##TITLE=Analysis number 320946
Compound Code ac 34403
Project Code adrs
Chemist Name acros
##JCAMPDX= 6.0         $$ Bruker NMR JCAMP-DX V2.0
##DATA TYPE= NMR SPECTRUM
##DATA CLASS= NTUPLES
##ORIGIN= Bruker BioSpin GmbH
##OWNER= nmr
$$ XWIN-NMR		Version 3.5
$$ Tue Jul 18 15:15:52 2006 GMT Daylight Time (UT+1h)  MAYBRIDGE\nmr@NMR_250MHZ
##.OBSERVE FREQUENCY= 250.131544655141
##.OBSERVE NUCLEUS= ^1H
##.ACQUISITION MODE= SIMULTANEOUS (DQD)
##.ACQUISITION SCHEME= undefined
##.AVERAGES= 16
##.DIGITISER RES= 18
##SPECTROMETER/DATA SYSTEM= dpx250
##.PULSE SEQUENCE= zg30
##.SOLVENT NAME= CDCl3
##.SHIFT REFERENCE= (INTERNAL, CDCl3, 0, 16.522)
##AUDIT TRAIL= $$ (NUMBER, WHEN, WHO, WHERE, WHAT)
$$ ##TITLE= Audit trail, XWIN-NMR		Version 3.5
$$ ##JCAMPDX= 5.01
$$ ##ORIGIN= Bruker BioSpin GmbH
$$ ##OWNER= nmr
$$ C:\u/data/dgb/nmr/ADRS/3000/pdata/1/auditp.txt
$$ ##AUDIT TRAIL=  $$ (NUMBER, WHEN, WHO, WHERE, WHAT)
(   1,<2006-07-18 15:15:29.85 +100>,<MAYBRIDGE\nmr>,<NMR_250MHZ>,
      <created by zg, POWCHK disabled, PULCHK disabled
       configuration hash MD5:
       E2 DF 36 D8 04 B2 41 60 5A D7 A3 38 5A 4B D0 FE
       data hash MD5: 64K
       9E 14 07 3A F4 DC 84 BB 8C BA 5B 26 2F A8 0A 86>)
(   2,<2006-07-18 15:15:42.16 +100>,<MAYBRIDGE\nmr>,<NMR_250MHZ>,
      <Start of raw data processing
       ef LB = 0.3 FT_mod = 6 PKNL = 1 SI = 32K 
       data hash MD5: 32K
       43 AB 51 62 C7 C1 13 73 AA CB E7 61 F4 56 5F 33>)
(   3,<2006-07-18 15:15:43.74 +100>,<MAYBRIDGE\nmr>,<NMR_250MHZ>,
      <apk 
       data hash MD5: 32K
       C2 12 C2 51 AB D1 27 05 49 13 09 7E 8A CE 8F 9C>)
(   4,<2006-07-18 15:15:44.52 +100>,<MAYBRIDGE\nmr>,<NMR_250MHZ>,
      <abs ABSG = 5 
       data hash MD5: 32K
       02 57 49 F0 3C AB 82 A7 71 B0 A3 EA BC 0B 39 72>)
$$ ##END=
$$ 
$$ hash MD5
$$ D5 88 D5 0D F8 BE C0 B6 93 7B 83 74 97 B0 3B DD
##$RELAX= 
##$RELAX= 
##$RELAX= 
##$RELAX= 
##$RELAX= 
##$RELAX= 
##$RELAX= 
$$ Bruker specific parameters
$$ --------------------------
##$DU= <C:\u>
##$EXPNO= 3000
##$NAME= <ADRS>
##$PROCNO= 1
##$TYPE= <nmr>
##$USER= <dgb>
##$AMP= (0..31)
100 100 100 100 100 100 100 100 100 100 100 100 100 100 100 100 100 100 
100 100 100 100 100 100 100 100 100 100 100 100 100 100 
##$AQSEQ= 0
##$AQ_mod= 3
##$AUNM= <au_zg>
##$AUTOPOS= <47 >
##$BF1= 250.13
##$BF2= 250.13
##$BF3= 250.13
##$BF4= 250.13
##$BF5= 500.13
##$BF6= 500.13
##$BF7= 500.13
##$BF8= 500.13
##$BYTORDA= 1
##$CFDGTYP= 0
##$CFRGTYP= 5
##$CHEMSTR= <none>
##$CNST= (0..31)
1 1 145 1 1 1 1 1 1 1 1 1 1 1 1 1 1 1 1 1 1 1 1 1 1 1 1 1 1 1 1 1 
##$CPDPRG= <>
##$CPDPRG1= <>
##$CPDPRG2= <>
##$CPDPRG3= <>
##$CPDPRG4= <mlev>
##$CPDPRG5= <mlev>
##$CPDPRG6= <mlev>
##$CPDPRG7= <mlev>
##$CPDPRG8= <mlev>
##$CPDPRGB= <>
##$CPDPRGT= <>
##$D= (0..31)
0 1 0 0 0 0 0 0 0 0.06 0 0 0 0 0 0 0.0002 0 0 0 0 0 0 0 0 0 0 0 0 0 0 
0 
##$DATE= 1153232128
##$DBL= (0..7)
120 120 120 120 120 120 120 120 
##$DBP= (0..7)
150 150 150 150 150 150 150 150 
##$DBP07= 0
##$DBPNAM0= <>
##$DBPNAM1= <>
##$DBPNAM2= <>
$$ [...]
##$SUBNAM7= <"">
##$SUBNAM8= <"">
##$SUBNAM9= <"">
##$SW= 20.6930455092707
##$SWIBOX= (0..15)
0 0 3 0 0 0 0 0 0 0 0 0 0 0 0 0 
##$SW_h= 5175.983436853
##$TD= 65536
##$TD0= 1
##$TE= 296.16
##$TE2= 300
##$TE3= 300
##$TEG= 300
##$TL= (0..7)
0 120 120 120 120 120 120 120 
##$TP= (0..7)
150 150 150 150 150 150 150 150 
##$TP07= 0
##$TPNAME0= <>
##$TPNAME1= <>
##$TPNAME2= <>
##$TPNAME3= <>
##$TPNAME4= <>
##$TPNAME5= <>
##$TPNAME6= <>
##$TPNAME7= <>
##$TPOAL= (0..7)
0.5 0.5 0.5 0.5 0.5 0.5 0.5 0.5 
##$TPOFFS= (0..7)
0 0 0 0 0 0 0 0 
##$TUNHIN= 0
##$TUNHOUT= 0
##$TUNXOUT= 0
##$USERA1= <user>
##$USERA2= <user>
##$USERA3= <user>
##$USERA4= <user>
##$USERA5= <user>
##$V9= 5
##$VALIST= <valist>
##$VCLIST= <CCCCCCCCCCCCCCC>
##$VD= 0
##$VDLIST= <DDDDDDDDDDDDDDD>
##$VPLIST= <PPPPPPPPPPPPPPP>
##$VTLIST= <TTTTTTTTTTTTTTT>
##$WBST= 1024
##$WBSW= 4
##$XGAIN= (0..3)
0 0 0 0 
##$XL= 0
##$YL= 0
##$YMAX_a= 560236
##$YMIN_a= -626859
##$ZGOPTNS= <>
##$ZL1= 120
##$ZL2= 120
##$ZL3= 120
##$ZL4= 120
##$ABSF1= 16.522
##$ABSF2= -4.171173
##$ABSG= 5
##$ABSL= 3
##$ALPHA= 0
##$AQORDER= 0
##$ASSFAC= 0
##$ASSFACI= 0
##$ASSFACX= 0
##$ASSWID= 0
##$AUNMP= <proc_1d>
##$AZFE= 0.1
##$AZFW= 0.1
##$BCFW= 0
##$BC_mod= 0
##$BYTORDP= 0
##$COROFFS= 0
##$CY= 12.5
##$DATMOD= 1
##$DC= 0
##$DFILT= <>
##$DTYPP= 0
##$F1P= 14.0000005364418
##$F2P= -0.99999901652339
##$FCOR= 0.5
##$FTSIZE= 32768
##$FT_mod= 6
##$GAMMA= 0
##$GB= 0
##$INTBC= 1
##$INTSCL= 1
##$ISEN= 128
##$LB= 0.3
##$LEV0= 0
##$LPBIN= 0
##$MAXI= 10000
##$MC2= 0
##$MEAN= 0
##$ME_mod= 0
##$MI= 0
##$NCOEF= 0
##$NC_proc= -2
##$NLEV= 6
##$NOISF1= 0
##$NOISF2= 0
##$NSP= 0
##$NTH_PI= 0
##$NZP= 0
##$OFFSET= 16.522
##$PC= 1
##$PHC0= 163.4567
##$PHC1= 5.686779
##$PH_mod= 1
##$PKNL= yes
##$PPARMOD= 0
##$PSCAL= 4
##$PSIGN= 0
##$REVERSE= no
##$SF= 250.13
##$SI= 32768
##$SIGF1= 0
##$SIGF2= 0
##$SINO= 400
##$SIOLD= 32768
##$SREGLST= <1H.CDCl3>
##$SSB= 0
##$STSI= 32768
##$STSR= 0
##$SW_p= 5175.98343685301
##$SYMM= 0
##$S_DEV= 0
##$TDeff= 65536
##$TDoff= 0
##$TI= <Analysis number 999999
Compound Code 99
Book Reference 9
Project Code 9>
##$TILT= no
##$TM1= 0
##$TM2= 0
##$TOPLEV= 0
##$USERP1= <user>
##$USERP2= <user>
##$USERP3= <user>
##$USERP4= <user>
##$USERP5= <user>
##$WDW= 1
##$XDIM= 32768
##$YMAX_p= 279888068
##$YMIN_p= -28388
$$ End of Bruker specific parameters
$$ ---------------------------------
##NTUPLES= NMR SPECTRUM
##VAR_NAME=  FREQUENCY,     SPECTRUM/REAL,   SPECTRUM/IMAG
##SYMBOL=    X,             R,               I
##VAR_TYPE=  INDEPENDENT,   DEPENDENT,       DEPENDENT
##VAR_FORM=  AFFN,          ASDF,            ASDF
##VAR_DIM=   32768,         32768,           32768
##UNITS=     HZ,            ARBITRARY UNITS, ARBITRARY UNITS
##FACTOR=    0.157963299565203, 1,           1
##FIRST=     4132.6476996994, 0,             0
##LAST=      -1043.33573715361, 0,           0
##MIN=       -1043.33573715361, -28388,      0
##MAX=       4132.6476996994, 279888068,     0
$$ Real data points
##PAGE= N=1
##DATA TABLE= (X++(R..R)), XYDATA
$$ [...]
17212E125l403l65p797m555L064J0805P42J664M96o239l698K208P892k066k288
17197A585Q75m526l24J488m303N010N689r78m906J149j100j495P03M442M778l339
17181D748r970k26L792J69L07j946M063L807Q588n091j1218o642j231N579N1j445
17165f665k484M056M232q286J478q62Q87N381K92J0208L703o317r482n49K061
17150b347l132P945l90m219K839k535k601r25P617j85m679n649O91l334O92J907
17134h305K403N097J771r23O30k968k106N477O607K091n056L248J390o359n913
17119b916k941K717L050P75k094q345K839J3235R791p002j70k131L283m370k38
17104E483J362m911k308j295Q55L033l98K181O437K76M305L465q104l785l249
$$ y = [5125, 1722, 1357, -6440, -10995, -7931, 2874, 3616, 5280, 5776, -463, -4161, -1953, 5939, 3873, 1585, 2460, -2066, -2390, -902, -5205, -195, 5494, 4516, -390, 759, -341, -1836, -1133, 3309, 8087, 4748, -5222, -5448, -1656, -1487, -1180, -3126, 937, 4744, 13332, 8241, -2977, -9619, -10850, -5271, -5220, -6665, -9149, -5093, -861, -9147, -7669, -8531, -7644, -2263, -1971, 8237, 11940, 5623, -3859, -4408, -2347, -5479, 2466, 2076, -2143, 696, -1839, -4440, -5365, 2252, 2067, -2612, -8261, -7570, -10904, -10212, -8305, -5902, -805, 966, 43, 673, -2295, -4401, 1076, 7683, 9774, 4718, 7966, 9356, 2997, -2916, -5857, -3140, -90, 685, -1409, -9754, -6915, 6320, 16111, 9109, 8939, 6808, 10091, 5721, 5483, 6845, 1934, -374, -1669, -814, 2219, 1821, 4002, 10439, 10715, 15020, 18485, 10381, 6596, 3347]
17089C347K369r0o25n490l937m292M376J0403J518k979n939j788K931k123r083
17074a1402N759P962O473p82q25j710q45P45j475n24M130j2232n240N32L500P784
17058A850m092l736Q28L979P464J31l001j394j07O856M465K370n018m289L219
17043I525m23l278j543m210o651K8Q191O661R88p076r776o29k785l913j593o665
17027b3149o92J3127J2654K42k847L208NL031K329n717r655j827M733L000l257
17012d815J80P040M592m968m316L717R471J0963l029k663j0321k607K304l83k454
16997B711q392N87L473L389O059l440n000m936N086K031L908M767J426k397m02
16982H870K915n524p866k257m150K405P627j011M920J386J53j239q575n584J819
$$ y = [3347, 5716, 5626, 5001, -489, -4426, -8718, -4342, 6061, 7579, 4600, -1339, -3127, -196, -2319, -11402, -5643, 2319, 8792, 8010, 7185, 5475, 4630, 5375, 3900, 3376, 7506, -4726, -9966, -9434, -5934, 1850, -2242, -5978, -5150, -1171, 6293, 6424, 3423, 2029, 1922, 8778, 13243, 15613, 10595, 6306, 9525, 9102, 5824, 4281, 71, -6580, -6552, 1639, 8300, 9288, 2212, -7564, -8193, -10978, -14891, -16484, -23149, -23841, -10714, 1940, 2182, -665, 2543, 2548, 5579, 7908, 2191, -7464, -9291, -4558, -1558, -4815, -4635, 2405, 6997, 2029, -2287, 1430, 10901, 21864, 18835, 16172, 5851, 3244, 5548, 5165, 2711, -5681, -5094, -1621, 1768, 7827, 4387, -613, -5549, -463, 1568, 5476, 10243, 11669, 9272, 8870, 11785, 6261, -1605, -3862, -8012, -5607, 2020, 1009, 5929, 7315, 7468, 6229, -2346, -7930, -6111]
16967f111O538J551j358K064k840m827n11M639M713m131K082M372m56j511j983
16952B231p450j439J034k21j884k811j807J451n82R27L683N305l416j026L629
16937b376J499M207q70q44K798L694m551l583K191m355j867K391K204L222j815
16922A945J442L666J171j318m53j280k570p14m828k268M914K801o639n978L48
16907i761r80L990K788L922O133L37k779l254J123L065k643j688j782oj322k65
16891c122o04J377L355p08l068M548R05K22Q26k505O615N263k784m433q640l25
16875c078O557K079j4457n181N73p4l347N808N060o47k799N770N325q021j046
16860g478R306m70j081n896N758Q525q338n52M942K335l504n157k652j127Q23
$$ y = [-6111, 427, 1978, 620, 2684, -156, -4983, -5494, -855, 3858, -273, 1809, 6181, 5725, 4214, 2231, -5219, -6658, -5624, -5845, -7729, -10540, -12347, -10896, -11478, -10551, -6868, -1563, -4979, -6005, -2376, -877, 3330, 2460, 1616, 4414, 8108, 3557, -26, 2165, -2190, -4057, -1666, 538, 3760, 1945, 3387, 7053, 8224, 6906, 6453, 5173, 2603, 1889, -2939, -5207, -293, 2508, -4131, -10109, -9761, -10741, -6751, -3963, -41, 6092, 6429, 3650, 396, 1519, 4584, 1941, 253, -1529, -1535, -2857, -3122, -3726, -2349, 1006, 298, -2770, 1778, 2683, 2905, 3731, 1226, 7841, 13104, 10320, 5887, -2753, -3078, 3479, 5558, -8899, -14080, -13507, -13581, -16928, -11120, -6060, -6707, -9506, -3736, 1589, -6432, -7478, 1828, 1358, 277, -5619, 139, 8664, 326, -226, 4716, 7051, 3547, -1610, -4262, -5389, -4566]
16845d566l295L245J872k338p426K416K027J880O248j069k483m780j319J716p256
16830a5128J640O255O9P085M806N874l338q567l760N375n47k302N859R45M27k017
16814B676m764m793L452Q34K519p65K174k056l002o716L169P358M924J40j570
16799C580k249q828n055K277L021J934L375Pk425j924p90M704L662k287J276L11
16783E89m988l621Q266K833n74N45j245k000o199j2598k443L616N545l656J612
16768a4318J897O109Q203K848j379n897J61p37r95M474n917p90J0234P591M461
16753A5945q432L218k852j602k431p057O82P3K197Q299l308q980j411K311N967
16738B619j509r24R96l037o453o53M586O059M91K521j013q24l115k707j255K04
$$ y = [-4566, -7861, -4616, -2744, -5082, -12508, -10092, -8065, -6185, 63, -1006, -3489, -8269, -9588, -7872, -15128, -13488, -7233, -7164, -79, 4727, 10601, 7263, -1304, -5064, 311, -236, -2538, 3321, 4266, 4693, 2676, -2088, -6881, -3429, -2595, -76, -841, 1333, -723, -3725, -10441, -7272, 86, 5010, 5150, 3580, 1331, -7497, -12552, -10275, -7254, -5320, -1945, -1938, -4363, -6287, -7077, -2373, 1289, -998, 278, 589, -4399, -8020, 246, 3079, 2505, 3050, 1805, -195, -6394, -18992, -21435, -17819, -12274, -15930, -14318, -12421, -6312, 1891, 4739, 3360, -2537, -2376, -3113, -4108, 366, -5551, -6341, 3893, 11484, 15945, 7513, 10731, 7879, 6277, 3846, -3211, -2529, -2456, -259, 8040, 4732, -4248, -5659, -3348, 2619, 1110, 186, 1182, -1855, -8308, -8961, -4375, 1684, 2175, 4696, 3683, 2859, -256, -2963, -4218, -4014]
16722d014O220k083n261o005m720J195N541j309L710M62q399M004R77K239L566
16707c877L295J161r1o28L680j538P65O588l311r134J706o24n722l199Q997Q574
16691F642L348j745p036l444J161m296j737Q359L079q24r583mM135J468o813K212
16675e078O028O128J531n004N39q901j341J794q14r94N809O009N858q32l177m26
16659G129k394p11j277n696r16K521k111k445O161K688L495K119l311J089K028
16644H369l837o287r394p469m453L685K715j75L305J53J214M143j275N987O00
16629b719m03j061R63J947J005n053m941L920R526k755q664J424M244j412L779
16614b00P793r02j47K549j97q214r8l50K396P342K621p752m768k62N560J174l430
$$ y = [-4014, 2206, 123, -5138, -11143, -15863, -14668, -9127, -10436, -6726, -6264, -14663, -10659, -9682, -7443, -3877, -582, 579, 488, -140, 3540, 2002, 2767, 9355, 6044, -3090, -1384, -2008, -7730, -10929, -1932, 6642, 9990, 8245, 1209, -2235, -1074, -5370, -7107, 1252, 4331, 3507, -6076, -6080, -1945, -477, -7290, -5078, 950, 7078, 8609, 3605, 4144, -4757, -6098, -4304, -5118, -6112, -303, 5706, 11564, 10732, 7555, 7129, 4735, 4024, 2747, -2949, -3865, -1344, -3455, -5900, 261, 2949, 6444, 8563, 5252, 6341, 8369, 4532, -1755, -11149, -18618, -23071, -19386, -16671, -16846, -13541, -13388, -12174, -8031, -9306, -3319, -2719, -3122, -4183, -3220, -1273, -268, -5321, -10262, -6342, 3184, 429, -8235, -6811, -2567, -3979, -200, 7593, 6691, 6544, 9093, 8896, 682, 584, 234, 2630, 9972, 12593, 4841, 73, -189, 5371, 6545, 3115]
16597C115j469l68N079J310m800q4k799k832n66J89p069j089k589k822M587N398
16581f809O873l379m663K004q3J859o89K911l736Q51R382j928l115j006n066j375
16565g969P659O91l184j421l104l697O556N51j867P06k501N381P028O658l71o414
16549D702J10M120N922L41P466N245k207j661J43k470O17N160L303M355m80o97
16533C3969n778m020n906k445o951k532r50l416O442K736l902J075L138m684O979
16518A3755L469o565j2871k127L633N017N509O581l121q740M968K792l460m383
16504D457l316L830j223n322j683K150M612N456M821J189n035M703N490K858O58
16489B3645q13k198k001m64J992j385l162j006N337Q92l331J559J346J516q9N198
$$ y = [3115, 1646, 1278, 6357, 7667, 2867, 2783, -16, -2848, -3414, -3225, -10294, -11383, -13972, -16794, -12207, -6809, 64, -3315, -7978, -5974, -6057, -4198, -4887, -1976, -5712, -4861, 4521, 2593, -522, -1528, -6594, -7969, -310, 381, -2803, -4224, -7328, -11025, -4469, -3918, -5785, -5079, -7580, -2199, 4829, 11487, 11116, 4702, 4812, 8932, 14854, 15195, 22661, 27906, 25699, 24038, 24181, 21711, 22328, 27488, 30791, 35146, 34666, 33969, 28191, 24171, 18265, 15820, 8869, 6337, 5387, 1971, 8413, 11149, 7247, 8322, 11460, 6776, 13755, 17224, 10659, -2212, -4339, -706, 4311, 9820, 16401, 13280, 4540, 9508, 12300, 8840, 4457, 1141, 4971, 3748, -1574, -3257, -1107, 3505, 8961, 13782, 14971, 9936, 14639, 20129, 22987, 23645, 22832, 20634, 18633, 18169, 20161, 18776, 15614, 14608, 19945, 20837, 17506, 19065, 20411, 21927, 21838, 27036]
16473B7036j488K087J162p464j2594k652O698R595Q1l832q262m070j683n847j710
16458b943J696l781q70M51k789l180L279K870J504L711M485N13k092p49K959r79
16442D085M228K403K244k917k596m680m798J209P93L804K494q121n197K730P633
16427C314J0087N76q049k168J259m729M80N668M001K603L045n537l170l470l275
16412F35O059L747J629n069p252q66K186M28k595l78J323k515Q09j388m92Q399
16396D660O187m581q470l678N567Q592Q199m872o164q611o854m237M175M436J51
16381e500m36M718N559m683j616J572M154K603o372o244L056P846N936L075p044
16366F624j0806N58j29L301oq52L312j866K289K424p35l868j148K315L608j615
$$ y = [27036, 25548, 27635, 28797, 21333, 8739, 6087, 12785, 22380, 22461, 18629, 10367, 6297, 4614, -1233, -2943, -1247, -5028, -5898, -5447, -8236, -11416, -8137, -5267, -3763, -52, 4433, 4946, 2854, 2105, 5064, 4085, 8313, 10716, 12960, 10043, 7447, 2767, -2031, -822, -29, 3775, 6269, -1852, -7049, -4319, 3314, 13401, 13977, 5928, 3760, 5019, 290, 770, 6438, 10439, 13042, 16087, 10550, 7380, 3910, 635, 6694, 10441, 12070, 7001, -251, -1117, 1069, 1497, -1098, -1476, -153, -2668, -1859, -3247, -3739, 4660, 10847, 6266, -2204, -5882, -315, 8277, 16476, 11604, 5440, -3171, -10025, -14262, -10087, -5651, -5500, -5936, -1218, 4341, -342, -1958, -386, 3768, 6371, -1, -6245, -3189, 4657, 10593, 13668, 6624, -4182, -3624, -3753, -452, -458, -1310, 2002, 136, 2425, 4849, 4114, 246, -902, 1413, 5021, 3406]
16350C406m482l386M921K550m820o749k648O57L960M4J137J058J447q68k917L027
16334c663N627L587l981K026J11j132K206l010o586K220l07m679l582J093N018
16319e052R38j107j331J0988k22k564J144j507j854j434M71L573q76R1j255J62
16303A65l196N577n485K502J012n982O75M185P933l173l674o19M89j504k278k778
16287f151j127P56M873j70m49J266K724L252P81k124k296j959n505o59k494R82
16271h300M232L250l565m145J268J325o64K570R99O71N057k04k636o590j270Q543
16255E41N384m650n761j242k689l194M385J232J0310Q0j43O931l756l388n707
16240a667M29Q586m41o900n689p660L090O586J64K356j779j085o94k316N46K131
$$ y = [3406, -1076, -4462, 459, 3009, -1811, -8560, -11208, -10551, -6591, -6547, -5410, -4352, -2905, -3773, -6690, -3663, 1964, 5551, 1570, 3596, 3707, 2575, 4781, 1771, -4815, -2595, -2902, -7581, -11163, -10070, -5052, -4114, -5221, -6552, 4436, 4214, 1650, 2794, 1287, -567, -2001, -1530, 2043, 1167, 1258, 3, 165, -3031, 2546, -2939, -437, 575, -5407, -4732, -547, 7386, 4213, 539, -80, 409, -1095, -3373, -6151, -7278, -6522, -1649, -1819, -2268, -1002, 1722, 4974, 5755, 3631, 1335, -624, -6129, -6788, -9282, -8300, -4068, -818, -4383, -8528, -7260, -5935, -6599, -4029, -3030, -2359, 2698, 2494, -142, -6732, -8002, 541, 5925, 1275, -4486, -5728, -8417, -11611, -7226, -5994, 4316, 4396, 4253, 11184, 7428, 4040, -1667, -1238, 7348, 6907, 7, -5682, -13342, -10252, -3666, -3502, -1146, -2925, -4010, -4704, -7020, -6474, -4343]
16224d343o91l19L722M755J4972o756j5225K68N813J068o083k528j341M932j104
16209b860Q449M653J59q873k990O905O059O40j476l835q857k945j097P002J04
16194A038k779o06j384J105m611K657L945r012L502M30J098j76j0211K770J469
16179a0765l374L152O890p84k835L051J800k086j712k957K6O542L396J522J719
16164C585Q20m418n571j003k762o77R059L801J762k913l673L153L981r254L105
16149a005M254j140L41l704j789J484R015K127m716j871L033J674p01o772l657
16134c427j87J298P46m289n549j434O103J0492J660R98k740K346k23N103o1o689
16118D147M269P547k4p712l000M079l437o534k927o520M2J1169K957k590R7j0622
$$ y = [-4343, -5034, -5353, -1631, 3124, 18096, 11340, -3885, -3617, 2196, 3264, -2819, -5347, -6688, -1756, -2860, 5589, 10242, 10401, 1528, -1462, 5443, 11502, 12142, 10666, 6831, -2026, -4971, -6068, 934, 1038, -1741, -2347, -3731, -2626, -7237, -4580, -635, -9647, -6145, -5715, -4617, -4793, -15004, -12234, -10765, -14139, -10987, -4097, -4881, -7716, -4665, -2865, -4951, -6663, -9620, -9594, -3052, 344, 1866, 3585, 4405, -13, -5584, -6587, -9349, -10026, -967, 2834, 4596, 1683, -1990, 1163, 5144, -4110, -1005, 3249, 2109, 2450, -1254, -3043, -1559, 7456, 9583, 4867, 2996, 6029, 7703, 7002, 230, -3427, -3614, -2316, -1570, -5859, -11408, -12842, -6739, 3753, 5413, 6411, 3671, 6017, 5794, 10897, 10836, 4147, 8416, 15963, 15939, 8227, 5227, 9306, 5869, -665, -3592, -10112, -10070, 1099, 4056, 1466, 1563, -9059]
16102i059r352K537J2623n53o986J361L018M799J152J655n23k907n451J203N052
16087a431j15J596j398o947l127P569M551l066R057J671j321L842K056k233j0060
16072F44j3164K725R805Q59K80K488Q7j666m382K567k774r92K909m68k814k503
16056f399j564M862K900n835k853j23k446M529j620l062l616k788J207J4043J0413
16041G648q64l312k970M944M113l20l157q423k803N916J836L795m272m7k54n67
16025A263q29k012M221k129o219o176J228K422P21L77K221M973J329N63L145k249
16009B849n403l477l602M800R338J142n639k123n203J306N600m126n725l601K352
15994a1512R771L503K970J535n496l870q585J076O336J108J498j002o266l756
$$ y = [-9059, -18411, -15874, -3251, -3804, -10790, -9429, -6411, -1612, -460, 1195, 672, -2235, -7686, -6483, -1431, -1546, 50, -1348, -8295, -11422, -3853, 698, -2368, 6689, 8360, 7039, 10881, 12937, 10704, 644, -12520, -9795, 10, 869, 1149, 3637, 3724, 2058, -2324, 243, -2531, -3523, -614, -1082, -3896, -6399, -7963, -3101, -201, -6036, -8889, -9012, -11458, -6929, -8549, -11611, -15227, -18015, -16808, -2765, 7648, 6784, 3472, 502, 5446, 9559, 9239, 6082, -2341, -5144, 772, 2608, 6403, 2131, 2084, 1830, 1263, 434, -1578, 2643, 514, -5705, -11881, -10653, -8231, -7510, -7133, -4912, 61, 1390, 1953, 5098, 2849, -2554, -6031, -9633, -4833, 4505, 5647, 8, -2115, -7318, -6012, -412, -4538, -10263, -13864, -11512, -1741, 1762, 4732, 6267, 771, -3099, -11684, -10608, -4272, -3164, -1666, -2668, -8934, -12690]
15980a2690Q031M556J263o52m398P44J735k409n90O151J296m29K167n391p067
15965g683K423L00l969o67j01j0576q115M554P612P849Q51R439O68l320o675j802
15949i212O639M839r509M76j46M562j629M925N600k268K820j543n22k639l588
15934a195j572kl204j774l409k727K609j684M738j566J035J918L970P769L177
15919H083j0401K238J32n468K473N686O231n086o736k10r43k384k31L973K608
15904c5k710q160N909L786N399R83n404l42L190k937l266k289J172o37Q891M258
15888G808n408j0317m205M293N348o96J627p012L585N870l281J517j036N86k666
15873c987N151k145j541k340p553m056J761Q855N391j351J264l218m195j408K442
$$ y = [-12690, -4659, -103, 1160, 508, -3890, -3146, -1411, -3820, -4410, 1741, 3037, 2608, 4775, -616, -7683, -5260, -4960, -8929, -9596, -9697, -20273, -28388, -23834, -16222, -8373, -7522, 1917, 2585, -735, -7410, -9212, -2573, 2266, -7243, -6767, -6913, -2351, -3980, 945, 6545, 4277, 7097, 5554, 5032, 2393, -1195, -2767, -2769, -5973, -7747, -11156, -13883, -11274, -12958, -8220, -9786, -8751, -6833, -2863, 4906, 8083, -2318, -80, 52, -5416, -2943, 2743, 8974, 3888, -2848, -3058, -4001, -6385, -6616, -2643, -35, -2745, -10905, -4996, -1210, 4189, 5172, -232, -574, 2616, -321, -3587, -5876, -4704, -5341, 3550, 7808, 2400, -7917, -12122, -7829, -2481, -3177, -1550, -8562, -4977, 893, -2388, -871, -1907, -1321, -3987, 1164, -981, -2522, -4862, -12415, -16471, -14710, -5855, -464, -1815, -551, -3769, -7964, -9372, -6930]
15858f930j458K572N382L681m021n213m298J71O558L101j277L09j073J224L111
15843A839Q693P94j790l522k974k53j710o26R78J483J18J814n424K065Q701K847
15827A3033l877j0672q541K273L71l126l414N691O42k537M050J649l137J98K76
15812g121M77J931m57K430J457l96m32J543k158J633L949P483J018L231P54o685
15796H657n332J919P45l736J297m553m204m977j728j804L441Q448Q48j364m155
15781f498l247J066K375J027N295K245j987q727n681Q786O762M863p214k00l861
15766d996j641l435M601J3271K403o362j0804n111O80N09k61O647M356J448K297
15751C602k066J016J80l351J527M960j431k803l408l999M201n62J532n086o118
$$ y = [-6930, -8388, -5816, -434, 3247, -774, -5987, -10285, -10114, -3556, -455, -1732, -1423, -2496, -1272, 1839, 10532, 11326, 9536, 6014, 3040, 2787, 1077, 451, 1429, 2912, 3030, 4844, -580, 1485, 10186, 13033, 9156, -1516, -10057, -7784, -7413, -10539, -13953, -8262, -7620, -10157, -6107, -4458, -7595, -7397, -7121, -6644, -4713, -5170, -2740, -1283, -1679, -2111, -568, -2726, -1093, 2856, 10339, 11357, 14588, 15342, 8657, 3325, 5244, 5989, 2253, 3550, -1003, -5207, -10184, -11912, -13716, -10275, -1827, -979, -2343, -6498, -9745, -8679, -6304, -5277, 18, 2263, 276, -8451, -14132, -5346, 1416, 6279, -935, -1135, -4996, -6637, -10072, -5471, 7800, 10203, 3841, -6963, -12074, -11394, -10885, -11146, -4499, -143, 1305, 3602, 1536, 2552, 2732, -619, 908, 5868, 4437, 1634, -1774, -5773, -1572, -2134, -602, -5688, -11806]
15736a1806k654K413o47n16N310M298j468r92m52l991m588M504M29j643N906M156
15720a741L302j690j414L108J455p630j141J499Q59j548p68K502j004M241L360
15705C390j1415Q39K17k75m970K10j584L426L208k574L026O899k157l040j429
15690f229K259O955n332q202M127M589R327k538p040Q59m710J85m11l655k095
15675a1911J429O191k349l681L289L75L460K106L240n5L438L107j257J821k063
15660G140m484n562K408L634j787m474K598P638j576M186M323n225r123R96j0457
15645i765l260P460N284j976n66N403J006l412L338m063j40l522Q61J339k516
15630d529j756J02L676n352l663k259M565J1754M310k174J869o596l659J648l955
$$ y = [-11806, -14460, -12047, -12694, -13210, -7900, -3602, -5070, -6062, -6514, -10505, -15093, -10589, -10160, -11803, -5897, -1741, 1561, -129, -1543, 1565, 3020, -4610, -5751, -4252, -3393, -4941, -5709, -3207, -4211, 30, 3390, -8025, -7186, -6969, -7244, -12214, -12004, -13588, -10162, -6954, -9528, -6502, 397, -1760, -4800, -6229, -3970, 2985, -2347, -10549, -6422, -1833, 7494, 4956, -2084, -1225, -5935, -5750, -6161, -9816, -11911, -10482, -4291, -6640, -10321, -7032, -6657, -3197, -1091, 2149, 2094, 5532, 8639, 7382, 9203, 7140, 2656, -2906, -498, 3136, 1349, -3125, -527, 7111, 5535, 9721, 14044, 8819, -304, 692, -9765, -13025, -5565, -281, -2257, -2823, 2580, 3586, 174, 3512, -551, -691, -4213, -3352, -2013, -4529, -6285, -6183, -2507, -7859, -11522, -13781, -9216, 2538, 6848, 4674, 6543, -53, -3712, -2064, -6019]
15615f019k571j256K063L513L873K195p451j204M49K012J132K233l996l82L571
15600a838m890j948M053P062Q777k252r084J843K659J525k652p778J869K875l420
15585c199l77J706J728R72k737o92J455k085p222k799j013O72Q256J782j915j981
15569g449k57K839p66J894K54j110k116m915k056N183L226J833J296J230k148
15554c062O006L033k831K108K8o049j542l78n993p9J04M7N539m75k894L877k552
15537e113l790K418N44K501M022k386K547l67J814m140l421K006m0k688K697J618
15521a778J163K113L188k236K32m311l566J203m587j723P049J327l424M04J676
15506c270k206L435N034l71L63J281J830P323m879K15l8p657l588k183k631m77
$$ y = [-6019, -8590, -9846, -7783, -4270, -397, 1798, -5653, -6857, -6408, -4396, -3264, -1031, -5027, -5409, -1838, -6728, -8676, -4623, 2439, 11216, 8964, -120, 1723, 4382, 5907, 3255, -4523, -2654, 221, -3199, -3576, -1870, -142, 830, -1907, -2599, -1144, -3229, -10451, -13250, -14263, -13591, -5335, -3553, -5468, -7449, -7706, -4867, -5633, -3739, -3485, -4595, -6711, -11626, -13682, -8499, -5273, -3440, -2144, -914, -3062, 2944, 5977, 3146, 5254, 5282, -767, -2309, -2687, -8680, -8759, -8655, -8608, -3069, -3544, -6438, -2561, -5113, -8903, -6485, -5941, -3440, 582, -1804, 743, 376, 2190, -1950, -5371, -3365, -3405, -6093, -3396, -1778, -615, 1498, 4686, 2450, 2682, -1629, -5195, -3992, -8579, -10302, -3253, -1926, -5350, -4946, -3270, -5476, -2041, 2993, 2622, 2985, 4266, 6096, 13419, 8540, 8755, 8717, 1060, -2528, -4711, -7342, -7819]
15490g819L114l914L880k216n81m83K561M346l621J424N556J22l078n157k295
15475h161K043P847N78J313K419j785l078m521n259N154O407M668J05p798o885
15460f953K219Q093O799p367k429j457O757L022q043j656O098L73o879m520K762
15445c181L051k436m512j416O171L458k743n15K058L866L083j192l200o968j276
15430e752O534k910l95O881M046j295l661j8K721j874l81P388o737p465l157P67
15414e308L13R250j276N21K804k807n029l236o98R7k5j120m716Q156q99O923J0482
15397A3432K65J935o945j0272m262m49j335P29N28m961J872Q246j547O892j863
15382B265l261n930j641k656o888K141K806J360J1174M738n141R20N687l214l733
$$ y = [-7819, -4705, -8619, -4739, -6955, -7536, -8019, -5458, -1112, -4733, -3309, 2247, 2369, -709, -5866, -8161, -6118, 1729, 2307, 3620, 6039, 4254, 1176, -3345, -8604, -3450, 2957, 7625, 7730, -68, -6953, -4734, 3359, 10158, 2791, 362, -1095, 5662, 8684, 641, -1015, 5083, 5456, -1423, -5943, -3181, -130, -2566, -7078, -8494, -2323, 1135, -1608, -2123, -65, 3801, 6884, 5692, 2492, -4476, -5752, 782, -2128, -2523, 4358, 8404, 7109, 3448, 3430, 6151, 4277, 3896, 11284, 4547, -2918, -6075, -5308, -4995, 4255, 2979, 3500, 6304, 3497, -1532, -4768, -5466, -5369, -5394, -6514, -11230, -3074, -3973, 2950, 13432, 13697, 15632, 8687, -1585, -5847, -6296, -7631, -6902, -6374, -11335, -9463, -1217, -2764, 4128, 2265, -996, -6926, -8567, -11223, -18111, -15970, -13164, -11804, -630, 4108, -1033, -113, 5574, 2360, -1373]
15367a373o42J46m5Q12p33K398j04l603p866M267N322K486q482k29Q60Q020M575
15350E809k453j42k140l055M091M927r2K930q902k964l743m484M220m498m559
15335a5055J933N184J282M678L945J658o539k693L545L371n132l104J627O354
15321A054K490k889j405N014k020l260L783N881k185R01n823o789M999j104P795
15306F442M173J366j19k453j2019k433L169j647N46M240K736K771M638l424l878
15291D108n752P34k894m440L426M263J093o740m627o342r28L351J010J713J320
15276a0705O792N963L507n399k367j736J480n512k970O000N550j970K52K055K667
15261C607Q148n723p071J126q712m383L693P108k706O24j241o886m93K42K441
$$ y = [-1373, -2015, -1869, -1914, -1102, -1835, 563, 459, -3144, -11010, -6743, -1421, 1065, -7417, -7646, -6786, 1234, 5809, 3356, 3214, 1074, -1981, 2110, 7037, 6945, 9875, 973, -1991, -5734, -10218, -5998, -10496, -15055, -13122, -7938, -6656, -1978, 1967, 3625, -2914, -5607, -2062, 1309, -3823, -6927, -5300, 1054, 3544, 655, -750, 4264, 2244, -1016, 2767, 8648, 6463, 7364, 1541, -5248, -249, -1353, 6442, 10615, 11981, 11862, 9409, -2610, -5043, -1874, -3521, -2975, 1265, 4001, 6772, 11410, 7986, 4108, -1644, -910, -3804, -8244, -4818, -555, 538, -6202, -10829, -17171, -18099, -14748, -13738, -12025, -10705, -3913, 2050, 5557, 158, -2209, -3945, -2465, -7977, -10947, -4947, 603, -1367, -1115, 940, 3607, 11755, 6032, -1039, 87, -8625, -13008, -9315, -2207, -4913, -4289, -5530, -12416, -12909, -12667, -10226]
15246a0226L390j27q13k71j349p375N066R874k767M041K040K103J155l282p452
15231e993j340K624K148o78q001L821K765r1j746j233L203j523o349j75O592M734
15215a242n120M65O593J304K783J578n11M392j470L136o280J061N605l807N50
15200I037K052k862l831l478j293l853n419n876J0612J245m891k473p49L59K691
15185h729M460K794m409j451l54O360Q758n445q180k114l694J056P004J506m53
15170b891k247L360K439k764n63K172R43j087j83J955J628p08K099K090J07J618
15154G968k177k127k907m499m578L232K311N933J854j467P136L875o489o954j370
15139b59J680m694N521p05L840q26l574m757m452N483M0m997o266R08J911K605
$$ y = [-10226, -6836, -6963, -7776, -8047, -9396, -16771, -11705, -1831, -4598, -557, 1483, 3586, 4741, 1459, -5993, -7333, -4709, -2561, -3239, -11240, -7419, -4654, -4745, -6491, -7724, -4521, -6044, -12393, -12568, -5976, -1242, -6362, -5897, 696, 2000, 4783, 6361, 5850, 10242, 8772, 11908, 5628, 6689, 12294, 8487, 9037, 11089, 8227, 4396, 918, -375, -4228, -9647, -15523, -4911, -3666, -8557, -11030, -11779, -11420, -8729, -4269, -1475, -5884, -7335, -7689, -1329, 7429, 1984, -6196, -8310, -12004, -10948, -3944, -2438, -2891, -5138, -1778, 661, -2103, -2666, -494, 449, -638, -821, 1134, 2762, 2054, 4153, 6243, 6350, 7968, 5791, 3664, 757, -3742, -8320, -5088, -2777, 3156, 5010, 3543, 10679, 14554, 8065, 1111, -259, 1421, -3273, 2248, 1543, 5383, 4557, 983, -3774, -8226, -2743, -2703, -7700, -13966, -13058, -11147, -8542]
15123h542L54M018M639R11p296l040P85k865K163J2860P175K279K199j0316p262
15108a938k412j047k277k531J568l23k061L855K108M605K946O708n489n36O896
15093A0072j756p507l598J431r86M035O603j006q958o43j088K779k22M900q61
15078C195Q995j551o832j0009q167k941L98n695P436J0701O467K458n068k723
15064c336j983o469n93J296L397K418J209k47k850J871L261L547N426k513o461
15049b027P18M81L825K99l711o648l171j529o266L294P871O364p122j934Q520
15034a036M720q05o585o940K968M785N986k571M521N60p23J882k707n335j490
15019b770K651M175m596l930q11m95l596Q446N180K289p416l903K681l245L066
$$ y = [-8542, -8188, -4170, 469, 1380, -5916, -8956, -8171, -11036, -8873, 3987, 11162, 13441, 15640, 5324, -1938, -4350, -5397, -7674, -10205, -8637, -8960, -11021, -7166, -5058, -453, 2493, 9201, 3712, 3176, 10072, 8316, 809, -2789, -1358, -2344, 1691, 8294, 7288, -1670, -2313, -3401, -622, -844, 4056, 3195, 12190, 10639, 3807, -6202, -14369, -17310, -16912, -22607, -15171, -4470, 1997, 4455, -613, -3336, -5319, -11788, -12381, -11085, -7688, -5270, -4061, -4308, -7158, -5287, -2026, 1521, 6947, 4434, -2027, -1309, -828, 2997, 3296, -415, -7063, -10234, -11763, -18029, -14735, -6864, -500, -7622, -9556, -1036, 3684, 2879, -3706, -10646, -7678, -2893, 3093, 522, 5043, 5603, 4880, 6762, 4055, -1280, -2770, -119, 4056, -540, -4470, -5281, -5776, -9372, -926, 4254, 6543, -873, -4776, -2095, -5340, -2274]
15004b274K03l713m337k548NM812K764M886N617O52j294N60K121O35q140p142
14988g193k344M784N533L576j379j159N39l746r713K325R531N436J231r34n061
14973A426J97k074N646j978j18J221o165J080j599m783k808j65P754J0476M909
14958A3019N945o78L576K808j0428n424L464L452r42j0012L551L956j197q41k631
14943G618j169l788k714L222N816k970J126n726k937k947k464M347Q57M885N17
14928C673k676L913o485k033P04k881R74j237K951l140k547O382J0048K758r31
14913I473K980m810q720n852J058L013J713J388l281k636l745M159r1k403k180
14898i934p012L696R505M495k58O806K391r42o972k335j947K697K672k020k556
$$ y = [-2274, -2071, -5784, -10121, -12669, -12664, -7852, -5088, -202, 5415, 6067, 4773, 5333, 7454, 8089, -51, -7193, -9537, -4753, 780, 4356, 2977, 1818, 2357, -1389, -11102, -8777, 754, 6190, 7421, 6487, 1426, 1623, -451, 5195, 3217, 3099, 4320, -1845, -765, -2364, -7147, -9955, -10120, -2366, 8110, 13019, 18964, 18286, 21862, 24670, 14242, 8818, 12282, 15734, 14792, 4780, 8331, 12287, 11090, 10249, 7618, 6449, 2661, -53, 3169, 8985, 6015, 7141, 1415, -1522, -4469, -6933, -2586, -1729, 3156, 3673, 997, 4910, -1575, -3608, -2904, -5785, -4811, -6048, -3097, -6237, -8784, -2402, 7646, 10404, 9473, 12453, 7643, -1077, -6929, -5871, -2858, -1145, 243, -3038, -5674, -9419, -5260, -5351, -7754, -9934, -16946, -13250, -3745, 750, 492, 7298, 9689, 8747, 1775, -560, -2507, 190, 2862, 842, -1714]
14883a714k809j821j781Q17n72J921r6L649M578J816k074J902P977k44on111r043
14866b611m612M463j99K596J785r55N02R434N793l20l678J289L402J607l508q509
14850F479j916m176J233L070o85k99j0285j718K197R725L156n088l368k224Q3
14835c816j006r02M114K769r681j0859O341N471M167j954m088l670K527J0218
14821c69J46r073q490m045Q590K858k486O383O059J837L826R03m098k761j310
14806b030J265O43P45j722l550M584K167K479k592r79l49q513q03L564J489l330
14790f932l467j172j523L65K419O39k410J042K761N058k591l957N345l165k014
14775i602P899J212n583m163j701k373O186L122k059O7N01M16J342j470j496P75
$$ y = [-1714, -4523, -6344, -8125, -7308, -7880, -5959, -6055, -2406, 2172, 3988, 1914, 3816, 11793, 11549, 11543, 6432, -2611, -7223, -2760, -2959, -363, 1422, 467, 969, 10403, 16196, 15876, 12198, 13487, 16889, 18496, 14988, 6479, 4563, 387, 1620, 4690, 4005, 3706, -6579, -8297, -6100, 3625, 6781, 1693, -1675, -3899, -3816, -4822, -5724, -1610, 1159, -8522, -19381, -13040, -7569, -3402, -5356, -9444, -13114, -10587, -369, -223, -9296, -17786, -21831, -13241, -10383, -12869, -6486, -427, 1410, 5236, 6139, 2041, -720, -2030, -765, -122, 623, -1099, -4649, -65, 2102, 4581, 1989, 1010, 661, -7852, -8655, -5091, -3602, -6932, -10399, -11571, -13094, -12729, -10310, -9671, -12081, -11039, -8278, -3220, -5811, -9768, -4423, -7588, -9602, -1703, -491, -6074, -10237, -11938, -14311, -8125, -5003, -7062, -6995, -6494, -6078, -4736, -6206, -7702, -6927]
14759f927k050M056k37m455q92R299L86q255K382m57j495L92M157j547l798j222
14743a0663k000N616M587m371q957R74M080L299M891l50N285j925j705M806m413
14728h46j431M062l949o920o181K187n63P51P946N047L75J015R88j797j902K427
14712A209j289L261k055o712k061M577Q426m253j3037Q29O752j355R15n81L94
14697d980M11o9M24K202K283K180q957N127N091l197o655n878N117J544j439L31
14681f465K461l249K511J0110k448o373J210J270J174o264l27k84K374P087k483
14666C04m022Q211M4o640q578L245N968M109k735p057j872k350N136j534K994
14651d777k490m217P718O886R6l24L135J397p96n424R4L102L361J506Q45j1315
$$ y = [-6927, -8977, -4921, -5158, -9613, -10505, -1206, -820, -9075, -6693, -7150, -8645, -8253, -4096, -5643, -9441, -10663, -12663, -7047, -2460, -6831, -15788, -14814, -10734, -7435, -2544, -2894, 2391, 466, -1239, 3567, -846, -2277, 1785, -2164, -9084, -15265, -13078, -13641, -12890, -4944, 103, 478, 1493, 2481, 684, -1218, 1209, -80, 3181, 1126, -5586, -7647, -3070, 5356, 1103, -11934, -11105, -4353, -5708, -4793, -5374, -4980, -4569, -4638, -4214, -2012, 271, 2451, -6506, -1379, 3712, 515, -6140, -12018, -6901, -5357, -6796, -6465, -4004, -7253, -4742, 5368, 2920, -3453, -2243, -973, 201, -6063, -6390, -6674, -4300, 2787, 304, -3718, 4493, 4537, -2103, -10681, -7436, -1468, 2641, -94, -7151, -9023, -11373, -6237, -7771, -4777, -7267, -11484, -3766, 3120, 3216, 2892, 6027, 7424, 6628, 1204, 1298, 4400, 7761, 9267, 10112, -1203]
14635a203l587k842j759N249n03o550o41M856L73n30K914J627M163L562R77m518
14619A588p309L49K72n18J568K956K089L678J814j515l623j518j526L883N048
14604G236M070o096k396J878L693n228l554j679P540O019p008n725J236J267l520
14589b267l888K611n97R76l59J0200j184m365M21K343N490m489o751l583M569
14574h73l938o812j935n553N289P499R993n696m127O733k28N63j654j841P09Q373
14558F502k144k03P22J641l570l645r006m424J849Q807r65K653M240n263p836
14543a0642K426J767M87j287J70k77J378M951K183r06P27M592N487O42J409k925
14527A0182j963o886K511O226k791p964J788J646L048L877l067p496j061J540
$$ y = [-1203, -4790, -7632, -9391, -4142, -4645, -11195, -11836, -6980, -6607, -7137, -4223, -2596, 1567, 5129, 6106, 1588, -5721, -5372, -5100, -5618, -4050, -1094, 995, 4673, 6487, 4972, 1349, -169, -1695, 2188, 7236, 11306, 5210, 2814, 4692, 8385, 3157, -397, -2076, 5464, 11483, 4475, -1250, -14, 1253, -2267, -6155, -3544, -4141, -3165, -3524, 6676, 5492, 1127, 1548, 3891, 9381, 4892, -1859, -5442, -873, -4811, -11623, -13558, -19111, -13822, -6323, 3670, -2026, -6153, 580, 352, 915, -739, -2580, -1871, 6502, 4358, 4155, 4877, 6518, 2948, -697, -9703, -14127, -12278, -3471, -4436, -1783, 2457, -2806, -10642, -8216, -6449, -5962, -7249, -7079, -7356, -5978, -1027, 1156, 250, 977, 5569, 11056, 11698, 13107, 10182, 8219, 1333, 3844, 10070, 7279, -685, 1103, 2749, 5797, 9674, 6607, -889, -1950, -410]
14513d10J717K110j050O489l676j012j551j454l352K792L989K218j1772j446L190
14498c218k967N061L617m824l641M604P069j982O145m064m967n421m46j457r436
14483a5927j102K176Q507R814P31p497p044k344N047O146P57l652k439M630L509
14468A312J346l338k562p182o01j532q312L762R095Q462L98n426K412O532K001
14453F367l909l432k745p06m498L314K019L85J568n01k500K089K161L875o53k373
14437D61M0M76K294O83m791Q20q65L979o184k396m463j425r9L889J0352L61L447
14420F579o109o792o897j908N785K225j985L38J855N337K084m986l569K046r41
14405f938K973P317m334m578m845k599R535L745n194J61J996r359K240M413P692
$$ y = [-410, 1307, 3417, 2367, 8856, 5180, 4168, 2617, 1163, -2189, 603, 4592, 6810, -4962, -6408, -3218, -6185, -1124, 2493, -2331, -5972, -1368, 5701, 3719, 9864, 5800, 833, -4588, -5034, -6491, -15927, -17029, -14853, -6346, 3468, 4199, -3298, -10342, -12686, -7639, -1493, -736, -4388, -6827, -2197, 1312, 2658, -680, -3242, -10424, -11025, -12557, -20869, -17107, -8012, 450, 848, -4578, -2166, 4366, 6367, 2458, -974, -3719, -4425, -8923, -5609, -3590, -3205, -1637, -2138, -4638, -2549, -388, 3487, 2834, 461, 501, 977, 3271, 3954, -837, -17, -882, 3097, -3087, -5483, -9946, -11371, -11470, -7581, 2771, 3132, 6579, 470, -6322, -13219, -15127, -9342, -7117, -9102, -8764, -6909, -1572, 512, -4474, -8043, -5997, -6938, -3965, 3352, -982, -5560, -10405, -13004, -3469, 276, -4918, -4757, -2761, -12120, -9880, -5467, 2225]
14390B225N331J611n612k900j341P07l253j550L955j18k321j009o278L555p2K156
14374d914K039L363M874Q63L86j47j052K191l166K736k202p155l429P8k136K420
14358e251j966j757k859l394J0193O397L259k002l659k095j251m893K857M008
14344b413k171N741J429j639J292J429r092J071K31J881K991m68p194K154K138
14329b620l498k01N55N05j358M140K406K130o608q71L687J1013L498l018m838
14314D922l789m623m581q866n668O468o71O645Q956M595p748n512J92l394j31
14299a3205J135l83Q355J618r87k763l327j084q52J265N522Q5N521m685J979L655
14283A849m247j220K369L386j441n078k196j598k30J833L43R04j39j225N055K81
$$ y = [2225, 7556, 9167, 3555, 655, -686, 21, -3232, -4782, -827, -945, -3266, -4275, -10553, -6998, -7070, -4914, -2875, 488, 5362, 6225, 6611, 6464, 5412, 7603, 4437, 7173, 4971, -2184, -5613, -5535, -7671, -5251, -7217, -8974, -11833, -15227, -5034, 1363, 4622, 2620, -1039, -3134, -4385, -9278, -6421, -2413, -4584, 1157, 2586, 947, 2239, 3668, -5424, -4353, -4122, -2241, 750, 282, -6912, -4758, -2620, -6118, -6319, -5764, -5259, -6617, -2477, -71, 2059, -4549, -5420, -1733, 9280, 12778, 9760, 4922, 1133, -3490, -8071, -16937, -22605, -16137, -16808, -10163, -1207, 3388, -4360, -9872, -9680, -13074, -13205, -12070, -12453, -4098, -2480, -3467, -6230, -9557, -10641, -11493, -10228, -4706, -4621, 900, -3785, -1806, 1849, -2398, -3618, -1249, 2137, 696, -4382, -6578, -8176, -8406, -6573, -6230, -5326, -5465, -6690, -1635, -1354]
14267a354q579N678P773K601m396m785J0840K384n363l506J242n599L344J836
14253B116m962N055L276M439j497j492l266j763O317k844o987q328j543P38p47
14238a1488J49L850L359m023N909N976l535n10J947m434K88k195R99n839M089
14223e458N591L242k22K059N13l119l702j63L669O208J1144N15j0417n342l977
14208E41m754k430N550P598j552m099k017J471m135O254K478n85J78Q16j721K782
14192F375J605p874o523m1N77o49K743K153P26k553J02k000j790J495R557J884
14176E787j301o256o275j512k720K852J0991O834N372q097m921R2p556r575P222
14161i063J1108Q56M35l889k913m175J777k471n733L218P40L382L572l687m718
$$ y = [-1354, -9933, -4255, 3518, 6119, 1723, -3062, 7778, 10162, 4799, 1293, 2535, -3064, 280, 2116, -2846, 2209, 5485, 9924, 8427, 6935, 3669, 1906, 8223, 5379, -1608, -9936, -11479, -10741, -11488, -11339, -7489, -4130, -8153, -2244, 3732, 197, -313, 1634, -2800, -2512, -4707, -3708, -9547, -5458, 133, 3375, 3153, 5212, 5725, 2606, -1096, -1259, 2410, 8618, 19762, 20277, 9860, 4518, 541, -4213, -6643, -1093, 6505, 4953, 854, -1163, 308, -3827, 2427, 4905, 4320, 4498, 5314, 3593, 6375, 7980, 106, -6417, -6458, -5881, -6530, -3787, -1634, -908, -3461, -3359, -5359, -7149, -5654, 3903, 5787, 4486, -1770, -8045, -9557, -12277, -9425, 1566, 8400, 13772, 5675, 754, 846, -6710, -16285, -9063, 2045, 2901, 3336, -553, -3466, -7641, -5864, -8335, -14068, -10850, -10110, -6728, -3156, -6843, -11561]
14146a1561n4q82l61L102L941J355M32L237k05l805K021L665K577l647l256J121
14130b320J864k425p531M04Q189J3778j094j0379n532K362R30l16L042P90o530
14115d768M561L786O361p01o949m26K551N42n726l833j409L103k22M449k446j932
14099c059L097o354j728K192K487Q37l514o967k320K215K701q69j195O077m599
14084a0999M834M567L428K61M423K209k814n104n50J958J598k142K290m54K470
14069E975l445m468L805J140j13L800k252m119j817K810N141j415o441p290n09
14054i198p053j910j481K540j41K773O974K111L01m313q079n978K433J660O333
14039a3028k163j949L410k677M057J725n43l168K622J1821N866n283Q10j049k341
$$ y = [-11561, -11615, -12497, -12858, -9756, -5815, -4460, -4028, -791, -996, -4801, -2780, 885, 3462, -185, -3441, -2320, -456, -2881, -10412, -10008, -1819, 11959, 10865, 486, -5046, -2684, -1754, -2070, 972, 1762, -4768, -207, 3579, 9940, 9239, 2290, 1864, 4415, 4957, -769, -4602, -6011, -2908, -3130, 1319, -1127, -3059, 38, -6316, -8044, -5852, -3365, -2528, -6042, -13009, -15329, -13114, -10413, -11282, -12477, -6400, -10999, -6165, -1598, 1830, 2091, 6514, 8723, 5909, 805, 255, 2213, 3811, 1669, 3959, 3505, 5975, 2530, -1938, 1867, 3007, 2894, 6694, 4442, 323, -1494, 1316, 6457, 5042, -1399, -8689, -9198, -16251, -18161, -19642, -17102, -17243, -14470, -7496, -5385, -5084, -9397, -17476, -23454, -21021, -19361, -13028, -15191, -17140, -13730, -16407, -12350, -10625, -11168, -14336, -11714, 107, 5973, 690, 1500, 451, -1890]
14024a890M164l32Q17M998k147n551m615N437q5m73j435p17L533K951K02p605
14008b748K989J658o101p410M880O650j855n64m364q73R799q86m122o692K770
13993f869j835o71M959L010o138k257M78L153J920l678O477J980p747J424l411
13978i205K563N303J970k048j145q292j004L594M293N067R243J006q671n734N058
13963A998J25j775L562J819n212o9J612K146o64k535J374P9K889l166l667l271
13947d755L503J802J292k183k480O072M850L556k815o415L844n721m228l194J678
13932e194M469m58m268n345m588K008L276j662J019J395j369j83K06J0103j126
13917a717m379L190M151n305P34l338K171O258J85j788k974j263j004O280K984
$$ y = [-1890, 2274, 1942, 2759, 7757, 5610, 59, -4556, 881, 796, 323, -1112, -1829, 1704, 4655, 4857, -2748, 241, 1899, -4202, -11612, -6732, -82, -1937, -2501, -6865, -7738, 2061, 1175, -2947, -9639, -6869, -8704, -9375, -4416, -1406, -7544, -9801, -9323, -6170, -4250, -7928, -1451, 529, -7218, -5794, -9205, -6642, -1339, 631, -1417, -2562, -10854, -11858, -8264, -3971, 1096, 10339, 11345, 2674, -3060, 1998, 2123, 348, 3910, 5729, 517, 448, 2060, 4206, 3542, 1007, 2381, 2460, 5349, 2183, -1484, -4755, -1252, 550, 1842, -341, -2821, 3251, 8101, 11657, 8842, 2427, 6271, 550, -3678, -6872, -5194, -725, -1183, -5451, -10796, -15384, -13376, -10100, -11762, -10743, -9348, -10717, -10900, -10694, -591, -1717, -6096, -2906, 1245, -4060, -3326, -6664, -4493, 1765, 1950, 162, -2812, -4075, -5079, 1201, 4185]
13902D185J482j875l953k345n973L700M771N880M197p892m269k76l057k439M015
13887c849m071O880K253l410p864N057P516P038j674k630m656J824N13l436n978
13872f487n422m132J451N707O096R99N313j387j1979j428k601J397m841K134M239
13857a0941o65n522J611N798L727L093J0074M027p174l896p002r161J980P425
13843f626M627J913j867n336K986O42j378j1146j735J0134N304o352o985J381
13829a4438R20K541L335K575j083P027M145k512m354k348J038l920n778l971L399
13814a3424J0995L330N900o76l867L38Q42P742M955J846J836J872J783K626K539
13799B8637Q01j514j397l149o996k534j805o048j773k832k152o21N154l405J382
$$ y = [4185, 5667, 3792, -161, -2506, -8479, -4779, -8, 5872, 10069, 2177, -2092, -2368, -5425, -7864, -3849, -7920, -1040, 1213, -2197, -10061, -5004, 2512, 9550, 7876, 5246, 590, 2414, 2927, -509, -6487, -11909, -16041, -14590, -8883, -2787, -1788, 3525, 2138, -9841, -11269, -13870, -12473, -17314, -15180, -10941, -11606, -17128, -15517, -9719, -5992, -2899, 7175, 11202, 4028, 132, -6870, -16031, -14051, -6626, -1999, -86, -1953, -7289, -4303, -3661, -5039, -16185, -17920, -7786, -2482, -8834, -15819, -14438, -13518, -10977, -7642, -5067, -6150, 877, 5022, 2510, -1844, -4192, -3154, -7074, -12852, -16823, -13424, -2429, 901, 6801, 6125, 2258, 2596, 3438, 11180, 16135, 17981, 19817, 21689, 23472, 26098, 28637, 29438, 27924, 26527, 23378, 16382, 13848, 12043, 5995, 4222, 1390, -762, -1383, 3771, 366, 1748]
13784A748m066k377J856J522P701P328q624o141o819R18Q434J559K51l009q139
13769g858k10L161N161l625J588N160Q55k467j376L31K77n175O92j851J546L237
13753e54L422j417j03m202l741P476M220k323j985Q89l460j059R304l015k950
13738E02n839o298M487p81J785j693J529M421L296J786m846p502L168n289m724
13723a5998P786J1275l068l154m356m853k72K085P868P007R28l16l055l870K540
13708E47J874j629O64K362K966j752l869Q63r72o71M217o748j770M93k511J628
13692d308K081N793L447k802o255j3171m589J304Q540N887K123l415L128J1431
13678I194M381o837n470L218l005J826K276m272o781n141N103J508L296q621o447
$$ y = [1748, -2318, -4695, -2839, -1317, 6384, 13712, 5088, -1053, -7872, -6954, 1480, 3039, 3290, 281, -7858, -8068, -4907, 254, -3371, -1783, 3377, 4232, 1765, 389, 720, 997, -4178, -3486, -5337, -3791, -554, 2868, 1451, 1348, -2854, -6595, 881, 5101, 2778, 793, 1682, -1778, -2837, 6467, 3452, 502, -5337, -11635, -7148, -7929, -6144, -7837, -6308, -1887, 1409, 3195, -1651, -9153, -5985, -11274, -15998, -8212, 3063, -5, -3159, -7515, -12368, -12640, -10555, -2687, 4320, 5248, 4932, 1877, -1993, 547, 2421, 792, 1456, 3818, 6784, 5032, 1163, 2026, 1054, 383, 4600, -2148, -3918, -3425, -5936, -4308, -2227, 3566, 7013, 4211, -2044, -15215, -19804, -18500, -9960, -4073, -1950, -5365, -2237, 9194, 13575, 6738, 1268, 4486, 1481, 3307, 5583, 1311, -5470, -10611, -5508, -4000, -704, -9325, -15772]
13663a5772J118J414M870K883o092j444K624l905J796N261M332P52l076L185J485
13648e69j830m523K218O887N689j464M268j75j65L34m939m363Km585K460O097
13632E342j424m492K4N27k634o406q18K571q648p31O789q13M440j008Q66Q56N172
13615c87K241n538l908J456j101P409L707o437L62K161M040m506k567k173J221
13600d020J0624J332p200k999K044K697K74n32L99n673k342M417Q524o04o94k75
13584E972r473p991J995L573J99J720l481r09O225P22k617M701j233K358J107
13569B868m433J757K259l972l254M625J090j879m488l335J708j498K709L316L986
13554A459R162k289m160J901j081j471m106L347m20j124J59m888J542P74j044
$$ y = [-15772, -14654, -13240, -8370, -5487, -11579, -13023, -10399, -14304, -12508, -7247, -2915, -2163, -5239, -2054, -569, -2399, -6922, -4704, 2183, 7872, 6408, 10676, 10501, 10336, 10670, 5731, 1368, 1370, -3215, -755, 5342, 3918, -574, -550, -23, -2657, -9063, -9881, -7310, -15958, -16689, -9900, -10713, -6273, -7281, -6415, -5559, -387, 1854, -3684, -7592, -6136, -7237, 172, 3879, -2558, -2196, -35, 4005, -501, -3068, -5241, -4020, 6604, 7936, 736, -2263, -219, 2478, 2752, 2220, 2619, -3054, -5396, -979, 7545, 6941, 6247, 5972, -3501, -11492, -9497, -5924, -5725, -4005, -7486, -8395, -2170, -1448, -4065, 636, -597, 1761, 2868, -1565, 192, 2451, -1521, -4775, -150, 940, -939, -5427, -8762, -7054, -8552, -5843, -2527, 1459, 10621, 8332, 4172, 6073, 4992, 3521, -585, 2762, 2342, 1218, 1377, -3511, -1969, -1195, -2239]
13539b239l929O98O950P347j443n312m262k401k017l063J09L116O397K575n304
13524b778m252o403k861Q356J3167L092r900m37O642N818k69p06j712k319o617
13509a179q76R44R96J80M496o60k820j39J996j484m235l476J033K96l429K625
13493e732m54l103K734l324Q949P421m10p877k995K22q15K913L291m292l904N223
13477b153j816R01j02J081m59M261J59J180m666l768j758l772j99j787j506N529
13461h875L774Q381J399Q24J64r16L343l397O59n26J548n733o687p221P236N445
13445e82L391L183M768n904l441m187J401Q5k579k449J482j765l423k110J803
13430a0327J075L1J845J665J55O759L036J279n481Q00J580q756P506P162K35r699
$$ y = [-2239, -6168, -5470, 1480, 8827, 7384, 2072, -2190, -4591, -6608, -9671, -9562, -6446, -49, 2526, -2778, -7030, -13433, -16294, -7938, 5229, 8321, -1579, -2016, 4626, 10444, 10175, 9469, 7757, 5438, -1179, -2055, -1111, -115, 65, 4561, 3901, 1081, 942, 2938, 1454, -2781, -6257, -5224, -4928, -8357, -5732, -6186, -9289, -6555, -9879, -930, 6491, 6081, -1796, -4791, -4569, -5384, -2471, 820, -3472, -7376, -2153, -3969, -3068, -3170, -2089, -2548, 1713, 1872, 3052, -1614, -5382, -7140, -10912, -11111, -12898, -14404, -8875, -5101, 3280, 4679, 5503, 5667, 4751, 8094, 4697, 5356, 4830, 6378, 645, -6042, -13263, -6027, -582, 2809, 5992, 10760, 4856, 1415, -2772, -1371, -1286, -3865, -6314, -4832, -6597, -10020, -12130, -10327, -9252, -9221, -7376, -5711, -5556, 1203, 4239, 5518, 37, 837, 2417, -6339, 1167, 8329, 8564, -1135]
13414a135k603N782N366K98j083l405M599P352n07o539l238j397r524j847J129
13399f752M86K171P663M394l153k810M133l559j579j982L459j618m644J418K721
13384C48K183J957P509j031p053L495l583k950k869l814K284L649q53k789m61
13369c978J241l700J530K675o917m450P067L010K6m75K89J506M270P556k541q917
13353a808r12L713K153q20m862N45j1772J803K778l101N394M937J368o385l399
13338a0368M979k859r77J882j867Q01K020N302P033n33r025n653J050M014M552
13323C51P75n956J448K933l351K558J783m290O312K773o755n74M882K527k648
13308B768n652k994O977J1531L822k732m168p061q857l958P8O684K58j676j104
$$ y = [-1135, -3738, 2044, 7410, 7708, 6625, 3220, 7819, 15171, 14664, 8125, 4887, 3490, -6034, -7881, -6752, -6266, -4095, 3568, 7962, 4809, 1999, 6132, 2573, 994, -988, 2471, 853, -3791, -2373, 348, 2531, 4488, 11997, 10966, 3913, 7408, 3825, 875, -1994, -5808, -3524, 125, -728, -3517, -3978, -2737, -6437, -4907, -2232, -9149, -13599, -6532, -3522, -3496, -3971, -3682, -2176, 2094, 9650, 7109, -1808, -2720, 993, 3146, 2326, -2536, -1991, -13763, -11960, -9182, -12283, -6889, -1952, -584, -6969, -10368, -5389, -8248, -9225, -7343, -9210, -8409, -6389, -1087, 5946, 5413, -3612, -9265, -8215, -4201, 351, 1126, -4830, -3382, -449, -3800, -1242, 541, -3749, 2563, 5336, -1419, -1993, 2889, 5416, 2768, -2884, -5878, 1099, 12630, 16452, 13720, 9552, 2491, -6366, -10324, -10246, -3562, -3304, -4980, -6084]
13293f084K76j640o880k754N406L839l419J734O15L51M815q24J116L023M041k1
13277C594j23m222q657k626J2343M993J332k227r079M289K534n17j528m159j927
13262e980k52k723J492M724L416o65J920N212M865k421p230l528M652l156k758
13247b432J855O17O877M21K178J267K818n371k104P81j207o243m752j070K4L75
13231e966Q79L036j17m492K348n99p777L027P6l768m955j9L002N271J8P955O267
13214D186k047m057r48K920r95m450M067J399m24p340q08o293J880J552M481M453
13198b424J45m00N435J689m433o694k01R58m766q6N36q22k948O538N746l648j698
13181g073L789L172q106m262N502K405P485L141o52n284p377K078M715L516R72
$$ y = [-6084, -5808, -7448, -14328, -17082, -11676, -7837, -11256, -9522, -8907, -8556, -3741, -4565, -3449, -426, 3615, 3594, 3471, -751, -9408, -12034, 309, 5302, 6634, 4407, -4672, -383, 2151, 1634, 106, -4053, -5980, -6232, -8955, -7463, -2739, 677, 12, 1932, 7144, 12009, 9588, 2358, -1170, 3482, 326, -2432, -577, 40, 6917, 7338, 9516, 10783, 13601, 8230, 6126, 6907, 5700, -543, -5295, -6365, -6341, -5966, -5087, -2051, -2168, -6660, -4312, -4911, -12688, -9661, -9585, -13353, -18308, -18327, -15325, -10054, -10036, -2081, 4186, 2139, -1918, -2866, 54, -941, -5391, -1324, 75, -349, -7689, -8497, -14790, -12910, -11358, -6877, -2424, -2279, -2679, 2756, 4445, 12, -6682, -6883, -5925, -10691, -10777, -10241, -11063, -14011, -7473, -1727, -5375, -7073, -3284, -112, -8218, -12480, -6978, -4573, 2912, 6053, 5401, 117, -7260, -5182, -467, 3049, 4021]
13166D021J136M50l820p77n343J990M203J052r731J362R467K421m046q394l020
13151i029L139K229N736k943k176L718l318M968J565p158N574k426l837l433l34
13136g725O422J313M561K286N63J413p19l351k80m629J21N109m92j281n066n606
13120g361J115L637L369k780k808mj26l271j005k701O386K633P660Q084p001L754
13104I581N400m058l627j5698J359R270m951j963P19N511M428m299k322m059n104
13089i813M003j304K408M863J109n555k022l20M322O241K740L592p083P96N454
13074I431l532j2825o082J279l523P12n56o97O711P35K524M231o864k972J764
13059i664N858N05j981L522J690j859j38K236O174K979q13j490n421k95p1L291
$$ y = [4021, 5157, 5607, 1787, 1010, -4333, -2343, 1860, 2912, -6819, -5457, 4010, 6431, 2385, -6009, -9029, -5890, -3661, 2075, -868, -3044, 674, -2644, 2324, 3889, -3269, 2305, -121, -3958, -7391, -7725, -1303, 10, 4571, 6857, 7420, 8833, 8114, 4763, 4483, -146, -25, 5084, 4592, 3311, -1755, -7361, -6246, -2609, 760, -2020, -4828, -4832, -4958, -8229, -9234, -11935, -5549, -2916, 4744, 12828, 5827, 9581, 14981, 10923, 7296, -8402, -7043, 2227, -2724, -4687, -3968, 1543, 5971, 1672, -650, -4709, -9813, -5810, -7114, -4706, 157, 1266, -4289, -6311, -6631, -2309, 3932, 6672, 10264, 3181, 3977, 9431, 5899, -6926, -13008, -11729, -15252, -14540, -15096, -15793, -9082, -8347, -5823, -1592, -8456, -11428, -9664, -3806, -3301, -5282, -1760, -70, -1929, -2067, 169, 6343, 9322, 8509, 7019, 1598, 1303, 1232, 4523]
13043D523M596p84q334m568k325J456K092k66K047N33J246k669J634L115n885
13028c589m929P794J0252o46j603k777p509J978N037j502k342j291k996N963J074
13013B914J381M841m90m681l917J188p03j861l429l46k94J007O352L891N274J707
12997A2834l91l288l635j810Q04k67N944n30J587l213j308l267l467n383L85J911
12981c094N189l965J877k696l381P517Q577k926m095L562n007l723M002m06o350
12966d919l315j438k45M65K942j488p134O551P26n060Q18O67P710J901l101J06
12950d814M12J275M265N270q10l558m521O659l007J237L707j392p327N123O316
12935H835l875j055m649m600M06k672M168j77m330r995o25O355J44j92Q57M862
$$ y = [4523, 9119, 8335, 1, -4567, -6892, -5436, -3344, -3610, -1563, -1030, 216, -2453, -819, 2296, -3589, -8518, -724, 9528, 8882, 7279, 4502, -3007, -1029, 4008, 2506, 164, -1127, -4123, 1840, 2914, 4295, 9136, 8646, 3965, 48, 1236, 533, -1328, -4757, -5103, -5397, -4390, 1962, 5853, 11127, 12834, 12443, 9155, 5520, 3710, 4514, 4247, 10191, 9661, 11248, 8035, 6727, 3460, -7, -5390, -5005, -3094, 2095, -1870, 7, -2689, -6070, 1447, 10024, 7098, 3003, 6565, 1558, -2165, 1837, 1431, -4919, -8234, -9672, -9917, -9452, -6510, -7998, -15132, -8581, -7855, -12915, -12097, -11430, -3720, -1819, -4920, -4814, -4402, -3127, 1138, 6408, 5598, 2040, -2481, 4178, 1171, 2408, 6115, 4723, -2604, 2519, 8835, 4960, 3905, -744, -5344, -4938, -7610, -3442, -3619, -7949, -17944, -18569, -12214, -12070, -12262, -11405, -6543]
12919f543N157m169j036K261L603Q954J724r14n695j667K101m060j0943K15l22
12904a1334K312K427P021Q062l959o515P532M073J10m304k845Q29o569l328Q112
12889A624J2329j614m386j0921n536n141M149K408L938K661J706L422l3n102L846
12874C350J531m823j2417m023K274K067O90N661M531j632l317K049K020M353k359
12859d5L476l03K619l519j412n661j0944L377N939K329N471L074q32o707p253
12844a0391N73l521O290O337O049J850n372N003n556p085L12M321R21n947K084
12829d132k848J122K476L135l568p224R32K19K413k707K207k865l033J845P743
12814d285Q58j870j729p64r33O08q14K328j81m649K234J463P698M320k752m654
$$ y = [-6543, -1386, -5555, -6591, -4330, -727, 8227, 9951, 9037, 3342, 1675, 3776, -284, -11227, -11012, -11334, -9022, -6595, 426, 8488, 4529, -1986, 5546, 9619, 9729, 5425, 2580, 3409, -3160, -6488, 1624, 13953, 12339, 7953, -2968, -8504, -13645, -9496, -7088, -3150, -489, 1217, 4639, 4606, -496, 3350, 4881, 58, -12359, -16382, -14108, -12041, -11351, -5690, -1159, -2791, -6108, -4059, -2039, 2314, -45, 3431, 3128, 5747, 2228, 816, -4845, -15789, -12412, -6473, -4144, 1327, 4401, 3569, -3138, -10391, -9818, -13339, -7049, -712, 5337, 7187, 1815, 6818, 1262, -5823, -5511, -1190, -269, -6216, -4132, -6980, -5858, -3382, -247, -3815, -11039, -10107, -9888, -7475, -10182, -7975, -10840, -13873, -12028, -4285, -3427, -5297, -7026, -7790, -8723, -8115, -8929, -6601, -6782, -11431, -9197, -7734, -36, 4284, 1532, -3122]
12798c122L33P06K982q78J792N776M598o375n035m701O431K654m265o1M53n691
12782d403n097K583n84k077j696L131k195k833j721O271M794Q569Q769m371j1503
12767b363l695k053P625N382K326o563Q8N132l137n115n815K555K57j63M574L327
12751B362n014N567K51l458J675q625j218o090k978M223N173L986J428l21l711
12736f750O9NJ217O024o276j693J938J777j152M251k148m434M532L537m421n715
12720i239J411l212j458J25K159m950L69Q183l010k292M160M33M586O183N001
12705H449j336n762J37j63K434j736J004l983m517n257p01N224o48j102p96M976
12689c777P432Q321N27p197l909j69k148o214j60M567K558N82K846o418o689N34
$$ y = [-3122, -2789, -2083, 899, 21, 1813, 7589, 12187, 5812, 777, -3924, 2507, 5161, 896, 835, 1288, -4403, -9500, -6917, -7501, -9578, -11274, -8143, -10338, -13171, -14892, -8621, -3827, 4742, 13511, 9140, -2363, -6058, -8111, -486, 4896, 7222, 659, 747, 5879, 2742, -2373, -8188, -5633, -5376, -5539, -965, 2362, -2652, 2915, 3166, -292, 1383, -7242, -8460, -14550, -17528, -13305, -8132, -4146, -2718, -3039, -6750, -6681, -6676, -5459, 565, -5711, -7404, -5466, -3689, -4841, -590, -2738, -7172, -2640, 897, -3524, -9239, -7828, -11040, -12498, -12373, -10214, -15164, -14795, -6612, -9622, -11914, -7754, -7321, -2735, 3448, 8449, 7113, 1351, 1488, 1325, 3759, 2023, 3027, -956, -5473, -10730, -11431, -6207, -6855, -7957, -8753, -3777, 3655, 11976, 12503, 5306, 1397, 1228, -920, -7134, -7294, -2727, -169, 413, 3259, -3159, -9848, -9314]
12673i314j152J483l555K592M876K796R45M987n163q019M584M970o567j385K252
12658e670o810L478P223N61o59k826J204l965j708N25L220K585j965o22J755N812
12642B138P143K92n105o422k410k756j020l853l07O908L82p055j042K073J981
12627i053P686Q289k129L9n216J119l656p74J007K933K372M968k08m194k066L272
12611D389j065k428K39K106K830q08m151n050J399n011K066L280j176N316l753
12596a817q408M323k935K104M235N871M220J055j063K49l775m812P338N494j019
12581A1060o308j1115J083j483j145k698P554P95r46n04K388J576J279K144L21
12566D001r81M211N842k699p455n408M3k712M101Q726j927l853n377k189L357
$$ y = [-9314, -10466, -8983, -12538, -9946, -5070, -2274, -1329, 3658, -1505, -9524, -4940, 30, -6537, -7922, -5670, -12480, -9002, -1779, -1218, -1877, -4703, -3499, -7464, -9172, -8647, -5427, -2842, -4807, -5429, -3674, 2138, 9281, 9573, 4468, -1954, -4364, -7120, -8140, -11993, -12300, -5392, -5010, -12065, -13107, -11034, -9053, -1367, 6922, 4793, 4832, -384, 735, -2921, -3695, -2688, 245, 2617, 7585, 7377, 3183, 1117, 4389, 3324, 896, 1135, 3241, 6071, 5263, 1112, -3938, -2539, -7550, -5484, -2204, -3380, 1936, -1817, -10225, -5902, -8837, -6733, -2498, 3373, 7593, 8648, 7585, 7834, 4059, -753, 6585, 12079, 11060, 4752, -6363, -5280, -6763, -7908, -10606, -3052, -2257, -3203, -3707, -1319, 257, 1536, 3680, 4001, 3020, 7231, 13073, 10374, 2919, -2489, -2446, -5158, -1057, 7669, 5742, 1889, -3488, -5677, -2320]
12551b320k845k114J096J716M483P369p201l161N678l018l969K04l413j224L339
12536e380M068J869Q83J357N887k156j1708l13l13m241j36L691P02Q05j090J759
12520d316L544L578K408M544J809l558l973m341L030o04p416L012l69n303O821
12505a134j222k02l436n147m96L416N982L028p46o765k661P584k292n079K690
12490f480m505O938Q719K12k070p395p038k808J556M438L333K586K128L530j557
12475A587K736j366n605J65m284R256M805k636j3n872k287m847O244K86p642j003
12459a0476N313j271K716L349m158P771K876k743K923K778k547l349J046o40l815
12444b27k308o048L3L445L694L923q265N330J407K49Q47J314J03r1o794r16j961
$$ y = [-2320, -5165, -7279, -6183, -4467, 16, 7385, 184, -2977, 2701, -317, -4286, -4082, -7495, -8719, -5380, -1312, 557, 1440, 2797, 8684, 6528, -5180, -5493, -5806, -10047, -10183, -6492, -5790, -4985, -6075, -4316, -772, 2806, 5214, 9758, 11567, 8009, 4036, -305, 2725, 2121, -5295, -2283, -2652, -7955, -1134, -2356, -2558, -5994, -11141, -11637, -8221, -2239, 789, 43, -6722, -9383, -1799, -4091, -9170, -6480, -10985, -4047, 4672, 4884, 2814, -4581, -11619, -14427, -12871, -8433, -5100, -2514, -386, 3144, 1587, 4323, 2957, -2648, -2483, -6767, 2489, 7294, 4658, 4645, -1227, -3514, -8361, -2117, -1831, -9473, -10476, -5163, -6434, -3718, -369, -4527, 3244, 6120, 3377, 6300, 9078, 6531, 3182, 4228, 3588, -227, -2535, -8583, -8550, -5105, -1411, 2512, -5753, -423, 984, 1233, 2080, 3394, 3497, 3406, -3388, -4304, -6265]
12427f265O662l89N764l863m252j09k282l970K346l009O438k913j237k051j326
12412a0456l475L803K763M071J939Q37J725o325o57R987k653n188J925j288J314
12397a678l687n803N983M593L883K214n25k828K248r04k541K971j961L035L864
12382H864l812q652O66N660L775K731L878K060n780o12o921O379P260n424l841
12367F231j630K745l219k785m657m130j128o997Q43R711N401k598J998M007O209
12352A0001o858j0868j190R0l844R97K91k82K056Q880M812L271L238m797r047
12337c250j005M136J569m261j916L99l580R29J43L500L270j907k774p556L834
12322h469L907L113K733k006j186K233M04n855N7M965L968o609k304j585n556
$$ y = [-6265, 397, 8, 5772, 1909, -2343, -2452, -4734, -8704, -6358, -9367, -2929, -5842, -7079, -9130, -10456, -13931, -10128, -7365, -3294, -1355, -518, 1207, -5118, -5775, 4212, 1559, -3629, -1704, -2992, -1678, -5365, -11168, -5185, -592, 3291, 5505, 4980, 2152, 4400, 3496, 955, 3926, 1965, 5000, 8864, 5052, -3600, -2934, 2726, 6501, 9232, 13110, 15170, 9390, 8778, 1857, 8236, 15496, 10072, 6231, 4601, 7346, 4127, 1342, -3315, -7445, -8573, -15570, -14727, -5016, 385, -2213, -215, 3792, 10001, 3143, -7725, -8915, -8825, -12669, -11672, -11381, -11663, -9607, -727, 4085, 7356, 10594, 5797, -3250, -4255, -119, 1450, -2811, -4727, -4328, -7908, -6979, -6836, -3336, -66, -1973, -4747, -12303, -8469, -4562, -1449, 1284, -722, -1908, 325, 729, -5126, -5069, -104, 3864, -2745, -5049, -6634, -12190]
12307a2190P979N510j45L9L087K363m625N089l210p981p90Q87N075J652k634m358
12291d252m737J079j268L000O665L095K65l688l33j334J511j049l285J855k094
12276d570p8J878O100Q552K209m298M412M023j175p85o815K710l79n689m087k809
12260h01l553L934M021L341J593M462M59j1767J109L362L912k654m889K286N55
12245E370j523o544k306m038L179R180M858j303k935J258L938m123j988L098l816
12230B305o335j233O06l608J397J1453M002J465m837m827N691o563j902J087k698
12215c997L724L353L069M13m324k756j213l469k089l655J59M423K737o405K511
12200g519Q010k81p148n198J829j260O978R412k207p584Q61k89L965P438o674
$$ y = [-12190, -4211, 1299, 1154, 1193, 4280, 6643, 2018, 7107, 3897, -4084, -4874, -3987, 1088, 2740, 106, -4252, -8989, -7910, -9178, -6178, 487, 3582, 3847, 159, -174, -1508, 3, -1046, -4331, -2476, -4570, -4648, -2770, 3330, 11882, 14091, 9793, 14205, 18228, 17053, 16268, 9453, 12163, 11784, 6095, 2008, -801, -4354, -420, 3601, 6942, 8535, 12997, 13456, 1689, 2798, 6160, 10072, 7418, 2529, 4815, 5370, 3847, -2697, -5003, -9041, -5862, 3318, 8176, 6873, 3938, 5196, 9134, 5011, 3023, 6121, 2305, -4030, -5263, -4657, -8265, -6868, 4585, 8587, 10052, 5215, 388, 6079, -484, -2386, -1299, -3997, -273, 3080, 6149, 6562, 2238, -518, -1731, -5200, -7289, -10944, -10785, -6362, -3625, -10030, -7519, 491, 210, -6938, -12136, -10307, -11567, -4589, 4823, 2616, -4968, -4107, -4396, -431, 7007, 333]
12185C33Q28J2416m87j1335l961j981k038K429j02j626J935J858k348j418L884
12170a613M83r312L532P795J778K523J405l794r950k240Q691K551l760j021k247
12155e179J241l639L18N017N434N289K049J056l501k025j587J728J591q015q630
12140h853j351K370m561N030J349N571P580k798j0418l097J0785M694L378m235
12126E444j579m821m635j674J403l474k626K756K132N918K259l447P37K270P16
12111A379p09k346j839j12N73o132l821p45J887M61k264K623L106Q779Q348l148
12095F040K509m266n019o05J826L881Q155j975m341m217M443P058k880o087k071
12080B451r163L552O896o06K607R711R73L524k417l787p054j0651p441j389j789
$$ y = [333, 1161, 13577, 13090, 1755, -2206, -4187, -6225, -3796, -3898, -5524, -3589, -1731, -4079, -5497, -1613, -1130, -10442, -6910, 885, 2663, 5186, 6591, 2797, -7153, -9393, -702, 1849, -1911, -2932, -5179, -3938, -7577, -7259, -2242, 3192, 8481, 10530, 11586, 8085, 6060, 4473, 6201, 7792, -223, -8853, -10204, -7834, -12395, -7365, -6016, -445, 7135, 4337, -6081, -9178, 1607, 6301, 9679, 5444, 3865, -956, -5591, -7265, -5862, -9336, -11962, -9206, -7074, -1156, 1103, -2344, -1607, 663, 1379, 670, -1676, -3515, -3627, -3054, -9186, -13007, -13752, -11865, -11404, -13668, -11045, -7939, 840, 9188, 6040, 8549, 4283, -736, -1341, 485, 4366, 12521, 10546, 6205, 1988, 6431, 13489, 10609, 4522, 2451, -6712, -3160, 3736, 3130, 5737, 15448, 16421, 19945, 17528, 13741, 6687, -3964, -11405, -12794, -14583]
12065a4583Q899Q093J59N14j494n593o335J647P763J175R65l829k622O90O888
12050B337L569n47j077O108o220r64K888m294P40K160n482K4K358j246Q40m7K765
12033C912M57K002n187k839q166K238O122K248j173k283l422J904l487K273O92
12018d709O983J109m748o902N998O974L39k816j908k743l805k453P395L295o91
12003A318l990K498K947M651m400m926r44N96j238p111n934O35M001L301J370
11988g226j549o515N394K657K369m55K711L667K13O433l053m452q18p54j193M408
11972A837N96K47O18J880j175k500j036K309O927l06m096p870p96O107M023m117
11956B648m523p33n364M52O851Q874N4k155k569l547m466j948l269j098M85L261
$$ y = [-14583, -5684, 2409, 2568, 3082, 1588, -4005, -10340, -8693, -930, 245, 1210, -2619, -5241, -4551, 2337, 5906, 5359, 4282, 10390, 4170, 3206, 6094, 1800, 2540, 4700, -782, -758, 1600, 354, 1194, 1147, 3912, 4369, 6371, 1184, -1655, -9821, -7583, -1461, 787, -386, -2669, -6091, -4187, -7674, -5401, -4709, 2274, 3383, -1365, -8267, -2269, 4705, 5044, 2228, 320, -2423, -6228, -8681, -1286, 2009, 1318, -2672, -174, 2773, 7424, 3024, -1902, -2846, -2250, -3488, -10599, -16533, -15898, -11897, -8596, -7226, -8775, -15290, -9896, -7239, -4870, -5325, -2614, 1053, 1266, 7699, 4646, 194, -624, -1378, -2571, 1837, 2433, 2680, 3298, 5178, 4003, 1503, 467, 2776, 9703, 9397, 5301, -2569, -3365, 2742, 6765, 2648, -1875, -2608, -7972, -7520, -669, 8205, 8259, 6104, 3535, -12, -4478, -6426, -9695, -10793, -10308, -7047]
11940g047K563L635k561q909L104O396K243p029k628L724L478N349m322m887j07
11925f998n613R121P169K960L11j665l690M265O881n032p788j0251k761N752P533
11910A94n905j270M429K818k218m302j015J35L375q763K67N307P903L853j97j46
11894D465k762L392n588q865m17N262Q72M087J02n450q17O326K085p117k255O277
11878d03N98k957M664K924M733l135k399M002j1509o592R96q9K853n94J392N247
11862b69K881k531j181L465j60L416N848L176m55J114J931J84m744j1130M447
11847E992L675l145P60J151N52m772m190L914n299o30P464M487L59K728l585l496
11831E965K707n261l767K402m374J32K399M590j018j1355k455j167l016O32M233
$$ y = [-7047, -4484, -849, -3410, -12319, -9215, -2819, -576, -7605, -10233, -6509, -3031, 2318, -2004, -6891, -6998, -12611, -3490, 3679, 6639, 6950, 5285, 1595, 5860, 12741, 7709, -79, -10330, -13091, -7339, 194, -5711, -6981, -2552, 266, -1952, -6254, -7269, -7134, -3759, -12522, -12255, -6948, 955, 4808, 4611, 4465, 1703, 5095, -493, -9358, -9775, -4513, -3641, 446, 548, -4902, -5719, 607, 2692, -4425, -6680, -403, 195, -2762, 1902, 4826, 9559, 6424, 4025, 8027, -3482, -10074, -9078, -9167, -6314, -6908, -5516, -269, 2612, 81, -1100, 2365, 2205, 5621, 11469, 14645, 14190, 15304, 17235, 17419, 12675, 1545, 5992, 9667, 6522, 7282, 8433, 8985, 4213, 23, 3937, -1362, -1992, 5472, 9959, 10318, 13046, 9461, 5965, 8672, 3411, -356, 2046, -2328, -2196, 203, 4793, 3775, -7580, -10035, -11202, -14218, -13586, -9353]
11816i353R620r11k949J429o852J683R588r63j465o927l483m137L568P299O998
11801C145R240M463j5415o734j298K383N231k983p40k488q825j92O065k09R198
11786H41K371n907K29K89k810m130k213R71Q370j671k777l413l645j953M003r51
11770a2396J811K364M791J235M626J345k006o35J953n352N396L678n325l168j644
11755c327P54O03J203K308J697J468J500k916L72j1737k065N921M387k308k864
11740e004Q92O50R52k60l514K408K507K973Q881R52n486J52J80q04o418n072K508
11723c503L479Q407N029k94n50m122q741n733L509K418J970l505j748R310J883
11708G809l607m042p123M35Q608j8q802l116P997K253J244M561R3k412k118n64
$$ y = [-9353, 267, -644, -3593, -2164, -9016, -7333, 2255, 1292, -173, -7100, -10583, -14720, -11152, -3853, 3145, 12385, 16848, 1433, -5301, -6599, -4216, 1015, -1968, -2708, -5196, -14021, -14213, -8148, -8357, 841, 3212, -2695, -2466, -2177, -4987, -9117, -11330, -10359, -1989, -3660, -6437, -9850, -13495, -15448, -11445, -12396, -10585, -8221, -3430, -2195, 2431, 3776, 1770, 1135, 3088, -2264, 3132, 6810, 1485, -1683, -3327, -2573, -1970, -767, 1541, 3238, 4706, 6206, 3290, 3662, -8075, -10140, -4219, 168, -2140, -5004, -4112, -3462, -2510, -2770, -6284, -3876, -1369, 1604, 10485, 11437, 5951, 6103, 6283, 5479, -939, -6011, -3503, -24, 8383, 13412, 13118, 12568, 8446, -295, -6028, -2519, -101, 1869, -1636, -3384, 5926, 7809, 4202, 160, -6963, -6528, 2080, 2062, -6740, -9856, -1859, 394, 1638, 6199, 6292, 3880, 1762, 1198]
11692A198M203O18K930J555o11m162k704N196J728J806l089n502L716p49j1639
11677e506k117M848j973k281n25M699K691J964K28N11K02M269l373l475j874m736
11661f448j36k72N000N641j783m826m367j469P528N024J853l298p911o674l27
11646a2465R202Q175j799m681l063j661r97J654L028L94l546l652M524J3398m102
11631D409q456j882L625k999n307L592P185K088m30R56j986n007m818O91L231
11616e108r48Q18O409M213M27J92J349l556L27N521m70m674r804p78L87N123L39
11599b33j020p92n797J406L14j413L189P412J2050m833j089Q84m335k887K420
11584E276j157q22K84k095l616k328l785O118J0687N011n874m651o853j908L965
$$ y = [1198, 5401, 6019, 8949, 10504, 9893, 5731, 3027, 8223, 9951, 11757, 8668, 3166, 6882, 6133, -5506, -7623, -2775, -4748, -7029, -7554, -2855, -164, 1800, 2028, 2539, 2741, 7010, 3637, 162, -1712, -6448, -6584, -6856, -1856, 3785, 2002, -2824, -7191, -8660, -1132, 3892, 5745, 2447, -5464, -12138, -12465, -3263, 4912, 3113, -1568, -4631, -6292, -7289, -5635, -2607, -2213, -5759, -9411, -4887, 8511, 4409, -4047, -5929, -2304, -5303, -10610, -7018, 167, 2255, 1825, 2781, 795, -4212, -9030, -8339, -5108, -6056, -5238, 1171, 5384, 5811, 6003, 7352, 3796, 4123, 9644, 9174, 4500, -5304, -6082, -5695, -572, -233, -1253, -2045, -7842, -6436, -6122, -7535, -4346, 3066, 15116, 10283, 9194, 10078, 5743, 2856, 5276, 4119, 3297, 3581, 1486, -2130, -4458, -8243, -2125, 8562, 13573, 7699, 3048, -3805, -5713, -1748]
11569a748K583k342m770K495N644n750J840O887M108l247n430m717j384k88O817
11554F98J780K063j459k962L070j885N681K586N35p48k365L3j659o111p897O51
11538g989K729O396O879K59m600o136n175M896O448M114J346L70l303R47J067
11523H248k20l804j334m942m396P210M695P13j698l357M14J793O406O495o279
11508I944NO715m707K174m513j216l56r95L622N260O348n817p115j850l656J27
11492C970M36m990j009n72M407L22N83k777L390j66n686p60M191Q10l773M546
11476B922J458J673K009n015j801J591n111n742L082L827P389k679p935k156J225
11461e263L264R16N722Pr334k510L917R52J751L638m410K485l263j048L198O682
$$ y = [-1748, 835, -1507, -6277, -3782, 1862, -3888, -2048, 4839, 8947, 5700, 270, -4447, -5831, -6119, 698, 2478, 4541, 3082, 120, 3190, 1305, 6986, 9572, 10107, 9359, 6994, 7027, 5368, -743, -8640, -7989, -5260, 1136, 8015, 8274, 3674, -2462, -7637, -2741, 3707, 7821, 9167, 9537, 6234, 7181, 8248, 8028, 4224, 2890, -2052, -6448, 762, 5457, 6170, 4472, 1115, 1529, 3322, 9728, 16223, 9944, 9949, 16664, 11957, 14131, 9618, 8402, 8046, 7051, 10673, 15933, 22281, 16464, 9349, 7499, 3843, 3970, 4406, -584, -1593, -2165, 2242, 2564, 3147, 370, 3760, 3594, -2092, -2852, 1339, 2149, -1624, 2922, 4380, 6053, 8062, 3047, 1246, 2837, -2274, -8016, -4934, -1107, 6282, 3603, -4332, -6488, -5263, -1999, -1083, 4639, 4646, -4688, -7198, -3281, -2329, -578, 3060, -1350, 1135, -2128, -3176, 22, 6704]
11445F704M674k109k420M14l813K278Q93m101Q13M604K139q867k455M923M677
11430H354O533m129k216m678j714J0605M179p515p791m72l130j917j451N718R637
11415A0013O648k519m381P41j224k386Q8k958o27j239m881k827L832N436N594
11400I310K860j541l006J138K270M428j744n298k819L179M37K014m877j447K544
11385G448m886k414m357l587M341M734M722K919K856l324l127L767m957l454k103
11370a422K99N934K525M425j938m27K215j030j079n84J846P33Q78M963n444p153
11354D741j196m28l41p60j761K38k285r15J779M956J1284O380j3614o392k451
11339g65L459L745L446j226j0420k567k941L347J1276L698k888k4J198J634n916
$$ y = [6704, 11378, 9269, 6849, 7263, 3450, 5728, 6621, 2520, 3333, 7937, 10076, 1209, -1246, 3677, 8354, 14887, 10758, 8542, 3864, 2150, 12755, 16934, 9419, 1628, 1156, -1974, -3891, -5342, 376, 10013, 16661, 14142, 9761, 10502, 9278, 6892, 6980, 4022, 3395, 2156, -2725, -5552, -1720, 3716, 9310, 12170, 10629, 7623, 8761, 11031, 15459, 13715, 8417, 5598, 8777, 9214, 11228, 6351, 4904, 7448, 2562, 148, -4209, -7796, -3455, 1279, 6001, 8920, 11776, 8452, 5325, 9092, 4135, 681, -1422, -1123, 4811, 7336, 11761, 9823, 9396, 11611, 10581, 9502, 8918, 10764, 11497, 12375, 17338, 11894, 4741, 3545, 3117, 2776, 2016, 255, 493, -1792, -2707, -928, 4028, 15312, 21692, 8078, 1686, -765, 2694, 6439, 9885, 8659, -1761, -4328, -7269, -3922, 7354, 11052, 8164, 8140, 9338, 10972, 5056]
11324E056j867J019j059o83j126P49N088O07L343K355k001O74J25j930j92N09
11308A0667m111M025N54j803r442J71K196Q675K731k787o474J858J175M097l884
11293G648n86r29o808O34J906J0047L903j331j395O014L073n036j4602m642K324
11278B20p76q33R88J08N60O90N213M487k87n016R236K88l492p25l13R294n787
11261A3855j0390o939j41N45k261m771P091R234M009j419L103l269R00K624M58
11246A2629O87J475P662Q151Q407j876M03K740K915j608q59p184n690o134j2229
11231I489o818N602M835p805K353R53J591N414K555m893q06j894l950l063J523
11216E086J280l214l332l81K095M026Q337L22o294l696k06k894P106L288k77k520
$$ y = [5056, 3189, 4208, 3149, 2466, 1340, 2089, 7177, 7784, 11127, 13482, 11481, 12155, 12280, 10350, 10158, 10667, 6556, 10581, 11135, 9332, -110, 61, 2257, 10932, 13663, 10876, 4402, 6260, 7435, 11532, 7648, 7062, 6133, -675, -41, 1865, 11912, 15815, 14484, 13089, 19103, 22176, 17140, 2538, -2104, 220, -556, -1389, -401, -293, 267, 957, 6170, 10657, 10370, 5354, 14590, 14878, 11386, 10661, 10348, 19642, 13855, 3465, -3474, -3615, -3070, -5331, -10102, -3011, 6223, 10232, 8813, 11916, 8647, 9547, 12171, 12629, 13316, 14791, 22453, 30604, 39011, 37135, 37538, 40278, 43193, 41585, 40726, 33542, 27852, 21718, 9489, 2671, 8273, 13108, 5303, 7656, 8609, 10200, 15614, 18169, 13276, 12470, 10576, 6626, 3563, 5086, 6366, 3152, -180, -561, 1534, 5560, 13897, 14219, 7925, 4229, 4023, 1129, 8235, 11523, 11246, 8726]
11200H726r285k015m28Q135K533K49M377k342j340K453p942m223k032M121l969
11185b982K847M087Q003L075K530K326l993n622J91P544N539J423k952k835j423
11170A7758m287K648p9J452J827m084k578L558m18J949j425j715k005j951O744
11155A7394L633k832o266k969N506L243l208m959L243N429j793j474l146p278
11141D523K429R149o15j574n594k738K473K618J325J013m618L615J2510l600q621
11126A2295k458O936l109K950M394N190M087L195L912k300k250L842N286k052
11112C9918l591o719Q59K553q249j812j21m681P1N375l719o980k591M658l05J257
11096A5923P73k980l397P33m944k771N10P105J4589K446l958n434l739J042M39
$$ y = [8726, -559, -2574, -3002, 5133, 7666, 7915, 12292, 9950, 8610, 11063, 3121, -1102, -3134, 987, -2982, -135, 3952, 11955, 15030, 17560, 19886, 15893, 10271, 10462, 18006, 23545, 24968, 22016, 19181, 17758, 13471, 16119, 16040, 17492, 19319, 15235, 12657, 16215, 15797, 17746, 16321, 14606, 12601, 10650, 17394, 21027, 18195, 11929, 8960, 14466, 17709, 14501, 9542, 12785, 18214, 16421, 14947, 11801, 4523, 6952, 16101, 15486, 13912, 8318, 5580, 8053, 10671, 11996, 13009, 8391, 12006, 24516, 20916, 12295, 9837, 16773, 13664, 16614, 21008, 26198, 30285, 33480, 37392, 35092, 32842, 36684, 41970, 39918, 36327, 29608, 30467, 33020, 24771, 22959, 22838, 18157, 18228, 23603, 19884, 12904, 10313, 14971, 14666, 15923, 16696, 13716, 10319, 11052, 6108, 3337, 3847, 10952, 25541, 27987, 24029, 18595, 14856, 15898, 16337]
11081A6337M49M237k771Q663K164m564o459n249n141M917N962k415k445m509J377
11066A0553N482M488j915l590n468N418M586k279M99n763o549k235L138J786K476
11051A0627J201K798k054j612L588K72J821M300n57q40n117p811l35K394l848
11036D827K345k65j203j811J183N54J886l36J013R31L570l202J94K068m150l90
11020G214M133R350K614m674p245N882M675K907o12n834p528o047L277N375n537
11005G950m179l509l258Q434P333R519J559n19J924j987o715r9R026Q409p35o262
10989B6891k220k335n261N361l158n75N286M684j526k989K94K015l056J892o069
10974A9234m012M75k724m422K523M689P253L937q744r024K069Q231N336n128j514
$$ y = [16337, 16786, 21023, 18252, 26915, 29079, 24515, 18056, 12807, 7666, 12583, 18545, 16130, 13685, 9176, 10553, 16035, 20523, 18608, 15018, 9550, 14968, 19554, 17275, 17774, 12011, 5462, 3227, 6365, 8151, 10627, 11828, 14626, 12572, 10960, 14548, 14820, 16641, 20941, 20384, 19544, 14427, 6616, 6281, 8675, 4827, 7172, 6907, 5704, 3893, 5076, 5630, 7516, 7180, 8193, 9124, 12694, 9492, 9686, 11754, 7604, 7214, 11347, 20697, 23311, 18637, 11392, 17274, 21949, 24856, 24244, 18410, 10882, 4835, 8112, 13487, 7950, 3771, 262, -2996, 5438, 12771, 22290, 23849, 23330, 25254, 23267, 16552, 16453, 25479, 33888, 33153, 26891, 24671, 22336, 17075, 22436, 19278, 18703, 23989, 28673, 27147, 24158, 24452, 26467, 23411, 25303, 19234, 15222, 15697, 12973, 8551, 11074, 15763, 23016, 26953, 18209, 9185, 11254, 19485, 24821, 19693, 18179]
10959A8179Q764P53k320j065R04M0k337M8O365M78p342O31m066J549J118Q56J001
10942B3556p318M67O611L645K416N30Q03m441n922n088M209j930K20P438J429
10927B6625r68L87n821O232P134m561o354N9Q628O99M332k011k528Q099J118l90
10911D0680N13j000o871j057P39M217R764J203p421n589l258n523o352p3N947
10896B5919N28K053n56l630J995k286l032R1M118L790m856l339J645L118l55L318
10880B8521M396K035O63j57L84p913J210K613R36J058M684J440l889q475n774
10865B1732J242l93K549M14j02k115j163K905K416J362j72r27J96j466l303m636
10849A8539j931l066L320M430P457L977n835J830K820l222m944M264K377l791
$$ y = [18179, 26943, 27696, 25376, 24311, 25215, 25255, 22918, 22966, 29331, 29809, 22467, 23098, 19032, 20581, 21699, 22555, 23556, 16238, 16705, 23316, 26961, 29377, 29907, 30710, 26269, 20347, 15259, 19468, 17538, 17758, 25196, 26625, 25657, 26044, 20223, 26455, 33589, 29028, 22674, 22733, 31361, 32060, 36392, 34381, 31853, 39952, 41070, 40680, 41193, 40193, 33322, 32265, 33004, 37221, 46985, 48188, 40767, 35178, 31920, 26397, 20045, 19972, 25919, 26447, 28500, 27944, 24314, 26309, 24023, 20991, 21082, 25200, 28990, 24134, 20795, 22440, 25558, 25203, 28521, 32917, 34952, 35615, 35458, 35842, 27929, 29139, 31752, 32688, 33746, 38430, 39870, 35981, 27506, 21732, 22974, 22581, 25130, 25544, 25442, 23327, 22164, 25069, 27485, 28847, 28675, 27748, 27944, 26478, 23175, 18539, 16608, 13542, 16862, 21292, 28749, 32726, 26891, 28721, 31541, 28319, 23375, 27639, 30016, 26225]
10835B6225m110L590K840J93j500q62P4J473K381M462J232k26J292p712P615N593
10819D2560q230l111n278m14K41R37k340L277K530L484J475p771j538k185O44
10804B4281k959p247L014l992k356K290M301L164N850N358k686n010j585q85K029
10789B3567Q665N714j66L00m517j669R547m849j934j384M040l789l808Q02k584
10774B7935J811m699J249k089k726J842N709R98j043K027M946Q4m257n136K544
10759B9195K468p05n838k427n657j141L393L653K416j399o361K936O961R351O12
10744C7457j2712k530R866l63L609K651J289m36N133Q071L835J1333k304q193
10730E6706o490M511j066l068M130j037m85K68k965o208l761l319L329J645M46
$$ y = [26225, 22115, 25705, 28545, 28738, 27238, 26376, 26450, 27923, 30304, 34766, 35998, 35772, 37064, 29352, 36967, 42560, 34330, 31219, 25941, 25527, 25768, 26705, 24365, 27642, 30172, 33656, 35131, 27360, 25822, 23637, 24281, 21322, 14075, 17089, 13097, 10741, 13031, 17332, 20496, 26346, 31704, 29018, 24008, 22423, 21538, 23567, 32232, 37946, 37780, 38080, 33563, 31894, 41441, 36592, 34658, 33274, 37314, 33525, 29717, 30519, 27935, 29746, 25047, 26296, 24207, 21481, 23323, 29032, 30030, 28987, 31014, 35960, 36044, 31787, 26651, 29195, 31663, 30958, 25120, 22693, 17036, 15895, 19288, 22941, 25357, 23958, 17597, 20533, 27494, 36845, 37457, 24745, 22215, 32081, 31718, 35327, 37978, 39267, 38831, 43964, 52035, 55870, 67203, 64899, 56706, 50216, 54727, 53661, 50593, 54723, 53686, 53201, 53469, 50504, 44296, 40535, 37216, 40545, 42190, 42636]
10715D2636K365J015k607n307m338L242J0057P534k74m042J127M884p449O54j999
10700D7498j317K63L407L536j000K399Q56K123L974k177l567R019L496n3K962
10685G1419L17j796m134q668j147J444l636o783l683J342m281o12K034k363m038
10670C5415n707o925k350K630N766L194M02j418l5j322L06M730M128k894l329
10655C2591J391J0328N383P126P071K643O099J185j743R125J3370N348J2818J0136
10641A22871P758O567K739J4105J8133K8558L1832M2151N8638Q8755J03644J21637
10629F47388J43660J70834J75580J48314J19358J00168O7673L4510l8650q3918
10619A484917j34730j57555j39839j35220j29205j37896j13615o9291m6769l3454
$$ y = [42636, 45001, 46016, 43409, 38102, 33764, 37006, 47063, 54597, 54323, 50281, 51408, 56292, 48843, 49497, 47498, 46181, 46444, 49851, 53387, 52387, 54786, 55642, 57765, 61739, 59562, 55995, 65014, 68510, 68457, 71419, 71736, 69940, 65806, 57138, 55991, 57435, 53799, 47016, 43333, 44675, 40394, 39782, 41816, 39453, 35415, 29708, 22783, 20433, 23063, 28829, 32023, 32425, 31007, 30972, 29650, 29956, 34686, 38814, 35920, 32591, 33982, 44310, 49693, 56819, 63890, 66533, 72632, 73817, 72074, 81199, 94569, 99917, 112735, 122871, 130629, 137196, 139935, 154040, 172173, 200731, 232563, 274714, 333352, 422107, 525751, 647388, 791048, 961882, 1137462, 1285776, 1405134, 1505302, 1572975, 1607485, 1568835, 1484917, 1350187, 1192632, 1052793, 917573, 788368, 650472, 536857, 467566, 420797, 387343]
10609C87343k0731j8927k3657r813j2327l528m424j2336j2973j6628j2774r328
10597B29897j4442j6184n594m196l934m517n894n254j947j2061j1859Q8k275p813
10583A34015p897q281l121n643k705k989j777J645K229q575p168m202n124l893
10569G6514l136k630K448J103O612M733o587j760L279J513p82n831l569p28J557
10554G2736N385o9k341n14N434jN216k289n866N818R993j033k767j014L963l545
10538H9106k792M203j883K419r84N334l335M59N076P490R417N008Q51j137k119
10523A17113l029J681m863r797m154K071K330q54P077J1788J229J418K081l776
10509A20315j123p499j940O401O78p529r354m809O54n251m418J38O604K209j631
$$ y = [387343, 366612, 347685, 324028, 314215, 301888, 298360, 293936, 281600, 268627, 251999, 239225, 229897, 215455, 199271, 193677, 189481, 185547, 181030, 175136, 169882, 167935, 155874, 144015, 144103, 141828, 134015, 126118, 117837, 114716, 109073, 106368, 103379, 101602, 103247, 105476, 96901, 89733, 85531, 80407, 76514, 73378, 70748, 73196, 74299, 80911, 85644, 79057, 77297, 80576, 82089, 81307, 75476, 71907, 71179, 72736, 78121, 78052, 75711, 75197, 80631, 80630, 85846, 83557, 77691, 83509, 93502, 92469, 89702, 88688, 92651, 89106, 86314, 90517, 88634, 91053, 90069, 95403, 92068, 92527, 97603, 105093, 114510, 119518, 120369, 119232, 117113, 114084, 115765, 110902, 101105, 96951, 99022, 101352, 100498, 107575, 119363, 120592, 122010, 124091, 120315, 119192, 111693, 109753, 116154, 116832, 109303, 99949, 95140, 95794, 90543, 86125, 86263, 92867, 95076, 93445]
10494I3445J225m094n016j588J2204N642m080m254O487J6074J3401Q307R318Q915
10480A55986J6417K4814Q350J5822Q091M544j716r046J634o750q817j2224k714
10467A94391n312n336j623k655r343j1543l640o323l99k171p625j1187j2043l472
10453A11719L10j146N115L777N248J0746L909J090J0161P251K927P87j308j745
10439A58841n52l27k133q308k477L906r92L08o14n788j5P617K290O228O449j977
10423A62456K831K753K966j691L580j118r119n450q931j4840k1348j5121r440
10410H7528j0589o607j4336j0415j031L143j358P231R210M081n97R391J4331M738
10396I4720K53O875N026J813K327R884L021k704J065J0829J0481O285J0185L240
$$ y = [93445, 94670, 90576, 85560, 83972, 96176, 101818, 97738, 93484, 99971, 116045, 129446, 137753, 147071, 155986, 172403, 197217, 205567, 221389, 229480, 234024, 232308, 223262, 224896, 218146, 209329, 197105, 194391, 189079, 183743, 182120, 179465, 170122, 158579, 154939, 148616, 148217, 146046, 138421, 127234, 115191, 111719, 112029, 110883, 115998, 119775, 125023, 135769, 139678, 140768, 150929, 158180, 161107, 161894, 160586, 158841, 158289, 157962, 155829, 147521, 145044, 148950, 147958, 148266, 147652, 141864, 141849, 149466, 151756, 157984, 164433, 162456, 165287, 168040, 171006, 169315, 172895, 171777, 162658, 157208, 148277, 133437, 112089, 96968, 87528, 76939, 70332, 55996, 45581, 44550, 47693, 46335, 53566, 62776, 66857, 66260, 75651, 89982, 94720, 94973, 101848, 106874, 108687, 111014, 120898, 123919, 121215, 122280, 133109, 143590, 149875, 160060, 163300]
10382A63300O01P560k892m303L268J400K98k253l83j028q815P560O825K259P902
10367A81299Q14p772r270j0322J84K108Q352J4433J0109J3679J6825K2439M0952
10354B83830M3219M3743L4980K3742L4762L8577L5972K2898k767j5951l0848k2015
10342D90142j4544k6795m2677m6372k1870j2047k1669j5624J0372O370O087J6013
10330C27386K2349J8280K1488N350R281J8162J5933J9239J3269J1874J5950J5171
10318E13732Q770Q382J2801J7046J7870J4206J3975K0927J3714J3180J4775J1433
10306F80811L008K695l612o775k0911k9021k6723r609m12K894R705J6800K6775
10293F45625M4956O1341O5623P1989P5819O3752M3759N3619L9659J5728J1610
$$ y = [163300, 163901, 171461, 168569, 164266, 167534, 168934, 169232, 166979, 166596, 165568, 156753, 164313, 171138, 173397, 181299, 182113, 174341, 165071, 154749, 154933, 157041, 165393, 179826, 189935, 203614, 220439, 242878, 283830, 327049, 370792, 405772, 429514, 464276, 502853, 538825, 561723, 558956, 543005, 512157, 490142, 475598, 448803, 406126, 359754, 337884, 325837, 304168, 288544, 298916, 305286, 311373, 327386, 349735, 368015, 389503, 394853, 404134, 422296, 438229, 457468, 470737, 482611, 498561, 513732, 522502, 530884, 543685, 560731, 578601, 592807, 606782, 627709, 641423, 654603, 669378, 680811, 683819, 686514, 682902, 676127, 655216, 626195, 599472, 589863, 589451, 592345, 602050, 618850, 645625, 690581, 751922, 817545, 889534, 965353, 1029105, 1072864, 1126483, 1166142, 1181870, 1193480]
10282A193480P881J0779J8412J8883K5741K0266L4448N2299N5423N7099N9071
10271A553782P1376Q3496P8450Q0388P0143O8890P1484O9993P1470Q4126Q9007
10260B392605J01619J26773J44270J61116J96131K24399K53985K97779L41466
10251D240143M27616N34852O23684P20369Q43983J013220J172500J189702J178712
10242A1944781J295638J438476J488709J412208J543035J929840K464879L236547
10234B6754113M495503O687301J0029024J4355388J8378618K1418087K5330160
10227A27448194L0226808L2900013K7780464K0960113J8955244J3526279Q090953
10220B79888068l701093j1711248j8554491k7003427k5655882k4651147k2507637
$$ y = [1193480, 1201361, 1212140, 1230552, 1249435, 1275176, 1295442, 1329890, 1382189, 1437612, 1494711, 1553782, 1625158, 1708654, 1787104, 1867492, 1937635, 2006525, 2078009, 2148002, 2219472, 2303598, 2392605, 2494224, 2620997, 2765267, 2926383, 3122514, 3346913, 3600898, 3898677, 4240143, 4667759, 5202611, 5826295, 6546664, 7390647, 8403867, 9576367, 10766069, 11944781, 13240419, 14678895, 16167604, 17579812, 19122847, 21052687, 23517566, 26754113, 31249616, 37936917, 47965941, 62321329, 80699947, 102118034, 127448194, 157675002, 190575015, 218355479, 239315592, 258270836, 271797115, 279888068, 276186975, 264475727, 245921236, 218917809, 193261927, 168610780, 146103143]
10213A46103143k4361275k3363563j6196527j0438161p147388n277277m104298
10206E5214654l292675k725470k349570k127868k050902j974481j943943j906005
10198C6843740j887856j877622j795085j694592j552948j443463j343639j230953
10190B4017582j134674j052059r75092r19171q67682q07339p63619p27786o79240
10181A6090920o34126o00663n73030n37186m91466m63916m41631m06501l80170
10172A1562231l56535l33767l21391k97351k84862k73072k55732k57047k48835
10163H933639k44508k40956k32149k27481k16661k09044j93816j82550j75545
10154G010929j64045j56089j43984j26380j38405j44625j40277j40701j35593
$$ y = [146103143, 121741868, 98378305, 82181778, 71743617, 64596229, 59318952, 55214654, 51921979, 49196509, 46846939, 44719071, 42668169, 40693688, 38749745, 36843740, 34955884, 33078262, 31283177, 29588585, 28035637, 26592174, 25248535, 24017582, 22882908, 21830849, 20855757, 19936586, 19068904, 18261565, 17497946, 16770160, 16090920, 15456794, 14856131, 14283101, 13745915, 13254449, 12790533, 12348902, 11942401, 11562231, 11205696, 10871929, 10550538, 10253187, 9968325, 9695253, 9439521, 9182474, 8933639, 8689131, 8448175, 8216026, 7988545, 7771884, 7562840, 7369024, 7186474, 7010929, 6846884, 6690795, 6546811, 6420431, 6282026, 6137401, 5997124, 5856423, 5720830]
10145E720830j47290j57626j66140j62948j51100j53832j42264j43645j37846
10136D358139j17198j04531j03710r2946q6975r5622r9490q5760q3285r0528r8783
10125C299311r5563q7557p9742p4412p3245p2642o5470o7189o3268n6257n9174
10114B504792n6327n1663m4861n0237n3710m4320m1431n0005m4044m2149m6255
10103A979790m3339l8680k9585l2793k6973k4857k7539j9644l0716k8504m3554
10092A633606n7145o0415n9186m9801n5325m5858m2552l4339l0840j3990J461
10081A185616O917N625K095N563L487o001q224j3455l2288l3083l0582l7080m3597
10068A004993l8513l8261m4502m4864m1561l6128k9826l0447k7384k0303k1067
$$ y = [5720830, 5573540, 5415914, 5249774, 5086826, 4935726, 4781894, 4639630, 4495985, 4358139, 4240941, 4136410, 4032700, 3939754, 3852779, 3757157, 3657667, 3571907, 3488622, 3398094, 3299311, 3203748, 3116191, 3036449, 2962037, 2888792, 2816150, 2750680, 2683491, 2620223, 2563966, 2504792, 2448465, 2396802, 2351941, 2301704, 2247994, 2203674, 2162243, 2112238, 2068194, 2026045, 1979790, 1936451, 1897771, 1868186, 1835393, 1808420, 1783563, 1756024, 1736380, 1705664, 1677160, 1633606, 1576461, 1516046, 1456860, 1407059, 1351734, 1305876, 1263324, 1228985, 1198145, 1184155, 1185616, 1192533, 1198158, 1200253, 1205816, 1209303, 1203302, 1195078, 1181623, 1149335, 1116252, 1085670, 1048590, 1004993, 966480, 928219, 883717, 838853, 797292, 761164, 731338, 700891, 673507, 653204, 632137]
10057F32137j9820j1687j0741j7694q957o164j3346j4653j7525n384Q72j4403
10045D92635j4358q532p570n848l858m575l659p118n51L696l467r594j4041j7160
10031C96000k0384r352j9833j9274j3952j9344j2140q485N50M220j249k162J301
10018B75896J1237J0251k204k226P192o719j0417k634p181j1047m589p928k513
10005B47118o945p648l87m57m646n387n577J843L148K005R361J1352K184l48p01
9990B44915j861l332M575L720k211j2879q021L635N49r646j0039j121N280J169
9976B14733l646O38Q255J00M865J929j157N384o035N957L950N25l863k449r511
9961B19675k722M650Q716K374p283j6730n712o469m990l569j894n429k29R09O18
$$ y = [632137, 612317, 600630, 589889, 572195, 563238, 557074, 543728, 529075, 511550, 506166, 507038, 492635, 478277, 469745, 462175, 456327, 452469, 447894, 444235, 437117, 436566, 440262, 436795, 427201, 413160, 396000, 375616, 366264, 346431, 327157, 313205, 293861, 281721, 273236, 273786, 278006, 276757, 274595, 275896, 287133, 297384, 295180, 292954, 300146, 293427, 283010, 280376, 273195, 262148, 257559, 249631, 247118, 240173, 232525, 232138, 231681, 227035, 221648, 216071, 217914, 221062, 223067, 232428, 243780, 245964, 245616, 244915, 243054, 239722, 244297, 248017, 245806, 232927, 224906, 228541, 229090, 219444, 209405, 208284, 213564, 214733, 211087, 211725, 219980, 220080, 224945, 226874, 225717, 231101, 225066, 231023, 234973, 235498, 231635, 229186, 219675, 216953, 221603, 230319, 232693, 225410, 208680, 202968, 196499, 191509, 187940, 186046, 180617, 180388, 181297, 181915]
9946A81915m580o809m225l376j324j034l156r722r420o031j0144j6398k107Q79
9932A04468l182l804l174M380N769L243k328l712K183L634o071j754k174j2138
9918H5340q737j1491m066o082l448O159L862l25L190q02j151l752m388K544L945
9903F0798J512N501J845N63j537l426p510j093j914l153k912L853P194O731L187
9888F9639O82m98l802m402l227M245J548O361O48r54k079j369l079j06J63M282
9872F8052P715J086K71j354P61K211M178M3J476o712n201k378K842N738l832j954
9856G2942m689q151N843m283J072O953K140O774k831n284m79K386J097J172K096
9841G6758P818N607P157M213R672J1673P607J807J3462J2225J585J913Q646J4805
$$ y = [181915, 177335, 170526, 166301, 162925, 161601, 160567, 157411, 147689, 138269, 132238, 122094, 105696, 103589, 104468, 101286, 97482, 94308, 98688, 104457, 107700, 105372, 101660, 103843, 107477, 101406, 99652, 97478, 85340, 76603, 65112, 61046, 54964, 51516, 57675, 61537, 61212, 64402, 63600, 62449, 58697, 54309, 56853, 60798, 62310, 67811, 69656, 70219, 68682, 65256, 57746, 56653, 54739, 51586, 48674, 52527, 59721, 66452, 69639, 70321, 69823, 66021, 61619, 58392, 62637, 64185, 70546, 71194, 70240, 68161, 66792, 63713, 63607, 63770, 68052, 75767, 76853, 77124, 75770, 76531, 78742, 82920, 82963, 84439, 77727, 72526, 70148, 72990, 78728, 74896, 72942, 68253, 60102, 65945, 61662, 62734, 69687, 71827, 78601, 75770, 70486, 70007, 72393, 73490, 74662, 76758, 84576, 90183, 97340, 101553, 111225, 122898, 130505, 132312, 145774, 157999, 159584, 161497, 170143, 184948]
9827A84948K9771L6544M8104Q4652J10817J17975J41132J72658J89386J60090
9817A276077J15355R7534O8856M9404k1996p3495j19204j51631j41567j31436
9807I67897j21369j32268j19644q3437n3403k9212k1432j6538j6063q787r812
9796C55932j2064n320J40m361q205k880l894n403n182k975R976J0454M778M540
9782C35536M411J0326R948J1775J7654K2980J8067K5513K4494K8957M8973M8185
9770F06819N2451N8058P8206R6729J15853J43286J72378K14948K72227L19248
9760B130203L76893M13911M12594L78272L01893J81058L5387j34158k95014l87683
9750C413356l97827l69016l23617k67743k25806j87788j60354j37874j07134q4596
$$ y = [184948, 214719, 251263, 299367, 384019, 494836, 612811, 753943, 926601, 1115987, 1276077, 1391432, 1488966, 1557822, 1607226, 1585230, 1511735, 1392531, 1240900, 1099333, 967897, 846528, 714260, 594616, 511179, 457776, 428564, 407132, 390594, 374531, 365744, 355932, 343868, 338548, 338688, 334327, 326122, 323242, 319348, 313945, 308763, 305788, 315764, 326218, 330996, 335536, 339947, 350273, 360221, 371996, 389650, 412630, 430697, 456210, 480704, 509661, 558634, 606819, 659270, 717328, 795534, 892263, 1008116, 1151402, 1323780, 1538728, 1810955, 2130203, 2507096, 2921007, 3333601, 3711873, 4013766, 4194824, 4230211, 4096053, 3801039, 3413356, 3015529, 2646513, 2322896, 2055153, 1829347, 1641559, 1481205, 1343331, 1236197, 1151601]
9740A151601p7645o2863n6604n7240m6061m0729l7574m5958l3372k6561k9583
9729F37411k4957k8965k6488j7639k0227k1444k3386k2557j2133r613j3358j5304
9717D01340j2948p262M32K007J1894J842O513R305R123K104j1875j6463r439r583
9703C76990k484N234J2269o024j7169k3217k6453k5769k4721j7659j7243o708
9691B27046o132r672l793j0429r490l864J071q083p239k284K003j0640q812j0722
9677A38960L81P97l845j179m720k233J912j95q511n950j277o666m534K46k260
9662A00926j982n875J81n74k930K44p453n98k453l22P567j588q033N553J004j1206
9646G2461l253M692k866j482n433K04K532l439j583j0458m385p29N195m91n426
$$ y = [1151601, 1073956, 1011093, 954489, 897249, 851188, 810459, 772885, 726927, 693555, 666994, 637411, 612454, 583489, 557001, 539362, 519135, 497691, 474305, 451748, 439615, 430002, 416644, 401340, 388392, 381130, 381562, 383569, 395463, 397305, 403818, 413123, 422246, 424350, 412475, 396012, 386573, 376990, 374506, 379740, 392009, 385985, 368816, 345599, 319146, 293377, 268656, 250997, 233754, 227046, 220914, 211242, 207449, 197020, 187530, 183666, 184737, 176654, 169415, 167131, 169134, 158494, 149682, 138960, 139341, 140138, 136293, 135114, 130394, 128161, 130073, 129878, 121367, 115417, 114140, 107474, 102940, 103186, 100926, 98944, 93069, 93250, 92676, 89746, 89990, 82537, 81939, 79486, 79164, 86731, 85143, 77110, 82663, 83667, 72461, 69208, 73900, 71034, 69552, 64119, 64323, 66855, 63416, 61833, 51375, 46990, 46261, 51456, 50965, 45539]
9631D5539R02Q810N967p810j099Q21n523l488K031J731L554P54o052p795r16J187
9615C8613J399l85P84M7l665M75l215r63m217j847M951k075k048M271j839r443
9599B0843j332P038J600J836L624j692o142l71m100j085O17J686r84k926p61r86
9583A6865R46l309R13L948j542J033O279k599j022J478O58k860n540M126M0l010
9567A6404m242q32K819M446J95k376k071J209o291q526k527L705K01K352Q272
9552A2738M619m143J708K602k10J349J929m573K575m094k242O01J373j929k031
9537A0272q75j534l422j365M285O720k06n071k881m595j14J792K139K101m64L553
9521A0335K640r26j051l968m725p03Q58K384L898J473K790L185N971j213q347
$$ y = [45539, 46441, 55251, 61218, 53408, 52309, 53130, 47607, 44119, 46150, 47881, 51435, 52189, 46137, 38342, 37426, 38613, 40012, 39627, 40411, 40458, 36793, 37268, 34053, 33090, 28873, 27026, 31977, 29902, 27854, 32125, 30286, 20843, 19511, 26549, 28149, 29985, 33609, 31917, 25775, 25404, 21304, 20219, 20836, 22522, 21538, 18612, 17851, 16865, 17811, 14502, 15415, 19363, 17821, 18854, 25133, 22534, 21512, 22990, 23648, 20788, 15248, 19374, 19414, 16404, 12162, 11330, 14149, 18595, 18790, 16414, 14343, 15552, 9261, 735, -1792, 1913, 2114, 4466, 12738, 17357, 13214, 14922, 17524, 17314, 18663, 20592, 16019, 18594, 14500, 12258, 12859, 14232, 12303, 10272, 9397, 7863, 4441, 3076, 7361, 14081, 13875, 8804, 5923, 1328, 1214, 3006, 5145, 7246, 6782, 10335, 12975, 12049, 10998, 7030, 2305, 1602, 2460, 4844, 8742, 10215, 13005, 16190, 22161, 20948, 12601]
9506A2601l526j0643m146r68J0990L199M64j34j332K736k591l736K280Q549N110
9491A8853r42k85r535j283M83J067K231p69j15O924j419j648M138m488l672j988
9475G552K100K141o140q917L014m82L042Q584j703j4089p041J845L224O907R496
9460I533J658m778k495K00P33N21q59L840J449l225m588m365O349L517m922k817
9444b49m946P27O577N838m68m939L220O919l43k16k014j456m417l384n493L235
9428a409Q264L066p364j804o39l944L149J0262j310L6O261N82O37o425l319q254
9412b211j1998q83K877K116L628N240P704k9n219r370N444N633O40K667J956O793
9396A4988k555J836M065n905O47J926K203J622K842k31j138q500o670n12O64L875
$$ y = [12601, 9075, -1568, -5714, -6682, 4308, 7507, 7971, 7837, 6505, 9241, 6650, 2914, 5194, 13743, 18853, 17911, 17626, 8091, 6808, 7291, 8358, 10589, 9820, 9705, 16629, 15210, 13562, 17700, 13212, 9540, 7552, 9652, 11793, 5653, -3264, -250, -732, 2310, 10894, 9191, -4898, -11939, -10094, -6870, 37, 9533, 11191, 6413, 3918, 4118, 4851, 5372, 4513, 8353, 9802, 6577, 1989, -2376, 3973, 7490, 2568, -249, -5195, -4468, 2109, 7947, 7479, 2540, 5760, 12679, 12336, 12120, 10106, 8650, 4233, 849, -4644, -1409, 6855, 9921, 2557, 753, 114, -3830, -681, 9581, 8271, 8307, 14568, 15150, 15787, 9362, 6043, -2211, -14209, -15092, -12215, -10099, -6471, -1231, 6473, 6444, 1225, -8145, -2701, 2932, 3572, 6239, 8195, 14988, 12433, 14269, 18334, 12429, 13076, 15002, 17205, 18827, 21669, 21438, 20300, 11800, 5130, 4618, 5282, 9157]
9380I157l092n44O735O33N451L001j740q879J770J29k946q230R19P30j140J300
9364C254P058m510L849M228J308q382k603R752J402n948p533r761p64J1339N279
9349G968L802k976l017m521L344K555o000p927K969k089P779J0649m554m396K435
9334F021O719M17m37k020q381m084J334O35M902O206k167m759o783j090P25J778
9318i84j530m845M641m98j956J822N638L287m023K431J989m927J473R930L429
9303A5877k888l763r040j74J891j821J04k284K939o42m817k425J643R4k301k294
9287i901n79P093K666K770l990o438o06J0055O057l519l897m260j698P404J3022
9272A4179p55q132j892l343k728m186J173N257o893l630L818L975m219L547R34
$$ y = [9157, 6065, 5521, 12256, 12889, 18340, 21341, 19601, 10722, 12492, 12621, 9675, 1445, 2364, 3094, 1954, 3254, 10312, 5802, 9651, 13879, 15187, 6805, 4202, 13954, 15356, 9408, 1875, -7886, -8650, 2689, 7968, 11770, 8794, 5777, 1256, 4600, 7155, 1155, -6772, -3803, -5892, 1887, 12536, 7982, 3586, 6021, 12740, 13157, 12720, 10700, 2319, -1765, -431, 204, 5106, 11312, 9145, 4386, -2397, -3487, -2762, -984, -2514, -7359, -2718, -3216, -5172, -3350, 2288, 5575, 1552, 3983, 5972, 1045, 2518, 12448, 15877, 12989, 9226, 186, 12, 1903, 82, 186, -2098, 841, 199, -4618, -7043, -5400, -5306, -7607, -9901, -10480, -3387, -721, 2049, -1941, -8379, -8985, 1070, 7127, 3608, -289, -4549, -6247, 1157, 14179, 13424, 5292, 3400, 57, -2671, -6857, -5684, -427, -7320, -10950, -7132, -3157, -7376, -3829, -2895]
9257b895m79P562M145p99K465r286o426o326J563M914j301J0708R478k119l869
9242G335j624N276k089k482m616l415l944M630J007N206J751L184R383m14o126
9227A3062j978L421M619O950q213r832l141k388j725O237m224k491k050J814M46
9212E07Q89M900J860j3699L81N033L085m694L907O884l635o679j31P691J557l121
9196D735l943K52p03J818Q780L902k185j0013p87J842O58K880k442j119q8j798
9180A789L784K642K369p82m902O01j139K616Nk929j021r6K246k023J018m808j885
9163b515K476N121R387k816j287K91k522j099Q67j292L46j1180L822P945L063
9148A0607J995m966j0617q85j293J826j034n64j950J090O663J525m038N846P851
$$ y = [-2895, -3374, 4188, 8333, 7534, 9999, 713, -5713, -12039, -10476, -5562, -6863, 3845, 13323, 11204, 7335, 5711, 10987, 8898, 6416, 1800, -1615, -5559, -929, 78, 5284, 7035, 10219, 19602, 19188, 13062, 11084, 14505, 19124, 26074, 17861, 8029, 4888, 2500, 775, 7012, 2788, 297, -1753, 61, 507, 1396, 6296, 8156, -5543, -5162, -129, 2956, -1738, 2169, 9053, 5418, -1261, -1392, 6299, 7856, 4735, 792, 1044, 341, 2159, 10939, 14841, 12656, 2643, 1856, 3698, 4356, 7236, 4794, 3675, 3587, 1789, 5573, 8215, 10584, 9802, 4900, 5501, 4362, 6978, 6983, 4054, 3033, 2937, 5183, 3160, 4178, -630, -2515, -39, 5082, 14469, 11653, 10366, 10657, 8135, 7036, 7903, 6611, 6957, -4223, -401, 7544, 10607, 12602, 7636, -2981, -3866, -5159, -3333, -4367, -4931, -6881, -5791, 872, 2397, -1641, 4205, 12056]
9133A2056N689k583p220k068q0l379o419J020k240m718K9J377k679M147N617J0313
9117H862k380J200O883n095j6R54o573j289L823L504M5m640K644k590k178k222
9101I32j758l072l87j28J695M111j891J246Q121K525k099q092n321j930K40l294
9085i102l183K590M644P33J786K042j91M214J634J460M626k253q600j721K73m28
9069a476L43J122l604m165l573j713K01N741J2893o959o764Q513J795j3950r62
9054a2558J0405M906k427M320m994K208K85o122l711K366J0635O39Q072K459j892
9039A4591o172k549q064q285O33O719p56k560L71N84N057K42L257M347M380o174
9023E621p145m213K239P319J811J151K682J085l995j375k123l654O089M95O287
$$ y = [12056, 17745, 15162, 7942, 5874, 5794, 2415, -4004, -2984, -5224, -9942, -9913, -8536, -11215, -7068, -1451, 8862, 6482, 7682, 14565, 9470, 9454, 10408, 3835, 2546, 6369, 9873, 9918, 5278, 7922, 5332, 3154, 932, -826, -3898, -4285, -4413, -2718, 1393, -498, 748, 8869, 11394, 9295, 1203, -4118, -6048, -5808, -9102, -12285, -9695, -5051, -4318, -2532, -490, -681, 3533, 5167, 6627, 11253, 9000, 400, -1321, -1048, -1476, -1133, -11, -3615, -7780, -11353, -13066, -12865, -7124, 5769, -1190, -7954, 559, 2354, -11596, -12558, -2153, 2753, 326, 4646, -348, 1860, 2145, -3977, -7688, -5322, 5313, 5952, 14024, 16483, 14591, 8419, 5870, -2194, -10479, -9846, -3127, -3883, -6443, -6072, -5488, -431, -189, 3068, 7415, 11795, 5621, -1524, -5737, -3498, 3821, 5632, 6783, 9465, 10550, 6555, 5180, 3057, -597, 5492, 5987, 12274]
9008A2274j064r920l060O54o23J22o687J345L973K772M336L197J797M808N380
8993A9304k749j0101n737p41m267M145M916l75J199m870l032K055J686P834O692
8978A5959k864k764n765l19N938R98j0344K286j17O029M259k171M218o866m158
8963D319M07J349j0137J825K873N718L538q841o020K695Q908M715j0109j0259
8949i019O680N011q15L50K553L365k269j72n581k837n185k540L073j386r80o323
8933a6075K676R622O101L387K249o943l849P824Q877L91L171q577J804n554j0893
8918e789k099J827K379k361L331l276L449M419J632l442L199K991j479m23j492
8903B866J657O225k967p95J643l127n996Q66m11j377p50n60J189k292j722M129
$$ y = [12274, 11210, 1290, -1770, -1116, -1739, -1617, -8304, -6959, -2986, -214, 4122, 7319, 9116, 13924, 19304, 16555, 6454, 717, -24, -4291, -146, 4770, 4395, 5594, 724, -2308, -253, 1433, 9267, 15959, 13095, 10331, 4566, 4247, 10185, 11183, 839, 3125, 3008, 9037, 13296, 11125, 15343, 8477, 4319, 4726, 6075, -4062, -2237, 636, 6354, 9892, 1051, -4969, -2274, 6634, 11349, 1240, -9019, -2339, 2672, 1857, 2207, 4760, 8125, 5856, 5684, 103, -2734, -7919, -10459, -7386, -8772, -9752, -16075, -13399, -3777, 2324, 5711, 7960, 1017, -2832, 4992, 13869, 14260, 17431, 8854, 10658, 5104, -5789, -7888, -6061, -3682, -6043, -2712, -5988, -2539, 1880, 3512, 70, 3269, 6260, 4781, 4358, 2866, 4523, 10748, 7781, 6986, 8629, 5502, -494, 372, -39, -1416, -2166, -2726, -1537, -3829, -5551, -1422]
8887a422P332n512j329p58P743O256K662j373m709n200l92m451n370o395K184
8872a0734R483L765r91l695O57N552p01l931n58k619k286L820K342q61j009L106
8856A340l630K117M041L67o636o873m155M841j936q32J055O285N189R08K940k189
8840B832k376o177j19M154Q64P394K778K260p738l61P257L490r009r257l047j789
8824h844k493Q727Q416k439j324K329j953R47p318m188N237L380j994k626N950
8809A807Q206J660q627K10r43o46K156J003n451m196K743J976L575L524o816J947
8793B128M380M584L524N26j048m557n368j432J160m854J678P63l479N726K522
8778F253n206l519K197L388k608m330L718p497o238K100O85M083j411n082M413
$$ y = [-1422, 5910, 398, -931, -1689, 6054, 12310, 14972, 13599, 8890, 3690, 3298, -1153, -6523, -12918, -10734, -1251, 2514, 1523, -2172, -1515, 4037, 3336, -595, -1153, -3772, -6058, -2238, 104, -757, -1766, 1340, -2290, -173, 3868, 4235, -2401, -9274, -13429, -8588, -10524, -11356, -10301, -4016, 1173, 2081, 5021, 2832, 456, -5721, -5840, -1686, -822, 6572, 9350, 11610, 3872, 3511, 10768, 14258, 5249, -4008, -7055, -8844, -11337, -2610, 5806, 3367, 2043, 4372, 2419, 3366, -3952, -8140, -2903, 477, -1517, -4143, 1807, 10013, 11673, 3046, 3256, 2313, 1667, 3823, 4826, -625, -4821, -2078, -102, 3473, 6997, 181, 2128, 6508, 11092, 14616, 15142, 14094, 9537, 4169, 2737, 3897, -957, 721, 1484, -1995, 3731, 6253, 1047, -2472, -275, 3113, 505, -3825, -107, -7604, -13842, -11742, -11057, -6974, -8385, -13467, -9054]
8763i054J90L381o14l169J633K508L904M445l405K19m398K211Q180J393K903j098
8747I229k728l249m824k814K235J858J214m046j372J713L264O060r442m228P064
8732f6k821j576o508J821N554L671K07n902m382m781M214L902M394J2680k621
8717G786q957K57l443m12l79L080n953J088M270L960N535J007j741L136L046k834
8701I446m744K638m589m989M081o34p448k078M312P853J595J817J432l647k988
8686B057m231K616P908M559L835N999l955o448J423K854j2810r388k793k233O008
8671d599Q63L805L661N609P830k842o018o095l329M654J3354k393l154N783K527
8656A9656r17q028m809J0382k510k682N096k78m094K609k979K862q956o954J69
$$ y = [-9054, -8864, -5483, -6097, -9266, -7633, -5125, -1221, 3224, -181, 38, -4360, -2149, 6031, 7424, 10327, 9229, 6501, 3252, -1572, -4386, -2151, -293, 921, -3125, -4497, -2784, 480, 6540, -2902, -7130, -66, -2887, -4463, -10971, -9150, -3596, 75, 282, -5620, -10002, -14783, -10569, -6667, -2273, 10407, 7786, -1171, -914, -4357, -4769, -5148, -2068, -8021, -6933, -2663, 1297, 6832, 7839, 6098, 9234, 12280, 9446, 4702, 7340, 2751, -2238, 1843, 1209, -6239, -8317, -4005, 3848, 5443, 7260, 8692, 5045, 2057, -2174, 442, 8350, 12909, 16744, 22743, 18788, 12340, 13763, 16617, 3807, -5581, -8374, -10607, -4599, -3736, 69, 3730, 9339, 17169, 14327, 8309, 2214, -1115, 3539, 16893, 14500, 11346, 17129, 19656, 18739, 10711, 5902, 16284, 13774, 11092, 16188, 15910, 11816, 14425, 11446, 14308, 5352, -1602, -1433]
8641a433L39N676j535p455J081K781q77n254j49j923m559j209O744J1138K134
8626E499k436j957J134k223o140M7L443N412k188J465O432j625k747M18L3k961
8610A606p672Q581N438j105K931L7J69r20o34L566j01r511n979O819O206n507
8594C924K670L124o939k751K340R894K691Q794J491l108J383p64j0205k620r52
8579H972l826J710M884J1830l875j0211M548K43n650J162M032N41K350O640p25
8564B2625L66M480q487m130j096p442M184Q654J4962L686J16K118J641N46P704
8549D9927K209j213M590M683M61m506n47j0122j1507r511k633N524K315K315O317
8534C8302M525m438j242j379l533N234R742n46m471N76n464p944K934k667m068
$$ y = [-1433, -1094, 4582, 3047, -4408, -3327, -546, -1423, -6677, -6826, -8749, -13308, -14517, -7773, 3365, 5499, 3063, 1106, 2240, 17, -6123, -6076, -2633, 2779, 591, 2056, 8488, 6863, 4116, 4534, 4567, 1606, -6066, 2515, 7953, 6848, 9779, 9816, 9985, 9065, 8431, 11997, 11896, 2385, -3594, 3225, 9431, 3924, 6594, 9718, 2779, 28, 2368, 12262, 14953, 23747, 25238, 22130, 23513, 22749, 12544, 9924, 8972, 5146, 6856, 11740, 23570, 19695, 9484, 14032, 14275, 8625, 9787, 13819, 14360, 16710, 23350, 22625, 22991, 27471, 18984, 14854, 13758, 6316, 10500, 19154, 34116, 37802, 37918, 40036, 41677, 42223, 49927, 52136, 50923, 55513, 60196, 60657, 56151, 55604, 45482, 33975, 24464, 21831, 27355, 29670, 31985, 38302, 42827, 38389, 37147, 35768, 32235, 37469, 47211, 46665, 42194, 42770, 37306, 29362, 32296, 29629, 25561]
8519B5561M166j425n935l37o37J640j786L663l997n834k280N02K89j097L838R07
8503A7238k637l562N602L686j0403m096P276n63K42j060p17l297N889J0543L229
8488B7370R65j260K48R06K446k99R080M451k659j6596j3850r249k876P22O461
8473E860M004q124L285J618j1159k312O568L605K00Q464j731k432K888J116n92
8458A1258n100n319K166N686J998J960n121m723o851K640R41M334M21J652P004
8443A2946k25p765j712l37j025M915m894l544J558K324OK061j76k276k038j054
8427a236j015J784j665r38R84J0368J560l468O74J274p157N773J0674r89m636
8412A1987l00k780j896J034l286k900j554q05m565L847P642k822k249J639m094
$$ y = [25561, 29727, 28302, 22367, 22030, 21393, 23033, 21247, 24910, 20913, 15079, 12799, 13301, 13590, 12493, 16331, 17238, 14601, 11039, 16641, 20327, 9924, 5828, 13104, 12541, 12783, 11723, 11006, 7709, 13598, 24141, 27370, 28335, 27075, 27323, 28229, 30675, 30376, 39456, 43907, 41248, 24652, 10802, 1553, -1323, -601, 5860, 9864, 1740, 5025, 6643, -4516, -6828, -260, 3345, 3545, 12009, 10278, 7846, 10734, 11850, 11258, 6158, 839, 3005, 8691, 10689, 12649, 7528, 2805, -4046, -1406, -465, 3869, 4290, 5942, 12946, 12721, 4956, 3244, 2907, 1882, 6797, 1903, -1641, -83, 2241, 2247, 4308, 4132, 1856, -182, -1236, -2251, -467, -2132, -3070, -2086, 8282, 9842, 6374, 7048, 8322, 1165, 6938, 17612, 16623, 11987, 11687, 8907, 7011, 8045, 4759, 1859, 305, -500, -5065, -1218, 6424, 3602, 1353, 2992, -1102]
8397a102o362j412O289l230l327o10P503P090O271j865n041m34L161k809O2m774
8381e90J1K177O277n107j0420m587K916J890O710l47K557M959M460Qo582k325
8365B007K130R17r589l251l31j676K391M398L589L449N495m519o28p129n007j446
8349i200M877M512m619k479K620N9L374J407J871O48l776n573N52Q987L055k229
8333D086j331m02j711o643P02Q309N574N789K725j0433q608l335P861Q432l725
8318G290k443K916m127l425m050M269N731m006n862Q343K790J0490m03k376k528
8303A2609l200r883J586J644L506k459k801o77l506n102r78P710J855O313N416
8288A2033l394j3207o065O18P853L432m93L315j174l098j246k257J731N230N175
$$ y = [-1102, -7464, -8876, -2587, -5817, -9144, -9754, -2251, 4839, 11110, 9245, 4204, 3770, 6931, 4122, 4184, -590, -579, 1598, 7875, 2768, -7652, -12239, -9323, -7433, -723, -1070, 1487, 6446, 10906, 10914, 4332, 2007, 4137, 5054, -4535, -7786, -8117, -9793, -7402, -3004, 585, 4034, 9529, 5010, 4382, -2747, -7754, -9200, -4323, 189, -4430, -6909, -4289, -4230, -856, 551, 2422, 3070, -706, -6279, -5727, 3260, 6315, 4086, 2755, 2353, 642, -6001, -5299, 3010, 8584, 14373, 17098, 6665, -1943, -5278, 2583, 11015, 7290, 4847, 7763, 3636, 211, -3839, 430, 6161, 2155, -3707, 4636, 7426, 17916, 17513, 15137, 12609, 9409, -474, 1112, 2756, 6262, 3803, 1002, 325, -3181, -8283, -9261, -1551, 304, 6617, 12033, 8639, -4568, -10633, -10015, -2162, 1270, 777, 4092, 2918, -180, -1426, -3683, -1952, 3278, 8453]
8273H453K252p723l885l461k607J831q43L262r2Q123J873l439l850l761k829N69
8257f127o31N719J1749K165r313j2498j526K019J953K788R258Q804j147m282K133
8242A1064p1o077k732k375J322N808r686n929j258m960J085L862Q123O06o490
8227g708l69O968L757p230L007Q738k408p446n797K912O845M819O83M224L742
8212A4737q313p351p81O664p242l262N069K607L781N91M787L77k126L075m21m663
8196G529K330j822m621m092k478n912l864J4850J0686n206p200M838M785L69n128
8181E064k185K537j223q88J88K607j703M956J507k519j61o048N423K996q577j1013
8165i039Q018O422K30K161j784N44j004l249k105N708J334j413n308r066n11J325
$$ y = [8453, 10705, 2982, -903, -4364, -6971, -5140, -5983, -2721, -2813, 5310, 7183, 3744, -106, -3867, -6696, -6127, -6758, -1039, 10710, 12875, 3562, -8936, -10462, -8443, -6490, -3702, 5556, 14360, 13213, 8931, 11064, 10993, 4916, 2184, -191, 1131, 6939, -2747, -8676, -9934, -14894, -13809, -9947, -1824, -1218, -7708, -8077, -1109, 2648, -4582, -1575, 7163, 4755, -2691, -8488, -5576, 1269, 6088, 6771, 10995, 14737, 6424, -927, -1708, 4956, -2286, -5548, -479, 2128, 5909, 6500, 11287, 11664, 9538, 12613, 12192, 7529, 9859, 8037, 3416, -676, -3154, -9066, -12930, 1920, 12606, 7400, 200, 5038, 9823, 10192, 5064, 2879, 5416, 4193, 3305, 3493, 6100, 4397, 9353, 10860, 8341, 8180, 2132, 7555, 10551, 1974, -9039, -1021, 5401, 5631, 7792, 6008, 6552, 5548, 2299, 194, 5902, 7236, 5823, 515, -8551, -9062, -7737]
8149g737M548N83M053j201J126n95j794l600j033l9L507k544O338J039l414j801
8133b564M914l566m542R41K078J316Q84N792J196l141n808P277K221l143R70l027
8117A798p95K344N084J41o690n827J1805L134q365k304p331N678K035j381j810
8102b484J63J856j583k295j644K351R79L489n414o428K532N337J670L966Q95J127
8086D517l709q855l063J0232N376M832j31j273k045N054o106J45J1381m790J117
8071A2682M738l41q440l642j792J612P384K73o551J764K458l095j481m411k998
8056a840j506K431R73M367N429m939j3K334K225p387m560L313k209k284J249Q664
8040F247M109n365m806j704J723n40K23K660j535R38M598m550N50j315m065J859
$$ y = [-7737, -3189, -2606, 1447, 246, 1372, 777, -1017, -4617, -5650, -5689, -2182, -4726, 1612, 2651, -763, -2564, 2350, -1216, -5758, -4817, -2739, -1423, -539, 5253, 6449, 3308, -2500, 4777, 6998, 3855, 4825, 1798, 1003, 3347, 8431, 8572, 1882, -3945, 7860, 10994, 2629, 325, -7006, -1328, 707, -674, -2484, -2321, -465, -2048, -4343, -5987, -3636, -2657, 832, -4582, -11010, -8478, -3141, -1471, 2495, 3390, 4517, 808, -8047, -11110, -878, 4498, 9330, 9199, 7926, 5881, 10935, 4829, 4974, 16355, 11565, 12682, 17420, 17079, 8639, 4997, 3205, 4817, 12201, 12474, 5923, 7687, 10145, 7050, 5569, 1158, -1840, -3346, -915, 58, 4425, 9854, 4915, 4902, 7236, 9461, 2074, -2486, 827, -1382, -3666, -2417, 6247, 10356, 4991, 185, -1519, 204, -336, -113, 2547, 1012, 1950, 6548, 1998, 2548, 1233, -2832, -973]
8024i73N174O584P44l145n934l516J333J503k439M541J925j2338m900R578N091
8009C228P167q46n714p954L05r10j569P105K943N837j945N87J642k884m936L436
7993E492o431r893O530P584N425N449l155M621J438l222R83m022J163L661j094
7978A4529m033K447M426l66j0437j0781J26R132N878k180l712j031J157J575L690
7963A0420m894Q47M324O521n25k583m902l989L042M936L90m774n48N178m921n826
7947B696O329J959l914P11N789n42m321N168k010j861J405R75J773k078l156l033
7931E890k328l239Q853M587l932j832M9k968l788Q68N029N295m406k492q21K474
7915G239r26k513l75n85N892P550k007o781k801l09J1191N383j375o930l011P12
$$ y = [-973, 4201, 10785, 11529, 8384, 2450, -1066, 267, 1770, -669, 3872, 5797, -6541, -11441, -1863, 3228, 10395, 9549, 3835, -4119, -3814, -4724, -6293, 812, 3755, 9592, 7647, 8234, 9876, 6992, 2056, 5492, -939, -10832, -4302, 3282, 8707, 14156, 11001, 15622, 17060, 13838, 14821, 10799, 11962, 15623, 14529, 10496, 12943, 17369, 17003, 6566, -4215, -4089, 5043, 10921, 8741, 5029, 3998, 5155, 6730, 10420, 5526, 6373, 10697, 17218, 16693, 14110, 9208, 5219, 8261, 13197, 13587, 8813, 8265, 13443, 8522, 2696, 9025, 10984, 7070, 7781, 13570, 13028, 8707, 13875, 11865, 10004, 11409, 12384, 14157, 12079, 8923, 5890, 3562, 323, 9176, 13763, 9831, 7999, 8048, 5080, 1292, 2160, 7189, 12484, 8078, 5586, 4765, 7239, 6313, 3800, 3425, 2840, 8732, 16282, 14275, 7494, 4693, 4384, 15575, 20958, 19583, 12653, 9642, 10354]
7899A0354K233o4J06K72J611J190k680l828K833K504K924o82l265k958M301R13
7883A5764J077K934K701n184m535o342n009r73P427J926m69l332k083O24O678
7868A1204P05j2360p14k98L158K73O113k33J687l05k779J462k839J194N943j36
7852A2075m012J803j946J262K749o40n94K518j990n767m309l587P588J0068k111
7837A3107j795r82j279p450l213m879K250P960m565n785Q680l124J76J268J918
7822B287K124K154l518k710Q49P569K41m887p567K928L103K631K333N107k981
7807I663K06K915l344L839m421j369m915j066l122O520K575n161k995r72Q017
7792F370L526j226R48p608l072R375M878l476m450n523o898J245J716l070L65
$$ y = [10354, 12587, 12523, 12629, 12901, 14512, 15702, 13022, 9194, 12027, 14531, 17455, 16773, 13508, 10550, 14851, 15764, 16841, 19775, 22476, 17292, 12757, 6415, 1406, 433, 7860, 9786, 9317, 5985, 3902, 4526, 11204, 11909, -451, -1165, -1463, 1695, 1968, 8081, 7848, 9535, 9230, 6451, 7913, 5074, 6268, 12211, 12075, 8063, 9866, 7920, 9182, 11931, 11291, 10697, 13215, 11225, 5458, 1149, -2438, 5150, 15218, 13107, 11312, 10330, 9051, 1601, -1612, -6491, -4241, 3719, -846, -6631, 2049, -1075, -899, 369, 2287, 4411, 6565, 3047, 337, 1186, 8755, 8996, 4109, -3458, -530, 2573, 5204, 7537, 12644, 9663, 9869, 12784, 9440, 13279, 8858, 7489, 2574, 1508, -1614, 4906, 7481, 2320, -675, -1647, 6370, 9896, 8670, 9618, 2010, -1062, 8313, 13191, 9715, 5265, -258, -7156, -5911, -4195, -7265, -6900]
7777f900J440R377j412p511k293M107J135K52N085J717m727k580K264o108L900
7762b254L499J2186K124m789O13q839r435K53N392N899N113n042n533N391l035
7747A543p14k488L697J983m201j053l532k674j703M365N492K37q221j0016P70
7732a6515P270R805O635m87r299n146o133J684N49l359N528m383K497J0252K410
7717A308m272l976j497O16R73l534k77K462J910q4j658k686K492Q942K884j391
7701B212m008L227M660l187k621l034L281L303q43L637O055l941q520p715K311
7686e183M345P42K08n364q90lK711L700J969J911q365k236N285k292M617P626
7670H781K410m773j298j93R12r6q47P887J017l753Q86o685k524J140k489j284
$$ y = [-6900, -5460, 3917, 2505, -5006, -7299, -3192, -2057, -1805, 3280, 4997, 270, -2310, -46, -6154, -2254, 1245, 13431, 15555, 10766, 11379, 2540, -6895, -6642, -1250, 4649, 9762, 4720, -813, 4578, 1543, 829, -1659, 2038, 4021, -180, -1233, -4765, -7439, -9142, -4777, 715, 952, -7269, -17285, -16515, -9245, 560, 7195, 6708, -2591, -7737, -13870, -12186, -11637, -14996, -9468, -13851, -11354, -1102, 1308, -2964, -6940, -8437, -7821, -6848, -10382, -10659, -8197, -6287, -6371, -8029, -10715, -8223, 719, 3603, 2212, -1796, 1431, 6091, 2904, 283, -2751, 530, 3833, 2990, 6627, 12682, 8741, 221, -7494, -5183, -838, -96, 112, -5252, -6142, -6145, -3434, 266, 2235, 4146, -4219, -6455, -1170, -3462, 1155, 8781, 11191, 6418, 5120, 4927, 5839, 5743, 4896, 12783, 13800, 10047, 10933, 4248, 1724, 2864, 375, -909]
7654i09J278l47J355l882n934N181L966k249n748L857R13j46p76M354k94k540
7638a921K623J865l734K100N28P09j67l80k408J849K227N518K747m872j1154k804
7622g274K092J629n17Q224J781J469o038p53R04n483J112O204P07l175j746M58
7606d06o87J456l500j032k052L869J228L45J301l380p305l943P515P004k367j629
7590c583o481j233M112K149q93m495o070R57R748K870q894l143M147R756Q11O97
7574D55j035o488K195K134O91Q39m002r174J561J340M767O47K711J574l187K005
7558b967J256R20O914J229o080k389M350K102k952l087r945n51L689L104N333
7543I26l769J740O166J197l231j471R07l082L409o96m165q709n085M573P497m828
$$ y = [-909, 369, 22, 1377, -2505, -8439, -3258, 708, -1541, -7289, -3432, -2519, -2665, -3441, 913, 619, -1921, 702, 2567, -1167, 933, 1461, 2170, 2003, 1623, -785, 1064, 3291, 8809, 11556, 6684, -4470, -7274, -5182, -3553, -4070, 4154, 5935, 7404, 1366, 613, 1517, -3966, -2854, 3350, 4057, 882, -864, -406, -1093, 363, -3137, -4169, -6221, -2352, -1124, -779, 522, -2858, -10163, -14106, -6591, 413, -1954, -3583, -10064, -11297, -7185, -5036, -5929, -10424, -16494, -15537, -5789, -2919, -11813, -14956, -10809, -1053, -242, 455, -580, -7068, -4873, -2739, -2048, -1209, -5211, -14385, -12824, -11484, -6717, -6070, -3359, -1785, -4972, -2967, -1711, -791, 6123, 7352, 1272, -1117, 3233, 5335, 2383, -704, -10649, -11200, -7511, -4407, 926, -2843, -1103, 5063, 6260, 3029, 1558, 2465, -617, 2792, 2096, -2069, -10778, -15863, -11290, -3793, -8621]
7527h621k600k402Q717K976K34k442J432n638l237Q89N248K882P603Q244n156
7512H129k018l733j518P735o95p884j0276l290K816O173K176j45j609k356M54
7497f041m94J434K265O245K555k907o956n794L038O767l911k563J260o340l0K025
7481i447J0041l57k78M596n434n786l190J738M003j464l454L83n092K244J580
7466i917N841Q896m365K387N274l691q673Q28Q116L390j527k032K358k708M284
7451H461J838k928j0763k789k219k695k054K636N34j576K897L718p534L314O477
7436b683r607r695L913J1233L417j866j81m779K159k806M607O660l322K352l811
7421d409o643L296N094J650M4O61l462l958M215J5050K115m68r645k932K670o739
$$ y = [-8621, -11221, -13623, -4906, -1930, -1696, -4138, -2706, -8344, -11581, -10692, -5444, -2562, 5041, 13285, 8129, 6111, 2378, 860, 8595, 7900, 16, -10260, -13550, -10734, -4561, -2385, -2530, -4139, -6495, -6041, -6535, -5101, -2836, 3409, 5964, 3057, -3899, -9693, -6655, 112, -3799, -6362, -5102, -11442, -11472, -9447, 594, 237, -41, 4555, -879, -6665, -9855, -8117, -4114, -5578, -9032, -8649, -13741, -11497, -9917, -4076, 4820, 455, 2842, 8116, 4425, -4248, -3420, 4696, 8086, 6559, 4527, 6885, 4177, 8461, 10299, 7371, -3392, -6181, -8400, -11095, -13149, -10513, -9979, -11555, -8658, -4940, -12474, -9160, -2683, -12290, -21985, -18072, -6839, -3422, -5288, -5469, -10248, -8089, -10895, -6288, 372, -2950, -598, -4409, -11052, -7756, -2662, -1012, -968, -307, -3769, -7727, -3512, 11538, 13653, 13185, 3540, 608, 3278, -3461]
7405c461m577O901J052J483K353p8J481O56p385l401j994J473L218l814L33j005
7389f765m987k951R583R940k989l804j508P30K790O179J247K498j961n918n81
7374A503k061k912k389P02P62L110N615J063o84l462N92L46k938m450K821N240
7358B858j891j129j038L652j254o591L220M689q26l045L6J050L946j307K841m034
7342A177L39j383M233K83n132l526L08k618J54p16P289R17Q10J189L295k691m579
7325f51o499K391j431l91Q54K820o138q171K958J0004K716n64n28K691O838k011
7309D888o849j044K526K939J657n558n413Q619J3489j699r5j471j145n431l160
7294B253K140q64k457l640J19j831M393K17K043K583o354l762l908J290N737l984
$$ y = [-3461, -8038, -1137, -85, 1398, 3751, 3673, 5154, 5810, -1575, -4976, -6970, -5497, -2279, -6093, -5760, -6765, -11752, -14703, -5120, 4820, 1831, -1973, -3481, -2751, 39, 6218, 7465, 9963, 8002, 2084, 1503, -558, -3470, -5859, -5157, -4395, -1285, 4330, 5393, 4709, 1247, 1839, 2185, -753, -5203, -2382, 2858, 967, -162, -1200, 2452, 1198, -5393, -2173, 2516, 1690, -1355, -1319, -269, 3677, 2370, 5211, 1177, 1516, 133, 4366, 4649, -483, -4009, -3701, -6319, -6165, -6881, 408, 1325, 2135, 3324, 6619, 3928, -651, -7150, -4759, -6190, -6581, -5727, -2907, -9045, -17216, -14258, -4254, -1538, -2102, -2630, 61, 6899, 4888, -1961, -3005, -479, 2460, 4117, -1441, -6854, 1765, 15254, 13555, 13460, 11989, 10844, 5413, 2253, 4393, 3529, 1072, -2568, -2449, -4280, 113, 330, 2373, 4956, -1398, -5160, -9068, -7778, -2041, -6025]
7278f025l293N030N799P87p57l200j945O737l828j120M036N884Q88J219o771m663
7262a222k199J146l280O332J294m680k887m95K968m288m988P37K414N203M102
7247A57j290n08M246N999m639p463Q92k557J66m115K833J451J384n65L128k083
7231b964r97J75J18M436J769r721l615J140K303O810O451l234L677Q94o71l788
7215B783l273J146R49P75j079K56l907l717R238J177o084j882l807J201J566k181
7199f839r66p92J022M787J808o145l701K318K338n446L832l97N01l160L521M514
7183b805N659j459l64j712m768m558M076P121J131k714p110J083M330L993M837
7168F740k935n351l913M906O40o34K480K547J435j37J002l242n799O5L372R775
$$ y = [-6025, -9318, -4288, 1511, 2298, 1541, -1659, -3604, 3133, -695, -1815, 2221, 8105, 8993, 10212, 3441, -1222, -3421, -2275, -5555, 777, 2071, -2609, -5496, -5991, -3023, -7311, -12299, -11562, -9148, -3945, 157, -1133, -1641, 2605, 8604, 3965, -3498, -2606, -5163, -4997, -9112, -6279, -4828, -3444, -4009, -881, -2964, -3961, -3786, -3668, 768, 2537, -7184, -10799, -9659, -7356, -546, 5905, 2671, 6348, 7242, 6571, 2783, -490, 656, 1605, 2380, 1301, 1557, -2350, -6067, 3171, 4348, -1736, -3618, -7425, -6224, -4658, -6839, -7805, -8597, -7575, -2788, -980, -7125, -10826, -8508, -6170, -11616, -7784, -8181, -7680, -10840, -7319, -2805, 2854, 1395, 1031, -681, -5449, -10007, -5931, 1190, 2321, -393, -7503, -6420, -2090, 1903, 6740, 3805, -1546, -5459, -553, 87, -547, 1933, 4480, 5915, 5778, 6780, 3538, -2261, -2196, 1176, 10951]
7152A0951r690n925J2M881m154j769M101o654p480L156P623k234P38N005O51k273
7136c061K622J205O872j665o567M564j998l527m327j625K911O982p04j61J371
7121B892Q813J543m659o33R4k613k870j704L299O153j18J536L762N854r239l467
7105H643m267J149k8P893L496p416p180k234M035m430j306r11m482n93L786L110
7089g35N65o408k00n095K206k889L169K3M355j635L46n71j79n611q870k793R653
7072a4669O494k995L50J576L627R98K985L69j313j854k07J97j8m0l43M354J404
7055I15l966l588L630Q658R97K810J343m416o065p359m779l202R87J1582L207
7040G54m390O789K576m841j501L567M634K74l006n576r730p681j395L20j371O384
$$ y = [10951, 1261, -4664, -4652, 229, -3925, -5694, -1593, -8247, -15727, -12571, -4948, -7182, -6444, -1439, -788, -3061, -439, 766, 7638, 5973, -594, 3970, 1972, -1555, -5882, -7507, -4596, 2386, 1682, 1521, 2892, 11705, 13248, 8589, 7956, 8050, 5437, 2567, 863, 4162, 10315, 10197, 11733, 15495, 21349, 12110, 8643, 4376, 5525, 5497, 13390, 16886, 9470, 2290, 56, 4091, -339, -1645, -2556, -7038, -7631, -3845, -735, -170, -6578, -6778, -11873, -9667, -12556, -9387, -9364, -5009, -6644, -6298, -6869, -7048, -12659, -21529, -24322, -14669, -8175, -11170, -10820, -9244, -5617, -4619, -1634, -1265, -2578, -4432, -4639, -4442, -4460, -4500, -4843, -489, 915, -3051, -6639, -3009, 5649, 6646, 9456, 10799, 6383, 318, -7041, -11820, -15022, -14035, -2453, 754, -3636, 3153, 5729, 888, -613, 2954, 7588, 7862, 4856, -720, -10450, -18131, -19526, -19206, -20577, -14193]
7024a4193O949m685J576q62k667j424J1161R213M421m44N860J773j805j1627j0737
7009g491l576L433o74m695l436L765J2623N156L700J970j1773q674L033l257J84
6994i712O817Q045Q23l175r038l763l093q22p23R197L912o18K391N130k524j587
6978A260l51M14k625r14O396p23o57P086Q586q478o300q301l306l80J709J636
6962d948R70N298p151k612M09M632M265n178K80K79R877K108J403m634p249L128
6946H77M418M785o602n870q04P969L421p843l58M436K557m430o315J08p54j681
6930f086j187l151J698k461L363O694n470J512l225p69l78M191M026m618J456
6915d405N21K144L748J699P35K0K077k244k38p92n213p10k124j758J52k468M167
$$ y = [-14193, -7244, -11929, -10353, -11215, -13882, -15306, -4145, 5068, 9489, 9045, 14905, 16678, 14873, 3246, -7491, -11067, -7634, -8308, -13003, -16439, -12674, -51, 5105, 8805, 10775, -998, -9672, -6639, -9896, -9712, -2895, 5150, 5973, 2798, -6240, -10003, -13096, -13918, -14641, -5444, -1532, -2150, 241, 5371, 2847, 1260, 909, 1323, -1302, -2216, 4180, 3457, 2800, 9886, 18472, 9994, 3694, -4607, -7913, -8293, -6584, -4948, -3978, 1320, -5831, -8443, -8034, -3402, 863, -4315, -4035, -3756, 6121, 8229, 9632, 4998, -2251, 877, 5295, 10080, 3478, -2392, -3196, 4773, 8194, 351, -7, 4429, 6986, 2556, -3759, -3651, -4405, -6086, -7273, -10424, -8726, -11187, -7824, -1130, -6600, -5088, -8313, -9082, -9460, -5269, -1243, -5861, -4405, -3884, -1740, 2008, 3707, 4442, 4462, 6539, 4295, 4057, 3265, -1948, -2658, -4782, -6540, -6388, -8856, -4689]
6898d689O513R662J144o648n867o983j453n210J577R939M887R756j867j1189k254
6883b682K006Q29k097L700K323l111n11k007J392m967l180r21j843O457J798O939
6867D125O715R49k07l702j295o571J013J30l107j791J659L524M632j131n400J347
6851H90M464o880j2690q1O161J699r20L452P272m883n673J598K960j036M724P072
6835H129j627P18k636m682K573Q28l859J12J298K844l982l619q372l703L256R393
6819c329J513k666K586J836o562L066O604O933q57q765K966L048J102j947j028
6804D500l516k566L697R59m267n416k597L323N255j654m741Q88l043k060L845
6789g393J149N155J295j136m541k068k738J509M999k07l934k680P28J628R042
$$ y = [-4689, 1824, 11486, 12630, 5982, 115, -6868, -8321, -13531, -11954, -2015, 2872, 12628, 10761, -428, -2682, -676, 153, -1944, 1756, 4079, 968, 457, -1550, -158, -5125, -8305, -9226, -11069, -4612, -2814, 4125, 10840, 11789, 11582, 7880, 6585, 14, 1027, 1157, -1950, -3741, -2082, 1442, 6074, 4943, -457, 890, 5354, -1526, -14216, -14297, -8136, -6437, -7357, -3905, 3367, -1516, -7189, -5591, -2631, -3667, 1057, 8129, 6502, 7220, 4584, -98, 2475, 3303, -556, -444, 854, 3698, -284, -3903, -12275, -15978, -12722, -3329, -1816, -4482, -1896, -60, -6622, -3556, 3048, 9981, 9124, 359, 3325, 6373, 7475, 5528, 4500, 984, -1582, 2115, 3074, -1193, -6609, -9206, -5883, -628, -2282, -7023, -6135, -9178, -11238, -7393, -6244, -1089, 206, -930, -5471, -7539, -10277, -8768, -3769, -3976, -7910, -10590, -9862, -8234, 808]
6774H08M146R31l809p928o952L629J468l672K20L543M618J586n063M60N357j752
6758b410l705j511m490J827J920o3Q336K2k507j244l004m097J631J452L21J409
6742f113J393J975M646l66R9l732k985K741l158O527K341n706n192J271j694q0
6726h033P367q24k258j376j295K491M806J108L162m391k280j172J43L611o240
6711e181l088J305K189N653L513k319o88j621J142O202J560k416q962l72Q129
6696E046P908L529K648M471l071m025O096J38O84n531n403l911n662M679M567
6681A2163k787l431N166o81l343l986J304R113R98m470o784L362J911o494k332
6666b91P84k561J226O700Q40j331p156Q86Q599n37J857J682l738o879l118k465
$$ y = [808, 4954, 5885, 2076, -5852, -12804, -9175, -7707, -11379, -11159, -7616, -2998, -1412, -6475, -6015, -658, -2410, -6115, -7626, -12116, -10289, -8369, -8432, -96, -74, -2581, -3825, -6829, -10926, -9295, -7843, -7522, -6113, -4720, -2745, 1901, 1535, 1634, -2098, -5083, -2342, -5500, 1027, 3368, -2338, -7530, -6259, -7953, -8033, -666, -1490, -3748, -5124, -6419, -3928, 878, 1986, 5148, 757, -1523, -2695, -2552, 1059, -5181, -8269, -6964, -4775, 878, 4391, 2072, 1384, -237, 905, 7107, 8667, 6251, -2711, -3083, 5046, 12954, 16483, 19131, 23602, 20531, 16506, 22602, 22740, 23424, 17893, 12490, 8579, 2917, 7596, 12163, 9376, 5945, 11111, 10430, 7087, 3101, 4405, 13518, 14516, 10046, 3262, 6624, 8535, 2041, -291, 493, -2068, -842, 5858, 6698, 5367, -1789, -903, 7696, 7159, 9016, 10698, 6960, 81, -3037, -5502]
6650e502P86J711J621J339K878p9m877m229l936o233m32M702J053J030O639L181
6634c48J19j296J74L906k856j449K169M202m972N388j67n331J638L732j295m999
6618a385M132M983j74k479o04m459p666L117L13m496N354j416p858R138J2713
6603I213k591j0299q46j742q911P532M481O169K27M55n122l554R297L636q824
6588h79m950j130K776N117j525M964M600j735K230O80k459l776m636N132l324
6573A085n250N507k806l51M153O260M212J722k265j94k005q092j1536n089L556
6558a1093L542m616K467M227K736Q466K189j936j1235p278j940M00J3302O698
6544E929K591j204q069j514M957J889k829m71j892N911J977p64j681o181M051
$$ y = [-5502, -4716, -3005, -1384, -45, 2833, 2754, -2123, -6352, -10288, -16521, -16953, -12251, -11198, -10168, -3529, -348, -229, -1525, -1351, 2555, -301, -1750, 419, 4621, -351, 5037, 4870, -461, 1177, 4909, 3614, -1385, 2747, 7730, 7556, 5077, 4473, 14, -7652, -4535, -4222, -8718, -3364, -4780, -12638, -3500, 9213, 6622, -3677, -4523, -6265, -15176, -7644, -3163, 3006, 3233, 3688, -1434, -4988, 4309, 7945, -879, -5829, -6959, -4183, 934, -591, 4373, 8973, 7238, 9468, 10148, 7689, 3913, -723, 4409, 1085, -4165, 1342, -1464, -1815, 2338, 8598, 12810, 14532, 12267, 12073, 10068, 1976, -9560, -14649, -11093, -7551, -12167, -9700, -5473, -2737, 5729, 7918, 5982, -5253, -12531, -14471, -14071, -769, 5929, 8520, 7316, -753, -2267, 2690, 4579, 1750, 1279, -613, 5298, 7275, 6511, 4830, -1351, 2700]
6529B700Q286o831n117N916M974l579j20l264k748o673k218N858k357j852N148
6514a877M310K118j123k79j814r080N190O04l837K231N351j97j646k336l839k879
6498i103P334P82m19p24l001o516j199J886K589J1535K899j820K489N241K856
6483A4829q141M148j045k117j873M130K792m485p280k809K963k994R28p799q702
6468a7455K250M328N257P396L469j31n041q079Q67k074N961m48l293n525K555
6453i963J929M793M42l293K197L667m344J653j063J1639K237j4297n956J0537
6439A78M982L714J128l338q162O44L878M16m195m689k931k849Q382Q348m677j720
6423h91l249R74O110K315o437p575J667K485q121J3799O449p656r269J618L424
$$ y = [2700, 10986, 4155, -962, 4954, 9928, 6349, 6229, 2965, 217, -6456, -8674, -2816, -5173, -7025, -1877, 2433, 4551, 3428, 3149, 1335, -7745, -2555, -1951, -5788, -3557, 1794, 1597, -49, -2385, -6224, -9103, -1769, -987, -1406, -2130, -5131, -11647, -12846, -10960, -8371, 3164, 6063, 4243, 6732, 11973, 14829, 6688, 10836, 9791, 7674, 5801, 9931, 12723, 8238, 958, -1851, 1112, -1882, -954, -8753, -17455, -15205, -10877, -5620, 1776, 5245, 5114, 73, -8006, -7139, -9213, -3252, -3700, -6993, -12518, -9963, -8034, -3241, -2799, -6092, -3895, -228, -4572, -2919, -3982, 7657, 9894, -4403, -10359, 178, 5160, 8874, 10002, 6664, -1498, -854, 3024, 3440, -755, -5444, -8375, -11224, -2842, 5506, 829, -891, -4140, -3166, 2944, 5259, -1178, -8753, -7086, -4601, -12722, 1077, 7526, -130, -9399, -7781, -4357]
6408d357M396J278J679k8l951j974l137L468K928O460K72j320m426K85M22k689
6392f94k99K744q94j88J283m665j997K472M397l33J618J478l261K35o53N544P20
6375G507p35N532N303k574j0221r356o721K044M333j284J691K513L037J898J215
6360D182J963n272k37O943o431o41K448M538m003L717k450L427K739o779m507
6345c63o982J98K441M058l452n500Q443K873J2560K011q01k977j2786j145J661
6330B39M902J364j622k397o541j273j850j906M005N907N235j052R07l519j575
6315H24j668O078O704m370o039p417p549m309P479K08K552O768j842j350O110
6300B179K02k100o332K226K006J122K216o377L598J0007j264k43mJ355l242k703
$$ y = [-4357, 39, 1317, 2996, 2968, -983, -2957, -6094, -2626, 302, 6762, 7034, 5714, 1288, 1573, 1995, -694, -993, 1751, 857, 669, 1952, -2713, -4710, -2238, 2159, 1826, 3444, 4922, 1661, 1896, 1243, 6787, 7507, 6772, 12304, 17607, 15033, 4812, -4544, -11265, -9221, -4888, -6172, -4481, -1968, 1069, 2967, 4182, 6145, 873, 636, 7579, 1148, 507, 2955, 7493, 3490, 7207, 4757, 8184, 10923, 4144, -363, -7345, -7147, -4706, -648, -4100, -9600, -1157, 1716, 14276, 16287, 15486, 12509, -277, -1422, 239, 5141, 6505, 4883, 2486, -4055, -5328, -7178, -9084, -5079, 828, 6063, 5011, 5918, 2399, 824, -844, 5234, 11938, 7568, 1529, -5888, -13437, -17746, -10267, -10059, -7507, -739, -2581, -3931, 2179, 2381, 281, -6051, -3825, -1819, -697, 1519, -4858, -1260, 8747, 7483, 7240, 7236, 8591, 5349, 2646]
6284B646K333M981j828n127n674l873Q330n6o453k137l029m385J475P675N879
6269G57L405q9m557q4J57K504m497n180J32N377n029j297q100L065P148M740k150
6252c698m624K88j859o575N669M037M96K490M730K749M30J466m323n855J858k161
6236d882Q968K996K971l277M451L913p90k838j225j067l722m628j512j394J432
6221f04k254m506n993l354M820m251q257ON014J5909J0325l314o41r01k823J634
6205H10J304m372K053k565M612O102m523m171l012k932N70M048Q328P342l334
6190A0260j6445o50L143l506l414M883L361N387P45r38L97n040L88n55J652K023
6174A691o615k147K511M095L908k537m128M250R47l278o62k246K22l798k153M471
$$ y = [2646, 4979, 9960, 8132, 3005, -2669, -6542, 1788, 1732, -4721, -6858, -9887, -14272, -12797, -5122, 757, 4162, 4073, -484, -568, -411, 2093, -2404, -7584, -7452, -2075, -7104, -8401, -16501, -13436, -6288, -1548, -3698, -8322, -8034, -9893, -16468, -10799, -6762, -6266, -3776, 954, 3703, 4133, 5599, 1276, -4579, -2721, -4882, 4086, 7082, 10053, 6776, 11227, 15140, 14350, 11512, 10287, 9220, 5498, 870, -642, -2036, -604, -2858, -7364, -13357, -16711, -11891, -16142, -24399, -24393, -19379, -3470, 6855, 3541, 2900, 1999, -824, 810, 2114, -2258, -205, -2770, 1842, 7944, 3421, -750, -3762, -6694, -6124, -2076, 6252, 13594, 10260, -6185, -6835, -3692, -7198, -10612, -5729, -2368, 3019, 3764, 2826, 3223, -1817, -1429, -1984, -332, 1691, -4924, -7071, -4560, -465, 3443, 906, -3222, 1028, 1975, -1303, -1965, -4211, -3989, -7787, -9940, -5469]
6158e469R748R24K571j521r37J640m951L55L047o642n72Q632M226n701l630m846
6142c126n4m073l183N441O629P98o182k825n134L209R198N039j95j349K801m921
6126B073o834P06M971L747n66k217k786L07M955j580n39n774k635N347O55l767
6110c937p48K878L140j383l47j2j845n343N600K913J792j584q12l615m006m41
6094g750K051k43n44q339O36P336K347N94Q825j512n55o3m041J473L363Q83m129
6077C32o013n119O673Q606J473L89k159J835l36J31j32K729l516n471k79J023
6061A66o02j664J391K753N169j83o831m855k622K853j039N795m296j194m39q09
6045f407J327P766n399k644J176K616L888m812k288L905J423J373j316r776o441
$$ y = [-5469, 4279, 5203, 7774, 6253, 5316, 6956, 2005, 2360, 5407, -1235, -1807, 6825, 11051, 5350, 1720, -3126, -3180, -7253, -10436, -4995, 1634, 2432, -3750, -6575, -11709, -8500, 698, 5737, 5542, 4193, 6994, 2073, -4761, -4055, 916, 4663, 4097, 1880, -906, -599, 4356, 2776, 2237, -3537, -6172, -825, -170, -3937, -4685, -1807, 1333, -50, -397, -409, -2254, -7597, -1997, 916, 2708, 1124, 312, -3303, -7309, -7750, -5699, -5942, -6486, -14825, -14189, -6853, -4506, -3912, 4913, 3401, 2846, 2783, -1258, 215, 3578, 4461, 332, -5681, -10800, -4127, 4479, 5952, 6341, 4182, 6017, 5681, 5812, 5680, 8409, 4893, -578, -857, 166, -436, -2100, -709, 2044, 7213, 7030, 199, -4656, -7278, -4425, -5464, 331, -3965, -5159, -5598, -6407, -5080, 2686, -2713, -5357, -4181, -1565, 2323, -2489, -4777, -872, 551, 1924, 608, -9168, -15609]
6030a5609M417O273K257O94o804j065p57N71K602k375m666O405l719k066J451
6015a2391O480Q199J285n903p457J396l961J630J3231L365j645M174J999J12j711
6000H803o20L706l543k131L099m081l982p193m974L170N189p3l269L322L232M510
5984E165l10m966j420N200J378l130K077N42K064N251J621m985J099j1008J909
5969D87m035p234l504O981O263P904m903n328P387l040l129K532m902l693J908
5954f306N682O048K77K416p672j455k89m17N461j286n628l621o84K220j138m98
5938f890M84l606L55k279P271K439k97L504M515m020K733P503L06p756k325L101
5922E038K308n7j262j074L309l776j809L731o15n653K720K172m112m793m594L394
$$ y = [-15609, -11192, -4919, -2662, -1968, -8772, -9837, -10594, -10023, -7421, -9796, -14462, -8057, -11776, -13842, -12391, -5911, 2288, 3573, -2330, -9787, -8391, -12352, -10722, 2509, 5874, 4229, 8403, 10402, 10514, 8803, 8183, 11889, 8346, 6215, 9314, 5233, 1251, -5942, -10916, -7746, -2557, -2630, -5899, -2577, 655, 5165, 4855, -111, -1531, 3669, 5047, 1917, 3994, 4536, 6600, 11851, 13472, 8487, 9586, -1422, 487, -3548, -10782, -14286, -7305, -1042, 6862, 1959, -3369, 4018, 978, -2151, 381, -4521, -8214, -6306, -624, 5424, 5701, 8117, 445, -1010, -1299, -1716, 3745, 2459, -3169, -6790, -7474, -5254, -6392, -6890, -6406, -10012, -9657, -11936, -4665, -2226, -2523, 981, 5496, 1476, 4209, 11712, 12018, 4262, 1937, 5038, 7346, 7289, 6027, 4953, 8262, 4486, 2677, 6408, 5793, 140, 2860, 5032, 920, -3873, -8467, -5073]
5906e073L308K047k582m27J233J666O35m296j338k058K919M556m881L121j035
5891b205o708K672M517j779K992L426k873j331J310K722J74m079j380N371j286
5876A543m216l205L018O213L775q640K04l212r79k050p72M279N22N002j675k148
5860b341o420q115Q61J1040l20k709o85J740k649m15J401J918O306L375m850N85
5844a278Q69L648m626L437M212l078l410L04j302k00O846k889O866j343j0379
5829b323k249O512J571L033J197k080r96o229m234o258K053L853L023j13k193
5814e433n209K551N100L560m82N996j91p583q436p31M725N095M410M296l42o068
5798A258n704j213P468L767K996k906k373j121o308k940j275O228P269o474K021
$$ y = [-5073, -1765, 282, -2300, -2727, -1494, 172, 807, -3489, -4827, -6885, -3966, 590, -4291, -1170, -2205, -8913, -6241, -1724, -3503, -511, 2915, 42, -1289, 21, 2743, 2917, -1162, -2542, 2829, 1543, -2673, -5878, -2860, 3353, 7128, -1512, -1308, -4520, -5499, -7549, -8321, -4042, -3520, 1482, -193, -2341, -8761, -16876, -16015, -4975, -5295, -8004, -8689, -6949, -9598, -10013, -8612, -6694, -388, 2987, -1863, -1278, -409, 3239, -1387, 2050, 6262, 3184, -226, 78, -1224, -1424, 5422, 2533, 9399, 8056, -2323, -4572, 1940, 3511, 6544, 7741, 5661, 4665, -1564, -5798, -12056, -10003, -6150, -3127, -3240, -5433, -10642, -8091, -2991, 569, 87, 6083, 5892, -1691, -10127, -10858, -6133, -1038, 3372, 7668, 7326, 1258, -4446, -5659, 1809, 5576, 8572, 5666, 3293, 2172, -4136, -7076, -8351, -2123, 5146, -1328, 693]
5783F93N27l909m202l70J914M174M333m62q39R42N96p885m700K378m710j740M439
5766h821P471j362J091r15K134K68j128K341j114j324K08P99L018N648m912n118
5750a716k995k36O270Q370k691k553j301L082J279o21j0657m351M980k980q4M012
5734b192N246P921N096n378r412m299j19M405L68R41%k399j230j548j663M74j966
5717e755k849P316L885l933N9P032k047j865j0j126m642o709K469m90k453J041
5701a0077N495m93j2303m882L808J2095l67R85L723K555J113o425J895L067k420
5686b231n541n181J690Q446M194o08j856j492m764l205M708k17r03j744L033J941
5670c730R69L277j366j1773J446O953L257N036J272L593Q44n084k280l609N237
$$ y = [693, 1220, -2689, -6891, -7261, -5347, -1173, 3160, 2698, 1859, 2801, 3397, -4488, -9188, -6810, -11520, -13260, -8821, -1350, -2712, -1621, -2536, -402, -134, -1262, 1079, -35, -1359, -1151, -352, 2666, 8314, 3402, -1716, -4711, -4947, 1323, 9693, 7002, 4449, 3148, 6230, 7509, 6888, -3769, -8120, -3140, -6120, -6204, -2192, 3054, 10975, 16071, 10693, 1281, -3018, -3137, 1268, 1636, 2577, 2577, 178, -1052, -2600, -4263, -3789, -5755, -8604, -1288, 2597, -1336, -1277, 5755, 3708, 1843, 1833, 707, -3935, -10644, -8175, -8665, -11118, -10077, -4582, -5075, -17378, -22260, -18452, -6357, -6724, -5739, -2016, 539, 1652, -4773, -2878, 189, -2231, -7772, -12953, -11263, -2817, 1377, 769, -1087, -2579, -7343, -10548, -5840, -6057, -6960, -8704, -5671, -3730, -2761, 516, -850, -12623, -11177, -4224, -967, 4069, 5341, 8934, 9778, 4694, 2414, -1195, 4042]
5655D042J696n253J222l422m690K246m2R29Q43k250K232N05m087j85Q21K298J434
5638a661j306k529L165j262n490n33J880K605N87o67J588M172l559m153k02p74
5622h139L334k141J024q694j079O490M99j230J793M924P034K815l758m307m879
5607f314k669m511K220O598K887M193R87p124P08k800j05l767N57M719k435l68
5591g224l183J594N286O831o62N69r257K104R194J206p301m410L516k160j431
5576e328j978k53r73j116J3425P080j469K148K241j1619j659J669m497j366j638
5561e333m355K895Q221K486k303j516J430p16J109l362m317k391M803j730l679
5546h758O55o25o942J301k912n633K760M829J493j397L802j60J781N497n197n72
$$ y = [4042, 5738, 485, 1707, -1715, -6405, -4159, -4201, -3272, -2429, -4679, -2447, -1942, -6029, -6214, -5393, -3095, -1661, -2967, -5496, -2331, -3593, -9083, -9616, -7736, -5131, -4544, -5211, -3623, 549, -3010, -7163, -7365, -8139, -4805, -6946, -5922, -14616, -15695, -9205, -8706, -9936, -8143, -3219, 3815, 6630, 2872, -1435, -6314, -8983, -13494, -11274, -4676, -1789, 2404, 3391, -3733, -3025, -5825, -5930, -9697, -9140, -4421, -6856, -7224, -10407, -8813, -3527, 3304, 2642, 3211, -6046, -3942, 5252, 6458, -843, -5253, -1737, -3897, -5328, -7306, -7559, -8532, -9648, 3777, 10857, 9388, 11536, 13777, 2158, 499, 2168, -2329, -3695, -5333, -9688, -6793, 1428, 3914, 1611, 95, 1525, 809, 1918, -1444, -5761, -8152, -3349, -5079, -8758, -8103, -8728, -15670, -14369, -17281, -22914, -20154, -15325, -13832, -15229, -11427, -11587, -9806, -4309, -9506, -10078]
5530a0078Q16N161J0646l122k544N305J517j365l517q205K068j068p058k923N919
5515h448P385J090Q04J936N28K348L661K184m010k951J441K001o362l911j058
5500c362M783m260k561M040M327k377k676k508j587q73k029k933R28q16m429K952
5484a3381L792L735N554M153m934k965l631R45M093K426l02k6k306r957L462Q682
5468f60r77j210j288L497M538k50j670o973J077J543o885k767M430k460O906L475
5452C26J808j402M319M618l841r372K294J739m268l319j134O657l830O413Q7n286
5436d191L854O918k308r236K03P225l069j692K68K559j756P80N056k975p005j59
5420e528L263M443M87q79O72k606k48p54L441K894k732n850n060n883m959M40
$$ y = [-10078, -9262, -4101, 6545, 3423, 879, 6184, 7701, 6336, 2819, -5386, -3318, -4386, -11444, -14367, -8448, -1063, 27, 831, 2767, 3295, 5643, 9304, 11488, 7478, 4527, 5968, 7969, 1607, -2304, -3362, 1421, -2839, -5400, -1360, 2967, 590, -2086, -4594, -6181, -7054, -9083, -12016, -11088, -11904, -16333, -13381, -9589, -5854, -300, 3853, -1081, -4046, -7677, -6732, -2639, -213, -515, -541, -2847, -12804, -9342, -660, -1637, -2847, -4135, -638, 3900, 3650, 1980, -4993, -3916, -2373, -9258, -12025, -7595, -10055, -3149, 326, 2134, 732, 5051, 9669, 5828, -3544, -1250, 489, -3779, -7098, -8232, -1575, -5405, 1008, 1095, -4191, -337, 6581, 4273, -4963, -4760, 2465, -604, -2296, -2028, 531, -1225, -445, 4611, 1636, -5369, -5528, -2265, 2178, 2665, 1786, 2458, -148, -396, -1150, 2291, 5185, 2453, -3397, -8457, -14340, -19299, -18859]
5404a8859P487Q403P447l464n298j051o069l85P74l155RK774n64O764n1k750L973
5387d015J622k332j689KN208m4j693l891q09K592j214J501O429j471n186P419
5371B429J449N62R09L143k265N720J255n779r581K953K851K968j966m537o95J030
5355D46M823p234m553J9M632j212J093J992M532k246j061j903K079K455j581k149
5339A32Q627j130l591K079Q25j04j260N043k343p617l528l228N467j545J248m676
5323e601O260M613k801l169m161j061N683K776l09J063l173r56J893n257J451
5308b749M248k20M232J184j203R14l764O33N32m84p655n324m396J273P176j745
5292g348N239J967k482k790k225j934L344K388k903j208K891J273p798j539Q183
$$ y = [-18859, -11372, -2969, 4478, 1014, -4284, -5335, -11404, -11789, -11015, -14170, -14161, -11387, -11951, -5187, -5238, -7988, -4015, -2393, -4725, -6414, -6412, -1204, -1248, -2941, -6832, -7641, -5049, -6263, -4762, 1667, 196, -4990, 2429, 3878, 4440, 5349, 8492, 6227, 11947, 13202, 7423, -2158, 795, 3646, 6614, 4648, 111, -584, 446, 5269, -1965, -6518, -6499, -1867, -3079, -1986, 6, 4538, 2292, 1231, -672, 1407, 3862, 2281, 132, 8759, 7629, 4038, 6117, 6942, 6838, 5578, 10621, 8278, 661, -2867, -6095, -628, -2173, -925, -5601, 659, 5272, 2471, -698, -4859, -5920, -237, 2539, 2230, 3293, 120, -836, 1057, -4200, -2749, 1499, 1279, 5511, 6695, 5492, 6406, 2642, 3275, 3807, 3323, -4332, -9656, -14052, -12779, -5603, -7348, -2109, -142, -2624, -5414, -7639, -9573, -6229, -3841, -6744, -7952, -5061, -3788, -11586, -13125, -4942]
5277d942j850N050J1614P300m448n467o915j383J805l930L553L903K142q01n561
5262G0m809j46j831M864N594J509m51P00k755p340k232J07K967O525l198j952
5246b378N791J478m836p27j449k272j301K633m503l074j859K464j01J582L142
5231e410K152P53L715o59j509q90K647k173lJ401m281K711M543Q91p887j399P000
5214A602K033p770j2445J290J980J042J36P06j667q21J803k210k49M799j927l744
5198a5442k094N676M109O78O107J370k127K125K310j829j226L596J325n961j499
5183b882J142r811k841J690O532l15p9L901l619o692K017O592P890m38r933l683
5167a0529R045L533j88Q07j505m057m418o557M495P716M929L93l057M60L414l115
$$ y = [-4942, -6792, -1742, 9872, 17172, 12724, 7257, 342, -1041, 764, -3166, 387, 4290, 6432, 5631, 70, -4739, -4885, -6716, -1852, 3742, 5251, 4800, 5500, 2745, -4595, -6827, -6720, -3753, 2772, -426, -2378, 3413, 4891, 55, -672, -2121, -4393, -5694, -3061, -7564, -10638, -12497, -10033, -10134, -8552, -5410, -3258, -2505, 1210, 551, -958, -1848, 799, -1374, -1377, 24, -4257, -1546, 2997, 3888, -3999, -5398, 1602, 3635, -4135, -16580, -15290, -13310, -12268, -12132, -11426, -13093, -13914, -12111, -14321, -14570, -9771, -11698, -15442, -17536, -11860, -7751, -7073, -966, 404, -1723, 402, 2712, 883, -343, 3253, 4578, -1383, -2882, -1740, -11551, -14392, -12702, -6170, -6485, -6564, -2663, -6282, -12974, -10957, -4365, 3525, 3087, -6846, -10529, -1484, 2049, 1861, 2668, 1163, -2894, -7312, -13869, -9374, -1658, 3271, 3664, 607, 1067, 4481, 1366]
5151A366j413N349l60j535l781m054M236N463k183m105N413M785k458j721j095
5136C907r457J977k827q52N082p09q713K984O62N886K887L854L721o231n605k151
5120e585M354R188N129o700k682J890l333l182n00l463q8J998m734m915l411L608
5104a2426K277N540J501L369K587q768k944M751N497K734q104M15j807N684M510
5089D816J378p369n201M820L488P685r20j111l744l918r6M771K220J007l719l539
5073E68J40L06J050k372N92l432l67N479K015K048J965j1058m845N97L567M648
5057I01N433N215m637q256L147O523j840l977m600K339m125k520L117O133j570
5042A283q17k76l958M970N398o701o409L778O205K693n105o521n708L161J674
$$ y = [1366, -47, 5302, 4942, 3407, -374, -4428, -192, 5271, 3088, -1017, 4396, 9181, 6723, 5002, 3907, -5550, -3573, -6400, -7252, -2170, -2879, -11592, -8608, -7946, -2060, 827, 4681, 8402, 2171, -3434, -5585, -1231, 7957, 13086, 6386, 3704, 5594, 2261, -921, -1421, -4884, -4972, -2974, -7708, -12623, -16034, -12426, -10149, -4609, -3108, 261, 2848, -5920, -8864, -4113, 1384, 4118, -3986, -3571, -5378, 306, 4816, 6194, -1175, -6376, -1556, 1932, 9617, 8697, 7586, 3842, -76, -172, 4599, 6819, 7826, 4107, 568, 708, 1014, 2064, -308, 284, -3148, -3515, 1964, 3979, 6027, 7992, -3066, -7911, -7314, -3747, 901, 6334, 11549, 6912, -1344, 1803, 8326, 6486, 2509, -2091, 248, -3877, -6397, -3280, 2853, 1283, 466, 190, -3768, 1202, 6600, -101, -6510, -2732, 3473, 6166, 1061, -5460, -11168, -8007, -6333]
5027f333K433P432L097j017m015j047L522l509J491O135L614q605K025m397n172
5012d346L125k166k438P58J244n18J448M495M151k846K597l743j264n764O196
4997I29k12k940m409j438j97r12J743J785M131P373o765j3940P56K825m004O41
4981a4634M615N473M546j665J491m067l312P24l233P847O66N296M621L193M56
4966A2017o767m443j606j955R66N024J25m488K962L464K734j585o999l846j705
4951f102j659M446n748Q657K715k319m826q80K660M528l63N22k157n860O614R318
4935I546N84j3214k159J806l25p91M93M997L384k535o889m054K85K607L869J007
4919a389k196m15L315k409q282J02L234L786r08J305K912R017J840j1204p227
$$ y = [-6333, -3900, 3532, 6629, 5612, 1597, 550, 4072, 563, 2054, 8189, 11803, 3198, 5223, 826, -4346, -1221, -3387, -5825, -5067, -3823, -4341, -2893, 1602, 5753, 2907, 5504, 1761, 497, -5267, 929, 717, -2223, -6632, -8070, -8267, -9179, -7436, -5651, -1520, 5853, -912, -14852, -14096, -11271, -15275, -14634, -10019, -4546, 0, -1665, -174, -4241, -7553, -6829, -10062, -2215, -1549, 3747, 8368, 11561, 12017, 5250, 807, -799, -2754, -1788, 3236, 3361, -1127, 1835, 5299, 8033, 6448, -551, -4397, -6102, -7761, -3315, -9063, -406, 2309, -10, -4836, -5716, -3056, 1472, 1109, 1631, -526, -6386, 228, 9546, 10130, -3084, -5243, -3437, -3762, -4553, -4060, 937, 4321, 1786, -5103, -9157, -8872, -6265, -2396, -1389, -3585, -4000, -685, -3094, -11376, -11274, -8040, -4254, -5162, -3857, -945, 8072, 9912, -1292, -8519]
4904h519J924J3761N83n408j15O680k560k384K170N017k910j838K064M330R05
4889A3700q926p225J308o70r85m580m517O660M909M122j936k614P6P49K34M09
4873G14n46J303k207m33l005O1J394J355k586m054N407P797q16n730K175K538
4857C367M891M470j043p653j673M500J1876j25j1164n296J000j792m197q69l398
4842g106J046l196p44M442J589Q785j541l57L373l170k467k860n935J792L90K932
4826c027M575N879k205k834K727j445n754k349M284M886j110n292k496L671J574
4811A084l126p32p62j86m34P36k025K053L442n563j178k434q27Q8k062L99Q495
4794c032j233j741o716J607O36m918j790J2639P554r79M37j535k199p112k148
$$ y = [-8519, -6595, 7166, 7749, 2341, 2226, 8906, 6346, 3962, 6132, 11149, 8239, 6401, 8465, 12795, 13700, 4774, -2451, -1143, -1813, -2798, -7378, -11895, -5235, -326, 3796, 1860, -754, -678, 71, 305, 714, 168, 1471, -736, -1169, -4174, -4113, -2719, -1364, -3950, -8004, -2597, 5200, 4384, -1346, 829, 3367, 8258, 12728, 11685, 4032, 2359, 6859, 18735, 18610, 7446, 2150, 3150, 1358, -2839, -3708, -7106, -6060, -9256, -10000, -5558, -3969, 4816, 3275, 2918, 6291, 3121, 654, -2206, -8141, -6349, -5959, -3027, 1548, 7427, 5222, 2388, 5115, 3670, -2084, -4433, -149, 4737, 3627, -1665, -4161, -490, 1084, -2042, -2774, -3536, -3722, -4156, -3420, -5445, -3392, 50, -5513, -6691, -9125, -9952, -9864, -11926, -11527, -3032, -4265, -6006, -12722, -11115, -10479, -15397, -17187, -4548, 3006, 2027, 2464, 929, -1270, -8382, -10530]
4779a0530P213L508j100m777O502N962m432J139L118k133m251l668l935M221O517
4764C354p992L101J1266j412P8q75m33k454O463J866l986k034k130o568m714l915
4748a0385N824L655j198j177m506k519L778Q846Q045O043j388l615l024o978k21
4733A180L004P87n778K075N371j638m741o665m62O136J969M814L36l816J377p9
4717C870r594n880K010m499M100L642q8k841r16O007j704P94m42Q382L381O82
4701F904n588k773M229Q909K723m145m035k999M167k773O35L472p769o727M141
4686a629J162o26m279m357P637N64l867j33P699N895l931m080q594k997l2J596
4670i972M216O823M65L209l514R04r983l063k098L846N338L320L171n676l789
$$ y = [-10530, -3317, 191, -909, -5686, 816, 6778, 2346, 3485, 6603, 4470, 219, -3449, -7384, -3163, 3354, -4638, -1537, 9729, 8317, 8395, 7520, 7087, 4633, 11096, 12962, 8976, 6942, 4812, -1756, -6470, -10385, -4561, -906, -2104, -3281, -7787, -10306, -6528, 2318, 10363, 16406, 15018, 11403, 8379, 1401, 1180, 4184, 4971, -807, 1268, 6639, 5001, 260, -6405, -6867, -731, 1238, 6052, 6388, 2572, 3949, 3870, -5724, -11604, -9594, -14093, -9993, -6351, -6439, -9280, -10196, -4189, -5893, -5099, -5541, 2841, 6222, 6904, 1316, -1457, 2772, 11681, 14404, 10259, 6224, 3225, 7392, 4619, 5254, 8726, 957, -5770, -1629, -467, -1093, -5372, -9729, -2092, -1528, -5395, -5528, 2171, 8066, 4135, 55, -8539, -11536, -11568, -9972, -5756, 1067, 1532, 4741, 1227, 2131, -7852, -10915, -13013, -9167, -3829, -509, 2662, -3014, -6803]
4655f803L009M67L870l147N67K395N55L843L765p032L248r97j0788K304J910Q5
4639b749K876n590J347L701M66J690l245M074Q085K341j956q557r934o02O1K657
4623e335N216k98j642j261M654j755j913M596K792J342k439r283n843l234J082
4608a3321O506N164K377L203o116r277O642J0631j192k442r8J04l316j208M402
4593B059k082j0960q616N777K664M070K698k105j875K913n306m386N996J0539
4579A386J455K697L454n032n402p580j536J319N328M756k025p896K329L549q74
4564d072M331r000j808Q237K09k817n39m769k688K697L509O861l178q24O287L978
4548F414l953l661Q947P090q569oj70j873p84m268l752l568m381N46L235K943
$$ y = [-6803, -3794, -3327, 543, -2604, -2037, 358, 913, 4756, 8521, 1489, 4737, 3740, -7048, -4744, -2834, -2749, 127, -5463, -4116, -415, 51, 1741, -1504, 2570, 10655, 12996, 11040, 2483, -7451, -8053, -7992, -5335, -119, -417, -2059, -3320, 1334, -421, -2334, 2262, 5054, 6396, 3957, -5326, -11169, -14403, -13321, -6815, -1651, 726, 3929, -2187, -11464, -4822, 5809, 4617, 2175, 2077, 2181, -1135, -2343, 2059, -23, -10983, -19599, -13822, -11158, -7088, -4390, -6495, -8370, -5457, -10763, -15149, -9153, 1386, 2841, 5538, 8992, 3960, -1442, -9022, -10558, -9239, -3911, 845, -1180, -9076, -6747, -3198, -4072, 259, -8741, -10549, -2312, -2103, -4920, -5459, -10228, -12916, -10219, -6710, 151, -3027, -3851, 2436, 6414, 2461, -1200, 7747, 14837, 6268, 6262, 6092, 4219, 3435, -833, -4585, -8153, -12534, -11988, -8753, -5810]
4532e810O298K613j274J558o02M400N760p481k016j847L099q91J499m10M27l44
4516D979q602k064j004P007k723n872K887M179n483J042M357k131M560J343K06
4501B681p105k614J459N457r73n458l391N009J381n495M715l75q686P37J268P320
4485d070R457L297n66j325O66O59J275p631j137L085J428j196J19j847k975J980
4469A219l842o992k312L224N583k145l286K873K227j368j968l902K203K213k93
4454f566K97M1R841p501n073L521N698O503l24n387J284p27R96m80l016l367R53
4437c307j4o70j739n007L906J191K907L91K996J803j139l747q12P267M955m636
4421D345o039R24N600k800r41L482j808l531j434K065k823k162L689k196J928
$$ y = [-5810, 488, 3101, 1827, 3385, 2783, 7183, 12943, 5462, 3446, 1599, 4698, 3807, 5306, 4896, 5323, 4979, -3623, -5687, -6691, 316, -2407, -8279, -5392, -1213, -6696, -5654, -1297, -3428, 1132, 2475, 2681, -4424, -7038, -5579, -122, -1095, -6553, -9944, -4935, -3554, -9049, -4334, -4709, -13395, -12658, -11390, -4070, 5387, 8684, 8118, 6793, 7459, 8118, 9393, 1762, 625, 3710, 5138, 3942, 4061, 2214, -761, 1219, -2623, -9615, -11927, -8703, -3120, -5265, -8551, -5678, -3451, -4819, -6787, -10689, -8486, -6273, -6566, -6269, -6228, 3613, -3888, -8961, -5440, 258, 6761, 6437, 1050, 2334, 1607, 2603, 2123, -893, -4260, -3307, -3321, -3991, -5730, -10737, -6831, -5640, -2733, -2342, 654, 2457, 1318, -2429, -3241, 4026, 8981, 4345, -1694, -770, 4830, 2030, 1089, 4571, 2763, -768, -2202, -137, -2960, -5122, -1433, -3629, -1701]
4406a701P03r86k31m581K13M993J727k145q03M571K206J670P04K287n606l196
4390a75l262o449L413L593J289O55l298K499K191k733L2M96l014n303P669o030
4374h427m983q23M919k307l098P297J243J859O623J504K023k668o283m282K955
4359d448n07R09l594n858M855L95L228m8N175n89p534q424L440Q350P035l631
4343a246N378j070p230m911M662L865J501P371K53K851q287l034l199m321N521
4328a896k11n508l284o642J81O038R002j576qm047Q52O279l872j100M844P13m488
4311d723R134K507m128L52kp536k956M408Q796J751l053q158m299k079N011N251
4295B76O203L498n187p661L69K769K546j441m557K638K71K7J291M252J717n84
$$ y = [-1701, -998, -1984, -2215, -6796, -6583, -1590, 137, -2008, -2811, 1760, 3966, 5636, 6340, 8627, 3021, -175, -3437, -9886, -6473, -2880, -1591, -936, -4234, -1735, 456, -2277, -2245, -1749, -4763, -10066, -2397, -8427, -13410, -14233, -9314, -11621, -14719, -7422, -6179, -4320, 2303, 3807, 5830, 3162, -3121, -7403, -4448, -4955, -4046, -7640, -13498, -8643, -8248, -5020, -5068, 107, -482, -8016, -16440, -13000, -4650, 2385, -1246, 4132, 3062, -4168, -9079, -4417, -552, 949, 8320, 8573, 11424, 3137, 103, -3096, -7417, -1896, -2107, -7615, -10899, -17541, -17360, -11322, -2320, -3896, -3904, -7951, -7099, -820, -4692, -5792, -948, -235, -4723, 4411, 6918, 2790, 3142, 3140, -4396, -7352, -2944, 5852, 7603, 4550, -3608, -7907, -9986, -4975, 276, 6479, 9977, 4790, -2871, -2502, 267, 2813, 1372, -3185, -547, -276, -249, 1042, 5294, 7011, 6427]
4279F427J540m936p865M133K815q43R71N368K545k477k915j024l288L901l031
4264A321r980k180O390r57r212N073Q468m600o4P757P69J501l113k411l412J560
4248c090j336m626l666L763P265O282j4004n868P057K776k299n096o594O719M689
4233h028J17K971K028L75j883rk940K430j332j816K057J490M240K677J602k313
4217A666p534k189J398l731N293P268k81j1519j646J915N951M005N46N996J510
4202H648j044l232k702l337L592M939N51l457o21M588k297l912m002l324K379
4187c231O816O508K780o275o076J97L086j159N351m84J193P199l841l404m848
4172C812q619r15o37K967k651j841Q192l401n229l001N556N913j590j0000k401
$$ y = [6427, 7967, 3031, -4834, -701, 2114, 1271, 2242, 7610, 10155, 7678, 4763, 3739, 451, 4352, 1321, -8659, -10839, -4449, -5406, -14618, -9545, -1077, -5677, -5741, 2016, 2785, 4286, 1173, -1238, -4650, -3090, -4426, -9052, -12718, -8955, -1690, 4592, -9412, -15280, -8223, -5447, -7746, -12842, -19436, -12717, -8028, -7911, -4940, -2912, -2537, -4420, -4429, -7369, -4939, -6271, -8087, -6030, -4540, -300, 2377, 3979, 1666, -5868, -8057, -6659, -10390, -5097, 2171, 1890, -9629, -11275, -9360, -3409, 596, 1142, 7138, 8648, 7604, 4372, 1670, -1667, 1925, 6864, 7415, 3958, 3337, 7925, 5628, 1716, -2286, -5610, -3231, 3585, 10093, 12873, 6598, 522, 719, 3805, 2646, 7997, 7513, 8706, 15905, 12064, 8660, 3812, -4807, -5722, -6359, -3392, -6043, -7884, 308, -3093, -8322, -11323, -5767, 146, -1444, -11444, -13845]
4157a3845P647R505J03p411K854L899O780m246m172J404j835M155K172o879m78
4142c47L779k906m799N252O858j016j96m638q862K01n19j565O993N981k441n525
4126c750J424K352K885j543K101k716n456K475M281k078N037p525p198L923Q364
4111B576l268j043K563j766Q67m372K193K877K669N046l861l071J471K155K905
4096G941o737o747l534N385O325j36n765l086n268K935K632J0657L318J203J019
4081A0142j1623K99N960L252l566o620k376J0022L284k210m343N50O67k141j213
4066H4J739J052k010J325Q886k980l619o518o734n004N702M810K42K088n906Q40
4050f003L659L491M024J197p615q075n638J176N565M962K627R37K750l058m526
$$ y = [-13845, -6198, 3307, 3410, -4001, -1147, 2752, 9532, 5286, 1114, 2518, 683, 4838, 7010, 131, -347, 3432, 526, -4273, 979, 7837, 6821, 6625, 1987, -6875, -6674, -7193, -8758, -1765, 4216, 1775, -3750, -2326, 26, 2911, 1368, 3469, 753, -4703, -2228, 2053, -25, 5012, -2513, -9711, -5788, 2576, -692, -1735, 828, -938, -71, -4443, -2250, 627, 3296, 8342, 4481, 1410, 2881, 5036, 7941, 1204, -5543, -9077, -3692, 2633, 2497, -3268, -6354, -11622, -8687, -6055, 4602, 7920, 9123, 10142, -1481, -1182, 4778, 8030, 4464, -2156, -4532, 5490, 8774, 6564, 2221, 2771, 3438, 1297, 84, 1823, 2875, 865, 2190, 11076, 8096, 4477, -2041, -8775, -13779, -8077, -3267, -3025, -937, -6843, -6003, -2344, 1147, 5171, 6368, -1247, -9322, -14960, -13784, -8219, -3257, -630, 307, 3057, -1, -4527]
4035d527o071P253P623L051J98l750j24J1016J803n736k006n682j046k68O850
4020H584M229m664j747M485O71l426l954n087l258q02J910M613j299n543m03n386
4004a1077l363R805L221m582J803K29m939J115O192J977r796j914Q49Q228K12
3989b040r57L854J166j857J813j999O929K674L89L572m725J449k914k919N66m317
3973F84L851K915q429o400m482P108N268Q145m259l736l66J861o303J895L293
3958A045l968m99N018n755q94k722J391P039J526k131O633q420j1124N14R816
3943b531Q186K315l175J814l216n90m870q69R94k657J322O870N413o792Q95M494
3927G603l988r724n605J651N679R662m688n927p02r45k71M201P269K21j000m94
$$ y = [-4527, -10598, -3345, 4278, 7329, 7527, 3777, 3653, 14669, 16472, 10736, 8730, 3048, 2002, 1734, 8584, 12813, 8149, 6402, 10887, 11558, 8132, 4178, -909, -4167, -4969, -3059, 1554, 255, -5288, -5691, -11077, -14440, -4635, -1414, -5996, -4193, -3964, -8903, -7788, -1596, 381, -9415, -11329, -10480, -2252, -2040, -2997, 857, 2023, 166, 1979, -20, 6909, 9583, 9972, 13544, 8819, 10268, 7354, 4435, 5001, 684, 4535, 7450, -979, -7379, -11861, -4753, 515, 8660, 4401, 665, 299, 2160, -4143, -2248, 1045, -2923, -3422, 1596, -4159, -5053, -7775, -6384, 655, 2181, 50, 6683, -1737, -12861, -12347, -2531, 5655, 7970, 4795, 6609, 3393, 2803, -2067, -2936, -1942, -4599, -3277, 3593, 9006, 2214, 3109, 7603, 3615, -6109, -11714, -10063, -4384, 5278, 590, -5337, -6039, -6984, -7255, -3054, 4215, 4436, 3436, 2942]
3911B942j981j72r668k532J2305R248Q42q573l423K207J257J824P7m623m247J224
3895c293m240o650n741J920R605N586K80l43j618l895q362N46K636O564nJ102
3879e908O746J392o898l453K112K910p6J867j268m408j577P163L212J607M32n594
3863a741l679K291L489J642M608q184m727N034K566m166l933K111P328k055o878
3848f294j437k219N595j410m719j416L26Q50K923N922P432O082l105m207O73j636
3832C360J282J193j883m451l360n341J088O193J352o935j361q17m499M959R317
3817I7L322n293k98O75K85k273j579o739N460j306O137j4241n404N694M759M112
3801f592M236N815O533K639k517j2477l730J769j209L689M146j856J059J009K701
$$ y = [2942, 961, 789, -8879, -11411, 894, 10142, 10984, 2411, -1012, 1195, 2452, 4276, 4353, -270, -4517, -3293, -7533, -14183, -19924, -18004, -8399, -2813, -2533, -2876, -4494, -8389, -16751, -16205, -13569, -7005, -7010, -5908, 838, 2230, -4668, -8121, -6009, -3099, -3175, -1308, -2576, -6984, -8561, -1398, 1814, 3421, 3853, -1741, -5420, -3129, 360, 2002, 6610, -1574, -6301, -1267, 1299, -2867, -6800, -4689, 2639, 584, -6294, -7731, -9950, -4355, -5765, -10484, -11900, -11574, -10724, -7801, -1879, 5553, 11635, 8530, 4323, 4996, 3360, 4642, 5835, 3952, -499, -3859, -9200, -8112, -1919, -567, -7502, -8863, -9680, -14179, -9220, 97, 3419, -1874, -2172, -1497, -1212, -3485, -5064, -11803, -6343, -7649, -1512, -15753, -21157, -15463, -10704, -6592, -2356, 3459, 9992, 12631, 10114, -2363, -6093, -4324, -5533, -1844, 2302, 446, 1505, 2514, 5215]
3786E215K524p84j497L483n940k385m981p692j615N401m207Q787L637m447k125
3771f626j228k288m54m429R22r21N845K762N737N79j081j565L995n286k958m365
3755a1361K202J664j984J501P879K652l720o861k073J625L323J027m078m263J05
3740a2362L292J430R299N760j133J258J650o436o662k183j009O28L825N553K051
3725D961J138m16r144l11Q58N83M907L706K975J568K70j3098q752O271O367M14
3709B297q058j0492n33N141N228L536R0q697l006K272O847R70j003J133l629K619
3693e285k888J164r73N407l931j154k905O91m021P658L064J027O831n428k079
3678b822P108l34k404K036K161Q703J16q499M435k184n219r626K158J450k263
$$ y = [5215, 7739, 6955, 5458, 8941, 3001, 616, -4365, -12057, -13672, -8271, -12478, -3691, -54, -4501, -6626, -7854, -10142, -10596, -15025, -14103, -15024, -9179, -6417, -680, -101, -1182, -2747, 1248, -4038, -6996, -11361, -9159, -7495, -9479, -7978, -99, 2553, -1167, -8028, -10101, -8476, -5153, -4126, -8204, -12467, -12362, -9070, -7640, 1659, 7419, 6286, 7544, 9194, 2758, -3904, -6087, -7096, -6468, -2643, 2910, 4961, 6099, 5683, -3461, -3772, -2914, -2331, 2576, 6282, 9257, 10825, 11095, -2003, -10755, -4484, 1883, 2297, -5761, -16253, -16786, -11645, -6417, -2881, -2791, -11488, -14494, -12222, -5375, -4405, -5408, -4275, -7904, -5285, -8173, -7009, -7982, -2575, -6506, -7660, -10565, -9874, -13895, -6237, -3173, -2146, 4685, -743, -2822, 4286, 3952, 1548, 3584, 5745, 14448, 14564, 6065, 10500, 8316, 3097, -6529, -4371, -2921, -5184]
3663e184O659Q320l089p495m259N363j843L773L199p275q954J878R795L072n870
3648a910l89k666k283N336N138j908J211m934j1127n62M258J573O81j715N325
3633c972J0164J885k644m894j68j124k05L299l343m574K175J04j780L855K206
3618I84l276l022M97L325k802R50O025J540p471n187M669K722j934K299l116l583
3602g380L028R898n64j0416L212J1615o601k013k45m377K414O440k186o694j947
3587e816P653J156j0522J113O190L637O751O622o723j2996m261j435K157j956
3573h430K322L967J221K020N448m071M359O369r15J486l020l034l537l751n619
3558e185j503l151o956J706L467j041j983j010L579R824J0178J310o003l881o38
$$ y = [-5184, 1475, 9795, 6706, -789, -5048, 315, -1528, 2245, 5444, -1831, -10785, -8907, 888, 3960, -1910, -2299, -4965, -7248, -1912, 3226, 1318, 2529, -2405, -13532, -14094, -9836, -8263, -7582, -9297, -3972, 6192, 8077, 5433, 539, 371, -753, -958, 2341, -1002, -5576, -3401, -3297, -5077, -1222, 984, -2292, -5314, -4817, -1492, -4294, -3344, 2681, 4221, -3250, -8437, -3768, -1046, -2980, -681, -3797, -7380, -4352, 5546, 4982, -5434, -2222, 9393, 2792, 779, 534, -3843, -1429, 5011, 2825, -3869, -5816, 1837, 2993, -7529, -6416, -226, 3411, 10162, 16784, 10061, -2935, -7196, -8631, -6474, -8430, -6108, -2141, -920, 1100, 6548, 2477, 6836, 13205, 12290, 13776, 10756, 7722, 4185, 434, -5185, -6688, -9839, -16795, -15089, -11622, -12663, -14646, -15656, -12077, -2253, 7925, 9235, 3232, -649, -1287]
3543a287J242N199M65l481l860q18l974j150K004R836J690k846j306j7l400q799
3527a0502M35J61R706O633j671n075M075O871m466l826k665M93J74M497N55q747
3511c352q023P943M448L019M813Q55p813m428l604N953O666o256K76M08k251k644
3495c990P391N348m105p471J790J236M454j53m40j905k553j274O029l59m59N98
3479D137o957l608l691K278K486O169k26n264n346L738Q608J79J655m558k617
3464c017l877k753K784M257N31O73q01p269o003L274O195R394j52N447m71p176
3448A036o914p16N023N696l281j951J213j070J815j928j614q452o277P293K765
3433g362P480K647j932j214J651P0P5J49k03l898p729o125j15P077M360r720L661
$$ y = [-1287, -45, 5154, 5619, 2138, -1722, -2540, -6514, -7664, -5660, 4176, 5866, 3020, 1714, 1697, -1703, -10502, -10067, -9906, -200, 6433, 4762, -313, 3762, 10633, 6167, 2341, -324, 169, 343, 4840, 5395, -3352, -11375, -3432, 1016, 4035, 8848, 9703, 1890, -2538, -6142, -189, 6477, 221, 497, 905, -1346, -3990, 3401, 8749, 4644, -2827, -1037, 199, 4653, 4500, 4060, 2155, -398, -1672, 4357, 3998, 3539, 4137, -2820, -6428, -10119, -7841, -5355, 814, 588, -4676, -10022, -6284, 2324, 2503, 4158, -400, -3017, -6894, -9647, -6863, -2606, -2075, -1402, -2203, -9472, -15475, -12201, -6006, 3388, 3236, 8683, 8212, 1036, -5878, -6594, -1571, 4125, 844, -1107, 106, -964, 851, -1077, -2691, -11143, -17420, -10127, -7362, 118, 2765, 833, -381, 1270, 1340, 1415, 1564, 1361, -2537, -10266, -16391, -16506, -9429, -5069, -14789, -11128]
3416a1128O38j360L462J0051J269l952J407K561j382M89k64O04J990l973n186
3401d774K114M64O516M657K850o999J560J581o122k38L193Q37q549p280k948J228
3385a1910J121M94N510k371l700j746k59Q155o854j794K717M275K270j638l236
3370h966M903L350o00M358P682L20m975p088j953N396L732l717r74l528j916O131
3354B155O409k312k421j136l077K785M359j682j468k489J770J756l129L612n48
3339D584L270k090q075K275L391P6K904P095j603l616m650l236P022K790k965
3324G172J363j99J659N828k872P73J855j603m555l798o071L397k823l174J369
3309a679J48j174P89M249q31M580M055m189j916K502n827r705K750K926J320l509
$$ y = [-11128, -10490, -11850, -8388, 1663, 2932, -1020, 387, 2948, 1566, 2055, 1791, 2395, 4385, 412, -4774, -2660, -2196, 4320, 8977, 11827, 4828, 6388, 7969, 1847, 1609, 4802, 5639, -2910, -10190, -13138, -11910, -10789, -10295, -4785, -7156, -10856, -12602, -12861, -4706, -11560, -13354, -10637, -6362, -4092, -5730, -8966, -4063, -713, -1313, 3045, 10727, 11047, 6072, -1016, -2969, 2427, 6159, 2442, 1468, -2060, -3976, 2155, 8564, 6252, 3831, 2695, -382, 2403, 6762, 5080, 3612, 1123, 2893, 4649, 1520, 5132, 4584, 7854, 5764, -2311, -36, 3355, 3431, 6335, 13430, 11827, 8211, 3561, 325, 7347, 10137, 7172, 8535, 8336, 9995, 15823, 12951, 13724, 15579, 13976, 9421, 5623, -448, 2949, 126, -3048, -1679, -1531, -2705, -1916, 2333, 1502, 6082, 10137, 5948, 4032, 6534, 707, -8998, -6248, -3322, -2002, -5511]
3293e511J403j182j950k697J015Q29J355J0733P421j461k435o38J136l699m341
3278b2l09K262q55j573k146L347j431l71K905l89q03l769P67p6K870l432n015
3261h040J080K267l28k154m49J580J92K706K53R57L126M264m483o70K778l932
3245h53k138L365M533n1p359J327j274K065j095J085k243p586n020K548K810j253
3229a1139L421M775N559o02r84k149j996P459J719J769K883j143n624j597p312
3214d961n248r34k555kK538M221O486j09P97l732J335k89J512j07k40L52p532
3197h468L477M203J27j464k873N549M703n865n082q19L093n101M001n097R88N013
$$ y = [-5511, -4108, -5290, -7240, -9937, -8922, -8093, -6738, 3995, 11416, 9955, 7520, 6882, 8018, 4319, -22, -331, 1931, 1076, -497, -2643, 704, -727, -1098, 1807, 1418, 615, -3154, -2387, -2463, 407, -3025, -8040, -6960, -4693, -5021, -7175, -7624, -6044, -5852, -3146, -2893, -1936, 1190, 5454, 971, 301, 3079, -853, -2991, 374, 4907, 4856, -2503, -1176, -2450, -385, -1480, -395, -2638, -10224, -15244, -12696, -9886, -11139, -7718, -2943, 2616, 2014, 1030, -1119, -3115, 4344, 6063, 7832, 10715, 9572, 3948, 2351, -4961, -10209, -11143, -13698, -13700, -11162, -6941, -455, -564, 233, -3499, -2164, -2453, -941, -1048, -1288, -936, -8468, -4991, -788, -661, -2125, -4998, 551, 5254, -611, -5693, -6512, -3419, -8520, -4519, -9616, -8628, -3615]
$$ [...]
##END NTUPLES=NMR SPECTRUM
##END=
