##TITLE=Analysis number 320858
Compound Code btb 07484
Project Code adrs
Chemist Name stores
##JCAMPDX= 6.0         $$ Bruker NMR JCAMP-DX V2.0
##DATA TYPE= NMR SPECTRUM
##DATA CLASS= NTUPLES
##ORIGIN= Bruker BioSpin GmbH
##OWNER= nmr
$$ XWIN-NMR		Version 3.5
$$ Fri Jul 14 09:12:26 2006 GMT Daylight Time (UT+1h)  MAYBRIDGE\nmr@NMR_250MHZ
##.OBSERVE FREQUENCY= 250.131544655141
##.OBSERVE NUCLEUS= ^1H
##.ACQUISITION MODE= SIMULTANEOUS (DQD)
##.ACQUISITION SCHEME= undefined
##.AVERAGES= 16
##.DIGITISER RES= 18
##SPECTROMETER/DATA SYSTEM= dpx250
##.PULSE SEQUENCE= zg30
##.SOLVENT NAME= DMSO
##.SHIFT REFERENCE= (INTERNAL, DMSO, 0, 16.522)
##AUDIT TRAIL= $$ (NUMBER, WHEN, WHO, WHERE, WHAT)
$$ ##TITLE= Audit trail, XWIN-NMR		Version 3.5
$$ ##JCAMPDX= 5.01
$$ ##ORIGIN= Bruker BioSpin GmbH
$$ ##OWNER= nmr
$$ C:\u/data/dgb/nmr/ADRS/2710/pdata/1/auditp.txt
$$ ##AUDIT TRAIL=  $$ (NUMBER, WHEN, WHO, WHERE, WHAT)
(   1,<2006-07-14 09:12:05.30 +100>,<MAYBRIDGE\nmr>,<NMR_250MHZ>,
      <created by zg, POWCHK disabled, PULCHK disabled
       configuration hash MD5:
       E2 DF 36 D8 04 B2 41 60 5A D7 A3 38 5A 4B D0 FE
       data hash MD5: 64K
       49 34 E1 27 79 6E E0 1F 6D 0C 58 0D DF AE C3 0D>)
(   2,<2006-07-14 09:12:17.39 +100>,<MAYBRIDGE\nmr>,<NMR_250MHZ>,
      <Start of raw data processing
       ef LB = 0.3 FT_mod = 6 PKNL = 1 SI = 32K 
       data hash MD5: 32K
       4F 6A F0 A9 08 D9 5A ED 9B 50 9C DB FA F6 3D 2B>)
(   3,<2006-07-14 09:12:19.00 +100>,<MAYBRIDGE\nmr>,<NMR_250MHZ>,
      <apk 
       data hash MD5: 32K
       4B 7D 3A E9 A6 67 64 91 9B FA 60 C8 25 06 88 43>)
(   4,<2006-07-14 09:12:19.74 +100>,<MAYBRIDGE\nmr>,<NMR_250MHZ>,
      <abs ABSG = 5 
       data hash MD5: 32K
       64 7B 8A 16 80 E0 43 7D A3 3A 91 4C 27 68 D6 AE>)
$$ ##END=
$$ 
$$ hash MD5
$$ 1F A4 00 F5 2D 88 08 21 53 E1 6D B9 08 B7 5D BD
##$RELAX= 
##$RELAX= 
##$RELAX= 
##$RELAX= 
##$RELAX= 
##$RELAX= 
##$RELAX= 
$$ Bruker specific parameters
$$ --------------------------
##$DU= <C:\u>
##$EXPNO= 2710
##$NAME= <ADRS>
##$PROCNO= 1
##$TYPE= <nmr>
##$USER= <dgb>
##$AMP= (0..31)
100 100 100 100 100 100 100 100 100 100 100 100 100 100 100 100 100 100 
100 100 100 100 100 100 100 100 100 100 100 100 100 100 
##$AQSEQ= 0
##$AQ_mod= 3
##$AUNM= <au_zg>
##$AUTOPOS= <48 >
##$BF1= 250.13
##$BF2= 250.13
##$BF3= 250.13
##$BF4= 250.13
##$BF5= 500.13
##$BF6= 500.13
##$BF7= 500.13
##$BF8= 500.13
##$BYTORDA= 1
##$CFDGTYP= 0
##$CFRGTYP= 5
##$CHEMSTR= <none>
##$CNST= (0..31)
1 1 145 1 1 1 1 1 1 1 1 1 1 1 1 1 1 1 1 1 1 1 1 1 1 1 1 1 1 1 1 1 
##$CPDPRG= <>
##$CPDPRG1= <>
##$CPDPRG2= <>
##$CPDPRG3= <>
##$CPDPRG4= <mlev>
##$CPDPRG5= <mlev>
##$CPDPRG6= <mlev>
##$CPDPRG7= <mlev>
##$CPDPRG8= <mlev>
##$CPDPRGB= <>
##$CPDPRGT= <>
##$D= (0..31)
0 1 0 0 0 0 0 0 0 0.06 0 0 0 0 0 0 0.0002 0 0 0 0 0 0 0 0 0 0 0 0 0 0 
0 
##$DATE= 1152864724
##$DBL= (0..7)
120 120 120 120 120 120 120 120 
##$DBP= (0..7)
150 150 150 150 150 150 150 150 
##$DBP07= 0
##$DBPNAM0= <>
##$DBPNAM1= <>
##$DBPNAM2= <>
$$ [...]
##$SUBNAM7= <"">
##$SUBNAM8= <"">
##$SUBNAM9= <"">
##$SW= 20.6930455092707
##$SWIBOX= (0..15)
0 0 3 0 0 0 0 0 0 0 0 0 0 0 0 0 
##$SW_h= 5175.983436853
##$TD= 65536
##$TD0= 1
##$TE= 296.16
##$TE2= 300
##$TE3= 300
##$TEG= 300
##$TL= (0..7)
0 120 120 120 120 120 120 120 
##$TP= (0..7)
150 150 150 150 150 150 150 150 
##$TP07= 0
##$TPNAME0= <>
##$TPNAME1= <>
##$TPNAME2= <>
##$TPNAME3= <>
##$TPNAME4= <>
##$TPNAME5= <>
##$TPNAME6= <>
##$TPNAME7= <>
##$TPOAL= (0..7)
0.5 0.5 0.5 0.5 0.5 0.5 0.5 0.5 
##$TPOFFS= (0..7)
0 0 0 0 0 0 0 0 
##$TUNHIN= 0
##$TUNHOUT= 0
##$TUNXOUT= 0
##$USERA1= <user>
##$USERA2= <user>
##$USERA3= <user>
##$USERA4= <user>
##$USERA5= <user>
##$V9= 5
##$VALIST= <valist>
##$VCLIST= <CCCCCCCCCCCCCCC>
##$VD= 0
##$VDLIST= <DDDDDDDDDDDDDDD>
##$VPLIST= <PPPPPPPPPPPPPPP>
##$VTLIST= <TTTTTTTTTTTTTTT>
##$WBST= 1024
##$WBSW= 4
##$XGAIN= (0..3)
0 0 0 0 
##$XL= 0
##$YL= 0
##$YMAX_a= 342278
##$YMIN_a= -437508
##$ZGOPTNS= <>
##$ZL1= 120
##$ZL2= 120
##$ZL3= 120
##$ZL4= 120
##$ABSF1= 16.522
##$ABSF2= -4.171173
##$ABSG= 5
##$ABSL= 3
##$ALPHA= 0
##$AQORDER= 0
##$ASSFAC= 0
##$ASSFACI= 0
##$ASSFACX= 0
##$ASSWID= 0
##$AUNMP= <proc_1d>
##$AZFE= 0.1
##$AZFW= 0.1
##$BCFW= 0
##$BC_mod= 0
##$BYTORDP= 0
##$COROFFS= 0
##$CY= 12.5
##$DATMOD= 1
##$DC= 0
##$DFILT= <>
##$DTYPP= 0
##$F1P= 14.0000005364418
##$F2P= -0.99999901652339
##$FCOR= 0.5
##$FTSIZE= 32768
##$FT_mod= 6
##$GAMMA= 0
##$GB= 0
##$INTBC= 1
##$INTSCL= 1
##$ISEN= 128
##$LB= 0.3
##$LEV0= 0
##$LPBIN= 0
##$MAXI= 10000
##$MC2= 0
##$MEAN= 0
##$ME_mod= 0
##$MI= 0
##$NCOEF= 0
##$NC_proc= -5
##$NLEV= 6
##$NOISF1= 0
##$NOISF2= 0
##$NSP= 0
##$NTH_PI= 0
##$NZP= 0
##$OFFSET= 16.522
##$PC= 1
##$PHC0= 158.0735
##$PHC1= 11.14952
##$PH_mod= 1
##$PKNL= yes
##$PPARMOD= 0
##$PSCAL= 4
##$PSIGN= 0
##$REVERSE= no
##$SF= 250.13
##$SI= 32768
##$SIGF1= 0
##$SIGF2= 0
##$SINO= 400
##$SIOLD= 32768
##$SREGLST= <1H.DMSO>
##$SSB= 0
##$STSI= 32768
##$STSR= 0
##$SW_p= 5175.98343685301
##$SYMM= 0
##$S_DEV= 0
##$TDeff= 65536
##$TDoff= 0
##$TI= <Analysis number 999999
Compound Code 99
Book Reference 9
Project Code 9>
##$TILT= no
##$TM1= 0
##$TM2= 0
##$TOPLEV= 0
##$USERP1= <user>
##$USERP2= <user>
##$USERP3= <user>
##$USERP4= <user>
##$USERP5= <user>
##$WDW= 1
##$XDIM= 32768
##$YMAX_p= 330615243
##$YMIN_p= -943018
$$ End of Bruker specific parameters
$$ ---------------------------------
##NTUPLES= NMR SPECTRUM
##VAR_NAME=  FREQUENCY,     SPECTRUM/REAL,   SPECTRUM/IMAG
##SYMBOL=    X,             R,               I
##VAR_TYPE=  INDEPENDENT,   DEPENDENT,       DEPENDENT
##VAR_FORM=  AFFN,          ASDF,            ASDF
##VAR_DIM=   32768,         32768,           32768
##UNITS=     HZ,            ARBITRARY UNITS, ARBITRARY UNITS
##FACTOR=    0.157963299565203, 1,           1
##FIRST=     4132.6476996994, 0,             0
##LAST=      -1043.33573715361, 0,           0
##MIN=       -1043.33573715361, -943018,     0
##MAX=       4132.6476996994, 330615243,     0
$$ Real data points
##PAGE= N=1
##DATA TABLE= (X++(R..R)), XYDATA
$$ [...]
15624c76984Q5994q4074m6497P2401K34314J10915N0343j31506M0417K85117N4454
$$ -376984 -290990 -375064 -421561 -349160 -114846 -3931 46412 -85094 -44677 240440 294894
15613B94894P198j08233j78659j70157j17374j0946o9303K58003K98887K8858
$$ 294894 302092 193859 15200 -154957 -272331 -283277 -352580 -94577 204310 233168
15603B33168q2929l9738J5008J45737J2308P705j80762k21776j06326L811o5116
$$ 233168 150239 110501 125509 271246 283554 291259 110497 -111279 -217605 -213794 -278910
15592b78910J0385J44997K60360P1316M7121o7249p7165p0407r3898N4302J86029
$$ -278910 -268525 -123528 136832 208148 255269 188020 110855 40448 -53450 852 186881
15581A86881j04452k80629k59851K399J36572q5975K6622N4175J34789r513n8117
$$ 186881 82429 -198200 -458051 -455652 -319080 -405055 -378433 -324258 -189469 -198982 -257099
15570b57099J38032L3364J22299J20271N1144q6364k86179p3472l4079k366r4530
$$ -257099 -119067 -85703 36596 156867 208011 121647 -164532 -238004 -272083 -274449 -368979
15559c68979K55262L7450J31714J618k84336k47489R3408J81881K56913k6447
$$ -368979 -113717 -76267 55447 57065 -227271 -474760 -381352 -199471 57442 30995
15549C0995k99803l7805P5158K10975k28343j8930K01045l104o0410j09257N0917
$$ 30995 -268808 -306613 -231455 -20480 -248823 -267753 -66708 -69812 -130222 -239479 -188562
15538a88562J73943J13816k38646O8486j0846j27509R0373J42178j16392O6280
$$ -188562 -14619 99197 -139449 -70963 -81809 -209318 -118945 23233 -93159 -26879
15528b6879N0942n865j57453J71478o8489M9111q2846R3978K10484j21368n3732
$$ -26879 24063 18198 -139255 32223 -36266 12845 -70001 23977 234461 113093 59361
15517E9361K5439J19672l8764k28671j41245J5302N4079L0190j97726o7338J08040
$$ 59361 84800 204472 165708 -62963 -204208 -188906 -134827 -104637 -302363 -369701 -261661
15506b61661K95074o1588l5536m0675K30690J18554l5652l80697M3191M17647
$$ -261661 33413 -28175 -63711 -104386 126304 244858 209206 -171491 -128300 289347
15496B89347Q0521k12438j9953r2517p1868j09102j70884M9185J79779r5625q5334
$$ 289347 369868 157430 137477 44960 -26908 -136010 -306894 -257709 -77930 -173555 -258889
15485b58889l8464l9559J00159J9451j00887P8131J7847J09703j14093j17387
$$ -258889 -297353 -336912 -236753 -217302 -318189 -240058 -222211 -112508 -226601 -343988
15475c43988M8778K34913J75389N453o1263j45281J42272j19644J6938J53942
$$ -343988 -295210 -60297 115092 120545 59282 -85999 56273 -63371 -46433 107509
15465A07509q8545k0952r3617l47064J29557K68999o7870j64689K586L79911Q0414
$$ 107509 18964 -1988 -95605 -442669 -313112 -44113 -111983 -276672 -274086 105825 186239
15454A86239j75766k51653k58285l6988J98067J67547O7602k75910k23352L14929
$$ 186239 10473 -241180 -499465 -536453 -338386 -170839 -103237 -379147 -602499 -287570
15444b87570J67173j42536K15530K40717J28114k30494l30572k7854m0682P3733
$$ -287570 -120397 -262933 -47403 193314 321428 90934 -239638 -267492 -308174 -234441
15434b34441L3186J6179j14557p8747K30865P6073Q1927o4646Q6735k7537j88345
$$ -234441 -201255 -185076 -299633 -378380 -147515 -71442 10485 -54161 32574 5037 -183308
15423a83308J86732K38239o7687l32852j28328N2262J42979P1838N4274K0010
$$ -183308 3424 241663 173976 -158876 -287204 -234942 -91963 -20125 34149 54159
15413E4159r7156n0254J55056R7257j33596M2169K05419j89009q6335r9912j36286
$$ 54159 -42997 -93251 61805 159062 25466 67635 273054 84045 -2290 -102202 -238488
15402b38488l918O1249l2969O3237L3268n5701J30974K38010O9281k88557j38213
$$ -238488 -242406 -181157 -214126 -150889 -117621 -173322 -42348 195662 264943 -23614 -161827
15391a61827k45407j0778K30953Q7431Q314j7590p7013n9781J46695L2487j73992
$$ -161827 -407234 -418012 -187059 -99628 -91314 -108904 -185917 -245698 -99003 -66516 -240508
15380b40508o1086O9845R1311J9009N1679R1674J17646q3427k03916q2295J24347
$$ -240508 -301594 -231749 -140438 -121429 -69750 21924 139570 56143 -147773 -230068 -105721
15369a05721O2376Q1506Q664l1013J30594J94505j35466k35485l2679k5965K6414
$$ -105721 -43345 38161 46825 15812 146406 340911 205445 -30040 -62719 -88684 -62270
15358f2270L3225J46109j77245o9935K64757P5367J5141k12340j25354M8313K2373
$$ -62270 -29045 117064 -60181 -130116 134641 210008 225149 12809 -112545 -64232 -41859
15347d1859j14012P473J49422J63019j25982j50830j43052j33724k2525K67810
$$ -41859 -155871 -148398 1024 164043 38061 -112769 -255821 -389545 -412070 -144260
15337a44260M10850l4155j46885j72713j81972O0856J17014n4834k45008m784
$$ -144260 266590 232435 85550 -87163 -269135 -208279 -91265 -146099 -391107 -395891
15327c95891J03660K9268k59354J71446J86480n1423O4312J0017J19381j2367
$$ -395891 -292231 -262963 -522317 -350871 -164391 -215814 -151502 -141485 -22104 -34471
15317c4471L5321j21227j05102j23616O1713j75491j61152J62611J85217Q167
$$ -34471 850 -120377 -225479 -349095 -287382 -462873 -624025 -461414 -276197 -268030
15307b68030P5385N1831Q6244k36658j89380j49583J88200L41047K16732q8938
$$ -268030 -192645 -140814 -54570 -291228 -480608 -630191 -441991 -100944 115788 26850
15297B6850k73872k18824L3593N0447Q6707J96590J05993j56851j56855K58466
$$ 26850 -247022 -465846 -432253 -381806 -295099 -98509 7484 -149367 -306222 -47756
15287d7756K52978j49321j32442K3673K525J57679K84240p9133k18574q4756J05792
$$ -47756 205222 55901 -76541 -52868 -50343 107336 391576 312443 93869 9113 114905
15276A14905K13425j46142k09298j05593J13532m0805r959K10716j19798j71766
$$ 114905 328330 182188 -27110 -132703 -19171 -59976 -69935 140781 20983 -150783
15266a50783L9753J20550j18663q1956J28658L22281K42125k0207r4078m32522
$$ -150783 -111030 9520 -109143 -191099 -62441 259840 501965 481758 387680 -44842
15256d4842k29299j3679L8499K69399M3125j77809N2016j17047p5049N9331J41431
$$ -44842 -274141 -287820 -249321 20078 63203 -114606 -62590 -179637 -254686 -195355 -53924
15245e3924p9598j83801K95793P2014J08353L7434j12770O2301q9228m9445j09103
$$ -53924 -133522 -317323 -21530 50484 158837 196271 83501 145802 56574 7129 -101974
15234a01974P1830j26965J42747K09123j02819j76323j7726q8779j01695j2222
$$ -101974 -30144 -157109 -14362 194761 91942 -84381 -102107 -190886 -292581 -304803
15224c04803J20608K54212Q696j00034J37320O4618r3564k39521k43970o5876
$$ -304803 -184195 70017 78713 -21321 115999 180617 87053 -152468 -396438 -462314
15214d62314j75833m6929J99460K29175Q5686L3267L0895L1510j22849J07571
$$ -462314 -638147 -685076 -485616 -256441 -170755 -137488 -106593 -75083 -197932 -90361
15204i0361Q9785L514J61018k2742K2632J39250J38718j1662k99837r5558L8329
$$ -90361 -576 2938 163956 141214 163846 303096 441814 430152 130315 34757 73086
15193G3086j8983j96977p964j8173q1051M5075J43359m8488M6798j51662L374
$$ 73086 54103 -142874 -150838 -169011 -250062 -204987 -61628 -110116 -63318 -214980 -211606
15182b11606Q031K36935J59698L7660j39664m2500k1228j3233j89154j82983p47
$$ -211606 -203575 33360 193058 230718 91054 48554 27326 14093 -175061 -358044 -358791
15171c58791J50411O1843j68087K1849J91025J31388J97990j65256j05924l1640
$$ -358791 -208380 -146537 -314624 -292775 -101750 29638 227628 62372 -43552 -75192
15161g5192J64990r0400k29213n3643n9747M8293J33618N7026M152n7062k21762
$$ -75192 89798 -602 -229815 -283458 -343205 -294912 -161294 -104268 -100116 -157178 -378940
15150c78940j45866K66487K03397J21365O756j71059k04605Q4473L5450k64958
$$ -378940 -524806 -258319 -54922 66443 73199 -97860 -302465 -217992 -182542 -447500
15140d47500Q2458q8080K5407O5675K03702J76919j01704n5228k69266o1622J75416
$$ -447500 -365042 -453122 -427715 -362040 -158338 18581 -83123 -138351 -407617 -469239 -293823
15129b93823J49989j27046l9404o2818j90610J58083J79404j32388J77907j9399
$$ -293823 -143834 -270880 -310284 -373102 -563712 -405629 -226225 -358613 -180706 -200105
15119b00105O9255J77929P8870l8965j40391q1458k39848j62962J00910K61103
$$ -200105 -130850 47079 125949 86984 -53407 -134865 -374713 -537675 -436765 -175662
15109a75662K48584j01528O4813l911k16502P3963R5068J29873O8695j48637L2904
$$ -175662 72922 -28606 36207 32296 -184206 -110243 -15175 114698 183393 34756 67660
15098F7660J2309j32650m4037j76595o6325J90789L94487P2319p2080j758q7684
$$ 67660 79969 -52681 -96718 -273313 -339638 -148849 245638 317957 245877 244119 156435
15087A56435j34586J1489J5835k88169k33632J81528K18672N6179Q8646J9485
$$ 156435 21849 33338 49173 -238996 -472628 -291100 -72428 -16249 72397 91882
15077I1882J36265j66690j67940J43843Q8219N775M8827m3715j64999n4044J1750
$$ 91882 228147 61457 -106483 37360 125579 131354 180181 136466 -28533 -82577 -70827
15066g0827q5044r3323K6134J4856R9122K59065K40111J56383k00099m06319k85588
$$ -70827 -155871 -249194 -223060 -208204 -109082 149983 390094 546477 346378 -59941 -345529
15055c45529J77740l886k9534P5358J24914K09010P2838r7905m15366J22310o374
$$ -345529 -167789 -171675 -201209 -125851 -937 208073 280911 183006 -232360 -110050 -116424
15044a16424j26321O1112N2064J26638K05477J30033j31330l1513q8372j36710
$$ -116424 -242745 -181633 -129569 -2931 202546 332579 201249 169736 81364 -55346
15034e5346K14686j07103l32313J6316J40917p8122K06553J11776K86724p2516
$$ -55346 159340 52237 -280076 -263760 -122843 -200965 5588 117364 404088 331572
15024C31572j52659J05320j20885j96620Q5525n6558K11301J31003j707K8116
$$ 331572 178913 284233 163348 -33272 52253 -4305 206996 337999 336292 364408
15014C64408j81652l66047m11099P5308L93776K02287J6309r4909M1533k35283
$$ 364408 182756 -183291 -594390 -519082 -125306 76981 93290 -1619 39914 -195369
15004a95369l39853J09592J31668l555N0850J25717Q3884J02391j43982l76939
$$ -195369 -535222 -425630 -293962 -297517 -246667 -120950 -37066 65325 -78657 -455596
14994d55596n2536L5204N7797M1660R9111p5103j65226N2710M71399K18045j13901
$$ -455596 -508132 -472928 -415131 -373471 -274360 -349463 -514689 -461979 9420 227465 113564
14983A13564K4636n01488j33668J77962J83300N4374r1718j65714L7938J28602
$$ 113564 138200 -363288 -496956 -318994 -135694 -81320 -173038 -338752 -300814 -172212
14973a72212N395N2386J62701K15050j42247m16R678J00937p1062j28235j59986
$$ -172212 -166817 -114431 48270 263320 121073 120657 130335 231272 160210 31975 -128011
14962a28011j11721j82525J08049Q3404j96586k87592O8910J87624L33357N8870
$$ -128011 -239732 -422257 -314208 -230804 -427390 -714982 -646072 -458448 -125091 -66221
14952f6221R651K52346J14042P1953m3809n2712m8845n9419l2416j60274l39381
$$ -66221 -56570 195776 309818 381771 337962 285250 236405 176986 144570 -15704 -355085
14941c55085k18645J22625L60874O2818n2158K88143J41122l86502r3828o0153
$$ -355085 -573730 -451105 -90231 -27413 -79571 208572 349694 -36808 -130636 -190789
14931a90789j44968M0138o6266q1391J18454J54191K47989k69637n860K35183
$$ -190789 -335757 -295619 -361885 -443276 -324822 -170631 77358 -192279 -198139 37044
14921C7044N0933j09577J24933K7701Q3701j97497j0969o3806o2574n7014J38171
$$ 37044 87977 -21600 103333 131034 214735 17238 6269 -57537 -120111 -177125 -38954
14910c8954P7471k15850n4865j62177o4043J46885K87250J12352j47098N4043
$$ -38954 38517 -177333 -232198 -394375 -458418 -311533 -24283 88069 -59029 -4986
14900d986l1428j2832k8408k42662K9432R5751k2880j98336q6344J07818j6932
$$ -4986 -36414 -49246 -77654 -320316 -290884 -195133 -218013 -416349 -502693 -394875 -411807
14889d11807K43884j4893o0453j72393q1842r2521K35881K85870k16832J9512
$$ -411807 -167923 -182816 -243269 -415662 -497504 -590025 -354144 -68274 -285106 -265594
14879b65594J90258L2235j6315n5650J30704q0202l97127Q0935J48907K40047
$$ -265594 -75336 -43101 -59416 -115066 15638 -64564 -461691 -380756 -231849 8198
14869H198J44065N1752J6170l3549l89561K5907L3534P1941j34434l2477K77589
$$ 8198 152263 204015 220185 186636 -202925 -177018 -143484 -71543 -205977 -238454 39135
14858C9135l2697j25480p909n219q6071j55525Q1374l4974r193q2092j6106R4161
$$ 39135 6438 -119042 -126951 -132170 -218241 -373766 -292392 -327366 -336559 -418651 -434757 -340596
14846c40596K80159Q6836o498J35999R421r1432m4956o1817J08136N1788n5403
$$ -340596 -60437 26399 19901 155900 165321 73889 28933 -32884 75252 127040 71637
14835G1637j48930J09269j2658q9279R523K37435k2823p5720J48619J24489r3715
$$ 71637 -77293 31976 19318 -69961 -60438 176997 154174 78454 227073 351562 257847
14824B57847j67566k57704J08014k435m8818m0104J02954M512l3934o0059r3376
$$ 257847 90281 -167423 -59409 -61844 -110662 -150766 -47812 -43300 -77234 -137293 -230669
14813b30669J66755J465j72354L0558K1720N2870Q2852N4920K66479J33728k97936
$$ -230669 -63914 -62449 -234803 -204245 -182525 -129655 -46803 8117 274596 408324 110388
14802A10388k719j06721j69860O4997J17248J8179J42088k6785k74407n7232N5594
$$ 110388 107669 948 -168912 -103915 13333 31512 173600 146815 -127592 -184824 -129230
14791a29230J07137j11171j60481J14671K77478P3044l85020k6698Q3321J42297
$$ -129230 -22093 -133264 -293745 -179074 98404 171448 -213572 -240270 -156949 -14652
14781a4652r4746n5617n9498O7524R0108K38183k3429j57087J15018K9044k81858
$$ -14652 -109398 -165015 -224513 -156989 -66881 171302 147873 -9214 105804 134848 -147010
14770a47010k96625m2123Q4326Q1724L52220J24105J6821Q6944j76519j84947
$$ -147010 -443635 -485758 -401432 -319708 32512 156617 173438 260382 83863 -101084
14760a01084j36746k1349J79119J51507j20425J2249j18827p85J73943J46035
$$ -101084 -237830 -259179 -80060 71447 -48978 -36729 -155556 -156341 17602 163637
14750A63637o945j53629J31430K79289j63691j05126k08845j93244j43600J11556
$$ 163637 156692 3063 134493 413782 250091 144965 -63880 -257124 -400724 -289168
14740b89168L10790J78204j65709m77888Q7750l8808J46814P5165Q9202o6970
$$ -289168 21622 199826 34117 -443771 -356021 -394829 -248015 -172850 -83648 -150618
14730a50618O0566j14802O9210L1036K2053K33276q2707K21416K11493k89797
$$ -150618 -90052 -204854 -135644 -104608 -82555 150721 68014 289430 500923 211126
14720B11126j53196M912j43966m1338J22480n6342k04894j73878m8311j2010L21992
$$ 211126 57930 62842 -81124 -122462 18 -56324 -261218 -435096 -483407 -495417 -173425
14709a73425K72706k07360R452N1862R1252J86608R6586K06592j80074l16896
$$ -173425 99281 -108079 -98627 -46765 44487 231095 327681 534273 354199 37303
14699C7303p0043Q2860O9086L245k12558p6153j35311J29164m2858j2130J19854
$$ 37303 -32740 50120 119206 122451 -90107 -166260 -301571 -172407 -215265 -227395 -107541
14688a07541J98146o0187J0115O1227j61282j15181N0716j35743k0466K64039
$$ -107541 90605 30418 40533 101760 -59522 -174703 -123987 -259730 -280196 -16157
14678a6157J59146q6047N8824J43089K8047l06834k25661J97465K22593j5629
$$ -16157 142989 56942 115766 258855 286902 -19932 -245593 -48128 174465 158836
14668A58836r1110j03682n2051n1229J74462j80473k0213R1812l5797M2206O1813
$$ 158836 67726 -35956 -88007 -139236 35226 -145247 -165460 -73648 -109445 -67239 -5426
14657e426P355L3748R6263m2098k14507l4344j85369J2159J6332R4862M7398P8765
$$ -5426 1929 35677 131940 89842 -124665 -159009 -344378 -332219 -315887 -221025 -173627 -94862
14645i4862R2922j57197k52453J41905J45234J27150K23121p1530j65641l26419
$$ -94862 -1940 -159137 -411590 -269685 -124451 2699 225820 154290 -11351 -337770
14635c37770k4375P795M7400Q8503J69872j26387N7004k03364j43138P3658L57141
$$ -337770 -362145 -354350 -306950 -218447 -48575 -174962 -117958 -321322 -464460 -390802 -33661
14624c3661K11103J4246j20566j47177j13121n5966j4674J70666Q0087J48682
$$ -33661 177442 191688 71122 -76055 -189176 -245142 -259816 -89150 -9063 139619
14614A39619M339n7944j76620j5309J04048L011J78196K40087L62123q1729l22874
$$ 139619 143958 86014 -90606 -105915 -1867 1144 179340 419427 781550 699821 376947
14603C76947k90266n8881K49672J98051k45318r3554M8342l1162N0617j32197
$$ 376947 86681 27800 277472 475523 230205 136651 184993 153831 204448 72251
14593G2251o1978p0221k0219k62796o1968M4105K71856J90211P2942k4916J03107
$$ 72251 10273 -59948 -80167 -342963 -404931 -360826 -88970 101241 174183 149267 252374
14582B52374K195j23393j33182j96515R7627P233R0351r409k78199o0400K8371
$$ 252374 254569 131176 -2006 -198521 -100894 -93661 -3310 -12719 -290918 -351318 -322947
14571c22947K46869J82529j48363j29099m0519j90298j1536J32990J24025K08236
$$ -322947 -76078 106451 -41912 -171011 -211530 -401828 -413364 -280374 -156349 51887
14561E1887K68041j11095J7879j7046j65607K38652J56835j49057k80828j7075
$$ 51887 319928 208833 226712 209666 44059 282711 439546 290489 9661 -7414
14551g414k7925J14727J34323J27714j16336k11862k61925k34223J70049j3491
$$ -7414 -35339 79388 213711 341425 225089 13227 -248698 -482921 -312872 -326363
14541c26363K656J59874o2353K541n9953j23125M2915J50862O3284R978N4798
$$ -326363 -323707 -163833 -226186 -223645 -283598 -406723 -363808 -212946 -149662 -139684 -84886
14530h4886K6405L1535J74092l79543j84270J60163J19896l4078N9454n4525j04635
$$ -84886 -58481 -26946 147146 -232397 -416667 -256504 -136608 -170686 -111232 -165757 -270392
14519b70392j4110J37876N0668J43105O0284p583j99889J45326k7189j50780n5946
$$ -270392 -284502 -146626 -95958 47147 107431 99848 -100041 45285 18096 -132684 -188630
14508a88630J8200L5189J87169j6272m3570j29186l62062M26220J81248o6365
$$ -188630 -170430 -135241 51928 35656 -7914 -137100 -499162 -72942 108306 41941
14498D1941j7919J68494j11620j60414n226K6745J5053o956P197q9329k12222
$$ 41941 24022 192516 80896 -79518 -84744 -57999 -42946 -49902 -42705 -132034 -344256
14487c44256J64746K92550j40014k3457o9891j48526J80582J40205l14687k31109
$$ -344256 -179510 113040 -26974 -50431 -120322 -268848 -88266 51939 -262748 -493857
14477d93857L3086N5060J94113J70743j01446j97487K4299Q5430m334j23020J49681
$$ -493857 -460771 -405711 -211598 -40855 -142301 -339788 -315489 -230059 -234393 -357413 -207732
14466b07732K03974N1083n3422J01246k74978l36630m4860K22713M72382J92991
$$ -207732 -3758 47325 -6097 95149 -179829 -516459 -561319 -338606 133776 326767
14456C26767j00007k98046J13431l862o3757J15498j7035L2445j02853p8419r251
$$ 326767 226760 -71286 42145 38283 -25474 90024 72989 105434 2581 -75838 -85089
14445h5089j76189p2377K38037L8155R730j56295j60311o6637J23582j16121P8000
$$ -85089 -261278 -333655 -95618 -57463 -47733 -204028 -364339 -430976 -307394 -423515 -345515
14434c45515O0102r6950K96511K60527j22501k60432m2259M2415l847J85027M3374
$$ -345515 -285413 -382363 -85852 174675 52174 -208258 -250517 -208102 -211949 -26922 16452
14423A6452L4509j62341k83487J87540Q5318R0512m5209l2281J36142J39769j664
$$ 16452 50961 -111380 -394867 -207327 -122009 -31497 -76706 -108987 27155 166924 165260
14412A65260l34447l7313K8901J52168j2707j14777K44155m3085o2557j94516
$$ 165260 -169187 -206500 -177599 -25431 -38138 -152915 91240 48155 -14402 -208918
14402b08918Q3280J16948J33745r8977j1154J67032J95086j46220k47972k02458
$$ -208918 -125638 -8690 125055 26078 14924 181956 377042 230822 -17150 -219608
14392b19608m1402j77087K9774K05090K94283N5303j78112j49425J6313J42702
$$ -219608 -261010 -438097 -408323 -203233 91050 146353 -31759 -181184 -164871 -22169
14382b2169J81086J6321l0121P7199j46952k01413J15247O8107O2353j9698q8950
$$ -22169 158917 175238 145117 222316 75364 -126049 -10802 57305 119658 99960 11010
14371A1010N8909J30712j58104k42603k0482k6908O5607Q4142j80125J9682j46682
$$ 11010 69919 200631 42527 -200076 -220558 -247466 -181859 -97717 -277842 -258160 -404842
14360d04842j0420R7944J771J35003K7629K34792M1306j19515J65934m911J037
$$ -404842 -415262 -317318 -315547 -180544 -152915 81877 123183 3668 169602 164691 165728
14349A65728l17251k19133n3087J70524R0134j35396N315J31640J0643j9151J15505
$$ 165728 -151523 -370656 -423743 -253219 -163085 -298481 -293166 -161526 -150883 -170034 -54529
14338e4529j49322J89959l6152k01042J63315L8806q7542j51644J25359K99110
$$ -54529 -203851 -13892 -50044 -251086 -87771 -48965 -136507 -288151 -162792 136318
14328A36318K17488p4364L7268k20848k02342J04883J82067j33486j03245L01573
$$ 136318 353806 279442 316710 95862 -106480 -1597 180470 46984 -56261 245312
14318B45312P6926k62269k08646J87171J80077R8891j71141J24275O9231k10307
$$ 245312 322238 59969 -148677 38494 218571 317462 146321 270596 339827 129520
14308A29520j42430J61887j32236k92238o4701K59152L07270j84964l28102K6423
$$ 129520 -12910 148977 16741 -275497 -340198 -81046 226224 41260 -286842 -260419
14298b60419J44505m2963K6803J36044J75424r0611n0775j5128l4791j1770j24073
$$ -260419 -115914 -158877 -132074 3970 179394 88783 38008 22880 -11911 -23681 -147754
14287a47754J22969j45835J85789L11335l2992l10772j05132R4595J09082K3797
$$ -147754 -24785 -170620 15169 326504 293512 -17260 -122392 -27797 81285 105082
14277A05082J03970J21795N3187j32114n7197k34615o9110m1431K17131J16932
$$ 105082 209052 330847 384034 251920 194723 -39892 -109002 -150433 66698 183630
14267A83630L7838r4265Q3972m5454j73360m6889o613k28144J3009r5859J41141
$$ 183630 221468 127203 211175 165721 -7639 -54528 -61141 -289285 -276276 -372135 -230994
14256b30994L21130j56284j14393K01260j1584k91184Q3975J39880J88549j0814
$$ -230994 90136 -66148 -180541 20719 9135 -282049 -198074 -58194 130355 119541
14246A19541k04648N0854K64935J3141l18427j62116J28028j67579k29977J93734
$$ 119541 -85107 -34253 230682 243823 -74604 -236720 -108692 -276271 -506248 -312514
14236c12514N9229Q5642J05141K00055J24041R3917j53993p4692j76148K474J10798
$$ -312514 -253285 -167643 -62502 137553 261594 355511 201518 126826 -49322 -46848 63950
14225F3950l0176r156j25412J92543J46298k1978r4447p948R3642j50765n1759
$$ 63950 33774 24618 -100794 91749 238047 216069 121622 113674 207316 56551 4792
14214D792O2366P1434p901J9483n4356Q6137K6326j30118J42823m7625j32668
$$ 4792 67158 138592 130691 150174 95818 181955 208281 78163 220986 173361 40693
14203D0693r7349o5384j62125J23348K96040J49198r8026k6175j21054r6269r5172
$$ 40693 -56656 -122040 -284165 -160817 135223 284421 186395 160220 39166 -57103 -152275
14192a52275M5661m6659J06461P6685j18067k07344N1924K52268Q1045r5499j04372
$$ -152275 -106614 -153273 -46812 29873 -88194 -295538 -243614 8654 89699 -5800 -110172
14181a10172m9634K808k10410j92780O0132K46582j28027J84719L6616J38876
$$ -110172 -159806 -156998 -367408 -560188 -500056 -253474 -381501 -196782 -160166 -21290
14171b1290O4458k0817j26250L1619q2008k502j15309l8312L6971q4221N22925
$$ -21290 43168 22351 -103899 -72280 -154288 -156790 -272099 -310411 -273440 -357661 165264
14160A65264O9959j34249k86959l98678k1627L46541K95112R1410P6601M2530
$$ 165264 235223 100974 -185985 -584663 -606290 -259749 35363 126773 203374 245904
14150B45904r7445R0382k63058j31451K61693J0836j79366P1437P3903j3071l61944
$$ 245904 148459 238841 -24217 -155668 106025 116861 -62505 8932 82835 69764 -292180
14139b92180k51582J71798J41779r146k105J76988o5293J28499R8281q2666M8547
$$ -292180 -543762 -371964 -230185 -239331 -241436 -64448 -129741 -1242 97039 14373 62920
14128F2920J17211k6507l22048k59113j1873J10946J83836K47442j89828j01915
$$ 62920 180131 153624 -168424 -427537 -439410 -328464 -144628 102814 -87014 -188929
14118a88929J20345J02939P6457j21274O4945R8566J55143M0713j56945q1759
$$ -188929 -68584 34355 110812 -10462 54483 153049 308192 348905 191960 110201
14108A10201k25345n7482k8414j44423K8596m5781J92143J11520n3315j02259
$$ 110201 -115144 -172626 -201040 -345463 -316867 -362648 -170505 -58985 -112300 -214559
14098b14559o8522m8879J08819K96694J60265l0614k35453j55802L8641L0525
$$ -214559 -283081 -331960 -223141 73553 233818 203204 -32249 -188051 -149410 -118885
14088a18885Q8698K24902l14036n8468r419J18301K48037j73630l38906M3688
$$ -118885 -30187 194715 -119321 -177789 -187208 -68907 179130 5500 -333406 -289718
14078b89718L7187j2822J89600J47536L2382j85925n7596O9660M1526R7048j91252
$$ -289718 -252531 -265353 -75753 71783 104165 -81760 -139356 -69696 -28170 68878 -122374
14067a22374L8273o1124r187J96525N6012j10440o429j02544k74889k65677K15476
$$ -122374 -84101 -145225 -154412 42113 98125 -12315 -18744 -121288 -396177 -661854 -446378
14056d46378K20246P13J31208J39300Q112J76075J26313m6242j30478j90136n461
$$ -446378 -226132 -225419 -94211 45089 53201 229276 355589 309347 178869 -11267 -16728
14045a6728J04678J03524q3936N1143Q6631j35388j6711R6917j24479j51653J41585
$$ -16728 87950 191474 107538 158681 245312 109924 93213 190130 65651 -86002 55583
14034E5583k07058n1796K46380J61333k00330o5255J51704M6417j09557j55722
$$ 55583 -151475 -203271 43109 204442 4112 -61143 90561 136978 27421 -128301
14024a28301j330K07094O7612j1484J9877N72J43239p398M6289j25720j06781
$$ -128301 -129631 77463 145075 133591 153468 154040 297279 289881 336170 210450 103669
14013A03669j57073k39000j41894J1110J62214R2796J85807P3493j89623K89089
$$ 103669 -53404 -292404 -434298 -423188 -260974 -168178 17629 91122 -98501 190588
14003A90588J11866j94941j41852J43667k05990j61704M1934M6132R9312M1824
$$ 190588 302454 107513 -34339 109328 -96662 -258366 -216432 -170300 -70988 -29164
13993b9164j7411L08056n4557L5418q0917o7066J18822o7378j45270j18851j02311
$$ -29164 -46575 261481 206924 242342 161425 94359 213181 145803 533 -118318 -220629
13982b20629K26006J23589J60439P3592k13997J6869j26427m44498q27K52039
$$ -220629 5377 128966 289405 362997 149000 165869 39442 -405056 -405883 -153844
13972a53844K02100K54098J41306O6617k66211M8165N5378J22936J4679l19466
$$ -153844 48256 302354 443660 510277 244066 292231 347609 470545 485224 165758
13962A65758j93263K15091M04173l3395m37548k2079J00576L5829m8864n9420
$$ 165758 -27505 187586 591759 558364 120816 98737 199313 235142 186278 126858
13952A26858j05363j63451M1425L98518J32289n2852o2289r9034j804j23044j58684
$$ 126858 21495 -141956 -100531 297987 430276 377424 315135 216101 214297 91253 -67431
13941f7431R8393L033N6668J12949k5784k44691j9938K78348J01454J73466m0741
$$ -67431 30962 33995 90663 203612 177828 -66863 -86801 191547 293001 466467 425726
13930D25726k33892K9896j88881k83799K830j4494m2060N2968R7114j16814J6975
$$ 425726 191834 221730 32849 -250950 -248120 -262614 -304674 -251706 -154592 -271406 -254431
13919b54431J17845j21641r4147N6468Q4951Q9490L0665L2822r1167o0337N4988
$$ -254431 -136586 -258227 -352374 -295906 -210955 -121465 -90800 -57978 -149145 -209482 -154494
13908a54494J05176k5782k33200J58088l920L6729O7051J07772p9416k36052j45710
$$ -154494 -49318 -75100 -308300 -150212 -154132 -117403 -50352 57420 -21996 -258048 -403758
13897d03758j18179o8992K18404J42712m13484o2821L74597Q1201o6765L43585
$$ -403758 -521937 -590929 -372525 -229813 -643297 -706118 -331521 -250320 -317085 26500
13887B6500P9837j75017r8122R2524J2405J19777N2534k74029j46891j34808J93414
$$ 26500 106337 -68680 -166802 -74278 -61873 57904 110438 -163591 -310482 -445290 -251876
13876b51876O7180p6482j7832n3135J0878q9557K47322n2945j38388K1197J48783
$$ -251876 -184696 -261178 -279010 -332145 -321267 -410824 -163502 -216447 -354835 -333638 -184855
13865a84855K58091O3118k05886j25420j00165J9903J70119J07388k69247j55546
$$ -184855 73236 136354 -69532 -194952 -295117 -275214 -105095 2293 -266954 -422500
13855d22500J09450P7933o162J56762J69899K57576j83782j25127o7569M211P9748
$$ -422500 -313050 -235117 -241279 -84517 85382 342958 159176 34049 -33520 -29309 50439
13844E0439J00185J86099Q5077j3092k52759k62885j08131J4183M9461N1372n0885
$$ 50439 150624 336723 421800 408708 155949 -106936 -215067 -200884 -151423 -100051 -150936
13833a50936l4349J3484K7771J49056j78380k62519L4953J91814J09364l7389
$$ -150936 -185285 -171801 -144030 5026 -173354 -435873 -400920 -209106 -99742 -137131
13823a37131j15759N0888j83836M5264R3820j41205q1060K49845j6657o870Q6946
$$ -137131 -252890 -202002 -385838 -340574 -246754 -387959 -469019 -219174 -235831 -242701 -155755
13812a55755J97425J4916Q4731j59862j98875l910m4536J26141O3728J08067j60402
$$ -155755 41670 56586 141317 -18545 -217420 -221330 -265866 -139725 -75997 32070 -128332
13801a28332k26822l1061K07836P1349n005L1489j45537j32850Q1475o9497J0722
$$ -128332 -355154 -386215 -178379 -107030 -112035 -80546 -226083 -358933 -277458 -346955 -336233
13790c36233j24355J14986J73567L11749R8012j69063k85670j63058j55237J86092
$$ -336233 -460588 -345602 -172035 139714 237726 68663 -217007 -380065 -535302 -349210
13780c49210J00456k04867Q7211J20326J84759j3480N8747j5897o7815m7155o84
$$ -349210 -248754 -453621 -366410 -246084 -61325 -74805 -16058 -31955 -99770 -146925 -147609
13769a47609N0378m4277r7063J12090J85905j12243Q9681r5067Q3380L2530j08119
$$ -147609 -97231 -141508 -238571 -126481 59424 -52819 36862 -58205 25175 57705 -50414
13758e0414L63O377o4547R5151Q4507n4146K7643J38087o1325k27273J09396q434
$$ -50414 -50051 -43674 -108221 -13070 71437 17291 44934 183021 121696 -105577 3819 -4615
13746d615K6435q9655j06471K40881m09093K5214J90202j3817K76922J28057l64447
$$ -4615 21820 -67835 -174306 66575 -342518 -317304 -127102 -140919 136003 264060 -100387
13735a00387l2145Q2365J05293J15555k3167L7339M479K6862j06979j81308j20397
$$ -100387 -132532 -50167 55126 170681 147514 184853 189332 216194 109215 -72093 -192490
13724a92490l06417K67672M24649l8910n3295L3512Q8272j7941q7122L5213l7709
$$ -192490 -498907 -231235 193414 154504 101209 134721 222993 205052 117930 153143 115434
13713A15434k00662k37488J78291N2149N2173O8955P8416k23006j43233r5591
$$ 115434 -85228 -322716 -144425 -92276 -40103 28852 107268 -115738 -258971 -354562
13703c54562N8489J58657J53144R0229J75392L01363q2966l02290l1739P9568
$$ -354562 -296073 -137416 15728 105957 281349 582712 499746 197456 165717 245285
13693B45285l01613J62515p7977N515j29459J34613M7189k27592L7225R4042k0898
$$ 245285 -56328 106187 28210 33725 -95734 38879 86068 -141524 -104299 -10257 -31155
13682c1155Q0412K63335j19421O4350Q9591k00697j80232k44175l06138Q1688
$$ -31155 49257 312592 193171 257521 347112 146415 -33817 -277992 -584130 -502442
13672e02442K85951K89679J77405M9432q5261n4190q7488m083j3042J61740j71565
$$ -502442 -216491 73188 250593 300025 214764 160574 73086 69003 55961 217701 46136
13661D6136j32644j00446J20370j2319J2272J6870R2290j5372k31166N1324J60216
$$ 46136 -86508 -186954 -66584 -78903 -66631 -49761 42529 27157 -204009 -152685 7531
13650G531L9338k08790J05737O3526J54599j27666J26104N54416j34022j10714
$$ 7531 46869 -161921 -56184 7342 161941 34275 160379 714795 580773 470059
13640D70059j90585k37136k1806J36315J04119K07709k724k11232n5928J33548
$$ 470059 279474 42338 20532 156847 260966 468675 465951 254719 198791 332339
13630C32339L2269l8776j79346l73489k50355J53984K14239j9061R9411L90643
$$ 332339 364608 325832 146486 -227003 -477358 -323374 -109135 -128196 -28785 361858
13620C61858J5345j82295j75743R0593L47159K63536o7239k09715k30551m1761
$$ 361858 377203 194908 19165 109758 456917 720453 653214 443499 212948 171187
13610A71187N551j04537J44219J99456k1151j79912p8251j38938j03914j39496
$$ 171187 176738 72201 216420 415876 394725 214813 136562 -2376 -106290 -245786
13600b45786p9295n9544J00794J03504J82889J56142n3427k66498M7876M3058
$$ -245786 -325081 -384625 -283831 -180327 2562 158704 105277 -161221 -113345 -70287
13590g0287J1187J12822Q2699k10823j1585J55917J33294r907k0398j45070r8613
$$ -70287 -59100 53722 136421 -74402 -85987 69930 203224 193317 172919 27849 -70764
13579g0764J49569M044n6364J52585R8532P1749J72635J29649j61212o2282Q4613
$$ -70764 78805 82849 26485 179070 277602 349351 521986 651635 490423 428141 512754
13568E12754k01447n8608m7718k1906j25228J48482l3952j51468j40821R3036
$$ 512754 311307 252699 204981 183075 57847 206329 172377 20909 -119912 -26876
13558b6876K72656o4074l41056l5379R5485K05491o2638j54251M0527N5556J50583
$$ -26876 245780 181706 -159350 -194729 -99244 106247 43609 -110642 -70115 -14559 136024
13547A36024j83618m9292m3366J58967k05332J18318R6719k8186K99414L89192
$$ 136024 -47594 -96886 -140252 18715 -186617 -68299 28420 234 299648 688840
13537F88840j62130k16547k02742R0832N6192m5328P7726j45248j07137n4793
$$ 688840 526710 310163 107421 198253 254445 209117 286843 141595 34458 -20335
13527b0335q9156o3327j4955K3358K10600m5071N6037j328O3437j95721m1414
$$ -20335 -109491 -172818 -187773 -164415 46185 1114 57151 55823 119260 -76461 -117875
13516a17875L31172J7671N0947Q3019j8912p5083r0728L7702j13371j28644j32665
$$ -117875 213297 230968 281915 364934 346022 270939 180211 217913 104542 -24102 -156767
13505a56767K83624J02888J6818j75161J96856r1455n6995k02333j65250J62327
$$ -156767 126857 229745 246563 71402 268258 176803 119808 -82525 -247775 -85448
13495h5448L6594j390K77045M3704k85859j50602n8533K07498J10926N7144Q7170
$$ -85448 -48854 -50244 226801 270505 -15354 -165956 -224489 -16991 93935 151079 238249
13484B38249k2019P3745r7070k3646j38447K77196K46949m8085m03241k35055
$$ 238249 216230 289975 192905 169259 30812 308008 554957 506872 103631 -131424
13474a31424L9817N5466k3548r3696N330k01966k3533K40241q5331j64858j21550
$$ -131424 -91607 -36141 -59689 -153385 -148055 -350021 -373554 -133313 -218644 -383502 -505052
13463e05052J65060n079m4217j39017l7595L05765k668j55824K19722K85119K34010
$$ -505052 -339992 -345071 -389288 -528305 -565900 -260135 -262803 -418627 -198905 86214 320224
13452C20224J24205k9992j75890l73562l5619m4400J43319J34158R2963J7783
$$ 320224 444429 414437 238547 -135015 -170634 -215034 -71715 62443 155406 173189
13442A73189k49636j90843O3555J14991j9201j95470j20866J62687L46628M30375
$$ 173189 -76447 -267290 -203735 -88744 -107945 -303415 -424281 -261594 85034 515409
13432E15409o3231k50074N6788n7861l52585k41660N8807K82358N5298o228J49851
$$ 515409 452178 202104 258892 201031 -151554 -393214 -334407 -52049 3249 -2979 146872
13421A46872j19284j55755J6820l4176J37782K16045j7060Q3188j61033q8253
$$ 146872 27588 -128167 -111347 -145523 -7741 208304 191244 274432 113399 25146
13411B5146J15769J45821o2214k5858j07056m2069l9331J97988J18395n4419l19172
$$ 25146 140915 286736 224522 198664 91608 49539 10208 208196 326591 272172 -47000
13400d7000m75312j59436J59896J59707O9586J07914M39737J4281k77024j64202
$$ -47000 -522312 -681748 -521852 -362145 -292559 -184645 255092 269373 -7651 -171853
13390a71853M0658M3333p6877j76425k7991L2634K35951L8614J5757l7519M8126
$$ -171853 -131195 -87862 -164739 -341164 -369155 -336521 -100570 -61956 -46199 -83718 -35592
13379c5592q1925K1534L08849J30612r8078j92599n8580J6693J21747R5811k28534
$$ -35592 -117517 -95983 212866 343478 245400 52801 -5779 10914 132661 228472 -62
13368f2k1977J20281Q5213J0405k95434k41101K25133M6849J20492K33056O7990
$$ -62 -22039 98242 183455 193860 -101574 -342675 -117542 -70693 49799 282855 350845
13357C50845l03831L2373M3024k2614J1198k0788R1080j91406K75031J46043N3940
$$ 350845 47014 79387 122411 99797 110995 90207 181287 -10119 264912 410955 464895
13346D64895J38801n9625k43346o9395j69715m6417Q9489J98676p5505J5386l606
$$ 464895 603696 544071 300725 231330 61615 15198 104687 303363 227858 243244 239638
13335B39638j35318l27660O9066K53475M2723o8902o4244q5874R5186K02015N862
$$ 239638 104320 -223340 -154274 99201 141924 73022 8778 -77096 18090 220105 225967
13324B25967k47481j90288J82525J22723K66282n5708j44259J00143O0385p2785
$$ 225967 -21514 -211802 -29277 93446 359728 304020 159761 259904 320289 247504
13314B47504j73156j3867J03268J42903m277l16920o1985J84529L0181K7238K3767
$$ 247504 74348 60481 163749 306652 302375 -14545 -76530 107999 138180 165418 189185
13303A89185l7281N0465K53669J96592j46428k77741L0892r4712l3995Q2944j52224
$$ 189185 151904 202369 456038 652630 506202 228461 259353 164641 130646 213590 61366
13292F1366q6937j46891R5098J88312J36064M999l4901q2729N6953R0420j07209
$$ 61366 -25571 -172462 -77364 110948 247012 252011 217110 134381 191334 281754 174545
13281A74545k7704J35127M7657k02538o2782K73698J7605j52289j19002m2074
$$ 174545 146841 281968 329625 127087 64305 338003 355608 203319 84317 42243
13271D2243j91796j47294K24878K11674j95536j64960N4646j51275N4450r5842
$$ 42243 -149553 -296847 -71969 139705 -55831 -220791 -166145 -317420 -262970 -358812
13261c58812k7913J87147J12230J07125o8805o4419Q3672Q9893o2447M4668K40418
$$ -358812 -386725 -199578 -87348 19777 -49028 -113447 -29775 60118 -2329 42339 282757
13250B82757j84467J8081Q4563K7518k15025q0061l5272j57540L362M0928K1073
$$ 282757 98290 116371 200934 228452 13427 -66634 -101906 -259446 -256084 -215156 -194083
13239a94083R2338L8865J43561J76582K39012j60163j62148k15058n2024J350
$$ -194083 -101745 -62880 80681 257263 496275 336112 173964 -41094 -93118 -91768
13229i1768J21649k4523Q4773k0372J70048L2014r1238j71494n8367j5017R4086
$$ -91768 29881 5358 90131 69759 239807 271821 180583 9089 -49278 -64295 29791
13218B9791J75954n1299l27734k8048j9572J29918J39528j14806N3815J58225
$$ 29791 205745 154446 -173288 -201336 -220908 -90990 48538 -66268 -12453 145772
13208A45772R8520J62057n9160l61148j78141N5577K90058M3934k09356j07796
$$ 145772 244292 406349 347189 -13959 -192100 -136523 153535 197469 -11887 -119683
13198a19683J71582J90245j65455r8101j1891P5237K56653j3065j91112j7263
$$ -119683 51899 242144 76689 -21412 -33303 41934 298587 285522 94410 77147
13188G7147q4680k1839k3367R6446K0240j13675P299J4054k3711K69100K5838
$$ 77147 -7533 -29372 -52739 43707 63947 -49728 -42429 -28375 -52086 217014 242852
13177B42852L6185j8454K15558k01980j66802j64533J67670q8048N2231K9040
$$ 242852 279037 260583 476141 274161 107359 -57174 110496 22448 74679 103719
13167A03719J82452j1408j32915j90257j05698r019m6423K433K73483O1052k85370
$$ 103719 286171 274763 141848 -48409 -154107 -163126 -209549 -207116 66367 127419 -157951
13156a57951J85802J00814j61125j86888K19117L69232J35170n6431j66150k0231
$$ -157951 27851 128665 -32460 -219348 -231 369001 504171 447740 281590 261359
13146B61359q5481k36250j53700J939J92574R6761J361j19619k65845j5779q9888
$$ 261359 175878 -60372 -214072 -212133 -19559 77202 78563 -41056 -306901 -322680 -412568
13135d12568m2501J53595K4186K75530j74779N6601K32270j0261l7934P8288j48921
$$ -412568 -455069 -301474 -277288 -1758 -176537 -119936 112334 102073 64139 142427 -6494
13124f494O3297J64760l8590o1999j55442n3069k39005m1692j72600j50353J66887
$$ -6494 56803 221563 182973 120974 -34468 -87537 -326542 -368234 -540834 -691187 -524300
13113e24300P9494L00548J16253k7233L3906M730K6259o3944p0571Q9687j27474
$$ -524300 -444806 -144258 -28005 -55238 -21332 -16602 9657 -54287 -124858 -35171 -162645
13102a62645k17899M185J05152J91435P5307J87319j1411J99478J10889j53396
$$ -162645 -380544 -376359 -271207 -79772 -4465 182854 171443 370921 481810 328414
13092C28414k60708O5491J67554j50121K8607K58101L3616j07363j71161q3777
$$ 328414 67706 133197 300751 150630 179237 437338 470954 363591 192430 108653
13082A08653j63626J73071J42752p0796k13285k62236N0661J90917L32703K78535
$$ 108653 -54973 118098 260850 190054 -23231 -285467 -234806 -43889 288814 567349
13072E67349j30231l65815k93918R0791M6951j43551M5342J2069k65154L17598
$$ 567349 437118 71303 -222615 -131824 -84873 -228424 -183082 -171013 -436167 -118569
13062a18569J44218o8179J38395q6722j90065j00465K14295p251l4105n3249p0047
$$ -118569 25649 -42530 95865 9143 -180922 -281387 -67092 -74343 -108448 -161697 -231744
13051b31744q54K16875J47427J57570J08909j35439k97455l6542J47950n3173
$$ -231744 -232598 -15723 131704 289274 398183 262744 -34711 -71253 76697 23524
13041B3524k20885j76934L2260J70556L42969J05254J23655n8890m9948j73319
$$ 23524 -197361 -374295 -342035 -171479 171490 276744 400399 341509 291561 118242
13031A18242J74548r4475l2229J31144J29433N7257j44827p4263K2167J71731
$$ 118242 292790 198315 166086 297230 426663 483920 339093 264830 286997 458728
13021D58728j42864j38807m7732o0957j32837K17629k86210k32064O6653O6131
$$ 458728 315864 177057 129325 68368 -64469 153160 -133050 -365114 -298461 -232330
13011b32330n9036J6052j67546L63650P1580j00479P6524J60392J85111K4859
$$ -232330 -291366 -275314 -442860 -79210 -7630 -108109 -31585 128807 313918 338777
13001C38777j87825P331J34120K57798O2329k79137j62081L0994j69756j43778
$$ 338777 150952 158283 292403 550201 612530 333393 171312 202306 32550 -111228
12991a11228J03651K54195Q8354j60975O377o1682l3048l1675j8345K3543J87222
$$ -111228 -7577 246618 334972 173997 180374 118692 85644 53969 35624 59167 246389
12980B46389k65649m9266J61622J6028J59702J54760q10j73026m18438j28123
$$ 246389 -19260 -68526 93096 109124 268826 423586 422776 249750 -168688 -296811
12970b96811J21908O5628L51622O4320q0351k22896j61507P6826J87022J53773
$$ -296811 -174903 -109275 242347 306667 226316 3420 -158087 -81261 105761 259534
12960B59534q8995n8530J24324R4195m1126J41128o2461o8982j06727l19362o678
$$ 259534 170539 112009 236333 330528 289402 430530 368069 299087 192360 -127002 -133680
12949a33680J97266M3789J4779O4177l2774l4377L2841q964J85999J04980N9042
$$ -133680 63586 107375 122154 186331 153557 119180 152021 143057 329056 434036 493078
12938D93078o1384j47746j30389r2864l1634J07837q8510j46683j42468J57921
$$ 493078 431694 283948 153559 60695 29061 136898 48388 -98295 -240763 -82842
12928h2842K6726k9834j13770j67519J02860J18345q293j0743o6969j13818j44304
$$ -82842 -56116 -85950 -199720 -367239 -264379 -146034 -154327 -165070 -232039 -345857 -490161
12917d90161K37790K72753J68033J39161k03909L6949J7913l2268r6009j96288
$$ -490161 -252371 20382 188415 327576 123667 160616 178529 146261 50252 -146036
12907a46036J02625n2865J02628K85182Q5278j41020k24735J09191J69971Q482
$$ -146036 -43411 -96276 6352 291534 376812 235792 11057 120248 290219 298701
12897B98701O4913o2165j89974j40074M7476K751j22190m1626j29235j21567J16369
$$ 298701 363614 301449 111475 -28599 18877 21628 -100562 -142188 -271423 -392990 -276621
12886b76621K36543J95387j8955l43828j61352r574K29435N4667N9491k57217
$$ -276621 -40078 155309 136354 -207474 -368826 -378400 -148965 -94298 -34807 -292024
12876b92024l9975J00696R1900m7241J82365J82380j0700m0171j02041k08089
$$ -292024 -331999 -231303 -139403 -186644 -4279 178101 167401 127230 25189 -182900
12866a82900J00474L66914J41202j79462q5449q924L0957n1978Q253J0273j46225
$$ -182900 -82426 284488 425690 246228 160779 151855 182812 130834 139087 149360 3135
12855C135P6573N9924J23772k8563j46235j45869p8671j5612j0014Q4473J44493
$$ 3135 79708 139632 263404 234841 88606 -57263 -135934 -151546 -161560 -77087 67406
12844F7406j64614j23288J78024J09800j3321L0945K18538R5903j94076j56521
$$ 67406 -97208 -220496 -42472 67328 54007 84952 303490 399393 205317 48796
12834D8796J1095l4217K4523J60065J52558n9594j00121q7945o8419K49865K1457
$$ 48796 59891 25674 50197 210262 362820 303226 203105 115160 46741 296606 318063
12823C18063K2685J07971j77670j22911o2850r2206j09108j9282R6995R8005j05573
$$ 318063 340748 448719 271049 148138 85288 -6918 -116026 -135308 -38313 59692 -45881
12812d5881N8831j92722k0392m9024K88207J59107L4756J10331j08224R2220l8169
$$ -45881 12950 -179772 -200164 -249188 39019 198126 232882 343213 234989 327209 289040
12801B89040j05259r8834k906L2921M4508N2424N3360J44935n4195j45455j64754
$$ 289040 183781 84947 82041 114962 159470 211894 265254 410189 355994 210539 45785
12790D5785J53512O2559j36782q8475m28k3121p3495O4228J43019L3546k33690
$$ 45785 199297 261856 125074 36599 36171 13050 -60445 3783 146802 180348 -53342
12779e3342O9082R816R6961m4466n6734M9289R1733J74818L5446j05631n7557
$$ -53342 15740 25556 122517 78051 21317 70606 162339 337157 372603 266972 209415
12768B09415r1689o0596j9787n9268k1069L7597k0213p1789J43371Q0669j3697
$$ 209415 117726 57130 37343 -21925 -42994 -5397 -25610 -97399 45972 126641 112944
12757A12944Q2668J37803K216J14294j23580l34849r2960p0580m5217K229J02721
$$ 112944 195612 333415 335631 449925 326345 -8504 -101464 -172044 -217261 -215032 -112311
12746a12311O8138m9121J2367J70450k41477M273J47944K9442M1163k4909M1034
$$ -112311 -44173 -93294 -80927 89523 -151954 -147681 263 29705 70868 45959 86993
12735H6993K0954M4015J23562j77321j87535J94962J64365Q8865R5073j30769
$$ 86993 107947 151962 275524 98203 -89332 105630 269995 358860 453933 323164
12725C23164k90976K7474J99473k3467M27800J91781j26686j31756Q976k04026
$$ 323164 32188 59662 259135 235668 663468 855249 728563 596807 605783 401757
12715D01757l49065r3973n4071N2077J27973M5994l5038q2141J50876k3669R891
$$ 401757 52692 -41281 -95352 -43275 84698 130692 95654 13513 164389 140720 150611
12704A50611o3242q613N4450J58422K80824J78753j12515Q7528j28062k59668
$$ 150611 87369 78756 133206 291628 572452 751205 638690 726218 598156 338488
12694C38488J84391q4783L7436J73033j75547j21068j06757M9041o7510q4489
$$ 338488 522879 438096 475532 648565 473018 351950 245193 294234 226724 142235
12684A42235p0442O5776Q9059N6727r4506j49115k02544M8078Q1744j52494J35968
$$ 142235 71793 137569 226628 283355 188849 39734 -162810 -114732 -32988 -185482 -49514
12673d9514J48034L0260p3733P2j9580m7176o6068k8801O798N735J33854J29548
$$ -49514 98520 128780 55047 55119 35539 -11637 -77705 -106506 -99708 -93973 39881 169429
12661A69429K61027Q1394J00754J38564j97356j79509L7821J2691j85531J7893
$$ 169429 430456 511850 612604 751168 553812 374303 412124 424815 239284 257177
12651B57177q2524n5970k01720J04319J25688R6938k1285k69655q306j75544o403
$$ 257177 174653 118683 -83037 21282 146970 243908 222623 -47032 -55338 -230882 -237285
12640b37285L35914Q7723L53151o9207j76837K10471R6270L5035j40432k90518
$$ -237285 98629 186352 539503 470296 293459 503930 600200 635235 494803 204285
12630B04285k10358K8747L18587J04586k94590j2281J48344m9809M0182J70349
$$ 204285 -6073 22674 341261 445847 151257 138976 287320 237511 277693 448042
12620D48042n1315o3343M5507K0046j5841J46809J31059o1133j62892k73000J16783
$$ 448042 396727 333384 378891 398937 383096 529905 660964 599831 436939 163939 280722
12609B80722n4737R6186M4504l66082K11595Q6705j35084j05188Q2003J39905
$$ 280722 225985 322171 366675 593 212188 298893 163809 58621 140624 280529
12599B80529o4733k9868O3400K46101o6094J4476j76376j23792Q8270p1326j07806
$$ 280529 215796 185928 249328 495429 429335 443811 267435 143643 231913 160587 52781
12588E2781P3638R28L4790p4553O2085J99307r6774p7623j8896J01956J20840
$$ 52781 126419 127347 162137 87584 149669 348976 252202 174579 155683 257639 378479
12577C78479n756P334J12835N8870L9155k5759J17879K33556j64164k20209j65301
$$ 378479 372723 380057 492892 551762 590917 565158 683037 916593 752429 532220 366919
12566C66919j1606J5905M0444K15400K6939J02077j23760k35223j35209J04574
$$ 366919 355313 371218 411662 627062 654001 756078 632318 397095 261886 366460
12556C66460L46515k76002l26163K24285J70225j48760N1324M7127N6756m5009
$$ 366460 712975 436973 110810 335095 505320 356560 407884 455011 511767 466758
12546D66758o4503k13310k2531j01272L44318J11740R8101J38382j72369j00870
$$ 466758 402255 188945 166414 65142 409460 521200 619301 757683 585314 484444
12536D84444l8486o6961p4797J85655q4026j09998K10471J17709k55449J16659
$$ 484444 445958 378997 304200 489855 405829 295831 506302 624011 368562 485221
12526D85221L71024k2665k44012N0052j98573j89236r1612k11132P6636J54775
$$ 485221 856245 833580 589568 639620 441047 251811 160199 -50933 25703 180478
12516A80478J74505K14087k74367o6998K61954J30714j06440k74433j15947k2104
$$ 180478 354983 569070 294703 227705 489659 620373 513933 239500 123553 101449
12506A01449K55954K15823J48431n0291k57297P1357j3887k45981j5312l2516
$$ 101449 357403 573226 721657 671366 414069 485426 471539 225558 210246 177730
12496A77730j3650m4579K1347N7913o0299J2806P1983J82152J66190R3760j11674
$$ 177730 164080 119501 140848 198761 138462 151268 223251 405403 571593 665353 553679
12485E53679J4336l453Q0517j46081n9007l0609J10548p1027m8656L87227J67021
$$ 553679 568015 564562 645079 498998 439991 409382 519930 448903 400247 787474 954495
12474I54495k63966m8445J04833k6084r0472j21947j9633Q0652K15962J63091
$$ 954495 690529 642084 746917 720833 630361 508414 488781 569433 785395 948486
12464I48486J02489J54310j92791m11925L8863j94424j37449J30197J49189J1400
$$ 948486 1050975 1205285 1012494 600569 639432 445008 307559 437756 586945 598345
12454E98345M8409J33754k7572J47459k2030j52735k5522J03521J47722j34018
$$ 598345 646754 780508 752936 900395 878365 725630 700108 803629 951351 817333
12444H17333k31867J11707O6741o269J70658P380j14543k67012q5662J36243n5805
$$ 817333 585466 697173 763914 757645 928303 935683 821140 554128 468466 604709 548904
12433E48904O6009K06932K37799l2298n7149n3480j42963o9895K4306q08m9859
$$ 548904 614913 821845 1059644 1027346 970197 916717 773754 703859 728165 727357 677498
12422F77498J43086j93014K28604J29763j35772j20272m0161p8668L5438K8852
$$ 677498 820584 627570 856174 985937 850165 729893 689732 611064 646502 675354
12412F75354k08801J03139K66926k8265j53062l040j89637J87603K68187q0004
$$ 675354 466553 569692 836618 808353 655291 652251 462614 650217 918404 838400
12402H38400k79717n9014J28134k758O6200O3465R1616O7801K402k68545l4576
$$ 838400 558683 499669 627803 625045 691245 754710 846326 914127 916529 647984 613408
12391F13408K51234J09657q6446j17160j71106M563N1282K82327J03668j22683
$$ 613408 864642 974299 887853 770693 599587 604150 655432 937759 1041427 918744
12381I18744m5013j35568L4151J07087L3116k3866j4179R2559j08083j22673N2308
$$ 918744 873731 738163 772314 879401 912517 888651 874472 967031 858948 736275 788583
12370G88583K17297R7067r2098k77612r4618K61565J83437K64112J19862j44649
$$ 788583 1005880 1102947 1010849 733237 638619 900184 1083621 1347733 1467595 1322946
12360A322946p0055j8704j95785L9376Q9854J72797J14953j88714r5478k49746
$$ 1322946 1252891 1234187 1038402 1077778 1167632 1340429 1455382 1266668 1171190 921444
12350I21444j7050J43247J33625j85977M2427J81844j01099J07752K10905j83526
$$ 921444 904394 1047641 1181266 995289 1037716 1219560 1118461 1226213 1437118 1253592
12340A253592l94612R9255J43682J61506K11769j29417J9069J03098k33572M2065
$$ 1253592 858980 958235 1101917 1263423 1475192 1345775 1364844 1467942 1234370 1276435
12330A276435K09036J7209j98973l9861j3417j76517q3308J9476n4278Q5744K27934
$$ 1276435 1485471 1502680 1303707 1263846 1250429 1073912 990604 1010080 955802 1041546 1269480
12319A269480N1537k57236j06437K88739J70678L7518j16155K84474K19377j19461
$$ 1269480 1321017 1063781 957344 1246083 1416761 1454279 1338124 1622598 1841975 1722514
12309A722514j21302j14868j02451j09459j99112K60320J57977k82608l6800J90840
$$ 1722514 1601212 1486344 1383893 1274434 1075322 1335642 1493619 1211011 1174211 1365051
12299A365051r897K0605j77450J15341K78922O4757n2489j63453j16553n0117
$$ 1365051 1355154 1375759 1198309 1313650 1592572 1657329 1604840 1441387 1324834 1274717
12289A274717J54431J52611K51870j31585r6119j95786K02285N5560M1572M6977
$$ 1274717 1429148 1581759 1833629 1702044 1605925 1410139 1612424 1667984 1709556 1756533
12279A756533j03325K04974J49742k7688k07026j25080M3210J20110J4273j02784
$$ 1756533 1653208 1858182 2007924 1980236 1773210 1648130 1691340 1811450 1825723 1722939
12269A722939K7428l09445k84255Q4803M53681L65227j26664l2951j28013k22801
$$ 1722939 1750367 1440922 1156667 1241470 1695151 2060378 1933714 1900763 1772750 1549949
12259A549949j48208J01745L51747j15396j76971q2681J83007j04636k5997J02967
$$ 1549949 1401741 1503486 1855233 1739837 1562866 1480185 1663192 1558556 1532559 1635526
12249A635526J59670J4096j06473p5428K77184K94662K9332J2322k9843j30964
$$ 1635526 1795196 1809292 1702819 1627391 1904575 2199237 2228569 2240891 2211048 2080084
12239B080084m0385j37286k02292J28016K58332J17492J49159k0592J17928J74556
$$ 2080084 2039699 1902413 1700121 1828137 2086469 2203961 2353120 2332528 2450456 2625012
12229B625012l54255k56979q6849Q2254K36590L78952K7184j71246j63461j74814
$$ 2625012 2270757 2013778 1926929 2009183 2245773 2624725 2651909 2480663 2317202 2142388
12219B142388J33718m2121j09431N2080M01868J26976n1477l3818k9361m5550
$$ 2142388 2276106 2233985 2124554 2176634 2578502 2705478 2654001 2620183 2590822 2545272
12209B545272m1116M3740J35383m8282P109k1788m5254K07714k9107k4731J63552
$$ 2545272 2504156 2547896 2683279 2634997 2642106 2620318 2575064 2782778 2753671 2728940 2892492
12198B892492P9721J46776N5993j38638j1941Q267N1727J26658O277m0982q0966
$$ 2892492 2972213 3118989 3174982 3036344 3024403 3032670 3084397 3211055 3217332 3176350 3095384
12187C095384j6752k8235k53305P414k2026J98105P2335K63086R5646k17013j00237
$$ 3095384 3078632 3050397 2797092 2804506 2782480 2980585 3052920 3316006 3411652 3194639 3094402
12176C094402J6192p0802J78978P1399j58462K97485K21242L8869n5044j34347
$$ 3094402 3110594 3039792 3218770 3290169 3131707 3429192 3650434 3689303 3634259 3499912
12166C499912o1734m4500N7616m6282L82441K5692j05511l1098M7283J3424j19256
$$ 3499912 3438178 3393678 3451294 3405012 3787453 3813145 3707634 3676536 3723819 3737243 3617987
12155C617987Q6883K41670L40521R5696j34514j35442m5902P6010M7639j22945
$$ 3617987 3704870 3946540 4287061 4382757 4248243 4112801 4066899 4142909 4190548 4067603
12145D067603m3553K26602N1867M1481j12889R6307n374Q3440l3318K20050Q6502
$$ 4067603 4024050 4250652 4302519 4344000 4231111 4327418 4322044 4405484 4372166 4592216 4678718
12134D678718Q2596L8626M2810O8432k07007j06637K20065K91802l0271L5380
$$ 4678718 4761314 4799940 4842750 4911182 4704175 4597538 4817603 5109405 5079134 5114514
12124E114514J96225K17152M5315k4141k5448R5496q6454k53971j03583J67364
$$ 5114514 5310739 5527891 5573206 5549065 5523617 5619113 5532659 5278688 5175105 5342469
12114E342469L64207R6311j31833J90336j3942P5097K17932J96167J06163J59037
$$ 5342469 5706676 5802987 5671154 5861490 5847548 5922645 6140577 6336744 6442907 6601944
12104F601944K17655K6009l30411j07175J42809Q8032J35734N4233R8423j0087
$$ 6601944 6819599 6845608 6515197 6408022 6550831 6638863 6774597 6828830 6927253 6917166
12094F917166m0665j02797K0531J76883K49668J74509O1161j84197L990K88059
$$ 6917166 6876501 6773704 6794235 6971118 7220786 7395295 7456456 7272259 7276249 7564308
12084G564308p822k46476J34842K14839M4585L30997L32515J34424q4862j08943
$$ 7564308 7556486 7310010 7444852 7659691 7704276 8035273 8367788 8502212 8417350 8308407
12074H308407n9045J84988J69677m2J84804J75565j5029R1129L41119K14518j47988
$$ 8308407 8249362 8434350 8604027 8603985 8788789 8964354 8949325 9040454 9381573 9596091 9448103
12063I448103M6753m5065j89598K73800M54639L67151K03736J21480J38058K08802
$$ 9448103 9494856 9449791 9260193 9533993 9988632 10355783 10559519 10680999 10819057 11027859
12053A1027859o6659J58309J61022l7323R3316M56735N38774L4996M780J33032
$$ 11027859 10961200 11119509 11280531 11243208 11336524 11793259 12332033 12367029 12371809 12504841
12043A2504841N8548J04349j01350J71773m5180O9939K97474N07199K75840l11412
$$ 12504841 12563389 12667738 12566388 12738161 12692981 12762920 13060394 13567593 13843433 13532021
12033A3532021J50391N90138J81607K48250J77225K20293L35044K28780J20936
$$ 13532021 13682412 14272550 14454157 14702407 14879632 15099925 15434969 15663749 15784685
12024A5784685J01550K97945K30949L23759L50947K92246M27862K53690L58477
$$ 15784685 15886235 16184180 16415129 16738888 17089835 17382081 17809943 18063633 18422110
12015A8422110M67914K81540L2968L11306K94682L89532J68270J59828N98590
$$ 18422110 18890024 19171564 19204532 19515838 19810520 20200052 20368322 20528150 21126740
12006B1126740M25918L43884K39474K41116O5730K08877O97873N03298K06309
$$ 21126740 21552658 21896542 22136016 22377132 22442862 22651739 23349612 23852910 24059219
11997B4059219L32831N46729O41140M78072M52359K85663M72337N54628L66751
$$ 24059219 24392050 24938779 25579919 26057991 26510350 26796013 27268350 27822978 28189729
11988B8189729M39546L76122O68770M68493O37420O13424N54692N84843N70716
$$ 28189729 28629275 29005397 29674167 30142660 30780080 31393504 31948196 32533039 33103755
11979C3103755P51628O38346M68875M76694N03338M62386N91651N84184P50633
$$ 33103755 33855383 34493729 34962604 35439298 35942636 36405022 36996673 37580857 38331490
11970C8331490P50657P53812N91178N26948O09100P35972M64819N65299Q45825
$$ 38331490 39082147 39835959 40427137 40954085 41563185 42299157 42763976 43329275 44175100
11961D4175100R22696O52185P31870N05180O94757P40280N57872O88049R96154
$$ 44175100 45097796 45749981 46481851 46987031 47681788 48422068 48979940 49667989 50664143
11952E0664143P86299M19964M84160P35272O95594P88862O72700P86401M92782
$$ 50664143 51450442 51870406 52354566 53089838 53785432 54574294 55246994 56033395 56526177
11943E6526177N78907M75790N68455N24092N48620M54988M57792L82816J57078
$$ 56526177 57105084 57580874 58149329 58673421 59222041 59677029 60134821 60517637 60674715
11934F0674715L30470L95922J52172N5373K38138R5086N78093L15847K86161J49832
$$ 60674715 61005185 61401107 61553279 61608652 61846790 61941876 62519969 62835816 63121977 63271809
11924F3271809N001N3742j29630l21356J6966J60299k4235J35282j36433m85837
$$ 63271809 63276810 63330552 63200922 62879566 62896532 63056831 63032596 63167878 63031445 62545608
11914F2545608l93855k25565n80005n20816l81213j70991j94564k33788o20746
$$ 62545608 62151753 61926188 61346183 60825367 60444154 60273163 60078599 59844811 59224065
11905E9224065n70093n02853m46560m52752l85448m94613o09796n34241p32354
$$ 59224065 58653972 58151119 57704559 57251807 56866359 56371746 55761950 55227709 54495355
11896E4495355o69488p56724n31817m07921n41969o18911p37281q92485n62824
$$ 54495355 53825867 53069143 52537326 52129405 51587436 50968525 50231244 49338759 48775935
11887D8775935m48493o18880m69897o62565p94860p27437m25285n35929r98510
$$ 48775935 48327442 47708562 47238665 46576100 45781240 45053803 44628518 44092589 43094079
11878D3094079o56735k83457l87338m92236n54789q77067p21257n13008k90247
$$ 43094079 42437344 42153887 41766549 41274313 40719524 39842457 39121200 38608192 38317945
11869C8317945o04412n76731o91248m63503o04677p45409o01215l62603m05415
$$ 38317945 37713533 37136802 36445554 35982051 35377374 34631965 34030750 33668147 33262732
11860C3262732n23111l82118l13512n22202n68849m36225m77014m26071n88884
$$ 33262732 32739621 32357503 32043991 31521789 30952940 30516715 30039701 29613630 29024746
11851B9024746k16191m47067m85340m04861m24227l66140m32323m16844l33068
$$ 29024746 28808555 28361488 27876148 27471287 27047060 26680920 26248597 25831753 25498685
11842B5498685n03758l19835k93102l10573k66871m09172q04633n24985k25892
$$ 25498685 24994927 24675092 24381990 24071417 23804546 23395374 22590741 22065756 21839864
11833B1839864l03776j90742j88001k27738m66510M972j27377k96023j29429k76374
$$ 21839864 21536088 21345346 21157345 20929607 20463097 20468069 20340692 20044669 19915240 19638866
11823A9638866m63765m06527l73832k66666j00358p4690k82668n11127k32975
$$ 19638866 19175101 18768574 18394742 18128076 18027718 17953028 17670360 17159233 16926258
11814A6926258j04628o4080l9946m74733m57764n8487j19308k19391k23702k13255
$$ 16926258 16821630 16757550 16717604 16242871 15785107 15726620 15607312 15387921 15164219 14950964
11804A4950964j96537m09671j98255k3409l27208m14587j40502K9078J41639l32331
$$ 14950964 14754427 14344756 14146501 14123092 13795884 13381297 13240795 13269873 13411512 13079181
11794A3079181k12256P1114n2988k01753j82004K596p870m72817l22009j13863
$$ 13079181 12866925 12938039 12885051 12683298 12501294 12503890 12496020 12023203 11701194 11587331
11784A1587331l64200k34842J45233P4431k95812j92761l3897J08186o8705j77227
$$ 11587331 11223131 10988289 11133522 11207953 10912141 10719380 10685483 10793669 10724964 10547737
11774A0547737j90016k16598l37645J51911l5018k30141Q971j90642j14072j17629
$$ 10547737 10357721 10141123 9803478 9955389 9920371 9690230 9699201 9508559 9394487 9276858
11764I276858N8516j28622l56129j62463o8869K1360k4450n6390k24376j72579
$$ 9276858 9335374 9206752 8850623 8688160 8619291 8640651 8616201 8559811 8335435 8162856
11754H162856J0188l2650Q3204O8300l29445j12180L8618Q1392l18147l14618
$$ 8162856 8173044 8140394 8223598 8291898 7962453 7850273 7888891 7970283 7652136 7337518
11744G337518j18333k63853m4571M0556K96501J8527l57259j24729J40172q89
$$ 7337518 7219185 6955332 6910761 6951317 7247818 7266345 6909086 6784357 6924529 6923640
11734F923640j92586k60995j63827j9230j49040n4694L9293J71045K32412k1359
$$ 6923640 6731054 6470059 6306232 6287002 6137962 6083268 6122561 6293606 6526018 6504659
11724F504659j20954j58693q5845L6365l4488m61437k83999N9300P1845K1997
$$ 6504659 6383705 6225012 6139167 6175532 6141044 5679607 5395608 5454908 5526753 5548750
11714E548750k02394k37128j65542J0264L9947K295j00732k9331K1001k19966
$$ 5548750 5346356 5109228 4943686 4953950 4993897 4996192 4895460 4866129 4887130 4667164
11704D667164K006J08671Q2124J41641N2168j11605l5523N3658k92549m4717n2176
$$ 4667164 4669170 4777841 4859965 5001606 5053774 4942169 4906646 4960304 4667755 4623038 4570862
11693D570862K4706k2293k32988j02664J68519o0926L6597l09368o5684J55249
$$ 4570862 4595568 4573275 4340287 4237623 4406142 4345216 4381813 4072445 4006761 4162010
11683D162010P5824l09885j86941o107l3079K00939j4703j36923j39997L0819
$$ 4162010 4237834 3927949 3741008 3734901 3701822 3902761 3888058 3751135 3611138 3641957
11673C641957m2038J23124j43447j39075n2198m7451K35268P4877m6975j88159
$$ 3641957 3599919 3723043 3579596 3440521 3388323 3340872 3576140 3651017 3604042 3415883
11663C415883r7258R6280j78800k0129K30344L54151O5937k93710j31378k36630
$$ 3415883 3318625 3414905 3236105 3215976 3446320 3800471 3866408 3572698 3441320 3204690
11653C204690q8401O9858k7274r9245M2637J90466R8007j76474j10316j90864
$$ 3204690 3116289 3186147 3158873 3059628 3102265 3292731 3390738 3214264 3103948 2913084
11643B913084j25993J08611L4546k7803n8912j72646j80673P763N1203N1547L29608
$$ 2913084 2787091 2895702 2930248 2902445 2843533 2670887 2490214 2497977 2549180 2600727 2930335
11632B930335m23717l6335J11835j43257P7187Q3884N1701J4899J35414l15167
$$ 2930335 2506618 2470283 2582118 2438861 2516048 2599932 2651633 2666532 2801946 2486779
11622B486779j09220J51756J53717Q6992J30735k4377n4797j54465p9667j29878
$$ 2486779 2377559 2529315 2683032 2770024 2900759 2876382 2821585 2667120 2587453 2457575
11612B457575J98201q9862O8128K06959o4321n2737m119k35001k25268j98428
$$ 2457575 2655776 2565914 2634042 2841001 2776680 2723943 2719824 2484823 2259555 2061127
11602B061127j84119K71854K64712j01998j27213m3442P7113j01914k86059j59298
$$ 2061127 1877008 2148862 2413574 2311576 2184363 2140921 2218034 2116120 1830061 1670763
11592A670763J48701Q3611j74840J28393L9265M2430k5192q7720K6243J79766
$$ 1670763 1819464 1903075 1728235 1856628 1895893 1938323 1913131 1825411 1851654 2031420
11582B031420p7811j05221k3613j44640J11365K00456j59601j59705j19935K08154
$$ 2031420 1953609 1848388 1824775 1680135 1791500 1991956 1832355 1672650 1552715 1760869
11572A760869J75653J35511M1743K05480K37408j33849k06335j44157r0738K44734
$$ 1760869 1936522 2072033 2113776 2319256 2556664 2422815 2216480 2072323 1981585 2226319
11562B226319R1772k91275j48370K2369p6005K20670k5351k13321K632k47495
$$ 2226319 2318091 2026816 1878446 1900815 1824810 2045480 2020129 1806808 1809440 1561945
11552A561945k01182K03757O8227k30022n3543L1845R8640j17741j07172p9181
$$ 1561945 1360763 1564520 1632747 1402725 1349182 1381027 1479667 1361926 1254754 1175573
11542A175573K62254K44145n2174k5951m5169J20985k09521k79567J02462L07825
$$ 1175573 1437827 1681972 1629798 1603847 1558678 1679663 1470142 1190575 1293037 1600862
11532A600862J75114j53303O478j9885J14839k69313j71052q491n1420J72314
$$ 1600862 1775976 1622673 1629151 1609266 1724105 1454792 1283740 1275249 1223829 1396143
11522A396143K3371j33071k00289j10491m7686k35712J1175L53177L41408K89561
$$ 1396143 1419514 1286443 1086154 975663 927977 692265 703440 1056617 1398025 1687586
11512A687586j34050j3292j47134l08261p5139J12454L8103j6562J84389K11338
$$ 1687586 1553536 1540244 1393110 1084849 1009710 1122164 1160267 1143705 1328094 1539432
11502A539432k27738j91132L4217k22707j82489K00419J70981N7395L4171K3893
$$ 1539432 1311694 1120562 1154779 932072 749583 950002 1120983 1178378 1212549 1236442
11492A236442R4287P4538k32466k39030J91480M4294J40976k10768l71485m7077
$$ 1236442 1330729 1405267 1172801 933771 1125251 1169545 1310521 1099753 728268 681191
11482F81191L02320J41291J36850J18621O5597k27732l1989R5185J36674k16042
$$ 681191 983511 1124802 1261652 1380273 1445870 1218138 1186149 1281334 1418008 1201966
11472A201966k19012N3656n0753n1875n3907J77761m412j09571K9204J18653O1651
$$ 1201966 982954 1036610 985857 933982 880075 1057836 1053424 943853 973057 1091710 1153361
11461A153361r3145m7109N7802P1569p5918j73455n5243J67063k1097j64541k10039
$$ 1153361 1060216 1013107 1070909 1142478 1066560 893105 837862 1004925 983828 819287 609248
11450F09248q5642P2623K40689K58768K61128J49925l51479k13415j28900j8139
$$ 609248 523606 596229 836918 1095686 1356814 1506739 1155260 941845 812945 794806
11440G94806J51884j3831M1343N5750P6637K9538l4386N858k35532j07624j76227
$$ 794806 946690 932859 974202 1029952 1106589 1136127 1101741 1107599 872067 764443 588216
11429E88216L3360N6625O1946n9021K04473J58903O5613j02166j08526K36990
$$ 588216 621576 678201 740147 681126 885599 1044502 1110115 1007949 899423 1136413
11419A136413j18323j90706p0338J40482J3971j72173k9600k26689J18639J89313
$$ 1136413 1018090 827384 757046 897528 911499 739326 709726 483037 601676 790989
11409G90989M745Q6017n0314j77775m5753R2889L8301K60049K27172L02074n5315
$$ 790989 795734 881751 831437 653662 607909 700798 739099 999148 1226320 1528394 1473079
11398A473079k51414j50458j09028r2208M1348R5369j54133j6223N4830m7968
$$ 1473079 1221665 1071207 962179 869971 911319 1006688 852555 836332 891162 843194
11388H43194k30027N8048J39435J69900K4305k44957j1662l8449j26819J32708
$$ 843194 613167 671215 810650 980550 1004855 759898 748236 709787 582968 715676
11378G15676P2841K891P0344k5642j62596l4028P4783n7403j29318O434J12280
$$ 715676 788517 791408 861752 836110 673514 639486 714269 656866 527548 533982 646262
11367F46262J31627J40732j12920l08138j55288J69620J88716r3156k0870N6399
$$ 646262 777889 918621 805701 497563 342275 511895 700611 607455 586585 642984
11357F42984m3030j6022L01419K87639j37527j71008j68942K7632l6492j16153
$$ 642984 599954 583932 885351 1172990 1035463 864455 695513 723145 686653 570500
11347E70500k45145J13105O5154P2682n2683J64792j10615k40261Q411J57642
$$ 570500 325355 438460 503614 576296 523613 688405 577790 337529 345940 503582
11337E03582j21495J2371Q1441M5283J8372J6211k1980O5520j58938n647n2106
$$ 503582 382087 394458 475899 521182 539554 555765 533785 599305 440367 434720 382614
11326C82614K01084J33029q9814J52120K34773j83869j03216j16829j28326j50190
$$ 382614 583698 716727 626913 779033 1013806 829937 726721 609892 481566 331376
11316C31376r1956K86358p5870r761K56246J83377o0954p7352l11277k23365j61350
$$ 331376 239420 525778 449908 440147 696393 879770 818816 741464 430187 206822 45472
11305D5472L8742J94858L3592N1133J44776P2232p9228j6775J61242R4743J63370
$$ 45472 84214 279072 312664 363797 508573 580805 501577 484802 646044 740787 904157
11294I04157j92876k99716k15086j19342J53285L16475j4471n4170l1292M105
$$ 904157 711281 411565 196479 77137 230422 546897 532426 478256 446964 451069
11284D51069o9254j05571M995J48511k1095K50613j0735q0560O4962j00373j36659
$$ 451069 381815 276244 281239 429750 408655 659268 648533 567973 632935 532562 395903
11273C95903r6821N3632L178M1813N2842j4409j7466o0871p8538J61407j25499
$$ 395903 299082 352714 355892 397705 450547 436138 418672 357801 279263 440670 315171
11262C15171J08084p4433k88036m6677R5917r2105M7366K39421J41247o529k48273
$$ 315171 423255 348822 60786 14109 110026 17921 65287 304708 445955 439426 191153
11251A91153r5119K17686O0553O6981K00357k6273p1679j06950p2524K30329m1980
$$ 191153 96034 313720 374273 441254 641611 615338 543659 436709 364185 594514 552534
11240E52534q5687j16236n0700J76347R3819M7974O668L5885j29997j59568P4107
$$ 552534 466847 350611 299911 476258 570077 618051 624719 660604 530607 371039 445146
11229D45146j39551k50656L7852J4605K17691p2299n6494P0845j36717P9559R0556
$$ 445146 305595 54939 92791 107396 325087 252788 196294 267139 130422 209981 300537
11218C00537k1227j90506N1796J33956J1734m3930k7089J4065p7546k18384J35961
$$ 300537 279310 88804 140600 274556 286290 242360 215271 229336 151790 -66594 69367
11207F9367K2138k8711j35398J43396J43715k0154j13980r0715O9466M4890l9837
$$ 69367 91505 62794 -72604 70792 214507 194353 80373 -10342 59124 104014 64177
11196F4177j45913O7785O2938j8190K39370N8506j13209J27695J88939J17142
$$ 64177 -81736 -13951 48987 30797 270167 328673 215464 343159 532098 649240
11186F49240j8045j7578j08703j10293j36852j81254J05375j26279O2382j78983
$$ 649240 631195 613617 504914 394621 257769 76515 181890 55611 117993 -60990
11176f0990L7913K65940J39505m0227j83989j58464N3826L3105k5003L2094Q0108
$$ -60990 -23077 242863 382368 342141 158152 -312 53514 86619 61616 93710 173818
11165A73818J01358j24751M2547N147J52426J52796J12611J54734J95217k90776
$$ 173818 275176 150425 192972 198119 350545 503341 615952 770686 965903 675127
11155F75127j96375k89452J01684J39092m7970J10599j74284n1304l71336j21043
$$ 675127 478752 189300 290984 430076 382106 492705 318421 267117 -104219 -225262
11145b25262J88530K05003J91039P0150k36534l36597N9465J77076N7530j30590
$$ -225262 -36732 168271 359310 429460 192926 -143671 -84206 92870 150400 19810
11135A9810N6169j9165k7976J83874Q5271n40934n9081M25940J09463n848r7988
$$ 19810 75979 56814 28838 212712 297983 -242951 -302032 123908 233371 227523 129535
11124A29535k50572J65922J87614j06318k48197j11903j11197P5412N38659P8808
$$ 129535 -121037 44885 232499 126181 -122016 -233919 -345116 -269704 268955 347763
11114C47763r2433p6925p1925k64633O6506K64169p6919l8665Q181n2814Q6726
$$ 347763 255330 178405 106480 -158153 -91647 172522 95603 56938 65119 12305 99031
11103I9031M2048Q0867K12330J0q9358j36284M8972M0765K4580J09211k95423
$$ 99031 141079 221946 434276 434286 344928 208644 257616 298381 322961 432172 136749
11092A36749k26253p5999j26595L1514N6487J96937p6767o6812Q0951K5627k37693
$$ 136749 -89504 -165503 -292098 -260584 -204097 -7160 -83927 -150739 -69788 -44161 -281854
11081b81854N7235n9706K8847K04080M11448n660j56207q8811K81418R6837j45831
$$ -281854 -224619 -284325 -255478 -51398 360050 354390 198183 109372 390790 487627 341796
11070C41796j30954j5616M7040P5303J65864k121L2061k51477k01882J01628L00694
$$ 341796 210842 195226 242266 317569 483433 481312 513373 261896 60014 161642 462336
11059D62336j81294l01726j4337L03097K71110J05438l0378K81680k8982j29736
$$ 462336 281042 -20684 -35021 268076 539186 644624 614246 895926 866944 737208
11049G37208J2620K96481q9174l53259K12600J25751k6768J53769M2216P7779
$$ 737208 749828 1046309 957135 603876 816476 942227 915459 1069228 1111444 1189223
11039A189223K23984p6297j64925K5743J53577n4763j87486k3370K82379J15617
$$ 1189223 1413207 1336910 1171985 1197728 1351305 1296542 1109056 1085686 1368065 1483682
11029A483682J72403R487J26956k4993p3819m8437R1731j67674m4901J25928J03109
$$ 1483682 1656085 1665572 1792528 1767535 1693716 1645279 1737010 1569336 1524435 1650363 1753472
11018A753472J8908j36667n6951m1738Q036K2277q8712l9486n7634j09947p2966
$$ 1753472 1772380 1635713 1578762 1537024 1545060 1567337 1478625 1439139 1381505 1271558 1198592
11007A198592J72422p5140k07583j48001J43031K09167O5294J1377k95704j52998
$$ 1198592 1371014 1295874 1088291 940290 1083321 1292488 1357782 1369159 1073455 920457
10997I20457r9564l48981L9704J65432K4254j28291k02965p0051j52993l0175
$$ 920457 820893 471912 511616 677048 701302 573011 370046 299995 147002 116827
10987A16827r6970n7506M24237K16924P8704l11231r4870J17562r0426k01272
$$ 116827 19857 -37649 386588 603512 682216 370985 276115 393677 303251 101979
10977A01979r525M9869K0307J31851J5553k491J09449J15956O505j24994j35493
$$ 101979 92454 142323 162630 294481 310034 307543 416992 532948 539453 414459 278966
10966B78966J3011J25499R2433O0171j08324j42012q8511n9436N4685q7304J48563
$$ 278966 291977 417476 509909 570080 461756 319744 231233 171797 226482 139178 287741
10955B87741O348k68010r3260K56867K08166n362j63465p0144m4042N4405K42214
$$ 287741 294089 26079 -67181 189686 397852 392490 229025 158881 114839 169244 411458
10944D11458m6337P8615K6087k38501k10300j10429L9116J56226J9475K27013
$$ 411458 365121 443736 469823 231322 21022 -89407 -50291 105935 125410 352423
10934C52423j18720m3537L8727j32554k27019j96368N9859q4124p0643J50840
$$ 352423 233703 190166 228893 96339 -130680 -327048 -267189 -351313 -421956 -271116
10924b71116K77622J55905N4014J1941J7564j21360j46513j75354j7550Q2003
$$ -271116 6506 162411 216425 228366 245930 124570 -21943 -197297 -214847 -132844
10914a32844J59648L2071N8270l8355J96940J9673j92759j76516o0684j144J02667
$$ -132844 26804 58875 117145 78790 275730 295403 102644 -73872 -134556 -135700 -33033
10903c3033J24133J47339N221J48768J45748j63487o2676L5097k06633l55611
$$ -33033 91100 238439 243660 392428 538176 374689 312013 347110 140477 -215134
10893b15134J1290K1221K6904P6850R7118r0939j09141K4594K77640o7885O4333
$$ -215134 -203844 -182623 -155719 -78869 18249 -72690 -181831 -157237 120403 52518 116851
10882A16851j56869j30719N6304L44443J46660j30462K2916k0423q7405J0726
$$ 116851 -40018 -170737 -114433 230010 376670 246208 269124 248701 161296 172022
10872A72022p1355Q651l0377M3382Q3767J58540p9965M9997R3576j29193k56480
$$ 172022 100667 109318 78941 122323 206090 364630 284665 334662 428238 299045 42565
10861D2565L287O3749j3816j58799q4857J10281P4700Q2198Q3296J53418J26648
$$ 42565 45852 109601 95785 -63014 -147871 -37590 37110 119308 202604 356022 482670
10850D82670j14981k90308Q5945L8505J63796j39138j40805J22529J9186m3821
$$ 482670 367689 77381 163326 201831 365627 226489 85684 208213 227399 183578
10840A83578o8620J8891q6065k18035J8238L04925j25245q3018J20523K4941n3120
$$ 183578 114958 133849 47784 -170251 -152013 152912 27667 -55351 65172 90113 36993
10829C6993l6436J33928J34404m2197J35136o4684k85625m2499K5437o2213L7416
$$ 36993 557 134485 268889 226692 361828 297144 11519 -30980 -5543 -67756 -30340
10818c0340J81547O2458k32513J05964Q9410p9621n3882J27838k1551J45241N2605
$$ -30340 151207 213665 -18848 87116 176526 96905 43023 170861 149310 294551 347156
10807C47156k27142j15764j19826N6979J34834M1600j96202o0266r6724j28177
$$ 347156 120014 4250 -115576 -58597 76237 117837 -78365 -138631 -235355 -363532
10797c63532j19221m6749l2244n0295K70703J31890J6198j8926n1384k6259J43404
$$ -363532 -482753 -529502 -561746 -612041 -341338 -209448 -193250 -212176 -263560 -289819 -146415
10786a46415j44182j49468r0250J78589J91869K94815k0684j61076N9565K0401
$$ -146415 -290597 -440065 -530315 -351726 -159857 134958 114274 -46802 12763 33164
10776C3164j43033Q9193q9967m3478q124K4963j04171J41735q6690k67406j1813
$$ 33164 -109869 -20676 -110643 -154121 -162245 -137282 -241453 -99718 -186408 -453814 -465627
10765d65627R7680j72058j17403K20393R4374k0148j2903j1756J8092J43783j73209
$$ -465627 -367947 -540005 -657408 -437015 -342641 -362789 -375692 -387448 -369356 -225573 -398782
10754c98782J3577q7905K1700L37747J13804P7795O9902r8535j77348j37591o7706
$$ -398782 -385205 -473110 -451410 -113663 141 77936 147838 49303 -128045 -265636 -333342
10743c33342K4288k9492N5735J33660j07639R5868K76158j20031K2993J22994
$$ -333342 -309054 -338546 -282811 -149151 -256790 -160922 115236 -4795 18198 141192
10733A41192r9628Q8946J93980Q8093L2473j61896P509J89384K9649k09013K7944
$$ 141192 41564 130510 324490 412583 445056 283160 290669 480053 509702 300689 328633
10722C28633j78872q4153J3006k23612R9403M2836J16677K19474J08532o3912
$$ 328633 149761 65608 78614 -144998 -45595 -2759 113918 333392 441924 378012
10712C78012j8869q4198l1974P9533L04306p3846k63961q2377p0715r3243K96624
$$ 378012 359143 274945 242971 322504 626810 552964 289003 206626 135911 42668 339292
10701C39292J95650N9809J23360j55781j22151j65031n8175o4393K31772J94918
$$ 339292 534942 594751 718111 562330 440179 275148 216973 152580 384352 579270
10691E79270m1848k32964K30665K10769j06172j72715Q8017k8971j0124M8019
$$ 579270 537422 304458 535123 745892 639720 467005 555022 526051 515927 563946
10681E63946N3235j8975n6261o2742J14027K86853N5475k3420m6825q8905k42546
$$ 563946 617181 598206 541945 479203 593230 880083 935558 912138 865313 776408 533862
10670E33862o6309J68917O1224Q9499J95199k6219l63584j66953R4426J71317
$$ 533862 467553 636470 697694 787193 982392 956173 592589 425636 520062 691379
10660F91379M4789L5610J16486P554P2103P1529J65417K43931L41155m5837j59922
$$ 691379 736168 771778 888264 895818 967921 1039450 1204867 1448798 1789953 1744116 1584194
10649A584194m5095k8994j06935K28638J82014L59263M60256M95969L34376K31576
$$ 1584194 1539099 1510105 1403170 1631808 1813822 2173085 2633341 3129310 3463686 3695262
10639C695262M44691M29186L25380L89788N78125P83143P04073R78472J461023
$$ 3695262 4139953 4569139 4894519 5284307 5862432 6645575 7349648 8328120 9789143
10630I789143J311600J871319K421092L299858M245533N511595P683794R608160
$$ 9789143 11100743 12972062 15393154 18693012 22938545 28450140 36133934 45742094
10622D5742094J1071816J0728697R745855R247271R062914Q981135P790560M972974
$$ 45742094 56813910 67542607 77288462 86535733 95598647 104579782 112370342 117343316
10614A17343316K630646L610700Q018319J3506242J6863956J6505232J4160878
$$ 117343316 119973962 123584662 131602981 145109223 161973179 178478411 192639289
10607A92639289J3177543J3633308J3444255R682027J791611n814909n598372
$$ 192639289 205816832 219450140 232894395 242576422 244368033 238553124 232954752
10600B32954752J802418J1643167J7604342J7071774J3135988J1508944J2320447
$$ 232954752 234757170 246400337 264004679 281076453 294212441 305721385 318041832
10593C18041832J0458658K114753j2020344k3637929k4426836j6086346o026375
$$ 318041832 328500490 330615243 318594899 294956970 270530134 254443788 248417413
10586B48417413L58671J829412O64947R73998J964821K98374n721034j5322750
$$ 248417413 248776084 250605496 251270443 252244441 254209262 254507636 248786602 233463852
10578B33463852k2746372k2390404j6700830j0259300o053532m443904l857200
$$ 233463852 210717480 188327076 171626246 161366946 155313414 150869510 147012310
10571A47012310l300241l315883m761041p360428j1045038j3675844j3304314
$$ 147012310 143712069 140396186 135635145 128274717 117229679 103553835 90249521
10564I0249521j1382035r181442p398208n593077m194284l431929l232287k452243
$$ 90249521 78867486 69686044 62287836 56694759 52500475 49068546 45836259 43384016
10556D3384016k251643j938124j635152j338862j359545j590345j396029j195014
$$ 43384016 41132373 39194249 37559097 36220235 34860690 33270345 31874316 30679302
10548C0679302j077836j089792j054218r63049p41667j050857q93205o50403q20970
$$ 30679302 29601466 28511674 27457456 26494407 25752740 24701883 23808678 23158275 22337305
10539B2337305p41690n67828n44454q48744o71243n04220m78315n40021n16443
$$ 22337305 21595615 21027787 20483333 19634589 18963346 18459126 17980811 17440790 16924347
10530A6924347l85096l31224m67951m94886l96391n38631l96256l74577n99431
$$ 16924347 16539251 16208027 15740076 15245190 14848799 14310168 13913912 13539335 12939904
10521A2939904m55025m8794k13479l57707l61954l75694j77834k89038l29514
$$ 12939904 12484879 12436085 12222606 11864899 11502945 11127251 10949417 10660379 10330865
10512A0330865l09384k67402j80529k66864k86041k93320j39161j29568k13940
$$ 10330865 10021481 9754079 9573550 9306686 9020645 8727325 8588164 8458596 8244656
10503H244656k0641p0876P1964l49610l88142p3524J9998l13892j5719l50155
$$ 8244656 8224015 8153139 8225103 7875493 7487351 7413827 7433825 7119933 7104214 6754059
10493F754059k99268j05566j36579q033P5497k95486m06411l58003J80996l8490
$$ 6754059 6454791 6349225 6212646 6204613 6280110 5984624 5578213 5220210 5401206 5362716
10483E362716k70651j33455K1779J67327n4885j98204j66990R9145L6919l67140
$$ 5362716 5092065 4958610 4980389 5147716 5092831 4894627 4727637 4826782 4863701 4496561
10473D496561k42378k44623k7716J61625k64367j19526N1877j38869N5546Q6884
$$ 4496561 4254183 4009560 3981844 4143469 3879102 3759576 3811453 3672584 3728130 3815014
10463C815014o7323j01659m8788q3667K3728j60962p5685j56794k71581j28565
$$ 3815014 3747691 3646032 3597244 3513577 3537305 3376343 3300658 3143864 2872283 2743718
10453B743718K30619J1346j28286k41906j00448J70061L61695L6315l19122k54327
$$ 2743718 2974337 2985683 2857397 2615491 2515043 2685104 3046799 3083114 2763992 2509665
10443B509665O8616j34112j31783N1783M5095M1939n7950j69563J8659J34598
$$ 2509665 2578281 2444169 2312386 2364169 2409264 2451203 2393253 2223690 2242349 2376947
10433B376947P2039j4132J8088j51915N6499j82657k02623q310l13809k06195
$$ 2376947 2448986 2434854 2452942 2301027 2357526 2174869 1972246 1963936 1650127 1443932
10423A443932m4792J06701p7169J40243J41446j64810r0517J10734r2674P0105
$$ 1443932 1399140 1505841 1428672 1568915 1710361 1545551 1455034 1565768 1473094 1543199
10413A543199k8240R308P2127p3657M4610N850q7961o3415j21976k43320j48073
$$ 1543199 1514959 1524267 1596394 1522737 1567347 1573197 1485236 1421821 1299845 1056525 908452
10402I08452K42938P8743J60498j81655J26254n333m6469j72602j56716j85249
$$ 908452 1151390 1230133 1390631 1208976 1335230 1329897 1283428 1110826 954110 768861
10392G68861k77653J17107K73828J92658J20908p5333k4235j94822j75413J62289
$$ 768861 491208 608315 882143 1074801 1195709 1120376 1096141 901319 725906 888195
10382H88195L88429o9565k33886P5030J40984M8932O1508m6436J75657o6948k68269
$$ 888195 1276624 1207059 973173 1048203 1189187 1238119 1299627 1253191 1428848 1361900 1093631
10371A093631o6837k09031M2570Q5110p3026m3396j05108n7382M2895J72108R3446
$$ 1093631 1026794 817763 860333 945443 872417 829021 723913 666531 709426 881534 974980
10360I74980n0934q7063p2563k08585J35112K41936m0551J60770R4991n9317J04699
$$ 974980 924046 836983 764420 555835 690947 932883 892332 1053102 1148093 1088776 1193475
10349A193475k15693r5247Q9776k9550l31144j81201j11280n6128J44261o0101
$$ 1193475 977782 882535 972311 942761 611617 430416 319136 263008 407269 347168
10339C47168P9519r123n8383J17011J21795K90286q3366j92846q1336n4900K8140
$$ 347168 426687 417564 359181 476192 597987 888273 804907 612061 530725 475825 503965
10328E03965n1472J14229m4668k20136j95191q0168K94822Q9259q648k3709n2350
$$ 503965 452493 566722 522054 301918 106727 26559 321381 410640 401992 378283 325933
10317C25933q125J68850K04230J48491k08974l01655k03491Q4242K50250J31835
$$ 325933 317808 486658 690888 839379 630405 328750 125259 209501 459751 591586
10307E91586j53901K5227K99198n3165k16679R1281L10467N6477k77300k67099
$$ 591586 437685 462912 762110 708945 492266 583547 894014 950491 673191 406092
10297D06092o4585r6653j68938K04777J65064O602p4844o4536q443q7677J00145
$$ 406092 341507 244854 75916 280693 445757 452359 377515 312979 304536 216859 317004
10286C17004J74310j92288j99574K6423J22656J22894l5150m9004K7192J57585
$$ 317004 491314 299026 99452 125875 248531 371425 336275 287271 314463 472048
10276D72048K272k26103K1468K28139R6872k09530J6539j57323j0682j61731J69260
$$ 472048 474320 248217 269685 497824 594696 385166 401705 244382 233700 71969 241229
10265B41229L43353j08481p0472r0941J68729j03917j12180j82431k13897J60346
$$ 241229 584582 476101 405629 314688 483417 379500 267320 84889 -129008 31338
10255C1338J18911j58488J34284K27199K52286J28593O5922j20072k99553q7979
$$ 31338 150249 -8239 126045 353244 605530 734123 800045 679973 380420 292441
10245B92441N6188j8585n9438k6641l5721j13991L4374J38484J52488N969J47218
$$ 292441 348629 330044 270606 243965 208244 94253 128627 267111 419599 425568 572786
10234E72786L7547M4092j09141l44801l62649j49562P4320K18743R2526j23063
$$ 572786 610333 654425 545284 200483 -162166 -311728 -237408 -18665 73861 -49202
10224d9202K7214j10271l9525L8238n1031o6921K04855K37709Q615l8169J53329
$$ -49202 -21988 -132259 -171784 -133546 -184577 -251498 -46643 191066 199681 161512 314841
10213C14841K93117n6820m57827k12696q0835M9717L24558j25799p970J77142
$$ 314841 607958 551138 93311 -119385 -200220 -150503 174055 48256 40286 217428
10203B17428J7972N0609O0836P4249J71348M3906j60640j56613J88486j9283j74101
$$ 217428 235400 286009 346845 421094 592442 636348 475708 319095 507581 488298 314197
10192C14197J4522J19450l9482J12417R6449J12575K90355o8023k07902n7258
$$ 314197 328719 448169 408687 521104 617553 730128 1020483 952460 744558 687300
10182F87300Q8608o8603p2684Q9191J87241k7388j95664J5001J51829L27667J16089
$$ 687300 775908 707305 634621 723812 911053 883665 688001 703002 854831 1182498 1298587
10171A298587J67580J18076L5606k16537K3203m893o1323k2161K01616K03668
$$ 1298587 1466167 1584243 1619849 1403312 1426515 1421622 1360299 1338138 1539754 1743422
10161A743422Q9646r3336o2871R638N3511k5901n9234k94296j81894k11214r6402
$$ 1743422 1833068 1739732 1676861 1686499 1740010 1714109 1654875 1360579 1178685 967471 871069
10150H71069L15111K14790J21402m957p8546l82783n0205L80300M7301q9309q9073
$$ 871069 1186180 1400970 1522372 1517415 1438869 1056086 1005881 1386181 1433482 1344173 1255100
10139A255100J84142J46693j16184k1166p7887q1757j79713k68440j67687O369
$$ 1255100 1439242 1585935 1469751 1448585 1370698 1288941 1109228 840788 673101 679470
10129F79470p8693J02682n5644j02516o293R7089j55187r1768j7848K8671K18134
$$ 679470 600777 703459 647815 545299 539006 636095 480908 389140 371292 399963 618097
10118F18097J01248l8632r3931k74632k68983N9202K89838J81037k64574k99529
$$ 618097 719345 680713 586782 312150 43167 102369 392207 573244 308670 9141
10108I141m6395j54396j57035P7858J67217J75874L05676l6114m1089p2920J9999
$$ 9141 -37254 -191650 -348685 -270827 -103610 72264 377940 341826 300737 227817 247816
10097B47816r6692J56346J14950J41587L4141n1016N549o2325J62287J30122j33691
$$ 247816 151124 307470 422420 564007 598148 547132 552681 490356 652643 782765 649074
10086F49074j7313r919J07773j39546k13483l0794m3293p0275K43914J21902j34145
$$ 649074 631761 621842 729615 590069 376586 345792 302499 232224 476138 598040 463895
10075D63895L8063n7981k07604J26901K64063j48822k44038N0035J174O2239m6316
$$ 463895 501958 443977 236373 363274 627337 478515 234477 284512 285686 347925 301609
10064C01609r2138O6728O2764j14063j97075k8677r7682n3948l851l7630J85005
$$ 301609 209471 276199 338963 224900 27825 -852 -98534 -152482 -156333 -193963 -8958
10053h958K2874K893j2856N3347K01561k28299N4345R9819k79711J3140J69838
$$ -8958 13916 16809 3953 57300 258861 30562 84907 184726 -94985 -81845 87993
10042H7993j15145J21537O8357k4787K087q3194o2589J56000J10915j87443l66095
$$ 87993 -27152 94385 162742 137955 140042 56848 -5741 150259 261174 73731 -292364
10031b92364j57729J29935J32439r1501K09257p6721K73018K64075j15180k57116
$$ -292364 -450093 -320158 -187719 -279220 -69963 -146684 126334 390409 275229 18113
10021A8113q151R6085R6745j04849k15223O938K27952M7776j40140L5457k02958
$$ 18113 9962 106047 202792 97943 -117280 -110342 117610 165386 25246 60703 -142255
10010a42255O7006J36022Q0328l8707O2706K12056J44433m32950m01383o20K15723
$$ -142255 -75249 60773 141101 102394 165100 377156 521589 88639 -312744 -313364 -97641
9999i7641J33352K21737K6365J4692K5760n5187N9814j31097j78557P3877q8897
$$ -97641 35711 257448 283813 298505 324265 269078 328892 197795 19238 93115 4218
9988D218P2672j75842J09050L06384J50122j2644R4862j09753j76678o4068k5997
$$ 4218 76890 -98952 10098 316482 466604 453960 548822 439069 262391 198323 172326
9977A72326j42885o6907J58048K62154J49814l77198j18101P5345J273N151l9351
$$ 172326 29441 -37466 120582 382736 532550 155352 37251 112596 113869 119020 79669
9966G9669n8923k5404K68853J87191o4134j14544J14108J3263j28470m3899j4693
$$ 79669 20746 -4658 264195 451386 387252 272708 386816 400079 271609 227710 213017
9955B13017M2596j06625L5649p3931j09323l2105N3174J69032O2644j14391l88220
$$ 213017 255613 148988 184637 110706 1383 -30722 22452 191484 254128 139737 -248483
9944b48483L9011K04545J53242P4632k54324J2383R8178L29478p5545k03155l08157
$$ -248483 -209472 -4927 148315 222947 -31377 -18994 79184 408662 333117 129962 -178195
9933a78195q5569K55551L38247j21775k31923k29489P7602J85647J55952O3998
$$ -178195 -263764 -8213 330034 208259 -23664 -253153 -175551 10096 166048 230046
9923B30046l12162j36860K37615J70188J73256n2377l1579M2643m2994j59536
$$ 230046 -82116 -218976 18639 188827 362083 309706 278127 320770 277776 118240
9913A18240j18965j41766l4912J04597M0537J96723J56901r7800j38478K10447
$$ 118240 -725 -142491 -177403 -72806 -32269 164454 321355 223555 85077 295524
9903B95524p164k89638M8568J17163o147k12414L7000J68722k71498j47966l1887
$$ 295524 288360 -1278 47290 164453 158306 -54108 -17108 151614 -119884 -267850 -299737
9892b99737L19068K44267O3129k36685j43213k202l2234N6425J26483M0467P3581
$$ -299737 19331 263598 326727 90042 -53171 -55373 -87607 -31182 95301 135768 209349
9881B09349J54738j3859R7213K99768k8074l47171l59664N3898J15671K21260
$$ 209349 364087 350228 447441 747209 719135 371964 12300 66198 181869 403129
9871D03129j21582m5282o6654O1787J0267O6221m60620l6555j2761j98380J90470
$$ 403129 281547 236265 169611 231398 241665 307886 -152734 -189289 -202050 -400430 -209960
9860b09960K84156R9281k26002M1306K62831M00856K81136k73684j32384k7838
$$ -209960 74196 173477 -52525 -11219 251612 652468 933604 659920 527536 499698
9850D99698M0914k16140j17168J91181O8858p3910l10819j4232o6965J33635M3268
$$ 499698 540612 324472 207304 398485 467343 393433 82614 68382 1417 135052 178320
9839A78320R2634Q0386j71740l15431l4739J57042J71377J8468n9755J63325J49232
$$ 178320 270954 351340 179600 -135831 -170570 -13528 157849 176317 116562 279887 429119
9828D29119J35562j26453l03737m07731J78700L39925K41442M220j80905j47698
$$ 429119 564681 438228 134491 -273240 -94540 245385 486827 491047 310142 162444
9818A62444l601J53446K8484j71723k72309O7378K55529J8154k7125n282l356
$$ 162444 158843 312289 340773 169050 -103259 -35881 219648 237802 210677 205395 202039
9807B02039j64822J67883j06102n7340L16468P2527j04907l46232k21212R535
$$ 202039 37217 205100 98998 41658 358126 430653 325746 -20486 -241698 -232163
9797b32163o4066J56855J60626k43581k82564P8585N2616r2764m9561K12708K24039
$$ -232163 -296229 -139374 21252 -222329 -504893 -426308 -373692 -466456 -516017 -303309 -79270
9786g9270K83183j83780M3257J02737K4778j42020k40211j35094J00661K30344
$$ -79270 203913 20133 63390 166127 190905 48885 -191326 -326420 -225759 4585
9776D585R5936r0233K37854j127j48292J25184J80332k58379p5572k177K0430
$$ 4585 100521 10288 248142 247015 98723 223907 404239 145860 70288 68111 88541
9765H8541p526J09492K2911j19233K23735P3881l7290o474p386j94489m0407m6227
$$ 88541 81015 190507 213418 94185 317920 391801 354511 348037 340651 146162 105755 59528
9753E9528l8475J77729O10K63692j993q1262j30463j96384j05572O6029O4651
$$ 59528 21053 198782 199392 463084 461091 379829 249366 52982 -52590 13439 78090
9742G8090j2899k6618j52606r6241j8760J18111J94714R2195J76624j06166j84876
$$ 78090 65191 38573 -114033 -210274 -229034 -110923 83791 175986 352610 246444 61568
9731F1568p1936j12743k62568j05088J09742L35951Q5050r050O1525j56830j68130
$$ 61568 -10368 -123111 -385679 -490767 -381025 -45074 39976 30926 92451 -64379 -232509
9720b32509k22232J30699M4584O3823L6588L5997m0000j18588j3784r9548J13627
$$ -232509 -454741 -324042 -279458 -215635 -179047 -143050 -183050 -301638 -315422 -414970 -301343
9709c01343J54938J14237K0995j07344M607j25481K0314J98691j03166o7224k4938
$$ -301343 -146405 -32168 -11173 -118517 -113910 -239391 -219077 -20386 -123552 -190776 -215714
9698b15714j8776N01836J09343j18325l8161J8757j23230j94412R658n8642j1190
$$ -215714 -234490 267346 376689 258364 220203 238960 115730 -78682 -69024 -127666 -138856
9687a38856J83470O6433n6194p4831k6800l3520K2223k32545o4760J76964K73584
$$ -138856 44614 111047 54853 -19978 -46778 -80298 -58075 -290620 -355380 -178416 95168
9676I5168J63774J93676l07730j28395j03109K71454K75031k65780j27742Q406
$$ 95168 258942 452618 144888 16493 -86616 184838 459869 194089 66347 74753
9666G4753q0925J0182J91468k2597N3912K51778Q748J77060L81047L23510L88782
$$ 74753 -6172 4010 195478 172881 226793 478571 487319 664379 1045426 1368936 1757718
9655A757718J43858j6860J11799J98254k01203k64710o78359l73101l43570j83207
$$ 1757718 1901576 1884716 1996515 2194769 1993566 1728856 1050497 677396 333826 150619
9645A50619m4184L7439M0816j50099Q5832J46104j2480m0018p6228j6061J36055
$$ 150619 106435 143874 184690 34591 120423 266527 254047 214029 137801 121740 257795
9634B57795j80995j14291j09727N0028p0459K59377J46810k15069j15183j10463
$$ 257795 76800 -37491 -147218 -97190 -167649 91728 238538 23469 -91714 -202177
9624b02177k317l9864j1935j15943N385q6417J44155L60707J5829O9663P8379
$$ -202177 -204494 -244358 -256293 -372236 -366851 -453268 -309113 51594 67423 137086 215465
9613B15465J57839J2090Q5880k12423j33591M8647M4935k73888j79614J2684J08828
$$ 215465 373304 385394 471274 258851 125260 173907 218842 -55046 -234660 -221976 -113148
9602a13148L11217M03543m44625k98255k83089J053N7600R5661K04670L91355
$$ -113148 198069 601612 156987 -141268 -424357 -423304 -365704 -270043 -65373 325982
9592C25982j0630M0230r9236o3033j57076j20584J9885M0710K39512j68100k9207
$$ 325982 315352 355582 256346 193313 36237 -84347 -64462 -23752 215760 47660 18453
9581A8453p7368Q4115k6037L61894M5406l4723O506j88941j28268j6359J54936
$$ 18453 -58915 25200 -837 361057 406463 371740 378246 189305 61037 44678 199614
9570A99614j25505j70582J74233K71484R5382j05151j82804o8824j21762r7311
$$ 199614 74109 -96473 77760 349244 444626 339475 156671 87847 -33915 -131226
9560a31226J33920Q7585j5672k16554n1184o6406R2695K16543J47912j32789k61178
$$ -131226 2694 90279 74607 -141947 -193131 -259537 -166842 49701 197613 64824 -196354
9549a96354j1155K96938J08340q6147N7274k54163J1464L2338P6525k10897j80276
$$ -196354 -207509 89429 197769 111622 168896 -85267 -73803 -41465 35060 -175837 -356113
9538c56113N2597K8895J8620l5094j44255J86705q8512J98447J77005J22345j3398
$$ -356113 -303516 -274621 -256001 -291095 -435350 -248645 -337157 -138710 38295 160640 147242
9527A47242m0972j93300J25396n0539j51844j92567L0877J67597L7818L23606
$$ 147242 106270 -87030 38366 -12173 -164017 -356584 -325707 -158110 -120292 203314
9517B03314K80687q8495j59470M1657j80311k19960j56146J9113n2111J37209
$$ 203314 484001 395506 236036 277693 97382 -122578 -278724 -259611 -311722 -174513
9507a74513K8J53347O0047J52314P7355J49473o6498k24420p8282l0907O2307
$$ -174513 -174485 -21138 38909 191223 268578 418051 351553 127133 48851 17944 80251
9496H0251p1421J10883J01453j05688j25096J99308j27877p8538N8812J30859
$$ 80251 8830 119713 221166 115478 -9618 189690 61813 -16725 42087 172946
9486A72946O7244j81220j81111R7669M8474j9160j7913J2278o1977j44737K5639
$$ 172946 240190 58970 -122141 -24472 24002 4842 -13071 -793 -62770 -207507 -181868
9475a81868P6992Q0764P8820Q8881j67045Q1011L5262j6595j29011J19910L5887
$$ -181868 -104876 -24112 54708 143589 -23456 57555 92817 76222 -52789 67121 103008
9464A03008l04415J29407R4971j45234L27919K00278k94542k05097k1668J63761
$$ 103008 -201407 -72000 22971 -122263 205656 405934 111392 -93705 -115373 48388
9454D8388K00381J93054j19013k98992j22528J45220L35512L12024p272l12481
$$ 48388 248769 441823 322810 23818 -98710 46510 382022 694046 686774 374293
9444C74293l3195j81026l43690J12508j34392l52934m781J05431J56549K60497
$$ 374293 341098 160072 -183618 -71110 -205502 -558436 -563217 -457786 -301237 -40740
9434d0740J54084K01691l01179m7822l7521M0047J22277L62327J7845k21870j31820
$$ -40740 113344 315035 13856 -33966 -71487 -31440 90837 453164 471009 249139 117319
9423A17319J45819Q9684l0674n9604j19269k7410k68657K53107k14701l26103
$$ 117319 263138 352822 322148 262544 143275 115865 -152792 100315 -114386 -440489
9413d40489J75928L66812M4128O2745J87058j29508P690k45437k52518L2824n2339
$$ -440489 -264561 102251 146379 209124 396182 266674 274364 28927 -223591 -190767 -243106
9402b43106M0293K54119q1953L8995k8489N8871r8178j5764J25743J16035Q9484
$$ -243106 -202813 51306 -30647 8348 -20141 38730 -59448 -75212 50531 166566 256050
9391B56050j06496k0656O0346k41259J5269n3691j45896O4286M4986m3412Q3517
$$ 256050 149554 128898 189244 -52015 -36746 -90437 -236333 -172047 -127061 -170473 -86956
9380h6956J07667k8776k795O3128K57887j53239l11644j6688J73131Q5696K07301
$$ -86956 20711 -8065 -10860 52268 310155 156916 -154728 -171416 1715 87411 294712
9369B94712O5218K24210J00953j64923j02053j06740l37279j65555P9990O1241
$$ 294712 359930 584140 685093 520170 418117 311377 -25902 -191457 -111467 -50226
9359e0226J67933O8066k57995l49692P600Q3785K9539r1695K25269K9181m4691
$$ -50226 117707 185773 -72222 -421914 -414314 -330529 -300990 -392685 -167416 -138235 -182926
9348a82926k50359m2326K78760M2975J7579m4381J5776J26646J56640K4948p5197
$$ -182926 -433285 -475611 -196851 -153876 -136297 -180678 -164902 -38256 118384 143332 68135
9337F8135N6129N6236p1343j29603j39712J34920N6230p3026k98053k28611J86379
$$ 68135 124264 180500 109157 -20446 -160158 -25238 30992 -42034 -340087 -568698 -382319
9326c82319K05351M891O7465R8949J21511M6385j28011j33887J2253M5269R3044
$$ -382319 -176968 -172077 -104612 -5663 115848 162233 34222 -99665 -87412 -42143 50901
9315E0901K75Q1014o786j14824N9489N853J3121j54146j21306N3285Q7496j89938
$$ 50901 51176 132190 125404 10580 70069 75922 89043 -65103 -186409 -133124 -45628 -235566
9303b35566m9954j16210K90043n4756j95921K99787K70348O977k8632l3919J09768
$$ -235566 -285520 -401730 -111687 -166443 -362364 -62577 207771 214748 186116 152197 261965
9292B61965N9023n4335j46659l8676K4288m3165l0655L4838J5886q4414O7741
$$ 261965 320988 266653 119994 81318 105606 62441 31786 66624 82510 -1904 65837
9281F5837J99672M978n7151J03615J67527l28918J23642K6175j85133L5356j30328
$$ 65837 265509 270487 213336 316951 484478 155560 279202 305377 120244 155600 25272
9270B5272q1772M1676K6436K46057J69520j66492j60126P3434O1305J3025J23280
$$ 25272 -56500 -14824 11612 257669 427189 260697 100571 174005 235310 248335 371615
9259C71615j54231k90418j01835P2371J41953R1709J8962K2529k31339r5664O3537
$$ 371615 217384 -73034 -174869 -102498 39455 131164 150126 172655 -58684 -154348 -90811
9248i0811L6042K2048J42980j7216P2793M1097O6473j25648j84434n8292m2910
$$ -90811 -54769 -32721 110259 93043 165836 206933 273406 147758 -36676 -94968 -137878
9237a37878o9527L5420J63004K05160O6210n0602j49571l41326L15619n2380k54366
$$ -137878 -207405 -171985 -8981 196179 262389 211787 62216 -279110 36509 -15871 -270237
9226b70237j13709J64595J50285M18058N0768l27063j63591j28673j28422j8358
$$ -270237 -383946 -219351 -69066 348992 399760 72697 -90894 -219567 -347989 -366347
9216c66347o4707j8038J75511M58528K19008J71499k89757j56890o5899k34673
$$ -366347 -431054 -449092 -273581 184947 403955 575454 285697 128807 62908 -171765
9206a71765j78922K6817J37121l5132L25990N8044p3724j32478j65218o3689K38957
$$ -171765 -350687 -323870 -186749 -221881 104109 162153 88429 -44049 -209267 -272956 -33999
9195c3999j27238j31654J15659J2665J48108r6272J41305K13265L7500J89939
$$ -33999 -161237 -292891 -177232 -164567 -16459 -112731 28574 241839 279339 469278
9185D69278R4549k44171k21397k05522j96911K3802K05501j73576j06042R4187
$$ 469278 563827 319656 98259 -107263 -304174 -280372 -74871 -248447 -354489 -260302
9175b60302L30630K24338k49760j07218p8390Q7231J25850p1057o1941J15935
$$ -260302 70328 294666 44906 -62312 -140702 -53471 72379 1322 -60619 55316
9165E5316J4535p3013O3474K11849M0334o0238j65572J17623k1312O827J18796
$$ 55316 69851 -3162 60312 272161 312495 252257 86685 204308 182996 189823 308619
9154C08619J9896j39784q4204j18532n2370L278N1800j04730j83916r3115m0517
$$ 308619 328515 188731 104527 -14005 -66375 -63097 -11297 -116027 -299943 -393058 -433575
9143d33575J25135N9482L23400Q6227M7822o7039n10p0413l02538j32104K96861
$$ -433575 -308440 -248958 74442 160669 208491 141452 140942 70529 -232009 -364113 -67252
9132f7252Q9769J28552Q5381O0934J39824j30130k98370Q8140K56736L37992j5904
$$ -67252 22517 151069 236450 297384 437208 307078 8708 96848 353584 691576 675672
9121F75672j77996j83783j3710Q4776j60074j93094j00065O7065k8680p215L08712
$$ 675672 497676 313893 300183 384959 224885 31791 -68274 -1209 -29889 -37104 271608
9110B71608P9500k13478k37204j52382J10730K94430R2767j36666j55997O8978
$$ 271608 351108 137630 -99574 -251956 -141226 153204 245971 109305 -46692 22286
9100B2286N6031M6468j38499J32285n0775r2696K05151P849k56660L5643j78777
$$ 22286 78317 124785 -13714 118571 67796 -24900 180251 188100 -68560 -32917 -211694
9089b11694O9193j02657M2744K53658J27423J85639j46300m96279k13486N3547
$$ -211694 -142501 -245158 -202414 51244 178667 364306 218006 -278273 -491759 -438212
9079d38212K51266K299J637J0602J77113N059p3915k34018J50515L97308j3278
$$ -438212 -186946 -184647 -183010 -172408 4705 9764 -64151 -298169 -147654 249654 236376
9068B36376l01164j14324Q9268K14445J11456r5109p7710j30817N6909L49246
$$ 236376 -64788 -179112 -89844 124601 236057 140948 63238 -67579 -10670 338576
9058C38576j7932J97888r2794m4000J62115k87764k54393k60921M8250N8364n6974
$$ 338576 320644 518532 425738 381738 543853 256089 1696 -259225 -210975 -152611 -209585
9047b09585Q716K22552J83668R2365j5002P7206L6405M4977l00242l62178n8644
$$ -209585 -200869 21683 205351 297716 282714 359920 396325 441302 141060 -221118 -279762
9036b79762k48878K13723J60312r285P311J3569K22963j06865j16823o1737n6562
$$ -279762 -528640 -314917 -154605 -163890 -156579 -143010 79953 -26912 -143735 -205472 -262034
9025b62034r8497j63877K03905p9669R82L9863j27080K35416O0284J00922J33659
$$ -262034 -360531 -524408 -320503 -400172 -399190 -359327 -486407 -250991 -190707 -89785 43874
9014D3874J44156j67346O708L4230k3897j48030m1223n5612J52175L21240j74464
$$ 43874 188030 20684 27392 61622 37725 -110305 -151528 -207140 -54965 266275 91811
9003I1811j20383k07328K23045K66841j06945m7249Q5707l8167K2561Q3071n3466
$$ 91811 -28572 -235900 -12855 253986 147041 99792 185499 147332 169893 252964 199498
8992A99498j66884j05329M2498l17598j22937K33230j0407k7157q8456N773J89935
$$ 199498 32614 -72715 -30217 -347815 -470752 -237522 -247929 -275086 -363542 -357769 -167834
8981a67834J28775K0479J14857j30548q061J13566K21181N4146k07664j90797
$$ -167834 -39059 -18580 96277 -34271 -42332 71234 292415 346561 138897 -51900
8971e1900O6615q5207J80732o7822k06592n5997J97670K0028j80861m9848J05012
$$ -51900 14715 -70492 110240 42418 -164174 -220171 -22501 -2473 -183334 -233182 -128170
8960a28170P4768N7646j39854p434R6389K33425m8017j20436M0928L6679p4031
$$ -128170 -53402 4244 -135610 -143044 -46655 186770 138753 18317 59245 95924 21893
8949B1893P0479k7491O4954r7107L35871K12415n9488L6981l85957k15336j68578
$$ 21893 92372 64881 129835 32728 368599 581014 521526 558507 172550 -42786 -211364
8938b11364K11432Q293J2292n5789R5943k382k38107o8862Q9987j12464J0301
$$ -211364 68 8361 20653 -35136 60807 58425 -179682 -248544 -158557 -271021 -260720
8927b60720n4362P327L87670n1362R0137j21392p0323J12200j7094l08226n8935
$$ -260720 -315082 -307755 79915 28553 118690 -2702 -73025 39175 22081 -286145 -345080
8916c45080N7636p8362k1184J82718O1934O7658o6730k38142j3753j1400Q6288
$$ -345080 -287444 -365806 -386990 -204272 -142338 -74680 -141410 -379552 -393305 -404705 -318417
8905c18417J5227J62103N437k6658l5094L5764p0763j61386j05721j8225Q629
$$ -318417 -303190 -141087 -135650 -162308 -197402 -161638 -232401 -393787 -499508 -517733 -509104
8894e09104k1546Q323J23791K17066n8041J24871J78428K84693K14626k1492p9324
$$ -509104 -530650 -522327 -398536 -181470 -239511 -114640 63788 348481 563107 541615 462291
8883D62291j25529n9328p1714k66353j14770j2775l2960K09384O8975L6197Q5232
$$ 462291 336762 277434 205720 -60633 -175403 -188178 -221138 -11754 57221 93418 178650
8872A78650l19533k49060J47323J39662P8383j53713k66988N2438L71441Q0055
$$ 178650 -140883 -389943 -242620 -102958 -24575 -178288 -445276 -392838 -21397 58658
8862E8658J77264M2932k787j09564O5860K04113K55195k09530k17417j2102m6866
$$ 58658 235922 278854 276067 166503 232363 436476 691671 482141 264724 252622 205756
8851B05756M4263J64004P1741M622l5146j68628o8508j06419j99176j09428j8982
$$ 205756 250019 414023 485764 490386 455240 286612 218104 111685 -87491 -196919 -215901
8840b15901J10350N8725L0426p5153j45079k3833K69179J71028K17948l9410l09939
$$ -215901 -105551 -46826 -16400 -91553 -236632 -260465 8714 179742 397690 358280 48341
8829D8341l07530o3808J05696J15790L29510R3712l70127K20214k6625j84715
$$ 48341 -259189 -322997 -217301 -101511 227999 321711 -48416 171798 145173 -39542
8819c9542j34601J56452L9747K4625m4760N0977L14893K13153J16037l19658j27514
$$ -39542 -174143 -17691 22056 46681 1921 52898 367791 580944 696981 377323 249809
8808B49809o1849j00122p5402K37609q9184n3911j34500k75132k2445L5856K35144
$$ 249809 187960 87838 12436 250045 160861 106950 -27550 -302682 -325127 -289271 -54127
8797e4127J13206L4221j22873k80567k8879J34268K21254N0356r0415J06882M5257
$$ -54127 59079 93300 -29573 -310140 -339019 -204751 16503 66859 -23556 83326 128583
8786A28583r7205J06083j85697j55316J26980L57921r3136p9491R8189J18149
$$ 128583 31378 137461 -48236 -203552 -76572 281349 188213 108722 206911 325060
8776C25060J26293J01286q9251j70726K1746j03290k32052j23881J82040K38598
$$ 325060 451353 552639 463388 292662 314408 211118 -20934 -144815 37225 275823
8766B75823L4973j44826K6872J22111l54759k37641N9071L48432L29844K5540
$$ 275823 310796 165970 192842 314953 -39806 -277447 -218376 130056 459900 485440
8756D85440l73489j77208J955j179J78115n7623r7624j21990J04698j1570o4322
$$ 485440 111951 -65257 -63302 -64481 113634 56011 -41613 -163603 -58905 -70475 -134797
8745a34797J42063K36504J51387l41669k98477L73290J95947q9657k90078j12992
$$ -134797 7266 243770 395157 53488 -244989 128301 324248 234591 -55487 -168479
8735a68479j03673O4843K63498K522J0816K7243O0788j27245q2534j42745R8814
$$ -168479 -272152 -207309 56189 58711 69527 96770 157558 30313 -52221 -194966 -96152
8724i6152J94104J50474l44q2580J23829O5402q5811k71292k52340o1584n4319
$$ -96152 97952 248426 248082 165502 289331 354733 268922 -2370 -254710 -316294 -370613
8713c70613K37095J02712j95329k69504O1840J09224Q8166J57146J89292R3890
$$ -370613 -133518 -30806 -226135 -495639 -433799 -324575 -236409 -79263 110029 203919
8703B03919K9722j45060P2201J51766j4168j16143o4818l8646R0817J03727p3812
$$ 203919 233641 88581 160782 312548 298380 182237 117419 78773 169590 273317 199505
8692A99505J47595J38737m2509l76033Q1993j3272M8806N911j64061j48032J00702
$$ 199505 347100 485837 443328 67295 149288 136016 184822 190733 26672 -121360 -20658
8681b0658P2842j31765o9515r9453j21122j37358K46066L29588Q5121j60586j6801
$$ -20658 52184 -79581 -149096 -248549 -369671 -507029 -260963 68625 153746 -6840 -23641
8670b3641q8473K2340R0295j5749o5094N1789K16003M5658j1168J43978j2470
$$ -23641 -112114 -89774 521 -15228 -80322 -28533 187470 233128 221960 365938 353468
8659C53468l64514j38033R8887K16030J04857j22614j62052J39177j68679k4604
$$ 353468 -11046 -149079 -50192 165838 270695 148081 -13971 125206 -43473 -68077
8649f8077n4848j57175k07800K46992O3618r2464j30009r1526K20516J98911k6934
$$ -68077 -122925 -280100 -487900 -240908 -177290 -269754 -399763 -491289 -270773 -71862 -98796
8638i8796k16010l4057J2673J70595j3471r3230K88288J18376k9804j71850l6961
$$ -98796 -314806 -348863 -336190 -165595 -179066 -272296 15992 134368 104564 -67286 -104247
8627a04247q9487l3638K10067N7466j69836J95189J67150j06261k4565L9989J99439
$$ -104247 -193734 -227372 -17305 40161 -129675 65514 232664 126403 101838 141827 341266
8616C41266j35720j20996l7650J42340J67119O5755j22829M6300K25379k5085
$$ 341266 205546 84550 46900 189240 356359 422114 299285 345585 570964 545879
8606E45879k34091j74961J05399N4277N7171r5125k10712j48490j34136j85687
$$ 545879 311788 136827 242226 296503 353674 258549 47837 -100653 -234789 -420476
8596d20476J60593L57358n9520l17298j31497J05767L05918J37766j59301J96447
$$ -420476 -259883 97475 37955 -279343 -410840 -305073 845 138611 -20690 175757
8586A75757J98137J71061K328n1929N2569R1363q6392l79955k28480J25825J25337
$$ 175757 373894 544955 547283 495354 547923 639286 552894 172939 -55541 70284 195621
8575A95621j84574j7270J92982K45668K2204O7190j25952O9982K3968j70268m382
$$ 195621 11047 -6223 186759 432427 454631 521821 395869 465851 489819 319551 315169
8564C15169j05286l01381J750J56646J9453k6584M25882L07869l27843k32644
$$ 315169 209883 -91498 -89748 66898 86351 59767 485649 793518 465675 233031
8554B33031j89633j50075K07816K1623k63956J7104o0275o7004J56272J75855
$$ 233031 43398 -106677 101139 122762 -141194 -124090 -184365 -251369 -95097 80758
8544H0758N9070Q6413q70j40376O3306J02467k45684j65301j49193l1149K6163
$$ 80758 139828 226241 225371 84995 148301 250768 5084 -160217 -309410 -340559 -314396
8533c14396J04570M8347J5803O2567P8094K643O5932j95932j33696J37084L6548
$$ -314396 -209826 -161479 -145676 -83109 -5015 -2372 63560 -132372 -266068 -128984 -92436
8522i2436K1552J33219K7809k76277M3946J38170K18369N3297j45460l62711M1294
$$ -92436 -70884 62335 90144 -186133 -142187 -4017 214352 267649 122189 -240522 -199228
8511a99228r3542J32598Q8417m5398j00752j18930K5312O7654Q5950k16074J48917
$$ -199228 -292770 -160172 -71755 -117153 -217905 -336835 -311523 -243869 -157919 -373993 -225076
8500b25076J71906o0239K0283J39392K30327n6335j73050n2104j09875J36139
$$ -225076 -53170 -113409 -93126 46266 276593 220258 47208 -4896 -114771 21368
8490B1368K82815o01J2170l6246j64490l6252k85913k83625j12225J14145k5345
$$ 21368 304183 303582 315752 279506 115016 78764 -207149 -490774 -602999 -488854 -514199
8479e14199J22439J52016K14139J93767p7798K26057n7828r0533n6079n0656P5291
$$ -514199 -391760 -239744 -25605 168162 90364 316421 258593 168060 111981 61325 136616
8468A36616J30000p3192k39143j77130m5325m553r867N6665M0130J55471p8191
$$ 136616 266616 193424 -45719 -222849 -268174 -272727 -282594 -225929 -185799 -30328 -108519
8457a08519p1596j27626J63481J26272J01450K09847K36871J5417j31408o3560
$$ -108519 -180115 -307741 -144260 -17988 83462 293309 530180 545597 414189 350629
8447C50629J14071J20828j18985n0317K71848k93530j7426L0795K8312M3272j01446
$$ 350629 464700 585528 466543 416226 688074 394544 377118 407913 436225 479497 378051
8436C78051n8740k2085M5165j94184j39348R372L0596N2976k91561p9881J55680
$$ 378051 319311 297226 342391 148207 8859 18231 48827 101803 -189758 -269639 -113959
8425a13959K08082J17104L8151J85781l7304l22295m7610j3178q6630Q1451J98575
$$ -113959 94123 211227 249378 435159 397855 75560 27950 14772 -71858 9593 208168
8414B08168j33602k34252j67026j4418R1958J66659J80693L39688K6058j99267
$$ 208168 74566 -159686 -326712 -341130 -249172 -82513 98180 437868 463926 264659
8404B64659j22060J75239l2877J54181k1715l03787m1718J55175K41479J33701
$$ 264659 142599 317838 284961 439142 417427 113640 71922 227097 468576 602277
8394F02277k47475l65520j01714o4520O948J28551M0078J40826n084r5357m1473
$$ 602277 354802 -10718 -112432 -176952 -170004 -41453 -1375 139451 134367 39010 -2463
8383b463j47442o3160J47213K29430J33171l20559n6599O5315K6384m022l1681
$$ -2463 -149905 -213065 -65852 163578 296749 -23810 -80409 -15094 11290 7268 -24413
8372b4413r5510J34353J2010q6952l0147N9808p236J01036J68788n115j95582
$$ -24413 -119923 14430 26440 -60512 -90659 -30851 -38087 62949 231737 226622 31040
8361C1040l52378j63339K29404K79026J77784q3573j74976k25453o3185R8332
$$ 31040 -321338 -484677 -255273 23753 201537 117964 -57012 -282465 -345650 -247318
8351b47318J85783O7690r9054J28662K40009J58038n5387k5266K68527K83979
$$ -247318 -61535 6155 -92899 35763 275772 433810 378423 353157 621684 905663
8341I05663Q2682r0228k17648j72768j71929n1872k74441j17959j32563J57404
$$ 905663 988345 898117 680469 507701 335772 283900 9459 -108500 -241063 -83659
8331h3659N5938o7904r8735J50533k8350l2900j04968j73035L2967R8614j34421
$$ -83659 -27721 -95625 -194360 -43827 -72177 -105077 -210045 -383080 -350113 -251499 -385920
8320c85920L8283J95302J55008J6887Q0653l039k98754n9193J13580M2100K34479
$$ -385920 -347637 -152335 2673 19560 100213 97174 -201580 -260773 -147193 -105093 129386
8309A29386K20202M951J36185j9521K1008J61723L03177J47707R7397R6720J90753
$$ 129386 349588 354539 490724 471203 492211 653934 957111 1104818 1202215 1298935 1489688
8298A489688P3740k5418q2408j50819l40774m93812j00575j1607j0361m238K15490
$$ 1489688 1563428 1538010 1455602 1304783 964009 470197 369622 358015 347654 343416 558906
8287E58906m4004J26507k3934p7183j70079p9966j38476k02771k03398L45992
$$ 558906 514902 641409 617475 540292 370213 290247 151771 -51000 -254398 91594
8277I1594P3254j00539J02281j11947k10529k7434J37392j22982j16354J06169
$$ 91594 164848 64309 166590 54643 -155886 -183320 -45928 -168910 -285264 -179095
8267a79095K98634M5595k15523k21053j49408j93695N3024L69173K71436K21125
$$ -179095 119539 165134 -50389 -271442 -420850 -614545 -561521 -192348 79088 300213
8257C00213J24534L56720K91343K0894J4988k37629l33290l28953j62095N3001
$$ 300213 424747 781467 1072810 1093704 1108692 871063 537773 208820 46725 99726
8247I9726J7501j90861j68291J89278J27932m1324p95k1717q2366J7672j00795
$$ 99726 117227 -73634 -241925 -52647 75285 33961 33166 11449 -70917 -53245 -154040
8236a54040o5120O1437J42029k23623j0188J22440L69659k0408j11237j29303
$$ -154040 -219160 -157723 -15694 -239317 -249505 -127065 242594 222186 110949 -18354
8226a8354r1620L98442j51495L0402J26304q053j29486P774O1640P6368Q131j10982
$$ -18354 -109974 288468 136973 167375 293679 285626 156140 163914 225554 301922 310053 199071
8214A99071L7307p3835J16830j72068l61692o5058m0260R3243K90645J5098N9704
$$ 199071 236378 162543 279373 107305 -254387 -319445 -359705 -266462 24183 39281 98985
8203I8985J26225q8592k23296m5121q8269K63148K79139O0769l7027J25577j96797
$$ 98985 225210 136618 -86678 -131799 -220068 43080 322219 382988 345961 471538 274741
8192B74741K6700j08064Q0605J49812m38005k07005J58538j6707j86240o4629
$$ 274741 301441 193377 273982 423794 -14211 -221216 -62678 -79385 -265625 -330254
8182c30254n430Q4273p4253l4555J84546J50013O9579j44756k6747j04118P2838
$$ -330254 -335684 -251411 -325664 -360219 -175673 -25660 43919 -100837 -127584 -231702 -158864
8171a58864O7091M3941o6194o2377Q7326j8870J5523J8714k3867M8918L17130
$$ -158864 -91773 -47832 -114026 -176403 -89077 -107947 -92424 -73710 -97577 -48659 268471
8160B68471Q8575j61739l9304r0882O1454j64608k1184K62908j68877q1473K33159
$$ 268471 357046 195307 156003 65121 126575 -38033 -59217 203691 34814 -46659 186500
8149A86500J54782q6849l3018J8935l7009K3966l8239k33572j57848j50774R3071
$$ 186500 341282 254433 221415 240350 203341 227307 189068 -44504 -202352 -353126 -260055
8138b60055K42939l7018l16934l6398J42854j19457J15586N4898m7394K1299J16147
$$ -260055 -17116 -54134 -371068 -407466 -264612 -384069 -268483 -213585 -260979 -239680 -123533
8127a23533O2950j18690p7309J30781R8627J19532j59933r6836J59206J87330
$$ -123533 -60583 -179273 -256582 -125801 -27174 92358 -67575 -164411 -5205 182125
8117A82125Q1555P5382j29798l31487J26624J28954q7900J56151p5455j34351
$$ 182125 263680 339062 209264 -122223 4401 133355 45455 201606 126151 -8200
8107h200P3809K9928J48261K55868o9004j72458j44434j18493j25201j39452k3417
$$ -8200 65609 95537 243798 499666 430662 258204 113770 -4723 -129924 -269376 -292793
8096b92793K26179o7897o4098K09207J32071j36584N0749J38236J68894j38938
$$ -292793 -66614 -134511 -198609 10598 142669 6085 56834 195070 363964 225026
8086B25026l87057l34300P8107J23696n726J26098K23872j2038R575J92716J22910
$$ 225026 -162031 -496331 -418224 -294528 -300254 -174156 49716 37678 47253 239969 362879
8075C62879j90568o1515N0021M9534j03075J22326O1512m3869j12966j04851k006
$$ 362879 172311 110796 160817 210351 107276 229602 291114 247245 134279 29428 27422
8064B7422K42232j52924k38145k11137o3227J5337j8568n2971N2905o0634K11563
$$ 27422 269654 116730 -121415 -332552 -395779 -380442 -399010 -451981 -399076 -459710 -248147
8053b48147L18927j7828j91749j80569J19422J71450J69425j84591J71938P7389
$$ -248147 70780 52952 -138797 -319366 -199944 -28494 140931 -43660 128278 205667
8043B05667l48539j45263L17205J5601j81838q9734m0823K4953J73191R2582n3574
$$ 205667 -142872 -288135 29070 44671 -137167 -226901 -267724 -242771 -69580 23002 -30572
8032c0572j50829M5894L25400N701p3666p4469L5688K8392Q4031J98461M2584
$$ -30572 -181401 -135507 189893 195594 121928 47459 83147 111539 195570 394031 436615
8021D36615k27756k70294k890R510M8693j33674J95708M5693q6951J16633m2615
$$ 436615 208859 -61435 -64325 -54815 -6122 -139796 55912 101605 14654 131287 88672
8010H8672k42950J33642J20070o8163J21638m7942K6952R7153Q361j18108j37620
$$ 88672 -154278 -20636 99434 31271 152909 104967 131919 229072 237433 119325 -18295
7999a8295L3772J77281K68982o8344r3201K317l3153o1063j83007j27382n7333
$$ -18295 15477 192758 461740 393396 300195 302512 269359 208296 25289 -102093 -159426
7988a59426K04578L3162m96319k35195J61856O0110K45242K05107R3384q0098
$$ -159426 45152 78314 -418005 -653200 -491344 -431234 -185992 19115 112499 32401
7978C2401M7186j4237K00421J12556j03740o0740j07412M7957J21817J1719m3715
$$ 32401 79587 65350 265771 378327 274587 213847 106435 154392 276209 287928 244213
7967B44213j16370n3990j87888n9090j9083J10909N6738l2225J62028k8392q8950
$$ 244213 127843 73853 -114035 -173125 -192208 -81299 -24561 -56786 105242 76850 -12100
7956a2100N7080j01620j82113N951j7708j99918l4096J23201j2648o2187J14957
$$ -12100 44980 -56640 -238753 -232802 -250510 -450428 -484524 -361323 -373971 -436158 -321201
7945c21201K25309J81814o4714n4884N1874r3248j35749j50558J2283m7868K88227
$$ -321201 -95892 85922 21208 -33676 18198 -75050 -210799 -361357 -349074 -396942 -108715
7934a08715K71687J54719M3616p6907O4943k5350l2474j98698P0749j17325k01985
$$ -108715 162972 317691 361307 284400 349343 323993 291519 92821 163570 46245 -155740
7923a55740j76914J76165M1886l03011J48070K33663r667N5289K33351K26161
$$ -155740 -332654 -156489 -114603 -417614 -269544 -35881 -45548 9741 243092 469253
7913D69253l1000k26050j04862K7047p2729j4245J2229J0249Q3049k425o7625
$$ 469253 438253 212203 107341 134388 61659 47414 59643 69892 152941 150516 82891
7902H2891J28553j85380j10172R6798R286j11301m8320j19436j35150K49343J70521
$$ 82891 211444 26064 -84108 12690 21976 -89325 -137645 -257081 -392231 -142888 27633
7891B7633M0925k7926L8882J21931N9436L5855l0177j21775k62014K1665j135
$$ 27633 68558 40632 79514 201445 260881 296736 266559 144784 -117230 -95565 -96700
7880i6700j46074Q0573K09973L1127J8587o4689j6309m6923K43195J44227M9127
$$ -96700 -242774 -162201 47772 78899 97486 32797 16488 -30435 212760 356987 406114
7869D06114j46516l15445n557Q8843N8883J57153J00199k8995j34903o0058P4832
$$ 406114 259598 -55847 -61404 27439 86322 243475 343674 314679 179776 119718 194550
7858A94550n1370Q4300o929k41699j6227K684N1504k41134N2589J9215J5101M1116
$$ 194550 143180 227480 220551 -21148 -37375 -34691 16813 -224321 -171732 -152517 -137416 -96300
7846i6300N0663m596N0479k58511k37512J57684L36377J2334j04182P2350j54435
$$ -96300 -45637 -50233 246 -258265 -495777 -338093 -1716 10618 -93564 -21214 -175649
7835a75649O8950K36143J2463j89965l8829N483N1837Q9003k09389m0130J89920
$$ -175649 -106699 129444 141907 -48058 -86887 -81404 -29567 59436 -149953 -190083 -163
7824a63j6347m0008j19267j04503J23650J69763P188j57906n8928J05313k54505
$$ -163 -16510 -56518 -175785 -280288 -156638 13125 20313 -137593 -196521 -91208 -345713
7813c45713M628K21317K27331k48267r9507l5521K03396n1768j80987n2890J26380
$$ -345713 -341085 -119768 107563 -140704 -240211 -275732 -72336 -124104 -305091 -357981 -231601
7802b31601j54743J32609l0942p5522J83910J09404n4746M7229J33525J48531
$$ -231601 -386344 -253735 -284677 -360199 -176289 -66885 -121631 -74402 59123 207654
7792B07654j0111j47295j11202k84949p3260M9415J62826P1932M3107J439R8237
$$ 207654 197543 50248 -60954 -345903 -419163 -369748 -206922 -134990 -91883 -90444 7793
7781G793O6504J05365k69038l9462J63364j16432j95290j65175L8391r7055J95820
$$ 7793 74297 179662 -89376 -128838 34526 -81906 -277196 -442371 -403980 -501035 -305215
7770c05215J39558P3528K56232L6047L14917J39736k01298l64643j92724r4777
$$ -305215 -165657 -92129 164103 200150 515067 654803 453505 88862 -103862 -198639
7760a98639k0881R1964K29565P8952l4112r8555j62342j67607j25666j13558L24629
$$ -198639 -219520 -127556 102009 180961 146849 48294 -114048 -281655 -407321 -520879 -196250
7749a96250L00644J14703J4194k41845k54681p9096K33168K53149k7262k132J5982
$$ -196250 104394 219097 233291 -8554 -263235 -342331 -109163 143986 116724 114592 130574
7738A30574M492q021q8753k65132K0562O4456j12391J62430L29197k23399l79936
$$ 130574 135066 127045 38292 -226840 -206278 -141822 -254213 -91783 237414 14015 -365921
7727c65921K26001K70876j34495l03837m7110J27035k284m096R3799R9749O987
$$ -365921 -139920 130956 -3539 -307376 -354486 -227451 -229735 -233831 -140032 -40283 -33296
7716c3296J24335J34517J43927j97561k97727r2567J94011K19900j33190k49377
$$ -33296 91039 225556 369483 171922 -125805 -218372 -24361 195539 62349 -187028
7706a87028K6362r6354Q16j69314m1528J10867J51557j29706p633J04046J26879
$$ -187028 -160666 -257020 -256204 -425518 -467046 -356179 -204622 -334328 -341961 -237915 -111036
7695a11036n827J47238L0589m12191o2486M67846K61042k51010j40554j10784
$$ -111036 -116863 30375 60964 -351227 -413713 54133 315175 64165 -76389 -187173
7685a87173p6319O1261K37964L7421R3783K14590k1639k08334j70510J59798R9284
$$ -187173 -263492 -202231 35733 73154 166937 381527 359888 151554 -18956 140842 240126
7674B40126j28400q5958k61904N6511J93795j69717n9676O0118J38379j61235
$$ 240126 111726 25768 -236136 -179625 14170 -155547 -215223 -155105 -16726 -177961
7664a77961J43416R5444J97863J69735j21726k46023k08953N5098K40760J22388
$$ -177961 -34545 60899 258762 428497 306771 60748 -148205 -93107 147653 270041
7654B70041l70339k29900J32808o3736n7012n1979K10579R4486q4119j58240J28429
$$ 270041 -100298 -330198 -197390 -261126 -318138 -370117 -159538 -65052 -149171 -307411 -178982
7643a78982L11548J38556K8777N8186j71752k31070N0278j11832r6304K6953K31141
$$ -178982 132566 271122 299899 358085 186333 -44737 5541 -106291 -202595 -175642 55499
7632E5499Q4851j67654R6190m8140O285q6873M5380p2721P4839r5191j83903J60805
$$ 55499 140350 -27304 68886 20746 27031 -59842 -14462 -87183 -12344 -107535 -291438 -130633
7620a30633L6880J78365J34960J0540N2014q2485l17346P8938J00633n2762n0902
$$ -130633 -93753 84612 219572 230112 282126 199641 -117705 -38767 61866 9104 -41798
7609d1798Q5766Q6660j93379K16760M3914m6130Q7649j92026R4942o8535J47662
$$ -41798 43968 130628 -62751 154009 197923 151793 239442 47416 142358 73823 221485
7598B21485j36775k02947J98780j4473k18809L47185J02921m9001j63394J38164
$$ 221485 84710 -118237 80543 66070 -152739 194446 297367 248366 84972 223136
7588B23136k13826o9207q2530k59817j05663K15689j06675N6956K60284J1478
$$ 223136 9310 -59897 -142427 -402244 -507907 -292218 -398893 -341937 -81653 -70175
7578g0175m5238j2166O3154j99588M0149K02602P0934o5605j36190O9704J05922
$$ -70175 -115413 -127579 -64425 -264013 -223864 -21262 49672 -15933 -152123 -82419 23503
7567B3503K35188o3295q1531J77692J0316M8874K29325j07572l63506k00469J37289
$$ 23503 258691 195396 113865 291557 301873 350747 580072 472500 108994 -91475 45814
7556D5814r343q0972o2438R546m5350K93513K53681j51496l33453j30213M820
$$ 45814 36471 -44501 -106939 -97393 -142743 150770 404451 252955 -80498 -210711 -205891
7545b05891k2583J63424k6165j00198j04002O7233J08969N4715J04724O5344m5930
$$ -205891 -228474 -65050 -91215 -191413 -295415 -228182 -119213 -64498 40226 105570 59640
7534E9640p9451j85888k27998J72092k6291r7481J26018J32624K07884r5152k07039
$$ 59640 -19811 -205699 -433697 -261605 -287896 -385377 -259359 -126735 81149 -14003 -221042
7523b21042p6811J12354K9772K2541q8010J18147J27140o2160J34090r7971P439
$$ -221042 -297853 -185499 -155727 -133186 -221196 -103049 24091 -38069 96021 -1950 5489
7512E489L9580p3688j13479J46990J76920K47758l3381j79710j51850O5921k44225
$$ 5489 45069 -28619 -142098 4892 181812 429570 396189 216479 64629 130550 -113675
7501a13675k30913n4518J05143J37500p797l1334K5674Q6912j11467p224N19k03362
$$ -113675 -344588 -399106 -293963 -156463 -164260 -195594 -169920 -83008 -194475 -201699 -201180 -404542
7489d04542l76971j61505M08401K18558J92818r921o2937n4482J8880N5340J69502
$$ -404542 -781513 -943018 -534617 -316059 -123241 -133162 -196099 -250581 -231701 -176361 -6859
7478f859J22644r3924k35541p8862M2238J72431j69336j27472j5944o514K19331
$$ -6859 115785 21861 -213680 -292542 -250304 -77873 -247209 -374681 -390625 -397139 -177808
7467a77808J63859j16286k8787M3631m9533P0441k392j7564R3856J32863m5619
$$ -177808 -13949 -130235 -159022 -115391 -164924 -94483 -96875 -114439 -20583 112280 66661
7456F6661j04096j70344N3908R0800r5464K04306K3354k48317M2094J4393l7110
$$ 66661 -37435 -207779 -153871 -63071 -158535 45771 69125 -179192 -137098 -122705 -159815
7445a59815j57104j82420o7723O7682J37209K25285o8625K9431J14645J96824
$$ -159815 -316919 -499339 -567062 -499380 -362171 -136886 -205511 -176080 -61435 135389
7435A35389K45565j89895k58316n1721Q9780r286J03286R0488k51396j87049O4989
$$ 135389 380954 191059 -67257 -118978 -29198 -38484 64802 155290 -96106 -283155 -218166
7424b18166n8849Q5379J29529M9128j69081j32640n8664P1515J72656K20230K5092
$$ -218166 -277015 -191636 -62107 -12979 -182060 -314700 -373364 -301849 -129193 91037 116129
7413A16129L9700p3008k6094J56973p4890l5386J79570o7222k15577M4010M3990
$$ 116129 155829 82821 56727 213700 138810 103424 282994 215772 195 44205 88195
7402H8195j36649P0443m5487L843J78871o5216l7957j01545J02691J21092j61697
$$ 88195 -48454 21989 -23498 -19655 159216 94000 56043 -45502 57189 178281 16584
7391A6584k32344j0084j38279q9305n9994J55952n195J52862J73346K16272J15889
$$ 16584 -215760 -225844 -364123 -453428 -513422 -357470 -362665 -209803 -36457 179815 295704
7380B95704j3974j4355j08865o7233j2617p3285Q9969J09932j78567R598J04570
$$ 295704 281730 267375 158510 91277 78660 5375 95344 205276 26709 36307 140877
7369A40877J89612r0550j34310j08477J91087J42737J53706r538j69427p6872
$$ 140877 330489 239939 105629 -2848 188239 330976 484682 475144 305717 228845
7359B28845j37070j42650J043J300j88263j77058P6169J89367J24206k287k2781
$$ 228845 91775 -50875 -49832 -48532 -236795 -413853 -337684 -148317 -24111 -26398 -49179
7348d9179K70548M4941j79794j16520j47019r2365M5908K47854K4579j4690j34301
$$ -49179 221369 266310 86516 -30004 -177023 -269388 -223480 24374 48953 34263 -100038
7337a00038L4191L58555L41116m1055l04867L5247k83578n7997J9153j78790p4603
$$ -100038 -65847 292708 633824 592769 287902 323149 39571 -18426 727 -178063 -252666
7326b52666k61562j55562O5003L03807J6779J8045J31177R9324P6493j30637j59673
$$ -252666 -514228 -669790 -604787 -300980 -284201 -266156 -134979 -35655 40838 -89799 -249472
7315b49472M9054R4681J31636Q857K1713j7426J4361J19589j2466k40645j36509
$$ -249472 -200418 -105737 25899 34756 56469 39043 53404 172993 160527 -80118 -216627
7304b16627L9323J61133j04388r179L6641J10839m6845l4320J21939k508j67502
$$ -216627 -177304 -16171 -120559 -129738 -93097 17742 -29103 -63423 58516 56008 -111494
7293a11494J87492L68627k60102o7906J19706p151j00253j5363p3716j5189J3227
$$ -111494 75998 444625 184523 116617 236323 229172 128919 113556 39840 24651 37878
7282C7878m527r2840q5073K34923P610l3064L1258L471l3193j1336j35962j23567
$$ 37878 33351 -59489 -144562 90361 97971 64907 96165 99636 66443 55107 -80855 -204422
7270b04422q9571K95074K2880m1786k8258k6693k5092J64981R9280M0494q9757
$$ -204422 -293993 1081 23961 -17825 -46083 -72776 -97868 67113 166393 206887 117130
7259A17130j73718R2332m0365q9329j14066Q998K86665k9895P5731J29377O5727
$$ 117130 -56588 35744 -4621 -93950 -208016 -199018 87647 57752 133483 262860 328587
7248C28587P3153k11660j76668R011J221q7419l03714K8571K78571J11160R0456
$$ 328587 401740 190080 13412 22423 23644 -63775 -367489 -338918 -60347 50813 141269
7237A41269j29439o0837j2352K03025j3160Q5011J16492J93224l04202o9794o309
$$ 141269 11830 -49007 -61359 141666 128506 213517 330009 523233 219031 149237 142928
7226A42928r7346r0080Q8633r1083r1761P6200L29824J8660j78676r4445j41926
$$ 142928 45582 -44498 44135 -46948 -138709 -62509 267315 285975 107299 12854 -129072
7215a29072n1108m3123J62179j01631k4291r0109N2210K31649k37055j71718j59428
$$ -129072 -180180 -223303 -61124 -162755 -187046 -277155 -224945 6704 -230351 -402069 -561497
7204e61497j5549J75139J03945K22078m7484l51703r2739j28012L9801J12100
$$ -561497 -577046 -401907 -297962 -75884 -123368 -475071 -567810 -695822 -656021 -543921
7194e43921R1079J94693J16743P9764j15810j60099J24509M0350J11248q685L99731
$$ -543921 -452842 -258149 -141406 -61642 -177452 -337551 -213042 -172692 -61444 -70129 329602
7183C29602N5595j76869q3451L0318m4718j04933j91082j6602J7563J54942r5409
$$ 329602 385197 208328 124877 155195 110477 5544 -185538 -202140 -184577 -29635 -125044
7172a25044j12795J77677J83045J27153Q9852O9003p4738j00208q9561l22230
$$ -125044 -237839 -60162 122883 250036 339888 408891 334153 233945 144384 -177846
7162a77846o0657K54558l797J78537ko8061n1552J12562q3065o7398j99049r6024
$$ -177846 -238503 16055 12258 190795 190793 122732 71180 183742 100677 33279 -165770 -261794
7150b61794J84154k53313l6364K21119K07509Q1260j73221q569N2883k71k15628
$$ -261794 -77640 -330953 -367317 -146198 61311 142571 -30650 -39219 13664 13393 -202235
7139b02235J01908J89155J24364O8206N0586p5902j25011K1428k48668j87906
$$ -202235 -100327 88828 213192 281398 331984 256082 131071 152499 -96169 -284075
7129b84075l0977j48646O9128L40771J96381N9709J56404k19899j85160j22754
$$ -284075 -315052 -463698 -394570 -53799 142582 202291 358695 138796 -46364 -169118
7119a69118j07375M8692P9782p4851q3495n5307J25048j12303l8893J98146J59542
$$ -169118 -276493 -227801 -148019 -222870 -306365 -361672 -236624 -348927 -387820 -189674 -30132
7108c0132j72164R4895R3968N183P621j28339p174J51413J01241O5491J51413
$$ -30132 -202296 -107401 -13433 -8250 -629 -128968 -136142 15271 116512 182003 333416
7097C33416j31303j23028m786K96863J90419k14148j45474K5387n1586p7558p3325
$$ 333416 202113 79085 74299 371162 561581 347433 201959 227346 175760 98202 24877
7086B4877j32416j22019o8673J01642K5813o4329J74391K98209j70913j06177
$$ 24877 -107539 -229558 -298231 -196589 -170776 -235105 -60714 237495 66582 -39595
7076c9595N1321J5177J22862p6593j56461k27530o0757n0448l3857k8453K16332
$$ -39595 11726 26903 149765 73172 -83289 -310819 -371576 -422024 -455881 -484334 -268002
7065b68002J98547J49698J74820l27019m54789j08593j66442K52230R6572J46185
$$ -268002 -69455 80243 255063 -71956 -526745 -635338 -801780 -549550 -452978 -306793
7055c06793K60128K28087K26226o2247l32521l53283l5055O7882L67273J37163
$$ -306793 -46665 181422 407648 345401 12880 -340403 -375458 -307576 59697 196860
7045A96860j61844R4717M6754o6851R6474l7870j21078J45706R6513j47220Q2064
$$ 196860 35016 129733 176487 109636 206110 168240 47162 192868 289381 142161 224225
7034B24225q2198j0451k49842n7486o0314q4727J97312R5565n7067l438j35464
$$ 224225 142027 131576 -118266 -175752 -236066 -320793 -123481 -27916 -84983 -88421 -223885
7023b23885k44575p3149J29115O5419j79909n6798K64496K43437J51775j21102
$$ -223885 -468460 -541609 -412494 -347075 -526984 -583782 -319286 -75849 75926 -45176
7013d5176M448N3209L01497K0518k85305K4007J50400r2141J7889M8346j26966
$$ -45176 -40728 12481 313978 334496 49191 73198 223598 131457 149346 197692 70726
7002G0726p294K59456P0402j26211j0316k00313k09631O7093J93791j83887j89261
$$ 70726 63432 322888 393290 267079 256763 56450 -153181 -86088 107703 -76184 -265445
6991b65445P0185R4841P6790L2771o4569J5172j61045K1394p4816J40021K54111
$$ -265445 -195260 -100419 -23629 9142 -55427 -40255 -201300 -179906 -254722 -114701 139410
6980A39410k0380j76238q5884O2481j10287r0878J82230J33314q0462j49329J50812
$$ 139410 119030 -57208 -143092 -80611 -190898 -281776 -99546 33768 -46694 -196023 -45211
6969d5211J0188n4905L3392q4429p0762Q4296J54511K9098k25535j92888j3698
$$ -45211 -35023 -89928 -56536 -140965 -211727 -127431 27080 56178 -169357 -362245 -375943
6958c75943J35003J58808p1679j85836P5496j8138J48182J77216j90521r0779
$$ -375943 -240940 -82132 -153811 -339647 -264151 -282289 -134107 43109 -147412 -238191
6948b38191J95893J08892m0472j29623o3997L1065J5469O5418j28896k57713J73064
$$ -238191 -42298 66594 26122 -103501 -167498 -136433 -120964 -55546 -184442 -442155 -269091
6937b69091J40933Q0010k1870M9831L4689J010L9108j65220j15047K09074J90563
$$ -269091 -128158 -48148 -70018 -20187 14502 15512 54620 -110600 -225647 -16573 173990
6926A73990Q4851l7013j94797j90522l5M6822J1335J19319J94590q9933J08926
$$ 173990 258841 221828 27031 -163491 -163526 -116704 -105369 13950 208540 118607 227533
6915B27533j64400J3253K71409j71910j97769J33580J79952J9915n4034j20283
$$ 227533 63133 76386 347795 175885 -21884 111696 291648 311563 257529 137246
6905A37246Q8672J33851k46685j79324N8865J54583r6513o3820n8150j98331l1450
$$ 137246 225918 359769 113084 -66240 -7375 147208 50695 -13125 -71275 -269606 -301056
6894c01056n9191l66320o0150J17658L08933J03232j02890j55894K74758J75751
$$ -301056 -360247 -726567 -786717 -669059 -360126 -256894 -359784 -515678 -240920 -65169
6884f5169J26310J11745J92705K4634k32526o7606j15965k60089P6284o0164L21234
$$ -65169 61141 172886 365591 390225 157699 90093 -25872 -285961 -209677 -269841 51393
6873E1393K11429n5160O7024J58456Q8520k0717k79426k28063k54879l76714K67590
$$ 51393 262822 207662 274686 433142 521662 500945 221519 -6544 -261423 -638137 -370547
6862c70547M49298p0442q1982J30233L00412j5420l00065j64452m8164J24665
$$ -370547 78751 8309 -73673 56560 356972 341552 41487 -122965 -171129 -46464
6852d6464K28424J71578k09921m11540j96049P84K3919J15484M2831J49646K42995
$$ -46464 181960 353538 143617 -267923 -463972 -463188 -439269 -323785 -280954 -131308 111687
6841A11687J75511J41294N4262o4203l77781M8221Q0778J49934j86836j31975
$$ 111687 287198 428492 482754 418551 40770 88991 169769 319703 132867 892
6831H92k6020k1123K30973N4044k18376J50827J34762J903r4695k27074l4761
$$ 892 -25128 -46251 184722 238766 20390 171217 305979 307882 213187 -13887 -48648
6820d8648J16144N6234R7845k62756k86728k520K90315K62204o0961k4839J7468
$$ -48648 67496 123730 221575 -41181 -327909 -330429 -40114 222090 161129 136290 153758
6809A53758k0038k5669r8062j41930K9926p4983q4661l34916J1937J13597L45186
$$ 153758 133720 108051 9989 -131941 -102015 -176998 -261659 -596575 -584638 -471041 -125855
6798a25855q9308J7952j00577J74172j01629j09206J5572J88281K08943q6581
$$ -125855 -215163 -197211 -297788 -123616 -225245 -334451 -318879 -130598 78345 -8236
6788h236l06862K3906Q1275l100J41208N9341j93677k56597j56877l1644J26864
$$ -8236 -315098 -291192 -209917 -213017 -71809 -12468 -206145 -462742 -619619 -651263 -524399
6777e24399J09970M5015M44938L31175o8281k66898n4102q7977L7213j16901j35853
$$ -524399 -414429 -369414 75524 406699 338418 71520 17418 -70559 -33346 -150247 -286100
6766b86100M6249n4373k72612M51636M91587l20456o0172J54662r5609J17323
$$ -286100 -239851 -294224 -566836 -115200 376387 55931 -4241 150421 54812 172135
6756A72135K88716k75809k82545m101J89774J27104j54293R1007K62684J38497
$$ 172135 460851 185042 -97503 -101604 88170 215274 60981 151988 414672 553169
6746E53169k63662O814N2165k18245o9396n4243L1005J09052j4369N3388M4410
$$ 553169 289507 296321 348486 130241 60845 6602 37607 146659 132290 185678 230088
6735B30088k47956m0313J00307L18919J09515n3678j15042J5596j35487j76601
$$ 230088 -17868 -58181 42126 361045 470560 416882 301840 317436 181949 5348
6725E348k26153j21211j12462o3160K32781K50079K8202L3845n7409J02724L8091
$$ 5348 -220805 -342016 -454478 -517638 -284857 -34778 -6576 27269 -30140 72584 110675
6714A10675j11316O8562J77092J31565k07218l39886J44545J49426P8790J57075
$$ 110675 -641 67921 245013 376578 169360 -170526 -25981 123445 202235 359310
6704C59310j46022k71580k19008J18309R4651o9052L2161J23906l8149k5239l02558
$$ 359310 213288 -58292 -277300 -158991 -64340 -133392 -101231 22675 -15474 -40713 -343271
6693c43271M6874K52616J31372m7951k68026j28049J96327k9047m7048K07385
$$ -343271 -296397 -43781 87591 39640 -228386 -356435 -160108 -189155 -236203 -28818
6683b8818o0586r0237q7949J5206L0666J92833K16986j05769j38988R9192R8315
$$ -28818 -89404 -179641 -267590 -252384 -221718 -28885 188101 82332 -56656 42536 140851
6672A40851n4516o1889m9105k35928J02425L5748o8851j04860o6190Q7033K2930
$$ 140851 86335 24446 -24659 -260587 -158162 -122414 -191265 -296125 -362315 -275282 -252352
6661b52352J14563M0764o1685l4104L0360Q0326L80587R7952k68714k59451q9855
$$ -252352 -137789 -97025 -158710 -192814 -162454 -82128 298459 396411 127697 -131754 -221609
6650b21609R3615O716j21083j55786K14163L81802N2066j658k039j9173k30468
$$ -221609 -127994 -121278 -242361 -398147 -183984 197818 249884 248226 246187 227014 -3454
6639c454n4112Q5977j3818j37210j84389j25597J50450J50707J23139L5225j60678
$$ -3454 -57566 28411 14593 -122617 -307006 -432603 -282153 -131446 -8307 26918 -133760
6628a33760o4677O6179M33727K64818k60323m4139m3608J07664J20443j8191m5098
$$ -133760 -198437 -132258 301469 566287 305964 261825 218217 325881 446324 428133 383035
6617C83035j83206p1410j28924n3995k61100p3379K90143M9474j36896M9157J27793
$$ 383035 199829 128419 -505 -54500 -315600 -388979 -98836 -49362 -186258 -137101 -9308
6606i308J66976L1042q8357j01796p1731J35021P4140l72087j46753L22216j4230
$$ -9308 157668 188710 100353 -1443 -73174 61847 135987 -236100 -382853 -60637 -74867
6595g4867k61954J74455l559k16438k46861J54067K19256J7718o2574J50653J03771
$$ -74867 -336821 -162366 -165925 -382363 -629224 -475157 -255901 -238183 -300757 -150104 -46333
6584d6333p6872j38885k23602Q834J05784N1503J26477J19385r6334o4380K51044
$$ -46333 -123205 -262090 -485692 -476858 -371074 -319571 -193094 -73709 -170043 -234423 16621
6573A6621J59464l7602j29262j05101q653k8904j76215j1851J87303q1755l5260
$$ 16621 176085 138483 9221 -95880 -104533 -133437 -309652 -321503 -134200 -215955 -251215
6562b51215r2022J3279R4505m4244J63934L6706J32521M0559k31846rJ31578O0482
$$ -251215 -343237 -329958 -235453 -279697 -115763 -79057 53464 94023 -137823 -137832 -6254 54228
6550E4228k675Q7930J40305J44066j22490m0613K3534k9944Q0825N9826l4159
$$ 54228 51553 139483 279788 423854 301364 260751 284285 254341 335166 394992 360833
6539C60833K9638J21417L3375j27466k16916K1335J44559j85870j62859j17579
$$ 360833 390471 511888 545263 417797 200881 222216 366775 180905 18046 -99533
6529i9533j39722L6703M6515J70406M4906o1963q6367L06442O4961o4551m5782
$$ -99533 -239255 -202552 -156037 14369 59275 -2688 -89055 217387 282348 217797 172015
6518A72015J47213O1252P9970j69733N8313p0903j79426p2571q9453R877R5961
$$ 172015 319228 380480 460450 290717 349030 278127 98701 26130 -63323 -53446 42515
6507D2515J71755k00355p1683P6323n9295n6644k23201m8963K84047P1758R3715
$$ 42515 214270 13915 -57768 18555 -40740 -97384 -320585 -369548 -85501 -13743 79972
6496G9972J2191j34022N1657J64355K16686J18750m7700k71412j77023j48842
$$ 79972 92163 -41859 9798 174153 390839 509589 461889 190477 13454 -135388
6486a35388r9285j57278j44115K10407P547k8585J58081K2199r6528P7036J77145
$$ -135388 -234673 -391951 -536066 -325659 -318112 -346697 -188616 -166417 -262945 -185909 -8764
6475h764m3972M3050J98864j59931m2109p8751n0031L8212J430O332J27454M36489
$$ -8764 -52736 -9686 189178 29247 -12862 -91613 -141644 -103432 -102002 -95670 31784 468273
6463D68273p8430M6511K5969p7441j67920j43928K04929j05907k15647J77944
$$ 468273 389843 436354 462323 384882 216962 73034 277963 172056 -43591 134353
6453A34353R224j48773j47391j5338J21213J59291q2319k24180j0398P963P8105
$$ 134353 143577 -5196 -152587 -167925 -46712 112579 30260 -193920 -204318 -196355 -118250
6442a18250o8370J01771L5065o2904J36211Q712k5595J23140J9615j77209o231
$$ -118250 -186620 -84849 -49784 -112688 23523 32235 6640 129780 149395 -27814 -34045
6431c4045K3332K45694L5268p6740M4352j51508l00586K35904K87218l7064m8528
$$ -34045 -10713 234981 270249 193509 237861 86353 -214233 21671 308889 271825 223297
6420B23297o326J01812j66524l74629j49594L1065J54972N7591J98368n6817O976
$$ 223297 216971 318783 152259 -222370 -371964 -340899 -185927 -128336 70032 13215 20191
6409B0191L2037j35202k5279q1232K4437O1254L169P327j40730J58321L4172j00682
$$ 20191 52228 -82974 -108253 -189485 -165048 -103794 -100625 -93298 -234028 -75707 -41535 -142217
6397a42217M7020M4675J4861K18674K8675j89747r1314K16009k08106k0804k37200
$$ -142217 -95197 -50522 -35661 183013 211688 21941 -69373 146636 -61470 -82274 -319474
6386c19474r6110J73585l9936l72703m7820L19855K09846M3100Q0652m955K98925
$$ -319474 -415584 -241999 -281935 -654638 -702458 -382603 -172757 -129657 -49005 -53960 244965
6375B44965N3404r1114j74991o7145K87046K6518l91486j62107K52294Q5673o9273
$$ 244965 298369 207255 32264 -34881 252165 278683 -112803 -274910 -22616 63057 -6216
6364f216o1700Q6293L2396j1318L5299J65680J02720m04347Q0133M10797r72l32519
$$ -6216 -67916 18377 50773 39455 74754 240434 343154 -61193 18940 429737 428765 96246
6352I6246k69867p3868j55085j35291L19943K41315J80816k2009j25509J01502
$$ 96246 -173621 -247489 -402574 -537865 -217922 23393 204209 182200 56691 158193
6342A58193J25252l2450n9498n7865j60676m4785l5433P2207J3578J87788J04122
$$ 158193 283445 250995 191497 133632 -27044 -71829 -107262 -35055 -21477 166311 270433
6331B70433m01498l1374Q7215k7626n8343j2896L7914j6605j08059J4740P8138
$$ 270433 -131065 -162439 -75224 -102850 -161193 -174089 -136175 -152780 -260839 -246099 -167961
6320a67961J63512j06020q848K68176J81314k17545j14157J58861O9421Q8262
$$ -167961 -4449 -110469 -119317 148859 330173 112628 -1529 157332 226753 315015
6310C15015k7422J58l2335j80652q3377j65297m9330q6208k33786q9385K77520
$$ 315015 287593 287751 255416 74764 -8613 -173910 -223240 -309448 -543234 -632619 -355099
6299c55099J94550k5750l3535J38412J11954J30726o1314n1435L1605k18067j40256
$$ -355099 -160549 -186299 -219834 -81422 30532 161258 99944 48509 80114 -137953 -278209
6288b78209j45266j3133J81893L18472K59401k418P0778j63662j79146k93025
$$ -278209 -423475 -436608 -254715 63757 323158 320740 391518 227856 48710 -244315
6278b44315O6300L9876J36713j18533N6568R4022J44068j52090k40235L1887j12278
$$ -244315 -178015 -138139 -1426 -119959 -63391 30631 174699 22609 -217626 -185739 -298017
6267b98017J60856P7276K37588M4802m0510J30254l07666q1849J8968m7235j04496
$$ -298017 -137161 -59885 177703 222505 181995 312249 4583 -77266 -58298 -105533 -210029
6256b10029j0543J3015J02347K13042J1191j82575J481L60143J09089Q6708K740
$$ -210029 -220572 -207557 -105210 107832 119023 -63552 -62071 298072 407161 493869 496609
6245D96609j08675k70690j82703K52906J25789q9950N5512J53035J9623j63774
$$ 496609 387934 117244 -65459 187447 313236 223286 278798 431833 451456 287682
6235B87682m354K53698m3909l41586j97117K546j85716m25936J99968K52308J45374
$$ 287682 283328 537026 493117 151531 -45586 -43040 -228756 -654692 -454724 -202416 -57042
6224e7042O3843j04143K23751J22900j42917J02081k10439k36312p0919J52290
$$ -57042 6801 -97342 126409 249309 106392 208473 -1966 -238278 -309197 -156907
6214a56907m5771n1792l6594J43908j07222J22705J44004m4022J0423o8570n2191
$$ -156907 -202678 -254470 -291064 -147156 -254378 -131673 12331 -31691 -21268 -89838 -142029
6203a42029j05398q2389J50281J54028J0254j62806p3324j63769J16743K09606
$$ -142029 -247427 -329816 -179535 -25507 -15253 -178059 -251383 -415152 -298409 -88803
6193h8803M0430j85124J54304j78207j05690Q1321j04896M062K99417J82243J24155
$$ -88803 -48373 -233497 -79193 -257400 -363090 -281769 -386665 -382603 -83186 99057 223212
6182B23212j54120K4159j27102m204L5874P9926l5340J2448p2882n8198N612j365
$$ 223212 69092 93251 -33851 -38055 -2181 77745 42405 54853 -18029 -76227 -70615 -71980
6170g1980J75255J67188J3503k12828j21042j236L68970J97302K38613p1569j23739
$$ -71980 103275 270463 283966 71138 -49904 -51140 317830 515132 753745 682176 558437
6159E58437k19358L8653M6527j82100n8802n8343j54164m1657m1956J19561n2859
$$ 558437 339079 377732 424259 242159 183357 125014 -29150 -70807 -112763 6798 -46061
6148d6061j52014j21555q9362J23835j0687r562J69826L1276j37701k7236J58427
$$ -46061 -198075 -319630 -408992 -285157 -295844 -305406 -135580 -104304 -242005 -269241 -110814
6137a10814K11194m6070J09733R6563N0968k10495j80138j34982J06881l7304
$$ -110814 100380 54310 164043 260606 311574 101079 -79059 -214041 -107160 -144464
6127a44464k30145J14085J78161L31442j0619k80178k09759j28569j832N4636
$$ -144464 -374609 -260524 -82363 249079 238460 -41718 -251477 -380046 -381878 -327242
6117c27242J03968O8487N165K9485P6095J22844M6035k40419o2989R9260K425
$$ -327242 -223274 -154787 -149622 -120137 -44042 78802 124837 -115582 -178571 -79311 -76886
6106g6886K7870P9232K88673k16368q8131l07906n4899O1781J16365L58432J00338
$$ -76886 -49016 30216 318889 102521 14390 -293516 -348415 -286634 -170269 188163 288501
6095B88501j08436j30213m1031l5238M851k9691J4011j0287l491R5332m8966q359
$$ 288501 180065 49852 8821 -26417 -21566 -51257 -37246 -47533 -51024 44308 -4658 -13017
6083a3017J343o1524K0851J40261N0354l4608R6502k4172k9163j45006k39065
$$ -13017 -11674 -73198 -52347 87914 138268 103660 200162 175990 146827 1821 -237244
6072b37244M6361r4985J1354L83983L5511j98620j2872k5536j32675K93063j81270
$$ -237244 -190883 -285868 -274514 109469 144980 -53640 -66512 -92048 -224723 68340 -112930
6061a12930K9791K8069j1862j12817J38791L7242r728j26838j43560r4169J73811
$$ -112930 -83139 -55070 -66932 -179749 -40958 -3716 -13444 -140282 -283842 -378011 -204200
6050b04200J46580m3627q1637J52309q7130o5818n1656P3688J78177k5686j55463
$$ -204200 -57620 -101247 -182884 -30575 -117705 -183523 -235179 -161491 16686 -9000 -164463
6039a64463O1891M4608l67918K32743K25650q210J73361o7161j51129K14623K6601
$$ -164463 -102572 -57964 -425882 -193139 32511 24301 197662 130501 -20628 193995 220596
6028B20596l84346k38145K8774j17589M0695J10066Q8044J58670J2973J07203
$$ 220596 -163750 -401895 -373121 -490710 -450015 -339949 -251905 -93235 -80262 26941
6018B6941M4780k31619k21979J43681p1268Q8608m1879o7075L0345J83500R6580
$$ 26941 71721 -159898 -381877 -238196 -309464 -220856 -262735 -329810 -299465 -115965 -19385
6007a9385J1074K01779p7554o1490l87405j81491o3113R9599K04788L53580O6388
$$ -19385 -8311 193468 115914 54424 -332981 -514472 -577585 -477986 -273198 80382 146770
5996A46770N7735Q5322j02210J6890j69263k08365M1619j99331k18899J74556
$$ 146770 204505 289827 187617 204507 35244 -173121 -131502 -330833 -549732 -375176
5986c75176K40921R8650j50528j20804L805j64513r7684K48994K66832K72594
$$ -375176 -134255 -35605 -186133 -306937 -303132 -467645 -565329 -316335 -49503 223091
5976B23091O8543j59232j34079m8005j16930r8784n3493J17204Q2707L8732J99376
$$ 223091 291634 132402 -1677 -49682 -166612 -265396 -318889 -201685 -118978 -80246 119130
5965A19130K23150k45761k51167j78218k37170L7173J53998K06339J75176l2093
$$ 119130 342280 96519 -154648 -332866 -570036 -532863 -378865 -172526 2650 -29443
5955b9443K4294j30453m237K45616M9333R2463j16420K1193j35147k5960J67007
$$ -29443 -5149 -135602 -139839 105777 155110 247573 131153 152346 17199 -8761 158246
5944A58246j34106q1533n9657K11297k5429k54624o912N06081J80040k53724n5392
$$ 158246 24140 -57393 -117050 94247 68818 -185806 -192718 313363 493403 239679 184287
5933A84287J88836p5935l65163j62439O3502J48026L6455j15324J75671J41144
$$ 184287 373123 297188 -67975 -230414 -166912 -18886 17569 -97755 77916 219060
5923B19060J0679P0406O7891P1838k2025j05777j05035k26430o6182j53092P8661
$$ 219060 229739 300145 368036 439874 417849 312072 207037 -19393 -85575 -238667 -160006
5912a60006J17098o0740K80391r9530l15393J53227L10597R9016o2734q5894k68958
$$ -160006 -42908 -103648 176743 77213 -238180 -84953 225644 324660 261926 176032 -92926
5901i2926K3233J90136r5470J297J08706l1822j94916P8743o0100K3342J21961
$$ -92926 -69693 120443 24973 26270 134976 103154 -91762 -13019 -73119 -49777 72184
5890G2184j26580k1049P7633L8647j19350l74288J20203M14923J17602q1582j87989
$$ 72184 -54396 -75445 2188 40835 -78515 -452803 -332600 82323 199925 118343 -69646
5879f9646o4802j35161j12451K06286P5832j34428p7465l6956K352N1783j57115
$$ -69646 -134448 -269609 -382060 -175774 -99942 -234370 -311835 -348791 -346439 -294656 -451771
5868d51771j43767J35109L4186N2740o356Q7876K39682J42444p7904j44809J04668
$$ -451771 -595538 -460429 -426243 -373503 -379859 -291983 -52301 90143 12239 -132570 -27902
5857b7902J37283n5013J83417j07023J58696L5509K63397J58125l49792j82742
$$ -27902 109381 54368 237785 130762 289458 324967 588364 746489 396697 213955
5847B13955J13228q487k14916j59076l9702L3822j23699m2467r2081R4608J09767
$$ 213955 327183 318696 103780 -55296 -94998 -61176 -184875 -227342 -319423 -224815 -115048
5836a15048K11074l3596q3248P9755K03872k73214j3277K1023j57754j36938K01206
$$ -115048 96026 62430 -20818 58937 262809 -10405 -23682 -2659 -160413 -297351 -96145
5825i6145J91348j26154j7589q1211M0500k8855O0794m7023Q8182R9717P399m2231
$$ -96145 95203 -30951 -48540 -129751 -89251 -118106 -57312 -104335 -16153 83564 90963 48732
5813D8732J71371O0492j52491l92983j01886K07723J54740Q6274m3148J45152
$$ 48732 220103 280595 128104 -264879 -366765 -159042 -4302 81972 38824 183976
5803A83976j98144k29321L9533J41979o1726j61975M5005l6033L9853J32962J39658
$$ 183976 -14168 -243489 -203956 -61977 -123703 -285678 -240673 -276706 -236853 -103891 35767
5792C5767K91021O3797l03122k07598Q6640Q1913O4294j3256j12165J4310l65474
$$ 35767 326788 390585 87463 -120135 -33495 48418 112712 99456 -12709 1601 -363873
5781c63873J873K33895j84784j93520J27404J01627L40125K19826j40517k03058
$$ -363873 -362000 -128105 -312889 -506409 -379005 -277378 62747 282573 142056 -61002
5771f1002L7483N5134P2029R656m34360j73578p900J79804K67776J39059K5198
$$ -61002 -23519 31615 103644 113300 -321060 -494638 -502538 -322734 -54958 84101 109299
5760A09299k19991q4071K97128K56494p2979r1088j42513m127n8207k33522k27568
$$ 109299 -110692 -194763 102365 358859 285880 194792 52279 48152 -10055 -243577 -471145
5749d71145r451Q5246J77224K88709j26189k9324J68330l4454j59834M8198J93
$$ -471145 -480596 -395350 -218126 70583 -55606 -84930 83400 48946 -110888 -62690 -62497
5738f2497j08101n0481K2874J00708P1807p9264j47311j42568O4857M0580L0724
$$ -62497 -170598 -221079 -198205 -97497 -25690 -104954 -252265 -394833 -329976 -289396 -258672
5727b58672R0242Q3126J70011p1711k30509J15123K1473N1572P1855j69142O5616
$$ -258672 -168430 -85304 84707 12996 -217513 -102390 -80917 -29345 42510 -126632 -61016
5716f1016L7021m2136J61348J13853j36999k14079Q04J01682l752j59051R1337
$$ -61016 -23995 -66131 95217 209070 72071 -142008 -141204 -39522 -43274 -202325 -110988
5705a10988J50511O6228r0498J0773Q3601j27988J58275J96603k05271k66873
$$ -110988 39523 105751 15253 26026 109627 -18361 139914 336517 131246 -135627
5695a35627j2800n1597k0508K01052R7434J34739k21730j87379M4263O6529N8392
$$ -135627 -148427 -200024 -220532 -19480 77954 212693 -9037 -196416 -152153 -85624 -27232
5684b7232j03572n0221O6118j13781J97790J21206p2214K6222J08221J34593j7186
$$ -27232 -130804 -181025 -114907 -228688 -30898 90308 18094 44316 152537 287130 269944
5673B69944j4763N0535j56578P8776n5578k81396L0649J30179M524j62175j40857
$$ 269944 255181 305716 149138 227914 172336 -109060 -78411 51768 56292 -105883 -246740
5662b46740q7073K11240R0614m7683O3140L3927j36514q6652L8576n2296J03183
$$ -246740 -333813 -122573 -31959 -79642 -16502 17425 -119089 -205741 -167165 -219461 -116278
5651a16278l39538j2546N01218Q794J73060l3830o0885j0950l7784j21076k18649
$$ -116278 -455816 -468362 32856 41650 214710 180880 119995 109045 71261 -49815 -268464
5640b68464p4611J6834j6653m2396l1070O039K99124Q3853K4304n5072r4428P9475
$$ -268464 -343075 -326241 -342894 -385290 -416360 -410321 -111197 -27344 -3040 -58112 -152540 -73065
5628g3065k21350j92198L01825K11692j88569j62801n6580J82131J42495n7909
$$ -73065 -294415 -486613 -184788 26904 -161665 -324466 -381046 -198915 -56420 -114329
5618a14329l0868q0902K84898j72313j54336m9982N2585r9582j11550K00885J59846
$$ -114329 -145197 -226099 58799 -113514 -267850 -317832 -265247 -364829 -476379 -275494 -115648
5607a15648j33872P114J84507K79028r0174k89381k56579J9974M60217K76648
$$ -115648 -249520 -242406 -57899 221129 130955 -158426 -415005 -395031 65186 341834
5597C41834L7892j89844k81846k30685m2634j04026J96619N7527q7420n1994j10102
$$ 341834 379726 189882 -91964 -322649 -365283 -469309 -272690 -215163 -302583 -354577 -464679
5586d64679K72422L03220O3215K02700q5500l74302j08781K31431K5681r4494
$$ -464679 -192257 110963 174178 376878 291378 -82924 -191705 39726 65407 -29087
5576b9087p9907j88068o6980J2475l8599k309K33539K1980N4623J04459O8364
$$ -29087 -108994 -297062 -364042 -351567 -390166 -392475 -158936 -136956 -82333 22126 90490
5565I0490j43394k9845J55351K08666J35055k13953k01819q1928j74757K3763
$$ 90490 -52904 -82749 72602 281268 416323 202370 551 -81377 -256134 -232371
5555b32371J67637L3280m6686J13371P8710o5262R5472l4039k91311j20966K91544
$$ -232371 -64734 -31454 -78140 35231 113941 48679 144151 110112 -181199 -302165 -10621
5544a0621L2283j94888J09301K11387o1483l4638n408k9847j20095J7648O0786
$$ -10621 21662 -173226 -63925 147462 85979 51341 45933 16086 -104009 -86361 -25575
5533b5575j85338j10824j24541J76748J08209J24801K26714m5530k23710j43258
$$ -25575 -210913 -321737 -446278 -269530 -161321 -36520 190194 144664 -79046 -222304
5523b22304n2745J8698J23706J15592o6608l13204M8704K91833l2736R6804J80897
$$ -222304 -275049 -256351 -132645 -17053 -83661 -396865 -348161 -56328 -89064 7740 188637
5512A88637J3182m7642j92227q0132k2276J45211l3915r002Q5378k94487o8710
$$ 188637 201819 154177 -38050 -118182 -140458 4753 -29162 -38164 47214 -247273 -315983
5501c15983J78220N2225P1608j07593k34111n3621m2324J26275J4143J2978M7865
$$ -315983 -137763 -85538 -13930 -121523 -355634 -409255 -451579 -325304 -311161 -298183 -250318
5490b50318K08061L97854l50623m10303n0923J11643m4295J00157J39217K76388
$$ -250318 -42257 355597 4974 -405329 -456252 -344609 -388904 -288747 -149530 126858
5480A26858N971K4099j06966j49866J17068K53278J24113n189k40278J849J3334
$$ 126858 132829 156928 49962 -99904 17164 270442 394555 389366 149088 150937 164271
5469A64271M6130o3180j85860o5368J10658Q4560N2137k24763j8529P0395M0708
$$ 164271 210401 147221 -38639 -104007 6651 91211 143348 -81415 -99944 -29549 11159
5458A1159J68904J35823k29957k40201R7512L4144J04816J55906j3736j99755
$$ 11159 180063 315886 85929 -154272 -56760 -22616 82200 238106 224370 24615
5448B4615J187K6895r214L5404J38715Q1075J099J19382n3377j02926J13110k76031
$$ 24615 25802 52697 43483 78887 217602 298677 299776 419158 365781 262855 375965 99934
5436I9934m9529l3996m7643R3234N8790o0460J10114n1421k70396O7934O3546
$$ 99934 50405 16409 -31234 62000 120790 60330 170444 119023 -151373 -83439 -19893
5425a9893L7818k9150J19029M3798J096R8248L11196j92624l29816k58634j04126
$$ -19893 17925 -11225 107804 151602 152698 250946 562142 369518 39702 -218932 -323058
5414c23058j47640J98786J91921j20714N0936j10150K06222K36355j52530k44006
$$ -323058 -470698 -271912 -79991 -200705 -149769 -259919 -53697 182658 30128 -213878
$$ [...]
##END NTUPLES=NMR SPECTRUM
##END=
