##TITLE=Analysis number 319383
Compound Code btb 10430
Book Reference 475/52/5
Project Code adrs
Chemist Name janep
##JCAMPDX= 6.0         $$ Bruker NMR JCAMP-DX V2.0
##DATA TYPE= NMR SPECTRUM
##DATA CLASS= NTUPLES
##ORIGIN= Bruker BioSpin GmbH
##OWNER= nmr
$$ XWIN-NMR		Version 3.5
$$ Fri May 12 08:46:17 2006 GMT Daylight Time (UT+1h)  MAYBRIDGE\nmr@NMR_250MHZ
##.OBSERVE FREQUENCY= 250.131544655141
##.OBSERVE NUCLEUS= ^1H
##.ACQUISITION MODE= SIMULTANEOUS (DQD)
##.ACQUISITION SCHEME= undefined
##.AVERAGES= 16
##.DIGITISER RES= 18
##SPECTROMETER/DATA SYSTEM= dpx250
##.PULSE SEQUENCE= zg30
##.SOLVENT NAME= DMSO
##.SHIFT REFERENCE= (INTERNAL, DMSO, 0, 16.522)
##AUDIT TRAIL= $$ (NUMBER, WHEN, WHO, WHERE, WHAT)
$$ ##TITLE= Audit trail, XWIN-NMR		Version 3.5
$$ ##JCAMPDX= 5.01
$$ ##ORIGIN= Bruker BioSpin GmbH
$$ ##OWNER= nmr
$$ C:\u/data/dgb/nmr/ADRS/4200/pdata/1/auditp.txt
$$ ##AUDIT TRAIL=  $$ (NUMBER, WHEN, WHO, WHERE, WHAT)
(   1,<2006-05-12 08:45:37.29 +100>,<MAYBRIDGE\nmr>,<NMR_250MHZ>,
      <created by zg, POWCHK disabled, PULCHK disabled
       configuration hash MD5:
       84 BC 41 DB A1 6E 1D 46 DA 25 12 A5 C1 ED C5 3A
       data hash MD5: 64K
       4D D2 7E ED F5 48 67 7B 24 05 AA 08 07 CA 10 AF>)
(   2,<2006-05-12 08:45:57.36 +100>,<MAYBRIDGE\nmr>,<NMR_250MHZ>,
      <Start of raw data processing
       ef LB = 0.3 FT_mod = 6 PKNL = 1 SI = 32K 
       data hash MD5: 32K
       A9 87 46 4B 17 EA 79 38 5F D4 70 30 7F 36 00 61>)
(   3,<2006-05-12 08:46:01.86 +100>,<MAYBRIDGE\nmr>,<NMR_250MHZ>,
      <apk 
       data hash MD5: 32K
       16 E7 90 B0 E1 9B 2B 07 AF DD EC E2 0A CB 6A FB>)
(   4,<2006-05-12 08:46:03.52 +100>,<MAYBRIDGE\nmr>,<NMR_250MHZ>,
      <abs ABSG = 5 
       data hash MD5: 32K
       A2 48 D5 06 B2 97 8C 29 8B 0A 61 87 C9 79 01 45>)
$$ ##END=
$$ 
$$ hash MD5
$$ 76 B1 EB BC EA 25 25 40 6C 3C 41 DB 45 C6 1A 1F
##$RELAX= 
##$RELAX= 
##$RELAX= 
##$RELAX= 
##$RELAX= 
##$RELAX= 
##$RELAX= 
$$ Bruker specific parameters
$$ --------------------------
##$DU= <C:\u>
##$EXPNO= 4200
##$NAME= <ADRS>
##$PROCNO= 1
##$TYPE= <nmr>
##$USER= <dgb>
##$AMP= (0..31)
100 100 100 100 100 100 100 100 100 100 100 100 100 100 100 100 100 100 
100 100 100 100 100 100 100 100 100 100 100 100 100 100 
##$AQSEQ= 0
##$AQ_mod= 3
##$AUNM= <au_zg>
##$AUTOPOS= <4 >
##$BF1= 250.13
##$BF2= 250.13
##$BF3= 250.13
##$BF4= 250.13
##$BF5= 500.13
##$BF6= 500.13
##$BF7= 500.13
##$BF8= 500.13
##$BYTORDA= 1
##$CFDGTYP= 0
##$CFRGTYP= 5
##$CHEMSTR= <none>
##$CNST= (0..31)
1 1 145 1 1 1 1 1 1 1 1 1 1 1 1 1 1 1 1 1 1 1 1 1 1 1 1 1 1 1 1 1 
##$CPDPRG= <>
##$CPDPRG1= <>
##$CPDPRG2= <>
##$CPDPRG3= <>
##$CPDPRG4= <mlev>
##$CPDPRG5= <mlev>
##$CPDPRG6= <mlev>
##$CPDPRG7= <mlev>
##$CPDPRG8= <mlev>
##$CPDPRGB= <>
##$CPDPRGT= <>
##$D= (0..31)
0 1 0 0 0 0 0 0 0 0.06 0 0 0 0 0 0 0.0002 0 0 0 0 0 0 0 0 0 0 0 0 0 0 
0 
##$DATE= 1147419935
##$DBL= (0..7)
120 120 120 120 120 120 120 120 
##$DBP= (0..7)
150 150 150 150 150 150 150 150 
##$DBP07= 0
##$DBPNAM0= <>
##$DBPNAM1= <>
$$ [...]
##$SUBNAM7= <"">
##$SUBNAM8= <"">
##$SUBNAM9= <"">
##$SW= 20.6930455092707
##$SWIBOX= (0..15)
0 0 3 0 0 0 0 0 0 0 0 0 0 0 0 0 
##$SW_h= 5175.983436853
##$TD= 65536
##$TD0= 1
##$TE= 296.16
##$TE2= 300
##$TE3= 300
##$TEG= 300
##$TL= (0..7)
0 120 120 120 120 120 120 120 
##$TP= (0..7)
150 150 150 150 150 150 150 150 
##$TP07= 0
##$TPNAME0= <>
##$TPNAME1= <>
##$TPNAME2= <>
##$TPNAME3= <>
##$TPNAME4= <>
##$TPNAME5= <>
##$TPNAME6= <>
##$TPNAME7= <>
##$TPOAL= (0..7)
0.5 0.5 0.5 0.5 0.5 0.5 0.5 0.5 
##$TPOFFS= (0..7)
0 0 0 0 0 0 0 0 
##$TUNHIN= 0
##$TUNHOUT= 0
##$TUNXOUT= 0
##$USERA1= <user>
##$USERA2= <user>
##$USERA3= <user>
##$USERA4= <user>
##$USERA5= <user>
##$V9= 5
##$VALIST= <valist>
##$VCLIST= <CCCCCCCCCCCCCCC>
##$VD= 0
##$VDLIST= <DDDDDDDDDDDDDDD>
##$VPLIST= <PPPPPPPPPPPPPPP>
##$VTLIST= <TTTTTTTTTTTTTTT>
##$WBST= 1024
##$WBSW= 4
##$XGAIN= (0..3)
0 0 0 0 
##$XL= 0
##$YL= 0
##$YMAX_a= 390279
##$YMIN_a= -459304
##$ZGOPTNS= <>
##$ZL1= 120
##$ZL2= 120
##$ZL3= 120
##$ZL4= 120
##$ABSF1= 16.522
##$ABSF2= -4.171173
##$ABSG= 5
##$ABSL= 3
##$ALPHA= 0
##$AQORDER= 0
##$ASSFAC= 0
##$ASSFACI= 0
##$ASSFACX= 0
##$ASSWID= 0
##$AUNMP= <proc_1d>
##$AZFE= 0.1
##$AZFW= 0.1
##$BCFW= 0
##$BC_mod= 0
##$BYTORDP= 0
##$COROFFS= 0
##$CY= 12.5
##$DATMOD= 1
##$DC= 0
##$DFILT= <>
##$DTYPP= 0
##$F1P= 14.0000005364418
##$F2P= -0.99999901652339
##$FCOR= 0.5
##$FTSIZE= 32768
##$FT_mod= 6
##$GAMMA= 0
##$GB= 0
##$INTBC= 1
##$INTSCL= 1
##$ISEN= 128
##$LB= 0.3
##$LEV0= 0
##$LPBIN= 0
##$MAXI= 10000
##$MC2= 0
##$MEAN= 0
##$ME_mod= 0
##$MI= 0
##$NCOEF= 0
##$NC_proc= -4
##$NLEV= 6
##$NOISF1= 0
##$NOISF2= 0
##$NSP= 0
##$NTH_PI= 0
##$NZP= 0
##$OFFSET= 16.522
##$PC= 1
##$PHC0= 161.8783
##$PHC1= 7.304518
##$PH_mod= 1
##$PKNL= yes
##$PPARMOD= 0
##$PSCAL= 4
##$PSIGN= 0
##$REVERSE= no
##$SF= 250.13
##$SI= 32768
##$SIGF1= 0
##$SIGF2= 0
##$SINO= 400
##$SIOLD= 32768
##$SREGLST= <1H.DMSO>
##$SSB= 0
##$STSI= 32768
##$STSR= 0
##$SW_p= 5175.98343685301
##$SYMM= 0
##$S_DEV= 0
##$TDeff= 65536
##$TDoff= 0
##$TI= <Analysis number 999999
Compound Code 99
Book Reference 9
Project Code 9>
##$TILT= no
##$TM1= 0
##$TM2= 0
##$TOPLEV= 0
##$USERP1= <user>
##$USERP2= <user>
##$USERP3= <user>
##$USERP4= <user>
##$USERP5= <user>
##$WDW= 1
##$XDIM= 32768
##$YMAX_p= 305944755
##$YMIN_p= -476774
$$ End of Bruker specific parameters
$$ ---------------------------------
##NTUPLES= NMR SPECTRUM
##VAR_NAME=  FREQUENCY,     SPECTRUM/REAL,   SPECTRUM/IMAG
##SYMBOL=    X,             R,               I
##VAR_TYPE=  INDEPENDENT,   DEPENDENT,       DEPENDENT
##VAR_FORM=  AFFN,          ASDF,            ASDF
##VAR_DIM=   32768,         32768,           32768
##UNITS=     HZ,            ARBITRARY UNITS, ARBITRARY UNITS
##FACTOR=    0.157963299565203, 1,           1
##FIRST=     4132.6476996994, 0,             0
##LAST=      -1043.33573715361, 0,           0
##MIN=       -1043.33573715361, -476774,     0
##MAX=       4132.6476996994, 305944755,     0
$$ Real data points
##PAGE= N=1
##DATA TABLE= (X++(R..R)), XYDATA
$$ [...]
27633b99875P2883J76565r9623j20229o4390J20827O6990J5563o117P3455l2580
$$ -299875 -226992 -50427 -150050 -270279 -334669 -213842 -146852 -131289 -137406 -63951 -96531
27622i6531O0977Q3779l3190J8638j06424j27042K425M770J29618k4978L3470
$$ -96531 -35554 48225 15035 33673 -72751 -199793 -197368 -192598 -62980 -87958 -54488
27611e4488K6851j2806M9900L1685j2925q94M2794k3831o272j2840J1847L7126
$$ -54488 -27637 -40443 9457 41142 28217 27323 70117 46286 40014 27174 39021 76147
27599G6147p5560q7732M8771n5228J48184R3014K7088n5423K348j9654n7254j03541
$$ 76147 587 -87145 -38374 -93602 54582 147596 174684 119261 121609 101955 44701 -58840
27587e8840p1215N1169p3312M7621J01537J18669O9116n2253j35776L3122l6155
$$ -58840 -130055 -78886 -152198 -104577 -3040 115629 184745 132492 -3284 29838 -6317
27576f317R2655J15105k278j30592q3327j13617p6995J36438M1644k0740J4058
$$ -6317 86338 201443 199165 68573 -14754 -128371 -205366 -68928 -27284 -48024 -33966
27565c3966p4004j2692J0775o527J09296q7167j57230k1862J42587j302j3814
$$ -33966 -107970 -120662 -109887 -116414 -7118 -94285 -251515 -273377 -130790 -132092 -145906
27554a45906J22362N8109J4689n2828M551K1229p6644M309k2478m1077N0544Q5526
$$ -145906 -23544 34565 49254 -3574 977 22206 -54438 -50129 -72607 -113684 -63140 22386
27542B2386p2104n61M8946J9142Q3863J4920n7245k45740j28896q3435O6361R6129
$$ 22386 -49718 -50279 -1333 17809 101672 116592 59347 -186393 -315289 -398724 -332363 -236234
27530b36234M0825M7737L4561j5331R3835m7014n4592J04712J4055k5268n7736
$$ -236234 -195409 -147672 -113111 -128442 -34607 -81621 -136213 -31501 -17446 -42714 -100450
27519a00450o0837o6016O6636L5580j1342j4691J12684J22631j03907m8916j7376
$$ -100450 -161287 -227303 -160667 -125087 -136429 -151120 -38436 84195 -19712 -68628 -86004
27508h6004J02421M8274p7136j7613k4368N2850j9365K6042q9074K4627Q3398
$$ -86004 16417 64691 -12445 -30058 -54426 -1576 -20941 5101 -83973 -59346 24052
27497B4052N2682N0265j06506R2336M2915M5846m4044j94368k6756N9554l1023
$$ 24052 76734 126999 20493 112829 155744 201590 157546 -36822 -63578 -4024 -35047
27486c5047k1189J47385J71934L6184j44180l4636Q3021m3442j18261o3963l2323
$$ -35047 -56236 91149 263083 299267 155087 120451 203472 160030 41769 -22194 -54517
27475e4517M6738k9454j2737p1005Q6026p8536n5221J66150O627q5344o8718R5547
$$ -54517 -7779 -37233 -49970 -120975 -34949 -113485 -168706 -2556 4071 -81273 -149991 -54444
27463e4444M9015l5691p056K8526j0680Q0546K5730q4458L9578L7418L6383l838
$$ -54444 -5429 -41120 -48176 -19650 -30330 50216 75946 -8512 31066 68484 104867 101029
27451A01029Q0014Q7632L900m3149j11171L9137K178l6851l8832l6103p1521p8725
$$ 101029 181043 268675 272575 229426 118255 157392 159570 122719 83887 47784 -23737 -102462
27439a02462M0584P7318k7679o8917R9207K01539l5860j28292Q5435n0137m5947
$$ -102462 -61878 15440 -12239 -81156 18051 219590 183730 55438 140873 90736 44789
27428D4789O2563L0827j2159q7046j3876m9161P3880L9463j01703N073J65902
$$ 44789 107352 138179 126020 38974 25098 -24063 49817 89280 -12423 -7350 158552
27417A58552j32641l9002J40989L932J6846O9418J5037J3641o4386r8011m5011
$$ 158552 25911 -13091 127898 131830 148676 218094 233131 246772 182386 84375 39364
27406C9364J0235K2152r9141o0860O7786K9725O6430n2391p3286K4591M192n8734
$$ 39364 49599 71751 -27390 -88250 -20464 9261 75691 23300 -49986 -25395 -21203 -79937
27394g9937K223M7818O0952k6401l2166J7900l8328j4053O7546m4407K4429J59618
$$ -79937 -77714 -29896 31056 4655 -27511 -9611 -47939 -61992 5554 -38853 -14424 145194
27382A45194r2407o3535k7733l3898J3808l612N0277M2543j6902j9107j0355M2431
$$ 145194 52787 -10748 -38481 -72379 -58571 -62183 -11906 30637 13735 -5372 -15727 26704
27370B6704n8056R2183P6741p3141n6480k1628L0006N752P7378O1875m8110j5485
$$ 26704 -31352 60831 137572 64431 7951 -13677 16329 22081 99459 161334 113224 97739
27358I7739r7837j5554P6502j9080J5326l2749j32162Q620L6404k9413o2274J38695
$$ 97739 -98 -15652 60850 41770 57096 24347 -107815 -99195 -62791 -92204 -154478 -15783
27346a5783L5847j19981p6382j02470k0747J41870P3683k2222J27061K1371k7203
$$ -15783 20064 -99917 -176299 -278769 -299516 -157646 -83963 -106185 20876 42247 15044
27335A5044m7738l7709J52436N8269R643q062o0034L8232m7101m4231O4487m129
$$ 15044 -32694 -70403 82033 140302 149945 141883 81849 120081 72980 28749 93236 89107
27323H9107q5934j13661P4454Q508r6259o9180n2087K32547P5938k9085O7791
$$ 89107 3173 -110488 -36034 -27526 -123785 -192965 -245052 -12505 63433 34348 102139
27312A02139j00020j59911l3844K8360l8046L1518J53789J9692N8854J02674M4745
$$ 102139 2119 -157792 -191636 -163276 -201322 -169804 -16015 3677 62531 165205 209950
27301B09950j81493O3892M7989J7620J6262r4007l6987j26362K2884K25291J7800
$$ 209950 28457 92349 140338 157958 174220 80213 43226 -83136 -60252 165039 182839
27290A82839q2962l2810r8554m6342M7296J522m8248J47095N7986r9896Q9328
$$ 182839 99877 67067 -31487 -77829 -30533 -29011 -77259 69836 127822 27926 117254
27279A17254m5685M1383N1563j3751L6436M481k39414r0381L3715M4644K858O6998
$$ 117254 71569 112952 164515 150764 187200 191681 -47733 -138114 -104399 -59755 -56897 10101
27267A0101l1713M2148k2722L5696K3275n8077n8769j9657j36523j3972l4795
$$ 10101 -21612 20536 -2186 33510 56785 -1292 -60061 -79718 -216241 -230213 -265008
27256b65008O2358P8273j0660j7330K4450o1495j4105J21583j5930p5767Q0219
$$ -265008 -202650 -124377 -135037 -152367 -127917 -189412 -203517 -81934 -97864 -173631 -93412
27245i3412J64110j274n3603o6164l1651M4118m6225j14097M4791L6607j07043
$$ -93412 70698 69424 15821 -50343 -81994 -37876 -84101 -198198 -153407 -116800 -223843
27234b23843m8028M4003J13853K5189Q9077Q2920M7872K0015J5668j62305m1040
$$ -223843 -271871 -227868 -114015 -88826 251 83171 131043 151058 166726 4421 -36619
27223c6619O8679M9438N9888L9629j55472J0884J35717J15759j64541j72492m2953
$$ -36619 32060 81498 141386 181015 25543 36427 172144 287903 123362 -49130 -92083
27212i2083M0488J14295Q7539N154Q5216k3609k9871r3430j26709l1062M5180
$$ -92083 -51595 62700 150239 155393 240609 217000 187129 93699 -33010 -64072 -18892
27201a8892N1659j1098j8918j23591j0657R8418K2248J3736j7798m8859J8666
$$ -18892 32767 21669 2751 -120840 -131497 -33079 -10831 2905 -14893 -63752 -45086
27190d5086K0477O9358r326O305j1538R8820r0560p3118O480n3023o3506j4098
$$ -45086 -24609 44749 35423 41728 30190 129010 38450 -34668 -28188 -81211 -144717 -158815
27178a58815K0034L6164J06439M1916o4097L9953R5414r1038l5371K0048k942
$$ -158815 -138781 -102617 3822 45738 -18359 21594 117008 25970 -9401 10647 7705
27167G705M168N5929O9371Q2150n1519q6333m5098P8591j40615m3520J24509q2513
$$ 7705 11873 67802 137173 219323 167804 81471 36373 114964 -25651 -69171 55338 -27175
27155b7175n0097N3987J88501j00732k1693O5476l2241j31628N2503q308m9671
$$ -27175 -77272 -23285 165216 64484 42791 108267 76026 -55602 -3099 -11407 -61078
27144f1078o5884l9578j9366O9494M6562l1724m3697K3659J13085L9976K9850
$$ -61078 -126962 -166540 -185906 -116412 -69850 -101574 -145271 -121612 -8527 31449 61299
27133F1299N00m1612n7357l175J70243P6150p0676j87537j20272L5461R9436k1274
$$ 61299 61799 20187 -37170 -40345 129898 206048 135372 -52165 -172437 -136976 -37540 -58814
27121e8814j8670M1571J5765R9460L4831n3123l2946k641j16033j21688K0151
$$ -58814 -77484 -35913 -20148 79312 114143 61020 28074 25433 -90600 -212288 -192137
27110a92137L6310N9347l5643q981J76968j7101m2654j24429N773P0937o9483
$$ -192137 -155827 -96480 -132123 -141104 35864 18763 -23891 -148320 -142547 -71610 -141093
27099a41093n551M0101L9516O3002Q076N581p1232r3560J7631L450p0569K2182
$$ -141093 -146644 -106543 -67027 -4025 4051 9632 -61600 -155160 -137529 -134079 -204648 -182466
27087a82466J63220J13382l1945j7507J2296o885j7127p8272j32353k084Q4235
$$ -182466 -19246 94136 62191 44684 56980 50095 32968 -45304 -177657 -179741 -95506
27076i5506Q8704n9193q5312N5617P8380j9712L1998q358j2926O0523m8297p1344
$$ -95506 -6802 -65995 -151307 -95690 -17310 -37022 -5024 -13382 -26308 34215 -14082 -85426
27064h5426m408Q6737J58658Q0310l5106n8715k4163n5955m2954L9066P4495P7447
$$ -85426 -89834 -3097 155561 235871 200765 142050 117887 61932 18978 58044 132539 209986
27052B09986l6337o3111j49553j29766R2289J13687L8297J7186k0599m9642k6103
$$ 209986 173649 110538 -39015 -168781 -76492 37195 75492 92678 72079 22437 -3666
27041c666K0699o527R8952K6280m7100m6405O2416n5070q1303j12569M9610J92254
$$ -3666 17033 10506 109458 135738 88638 42233 104649 49579 -31724 -144293 -94683 97571
27029I7571M7879K1434m7327j25008n8501p320P8091k5671r684k1370l0309o639
$$ 97571 145450 166884 119557 -5451 -63952 -71272 6819 -18852 -28536 -49906 -80215 -86854
27017h6854K1759q3907J305K10664R2951o6647o3346l3739L757k6193N645J43545
$$ -86854 -65095 -149002 -147697 62967 155918 89271 25925 -7814 -4057 -30250 -24605 118940
27005A18940J91212m2048k04123j78775N1144L1363L7062J7100K8449l0029l0323
$$ 118940 310152 268104 63981 -114794 -63650 -32287 4775 21875 50324 20295 -10028
26994a0028L7671P1436J6963J01167P3482r3573o8195r0453k05056m7709m586
$$ -10028 27643 99079 116042 217209 290691 197118 128923 38470 -166586 -214295 -218881
26983b18881J07092J8212l7730P0328Q1638L127n2408L982m9949J04078M1873
$$ -218881 -111789 -93577 -131307 -60979 20659 23786 -28622 -24640 -74589 29489 71362
26972G1362j0794n1600p3517J9353M5871P753K4188M2547j927r1164j06832Q6683
$$ 71362 60568 8968 -64549 -45196 675 8428 32616 75163 73236 -17928 -124760 -38077
26960c8077M4630q633M2418L8316m4211p012J68208J02937P194l106q2605k1966
$$ -38077 6553 -2080 40338 78654 34443 27431 195639 298576 305770 302664 220059 198093
26948A98093j19089j12985L3247M0969J4722m2266l4200j8477N1786J17585N4756
$$ 198093 79004 -33981 -734 40235 54957 12691 -21509 -39986 11800 129385 184141
26937A84141O7445J4687r0254j04151j3103p7883m300M4938P3099o0776m5492
$$ 184141 251586 266273 176019 71868 58765 -19118 -23418 21520 94619 33843 -11649
26926a1649K5589O868O9349j4360j35894o5239R9877K4552l434l8593P6903O4642
$$ -11649 13940 20808 90157 75797 -60097 -125336 -25459 -907 -4341 -42934 33969 98611
26914I8611l0936Q4713L4608k330p9106l4748j13764r173N4105K2151m5619M71
$$ 98611 67675 152388 186996 184666 105560 70812 -42952 -52125 1980 24131 -21488 -21017
26902b1017Q3831J2933K9359p162r9363p8731L266R0094M3511j82056q0241O5598
$$ -21017 62814 75747 105106 97944 -1419 -80150 -76884 13210 56721 -125335 -205576 -139978
26890a39978J25221J21014K6411l3101l2157L5534L251J8882p4932j14663o0755
$$ -139978 -14757 106257 132668 99567 67410 102944 106195 125077 50145 -64518 -125273
26879a25273K9717M6756n157M3058k5245L5254o0582m6622n847o8867L9592O8317
$$ -125273 -95556 -48800 -53957 -10899 -36144 -890 -61472 -108094 -113941 -182808 -143216 -74899
26867g4899J12793m4104M191J01261O6794q6102l4082K0593l7883o6314n2056
$$ -74899 37894 -6210 -2019 99242 166036 79934 45852 66445 28562 -37752 -89808
26856h9808j4702J13735K4412J3933P9311r7474J4908J07495n598k6496o8209
$$ -89808 -104510 9225 33637 47570 126881 29407 44315 151810 146212 119716 51507
26845E1507O8574j11820n7228j9611m4306M4221R4766N2613o5510r0716j045L4968
$$ 51507 120081 8261 -48967 -68578 -112884 -68663 26103 78716 13206 -77510 -78555 -43587
26833d3587m7829Q4004J5541M5356M4798m4431n9411r3439M58J40491P1920o5560
$$ -43587 -91416 -7412 8129 53485 98283 53852 -5559 -98998 -98540 41951 113871 48311
26821D8311p6443k2137m0600o8472Q8349N9421J03021n8089r535J6694J26116
$$ 48311 -28132 -50269 -90869 -159341 -70992 -11571 91450 33361 23826 40520 166636
26810A66636P1393j28626q36n560j14160m1076K02819l2932n8970m1205K3117
$$ 166636 238029 109403 108567 103007 -11153 -52229 150590 117658 58688 17483 40600
26799D0600L3749K3203j01825r1048J0699L5886J1311P1328k0621m8089L8377
$$ 40600 74349 97552 -4273 -95321 -84622 -48736 -37425 33903 13282 -34807 3570
26788C570j6149N3011k9610j07172o313m4545J33448q247n2007K9947J00064m4272
$$ 3570 -12579 40432 10822 -96350 -102663 -147208 -13760 -22007 -74014 -44067 55997 11725
26776A1725K7526p2194k8010q5815O0772n6973K2954q767J0511M8919J1857M7493
$$ 11725 39251 -32943 -60953 -146768 -85996 -142969 -120015 -128782 -118271 -69352 -57495 -10002
26764a0002P6216K2679n8806l8470L1807r0170o331J5416k0653o6560L3104J55647
$$ -10002 66214 88893 30087 -8383 23424 -66746 -73077 -57661 -78314 -144874 -111770 43877
26752D3877l447j42679l0224N183o40j8997P0401P8457O1411j7076p6144K2230
$$ 43877 40430 -102249 -132473 -127290 -127930 -146927 -76526 1931 63342 46266 -29878 -7648
26740g648M4385o6344p183L076K9530R0616J20758J570K3387j11100j48222m3812
$$ -7648 36737 -29607 -36790 -33714 -4184 86432 207190 208760 232147 121047 -27175 -70987
26728g0987N8132k7220P9927Q5097Q838p9509l143k4588o0112n8009J12588J15775
$$ -70987 -12855 -40075 39852 124949 133787 54278 51135 26547 -33565 -91574 21014 136789
26716A36789j72201k06073j5263R6840j2166k6091K3573K209J4041R1695L1639
$$ 136789 -35412 -241485 -256748 -159908 -172074 -198165 -174592 -172383 -158342 -66647 -35008
26705c5008l2620J3161K5879j11549m0541l0552J07746L0424L9412k0248J08659
$$ -35008 -67628 -54467 -28588 -140137 -180678 -211230 -103484 -73060 -33648 -53896 54763
26694E4763k274l5622n7629J24218P5803q9634j48364p5223l4638q618N2086R3326
$$ 54763 52489 16867 -40762 83456 159259 69625 -78739 -153962 -188600 -197218 -145132 -51806
26682e1806J0669r4775k8215L7942J77534L7346o4499j8410o0165O4210J5040
$$ -51806 -41137 -135912 -164127 -126185 51349 88695 24196 5786 -54379 9831 24871
26671B4871q1903O5569L8301p8741K6880m1739k6227l7640N2608Q4271K0357j2148
$$ 24871 -57032 8537 46838 -31903 -5023 -46762 -72989 -110629 -58021 26250 46607 34459
26659C4459j30640o3594K04998P9975j1204j7052l4865l3738m5760q917q5370
$$ 34459 -96181 -159775 45223 125198 113994 96942 62077 28339 -17421 -26338 -111708
26648a11708R449P2171j2832K1430J50049J3823j142m1062j9237m2277j7286m6707
$$ -111708 -102259 -30088 -42920 -21490 128559 142382 141240 100178 80941 38664 21378 -25329
26636b5329k6j38713k0578L9295r3687L6614P24j8408o7082j5547N3150J1382
$$ -25329 -25355 -164068 -184646 -145351 -239038 -202424 -201700 -220108 -287190 -302737 -249587 -238205
26624b38205J08587R4101O79m8689p3442K7413Q7714Q0936J09472N4089o955j55815
$$ -238205 -129618 -35517 -34838 -83527 -156969 -129556 -41842 39094 148566 202655 195700 39885
26612C9885p0838J1731N458O9648J139m0980N1791k3074m8648K9880l173k5440
$$ 39885 -30953 -19222 -13764 55884 57023 16043 67834 44760 -3888 25992 22819 -2621
26600b621o9527L2522O6772R1482O6270p0837j05126o3555j2869J16598o945J03181
$$ -2621 -72148 -39626 27146 118628 184898 114061 8935 -54620 -67489 49109 42164 145345
26588A45345J05343n147o2472p7956j36038j9761k9948O6714M2651l4186J5149
$$ 145345 250688 245541 183069 105113 -30925 -50686 -80634 -13920 28731 -5455 9694
26577I694N5282j7645m8837m7992K5771k5527O242J15677K6557j19985l2503j9756
$$ 9694 64976 47331 -1506 -49498 -23727 -49254 -43012 72665 99222 -20763 -53266 -73022
26565g3022n484J39382J64912J0113j60558p1795J14275k0891p1504P830j1207
$$ -73022 -78506 60876 225788 235901 75343 3548 117823 96932 25428 33258 22051
26554B2051k3480q0179L4411K5767j8120K2326N7571J24833L5089j04407L341
$$ 22051 -1429 -81608 -47197 -21430 -39550 -17224 40347 165180 200269 95862 99203
26543I9203p263p2162J5632N4374K4201p9603m7894l7073l9116M3816m7133N4016
$$ 99203 91940 19778 35410 89784 113985 34382 -13512 -50585 -89701 -45885 -93018 -39002
26531c9002n820r6319M3064K0306K8035J27915l0363m5206m0340Q9322o2253p469
$$ -39002 -44822 -141141 -98077 -77771 -49736 78179 47816 2610 -37730 51592 -10661 -18130
26519a8130L2675L4054K3457n068m9421m4147R500l9708k2401q4125o8749k2536
$$ -18130 14545 48599 72056 66988 17567 -26580 -17080 -56788 -79189 -163314 -232063 -254599
26507b54599P0156M6120O6353o088k3956P8719J1117j1719J7132N468P0364n1360
$$ -254599 -184443 -138323 -71970 -78058 -102014 -23295 -12178 -23897 -6765 -1297 69067 17707
26495A7707m7519J41618m3304J4715l393n2441j02763j06606N1557J41879N6182
$$ 17707 -29812 111806 68502 83217 79824 27383 -75380 -181986 -130429 11450 67632
26484F7632o0188j0494K6808K7634L9854n0295m7978o8599M5568J8289K0385L8046
$$ 67632 7444 -3050 23758 51392 91246 40951 -7027 -75626 -30058 -11769 8616 46662
26472D6662Q0529M200o889j0682r1761j5564k5446n859p3111j09257Q0722k7826
$$ 46662 127191 131391 124502 113820 22059 6495 -18951 -24810 -97921 -207178 -126456 -154282
26460a54282Q6207o7256P724M9825o7584p9921J5262j6935j03J26669N7973J53588
$$ -154282 -68075 -135331 -127607 -77782 -145366 -225287 -210025 -226960 -227063 -100394 -42421 111167
26448A11167J11137J6627P5088j34018j31574r627k596l6739K5748J3720p9592
$$ 111167 222304 238931 314019 180001 48427 38800 36204 -535 25213 38933 -40659
26437d0659n4311R7192K2562m0404k992l7422j2193q3711p897M440P9769o6009
$$ -40659 -94970 2222 24784 -15620 -18612 -56034 -68227 -151938 -159835 -155395 -75626 -141635
26425a41635O5133o4624R5816J33648L4672k5000P0436l4087n7942r085P447L1651
$$ -141635 -76502 -141126 -45310 88338 123010 98010 168446 134359 76417 67332 74779 106430
26413A06430l6817l4571p3278j12071m531O1680j22724Q5889J56163M7361r1871
$$ 106430 69613 35042 -38236 -150307 -154838 -93158 -215882 -129993 26170 73531 -18340
26402a8340M4200O9909k5659Q406j398m1574L088L518N2566j50491j7846J49902
$$ -18340 25860 95769 70110 78516 77118 35544 38632 42150 94716 -55775 -73621 76281
26390G6281O0067m2001J4135k409l1410m5448M9052n7575j08593O2627L6632m7429
$$ 76281 136348 94347 108482 106073 74663 29215 78267 20692 -87901 -25274 11358 -36071
26378c6071K4243o6856q862J39111R9016j20966j34278j32835R7420J64033l7227
$$ -36071 -11828 -78684 -87546 51565 150581 29615 -104663 -237498 -140078 23955 -13272
26367a3272M9003p2395o987J5863j8602K9493k3755j9311J0465j5677J1114O0300
$$ -13272 35731 -36664 -43651 -27788 -46390 -16897 -40652 -59963 -49498 -65175 -54061 6239
26355F239l3582k5646k9920n9279J29950J52059k9107j43378j1771J9973J7620
$$ 6239 -27343 -52989 -82909 -142188 -12238 139821 110714 -32664 -44435 -24462 -6842
26344f842R8254J8792k9914p6318P0754P5537Q5736R3399j09278o5586m4449j9575
$$ -6842 91412 110204 80290 3972 74726 150263 235999 329398 220120 154534 110085 90510
26332I0510m5603M845J53580J838l6759l8745o331k6716J2137O3149J7577O4252
$$ 90510 44907 49752 203332 205170 168411 129666 123335 96619 108756 171905 189482 253734
26320B53734j06143J3429j6204j13215J6799M1476m9831N5387J8487k9163l3986
$$ 253734 147591 161020 144816 31601 48400 89876 40045 95432 113919 84756 50770
26309E0770j22019q842L1543j8274q5283M3721J10843K8429M2423M4626J656k9309
$$ 50770 -71249 -80091 -48548 -66822 -152105 -108384 2459 30888 73311 117937 119593 90284
26297I0284o3199p169k830P8365l2361j17963j16825k5725O5324l8253O4104Q9540
$$ 90284 27085 19916 17086 95451 63090 -54873 -171698 -197423 -132099 -170352 -106248 -16708
26285a6708j878k5004J17861K8685j38425n6571K9101L6932P0564j46871r398
$$ -16708 -18586 -43590 74271 102956 -35469 -92040 -62939 -26007 44557 -102314 -111712
26274a11712K8495N8588N4812r9416P2685N3308k3723l9211J39406N0928j42324
$$ -111712 -83217 -24629 30183 -69233 3452 56760 33037 -6174 133232 184160 41836
26263D1836j46358L8099j4398q3826n4940m609M9357j07543M6706J50559J29141
$$ 41836 -104522 -66423 -80821 -164647 -219587 -224196 -174839 -282382 -235676 -85117 44024
26252D4024M0106j28124k1255O5072p4999r5822L4368j07405o227K6775O9475
$$ 44024 84130 -43994 -65249 -177 -75176 -170998 -136630 -244035 -250262 -223487 -154012
26241a54012J59335J6943m135j166l5957J12730m0986j49818q1432k5074L5447
$$ -154012 5323 22266 18131 16965 -18992 93738 52752 -97066 -178498 -203572 -168125
26230a68125O5095N1112J36748q5233j22900o6311O6917J16513j8141K448R4347
$$ -168125 -103030 -51918 84830 -403 -123303 -189614 -122697 -6184 -24325 -21877 72470
26219G2470j7045o5421o3301J3538N1126R3702N2070q3100J02349p0212p2088
$$ 72470 55425 -9996 -73297 -59759 -8633 85069 137139 54039 156388 86176 14088
26208A4088n7788o4918l7044K7287o5752R9502J10150m5202j31920N36n7090q189
$$ 14088 -43700 -108618 -145662 -118375 -184127 -84625 25525 -19677 -151597 -151061 -208151 -216340
26196b16340J79361R5097o941P0655n9637j5513N7104p0779j1661k6265l9676
$$ -216340 -36979 58118 51177 121832 62195 46682 103786 33007 21346 -4919 -44595
26185d4595l9869n0325r0160m8312p497J36481J37755N6691j54511J29365N0376
$$ -44595 -84464 -134789 -224949 -273261 -280758 -144277 -6522 50169 -104342 25023 75399
26174G5399j2739j53175j1382J02516O9489m2799l3519L348L5589n1239K3873
$$ 75399 62660 -90515 -101897 619 70108 27309 -6210 -2862 32727 -18512 5361
26163E361l7911j5500K9891J23718o1418o0973K8147p9177L107O1137k3253J12552
$$ 5361 -32550 -48050 -18159 105559 44141 -16832 11315 -67862 -64755 -3618 -26871 85681
26151H5681J474m6978l2003k6898N676J3328M8969J37713J3717M6125n7133j03851
$$ 85681 87155 40177 8174 -18724 -13048 280 49249 186962 200679 246804 189671 85820
26139H5820k248K683k168j21801q7271M6484J17897J51216q7218n4229L4928j1355
$$ 85820 83572 86255 84087 -37714 -124985 -78501 39396 190612 103394 49165 84093 72738
26127G2738J1103m9300n3125M9270K1942n5495r1996L2779J48990k819O7992K079
$$ 72738 83841 34541 -18584 30686 52628 -2867 -94863 -62084 86906 84087 152079 154158
26115A54158o0742q0619j34543j3456M3016k060q5120M5162o4859J26713Q4973
$$ 154158 93416 12797 -121746 -135202 -92186 -94246 -179366 -134204 -199063 -72350 12623
26104A2623n3606n8936M3962J41149N0712j5984O6078o1031j15152O1147j7491
$$ 12623 -40983 -99919 -55957 85192 135904 119920 185998 124967 9815 70962 53471
26093E3471P728K2841j03105p5240j15079J05133J44298j3459o237N530l4565
$$ 53471 61199 84040 -19065 -94305 -209384 -104251 40047 26588 20351 25881 -8684
26082h684j23185j17094Q1093J11088P0927k0325O672l1344j27331k4797N269
$$ -8684 -131869 -248963 -167870 -56782 14145 -6180 492 -30852 -158183 -182980 -177711
26071a77711o2028J9858J68334L3521j09077J987K0883l2467N9345M2683k9688
$$ -177711 -239739 -219881 -51547 -18026 -127103 -125116 -104233 -136700 -77355 -34672 -64360
26060f4360k5909M1337M914n6837Q5213j82021k63996N2251Q653J56754K09234
$$ -64360 -90269 -48932 -44018 -100855 -15642 -197663 -461659 -409408 -400755 -244001 -34767
26049c4767N4432J17702J19341j09065r4474N1116j13923l4250j9320n6840j21335
$$ -34767 19665 137367 256708 147643 53169 104285 -9638 -43888 -63208 -120048 -241383
26038b41383K2900J14388J41866Q1083k4290j60988m1730J04967J55021m0491
$$ -241383 -218483 -104095 37771 118854 94564 -66424 -108154 -3187 151834 111343
26028A11343j05180L3312Q0472N0850o0334k4981P8358m9810j9437K3050j06676
$$ 111343 6163 39475 119947 170797 110463 85482 163840 114030 94593 117643 10967
26017A0967j25311m5807Q20M7624J15035O5885J21854j56310j54215R8376K1477
$$ 10967 -114344 -160151 -159331 -111707 3328 69213 191067 34757 -119458 -21082 395
26006C95n9313M439K2563o2298l3959J50991O8571P925j19413p7931o9463k0210
$$ 395 -58918 -54479 -31916 -94214 -128173 22818 91389 99314 -20099 -98030 -167493 -187703
25994a87703O4430O2775J18923j43656m6480Q4370n2735M7799K7189n822M3256
$$ -187703 -123273 -60498 58425 -85231 -131711 -47341 -100076 -52277 -25088 -30910 12346
25983A2346o776R3111J23827n0211r1235p0213l6612Q8009K78L187J4928p6696
$$ 12346 5570 98681 222508 172297 81062 10849 -25763 62246 62524 65711 80639 3943
25971C943k4606K5920q684m1586Q0988J0715r5438n4099N2973k3790K8131K2306
$$ 3943 -20663 5257 -3427 -45013 35975 46690 -48748 -102847 -49874 -73664 -45533 -23227
25959b3227k0995J85469J83458l3312j45794j76875J13864J15174N4931j44219
$$ -23227 -44222 141247 324705 291393 145599 -31276 82588 197762 252693 108474
25949A08474j0687m8223j84917j05243L7168m0134m9860J6786J65298R8868o177
$$ 108474 97787 49564 -135353 -240596 -203428 -243562 -293422 -276636 -111338 -12470 -18647
25938a8647N9668R0810j22543j23378j48332J70501J22069N1575M1625o9047J0952
$$ -18647 41021 131831 9288 -114090 -262422 -91921 30148 81723 123348 54301 65253
25927F5253j08699O1238R061J8248J7126N421m9941m2800l8154N526J11818r354
$$ 65253 -43446 17792 26853 45101 62227 67648 17707 -25093 -63247 -57721 54097 44743
25915D4743j36671j27006P0129J16937m481l825k1240J52927J3060r6782j83132
$$ 44743 -91928 -218934 -148805 -31868 -36349 -40174 -61414 91513 104573 7791 -175341
25904a75341m4681M5334q2118n4283J15134M0467J3391k5744J04280r9602P4524
$$ -175341 -220022 -174688 -256806 -311089 -195955 -155488 -142097 -167841 -63561 -163163 -88639
25893h8639J31822o2010k2821j0903K8630M7003L7390k2708P1473j85320j9486
$$ -88639 43183 -18827 -41648 -52551 -23921 23082 60472 37764 109237 -76083 -95569
25882i5569J76339k5596j37485o0957n9901O232J01976J00971j1474O2485q6353
$$ -95569 80770 55174 -82311 -143268 -203169 -196937 -94961 6010 -5464 57021 -29332
25871b9332j9849M5768L1574j4248p9390J5708M4435N7252L5616r5823j06780
$$ -29332 -49181 -3413 28161 13913 -65477 -49769 -5334 51918 87534 -8289 -115069
25860a15069K3945J12422K04272K239j04119p4408l3695k1538J00245m1912q4173
$$ -115069 -91124 21298 225570 227809 123690 49282 15587 -5951 94294 52382 -31791
25849c1791N7722O2266j3384n699K0369k509q1379j1858K8100j14210j2427J8858
$$ -31791 25931 88197 74813 69114 89483 86974 5595 -6263 21837 -92373 -104800 -85942
25837h5942J38372M8929j26348j27757p2544L844M8254K1244M6366R0251J2495
$$ -85942 52430 101359 -24989 -152746 -225290 -221446 -173192 -151948 -105582 -15331 -2836
25826b836n9362o2892M4980J47772j7222j06210P636r9395j23658J45643J06537
$$ -2836 -62198 -125090 -80110 67662 50440 -55770 -48134 -147529 -271187 -125544 -19007
25815a9007p4232m9725j18023K02808J18295K3197m6797M1240K2935j12734k727
$$ -19007 -93239 -142964 -260987 -58179 60116 83313 36516 77756 100691 -12043 -14770
25804a4770K3856j8046O1588k7615N3416P123p043j9184k7084O6213L481L2082
$$ -14770 9086 -8960 52628 25013 78429 85552 78509 59325 32241 98454 101935 134017
25792A34017p2230p8347J8980q5276j0171J3619l5758R7452j6033l6515J02146
$$ 134017 61787 -16560 2420 -82856 -93027 -79408 -115166 -17714 -33747 -70262 31884
25781C1884M6583P9663M1814q7553j7953L8642P0091q342o0579m8265k2902q5153
$$ 31884 78467 158130 199944 112391 94438 133080 203171 194829 134250 85985 63083 -22070
25769b2070p2872J0445N4069k463m7296j31251N2400J61272p862M9336o764N0609
$$ -22070 -94942 -84497 -30428 -32891 -80187 -211438 -159038 2234 -5628 43708 36944 87553
25757H7553k9282j5594L6241j70931L0115R6142J2981l2989m9916l0728R4360
$$ 87553 58271 42677 78918 -92013 -61898 34244 47225 14236 -35680 -66408 27952
25746B7952J20224l3392p8594p4610J9128K9849k6874m4516J6749l186k494J09001
$$ 27952 148176 114784 36190 -38420 -19292 10557 -16317 -60833 -44084 -47270 -49764 59237
25734E9237J17682r8583M972l7730q4030l4985J5k7744o4012j6028j1472J09488
$$ 59237 176919 78336 83308 45578 -38452 -73437 -73422 -101166 -165178 -181206 -192678 -83190
25722h3190N4435L4508q202n0854M9645N5400J5138M0785O0365k3623n222m7261
$$ -83190 -28755 5753 -2449 -53303 -3658 51742 66880 107665 168030 144407 139185 91924
25710I1924l9135j62297o9866M9104p545O046Q2792k0214j47684J4480R4893O4844
$$ 91924 52789 -109508 -179374 -130270 -137815 -131769 -48977 -69191 -216875 -202395 -107502 -42658
25698d2658j34482O2936K2387R9105M3973N8674l0207m9903J3494j6402J2033
$$ -42658 -177140 -114204 -91817 7288 51261 109935 79728 29825 43319 26917 38950
25687C8950m9404j25195p8452K6251k7513M2107J8068L9208K4355j29445o3237
$$ 38950 -10454 -135649 -214101 -187850 -215363 -173256 -155188 -115980 -91625 -221070 -284307
25676b84307k4503N3567J87994Q1422k7411j05753j4056m9113l185M4437J8365
$$ -284307 -308810 -255243 -67249 14173 -13238 -118991 -133047 -182160 -185345 -140908 -122543
25665a22543J39326K6502m494Q8207j2512k5760K8855o5966o9453J24065k2378
$$ -122543 16783 43285 38791 126998 114486 88726 117581 51615 -17838 106227 83849
25654H3849j27275N4724N0471o8206K4564N3825j26644j67156R2458J62770K4534
$$ 83849 -43426 11298 61769 -6437 18127 71952 -54692 -221848 -129390 33380 57914
25643E7914J105j3779K3678J5253n0141j86281n1012P0294k373N9378Q2688K4323
$$ 57914 59019 45240 68918 84171 34030 -152251 -203263 -132969 -135342 -75964 6724 31047
25631C1047o180o8101J4410j63141q7456L3460l7658M8148Q6269r8705l6505j513
$$ 31047 24867 -43234 -28824 -191965 -279421 -245961 -283619 -235471 -149202 -247907 -284412 -285925
25619b85925L6382O3697k5674O4901L8134J55977L4088r4084l0205m3450P7918
$$ -285925 -249543 -185846 -211520 -146619 -108485 47492 81580 -12504 -42709 -86159 -8241
25608h241J14618O6833p9334o6310p788J5200k3749l563K8140q1425L8195P3114
$$ -8241 106377 173210 93876 27566 19778 34978 11229 7666 35806 -45619 -7424 65690
25596F5690j96646j25321m4937J95098O0397p8554j2922P0775J24643k456j31367
$$ 65690 -130956 -256277 -301214 -106116 -45719 -124273 -137195 -66420 58223 55767 -75600
25585g5600j0617L2564J62598k0317q2692J19079m1246n3433j72321q2871J32379
$$ -75600 -86217 -53653 108945 88628 5936 125015 83769 30336 -141985 -224856 -92477
25574i2477J6427j8692J4710q3351j5433m9475P7980O6688K1368o6271K2760P1309
$$ -92477 -76050 -94742 -80032 -163383 -178816 -228291 -150311 -83623 -62255 -128526 -105766 -34457
25562c4457l2421O2229L1591N6498M0613n7839n5404o1585M5923j8045m4292L6826
$$ -34457 -66878 -4649 26942 83440 124053 66214 10810 -50775 -4852 -22897 -67189 -30363
25550c0363P4841J0128O198o4011j2066N4046L1827J4675j2571q0556R538J22795
$$ -30363 44478 54606 60804 -3207 -15273 38773 70600 85275 72704 -7852 1686 124481
25538A24481n8610m5424j7067Q409O8772J36072k3512j31995q8567j31118q163
$$ 124481 65871 20447 3380 11789 80561 216633 193121 61126 -27441 -158559 -166722
25527a66722k5891j4554K644L2177J15478m078r5435Q6014Q5748j5797O8693l9159
$$ -166722 -192613 -207167 -204523 -172346 -56868 -60946 -156381 -70367 15381 -416 68277 29118
25515B9118j89612o6716M1444J14466r865J23611Q6292m6541k3431o6328l6080
$$ 29118 -160494 -227210 -185766 -71300 -81165 42446 128738 82197 58766 -7562 -43642
25504d3642P4315J11078J1906p7199o4663J6595L4661l0800J4741j15710q2010
$$ -43642 30673 141751 153657 76458 11795 28390 63051 32251 46992 -68718 -150728
25493a50728n2891K6763J01074J09631q0218q9105k242J21434j02739q1171l9091
$$ -150728 -203619 -176856 -75782 33849 -46369 -135474 -137716 -16282 -119021 -200192 -239283
25482b39283J5269J44593J76624k9021o9086M6987Q4701l1009j24638J01811L6859
$$ -239283 -224014 -79421 97203 68182 -904 46083 130784 99775 -24863 76948 113807
25471A13807J8795j27791j79804j80415P852J80622n0805m3300n596M1865O5865
$$ 113807 132602 4811 -174993 -355408 -347556 -166934 -217739 -261039 -266635 -224770 -158905
25460a58905N4788J28375L7669p7765j52916J14126K2347q4576o1842j7018J08908
$$ -158905 -104117 24258 61927 -15838 -168754 -54628 -32281 -116857 -178699 -195717 -86809
25449h6809O6933K3527k9136j1507J206O9643P323n0886n9028M269K1690k8993
$$ -86809 -19876 3651 -25485 -36992 -35786 33857 41180 -9706 -68734 -64465 -42775 -71768
25437g1768k7774P3731P7845O0134j15635l9603P8108M7580P1739j7228m8849
$$ -71768 -99542 -25811 52034 112168 -3467 -43070 35038 82618 154357 137129 88280
25426H8280Q6850n2745j23714l4520k7310j22944N4649O4796p1529O2974L6993
$$ 88280 175130 122385 -1329 -35849 -63159 -186103 -131454 -66658 -138187 -75213 -38220
25415c8220m887j388r2474L1947j7043l3774O6920K1181j7445K8748P4615M0413
$$ -38220 -43107 -44495 -136969 -105022 -122065 -155839 -88919 -67738 -85183 -56435 18180 58593
25403E8593j9975j7697j11183j9791q7994N1093N7261q630l835N9201Q4493m3180
$$ 58593 38618 20921 -90262 -110053 -198047 -146954 -89693 -98323 -102158 -42957 41536 -1644
25391a644M0237r3530R656J47315K1524k9599j68152o3443M24K8106M9369O1426
$$ -1644 38593 -54937 -45281 102034 123558 93959 -74193 -137636 -137212 -109106 -59737 1689
25379A689O1550L4097m3652K4910P1984l0716l4155m8198L5969N1858p7415j94516
$$ 1689 63239 97336 53684 78594 150578 119862 85707 37509 73478 125336 47921 -146595
25367a46595n2600R2161Q9748J05568N7569j06112k031j1490R5668l9333l6309
$$ -146595 -199195 -107034 -17286 88282 145851 39739 37708 26218 121886 82553 46244
25356D6244Q818l6642k7839m2051o7595P6620K56608R9999p3672k400L8667j14431
$$ 46244 55062 18420 -9419 -51470 -119065 -42445 214163 314162 240490 238090 276757 162326
25344A62326r1302j25877p9399p020N6980R9566J6873k6465p8077r4331J07886
$$ 162326 71024 -54853 -134252 -141272 -84292 15274 32147 5682 -72395 -166726 -58840
25333e8840o311Q0811J22250r1180j99471n9320j9334P4316J41917L2251k8356
$$ -58840 -65151 15660 137910 46730 -152741 -212061 -231395 -157079 -15162 17089 -11267
25322a1267m8687q82k1641k9217J07559O7374p941k3298p5314J3554j16733q1368
$$ -11267 -59954 -60836 -82477 -111694 -4135 63239 55298 32000 -43314 -29760 -146493 -227861
25310b27861N6154J66463J8130R5211l4036j04394o9794o3468P3600J41634O284
$$ -227861 -171707 -5244 12886 108097 74061 -30333 -100127 -163595 -89995 51639 57923
25299E7923q8976n057k3179r092Q208M4598l6766O417k3695M0932L5943K0528
$$ 57923 -31053 -36110 -59289 -68381 -60173 -15575 -52341 -45924 -69619 -28687 7256 27784
25287B7784q3606L2159n2848r4594r0218J17061J14876L2788Q554n879n3155p6927
$$ 27784 -55822 -23663 -76511 -171105 -261323 -144262 -29386 3402 11956 6077 -47078 -124005
25275a24005R9386J47219k0979j50482j1022k1802o6182o1229P4718l1459m723
$$ -124005 -24619 122600 101621 -48861 -59883 -81685 -147867 -209096 -134378 -165837 -170560
25264a70560J45259R5074m9926j52912K3694M7056j52520M1873J52063J55618
$$ -170560 -25301 69773 19847 -133065 -109371 -62315 -214835 -172962 -20899 134719
25254A34719o6189j11601j5825K5635j4276j9867j01632l3642J15684J8869J2448
$$ 134719 68530 -43071 -58896 -33261 -47537 -67404 -169036 -202678 -86994 -68125 -55677
25243e5677L7716k769P0715N143j00082j26949O2968J60567j16728j2139J57256
$$ -55677 -17961 -20730 49985 55128 -44954 -171903 -108935 51632 -65096 -77235 80021
25232H0021J13419j80578j55805P4571M7878n5427J2019K9087j2544p0714j261
$$ 80021 193440 12862 -142943 -68372 -20494 -75921 -63902 -34815 -47359 -118073 -119334
25221a19334J8891O8059m5147r2679j58482p5903O2704Q5690Q0720J51453K1422
$$ -119334 -100443 -32384 -77531 -170210 -328692 -404595 -341891 -256201 -175481 -24028 -2606
25210b606p3655j7592j7880L8145N5090R7679m5440j5536m5547m0220Q620P8850
$$ -2606 -76261 -93853 -111733 -73588 -18498 79181 33741 18205 -27342 -67562 -58942 19908
25198A9908M2925M9320L2540o0365O6623L9205k8232o2785J0545j14020j18831
$$ 19908 62833 112153 144693 84328 150951 190156 161924 99139 109684 -4336 -123167
25187a23167J8123R4835J06328L2965o0341j04600Q591p0979j00784k5447L8768
$$ -123167 -105044 -10209 96119 129084 68743 -35857 -27266 -98245 -199029 -224476 -185708
25176a85708R6089K8692n0831j0409J70758N5852l2333r1039O9920M6425M0971
$$ -185708 -89619 -60927 -111758 -122167 48591 104443 72110 -18929 50991 97416 138387
25165A38387J63519o9630j12829o930L9063p8514N8453K0223k23455j53087Rj4400
$$ 138387 301906 232276 119447 112517 151580 73066 131519 151742 -71713 -224800 -224791 -239191
25153b39191Q3496M9222l3946o3030L0620r227O505p671M1079K1297O3782P1251
$$ -239191 -155695 -106473 -140419 -203449 -172829 -182056 -175551 -183222 -142143 -120846 -57064 14187
25141A4187J50019O7291j50397K5728m2128o0383n7094l4575n4854L0172J01577
$$ 14187 164206 231497 81100 106828 64700 4317 -52777 -87352 -142206 -112034 -10457
25130a0457M5133M5971j51336o8459P8580O1288j8637N7060O7298k9646L2771
$$ -10457 34676 80647 -70689 -139148 -60568 720 -17917 39143 106441 76795 109566
25119A09566K1376O0654p8364r4517p3322Q06R131L31n0038k6218J08117J1083
$$ 109566 130942 191596 113232 18715 -54607 -53801 -44670 -44339 -94377 -120595 -12478 -1395
25107a395k8551P3839j2472J0505r5462l0094m2926M8078j6617r797k0207M5163
$$ -1395 -29946 43893 31421 41926 -53536 -83630 -126556 -78478 -95095 -104892 -125099 -79936
25095g9936n8020n6067K0435J06006j253l7998j31363k4654J68001J82947N4401
$$ -79936 -137956 -194023 -173588 -67582 -68835 -106833 -238196 -262850 -94849 88098 142499
25084A42499j48130q8548k9809R0001O0319O793J49147o0999j90630q7992O8438
$$ 142499 -5631 -94179 -123988 -33987 26332 33125 182272 121273 -69357 -157349 -88911
25073h8911Q3414n7599O1153O9987j0748m1836j1923j79521q1846M2045M6341
$$ -88911 -5497 -63096 -1943 68044 57296 15460 3537 -175984 -257830 -215785 -169444
25062a69444J72137Q0852K7686j02747l6937R407m1187r670N1300J15110q8518
$$ -169444 2693 83545 111231 8484 -28453 -19046 -60233 -69903 -18603 96507 7989
25051G989M4233J25523K5241j27516j48856l7424M3214Q7327K3863j21035o7221
$$ 7989 52222 177745 202986 75470 -73386 -110810 -67596 19731 43594 -77441 -144662
25040a44662O2709J01894K008j5435j11994m2404p7467o001R4640N3262k321n1640
$$ -144662 -81953 19941 21949 6514 -105480 -147884 -225351 -231352 -136712 -83450 -85771 -137411
25028a37411K3092K9940l1722l4448l2621J16488q832L7089l142j5073L4618p230
$$ -137411 -114319 -84379 -116101 -150549 -183170 -66682 -75514 -38425 -41567 -56640 -22022 -29252
25016b9252K0953N5121j0650o2774j01499p8959J9342J30257J8291n1065J13408
$$ -29252 -8299 46822 36172 -26602 -128101 -207060 -187718 -57461 -39170 -90235 23173
25005B3173j9969j5667k4203j912P3324Q1983O251q9735r8514j9623k5008O4383
$$ 23173 3204 -12463 -36666 -38578 34746 116729 122980 33245 -65269 -84892 -109900 -45517
24993d5517m6147N7241L9205l6573J6963l629L852K9302J9032l5021R4977M8308
$$ -45517 -91664 -34423 4782 -31791 -14828 -18457 -14605 14697 33729 -1292 93685 141993
24981A41993L4481M9108j33913j863j5300n4509o156J42696O5263m2397j49499
$$ 141993 176474 225582 91669 89806 74506 19997 13841 156537 221800 179403 29904
24970B9904p7451l0571R0333Q930m6911o7765N3650M0952K3390J02860r7785r6427
$$ 29904 -47547 -78118 12215 21145 -25766 -93531 -39881 1071 24461 127321 29536 -66891
24958f6891J23353J00869l9900L3786n863M725m3810q2889L5961k1013m5333j931
$$ -66891 56462 157331 117431 151217 145354 150079 106269 23380 59341 38328 -7005 -8936
24946h936o194P5102m1897k8074L7693N5556Q24p0221M4825k4757j19541k1125
$$ -8936 -15130 59972 18075 -9999 27694 83250 84074 13853 58678 33921 -85620 -106745
24934a06745R9147N9639P092r654J6893m6990M3218q2420j41833j04398R41J18755
$$ -106745 -7598 52041 59133 49479 66372 19382 62600 -19820 -161653 -266051 -265110 -146355
24922a46355O0403m4154j9637J5785J55796L8344O0306N6196l6483k8448q5956
$$ -146355 -85952 -130106 -149743 -133958 21838 60182 120488 176684 140201 111753 25797
24911B5797j86735r7162J21116r074k618k9447k3867L5558J57087J53976L2521
$$ 25797 -160938 -258100 -136984 -146058 -148676 -178123 -201990 -166432 -9345 144631 177152
24900A77152R6904n1588j30403l3974k9948O7863P4894o3383l6215k667r1616
$$ 177152 274056 222468 92065 58091 28143 96006 170900 107517 71302 68635 -22981
24889b2981J1523M6576K8902q1056K7463N2781l0723l0887r4814J01969J53096
$$ -22981 -11458 35118 64020 -17036 10427 63208 32485 1598 -93216 8753 161849
24878A61849q1898p0762j5348j04274J270k3089J04310R4138K4623p0335j44071
$$ 161849 79951 9189 -6159 -110433 -109163 -132252 -27942 66196 90819 20484 -123587
24867a23587M4307K6625j46741j03929O0908L2624n8071N9224P8559L0977l1087
$$ -123587 -79280 -52655 -199396 -303325 -242417 -209793 -267864 -208640 -130081 -99104 -130191
24856a30191N2860K7348O0633r765o929K2130k9869m0703R8885J6524p7472l9250
$$ -130191 -77331 -49983 10650 885 -6044 16086 -13783 -54486 44399 60923 -16549 -55799
24844e5799m6248K5464Q6100j10266p069J19989M2605r7705O5488M4380M9180
$$ -55799 -102047 -76583 9517 -100749 -107818 12171 54776 -42929 22559 66939 116119
24833A16119j07486r8426N2169J15398J24516j18969m7449L7491l8055j01472
$$ 116119 8633 -89793 -37624 77774 202290 83321 35872 73363 35308 -66164
24823f6164k16N0139n9212j00252R4251J12375J639J07637n1005p8422k4015K7541
$$ -66164 -66380 -16241 -75453 -175705 -81454 30921 32560 140197 89192 10770 -13245 14296
24811A4296q542k4592m2060j49060j17976J25610l2244N7775J68825j3068r1565
$$ 14296 5754 -18838 -60898 -209958 -327934 -202324 -234568 -176793 -7968 -21036 -112601
24800a12601n1863J06374r2839J32791O627p9425K5620K2153P112n0299J320m7591
$$ -112601 -164464 -58090 -150929 -18138 -11511 -90936 -65316 -43163 -36051 -86350 -85030 -132621
24788a32621J1421P2999o3660p3714j3002P9515O3485J35293N3531N621l5794
$$ -132621 -121200 -48201 -111861 -185575 -198577 -119062 -55577 79716 133247 138868 103074
24777A03074K6750J0607o821m9516m7770P066M9654O0102j65167r9692L6365n0323
$$ 103074 129824 140431 133610 84094 36324 43390 93044 153146 -12021 -111713 -75348 -125671
24765a25671j04512K1738Q5999J7021M0866P949O8734J22966K4981J25902p6167
$$ -125671 -230183 -208445 -122446 -105425 -64559 -56610 12124 135090 160071 285973 209806
24754B09806p2674M3036p6174q4941N1843O0981P0571k5395j41750K1478o976
$$ 209806 137132 180168 103994 19053 70896 131877 202448 177053 35303 56781 49805
24743D9805K8817n0821L9415o3385o1937j3309N917K5258R8134J05645L0244r0006
$$ 49805 78622 27801 67216 3831 -58106 -71415 -65498 -40240 57894 163539 193783 103777
24731A03777o9661j9127j12705j01943R6703R8495O3709j07816j07442p0667L5492
$$ 103777 34116 14989 -97716 -199659 -102956 -4461 59248 -48568 -156010 -226677 -191185
24720a91185J44996L783j02361j3937m1950Q2845J0235k0240J37363n4955k2973
$$ -191185 -46189 -42406 -144767 -158704 -200654 -117809 -107574 -127814 9549 -45406 -68379
24709f8379J21814P6095j5163J8845R0383p8105q7508j16043r0945J31839Q6916
$$ -68379 53435 129530 114367 133212 223595 145490 57982 -58061 -149006 -17167 69749
24698F9749q4230m4901J37276l5181j66513L5927L2178q0951N7274R705m427p0226
$$ 69749 -14481 -59382 77894 42713 -123800 -87873 -55695 -136646 -79372 -69667 -74094 -144320
24686a44320K1669Q7797M8891M6045M0867q7845k0664M5696j32024m5362Q3641
$$ -144320 -122651 -34854 14037 60082 100949 13104 -7560 38136 -93888 -139250 -55609
24675e5609N7496p2918r2804J6003J64063J02884l3101k502P1477L3774l6723
$$ -55609 1887 -71031 -163835 -147832 16231 119115 86014 83512 154989 188763 152040
24664A52040r5764R8499L4093r937j93463j6014M6573M4271K404k5477N9117J21531
$$ 152040 56276 154775 188868 178931 -14532 -30546 16027 60298 62702 37225 96342 217873
24652B17873M1459j14267k38965n0178l3660J1958N2890P6476n80L179Q6713l3880
$$ 217873 259332 145065 -93900 -144078 -177738 -165780 -112890 -36414 -36994 -33815 52898 19018
24640A9018j6978j17151j22601k0048K1106J03089Q1048K9306Q669L9409Q6244
$$ 19018 2040 -115111 -237712 -257760 -236654 -133565 -52517 -23211 -14542 24867 111111
24629A11111J9148l9651L7874J2704M3823o9078j27576j8525P1106P0075m9497
$$ 111111 130259 90608 128482 141186 185009 115931 -11645 -30170 40936 111011 61514
24618F1514m9159N285q0410J6682k0818n2090j09879N0817J03825p723m3733j07594
$$ 61514 12355 17640 -62770 -46088 -66906 -118996 -228875 -178058 -74233 -81956 -125689 -233283
24606b33283J16412K61372J01256o9197j58178j53238L0361M2379P7626O9536
$$ -233283 -116871 144501 245757 176560 18382 -134856 -104495 -62116 15510 85046
24596H5046L4437l4543q4609O1047o5503n7894J04488P3738o5963l8690j27432
$$ 85046 119483 84940 331 61378 -4125 -62019 42469 116207 50244 11554 -115878
24585a15878P2433P9976k4071m0605J03532J07298l2134l4410K433j51605j66932
$$ -115878 -43445 36531 12460 -28145 75387 182685 150551 116141 118574 -33031 -199963
24574a99963N0940J21128m5592P131P9968J33013J64187o4450o8197r5056j67972
$$ -199963 -149023 -27895 -73487 -66356 13612 146625 310812 246362 178165 83109 -84863
24563h4863K7102l981j45858j04146L0924J53488R5771K033J06449k720q1319
$$ -84863 -57761 -61742 -207600 -311746 -280822 -127334 -31563 -29530 76919 74199 -7120
24552g120J5426K2M7855l0068m4080p6572P9942n247k4854n4968l5044J38404
$$ -7120 8306 8328 56183 26115 -17965 -94537 -14595 -19842 -44696 -99664 -134708 3696
24540C696Q3280m3966j53413k2512J35343n1153q5882P6926L8343k654o1028q6463
$$ 3696 86976 43010 -110403 -132915 2428 -48725 -134607 -57681 -19338 -21992 -83020 -169483
24528a69483l2175P6788J8547O4223M3523K7756k5939l3991L4082J4358K2200
$$ -169483 -201658 -124870 -106323 -42100 1423 29179 3240 -30751 3331 17689 39889
24517C9889K2976m0897n8061m2292N4103L80q0223O0497R65p7219M0431J24556
$$ 39889 62865 21968 -36093 -78385 -24282 -23902 -104125 -43628 -42663 -119882 -79451 45105
24505D5105k0296J2064M0130J868J543R1435l520j00279j04429Q373m514J3619
$$ 45105 24809 36873 77003 78871 80414 171849 168329 68050 -36379 -28006 -32520 -18901
24493a8901K8394J32211P1662q6411l4976l5646r8835O3150J8010R0618K1941
$$ -18901 9493 141704 213366 126955 91979 56333 -42502 20648 38658 129276 151217
24482A51217k8243n796n8973r0390l8721O1315j7220o5457l8324J14284Q941n7889
$$ 151217 122974 117178 58205 -32185 -70906 -9591 -26811 -92268 -130592 -16308 -7367 -65256
24470f5256k2544k2444K9582P8506p1889j08289j5352l0932K2923L417J08718
$$ -65256 -87800 -110244 -80662 -2156 -74045 -182334 -197686 -228618 -205695 -202278 -93560
24459i3560J18328P4871M0979j04181l6914r4938M184J1973l4278O340M9511M7476
$$ -93560 24768 99639 140618 36437 -477 -95415 -91231 -79258 -113536 -107196 -57685 -10209
24447a0209N9978l4787K2360K807o7954m3638r5362Q7595J38087Q2530n702o6512
$$ -10209 49769 14982 37342 40149 -27805 -71443 -166805 -79210 58877 141407 135705 69193
24435F9193J2727q2228q1094L8785P3960M9974P0460k9502j09533Q873K0598L3851
$$ 69193 81920 -308 -81402 -42617 31343 81317 151777 122275 12742 21615 42213 76064
24423G6064l9620j6368j5390J0427M8747P4638l2836k0782r240Q3598J21772k1622
$$ 76064 36444 20076 4686 15113 63860 138498 105662 84880 75640 159238 281010 259388
24411B59388p7235j6679l6130P792J19880O3556o5209j28226q4261n3414k4141
$$ 259388 182153 165474 129344 137136 257016 320572 255363 127137 42876 -10538 -34679
24400c4679P0162l8329j31327n1291o992q5069K676O1295N9968K3318k5963M6798
$$ -34679 35483 -2846 -134173 -185464 -192456 -277525 -274849 -213554 -153586 -130268 -156231 -109433
24388a09433J67888K419K5980J3569N8431p7507j9467l7174j4640o3663p0104
$$ -109433 58455 60874 86854 100423 158854 81347 61880 24706 10066 -53597 -123701
24377a23701p719P8545O7806j14774L4711m526J4644M6473o041l634l0762N684
$$ -123701 -131420 -52875 14931 -99843 -65132 -69658 -55014 -8541 -14582 -18216 -48978 -43294
24365d3294Q0718Q1819L084n4173l2042n7545M5185J65086l4122p1284m1142j10979
$$ -43294 37424 119243 122327 68154 36112 -21433 23752 188838 154716 83432 42290 -68689
24353f8689P528J24422J17142m1552o7299j13118k8794l031R470J29900Q7651
$$ -68689 -61161 63261 180403 138851 71552 -41566 -70360 -73391 -63921 65979 153630
24342A53630o7744o3637J8544J1329N09Q2841j02141n0933k8103k1579L8094J9227
$$ 153630 85886 22249 40793 52122 52631 135472 33331 -17602 -45705 -67284 -29190 -9963
24330i963p1077j00416m0933P6092N0714k4154o3798L9902J05304l015n4618l0596
$$ -9963 -81040 -181456 -222389 -146297 -95583 -119737 -183535 -143633 -38329 -41344 -95962 -126558
24318a26558m8418K3794M2772L0090l4701J44118K1904l5823n0357P6099J02621
$$ -126558 -174976 -151182 -108410 -78320 -113021 31097 53001 17178 -33179 42920 145541
24307A45541j8511o1580m8759r3652q8611q1442r5509O5335l6254n0442N1135
$$ 145541 127030 65450 16691 -76961 -165572 -247014 -342523 -277188 -313442 -363884 -312749
24296c12749J08996J39171J17145J9091o2612l2763m2360q6341L8739k0404r0554
$$ -312749 -203753 -64582 52563 71654 9042 -23721 -66081 -152422 -113683 -134087 -224641
24285b24641N5088J49716q1144q766R0004M6116j04435P1140O501k8601J04263
$$ -224641 -169553 -19837 -100981 -109747 -19743 26373 -78062 -6922 -421 -29022 75241
24274G5241k0546k6681q092k9647L7413r5279o1432o0643N56M4789J34940J08284
$$ 75241 54695 28014 19922 -9725 27688 -67591 -129023 -189666 -189110 -144321 -9381 98903
24262I8903j1604p5503j92790L268K9102l9165J05799J11480L6989O7264m9911
$$ 98903 87299 11796 -180994 -177726 -148624 -187789 -81990 29490 66479 133743 83832
24251H3832j02381M3249l1157L0304O5621j9508n0009j3953j8124k514k0817q7678
$$ 83832 -18549 24700 -6457 23847 89468 69960 19951 5998 -12126 -14640 -35457 -123135
24239a23135o3005Q7442M7627K430K6589m0368m1148k9201R5296R0406L720r7937
$$ -123135 -186140 -98698 -51071 -48641 -22052 -62420 -103568 -132769 -37473 52933 56653 -41284
24227d1284m2321R4295L486j814L6103Q7339j31664m8227J6553L5305J20667J14683
$$ -41284 -83605 10690 14176 12362 48465 135804 4140 -44087 -27534 7771 128438 243121
24215B43121k1023m5857j06260r8168k4710o4927m5702O8368O4274k4378n2088
$$ 243121 222098 176241 69981 -28187 -52897 -117824 -163526 -95158 -30884 -55262 -107350
24204a07350Q0314m3017j6754J41493O3289M7631j09449j6433K7321m1558q260
$$ -107350 -27036 -70053 -86807 54686 117975 165606 56157 39724 67045 25487 17227
24193A7227o8438L511Q7868J7885l2348j13797K5150m2344p2413J24780J2801
$$ 17227 -51211 -47700 40168 58053 25705 -88092 -62942 -105286 -177699 -52919 -40118
24182d0118l0892J12779N5393j09071q6352J8076M6220J09059Q3650j3277o6797
$$ -40118 -71010 41769 97162 -11909 -98261 -80185 -33965 75094 158744 145467 78670
24171G8670J3085N7290J09799R842K7701L5719J5185j04569m5811L0158L6223
$$ 78670 91755 149045 258844 268686 296387 332106 347291 242722 196911 227069 263292
24160B63292J3357m518q6581l2445O188l2224K15424N0798J9183M5558M4726M4550
$$ 263292 276649 272131 185550 153105 159293 127069 342493 393291 412474 458032 502758 547308
24148E47308k02l0125q7296j15788N8506K8918p4836q3230Q719J4344k2373Q320
$$ 547308 547106 516981 429685 313897 372403 401321 326485 243255 251974 266318 243945 252265
24136B52265j60102p0078K3285k2874k4804k0900j1505L0333J63272K231K5612
$$ 252265 92163 22085 45370 22496 -2308 -23208 -34713 -4380 158892 161123 186735
24125A86735M2771l8854o5136N7927l2611m045J8111R932p2014n7027l9135K7041
$$ 186735 229506 190652 125516 183443 150832 146787 164898 174830 102816 45789 6654 33695
24113C3695Q891m0422j04521K618J30754m4560M8111M373r367m11K1472K2010
$$ 33695 42586 2164 -102357 -99739 31015 -13545 34566 38939 29572 29161 50633 72643
24101G2643p4096j3679K5443K8887l3656P5311Q1897O6396M4996j39433m2529
$$ 72643 -1453 -15132 10311 39198 5542 80853 162750 229146 274142 134709 92180
24090I2180n951L8219m3719o5283k0704j697L1556Q7074L2661j13244j00250l8477
$$ 92180 86229 124448 80729 15446 -5258 -6955 24601 111675 144336 31092 -69158 -107635
24078a07635J5788Q039O5438N1928K4302j9725q01m2274M1405J11652J6754l6446
$$ -107635 -91847 -83808 -18370 33558 57860 38135 37334 -4940 36465 148117 164871 128425
24066A28425l0782K4385m7005K1182O0755m9570m8665m0386m1334J8110J08627
$$ 128425 97643 122028 75023 96205 156960 107390 58725 18339 -22995 -4885 103742
24055A03742J32104k0001K5678j1197o7055p6209K4003p2679m5355r9565j40351
$$ 103742 235846 215845 241523 230326 163271 87062 111065 38386 -6969 -106534 -246885
24044b46885N2952J02422R2679N5030M4468n6338k1654N5353n9832m8450r2903
$$ -246885 -193933 -91511 1168 56198 100666 44328 22674 78027 18195 -30255 -123158
24033a23158J779M8029j1703K6929M8400j6417j08715L1570J09046P5764M4370
$$ -123158 -121379 -73350 -85053 -58124 -9724 -26141 -134856 -103286 5760 81524 125894
24022A25894R7562N3904j18042q2170j47689m672l3630K0328L266N7285P2795
$$ 125894 223456 277360 159318 77148 -70541 -75213 -108843 -88515 -85249 -27964 44831
24011D4831n747o6487O4801k5873L3639J521n3090l8160L8770P4283K8358J9297
$$ 44831 39084 -27403 37398 11525 45164 46685 -6405 -44565 -5795 68488 96846 116143
23999A16143o2864l014l6527L939L4427P8412J2040j20775o2934L7566J9170j3346
$$ 116143 53279 50265 13738 17677 52104 130516 142556 21781 -41153 -3587 15583 2237
23987B237l279q4018J1381P1283Q4415N612L9157j4892l7617L2080O944J21792
$$ 2237 -1042 -85060 -73679 -2396 82019 87631 126788 111896 74279 106359 113303 235095
23975B35095j3300j87660k38j14851m1713N841J22959L2345o7872r8791M7004
$$ 235095 221795 34135 33897 -80954 -122667 -116826 6133 38478 -29394 -128185 -81181
23964h1181P7481n9562q45l2200J7816J16493N0099j43829j562Q3815k3918o1270
$$ -81181 -3700 -63262 -64107 -96307 -78491 38002 88101 -55728 -57290 26525 2607 -58663
23952e8663r2474r2515n5701J7097Q2364M5436J02447m8743p2478m3122O3089
$$ -58663 -151137 -243652 -299353 -282256 -199892 -154456 -52009 -100752 -173230 -216352 -153263
23941a53263J47602j7000m0723n4779J00404P7140L9662Q369j6473K6233n4286
$$ -153263 -5661 -22661 -63384 -118163 -17759 59381 99043 107412 90939 117172 62886
23930F2886m1751j33405q5872M065O6997J3579Q8213J27840J64j48452j32911
$$ 62886 21135 -112270 -198142 -194077 -127080 -113501 -25288 102552 102716 -45736 -178647
23919a78647Q1490P6090O5414l127O550m0155n1258p5043K6996K5920n0947R4833
$$ -178647 -97157 -21067 44347 41220 47770 7615 -43643 -118686 -91690 -65770 -116717 -21884
23907b1884K2722M4776l2211j1981M3903m7414Q5573o979j9184l5101l8160q4420
$$ -21884 838 45614 13403 1422 45325 -2089 83484 76505 57321 22220 -15940 -100360
23895a00360k3617L0796M9277J4176j8740q8745L6699O2977O5283l1879J250J89125
$$ -100360 -123977 -93181 -43904 -29728 -48468 -137213 -100514 -37537 27746 -4133 -2883 186242
23883A86242M1814j39074r1948J7494J741J16226J9548n4029M2000m2154j3114
$$ 186242 228056 88982 -2966 14528 16269 132495 152043 98014 140014 97860 84746
23872H4746J5430N9649j38619r8704J18342j4419J0695l3215p4230k5854P1918
$$ 84746 100176 159825 21206 -77498 40844 26425 37120 3905 -70325 -96179 -24261
23861b4261N5050r4226o1408k6314m823O552J12576k182J2549M9391L5185L8660
$$ -24261 30789 -63437 -124845 -151159 -155982 -149430 -36854 -39036 -26487 22904 58089 96749
23849I6749r8437j7037J16401j42673j20537L9163Q6710O7891L4011o4013m0715
$$ 96749 -1688 -18725 97676 -44997 -165534 -126371 -39661 28230 62241 -1772 -42487
23838d2487K2228L1211o0618L7747J57599r0209n5356n0380k7640q0091Q6369
$$ -42487 -20259 10952 -49666 -11919 145680 55471 115 -50265 -77905 -157996 -71627
23827g1627N6830J8160L5635k7231L1689m4046M1622l4254L1120J510j62036j38265
$$ -71627 -14797 3363 38998 11767 43456 -590 41032 6778 37898 39408 -122628 -260893
23815b60893R1453J5386Q6392K36603m0033l3154j23998l7128M9953m1313m5569
$$ -260893 -169440 -154054 -67662 168941 128908 95754 -28244 -65372 -15419 -56732 -102301
23804a02301j1932J25298J09367R110K3938p2135l5134q6773M6804J00501p544
$$ -102301 -114233 11065 120432 129542 153480 81345 46211 -40562 6242 106743 99199
23793I9199m4725q7629j11947O9407J12610j0130P0276J06801J5354j30559j31189
$$ 99199 54474 -33155 -145102 -75695 36915 26785 97061 203862 219216 88657 -42532
23782d2532N5980o8470R744k1868N0466L1233j44147Q393J16913J7281n0721j3708
$$ -42532 13448 -55022 -45278 -67146 -16680 14553 -129594 -121201 -4288 12993 -37728 -51436
23770e1436L9671N1616K1101L5400n5121j8364N1062k0946o5770J24429O0990
$$ -51436 -11765 39851 60952 96352 41231 22867 73929 52983 -12787 111642 172632
23759A72632j1235p0087k3883K0450M7616j21313p3111J17615J7925n9492m9957
$$ 172632 161397 91310 67427 87877 135493 14180 -58931 58684 76609 17117 -32840
23748c2840J00180p7556p6570l1948J47151J03020q8469r3144j9430K7423J12765
$$ -32840 67340 -10216 -86786 -118734 28417 131437 42968 -50176 -69606 -42183 70582
23737G0582q6909m3420q7624K8126R6098Q0483M5909k6755q8542n7648k3293L6673
$$ 70582 -16327 -59747 -147371 -119245 -23147 57336 103245 76490 -12052 -69700 -92993 -56320
23725e6320o5804L8214O8838l1381L4331N0889J67361l6299o7144o7008j9163
$$ -56320 -122124 -83910 -15072 -46453 -12122 38767 206128 169829 102685 35677 16514
23714A6514q6610m1005J35545L8551M2887j20640R7905L9917k94q681r6184r3052
$$ 16514 -70096 -111101 24444 62995 105882 -14758 83147 123064 122770 114089 17905 -75147
23702g5147J1207L2714m7497l8628O9800M4972Q2834l7475n7822p437P497p6002
$$ -75147 -63940 -31226 -78723 -117351 -47551 -2579 80255 42780 -15042 -22479 -14982 -90984
23690i0984o2997N2037Q9856K8873m742P538O1204n859o568k5993J26674l2651
$$ -90984 -153981 -101944 -12088 16785 12043 19581 80785 74926 68358 42365 169039 136388
23678A36388l2882m9605n704j15442P952L5022P0520o8624p2980N3238K7477k201
$$ 136388 103506 53901 48197 -67245 -59293 -24271 46249 -22375 -95355 -42117 -14640 -16841
23666a6841J41608J56710k39067m9944Q9012r932m224n7418k4548P8323q811K5436
$$ -16841 124767 281477 42410 -7534 81478 71546 67322 9904 -14644 63679 54868 80304
23654H0304J29783q6686j72919l0306j9784j01264n5751M7524J27866O1964L3616
$$ 80304 210087 123401 -49518 -79824 -99608 -200872 -256623 -209099 -81233 -19269 14347
23643A4347q2594l6762N4437o9413Q9456M0944P4026M1108k4039o131r0081k09070
$$ 14347 -68247 -105009 -50572 -119985 -30529 10415 84441 125549 101510 95379 5298 -203772
23631b03772m1200J16241J14502j15327r1902L17Q306J6354P4375J00265k0360
$$ -203772 -244972 -128731 -14229 -129556 -221458 -221141 -212835 -196481 -122106 -21841 -42201
23620d2201M1394M0033j074l7232o1857O2795K0910L3195P1638j14975j65620
$$ -42201 -807 39226 38152 920 -60937 1858 22768 55963 127601 12626 -152994
23609a52994q7745j3922J4846L736J15773J17209P1673O1338n1663rL9726o7957
$$ -152994 -240739 -254661 -239815 -236079 -120306 -3097 68576 129914 78251 78242 117968 50011
23597E0011l6578j1240M8517j2720l6527K6398j37632l4318J62665n7575n0962
$$ 50011 13433 2193 50710 37990 1463 27861 -109771 -144089 18576 -38999 -89961
23586h9961P1025l0528K5886r349j9024n9661r071N0645p548p4260p1858n1288
$$ -89961 -18936 -49464 -23578 -32927 -51951 -111612 -120683 -70038 -77586 -151846 -223704 -274992
23574b74992J6932m1123j7322N0058P9691P0061J19245j22179L3207J29386m8670
$$ -274992 -258060 -299183 -316505 -266447 -186756 -116695 2550 -119629 -86422 42964 -5706
23563e706j6892J16354J26526j22803j30479r7247N0984M2565l1968L0967J7316
$$ -5706 -22598 93756 220282 97479 -33000 -130247 -79263 -36698 -68666 -37699 -20383
23552b0383o5586l1937J9971J7340J2990m0080L6899R669M215K7295M7900K2321
$$ -20383 -85969 -117906 -97935 -80595 -67605 -107685 -70786 -61117 -56902 -29607 18293 40614
23540D0614K1867n8987j04309M5649R9649l5712R715q5842O8945J8637Q493p5633
$$ 40614 62481 3494 -100815 -55166 44483 8771 18486 -67356 1589 20226 28719 -46914
23528d6914p0748R0561J74040O2253j58555k0041k4239l1815r8526J7993P2734
$$ -46914 -117662 -27101 146939 209192 50637 30596 6357 -25458 -123984 -105991 -33257
23517c3257K0639J443m5089J9792K9637l3648j12472r8201K5046J49177J34461
$$ -33257 -12618 -11175 -56264 -36472 -6835 -40483 -152955 -251156 -226110 -76933 57528
23506E7528M3016J01944R9298j43336j9775n2781L1245p6492O6036R7346N0227
$$ 57528 100544 202488 301786 158450 138675 85894 117139 40647 106683 204029 254256
23495B54256R1952k6187k47732r7975J26013k2380p0843r275l5491p344k6347
$$ 254256 346208 320021 72289 -25686 100327 77947 7104 -2171 -37662 -45006 -71353
23484g1353O5742n6251J25352J17122j4018k7581l3751j18975j24318o5996J14272
$$ -71353 -5611 -61862 63490 180612 166594 139013 105262 -13713 -138031 -204027 -89755
23473h9755J07338J6053m4944K6709l4386J9699L667q3064j2457J11204o6989
$$ -89755 17583 33636 -11308 15401 -18985 714 4381 -78683 -91140 20064 -46925
23462d6925L4711j757j08494J11854J01042o0518j28708J7703M0748L4626M6682
$$ -46925 -12214 -13971 -122465 -10611 90431 29913 -98795 -81092 -40344 -5718 40964
23451D0964L1432j29347j48917q260J12793P9694o5946m1441r498J8080J9900
$$ 40964 72396 -56951 -205868 -214128 -101335 -21641 -87587 -129028 -138526 -120446 -100546
23440a00546Q0233O3993N4183P0875M849J0146m7446q0120k6261J61524P4091
$$ -100546 -20313 43680 97863 168738 173587 183733 136287 56167 29906 191430 265521
23429B65521k3001m9234j20057p8330L3479P6491O4018K6798m2852j36338M1752
$$ 265521 242520 193286 73229 -5101 28378 104869 168887 195685 152833 16495 58247
23418E8247m4498j4645j9189l2011J3183O5277J21925o7278J6945J62087N7764
$$ 58247 13749 -896 -20085 -52096 -38913 26364 148289 81011 97956 260043 317807
23407C17807m8507m5031r562n2014p83o7621j37686j86397j3932Q5455P3332L9673
$$ 317807 269300 224269 214707 162693 161910 94289 -43397 -229794 -243726 -158271 -84939 -45266
23395d5266k0820K8717K25828J49523L5672o712j60617j13207p4241Q2119j5998
$$ -45266 -66086 -37369 188459 337982 373654 366942 206325 93118 18877 100996 84998
23384H4998K1821J2296J5384M9352j47n8799l0888m7288j01970j6680K6645J7813
$$ 84998 106819 119115 134499 183851 183704 124905 94017 46729 -55241 -71921 -45276 -27463
23372b7463p3751j3160M2264r6708J9052J16142O8048R2297o572O3482O2623J29275
$$ -27463 -101214 -114374 -72110 -168818 -149766 -33624 34424 126721 120149 183631 246254 375529
23360C75529p927n2791j39170m5691j7487M8181K1602J4479j8494j8238J3438
$$ 375529 367602 314811 175641 129950 112463 160644 182246 196725 178231 159993 173431
23349A73431J21115K8883l8748j42746j07220p6522p8068N8941K3156P2053K2926
$$ 173431 294546 323429 284681 141935 34715 -41807 -119875 -60934 -37778 34275 57201
23338E7201J5069m3704j1535j7285J10280l6088j09733j08400L5282J33962O7307
$$ 57201 72270 28566 17031 -254 110026 73938 -35795 -144195 -108913 25049 92356
23327I2356o9616P5793N3090j50769l2449R4186P4970m5619m1240r4802l1277
$$ 92356 22740 98533 151623 854 -31595 62591 137561 91942 50702 -44100 -75377
23316g5377R8800K15484p3810k05048o099O808m2087k5777J48428O3298K9450
$$ -75377 23423 238907 165097 -39951 -46050 -39242 -81329 -107106 41322 104620 134070
23305A34070k192L5296k9005l7246j29975Q4669m9738j43349P2524Q4530m1071
$$ 134070 131878 167174 138169 100923 -29052 55617 5879 -137470 -64946 19584 -21487
23294b1487p0956L9616J05193N1786m4800J04150N4848j0549j3308r6116r4731
$$ -21487 -92443 -52827 52366 104152 59352 163502 218350 207801 194493 98377 3646
23283C646o7562j8715Q6862j9922l293n4471R716K3197k2270K5954r0526Q609
$$ 3646 -63916 -82631 4231 -15691 -18984 -73455 -63739 -40542 -62812 -36858 -127384 -118775
23271a18775L9547j38363m5758J37645L8378j0459M5166r447m401N4714n7561
$$ -118775 -79228 -217591 -263349 -125704 -87326 -97785 -52619 -62066 -66467 -11753 -69314
23260f9314N3856J23841K2232q6218j3158L0851R3204M2080m0888o8923j13584
$$ -69314 -15458 108383 130615 44397 31239 62090 155294 197374 156486 87563 -26021
23249b6021L7980M8459N9417m8070K3110k3032r3683J8220J16091q0939m0907
$$ -26021 11959 60418 119835 71765 94875 71843 -21840 -3620 112471 31532 -9375
23238i375p5063m7092k5164P1692l9343l919n7777J65746K10160J01393P9652
$$ -9375 -84438 -131530 -156694 -85002 -124345 -128264 -186041 -20295 189865 291258 370910
23227C70910j14540j52290j7011l6465j13958P0483o7438K3159n865J05729l8818
$$ 370910 256370 104080 87069 50604 -63354 7129 -60309 -37150 -43015 62714 23896
23216B3896n5843j8879J0538L9074M5211L9829O6237k7264j44466R4168J75441
$$ 23896 -31947 -50826 -40288 -1214 43997 83826 150063 122799 -21667 72501 247942
23205B47942L611N2684p356j30615j05616q3268P1317M0604j08751r4364n4920
$$ 247942 251553 304237 296881 166266 60650 -22618 48699 89303 -19448 -113812 -168732
23194a68732Q9977M293j05194p787J42431j1792r2622N0753J47961Q7769J4145
$$ -168732 -78755 -74462 -179656 -187443 -45012 -56804 -149426 -98673 49288 137057 151202
23183A51202j16274m8544K5982j7302l4966J7465M6911J7897o233q480J0906k2028
$$ 151202 34928 -13616 12366 -4936 -39902 -22437 24474 42371 36138 27658 38564 16536
23171A6536r5273n0678J13850J22854J93056M5375j67536q5722q3537j8902J8407
$$ 16536 -78737 -129415 -15565 107289 300345 345720 178184 92462 8925 -9977 8430
23160H430p989J52368M0933j36003o5321K7730K3368j11895P223O4354P7323r2225
$$ 8430 441 152809 193742 57739 -7582 20148 43516 -68379 -61156 3198 80521 -11704
23148a1704n3899M7048J1877p1395k8566N8396J52886j6378q1395P0766O2650
$$ -11704 -65603 -18555 -6678 -78073 -106639 -48243 104643 88265 6870 77636 140286
23137A40286q4861l1899l6868M0575J10032P1780m6958M6076k572l3519J6014
$$ 140286 55425 23526 -13342 27233 137265 209045 162087 208163 205591 172072 188086
23126A88086j1900K5292j07118o0340j5229Q326O1718O2970j4012j602L1480J25568
$$ 188086 176186 201478 94360 34020 18791 27117 88835 151805 137793 136191 167671 293239
23114B93239k1521j13298Q6066P5644j4396q2788j28772j81638l1648K8640J00791
$$ 293239 271718 158420 244486 320130 305734 222946 94174 -87464 -119112 -90472 10319
23103A0319K4622n783J2481m5142p2776N9118J30084J9930n0324j9726j6726q6259
$$ 10319 34941 29158 41639 -3503 -76279 -17161 112923 132853 82529 62803 46077 -40182
23091d0182J62611Q8924l6566Q7377j42936k1068M1703N4800p1057j10472m7413
$$ -40182 122429 211353 174787 262164 119228 98160 139863 194663 123606 13134 -34279
23080c4279j15299r2771R1129K01431O8458m6548j5061J45319J16298q3736j17790
$$ -34279 -149578 -242349 -151220 50211 118669 72121 57060 202379 318677 234941 117151
23069A17151M2944Q5786j7105m8934K6261K1063Q991l0006p2145j23470L7880
$$ 117151 160095 245881 228776 179842 206103 227166 236157 206151 134006 10536 48416
23058D8416J26105m7198n3078j1851k427j0704N7304J047j13364J77705Q5275
$$ 48416 174521 127323 74245 62394 59967 49263 106567 107614 -5750 171955 257230
23047B57230M5988k0966j09280q2203m9770j7751K3598m9237J8179J30414J8587
$$ 257230 303218 282252 172972 90769 40999 23248 46846 -2391 15788 146202 164789
23036A64789r3443n4733N7026o4523R5059M6653p2286O1689p0355m15N587n301
$$ 164789 71346 16613 73639 9116 104175 150828 78542 140231 69876 69461 75048 69747
23024F9747J2095J7142j48287k9101O9520m6529P9731M9282k9406K0233Q879K797
$$ 69747 81842 98984 -49303 -78404 -8884 -55413 24318 73600 44194 64427 73306 76103
23012G6103l3384K9661N0426p0188j3069j4606K311M7475M6890R2782p031n0208
$$ 76103 42719 72380 122806 52618 39549 24943 27254 74729 121619 214401 207370 157162
23000A57162k8829J3525Q996Q5291O287j02563j11013l2870r6992J46452L228
$$ 157162 128333 141858 150854 236145 242432 139869 28856 -4014 -101006 45446 48674
22989D8674j58917N7017O2834k4726M9585Q7009n2025M9519O6818P0610J58860
$$ 48674 -110243 -53226 9608 -15118 34467 121476 69451 118970 185788 256398 415258
22978D15258j2809j02928k1764j8123p4806J8403r711K3186k004k6989N0862p2842
$$ 415258 402449 299521 277757 259634 184828 203231 193520 216706 214702 187713 238575 165733
22966A65733o3167j42175n1735J22713O4195P3749N0187o3991j08381j5154k9
$$ 165733 102566 -39609 -91344 31369 95564 169313 219500 155509 47128 31974 31945
22955C1945N2266q7680m8376P668J53046J03683k6772j49581p4634P9300R112
$$ 31945 84211 -3469 -51845 -44177 108869 212552 185780 36199 -38435 40865 49977
22944D9977o8634M5024J17992J8380J01624J44424k8236o72Q0158j08583j51886
$$ 49977 -18657 26367 144359 162739 264363 408787 380551 379879 460037 351454 199568
22933A99568l80J9038Q7282J7094l2776O7399O381J9724j14968k8505j8699j16100
$$ 199568 199188 218226 305508 322602 289826 357225 363606 383330 268362 239857 221158 105058
22921A05058o2905Q9553k0657q8836M2169K9095j5235M0583j8167N4261M1696
$$ 105058 42153 131706 111049 22213 64382 93477 78242 118825 100658 154919 196615
22910A96615o5220j9618n3089l8328R408J39342l3268k08199l1899J68803R2904
$$ 196615 131395 111777 58688 20360 29768 169110 135842 -72357 -104256 64547 157451
22899A57451J8807k6833q1217J6422O9588j0877n9735L5581M1418J58060K4333
$$ 157451 176258 149425 68208 84630 154218 143341 83606 119187 160605 318665 342998
22888C42998j21411n7181N4556P831q3028l9795q8516k10M541J26124o0671m9149
$$ 342998 221587 164406 218962 226793 143765 103970 15454 15244 19785 145909 85238 36089
22876C6089n1973L1534j9128J1267p9714n9177J68869J24064M4976m2373L1974
$$ 36089 -15884 15650 -3478 7789 -71925 -131102 37767 161831 206807 164434 196408
22865A96408J5057n4312k084m2817N358o2164N5651J42068M3326N7841Q0940k8620
$$ 196408 211465 157153 155069 112252 117610 55446 111097 253165 296491 354332 435272 406652
22853D06652j66126l612J69291J18775Q5819J24205M6726q7815p9486l3978j6545
$$ 406652 240526 236914 406205 524980 610799 735004 781730 693915 614429 580451 563906
22842E63906k0670j07851n7467l8659O1105l2257k2056r1894M678R7682R1635
$$ 563906 543236 435385 377918 339259 400364 368107 346051 254157 258835 356517 448152
22831D48152l8195k5325M8390P2543M1291l4886J26939J06697N6189Q9623p189
$$ 448152 409957 384632 433022 505565 546856 511970 638909 745606 801795 891418 884229
22820H84229J1589J49251J21391J56739K92263K17274J15098M0356K4226j91144
$$ 884229 895818 1045069 1166460 1323199 1615462 1832736 1947834 1988190 2012416 1821272
22810A821272k38310k43647J9431n6189j68299j68277L4398J30509K3026n1101
$$ 1821272 1582962 1339315 1358746 1302557 1134258 965981 1000379 1130888 1153914 1102813
22800A102813j66439j38649Q6791K2607j28018p3842j8794j7768M849n9464J16395
$$ 1102813 936374 797725 884516 907123 779105 705263 686469 668701 673550 614086 730481
22789G30481J67077O9288r1283j20296P7459J47688M1319J82519J06224j29243
$$ 730481 897558 966846 875563 755267 832726 980414 1021733 1204252 1310476 1181233
22779A181233j12175K9064Q7375J96401Q0109m6077m5833O1226J25547j07253
$$ 1181233 1069058 1098122 1185497 1381898 1462007 1415930 1370097 1431323 1556870 1449617
22769A449617J20910J80408O4860P7617M70O5117R4963J1429R4080J14750R4312
$$ 1449617 1570527 1750935 1815795 1893412 1893882 1958999 2053962 2065391 2159471 2274221 2368533
22758B368533J15412P9238J79265K26118L18085K05203J04200K28494L41246L79520
$$ 2368533 2483945 2563183 2742448 2968566 3286651 3491854 3596054 3824548 4165794 4545314
22748D545314L83501M90602N68933N93245P12861Q86261J012358J183471J340707
$$ 4545314 4928815 5419417 5988350 6581595 7294456 8180717 9193075 10376546 11717253
22739A1717253J632129J909469K138069K681240L453546M137090N769314Q127379
$$ 11717253 13349382 15258851 17396920 20078160 23531706 27668796 33438110 41565489
22731D1565489J1822594J7917055K6997819L9004883M9063441M6541586K9501331
$$ 41565489 53388083 71305138 98302957 137307840 186371281 232912867 262414198
22724B62414198J2786152l184608k5592104m4411352m6094712l6227768k5258333
$$ 262414198 275200350 272015742 246423638 202012286 155917574 119689806 94431473
22717I4431473j7022097j1684156q403386o435297m996673m040559l398327k803137
$$ 94431473 77409376 65725220 57321834 50886537 45889864 41849305 38450978 35647841
22709C5647841k429086k041787j731805j392972j312879j357266j297027j126807
$$ 35647841 33218755 31176968 29445163 28052191 26739312 25382046 24085019 22958212
22701B2958212j091055j008519r45987r64961q45742p88521n52345n83211m75884
$$ 22958212 21867157 20858638 19912651 18947690 18101948 17313427 16761082 16177871 15701987
22692A5701987n07373m09509l78448l88676l16422k08026l67142k38135k20199
$$ 15701987 15194614 14785105 14406657 14017981 13701559 13493533 13126391 12888256 12668057
22683A2668057j64405l41120m25485l49409j77760k40838l20535k58606k75431
$$ 12668057 12503652 12162532 11737047 11387638 11209878 10969040 10648505 10389899 10114468
22674A0114468k68973k57273k25195k30879k71637k16343j74095j82312j55646
$$ 10114468 9845495 9588222 9363027 9132148 8860511 8644168 8470073 8287761 8132115
22665H132115k87188k62882j10878m0670k2405j63504l21454j86549j05408j98022
$$ 8132115 7844927 7582045 7471167 7430497 7408092 7244588 6923134 6736585 6631177 6433155
22655F433155j55487N4705m893k18046j97078o3442j1001j60924j23852n9222
$$ 6433155 6277668 6332373 6327480 6109434 5912356 5848914 5837913 5676989 5553137 5493915
22645E493915r5294r2803n3928j44640j05170j46067r3207q1465j22612k32308
$$ 5493915 5398621 5305818 5251890 5107250 5002080 4856013 4762806 4681341 4558729 4326421
22635D326421j14665L2869m5711j71236j35187q5220j8196L4152r2936o8274k0578
$$ 4326421 4211756 4244625 4198914 4027678 3892491 3807271 3789075 3823227 3730291 3662017 3641439
22624C641439O6566k1372k2459k48051j91373q3483L3215L8842p1302Q6675K072
$$ 3641439 3708005 3686633 3664174 3416123 3224750 3141267 3174482 3213324 3142022 3228697 3230769
22613C230769r3039j70946j26429P5014J44221J5479j09700l469q0078j68700
$$ 3230769 3137730 2966784 2840355 2915369 3059590 3075069 2965369 2961900 2881822 2713122
22603B713122j14801l4614O0648K8914j54571j20704k9079L7811n0975j26273
$$ 2713122 2598321 2563707 2624355 2653269 2498698 2377994 2348915 2386726 2335751 2209478
22593B209478p5787M8997O0948n0687R2627m9900j59616q0743p8300K7420r2864
$$ 2209478 2133691 2182688 2243636 2192949 2285576 2235676 2076060 1995317 1917017 1944437 1851573
22582A851573j68027j39519M8048K00850m2784j41191l7493Q7642L2321j5375
$$ 1851573 1683546 1544027 1592075 1792925 1750141 1608950 1571457 1659099 1691420 1676045
22572A676045J04709k2307p5232P1318r7534k1534j5747j03798r0334n1001K4116
$$ 1676045 1780754 1758447 1683215 1754533 1656999 1635465 1619718 1515920 1425586 1374585 1398701
22561A398701o7370n6746j1868J26585j4569R10o435N422j4723j75478j77853
$$ 1398701 1331331 1274585 1262717 1389302 1374733 1375643 1369208 1374630 1359907 1184429 1006576
22550A006576l2399R3521L1844K1680J498l4868j5239M6563o0273M2919P7794
$$ 1006576 974177 1067698 1099542 1121222 1122720 1087852 1072613 1119176 1058903 1101822 1179616
22539A179616o6702m6233P0291M1945m3748j78433r8357k3118J38578J12370j10226
$$ 1179616 1112914 1066681 1136972 1178917 1135169 956736 858379 835261 973839 1086209 975983
22528I75983J1429o9581l2507J22846N2398n2064j27665j6757N6920P239M3636
$$ 975983 987412 917831 885324 1008170 1060568 1008504 880839 864082 921002 928241 971877
22517I71877o2682j31783j32054j5288N9523J24203L8910Q3117J6605k06284l3321
$$ 971877 909195 777412 645358 630070 689593 813796 852706 935823 952428 746144 712823
22506G12823J16225J09897j5012k8776j27271j1118P1804J02231k1912O9064q535
$$ 712823 829048 938945 923933 895157 767886 756768 828572 930803 908891 977955 969420
22495I69420R182m2887m8759J2765j38286q0848M7060j18706K8576k0522j44615
$$ 969420 978602 935715 886956 899721 761435 680587 727647 608941 637517 616995 472380
22484D72380l6021J3944o6648l3537l0843J26099L8183r596j24418n2317O5499
$$ 472380 436359 450303 383655 350118 319275 445374 483557 473961 349543 297226 362725
22473C62725m6704j6217O4757k9830n8914j5643J6092M9345O1897M8556M6431
$$ 362725 316021 299804 364561 334731 275817 260174 276266 325611 387508 436064 482495
22462D82495R6201Q060j97756j32976K6512J12567N5533J8097N0315J07550m5684
$$ 482495 578696 586756 389000 256024 282536 395103 450636 468733 519048 626598 580914
22451E80914n2180O5250j37270p6728j899N4336n3003q5047K2906K9970M4394
$$ 580914 528734 593984 456714 379986 378087 432423 379420 294373 317279 347249 391643
22440C91643O0615M9014N3951J4408L5801q944o4571p3899o7776m5257r2777J9545
$$ 391643 452258 501272 555223 569631 605432 596488 531917 458018 390242 344985 252208 271753
22428B71753m9551m2830Q8914J11365P5440P8332l2498J8322J5090R1402O1368
$$ 271753 222202 179372 268286 379651 455091 533423 500925 519247 534337 625739 687107
22417F87107Q2920J09209R2718Q4591m6482j2332n7625j76934q0782M0990k1924
$$ 687107 770027 879236 971954 1056545 1010063 997731 940106 763172 682390 723380 701456
22406G01456J7742O1310J4335q2272o7m5706j7222J09656J36602j02931m7784
$$ 701456 719198 780508 794843 712571 712504 666798 649576 759232 895834 792903 745119
22395G45119K0346N6922q1205j31402p3849p5080l9914R5258n546K8603l7886
$$ 745119 765465 822387 741182 609780 535931 460851 420937 516195 510649 539252 501366
22384E01366m8165K2985j17899R6931m410j6410O397K987k365m8188j4629N7565
$$ 501366 453201 476186 358287 455218 450808 434398 440795 443782 441417 393229 378600 436165
22372D36165J43396M7529l2903q0731J4848L11911J23294k21211k35803P0946
$$ 436165 579561 627090 594187 513456 528304 840215 963509 742298 506495 577441
22362E77441J34118k8900m5120R978q1145l9239O0246J21925K56087O3044J5024
$$ 577441 711559 682659 637539 647517 566372 527133 587379 709304 965391 1028435 1043459
22351A043459J06852R1401j8798o2356r0222m3301m3058j12062j34435m3372q916
$$ 1043459 1150311 1241712 1222914 1160558 1070336 1027035 983977 871915 737480 694108 685192
22340F85192p2344p8220J48832Q384P6207M2508J32962q8683J2451l5806k6025
$$ 685192 612848 534628 683460 691844 768051 810559 943521 854838 867289 831483 805458
22329H05458J63499p10K8390P8559R6331k785J4774P3356J68071L83233N03330
$$ 805458 968957 968247 996637 1075196 1171527 1168742 1183516 1256872 1424943 1808176 2311506
22318B311506L22337O3493J30341J5919l13681l55714l38611k89641j93550j48777
$$ 2311506 2633843 2697336 2827677 2843596 2529915 2174201 1835590 1545949 1352399 1203622
22308A203622j1582N7067R6537n6011k07672j03096R7936J74845J93272l0298
$$ 1203622 1192040 1249107 1345644 1289633 1081961 978865 1076801 1251646 1444918 1414620
22298A414620L5215P67n1675J54849M7234J7943J06931R4826J00887P5603J90455
$$ 1414620 1449835 1450602 1398927 1553776 1601010 1618953 1725884 1820710 1921597 1997200 2187655
22287B187655J33144q7792M7034O9859k5686N9649K0748K1086L9649P7768J37802
$$ 2187655 2320799 2233007 2280041 2349900 2324214 2383863 2404611 2425697 2465346 2543114 2680916
22276B680916K6074P8702N2546J22022J89597M8435J07872K03577K44067L28618
$$ 2680916 2706990 2785692 2838238 2960260 3149857 3198292 3306164 3509741 3753808 4082426
22266D082426J75051L06680M03243M20546M52174P07373J009812J137863J293260
$$ 4082426 4257477 4564157 4967400 5387946 5840120 6547493 7557305 8695168 9988428
22257I988428J455952J688290K196896K746352L793528N262577P573421J1393329
$$ 9988428 11444380 13132670 15329566 18075918 21869446 27132023 34705444 46098773
22249D6098773J8043874L0789201N1811202P0654619N5573323K1021867J1951896
$$ 46098773 64142647 94931848 146743050 217397669 272970992 293992859 305944755
22242C05944755l662985m7267540p0324297n5099054l3673628k0192263j2800038
$$ 305944755 302281770 255014230 184689933 129590879 95917251 75724988 62924950
22235F2924950q792925o645828n265526m267149l430894k870874k409182j813248
$$ 62924950 54132025 47486197 42220671 37953522 34522628 31651754 29242572 27429324
22227B7429324j445661j258820r91934r48374r59234r13227p84527p61512q26021
$$ 27429324 25983663 24724843 23732909 22784535 21825301 20912074 20127547 19366035 18540014
22218A8540014p08538o40044n42590o96641o92083m19980n06606l92787k76002
$$ 18540014 17831476 17191432 16648842 15952201 15260118 14840138 14333532 13940745 13664743
22209A3664743l05654k70116k54968k44942k51912j89370j62307k53056k35196
$$ 13664743 13359089 13088973 12834005 12589063 12337151 12147781 11985474 11732418 11497222
22200A1497222j58742l35724l42675l16625k32421j45043j43168k51084k53361
$$ 11497222 11338480 11002756 10660081 10343456 10111035 9965992 9822824 9571740 9318379
22191I318379j94216j57680r0198k02820l31048k80227k25320j58705j51817k26297
$$ 9318379 9124163 8966483 8876285 8673465 8342417 8062190 7836870 7678165 7526348 7300051
22181G300051j86493j49218j9417q4472j74838k8941j7270L2904J44852L25407
$$ 7300051 7113558 6964340 6944923 6860451 6685613 6656672 6639402 6672306 6817158 7142565
22171G142565L71950N5256o1517j17608m00376n42203m43553k47659j51213p2575
$$ 7142565 7514515 7569771 7508254 7390646 6990270 6448067 6004514 5756855 5605642 5533067
22161E533067j42028R9855J41277L3268O5692R1335j52879k17967j63657r6894
$$ 5533067 5391039 5490894 5632171 5665439 5731131 5822466 5669587 5451620 5287963 5191069
22151E191069k53133k47597j79494k71332k12085j12094o9230k32624j09832J12383
$$ 5191069 4937936 4690339 4510845 4239513 4027428 3915334 3846104 3613480 3503648 3616031
22141C616031J6979q0322j05533m0434q5930j11134j21018p6113K6635j3046N1804
$$ 3616031 3633010 3552688 3447155 3406721 3320791 3209657 3088639 3012526 3039161 3026115 3077919
22130C077919n757j75623m7309j16473j1660q2355r7036k5202j07466j8456N8527
$$ 3077919 3072162 2896539 2849230 2732757 2721097 2638742 2541706 2516504 2409038 2390582 2449109
22119B449109Q0386p7782o8055p4999J5594M5603Q4959j65802o1584m7645j06972
$$ 2449109 2529495 2451713 2383658 2308659 2324253 2369856 2454815 2289013 2227429 2179784 2072812
22108B072812j44012m4824N4710o3013k6117j41160n0891P4580L2582J9687o6808
$$ 2072812 1928800 1883976 1938686 1875673 1849556 1708396 1657505 1732085 1764667 1784354 1717546
22097A717546o8094n1357l5874p282L7273m0870j05126l7736J6916j2366R5861
$$ 1717546 1649452 1598095 1562221 1554939 1592212 1551342 1446216 1408480 1425396 1413030 1508891
22086A508891P3976j58286m9085p1875q3614Q4414P6095n669m8420k965p0654
$$ 1508891 1582867 1424581 1375496 1303621 1220007 1304421 1380516 1374847 1326427 1323462 1252808
22075A252808M8057N918j09123l941L7671j3147r4299j73848n7131O0815O1543
$$ 1252808 1300865 1306783 1197660 1193719 1231390 1218243 1123944 950096 892965 953780 1015323
22064A015323n3618L0116K5676N9444J40362J1936j07542l7067L563p4429j1163
$$ 1015323 961705 991821 1017497 1076941 1217303 1229239 1121697 1084630 1088193 1013764 1002601
22053A002601n0302k5456p3774m4863P7213L0468L5715p2819N951j7419j0739
$$ 1002601 952299 926843 853069 808206 885419 915887 951602 878783 884734 867315 856576
22042H56576r568q1711K1093m0934j08136N7650L3597p9785n0912L0458j16719
$$ 856576 847008 765297 786390 745456 637320 694970 728567 648782 597870 628328 511609
22031E11609k6300p484O3966J59764O2670j24021o1638J0413J5000j02150L90
$$ 511609 485309 477825 541791 701555 764225 640204 578566 588979 603979 501829 502219
22020E02219J46466o143j0263K2697p7192J16774r3139m2573o6676J2157P040
$$ 502219 648685 642542 632279 654976 577784 694558 601419 558846 492170 504327 511367
22009E11367Q7125K4878L3931j2393K2395M1264P3571j20342j56763J8596m8287
$$ 511367 598492 623370 657301 644908 667303 708567 782138 661796 505033 523629 475342
21998D75342j38370P126K7337o4443k4393M5128M816m1071K8707P2334L1034K9060
$$ 475342 336972 344098 371435 306992 282599 327727 332543 291472 320179 392513 423547 452607
21986D52607p4762m5730k8914k4460J5819K8608j0357k1149l0962o5926O201J20858
$$ 452607 377845 332115 303201 278741 294560 323168 312811 291662 260700 194774 200975 321833
21974C21833J5066L8108Q9074o2392j44857K3693K4778l4552L2673j13766j485
$$ 321833 336899 375007 464081 401689 256832 280525 305303 270751 303424 189658 188173
21963A88173Q0545P0437j06086P0482J5560j5204l0171Q8964K4611J9215p7463
$$ 188173 268718 339155 233069 303551 319111 303907 273736 362700 387311 406526 329063
21952C29063j06799j45061o0295J2475J7918l3751L2967J06518M5512j9880O7008
$$ 329063 222264 77203 16908 29383 47301 13550 46517 153035 198547 178667 245675
21941B45675M0001k12931n5794K7410O868M5205J8713L9962O4374n5486L8051
$$ 245675 285676 72745 16951 44361 51229 96434 115147 155109 219483 163997 202048
21930B02048J9228j45670K0085R4125J29662J7949j06115n3270o4176J0976Q8435
$$ 202048 221276 75606 95691 189816 319478 337427 231312 178042 113866 124842 213277
21919B13277K1923q450K2578q572K4131J51945k532j45454n6238k5207k3282J72942
$$ 213277 235200 226750 249328 240756 264887 416832 414300 268846 212608 187401 164119 337061
21907C37061j5781j39737n7299q4545q0016r3947P2211P7860J19062O2280m3278
$$ 337061 321280 181543 124244 39699 -40317 -134264 -62053 15807 134869 197149 153871
21896A53871j903J28091j09960j17510q2941K1382m0921j1261J0571j5837J322
$$ 153871 151968 280059 170099 52589 -30352 -8970 -49891 -61152 -50581 -66418 -65096
21885f5096R652K4364L3537k7944j1944M9030K7394O7522n7018j74297O5756J90559
$$ -65096 -55444 -31080 2457 -25487 -37431 11599 38993 106515 49497 -124800 -59044 131515
21873A31515j2672l617j30480o8267l1769J27195J63301o3039k0849o4914q6368
$$ 131515 118843 115226 -15254 -83521 -115290 11905 175206 112167 91318 26404 -59964
21862e9964N7438J5932K6683J13282J56921j49791k10458K4824Q501K2073O0214
$$ -59964 -2526 13406 40089 153371 310292 160501 -49957 -25133 -16632 5441 65655
21851F5655O337K2149J5351m9533n4645m0609O4618P8195J0213R8943j1352j06869
$$ 65655 71992 94141 109492 59959 5314 -35295 29323 107518 117731 216674 205322 98453
21839I8453J17408k3751m0676q0969J1554Q0115q3702j42104M1463M3022J28897
$$ 98453 215861 192110 151434 70465 82019 162134 78432 -63672 -22209 20813 149710
21828A49710J53292R6632M6803q697p043m1237j2955O706L515P7623j8496j5209
$$ 149710 303002 399634 446437 437740 430697 389460 376505 383211 386726 464349 445853 430644
21816D30644r3375n4488r6211k6430r455l0537j925m0584m6585l9204Q3961m558
$$ 430644 337269 282781 186570 160140 150685 120148 118223 77639 31054 -8150 75811 71253
21804G1253n3365J00654l3683j11913j8125L2909J12937P6858j20819Q7314R8702
$$ 71253 17888 118542 84859 -27054 -45179 -12270 100667 177525 56706 144020 242722
21793B42722l5266p5134m7161L7979N621L3987m4544o0353j68705O6871M7970
$$ 242722 207456 132322 85161 123140 128761 162748 118204 57851 -110854 -43983 3987
21782C987j5039k3212R5328j8268M3329O0313o4971j04175O3958M0494J79k1414
$$ 3987 -11052 -34264 61064 42796 86125 146438 81467 -22708 41250 81744 81923 60509
21770F0509M172R742L7689j23090o6738M5156N1624J24778k9917M4410m1612j27829
$$ 60509 64681 74423 112112 -10978 -77716 -32560 19064 143842 113925 158335 116723 -11106
21758a1106P94o1503o0493J01665q433j01674n5976K7336J54996l15l5363j10885
$$ -11106 -10312 -71815 -132308 -30643 -39076 -140750 -196726 -169390 -14394 -14709 -50072 -160957
21746a60957J8600K9236Q9461L3721J8711l440q9865J2341K2964l0764J25083
$$ -160957 -142357 -113121 -23660 10061 28772 25332 -64533 -52192 -29228 -59992 65091
21735F5091P8783K9456n5865j45528o9950O0961K5615k3365L082p5711m8698K2432
$$ 65091 143874 173330 117465 -28063 -98013 -37052 -11437 -34802 -31720 -107431 -156129 -133697
21723a33697K8232N2475L3163P064j18082L4160j1324r7045Q8256Q5329k9153
$$ -133697 -105465 -52990 -19827 -12763 -130845 -96685 -108009 -205054 -116798 -31469 -60622
21712f0622L0690m0130r348n0916L1976M7922O7730Q8559p1410j35981L7216J5886
$$ -60622 -29932 -70062 -79410 -130326 -98350 -50428 17302 105861 34451 -101530 -64314 -48428
21700d8428l7992M8265O4565m6175m8281l4712N4315O5571K5230L656P2660L1031
$$ -48428 -86420 -38155 26410 -19765 -68046 -102758 -48443 17128 42358 46014 118674 149705
21688A49705n7705J065J5157p284L583N6952n4587p0642j54208O5632P9358J06632
$$ 149705 92000 93065 108222 100938 104521 161473 106886 36244 -117964 -52332 27026 133658
21676A33658P1127j19303r2915L1240K492J12283L50990L48897L04251K29020
$$ 133658 204785 85482 -7433 23807 26299 138582 489572 838469 1142720 1371740
21666A371740J78701N8777j0686o7102k41458l91286k77161j42316j7959m4963
$$ 1371740 1550441 1609218 1598532 1531430 1289972 898686 621525 479209 461250 416287
21656D16287p9500l3542p5338M0004M2188q6127r3038O2413J711M6727o0791m3597
$$ 416287 336787 303245 227907 267911 310099 223972 130934 193347 195058 241785 180994 137397
21644A37397M081j17161L9022R6690m1881m8781n3029K6744L647p5001l1293j1429
$$ 137397 141478 24317 63339 160029 118148 69367 16338 43082 46729 -28272 -59565 -70994
21632g0994P2625L9033L4850m4981n3015Q7960M717k6891L5401n647o6314R901
$$ -70994 1631 40664 75514 30533 -22482 65478 70195 43304 78705 73058 6744 16645
21620A6645J63346J6343K906l3727m008N3070k577l1661r6049K5404k3914K8927
$$ 16645 179991 196334 199240 165513 161505 214575 211998 180337 84288 109692 85778 114705
21608A14705O5752j6718M4722n4382o9177p695j65626K3225K6801l8481R1660
$$ 114705 180457 163739 208461 154079 84902 77207 -88419 -65194 -38393 -76874 14786
21597A4786J28864r9146q7865p877J43995K8008j2568o5941l1524o2524n466M7995
$$ 14786 143650 44504 -43361 -51238 92757 120765 108197 42256 10732 -51792 -57258 -9263
21585i263J5669Q4959j900q931O8997p954K7601N857r951k9027j60752p7028M5745
$$ -9263 6406 91365 89465 80534 149531 141577 169178 175035 165084 136057 -24695 -101723 -55978
21572e5978J10201P1402o9848j7912N2188K7334p9348L1490j9028M9057p896j35455
$$ -55978 54223 125625 55777 37865 90053 117387 38039 69529 50501 99558 91662 -43793
21560d3793R8794J14994j04561j57705j76412q9887N9122J28493K13644Q0387
$$ -43793 55001 169995 65434 -92271 -268683 -358570 -299448 -170955 42689 123076
21550A23076j11441o6029J6268J59352L8042M577j02339o7046l1659P0073J00542
$$ 123076 11635 -54394 -38126 121226 159268 163845 61506 -5540 -37199 32874 133416
21539A33416N3185J4462j52107K1567J02021R057q072O3089l7969j18338o825
$$ 133416 186601 201063 48956 70523 172544 181601 173529 236618 198649 80311 73486
21528G3486o5359j5201J4490k2164p7974J74829M8691l5672M1046j5476M2554
$$ 73486 8127 -7074 7416 -14748 -92722 82107 130798 95126 136172 120696 163250
21517A63250K1197j32863m6977l406j14188K8347p0534M0949J14562Q1949o1927
$$ 163250 184447 51584 4607 1201 -112987 -84640 -155174 -114225 337 82286 20359
21506B0359J16880n9753j03971j45241Q3490P100k2961j8564m0130J6211N8740
$$ 20359 137239 77486 -26485 -171726 -88236 -81136 -104097 -122661 -162791 -146580 -87840
21495h7840N9372O6625k1055p9540j5555J10940l4604j3617O3859k8401n6325
$$ -87840 -28468 38157 17102 -62438 -77993 32947 -1657 -15274 48585 20184 -36141
21484c6141o95J0846L2493n6776n3498l4923R3986J03485m2949k4121J8149K1299
$$ -36141 -36836 -25990 6503 -50273 -103771 -138694 -44708 58777 15828 -8293 9856 31155
21472C1155R42P0304J12465j16237j33905q6466R7068K0047r0573q9890J03086
$$ 31155 32097 102401 214866 98629 -35276 -121742 -24674 -4627 -95200 -185090 -82004
21461h2004j8420m9684P1280n611k376P1563N1291m3755N1840Q5698o506o0795
$$ -82004 -100424 -150108 -78828 -84439 -86815 -15252 36039 -7716 44124 129822 123316 62521
21449F2521l9071j43701m2970j24011o0768J5417J64204K22261J7786n4285L529
$$ 62521 23450 -120251 -163221 -287232 -348000 -332583 -168379 53882 71668 17383 20912
21438B0912q2421o3407O8706j9865P0944k7711o6552k2293L7798N640k5429k3876
$$ 20912 -61509 -124916 -56210 -76075 -5131 -32842 -99394 -121687 -83889 -78249 -103678 -127554
21426a27554j23590M2756J29857M0425J6228j271j37295m0600M6651k3452N6716
$$ -127554 -251144 -208388 -78531 -38106 -21878 -23149 -160444 -201044 -154393 -177845 -121129
21415a21129J25701O6815N7748j2357l9684n4394p459m8139K7964k892n9387M7432
$$ -121129 4572 71387 129135 116778 77094 22700 15241 -32898 -4934 -7826 -67213 -19781
21403a9781R0973L4163J5298m1239P744J982l926m7392j27136K7043L9514P6002
$$ -19781 71192 105355 120653 79414 87158 89140 85214 37822 -89314 -62271 -22757 53245
21391E3245r7390l0380K5015O6959M9325J8996j36822l368K9364N3701p5639p0553
$$ 53245 -44145 -74525 -49510 17449 66774 85770 -51052 -54420 -25056 28645 -46994 -117547
21379a17547K0981L5715R8250J7830q4141j47692o5681N4018J15999R1956R2046
$$ -117547 -96566 -60851 37399 55229 -28912 -176604 -242285 -188267 -72268 19688 111734
21368A11734n5646K5256L4214L3845j18685j72159Q3589q481k3659M35n1591r215
$$ 111734 56088 81344 115558 149403 30718 -141441 -57852 -66333 -89992 -89557 -141148 -150363
21356a50363J09661l6560O1870q9124K4803J41527m242o3966L8779K2712p1260
$$ -150363 -40702 -77262 -15392 -104516 -79713 61814 57572 -6394 32385 55097 -16163
21345a6163k6723O2457N9094k6262n2006n4777n7866K5688K0398M2345J55188
$$ -16163 -42886 19571 78665 52403 397 -54380 -112246 -86558 -66160 -23815 131373
21334A31373q4969o0972m9462J1427j00708J9744J678r6398k9989J05335J27170
$$ 131373 46404 -14568 -64030 -52603 -153311 -133567 -131889 -228287 -258276 -152941 -25771
21323b5771q540j03685m2599K3639K5969k4491k2815Q766K7472L1260J3023R1934
$$ -25771 -34311 -137996 -180595 -156956 -130987 -155478 -178293 -169527 -142055 -110795 -97772 -5838
21311e838O2897j44988j21830J0573p9297J36347J16191O8464m5395j03986J16712
$$ -5838 57059 -87929 -209759 -199186 -278483 -142136 -25945 42519 -2876 -106862 9850
21300I850J07349O070o5446n3244k5486m9436K6880R580L2118J136l0981q3024
$$ 9850 117199 123269 57823 4579 -20907 -70343 -43463 -33883 -1765 -629 -31610 -114634
21288a14634q5446n0064P0698K4876m4794P989o9661J9412J43336J51739n463
$$ -114634 -200080 -250144 -179446 -154570 -199364 -191375 -261036 -241624 -98288 53451 47988
21277D7988N9628k8368n487J2327K7053j17611p2612J18498J74235m7900j26959
$$ 47988 107616 79248 73761 86088 113141 -4470 -77082 41416 215651 167751 40792
21266D0792q8267j02642L3337J03595J33840K3341j5035K1270n3158p9966J10648
$$ 40792 -47475 -150117 -116780 -13185 120655 143996 128961 150231 97073 17107 127755
21255A27755p5222q1179M3228L6833j29449j5152P7888k0695j44653p5408M3439
$$ 127755 52533 -28646 14582 51415 -78034 -93186 -15298 -35993 -180646 -256054 -212615
21244b12615J60719L1585r6230q004R826P5869N6574P0736J27915m9586o5904
$$ -212615 -51896 -20311 -116541 -124545 -114719 -38850 17724 88460 216375 166789 100885
21233A00885m4212j01708j6377k8320J9585R5941o0713j28300M7005N1825L5850
$$ 100885 56673 -45035 -61412 -89732 -70147 25794 -34919 -163219 -116214 -64389 -28539
21222b8539L5494q6297p1181K3234L7890J02882L0832R7569P7102j07957j8039
$$ -28539 6955 -79342 -150523 -127289 -89399 13483 44315 141884 218986 111029 92990
21211I2990o9218O494p5120Q2536j22093p0811K5087r814P4311q644o8961O5110
$$ 92990 23772 30266 -44854 37682 -84411 -155222 -130135 -139949 -65638 -74282 -143243 -78133
21199g8133J20876n2860n9161n1231J21220l807K4737O0016p4714j11034n5810
$$ -78133 42743 -10117 -69278 -120509 711 -3096 21641 81657 6943 -104091 -159901
21188a59901R627m6807K8595J2538J54110K8933r3135j1894n0973j852q418Q6442
$$ -159901 -150274 -197081 -168486 -155948 -1838 27095 -66040 -77934 -128907 -130759 -139177 -52735
21176e2735J09666R768r4960J4582K5349O1427M4682J7523M3726n1500p6417l4804
$$ -52735 56931 66699 -28261 -13679 11670 73097 117779 135302 179028 127528 51111 16307
21164A6307J7817L0687m9185o4453k2196O9914K1449L1455K0978n0405o0554R847
$$ 16307 34124 64811 15626 -48827 -71023 -1109 20340 51795 72773 22368 -38186 -28339
21152b8339n1913m9581P0361l170k2910m9242l411K4564N4783l3759m175P0186
$$ -28339 -80252 -129833 -59472 -62642 -85552 -134794 -138205 -113641 -58858 -92617 -96792 -26606
21140b6606J15799j5676j4496J08850r3230k21629P710k820l0705L3697J09086
$$ -26606 89193 73517 59021 167871 74641 -146988 -139278 -142098 -172803 -139106 -30020
21129c0020L576J3128O1401q5854n0730J9017m320K2644J60186J19285R638l2050
$$ -30020 -26444 -13316 48085 -37769 -88499 -69482 -73802 -51158 109028 228313 237951 205901
21117B05901r1846k2901o0714j8367n0136l587l1867P2366P9548Q5129k5514p3016
$$ 205901 114055 91154 30440 12073 -38063 -41650 -73517 -1151 78397 163526 138012 64996
21105F4996M7988o1623N974O825J522L7833L6533j9399n6452q3605r2816j19092
$$ 64996 112984 51361 57335 64160 65682 103515 140048 120649 64197 -19408 -112224 -231316
21093b31316n5892O6988J66466Q6741M3533k0790J9627M6729p9820L5030m7812
$$ -231316 -287208 -220220 -53754 32987 76520 55730 75357 122086 42266 77296 29484
21082B9484n6099Q9482r6216m0411O1080n3726k2175O1318o3645q937R249k9764
$$ 29484 -26615 62867 -33349 -73760 -12680 -66406 -88581 -27263 -90908 -99845 -90596 -120360
21070a20360J717R5255M0926r9178k9443K2383p0890Q8606J33499p9351j53683
$$ -120360 -118643 -23388 17538 -81640 -111083 -88700 -159590 -70984 62515 -16836 -170519
21059a70519k9818o845L4606K1412M6714P529R8887k1182J1530j23819m9690n153
$$ -170519 -200337 -207182 -172576 -151164 -104450 -96921 1966 -19216 -7686 -131505 -181195 -186348
21047a86348O105j06708j5243m9607N5571J29512k063J28862P6154k4481K802
$$ -186348 -180243 -286951 -302194 -351801 -296230 -166718 -168781 -39919 36235 11754 14556
21036A4556k6360P021R2318n8337p815K9145K0102n6517q6357q3069j5769k0538
$$ 14556 -11804 -4783 87535 29198 21383 50528 70630 14113 -72244 -155313 -171082 -191620
21024a91620P8374J43263R7250L6897j49464j32972J28977J3454l7896n9443k1123
$$ -191620 -113246 30017 127267 164164 14700 -118272 10705 24159 -13737 -73180 -94303
21013i4303n0911M5537L7644J24895k3050Q316Q9748j44407M922k6107l7129P9852
$$ -94303 -145214 -99677 -62033 62862 39812 48128 137876 -6531 -1609 -27716 -64845 15007
21001A5007L3060J9740r0934n453J095r4741J13608J68007p3287j10735j4157
$$ 15007 48067 67807 -23127 -28580 -27485 -122226 -8618 159389 86102 -24633 -38790
20990c8790j00918J34239J16744J5493o8315n4251Q891j11606q0969J30271J44202
$$ -38790 -139708 -5469 111275 126768 58453 4202 13093 -98513 -179482 -49211 94991
20979I4991k3474o7028j7570j16551j26158n2819J29036R8158m9333m4695j15380
$$ 94991 71517 4489 -13081 -129632 -255790 -308609 -179573 -81415 -130748 -175443 -290823
20968b90823R2861J36356j3241j43127j06742k533J20441J51298m8424M6341m4764
$$ -290823 -197962 -61606 -74847 -217974 -324716 -327249 -206808 -55510 -103934 -57593 -102357
20957a02357q4961r6662P3746R9922m8124L3535j09607l954p763O9151J05231
$$ -102357 -187318 -283980 -210234 -110312 -158436 -124901 -234508 -238462 -246225 -177074 -71843
20946g1843j7644J9600M0359L0530l3240j3393l7412L7417J5016j0618J00198
$$ -71843 -89487 -69887 -29528 1002 -32238 -45631 -83043 -45626 -30610 -41228 58970
20935E8970J03634m0524j58560m6843r2750J10102O9694o7613N050p98m5793q5948
$$ 58970 162604 122080 -36480 -83323 -176073 -65971 3723 -63890 -58840 -59638 -105431 -191379
20923a91379P3558M2621J20403L111j6469k5569j84747q6984K5724L7703Q2737
$$ -191379 -117821 -75200 45203 48314 31845 6276 -178471 -265455 -239731 -202028 -119291
20912a19291Q7593j41153j42960J9268M6958J10981L7742O829k2562q3021J6038
$$ -119291 -31698 -172851 -315811 -296543 -249585 -138604 -100862 -94033 -116595 -199616 -183578
20901a83578k8751r0456k5508P5441K4828P0664J24577j08672j13951L0696J91935
$$ -183578 -212329 -302785 -328293 -252852 -228024 -157360 -32783 -141455 -255406 -224710 -32775
20890c2775P4982q3567j39556m6162J12831j4304L3542J1216Q1702L0546R3976
$$ -32775 42207 -41360 -180916 -227078 -114247 -128551 -95009 -83793 -2091 28455 122431
20879A22431n4671j82478n1202j18051K4433J18956K12150M6669n7642p386R404
$$ 122431 67760 -114718 -165920 -283971 -259538 -140582 71568 118237 60595 53209 62613
20868F2613k5743n1214j2242j0759q0165l7549P6074J0034r2567r5804L0003O6519
$$ 62613 36870 -14344 -26586 -37345 -117510 -155059 -78985 -68951 -161518 -257322 -227319 -160800
20856a60800J00986L2720N9211l1268M2762O5599k1476j34079m6765Q0070j2436
$$ -160800 -59814 -27094 32117 849 43611 109210 87734 -46345 -93110 -13040 -25476
20845b5476L9411j02824q0532P0419J35517l255k1501J2794n9354o1384m3514
$$ -25476 13935 -88889 -169421 -99002 36515 33260 11759 24553 -34801 -96185 -139699
20834a39699Q739J15304q5064O371O3221L8270m4146q0064k8195N381O530o330
$$ -139699 -130960 -15656 -100720 -94349 -31128 7142 -37004 -117068 -145263 -139882 -133352 -139682
20822a39682K7051P0455j5199n8172p2339R9233K6929j72L4298J57836p9096j07143
$$ -139682 -112631 -42176 -57375 -115547 -187886 -88653 -61724 -61896 -27598 130238 51142 -56001
20810e6001M7710J21223L5383m4004m4677k740K2696Q278m8747L1107p7983M2733
$$ -56001 -8291 112932 148315 104311 59634 56894 79590 87868 39121 70228 -7755 34978
20798C4978Q5117O7445n9759n8440o823M01Q218j6114n389O6034j30395j0633
$$ 34978 120095 187540 127781 69341 62518 62919 71137 55023 49634 115668 -14727 -25360
20786b5360J7118O2545N6607o8302m3168O5077O1124J66000M4581j39341p3388
$$ -25360 -8242 54303 110910 42608 -560 64517 125641 291641 336222 196881 123493
20775A23493k0630q2277j30775L9986J16451p1656L2897Q4597j26905n6366q250
$$ 123493 102863 20586 -110189 -70203 46248 -25408 7489 92086 -34819 -91185 -99435
20764i9435N9629N46o0363J6623j9491j8843p134Q4945j4111J8792L8174R0418
$$ -99435 -39806 -39260 -99623 -83000 -102491 -121334 -128468 -43523 -57634 -38842 -668 89750
20752H9750O2672l136l1723j50272l4131M0491o5127K194K5305j48498j8231O804
$$ 89750 152422 149286 117563 -32709 -66840 -26349 -91476 -89282 -63977 -212475 -230706 -223902
20740b23902N2636P8679J08528P3972N62O7681q9852m9053o279P442k7923m6137
$$ -223902 -171266 -92587 15941 89913 90475 158156 68304 19251 12972 20414 -7509 -53646
20728e3646M1015k1828l0099J3702k7333N8862J2393O687o069n0622n0117M9227
$$ -53646 -12631 -34459 -64558 -50856 -78189 -19327 -6934 -247 -6316 -56938 -107055 -57828
20716e7828O8750R268k20j10979m2247R7850O1879J07810k307j59872k1960J7789
$$ -57828 10922 20190 19970 -91009 -133256 -35406 26473 134283 131976 -27896 -49856 -32067
20704c2067p0065o2256Q5665P3387Q102q0066p0009p2410J29842K8704r0360o1964
$$ -32067 -102132 -164388 -78723 -5336 2766 -77300 -147309 -219719 -89877 -61173 -151533 -213497
20692b13497O1742M8435R5062O6877l1651l5976P5238K8010n6462j40742L1826
$$ -213497 -151755 -103320 -8258 58619 26968 -9008 66230 94240 37778 -102964 -71138
20681g1138k6038N9635J84928J45634K493p5261j91674M47j19503J6299J60366
$$ -71138 -97176 -37541 147387 293021 295514 220253 28579 29026 -90477 -74178 86188
20670H6188M0237o7319o073k825m0318J0214j10663M6175J00169K1925j13049
$$ 86188 126425 59106 53033 50208 9890 20104 -90559 -44384 55785 77710 -35339
20659c5339K4570R5847L2955K0305j9860j40861M9541J37198j3066m9308M9534
$$ -35339 -10769 85078 118033 138338 118478 -22383 27158 164356 151290 101982 151516
20648A51516j9411J3923q341o4948l9703p5266k8113n6290n8863m1002o259O9683
$$ 151516 132105 146028 137687 72739 33036 -42230 -70343 -126633 -185496 -226498 -232757 -163074
20636a63074J05662R331Q17K6436P3679n4655o1530J9271l7747m3258O0421o2091
$$ -163074 -57412 -48081 -47264 -20828 52851 -1804 -63334 -44063 -81810 -125068 -64647 -126738
20624a26738l6640M7006J30324L0144p5366j51901N4435O7645M7822O7970J53853
$$ -126738 -163378 -116372 13952 44096 -31270 -183171 -128736 -61091 -13269 54701 208554
20613B08554j59038o5439O6859j7107L8170k943r6247L9814l5548k1329r5797
$$ 208554 49516 -15923 50936 33829 71999 69056 -27191 12623 -22925 -44254 -140051
20602a40051K6795k1709l1179m5545p3664K9642l508L4551L2029N6758J05732
$$ -140051 -113256 -134965 -166144 -211689 -285353 -255711 -259219 -224668 -192639 -135881 -30149
20591c0149L0631k1390P2142k1649N065q8533m2140j2325J26728J34490N7729
$$ -30149 482 -20908 51234 29585 34650 -53883 -96023 -108348 18380 152870 210599
20580B10599j56432n1904K3880j1706k8908r0289j44j595J2487l2417k5241l8651
$$ 210599 54167 2263 26143 14437 -14471 -104760 -104904 -106499 -94012 -126429 -151670 -190321
20568a90321P2556J22310k5957O4277k3851k8756n2100q8490m0649k8681J20561
$$ -190321 -117765 4545 -21412 42865 19014 -9742 -61842 -150332 -190981 -219662 -99101
20557i9101J23776Q711R7517Q390o1123j4812l2722j7163k7063m5251o2878l6481
$$ -99101 24675 33386 130903 139293 78170 63358 30636 13473 -13590 -58841 -121719 -158200
20545a58200J4273k5569l5443P5746n9614Q09J23981K6709l4829J31505N6721
$$ -158200 -143927 -169496 -204939 -129193 -188807 -187998 -64017 -37308 -72137 59368 116089
20534A16089r448q2393l7384q625j21994m9308j3861L0454L4451M7919J02575
$$ 116089 106641 24248 -13136 -21761 -143755 -193063 -206924 -176470 -142019 -94100 8475
20523H475K0844j10820k12827j8787P0352J27993Q6738k0383n9569p655o1387
$$ 8475 29319 -81501 -294328 -313115 -242763 -114770 -28032 -48415 -107984 -115639 -177026
20512a77026m2676R0247O8012n537L8666o2911j10241q555m388J53897L9931k3639
$$ -177026 -219702 -129455 -61443 -66980 -28314 -91225 -201466 -210021 -214409 -60512 -20581 -44220
20500d4220L1412K8877j0267l7579N8122j0919k7308p0846j5444J0680J6684P3220
$$ -44220 -12808 16069 5802 -31777 26345 15426 -11882 -82728 -98172 -87492 -70808 2412
20488B412J5819P7254l5108j9732n8579r1559l2262m166N11j23799N8357J35211
$$ 2412 18231 95485 60377 40645 -17934 -109493 -141755 -145921 -145410 -269209 -210852 -75641
20476g5641j8311q1046k9570j29934p6213P5787K0434R312N4295j4151o221l7114
$$ -75641 -93952 -174998 -204568 -334502 -410715 -334928 -314494 -305182 -250887 -265038 -271259 -308373
20464c08373k0860M0277o0721r659P2361J65091J39924K2657j911k9292j7606
$$ -308373 -329233 -288956 -349677 -359336 -286975 -121884 18040 40697 38786 9494 -8112
20453h112o3130o5408J25448q2205j09486O4045P7388p1022R584L4391K7708O2949
$$ -8112 -71242 -136650 -11202 -93407 -202893 -138848 -61460 -132482 -122898 -88507 -60799 2150
20441B150q460j30259k5538k3778J4992K183K1339J5812M0981Q930P1909L9531
$$ 2150 -6310 -136569 -162107 -185885 -170893 -168710 -147371 -131559 -90578 -81648 -9739 29792
20429B9792O3572M5392o1313m2483N1625O8585O7930j38262o8866j1148l7431
$$ 29792 93364 138756 77443 34960 86585 155170 223100 84838 15972 4824 -32607
20418c2607j092j53826j24260L5757J2118O8253R0181J20420r5425k86870N4048
$$ -32607 -33699 -187525 -311785 -276028 -263910 -195657 -105476 14944 -80481 -367351 -313303
20407c13303J30337P4611m0413j8872L3727n1732j5584J51338l358M1172n840
$$ -313303 -182966 -108355 -148768 -167640 -133913 -185645 -201229 -49891 -53249 -12077 -17917
20396a7917K8551O7890j04723k38936n931J01975k2742J23908J44592N2762q3931
$$ -17917 10634 78524 -26199 -265135 -271066 -169091 -191833 -67925 76667 129429 45498
20385D5498j20510J7630O2831o4500O0822l6286p6548J8614j01510n6876K4833
$$ 45498 -75012 -57382 5449 -59051 1771 -34515 -111063 -92449 -193959 -250835 -226002
20374b26002P7633j0016j08509k6306O4443J03820l4525k7700K3048J7741o558
$$ -226002 -148369 -158385 -266894 -293200 -228757 -124937 -159462 -187162 -164114 -146373 -152931
20363a52931Q3616P475r6982j0781j1713L6633P640l3708K5674J11002J58561
$$ -152931 -69315 -61840 -158822 -169603 -181316 -144683 -137043 -170751 -145077 -34075 124486
20352A24486r2236L0093R9209j7353k8736j62190n3354o4665O3027k9512J03913
$$ 124486 32250 62343 161552 144199 115463 -46727 -100081 -164746 -101719 -131231 -27318
20341b7318L5189q6299p5276P9427P164j5115L5394N2300N9446K9616j01771k967
$$ -27318 7871 -78428 -153704 -74277 -67113 -82228 -46834 5466 64912 94528 -7243 -10210
20329a0210p3551r4463J19158K7932n1814j38945N4944J05243k2039R6367R5906
$$ -10210 -83761 -178224 -59066 -31134 -82948 -221893 -166949 -61706 -83745 12622 108528
20318A08528m4529q6959M627N0144M2454o0168M6693Q2332j50352q2567o789M8330
$$ 108528 63999 -22960 -18333 31811 74265 14097 60790 143122 -7230 -89797 -96586 -48256
20306d8256J7955m0296m2833K0480P4661J29648P5069n8738M2366m5175l9630
$$ -48256 -30301 -70597 -113430 -92950 -18289 111359 186428 127690 170056 124881 85251
20295H5251k6877l8274M6869P3721r2146n4158o6708n6976N962J2740N2479J8072
$$ 85251 58374 20100 66969 140690 48544 -5614 -72322 -129298 -123336 -110596 -58117 -40045
20283d0045n109K171N3320R7763Q0657n3402q1172n539r1773j58086l0977R1983
$$ -40045 -45154 -42983 10337 108100 188757 135355 54183 48644 -43129 -201215 -232192 -140209
20271a40209K1823N9801L9020j8659J14584K03425M295j43533o6459n1365j8552
$$ -140209 -118386 -58585 -19565 -38224 76360 279785 284080 140547 74088 22723 4171
20260D171R5976O1340q3979J6631K9825j13053J1144J5430K5320p7477q5055l1050
$$ 4171 100147 161487 77508 94139 123964 10911 22055 37485 62805 -14672 -99727 -130777
20248a30777M2764J10087O8177p1456k0708K3234O2766L9758j04474p9970j35388
$$ -130777 -88013 22074 90251 18795 -1913 21321 84087 123845 19371 -60599 -195987
20237a95987N1522n0731l1953N2904K00425J44144K2954j10465j63218l5081r061
$$ -195987 -144465 -195196 -227149 -174245 26180 170324 193278 82813 -80405 -115486 -124547
20226a24547L804P268J4553J02457j7082m4672j7560M0887M0995m7907m7642n6696
$$ -124547 -120743 -113475 -98922 3535 -13547 -58219 -75779 -34892 6103 -41804 -89446 -146142
20214a46142j22372p1769J21420L0556n3526p5703J13626P5176n6924k2993r0137
$$ -146142 -268514 -340283 -218863 -188307 -241833 -317536 -203910 -128734 -185658 -208651 -298788
20203b98788j2968J04055Q3598R6708k8113j4812o554O9866m8418r167K2309J6189
$$ -298788 -311756 -207701 -124103 -27395 -55508 -70320 -76874 -7008 -55426 -64593 -42284 -26095
20191b6095p7171M4563K287L0766L9939j9286p0397J6447J60q9105l9617J2242
$$ -26095 -103266 -58703 -56416 -25650 14289 -4997 -75394 -58947 -58787 -147892 -187509 -175267
20179a75267l9125n2660Q775N5645J9230m9595j3529L4270R1123N7194P708k6642
$$ -175267 -214392 -267052 -258277 -202632 -183402 -232997 -246526 -212256 -121133 -63939 -56231 -82873
20167h2873L5163O4404O8931k4554o6670j95078k5479L5830J7523K9801P9930
$$ -82873 -47710 16694 85625 61071 -5599 -200677 -226156 -190326 -172803 -143002 -63072
20156f3072L3543M8978J4398k3701k2991R1725Q7336K3496j55593q3637K693m4730
$$ -63072 -29529 19449 33847 10146 -12845 78880 166216 189712 34119 -49518 -46825 -91555
20144i1555l0948J31712K2617j35952j50963k930Q9342K213j4984P1295j9967
$$ -91555 -122503 9209 31826 -104126 -255089 -258019 -168677 -166464 -181448 -110153 -130120
20133a30120n5337N4590M9119J01615P8246l3284O8616o3368m3994j23401r5826
$$ -130120 -185457 -130867 -81748 19867 98113 64829 133445 70077 26083 -97318 -193144
20122a93144k3093R1522M0360o5964n8252N7868j4397N9226O0583M39L1644J80917
$$ -193144 -216237 -124715 -84355 -150319 -208571 -150703 -165100 -105874 -45291 -44852 -13208 167709
20110A67709r1949k6841r4491P3404Q3048n8896o2519j35721k4584J12159J29238
$$ 167709 75760 48919 -45572 27832 110880 51984 -10535 -146256 -170840 -58681 70557
20099G0557J18920j00822k24767m5272J25146O965l351O9814L9492p070j9548
$$ 70557 189477 88655 -136112 -181384 -56238 -49273 -52624 17190 56682 49612 30064
20088C0064Q0096O3009n0869r8271o2669j14466j892q716K2233L6604J10153J67362
$$ 30064 110160 173169 122300 24029 -38640 -153106 -154998 -163714 -141481 -104877 5276 172638
20076A72638j3811p7632p8866j81106L1281J55997Q8579o7065r2290M576R725
$$ 172638 158827 81195 2329 -178777 -147496 8501 97080 30015 -62275 -57699 -47974
20065d7974J15896p818p6912n7528J9397K8991M3217l2781r8698j4863N5113J97922
$$ -47974 67922 60104 -16808 -74336 -54939 -25948 17269 -15512 -114210 -129073 -73960 123962
20053A23962J60669O9353q4821n0966j04951q0067j3725j0819O0094k1171j70912
$$ 123962 284631 353984 269163 218197 113246 33179 19454 8635 68729 47558 -123354
20042a23354j9175J10907L5809N775K8981j23421p0595q029J11593Q4325m5448
$$ -123354 -142529 -31622 4187 9962 38943 -84478 -155073 -163102 -51509 32816 -12632
20031a2632n1191o8944J991J11830R5197Q1497N401l5343r1433N669j28862o526
$$ -12632 -63823 -132767 -130776 -18946 76251 157748 163149 127806 36373 42042 -86820 -93346
20019i3346N2065o212P5616j6744j45813l4991J9226j9336O9908N3949J09926
$$ -93346 -41281 -47493 28123 11379 -134434 -169425 -150199 -169535 -99627 -45678 64248
20008F4248N3964r5049j67516o7122J5678M8497m2500L6136R5267N5558m6739
$$ 64248 118212 23163 -144353 -211475 -195797 -147300 -189800 -153664 -58397 -2839 -49578
19997d9578o773k5265l7804m10q7632o3009O7313J6711J26151j6344K267M9665
$$ -49578 -56351 -81616 -119420 -119830 -207462 -270471 -203158 -186447 -60296 -76640 -74373 -24708
19985b4708J7564o0591k0262K6354N6262j0291K0649M5574L3394q9117l2122j12487
$$ -24708 -7144 -67735 -87997 -61643 -5381 -15672 4977 50551 83945 -5172 -37294 -149781
19973a49781L3377K4038j11776j08180k829M1023P7994M0805J09331N1106L0182
$$ -149781 -116404 -92366 -204142 -312322 -315151 -274128 -196134 -155329 -45998 5108 35290
19962C5290r2177k8939j3134M2571r827r6645J04286J0458p8148J46580J37010
$$ 35290 -56887 -85826 -98960 -56389 -66216 -162861 -58575 -48117 -126265 20315 157325
19951A57325P5058n5019j61825J4019q4730K240M7436m3813P0767L9985p5455
$$ 157325 232383 177364 15539 29558 -55172 -52932 -5496 -49309 21458 61443 -14012
19940a4012J5049l2468m7719O3626J18762N995L6307r1745M3403O0139O628j52521
$$ -14012 1037 -31431 -79150 -15524 103238 109233 145540 53795 97198 157337 163965 11444
19928A1444o0398K7589l4918o0584j4531q930O4456L7216J8569m9588O5074J03719
$$ 11444 -48954 -21365 -56283 -116867 -131398 -140328 -75872 -38656 -20087 -69675 -4601 99118
19916I9118K073K8897R1384L7917r3140j23924j42822q6162M9538J192m2252O3307
$$ 99118 101191 130088 221472 259389 166249 42325 -100497 -186659 -137121 -135929 -178181 -114874
19904a14874M8352k9640n1121N7775L6611j329p0577p2753k9852M0338O7421K6832
$$ -114874 -66522 -96162 -147283 -89508 -52897 -54226 -124803 -197556 -227408 -187070 -119649 -92817
19892i2817o01K6972P7786P444J086k4670N2112j2065N2620j19686j21202m4037
$$ -92817 -93418 -66446 11340 18784 19870 -4800 47312 35247 87867 -31819 -153021 -197058
19880a97058O6802M7960r6303r5993J10568m0258k2718L7480J69156k7123j23885
$$ -197058 -130256 -82296 -178599 -274592 -164024 -204282 -227000 -189520 -20364 -47487 -171372
19869a71372n3688N3596M534q5035O0509M6615l399O8887L136j09246Q3120O6746
$$ -171372 -225060 -171464 -166930 -251965 -191456 -144841 -148240 -79353 -76217 -185463 -102343 -35597
19857c5597o4902m8494j19195P2527J15766P6991p2412N4684P5856N5213N7551
$$ -35597 -100499 -148993 -268188 -195661 -79895 -2904 -75316 -20632 55224 110437 167988
19846A67988o4397j5253P1754o3839q5697j6165L3447m6927j14360r917O9543
$$ 167988 103591 88338 160092 96253 10556 -5609 27838 -19089 -133449 -143366 -73823
19835g3823J09849J14981n3133n6900o3604J4698O8108m6301q1019M2699N0162
$$ -73823 36026 151007 97874 40974 -22630 -7932 60176 13875 -67144 -24445 25717
19824B5717O5525k1865Q0849l9860j40184m7355K14927R7893j5280m6444k28620
$$ 25717 91242 69377 150226 110366 -29818 -77173 137754 235647 220367 173923 -54697
19813e4697j08822J40147M2238R0012R422j9078P1225k4640K034j63166O5533
$$ -54697 -163519 -23372 18866 108878 118300 99222 170447 145807 147841 -15325 50208
19802E0208L1365q82L2654l1461q3256j12786k2234j6046N9780j2282Q5605P5712
$$ 50208 81573 80691 113345 81884 -1372 -114158 -136392 -152438 -92658 -104940 -19335 56377
19790E6377J10933N9394j41399J324J3356J2083K09793K44831J02756L52707P10009
$$ 56377 167310 226704 85305 86629 99985 112068 321861 566692 669448 1022155 1732164
19779A732164P94469M84419K05623K63897K33636l86428o33112m18720l31505
$$ 1732164 2526633 3011052 3216675 3480572 3714208 3327780 2694668 2275948 1944443
19770A944443k72148k35034j67603j89128k37465j79244k59008p6256q1952o8459
$$ 1944443 1672295 1437261 1269658 1080530 843065 663821 404813 328557 246605 178146
19760A78146l0777q342l4761J03910N0872j24191j65124M6590O0836k7666J3590
$$ 178146 147369 139027 104266 208176 259048 134857 -30267 16323 77159 49493 63083
19749F3083O2023k7703o0117O6387m9993m4117n0135M4413M3969K7527O7655m3696
$$ 63083 125106 97403 37286 103673 53680 9563 -40572 3841 47810 75337 142992 99296
19737I9296m3248l1516p9258J11498M1174J17559M0704k2726n8638k7570r1057
$$ 99296 56048 24532 -54726 56772 97946 215505 256209 233483 174845 147275 56218
19726E6218j07462j02483J50080l4210r3365J4046J92122J22804r12j13927n398
$$ 56218 -51244 -153727 -3647 -37857 -131222 -117176 74946 197750 196838 82911 77513
19715G7513J09578P0763K593j9739j4833q9704j68614L7284K01405o0657m8445
$$ 77513 187091 257854 260447 240708 225875 136171 -32443 4841 206246 145589 97144
19704I7144M1298k287N7778j06335j02061O6829M0246J5670j9763l9714R1352
$$ 97144 138442 136155 193933 87598 -14463 52366 92612 108282 88519 48805 140157
19693A40157P6679M8223q3934J057Q8019R1158j02991n6273j54064j04142L2335
$$ 140157 216836 265059 181125 182182 270201 361359 258368 202095 48031 -56111 -23776
19682b3776o540m980M3809j7873m7928J70590R7726m95p1813L328k6180r7652
$$ -23776 -30316 -35296 8513 -9360 -57288 113302 211028 210533 138720 142048 115868 18216
19670A8216J1141m9709K3699O3567M5861j0934n473N7901J0349K6084M5854l6781
$$ 18216 29357 -20352 3347 66914 112775 101841 96368 154269 164618 190702 236556 199775
19658A99775K2718l9479J7805Q1910r7878j04137p8565P4248O4090j5675Q897
$$ 199775 222493 183014 200819 282729 184851 80714 2149 76397 140487 124812 133709
19647A33709n2057r0016J1074O1050m5403n554r9824j63550J4805Q4053J68460
$$ 133709 81652 -8364 2710 63760 18357 12803 -87021 -250571 -235766 -151713 16747
19636A6747J40581o9598r0259J38163q1721r4749l841j7053q337l274l6135k7832
$$ 16747 157328 87730 -2529 135634 53913 -40836 -44677 -61730 -70067 -73341 -109476 -137308
19624a37308k8364l5720N3461O2336O1900O4249q904q054k0541L4366j14703n4792
$$ -137308 -165672 -201392 -147931 -85595 -23695 40554 31650 23596 3055 37421 -77282 -132074
19612a32074K5928P1495J2766k9360J17339K7646l4901k4019M715M5168q1448
$$ -132074 -106146 -34651 -21885 -51245 66094 93740 58839 34820 39535 84703 3255
19601C255q5816j75987N0241P4511M1274N0777J0643L4508J86781N6136q7727
$$ 3255 -82561 -258548 -208307 -133796 -92522 -41745 -31102 3406 190187 246323 158596
19590A58596m279n9975p5926j57312J9759J03963J42511K7081K3919n8452k15885
$$ 158596 154317 94342 18416 -138896 -119137 -15174 127337 154418 178337 119885 -96000
19579i6000p2331k6603j41667K05774L9262j29769j08008P5742P9217q1459m1150
$$ -96000 -168331 -194934 -336601 -130827 -91565 -221334 -329342 -253600 -174383 -255842 -296992
19568b96992J8004P6874l3290J36357K60364r1893n4396m5096J0675j5045J4766
$$ -296992 -278988 -202114 -235404 -99047 161317 69424 15028 -30068 -19393 -34438 -19672
19557a9672P5579P8497k0997j11907o6626O9009N1104l7778L6377j40115m2770
$$ -19672 55907 134404 113407 1500 -65126 3883 54987 17209 53586 -86529 -129299
19546a29299J57306J88167r4803n1073N0297n1040o3238l1113Q5277Q8143m5830
$$ -129299 28007 216174 121371 70298 120595 69555 6317 -24796 60481 148624 102794
19535A02794r7388p2171P2336M1635j658J23302O6491J987o5340O6657J57106
$$ 102794 5406 -66765 5571 47206 45548 168850 235341 237328 171988 238645 395751
19524C95751J91080N2312J6775K6995o9909j90327o6661o8121N017j37938k9059
$$ 395751 586831 639143 655918 682913 613004 422677 356016 287895 292912 154974 125915
19513A25915j9114n412M2056L224M8401q5526j33146k921j3907p3319L5410P6575
$$ 125915 106801 101389 143445 146669 195070 109544 -23602 -26523 -40430 -113749 -78339 -1764
19501a764n317j32478p4898r346K06218M942q9579K5598J6203L5931n9196J3897
$$ -1764 -7081 -139559 -214457 -223803 -17585 -12643 -102222 -76624 -60421 -24490 -83686 -69789
19489f9789j8163Q8798J08212l5395j3478j6222O9814O6441k01139j87011N6021
$$ -69789 -87952 846 109058 73663 60185 43963 113777 180218 -20921 -207932 -151911
19478a51911P6873M2675l067M7352J51279K65446K38062k4983N813J5445j31954
$$ -151911 -75038 -32363 -35430 11922 163201 428647 666709 641726 647539 662984 531030
19467E31030m7541q1833n6016j4284Q0108m9937j05589o5895r8161p5535m4285
$$ 531030 483489 401656 345640 331356 411464 361527 255938 190043 91882 16347 -27938
19456b7938J99415K0344q4713p801J29936R033r7648j14075P4717m7921p7280
$$ -27938 171477 191821 107108 99307 229243 238276 140628 26553 101270 53349 -23931
19445b3931N5326J8351j08957l0372J06114P9033o6847q7067J0295L9997M0571
$$ -23931 31395 49746 -59211 -89583 16531 95564 28717 -58350 -48055 -8058 32513
19434C2513L6182j39266p9286J6063P6111j5226p682N0909J8725M5412L2541K4721
$$ 32513 68695 -70571 -149857 -133794 -57683 -72909 -80591 -29682 -10957 34455 66996 91717
19422I1717l6770K5755Q3304Q0063r8031j00713P7917R8931j46882k6854l8179
$$ 91717 54947 80702 164006 244069 146038 45325 123242 222173 75291 48437 10258
19411A0258O3830J30926q0305j0044J8782p3478R6938R934o9085J37605R0136
$$ 10258 74088 205014 124709 114665 133447 59969 156907 166841 97756 235361 325497
19400C25497P4202j77123k97485M3578P137N6389J19798K7706K7872j00001j16680
$$ 325497 399699 222576 -74909 -31331 -24194 32195 151993 179699 207571 107570 -9110
19389i110J7087O2693O1715J18149n6534n128O0221j17362j3848P1321n5331j7840
$$ -9110 7977 70670 132385 250534 194000 188872 249093 131731 117883 189204 133873 116033
19377A16033O4501O8101j2872k9666r0138p8916m0041k7796R0759J28518R5717
$$ 116033 180534 248635 235763 206097 115959 37043 -2998 -30794 59965 188483 284200
19366B84200k9493o8256R9295J5094l7801P47j03456m93j56220k2186N8177J66
$$ 284200 254707 186451 285746 300840 263039 263786 160330 159837 3617 -18569 39608 39774
19354C9774o300K2839L9789k8626L0281j45867l996p838L0646J26147J22674j619
$$ 39774 33474 56313 96102 67476 97757 -48110 -52106 -59944 -29298 96849 219523 217904
19342B17904K7524R9270Q3552R7921L5455l0284r0303j11514j4124j03702q8807
$$ 217904 245428 344698 428250 526171 561626 531342 441039 329525 315401 211699 122892
19331A22892O5065M3461o2952M2056o7480m9716O0891Q391k4217J4997p7681l6688
$$ 122892 187957 231418 168466 210522 143042 93326 154217 162608 138391 153388 75707 39019
19319C9019r029p8402K0666J04493N6620N4634m6167j76565K4655J41745J04935
$$ 39019 29990 -48412 -27746 76747 133367 188001 141834 -34731 -10076 131669 236604
19308B36604Q3366j40283k6302p7777J28468J48922k4469j27893q5956p9220n2190
$$ 236604 319970 179687 153385 75608 204076 352998 328529 200636 114680 35460 -16730
19297a6730j4127K4469R5016L5456L9858k7867P2930J25720J7059q5486L4936
$$ -16730 -30857 -6388 88628 124084 163942 136075 209005 334725 351784 266298 301234
19286C01234j7293m3652J10195m8876m9858R4175q048N6953n0331m2378K781q0458
$$ 301234 283941 240289 350484 301608 251750 345925 337877 394830 344499 302121 304902 224444
19274B24444O4839K4273q2427l3788N3981k07554j72628K186J41152K09486l1927
$$ 224444 289283 313556 231129 197341 251322 43768 -128860 -126674 14478 223964 192037
19263A92037J9451J06031k6273r8989J5419L2577r6417k0953l0980J17424J04644
$$ 192037 211488 317519 291246 192257 207676 240253 143836 122883 91903 209327 313971
19252C13971O1431q7164j56856K8465J19637J73965o0240q9584j11661J06381
$$ 313971 375402 288238 131382 159847 279484 453449 393209 303625 191964 298345
19242B98345N4312m2351Q351j6400o8351l7798L7594q9515j4664Q1447N4566m3703
$$ 298345 352657 310306 318657 302257 233906 196108 233702 144187 129523 210970 265536 221833
19230B21833j40615j7576L0858O6666p4226o0146P0823M520o345J2487j6476j28314
$$ 221833 81218 63642 94500 161166 86940 26794 97617 102137 95792 108279 91803 -36511
19218c6511M0873J48369P4216R3277J8701k04798M5612N8448r907q0186J00866
$$ -36511 4362 152731 226947 320224 338925 134127 179739 238187 228280 148094 248960
19207B48960J05444J03085L045k9102m7617j04867R8537J58120J0252p6109r5482
$$ 248960 354404 457489 460534 431432 383815 278948 377485 535605 545857 469748 374266
19196C74266m7260o5141K9501J31846k4313r8958J8239L0416j23476j3528J07434
$$ 374266 327006 261865 291366 423212 398899 299941 318180 348596 225120 211592 319026
19185C19026j9818r2263K8109J94863j7334j16525p7179n2399j5242m213L0504
$$ 319026 299208 206945 235054 429917 412583 296058 218879 166480 151238 147025 177529
19174A77529M2963l9192L0914j0285l0272l2200k9881j08105P4258O0256q176
$$ 177529 220492 181300 212214 201929 171657 139457 109576 1471 75729 135985 127809
19163A27809L8942p1371o137J5466M8211O724R3775j50701m2927J35174m4717
$$ 127809 166751 95380 89243 104709 152920 159644 253419 102718 59791 194965 150248
19152A50248L1116K0948M3027J24634J26676o4278N1555M206o8964m7920k5613
$$ 150248 181364 202312 245339 369973 496649 432371 483926 488132 419168 371248 345635
19141C45635j31892o7668K0525L3562J07122j0980o9897k5323O0885J1403L5010
$$ 345635 213743 146075 166600 200162 307284 296304 226407 201084 261969 273372 308382
19130C08382n8240o4094q8691M8360J6537n1806R8390Q7332m8029q16J453j40857
$$ 308382 250142 186048 97357 145717 162254 110448 208838 296170 248141 247325 248778 107921
19118A07921M8158M977Q9414Q5227p5905o8452J64594Q7774L8911N4738j84078
$$ 107921 156079 161056 250470 335697 259792 191340 355934 443708 482619 537357 353279
19107C53279q1260L3960n5639K7464p1672q6513m2558K8860P9447J27960K8711
$$ 353279 272019 305979 250340 277804 206132 119619 77061 105921 185368 313328 342039
19096C42039n3981L4575q1213m9837L6898k7898P809n1465P409J29397O8521j9696
$$ 342039 288058 322633 241420 191583 228481 200583 208392 156927 164336 293733 362254 342558
19084C42558N4765M826o9147q3880k3690Q2265l3630M9625o2319K7063K9032N7984
$$ 342558 397323 402149 333002 249122 225432 307697 274067 323692 261373 288436 317468 375452
19072C75452O3668p490L1464q00R669P8416P1004j4569j1478N403J69648k5162
$$ 375452 439120 431630 463094 462294 471963 550379 621383 606814 595336 600739 770387 745225
19060G45225p7797m947j72292N925J28264k3442l9068q8334m5068Q5854J41887
$$ 745225 667428 662481 490189 496114 624378 600936 561868 473534 428466 514320 656207
19049F56207R1191o5578p7034k7809L9727Q5072K2563n547R0920J05867L2759
$$ 656207 747398 681820 604786 576977 616704 701776 724339 718792 809712 915579 948338
19038I48338J40798J72919R2171N2648j2586O544K8272P4038J45063J14179J56558
$$ 948338 1089136 1262055 1354226 1406874 1394288 1400832 1429104 1503142 1648205 1762384 1918942
19027A918942J58525J67360K01048J69470L1949Q8226J33505J35446J45434J77568
$$ 1918942 2077467 2244827 2445875 2615345 2647294 2735520 2869025 3004471 3149905 3327473
19017C327473K74356J81308K33822M48316M84103P20734Q95878J072461J446830
$$ 3327473 3601829 3783137 4016959 4465275 4949378 5670112 6565990 7638451 9085281
19008I085281J893787K440606L488964N109100P691427J1569695J7208393K2360411
$$ 9085281 10979068 13419674 16908638 22017738 29709165 41278860 58487253 80847664
19000H0847664K3038379J8482547J0853552J557372q573711j7671775k2177597
$$ 80847664 103886043 122368590 133222142 134779514 126205803 108534028 86356431
18993H6356431k0581911j5326393j0275409o825181m697003l448482k716950k195078
$$ 86356431 65774520 50448127 40172718 33347537 28650534 25202052 22485102 20290024
18985B0290024j763337j315156r77132r09614p42355m91175l39100k24327k5592
$$ 20290024 18526687 17211531 16234399 15324785 14582430 14091255 13752155 13527828 13502236
18976A3502236k25617l41313l21299k14148j25050j24872k45498k00576p0270
$$ 13502236 13276619 12935306 12614007 12399859 12274809 12149937 11904439 11703863 11633593
18967A1633593j60865j99825k79396m8033n1832o1122J43625K65088N11449M91931
$$ 11633593 11472728 11272903 10993507 10945474 10893642 10832520 10976145 11241233 11752682 12244613
18957A2244613O54550R69936J276618J792698K703887L716719N350044Q176546
$$ 12244613 12899163 13869099 15145717 16938415 19642302 23359021 28709065 36885611
18949C6885611J2881237J9135065K4664659K4906683J9513792J1051515R92813
$$ 36885611 49766848 68901913 93566572 118473255 137987047 149038562 150031375
18942A50031375j0368447k0079961k4434699k2180760j6479891j0854692p278616
$$ 150031375 139662928 119582967 95148268 72967508 56487617 45632925 38354309
18935C8354309n094719l743093k930847k482387k027668j614157j415232j194333
$$ 38354309 33259590 29516497 26585650 24103263 22075595 20461438 19046206 17851873
18927A7851873r03124n75734l78049l41552l61748m91778l56147n11836n74474
$$ 17851873 16948749 16373015 15994966 15653414 15291666 14799888 14443741 13931905 13357431
18918A3357431m96669l96055l22799j98719k58303n02483m65476l33365l30844
$$ 13357431 12860762 12464707 12141908 11943189 11684886 11182403 10716927 10383562 10052718
18909A0052718l69504l80519j94513r2673j55872k20917k46703k37341l82696
$$ 10052718 9683214 9302695 9108182 9015509 8859637 8638720 8392017 8154676 7771980
18900G771980j68871q0474j69613j35178j06633j82625k03745j07121k13387j45034
$$ 7771980 7603109 7522635 7353022 7217844 7111211 6928586 6724841 6617720 6404333 6259299
18890F259299o3196j60470j54537k32202n1409q390k44767j08610o5039J9496
$$ 6259299 6196103 6035633 5881096 5648894 5597485 5589095 5344328 5235718 5170679 5190175
18880E190175J9567j08989j63237j48011j12541J6742q9654j58572j65830j46142
$$ 5190175 5209742 5100753 4937516 4789505 4676964 4693706 4604052 4445480 4279650 4133508
18870D133508J7955j9382q7496j28714l5885l5056j00532J7714n9506l5370r5714
$$ 4133508 4151463 4132081 4044585 3915871 3879986 3844930 3744398 3762112 3702606 3667236 3571522
18859C571522m5147k7979j25285j13565j49275r1509o8503l5200m0172M9613j14359
$$ 3571522 3526375 3498396 3373111 3259546 3110271 3018762 2950259 2915059 2874887 2924500 2810141
18848B810141j13213n80q6910q3917j0226J48653l0098p8503m4998r2453j00783
$$ 2810141 2696928 2696348 2609438 2525521 2515295 2663948 2633850 2555347 2510349 2417896 2317113
18837B317113J00128J3701p9774n8403j41170M798j9930k7171j98267j31818O2755
$$ 2317113 2417241 2430942 2351168 2292765 2151595 2156393 2136463 2109292 1911025 1779207 1841962
18826A841962K1302o9346J7325l4091o9054m6482j8036J46639o096k7659l177
$$ 1841962 1863264 1793918 1811243 1777152 1708098 1661616 1643580 1790219 1784123 1756464 1753287
18815A753287j0357J5948p3226j58636o0857K9608o9757K5100J05523j36231M4392
$$ 1753287 1742930 1758878 1685652 1527016 1466159 1495767 1426010 1451110 1556633 1420402 1464794
18804A464794J03118n6144j23028m4270L2271Q416p4493j44629n2098J25154O3265
$$ 1464794 1567912 1511768 1388740 1344470 1376741 1385157 1310664 1166035 1113937 1239091 1302356
18793A302356o3251q6651K6976k0076J5552P9694O6940J272L7532l0479m3403
$$ 1302356 1239105 1152454 1179430 1159354 1174906 1254600 1321540 1322812 1360344 1329865 1286462
18782A286462L6994m982r3376k65537j9530M2350m7608K626j17122O6341O5632
$$ 1286462 1323456 1318474 1225098 959561 940031 982381 934773 937399 820277 886618 952250
18771I52250p5586j15822l9328J14049J63590M4041n916n6295n5554Q1560K1641
$$ 952250 876664 760842 721514 835563 999153 1043194 1037278 980983 925429 1006989 1028630
18760A028630N3029k6190o3703m5846l37J0258o2757p7444n1457o9074R5525j4887
$$ 1028630 1081659 1055469 991766 945920 945583 955841 893084 815640 764183 695109 790634 775747
18748G75747P0773O1811J8704K3089Q8725o951J8310M0352j6376o4726J1461J02143
$$ 775747 846520 908331 927035 950124 1038849 1031898 1050208 1090560 1074184 1009458 1020919 1123062
18736A123062J37302K4427k21786k75491r3586L3183n4865j02595j8833o973J21304
$$ 1123062 1260364 1284791 1063005 787514 693928 727111 672246 569651 550818 543845 665149
18725F65149J6977l7369l2640J19151r9583N5660Q7532q4283J8608n035K6456
$$ 665149 682126 644757 612117 731268 631685 687345 774877 690594 709202 704167 730623
18714G30623J16484K10943R4387P5141J18588n2776r6620J0698L1410j60199j18028
$$ 730623 847107 1058050 1152437 1227578 1346166 1293390 1196770 1207468 1238878 1078679 960651
18703I60651p0506j10682j30690m6488L066r8957o4252q1277j2310J24494P1713
$$ 960651 890145 779463 648773 602285 605351 506394 442142 360865 348555 473049 544762
18692E44762q5509n6916O8759N8264q1456r4624l7271J11063O2446q3634l31m9485
$$ 544762 459253 402337 471096 529360 447904 353280 316009 427072 489518 405884 405553 356068
18680C56068M211o3595l5912J22457J49764N2283j294J6545P7930l532r062N4236
$$ 356068 360279 296684 260772 383229 532993 585276 583982 600527 678457 674925 665863 720099
18668G20099M6192p4649P9398k3574k44554q7754P7096j0393J2340J8154r32j10092
$$ 720099 766291 691642 771040 747466 502912 415158 492254 481861 494201 512355 511423 401331
18656D01331p2217l9691J33606m3584Q7339N785j30021j504N8533l091r1127p2594
$$ 401331 329114 289423 423029 379445 466784 472569 342548 341044 399577 396486 305359 232765
18644B32765J43385L4623P4322j08402l8769p8954L768Q272M6908P3533q3398
$$ 232765 376150 410773 485095 376693 337924 258970 262738 271010 317918 391451 308053
18633C08053M4432L036p5850m0780R8252L0349J0069K7574k1525o4672q7578n9559
$$ 308053 352485 355521 279671 238891 337143 367492 377561 405135 383610 318938 231360 171801
18621A71801n1434k0106j5313k7391N3743N0595J6086J08542Q8591J25876k6172
$$ 171801 120367 100261 84948 57557 111300 161895 177981 286523 375114 500990 474818
18610D74818k5925o929K0554o0154j13527j44112j7065J12608J4265L2396N8162
$$ 474818 448893 441964 462518 402364 288837 144725 127660 240268 254533 286929 345091
18599C45091K1672J23963j22369m2697j01706j15187q3238Q6952P7702m1625M5843
$$ 345091 366763 490726 368357 325660 223954 108767 25529 112481 190183 148558 194401
18588A94401J8581P5146J17503o260j16174k1712L0851L6300O301O7510l7275
$$ 194401 212982 288128 405631 399371 283197 261485 292336 328636 334937 402447 365172
18577C65172r9401R506n90R0479L9294r7673j5582K5803Q7115J02240j4970R7017
$$ 365172 265771 275277 274687 365166 404460 306787 291205 317008 404123 506363 491393 588410
18565E88410P458P1899M1837J7526J2063m2486j44663j28817j25328j58536P5428
$$ 588410 595868 667767 709604 727130 739193 696707 552044 423227 297899 139363 214791
18554B14791J02521R5948J19486L9298k0840k7023k3264J01230q761J25427K13683
$$ 214791 317312 413260 532746 572044 551204 524181 500917 602147 593386 718813 932496
18543I32496Q6633j14152j92582j20895N6465J8931q196j91705j14293j4139O3963
$$ 932496 1019129 904977 712395 591500 647965 666896 658700 466995 352702 338563 402526
18532D02526J16590p2337j46965j2655r488l3121k0895q0172l4897m2842M249
$$ 402526 519116 446779 299814 287159 277671 244550 223655 143483 108586 65744 69993
18521F9993J49480K5374o3024j3953M2158J28848J54846p1933j66909K5280j4204
$$ 69993 219473 244847 181823 167870 210028 338876 493722 421789 254880 280160 265956
18510B65956j25679p4118R4784Q8300m0645N0706j25569j73582K9760M8916P7732
$$ 265956 140277 66159 160943 249243 208598 259304 133735 -39847 -10087 38829 116561
18499A16561J41168j25314K9866Q3676J04774j4569j03429r4726m2840n3026o8320
$$ 116561 257729 132415 162281 245957 350731 336162 232733 138007 95167 42141 -26179
18488b6179J64783J56351O5743k2315j32389N4150J420N534N0554r0288l2446
$$ -26179 138604 294955 360698 338383 205994 260144 261564 267098 317652 227364 194918
18477A94918J11201J83714k8496o7915M9131K7862L7763J4836j597M0729J80247
$$ 194918 306119 489833 461337 393422 442553 470415 508178 523014 521417 562146 742393
18466G42393O5528j8125k8475j7241q9210r5057k7608j77251k19944n4614L5099
$$ 742393 807921 789796 761321 744080 654870 559813 532205 354954 135010 80396 115495
18455A15495R6608L4891O7504q9807k03451l4541j6076K09390N6506p9762L7422
$$ 115495 212103 246994 314498 224691 21240 -13301 -29377 180013 236519 156757 194179
18444A94179L5040P8883q0656r860J7182J25410J02583k9509o4807p295l0361
$$ 194179 229219 308102 227446 217586 234768 360178 462761 433252 368445 361150 330789
18433C30789j01585O2151p4879O1611N4100j00446p3541J06756n6314l4244J29838
$$ 330789 229204 291355 216476 278087 332187 231741 158200 264956 208642 174398 304236
18422C04236J90287j16938k4667l6398R7063J63004J80038K46306N2360K7493
$$ 304236 494523 377585 352918 316520 413583 576587 756625 1002931 1055291 1082784
18412A082784o5902Q1120K896p6366q6590K5182m7140o2635J06105P8200r1683
$$ 1082784 1016882 1098002 1100898 1024532 937942 963124 915984 853349 959454 1037654 945971
18401I45971j18921r4182j26672n0636p5350J4309M4226j10414j3660j00976l5916
$$ 945971 827050 732868 606196 555560 480210 494519 538745 428331 414671 313695 277779
18390B77779O6972o7912P475J80655o3440j27060n875j11515p4854L2070L5582
$$ 277779 344751 276839 284314 464969 401529 274469 268594 157079 82225 114295 149877
18379A49877j6529K7752P5498J198K8586J11486k6867l2448R0758J6669j40923
$$ 149877 133348 161100 236598 237796 266382 377868 351001 318553 409311 425980 285057
18368B85057m4800M8939j773M292j11371J5032P8527O5549J19913J1178P8032
$$ 285057 240257 289196 287423 291715 180344 195376 273903 339452 459365 470543 548575
18357E48575j9113j37953j57192r0673p642J10121J79206k7117q1048j01192n2024
$$ 548575 529462 391509 234317 143644 136002 246123 425329 398212 317164 215972 163948
18346A63948J01277K8945k1100k3627k1886m3748k3627P9772M7978q7143j10763
$$ 163948 265225 294170 273070 249443 227557 183809 160182 239954 287932 200789 90026
18335I0026J4848N2163J42756Q9917K9067L2647j83369J8134K7154N7757o11N3046
$$ 90026 104874 157037 299793 389710 418777 451424 268055 286189 313343 371100 370489 423535
18323D23535l6719O4616M6890j44130j44901L8730K7826p0409L9629j5450L6401
$$ 423535 386816 451432 498322 354192 209291 248021 275847 205438 245067 229617 266018
18312B66018n0313K7468M5995J8667P2271L9915r965j6309k1591j23296K136K9152
$$ 266018 215705 243173 289168 307835 380106 420021 410056 393747 372156 248860 250996 280148
18300B80148K1768L4132q084l5617o3468P945K01876J27384l6595r4954Q568j82781
$$ 280148 301916 336048 327964 292347 228879 236824 438700 566084 529489 434535 443103 260322
18288B60322L2858R5987J32809R9892l4933k4424N7829O2938j00716n3844j16702
$$ 260322 293180 389167 521976 621868 586935 562511 620340 683278 582562 528718 412016
18277D12016J558j2949K9186k741L5398K325p6378M6067o1090p2451L985j8539
$$ 412016 413574 400625 429811 427070 462468 464793 388415 434482 373392 300941 304926 286387
18265B86387m7662Q5144p197m6271q418O7542n2709L7165O7122K4484m1324O125
$$ 286387 238725 323869 316672 270401 261983 329525 276816 313981 381103 405587 364263 370388
18253C70388L7684P8961O5789j3047J34117L5317k2398M9751r0828j25309j35392
$$ 370388 408072 487033 552822 539775 673892 709209 686811 736562 645734 520425 385033
18242C85033M249Q9914k06377p6884R8307j9445J5787J39558n8216l0071R5058
$$ 385033 389282 479196 272819 195935 294242 274797 290584 430142 371926 341855 436913
18231D36913P5908L3649j5198r2719n0966j7808j52482j0768J09327K1816r6609
$$ 436913 512821 546470 531272 438553 387587 369779 217297 206529 315856 337672 241063
18220B41063j28444J3362M7665m3331k9383O8271k1097J08938M7677J63655k9328
$$ 241063 112619 125981 173646 130315 100932 169203 148106 257044 304721 468376 439048
18209D39048j37751j3406O9392P7104Q8152N3837j07327j56138k8262j30952j19396
$$ 439048 301297 287891 357283 434387 522539 576376 469049 312911 284649 153697 34301
18198C4301P1695J46058k463Q6343k4151r5914l6114j8512o7834n1704j2728J3312
$$ 34301 105996 252054 249591 335934 311783 215869 179755 161243 93409 41705 28977 42289
18186D2289K9023P7140P6036J8251j5725k101l7553l890p606O3731N1195o6968
$$ 42289 71312 148452 224488 242739 227014 224913 187360 183470 175864 239595 290790 223822
18174B23822l0681J34968P5825n7087K139n3994k3056P957J04557J14357j05248
$$ 223822 193141 328109 403934 346847 348986 294992 271936 279893 384450 498807 393559
18163C93559q9556J18163L1694L8002L7130J7257R7291J18978N2848j13437M8707
$$ 393559 304003 422166 453860 491862 528992 546249 643540 762518 815366 701929 750636
18152G50636M5893j10898L7163O2683p0150o5871O5171J82932l2884j03571O1426
$$ 750636 796529 685631 722794 785477 715327 649456 714627 897559 864675 761104 822530
18141H22530J42092m1848o4937l1461j10468q6686O6490k9278j8201J0923J59662
$$ 822530 964622 922774 857837 826376 715908 629222 695712 666434 648233 659156 818818
18130H18818j9498J0145N797L6793k4201k6240O479P5029P8063R9774N0804J82708
$$ 818818 799320 809465 815262 852055 827854 801614 808093 883122 961185 1060959 1111763 1294471
18118A294471L02819K31130J53875J35284r770j94709k02405m4553j16536p8906
$$ 1294471 1597290 1828420 1982295 2117579 2107809 1913100 1710695 1666142 1549606 1470700
18108A470700m2034N4834p2411N7345L1262Q2541R1745R3851N7038P1589P0060
$$ 1470700 1428666 1483500 1411089 1468434 1499696 1582237 1673982 1767833 1824871 1896460 1966520
18097A966520N0918J09742J61003k1943M0681M3195R3379N5126o0012o1463m1334
$$ 1966520 2017438 2127180 2288183 2266240 2306921 2350116 2443495 2498621 2438609 2377146 2335812
18086B335812j6194P9610L30337L39139J91780J99693J97793N8963P3530J23526
$$ 2335812 2319618 2399228 2729565 3068704 3260484 3460177 3657970 3716933 3790463 3913989
18076C913989K27616J46656K23617N09783M14824M95952M94973O63055P60910
$$ 3913989 4141605 4288261 4511878 5021661 5436485 5932437 6427410 7090465 7851375
18067G851375P90871Q32946J011611J242039J657259K145855K903190M145401
$$ 7851375 8642246 9475192 10486803 11728842 13386101 15531956 18435146 22580547
18059B2580547O519010J0326087J6317639K2945931K5136151K1638503J3769308
$$ 22580547 29099557 39425644 55743283 78689214 103825365 125463868 139233176
18052A39233176L552880o580381j6590865k3378520k2094727j5402524r316944
$$ 139233176 142786056 136205675 119614810 96236290 74141563 58739039 49422095
18045D9422095n254069k889062j216397K08063J798907M201948P677072J3534685
$$ 49422095 44168026 41278964 40062567 40270630 42069537 46271485 53948557 67483242
18037F7483242K1194626K6047299K3310586J6700093P192151m358440j6267238
$$ 67483242 88677868 114725167 138035753 154735846 161927997 157569557 141302319
18030A41302319k4720793k6296943k0760481j3852158q726531n724638m138758
$$ 141302319 116581526 90284583 69524102 55671944 46945413 41220775 37082017
18023C7082017l326826k765082k394490k032256j618979j326318j162215r36816
$$ 37082017 33755191 30990109 28595619 26563363 24944384 23618066 22455851 21519035
18015B1519035p62633n43270o87634p31102p08724o75136n64794m01313l29923
$$ 21519035 20756402 20213132 19525498 18794396 18085672 17410536 16845742 16444429 16114506
18006A6114506m80743m38537n49647m55492l73962m15749m43041l65810k16272
$$ 16114506 15633763 15195226 14645579 14190087 13816125 13400376 12957335 12591525 12375253
17997A2375253j71825k88893k27429j61721j33542q0633j19198k14296j82327
$$ 12375253 12203428 11914535 11687106 11525385 11391843 11311210 11192012 10977716 10795389
17988A0795389j65698k50513l39213k01967k2336m08896n04135l19941j60774
$$ 10795389 10629691 10379178 10039965 9837998 9815662 9406766 8902631 8582690 8421916
17979H421916j39902k48782j77100k03862k82175n8332o0563j82636j83345j82030
$$ 8421916 8282014 8033232 7856132 7652270 7370095 7311763 7251200 7068564 6885219 6703189
17969F703189L487L8711j16951k12841j68022n4272j5009n4820k02749l29109
$$ 6703189 6706676 6745387 6628436 6415595 6247573 6193301 6178292 6123472 5920723 5591614
17959E591614k36869J9154P3410J20309j30931k5990n6728k01218l5909j2235
$$ 5591614 5354745 5373899 5447309 5567618 5436687 5410697 5353969 5152751 5116842 5104607
17949E104607j12129j61o4039j11733j9249J5421j11890q4079j27308j87935r9062
$$ 5104607 4992478 4992317 4928278 4816545 4797296 4812717 4700827 4616748 4489440 4301505 4202443
17938D202443O4423r4902k10373j4304j27479j21417m3077o0947q6989m3756m0126
$$ 4202443 4266866 4171964 3961591 3947287 3819808 3698391 3655314 3594367 3507378 3463622 3423496
17927C423496j7794N5526J02742N2356l4513L5718j47998j58246j33982n7180
$$ 3423496 3405702 3461228 3563970 3616326 3581813 3617531 3469533 3311287 3177305 3120125
17917C120125o4286p4509L8647p1416j06548j16362q4221j36017J2667p3523J8269
$$ 3120125 3055839 2981330 3019977 2948561 2842013 2725651 2641430 2505413 2518080 2444557 2462826
17906B462826M907m7767l3240r4294l5585Q4015O836j28685j25331j6423J2061
$$ 2462826 2467733 2419966 2386726 2292432 2256847 2340862 2347698 2219013 2093682 2077259 2089320
17895B089320P7252j3632n1202L0317O4668L7575q1720j14031p7852j32786O0447
$$ 2089320 2166572 2152940 2101738 2132055 2196723 2234298 2152578 2038547 1960695 1827909 1888356
17884A888356J05480N5897L8610m1396j6104O4388J5500j29132r4954J9200M1057
$$ 1888356 1993836 2049733 2088343 2046947 2030843 2095231 2110731 1981599 1886645 1905845 1946902
17873A946902q1373q0718L0292K0932o9582Q8504o21r6270q9232q4596Q2852J02976
$$ 1946902 1865529 1784811 1815103 1836035 1766453 1854957 1854336 1758066 1668834 1584238 1667090 1770066
17861A770066M6359m5603p1644l0253p7684j37244j06225P9891p1543j29857j03555
$$ 1770066 1816425 1770822 1699178 1668925 1591241 1453997 1347772 1427663 1356120 1226263 1122708
17850A122708k8714P6239j3310o4363J0185Q1774n6943j33914M179J902L7486
$$ 1122708 1093994 1170233 1156923 1092560 1102745 1184519 1127576 993662 997841 999743 1037229
17839A037229l1078L5623Q1285q0639K1851k1776L1809J31103n8184P1434J4991
$$ 1037229 1006151 1041774 1123059 1042420 1064271 1042495 1074304 1205407 1147223 1218657 1233648
17828A233648p2392m8075q0227m0531M7621j6772k0475m0076L2604N0489j3457
$$ 1233648 1161256 1113181 1032954 992423 1040044 1023272 1002797 962721 995325 1045814 1032357
17817A032357j14735J1715J03436j0574j10240l2712L4419m2221j4211K5124o5670
$$ 1032357 917622 929337 1032773 1022199 911959 879247 913666 871445 857234 882358 816688
17806H16688P6223j3456o7785j01862j05708o1934Q9364J12276n397p4222r4667
$$ 816688 892911 879455 811670 709808 604100 542166 631530 743806 738409 664187 569520
17795E69520p212m8250j42177J6178J2129N9803J07522J04400k1242m7429p286
$$ 569520 562308 514058 371881 388059 400188 459991 567513 671913 650671 603242 595956
17784E95956k9549j933k1696N3009l9739n951Q3300M1162l0873l6879k6357K0083
$$ 595956 566407 564474 542778 595787 556048 550097 633397 674559 643686 606807 580450 600533
17772F00533r6147j66424n5913J10971K04624j2866L0012l9864q9991m9886L9114
$$ 600533 504386 337962 282049 393020 597644 584778 614790 574926 484935 435049 474163
17761D74163R2276j0092n819n6492j09110n0244M9344N5111j31887K1976J37090
$$ 474163 566439 556347 550528 494036 384926 334682 384026 439137 307250 329226 466316
17750D66316K4670m6617m2099j8146J11138m4348j0209K6801J0138j2982p9290
$$ 466316 490986 444369 402270 384124 495262 450914 440705 467506 477644 464662 385372
17739C85372Q6729l8379r5324K8848M454J25683n1889q9055o795M433P3828R3162
$$ 385372 472101 433722 338398 367246 371700 497383 445494 356439 349644 354077 427905 521067
17727E21067n2336P3722Q162q8685K0207Q455l3384n2788j59567l9891P8841K2765
$$ 521067 468731 542453 550615 461930 482137 490592 457208 404420 244853 204962 283803 306568
17715C06568o9463J1256j19284J13948P2431J45030P8999L2211P6021n9990r1660
$$ 306568 237105 248361 129077 243025 315456 460486 539485 571696 647717 587727 496067
17704D96067o1092O5999J11968L0914N1066j16322k17587j17796j6398k1497L5658
$$ 496067 434975 500974 612942 643856 694922 578600 361013 243217 226819 205322 240980
17693B40980J18043M637m365Q8579M067M85J0429j3885k4217q0867l4630o692
$$ 240980 359023 363660 359295 447874 451941 452426 462855 448970 424753 343886 309256 302564
17681C02564P9832J07656j4842n5208M9356J7720M2154J30693J15198N7988k5338
$$ 302564 382396 490052 475210 420002 469358 487078 529232 659925 775123 833111 807773
17670H07773k5885k25332r7069k5109j18825k1100J3716K22267R346k4511J22433
$$ 807773 781888 556556 459487 434378 315553 294453 308169 530436 539782 515271 637704
17659F37704J4997L5707m5741O4067Q168O0471k2046n0151l7259R968J7223o1762
$$ 637704 652701 688408 642667 706734 714902 775373 753327 703176 665917 675885 693108 631346
17647F31346R8476P56n1172j33210k3817j0812l8591J60754J13156o9756o9384
$$ 631346 729822 730578 679406 546196 522379 511567 472976 633730 746886 677130 607746
17636F07746N1444J08977n5958J2820R6557K3629q6629K1153O5735N3388P7286
$$ 607746 659190 768167 712209 725029 821586 845215 758586 779739 845474 898862 976148
17625I76148o4286l7332q8519k7209O7127J71628l9027R938Q3747R8822J20677
$$ 976148 911862 874530 786011 758802 825929 997557 958530 968468 1052215 1151037 1271714
17614A271714m2213J34253J15216j3181J14986o3231r6437K6745K3764k2661L8189
$$ 1271714 1229501 1363754 1478970 1465789 1580775 1517544 1421107 1447852 1471616 1448955 1487144
17603A487144N0943P3320J08402O3823J29023J09957K77990L23943L25836K39417
$$ 1487144 1538087 1611407 1719809 1783632 1912655 2022612 2300602 2624545 2950381 3189798
17593C189798L30254M18647M18189L62608M24120O48722Q51055J086035J621179
$$ 3189798 3520052 3938699 4356888 4719496 5143616 5792338 6643393 7729428 9350607
17584I350607K064874K837010M641087P377158J1595522J5754930J4758323P902392
$$ 9350607 11415481 14252491 18893578 26270736 37866258 53621188 68379511 76281903
17576G6281903L625934J42464p868779j4632226j3728811r673478n956243l596064
$$ 76281903 79907837 80050301 72181522 57549296 43820485 34147007 28190764 24594700
17568B4594700k043939j096070l03916M73542J103844K501532M869287Q170935
$$ 24594700 22550761 21454691 21150775 21624317 22728161 25229693 30098980 38269915
17560C8269915J2286886J4212737R777006L998640J151229m209517j1992568j4335615
$$ 38269915 50556801 64769538 74546544 78545184 79696413 75486896 63494328 49158713
17552D9158713j1113824p457220m723158l021145k170358j581013j191487j074609
$$ 49158713 38044889 30587669 25864511 22843366 20673008 19091995 17900508 16825899
17544A6825899q44991p12253n81473l72040k40278r9096J8156J28762N3086K09555
$$ 16825899 15980908 15268655 14687182 14315142 14074864 13975768 13993924 14122686 14175772 14385327
17534A4385327K64322L15033O57710J078803J697479K680305M251293O788658
$$ 14385327 14649649 14964682 15622392 16701195 18398674 21078979 25330272 32118930
17526C2118930J0672624J4503857J3216577O898607L126749l44264q108450j4047044
$$ 32118930 42791554 57295411 70511988 77410595 80537344 80193080 72084630 58037586
17518E8037586j2631610q683330n584148l412995j990489j166511m68332L31940
$$ 58037586 45405976 36722646 31138498 27725503 25735014 24568503 24100171 24432111
17510B4432111J026161K429683M545212P636308J1672482J3408052Q790414L295111
$$ 24432111 25458272 27887955 32433167 40069475 51741957 65150009 73940423 77235534
17502G7235534R33399m400030j2053040j3977745j0626953o886793m373228k951544
$$ 77235534 78168933 73768903 61715863 47738118 37111165 30224372 25851144 22899600
17494B2899600k220925j634555j440105j184457j046199p49280n73390n96479
$$ 22899600 20678675 19044120 17604015 16419558 15373359 14624079 14050689 13454210
17486A3454210l66794m72389n16299l27836l75927m68232l78895m23473l87775
$$ 13454210 13087416 12615027 12098728 11770892 11394965 10926733 10547838 10124365 9736590
17477I736590l30531k36840j36218j15541k40074j41026j95575k26913l21290
$$ 9736590 9406059 9169219 9033001 8917460 8677386 8536360 8340785 8113872 7792582
17468G792582j79755j13487j99617n4597j18203k01401j56736n3477j91370k64281
$$ 7792582 7612827 7499340 7299723 7245126 7126923 6925522 6768786 6715309 6523939 6259658
17458F259658k25095k14099j15897r4959j13433k26569j24536k35509l9047n9604
$$ 6259658 6034563 5820464 5704567 5609608 5496175 5269606 5145070 4909561 4870514 4810910
17448D810910j67265j5366Q2438j60871j24423n2912m3988j39938j75639j24294
$$ 4810910 4643645 4628279 4710717 4549846 4425423 4372511 4328523 4188585 4012946 3888652
17438C888652j19733n8250M0132N385M3444q7100q7636j03268p0020k4567P9507
$$ 3888652 3768919 3710669 3750801 3756186 3799630 3712530 3624894 3521626 3451606 3427039 3506546
17427C506546K845N2812j6092m0886j06856j69638j27257n8431q6291j16170q3054
$$ 3506546 3509391 3562203 3546111 3505225 3398369 3228731 3101474 3043043 2956752 2840582 2757528
17416B757528O5751P8235n7749j36338j18150k08664M0067J8029o5730r5550J23459
$$ 2757528 2823279 2901514 2843765 2707427 2589277 2380613 2420680 2438709 2372979 2277429 2400888
17405B400888J8797r4982P4041o6455j65124j60815j8553J42213k3524j45880
$$ 2400888 2419685 2324703 2398744 2332289 2167165 2006350 1987797 2130010 2106486 1960606
17395A960606j00987M7534K2727n2121p6674J3518j29027m6144J9828O1991L8260
$$ 1960606 1859619 1907153 1929880 1877759 1801085 1814603 1685576 1639432 1659260 1721251 1759511
17384A759511p4150J07208l9147j24237j36210l0230M8392J2866m251Q8139K304
$$ 1759511 1685361 1792569 1753422 1629185 1492975 1462745 1511137 1524003 1519752 1607891 1610195
17373A610195j11152o1216M0465Q3903J60288K717j02062n4908j73086j5752Q9355
$$ 1610195 1499043 1437827 1478292 1562195 1722483 1725200 1623138 1568230 1395144 1379392 1468747
17362A468747j5724j55432j02074j03209K0639R6723J23582m7947j16773j21944
$$ 1468747 1453023 1297591 1195517 1092308 1112947 1209670 1333252 1285305 1168532 1046588
17352A046588m6113l0567p5884n4778N0663J57517L6636j14758k73245j955L6208
$$ 1046588 1000475 969908 894024 839246 889909 1047426 1084062 969304 696059 694104 730312
17341G30312Q2170R3053j13103j6424N0846L2935n7059j02084n7980P0023J11057
$$ 730312 812482 905535 792432 776008 826854 859789 802730 700646 642666 712689 823746
17330H23746m4823p0850M499O2951R8215n6649q4789j536K6592J29229j1497r0601
$$ 823746 778923 708073 712572 775523 873738 817089 732300 730764 757356 886585 875088 784487
17318G84487j05465R5603J51046m8368k095J78268r44j81793p3795r4919n4198
$$ 784487 679022 774625 925671 877303 875208 1053476 1052532 870739 796944 702025 647827
17307F47827l3902k5590M8963M5096o7869r9171P5254k5033j8691l28R1504p5835
$$ 647827 613925 588335 637298 682394 614525 515354 590608 565575 546884 546556 638060 562225
17295E62225o1099j77982j5588K0932O8217k0028L2831K5560O7725P6184l0726
$$ 562225 501126 323144 307556 328488 396705 376677 409508 435068 502793 578977 548251
17284E48251o3749j32864K3397P0417j4679j15063P0242p0705K6188n5455N6749
$$ 548251 484502 351638 375035 445452 430773 315710 385952 315247 341435 285980 342729
17273C42729n2333r474j04507J27486M5696K5511J0327N6996j15713m9587j1992
$$ 342729 290396 280922 176415 303901 349597 375108 385435 442431 326718 277131 265139
17262B65139k4633r699K9672o6908J37373l1902q7925k8158r28N3569N5565m8462
$$ 265139 240506 230807 260479 193571 330944 299042 211117 182959 182031 235600 291165 242703
17250B42703j07081L5531K6629N2246J1322n9992r7053l9518R035M8971J42656
$$ 242703 135622 171153 197782 250028 261350 201358 104305 64787 73822 122793 265449
17239B65449Q5264L1131p9550m1834l6438M3749k2659n6168k7188P3521m8807
$$ 265449 350713 381844 302294 260460 224022 267771 245112 188944 161756 235277 186470
17228A86470p1384N644P0911o2422l3861l8467L3850J24984M4340m8413j1131
$$ 186470 115086 120730 191641 129219 95358 56891 90741 215725 260065 211652 200521
17217B00521L9960M3251l8412L7234K9231n456j02908K3484J91156j00582j17907
$$ 200521 240481 283732 245320 282554 311785 306329 203421 226905 418061 317479 199572
17206A99572k793q2545r320L9502j1856r99M7051L9473J2758m4380o5839L7167
$$ 199572 196779 114234 104914 144416 132560 131561 178612 218085 230843 186463 120624 157791
17194A57791Q5614M4488l2965r57k9960o3780l0975m6125m0354P0034K7601l119
$$ 157791 243405 287893 254928 253971 224011 160231 129256 83131 42777 112811 140412 137293
17182A37293K4921J0490m2876K7855k5223j5811J10670j0887l9550l8087N1088
$$ 137293 162214 172704 129828 157683 132460 116649 227319 216432 176882 138795 189883
17171A89883o9678j04158L7632O4525N4596m2967L726j41610o9321N1445O1023
$$ 189883 120205 16047 53679 118204 172800 129833 133559 -8051 -77372 -25927 35096
17160C5096N8339K5609K5366n1904O550l5757M3052R9684l5246j3307m0920q5538
$$ 35096 93435 119044 144410 92506 99056 63299 106351 206035 170789 157482 116562 31024
17148C1024K062J23895P6024N2059M9158j06404O1034M1731q1302M6788K8973
$$ 31024 33086 156981 233005 285064 334222 227818 288852 330583 249281 296069 325042
17137C25042q2397j03535J41614J44589j01312q1100j10436j00288N0968M3862
$$ 325042 242645 139110 280724 425313 324001 242901 132465 32177 83145 127007
17127A27007l3973j24518J9578K31016p4793j30407m2820l6319q2239J13984M6619
$$ 127007 93034 -31484 -11906 219110 144317 13910 -28910 -65229 -147468 -33484 13135
17116A3135k2397J1312N5705J2072n4o8601m5866j2300j29737M6197K6982J05476
$$ 13135 -9262 2050 57755 69827 69773 1172 -44694 -56994 -186731 -140534 -113552 -8076
17104h076L7317P0886k5530J2975M2798K7940q7778k6866J06775N1521j19633
$$ -8076 29241 100127 74597 87572 130370 158310 70532 43666 150441 201962 82329
17093H2329J5053j48753L840M9888J3050j89092L7742R1503J02484j9470Q1932
$$ 82329 97382 -51371 -47531 2357 15407 -173685 -135943 -44440 58044 38574 120506
17082A20506P278J41609L5662m9641l7781N0678J03424j1175p6464l2175j09435
$$ 120506 127784 269393 305055 255414 217633 268311 371735 360560 284096 251921 142486
17071A42486n4933l5566J50497J09025l0224n1974J4712P4682N8869r096O221
$$ 142486 87553 51987 202484 311509 281285 229311 244023 318705 377574 368478 374699
17060C74699J8199k5104M6552o9313o304l0086j01777j37671j8126J94446J55393
$$ 374699 392898 367794 414346 345033 338729 308643 206866 69195 51069 245515 400908
17049D00908L0085q1832k15896o7263J40174O8285k6411l6668J7764O705J07487
$$ 400908 430993 349161 133265 66002 206176 274461 248050 211382 229146 235851 343338
17038C43338l8615j5995R639O3034j6267k29991j45132R879P5608m5237Q1093
$$ 343338 304723 288728 298367 361401 345134 115143 -29989 -20110 55498 10261 91354
17027I1354J43388O6j34665r6748L5500R2520O9889J29298o0961p2206n7056O143
$$ 91354 234742 234808 100143 3395 38895 131415 201304 330602 269641 197435 140379 146522
17015A46522J35251p839q7199L0785K7721K3058L7838j4712K0570P87R5094j7261
$$ 146522 281773 273934 186735 217520 245241 268299 306137 291425 311995 312782 407876 390615
17003C90615p8438K1286Q9250j25545j20662r797j5985J8763L7029j2686j40561
$$ 390615 312177 333463 422713 297168 176506 166709 150724 169487 206516 193830 53269
16992E3269n666K07351Q9296Q8236N713k7791R6329l1257j54897j29837N7542
$$ 53269 47603 254954 344250 432486 438199 410408 506737 475480 320583 190746 248288
16981B48288J06252n7978k5945p021n5880q7629o1870P2803M2070O5273M0385
$$ 248288 354540 296562 270617 263596 207716 120087 58217 131020 173090 238363 278748
$$ [...]
##END NTUPLES=NMR SPECTRUM
##END=
