##TITLE=Analysis number 321013
Compound Code cc 00806
Project Code adrs
Chemist Name fudan
##JCAMPDX= 6.0         $$ Bruker NMR JCAMP-DX V2.0
##DATA TYPE= NMR SPECTRUM
##DATA CLASS= NTUPLES
##ORIGIN= Bruker BioSpin GmbH
##OWNER= nmr
$$ XWIN-NMR		Version 3.5
$$ Thu Jul 20 11:07:42 2006 GMT Daylight Time (UT+1h)  MAYBRIDGE\nmr@NMR_250MHZ
##.OBSERVE FREQUENCY= 250.131544655141
##.OBSERVE NUCLEUS= ^1H
##.ACQUISITION MODE= SIMULTANEOUS (DQD)
##.ACQUISITION SCHEME= undefined
##.AVERAGES= 16
##.DIGITISER RES= 18
##SPECTROMETER/DATA SYSTEM= dpx250
##.PULSE SEQUENCE= zg30
##.SOLVENT NAME= DMSO
##.SHIFT REFERENCE= (INTERNAL, DMSO, 0, 16.522)
##AUDIT TRAIL= $$ (NUMBER, WHEN, WHO, WHERE, WHAT)
$$ ##TITLE= Audit trail, XWIN-NMR		Version 3.5
$$ ##JCAMPDX= 5.01
$$ ##ORIGIN= Bruker BioSpin GmbH
$$ ##OWNER= nmr
$$ C:\u/data/dgb/nmr/ADRS/3170/pdata/1/auditp.txt
$$ ##AUDIT TRAIL=  $$ (NUMBER, WHEN, WHO, WHERE, WHAT)
(   1,<2006-07-20 11:07:19.63 +100>,<MAYBRIDGE\nmr>,<NMR_250MHZ>,
      <created by zg, POWCHK disabled, PULCHK disabled
       configuration hash MD5:
       E2 DF 36 D8 04 B2 41 60 5A D7 A3 38 5A 4B D0 FE
       data hash MD5: 64K
       12 17 28 01 E2 75 31 6C 73 75 4E B6 38 F5 26 66>)
(   2,<2006-07-20 11:07:32.46 +100>,<MAYBRIDGE\nmr>,<NMR_250MHZ>,
      <Start of raw data processing
       ef LB = 0.3 FT_mod = 6 PKNL = 1 SI = 32K 
       data hash MD5: 32K
       17 EE 00 53 FD 9D D1 21 48 80 0A 2F E6 EB DD BD>)
(   3,<2006-07-20 11:07:34.07 +100>,<MAYBRIDGE\nmr>,<NMR_250MHZ>,
      <apk 
       data hash MD5: 32K
       EB BB FD 8C AA 87 51 A8 00 E1 91 7D 02 B9 1F D9>)
(   4,<2006-07-20 11:07:34.79 +100>,<MAYBRIDGE\nmr>,<NMR_250MHZ>,
      <abs ABSG = 5 
       data hash MD5: 32K
       F4 98 A8 14 5C EC B4 C0 3E A0 A9 8C 20 D9 4B CD>)
$$ ##END=
$$ 
$$ hash MD5
$$ 33 9C 1D C1 23 F3 34 04 CF 79 2D C8 75 D2 12 EC
##$RELAX= 
##$RELAX= 
##$RELAX= 
##$RELAX= 
##$RELAX= 
##$RELAX= 
##$RELAX= 
$$ Bruker specific parameters
$$ --------------------------
##$DU= <C:\u>
##$EXPNO= 3170
##$NAME= <ADRS>
##$PROCNO= 1
##$TYPE= <nmr>
##$USER= <dgb>
##$AMP= (0..31)
100 100 100 100 100 100 100 100 100 100 100 100 100 100 100 100 100 100 
100 100 100 100 100 100 100 100 100 100 100 100 100 100 
##$AQSEQ= 0
##$AQ_mod= 3
##$AUNM= <au_zg>
##$AUTOPOS= <28 >
##$BF1= 250.13
##$BF2= 250.13
##$BF3= 250.13
##$BF4= 250.13
##$BF5= 500.13
##$BF6= 500.13
##$BF7= 500.13
##$BF8= 500.13
##$BYTORDA= 1
##$CFDGTYP= 0
##$CFRGTYP= 5
##$CHEMSTR= <none>
##$CNST= (0..31)
1 1 145 1 1 1 1 1 1 1 1 1 1 1 1 1 1 1 1 1 1 1 1 1 1 1 1 1 1 1 1 1 
##$CPDPRG= <>
##$CPDPRG1= <>
##$CPDPRG2= <>
##$CPDPRG3= <>
##$CPDPRG4= <mlev>
##$CPDPRG5= <mlev>
##$CPDPRG6= <mlev>
##$CPDPRG7= <mlev>
##$CPDPRG8= <mlev>
##$CPDPRGB= <>
##$CPDPRGT= <>
##$D= (0..31)
0 1 0 0 0 0 0 0 0 0.06 0 0 0 0 0 0 0.0002 0 0 0 0 0 0 0 0 0 0 0 0 0 0 
0 
##$DATE= 1153390038
##$DBL= (0..7)
120 120 120 120 120 120 120 120 
##$DBP= (0..7)
150 150 150 150 150 150 150 150 
##$DBP07= 0
##$DBPNAM0= <>
##$DBPNAM1= <>
##$DBPNAM2= <>
##$DBPNAM3= <>
$$ [...]
##$SUBNAM7= <"">
##$SUBNAM8= <"">
##$SUBNAM9= <"">
##$SW= 20.6930455092707
##$SWIBOX= (0..15)
0 0 3 0 0 0 0 0 0 0 0 0 0 0 0 0 
##$SW_h= 5175.983436853
##$TD= 65536
##$TD0= 1
##$TE= 295.16
##$TE2= 300
##$TE3= 300
##$TEG= 300
##$TL= (0..7)
0 120 120 120 120 120 120 120 
##$TP= (0..7)
150 150 150 150 150 150 150 150 
##$TP07= 0
##$TPNAME0= <>
##$TPNAME1= <>
##$TPNAME2= <>
##$TPNAME3= <>
##$TPNAME4= <>
##$TPNAME5= <>
##$TPNAME6= <>
##$TPNAME7= <>
##$TPOAL= (0..7)
0.5 0.5 0.5 0.5 0.5 0.5 0.5 0.5 
##$TPOFFS= (0..7)
0 0 0 0 0 0 0 0 
##$TUNHIN= 0
##$TUNHOUT= 0
##$TUNXOUT= 0
##$USERA1= <user>
##$USERA2= <user>
##$USERA3= <user>
##$USERA4= <user>
##$USERA5= <user>
##$V9= 5
##$VALIST= <valist>
##$VCLIST= <CCCCCCCCCCCCCCC>
##$VD= 0
##$VDLIST= <DDDDDDDDDDDDDDD>
##$VPLIST= <PPPPPPPPPPPPPPP>
##$VTLIST= <TTTTTTTTTTTTTTT>
##$WBST= 1024
##$WBSW= 4
##$XGAIN= (0..3)
0 0 0 0 
##$XL= 0
##$YL= 0
##$YMAX_a= 345793
##$YMIN_a= -546475
##$ZGOPTNS= <>
##$ZL1= 120
##$ZL2= 120
##$ZL3= 120
##$ZL4= 120
##$ABSF1= 16.522
##$ABSF2= -4.171173
##$ABSG= 5
##$ABSL= 3
##$ALPHA= 0
##$AQORDER= 0
##$ASSFAC= 0
##$ASSFACI= 0
##$ASSFACX= 0
##$ASSWID= 0
##$AUNMP= <proc_1d>
##$AZFE= 0.1
##$AZFW= 0.1
##$BCFW= 0
##$BC_mod= 0
##$BYTORDP= 0
##$COROFFS= 0
##$CY= 12.5
##$DATMOD= 1
##$DC= 0
##$DFILT= <>
##$DTYPP= 0
##$F1P= 14.0000005364418
##$F2P= -0.99999901652339
##$FCOR= 0.5
##$FTSIZE= 32768
##$FT_mod= 6
##$GAMMA= 0
##$GB= 0
##$INTBC= 1
##$INTSCL= 1
##$ISEN= 128
##$LB= 0.3
##$LEV0= 0
##$LPBIN= 0
##$MAXI= 10000
##$MC2= 0
##$MEAN= 0
##$ME_mod= 0
##$MI= 0
##$NCOEF= 0
##$NC_proc= -5
##$NLEV= 6
##$NOISF1= 0
##$NOISF2= 0
##$NSP= 0
##$NTH_PI= 0
##$NZP= 0
##$OFFSET= 16.522
##$PC= 1
##$PHC0= 156.5773
##$PHC1= 4.760038
##$PH_mod= 1
##$PKNL= yes
##$PPARMOD= 0
##$PSCAL= 4
##$PSIGN= 0
##$REVERSE= no
##$SF= 250.13
##$SI= 32768
##$SIGF1= 0
##$SIGF2= 0
##$SINO= 400
##$SIOLD= 32768
##$SREGLST= <1H.DMSO>
##$SSB= 0
##$STSI= 32768
##$STSR= 0
##$SW_p= 5175.98343685301
##$SYMM= 0
##$S_DEV= 0
##$TDeff= 65536
##$TDoff= 0
##$TI= <Analysis number 999999
Compound Code 99
Book Reference 9
Project Code 9>
##$TILT= no
##$TM1= 0
##$TM2= 0
##$TOPLEV= 0
##$USERP1= <user>
##$USERP2= <user>
##$USERP3= <user>
##$USERP4= <user>
##$USERP5= <user>
##$WDW= 1
##$XDIM= 32768
##$YMAX_p= 340889682
##$YMIN_p= -277107
$$ End of Bruker specific parameters
$$ ---------------------------------
##NTUPLES= NMR SPECTRUM
##VAR_NAME=  FREQUENCY,     SPECTRUM/REAL,   SPECTRUM/IMAG
##SYMBOL=    X,             R,               I
##VAR_TYPE=  INDEPENDENT,   DEPENDENT,       DEPENDENT
##VAR_FORM=  AFFN,          ASDF,            ASDF
##VAR_DIM=   32768,         32768,           32768
##UNITS=     HZ,            ARBITRARY UNITS, ARBITRARY UNITS
##FACTOR=    0.157963299565203, 1,           1
##FIRST=     4132.6476996994, 0,             0
##LAST=      -1043.33573715361, 0,           0
##MIN=       -1043.33573715361, -277107,     0
##MAX=       4132.6476996994, 340889682,     0
$$ Real data points
##PAGE= N=1
##DATA TABLE= (X++(R..R)), XYDATA
$$ [...]
19096a35496j1014R619P4888O0655j8052r7634J0999M6745j2058j00708K2052
$$ -135496 -146510 -136891 -62003 -1348 -19400 -117034 -106035 -59290 -71348 -172056 -150004
19085a50004K3786m424L4727P7437m2602k719m248J8759N365k0935k960P3125
$$ -150004 -126218 -130642 -95915 -18478 -61080 -63799 -68047 -49288 -43923 -64858 -67818 5307
19073E307M2979p1756k7722J2481M2275N9137K2240k9440M7044K6933N1101m7990
$$ 5307 48286 -23470 -51192 -38711 3564 62701 84941 55501 102545 129478 180579 132589
19061A32589J1572J1088k9196O50J1711n489k6991M3910l4708p59L9736q626k3819
$$ 132589 144161 155249 126053 126703 138414 132925 105934 149844 115136 114377 154113 145487 121668
19048A21668N9444p3728q0292J9554m8902N529O3217R546o2715k2019M6140O5104
$$ 121668 181112 107384 27092 46646 -2256 3273 66490 76036 13321 -8698 37442 102546
19036A02546j5737m403k2361P809J08416Q0583j06326l5958R4125N4625J3022
$$ 102546 86809 82406 60045 67854 176270 256853 150527 114569 208694 263319 276341
19025B76341m4754L165p656O0488R6817l9509L8302M9499J22335J96707J01374
$$ 276341 231587 234752 227096 287584 384401 344892 383194 432693 555028 751735 853109
19014H53109J6746L5402j7583j1002Q374j0016p9439q5092n1017l8569L7925K7258
$$ 853109 869855 905257 887674 876672 885046 875030 795591 710499 659482 620913 658838 686096
19002F86096Q7262M2563K4328n7594J0813Q306o4776p1546J3036j52664j43509
$$ 686096 773358 815921 840249 782655 793468 801774 736998 665452 678488 525824 382315
18991C82315n1953q479m5528p7771k5885J9601o9701k4856J5929Q5216L3309m8114
$$ 382315 330362 321883 276355 198584 172699 192300 122599 97743 113672 198888 232197 184083
18979A84083R048m5335j5667L4809J497o448m3032o7166r4187j9236N1063k786
$$ 184083 193131 147796 132129 166938 168435 161987 118955 51789 -42398 -61634 -10571 -13357
18967a3357J1779J9801K2213j4342J928O0713J38n4255r1021J4894R1721L4421
$$ -13357 -1578 18223 40436 26094 28022 88735 88873 34618 -56403 -41509 50212 84633
18955H4633k2235L8169R8039Q2106j27309l6424M3507N6089M3170l9056l5576
$$ 84633 62398 100567 198606 280712 153403 116979 160486 216575 259745 220689 185113
18944A85113n3342n8756j5506Q8945J11384l5296j15089o4901p1157O3029P3168
$$ 185113 131771 73015 57509 146454 257838 222542 107453 42552 -28605 34424 107592
18933A07592j9124q7021l944R492K4603Q662K5086L0434J796N297l2222m57n7198
$$ 107592 88468 1447 -2497 6995 31598 40260 65346 95780 97576 102873 70651 70194 12996
18920A2996Q0445j6486o2892L940p1380N715Q4327M2181o1055j8863O9419k123
$$ 12996 93441 76955 14063 18003 -53377 -47662 36665 78846 17791 -1072 68347 66224
18908F6224j06382k5157R011j5458l92J087P2280P4534n9740l1350Q3532N7876
$$ 66224 -40158 -65315 -56304 -71762 -72154 -71067 1213 75747 16007 -15343 68189 126065
18896A26065m4303j1215P410m919l8276o108k976l7578K4925M9445R447n7120
$$ 126065 81762 70547 77957 73038 34762 28654 25678 -11900 13025 62470 71917 14797
18884A4797k401N9661R0949N0083R038j20348p4037k6311K26k878n0774L3793
$$ 14797 12396 72057 163006 213089 222127 101779 27742 1431 1657 -1221 -51995 -18202
18872a8202K4559M2698R429k0318M4479M5483l6346j6576l5366M938m2854r166
$$ -18202 6357 49055 58484 38166 82645 128128 91782 75206 39840 44778 1924 -7242
18860g242K7961n5271o4936L717J01209O7420j045m9818K297j5701m5521L2484
$$ -7242 20719 -34552 -99488 -95771 5438 72858 71813 21995 24292 8591 -36930 -4446
18848d446j6674o9453m63o064N4482p834k7542l9172l8657L5128L7054L4658k1200
$$ -4446 -21120 -90573 -91036 -97100 -42618 -50452 -77994 -117166 -155823 -120695 -83641 -48983 -70183
18835g0183M0916K0338R8527M9280o7987l1494m1056K711O6040K353j7669K5089
$$ -70183 -29267 -8929 89598 138878 70891 39397 -1659 1052 67092 69445 51776 76865
18823G6865J2917j6497K301M016j3432j1883n0424J7087O0240K6331R255q192
$$ 76865 89782 73285 75586 79602 66170 54287 3863 20950 81190 107521 116776 108584
18811A08584J906j4189k8842n7429N4219L5192K1280l6898M7801L5235J0877l957
$$ 108584 110490 96301 67459 10030 64249 99441 120721 83823 131624 166859 177736 173779
18799A73779l7313J27223L1599L4076l687n3967L5212P0293Q7206O7103L5908
$$ 173779 136466 263689 295288 329364 325677 271710 306922 377215 464421 531524 567432
18788E67432r292j28210R0168O1323K4321J6503k2968j17415K528M0181O584K768
$$ 567432 558140 429930 520098 581421 605742 622245 599277 481862 484390 524571 531155 533923
18776E33923m6477n0607j525j7587k594O837o6239o4320m6812l5154j10935L4110
$$ 533923 487446 436839 435314 417727 415133 421970 355731 291411 244599 209445 98510 132620
18764A32620j6400j3651j5872L0049M6328j7249o7402m0959m0998N5587L5942
$$ 132620 116220 102569 86697 116746 163074 145825 78423 37464 -3534 52053 87995
18753H7995J9979k1678j220K590L8855J02190j0562n0563l9655M7298n3871p4791
$$ 87995 107974 86296 85076 87666 126521 228711 218149 167586 127931 175229 121358 46567
18741D6567p6726m6969O7358k9785K0246j770J2212k0482j0031l1886q966q477
$$ 46567 -30159 -77128 -9770 -39555 -19309 -21079 -8867 -29349 -39380 -71266 -80232 -88709
18729h8709J01016P8426J7374p3680n6735K9797j6718k0566M5726P9493k5662
$$ -88709 12307 90733 108107 34427 -22308 7489 -9229 -29795 15931 95424 69762
18718F9762q9834j0683Q5045J0782p0754m8139J7862P8471M0579m4550j27122
$$ 69762 -20072 -30755 54290 65072 -5682 -53821 -35959 42512 83091 38541 -88581
18707h8581l4144J56996J12885j4818l200L7019N457K7825L7994j5493K8603j41690
$$ -88581 -122725 34271 147156 132338 129138 166157 171614 199439 237433 221940 250543 108853
18695A08853r3022j6724J4457M4379L8616K5563L418o7851j33834K719J1338K0957
$$ 108853 15831 -893 13564 57943 96559 122122 125540 57689 -76145 -73426 -62088 -41131
18683d1131N1562L1972k5832k4538L4248m769n1178N5277M4010j39799k1967K2247
$$ -41131 10431 42403 16571 -7967 26281 21512 -29666 25611 69621 -70178 -92145 -69898
18671f9898M9590L3682l0622J7477R3184J284o6760J0988l0119p1238l1704k7609
$$ -69898 -20308 13374 -17248 229 93413 94697 27937 38925 8806 -62432 -94136 -121745
18659a21745N4124k031J6061N9606J3959m615L0528j7464q3381K0323K9699L6656
$$ -121745 -67621 -69652 -53591 6015 19974 15359 45887 28423 -54958 -34635 -4936 31720
18647C1720Q1146P5937K8994M898L9159m7445j3354k5330j02144L9820O6607k6875
$$ 31720 112866 188803 217797 222695 261854 214409 201055 175725 73581 113401 180008 153133
18635A53133m7407r1747q9829j175L8495J1135j0945K4019K0259p3976l6634J6212
$$ 153133 105726 13979 -75850 -77025 -38530 -27395 -38340 -14321 5938 -68038 -104672 -88460
18623h8460J9433P2746M477n5439j6302l4745j7769J7127L0511p9788o116J3724
$$ -88460 -69027 3719 8196 -47243 -63545 -98290 -116059 -98932 -68421 -148209 -154325 -140601
18611a40601o510Q8722J23213n2112k0814J9665P594m9496p6307J0592P1862o5402
$$ -140601 -147111 -58389 64824 12712 -8102 11563 19157 -30339 -106646 -96054 -24192 -89594
18599h9594J2048J13801N1313k8796k162L4790J3866K4462K0386L2830O1421j2451
$$ -89594 -77546 36255 87568 58772 56610 91400 105266 129728 150114 182944 244365 231914
18587B31914L1334j8625n1009j4072L1971m1598m8665k7324K741J4578j07955
$$ 231914 263248 244623 193614 179542 211513 169915 121250 93926 96667 111245 3290
18576C290P2757R2137j2935j8366n871N9489M6094q46q5622q2376N3369O3209
$$ 3290 76047 168184 155249 136883 131012 190501 236595 235749 150127 67751 121120 184329
18564A84329L0176L31K444O1746q3652j22930k0279K1513P9039O1317j6823m9775
$$ 184329 214505 214836 217280 279026 195374 72444 52165 73678 152717 214034 197211 147436
18552A47436j1889P2744p131l1111M8668o861L026J867M9636p0863k6768L5203
$$ 147436 135547 208291 201160 170049 218717 211856 214882 216749 266385 195522 168754 203957
18540B03957n1442j15902N4656J12995K8017k8564O722l0769l4291J3505N6624
$$ 203957 152515 36613 91269 204264 232281 203717 210439 179670 145379 158884 215508
18529B15508K5000j5360p3215j7814J981O2380L8595l878P518K1473n9154k175
$$ 215508 240508 225148 151933 134119 136100 198480 237075 233197 240715 262188 203034 200859
18517B00859o899M9919n233p664P9432P2630O4253P8804O5935k5817J2554j3803
$$ 200859 193960 243879 238646 230982 310414 383044 447297 526101 592036 566219 578773 564970
18505E64970n746k2593Q670Q1292k3802j41593j04643m0013j5364l4974k3047
$$ 564970 559224 536631 545301 626593 602791 461198 356555 316542 301178 266204 243157
18494B43157l6086k3809L5206j1536m565k0266k3270N4579k4973k7966N53p6617
$$ 243157 207071 183262 218468 206932 202367 182101 158831 213410 188437 160471 161024 84407
18482H4407K2972n9999m1421l9138O86J7247n2994j332L6267M5236M0991O4098
$$ 84407 107379 47380 5959 -33179 -32493 -15246 -68240 -69572 -33305 11931 52922 117020
18470A17020O0693O8881k41o5860j08939O756Q5546N7808K7813J31612R3060P1398
$$ 117020 177713 246594 246353 180493 71554 78310 163856 221664 249477 381089 474149 545547
18458E45547Q0556N3470J47720J43072J26093J31287J17253Q8762O3743k5976
$$ 545547 626103 679573 827293 970365 1096458 1227745 1344998 1433760 1497503 1471527
18448A471527q4972m8513m0539j08655p6755k5857k1980Q648m4550l6099n0592
$$ 1471527 1386555 1338042 1297503 1188848 1112093 1086236 1064256 1072904 1028354 992255 941663
18437I41663m4126L7653j7872o4146j13960m8178m2537M922k6713m4326J3248
$$ 941663 897537 935190 917318 853172 739212 691034 648497 653419 626706 582380 595628
18426E95628J8083q5809q3578r0928l1708p5768m3617P143L1542P1849L3921m2801
$$ 595628 613711 527902 444324 353396 321688 245920 202303 209446 240988 312837 346758 303957
18414C03957J045m6575j8508M7939O7335J541m1921p394J4983m520n1981M8342
$$ 303957 305002 258427 239919 287858 355193 356734 314813 307419 322402 317882 265901 314243
18402C14243N7105R937j6510k0776N2098L0081k3286n5596k914j0416K3199M6927
$$ 314243 371348 381285 364775 343999 396097 426178 402892 347296 344382 333966 357165 404092
18390D04092n6914m9851l276J9054n4372m7995p49K0694k758L107P9911J33648
$$ 404092 347178 297327 294051 313105 258733 210738 209989 230683 227925 231032 310943 444591
18378D44591l4306j07793L6710q192j14830p9100J7473J3508R6435M7465n2201
$$ 444591 410285 302492 339202 331010 216180 137080 154553 168061 264496 311961 259760
18367B59760M342J12781k5716K4712K4931m4680q4173o3539K3030O9437j6443
$$ 259760 264102 376883 351167 375879 400810 356130 271957 208418 231448 300885 284442
18356B84442O6614j700L2138n6997j4228M0297J3133J7253m6998M7474Q3093N1322
$$ 284442 351056 349356 381494 324497 310269 350566 363699 380952 333954 381428 464521 515843
18344E15843N0431K2527L3492Q1933J28443M7109K7522J07641Q3423L3224K8648
$$ 515843 566274 588801 622293 704226 832669 879778 907300 1014941 1098364 1131588 1160236
18333A160236Q8160Q5367N7805Q1635Q4130M6274J07013M0885j338R730J72899
$$ 1160236 1248396 1333763 1391568 1473203 1557333 1603607 1710620 1751505 1750167 1759897 1932796
18322A932796Q2046O6577R0408L4066J02724J34234J77302J07673J3181J63889
$$ 1932796 2014842 2081419 2171827 2205893 2308617 2442851 2620153 2727826 2741007 2904896
18312B904896K00286K06314J77080K00111K72930L62289L74661M72383N76778
$$ 2904896 3105182 3311496 3488576 3688687 3961617 4323906 4698567 5170950 5747728
18303E747728P96542J161520J458479J776799K221434K715979L194086L750431
$$ 5747728 6544270 7705790 9164269 10941068 13162502 15878481 19072567 22822998
18295B2822998M168786M649310N301320O159163O575749O524151O173081N666475
$$ 22822998 26991784 31641094 36942414 43101577 49677326 56201477 62374558 68041033
18287F8041033M830366M264174M181286M179372L461472K224383J057681J02239
$$ 68041033 72871399 77135573 81316859 85496231 88957703 91182086 92239767 92342006
18279I2342006o56991l12064J006524J935469J846266J026380K26638o02939j137346
$$ 92342006 91685015 91372951 92379475 94314944 96161210 97187590 97414228 96811289 95673943
18270I5673943j157238j323473k519450m183076n467983o361368p123399p039360
$$ 95673943 94516705 93193232 90673782 86490706 81022723 74661355 67537956 60498596
18262F0498596o135786n271560m868519m674553m502368m097934l601379l062936
$$ 60498596 54362810 49091250 44222731 39548178 35045810 30947876 27346497 24283561
18254B4283561k404706j967651j592259j241652j074994j040498r27846p45919
$$ 24283561 21878855 19911204 18318945 17077293 16002299 14961801 14033955 13288036
18246A3288036p43399o10550n91849n53074n20537n28528m99047l92079l73574
$$ 13288036 12544637 11934087 11342238 10789164 10268627 9740099 9241052 8848973 8475399
18237H475399l38581l74206k31338k76593l25453k37282k24540l20213l27734
$$ 8475399 8136818 7762612 7531274 7254681 6929228 6691946 6467406 6147193 5819459
18228E819459k25791j96191j78824j85747j25402j28990j71376j00471j20015
$$ 5819459 5593668 5397477 5218653 5032906 4907504 4778514 4607138 4506667 4386652
18219D386652j10892q6983j84065j52417m5161p7776j36398j59922r2377o4658
$$ 4386652 4275760 4188777 4004712 3852295 3807134 3729358 3592960 3433038 3340661 3276003
18209C276003l004j09876q1897k9869N2260k9733j21456m7699Q8928k587l8255
$$ 3276003 3272999 3163123 3081226 3051357 3103617 3073884 2952428 2904729 2993657 2991070 2952815
18198B952815r513o4693n972n5690r5176m7783l5931n1735o499J5135O5174J39667
$$ 2952815 2943302 2878609 2872637 2816947 2721771 2673988 2638057 2586322 2579823 2594958 2660132 2799799
18186B799799Q2108L7012K238M5886J15212P6096J22030O1841J6264J33892Q6423
$$ 2799799 2881907 2918919 2921157 2967043 3082255 3158351 3280381 3342222 3358486 3492378 3578801
18175C578801k1539O3969J09566l2435j04366j3574j2556m6794r038J1535K3796
$$ 3578801 3557262 3621231 3730797 3698362 3593996 3580422 3567866 3521072 3512034 3523569 3547365
18164C547365J8859M9351k2512l5763o5483L2832m2517n4437o8746r7525j20061
$$ 3547365 3566224 3615575 3593063 3557300 3491817 3524649 3482132 3427695 3358949 3261424 3141363
18153C141363j34527j23476k06720j54680n4952j20973j71062n6603l7627Q550
$$ 3141363 3006836 2883360 2676640 2521960 2467008 2346035 2174973 2118370 2080743 2089293
18143B089293k2991p2422j21599l5284q3413l8496m973o0463k6677n2918k7575
$$ 2089293 2066302 1993880 1872281 1836997 1753584 1715088 1710115 1649652 1622975 1570057 1542482
18132A542482o6340l5130m7829k0537j3929M0824N0690p4091r8253j11454p0623
$$ 1542482 1476142 1441012 1393183 1372646 1358717 1399541 1450231 1376140 1277887 1166433 1095810
18121A095810L065L0025p1921q0486j23887r1703k3480L8449K3762p7728K5961
$$ 1095810 1098875 1128900 1056979 976493 852606 760903 737423 775872 799634 721906 747867
18110G47867m3666n7911n6366K1779M8675K5401M770P1706K7632O000J171N0354
$$ 747867 704201 646290 589924 611703 660378 685779 690549 762255 789887 795887 797058 847412
18098H47412L391q685L0822m2807j05858l7780N7237Q6935l5818L5966Q2212P0372
$$ 847412 850803 842118 872940 830133 724275 686495 743732 830667 794849 830815 913027 983399
18086I83399R1896J66944J15094L3191O8593P8355L5414K2172m4856N9842Q9219
$$ 983399 1075295 1242239 1357333 1390524 1459117 1537472 1572886 1595058 1550202 1610044 1699263
18075A699263Q8022J8821O4825M0954L2368m4813j0540l8798J06722K3155n6167
$$ 1699263 1787285 1806106 1870931 1911885 1944253 1899440 1888900 1850102 1956824 1979979 1923812
18064A923812j6793L0774l2496n1870k5127k5628j03653j59431p3134j14052q2096
$$ 1923812 1907019 1937793 1905297 1853427 1828300 1802672 1699019 1539588 1466454 1352402 1270306
18053A270306p3241n0940o0776l3722k8436j1226p7884j26054r7940K2729P4827
$$ 1270306 1197065 1146125 1085349 1051627 1023191 1011965 934081 808027 710087 732816 807643
18042H07643L8946j5172M6991K207l1704n5648j23588M550j8044l2098J6396M231
$$ 807643 846589 831417 878408 880615 848911 793263 669675 674225 656181 624083 640479 644710
18030F44710J9848J12370o1138O700K8303m354l2241p6104P3459L6981M3523M7505
$$ 644710 664558 776928 715790 722490 750793 746439 714198 638094 711553 748534 792057 839562
18018H39562K4642r0844j03598l438l1211l1646N8355P2651O4081Q3603j08821
$$ 839562 864204 773360 669762 666324 635113 603467 661822 734473 798554 882157 773336
18007G73336j05112L435O2004Q0363j4991j1151j9574j2454n9690o2670K7322
$$ 773336 668224 671659 733663 814026 799035 787884 768310 755856 696166 633496 660818
17996F60818Q0003O8440K1869m6709j6590m1172j5056R0185Q7492L7570o275l6133
$$ 660818 740821 809261 831130 784421 767831 726659 711603 801788 889280 926850 920575 884442
17984H84442q272K8459q0490L496Q0830M0301O8668R3416J11461J71624J16803
$$ 884442 876170 904629 824139 827635 908465 948766 1017434 1110850 1222311 1393935 1510738
17973A510738M4022R0817J58399J18169O0286J79968J51337J72762L38221K29571
$$ 1510738 1554760 1645577 1803976 1922145 1982431 2162399 2313736 2486498 2824719 3054290
17963C054290K82195L59741L77478M42321N66528O88878Q57205J240064J750357
$$ 3054290 3336485 3696226 4073704 4516025 5082553 5771431 6628636 7868700 9619057
17954I619057K502978L676941M682761M822313M889471N561967N955732O546407
$$ 9619057 12122035 15798976 20481737 25304050 30193521 35755488 41711220 48257627
17946D8257627Q707833J1728151J1758490P811592O228933O317939L370879L439420
$$ 48257627 56965460 68693611 80452101 88263693 94492626 100810565 104181444 107620864
17938A07620864Q342718J2139478P847707K5118R30675j611133o358195K909Q180880
$$ 107620864 115963582 128103060 135950767 135975885 136906560 135295427 128937232 128940141 137121021
17929A37121021Q969340J860757p56609p54420n803363n708970M14953M639699
$$ 137121021 146090361 147951118 147194509 146440089 140636726 134927756 135342709 139982408
17921A39982408o95531q788260p213100j0324899j5419402j0987300n819837m730251
$$ 139982408 139286877 130498617 123285517 112960618 97541216 86553916 80734079 76003828
17913G6003828o856971p186492p096717q535945p754679n330125l547061k618584
$$ 76003828 69146857 61960365 54863648 46327703 38573024 33242899 29695838 27077254
17905B7077254k002730j565013j408313j318820j147633j001335r06119q33517
$$ 27077254 25074524 23509511 22101198 20782378 19634745 18633410 17727291 16893774
17897A6893774p97576o64720o48808p60398o79287n28170n44162n16940l43077
$$ 16893774 16096198 15431478 14782670 14022272 13342985 12814815 12270653 11753713 11410636
17888A1410636l46247l56627l41794l27566l48504l29464k88798k55559k05751
$$ 11410636 11064389 10707762 10365968 10038402 9689898 9360434 9071636 8816077 8610326
17879H610326j46795j90377j68684j23179j60953j67899j03729j03579j20227
$$ 8610326 8463531 8273154 8104470 7981291 7820338 7652439 7548710 7445131 7324904
17870G324904j12677j54374k14007j54588j38726o8108j66062j36984n5796n604
$$ 7324904 7212227 7057853 6843846 6689258 6550532 6482424 6316362 6179378 6123582 6117978
17860F117978l7022p2703p3780o819r873o9772j69990j30889p3489o8711K0373
$$ 6117978 6080956 6008253 5934473 5927654 5917781 5848009 5678019 5547130 5473641 5404930 5425303
17849E425303n2050o1416O8558Q6992K3654J75015K00269J85840K33320M41717
$$ 5425303 5373253 5311837 5380395 5467387 5491041 5666056 5866325 6052165 6285485 6727202
17839F727202N10863P39726J098003J433910J726527K086580K453526K688521
$$ 6727202 7238065 7977791 9075794 10509704 12236231 14322811 16776337 19464858
17831A9464858L211393L745583M215242M157686L444130K835912K472181K253790
$$ 19464858 22676251 26421834 30637076 34794762 38238892 41074804 43546985 45800775
17823D5800775J900932J410554O82653o33479j797398k015141j215482k56768
$$ 45800775 47701707 49112261 49794914 49161435 47364037 45348896 44133414 43876646
17815D3876646M36367P71392P72917O38959M33947K36923O4891k04626n09055
$$ 43876646 44313013 45084405 45857322 46496281 46930228 47167151 47232042 47027416 46518361
17806D6518361j311469k671703l942417m210849l771371l353454l011720k739602
$$ 46518361 45206892 42535189 38592772 34381923 30610552 27257098 24245378 21505776
17798B1505776k467204k045128j579053j200343r21253n83851m24390l20529j60907
$$ 21505776 19038572 16993444 15414391 14214048 13292795 12708944 12284554 11964025 11803118
17789A1803118l4917j9296P1498L19800O13197P88198J112456J509963J915113
$$ 11803118 11768201 11748905 11820403 12140203 12753400 13541598 14654054 16164017 18079130
17780A8079130K420817K849418L263640L853296M430783M693866M491479L729714
$$ 18079130 20499947 23349365 26613005 30466301 34897084 39590950 44082429 47812143
17772D7812143K926442K507176K328212J886461J196957L07233j095599k228466
$$ 47812143 50738585 53245761 55573973 57460434 58657391 58964624 57869025 55640559
17764E5640559k215187j248828j88463O92865J159503J094414P41446L60952K05728
$$ 55640559 53425372 52176544 51988081 52680946 53840449 54934863 55676309 56037261 56242989
17755E6242989l6294l17507q89120k027230l674013n063919n231644m621821m057823
$$ 56242989 56206695 55889188 55000068 52972838 49298825 44234906 39003262 34381441 30323618
17746C0323618l689943l347774k878530k328350j856279j489322j238578j026001
$$ 30323618 26633675 23285901 20407371 18079021 16222742 14733420 13494842 12468841
17738A2468841q40933o52957m39699m24710m73591m71692l71781l21833l99845
$$ 12468841 11627908 10974951 10535252 10110542 9636951 9165259 8793478 8471645 8071800
17729H071800l22979k79488k60981j03606r0819k70171j77699r2178j81160j67345
$$ 8071800 7748821 7469333 7208352 7104746 7013927 6743756 6566057 6473879 6292719 6125374
17719F125374k03377j97630l8192r6176q5245l7892K7159o5002p3493r1152l4499
$$ 6125374 5921997 5724367 5686175 5589999 5504754 5466862 5494021 5429019 5355526 5264374 5229875
17708E229875N5338J32729J27435J87606J73119K38667L80990M50193N30544P43175
$$ 5229875 5285213 5417942 5545377 5732983 5906102 6144769 6525759 6975952 7506496 8249671
17698H249671J142121J879715K928930L832435L705553L010883L613406O025714
$$ 8249671 9391792 11271507 14200437 18032872 21738425 24749308 28362714 34388428
17690C4388428Q798029Q606437N238404K906381J638070J888951L545734L663767
$$ 34388428 43186457 51792894 57031298 59937679 61575749 63464700 67010434 70674201
17682G0674201K886676j348082p579600n450796j913827M59705K116218J947846
$$ 70674201 73560877 72212795 64633195 59182399 57268572 57728277 59844495 61792341
17674F1792341J662514N88506r0345p45950k9590J531330J516870M21317m517245
$$ 61792341 63454855 64043361 63953016 63207066 63177476 64708806 66225676 66646993 62129748
17665F2129748j0175950p658884m194447k755588l517053n461252n037414l191632
$$ 62129748 51953798 44294914 40100467 37344879 33827826 28366574 23329160 20137528
17657B0137528k008293j330114r69412o84357m92034l76269k69364j98287q5730
$$ 20137528 18129235 16799121 15829709 15145352 14653318 14277049 14007685 13809398 13723668
17648A3723668J27253L38001N55582J053308J785904L122697M546604M815981
$$ 13723668 13850921 14188922 14744504 15797812 17583716 20706413 25253017 30068998
17640C0068998M013301M159443O722171J0641161J1690747P996032M217628K392263
$$ 30068998 34082299 38241742 44963913 55605074 67295821 75291853 79509481 81901744
17632H1901744J864306L990866M811930M119945N24759q443736q333455l552067
$$ 81901744 83766050 87756916 92568846 96688791 97213550 88769814 80436359 76884292
17624G6884292j35229K462193K983514K609630J315814p204p66537n61718J734269
$$ 76884292 76749063 79211256 82194770 84804400 86120214 86113010 85346473 84784755 86519024
17615H6519024K250402J045611l685491j3018925j1970055o716015m302627m497594
$$ 86519024 88769426 89815037 86129546 73110621 61140566 54424551 50121924 45624330
17607D5624330o984799p325941n198332l239330k226886j704792j248468r95943
$$ 45624330 38639531 31313590 26115258 22875928 20649042 18944250 17695782 16699839
17599A6699839q31558p63069p59305p31265o89412o09131o10293n22956m36633
$$ 16699839 15868281 15105212 14345907 13614642 12925230 12316099 11705806 11182850 10746217
17590A0746217l88604l81434m38984m46129l32170l97070k72334k74530k97346
$$ 10746217 10357613 9976179 9537195 9091066 8758896 8361826 8089492 7814962 7517616
17581G517616k21279k02581k33194j84569j93427k10176k02570j75613k33277
$$ 7517616 7296337 7093756 6860562 6675993 6482566 6272390 6069820 5894207 5660930
17572E660930j75850j00369j12676p5576n7443m7349l9755N0521k4423j34849
$$ 5660930 5485080 5384711 5272035 5196459 5139016 5091667 5051912 5102433 5078010 4943161
17562D943161k03723j23842j00641q0510j3703n5222j54139k05690j15365j21327
$$ 4943161 4739438 4615596 4514955 4434445 4420742 4365520 4211381 4005691 3890326 3768999
17552C768999l5116L5297l6087j36990j16336j05304o9293k5442r6717j68877
$$ 3768999 3733883 3769180 3733093 3596103 3479767 3374463 3305170 3279728 3183011 3014134
17542C014134j44616j36533r8891j15840r2159r6864m5165m0327m9704o1925q7962
$$ 3014134 2869518 2732985 2634094 2518254 2426095 2329231 2284066 2243739 2194035 2132110 2044148
17531B044148q7507J6290o7668k0711M6691o2614n4826j36571n1106o1063q5763
$$ 2044148 1956641 1972931 1905263 1884552 1931243 1868629 1813803 1677232 1626126 1565063 1479300
17520A479300K371k9233m6495J3049k5271k1356k928N8969k0289J9460k381j1236
$$ 1479300 1481671 1452438 1405943 1418992 1393721 1372365 1369437 1428406 1408117 1427577 1425196 1413960
17508A413960l3855M746l3836J2325l7009r2731j3404R376j3708M4496p1816m9842
$$ 1413960 1380105 1384851 1351015 1363340 1326331 1233600 1220196 1229572 1215864 1260360 1188544 1138702
17496A138702L0475J5357p169l5793l310M8519R8779J26351P6627J15949J17617
$$ 1138702 1169177 1184534 1177365 1141572 1138262 1186781 1285560 1411911 1488538 1604487 1722104
17485A722104Q2469l873Q9659J33678Q2041J12071P274j14973j88798k05000j77534
$$ 1722104 1804573 1800700 1890359 2024037 2106078 2218149 2225423 2110450 1921652 1716652 1539118
17474A539118j28632j89859j04006J3200p9743r1304k520p1200J9990K2086J571
$$ 1539118 1410486 1220627 1116621 1129821 1050078 958774 956254 885054 905044 927130 928701
17463I28701k447k8112M1277K5605p891o2864r7973k7643j573Q3654L8553K7462
$$ 928701 926254 898142 939419 965024 957133 894269 796296 768653 767080 850734 889287 916749
17451I16749j24992j10396k8436r4071J3334R6544N1846K3747M5913n4646p0225
$$ 916749 791757 681361 652925 558854 572188 668732 720578 744325 790238 735592 665367
17440F65367M3986L8741J02829O2341Q0721J10425J22855J80088J75281L9235
$$ 665367 709353 748094 850923 913264 993985 1104410 1227265 1407353 1582634 1621869
17430A621869m3480J58787J28636J2072N4330j0939q6398j02547q9943r9094k2743
$$ 1621869 1578389 1737176 1865812 1877884 1932214 1921275 1834877 1732330 1642387 1543293 1520550
17419A520550J5897O00o841K4530M3599J2447l9985p285J7206o0405R650j8864
$$ 1520550 1536447 1537047 1530206 1554736 1598335 1610782 1570797 1563512 1580718 1520313 1529963 1511099
17407A511099L3086J0027l5172k6273j6949J1030m1229r7152o6604j04177j32089
$$ 1511099 1544185 1554212 1519040 1492767 1475818 1486848 1445619 1348467 1281863 1177686 1045597
17396A045597n0279l9567M8529L1687j24678q0070q936q9293q1406L7677N7905
$$ 1045597 995318 955751 1004280 1035967 911289 831219 822283 732990 651584 689261 747166
17385G47166Q2897J6738J5478r612n920m3076k87N274k7572L2202R617p1435l5295
$$ 747166 830063 846801 862279 852667 846747 803671 803384 808658 781086 813288 822905 751470 716175
17372G16175N6972m359M1084j2932k126O4939Q9448R4659m2987j9913l0685K5453
$$ 716175 773147 768788 809872 796940 794814 859753 949201 1043860 1000873 980960 950275 975728
17360I75728k7505O9846m5551r2036J0147K4658M1510m1191N0685O0180P4777
$$ 975728 948223 1018069 972518 880482 890629 915287 956797 915606 966291 1026471 1101248
17349A101248J2427K2132J69732J46209J04849K29653J36080J08756J50624J44863
$$ 1101248 1113675 1135807 1305539 1451748 1556597 1786250 1922330 2031086 2181710 2326573
17339B326573J90017Q7224P8249R6455N8708J00648R0117J83288K57000L27701
$$ 2326573 2516590 2603814 2682063 2778518 2837226 2937874 3027991 3211279 3468279 3795980
17329C795980L38516L81514N51699O22124P36543R67741J187283J568359K273373
$$ 3795980 4134496 4516010 5067709 5689833 6426376 7394117 8581400 10149759 12423132
17320A2423132L242484N076064P911731J0841043J3900715J8096004J9560343
$$ 12423132 15665616 20741680 28653411 39494454 53395169 71491173 91051516
17313I1051516J8024066J8448220J7710130J4537601J1486344P675535N981910
$$ 91051516 109075582 127523802 145233932 159771533 171257877 178933412 184915322
17306A84915322l799007j7175778j6465077k2541729k8810418k1138681j6443952
$$ 184915322 181116315 163940537 147475460 124933731 96123313 74984632 58540680
17299E8540680j3266827q414128n018099l354105k398939j801397j427936j284087
$$ 58540680 45273853 36859725 31841626 28487521 26088582 24287185 22859249 21575162
17291B1575162j240328j003680r27033q93201p58833p62858p06943o04581n79510
$$ 21575162 20334834 19331154 18404121 17510920 16752087 15989229 15282286 14677705 14098195
17282A4098195n58239l99387l42550k38525k26092j65685p2453n3440P803J20840
$$ 14098195 13539956 13140569 12798019 12559494 12333402 12167717 12095264 12041824 12049627 12170467
17272A2170467J39227L08165N21213P96042J137458J926731L347090N220683P430915
$$ 12170467 12309694 12617859 13139072 13935114 15072572 16999303 20346393 25567076 32997991
17263C2997991R601958J2710792J4637373J3548921J3555563J3672281J1321281
$$ 32997991 42599949 55310741 69948114 83497035 97052598 110724879 122046160
17256A22046160R107465O266640M760959O9831j1666706j2879670j4837942k2009643
$$ 122046160 131153625 137420265 142181224 142251055 130584349 117704679 102866737 80857094
17248H0857094j7699005j2893462j0861099p428456m580468k890502k015556j440447
$$ 80857094 63158089 50264627 39403528 31975072 27394604 24504102 22488546 21048099
17240B1048099j239210j190904r77955q30607q07677p87307p10317o82695n56607
$$ 21048099 19808889 18617985 17640030 16809423 16001746 15214439 14504122 13821427 13264820
17231A3264820m08765k99193j82762j36119K9677P9151R6118J64806K06202P885
$$ 13264820 12856055 12556862 12374100 12237981 12267658 12346809 12442927 12607733 12813935 12821820
17221A2821820r330K3144o7570k68376l61106m36278m02172m31186l46540j06507
$$ 12821820 12812490 12835634 12768064 12499688 12138582 11702304 11300132 10868946 10522406 10415899
17211A0415899M6847J23443L31948O51790Q78095J342093J859367K672983L912283
$$ 10415899 10462746 10586189 10918137 11569927 12448022 13790115 15649482 18322465 22234748
17202B2234748N523614P244367R093082J0521416J0884237J0382613R490442Q227703
$$ 22234748 27758362 35002729 44095811 54617227 65501464 75884077 85374519 93602222
17194I3602222O948087N436781L343067k01937n064912r349935j2247390j3766524
$$ 93602222 100550309 105987090 109330157 109128220 104063308 94713373 82465983 68699459
17186F8699459j2929175j0570137q062083n851903m221673l021334k250038j635871
$$ 68699459 55770284 45200147 37138064 31286161 27064488 24043154 21793116 20157245
17178B0157245j208994r61631q87132p49856n90150l32852k92077k60692j98360
$$ 20157245 18948251 17986620 17099488 16349632 15759482 15426630 15134553 14873861 14675501
17169A4675501j18346j38017j09383r4556j43457k59445l91780m94352o12899
$$ 14675501 14557155 14419138 14309755 14215199 14071742 13812297 13420517 12926165 12313266
17160A2313266n30180m49766j72363k0434M4249K50944M13735N99360R87116J584473
$$ 12313266 11783086 11333320 11160957 11140523 11184772 11435716 11849451 12448811 13435927 15020400
17150A5020400K427951L528785M943314O552997Q177225R127291R063965Q576384
$$ 15020400 17448351 20977136 25920450 32473447 40650672 49777963 58841928 67418312
17142F7418312P807976O672611N600720M383197K311539j192997n479618q799854
$$ 67418312 75226288 81898899 87499619 91882816 94194355 93001358 87521740 78721886
17134G8721886j1138793j2111181j0944765q687665o500952m746097l219111k287679
$$ 78721886 67583093 55471912 44527147 35839482 29338530 24592433 21373322 19085643
17126A9085643j729602j412091j070793r35881p86628o86972o05771o38425o13531
$$ 19085643 17356041 15943950 14873157 13937276 13150648 12463676 11857905 11219480 10605949
17117A0605949m48442l85865m94372m86403m17951l69706l17545k98253j88831
$$ 10605949 10157507 9771642 9277270 8790867 8372916 8003210 7685665 7387412 7198581
17108G198581j72948k66139k84862k28570k84048l38245k32323j60224k08359
$$ 7198581 7025633 6759494 6474632 6246062 5962014 5623769 5391446 5231222 5022863
17099E022863k31294k47886j63867q4565o0079l9622j23011j18816q0383j68686
$$ 5022863 4791569 4543683 4379816 4295251 4235172 4195550 4072539 3953723 3873340 3704654
17089C704654j40614n5963p5088j13719j13123j27454j06564j33454j08884o8145
$$ 3704654 3564040 3508077 3432989 3319270 3206147 3078693 2972129 2838675 2729791 2661646
17079B661646k6261l9165l4805q0840j39609q9187j15492m0736J7760l8372n2906
$$ 2661646 2635385 2596220 2561415 2480575 2340966 2251779 2136287 2095551 2113311 2074939 2022033
17068B022033J9843J6547l5690j04894p8935m7544l6474k5108k0329n8169j2601
$$ 2022033 2041876 2058423 2022733 1917839 1838904 1791360 1754886 1729778 1709449 1651280 1638679
17057A638679L0307k1431j32401j471o9373l5632J455l513K2072l2563l8770p4465
$$ 1638679 1668986 1647555 1515154 1513683 1444310 1408678 1410133 1406620 1428692 1396129 1357359 1282894
17045A282894o6198k7428m1555l3790k6234l3216K8100n971j09518o5079K0617
$$ 1282894 1216696 1189268 1147713 1113923 1087689 1054473 1082573 1076602 967084 902005 922622
17034I22622P921j719p2484l8844Q6186j7558o1165j0181j6794M2597n305r093
$$ 922622 930543 928824 856340 817496 903682 886124 824959 814778 797984 840581 835276 826183
17022H26183m0459o0283L5039O2633l8349J4386J9139m40j13743j11487L9233
$$ 826183 785724 725441 760480 823113 784764 799150 818289 817849 704106 592619 631852
17011F31852j4198p414j7592q041k0164N1242j6451K594m8373o2460j33511o0056
$$ 631852 617654 610240 592648 584607 564443 615685 599234 601828 553455 490995 357484 297428
16999B97428K3369L2781l3280N4888M9111J0954O0265L2148q9227p1680M3766
$$ 297428 320797 353578 320298 375186 424297 435251 495516 527664 438437 366757 410523
16988D10523P5449J3990L3777q8496j0737N5795K8083j694j16062j4271J19875
$$ 410523 485972 499962 533739 445243 434506 490301 518384 516690 400628 386357 506232
16977E06232k435n0547r953Q6206l2704q5428p070k9354k4574j5536k530L2689
$$ 506232 503797 453250 443297 529503 496799 411371 404301 374947 350373 334837 332307 364996
16965C64996j6769o8317M3298J4821n759O6763o5314o9146J0448r092J7933j206
$$ 364996 348227 279910 323208 338029 332270 399033 333719 264573 275021 265929 283862 282656
16953B82656n4441M5615Q8347M8368J2418j04326r5312j01173J1637L5786O2038
$$ 282656 228215 273830 362177 410545 422963 318637 223325 122152 133789 169575 231613
16942B31613L8333j4492o927l2486N4658K2431m1152R522p992m756J0861k1092
$$ 231613 269946 255454 248527 216041 270699 293130 251978 261500 253508 248752 259613 238521
16930B38521p0087j462J6751J2764m423M7990J1533l2565J1526J8118Q0300O3896
$$ 238521 168434 166972 183723 196487 192064 240054 251587 219022 230548 248666 328966 392862
16918C92862k8588p4907l809J7871m6153j29000j8993L3093N135M0926o143K2866
$$ 392862 364274 289367 285558 303429 257276 128276 109283 142376 147511 188437 182294 205160
16906B05160P9449k5732R657L6577o2737l1031Q9051k9880O775M448m844k0480
$$ 205160 284609 258877 268534 305111 242374 211343 300394 270514 277289 281737 276893 256413
16894B56413L5947l2475j7249n7072n9718L9568N1724k5199n0808L3242q979O49
$$ 256413 292360 259885 242636 185564 125846 165414 217138 191939 141131 174373 165394 166043
16882A66043J717r120M1171J029k228k8876j5339l0300k5040O4205L2484j034
$$ 166043 167760 158640 199811 200840 198612 169736 154397 124097 99057 163262 195746 194712
16870A94712p8473l6296M2429N9028n3712k6437n885J5060P8919j5283n3039k3727
$$ 194712 116239 79943 122372 181400 127688 101251 95366 110426 189345 174062 121023 97296
16858I7296k7264m8753r093O639O1627j18N0508j762K5723l6804l1333l786l337
$$ 97296 70032 21279 12186 18825 80452 80334 130842 129080 154803 117999 86666 82880 79543
16845G9543Q883J0427o1342l0653P4603M4907J4361K2912n4148l1807l374M7618
$$ 79543 88426 98853 37511 6858 81461 126368 140729 163641 109493 77686 74312 121930
16833A21930K035M4562j4571m6506J1671J3633L0080l1640k9868l1853J0624k5498
$$ 121930 123965 168527 153956 107450 119121 132754 162834 131194 101326 69473 80097 54599
16821E4599K6899j5103j8349R9634N2850n8803j02913L168L3654J4925J32530
$$ 54599 81498 66395 48046 147680 200530 141727 38814 41982 75636 90561 223091
16810B23091Q5332p7000p9361l9744k470l9224J9360l048N9519J48162J4059r233
$$ 223091 308423 231423 152062 112318 109848 70624 89984 86936 146455 294617 308676 299443
16798B99443N3717J0665J3769Q1396J16021P4861O2306P9232N8017n5083P7786
$$ 299443 353160 363825 377594 458990 575011 649872 712178 791410 849427 794344 872130
16787H72130Q5070J7066q0738j34669j31427j16721q8310o1616j2814l8422K261
$$ 872130 957200 974266 893528 758859 627432 510711 422401 360785 347971 309549 311810
16776C11810o4339r3652n1674J0293j26121O0286J30162n5135m742O7983M6947
$$ 311810 247471 153819 102145 112438 -13683 46603 176765 121630 116888 184871 231818
16765B31818m0418N4550L642l8075m6630O545Q512o287J2545L5079q186K4859
$$ 231818 191400 245950 249592 211517 164887 171432 179944 173657 186202 221281 213095 237954
16753B37954n3189k8911n0952n7814j7816Q5081P5287m4382r420N0538N8372J11237
$$ 237954 184765 155854 104902 47088 29272 114353 189640 145258 135838 186376 244748 355985
16741C55985J71976J26775J12073K0753r554N3857R0791K5428p8176r4819l2291
$$ 355985 527961 654736 766809 787562 778008 831865 922656 948084 869908 775089 742798
16730G42798p5197j39066j23011o7428k7488l4114l1853J4784l9413r4542k9337
$$ 742798 667601 528535 405524 338096 310608 276494 244641 259425 220012 125470 96133
16719I6133P7483k6727j1020P9500n21m9641m5400n1814J9771J2886O2155j9711
$$ 96133 173616 146889 135869 215369 214848 165207 119807 67993 87764 100650 162805 143094
16707A43094l5078m1607P7256J34200R955q4820k1671j1699K1993m0211k1776
$$ 143094 108016 66409 143665 277865 287820 203000 181329 169630 191623 151412 129636
16696A29636K5512Q8041n2448L6121K1525J040m4960n8894P4653J28733K0607
$$ 129636 155148 243189 190741 226862 248387 249427 204467 145573 220226 348959 369566
16685C69566o2043J7851N0515J53223m3778n993K6378j1149k1279N140j8106q9558
$$ 369566 307523 325374 375889 529112 485334 479341 505719 494570 473291 478431 460325 370767
16673C70767k2031k1633m1028J9303l1699q7349j23839R672P2492m0472n85k0843
$$ 370767 348736 327103 286075 305378 273679 186330 62491 72163 144655 104183 103598 82755
16661H2755K067L0352R176p2579r741L053J01004J13618P924j09119q0859K652
$$ 82755 84822 115174 124350 51771 42030 45083 146087 259705 267629 158510 77651 80303
16649H0303M5867l3000k2700M7383m9673j1078k6652k5261Q8951P4329m2323k0711
$$ 80303 126170 93170 70470 117853 68180 57102 30450 5189 94140 168469 126146 105435
16637A05435J6871N0228N2653N5200k0313J5616O3297M9235Q8495P8797l1389
$$ 105435 122306 172534 225187 280387 260074 275690 338987 388222 476717 555514 524125
16626E24125J0065J1967m8941k5789J0398o1920o7101l6377l1030m8182o1205
$$ 524125 534190 546157 497216 471427 481825 419905 352804 316427 285397 237215 176010
16615A76010k0111m7309L0021K9714l9182j1470m688l0085q0043n6241J2884J02
$$ 176010 155899 108590 138611 168325 129143 117673 112985 82900 2857 -53384 -40500 -40398
16603d0398j7744J2031j8288P644N765K9635k0254K0753L5070R781M1432P6892
$$ -40398 -58142 -46111 -64399 -56755 -50990 -21355 -41609 -20856 14214 23995 65427 142319
16591A42319m7207J6218l8288L7063O5891j08714j07124j2355O7966N8483k0843
$$ 142319 95112 111330 73042 110105 175996 67282 -39842 -52197 15769 74252 53409
16580E3409k2901r407m4324N3684L7830k6815L6261M6947j9706M4789J7661J465
$$ 53409 30508 21101 -23223 30461 68291 41476 77737 124684 104978 149767 167428 168893
16568A68893P979k056j1629k5326J7053j1151l8725q4047j4197p374l14R6014
$$ 168893 176872 174816 163187 137861 154914 143763 105038 20991 6794 -580 -894 95120
16556I5120M4886l4083k9998n0494r4470o1203j2619J05452Q8452Q4758O4184
$$ 95120 140006 105923 75925 25431 -69039 -130242 -142861 -37409 51043 135801 199985
16545A99985O744o5592l8180k2171l6077l0466o9781J4059k5207m3831J05559
$$ 199985 206729 141137 102957 80786 44709 14243 -55538 -41479 -66686 -110517 -4958
16534d958O4033l1810k9129k947m6330o7190M3258M6864K215R6785N9850m0665
$$ -4958 59075 27265 -1864 -4811 -51141 -118331 -75073 -28209 -25994 70791 130641 89976
16522H9976n3425n1537j1934k1655M757M6480L2261M5616l9417o1011q0310K5684
$$ 89976 36551 -14986 -26920 -48575 -43818 2662 34923 80539 41122 -19889 -100199 -74515
16510g4515N0471j2737O63j4801k0437q29L8155L8303J4634L0629l4959Q026N5050
$$ -74515 -24044 -36781 -36118 -50919 -71356 -72185 -34030 4273 18907 49536 14577 22603 77653
16497G7653Q0515o2332p4607m1719m2886M1156O3274J4848L358M1283l15k1705
$$ 77653 158168 95836 21229 -20490 -63376 -22220 41054 55902 59260 100543 100228 78523
16485G8523q5252q5671n2335Q8612P5799k8568K5163M3244K141p2625K6506k281
$$ 78523 -6729 -92400 -144735 -56123 19676 -8892 16271 59515 61656 -10969 15537 13256
16473A3256N751J10411K4181m7879J664N5403k2917j02565j23503m3057k763O0282
$$ 13256 19007 129418 153599 105720 107384 162787 139870 37305 -86198 -129255 -132018 -71736
16461g1736M4100j3867K8517P6629j11598o0542P1248L1333K4969K429O3868J7400
$$ -71736 -27636 -41503 -12986 63643 -47955 -108497 -37249 -5916 19053 21482 85350 102750
16449A02750j0429M1593k9628J653N7040l2761m5218n7605j5619k9977K8141N9848
$$ 102750 92321 133914 104286 105939 162979 130218 85000 27395 11776 -18201 9940 69788
16437F9788L214m2326K2683O2595n452n3331k766j9174j6150M7336n4668J5795
$$ 69788 73002 30676 53359 115954 110502 57171 54405 35231 19081 66417 11749 27544
16425B7544p613m6189L2129n1180m4647m9402q460P2380J67272P9733n5926p250
$$ 27544 19931 -26258 5871 -45309 -89956 -139358 -147818 -75438 91834 171567 115641 108391
16413A08391N9922l6019p445l7637k3663q147n5369j3611M0957P0867j09173J2680
$$ 108391 168313 132294 124849 87212 63549 55402 33 -13578 27379 98246 -10927 1753
16401A753M6327k0694J0651K9025L2078j4779Q683K0737j6891L4907r8322p2335
$$ 1753 48080 27386 38037 67062 99140 84361 93044 113781 96890 131797 33475 -38860
16389c8860N4225M8938J9067m7354l4216j8733O5112p702r86O0135M1553p338
$$ -38860 15365 64303 83370 36016 1800 -16933 48179 40477 39491 99626 141179 133841
16377A33841n0145j7248o3828Q67N144q3881l342K8508J5981J3952J2710P235
$$ 133841 83696 66448 2620 3487 8631 -75250 -78592 -50084 -34103 -20151 -7441 -206
16365b06n5060M9718k170m5951N7686R5869R2102j0299l1600k9259m0857k6555
$$ -206 -55266 -5548 -7718 -53669 4017 99886 191988 181689 150089 120830 79973 53418
16353E3418n3884m0221l0726l1139p800P4680N5141M2138J162M2920M0911j4671
$$ 53418 -466 -40687 -71413 -102552 -110352 -35672 19469 61607 62769 105689 146600 131929
16341A31929P99L6978J3074o6530K4319l3493K3879k0357q0318l7969L6591k9622
$$ 131929 132728 169706 182780 116250 140569 107076 130955 110598 30280 -7689 28902 -720
16329g20l673M160K784J5898M7860O9324n8761M9599J3127K220M7538m1918l5411
$$ -720 -4393 -233 2551 18449 66309 135633 76872 126471 139598 141818 189356 147438 112027
16316A12027k5820p872J4662l7859J0526q70m7558j3387n7781m0780M1260Q4284
$$ 112027 86207 78335 92997 55138 65664 64794 17236 3849 -53932 -94712 -53452 30832
16304C0832j6608n2335J04012O0389l6664K4987o941P395n5381L788K1258J2783
$$ 30832 14224 -38111 65901 126290 89626 114613 107672 115067 59686 63474 84732 97515
16292I7515l2243n8072p4604l4171M7863K7990M7778J3593j5023m6054n1433P423
$$ 97515 65272 7200 -67404 -101575 -53712 -25722 22056 35649 20626 -25428 -76861 -69438
16280f9438k739J2003K1407J0810K2219N321q3764J3928O2670k6652j708J9779
$$ -69438 -72177 -60174 -38767 -27957 -5738 -417 -84181 -70253 -7583 -34235 -35943 -16164
16268a6164r1144p84P3538N7791k3065o4435k9304O1118J7296K1627M8132J3602
$$ -16164 -107308 -108092 -34554 23237 172 -64263 -93567 -32449 -15153 6474 54606 68208
16256F8208L1634M2130q2198o5369K5765J5432l1049L7046Q979j3124J3106J8807
$$ 68208 99842 141972 59774 -5595 20170 35602 4553 41599 50578 37454 50560 69367
16244F9367k6504o2675J4636N3443O2556K2748l8144n1516p3640r5529L0484J03484
$$ 69367 42863 -19812 -5176 48267 110823 133571 95427 43911 -29729 -125258 -94774 8710
16232H710k2174N41K7777J20306N6993l6189l6538n9935n069m5803o8899m0809
$$ 8710 -13464 -12923 14854 135160 192153 155964 119426 59491 54422 8619 -60280 -101089
16220a01089O918m7725M3761M7150O8592l8484o3945o6091N3392p277r044j04
$$ -101089 -94171 -141896 -98135 -50985 17607 -20877 -84822 -150913 -97521 -104798 -113842 -113946
16208a13946J19050L8042o4212r4239K8871K8810q0172N569j27J1502P9526K3679
$$ -113946 5104 43146 -21066 -115305 -86434 -57624 -137796 -132227 -132354 -120852 -41326 -17647
16196a7647k1646N9625L0027M3269N5677J6244m9549L4508j996j21623j31231
$$ -17647 -39293 20332 50359 93628 149305 165549 116000 150508 148512 26889 -104342
16185a04342j05629M846P8251J22029J05440p039o0515j2832M1926j2123r725
$$ -104342 -209971 -205125 -126874 -4845 100595 93556 33041 20209 62135 50012 40287
16174D0287j0056K7219K7848o3396l0075m5813l3519r977M2334P7465m6258m760
$$ 40287 30231 57450 85298 21902 -8173 -53986 -87505 -97482 -55148 22317 -23941 -28701
16162b8701Q5205M9249l3201q46j5951K3606o1277n2818L0909J4536l9337J5376
$$ -28701 56504 105753 72552 71706 55755 79361 18084 -34734 -3825 10711 -28626 -13250
16150a3250M9922n797M6496q971n4832M4594r606p1147J5800K3491o5902K626
$$ -13250 36672 30875 77371 68400 13568 58162 48556 -22591 -6791 16700 -49202 -46576
16138d6576M0935r6325M2123O1084l6665k119j0327m7379j2860k6637J00668K4800
$$ -46576 -5641 -101966 -59843 1241 -35424 -37543 -47870 -95249 -108109 -134746 -34078 -9278
16126i278j1311K1965l9350m6522K5207J8262m034j1158L0288J050p4006L329
$$ -9278 -20589 1376 -37974 -84496 -59289 -41027 -45061 -56219 -25931 -24881 -98887 -95558
16114i5558K6540R2524L1833J2872n0463r4325n941K2860M514k5858K3052L4072
$$ -95558 -69018 23506 55339 68211 17748 -76577 -82518 -59658 -55144 -81002 -57950 -23878
16102b3878N8060J7296r647k4697J6112K0044M6083q359o1463l3124n2095l743
$$ -23878 34182 51478 41831 17134 33246 53290 99373 91014 29551 -3573 -55668 -59411
16090e9411M2686O7284p589M7527J4782k4435n8859q4296j989L4759m64j3058
$$ -59411 -16725 50559 42970 90497 105279 80844 21985 -62311 -64300 -29541 -30005 -43063
16078d3063l0792k6287j066M6614L4442K5269N0117m0202j4346J0738K163m1265
$$ -43063 -73855 -100142 -101208 -54594 -20152 5117 55234 15032 686 11424 13587 -27678
16066b7678L7997J3299K3980J5627O3087r0383m0260L3188o2409j07319J3625
$$ -27678 10319 23618 47598 63225 126312 35929 -4331 28857 -33552 -140871 -127246
16055a27246M7222J9935Q8455Q5223k07n0338l7107k8224l3947N9932O2483k5948
$$ -127246 -80024 -60089 28366 113589 113382 63044 25937 -2287 -36234 23698 86181 60233
16043F0233m2341o0921j06955j2814K8828k9367o2527J15296P7255J3079N7780
$$ 60233 17892 -43029 -149984 -162798 -133970 -163337 -225864 -110568 -33313 -20234 37546
16032C7546n6850o9848k8642M2700M0637L4313K3483n5195M9679Q3260j4196p9443
$$ 37546 -19304 -89152 -117794 -75094 -34457 -144 23339 -31856 17823 101083 86887 7444
16020G444o3608R942l9230j2011Q1009K442K5330J9475q2485m1884r1927O9472
$$ 7444 -56164 -46222 -85452 -97463 -16454 -14012 11318 30793 -51692 -93576 -185503 -116031
16008a16031J22833Q1762l6543n9749n7147m8518N8264J07718j6648J00643q104
$$ -116031 6802 88564 52021 -7728 -64875 -113393 -55129 52589 35941 136584 128480
15997A28480l4234o5023m356k8044j4313k0734l862L8846J7173l8082k6327q6513
$$ 128480 94246 29223 24867 -3177 -17490 -38224 -42086 -3240 13933 -24149 -50476 -136989
15985a36989p3430R7621N6550n8608m810k1090K0026J27988o3816M548l3236j4481
$$ -136989 -210419 -112798 -56248 -114856 -119666 -140756 -120730 7258 -56558 -52010 -85246 -99727
15973i9727N7500O316k3470P8306j9622o1225M2192l5141n8028N1318J21787L6841
$$ -99727 -42227 -35911 -59381 18925 -697 -61922 -19730 -54871 -112899 -61581 60206 97047
15961I7047l3051J522p42J9983j8458l2420M5180j0056k3546m6855j6521J45692
$$ 97047 63996 65518 64776 84759 66301 33881 79061 69005 45459 -1396 -17917 127775
15949A27775Q2862l7283q5852l7226K0376j400L4554j7388m547R192n1230O2061
$$ 127775 210637 173354 87502 50276 70652 69252 103806 86418 81871 91063 39833 101894
15937A01894N2002M365R680L2921j88l9148o7126m3405k3411k8911M5947j9682
$$ 101894 153896 158261 167941 200862 200674 161526 94400 50995 27584 -1327 44620 24938
15925B4938j7908J9375l1210m3916K516N1031K8161j0566l3894M7063p0933l3480
$$ 24938 7030 26405 -4805 -48721 -46205 4826 32987 22421 -11473 35590 -35343 -68823
15913f8823J618Q724J0906Q7779K5317n7772n1518k1227N2401M7547L934n3340
$$ -68823 -67205 -58481 -47575 40204 65521 7749 -43769 -64996 -12595 34952 38886 -14454
15901a4454p4151r4438O6394L1808O9696N8258J97n4817J07915L9099j6806p4321
$$ -14454 -88605 -183043 -116649 -84841 -15145 43113 43310 -11507 96408 135507 118701 44380
15889D4380k8426R846K3930N5145k083n3657q1201N834l5199K1193Q722R757l254
$$ 44380 15954 25800 49730 104875 102792 49135 -32066 -26232 -61431 -40238 -31516 -21759 -25013
15876b5013k6393K9437L6491j1427J962k1343p6476M6864O7519k8589N8214J7283
$$ -25013 -51406 -21969 14522 3095 5057 -16286 -92762 -45898 21621 -6968 51246 68529
15864F8529n0745M9018l4334M76N5543L2667p6497o6965R579O67j3427j1382M2996
$$ 68529 17784 66802 32468 32944 88487 121154 44657 -22308 -12729 -12062 -25489 -36871 6125
15851F125k9606N479N6868j4604O0026L132l8637n997m1934K38L8465L5606m1347
$$ 6125 -23481 -18002 38866 24262 84288 87420 48783 42786 852 1090 39555 75161 33814
15838C3814k291o4148k2966N0806P0285j024J3155O8304l8129m4621M0105p439
$$ 33814 31523 -32625 -55591 -4785 65500 64476 77631 145935 107806 63185 103290 95851
15826I5851K900J2891k4010k0187o7333p7202o1810q3613j7731Q0260K1949J999
$$ 95851 98751 111642 87632 67445 112 -77090 -138900 -222513 -240244 -159984 -138035 -136036
15814a36036J3053O3180J3080m3566k6068P2596O9799k5337l8254r4726l7551
$$ -136036 -122983 -59803 -46723 -90289 -116357 -43761 26038 701 -37553 -132279 -169830
15803a69830J13024J1852r6277j9303N5023k6920O1046n622J0440M1675M6069
$$ -169830 -56806 -44954 -141231 -160534 -105511 -132431 -71385 -77007 -66567 -24892 21177
15792B1177M1731r556n6839n4387k5783K8423r9817p1916P3480P2783M4017l6656
$$ 21177 62908 53352 -3487 -57874 -83657 -55234 -155051 -226967 -153487 -80704 -36687 -73343
15780g3343J2229K8748r248l7094K2521m8842m8365P4861M1562N8433j6463q1880
$$ -73343 -61114 -32366 -41614 -78708 -56187 -105029 -153394 -78533 -36971 21462 4999 -76881
15768g6881M0478P9675j7087p9021O202K6344k1813k9536M8355J3304m7666K6798
$$ -76881 -36403 43272 26185 -52836 -46634 -20290 -42103 -71639 -23284 -9980 -57646 -30848
15756c0848j7769O551l088q0095M2676R2550Q58j6836m8389k0564k0440k0390
$$ -30848 -48617 -42066 -45154 -125249 -82573 9977 10835 -6001 -54390 -74954 -95394 -115784
15744a15784o259M7445O6397L2740o576O5268O1768p1823q8621l2427L5030M2761
$$ -115784 -122043 -74598 -8201 24539 17963 83231 144999 73176 -15445 -47872 -12842 29919
15732B9919J6671l4506m1990R295N1523l0627j9474L0911O1957p0635J9599K8314
$$ 29919 46590 12084 -29906 -20611 30912 285 -19189 11722 73679 3044 22643 50957
15720E0957j0864n55l7906k5397J22925P9159j00995j07694k3024K2819N0809
$$ 50957 40093 39538 1632 -23765 99160 178319 77324 -30370 -53394 -30575 20234
15709B0234m5169L6572k0815p9131J4494j8471j5089Q523N4713R5411l1216q9766
$$ 20234 -24935 11637 -9178 -88309 -73815 -92286 -107375 -98852 -44139 51272 20056 -69710
15697f9710K6307m2279m2897O3867O0931O6462j1478m1896l8033L6655K2961k8511
$$ -69710 -43403 -85682 -128579 -64712 -3781 62681 51203 9307 -28726 7929 30890 2379
15685B379K4008n60J0308m0511p333Q332j8539m5898M5248K5658L1532J8369J6121
$$ 2379 26387 25827 36135 -4376 -11709 -3377 -21916 -67814 -22566 3092 34624 52993 69114
15672F9114J9229k1852l542n4849m4496k8676o619M0082l2413L0924O9468j5585
$$ 69114 88343 66491 62949 8100 -36396 -65072 -71691 -31609 -64022 -33098 36370 20785
15660B0785l8450N1825N573n8424L1041L7963j17973p5769K9231N9505Q2022J137
$$ 20785 -17665 34160 39733 -18691 12350 50313 -67660 -143429 -114198 -54693 27329 28466
15648B8466j7487j9167o0600L1138O3171j7990j9684J6348j2207n7281O636M4464
$$ 28466 10979 -8188 -68788 -37650 25521 7531 -12153 4195 -8012 -65293 -58657 -14193
15636a4193o6588p6365M0587O9688J5066J8961R906K2955j8511P039k4881r294
$$ -14193 -80781 -157146 -116559 -46871 -31805 -12844 -2938 20017 1506 8545 -16336 -25630
15624b5630k5336j5662j08569M9172N9513M5006n065l6840J3737L6689L915J4586
$$ -25630 -50966 -66628 -175197 -126025 -66512 -21506 -26571 -63411 -49674 -12985 -9070 5516
15612E516K5738m2595P300l2799N8327L4879j7231P438n1026o2825K3616J26253
$$ 5516 31254 -11341 -4041 -36840 21487 56366 39135 46573 -4453 -67278 -43662 82591
15600H2591m0941m0625j2595k5248m0047J3026O821m6446L1916N5674l6583j10445
$$ 82591 41650 1025 -11570 -36818 -76865 -63839 -57018 -103464 -71548 -15874 -52457 -162902
15588a62902l6768Q31R5295k6191O7459O6773J5864n2401l6950N4199O1096n0449
$$ -162902 -199670 -198839 -103544 -129735 -62276 4497 20361 -32040 -68990 -14791 46305 -4144
15576d144o1083M3883l5300m0180n0639N9004M7798P399J5220P4646k6370j08275
$$ -4144 -65227 -21344 -56644 -96824 -147463 -88459 -40661 -33262 -18042 56604 30234 -78041
15564g8041Q310Q1160m8013j03773o0476l587j6102R0562N0524P073O1949n19
$$ -78041 -69731 11429 -36584 -140357 -200833 -204420 -220522 -129960 -79436 -72363 -10414 -10933
15552a0933K2058q25L8571m505q5073m4649P1491K1717k3498j5771o0508j3356
$$ -10933 11125 10300 48871 44366 -40707 -85356 -13865 7852 -15646 -31417 -91925 -105281
15540a05281L6245J3173p0833N6186l747k3267J9801K4997P844p3296O479N1659
$$ -105281 -69036 -55863 -126696 -70510 -74257 -97524 -77723 -52726 -44882 -118178 -111699 -60040
15528f0040J1367m265M1474o176J0547k8562p3584m1252N2894P363J8863J3010
$$ -60040 -48673 -52938 -11464 -17640 -7093 -35655 -109239 -150491 -97597 -90234 -71371 -58361
15516e8361J3711P6149P4022k0591l0129l8561r5553j1157N6820Q0259K7344k4942
$$ -58361 -44650 31499 105521 84930 54801 16240 -79313 -90470 -33650 46609 73953 49011
15504D9011p7914O2160O6723l1624r1947O08k8184J7019J2336k9859l8603l1806
$$ 49011 -28903 33257 99980 68356 -23591 -22983 -51167 -34148 -21812 -51671 -90274 -122080
15492a22080K7496L2809P0876M4736j6548P6487L9406j1338l4912n0308p0218
$$ -122080 -94584 -61775 9101 53837 37289 113776 153182 141844 106932 56624 -13594
15481a3594n7551j6325m4986M5727O3193m0328l3400O6719l4102J4274L0590K284
$$ -13594 -71145 -87470 -132456 -86729 -23536 -63864 -97264 -30545 -64647 -50373 -19783 -17499
15469a7499M5636N2344n3272p9182J630L9057J3399O8053K27j27143r7344P0972
$$ -17499 28137 80481 27209 -51973 -50343 -11286 2113 70166 70393 -56750 -154094 -83122
15457h3122r097p1911N1951r415m40Q9390J6873J1173l0932M743j910j4428q606
$$ -83122 -92219 -164130 -112179 -121594 -122034 -32644 -15771 -4598 -35530 -30787 -32697 -47125 -55731
15444e5731O9497L1473J8854L1011l5790p370p7681O427n611L0429k4906J6255
$$ -55731 13766 45239 64093 95104 59314 51944 -25737 -19310 -24921 5508 -19398 -3143
15432c143J9048n3148k7407J08026J7039o0114r606k3884J7688K5964K6156m8026
$$ -3143 15905 -37243 -64650 43376 60415 301 -9305 -33189 -15501 10463 36619 -11407
15420a1407K0197L4149k2872R1156n5316n3215O8323p3869o5728L5138K7245K463
$$ -11407 8790 42939 20067 111223 55907 2692 71015 -2854 -68582 -33444 -6199 -3736
15408c736j99L0287p2040o6873j9989L6224k9521L0856P0484O5000l9509n3062
$$ -3736 -3935 26352 -45688 -112561 -132550 -96326 -125847 -94991 -24507 40493 984 -52078
15396e2078N0509M188m1396j01734p0477o224P1987N9509N3966m3490j09410M7739
$$ -52078 -1569 2619 -38777 -140511 -210988 -217212 -145225 -85716 -31750 -75240 -184650 -136911
15384a36911J4331M2192J2361K9750m684P2459j518p1781j10906l6344K2700N2392
$$ -136911 -122580 -80388 -68027 -38277 -42961 29498 27980 -43801 -154707 -191051 -168351 -115959
15372a15959O7131l6395M265J9499o925o3477j9558P6101N6742l233N1929K663
$$ -115959 -48828 -85223 -80958 -61459 -68384 -131861 -151419 -75318 -18576 -21809 30120 32783
15360C2783K8614l290n1509n9037o7420J1079m6154k2565P3670N2563K9181P1684
$$ 32783 61397 58107 6598 -52439 -119859 -108780 -154934 -177499 -103829 -51266 -22085 49599
15348D9599L0811r5421p5744k8703P180M8028K4747N0293j7545l2397L1261O2405
$$ 49599 80410 -15011 -90755 -119458 -112278 -64250 -39503 10790 -6755 -39152 -7891 54514
15336E4514J6611L1859p48n0161q8586n8883j957M7178L1357L4795J1948r872
$$ 54514 71125 102984 102236 52075 -36511 -95394 -97351 -50173 -18816 15979 27927 18055
15324A8055M7058J5786j02570n7262L1181L4367N3780j8376Q43j2500r9675j6410
$$ 18055 65113 80899 -21671 -78933 -47752 -13385 40395 22019 22862 10362 -89313 -105723
15312a05723J13576J03730k8395r2685j9207q5254n3135n7028J25701N0725p7146
$$ -105723 7853 111583 83188 -9497 -28704 -113958 -167093 -224121 -98420 -47695 -124841
15301a24841M4618P2154J7464m2000L8667M633m5736j9265m8387K7167O8226J04881
$$ -124841 -80223 -8069 9395 -32605 6062 10695 -35041 -54306 -102693 -75526 -7300 97581
15289I7581L7620P333p0717k4466J6486j2688j07656O9164j4737k8111l8482k0211
$$ 97581 135201 142534 71817 47351 63837 51149 -56507 12657 -2080 -30191 -68673 -88884
15277h8884k7652k5900J267R5163l4943K3821L5035o5566K0877M1479L2121l0329
$$ -88884 -116536 -142436 -141169 -46006 -80949 -57128 -22093 -87659 -66782 -25303 6818 -23511
15265b3511L6937K7748N1892r595k0532o256L3970q0450l4985P7335p3705o2178
$$ -23511 13426 41174 93066 83471 62939 56683 90653 10203 -24782 52553 -21152 -83330
15253h3330L064j4899P582K5149L6966l320K1151K7847M2249M5024l0995n0503
$$ -83330 -80266 -95165 -87583 -62434 -25468 -28788 -7637 20210 62459 107483 76488 25985
15241B5985j3940p495j2122l1969r266k0742L7316K7190j5291L9790M1234J6225
$$ 25985 12045 4550 -7572 -39541 -48807 -69549 -32233 -5043 -20334 19456 60690 76915
15229G6915L5986n4873L402R71J6752j2253l3645l2504m2211K2096M4534n3023
$$ 76915 112901 58028 61430 62401 79153 66900 33255 751 -41460 -19364 25170 -27853
15217b7853j7557O8703K3004K6549J640n4792n7997n2013K0440L1450L0510q7062
$$ -27853 -45410 23293 46297 72846 74486 19694 -38303 -90316 -69876 -38426 -7916 -94978
15205i4978k1180R9464L3442k003P0443m2010q9776j4954K5269m9143K9302Q1594
$$ -94978 -116158 -16694 16748 14745 85188 43178 -46598 -61552 -36283 -85426 -56124 25470
15193B5470L1674m4878n3083k251J191j8115K0204P1122l0128L3123L6426o0643
$$ 25470 57144 12266 -40817 -43068 -41877 -59992 -39788 31334 1206 34329 70755 10112
15181A0112o7593j7773M1112l6934q8938q8535J1621R1517J7121j6188J2341M4223
$$ 10112 -57481 -75254 -34142 -71076 -160014 -248549 -236928 -145411 -128290 -144478 -132137 -87914
15169h7914k8266l6656J0470J30137K0084n971L0203k6980n5078M093P7288n5396
$$ -87914 -116180 -152836 -142366 -12229 7855 1884 32087 5107 -49971 -45878 31410 -23986
15157b3986J7329M5312n0217m9987J23858k5539M9661k1777p6608N136L5202l6612
$$ -23986 -6657 38655 -11562 -61549 62309 36770 86431 64654 -11954 -6818 28384 -8228
15145h228n4402j7063K382K7955k3395L2935O0843M2736o9727J5580j457M6859
$$ -8228 -62630 -79693 -77311 -49356 -72751 -39816 21027 63763 -5964 9616 8159 55018
15133E5018J6134J7862M4664N4252K3660j05352j04624k2367M8619K092L0361
$$ 55018 71152 89014 133678 187930 211590 106238 1614 -20753 27866 29958 60319
15122F0319L005M9989j1925j4662j8972m8101n5293k3987O2339o466p2884N6053
$$ 60319 63324 113313 101388 86726 67754 19653 -35640 -59627 2712 -3754 -76638 -20585
15110b0585M4354L8802n4969K947J8651K2556q307p1595l4472m175n0777L1135
$$ -20585 23769 62571 7602 10549 29200 51756 43449 -28146 -62618 -66793 -117570 -86435
15098h6435K8592l9519j751M1461m1472m4214K1982Q0225n3388j02502L7782K5852
$$ -86435 -57843 -97362 -99113 -57652 -99124 -143338 -121356 -41131 -94519 -197021 -159239 -133387
15086a33387K9074j5678L8116L0768k9662P0672m185n9632M4808J1455j9414J5313
$$ -133387 -104313 -119991 -81875 -51107 -80769 -10097 -14282 -73914 -29106 -17651 -37065 -21752
15074b1752K3644K8050l7377k3600p8704L3609O8111o38r1431o696M2585k9364
$$ -21752 1892 29942 -7435 -31035 -109739 -76130 -8019 -8657 -100088 -106784 -64199 -93563
15062i3563L0845j8861k1911p0502l8645J15514N9121L3106M9567J7691J13p6477
$$ -93563 -62718 -81579 -103490 -173992 -212637 -97123 -38002 -4896 44671 62362 62475 -14002
15050a4002o1456k379K8606m6609J5605J12403M9677k3734j4685O992j2930K5374
$$ -14002 -75458 -77837 -49231 -95840 -80235 32168 81845 58111 43426 50418 37488 62862
15038F2862l2835l1999J9952q041m9088j8271j2546R4444M7728M3162l251l8789
$$ 62862 30027 -1972 17980 9939 -39149 -57420 -69966 24478 72206 115368 112117 73328
15026G3328q5507k9474L761N467M2523K6812P733o9412m0917l808L5143L2473
$$ 73328 -12179 -41653 -37892 -32425 10098 36910 44643 -24769 -65686 -69494 -34351 -1878
15014a878k84m7241R17K968O5900K0010n6357N5126o5733j6878O1345J4996m5277
$$ -1878 -2162 -49403 -48486 -45518 20382 40392 -15965 39161 -26572 -43450 17895 32891 -12386
15001a2386o4200p135q007j0948N618L4833L6501k737p3566m0202R6129J02189
$$ -12386 -76586 -83721 -91728 -102676 -97058 -62225 -25724 -28461 -102027 -142229 -46100 56089
14989E6089l9214k0666K2253m592K0926l2495J8973O5110J1840n0418n0989q5549
$$ 56089 16875 -3791 18462 13870 34796 2301 21274 86384 98224 47806 -3183 -88732
14977h8732o2773K0284N8931J8917N8172n3337n4643K6321m675J5809l2083J0225
$$ -88732 -151505 -131221 -72290 -53373 4799 -48538 -103181 -76860 -81535 -65726 -97809 -87584
14965h7584k8979L9205J06824L2021P713L0327m7508m9841R632j2093j9827q0234
$$ -87584 -116563 -77358 29466 61487 69200 99527 52019 2178 11810 -283 -20110 -100344
14953a00344J2646M6291m1135o692O7143N2955m2893M967P8599l7199j7794J2469
$$ -100344 -87698 -41407 -82542 -89234 -22091 30864 -12029 -7062 71537 34338 16544 29013
14941B9013K9948L0883j07048J482l0188N5831J7638J7808k333r2675m0081N9021
$$ 29013 58961 89844 -17204 -15722 -45910 9921 27559 45367 43034 -49641 -89722 -30701
14929c0701M6181J9927J7062J4482l9589j9286l3064l0802N0400M8479l8162P838
$$ -30701 15480 35407 52469 66951 27362 8076 -24988 -55790 -5390 43089 4927 12765
14917A2765N5702n4585K2633M7844k2469l3637l9339L2306K862P020j3514k2980
$$ 12765 68467 13882 36515 84359 61890 28253 -11086 21220 24082 31102 17588 -5392
14905e392O8187K5118o6291p3876r3831L3091J6864P7129M7677j195j7543N1186
$$ -5392 62795 87913 21622 -52254 -146085 -112994 -96130 -19001 28676 27481 9938 61124
14893F1124j4205p8312j8046Q415l2547p2616K0685P2324J0553l0343J3978m3863
$$ 61124 46919 -31393 -49439 -41024 -73571 -146187 -125502 -53178 -42625 -72968 -58990 -102853
14881a02853m1337j474N2215p658J4081J6592N7752J3713r2R348J9312L0363k93
$$ -102853 -144190 -145664 -93449 -101107 -87026 -70434 -12682 1031 939 10287 29599 59962 59669
14868E9669l6366q2687l0093R133J0002N485m0310N88L2367P243J2677K4536p4651
$$ 59669 23303 -59384 -89477 -80344 -70342 -64857 -105167 -104579 -72212 -64969 -52292 -27756 -102407
14855a02407J23436Q4279m7059p0218k9608q260k8346Q230J4177m3533k4118P8754
$$ -102407 21029 105308 58249 -11969 -41577 -49837 -78183 -69953 -55776 -99309 -123427 -44673
14843d4673R435L2733M1024m5441n8490L8066K7973m654j07650j4524P8749O8162
$$ -44673 -35238 -2505 38519 -6922 -65412 -27346 627 -4027 -111677 -126201 -47452 20710
14831B0710p821m2686n575k0275M002K6825l0863j09546j3669M7071N2454M9728
$$ 20710 12889 -29797 -35372 -55647 -51645 -24820 -55683 -165229 -178898 -131827 -79373 -29645
14819b9645J1235M9k677L7910n1889q7077r1739J8960O5324K5489K7708K4728
$$ -29645 -18410 -18361 -21038 16872 -35017 -122094 -213833 -194873 -129549 -104060 -76352 -51624
14807e1624L4172J4236o5708l0020O2533r679j1586R616k7893M6155j0176k7383
$$ -51624 -17452 -3216 -68924 -98944 -36411 -46090 -57676 -48060 -75953 -29798 -39974 -67357
14795f7357n5055p269O2822P8652q312j37034r200k2489j5685M4650L8962K3450
$$ -67357 -122412 -129681 -66859 11793 3481 -133553 -142753 -165242 -180927 -136277 -97315 -73865
14783g3865o0956N2679J02784n08j7656L0927l2521o0681n3039J4326K1078J9302
$$ -73865 -134821 -82142 20642 20134 2478 33405 884 -59797 -112836 -98510 -77432 -58130
14771e8130q628N370K0387L2383j601J552L5595q614p6593N3555M0477l132L4159
$$ -58130 -66758 -61388 -41001 -8618 -10219 -8667 26928 18314 -58279 -4724 35753 32621 66780
14758F6780M9506j10982p4216N8370l7877N0971M9644n8135n170o2900p6253J1428
$$ 66780 116286 5304 -68912 -10542 -48419 2552 52196 -5939 -11109 -74009 -150262 -138834
14746a38834O1375j7804K4288N3639N8559l3182N4328O6616k236q6171q0987m6820
$$ -138834 -77459 -95263 -70975 -17336 41223 8041 62369 128985 126749 40578 -40409 -87229
14734h7229Q8415P887q1679j2655L6284J2043J9304N4286p31l9167p273K3063
$$ -87229 1186 9073 -72606 -85261 -48977 -36934 -17630 36656 35925 -3242 -10515 12548
14722A2548l5169Q868l531j7551j2133M6667j1755k4353K7185M0255k0218L7978
$$ 12548 -22621 -13753 -17284 -34835 -46968 -301 -12056 -36409 -9224 31031 10813 48791
14710D8791k4366k8723o4984l5679J4203O7428J7656K355R01k8401J03441O4242
$$ 48791 24425 -4298 -69282 -104961 -90758 -23330 -5674 -3319 -2418 -30819 72622 136864
14698A36864n6604K2565O0902m3434j35608m8795P3107k3812q1070q1372L788
$$ 136864 80260 102825 163727 120293 -15315 -64110 8997 -14815 -95885 -177257 -173469
14687a73469J020J09067M8013j513J1689K9112l6344p2747k0437M5203K6695n8325
$$ -173469 -172449 -63382 -15369 -16882 -5193 23919 -12425 -85172 -105609 -60406 -33711 -92036
14675i2036q186Q8147N0407p3601j5526J8900M1894p8072j2427M9897K714K2394
$$ -92036 -100222 -12075 38332 -35269 -50795 -31895 9999 -68073 -80500 -30603 -27889 -5495
14663e495R1023k6629j13486l8069M6286J2045l8236o5088j1379M7163P2616j3011
$$ -5495 85528 58899 -54587 -92656 -46370 -34325 -72561 -137649 -149028 -101865 -29249 -42260
14651d2260L9145P6926m1444M953R774L6229N006l585n1537p94L0459R31k2953
$$ -42260 -3115 73811 32367 37320 47094 83323 88329 84744 33207 32413 62872 63803 40850
14638D0850l768j2797m8136N2823O0812k8010o7975K9134q123M610j8637p3738
$$ 40850 37082 24285 -23851 28972 89784 61774 -6201 22933 14810 19420 783 -72955
14626g2955j6096m5459j3620L0229Q2369N9821m6117k640k8899l1537K1971K3643
$$ -72955 -89051 -134510 -148130 -117901 -35532 24289 -21828 -24468 -53367 -84904 -62933 -39290
14614c9290m1974R709O0698M8938R6990k4739q4282l6646K0516K7905n5761m3616
$$ -39290 -81264 -71555 -10857 38081 135071 110332 26050 -10596 9920 37825 -17936 -61552
14602f1552L0442J048L671k8128J4841N1896N1740o0234n6832m2917J7788j478
$$ -61552 -31110 -30062 -26391 -54519 -39678 12218 63958 3724 -53108 -96025 -78237 -79715
14590g9715K8221P83L0995M2293L2101L3779j15967k9187L1860J5589j1018j1790
$$ -79715 -51494 -50711 -19716 22577 54678 88457 -27510 -56697 -24837 -9248 -20266 -32056
14578c2056M4013j2585p188j3659L087r324J3042K2721m3397j7859K922J497k8074
$$ -32056 11957 -628 -7816 -21475 -18388 -27712 -14670 8051 -35346 -53205 -50283 -48786 -76860
14565g6860o17l0232L9517M7921M9261m6293p2710Q0365l377k2922L793j890m5157
$$ -76860 -77477 -107709 -68192 -20271 28990 -17303 -90013 -9648 -13025 -35947 -32154 -34044 -79201
14552g9201p4355K9563O2191k925N4037J0463L2722k8107l1293o473L7805O7717
$$ -79201 -153556 -123993 -61802 -64727 -10690 -227 32495 4388 -26905 -33378 4427 72144
14540G2144m7473l0138J3169P8830j1276o1517J1132J1388K7445k4359n2098m5319
$$ 72144 24671 -5467 7702 86532 75256 13739 24871 36259 63704 39345 -12753 -58072
14528e8072P2488J6130L7844k4707j0985j6399o8385n8309O0020O5621n6549L8094
$$ -58072 14416 30546 68390 43683 32698 16299 -52086 -110395 -50375 15246 -41303 -3209
14516c209l2943L468L1164K529O5544J16487l8423n909p1284j00242K1161N0244
$$ -3209 -36152 -32684 -1520 1009 66553 183040 144617 138708 67424 -32818 -11657 38587
14504C8587L4837j436j8996n928n038P247Q417n221n1534j2534o1265k1871j0239
$$ 38587 73424 71988 52992 47064 42026 49273 57690 52469 935 -11599 -72864 -94735 -104974
14491a04974R291Q837l0572p4198M7515O8670o416N008Q905R9503M3201j2202
$$ -104974 -95683 -86846 -117418 -191616 -144101 -75431 -81847 -76839 -67934 31569 74770 62568
14479F2568j9170Q11j7424p7973j9981J8732K2784J0725J2740J0660l3944o4397
$$ 62568 43398 44209 26785 -51188 -71169 -52437 -29653 -18928 -6188 4472 -29472 -93869
14467i3869L282k5287M7822N4736M6618k4220n6727k9034M4701R321m1054M7035
$$ -93869 -90587 -115874 -68052 -13316 33302 9082 -47645 -76679 -31978 -22657 -63711 -16676
14455a6676J00179j5225j4436o1241K5698L0908k5219q658Q1411j4709q2266k0502
$$ -16676 83503 68278 53842 -7399 18299 49207 23988 15330 96741 82032 -234 -20736
14443b0736O6783P150r5372j04546j8552L1213J50266J06235n5742J17704M9345
$$ -20736 46047 53197 -42175 -146721 -165273 -134060 16206 122441 66699 184403 233748
14432B33748l0543r5842m7355k9976L3831l699P6360J7604q2077j6468J6491m5756
$$ 233748 203205 107363 60008 30032 63863 60164 136524 154128 72051 55583 72074 26318
14420B6318J0276L3015l653M490J5413j8047l2020Q13k6655k4766M5500R4380
$$ 26318 36594 69609 65956 70446 85859 67812 35792 36605 9950 -14816 30684 125064
14408A25064j02336m4170M1643j2619O8688M6885n1622j6543M4914j8205r5756
$$ 125064 22728 -21442 20201 7582 76270 123155 71533 54990 99904 81699 -14057
14397a4057q9781K7590M5422p7581M2701N7814J699L7176j3825j7190P9824j141
$$ -14057 -103838 -76248 -30826 -108407 -65706 -7892 -6193 30983 17158 -32 79792 78651
14385G8651l2974L7215M9983K0590j05718n9984N7306N9062N238p0422j13815
$$ 78651 45677 82892 132875 153465 47747 -12237 45069 104131 109369 38947 -74868
14374g4868k9479k0246M4888J32997o4753L7779L6017n8134n403O8230n4639k8831
$$ -74868 -104347 -124593 -79705 53292 -11461 26318 62335 4201 -1202 67028 12389 -16442
14362a6442J9641M8297j4567J9563m3399o4232l2102R2536R0752j00266l4745
$$ -16442 3199 51496 36929 56492 13093 -51139 -83241 9295 100047 -219 -34964
14351c4964j1940Q1187K142q382M6358m1664R524j055K1776O7170L9861J0540
$$ -34964 -46904 34283 36425 28043 74401 32737 42261 41206 62982 130152 170013 180553
14339A80553O295N8420Q3124N3265J35262J29903K8472Q405K5761R5501j2598
$$ 180553 186848 245268 328392 381657 516919 646822 675294 683699 709460 804961 792363
14328G92363j00544r6220j45084q8346P2383j2444k1385k7630k1592j49430k4182
$$ 792363 691819 595599 450515 362169 434552 422108 400723 373093 351501 202071 177889
14317A77889n754K55L138j464r659j3866L6718j01276q3718O7937k8868N4760
$$ 177889 172135 172390 175528 174064 164405 150539 187257 85981 2263 70200 41332 96092
14305I6092J34177K9252l1619q3671n8862K572O2600o8122n2785J0820K3874O5933
$$ 96092 230269 259521 227902 144231 85369 87941 150541 82419 29634 40454 64328 130261
14293A30261k9545k961j360Q6854Q8355J7616k3049R5574M1671P2090J70588K26411
$$ 130261 100716 97755 96395 183249 271604 289220 266171 361745 403416 475506 646094 872505
14281H72505J42100J39784J28965R9599J43317P3293Q3471M8708j66853k64811
$$ 872505 1014605 1154389 1283354 1382953 1526270 1599563 1683034 1731742 1564889 1300078
14271A300078j82939j75531j59118j62228o1817q9558r8227q3712m2043N1214
$$ 1300078 1117139 941608 782490 620262 558445 468887 370660 286948 244905 296119
14261B96119K8104J7222Q109o2525n2385m5758l3539K0507P4489q143K2375N5474
$$ 296119 324223 341445 349554 287029 234644 188886 155347 175854 250343 242200 264575 320049
14249C20049m1096q5685J24778j9510K8454M2450L2773j3471M6432M0504P2107
$$ 320049 278953 193268 318046 298536 326990 369440 402213 388742 435174 475678 547785
14238E47785M6594k3753J3423O4680k4445n4884l2830j0737l1355r121Q1480J31113
$$ 547785 594379 570626 584049 648729 624284 569400 536570 525833 494478 485357 566837 697950
14226F97950J56760J6929M2673l5233j4785N3153R1493J22268r501p7973j98694
$$ 697950 854710 871639 914312 879079 864294 917447 1008940 1131208 1121707 1043734 845040
14215H45040j33291j13544j17949k3668n824l3067j1999K2279k4715l2463n6713
$$ 845040 711749 598205 480256 456588 450764 417697 405698 427977 403262 370799 314086
14204C14086l5176m0991m6373l2150N9896M1592n707m0963M0875N9859P0771M785
$$ 314086 278910 237919 191546 159396 219292 260884 255177 214214 255089 314948 385719 390504
14192C90504J436R0258J61424J01361J3584K701l8343k7150J0543J38089o08k7904
$$ 390504 391940 482198 643622 744983 758567 761268 722925 695775 706318 844407 843799 815895
14180H15895J9301J3350o9926k9806q8998r8184m5457k6894o3263q84K6137l0146
$$ 815895 835196 848546 778620 748814 659816 561632 516175 489281 426018 425134 451271 421125
14168D21125m7195k8632o4046j9211j01426l1043M8261O7321J9958n5309l3020
$$ 421125 373930 345298 281252 262041 160615 129572 177833 245154 265112 209803 176783
14157A76783N754J4676k7599r2973K4703L5554k3259K5418M0477l3853J3647J9646
$$ 176783 182537 197213 169614 76641 101344 136898 113639 139057 179534 145681 159328 178974
14145A78974l2853L4884K7316K3078L4395K8990L3624L1142r620J2253J6783O0193
$$ 178974 146121 181005 208321 231399 265794 294784 328408 359550 349930 362183 378966 439159
14133D39159L3146k6894O2869n435j9124R6039K2803p3286o4570N8494j7964p2861
$$ 439159 472305 445411 508280 502845 483721 579760 602563 529277 464707 523201 505237 432376
14121D32376m8172o2881n2916m754k9037m6513N1069M5866J09941n885p4209J5654
$$ 432376 384204 321323 268407 263653 234616 188103 239172 285038 394979 389094 314885 330539
14109C30539K2278j7084J839l8622j12737p1525J0360N061M750N083m1540J7115
$$ 330539 352817 335733 337572 298950 186213 114688 125048 130109 134859 139942 98402 115517
14097A15517Q407Q7715r015m0313m3441j9295J2685O7948n0556o8200O4799N3147
$$ 115517 123924 211639 202624 162311 118870 99575 112260 180208 129652 61452 126251 179398
14085A79398q810J609m2848n5911l1910L4967J06133K5449J7139P708k9918l0723
$$ 179398 170588 172197 129349 73438 41528 76495 182628 208077 225216 232924 203006 172283
14073A72283J0012J3307K5974m6388n3146K9908J32142J6645p3255K6949Q2566
$$ 172283 182295 195602 221576 175188 122042 151950 284092 300737 227482 254431 336997
14062C36997M5017P2537N3706L0665P689J8491l9742o2775l3785P38K7802n888
$$ 336997 382014 454551 508257 538922 546611 565102 525360 462585 428800 429538 457340 451452
14050D51452n8586q3923j7760K9167k3003l7470k7911K820N6566J5503K5756m7589
$$ 451452 392866 308943 291183 320350 297347 259877 231966 234786 291352 306855 332611 285022
14038B85022p3302L5046Q7105k2625o4142L8088N2280k7227m5269k4197j1689
$$ 285022 211720 246766 333871 311246 247104 285192 337472 310245 264976 240779 229090
14027B29090k2631L4773l1008l671K2782n6658l4642R0741O7788J8089J630l0415
$$ 229090 206459 241232 210224 206553 229335 172677 138035 228776 296564 314653 316283 285868
14015B85868L3119K6439o7069k8885j1566P1870L6258j5811r07N2166P4553M1760
$$ 285868 318987 345426 278357 249472 237906 309776 346034 330223 329316 381482 456035 497795
14003D97795r579P720k2906n5579l509j7465j6487O8192N225M5013Q1830R1954
$$ 497795 488216 495936 473030 417451 413942 396477 379990 448182 453407 498420 580250 672204
13991F72204m31o8789l4272J22K7891P3368O4122J20955J05796P3478j2703j15610
$$ 672204 671773 602984 568712 568834 596725 670093 734215 855170 960966 1034444 1021741 906131
13979I06131N7697o539q298J06602O8903k0676K2103M9188j7055J06972n555N0339
$$ 906131 963828 957289 948991 1055593 1124496 1103820 1125923 1175111 1158056 1265028 1259473 1309812
13967A309812Q96k3479l1350M7576K1734m0047p232J8926O3145N6156m1028k6880
$$ 1309812 1310708 1287229 1255879 1303455 1325189 1285142 1277910 1296836 1359981 1416137 1375109 1348229
13955A348229l1199o6687q5080m8014m9833j2084j7605p896Q2371Q054j3231o6868
$$ 1348229 1317030 1250343 1165263 1117249 1067416 1055332 1037727 1029831 1112202 1120256 1107025 1040157
13943A040157j903O63r1338K111J3667l2536Q4037Q5565O1273J06193R4341p665
$$ 1040157 1038254 1038917 947579 949690 963357 930821 1014858 1100423 1161696 1267889 1362230 1354565
13931A354565L1632J01935Q6167P5471R3944K5045J03920P6197J34939J02276
$$ 1354565 1386197 1488132 1574299 1649770 1743714 1768759 1872679 1948876 2083815 2186091
13921B186091m027P6677J75533Q5081Q0010P6834M2273n243j9953o5917o2277
$$ 2186091 2182064 2258741 2434274 2519355 2599365 2676199 2718472 2713229 2693276 2627359 2565082
13910B565082o0487r7009j40582q1279p648O480J9160p6116p6271O3191O2831
$$ 2565082 2504595 2407586 2267004 2185725 2178077 2184557 2203717 2127601 2051330 2114521 2177352
13899B177352M4165P08K6571M0P4948J04659L4295N7790P0695L8850O3428K21335
$$ 2177352 2221517 2222225 2248796 2248836 2323784 2428443 2462738 2520528 2591223 2630073 2693501 2914836
13887B914836Q8875N7845J68594J44536J77129K44611L04543K95785L66936N08338
$$ 2914836 3003711 3061556 3230150 3374686 3551815 3796426 4100969 4396754 4763690 5272028
13877E272028O60509P78682Q12314R46988J156408J519893K040337K614054L325883
$$ 5272028 5932537 6711219 7523533 8470521 9626929 11146822 13187159 15801213 19127096
13868A9127096M533607O736264J0175980J5096240J9561441J9657672J4866431
$$ 19127096 23660703 30396967 40572947 55669187 75230628 94888300 109754731
13861A09754731R376296P571231R341692J1289587J0879518N306164p896884k2089168
$$ 109754731 119131027 126702258 136043950 147333537 158213055 163519219 155622335 133533167
13853A33533167k8792063k5581479j7517295j1047966p040248m749843l457451
$$ 133533167 104741104 79159625 61642330 50594364 43554116 38804273 35346822
13846C5346822l027927k927487k709316k183961j752107j271623j103394j011595
$$ 35346822 32318895 29391408 26682092 24498131 22746024 21474401 20371007 19359412
13838A9359412r21328q17561p49528n25983l73227l67824l24415k27835j07884
$$ 19359412 18438084 17620523 16870995 16345012 15971785 15603961 15279546 15051711 14943827
13829A4943827n0904q52M7853K49585K61073L92525N25297P20937R40488J186989
$$ 14943827 14892923 14892071 14939924 15189509 15450582 15843107 16368404 17089341 18029829 19216818
13819A9216818J601029K060025K632901L511178M564226N977021Q378319J2301737
$$ 19216818 20817847 22877872 25510773 29021951 33586177 39563198 47941517 60243254
13811F0243254J9150961K9334384L8951587L8815672K9157288K3331448K3243540
$$ 60243254 79394215 108728599 147680186 186495858 215653146 238984594 262228134
13804B62228134K2390979K1490712K0781708J3998149j1586962m3689344m8392984
$$ 262228134 284619113 306109825 326891533 340889682 329302720 285613376 237220392
13797B37220392m3757783m5558527l5331904k1576993j3081417q808742o545175
$$ 237220392 193462609 147904082 112572178 90995185 77913768 69105026 62559851
13790F2559851n008905l927695l205535k671623k083089j642988j288775r27763
$$ 62559851 57550946 53623251 50417716 47746093 45663004 44020016 42731241 41803478
13782D1803478n79439j74823L90016J078769J811992K777725M049314N470407
$$ 41803478 41224039 41049216 41439232 42518001 44329993 47107718 51157032 56627439
13774E6627439O696851P085609O482775N674941M954622M471774L924401L091491
$$ 56627439 63324290 70409899 76892674 82567615 87522237 91994011 95918412 99009903
13766I9009903J117332k016066n102702p026181p055676n793723m025016k147209
$$ 99009903 100127235 98111169 93008467 85982286 78926610 73132887 69107871 66960662
13758F6960662l46296K063914N349884J0036267J6166703K1168992K0457530J3365944
$$ 66960662 66614366 68678280 74028164 84064431 100231134 121400126 141857656 155223600
13750A55223600O759181O114005R303182J1604615J0459141L629136j2277736
$$ 155223600 161982781 168096786 177399968 189004583 199463724 203092860 190815124
13743A90815124l0132422l5557016k7955069j8185385j1413608p451083n127418
$$ 190815124 160682702 125125686 97170617 78985232 67571624 60120541 54993123
13736E4993123l740242k926110k266245j736144j167305o17261k30383L28482
$$ 54993123 51252881 48326771 46060526 44324382 43157077 42539816 42309433 42637915
13728D2637915P18916J275981J921314K834430L944187N561555P737168J0459805
$$ 42637915 43356831 44632812 46554126 49388556 53332743 58894298 66631466 77091271
13720G7091271J3523859J5729243J5895998J4510086J3098182J1843217R993087
$$ 77091271 90615130 106344373 122240371 136750457 149848639 161691856 171684943
13713A71684943P806973N026436K69889p435004j4886231j8372106j9934863k0182575
$$ 171684943 179491916 184518352 184788241 177353237 162467006 144094900 124160037 103977462
13705A03977462j7187706j2956387r315253o848635n238270m193123l411628k807932
$$ 103977462 86789756 73833369 64518116 57669481 52431211 48238088 44826460 42018528
13697D2018528k370340k158128j923933j679149j435205j315262j159694j196466
$$ 42018528 39648188 37490060 35566127 33886978 32451773 31136511 29976817 28780351
13689B8780351j209879j107582r60340q47868p44660o99684n51276l86660k43435
$$ 28780351 27570472 26462890 25502550 24654682 23910022 23210338 22659062 22272402 22028967
13680B2028967j16258m6692J61984K61199L30019M71397O77675R17342J237259
$$ 22028967 21912709 21866017 22028001 22289200 22619219 23090616 23768291 24685633 25922892
13671B5922892J591252J995383K555767L356616M407987N745199P043271P820051
$$ 25922892 27514144 29509527 32065294 35421910 39829897 45575096 52618367 60438418
13663F0438418P773867O787228N464814M572221M105046L435823J996625o42757
$$ 60438418 68212285 74999513 80464327 85036548 89141594 92577417 94574042 93931285
13655I3931285m354201p990882j0353202j0479619r074036p424022n741774m414735
$$ 93931285 89577084 81586202 71233000 60753381 51679345 44255323 38513549 34098814
13647C4098814l502456k730872k318037k023796j801430j478571j291509j141986
$$ 34098814 30596358 27865486 25547449 23523653 21722223 20243652 18952143 17810157
13639A7810157j002604r11527p75203o72908o53690o80896o90675n57980m99114
$$ 17810157 16807553 15896026 15120823 14447915 13794225 13113329 12422654 11864674 11365560
13630A1365560m53945l90524l75025l61951l69663l26631l09571l45458l33677
$$ 11365560 10911615 10521091 10146066 9784115 9414452 9087821 8778250 8432792 8099115
13621H099115k46637k05740k74853l70925k99084j61489j58045j48761j39856
$$ 8099115 7852478 7646738 7371885 7000960 6701876 6540387 6382342 6233581 6093725
13612F093725j76882j38781j63040k30593j57266j20138j07478j34237j34210
$$ 6093725 5916843 5778062 5615022 5384429 5227163 5107025 4999547 4865310 4731100
13603D731100n0522j60614j93179j65136n9547j1344n4120j53614j78844j57990
$$ 4731100 4680578 4519964 4326785 4161649 4102102 4090758 4036638 3883024 3704180 3546190
13593C546190j62294L8711P7824R5326L1807r8202j12157n4805j26036p5165j91782
$$ 3546190 3383896 3422607 3500431 3595757 3627564 3529362 3417205 3362400 3236364 3161199 2969417
13582B969417j29024o6539j9035n7771M923L1609M192j10158j07710q2282k4259
$$ 2969417 2840393 2773854 2754819 2697048 2701971 2733580 2737772 2627614 2519904 2437622 2413363
13571B413363n1001n5796n0467n6120l1770p8893p4650j0297n0552l2961N3502
$$ 2413363 2362362 2306566 2256099 2199979 2168209 2089316 2014666 2004369 1953817 1920856 1974358
13560A974358m2962q1543l6590R5l8261N7677j0732j15449j70322l1184M9482
$$ 1974358 1931396 1849853 1813263 1813358 1775097 1832774 1822042 1706593 1536271 1505087 1554569
13549A554569M0064p674m8672l3644r2871j13228o0001n1714n8470M9391J1262
$$ 1554569 1594633 1586959 1538287 1504643 1411772 1298544 1238543 1186829 1128359 1177750 1189012
13538A189012O6157j7015m4642j6858J0754m7328N9321k1066l1153l2639k9038
$$ 1189012 1255169 1238154 1193512 1176654 1187408 1140080 1199401 1178335 1147182 1114543 1085505
13527A085505m811K5401r064L2500L024j17296l0628r022l1806k4469M0192R399
$$ 1085505 1080694 1106095 1097031 1129531 1132555 1015259 984631 975609 943803 919334 959526 968925
13515I68925q4049j5827p969k9135q070k8619n5533K2074q787p264j1641N0351
$$ 968925 884876 869049 861080 831945 823875 795256 739723 761797 753010 745746 734105 784456
13503G84456J9067o1461m4204n4739J5261K0682k2761J6695Q4781m6331n6937
$$ 784456 803523 742062 697858 643119 658380 679062 656301 672996 757777 711446 654509
13492F54509L5064m1485r8853k9676j0471Q1091O0987k8743r484L4084k0194k6868
$$ 654509 689573 648088 549235 519559 509088 590179 651166 622423 612939 647023 626829 599961
13480E99961k6369j2882j6830Q6521J3525r664K8224j04096n4587L565R4430K7066
$$ 599961 573592 560710 543880 630401 643926 634262 662486 558390 503803 507368 601798 628864
13468F28864r8508j1992M6639N8702m8947o9999k5326l237N9708J8497k7867M293
$$ 628864 530356 518364 565003 623705 574758 504759 479433 476196 535904 554401 526534 530827
13456E30827n0141j06417l9732J5506m6591l9522J2569J58337N6453q0860L5343
$$ 530827 480686 374269 334537 350043 303452 263930 276499 434836 491289 410429 445772
13445D45772L6617q2035p2948O1467q812j25856k0390L7210N0677Q249K3499q3621
$$ 445772 482389 400354 327406 388873 380061 254205 233815 271025 321702 329951 353450 269829
13433B69829j6418p5557j9860P6485L02K8617J9460M6454K3501O5625J3645q2082
$$ 269829 253411 177854 157994 234479 234781 263398 282858 329312 352813 418438 432083 350001
13421C50001n5872j0769n0813K8313K2601M0026j0431k5982l8757N64O0772j3452
$$ 350001 294129 283360 232547 260860 283461 323487 313056 287074 248317 248881 309653 296201
13409B96201J6620l1101L830J7779m2481k405N3336j8219j0281j4882j21626m5189
$$ 296201 312821 281720 285550 303329 260848 258443 311779 293560 283279 268397 146771 101582
13397A01582P4562L9250O6575n1931N5789O7327o085q1197j4733L3257M3321o321
$$ 101582 176144 215394 281969 230038 285827 353154 347069 265872 251139 284396 327717 321396
13385C21396L5668kK5300M9945J08279R2384R5530J16791O8387J5319Q972J12101
$$ 321396 357064 357062 382362 432307 540586 632970 728500 845291 913678 928997 937969 1050070
13373A050070J595j37967j68809j09117r0733r0304j17337r297N7053K532n2183
$$ 1050070 1051665 913698 744889 635772 545039 454735 337398 328101 385154 387686 335503
13362C35503m8115n5203j46601L4485Q1737J2255L1991J3526l6686k6527K4959
$$ 335503 287388 232185 85584 120069 201806 214061 246052 259578 222892 196365 221324
13351B21324k394m3998N0999j1836Q833L8235j3746J1151m4937j7443M4943K1816
$$ 221324 218930 174932 225931 214095 222928 261163 247417 258568 213631 196188 241131 262947
13339B62947j7421P904L1502K3172j0166Q17N3922M2954L9920R4666J12723J26283
$$ 262947 245526 253430 284932 308104 297938 298755 352677 395631 435551 530217 642940 769223
13327G69223J22497J32189J84602Q1011J24707J11758J14013Q5434m1613m1276
$$ 769223 891720 1023909 1208511 1289522 1414229 1525987 1640000 1725434 1683821 1642545
13317A642545o0855j18357k34409k21635j82074j52444p5780n5407Q127p7554
$$ 1642545 1581690 1463333 1228924 1007289 825215 672771 596991 541584 549711 472157
13307D72157m3651P98m5385o6702l3495L9396L3318k3261r5365p247P3386M1748
$$ 472157 428506 429304 383919 317217 283722 323118 356436 333175 237810 230563 303949 345697
13295C45697K2491J64111R9843k3382k157j6134m0816L1503L7725l9252L4282
$$ 345697 368188 532299 632142 608760 606603 590469 549653 581156 618881 579629 613911
13284F13911n804k5538K2272o2944j21971k1151K4360k7894k2517J0264O7014
$$ 613911 608107 582569 604841 541897 419926 398775 423135 395241 372724 382988 450002
13273D50002J36920J41668Q0375l3658O2008J7341r717J01335P9841O9165N4937
$$ 450002 586922 728590 808965 775307 837315 854656 844939 946274 1026115 1095280 1150217
13262A150217k6574j12277j28241k02443p4094j16869k1671O102J437l210m7345
$$ 1150217 1123643 1011366 883125 680682 606588 489719 468048 474150 475587 472377 425032
13251D25032m0922j00023K0397L5749P0122k190m9059N0798Q0732k8914P0918
$$ 425032 384110 284087 304484 340233 410355 408165 359106 409904 490636 461722 532640
13240E32640O2090N6651N7748J10545P9911J6143L9474p896k2701j6188q8201
$$ 532640 594730 651381 709129 819674 899585 915728 955202 947306 924605 908417 820216
13229H20216j09959j05902j42500j55061l1061J8603l2480J9474N966p054q210
$$ 820216 710257 604355 461855 306794 275733 294336 261856 281330 287296 280242 272032
13218B72032M1628M6799j1778K0306n3946k8301o2175j6133l9915l495L9877K6756
$$ 272032 313660 360459 348681 368987 315041 286740 224565 208432 168517 165022 204899 231655
13206B31655l4953K6466J8920l8728P316j2837J5234J04649O1271p6604j29081
$$ 231655 196702 223168 242088 203360 210676 197839 213073 317722 378993 302389 173308
13195A73308o0787L1191R6054O0871K598Q4058L5265K6927l0929K8769Q7831l5290
$$ 173308 112521 143712 239766 300637 303235 387293 422558 449485 418556 447325 535156 499866
13183D99866n2668K8070J38014n010l5116j1286m7744m7202k5346m6984k4501
$$ 499866 447198 475268 613282 608272 573156 561870 514126 466924 441578 394594 370093
13172C70093L6566j9867j11699r8355k2422N8204K433j9895l9869m1199J965o0182
$$ 370093 406659 386792 275093 176738 154316 212520 214953 195058 155189 113990 115955 55773
13160E5773J6337K9649m5448o0q084q238M4886J3717q344o6551o2819k5976M8491
$$ 55773 72110 101759 56311 56251 48167 39929 84815 98532 90188 23637 -39182 -65158 -16667
13147a6667R241m8153N0362P4499P4064L2502K764n9474o1381J9679J3864l9974
$$ -16667 -7426 -55579 -5217 69282 143346 175848 178612 119138 57757 77436 91300 51326
13135E1326j10943N833j4052P4354N3815K3039N8775O3680k6109k6137j2697O373
$$ 51326 -59617 -53784 -67836 6518 60333 83372 142147 205827 179718 153581 140884 147257
13123A47257J8719M278j5279k8911K1639J0706M4443J5104j30174m6631K176J4678
$$ 147257 165976 170254 154975 126064 147703 158409 202852 217956 87782 41151 43327 58005
13111E8005K5872n297M8606Q0202K8799o9221j914j5515P9217m9469J2391q0674
$$ 58005 83877 78580 127186 207388 236187 166966 165052 149537 228754 179285 191676 111002
13099A11002j39510N6868K5814k9489k0830K0139N272M5126o3057K9957K0107
$$ 111002 -28508 28360 54174 24685 3855 23994 29266 74392 11335 41292 61399
13088F1399K8897M8761k2763l1124m1276l4263q817o76J7535O6303j5217K2040
$$ 61399 90296 139057 116294 85170 43894 9631 814 138 17673 83976 68759 90799
13076I0799J14270M0481r9596m2293N244j9955K9594P378k320l5854l7008o6998
$$ 90799 205069 245550 145954 103661 108905 88950 118544 125922 123602 87748 50740 -16258
13064a6258n8480K0587R3152P7846N7876L9514m4343r2453n9503j2080O89j1270
$$ -16258 -74738 -54151 39001 116847 174723 214237 169894 77441 17938 5858 6547 -4723
13052d723O2872O4243p3383j9858M4859M4269j6311o1868m34J9589J2945O3463
$$ -4723 58149 122392 49009 29151 74010 118279 101968 40100 39666 59255 72200 135663
13040A35663k1700m5726O375K6848N8251J6419j37325n3803P1413l8573J873j05215
$$ 135663 113963 68237 74612 101460 159711 176130 38805 -14998 56415 17842 19715 -85500
13028h5500k6706N0567J5180K1237J0336J6703k1466J3009o77L3634L6732q787
$$ -85500 -112206 -61639 -46459 -25222 -14886 1817 -19649 -6640 -7317 26317 63049 54262
13016E4262L321M025k8480k5207n500M5897l2135j14042L0537Q9901l0815L4480
$$ 54262 57583 61608 33128 7921 2421 48318 16183 -97859 -67322 22579 -8236 26244
13004B6244N7136m6781n3258l0947n8435q0481J092R8590J24699J2949j4403r24
$$ 26244 83380 36599 -16659 -47606 -106041 -186522 -185430 -86840 37859 50808 36405 35481
12992C5481M7682n9621k2056K3629K986k8143j5758O6686k793k9403N7379N8320
$$ 35481 83163 23542 1486 25115 28101 -42 -15800 50886 48093 18690 76069 134389
12980A34389L0141j7844m1549l5894M4613K5423m842l3989j2204J1843p154j08579
$$ 134389 164530 146686 105137 69243 113856 139279 134437 100448 88244 100087 92933 -15646
12968a5646o8207J3983L9999l2238m6445Q0424K8943J895L6753k1330J4074k4610
$$ -15646 -83853 -69870 -29871 -62109 -108554 -28130 813 2708 39461 18131 32205 7595
12956G595l5045k6948M4846k6386r001L3417o2475N9938P2663K602K3400N0313
$$ 7595 -27450 -54398 -9552 -35938 -44939 -11522 -73997 -14059 58604 61206 84606 134919
12944A34919p8372j03018n5234J3375N1905p5671l5180L9282J42565M6146L0319
$$ 134919 56547 -46471 -101705 -88330 -36425 -112096 -147276 -107994 34571 80717 111036
12933A11036k5797n8331Q272O7874J377l8012l914n6084l5865J40749O2318j6040
$$ 111036 85239 26908 35180 103054 104431 66419 62505 6421 -29444 111305 173623 157583
12921A57583m0405n0271p5469j1454K1979l7055m3787P303Q0992O8911q1763l4697
$$ 157583 117178 66907 -8562 -20016 1963 -35092 -78879 -71576 9416 78327 -3436 -38133
12909c8133j5935l5429k6601J8698L3217k2144p581m4700K5885N1373L3832r838
$$ -38133 -54068 -89497 -116098 -97400 -64183 -86327 -93908 -138608 -112723 -61350 -27518 -37356
12897c7356K5160K3335k3183N8345O2127m0041n5305n4048l1259L8217n8774K1610
$$ -37356 -12196 11139 -12044 46301 108428 68387 13082 -40966 -72225 -34008 -92782 -71172
12885g1172K9387K1600O8943L420n9839J8667J4714j5384J9410n7304q4964L8524
$$ -71172 -41785 -20185 48758 52178 -7661 11006 25720 10336 29746 -27558 -112522 -73998
12873g3998L7883k9125k4635L6181K5288m1156o6480P4169N4072P5616m928m1753
$$ -73998 -36115 -65240 -89875 -53694 -28406 -69562 -136042 -61873 -7801 67815 62887 21134
12861B1134l4786Q1561p510k4497j5346o237n5305o7784K5746L1048n1470J5087
$$ 21134 -13652 67909 60399 35902 20556 14319 -40986 -108770 -83024 -51976 -103446 -88359
12849h8359O3087L6099j3455q6419m2210J02311L1618L865m0034n4611R3953P6621
$$ -88359 -25272 10827 -2628 -89047 -131257 -28946 2672 6537 -33497 -88108 5845 82466
12837H2466O1891O0387q9549l6685R81l4929k5884j6211l3732q9910M6203P8713
$$ 82466 144357 204744 115195 78510 79491 44562 18678 2467 -31265 -121175 -74972 3741
12825C741L8557K1297n2405n9038p5330J7898J00239K7885n9801J310k0415r804
$$ 3741 42298 63595 11190 -47848 -123178 -105280 -5041 22844 -36957 -35647 -56062 -65866
12813f5866j6939k1505J17047M7915K1134K945q9600o934N7999M1301j8815o5864
$$ -65866 -82805 -104310 12737 60652 81786 84731 -4869 -11803 46196 87497 68682 2818
12801B818j9900J7392m4041l1497N6700L9114L5536O1925k5419J9553L4274k70
$$ 2818 -17082 310 -43731 -75228 -18528 20586 56122 118047 92628 112181 146455 146185
12789A46185k6032k2318J2575n104r5140r900J5287l4268k1257L1220O2399q918
$$ 146185 120153 97835 110410 105306 10166 266 15553 -18715 -39972 -8752 53647 44729
12777D4729o1471n8470j6897K2302R1020M5677n6549m2479N195N6533j2305M05
$$ 44729 -16742 -75212 -92109 -69807 21213 66890 10341 -32138 -26943 29590 17285 17690
12765A7690l1668n9855j0344Q4877q999m6739n3494Q0512R4810n9r0007n6302
$$ 17690 -13978 -73833 -84177 700 -8299 -55038 -108532 -28020 66790 66731 -23276 -79578
12753g9578K560M5336O8748r484j5713l6951k6103k045j792L0804K6093M214m0970
$$ -79578 -77018 -31682 37066 27582 11869 -25082 -51185 -53230 -55022 -24218 1875 6089 -34881
12740c4881m2480j509k108P1587K6448k436k3580j6404J2833P2463J46q5026N9150
$$ -34881 -77361 -78870 -80978 -9391 17057 14621 -8959 -25363 -12530 59933 60079 -24947 34203
12727C4203P1631j06324n3016P9598J11096l936o4645R410l117k9796L2530k5655
$$ 34203 105834 -490 -53506 26092 137188 133252 68607 78017 74900 45104 77634 51979
12715E1979p9138j1835K0173n838j9916P6385N5106J241j0311M90n6444j1078
$$ 51979 -27159 -38994 -18821 -24659 -44575 31810 86916 88157 77846 78336 21892 10814
12703A0814k5014n1055K1933j8042q231k7370J5991K3630P3404k1909n2597n8813
$$ 10814 -14200 -65255 -43322 -61364 -69595 -96965 -80974 -57344 16060 -5849 -58446 -117259
12691a17259R479M3665J2527K1954P8212m7105K7913m0947l9897P8784j5434j1328
$$ -117259 -107780 -64115 -51588 -29634 48578 1473 29386 -11561 -51458 27326 11892 564
12679E64K3204J377R022M4025j961n3567J6897n2596k6274j0117l2922l1013K3258
$$ 564 23768 25145 34167 78192 76231 22664 39561 -13035 -39309 -49426 -82348 -113361 -90103
12666i0103k0131l7357K4518O5230K2200o7622M2477M9608L4642j1848m7355m0093
$$ -90103 -110234 -147591 -123073 -57843 -35643 -103265 -60788 -11180 23462 11614 -35741 -75834
12654g5834l1484J17103J12445J17130M1998L5636R15K2358P811k6391O6606J27515
$$ -75834 -107318 9785 122230 239360 281358 316994 317909 340267 348078 321687 388293 515808
12642E15808Q8009L4152j44270j66554r7318o9937n4603m7609n9407o7572O800
$$ 515808 603817 637969 493699 327145 229827 159890 105287 57678 -1729 -69301 -62501
12631f2501P0330J1962J1248M5472l5019j040J1086Q501L9584M5072K9806q1001
$$ -62501 7829 19791 31039 76511 41492 40452 51538 60039 99623 144695 174501 93500
12619I3500k6433J4290n364K5039k3587o3843j3796P9879P3352L981j4612j2236
$$ 93500 67067 81357 75993 101032 77445 13602 -194 79685 153037 157018 142406 130170
12607A30170o6138n4335M31Q7790N8506j0002p3525j15714k5674O7410J03104
$$ 130170 64032 9697 10128 97918 156424 146422 72897 -42817 -68491 -1081 102023
12596A02023J0419p4022Q3656N6270m0774l8679k8602Q366m2303r0585n348P7636
$$ 102023 112442 38420 122076 178346 137572 98893 70291 78657 36354 -54231 -59579 18057
12584A8057P1861J547k1963K7925N73p7954n195L13l4140P5545m338j36127j2196
$$ 18057 89918 91465 69502 97427 98000 20046 14851 15164 -18976 56569 52231 -83896 -96092
12571i6092Q7891J0396m1647L1377J1045O3913j317K6882K0357N0074k6119q0008
$$ -96092 -8201 2195 -39452 -8075 2970 66883 65566 92448 112805 162879 136760 56752
12559E6752q213K3123k4354j6847r209l0831l2440M4842L4631l2507N6836M3098
$$ 56752 48539 71662 47308 30461 21252 -9579 -42019 2823 37454 4947 61783 104881
12547A04881M9620l7972p5057k7269M207l297l2575m168L689P1815K6616l4026
$$ 104881 154501 116529 41472 14203 18410 15113 -17462 -21630 -17941 53874 80490 46464
12535D6464q5866l0463o872L1972q88J0171J9268m2844j9031P4555M0797M8488
$$ 46464 -39402 -69865 -76737 -44765 -45653 -35482 -16214 -59058 -78089 -3534 37263 85751
12523H5751Q693r2469M6582K3760l5661R230L4090n633j6569m2351q6488P3422
$$ 85751 94444 1975 48557 72317 36656 45886 79976 74343 57774 15423 -71065 2357
12511B357J1661q1919j7994R7225P369l1143N756K3108j3272j1471j3598N9630
$$ 2357 14018 -67901 -85895 11330 18699 -12444 -6688 16420 3148 -8323 -21921 37709
12499C7709L7789j7166j15370K6797K1845o7977m6330K6192l1414N7203R7257
$$ 37709 75498 58332 -57038 -30241 -8396 -76373 -122703 -96511 -127925 -70722 26535
12488B6535m1671K747k8752K2020P0571l844k5335p0067R213L7683m0506j3169
$$ 26535 -15136 -12389 -41141 -19121 51450 47606 22271 -47796 -38583 -900 -41406 -54575
12476e4575K9426n1715j5154O2342K2748k2426k7066K8063K2049Q142J8633j1052
$$ -54575 -25149 -76864 -92018 -29676 -6928 -29354 -56420 -28357 -6308 1834 20467 9415
12464I415J6303M2659j3782j8088p2774O4866M7702K597n01p0350p022N0718j0443
$$ 9415 25718 68377 54595 36507 -36267 28599 76301 78898 78397 8047 1025 51743 41300
12451D1300l5106J0387m2556j0811K8757j7074k5885N8184K008n4998m4698j5483
$$ 41300 6194 16581 -25975 -36786 -8029 -25103 -50988 7196 9204 -45794 -90492 -105975
12439a05975M1510L0643J9224P7939K9041J0391m1965q111Q45R5697o6563K0267
$$ -105975 -64465 -33822 -14598 63341 92382 102773 60808 52697 53542 149239 82676 102943
12427A02943k5625J3523q13K6n2292k3395J9244j886m1560N9693J557L9055L6252
$$ 102943 77318 90841 90028 90054 37762 14367 33611 31725 -9835 49858 51415 90470 126722
12414A26722M8697q9430j24931l4577O1799L7307k6946M8897j048j758o862o8333
$$ 126722 175419 85989 -38942 -73519 -11720 25587 -1359 47538 46490 44732 37870 -30463
12402c0463L0113R3125O7299J01724M2811k8563p7822p9797p8281k817m5765k861
$$ -30463 -350 92775 160074 261798 304609 276046 198224 118427 40146 37329 -8436 -11297
12390a1297R815l788K5551L9484R908Q3113j2076o0870p0202L0377P3115L2864
$$ -11297 -1482 -5270 20281 59765 69673 152786 140710 79840 9638 40015 113130 145994
12378A45994P5M6296p0566j870N979m6806o9230L2251J6883J5381P7202k2938
$$ 145994 146069 192365 121799 119929 125908 79102 9872 42123 59006 74387 151589 128651
12366A28651J1302m2362o3090L1966m034j0029j4203j6461n30J5105J8057P19
$$ 128651 139953 97591 34501 66467 62433 52404 38201 21740 21210 36315 54372 55091
12354E5091j4764L1475j9274Q99M04l9093J0060Q8058L281k9193m1123j17530
$$ 55091 40327 71802 52528 53427 53831 14738 24798 112856 116137 86944 45821 -71709
12342g1709m0127Q5677N9579J6071L7173K0069L1393M6468m1667M2307p0822r9421
$$ -71709 -111836 -26159 33420 49491 86664 106733 138126 184594 142927 185234 114412 14991
12330A4991L7107J09476P928k8442p099j4205j078l7114r201R20K8773N7747m8568
$$ 14991 52098 161574 169502 141060 133961 119756 118678 81564 72363 73283 102056 159803 111235
12317A11235n9618l776L693Q5259K1821m405j4954m373J6969k6193l4169m3180
$$ 111235 51617 47841 51534 136793 158614 154209 139255 134882 151851 125658 91489 48309
12305D8309j3791J1220K3867j4842O9791M1232J5639l7614q8749L692O352n70
$$ 48309 34518 45738 69605 54763 124554 165786 181425 143811 55062 58754 65106 64536
12293F4536o544M1287M137n1718M8036N0045l6601J1519o80m4149K4660R844Q2245
$$ 64536 57992 99279 103416 51698 99734 149779 113178 124697 124017 79868 104528 114372 196617
12280A96617Q708j0837J9695j1214p3077m824N9780M867j0937l5562n2581q4023
$$ 196617 205325 194488 214183 202969 129892 125068 184848 189715 178778 143216 90635 6612
12268F612k5182l19M2471j655N3189P9464r624o0979j3458M5308L9925j0750J6688
$$ 6612 -18570 -18889 23582 21927 75116 154580 144956 83977 70519 115827 155752 145002 161690
12255A61690n0369o2841j8895o48k3156O4715j8896q3389r464M9827M0266j733
$$ 161690 111321 48480 29585 28937 5781 70496 51600 -31789 -41253 8574 48840 47107
12243D7107k5864M0055N480n0340O341P2025k0164l1961l400Q8866M1146p8153
$$ 47107 21243 61298 66778 16438 22779 94804 74640 42679 39279 128145 169291 91138
12231I1138j7384J7873L654m7918m2214N5259M6218L6033o2384p4213j2894J7078
$$ 91138 73754 91627 95281 47363 5149 60408 106626 142659 80275 6062 -6832 10246
12219A0246K8443l3508j3727O4005M7184J7239l0253q5232M578J07919O3472o9314
$$ 10246 38689 5181 -8546 55459 102643 119882 89629 4397 8975 116894 180366 111052
12207A11052J4150j3884q700j9550k1318o148j2234j2811J897j3519k4547J5755
$$ 111052 125202 111318 102618 83068 61750 55602 43368 30557 32454 18935 -5612 10143
12195A0143l0089J4970L3797l1855o2450R8016j1003l2519K893J3782O7430N3669
$$ 10143 -19946 -4976 28821 -3034 -65484 32532 21529 -10990 -8097 5685 73115 126784
12183A26784P6483k4535n4064j7207k3545K6964N5700L9964j7811k2957o4907
$$ 126784 203267 178732 124668 107461 83916 110880 166580 206544 188733 165776 100869
12172A00869R82K0654k0695o2609l2228O0812l8667p2232N0307j435O773l0824
$$ 100869 101851 122505 101810 39201 6973 67785 29118 -43114 7193 5758 12531 -18293
12160a8293L2544Q7627Q8122R26K682K0048j05940n1501L6261K5392L3786j8001
$$ -18293 14251 101878 190000 190926 193608 213656 107716 56215 92476 117868 151654 133653
12148A33653j4752J8255j267K1977n6399r0747O919O3097o807o7716K4506J4289
$$ 133653 118901 137156 135889 157866 101467 10720 17639 80736 73929 6213 30719 45008
12136D5008p616J05412O9555O033K2303K239o6761J0459K1121L2412n0497r4942
$$ 45008 37392 142804 212359 218392 240695 242934 176173 186632 207753 240165 189668 94726
12124I4726K5365Q9193n9398p0929O8010Q6479N7769J9084K9262l7129l6644N9059
$$ 94726 120091 209284 149886 78957 146967 233446 291215 310299 339561 302432 265788 324847
12112C24847L5045m0992n0527Q4868P1685J26314O9935L4810R1106l612J097j9442
$$ 324847 359892 318900 268373 353241 424926 551240 621175 655985 747091 743479 744576 725134
12100G25134M4198L0643j53849q3789m4297M0228O7127l2774j28470q5990O5075
$$ 725134 769332 799975 646126 562337 518040 558268 625395 592621 464151 378161 443236
12089D43236P3433k0798L8766K0498K1408j5990r3469m4184J4534M0949k1819
$$ 443236 516669 495871 534637 555135 576543 560553 467084 422900 437434 478383 456564
12078D56564N565P0257K176n6105j1880K0006J3151q5426r7459J6847l359o2882
$$ 456564 462129 532386 534562 478457 466577 486583 499734 414308 316849 333696 330337 267455
12066B67455N3598O6474K3091l4003J7197L7871Q7049J05939N1116N3198Q5528
$$ 267455 321053 387527 410618 376615 393812 431683 518732 624671 675787 728985 814513
12055H14513Q5835O3081L5747J9330K2289R3425J52250Q7193J12393O3021p6105
$$ 814513 900348 963429 999176 1018506 1040795 1134220 1286470 1373663 1486056 1549077 1472972
12044A472972J372r57q5415n9502j19708j50319q3078P7584q618l7152p9505n0601
$$ 1472972 1474344 1473387 1387972 1328470 1208762 1058443 975365 1052949 1044331 1007179 927674 877073
12032H77073l0407n5444m6494L9480J31000K1805q8267j24529j7679L9585J6755
$$ 877073 846666 791222 744728 784208 915208 937013 848746 724217 706538 746123 762878
12021G62878k7310o1195K1940k0270n0695p2221m2324o4007m7177k3440K4486
$$ 762878 735568 674373 696313 676043 625348 553127 510803 446796 399619 376179 400665
12010D00665M7490J0733k103p981n135J4562N3841K5231o7482L5857R9709J50012
$$ 400665 448155 458888 456785 448804 443669 458231 512072 537303 469821 505678 605387 755399
11998G55399k3220j6288M4205L1155l4072L0143J5425l9739n0777K6347L3385
$$ 755399 732179 715891 760096 791251 757179 787322 802747 763008 712231 738578 771963
11987G71963o1699m4332k3244K334j148K0994o4123o2264k339J0060r6614q9949
$$ 771963 710264 665932 642688 645022 643874 664868 600745 538481 536142 546202 449588 359639
11975C59639Q2501J06058L6704N5092k2689r9347j2709o9361p9422j1651J2753
$$ 359639 442140 548198 584902 639994 617305 517958 505249 435888 356466 344815 357568
11964C57568K0522K5060k9321N8963n7570M157j5951O057O382R775p5299q4812
$$ 357568 378090 403150 373829 432792 375222 379379 363428 369485 375867 385642 310343 225531
11952B25531J6807K1501Q167R4338j778m6931o774m6565K3023K0627K8105J9666
$$ 225531 242338 263839 272006 366344 364566 317635 310861 264296 287319 307946 336051 355717
11940C55717k1082K9288K6305Q863M7928P0504J15264K16375K11823O2252N1690
$$ 355717 334635 363923 390228 399091 447019 517523 632787 849162 1060985 1123237 1174927
11929A174927J51723J53699J08118O1297K3773K5161k79284l91860k92637j99333
$$ 1174927 1326650 1480349 1588467 1649764 1673537 1698698 1419414 1027554 734917 535584
11919E35584o1348j15q7768R783j777P290k1223J19609n5813o5969J0887j8638
$$ 535584 474236 474121 386353 396136 394359 401649 380426 500035 444222 378253 389140 370502
11907C70502j7984N660p8385o5395K8362M9766J9611k2521m5153j5959K5537J6837
$$ 370502 352518 358178 279793 214398 242760 292526 312137 289616 244463 228504 254041 270878
11895B70878n5309k3745O971K7989N1501J216N5525Q7833M8032m243J9132L9221
$$ 270878 215569 191824 198795 226784 278285 279501 335026 422859 470891 466648 485780 525001
11883E25001p284l2160Q296m3683r3653o853J1725P5177L5509N7232M0213n5910
$$ 525001 517717 485557 493853 450170 356517 349664 361389 436566 472075 529307 569520 513610
11871E13610m2196k2158K3812j5184K8600N343m6228L7942m5848j3786R2099J3176
$$ 513610 471414 449256 473068 457884 486484 491827 445599 483541 437693 423907 516006 529182
11859E29182R046n9348k6994P3585N0988l8301o9746p6961o7634M1199L2475L919
$$ 529182 538228 478880 451886 525471 576459 538158 468412 391451 323817 365016 397491 401410
11847D01410L7634o331l8219p0253n1411k5341J881l7812k3318K0226O6426J41036
$$ 401410 439044 432713 394494 324241 272830 247489 249370 211558 188240 208466 274892 415928
11835D15928K8320O3555J8757j7728m0554k0000Q602J7452M2083N5753M5176M3305
$$ 415928 444248 507803 526560 508832 468278 448278 456880 474332 516415 572168 617344 660649
11823F60649n6712J9299m8968j2703N4361P5064M1183l8922l6965N9416L630r212
$$ 660649 603937 623236 574268 561565 615926 690990 732173 693251 656286 715702 719332 710120
11811G10120N4274L4681K2472L7059M3381J5010j2420m572j4097O8242J09945
$$ 710120 764394 799075 821547 858606 901987 916997 904577 900005 885908 954150 1064095
11800A064095J74696R4400j1411n0180l4271l706N6243M6643K6135M5997j8885
$$ 1064095 1238791 1333191 1321780 1271600 1237329 1233623 1289866 1336509 1362644 1408641 1389756
11789A389756J4148Q0566K1353N711O814O117K7512J06823M4838q392j1156n2675
$$ 1389756 1403904 1484470 1505823 1511534 1518348 1524465 1551977 1658800 1703638 1695246 1684090 1631415
11777A631415K33M895q7861k2103m3899Q1762M218p7699n4751m3487R5909n268
$$ 1631415 1631648 1636543 1548682 1526579 1482680 1564442 1568660 1490961 1436210 1392723 1488632 1483364
11765A483364Q752M0674Q689k9702m9773k4229N6772J54677J35225k1147M237
$$ 1483364 1492116 1532790 1541479 1511777 1462004 1437775 1494547 1649224 1784449 1763302 1767539
11754A767539K2956N2168P9795K36168K2736k2123O9314P2513O1199J03121M9376
$$ 1767539 1790495 1842663 1922458 2158626 2181362 2159239 2228553 2301066 2362265 2465386 2514762
11743B514762Q6465K7935P7867J45903R3092K2151L0423J8572K9582J85771R1905
$$ 2514762 2601227 2629162 2707029 2852932 2946024 2968175 2998598 3017170 3046752 3232523 3324428
11732C324428m5683j0918J9761P1389P0605n0991j3785J6675L1024K5646J8675
$$ 3324428 3278745 3267827 3287588 3358977 3429582 3378591 3364806 3381481 3412505 3438151 3456826
11721C456826q22M9451J86856J20400R2035M5126P4832J30681R8982J55447K38096
$$ 3456826 3456004 3505455 3692311 3812711 3904746 3949872 4024704 4155385 4254367 4409814 4647910
11710D647910J25053J75827K51752L49663M03448M12586M48641N51735N90852
$$ 4647910 4772963 4948790 5200542 5550205 5953653 6366239 6814880 7366615 7957467
11701G957467O43335P98312J077124J321664J571087J925194K677625L697458
$$ 7957467 8600802 9399114 10476238 11797902 13368989 15294183 17971808 21669266
11693B1669266M885435N650405O160121O804638P622639Q656951R737369J0579220
$$ 21669266 26554701 32205106 38365227 45169865 52792504 61449455 71186824 81766044
11685H1766044J0997365R897175P606194N821387M837051M058142L151871K101662
$$ 81766044 92763409 102660584 110266778 116088165 120925216 124983358 128135229 130236891
11677A30236891M57726k041306m808819o024047n712287n012891m414710m148260
$$ 130236891 130694617 128653311 123844492 117820445 112108158 107095267 102680557 98532297
11669I8532297l802138l516857l318160k375363p61574M19977Q80885R30643P66686
$$ 98532297 94730159 91213302 87895142 85519779 84758205 85178182 86059067 86989710 87756396
11660H7756396L46041k27609p70735j553463k230306k827446l392767l814296
$$ 87756396 88102437 87874828 87104093 85550630 83320324 80492878 77100111 73285815
11652G3285815l879185l771473l744640l657140l316725k869342k490550j855696
$$ 73285815 69406630 65635157 61890517 58233377 54916652 52047310 49556760 47701064
11644D7701064j172477k67658O92700J810400L266518M878264O434619Q352322
$$ 47701064 46528587 46260929 46953629 48764029 52030547 56908811 63343430 71695752
11636G1695752J0554079J1953365J3119732J4956103J6921278J8036512J7649038
$$ 71695752 82249831 94203196 107322928 122279031 139200309 157236821 174885859
11629A74885859J7552294J6954230J2764288Q983840P535181N578581L172110
$$ 174885859 192438153 209392383 222156671 231140511 238675692 244254273 247426383
11622B47426383l74278l183017n357020r099292j1249470j0994550r214201p552264
$$ 247426383 247052105 243869088 238512068 229412776 218163306 207168756 197954555 190402291
11614A90402291p688081o474720m471338m118782k943227o75744R13262J191028
$$ 190402291 182714210 176239490 171768152 167649370 164706143 164030399 164943661 166134689
11606A66134689P19685r7562j273845k761826m338824n734523o986219q005257
$$ 166134689 166854374 166756812 165482967 162721141 158382317 152647794 145661575 137656318
11598A37656318q675826q903765q874416q622924q311158p644937o829798n937931
$$ 137656318 128980492 120076727 111202311 102579387 94268229 86623292 79793494 73855563
11590G3855563n075999m131318l194285k372267j574836o60665L28628J456868
$$ 73855563 68779564 64648246 61453961 59081694 57506858 56846193 57174821 58631689
11582E8631689K587421L407431M141220M797486N667595O715141P577166Q355267
$$ 58631689 61219110 64626541 68767761 73565247 79232842 85947983 93525149 101880416
11574A01880416Q296760P257326N658125M044002L172067K657942J709091P21054
$$ 101880416 110177176 117434502 123092627 127136629 130308696 132966638 134675729 135396783
11566A35396783q93698k961414m783407n870758n564598m763906m337206l916556
$$ 135396783 134503085 131541671 126758264 120887506 115322908 110559002 106221796 102305240
11558A02305240l741357l550437l152889k425910j362468o83078m47231m62577
$$ 102305240 98563883 95013446 91860557 89434647 88072179 87389101 86941870 86479293
11550H6479293o94054j187026j726656k404395k974062l566245m012262m255651
$$ 86479293 85785239 84598213 82871557 80467162 77493100 73926855 69914593 65658942
11542F5658942m406229m380423m301016m116791l882215l597630l216113k896602
$$ 65658942 61252713 56872290 52571274 48454483 44572268 40974638 37758525 34861923
11534C4861923k552214k227807j894040j660082j408909j308946j260212j088494
$$ 34861923 32309709 30081902 28187862 26527780 25118871 23809925 22549713 21461219
11526B1461219j011728j044653r75653p89188o93913n99475o15116o23624n69757
$$ 21461219 20449491 19404838 18429185 17639997 16946084 16346609 15731493 15107869 14538112
11517A4538112n21123n69578m74473n49777n05235l56407l27716l97050l53511
$$ 14538112 14016989 13447411 12972938 12423161 11917926 11561519 11233803 10836753 10483242
11508A0483242k03680k73076l28530l15661k89622k71086k00678k55941j83627
$$ 10483242 10279562 10006486 9677956 9362295 9072673 8801587 8600909 8344968 8161341
11499H161341j63529k58724k01306j56116j41349j98388j91251k29700j77422
$$ 8161341 7997812 7739088 7537782 7381666 7240317 7041929 6850678 6620978 6443556
11490F443556j31762j28398j66169r2796j22148j40729o1626j25244j84620j34088
$$ 6443556 6311794 6183396 6017227 5924431 5802283 5661554 5599928 5474684 5290064 5155976
11480E155976j28789j85661r9533j08074n0771r9231j2924j6493j42973j22996
$$ 5155976 5027187 4841526 4741993 4633919 4583148 4483917 4470993 4454500 4311527 4188531
11470D188531q1551m6882r7749m4738r7573j25081q7089l8678m8947n0447l4170
$$ 4188531 4106980 4060098 3962349 3917611 3820038 3694957 3607868 3569190 3520243 3469796 3435626
11459C435626j24564q6611j53539j18202j15226m3908l9435r5932N0589J4595
$$ 3435626 3311062 3224451 3070912 2952710 2837484 2793576 2754141 2658209 2708798 2723393
11449B723393j41011j48025j4008J2767l7574p6602q8692o8402l5559l9452n4429
$$ 2723393 2582382 2434357 2420349 2433116 2395542 2318940 2230248 2161846 2126287 2086835 2032406
11438B032406O3739j0924l8557Q305L6338q5496n9250L8084p1286k8932o8065
$$ 2032406 2096145 2085221 2046664 2054969 2091307 2005811 1946561 1984645 1913359 1884427 1816362
11427A816362r2867p7678o0034K7461j6045p1894r8783k6696K120Q7133K071n0600
$$ 1816362 1723495 1645817 1585783 1613244 1597199 1525305 1426522 1399826 1401946 1489079 1491150 1440550
11415A440550o0879J706M2564k9231P791l6358L0827J2350k0679r2415p9769m3423
$$ 1440550 1379671 1381377 1423941 1394710 1402501 1366143 1396970 1409320 1388641 1296226 1216457 1173034
11403A173034K8760j4196L5720m4457p8459n3009k3178j7955q4951L0731M3257
$$ 1173034 1201794 1187598 1223318 1178861 1100402 1047393 1024215 1006260 921309 952040 995297
11392I95297l4460o9932L0147J08239Q2473m3531m3865J299o6286l9350r0272
$$ 995297 960837 890905 921052 1029291 1111764 1068233 1024368 1025667 959381 920031 829759
11381H29759j2777N1516J1927q2147k1807M6325m621o613R474o6296K006L1001
$$ 829759 816982 868498 880425 798278 776471 822796 818175 811562 821036 754740 756746 787747
11369G87747j0867K1388Q085m6867N873m2563k687r703K961j4367N9697l1645
$$ 787747 776880 798268 806353 759486 765359 722796 720109 710406 713367 699000 758697 727052
11357G27052o717k9276J1273j9281L7635l8113k2585J7026P827k6848j05723l8918
$$ 727052 720335 691059 702332 683051 720686 682573 659988 677014 684841 657993 552270 513352
11345E13352N6564j2710J3033l836m323O0232l8421o354j7847J210J941m5226
$$ 513352 569916 557206 570239 566403 562080 622312 583891 577537 559690 560900 562841 517615
11333E17615p1409k8703Q3250J9340j0056j5729q9813k4183n4308P5055Q3514
$$ 517615 446206 417503 500753 520093 510037 494308 404495 380312 326004 401059 484573
11322D84573j7675L8760K2686N3491j2260M929k3653j11253o3135K5646j8278
$$ 484573 466898 505658 528344 581835 569575 574504 550851 439598 376463 402109 383831
11311C83831L8138K2657Q7108M1810r9065k9392k5670l3389k8846N4007N91m095
$$ 383831 421969 444626 531734 573544 474479 445087 419417 386028 357182 411189 411780 407685
11299D07685j07650p0159K1663R3507L0314k7181r3911k9869J00446R3647M1732
$$ 407685 300035 229876 251539 345046 375360 348179 254268 224399 324845 418492 460224
11288D60224l6789l4209n5289r699N708M5511l9443J37j4392n7547M6009L6840
$$ 460224 423435 389226 333937 324238 329946 375457 336014 336151 321759 264212 310221 347061
11276C47061K3342k6209j3039l0805r317L2100O3074M929r5668n3148J32046j4425
$$ 347061 370403 344194 331155 300350 291033 323133 386207 391136 295468 242320 374366 359941
11264C59941o0432l4100J0626K2032l460N4979P0756P0099R1039J25377O6074
$$ 359941 299509 265409 276035 298067 294607 349586 420342 490441 581480 706857 772931
11253G72931O0624M113m0425K0485N322P314R797p153p2523M5967K4784j2736
$$ 772931 833555 837668 797243 817728 823050 830364 840161 833008 760485 806452 831236 818500
11241H18500l7598n6204m5764l3600J2051J685N0264N564l7566L758N0676J4633
$$ 818500 780902 724698 678934 645334 657385 659070 709334 714898 677332 681090 731766 746399
11229G46399r3131k2171K6865o3420R929k5298N705j7112j01994n4623k9066n906
$$ 746399 653268 631097 657962 594542 604471 579173 584878 567766 465772 411149 382083 376177
11217C76177O6436M7888L13J8754K2299l3393O583J8443K4231J3230L7118N5852
$$ 376177 442613 490501 490814 509568 531867 498474 505057 523500 547731 560961 598079 653931
11205F53931Q2027O2083Q9620L765R2465J55605J48082Q7056J3053K2307K4057
$$ 653931 735958 798041 887661 891426 983891 1139496 1287578 1374634 1387687 1409994 1434051
11194A434051m9049L4010R8309j6744k3395n6905m5300m4871k242l4631r0445
$$ 1434051 1385002 1419012 1517321 1500577 1477182 1420277 1374977 1330106 1327864 1293233 1202788
11183A202788o2809K0053r566L9099k3611j14195j07476j9144l2465L2990r0466
$$ 1202788 1139979 1160032 1150466 1189565 1165954 1051759 944283 925139 892674 925664 835198
11172H35198o6400L062N0026p0181r8520j065l2660l4122r772n8261m3976l8639
$$ 835198 768798 771860 821886 751705 653185 652120 619460 585338 575566 517305 473329 434690
11160D34690k2521l9654l4067j6798M7146K0628L597Q192J599l268P9833P0088
$$ 434690 412169 372515 338448 321650 368796 389424 393021 401213 402812 399544 479377 549465
11148E49465P42N0083J01646J27165M7379M2622L2794j9430l8304R1007Q5711
$$ 549465 550207 600290 701936 829101 876480 919102 951896 932466 894162 985169 1070880
11137A070880o7684j47622q6669M4936k021j12648k4341q540n3873J6216k2518
$$ 1070880 1003196 855574 768905 813841 811820 699172 674831 666291 612418 628634 606116
11126F06116M0729l3858p0155q103k2643r428K5587L6730o553k6012o9371o780
$$ 606116 646845 612987 542832 534729 512086 502658 528245 564975 558422 532410 463039 456259
11114D56259k3022j9318o7513n340J7413J0562k1304J5379o3772O464N1762o6033
$$ 456259 433237 413919 346406 341066 358479 369041 347737 363116 299344 305808 357570 291537
11102B91537k9399n8413J0485L8360k1594k3138K270J861j4059J607o686n4850
$$ 291537 262138 203725 214210 252570 230976 207838 210108 211969 197910 199517 192831 137981
11090A37981m7259O2760L9195N3M664J545J4984O5718m071o5610o7923J9361p99
$$ 137981 90722 153482 192677 192730 197394 198939 213923 279641 275570 209960 142037 161398 160599
11077A60599m5356p2689p7920J4697M4754L9420J02194l3606k1022M7929O6450
$$ 160599 115243 42554 -35366 -20669 24085 63505 165699 132093 111071 159000 225450
11066B25450l9778K3909k5441M41r962o2240o058j2917n4898m1673J07425J62220
$$ 225450 185672 209581 184140 184581 174619 112379 106321 93404 38506 -3167 104258 266478
11054B66478k69j5992q3453N5789K0514L4141J41880M2374k8150R910j10398k6147
$$ 266478 266209 250217 166764 222553 243067 277208 419088 461462 433312 443222 332824 306677
11042C06677k3131M4167J06726J32969J7148r3236k7279J9036J17995M2766l4058
$$ 306677 283546 327713 434439 567408 584556 491320 464041 483077 601072 643838 609780
11031F09780k0169k889J5749J9296m7846J7222q322k4144N731N0266J89567M436
$$ 609780 589611 586722 602471 621767 573921 591143 582821 558677 564408 614674 804241 808677
11019H08677r2423j01561j07940j4171N3759O866n1887j4805J3373m9840j0439
$$ 808677 716254 614693 506753 492582 546341 553207 501320 486515 499888 450048 439609
11008D39609J2255l1349o9411j6876N401k6628k6813j2365Q3890K2966k5324k8212
$$ 439609 451864 420515 351104 334228 339629 313001 286188 273823 357713 380679 355355 327143
10996C27143m9541L9412j16237j17218n4769K1878N802J4213J3799L8686Q07K2754
$$ 327143 277602 317014 200777 83559 28790 50668 56470 70683 84482 123168 123975 146729
10984A46729j8425k8304N0290o1927k3371O4260L9487q067j14892p8423K4356
$$ 146729 128304 100000 150290 88363 64992 129252 168739 160672 45780 -32643 -8287
10973h287L1862N6397O7264l616j2157J0507K3384m1343o2472N668P0979K4420
$$ -8287 23575 79972 147236 143620 131463 141970 165354 124011 61539 67207 138186 162606
10961A62606l4034J1657j4938r9401r1239K9878m3480M4161O9798J02411K3460
$$ 162606 128572 140229 125291 25890 -65349 -35471 -78951 -34790 35008 137419 160879
10950A60879N5392n5198j00370p6549q147N1736M5832K5303L2326m3931L6974
$$ 160879 216271 161073 60703 -15846 -23993 27743 73575 98878 131204 87273 124247
10939A24247j3269j1199m8864j03942N5277J28080P65m722n7321l9646K0262J5590
$$ 124247 110978 99779 50915 -53027 2250 130330 131095 126373 69052 29406 49668 65258
10927F5258k0371n9345l3879K1150O3038K6027m1365q6410L6034N2159O1967J6382
$$ 65258 44887 -14458 -48337 -27187 35851 61878 20513 -65897 -29863 22296 84263 100645
10915A00645m1104j5360k536j2134n9386k5000M5538M6028K8383j7989P178M0221
$$ 100645 59541 44181 41645 29511 -29875 -54875 -9337 36691 65074 47085 54263 94484
10903I4484P1209K3082n5418m8663j18378o365K9684P9429K4792M9191N6476n5805
$$ 94484 165693 188775 133357 84694 -33684 -40049 -10365 69064 93856 143047 199523 143718
10891A43718j13491q7770m2848M8758J8923R6598M2497m1086O91M03L5459P8443
$$ 143718 30227 -57543 -100391 -51633 -32710 63888 106385 65299 65990 66393 101852 180295
10879A80295N216k9670q7108r1778m597K7386m5907O514O2610K5684N2162K620
$$ 180295 185511 155841 68733 -23045 -27642 -256 -46163 -39649 22961 48645 100807 103427
10867A03427L3914L1168l6969J7505N653L5899p9961n1877k6273r476K0199M8921
$$ 103427 137341 168509 131540 149045 154698 190597 110636 58759 32486 23010 43209 92130
10855I2130L0294l7372L823J7855J3230O2532K1653o2895m9487m6352l1647N8329
$$ 92130 122424 85052 88875 106730 119960 182492 204145 141250 91763 45411 13764 72093
10843G2093P7519R0124K1476n9639m7353K9708r760n0425j15218J8678k7048j4737
$$ 72093 149612 239736 261212 201573 154220 183928 174168 123743 8525 27203 155 -14582
10831a4582L004L965N9055P931j13872N2022J32574K4369L6814K0798k5693q6622
$$ -14582 -11578 -7613 51442 59373 -54499 -2477 130097 154466 191280 212078 186385 99763
10819I9763k2238m1952N0271P9643l6746l4626n3374r3055k9569j9248L4834R0133
$$ 99763 77525 35573 85844 165487 128741 94115 40741 -52314 -81883 -101131 -66297 23836
10807B3836J3443J2514J1526P767J0957j20866q9477O7376L1667N5484k2641k2370
$$ 23836 37279 49793 61319 69086 80043 -40823 -130300 -62924 -31257 24227 1586 -20784
10795b0784m4047l1101M8088Q2062P6451j6821q2185n9438M7309N9376M8468M5916
$$ -20784 -64831 -95932 -47844 34218 110669 93848 11663 -47775 -466 58910 107378 153294
10783A53294j5560m2275M123N8534K1685m5456p4101o560r809P391L790n1625
$$ 153294 137734 95459 99582 158116 179801 134345 60244 53684 43875 51266 55056 3431
10771C431k5214k4381K0934L7980k6328L7468k6807m814m110M0322Q5082P542
$$ 3431 -21783 -46164 -25230 12750 -13578 23890 -2917 -7731 -11841 28481 113563 121105
10759A21105k377J2835m9131j2011m7593L8409J5017K3810K324J8190q5918m5072
$$ 121105 118728 131563 82432 70421 22828 61237 76254 100064 102388 120578 34660 -10412
10747a0412O5436J04188k1890k1227r064l806j3116O8030N6111m4080m4575K6725
$$ -10412 55024 159212 137322 116095 107031 103225 90109 158139 214250 170170 125595 152320
10735A52320L3281j0788o7526m2509M8848O2519K1059r8662m0224J05466N9125
$$ 152320 185601 174813 107287 64778 113626 176145 197204 98542 58318 163784 222909
10724B22909k025j2638j3058N9566N6936o7423o2597K7923M8795L0946J9202M4636
$$ 222909 220884 208246 195188 254754 311690 244267 181670 209593 258388 289334 308536 353172
10712C53172J4279J2897K8262K2304r0132l6701P4262L3813r769r0747n4386k4160
$$ 353172 367451 380348 408610 430914 340782 304081 378343 412156 402387 311640 257254 233094
10700B33094j163L9369O7153P3313l2386P046j3708L030Q135j02971L1624J856
$$ 233094 231931 271300 338453 411766 379380 386426 372718 375748 383883 280912 312536 314392
10688C14392n1725O6369j5101N4941N7011l0813l1888k5550P413l5792L1614O6701
$$ 314392 262667 329036 313935 368876 425887 395074 363186 337636 345049 309257 340871 407572
10676D07572l7134l3418J05060M503L5074M676l4729n8759K0965K2987O8157m3204
$$ 407572 370438 337020 442080 446583 481657 486333 451604 392845 413810 436797 504954 461750
10664D61750o7734J6123M1894L4949k2316M8760O0309L5718p655j5742P3746L7649
$$ 461750 394016 410139 452033 486982 464666 513426 573735 609453 601798 586056 659802 697451
10652F97451K3571j6284L9534K2464P259M5608O713K8556O2311J52263J56392
$$ 697451 721022 704738 744272 766736 773995 819603 826316 854872 917183 1069446 1225838
10641A225838J75703K47812J92991J61224J92455K31533K33769L48335L13696
$$ 1225838 1401541 1649353 1842344 2003568 2196023 2427556 2661325 3009660 3323356
10632C323356L25916L18800M86274P26053R00368J197907J664289K124270K697816
$$ 3323356 3649272 3968072 4454346 5180399 6080767 7278674 8942963 11067233 13765049
10623A3765049K990006K956246K579462K545872K576501K707347K884304K649757
$$ 13765049 16755055 19711301 22290763 24836635 27413136 30120483 33004787 35654544
10615C5654544K251071J819793K137124L119848L815471L746930L275531L187984
$$ 35654544 37905615 39725408 41862532 44982380 48797851 52544781 55820312 59008296
10607E9008296L632809M250442M426860L660852J881152j60974n76281J011994
$$ 59008296 62641105 66891547 71318407 74979259 76860411 76699437 76123156 77135150
10599G7135150K678885K910703K447321K652667L418707L880103L482181J548225
$$ 77135150 79814035 82724738 85172059 87824726 91243433 95123536 98605717 100153942
10591A00153942j963088n709988o904428n164709k860682j684758j227459n86250
$$ 100153942 98190854 92480866 85576438 80411729 77551047 75866289 74638830 74052580
10583G4052580K70894Q13319L52886j213217l670771o191394o674841n360428
$$ 74052580 74323474 75136793 75489679 74276462 70605691 64414297 57739456 52379028
10575E2379028l753690k651681j967350j472995j085486r38441j222001j980058
$$ 52379028 48625338 45973657 44006307 42533312 41447826 40509385 39287384 37307326
10567C7307326l081448m024134m144547l576146k847592k157944j659371j389114
$$ 37307326 34225878 30201744 26057197 22481051 19633459 17475515 15816144 14427030
10559A4427030j097442q99357p00279n65073n42487n17562n16111m21423m07505
$$ 14427030 13329588 12430231 11729952 11164879 10622392 10104830 9588719 9167296 8759791
10550H759791k78291l55110l47065l15067k48163k31000k45220k80703j89411
$$ 8759791 8481500 8126390 7779325 7464258 7216095 6985095 6739875 6459172 6269761
10541F269761j71640j94762j37768k83336k15344j47614j36113j90537j68023
$$ 6269761 6098121 5903359 5765591 5482255 5266911 5119297 4983184 4792647 4624624
10532D624624j16475j97066j58364j30260n3812j55896j19102j17550p9758p7247
$$ 4624624 4508149 4311083 4152719 4022459 3968647 3812751 3693649 3576099 3496341 3419094
10522C419094m0113r7275r9444j56492r3282n6060k0837j16013j29238n8619j774
$$ 3419094 3378981 3281706 3182262 3025770 2932488 2876428 2855591 2739578 2610340 2551721 2549947
10511B549947n6701o1056o1054j07410j65574l3884J6589M1816J1189q2709j01811
$$ 2549947 2493246 2432190 2371136 2263726 2098152 2064268 2080857 2122673 2133862 2051153 1949342
10500A949342o0087p2144m4179r2543o1039q3447m7263m6183k5313M725l2901
$$ 1949342 1889255 1817111 1772932 1680389 1619350 1535903 1488640 1442457 1417144 1421869 1388968
10489A388968l1219L2230L0811K496K4463q8997j07963l1693j27949k9551k7204
$$ 1388968 1357749 1389979 1420790 1423286 1447749 1358752 1250789 1219096 1091147 1061596 1034392
10478A034392O9036K1950k3835M4556J791J4633l2314j11608o7529l7199l5292
$$ 1034392 1103428 1125378 1101543 1146099 1147890 1162523 1130209 1018601 951072 913873 878581
10467H78581K6139J8844N50l6809q8568o0427q2772J1734R4398M5604p3786q3258
$$ 878581 904720 923564 924114 887305 798737 738310 655538 667272 761670 807274 733488 650230
10455F50230l4080n0622j0963J9646Q6470j1660m6867N740L382l1502K7937j01599
$$ 650230 616150 565528 554565 574211 660681 649021 602154 607894 611276 579774 607711 506112
10443E06112j21873l1166K6765R5512J10222m1939k2739r6593q3122j5777p9112
$$ 506112 384239 353073 379838 475350 585572 543633 520894 424301 341179 325402 246290
10432B46290k8940M7792L6640O9218N71o1918k8235P500J0121l441K2725K6027
$$ 246290 217350 265142 301782 371000 371571 309653 281418 288918 299039 295598 318323 344350
10420C44350l0836q5335K590N435j3167J8698j7327L8021R710L3708L7720n55
$$ 344350 313514 228179 230769 236204 223037 241735 224408 262429 272139 305847 343567 343012
10408C43012n9160r7563L2465M0639m9258o0830J06997M2269l8900l1088J8639
$$ 343012 283852 186289 218754 259393 210135 149305 256302 298571 259671 228583 247222
10397B47222k0369k6157l6601p0908J19P2862M9833J2609m7536k9450k3795L6201
$$ 247222 226853 200696 164095 93187 93306 166168 216001 228610 181074 151624 127829 164030
10385A64030J8808K6816n4103J4793N9128j3125m9360o4049K8953J2392J4066
$$ 164030 182838 209654 155551 170344 229472 216347 166987 102938 131891 144283 158349
10374A58349k3099m2011K4658J38488K6887m7817Q449m0666n8383l6230L0125
$$ 158349 135250 93239 117897 256385 283272 235455 243904 203238 144855 108625 138750
10363A38750K3118o0601o5265N3610j1971k3251R8114P6426J0447O1383L1182
$$ 138750 161868 101267 36002 89612 77641 54390 152504 228930 239377 300760 331942
10352C31942J8137J7430q2570j14278l6791o9197n2652L9766M9396J205L6085
$$ 331942 350079 367509 284939 170661 133870 64673 12021 51787 101183 102388 138473
10341A38473m5824m2965r6538L1433R0882k7998p7756Q1906K8565j1520M6931
$$ 138473 92649 49684 -46854 -15421 75461 47463 -30293 51613 80178 68658 115589
10330A15589j6654p1681l449J4083Q4752L5221q192L4257p9903j208P3842m4107
$$ 115589 98935 27254 23805 37888 122640 157861 149669 183926 104023 102815 176657 132550
10318A32550J9037o1926m656M5650n6613N882p0789r0981J08355O6044r532j03669
$$ 132550 151587 89661 85005 130655 74042 79924 9135 -81846 26509 92553 83021 -20648
10306b0648l2324M0243O8677K3208m6903j3342N6288R1323j2427k6462M087m4007
$$ -20648 -52972 -12729 55948 79156 32253 18911 75199 166522 154095 127633 131720 87713
10294H7713l1077k2466N1804L583q040K948J4456L5461L5395r1216q1861n1126
$$ 87713 56636 34170 85974 89557 81517 84465 98921 134382 169777 78561 -3300 -54426
10282e4426M8129M2532n3568j1261Q527L7877N6836O5612N1400k3334l4140o8597
$$ -54426 -6297 36235 -17333 -28594 -20067 17810 74646 140258 191658 168324 134184 65587
10270F5587J4326O2l6583L5741P2017o992l9356R6647O2126k515q0405j38761
$$ 65587 79913 79975 43392 79133 151150 144158 104802 201449 263575 261060 180655 41894
10258D1894o3420M1985J1045l2133M1728M7366l8250j09561k4899P5506P4732
$$ 41894 -21526 20459 31504 -629 41099 88465 50215 -59346 -84245 -8739 65993
10247F5993l6230m0617j715N105K1380l6469p601J0368O6201N3162p8862m2435
$$ 65993 29763 -10854 -12569 -7464 13916 -22553 -30154 -19786 46415 99577 20715 -21720
10235b1720M1721j8147L979j383m0081K5133K2605M1551O6660l290q5870m0049
$$ -21720 20001 1854 5833 4450 -35631 -10498 12107 53658 120318 117028 31158 -8891
10223h891J6472p7933j2464j6210O8941k8278P216P7656O4187O2233l0110j07806
$$ -8891 7581 -70352 -82816 -99026 -30085 -58363 -51147 26509 90696 152929 122819 15013
10211A5013k5585P5318M3376k1483Q056J2278j7141J3950O1399K2210l2421M835
$$ 15013 -10572 64746 108122 86639 94695 106973 89832 103782 165181 187391 154970 159805
10199A59805m3025l0540P8377R0619J4554M1549l2289m1980j2336l9615L0327
$$ 159805 116780 86240 164617 255236 269790 311339 279050 237070 224734 185119 215446
10188B15446Q5576Q8523p5718o3208n4291J4197K1867l1206P6554M1369M0476
$$ 215446 301022 389545 313827 250619 196328 210525 232392 201186 277740 319109 359585
10177C59585N055o9234k9735P8494L5982N5328j1634k7529m5648j6629R2455P7404
$$ 359585 364640 295406 265671 344165 380147 435475 423841 396312 350664 334035 426490 503894
10165E03894m3488j2176N8162K3677k2704M798L4665O9241k237O2458R0081Q45
$$ 503894 460406 448230 506392 530069 507365 512163 546828 616069 613832 676290 766371 767216
10153G67216p9083m8948l6983j5593r497j2787J9464l3055M2741K7101k8634m6956
$$ 767216 688133 639185 602202 586609 577112 564325 583789 550734 593475 620576 591942 544986
10141E44986l5614j17454l9640M2535j3947m3662K1176j4110j8283k0328j15735
$$ 544986 509372 391918 352278 394813 380866 337204 358380 344270 325987 305659 189924
10130A89924o0539M6719O5366P1332o931j8226l6692L707N62k2859M6165n9504
$$ 189924 129385 176104 241470 312802 305871 287645 250953 254660 255222 232363 278528 219024
10118B19024j5343N0408j8341q6629l7238R048m5655j9351N1812N7659L0145J1262
$$ 219024 203681 254089 235748 149119 111881 120929 75274 55923 107735 165394 195539 206801
10106B06801N199q071k8716n1210q4490p318M8709m8252M7397L1289J58121Q4693
$$ 206801 212000 203929 175213 124003 39513 32195 80904 32652 80049 111338 269459 354152
10094C54152k8093m5456k1306L937k6388R4329K763n2188n1298k2048J507J1001
$$ 354152 326059 280603 259297 263234 236846 331175 333938 281750 230452 208404 209911 220912
10082B20912J01292J04616L1810N5812K216l3J400N7101M6575o9785r1329k600
$$ 220912 322204 426820 458630 514442 516658 516625 518025 575126 621701 551916 460587 457987
10070D57987r673l6498p1293L8532j26934l0837K1051J7290m6111j9357Q40L2302
$$ 457987 448314 411816 340523 379055 252121 221284 242335 259625 213514 194157 194997 227299
10058B27299p4686k4553J9639J9221k629o7040j4722J8860L3780O2991L1649Q742
$$ 227299 152613 128060 147699 166920 164291 97251 82529 101389 135169 198160 229809 238551
10046B38551j01014l66o1688q7118K9042N8986j76r569j0162k2560l2332J600
$$ 238551 137537 137171 75483 -11635 17407 76393 76217 66648 56486 33926 1594 3194
10034C194j7872L4045P0360n6461l4025L0180R7314M0460k1970j7868m4096j36
$$ 3194 -14678 19367 89727 33266 -759 29421 126735 167195 145225 127357 83261 83125
10022H3125P0357n8783m4665k0882n870M9320j9172j462j7984l0109j5352M3480
$$ 83125 153482 94699 50034 29152 23282 72602 53430 51968 33984 3875 -11477 32003
10010C2003l995l548L5244n7439K9475L2966J2286J6814J0113j1713K9659Q3525
$$ 32003 28008 24460 59704 2265 31740 64706 76992 93806 103919 92206 121865 205390
9998B05390J02018O0087L4575O3778P5494N8584l854m064R6992O2611J16615l5822
$$ 205390 307408 367495 402070 465848 541342 599926 596072 592008 689000 751611 868226 832404
9986H32404j35376j43553j30522j22037o6348j5023j1032m8320L773K4897q719
$$ 832404 697028 553475 422953 300916 234568 219545 208513 160193 163966 188863 180144
9975A80144m0310L7468K4544o9721L8953K2570N7506o568k6488j02572n9422p3001
$$ 180144 139834 177302 201846 132125 171078 193648 251154 244586 218098 115526 56104 -16897
9963a6897n5474N1615N5996N2077N0561j2748q3756R426j7127k0160o8655n7632
$$ -16897 -72371 -20756 35240 87317 137878 125130 41374 50800 33673 13513 -55142 -112774
9951a12774j243P9416P7694O0932K7707j5633k0841j5229j20101M745o2484j2876
$$ -112774 -114017 -34601 43093 104025 131732 116099 95258 80029 -40072 -35327 -97811 -110687
9939a10687L4852K2225J14099Q0114j4117j2760l7460j7000n3313o2879o2777
$$ -110687 -75835 -53610 60489 140603 126486 113726 76266 59266 5953 -56926 -119703
9928a19703R9541O5501p4207l9750L0856l0374L5373j6196J3852M1736p242k9933
$$ -119703 -20162 45339 -28868 -68618 -37762 -68136 -32763 -48959 -35107 6629 -613 -30546
9916c0546q641R6459n7543o9974p0925N4946l8485Q6389P4377n8946m6931J5966
$$ -30546 -39187 57272 -271 -70245 -141170 -86224 -124709 -38320 36057 -22889 -69820 -53854
9904e3854K2064O338K8181N8608k345M6653J074j119R94l5436m8101k0586J31760
$$ -53854 -31790 -25452 2729 61337 58992 105645 106719 105600 106594 71158 23057 2471 134231
9891A34231R6872j5580n4757j6012K6448q0275k8174P6330P7349n2639K0611K9636
$$ 134231 231103 215523 160766 144754 171202 90927 62753 139083 216432 163793 184404 214040
9879B14040j12792m9293k5648j1761j8316m0356M522P694J4511o1633j6874J2132
$$ 214040 101248 51955 26307 14546 -3770 -44126 -39604 -31910 -17399 -79032 -95906 -83774
9867h3774L7407r619M8317Q9745j2789j5201l4807P161o9351P2336M9450L6434
$$ -83774 -46367 -55986 -7669 82076 69287 54086 19279 26440 -42911 29425 78875 115309
9855A15309n1455L4749Q213o20o1955N9758M4161Q024L4287o2157k1738Q557m1179
$$ 115309 63854 98603 106816 106196 44241 103999 148160 156184 190471 128314 106576 115133 73954
9842G3954o0017J7080J7928m8774n5901N5111M0074P0425K7167l0578k6619q0952
$$ 73954 13937 31017 48945 171 -55730 -619 39455 109880 137047 106469 79850 -1102
9830a102o3200M914K9352p1781l2690j292n237L9250N0538K2670J9720P4529K7645
$$ -1102 -64302 -59388 -30036 -101817 -134507 -135799 -141036 -101786 -51248 -28578 -8858 65671 93316
9817I3316M7425r37j04300k7362j266j476n4556N2570N8772n0804k8631o5818
$$ 93316 140741 139804 35504 8142 6876 5400 -49156 3414 62186 11382 -17249 -83067
9805h3067k9099P0426M8821K6949L6857N0783m5128n3615L6000o5030L6418Q9458
$$ -83067 -112166 -41740 7081 34030 70887 121670 76542 22927 58927 -6103 30315 119773
9793A19773m3482p6395r108K5350k371o4520Q783J1265k7049j2637M6712N8128
$$ 119773 76291 -104 -9212 16138 13767 -50753 -41970 -30705 -57754 -70391 -23679 34449
9781C4449j4281k0120N8273l66L0210K0798o8691m923l3921j9883k1150k0525
$$ 34449 20168 48 58321 57955 88165 108963 40272 35349 1428 -18455 -39605 -60130
9769f0130K6665O9117O1323L9627J1170L4169J107j14546J6535n8081m6537J1539
$$ -60130 -33465 35652 96975 136602 147772 181941 183048 68502 85037 26956 -19581 -8042
9757h042j3803K0480j5632O7004M357j2970P5833J5981l5480K8370R4450N7166
$$ -8042 -21845 -1365 -16997 50007 54364 41394 117227 133208 97728 126098 220548 277714
9745B77714j17456p7064n483K32M776J8166L1127K5238m5957q8114k8773j6336
$$ 277714 160258 83194 77711 77943 82719 100885 132012 157250 111293 23179 -5594 -21930
9733b1930O0337L8470o9490j0806R2935o091L1660M0897K744p3537o0486m4176
$$ -21930 38407 76877 7387 -3419 89516 83425 115085 155982 158726 85189 24703 -19473
9721a9473R104o2227m1343L0960O1100k3868o4112k058N9087J8177P5486J135
$$ -19473 -10369 -72596 -113939 -82979 -21879 -45747 -109859 -111917 -52830 -34653 40833 41968
9709D1968J9234Q0030P7703l5195j3517j517m8612K10j2642m2128l0235M7754
$$ 41968 61202 141232 218935 183740 170223 168706 120094 120304 107662 65534 35299 83053
9697H3053k85q4889l6994J7298M1833M3321K6750M4885o044p5588l0992M039m828
$$ 83053 82768 -2121 -39115 -21817 20016 63337 90087 134972 128928 53340 22348 26387 21559
9684B1559k0684m9376j0175r375J9943M9621O749l1072N1633L38J6865n456n9876
$$ 21559 875 -48501 -58676 -68051 -48108 1513 8262 -22810 28823 29161 46026 40570 -19306
9671a9306j1506p870q2786l2123Q4595l816K0250m240j547K8987K0342k6330l7939
$$ -19306 -30812 -38682 -121468 -153591 -68996 -72812 -52562 -56802 -58349 -29362 -9020 -35350 -73289
9658g3289J6701J5288m1949J19293L0479m9648L586L0183N887l6790O1926R7413
$$ -73289 -56588 -41300 -83249 36044 66523 16875 20461 50644 56531 19741 81667 179080
9646A79080o6822q0982K2481j5036j285j9265N3705L6428l3627l1813k9968k8517
$$ 179080 112258 31276 53757 38721 37436 18171 71876 108304 74677 42864 12896 -15621
9634a5621n0255K5936P3300L0962p873n4056K8667M0238K8523r9380j6455L1555
$$ -15621 -65876 -39940 33360 64322 56449 2393 31060 71298 99821 441 -16014 15541
9622A5541k9350L8038M1272J764o1289k9747r8761l9728P0997J76186Q1138r6491
$$ 15541 -13809 24229 65501 67265 5976 -23771 -122532 -162260 -91263 84923 166061 69570
9610F9570p8470m9398K1030q5381K6639P1425K0022j7653K5312m0438l397k1768
$$ 69570 -8900 -58298 -37268 -122649 -96010 -24585 -4563 -22216 3096 -37342 -40739 -62507
9598f2507J00746P3417L1828p8344r6986k3053L4655L0733L4710P7919N8499p145
$$ -62507 38239 111656 143484 65140 -31846 -54899 -20244 10489 45199 123118 181617 174472
9586A74472j9986k9418P6171j11686j19890L3743k0886L9396J8700J3964o9523
$$ 174472 154486 125068 201239 89553 -30337 3406 -17480 21916 40616 54580 -14943
9575a4943q2231L7791O4113J0592K2860N1488m1054j3789j2945N1715j1251k2287
$$ -14943 -97174 -59383 4730 15322 38182 89670 48616 34827 21882 73597 62346 40059
9563D0059n4332O0677N9645m8453n0216o648j950K4954K8014L5410M9468k1276
$$ 40059 -14273 46404 106049 57596 7380 732 -1218 23736 51750 87160 136628 115352
9551A15352K9293k3712j11520m1304Q6663J7690q9108k748K0138L344K8050j1079
$$ 115352 144645 120933 9413 -31891 54772 72462 -16646 -19394 744 4088 32138 21059
9539B1059K896M5686R062n6354J2960K5293R1400N561k7036o130r1563l8026K066
$$ 21059 23955 69641 78703 22349 35309 60602 152002 157563 130527 124397 32834 -5192 -3126
9526c126M2916M1659M8812k8228n5583L1220N3738l1824p8232l8717l671k8200
$$ -3126 39790 81449 130261 102033 46450 77670 131408 99584 21352 -17365 -21036 -49236
9514d9236o3842M1267q0081K232R6100N9365j2171o937j2658m954L0405k0980
$$ -49236 -113078 -71811 -151892 -149660 -53560 5805 -6366 -13303 -25961 -30915 -510 -21490
9502b1490J2597L6620M1516L195n0724n9364N4301p2836N7177J3115Q1196J6457
$$ -21490 -8893 27727 69243 72438 21714 -37650 16651 -56185 992 14107 95303 111760
9490A11760n8659j882p3367k4638k3365L6764P2369p349j1288J5463p4091m9382
$$ 111760 53101 51219 -22148 -46786 -70151 -33387 38982 31633 20345 35808 -38283 -87665
9478h7665r217R5810M717q5592k9209J3162Q6619N9103q412R7397p9871n9196
$$ -87665 -96882 -1072 3645 -81947 -111156 -97994 -11375 47728 39316 136713 56842 -2354
9466b354r0203j24009j0701J4715N3325J10631O2915o4586m9022J3309O1312R1638
$$ -2354 -92557 -216566 -227267 -212552 -159227 -48596 14319 -50267 -99289 -85980 -24668 66970
9454F6970l8602m26J4495n5846J9149N2494N8162j2514J5851j8927m1100n3738
$$ 66970 28368 27942 42437 -13409 5740 58234 116396 103882 119733 100806 59706 5968
9442E968P655M8008J2243k3608q722N8077j4589n8459O089K3629j6725J8783L1103
$$ 5968 13623 61631 73874 50266 41544 99621 85032 26573 32662 56291 39566 58349 89452
9429H9452p4729M3150o3555j2339M661k4140J4427l6245L2564P1180N9489j5081
$$ 89452 14723 57873 -5682 -18021 -13360 -37500 -23073 -59318 -26754 44426 103915 88834
9417H8834n7091m7183q655j8416m924L9821m2772m358j3068Q099m0159O7354N171
$$ 88834 31743 -15440 -24095 -42511 -47435 -7614 -50386 -54744 -67812 -59713 -99872 -32518 -27347
9404b7347l6552j1221L370J1804J3492p401l9778j4078Q3726L9365j3283K5627
$$ -27347 -63899 -75120 -71750 -59946 -46454 -53855 -93633 -107711 -23985 15380 2097 27724
9392B7724L4180m4303j10586l4685K2839K1818n0559l4931j1706P1148Q3793P6326
$$ 27724 61904 17601 -92985 -127670 -104831 -83013 -133572 -168503 -180209 -109061 -25268 51058
9380E1058o0555o4431k1674O9411M8888J001N5463N5259n2973n8463l7871K8487
$$ 51058 -9497 -73928 -95602 -26191 22697 23698 79161 134420 81447 22984 -14887 13600
9368A3600N3419k2810m1822J561L473L0368K5764p0335m7539j0629K8321N4828
$$ 13600 67019 44209 2387 3948 7421 37789 63553 -6782 -54321 -64950 -36629 18199
9356A8199k0254l0518M5375Q1109K7755n2518n8844r2758j1496K8862O2651M9071
$$ 18199 -2055 -32573 12802 93911 121666 69148 10304 -82454 -93950 -65088 -2437 46634
9344D6634J6303m6542l2217K0134J6678N1344N4747L6483o9658j2678J0145K5638
$$ 46634 62937 16395 -15822 4312 20990 72334 127081 163564 93906 81228 91373 117011
9332A17011k7117k8965n1073l8885r3066L973L7356j1141J8449L4270m356J131
$$ 117011 89894 60929 9856 -29029 -122095 -118122 -80766 -91907 -73458 -39188 -43544 -42413
9320d2413m8618o117K8851K648N1787P4014L2316l2748m7453P217J00219J4479
$$ -42413 -91031 -97148 -68297 -65649 -13862 60152 92468 59720 12267 19484 119703 134182
9308A34182k9066n9133o6444L5090Q0293K2102n3151l6836j2999k4980l9505M4013
$$ 134182 105116 45983 -20461 14629 94922 117024 63873 27037 14038 -10942 -50447 -6434
9296f434L3233M6782j4754l8878J7476m1473n0310j1972P113j7738m9099j9390
$$ -6434 26799 73581 58827 19949 37425 -4048 -54358 -66330 -59217 -76955 -126054 -145444
9284a45444K087P8271O4495P528o0167p6082M273k962n3213l045L6279L3535L0093
$$ -145444 -143357 -65086 -591 6937 -53230 -129312 -125039 -128001 -181214 -184259 -147980 -114445 -84352
9271h4352N9761l09p646n9074J1660k610m5511Q9397J01540O7372r1274q7293
$$ -84352 -24591 -24900 -32546 -91620 -79960 -82570 -128081 -38684 62856 130228 38954 -48339
9259d8339J0674K6341J7433n4128J0839k0974O8689M4616k1176J3172K1870O683
$$ -48339 -37665 -11324 6109 -48019 -37180 -58154 10535 55151 33975 47147 69017 75700
9247G5700m4954k7026O1955N6616q4166j47391N684K509j9735Q6085j3167o4970
$$ 75700 30746 3720 65675 122291 38125 -109266 -103582 -101073 -120808 -34723 -47890 -112860
9235a12860l7706n512N9507M7561L3648L0447M450O7888m0824q1948k715N818
$$ -112860 -150566 -156078 -96571 -49010 -15362 15085 19535 87423 46599 -35349 -38064 -32246
9223c2246L8189R6073M2243o7524n3529p6336l7791k2149L6003k9556O0437J4586
$$ -32246 5943 102016 144259 76735 23206 -53130 -90921 -113070 -77067 -106623 -46186 -31600
9211c1600N3180P8064L2493j17777n4775j9762O2325O1661j9758M007L281k6519
$$ -31600 21580 99644 132137 14360 -40415 -60177 2148 63809 44051 48058 51339 24820
9199B4820j3390m3326J1315J4642j632K2696N413k6638r6505J7432P8008o4598
$$ 24820 11430 -31896 -20581 -5939 -7571 15125 20538 -6100 -102605 -85173 -7165 -71763
9187g1763m711l8246o4635L4287O4462O269N3115J7267q158N25l663L7785P0552
$$ -71763 -76474 -114720 -179355 -145068 -80606 -74337 -21222 -3955 -12113 -11588 -15251 22534 93086
9174I3086M8735j0701j5253o4220l1433L2612l6278k6364K5568m0872m5888J8780
$$ 93086 141821 131120 115867 51647 20214 52826 16548 -9816 15752 -25120 -71008 -52228
9162e2228J4712J7876o0612L5883M2605j4701N2859O7955l0675l6837o6855o741
$$ -52228 -37516 -19640 -80252 -44369 -1764 -16465 36394 104349 73674 36837 -30018 -36759
9150c6759N0230M0945J8055j757p5315m2365J5312m0761M435N828L787P0778q0994
$$ -36759 13471 54416 72471 70714 -4601 -46966 -31654 -72415 -67980 -62152 -58365 12413 -68581
9137f8581q5607R550M2452Q8538O2604l2087m5578L4460j8430M4215L2803o8911
$$ -68581 -154188 -144638 -102186 -13648 48956 16869 -28709 5751 -12679 31536 64339 -4572
9125d572q8537K1632O7868j8363j4602O3179M0188k8704q6534m2854M4544R1421
$$ -4572 -93109 -71477 -3609 -21972 -36574 26605 66793 38089 -48445 -91299 -46755 44666
9113D4666l785k8578J2579N722m6111K7360J2570l7223n0195o31K9103n660L4164
$$ 44666 40881 12303 24882 30604 -15507 11853 24423 -12800 -62995 -63626 -34523 -40183 -6019
9100f019K8802j1375n0677l700K1615R487L870K1998k5426R7311N6936n6790n4527
$$ -6019 22783 11408 -39269 -42969 -21354 -11867 -7997 14001 -11425 85886 142822 86032 31505
9087C1505L2075O0348k8979J3761K1498R31p3295j6371J646l0342J8805k7825
$$ 31505 63580 123928 94949 108710 130208 131139 57844 41473 43119 12777 31582 3757
9075C757m3084J7538M0052m8311n1541M9469P0006l1566k6824j1939j9610r760
$$ 3757 -39327 -21789 18263 -30048 -81589 -32120 37886 6320 -20504 -32443 -52053 -61813
9063f1813k5462k86M1934L9812J13644L5522m0073k5124J7926m4857n3789k410
$$ -61813 -87275 -87561 -45627 -5815 107829 143351 103278 78154 96080 51223 -2566 -4976
9051d976j4197Q6393J31883K4549m5625q1667o0042p5636O6140J44220p6667j03240
$$ -4976 -19173 67220 199103 223652 178027 96360 36318 -39318 26822 171042 94375 -8865
9039h865M969N525M8506n9360j3002l968m2448o027J40969k1560j04358k0941
$$ -8865 -3896 1629 50135 -9225 -22227 -26195 -68643 -74670 66299 44739 -59619 -80560
9027h0560J06106j7788J910L4820p1347k0624O3266Q701r06L0181k6235J0532
$$ -80560 25546 7758 9668 44488 -26859 -47483 15783 24484 23578 53759 27524 38056
9015C8056l6949k4003P9850M4459j8069n993N2085j05828m0115L1043j6058k9577
$$ 38056 1107 -22896 56954 101413 83344 77351 129436 23608 -16507 14536 -1522 -31099
9003c1099O3521P954k9223M897l5946Q978J12610L4113j0709p5334K4588j2172
$$ -31099 32422 40376 11153 16050 -19896 -10918 101692 135805 125096 49762 74350 62178
8991F2178m3745K4100L6759l7621K5373P7306o2217j33157m130j5203Q6215Q9846
$$ 62178 18433 42533 79292 41671 67044 144350 82133 -51024 -55154 -70357 15858 105704
8979A05704j8848o8086m6887K7509L6229K8262j04262o7862j353M0737P3254L9029
$$ 105704 86856 18770 -28117 -608 35621 63883 -40379 -108241 -109594 -68857 4397 43426
8967D3426l6481o0494k7904M5080J04685L5142l8701n357p6972J2458N1440J9735
$$ 43426 6945 -53549 -81453 -36373 68312 103454 64753 59396 -17576 -5118 46322 66057
8955F6057J542N8076l2155r8318n8920M6785N2561J887J1302j0056k4035L2835
$$ 66057 67599 125675 93520 -4798 -63718 -16933 35628 37515 48817 38761 14726 47561
8943D7561q642o4139o49P2043M2526q1705p2789K5160n454m2519k6434L6386N0394
$$ 47561 38919 -25220 -25869 46174 88700 6995 -65794 -40634 -46088 -88607 -115041 -78655 -28261
8930b8261K3313j0311J5595J4056j2437Q372N6074N5259l1885p6820p5440m4764
$$ -28261 -4948 -15259 336 14392 1955 10327 66401 121660 89775 12955 -62485 -107249
8918a07249m4949N8627R5512j4373M4730k7402n3267K4587P1849j3054l0225J7102
$$ -107249 -152198 -93571 1941 -12432 32298 4896 -48371 -23784 48065 35011 4786 21888
8906B1888l0691O7331k6237l7862M4804j6968j876j2382K0471j9620j7062K3682
$$ 21888 -8803 58528 32291 -5571 39233 22265 20389 8007 28478 8858 -8204 15478
8894A5478P6162k5636m6148J740J7678M3232M8943P296L719j61552o3109r499
$$ 15478 91640 66004 19856 21596 39274 82506 131449 138745 142464 -19088 -82197 -91696
8882i1696P8497J2346J1557n6203j144Q5242Q540N534J3881j7149l8462r8796
$$ -91696 -13199 -853 10704 -45499 -46643 38599 47139 52673 66554 49405 10943 -87853
8870h7853L4395P8033j2015R08l1887J9965J0693q4566l6820N489K2342P6227
$$ -87853 -53458 24575 12560 13468 -18419 1546 12239 -72327 -109147 -103658 -81316 -5089
8858e089R0440r75m521J3313l6728k4822l6738k1440R0011L2266q420n2966j31204
$$ -5089 85351 84376 79855 93168 56440 31618 -5120 -26560 63451 95717 87297 34331 -96873
8845i6873r224O1502J22734O03m7750j9209O437L7781P1918j4919k5514q3804
$$ -96873 -106097 -44595 78139 78742 30992 11783 18220 56001 127919 113000 87486 3682
8833C682q9652k8194m924K8353M2551K0063K7818J00833m7686j8592n3369l2082
$$ 3682 -85970 -114164 -119088 -90735 -48184 -28121 -303 100530 52844 34252 -19117 -51199
8821e1199Q0188L0371L3014P247K8919J0856k7123J3268K3586M369r745j9487
$$ -51199 28989 59360 92374 99621 128540 139396 112273 125541 149127 153496 143751 124264
8809A24264j3102r0101l0102M5699O3091n5755J4601m385j5546p4407j1108J7355
$$ 124264 111162 21061 -9041 36658 99749 43994 58595 54210 38664 -35743 -46851 -29496
8797b9496O134m2303N1305P1922P6357n2992l3982P5661n9076l3267P1682K6416
$$ -29496 -23362 -65665 -14360 57562 133919 80927 46945 122606 63530 30263 101945 128361
8785A28361M0329K2721j5802m9267n0534l3376M0045M5272m6819l9457R514K1204
$$ 128361 168690 191411 175609 126342 75808 42432 82477 127749 80930 41473 50987 72191
8773G2191j7611k0366K1033j5919m5058P7052j4498r624n1248j5803J6106P0646
$$ 72191 54580 34214 55247 39328 -5730 71322 56824 47200 -4048 -19851 -3745 66901
8761F6901l0959J2479K4229J9009l3828o7502P5422M4243l3008K4152M253L3760
$$ 66901 35942 48421 72650 91659 57831 -9671 65751 109994 76986 101138 105391 139151
8749A39151n1697J5965p3732n9968J2810q569l114L8083P1398j3720J7438r4538
$$ 139151 87454 103419 29687 -30281 -17471 -26040 -29154 8929 80327 66607 84045 -10493
8737a0493L0191K8694M6432n1882p7815R953J2355L3767K7555O686j6270J6151
$$ -10493 19698 48392 94824 42942 -34873 -24920 -12565 21202 48757 55443 39173 55324
8725E5324m3064p3169R079M2549P6643l8179m4626n7265L282M1988L3947r697
$$ 55324 12260 -60909 -51830 -9281 67362 29183 -15443 -72708 -69426 -27438 6509 -3188
8713c188r8054j3331K2735M3418L8859K3591j9373M3743q896M4782N6807M4529
$$ -3188 -101242 -114573 -91838 -48420 -9561 14030 -5343 38400 29504 74286 131093 175622
8701A75622k1406p6067P7802l1939l5526m4716R215j7636m8190J3728l7807j9855
$$ 175622 154216 78149 155951 124012 88486 43770 52985 35349 -12841 887 -36920 -56775
8689e6775M644L245m1473P8869P3517m6541k0438N2363j8973k1935L4765l73j02358
$$ -56775 -52131 -48886 -90359 -11490 62027 15486 -4952 47411 28438 6503 41268 40895 -61463
8676f1463R7415J31625m0231j05420j8888m4911J7192O6933M6346l9646j19433
$$ -61463 35952 167577 127346 21926 3038 -41873 -24681 42252 88598 48952 -70481
8665g0481q3109O3869R0153K0211q9368N6175L471m4752l2263l3737L875L8644
$$ -70481 -153590 -89721 432 20643 -68725 -12550 -9079 -53831 -86094 -119831 -115956 -77312
8653g7312l9465J05240J08987L8171k5480j8991l8757k4461j9002J1633j1027
$$ -77312 -116777 -11537 97450 135621 110141 91150 52393 27932 8930 20563 9536
8642I536J0614M1514j55l6252m7566M997R999j6055K6263n8581M528N9266K5564
$$ 9536 20150 61664 61509 25257 -22309 -17312 -7313 -23368 2895 -55686 -51158 8108 33672
8629C3672N2335J6041M7504p5017q8202J9292K7152n3210L3582M260l5815L3082
$$ 33672 86007 102048 149552 74535 -13667 5625 32777 -20433 13149 17409 -18406 14676
8617A4676M4449j5832p6557J2408K1147j6627M798P4281k0967j0773K2014n5028
$$ 14676 59125 43293 -33264 -20856 291 -16336 -11538 62743 41776 31003 53017 -2011
8605b011p8215l7783N7430K5156K4614J2209m2324M6732m0234L2813O7749J8517
$$ -2011 -80226 -118009 -60579 -35423 -10809 1400 -40924 5808 -34426 -1613 66136 84653
8593H4653M1293M7l2150K2795K518q8569J2405J0099j2463K8725J3368j1992J2033
$$ 84653 125946 125993 93843 116638 119156 30587 42992 53091 40628 69353 82721 70729 82762
8580H2762P4970r653j07568k4254M5977K7014L8063J0295k1980K7146J4262l1323
$$ 82762 157732 148079 40511 16257 62234 89248 127311 137606 115626 142772 157034 125711
8568A25711O266o7259q8157L3967o4622n3691l597O2096O4029l5835n8781k9260
$$ 125711 131977 64718 -23439 10528 -54094 -107785 -111382 -49286 14743 -21092 -79873 -109133
8556a09133J2306N3555J19713k2035j6109R994k9684p0857p2800m7625p54K4627
$$ -109133 -96827 -43272 76441 54406 38297 48291 18607 -52250 -125050 -172675 -173429 -148802
8544a48802M5933J17028P1015L6349n8215l3578O1403M5728J8538m2595m3938
$$ -148802 -102869 14159 85174 121523 63308 29730 91133 136861 155399 112804 68866
8533F8866q2140o3268j06745K7478N6013L9094K4405m2071j5039M6025M6640L2876
$$ 68866 -13274 -76542 -183287 -155809 -99796 -60702 -36297 -78368 -93407 -47382 -742 32134
8521C2134n8823k0810N9595m878P735J3797K1944K9856J5156J2205O1091K1889
$$ 32134 -26689 -47499 12096 7218 14953 28750 50694 80550 95706 107911 169002 190891
8509A90891k4351l2861m3777r035L2167K6030j03131M861q936k6012j7569o2984
$$ 190891 166540 133679 89902 80867 113034 139064 35933 40794 31858 5846 -11723 -74707
8497g4707L5337P3523L3559J5081M7057k123q4473k9499P0082M5881L8697m4625
$$ -74707 -39370 34153 67712 82793 129850 127727 43254 13755 83837 129718 168415 123790
8485A23790j69675l3885K1912L4590M3049j0928Q465J0161Q7681M4988q3965o8422
$$ 123790 -45885 -79770 -57858 -23268 19781 8853 17318 27479 115160 160148 76183 7761
8473G761r0291n7240P8709K1994J7032N6059Q8999n0113n0061o893r091O7641
$$ 7761 -82530 -139770 -61061 -39067 -22035 34024 123023 72910 22849 15956 6865 74506
8461G4506N5353M4623j351J1023n5765o9321l3227M780M9838M3435j5909l9975
$$ 74506 129859 174482 173131 184154 128389 59068 25841 30621 80459 123894 107985 68010
8449F8010J1224j7541K5310L3954l573M5628o0705n8204q7248K2556J364R168
$$ 68010 79234 61693 87003 120957 117384 163012 102307 44103 -43145 -20589 -19225 -10057
8437a0057K2377J7564o4337L4596J4392J349J0096o8475j1341Q0146N4509l282
$$ -10057 12320 29884 -34453 143 14535 15884 25980 -42495 -53836 26310 80819 77537
8425G7537N4382q160Q091o3325m0461q364L1265k432M493k1134p0746P0926P6065
$$ 77537 131919 123759 131850 68525 28064 19700 50965 48533 53026 31892 -38854 32072 108137
8412A08137j9295j7842P780o4475j2804L9087o575N9518l690n2102m8530O7566
$$ 108137 88842 71000 78780 14305 1501 40588 34013 93531 89841 37739 -10791 56775
8400E6775L9144P454p1323L0114L647l3115K9223K1424L2470o0991o8237Q0666
$$ 56775 95919 103373 32050 62164 65811 32696 61919 83343 115813 54822 -13415 67251
$$ [...]
##END NTUPLES=NMR SPECTRUM
##END=
