##TITLE=317007
cc 03504
adrs
endeavour
##JCAMPDX= 6.0         $$ Bruker NMR JCAMP-DX V2.0
##DATA TYPE= NMR SPECTRUM
##DATA CLASS= NTUPLES
##ORIGIN= Bruker BioSpin GmbH
##OWNER= nmr
$$ XWIN-NMR		Version 3.5
$$ Wed Jul 12 08:28:53 2006 GMT Daylight Time (UT+1h)  MAYBRIDGE\nmr@NMR_250MHZ
##.OBSERVE FREQUENCY= 250.131544655141
##.OBSERVE NUCLEUS= ^1H
##.ACQUISITION MODE= SIMULTANEOUS (DQD)
##.ACQUISITION SCHEME= undefined
##.AVERAGES= 14
##.DIGITISER RES= 18
##SPECTROMETER/DATA SYSTEM= dpx250
##.PULSE SEQUENCE= zg30
##.SOLVENT NAME= CDCl3
##.SHIFT REFERENCE= (INTERNAL, CDCl3, 0, 16.522)
##AUDIT TRAIL= $$ (NUMBER, WHEN, WHO, WHERE, WHAT)
$$ ##TITLE= Audit trail, XWIN-NMR		Version 3.5
$$ ##JCAMPDX= 5.01
$$ ##ORIGIN= Bruker BioSpin GmbH
$$ ##OWNER= nmr
$$ C:/u/data/dgb/nmr/ADRS/15601/pdata/1/auditp.txt
$$ ##AUDIT TRAIL=  $$ (NUMBER, WHEN, WHO, WHERE, WHAT)
(   1,<2006-02-03 11:55:37.53 +000>,<MAYBRIDGE\nmr>,<NMR_250MHZ>,
      <created by zg, POWCHK disabled, PULCHK disabled
       terminated by command 'halt'
       configuration hash MD5:
       84 BC 41 DB A1 6E 1D 46 DA 25 12 A5 C1 ED C5 3A
       data hash MD5: 64K
       3E BC 58 C9 C7 01 34 C7 20 FB 60 DA 29 2B 0C 33>)
(   2,<2006-02-03 11:55:44.13 +000>,<MAYBRIDGE\nmr>,<NMR_250MHZ>,
      <Start of raw data processing
       ef LB = 0.3 FT_mod = 6 PKNL = 1 SI = 32K 
       data hash MD5: 32K
       53 C5 20 BF DB E9 BF 5B 60 33 07 28 D5 EB 96 10>)
(   3,<2006-02-03 11:55:50.00 +000>,<MAYBRIDGE\nmr>,<NMR_250MHZ>,
      <apk 
       data hash MD5: 32K
       3E 04 EF 7B 35 2B 26 67 A6 A3 2C C2 0F 06 8F E4>)
(   4,<2006-02-03 11:55:51.78 +000>,<MAYBRIDGE\nmr>,<NMR_250MHZ>,
      <abs ABSG = 5 
       data hash MD5: 32K
       86 F3 48 B7 EC F9 3B 8B 5E 31 29 6E 43 A7 33 99>)
$$ ##END=
$$ 
$$ hash MD5
$$ 48 34 EB 8B 2E BF 8A EF 91 F5 AA 75 AB 98 F1 A0
##$RELAX= 
##$RELAX= 
##$RELAX= 
##$RELAX= 
##$RELAX= 
##$RELAX= 
##$RELAX= 
$$ Bruker specific parameters
$$ --------------------------
##$DU= <C:\Restored>
##$EXPNO= 15601
##$NAME= <ADRS>
##$PROCNO= 1
##$TYPE= <nmr>
##$USER= <dgb>
##$AMP= (0..31)
100 100 100 100 100 100 100 100 100 100 100 100 100 100 100 100 100 100 
100 100 100 100 100 100 100 100 100 100 100 100 100 100 
##$AQSEQ= 0
##$AQ_mod= 3
##$AUNM= <au_zg>
##$AUTOPOS= <9 >
##$BF1= 250.13
##$BF2= 250.13
##$BF3= 250.13
##$BF4= 250.13
##$BF5= 500.13
##$BF6= 500.13
##$BF7= 500.13
##$BF8= 500.13
##$BYTORDA= 1
##$CFDGTYP= 0
##$CFRGTYP= 5
##$CHEMSTR= <none>
##$CNST= (0..31)
1 1 145 1 1 1 1 1 1 1 1 1 1 1 1 1 1 1 1 1 1 1 1 1 1 1 1 1 1 1 1 1 
##$CPDPRG= <>
##$CPDPRG1= <>
##$CPDPRG2= <>
##$CPDPRG3= <>
##$CPDPRG4= <mlev>
##$CPDPRG5= <mlev>
##$CPDPRG6= <mlev>
##$CPDPRG7= <mlev>
##$CPDPRG8= <mlev>
##$CPDPRGB= <>
##$CPDPRGT= <>
##$D= (0..31)
0 1 0 0 0 0 0 0 0 0.06 0 0 0 0 0 0 0.0002 0 0 0 0 0 0 0 0 0 0 0 0 0 0 
0 
##$DATE= 1138967734
##$DBL= (0..7)
120 120 120 120 120 120 120 120 
##$DBP= (0..7)
150 150 150 150 150 150 150 150 
##$DBP07= 0
##$DBPNAM0= <>
##$DBPNAM1= <>
##$DBPNAM2= <>
##$DBPNAM3= <>
$$ [...]
##$SUBNAM7= <"">
##$SUBNAM8= <"">
##$SUBNAM9= <"">
##$SW= 20.6930455092707
##$SWIBOX= (0..15)
0 0 3 0 0 0 0 0 0 0 0 0 0 0 0 0 
##$SW_h= 5175.983436853
##$TD= 65536
##$TD0= 1
##$TE= 293.16
##$TE2= 300
##$TE3= 300
##$TEG= 300
##$TL= (0..7)
0 120 120 120 120 120 120 120 
##$TP= (0..7)
150 150 150 150 150 150 150 150 
##$TP07= 0
##$TPNAME0= <>
##$TPNAME1= <>
##$TPNAME2= <>
##$TPNAME3= <>
##$TPNAME4= <>
##$TPNAME5= <>
##$TPNAME6= <>
##$TPNAME7= <>
##$TPOAL= (0..7)
0.5 0.5 0.5 0.5 0.5 0.5 0.5 0.5 
##$TPOFFS= (0..7)
0 0 0 0 0 0 0 0 
##$TUNHIN= 0
##$TUNHOUT= 0
##$TUNXOUT= 0
##$USERA1= <user>
##$USERA2= <user>
##$USERA3= <user>
##$USERA4= <user>
##$USERA5= <user>
##$V9= 5
##$VALIST= <valist>
##$VCLIST= <CCCCCCCCCCCCCCC>
##$VD= 0
##$VDLIST= <DDDDDDDDDDDDDDD>
##$VPLIST= <PPPPPPPPPPPPPPP>
##$VTLIST= <TTTTTTTTTTTTTTT>
##$WBST= 1024
##$WBSW= 4
##$XGAIN= (0..3)
0 0 0 0 
##$XL= 0
##$YL= 0
##$YMAX_a= 308656
##$YMIN_a= -382922
##$ZGOPTNS= <>
##$ZL1= 120
##$ZL2= 120
##$ZL3= 120
##$ZL4= 120
##$ABSF1= 16.522
##$ABSF2= -4.171173
##$ABSG= 5
##$ABSL= 3
##$ALPHA= 0
##$AQORDER= 0
##$ASSFAC= 0
##$ASSFACI= 0
##$ASSFACX= 0
##$ASSWID= 0
##$AUNMP= <proc_1d>
##$AZFE= 0.1
##$AZFW= 0.1
##$BCFW= 0
##$BC_mod= 0
##$BYTORDP= 0
##$COROFFS= 0
##$CY= 12.5
##$DATMOD= 1
##$DC= 0
##$DFILT= <>
##$DTYPP= 0
##$F1P= 14.0000005364418
##$F2P= -0.99999901652339
##$FCOR= 0.5
##$FTSIZE= 32768
##$FT_mod= 6
##$GAMMA= 0
##$GB= 0
##$INTBC= 1
##$INTSCL= 1
##$ISEN= 128
##$LB= 0.3
##$LEV0= 0
##$LPBIN= 0
##$MAXI= 10000
##$MC2= 0
##$MEAN= 0
##$ME_mod= 0
##$MI= 0
##$NCOEF= 0
##$NC_proc= -4
##$NLEV= 6
##$NOISF1= 0
##$NOISF2= 0
##$NSP= 0
##$NTH_PI= 0
##$NZP= 0
##$OFFSET= 16.522
##$PC= 1
##$PHC0= 100.1714
##$PHC1= 10.41129
##$PH_mod= 1
##$PKNL= yes
##$PPARMOD= 0
##$PSCAL= 4
##$PSIGN= 0
##$REVERSE= no
##$SF= 250.13
##$SI= 32768
##$SIGF1= 0
##$SIGF2= 0
##$SINO= 400
##$SIOLD= 32768
##$SREGLST= <1H.CDCl3>
##$SSB= 0
##$STSI= 32768
##$STSR= 0
##$SW_p= 5175.98343685301
##$SYMM= 0
##$S_DEV= 0
##$TDeff= 65536
##$TDoff= 0
##$TI= <Analysis number 999999
Compound Code 99
Book Reference 9
Project Code 9>
##$TILT= no
##$TM1= 0
##$TM2= 0
##$TOPLEV= 0
##$USERP1= <user>
##$USERP2= <user>
##$USERP3= <user>
##$USERP4= <user>
##$USERP5= <user>
##$WDW= 1
##$XDIM= 32768
##$YMAX_p= 418403332
##$YMIN_p= -315390
$$ End of Bruker specific parameters
$$ ---------------------------------
##NTUPLES= NMR SPECTRUM
##VAR_NAME=  FREQUENCY,     SPECTRUM/REAL,   SPECTRUM/IMAG
##SYMBOL=    X,             R,               I
##VAR_TYPE=  INDEPENDENT,   DEPENDENT,       DEPENDENT
##VAR_FORM=  AFFN,          ASDF,            ASDF
##VAR_DIM=   32768,         32768,           32768
##UNITS=     HZ,            ARBITRARY UNITS, ARBITRARY UNITS
##FACTOR=    0.157963299565203, 1,           1
##FIRST=     4132.6476996994, 0,             0
##LAST=      -1043.33573715361, 0,           0
##MIN=       -1043.33573715361, -315390,     0
##MAX=       4132.6476996994, 418403332,     0
$$ Real data points
##PAGE= N=1
##DATA TABLE= (X++(R..R)), XYDATA
$$ [...]
28723A3603P144L3912L0355K1292k8356j7621N3454K2166l1936l8216l3588J643
28711C3852N344J0151l3691o5098j3672P01l226J1287M0042k500N2538L1107K0834
28698H7669Q90l0250r253l1553p8148Q205R3171J8698n6059l8558k93K5893J4871
28685E283m510k0229r325p641r848R465j0458J5748J2888k536J7183K0516L6062
28672E2598M463m6371o2550l2454p871K1630O0678K7576L4130o221o7013k2311
28660d3716O3261L1279L7435p254J7344K1973q833j9456j3079J7520L0250l4683
28648I2041p2662p32j5860m8416k446L5581N1753k0051l0309j0231k895R635K4882
28635A0290j5025r981k9002n4J5586M9101m3731r537M6267k3375l0657p953j1938
$$ y = [13603, 20747, 54659, 85014, 106306, 77950, 60329, 113783, 135949, 104013, 65797, 32209, 33852, 39196, 49347, 15656, -49442, -63114, -62413, -65639, -54352, -14310, -16810, 35728, 66835, 87669, 88559, 58309, 49056, 17503, -60645, -52440, 40731, 59429, 3370, -35188, -35481, -9588, 5283, 773, -19456, -28781, -36422, -46270, -36805, -47263, -31515, -18627, -21163, -3980, 16536, 52598, 57061, 10690, -51860, -84314, -92185, -70555, -9877, 17699, 51829, 45608, -21405, -43716, 19545, 50824, 88259, 81005, 98349, 120322, 111489, 92033, 78954, 96474, 126724, 92041, 19379, 18647, 2787, -45629, -48075, -12494, 39259, 19208, -11101, -21332, -24227, -14592, 10290, -4735, -14716, -43718, -43772, -28186, 20915, -22816, -32353, 13914, -9461, -40118, -48071, -60009]
28622f0009l4218K2433K8344j1270k0048J4264J01459L0208j6149Q386K2527O8639
28610A54566k0319p7076n0573J5507J8283J8133k5984l3699k7849l5813j234L8728
28598b7330R2966K763q6908p840n3126m03K4365K5016K0950M488n5561l0167l1162
28585a21949l0839K9498P6627N5853R309K1667l2686k9591O917l53R788j4574
28573b0333P6784J9585k9454k4727k9241j2437n1913l086J1840M1922k9153P62
28561d9451O014Q5663K4214J0595m917J1096m9479n5633k929j3760k0169N6102
28549b654L6039J5616k3826m0592K4697J3239k1712J5349O337k5673m4835O246
28537d1769M3029L7282l6556p7934R533k041r415j5483l9593L2970l1341n516
$$ y = [-60009, -94227, -71794, -43450, -54720, -74768, -60504, 40955, 71163, 55014, 63400, 85927, 154566, 134247, 57171, 6598, 22105, 40388, 58521, 32537, -1162, -29011, -64824, -66058, -27330, 65636, 68399, -18509, -26349, -79475, -79878, -55513, -30497, -9547, -5059, -60620, -90787, -121949, -152788, -123290, -46663, 9190, 18499, 40166, 7480, -22111, -15194, -15547, -5759, -20333, 56451, 76036, 46582, 21855, -7386, -19823, -71736, -74822, -62982, -21060, -50213, -49451, -43437, 42226, 66440, 77035, 72118, 83214, 33735, -21898, -24827, -38587, -58756, -2654, 33385, 49001, 25175, -15417, 9280, 22519, 807, 16156, 22493, -3180, -48015, -41769, 1260, 38542, 1986, -75948, -66415, -68456, -77871, -93354, -132947, -99977, -131318, -136834]
28525a36834L0366L4862l4234n620K7888K3021M813k9012O1120M3963k7186m5406
28513e2259M954P345o015m8085N3680J2716k4954K4686L3417P831j8533J0777
28501E560J9263k2419j6676L7709P189p236j6457l5530q9092m797L4705L4133
28489e3648K0677K5292j2406L3722K2867J6427l070k7769l3680k0267R373J7780
28477d702J2127J7660K617k0182K8270l279j4274K5679k2443q1413o647L7137
28465b9450j1383m7492L1310M1725O933l3112l9264j7352L3315K1730j279O1928
28453A7609N2116l4536j5810J1925K0304J9517J1872J2708l8645o5379K6142k6303
28441h480J5231K2347j7908J4633J0294J4446K2735m0689j6289K0987l5654J193
$$ y = [-136834, -106468, -71606, -105840, -111460, -83572, -60551, -55738, -84750, -23630, 20333, -6853, -52259, -47305, -39960, -45975, -94060, -40380, -27664, -52618, -27932, 5485, 13316, -5217, 5560, 24823, 2404, -14272, 23437, 30626, 23390, 6933, -28597, -117689, -122486, -87781, -53648, -32971, -7679, -20085, 13637, 36504, 52931, 49861, 22092, -11588, -31855, -22482, -4702, 7425, 25085, 27702, 7520, 35790, 32511, 18237, 43916, 21473, -59940, -66587, -29450, -40833, -88325, -57015, -15290, -8357, -41469, -80733, -98085, -64770, -43040, -44319, 17609, 69725, 35189, 19379, 31304, 51608, 71125, 82997, 95705, 57060, -8319, 17823, -8480, 6751, 29098, 11190, 25823, 36117, 50563, 73298, 32609, 16320, 37307, 1653, 2846]
28429B846k1711m2694K5440M0227m66J0396M2385l6239l920O9778n3651l2156
28417B35l1576j8859O3749K7340o3960J6335M7053j3202K4415l5335J1117N7695
28405H5007K1469j4039L555O154L3978j3937j1615q261q5551n6737N280J8813
28393a5884o3728o3892K7429O8652o118J836P991K0848K2048j1513k3652J6326
28381a9657J3396L570j1583P50O0606J7177k7185k0845m0588L5965J7291o061
28369B2836J1681j0934l6735l6631n9173q895K9918N1295O176M000m0603j2208
28357g9273k0934K3809L4476N9662l3758K9989N0129q588K263n890L2758M8223
28345A32866l0682m2698k74M1462l4345m3019N98m9223O114j235L476r706L3453
$$ y = [2846, -18865, -61559, -36119, 4108, 3642, 14038, 56423, 20184, 16264, 86042, 32391, 235, -31341, -50200, 13549, 40889, -23071, -6736, 40317, 27115, 51530, 16195, 27312, 85007, 106476, 92437, 95992, 102146, 136124, 122187, 110572, 102311, 16760, -39977, -34697, -15884, -79612, -143504, -116075, -47423, -53541, -51705, -43714, -22866, -818, -12331, -35983, -19657, -6261, -2691, -14274, -13524, 47082, 64259, 37074, 16229, -24359, 11606, 28897, 22836, 34517, 23583, -13152, -49783, -108956, -117851, -87933, -36638, -30462, -26462, -67065, -79273, -100207, -76398, -41922, 17740, -16018, 13971, 64100, 55512, 57775, 51885, 84643, 132866, 102184, 59486, 59212, 100674, 66329, 23310, 23908, -25315, -19201, -20436, -16960, -26666, 6787]
28332F787L4173R348J3133N950k9447n6987M8532j1060k9423P49M4105j6241k9284
28319i665J4878K1933j3784l2055j1757P711p147l3298p754M0109j3560O406O6454
28306B8471N4977m8141q643k5636r6239k7991R179L6924K4014J0924J9459m5992
28294f8694l1061L0423Q3795k2228m7753j0865K2001L6546M674n8949p410M4122
28282b5399O1842j3928k1198l1135k8332j5585J5433Q7733L0929o0291Q779J7329
28270B6177p997j9784j9773n1444n5343K9409M1899J9180k4312j6965N3317L8801
28258A3165l3731k845o581J6425M9431k3346m684L0649N414l842J7856n2182n056
28245F73O5456j9529j6269k1235l3324m0896P7273M8758k2774N8282r008n5775
$$ y = [6787, 40960, 50308, 63441, 69391, 39944, -17043, 31489, 20429, -8994, -8245, 35860, 19619, -9665, 5213, 27146, 13362, -18693, -30450, -22739, -29886, -63184, -70938, -30829, -44389, -37983, 28471, 83448, 35307, 26664, 1028, -95211, -123202, -114023, -77099, -53085, -42161, -22702, -68694, -99755, -69332, 14463, -7765, -55518, -66383, -44382, -7836, -3162, -62111, -69521, -25399, 36443, 22515, 1317, -29818, -58150, -73735, -58302, 29431, 60360, 69, 8848, 26177, 18180, -1604, -21377, -72821, -128164, -98755, -56856, -37676, -61988, -78953, -25636, 13165, -20566, -23411, -29992, -13567, 35864, 12518, 7834, 38483, 43897, 40055, 57911, 5729, 673, 66129, 46600, 30331, 9096, -24228, -65124, 12149, 60907, 38133, 96415, 87407, 31632]
28233C1632J808K8889K2943j0530q822J596J967k8252k4326K065l5003p377m5401
28220f8811J7169P4002m030q1040j0763K1571Q562l1586L2965O6494K9549R113
28208F3195j5205l8657n5516K6753Q8033M8022k323l8592n0214q478k7101n5799
28196f5882N712O550J5113J789J7308N381P0281K6135l6337K6831J8685j9680
28184G1886j8496J910o0110k6004j7666j2404K9117O2270L6509k6448L276K8224
28172G2064l3867R478M8507j8243k2077J3303J9054K1342n9246l4383m1989P93
28160b5264J1548m7242L9017j2318n6130J7909L3036n8436l088K2893M3379M4418
28148I722m7856k4000J4013K3584k3985P993k1101K348M4982K6500K4519N4420
$$ y = [31632, 33440, 62329, 85272, 74742, 65920, 67516, 69483, 41231, 16905, 18970, -16033, -23410, -68811, -51642, 22360, 18330, -62710, -73473, -51902, -43340, -74926, -41961, 24533, 54082, 63195, 47990, 9333, -46183, -19430, 68603, 116625, 114302, 75710, 25496, 17018, -10083, -65882, -60170, -53620, -38507, -36718, -19410, -14029, 56252, 82387, 46050, 72881, 91566, 71886, 53390, 55300, -4810, -30814, -48480, -60884, -31767, 30503, 67012, 40564, 43840, 72064, 38197, 47675, 96182, 77939, 55862, 69165, 88219, 109561, 50315, 15932, -26057, -25264, -13716, -60958, -21941, -34259, -90389, -72480, -39444, -97880, -100968, -78075, -34696, 9722, -38134, -62134, -48121, -24537, -48522, -40529, -61630, -59282, -14300, 12200, 36719, 91139]
28136I1139J2074k5591q9255j1445l7467l6889M6504P5467O0926l3287n1213j5428
28124a4465n0654K5294M0942k3999l9550O2070P1499J6966K1956o9446k1464R432
28112B8581Q752j267J7390j7556k8328L2622M0289l218m0840r6156j7644L7711
28100c9664L115K3403K5409o990K446K4600q5431o6872q540o115K533N0521M4030
28087c7555N798K7169O0503p092p1940l5167K3426J0946L5511n003n0221l1584
28075g5209L5812L695M8737L9371j0008j3155J7703m700m4541k412J7446N8656
28063G1395k4401n4673j4622J0355l1201J0412Q232P316M8187J7852L2451K3941
28051A05244m4388o4816J8495O6474q143m3008J3842o0022j0447K1910j7157j6671
$$ y = [91139, 103213, 77622, -11633, -23078, -60545, -97434, -50930, 24537, 85463, 52176, 963, -14465, -65119, -39825, 1117, -22882, -62432, -362, 71137, 88103, 110059, 40613, 19149, 28581, 37333, 36066, 53456, 35900, 7572, 40194, 80483, 77265, 36425, -59731, -77375, -39664, -36549, -13146, 12263, 5273, 7719, 32319, -53112, -119984, -128524, -134639, -132106, -81585, -37555, -31757, -4588, 55915, 48823, -23117, -58284, -34858, -23912, 11599, 6596, -43625, -75209, -39397, -35702, 13035, 52406, 42398, 29243, 46946, 42246, -2295, -4707, 12739, 71395, 46994, -7679, -22301, -11946, -43147, -32735, -24503, -17187, 31000, 48852, 81303, 105244, 60856, -3960, 14535, 81009, 72866, 29858, 43700, -16322, -26769, -4859, -22016, -38687]
28039c8687R255j9863M2291l670k6664L0344L7821p2125L771N2910L2723m493
28027D3613J855P714l5129J8572k666k8611k0280m9175j1456Q048O880M5534J5448
28014C47j6848J2630N8562J8311o747L637n0301m4659j4701j139k3122M1027m120
28001b7123M1058j9914j7302l0263J9722L6469N5685j7519n1149m1489J9006O094
27989b6725M1339j3177j154k0358K6312L4997k6728J8790m3753K2067k2732j8446
27977b9568m386L9854R336p930j6566P457M7745p071l7032l3452l1513N61N969
27964e6596l1426L4669L1230p690K9552r411n3600j1355l008Q1334K6644p1275
27952d0932k8328M0862Q7986M4709l409l8129k0706o6357n601L6977O3972m7364
$$ y = [-38687, -29432, -49295, -7004, -10674, -37338, -6994, 30827, -41298, -37527, 15383, 48106, 43613, 45468, 53182, 18053, 36625, 33959, 5348, -14932, -64107, -75563, -67515, -60635, -15101, 347, -16501, -3871, 54691, 73002, 66255, 69892, 19591, -25068, -39769, -40908, -64030, -23003, -27123, 13935, -5979, -23281, -53544, -33822, 2647, 58332, 40813, -10336, -51825, -32819, -26725, 14614, 1437, 283, -20075, 6237, 41234, 14506, 33296, -10457, 11610, -11122, -29568, -33954, 5900, 15236, 7306, -9260, -1803, 45942, 38871, 1839, -31613, -63126, -62565, -56596, -88022, -53353, -22123, -29813, -261, -9672, -63272, -74627, -77635, 3699, 30343, -40932, -69260, -28398, 59588, 104297, 100888, 62759, 42053, -24304, -29905, 7072, 71044, 23680]
27940B3680n9746K8478O4759p063m257J8714o0569o8015J8428J0583l4615M5759
27928b3864N5702k5294m1684N0359R952l7932L3946M5628L5943l7229p1199J4741
27916I069j3066m317l2707j5444K989n978k1800L8378J00229K3405k906O8181
27904A46033N1386n7672p6578o4857J3920O2454l1122l4302j649j8455l9871M0334
27892a0379j3934j2672l7234j7438P2822M2062l07P065R116n788j3754o4881R657
27879c5665n556Q7517M7088k6968p0859p35L4028k1870K3646N7187O947m3004
27867E1756l0385k0358k3323K8206J2575R854L0939k5494L94N329P063j8140n8295
27854b9879q508k8821L12n943K6155L5574k9260n74J6777j6277O3137L8282K7101
$$ y = [23680, -36066, -7588, 57171, 50108, 45851, 64565, 3996, -64019, -45591, -35008, -69623, -23864, 31838, 6544, -35140, 15219, 25171, -12761, 21185, 66813, 102756, 65527, -5672, 9069, -3997, -8314, -41021, -56465, -53476, -59454, -81254, -42876, 57353, 80758, 77852, 146033, 197419, 139747, 63169, -1688, 12232, 74686, 43564, 9262, 7613, -10842, -50713, -10379, -24313, -36985, -74219, -91657, -18835, 23227, 22920, 29985, 39101, 33313, 19559, -45322, -35665, -41221, 46296, 93384, 66416, -4443, -5178, 28850, 6980, 30626, 87813, 94760, 51756, 21371, 1013, -22310, 5896, 18471, 28325, 59264, 33770, 34164, 39493, 46556, 28416, -29879, -38387, -67208, -66896, -72839, -46684, -11110, -40370, -40944, -24167, -40444, 22693, 60975, 88076]
27841H8076k1673m8100k5476J2004J2933n5199j0090M3418m053j2164M223J9684
27829C583L2830L0528O934n291j7845q8915n661K9459N7154L2668k5420m6851
27817C173P073Q726J942M6623J7440J9983K5081j7058q8990k2527K9573N302n1301
27804a4960J9325J6134o2190m405L211N7249L5548L40p2911J88j2124O2871M18
27791B8694j9594K655J1523L9919l1599J6418k2844K7956L7053m5760n037L5307
27779G4691j082m4797k2394l9145n2249M2092K2425m5287J6654N5452P119K0800
27767C4279l511L0078M272l8189j848k1765J1770m20J5734o2541N935j124J9771
27754g559M2528j1347K7114k0704j2428j7589n9189m1169N4066J631J2401n7613
$$ y = [88076, 66403, 18303, -7173, 4831, 17764, -37435, -47525, -4107, -8160, -20324, -16101, 3583, 36413, 66941, 73875, 68584, 50739, -38176, -43837, -14378, 42776, 75444, 50024, 3173, 10246, 18972, 20914, 67537, 84977, 104960, 130041, 112983, 23993, 1466, 31039, 36341, -14960, 4365, 20499, -41691, -46096, -42885, 14364, 49912, 50252, -22659, -22471, -34595, 28276, 28694, 9100, 11755, 23278, 63197, 31598, 48016, 25172, 53128, 90181, 44421, 39384, 74691, 73609, 28812, 6418, -32727, -84976, -42884, -20459, -65746, -49092, 6360, 13479, 34279, 30768, 60846, 65118, 26929, 25081, 3316, 15086, 14666, 30400, -32141, -26206, -27330, -7559, 34969, 23622, 50736, 30032, 17604, 15, -59174, -100343, -46277, -44646, -32245, -89858]
27742h9858o3166K4580L3460l9067M9530Q1366O0191j7427m9565l5275L0889P1918
27730E7576J1887o3456n9178k2743J4405N1K4801M5787O0152j631O533J523l2163
27717D3544L4372K4328k8160k4643r152m057p4181r646K0276K531L5944J0720
27705B1876k5532j15k1425J1538K1253k1999r782k9105m0836J1089j2875k6944
27693a22857L7961N9302O2511m9399j4484M8915p655k2631j8880K0288L1115L4328
27681E8514j8271o6280n742n1546K5270M0132K6443o682k5429k5132j2461K0238
27669d0946P916m4153m2980o4605R325M8058P6298K2611J4746N267K6685j1170
27657G052j9488p359J7390K4475J7183j4774L2867k4619N774M5934k378k3657
$$ y = [-89858, -153024, -128444, -94984, -134051, -84521, -3155, 57036, 39609, -9956, -45231, -14342, 57576, 69463, 6007, -53171, -75914, -61509, -61458, -36657, 9130, 69282, 67651, 74184, 75707, 43544, 77916, 102244, 74084, 49441, 40289, 36232, -37949, -47595, -27319, -24788, 11156, 21876, -3656, -3771, -25196, -13658, 7595, -14404, -24186, -53291, -94127, -83038, -95913, -122857, -84896, -25594, 36917, -12482, -26966, 21949, 14294, -8337, -27217, -6929, 24186, 58514, 40243, -26037, -31779, -83325, -58055, -17923, 8520, 1838, -23591, -48723, -61184, -40946, -33030, -77183, -120163, -184768, -175443, -127385, -51087, -28476, -13730, -8463, 18222, 7052, -12436, -19795, -2405, 22070, 39253, 24479, 57346, 32727, 38501, 84435, 82057, 58400]
27645E8400m0621j4423K6358M0170M01k7853k378L4050K0971L593l6155q1413
27633a8900k8642k6208K8478K2087M6427J4222O026j5577O780P2276l328k5553
27621G8088n023k9066K4155k6959l5251J2721M160O648J1872N2196M9556l0305
27609A12792m3903r314M1401n1672k3388L4415k5150J5106m1493J9931L0355j8638
27597D0442k8869l0443L9216k7670L0518l3619n0693l7326L5717N1024k5257l3301
27585g0261L7203j8268J2112M0390N2892n741j7197j9628k2998j3642J7993p415
27573a4560j9203O0886O6312J0876j7772p8131l9299K1756N850J3954j4045O0515
27561E7139N3727o5528o2317R753N1281K726o7376n8803P328K1464j3599j510
$$ y = [58400, 17779, 3356, 29714, 69884, 70285, 42432, 40054, 74104, 95075, 98668, 62513, -18900, -47542, -73750, -45272, -23185, 23242, 37464, 43490, 27913, 34693, 106969, 103641, 78088, 73065, 43999, 68154, 41195, 5944, 18665, 22825, 29473, 41345, 93541, 143097, 112792, 68889, 59575, 100976, 49304, 25916, 60331, 35181, 50287, 8794, 28725, 59080, 40442, 11573, -18870, 20346, -7324, 23194, -10425, -61118, -98444, -62727, -11703, -36960, -70261, -33058, -51326, -39214, 1176, 54068, 48327, 31130, 11502, -11496, -25138, -7145, -14560, -33763, 27123, 93435, 104311, 86539, 8408, -30891, -9135, -3285, 10669, -3376, 57139, 110866, 45338, -16979, -7226, 44055, 46781, -20595, -79398, -72070, -50606, -64205, -65715]
27549f5715m2670m097K6829P6331O7834K9614k1842m7206l8579J5893k783K2482
27537A6091N5540K1061O315k5365n2378n360k9256p1079o62l423p343m992M0591
27524f0260j4384K6242l0966N623J2872j7156J9316j5709k1078r82O75O4218j6792
27511d8381m2160l7049M6971L6559O3678j101k0474l2430l8054K9247P7564J4376
27499D8746q211K702L0017l2666L19q278j9075k5268j0083k1596K5267j7062k0603
27486e5791K3487P900N1384N04n774L064J1826q94k5980j8873K1422o47j9394
27473g766L4266J102N2057L5953p7856p896r675N6565J7572M3358l2130p1031
27461C4519l1483j7891m7745j5999l6744J7132K2253L6667M9625m3220p234j5416
$$ y = [-65715, -108385, -112482, -85653, -9322, 58512, 88126, 66284, 19078, -19501, -3608, -6391, 16091, 71631, 92692, 99007, 73642, 21264, 15904, -13352, -84431, -85093, -88516, -95859, -100851, -60260, -74644, -48402, -79368, -73745, -60873, -78029, -58713, -74422, -95500, -96482, -95807, -31589, -48381, -90541, -127590, -80619, -44060, 19618, 18517, -1957, -34387, -72441, -43194, 34370, 48746, 40535, 43237, 73254, 40588, 40907, 32629, 13554, -11714, -21797, -43393, -18126, -35188, -55791, -32304, -24404, 26980, 27484, 21710, 24774, 36600, 35706, 9726, -9147, 12275, 11628, -7766, 26500, 27602, 79659, 115612, 37756, 29860, 20185, 76750, 94322, 137680, 105550, 34519, 3036, -14855, -62600, -78599, -115343, -98211, -75958, -39291, 10334, -32886, -40120, -55536]
27449e5536K1249O1660L0881j07334j2140L8778l39p271p7M4072n6924q691n376
27436e7048M169j1393k4438N418J8503K1225Q779M7723K1118P265l6423k7485
27424b2587k3123Q597M0926M3015J7503K9139j2557n4184k2079K1906Q417Q619
27412D3592O435L6095k1801o1707n8164J9375K4363J7180n9899o487M2625J3195
27400e198p045l062p2834l757K2615L4872m7910q2M9233J2111j801j5668O613
27387c1913l8885p0521k3070K3846J3479K8964L0696M7615j3248k3045K611L7513
27375a5958N8301k0573k5082k0623l8988P518j8572m9216P0864Q7114l7911m7788
27363e0914L2610M7306K3503k5874M2591L6115l0826k4784Q551l2776n3246l3640
$$ y = [-55536, -34287, 27373, 58254, -49080, -61220, -22442, -22781, -30052, -30129, 13943, -42981, -51672, -57048, -52879, -64272, -88710, -83292, -64789, -43564, -34785, 12938, 34056, 41321, 4898, -22587, -45710, -37113, 3813, 46828, 64331, 93470, 80913, 26729, 4650, 26556, 34973, 43592, 50027, 86122, 64321, 2614, -55550, -36175, -11812, 5368, -54531, -61018, -18393, -5198, -12243, -15305, -88139, -91896, -69281, -34409, -82319, -82401, -33168, -21057, -22858, -38526, -31913, -70798, -141319, -164389, -140543, -127064, -98100, -67404, -19789, -33037, -56082, -53471, -15958, 42343, 21770, -3312, -23935, -62923, -55405, -73977, -123193, -52329, 34785, -3126, -50914, -18304, 29002, 52505, 26631, 69222, 105337, 74511, 49727, 58278, 25502, -27744, -61384]
27351f1384K8772K7334K5592M1858q631j6496J4153m9311m0270L7109L5132j8071
27339A5787l602r494P4685j3496n5116q117m8397K226R3597K6976j2766l7528
27327B4755j0094q024k8981N2217k1834o3305J0094J7627L0487M9225k6564j4972
27315A0631j6068L0419K7703k7879o5612K5485P7477l6251l1150L4283M1119J2324
27303H2481q554j0464J1558M215n6519l8883j0600q771n4039j8210N8717K0715
27291b8354J0926K1024P581L568L6671J2987k4272l597J406M7843L8189n5315
27279F8657r425K6122j2747n6894O2806N1718m3796r0787k1297P5760J8247o6940
27267A424K2812K9138J5010j0310k2735n1621O017L8381K3960M924J1131L7584
$$ y = [-61384, -32612, -5278, 20314, 62172, 53541, 37045, 51198, 1887, -38383, -1274, 33858, 15787, 12185, 2691, 77376, 63880, 8764, 647, -47750, -45524, 48073, 75049, 62283, 24755, 14661, 6637, -22344, 29873, 8039, -55266, -45172, -27545, 2942, 52167, 25603, 10631, -5437, 24982, 52685, 24806, -40806, -15321, 62156, 25905, -5245, 29038, 70157, 82481, 73927, 63463, 75021, 79236, 22717, -16166, -26766, -35537, -89576, -107786, -49069, -28354, -17428, 3596, 11177, 14745, 51416, 64403, 40131, 36534, 37940, 85783, 123972, 68657, 59232, 85354, 72607, 15713, 78519, 130237, 86441, -4346, -25643, 50117, 68364, 1424, 24236, 53374, 68384, 58074, 35339, -16282, -10265, 28116, 52076, 57000, 68131, 105715]
27255A05715j4496r236o8766k1912O5231J8254m8329l1264k4249R673j4143J2366
27243b1156J3513J2337P5000p786r0495j9238nJ4428j7844P1786O1118k0761o3069
27230G828j8361j33j5424M9934r588j8699L0565L993j8720M23J3899J6328M958
27217D7003k8099L6959l4949m1863L237j8297L6647p393k3302J0891l4243n738
27205e9147K8425M386j4024k4684J6812J8432N6443O548l1562l8182J6237N9037
27193C8721k320n0376n0760m3438L6893L1661k3999j9886R5911K7050p3392m0326
27181g4261k0467N1674n166q581k7115j3597R295N2421N839m4761p7522J9741
27169a32500O6543p549P769L8654M8284M7004j8113m6581J15K7694k4290j7932
$$ y = [105715, 91219, 81983, 13217, -8695, 56536, 74790, 26461, -4803, -29052, -19379, -33522, -21156, -7643, 4694, 79694, 71908, -18587, -37825, -37830, -23402, -41246, 30540, 91658, 70897, 7828, -10533, -10666, -26090, 23844, 14256, -4443, 26122, 30115, 11395, 11818, 25717, 42045, 47003, 18904, 55863, 20914, -20949, -17712, -36009, 638, -6755, -30057, -19166, -53409, -59147, -30722, -26336, -40360, -65044, -48232, -29800, 26643, 33191, 1629, -36553, -20316, 38721, 36401, -13975, -64735, -108173, -71280, -39619, -63618, -83504, 12407, 39457, -33935, -74261, -94728, -43054, -48220, -56801, -83916, -97513, -88218, -35797, -29958, -74719, -152241, -132500, -65957, -73506, -65737, -27083, 21201, 68205, 50092, 3511, 3626, 31320, 7030, -10902]
27157a0902n039M01J6712K7797l1390n000N638j7331l471L5453M8345J2535j63
27144G3585k2177n8596Q19P6377L78o565l6880j3830J7708m3769o1486q393P0892
27131a1937O3393M8592K1996m8376m5817o3129L2588l3131k0374m3757j023M7950
27119e3025N7027N1470l6792J4350M8191p5291k6595J4087n9486r969K573q876
27107h2336J8641K7366k6807l3518K4764L1346K9359J857j8929p0359J0592N7536
27095c0488l1958K1072L4107l9338j2063K7699Q370j1422N8608J9025j3334L1137
27083F1415m1262k8483J3444O463m6911K6567J7340L0587N81n654L5803L1557
27071A01447j2519K2189k7497p963m5503l9291o3397m0497L6882N4674J4184l0635
$$ y = [-10902, -15941, -15540, 1172, 28969, -2421, -7421, -1783, -19114, -22585, 12868, 61213, 73748, 73585, 51408, -7188, -6369, 70008, 70386, 63821, 26941, 13111, 30819, -12950, -74436, -82829, -11937, 51456, 100048, 122044, 73668, 27851, -35278, -2690, -35821, -56195, -99952, -100975, -53025, 4002, 55472, 18680, 33030, 81221, 5930, -20665, -6578, -66064, -76033, -73460, -82336, -63695, -36329, -63136, -96654, -71890, -40544, -11185, -9328, -28257, -98616, -88024, -30488, -62446, -41374, -7267, -46605, -58668, -30969, -22599, -34021, 24587, 43612, 30278, 61415, 20153, -8330, 5114, 11577, -35334, -8767, 8573, 39160, 39741, 34087, 69890, 101447, 88928, 111117, 83620, 75657, 30154, -9137, -72534, -113031, -76149, -21475, -7291, -37926]
27059c7926m7085R473J135N533L6224M7111J6462J1177p208o979K2742N243K3122
27046G9024k8459L3488M4845r7331j46219O517Q2247J9301r364n8724K6344J18455
27034G0124k7109J4564p102J4557k424k7265k6547n8801p8400J2210p198J701
27022a21690O8332K5430l0471M7001J6239j4204j0136k803M4040l9930k7950l030
27010d9172L8117j4576J9184L2280l9101j9859k2299k3950K1749Q9770P4742k164
26998A04721r628m4145p7174J0881j7217L5579K1386j5619K1915O6367k2646p0521
26986C899m8393J9542k0153m905M877K2562K9810K2083J1233J2206J8740J859
26974G3360K0926P737p1272J7829J2935N083j6565J1742K638o811l4211k0950
$$ y = [-37926, -85011, -75538, -74403, -68870, -32646, 14465, 30927, 42104, 34896, 27917, 50659, 55902, 79024, 50565, 84053, 128898, 31567, -114652, -108135, -25888, -6587, -15951, -74675, -48331, 70124, 43015, 57579, 50477, 65034, 62610, 35345, 8798, -50003, -128403, -116193, -123391, -121690, -53358, -27928, -58399, -11398, 4841, -9363, -19499, -22302, 21738, -18192, -46142, -49172, -11055, -25631, -6447, 25833, -13268, -33127, -55426, -79376, -57627, 32143, 106885, 104721, 95093, 50948, -26226, -15345, -32562, 3017, 24403, 8784, 30699, 97066, 74420, 3899, -44494, -24952, -45105, -50010, -45133, -22571, 7239, 29322, 40555, 52761, 71501, 73360, 94286, 102023, 30751, 48580, 61515, 66598, 50033, 61775, 64413, 57602, 23391, 2441]
26962B441l8168k9025j110K814L0999j12j5025r5l1975l6779n1029M9921K0710
26949i6433N6341l3171q2192l8928N1540K9001K3448L5832O2979J9762J7512j4614
26937C1077k2758N046j158k0793q9326Q225m000l8702j1355m8164q444P0291N3768
26924g6293J11769O0635l8504j5854J1275o5741m974M0447p159j4386j6742M1044
26912B5517m678k605k2439j2238j0775q483j1360O4605K5469p46Q7680l9550p6842
26899A3555k6000o0996j2123J2690L3201l0164k606J9404K4850K8504l4155m7207
26887h1047M5545K3316k8413K6956j5634K3770P345Q449r878j7395O6171M9415
26875I8600l3968k9241L7182K3362K2153J0601l4215O443j2923p9241n1612j4786
$$ y = [2441, -35727, -64752, -65862, -63048, -32049, -32161, -47186, -47281, -79256, -116035, -167064, -117143, -96433, -40092, -73263, -155455, -194383, -142843, -113842, -90394, -54562, 8417, 28179, 45691, 31077, 8319, 13365, 12207, -8586, -97912, -89687, -93687, -132389, -143744, -191908, -200352, -130061, -76293, 35476, 96111, 57607, 41753, 53028, -12713, -17687, 22760, 15601, 1215, -15527, 25517, 20839, 18234, -4205, -16443, -27218, -35701, -47061, 17544, 43013, 42267, 129947, 90397, 13555, -12445, -73441, -85564, -72874, -39673, -69837, -72443, -53039, -28189, 315, -33840, -81047, -35502, -12186, -40599, -13643, -29277, -5507, 1838, 10287, 409, -16986, 49185, 98600, 64632, 35391, 72573, 95935, 118088, 128689, 94474, 100917, 87994, 8753, -42859, -57645]
26863e7645J5447m9466N3047Q3686J8690q1553J910M568L7549N7667k4422l7432
26851B2046l2415q9705k4408M9038N8057J2448j2629K5443L7316K2240n818k4313
26839C7300m3499j7377K8076L6539m1204l9663L5953J8017J817n92K678Q544K5292
26826E1881l214K4504m0734p0984l4447J9229j8938J8346O1510L0728J5506j1866
26814D1521J3338p7328j03011k275J5923J16749L8489O966o250k3024p5879m3130
26802i7911N0946P1612k7100m1053J7851L9016L0016m3260m3806l577j6558o5195
26790a29019K9009N2008M3138j8152k3602q031j1181J0602j0548J6039L5245N3526
26778C9034n507j5166o314O061J6423p971l3247l7277m2608l3991O2406Q7458
$$ y = [-57645, -42198, -91664, -38617, 45069, 63759, -17794, -15884, -11316, 26233, 83900, 59478, 22046, -10369, -100074, -124482, -75444, -17387, -4939, -17568, 7875, 45191, 67431, 61613, 37300, -6199, -23576, 4500, 41039, -165, -39828, -3875, 14142, 15959, 15367, 18045, 26589, 51881, 48667, 73171, 32437, -38547, -72994, -53765, -72703, -54357, 7153, 37881, 53387, 41521, 54859, -22469, -125480, -127755, -111832, 4917, 43406, 50372, 44122, 21098, -54781, -97911, -46965, 24647, -2453, -43506, -25655, 13361, 43377, 117, -43689, -47266, -63824, -129019, -100010, -48002, -4864, -23016, -46618, -54649, -65830, -55228, -65776, -49737, -14492, 39034, 33527, 18361, 12047, 18108, 34531, 26560, -6687, -43964, -86572, -120563, -58157, 29301]
26766B9301l0986j7406l0589M071j4179l3839k0069Q912j6463Q0337K7514L6151
26754B2755K1801j9402K5503j0503o0764j2921M7986j5099K0365M1079l596l5690
26742B1514k4908l3546j8392M8964O430M5006n534o4832K169j7641J8370N0239
26730B7839L2695M6796J3652n3861n9367J4877M0123n0042J83n4029l3346K9453
26718d5027M3876N035k6955K1100P5629K3390j3150o8936q2301l74L2176j347
26706c6884J3507O2668k1615l9580m9999J04329Q5871o3098l8344k5850n534K4808
26694A0279K0918l160m693r11M1746K0594n772m2387m8695j2727j1879K597l0100
26681f4190q638J4302Q307J3354M8868m7784l8222K9354M1287l7302r990J0037
$$ y = [29301, -1685, -19091, -49680, -45609, -59788, -93627, -113696, -104784, -121247, -40910, -13396, 22755, 44556, 25154, 50657, 40154, -20610, -33531, 14455, -644, 19721, 60800, 57204, 21514, -3394, -36940, -55332, -6368, 62, 45068, 39534, -25298, -23129, -40770, -22400, 27839, 60534, 107330, 120982, 67121, 7754, 22631, 62754, 12712, 12895, -41134, -74480, -45027, -1151, 3884, -23071, -1971, 73658, 97048, 83898, 14962, -67339, -67713, -35537, -36884, -23377, 39291, 17676, -21904, -71903, 32426, 118297, 55199, 16855, -8995, -14529, 10279, 31197, 28037, 23344, 22433, 64179, 84773, 79001, 36614, -12081, -24808, -36687, -34090, -64190, -72828, -58526, -50219, -36865, 12003, -35781, -74003, -44649, -3362, -40664, -50654, -40617]
26669d0617J5287N102K6781O9406J0720l0762n7727J1625K5384o8923k592J1055
26657b5261N8882N912l3351J3616K5344Q203q3442j9708M3658j5292J6840Q018
26645C419J0423K5307K1469l3959J967j6659n1052k5227L151N0997J4417k70p8294
26632g4311j0234K2092P5310K9116k0270J852m2003q9595L2375N3001k7925k8596
26620g9188N4608L5017O09m3597l2462q88j0989K8358p408o5324l3916J4423K0339
26607a20418J5497M4323L9025L018O280M872m4655l6349K1757O379M7919K2560
26595A0208k1991N567M3194R0179o503m8193n1592j546j202P668o25J9453k5965
26582A8652P772l705k9735M597J7736M2192k8336k1514j284K9570k9027J9047
$$ y = [-40617, -25330, -20228, 6553, 75959, 86679, 55917, -1810, 9815, 35199, -33724, -36316, -25261, 33621, 39533, 6182, 19798, 45142, 53345, -30097, -49805, -6147, -21439, -4599, 3419, 13842, 39149, 60618, 26659, 28626, 11967, -39085, -64312, -61161, -10164, 4253, 3983, -74311, -84545, -62453, 12857, 41973, 21703, 23555, -18448, -108043, -75668, -22667, -50592, -79188, -24580, 10437, 11046, -32551, -65013, -65901, -76890, -48532, -55940, -121264, -155180, -140757, -120418, -104921, -60598, -21573, -18555, -12275, -7403, -52058, -88407, -66650, -60271, -12352, 10208, -11783, -6216, 36978, 127157, 120654, 72461, 20869, 19323, 18121, 25789, 25164, 44617, 18652, 26424, 22719, -7016, -2419, 15317, 57509, 29173, 7659, 6375, 35945, 6918, 25965]
26570B5965Q407l5278K1858N3376j2735m7146n2932n7718J5835l6004p390J7854
26558a05908L8741M9128P5053L7899m3694j8993l8266j9000L2718j3262L8577
26547C2993m468j213k930J8578k4750k1768n048M9598K567n8495Q2740M773J4890
26534H7467l0250j5911q563m9944k8994K4989o150O98M0412K4252k3287M5198
26522E9917k319m8296l0934j3755k5533O766L4628R1060l384o9242j4907l5250
26510e1249j0987j7590j2489J5831L5353P9313J1763k4228n0068p8598K9922M3830
26498b9197O119K6682Q3354L08r5174m6495N207O1425J7390m585O4671o3229o9094
26485d2618j818L9553p48l49L1005m928R529J8254J2595K053K885p1095n7576
$$ y = [25965, 34372, -906, 20952, 74328, 61593, 14447, -38485, -96203, -80368, -116372, -123762, -105908, -67167, -18039, 57014, 94913, 51219, 32226, -6040, -25040, 7678, -5584, 32993, 28525, 27312, 24382, 42960, 18210, -3558, -8606, 40992, 43559, -14936, 67804, 72577, 87467, 57217, 41306, 32743, -17201, -46195, -21206, -27356, -26658, 13754, 38006, 14719, 59917, 57598, 9302, -21632, -35387, -60920, -54154, -19526, 71534, 68150, -1092, -15999, -51249, -62236, -79826, -92315, -76484, -41131, 38182, 49945, 25717, -24351, -102949, -73027, -29197, -23078, 3604, 86958, 87266, -7908, -54403, -49196, 12229, 29619, 25034, 89705, 26476, -42618, -44436, -4883, -5631, -5980, 25025, 20097, 29626, 47880, 60475, 62528, 65413, -5682, -63258]
26472f3258P6632P2990O9641j5551l7586J5361J373q216r0011n8047N0530O3613
26460G7471J3994k1171j5032Q674k9632m2474J6815K111O692m0555K6526k1295
26448a7876k3085k7335J3399L7377L9712J4218j0959l0115j2443j7329n411J7315
26436b2532l8745J2916J5002L352m7996l0319Q8433N3564l9703J259J4588K6312
26424C6131m896L49k0710o4744K5203L4567j2972m8353o0560o5859N195N8501
26412a18148M4634K7650Q5173J1488q271J5570j4178m1705J9039j4511r1828k735
26400h7822J6704M3346l76q010K7102r094N932j0801N472L4407k3997m1994M3878
26387e253M2023p3625o3453J5199N372N3024l058O3639L2288O898M746N02L755
$$ y = [-63258, 13374, 86364, 156005, 140454, 102868, 118229, 119602, 111386, 21375, -36672, 13858, 77471, 91465, 70294, 55262, 63936, 34304, -8170, 8645, 10756, 17448, -23107, 3419, -17876, -40961, -68296, -54897, -17520, 22192, 36410, 25451, -4664, -17107, -34436, -39847, -22532, -61277, -48361, -33359, -30007, -78003, -108322, -19889, 33675, -6028, -4769, 9819, 36131, 31235, 31584, 10874, -53870, -28667, 5900, -7072, -55425, -115985, -181844, -176649, -118148, -73514, -45864, 39309, 50797, 42526, 58096, 43918, 2213, 21252, 6741, -85087, -87822, -71118, -27772, -28148, -36158, -9056, -18150, -12218, -23019, -17547, 16860, -7137, -49131, -5253, 36770, -36855, -100308, -85109, -79737, -26713, -29771, 33868, 66156, 73054, 77800, 78302, 82057]
26374H2057j5984m4620k9812M3863o00p3764J0219K6170L819l711M5533J6462
26362E9632l2223q5088j7402R6733m9537m6151O287N4833K7542n8822m8632r427
26350a02255N009K3567L4870J0835K8405l5530O03J2487K8013n128l1506l2983
26338f3613J0654L1990K8879j7163K070m868l2379P040n8759L7115O9050k4528
26326a4512m6435l6821k6015M7780R3805N0987K6089k8300o0877k4973k6161K1005
26314b4428L5609q78j3044k2772m3876l2761K1608p997J5664L1242l5116J381
26302g5368j2096O806K9916j0344o4547J0960L3121P0717K4556L8246J0230m0604
26290B1593l1658l336L2969L9223o8636R144M1960K817j1914j7378k2066l6872
$$ y = [82057, 66073, 21453, -8359, 35504, 34904, -38860, -28641, -2471, 1348, -2363, 43170, 59632, 27409, -57679, -75081, 21652, -27885, -74036, -67749, -12916, 14626, -44196, -92828, -102255, -97246, -73679, -38809, -27974, 431, -35099, -34496, -22009, 6004, 876, -30630, -63613, -52959, -20969, 7910, -9253, -7183, -12051, -44430, -37390, -96149, -59034, 10016, -14512, -60947, -97768, -123783, -76003, 17802, 68789, 94878, 66578, 5701, -19272, -45433, -24428, 11181, 10303, -2741, -25513, -69389, -102150, -80542, -88539, -72875, -41633, -76749, -75368, -87464, -80658, -50742, -61086, -125633, -114673, -81552, -10835, 13721, 51967, 62197, 21593, -10065, -13401, 19568, 58791, -9845, -701, 41259, 44076, 32162, 14784, -7282, -44154]
26278d4154k4574l3330n891K0171k2171r83N0679L2438j1812K6057M190l9963
26266d9343O51L3155K8840P719J9349L1656k5261j1286r665m7808M103M9988k8808
26253C290p7196j3661L4370L8406P8659O746n4621p1086L0308Q4282m7472p2005
26241e9980j7762K8957M5005J7470o205l3687L9835M6350J5757q1213q2197M5194
26229d2476Q9964j6839m3135q4893m2449O6837K7500m7905J4608J20658L9089
26218H0959L0488r299p1453p2008l5367K4908M6621j3454N8943m8441m0068M1228
26206f943M4798M1126j4432L0237K5595n1088K0156m9314r916K3740l155k7364
26194B3440k1995R90k6670k984K780J3798m3120k0136K641o145L0124P8074M3548
$$ y = [-44154, -68728, -102058, -107949, -87778, -109949, -110932, -60253, -27815, -39627, -13570, -9380, -49343, -48692, -15537, 13303, 21022, 40371, 72027, 46766, 35480, 25815, -21993, -17890, 32098, 3290, -73906, -87567, -53197, -14791, 63868, 70614, 15993, -55093, -24785, 59497, 12025, -59980, -77742, -48785, -3780, 13690, 7485, -26202, 13633, 59983, 75740, -5473, -87670, -42476, 47488, 30649, -12486, -97379, -139828, -72991, -45491, -93396, -78788, 41870, 80959, 111447, 102148, 30695, -41313, -76680, -51772, -5151, -18605, 40338, -8103, -48171, -6943, 37855, 78981, 64549, 94786, 120381, 69293, 89449, 40135, 30219, 53959, 50804, 23440, 1445, 2435, -24235, -27219, -24439, -10641, -53761, -73897, -71256, -77401, -47277, 30797, 74345]
26181G4345k16p256l0585p4052k3434K3104N046Q739n5744o6454L5920l511L2503
26168h1595N170P375L7273N079j5397J0861R1480m845j6858l2413r2353o737L1839
26155f1121O7612K4218L2140J2545K0828n4100p9676L1954P2700k0700o4535l0144
26143d8279K4420J8197k6271n4660L0311O9354K9327J8970Q291J4160m9684p5712
26131d1576M6431L9620L6993k6819k1768j701o396M5041L6830l1350q973p2012
26119e680m6203j6144J9682L7294M7863j6082m2223J8267L5085j0171l7165j263
26107a6740r525k2319J7833L7408j7260J9832p2476k7669l2144q833Q1691J5679
26095c4523n1506l2567j5959Q6226N4438j1082L531l1657l6507o820M446j5545
$$ y = [74345, 74129, 66873, 36288, -37764, -61198, -38094, -33048, -24309, -80053, -146507, -110587, -114098, -81595, -76425, -69050, -31777, -26698, -42095, -31234, 60246, 55401, 38543, 6130, -86223, -92960, -61121, 6491, 30709, 62849, 75394, 96222, 42122, -37554, -5600, 67100, 46400, -18135, -48279, -23859, -5662, -31933, -86593, -56282, 13072, 42399, 61369, 69660, 83820, 34136, -41576, 4855, 44475, 81468, 54649, 32881, 31180, 24784, 69825, 106655, 75305, 66332, -5680, -51883, -68027, -48345, -11051, 36812, 20730, -21493, -3226, 31859, 21688, -15477, -16740, -26265, -48584, -30751, 6657, -10603, 9229, -63247, -90916, -123060, -131893, -50202, -34523, -86029, -118596, -134555, -48329, 6109, -4973, -1442, -33099, -69606, -76426, -71980, -87525]
26083h7525J01473M4492p6210j6295p494Q62N3152n7481j0238j0496Q292M1274
26071a6194L367M3581K4861n9918m8900K6306J0637j236L1398L9633o712K3944
26059G0767J1181m6804J960k6815m2211J2132L1473k088J5691o5576j9741K3049
26047c6982N6067J1218p58k4053l50p480j940M6356Q282l8135j007L3887k0655
26034B4450j3888L5645N1500m6481J050o3667l2604L8487R133L2297k5440o4024
26022e3542M179P201k7408j8264j4987K6202P0519L5456M3679r492l2450n0148
26010a9055m5720K9178L9400L9157o78k5437N4833K1799k8189r0255o1302P5983
25998a0286Q7919J2911l6260o7840o956J0686m3461j2864M4372q845k014O127
$$ y = [-87525, 13948, 58440, -17770, -34065, -41559, -40697, 12455, -45026, -55264, -65760, -57468, -16194, -12827, 30754, 55615, -4303, -53203, -26897, -16260, -17496, 13902, 53535, 46823, 70767, 81948, 35144, 37104, 10289, -31922, -19790, 11683, 9595, 25286, -40290, -60031, -36982, 19085, 30303, 29545, 5492, 5142, -2338, -4278, 42078, 50360, 12225, 11218, 45105, 24450, 10562, 46207, 97707, 51226, 52276, -11391, -43995, -5508, 3625, 35922, 10482, -53542, -49363, -42162, -69570, -87834, -102821, -76619, -6100, 29356, 73035, 63543, 31093, -19055, -64775, -35597, 3803, 42960, 42282, 16845, 71678, 93477, 65288, -24967, -86269, -10286, 77633, 90544, 54284, -13556, -20512, -9826, -53287, -66151, -21779, -30624, -32638, -26511]
25986b6511M4649j7797k340n4120k3071L5568L566m327k284m0465J930O8908O097
25973a0197n466L792l5160J3463m7452k4940K3168M0124k055q138K8636k772m190
25960c1187L0950l0804l5813J1778O7938K6206j06237m4956O8894N7599P1356
25949H5724J6485r9829m6905K8860k3708k6769J2495j8249J8008n164j0225m467
25937g3744Q8290K1806n423j0578O509N4269J5112R53o007m3542K6404M1486J168
25924A16703J2157k6944o6626J0068N2055k1951o7627P153j4409k8355L0657J4544
25912A7425K1144k9432K280j7772k6407J757J221M397P017L2125p076q301L9333
25899C7711J4723K223j2469r592j853j8287m4247k7499p726m9394p985M8868K6327
$$ y = [-26511, 18138, 341, -1999, -56119, -79190, -43622, -40056, -44383, -46667, -87132, -85202, -16294, -10197, -15663, -11871, -47031, -33568, -81020, -105960, -82792, -42668, -44723, -52861, -24225, -26997, -31187, -237, -31041, -66854, -55076, 12862, 39068, -67169, -112125, -43231, 14368, 85724, 102209, 2380, -44525, -15665, -39373, -66142, -53647, -71896, -53888, -59052, -69277, -73744, 14546, 36352, 30929, 20351, 26860, 81129, 96241, 97194, 91187, 47645, 74049, 115535, 116703, 128860, 101916, 35290, 45358, 97413, 75462, 7835, 14988, 579, -27776, 2881, 17425, 38569, 9137, 11417, -6355, -32762, -31005, -29784, -25387, -18370, 13755, 6679, -1622, 37711, 52434, 54657, 42188, 32596, 30743, 12456, -31791, -59290, -67016, -116410, -124395, -75527, -49200]
25886d9200L1899m7459N026P5318O3481L7616n643o7596o5274L7210J6298M7604
25874G9280o278L1193j8279l5899l5639L618M8542r252L5581K0744o5030m432
25862D4149n9581p1712J37L690N9016N0632K8007o1451K1555p0529k5573K4205
25850e7455P688K6700M3505J9825k4264o3833M54l619K2756j4881M802M0264O5963
25837F7905K8739o6401l2882k4729n6705j205J8650J8709j6441k0943j7713N5163
25825d7853J3153n368L1328L4423N0642k6130n3549O931k3578J5305K0982J7549
25813C3835L929m5013R17J3723l6003j7659N65K8403j3261n1271q4163j7336R1501
25800i1833R2266j160j2939k4871m463K9742m2975L3102K3392M661L928o503M2992
$$ y = [-49200, -17301, -64760, -59734, 15584, 79065, 116681, 111038, 43442, -21832, 15378, 31676, 79280, 73002, 104195, 85916, 50017, 14378, 17996, 66538, 57286, 92867, 113611, 48581, 44149, -15432, -87144, -87007, -83317, -24301, 26331, 54338, -7113, 14442, -56087, -81660, -57455, -49767, -23067, 20438, 40263, 15999, -47834, -47380, -50999, -28243, -43124, -38322, 1942, 67905, 96644, 30243, -2639, -27368, -84073, -85278, -66628, -47919, -64360, -85303, -103016, -47853, -34700, -40068, -8740, 25683, 76325, 50195, -3354, 3577, -20001, -4696, 16286, 33835, 37764, -7249, -6332, 7391, -28612, -46271, -45706, -17303, -30564, -81835, -165998, -183334, -91833, 433, -727, -13666, -38537, -43000, -13258, -56233, -23131, 261, 4922, 8850, 2347, 45339]
25787D5339K6215l7897k1062k4585M8423J7918J9935q689k1441j11L0296o8956
25775E385m8857J5998L2684J629R958K7660m4805k5825N5537O6987m3910m3387
25763I054k4665K3280l1306j9672K0751l8820J6211L0780j6800j8547N1789M985
25751G040m9842R211P394J7174N835p249J1945n6545L685K6375N4427O373m841
25738C0982J7773K5603J6053n0305q6052k3880M6412K6507k1651o1149k6760O7318
25726c9149Q7965j8605m9004n4575K9553q32j1107M7757J2789L2709m6987l7022
25714d6508j5260j1354M6060J9950l157O435L5734p607L9352R161k9174l1225
25702A2407l2107k2027K1753K146K5652m7253k1750N0397P0206m377l8143K2814
$$ y = [45339, 71554, 33657, 12595, -11990, 36433, 54351, 74286, 65597, 44156, 44045, 74341, 5385, -43472, -27474, 5210, 6839, 16797, 44457, -348, -26173, 29364, 96351, 52441, 9054, -15611, 7669, -23637, -43309, -22558, -61378, -45167, -14387, -31187, -49734, 2055, 7040, -42802, -33591, -26197, -9023, -3188, -10437, 1508, -55037, -51352, -24977, 29450, 35823, 30982, 48755, 74358, 90411, 40106, -45946, -69826, -23414, 3093, -18558, -79707, -106467, -39149, 48816, 30211, -18793, -73368, -43815, -44647, -55754, -7997, 4792, 37501, -9486, -46508, -61768, -73122, -27062, -7112, -10269, -3834, 31900, 24293, 63645, 72806, 43632, 12407, -19700, -41727, -19974, -17828, 7824, -39429, -61179, -10782, 59424, 55047, 16904, 39718]
25690C9718M1230l8845l5690j9286j0321o722Q897L2839K2274j7790m5113M0883
25678A2074Q6602J7771l0134n0919j05213Q405P2939K5156M2431J291r2073J748
25666i922r43K6694p566q318k1342J6699N7399j3003O839k2065m771J4463j6826
25653A7338l6349k2143L6335P3413L661m8351j8499K923L390K6708j1543O97j8866
25640H714m0208j8101K6655O3393L1675L3529M743q3177o1151O3483K3675L808
25628E7038k5371j6268l2632n0321l4087L4796q19L3685J1606L7128L2558M20
25616D7733Q37l7487k5153j0916n925K680P178p3386L2102N4256J9218j6059J044
25603c878P930M0620l6075k2677k4360Q970O8169k3252K7336P3572j48n0251q001
$$ y = [39718, 80948, 42103, 6413, -12873, -23194, -29916, -21019, 11820, 34094, 16304, -28809, 12074, 98676, 116447, 86313, 35394, -69819, -61414, 11525, 36681, 79112, 80403, -11670, -9922, -10865, 15829, 8263, -55, -21397, -4698, 52701, 39698, 46537, 24472, 19701, 34164, 17338, -19011, -41154, -4819, 68594, 72255, 23904, 5405, 8328, 11718, 38426, 26883, 27580, 8714, -31494, -49595, -22940, 40453, 72128, 105657, 110400, 27223, -33928, 29555, 53230, 57038, 31667, 15399, -17233, -67554, -101641, -66845, -67664, -33979, -22373, 14755, 47313, 47733, 48570, 11083, -14070, -24986, -30911, -28231, -21053, -94439, -62337, -8081, 11137, -4922, -3878, 4052, 44672, 8597, -14080, -38440, -29470, 38699, 15447, 42783, 116355, 116207, 65956, 57955]
25590E7955j7426k0728J963m4928j2087L6242J1359K5675j959O2349L5309j5184
25578A18540p109J3092j9231k2245l9214L1647J7149r0629q7318m7220M6563J2943
25566g3032j5202J4682O0281P1972n3320n2567J9153n928l1100j1288M9820J3027
25554a3502J3533q2972l8711N2683O0418J6056k5050k3877p2729N0248J2098K8149
25542b3656O1222J070k1595K6265O329k2439j6201j5183m150j8913J6105n2650
25530f3796J7838M3861l7679Q1714L4668k1290j1287k4193q5216j7319Q1379L6889
25518C5569r3497m4471r00L3102K6268N793J5726K8589J386j0396k5684l3062
25506f1577J6282p819n596M0768Q0979M095n7941l8734k8237K1185L5475j1309
$$ y = [57955, 40529, 19801, 21764, -23164, -35251, 991, 12350, 38025, 36066, 98415, 133724, 118540, 111431, 124523, 105292, 83047, 43833, 75480, 92629, 2000, -85318, -132538, -85975, -73032, -88234, -73552, -13271, 58701, 5381, -47186, -28033, -33961, -65061, -76349, -26529, -13502, 31, -82941, -121652, -68969, -8551, 7505, -17545, -41422, -114151, -63903, -51805, -23656, 37566, 38636, 17041, 43306, 49635, 27196, 10995, -4188, -8338, -27251, -11146, -63796, -45958, -2097, -39776, 41938, 76606, 55316, 44029, 19836, -65380, -82699, -1320, 35569, -57928, -102399, -103299, -70197, -43929, -38136, -22410, 6179, 7565, -2831, -28515, -61577, -45295, -53114, -58710, -17942, 63037, 67132, 9191, -29543, -57780, -36595, -1120, -12429]
25494a2429J4300k9793N484J1347L910K517l5502k3186o476Q5186l287n2815n132
25481d5876L2826M0682o4812k2800m6074O2948N9413O277J1803n2310K3226l0620
25469b5317J6192N605L549n027k0038l7200L3825K2040j9997m066J4962k283l6174
25456e3929Q918N8625o39o444J3353l7353N6205L3635m7673o3122J1914O3351
25444C6841N5376K166k4473L111Q554k1781N003k4395k7657j4675J3149J7523
25432B8742p897n0684K6926P043J6930j4073r178M5970K1771l4233n1751k212
25420b2646N3274m064j9521L825J5138k3882K8354K3411J6803j6165n1979m2918
25408d0370O923M2091n5945J3345M7112L2366R655m465l0700p1851j4631P221
$$ y = [-12429, 1871, -27922, -22438, -11091, -7181, -4664, -40166, -63352, -69828, 15358, 12071, -40744, -45876, -13050, 27632, -37180, -59980, -106054, -43106, 16307, 22584, 34387, -17923, 5303, -25317, -9125, -3520, 29, -4998, -25036, -62236, -28411, -6371, -26368, -30434, -15472, -17755, -53929, -45011, 13614, 12975, 6531, 19884, -17469, 38736, 72371, 24698, -38424, -26510, 36841, 92217, 94383, 69910, 73021, 81575, 59794, 64797, 40402, 12745, -1930, 11219, 28742, 20845, -29839, -2913, 4130, 21060, 6987, -2191, 43779, 65550, 31317, -20434, -22646, 30628, 26564, 7043, 10868, 26006, 2124, 30478, 53889, 70692, 54527, 2548, -40370, -33447, 8644, -47301, -33956, 13156, 45522, 55177, 50712, 20012, -51839, -66470, -59249]
25396e9249N7338P2973m5924m9185M9433M8761p282L2387m3025o3966k6569K8261
25384f047K0583L9325j8439O686J8429J7808P423K2147o2506j4281k3281p9577
25372g1730m6677J5144O010K0729q365N2329O4675L6902l9226l6599J1845k1583
25360a6546O928R120K2364K7123j6027r8336J3995R1615M9342m3954m4535k2388
25348b1299k2936j9839L3894K9881j5050K3419j679M550K0362n8511k6355P4209
25336B0646M2832J9826J2888o0876m7934l1987o781j7838P703N5137J6610l6099
25324b5873j975L1294M0557j4089k3501L9256n074j5387n0838J8778k5586j8108
25312e0546J1786j0515J6393m0775m3653K2258P938K4433N8089m2542n3549M8308
$$ y = [-59249, -1911, 71062, 25138, -24047, 25386, 74147, 66865, 99252, 56227, -7739, -34308, -6047, 14536, 53861, 35422, 42108, 60537, 78345, 85768, 107915, 45409, 31128, 7847, -71730, -118407, -103263, -97253, -76524, -84889, -32560, 32115, 69017, 29791, -6808, 5037, -16546, -9618, -498, 21866, 48989, 32962, -65374, -51379, 40236, 89578, 45624, 1089, -21299, -44235, -64074, -30180, -299, -15349, 8070, 6391, 10941, 31303, -27208, -53563, 20646, 63478, 83304, 96192, 35316, -12618, -44605, -51386, -69224, -61521, -6384, 10226, -25873, -27848, 3446, 44003, 29914, 6413, 45669, 40595, 25208, -25630, -6852, -32438, -50546, -38760, -49275, -32882, -73657, -117310, -95052, -87114, -62681, -4592, -47134, -100683, -52375]
25300e2375J5607P0686m0183k2356K9528k1782k0030J4121P5801M7375p016p5784
25288A3592o369j4567k0767M0464m2658L8180P3929L9811P006o1997K9438k5700
25276G0362m4683j9701K1856J3740m1831J1630J417K350m362L034K1121L164o04
25263C7493j7528l0942l9271M5449L1525k2681M1413N0851m1251l9331k6662q297
25251a9232Q705l31K7789J2298j7178k6054j2083J6839K4951J5207l0461R259
25239I709N0818L1977p7508m1325N647K4093m0697K212M4756J0290m6516k6148
25227e2692N4948l2162l1641j795K0187O0679l123J8635L546m8730j7577j766
25215c1491M8127K8619k654N278J2635R757j8345k0685l3841k6636J480L5910
$$ y = [-52375, -36768, 33918, -6265, -28621, 907, -20875, -40905, -26784, 49017, 96392, 89376, 13592, 7223, -7344, -28111, 12353, -30305, 7875, 81804, 121615, 128621, 66624, 96062, 70362, 25679, 5978, 27834, 41574, -257, 11373, 12790, 15140, 10778, 13812, 34933, 38097, 37493, 19965, -10977, -50248, -4799, 26726, 4045, 45458, 96309, 55058, 15727, -10935, -19232, -10527, -10858, 16931, 29229, 12051, -14003, -26086, -9247, 15704, 30911, 450, 9709, 60527, 92504, 14996, -26329, -20682, 3411, -37286, -35074, 9682, 19972, -26544, -52692, 2256, -29906, -61547, -63342, -43155, 17524, 14401, 33036, 36582, -12148, -29725, -31491, 16636, 45255, 42601, 47879, 60514, 70271, 51926, 31241, -2600, -29236, -27756, 8154]
25203H154l680k9871K3764J6310J9396L4024k5104J0342o5067m3101M2523L1402
25191A9092L020p1125O260J8848O0657k1602n776J7180M1817K939k6852m9694
25179e236N5519j9871l0780Q297R986k3420O478J0841O659L7442l4508k7109k8097
25166c3799o5591M1131Q7864K1362Q792m5598M8029o90p2148l8841j5779k6268
25154i1536K7650K4456o10K3598k1027M0769M2910k9929J7013P249L522j2579
25142C1486q558m1186L8891J0882j934n2061k955O1039K2551n065q7047j1150
25130d5107k21L7894K7295O5m3062n3289J3337Q2076m675O47J55k492n1195j788
25116d0360k60K23J1296m151j024J1174L0547m0918r435K9884J8556J2736j6524
$$ y = [8154, 4474, -25397, -1633, 14677, 34073, 68097, 42993, 53335, -11732, -54833, -12310, 19092, 22112, -49013, -42753, -23905, 36752, 15150, 9374, 26554, 68371, 71310, 44458, -5236, 50283, 30412, -368, 7929, 17915, -5505, 973, 11814, 18473, 55915, 21407, -5702, -33799, -99390, -58259, 29605, 50967, 59759, 14161, 62190, 61500, -10648, -49489, -65268, -91536, -63886, -39430, -40040, -16442, -37469, 3300, 46210, 16281, 33294, 40543, 44065, 31486, 22928, -18258, 20633, 31515, 29581, -22480, -25435, 35604, 58155, 53090, -33957, -45107, -45328, -7434, 19861, 19926, -23136, -76425, -63088, 18988, 14313, 14960, 15115, 12623, -38572, -40360, -40620, -40397, -29101, -33252, -34276, -23102, 7445, -33473, -42908, -13024, 5532, 18268, 1744]
25103A744p9N469K0411J7628J9722n654q777n2656l1744n2787L0205J00283l2751
25090A1014k0473m5593M9341L7757K381o783j4032j3475m8262j7096K5391P4763
25078C4933J1918n5107k8181J645N2K6649k0527J1348M6422k9028k3906R691M7200
25065C3109j113l0116R719K8300k2252J328k3519k9549l875j681K2192L2321k6218
25052a1354K5065P962q631m4348J8572L2390m0945k7514R51l2583K8710N2561
25040H36L8422O546n855l3164J762L804J3007j9917o585l8946K5566J5053j222
25027f93J1949L3746K3536o2792k9762o4796l3749Q1639N3629Q902O2784k7185
25015E7208j3655L134p048j7077j3531l2758j5416L7539P792k9456l5678k4171
$$ y = [1744, 1665, 7134, 27545, 45173, 64895, 59241, 50464, -2192, -33936, -86723, -56518, 43765, 11014, -9459, -55052, -5711, 32046, 34427, 27644, 13612, 137, -48125, -65221, -39830, 34933, 46851, -8256, -36437, -34792, -34740, -8091, -28618, -17270, 29152, 124, -23782, -14091, 33109, 31996, 1880, 11599, 39899, 17647, 18975, -4544, -34093, -37968, -39649, -17457, 14864, -11354, 13711, 21673, 13042, -31306, -12734, 19656, -21289, -48803, -47852, -80435, -51725, 836, 39258, 45804, 39949, 6785, 8547, 12351, 25358, 5441, -1144, -40090, -14524, 529, -693, 11256, 45002, 68538, 5746, -24016, -88812, -122561, -40922, 12707, 21609, 84393, 57208, 43553, 46687, 39639, 22562, 9031, -23727, -39143, -1604, 6188, -23268, -58946, -83117]
25003h3117j0228N0751J7210k6004r794n8814j4097L4414N2627L8367M4742j9355
24991A6702n1435n7890K5997q738M4339o478J2536J1947J8755M8333K6762n8934
24979B1896J4344m7651l1488M8566K6334L2147L0323j223k3931p4701m7397J0750
24967d2031O706l619q0718l4488M2909J8806m3950J4243O8596K9528r042l863
24955c6923j9991p337L6188R9489J0378j1850l2816j2004j2392p471J5389K2806
24943D3466M0259L0395j9480J0247m4757l7292L6018m0375n8005L939l0788j3358
24931g9731L804N7886o120m2378K865R310J803K7478R1l0265M7118L6940J1534
24918D0335Q260m7657K7233J7376O81j4795J8838J4158q375l7408Q202o369k2846
$$ y = [-83117, -93345, -42594, -25384, -51388, -61182, -119996, -134093, -99679, -47052, -8685, 36057, 16702, -34733, -92623, -66626, -75364, -31025, -37503, -24967, -13020, 5735, 54068, 80830, 21896, 36240, -11411, -42899, 5667, 32001, 64148, 94471, 93248, 69317, -5384, -52781, -42031, -35325, -38944, -119662, -154150, -111241, -92435, -136385, -122142, -53546, -24018, -33060, -36923, -56914, -64251, -28063, 71426, 81804, 69954, 37138, 25134, 12742, 5271, 20660, 43466, 83725, 114120, 94640, 104887, 60130, 22838, 58856, 18481, -39524, -35585, -66373, -79731, -75927, -18041, -24161, -66539, -63674, -54364, -52561, -25083, -24992, -55257, -8139, 28801, 40335, 48595, 938, 28171, 45547, 46228, 31433, 50271, 64429, 56054, 18646, 26848, 20479, -2367]
24905b367M8240R2153Q6q2751j0482o1907o8712n7774J7051O1721L4513M6058
24893A5829J4716l3142K0131K5933J6556n0223j5053k3913m1637j6289J7692Q1634
24881A2234R280n2165n8183r862M1928j1479J0542J09933O1433m5976J6797l3140
24869E1342N630R4245l36j20312o5871J1926P677K3728j1987K9951j2833O770
24857A9930M48l263j5259k5223k3171J1757M2780P730m3085n034J3912r525J4764
24844a3239N3848j5308m5790l715M2851P870J5722J0666j3053M2340L9482j3320
24832A08354l7305m5138M6678o191n8318l408L3371j213p939j8850L2998P842
24820E0881m1779N947N1375K3109j2445j5590J7499k8553l7392r1933P346M2904
$$ y = [-2367, 45873, 138026, 138112, 55361, 44879, -17028, -85740, -143514, -126463, -64742, -30229, 15829, 30545, -2597, 17534, 43467, 60023, 9800, -5253, -29166, -70803, -87092, -69400, 12234, 21514, -30651, -88834, -98696, -56768, -68247, -57705, 52228, 113661, 67685, 84482, 51342, 56972, 151217, 150881, 30569, -35302, -23376, -15699, 8029, -3958, 25993, 13160, 19930, 20378, 17115, 1856, -23367, -46538, -34781, 7999, 15729, -27356, -32390, -18478, -28003, -13239, 40609, 25301, -20489, -24204, 18647, 26517, 42239, 52905, 39852, 82192, 121674, 108354, 71049, 25911, 72589, 66398, 8080, 4672, 38043, 36830, 28891, 10041, 43039, 50881, 9102, 15049, 66424, 89533, 77088, 61498, 78997, 50444, 13052, -78881, -71535, -28631]
24808b8631k091r439K0820N0126P4574n6211o4868k4541k0446K5245L8292k42
24796B588l9872l144M780k023R071N7843L953n259n8611J0903O3829n0360j822
24783h124J8343j0713M08L9689J421k8j4132l6167n1014R865o808L0437n564N2791
24769B0404L6372j8046j2664P347j2590k0554K4573J4740j10035m6008K0638O1645
24757c4178k345L6597L7254M9112k4705l3294k6515k6079j8535o992N236q143
24745e2587L8159K7118k6424n9104k7672N6572P0788K2401R873l1500k8415j6768
24733a7559m5581n32O1879K0810J6175k878K1148l3814l0123J6169L8970l995
24721D0669l3264K4235l7450M8705K7836K5343o1153l7619j0249K86k3741k9999
$$ y = [-28631, -30722, -40161, -19341, 30785, 105359, 49148, -15720, -40261, -60707, -35462, 2830, 2588, -37284, -40428, -35648, -37671, -28600, 29243, 33196, 27937, -30674, -19771, 44058, -6302, -8124, 10219, -494, -86, 39603, 41024, 40996, 26864, -9303, -60317, -50452, -57260, -26823, -32387, 20404, 56776, 38730, 26066, 33413, 20823, 269, 24842, 39582, -70453, -116461, -95823, -34178, -36523, 74, 37328, 86440, 61735, 28441, 1926, -24153, -42688, -49680, -44444, -52587, -14428, 12690, -13734, -72838, -100510, -43938, 26850, 49251, 59124, 27624, -791, -17559, -63140, -63672, -1793, 19017, 35192, 32314, 53462, 19648, -10475, 5694, 44664, 40669, 7405, 31640, -5810, 42895, 70731, 96074, 34921, -2698, -12947, -12661, -36402, -66401]
24709f6401l339P880p539J010O259L9319p370k1187M3747m603n0427M9222R4130
24696H0701o645k8281o5750k1185q34k5083L6235J01666n754J651m5752J2682
24684C3651k1103p315M9452k5117k0306m9373L5013l609j8864l6267R58J349m0068
24671a01599J5718K7174j6070N2196M3487k7405m2364l3923J924K6428J4830L0547
24659i057K4490J7314k5090j1638k1999N4214L1376k0676k6978j8447o4062l4541
24647a05094J0094N181J4265K4945L8692q140p002M831m6732Q439M1712J8410
24635c99n6119k8815P4434L8255M9454O96o7677m3617k7617K5955M3042k5994
24623a8402O782K2219j8447O135K343j8249O120L0149o5708j7487L5387J3216
$$ y = [-66401, -69740, -61860, -69399, -68389, -62130, -22811, -30181, -51368, -7621, -12224, -62651, -13429, 80701, 74056, 45775, -19975, -41160, -41994, -67077, -30842, 70824, 65070, 66721, 20969, 33651, 12548, 5233, 54685, 29568, 9262, -40111, -5098, -8707, -27571, -63838, -62880, -61531, -101599, -85881, -58707, -74777, -22581, 20906, -6499, -48863, -82786, -80862, -54434, -39604, -9057, 15433, 32747, 7657, -3981, -25980, 28234, 59610, 38934, 11956, -6491, -70553, -105094, -95000, -89819, -75554, -50609, -11917, -20057, -27059, -22228, -68960, -60521, -18809, -399, -56518, -85333, -10899, 27356, 76810, 77506, 9829, -33788, -61405, -35450, 7592, -18402, -11620, 10599, -7848, -1713, 630, -17619, -11499, 18650, -47058, -64545, -29158, -15942]
24611a5942J216J3387j6564k7125k3244J7111K3807P3473J7348J1097j9405L976
24599E9135j5317P223J4251p652R163j0262O194K2841j683l2606k2300J2330J6386
24586E7703q394M9388r312m8772o6869L286j4848K3583l2509j852O0031N1589
24574F3024j7142p1077N182K9741j9525r608o778K0083l552M3968o940N758k9249
24561C885J296J2696J0565K0365j5070J1728k4880j6535o6801K5477K3217N2890
24549C8833m388l8265L1983j4125p2670k1637N2871J0800l063q4483K6573K9133
24537d8438K2887J4830l3624R143P8083l8770k0282j6174l8506j7287M2756k8880
24525g4262N6705O8044J4312l7578q3674n6950J1103N3920J9688M3623L6252k38
$$ y = [-15942, -14726, -1339, -17903, -45028, -68272, -51161, -27354, 46119, 63467, 74564, 55159, 59135, 43818, 51041, 65292, 57640, 66803, 56541, 62735, 85576, 83893, 51287, 28987, 41317, 57703, 49309, 98697, 89385, 40613, -26256, -22970, -37818, -14235, -46744, -48596, 11435, 63024, 45882, -25195, -20013, 9728, -9797, -19405, -26183, -6100, -9652, 34316, 27376, 33134, 3885, 5181, 17877, 28442, 48807, 33737, 45465, 20585, 4050, -62751, -37274, -14057, 38833, 34445, -3820, 28163, 14038, -58632, -80269, -27398, -16598, -19661, -104144, -77571, -48438, -25551, -10721, -44345, -35202, 42881, 4111, -16171, -32345, -70851, -88138, -45382, -74262, -17557, 50487, 64799, 27221, -56453, -113403, -102300, -48380, -28692, 14931, 51183, 50945]
24513E0945K4778K7618k7726k6719k0882R04k5447J5218m095J0760L3538j2642
24501D6250m6271n1828L2316j4596J3254l4030M639N1585J932J4347o335M2435
24489E3698M9791m9171o0714q901P993m0733J8379R205m3294J4148J6524K3070
24477a0005j4040l0407l904M818Q317L3753L2270o0607J4281Q441o876O9051k3306
24464B1786m5702n5398k4371O244J2521K1673M3144k8853O793L7512n6128K4206
24452c6573J4064M0149j5508n4689k4754j024M9704P8921R137k6219r7649k3757
24440h8198m740M5219K6521N0561N315j5763o838k896J6287M1614o273n79q6089
24427b5859l2685L4723M5744M8411l8087o9177K8926l143j9528k336J3918M1691
$$ y = [50945, 75723, 103341, 75615, 48896, 28014, 28918, 3471, 18689, 14594, 25354, 58892, 46250, -21, -51849, -19533, -34129, -20875, -54905, -50266, 1319, 3251, 17598, 11263, 53698, 103489, 54318, -6396, -15297, -7304, -48037, -29658, -20453, -63747, -49599, -33075, -10005, -24045, -54452, -58356, -53538, -45221, -11468, 20802, -39805, -25524, -17083, -23959, 45092, 21786, -23916, -79314, -103685, -97441, -84920, -63247, -20103, -48956, -42163, -4651, -60779, -36573, -22509, 17640, 2132, -52557, -77311, -78335, -28631, 50290, 59427, 33208, -64441, -88198, -92938, -47719, -21198, 29363, 34678, 18915, 12077, 9181, 25468, 67082, 60809, 60230, -25859, -58544, -23821, 21923, 70334, 32247, -36930, -8004, -11147, -30675, -33011, -19093, 22598]
24415B2598l1273k8183K5643j539j2994k0057K1903M0429j9198O5386K121n8465
24403F371M636N144N060p947o4010J3665L8076J7439Q507l6210K8109M3227k6342
24390C5725k1310q3068k3089K0693J2000M3099K6310l0797r433M5657k1759l3077
24378c9049L0549J5312L5477j8060l6521M3664L6921l2967l344l1806J3514N7665
24366G1355K002m0557l9530k9524L2726j9928j6913o5410k3763j1041M4533M4790
24354e1260l899M1572N2689l9269m2838L2844K2519J1581k1478o5761n3001L4403
24342h1898j0632M0707J4069O316M7922K0616J3417O0262N976m9790j28011k9765
24330i0811M7884M8421L0904j2192O917K2702K8858n4716k0578m7040J5243J7243
$$ y = [22598, -8675, -36858, -11215, -12754, -25748, -45805, -23902, 16527, -2671, 62715, 64836, 6371, 11007, 16151, 21211, 13264, -50746, -37081, 995, 18434, 26941, -9269, 18840, 62067, 35725, 14415, -68653, -91742, -71049, -59049, -15950, 10360, -20437, -29870, 15787, -5972, -39049, -8500, 6812, 42289, 24229, -12292, 31372, 68293, 35326, 31982, 176, 13690, 71355, 73357, 32800, -6730, -36254, -3528, -23456, -40369, -105779, -129542, -140583, -96050, -51260, -55159, -13587, 39102, -167, -43005, -10161, 12358, 23939, 2461, -63300, -116301, -81898, -92530, -51823, -37754, -31438, 16484, 37100, 50517, 110779, 116755, 66965, -61046, -90811, -42927, 5494, 36398, 24206, 31123, 53825, 82683, 27967, 7389, -39651, -24408, -7165]
24318g165j3947Q6636P0148k6374l4653M4867N0417l9258n0606l5601k2577j6566
24306E321K1519K3265q845j8259l3055l2454n2280N2235M7366j3538j7491k2560
24294d8776Q905K5335Q520m0046M6592J0248j1352l585j8532L310Q2751l246l8889
24281B1235K1547Q727j1180j0123m6509k1946N8686L8579J0221m5802p3045K626
24269d6984N3723n9375R456Q7639M1954p024k240L5687N6509j9447l4144p577
24257A08177r302l5666l2406r394J02165L6029l9147j8235j2902q9434o2766m15
24245f3296R427K843L8183L2426m4367R183J1452J3842M1019L4931M909J0617
24233A01169o0492l2275n8763K7600M8395L2871n878O0291j3888j13025k2311
$$ y = [-7165, -21112, 65524, 135672, 109298, 74645, 119512, 169929, 130671, 80065, 44464, 21887, 5321, 26840, 50105, 41260, 23001, -10054, -42508, -94788, -42553, 4813, -8725, -26216, -48776, -39871, -14536, -6016, -46062, 530, 10778, -574, -4159, -22691, -19381, 63370, 60124, 21235, 42782, 51509, 40329, 30206, -16303, -38249, 20437, 59016, 69237, 23435, -49610, -46984, 6739, -52636, -43180, 44459, 86413, 79389, 77149, 112836, 169345, 149898, 115754, 108177, 98875, 63209, 30803, 21409, 123574, 159603, 120456, 102221, 89319, -115, -62881, -63296, -53869, -51026, -12843, 19583, -24784, -15601, -4149, 9693, 50712, 85643, 90552, 101169, 40677, 8402, -50361, -22761, 25634, 58505, 52627, 112918, 99030, -13995, -36306]
24222c6306j4538K0074K6209L2103L7374M1414j2001K122k6252l8340q250L9628
24210F3237K1233o208J9425j4689n3347l9124m9797r378N9496K4137N6934L3141
24198A05060p8551k2340K3154L9243j5422k4732l3131k2723K4910N567Q664o8659
24186e8960m4317L6252K0983J844K2949l7514k3144O0050K0981J0650q0100K5460
24174d4866n5079l3533J1158N8778k8159l9337K0108J9739K4555K2369N237L697
24162c5333L8074L0117m7346l0790L3148M6499O216L8727O1822j6094o4406p9118
24150a8484q4582j6909M465j0812O1885O0523J7329m9585o5710J9097O7521N6058
24138D0796K6147J6401L5701J3685q6276l4813m5714M5653N1551m81j9549p9756
$$ y = [-36306, -50844, -30770, -4561, 27542, 64916, 106330, 94329, 96451, 70199, 31859, 23609, 63237, 84470, 78262, 97687, 82998, 29651, -9473, -59270, -68648, -9152, 14985, 71919, 105060, 26509, 4169, 27323, 66566, 51144, 26412, -6719, -29442, -4532, 1035, 9699, -58960, -103277, -67025, -46042, -44198, -21249, -58763, -81907, -21857, -876, 9774, -70326, -44866, -99945, -133478, -122320, -63542, -91701, -131038, -110930, -91191, -66636, -44267, -39030, -35333, 2741, 32858, -14488, -45278, -12130, 34369, 40585, 79312, 141134, 125040, 60634, -18484, -103066, -119975, -115510, -126322, -64437, -3914, 13415, -36170, -101880, -82783, -15262, 40796, 66943, 83344, 119045, 132730, 46454, 11641, -34073, 11580, 63131, 62650, 43101, -36655]
24126c6655o9731P1341N487P945m220n4820q496M640M0488m773l0777J4459N3619
24113a1493L285k7276j7069L7704P8255R177l1609k1319k2427j3222J265L8908
24101B4179o4271n7845r873n431R587L7377j0698J0979j9712j5920m2967J6359
24089a28236J7396M9439r666o065j3369N1949L1313K336n8939K2311O5788j599
24077B2658K4699m0872o5708m8441N0476Q823k7618L9293K6429m5047j0453M6562
24065a9199J9781J4165j8450o162l5619l1834M3230M7815l0273P473j0033N0051
24053C0945K1549J3573n6965p6912k1313O320J9935L839K0361L2953m2188m2549
24041i0452m659L8315J5687m26N4028L2720j3925j0410j2149q370l2363N1222
$$ y = [-36655, -106386, -35045, -29558, -21613, -25833, -80653, -89149, -84509, -44021, -48794, -79571, -65112, -11493, -8208, -35484, -52553, -14849, 63406, 72583, 40974, 19655, -2772, -15994, -14729, 24179, -40092, -97937, -107810, -113241, -103654, -66277, -76975, -65996, -85708, -101628, -144595, -128236, -110840, -61401, -71067, -77132, -90501, -38552, -7239, -4903, -63842, -41531, 24257, 22658, 47357, 6485, -59223, -107664, -57188, -48365, -75983, -36690, -10261, -55308, -65761, -19199, 582, 14747, -3703, -9865, -45484, -77318, -34088, 13727, -16546, -9073, -19106, 30945, 52494, 66067, 9102, -67810, -89123, -82803, -62868, -59029, -38668, -5715, -47903, -90452, -95111, -56796, -41109, -41535, 12493, 45213, 31288, 20878, 8729, 359, -32004, 19218]
24029A9218l243l0681N6458L0942k5333m165J0258k5042k7799k3690P376K4166
24017H465K3368K7877Q846l5517l070M1414J0692m9058j7677K5050j411j4111
24005B4868l8215O374j3629k454p719m602o98l9317l2978K2821l197n2277m032
23992a45055K8299M8112L1943M3956K6837Q419n5951j0915r460j3750m6354m3381
23980a37300m0530M5536J2906L1181P1862p782o5200N4836J2846m4991J5495J6879
23968c4262J7327K6581l0331m8268J5242L8513L5016L5528m6639m2827m4762Q4039
23956E157K3653o2438M976M5257o779m511K7286L3603M7304k5406n1654j0450
23944B5998l7601K1477q879Q6415J8640l6798M797L5907o2138k8593n5308n6263
$$ y = [19218, 15975, -14706, 41752, 72694, 47361, 43196, 53454, 28412, 613, -23077, -15701, 8465, 31833, 59710, 68556, 33039, 29969, 71383, 82075, 33017, 15340, 40390, 38979, 24868, -13347, -6973, -20602, -23056, -30775, -35377, -36075, -75392, -108370, -85549, -88746, -141023, -145055, -116756, -68644, -36701, 7255, 34092, 42511, -13440, -24355, -33815, -47565, -93919, -137300, -177830, -132294, -119388, -88207, -16345, -24127, -89327, -34491, -21645, -66636, -51141, -34262, -16935, 9646, -20685, -68953, -53711, -15198, 19818, 55346, 8707, -34120, -78882, 5157, 28810, -33628, -28652, 16605, 9826, 5315, 32601, 66204, 113508, 88102, 36448, 25998, -11603, 9874, 995, 87410, 106050, 69252, 74049, 109956, 47818, 19225, -36083, -92346]
23932i2346N516N5146J5759n0330K2715O6611N88k635O2747J3097m3802N222N261
23919F3549m647l0670m1302L1256L2611q9012j2155J7205L631n3189m210O5616
23907b1317j0436k9783o6206k4541L7022Q3259L8296m2877k0575K8864K8717K6551
23895B6974J8082l0201r4388M328m5411J2032J7457M6150M8528L6259l116k5260
23883A1434l4261k1664l4286Q529M5917M5008O0187K6503l144n1068k4049K8706
23871E7812O1971k050r0905o3775K1233k1237K3777J7129o0329p4107Q738Q1910
23859c9833M5387L6928o912o6726j0795J3761j5194K9265M5647j0040K6227L9899
23847H7614j9220l5360m1745o4242P738m964o043K723P0594K5306o4239o2745
$$ y = [-92346, -86830, -31684, -15925, -66255, -43540, 23071, 23659, 21024, 83771, 96868, 53066, 58288, 63549, 58902, 28232, -13070, 18186, 50797, -38215, -50370, -33165, -29534, -82723, -86933, -21317, -31753, -61536, -127742, -152283, -115261, -32002, 6294, -36583, -57158, -28294, 423, 26974, 45056, 14855, -79533, -75205, -120616, -108584, -91127, -44977, 3551, 39810, 36694, 11434, -22827, -44491, -78777, -70248, -24331, 20677, 80864, 107367, 104223, 53155, 29106, 57812, 119783, 117733, 26828, -36947, -15714, -36951, -13174, 3955, -56374, -130481, -121743, -39833, 5554, 42482, 35570, -31156, -41951, -28190, -43384, -14119, 31528, 21488, 47715, 87614, 68394, 33034, -8711, -72953, -65215, -70179, -76222, -73499, -2905, 22401, -41838, -104583]
23835a04583R7669M8262j1132m4370o3757k2230P410j4061J5809M6061M4726R218
23823I022k9463L289L4087K5795L7673m2827l4687o109J799J8617N5064m1031
23811C1229K1000l3906k8302j5908J1466M5537j4950n2157J7784J7707l3035r878
23799d3413l33J9274k4727N583K337l7633N4364L0458k354m3206p587j9634L0054
23786c6817J0782K9937j7154J9905K889J3493J0713l773k9922n4384l0338L2229
23774e2440N2368J948k8604j1353J9497M7288j3152n5440K8170O1716q576L6950
23762G8372M0772q059p8415k5819M7803k0307p1838k2833o89P7295N2288l1346
23750C7224l8826o48m391K4139N7516L465q5543l5807j1285M6050K0244P446K123
$$ y = [-104583, -6914, 41348, 30216, -14154, -77911, -100141, -92731, -106792, -90983, -44922, -196, 9022, -20441, -17152, 16935, 42730, 80403, 37576, 2889, -3220, -1421, 17196, 72260, 31229, 52229, 18323, -9979, -25887, -14421, 31116, 16166, -35991, -18207, -500, -33535, -43413, -43746, -24472, -49199, -43616, -41279, -78912, -24548, 5910, 3556, -39650, -47237, -66871, -36817, -26035, 3902, -13252, 6653, 9542, 23035, 33748, 29975, 53, -54331, -84669, -52440, -72, 1876, -26728, -38081, -18584, 28704, 15552, -39888, -11718, 49998, 41422, 78372, 119144, 111085, 32670, 6851, 54654, 34347, -37491, -60324, -61013, 16282, 68570, 37224, -1602, -2250, -6641, 17498, 75014, 78479, -7064, -42871, -54156, -8106, 12138, 19584, 21707]
23737B1707K6368j3435o6397q089q658R652N9419L1587j3867m2963l8857K5054
23725a8479N502k563Q088j1822Q402J6849L4984k7854N628k1651q983N2414J0849
23712E1364J9110k0405m1813N152J3144M563J1819m1640k840O010J7091O9743
23700I1298M2130N3956o6343r1735j5245j3730M8924L1667l8076q2773n579J6578
23688b8928j1960j5582P370J7261M5705J4753J702j4832p7031l5518O8577J4559
23676a3924m338j5877K5941m1446J565L1581M2935O7494R115l6774n7035p370
23664A867O054J4982l5565m734N3950K738k3675j5053k6963J7704L1046j2952
23652I399n616J2979N316k3259m1157k0891K3898M3183r149K698J7694J1770k9912
$$ y = [21707, 48075, 34640, -31757, -39846, -48504, -38852, 20567, 52154, 38287, -4676, -43533, -18479, -12977, -15540, -7452, -19274, -10872, 5977, 40961, 13107, 18735, -2916, -11899, 40515, 51364, 70474, 50069, 8256, 13408, 26552, 31115, 42934, 1294, -1546, 4464, 21555, 91298, 133428, 187384, 121041, 29306, 14061, 331, 49255, 80922, 42846, -39927, -45506, -28928, -40888, -56470, -49100, -31839, 13866, 28619, 30321, 15489, -61542, -97060, -28483, -13924, -18262, -34139, -8198, -49644, -48079, -16498, 26437, 93931, 103046, 66272, 9237, 1867, 7921, 22903, -12662, -17396, 36554, 39292, 15617, 564, -26399, -8695, 22351, 9399, 3783, 16762, 22078, -1181, -42338, -63229, -39331, 3852, -5297, -2599, 15095, 26865, -3047]
23639c047M840J5474n7400J5410K8967K7911j8402l9214k3420j4932j5640J8618
23627f0835q23J5530L6250l5877q0311L4218P70Q920N4973J8012p3292l9883k548
23614a24896N3680P2271O4850l8635m3455k3853m7531O1082j8429o4074k1781
23603a30771q624M5845K8097Q2116J2900j3130n627J395q144M3692K7058l4658
23591D0149m75j1541l4369n0922J6508L5658j1635l7736j6696l0565R909O6529
23579b5186m6822j8917M1220J8502k9776m5583K973P3219j9168k6888J5232m184
23567f5378j3999O9071L2139k5469r3431k5777M0941J16983L2388L1579k9916
23556F9131j2082N785P676k5462k0477R105j4265J0393J6366K8220n7180k5489
$$ y = [-3047, 1793, 17267, -40133, -24723, 4244, 32155, 13753, -25461, -48881, -63813, -79453, -60835, -61658, -46128, -9878, -45755, -126066, -91848, -91078, -82158, -27185, -9173, -82465, -122348, -124896, -71216, 1055, 65905, 27270, -16185, -40038, -87569, -26487, -44916, -108990, -130771, -139395, -93550, -65453, 16663, 29563, 16433, 10806, 12201, 4057, 47749, 74807, 40149, 39674, 28133, -6236, -57158, -40650, -4992, -16627, -54363, -71059, -101624, -91715, -25186, -72008, -90925, -49705, -31203, -60979, -106562, -103589, -30370, -49538, -76426, -61194, -65378, -79377, -10306, 21833, -3636, -97067, -122844, -81903, 35080, 67468, 99047, 69131, 57049, 62834, 70510, 45048, 24571, 33676, 19411, 29804, 46170, 74390, 17210, -8279]
23544h279k5903j8131m838k7028M7914K5021O316M5444K0085k0967J3570l7884
23532A5320o9985R301K7649q057L4481m403n4441l2883K0488N105R1138J899L2113
23519F7725j7365P410n7354n4991N962K0941P5413j2601l5980J8090M6125l0369
23507C3006k2500L7746M0156K3259p9138j00560L7251L1424M5652K7754O090M007
23495H4147k4009l8071j0078R955N4126L4668K5142l8912n1124n287q916K0054
23483E1695O4216J7361L1359K9313L1741J04074K24309K94338N05450M81028K95310
23472B130194K24183k01546l68879l80210l83848l59019k15994j30110j16689
23463A98082o4544m33k3864k1017r300l1064m3588m3549J3438P0370J4975j7031
$$ y = [-8279, -34182, -52313, -57151, -84179, -36265, -11244, -4928, 40516, 60601, 39634, 53204, 15320, -54665, -45364, -17715, -25772, 8709, 4306, -50135, -83018, -62530, -57425, 33713, 35612, 67725, 50360, 57770, 416, -54575, -48613, -27672, 47741, 35140, -840, 17250, 63375, 33006, 10506, 48252, 88408, 111667, 32529, -68031, -30780, 644, 46296, 74050, 80140, 84147, 60138, 22067, 11989, 21944, 76070, 110738, 135880, 96968, 45844, 40557, 31641, 51695, 115911, 133272, 164631, 193944, 225685, 329759, 554068, 848406, 1353856, 1834884, 2130194, 2354377, 2152831, 1783952, 1403742, 1019894, 660875, 444881, 314771, 198082, 133538, 133105, 109241, 88224, 78924, 47860, 4272, -39277, -25839, 44531, 59506, 42475]
23451D2475q29L3538l3411J754K7944N3845k6219l9253K566K9099p7969p5178
23439f1638K8167O9132j3655K3250j025k04K2468k2040l304J6609m0694R501k0696
23426E871K4275M9315K1819j1703l0361j0758j3180J0697l6937k7097K548K9606
23414A4095K2431J7179J4780o9765m9700M6710J33N202K830j6598N6788M4073
23402H8158m4946M632o2491o0034M2819M1694J5253N2084J7871n4874r2382L0499
23390b1717O7216J9530j1100J6383L711p3347n6859J8201o1077k6857K7808N0489
23378d7619R447J3468O7589l8435m057j2169L211M3977O2400j956k5064m4392
23366B6400R231p5262m5652K1551k6941K3417P7493J9124J634K6757m1917o9152
$$ y = [42475, 41646, 75184, 41773, 43527, 71471, 125316, 99097, 59844, 62410, 91509, 13540, -61638, -33471, 35661, 22006, 45256, 44231, 44027, 66495, 44455, 41151, 57760, 17066, 26567, 5871, 30146, 79461, 101280, 89577, 59216, 48458, 35278, 45975, 9038, -18059, -15511, 14095, 36526, 53705, 68485, -1280, -50980, -4270, -4137, 1065, 3895, -12703, 44085, 88158, 43212, 47844, -14647, -74681, -31862, 9832, 25085, 77169, 95040, 40166, -52216, -21717, 45499, 65029, 53929, 70312, 74023, 676, -56183, -37982, -99059, -125916, -98108, -47619, -38172, -24704, 42885, 4450, 393, -11776, -8565, 35412, 97812, 95856, 70792, 26400, 35631, -39631, -85283, -63732, -90673, -67256, 10237, 29361, 30995, 57752, 15835, -53317]
23354e3317m2300L6173O6842K6790j4390k4516k8620n8330K0434j903K1153J5108
23342c6876O035M8529j6657j6370M634J00686L4396o0017K196k2635p9579k7691
23330f3349J7060J4492M2815L6560j9273l8048J02K063N1905l5966N757k9464
23318a5346m1674m0917N8611k8340K9140O3751m0010j6913J8457J4783o208L4627
23306B9961L2476r3661O282m462J2432K8221J04333J4472n6104m249K679N0937
23294A23317Q0011n8722j18114m5467L4857k0710M9430k5947l6402m230r919J1263
23282b0633J0102L1518O0764j016K6539j4241l2437q747J040k5286J8738J3767
23270F0108N189k1588k4877L247K9522j6692j0610q760N1437J6989q383j708j3373
$$ y = [-53317, -95617, -59444, 7398, 34188, 19798, -4718, -33338, -91668, -71234, -73137, -51984, -36876, -30841, 17688, 1031, -15339, -10705, 89981, 124377, 64360, 66556, 43921, -35658, -63349, -46289, -31797, 11018, 47578, 28305, -9743, -9641, -7578, 44327, 8361, 14118, -15346, -57020, -97937, -39326, -67666, -38526, 25225, -14785, -31698, -13241, 1542, -4666, 29961, 62437, -31224, -24942, -29404, -16972, 11249, 115582, 130054, 73950, 69701, 72380, 123317, 203328, 144606, 26492, -18975, 15882, -4828, 44602, 18655, -17747, -21977, -31896, -20633, -10531, 20987, 81751, 80735, 107274, 93033, 60596, 51849, 52889, 27603, 46341, 60108, 65297, 43709, 18832, 22079, 51601, 34909, 24299, 15539, 66976, 83965, 75582, 73874, 60501]
23257F0501k7015l1442o058Q249J1039m9786m33K5178J2041L4102k1021J6056
23245C1411J7957Q801m271J522l3479J2388N6965K3661j1223m7183R938J0315
23233G6802l346j2606K0833k5924l0127m2457L6590m1522j5798N5900O80k0693
23221a668p908k9043N0274K6L7922P976l1224J7792k4352k8802M1585n4697m3921
23208f6040l5603J0068M7023j4801K8620j6065l1756N540M3737N8012J033q185
23196B1583l4705r427O2480N9423P803j5393o9311k1162M6787J8579m2138l0524
23184f005l3402j8180k922K0970j9577K1511L1435L2287m9005j4201J0318L8349
23172A1578Q667K499j3569K5898L858l620o0395q4302p285K9124J110L891K4198
$$ y = [60501, 33486, 2044, -4014, 4235, 15274, -34512, -34945, -9767, 2274, 36376, 15355, 31411, 49368, 58169, 53898, 55420, 21941, 34329, 91294, 114955, 103732, 56549, 66487, 76802, 73456, 60850, 81683, 55759, 25632, -16825, 19765, -21757, -37555, 18345, 19025, -1668, -9576, -38619, 11655, 11681, 49603, 57579, 26355, 44147, 19795, -9007, 32578, -22119, -66040, -101643, -91575, -44552, -59353, -30733, -46798, -78554, -73014, -29277, 28735, 29768, 21583, -13122, -22549, 39931, 99354, 107157, 91764, 22453, 1291, 48078, 66657, 24519, -6005, -39407, -57587, -60509, -39539, -59116, -37605, -6170, 26117, -22888, -37089, -26771, 11578, 20245, 22744, 9175, 35073, 38931, 35311, -25084, -109386, -116671, -87547, -86437, -82546, -58348]
23159e8348J9713r621N5238N5158L0787m4506n4035N1765O1543O2140J0564n1973
23147A28425N1486R0373N8577Q0411j9630j16905j17235j28774m0460R6369J4098
23136I6735l9838j7767j999m3960k8717K8756L044P553n830q783L7014L1041J8002
23123G5251l8915k6737K4121L0047m1355o7138k076p108J365k5335l5293N5070
23111e8103O3286P23R543j6897n1632p5981o0120N0702O9535R495L2680j9506
23099d6275K7740j0100o3969K9272N2500P1635n2082l5777m7799k6642k5700n1976
23087a79173l0302m8829n7086N1679Q0091R081J48599J62347N9483J2962L7575
23076B46427j5080m9645m4948k0740O342k801M567m2195L6466L858o809j435k2786
$$ y = [-58348, -38635, -48256, 6982, 62140, 92927, 48421, -5614, 46151, 107694, 169834, 180398, 128425, 179911, 270284, 328861, 409272, 389642, 272737, 155502, 26728, -13732, 82637, 96735, 56897, 39130, 37131, -6829, -35546, -6790, -3746, 3807, -2023, -10806, 26208, 57249, 75251, 36336, 9599, 33720, 63767, 22412, -44726, -46802, -53910, -52545, -77880, -113173, -58103, 5183, 5906, 15449, -1448, -53080, -129061, -189181, -138479, -68944, -59449, -26769, -46275, -18535, -28635, -92604, -63332, -10832, 60803, 8721, -27056, -74855, -101497, -127197, -179173, -209475, -258304, -315390, -263711, -183620, -174539, -25940, 136407, 195890, 208852, 246427, 231347, 181702, 136754, 116014, 122356, 119555, 124122, 81927, 118393, 122251, 115442, 114007, 91221]
23063I1221r078R393l4912j3163l1063k2353j3424R489P23J0365J9254L7911j3757
23050D0606l0349J5143J0853k187M4427j3203m4039J8639O3757L0546N0536j6402
23038A68327l4071O6234M6431l0273J2050K3593M4015K256n4280K2791m5411l605
23026B18057K9120j6420R9440L3738K2267M4806M2569p9440m6595n0743n8290
23015B38509l735r0268p7036K6117K9648K7987l0556n3124K4212r776l7173j2712
23003C2093J8711M1879J2072O3903l2046k2909K3052K7710q05k292L284L6212
22991B00864j4091J5470J1426l4450k0871j8209M545O9761M0474M1672k6043j6438
22979B54110o874J10294J3293k9334K1476K6686R5217J93003K29455L49955N02269
$$ y = [91221, 82143, 91536, 56624, 43461, 12398, -9955, -23379, -13890, -13167, -2802, 16452, 54363, 40606, 10257, 25400, 36253, 34066, 78493, 65290, 21251, 39890, 103647, 134193, 184729, 168327, 134256, 200490, 246921, 216648, 228698, 252291, 296306, 298562, 244282, 267073, 221662, 218057, 247177, 230757, 330197, 363935, 386202, 431008, 473577, 394137, 347542, 296799, 238509, 234774, 144506, 67470, 93587, 123235, 151222, 120666, 67542, 91754, 81978, 44805, 32093, 50804, 92683, 104755, 168658, 136612, 113703, 136755, 164465, 163660, 161368, 164652, 200864, 186773, 202243, 213669, 179219, 158348, 140139, 144684, 214445, 254919, 296591, 270548, 254110, 247236, 357530, 370823, 341489, 362965, 389651, 484868, 677871, 907326, 1257281, 1759550]
22968A759550L17261L03786K21169k32009m55852m09742l06005k49314j88681
22959G60163q7842n4523m5308j25259l9385L6888J5524K3798Q962K5871K0285
22948E39174j8189n6191j7818m3857j46Q7073R2281J3758J08320M0520M0356n009
22936G80272J2863l0483L4925K0847O2071N7720O8792J60517J53345J28465J43508
22925A592842J24786J90019J60830J84663J52389R6464J63838K52261K81374L56910
22915C556376M56112N89405O19695O26111P03185Q14577R82654J251179J633968
22906A1233262J978509K107480K590538L014066L751637N550927Q451934J3840727
22898E2519080K4038472M4413234Q0927433R7740756N4659107N1671067J2434183
$$ y = [1759550, 2076811, 2380597, 2601766, 2369757, 1913905, 1504163, 1198158, 948844, 760163, 672321, 617798, 572490, 447231, 407846, 444734, 460258, 484056, 493018, 518889, 539174, 520985, 464794, 446976, 403119, 402973, 490046, 582327, 596085, 704405, 744925, 785281, 780272, 793135, 762652, 797577, 818424, 880495, 938215, 1007007, 1167524, 1320869, 1449334, 1592842, 1717628, 1907647, 2068477, 2253140, 2405529, 2501993, 2665831, 2918092, 3199466, 3556376, 4012488, 4601893, 5221588, 5847699, 6550884, 7365461, 8348115, 9599294, 11233262, 13211771, 15319251, 17909789, 20923855, 24675492, 30226419, 38678353, 52519080, 76557552, 120970786, 201898219, 299638975, 354298082, 405969149, 418403332]
22891D18403332o6513019p5074079o8182816o7695461m6735895k6288200j5351508
22884E2562354r958354p071456n171318m431725l723032l034254k632701k217613
22876A4321901j775103j498338j231628q87265o90735o22003n56690m63612m44935
22867F151592n43228m53791m55130l66616l07093k81738j93011j43823r7334o2891
22857C246937j09317j92918j36114j23805j38582q7132j02216j67034j20164r7228
22847A972427n3447m1027q1632p3935o3870j19328n6358l4218n0547j56799j22915
22836A118351m8410l1367q3320n9463j8377Q015N035n2962q0428p1707o9205n5187
22824E60975O1956J22300J16439K74465N86611M39518K82117K78513k10093m36364
$$ y = [418403332, 351890313, 276816234, 208633418, 140937957, 94202062, 67913862, 52562354, 42604000, 35532544, 30361226, 25929501, 22206469, 19172215, 16539514, 14321901, 12546798, 11048460, 9816832, 8929567, 8238832, 7616829, 7060139, 6596527, 6151592, 5608364, 5154573, 4699443, 4332827, 4025734, 3743996, 3550985, 3407162, 3309828, 3246937, 3137620, 2944702, 2808588, 2684783, 2546201, 2459069, 2356853, 2189819, 2069655, 1972427, 1918980, 1877953, 1796321, 1722386, 1658516, 1539188, 1482830, 1448612, 1398065, 1241266, 1118351, 1069941, 1038574, 955254, 895791, 877414, 885429, 890464, 837502, 757074, 685367, 616162, 560975, 622931, 745231, 861670, 1136135, 1722746, 2162264, 2444381, 2722894, 2512801, 2076437]
22814B076437l94007m10631k66482j97706j83078j03169n7025n6425j1034l8888
22804C57992m6314O234l149n2656k5046j0873j2102J2034j8513n2673J9937J1725
22792A86596J8980l2835l6104R728J9243L5165o2392n322J7667M1989J2357K6866
22780B31938k5741J743m1336o0353j2929k4532l1005n237N6883P931j7809o591
22768G2962m2957r651k4331l0299K3640O9255J2675m6599q7562k2541K2362L6523
22756b6523m0230o9360M2387k199R573N1910J5464J0002m9198K5585p0R4372j051
22743F0662J3329p18N7517J2887j10970j1552M7430M0998p5532l8390M7836P1084
22731A14581j2114j092K9535n2991r2029l2385P3725K2726k4016p6886k7008K8290
$$ y = [2076437, 1682430, 1271799, 1005317, 807611, 624533, 521364, 464339, 407914, 396880, 357992, 311678, 317912, 314763, 262107, 237061, 226188, 214086, 226120, 207607, 154934, 174871, 186596, 205576, 172741, 136637, 146365, 165608, 200773, 138381, 133059, 150726, 192715, 205072, 231938, 206197, 207940, 166604, 106251, 93322, 68790, 37785, 32548, 89431, 97362, 79553, 72962, 30005, 20354, -3977, -34276, -10636, 58619, 71294, 24695, -62867, -85408, -63046, -26523, -66753, -136113, -93726, -95925, -86352, -34442, -18978, -8976, -58174, -32589, -32659, 61713, 60662, 73991, 73273, 130790, 143677, 32707, 21155, 68585, 109583, 34051, -4339, 43497, 114581, 102467, 101375, 130910, 77919, -14110, -46495, 27230, 49956, 25940, -50946, -77954, -49664]
22719d9664j9910o184K3055O2023q601o6750k3255j3889K3010j9047J6439j9858
22707a02631L2680M2983M4328P5026J57713M3908m1655N0217J8124p0147j4380
22696B36166m5869l5480O110o986K8099m2123o2101l9910M5880k010l3197K7823
22684G6402o9237K0118N7163P567J6895l9086j8843M1791o6742j7327l5544k8629
22672e5472N5759O5652l7208r608J0582k9730k3224k2869L3867K8540R570k139
22660B3720j5051M5690J539k3557m732l0962l3762k9649l242L1054j2783m866
22648e6601L2736P569m1977j9553N9263J2439o093l4336k8869L064M685m0686
22636a08359L7667L5341J4676J9687r076L3718L385l1063M3263O1900m5379j926
$$ y = [-49664, -69574, -75758, -52703, 9320, 719, -66031, -89286, -103175, -80165, -99212, -82773, -102631, -69951, -26968, 17360, 92386, 250099, 294007, 252352, 302569, 320693, 250546, 236166, 190297, 154817, 160927, 153941, 182040, 139917, 77816, 37906, 83786, 81776, 48579, 76402, 7165, 27283, 84446, 92013, 108908, 69822, 50979, 92770, 26028, 8701, -26843, -55472, 287, 65939, 28731, 19123, 29705, -25, -23249, -46118, -12251, 16289, 25859, 23720, 8669, 54359, 55898, 32341, 27609, -3353, -37115, -66764, -70006, -38952, -51735, -56601, -23865, -16296, -58273, -77826, -18563, -6124, -12217, -46553, -75422, -72358, -67673, -108359, -70692, -35351, -20675, -988, -10064, 23654, 27039, -4024, 39239, 101139, 55760, 53834]
22624E3834k247K6943j1035K3960Q081N98l5577k7181k5251K9339O434J285l0358
22611A8825L2206M6695m3564k3477j1573M7185L4220k9457k5710n3850K179L2003
22599B5682N2407j5779k8444o9621n711O1064L8015M036j5716J7229P1331j9635
22587A14858n990K3618k1906n7303J7604l594k0501K7450p92k3319o129n0436
22575f440j1110O8962l6o5675k227J29297N0839n9663m7910j3789m9498m4950
22563e2200K7180j9783k7127L0162p59n0314M3907K9649j3906m2219l1399L9889
22551f6920O0727l1811p934p087L1465P610m9433L5702K0378n2688O680O3578
22539A0267N6463P229l8850R393k3179l1632l8031P676K1386r18k1043j1947P86
$$ y = [53834, 51587, 78530, 67495, 91455, 99536, 100134, 64557, 37376, 12125, 41464, 47898, 49183, 18825, 51031, 97726, 54162, 30685, 19112, 66297, 100517, 71060, 45350, -8500, -6321, 25682, 78089, 62310, 33866, -35755, -41466, 19598, 57613, 61649, 45933, 63162, 134493, 114858, 108868, 132486, 110580, 53277, 70881, 67287, 46786, 74236, 73444, 50125, 43996, -6440, -17550, 51412, 51376, -14299, -16526, 112771, 163610, 103947, 56037, 42248, -7250, -52200, -25020, -44803, -71930, -41768, -42527, -92841, -48934, -19285, -33191, -75410, -106809, -66920, -6193, -38004, -45938, -53025, -21560, -13950, -63383, -27681, -7303, -59991, -53311, 10267, 66730, 73959, 35109, 44502, 21323, -10309, -48340, -40664, -19278, -20196, -41239, -53186, -52400]
22526e2400R235M1299J596N249j1190j4662J3216l7485q0170J8479O9092p416
22514d5157O447m1230J193M026M4256M3261K0495l0585m6706o4170N3446N7031
22502B307L0040n543N948k0085m4025J35M707j1264J5745J6908o6647l0025J7418
22489h4381l4492O5444M9836l5724k3417L1282j3151J0583O9997M5005l8684j9659
22477B2639K1549m8747J3642O810l5370l8374N559J6280k6811J5932k816J1397
22465c8310O0327K8629m7050j4960m870K5557o458j5815l2796M9132J2660k0019
22453c973m2899j0249J4731j6572j8891K6098J0505J0923j214k1430K9053J8436
22441e482L4155l4260l7564j4087k3389j1918j219k7002j9018k1044J5046P5829
$$ y = [-52400, -43165, -1866, -270, 4979, -6211, -20873, -7657, -45142, -125312, -106833, -37741, -45157, -38710, -79940, -78747, -74721, -30465, 12796, 33291, 2706, -44000, -108170, -54724, 2307, 32347, 26804, 32752, 12667, -31358, -31223, -26516, -37780, -22035, -5127, -71774, -101799, -84381, -118873, -53429, -3593, -39317, -62734, -31452, -44603, -34020, 35977, 80982, 42298, 22639, 44188, -4559, 9083, 15893, -19477, -57851, -52292, -36012, -62823, -46891, -49707, -38310, 22017, 50646, 3596, -11364, -16234, 9323, 2865, -12950, -45746, 3386, 16046, -3973, -46872, -57121, -42390, -58962, -77853, -51755, -41250, -30327, -31541, -52971, -23918, -5482, 28673, -5587, -43151, -57238, -80627, -92545, -93764, -120766, -139784, -160828, -145782, -69953]
22429f9953J6200L4219m5180P4310M5085k9880n1478K4508O818M7503j1356p708
22417C3088m5923n4965j3936J5444N697M6769j694q814m4916l5068J9435j618
22405h6501J1516q753K5232M3814M140P425J6662J8894J2471M0833L2902p017
22393A11618R947k5675m5276k3187n305N294L9236k5680l4451l6791n8380P726
22381h0924P4604K0802j0265q259N092M0808L7426L6316m9475p1915m4072k9713
22369g9575n1243m020L420j4242L2244L4733j6132L0295j4611Q991J8386J7771
22357c3983q65j1723p4597O724K6286J8752J8682k4862p2953L9888N3571j614
22345e6694J616j5160Q0199N4210k2645n5495m3856K6971M5084K860r817K518
$$ y = [-69953, -53753, -19534, -64714, 9596, 54681, 24801, -26677, -2169, 4649, 52152, 40796, 33088, -12835, -67800, -81736, -66292, -60595, -13826, -15520, -24334, -69250, -104318, -84883, -86501, -74985, -83738, -58506, -14692, -10552, -3127, 13535, 32429, 44900, 85733, 118635, 111618, 121565, 95890, 50614, 27427, 22122, 27416, 66652, 40972, 6521, -30270, -88650, -80924, -6320, 14482, 4217, -4042, 1050, 41858, 79284, 115600, 66125, -5790, -49862, -79575, -130818, -134838, -131418, -145660, -113416, -78683, -94815, -64520, -79131, -70140, -51754, -33983, -34848, -46571, -121168, -114444, -88158, -69406, -50724, -75586, -148539, -108651, -55080, -56694, -55078, -70238, 9961, 64171, 41526, -13969, -57825, -30854, 14230, 17090, 7273, 9791]
22333I791r894m5412l3851K4528L6105M4080K2054K6508J9530j6780l2191K2217
22321F6685N9633n1983p334L3384l2693j9082R928J2917K8535R0154L5825J02560
22309C28529J82186K49359M43285N07530L21618K68980k3844l65731m60159m28913
22299A022840l53248k26703q0375l6893k1921j21643l5094J8809k9699n5608j9166
22288F1299P233Q803l6990l807K1217o9764m9549m4011m7757K4136M8766L9240
22276d1184J2835O787K8682Q1606o8775j6401m9737m3890J423P8336o688J4853
22264b153k8053m7642K168L7931j3256J5316K0287J8366j7809n9088p2677J06496
22252d0114Q0204j5545J1624q054J0314l1502j0599K0638Q641K0311n2252q448
$$ y = [9791, -103, -45515, -79366, -54838, -18733, 25347, 47401, 73909, 93439, 76659, 44468, 66685, 126318, 74335, 67001, 100385, 67692, 48610, 58538, 71455, 99990, 190144, 225969, 328529, 510715, 760074, 1203359, 1710889, 2032507, 2301487, 2277643, 1911912, 1451753, 1022840, 669592, 442889, 362514, 325621, 303700, 182057, 146963, 165772, 136073, 80465, 61299, 68532, 77335, 40345, 36538, 57755, -12009, -61558, -105569, -153326, -129190, -80424, -41184, -28349, -21562, 7120, 88726, 19951, 3550, -46187, -90077, -88654, -10318, -17006, -2153, -30206, -77848, -75680, -37749, -51005, -35689, -15402, 2964, -14845, -73933, -146610, -40114, 40090, 24545, 36169, 28115, 38429, 6927, -3672, 16966, 25607, 45918, -6334, -14782]
22240a4782N5113K5968k2747J9223k4486j4374Q734l0208n253M7612J5156J4833
22228G4789l9680o6162m5870J379K2210M4689J8677j8857K630J7591l6787l5859
22216f1250N5475K473l1096L8081O7931m7757j7180N2079M5475p921l3091q240
22204E4979k8527n3727j9987L9786O745O91N715j9444j4146M3351Q818o926K2434
22191C9762J93J2670L2545o708K9102o452q9241j7413j6631J1103Q99O2180J6967
22178F8976r4582o2005k7029k7383N3237N3795K3547j7394o7017J8940L6755j6951
22166e7111k962J0053J2831j3419K4634L5258o890k0263K8981o107j390M7062
22154E0677O9882K6650o9742O172k549L045o3365n6358L52L233J8159L2100L4587
$$ y = [-14782, 40331, 66299, 43552, 62775, 38289, 23915, 32649, 2441, -2812, 44800, 59956, 74789, 35109, -31053, -76923, -75544, -53334, -8645, 10032, -8825, -6195, 11396, -25391, -61250, -5775, -3302, -34398, 3683, 71614, 23857, 6677, 58756, 104231, 96310, 63219, 54979, 26452, -27275, -47262, -7476, -731, -40, 5675, -13769, -27915, 15436, 24254, 17328, 39762, 39955, 52625, 85170, 78462, 107564, 101112, 11871, -5542, -22173, -11070, -10171, 52009, 68976, -25606, -87611, -114640, -142023, -88786, -34991, -11444, -28838, -95855, -76915, -40160, -57111, -60073, -50020, -37189, -50608, -25974, 9284, 2394, -17869, 11112, 5005, 3615, 50677, 120559, 147209, 77467, 83639, 81090, 84135, 20770, -35588, -35236, -32003, -13844, 18256, 52843]
22141E2843L718k8706m2912O2250R2825J489L3426M4070m8935O1503L1888Q5326
22129C48785J33556J46419K45557K78566K30070K51688J18059m5184j70272k03912
22119A333332k39920k19198j71182j74153j01796j18040j25518P052o6616n4479
22109F9482o3255k714L5705L8228k1286k3801n868R104j7894J5497L6901q210
22097F1889J6427k0532l4197J9396l675j8418k2803m0112O6444K8677P072k0841
22085C9327L5724k4441m5682K6062j621m3801m124P6702Q698p0911o6513J8716
22073e1864L6945j1949J0793N2284l0917p3864N1189L8643L7933j7981j5481J0939
22061C6670q0090k5607J2192J526N1354J2776p67j2534K3815K9523j1447l8312
$$ y = [52843, 56561, 27855, -15057, 47193, 140018, 141507, 174933, 219003, 170068, 231571, 263459, 348785, 482341, 628760, 874317, 1152883, 1382953, 1634641, 1752700, 1707516, 1537244, 1333332, 1093412, 874214, 703032, 528879, 427083, 309043, 183525, 190577, 123961, 69482, 6227, 3513, 39218, 77446, 56160, 32359, 26491, 35595, 17701, 33198, 70099, 61889, 78316, 57784, 23587, 42983, 39308, 20890, -1913, -42025, 24419, 53096, 60168, 39327, 75051, 50610, 4928, 30990, 29369, -14432, -18556, 58146, 66844, -4067, -70580, -51864, -14919, -26868, -16075, 36209, 5292, -68572, -17383, 21260, 59193, 41212, 25731, 36670, -43420, -69027, -56835, -55309, -3955, 8821, 8054, -4480, 19335, 48858, 37411, -901]
22049i01n3217J6535O15L632q287l5085n1477l7261J8781O4877Q9697K063q2268
22036g2296o3712j2129L4276O7476k1356o5678p917N5577P5007j3538o720J0024
22024b0986k6860m684O9659M6693J2438J3926k5487o2272j0452o643k8510j1850
22012e5028M8531J1833m597j0204n4119o0449k9087p1780M733J5105M8685J08366
22000d8011N4430l1445o555O6707K255m6936J2197L3830j8558L1185J2755J6602
21988G8456J2192L453N597R531j7114J1073K2595k6807k9967n708N3103j0298
21976A06106r4777j3657n211m2558L1000J4505l2132R903N2584K7878J0808K936
21964F7385J145N534l563r07q828n3577l218P7187J4533J1877J5197k8523k9285
$$ y = [-901, -54118, -37583, -36968, -33336, -41623, -76708, -128185, -165446, -146665, -81788, 7909, 9972, -72296, -136008, -148137, -113861, -46385, -67741, -133419, -141336, -85759, -10752, -24290, -31010, -20986, -47846, -52530, 17129, 63822, 76260, 90186, 64699, 2427, -8025, -14668, -43178, -55028, -6497, 5336, 739, -9465, -63584, -124033, -153120, -224900, -220167, -205062, -156377, -48011, 6419, -25026, -31581, 35126, 37381, -9555, 2642, 36472, 17914, 49099, 61854, 78456, 90648, 94101, 99698, 109229, 92115, 103188, 125783, 98976, 69009, 63301, 116404, 106106, 11329, -2328, -7539, -50097, -19097, -4592, -36724, -26821, 25763, 53641, 64449, 67385, 68530, 74064, 70501, 69594, 60766, 7189, 3971, 81158, 95691, 107568, 122765, 94242, 64957]
21951F4957M602j2666R1648K5956r3707k1614j6360R2987R3284J25744Q7264J31855
21939E73950J99782K94671L50763N13853O53692O56476M37301J43843j71573m54096
21929C198662n66697o35534n00282m19785k41112j65414j38557p7243o4661r5039
21919B94338r6143o5842M1335J203k3244J1357n0659j8884K6827N2170k1313l4239
21907A16906L9694p892j4265k1412k1262O812l9164J0384n412o2079K6113J4516
21895D2939j8340L7497m7936k3168J4714m074K6760J5244R215l7275m7946K5372
21883f998k2322J8937K0955k0593L1422R03m9465j381j4641k9171P2965O5748
21871F6359K7368l6398m2060n5856K041M7154L3160l994J8909K2945o889o2466
$$ y = [64957, 69559, 56893, 148541, 174497, 80790, 59176, 42816, 135803, 229087, 354831, 442095, 573950, 773732, 1068403, 1419166, 1933019, 2586711, 3243187, 3680488, 3824331, 3652758, 3198662, 2631965, 1996431, 1496149, 1076364, 835252, 669838, 531281, 454038, 389377, 294338, 198195, 132353, 173688, 174891, 151647, 163004, 112345, 93461, 120288, 172458, 151145, 116906, 156600, 148708, 134443, 113031, 91769, 98581, 59417, 69801, 64389, 2310, 28423, 42939, 24599, 62096, 14160, -9008, 5706, 1632, 28392, 43636, 52851, 15576, -32370, -6998, -29320, -10383, 10572, -10021, 21401, 22304, -27161, -28542, -43183, -72354, 611, 66359, 93727, 57329, 15269, -40587, -38546, 8608, 41768, 37774, 56683, 79628, 72739, 10273]
21859A0273J6449k7573n7913k6416R869L0681L9064N9653J7295J4537O178n2402
21847C9695k3082J5374K098J334m771q896k3898j5841k6596l4055K3164l6149
21835i1623K4509j9553o2925J01612M4097m2779k606L968J5536O2138L6225m8212
21823B0387j7698K6440j0834r6558j7637N3179M7130l4394N026K7093L5390p016
21811C0508l745m1305l018m2958L3170M3350k1291l2860P363k7472M9633R4194
21799H5569O0249q724o0001o9550Q534l898L6593K7437M9166L1575o578J5390
21787A65762K4084K8415j5065q649M0184N7993p9643j31526l1833p667L118j6506
21775B8667j0132k2809J2994L8161R398J7880j9403l0173n5580n4080K2538r286
$$ y = [10273, 26722, -851, -58764, -85180, -75311, -44630, -5566, 54087, 71382, 85919, 92097, 39695, 16613, 31987, 34085, 35419, 30648, 21752, -2146, -17987, -44583, -78638, -55474, -91623, -67114, -86667, -149592, -47980, -3883, -46662, -49268, -45300, -29764, 32374, 68599, 20387, 2689, 29129, 18295, -78263, -95900, -42721, 4409, -29985, -24959, 2134, 37524, 30508, 26763, -14542, -17560, -60518, -27348, 16002, -5289, -38149, -30786, -58258, -8625, 85569, 145818, 137094, 77093, 7543, 16077, 12179, 48772, 76209, 125375, 156950, 150372, 165762, 189846, 218261, 203196, 194547, 234731, 292724, 213081, 81555, 49722, 42055, 45173, 28667, 18535, -4274, 8720, 46881, 56279, 74159, 54756, 24583, -30997, -85077, -62539, -71825]
21763g1825J4036o9549k5176N814R1722K5151L4451o441J6532K7171r583p964
21751B4339K6769N727p5228n5441j9144k7398J8836N8633K3712n4194j5016n440
21739i3845m7847M8304J00760J2298o5457p0550n884j7897k7654k8696K3238l7698
21727b10928n9047L3597L5502N5396O4997N0483M4240k1765L5085N2147m3642
21716C6065k4797M2021J10474j4425l2534j1461m6773j3073k9764M9309M9091
21705A14133n5979n7406N065K2268K0007J3958l594m2954p4276K3518O2514Q00
21693B8054o606Q9124N2138l6581l0649J630J5708l3314K327O7394L0721p109
21681A72837J1220n515R199p566O577N0788K0383n3191p6318j0484L9686j5884
$$ y = [-71825, -57789, -127338, -152514, -146700, -54978, -29827, 4624, -1817, 14715, 41886, 32303, 24339, 51108, 56835, -18393, -73834, -92978, -120376, -101540, -42907, -19195, -73389, -88405, -93845, -141692, -93388, 7372, 19670, -45787, -116337, -122221, -140118, -167772, -196468, -173230, -210928, -269975, -236378, -200876, -145480, -80483, -30000, 14240, -7525, 27560, 79707, 36065, 11268, 53289, 163763, 149338, 116804, 105343, 58570, 45497, 15733, 65042, 114133, 58154, 748, 5813, 28081, 48088, 62046, 58452, 15498, -58778, -35260, 27254, 28054, 21448, 110572, 162710, 126129, 95480, 97110, 112818, 79504, 81831, 149225, 179946, 172837, 184057, 178542, 187741, 180175, 186752, 237540, 257923, 204732, 128414, 117930, 157616, 141732]
21669A41732M3777r905K8946M4498O6877O2562Q72J721j9504l698n4839l3414
21657B69625p8504m0513L9296K3583m4472j0567M9896k3923l4978m293j4070N2462
21645A83542j4245q83P1061j7055l8899J1952p938l408K1453L8990L4230J357
21633B80157L7253K2417l6622n4097m17m735m8621l1390k7746P2557O2014O677
21621B77447L3343j3992l8342J5813j9925o6195J3438j5770k5461K2334O2253
21610B44943l3873j4467L9200P3170M9200K8023j0706L2514M1227L4573k0133
21599D63671o0141k4604O7820O0342l2900q55K4791L5784o63M285r41O4465J7018
21586F18072J4263N8035J3107K7492N3289M7820J36515Q5680P5101J68137J68328
$$ y = [141732, 185509, 175604, 204550, 249048, 315925, 378487, 379359, 381080, 361576, 357878, 303039, 269625, 191121, 150608, 189904, 213487, 169015, 158448, 208344, 184421, 149443, 145150, 131080, 183542, 169297, 168414, 239475, 222420, 183521, 195473, 187535, 184127, 205580, 244570, 278800, 280157, 317410, 339827, 303205, 249108, 248691, 243956, 195335, 163945, 136199, 208756, 270770, 277447, 310790, 296798, 258456, 274269, 254344, 188149, 201587, 185817, 160356, 182690, 244943, 211070, 196603, 235803, 308973, 358173, 386196, 375490, 408004, 449231, 483804, 463671, 403530, 378926, 446746, 507088, 474188, 473333, 498124, 533908, 533245, 537530, 536589, 601054, 618072, 632335, 690370, 703477, 730969, 784258, 832078, 968593, 1054273, 1129374, 1297511, 1465839]
21575A465839J52267J75624L17044L82992M29702M16300M89172N61811M68019
21566D858770L18939K46082J16845L5205n4088j33237j32036j03696j5870J41873
21556E278787J74483M03641M95547O08619O96191Q49822J062676J157773J283191
21547A2010730J744830K230136K764670L648388N036005P181369J0487598J5862503
21539F0966229K4163637L4603892M4288491N0750809M9183492L6907134J7153399
21532C18017083o694056k8254822m2694816m8089078m4896852l6953365k7812239
21525H2621855j9532164j3389275r339943o838115n199939m036229l211859k596562
21517A8477769k142339j813440j513665j296088j080767q11297p36339n99675
$$ y = [1465839, 1618106, 1793730, 2110774, 2493766, 2923468, 3339768, 3828940, 4390751, 4858770, 5177709, 5423791, 5540636, 5575841, 5521753, 5388516, 5256480, 5152784, 5136914, 5278787, 5453270, 5856911, 6352458, 6961077, 7657268, 8507090, 9569766, 10727539, 12010730, 13755560, 15985696, 18750366, 22398754, 27434759, 34616128, 45103726, 60966229, 85129866, 119733758, 164022249, 214773058, 263956550, 300863684, 318017083, 311323027, 283068205, 240373389, 192284311, 147387459, 110434094, 82621855, 63089691, 49700416, 40360473, 33522358, 28322419, 24286190, 21074331, 18477769, 16335430, 14521990, 13008325, 11712237, 10631470, 9820173, 9083834, 8484159]
21509H484159m38973l43337k22880j12817m5024k4782J1242O6272J8416j8952
21499G373324j46114k96771m19578m97121n58083o24782n37762m85216m29612
21490C378285k87988k21887k05240j38387j65925p3404M272r2141j63234j60136
21480A874215j01661n7915r7357j10434j05166m5494k8185j25029p3852n5875
21470A073247l9918j02157m0981n3225k9666m1986q9634m1599j4557l438K1123
21459F37209n1027j04175l2577J6667l7088l3602M8299o700k0643M0313p719l3722
21447D15235q436j1388r227q43j4489m5086q43j5653p172N781J6174k6920p1588
21434B25545j6989m563M6785K6203k6287k8795l2652j7176M2581O6443L0397j849
$$ y = [8484159, 8045186, 7701849, 7478969, 7366152, 7321128, 7296346, 7307588, 7373860, 7392276, 7373324, 7227210, 6930439, 6510861, 6013740, 5455657, 4830875, 4293113, 3807897, 3378285, 3090297, 2868410, 2663170, 2524783, 2358858, 2285454, 2289726, 2197585, 2034351, 1874215, 1772554, 1714639, 1617282, 1506848, 1401682, 1356188, 1328003, 1202974, 1129122, 1073247, 1033329, 931172, 890191, 836966, 807300, 765314, 675680, 634081, 619524, 616086, 637209, 586182, 482007, 449430, 466097, 429009, 395407, 443706, 437006, 416363, 456676, 448957, 415235, 406799, 395411, 386184, 385341, 370852, 325766, 324923, 309270, 302098, 307879, 324053, 297133, 225545, 208556, 203993, 250778, 276981, 250694, 221899, 189247, 172071, 214652, 281095, 311492, 309643]
21422C09643l7261m4549k2369n1800J71k5627n5215M5484L1708k6083M1299L1769
21410A97170k7439j3970l8636p335l6258q102k6691l1136l8212K3062O6381k963
21398E5871L5673L4528N4405j5594p2293o8053k9832p950L826L2310K9652k4542
21386B8001M4837M5160M2868l0204m6766j6650L0314j2118n9065l1794j4865Q394
21374a1888L484K3349r514k211j4467L2002K3907J7117N219m2091R885M9307l4245
21361D9854r468n1767k060K0247K4304m0137m8562J7659k1113m1431L9506K3308
21349c9660n6440J9665J00296M1609N6462R5893R3070p173j3490l1342k5174l9383
21337A94333j2751K5344K5490j9919J296L3300K9957r084n2926m0060j9856p732
$$ y = [309643, 272382, 227833, 205464, 153664, 153835, 128208, 72993, 118477, 150185, 124102, 165401, 197170, 169731, 155761, 117125, 109790, 73532, 65430, 38739, 7603, -30609, -7547, 58834, 55871, 91544, 126072, 180477, 164883, 92590, 24537, -5295, -13245, -9419, 22891, 52543, 28001, 72838, 117998, 160866, 130662, 83896, 67246, 97560, 85442, 26377, -5417, -20282, -11888, -8404, 14945, 5431, 3220, -11247, 20755, 44662, 61779, 66998, 24907, 34792, 84099, 49854, 40386, -11381, -13441, 6806, 31110, -9027, -57589, -39930, -61043, -102474, -62968, -39660, -96100, -76435, 23861, 65470, 121932, 217825, 310895, 303722, 290232, 258890, 233716, 194333, 181582, 206926, 232416, 212497, 213793, 247093, 277050, 267966, 215040, 174980, 155124, 147392]
21325A47392r140o1014O613K7183k3139j8866J5296J394Q055K7259k9573K2280
21313A13740l8983j1842R845N0968M1803k927m1259J534R369K434J0423J7812
21301A62917l0229n6548p7609Q559o334R587j385m212L1737n905j8607L7561N0130
21288I9662j8602M109k081k4693m963J5095j941q503l373N263K6689j7858J8170
21275H6974l1289N1650P5678O286k9185p8532m0445K7081L2461l5190j3854M750
21263E6385P765J3322J6841q547k170O902K7687N6283m5831J8924J1211m6608
21251A12164r594k4199K3364K1444j7038l4545p115M2859n0626j05997NO8734
21239A9456M1375n2763L4557M9350k048j8608p6377o2737J4366K6756M8734J7063
$$ y = [147392, 138252, 77238, 83851, 111034, 87895, 69029, 84325, 85719, 93774, 121033, 91460, 113740, 74757, 62915, 72760, 123728, 165531, 162604, 121345, 122879, 132248, 134682, 145105, 162917, 132688, 76140, -1469, 7090, 756, 10343, 8958, 4746, 36483, 30578, 11971, 49532, 99662, 81060, 85169, 83088, 58395, 53432, 68527, 66586, 58083, 54710, 59973, 86662, 68804, 86974, 55685, 107335, 183013, 189299, 160114, 81582, 41137, 68218, 100679, 65489, 51635, 56385, 64150, 77472, 94313, 85766, 83596, 90498, 118185, 174468, 128637, 147561, 158772, 112164, 102570, 78371, 101735, 123179, 106141, 71596, 64481, 107340, 56714, -49283, -49278, 19456, 60831, 8068, 42625, 91975, 89927, 71319, -5058, -67795, -53429, -26673, 22061, 39124]
21227C9124o683j2526O199n929L9996J7814l4396N158R379K442K293m0571j9915
21214B385m6754l4439r486K1550J7813L1820K1678p2478m8588N516O9343J453
21202d0187k7003J3058P8106O0075n124p3276k3485k3138L3816O3427K0942j5300
21190F1911m5364M227j6223n627k1158o1833l155J216j0062O2604M7834J0709
21178B5079j4223J9214N990n2099q6509J5159O454j8948L6433J5823m5727l8874
21166a32228m981k3464O845M1999P3359L5185O3092j1250L2667n8332J557L2588
21154E7037m5598k8048K1830n1911l9172n905L9200J96k5868M3103O9777p956
21142B6685K9942K0447r064j1960j9515k229N961J3784k1011k1496j02171l21
$$ y = [39124, 32441, 19915, 26114, 20185, 60181, 77995, 43599, 48757, 58136, 60578, 62871, 22300, 2385, -44369, -78808, -88294, -66744, -48931, -17111, 4567, -67911, -116499, -110983, -41640, -40187, -67190, -54132, 23974, 84049, 78925, 5649, -17836, -40974, -7158, 56269, 77211, 61911, 16547, 20774, 4551, -1076, -22234, -84067, -87222, -86006, -96068, -33464, 14370, 25079, 10856, 30070, 36060, -16039, -102548, -87389, -80935, -99883, -63450, -47627, -93354, -132228, -137209, -160673, -153828, -111829, -38470, -3285, 59807, 48557, 81224, 22892, 24449, 57037, 11439, -16609, 5221, -46690, -85862, -91767, -52567, -52371, -78239, -35136, 34641, 26685, 56627, 77074, 68010, 56050, 36535, 34306, 40267, 54051, 33040, 11544, -90627, -90948]
21130i0948O6021J6251m9150J4974N326Q440L2440o014K1401o5550j2130J04664
21118D5725K8147m6545p0177J3302L4588L874r5446p722O4692Q641j017Q5865
21106F3927M4755M5508m3219n2617k5272K2023N6965O5522j9593l4204k5510l1825
21094F6460n1744l7571J9267M2257l2789l7441j6132m7217O3846P1871K6342j0802
21082E6347Q198J1581L34l3790m8944k8798l5185o664K4200P6928N4159p35r787
21069F7844k4117J9077j3268m1589M9639Q0181q862l7565n5116l0773K2769r359
21057A8861k4998j1030L9285P846l733l4309k3376n7839m8024K8100K9553k138
21045h1802M8917M8206K698j1780J0881M4762k4992l8340Q32k0483o1160r806
$$ y = [-90948, -24927, -8676, -57826, -42852, -37526, -29086, 3354, -2660, 18741, -46809, -58939, 45725, 73872, 27327, -42850, -29548, 5040, 8914, -86532, -94254, -29562, -20921, -21938, 63927, 108682, 154190, 110971, 58354, 33082, 55105, 112070, 177592, 157999, 123795, 98285, 66460, 14716, -22855, -3588, 38669, 5880, -31561, -47693, -94910, -31064, 40807, 67149, 56347, 64545, 76126, 76460, 42670, -6274, -35072, -70257, -76921, -52721, 24207, 78366, 77631, 67844, 43727, 62804, 49536, 7947, 57586, 137767, 128905, 91340, 36224, 5451, 28220, 18861, -6137, -17167, 22118, 29964, 26231, -8078, -31454, -89293, -137317, -109217, -79664, -81802, -32885, 15321, 18019, 6239, 17120, 61882, 36890, -1450, -618, -21101, -82261, -92067]
21033i2067M7309J9957m196l799L1902P0027l014m0325k5039J0482o21r216l7253
21020c5853J8342K7484K0117k2232R658L1058K2786l1043k0910N4146j1978r736
21008E1839L455K154m1851o1845J8942P1255J7176j9536j7095m2914m3113j9201
20996h0734J8656k6393J6651R3567J41n2911l3159N015J5684L8949Q153j3953
20984a0334M2051M2338k3365J7137j5669J1009K5991j1578k1449j7930m2941j2033
20972a6773j0420M0332N6404K2104j6491J859Q4874P805j06314l2351N3059k6171
20960E7917J8132r410j7628J1434N1291J2100o6846m4124m9346q114O97J8834
20948b5063M4163O8534K6969M0515O2558R4665R4987J90889K75312K57973J94988
$$ y = [-92067, -44758, -24801, -28997, -32796, -894, 69133, 66119, 25794, 755, 11237, 10616, 1400, -35853, -17511, 9973, 30090, 7858, 17516, 48574, 71360, 40317, 19407, 73553, 61575, 51839, 55294, 57448, 15597, -46248, -27306, 43949, 61125, 41589, 24494, -18420, -61533, -80734, -62078, -88471, -71820, 21747, 21888, -31023, -64182, -59167, -43483, -4534, 3619, -10334, 31717, 74055, 50690, 67827, 52158, 63167, 89158, 77580, 56131, 38201, -4740, -16773, -27193, 13139, 69543, 91647, 75156, 77015, 161889, 169694, 63380, 31029, 84088, 57917, 76049, 66639, 49011, 60445, 111736, 123836, 56990, 12866, -36480, -44594, -43897, -25063, 19100, 87634, 114603, 155118, 217676, 312341, 407328, 598217, 873529, 1131502, 1326490]
20937A326490K08576J80211m2242j42425j49272j96180k80909k40576j55824j41856
20927C65993r7915p0645m4558j0874j4627K7610l7826o8383J0726K9907l0455
20916E8953j0584q822M2259M0715p0619o4749n040M879K5600L7048l9333l0832
20904b0525J3846N1408P589r5707q509J6529l2861N772L5685M526N837o045R682
20891a2773K0301L6701m0355l1204O2809o775m3444K9128K1092O632l5682K2466
20879B8896P0270L4692k2243q759n4216m8198L532K1858N1118J7994o478M776
20867I3242K974l7693l505K5794J1253p2394n2770M0907K0208j9668k5381k2100
20855c9133k3072j3048M9095L9245J2404l1215l1500j9482J5289L4643L5782m0579
$$ y = [1326490, 1535066, 1715277, 1673035, 1530610, 1381338, 1185158, 904249, 663673, 507849, 365993, 268078, 197433, 152875, 142001, 127374, 154984, 117158, 48775, 59501, 89408, 58953, 48369, 39547, 81806, 122521, 51902, -12847, -17887, -13008, 12592, 49640, 10307, -20525, -6679, 44729, 52318, -43389, -51898, -35369, -68230, -62458, -26773, -22247, -16410, -22455, -12773, 7528, 44229, 3874, -27330, 35479, 28704, -14740, 14388, 35480, 42112, 6430, 28896, 99166, 133858, 111615, 102856, 48640, 442, 3974, 25832, 76950, 94944, 88466, 93242, 96216, 58523, 55018, 80812, 92065, 19671, -33099, 7808, 28016, 8348, -17033, -39133, -62205, -75253, -26158, 13087, 25491, -5724, -37224, -56706, -41417, -6774, 29008, -11571]
20843a1571m3590p6687L5713O5573l522M3965j8719l7765j9313J2037M1436k218
20831a4661J4270Q0544J8587l2595l1043j2884j8771l9443R176j429p4876R208
20819i3917K926m1140k9682N7339O0692K2537M0312n902j27570k5658Q946j592
20807a32709K5190L7400L7710k1084L7141L3836m202n2528j8879l2422J5271L1895
20795d3381N0430m3103N636L1558k0530J2141m6326k3651j1459m019K6784O2474
20783c446k8373K7807o513N338J9900O1432j2888m348m5420m6632K4615m7182
20771e5710n3174N4250L1766J5857k5426m3766j4184j3232O034M5953K1104K2488
20759h040L0582j7651n470l5973r364L7468J5966n0184n2899m2434M963O0125
$$ y = [-11571, -55161, -131848, -96135, -30562, -34084, 9881, -8838, -46603, -65916, -53879, -12443, -14661, -391, 80153, 98740, 66145, 35102, 22218, 3447, -35996, -26820, -28249, -103125, -93917, -90991, -132131, -161813, -104474, -43782, -21245, 19067, 13165, -114405, -140063, -131117, -132709, -107519, -70119, -32409, -53493, -16352, 17484, 13282, -39246, -58125, -90547, -75276, -43381, 7049, -36054, -30418, 1140, -19390, -7249, -53575, -77226, -88685, -92704, -65920, -3446, -31819, -4012, -10525, -5187, 14713, 76145, 63257, 58909, 13489, -33143, -8528, -55710, -108884, -54634, -22868, -7011, -32437, -76203, -90387, -103619, -97585, -51632, -30528, -8040, 22542, 4891, -579, -36552, -45916, -8448, 7518, -42666, -95565, -137999, -133036, -72911]
20747g2911j0979L2162l9523K136J5112N8480L8207L6554r706p025n912q877Q74
20734B8592k0862o558m2368l1724N9858Q7955q705k6261k3956L9606J7798m9138
20722B4237k2557m1268m9719k8471K8266K6781L0089M0715L3660k1791n3272M0160
20710F830R791j0632J4925J7180j2714k2529L1849p997J540q400K31l3323J5271
20697B022Q5178K7651j472m5566q5345j5587k4344n1988m6016Q3016J07054N3595
20685H8198M9232j6912l5890k9103J2435m4888k5880r612k6035R738j8897j6543
20673f4157M4095N1860k9930q077m0351o0689j2033J249N688M7476O1946N313
20661B390K332J1818L4441m0001l7656K324L1183k9578m924p008L665P607M4312
$$ y = [-72911, -83890, -51728, -91251, -89115, -74003, -15523, 22684, 59238, 49532, 42507, 36595, 27718, 28592, 7730, 1172, -41196, -72920, -13062, 74893, 66188, 39927, 15971, 55577, 73375, 24237, 1680, -39588, -89307, -117778, -89512, -62731, -32642, 8073, 41733, 19942, -33330, 6830, 16621, 5989, 20914, 38094, 25380, 2851, 34700, 26703, 28243, 19843, 20074, -13249, 2022, 87200, 114851, 113379, 67813, -17532, -33119, -57463, -109451, -155467, -72451, 34603, 88198, 137430, 120518, 84628, 55525, 67960, 23072, -2808, -12420, -38455, -28717, -47614, -64157, -20062, 31798, 1868, -6209, -46560, -107249, -119282, -118033, -112345, -64869, -2923, 2390, 4722, 16540, 50981, 10980, -26676, -24352, 6831, -22747, -27671, -34679, -31014, -23407, 20905]
20648B0905N5481L376p4129m2845K5090P9593j67l9919o386N6030K012l8886N949
20635D6104p7608n1090J1198L302q2778R783N408l783K3516L5976R683k1210j0550
20622a02049J6306L0748K7300k37m8708j2649O28n8690k3842M1433J3461l0101
20610a46400K1914K6583L9981L5051k6843k0812p141N412p838j5103k4097o28
20598a19921M1887K2586K4789R631o2878n411R568K7235j0037K0673Q318K4830
20586h730n451l0083J8180N1890j7127j7722l2326q6957J2623M4349n055J1542
20574f4867r94j7957J7268N5319L1494J3393q284Q131l1280k7513K7244J2376
20562A4330k2968l4689m0095k0451J2251M6278K9779j1940K3155K8177p9484k2808
$$ y = [20905, 76386, 79762, 5633, -37212, -12122, 67471, 67304, 27385, 20999, 77029, 79041, 40155, 46104, -31504, -82594, -71396, -68094, -150872, -141089, -135681, -139464, -115948, -79972, -70289, -91499, -102049, -85743, -54995, -27695, -27932, -76640, -89289, -88661, -147351, -171193, -129760, -116299, -146400, -124486, -97903, -57922, -22871, -49714, -70526, -77667, -72255, -80093, -95196, -119293, -119921, -78034, -55448, -30659, -21028, -83906, -89317, -79749, -52514, -62551, -41878, -33560, -8730, -14181, -44264, -26084, 25806, 8679, -9043, -41369, -128326, -115703, -71354, -76409, -64867, -65861, -83818, -66550, -11231, 20263, 33656, 25372, 33503, 2223, -25290, 1954, 14330, -8638, -43327, -83422, -103873, -91622, -45344, -15565, -27505, -4350, 23827, -55657, -78465]
20550g8465O9667L8613m7024K0721n378o2910r6573K9102R8891O7389m174k0308
20538I551L9020M444m5793k1925M890N8949J625q8339n9112L3334P4241R113n50
20525A9448n9890l4268j2510k2247L169J8792l6860L6020M8041K9369l4783L0725
20513a4994M1825J1280j7042p4868k6232J4084P4432o248m8539j4540k974m706
20501f8522K4696k0482K0808K8567o2958m652N066L7203J9810l8191K9562k0962
20489e0055j7158n526J9214R839M3487k6050n4683Q672k3330J7288q352k4858
20477a11512K3738L1418J3627r985Q9k3829j528N6691J9168k8963j2096K141J5113
20464b5928j0938r04J2770j8990j7458K9879k507o5564l8679L4795L2549J5400
$$ y = [-78465, -8798, 29815, -17209, 3512, -1866, -64776, -161349, -132247, -33356, 34033, 29859, 9551, 48571, 53015, 7222, -14703, -9813, 49136, 50761, -37578, -96690, -63356, 10885, 19998, 19448, -40442, -74710, -87220, -109467, -106298, -87506, -124366, -88346, -40305, -10936, -45719, -14994, 26831, 38111, 21069, -53799, -80031, -65947, 8485, 2237, -46302, -60842, -63816, -68522, -43826, -64308, -43500, -14933, -77891, -82543, -77477, -40274, -20464, -58655, -29093, -50055, -67213, -72739, -53525, -43686, -199, -26249, -80932, -72260, -95590, -78302, -86654, -111512, -87774, -56356, -42729, -52714, -52625, -76454, -77982, -21291, -2123, -31086, -43182, -41041, -25928, -36866, -37770, -25000, -43990, -61448, -31569, -34076, -99640, -138319, -103524, -70975, -55575]
20452e5575M9341J40J5405j8335o8133n2499J2686K8387K6727P7308N7314k9005
20440D3761o402m16n7530m984J1265k0135j5097K1322J3172K0410J5312j0685
20428I993j9550k0940K5948k8862r089j632Jq527K5633K4645n273j3708O750J01556
20414H6945Q27l5542l4956k9710m1728r550K3240L5253L7190j7916o1615J9599
20402b7963N8470K3719m418N189M5819n3484K7174p842k9049m3157k7741m8473
20390h1756l6759M1043K3367P57J558M5744M7385J0701r5230m7432l5536j6897
20378a43055R3672L1850o6171k4533M0739Q412n322J5363K2480j4994M0095L3758
20366C2294o5038q4184p53P0466L572j0372k0817K5332P2820j2029j24215p4498
$$ y = [-55575, -6234, -6094, 9311, -9024, -77157, -129656, -116970, -88583, -61856, 15452, 72766, 43761, 37359, 36943, -20587, -25571, -14306, -34441, -49538, -28216, -15044, 5366, 20678, 9993, -9557, -30497, -4549, -33411, -42500, -44132, -44131, -52658, -27025, -2380, -7653, -21361, -14611, 86945, 87772, 52230, 17274, -12436, -54164, -63714, -40474, -5221, 31969, 14053, -47562, -27963, 30507, 54226, 49808, 54997, 100816, 47332, 74506, 66664, 37615, -5542, -33283, -81756, -118515, -77472, -54105, -53348, -51790, -6046, 41339, 52040, -43190, -90622, -126158, -143055, -49383, -17533, -83704, -108237, -67498, -59086, -64408, -49045, -26565, -41559, -1464, 32294, -32744, -116928, -117681, -47215, -43643, -54015, -74832, -49500, 23320, 11291, -112924, -187422]
20354a87422l757R4669P6051K1412q4579k9357O5280O1453L4375j730L0584m3946
20342C3033J5261j322r417k4515m054L2943K6144J1493k9571j4971n9952o1013
20330h5941k4018K0270l653Q1127P2789l7239K2861k427j1706j0330l6764p512
20318b2543P477o912K0256K2993j6080K4609N137j2029k5936n4579K6632M1283
20306A0308L7815M5287m7235n1552J715M3170j518m4794J79n1138k1513K3556
20294e5720M8054j1353r077M444q301K0334j2643l9727k2866l693J3564K7987
20282d8997K3430L1007L528J589K0866j4708j5029K7765l761q249r058j9026n3675
20269f4318K3175J5222l8566j5193J7469J9208M1325R691J8570q541O541j4334
$$ y = [-187422, -191179, -96510, -20459, 953, -83626, -112983, -47703, 13750, 48125, 46395, 76979, 33033, 48294, 46972, 37555, 13040, 8986, 41929, 68073, 79566, 49995, 35024, -24928, -85941, -109959, -89689, -93342, -12215, 60574, 23335, 46196, 43769, 32063, 21733, -15031, -22543, -15066, -21978, -1722, 21271, 5191, 29800, 34937, 22908, -3028, -57607, -30975, 10308, 48123, 93410, 46175, -5377, -3662, 39508, 37990, -6804, -6625, -57763, -79276, -55720, -7666, -19019, -28096, -23652, -31953, -11619, -24262, -63989, -86855, -90548, -76984, -48997, -25567, 5440, 8968, 10557, 31423, 16715, 1686, 29451, 25690, 17441, 8383, -10643, -64318, -41143, -25921, -64487, -79680, -62211, -43003, -1678, 8013, 26583, 18042, 24583, 10249]
20257A0249M390j219l5668m3453J1760L9073q668o2967J4049N8318K3312l3187
20245b4011k3011m908K4317K0752l3211J3827k7337K0289J02219j8548m871L0864
20233G6371K1001K1966O3829P2316J12371N0059L4236M7762q1123q0329O561L0882
20221C75902k8779M8690J514k3056j8113m7353l2075M4431k1752j2513J286p7476
20209B10706p6452k4943m9075m2386J0700m7290N327m0862K3448M3865L9600n1497
20197A141k2896O2737K0251L453k8890r643O529j9059N690k8671M6702M0798L5150
20184A13292m506k1113P824l44N9250P1768J18141R1992J15947M7655K8146L8137
20172F66189o2887r6047p0389n228L6982Q1854N1525n0758K2455M8663N4052j1001
$$ y = [10249, 14639, 13420, -22248, -65701, -53941, -14868, -23536, -86503, -72454, -14136, 9176, -24011, -47022, -51930, -27613, -6861, -40072, -26245, -53582, -33293, 68926, 50378, 45507, 76371, 97372, 119338, 183167, 255483, 367854, 417913, 452149, 499911, 418788, 338459, 345020, 375902, 347123, 395813, 397327, 374271, 356158, 308805, 276730, 321161, 299409, 286896, 288182, 210706, 134254, 109311, 60236, 17850, 28550, -18740, -13413, -54275, -30827, 13038, 52638, 1141, -21755, 40982, 61233, 64686, 35796, 26153, 32682, 13623, 19313, -9358, 37344, 78142, 113292, 108786, 87673, 95497, 95153, 154403, 226171, 344312, 436304, 552251, 599906, 628052, 666189, 603302, 507255, 436866, 431638, 468620, 550474, 601999, 551241, 573696, 622359, 676411, 665410]
20160F65410o8464J1428J4534l3094p1803k2495l3010q3225j13143p1605j8642
20149A75891m8470L503O0708O9560J7189J1414l188K4949k2828M1495k3489r3065
20137B13669n1678o208K7421L7167o1236p9075l8696l5319l2063N979L8036O0368
20125G8365k002j4906O9589K1513K6850M1512j9059k4684K0198J1584n6913m290
20113A47757o2479J007N472o301J3358Q2957Q1153N9729K822r474J0351k473J2340
20100C36219J5050J6814O0774N5126J0173k3361K5304k9434j12328q1765j2820
20089B59752Q113p5064n8223j9837n8759j4523n287J183K7205o770l4644J5675
20077C8821p476p9826J2546P6288Q8785j6550o2493r6218k3228M6164M2968N6447
$$ y = [665410, 596946, 608374, 622908, 589814, 518011, 495516, 462506, 379281, 266138, 194533, 175891, 127421, 130924, 191632, 261192, 278381, 289795, 286607, 311556, 288728, 330223, 306734, 213669, 161991, 155783, 183204, 220371, 159135, 80060, 41364, 6045, -26018, -20039, 17997, 78365, 76363, 61457, 131046, 152559, 179409, 220921, 201862, 177178, 197376, 208960, 152047, 147757, 85278, 86285, 91757, 85456, 98814, 181771, 262924, 322653, 325475, 316001, 326352, 323879, 336219, 351269, 368083, 428857, 483983, 494156, 470795, 496099, 466665, 354337, 272572, 259752, 267865, 192801, 134578, 114741, 55982, 41459, 36172, 37355, 64560, 57790, 23146, 38821, 31345, -48481, -35935, 40353, 129138, 112588, 50095, -46123, -69351, -23187, 19781, 76228]
20065G6228j9255j9964J7876L0428L809o6859n9785k8135J8669J5621L2489L3888
20053C5010j7892K0623K5492N240K3480L6258j5339n5840N054L1286l685k3953
20041F5734l560n5803J2964J1190m2536m586K0510P46L6833j9557m9945l0927
20029e8937j7552j5444o131q56L6380L901O4367K8478m876k7589k8402k9127O346
20016d9442J8582l5664J7664R1388p045n3672K6335P432j3087O6342m0683j2544
20004A5606p0396M0394N663k0172j5364k4853J7872O1477L7538n1547n4228J0621
19992d7389L2444k2551k3889N0783l767j452O276K5921k1681L737N6626K9436
19980H4494m1880o0495o3717k1981j6480M7741L8278L0916L0358K9523p1572k9725
$$ y = [76228, 56973, 37009, 54885, 85313, 89122, 22263, -37522, -65657, -46988, -31367, 1122, 35010, 17118, 37741, 63233, 68473, 91953, 128211, 112872, 57032, 62086, 93372, 89687, 65734, 62174, 6371, 19335, 30525, -12011, -16597, 3913, 4659, 41492, 21935, -28010, -58937, -76489, -91933, -98064, -98920, -62540, -58639, 5728, 34206, 29330, 1741, -26661, -55788, -49442, -30860, -66524, -48860, 42528, 35483, -18189, 8146, 15578, 2491, 68833, 28150, 15606, -54790, -14396, -8733, -28905, -44269, -69122, -51250, 10227, 47765, -3782, -58010, -47389, -14945, -37496, -61385, -10602, -14369, -15821, -9545, 16376, -5305, -1568, 55058, 84494, 42614, -17881, -81598, -103579, -120059, -72318, -34040, -3124, 27234, 56757, -14815, -44540]
19968d4540L0551l9230k0522R049K7899l6693Q562J7335P3617J8390m5664p7558
19956g8804j0263N1002K6186K2758j627l3906M3289p280L9110K5653J0363K6070
19944A12551r201p0410L1351O3262k7867Q31n0835k6053M828R546j1486J3078
19932C9595J8805M394O7447K9275n4607j8953k6037l5294j4676j0718k495l0598
19920c3862j0731O2811P0284l4078M405K4543l7767o1421M9202O2218R548o6942
19908C8210n3542J8313j2281l1743K2159r206M6003J6420j2332K3042o353L3463
19896G2153n9167J2398N8314K9761J5423m3317p8929k4574r081K8267l8718K6034
19884a1436J9047J2202J98L1688J5630l8759l2715k6736J526N8301J7188o6393
$$ y = [-44540, -13989, -53219, -73741, -64692, -36793, -73486, -64924, -47589, 26028, 44418, -1246, -78804, -89067, -38065, -11879, 10879, 9252, -24654, 18635, 11355, 50465, 76118, 86481, 112551, 103350, 32940, 64291, 127553, 99686, 100517, 49682, 23629, 28457, 38003, 26517, 39595, 58400, 62794, 130241, 159516, 104909, 85956, 59919, 24625, 9949, -769, -3264, -33862, -44593, 18218, 88502, 54424, 58829, 83372, 45605, -15816, 33386, 95604, 105152, 38210, -15332, 2981, -9300, -41043, -18884, -28090, 17913, 34333, 22001, 45043, 38690, 72153, 12986, 25384, 83698, 113459, 128882, 85565, 6636, -17938, -27019, 1248, -37470, -11436, 7611, 19813, 20011, 51699, 67329, 28570, -4145, -30881, -29355, 28946, 46134, -20259]
19872b0259O261o828N98N1135m803l9509l6581L0877J3288p827N1871J455L8819
19859G8497J3955p1111o9193J4465K0021m2602m5136N0993J4909m4716R306O1292
19847i320M4800N5729K4826j3588l8720K6089Q619k4727l4818m3747L88l315M1609
19834C3825L9759N8428j9286o4054K1103O0089J6468K8188M2784j7449m3771m0463
19822A15621l0485M3383K3698J0195R415j8824k426k7123m8738K9312N1286J5750
19810A71064J3787p0411j7544Q722J9961k184J7992j3681K5967K31j7226j4718
19798A21960k8303j4619L2521M3107j933o273l4838k6927M6098P7377J5917K3535
19786B47622M8494N3390j26q8741Q3286L9166K0248N9685J06205k4440m8331m8851
$$ y = [-20259, -13998, -20826, -20228, 30907, 26104, -13405, -49986, -19109, -5821, -13648, 38223, 39678, 78497, 92452, 21341, -47852, -33387, -13366, -55968, -101104, -50111, -35202, -79918, -70612, -9320, 35480, 91209, 116035, 102447, 63727, 89816, 98435, 73708, 38890, -4857, -4469, -7784, 33825, 73584, 132012, 112726, 48672, 69775, 129864, 146332, 174520, 217304, 199855, 156084, 115621, 85136, 128519, 152217, 162412, 171827, 153003, 150577, 123454, 74716, 104028, 155314, 171064, 184851, 114440, 96896, 105618, 125579, 123395, 141387, 127706, 153673, 153904, 136678, 121960, 93657, 79038, 111559, 154666, 152733, 146460, 111622, 84695, 130793, 208170, 224087, 247622, 296116, 349506, 349380, 260639, 343925, 383091, 403339, 463024, 569229, 544789, 496458, 447607]
19774D47607o7087j7410k8252k8150m6110j7545r622K256N4665Q7166J500j0418
19762C68600N4264N1600K3334l612L0596m7032n701L7783O8121N8550L7446n308
19750F68641L7544L425K185K6876O6710L1209L1146J51520J84274L77969O70653
19739B252152P87315O19889M36634j2002m18056m95953m13864l37923j94079K1905
19729B246018J41081J67888K07165K59930J84534J56776J86777K55276K48275
19720D053720L08268N42382O96487R42183J399001J876971K728302M481778P584838
19711B4613930J2341565J4669024R824333N471736O780240O214645j455834p933276
19703G0526363q700651q755186o828338m72486P148811Q580738J444565m579536
$$ y = [447607, 380520, 363110, 334858, 306708, 260598, 243053, 233431, 235687, 290352, 377518, 379018, 368600, 422864, 474464, 497798, 494186, 524782, 477750, 472049, 509832, 577953, 636503, 673949, 668641, 706185, 709610, 711795, 738671, 805381, 836590, 867736, 1019256, 1203530, 1581499, 2252152, 3039467, 3659356, 4095990, 4083988, 3665932, 3169979, 2756115, 2418192, 2224113, 2246018, 2387099, 2554987, 2762152, 3022082, 3206616, 3363392, 3550169, 3805445, 4053720, 4361988, 4904370, 5600857, 6543040, 7942041, 9819012, 12547314, 17029092, 24613930, 36955495, 51624519, 61448852, 66920588, 73700828, 79915473, 78459639, 70526363, 61825712, 53070526, 46242188, 45769702, 52918513, 61499251, 62943816, 58364280]
19695E8364280o689885p966271o368124j438556M815055R650838P470053q4581
19687E7752809n950668q431172r747298q595053n764173l413848k066782j428486
19679A2355329r33482m79271j58269J65775L89797M03074R6666J3609K2433J58952
19669A2034613N60277J055705J423053K010031K752157L998932O211554J0493027
19661D0539349J8346928K7989757K5274308N454530q386922j4466637j9350241
19654G5401072j7743585j1057405n223472q21790L477979R035498J5560279J6972895
19646H5601471J0955038R332247J4311567J4547832M057709l332014n368772j0038311
19638A20066767j2309290j0992326j0122491j2215748j1779328r514712p238429
$$ y = [58364280, 51674395, 43708124, 37340000, 35901444, 40716499, 50367337, 57837390, 57752809, 51802141, 43370969, 33623671, 25028618, 19264445, 15850597, 13783815, 12355329, 11421847, 10942576, 10784307, 10950082, 11339879, 11742953, 11839619, 11853228, 11875661, 12034613, 12594890, 13650595, 15073648, 17083679, 19835836, 23834768, 30046322, 40539349, 58886277, 86876034, 112150342, 117604872, 109217950, 94751313, 75401072, 57657487, 46600082, 41376610, 40554820, 44032799, 53068297, 68628576, 85601471, 96556509, 105888756, 120200323, 134748155, 138805864, 135473850, 130105078, 120066767, 107757477, 96765151, 86642660, 74426912, 62647584, 53132872, 45894443]
19631D5894443l885846N54786N838848J2882743J7701979J4841886Q046890l751676
19623I8124053j3251153j6134329j6101566j3530412r039316n608879l542153
19616B0916245k289166j464289q07872n25573k32854J05790k81380q74011r02829
19607A3644061q66143q19293n13883j75944K52670O13503R67357J614734K773077
19598A7490139M795387Q154752J1030421Q544580O522461L546508l799317o109379
19590E0175552m541299k005091L648591Q646760P479738O087316J578213l997785
19582F7071995k842121K128127P483932R018958Q998029P018913K233627k339000
19574I8772460n598264r606476j4105170j4184599j2408802j0656022p790067
$$ y = [45894443, 42008597, 42563383, 48402231, 61284974, 78986953, 93828839, 101875729, 98124053, 84872900, 68738571, 52637005, 39106593, 30067277, 24458398, 20916245, 18627079, 17162790, 16354918, 15829345, 15596491, 15702281, 15420901, 14546890, 13644061, 12777918, 11958625, 11444742, 11268798, 11521468, 12134971, 13102328, 14717062, 17490139, 22285526, 30440278, 41470699, 50015279, 56537740, 60084248, 56284931, 50175552, 45634253, 43629162, 47277753, 55924513, 63404251, 69491567, 71069780, 67071995, 64229874, 66358001, 73841933, 82860891, 91858920, 98877833, 101111460, 98772460, 93174196, 83567720, 69462550, 55277951, 42869149, 32213127, 24423060]
19567B4423060n103481l414342k431732j849960j359210j036794p82846o06962
19559G837733n77814m92124m06827l43579l56831l22352k54891j71158n1909P9774
19549D940022L51761N89176N92469K25670K41252l5482o82281p52696p67308p97949
19539C904634o44541m94223k37798k57058j98731j67799j09433n8615o3114j35145
19529A538177o9003m4133l7182r9902n1984n1106l9731j06509l2409m3064j5217
19518I47937p4653N942m4317L91j3206m3586J7441Q2783J91990J88630P8016N244
19506A342612K3366k5852r5993o4254j50567j22907j62405o0574l9714K4820l2290
19495F36242m3047l1235K4709L0287l0551l1487L5526N741m6416l5583m0792o5155
$$ y = [24423060, 19319579, 15905237, 13473505, 11623545, 10264335, 9227541, 8444695, 7837733, 7259919, 6767795, 6360968, 6017389, 5660558, 5338206, 5083315, 4912157, 4860248, 4940022, 5291783, 5880959, 6473428, 6699098, 6940350, 6904868, 6222587, 5469891, 4702583, 3904634, 3260093, 2765870, 2528072, 2271014, 2072283, 1904484, 1795051, 1736436, 1673322, 1538177, 1469174, 1425041, 1387859, 1287957, 1235973, 1184867, 1145136, 1038627, 1006218, 963154, 947937, 873284, 879226, 834909, 835300, 822094, 778508, 795949, 878732, 1070722, 1259352, 1337368, 1342612, 1365978, 1340126, 1244133, 1179879, 1029312, 906405, 744000, 683426, 643712, 668532, 636242, 593195, 561960, 586669, 616956, 586405, 554918, 590444, 596185, 549769, 514186, 473394, 408239]
19483D08239o6740j1333K7892R399L2675j9827l9376k1920L6872Q9034n0157j2324
19471C82434N7841P345K3942J4354n2654m7660m143l1698J0250K5003o1575J3392
19459C36831M1502l3326j2771l4606L7513J03650o969j0172l8487j8026M411L6057
19447D05607K0222Q0541L249n2923l6879k4819J0472r585p4654n3560l3771Q059
19435B41959M7583M2702j2634N110M677P306J1j2112m1801M3039Q4415l2392r8214
19422B79649j5070l371q669q4493m608J1298O8146j6987k7868p615j4664O4794
19410B40542K4037K278N2618N2242J5819Q74m0668n7982R617n413q674l3097j3145
19397B39048j7630K8612m3792l8176p326O6040M1843j9995o8135l3006j5989K2721
$$ y = [408239, 341499, 330166, 358058, 367457, 400132, 380305, 340929, 319009, 355881, 444915, 394758, 382434, 440275, 447620, 471562, 485916, 433262, 385602, 381459, 349761, 360011, 385014, 323439, 336831, 378333, 345007, 332236, 297630, 335143, 438793, 431824, 421652, 383165, 365139, 369550, 405607, 425829, 506370, 509619, 456696, 419817, 394998, 405470, 395885, 321231, 267671, 233900, 241959, 289542, 332244, 319610, 324720, 329397, 336703, 336714, 324602, 282801, 325840, 410255, 377863, 279649, 264579, 261208, 252539, 168046, 163438, 174736, 242882, 225895, 198027, 190412, 175748, 240542, 264579, 266857, 319475, 371717, 387536, 388410, 347742, 289760, 299377, 293964, 285290, 252193, 239048, 221418, 250030, 206238, 168062, 160736, 226776, 268619, 248624, 180489, 147483, 131494, 154215]
19385A54215M0504J4241K0102n60L0747L5024n930Q469M8692K1795k1304l8184
19373C07811m2087l4479m7145K7251L5534L4965M535n9510j9952L9282L649l5072
19361B14782k2072N718K4014M5012o9600n5148k7209k2217K4757k192K0613Q418
19349A44876k3198k9051o2070j3494R4493J0108j7689J0223O8009L3595Q5205
19338C01007K4408R641j3550k6019m0185r078N77K7627n4346m4842K3198L3372
19326B31810O4509L2487L7737K7262q0239k0147J6209Q346l6620l9313K6039j4356
19314B53724L930N4619k5876r2254K1017N388o7103l8459l5486l2701N6092R9570
19302B02461J07022Q7894m6412M2106r721q0224L341N1512M9280J0455m440j7990
$$ y = [154215, 194719, 208960, 229062, 228502, 259249, 294273, 288343, 296812, 345504, 367299, 345995, 307811, 265724, 231245, 184100, 211351, 246885, 281850, 286385, 226875, 206923, 246205, 249854, 214782, 192710, 198428, 222442, 267454, 197854, 142706, 115497, 93280, 118037, 115845, 136458, 144876, 121678, 92627, 30557, 17063, 111556, 121664, 103975, 114198, 182207, 215802, 301007, 325415, 335056, 321506, 295487, 255302, 246224, 246801, 274428, 220082, 175240, 198438, 231810, 296319, 328806, 366543, 393805, 313566, 293419, 309628, 317974, 281354, 242041, 268080, 253724, 257654, 312273, 286397, 194143, 215160, 220548, 153445, 114986, 79500, 46799, 102891, 202461, 309483, 397377, 350965, 393071, 383350, 303126, 306467, 357979, 407259, 417714, 413274, 395284]
19290C95284K3273L4235k7429K2062R1603Q2162M2316k5175J4288M3696P0681
19279G66996M8163r974J2518L0476K6288m8406L1018M0954J53217J63222J46635
19268A361107K2576M6007N5530k8712l1016O8034Q7105J40797K27586K55899J57584
19257B362497J96981K31636L76291O35119Q81239J470334K508595M345201P094269
19248B0102162P694638K304485j916554l286216m712321m580529k548215n64692
19240A2492758J111815L119259O384941J0545977R425361M78760m098717o013179
19232C3446975q120596p306897m667057k647115j321624o22188m00149l86689
19224G974660m24316l80324m11278l97530j99797q9389n847J65797M33479O03858
$$ y = [395284, 418557, 452792, 425363, 447425, 539028, 621190, 663506, 638331, 652619, 696315, 766996, 815159, 805185, 817703, 848179, 874467, 826061, 857079, 898033, 1051250, 1214472, 1361107, 1383683, 1429690, 1485220, 1456508, 1425492, 1493526, 1580631, 1721428, 1949014, 2204913, 2362497, 2559478, 2791114, 3167405, 3802524, 4683763, 6154097, 8662692, 13007893, 20102162, 27796800, 30101285, 28184731, 24898515, 20186194, 15605665, 13057450, 12492758, 13604573, 16723832, 23108773, 33654750, 43080111, 43558871, 39460154, 33446975, 25326379, 18019482, 13352425, 10705310, 9383686, 8761498, 8361349, 7974660, 7550344, 7170020, 6758742, 6361212, 6161415, 6072026, 6066179, 6231976, 6665455, 7269313]
19214G269313Q29957Q94535J013146J429917K225648L538314N738414R516648
19206C2455892J6085310K4852064K4114217N870866o714277j1774712j7047445
19199F7841915j6339533j0082027m294812M86983N629599J2600549J9777504J4823939
19191I0444117j126103q236460j1705373j4480117j0922586m169839P82185J29376
19183D0715200l086562l707162m353262m592394l183216j551517n41726K11276
19175A9910637R67033K012567L628274O411632J0895876J7365953K0323768J5120247
19167I6635987O685711n580460j2619954j3988290j2473556p805037j282677N901243
19159E5472967J5125193K5679768K5894061J1938543M256483N624765M445734
$$ y = [7269313, 8099270, 8993805, 10006951, 11436868, 13662516, 17200830, 22939244, 32455892, 48541202, 73393266, 97507483, 103378349, 96664072, 84889360, 67841915, 51502382, 41420355, 37125543, 37612526, 43242125, 55842674, 75620178, 90444117, 89318014, 81081554, 69376181, 54896064, 43973478, 39803639, 40585824, 40715200, 37628638, 33921476, 29568214, 24975820, 21792604, 20241087, 19699361, 19910637, 20877670, 22890237, 26518511, 32930143, 43826019, 61191972, 81515740, 96635987, 103321698, 97741238, 85121284, 71132994, 58659438, 50854401, 49571724, 55472967, 70598160, 96277928, 122171989, 134110532, 138367015, 143991780, 148437514]
19152A48437514k128831r820258j7436731k0394381k0462023j7111354j0644811
19145E0439125m551718M27567N961655J3350389J7738529P369825n662188r923215
19137G5149969j3455528j4658469j0649752o352708l818844k428923j527977q84593
19129B1373175r0407R94672K714418M810077N632321M445317K613132J26973K07588
19120D2827266L162176Q246850J1362439Q700239M069674m308846r536841j0434898
19112E4088059r142627n395091N4894N536127J1232996J4477343J0330147L949169
19104H5131017n795563j2496311j4015634j3366351j0661089o877240m178498
19097A7740331k652880j868205j372078j158016r05619o68916n18395m77040m26931
$$ y = [148437514, 146308683, 136488425, 119051694, 98657313, 78195290, 61083936, 50439125, 45887407, 46314974, 52276629, 65627018, 83365547, 90735372, 85073184, 75149969, 61694441, 47035972, 36386220, 30033512, 26214668, 23785745, 22257768, 21373175, 21282768, 22277440, 24991858, 29801935, 35434256, 39879573, 42492705, 42619678, 42827266, 45989442, 54236292, 65598731, 74298970, 78368644, 74059798, 64522957, 54088059, 44945432, 39550341, 39605235, 45141362, 56374358, 70851701, 81181848, 85131017, 79335454, 66839143, 52823509, 39457158, 28796069, 21918829, 17740331, 15087451, 13219246, 11847168, 10689152, 9783533, 9114617, 8596222, 8119182, 7692251]
19088G692251l56912m16448l87589k69049j60372n766P6772J78799L74501P29567
19078G455754J183642K117400L683758N855667O257726M314411J704459k433861
19070C0138956m577956m822339m382224k850049r02025J004057K974435M144018
19062B0726873L024905J225128j789799l621094m010552l876189l002960j834347
19054F841965j231752q46979n91824m68188m17059k81568k62281j90044j61642
19045B390628j07378q1249l4435j14155q6464n1423q7393r7338j1675j4197q4059
19034A620862o7396o9128p8473j15531k8046q4692r8925p3092q7319k8496p0785
19023H18979j9034l9251m5129l8676L0450L134O503l1726l4109J04224n257j00120
$$ y = [7692251, 7335339, 6918891, 6531302, 6262253, 6101881, 6096115, 6172887, 6351686, 6726187, 7455754, 8639396, 10756796, 14440554, 20296221, 26553947, 30868358, 32572817, 30138956, 25561000, 20738661, 16356437, 13506388, 12604363, 13608420, 16582855, 20726873, 23751778, 24976906, 23187107, 19566013, 15555461, 11679272, 8676312, 6841965, 5610213, 4763234, 4171410, 3703222, 3286163, 3004595, 2742314, 2552270, 2390628, 2283250, 2202001, 2167566, 2053411, 1966947, 1915524, 1828131, 1730793, 1719118, 1704921, 1620862, 1553466, 1484338, 1405865, 1290334, 1262288, 1177596, 1078671, 1005579, 918260, 889764, 818979, 799945, 760694, 715565, 676889, 707339, 710473, 716976, 685250, 651141, 755365, 750108, 649988]
19011F49988J3904J7153l1992m4650n8217J9798k9863j3068N9501M2527j9336
19000F05745j7310m8759K1915O932k8421J9882k6434j4889K8076k6002m4194M485
18988D81026j5003k0018R161K7756k5508n6929N587q42K2717L0046n7944O341
18976D06390R516n3022k9270Q383m231l6668R842Q9251P530j3688R193M1246K2541
18963D67013J8391j8569k1706K3275N120j2626m668q521J567n802K8088l4660
18951D36902j7541K7721j8162K3917N526p5449k6113l7078j9814K0880J6775J7840
18939C55404m1138L4947K0188R251R764J0507o0126j4924K9044m812o6396K201
18927B83910O3144O7722j4710m8443m7550j5761j3864l9011j0916M0929N1388
$$ y = [649988, 663892, 681045, 649053, 604403, 546186, 565984, 536121, 523053, 582554, 625081, 605745, 588435, 539676, 561591, 568523, 540102, 559984, 533550, 518661, 546737, 520735, 476541, 481026, 466023, 446005, 455166, 482922, 457414, 400485, 406072, 405230, 427947, 457993, 400049, 406390, 415906, 362884, 333614, 341997, 337766, 301098, 310940, 400191, 407721, 394033, 403226, 444472, 467013, 485404, 466835, 445129, 468404, 473524, 460898, 456230, 447709, 449276, 443474, 471562, 436902, 419361, 447082, 428920, 452837, 458363, 382914, 356801, 319723, 299909, 320789, 337564, 355404, 314266, 349213, 369401, 378652, 388416, 398923, 338797, 323873, 352917, 348105, 281709, 283910, 347054, 414776, 400066, 351623, 304073, 288312, 274448, 235437, 224521, 265450, 316838]
18916C16838K0474M2896p4194l144M4j7880r881J2637L2937j3671k3485L2411
18904C15982N8755L6285n6039k9236j0075K396m8345n174N6084J7758n344K8629
18892C61676K7570l8095p8754K794k422o2925j9402J4138L7540K4485K3013J3751
18880C03369j8718q251N871l134j0896j3442k6789n7668J9559O9772K7179k528
18868B84324j3148l2182J7970K8058K5905m9227q3666M6779K5192m1716j2385
18857A95904K9195l4991n5468j3884J0661M3653J7950P549J4189J330J9903L8872
18845B74863j1875p4761N576J2805q433M8060k6928q4295k6969J6245L1571K4033
18833A79892J886K8021j737k2699l7534n8982M618K4503L0364L3548o871j2911
$$ y = [316838, 337312, 380208, 306014, 302870, 302914, 285034, 275153, 287790, 320727, 307056, 283571, 315982, 374737, 411022, 354983, 325747, 315672, 318068, 269723, 264549, 320633, 338391, 333047, 361676, 389246, 351151, 272397, 275191, 272769, 209844, 190442, 204580, 242120, 266605, 289618, 303369, 284651, 276400, 282271, 279137, 268241, 254799, 228010, 170342, 189901, 259673, 286852, 284324, 271176, 238994, 256964, 285022, 310927, 261700, 178034, 224813, 250005, 208289, 195904, 225099, 190108, 134640, 120756, 131417, 175070, 193020, 200569, 214758, 216088, 235991, 274863, 262988, 188227, 193803, 206608, 198175, 246235, 219307, 135012, 108043, 124288, 155859, 179892, 181778, 209799, 208062, 185363, 147829, 88847, 93465, 117968, 148332, 181880, 175009, 162098]
18821A62098K0582l2297m4309n488p403J6617J9799k2679l681K3147m4998L2320
18809A13708L8486m4544m6901J5755K8984l246j2734m2042N041M6474J8212q25
18797A16368M725J9999k5734Q928K5974j4783k1879J1459j6061j1729K7406M5968
18785A70641M2303M4436k8541j5818n3178J7937K6666O736k1239p960p4589l6141
18773G1253J1091K6643K5755M9568J76658K08999R960j03066p7257o1886m7873
18762B89845l436o3625r7917j0927k4086l690O1892M6396K096j9226k0219L1958
18750A89061L0819M6353O692o7991m6081n6369O819Q7638j1769o7939n9759k588
18738E4886O9952J0917j3960r25l7967j6228j9018N5254M8251L8912j5953M6389
$$ y = [162098, 182680, 150383, 106074, 100586, 93183, 109800, 129599, 106920, 103239, 126386, 81388, 113708, 152194, 107650, 60749, 76504, 105488, 102242, 89508, 47466, 52507, 98981, 117193, 116368, 121093, 141092, 115358, 124286, 150260, 135477, 113598, 125057, 108996, 97267, 124673, 170641, 212944, 257380, 228839, 213021, 159843, 177780, 204446, 211182, 189943, 181983, 107394, 71253, 82344, 108987, 134742, 184310, 360968, 569967, 579927, 476861, 399604, 337718, 289845, 286409, 222784, 124867, 113940, 89854, 86164, 148056, 194452, 196548, 177322, 157103, 189061, 219880, 266233, 272925, 204934, 158853, 102484, 109303, 196941, 185172, 117233, 57474, 54886, 124838, 135755, 121795, 120870, 82903, 66675, 47657, 102911, 151162, 190074, 174121, 220510]
18726B20510R7250P3789N2652P321j1889o5109m2619Q174K5141M0279K8902O429
18714D40830L8320K4919n091j33206j52117l2121n4710p4093J3682K338o715J2645
18702G4681o884j5092N5645K1208L2895L7571m6853N881r272k8916O3835P7346
18690B62045m4212o1571J0113L5695m0858M400N2860O1398J291K4282P3828M3797
18678D23068n5685o410k1640K7249P9886N5630N1095N1041J4774k3888m1204q2542
18666D71374p3755k2096Q314P9139N8608K9494L1123m8465M8876k7356k3532l8123
18654D93601p2888o7529L066J0512J3563K6227R0387O9233k1092j19168r9160
18643C26752j5998j8404l5309O303L7125M3865k2716m6565m4123m0978M790K0195
$$ y = [220510, 317760, 391549, 444201, 451522, 439633, 374524, 331905, 340079, 365220, 405499, 434401, 440830, 479150, 504069, 498978, 365772, 213655, 181534, 126824, 52731, 66413, 68751, 62036, 74681, 67797, 52705, 108350, 129558, 162453, 200024, 153171, 159052, 149780, 120864, 184699, 262045, 217833, 156262, 166375, 202070, 161212, 165612, 218472, 279870, 281161, 305443, 379271, 423068, 367383, 360973, 339333, 366582, 446468, 502098, 553193, 604234, 619008, 595120, 553916, 471374, 397619, 375523, 383837, 462976, 521584, 551078, 582201, 533736, 582612, 555256, 531724, 493601, 420713, 353184, 356250, 366762, 380325, 406552, 496939, 566172, 545080, 425912, 326752, 310754, 292350, 257041, 263344, 300469, 344334, 321618, 275053, 230930, 189952, 194742, 214937]
18631B14937J8568p5438K9908L8208L9299N5747k3430l2447m4386J14744P856
18620C43566n8601K3208Q4526N8649L5688R4697N7528l1568q4461q2772l3841
18609D06619q000J8640P5086Q9013J00591M3819l306n5251l7468j69399q8716
18598C71628j1073j4661m1172J08426P7060m8618k6429n3k9441p9605m1281k8717
18586B36064m9305o3223k4022k4483K6916K9645j0848K4025n1247p5388L5445
18575E3579L2123N1193n309m379j4975j8726n116m0081M0473m929K8228N2346
18563A64427m8362M0931N9570K83Q7184N1732m3838k6708q6568O236P6977L3907
18551C15771l0712j5724M427J2420j0007k0682n6094o9817J8419k9035l4005J1533
$$ y = [214937, 233505, 158067, 187975, 226183, 265482, 321229, 297799, 265352, 220966, 335710, 343566, 284965, 308173, 392699, 451348, 487036, 581733, 639261, 607693, 523232, 440460, 406619, 398619, 417259, 492345, 581358, 681949, 725768, 722462, 667211, 629743, 460344, 371628, 360555, 345894, 304722, 413148, 490208, 441590, 415161, 415108, 385667, 306062, 264781, 236064, 186759, 123536, 99514, 75031, 101947, 131592, 120744, 144769, 93522, 18134, 53579, 85702, 136895, 131586, 127207, 112232, 93506, 88390, 48309, 88782, 83853, 112081, 164427, 116065, 156996, 216566, 216849, 304033, 355765, 311927, 285219, 198651, 204887, 281864, 315771, 285059, 269335, 273762, 286182, 276175, 255493, 199399, 129582, 148001, 118966, 84961, 96494]
18539I6494K0212j9720k0813k7567j5956J7296L0583K5167R080O779J9987J5166
18527A56708m9766l9485m448j5093m7058P4348J7352K1526K3745k7899K0865k2080
18515A08715p2125k3717O7861L8320o754o307J1731K3992p324k3792J3543m5289
18503G8854j2838O051l1070o703N0265L5448j3035j2711l8934j3904N8340O9191
18491A68954N6696k9829l975K0640m6879m6424J9542k5953o0915o424L150l0574
18479A8009j5753M3428N3425M2639j2327j7693m2701k8122L8579L15o9337o7714
18467e7252K681L1562k6770N5656O83j9853P6696J9584J833l3104O872l638k4843
18454C0107L0176L0802L5790Q474m8168m080j4530o4124m8496j0537J6392j4111
$$ y = [96494, 116706, 96986, 76173, 48606, 32650, 49946, 80529, 105696, 114776, 121555, 141542, 156708, 106942, 67457, 63009, 47916, 858, 75206, 92558, 114084, 137829, 109930, 130795, 108715, 36590, 12873, 80734, 119054, 112300, 105993, 117724, 141716, 134392, 110600, 124143, 78854, 66016, 72067, 40997, 34294, 84559, 120007, 106972, 94261, 55327, 41423, 99763, 168954, 225650, 195821, 191846, 212486, 165607, 119183, 138725, 112772, 51857, 45433, 48583, 18009, 2256, 45684, 99109, 141748, 129421, 111728, 69027, 40905, 79484, 79799, 10462, -57252, -54571, -23009, -49779, 5877, 6560, -13293, 63403, 82987, 84820, 51716, 58588, 54950, 30107, 60283, 91085, 126875, 135349, 87181, 83101, 68571, 4447, -44049, -54586, -38194, -52305]
18442e2305J6519l2685K6026M8968L1542J3702J3820j0359q792n030J1601K1127
18430G4134k538n6071j764K0963K3665K8269M801K19J7848l8877M699O3558K1746
18417A60652o2198p0611K1297m176l1247M0125K160j711k9330P14J7462j7452
18405B5685K203K0352K5932Q750m3295J9260J6860l619j9897l5728k9802j4480
18393b7779j2654K4773K9224K6575L7767N0122j3011j0988l6964l2380P127n692
18381C6120k942l0999l6183Q575N090O0416J7300l142m6199L1090L1891m3187
18369B7830k6645k4249J4997P7120J04419K7665n079l9024o1970o0514k1530M4948
18357E7968K4471l5011j5838L3473O7327k3924J4503n1438l6512o746M8892K1735
$$ y = [-52305, -35786, -68471, -42445, 6523, 38065, 51767, 65587, 55228, 46436, 41406, 53007, 74134, 71596, 15525, 13761, 34724, 58389, 86658, 91459, 91678, 109526, 70649, 75348, 138906, 160652, 98454, 27843, 49140, 44964, 13717, 53842, 56002, 54291, 24961, 25675, 43137, 25685, 27888, 48240, 74172, 82922, 39627, 58887, 75747, 72128, 52231, 16503, -13299, -27779, -40433, -15660, 13564, 40139, 77906, 128028, 115017, 104029, 67065, 34685, 41812, 36120, 33178, 2179, -34004, -25429, -20339, 40077, 57377, 54235, 8036, 39126, 71017, 27830, 1185, -23064, -8067, 69053, 173472, 201137, 196058, 157034, 95064, 34550, 13020, 57968, 82439, 47428, 31590, 65063, 132390, 108466, 122969, 71531, 35019, 28273, 77165, 98900]
18345I8900k8351o9957L7881k0491k507J1992L941P1660P948n515m8752j5214
18333D1535n7326J1725L7382j246k2031J5734l0734j1651K4731K8061M4565Q1738
18321A62483j8724o6592M454K339j0892q2798k2339K4466K331j2394O39K3809
18309F782J9804k8149j592M0594K6196m6403l3230J4664J9684k0364K2201R9666
18297A19853N811J4838K2518p2316m696P779j5730k0162k8458L4372M5052N7172
18285A66033J5648q4832n5513n853L6443J6578j1810o9216l3538P6126L0989j5054
18273F6001K0589k3925n7268k8951J3711K0106L6673R540o1984J8935n242k8023
18261a9838J8178L1614P728l071J1420j5851j5384l6094K1429r622M2339K2291
$$ y = [98900, 70549, 592, 38473, 17982, 15475, 27467, 31408, 103068, 111016, 105501, 56749, 41535, -15791, -4066, 33316, 32070, 10039, 25773, -4961, -16612, 8119, 36180, 80745, 162483, 143759, 77167, 81621, 83960, 73068, -9730, -32069, -7603, -5272, -17666, -17027, 6782, 26586, -1563, -3155, 37439, 63635, 17232, -15998, -1334, 18350, -2014, 20187, 119853, 125664, 140502, 163020, 90704, 86008, 93787, 78057, 57895, 29437, 63809, 108861, 166033, 181681, 96849, 41336, 35483, 71926, 88504, 76694, 7478, -26060, 50066, 81055, 66001, 86590, 62665, 5397, -23554, -9843, 10263, 46936, 56476, -5508, 13427, 8185, -19838, -1660, 29954, 37682, 34611, 46031, 30180, 14796, -21298, 131, -9491, 32848, 55139]
18249E5139L038R878j8884k5913K258R5195R3760k7196n5116q922r822K3829l2638
18236A04606j6070N315r723n4501l8704n8722K4368K3827L604o439k0775K1430
18224b1784J0363K060l3648K4156M7103L5769l723j6457M767K629P80j9494k7294
18211E227k7080J5802J6218o562L423O8649R922n0064l2831N326M3951K5929J440
18198G9350K1188J6874k7602R810J0679o4252l6770K082n4215j8049K4173j6403
18186e3135P051P3708K0308l8163J3223k4898Q337N51J3234m75M5863M1355J7651
18173A24610o0757m0464j2913R071J1932m0317J4189K3850L0113K6373l0527o4109
18161h949m928L1820M5928L5834R925L6336k1914j8689l4398k9582L8758J8821
$$ y = [55139, 58177, 68055, 49171, 23258, 25516, 120711, 214471, 187275, 132159, 123237, 113415, 137244, 104606, 88536, 93851, 84128, 29627, -9077, -67799, -43431, -19604, -16000, -22439, -43214, -21784, -11421, -9361, -43009, -18853, 28250, 64019, 60296, 43839, 48606, 51235, 52015, 32521, 5227, -21853, -6051, 10167, 3605, 7028, 75677, 85599, 35535, 2704, 8030, 51981, 77910, 79350, 100538, 117412, 89810, 99620, 110299, 46047, 9277, 11359, -42856, -60905, -36732, -53135, -46084, 27624, 47932, 9769, 22992, -1906, 6431, 6982, 20216, 19741, 65604, 106959, 124610, 63853, 23389, 10476, 19547, 31479, -8838, 5351, 29201, 59314, 85687, 55160, -8949, -13877, 17943, 63871, 99705, 109630, 145966, 124052, 105363, 70965, 41383, 80141, 98962]
18149I8962K1640L7892m455j4338q120K8868M0811O589N1866R0328P5391k5027
18137D00407p846K7618N065j0000P2747Q0294O3144J40349J33815P2670P8040
18126A056303J38375J87527J48582J68122K56772L54639L92816N01246O75637
18117C880019Q86536J311596J992966L172734N469318J0221027J9610903K9817925
18109G6363024J4662989p226358j0824000j5881985j9497471j3442399p364281
18102A6789519m219462k683048j897704j368053j062854p70401o51954m96389
18094C639654l88182l39883l24246k60695k30410k16879j51394j24969j05155
18085A497841r0203j01827n4919r1619j09056r9158q6278n1169K9592j6788q5443
$$ y = [98962, 120602, 158494, 154039, 139701, 131581, 160449, 201260, 207849, 259715, 350043, 425434, 400407, 392561, 420179, 425244, 415244, 487991, 568285, 631429, 771778, 905593, 978263, 1056303, 1194678, 1382205, 1530787, 1698909, 1955681, 2310320, 2703136, 3204382, 3880019, 4766555, 6078151, 8071117, 11243851, 16713169, 26934196, 46545099, 76363024, 91026013, 83799655, 72975655, 57093670, 37596199, 24153800, 16789519, 12570057, 9887009, 7989305, 6621252, 5558398, 4787997, 4136043, 3639654, 3251472, 2911589, 2587343, 2326648, 2096238, 1879359, 1727965, 1602996, 1497841, 1407638, 1305811, 1250892, 1159273, 1050217, 951059, 864781, 813612, 843204, 826416, 740973]
18074G40973l8954k3028K487M1083k2324j03631q6430k6846j3876L7944k9648
18063D77750k4227l8083J6996j18240n4349L3702j373M9589O311r2373l1189l2627
18051A91887j2631N5447J07611N8361l7591l5032m0513j1161r170k2651n3274
18040A91283p709K3801j9977o076l4595Q775j7260P209J8277J9753K496k6455
18028A59522m5614J1066L6994o138K185j6981k6514l2090K2736m0243k8402j869
18016C4652m0271J6610N6011P053J3719l4132j8996K2506K3940L5179P739l2870
18004I1140L3607m8772k2559p407m674l1804m1369K0453L8490L0379M5165r461
17992I3188K170j6412j3583k0126o126M980m530O9256m1443l3348J3757K4059
$$ y = [740973, 702019, 678991, 681478, 722561, 700237, 596606, 510176, 483330, 469454, 507398, 477750, 453523, 415440, 432436, 314196, 259847, 293549, 292176, 341765, 348076, 255703, 224514, 191887, 179256, 234703, 342314, 400675, 363084, 328052, 287539, 276378, 267208, 244557, 191283, 183574, 207375, 187398, 181322, 146727, 155502, 138242, 145451, 163728, 183481, 185977, 159522, 113908, 124974, 161968, 155830, 158015, 141034, 114520, 82430, 105166, 64923, 36521, 34652, -5619, 10991, 67002, 74055, 87774, 53642, 34646, 57152, 81092, 116271, 124010, 91140, 124747, 75975, 53416, 46009, 41335, 9531, -31838, -11385, 27105, 57484, 102649, 93188, 95358, 78946, 65363, 45237, 39111, 44091, 39561, 108817, 67374, 34026, 47783, 71842]
17980G1842l03k7602k6639j3433L6507j0550l3159p133k7736M7181Q6856O0918
17968A56749q458k5498k2641L9912K902q9365m5788k0839L2830l2437l488n498
17956b1619K0318J8351K3423L1604j9671J1953M438k8489N9633l8244p9500j5568
17944c3371J6230P396o93J905K2438l7511j165Q717M3424M9878l480q2666m3063
17931e1961L6312O1923k8126j6199m5007J5508M4947J1178k4411o7295l2650O2608
17919c3173K9549L436j3600K5407N0044J6077k076j2251o8113l1388N9101K1494
17907D4507k2269k0962R877J7450M3676l0757l212R664K438K320l8980L1949J4275
17894E9976l2681o2798o6178K7670K4724M3856j6847j8308M1541K7837J7930K4352
$$ y = [71842, 71539, 43937, 17298, 3865, 40372, 29822, -3337, -10470, -38206, 8975, 95831, 156749, 148291, 122793, 100152, 140064, 142966, 53601, 7813, -13026, 19804, -12633, -16121, -21619, -1301, 17050, 40473, 72077, 52406, 64359, 68797, 40308, 99941, 61697, -17803, -33371, -17141, -9745, -10438, -8533, 13905, -23606, -24771, -16054, 27370, 77248, 73768, -8898, -51961, -15649, 46274, 18148, 1949, -43058, -27550, 17397, 28575, 4164, -63131, -95781, -33173, -3624, -188, -13788, 11619, 61663, 77740, 75664, 63413, -4700, -36088, 23013, 44507, 22238, 1276, 11153, 28603, 72279, 41522, 38310, 47974, 50412, 52732, 13752, 45701, 59976, 27295, -35503, -101681, -74011, -49287, -5431, -22278, -40586, 955, 28792, 46722, 71074]
17882G1074R403m0911m8126K7555k727J5137K2888k4254k8481m0592j3060P8860
17870B6766R9151l5569l6478K828L750j0015K5098L4333k3605k8976M5840M3710
17858A46833k9273m8117l5976J9176k1126k887J239j1668L9790M2560k4142l8684
17846C7725k6708n6851o967O590Q437L4131J4973k9068j9726J7830J7620M1580
17834C9566p068L8529K5323M6475l9361o3487q1141o3319K9158L7005j7578K2532
17822c3366K8129L871o475Q7552L6653l4206j203k8361p5278l9267j8356J7634
17810f2673L6318J4430J02O5089j8595J2542M3226L0427n2145j8715J2742r805
17798E2943k2591j909K4895o719j218j620j4787l9291j6129L7357r983o0447j717
$$ y = [71074, 80477, 39566, -8560, 18995, 16268, 31405, 54293, 30039, 1558, -39034, -52094, 26766, 125917, 90348, 53870, 56698, 60448, 50433, 75531, 109864, 86259, 57283, 103123, 146833, 117560, 69443, 33467, 52643, 31517, 28630, 29869, 18201, 57991, 100551, 76409, 37725, 11017, -45834, -52801, -46211, -37774, -3643, 11330, -17738, -37464, -19634, -2014, 39566, 32498, 71027, 96350, 142825, 103464, 39977, -41164, -104483, -75325, -38320, -55898, -33366, -5237, -1366, -7841, 79711, 116364, 82158, 80955, 52594, -22684, -61951, -80307, -62673, -26355, -11925, -11823, 53266, 34671, 47213, 90439, 120866, 68721, 50006, 62748, 52943, 30352, 28443, 53338, 46619, 45401, 43781, 28994, -10297, -26426, 10931, 948, -59499, -61216]
17785f1216o647J1049j0116Q667J14168P2583k7711p2615p186J6281q8898l1376
17773h3017M6093M3802J3418L4376m8293J0553o95k7984l2375j8377P938K8409
17761b6152M4205O7326L1551L464r474K390l9441o0946k4550K9465M5470m5049
17749A8259l9184J5698J8194K690l060n9250k2021O8468j1746k3257O818L7578
17737I187o236l6798j2031m140K4154J8712P0631j3276o5358l3088J9945N2626
17725B4328N5608J9145K1029o4888n8627N080k4408K4025p204l4717J7483Q363
17713a4783p0164p633M8765O3336M3441L124j3075l4973J9484k6549j836P106
17701A6243j568J2113o0501k5157K3190M9746j6237l7799K434K8697J4757J8405
$$ y = [-61216, -67863, -56814, -66930, -58263, 55905, 128488, 100777, 28162, 20976, 37257, -51641, -83017, -36924, 6878, 20296, 54672, 6379, 16932, 16237, -11747, -44122, -62499, -54561, -26152, 18053, 85379, 116930, 120394, 110920, 113310, 73869, 12923, -11627, 17838, 63308, 18259, -20925, -5227, 12967, 15657, 12597, -46653, -68674, -206, -11952, -35209, -28391, 9187, 2951, -33847, -45878, -50018, -25864, -7152, 63479, 50203, -15155, -48243, -28298, 24328, 79936, 99081, 120110, 55222, -3405, 1675, -22733, 1292, -5912, -40629, -23146, -14783, -84947, -92580, -43815, 19521, 62962, 66086, 53011, 18038, 37522, 10973, 9137, 16243, 14675, 26788, -33713, -58870, -35680, 14066, -2171, -39970, -37536, -8839, 5918, 24323]
17689B4323r122m026p644J5785N6279j0063n6787n1831k3590J9959L4564M1604
17677B9451k311o6648m1390J9017P7185K4821n5593R115M7732p824l3999K501
17665B057K4718K1585J2552m0099J5046L4040J6199L3074L422j4538m2345n6613
17653I098j5367N8669J0191k4735o756m2435k3134P943J9478N8502L2890K3612
17641A07956j0742n4908L7672M2662n2982o0853J7199K1352j3674M3472j2953
17630F4201p7680n4199J5471O3450J7877J5589L1101r763j5023k8177n514j9845
17618b512j9180k1097J7109N3157L0823L0358m8540p5499M0017L1427j347K4574
17606E9290m988k9916l7419J5593J3631J8229K7446l1139k3506k4645m7836K6121
$$ y = [24323, 15201, 11175, 3531, 19316, 75595, 65532, 8745, -43086, -66676, -46717, -12153, 29451, 27140, -39508, -80898, -61881, 15304, 40125, -15468, -6353, 41379, 33555, -444, 2057, 26775, 48360, 60912, 20813, 35859, 69899, 86098, 119172, 122594, 108056, 65711, 9098, -6269, 52400, 62591, 37856, 31100, -11335, -34469, -26526, -7048, 51454, 84344, 107956, 97214, 42306, 79978, 122640, 69658, 8805, 26004, 47356, 33682, 77154, 64201, -13479, -67678, -52207, 11243, 29120, 44709, 75810, 66047, 51024, 22847, 17333, -2512, -21692, -42789, -25680, 27477, 58300, 88658, 40118, -35381, 4636, 36063, 34716, 59290, 54302, 24386, -13033, 2560, 16191, 34420, 61866, 30727, 7221, -17424, -65260, -39139]
17594c9139M4839m8512r234K9759L688N4965p8632p0651J2811L0121O9977K3368
17582B3360o0850k6800K251M4566N1953k5665k7062j1261N2064N7113J6557l3556
17570F2670j3862j4851m886R001k3884q826j9188j9052j0715j2036P827M7787
17558a5N2217L2981K0660R262J1171O433l9757m8516k3178j1779N1104l259J7995
17545G5319L3792j6038k4865j8004m5279n602L1887m4653k1747L6691L46J8250
17533B0097L7562L5164k4977l4431L1589k7866O545n473K2658m58J1528o1018
17521A0920l3091J3977o475l909L2196l1041q7359K5871N7558Pl4302K6684L6707
17508G743m2199q486M7121k0726r176N188J6812j8657k7715j6997M1858J1111
$$ y = [-39139, 5700, -42812, -52046, -22287, -18599, 36366, -42266, -112917, -100106, -69985, -8, 23360, -37490, -64290, -62039, -17473, 34480, 8815, -18247, -29508, 22556, 79669, 96226, 62670, 48808, 33957, 29071, 38072, 14188, 5362, -13826, -32878, -43593, -55629, -47802, -15, 52202, 85183, 105843, 115105, 126276, 132709, 92952, 44436, 21258, 9479, 60583, 57324, 75319, 109111, 93073, 68208, 50204, 4925, -677, 31210, -13443, -35190, 1501, 1847, 20097, 57659, 92823, 67846, 33415, 65004, 37138, 43683, 38210, 60868, 60410, 71938, 10920, -22171, -8194, -14669, -18578, 13618, -17423, -104782, -78911, -21353, -21346, -55648, -28964, 7743, -34456, -42942, 4179, -16547, -25723, -20535, -3723, -22380, -50095, -67092, -25234, -14123]
17496a4123J2531J3366j53p5476k037N6402k4605k5903M4461K4426N5134O663
17484G0686n6853m5908o887j7524k2972j7412R846j8354K1721L3635L8557K9228
17472A7763J313l768k4175l3910M0733M6002k5119j821M2967k4265j765K4254
17460E8209k4578j5927L9283J9222l6358j8685k7978K7268j3086K7101Q3249L3079
17448A50799m0769n0426k906R3601J54024J51455O6453q7029q1305r3036j08375
17437A52486j04202O396n745L2304K9887k3474r625K0722j1934o1763m1954m7446
17425f4348n7058R058M5351M099M3944M6584M5370K0320k4828l622k3006j7100
17413B4764J6523J9429K7509L129m3025k0814J3098J8130k8925p4231j0165j06
$$ y = [-14123, -1592, 11774, 11621, -63855, -65892, -9490, -34095, -59998, -15537, 8889, 64023, 70686, 13833, -32075, -38962, -56486, -79458, -96870, -87024, -105378, -83657, -50022, -11465, 17763, 19076, 15308, -8867, -42777, -2044, 43958, 18839, 17018, 59985, 35720, 33955, 58209, 33631, 17704, 56987, 76209, 39851, 21166, -6812, 20456, 7370, 34471, 117720, 150799, 110030, 59604, 56698, 150299, 304323, 455778, 522231, 435202, 353897, 260861, 152486, 48284, 54680, 48935, 81239, 111126, 87652, 78027, 98749, 86815, 25052, -16902, -64348, -121406, -112348, -66997, -62898, -18954, 27630, 73000, 93320, 68492, 64870, 41864, 24764, 41287, 60716, 88225, 91354, 48329, 27515, 40613, 58743, 29818, -44413, -54578, -54684]
17401e4684M3285M812P624L5921l0232o1296K7151L4665K9525J5779l2323j6380
17389C847l1918o3417K1396q548O4411P3713J0480M5098O1393n0089J4989m1665
$$ y = [-54684, -11399, -6587, 1037, 36958, 6726, -54570, -27419, 7246, 36771, 52550, 20227, 3847, -28071, -91488, -70092, -78640, -14229, 59484, 69964, 115062, 176455, 126366, 141355, 99690]
$$ [...]
##END NTUPLES=NMR SPECTRUM
##END=
