##TITLE=Analysis number 320861
Compound Code cc 13502
Project Code adrs
Chemist Name andys
##JCAMPDX= 6.0         $$ Bruker NMR JCAMP-DX V2.0
##DATA TYPE= NMR SPECTRUM
##DATA CLASS= NTUPLES
##ORIGIN= Bruker BioSpin GmbH
##OWNER= nmr
$$ XWIN-NMR		Version 3.5
$$ Fri Jul 14 09:05:05 2006 GMT Daylight Time (UT+1h)  MAYBRIDGE\nmr@NMR_250MHZ
##.OBSERVE FREQUENCY= 250.131544655141
##.OBSERVE NUCLEUS= ^1H
##.ACQUISITION MODE= SIMULTANEOUS (DQD)
##.ACQUISITION SCHEME= undefined
##.AVERAGES= 16
##.DIGITISER RES= 18
##SPECTROMETER/DATA SYSTEM= dpx250
##.PULSE SEQUENCE= zg30
##.SOLVENT NAME= CDCl3
##.SHIFT REFERENCE= (INTERNAL, CDCl3, 0, 16.522)
##AUDIT TRAIL= $$ (NUMBER, WHEN, WHO, WHERE, WHAT)
$$ ##TITLE= Audit trail, XWIN-NMR		Version 3.5
$$ ##JCAMPDX= 5.01
$$ ##ORIGIN= Bruker BioSpin GmbH
$$ ##OWNER= nmr
$$ C:\u/data/dgb/nmr/ADRS/2700/pdata/1/auditp.txt
$$ ##AUDIT TRAIL=  $$ (NUMBER, WHEN, WHO, WHERE, WHAT)
(   1,<2006-07-14 09:04:40.85 +100>,<MAYBRIDGE\nmr>,<NMR_250MHZ>,
      <created by zg, POWCHK disabled, PULCHK disabled
       configuration hash MD5:
       E2 DF 36 D8 04 B2 41 60 5A D7 A3 38 5A 4B D0 FE
       data hash MD5: 64K
       C6 05 51 33 53 93 62 F1 6B C1 13 39 3C 7E 59 CE>)
(   2,<2006-07-14 09:04:54.81 +100>,<MAYBRIDGE\nmr>,<NMR_250MHZ>,
      <Start of raw data processing
       ef LB = 0.3 FT_mod = 6 PKNL = 1 SI = 32K 
       data hash MD5: 32K
       8F 88 E4 77 5B AB 7D 98 E5 F3 23 6A 09 7B 30 3B>)
(   3,<2006-07-14 09:04:56.39 +100>,<MAYBRIDGE\nmr>,<NMR_250MHZ>,
      <apk 
       data hash MD5: 32K
       61 FC 38 C5 E1 5C B6 8B 77 97 B2 9E C6 62 C4 EA>)
(   4,<2006-07-14 09:04:57.24 +100>,<MAYBRIDGE\nmr>,<NMR_250MHZ>,
      <abs ABSG = 5 
       data hash MD5: 32K
       63 03 8E 50 47 D7 15 6B 08 05 5A 70 CD B2 E9 4C>)
$$ ##END=
$$ 
$$ hash MD5
$$ 77 34 0B 44 94 1E 87 B0 05 5C 7E 70 CE 15 B6 F6
##$RELAX= 
##$RELAX= 
##$RELAX= 
##$RELAX= 
##$RELAX= 
##$RELAX= 
##$RELAX= 
$$ Bruker specific parameters
$$ --------------------------
##$DU= <C:\u>
##$EXPNO= 2700
##$NAME= <ADRS>
##$PROCNO= 1
##$TYPE= <nmr>
##$USER= <dgb>
##$AMP= (0..31)
100 100 100 100 100 100 100 100 100 100 100 100 100 100 100 100 100 100 
100 100 100 100 100 100 100 100 100 100 100 100 100 100 
##$AQSEQ= 0
##$AQ_mod= 3
##$AUNM= <au_zg>
##$AUTOPOS= <47 >
##$BF1= 250.13
##$BF2= 250.13
##$BF3= 250.13
##$BF4= 250.13
##$BF5= 500.13
##$BF6= 500.13
##$BF7= 500.13
##$BF8= 500.13
##$BYTORDA= 1
##$CFDGTYP= 0
##$CFRGTYP= 5
##$CHEMSTR= <none>
##$CNST= (0..31)
1 1 145 1 1 1 1 1 1 1 1 1 1 1 1 1 1 1 1 1 1 1 1 1 1 1 1 1 1 1 1 1 
##$CPDPRG= <>
##$CPDPRG1= <>
##$CPDPRG2= <>
##$CPDPRG3= <>
##$CPDPRG4= <mlev>
##$CPDPRG5= <mlev>
##$CPDPRG6= <mlev>
##$CPDPRG7= <mlev>
##$CPDPRG8= <mlev>
##$CPDPRGB= <>
##$CPDPRGT= <>
##$D= (0..31)
0 1 0 0 0 0 0 0 0 0.06 0 0 0 0 0 0 0.0002 0 0 0 0 0 0 0 0 0 0 0 0 0 0 
0 
##$DATE= 1152864280
##$DBL= (0..7)
120 120 120 120 120 120 120 120 
##$DBP= (0..7)
150 150 150 150 150 150 150 150 
##$DBP07= 0
##$DBPNAM0= <>
##$DBPNAM1= <>
##$DBPNAM2= <>
$$ [...]
##$SUBNAM7= <"">
##$SUBNAM8= <"">
##$SUBNAM9= <"">
##$SW= 20.6930455092707
##$SWIBOX= (0..15)
0 0 3 0 0 0 0 0 0 0 0 0 0 0 0 0 
##$SW_h= 5175.983436853
##$TD= 65536
##$TD0= 1
##$TE= 296.16
##$TE2= 300
##$TE3= 300
##$TEG= 300
##$TL= (0..7)
0 120 120 120 120 120 120 120 
##$TP= (0..7)
150 150 150 150 150 150 150 150 
##$TP07= 0
##$TPNAME0= <>
##$TPNAME1= <>
##$TPNAME2= <>
##$TPNAME3= <>
##$TPNAME4= <>
##$TPNAME5= <>
##$TPNAME6= <>
##$TPNAME7= <>
##$TPOAL= (0..7)
0.5 0.5 0.5 0.5 0.5 0.5 0.5 0.5 
##$TPOFFS= (0..7)
0 0 0 0 0 0 0 0 
##$TUNHIN= 0
##$TUNHOUT= 0
##$TUNXOUT= 0
##$USERA1= <user>
##$USERA2= <user>
##$USERA3= <user>
##$USERA4= <user>
##$USERA5= <user>
##$V9= 5
##$VALIST= <valist>
##$VCLIST= <CCCCCCCCCCCCCCC>
##$VD= 0
##$VDLIST= <DDDDDDDDDDDDDDD>
##$VPLIST= <PPPPPPPPPPPPPPP>
##$VTLIST= <TTTTTTTTTTTTTTT>
##$WBST= 1024
##$WBSW= 4
##$XGAIN= (0..3)
0 0 0 0 
##$XL= 0
##$YL= 0
##$YMAX_a= 382605
##$YMIN_a= -560970
##$ZGOPTNS= <>
##$ZL1= 120
##$ZL2= 120
##$ZL3= 120
##$ZL4= 120
##$ABSF1= 16.522
##$ABSF2= -4.171173
##$ABSG= 5
##$ABSL= 3
##$ALPHA= 0
##$AQORDER= 0
##$ASSFAC= 0
##$ASSFACI= 0
##$ASSFACX= 0
##$ASSWID= 0
##$AUNMP= <proc_1d>
##$AZFE= 0.1
##$AZFW= 0.1
##$BCFW= 0
##$BC_mod= 0
##$BYTORDP= 0
##$COROFFS= 0
##$CY= 12.5
##$DATMOD= 1
##$DC= 0
##$DFILT= <>
##$DTYPP= 0
##$F1P= 14.0000005364418
##$F2P= -0.99999901652339
##$FCOR= 0.5
##$FTSIZE= 32768
##$FT_mod= 6
##$GAMMA= 0
##$GB= 0
##$INTBC= 1
##$INTSCL= 1
##$ISEN= 128
##$LB= 0.3
##$LEV0= 0
##$LPBIN= 0
##$MAXI= 10000
##$MC2= 0
##$MEAN= 0
##$ME_mod= 0
##$MI= 0
##$NCOEF= 0
##$NC_proc= -3
##$NLEV= 6
##$NOISF1= 0
##$NOISF2= 0
##$NSP= 0
##$NTH_PI= 0
##$NZP= 0
##$OFFSET= 16.522
##$PC= 1
##$PHC0= 165.2071
##$PHC1= 5.103756
##$PH_mod= 1
##$PKNL= yes
##$PPARMOD= 0
##$PSCAL= 4
##$PSIGN= 0
##$REVERSE= no
##$SF= 250.13
##$SI= 32768
##$SIGF1= 0
##$SIGF2= 0
##$SINO= 400
##$SIOLD= 32768
##$SREGLST= <1H.CDCl3>
##$SSB= 0
##$STSI= 32768
##$STSR= 0
##$SW_p= 5175.98343685301
##$SYMM= 0
##$S_DEV= 0
##$TDeff= 65536
##$TDoff= 0
##$TI= <Analysis number 999999
Compound Code 99
Book Reference 9
Project Code 9>
##$TILT= no
##$TM1= 0
##$TM2= 0
##$TOPLEV= 0
##$USERP1= <user>
##$USERP2= <user>
##$USERP3= <user>
##$USERP4= <user>
##$USERP5= <user>
##$WDW= 1
##$XDIM= 32768
##$YMAX_p= 316931982
##$YMIN_p= -368842
$$ End of Bruker specific parameters
$$ ---------------------------------
##NTUPLES= NMR SPECTRUM
##VAR_NAME=  FREQUENCY,     SPECTRUM/REAL,   SPECTRUM/IMAG
##SYMBOL=    X,             R,               I
##VAR_TYPE=  INDEPENDENT,   DEPENDENT,       DEPENDENT
##VAR_FORM=  AFFN,          ASDF,            ASDF
##VAR_DIM=   32768,         32768,           32768
##UNITS=     HZ,            ARBITRARY UNITS, ARBITRARY UNITS
##FACTOR=    0.157963299565203, 1,           1
##FIRST=     4132.6476996994, 0,             0
##LAST=      -1043.33573715361, 0,           0
##MIN=       -1043.33573715361, -368842,     0
##MAX=       4132.6476996994, 316931982,     0
$$ Real data points
##PAGE= N=1
##DATA TABLE= (X++(R..R)), XYDATA
$$ [...]
17173a6830M772J2002M005J821K5851n471j1151J7706M7212j4988K0885K7633
$$ -16830 -12058 -56 3949 5770 31621 26150 14999 32705 79917 64929 85814 113447
17161A13447j8710K5061M3429Q315k6813j8139J0078R064K7127J7019J6717l5023
$$ 113447 94737 119798 163227 171542 144729 126590 136668 145732 172859 189878 206595 171572
17149A71572j9202J3378K620K2118J0385Q913K8861M5741J1924j0351O477O021
$$ 171572 152370 165748 168368 190486 200871 209784 238645 284386 296310 285959 292436 298457
17137B98457k0538K9256J2569K0564Q913J4349L0441R789l480J3053o577k1434
$$ 298457 277919 307175 319744 340308 349221 363570 394011 403800 400320 413373 406796 385362
17125C85362L9101P1729M7423j4527L7569L7741K2962P9559J47904J42637Q5926
$$ 385362 424463 496192 543615 529088 566657 604398 627360 706919 854823 997460 1083386
17114A083386P1253J18565J32747J22301N8046P4042J02670P2832J10354J16023
$$ 1083386 1154639 1273204 1405951 1528252 1586298 1660340 1763010 1835842 1946196 2062219
17104B062219J38164J75193K02551K91944L61929M29462N22511O67020Q82315
$$ 2062219 2200383 2375576 2578127 2870071 3232000 3661462 4183973 4850993 5733308
17095E733308J135676J537425K164128L109909M318702N599498O584238O813856
$$ 5733308 6868984 8406409 10570537 13680446 17999148 23598646 30182884 36996740
17087C6996740O240152N000332L422909J609261n89132l220143n617013p082774
$$ 36996740 43236892 48237224 51660133 53269394 52680262 49460119 43843106 36760332
17079C6760332p437432o458668m960668l528399k353214j606303j151142q36936
$$ 36760332 29322900 22864232 17903564 14375165 12021951 10415648 9264506 8427570
17071H427570o33105n35030m14358k99781l08096k71157k33787j88171j58383
$$ 8427570 7794465 7259435 6845077 6545296 6237200 5966043 5732256 5544085 5385702
17062E385702j22063o1218m6691n3587o9488o0550p6458o2499q2038p8364q6148
$$ 5385702 5263639 5202421 5155730 5102143 5032655 4972105 4895647 4833148 4751110 4672746 4586598
17051D586598n5949l6550M532M1106Q3159J50878K18562L19554L93752N00742
$$ 4586598 4530649 4494099 4498631 4539737 4622896 4773774 4992336 5311890 5705642 6206384
17041F206384P11298R64919J326752J847553K628036L663163M845027N875269
$$ 6206384 6917682 7882601 9209353 11056906 13684942 17348105 22193132 28068401
17033B8068401O318826N996673M967801L534733J873945j03851k445379m730605
$$ 28068401 34387227 40383900 45351701 48886434 50760379 50656528 48211149 43480544
17025D3480544o437365p175840o535965n134011l684104k472678j665120j171933
$$ 43480544 37043179 29867339 23331374 18197363 14513259 12040581 10375461 9203528
17017I203528q85910o21619m78229m24793l92994l24678k88679k69659k62008
$$ 9203528 8317618 7695999 7217770 6792977 6399983 6075305 5786626 5516967 5254959
17008E254959k39039j73730j54379j81905j62061j71304k10224j91495j52053
$$ 5254959 5015920 4842190 4687811 4505906 4343845 4172541 3962317 3770822 3618769
16999C618769j47114j44556j48339j41341j54429j41613j06466j11108j12876
$$ 3618769 3471655 3327099 3178760 3037419 2882990 2741377 2634911 2523803 2410927
16990B410927j30522j04799q1361p5525o8918n8520r2621n5160m8832n7048k4870
$$ 2410927 2280405 2175606 2094245 2018720 1949802 1891282 1798661 1743501 1694669 1637621 1612751
16979A612751m3917l3237m9473n1162j6087n3417n1266o1353J358j4972l3736
$$ 1612751 1568834 1535597 1486124 1434962 1418875 1365458 1314192 1252839 1254197 1239225 1205489
16968A205489m7014l4494k8458j3244l6080l9779O356k8818o6750l2169r313l314
$$ 1205489 1158475 1123981 1095523 1082279 1046199 1006420 1012776 983958 917208 885039 875726 872412
16956H72412j9048p8817m3665J82n25j3919n961p267l238l882q550l6604j0525
$$ 872412 853364 774547 730882 731064 730539 716620 710659 703392 700154 696272 687722 651118 640593
16943F40593j4271l5804l4045m7749k0235J2775j2338q15q638Q429k4627n3455
$$ 640593 626322 590518 556473 508724 488489 501264 488926 488111 479473 487902 463275 409820
16931D09820M154Q07K081o763j5632J5364J2089j2452J7431l0498k1075p417k9655
$$ 409820 413974 414781 416862 410099 394467 409831 421920 409468 426899 396401 375326 367909 338254
16918C38254j9585o125P715N606j2077K212j6655l0289L7982L4635r523k3801
$$ 338254 318669 312544 320259 325865 313788 316000 299345 269056 307038 341673 332150 308349
16906C08349O15J1465K3598J1200j0671j884K3461J8552l5962k3222O353K773
$$ 308349 308964 320429 344027 355227 344556 342672 366133 384685 348723 325501 331854 334627
16894C34627j4369q461Q352r673k0687l0371j9257M952k307j4435j2239r802l7578
$$ 334627 320258 311797 320149 310476 289789 259418 240161 245113 242806 228371 216132 206330 168752
16881A68752q057j4114k4269J0919J7852o17J1785j9288k8861j3985r791J3958
$$ 168752 160695 146581 122312 133231 151083 150466 162251 142963 114102 100117 90326 104284
16869A04284J7147o785j4577K1641J1403j5331M832L8156J3992j3527j9534J558
$$ 104284 121431 114646 100069 121710 133113 117782 122614 160770 174762 161235 141701 143259
16857A43259J5455n3067l9454j4570j342k770M2607N7975M1682L739Q417k661
$$ 143259 158714 105647 66193 51623 50281 47511 90118 148093 189775 193514 201931 199270
16845A99270q111O773l987J4931J0640m794j7798Q01J671l0111l2426j0351R433
$$ 199270 191159 197932 193945 208876 219516 214722 196924 197725 199396 169285 136859 126508 135941
16832A35941n724J710m3477m1417K0992L538J1046j747L733K7483K2964k7227
$$ 135941 130217 131927 88450 47033 68025 71563 82609 80862 84595 112078 135042 107815
16820A07815p277k4589m0193r33J1953K712J6796L326j955l0200p731m530J8264
$$ 107815 100538 75949 35756 34823 46776 49488 66284 69610 67655 37455 29724 25194 43458
16807D3458M2973J1375r945M929M084n769l3525m6237L0874J5163R620L1422q933
$$ 43458 86431 97806 87861 92790 96874 91105 57580 11343 42217 57380 67000 98422 89489
16794H9489J349M008j5003k2668k442j4020j6975J246J0492J7975q823j9700N013
$$ 89489 90838 94846 79843 57175 54733 40713 23738 24984 35476 53451 44628 24928 29941
16781B9941J1720L756J1552k9034n256J7593O927P971J9829p078k2130k7179n684
$$ 29941 41661 45417 56969 27935 22679 40272 47199 55170 74999 67921 45791 18612 12928
16768A2928J3674j9789m782L5789L5994j7404r128K864R595Q357P015k3548l742
$$ 12928 26602 6813 2031 37820 73814 56410 47282 50146 59741 68098 75113 51565 47823
16755D7823K1526k2469j6198P9r384J0124M502M6n188k3022r764J7164k8251J6711
$$ 47823 69349 46880 30682 30761 21377 31501 36003 36049 30861 7839 -1925 15239 -13012 3699
16741C699K8788k4106J5481L6438J1803j1897j8198j4991p60l358K6930K5763
$$ 3699 32487 8381 23862 60300 72103 60206 42008 27017 26257 22899 49829 75592
16729G5592j4591l7567J7003O893k0117r75L3193q613l2504k7109j0516l632J557
$$ 75592 61001 23434 40437 47330 27213 26238 59431 50818 18314 -8795 -19311 -22943 -21386
16716b1386J4840L2536k2592l7816L9787K6157J0698k900k0820p656q163L332
$$ -21386 -6546 25990 3398 -34418 5369 31526 42224 39324 18504 10848 2685 6017
16704F017k1906N412m063J0752L9667J6488j0406j1734R486j5063K3713K4997
$$ 6017 -15889 -10477 -14540 -3788 35879 52367 41961 30227 39713 24650 48363 73360
16692G3360k8954o200K645n4057J1956J2809l2326K1785p313J227k516j8654J1791
$$ 73360 44406 38206 40851 -13206 -1250 11559 -20767 1018 -6295 -5068 -7584 -26238 -14447
16679a4447N286J6963L0429J5408j7807l4778j9123n884J0537J7785k613j4457
$$ -14447 -9161 7802 38231 53639 35832 1054 -18069 -23953 -13416 4369 1756 -12701
16667a2701L896N923J974K9655j5650m3717J5794Q312R293R007j427J1647l2269
$$ -12701 -8805 -2882 -908 28747 13097 -30620 -14826 -6514 2779 11786 10359 22006 -10263
16654a0263l0368J3389J1043r508o077M527P792K9322Q510N475K4902j4558r242
$$ -10263 -40631 -27242 -16199 -25707 -31784 -27257 -19465 9857 18367 23842 48744 34186 24944
16641B4944O664N359L2535k3128R537K008r646k6658J3594J8035j9818k4350K0832
$$ 24944 31608 36967 69502 46374 55911 57919 48273 21615 35209 53244 33426 9076 29908
16628B9908K1348j236j7223j5173L511J3096O766k1834M029J9884j6854Q118k3687
$$ 29908 51256 50020 32797 17624 21135 34231 40997 19163 23192 43076 26222 34340 10653
16615A0653q814J3567k5777J1437j877j2896K7957M518K6226l306J027m3470k3197
$$ 10653 1839 15406 -10371 1066 -811 -13707 14250 18768 44994 41688 42715 -755 -23952
16602b3952J3177n467J0643K0778l099N94q576r829l4654r631L408J5220O586
$$ -23952 -10775 -16242 -5599 15179 12080 12674 4098 -5731 -40385 -50016 -46608 -31388 -24802
16589b4802J0239K4140L699K381J1359K7898J4175j3698L0745K4934J2896M0273
$$ -24802 -14563 9577 13276 15657 27016 54914 69089 55391 86136 111070 123966 164239
16577A64239M6035O5772J7095O964J0739j4912q209l0985n5052o2277m7855M265
$$ 164239 210274 276046 293141 300105 310844 295932 287723 256738 201686 139409 91554 95819
16565I5819j4671j6707L9353J3499m844k0258k1972J960k4316m3092J1227J5824
$$ 95819 81148 64441 103794 117293 112449 92191 70219 72179 47863 4771 15998 31822
16553C1822l778P838r117j4124m280K0852J9845j9395o547k4947k7938K0435K6566
$$ 31822 28044 35882 26765 12641 8361 29213 49058 29663 23116 -1831 -29769 -9334 17232
16540A7232k0977N870J4974O970J6553j2362l7082R877J6207J1709K9766K3553
$$ 17232 -3745 2125 17099 24069 40622 28260 -8822 1055 17262 28971 58737 82290
16528H2290k551J4717K1255J2359N763L5352J7851J6056J7427K0628L6279J6057
$$ 82290 79739 94456 115711 128070 133833 169185 187036 203092 220519 241147 277426 293483
16516B93483k9594l5473o5642j9180j2258k4848l5411l4633O353j8690q340K2796
$$ 293483 263889 228416 162774 143594 131336 106488 71077 36444 42797 24107 15767 38563
16504C8563M80r915n980M732J7936J5227J3786l8815k8286n745N77l3322J0414
$$ 38563 39043 29128 23148 27880 45816 61043 74829 36014 7728 1983 2560 -30762 -20348
16491b0348K8498o295J4166O55j6118j3081j4674J0674M1198J6928P353p376J554
$$ -20348 8150 1855 16021 16676 558 -12523 -27197 -16523 24675 41603 48956 41580 43134
16478D3134P777R96k1960j9513Q89O077p437Q118J8937r557p485j5237P534j5618
$$ 43134 50911 51907 29947 10434 11323 17400 9963 18081 37018 27461 19976 4739 12273 -3345
16464c345J347k0689j8981Q339K1788K5136J1207K0727m1142j1759J1922L6886
$$ -3345 -1998 -22687 -41668 -33329 -11541 13595 24802 45529 4387 -7372 4550 41436
16452D1436L5373l2083m0607p643M500k3122j1416K0246J9491j4289j715J9650
$$ 41436 76809 44726 4119 -3524 976 -22146 -33562 -13316 6175 -8114 -9829 9821
16440I821q471J6275j852R538Q574N352j0873Q68q343l576J5512M991m890j4984
$$ 9821 1350 17625 15773 25311 33885 39237 28364 29232 20889 17313 32825 37816 32926 17942
16426A7942k5892k2395K1960J6243R319J1707j0450j258j4896k1612Q052l8596
$$ 17942 -7950 -30345 -8385 7858 17177 28884 18434 17176 2280 -19332 -11280 -49876
16414d9876N828K4890j236K14K3099P735r362J2522p74j7475k0682Q537N32O181
$$ -49876 -44048 -19158 -20394 -20180 2919 10654 1292 13814 13040 -4435 -25117 -16580 -16048 -9867
16400i867J0544m993K176J0099k1017k1171K2064L1865j1853L86j1491J7975j4399
$$ -9867 677 -4316 -2140 7959 -13058 -34229 -12165 19700 7847 8233 -3258 14717 318
16387C18L725J6489l6422j0574p037L4645K4293J0286l2645j4324J1880O634r409
$$ 318 4043 20532 -15890 -26464 -33501 1144 25437 35723 3078 -11246 634 7268 -2141
16374b141K57q165P463J5861J9030J4843M2090k3107l7704M780K4119K287j8n984
$$ -2141 -1884 -10049 -2586 13275 32305 47148 89238 66131 28427 33207 57326 59613 59595 53611
16360E3611j8422J5662j7959k6211J493r729j5654j5816n43j115N219m83p22l768
$$ 53611 35189 50851 32892 6681 8174 -1555 -17209 -33025 -33568 -34683 -29464 -29947 -30669 -34437
16346c4437J4844j0805O80L2982J3834q85L845j5718r126J7359J9056K3760j9877
$$ -34437 -19593 -30398 -29718 3264 17098 16213 20058 4340 -4786 12573 31629 55389 35512
16333C5512k5825M304r235l569O803q591L1092k5245O331p318j4797k0162M023
$$ 35512 9687 13991 4756 1187 7990 -601 30491 5246 11577 4259 -10538 -30700 -26677
16320b6677K2330L70K847J2189P894Q865k4015J1540m389j7110l163k6970O269
$$ -26677 -4347 -3977 -1130 11059 18953 27818 3803 15343 10954 -6156 -9319 -36289 -30020
16307c0020O856K948L1399j5196k2484k5401L873k2423k493K6825L9566j6050
$$ -30020 -23164 -20216 11183 -4013 -26497 -51898 -48025 -70448 -72941 -46116 -6550 -22600
16295b2600q43j1949m3132k783L9644k1495j0764M346N2120q833J584N167k0445
$$ -22600 -23443 -35392 -78524 -81307 -41663 -63158 -73922 -69576 -17456 -26289 -24705 -19538 -39983
16282c9983L587L0420N2123m5702k5781j2684J5821O916M501m935j262J6681J8068
$$ -39983 -36396 -5976 46147 445 -25336 -38020 -22199 -15283 -10782 -15717 -16979 -298 17770
16269A7770k675j943j3925M465L8128n64k0027j0686J7471k2165p527j588j0043
$$ 17770 15095 13152 -773 3692 41820 41256 21229 10543 28014 5849 -1678 -3266 -13309
16256a3309l0318M855L5816K7668n40m6061j5668M930J7132J1190l936J0822J8423
$$ -13309 -43627 -38772 -2956 24712 24172 -21889 -37557 -32627 -15495 -4305 -8241 2581 21004
16243B1004l981k6629j6967J2475K2790P495k4832j3394P111k73K0770O615l4107
$$ 21004 17023 -9606 -26573 -14098 8692 16187 -8645 -22039 -14928 -15201 5569 12184 -21923
16230b1923r086j8210J4113M9596K3603j9454l3737l3859j6650K9111J5452j1667
$$ -21923 -31009 -49219 -35106 14490 38093 18639 -15098 -48957 -65607 -36496 -21044 -32711
16218c2711J1253L807m724k1999k6643K851K0389L808K8493J5740j4608M0889
$$ -32711 -21458 -17651 -22375 -44374 -71017 -68166 -47777 -43969 -15476 264 -14344 26545
16206B6545R68n829q037J920J4387Q858m761j7703J5519R992j1187k3237M797
$$ 26545 27513 21684 13647 15567 29954 38812 34051 16348 31867 41859 30672 7435 12232
16193A2232j8161k6713J4944M430N151n355o25K733J6770R767L927q881J5525
$$ 12232 -5929 -32642 -17698 -13268 -8117 -13472 -14097 -11364 5406 15173 19100 10219 25744
16180B5744j3098k4988j6792K1910M6561l058j4445p286j6668j9504J9845q320
$$ 25744 12646 -12342 -29134 -7224 39337 36279 21834 14548 -2120 -21624 -1779 -10099
16168a0099Q039O273J0615j5550K5812j246k6263j3831J84J8956J4673J1464j3602
$$ -10099 -2060 4213 14828 -722 25090 23844 -2419 -16250 -16066 2890 17563 29027 15425
16155A5425k991J328J0109M731p688R994l0238k0924q182j2421L7249K9120k0226
$$ 15425 12434 13762 23871 28602 20914 30908 670 -20254 -28436 -40857 -3608 25512 5286
16142E286j9671j355J5030k2452j5075J8798Q948K9810j07j3132L577j12j1777
$$ 5286 -14385 -15740 -710 -23162 -38237 -19439 -10491 19319 19212 6080 9657 9545 -2232
16129b232J0773J3273n913O243j3223K843M62O593K1878o476q959j651Q762k973
$$ -2232 8541 21814 15901 22144 8921 11764 12226 18819 40697 34221 25262 23611 32373 29400
16115B9400m0239k7447j0622L2429O812K6206K0548O298j7818k6937n051k007
$$ 29400 -10839 -38286 -48908 -16479 -9667 16539 37087 43385 25567 -1370 -6421 -8428
16103h428L637L0534Q124k2012j5418l2659O862J8235O956L0752n532k1372O371
$$ -8428 -4791 25743 33867 11855 -3563 -36222 -29360 -11125 -4169 26583 21051 -321 6050
16090F050J2362j0429j8373J1210l256j914M215N269o638O284J4673k4745k1870
$$ 6050 18412 7983 -10390 820 -2436 -4350 -135 5134 -1504 4780 19453 -5292 -27162
16077b7162K6695N126o901j617l1312M66R830J5106K9837J3463l923k8386J9628
$$ -27162 -467 4659 -2242 -3859 -35171 -34705 -24875 -9769 20068 33531 29608 1222 20850
16064B0850J5161o128m143K4400j8873l8490j4234M373o00K6352l756r188k3803
$$ 20850 36011 29883 25740 50140 31267 -7223 -21457 -17084 -17684 8668 4912 -4276 -28079
16051b8079N466L1582K8640L4387Q69k225j9252N419q764J0544Q965k1322k8812
$$ -28079 -22613 8969 37609 71996 72865 70640 51388 56807 48043 58587 67552 46230 17418
16038A7418k7809k6446j0096j587m888Q686P293J6996o965k8364m882J1107K3943
$$ 17418 -10391 -36837 -46933 -48520 -53408 -44722 -37429 -20433 -27398 -55762 -60644 -49537 -25594
16025b5594l068k3662j2173p344L5318k939p296M613M1954L3482j9515j3252J9473
$$ -25594 -28662 -52324 -64497 -71841 -36523 -39462 -46758 -42145 -191 33291 13776 524 19997
16012A9997P804K7560k6293k41j9644j9411l802j8417J0304L1584l2739k4419
$$ 19997 27801 55361 29068 28827 9183 -10228 -14030 -32447 -22143 9441 -23298 -47717
16000d7717J8327q797L5135R980k232J2956O37j3050L042J0405J7589j956k9984
$$ -47717 -29390 -38187 -3052 6928 4696 17652 18289 5239 8281 18686 36275 34319 4335
15987D335k2244O786k5673j4076K2688l5005m633K3269J2148K1440j195k2167
$$ 4335 -17909 -11123 -36796 -50872 -28184 -63189 -67822 -44553 -32405 -10965 -12160 -34327
15975c4327M61l522P605q131M232L239L506K0493j5416j2947j4681M1922l120
$$ -34327 -33866 -37388 -29783 -37914 -33682 -30443 -26937 -6444 -21860 -34807 -49488 -7566 -10686
15962a0686k2091l403j501l648K0144J1487j7974k1080L0538L2872j8632k5622
$$ -10686 -32777 -36180 -37681 -41329 -21185 -9698 -27672 -48752 -18214 14658 -3974 -29596
15950b9596k4110L205M2063K2881K1586J0815k2306j1833K368k9403n405O446
$$ -29596 -53706 -50501 -8438 14443 36029 46844 24538 12705 15073 -14330 -19735 -13289
15938a3289J2773J7327J3488j4094j1652k3053r604K4760J4638j3014m27O037
$$ -13289 -516 16811 30299 16205 4553 -18500 -28104 -3344 11294 -1720 -2147 3890
15926C890n740l2879j6346J5262L370M914K4688J7665r627K205j1171o522j646
$$ 3890 -1850 -34729 -51075 -35813 -32443 -27529 -2841 14824 5197 7402 -3769 -10291 -11937
15913a1937n228R211l422j8809J9436O575n504J0418M918N535J1240J6015l5761
$$ -11937 -17165 -7954 -11376 -30185 -10749 -4174 -9678 740 5658 11193 22433 38448 2687
15900B687k7711M373j6410J3685j4775P59K713l973J5540R532j308K4911Q196
$$ 2687 -25024 -20651 -37061 -23376 -38151 -37392 -34679 -38652 -23112 -13580 -14888 10023 18219
15887A8219m491r236k190p806K979k213J0662j3836l373K7956j1659j7394l5086
$$ 18219 13728 4492 2302 -5504 -2525 -4738 5924 -7912 -11285 16671 5012 -12382 -47468
15874d7468J168j817M4025j2952j7567L1237L6186j341P198K0383l9697l9403
$$ -47468 -46300 -48117 -4092 -17044 -34611 -3374 32812 31471 38669 59052 19355 -20048
15862b0048M492J8762L1005K906q574P361j1405L600j5330k929M1741l848k8313
$$ -20048 -15556 3206 34211 37117 28543 35904 24499 28099 12769 9840 51581 47733 19420
15849A9420j6635j3152Q192n310l1277m760J9494K482o236J3836J7030P411k334
$$ 19420 2785 -10367 -2175 -7485 -38762 -43522 -24028 -21546 -27782 -13946 3084 10495 8161
15836H161k2429O64r63K455J240K1022J6570J0898j5782m0549k1434J5007K7525
$$ 8161 -14268 -13604 -14567 -12112 -10872 10150 26720 37618 21836 -18713 -40147 -25140 2385
15823B385j2914k38j7897p279K9203L671k537N655K541j1003n772j7090j442K1348
$$ 2385 -10529 -10767 -28664 -35943 -6740 -3069 -5606 49 2590 -8413 -14185 -31275 -32717 -11369
15809a1369R767Q575M113k0417l682j0505j5063j6328o70K975K506K300j1365
$$ -11369 -1602 6973 11086 -9331 -13013 -23518 -38581 -54909 -55579 -52604 -50098 -47798 -59163
15796e9163l535J2727K8657m467K9120M2776j6405k6623K5949k3011k8018k1760
$$ -59163 -62698 -49971 -21314 -25781 3339 46115 29710 3087 29036 6025 -21993 -43753
15784d3753j8759L4457K9508L2321J1610n125j1883k0598k0928L634J569n175
$$ -43753 -62512 -28055 1453 33774 45384 40259 28376 7778 -13150 -9516 -7947 -13122
15772a3122K8679j4312l3420K2475K7388l1266M221K0617L63p295J2960q62k562
$$ -13122 15557 1245 -32175 -9700 17688 -13578 -9357 11260 11623 4328 17288 16426 13864
15759A3864K0688j7469J3355J1890q047j2738j2675K3832j1852L191j8540k1148
$$ 13864 34552 17083 30438 42328 34281 21543 8868 32700 20848 24039 5499 -15649
15747a5649j7773k3559N892j91O135K4027K3030o711k9767j3945j594J5967R841
$$ -15649 -33422 -56981 -51089 -51280 -45145 -21118 1912 -4799 -34566 -48511 -50105 -34138 -24297
15734b4297M739K1668J8957j1600K431m375J3756j9614n694j3176k0863k0094
$$ -24297 -19558 2110 21067 9467 11898 7523 21279 1665 -4029 -17205 -38068 -58162
15722e8162J3541J7132k027L4283M2778R291q497j9834J2645o252l1093j2953
$$ -58162 -44621 -27489 -29516 4767 47545 56836 48339 28505 41150 34898 3805 -9148
15710i148J6312j0902k9119K2777p15j3003l273L1306P269J936k2920O93K359
$$ -9148 7164 -3738 -32857 -10080 -10795 -23798 -27071 4235 11504 13440 -9480 -8787 -6428
15697f428L0097L0002k0428j8575j242K7165k1673k3076P432k3047J0855L1411
$$ -6428 23669 53671 33243 14668 13426 40591 18918 -4158 3274 -19773 -8918 22493
15685B2493q2j0574J8820K8285L891q035j8957j2310J9250k1516M499J8879j0922
$$ 22493 22411 11837 30657 58942 62833 54798 35841 23531 42781 21265 25764 44643 33721
15672C3721j2823m109l7916k0204J4053L9809p537m8105j5549L6576r177L8010
$$ 33721 20898 16789 -21127 -41331 -27278 12531 4994 -43111 -58660 -22084 -31261 6749
15660F749J426j6293o744K190M838L2204q618m7825j6123K8702j653K3540k7259
$$ 6749 8175 -8118 -14862 -12672 -7834 24370 15752 -32073 -48196 -19494 -21147 2393 -24866
15647b4866r055j668K484K0089K5066n382J3606P339p415K609n191m4517k2303
$$ -24866 -33921 -35589 -33105 -13016 12050 6668 20274 27613 20198 22807 17616 -26901 -49204
15634d9204M372j1004o436j934K1339M1198J7493M663j695k2351j6501j6907k1619
$$ -49204 -44832 -55836 -62272 -64206 -42867 -1669 15824 20487 18792 -3559 -20060 -36967 -58586
15621e8586J0222j1596L6790J2655K4524k5943m1616l247o60j4739J1470L1271
$$ -58586 -48364 -59960 -23170 -10515 14009 -11934 -53550 -56797 -57457 -72196 -60726 -29455
15609b9455K2811J6820L5072k2844k9996p443L2980k7422k5304J0759K8325j1648
$$ -29455 -6644 10176 45248 22404 -7592 -15035 17945 -9477 -34781 -24022 4303 -7345
15597g345k378J9885K104n381r562l4008j6935J1955L1729J1464r621J6338J1244
$$ -7345 -9723 10162 12266 6885 -2677 -36685 -53620 -41665 -9936 1528 -8093 8245 19489
15584A9489j0690j927k79P555N414j723j8224j1837k1779k0522K9294K863J318
$$ 19489 8799 6872 6593 14148 19562 17839 -385 -12222 -34001 -54523 -25229 -22366 -21048
15571b1048o624k3049O984j3064j1437K6566J9871j4510r436J0261N462M585j2840
$$ -21048 -27672 -50721 -43737 -56801 -68238 -41672 -21801 -36311 -45747 -35486 -30024 -25439 -38279
15558c8279K9152L399o486J9984K2095j6745j9089P359J1112K859k0590J1742
$$ -38279 -9127 -5728 -12214 7770 29865 13120 -5969 1390 12502 15361 -5229 6513
15546F513J7936k6745l3412j2326J5094J1582K302J0356j8400k2700R529k186
$$ 6513 24449 -2296 -35708 -48034 -32940 -21358 -19056 -8700 -27100 -49800 -40271 -42457
15534d2457R934J7178j6706K12m399Q204Q643K2990M922L375r240J238l023N926
$$ -42457 -32523 -15345 -32051 -31839 -36238 -28034 -19391 3599 8521 11896 2656 3894 871 6797
15520F797K4692J5525J928j0534j6185j7183j5407l906j7000K3088K4985J6748
$$ 6797 31489 47014 48942 38408 22223 5040 -10367 -14273 -31273 -8185 16800 33548
15508C3548K5609k628K444k367j3990m214l1752m4755l0080J8638L6527J1951
$$ 33548 59157 56529 58973 56606 42616 38402 6650 -38105 -68185 -49547 -13020 -1069
15496a069j3447j7942n484M8251J0306j4326J1269j7957k5501J1284P460J4803
$$ -1069 -14516 -32458 -37942 10309 20615 6289 17558 -399 -25900 -14616 -7156 7647
15484G647Q907k2537j5343j3662K7686K7017m525o754k2254N611R654M2321O710
$$ 7647 16554 -5983 -21326 -34988 -7302 19715 15190 8436 -13818 -8207 1447 43768 50478
15471E0478m0055j3501q462K8725L2215j459n499k0527k529k415k5020j1686o906
$$ 50478 10423 -3078 -11540 17185 49400 47941 42442 21915 19386 16971 -8049 -19735 -26641
15458b6641M7759r421J4273K835j8415k4223j2194J3283K7678l4088j2249K3135
$$ -26641 21118 11697 25970 28805 10390 -13833 -26027 -12744 14934 -19154 -31403 -8268
15446h268P021M678k3092J7445n337R491j8709O03l806l5159j0658Q859J656K1928
$$ -8268 -1247 3431 -19661 -2216 -7553 1938 -16771 -16168 -19974 -55133 -65791 -56932 -55276 -33348
15432c3348R232K1814J1439j980j3640J2292K0722k9770o177P782o437Q672K5222
$$ -33348 -24116 -2302 9137 7157 -6483 5809 26531 -3239 -9416 -1634 -8071 601 25823
15419B5823k3905j4909j1704n577L7311m955j4786L4716J3993J3407j6015M130
$$ 25823 1918 -12991 -24695 -30272 7039 2084 -12702 22014 36007 49414 33399 37529
15407C7529j951k6936j8206P665M7680r400l8408l009o07q457L637K5925K634
$$ 37529 35578 8642 -9564 -1899 45781 36381 -2027 -5036 -5643 -14100 -10463 15462 18096
15394A8096q106L386J9050M86l570J5238o551N509O963l2915k9428r806R464J0735
$$ 18096 9990 13376 32426 32912 29342 44580 38029 43538 50501 17586 -11842 -21648 -12184 -1449
15380a449R308J8363j4892R673O805R358n591j8637J5325o460M952J5238j5729
$$ -1449 7859 26222 11330 21003 27808 37166 31575 12938 28263 21803 26755 41993 26264
15367B6264k7530m731j1712k4610K190K4960o199j8816J9657K8127p777N841q024
$$ 26264 -1266 -5997 -17709 -42319 -40129 -15169 -21368 -40184 -20527 7600 -177 5664 -2360
15354b360j0114R042o367j1216k0443m0073J4M3370L5907J9035j0877k8579l0709
$$ -2360 -12474 -3432 -9799 -21015 -41458 -81531 -81517 -38147 -2240 16795 5918 -22661 -53370
15341e3370j5687K1190o336l944j1776o620J9701K5889K1620j1016k2410j0725
$$ -53370 -69057 -47867 -54203 -58147 -69923 -76543 -56842 -30953 -9333 -20349 -42759 -53484
15329e3484k028M186K4191L250k2180N660R210M639O6J2619o504Q362m859J7223
$$ -53484 -55512 -51326 -27135 -23885 -46065 -40405 -31195 -26556 -26490 -13871 -20375 -12013 -16872 351
15315C51P902K9788L57l2197k9033J7354k764N936p798j2187L6084M5415m4430
$$ 351 8253 38041 38398 6201 -22832 -5478 -8242 -2306 -10104 -22291 13793 59208 14778
15302A4778l3759N366n976L755j157R313J7148j0550Q844j3009O371J4710J5811
$$ 14778 -18981 -13615 -19591 -15836 -16993 -7680 9468 -1082 7762 -5247 1124 15834 31645
15289C1645k2966j8618l2050R369j6762K4248Q355p380j5948K1516K9591J4348
$$ 31645 8679 -9939 -41989 -32620 -49382 -25134 -16779 -24159 -40107 -18591 11000 25348
15277B5348j5440j3498m218p505R599K9892r244l1917j924r432L20m532K9873
$$ 25348 9908 -3590 -7808 -15313 -5714 24178 14934 -16983 -18907 -28339 -28019 -32551 -2678
15264b678K7315l803j7866L2262O55k6644Q289J624r342J5005j7392k153j100
$$ -2678 24637 20834 2968 35230 35885 9241 17530 19154 9812 24817 7425 5272 4172
15251D172k4516O11n435J2962K5616j7240P251o576j2391j4347O309J1727l717
$$ 4172 -20344 -19733 -25168 -12206 13410 -3830 3421 -3155 -15546 -29893 -23584 -11857 -15574
15238a5574M6645k4519j1349J5238k8831j8327J470m916K6234R350j3080J7020
$$ -15574 31071 6552 -4797 10441 -18390 -36717 -35247 -40163 -13929 -4579 -17659 -639
15226f39r230q760j4094K070Q713J1675J9296K2385j2064r943N775N245J4158
$$ -639 -9869 -18629 -32723 -30653 -21940 -10265 9031 31416 19352 9409 15184 20429 34587
15213C4587r090n92J5046l2136k9913q6J3790J6169K6499l15m1065J9314P525
$$ 34587 25497 24905 39951 7815 -22098 -22184 -8394 7775 34274 33959 -7106 12208 19733
15200A9733m5928m1356M883L5663J3091K1284J0708k2421Q461K718j0044l5887
$$ 19733 -26195 -67551 -62668 -27005 -13914 7370 18078 -4343 4118 6836 -3208 -39095
15188c9095O785O087K2643R298j7509K8066J0497J0014L3193j4225j1864k1255
$$ -39095 -32310 -26223 -3580 5718 -11791 16275 26772 36786 69979 55754 43890 22635
15176B2635l916K0874l4982N995L60j2359p975p471K6314Q301k7367q138M981
$$ 22635 18719 39593 4611 10606 10966 -1393 -9368 -16839 9475 17776 -9591 -17729 -12748
15163a2748J5965J1958j1686j6810k8276o241j3959R793L9182J0243r77J4627
$$ -12748 3217 15175 3489 -13321 -41597 -47838 -61797 -52004 -12822 -2579 -3556 11071
15151A1071j8072m559j291k6793j0698L5039K675Q59P431k237j7837k6979J1992
$$ 11071 -7001 -11560 -12851 -39644 -50342 -15303 -12628 -11769 -4338 -6575 -24412 -51391 -39399
15138c9399L0793J3614K939p106J0540J5784l4099M692M847r313l8901k1367L4979
$$ -39399 -8606 5008 7947 841 11381 27165 -6934 -2242 2605 -6708 -45609 -66976 -31997
15125c1997l686k462L7769j3006J426J1529l209K5170o88k663l113q196J673M621
$$ -31997 -35683 -38145 -376 -13382 -11956 -427 -3636 21534 20846 18183 15070 6874 8547 13168
15111A3168j037R267K831K0753L5075k6937l7936j3864n314k6531N62J8215O012
$$ 13168 12131 21398 24229 44982 80057 53120 15184 1320 -3994 -30525 -29963 -11748 -5736
15098e736J937J161m638Q342k0202j0627q160k215o50L0834O739O678j8036K4403
$$ -5736 -3799 -2638 -7276 1066 -19136 -29763 -37923 -40138 -40788 -9954 -3215 3463 -14573 9830
15084I830P405j8419j7292K3816k4789m188K0049L0792r347m3988k4631J1266
$$ 9830 17235 -1184 -18476 5340 -19449 -23637 -3588 27204 17857 -26131 -50762 -39496
15072c9496O21J5819l9J6287J8189J6166J6908m2884k7162P375J6963P572j5809
$$ -39496 -38875 -23056 -23095 -6808 11381 27547 44455 1571 -25591 -18216 -1253 6319 -9490
15059i490j1872K8912j3219k60R808J6403J0511k4791k0291J7297J2121J7114
$$ -9490 -21362 7550 -5669 -5929 3879 20282 30793 6002 -14289 3008 15129 32243
15047C2243J2941J4082k6053k6880j7126j4035J2321j326m933L2225L4312J0035
$$ 32243 45184 59266 33213 6333 -10793 -24828 -12507 -13833 -18766 13459 47771 57806
15035E7806J2893l4974K6085O041j5882k100j0378l2830O339O722M237L7J0100
$$ 57806 70699 35725 61810 67851 51969 49869 39491 6661 13000 19722 23959 23996 34096
15022C4096q554m587J2630j824l060j8781m1943j4052k71L0427J9267K8683N6766
$$ 34096 25542 20955 33585 31761 28701 9920 -32023 -46075 -46346 -15919 3348 32031 88797
15009H8797J903K7072O4509Q1949O0891J6248K561P254j513J3008l2214q3126
$$ 88797 90700 117772 182281 264230 325121 341369 343930 351184 349671 362679 330465 247339
14997B47339p1850k0899k9039l5699l8658N471K8292k5884j4621k771j3485J6593
$$ 247339 175489 154590 125551 89852 51194 56665 84957 59073 44452 41681 28196 44789
14985D4789k5991j4989k3627j8711m335L0495j2510p117J4879j0819J2581o496
$$ 44789 18798 3809 -19818 -38529 -42864 -12369 -24879 -31996 -17117 -27936 -15355 -21851
14973b1851k0469M131J3329M530J1750j3607j157P034k1447m825J0077J8445L4437
$$ -21851 -42320 -38189 -24860 -20330 -8580 -22187 -23344 -16310 -37757 -42582 -32505 -14060 20377
14960B0377O573l1846j6189l152j7629K8096q949n120L15Q373K1177J0092P602
$$ 20377 26950 -4896 -21085 -24237 -41866 -13770 -22719 -27839 -27524 -19151 2026 12118 19720
14947A9720J8157J6717K4795k7149k9222j0435j503J896M487j0804o04J8471j0000
$$ 19720 37877 54594 79389 52240 23018 12583 11080 12976 17463 6659 6055 24526 14526
14934A4526k1286N627M084m7470o515K3390o354J0196K0771J5680j031k5726k5045
$$ 14526 -6760 -1133 2951 -44519 -51034 -27644 -33998 -23802 -3031 12649 11618 -14108 -39153
14921c9153J2839K7099l0145m66j6210l326J5969M7030J0238J6262O839j4882
$$ -39153 -26314 785 -29360 -29826 -46036 -49362 -33393 13637 23875 40137 46976 32094
14909C2094k2995j0602L1788J3082M193l716l2791l254m950n789Q805K2750l7102
$$ 32094 9099 -1503 30285 43367 47560 43844 11053 7799 2849 -2940 5865 28615 -8487
14896h487k3044K0051N335K3050n485j6509K2436L4878L619k3966j5846r552j3484
$$ -8487 -31531 -11480 -6145 16905 11420 -5089 17347 52225 55844 31878 16032 6480 -7004
14883g004J6632r591K5684J1728k0781j8822k2875L1452p239J6473J0756k333
$$ -7004 9628 37 25721 37449 16668 -2154 -25029 6423 -816 15657 26413 24080
14871B4080N513m6054m700K523r463j7669J0808P616j0899J36M2551j4372k4123
$$ 24080 29593 -16461 -21161 -18638 -28101 -45770 -34962 -27346 -38245 -38109 4442 -9930 -34053
14858c4053o144r669k339P094l7526L0294K4894k2204K671K3943L1999K0221j2888
$$ -34053 -40197 -49866 -52205 -45111 -82637 -52343 -27449 -49653 -46982 -23039 8960 29181 16293
14845A6293m2561J3310J1925K9030J3879l3471J1141l034J1798Q073k0138r814
$$ 16293 -26268 -12958 -1033 27997 41876 8405 19546 16512 28310 36383 16245 6431
14833F431j5114k302k2569L1437K0324k5410l9474p347l95k2731J9086K2479K3369
$$ 6431 -8683 -10985 -33554 -2117 18207 -7203 -46677 -54024 -54419 -77150 -58064 -35585 -12216
14820a2216k4558Q037L9461K0811K0937p90l9706L172J1675j2667j1420j2871
$$ -12216 -36774 -28737 10724 31535 52472 51682 11976 15148 26823 14156 2736 -10135
14808a0135O844J4375N970q447N547R263k4265O098K3419j367J6826j0347k6536
$$ -10135 -3291 11084 17054 8607 14154 23417 -848 5250 28669 27302 44128 33781 7245
14795G245k7485J0246q066k499O327J1289m430n655J4359K8142j6979k2419J1305
$$ 7245 -20240 -9994 -18060 -20559 -14232 -2943 -7373 -13028 1331 29473 12494 -9925 1380
14782A380p843l8290K0333L6981L6098J6609l0571k6568l823j666k1885M83K915
$$ 1380 -6463 -44753 -24420 12561 48659 65268 34697 8129 4306 2640 -19245 -18762 -15847
14769a5847R118j740N513Q157l4507p041L969K9225L2859l841k0706l6866k1484
$$ -15847 -6729 -8469 -2956 5201 -29306 -36347 -32378 -3153 29706 25865 5159 -31707 -53191
14756e3191J4035L4787K972J9931N941j8658O575m954J4941k109j2968j4930n129
$$ -53191 -39156 -4369 -1397 18534 24475 5817 12392 7438 22379 20270 7302 -7628 -12757
14743a2757K8833j0386l3774k9290K2348J2198o399J368K074L903O529j7083K788
$$ -12757 16076 5690 -28084 -57374 -35026 -22828 -29227 -27859 -25785 -21882 -15353 -32436 -29648
14730b9648M569K7973J0273k3358j5634j78L7946J7864r813n885j1643k6006J690
$$ -29648 -25079 2894 13167 -10191 -25825 -26003 11943 29807 19994 14109 2466 -23540 -21850
14717b1850J192L3110j5744n347o560Q065l412J819J1078q248O785r26m168j7679
$$ -21850 -20658 12452 -3292 -8639 -15199 -7134 -10546 -8727 2351 -5897 888 -38 -4206 -21885
14703b1885j3620N840P742K3002L1320k812j9626n644r468K8033J5911j3907j5098
$$ -21885 -35505 -29665 -21923 1079 32399 29587 9961 4317 -5151 22882 38793 24886 9788
14690I788j4464J2113n667k2355J4200J1101j8032l066o118j4949J2838J2486
$$ 9788 -4676 7437 1770 -20585 -6385 4716 -13316 -16382 -22500 -37449 -24611 -12125
14678a2125k9526k967L7055K2200J107m358m9549k2736R313K5053m101k5238L3129
$$ -12125 -41651 -44618 -7563 14637 15744 11386 -38163 -60899 -51586 -26533 -30634 -55872 -22743
14665b2743L4951k4281K6380J549j4585M867l851M599n195K4689l9521K6923j3920
$$ -22743 12208 -12073 14307 15856 1271 6138 2287 6886 1691 26380 -13141 13782 -138
14652a38K743K0765K801q852k8123K1852k655p082L2506L744K011j6060J5531
$$ -138 2605 23370 26171 17319 -10804 11048 8393 1311 33817 37561 39572 23512 39043
14639C9043L1054k984o1473l3029j606P072o74J9043J3474m307J7084j6087m886
$$ 39043 70097 67113 5640 -27389 -28995 -21923 -22597 -3554 9920 5613 22697 6610 1724
14626A724R996j5023J7737j3272k9109j8655j1195K0905K8694j0793j6996N958
$$ 1724 11720 -3303 14434 1162 -27947 -46602 -57797 -36892 -8198 -18991 -35987 -30029
14614c0029K5337M5776r417l1195K606N947j7366m147k0638o879J6317j0145J3950
$$ -30029 -4692 41084 31667 472 3078 9025 -8341 -12488 -33126 -40005 -23688 -33833 -19883
14601a9883l964P317l380K7380K1245J7531l0752k2154O178M2753n552l7732k4216
$$ -19883 -23847 -16530 -19910 7470 28715 46246 15494 -6660 -482 42271 36719 -1013 -25229
14588b5229L6561R95j5159j9431j8987k7289p656J1937L0536L863Q128j9205j2456
$$ -25229 11332 12327 -2832 -22263 -41250 -68539 -76195 -64258 -33722 -29859 -21731 -40936 -53392
14575e3392K364K7188l516K909L3924N259q62L352q845K5627J6349n039m1606
$$ -53392 -51028 -23840 -27356 -24447 9477 14736 13874 17226 8381 34008 50357 45318 3712
14562C712j4219J1369j2421j7976K805M169k569J1307R470K410O463k3580Q394
$$ 3712 -10507 862 -11559 -29535 -26730 -22561 -25130 -13823 -4353 -1943 4520 -19060 -10666
14549a0666J2690N980m858l5355j1086J3341J9923k725j3657M415K3868M575l2621
$$ -10666 2024 8004 3146 -32209 -43295 -29954 -10031 -12756 -26413 -21998 1870 6445 -26176
14536b6176N581R173n775L069n678k2574K6392K8170p31o337j4396j251J2866
$$ -26176 -20595 -11422 -17197 -14128 -19806 -42380 -15988 12182 11451 5114 -9282 -10533 2333
14523B333K8804j4237o705k5765L226J1738L0325l131j4276K6006K4634j6543
$$ 2333 31137 16900 10195 -15570 -12344 -606 29719 26588 12312 38318 62952 46409
14511D6409k7849k1818j316r33J8275J2972p218k7765l2717m372r026p697q212
$$ 46409 18560 -3258 -4574 -5507 12768 25740 18522 -9243 -41960 -46332 -55358 -63055 -71267
14498g1267m253J5045L3972J3990r871o637J0414j3302l3971J3396r891Q74J4059
$$ -71267 -75520 -60475 -26503 -12513 -22384 -29021 -18607 -31909 -65880 -52484 -62375 -61501 -47442
14485d7442N092j755J5704R494R121K1984J4179l783k3644K823K34k845k8038
$$ -47442 -42350 -44105 -28401 -18907 -9786 12198 26377 22594 -1050 1773 2007 -838 -28876
14472b8876l877O661j486N732k4353n544K2984k653k941J6985J2050Q087j0978
$$ -28876 -32753 -26092 -27578 -21846 -46199 -51743 -28759 -31412 -34353 -17368 -5318 2769 -8209
14459h209r861j6322n179N594J1481L7604R130J4292n580M28R640l1792k524J6465
$$ -8209 -18070 -34392 -39571 -33977 -22496 15108 24238 38530 32950 33378 43018 11226 8702 25167
14445B5167J2053l2060j9712J0967K0146p077j0453r329J6198K1134q717k2571
$$ 25167 37220 5160 -14552 -3585 16561 9484 -969 -10298 5900 27034 18317 -4254
14433d254l452k9826q258O627K5569j1178l2317K4072M0900K2753P132r06j8515
$$ -4254 -7706 -37532 -45790 -39163 -13594 -24772 -57089 -33017 7883 30636 37768 36862 18347
14420A8347N341K402J262L5167k2984l6757n1501l8499K1673L2646O581n602q71
$$ 18347 23688 26090 27352 62519 39535 2778 -48723 -87222 -65549 -32903 -26322 -31924 -32795
14407c2795L591l3699M888K8130L1936J4981J1547N650J0439l8353l0053J379
$$ -32795 -29204 -62903 -58015 -29885 2051 17032 28579 34229 44668 6315 -23738 -22359
14395b2359L0151L1383K625l1690j7814l2137P948M1433j5448j1535J6228l524
$$ -22359 7792 39175 41800 10110 -7704 -39841 -31893 9540 -5908 -17443 -1215 -4739
14383d739k0608M513j3485J8466N88n910N256J1063m487m196k0322P905K1245
$$ -4739 -25347 -20834 -34319 -15853 -15265 -21175 -15919 -4856 -9343 -13539 -33861 -25956 -4711
14370d711L8164J7624j4867k5162k2288Q482J5340J1449j5609m840l6820J8963
$$ -4711 33453 51077 36210 11048 -11240 -2758 12582 24031 8422 3582 -33238 -14275
14358a4275M0245j7965l5066j0154J0135L7922j6669r672l196K8919n760j8606
$$ -14275 25970 8005 -27061 -37215 -27080 10842 -5827 -15499 -18695 10224 4464 -14142
14346a4142k043K1786J672l8254L171J4697p704j91K598R747o475J2774L661K1490
$$ -14142 -16185 5601 7273 -30981 -27810 -13113 -20817 -21008 -18410 -8663 -15138 -2364 1297 22787
14332B2787k7450k7979N996J0442M125K6815m346J5483J2661N486k2053j5360
$$ 22787 -4663 -32642 -26646 -16204 -12079 14736 10390 25873 38534 44020 21967 6607
14320F607L1177k214k8497n389k6915n495R031Q198O609l828j1197l833K1916
$$ 6607 37784 35570 7073 1684 -25231 -30726 -21695 -13497 -6888 -10716 -21913 -25746 -3830
14307c830K0291J2632l2227l4769K5399K5059L849L136M30r694J7501r044j0548
$$ -3830 16461 29093 -3134 -37903 -12504 12555 16404 19540 19970 10276 27777 18733 8185
14294H185j6957n9L0070J1058M967K044j30k9230l7050Q307k5100l502J5353J6343
$$ 8185 -8772 -8831 21239 32297 37264 39308 39178 9948 -27102 -18795 -43895 -47397 -32044 -15701
14280a5701j2573j8124j8521q08L0726K3591K574j0542j582L7313l473k9893m1552
$$ -15701 -28274 -46398 -64919 -65727 -35001 -11410 -8836 -19378 -20960 16353 12880 -17013 -58565
14267e8565R447N5230l272q212J0064p057L7132k1161l3034M201j0831K3728J6337
$$ -58565 -49118 6112 2840 -5372 4692 -2365 34767 13606 -19428 -15227 -26058 -2330 14007
14254A4007K602P875Q782m3882j2319K5176J9589p118k8709l3676j3743Q091K6063
$$ 14007 16609 24484 33266 -10616 -22935 2241 21830 14712 -13997 -47673 -61416 -53325 -27262
14241b7262M6688Q976J568j6654j2109L920J7351O224J2035K7939m394j3459J9138
$$ -27262 19426 28402 29970 13316 1207 5127 22478 28702 40737 68676 64282 50823 69961
14228F9961j2689k4670m3072l2161j5891L769M2142J0409J5686L6903j1584j2003
$$ 69961 57272 32602 -10470 -42631 -58522 -54753 -12611 -2202 13484 50387 38803 26800
14216B6800J5881j5085r782Q987p938m4199J8065M4962p196p613j5653q627j8570
$$ 26800 42681 27596 17814 26801 18863 -25336 -7271 37691 30495 22882 7229 -1398 -19968
14203a9968P725p352J089P246J831J8485j1932J4915J4973j3706J622J9124N034
$$ -19968 -12243 -19595 -18506 -11260 -9429 9056 -2876 12039 27012 13306 14928 34052 39086
14190C9086m945l0069L158j1362k5543o859K5038L3550Q514J3002j0411j8374
$$ 39086 34141 4072 7230 -4132 -29675 -36534 -11496 22054 30568 43570 33159 14785
14178A4785m2054l9480r609J6505L5144j6016k2856K5784M672k6781Q465K7173
$$ 14785 -27269 -66749 -76358 -59853 -24709 -40725 -63581 -37797 -33125 -59906 -51441 -24268
14166b4268R340o07J7218j4836k8982l8627K4528L9639J5684j6071j4939K8736
$$ -24268 -14928 -15535 1683 -13153 -42135 -80762 -56234 -16595 -911 -16982 -31921 -3185
14154c185J3705J8926l090J9392j1606l0693m299N676M724M0088p932L466P995
$$ -3185 10520 29446 26356 45748 34142 3449 -850 4826 9550 49638 41706 45172 53167
14141E3167j224n596j8478J7698m571k0413k5577Q505J9291Q78L223k1270j4076
$$ 53167 51943 46347 27869 45567 40996 20583 -4994 3511 22802 23680 26903 5633 -8443
14128h443L3586j1677j6582J2902M3110J8707k5673l6462m0828r005K9606L4740
$$ -8443 25143 13466 -3116 9786 52896 71603 45930 9468 -31360 -40365 -10759 23981
14116B3981j0500m2770J9586K5532k1285M895K0494M721J0591P186k93n456p176
$$ 23981 13481 -29289 -9703 15829 -5456 -561 19933 24654 35245 42431 42138 36682 29506
14103B9506j6402l1449L940K99K3544Q080j5533p390k699j9230K467o54k4038
$$ 29506 13104 -18345 -14405 -14106 9438 17518 1985 -5405 -8104 -27334 -24867 -25521 -49559
14090d9559K6918L3954M790M278Q210N42m284k5263q140K5231J1655K9513K277
$$ -49559 -22641 11313 16103 20381 28591 29133 24849 -414 -8554 16677 28332 57845 60122
14077F0122k4023n955j6962m8009j25K3790m885M896L3348R746k9461k3208K1917
$$ 60122 36099 30144 13182 -34827 -34952 -11162 -16047 -11151 22197 31943 2482 -20726 1191
14064A191M8248k2779m3904k1390L708j0424M730k122l983K515J4713R26J7559
$$ 1191 49439 26660 -17244 -38634 -34926 -45350 -40620 -42742 -46725 -44210 -29497 -28571 -11012
14051a1012K2600k9367p71k3384j7228J1681k6738q098K3306K9003l230J1728
$$ -11012 11588 -17779 -18550 -41934 -59162 -47481 -74219 -82317 -59011 -30008 -33238 -21510
14039b1510K1602J6737l0490l409m757J494J9421J376k3736j173L2217j0805l0336
$$ -21510 92 16829 -13661 -17070 -21827 -20333 -912 464 -23272 -24445 7772 -3033 -33369
14026c3369M328R554N837L641M28k132o450p233j3831L4863L3734R892j5388l4689
$$ -33369 -29041 -19487 -13650 -10009 -9581 -11713 -18163 -25396 -39227 -4364 29370 39262 23874 -10815
14012a0815J159L6147Q129N99j1796l2263k889o374j1049L4252J4376j8568J7831
$$ -10815 -9656 26491 34620 35219 23423 -8840 -11729 -18103 -29152 5100 19476 908 18739
13999A8739M1547l784j1732J7813J3355j4883J0431j2087n2277j170j68J3773
$$ 18739 60286 56502 44770 62583 75938 61055 71486 59399 7122 5952 5784 19557
13987A9557r282r657O403J7193K8804L911j5123q451l4490k506J8356J6189O568
$$ 19557 10275 618 7021 24214 53018 56929 41806 33355 -1135 -3641 14715 30904 37472
13974C7472j1065J4175k886l6235k1225M2491K1620m259k198j2946j0810n398
$$ 37472 26407 40582 37696 1461 -19764 22727 44347 40088 37890 24944 14134 8736
13962H736K527J1271K9866L2761k0888l0086j2278N408L310k2748k318j65J8073
$$ 8736 11263 22534 52400 85161 64273 34187 21909 27317 30627 7879 5561 5396 23469
13949B3469k7557k2914M507J0688J6198K8187j175l8317k2066J7870j0014L800
$$ 23469 -4088 -27002 -22495 -11807 4391 32578 31403 -6914 -28980 -11110 -21124 -17324
13937a7324O568Q859j023j6164L3562J9219n59P276j8947j056l1978k01R997J0290
$$ -17324 -10756 -1897 -2920 -19084 14478 33697 33138 40414 21467 20411 -11567 -11768 -1771 8519
13923H519L0886J7170J8840q229j7497j7212k0032r979k1113j8543J0180L9929
$$ 8519 39405 56575 75415 67186 49689 32477 12445 2466 -18647 -37190 -27010 12919
13911A2919J2609K1746j4731k9811o382m900j6678N794K3551J3594L0860J3496
$$ 12919 25528 47274 32543 2732 -3650 -8550 -25228 -19434 4117 17711 48571 62067
13899F2067l4771j6986N741p364K6302j454k8893m4474Q542N2597J4141m158j0465
$$ 62067 27296 10310 16051 8687 34989 33535 4642 -39832 -31290 21307 35448 31290 20825
13886B0825l981K1697j2272K6653J7178k5926l022L055K4988N124J1333l6418
$$ 20825 16844 38541 26269 52922 70100 44174 41152 44207 69195 74319 85652 49234
13874D9234j4289R707k7193j6477J6059J7094p523k4099l147L1259K4943K3271
$$ 49234 34945 44652 17459 982 17041 34135 26612 2513 -634 30625 55568 78839
13862G8839m458k4533j9405o515R966J6127m989j1876l605P885K7361N239L0438
$$ 78839 74381 49848 30443 23928 33894 50021 45032 33156 29551 37436 64797 70036 100474
13849A00474J6430k6691k4203p156K3854l1734M74j7816J4172L1028K1788J1624
$$ 100474 116904 90213 66010 58854 82708 50974 51448 33632 47804 78832 100620 112244
13837A12244N694m046L8014K4275p038K6578P4157M6412J2867J5071J2521Q841
$$ 112244 117938 113892 151906 176181 169143 195721 269878 316290 329157 344228 356749 365590
13825C65590k5639j7645j5653k5706k9759l7913j5349R092J707K0767j069k838
$$ 365590 339951 322306 306653 280947 251188 213275 197926 207018 208725 229492 228423 225585
13813B25585J9350M0583J3109k9320K6943O0323K0476j8291O211J3664M1661M5669
$$ 225585 244935 285518 298627 269307 296250 356573 377049 358758 364969 378633 420294 465963
13801D65963K5661Q304l012m7422l8523K2351l626l5476k1794l4334l3097J2110
$$ 465963 491624 499928 496916 449494 410971 433322 429696 394220 372426 338092 304995 317105
13789C17105P012m820q144j7940l4850k1917q136q178J2579j6014j087K5983K2698
$$ 317105 324117 319297 311153 293213 258363 236446 228310 220132 232711 216697 215610 241593 264291
13776B64291r366L6555M4947M9208K6436J09o326l3732k2646k969m2398p5826
$$ 264291 254925 291480 336427 385635 412071 412180 405854 372122 349476 346507 304109 228283
13764B28283j4185O1j9161k3622Q910K6942l8528P855p454k7887k412j259q578
$$ 228283 214098 214159 194998 171376 180286 207228 168700 176555 169101 141214 138802 137543 128965
13751A28965o914n719q413L6224J9206k4202k0510K66q845r088j5891L9936J7987
$$ 128965 122051 116332 107919 144143 163349 139147 118637 118903 110058 100970 85079 125015 143002
13738A43002l3878J3071K0586J3375l0509l6338O360j5010N851P75k4781l604
$$ 143002 109124 122195 142781 156156 125647 89309 95669 80659 86510 87285 62504 58900
13726E8900J868J4K3338K3131K907m2351j2965J0859L8882J0179k7368q545j110
$$ 58900 60768 60782 84120 107251 110158 67807 54842 65701 104583 114762 87394 78849 77739
13713G7739M249Q198j0968r300j0267j5589k519K617j0658p380j7420N456J7239
$$ 77739 81988 90186 79218 69918 59651 44062 41543 44160 33502 26122 8702 14158 31397
13700C1397J5669N3026L6332l0097k8815k1397J8750J015q051K989K8597Q946
$$ 31397 47066 100092 136424 106327 77512 56115 74865 75880 67829 70818 99415 108361
13688A08361l2316l734o250j3215O064K545Q30k1164l0560j4625L881M4484J9012
$$ 108361 76045 72311 66061 52846 58910 61455 62285 41121 10561 -4064 -183 44301 63313
13675F3313L318j1081N111L6652M544j9698J9201o365O980K51j7102j6533N510
$$ 63313 66631 55550 60661 97313 101857 82159 101360 94995 101975 102226 85124 68591 74101
13662G4101j3254K5592R112J8176l4513k7654J3169M823K0629J1854K0364J5649
$$ 74101 60847 86439 95551 113727 79214 51560 64729 69552 90181 102035 122399 138048
13650A38048j9103l3043n943J9185n175M823K613j7397q257j8092j4165L4456
$$ 138048 118945 85902 79959 99144 93969 98792 101405 84008 75751 57659 43494 77950
13638G7950J0402l508j8040k156l1430J5025L3193J8193M4214r62l7691k4678
$$ 77950 88352 84844 66804 64648 33218 48243 81436 99629 143843 142881 105190 80512
13626H0512j2195k4862K4872L5892j5101j1142l325J1496L9031K6835R654m0248
$$ 80512 68317 43455 68327 104219 89118 77976 74651 86147 125178 152013 161667 121419
13614A21419k7322j882k0828J75j2116L792J3552J0943j0269j2516q577K9861
$$ 121419 94097 92215 71387 71562 59446 63238 76790 87733 77464 64948 56371 86232
13602H6232k2789k4568L0890L6486J6221J824M00k249K3337j9797j6152j2046
$$ 86232 63443 38875 69765 106251 122472 124296 124696 122447 145784 125987 109835 97789
13590I7789L386L6650l598j0327m344M92K82j027m745J2075l1410K718N2680j5717
$$ 97789 101175 137825 134227 123900 119556 120048 120330 119303 114558 126633 95223 97941 150621 134904
13576A34904o198N21r502K5046K0633k6920j005K9220o563l8437m1818j1145L5129
$$ 134904 128706 129227 119725 144771 165404 138484 137479 166699 160136 121699 79881 68736 103865
13563A03865N339P072N766j8798K5645o768L536J3718n671k1953k6200M364j6011
$$ 103865 109204 116276 122042 103244 128889 122121 125657 139375 133704 111751 85551 89915 73904
13550G3904P013n095j5745k5432l89Q685l412J4009K4267L083p184N65L9893K4375
$$ 73904 80917 75822 60077 34645 34256 42941 39529 53538 77805 80888 73704 74269 114162 138537
13536A38537J0731J2111r065r304m62j1434j3656l3980J8446L5259J4639j53l920
$$ 138537 149268 161379 152314 143010 142548 131114 117458 83478 101924 137183 151822 151669 147749
13523A47749L567J7898L4523M1302j814K4884K4220K0640N3774J1434j1487l9099
$$ 147749 151316 169214 203737 245039 243225 268109 292329 312969 366743 378177 366690 327591
13511C27591k9546j0403K0990K6919j1710R509j9607R649K4073M8488R462j6423
$$ 327591 298045 287642 308632 335551 323841 333350 313743 323392 347465 395953 405415 388992
13499C88992J4801n337k5593r158J3933J2436J4797K1586o711N6309M9058L0928
$$ 388992 403793 398456 372863 363705 377638 390074 404871 426457 419746 476055 525113 556041
13487E56041M2466L1266j3541J4736L4974K1043o0552m4298M560L3555j7062l8222
$$ 556041 598507 629773 616232 630968 665942 686985 626433 582135 586695 620250 603188 564966
13475E64966k4397J579q408m6916k7352R56K1998K447K6028R466M9851N6513J9030
$$ 564966 540569 542148 533740 486824 459472 460428 482426 484873 510901 520367 570218 626731 645761
13462F45761J2147K4250L47k787K3460n986l5961L000L774n9277o2030l9245K69
$$ 645761 657908 682158 682505 679718 703178 697192 661231 664231 668005 608728 546698 507453 507722
13449E07722l2014j8033M370l1560n660m314M1311j3222K0048K6987J0563K8030
$$ 507722 475708 457675 462045 430485 424825 420511 461822 448600 468648 495635 506198 534228
13437E34228N0228L2785K7471K6583O796M0877L1674O045R994R058j9713N732
$$ 534228 584456 617241 644712 671295 678091 718968 750642 756687 766681 775739 756026 761758
13425G61758q840l5555j5993J66L026Q44k8853o432L3302L6463L1231K4834J6478
$$ 761758 752918 717363 701370 701536 704562 705406 676553 670121 703423 739886 771117 795951 812429
13412H12429L4483K4681K6971Q1991O7715J8112K6719L8480M0478L0230J4575
$$ 812429 846912 871593 898564 980555 1048270 1066382 1093101 1131581 1172059 1202289 1216864
13401A216864K6629K8023J8910M0887J7425L6196Q0524O1283M6430N5649M0875
$$ 1216864 1243493 1271516 1290426 1331313 1348738 1384934 1465458 1526741 1573171 1628820 1669695
13390A669695N7239Q9512O3168Q7728J36369J57610J70925J73497K25454K53456
$$ 1669695 1726934 1816446 1879614 1967342 2103711 2261321 2432246 2605743 2831197 3084653
13380C084653K42336L52472M10958M77216N50515O02520P11271Q23332J039361
$$ 3084653 3326989 3679461 4090419 4567635 5118150 5720670 6431941 7255273 8294634
13371H294634J348386J706954K334704L318921M661784O126074O915096O298790
$$ 8294634 9643020 11349974 13684678 17003599 21665383 27791457 34706553 41005343
13363D1005343M464611K690707J713768R82847r94920m625795p386605p149701
$$ 41005343 45469954 48160661 49874429 50857276 49862356 45236561 37849956 30700255
13355C0700255n164897l189809j732612o34836K16765Q20376J052231J024917
$$ 30700255 25535358 22345549 20612937 19978101 20194866 21015242 22067473 23092390
13347B3092390J048003J294563J746746K224316K464689K711137L109938L542717
$$ 23092390 24140393 25434956 27181702 29406018 31870707 34581844 37691782 41234499
13339D1234499M273431N485559O650914O250400L650593P11340k65175K26610
$$ 41234499 45507930 50993489 57644403 63894803 67545396 68256736 67991561 68218171
13331F8218171L62297j173036l929855n898565n859074m438157k742685j836881
$$ 68218171 68580468 67407432 63477577 57579012 51719938 47281781 44539096 42702215
13323D2702215k317600l318279l211218k345075j542049j011662n75321l49219
$$ 42702215 40384615 37066336 33855118 31510043 29967994 28956332 28381011 28031792
13315B8031792o48933r92318p44728K13746J417027K884823M623506O250189O794845
$$ 28031792 27382859 26390541 25645813 25859559 27276586 30161409 34784915 41035104 47829949
13306D7829949N621877L488379J689768P79407j75942k842779o935029r260114
$$ 47829949 53451826 56940205 58629973 59409380 59233438 56390659 49455630 40195516
13298D0195516q276270n975718m063852k830202k065676j568930j224754r94619
$$ 40195516 31919246 25943528 21879676 19049474 16983798 15414868 14190114 13195495
13290A3195495p81465o94022o34748n48346n84347n75226m81933m66620m02954
$$ 13195495 12414030 11720008 11085260 10536914 9952567 9377341 8895408 8428788 8025834
13281H025834l94467l55573l46147l15256k39252k35343k41062j91397k03556
$$ 8025834 7631367 7275794 6929647 6614391 6375139 6139796 5898734 5707337 5503781
13272E503781j98223j66500j58929j66875j52944j42707j62270j61034j43020
$$ 5503781 5305558 5139058 4980129 4813254 4660310 4517603 4355333 4194299 4051279
13263D051279j37802j17433j19512q3495j07673j22635j03398r4752o3805n6705
$$ 4051279 3913477 3796044 3676532 3593037 3485364 3362729 3259331 3164579 3100774 3044069
13253C044069n1737j09677q0549p7214q3517o7568j13093n3851l9312p4034o4128
$$ 3044069 2992332 2882655 2802106 2724892 2641375 2573807 2460714 2406863 2367551 2293517 2229389
13242B229389m1519l8324p1281l2434l7419n9102l3803n7236p0665o6935l4290
$$ 2229389 2187870 2149546 2078265 2045831 2008412 1949310 1915507 1858271 1787606 1720671 1686381
13231A686381k9128k8828l7051l7672l6713l6070j4390l6284k6735k3155l0036
$$ 1686381 1657253 1628425 1591374 1553702 1516989 1480919 1466529 1430245 1403510 1380355 1350319
13220A350319r403k7408j6427j7535k4030n3125m2465j2755O441k9300n7399n4226
$$ 1350319 1340916 1313508 1297081 1279546 1255516 1202391 1159926 1147171 1153612 1124312 1066913 1012687
13208A012687m4526l7842K6110j5872j3277O680l0268n3829m8710n286j2631k1459
$$ 1012687 968161 930319 956429 940557 927280 933960 903692 849863 801153 795867 783236 761777
13196G61777Q472j3823l2989k4965L088J6891J4654K47K8557M3920k3709j6611
$$ 761777 770249 756426 723437 698472 701560 718451 733105 733352 761909 805829 782120 765509
13184G65509k0582q435k4367k2327k2327l3393O833R903j6956L079K996J5737
$$ 765509 744927 736492 712125 689798 667471 634078 640911 650814 633858 636937 639933 655670
13172F55670O504j0220k8150m0916q976m7084l3536N176J0490j9209k8155k6166
$$ 655670 662174 651954 623804 582888 573912 526828 493292 498468 508958 489749 461594 435428
13160D35428L343J3457R628k6592j2109J3771q498n662j1700K3046L6666P917
$$ 435428 438771 452228 461856 435264 423155 436926 428428 422766 411066 434112 470778 478695
13148D78695n018J7058L7145k0944k3779p690k6654k0236q696p612r61J0620j585
$$ 478695 473677 490735 527880 506936 483157 475467 448813 428577 419881 412269 411308 421928 420343
13135D20343j0609J412j6224j0770j2988Q646J3586K4917p398j097j6396j5677
$$ 420343 409734 411146 394922 384152 371164 379810 393396 418313 410915 409818 393422 377745
13123C77745J9247r696m4643l8881K5961N7083P765j142J2644j2479j6901q077
$$ 377745 396992 387296 342653 303772 329733 386816 394581 393439 406083 393604 376703 368626
13111C68626l4766m4259J7337m661j8363j3887O169j5379j9014M145M827K429
$$ 368626 333860 289601 306938 302277 283914 270027 276196 260817 241803 245948 250775 253204
13099B53204L601Q560K20l7757k544K2800K1363L2212J9667j6646j8940j4254
$$ 253204 256805 265365 265585 227828 225284 248084 269447 301659 321326 304680 285740 271486
13087B71486Q395j4793j5639l5787J5172K934L9883k784l2782j5673Q061L1242
$$ 271486 279881 265088 249449 213662 228834 231768 271651 268867 236085 220412 228473 259715
13075B59715K0929j3321m2514j6266J1195J7674j8489l18J454K6748o162p752
$$ 259715 280644 267323 224809 208543 219738 237412 218923 218605 220059 246807 240645 232893
13063B32893o971k0500j8201j3060J2073J9908K2396l186J0252m549m24k6229
$$ 232893 225922 205422 187221 174161 186234 206142 228538 225352 235604 231055 230631 204402
13051B04402q450R60r60K6491L9370j1974r419j9537j3798m4011m1520j1991K0001
$$ 204402 195952 196912 195952 222443 261813 249839 240420 220883 207085 163074 121554 109563 129564
13038A29564J1197o129J935k6612N61N6532K3503q897j9865j1508O057k2351J7108
$$ 129564 140761 134632 136567 109955 110516 167048 190551 181654 161789 150281 156338 133987 151095
13025A51095J6698k2099k5869J5958K442j2423n738M087J7397K3795k2733J4826
$$ 151095 167793 145694 119825 135783 138225 125802 120064 124151 141548 165343 142610 157436
13013A57436L429k4231K0318j9128l2334N850L7683L8057J7776k3677k9043M141
$$ 157436 160865 136634 156952 137824 105490 111340 149023 187080 204856 181179 152136 156277
13001A56277M8376K8256l4614k5117P902j5980j6258O454J4916l124j8241J9965
$$ 156277 204653 232909 198295 173178 181080 165100 148842 155296 170212 167088 148847 168812
12989A68812k889J7457M06J3652J3897k2564j7224j7727M22N818P808n180j9355
$$ 168812 165923 183380 183786 197438 211335 188771 171547 153820 154242 160060 167868 162688 143333
12976A43333o072L0663O168p940J560O592j2397R094K7064j6064j7273K0310j2119
$$ 143333 137261 167924 174092 166152 167712 174304 161907 171001 198065 182001 164728 185038 172919
12963A72919j9934k2854j1400j3847R961j8571K370N914M104L998k1906J3481
$$ 172919 152985 130131 118731 104884 114845 96274 98644 104558 108662 112660 90754 104235
12951A04235J7621j3216j0082j8305l549Q174J2231j591J8344J4297p361j1488
$$ 104235 121856 108640 98558 80253 76704 84878 97109 95518 113862 128159 120798 109310
12939A09310K0693L8968J1878j0155j3282k168L788n345k4076m744R551J8043
$$ 109310 130003 168971 180849 170694 157412 155244 159032 153687 129611 124867 134418 152461
12927A52461j0177Q992m051j4939J8542J9703k791k08J8808j9383l2324L3190
$$ 152461 142284 151276 147225 132286 150828 170531 167740 167532 186340 166957 134633 167823
12915A67823K9883j684n548l0689m7998r269Q353K6525J6847k4249j2455J3114
$$ 167823 197706 196022 190474 159785 111787 102518 110871 137396 154243 129994 117539 130653
12903A30653J9029N4204J4224j3853k4456J9402K298P712L5497O225Q844k915
$$ 130653 149682 203886 218110 204257 179801 199203 201501 209213 244710 250935 259779 256864
12891B56864Q887K361L6156M3896K6566m872k3712k9461l164K1326J547k9356
$$ 256864 265751 268112 304268 348164 374730 369858 346146 316685 313521 334847 336394 307038
12879C07038j1179l004J1866j604r827r81j7394j3950J6764K1637J506M64M1164
$$ 307038 295859 292855 304721 303117 293290 292309 274915 260965 277729 299366 300872 301336 342500
12866C42500K9016M0190N2402K0129J2699M351J2417k4506k7361k4438l2180n196
$$ 342500 371516 411706 464108 484237 496936 501287 513704 489198 461837 437399 405219 400023
12854D00023k4397j0472J3601k796o715l8299o2329l0907K1930K1908j0421l1659
$$ 400023 375626 365154 378755 375959 369244 330945 268616 237709 259639 281547 271126 239467
12842B39467j0184l4297M625K1350L4768L4449K6263L4412M9240O2006J7196J1731
$$ 239467 229283 194986 199611 220961 255729 290178 316441 350853 400093 462099 479295 491026
12830D91026j2840j2403k994k9411n3487n2702m3226k8717k9353p573J9121l974
$$ 491026 478186 465783 462789 433378 379891 327189 283963 255246 225893 218320 237441 233467
12818B33467l2866k3814k6604j84r099K0734M6652J1463J974l8423k8478j8514
$$ 233467 200601 176787 150183 149999 140900 161634 208286 219749 221723 183300 154822 136308
12806A36308o238Q100R327J9363k3082l0627J6872K8124L0845O393j3503k3177
$$ 136308 130070 138170 147497 166860 143778 113151 130023 158147 188992 195385 181882 158705
12794A58705j9377j4619K2818q027m298j1368j8478K368J3027L2737K2234l18
$$ 158705 139328 124709 147527 139500 135202 123834 105356 107724 120751 153488 175722 175404
12782A75404j379k0274j5354l463J4994Q94k2071J3261K3194r164l384J9246J2376
$$ 175404 174025 153751 138397 134934 149928 150822 128751 142012 165206 156042 152658 171904 184280
12769A84280k2600M972Q894j7230l1611L296J1883J8184j230j3593p175p945J512
$$ 184280 161680 166652 175546 158316 126705 130001 141884 160068 158838 145245 138070 130125 131637
12756A31637r640P999J162J1K080j9922K1502k927r398r703J3258K0849J0550
$$ 131637 121997 129996 131158 131169 133249 113327 134829 131902 122504 112801 126059 146908 157458
12743A57458M840L74k1213j4060Q343m11l392l372j5962O187J2266K9706p472
$$ 157458 162298 162672 141459 127399 135742 135331 131939 128567 112605 118792 131058 160764 153292
12730A53292M876j1917r823p238k1361J4875k3601N616L5092K6787l3884k2244
$$ 153292 158168 146251 136428 129190 107829 122704 99103 104719 139811 166598 132714 110470
12718A10470O334J8274r081j6485J8296L0410k3363l2919j2111Q777M649j981
$$ 110470 116804 135078 125997 109512 127808 158218 134855 101936 89825 98602 103251 101270
12706A01270o217m965k1057J3937O346L1396K8417K3606Q916m3128j1338k9559
$$ 101270 95053 90088 69031 82968 89314 120710 149127 172733 181649 138521 127183 97624
12694I7624o105O70N308L2688J7663k813j0225j1343k4221p359M3983L8061j7956
$$ 97624 91519 92189 97497 130185 147848 145035 134810 123467 99246 91887 135870 173931 155975
12681A55975j9818R910j7783K0072k1549j1243J18j0045j0983p034O543P163J2790
$$ 155975 136157 146067 128284 148356 126807 115564 115682 105637 94654 87620 94163 101326 114116
12668A14116k926l127J8487K1725M230m8892o76J7583j2062n046j220j2947M883
$$ 114116 111190 108063 126550 148275 152505 103613 102937 120520 108458 103412 102192 89245 94128
12655I4128K3606O342j0638q3J2058J503k0213M385k591K6503j2922N391m4440
$$ 94128 117734 124076 113438 113355 125413 126916 106703 111088 108497 135000 122078 127469 83029
12642H3029l4604M0206K1810L0392K0919l6073k5865j4224M606m116n014M3217
$$ 83029 48425 88631 110441 140833 161752 125679 99814 85590 90196 86080 81066 124283
12630A24283K0257n108o579K2242k3109j2259J1312J0416n519J0078J4892o410
$$ 124283 144540 139432 132853 155095 131986 119727 131039 141455 135936 146014 160906 154496
12618A54496j3005j0350J7084l4765j2246J5426q754K653K4250j2487l526K7978
$$ 154496 141491 131141 148225 113460 101214 116640 107886 110539 134789 122302 118776 146754
12606A46754j0931n780n833J0134J8457J9180j5147n023r423J1001K076R228p873
$$ 146754 135823 130043 124210 134344 152801 171981 156834 151811 142388 153389 155465 164693 156820
12593A56820m2053l8810q642K6849K3744M1168J3933k7834Q064J4442j3064M527
$$ 156820 114767 75957 67315 94164 117908 159076 173009 145175 153239 167681 154617 159144
12581A59144l7412q88K5736j662J3079M0568Q679m5459j1025J1077J4988K4082
$$ 159144 121732 120844 146580 144918 157997 198565 207244 161785 150760 161837 176825 200907
12569B00907n615l1438j2186l0687J9598P2342K9306K0526K1652M5776K2741K0938
$$ 200907 195292 163854 151668 120981 140579 212921 242227 262753 284405 330181 352922 373860
12557C73860J2169O110n320l2209k9133k7220j6486r266k7988k2483O730P949
$$ 373860 386029 392139 386819 354610 325477 298257 281771 272505 244517 222034 228764 236713
12545B36713j6074R872N501J979K5465P323K0737m138n037K0796L7659J7941K7150
$$ 236713 220639 230511 236012 237991 263456 270779 291516 287378 282341 303137 340796 358737 385887
12532C85887M0936K8216J6408K709K6486j2670o637j6249l2272l2446k8652j432
$$ 385887 426823 455039 471447 474156 500642 487972 481335 465086 432814 400368 371716 370284
12520C70284R81m3490l1521K1303n026k9464l1640J1019Q644K659J3069j3959
$$ 370284 371265 327775 296254 317557 312531 283067 251427 262446 271090 273749 286818 272859
12508B72859N343j613K8906N7783J5813P914M107k673J1130J0974P630J7193k0945
$$ 272859 278202 276589 305495 363278 379091 387005 391112 388439 399569 410543 418173 435366 414421
12495D14421o7459k1277k8207l7471j0896j7114m5069J1293j2878m836m8385j9893
$$ 414421 346962 325685 297478 260007 249111 231997 186928 198221 185343 180507 132122 112229
12483A12229J2861M922l3172J2465K0468L9669M179J764o503k4163m642L0347
$$ 112229 125090 130012 96840 109305 129773 169442 173621 175385 168882 144719 140077 170424
12471A70424j9667r342K5597J1706m6728r217J506O863L5016k050p048k1473J388
$$ 170424 150757 141415 167012 178718 131990 122773 124279 131142 166158 164108 157060 135587 136975
12458A36975L5691j1959k5249M3056M1266k3728l8784J0992O990N260J791m665
$$ 136975 172666 160707 135458 178514 219780 196052 157268 168260 175250 180510 182301 177636
12446A77636n643j878q246o393l9828o261L487K6256k679j3502N532L398K6179
$$ 177636 171993 170115 161869 155476 115648 109387 112874 139130 136451 122949 128481 131879 158058
12433A58058J3446l345j7709o045n484j1594K6910r627k9261J5941J9416O468
$$ 158058 171504 168159 150450 144405 138921 127327 154237 144610 115349 131290 150706 157174
12421A57174k1131l9509K2887J1723j8620k0818r922J2897M0958K5331L378K1876
$$ 157174 136043 96534 119421 131144 112524 91706 81784 94681 135639 160970 164348 186224
12409A86224k285n984J4793j6405m746R301n705k3868K281K2569R29m442N445
$$ 186224 183939 177955 192748 176343 171597 180898 175193 151325 153606 176175 177104 172662 178107
12396A78107N308j6419j9877p945j8481J3309O4922k908m755r188o989J0333J8461
$$ 178107 183415 166996 147119 139174 120693 134002 198924 196016 191261 182073 175084 185417 203878
12383B03878J118l6041j2830R71m154k92K5694K5516K2079L029J531k1567r765
$$ 203878 204996 168955 156125 157096 152942 152650 178344 203860 225939 228968 230499 208932 199167
12370A99167j3523R256J171k2638j9833J0905L483k5867J894N0598K2914l694
$$ 199167 185644 194900 196071 173433 153600 164505 167988 142121 144015 194613 217527 213833
12358B13833j128k968k0629j403l1471j2108K4290J7383j863J2680r010R26J2073
$$ 213833 212705 209737 189108 187705 156234 144126 168416 185799 183936 196616 187606 188532 200605
12345B00605J0345k3604J8219Q74K0740l465j3198n487J9338q641m371r317K3220
$$ 200605 210950 187346 205565 206439 227179 223714 210516 205029 224367 215726 211355 202038 225258
12332B25258K9878q051l4743k3587l1478j6440J1099O1164J8544j1617J767m494
$$ 225258 255136 247085 212342 188755 157277 140837 151936 213100 231644 220027 221794 217300
12320B17300p378r458k673l1204k2042J014K996m5427l8158J5676J2896J6630
$$ 217300 209922 200464 197791 166587 144545 145559 148555 103128 64970 80646 93542 110172
12308A10172j4626k6078k1728K5878k134k693L779K7056J8722k3828l243J301
$$ 110172 95546 69468 47740 73618 71484 68791 72570 99626 118348 94520 91277 92578
12296I2578K0495L3572j0423j5026o099L44j5685j8804J6385J2616K5220Q722
$$ 92578 113073 146645 136222 121196 115097 115441 99756 80952 97337 109953 135173 143895
12284A43895l2874m6484j668o586k3455l2449k5498R15o89k828l398K7165K4104
$$ 143895 111021 64537 62869 56283 32828 379 -25119 -24204 -24893 -27721 -31119 -3954 20150
12271B0150P582M0421K5984j4185l6717J8764J9896j2220l4012O876K0358K6949
$$ 20150 27732 68153 94137 79952 43235 61999 81895 69675 35663 42539 62897 89846
12259H9846K671N016j1893R706J7458j6802n6156N659O066r613k2113M891N3520
$$ 89846 92517 97533 85640 95346 112804 96002 39846 45505 51571 41958 19845 24736 78256
12246G8256J4451R116M8203N9616N0560K8001L0908K8082k8758n4260L187Q320
$$ 78256 92707 101823 150026 209642 260202 288203 319111 347193 318435 264175 267362 275682
12234B75682j2257l5411k7392k6521O188K660K594m802K3956L4025j9249N275
$$ 275682 263425 228014 200622 174101 180289 182949 185543 180741 204697 238722 219473 224748
12222B24748J089n911o390L7358L2451j9606M965J9375O030L359P597q770k9960
$$ 224748 225837 219926 213536 250894 283345 263739 268704 288079 294109 297468 305065 296295 266335
12209B66335l0454K545l9L4357P3K769N5332j3709l6076K6944M1055n847j2286
$$ 266335 235881 238426 238387 272744 272817 275586 330918 317209 281133 308077 349132 343285 330999
12196C30999o1P935P126J7431L6302J0519J0221Q824k0088Q660J4779k3689k4041
$$ 330999 330938 338873 345999 363430 399732 410251 420472 429296 409208 417868 432647 408958 384917
12183C84917K1908J8946K9531J2571K2856P24j2180r447N08P858N778N27J8529
$$ 384917 406825 425771 455302 467873 490729 491453 479273 469826 470334 478192 483970 484497 503026
12170E03026J9548J5703J6439K3729M5987N3903K2934K944L9211K2737J6573N4565
$$ 503026 522574 538277 554716 578445 624432 678335 701269 704213 743424 766161 782734 837299
12158H37299K2086J9923M7617N1746M0318N1059R3331J01738Q6153N3192Q7200
$$ 837299 859385 879308 926925 978671 1018989 1070048 1163379 1265117 1351270 1404462 1491662
12147A491662J16225R0600R0175J26894J32005J70247K36642K35389K49286L09054
$$ 1491662 1607887 1698487 1788662 1915556 2047561 2217808 2454450 2689839 2939125 3248179
12137C248179L69491M01504M16032N28562O82190Q07708R51392J126730J411272
$$ 3248179 3617670 4019174 4435206 4963768 5645958 6453666 7405058 8531788 9943060
12128I943060J762063K289370L144386M308826N654355O702220O818167N763235
$$ 9943060 11705123 13994493 17138879 21447705 27102060 33804280 40622447 46385682
12120D6385682M121545K594956J365768j94509k789463n676401p141810o558809
$$ 46385682 50507227 53102183 54467951 54273442 51483979 45807578 38665768 32106959
12112C2106959m803486k900758j414453l01890M14135P73703Q95883J046311J263881
$$ 32106959 27303473 24402715 22988262 22686372 23100507 23874210 24770093 25816404 27080285
12103B7080285J676876K052142K230144K220585K272704K500283L008016L894495
$$ 27080285 28757161 30809303 33039447 35260032 37532736 40033019 43041035 46935530
12095D6935530M851042N116522M323098K944458J914449J625134J557056Q90675
$$ 46935530 51786572 56903094 61226192 64170650 66085099 67710233 69267289 70157964
12087G0157964r71620l571953n488467n775509m800988l724918l356450l454768
$$ 70157964 69186344 65614391 60125924 54350415 49549427 45824509 42468059 39013291
12079C9013291l285198k683102j989610j368416r29249p55214q70050j000255
$$ 39013291 35728093 33044991 31055381 29686965 28757716 28002502 27132452 26132197
12071B6132197p19849n6422Q48771J998604L251575M529586N354952N211066M095665
$$ 26132197 25412348 25355926 26204697 28203301 31454876 35984462 41339414 46550480 50646145
12062E0646145K536521J196866Q6902j528641m051143o443274p344533o491204
$$ 50646145 53182666 54379532 54466434 52937793 48886650 42443376 35098843 28607639
12054B8607639m886411l431169k486951j809765j353504j110030q79459p62810
$$ 28607639 23721228 20290059 17803108 15993343 14639839 13529809 12650350 11887540
12046A1887540o74858n82844n22125n17575n21379m86410m45147m19695l35583
$$ 11887540 11212682 10629838 10107713 9590138 9068759 8582349 8137202 7717507 7381924
12037G381924l38691l22102k63161k59357k54838k07538k34772k08514j88471
$$ 7381924 7043233 6721131 6457970 6198613 5943775 5736237 5501465 5292951 5104480
12028E104480j57800j70219j79872j66136j02713j48980j38261j16314j28967
$$ 5104480 4946680 4776461 4596589 4430453 4327740 4178760 4040499 3924185 3795218
12019C795218j19836r3977j06941j27083r6381o3880j12097n9552o9539p0693
$$ 3795218 3675382 3581405 3474464 3347381 3251000 3187120 3075023 3015471 2945932 2875239
12009B875239r1417j00435m6291o2106o3480p8493q2430q5443p2331l6799l2271
$$ 2875239 2783822 2683387 2637096 2574990 2511510 2433017 2350587 2265144 2192813 2156014 2123743
11998B123743n0609m1065m5448n1143n1160o9474o3535l6383m8366n7428k9048
$$ 2123743 2073134 2032069 1986621 1935478 1884318 1814844 1751309 1714926 1666560 1609132 1580084
11987A580084m2314j8868j7686m7789j2988k2487j9464m7901k1287k0075o6681
$$ 1580084 1537770 1518902 1501216 1453427 1440439 1417952 1398488 1350587 1329300 1309225 1242544
11976A242544l8732k2897k9643l3707m841J365o6819o1354n5374k6308N86K1837
$$ 1242544 1203812 1180915 1151272 1117565 1112724 1114089 1047270 985916 930542 904234 904820 926657
11964I26657j3601j1383j6535k9788k6791l2859k2868j8782j9823k9624J3084
$$ 926657 913056 901673 885138 855350 828559 795700 772832 754050 734227 704603 717687
11953G17687K9560n287n0854l9187J6887P723Q724J6719J3188l8351k2868J2329
$$ 717687 747247 741960 691106 651919 668806 676529 685253 701972 715160 676809 653941 666270
11941F66270Q105O340K1479J6849M477m9580l4179J2491n477q866k8067J2072
$$ 666270 674375 680715 702194 719043 723520 673940 639761 652252 646775 637909 609842 621914
11929F21914R320l5283n6510j2014k22k8496J5548J527L821r291k5902l679J1814
$$ 621914 631234 595951 539441 527427 527205 498709 514257 515784 519605 510314 484412 480733 492547
11916D92547j5017l7232k5864q806J0991k104k063J4845J0411J3853n96M1570
$$ 492547 477530 440298 414434 405628 416619 414515 412452 427297 437708 451561 450965 492535
11904D92535J9266j1142NN901R04l870j608k880n2242j1223K4975j2281n171j802
$$ 492535 511801 500659 500664 506565 507469 503599 501991 499111 446869 435646 460621 448340 443169 441367
11890D41367j6951l3666j9105l7362K5134J8175J0779j2184l2423m788M2640k670
$$ 441367 424416 390750 371645 334283 359417 377592 388371 376187 343764 338976 381616 378946
11878C78946j8044j6054J7622J9765K1564J6094M733j1824L0484L5423j2974K603
$$ 378946 360902 344848 362470 382235 403799 419893 424626 412802 443286 478709 465735 468338
11866D68338N6901L4430M8183J00441J22504J41556K26480K08408J82387J29934
$$ 468338 525239 559669 607852 708293 830797 972353 1198833 1407241 1589628 1719562
11856A719562R8192O9731N41p5632j83456k46512k42401k03619j51827j46006
$$ 1719562 1817754 1887485 1888026 1812394 1628938 1382426 1140025 936406 784579 638573
11846F38573q1500j5113k8403j0954j2705m5653j1221l584l7211m4351P047r077
$$ 638573 557073 541960 513557 502603 489898 444245 433024 429440 392229 347878 354925 345848
11834C45848n4550l1709o644J2497j4510O895K7088K2167j638p595k3758l259
$$ 345848 291298 259589 252945 265442 250932 257827 284915 307082 305444 297849 274091 270832
11822B70832R488j2370k4497q619K170l632J7062n853n197M00J724L346o116J4536
$$ 270832 280320 267950 243453 234834 237004 233372 250434 244581 239384 239784 241508 244854 238738 253274
11808B53274L244k7189k5711j7577j490J1047J0633j0229j4136j8469j8441M0596
$$ 253274 256518 229329 203618 186041 184551 195598 206231 196002 181866 163397 144956 185552
11796A85552K1068l2332n320P06m518N736l557p812j8311l694J6800J9330k5895
$$ 185552 206620 174288 168968 169674 165156 170892 167335 159523 141212 137518 154318 173648 147753
11783A47753j652M4350p143k64L874j451j8427J977l3557j5671O468L5529O405
$$ 147753 146101 190451 183308 183044 186918 185467 167040 169017 135460 119789 126257 161786 168191
11770A68191l3651j7999P607j262O346L1314j2872l3761j0768p402L9137N0805
$$ 168191 134540 116541 124148 122886 129232 160546 147674 113913 103145 95743 134880 185685
11758A85685J0734k7058j346K1295J0619p012o583n5235J3667J1749K188J3276
$$ 185685 196419 169361 168015 189310 199929 192917 186334 131099 144766 156515 158703 171979
11746A71979L528J1906k869K8643K2442L1940M4943k575L7835J6278k524M480
$$ 171979 175507 187413 184544 213187 235629 267569 312512 309937 347772 364050 361526 366006
11734C66006r651l1196l2718k5056l2946n621J52N645q114m2501k364J7058j3929
$$ 366006 356355 325159 292441 267385 234439 228818 228970 234615 226501 184000 181636 198694 184765
11721A84765J0210R235r65k08J50R439L671j0831N626P32K6973O043K4655k0405
$$ 184765 194975 204210 203245 203037 203187 212626 216297 205466 211092 211824 238797 244840 269495 249090
11707B49090n239M0858K38J2572K9225l5424k6742n831M715j018J0886j8552r837
$$ 249090 243851 284709 284947 297519 326744 291320 264578 258747 263462 262444 273330 254778 244941
11694B44941K8175P628k0995J2977J736l0642j078P357k0249L1912N6542J4883
$$ 244941 273116 280744 259749 272726 274462 243820 242742 250099 229850 261762 318304 333187
11682C33187J1017M3610Q479j827K5904N6457N7725j838k1950k4721J9588m616
$$ 333187 344204 387814 396293 394466 420370 476827 534552 532714 510764 486043 505631 501015
11670E01015j5751l1221j2579K193l9480k7220K9936n830n166L07j883n867J9909
$$ 501015 485264 454043 441464 443657 404177 376957 406893 401063 395897 396204 394321 388454 408363
11657D08363K2856n777L7280L6214N9188L3764L4726O810j6597p617K2168j5283
$$ 408363 431219 425442 462722 498936 558124 591888 626614 633424 616827 609210 631378 616095
11645F16095l6269k8032J7220K3596k8430m5748R59k1706k8270j0350m3435q210
$$ 616095 579826 551794 569014 592610 564180 518432 519391 497685 469415 459065 415630 407420
11633D07420l7926l7734K4341K3924j0752o0359n3654j7795l2854n931k1767j1994
$$ 407420 369494 331760 356101 380025 369273 308914 255260 237465 204611 198680 176913 164919
11621A64919m0543l3665o5818m2301o1421o9062p1889m8581n3464m7017J704L0823
$$ 164919 124376 90711 24893 -17408 -78829 -147891 -219780 -268361 -321825 -368842 -367138 -336315
11609c36315R2627R7361O8138L2016J6714K362J3710K5912M6044Q161R418j1008
$$ -336315 -243688 -146327 -78189 -46173 -29459 -27097 -13387 12525 58569 66730 76148 65140
11597F5140K0971r660j1444J9169K6588p877K833j9757j812R361j6527k288l1994
$$ 65140 86111 76451 65007 84176 110764 102887 105720 85963 84151 93512 76985 74697 42703
11584D2703l2585R271n059J5565K9606L0808J0806P772K4302L535J87J0488K2853
$$ 42703 10118 19389 14330 29895 59501 90309 101115 108887 133189 136724 136911 147399 170252
11571A70252j2732j9985r130o348l5002p932M9315K2440k4077Q861L4044M1347
$$ 170252 157520 137535 128405 122057 87055 79123 128438 150878 126801 135662 169706 211053
11559B11053K9677K9045N9408N3333M7790J8529Q882p320r972Q705l4597r385
$$ 211053 240730 269775 329183 382516 430306 448835 457717 450397 440425 449130 414533 405148
11547D05148j6767M346L091m532j8900j5872O652J6416K5870O256L6962L4799
$$ 405148 388381 392727 395818 391286 372386 356514 363166 379582 405452 411708 448670 483469
11535D83469l158j0972k6492k2817Q983J9470n259j6352j125l5005J9143K0525
$$ 483469 480311 469339 442847 420030 429013 448483 443224 426872 425747 390742 409885 430410
11523D30410J449k0483K731L4723l1483m0972k2314Q824k1732m7018q917q499
$$ 430410 431859 411376 414107 448830 417347 376375 354061 362885 341153 294135 285218 276719
11511B76719K6419J4784J5262R860q967K1316K9890J1448L9720K4680k447N4135
$$ 276719 303138 317922 333184 343044 334077 355393 385283 396731 436451 461131 458684 512819
11499E12819O1565L6225K2899M4053J7212m904m100q407L7766M7139N1241N3524
$$ 512819 574384 610609 633508 677561 694773 689869 685769 677362 715128 762267 813508 867032
11487H67032N7353M3788K3789J5668K5425L1277K1521J0506J3540L8481J07885
$$ 867032 924385 968173 991962 1007630 1033055 1064332 1085853 1096359 1109899 1148380 1256265
11476A256265J25289Q8463J04552J08212J33175J32918J30532J07643J05381R7095
$$ 1256265 1381554 1470017 1574569 1682781 1815956 1948874 2079406 2187049 2292430 2389525
11466B389525P6485J05279J28699J37499K18164K81161L11314L31946L83223M59857
$$ 2389525 2466010 2571289 2699988 2837487 3055651 3336812 3648126 3980072 4363295 4823152
11456D823152N15800N69531N79655O26439O76574P34843P58168P97392P27356
$$ 4823152 5338952 5908483 6488138 7114577 7791151 8525994 9284162 10081554 10808910
11447A0808910P59234Q45689Q72267J030207J235127J585354K091206K555744
$$ 10808910 11568144 12413833 13286100 14316307 15551434 17136788 19227994 21783738
11439B1783738L091605L708495M423844N415480O871466R181691J2954218J8807520
$$ 21783738 24875343 28583838 33007682 38423162 45294628 54476319 67430537 86238057
11431H6238057K7183877L6482623M2744826M2350120L5262601K4781892J5305574
$$ 86238057 113421934 149904557 192649383 234999503 270262104 295043996 310349570
11424C10349570O582412o102170k3835272m0576624m9605287m6812410l5333224
$$ 310349570 316931982 310829812 286994540 246417916 196812629 150000219 114666995
11417A14666995k3359047j5037628j0049744p164122n449979m405642l767079
$$ 114666995 91307948 76270320 66220576 59056454 53606475 49200833 45433754
11410D5433754l352744l023637k739666k556409k342095k139060j903201j676385
$$ 45433754 42081010 39057373 36317707 33761298 31419203 29280143 27376942 25700557
11402B5700557j510714j325232j156749j084266j027266r45485q55051p81072
$$ 25700557 24189843 22864611 21707862 20623596 19596330 18650845 17795794 17014722
11394A7014722p20508p00399n54086m94724n00623m56346m57432m72093m99673
$$ 17014722 16294214 15593815 15039729 14545005 14044382 13588036 13130604 12658511 12158838
11385A2158838n05750m99337m86755m57946m39918l90013l42934l05754k50851
$$ 12158838 11653088 11153751 10666996 10209050 9769132 9379119 9036185 8730431 8479580
11376H479580k75875k54473k15109k08502j97355k28772k30331k12723j98531
$$ 8479580 8203705 7949232 7734123 7525621 7328266 7099494 6869163 6656440 6457909
11367F457909j83589j73980j71667j65549j51460j36390j15963j36584j41227
$$ 6457909 6274320 6100340 5928673 5763124 5611664 5475274 5359311 5222727 5081500
11358E081500j64190j45671j04144j24797j51711j44806j36008r4785o1126n7599
$$ 5081500 4917310 4771639 4667495 4542698 4390987 4246181 4110173 4015388 3954262 3896663
11348C896663p3283p2792n1487p7779q3707q4805r1620q4352o4147l3583o7006
$$ 3896663 3823380 3750588 3699101 3621322 3537615 3452810 3361190 3276838 3212691 3179108 3112102
11337C112102j09275p8621n0589j02752p5277q1461q8308j07197p0566r7287o7824
$$ 3112102 3002827 2924206 2873617 2770865 2695588 2614127 2525819 2418622 2348056 2250769 2182945
11326B182945o1021k9087k5568k7645n8772p6929m3658l0221o0172o1778l7109
$$ 2182945 2121924 2092837 2067269 2039624 1980852 1903923 1860265 1830044 1769872 1708094 1670985
11315A670985p146k6626o9393l3830q762l1466l4998q904J7949j8303l2448k5472
$$ 1670985 1663839 1637213 1567820 1533990 1525228 1493762 1458764 1449860 1467809 1449506 1417058 1391586
11303A391586r618j7585k3444l3155n4758o4664q7084p3230l3664k6116n0828
$$ 1391586 1381968 1364383 1340939 1307784 1253026 1188362 1101278 1028048 994384 968268 917440
11292I17440k1279j8347l0043j1089j392j0019j5579n281j9236p538J0877j4982
$$ 917440 896161 877814 847771 836682 835290 825271 809692 804411 785175 777637 788514 773532
11280G73532k2722l5019m8058l4606j043o229o280n46L56O17O259j4404k6594
$$ 773532 750810 715791 667733 633127 632084 625855 619575 619029 619385 620002 626261 611857 585263
11267E85263J7804N3080J9309k1849k4418J848M109k1296j8743l4417Q883L106
$$ 585263 603067 656147 675456 653607 629189 631037 635146 613850 595107 560690 569573 572679
11255E72679o648j8156k2063N649J6349n148L056j3285L2640N4835L7558Q771
$$ 572679 566031 547875 525812 531461 547810 542662 545718 532433 565073 619908 657466 666237
11243F66237L5745N4871P7710Q5904J19354O9754L0035k191p968n5977r5179j16388
$$ 666237 701982 756853 834563 920467 1039821 1109575 1139610 1137419 1129451 1073474 978295 861907
11231H61907j15189q1465m7225p8023k7292j0259l106J8627k4512k9395k6539
$$ 861907 746718 665253 618028 540005 512713 502454 499348 517975 493463 464068 437529
11220D37529k1543j6117l0856l6378j1445j0718k8220j609Q439j8622L121Q592
$$ 437529 415986 399869 369013 332635 321190 310472 282252 280643 289082 270460 273581 282173
11208B82173J1364k0897k4822o148R683M171j7273j9292j4986P67J767J0658l5932
$$ 282173 293537 272640 247818 241670 251353 255524 238251 218959 203973 204740 206507 217165 181233
11195A81233J1044O2800k275l3718p748o827o533r387R577Q674n04L1617K6675
$$ 181233 192277 255077 252802 219084 211336 204509 197976 188589 198166 206840 206336 237953 264628
11182B64628K9364l655K186k2136k2505j2508j4937M2498L3169m359j4271k1683
$$ 264628 293992 290337 292523 270387 247882 235374 220437 262935 296104 291745 277474 255791
11170B55791L262J153K5419L1040m275m1054l3121M3220L0576p139k0143k1934
$$ 255791 259053 260206 285625 316665 312390 271336 238215 281435 312011 304872 284729 262795
11158B62795j3605p225l1838k9523K3979P983j6534j5279j0713k925J7439k1321
$$ 262795 249190 241965 210127 180604 204583 212566 196032 180753 170040 167115 184554 163233
11146A63233l0934M832K3532J8281k228N769K7323j1903j425J3643j2279J4235
$$ 163233 132299 137131 160663 178944 176716 182485 209808 197905 196480 210123 197844 212079
11134B12079Q117j9035q338R135l6506r092k4136j9619p203k162k7817J2341L3977
$$ 212079 220196 201161 192823 201958 165452 156360 132224 112605 105402 103240 75423 87764 121741
11121A21741m478k6530l6810R555m455K98l0892L2459N3714R227r833l1264k0757
$$ 121741 117263 90733 53923 63478 59023 59321 28429 60888 114602 123829 113996 82732 61975
11108F1975k5681K6704l7l710L9738J2833n770O746m923k0877K1194M1180m8224
$$ 61975 36294 62998 62961 59251 98989 111822 106052 112798 107875 86998 108192 149372 101148
11095A01148j0068k1555j0507M0424l997q585j3590n846J6862L7765k715m2007
$$ 101148 91080 69525 59018 99442 95445 86860 73270 67424 84286 122051 119336 77329
11083G7329Q763K2609J2479l6706j2727o405q680m741J0044j760K5290J7330j6534
$$ 77329 86092 108701 121180 84474 71747 65342 56662 51921 61965 60205 85495 102825 86291
11070H6291m450J0746k2979k2046j5269L9375r744n439p341j4440K5333K8771
$$ 86291 81841 92587 69608 47562 32293 71668 61924 56485 49144 34704 60037 88808
11058H8808L395Q028q757j0435K296K8998O907j7508o019k9753j4596N069K540
$$ 88808 92203 100231 91474 81039 83335 112333 119240 101732 95713 65960 51364 56433 58973
11045E8973m980P020n118r440L679j8249k354L8511L3857k6584R195O001K389
$$ 58973 53993 61013 55895 46455 50134 31885 29531 68042 101899 75315 84510 90511 92900
11032I2900m314l3823j1020L930j3128J4484o248R308N5772N807j7393J0184K0761
$$ 92900 88586 54763 43743 47673 34545 49029 42781 52089 107861 113668 96275 106459 127220
11019A27220Q099J8684L999j8254j0208R437m882p23N044r121M0780L2907l7196
$$ 127220 135319 154003 158002 139748 129540 138977 134095 133372 138416 129295 170075 202982 165786
11006A65786m396P219J0425K0375J6535M8229P459p478J8891N0986O6338Q1823
$$ 165786 161390 168609 179034 199409 215944 264173 271632 264154 283045 334031 400369 482192
10994D82192P3912J62324K05928K06343J91660J44242J11364R6209J2489r5578
$$ 482192 556104 718428 924356 1130699 1322359 1466601 1577965 1674174 1686663 1591085
10984A591085k05431k45151k48558k10827j23929r3659p0443l2666j9538k0109
$$ 1591085 1385654 1140503 891945 681118 557189 463530 393087 360421 340883 320774
10974C20774k8976k6666k5480P965J2509j4885j2864J1382n6614m5688j827O227
$$ 320774 291798 265132 239652 247617 260126 245241 232377 243759 187145 141457 139630 145857
10962A45857j2610l0702j8669K3557j5172k7673j6263P773k0891Q40L5453K2479
$$ 145857 133247 102545 83876 107433 92261 64588 48325 56098 35207 36047 71500 93979
10950I3979j4031K265J9331j688J6433l9665k4156J4100J9331p147k0200J6805
$$ 93979 79948 82213 101544 99856 116289 76624 52468 66568 85899 78752 58552 75357
10938G5357J4043r689K585j6286J7527J3680k1451j6376j1836j5246k750M0700
$$ 75357 89400 79711 82296 66010 83537 97217 75766 59390 47554 32308 29558 70258
10926G0258J2203k3664O319J9146l474J6156M106m073j2770q51O372j7129l942
$$ 70258 82461 58797 65116 84262 80788 96944 101050 96977 84207 83356 89728 72599 68657
10913F8657J061K6021Q703K0199k7123j9843P279m2478k5707J5005J2898J848
$$ 68657 69718 95739 104442 124641 97518 77675 84954 42476 16769 31774 44672 46520
10901D6520M883J7077L5452j818l2047L720L2084j8340k2932P060K475j7621m869
$$ 46520 51403 68480 103932 102114 70067 73787 105871 87531 64599 71659 74134 56513 51644
10888E1644P905l800L761R629k5180j4951K792P421J2668j2064R429J0195o965
$$ 51644 59549 55749 59510 69139 43959 29008 31800 39221 51889 39825 49254 59449 52484
10875E2484m7398K2837L5635j2249k1557P517R303j1295J686p527k2251j1639
$$ 52484 5086 27923 63558 51309 29752 37269 46572 35277 36963 29436 7185 -4454
10863d454R721J487j1443J9154N464J7563P64k1304K4410J3953j9888j400p21
$$ -4454 5267 6754 -4689 14465 19929 37492 38256 16952 41362 55315 35427 34027 33306
10850C3306j4571J3998n217j2213o669J1691R315J3418n889r410k1878j0906J1673
$$ 33306 18735 32733 27516 15303 8634 20325 29640 43058 37169 27759 5881 -5025 6648
10837F648J4466j485K1512L2740j9297k2107k687j2677L332p119k5833K3643M0672
$$ 6648 21114 19629 41141 73881 54584 32477 29790 17113 20445 13326 -12507 11136 51808
10824E1808J4867p264J8088j2731k0168k4994O1J0874n879j2508K2884k294l660
$$ 51808 66675 59411 77499 64768 44600 19606 19667 30541 24662 12154 35038 32744 29084
10811B9084J4847J6394k358K5240M392j7287J5856k6226m5773M986K1224N140
$$ 29084 43931 60325 57967 83207 87599 70312 86168 59942 14169 19155 40379 45519
10799D5519m588J3249N784k4759J0070K4697M0543J9320p091l2768k4733j0536
$$ 45519 40931 54180 59964 35205 45275 69972 110515 129835 122744 89976 65243 54707
10787E4707j7704k2402j1345k8741O813r876Q075J0712L3197L683r28k2060j75
$$ 54707 37003 14601 3256 -25485 -18672 -28548 -20473 -9761 23436 27119 26191 4131 3956
10774C956O307J0053N692k0202l474j85L326L1108j2570Q544J4296j8551K2467
$$ 3956 10263 20316 26008 5806 2332 2147 5473 36581 24011 32555 46851 28300 50767
10761E0767J251j1320K3674M0994J2313J4795p791l6297m3885j6221P822j2718
$$ 50767 52018 40698 64372 105366 117679 132474 124683 88386 44501 28280 36102 23384
10749B3384j6396N34K8606L1598o894n227R75j8698K4454L923m209q465n468J5806
$$ 23384 6988 7522 36128 67726 60832 55605 56580 37882 62336 66259 62050 53585 48117 63923
10735F3923M501l33j9407K5377p478m0314J7123J574j3717j773q207k5646K503
$$ 63923 68424 68091 48684 74061 66583 26269 43392 44966 31249 29476 21269 -4377 -1874
10722a874J00K3130j4736j7536m361j2850L2526n375k6884j450R659R181J5725
$$ -1874 -1774 21356 6620 -10916 -15277 -28127 4399 -976 -27860 -29310 -19651 -10470 5255
10709E255L4570K674q135j0635k4832j3727N074K0373L3128j6689j0714m666Q304
$$ 5255 39825 42499 34364 23729 -1103 -14830 -9756 10617 43745 27056 16342 11676 19980
10696A9980J3048J6151k1099l7113J8341L0237J8904j4829J5983M9003M785n4235
$$ 19980 33028 49179 28080 -9033 9308 39545 58449 43620 59603 108606 113391 59156
10684E9156l3177O357J9031j0K0190k6097j2655j6826L928K79K1536J3928J1997
$$ 59156 25979 32336 51367 51357 71547 45450 32795 15969 19897 20176 41712 55640 67637
10671F7637n160k1505n022J5888j8247j2666M453j1578n167m736J2159J6564J5303
$$ 67637 62477 40972 35950 51838 33591 20925 25378 13800 8633 3897 16056 32620 47923
10658D7923J3373J039l0815k8145J5543r747J0366K3088K3852O614o437j3358
$$ 47923 61296 62335 31520 3375 18918 9171 19537 42625 66477 73091 66654 53296
10646E3296Q12m205j5987k1257J3791K320j5761j3365j71K5809L1076k5399j1539
$$ 53296 54108 49903 33916 12659 26450 28770 13009 -356 -527 25282 56358 30959 19420
10633A9420K2165q542j8073o227J6498J6636P410L992N635l2132k8084O440N791
$$ 19420 41585 33043 14970 8743 25241 41877 49287 53279 58914 26782 -1302 5138 10929
10620A0929J2719l387O766N381J7012N887k6032P023P26j9650Q39L1488n695m487
$$ 10929 23648 20261 27027 32408 49420 55307 29275 36298 37024 17374 18213 49701 44006 39519
10606C9519k9349j0245N674J6594P726n788k899K0560Q657k4603K9334N225k0959
$$ 39519 10170 -75 5599 22193 29919 24131 21232 41792 50449 25846 55180 60405 39446
10593C9446k1215k5441r312J8807J1507J9990j3683O072J568k2170j2835q645
$$ 39446 18231 -7210 -16522 2285 13792 33782 20099 26171 27739 5569 -7266 -15911
10581a5911K5134L757J0598J4487j4727j7276K0902K4754J4122o740j3087j5961
$$ -15911 9223 12980 23578 38065 23338 6062 26964 51718 65840 59100 46013 30052
10569C0052N546K9699p234n535j240J0502J7580J2601k3885m07J5277j3383j8091
$$ 30052 35598 65297 58063 52528 51288 61790 79370 91971 68086 67679 82956 69573 51482
10556E1482L843N025p169j2907k8407k1622j4498j5163R7N5428L8024o474k7247
$$ 51482 55325 60350 53181 40274 11867 -9755 -24253 -39416 -39319 16109 54133 47659 20412
10543B0412j2753l274j1783J1966L750o2634j441K4785L4279P559l833L9185J2078
$$ 20412 7659 4385 -7398 4568 8318 -54316 -55757 -30972 3307 10866 7033 46218 58296
10530E8296j7711k1003J1068J4259Q909k3134m4040k7237P924K0398q169K0819
$$ 58296 40585 19582 30650 44909 53818 30684 -13356 -40593 -32669 -12271 -20440 379
10518C79J2513j34J7893k0024m8282o577L4506K4114O629q814J6872r222Q449
$$ 379 12892 12758 30651 10627 -37655 -44232 -9726 14388 21017 12203 29075 19853 28302
10505B8302M614k2754j3692J115o383Q18O332L600J7812j629q889J4789Q397J0832
$$ 28302 32916 10162 -3530 -2415 -8798 -7980 -1648 1952 19764 18135 9246 24035 32432 43264
10491D3264M087J0621j3991j5066L8177j2955k5900k4708j9098l6422m0438K0036
$$ 43264 47351 57972 43981 28915 67092 54137 28237 3529 -15569 -51991 -92429 -72393
10479g2393K9808L2378K5291K5980K619k6595j2778j2046m401j1876l137J1445
$$ -72393 -42585 -10207 15084 41064 43683 17088 4310 -7736 -12137 -24013 -27150 -15705
10467a5705P207L959K0998J4003k3167k5320O996K4554J830l1410J5951K2800
$$ -15705 -8498 -4539 16459 30462 7295 -18025 -11029 13525 15355 -16055 -104 22696
10455B2696Q43n616L88K0374J1774q911k496n517n234j0795J1152J5460j1481
$$ 22696 23539 17923 18311 38685 50459 41548 39052 33535 28301 17506 28658 44118 32637
10442C2637k8335m346R92q163J3127K8871N320n988R489k5302m2273N760K6628
$$ 32637 4302 -44 948 -7215 5912 34783 40103 34115 43604 18302 -23971 -18211 8417
10429H417o123j2159l803O072j8518N802M1119L8353M769k3300k6707j0695k061
$$ 8417 2294 -9865 -13668 -7596 -26114 -20312 20807 59160 63929 40629 13922 3227 1166
10416A166K5026K6449p131j1938J1582L11Q715Q431K340j6434m2477R7j2362j3719
$$ 1166 26192 52641 45510 33572 45154 45465 54180 62611 64951 48517 6040 6137 -6225 -19944
10402a9944J0919p69j0257n731J2688K2652j8543Q391L1435r745l984J6332r812
$$ -19944 -9025 -9794 -20051 -25782 -13094 9558 -8985 -594 30841 21096 17112 33444 23632
10389B3632Q276l549j679N769k2916K4434J5653r677l3032j9474K3402R565j3132
$$ 23632 31908 28359 26680 32449 9533 33967 49620 39943 6911 -12563 10839 20404 7272
10376G272j3767K6123K8170m169k1479k5703K8744r527K494O541P556l89n231
$$ 7272 -6495 19628 47798 43629 22150 -3553 25191 15664 18158 24699 32255 31866 26635
10363B6635M325K3959K8475J2048j1104n4205m1217l039J3520P436Q052L5020
$$ 26635 30960 54919 83394 95442 84338 30133 -11084 -14123 -603 6833 14885 49905
10351D9905J700k2519q427J3962P321j7467j4454o365r689j8182j4526L2164J7485
$$ 49905 51605 29086 20659 34621 41942 24475 10021 3656 -6033 -24215 -38741 -6577 10908
10338A0908R928K4261p631j8783J2565J7704q197r207O061j0642k9301k3028k8909
$$ 10908 20836 45097 37466 18683 31248 48952 40755 31548 37609 26967 -2334 -25362 -54271
10325e4271J2179K3232M2584M653k2005j4890K7036K3860q452l60j5416k5847
$$ -54271 -42092 -18860 23724 28377 6372 -8518 18518 42378 33926 33566 18150 -7697
10313g697Q187j5652r582k0409j3701J8051K6134J4959N497O898J1225l8595m5528
$$ -7697 490 -15162 -24744 -45153 -58854 -40803 -14669 290 5787 12685 23910 -14685 -60213
10300f0213J6229P2950K3016k2885j0180j5585R901L0201L6938j9206m3691Q218
$$ -60213 -43984 28966 51982 29097 18917 3332 13233 43434 80372 61166 17475 25693
10288B5693k0716j8852K2515J0449r92O299N757N973j5194j6275J9018J6675o599
$$ 25693 4977 -13875 8640 19089 18097 24396 30153 36126 20932 4657 23675 40350 33751
10275C3751o056j2421l2574j9780K5989N28K0328M6050M826k8316r628l812j6682
$$ 33751 27695 15274 -17300 -37080 -11091 -10563 9765 55815 60641 32325 22697 18885 2203
10262B203L269J2435j6132k56j2662j5434q030J5405R34p248k4451j0184J4008
$$ 2203 5472 17907 1775 1519 -11143 -26577 -34607 -19202 -18268 -25516 -49967 -60151 -46143
10249d6143m942N5J8586K4423J213K322j8901l478l232K572J190j0392j863K3947
$$ -46143 -51085 -51030 -32444 -8021 -6808 -4486 -23387 -26865 -30097 -27525 -26335 -36727 -38590 -14643
10235a4643m398R294M969q645j0493K8694J6086k674J4543j2788k0633m962N564
$$ -14643 -19041 -9747 -4778 -13423 -23916 4778 20864 18190 32733 19945 -688 -5650 -86
10222h6J11j6307M233L0296J0518j4496k3849J300l665n09J7602J68j2428k3637
$$ -86 25 -16282 -12049 18247 28765 14269 -9580 -8280 -11945 -12454 5148 5316 -7112 -30749
10208c0749j8974J1062K8515J2317N776o39K2149k0285k2295k379l459J6268J2792
$$ -30749 -49723 -38661 -10146 2171 7947 7308 29457 9172 -13123 -15502 -18961 -2693 10099
10195A0099k0210L903K0210K423j3438J994K2069l965l1868M076o463l322J2394
$$ 10099 -10111 -6208 14002 16425 2987 4981 27050 23085 -8783 -4707 -11170 -14492 -2098
10182b098R015K6215l300j4778O438J736j407k2561p123m5671k9253M0081M4808
$$ -2098 6917 33132 29832 15054 21492 23228 21821 -740 -7863 -53534 -82787 -42706 2102
10169B102P751R564j116K601j649m252j05Q300l5067Q625K7578o147j9175q230
$$ 2102 9853 19417 18301 20902 19253 15001 14896 23196 -11871 -3246 24332 18185 -990 -9220
10155i220K0445j7641R467J4791R089k0306j5350k4313M182J5690j3956j0060
$$ -9220 11225 -6416 3051 17842 26931 6625 -8725 -33038 -28856 -13166 -27122 -37182
10143c7182J8050K2523j158J6322k050j2575J4748n791k3960k0377M04M188l753
$$ -37182 -19132 3391 2233 18555 16505 3930 18678 12887 -11073 -31450 -31046 -26858 -30611
10130c0611L819j3331m025O77K7414J350O309Q438M062k372L307M224K4965m485
$$ -30611 -26792 -40123 -44148 -43471 -16057 -14707 -8398 40 4102 1730 5037 9261 34226 29741
10116B9741j4136j0655j0977n325K9862J9246P440j1338j6478J1588K1899r712
$$ 29741 15605 4950 -6027 -11352 18510 37756 45196 33858 17380 28968 50867 41155
10104D1155l9598m5012o519K9599K3674N721P836J5131k5279q969l366j6966N69
$$ 41155 1557 -43455 -49974 -20375 3299 9020 16856 31987 6708 -2261 -5627 -22593 -22024
10091b2024L61M029J9513O774R768n197m779j1584j4428J1389J2372j9770j0530
$$ -22024 -21663 -17634 1879 8653 18421 13224 8445 -3139 -17567 -6178 6194 -13576 -24106
10078b4106p959L523J1409M41m052k876J7947J2819j4459j5651k9800n364q510
$$ -24106 -32065 -28542 -17133 -16692 -20744 -23620 -5673 7146 -7313 -22964 -52764 -58128 -66638
10065f6638K8396L8411J3951k0070j3105l625j3591M712R100j1287j4861L0985
$$ -66638 -38242 169 14120 -5950 -19055 -22680 -36271 -31559 -22459 -33746 -48607 -17622
10053a7622Q708Q340J5907K291J3967K891N796r355j88J9093J7318n671l3129
$$ -17622 -8914 -574 15333 17624 31591 34482 40278 30923 30735 49828 67146 61475 28346
10040B8346k8970K6545J0081k4184j6023k6762j686Q185k4603Q954J1172J5306
$$ 28346 -624 25921 36002 11818 -4205 -30967 -32653 -24468 -49071 -40117 -28945 -13639
10028a3639N2785r216k5529J6645j1732k0917j9963J0874p829J6095L9323j221
$$ -13639 39146 29930 4401 21046 9314 -11603 -31566 -20692 -28521 -12426 26897 25676
10016B5676L933M776L948j0982l3854m797m453J3796J2017J1679j9230q533j4927
$$ 25676 29609 34385 38333 27351 -6503 -11300 -15753 -1957 10060 21739 2509 -6024 -20951
10003b0951O161p820K3786k012k2183K4757L3012J4982k2744Q246P064m2452J1266
$$ -20951 -14790 -22610 1176 -836 -23019 1738 34750 49732 26988 35234 42298 -154 11112
9990A1112O450j4345k1262J7696L5149J7090k1341j6861k1525k3856r334r252
$$ 11112 17562 3217 -18045 -349 34800 51890 30549 13688 -7837 -31693 -41027 -50279
9978e0279K4539L8440J3202J2370J8991m2689k39M372o823K5575R646k6030j4561
$$ -50279 -25740 12700 25902 38272 57263 14574 14335 18707 11884 37459 47105 21075 6514
9965F514N181k2065l6347J2615J5858j7256j5725l161J7246M4610J8504J9602
$$ 6514 11695 -10370 -46717 -34102 -18244 -35500 -51225 -54386 -37140 7470 25974 45576
9953D5576J3653j7123k2563k1498J5737O014j5598J60M764m011j2053k2459k3293
$$ 45576 59229 42106 19543 -1955 13782 19796 4198 4358 9122 5111 -6942 -29401 -52694
9940e2694J3601J7761J3013K1224k5400P41J5533O08n622o61J1722Q835l568J4364
$$ -52694 -39093 -21332 -8319 12905 -12495 -11754 3779 4387 -1235 -1896 9826 18661 15093 29457
9926B9457O957j4123J4504j0140l468N235j4100Q017j613P402P786m0857o945
$$ 29457 36414 22291 36795 26655 23187 28422 14322 22339 20726 28128 35914 -4943 -11888
9913a1888j3075K833m094m238K1150J5971J836J4395j7538o285K6777J223j9415
$$ -11888 -24963 -22130 -26224 -30462 -9312 6659 8495 22890 5352 -933 25844 27067 7652
9900G652j9147k1589L9951K1218j6558o007J2094J3877N176j4662j6069j3620
$$ 7652 -11495 -33084 6867 28085 11527 5520 17614 31491 36667 22005 5936 -7684
9888g684k3110j0865J8013Q321J538K225q940K2701L2604K3339j3340l95o159
$$ -7684 -30794 -41659 -23646 -15325 -13787 -11562 -20502 2199 34803 58142 44802 44407 38248
9875C8248j9524l0713j4718q242K355j8077q097P522K6647K4037j1825L329J0466
$$ 38248 18724 -11989 -26707 -34949 -32594 -50671 -58768 -51246 -24599 -562 -12387 -9058 1408
9862A408k9381q621q974M129J330M200J2795K8047R663k3269l0935k2849K2463
$$ 1408 -27973 -36594 -45568 -41439 -40109 -35909 -23114 4933 14596 -8673 -39608 -62457 -39994
9849c9994K764J3913j657J0266J8048P26Q847J0884l267O12N225j3081k6503L8266
$$ -39994 -37230 -23317 -24974 -14708 3340 4066 12913 23797 20530 21142 26367 13286 -13217 25049
9835B5049O337l3741j9175J5231J3777O425K039j191k8203q444k540o652J0707
$$ 25049 31386 -2355 -21530 -6299 7478 13903 15942 14751 -13452 -21896 -24436 -31088 -20381
9822b0381J5785j857R135K1996l4549j7524J6566K9153K0379J4577j0053j4170
$$ -20381 -4596 -6453 2682 24678 -9871 -27395 -10829 18324 38703 53280 43227 29057
9810B9057l9428j2761M060Q672K1573J4643n767k1279J24K474p569l732j2255
$$ 29057 -10371 -23132 -19072 -10400 11173 25816 20049 -1230 -1106 1368 -6201 -9933 -22188
9797b2188j6500o205j1636L3919J5443m488l2146k733K3807K4294j9737k3325
$$ -22188 -38688 -44893 -56529 -22610 -7167 -11655 -43801 -46534 -22727 1567 -18170 -41495
9785d1495K7315r035J7785L5360J2591j0763q932m517p756k7908r176K396j1678
$$ -41495 -14180 -23215 -5430 29930 42521 31758 22826 18309 10553 -17355 -26531 -24135 -35813
9772c5813J7543K80J4783n279k382K925j2822r919P022K790m41J0136K2260j5373
$$ -35813 -18270 -17990 -3207 -8486 -10868 -7943 -20765 -30684 -23662 -20872 -21313 -11177 11083 -4290
9758d290j647K4973l1858j4145J3698K3597Q144j2296k0828p654L8742L8127l031
$$ -4290 -5937 19036 -12822 -26967 -13269 10328 18472 6176 -14652 -22306 16436 54563 51532
9745E1532l0979j0697m98m660n598j3380k4148p021J4449K9135J1619m34J0286
$$ 51532 20553 9856 9358 4698 -900 -14280 -38428 -45449 -31000 -1865 9754 9320 19606
9732A9606l328j4896K6020K6439J0011r361j5621k3385m0879p695R640k572k2958
$$ 19606 16278 1382 27402 53841 63852 54491 38870 15485 -25394 -33089 -23449 -26021 -48979
9719d8979j8890K1649J6288N146j7487j6411P117j1745J4454R735J0937k2016
$$ -48979 -67869 -46220 -29932 -24786 -42273 -58684 -51567 -63312 -48858 -39123 -28186 -50202
9707e0202p92L2617L4027R603J4272o619p836K5120l3693j9853L564J3663p332
$$ -50202 -50994 -18377 15650 25253 39525 32906 25070 50190 16497 -3356 208 13871 6539
9694F539j488r797j9079K8349J6795j258J3196k864j1021j2986J0031J2258J8539
$$ 6539 5051 -4746 -23825 4524 21319 20061 33257 30393 19372 6386 16417 28675 47214
9681D7214j8552l5841q981o11K0074K8240o18m7250l2851K7701L3183J340j3910
$$ 47214 28662 -7179 -16160 -16771 3303 31543 30925 -16325 -49176 -21475 11708 13048 -862
9668h62j3063J3748J4279J511k3630k6836N019J7619K1387J4998J8961l434n022
$$ -862 -13925 -177 14102 15613 -8017 -34853 -29834 -12215 9172 24170 43131 39697 34675
9655C4675q70Q358k26k62k0550p375j2994l4934J0778L3212P240j908j9461j2659
$$ 34675 33805 42163 41937 41675 21125 13750 756 -34178 -23400 9812 17052 15144 -4317 -16976
9641a6976j6423q823J0534K3055o505j374N882j9800k604n047J1731K9617R023
$$ -16976 -33399 -42222 -31688 -8633 -15138 -16512 -10630 -30430 -33034 -38081 -26350 3267 12290
9628A2290o921P506J725p716R866J7145L0552m16o280l5748l1524k3139j245J8007
$$ 12290 5369 12875 14600 6884 16750 33895 64447 64031 57751 22003 -9521 -32660 -33905 -15898
9614a5898J9074J81k9754r029K4640P664J8890N0485k5121m9518j0273R484N730
$$ -15898 3176 3357 -26397 -35426 -10786 -3122 15768 66253 41132 -8386 -18659 -9175 -3445
9601c445j1888j2657p19L9632M9300j0158k4672k5448K853L405k18J6431m2871
$$ -3445 -15333 -27990 -28709 10923 60223 50065 25393 -55 2798 6203 5985 22416 -20455
9588b0455o708K1490k7575K7720O386k2265K970J5082L5501K6645J8159n403l9535
$$ -20455 -27163 -5673 -33248 -5528 858 -21407 -18437 -3355 32146 58791 76950 71547 32012
9575C2012L196k3761n539K311k547k0870j508Q239P344p011k861P90K3866o220
$$ 32012 35208 11447 5908 8219 5672 -15198 -16706 -8467 -1123 -8134 -10995 -10205 13661 7441
9561G441j101j2917r881j8814J9628j939j560j404o29r910J2850K3484L6503k341
$$ 7441 6340 -6577 -16458 -35272 -15644 -17583 -19143 -20547 -21176 -31086 -18236 5248 41751 39410
9547C9410k0239j8270J3196j1169j3642k6817n330K2019K8808r551q880L59K8832
$$ 39410 19171 901 14097 2928 -10714 -37531 -42861 -20842 7966 -1585 -10465 -10106 18726
9534A8726L114m166P574Q470n202k6137j8630J2976K1586J6755m226j8285L8814
$$ 18726 21840 17674 25248 33718 28516 2379 -16251 -3275 18311 35066 30840 12555 51369
9521E1369K8502k09p164k314j0034j1399j2902l1115O965J0690J3429l7737j0855
$$ 51369 79871 79662 72498 70184 60150 48751 35849 4734 11699 22389 35818 -1919 -12774
9508a2774j1948l835J7913J6603k915L571K3319J5834q109k1484j4695j014M22
$$ -12774 -24722 -28557 -10644 5959 3044 6615 29934 45768 37659 16175 1480 466 888
9495H88J0796r278k3408k4042O087L6678J8225J819J1150l674j0627j7158l2228
$$ 888 11684 2406 -21002 -45044 -38957 -2279 15946 17765 28915 25241 14614 -2544 -34772
9482c4772o344P954L0697M7528o285k0121k0865P177K7821K216k3253l2477J0636
$$ -34772 -41116 -33162 -2465 45063 38778 18657 -2208 4969 32790 35006 11753 -20724 -10088
9469a0088J4475j1116j2101J3072K868K975J1641K1402p455L666M821l3001J2502
$$ -10088 4387 -6729 -18830 -5758 -2890 85 11726 33128 25673 29339 34160 1159 13661
9456A3661O325j2573M34p041k1975O430N228J0216j3921o7029p118J4857L5853
$$ 13661 19986 7413 7847 806 -21169 -14739 -9511 705 -13216 -80245 -87363 -72506 -36653
9443c6653L6505K5544k190q086l4323j0752M5130J0664j2108l8411k5628J6781
$$ -36653 -148 25396 23206 15120 -19203 -29955 15175 25839 13731 -24680 -50308 -33527
9431c3527n642K375P338J3045j1618J456m153L1909L0487J5059L905o858j5725
$$ -33527 -39169 -36794 -29456 -16411 -28029 -26573 -30726 1183 31670 46729 50634 43776 28051
9418B8051N799J1316L147l3721j6821m819m54m666J871L9923P23m700k0407j7443
$$ 28051 33850 45166 48313 14592 -2229 -7048 -7502 -12168 -10297 29626 30349 25649 5242 -12201
9404a2201J1369J8067r224K3133O202m49j5634r302k5645j0183J1106L3612L8106
$$ -12201 -832 17235 8011 31144 37346 36897 21263 11961 -13684 -23867 -12761 20851 58957
9391E8957L07k3877m674j9376j1684r847j2030j9311J3448Q626n238Q043L0784
$$ 58957 59264 35387 30713 11337 -347 -10194 -22224 -41535 -28087 -19461 -24699 -16656 14128
9378A4128O134l1658J0323N801m1947j6547J3624J352j2659M664J2437m982K9650
$$ 14128 20262 -11396 -1073 4728 -37219 -53766 -40142 -38790 -51449 -46785 -34348 -39330 -9680
9365i680K7696R711K2489J6438n4764k2205j3456j9078P523J6486Q622K7897N323
$$ -9680 18016 27727 50216 66654 11890 -10315 -23771 -42849 -35326 -18840 -10218 17679 23002
9352B3002J4319j8023m3380j3342J0461K4400L6392J0317R233m042j4018N323
$$ 23002 37321 19298 -24082 -37424 -26963 -2563 33829 44146 53379 49337 35319 40642
9340D0642j3941j5235j6537R198k6823l66l3082r645M3461L6327j1658l280j4312
$$ 40642 26701 11466 -5071 4127 -22696 -23062 -56144 -65789 -22328 13999 2341 -939 -15251
9327a5251j5311n848j414j4074r976j7005R713L9216P499P076O968P473L522n568
$$ -15251 -30562 -36410 -37824 -51898 -61874 -78879 -69166 -29950 -22451 -15375 -8407 -934 2588 -2980
9313b980J5264M4900J0335l3028l0643l1340j8914R169j669K1349M469j9774L5542
$$ -2980 12284 57184 67519 34491 3848 -27492 -46406 -37237 -38906 -17557 -13088 -32862 2680
9300B680P800j0473j4505j2719m534j4971l3007J0258k936J4749L51M651K2369
$$ 2680 10480 7 -14498 -27217 -31751 -46722 -79729 -69471 -72407 -57658 -57307 -52656 -30287
9287c0287J515P279J3292j5956l1330K943J5633J5276K8173l445J4379L3339l731
$$ -30287 -28772 -21493 -8201 -24157 -55487 -52544 -36911 -21635 6538 3093 17472 50811 47080
9274D7080M772o251J1050j841r113k6949k50j5594K923o042k5386J8502J0509
$$ 47080 51852 45601 56651 54810 45697 18748 18498 2904 5827 -215 -25601 -7099 3410
9261C410k0790n789m79K0684J6327j2883m611J8915l0996k2023m008L2898M4445
$$ 3410 -17380 -23169 -23648 -2964 13363 480 -4131 14784 -16212 -38235 -42243 -9345 35100
9248C5100k4510K4632M98m2535j6189j3351J4294M806N824M4475K37j0373J0378
$$ 35100 10590 35222 35720 -6815 -23004 -36355 -22061 -17255 -11431 33044 33281 22908 33286
9235C3286m231j1370K0885N0067J1114j9451l5940n6332l6492L0886J9195j1496
$$ 33286 29055 17685 38570 88637 99751 80300 44360 -11972 -48464 -17578 1617 -9879
9223i879J6491L8057k7223J1636J6521K1460J6116k9459k5933k1333r747Q149
$$ -9879 6612 44669 17446 29082 45603 67063 83179 53720 27787 6454 -3293 4856
9211D856N878j5501k6270N002L1169J9075K6256j7843j5763j1858q132m787n556
$$ 4856 10734 -4767 -31037 -26035 5134 24209 50465 32622 16859 5001 -3131 -7918 -13474
9198a3474l4j8279K2387J7578j5652l065K8708Q175j7559J1223j1472m386N34
$$ -13474 -13508 -31787 -9400 8178 -7474 -10539 18169 26344 8785 20008 8536 4150 4684
9185D684N122J9947M4555L5489k2948k7393k0935j4311M270J291n370n283j6035
$$ 4684 9806 29753 74308 109797 86849 59456 38521 24210 28480 29771 24401 19118 3083
9172C083l050o346k5349J8435J5549J5874J0321m626k8117j8076O927k762J8022
$$ 3083 33 -6313 -31662 -13227 2322 18196 28517 23891 -4226 -22302 -15375 -18137 -115
9159a15L9994R838k3232k3634J3647l600j4174j5267k0715K4795J8891K7844n614
$$ -115 39879 49717 26485 2851 16498 12898 -1276 -16543 -37258 -12463 6428 34272 28658
9146B8658r054j692j8889l8499j0210K0434M9098k3973l1168J2598L9422r837
$$ 28658 19604 17912 -977 -39476 -49686 -29252 19846 -4127 -35295 -22697 16725 6888
9134F888k9017R760J7887J1476O086J7472l144O666j4785k0678j5651j7241k208
$$ 6888 -22129 -12369 5518 16994 23080 40552 37408 44074 29289 8611 -7040 -24281 -26489
9121b6489J0232k9978K74L9488J3295k4127J1599J0855J216j0633J7384O49j5350
$$ -26489 -16257 -46235 -45961 -6473 6822 -17305 -5706 5149 6365 -4268 13116 13765 -1585
9108a585J1437O21J642J4157L879m285q579k2178j5605K7437R256k5952l3835
$$ -1585 9852 10473 12115 26272 30151 25866 17287 -4891 -20496 6941 16197 -9755 -43590
9095d3590Q06L0380R605k1909p71L0369j0756l6767M374J5226j2047J1991k096
$$ -43590 -42784 -12404 -2799 -24708 -25479 4890 -5866 -42633 -38259 -23033 -35080 -23089 -25185
9082b5185j646L6938K0013K6931J0560l999l2865j3702J0490j7461j2404K5087
$$ -25185 -26831 10107 30120 57051 67611 63612 30747 17045 27535 10074 -2330 22757
9070B2757J2151L058q58k6707j2067K1611k7982k7336m578L8632J3447o989J1939
$$ 22757 34908 37966 37108 10401 -1666 19945 -8037 -35373 -39951 -1319 12128 5139 17078
9057A7078j7440k3599L0672K5690o78n17n979p029j9361j8729M434K4793M1236
$$ 17078 -362 -23961 6711 32401 31723 31206 25227 18198 -1163 -19892 -15458 9335 50571
9044E0571k580j3197Q184j0509k7590Q419l160j8195J1447L2407l888j0305P299
$$ 50571 47991 34794 42978 32469 4879 13298 10138 -8057 3390 35797 31909 21604 28903
9031B8903K9466k1488n3234J76m039j082j6030M0824K9870K5348j6234p594j2206
$$ 28903 58369 36881 -16353 -16177 -20216 -21298 -37328 3496 33366 58714 42480 34886 22680
9018B2680j4388O324O221k38O294J2305n615k4365k1313J8016o719j4287j3401
$$ 22680 8292 14616 20837 20599 26893 39198 33583 9218 -12095 5921 -798 -15085 -28486
9005b8486O79J8610q202k880Q95k7236J0314J6673K1074L1877k6449l9685O492
$$ -28486 -27807 -9197 -17399 -20279 -19384 -46620 -36306 -19633 1441 33318 6869 -32816 -26324
8992b6324J1659L1157J145j9803N942J7415j2545J6085K7106j4112k8281O537
$$ -26324 -14665 16492 17637 -2166 3776 21191 8646 24731 51837 37725 9444 15981
8980A5981N787o0903j4617L9062K4357j7814j5843k166L7152J0803K272o259k9674
$$ 15981 21768 -39135 -53752 -14690 9667 -8147 -23990 -26156 10996 21799 24071 17812 -11862
8967a1862J3023j0137K0867j906k6927K0189L7975k612K427R8j7490k4206J2700
$$ -11862 1161 -8976 11891 9985 -16942 3247 41222 38610 41037 41135 23645 -561 12139
8954A2139K1766L842J2052k4954k4763J316j9925p166J4040r211J2766L5616k6810
$$ 12139 33905 37747 49799 24845 82 1398 -18527 -25693 -11653 -20864 -8098 27518 708
8941G08j3869q66K294j4221R113k6360O888P775l0134j2837J3050K2583j2704
$$ 708 -13161 -14027 -11733 -25954 -16841 -43201 -36313 -28538 -58672 -71509 -58459 -35876 -48580
8928d8580l387k3613J4849N1847L2915k278j2180l904p561R012K7890J7341p204
$$ -48580 -51967 -75580 -60731 -8884 24031 21753 9573 5669 -1892 7120 35010 52351 45147
8915D5147j4419j8406j6610M058o091J1794J2614J8873k1416N376P347J5201J2154
$$ 45147 30728 12322 -4288 -230 -6321 5473 18087 36960 15544 20920 28267 43468 55622
8902E5622j8645k0003l6684k615k088m817J6887K7055J188P199o382K2766k3328
$$ 55622 36977 16974 -19710 -22325 -24413 -29230 -12343 14712 15900 23099 16717 39483 16155
8889A6155j7729J0616J897j3369r034q08J5168J4382j0171o537j3079j2537j4522
$$ 16155 -1574 9042 10939 -2430 -11464 -12272 2896 17278 7107 570 -12509 -25046 -39568
8876c9568L5154N2657J1209l1581l2941k2585K0279N902J0445J747k097q596M473
$$ -39568 -4414 48243 59452 27871 -5070 -27655 -7376 -1474 8971 10718 8621 25 4498
8863D498J7814K001O964J7363k982p907j2229K991K9873P565j3879k6808n727
$$ 4498 22312 24313 31277 48640 45658 37751 25522 28513 58386 65951 52072 25264 19537
8850A9537K6813l5837k1888J7685j042J7845K1844P667j1442k9817j2709K0092
$$ 19537 46350 10513 -11375 6310 5268 23113 44957 52624 41182 11365 -1344 18748
8838A8748k4984m749J6141j4391Q82J1610M845J197K0746l653l1993l979o164
$$ 18748 -6236 -10985 5156 -9235 -8353 3257 8102 9299 30045 26392 -5601 -9580 -15744
8825a5744O684J0450R433J3228r144K2263J1851k0047k5444Q320j8103j0869K5478
$$ -15744 -9060 1390 10823 24051 14907 37170 49021 28974 3530 11850 -6253 -17122 8356
8812H356J7899q1j9123p958P331J7008J0276K1369J3448j3376l3133k641Q764
$$ 8356 26255 26174 7051 -907 6424 23432 33708 55077 68525 55149 22016 19375 28139
8799B8139k8972J2462O537R489n058J4519m4183j9595K3065M0448p567k1569j443
$$ 28139 -833 11629 18166 27655 22597 37116 -7067 -26662 -3597 36851 29284 7715 6272
8786F272N444j527R104K6977K2932J1206l1296m0450k5159j2273K7774J463J0696
$$ 6272 11716 10189 19293 46270 69202 80408 49112 8662 -16497 -28770 -996 467 11163
8773A1163m321K4509J3948k6228J5574J2781j3717j6473J4106Q323J2544j3728
$$ 11163 6842 31351 45299 19071 34645 47426 33709 17236 31342 39665 52209 38481
8761C8481n0951M861N848n221j0411j775P088J4046N0847R593j0283k4974Q431
$$ 38481 -12470 -7609 -1761 -6982 -17393 -19168 -12080 1966 52813 62406 52123 27149 35580
8748C5580K1202j4421k6505M346l1025j0218J875K8487J0164K0323j7306j4218
$$ 35580 56782 42361 15856 20202 -10823 -21041 -19166 9321 19485 39808 22502 8284
8736H284J7019K736j5452j3462J5400K0989N388q440p919m811J6469Q535j0409
$$ 8284 25303 28039 12587 -875 14525 35514 40902 32462 24543 19732 36201 44736 34327
8723C4327k2060j5768L25J1286N801J47l6505M342L8695K6848K2030P000o660
$$ 34327 12267 -3501 -3176 8110 13911 14058 -22447 -18105 20590 47438 69468 76468 69808
8710F9808j2592J6665m492k0391m0464p917M3619L8344K637n886k7374Q844K7139
$$ 69808 57216 73881 69389 48998 8534 617 44236 82580 85217 79331 51957 60801 87940
8697H7940m300j5108j673k3564r943K2816k6674j4354K3564L1122K2530O858p363
$$ 87940 83640 68532 66859 43295 33352 56168 29494 15140 38704 69826 92356 99214 91851
8684I1851j0476j3690K3085k5239j7281k1138j7437j2831j5606L3647J9022N229
$$ 91851 81375 67685 90770 65531 48250 27112 9675 -3156 -18762 14885 33907 39136
8672C9136o032J8381o849L808N3101k132k8643l8207j6730J4507J7419J2707p990
$$ 39136 33104 51485 44636 48444 101545 99413 70770 32563 15833 30340 47759 60466 52476
8659E2476N835J5933J1834Q788j1314K984j6255j9036Q538K5565j1020j798J2814
$$ 52476 58311 74244 86078 94866 83552 86536 70281 51245 59783 85348 74328 72530 85344
8646H5344k356k1883m1938J48J2749j4947P159K8972J1794O077N592K4845L937
$$ 85344 82988 61105 19167 19315 32064 17117 24276 53248 65042 71119 76711 101556 105493
8633A05493k5944K493j5249m991J7894O358J8624j545k2070L23L7339L6082L3869
$$ 105493 79549 82042 66793 61802 79696 86054 104678 103133 81063 81386 118725 154807 188676
8620A88676j6618j9000O941J4248q884j742J1749l3178L690K7481k3003n551j670
$$ 188676 172058 153058 159999 174247 165363 163621 175370 142192 145882 173363 150360 144809 143139
8607A43139j1022R862O737L761J946J2004K6806K085o450J6213J7880j137m3893
$$ 143139 132117 141979 148716 152477 154423 166427 193233 195318 188868 205081 222961 221824 177931
8594A77931J972L4820k0116l4868j4753j513k8887r034R061j6576P775M4405M7927
$$ 177931 179903 214723 194607 159739 144986 143473 114586 105552 114613 98037 105812 150217 198144
8581A98144J3700k3067l3652N961J964k2270n578l1728j0348J8429J7813q470
$$ 198144 211844 188777 155125 161086 163050 140780 135202 103474 93126 111555 129368 120898
8569A20898l2652J3762J5787k1387k1912K9973o578j2948j6676o1962m647l595
$$ 120898 88246 102008 117795 96408 74496 104469 97891 84943 68267 6305 1658 -1937
8557a937o000K5748L1986Q589n699j4447K7076K01k1390k5832l3528K2544k096
$$ -1937 -7937 17811 49797 58386 52687 38240 65316 65517 44127 18295 -15233 7311 5215
8544E215J6050M3559j091j029j9076L2392Q1696L9767j3652K472K334K09P176
$$ 5215 21265 64824 63733 62704 43628 76020 157716 197483 183831 186303 188637 188846 196022
8531A96022R347J4097k4484m1117l9066j6311l5938L415J64K827J6329L923o016
$$ 196022 205369 219466 194982 153865 114799 98488 62550 65965 66129 68956 85285 89208 83192
8518H3192k1830k0166j8556P489r623j2868J0125q451J4001K5212J8404J294m6738
$$ 83192 61362 41196 22640 30129 20506 7638 17763 9312 23313 48525 66929 68223 21485
8505B1485j3856J5737J4673R213M611p110j7262Q626j0151n759r08L064J4510
$$ 21485 7629 23366 38039 47252 51863 44753 27491 36117 25966 20207 19299 22363 36873
8492C6873M9413K2977M85k7733j3192J1593K6749l355l5268j1242J349j8647J0459
$$ 36873 86286 109263 109748 82015 68823 80416 107165 103810 68542 57300 58649 40002 50461
8479E0461l36j6391O737L9815p307l1842j8034J1562l861K2297J6430k8951L668
$$ 50461 50125 33734 40471 80286 72979 41137 23103 34665 30804 53101 69531 40580 44248
8466D4248o581K45J8046J380j9358k1123O381N525j7914k3004j1076m151J2983
$$ 44248 37667 37912 55958 57338 37980 16857 23238 28763 10849 -12155 -23231 -27382 -14399
8453a4399J6703J7057O284r245J98J6292R402J8574J089j5330J3833M827k7338
$$ -14399 2304 19361 25645 16400 16598 32890 42292 60866 61955 46625 60458 65285 37947
8440C7947k5463j4785n688J1423L5021P254n807l1970n225K2007l315q288j7424
$$ 37947 12484 -2301 -7989 3434 38455 45709 39902 7932 2707 24714 21399 13111 -4313
8427d313J1191J3451P266J8816P105k4526j9553Q372j149J3226K3925k5313j9496
$$ -4313 6878 20329 27595 46411 53516 28990 9437 17809 16660 29886 53811 28498 9002
8414I002j888R799m188K045J8528o976q081K129J0462M059j4454K6719j441N126
$$ 9002 7114 16913 12725 14770 33298 26322 18241 20370 30832 34891 20437 47156 45715 50841
8400E0841n778J3636j2310p186j8684p793J3095q770o439J9102r194j2255P029
$$ 50841 45063 58699 46389 39203 20519 12726 25821 17051 10612 29714 20520 8265 15294
8387A5294Q459K0926K2977L2834r026l6991J6926j0282q539J386k5508j0106m0326
$$ 15294 23753 44679 67656 100490 91464 54473 71399 61117 52578 53964 28456 18350 -21976
8374b1976l2478J4799N416k9701K2107K8933P716j2405q748J2642Q857k8156j4202
$$ -21976 -54454 -39655 -34239 -63940 -41833 -12900 -5184 -17589 -26337 -13695 -4838 -32994 -47196
8361d7196J0691Q818m13L4983j6864J3525K987k2873j7584j4892K1286L4193K5037
$$ -47196 -36505 -27687 -28100 6883 -9981 3544 6531 -16342 -33926 -48818 -27532 6661 31698
8348C1698L0363L099J486j8673j3357J040r455R160J4963l0050p658j7112l0089
$$ 31698 62061 65160 66646 47973 34616 35656 26201 35361 50324 20274 12616 -4496 -34585
8335c4585J3210M2439L485o597J831j1315N578K5284J8875j3657k6771L0011k1008
$$ -34585 -21375 21064 24549 17952 19783 8468 14046 39330 58205 44548 17777 47788 26780
8322B6780k4812o051J4182j3211J0402K5199J0726l5346j0850J8491o8j522J033
$$ 26780 1968 -4083 10099 -3112 7290 32489 43215 7869 -2981 15510 15442 13920 14953
8309A4953M1200q377j5497m776j5613j2114K3768J4318k1551j9139k610k0844
$$ 14953 56153 47776 32279 27503 11890 -224 23544 37862 16311 -2828 -5438 -26282
8297b6282m879p295N433J3277L9126M4032j0997l2110K00m535n820o531K93M092
$$ -26282 -31161 -38456 -33023 -19746 19380 63412 52415 20305 20505 15970 10150 3619 3912 8004
8283H004k350j160j3303l3453p730J5420P194J5641j187K3152J7596k2062j2461
$$ 8004 5654 4494 -8809 -42262 -49992 -34572 -27378 -11737 -12924 10228 27824 5762 -6699
8270f699J9728L1035K24k9349J5541j0014l6274r745K5086L4581k923o253r151
$$ -6699 13029 44064 44288 14939 30480 20466 -15808 -25553 -467 34114 31191 24938 15787
8257A5787l7975m331j16J4245O306k076j6257K537J9732J6955k3051r983K0506
$$ 15787 -22188 -26519 -26635 -12390 -6084 -8160 -24417 -21880 -2148 14807 -8244 -18227 2279
8244B279K9310j7577N13m934R436M82J8910j6668m12r908L8250j219n0702m063
$$ 2279 31589 14012 14525 9591 19027 19509 38419 21751 21339 11431 49681 48462 -2240 -6303
8230f303k6511J5159M12R191P152N491k534Q683J9029P75j5274P602k220J5962
$$ -6303 -32814 -17655 -17243 -8052 -900 4591 2057 10740 29769 30544 15270 22872 20652 36614
8216C6614J344l900l237q002J4659M558J6792p535m0541j3015L795K2513R743
$$ 36614 37958 34058 30821 22819 37478 42036 58828 51293 10752 -2263 1532 24045 33788
8203C3788j9548K791j5998j0126K9563K5188R373k2135l0076R467K1898Q62k0443
$$ 33788 14240 17031 1033 -9093 20470 45658 55031 32896 2820 12287 34185 35047 14604
8190A4604N647N222r508j8865k2936R865K2481o802j7362j6337J8314J1395J938
$$ 14604 20251 25473 15965 -2900 -25836 -15971 6510 -292 -17654 -33991 -15677 -4282 -2344
8177b344L4559k467q354K6234r776j3368q389j3582k8930J7124N4640J2170r062
$$ -2344 32215 29748 21394 47628 37852 24484 16095 2513 -26417 -9293 45347 57517 48455
8164D8455k9304j1579L1037J1363J5854j6773l6162K2702P672j6278q463j5645
$$ 48455 19151 7572 38609 49972 65826 49053 12891 35593 43265 26987 18524 2879
8152B879j3193L72J4818Q748J1860k610j8515L993K747j2129M765j5087j6253
$$ 2879 -10314 -9942 4876 13624 25484 22874 4359 8352 11099 -1030 3735 -11352 -27605
8139b7605j9967j4376o97J4575J9474L4323J7600N082k171N817o090J307j34J4260
$$ -27605 -47572 -61948 -62645 -48070 -28596 5727 23327 28409 26238 32055 25965 27272 27138 41398
8125D1398r511q377K367J0031L9511K144r925J4820n789J0798K3147K798j08j1073
$$ 41398 31887 23510 25877 35908 75419 77563 67638 82458 76669 87467 110614 113412 113304 102231
8111A02231l2947k0500O051P289j5544j8588M735j8616o01J6072j7329L348N772
$$ 102231 69284 48784 54835 62124 46580 27992 32727 14111 13510 29582 12253 15601 21373
8098B1373m440m3208M661L2895L4000j154j1393j0491l4926O945J0244K1839L1794
$$ 21373 16933 -26275 -21614 11281 45281 44127 32734 22243 -12683 -5738 4506 26345 58139
8085E8139q753k0616m022L2233J6136o215p993j3607K820k6120j3586K0930j7887
$$ 58139 49386 28770 24748 56981 73117 66902 58909 45302 48122 22002 8416 29346 11459
8072A1459l3623L0891K943l011L1300o679J5051O101L0066n116J8896J5493N804
$$ 11459 -22164 8727 11670 8659 39959 33280 48331 54432 84498 79382 98278 113771 119575
8059A19575j0831l1177r582j191O90K3056j1523k1386K4754L4573Q687n319L005
$$ 119575 108744 77567 67985 66794 67484 90540 79017 57631 82385 116958 125645 120326 123331
8046A23331o848j0905j0525J3056q543j2522k9985J423K079l128L2919L1243j2855
$$ 123331 116483 105578 95053 108109 99566 87044 57059 58482 60561 57433 90352 121595 108740
8033A08740N362q198j425J1087j9471j9765L0399K2556n335Q784r110J732m791
$$ 108740 114102 105904 104479 115566 96095 76330 106729 129285 123950 132734 123624 125356 120565
8020A20565j7789P56l950J3005K047n01K3217K3682R310K2835L5607K763j291
$$ 120565 102776 103532 99582 112587 114634 114133 137350 161032 170342 193177 228784 231547 230256
8007B30256k500Q00J0673j3724k5923r697J2308J1431M0119K1447o184p333o084
$$ 230256 227756 228556 239229 225505 199582 189885 202193 213624 253743 275190 269006 261673 255589
7994B55589q616J6101Q242l3142m8115m5151k4846q036j9269J2623J046l3170
$$ 255589 246973 263074 271316 238174 190059 144908 120062 112026 92757 105380 106426 73256
7982G3256j5770L5947L7648j1076j0367P676r437l065M284r568R35j0126J7564
$$ 73256 57486 93433 131081 120005 109638 117314 107877 104812 109096 99528 100463 90337 107901
7969A07901M2562J7017N632K4502l167N443M1371L8278J7645j9088M843j9576
$$ 107901 150463 167480 173112 197614 194447 199890 241261 279539 297184 278096 282939 263363
7957B63363Q320q783J4955l4292m9020K4304K8749O195k6553l8624l1107k6150
$$ 263363 271683 262900 277855 243563 194543 218847 247596 253791 227238 188614 157507 131357
7945A31357O014K762k1471L1223l471m4151k9087o660K5503J5593j0685l8237
$$ 131357 137371 140133 118662 149885 146414 102263 73176 66516 92019 107612 96927 58690
7933E8690L165K3024J0695N178J7859j155j3272K5760J5528K6114m4204J1703
$$ 58690 61855 84879 95574 100752 118611 117456 104184 129944 145472 171586 127382 139085
7921A39085O426o541j0999l326j7078j6346n215J863J5339k780N656k8513J6407
$$ 139085 145511 138970 127971 124645 107567 91221 86006 87869 103208 100428 106084 77571 93978
7908I3978K455L170k2865j7396q819l659K911k8733k4911J1854K2401k0779l543
$$ 93978 96433 99603 76738 59342 50523 46864 49775 21042 -3869 7985 30386 9607 6064
7895F064J2639J5674O120j2609J1150J0441r44j2885j7379j2406n887J0114j9898
$$ 6064 18703 34377 40497 27888 39038 49479 48535 35650 18271 5865 -22 10092 -9806
7882i806j2777J6444M815r164R991Q074j2001r78O182O086n582J3715l357J943
$$ -9806 -22583 -6139 -1324 -10488 -497 7577 -4424 -5402 780 6866 1284 14999 11642 13585
7868A3585K7964r7j9568m302N161O557o690k3812j5605J4356L1995J0105n287
$$ 13585 41549 41452 21884 17582 22743 29300 22610 -1202 -16807 -2451 29544 39649 34362
7855C4362m4461k9816p108K3159J144O960K4758J7844K2958j7926j3956K1729
$$ 34362 -10099 -39915 -47023 -23864 -22720 -15760 8998 26842 49800 31874 17918 39647
7843C9647N96l5429k3788J4953N970L4414j6855p742o226J518j4724j0219J7472
$$ 39647 40243 4814 -18974 -4021 1949 36363 19508 11766 5540 7058 -7666 -17885 -413
7830d13j0596R1J714k164j3755j3634M024p010j2664K6955J29Q116J3756K21J3034
$$ -413 -11009 -10918 -9204 -11368 -25123 -38757 -34733 -41743 -54407 -27452 -27323 -19207 -5451 -5230 7804
7815G804J1384j2870j2836J0991l5996j2189M285J3860M1110j0331r371r573R372
$$ 7804 19188 6318 -6518 4473 -31523 -43712 -39427 -25567 15543 5212 -4159 -13732 -4360
7802d360O366K75L94j4434k2559K9354K9711q192J627Q229k02k5203k172J4131
$$ -4360 2006 2281 2675 -11759 -34318 -4964 24747 16555 18182 26411 26209 1006 -1166 12965
7788A2965L0248J16m7450l4439j4774J8243K5388J5250J1567M088k1301l7150
$$ 12965 43213 43329 -4121 -38560 -53334 -35091 -9703 5547 17114 21202 -99 -37249
7776c7249k658J5005k618k894J2976m05L2097n799l1151o332l123j8534j456M443
$$ -37249 -39907 -24902 -27520 -30414 -17438 -17843 14254 8455 -22696 -29028 -32151 -50685 -52141 -47698
7762d7698J9617O216R759L763J0992J5339m161j457j4812J0187P581J4847K942
$$ -47698 -28081 -21865 -12106 -8343 2649 17988 13827 12370 -2442 7745 15326 30173 33115
7749C3115l3578j8317K7032J5194j4326j7653Q50Q754k553J3061K3169J6010k7873
$$ 33115 -463 -18780 8252 23446 9120 -8533 -7683 1071 -1482 11579 34748 50758 22885
7736B2885k849N284N60N984k1991K593q287Q057K1635M301J1384l6326o305R824
$$ 22885 20036 25320 25880 31864 9873 12466 4179 12236 33871 38172 49556 13230 6925 16749
7722A6749m622l5759j9168L1727j2270q077K6264K9778k7069j2337j5587o873
$$ 16749 12127 -23632 -42800 -11073 -23343 -31420 -5156 24622 -2447 -14784 -30371 -37244
7710c7244M7763K5339n679j1029l302k1464N635J1082R698P918k5254L738J2038
$$ -37244 10519 35858 30179 19150 15848 -5616 19 11101 20799 28717 3463 7201 19239
7697A9239q223j8197k6076p305L3957q52l2118m909P881K1026j492R494l0163
$$ 19239 11016 -7181 -33257 -40562 -6605 -7457 -39575 -44484 -36603 -15577 -17069 -7575 -37738
7684c7738K6055k076j1925M132l218K2560J7825L535k7246k4693J3824K2543k2678
$$ -37738 -11683 -13759 -25684 -21552 -24770 -2210 15615 19150 -8096 -32789 -18965 3578 -19100
7671a9100Q461k584j9624K3078L3032J1915j3788m4427J0580j2641L178J1785
$$ -19100 -10639 -13223 -32847 -9769 23263 35178 21390 -23037 -12457 -25098 -21920 -10135
7659a0135j48j4640k0846P134R320M279r61N152J3366N805J2626q456r229j5104
$$ -10135 -10283 -24923 -45769 -38635 -29315 -25036 -25997 -20845 -7479 -1674 10952 2496 -6733 -21837
7645b1837j1212J8099J6649J5484k3607K436J2538j804l8401J5063K4993J5295
$$ -21837 -33049 -14950 1699 17183 -6424 -3988 8550 6746 -31655 -16592 8401 23696
7633B3696R288K108m0215j8250J496J5518K3742N036K7122N71l730m6018J226
$$ 23696 32984 35092 -5123 -23373 -21877 -6359 17383 22419 49541 50112 46382 364 1590
7620A590P719m401j5570L1218J5959k8831j3291N490r295k1204J6307P112j0813
$$ 1590 9309 4908 -10662 20556 36515 7684 -5607 -117 -9412 -30616 -14309 -7197 -18010
7607a8010r451k6122L416Q813l871L69K4124L0462R098k4368j8546j0842M6743
$$ -18010 -27461 -53583 -50167 -41354 -45225 -44856 -20732 9730 18828 -5540 -24086 -34928 11815
7594A1815l472j3638j4299j2741O923K9806J5650j2068K229j0736J6692K7253
$$ 11815 8343 -5295 -19594 -32335 -25412 4394 20044 7976 10205 -531 16161 43414
7582D3414j7904k6727k6727j1727M8144O6246K6935k9016m2868m7696k6694j6621
$$ 43414 25510 -1217 -27944 -39671 8473 74719 101654 72638 29770 -17926 -44620 -61241
7570f1241J1677L4330R696j1955k3688N427o312r618j1504l2486j4614N3830L7287
$$ -61241 -49564 -15234 -5538 -17493 -41181 -35754 -42066 -51684 -63188 -95674 -110288 -56458 -19171
7557a9171K018j627L0101M4222j4839k773P797J5765k4733k3472j2862J48k67
$$ -19171 -17153 -18780 11321 55543 40704 37931 45728 61493 36760 13288 426 574 307
7544C07r867J9315K822j6806j0754l743k3209r897j6240K6805L0152j1576K645
$$ 307 -9560 9755 12577 -4229 -14983 -18726 -41935 -51832 -68072 -41267 -11115 -22691 -20046
7531b0046L85J2195j8595j5186j2622K5485J8021K3551M0727j1467j2203j1832
$$ -20046 -19661 -7466 -26061 -41247 -53869 -28384 -10363 13188 53915 42448 30245 18413
7519A8413o469n87j3057p301K6347n144l369L665L4049r664l2398j5202k4379
$$ 18413 11944 11357 -1700 -9001 17346 12202 8833 12498 46547 36883 4485 -10717 -35096
7506c5096R031K2394j6556k0119M1587Q157o608K054j7719L0720K4801K0037r606
$$ -35096 -26065 -3671 -20227 -40346 1241 9398 2790 4844 -12875 17845 42646 62683 53077
7493E3077p605j3994l7103k0885J5643L8507K704j7330p998j2733o652J32j5215
$$ 53077 45472 31478 -5625 -26510 -10867 27640 30344 13014 5016 -7717 -14369 -14237 -29452
7480b9452k358J3379K0263l250k5569o630j1172N52K3774K6632k1392K4246J7417
$$ -29452 -31810 -18431 1832 -1418 -26987 -33617 -44789 -44237 -20463 6169 -15223 9023 26440
7467B6440J2776r974j7955J5717J6746j4813j2981m453J3790j4886j3455J3705
$$ 26440 39216 29242 11287 27004 43750 28937 15956 11503 25293 10407 -3048 10657
7455A0657J4304q519Q521k0224m640k704j2293k0149N33K6886l963J0032r362
$$ 10657 24961 16442 24963 4739 99 -2605 -14898 -35047 -34514 -7628 -11591 -1559 -10921
7442a0921N539J2730o385M082N035O692J521J100N296J6080j113k0944p878j2780
$$ -10921 -5382 7348 963 5045 10080 16772 18293 19393 24689 40769 39656 18712 10834 -1946
7428a946m1361L610K4556P318J763j293J3182n028n347j2041j750K2507J9542
$$ -1946 -43307 -39697 -15141 -7823 -6060 -7353 5829 801 -4546 -16587 -18337 4170 23712
7415B3712j1923J7668j9467K3584j3221k8457K386k827J723J3166J6428l7957
$$ 23712 11789 29457 9990 33574 20353 -8104 -5718 -8545 -6822 6344 22772 -15185
7403a5185k4254M1900K3474j4314j9900K4569m559J9119O824r415l0211j9315
$$ -15185 -39439 2461 25935 11621 -8279 16290 11731 30850 37674 28259 -1952 -21267
7391b1267J9272k3859k569L007o700J5378j9080j110K5307m702m058O040L1076
$$ -21267 -1995 -25854 -28423 -25416 -32116 -16738 -35818 -36928 -11621 -16323 -20381 -14341 16735
7378A6735j5247m7205q056M6828J7958j575j5506j8365J1892Q92n343p318j1616
$$ 16735 1488 -45717 -53773 -6945 11013 9438 -6068 -24433 -12541 -11649 -16992 -24310 -35926
7365c5926K6375k580l969j8303J2038J0427J2051j0633m123k372m178K5294j2530
$$ -35926 -9551 -12131 -16100 -34403 -22365 -11938 113 -10520 -14643 -17015 -21193 4101 -8429
7352h429p298J5926J0946n4033J1489J6715k9543k579L7072p719J4285J2128k6509
$$ -8429 -15727 199 11145 -42888 -31399 -14684 -44227 -46806 -9734 -17453 -3168 8960 -17549
7339a7549j5754PJ1345k4196p73J7445j9136j6820R502J0986J4322N680K4350
$$ -17549 -33303 -33296 -21951 -46147 -46920 -29475 -48611 -65431 -55929 -44943 -30621 -24941 -591
7326e91m466O923K0950j4615m7823K5731Q395o946j5993R021l894J9114k824o337
$$ -591 -5057 1866 22816 8201 -39622 -13891 -5496 -12442 -28435 -19414 -23308 -4194 -7018 -13355
7312a3355M573J1409K2261j3599k2679p659J3330Q851L503q109j7272M848L555
$$ -13355 -8782 2627 24888 11289 -11390 -19049 -5719 3132 6635 -1474 -18746 -13898 -10343
7299a0343O988R437K4303k3484q912Q795n584K334L1854K9543k1657j3598l4754
$$ -10343 -3355 6082 30385 6901 -2011 6784 1200 3534 35388 64931 43274 29676 -5078
7286e078p095J5188K3677j74J8179n920j5441K4541J0631j5579j6380n1370k460
$$ -5078 -12173 3015 26692 26518 44697 38777 23336 47877 58508 42929 26549 -24821 -27281
7273b7281k0068k4502l225J3447J1624L9453N33P007j9957M458K7457j7726k2669
$$ -27281 -47349 -71851 -75076 -61629 -50005 -10552 -10019 -3012 -22969 -18511 8946 -8780 -31449
7260c1449J0483Q034k798J2600j1341j6114R880j9400l197K8826L4843j1234j6184
$$ -31449 -20966 -12932 -15730 -3130 -14471 -30585 -20705 -40105 -43302 -14476 20367 9133 -7051
7247g051Q236k2828k4868k5238n079K8453L3541K3124j2830j266j1715j3515j4807
$$ -7051 1185 -21643 -46511 -71749 -76828 -48375 -14834 8290 -4540 -5806 -17521 -31036 -45843
7234d5843J934K3697L4271K0635M166j1520j147m216j7217j010j103p873J0572
$$ -45843 -43909 -20212 14059 34694 38860 27340 26193 21977 4760 3750 2647 -5226 5346
7221E346L705j8198J3071J177k275j7673n610L8016n71l325p346l6668J1879J4767
$$ 5346 9051 -9147 3924 5101 2826 -14847 -20457 17559 16988 13663 6317 -30351 -18472 -3705
7207c705j2819L0478J8650l0535l8669M550M3233j8451j7741j6412l242L4788
$$ -3705 -16524 13954 32604 2069 -36600 -32050 11183 -7268 -25009 -41421 -44663 -9875
7195i875J9397N074J8485j6754l4968K4416K785l9710k0855m498J8012J1725k0857
$$ -9875 9522 14596 33081 16327 -18641 5775 8560 -31150 -52005 -56503 -38491 -26766 -47623
7182d7623n261J1839J7428L5160j4204k8097P314K0242n82p054K735o968k1024
$$ -47623 -52884 -41045 -23617 11543 -2661 -30758 -23444 -3202 -3784 -10838 -8103 -15071 -36095
7169c6095j5868O501M267l012M208k7504K7924L1777O799o949J94l245L1279K0823
$$ -36095 -51963 -45462 -41195 -44207 -39999 -67503 -39579 -7802 -1003 -7952 -7758 -11003 20276 41099
7155D1099R600k625j6084j3247n562L23r216j4300K666q901J397J3077n90J2082
$$ 41099 50699 48074 31990 18743 13181 13504 4288 -10012 -7346 -16247 -14850 -1773 -2363 9719
7141I719Q827N379n697j8213R22L2539K2109l1555k7996j945K2722j0724k5679
$$ 9719 18546 23925 18228 15 937 33476 55585 24030 -3966 -5911 16811 6087 -19592
7128a9592j6922J9219r071P042O276j0293k5990l9018K274L2710J3076J7890L590
$$ -19592 -36514 -17295 -26366 -19324 -13048 -23341 -49331 -88349 -86075 -53365 -40289 -22399 -18809
7115a8809J8225M3859M754O605k2504k6932j8081k7077J1036J2199j8176j1076
$$ -18809 -584 43275 48029 54634 32130 5198 -12883 -39960 -28924 -16725 -34901 -45977
7103d5977O369L78J0862L3316k0352k0298n317K1561O230n441r445J487r085q432
$$ -45977 -39608 -39230 -28368 4948 -15404 -35702 -41019 -19458 -13228 -18669 -28114 -26627 -35712 -44144
7089d4144K8444K8830J4141p469q411r423l056J1089k8716k3880Q887M400j3652
$$ -44144 -15700 13130 27271 19802 11391 1968 -1088 10001 -18715 -42595 -33708 -29308 -42960
7076d2960k3667P855J6270j328R96P825r987J6205j1810J0399O258K4313L455
$$ -42960 -66627 -58772 -42502 -43830 -42834 -35009 -44996 -28791 -40601 -30202 -23944 369 3824
7063C824q464J0731l752k3431k2003K6219J7114J3289N977n4489j5995L2229K6743
$$ 3824 -4640 6091 2339 -21092 -43095 -16876 238 13527 19504 -34985 -50980 -18751 7992
7050G992L9181J492J1784r314n0789P457O43k4075L3770K932j1629p319J4658
$$ 7992 47173 48665 60449 51135 346 7803 8446 -15629 18141 21073 9444 2125 16783
7037A6783n68n4713L254M7126K1940r26j1604L1092J0470m7832l2333J4274K985
$$ 16783 16215 -38498 -35244 11882 33822 32896 21292 52384 62854 15022 -17311 -3037 -52
7024e2n973J1552M889P749P914k3464o611J9013q336L301j3276J937J3500n307
$$ -52 -6025 5527 10416 18165 26079 2615 -3996 15017 6681 9982 -3294 -1357 12143 6836
7010F836o790k0384k2628J8110J6054p182j810l0614r397K8751L5963J4963q370
$$ 6836 46 -20338 -42966 -24856 -8802 -15984 -17794 -48408 -57805 -29054 6909 21872 13502
6997A3502j1811j7122n024m785j431O894M064j1619j386J6056k0709K8535J1004
$$ 13502 1691 -15431 -20455 -25240 -26671 -19777 -15713 -27332 -28718 -12662 -33371 -4836 6168
6984F168l956P216k1359l8979J9800K6863J1292k177R440J7704J8760M452K197
$$ 6168 2212 9428 -11931 -50910 -31110 -4247 7045 4868 14308 32012 50772 55224 57421
6971E7421l8151k7244l6020j7565J1648J7211J0434L1681j000j9594l5021j4298
$$ 57421 19270 -7974 -43994 -61559 -49911 -32700 -22266 9415 8415 -11179 -46200 -60498
6959f0498J0276K1976p823K652L1780o11J2300J9312m9673O71P616j0874j3324
$$ -60498 -50222 -28246 -36069 -33417 -1637 -2248 10052 29364 -20309 -19638 -12022 -22896 -36220
6946c6220J2056P218J8217k799J0786L9640J0365J4798j5240j6334k1269l8909
$$ -36220 -24164 -16946 1271 -1528 9258 48898 59263 74061 58821 42487 21218 -17691
6934a7691j9910o033J6467l644J6149L8015k2215k3254q28k4096N170L4690K001
$$ -17691 -37601 -43634 -27167 -30811 -14662 23353 1138 -22116 -22944 -47040 -41870 -7180 -5179
6921e179K6677K6413K5076j8063l9921k8031J6953l0907j8993K758J0269O294
$$ -5179 21498 47911 72987 54924 15003 -13028 3925 -26982 -45975 -43217 -32948 -26654
6909b6654K486P236M2494L223n2346k0341N004J9603l222l1857K4694N2556J745
$$ -26654 -24168 -16932 25562 28785 -23561 -43902 -38898 -19295 -22517 -54374 -29680 22876 24621
6896B4621l0319Q14Q553j4205l968Q141j230J0730k49K4840l871k4895P543n826
$$ 24621 -5698 -4884 3669 -10536 -14504 -6363 -7593 3137 2888 27728 23857 -1038 6505 679
6882F79L2074o520k8188k565m913m46J6673J52L316J1604N529k4519Q971M1748
$$ 679 32753 26233 -1955 -4520 -9433 -9879 6794 6946 10262 21866 27395 2876 11847 53595
6868E3595L665l1986k3721O49K2726j2137J4220p093j7099l9685k3043K102L2030
$$ 53595 57260 25274 1553 2202 24928 12791 27011 19918 2819 -36866 -59909 -57807 -25777
6855b5777P002M314n189O712l321K68j0699o559J622P370J3959J1516R039q97
$$ -25777 -18775 -14461 -19650 -12938 -16259 -15991 -26690 -33249 -31627 -24257 -10298 1218 10257 9360
6841I360m496k8796l787J6902j200p300L758k718K723J6866J4338j0749J3993
$$ 9360 4864 -23932 -27719 -10817 -12017 -19317 -15559 -18277 -15554 1312 15650 4901 18894
6828A8894j3979j4834q6j473O204p737l342L322N501J9235O17o928N903k404o525
$$ 18894 4915 -9919 -10005 -11478 -5274 -13011 -16353 -13031 -7530 11705 12322 5394 11297 8893 2368
6813B368P724K937j8588j0592L143K5673P797k0262k6682q747J0625k1974L886
$$ 2368 10092 13029 -5559 -16151 -13008 12665 20462 200 -26482 -35229 -24604 -46578 -42692
6800d2692L2232q39j6682N139r279J1115L5859J7650j7300j6490R403L6915J3029
$$ -42692 -10460 -11299 -27981 -22842 -32121 -21006 14853 32503 15203 -1287 8116 45031 58060
6787E8060k0755l4159l5987r025P054K4804O1639m73l1934k534K051J761p058
$$ 58060 37305 3146 -32841 -41866 -34812 -10008 51631 51158 19224 16690 18741 20502 13444
6774A3444J4041k3463J6781K7985j7391j6395L709L516R2P829K87n744k0307j020
$$ 13444 27485 4022 20803 48788 31397 15002 18711 22227 22319 30148 30435 24691 4384 3364
6760C364J2120K7641j3158j2756m38K6504j8735j1406m495q752N111j4416l8473
$$ 3364 15484 43125 29967 17211 16773 43277 24542 13136 8641 -111 5000 -9416 -47889
6747d7889J5900L5390K9375J9666K1626p455j3669K5240m588j0590J9478L4672
$$ -47889 -31989 3401 32776 52442 74068 66613 52944 78184 73596 63006 82484 117156
6735A17156J7658J3674p048j9288k8361n611K0065J4155p762L8221M3646K3117
$$ 117156 134814 148488 141440 122152 93791 88180 108245 122400 114638 152859 196505 219622
6723B19622j1252p241j4022m1697k7848l2286l4406o961j895J2748j7260k0054
$$ 219622 208370 201129 187107 145410 117562 85276 50870 43909 42014 54762 37502 17448
6711A7448k0670J2782K4777r19k7454l222Q592K0205k6169j1101j594M1600r960
$$ 17448 -3222 9560 34337 33418 5964 2742 11334 31539 5370 -5731 -7325 34275 24315
6698B4315k4083q779m314K1501K0965k8243o578M997R308P140P048K8094Q096
$$ 24315 232 -8547 -12861 8640 29605 1362 -5216 -219 9089 16229 23277 51371 59467
6685E9467R332k4223l2709l0496J951K3141j264j0835j9533q022j0300M533J188
$$ 59467 68799 44576 11867 -18629 -16678 6463 5199 -5636 -25169 -33191 -43491 -38958 -37770
6672c7770j6438J4467q615J952r062M4910j6436q792K8051n340j6015J4028M4232
$$ -37770 -54208 -39741 -48356 -46404 -55466 -10556 -26992 -35784 -7733 -13073 -29088 -15060 29172
6659B9172o20k0840j081L795m1830k705K8231J8116r07m604L298K2057k8628j7332
$$ 29172 28552 7712 6631 10426 -31404 -34109 -5878 12238 11331 6727 10025 32082 3454 -13878
6645a3878K7011J4627K800L2369j9019k3673k5406j5173m72j46K8546l79j1937
$$ -13878 13133 27760 30560 62929 43910 20237 -5169 -20342 -20814 -20960 7586 7207 -4730
6632d730m1338j4807K2249M4115L0350j9254q148q175j2018j7985Q228r395k5780
$$ -4730 -46068 -60875 -38626 5489 35839 16585 8437 262 -11756 -29741 -21513 -30908 -56688
6619e6688j8864L7915K3681M531L2691k832j8235l64j9165j9277J1080L4051J1643
$$ -56688 -75552 -37637 -13956 -9425 23266 20434 2199 1835 -17330 -36607 -25527 8524 20167
6606B0167k1k0926k27J449R189j7846j5199p997o757j5404j3819K1548L0165J7993
$$ 20167 20146 -780 -1007 442 9631 -8215 -23414 -31411 -38168 -53572 -67391 -45843 -15678 2315
6592B315q209j7029l944J0956J4951L6413K0519j3673j8156p526j92j2053k5854
$$ 2315 -5894 -22923 -26867 -15911 -960 35453 55972 42299 24143 16617 16425 4372 -21482
6579b1482j6427k0855J4896J5459J2348O428J0688N616j0851M171j0119L2038
$$ -21482 -37909 -58764 -43868 -28409 -16061 -9633 1055 6671 -4180 -9 -10128 21910
6567B1910L7428j766m1416r306K4355N461p021K2732j5275q719k6019p028J2211
$$ 21910 59338 57572 16156 6850 31205 36666 29645 52377 37102 28383 2364 -4664 7547
6554G547J8235l833j3458k590j8469j2597j0707N701O809K1560K655j1402K6678
$$ 7547 25782 21949 8491 5901 -12568 -25165 -35872 -30171 -23362 -1802 853 -10549 16129
6541A6129q009l2031k7559J4253J9200P365J4543P225k3358K8664R985m7650K0754
$$ 16129 8120 -23911 -51470 -37217 -18017 -10652 3891 11116 -12242 16422 26407 -21243 -489
6528d89J6708P337j0949J1610N068l6244m6592J3327K7111J3666j2852l6832J8495
$$ -489 16219 23556 12607 24217 29285 -6959 -53551 -40224 -13113 553 -12299 -49131 -30636
6515c0636J8484K1187J6838o354k0866m535L7O211j6133K9627M515l4896k4732
$$ -30636 -12152 9035 25873 19519 -1347 -5882 -5845 366 -15767 13860 18375 -16521 -41253
6502d1253j9020K036N672J4513N582J8412K5664K4533L2704J4062m6250k3078
$$ -41253 -60273 -58237 -52565 -38052 -32470 -14058 11606 36139 68843 82905 36655 13577
6490A3577J6878Q54J1931J7103l6661j2545j4695m608J9617j1191k1255r20j3519
$$ 13577 30455 31309 43240 60343 23682 11137 -3558 -8166 11451 260 -20995 -21915 -35434
6477c5434k0436J2684j8635J1804j4175K1452L0534k1898n36K2022j4545K427
$$ -35434 -55870 -43186 -61821 -50017 -64192 -42740 -12206 -34104 -34640 -12618 -27163 -24736
6465b4736Q808k396J1388L8952j2365k3533j1069j1598j3212p405N0393J9866
$$ -24736 -15928 -18324 -6936 32016 19651 -3882 -14951 -26549 -39761 -47166 3227 23093
6453B3093j5295k2482k4528p130L1010J69k0052q499k294j6957J5962K1841j2061
$$ 23093 7798 -14684 -39212 -46342 -15332 -15163 -35215 -43714 -46008 -62965 -47003 -25162 -37223
6440c7223o612k970L152L4338M801k211l621j1824Q715J9714Q561m397k1234j4437
$$ -37223 -43835 -46805 -43653 -9315 -4514 -6725 -10346 -22170 -13455 6259 14820 10423 -10811 -25248
6426b5248K416K1179O561J4558k7338M138J792J6404K495J401J692k1763l832
$$ -25248 -22832 -1653 4908 19466 -7872 -3734 -1942 14462 16957 18358 20050 -1713 -5545
6413e545l5677N954L3620N824j1262J4637J0344k3031j6386j4321J6410N224j0514
$$ -5545 -41222 -35268 -1648 4176 -7086 7551 17895 -5136 -21522 -35843 -19433 -14209 -24723
6400b4723k5789j5340r899J6413Q727J2817j6N732q181j637R799L806q718p649
$$ -24723 -50512 -65852 -75751 -59338 -50611 -37794 -37810 -32078 -40259 -41896 -32097 -28291 -37009 -44658
6386d4658k302J0197q892O229J4249J3959r372l0772l339K5681J3031r533j3948
$$ -44658 -46960 -36763 -45655 -39426 -25177 -11218 -20590 -51362 -54701 -29020 -15989 -25522 -39470
6373c9470N416K7338k683j7264l344K7874j0445k2513K0297N367j728m457j3269
$$ -39470 -34054 -6716 -9399 -26663 -30007 -2133 -12578 -35091 -14794 -9427 -11155 -15612 -28881
6360b8881M1953K2110K5864R300m2187n5790N404R578P484q759j0912J3791L0613
$$ -28881 13072 35182 61046 70346 28159 -27631 -22227 -12649 -5165 -13924 -24836 -11045 19568
6347A9568L1275j02l1808j6671J8147l1369K5479R303k751J8451o010n232p432
$$ 19568 50843 50741 18933 2262 20409 -10960 14519 23822 21071 39522 33512 28280 20848
6334B0848K1356n974k0419m519k2945J4335j3125J2284J1443k9369k363J6169
$$ 20848 42204 36230 15811 11292 -11653 2682 -10443 1841 13284 -16085 -18448 -2279
6322b279k3585l0266K3538J5814q239J3950L0422M693m153j9386l361r837m069
$$ -2279 -25864 -56130 -32592 -16778 -25017 -11067 19355 24048 19895 509 -2852 -12689 -16758
6309a6758Q797M9642P29j4991m76q198n968o143k1704k7160k1283J0033L9408
$$ -16758 -7961 41681 42410 27419 26943 18745 12777 6634 -15070 -42230 -63513 -53480 -14072
6296a4072J3589R924J6248J9907M340Q435n200k7844j1181j3687k6249R711J9771
$$ -14072 -483 9441 25689 45596 49936 58371 53171 25327 14146 459 -25790 -16079 3692
6283C692J2690J3823j331o184l030J8398n996j0729M635K0317j4452j0333l0027
$$ 3692 16382 30205 28874 22690 19660 38058 32062 21333 25968 46285 31833 21500 -8527
6270h527k4754J2958J4506J1604J1305J8518j0454o191l7879J1639L2782K4958
$$ -8527 -33281 -20323 -5817 5787 17092 35610 25156 18965 -18914 -7275 25507 50465
6258E0465K1696k5402K120J6133j1342k9766j1441l1638p767n154R204J6792n197
$$ 50465 72161 46759 48879 65012 53670 23904 12463 -19175 -26942 -32096 -22892 -6100 -11297
6245a1297R606J4079k4932j2574J9574K1347K1203K040k736j161l0646j6959r668
$$ -11297 -1691 12388 -12544 -25118 -5544 15803 37006 39046 36310 35149 4503 -12456 -22124
6232b2124o364r280k622K4270r124J2678K3795K9099r915k902n772k2973j136
$$ -22124 -28488 -37768 -40390 -16120 -25244 -12566 11229 40328 30413 27511 21739 -1234 -2370
6219b370Q685j119j2821J06J0969J105j4428L361p138m476L2k0242K089k693J68
$$ -2370 6315 5196 -7625 -7519 3450 4555 -9873 -6512 -13650 -18126 -18094 -38336 -36247 -38940 -38772
6204c8772j366j993L513j071k686m066j3365o706J7092m940q522L7106n27M884
$$ -38772 -40138 -42131 -38618 -39689 -42375 -46441 -59806 -66512 -49420 -54360 -62882 -25776 -26303 -21419
6190b1419J7300J662J2491k2599j5873m30o727L014k2861j2879j0686o544L67
$$ -21419 -4119 -2457 10034 -12565 -28438 -28868 -35595 -32581 -55442 -68321 -79007 -85551 -85184
6177h5184O320M5978L0734k604q723o733J262k1359J526n87K6924J4331J2480
$$ -85184 -78864 -32886 -2152 -4756 -13479 -20212 -18950 -40309 -38783 -39370 -12446 1885 14365
6164A4365K0315k1864k2246O780k7081j0062J453J9000J9108j4025r877j1137
$$ 14365 34680 12816 -9430 -2650 -29731 -39793 -38340 -19340 -232 -14257 -24134 -35271
6152c5271k6753R851J610K4246L4740k4050k2272j8421Q991j136J8868N3634r610
$$ -35271 -62024 -52173 -50563 -26317 8423 -15627 -37899 -56320 -47329 -48465 -29597 24037 14427
6139A4427j1332J6278m238k8516R480J8498K2057J1454J3353j5286K6370j9964
$$ 14427 3095 19373 15135 -13381 -3901 14597 36654 48108 61461 46175 72545 52581
6127E2581j8974k7738r340Q479M879j3820n946R247J4487K673j3193k9283j2964
$$ 52581 33607 5869 -3471 5008 9887 -3933 -9879 -632 13855 16528 3335 -25948 -38912
6114c8912M042J2497N1006K8994J7603m1236l3887K486Q767k4762k1218j728K4978
$$ -38912 -34870 -22373 28633 57627 75230 33994 107 2593 11360 -13402 -34620 -36348 -11370
6101a1370K6785J443q110j6828l258L304r46j6246j8173M2543K7819K688j520
$$ -11370 15415 16858 8748 -8080 -11338 -8034 -8980 -25226 -43399 -856 26963 29651 28131
6088B8131k7952k120j983J5355J4006J2277Q436l067j6871M478k7030j8437M2944
$$ 28131 179 -1941 -3924 11431 25437 37714 46150 43083 26212 30690 3660 -14777 28167
6075B8167L1370l5334k1214K0831l767l1559j9373j8277j2050J1946K1405J0108
$$ 28167 59537 24203 2989 23820 20053 -11506 -30879 -49156 -61206 -49260 -27855 -17747
6063a7747j646q799N783P994J0683r835J2841j2305k1161R896L6766K8536k106
$$ -17747 -19393 -28192 -22409 -14415 -3732 -13567 -726 -13031 -34192 -24296 12470 41006 38900
6050C8900q483j6787k821K0276k5509k7848j091J2120L4988M5473m515r988J4967
$$ 38900 30417 13630 10809 31085 5576 -22272 -23363 -11243 23745 69218 64703 54715 69682
6037F9682k591j1291l8632l4382j7012O553Q472J5690j6097J096p731l116p170
$$ 69682 67091 55800 17168 -17214 -34226 -27673 -19201 -3511 -19608 -18512 -26243 -29359 -36529
6024c6529J8510K889m404j2524j2859m12j423M719m080P497J2768K3954R646k8272
$$ -36529 -18019 -15130 -19534 -32058 -44917 -45329 -46752 -42033 -46113 -38616 -25848 -1894 7752 -20520
6010b0520M060K4721K0793j953k2944o973R120k030k9059k4471J0338J3937j2287
$$ -20520 -16460 8261 29054 27101 4157 -2816 6304 4274 -24785 -49256 -38918 -24981 -37268
5997c7268k291J2346K0199P933O729Q858k262q631o284k0655p113j3169j1452
$$ -37268 -39559 -27213 -7014 919 7648 16506 14244 5613 -671 -21326 -28439 -41608 -53060
5984e3060o643J8287K2449J1177k2721j8357L8J7388L1896L9852O768k1476j0494
$$ -53060 -59703 -41416 -18967 -7790 -30511 -48868 -48830 -31442 454 40306 47074 25598 15104
5971A5104k2060k5750J1602K5134K5371J8693J9370o874k3921k0672j6586q13
$$ 15104 -6956 -32706 -21104 4030 29401 48094 67464 60590 36669 15997 -589 -1402
5959a402R823J7636P459k4990L339K3373j0934j7836N369L1427K2110j3367k9387
$$ -1402 8421 26057 33516 8526 11865 35238 24304 6468 11837 43264 65374 52007 22620
5946B2620k006Q853p726k9736l4337J6545M811J3466O377k4197J1688r819l6419
$$ 22620 20614 29467 21741 -7995 -42332 -25787 -20976 -7510 -1133 -25330 -13642 -23461 -59880
5933e9880Q520P801L8578J3410L307R457J5785p438l4378l4501Q845J6028j0312
$$ -59880 -51360 -43559 -4981 8429 11736 21193 36978 29540 -4838 -39339 -30494 -14466 -24778
5920b4778n7640q548K9361M1041l27j1482j3018k1329J4854L6196j1315j8153
$$ -24778 -82418 -90966 -61605 -20564 -20891 -32373 -45391 -66720 -51866 -15670 -26985 -45138
5908d5138K0219m507k0427J1428m634J2307L5284k902p803L942k6613J3881J6421
$$ -45138 -24919 -29426 -49853 -38425 -43059 -30752 4532 1630 -6173 -2231 -28844 -14963 1458
5895A458o684l7788K0769M0151J186k864J0728q900m8883p075K4414k9344k5290
$$ 1458 -5226 -43014 -22245 17906 19092 16228 26956 18056 -30827 -37902 -13488 -42832 -68122
5882f8122M881N056L5560K7528j873k8313m818R676j0113O340k3941J5209J3351
$$ -68122 -63241 -58185 -22625 4903 3030 -25283 -30101 -20425 -30538 -24198 -48139 -32930 -19579
5869a9579j9392j4922K6148J0188J6539L9250j263j9812j3819J573k4664j4734
$$ -19579 -38971 -53893 -27745 -17557 -1018 38232 36969 17157 3338 4911 -19753 -34487
5857c4487O768K8402M0491K398k6614l3467j0715J6992O684M398M009k0374n084
$$ -34487 -27719 683 41174 43572 16958 -16509 -27224 -10232 -3548 850 4859 -15515 -20599
5844b0599K0898J7749l1340l3721k302r030R553j221N836J7236j1584R525l5J1260
$$ -20599 299 18048 -13292 -47013 -49315 -58345 -48792 -50013 -44177 -26941 -38525 -29000 -29035 -17775
5830a7775J221n959Q458P663K7007j1350j0408k9113k3196M697L1185M295j0261
$$ -17775 -16554 -22513 -14055 -6392 20615 9265 -1143 -30256 -53452 -48755 -17570 -13275 -23536
5817b3536O641l170k3744K7786K1410J4076n814N732K0411k5475j6634J0057j0535
$$ -23536 -16895 -20065 -43809 -16023 5387 19463 13649 19381 39792 14317 -2317 7740 -2795
5804b795l5606k576P282R145o465j2853P366J0718K99r166J2662J2674J7962P227
$$ -2795 -38401 -40977 -33695 -24550 -31015 -43868 -36502 -25784 -25485 -34651 -21989 -9315 8647 15874
5790A5874J9589J452k8156j6640K6513N077j6925j1438P760k7312L157J7116j8875
$$ 15874 35463 36915 8759 -7881 18632 23709 6784 -4654 3106 -24206 -21049 -3933 -22808
5777b2808l6161l541k1R081L0346j2948Q249K2030Q170J523k0223Q041j0288N136
$$ -22808 -58969 -62510 -62531 -53450 -23104 -36052 -27803 -5773 2397 3920 -16303 -8262 -18550 -13414
5763a3414J5621j2976j3329k7416k0884K4483L1391k3434n234J9666J9284M061
$$ -13414 2207 -10769 -24098 -51514 -72398 -47915 -16524 -39958 -45192 -25526 -6242 -2181
5751b181j6735O608O168j1043J1602J4233N673j9294j2770l1453k0794K9167L7557
$$ -2181 -18916 -12308 -6140 -17183 -5581 8652 14325 -4969 -17739 -49192 -69986 -40819 -3262
5738c262L0272J1294k2170k5501k8060N464L5240J4270l5713k3406J1060K5009
$$ -3262 27010 38304 16134 -9367 -37427 -31963 3277 17547 -18166 -41572 -30512 -5503
5726e503Q728K97l833j5734r042k968K3779j2244M307R717l9698k9872K6552J5024
$$ -5503 3225 3522 -311 -16045 -25087 -28055 -4276 -16520 -12213 -2496 -42194 -72066 -45514 -30490
5712c0490j9695K7833J3195j3503k2975q096j6250k1797K7837M9994p661k0368
$$ -30490 -50185 -22352 -9157 -22660 -45635 -53731 -69981 -91778 -63941 -13947 -21608 -41976
5700d1976j1851K4834M972r996O351J8550m6265j0564J754L10J8652j2043N166
$$ -41976 -53827 -28993 -24021 -34017 -27666 -9116 -55381 -65945 -64191 -63881 -45229 -57272 -52106
5687e2106L1019K5881J5067j0239l6582n65J696J0115J4525J0983L574p918j3991
$$ -52106 -21087 4794 19861 9622 -26960 -27525 -25829 -15714 -1189 9794 13368 5450 -8541
5674h541L644J5267j8430J212L5204Q266l9671k8191j3960P998J385L1011j792
$$ -8541 -4897 10370 -8060 -6848 28356 36622 -3049 -31240 -45200 -37202 -35817 -4806 -6598
5661f598k0610o917J1000j073l6089P079J9393J2998L260N766K190k2902M127
$$ -6598 -27208 -34125 -23125 -24198 -60287 -53208 -33815 -20817 -17557 -11791 -9601 -32503 -28376
5648b8376j2324m028M67L724k4978J2642K5148m105r624Q459L842J4961N716l115
$$ -28376 -40700 -44728 -44261 -40537 -65515 -52873 -27725 -31830 -41454 -32995 -29153 -14192 -8476 -11591
5634a1591m3483j6207K1366k3281j170j6293J5403R507J357j3159j2767K8150
$$ -11591 -55074 -71281 -49915 -73196 -74366 -90659 -75256 -65749 -64392 -77551 -90318 -62168
5622f2168N4648K5387n876j0435K7202n737p770K1420j6243r631k17j9774J1694
$$ -62168 -7520 17867 11991 1556 28758 23021 15251 36671 20428 10797 10580 -9194 2500
5609B500J3615K9363k012j5735p186p835K1384j1562m0506l8294j5987M0535N882
$$ 2500 16115 45478 43466 27731 20545 12710 34094 22532 -17974 -56268 -72255 -31720 -25838
5596b5838k6168o348J57J6324J7593k433J3689K957k3023k0326K433O900J1973
$$ -25838 -52006 -58354 -58197 -41873 -24280 -26713 -13024 -10067 -33090 -53416 -50983 -44083 -32110
5583c2110K375j855P982M0571J9024j5622p91j2281j332L6921q60N718j320j0206
$$ -32110 -29735 -31590 -23608 16963 35987 20365 19574 7293 5961 42882 42022 47740 46420 36214
5569C6214k0417k7305l123l2438K0499J3359j8926K7717k2898k7501L59p799J2065
$$ 36214 15797 -11508 -14631 -47069 -26570 -13211 -32137 -4420 -27318 -54819 -54460 -62259 -50194
5556e0194J9967J8273J0858l476J4565j2860q789j4889m102k0616J4388L9594
$$ -50194 -30227 -11954 -1096 -4572 9993 -2867 -11656 -26545 -30647 -51263 -36875 2719
5544B719L018L0753K3708j5433m790r583k6849o286J7695j0547j4443K2154L006
$$ 2719 5737 36490 60198 44765 39975 30392 3543 -2743 14952 4405 -10038 12116 15122
5531A5122j0352j2954L610K2135J9170j1685j24j0793l4123L516J4719p277l0173
$$ 15122 4770 -8184 -4574 17561 36731 25046 24922 14129 -19994 -16478 -1759 -9036 -39209
5518c9209J684j1642j1626L7493L0344L235O776j7040l0456j7370J9797K7277
$$ -39209 -37525 -49167 -60793 -23300 7044 10279 17055 15 -30441 -47811 -28014 -737
5506g37J3239M167J911l596j5471j7621N560O249P918k53l3445j3970k3579N310
$$ -737 12502 16669 18580 14984 -487 -18108 -12548 -6299 1619 1366 -32079 -46049 -69628 -64318
5492f4318O094r380J2526K0557Q312J4094J3567j7163J362j6602K0102L707k5039
$$ -64318 -58224 -67604 -55078 -34521 -26209 -12115 1452 -15711 -14349 -30951 -10849 -7142 -32181
5479c2181l4969J545M8276Q723J943l354P034J168J5474r027K0044J2873k3506
$$ -32181 -67150 -65605 -17329 -8606 -6663 -10017 -2983 -1815 13659 4632 24676 37549 14043
5466A4043K44O250J630k5920m3910j7637J3643J721L5771o652J8922J7264O086
$$ 14043 14287 20537 22167 -3753 -47663 -65300 -51657 -49936 -14165 -20817 -1895 15369 21455
5453B1455k122l8672j1859m15Q883O439L2980Q355j7029l325l2152l8499K9599
$$ 21455 19333 -19339 -31198 -31613 -22730 -16291 16689 25044 8015 4690 -27462 -65961 -36362
5440c6362r161j0836L1513K8730J5694j3551k2411J4862J3815o323m6174J8024
$$ -36362 -45523 -56359 -24846 3884 19578 6027 -16384 -1522 12293 5970 -40204 -22180
5428b2180J244J6765Q668P011N152l2774k424j3089O518O654J1005P034j7070
$$ -22180 -20936 -4171 4497 11508 16660 -16114 -18538 -31627 -25109 -18455 -7450 -416 -17486
5415a7486j3456p994K326j8803K0056J6091p305k1675j4740K3133K4492O784L27
$$ -17486 -30942 -38936 -36610 -55413 -35357 -19266 -26571 -48246 -62986 -39853 -15361 -8577 -8250
5402h250m657k4982P795K6439L6332L6319k7025l7867j6179r882n740L8920J4166
$$ -8250 -12907 -37889 -30094 -3655 32677 68996 41971 4104 -12075 -21957 -27697 11223 25389
5389B5389p530j1667m698j2470J102N334q91l9193M434M3701m504k1510K0975
$$ 25389 17859 6192 1494 -10976 -9874 -4540 -5431 -44624 -40190 3511 -993 -22503 -1528
5376a528J0019j0842k783Q573m544k0124J4353N470M20l365j5615k5043L555j1620
$$ -1528 8491 -2351 -5134 3439 -1105 -21229 -6876 -1406 -986 -4351 -19966 -45009 -41454 -53074
5362e3074K3203j658l3866K3350J608J2346L450J0543J4183K3199K3694j8464
$$ -53074 -29871 -31529 -65395 -42045 -40437 -28091 -24641 -14098 85 23284 46978 28514
5350B8514k3006j2555J23k349O045L7911r512j2203n968J76j9702l6701O759K2012
$$ 28514 5508 -7047 -6924 -9273 -3228 34683 25171 12968 7000 7176 -12526 -49227 -42468 -20456
5336b0456J9115q301k383l195j5109l911q793L4656K4912L152l8197k8712J904
$$ -20456 -1341 -9642 -12025 -15220 -30329 -34240 -43033 -8377 16535 19687 -18510 -47222 -45318
$$ [...]
##END NTUPLES=NMR SPECTRUM
##END=
