##TITLE=Analysis number 320659
Compound Code cc 14906
Project Code adrs
Chemist Name af chempharm
##JCAMPDX= 6.0         $$ Bruker NMR JCAMP-DX V2.0
##DATA TYPE= NMR SPECTRUM
##DATA CLASS= NTUPLES
##ORIGIN= Bruker BioSpin GmbH
##OWNER= nmr
$$ XWIN-NMR		Version 3.5
$$ Tue Jul  4 12:49:20 2006 GMT Daylight Time (UT+1h)  MAYBRIDGE\nmr@NMR_250MHZ
##.OBSERVE FREQUENCY= 250.131544655141
##.OBSERVE NUCLEUS= ^1H
##.ACQUISITION MODE= SIMULTANEOUS (DQD)
##.ACQUISITION SCHEME= undefined
##.AVERAGES= 16
##.DIGITISER RES= 18
##SPECTROMETER/DATA SYSTEM= dpx250
##.PULSE SEQUENCE= zg30
##.SOLVENT NAME= CDCl3
##.SHIFT REFERENCE= (INTERNAL, CDCl3, 0, 16.522)
##AUDIT TRAIL= $$ (NUMBER, WHEN, WHO, WHERE, WHAT)
$$ ##TITLE= Audit trail, XWIN-NMR		Version 3.5
$$ ##JCAMPDX= 5.01
$$ ##ORIGIN= Bruker BioSpin GmbH
$$ ##OWNER= nmr
$$ C:\u/data/dgb/nmr/ADRS/2270/pdata/1/auditp.txt
$$ ##AUDIT TRAIL=  $$ (NUMBER, WHEN, WHO, WHERE, WHAT)
(   1,<2006-07-04 12:48:56.45 +100>,<MAYBRIDGE\nmr>,<NMR_250MHZ>,
      <created by zg, POWCHK disabled, PULCHK disabled
       configuration hash MD5:
       E2 DF 36 D8 04 B2 41 60 5A D7 A3 38 5A 4B D0 FE
       data hash MD5: 64K
       07 BF D7 FF 60 C2 F0 F2 A0 B2 1B 54 BB DD 6D C8>)
(   2,<2006-07-04 12:49:10.83 +100>,<MAYBRIDGE\nmr>,<NMR_250MHZ>,
      <Start of raw data processing
       ef LB = 0.3 FT_mod = 6 PKNL = 1 SI = 32K 
       data hash MD5: 32K
       0A CF 1F 39 BA E7 93 45 77 72 4E CD 0E 2A BE 27>)
(   3,<2006-07-04 12:49:12.52 +100>,<MAYBRIDGE\nmr>,<NMR_250MHZ>,
      <apk 
       data hash MD5: 32K
       6F 47 71 1E E4 6C 20 8A B0 CC 31 8E 28 BF 60 9D>)
(   4,<2006-07-04 12:49:13.39 +100>,<MAYBRIDGE\nmr>,<NMR_250MHZ>,
      <abs ABSG = 5 
       data hash MD5: 32K
       A0 CC 82 66 0D 2E 93 54 42 5E 63 6F 57 29 D2 C6>)
$$ ##END=
$$ 
$$ hash MD5
$$ E5 2A 01 DF 3C 61 C9 79 8E FC 8D 6C 96 32 54 C6
##$RELAX= 
##$RELAX= 
##$RELAX= 
##$RELAX= 
##$RELAX= 
##$RELAX= 
##$RELAX= 
$$ Bruker specific parameters
$$ --------------------------
##$DU= <C:\u>
##$EXPNO= 2270
##$NAME= <ADRS>
##$PROCNO= 1
##$TYPE= <nmr>
##$USER= <dgb>
##$AMP= (0..31)
100 100 100 100 100 100 100 100 100 100 100 100 100 100 100 100 100 100 
100 100 100 100 100 100 100 100 100 100 100 100 100 100 
##$AQSEQ= 0
##$AQ_mod= 3
##$AUNM= <au_zg>
##$AUTOPOS= <27 >
##$BF1= 250.13
##$BF2= 250.13
##$BF3= 250.13
##$BF4= 250.13
##$BF5= 500.13
##$BF6= 500.13
##$BF7= 500.13
##$BF8= 500.13
##$BYTORDA= 1
##$CFDGTYP= 0
##$CFRGTYP= 5
##$CHEMSTR= <none>
##$CNST= (0..31)
1 1 145 1 1 1 1 1 1 1 1 1 1 1 1 1 1 1 1 1 1 1 1 1 1 1 1 1 1 1 1 1 
##$CPDPRG= <>
##$CPDPRG1= <>
##$CPDPRG2= <>
##$CPDPRG3= <>
##$CPDPRG4= <mlev>
##$CPDPRG5= <mlev>
##$CPDPRG6= <mlev>
##$CPDPRG7= <mlev>
##$CPDPRG8= <mlev>
##$CPDPRGB= <>
##$CPDPRGT= <>
##$D= (0..31)
0 1 0 0 0 0 0 0 0 0.06 0 0 0 0 0 0 0.0002 0 0 0 0 0 0 0 0 0 0 0 0 0 0 
0 
##$DATE= 1152013735
##$DBL= (0..7)
120 120 120 120 120 120 120 120 
##$DBP= (0..7)
150 150 150 150 150 150 150 150 
##$DBP07= 0
##$DBPNAM0= <>
##$DBPNAM1= <>
##$DBPNAM2= <>
$$ [...]
##$SUBNAM7= <"">
##$SUBNAM8= <"">
##$SUBNAM9= <"">
##$SW= 20.6930455092707
##$SWIBOX= (0..15)
0 0 3 0 0 0 0 0 0 0 0 0 0 0 0 0 
##$SW_h= 5175.983436853
##$TD= 65536
##$TD0= 1
##$TE= 296.16
##$TE2= 300
##$TE3= 300
##$TEG= 300
##$TL= (0..7)
0 120 120 120 120 120 120 120 
##$TP= (0..7)
150 150 150 150 150 150 150 150 
##$TP07= 0
##$TPNAME0= <>
##$TPNAME1= <>
##$TPNAME2= <>
##$TPNAME3= <>
##$TPNAME4= <>
##$TPNAME5= <>
##$TPNAME6= <>
##$TPNAME7= <>
##$TPOAL= (0..7)
0.5 0.5 0.5 0.5 0.5 0.5 0.5 0.5 
##$TPOFFS= (0..7)
0 0 0 0 0 0 0 0 
##$TUNHIN= 0
##$TUNHOUT= 0
##$TUNXOUT= 0
##$USERA1= <user>
##$USERA2= <user>
##$USERA3= <user>
##$USERA4= <user>
##$USERA5= <user>
##$V9= 5
##$VALIST= <valist>
##$VCLIST= <CCCCCCCCCCCCCCC>
##$VD= 0
##$VDLIST= <DDDDDDDDDDDDDDD>
##$VPLIST= <PPPPPPPPPPPPPPP>
##$VTLIST= <TTTTTTTTTTTTTTT>
##$WBST= 1024
##$WBSW= 4
##$XGAIN= (0..3)
0 0 0 0 
##$XL= 0
##$YL= 0
##$YMAX_a= 415872
##$YMIN_a= -503406
##$ZGOPTNS= <>
##$ZL1= 120
##$ZL2= 120
##$ZL3= 120
##$ZL4= 120
##$ABSF1= 16.522
##$ABSF2= -4.171173
##$ABSG= 5
##$ABSL= 3
##$ALPHA= 0
##$AQORDER= 0
##$ASSFAC= 0
##$ASSFACI= 0
##$ASSFACX= 0
##$ASSWID= 0
##$AUNMP= <proc_1d>
##$AZFE= 0.1
##$AZFW= 0.1
##$BCFW= 0
##$BC_mod= 0
##$BYTORDP= 0
##$COROFFS= 0
##$CY= 12.5
##$DATMOD= 1
##$DC= 0
##$DFILT= <>
##$DTYPP= 0
##$F1P= 14.0000005364418
##$F2P= -0.99999901652339
##$FCOR= 0.5
##$FTSIZE= 32768
##$FT_mod= 6
##$GAMMA= 0
##$GB= 0
##$INTBC= 1
##$INTSCL= 1
##$ISEN= 128
##$LB= 0.3
##$LEV0= 0
##$LPBIN= 0
##$MAXI= 10000
##$MC2= 0
##$MEAN= 0
##$ME_mod= 0
##$MI= 0
##$NCOEF= 0
##$NC_proc= -3
##$NLEV= 6
##$NOISF1= 0
##$NOISF2= 0
##$NSP= 0
##$NTH_PI= 0
##$NZP= 0
##$OFFSET= 16.522
##$PC= 1
##$PHC0= 159.8997
##$PHC1= 7.813885
##$PH_mod= 1
##$PKNL= yes
##$PPARMOD= 0
##$PSCAL= 4
##$PSIGN= 0
##$REVERSE= no
##$SF= 250.13
##$SI= 32768
##$SIGF1= 0
##$SIGF2= 0
##$SINO= 400
##$SIOLD= 32768
##$SREGLST= <1H.CDCl3>
##$SSB= 0
##$STSI= 32768
##$STSR= 0
##$SW_p= 5175.98343685301
##$SYMM= 0
##$S_DEV= 0
##$TDeff= 65536
##$TDoff= 0
##$TI= <Analysis number 999999
Compound Code 99
Book Reference 9
Project Code 9>
##$TILT= no
##$TM1= 0
##$TM2= 0
##$TOPLEV= 0
##$USERP1= <user>
##$USERP2= <user>
##$USERP3= <user>
##$USERP4= <user>
##$USERP5= <user>
##$WDW= 1
##$XDIM= 32768
##$YMAX_p= 379923568
##$YMIN_p= -193603
$$ End of Bruker specific parameters
$$ ---------------------------------
##NTUPLES= NMR SPECTRUM
##VAR_NAME=  FREQUENCY,     SPECTRUM/REAL,   SPECTRUM/IMAG
##SYMBOL=    X,             R,               I
##VAR_TYPE=  INDEPENDENT,   DEPENDENT,       DEPENDENT
##VAR_FORM=  AFFN,          ASDF,            ASDF
##VAR_DIM=   32768,         32768,           32768
##UNITS=     HZ,            ARBITRARY UNITS, ARBITRARY UNITS
##FACTOR=    0.157963299565203, 1,           1
##FIRST=     4132.6476996994, 0,             0
##LAST=      -1043.33573715361, 0,           0
##MIN=       -1043.33573715361, -193603,     0
##MAX=       4132.6476996994, 379923568,     0
$$ Real data points
##PAGE= N=1
##DATA TABLE= (X++(R..R)), XYDATA
$$ [...]
16711G6874r933p297p15j2440j161n420P00R735j3517P876K9767O829m871L566
$$ 76874 66941 59644 58929 46489 45328 39908 40608 50343 36826 44702 74469 81298 76427 79993
16697G9993j4384o645k263p914K242j68n019j416o801K996K94j2364j1364K558
$$ 79993 65609 58964 56701 48787 51029 50861 45842 44426 37625 40621 40915 28551 17187 19745
16683A9745Q795P562l199j0509p33o91N329L444j0721q704j3391L71K271L250
$$ 19745 28540 36102 32903 22394 21661 20970 26299 29743 19022 10318 -3073 -2702 -431 2819
16669B819J4503O97k2634P67J6164K1812K880J1895J1711K015m77J2691P417R48
$$ 2819 17322 18019 -4615 -3848 12316 34128 37008 48903 60614 62629 62152 74843 82260 83208
16655H3208q90n792p408J466P402q891k898r58K705j1873p632o598l386J0892
$$ 83208 82318 76526 69118 70584 77986 69095 66197 65239 67944 56071 48439 41841 38455 49347
16641D9347Q918L236r480n085M133K799o226P680l929m608j3013P364N949m219
$$ 49347 58265 61501 52021 46936 51069 53868 47642 55322 51393 46785 33772 41136 47085 42866
16627D2866o130J1308N835n702j2548L347J3769k54k5121q988P858j472J725K648
$$ 42866 36736 48044 53879 48177 35629 38976 52745 52491 27370 18382 26240 24768 26493 29141
16613B9141r781j5745M240J4579l575m908p4N159r065M313K60j2193j0178q320
$$ 29141 19360 3615 7855 22434 18859 13951 13877 19036 9971 14284 14544 2351 -7827 -16147
16599a6147K692L076Q673J1118R681J517K230q41j5917k0659j2205n114J2881
$$ -16147 -13455 -10379 -1706 9412 19093 20610 22840 21999 6082 -14577 -26782 -31896 -19015
16586a9015J0042R986J7348j8138j9601Q943m688n675P672L17n092Q747J3972
$$ -19015 -8973 1013 18361 223 -19378 -10435 -15123 -20798 -13126 -12809 -17901 -9154 4818
16573D818j666j7395p698J1498N688j7317K184j889L046p980k771R597k2244K638
$$ 4818 3152 -14243 -21941 -10443 -4755 -22072 -19888 -21777 -18731 -26711 -29482 -19885 -42129 -39491
16559c9491J7131O953J4046n746o212o003l036J0173N331j300M111K354j6028
$$ -39491 -22360 -15407 -1361 -7107 -13319 -19322 -22358 -12185 -6854 -8154 -4043 -1689 -17717
16546a7717j968o152L18J7121n487j8289n136j9875P35J4141n62L867N072L816
$$ -17717 -19685 -25837 -25519 -8398 -13885 -32174 -37310 -57185 -56450 -42309 -42871 -39004 -33932 -30116
16532c0116o399n549K0939J6380j1453j964m053K063j9287j1280J4560K5639K861
$$ -30116 -36515 -42064 -21125 -4745 -16198 -18162 -22215 -20152 -39439 -50719 -36159 -10520 -7659
16519g659j5506j3285j662J9911Q883j3634r4m227R396l64K748j624m940m17j3733
$$ -7659 -23165 -36450 -38112 -18201 -9318 -22952 -23046 -27273 -17877 -18241 -15493 -17117 -22057 -22474 -36207
16504c6207P746o22L1356P837j2314k9939j2086J0549J3043L912J638n09N929
$$ -36207 -28461 -29083 2273 10110 -2204 -32143 -44229 -33680 -20637 -16725 -15087 -15596 -9667
16491i667P89r731n718L634J3712J2365P834Q4j6123r844L303K2102J7840m350
$$ -9667 -8878 -18609 -24327 -20693 -6981 5384 13218 13302 -2821 -12665 -9362 12740 30580 26230
16477B6230j7265r40R157K693j3140q826n16k117k886j1408j369J159l194k995
$$ 26230 8965 8025 17182 19875 6735 -2091 -2607 -4724 -7610 -19018 -20387 -19228 -22422 -25417
16463b5417K30J2954L078P066M053J778J4689l606j1106m146j266p191K752K660
$$ -25417 -25187 -12233 -9155 -2089 1964 3742 18431 14825 3719 -427 -1693 -8884 -6132 -3472
16449c472m725k48l005l842p528M513M175p089l936J2600N487o010j4122p513
$$ -3472 -8197 -8445 -11450 -15292 -22820 -18307 -14132 -21221 -25157 -12557 -7070 -13080 -27202 -34715
16435c4715j1405q847Q740M580J489Q249K666n973o416P029L498p11j4292J3132
$$ -34715 -46120 -54967 -46227 -41647 -40158 -31909 -29243 -35216 -41632 -34603 -31105 -31816 -46108 -32976
16421c2976J3483J976k619P141l363r391L661J47L856J737M191j691P311L710
$$ -32976 -19493 -17517 -20136 -12995 -16358 -25749 -22088 -21941 -18085 -16348 -12157 -13848 -6537 -2827
16407b827K865j3118o742l969j5752k947J628j594K982J1174N193K759K1042k010
$$ -2827 38 -13080 -19822 -23791 -39543 -42490 -40862 -42456 -39474 -28300 -23107 -20348 694 -1316
16393a316j0o813q043l968p936l008L059L652K942O475r779o82j7543p184L856
$$ -1316 -1326 -8139 -16182 -20150 -28086 -31094 -28035 -24383 -21441 -14966 -24745 -25427 -42970 -50154 -46298
16378d6298J2080l815j171O847j406J6219j500j0452k513J1798O224o569P57q352
$$ -46298 -34218 -38033 -39204 -32357 -33763 -17544 -19044 -29496 -32009 -20211 -13987 -20556 -19799 -28151
16364b8151j0525o30l157L948N23L822P646J3102o37p911P026j189J016k313J1917
$$ -28151 -38676 -39306 -42463 -38515 -37992 -34170 -26524 -13422 -14059 -21970 -14944 -16133 -15117 -17430 -5513
16349e513P344r507l131l141Q153k602j2935j2314q575j779M810K98k829Q083
$$ -5513 1831 -7676 -10807 -13948 -5795 -8397 -21332 -33646 -42221 -44000 -39190 -38892 -41721 -33638
16335c3638R50O207J5100m040R23K922o595k335J2029J0544j1859j7092O923J4307
$$ -33638 -32688 -26481 -11381 -15421 -14498 -11576 -18171 -20506 -8477 2067 -9792 -26884 -19961 -5654
16321e654m716J2060J2344j714M278n338j3053p765J263P187R234j23N163J3603
$$ -5654 -10370 1690 14034 12320 16598 11260 -1793 -9558 -8295 -1108 8126 8003 13166 26769
16307B6769K4065K8288K9886L7893N8441O9781P3522P1868N8766N9167M5483p281
$$ 26769 50834 79122 109008 146901 205342 275123 348645 420513 479279 538446 583929 576648
16295E76648k4806m0647o6075q3631q1716n2317n2237m4690l9988k4036m91j861
$$ 576648 551842 511195 445120 361489 279773 227456 175219 130529 90541 66505 66014 64153
16283F4153j5449l05m141j8328R191M64j0160L769k591P789J311K686r42p049
$$ 64153 48704 48399 44258 25930 35121 35585 25425 29194 26603 34392 35703 38389 37447 30398
16269C0398p802l877p50J810M942j0621j2736R511q767j0980K3746J7284m563
$$ 30398 22596 18719 17969 19779 24721 14100 1364 10875 2108 -8872 14874 32158 27595
16256B7595n098J1055N379o469m275j6270k215P87p824l559Q430l36j1108j2005
$$ 27595 22497 33552 38931 32462 28187 11917 9702 10489 2665 -894 7536 7200 -3908 -15913
16242a5913k002k080J1067k752j1197p240J625J9008O429j0959J390M486r393
$$ -15913 -17915 -19995 -8928 -11680 -22877 -30117 -28492 -9484 -3055 -14014 -12624 -8138 -17531
16229a7531r984p575l357n505M072J6132k170r752O882L344N721J1657N113j3877
$$ -17531 -27515 -35090 -38447 -43952 -39880 -23748 -25918 -35670 -28788 -25444 -19723 -8066 -2953 -16830
16215a6830m450q096r388R946J0852J0894L145J285n161p516L4j0179k512p031
$$ -16830 -21280 -29376 -38764 -28818 -17966 -7072 -3927 -2642 -7803 -15319 -15285 -25464 -27976 -35007
16201c5007k335P446k52Q284N507k455P452J170q84K628j325j226j1038r838q897
$$ -35007 -37342 -29896 -30148 -21864 -16357 -18812 -11360 -10190 -11074 -8446 -9771 -10997 -22035 -31873 -40770
16186d0770P401K2816Q527p616m761o302q079j1921k957O664P979j565o336J1526
$$ -40770 -33369 -10553 -2026 -9642 -14403 -20705 -28784 -40705 -43662 -36998 -29019 -30584 -36920 -25394
16172b5394K2634R120l562q276n929K897j3468k874J1155J87m196N45M316j2722
$$ -25394 -2760 6360 2798 -5478 -11407 -8510 -21978 -24852 -13697 -13510 -17706 -17161 -12845 -25567
16158b5567j9999n697J2543J7792J391r233q467O998N141K550Q694N674p230o364
$$ -25567 -45566 -51263 -38720 -20928 -19537 -28770 -37237 -30239 -25098 -22548 -13854 -8180 -15410 -21774
16144b1774R563q90j3706m01j644N038Q947o208j6740n335N068J1144R842L090
$$ -21774 -12211 -13101 -26807 -27208 -28852 -23814 -14867 -21075 -37815 -43150 -38082 -26938 -17096 -14006
16130a4006n933k803L489K419K327J449j664l123J0512M821K04O117J520o440
$$ -14006 -19939 -22742 -19253 -16834 -14507 -13058 -14722 -17845 -7333 -2512 -2308 3809 5329 -1111
16116a111l425Q48J1161N929m55j2805m86p186l363J270m587K684q12l086K776
$$ -1111 -4536 -3688 7473 13402 12947 142 -344 -7530 -10893 -9623 -14210 -11526 -12338 -15424 -12648
16101a2648r700m104J440M851L750M739j1522j1785N878R571J1684m339p903j181
$$ -12648 -22348 -26452 -25012 -20161 -16411 -11672 -23194 -34979 -29101 -19530 -7846 -12185 -20088 -21269
16087b1269o69j702O124J506J611l508M900K398J243j9505j3729O129J2223J0608
$$ -21269 -21938 -23640 -17516 -16010 -14399 -17907 -13007 -10609 -9366 -28871 -42600 -36471 -24248 -13640
16073a3640R918Ol065k854l806o417J4764J661q902k787M32N435P401q756M96
$$ -13640 -3722 -3716 -6781 -9635 -13441 -19858 -5094 -3433 -12335 -15122 -14690 -9255 -1854 -10610 -10114
16058a0114j670l0782o665P195P935r17J680j832q467P711P51r66m53J7417K811
$$ -10114 -11784 -42566 -49231 -42036 -34101 -35018 -33338 -35170 -43637 -35926 -35175 -36141 -36594 -19177 -16366
16043a6366j4940l673J4154Q222K122m227M889o780m489N966K500n572J454K569
$$ -16366 -31306 -34979 -20825 -12603 -10481 -14708 -9819 -16599 -21088 -15122 -12622 -18194 -16740 -14171
16029a4171l593R196N787l422o456Q677j1345l096J210q267p743o89L074Q231
$$ -14171 -17764 -8568 -2781 -6203 -12659 -3982 -15327 -18423 -17213 -25480 -33223 -33912 -30838 -22607
16015b2607J2067k386n006k034j260J7075r221r527Q804q36j5564l808l763r104
$$ -22607 -10540 -12926 -17932 -19966 -21226 -4151 -13372 -22899 -14095 -14931 -30495 -34303 -38066 -47170
16001d7170R265J4306J0294P496k349l360M271P846j996j0660l719k26k0040q201
$$ -47170 -37905 -23599 -13305 -5809 -8158 -11518 -7247 599 -1397 -12057 -15776 -16002 -36042 -44243
15987d4243K5407K0441J18j3493L699p040j8078J085M313L163n173r329j676J4401
$$ -44243 -18836 1605 1723 -11770 -8071 -15111 -33189 -32104 -27791 -24628 -29801 -39130 -40806 -26405
15973b6405J1851j321l203N1L838K925Q212L318k31j2671j547M195o178Q486O18
$$ -26405 -14554 -15875 -19078 -19027 -15189 -12264 -4052 -734 -965 -13636 -15183 -10988 -17166 -8680 -8062
15958h062k077p479M515k310N249j5266N86J1647N54k351J1886M357l672j1987
$$ -8062 -10139 -17618 -13103 -15413 -10164 -25430 -24844 -13197 -12643 -14994 -3108 1249 -2423 -14410
15944a4410j51N566L886K199k611j2253J0289P403o274k023j6269r232o44N141
$$ -14410 -14561 -8995 -5109 -2910 -5521 -17774 -7485 -82 -6356 -8379 -24648 -33880 -34524 -29383
15930b9383M15r759n613p309O178J4468J3205p282q75J183R431K31p15L27k0708
$$ -29383 -28968 -38727 -44340 -51649 -45471 -31003 -17798 -25080 -25955 -24772 -15341 -15110 -15825 -15498 -36206
15915c6206l086J4837p105l772J7721J458M581J3273M57j0364m701K016Q950q878
$$ -36206 -39292 -24455 -31560 -35332 -17611 -16153 -11572 1701 2158 -8206 -12907 -10891 -1941 -10819
15901a0819p971J1267J1052j2117j9987n272J3738J2938K260R74L091j0424r020
$$ -10819 -18790 -7523 3529 -8588 -28575 -33847 -20109 -7171 -4911 -3937 -846 -11270 -20290
15888b0290j4703o621P080O897J6369L291o066K926R181k402m689J4021r853k2878
$$ -20290 -34993 -41614 -34534 -27637 -11268 -7977 -14043 -11117 -1936 -4338 -9027 4994 -4859 -27737
15874b7737l622N639J4048J8840O011j0863J513j0324j1269L414j167l709J5390
$$ -27737 -31359 -25720 -11672 7168 13179 2316 3829 -6495 -17764 -14350 -15517 -19226 -3836
15861c836P459j3609j0018n808R224O480k331j2372n990M623K0921J80m587l371
$$ -3836 3623 -9986 -20004 -25812 -16588 -10108 -12439 -24811 -30801 -26178 -5257 -5077 -9664 -13035
15847a3035m291k079j811k313r741M233J6408j876L385N881k155l332K42J575
$$ -13035 -17326 -19405 -21216 -23529 -33270 -29037 -12629 -14505 -11120 -5239 -7394 -10726 -10484 -8909
15833h909Q262j320L797k113j5769j406n277j1672J980J0438l047p725N070J7598
$$ -8909 -647 -1967 1830 -283 -16052 -17458 -22735 -34407 -32427 -21989 -25036 -32761 -27691 -10093
15819a0093Q88O265J5849o789j974M864k0689j0638p104J345J4024j059l813Q663
$$ -10093 -9205 -2940 12909 6120 4146 9010 -11679 -22317 -29421 -28076 -14052 -15111 -18924 -10261
15805a0261n517j5193K123n829L789J5690j548j484K207k937j5807J858L536Q434
$$ -10261 -15778 -30971 -28848 -34677 -30888 -15198 -16746 -18230 -16023 -18960 -34767 -32909 -29373 -20939
15791b0939n978O595R504O30j1751j4533M703J8995J1000r469j4675Q194Q210
$$ -20939 -26917 -20322 -10818 -10188 -21939 -36472 -31769 -12774 -1774 -11243 -25918 -17724 -9514
15778i514j0909p616O482L769q571m915L590n928J1785J0057p214m9j2407K905
$$ -9514 -20423 -28039 -21557 -17788 -26359 -31274 -27684 -33612 -21827 -11770 -18984 -19033 -31440 -28535
15764b8535j876L083J3145J1761P225o263K968n597q749L213n062O126Q287M245
$$ -28535 -30411 -27328 -14183 -2422 4803 -1460 1508 -4089 -12838 -9625 -14687 -8561 -274 3971
15750C971n122k541n748k206P849j514p777O86n042r71P676l857P202L58K138
$$ 3971 -1151 -3692 -9440 -11646 -3797 -5311 -13088 -12402 -17444 -18415 -10739 -14596 -7394 -7036 -4898
15735d898p734n871P70L822j2446j1776q470r728J3524P704P96M760N638O30P500
$$ -4898 -12632 -18503 -17733 -13911 -26357 -38133 -46603 -56331 -42807 -35103 -34307 -29547 -23909 -23279 -15779
15720a5779l907k642n925q585J0640K1991k6j5989j710o175P415N305K505N293
$$ -15779 -19686 -22328 -28253 -36838 -26198 -4207 -4233 -20222 -21932 -28107 -20692 -15387 -12882 -7589
15706g589J184m043j3476j0947p287J2613K126J2462M411J323j912k317J2289
$$ -7589 -6405 -10448 -23924 -34871 -42158 -29545 -27419 -14957 -10546 -9223 -11135 -13452 -1163
15693a163k823J271j7168K762O576N233p124j2798q648L58L334J3684N812N178
$$ -1163 -3986 -2715 -19883 -17121 -10545 -5312 -12436 -25234 -33882 -33524 -30190 -16506 -10694 -5516
15679e516n781r158J577R635J2310N270r62o507m137j664j3953j2395J861O921
$$ -5516 -11297 -20455 -18878 -9243 3067 8337 7375 868 -3269 -4933 -18886 -31281 -29420 -22499
15665b2499r269J241J4861k032q511n869J109J3613P269J391L178N73m899O760
$$ -22499 -31768 -30527 -15666 -17698 -26209 -32078 -30969 -17356 -10087 -8696 -5518 -4945 -9844 -3084
15651c084R866j3259r195O676M103J049K97J532J1863K302J9368L8857M8410N0257
$$ -3084 6782 -6477 -15672 -8996 -4893 -3844 -3547 -2015 9848 12150 31518 70375 118785 169042
15637A69042L4669K4788K1871J3251p867n9675q8540n4459q310j192k734q049
$$ 169042 203711 228499 250370 263621 255754 196079 107539 53080 44770 43578 40844 32795
15625C2795j5058j699K431j4096j3129M550J2681Q747j8577j8699M186n724N944
$$ 32795 17737 16038 18469 4373 -8756 -4206 8475 17222 -1355 -20054 -15868 -21592 -15648
15612a5648L347N358k769J174P707M397p932l999m80J2879m179K017R816r881
$$ -15648 -12301 -6943 -9712 -8538 -831 3566 -4366 -8365 -8845 4034 -145 1872 11688 1807
15598A807K070o476k826k797k559M930j356j6139q759P711L375Q007J0412j4125
$$ 1807 3877 -2599 -5425 -8222 -10781 -5851 -7207 -23346 -32105 -24394 -21019 -13012 -2600 -16725
15584a6725j4287P558o34K376J0174j734r626j020J3648r9J1759o873m913L604
$$ -16725 -31012 -23454 -24088 -21712 -11538 -13272 -22898 -23918 -10270 -10369 1390 -5483 -10396 -6792
15570f792p021o651P60P541M381r454q781k683L363J8222J0015j735K589j2211
$$ -6792 -13813 -20464 -19704 -12163 -7782 -17236 -26017 -28700 -25337 -7115 2900 1165 3754 -8457
15556h457M527J470j1311k224o896l673P507K0425O558l461q280j433o169M702
$$ -8457 -3930 -2460 -13771 -15995 -22891 -26564 -19057 1368 7926 4465 -3815 -5248 -11417 -6715
15542f715Q901l08j7150p423q389k103J3799Q385n278M263M039k738k49Q470J8719
$$ -6715 2186 1878 -15272 -22695 -31084 -33187 -19388 -11003 -16281 -12018 -7979 -10717 -10966 -2496 16223
15527A6223j801k4158j0584m829J868J4261J5895J2108j7052k0361J457L843r394
$$ 16223 14422 -9736 -20320 -25149 -23281 -9020 6875 18983 1931 -18430 -16973 -13130 -22524
15514b2524o123J4159J296j326J061J2848K2926J043l317J2399o375j8764p752
$$ -22524 -28647 -14488 -13192 -14518 -13457 -609 22317 23360 20043 32442 26067 7303 -449
15501d49p424R542r697j5706p221M072r23j45N045J4971k064J985J845m577N87
$$ -449 -7873 1669 -8028 -23734 -30955 -26883 -27806 -27951 -22906 -7935 -9999 -8014 -6169 -10746 -10159
15486a0159n028M494k925o52m490K866J6100J0592R124j839j1295j4123Q583l464
$$ -10159 -15187 -10693 -13618 -14270 -18760 -15894 206 10798 19922 18083 6788 -7335 1248 -2216
15472b216L495J585o318k93r194Q434O977o95M068o24j4328k0192r367N292K483
$$ -2216 1279 2864 -3454 -3747 -12941 -4507 2470 1775 5843 5219 -9109 -29301 -38668 -33376 -30893
15457c0893J5931K677l442O500J5306j2436m809j453K267J534j4617N28N509J0499
$$ -30893 -14962 -12285 -15727 -9227 6079 -6357 -11166 -12619 -10352 -8818 -23435 -22907 -17398 -6899
15443f899J626K076L906Q445o688k0953j6507q175Q725K522M049k867J0239M042
$$ -6899 -5273 -3197 709 9154 2466 -18487 -34994 -43169 -34444 -31922 -27873 -30740 -20501 -16459
15429a6459l853k454r292k948m318P921J6234l448o618K218J6108j710k2849j1804
$$ -16459 -20312 -22766 -32058 -35006 -39324 -31403 -15169 -18617 -25235 -23017 -6909 -8619 -31468 -43272
15415d3272p383J0161J3856M265P086J8781P728O23j3213q370J2362p020K748
$$ -43272 -50655 -40494 -26638 -22373 -15287 3494 11222 11845 -1368 -9738 2624 -4396 -1648
15402a648J2758J0572q29j3531r595q875o594j25K4864n87m265l268J851k797
$$ -1648 11110 21682 20853 7322 -2273 -11148 -17742 -17867 6997 6410 2145 -1123 728 -2069
15388b069o57k64l282o969P57J0643Q630j3444j5680M775K442J116L250M884n615
$$ -2069 -2726 -2990 -6272 -13241 -12484 -1841 6789 -6655 -22335 -17560 -15118 -14002 -10752 -5868 -11483
15373a1483j3016k072l903J3317L919n590N9R924P28o592j7127M0R573O006Q506
$$ -11483 -24499 -26571 -30474 -17157 -13238 -18828 -18769 -8845 -8117 -14709 -31836 -31796 -22223 -16217 -7711
15358g711K49k721P04M052N481j6129l690N535P305K207j1037O730k534k026j605
$$ -7711 -7462 -10183 -9479 -5427 54 -16075 -19765 -14230 -6925 -4718 -15755 -9025 -11559 -13585 -15190
15343a5190Q555P988M132k222J709p117q320j3476K319j988j450N857J2885k458
$$ -15190 -6635 1353 5485 3263 4972 -2145 -10465 -23941 -21622 -23610 -25060 -19203 -6318 -8776
15329h776L399J787L17m934j1169n345q58K108M041P346R223M788Q552m411j3141
$$ -8776 -5377 -3590 -3273 -8207 -19376 -24721 -25579 -23471 -19430 -12084 -2861 1927 10479 6068 -7073
15314g073O375O989o746o126j0330J6777Q603j0215r175J950N682k1595j2837
$$ -7073 -698 6291 -455 -6581 -16911 -134 8469 -1746 -10921 -8971 -3289 -24884 -37721
15301c7721n459j5836J623J0581m30l835Q403J1986R277J5307Q739K39J3553r655
$$ -37721 -43180 -59016 -57393 -46812 -47242 -51077 -42674 -30688 -21411 -6104 2635 2874 16427 6772
15287F772o585M021l854r322n065L490r15k458L067n48q985Q560k654q179P769
$$ 6772 187 4208 354 -8968 -14033 -10543 -11458 -13916 -10849 -11397 -20382 -11822 -14476 -22655 -14886
15272a4886Q345j194l88N45Q11L025n61j0934q032k31P271J360o746l285J7536
$$ -14886 -6541 -7735 -8123 -7578 -6767 -3742 -4303 -15237 -23269 -23500 -16229 -14869 -21615 -24900 -7364
15257g364J0046N815N207n764j774j728o259j7077m785K131m767K971K87r910
$$ -7364 2682 8497 13704 7940 6166 4438 -1821 -18898 -23683 -21552 -26319 -23348 -23061 -32971
15243c2971J3682R159q035j382q023j748n41o000L757j695J597J3480n770m513
$$ -32971 -19289 -10130 -18165 -19547 -27570 -29318 -29859 -35859 -32102 -33797 -32200 -18720 -24490 -29003
15229b9003o199j3288L028Q049R706O329j828p86L864J0036M841L370Q103N305
$$ -29003 -35202 -48490 -45462 -37413 -27707 -21378 -23206 -23992 -20128 -10092 -5251 -1881 6222 11527
15215A1527l370j4831J555J6600NQ844j4059k0067j0987o298L834Q291p1J248
$$ 11527 8157 -6674 -5119 11481 11486 20330 6271 -13796 -24783 -31081 -27247 -18956 -19027 -17779
15201a7779J1647N972K520l372k831q246m193o728j214L0J3339R361m504k673
$$ -17779 -6132 -160 2360 -1012 -3843 -12089 -16282 -23010 -24224 -24194 -10855 -1494 -5998 -8671
15187h671m766M360Q69j029j5838j3073Q571j5928k84L483j850J2027J906Q315
$$ -8671 -13437 -9077 -8208 -9237 -25075 -38148 -29577 -45505 -45789 -42306 -44156 -32129 -30223 -21908
15173b1908K897m005K0368p492m264o694n60p621N962O00n133k776J4185R323
$$ -21908 -19011 -23016 -2648 -10140 -14404 -21098 -21658 -29279 -23317 -22717 -27850 -30626 -16441 -7118
15159g118o379k930Q136J278j3348n679J071O962M173j12r040K58n836k92Q328
$$ -7118 -13497 -16427 -8291 -7013 -20361 -26040 -24969 -18007 -13834 -13946 -22986 -22728 -28564 -28856 -20528
15144b0528K80q01J1791J0699n985p351j1687l643N321O966J5569R040j2510j1131
$$ -20528 -20248 -21049 -9258 1441 -4544 -11895 -23582 -27225 -21904 -14938 631 9671 -2839 -13970
15130a3970r359L911j816J085K205Q99J0593R048K646m373k000K798q565l138
$$ -13970 -23329 -19418 -21234 -20149 -17944 -17045 -6452 2596 5242 869 -1131 1667 -6898 -10036
15116a0036n87K139J0531J2782q635j2799k061o490n0L932J625j0280k433K039
$$ -10036 -10623 -8484 2047 14829 6194 -6605 -8666 -15156 -15206 -11274 -9649 -19929 -22362 -20323
15102b0323Q491J1823P03k470j3117n688J2406O343J0054Q658J4770l548r936
$$ -20323 -11832 -9 694 -1776 -14893 -20581 -8175 -1832 8222 16880 31650 28102 18166
15089A8166j1763q079R251j0096j4191R542K001m142j6040K934k6J804K791K112
$$ 18166 6403 -1676 7575 -2521 -16712 -7170 -5169 -9311 -25351 -22417 -22443 -20639 -17848 -15736
15075a5736J3920M520K456J596L833K061q302k1521p900O358Q722j196R051j5003
$$ -15736 -1816 2704 5160 6756 10589 12650 4348 -17173 -25073 -18715 -9993 -11189 -2138 -17141
15061a7141j1341O531j0873j000N215N479J2841J5435j4720o124K620O942o889
$$ -17141 -28482 -21951 -32824 -33824 -28609 -23130 -10289 5146 -9574 -15698 -13078 -6136 -13025
15048a3025j3623P765P896J255q007j834M594M364N712L160P433J9l786L256j5697
$$ -13025 -26648 -18883 -10987 -9732 -17739 -19573 -14979 -10615 -4903 -1743 5690 5709 1923 5179 -10518
15033a0518J403K141j2842p752J194R25R892k501m124l324J1581O478o261M898
$$ -10518 -9115 -6974 -19816 -27568 -26374 -25449 -15557 -18058 -22182 -25506 -13925 -7447 -13708 -8810
15019h810j0562n588M819K1402P801Q327j2593q371o459k609J6995j757M853K996
$$ -8810 -19372 -24960 -20141 1261 9062 17389 4796 -3575 -10034 -12643 4352 2595 7448 10444
15005A0444j1543M518p64On389k452K804m964j318P521J265j94q16N764N784o389
$$ 10444 -1099 3419 2655 2661 -2728 -5180 -2376 -7340 -8658 -1137 128 -66 -882 4882 10666 4277
14989D277j734J0918k914J320Q09j1493m647J1612o210j2310J703q336r798P861
$$ 4277 2543 13461 10547 11867 12676 1183 -3464 8148 1938 -10372 -8669 -17005 -26803 -18942
14975a8942M687M337l505J3257J4391J066k010l05o199n347O976K263n370N666
$$ -18942 -14255 -9918 -13423 -166 14225 15291 13281 12976 6777 1430 8406 10669 5299 10965
14961A0965Q087O368o430j1571j3012k553P068R194l978n525m100N99j4334J0471
$$ 10965 19052 25420 18990 7419 -5593 -8146 -1078 8116 4138 -1387 -5487 -4888 -19222 -8751
14947h751J5788m908m689k693O011J073m209J0055P518p849J389Q672K300j7052
$$ -8751 7037 2129 -2560 -5253 758 1831 -2378 7677 15195 7346 8735 17407 19707 2655
14933B655k87J809J1934m379n678J2811o024l394m785j2726o368L678l996R097
$$ 2655 2368 4177 16111 11732 6054 18865 12841 9447 4662 -8064 -14432 -10754 -14750 -5653
14919e653Q496n73J610k48r282p056r518O113P655J913j5912k918l832p104R514
$$ -5653 2843 2270 3880 3632 -5650 -12706 -22224 -16111 -8456 -6543 -22455 -25373 -29205 -36309 -26795
14904b6795n145R407O099P770O185p74o419p092k895o084N861Q163P748j042q329
$$ -26795 -31940 -22533 -16434 -8664 -2479 -3253 -9672 -16764 -19659 -25743 -19882 -11719 -3971 -5013 -13342
14889a3342L303Q432q508j3273Q144P409n142o33j00K400j148k074j4350l583
$$ -13342 -10039 -1607 -10115 -23388 -15244 -7835 -12977 -13610 -13710 -11310 -12458 -14532 -28882 -32465
14875c2465J4021j0401l878m581J2847M821J7347m451k1426j1227J066L724j34
$$ -32465 -18444 -28845 -32723 -37304 -24457 -19636 -2289 -6740 -28166 -39393 -38327 -34603 -34737
14862c4737P98J0789P669n245p70J0108R593J5985J0068r510j1868j001k248r172
$$ -34737 -33939 -23150 -15481 -20726 -21496 -11388 -1795 14190 24258 14748 2880 1879 -369 -9541
14848i541J680J080M379O381k042n561j6087q018N297K6651N734o97k19j0624
$$ -9541 -7861 -6781 -2402 3979 1937 -3624 -19711 -27729 -22432 4219 9953 9256 9037 -1587
14834a587j1574m293j1246p114J6716m363O643J1193M388J062J0613k60p853k163
$$ -1587 -13161 -17454 -28700 -35814 -19098 -23461 -16818 -5625 -1237 -175 10438 10178 2325 162
14820A62L802O933R033L656M453K126o566j9329k2998j1909K283J2067M438J7054
$$ 162 3964 10897 19930 23586 28039 30165 23599 4270 -18728 -30637 -28354 -16287 -11849 5205
14806E205O8j963j7932k0404l728q535N139J8855J3888Q396j7530o968K621J0015
$$ 5205 5273 3310 -14622 -35026 -38754 -47289 -42150 -23295 -9407 -1011 -18541 -25509 -22888 -12873
14792a2873Q655R730p095N326M845L770p169k055o159j5270o948R604J761j042
$$ -12873 -4218 5512 -1583 3743 8588 12358 5189 3134 -3025 -18295 -25243 -15639 -13878 -14920
14778a4920o668k568l672J1361N749P027q805j3472P658K6466N348j1062j501
$$ -14920 -21588 -24156 -27828 -16467 -10718 -3691 -12496 -25968 -18310 8156 13504 2442 941
14765I41J1636j4183k2201K750O520K746L135j963L233N537k627K299j685j4366
$$ 941 12577 -1606 -23807 -21057 -14537 -11791 -8656 -10619 -7386 -1849 -4476 -2177 -3862 -18228
14751a8228j2251O118J4425P21m914o028l362L731J582j1861k354J0307K3716
$$ -18228 -30479 -24361 -9936 -9215 -14129 -20157 -23519 -19788 -18206 -30067 -32421 -22114 1602
14738A602k336o17L42q593k0527l337K2080J0176Q423N286j1935m269n318L897
$$ 1602 -734 -1351 -1009 -9602 -30129 -33466 -11386 -1210 7213 12499 564 -3705 -9023 -5126
14724e126P852P049p792k022K253J918N061j1571p016r977L261M298j2466O547
$$ -5126 2726 9775 1983 -39 2214 4132 9193 -2378 -9394 -19371 -16110 -11812 -24278 -17731
14710a7731J2217J2385K81j2782j7304N037P749M200J0683p914l194n752j2319
$$ -17731 -5514 6871 7152 -5630 -22934 -17897 -10148 -5948 4735 -3179 -6373 -12125 -24444
14697b4444j0700N5J5733q45N400J0144o76m088l18j0737k07j4086r246P606J0735
$$ -24444 -35144 -35089 -19356 -20201 -14801 -4657 -5333 -9421 -9739 -20476 -20683 -34769 -44015 -36409 -25674
14682b5674o846J0684J1540k663p315q706p46J3745N925j613j251N154O137R772
$$ -25674 -32520 -21836 -10296 -12959 -20274 -28980 -29726 -15981 -10056 -11669 -12920 -7766 -1629 8143
14668H143m362j0514Q425J977L942J4110m100j0829n292p558l9O293n903j9093
$$ 8143 3781 -6733 1692 3669 7611 21721 17621 6792 1500 -6058 -6097 196 -5707 -24800
14654b4800r743r071J2887J7846L135j8635L40K725J310Q590P866J680k365l552
$$ -24800 -34543 -43614 -30727 -12881 -9746 -28381 -28041 -25316 -24006 -15416 -7550 -5870 -8235 -11787
14640a1787q489j2138j1858m714J1599P444J6507k484q585Q1J0662Q57N498J8727
$$ -11787 -20276 -32414 -44272 -48986 -37387 -29943 -13436 -15920 -24505 -24424 -13762 -12905 -7407 11320
14626A1320R10j2424P10R807n284j2493l476J5035M447R076M903o609J0132n275
$$ 11320 12230 -194 516 10323 5039 -7454 -10930 4105 8552 17628 22531 15922 26054 20779
14612B0779j4589J0014M282l980o235p540j1813j2126J768J3986N923m592p011
$$ 20779 6190 16204 20486 16506 10271 2731 -9082 -21208 -19440 -5454 469 -4123 -11134
14599a1134k211j6079O577J3636k617j1415j842R710J2218o014j5345j1139r390
$$ -11134 -13345 -29424 -22847 -9211 -11828 -23243 -25085 -15375 -3157 -9171 -24516 -35655 -45045
14586d5045K2255K2430N440k329n16j0157j046J927p067K973P51m87l577K249
$$ -45045 -22790 -360 5080 2751 2235 -7922 -8968 -7041 -14108 -11135 -10384 -10871 -14448 -12199
14572a2199n981L866n669n558q405j5709P927J5983J1051J5810J2049P4o625K926
$$ -12199 -18180 -14314 -19983 -25541 -33946 -49655 -41728 -25745 -14694 1116 13165 13239 6614 9540
14558I540J0733o642j6349j1211j6341l104K2878J3225j5095j3062Q68J0098Q449
$$ 9540 20273 13631 -2718 -13929 -30270 -33374 -10496 2729 -12366 -25428 -24560 -14462 -6013
14545f013n595N894J7343L791j5132j0039K991L129j16J213K853n07j196j0399
$$ -6013 -11608 -5714 11629 15420 288 -9751 -6760 -3631 -3747 -2534 319 -188 -1384 -11783
14531a1783q810K689L733L062m869K581M87M274m73r047L088M912j377M7N271
$$ -11783 -20593 -17904 -14171 -11109 -15978 -13397 -12910 -8636 -9109 -18156 -15068 -10156 -11533 -11486 -6215
14516f215n067m576K0491M867n179j0026J696M482m330j1429L336J0737j1423
$$ -6215 -11282 -15858 4633 9500 4321 -5705 -4009 473 -3857 -15286 -11950 -1213 -12636
14503a2636j1202k779k787j347J0775j0650l943J1606J0853p707K431K916Q627
$$ -12636 -23838 -26617 -29404 -30751 -19976 -30626 -34569 -22963 -12110 -19817 -17386 -14470 -5843
14490e843J1773O572j707k2595j8178J0404J1089k468K468M755J3862J506j5872
$$ -5843 5930 12502 10795 -11800 -29978 -19574 -8485 -10953 -8485 -3730 10132 11638 -4234
14477d234q143j6361J2108l235p060j705K32l742O278N552O213P515q590k026
$$ -4234 -12377 -28738 -16630 -19865 -26925 -28630 -28398 -32140 -25862 -20310 -14097 -6582 -15172 -17198
14463a7198l958J721J2424N682j3910m213n839J0183N075M531j675j112l501r055
$$ -17198 -21156 -19435 -7011 -1329 -15239 -19452 -25291 -15108 -10033 -5502 -7177 -8289 -11790 -20845
14449b0845K527n1l449J4592m787K042L815N054J457q639j368O674r476o174L849
$$ -20845 -18318 -18369 -21818 -7226 -12013 -9971 -6156 -1102 355 -8284 -9652 -2978 -12454 -18628 -14779
14434a4779J7699M163q196J1119j140q263K590Q486M67j1650n445R665M402Q752
$$ -14779 2920 7083 -1113 10006 8866 603 3193 11679 12146 496 -4949 4716 9118 17870
14420A7870N481j126q298j6027Q25J755J941j5137j1593M89J419n499m17P315
$$ 17870 23351 22225 13927 -2100 -1275 480 2421 -12716 -24309 -23820 -22401 -27900 -28317 -21002
14406b1002M579Q610K243L119k925R459L424j676r528k0621j9572L691K2633K0375
$$ -21002 -16423 -7813 -5570 -2451 -5376 4083 7507 5831 -3697 -24318 -43890 -40199 -17566 2809
14392B809P39j4737q405n987j641J5277J2567k224j0090J1441n085K465K034k51
$$ 2809 3548 -11189 -19594 -25581 -27222 -11945 622 -1602 -11692 -251 -5336 -2871 -837 -1088
14378a088J4089L312l594j1819m288J0320l823j106P998o006l716J3430r75j0771
$$ -1088 13001 16313 12719 900 -3388 6932 3109 2003 10001 3995 279 13709 12734 1963
14364A963j0677J59J461o236n993n376L144k687P638p76J343k229O582Q481J0513
$$ 1963 -8714 -8555 -7094 -13330 -19323 -24699 -21555 -24242 -16604 -17380 -16037 -18266 -11684 -3203 7310
14349G310R18l928o386q374k533O531J6244r821r657L374L914P57P626j0934j724
$$ 7310 8228 4300 -2086 -10460 -12993 -6462 9782 -39 -9696 -6322 -2408 -1651 5975 -4959 -6683
14334f683j690K256n594o508o222P468Q182p953j333R527R155J6483k221m485
$$ -6683 -8373 -6117 -11711 -18219 -24441 -16973 -8791 -16744 -18077 -8550 605 17088 14867 10382
14320A0382m043o695k313o649k080O121N098R494j0807j1432l324m82K803j4689
$$ 10382 6339 -356 -2669 -9318 -11398 -5277 -179 9315 -1492 -12924 -16248 -16730 -13927 -28616
14306b8616N491N169M146R485L405l40p460j0802L403J386j957J534n327n098
$$ -28616 -23125 -17956 -13810 -4325 -920 -1260 -8720 -19522 -16119 -14733 -16690 -15156 -20483 -25581
14292b5581j946P883Q366N124m328p222j955J3138J42J490p606j161N184M477
$$ -25581 -27527 -19644 -11278 -6154 -10482 -17704 -19659 -6521 -6379 -4889 -12495 -13656 -8472 -3995
14278c995M791M46k1862j4226J767j840J2511n274M34j1260N536J9807L143K3547
$$ -3995 796 1242 -20620 -34846 -33079 -34919 -22408 -27682 -27248 -38508 -32972 -13165 -10022 13525
14264A3525O517P433p936j6005j9459J1026J1355P080k03j3727q966p376m058
$$ 13525 20042 27475 19539 3534 -15925 -4899 6456 13536 13333 -394 -9360 -16736 -20794
14251b0794M903R436K999j832q869L522O620K055o214O144J0391o289k1110J7670
$$ -20794 -15891 -6455 -3456 -5288 -14157 -10635 -4015 -1960 -8174 -2030 8361 2072 -19038 -1368
14237a368m059j7712k78J9523j272p288q835j2344Q388J1613r860O441L55Q4J2840
$$ -1368 -5427 -23139 -23417 -3894 -5166 -12454 -21289 -33633 -25245 -13632 -23492 -17051 -16696 -16612 -3772
14222c772R024r299j1862K676j0268m22J1068J226q60O607R943M031J549r567
$$ -3772 5252 -4047 -15909 -13233 -23501 -23923 -12855 -11629 -12489 -5882 4061 8092 9641 74
14208G4m161K879j0167p941j057j026M739J6002p645j2414k172M684J7254n951
$$ 74 -4087 -1208 -11375 -19316 -20373 -21399 -16660 -658 -8303 -20717 -22889 -18205 -951 -6902
14194f902k4596p959L949P744O926N314j073J6476M321j2280l285K2199R869k753
$$ -6902 -31498 -39457 -35508 -27764 -20838 -15524 -16597 -121 4200 -8080 -11365 10834 20703 17950
14180A7950k887P87K434j2316j3172l558j0307L611K65J2164J7174K518N477j5428
$$ 17950 15063 15850 18284 5968 -7204 -10762 -21069 -17458 -17193 -5029 12145 14663 20140 4712
14166D712r323P63j2045r407k770l697L282n629J37O22M399o798m701M884J2165
$$ 4712 -4611 -3848 -15893 -25300 -28070 -31767 -28485 -34114 -33977 -33355 -28956 -35754 -40455 -35571 -23406
14151b3406O656J2964n788k2686J7756J3135q761j6527o897M136J0971P645o01
$$ -23406 -16750 -3786 -9574 -32260 -14504 -1369 -10130 -26657 -33554 -29418 -18447 -10802 -11403
14138a1403k728K1418J0778n745q860n757Q369q673M719O686n042L707J0746M060
$$ -11403 -14131 7287 18065 12320 3460 -2297 6072 -2601 2118 8804 3762 7469 18215 22275
14124B2275N093p376r879r387J583R019m889o833j9179l551J2022J778k420m788
$$ 22275 27368 19992 10113 726 2309 11328 6439 -394 -19573 -23124 -11102 -9324 -11744 -16532
14110a6532j028L767L843J0166N59n145p351r19J0500O841l083r363o229Q589
$$ -16532 -17560 -13793 -9950 216 775 -4370 -11721 -12640 -2140 4701 1618 -7745 -13974 -5385
14096e385k979J2325n800j4352K208J5624j359p247K336M752N942O980M857p694
$$ -5385 -8364 3961 -1839 -16191 -13983 1641 282 -6965 -4629 123 6065 13045 17902 10208
14082A0208j5080j182o154l718k301O167K640j4671M887J4290o13r111P843r851
$$ 10208 -4872 -6054 -12208 -15926 -18227 -12060 -9420 -24091 -19204 -4914 -5527 -14638 -6795 -16646
14068a6646o076J1415J2614q94j0648n413j501J3707J0875K835j3273q151k729
$$ -16646 -22722 -11307 1307 413 -10235 -15648 -17149 -3442 7433 10268 -3005 -11156 -13885
14055a3885Q632j1575j3511P308J9358J0794j582j194J8134l020m991l900j1372
$$ -13885 -5253 -16828 -30339 -23031 -3673 7121 5539 4345 22479 19459 14468 10568 -804
14042h04m589n68n601J874j2701o668O541O757N513r380l542J0156L479l750q795
$$ -804 -5393 -5961 -11562 -9688 -22389 -29057 -22516 -15759 -10246 -19626 -23168 -13012 -9533 -13283 -22078
14027b2078j908N083Q11J349J526P05r558j02J744N378J536o700M483J3501K701
$$ -22078 -23986 -18903 -18092 -16743 -15217 -14512 -24070 -24172 -22428 -17050 -15514 -22214 -17731 -4230 -1529
14012a529l819Q673N957k140k272M35L055m978l924o727o442o165n243J193R232
$$ -1529 -5348 3325 9282 7142 4870 5305 8360 3382 -542 -7269 -13711 -19876 -25119 -23926 -14694
13997a4694M530Q935J0570N445j3473M63n314j5418R088J329j2117N179M054j691
$$ -14694 -10164 -1229 9341 14786 1313 1776 -3538 -18956 -9868 -8539 -20656 -15477 -11423 -13114
13983a3114J487l294n73l26J5859N950p197R197l958j2368J436M620o900P635
$$ -13114 -11627 -14921 -15494 -15820 39 5989 -1208 7989 4031 -8337 -6901 -2281 -9181 -1546
13969a546O098l466j560J223P726o90o535n688o944Q111n331k739j702j869J2592
$$ -1546 4552 1086 -474 749 8475 7785 1250 -4438 -11382 -3271 -8602 -11341 -13043 -14912 -2320
13954b320L415k149j0571j7793M783N485P963O940j0790j1312o418k0177k662
$$ -2320 1095 -1054 -11625 -29418 -24635 -19150 -11187 -4247 -15037 -26349 -32767 -52944 -55606
13941e5606J6958J2486L251P90k571N718Q593J101l905j1401J6638R653J0969
$$ -55606 -38648 -26162 -22911 -22121 -24692 -18974 -10381 -9280 -13185 -24586 -7948 1705 12674
13928A2674o38p547l495p411j414L798J0789J73j2672K66l124j5892k4N265J7737
$$ 12674 12036 4489 994 -6417 -7831 -4033 6756 6929 -5743 -5477 -8601 -24493 -24517 -19252 -1515
13913a515n961o676Q649J44O020M681p572M453m241o830l840K100Q910j7840j1247
$$ -1515 -7476 -14152 -5503 -5359 661 5342 -2230 2223 -2018 -8848 -12688 -10588 -1678 -19518 -30765
13898c0765J2595J1072k622m152P590J573M276Pn622J8958o8j0261j5083r170
$$ -30765 -18170 -7098 -9720 -13872 -6282 -4709 -433 -426 -6048 12910 12842 2581 -12502 -21672
13884b1672Q494Q820K599m415K918J0782J0079k147q951R268J499k4026r922J6408
$$ -21672 -13178 -4358 -1759 -6174 -3256 7526 17605 15458 6507 15775 17274 -6752 -16674 -266
13870b66O632K595p940J937J3200K824K137J5370j041k7707q067k660j5963j0864
$$ -266 6366 8961 1021 2958 16158 18982 21119 36489 35448 7741 -326 -2986 -18949 -29813
13856b9813J3484P82l695R809o83m57m971l299M433J6115l673k475O27O286K179
$$ -29813 -16329 -15547 -19242 -9433 -10116 -10573 -15544 -18843 -14410 1705 -1968 -4443 -3816 2470 4649
13841D649m496N863M256m776j9191j0143Q316Q609K480n244O082L707L171Q500
$$ 4649 153 6016 10272 5496 -13695 -23838 -15522 -6913 -4433 -9677 -3595 112 3283 11783
13827A1783p122l999k220j960J8524o433k363j0076j0596K509o685m007Q085K15
$$ 11783 4661 662 -1558 -3518 15006 8573 6210 -3866 -14462 -11953 -18638 -22645 -14560 -14345
13813a4345k424R032L10J1761l784j1531m629N435J0089J6275j767J762K776j4823
$$ -14345 -16769 -7737 -7427 4334 550 -10981 -15610 -10175 -86 16189 14422 16184 18960 4137
13799D137P802J988K45q478l255Q288j1207r264N963P638k190L543M295l681L437
$$ 4137 11939 13927 14172 5694 2439 10727 -480 -9744 -3781 3857 1667 5210 9505 5824 9261
13784I261O169M137J427j936j2076j1532l089M077J06J4293J1115j0702j1205
$$ 9261 15430 19567 20994 19058 6982 -4550 -7639 -3562 -3456 10837 21952 11250 45
13771D5O799L926n585K255l452N522n319r048r307m87M154l582M308J763k678
$$ 45 6844 10770 5185 7440 3988 9510 4191 -4857 -14164 -14651 -10497 -14079 -9771 -8008 -10686
13756a0686K265n275n242K939M556L840R288O008l50O291p942m304N364q030o618
$$ -10686 -8421 -13696 -18938 -15999 -11443 -7603 1685 7693 7343 13634 5692 1388 6752 -1278 -7896
13741g896q898k608L84K911M231K566O437O487O204q64N073O474O62M530k2180
$$ -7896 -16794 -19402 -19018 -16107 -11876 -9310 -2873 3614 9818 8954 14027 20501 21163 25693 3513
13726C513j3929N520r099j3553M01L282Q972K663N140q153m374M485R803R074
$$ 3513 -10416 -4896 -13995 -27548 -27147 -23865 -14893 -12230 -7090 -15243 -19617 -15132 -5329 3745
13712C745r988j4836N529J2773l036p914J8849J2940q760J2989j471j315r14L570
$$ 3745 -6243 -21079 -15550 -2777 -5813 -13727 5122 18062 9302 22291 20820 19505 18591 22161
13698B2161o969j077j5656p600m90m885j63r88j0376J658O254R19J1001M451r64
$$ 22161 15192 14115 -1541 -9141 -9631 -14516 -14679 -15667 -26043 -24385 -18131 -17212 -6211 -1760 -2724
13683b724J0242q963j5010J821J4605k517k752j522J2211J6390p733q917j4011
$$ -2724 7518 -1445 -16455 -14634 -29 -2546 -5298 -6820 5391 21781 14048 5131 -8880
13670h880j4795o756N449R252M944P164J1117k809q117m472O680q83k99n732p852
$$ -8880 -23675 -30431 -24982 -15730 -10786 -3622 7495 4686 -3431 -7903 -1223 -2106 -2405 -8137 -15989
13655a5989o110J1949P829K816K136k430M773K195j932j433J0182p71O826n570
$$ -15989 -22099 -10150 -2321 495 2631 201 4974 7169 5237 3804 13986 13215 20041 14471
13641A4471j2136N713R88k015J8449J0752j7306j1795L64j0859r810K821o338
$$ 14471 2335 8048 9036 7021 25470 36222 18916 7121 7485 -3374 -13184 -10363 -16701
13628a6701r240P100J0377J0286L60k6345N217J0941O358n860j1923o073P641
$$ -16701 -25941 -18841 -8464 1822 2182 -24163 -18946 -8005 -1647 -7507 -19430 -25503 -17862
13615a7862j875N609K37j110J240J7930l163j0091q793J4002P609K2064n896J052
$$ -17862 -19737 -14128 -13891 -15001 -13761 4169 1006 -9085 -17878 -3876 3733 25797 19901 20953
13601B0953k1323j3553M972r759P823L0616q923n389L916l916j1796j1883p62
$$ 20953 -370 -13923 -8951 -18710 -10887 19729 10806 5417 9333 5417 -6379 -18262 -19024
13588a9024R631K3610q439j9531k0044M684J82j0477K552J4159L749n90p351J3238
$$ -19024 -9393 14217 5778 -13753 -33797 -29113 -28931 -39408 -36856 -22697 -18948 -19538 -26889 -13651
13574a3651J340L666l650P466L672r315Q404J6125n533O262J751J644j0160R618
$$ -13651 -12311 -8645 -12295 -4829 -1157 -10472 -2068 14057 8524 14786 16537 18181 8021 17639
13560A7639n026j1123l803q408n67J2657J2535r975n715n736O753k272J831m326
$$ 17639 12613 1490 -2313 -10721 -11288 1369 13904 3929 -1786 -7522 -769 -3041 -1210 -5536
13546e536l657J971O940j795j0554m882N751m157O534N603L961k925j289j0349
$$ -5536 -9193 -7222 -282 -2077 -12631 -17513 -11762 -15919 -9385 -3782 179 -2746 -4035 -14384
13532a4384l459R040O868O532m682r062Q03k860O356M208j490l322J1621P645
$$ -14384 -17843 -8803 -1935 4597 -85 -9147 -8344 -11204 -4848 -640 -2130 -5452 6169 13814
13518A3814p11q096O34j3164r740J145J0329J1325j1530m873Q17l715p005M176
$$ 13814 13103 5007 5641 -7523 -17263 -16118 -5789 5536 -5994 -10867 -10050 -13765 -20770 -16594
13504a6594L734J7254p768p100L232N539p088m882N655J7058j1290r535R407M151
$$ -16594 -12860 4394 -3374 -10474 -7242 -1703 -8791 -13673 -8018 9040 -2250 -11785 -2378 1773
13490A773n266J893M396j9576q030k403J6277J6768n707l593J1051n51j6537O836
$$ 1773 -3493 -1600 2796 -16780 -24810 -27213 -10936 5832 125 -3468 7583 7032 -9505 -2669
13476b669N539m253L844L31J4006J1618j6887j6131q473O114O585Q35j3210j912
$$ -2669 2870 -1383 2461 2792 16798 28416 11529 -4602 -13075 -6961 -376 459 -12751 -14663
13462a4663J4527M513q882j5739m939P892K823L324r11O417Q622J552L567J663
$$ -14663 -136 4377 -4505 -20244 -25183 -17291 -14468 -11144 -12055 -5638 2984 4536 8103 9766
13448I766j3273m857K41J0823O31l512r593J951N246q407O083P35K699n210j7644
$$ 9766 -3507 -8364 -8123 2700 3331 -181 -9774 -7823 -2577 -10984 -4901 -4166 -1467 -6677 -24321
13433b4321K404P002L456r8P072P42P779j2696m585J0032M494p71m084M868n04
$$ -24321 -21917 -14915 -11459 -11557 -4485 -3743 4036 -8660 -13245 -3213 1281 510 -3574 1294 790
13418G90K837J0010j524n409O90q433r487j383O399J804J940L736Q81j482m974
$$ 790 3627 13637 12113 6704 7394 -1039 -10526 -11909 -5510 -3706 -1766 1970 2851 1369 -3605
13403c605Q030O206p689J162M812j501j8832j2003r360J1187K9802R922n130j1868
$$ -3605 4425 10631 2942 4104 8916 7415 -11417 -23420 -32780 -21593 8209 18131 13001 1133
13389A133R052J997p217l183k396j1302o841O059O01J47L440J741O092m82J367
$$ 1133 10185 12182 4965 1782 -614 -11916 -18757 -12698 -12097 -11950 -8510 -6769 -677 -1159 208
13374B08n377o586J1572J654L122j541j1391j4468N240P450O00L760P068N364
$$ 208 -5169 -11755 -183 1471 4593 3052 -8339 -22807 -17567 -10117 -9517 -5757 1311 6675
13360F675k726o004r366n155N935J5924k374j625k864J3093L826Q346o355M109
$$ 6675 3949 -2055 -11421 -16576 -10641 5283 2909 1284 -1580 11513 15339 23685 17330 21439
13346B1439l134R063k67q815l068J0414P815j2761j9113j7833j2380N61K4961
$$ 21439 18305 27368 27101 18286 15218 25632 33447 20686 1573 -16260 -28640 -28079 -3118
13333c118O727p077k818Q992L739j4089m759k670R918J1147n325o099j3671L322
$$ -3118 3609 -3468 -6286 2706 6445 -7644 -12403 -15073 -5155 5992 667 -5432 -19103 -15781
13319a5781m294L224Q352M033O699K048k322o304k749m621L911L181j7R960K239
$$ -15781 -20075 -16851 -8499 -4466 2233 4281 1959 -4345 -7094 -11715 -7804 -4623 -4640 5320 7559
13304G559j431M514M570L633p381j3085o772l803J8787P194q439n335P52N203
$$ 7559 6128 10642 15212 18845 11464 -1621 -8393 -12196 6591 13785 5346 11 763 5966
13290E966L844J1916K783o428j52k5364j2378N214Q155M528J901l082j720m330
$$ 5966 9810 21726 24509 18081 17929 -7435 -19813 -14599 -6444 -1916 -15 -3097 -4817 -9147
13276i147J1265m103O73N690K860l441k597j0968J5529J0996j0531j669j559R23
$$ -9147 2118 -1985 -1312 4378 7238 3797 1200 -9768 5761 16757 6226 4557 2998 3921
13262C921O675M236n25r855p088k0131l961J3175K1738j1532j8683O398J5851
$$ 3921 10596 14832 14307 4452 -2636 -22767 -26728 -13553 8185 -3347 -22030 -15632 219
13249B19J4408J6349j0952q562j913J280o476q678K890K403P557r082r480N630
$$ 219 14627 30976 20024 11462 9549 10829 4353 -4325 -1435 968 8525 -557 -10037 -4407
13235d407n136O88J3595L852o656O148j929m268n287p946J2754Q933k796j860
$$ -4407 -9543 -8855 4740 8592 1936 8084 6155 1887 -3400 -11346 1408 10341 7545 5685
13221E685n465j405L834Q330r605q342r06j041Q597p460j8950J0383J6003m157
$$ 5685 220 -1185 2649 10979 1374 -6968 -7874 -8915 -318 -7778 -26728 -16345 -342 -4499
13207d499Q74N228L660j2790K707J5338J0383n161j070K89j879j3729j6170j218
$$ -4499 -3625 1603 5263 -7527 -4820 10518 20901 15740 14670 14959 13080 -649 -16819 -18037
13193a8037j40L967L511m172k419m67J538J740j2024Q920J6391k14O777j0076
$$ -18037 -18177 -14210 -10699 -14871 -17290 -17757 -16219 -14479 -26503 -17583 -1192 -1406 5371 -4705
13179d705q888O580j7393p75N455j8122q91K1023O478P75M498R016J684j635m193
$$ -4705 -13593 -7013 -24406 -25181 -19726 -37848 -38739 -17716 -11238 -10463 -5965 3051 4735 3100 -1093
13164a093q870j1555p942n033L499J0064J3053K20N41m866K395m73n021N348P147
$$ -1093 -9963 -21518 -29460 -34493 -30994 -20930 -7877 -7657 -7116 -11982 -9587 -10060 -15081 -9733 -2586
13149b586j771l638p415R103k242j1P57K827j751L904k255j3914j1034Q029J9525
$$ -2586 -4357 -7995 -15410 -6307 -8549 -8560 -7803 -4976 -6727 -2823 -5078 -18992 -30026 -21997 -2472
13134b472J9500j3171m096o959j0804J0362Q626j4730J937J1438Q488J4433R481
$$ -2472 17028 3857 -239 -7198 -18002 -7640 986 -13744 -11807 -369 8119 22552 32033
13121C2033j6541j7258L726n595m226R867m942k121n69r081j1778K41Q758J644
$$ 32033 15492 -1766 1960 -3635 -7861 2006 -2936 -5057 -5626 -14707 -26485 -26244 -17486 -15842
13107a5842J284O102Q96M723Q990k59m953M225j1632n441K491p215J549O455M180
$$ -15842 -14558 -8456 -7560 -2837 6153 5894 941 5166 -6466 -11907 -9416 -16631 -15082 -8627 -4447
13092d447K44J1814M423j528K239j0094K728O076m209J932j883j539o198k459
$$ -4447 -4203 7611 12034 10506 12745 2651 5379 11455 7246 9178 7295 5756 -442 -2901
13078b901n252l483K340k419M054J2824k225l58k267L205m819L30K636p814k872
$$ -2901 -8153 -11636 -9296 -11715 -7661 5163 2938 2580 313 3518 -1301 -971 1665 -6149 -9021
13063i021J4351P329L581n704j852O082J552j3598l341p245j3632M968J4605n662
$$ -9021 5330 12659 16240 10536 8684 14766 16318 2720 -621 -7866 -21498 -16530 -1925 -7587
13049g587r498j89r66J8261N178N092L320j1669j3988j3526m849J3344P982J617
$$ -7587 -17085 -17274 -18240 21 5199 10291 13611 1942 -12046 -25572 -30421 -17077 -9095 -7478
13035g478J36J620J305k034J555J5961Q649J619o712j1109N202J1618j0812r604
$$ -7478 -7342 -5722 -4417 -6451 -4896 11065 19714 21333 14621 3512 8714 20332 9520 -84
13021h4j166J050P27r970m37J1940J1391p11j2427n405L054m256j786L914o1J0496
$$ -84 -1250 -200 527 -9443 -9880 2060 13451 12740 313 -5092 -2038 -6294 -8080 -4166 -4227 6269
13005F269k388L294N920o694q55r547N711P357Q49q493p868j3808Q135Q294P255
$$ 6269 3881 7175 13095 6401 5546 -4001 1710 9067 9916 1423 -6445 -20253 -12118 -3824 3431
12990C431j576L596J93o558j561P003N051K439M209n258M441o064r387O515L771
$$ 3431 1855 5451 5644 -914 -2475 4528 9579 12018 16227 10969 15410 9346 -41 6474 10245
12975A0245p800j2991r159l428n747M84k22l602R391K4936j620K166R325l46j0071
$$ 10245 2445 -10546 -19705 -23133 -28880 -28396 -28618 -32220 -22829 2107 487 2653 11978 11632 1561
12960A561j7847Q167J1755l658J895p127j833R411J1600j1248l629j242j534L163
$$ 1561 -16286 -8119 3636 -22 1873 -5254 -7087 2324 13924 2676 -953 -2195 -3729 -566
12946e66k513n029L505J1623n794r577J575Q501j0811j8248j0504J4431J3346
$$ -566 -3079 -8108 -4603 7020 1226 -8351 -6776 1725 -9086 -27334 -37838 -23407 -10061
12933a0061n469r796N524J7174R080Q410k902P972K592m973J794r471R00J759
$$ -10061 -15530 -25326 -19802 -2628 6452 14862 11960 19932 22524 17551 19345 9874 10774 12533
12919A2533j1287j1869J604N763K438L470l189j2379R954K574J4225P707J5721
$$ 12533 1246 -10623 -9019 -3256 -818 2652 -537 -12916 -2962 -388 13837 21544 37265
12906C7265q271j4151p249K875k557j1895m416j1784K845l731j3272J1311J2575
$$ 37265 28994 14843 7594 10469 7912 -3983 -8399 -20183 -17338 -21069 -34341 -23030 -10455
12893a0455j4796K038J1756R597J0092j0496j4332j0129K1220J5987l283n065
$$ -10455 -25251 -23213 -11457 -1860 8232 -2264 -16596 -26725 -5505 10482 7199 2134
12881B134K217j464O37q448k457O286K226r766n204K768Q198J6438j546J7427
$$ 2134 4351 2887 3524 -4924 -7381 -1095 1131 -8635 -13839 -11071 -2873 13565 12019 29446
12867B9446j0593k2915j3529r137j371J5626P180j533M348l157o572L550J986
$$ 29446 18853 -4062 -17591 -26728 -28099 -12473 -5293 -6826 -2478 -5635 -12207 -8657 -6671
12854f671J4163K876J227q792J2904j961k0975q473M521o841M049O317J3267N801
$$ -6671 7492 10368 11595 2803 15707 13746 -7229 -15702 -11181 -18022 -13973 -7656 5611 11412
12840A1412p584n771M169N623M789m31r578m404j0922J1173q83N978K502j2405
$$ 11412 3828 -1943 2226 7849 12638 12207 2629 -1775 -12697 -1524 -2407 3571 6073 -6332
12826f332m975N455j6429m121J4592Q488M545O724O403j257l713m918n220j445
$$ -6332 -11307 -5852 -22281 -26402 -11810 -3322 1223 7947 14350 13093 9380 4462 -758 -2203
12812b203l284K942n373o003N947k489r3K375N577m377L066N248M157J702J045
$$ -2203 -5487 -2545 -7918 -13921 -7974 -10463 -10556 -8181 -2604 -6981 -3915 1333 5490 7192 8237
12797H237J807k229k279n567M685M71r271N289m63l754J849J2668k237o235N920
$$ 8237 10044 7815 5536 -31 4654 5125 -4146 1143 680 -3074 -1225 11443 9206 2971 8891
12782H891N134J0054N79j0782r034k142K197M378q757l900K475P92j325N971n388
$$ 8891 14025 24079 24658 13876 4842 2700 4897 9275 518 -3382 -907 -115 -1440 4531 -857
12767h57n398J4264J789j0943Q44Q634J3446M799o084j1376k4679p486P509R610
$$ -857 -6255 8009 9798 -1145 -301 8333 21779 26578 20494 9118 -15561 -23047 -15538 -5928
12753e928P490o143j63n585m100j4368o175J7713K3175K654n513j205K914q362
$$ -5928 1562 -4581 -4744 -10329 -14429 -28797 -34972 -17259 5916 8570 3057 1852 4766 -3596
12739c596o472L533r627J236O842m199j8035M018J1354m31k125L583K831J2625
$$ -3596 -10068 -6535 -16162 -14926 -8084 -12283 -30318 -26300 -14946 -15377 -17502 -13919 -11088 1537
12725A537J1331p164j5578J1291J7619j438q451k388k858r667J111j824k2795
$$ 1537 12868 5704 -9874 1417 19036 17598 9147 6759 3901 -5766 -4655 -6479 -29274
12712b9274O02O691J3167O688j0945l26m581J457q382M963J2414J0636j986K105
$$ -29274 -28672 -21981 -8814 -2126 -13071 -13397 -17978 -16521 -24903 -19940 -7526 3110 1124 3229
12698C229K596k203O955r100n149n14O966J6897j3227k3252J2890J5108j835r905
$$ 3229 5825 3622 10577 1477 -3672 -4186 2780 19677 6450 -16802 -3912 11196 9361 -544
12684e44O617M832j0349O079r653j0477o259q05J1940J5082N711n102m354J197
$$ -544 6073 10905 556 6635 -3018 -13495 -19754 -20559 -8619 6463 12174 7072 2718 3915
12670C915K003K216P191K940q079P816q331L271M050J6669m361n639j2152k2756
$$ 3915 5918 8134 15325 18265 10186 18002 9671 12942 16992 33661 29300 23661 11509 -11247
12656a1247J878J2938p55l14P146j741j292m850j4716K799O550q520j958J8567
$$ -11247 -9369 3569 2814 2500 9646 7905 6613 1763 -12953 -10154 -3604 -12124 -14082 4485
12642D485L308l439l326l105l933o747J0416K249J432N20o608o40P788J0277j1631
$$ 4485 7793 4354 1028 -2077 -6010 -12757 -2341 -92 1340 1860 -4748 -5388 2400 12677 1046
12627A046J688N028r84o5o697p600o614j3401P945P380J2635j7162j3558J2177
$$ 1046 2734 7762 6778 6713 16 -7584 -14198 -27599 -19654 -12274 361 -16801 -30359 -18182
12613a8182O731L664l501Q476J401j872L930K210N309M390J3656N006j5726j3644
$$ -18182 -11451 -7787 -11288 -2812 -1411 -3283 647 2857 8166 12556 26212 31218 15492 1848
12599A848Q748k460j0731l145Q670N481o150M868O197m525K547m546J831m060
$$ 1848 10596 8136 -2595 -5740 2930 8411 2261 7129 13326 8801 11348 6802 8633 4573
12585D573MJ320K274m147k1304j2196o50N218J9809K4679n289r632O747R255j0858
$$ 4573 4577 5897 8171 4024 -17280 -29476 -30126 -24908 -5099 19580 14291 4659 11406 20661 9803
12570I803p573J1653Q489P73j8016L916M951j5480m618J3752N477o328r910P393
$$ 9803 2230 13883 22372 23145 5129 9045 13996 -1484 -6102 7650 13127 6799 -3111 4282
12556D282P296n190l475J258P283M02l614r174k711M010J8561p311K25o027K849
$$ 4282 11578 6388 2913 4171 11454 11856 8242 -932 -3643 367 18928 11617 11842 5815 8664
12541H664J0251L866j3753m161J5956k163l228j1396P71L3O29Q457L44Q395j5447
$$ 8664 18915 22781 9028 4867 20823 18660 15432 4036 4807 4840 5469 13926 14270 22665 7218
12526G218K120J3978L358k4914k2238J53k252J169K3747J452n670k01j7113j305
$$ 7218 9338 23316 26674 1760 -20478 -20325 -22577 -21408 2339 3791 -1879 -2080 -19193 -20498
12512b0498m922Q500N708l37L095J34J1375j083N227N609K579P574N785j6338
$$ -20498 -25420 -16920 -11212 -11549 -8454 -8320 3055 1972 7199 12808 15387 22961 28746 12408
12498A2408q024l870J929N522j0376j1548J2879N28o954Q829k449J5259o124j0920
$$ 12408 4384 514 2443 7965 -2411 -13959 -1080 -552 -7506 1323 -1126 14133 8009 -2911
12484b911N557m210m485O334N098M515M481p699j766M871J555o429j7571J7210
$$ -2911 2646 -1564 -6049 285 5383 9898 14379 6680 4914 9785 11340 4911 -12660 4550
12470D550J4993M334l930n72j0457j745L088m98l721K037l294l308l299p197J0982
$$ 4550 19543 23877 19947 19375 8918 7173 10261 9763 6042 8079 4785 1477 -1822 -9019 1963
12455A963O784P3j394J5694K2576k3123q125K626j803m337k80k954k237K077J0552
$$ 1963 8747 8820 7426 23120 45696 22573 14448 17074 15271 10934 10654 7700 5463 7540 18092
12440A8092o026k208p64o130N563L327q227J796P415J3363o766j4541K960k076
$$ 18092 12066 9858 9094 2964 8527 11854 3627 5423 12838 26201 19435 4894 7854 5778
12426E778r062o765J4637j6949p296R746N09K770m156Q040J646K445j9r725j232
$$ 5778 -3284 -10049 4588 -12361 -19657 -9911 -9402 -6632 -10788 -2748 -1102 1343 1324 -8401 -9633
12411i633N503Q971J0788j2780j0769o433O948O349J749o061m182N440N665p83
$$ -9633 -4130 4841 15629 2849 -7920 -14353 -7405 -1056 693 -5368 -9550 -4110 1555 772
12397G72n381n400j6213J4171J8814j0156q265N57J0072O835l90O11p353K716
$$ 772 -4609 -10009 -26222 -12051 6763 -3393 -11658 -11101 -1029 5806 5416 6027 -1326 1390
12383A390n305j383J0698O3l952j0096p91J6066O614M84L518J6144j0143j6778
$$ 1390 -3915 -5298 5400 5463 1511 -8585 -9376 6690 13304 13788 17306 33450 23307 6529
12369F529k007j015n667n154K760J1252l496l022J3518R976L677r82n714q560
$$ 6529 4522 3507 -2160 -7314 -4554 6698 3202 180 13698 23674 27351 26369 20655 12095
12355A2095J3961N610r272j929P847O845K105J620J008q378q675N183J4719o144
$$ 12095 26056 31666 22394 20465 28312 35157 37262 38882 39890 31512 22837 28020 42739 36595
12341C6595k3839j0417L290o543m349J2147J1399P013P921J24k79J609m656j8069
$$ 36595 12756 2339 5629 -914 -5263 6884 18283 25296 33217 33341 33062 34671 30015 11946
12327A1946j060p373j1701N028J3209J1433J1535N232P77j0271j0384j0356q900
$$ 11946 10886 3513 -8188 -3160 10049 21482 33017 38249 39026 28755 18371 8015 -885
12314h85j556J1913k492p167M862P219l641r465J099j2408Q805N739J6305J0648
$$ -885 -2441 9472 6980 -187 4675 11894 8253 -1212 -113 -12521 -3716 2023 18328 28976
12300B8976j050j0275o638q792q09J5494j0021k4927J195M915l514J3103N158
$$ 28976 27926 17651 11013 2221 1412 16906 6885 -18042 -16847 -11932 -15446 -2343 2815
12287B815K945l937O506o697L424K668P601r379K423k503P746J9397m454j2458
$$ 2815 5760 1823 8329 1632 5056 7724 15325 5946 8369 5866 13612 33009 28555 16097
12273A6097n890O200o87k064J377M860N82j989L188q1J416R40j311l174l909j000
$$ 16097 10207 16407 15720 13656 15033 19893 20475 18486 21674 21593 23009 23949 22638 19464 15555 14555
12257A4555l175o731m619j083m511J0623K544q972o070m761N191K533J3344M524
$$ 14555 11380 4649 30 -1053 -5564 5059 7603 -1369 -7439 -12200 -7009 -4476 8868 13392
12243A3392j2721o344l476j502Q197k507J76O131P331O9J175j350J2326J3646
$$ 13392 671 -5673 -9149 -10651 -2454 -4961 -4785 1346 8677 8746 9921 8571 20897 34543
12229C4543r662n909j2971l599J1713J2606l2r420o259j5155J197J5878K020j8782
$$ 34543 24881 18972 6001 2402 14115 26721 26689 17269 11010 -4145 -2948 12930 14950 -3832
12215c832L041j090n253K081L847Q375R499j153J478j3223l956j473L129o58J3806
$$ -3832 -791 -1881 -7134 -5053 -1206 7169 16668 15515 16993 3770 -186 -1659 1470 812 14618
12200A4618J5144j3010l772j299j645N666K89k933O242Q476j0346o779r779j7875
$$ 14618 29762 16752 12980 11681 10036 15702 15991 13058 19300 27776 17430 10651 872 -17003
12186a7003J954J5262L626K533Q486M956l34K332r971J691P786J0195m504n526
$$ -17003 -15049 213 3839 6372 14858 19814 19480 21812 11841 13532 21318 31513 27009 21483
12172B1483P348r804n1K952j6674n726Q090M885k689l494j230n701r095j92K2804
$$ 21483 28831 19027 18976 21928 5254 -472 7618 12503 9814 6320 5090 -611 -9706 -9898 12906
12157A2906P952M27k294J269r810m136O758J3620J4781l518l537j1950q033R489
$$ 12906 20858 21285 18991 20260 10450 6314 13072 26692 41473 37955 34418 22468 14435 23924
12143B3924k773K039k021O44k963M885J886J635J611j1057l618J3925J029M662
$$ 23924 21151 23190 21169 21813 18850 23735 25621 27256 28867 17810 14192 28117 29146 33808
12129C3808J198O387j1826k6513M842j0924k111n075R859J9401K675j5491j1156
$$ 33808 35006 41393 29567 3054 7896 -3028 -5139 -10214 -355 19046 21721 6230 -4926
12116d926j716l92j6083n617l71J3670K3199J7036L507k587n828l886O86k970
$$ -4926 -6642 -7034 -23117 -28734 -29105 -15435 7764 24800 28307 25720 19892 16006 16692 13722
12102A3722p319j5574N84J952r671J2078J6005J464j0873Q85L472P060r642j1488
$$ 13722 6403 -9171 -8587 -6635 -16306 -4228 11777 13241 2368 3253 6725 13785 4143 -7345
12088g345j0942O519M742l191J3127L752o587j2266K4412R147m201j016j810j305
$$ -7345 -18287 -11768 -7026 -10217 2910 6662 75 -12191 12221 21368 17167 16151 14341 13036
12074A3036L256p665j7685j0631m433N268J2527j1801k370J0859P703J1360P615
$$ 13036 16292 8627 -9058 -19689 -24122 -18854 -6327 -18128 -20498 -9639 -1936 9424 17039
12061A7039j4325p611L823R786Q08j8621r378M249J3641j364J0715J923j0959
$$ 17039 2714 -4897 -1074 8712 9520 -9101 -18479 -14230 -589 -1953 8762 10685 -274
12048b74R31k800o50o261P403j2179O81M539L807J947M759M724J0113p121p275
$$ -274 657 -2143 -2793 -9054 -1651 -13830 -13149 -8610 -4803 -2856 1903 6627 16740 9619 2344
12033B344m54K734J940K127o51O779p566q521J3047r354j6343p914j147Q844J5358
$$ 2344 1890 4624 6564 8691 8040 14819 7253 -1268 11779 2425 -13918 -21832 -22979 -14135 1223
12018A223J0559o449L4N852R790j593j090n038r539P363J799n258j3360L927l74
$$ 1223 11782 5333 5367 11219 21009 19416 18326 13288 3749 11112 12911 7653 -5707 -1780 -2154
12003b154m148j0470K832J3953J4108Q755j021O054Q164J969q485j0177r524j7865
$$ -2154 -6302 -16772 -13940 13 14121 22876 21855 27909 36073 38042 29557 19380 9856 -8009
11989h009j403R389r19m197Q47J38l406L219K337q207k948R428J1080m476n898
$$ -8009 -9412 -23 -942 -5139 -4292 -4154 -7560 -4341 -2004 -10211 -13159 -3731 7349 2873 -3025
11974c025o751R660J4298K649q764k463q59J1125J9024M908k8294j649J2865n00
$$ -3025 -9776 -116 14182 16831 8067 5604 4745 15870 34894 39802 11508 9859 22724 22224
11960B2224p084r09l644l616J2012J1028m336l116j3884o969O873O888m037m418
$$ 22224 15140 14231 10587 6971 18983 30011 25675 22559 8675 1706 8579 15467 11430 7012
11946G012J6028M41j0335m002J691j065O774j3795q727P144N319P133p477l637
$$ 7012 23040 23481 13146 9144 10835 9770 16544 2749 -5978 1166 6485 13618 6141 2504
11932B504N949Q53M89O544p636K391J749J567M052N469J6692K931n242j967l355
$$ 2504 8453 9306 9795 16339 8703 11094 12843 14410 18462 23931 40623 43554 38312 36345 32990
11917C2990j6904m468J2073r020n171M573n127R180M360Q463p636N39l528O120
$$ 32990 16086 11618 23691 14671 9500 14073 8946 18126 22486 30949 23313 23852 20324 26444
11903B6444r268p919o550l455L882M363M253q078j3806k543j400J1656J0508k406
$$ 26444 17176 9257 2707 -748 3134 7497 11750 3672 -10134 -12677 -14077 -2421 8087 5681
11889E681J4528M697K498O997l18O776j1018j1723k948L060J1679l144j9033r940
$$ 5681 20209 24906 27404 34401 34083 40859 29841 18118 15170 18230 29909 26765 7732 -2208
11875b208J5144J0622J325O04j6309m368K29k3375N782L4056J3599k253p787j022
$$ -2208 12936 23558 24883 25487 9178 4810 5039 -18336 -12554 21502 35101 32848 25061 24039
11861B4039j600j016k188r09J58j561J18j754K350j2399j3980O94R297j458Q37
$$ 24039 22439 21423 19235 18326 18484 16923 17041 15287 17637 5238 -8742 -8048 1249 -209 628
11846F28N747N577j0160j485P634Q586J637K994R031K340L058j5898j6376Q90
$$ 628 6375 11952 1792 307 7941 16527 18164 21158 30189 32529 35587 19689 3313 4203
11832D203N842j0070K043P73j2713N001K1322l139J774M938J02j5692J0549j796
$$ 4203 10045 -25 2018 2791 -9922 -4921 16401 13262 15036 19974 20076 4384 14933 13137
11818A3137k59m509j4958j1883m387K0995J9798J587J0600n522M255r58k279q315
$$ 13137 12878 8369 -6589 -18472 -22859 -1864 17934 19521 30121 24599 28854 27896 25617 17302
11804A7302n593O595k364n578m97m414j0869J4631J0253j3073n546j66J0661J6637
$$ 17302 11709 18304 15940 10362 9865 5451 -5418 9213 19466 6393 847 681 11342 27979
11790B7979R272J5058J5162J829q740r792l429o21R49p257j3618n487p278K621
$$ 27979 37251 52309 67471 69300 60560 50768 47339 46718 47667 40410 26792 21305 14027 16648
11776A6648n121q433n788Q578K326L793J2455o026M351J0810j5962r37J5907l676
$$ 16648 11527 3094 -2694 5884 8210 12003 24458 18432 22783 33593 17631 16694 32601 28925
11762B8925k472p330j1202L018L197n797o148P397J2097M439j1839l533M996R325
$$ 28925 26453 19123 7921 10939 14136 8339 2191 9588 21685 26124 14285 10752 15748 25073
11748B5073R996j0235J670N736r480j3831k589J211O949n568p586R432J6404L273
$$ 25073 35069 24834 26504 32240 22760 8929 6340 7551 14500 8932 1346 10778 27182 30455
11734C0455J0081K353J272N332J1152M401m899o117q362j1600j5416j4203p209
$$ 30455 40536 42889 44161 49493 60645 65046 60147 54030 45668 34068 18652 4449 -2760
11721b760q673J2967P779l855J3091L856j1330j0742M797M751R132O706k819n621
$$ -2760 -11433 1534 9313 5458 18549 22405 11075 333 5130 9881 19013 25719 22900 17279
11707A7279L320J0296K464j1188N27J666m491O090J0169n849j3750n460J1324
$$ 17279 20599 30895 33359 22171 22698 24364 19873 25963 36132 30283 16533 11073 22397
11694B2397J3654K722j0422N394P749R029m190l671m063j5093j3990p003N934
$$ 22397 36051 38773 28351 33745 41494 50523 46333 42662 38599 23506 9516 2513 8447
11681H447j940n208J414M554j3352M089J1407n826N054J5488J811j0554P454J2953
$$ 8447 6507 1299 2713 7267 -6085 -1996 9411 3585 8639 24127 25938 15384 22838 35791
11667C5791J521r738j584l900n076J804N062j2666n714R660Q631r675j4827J666
$$ 35791 37312 27574 25990 22090 17014 18818 23880 11214 5500 15160 23791 14116 -711 955
11653I55J3872R9m595n066O987R885O1O064p655j0455P344K518J0560Q213n081
$$ 955 14827 14926 10331 5265 12252 22137 22198 28262 20607 10152 17496 20014 30574 38787 33706
11638C3706p724j6347j2751j486L315j927R678N857L456o487l219q736l231N885
$$ 33706 25982 9635 -3116 -4602 -1287 -3214 6464 12321 15777 9290 6071 -2665 -5896 -11
11624a1O624J1231N923j6405j2773k328R783M024k737n476j168J6390Q738M844
$$ -11 6613 17844 23767 7362 -5411 -7739 2044 6068 3331 -2145 -3313 13077 21815 26659
11610B6659m033j586k233Q399Q216k636n16R980L770l399l310j2352j0882J80
$$ 26659 22626 21040 18807 27206 35422 32786 32270 42250 46020 42621 39311 26959 16077 16257
11596A6257l340r755J088R407r883l220m168L613N451p608p457Q095J4393P302
$$ 16257 12917 3162 4250 13657 3774 554 -3614 -1 5450 -2158 -9615 -1520 12873 20175
11582B0175K577j3788k757N255J1258k263j723Q293Q455O642j0827m207J922J405
$$ 20175 22752 8964 6207 11462 22720 20457 18734 27027 35482 42124 31297 27090 29012 30417
11568C0417o901k957r800j8776K6021J7907K777p967J419Q513P785j1804Q50J870
$$ 30417 23516 20559 10759 -8017 18004 35911 38688 30721 32140 40653 48438 36634 37484 39354
11554C9354j741R483m621o107o494m774j5746k365J5946J2718q72j645J0994n587
$$ 39354 37613 47096 42475 36368 29874 25100 9354 6989 22935 35653 34781 33136 44130 38543
11540C8543J464o319L06L072k822M46j295j4298P156K3638J712j3948k767N939
$$ 38543 40007 33688 33994 37066 34244 34690 33395 19097 26253 49891 51603 37655 34888 40827
11526D0827j037p179p870L367J5179j2410j1842L72j2156J691J0583N228Q161
$$ 40827 39790 32611 24741 28108 43287 30877 19035 19407 7251 8942 19525 24753 32914
11513C2914n857P669j326j0722m702K08J8483M476l262m418k587J5729j048p698
$$ 32914 27057 34726 33400 22678 17976 18184 36667 41143 37881 33463 30876 46605 45557 37859
11499C7859m110R546J0900p400L180N485K770j632m092k0624q754l501Q358L983
$$ 37859 33749 43295 54195 46795 49975 55460 58230 56598 52506 31882 23128 19627 27985 31968
11485C1968j4931J892J0472J460J8128r027j0523j0396K6o448q367k734J2974
$$ 31968 17037 18929 29401 30861 48989 39962 29439 19043 19069 12621 4254 1520 14494
11472A4494J6157P941L493O935K890l674P166j0970p486R620M974K223j6198j6087
$$ 14494 30651 38592 42085 49020 51910 48236 55402 44432 36946 46566 51540 53763 37565 21478
11458B1478N264J936N554J4314l395J157N76N3k0051r971M469p507K690N61j1368
$$ 21478 26742 28678 34232 48546 45151 46308 46884 46937 26886 16915 21384 13877 16567 17128 5760
11443E760O608J6982J203j1069O290O640j1679L667j3777K808q589n677P854k639
$$ 5760 12368 29350 30553 19484 25774 32414 20735 24402 10625 13433 4844 -833 7021 4382
11429D382R298M672L612l045R880N947P551N594J5002o501j4266j2549j2119K081
$$ 4382 13680 18352 21964 18919 28799 34746 42297 47891 62893 56392 42126 29577 17458 19539
11415A9539r883J653J7427J3920N929J0902J3873J7130K3J3766J1889J6742p600
$$ 19539 9656 11309 28736 42656 48585 59487 73360 90490 90513 104279 116168 132910 125310
11402A25310k7640l0597j2366j3690N042l324k861r850j3384K604J7070n722j0506
$$ 125310 97670 67073 54707 41017 46059 42735 39874 30024 16640 19244 36314 30592 20086
11389B0086J0627J1130k862j8391o100J1415o845o430N95J5216M968K643o53J711
$$ 20086 30713 41843 38981 20590 14490 25905 19060 12630 13225 28441 33409 36052 35399 37110
11375C7110P80j7539J450r969R406k709P630j464q721o282m10J1769m236o872
$$ 37110 37890 20351 21801 11832 21238 18529 26159 24695 15974 9692 9282 21051 16815 9943
11361I943J2034M18m644m725l712n551m392r608J0909J811j499n119R697O420
$$ 9943 21977 22395 17751 13026 9314 3763 -629 -10237 672 2483 984 -4135 5562 11982
11347A1982J3345j3668j2430L282M775n345l032N037J3355N169J4993j0367j1651
$$ 11982 25327 11659 -771 2511 7286 1941 -1091 3946 17301 22470 37463 27096 15445
11334A5445K747R635o229N551q746n513L533L033J633j0434j9614M140m97J8435
$$ 15445 18192 27827 21598 27149 18403 12890 16423 19456 21089 10655 -8959 -4819 -5316 13119
11320A3119R739Q837q780N412j1724N248J1437J3755n914n494J931O269M239q527
$$ 13119 22858 31695 22915 28327 16603 21851 33288 47043 41129 35635 37566 43835 48074 39547
11306C9547p508l884O002q158J2090O137j2466r121N007L876o392j2900r137J010
$$ 39547 32039 28155 34157 25999 38089 44226 31760 22639 27646 31522 25130 12230 3093 4103
11292D103O278K0434J4456m475j1326J2566J4668j3546l373L592L151p350o584
$$ 4103 10381 30815 45271 40796 29470 42036 56704 43158 39785 43377 46528 39178 32594
11279C2594M163p111p222R61j661J593j530j1429L925M101Q811l669r696J3040
$$ 32594 36757 29646 22424 23385 21724 23317 21787 10358 14283 18384 27195 23526 13830 26870
11265B6870J2177l447o428Q50L650o576M445K2666R814r869J115k500J0016J2309
$$ 26870 39047 35600 29172 30022 33672 27096 31541 54207 64021 54152 55267 52767 62783 75092
11251G5092Q076J926K714m36j3741p225J0012r818p692P953q344j3882n536q57
$$ 75092 83168 85094 87808 87372 73631 66406 76418 66600 58908 66861 58517 44635 39099 38242
11237C8242K435O011M80Q942l648q299j3009m227J1526k672j2238r0R328q884
$$ 38242 40677 46688 47168 56110 52462 44163 31154 26927 38453 35781 23543 23453 32781 23897
11223B3897m966Q52Q450n08K558J5826k958o648j1178K078l988k9612K893J4027
$$ 23897 18931 19783 28233 27725 30283 46109 43151 36503 25325 27403 23415 -6197 -3304 10723
11209A0723P861J4217N984o092j3242n013K014Q703k866j0041o33M467M049N545
$$ 10723 18584 32801 38785 32693 19451 14438 16452 25155 22289 12248 11615 16082 20131 25676
11195B5676L464l064r77O417j99J1175l142n479R558L596k321p79j484j3093j3107
$$ 25676 29140 26076 25099 31516 31317 42492 39350 33871 43429 47025 44704 43925 42441 29348 16241
11180A6241L08J0220K196j4051n289L523R321M50L389n688L957O612K004j1269
$$ 16241 16549 26769 28965 14914 9625 13148 22469 22919 26308 20620 24577 31189 33193 21924
11166B1924j345J1615j0945P7J9758q207j1525k583o509r670L182J7457J3171
$$ 21924 20579 32194 21249 21326 41084 32877 21352 18769 12260 2590 5772 23229 36400
11153C6400J2937q357j011L801J0143r327j4848q823J904k505j4410k137O559
$$ 36400 49337 40980 39969 43770 53913 44586 29738 20915 22819 20314 5904 3767 10326
11140A0326N208Q529M409m590j0263l111J1109J5392j527j1397p798k37k858j0105
$$ 10326 15534 24063 28472 23882 13619 10508 21617 37009 35482 24085 16287 16050 13192 3087
11126C087J3842J4693k554r112o063l114j7367q207J2051J6565L991O96O453M838
$$ 3087 16929 31622 29068 19956 13893 10779 -6588 -14795 -2744 13821 17812 18508 24961 29799
11112B9799J448Q309m125q618K144l610j3479L355J0455L530O082K008N30Q751
$$ 29799 31247 39556 35431 26813 28957 25347 11868 15223 25678 29208 35290 37298 37828 46579
11098D6579n733K233k085m171n839r710K844p075Q207n17j694P316J876J86O383
$$ 46579 40846 43079 40994 36823 30984 21274 24118 17043 25250 24733 23039 30355 32231 32417 38800
11083C8800j4536m064N583Q34K465Q341q38j735n634j2092P160R715l937k914
$$ 38800 24264 20200 25783 26617 29082 37423 36585 34850 29216 17124 24284 33999 30062 27148
11069B7148N638J0945R91n357k597Q975l258J992n516N768L35j4496J1020N115
$$ 27148 32786 43731 44722 39365 36768 45743 42485 44477 38961 44729 45064 30568 41588 46703
11055D6703M265m973p951P943K387N63l2p057m819J8658J1540O545o148p860o823
$$ 46703 50968 45995 38044 45987 48374 48937 48905 41848 37029 55687 67227 73772 67624 59764 52941
11040E2941L889r580l725m388K412Q565K0412P74j5773r967j478k584q47n500
$$ 52941 56830 47250 43525 39137 41549 50114 70526 71300 55527 45560 44082 41498 40651 35151
11026C5151O321R142j151M594Q294n786l198J363p255r323K355M609j316K918
$$ 35151 41472 50614 49463 54057 62351 56565 53367 54730 47475 38152 40507 45116 43800 46718
11012D6718K938l860m044N061m22K624N707n554n089K0606J914j2647m886J359
$$ 46718 49656 45796 41752 46813 46391 49015 54722 49168 44079 64685 66599 53952 49066 50425
10998E0425P216J0603q327P649L348o111j0362J193l172r567K272J9324m636j1216
$$ 50425 57641 68244 59917 67566 70914 64803 54441 55634 52462 42895 45167 64491 59855 48639
10984D8639p428N146L758r310P872K272N783l252j1676J4216J8929K848j13j3676
$$ 48639 41211 46357 50115 40805 48677 50949 56732 53480 41804 56020 74949 77797 77684 64008
10970F4008j1338j194l26O819P682M550o901Q24J2080r132j4238k4189j3232M069
$$ 64008 52670 51476 51150 57969 65651 70201 63300 64124 76204 67072 52834 28645 15413 19482
10956A9482J4966r37N671M753M917o164q298J241Q535j0509p34O979K0073J7219
$$ 19482 34448 33511 39182 43935 48852 42688 34390 35631 44166 33657 32923 39902 59975 77194
10942G7194o804n421j674o139p36R70k850j5572M06M150J0928K100m3r259O198
$$ 77194 70390 64969 63295 57156 56420 57390 54540 38968 39374 43524 54452 56552 56509 47250 53448
10927E3448K780m517p543l571R08o768q056M817J3425Q023N750j1097m264r18
$$ 53448 56228 51711 44168 40597 41505 34737 26681 31498 44923 52946 58696 47599 43335 42417
10913D2417J6622Q587K516j2690o447K812N36k672j2220M506R004P247p119j4592
$$ 42417 59039 67626 70142 57452 51005 53817 54353 51681 39461 43967 52971 60218 53099 38507
10899C8507n124J033j2551N582J3785l320P886R357j259J823Jk495J352l733r878
$$ 38507 33383 34416 21865 27447 41232 37912 45798 55155 53896 55719 55720 53225 54577 50844 40966
10884D0966P805J3908m935M748k15j2072o059J424N279k329J487J1090o51m805
$$ 40966 48771 62679 57744 62492 62277 50205 44146 45570 50849 48520 50007 61097 60446 55641
10870E5641j5123N417K9161J2197L000Q000Q156k714q370J2819K1168L5939O970
$$ 55641 40518 45935 75096 87293 90293 98293 106449 103735 95365 108184 129352 165291 172261
10857A72261m293O378K203j3023k2945k3251j2163p760N642L76p238M607k703
$$ 172261 167968 174346 176549 163526 140581 117330 105167 97407 103049 103425 96187 100794 98091
10844I8091j8472o566j5299n512J4788K970L847J5628j078r524J360k850L725
$$ 98091 79619 73053 57754 52242 67030 70000 73847 89475 88397 78873 80233 77383 81108
10831H1108j63j572j0088m802J2152J0664J3803K726K244p66r676J2786l041J367
$$ 81108 80945 79373 69285 64483 76635 87299 101102 103828 106072 105306 95630 108416 105375 106742
10817A06742p803k275j3418P763O737O060L264j1199O049N571O475L851j0004
$$ 106742 98939 96664 83246 91009 97746 103806 107070 95871 101920 107491 113966 117817 107813
10804A07813j2152j0480j3260Q574K1549P366q862j5419N987J2642l025O821J2340
$$ 107813 95661 85181 71921 80495 102044 109410 100548 85129 91116 103758 100733 107554 119894
10791A19894L197j3115R618K87J278P699R277j4243n957N708J2754j490K091R799
$$ 119894 123091 109976 119594 119881 121159 128858 138135 123892 117935 123643 136397 134907 136998 146797
10777A46797J2654Q89K859j4949p950N717K31N444M0518M0686M0961Q7689J14824
$$ 146797 159451 160340 163199 148250 140300 146017 146248 151692 192210 232896 273857 361546 476370
10764D76370N6780R180K3065M5914p965j41671j21916p6452n5110k9789j1878
$$ 476370 533150 542330 565395 611309 603344 461673 339757 263305 208195 178406 166528
10753A66528j6939o660N017P57Q186j501J1617J405J636k492q72J2872p387K195
$$ 166528 149589 142929 147946 148703 156889 155388 167005 168410 170046 167554 166682 179554 172167 174362
10739A74362j176j757o887n674k693J7312J6561J0599J9204N133J96j509J1920
$$ 174362 173186 171429 164542 158868 156175 173487 190048 200647 219851 224984 225180 223671 235591
10726B35591o736q336O712J064l747O70N142J7721K8872L6807L9185M0407N1249
$$ 235591 228855 220519 227231 228295 224548 225218 230360 248081 276953 313760 352945 393352 444601
10713D44601J03498J75974K45678K54228K53147K78046K75707J98082J3135j57423
$$ 444601 548099 724073 969751 1223979 1477126 1755172 2030879 2228961 2242096 2084673
10703B084673j95699k53554l42203l17333k07068j32254q2486m6140l5975k7241
$$ 2084673 1888974 1635420 1293217 975884 768816 636562 554076 507936 471961 444720
10693D44720j6453n71k7703n803J3p216j7513o283P87n417j3891j0730j1388m203
$$ 444720 428267 427696 399993 394190 394203 386987 369474 363191 363978 358561 344670 333940 322552 318349
10679C18349j485j2105L512R929L0907K4906L1011J2002L679K856m337j1946k4055
$$ 318349 316864 304759 308271 318200 349107 374013 405024 417026 420705 423561 419224 407278 383223
10666C83223k0766j8091k818m342p534K627K0100o984k7312l5884k5519j3934
$$ 383223 362457 344366 341548 337206 329672 332299 352399 345415 318103 282219 256700 242766
10654B42766p099j8361j3124n655R890K6242L0088L1909K5530M8674N5666L0723
$$ 242766 235667 217306 204182 198527 208417 234659 264747 296656 322186 370860 426526 457249
10642D57249K6711K7403J4684k6937p0430n2346k5663k1842j7212j968p099o912
$$ 457249 483960 511363 526047 499110 428680 376334 350671 328829 311617 309649 302550 295638
10630B95638p932j1013m784m636l208q468J0414J0342j481m159k848j7706j2776
$$ 295638 287706 276693 271909 267273 264065 255597 266011 276353 274872 270713 267865 250159 237383
10617B37383k2578j3393o956m645j3824j1557J0962l919m951N835L552J1112J5013
$$ 237383 214805 201412 194456 189811 175987 164430 175392 171473 166522 172357 175909 187021 202034
10604B02034N887r456J1494J5425K264l942r650o555J6083n787j8246O983J9459
$$ 202034 207921 198465 209959 225384 227648 223706 214056 207501 223584 217797 199551 206534 225993
10591B25993J8889j268O504J3692J450P63q313m803R730j167O678J232J2055J2243
$$ 225993 244882 243614 250118 263810 265260 266023 257710 252907 262637 261470 268148 269380 281435 293678
10577B93678R138J1884j0373j1647R108L2550K005m664L551l412q929K17p898
$$ 293678 302816 314700 304327 292680 301788 334338 336343 331679 335230 331818 322889 323106 315208
10564C15208l18n130j1714R428L0923J4005P955L1202J4387k597K0283K4358J893
$$ 315208 314890 309760 298046 307474 338397 352402 360357 391559 405946 403349 423632 447990 449883
10551D49883j0606k2797l8895l6469k2110m1391l2361j6537j141q573L733M2m683
$$ 449883 439277 416480 377585 341116 319006 277615 245254 228717 227576 219003 222736 222778 218095
10538B18095P227J2523J670l414N135p611Q930J0162J1917n150k2457m196J1594
$$ 218095 225322 237845 239515 236101 241236 233625 242555 252717 264634 259484 237027 232831 244425
10525B44425Q189J7987J2164j2816j9197p728p236o097p258O893k70K40J6015
$$ 244425 252614 270601 282765 269949 250752 243024 235788 229691 222433 229326 229056 229296 245311
10512B45311k572q085K666k300r57L928J0699l428l979R57j5817r489K996O567
$$ 245311 242739 234654 237320 235020 234063 237991 248690 245262 241283 242240 226423 216934 219930 226497
10498B26497m087J4677L240R036K6133K5144J8014L5026L6174K7149J7867J4702
$$ 226497 222410 237087 240327 249363 275496 300640 318654 353680 389854 417003 434870 449572
10486D49572Q516o230j3986m272P123M103J15N986l193J7336J2284r859r678j5292
$$ 449572 458088 451858 437872 433600 440723 444826 444941 450927 447734 465070 477354 467495 457817 442525
10472D42525r682L342J706j1690n340p604J0313K7395K3181J6292K7483M2079
$$ 442525 432843 436185 437891 426201 420861 413257 423570 450965 474146 490438 517921 560000
10460E60000O2012N9605N3407L3655M1636L3178O725K897J4136K3435M1808R9685
$$ 560000 622012 681617 735024 768679 810315 843493 850218 853115 867251 890686 932494 1032179
10448A032179J64898J95647J39158O0917L6673N9764k9884k25994k31728j37105
$$ 1032179 1197077 1392724 1531882 1592799 1629472 1689236 1659352 1433358 1201630 1064525
10438A064525q6869n7531P682K4589J5320J6242J4100J4942J2643J4036J876j7899
$$ 1064525 977656 920125 927807 952396 967716 983958 998058 1013000 1025643 1039679 1041555 1023656
10426A023656r661J3613n597k7361r896j895M74j4634K079p914K038J1343P150
$$ 1023656 1013995 1027608 1022011 994650 984754 982859 983333 968699 970778 962864 964902 976245 983395
10413I83395J2399L058j3909j3924j130J3915J0543J1420j5859P428M7764M6567
$$ 983395 995794 998852 984943 971019 969889 983804 994347 1005767 989908 997336 1045100 1091667
10401A091667r414k8314j5199O709l292J562q625r030O917j0182j1249Q269J9397
$$ 1091667 1082253 1053939 1038740 1045449 1042157 1043719 1035094 1026064 1032981 1022799 1011550 1019819 1039216
10388A039216M5480O6133O1094N1250N8510Q2822P2248P5951P8587R7093J07488
$$ 1039216 1084696 1150829 1211923 1263173 1321683 1404505 1476753 1552704 1631291 1728384 1835872
10377A835872J13600J18691J28229J55097J74401K21974K64356K62656K38458
$$ 1835872 1949472 2068163 2196392 2351489 2525890 2747864 3012220 3274876 3513334
10368C513334K36999K24466J64242M8289q1930j59486k13099k49519k61557k25548
$$ 3513334 3750333 3974799 4139041 4187330 4105400 3945914 3732815 3483296 3221739 2996191
10358B996191j80559q5959m2638j5773N486Q450L920n773q452l5697m4630k0135
$$ 2996191 2815632 2729673 2687035 2671262 2676748 2685198 2689118 2683345 2674893 2639196 2594566 2574431
10346B574431j184j04M6617O6175N8024P9373R2009R7051Q9866R7139J28036J49680
$$ 2574431 2573247 2573143 2619760 2685935 2743959 2823332 2915341 3012392 3102258 3199397 3327433 3477113
10334C477113J64285J84014K23329K83239L33817L92029N00455O14084O69985
$$ 3477113 3641398 3825412 4048741 4331980 4665797 5057826 5558281 6172365 6842350
10325F842350O88919P53243Q07144P96573P22766P44111R40996J151401J369030
$$ 6842350 7531269 8284512 9091656 9888229 10610995 11355106 12296102 13447503 14816533
10316A4816533J717360K158093K601762L106084L745370M637854N983975Q304268
$$ 14816533 16533893 18691986 21293748 24399832 28145202 32783056 38767031 47071299
10308D7071299J2438404J9327268K9930323M2757164N0619278M9084161M6243455
$$ 47071299 59509703 78836971 108767294 151524458 202143736 251227897 297471352
10301B97471352M5233377L4062966L155873k8881001l6184769m1319255n8621663
$$ 297471352 342704729 376767695 379923568 351042567 314857798 273538543 214916880
10294B14916880n8786500m1012328k5173782j5857126j0477085p234141n272260
$$ 214916880 156130380 115118052 89944270 74087144 63610059 56375918 51103658
10287E1103658m059514l239399k537173k329356k543298k210770j667171j379854
$$ 51103658 47044144 43804745 41267572 38938216 36394918 34184148 32516977 31137123
10279C1137123j241925j162997j103133j103609j193852j310682j305611j193147
$$ 31137123 29895198 28732201 27629068 26525459 25331607 24020925 22715314 21522167
10271B1522167j201220j183580j005679q19275o87459o05276n40904n04777n24367
$$ 21522167 20320947 19137367 18131688 17312413 16624954 16019678 15478774 14973997 14449630
10262A4449630n55261n83392n98514n99888n75631n36639m86171m29831l85941
$$ 14449630 13894369 13310977 12712463 12112575 11536944 11000305 10514134 10084303 9698362
10253I698362l80051l66782l33629k99100k65219k41843k41189k23271j98295
$$ 9698362 9318311 8951529 8617900 8318800 8053581 7811738 7570549 7347278 7148983
10244G148983k04273k15803k23263k01885j86827k06479j94095j90114j90070
$$ 7148983 6944710 6728907 6505644 6303759 6116932 5910453 5716358 5526244 5336174
10235E336174j60909j46799j33212j46255j43537j27426j27003j24177j06839
$$ 5336174 5175265 5028466 4895254 4748999 4605462 4478036 4351033 4226856 4120017
10226D120017r3170q1032p9587j06477r3400p4924p4362p4934q2602q4477q1844
$$ 4120017 4026847 3945815 3866228 3759751 3666351 3591427 3517065 3442131 3359529 3275052 3193208
10215C193208o9746n8020l6617l4550k1483l6880n6208n7544q2801j09212j23211
$$ 3193208 3123462 3065442 3028825 2994275 2972792 2935912 2879704 2822160 2739359 2630147 2506936
10204B506936j28399j13458j17547j04176q1105p4283o6808n0882n3264p6936
$$ 2506936 2378537 2265079 2147532 2043356 1962251 1887968 1821160 1770278 1717014 1640078
10194A640078q8496q7662q4731j02554j09767r8210q6650o3856n2454m1917m5037
$$ 1640078 1551582 1463920 1379189 1276635 1166868 1068658 982008 918152 865698 823781 778744
10183G78744n0913m9570m3242k2750j5953j1487k4073k1159j5735o284j7597l6829
$$ 778744 727831 678261 635019 612269 596316 584829 560756 539597 523862 517578 499981 463152
10171D63152m7875m5335l5137k1243k6293j1249l009J4006Q634O738J2988K4826
$$ 463152 415277 369942 334805 313562 287269 276020 273011 287017 295651 302389 315377 340203
10159C40203J9894R778n836r279L872j5897j5122M378R659J4563L0877J8774P460
$$ 340203 360097 369875 364039 354760 358632 342735 327613 331991 341650 356213 387090 405864 413324
10146D13324J1410p775K662K139J084j352j5847J1619n766j1965P460J3955m51
$$ 413324 424734 416959 419621 421760 422844 421492 405645 417264 411498 399533 406993 420948 420497
10133D20497l367J1468r263j5941k8198j8753J4856K3634J0591j332R057J1089
$$ 420497 417130 428598 419335 403394 375196 356443 371299 394933 405524 404192 413249 424338
10121D24338J3282K775j720j1557j5837k0741l2719k2465j5947o212n265J871
$$ 424338 437620 440395 438675 427118 411281 390540 357821 335356 319409 313197 307932 309803
10109C09803M897R026K1541K9666J6357K6763k822j1992j7587k5895m654J5223
$$ 309803 314700 323726 345267 374933 391290 418053 415231 403239 385652 359757 355103 370326
10097C70326p411p837o074J1436l48j2781k605N54j928J742j7535k436K870J5170
$$ 370326 362915 355078 349004 360440 360092 347311 344706 345260 343332 345074 327539 325103 327973 343143
10083C43143l694j0918j918K905P195n78k878M128p822l807k2452j3922R393J6237
$$ 343143 339449 328531 326613 329518 336713 336135 333257 337385 329563 325756 303304 289382 298775 315012
10069C15012J1815R688K1617K6784L711n929m035q031k9430k2158j1652j5506
$$ 315012 326827 336515 358132 384916 388627 382698 378663 370632 341202 319044 307392 291886
10057B91886j3611j2357j7056k4985k7771k1430k256J0364N372O602n660K526
$$ 291886 278275 265918 248862 223877 196106 174676 172420 182784 188156 194758 189098 191624
10045A91624K85j2396k1469j1025o029l447J016l859r730j1710M857L742q465
$$ 191624 191909 179513 158044 147019 140990 137543 138559 134700 124970 113260 118117 121859 113394
10032A13394K629m643r618o803n596l795j374J158K045J0094N715r62k556k479
$$ 113394 116023 111380 101762 94959 89363 85568 84194 85352 87397 97491 103206 102244 99688 97209
10018I7209K397j5416J401J4494J1995K473k78m983J937p696R167J798n24K238
$$ 97209 99606 84190 85591 100085 112080 114553 114275 109292 111229 103533 112700 114498 113974 116212
10004A16212p288r826r36l91J5500k292k873n778r385N399Q912J0758R344P251
$$ 116212 108924 99098 98162 97771 113271 110979 108106 102328 92943 98342 107254 118012 127356 134607
9990A34607P14m063J0542J816k398j0366o846j4499p383k085j384j5668l181P933
$$ 134607 135321 131258 141800 143616 141218 130852 124006 109507 102124 100039 98655 82987 79806 87739
9976H7739M704l712j3925N84J1225J1212J7591M72J1363J0018O453J164j4519
$$ 87739 92443 88731 74806 75390 86615 97827 115418 115890 127253 137271 143724 144888 130369
9963A30369k3845j2810J35m304o196O374J1133R203L126J044k047J0049J3192
$$ 130369 106524 93714 93849 89545 83349 89723 100856 110059 113185 114229 112182 122231 135423
9950A35423J3670n919L269P31O557q008j4335j6677j5908j4779m146K854O390
$$ 135423 149093 143174 146443 147174 153731 145723 131388 114711 98803 84024 79878 82732 89122
9937H9122q401j013J2163M765n338O27J7718k868m307O08o189j140j49o793j56
$$ 89122 80721 79708 91871 96636 91298 91925 109643 106775 102468 103076 96887 95747 95598 88805 88649
9922H8649K0985M662l180j6301j5913j063J0002J3655l998L183Q677L799q940
$$ 88649 109634 114296 111116 94815 78902 77839 87841 101496 97498 100681 109358 113157 104217
9909A04217p388K3089J2877J4941J4671Q610J1643P22k369O317L3770M8645M7051
$$ 104217 96829 119918 132795 147736 162407 171017 182660 183382 181013 187330 221100 269745 316796
9896C16796Q7625J14160J73620K60913K82225K62283K76180K62151J47589l9130
$$ 316796 404421 518581 692201 953114 1235339 1497622 1773802 2035953 2183542 2144412
9886B144412j84942j94144k53568l46825k89849j92201j30364q2891m6430n3003
$$ 2144412 1959470 1765326 1511758 1164933 875084 682883 552519 469628 423198 370195
9876C70195l5186j5930m940n697j4415j4393p894q43O78k0020j2413k09r493j7605
$$ 370195 335009 319079 314139 308442 294027 279634 271740 270897 271575 251555 239142 238933 229440 211835
9862B11835j2844m515n719j8375j0082q726O379J4729K168j28n648n571m095j0035
$$ 211835 198991 194476 188757 170382 160300 151574 157953 172682 174850 174722 169074 163503 159408 149373
9848A49373k901p707j1086N381O831J089k281P016k53m045o663j0459m640p613
$$ 149373 146472 138765 127679 133060 139891 140980 138699 145715 145462 141417 134754 124295 119655 112042
9834A12042Q866j2267k461L018r689j0121J1744N178j2041l350K854R473o842
$$ 112042 120908 108641 106180 109198 99509 89388 101132 106310 94269 90919 93773 103246 96404
9821I6404j6795l560J465j2218n139J6524J4200p781j1630p287M407J5666n96
$$ 96404 79609 76049 77514 65296 60157 76681 90881 83100 71470 64183 68590 84256 83660
9808H3660k0722n824R986O480P963J535J3974k622j1761o69q826r123M54M634
$$ 83660 62938 57114 67100 73580 81543 83078 97052 94430 82669 82000 73174 64051 64505 69139
9794F9139L223J3273n451j5013J4944l157k0169j4406J5861K1047j1970j256M146
$$ 69139 72362 85635 80184 65171 80115 76958 56789 42383 58244 79291 67321 66065 70211
9781G0211J7689J7609J9380K0443J7207l777R490J1824l175j861Q160r884k349
$$ 70211 87900 105509 124889 145332 162539 158762 168252 180076 176901 175040 183200 173316 170967
9768A70967J6619P451P926J4458J7688j14m952l652j0398k4117k0917j6877j0944
$$ 170967 187586 195037 202963 217421 235109 234995 230043 226391 215993 191876 170959 154082 143138
9755A43138j6974j9016j8777p359n022k356J796J1800J5919M448m139M609J648
$$ 143138 126164 107148 88371 81012 75990 73634 75430 87230 103149 107597 103458 108067 109715
9742A09715j0941J0720m4j7532o259L873N377o899j5099J545Q564J5770J1350
$$ 109715 98774 109494 109450 91918 85659 89532 94909 88010 72911 74456 83020 98790 110140
9729A10140K623j1882j1257m117j541j466j2362R222O837p171O801J9214J0687
$$ 110140 112763 100881 89624 85507 83966 82500 70138 79360 86197 79026 85827 105041 115728
9716A15728K517j1045k853k03J3113J1641k428j3891m988N713N042o345l017K45
$$ 115728 118245 107200 104347 104144 117257 128898 126470 112579 107591 113304 118346 112001 108984 109229
9702A09229L807K4651K2471m928P902P621n94n742j0507j1959p051M314M012J111
$$ 109229 113036 137687 160158 155230 163132 170753 170159 164417 153910 141951 134900 139214 143226 144337
9688A44337L211K3041K4652N259K008K656j378j2092j8569p143r3Q377o23l1479
$$ 144337 147548 170589 195241 200500 202508 205164 203786 191694 173125 165982 165889 174266 173643 142164
9674A42164j810P693K1741K110N212L364O301p910j7780p769n293o6P41j7570
$$ 142164 140354 148047 169788 171898 177110 180474 186775 178865 161085 153316 148023 147957 148698 131128
9660A31128p028k352m651j033O934p898J2391J3720J5525j5813J0100L686P18
$$ 131128 124100 121748 117097 116064 122998 115100 127491 141211 156736 140923 151023 154709 155427
9647A55427O498K579J1322J2292K1311K8872J4513J4898k080R5r855j0253n164
$$ 155427 161925 164504 175826 188118 209429 238301 252814 267712 265632 265727 255872 245619 240455
9634B40455j6198l1071j9598j0087L009r921o045n337j4183l254M137M993j887
$$ 240455 224257 193186 173588 163501 166510 156589 150544 145207 131024 127770 131907 136900 135013
9621A35013l45j687j54O861L299J1331J4675J3722q799j1727o480j2774p197r77
$$ 135013 134668 132981 132827 139688 142987 154318 168993 182715 173916 162189 155709 142935 135738 134761
9607A34761j2169q117n866L614j134n52p358o071l967J2047r056j0468K936M007
$$ 134761 122592 114475 108609 112223 111089 110537 103179 97108 93141 105188 96132 85664 88600 92607
9593I2607M531J887J469N423L352o730O183j01o010o465P412R712P24R7j0444
$$ 92607 97138 99025 100494 105917 109269 102539 108722 108621 102611 96146 103558 113270 113994 114091 103647
9578A03647M741J5164K698K913J571q013j7613q955l319L540Q783q019N79J9507
$$ 103647 108388 123552 126250 129163 130734 122721 105108 96153 92834 96374 105157 97138 97717 117224
9564A17224L884j5308m417j2108o654p41R573J8032J9084N241l879P707l529r111
$$ 117224 121108 105800 101383 89275 82621 81880 91453 109485 128569 133810 129931 137638 134109 124998
9550A24998j417p319j5917L225O871J058J0243L796Q327m37M679K85j0067l501
$$ 124998 123581 116262 100345 103570 110441 111499 121742 125538 133865 133428 138107 138392 128325 124824
9536A24824j1678j1672l228J617N526L806n070J8461J5708n606r300K861p969
$$ 124824 113146 101474 98246 99863 105389 109195 104125 122586 138294 132688 123388 126249 118280
9523A18280m87n025p228p141n972j1232l641Q159p263j6118P804J6789KJ9111
$$ 118280 117793 112768 105540 98399 92427 81195 77554 85713 78450 62332 70136 86925 86927 106038
9509A06038J625m749m865N14l343k851J1305R748q24k632o067J848J4021J1544
$$ 106038 107663 102914 98049 98563 95220 92369 103674 113422 112598 109966 103899 105747 119768 131312
9495A31312M707q570k3083j4554Q009J3352l789K18P601J2630m715k947L213J192
$$ 131312 136019 127449 104366 89812 97821 111173 107384 107602 115203 127833 123118 120171 123384 124576
9481A24576Q40q583j2340m7r464L64L947O446R377L787L134k943k1931j2403N619
$$ 124576 125416 116833 104493 104446 94982 95346 99293 105739 115116 118903 122037 119094 97163 84760 90379
9466I0379j261J946N097P55J0645N883j096M648J0535L092j2349p751J3981q889
$$ 90379 89118 91064 96161 96916 107561 113444 112348 116996 127531 130623 118274 110523 124504 115615
9452A15615j0742n010N657j0136j5178j5802m795J7894M606q778J0328J917P558
$$ 115615 104873 99863 105520 95384 80206 64404 59609 77503 82109 73331 83659 85576 93134
9439I3134m346L49q767O554K0134Q534m730p514k833O609q957j815M096k348R099
$$ 93134 88788 89137 80370 86924 107058 115592 110862 103348 100515 107124 98167 96352 100448 98100 107199
9424A07199n220m558J2858q257k1064j8606J3557K812Q021J5370R519J226k962
$$ 107199 101979 97421 110279 102022 80958 62352 75909 78721 86742 102112 111631 112857 109895
9411A09895j6885r953K593M792l951J3130J4662J014m540l995M710J071j1963
$$ 109895 93010 83057 85650 90442 86491 99621 114283 115297 110757 106762 111472 112543 100580
9398A00580O928K939m766J785O174j5001O951K290q082O489O753j4896j2128N989
$$ 100580 107508 110447 105681 107466 113640 98639 105590 107880 99798 106287 113040 98144 86016 92005
9384I2005K176K40j0588l27J2701J4432J8221k547Q068N635J5747M724k287k569
$$ 92005 94181 94421 83833 83506 96207 110639 128860 126313 134381 140016 155763 160487 158200 155631
9370A55631J0666J9929L0882J8754M0484M5250K8343L0006L6199J144k0509l3648
$$ 155631 166297 186226 217108 235862 276346 321596 349939 379945 416144 417288 396779 363131
9358C63131l8767k6166l0077j7285k9058k2489j2135p233j1782j0831j1918k636
$$ 363131 324364 298198 268121 250836 221778 199289 187154 179921 168139 157308 145390 142754
9346A42754K726Q100j753j1477k7473r619r3q060Q413j0645k839J786K895M628
$$ 142754 145480 153580 151827 140350 112877 103258 103165 95105 103518 92873 90034 91820 94715 99343
9332I9343j0908L246k130l507L217p949j223j1655O546J6238J1022n917j6743
$$ 99343 88435 91681 89551 86044 89261 81312 80089 68434 74980 91218 102240 96323 79580
9319G9580P945q65M346J0464m178p308o221n090J217K2688J9214n081N057l204
$$ 79580 87525 86660 91006 101470 97292 89984 83763 78673 79890 102578 121792 116711 121768 118564
9305A18564o87O14O324J5000j0305j8906r372j6990j2194M98R563L99L847R011
$$ 118564 117877 118491 124815 139815 129510 110604 101232 84242 72048 72546 82109 82508 86355 95366
9291I5366O680o632p411j898Q317J4021P809P060j0350l57R548l646k1734q531
$$ 95366 102046 95414 88003 86105 94422 108443 116252 123312 112962 112605 122153 118507 96773 88242
9277H8242K1325Q372P092k014q205k63J363O53K379k719J1251J4007N595P041
$$ 88242 109567 117939 125031 123017 114812 114549 115912 116565 118944 116225 127476 141483 147078 154119
9263A54119J6645J7109L3904K0769L596J9146K3837L1424Q061j0000k2179o569
$$ 154119 170764 187873 221777 242546 246142 265288 289125 320549 328610 318610 296431 289862
9251B89862k3439k8265j2027j1878m3406k7638j1306m920m187l439j9745j9553
$$ 289862 266423 238158 226131 214253 170847 143209 131903 126983 122796 119357 99612 80059
9239H0059Q942n946M94k592K2489n519q498M391q036j2346R942J4311p436k3984
$$ 80059 89001 83055 83549 80957 103446 97927 89429 93820 85784 73438 83380 97691 90255 66271
9225F6271j464J664Q701r302o532Q929L250q90M69K833q17J789j143p85K168P167
$$ 66271 64807 66471 75172 65870 59338 68267 71517 70627 71096 73929 73112 74901 73758 72973 75141 82308
9209H2308M010J323q856l973j5099Q285P740p336N919k343J414N510j1809n844
$$ 82308 86318 87641 78785 74812 59713 67998 75738 68402 74321 71978 73392 78902 67093 61249
9195F1249r111L268O264O244J3897l408n348m245k6001j0556J443J5391J3307
$$ 61249 52138 55406 61670 67914 81811 78403 73055 68810 42809 32253 33696 49087 62394
9182F2394P942j2361j4088O340J359m333J0463L580P743J2799k985j1582k1579
$$ 62394 70336 57975 43887 50227 51586 47253 57716 61296 69039 81838 78853 67271 45692
9169D5692M191R194j0388l092O683k848N443k07J47j162K560l202J1992Q048L079
$$ 45692 49883 59077 48689 45597 52280 49432 54875 54668 54815 53653 56213 53011 65003 73051 76130
9154G6130p484q874q031J2353m064J0203J5992j8080n386R214P877N087j8015
$$ 76130 68646 59772 51741 64094 60030 70233 86225 68145 62759 71973 79850 84937 66922
9141F6922j6539J8802K3317l026p573P027p734j9138p54J5627O034q351J3232
$$ 66922 50383 69185 92502 89476 81903 88930 81196 62058 61304 76931 82965 74614 87846
9128H7846l330j1152j5320j6765Q374J7249M777K0017J8544j5111m648J0591O653
$$ 87846 84516 73364 58044 41279 49653 66902 71679 91696 110240 95129 90481 101072 107725
9115A07725m046n588P967j772Q683R174q95J433J0770J1986k178j6193r419J2963
$$ 107725 103679 98091 106058 104286 112969 122143 121248 122681 133451 145437 143259 127066 117647 130610
9101A30610K3541J7817J6560J6655J9166K2301L1176K7383K6237M1324L7917N3936
$$ 130610 154151 171968 188528 205183 224349 246650 277826 305209 331446 372770 410687 464623
9089D64623P6777P2045Q0922J19250J54074K06407K78547L94937N76802Q05679
$$ 464623 541400 613445 694367 813617 967691 1174098 1452645 1847582 2424384 3230063
9079C230063J048810J093221Q46896N32098L29794J40016m30517j144280j301594
$$ 3230063 4278873 5372094 6218990 6751088 7080882 7220898 6790381 5646101 4344507
9070D344507j037002p10298m92232l45298k65989j90505j29500j13092j17166
$$ 4344507 3307505 2597207 2104975 1759677 1493688 1303183 1173683 1060591 943425
9061I43425q5266m5881l6008l3383l1399l7330k7930k0485k0293l1776m1419l1214
$$ 943425 858159 812278 776270 742887 711488 674158 646228 625743 605450 573674 532255 501041
9049E01041k0866k1431j9180j6399j1732j7922j1191o820j2397j0948j3326n146
$$ 501041 480175 458744 439564 423165 411433 393511 382320 375500 363103 352155 338829 333683
9037C33683j5869j6914j6751j8486p892j0317k131r137r984P259q827j1755j8479
$$ 333683 317814 300900 284149 265663 257771 247454 245323 236186 226202 233461 224634 212879 194400
9024A94400o095q389j7538k500J0382K874j2409j2338p568m611P2j4490l203J2734
$$ 194400 188305 179916 162378 159878 170260 173134 160725 148387 140819 136208 136280 121790 118587 131321
9010A31321j084j038P909p434j1813j1566Q173R996q619l548L200n693j8012L25
$$ 131321 130237 129199 137108 129674 117861 106295 114468 124464 115845 112297 115497 109804 91792 92117
8996I2117J807j2535J2985l902Q692L499j1770k0278M034Q027K226j920k920j2456
$$ 92117 93924 81389 94374 90472 99164 102663 90893 70615 74649 82676 84902 82982 80062 67606
8982F7606L535M325l658l406P227k809k1470n355K214m317j3147l678Q215J917
$$ 67606 71141 75466 71808 68402 75629 72820 51350 45995 48209 43892 30745 27067 35282 37199
8968C7199j5101K982j595j479N118q492p626q304O120R476M109n97J7553j0p273
$$ 37199 22098 25080 23485 22006 27124 18632 11006 2702 8822 18298 22407 21810 39363 39353 32080
8953C2080J505O67k190Q865M60K760K034j6540j1872m359m062j877j303j0822
$$ 32080 33585 34252 32062 40927 41387 44147 46181 29641 17769 13410 9348 7471 6168 -4654
8939d654k921Q669J2728K795l712N319L132K2284P804m295j879m157q685l519
$$ -4654 -7575 1094 13822 16617 12905 18224 21356 43640 51444 47149 45270 41113 32428 28909
8925B8909L286m8n89P258J1307n431k826j1429K171K582M845M380p32k404j1524
$$ 28909 32195 32147 31558 38816 50123 44692 41866 30437 32608 35190 40035 44415 43683 41279 29755
8910B9755n892O076Q045L602q088J3856J553Q711k0034m062l931j176Q072Q187
$$ 29755 23863 29939 37984 41586 33498 47354 48907 57618 37584 33522 29591 28415 36487 44674
8896D4674m773m52J79m979r370j2037j0344N416j4314J0305N102K352O932m725
$$ 44674 39901 39449 39628 34649 25279 13242 2898 8314 -6000 4305 9407 11759 18691 13966
8882A3966K557P874K438J3472o691o419O835L085J090N301q95R613L139N844m400
$$ 13966 16523 24397 26835 40307 33616 27197 34032 37117 38207 43508 42613 52226 55365 61209 56809
8867E6809o983k736N547m244m030n696o213n980K2067J731j8000j3922K508J5839
$$ 56809 49826 47090 52637 48393 44363 38667 32454 26474 48541 50272 32272 18350 20858 36697
8853C6697j534N24M518O65o566O793J0745J971L767P831P361k484j4692j6342
$$ 36697 35163 35687 40205 40870 34304 41097 51842 53813 57580 65411 72772 70288 55596 39254
8839C9254l414J1366l279m257N14n7O847P459j0334M394R336L978O807l991m81
$$ 39254 35840 47206 43927 39670 40184 40127 46974 54433 44099 48493 57829 61807 68614 64623 64142
8824F4142q132n285m431q3R00k939J750K798j6467k179J2824J0065P648l574n239
$$ 64142 56010 50725 46294 46211 47111 44172 45922 48720 32253 30074 42898 52963 60611 57037 51798
8809E1798j0374o89P573p39j774k464J615j1554n312J2361L715j2686M131J183
$$ 51798 41424 40735 48308 47569 45795 43331 44946 33392 28080 40441 44156 31470 35601 36784
8795C6784q915L174P017K892K304o748K449N270O721l782l10k087j4075j2987
$$ 36784 27869 31043 38060 40952 43256 36508 38957 44227 50948 47166 46856 44769 30694 17707
8781A7707L011J8035l627l928j1200J4162J2619q208j0268p537J0503J0360m0
$$ 17707 20718 38753 35126 31198 19998 34160 46779 38571 28303 20766 31269 41629 41589
8768D1589p80J0885o436m014K853M484J6298O124q284j2207j2501J714K3557K092
$$ 41589 40809 51694 45258 41244 44097 48581 64879 71003 62719 50512 38011 39725 63282 65374
8754F5374j3167m570q710o933o485j1467n417P108n32j406O597M270K213R120
$$ 65374 52207 47637 38927 31994 25509 14042 8625 15733 15201 13795 20392 24662 26875 35995
8740C5995L061j0178k416J775P053M973J5803m59r286j07R577J5942J2324j9336
$$ 35995 39056 28878 26462 28237 35290 40263 56066 55607 46321 46214 55791 71733 84057 64721
8726F4721k0759M734J1571J6230j3758j2734K249r061N698m35l670N53N084o894
$$ 64721 43962 48696 60267 76497 62739 50005 52254 43193 48891 48456 44786 45339 50423 43529
8712D3529j3869r98L370R864j7117j9325R24P943O558J6492j675j5984P790M199
$$ 43529 29660 28662 32032 41896 24779 5454 6378 14321 20879 37371 35696 19712 27502 31701
8698C1701Q815j150L05k977j0121L717J2447J2345R522j258K288n330r180M60
$$ 31701 40516 39366 39671 36694 26573 30290 42737 55082 64604 63346 65634 60304 51124 51584
8684E1584R178M865j1628o694k749P093j973l481N67J856J0519n998n999R214
$$ 51584 60762 65627 53999 47305 44556 51649 49676 46195 46762 48618 59137 53139 47140 56354
8670E6354M276N16P246J8037j0440j3918P060n084j2204J836J1040l350J1622
$$ 56354 60630 61146 68392 86429 75989 62071 69131 64047 51843 53679 64719 61369 72991
8657G2991N049m980P057J4107K184p126J0340r800K825m715N328K8758Q798m117
$$ 72991 78040 73060 80117 94224 96408 89282 99622 89822 92647 87932 93260 122018 130816 126699
8643A26699L213J6519L121M463l80M608Q264O5J865P969Q549j1560j1250q235
$$ 126699 129912 146431 149552 154015 153635 158243 166507 166572 168437 176406 184955 173395 162145 153910
8629A53910p06p109o820q622p457o941p455l364o959k735j1464p934j322r204
$$ 153910 153204 146095 139275 130653 123196 116255 108800 105436 98477 95742 84278 76344 75022 65818
8615F5818M519L987k85j3205m005j229M165P978m607M247P619R869J497j7034
$$ 65818 70337 74324 74039 60834 56829 55600 59765 67743 63136 67383 75002 84871 86368 69334
8601F9334j1566j6008n995P407J2747j589J040j0275l852J234j117P763J1244
$$ 69334 57768 41760 35765 43172 55919 54330 55370 45095 41243 42477 41360 49123 60367
8588F0367J178O74k2062k081M719J6182J0607k860M383Q418O946r372l3935r812
$$ 60367 61545 62219 40157 38076 42795 58977 69584 66724 71107 79525 86471 77099 43164 33352
8574C3352p59P879l930o433k471K0711P218k3869n405P882l447K975L159p517
$$ 33352 32593 40472 36542 30109 27638 48349 55567 31698 26293 34175 30728 33703 36862 29345
8560B9345K951o40K459q714M416l55m424m67M883j754N516j8168j0789J1341N228
$$ 29345 32296 31656 34115 25401 29817 29462 25038 24571 29454 27700 33216 15048 4259 15600 20828
8545B0828n111P217J3517K720r232j625J053n134j270k877j1362k461P272M684
$$ 20828 15717 22934 36451 39171 29939 28314 29367 24233 22963 20086 8724 6263 13535 18219
8531A8219j5438m00O847L645k709Q131L271j4723j461M74J0252o60l796p009M931
$$ 18219 2781 2381 9228 12873 10164 18295 21566 6843 5382 5856 16108 15448 11652 4643 9574
8516I574J1099n687j414K3655J7509j3642k834P93l306m164n809o548P118Q947
$$ 9574 20673 14986 13572 37227 54736 41094 38260 39053 35747 31583 25774 19226 26344 35291
8502C5291P41n805j3104j0096R202J1203l685j8710j2268l664J0188J4644J4292
$$ 35291 36032 30227 17123 7027 16229 27432 23747 5037 -7231 -10895 -707 13937 28229
8489B8229p721o308n205Q899O58j0753N928N608K452o895q494N520O580j0961
$$ 28229 20508 14200 8995 17894 18552 7799 13727 19335 21787 14892 6398 11918 18498 7537
8475G537j1365q848M153L772J313J1154L697l302j360o227O332O621K262o499
$$ 7537 -3828 -12676 -8523 -4751 -3438 7716 11413 8111 6751 524 6856 13477 15739 9240
8461I240o649k672P27J3119l02j0682j1250j704R933J6583K077k869o645p457
$$ 9240 2591 -81 646 13765 13463 2781 -8469 -10173 -240 16343 18420 15551 8906 1449
8447A449j0542M141l083Q622N023j595J0661K338j4811o80L161P171m773p642
$$ 1449 -9093 -4952 -8035 587 5610 4015 14676 17014 2203 1523 4684 11855 7082 -560
8433e60J0444m52o125l665J0143M317k503K007Q499k584l278K014j738R248l324
$$ -560 9884 9432 3307 -358 9785 14102 11599 13606 22105 19521 16243 18257 16519 25767 22443
8418B2443o851m051M093N829n51p530p628L712P139j4261J187l89p019J1706P290
$$ 22443 15592 11541 15634 21463 20912 13382 5754 9466 16605 2344 3531 3142 -3877 7829 15119
8403A5119k725J663L4o165q707Q752K7252k1596j5796l512j935R552J1284m970
$$ 15119 12394 14057 14091 7926 -781 7971 35223 13627 -2169 -5681 -7616 1936 13220 8250
8389H250M436L902m794j0724Q359j0598j2187J5304N223J294n701J89o60q304
$$ 8250 12686 16588 11794 1070 9429 -1169 -13356 1948 7171 8465 2764 2953 2293 -6011
8375f011k310M6O442J2331N986r012l104o13k609K847J0488j0435p327r329m528
$$ -6011 -8321 -8275 -1833 10498 16484 7472 4368 3755 1146 3993 14481 4046 -3281 -12610 -17138
8360a7138L939Q388R823J4899P872j0296j6428N7L504j4644k049R244L165N852
$$ -17138 -13199 -4811 5012 19911 27783 17487 1059 1116 4620 -10024 -12073 -2829 336 6188
8346F188n415J1778P16j5741j0939r631P738J993R897J30j1979k009J3841J945
$$ 6188 773 12551 13267 -2474 -13413 -23044 -15306 -13313 -3416 -3286 -15265 -17274 -3433 -1488
8332a488n396J0157K718L645N310j408j5944n238N831K0343K329j1802q778l515
$$ -1488 -6884 3273 5991 9636 14946 13538 -2406 -7644 -1813 18530 20859 9057 279 -3236
8318c236l038p271J0528J306j2991j0336n084P280J1079J6223Q731L122Q67q475
$$ -3236 -6274 -13545 -3017 -1711 -14702 -25038 -30122 -22842 -11763 4460 13191 16313 17180 8705
8304H705j6954J581J7597m344p773j602j0630j410o413n064J3097K786N593L436
$$ 8705 -8249 -6668 10929 6585 -1188 -2790 -13420 -14830 -21243 -26307 -13210 -10424 -4831 -1395
8290a395M467L0m472k896k8j0781m941q597J5500J6541K1120Q4j2790r752J183
$$ -1395 3072 3102 -1370 -4266 -4294 -15075 -20016 -28613 -13113 3428 24548 24632 11842 2090 3273
8275C273K154j1836M120K0937J6389J215j7387J432p469j0285l504L682M507J1321
$$ 3273 5427 -6409 -2289 18648 35037 36252 18865 20297 12828 2543 -961 2721 7228 18549
8261A8549K774j0590n844o629L417J1029k66n237n337Q101P120J799r861m495
$$ 18549 21323 10733 4889 -1740 1677 12706 12440 7203 1866 9967 17087 18886 9025 4530
8247D530J2861J4501J0836k407k1156q039r794l20J3517R027M112j2555m070j881
$$ 4530 17391 31892 42728 40321 19165 11126 1332 1012 14529 23556 27668 15113 11043 9162
8233I162k1157q594P582j292n46L3497J3408p638l483k271n056j2439N55K482
$$ 9162 -11995 -20589 -13007 -14299 -14845 18652 32060 24422 20939 18668 13612 1173 1728 4210
8219D210l012l915n371j2490R232O398l94K528p624j3621k528K177N518J0369
$$ 4210 1198 -2717 -8088 -20578 -11346 -4948 -5342 -2814 -10438 -24059 -26587 -24410 -18892 -8523
8205h523J0924q953j153Q249P601J0621K864m644q392j0733P393M040R609k162
$$ -8523 2401 -6552 -7705 544 8145 18766 21630 16986 8594 -2139 5254 9294 18903 16741
8191A6741q830p653q414r723k322J1462J820J871O962Q977p853j115J239j2075
$$ 16741 7911 258 -8156 -17879 -20201 -8739 -6919 -5048 1914 10891 3038 1923 3162 -8913
8177h913K396O19K478Q222l625J3317n89l978M719j2428q342j17K335P996j4082
$$ -8913 -6517 -5898 -3420 4802 1177 14494 13905 9927 14646 2218 -6124 -6241 -3906 4090 -9992
8162i992n032j43N090q3J1515L821L233m021q109K95K499J882j826J971J533N749
$$ -9992 -15024 -15167 -10077 -10160 1355 5176 8409 4388 -3721 -3426 -927 955 -871 1100 2633 8382
8146H382q651o996o03P198J4183N695Q00N283J225m669p526q484k909N038K613
$$ 8382 -269 -7265 -7868 -670 13513 19208 20008 25291 26516 21847 14321 5837 2928 7966 10579
8131A0579n351k672P4K510k94k427p033M464J2076l15r766K404Q895N965q431
$$ 10579 5228 2556 2630 5140 4846 2419 -4614 -150 11926 11611 1845 4249 13144 19109 10678
8116A0678j7423j3406o146J2850P648M107M207K937j3563J061L311K880P101J337
$$ 10678 -6745 -20151 -26297 -13447 -5799 -1692 2515 5452 -8111 -7050 -3739 -859 6242 7579
8102G579r726J636M314J1153j4945L697J4492N416L357j4962n094J2402J773o357
$$ 7579 -2147 -511 3803 14956 11 3708 18200 23616 26973 12011 6917 19319 21092 14735
8088A4735L418K325j432j2838j4903l37J3170J075L495q575M839J9r715K864L604
$$ 14735 18153 20478 19046 6208 -8695 -9032 4138 5213 8708 133 4972 4991 -4724 -1860 1744
8073A744J5226J5320k562j1221m044M064J918o400j850k327m919J908O745l134
$$ 1744 16970 32290 29728 18507 14463 18527 20445 14045 12195 9868 4949 6857 13602 10468
8059A0468N176M733Q40R319J580o160n060P873M781p254r546N09J0760J5949P934
$$ 10468 15644 20377 21217 30536 32116 25956 20896 28769 33550 26296 16750 17259 28019 43968 51902
8044E1902j0604m292k711J2241J040n226p050M410K942L832k122p952k89O994
$$ 51902 41298 37006 34295 46536 47576 42350 35300 39710 42652 46484 44362 36410 36121 43115
8030D3115j90l90j9365n080j261O290k51j799P367R931J675j7347n691o235Q191
$$ 43115 42925 42535 23170 18090 16829 23119 22868 21069 28436 38367 40042 22695 17004 10769 18960
8015A8960J1013j3568n343J2315J0269n437Q926r178j7685R608J1771J000J2012
$$ 18960 29973 16405 11062 23377 33646 28209 37135 27957 10272 19880 31651 32651 44663
8002D4663N817j7348j1349O231J8563O615r665J523r932P781M49j5974l820Q367
$$ 44663 50480 33132 21783 28014 46577 53192 43527 45050 35118 42899 43348 27374 23554 31921
7988C1921O184K755J804j6763k3234L976N996K883L490j307J3921P54L88J3805
$$ 31921 38105 40860 42664 25901 2667 6643 12639 15522 19012 17705 31626 32380 32768 46573
7974D6573j714n604O843n130R52Q056l134j9965n037l474R663Q032k340j6141
$$ 46573 44859 39255 46098 40968 41920 49976 46842 26877 21840 18366 28029 36061 33721 17580
7960A7580j0979k592P96N811P698J9824J5657j841k940p669k305n749j634j632
$$ 17580 6601 4009 4805 10616 18314 38138 53795 51954 49014 41345 39040 33291 31657 30025
7946C0025n394O42q336p718k640J294p517p930k464l092P266K559J2886J0197
$$ 30025 24631 25273 16937 9219 6579 7873 356 -7574 -10038 -13130 -5864 -3305 9581 19778
7932A9778j049j2998m864J2162m697j2976q430R854O428k675N913J5404j3903
$$ 19778 18729 5731 867 13029 8332 -4644 -13074 -3220 3208 533 6446 21850 7947
7919G947P784n29j0057j476R049Q377R008q477r233J702Q528O206J991J295q839
$$ 7947 15731 15202 5145 3669 12718 21095 30103 21626 12393 14095 22623 28829 30820 32115 23276
7904B3276l552N962k009j4496j2887J2387N95o784K094p404n409K541L234k880
$$ 23276 19724 25686 23677 9181 -3706 8681 9276 2492 4586 -2818 -8227 -5686 -2452 -5332
7890e332O944j871J0141m709J565L535r041r993j5128k414L461o38P123J0078
$$ -5332 1612 -259 9882 5173 6738 10273 1232 -8761 -23889 -26303 -22842 -23480 -16357 -6279
7876f279J4088R283O061j0271k0013q195j0187P359Q344J22j1646L035J1785o019
$$ -6279 7809 17092 23153 12882 -7131 -15326 -25513 -18154 -9810 -9688 -21334 -18299 -6514 -12533
7862a2533L640m552P075J0747L890k908L900J3382M5q004k487k242j0105r602
$$ -12533 -8893 -13445 -6370 4377 8267 5359 9259 22641 22686 14682 12195 9953 -152 -9754
7848i754K949K2310Q908m770J9632M589j2826p062q653j3956O795R082k160q841
$$ -9754 -6805 15505 24413 19643 39275 43864 31038 23976 15323 1367 8162 17244 15084 6243
7834F243p422j6432n642O937k224r64O451P762J1583L4j238j363K243P217p219
$$ 6243 -1179 -17611 -23253 -16316 -18540 -19504 -13053 -5291 6292 6326 5088 3725 5968 13185 5966
7819E966j440j589j0634N778R386K552j455J0761M170p979J781j4016j8852K717
$$ 5966 4526 2937 -7697 -1919 7467 10019 8564 19325 23495 15516 17297 3281 -15571 -12854
7805a2854P155M085j2360j841Q516o244j8843l246j155N102J1160L275r420l534
$$ -12854 -5699 -1614 -13974 -15815 -7299 -13543 -32386 -35632 -36787 -31685 -20525 -17250 -26670 -30204
7791c0204J5823O079k2667r401O83J1949K0399l083j1244o143L702P187P698L229
$$ -30204 -14381 -8302 -30969 -40370 -39687 -27738 -7339 -10422 -21666 -27809 -24107 -16920 -9222 -5993
7777e993J2514l491p674k867K006k896j0559j815o277l661J0775J7177L426J423
$$ -5993 6521 3030 -4644 -7511 -5505 -8401 -18960 -20775 -27052 -30713 -19938 -2761 665 2088
7763B088j5038Q22J087M274m148O450J828N776o150k1657M160K0928k057j991
$$ 2088 -12950 -12128 -11041 -6767 -10915 -4465 -2637 3139 -3011 -24668 -20508 420 -1637 -3628
7749c628r193l16J3892P857O476M577j1472j6901N477J50j0733j0707R461L738
$$ -3628 -12821 -13137 755 8612 15088 19665 8193 -8708 -3231 -3081 -13814 -24521 -15060 -11322
7735a1322K104R96m481Q395L967j361o660j0991j4457K567J5801L191r935L055
$$ -11322 -9218 -8222 -12703 -4308 -341 -1702 -8362 -19353 -33810 -31243 -15442 -12251 -22186 -19131
7721a9131K8996J0773j2690p271j468j3041J200J1913j3136p618k54Q620K0665
$$ -19131 9865 20638 7948 677 -791 -13832 -12632 -719 -13855 -21473 -21727 -13107 7558
7708G558K248m707q551k88K757j0480J5739J4632k0522p051m105Q726M282l798
$$ 7558 9806 5099 -3452 -3740 -983 -11463 4276 18908 -1614 -8665 -12770 -4044 238 -3560
7694c560r03o998p483M826Q789k028m048R80l042M2M158J3620J2490q473l004
$$ -3560 -4463 -11461 -18944 -14118 -5329 -7357 -11405 -10425 -13467 -13425 -9267 4353 16843 8370 5366
7679E366p825j0897J0820l790j2640J0287Q719M325L184p231n200m95J3664j0839
$$ 5366 -2459 -13356 -2536 -6326 -18966 -8679 40 4365 7549 318 -4882 -5377 8287 -2552
7665b552j3170J295K2391o40j5909l42M445M98j2968N03J7175L754l069j7709
$$ -2552 -15722 -14427 7964 7324 -8585 -8927 -4482 -3984 -16952 -16449 726 4480 1411 -16298
7651a6298K861P231L735p175m39l663l323J5002J3329n253n66P628Q169p720O659
$$ -16298 -13437 -6206 -2471 -9646 -10085 -13748 -17071 -2069 11260 6007 5441 13069 21238 13518 20177
7636B0177k5L71l772l644L857n511J473n677j1558P644j007n290r258j2487m970
$$ 20177 20152 20523 16751 13107 16964 11453 12926 7249 -4309 3335 2328 -2962 -12220 -24707 -29677
7621b9677o157O289P680J80Q44O921K543M105N227M664r868l267j020J1341M840
$$ -29677 -35834 -29545 -21865 -21685 -20841 -13920 -11377 -7272 -2045 2619 -7249 -10516 -11536 -195 4645
7606D645n214M450j292p92J0518j689j4675n314r24J0341L188m482q64Q35N204
$$ 4645 -569 3881 2589 1797 12315 10626 -4049 -9363 -10287 54 3242 -1240 -2104 -1269 3935
7591C935K886Q166o608j2967k455p995L08J271j244J1949L972o485p847R625P986
$$ 3935 6821 14987 8379 -4588 -7043 -15038 -14730 -13459 -14703 -2754 1218 -5267 -13114 -3489 4497
7576D497L955J0187o987j3137j198J0872J656l658L97l274q213N484L46r649p075
$$ 4497 8452 18639 11652 -1485 -2683 8189 9845 6187 6584 3310 -4903 581 927 -8722 -15797
7561a5797l592N728L068L107r183j1625M396J798Q903O991L875j94M299m913q887
$$ -15797 -19389 -13661 -10593 -7486 -16669 -28294 -23898 -22100 -13197 -6206 -2331 -2525 1774 -3139 -12026
7546a2026k263N198J2126O780p920p506o128N857p08O907m776k01M14j892p4L744
$$ -12026 -14289 -9091 3035 9815 1895 -5611 -11739 -5882 -6590 317 -4459 -4660 -4246 -6138 -6212 -2468
7530b468j3344n219r109R726K1552m59m697o441J4679K1921r684j7322J663j370
$$ -2468 -15812 -21031 -30140 -20414 1138 679 -4018 -10459 4220 26141 16457 -865 798 -572
7516e72p972j191Q051O669O58q088p673j1877P079M690q087k390k550J1087J7843
$$ -572 -8544 -9735 -1684 4985 5643 -2445 -10118 -21995 -14916 -10226 -18313 -20703 -23253 -12166 5677
7501E677m080l726j4149r303J0129J1728J1269K958K748l127P812L979N400j8866
$$ 5677 1597 -2129 -16278 -25581 -15452 -3724 7545 10503 13251 10124 17936 21915 27315 8449
7487H449j2683J1744N150l677J1052K591o936q710J4237J1280o022k4961k996
$$ 8449 -4234 7510 12660 8983 20035 22626 15690 6980 21217 32497 26475 1514 -1482
7474a482J8697L130M069j0369q551J310J3015o18j6095n606J460n361J0697K299
$$ -1482 17215 20345 24414 14045 5494 6804 19819 19201 3106 -2500 -1040 -6401 4296 6595
7460F595m901j291L418K100k685o026J2673M478o867j0916K390M999K173j0684
$$ 6595 1694 403 3821 5921 3236 -2790 9883 14361 7494 -3422 -1032 3967 6140 -4544
7446d544o936J4532J0173n343o650j3186k646J0561Q510J3898J856O097o004k1028
$$ -4544 -11480 3052 13225 7882 1232 -11954 -14600 -4039 4471 18369 20225 26322 20318 -710
7432g10n603r228j996k020P093N298o617n92Q146Q569K727p468P067Q946K301
$$ -710 -6313 -15541 -17537 -19557 -12464 -7166 -13783 -14375 -6229 2340 5067 -2401 4666 13612 15913
7417A5913j0649q614j306p004j0931j145J9067K4607l328o501n394L085K346o452
$$ 15913 5264 -3350 -4656 -11660 -22591 -23736 -4669 19938 16610 10109 4715 7800 10146 3694
7403C694o765p730P932J0426J742O128m531O509q135r39K186N464O639o874r645
$$ 3694 -3071 -10801 -2869 7557 9299 15427 10896 17405 9270 8331 10517 15981 22620 15746 6101
7388F101j163j2117M052L448p276j028J6752O026j889R053n56j7865O023K720
$$ 6101 4938 -7179 -3127 321 -6955 -7983 8769 14795 12906 21959 21403 3538 9561 12281
7374A2281o599p71M08L64n002m406n795J3090Q701p493j7936k259j710P27K294
$$ 12281 5682 4911 5319 5683 681 -3725 -9520 3570 12271 4778 -13158 -15417 -17127 -16400 -14106
7359a4106J3393N407l540j5048j8089J2894J1033R984r045j1322p68M036k287
$$ -14106 -713 4694 1154 -13894 -31983 -19089 -8056 1928 -7117 -18439 -19207 -15171 -17458
7346a7458p247J5359Q235M904j994K145k546J1710J0247q57n594j6102n489J507
$$ -17458 -24705 -9346 -1111 3793 1799 3944 1398 13108 23355 22498 16904 802 -4687 -3180
7332c180L727k536j2517o02Q211J2235k539m833Q476l648j3421j1658q122K1142
$$ -3180 547 -1989 -14506 -15108 -6897 5338 2799 -2034 6442 2794 -10627 -22285 -30407 -9265
7318i265R624n611l909J3378o694j0042j785M330J1852q799m818J4578M27p009
$$ -9265 359 -5252 -9161 4217 -2477 -12519 -14304 -9974 1878 -6921 -11739 2839 3266 -3743
7304c743K798L188R696j214p022M812J5100K895J71k0808j8016O187k989Q138
$$ -3743 -945 2243 11939 10725 3703 8515 23615 26510 26681 5873 -12143 -5956 -8945 -807
7290h07j0768n55J0447Q952K74o619j5359N684J4646m780k900j0268j7222n366
$$ -807 -11575 -12130 -1683 7269 7543 924 -14435 -8751 5895 1115 -1785 -12053 -29275 -34641
7276c4641j954J3876J4824M944P240k234j3383N699O81k077p1Q377J970L423q218
$$ -34641 -36595 -22719 -7895 -2951 4289 2055 -11328 -5629 -4948 -7025 -7096 1281 3251 6674 -1544
7261a544p409k281L469K119J06J1862L778o060n89N414Q301j4723j2974J1656
$$ -1544 -8953 -11234 -7765 -5646 -5540 6322 10100 4040 3451 8865 17166 2443 -10531 1125
7247A125L126M604Q279j1532o335K622m79k935k350P855N004j909O283Q590j4848
$$ 1125 4251 8855 17134 5602 -733 1889 1410 -1525 -3875 3980 8984 7075 13358 21948 7100
7232G100k162r958j3752r483R820M247Q752J0629m898l431l309J2489L091J682
$$ 7100 4938 -5020 -18772 -28255 -18435 -14188 -5436 5193 295 -3136 -6445 6044 9135 10817
7218A0817j489j2372j265L041L420l319j1466k332j451j1427L721Q616Q053n083
$$ 10817 9328 -3044 -4309 -1268 2152 -1167 -12633 -14965 -16416 -27843 -24122 -15506 -7453 -12536
7204a2536n298P891p017n247J2321K068p780Q90J4855J5561n763m151O146R920
$$ -12536 -17834 -9943 -16960 -22207 -9886 -7818 -15598 -14708 147 15708 9945 5794 11940 21860
7190B1860j5085j1599j145P704r930J009J103q219J0928k917j6286n496L763J076
$$ 21860 6775 -4824 -5969 1735 -8195 -7186 -6083 -14302 -3374 -6291 -22577 -28073 -24310 -23234
7176b3234k235R489L79q337o541R601K464j0516K254J0722O86R363p37Q76N904
$$ -23234 -25469 -15980 -15601 -23938 -30479 -20878 -18414 -28930 -26676 -15954 -15268 -5905 -6642 -5766 138
7161A38o247j7765l541P601J2001O597J826K563o816N566j3138l337n388j46Q975
$$ 138 -6109 -23874 -27415 -19814 -7813 -1216 610 3173 -3643 1923 -11215 -14552 -19940 -20086 -11111
7146a1111L045p391L151L031Q979r654p338j535j4330K942J025K2216O30O085
$$ -11111 -8066 -15457 -12306 -9275 -296 -9950 -17288 -18823 -33153 -30211 -29186 -6970 -6340 -255
7132b55R462J194j4575j7584J3685M744p776j2443J50K6211M796q73r10q959k597
$$ -255 9207 10401 -4174 -21758 -8073 -3329 -11105 -23548 -23398 2813 7609 6736 5826 -3133 -5730
7117e730O259O957l834m098j6388k864j801O757j1454K41J0708J1981n623o337
$$ -5730 529 7486 3652 -446 -16834 -19698 -21499 -14742 -26196 -25955 -15247 -3266 -8889 -15226
7103a5226M396J868q385Q509j2776l049J7191J2667n178j2824q167J1066j683
$$ -15226 -10830 -8962 -17347 -8838 -21614 -24663 -7472 5195 17 -12807 -20974 -9908 -11591
7090a1591j5901k978R446P922K634J2971m027m981k430n86n25K819J593l756p693
$$ -11591 -27492 -30470 -21024 -13102 -10468 2503 -1524 -6505 -8935 -9521 -10046 -7227 -5634 -9390 -17083
7075a7083L875o608m621J3691R083k095Q89J0962n117M905N482q874k789k765
$$ -17083 -13208 -19816 -24437 -10746 -1663 -3758 -2869 8093 2976 7881 13363 4489 1700 -1065
7061a065j3941o408K0622J761J66r360N633l594O738J4710n975P577L188K970
$$ -1065 -15006 -21414 -792 969 1135 -8225 -2592 -6186 552 15262 9287 16864 20052 23022
7047B3022p436p116M661L005m944n894J558q45J748l249k825N301j195Q4o640
$$ 23022 15586 8470 13131 16136 11192 5298 6856 6011 7759 4510 1685 6986 5791 5875 -765
7032g65m609m96k282n051M480M337J6375k209l417N455L55k1159j7265J6111L602
$$ -765 -5374 -5870 -8152 -13203 -8723 -4386 11989 9780 6363 11818 12173 -8986 -26251 -10140 -6538
7017f538N739R28r429N773N65N64N384N290q179o57K507n321O965K742j198L081
$$ -6538 -799 129 -9300 -3527 -2962 -2398 2986 8276 97 -560 1947 -3374 3591 6333 5135 8216
7001H216l856K451O563l409j3509j3276M579m848Q158N960m884j2001L919O323
$$ 8216 4360 6811 13374 9965 -3544 -16820 -12241 -17089 -8931 -2971 -7855 -19856 -15937 -9614
6987i614L487P645j4893m830J016J3998o121m309J164Q436o893j145O667O57j1457
$$ -9614 -6127 1518 -13375 -18205 -17189 -3191 -9312 -13621 -12457 -4021 -10914 -12059 -5392 -4735 -16192
6972a6192l086J162J3321J2925l861q415j166l717l632j0993J6780Q458n880r854
$$ -16192 -19278 -18116 -4795 8130 4269 -4146 -5312 -9029 -12661 -23654 -6874 1584 -4296 -14150
6958a4150O911M472P994Q147r589r076n169j277R010J9431K158K1l112m036K994
$$ -14150 -7239 -2767 5227 13374 3785 -5291 -10460 -11737 -2727 16704 18862 18883 15771 11735 14729
6943A4729j077j2831k691o206n545M487j2663m095R316J5233J0695n316n352L651
$$ 14729 13652 821 -1870 -8076 -13621 -9134 -21797 -25892 -16576 -1343 9352 4036 -1316 2335
6929B335m213N16L906q790r218J3404O850O8l95J2295n431j1859k059K947L481
$$ 2335 -1878 -1362 2544 -6246 -15464 -2060 4790 4858 4463 16758 11327 -532 -2591 356 3837
6914C837J824j1106j3240J2472J5487n039j1201q139n193Q847M553j428L707r465
$$ 3837 5661 -5445 -18685 -6213 9274 4235 -6966 -15105 -20298 -11451 -6898 -8326 -4619 -14084
6900a4084j3158K755J7877Q207J328j1863m138j0414r16L331Q821K3901J1615
$$ -14084 -27242 -24487 -6610 1597 2925 -8938 -13076 -23490 -24406 -21075 -12254 11647 23262
6887B3262j0828j5417n728l827j825j753J8147N893q191M76p271j000q741n463
$$ 23262 12434 -2983 -8711 -12538 -14363 -16116 2031 7924 -267 209 -7062 -8062 -16803 -22266
6873b2266L131q14Q040J724j47l371k929p895M73L011Q834Q511O03j4875J061
$$ -22266 -19135 -19949 -11909 -10185 -10332 -13703 -16632 -24527 -24054 -21043 -12209 -3698 -3095 -17970 -16909
6858a6909j3105R180J3521q927p606l301P190J736J393n615J6251J2925L125p554
$$ -16909 -30014 -20834 -7313 -16240 -23846 -27147 -19957 -18221 -16828 -22443 -6192 6733 9858 2304
6844B304J139o120l901J06K806n169j1521Q561J2509P326q562l557j5984l583
$$ 2304 3443 -2677 -6578 -6472 -3666 -8835 -20356 -11795 714 8040 -522 -4079 -20063 -23646
6830b3646K94K371O818j0688Q77J8085J1245m968k658j1645q656J0084J0861J829
$$ -23646 -23352 -20981 -14163 -24851 -23974 -5889 5356 388 -2270 -13915 -22571 -12487 -1626 203
6816B03j6273J378M820p812M436Q878j088j584q597K688K839k191K83M397J641
$$ 203 -16070 -14692 -9872 -17684 -13248 -4370 -5458 -7042 -15639 -12951 -10112 -12303 -12020 -7623 -5982
6801e982j4205n831j2383Q81O35P150J2850J3374n915L227k327J96k1O561k272
$$ -5982 -20187 -26018 -38401 -37520 -36885 -29735 -16885 -3511 -9426 -6199 -8526 -8330 -8351 -1790 -4062
6786d062O009K3895K109p649o588k0790j3958L330r673Q329M113K393J0010J1528
$$ -4062 1947 25842 27951 20302 13714 -7076 -21034 -17704 -27377 -19048 -14935 -12542 -2532 8996
6772H996r540n21M667j8427O251L156o62j916N484l770M005p73K599j750K785
$$ 8996 -544 -1065 3602 -14825 -8574 -5418 -6080 -7996 -2512 -6282 -2277 -3050 -451 -2201 584
6757E84k803j3154l79J1919k559p191J47k875p10N211M41L007Q056R93r968j2319
$$ 584 -2219 -15373 -15752 -3833 -6392 -13583 -13436 -16311 -17021 -11810 -11369 -8362 -306 687 -9281 -21600
6741b1600P960K124k278O409O410O908J855k793j1035M448J5886O055J7139k564
$$ -21600 -13640 -11516 -13794 -7385 -975 5933 7788 4995 -6040 -1592 14294 20349 37488 34924
6727C4924o917r325j3636p82N679J0242K244j2039j0765P39M230J4272p329q197
$$ 34924 28007 18682 5046 4264 9943 20185 22429 10390 -375 364 4594 18866 11537 3340
6713C340n794l789q599j0392j207J0284J1225o281p402K284J6801K674j2942j9185
$$ 3340 -2454 -6243 -14842 -25234 -26441 -16157 -4932 -11213 -18615 -16331 470 3144 -9798 -28983
6699b8983L985K3710J7204j2565q732J1700j0586p895j0829L623J0066j268K553
$$ -28983 -24998 -1288 15916 3351 -5381 6319 -4267 -12162 -22991 -19368 -9302 -10570 -8017
6686h017J4952j1688L648J322L155J1995j6026j1721l038j768L016n526r100k817
$$ -8017 6935 -4753 -1105 217 3372 15367 -659 -12380 -15418 -17186 -14170 -19696 -28796 -31613
6672c1613O221J4719K0809q899j5762J1870P340p577J1065M681l355O580M587
$$ -31613 -25392 -10673 10136 1237 -14525 -2655 4685 -2892 8173 12854 9499 16079 20666
6659B0666K487n65J3388l198j3327m03j1383k239n700n398l422r237R188M076
$$ 20666 23153 22588 35976 32778 19451 19048 7665 5426 -274 -5672 -9094 -18331 -9143 -5067
6645e067Q134j850O07M477o236Q430R170j3657q276p73P243J4317j58j2022n703
$$ -5067 3067 1217 1824 6301 65 8495 17665 4008 -4268 -5041 2202 16519 16361 4339 -1364
6630a364o401p918n138m5L5l421Q706O040r361m613l81J683J6435J0478m938n218
$$ -1364 -7765 -15683 -20821 -20866 -20831 -24252 -15546 -9506 -18867 -23480 -23861 -22178 -5743 4735 -203 -5421
6614e421N20J3968K151j6006j7409k765Q831O41J4494P035p037j8882l928Q892
$$ -5421 -4901 9067 11218 -4788 -22197 -24962 -16131 -15490 -996 6039 -998 -19880 -23808 -14916
6600a4916O553M128n020k049Q130P755J0561j0560J716P156j2079j4324p405n728
$$ -14916 -8363 -4235 -9255 -11304 -3174 4581 15142 4582 6298 13454 1375 -12949 -20354 -26082
6586b6082o00j484J771Q308l841k546l063m690L016J3921J4075O000m179L451
$$ -26082 -26682 -28166 -26395 -18087 -21928 -24474 -27537 -32227 -29211 -15290 -1215 4785 606 4057
6572D057K517p092r822r763k383J0629R497O474Q524K151j765j4176n861k751
$$ 4057 6574 -518 -10340 -20103 -22486 -11857 -2360 4114 12638 14789 13024 -1152 -7013 -9764
6558i764l154N493L86J5248J352m513j975j494O972J878m613J89j58o587N355
$$ -9764 -12918 -7425 -7039 8209 9561 5048 3073 1579 8551 10429 5816 6005 5847 -740 4615
6543D615N546J5279j3430k4645l260P453r718N963J6864n31K777M182R012j4690
$$ 4615 10161 25440 12010 -12635 -15895 -8442 -18160 -12197 4667 4136 6913 11095 20107 5417
6529E417j1534L203M084J088k479j168K192k812L265K1460R900r537j7452j5071
$$ 5417 -6117 -2914 1170 2258 -221 -1389 803 -2009 1256 22716 32616 23079 5627 -9444
6515i444J034R074J880r256j5748l930J4980J4910l662M694k711k4689j4524K467
$$ -9444 -8410 664 2544 -6712 -22460 -26390 -11410 3500 -162 4532 1821 -22868 -37392 -34925
6501c4925M476o476J3412J4932j339m695L123P063p170k444J4037O413R786N301
$$ -34925 -30449 -36925 -23513 -8581 -9920 -14615 -11492 -4429 -11599 -14043 -6 6407 16193 21494
6487B1494m373m309r415q067k756m683p143p176k168J4325J1464K689J1149O788
$$ 21494 17121 12812 3397 -4670 -7426 -12109 -19252 -26428 -28596 -14271 -2807 -118 11031 17819
6473A7819q186j4543K37j63j8265j6309N977N764Q360M422M682P811Q999j648
$$ 17819 9633 -4910 -4673 -4836 -23101 -39410 -33433 -27669 -19309 -14887 -10205 -2394 6605 4957
6459D957R155N57J20r729j3057j127J064J4930O969J901o780L656q590p331n618
$$ 4957 14112 14669 14789 5060 -7997 -9124 -8060 6870 13839 15740 8960 12616 4026 -3305 -8923
6444h923K898j256J3622R845j2932p315O830J074J777J520O990N44M848J132K569
$$ -8923 -6025 -7281 6341 16186 3254 -4061 2769 3843 5620 7140 14130 14674 19522 20654 23223
6429B3223P89j6025k558N778n025l825j0760j530Q991k273K917K168m459p217
$$ 23223 24012 7987 5429 11207 6182 2357 -8403 -9933 -942 -3215 -298 1870 -2589 -9806
6415i806N162M770m207l64P605K769l883J143n80k955j770j579l0N283p737n539
$$ -9806 -4644 126 -4081 -4445 3160 5929 2046 3189 2609 -346 -2116 -3695 -3725 1558 -6179 -11718
6399a1718k166q326J5032J9055j1612n034L841J943j2688j1076j997N153K728
$$ -11718 -13884 -22210 -7178 11877 265 -4769 -928 1015 -11673 -22749 -24746 -19593 -16865
6386a6865K603K23O074N785O674O232j1296q333J1965J3834P174m1j0976j0333
$$ -16865 -14262 -14039 -7965 -2180 4494 10726 -570 -8903 3062 16896 24070 24029 13053 2720
6372B720L130J7806n669j5439j3704m221Q868n66J199N077n868j4182K108O561
$$ 2720 5850 23656 17987 2548 -11156 -15377 -6509 -7075 -5876 -799 -6667 -20849 -18741 -12180
6358a2180J0519M494j7690m755M000P415L713r164K0358O965L77j8127N609m65
$$ -12180 -1661 2833 -14857 -19612 -15612 -8197 -4484 -13648 6710 13675 14052 -4075 1534 1069
6344A069k463p700N929K4187n531j9667K977J5754m621m180j7782j0311O259k632
$$ 1069 -1394 -9094 -3165 21022 15491 -4176 -1199 14555 9934 5754 -12028 -22339 -16080 -18712
6330a8712J2109P824K947j771k06P108N390N805P506o809j656j5347k269j2869
$$ -18712 -6603 1221 4168 2397 2191 9299 14689 20494 28000 21191 19535 4188 1919 -10950
6316a0950L28N520j2476k534J3917N038M623Q750k429j4420j4629J6268k644j6515
$$ -10950 -10622 -5102 -17578 -20112 -6195 -1157 3466 12216 9787 -4633 -19262 -2994 -5638 -22153
6302b2153M524Q582J5483r894j6517L117J3866l680k99K673q838O362J9089J2978
$$ -22153 -17629 -9047 6436 -3458 -19975 -16858 -2992 -6672 -6971 -4298 -13136 -6774 12315 25293
6288B5293P40k1533l510K388l178m123J350N131O425k670j0176j0480j461M597
$$ 25293 26033 4500 990 3378 200 -3923 -2573 2558 8983 6313 -3863 -14343 -15804 -11207
6274a1207N565K448J2875j33P830K447p007L447l444k880o92j0804j2106j8429
$$ -11207 -5642 -3194 9681 9548 17378 19825 12818 16265 12821 9941 9249 -1555 -13661 -32090
6260c2090O323J8686Q331K874n117m618P319m178j0697j057j696P70K525J2985
$$ -32090 -25767 -7081 1250 4124 -993 -5611 1708 -2470 -13167 -14224 -15920 -15150 -12625 360
6246C60J1274j5445m626K0540J765j6728J384q660Q34Q268q443j199n649k471
$$ 360 11634 -3811 -8437 12103 13868 -2860 -1476 -10136 -9302 -1034 -9477 -10676 -16325 -18796
6232a8796J31r083J145R071J7273j976K779r50m670p764L8Q442O664K751n927
$$ -18796 -18665 -27748 -26603 -17532 -259 -2235 544 -406 -5076 -12840 -12802 -4360 2304 5055 -872
6217h72J3925M684j6364q864P95J2622P625j4383r818o189q669N496N367K117
$$ -872 13053 17737 1373 -7491 -6696 5926 13551 -832 -10650 -16839 -25508 -20012 -14645 -12528
6203a2528O292N414O760N9P522N997o705j0776n904M828N804o408R643Q280K49
$$ -12528 -6236 -822 5938 5997 13519 19516 12811 2035 -3869 959 6763 355 9998 18278 18527
6188A8527Q959j1071o878Q615l01k4374q117J246L551q433J0192J8077R558J2844
$$ 18527 27486 16415 9537 18152 17851 -6523 -14640 -13394 -9843 -18276 -8084 9993 19551 32395
6174C2395J8911q640j6884r768j967l597j0337j5182O583q746K087Q316p841J3647
$$ 32395 51306 42666 25782 16014 14047 10450 113 -15069 -8486 -17232 -15145 -6829 -14670 -1023
6160a023P753r666m376j1054q53K0310j602j491m19J3689K78j1007j4261p640
$$ -1023 6730 -2936 -7312 -18366 -19219 1091 -511 -2002 -2421 11268 11546 539 -13722 -21362
6146b1362K960k092o445J4597P546J0425J907J0071R796p847N146r183p912q929
$$ -21362 -18402 -20494 -26939 -12342 -4796 5629 7536 17607 27403 19556 24702 15519 7607 -1322
6132a322r93J652N178l083M976j4242r679K923R77j616q844j3179J3146R304n32
$$ -1322 -2315 -663 4515 1432 6408 -7834 -17513 -14590 -13613 -15229 -24073 -37252 -24106 -14802 -15334
6117a5334l507J1479O996J3578k478j2894m399M103J0024n118m675j1190Q408
$$ -15334 -18841 -7362 -366 13212 10734 -2160 -6559 -2456 7568 2450 -2225 -13415 -5007
6104e007L671L983RK035J601j3210o670R31N777l198P451L647J0538p605r47n172
$$ -5007 -1336 2647 2656 4691 6292 -6918 -13588 -12657 -6880 -10078 -2627 1020 11558 3953 3006 -2166
6088b166k2280p902J6339J8125p41R013N634j0746o463K824n34n438J1675j0428
$$ -2166 -24446 -32348 -16009 2116 1375 10388 16022 5276 -1187 1637 1103 -4335 7340 -3088
6074c088j4892l93J6244J3083m538p493m642N548n453J499O785r925l822Q6q631
$$ -3088 -17980 -18373 -2129 10954 6416 -1077 -5719 -171 -5624 -4125 2660 -7265 -11087 -11001 -19632
6059a9632j1830J0289P782N518O685o184m053K082Q288P017J0550r657k622j907
$$ -19632 -31462 -21173 -13391 -7873 -1188 -7372 -11425 -9343 -1055 5962 16512 6855 4233 2326
6045B326r669k118N597l752q066K951J188L29J3440q595j1656M783J0697k005
$$ 2326 -7343 -9461 -3864 -7616 -15682 -12731 -11543 -11214 2226 -6369 -18025 -13242 -2545 -4550
6031d550N896l801j476K0874M615l289k585j4396j6059L716P798J2340q22l870
$$ -4550 1346 -2455 -3931 16943 21558 18269 15684 1288 -14771 -11055 -3257 9083 8261 4391
6017D391J2308J764j136O73n270j6025j3563J8954M866j3529M478P296R592J1910
$$ 4391 16699 18463 17327 18000 12730 -3295 -16858 2096 6962 -6567 -2089 5207 14799 26709
6003B6709j490m573J533J2843q221j8567o739o798n358O985m47j0507L332K2193
$$ 26709 25219 20646 22179 35022 26801 8234 1495 -5303 -10661 -3676 -4123 -14630 -11298 10895
5989A0895k294j2438j4023N717M67j0606k862J1907J2005j0646J2856J3039q996
$$ 10895 8601 -3837 -17860 -12143 -11676 -22282 -25144 -13237 -1232 -11878 978 14017 5021
5976E021o201J2231J899j5599k0531K920L954J152J0797J1069K772l823n85j0938
$$ 5021 -1180 11051 12950 -2649 -23180 -20260 -16306 -15154 -4357 6712 9484 5661 5076 -5862
5962e862k06L507K684Q695J013l387o364l651N920L122p314J021m659o204J5336
$$ -5862 -6068 -2561 123 8818 9831 6444 80 -3571 2349 5471 -1843 -822 -5481 -11685 3651
5947C651J121j5323r443j923M738j713l241R900R722J4327P33j4978l271P125
$$ 3651 4772 -10551 -19994 -21917 -17179 -18892 -22133 -12233 -2511 11816 12549 -2429 -5700 1425
5933A425J8568r850j8318l548M380J4028J4451j0665r98n545J22L632n94o62j0510
$$ 1425 19993 10143 -8175 -11723 -7343 6685 21136 10471 9473 3928 4050 7682 7088 6426 -4084
5918d084k342J2694j531J661j0222o235J2399L457j371l257K223O803R643l296
$$ -4084 -6426 6268 4737 6398 -3824 -10059 2340 5797 4426 1169 3392 10195 19838 16542
5904A6542m400j6485O38O65N435L752K81n184m000j4548m254J3602J0325K6880
$$ 16542 12142 -4343 -3705 -3040 2395 6147 6428 1244 -2756 -17304 -21558 -7956 2369 29249
5890B9249j483j8211j3522P984m658J2636j23j0103p347j108m940O3K47k483K1473
$$ 29249 27766 9555 -3967 4017 -641 11995 11872 1769 -5578 -6686 -11626 -11563 -11316 -13799 7674
5875G674K748K432j266r13J500J0972q517j7902M043J2365L645r60j2561L312
$$ 7674 10422 12854 11588 10675 12175 23147 14630 -3272 771 13136 16781 15821 3260 6572
5861F572q571k937k188k040K699Q286O452p153j2196p409P939P502j4009l377
$$ 6572 -1999 -4936 -7124 -9164 -6465 1821 8273 1120 -11076 -18485 -10546 -3044 -17053 -20430
5847b0430Q47Q816K1082l781j2891L296K3042j4587m862N327J4554M160j8259
$$ -20430 -19583 -10767 10315 6534 -6357 -3061 19981 5394 532 5859 20413 24573 6314
5834F314k280N3j761q689l029M988K6777Q96j0146p855j9077J652J3820R371Q179
$$ 6314 4034 4087 2326 -6363 -9392 -4404 22373 23269 13123 5268 -13809 -12157 1663 11034 19213
5819A9213k027j3489m149K170K0384j887o386l48L110K908P947q350l039j735
$$ 19213 17186 3697 -452 1718 22102 20215 13829 13481 16591 19499 27446 19096 16057 14322
5805A4322R52j3920l685p318r943P697j572q51k348p04O267L944M692p985m297
$$ 14322 15274 1354 -2331 -9649 -19592 -11895 -13467 -14318 -16666 -17370 -11103 -7159 -2467 -10452 -14749
5790a4749r346o76q769J1988J2890R082o448J335J0457l021J251J589R236m565
$$ -14749 -24095 -24771 -33540 -21552 -8662 420 -6028 -4693 5764 2743 3994 5583 14819 10254
5776A0254o031p91K764K981o565J1499P508m771p541l78j4123j6790M656J4332
$$ 10254 4223 3432 6196 9177 2612 14111 21619 16848 9307 8929 -5194 -21984 -17328 -2996
5762b996M528j0763k484Q880J742o327m783J359o356P814Q017p299M527M140N628
$$ -2996 1532 -9231 -11715 -2835 -1093 -7420 -12203 -10844 -17200 -9386 -1369 -8668 -4141 -1 5627
5747E627j7587m434L069R856L269o214P224L787L079j1676j3976R10k819K178
$$ 5627 -11960 -16394 -13325 -3469 -200 -6414 810 4597 7676 -4000 -17976 -17066 -19885 -17707
5733a7707J1404N151J4663L485m690j6525J38Q378k418j1116L881n66p904M76
$$ -17707 -6303 -1152 13511 16996 12306 -4219 -4081 4297 1879 -9237 -5356 -5922 -13826 -13350
5719a3350j886N895R123j146j2611k756K875Q337q716l977R519J1670J3706P191
$$ -13350 -15236 -9341 -218 -1364 -13975 -16731 -13856 -5519 -14235 -18212 -8693 2977 16683 23874
5705B3874l665j4630p486k3667r03J4363Q466o52o313M991j1669K02P440L529
$$ 23874 20209 5579 -1907 -25574 -26477 -12114 -3648 -4300 -10613 -5622 -17291 -17089 -9649 -6120
5691f120j756n016J6892k904p408j756j6931j2711J3370K6036Q440o224L793l045
$$ -6120 -7876 -12892 4000 1096 -6312 -8068 -24999 -37710 -24340 1696 10136 3912 7705 4660
5677D660j6396M028P185p950K028K858j6425p505J1181k786l54M221L859R056
$$ 4660 -11736 -7708 -523 -8473 -6445 -3587 -20012 -27517 -16336 -19122 -19476 -15255 -11396 -2340
5663b340q648j4546k073O972Q385M41o556O805L406p810J7983J7318k0172p395
$$ -2340 -10988 -25534 -27607 -20635 -12250 -11809 -18365 -11560 -8154 -15964 2019 19337 -835 -8230
5649h230j175M103J3358o361q254o73J2986l805j0412J57o326j850o69o377j1002
$$ -8230 -9405 -5302 8056 1695 -6559 -7232 5754 1949 -8463 -8306 -14632 -16482 -17151 -23528 -34530
5634c4530j451J8678J4473M638j362o896j146J1235L83j281P140m404j2492l621
$$ -34530 -35981 -17303 -2830 1808 446 -6450 -7596 3639 4022 2741 9881 5477 -7015 -10636
5620a0636R43p307J944J1675l646k357j2641J0896R558J068p83j0941N245P608
$$ -10636 -9693 -17000 -15056 -3381 -7027 -9384 -22025 -11129 -1571 -503 -1286 -12227 -6982 626
5606F26r657N53J2882Q084J741p369n090p771k354o216j589K0284J5965J369M018
$$ 626 -9031 -8478 4404 12488 14229 6860 1770 -6001 -8355 -14571 -16160 4124 20089 21458 25476
5591B5476j975J956k897n317j092j4314q479j817N554J4407M797l944j3476R073
$$ 25476 23501 25457 22560 17243 16151 1837 -6642 -8459 -2905 11502 16299 12355 -1121 7952
5577G952J1970M35j4520q188Q874Q43o372l008m476l931J035J520J765J1253p926
$$ 7952 19922 20357 5837 -2351 6523 7366 994 -2014 -6490 -10421 -9386 -7866 -6101 5152 -2774
5562b774k2359o75N212Q400J242o401p75r63m29J0712J1754L616m04K349m363
$$ -2774 -25133 -25808 -20596 -12196 -10954 -17355 -18130 -19093 -19522 -8810 2944 6560 6156 8505 4142
5547D142J901P18M756k105r356K3P375j208L879J4459m514j7401l750j0346j1462
$$ 4142 6043 6761 11517 9412 56 79 7454 6246 10125 24584 20070 2669 -1081 -11427 -22889
5532b2889j355J3497N395j498K56J1418J8050K051j5422J183m172j6545o916J2812
$$ -22889 -24244 -10747 -5352 -6850 -6594 4824 22874 24925 9503 10686 6514 -10031 -16947 -4135
5518d135J4443j3691rQ668o149j1918J0108N9o097Q809K176R409n58m440k687
$$ -4135 10308 -3383 -3392 5276 -873 -12791 -2683 -2624 -8721 88 2264 11673 11115 6675 3988
5503C988m06p28r15P240j2631l470O887M243L360j0882J4296Q299j0662r033J801
$$ 3988 3582 2854 1939 9179 -3452 -6922 -35 4208 7568 -3314 10982 19281 8619 -414 1387
5488A387m409l238K831J0773k775n508n582M090j854n733j1537J2762K5106J703
$$ 1387 -3022 -6260 -3429 7344 4569 -939 -6521 -2431 -4285 -10018 -21555 -8793 16313 18016
5474A8016p885m872j5660n558P499P05J5708R838r670j0731l422j0833R785j630
$$ 18016 10131 5259 -10401 -15959 -8460 -7755 7953 17791 8121 -2610 -6032 -16865 -7080 -8710
5460h710j2288L895K5621k799j8786l572J981N223K131q629N850n406p523O812
$$ -8710 -20998 -17103 8518 5719 -13067 -16639 -14658 -9435 -7304 -15933 -10083 -15489 -23012 -16200
5446a6200M545P888K668n929J510o109m306q38j906J1449J7958L089j936N992
$$ -16200 -11655 -3767 -1099 -7028 -5518 -11627 -15933 -16771 -18677 -7228 10730 13819 11883 17875
5432A7875M498n984O016o679j1999q997j2573k77J0913O28n040r828J779l094
$$ 17875 22373 16389 22405 15726 3727 -5270 -17843 -18120 -7207 -6579 -11619 -21447 -19668 -22762
5418b2762j678K836J7357j313m432j3471J0725O412M959O661M118m846q067j3837
$$ -22762 -24440 -21604 -4247 -5560 -9992 -23463 -12738 -6326 -1367 5294 9412 4566 -3501 -17338
5404a7338j3603k051P179K361J3350Q142K840J184J817l38j9421j1498L997n020
$$ -17338 -30941 -32992 -25813 -23452 -10102 -1960 880 2064 3881 3543 -15878 -27376 -23379 -28399
5390b8399J1250q7M97K69K514J3109P033K737l388J0937j197j3038K433Q045O8
$$ -28399 -17149 -17236 -16739 -16470 -13956 -847 6186 8923 5535 16472 15275 2237 4670 12715 12783
5375A2783j0788P448J1901j748l240j1328n898o45l313M290l164O453p53L191
$$ 12783 1995 9443 21344 19596 16356 5028 -870 -1515 -4828 -538 -3702 2751 1998 5189
5361E189J6564p904j3801j504L354J4595M161l631m154Q25p81m654M993o234o570
$$ 5189 21753 13849 48 -1456 1898 16493 20654 17023 12869 13694 12913 8259 13252 7018 448
5346D48L846p739L613l832O515J5168r128j3436O05R249M615m844o857j2605N953
$$ 448 4294 -3445 168 -3664 2851 18019 8891 -4545 -3940 5309 9924 5080 -1777 -14382 -8429
5331h429o61O638p297r618m548P995P677l900n339p146K359R1P368N949j189L539
$$ -8429 -9090 -2452 -9749 -19367 -23915 -15920 -8243 -12143 -17482 -24628 -22269 -22178 -14810 -8861 -10050 -6511
5315f511l074m038J0124L486q359R736N378P340r189j188j949o464J140M972r49
$$ -6511 -9585 -13623 -3499 -13 -8372 1364 6742 14082 4893 3705 1756 -4708 -3568 1404 455
5300D55O773L646j347k577j4893L520J1385L604o707p530l138k4M073o992J005
$$ 455 7228 10874 9527 6950 -7943 -4423 6962 10566 3859 -3671 -6809 -6833 -2760 -9752 -8747
5285h747K878k021j93R478r875m788k423o279M833J4508L032j751q770M574K605
$$ -8747 -5869 -7890 -8083 1395 -8480 -13268 -15691 -21970 -17137 -2629 403 -1348 -10118 -5544 -2939
5270b939N183J945k998m049j2166n484m96N600J7497M057p464j3451p920Q592
$$ -2939 2244 4189 1191 -2858 -15024 -20508 -21004 -15404 2093 6150 -1314 -14765 -22685 -14093
5256a4093N165O520N529p779m222J987n829j475K434M416N061j2240O790P86K0037
$$ -14093 -8928 -2408 3121 -4658 -8880 -6893 -12722 -14197 -11763 -7347 -2286 -14526 -7736 -6950 13087
5241A3087J7172m51k5932j699r89Q075J9561m304r752q326j3815q548K482J7691
$$ 13087 30259 29808 3876 2177 1188 9263 28824 24520 14768 6442 -7373 -15921 -13439 4252
5227D252K894j7240o883J3971O713m553K313J1999l296o204J870j199j1038j0260
$$ 4252 7146 -10094 -16977 -3006 3707 -846 1467 13466 10170 3966 5836 4637 -6401 -16661
5213a6661J0335O292O349p893l605K838j080j3089P730L587J251J6853K718Q68
$$ -16661 -6326 -34 6315 -1578 -5183 -2345 -3425 -16514 -8784 -5197 -3946 12907 15625 16493
5199A6493r638l519n334K898j5679M313J957k3706m226J0786P6M35J417P547J8676
$$ 16493 6855 3336 -1998 900 -14779 -10466 -8509 -32215 -36441 -25655 -25579 -25144 -23727 -16180 2496
5184B496K3028j118j9031r462p496J072j15q143l77J9402J8333R617Q88j3329
$$ 2496 25524 24406 5375 -4087 -11583 -10511 -10626 -18769 -19146 256 18589 28206 29094 15765
5170A5765j0500P85l304m600q921r469O099J0734r548j0166P693J4439Q652r825
$$ 15765 5265 6050 2746 -1854 -10775 -20244 -14145 -3411 -12959 -23125 -15432 -993 7659 -2166
5156b166q563O024O11J993N148j1328R180M621j2572j3225Q51P457Q075Q155P089
$$ -2166 -10729 -4705 -4094 -2101 3047 -8281 899 5520 -7052 -20277 -19426 -11969 -3894 4261 11350
5141A1350l572l986j2736k795J0697J0355Q286J1362k470q317R075L010j2992
$$ 11350 7778 3792 -8944 -11739 -1042 9313 17599 28961 26491 18174 27249 30259 17267
5128A7267k3598l176Q404J48l022N456J3599j0842j7467k354K1566O941j478m160
$$ 17267 -6331 -9507 -1103 -955 -3977 1479 15078 4236 -13231 -15585 5981 12922 11444 7284
5114G284L154N223r24j6035j3991J0697M426l854J4799M977j3763J319j876o661
$$ 7284 10438 15661 14737 -1298 -15289 -4592 -166 -4020 10779 15756 1993 3312 1436 -5225
5100e225j588L1M11J0106p347p396P598K482R989j144j1388N394K210n396J66
$$ -5225 -6813 -6782 -6371 3735 -3612 -11008 -3410 -928 9061 7917 -3471 1923 4133 -1263 -1097
5085a097J563r894K218O177Q014j1995r092j0491N890M336K062J429j262L121
$$ -1097 466 -9428 -7210 -1033 6981 -5014 -14106 -24597 -18707 -14371 -12309 -10880 -12142 -9021
5071i021J1694M782j12J2104L92k408j3466j4490k284N028j666L888O246O174
$$ -9021 2673 7455 7343 19447 19839 17431 3965 -10525 -12809 -7781 -9447 -5559 687 6861
5057F861M313r392j057m53K552j2828l670R771L947P881M923K411L513J683j1123
$$ 6861 11174 1782 725 272 2824 -10004 -13674 -3903 44 7925 12848 15259 18772 20455 9332
5042I332j7006p729M993m625J1777K786L573n237n294J2409O91K695M860Q097
$$ 9332 -7674 -15403 -10410 -15035 -3258 -472 3101 -2136 -7430 4979 5670 8365 13225 21322
5028B1322j775Q459q23q357q032p76j5617p415P945J83K258J3806r223k543l806
$$ 21322 19547 28006 27183 18826 10794 10018 -5599 -13014 -5069 -4886 -2628 11178 1955 -588 -4394
5013d394J316R022m145k19J947p484Q361M284j6785q520m315P704Q004O872L082
$$ -4394 -3078 5944 1799 1580 3527 -3957 4404 8688 -8097 -16617 -20932 -13228 -5224 1648 4730
4998D730M830P50j617O062l351p119q490j1442q792N6J240l841J2374M170m582
$$ 4730 9560 10310 8693 14755 11404 4285 -4205 -15647 -24439 -24383 -23143 -26984 -14610 -10440 -15022
4983a5022O529l952k281O623L28N36J8R889L859k939l976k564R889K733k514P00
$$ -15022 -8493 -12445 -14726 -8103 -7775 -7239 -7221 2668 6527 3588 -388 -2952 6937 9670 7156 7856
4967G856Q127o520j0904P44N286J692o482q174k863P96J002j6201J0884J0063
$$ 7856 15983 9463 -1441 -697 4589 6281 -201 -8375 -11238 -10442 -9440 -25641 -14757 -4694
4953d694M026O972J53m097K188N738m492l355Q661N049Q140j1101j3843j2861
$$ -4694 -668 6304 6457 2360 4548 10286 5794 2439 11100 16149 24289 13188 -655 -13516
4939a3516n652J340Q479J132l351j4293O333M784J2411J4162K247M547l266j0520
$$ -13516 -19168 -17828 -9349 -8217 -11568 -25861 -19528 -14744 -2333 11829 14076 18623 15357 4837
4925D837J0392M368m943n076j1095K024J4130L219j1399L152k843q470j1463n895
$$ 4837 15229 19597 14654 9578 -1517 507 14637 17856 6457 9609 6766 -1704 -13167 -19062
4911a9062N269P063J081p510m409J5302J1472J0509l978j4492j4488l020J437
$$ -19062 -13793 -6730 -5649 -13159 -17568 -2266 9206 19715 15737 1245 -13243 -16263 -14826
4898a4826k672n755j574J0220J1838r187q212n8J3070J0406O765Q621q118p149
$$ -14826 -17498 -23253 -24827 -14607 -2769 -11956 -20168 -20226 -7156 3250 10015 18636 10518 3369
4884C369k00J6809K331k1491j8498l433N832L914O999M201R200j461j5840O284
$$ 3369 3169 19978 22309 818 -17680 -21113 -15281 -11367 -4368 -167 9033 7572 -8268 -1984
4870a984N508J1274J406j9954j6392r409p55q57J8647J8534M009J852q737j5280
$$ -1984 3524 14798 16204 -3750 -20142 -29551 -30306 -31163 -12516 6018 10027 11879 3142 -12138
4856a2138o08P798p877n571J7065J4536J521O085q099j4174l27J2054j1067j9210
$$ -12138 -12746 -4948 -12825 -18396 -1331 13205 14726 20811 12712 -1462 -1789 10265 -802 -20012
4842b0012m805M896Q00K1302o734n619J1653q668n174k297Q664J5551o306N168
$$ -20012 -24817 -19921 -19121 2181 -4553 -10172 1481 -7187 -12361 -14658 -5994 9557 3251 8419
4828H419N144o828m85Q520O192K599r324j1433p807j4190J558Q351Q598k762r787
$$ 8419 13563 6735 6250 14770 20962 23561 14237 2804 -5003 -19193 -17635 -9284 -686 -3448 -13235
4813a3235j3834Q226R381K813m872k136j0341R994J2638p904m490j130k483R412
$$ -13235 -27069 -18843 -9462 -6649 -11521 -13657 -23998 -14004 -1366 -9270 -13760 -14890 -17373 -7961
4799g961l736q749K990P363L655J7318J4043J975M819m725n276j2689j5069O831
$$ -7961 -11697 -20446 -17456 -10093 -6438 10880 24923 26898 31717 26992 21716 9027 -6042 789
4785G89J1809l346m733M94O667n596K651J2386q343l524j781m171P097k912j8046
$$ 789 12598 9252 4519 5013 11680 6084 8735 21121 12778 9254 7473 3302 10399 7487 -10559
4770a0559n740Q607N273J60l74o862J031N316q207k287k832K817k338J943K814
$$ -10559 -16299 -7692 -2419 -2259 -2633 -9495 -8464 -3148 -11355 -13642 -16474 -13657 -15995 -14052 -11238
4755a1238j0786j2671L948J5645l15R500J9468O150r334L215j1979j9J1516k536
$$ -11238 -22024 -34695 -30747 -15102 -15417 -5917 13551 19701 10367 13582 1603 1584 13100 10564
4741A0564n426j3384O398l188M436J1125m86j2277L257p62r961m945M600J2826
$$ 10564 5138 -8246 -1848 -5036 -600 10525 10039 -2238 1019 257 -9704 -14649 -10049 2777
4727B777J2786K052j5401j397N22k242o622l762O659Q71r559M96K442P432J680
$$ 2777 15563 17615 2214 817 1339 -903 -7525 -11287 -4628 -3757 -13316 -12820 -10378 -2946 -1266
4712a266j0277p022l43Q784N408q27k322L944J643l885k63k64J4684Q689O0m413
$$ -1266 -11543 -18565 -18908 -10124 -4716 -5543 -7865 -3921 -2278 -6163 -6426 -6690 7994 16683 16743 12330
4696A2330O86k025J0932r64p384r796N428q7j334j5979j2378l604M003n81j898
$$ 12330 13016 10991 21923 20959 13575 3779 9207 9120 7786 -8193 -20571 -24175 -20172 -20753 -22651
4681b2651m437P718J2651P468P253L471j125j7424Q33J6363J0747L060j3362j6445
$$ -22651 -27088 -19370 -6719 749 8002 11473 10348 -7076 -6243 10120 20867 23927 10565 -5880
4667e880k1733k165K950R85J3148Q547p016l318r030p366J0197J1618R193J560
$$ -5880 -27613 -29778 -26828 -25843 -12695 -4148 -11164 -14482 -23512 -30878 -20681 -9063 130 1690
4653A690k98j0555M263J0898q681p10J1280k649r271L528L298o967q88p452J3664
$$ 1690 1392 -9163 -4900 5998 -2683 -3393 7887 5238 -4033 -505 2793 -4174 -5062 -12514 1150
4638A150N819N34m713q18M969N097M390q737p051l124l657K341p651J2235K0659
$$ 1150 6969 7503 2790 1972 6941 12038 16428 7691 640 -2484 -6141 -3800 -11451 784 21443
4623B1443P939j4914k0177p240j630O866Q769k844q611k376J3685J8034n29M333
$$ 21443 29382 14468 -5709 -12949 -14579 -7713 1056 -1788 -10399 -12775 910 18944 18415 22748
4609B2748J2511k338k2039n425l238p808q365q27J0589J0693j5246k620N861J1485
$$ 22748 35259 32921 10882 5457 2219 -5589 -13954 -14781 -4192 6501 -8745 -11365 -5504 5981
4595E981J3483n480K103R511k784j5147p461M81M81j1747l503J841J0097m949
$$ 5981 19464 13984 16087 25598 22814 7667 206 687 1168 -10579 -14082 -12241 -2144 -7093
4581g093J120p299p060P978J330J1277J5314j3943l972L142k2850r985J3284K232
$$ -7093 -5973 -13272 -20332 -12354 -11024 253 15567 1624 -2348 794 -22056 -32041 -18757 -16525
4567a6525J2534M447P221N935J268j0125p396K63J418J5158j0730j3238k04K391
$$ -16525 -3991 456 7677 13612 14880 4755 -2641 -2378 -960 14198 3468 -9770 -9974 -7583
4553g583q591O186k971L608R81j4973K313R594m664P516J0670O148k289j9974
$$ -7583 -16174 -9988 -12959 -9351 -8370 -23343 -21030 -11436 -16100 -8584 2086 8234 5945 -14029
4539a4029L139R207n803P6J2764R548n437k71J0808P457M418j7640j1813j4680
$$ -14029 -10890 -1683 -7486 -7410 5354 14902 9465 9194 20002 27459 31877 14237 2424 -12256
4525a2256J6059J0589o579r192q066P360J3327R706J492j63j6103n715p633J3261
$$ -12256 3803 14392 7813 -1379 -9445 -2085 11242 20948 22440 22277 6174 459 -7174 6087
4511F087l693m737J678L266K985m948n232L646j131K45Q675J0409K17m322m994
$$ 6087 2394 -2343 -665 2601 5586 638 -4594 -948 -2079 -1834 6841 17250 17467 13145 8151
4496H151r097M507J6742m385J38j3957j9368k730R667k178L206P494R600P156
$$ 8151 -946 3561 20303 15918 16056 2099 -17269 -19999 -10332 -12510 -9304 -1810 7790 14946
4482A4946N86Q88n71p664j0513k948m454p543k070N609q567N672J7873J9550j026
$$ 14946 15532 16420 15849 8185 -2328 -5276 -9730 -17273 -19343 -13734 -22301 -16629 1244 20794 19768
4467A9768L575J2038q226j1877k652k519m987L006K741J1339N59r071r713k527
$$ 19768 23343 35381 27155 15278 12626 10107 5120 8126 10867 22206 22765 13694 3981 1454
4453A454k377n586l326K81l7J1355K2695j8962r476K506R636l570k811O813Q448
$$ 1454 -923 -6509 -9835 -9554 -9591 1764 24459 5497 -3979 -1473 8163 4593 1782 8595 17043
4438A7043l44j8161m638K548k154Q631M913m953p298o688J853J7247M152k112
$$ 17043 16699 -1462 -6100 -3552 -5706 2925 7838 2885 -4413 -11101 -9248 7999 12151 10039
4424A0039k793q740p488K244J396p009R927J1443j3126K883N344p46l074J059
$$ 10039 7246 -1494 -8982 -6738 -5342 -12351 -2424 9019 -4107 -1224 4120 3374 300 1359
4410A359j9956O333M907j3065m750Q709j0029M988J3956j87O152j7147j4320J3276
$$ 1359 -18597 -12264 -7357 -20422 -25172 -16463 -26492 -21504 -7548 -7735 -1583 -18730 -33050 -19774
4396a9774J1431m467j4273L926Q499k940O280J1063o002q552O609N633R051j619
$$ -19774 -8343 -12810 -27083 -23157 -14658 -17598 -11318 -255 -6257 -14809 -8200 -2567 6484 4865
4382D865j3761m212k671J0532O85K134N967L20j104m598r517K099k029r32Q066
$$ 4865 -8896 -13108 -15779 -5247 -4562 -2428 3539 3859 2755 -1843 -11360 -9261 -11290 -12222 -4156
4367d156r159J673J0519Q107K30r881o605n548N333L989J2358Q638k514p756m391
$$ -4156 -13315 -11642 -1123 6984 7214 -2667 -9272 -14820 -9487 -5498 6860 15498 12984 5228 837
4352H37R668Q195r818o082K073J2452m127J04k89r06p923m42P631m651j0579o984
$$ 837 10505 18700 8882 2800 4873 17325 13198 13302 13013 12107 4184 3742 11373 6722 -3857 -10841
4336a0841k245J456K836R99o790k826m196N741L11o401L227M566Q595j37j0190
$$ -10841 -13086 -11630 -8794 -7795 -14585 -17411 -21607 -15866 -15555 -21956 -18729 -14163 -5568 -5705 -15895
4321a5895J085J0255M590K25N602n708m248m934J0103n91j7685L95J2209J3027
$$ -15895 -14810 -4555 35 260 5862 154 -4094 -9028 1075 484 -17201 -16806 -4597 8430
4307H430j7392r845J2901K4538J1567j3110r68K926J1069k085L38j485l15N36
$$ 8430 -8962 -18807 -5906 18632 30199 17089 16121 19047 30116 28031 28369 26884 26569 27105
4293B7105j8332j5767N568r019J0578K3j4321j0367R421J0777J5164n386j530
$$ 27105 8773 -6994 -1426 -10445 133 156 -14165 -24532 -15111 -4334 10830 5444 3914
4280C914k707q587N426j1174M19Q28R554J3404j513j984j9328j4619M275N963
$$ 3914 1207 -7380 -1954 -13128 -12709 -11881 -2327 11077 9564 7580 -11748 -26367 -22092 -16129
4266a6129R69O457p220p929j516J6499N145j708K773M336j511j590m684Q732j035
$$ -16129 -15160 -8703 -15923 -23852 -25368 -8869 -3724 -5432 -2659 1677 166 -1424 -6108 2624 1589
4251A589K82k270j3473p332N420o202j3211q436O805Q966Q400P200O43o451M2
$$ 1589 1871 -399 -13872 -21204 -15784 -21986 -35197 -43633 -36828 -27862 -19462 -12262 -11619 -18070 -18028
4236a8028N410k95j930N793J4753n514j392p43l77J4145m468j930q791q101O497
$$ -18028 -12618 -12913 -14843 -9050 5703 189 -1203 -1946 -2323 11822 7354 5424 -3367 -11468 -4971
4221d971M793K822o405j609J0726Q722j276q731l731J0098n933n383j24j7277
$$ -4971 -178 2644 -3761 -5370 5356 14078 12802 4071 340 10438 4505 -878 -1002 -18279
4207a8279k448o889J0446J3285Q783K410Q89j1722Q641k472o209m21m467J0750
$$ -18279 -20727 -27616 -17170 -3885 4898 7308 8197 -3525 5116 2644 -3565 -3986 -8453 2297
4193B297K2673m562j128O072L561O429j1682k8733r831J0993j839P138K637P399
$$ 2297 24970 20408 19280 25352 28913 35342 23660 -5073 -14904 -3911 -5750 1388 4025 11424
4179A1424N982p373j3194n742Q779O651p23o471n522J2111j2537q571k12N481
$$ 11424 17406 10033 -3161 -8903 -124 6527 5804 -667 -6189 5922 -6615 -15186 -15398 -9917
4165i917m809K998N33M265M81Q129o081o176J0578J3482q328p328q733K759o37
$$ -9917 -14726 -11728 -11195 -6930 -6449 1680 -4401 -10577 1 13483 5155 -2173 -10906 -8147 -8784
4150h784M720Q082L752J4236L045j2135m388M623j40l66L89j7525j1397R081Q045
$$ -8784 -4064 4018 7770 22006 25051 12916 8528 13151 13011 12645 13034 -4491 -15888 -6807 1238
4135A238N668K131m644k1424N784o448J1021K3158P964j7786k2393j1463L063
$$ 1238 6906 9037 4393 -17031 -11247 -17695 -6674 16484 24448 6662 -15731 -27194 -24131
4122b4131J5678M635p172J572Q108k086j0183o42J5448m931o902J1329P823O11
$$ -24131 -8453 -3818 -10990 -9418 -1310 -3396 -13579 -14221 1227 -3704 -10606 723 8546 9157
4108I157o747l270j9P538Q860K866L6k190q216j2346L196K429k605o26K149j0737
$$ 9157 2410 -860 -879 6659 15519 18385 18421 16231 8015 -4331 -1135 1294 -1311 -1937 212 -10525
4092a0525r696P444M522p305O373R413M505l125j933J0727q114j986L087M875
$$ -10525 -20221 -12777 -8255 -15560 -9187 226 4731 1606 -327 10400 2286 300 3387 8262
4078H262j3753n818M344j896j9792M419O865N961O780L588j899n261Q149p186
$$ 8262 -5491 -11309 -6965 -8861 -28653 -24234 -17369 -11408 -4628 -1040 -2939 -8200 -51 -7237
4064g237K496R517J1495L494j4644P348L563o959Q193Q117j2130j0149o745j1004
$$ -7237 -4741 4776 16271 19765 5121 12469 16032 9073 17266 25383 13253 3104 -3641 -14645
4050a4645K169J1634M395j0190m44J7153N31m666p5l470L475j800k897m801o211
$$ -14645 -12476 -842 3553 -6637 -7081 10072 10603 5937 5862 2392 5867 4067 1170 -3631 -9842
4035i842M110K0182J0773L7L668N379Q98q527n601o599J0616L93j890N672r272
$$ -9842 -5732 14450 25223 25260 28928 34307 35205 26678 21077 14478 25094 25487 23597 29269 19997
4020A9997k264j5789l091M613j2593n96R564K919N876k857p517p731k624J0874
$$ 19997 17733 1944 -1147 3466 -9127 -9723 -159 2760 8636 5779 -1738 -9469 -12093 -1219
4006a219N430q583j3070M00k148L112J0737O844j1324k853L453N829o65j0872
$$ -1219 4211 -4372 -17442 -17042 -19190 -16078 -5341 1503 -9821 -12674 -9221 -3392 -4057 -14929
3992a4929N432J6329l386o041R825j173n969j3183J4532O529N715r180l147k633
$$ -14929 -9497 6832 3446 -2595 7230 6057 88 -13095 1437 7966 13681 4501 1354 -1279
3978a279n314Q265P233p020j5374J0605k0775k343J0286Q120L102m707N03O291
$$ -1279 -6593 1672 8905 1885 -13489 -2884 -23659 -26002 -15716 -7596 -4494 -9201 -8698 -2407
3964b407o655J9222M234j727n250l404j2475J239J7958P009L260N219j5813j7626
$$ -2407 -9062 10160 14394 12667 7417 4013 -8462 -7223 10735 17744 21004 26223 10410 -7216
3950g216N50n877k380Q26P958R628L581j1176Q266m27k877n962p841j433R252
$$ -7216 -6666 -12543 -14923 -14097 -6139 3489 7070 -4106 4160 3733 856 -5106 -12947 -14380 -5128
3935e128J0949l879p461l184K588J2629Q239k205j4550l093J3227k90R005j2222
$$ -5128 5821 1942 -5519 -8703 -6115 6514 14753 12548 -2002 -5095 8132 7842 16847 4625
3921D625j1157r090j8386K791J4133J4183p494j0353j0641j209J2147M790K324
$$ 4625 -6532 -15622 -34008 -31217 -17084 -2901 -10395 -20748 -31389 -32598 -20451 -15661 -13337
3908a3337L034J6350R28j8122M850K006Q968N801k046M650K382K885j2783j1145
$$ -13337 -10303 6047 6975 -11147 -6297 -4291 4677 10478 8432 13082 15464 18349 5566 -5579
3894e579o083q066J2676K2828K564n790l315j3179n057n411L977N555L333R070
$$ -5579 -11662 -19728 -7052 15776 18340 12550 9235 -3944 -9001 -14412 -10435 -4880 -1547 7523
3880G523N363j7234Q123N668M013M38q00L870L882j7644r048j2552p037J3900
$$ 7523 12886 -4348 3775 9443 13456 13894 13094 16964 20846 3202 -5846 -18398 -25435 -11535
3866a1535R292M174J4325j3547q282J200J3685o529l0536O64R861J6451m471J345
$$ -11535 -2243 1931 16256 2709 -5573 -4373 9312 2783 -27753 -27089 -17228 -777 -5248 -3903
3852c903R346Q97j0035O994J4895J4542J914n016p465K747M60J403q786j8875
$$ -3903 5443 6340 -3695 3299 18194 32736 34650 29634 22169 24916 25376 26779 17993 -882
3838h82j0918P966P698j973L584l7J3892m137j6042q95n125K929N152l17O085
$$ -882 -11800 -3834 3864 1891 5475 5438 19330 15193 -849 -1744 -6869 -3940 1212 895 6980
$$ [...]
##END NTUPLES=NMR SPECTRUM
##END=
