##TITLE=Analysis number 321594
Compound Code cc 21122
Book Reference 483/46/4
Project Code adrs
Chemist Name mattw
##JCAMPDX= 6.0         $$ Bruker NMR JCAMP-DX V2.0
##DATA TYPE= NMR SPECTRUM
##DATA CLASS= NTUPLES
##ORIGIN= Bruker BioSpin GmbH
##OWNER= nmr
$$ XWIN-NMR		Version 3.5
$$ Thu Aug 17 12:18:00 2006 GMT Daylight Time (UT+1h)  MAYBRIDGE\nmr@NMR_250MHZ
##.OBSERVE FREQUENCY= 250.131544655141
##.OBSERVE NUCLEUS= ^1H
##.ACQUISITION MODE= SIMULTANEOUS (DQD)
##.ACQUISITION SCHEME= undefined
##.AVERAGES= 16
##.DIGITISER RES= 18
##SPECTROMETER/DATA SYSTEM= dpx250
##.PULSE SEQUENCE= zg30
##.SOLVENT NAME= CDCl3
##.SHIFT REFERENCE= (INTERNAL, CDCl3, 0, 16.522)
##AUDIT TRAIL= $$ (NUMBER, WHEN, WHO, WHERE, WHAT)
$$ ##TITLE= Audit trail, XWIN-NMR		Version 3.5
$$ ##JCAMPDX= 5.01
$$ ##ORIGIN= Bruker BioSpin GmbH
$$ ##OWNER= nmr
$$ C:\u/data/dgb/nmr/ADRS/1110/pdata/1/auditp.txt
$$ ##AUDIT TRAIL=  $$ (NUMBER, WHEN, WHO, WHERE, WHAT)
(   1,<2006-08-17 12:17:40.66 +100>,<MAYBRIDGE\nmr>,<NMR_250MHZ>,
      <created by zg, POWCHK disabled, PULCHK disabled
       configuration hash MD5:
       E2 DF 36 D8 04 B2 41 60 5A D7 A3 38 5A 4B D0 FE
       data hash MD5: 64K
       7C 30 A3 A6 BB 3C 14 F3 78 BB 8D A9 7A 0B AF 37>)
(   2,<2006-08-17 12:17:51.96 +100>,<MAYBRIDGE\nmr>,<NMR_250MHZ>,
      <Start of raw data processing
       ef LB = 0.3 FT_mod = 6 PKNL = 1 SI = 32K 
       data hash MD5: 32K
       F1 42 DC 64 6E 5A E3 C9 92 A5 2E 34 0F 28 6F 59>)
(   3,<2006-08-17 12:17:53.63 +100>,<MAYBRIDGE\nmr>,<NMR_250MHZ>,
      <apk 
       data hash MD5: 32K
       6D 42 AF 4D F0 D9 DA EC 0D A8 CE D6 3F 73 02 E9>)
(   4,<2006-08-17 12:17:54.43 +100>,<MAYBRIDGE\nmr>,<NMR_250MHZ>,
      <abs ABSG = 5 
       data hash MD5: 32K
       D7 D2 92 F6 45 49 37 AF 3D 54 E3 0B AF 1D 88 4C>)
$$ ##END=
$$ 
$$ hash MD5
$$ AC E3 4A 28 83 BF 24 D6 43 30 C3 A9 5E 0C F8 CD
##$RELAX= 
##$RELAX= 
##$RELAX= 
##$RELAX= 
##$RELAX= 
##$RELAX= 
##$RELAX= 
$$ Bruker specific parameters
$$ --------------------------
##$DU= <C:\u>
##$EXPNO= 1110
##$NAME= <ADRS>
##$PROCNO= 1
##$TYPE= <nmr>
##$USER= <dgb>
##$AMP= (0..31)
100 100 100 100 100 100 100 100 100 100 100 100 100 100 100 100 100 100 
100 100 100 100 100 100 100 100 100 100 100 100 100 100 
##$AQSEQ= 0
##$AQ_mod= 3
##$AUNM= <au_zg>
##$AUTOPOS= <27 >
##$BF1= 250.13
##$BF2= 250.13
##$BF3= 250.13
##$BF4= 250.13
##$BF5= 500.13
##$BF6= 500.13
##$BF7= 500.13
##$BF8= 500.13
##$BYTORDA= 1
##$CFDGTYP= 0
##$CFRGTYP= 5
##$CHEMSTR= <none>
##$CNST= (0..31)
1 1 145 1 1 1 1 1 1 1 1 1 1 1 1 1 1 1 1 1 1 1 1 1 1 1 1 1 1 1 1 1 
##$CPDPRG= <>
##$CPDPRG1= <>
##$CPDPRG2= <>
##$CPDPRG3= <>
##$CPDPRG4= <mlev>
##$CPDPRG5= <mlev>
##$CPDPRG6= <mlev>
##$CPDPRG7= <mlev>
##$CPDPRG8= <mlev>
##$CPDPRGB= <>
##$CPDPRGT= <>
##$D= (0..31)
0 1 0 0 0 0 0 0 0 0.06 0 0 0 0 0 0 0.0002 0 0 0 0 0 0 0 0 0 0 0 0 0 0 
0 
##$DATE= 1155813459
##$DBL= (0..7)
120 120 120 120 120 120 120 120 
##$DBP= (0..7)
150 150 150 150 150 150 150 150 
##$DBP07= 0
##$DBPNAM0= <>
##$DBPNAM1= <>
$$ [...]
##$SUBNAM7= <"">
##$SUBNAM8= <"">
##$SUBNAM9= <"">
##$SW= 20.6930455092707
##$SWIBOX= (0..15)
0 0 3 0 0 0 0 0 0 0 0 0 0 0 0 0 
##$SW_h= 5175.983436853
##$TD= 65536
##$TD0= 1
##$TE= 296.16
##$TE2= 300
##$TE3= 300
##$TEG= 300
##$TL= (0..7)
0 120 120 120 120 120 120 120 
##$TP= (0..7)
150 150 150 150 150 150 150 150 
##$TP07= 0
##$TPNAME0= <>
##$TPNAME1= <>
##$TPNAME2= <>
##$TPNAME3= <>
##$TPNAME4= <>
##$TPNAME5= <>
##$TPNAME6= <>
##$TPNAME7= <>
##$TPOAL= (0..7)
0.5 0.5 0.5 0.5 0.5 0.5 0.5 0.5 
##$TPOFFS= (0..7)
0 0 0 0 0 0 0 0 
##$TUNHIN= 0
##$TUNHOUT= 0
##$TUNXOUT= 0
##$USERA1= <user>
##$USERA2= <user>
##$USERA3= <user>
##$USERA4= <user>
##$USERA5= <user>
##$V9= 5
##$VALIST= <valist>
##$VCLIST= <CCCCCCCCCCCCCCC>
##$VD= 0
##$VDLIST= <DDDDDDDDDDDDDDD>
##$VPLIST= <PPPPPPPPPPPPPPP>
##$VTLIST= <TTTTTTTTTTTTTTT>
##$WBST= 1024
##$WBSW= 4
##$XGAIN= (0..3)
0 0 0 0 
##$XL= 0
##$YL= 0
##$YMAX_a= 468129
##$YMIN_a= -569435
##$ZGOPTNS= <>
##$ZL1= 120
##$ZL2= 120
##$ZL3= 120
##$ZL4= 120
##$ABSF1= 16.522
##$ABSF2= -4.171173
##$ABSG= 5
##$ABSL= 3
##$ALPHA= 0
##$AQORDER= 0
##$ASSFAC= 0
##$ASSFACI= 0
##$ASSFACX= 0
##$ASSWID= 0
##$AUNMP= <proc_1d>
##$AZFE= 0.1
##$AZFW= 0.1
##$BCFW= 0
##$BC_mod= 0
##$BYTORDP= 0
##$COROFFS= 0
##$CY= 12.5
##$DATMOD= 1
##$DC= 0
##$DFILT= <>
##$DTYPP= 0
##$F1P= 14.0000005364418
##$F2P= -0.99999901652339
##$FCOR= 0.5
##$FTSIZE= 32768
##$FT_mod= 6
##$GAMMA= 0
##$GB= 0
##$INTBC= 1
##$INTSCL= 1
##$ISEN= 128
##$LB= 0.3
##$LEV0= 0
##$LPBIN= 0
##$MAXI= 10000
##$MC2= 0
##$MEAN= 0
##$ME_mod= 0
##$MI= 0
##$NCOEF= 0
##$NC_proc= -3
##$NLEV= 6
##$NOISF1= 0
##$NOISF2= 0
##$NSP= 0
##$NTH_PI= 0
##$NZP= 0
##$OFFSET= 16.522
##$PC= 1
##$PHC0= 151.921
##$PHC1= 6.899949
##$PH_mod= 1
##$PKNL= yes
##$PPARMOD= 0
##$PSCAL= 4
##$PSIGN= 0
##$REVERSE= no
##$SF= 250.13
##$SI= 32768
##$SIGF1= 0
##$SIGF2= 0
##$SINO= 400
##$SIOLD= 32768
##$SREGLST= <1H.CDCl3>
##$SSB= 0
##$STSI= 32768
##$STSR= 0
##$SW_p= 5175.98343685301
##$SYMM= 0
##$S_DEV= 0
##$TDeff= 65536
##$TDoff= 0
##$TI= <Analysis number 999999
Compound Code 99
Book Reference 9
Project Code 9>
##$TILT= no
##$TM1= 0
##$TM2= 0
##$TOPLEV= 0
##$USERP1= <user>
##$USERP2= <user>
##$USERP3= <user>
##$USERP4= <user>
##$USERP5= <user>
##$WDW= 1
##$XDIM= 32768
##$YMAX_p= 366719887
##$YMIN_p= -154637
$$ End of Bruker specific parameters
$$ ---------------------------------
##NTUPLES= NMR SPECTRUM
##VAR_NAME=  FREQUENCY,     SPECTRUM/REAL,   SPECTRUM/IMAG
##SYMBOL=    X,             R,               I
##VAR_TYPE=  INDEPENDENT,   DEPENDENT,       DEPENDENT
##VAR_FORM=  AFFN,          ASDF,            ASDF
##VAR_DIM=   32768,         32768,           32768
##UNITS=     HZ,            ARBITRARY UNITS, ARBITRARY UNITS
##FACTOR=    0.157963299565203, 1,           1
##FIRST=     4132.6476996994, 0,             0
##LAST=      -1043.33573715361, 0,           0
##MIN=       -1043.33573715361, -154637,     0
##MAX=       4132.6476996994, 366719887,     0
$$ Real data points
##PAGE= N=1
##DATA TABLE= (X++(R..R)), XYDATA
$$ [...]
18689C67429J3398L35l6348l8888k8330m2131m0771K504J0459J0487m312J6977
18677B30809p031k3378O98k2075M31L5571J2403J8861J4486J0158r589K99K3836
18664B85479k1416j2847J3718j6999J1992J996K9909J3822P931l2399m9383j6221
18652B15582P664m151o947j9195J3280M8085K6221j8186M937k1564m1297J6762
18640B21191J4085M76m4455n2804M315J1507J4907N3595K3194K7414K6539Q720
18628C08684R645q711R152M6633j7901p4713K5326M5569K694M2231R3184Q0385
18616E62178N2042m2114p2095m5351m3357M1880M8225K786o511N346K8251J4148
18604E45428j7716j6886j3888l8048L7418J6928l6605K6960k3645K6369L3033
$$ y = [367429, 380827, 381162, 344814, 305926, 277596, 235465, 194694, 197198, 207657, 218144, 213832, 230809, 223778, 200400, 201098, 179023, 179454, 215025, 227428, 246289, 260775, 270933, 261344, 261643, 285479, 264063, 251216, 264934, 247935, 259927, 261923, 291832, 305654, 313585, 281186, 231803, 215582, 223246, 219095, 212148, 192953, 206233, 254318, 280539, 262353, 267290, 245726, 204429, 221191, 235276, 235752, 191297, 138493, 142808, 154315, 169222, 222817, 246011, 273425, 299964, 308684, 318329, 309618, 318770, 365403, 347502, 272789, 298115, 343684, 346378, 388609, 481793, 562178, 614220, 572106, 500011, 454660, 411303, 453183, 501408, 504194, 497683, 503029, 531280, 545428, 527712, 510826, 496938, 458890, 496308, 513236, 476631, 503591, 479946, 506315, 539348]
18593E39348L4011j0438j3550M1336N5093L6350M1191j711L1213Q4421N6051O0934
18581I54249O7243M6551J7722j5494M2851K6141L682k9295K5158L5142M3698O4134
18569A281782J14594J24811J25328J51603J95452K31393L77738N20969P09903
18560C833573R63671J145433J101885J132188R09288l3081o96168r87297r42036
18551F427456n84104j71422R5818K74484L14376L93351M32790m0378m32760j39640
18541F569971K57468O19448Q29672J144028J523771J401431Q13808P61449R87222
18532A4908268m4884j763476j767852j066146m20858J16710N59983Q41466R15629
18523A2278840R64056P97352P6238o89374j043305r91059o18597k27381J8666
$$ y = [539348, 573359, 562921, 549371, 590707, 645800, 682150, 723341, 721630, 752843, 837264, 893315, 954249, 1021492, 1068043, 1085765, 1070271, 1113122, 1139263, 1142945, 1113650, 1138808, 1173950, 1217648, 1281782, 1396376, 1521187, 1646515, 1798118, 1993570, 2224963, 2602701, 3123670, 3833573, 4797244, 5942677, 7044562, 8176750, 9086038, 9052957, 8356789, 7369492, 6427456, 5843352, 5671930, 5767748, 6042232, 6356608, 6749959, 7182749, 7142371, 6709611, 6569971, 6827439, 7446887, 8276559, 9420587, 10944358, 12345789, 13159597, 13921046, 14908268, 14863384, 13099908, 11332056, 10265910, 9845052, 9961762, 10521745, 11363211, 12278840, 13242896, 14040248, 14116486, 13427112, 12383807, 11392748, 10774151, 10546770, 10565436]
18514A0565436K25612L10534M11562Q24857J471100K281505L374797M539151N373649
18505B9378203N732693O183803O188022L718756L88217o4369J062401P2897k733930
18496D9926693l211606l036393l135644k008871j420048j445100r62425k13424
18488C4493182l31983j878043k990557k510719j626208j191919j046734n08802
18480B2408217L33646J321626K337312L273128L621001L612691L659878K682169
18472D3249668J67127j442319r55584Q30580K162003L193643M047010L618505
18464E4870633K940397M051621N581775O491871O534145M736762J283205k186740
18456H4303669l045691p01806J823709K853586Q41818l843452p925616p585394
$$ y = [10565436, 10791048, 11101582, 11513144, 12338001, 13809101, 16090606, 19465403, 24004554, 29378203, 35110896, 41294699, 47482721, 51201477, 51589694, 51525325, 52587726, 52660623, 49926693, 46715087, 43678694, 40543050, 38534179, 37114131, 35669031, 34706606, 34493182, 34161199, 32283156, 29292599, 26781880, 25155672, 23963753, 22917019, 22408217, 22741863, 24063489, 26400801, 29673929, 33294930, 36907621, 40567499, 43249668, 43416795, 41974476, 41018892, 41849472, 44011475, 47205118, 51252128, 54870633, 57811030, 61862651, 67444426, 73936297, 80470442, 85207204, 86490409, 84303669, 81257978, 80556172, 82379881, 85233467, 86075285, 82231833, 74306217, 66720823]
18448F6720823n032128k792923l154287n495611n470076m581780m454100l772669
18440C1967249k747839j920050j247398p61257m13823j67596Q4184p5784k83802
18431B4433884M6224M39063P53464R48837J89587r62422j117365j492068j983531
18422B1255673j520649p64877j54584J19891J59671J98449j77568j348148j991936
18413A5775922j630513j169686r17960o86019n69315n75948n87361n51583m46228
18404H641309l09643k87319k75396k39820k04386j77318j87322k09031j33459
18395F617615j32614o0002k7945J1608P8346J47076K13037K18690K32255K44952
18385G543018j6131m24067n43446m86472k39792J5457J29350J63357Q9336R1534
$$ y = [66720823, 61688695, 58895772, 55741485, 50245874, 44775798, 40194018, 35739918, 31967249, 29219410, 27299360, 26051962, 25290705, 24876882, 24709286, 24793470, 24717686, 24433884, 24480108, 24919171, 25672635, 26621472, 26811059, 25848637, 24731272, 23239204, 21255673, 19735024, 18970147, 18815563, 18935454, 19095125, 19293574, 19116006, 17767858, 15775922, 14145409, 12975723, 12057763, 11371744, 10802429, 10226481, 9639120, 9087537, 8641309, 8331666, 8044347, 7768951, 7529131, 7324745, 7147427, 6960105, 6751074, 6617615, 6485001, 6424999, 6397054, 6408662, 6487008, 6634084, 6847121, 7065811, 7298066, 7543018, 7526887, 7102820, 6559374, 6072902, 5833110, 5848567, 5977917, 6141274, 6230610, 6322144]
18375F322144L8668l56797n29574m52538l14538k48328j12636q5572p6990q9032
18365D094807o9265k28515l14466k28069j46897j26618j12894r3513q0446q8799
18355B605325n9357o7164p9855q9209r3369p9091m6359n6434l8130o2733m9076
18344A884548l3488k4864m7858o1280o9961l0972l9427q5021n5660n5085K8374
18333A409306l8262j18070r3123j4332l824m4239l5257m9735k8483m9056l7522
18322H97403J6369K2625m340j1376l3284k8310m02R905n2660l4266l754J2292
18310G90202q996j4964L268k1437j1585M5083k4617o9935m615P298o435j6542
18298F66725n7908n4267P454o946K5056l1560m1002j1199J4270Q742Q309L9332
$$ y = [6322144, 6360812, 6004015, 5474441, 5021903, 4707365, 4459037, 4346401, 4260829, 4183839, 4094807, 4025542, 3797027, 3482561, 3254492, 3107595, 2980977, 2868083, 2774570, 2694124, 2605325, 2545968, 2478804, 2398949, 2309740, 2216371, 2137280, 2090921, 2034487, 1996357, 1933624, 1884548, 1851060, 1826196, 1778338, 1717058, 1647097, 1616125, 1576698, 1491677, 1436017, 1380932, 1409306, 1371044, 1252974, 1159851, 1145519, 1141695, 1097456, 1062199, 1012464, 983981, 934925, 897403, 913772, 936397, 932057, 920681, 887397, 859087, 858685, 868590, 815930, 781664, 777910, 790202, 781206, 766242, 769510, 748073, 736488, 781571, 756954, 687019, 682404, 689702, 683267, 666725, 608817, 554550, 562004, 555058, 580114, 548554, 507552, 496353, 510623, 519365, 527674, 567006]
18286E67006j3044r819j373J1714j9700j8775j1720K6296o936J592J3972O606
18274E45819k4716K8134J2553m671k7969k0594J3411k6455k9652j844P779K4824
18262D96619L8428k9600m2651m5007n1536J7422K1794p34k2339n390M4995J875
18250D23876k7630k6216l5288O168N505k2377j571m0026j4525J1319L0265J6335
18238C25835P0966M1348n2644o348N3605k8133l4528L02l6345n3115J4212K4569
18226C19724p275J3685n9503m339L545J7577J0903J3066O156j9681J3542M6458
18214C53858m178l2205k0079j0435n139k8056j8441J2593K1441L3631j3797k8477
18202B60716M0598K0662l068l4003m8708n6544j7369K7162J9162j2081j0345k6736
$$ y = [567006, 553962, 544143, 542770, 554484, 534784, 516009, 504289, 530585, 523649, 525241, 539213, 545819, 521103, 549237, 561790, 557119, 529150, 508556, 521967, 495512, 465860, 464016, 471795, 496619, 535047, 505447, 462796, 417789, 366253, 383675, 405469, 404735, 382396, 377006, 422001, 423876, 396246, 370030, 334742, 340910, 346415, 324038, 322467, 282441, 267916, 279235, 309500, 325835, 396801, 438149, 385505, 379157, 432762, 404629, 370101, 370403, 334058, 280943, 295155, 319724, 312449, 326134, 266631, 262292, 265837, 283414, 294317, 307383, 313539, 293858, 307400, 353858, 349680, 317475, 297396, 286961, 281822, 253766, 235325, 247918, 269359, 302990, 289193, 260716, 301314, 321976, 318908, 284905, 236197, 179653, 162284, 189446, 208608, 196527, 186182, 159446]
18190A59446J3882K4701k2374J4295K432N893J6071M6308j8810l003j8561k0484
18178A99796M0575K7465o6791m2599J5345P979l1430o8876J6071N0502N1177J983
18166B01197p841k1219J4708K8657l7659J1256L8121J7523m0544N2L2882k9228
18154B07905K0936R570n627J7754L3282P179j5423k2859j2997O590K5011K3799
18142B95120Q054M3793l032K9459j1185J4507J4645L7897J6609k1938K9782N604
18130D59315L0395K2507O6623Q4113j516N7456J24886J02041J21244J14677J49634
18119A331375K12054K27188K41476L24989M30469N95483P94064J104478J587794
18110F849370K451753L824466N755551P099587N805896N138843P327425Q25745
$$ y = [159446, 173328, 198029, 175655, 189950, 192382, 198275, 214346, 260654, 241844, 238841, 220280, 199796, 240371, 267836, 201045, 158446, 173791, 181770, 150340, 81464, 97535, 148037, 199214, 201197, 193356, 172137, 186845, 215502, 177843, 189099, 227220, 244743, 204199, 204251, 237133, 207905, 228841, 238411, 232784, 250538, 283820, 290999, 275576, 252717, 239720, 246310, 271321, 295120, 303174, 346967, 343935, 373394, 362209, 376716, 391361, 429258, 445867, 423929, 453711, 459315, 489710, 512217, 578840, 662953, 661437, 718893, 843779, 945820, 1067064, 1181741, 1331375, 1543429, 1770617, 2012093, 2337082, 2767551, 3363034, 4157098, 5261576, 6849370, 9301123, 13125589, 18881140, 25980727, 31786623, 36925466, 44252891, 45078636]
18102D5078636j1595856j0213872n992246l563984k392698j821236j409716j088531
18094G000497q27447o45697n78056m45420l58063l25481k61294j68482j09338
18085C281219j10159r3784j42337j30480j15680n4775o6437m1217m2021j20153
18075B364176j38443j07295r3569j13323j07560p9258o3736p1760r4552j04792
18065A389888l5368q1467r1443m5243l8920n0823r414J6428j4838n4282l7654
18054I46864n127k2669K8937O10k0133l9430o0695k312J1278k087m9358n473L7213
18041H17618l5258l4280M1096m497l0229j7754M1762J1356k1537P436n7687o400
18029G11626N435m3443l0828K160j9736p472l2335q808k1352j0916k925j2253
$$ y = [45078636, 33482780, 23268908, 17276662, 13712678, 11319980, 9498744, 8089028, 7000497, 6173050, 5527353, 4949297, 4503877, 4145814, 3820333, 3559039, 3390557, 3281219, 3171060, 3077276, 2934939, 2804459, 2688779, 2634004, 2567567, 2526350, 2484329, 2364176, 2225733, 2118438, 2024869, 1911546, 1803986, 1724728, 1660992, 1589232, 1494680, 1389888, 1354520, 1273053, 1181610, 1136367, 1097447, 1046624, 1037210, 1053638, 1038800, 984518, 946864, 941737, 919068, 948005, 948615, 928482, 889052, 828357, 826045, 837323, 835236, 785878, 780405, 817618, 782360, 748080, 789176, 784679, 754450, 736696, 778458, 789814, 768277, 775713, 718026, 711626, 717061, 673618, 642790, 644950, 625214, 617742, 585407, 576599, 555247, 544331, 541406, 529153]
18017E29153l7956J689j5298m3509J027J3453j2551j0505L202l369J6729k2741
18005D19324L4685m654l9376l4557m959K2638J6089l9194j8611r755k154L9909
17993C79385P931p56K8804N9563j2078j1623o405J5438K0258R041M8462o634m980
17980E26406l6469l1133L2726K1076l4187n8327o1426k4246P337J3646j1705j6180
17968C27518q096k9612J9021j5555l5543k293j6588n289M6316N3946r66k6468
17956C06391r821k4175l2953j2469K3132O7407K957n2168k4411Q534j4514K2257
17944B60167R910l2562l3392J3400j2471J1820N122j1801q837q762K2020J7549
17932B32163L6818k281l621M7798L0482l7767q2L2107j1129p604K0046J4768j7865
$$ y = [529153, 491197, 492886, 477588, 434079, 435106, 448559, 436008, 425503, 428705, 425336, 442065, 419324, 454009, 449355, 409979, 375422, 370463, 393101, 409190, 369996, 351385, 341630, 339476, 379385, 387316, 386560, 415364, 474927, 462849, 451226, 444821, 460259, 480517, 489558, 538020, 531386, 526406, 489937, 458804, 491530, 512606, 478419, 420092, 358666, 334420, 341757, 355403, 343698, 327518, 319422, 289810, 308831, 293276, 257733, 255440, 238852, 233563, 279879, 333825, 332859, 306391, 296570, 272395, 239442, 226973, 250105, 317512, 320469, 268301, 243890, 252424, 237910, 260167, 270077, 237515, 204123, 217523, 205052, 216872, 221994, 210193, 201356, 192594, 214614, 232163, 268981, 266700, 263079, 310877, 341359, 303592, 303510, 335617, 324488, 316884, 336930, 351698, 333833]
17919C33833l3404l7481l8408J7990k2010j9864L2777p231k0469J4260j7196l4051
17907A68746K0840N299j9444k2262Q387J0668j6968m35N798k237j9138n529j1775
17894A21950k603j6154k4258J6732L8157l0292l0006j4846l7561j1880K0302K1392
17882E0933N9297k338j6064M26M945K3285N155q306J3212j8950m410L7155k4301
17869A20039k8113Q716M3742k987R011J0295l6378m2839O36J9415k7889K9772
17857A03420l836l8448l5636J465J7305j0980K7750L8273k2915l2068l2632j8405
17845f707R675L0669p725J0785J7243N491j5116J3068L5456N877n7754p7279L1292
17832e025L1911q475j5455K0944J3621J5127K6900R59J7911p406n7912K1192L2805
$$ y = [333833, 300429, 262948, 224540, 242530, 220520, 200656, 233433, 226202, 205733, 219993, 202797, 168746, 189586, 194885, 175441, 153179, 161566, 172234, 155266, 154831, 160629, 158392, 139254, 133725, 121950, 119347, 103193, 78935, 95667, 133824, 103532, 73526, 58680, 21119, 9239, 29541, 50933, 110230, 107892, 91828, 92254, 97199, 120484, 125639, 117333, 130545, 111595, 107185, 144340, 120039, 91926, 100642, 144384, 141397, 150408, 160703, 124325, 81486, 82122, 101537, 73648, 103420, 99584, 61136, 25500, 26965, 44270, 33290, 61040, 99313, 76398, 44330, 11698, -6707, 2968, 33637, 25912, 36697, 53940, 59431, 44315, 57383, 92839, 98716, 40962, -36317, -5025, 26886, 18411, 2956, 23900, 37521, 52648, 79548, 80507, 98418, 91012, 33100, 54292, 87097]
17819H7097j7348l9271L3243L9472l0224l8330k503R277L0973J5096K3196J4491
17807A25169j9498m5265l9675L4818K8643m4453k9968J376o387k408l7054N790
17795b8912J3462j7313K0269P099N369L3530J4670o609l814P124J5201K7883l3820
17782E4139j7432K7998K9847K550j2787l2606k9756N0101l243k0660L0348k4023
17770E4476n2819N2214L5454j6082n4437l3829K5913J7514M186K3201j2708l2455
17758A0628l749L5063m0408m3533M9794Q3928k4534l9324k6190L6957k2311r022
17746G299q465N101r493k855N7735L7659k9713l0729J4016M2896k8516k3579l0273
17733A083k6469r647L3763N585K8637K8157j4051k7711l4699K2592K0973J463
$$ y = [87097, 69749, 30478, 63721, 103193, 72969, 34639, 32136, 41413, 72386, 87482, 110678, 125169, 105671, 60406, 20731, 55549, 84192, 39739, 9771, 11147, 4760, 2352, -34702, -28912, -15450, -32763, -12494, -5395, -26, 33504, 48174, 41565, 37751, 44875, 60076, 87959, 54139, 36707, 64705, 94552, 97102, 84315, 51709, 21953, 72054, 68811, 48151, 78499, 54476, 1657, 53871, 89325, 73243, 18806, -15023, 10890, 28404, 32590, 55791, 43083, 10628, 6879, 41942, 1534, -41999, 7795, 91723, 67189, 27865, 1675, 38632, 16321, 7299, -1166, 3935, -5558, -8413, 49322, 86981, 57268, 26539, 40555, 83451, 54935, 31356, 1083, -25386, -35033, -1270, 4315, 32952, 61109, 47058, 19347, -15352, 7240, 28213, 29676]
17721B9676j5399j8145k933R488K4661k3062J388k658K2557k8332R59K1258j6150
17708C308N651n86j7682J3429L4509o45k5753J7834K5373o719j4301J4171J432
17695E0021j7257L462J4100Q437J4319j4564j6167j2752K2041L7186j3436j0973
17683F4417n032m044k4167n3007m231L2527J6268Q44J7021j8478L568k2600k6024
17670b2938L6279j2563j1880K8756p802l945J8042L682l0216l7019r304K8464
17658b0444k10M392K3651K9989o583m5902n1032L7747N5998k1751n2300Q005J4811
17645b3629L3063L0197J8927m2527p974k4485k838j9127O564K0491J4173L3122
17633C5957J0669q376k9475J0751K0792J7244k8262k5865l4020J9859L9261m412
$$ y = [29676, 14277, -3868, -6801, 2687, 27348, 4286, 5674, 3016, 25573, -2759, -1800, 19458, 3308, 8959, 8373, -9309, 4120, 38629, 37984, 12231, 30065, 55438, 48719, 34418, 48589, 50021, 32764, 36226, 50326, 58763, 73082, 58518, 42351, 29599, 51640, 88826, 75390, 64417, 59385, 55341, 31174, -21833, -26064, 6463, 22731, 23575, 40596, 22118, 25686, 3086, -22938, 13341, 778, -11102, 17654, 9852, 5907, 23949, 27631, -2585, -39604, -48908, -20444, -20654, -16262, 7389, 37378, 30795, -15107, -66139, -28392, 27606, 5855, -46445, -38440, -23629, 9434, 39631, 58558, 16031, 8057, -16428, -19266, -38393, -31829, -11338, 2835, 35957, 46626, 38250, 8775, 19526, 40318, 57562, 29300, 3435, -30585, -10726, 28535, 24123]
17621B4123j4537K6691l9551l366O4308K7440k2081l8255q642K5360J2042K3077
17609G6609J6691l457o1562k8281P536o890r116j3531N538j463J2019m6030k0590
17596g2527O9417K2680k8155l7519K4719L9874R409l0013l188r598m979K368M0129
17583B2617K8284K3355p564m4224k4545k2233l0136J1917p25M353l6716m69P0954
17570e132n095L897J0323j9094o814J4320K287J8879k0145L2115K5694j6979M613
17557C8869n784O794J2260L9835M8916l6255m5009l6581k1287l830J3209L5274
17545D6411J3743K099k8271j5023K5553J5724k1651j4829j8935k6145P841L5097
17533B1614n140m718Q416K2543k2002j0500J291J8258K767K4495N145m0443P413
$$ y = [24123, 9586, 36277, -3274, -6640, 57668, 85108, 63027, 24772, 16130, 41490, 53532, 76609, 93300, 89843, 28281, 0, 7536, 646, -8470, -22001, -16463, -17926, -5907, -51937, -72527, -3110, 19570, -8585, -46104, -21385, 18489, 27898, -2115, -5303, -14901, -19880, -17512, 22617, 50901, 74256, 66692, 22468, -2077, -24310, -54446, -42529, -43254, -38901, -75617, -76086, -5132, -10227, -6330, 3993, -15101, -21915, -7595, -5308, 13571, -6574, 25541, 51235, 34256, 38869, 33085, 39879, 52139, 91974, 140890, 104635, 59626, 23045, 1758, -2072, 11137, 46411, 60154, 62253, 33982, 18959, 44512, 60236, 38585, 23756, 4821, -21324, -13483, 21614, 16474, 11756, 20172, 42715, 20713, 10213, 11504, 29762, 32529, 57024, 62169, 21726, 29139]
17520B9139L5737k6183l6634k1211M5692J8520J7873k1191k3008K2993j976J4595
17508E4346L3134L730m2595j5178l9639j3949l832K3671J9153k6300O232m152
17496e379j0393j5193J2086J6019N6348p979k4508l0818m3966O924J7133k4961
17484e4687J697K0198K0998j8230j4795j885M1204M724n078K3801n729l0385k4276
17471d2443J1180J1445p88j7687L7977L4205m1597l5965k6221k1023j0969M9826
17459e2060N7996n448r871j484J4207K0831j6627j0182R509j479K269Q539L3569
17446D9769k2913j2357J7011K814r372L091K1070J00887M0808M8555o0457j03517
17434G5389l8865Q044j6243J4475L2984J530K8326L1427J4429j4695n7843l3623
$$ y = [29139, 64876, 38693, 2059, -19152, 26540, 45060, 62933, 41742, 18734, 41727, 39751, 54346, 87480, 91210, 48615, 33437, -6202, -20151, -23983, -312, 18841, -7459, -1227, -5379, -15772, -30965, -18879, -2860, 53488, 45509, 21001, -9817, -53783, -46859, -29726, -54687, -52990, -32792, -11794, -30024, -44819, -46704, -5500, -776, -5854, 17947, 12218, -18167, -42443, -31263, -19818, -20606, -38293, -316, 33889, -7708, -43673, -69894, -90917, -101886, -52060, 5936, 488, -9383, -10867, 3340, 24171, 7544, -2638, 6871, 5392, 7661, 16200, 49769, 26856, 14499, 31510, 34324, 24952, 28043, 49113, 150000, 190808, 239363, 178906, 75389, 36524, 44568, 28325, 42800, 75784, 77314, 105640, 137067, 151496, 136801, 78958, 45335]
17422D5335J6378K17r557J8263k585L1123k5421n9066n6836M0310K4128N2550
17410G4839j7946o3822r828K6594N1633r336k7200m621L2921k1358m3048k1264
17398c2436P0215J935K0543l1885k9714J1184K1856k5605J2559O558o904l5583
17386a7277J919k0627l117m344j665J2354J5404L0779Q703J0649J2994K2071m1452
17373B6391l9207k6967J5716n807K6185K1540n937j6110q682p397K3224J0943
17361A3892k3189j4252l9526J2919P095j9208l67M3174k822K4311J6637N269l710
17348B0223Q324K1425J0575K7744M452n5447l9715J9258j6552j8927L2437K1137
17336C4934L1597k0257j3499K7130J3170k8825k0847K0091J4712L322j7178l2944
$$ y = [45335, 61713, 61930, 52373, 70636, 68051, 99174, 73753, 14687, -42149, -1839, 22289, 74839, 56893, -6929, -16757, 9837, 61470, 52134, 24934, 20313, 53234, 31876, -11172, -32436, 37779, 39714, 60257, 28372, -1342, 9842, 31698, 6093, 18652, 25210, 18306, -17277, -15358, -35985, -39102, -43446, -45111, -32757, -17353, 13426, 22129, 32778, 45772, 67843, 26391, -12816, -39783, -24067, -29874, -3689, 17851, 11914, -4196, -12878, -20275, 2949, 13892, -9297, -23549, -63075, -50156, -43061, -62269, -62636, -19462, -22284, 2027, 18664, 23933, 20223, 28547, 49972, 60547, 88291, 92743, 37296, -2419, 16839, 287, -18640, 13797, 34934, 66531, 46274, 32775, 59905, 73075, 44250, 23403, 43494, 58206, 61528, 44350, 11406]
17324A1406O826l3687O055j204j8226J3712n371q064j956L4544J4196L4823o0636
17311g582k5944k0223J2223K6864O138o89m38j199Q621L1133k2439k4069j9035
17298c6639K1952Q493m1405k204L7352J4281J9911K853o127l866p627P580l9013
17285b4459M1112n086j9283j7128J6358l4998k0111L0792K5851j6734j6539n075
17273d5300J9967K6363L142L5011L6474M17N950K7042J4258l2083n5897l7288
17261a944j3128O3510j2007j9394p009J1012N7038K3726k9221o7803k4292L7637
17249A8125M1515j9820M854J7810k2353K2373J216o178k8727m819j3314O882Q5
17236A7649m8032P370L7709K1856J9951k5226m0164j5055R21K0223O062l5489
$$ y = [11406, 18232, -15455, -9400, -10604, -28830, -15118, -20489, -28553, -30509, 4035, 18231, 53054, -7582, -33526, -53749, -41526, -14662, -8524, -9213, -9651, -10850, -2229, 28904, 6465, -17604, -36639, -14687, -6194, -47599, -49803, -12451, 1830, 21741, 24594, 18467, 14601, 6974, 14554, -24459, 16653, 11567, -7716, -24844, -8486, -43484, -63595, -32803, -6952, -23686, -40225, -45300, -25333, 1030, 4172, 39183, 75657, 76074, 82024, 109066, 123324, 91241, 35344, -1944, -15072, 48438, 36431, 17037, 10028, 21040, 78078, 101804, 72583, 4780, -19512, 18125, 59640, 39820, 44674, 62484, 40131, 62504, 63720, 57542, 28815, 23996, 10682, 17564, 17649, -30383, -23013, 14696, 36552, 56503, 31277, -8887, -23942, -23021, -2798, 3264, -32225]
17224c2225m1910P912L6622K3473K2538k597l761J7692k4054L4689j8210k8996
17212h827L3480m455k3374j7766P612M5203j3122p545Q649O42L0642k1157k0728
17199I254j5782l2358K6256K3700O2536J7124J0238j0242k3420k6940l061o261
17187C1044k6267J9957n804k6361n6381j5393k1148j768P078M8532Q295m546K7900
17174a4862Q56J1668Q444J9993r779J084j9679K3809P020j0395J8746O259l3490
17161I674L0860l4664k0753K0877k8172l6614L5365J9198k5772k3776m925J5385
17149d3317N3495k050l5460K5810L170J1056Q980K444J2331l1075k5790n075j6084
17136d1565J970J4050K3876J0550Q94k9832k2815m742M5332K3565j0216J012k8913
$$ y = [-32225, -74135, -66223, -29601, -6128, 16410, 13813, 10052, 27744, 3690, 38379, 20169, -8827, 24653, 20198, -3176, -20942, -13330, 31873, 18751, 11206, 19855, 20497, 51139, 29982, 9254, -6528, -38886, -12630, 11070, 73606, 90730, 100968, 90726, 67306, 40366, 37305, 31044, 4777, 24734, 18930, -7431, -63812, -79205, -100353, -102121, -95043, -46511, -38216, -42762, -14862, -14006, -2338, 6106, 26099, 16320, 17404, -2275, 21534, 28554, 18159, 36905, 43164, 9674, 40534, 5870, -14883, 5994, -22178, -58792, -23427, -4229, -30001, -53777, -58702, -43317, 10178, 8128, -27332, -1522, 1648, 12704, 21684, 24128, 36459, 5384, -20406, -25481, -41565, -39595, -25545, -1669, 8881, 9775, -20057, -42872, -47614, -2282, 21283, 11067, 12079, -16834]
17123a6834j7652q177o508J1114L2832L3983r531m3569l7920M613P299O2712M79
17110A2841K868m4307N273J3004P57r052R938O687K3935j6013p303j9956p319
17097b8647O0993L1341l2972q73j1925j4981J05l9981l683m516L895j1482K637
17084e0089J1750L4190L0747r00j8243l5460j1402m536j4445r428R899k5545J9373
17071f4089M5223N113k5439L1356j4341o287k4329K782M2833J2935k2765j1059
17059b8067k3295k5369J5702L9362k7409K0289O2252R271K6620k8629k9604q364
17047B759o766k5755M960K7475m0274Q256K9690j908j3910K2187M4675k5755J5293
17034D0927j872p026j0689m1027P924N3025N749n9044P309L3620j1875L3147j2706
$$ y = [-16834, -34486, -42663, -49171, -38057, -5225, 28758, 19227, -24342, -62262, -57649, -50350, 12362, 12841, 15709, -28598, -23325, -10321, -9564, -18616, -8678, -1991, 21944, 5931, -1372, -21328, -28647, 32346, 63687, 30715, 29842, 17917, 2936, 3041, -36940, -40623, -45139, -41244, -52726, -50089, -38339, -4149, 26598, 25698, 7455, -28005, -39407, -43943, -58388, -67816, -57917, -83462, -64089, -18866, -13753, -39192, -7836, -22177, -28464, -52793, -50011, -7178, 5757, -17008, -28067, -51362, -76731, -61029, -21667, -49076, -28787, 33465, 42736, 69356, 40727, 11123, 2759, -4007, -29762, -24802, 2673, -37601, -29345, 345, -1563, -15473, 6714, 51389, 25634, 40927, 39055, 32029, 21340, -19687, -11763, 41262, 47011, -12033, -4724, 28896, 17021, 50168, 37462]
17021C7462l0744p1083j7787j083J1565K2959L2522k957m9506k3699k774N8740
17009c6385O3166L5487j5679l5143L368L3250K2529J5202p6379k6698J0397J1734
16997D849j2158J8598k141O580j8743r810R496p139l85k4422l580L4593L6623
16984C2361n6252j7019K0514M2276k30k2122N060N9041j7924l7915o8811n762
16972f6783L3807M0296K6267k7099k7747Q673L0644p930k1361J7604M5590j1678
16960D0283j0825l428Q257j6853J2277n306p936J2844j8631O220j0390L77L8205
16947D5094K8268n344l8559n6780n1230r85L7336J8497Q154k2352Q469j6602j073
16934d7107L517J7592o162K0869L963j5389j2041L8406o047J2301j5488Q89J9204
$$ y = [37462, 6718, -64365, -82152, -83235, -71670, -48711, -16189, -19146, -68652, -92351, -95125, -36385, 26781, 62268, 46589, 11446, 14814, 48064, 70593, 85795, 9416, -17282, -6885, 4849, -7309, 11289, 9148, 15728, -3015, -12825, -3329, -10468, -10853, -35275, -38855, -4262, 32361, -23891, -40910, -20396, 21880, 21650, -472, 4588, 63629, 45705, 7790, -61021, -66783, -32976, 7320, 33587, 6488, -21259, -12586, 18058, 10128, -11233, 6371, 51961, 40283, 29458, 26030, 34287, 17434, 29711, 24405, 16469, 29313, 10682, 16902, 6512, 6889, 45094, 73362, 68018, 29459, -27321, -78551, -79536, -42200, -23703, -15549, -37901, -29432, -46034, -47107, -43590, -25998, -32160, -11291, -7328, -22717, -34758, 3648, -2399, 9902, -5586, -4697, 14507]
16921A4507O881j4008K6960J8316r177R42J1027J3642k1938J599J107M709L4268
16908H8835j4606k8379Q05n240l2151j3047O7562K198j0255k796j9969k3581k2263
16895a2887j5758n102L780j8287J6776L1813R599Q926J5379j5604l7577j1650
16883c0592j5726J019N9699R849j9209k2330J9107J4984m660J5716m863k1353
16871A641j7313j3799L4081J0610L8857n858N17k8641m4003k6326J201M2726M3265
16858C6958j0256P650R52n026j6468l6463l4996k0763J289J1237N1443l164l0640
16845d8247O5492L1665k4629k6207J5020k7061j0922J4319K3124K8290j1584j3344
16833A5916M8154Q207k8751n8061j5178j5400R708j6801J2558J7544m6289q815
$$ y = [14507, 21388, 7380, 34340, 52656, 43479, 44421, 55448, 69090, 47152, 48751, 49858, 54567, 88835, 74229, 45850, 46655, 41415, 9264, -3783, 63779, 65977, 55722, 52926, 32957, 9376, -12887, -28645, -33747, -29967, -48254, -31478, 335, 9934, 18860, 34239, 18635, -18942, -30592, -46318, -45299, 14400, 24249, 5040, -17290, 1817, 16801, 12141, 27857, 22994, 1641, -15672, -29471, 4610, 15220, 54077, 48219, 48736, 20095, -23908, -50234, -49033, -6307, 36958, 26702, 34352, 35304, 30278, 13810, -22653, -57649, -78412, -77123, -65886, -14443, -17607, -48247, 17245, 48910, 24281, -1926, 13094, -13967, -24889, -10570, 12554, 40844, 29260, 15916, 64070, 72277, 43526, -14535, -29713, -45113, -35405, -52206, -39648, -22104, -68393, -77208]
16821g7208Q471M0187J6299m191K5424Q698K8305K1822n1092l6744n413k2532
16809d7974k2709k966L9006L0776M126J1225N0181K0841j8003n1600n4297L716
16797c7678J6616M1942o377l182L4020J8923l0891M385J3504l9463k0350k274
16785a0825m3734j1308P339Q832m1039k6634N2972O0797j2260P710J6563O947
16773A5360l6539j0783n4024J7621K9089N834L026J296L955J4553N353R088L0147
16760C3976j939l1280k4143n897L5028K1249m3626m4710k1362k4362K6914L3847
16748d6305Q711L6584j6778l1081m262K1592J9608K9212M831j9868k0045J6151
16736a650k6152l0061P28N5281L2433K1378l4724l3858j9545k270n097J8424K9861
$$ y = [-77208, -68737, -28550, -12251, -16442, 8982, 17680, 45985, 67807, 16715, -20029, -25442, -47974, -70683, -73649, -34643, -3867, 259, 11484, 61665, 82506, 64503, 12903, -41394, -37678, -21062, 20880, 14503, 11321, 45341, 64264, 33373, 37758, 51262, 11799, -8551, -10825, -54559, -65867, -58528, -49696, -90735, -117369, -64397, -3600, -15860, -8150, 8413, 15360, -21179, -31962, -85986, -68365, -39276, -33442, -30416, -29120, -25165, -10612, -5259, 3829, 33976, 32037, 757, -23386, -29283, 5745, 26994, -16632, -61342, -82704, -107066, -80152, -46305, -37594, -1010, -17788, -48869, -53131, -31539, -11931, 17281, 22112, 2244, -17801, -1650, -27802, -57863, -57135, -1854, 30579, 51957, 17233, -16625, -36170, -38440, -43537, -25113, 4748]
16723D748l0269J1729M3129O291M8996K547J586l0118j2684j9728k722J6822J608
16710D1935k0986J7029P412M798n2958j6717q584K5240N5437r48l7025k0124k6672
16697c2163l538K7343L0802M7487k7112p6224l8253J0340K8321J1039L9183K5243
16685D2468m5649n718M375m1227j3268Q351J9660n348j4289j0603j7623M369q278
16672h2780o034J3845O7090J27k5700M4413m409l0895M003K4743R242j4931k3116
16659b4402L8819P588l0512K3020k4043P366L8167P500J6190j1963o2510p910
16647b2690K5089j9889j2266J2900O924J6682O618q008J8260L4053k2327n4828
16635a9482l1842J5385O061M354R353j7409k8195j6169j1014Q453L5500N10m7021
$$ y = [4748, -25521, -13792, 29337, 35628, 84624, 87171, 88757, 58639, 45955, 26227, 23505, 40327, 41935, 20949, 37978, 45390, 50188, -2770, -19487, -28071, -2831, 52606, 51658, 14633, -5491, -32163, -35701, -8358, 22444, 69931, 42819, -33405, -71658, -61318, -32997, -21958, 17225, 42468, -3181, -8899, -4524, -45751, -59019, -50668, -31008, -36356, -50645, -61248, -78871, -74502, -82780, -88814, -74969, -7879, -7752, -33452, 10961, 6552, -24343, -20340, 4403, 13645, -1286, -24402, 14417, 22005, -8507, 14513, -9530, -2164, 36003, 43503, 59693, 47730, -14780, -22690, 2399, -17490, -29756, -16856, -9932, 6750, 13368, 5360, 23620, 57673, 35346, -19482, -51324, -35939, -29878, -25524, -16171, -33580, -61775, -77944, -88958, -80505, -45005, -44495, -91516]
16622i1516O569K1310R697K192j9323j6422k517J2607n0299j9867K5249O9823
16610e2497J04815L2650k0998k0118l1487n4499l6822n59L4446r279j466L6201
16598a9613j6794M3880K4057l4943m4800K8689J087j8008o501M1070N466K818
16586F408m409J2424l0327m0019N2225N8348J4200K5679m110r0257L0083l8991
16574h746j8492o317k048J6197J995l128J4292J0810l8541J295Q5600M2156l0138
16561F4935m0085k1834j8251k2934J977J2509j7398o484k3263k5076j3469M8795
16549f0578M5435K1366K4618q481P772k1285k556K6823j8956l5909K4253k703
16537b01O2451L2905j2062m1158l0094j3906K1905m888M2599n077k5480R198l3889
$$ y = [-91516, -84947, -63637, -53940, -51748, -71071, -87493, -90010, -77403, -127702, -147569, -122320, -52497, 52318, 84968, 63970, 43852, 12365, -42134, -78956, -79515, -45069, -54348, -55814, -19613, -36407, 7473, 31530, -3413, -48213, -19524, -18437, -36445, -42946, -1876, 3590, 6408, 1999, 14423, -15904, -55923, -3698, 54650, 68850, 94529, 90419, 162, 30245, -8746, -27238, -33555, -35603, -19406, -17411, -20539, -6247, 4563, -33978, -32683, 52917, 95073, 64935, 24850, 3016, -15235, -38169, -36192, -23683, -41081, -47565, -70828, -95904, -109373, -60578, -15143, 6223, 30841, 22360, 30132, 8847, 6291, 33114, 14158, -21751, 2502, -201, 62250, 95155, 83093, 41935, 11841, -2065, 19840, 14952, 57551, 52474, 26994, 36192, 2303]
16524B303j3745J4354p64j1470J1325k0827l610L5502R801m012j983l2438J0726
16511d838k975n733l2055j9193O969Q314R577N4156M4738m4868l3187k1668K0378
16498b0385L0174k5777J8389M1148r114k4869K394j6437K6930L0765l5121k9387
16486a1290j6594J4110L3262K9418j2770l2590l6642k993m849K0738J1176L3593
16474B4569L1862M4880J1439k1823o6801k3115j2486m756L8296P6659k2770l4278
16462D1676L6260n120j0088k0126j611m0650R711K5470l5868l7724j3823J4410
16450c7483M4531j3238j3787M770K8214m0554K063k6076m4248k6775P069K2481
16438i3033L4282L1360J7771j1327Q213K6505L7342l2085m0787K1305L5875J3804
$$ y = [2303, -11442, 2912, 2148, -9322, 2003, -18824, -22434, 13068, 22869, 18857, 16874, -15564, -4838, -7813, -13546, -45601, -64794, -57825, -49511, -39934, 14222, 58960, 14092, -19095, -40763, -20385, 9789, -15988, 2401, 43549, 34435, 9566, 11960, -4477, 22453, 53218, 18097, -11290, -27884, -13774, 19488, 48906, 36136, 3546, -33096, -36089, -40938, -20200, -9024, 24569, 56431, 101311, 112750, 90927, 24126, 1011, -11475, -16231, 22065, 98724, 75954, 41676, 77936, 72816, 62728, 42602, 40991, 341, 10052, 35522, -346, -38070, -51893, -37483, 7048, -6190, -19977, -15207, 13007, -27547, -25484, -51560, -95808, -122583, -115514, -93033, -58751, -27391, -9620, -20947, -12734, 13771, 51113, 19028, -21759, -454, 35421, 49225]
16426D9225j5576P542m2008j2261o030m288j4282k9716J7303P0367J3176L0577
16414F4029L1004j3121j6816n7270n4617K0871N7539K2081O611O477P113k820
16402G1081n3129m3410k3258k4709J3840J1978K907K7259J1257l3571J8262J1962
16390i531K1131l1662k4843N6586N0007m3125l9635o278N2747m3204J4237J595
16378a975J0615K049j3619K092p91L040l1593J6665L4859J1136j2744j6142k7609
16365b4017J5049J5987l0952N07j532J5728j6137L6268L3478o833J0306k6529
16353B1323J6664j1290l0322j8720k7245J583K9567N0243K5727j8816p554J8064
16341D9224J8027l6295l0696K0246K0615k1778l691j4640l6592J1885n961J6444
$$ y = [49225, 33649, 41191, -817, -13078, -19108, -23396, -37678, -67394, -50091, 20276, 33452, 64029, 95033, 81912, 65096, 7826, -46791, -25920, 31619, 53700, 60311, 66788, 73901, 71081, 17952, -25458, -48716, -73425, -59585, -47607, -44700, -17441, -6184, -39755, -21493, -9531, 11600, -20062, -44905, 11681, 61688, 18563, -21072, -27350, 25397, -17807, -3570, -1975, 8640, 10689, -2930, -838, -1629, 1411, -30182, -13517, 21342, 32478, 19734, 3592, -24017, -8968, 7019, -23933, -23426, -24958, -9230, -25367, 10901, 44379, 37546, 47852, 21323, 37987, 26697, -3625, -22345, -49590, -48007, -18440, 31803, 57530, 38714, 31160, 49224, 67251, 30956, 260, 20506, 41121, 19343, 15652, 1012, -35580, -23695, -29656, -13212]
16329a3212J4340r862J911j8180O832m200j0159J4910j1157l0843L082k0238l4381
16316a11157J1734M4505K5513j2133K5942Q145L2734j9308n3461n429R033n950
16304d9832K2894L852p170Q393J2175L5271J2657j5536l619J3007N962K9031P199
16291G4284r225l3305l8953K4128k145m2741l5730O1104J2497J8057l4276o486
16279a2791j2316m225k12N928p199j5974m4207J4504K1822K1447K4034M4841L9815
16266G5467l877k9398l6959P401n1110L9843K3953J5987k0912Q627j3048k5974
16254a0000k5793m7748m1552j917M8290N5872J7853j4940L1910K6091K6558l7315
16242B7309J4965l1790j3153l2687j2856K0496L5343K2097o939k5119l1692J7073
$$ y = [-13212, 1128, -8734, -6823, -25003, -18171, -22371, -32530, -17620, -28777, -59620, -56538, -76776, -111157, -99423, -54918, -29405, -41538, -15596, -7451, 25283, 5975, -47486, -52915, -43882, -49832, -26938, -23086, -30256, -21863, -9688, 25583, 38240, 22704, 19085, 32092, 38054, 67085, 74284, 65059, 31754, -7199, 16929, 14784, -27957, -63687, -2583, 9914, 27971, -6305, -12791, -25107, -29332, -29544, -23616, -30815, -46789, -90996, -76492, -54670, -33223, -9189, 35652, 75467, 71590, 42192, 5233, 12634, -38476, 1367, 25320, 41307, 20395, 29022, 15974, -10000, -35793, -83541, -125093, -127010, -78720, -22848, -4995, -19935, 11975, 38066, 64624, 27309, 42274, 10484, -2669, -35356, -48212, -27716, 7627, 29724, 22785, -2334, -34026, -16953]
16230a6953O5226K746p7046m8115M5944N3026m685l1243j2296o846J7086L2797
16218A9641k0976m7586j5812K7261M5129K0176r25j2307l2546l8757K7710M7598
16206A8606K3620k7288j8991J3192m5251p705K5234l4080K5054L1497M079l4405
16194b6438R111j0893l2704M1938P0131K4240n2810l355r78J192O817r554l1752
16181a5055p043N8648j184L2997P121m799K6871M653o0515q791M62K4922o225
16168E2062j5197K370k5966l4550l8928J008R625p675n624N874L0357K0350J2762
16155F468k1200q808J5206K303l5939m13l975Q373K4807L3825L7218J1109m8820
16142B0154m4855l3859P524j3205m7794l3802N7848R2279M7463j3266J0535k4675
$$ y = [-16953, 48273, 51019, -26027, -74142, -28198, 24828, 20143, -11100, -23396, -30242, -13156, 19641, -1335, -48921, -64733, -37472, 7657, 27833, 26908, 14601, -17945, -56702, -28992, 18606, 42226, 14938, -4053, 9139, -36112, -43817, -18583, -52663, -27609, 3888, 7967, -26438, -17327, -28220, -60924, -18986, 51145, 75385, 22575, 19220, 18242, 19434, 26251, 16697, -15055, -22098, 36550, 35366, 68363, 75484, 70685, 97556, 102209, 41694, 32903, 33365, 58287, 52062, 36865, 39235, 13269, -21281, -60209, -59201, -49576, -57251, -62875, -57001, -26644, -6294, 6468, -14732, -23540, -8334, -6031, -41970, -42383, -46358, -37985, -13178, 20647, 57865, 68974, 20154, -24701, -58560, -51036, -64241, -112035, -145837, -87989, 4290, 51753, 38487, 49022, 24347]
16130B4347k0244q02J5640l6249q5142m6349K7644P5176J9098K3106K128o1492
16118f3139N2496N4859r138J290Q673n1426n380K1607K0099r073j9569k6441r026
16105c4168J2288n882L6324k2863L7940K5979j5177J5417k4888j9287j4489k6058
16093c4864O414q265j2399J1954J2680K5367J3847L0989J1291m0138n4535J6982
16081b0677L2237L386j8877j1785q843K6719J0945P554L7936K7497l5495J868
16069E2465J4343m2556R431k0286k0566q645K2658O0324M7217K8891j2892m2234
16057H8150k4114j7400r218j0297o111l968L4867m273j6325J4913l2340P034O159
16044B7077n6538P775J7983k7512P456K4477L2395J6099l4922l7538o417K9898
$$ y = [24347, 4103, 3301, 18941, -17308, -102450, -148799, -121155, -45979, -26881, -3775, -1647, -63139, -10643, 44216, 35078, 36368, 45041, -6385, -11765, 9842, 29941, 20868, 1299, -25142, -34168, -21880, -27762, 8562, -14301, 23639, 49618, 34441, 49858, 24970, 5683, -8806, -34864, -28450, -36715, -49114, -37160, -24480, 887, 14734, 45723, 57014, 16876, -37659, -20677, 11560, 14946, -3931, -15716, -24559, 2160, 13105, 20659, 58595, 86092, 50597, 52465, 66808, 24252, 33683, 13397, -7169, -15814, 6844, 67168, 114385, 143276, 130384, 88150, 64036, 46636, 37418, 27121, 21010, 17042, 51909, 47636, 31311, 46224, 13884, 20918, 27077, -29461, -21686, -3703, -31215, -23759, 718, 33113, 49212, 14290, -23248, -29665, 233]
16032B33M8030J0814m2887j2456J3620K249k4754n090J6573N7680k0544o8854
16020b5386K3109L5285M6824J2841l4375k6761p349J7588r480P41O759j0499j8463
16007A0834J2619M7173K2419m3500m6069p232l7114J0152K2959k355K6449k0662
15995d327L254N231P52M152K5285P144J455J8481m747K1282M6407k0447q4035
15982A9887n1738L5499j5672l5225N987k881R067R928M2388n196l3695K6945J1065
15969A6359m107o452L5897j9149n758m8683J7673K7133L6118O5326k8342m7770
15957C8245m6262l442M9460j4402K4034o00l981j3668k6416k446J6541j1298o300
15944e35k1625j8269M62L5235L4358J8619m437m3519k8940L3389n614J7935K9337
$$ y = [233, 48263, 59077, 16190, 3734, 17354, 19603, -5151, -10241, 6332, 64012, 43468, -25386, -2277, 33008, 79832, 92673, 58298, 31537, 24188, 41776, 32296, 33037, 39796, 29297, 10834, 23453, 70626, 93045, 49545, 3476, -3756, -40870, -30718, -7759, -10114, 16335, -4327, -1073, 4158, 4910, 9062, 34347, 41491, 42946, 61427, 56680, 77962, 124369, 103922, 19887, -31851, 3648, -12024, -47249, -41262, -44143, -35076, -25148, 17240, 12044, -21651, 5294, 16359, 12252, 5800, 41697, 22548, 16790, -31893, -14220, 12913, 49031, 114357, 86015, 38245, -8017, -11459, 38001, 23599, 47633, 47033, 43052, 29384, 2968, 522, 17063, 5765, -535, -22160, -40429, -39967, -4732, 29626, 48245, 43808, 289, -28651, 4738, -876, 17059, 46396]
15931D6396k942M604L6169J981n3878M303m2403J868k7089K7279m511l8387J8536
15918b8074O901k3111j3220K2371K3021j484N936m2286n538J4564K641N4968K4445
15905D1134j8532m4230O887n000M6343O6520k8571l6142k278r305l940l6166M983
15892a8297k1920j2462K72P257R375j3602O819J0062k397N9130K4637l4998P16
15879A4592m5936o987L6217n2622K0550R042r494K7314n689K057l2743J5158O0373
15866C1832j632m1003m182L0873r825k5523n68P554k7664J2603L4653O891q931
15853E078L0322M7974l0179m4460l1654J8913J5678j663J4579K0561L7007K6968
15841A09124k8240m7136j2556J2282k4513l5108m3718l2541J9903K7102J0724
$$ y = [46396, 43454, 48058, 84227, 86208, 32330, 36633, -5770, -3902, -30991, -3712, -8223, -46610, -28074, -21173, -44284, -57504, -35133, -12112, -13596, -7660, -49946, -55484, -40920, -38279, 16689, 41134, 22602, -21628, -14741, -19741, 26602, 93122, 64551, 28409, 26131, 16826, 12886, -23280, -18297, -40217, -52679, -52407, -45150, -35775, -49377, -42558, -32496, -34893, 24237, 48874, 13876, 14592, -31344, -38331, -2114, -54736, -34186, -25144, -34638, -7324, -13013, -10956, -43699, -28541, 31832, 30200, -10803, -14985, 15888, 6063, -19460, -20028, -12474, -40138, -27535, 7118, 14009, 5078, 35400, 83374, 53195, 8735, -22919, -4006, 11672, 10009, 24588, 45149, 82156, 109124, 80884, 33748, 21192, 33474, 8961, -26147, -69865, -102406, -82503, -55401, -44677]
15830d4677j019L8974l747j6705L2415P563M713j0264J2798l4170n963r248j8701
15817d8031P935r287J6454M8947K905n091N379J7899J939j7218m3147k7517j2650
15804f1483j8353N654k1479J4663P8419L7571k6458k6745L2742l306Q036j4327
15792D934J6249L0809j1733L793j139k8789m4311l3831j5537l6137j6271J6082
15780a15881L9172O0769J947L837N5388r323p835k2026n4450j372M2493M2212
15768C4931j6605O920j0930k5744J1671j8926K7184j5181k756J3212J50l424O466
15755F968j1178r339l9053J8487L2958J1977r076j2652k5421j5943P402K8697
15743a6173M9398M4456n4214j4633m237j2809N0027K7762l6237o8070k3201l2102
$$ y = [-44677, -45696, -6722, -10469, -27174, 5241, 12804, 17517, 7253, 20051, -14119, -20082, -29330, -48031, -40096, -49383, -32929, 16018, 18923, 13832, 19211, 37110, 39049, 21831, -21316, -48833, -61483, -79836, -74182, -95661, -80998, -2579, 34992, 8534, -18211, 14531, 11225, 19261, 4934, 21183, 51992, 40259, 44052, 42913, 14124, -30187, -64018, -79555, -115692, -131963, -115881, -76709, -15940, -13993, -10156, 45232, 35909, 28074, 6048, -48402, -49774, -7281, 34931, 18326, 25246, 14316, -11428, 243, -18683, 8501, -6680, -9436, 3776, 3926, 502, 6968, -4210, -13549, -52602, -34115, -1157, 10820, 1744, -10908, -36329, -52272, -44870, -16173, 33225, 77681, 23467, 8834, 4597, -8212, 41815, 69577, 33340, -34730, -57931, -90033]
15731i0033N5004N162J0327O1651o207l8996l1992P534J2110k5753j3923k4263
15719g9379R274N587j354J1662R89L0351J7917K5282l1550m0365k080J9622P954
15706b6090k037Q091J4122j1902P284j0293j1975p773J8129M5112K6809J1071
15694F0548m3224k8761k2922l33L2397j085m1693J5320J8510K4328j4032n4193
15682e5140k3066L0548K536k3401k1643K3683J7885n742j698O7779N6049l8751
15670B9039m2276j26J2349L6453J3358l5632J8181L0772j6451j2364j1252j7239
15658D812m4230P844j7404P049J899j0007L7586O566L1759K5208r826n4057P531
15645e270L5489N743k7359Q835j1025n964n141j1543P534o0501J8411L9313n938
$$ y = [-90033, -35029, -29867, -19540, 42111, 35904, -3092, -35084, -27550, -15440, -41193, -55116, -79379, -70105, -64518, -65872, -54210, -53221, -22870, -4953, 20329, -11221, -51586, -53666, -34044, -26090, -28127, -20036, -5914, -17816, -10532, -20825, -32800, -40573, -22444, 22668, 49477, 60548, 17324, -11437, -34359, -34692, -2295, -3380, -45073, -29753, -11243, 13085, -947, -55140, -78206, -47658, -45122, -68523, -90166, -66483, -48598, -54340, -56038, 11741, 67790, 29039, -13237, -13363, -1014, 35439, 48797, 13165, 31346, 62118, 45667, 33303, 22051, 4812, -39418, -31574, -48978, -41929, -40030, -50037, -12451, -5885, 25874, 51082, 41256, -12801, -5270, 30219, 35962, 8603, 17438, 6413, 449, -4692, -16235, -8701, -69202, -50791, -11478, -17416]
15632a7416J1905Q819k4986m7525L2173O670K0029j515J3449j8984j3713M994
15620b6100N542L7011k5454P953K9987L215M969j5774k8229l593k3001J6423M605
15607a2446j0008J2331M9462L2998m3905j47k0940l4314q634q230k4495j3009
15595h1337k3259j0597O7856K1491k6861L493j0351M1657K9538N114Q286j9179
15583E851R849l1191k0426J8110O4099j8124j8555l6371K3424M6406j6964N062
15571C1170J8644j7591m3506l6769L4659L4055k547l9434J5242l8095j4547K9808
15559b8911l501J9033K876J1838j9813J232k3831m0414q72K4137K2172K5873K667
15546g514P064J1546L7313q057P915J7785J727m3252m1087l3934K1774M7722K8341
$$ y = [-17416, -5511, 3308, -21678, -69203, -37030, -30360, -10331, -11846, 1603, -17381, -31094, -26100, -20558, 16453, -9001, -1048, 28939, 32154, 37123, 21349, -6880, -10473, -33474, -17051, -12446, -22454, -10123, 39339, 72337, 28432, 28285, 7345, -26969, -35603, -43833, -68328, -81337, -104596, -115193, -47337, -25846, -52707, -49214, -59565, -17908, 11630, 16744, 25030, 5851, 15700, -15491, -35917, -17807, 46292, 28168, 9613, -26758, -3334, 43072, 26108, 31170, 49814, 32223, -11283, -48052, -13393, 20662, 18115, -21319, -6077, -44172, -58719, -28911, -32412, -13379, -10503, 1335, -18478, -17246, -41077, -81491, -82363, -58226, -36054, -10181, -7514, -450, 11096, 48409, 40352, 48267, 66052, 67779, 24527, -16560, -50494, -28720, 19002, 47343]
15533D7343O15l6950l7754K8680N1483n115l4179j1946K487K6118l523K3937p094
15520D4102r043L6148J6136j3148n8825k8535L884j4971J7477J4261J3672k9733
15508h575k9925J7566J4325m714l3648l2813Q996N9677Q039k2148N334r84Q304
15495a0566N075p0P491L0238k7975n197Q252j6051J6896j3892K3173M6707p951
15482E6130j7818O188m1931j584R327k0730k941Q937K761L6362J4339k4400n584
15469A9056Q383K0460P420L950j6935k2515J0512j988m7192L47L4537N296m6505
15456b5174j9004K4781J2379j3830j9332J942k0133j0312L7784L0562K249J6288
15444A8200q166O008j5601j3083n3553j7851Q795M753j2744m430N605L0695k1170
$$ y = [47343, 47958, 11008, -26746, 1934, 53417, 48302, 14123, 2177, 4664, 30782, 27259, 51196, 44102, 35059, 71207, 87343, 74195, 15370, -13165, -9281, -24252, -6775, 7486, 21158, -8575, -38500, -20934, -6609, -11323, -44971, -77784, -68788, -9111, -1072, -23220, -17886, -18870, -10566, -5491, -5561, 1930, 32168, 4193, -1004, 7248, -8803, 8093, -5799, 17374, 64081, 56130, 38312, 44500, 2569, 985, 10312, -10418, -13359, -4422, -1661, 34701, 49040, 24640, 19056, 27439, 47899, 55319, 59269, 42334, 19819, 30331, 28343, -18849, -18502, 16035, 21331, -25174, -44178, -19397, -7018, -20848, -40180, -38238, -58371, -68683, -30899, -337, 1912, 18200, 10034, 16042, 441, -12642, -66195, -84046, -75251, -70498, -83242, -87672, -82067, -51372, -72542]
15431g2542Q512l2633k3955M3085M5265l4316K4829O9098K4594k4240m8316k2838
15419d3457K4311J3181K4453R092k7848R367P217K8505k8113m8397J1515L3563
15407A3389O262K4859P775J1834M8049Q688k1035o9086k8986j4205l104J5252
15395c08J6510j0670k0172n346l0044j7860J1913L4846J5478L0365n400q815P151
15382A7648j4846n3240N40K7357M4448j5171j6328n301m0755k789J4294L3186
15370a0957K6970J0535k6753J099l8895q735J4737j7644L8470L6207l5403l0442
15358d0811j2089L195q957L8827N4479p406j6449N878p372k1097k7871k9637j5303
15345h4613J1115J6356J9549O0984K7752J4011j5996K537j5102j0441k4131R99
$$ y = [-72542, -64030, -96663, -120618, -77533, -32268, -66584, -41755, 27343, 51937, 27697, -20619, -43457, -19146, -5965, 18488, 27580, -268, 9099, 16316, 44821, 16708, -31689, -20174, 13389, 19651, 44510, 52285, 64119, 112168, 120856, 99821, 30735, 1749, -12456, -15560, -308, 16202, 5532, -14640, -19986, -50030, -67890, -55977, -21131, -5653, 24712, 19312, 10497, 17648, 2802, -50438, -49898, -22541, 21907, 6736, -9592, -14893, -55648, -58437, -44143, -10957, 16013, 26548, -205, 894, -38001, -46736, -31999, -49643, -11173, 25034, -10369, -40811, -52900, -49705, -58662, -19835, 34644, 27238, 10789, 16667, 9295, -11802, -39673, -69310, -84613, -73498, -57142, -37593, 23391, 51143, 65154, 49158, 51695, 36593, 26152, 2021, 3020]
15333C020n539k4227J1333j041J5354K2355j7350Q893M2127k5000o5357p563k030
15320d5025N770l9077j7136O7171P0334r303l9335l4791M7600j3360l7884j236
15308d6272L675j775M3588N1991k8384l0040J4246j1031m599r090k2228l8574
15296g8493J5964J2726n603M435J4915J5020l827p987K9312j3045J539l1643j9503
15283f6190J9516m943j0897O623j4991j31N199J6585j9160m568R301M8624K0977
15270E945l8308k0036K9850N5506k4191l9234J0011j3214j6625j8144k2025l052
15258i3517o1120M619N0697M0496j0057o319R001M139r416j175l5809j110M5327
15245f4244M191J2118j3162M6991J170J0222m5842q868M193K4771k3775j8099
$$ y = [3020, -2519, -26746, -15413, -16454, -1100, 21255, 3905, 12798, 54925, 29925, -35432, -42995, -45025, -39255, -78332, -95468, -28297, 42037, 32734, -6601, -41392, 6208, -7152, -45036, -46272, -42597, -44372, -784, 51207, 22823, -7217, 7029, -4002, -8601, -17691, -39919, -78493, -62529, -49803, -55406, -50971, -36056, -21036, -24863, -32850, -3538, -16583, -15044, -46687, -66190, -46674, -51617, -62514, -55891, -70882, -71013, -65814, -49229, -68389, -72957, -63656, -15032, 5945, -32363, -52399, -22549, 32957, 8766, -30468, -20457, -33671, -50296, -68440, -90465, -93517, -154637, -150018, -99321, -58825, -68882, -75201, -66200, -62061, -71477, -72652, -108461, -109571, -64244, -60053, -47935, -61097, -14106, -12936, -2714, -48556, -57424, -53231, -28460, -52235, -70334]
15233g0334K9444L6758p191M3455r194l1256j8277k0263P671K4061K665J7264
15221D803L4017K4990m574j6796k5346l0794k5094l1941j3925R2103K9027n2398
15209a5928M30k0976k3462K6618L8300N138P35K1548j090j2122J2166K8822J856
15196F2035o5096P900j7946k2842k921K4816J0716j561J6631J9935N266l603k0149
15183A3181p583M1602j440L5909Q550j6374J4750J2794n7815j4393k7739k1499
15171b0057m3917p893q849K1431N1180R353j0017j70j3006l999M7536j6004m1470
15158c5882j1392J7858J6753J8009Q532K4072l7083J808L5284J088n2402l2013
15146d5368L172j8132L4927J133O629N1233m618k0711l8800k4625o025J6741P1154
$$ y = [-70334, -40890, -4132, -11323, 32132, 22938, -8318, -26595, -46858, -39187, -15126, -12461, 4803, 38820, 63810, 59236, 42440, 17094, -13700, -38794, -70735, -84660, 7443, 36470, -15928, -15498, -36474, -59936, -33318, 4982, 10120, 10855, 32403, 31313, 19191, 31357, 60179, 62035, -3061, 4839, -13107, -35949, -38870, -14054, -3338, -4899, 11732, 31667, 36933, 33330, 13181, 5598, 47200, 45760, 81669, 90219, 73845, 88595, 101389, 43574, 29181, 1442, -20057, -63974, -71867, -80716, -59285, -8105, 1248, -8769, -8939, -21945, -25944, 21592, 5588, -35882, -47274, -29416, -12663, 5346, 13878, 37950, 867, 2675, 37959, 39047, -13355, -45368, -42196, -60328, -25401, -24268, -17639, 33594, 28976, 8265, -30535, -55160, -61185, -44444, 26710]
15133B6710L2702r768k8792J5511o778n6424l2541K8586K9222M4954K7852n9531
15121A1703m9297M0680L8257L5074M5711j3474n3195m599k3190j6801J4506k6062
15109f87j2495J5610R692L593j2795K1340J8501j5393m2271R119P413K279M5953
15096D9859N673k5259p124m1957l4932J3867M2065R814Q624m6480k1531k5330
15084g2711Q283l2764q487L0754K7260J9164J7549M9855L775P26k1767n3654O7258
15071C5241J5547k0385n8493j3142k8249J5869K0703O1586j5357n5129K0709L9839
15059A8739j7214n455k7j7244P124j0045L4474L0476P205J9184K202k4860j0426
15046C4133n3196K8220J3924j3416r64Q205o532j1851L7020N1833l1897m385j2310
$$ y = [26710, 59412, 49644, 20852, 36363, 29585, -26839, -59380, -30794, -1572, 43382, 71234, 11703, -37594, 3086, 41343, 76417, 122128, 108654, 55459, 50860, 27670, 10869, 25375, -687, -13182, 2428, 12120, 15713, 2918, 24258, 42759, 27366, -14905, -5786, 1627, 3906, 49859, 55532, 30273, 23149, -18808, -53740, -39873, 2192, 12006, 20630, -25850, -47381, -72711, -64428, -97192, -105679, -74925, -47665, -28501, -10952, 38903, 42678, 43404, 21637, -32017, 35241, 50788, 30403, -28090, -41232, -69481, -53612, -32909, 28677, 13320, -41809, -21100, 18739, 1525, -3930, -3957, -21201, -14077, -24122, 10352, 40828, 48033, 67217, 69419, 44559, 34133, -19063, 9157, 23081, 9665, 8701, 16906, 10374, -1477, 35543, 87376, 55479, 51094, 38784]
15033C8784j3859j7348l899J4050p916k8328k9397N1223N1301L770l8901o3077
15021d3597k5689M9442j1766j0866j6646N236J3283J2979J0755R885j7296M1759
15009A7479J9468m6606l1293K0752M601k5233k1551P997Q7294K5388m573K6268
14997G9991k9214l6664n3210P2q505N072P74J7973N5477J7024k1480m5718p0272
14984h8680J2419N8013L7651k365J22K0894n824m9624m2604j0888J51L2635J376
14971c6724k2117j2168M650m343N324K3014M334K123N545J7271j209j1843n3877
14958h0020L1307M8143M461l4821k4410M9157M2039l1843k3233r116n263J2917
14946b0682L4704l9293k5993m3125L6155K8524o784J7678J1115R657k939j6652
$$ y = [38784, 24925, 7577, 3678, 17728, 9812, -18516, -47913, 3310, 54611, 58381, 19480, -43597, -69286, -19844, -31610, -42476, -59122, -53886, -40603, -27624, -16869, -6984, -24280, 17479, 36947, -9659, -40952, -20200, -15599, -40832, -62383, -54386, 32908, 58296, 53723, 79991, 50777, 14113, -39097, -39025, -47530, -42458, -41684, -23711, 31766, 48790, 27310, -18408, -88680, -76261, -18248, 19403, 17038, 17160, 38054, 32230, -17394, -59998, -70886, -70735, -38100, -36724, -58841, -71009, -66359, -70702, -65378, -42364, -38030, -35907, -30362, -13091, -14300, -26143, -80020, -48713, -570, 3891, -30930, -55340, -6183, 35856, 4013, -19220, -28336, -33599, -20682, 14022, -25271, -51264, -94389, -58234, -29710, -36494, -18816, -7701, 1956, -983, -17635]
14934a7635K6595R924j4943R00k4290J2643K1499k0672J030l851Q182K8285L2758
14921F0425R297m212R908J8980n6292l844J3969o0078l7875K5857M2999J5060
14909C4194J6007J3799o194j9517l7615j1702O679J0896j5R205n793k741J4927
14896B2130P872l8410P372K6304J4713k1286L662K0610l547J0130k4429k9029
14884c908j4144l9701J5509J1945J978K5460j4110l5178P641L9153J0372k3116
14872a8099o80l367j6752l385M891J8088P719j7551k6863j4835K2266P546k109
14859d3131J2807j0659p209k1346O6432M6333m2593l2601J4255k041j6751J6383
14847b0121k2030N737o898Q412J7444K1778N862k4500n982J1318j5078p651Q476
$$ y = [-17635, 8960, 18884, 3941, 4841, -19449, -6806, 14693, -5979, -4949, -8800, -618, 27667, 60425, 69722, 65510, 75418, 94398, 38106, 34262, 48231, -11847, -49722, -23865, 19134, 34194, 50201, 64000, 57806, 38289, 674, -11028, -4349, 6547, 6532, 15737, 9944, 7203, 22130, 30002, -8408, -1036, 25268, 39981, 18695, 22357, 42967, 39420, 49550, 25121, -3908, -18052, -57753, -42244, -30299, -28321, -2861, -16971, -52149, -44508, -5355, 5017, -18099, -18779, -22146, -38898, -42283, -37392, -19304, -11585, -29136, -55999, -70834, -48568, -41022, -43131, -30324, -40983, -48192, -69538, -3106, 43227, 634, -31967, -17712, -19753, -36504, -20121, -42151, -36414, -43312, -34900, -17456, 4322, 10184, -14316, -20298, -8980, -24058, -31709, -23233]
14834b3233K5429j1725k7666J690O588L6490n912k2291k1705j4067L486K5431
14822b7485L4106N6649P343k9600l3229j2783j456O506J0685J8453K0304k1036
14810B8457k789l3046j9413q747K6675J0770j348n030K3361J8341P708j1953j8849
14797A4137R619J6917r999k0719j5854J2249J7476o287J7970k3761j7884l3876
14785d0012k5580o950O0935l1151J5059J3670K4137j1640R967k059j555O508J4524
14772B5853n0174k3600j6220K332M3660L0533R632j2267M3495j5664j4942J6373
14760C9011j801K274l0457l4276j9149L8461j3806J0892j9527K5q754J1968K2834
14747b305K206L5897L058j9141n524k6181K259K601J1953P863j009j4371k5575
$$ y = [-23233, 2196, -9529, -37195, -35505, -28917, 7573, 1661, -20630, -42335, -56402, -52916, -27485, 6621, 63270, 70613, 41013, 7784, -4999, -6455, 51, 10736, 29189, 49493, 28457, 25668, -7378, -26791, -35538, -8863, 1907, 559, -4471, 18890, 37231, 44939, 32986, 14137, 23756, 40673, 30674, 9955, -5899, 6350, 23826, 17539, 35509, 11748, -6136, -40012, -65592, -72542, -11607, -42758, -27699, -14029, 10108, -1532, 8435, 6376, 4821, 11329, 25853, -24321, -47921, -64141, -61809, -18149, 12384, 22016, 9749, 53244, 37580, 22638, 39011, 37210, 39484, 9027, -25249, -44398, -5937, -19743, -8851, -28378, -28353, -37107, -25139, -2305, -99, 35798, 38856, 19715, 14191, -11990, -9731, -7130, 4823, 12686, 11677, -2694, -28269]
14734b8269j8082L2750q162K1364k1010k1608J2922O576K7330j9832j0252o695
14722c2968J707j7842K397M8565J3908k2316l2506q763K5826l0433K37M7914j9251
14709b3525K523L0355M5841l562l08j6980n8753k3963P541M5508p783J55j7053
14696b0004k5887j331L6361K1503l5288m218k6542M115K4947j1236j0473Q924
14684c9129K6729L0648M2687K107l2276l5283k0307k4229j2350J125J2036K0934
14672b7308N3931K0949l3927m0670n177K764M783L0335k2479j1794q045m89l337
14659d0464J7061L019j6984K0331J8223N565p402M398j4477r221R568R899J0144
14646I660L5144l0665l8297l068K8596J9545M959L600l361L1165k6764j9416K977
$$ y = [-28269, -46351, -13601, -21763, -399, -21409, -43017, -30095, -23519, 3811, -16021, -26273, -32968, -31261, -49103, -46706, 1859, 15767, -6549, -39055, -47818, -21992, -52425, -52188, -4274, -23525, -21002, 9353, 55194, 51632, 51324, 34344, -24409, -48372, -40831, 4677, -3106, -2951, -20004, -45891, -47222, -10861, 10642, -24646, -28864, -55406, -51291, -26344, -37580, -48053, -39129, -12400, 18248, 60935, 63042, 30766, -4517, -24824, -49053, -61403, -60278, -48242, -27308, 26623, 47572, 13645, -27025, -32202, -29438, -24655, 5680, -16799, -28593, -36638, -37127, -40464, -23403, -20384, -37368, -17037, 1186, 6751, -651, 3747, -10730, -19951, -10383, -484, 9660, 44804, 14139, -24158, -27226, 1370, 20915, 25874, 29474, 26113, 57278, 30514, 11098, 14075]
14633A4075j4294Q882J1392p862P400L1190K9065l1813n4245n5716K0402M6478
14621D954k7698K3642L87k2938J1978j2447k8633K0171L0898M920K0505K9449
14609E5188m7891m8015j8270J419K7211J5257J7202M582Q537o3655M547K0994
14597b2894L3479K5989M428k9404m1812m105Q056j0773N646L2196j5260L9834
14585B5380k5520r10J6249K8372p620j4327R217q916j8030j2507j5466K1057R988
14572F967k4132K5543J8200J844j7336J676P283N693l0096j0635J9257L581k7253
14559a9408N113l548p230j4130J7681K0897J4554J7672k9590k2806m7286J5288
14547e2793p835P901M390K1351O459r844K300L0575Q321k8143j1307k7186M74
$$ y = [14075, -219, 8663, 20055, 12193, 19593, 50783, 79848, 48035, -6210, -61926, -41524, 4954, -22744, 898, 1285, -21653, -9675, -22122, -50755, -30584, 314, 5234, 25739, 55188, 7297, -40718, -58988, -57569, -30358, -15101, 2101, 6683, 15220, -48435, -43888, -22894, 10585, 36574, 41002, 11598, -30214, -34319, -26263, -37036, -31390, 806, -14454, 25380, -140, -1050, 15199, 43571, 35951, 21624, 30841, 21925, 3895, -8612, -24078, -3021, 6967, -17165, 8378, 26578, 28422, 11086, 12762, 20045, 25738, -4358, -14993, 4264, 7845, -19408, -14295, -17843, -25073, -39203, -21522, -625, 13929, 31601, 2011, -20795, -68081, -52793, -60628, -52727, -48337, -26986, -20527, -30371, -28071, 2504, 10825, -17318, -28625, -55811, -55337]
14534e5337N0600N6381j6841j2634K6062R944l1530J6019N572l373P847j79m7635
14521D896Q186Q587J4532M9299M9157O989k6932p0021m3169m6867n3036K2593
14509g5786M5887N3526J1890L3254j0519K1423l3352l1842k5935l6749K1747J8843
14497g613o869P543j1550j9769J641K232l4334l49j667J2232k001K2757J9261
14484a8486O493L4668L1480q805k2282k5650j0665k4904j4288J7571J3129L7853
14472A6114P618k6812J0134L9997K378k513k2537n744J7814L5118K0894K3824
14460A16285l970m5841k0213J7035R927k5915J4732K5524M938j7757Q682M5449
14448A28876m122M169j2262O671n5239m557n496m6346J2249M2752j4624J6560
$$ y = [-55337, -4737, 51644, 34803, 22169, 48231, 58175, 26645, 42664, 48236, 44863, 52710, 52531, 4896, 13082, 21669, 36201, 85500, 134657, 141646, 114714, 44693, 1524, -45343, -98379, -75786, -29899, 23627, 35517, 68771, 58252, 79675, 46323, 14481, -11454, -48203, -26456, -7613, -14482, -6939, -18489, -38258, -36617, -34385, -68719, -69068, -70735, -58503, -60504, -37747, -18486, -11993, 22675, 54155, 45350, 23068, -2582, -13247, -38151, -52439, -34868, -21739, 16114, 23732, -3080, 7054, 47051, 49429, 46916, 24379, 18635, 36449, 71567, 92461, 116285, 112315, 66474, 46261, 63296, 73223, 47308, 62040, 87564, 92502, 74745, 83427, 128876, 124754, 128923, 116661, 123332, 68093, 63536, 58040, 11694, 23943, 66695, 52071, 68631]
14436F8631L7002J0626P5K3852K0700k0656l6106O156O220l4934m428k7135P790
14423E7793O32l6618j0782K4564j7338n16j4024j5247J3269j0365k642M663K9907
14410B3296L405L6307k4109k4963l3633m2207J6744M4279P652K3417j3960m9341
14398c3113J0547l998j268J7891M3541K3827k7554q8200l3906J3178M1719J8881
14386a8455N311K0354J6185M921l8369m7865J1794N4038M2098n0106l7951J5131
14374b2914J4932L3617J1496J0252k3290k0621N361L738m4144k4441l6899k1574
14362a14487M7032M4422K4580J6692k2734M171j910k8923R253K4356j9520l162
14350b0230j8759J1901M1972K4168N966k5961k7731K4642m014N2962L2056m808
$$ y = [68631, 105633, 116259, 116334, 140186, 160886, 140230, 104124, 110280, 116500, 81566, 77138, 50003, 57793, 58425, 21807, 11025, 35589, 18251, 17735, 3711, -11536, 1733, -8632, -11274, -6611, 23296, 26701, 63008, 38899, 13936, -19697, -61904, -45160, -881, 6771, 30188, 16228, -33113, -22566, -26564, -27832, -9941, 33600, 57427, 29873, -58327, -92233, -79055, -37336, -18455, -13144, 7210, 23395, 28316, -10053, -57918, -46124, 7914, 50012, -94, -38045, -22914, -7982, 25635, 37131, 47383, 24093, 3472, 8833, 12571, -31573, -56014, -92913, -114487, -67455, -23033, 1547, 18239, -4495, -324, -2234, -31157, -21904, 2452, -17068, -20230, -38989, -27088, 14884, 39052, 45018, 19057, -8674, 15968, 11954, 64916, 96972, 92164]
14338I2164p3317k9492l917m472p904J699j5676J9543K0010K5283k7617k3638
14326b7334L910j6964M711O01k8966L4305l562J8806K0004n613k1946k2745l6994
14313h1787M0559J5728J3097J4940l0842m0966L9282L6657L029p664K3598k6571
14301i40m1154J0754M7462k770k5668M6815L2319o4168j8779j973J9293q960r398
14288a7167o596j1918J9378K3736r153L535J4687M912m381K928Q003k593k8324
14275b953j4982l8069m714L001j0758K2284L0090K9403M254r350J9149n105J4287
14262C6537M49k3331M290l7725L638r450r746J369l601J7293J8694J8695P113
14249B4225k5856k1272N5745M9965m8768m2010j2314k2685J4537k339j141l970
$$ y = [92164, 18847, -10645, -14562, -19034, -26938, -25239, -40915, -21372, -1362, 23921, -3696, -27334, -23424, -40388, -35677, -35076, -64042, -29737, -33299, -14493, 5511, -102, -22048, -44793, -81787, -41228, -25500, -12403, 2537, -28305, -69271, -29989, 6668, 9697, 2033, 25631, -940, -42094, -31340, 16122, 13352, -12316, 34499, 66818, 2650, -16129, -18102, 1191, -7769, -17167, -23763, -35681, -16303, 7433, -1720, 1815, 16502, 21414, 17033, 19961, 27964, 25371, -2953, -17935, -56004, -60718, -57717, -68475, -46191, -16101, 13302, 17556, 8206, 27355, 22250, 36537, 36986, 13655, 17945, -19780, -16142, -25592, -35338, -33969, -37570, -20277, -1583, 17112, 24225, -1631, -22903, 32842, 82807, 34039, -7971, -20285, -42970, -28433, -30772, -31913, -35883]
14237c5883J8139M0362K0261l4582m7270j2917J4333K9842j4386n955J9488j1334
14225a9902j964K8347N776m9585l5246L7662N4193j9562l4504j8612O866L3779
14213a2752K7318J7840N721J3474Q060p047m846n603r872o371k4928j1389J320
14200i075L3917R676m7347j5244J2701J9341j9020M6059J0222k8866K3455j0087
14188B5732k4973L37j148m8180Q342K6313l4831J9779O0360J8370n9476k1125
14176c0500l1466j4929J1469M3945J2885l0193R431P856l6270j8797M589M3500
14164b8480J8121M928J0015k4962J674L3159K5058M822k2920m0728J7465k102
14152c950j9814j2472j4129m35K0113M7923K7623j9744j2286m5688k2498L2775
$$ y = [-35883, -17744, 22618, 42879, 8297, -38973, -51890, -37557, -7715, -22101, -28056, -8568, -19902, -21866, 6481, 12257, -37328, -72574, -34912, 19281, -281, -34785, -53397, -46531, -12752, 14566, 32406, 38127, 51601, 59661, 52614, 47768, 42165, 32293, 25922, 994, -10395, -9075, 24842, 34518, -12829, -28073, -15372, 3969, -15051, 31008, 41230, 12364, 35819, 25732, 759, 1096, -52, -48232, -39890, -13577, -48408, -28629, 31731, 50101, -9375, -30500, -61966, -76895, -65426, -21481, -8596, -38789, -29358, -21502, -57772, -76569, -71980, -28480, -10359, -5431, 4584, -20378, -18704, 14455, 39513, 44335, 21415, -19313, -1848, -3950, -23764, -36236, -50365, -50800, -30687, 17236, 44859, 25115, 12829, -32859, -55357, -22582]
14140b2582K2990l3528j7797l520K4158J5234m2085m045J5269J1571r97K7693
14128g639j8091J933k5049m0677P445L811M3914j4331l0666N260K5295l851k5294
14115g7940K963J8476K4060M8558L729n561m417l1703l5009k8940J7576J0999
14103e7209K6835L3721m3596k4363N8139M6830J4901j0313J5336N868j2605l0924
14091B2620k8789k7572j9239Q197K8893L6232j9098k9944k9980k151J6204k5583
14079g0210j205L9131l248J5103K7221k5080j3579K059J3583N0660j7321m4439
14067b7325P090j292O2569L1313k034k1529k3672l6093L1655k3086k6296j6594
14055d5294M0545K6299q941J1180l0331k5162k2067M184R171L972J445J629j4433
$$ y = [-22582, 408, -33120, -50917, -54437, -30279, -15045, -57130, -61175, -45906, -34335, -35332, -7639, -25730, -23797, -48846, -89523, -82078, -78267, -34353, -48684, -79350, -74090, -48795, -52646, -77940, -74977, -56501, -32441, 16117, 19846, 14285, 9868, -21835, -56844, -85784, -68208, -57209, -30374, 3347, -40249, -64612, -6473, 40357, 55258, 44945, 60281, 66149, 53544, 22620, -6169, -33741, -52980, -44783, -15890, 20342, 1244, -28700, -58680, -60831, -44627, -70210, -71415, -32284, -35532, -20429, 6792, -18288, -31867, -29808, -16225, 34435, 17114, -27325, -20235, -21527, 41042, 72355, 70321, 48792, 25120, -10973, 20682, -2404, -28700, -45294, -4749, 21550, 12609, 23789, -6542, -31704, -53771, -49587, -40416, -36444, -34999, -33370, -47803]
14042d7803l41n681Q616r143n959K6134K502l5828M5707L7571J2137k7835k0902
14029b0825l6136R627L0418N7220j053l2654p450J3909N21J7477L1637J0090m3370
14016B9411o4r386j8129J4269k187n430k5481O890J6731J671j6605j7742m888
14003c0940K7689j0452k8732K8050K3285j0630J5977o0809q038K3979J8277K1868
13991I524k056k8281J7930L0664o857J1631J7616L7255j5954m5547m1082L53k586
13978a7390L7020j036l7954K0294j0627m2700K9692j2316j1597R834k3687k4463
13966h4930K959L9527M5045J9598n0127j0942N8355N022J1111L0083n0720n1249
13954c6268k0309L2550K6991k4056J6667J3665K3285J8484j4311K0081j3335k2198
$$ y = [-47803, -48144, -53825, -45209, -54352, -60311, -34177, -31675, -67503, -21796, 15775, 27912, 77, -20825, -56961, -47334, -16916, 40304, 39251, 6597, -853, 13056, 13577, 31054, 62691, 72781, 29411, 29347, 19961, 1832, 16101, 13914, 8484, -16997, -10107, 6624, 8295, -8310, -26052, -30940, -3251, -13703, -42435, -14385, 8900, -1730, 14247, -46562, -54600, -30621, -12344, 9524, 7468, -20813, -2883, 27781, 20924, 32555, 50171, 87426, 71472, 25925, -15157, -14804, -17390, 19630, 18594, -19360, 934, -9693, -52393, -22701, -35017, -46614, -36780, -60467, -84930, -81971, -42444, 2601, 22199, -27928, -38870, 19485, 24507, 35618, 65701, 14981, -36268, -56577, -24027, 2964, -21092, -4425, 9240, 32525, 51009, 36698, 56779, 43444, 21246]
13942B1246j9151l2676l8234M3506J4812J2459M219m4971m5002l5037M220O4034
13930e0575P990j1916q050L5137M2661m3863k0897J6615j6524L1951K7269K6393
13918C6191r593J3567K1661k9222k5241m342j026R417N312j8319j4727K0437O53
13905D768P944J3509j9798J7906l8902m8504O136j3747l7670J4313N8510P774
13893b7761l9005r052J7534k5117l6023J4953M7952L5793J9337j5425J2997L5915
13881C2098K780m953p267k2947k423J618k366J4640m030L2518Q455k6400O721
13868B8444j4809K8337O658j6323k3178M852J9249r221j1040O901j3309J2267
13856A8828K3326R953k1493o282M1357n06p1359j5373L1812N8708K9294j1681
$$ y = [21246, 2095, -30581, -68815, -25309, -10497, 1962, 6181, -38790, -83792, -118829, -114609, -50575, -42585, -54501, -62551, -27414, 15247, -28616, -49513, -32898, -49422, -17471, 9798, 36191, 26598, 40165, 61826, 32604, 7363, 3021, 1995, 11412, 16724, -1595, -16322, 4115, 4768, 12712, 26221, 6423, 24329, -14573, -63077, -56941, -70688, -108358, -94045, -35535, -27761, -66766, -75818, -58284, -83401, -119424, -104471, -56519, -20726, -1389, -16814, -3817, 32098, 34878, 29925, 22658, -289, -2712, -1094, -3460, 11180, 7150, 39668, 48123, 21723, 28444, 13635, 41972, 48630, 32307, 9129, 13981, 33230, 24009, 12969, 19870, 6561, 18828, 42154, 52107, 30614, 24332, 65689, 65183, -6176, -21549, 10263, 68971, 98265, 86584]
13844H6584o3559j9846J0592k0722o490R540k2478j5120p349j9506L2626o266
13832d1994o2975m536M7354M9615j2865j481k1399J6364Q516j7842N9050O2519
13820H0326j8190j557l5161k4379l0724j4740J1276K7787K8660K724j7444J097
13808I675P560l3016k69J7178J062l6012k6474J5493o226j14J7237M8151k5463
13795a1218j5349j2169m1041l979J1546J0867K1848l589J4294L081R427R599K0733
13782A4050j4776n8344l0187L8640N3455P923k2741q134j633K2644K6957k3314
13770D540P689J7978l5936p99j1707r292q998Q110K1520L661K796n3164j4695
13757f8297O3805M4639j7485l9209J5141l3871j4237N7578K6047j5122k874j1998
$$ y = [86584, 23025, 3179, 13771, -6951, -13441, -3901, -26379, -41499, -48848, -68354, -35728, -41994, -104969, -109505, -62151, -12536, -25401, -26882, -48281, -31917, -23401, -41243, 17807, 80326, 62136, 60579, 25418, 1039, -29685, -44425, -33149, -5362, 23298, 26022, 8578, 9675, 17235, -15781, -16050, 1128, 2190, -33822, -60296, -44803, -51029, -51143, -33906, 14245, -11218, -26567, -38736, -79777, -83756, -72210, -61343, -39495, -43084, -28790, -25709, -16282, -6683, 14050, -726, -59070, -89257, -50617, 2838, 10761, -11980, -20114, -21747, 897, 27854, 4540, 12229, 30207, -5729, -6528, -18235, -27527, -36525, -28415, -6895, -3234, -438, -53602, -68297, -4492, 40147, 22662, -16547, -1406, -35277, -49514, 8064, 34111, 18989, 16115, 4117]
13745D117j3375r214l164j5460n4920j3624L9665L0228L0833K7971O252k3619
13733E690m2138j0507J8794J8444K9454L8717N348m8979P804K1135P157o2139
13721a1220n1809L2546J0894J9500M4921N6321k6929l2076k1761K516r417j0417
13709C069L7822J7311o884j8757k8188l2308q473J2820J475K9367J1472J202n120
13696A4808K889N517J7198K802p7630k296M6280m086j978j309j1071l0581L5513
13683c944K2451n0863o2636K5793M1811K0038M2439L3199m2825l7714M620J2193
13671D562K7253l1350P906k738M650l9831k1440l757m0319L3518K6319K1024p997
13658b2200j6856l1542L1408o440L0479J3576j8108r631o25l9999k65N2645O729
$$ y = [4117, -9258, -18472, -21636, -37096, -92016, -105640, -65975, -35747, -4914, 23057, 29309, 5690, -36448, -46955, -28161, -9717, 19737, 58454, 63802, 14823, 22627, 43762, 50919, -11220, -63029, -30483, -19589, -89, 44832, 101153, 74224, 42148, 20387, 22903, 13486, 3069, 40891, 58202, 51318, 32561, 4373, -27935, -36408, -23588, -22113, 7254, 18726, 19928, 14808, 17697, 23214, 40412, 43214, -34416, -36712, 9568, 5482, 3504, 2195, -8876, -39457, -3944, 18507, -32356, -94992, -69199, -27388, -7350, 35089, 68288, 25463, -12251, -7631, 4562, 31815, 465, 8371, 5633, 10283, -29548, -50988, -54745, -95064, -61546, -35227, -14203, -22200, -39056, -70598, -39190, -45630, -15151, -1575, -19683, -29314, -29939, -69938, -70203, -17558, -10829]
13645a0829M0033K0844r019K0835N798J0319k6922R988J2791j0327k7137m0751
13633d377M0916N168k3161j2791j0613j6502j2471K9408L1661N131P393k5240
13621A4522k6333m6514l8161M054O6104R915o088M4445J6594K46k6277J1485L6392
13608F0384j2958r985L6495q45n2009j9262R560l3872k4508M3341P8090N5913
13596A30344m5287m4525M84k4298j1802J6415Q54k6720k0766Q72N8943L6916j853
13583F9577k1924l4958l2148J0029K2876j8507j800K7295K7303J3899k2899n4696
13571a5953k6178J7962o924j7892L2389M8767J3316r840m1787l877K5298j8908
13559c627n7700j0335J9869J8134o021o12L0743k4371r832L8333L7884l4253k0996
$$ y = [-10829, 29204, 50048, 41029, 61864, 67662, 77981, 51059, 61047, 73838, 63511, 36374, -4377, 36539, 41707, 18546, 5755, -4858, -21360, -33831, -4423, 27238, 32369, 39762, 14522, -11811, -58325, -96486, -92432, -26328, -16413, -22501, 21944, 38538, 38784, 12507, 23992, 60384, 47426, 37441, 73936, 73091, 21082, 1820, 11380, -22492, -47000, -3659, 74431, 130344, 85057, 40532, 41016, 16718, 4916, 21331, 22185, -4535, -25301, -24429, 34514, 71430, 69577, 47653, 12695, -19453, -9424, 13452, -5055, -6855, 20440, 47743, 61642, 38743, -15953, -42131, -24169, -31093, -48985, -16596, 32171, 45487, 35647, -6140, -10017, 15281, -3627, -61327, -71662, -51793, -33659, -39680, -40292, -9549, -33920, -43752, -5419, 32465, -1788, -22784]
13546b2784J2341K7597M500J1733L3263R636o873k0921K611M6218m721m1945k9452
13533B1203n0705M7828o192o008m69k2260J4053q867n561j3678K151k293l2756
13520f3554O854K9388J2345P662L0169m888m6663J211J1500j5597q397k739K7448
13507a5261L0734L0026K4691k2158k1105l2808j4482L1872M1046J4572k0590l6944
13495I593j0457p06m5005J6979N4845K6238p619l3665k22R389M6432J356n369
13482F1789o497K9067k3543k1866l5280j6201l5336p302K9758L7326m9273j1154
13470d8512M0287J9391p035k9972q927q196P398K8065J3185L3364k0172k5259
13458f383J1448r710j2340J1167q391M016K22J3551J6320K3313l0054p036J5602
$$ y = [-22784, -10443, 17154, 21654, 33387, 66650, 76286, 69413, 48492, 51103, 97321, 92600, 50655, 21203, -29502, 18326, 12134, 6126, 5657, -16603, -2550, -11417, -16978, -30656, -28505, -30798, -63554, -56700, -27312, -14967, -7305, 22864, 17976, -28687, -27476, -15976, -31573, -39970, -42709, -15261, 15473, 45499, 70190, 48032, 26927, -5881, -20363, 11509, 52555, 67127, 46537, 9593, -864, -1570, -46575, -29596, 25249, 51487, 43868, 10203, 9981, 19370, 65802, 67158, 61789, 55292, 84359, 60816, 38950, 3670, -12531, -47867, -55169, -25411, 11915, -37358, -48512, -8225, 11166, 4131, -25841, -34768, -42964, -35566, -7501, 5684, 39048, 18876, -6383, 5065, -4645, -16985, -5818, -14209, -10193, -9971, 3580, 19900, 43213, 13159, 6123, 21725]
13445B1725j4387p982k2320O5549K6175j1307L0893J8173l2558m3108l4272j0895
13433a4314q673K6691j3224n5577k6928j4296O8059K5148M0131k3642k8427K7103
13421B051o286j5358r12K5044O389j112k488o663k054j8506L4303p685J6802K7612
13407E1137P797m574M2452j562m076l2708K3299K9145l0432o2306M050M0800K9776
13394I2798k879K1760l4807n5605J9955K4614K452l2408L1321K4336l1302m2014
13382A8221L3949L5509K1211K6503k1188P29p967J2136L1726P2927M3129L7831
13370C04716O8573R8717Q9613J70334K35208K44057K86592K00896J83059j2296
13360A869469l45230l62769k52387k19549j18786j21966o9900n6538n2428q652
$$ y = [21725, 7338, -644, -22964, 42585, 68760, 57453, 88346, 106519, 73961, 30853, -3419, -14314, -22987, 3704, -9520, -65097, -92025, -106321, -38262, -13114, 27017, 3375, -25052, 2051, -4235, -19593, -20505, 4539, 10928, 9816, 7328, 665, -1389, -19895, 14408, 6723, 23525, 51137, 58934, 54360, 96812, 95250, 91174, 58466, 81765, 110910, 80478, 18172, 22222, 63022, 92798, 89919, 111679, 76872, 21267, 41222, 65836, 68288, 35880, 67201, 91537, 60235, 18221, 52170, 87679, 108890, 135393, 114205, 114934, 106967, 119103, 150829, 223756, 266885, 304716, 373289, 472006, 561619, 731953, 967161, 1211218, 1497810, 1698706, 1881765, 1869469, 1524239, 1161470, 909083, 689534, 570748, 448782, 378882, 322344, 269916, 261264]
13350B61264k042J2709J4686l6243p852k0795m1945K6602j411l3212K7596k3585
13338A75772j7259p029m9617m4502M5324m456p770M049o841l793Q738M1648N783
13325A40047J4412j8026j8827m9301N434k597k8169k9342j4306M1762M7946r091
13313G9942j1424J3660k422l3669J0193N795l0673L6877j4349m2646j1718J5271
13301A4837M7500J6102m869K6334k7785K8167j6134m6872k0835J3308o790j4822
13289H141L5730J9335J9941m6133l6942n0329J1951M6053J1009K0777N5121j8234
13277G6420j0990K6280J964m098j8405j5267p008m295k7912k3465j3457K6532
13265F299k7700M0049M1340J7297l7020L852m591n3831k1017Q249K2763L2194
$$ y = [261264, 259222, 271931, 286617, 250374, 242522, 221727, 179782, 206384, 204973, 171761, 199357, 175772, 158513, 151484, 101867, 57365, 102689, 98233, 90463, 94512, 87671, 83878, 92616, 134264, 140047, 154459, 136433, 117606, 68305, 73739, 71142, 42973, 13631, -675, 41087, 89033, 79942, 68518, 82178, 79756, 46087, 56280, 62075, 31402, 68279, 53930, 11284, -434, 14837, 62337, 78439, 73570, 99904, 72119, 100286, 84152, 37280, 16445, 29753, 22963, 8141, 43871, 63206, 83147, 37014, 72, -50257, -38306, 7747, 18756, 39533, 94654, 76420, 65430, 91710, 93674, 89576, 71171, 55904, 48896, 44601, 16689, -6776, -20233, 6299, -21401, 18648, 59988, 77285, 40265, 44117, 39526, -14305, -35322, -27073, -4310, 27884]
13253B7884P225J9297k805j9889o1754j4661P812j4494K0996M870K9450L4331
13241C8262j6520k5624K972r313K7901j3887J16j0243Q42j2009j0247K3230K031
13228b489J8344J3398K772n038J4076q518m814J4596j162j7108q66k5652j7380
13215a9841K4579n521j7488K0584J5909K3758J569o010n3770l0522K4610L9023
13203A6880R151J6547k1996n1854j7565L4637o420j9163j6354L1228q56l0731
13191e6496j2938j5249n703M5181Q502P821J0775J5639P624J0613o824L649N3131
13178F5725J5617m2238K9499M214j7580p058R061N0259P383l3614l362j5342j2191
13165E0373K5760j750K5110M5234l3513J5944M7355L1386J13M5789K106J6384
$$ y = [27884, 35109, 54406, 51601, 31712, -30042, -44703, -36891, -51385, -30389, -25519, 3931, 38262, 21742, -3882, -910, -10223, 17678, 3791, 3907, -6336, -5494, -17503, -27750, -4520, -2489, 15855, 29253, 32025, 26987, 41063, 32545, 27731, 42327, 41165, 24057, 23191, -2461, -19841, 4738, -783, -18271, 2313, 18222, 41980, 43549, 37539, -16231, -46753, -22143, 16880, 26031, 42578, 20582, -31272, -48837, -14200, -20620, -39783, -56137, -24909, -25765, -56496, -69434, -84683, -90386, -45205, -36703, -28882, -18107, -2468, 5156, 15769, 8945, 12594, 65725, 81342, 39104, 68603, 72817, 55237, 48179, 57240, 107499, 114882, 81268, 77906, 62564, 50373, 76133, 74383, 99493, 144727, 111214, 127158, 174513, 205899, 206012, 251801, 253907, 270291]
13153B70291j6515K1818K5691m2063j3932l144m0484p0927l6945J3396Q949J5042
13141A31177j1950m2004N891j7898m41J8887J3716L04l1972l2474k8690L4168
13129C8714M0010j0212m435m979p569M0798q492l8249j6363J0572J1982L4562
13117H6339j7315l1273K317j242k9478J9514M7125O080Q344k9534j1565L8890
13105H8202K0575k2458M315O565j1042o493r298j7629R438L3926k4736K042L2187
13092A05594j8168Q250j4584J432J0414k0518J027j0221j7520o0821k8928K2787
13080b1256K5018R788p414K3373M2745K2597J0005K7199r82l930j4930J816o033
13067A07996l6945l4216L6529j0447k1147O3536N8277j819L944k8448l4371J4465
$$ y = [270291, 253776, 275594, 301285, 259222, 245290, 242146, 201662, 130735, 93790, 107186, 116135, 131177, 119227, 77223, 83114, 65216, 64775, 83662, 97378, 97682, 65710, 33236, 4546, 38714, 78724, 68512, 64077, 59098, 51529, 92327, 83835, 45586, 29223, 39795, 51777, 86339, 69024, 37751, 40068, 38826, 9348, 28862, 75987, 82067, 90411, 60877, 49312, 88202, 108777, 86319, 90634, 97199, 86157, 79664, 70366, 52737, 62175, 96101, 71365, 73407, 105594, 87426, 95676, 81092, 82524, 92938, 72420, 73447, 63226, 45706, -15115, -44043, -21256, 3762, 13550, 6136, 29509, 72254, 94851, 104856, 132055, 131073, 127143, 112213, 114029, 107996, 71051, 36835, 73364, 62917, 41770, 105306, 163583, 161764, 165708, 137260, 102889, 117354]
13055A17354M056L8851n78k1936k2279N5899j8564m8033l6992j4271J5075L7265
13043A05847K9408J6392k9829J2873Q996k1114l6745J9901L4475L5655Q149K0255
13031B04263N1740K2875J649L0121M9172L923M1621j4253M0321M3321J8089k8860
13019D63982l9241r989K7036J4308M385L090L533L6094j7689l801M2430J3523
13007E37661J2340O9650L5525K0874q481k6908P425K6005P690J4166j6894q434
12995F70619j1783j0313J29j2367P770o523m8872l5360J5195Q301l132K0179P325
12982F01168j8966q759j0228K382k3946N0930R098K3860K4622L822j5394L8870
12970F77459J05406M0968j3451j0715O2121N3632J6457L6691K4450J2355L4684
$$ y = [117354, 121410, 160261, 159683, 137747, 115468, 171367, 152803, 104770, 67778, 53507, 68582, 105847, 135255, 151647, 121818, 134691, 143687, 122573, 85828, 105729, 140204, 175859, 184008, 204263, 256003, 278878, 280527, 310648, 359820, 363743, 405364, 391111, 431432, 474753, 492842, 463982, 424741, 414752, 441788, 456096, 460481, 463571, 467104, 503198, 485509, 481708, 524138, 537661, 550001, 619651, 655176, 676050, 667569, 640661, 648086, 674091, 681781, 695947, 679053, 670619, 658836, 648523, 648652, 636285, 644055, 637532, 588660, 553300, 568495, 576796, 573664, 593843, 601168, 582202, 573443, 563215, 565597, 541651, 592581, 601679, 625539, 650161, 653983, 638589, 677459, 782865, 823833, 810382, 799667, 861788, 915420, 931877, 968568, 993018, 1005373, 1040057]
12959A040057K9515P073N6331P9099J6670J5527N0377M4660K0712N8266J16876
12948A535163Q9843N5313O4745L8753R0017J14452N1279N9951R6407M7311O6963
12937B310197J59309J96526J43263Q8661J06078K00055K43209K95879L36141L65852
12927D445170L81836L95606M39207M23223M72141M95140N49810O79630Q47586
12918I129349J031791J274559J562740J891486K254821K590358L100939L893569
12910B6729612M695392N800203P980831J1324636J6368743K4173695L5454225
12903A32527337M8357763N4382790M6185443M3087365M2179189j1640615p5771357
12896B79307915p1233625m7789444l1271817k1928209j6657878j2983991r943196
$$ y = [1040057, 1069572, 1076645, 1132976, 1212075, 1228745, 1244272, 1294649, 1339309, 1360021, 1418287, 1535163, 1625006, 1680319, 1745064, 1783817, 1873834, 1988286, 2039565, 2099516, 2195923, 2243234, 2310197, 2469506, 2666032, 2809295, 2897956, 3004034, 3204089, 3447298, 3743177, 4079318, 4445170, 4827006, 5222612, 5661819, 6085042, 6557183, 7052323, 7602133, 8281763, 9129349, 10161140, 11435699, 12998439, 14889925, 17144746, 19735104, 22836043, 26729612, 31425004, 37225207, 45206038, 56530674, 72899417, 97073112, 132527337, 180885100, 235267890, 281453333, 324540698, 366719887, 355079272, 279307915, 208074290, 160284846, 129013029, 107084820, 90426942, 77442951, 67499755]
12889F7499755p586515o088257m959785m084245l706250l316969k550793k011401
12881C3195540j624211j512631j478821j393959j193011j011048q05468o42666
12873B3533725o12671o36458p32606q49978r63502r92302r63496r47370q73481
12864A5961861p84640p52185o74308o63229n56131n18075n44053m68779l35921
12855A0664540l20480l14141k36316j70630j68470k27575k33639k05798k63512
12846H523979k76437k64103k10253j91395j98710j48553j35900j68041j68237
12837F762350j20962j26870j46744j32794j11605j00120j30568j37781j64965
12828E589941k20159k02295j54420j42185j12968j59744j23195p9985j24939j82573
$$ y = [67499755, 59913240, 53824983, 48865198, 44780953, 41074703, 37757734, 35206941, 33195540, 31571329, 30058698, 28579877, 27185918, 25992907, 24981859, 24176391, 23533725, 22921054, 22284596, 21551990, 20702012, 19738510, 18746208, 17782712, 16835342, 15961861, 15177221, 14425036, 13750728, 13087499, 12531368, 12013293, 11469240, 11000461, 10664540, 10344060, 10029919, 9793603, 9622973, 9454503, 9226928, 8993289, 8787491, 8523979, 8247542, 7983439, 7773186, 7581791, 7383081, 7234528, 7098628, 6930587, 6762350, 6641388, 6514518, 6367774, 6234980, 6123375, 6023255, 5892687, 5754906, 5589941, 5369782, 5167487, 5013067, 4870882, 4757914, 4598170, 4474975, 4394990, 4270051, 4087478]
12818D087478j33289j09319j55936j10552r0949r0897r4286p3873q6961n0957
12808C090459n5266p7398p1073m0539q1478j7237m5576m5958o2984r6486q3553
12797B412911l3620k6085m6151n2245j01795p9058l3421k2795j9286n5286l1698
12786A911471k1735o7263o2724p0363m2168j3942o4159o8899p9268q4172q1313
12775A255465n2459m6909m4262j23766p6103o2719r2085l4396k5277m4542J9292
12764F72239k097o2283m4815m164P035l7341J926J2746N2031R708J8309k2784
12752F00510j02254q0977L202L9963N3898j2732J8214j8055j6970J2935K0226
12741E17960j8811O49P179n2632l3164N6661J9696l4881l4321N4274P973k5529
$$ y = [4087478, 3954189, 3844870, 3688934, 3578382, 3487433, 3396536, 3302250, 3228377, 3141416, 3090459, 3035193, 2957795, 2886722, 2846183, 2764705, 2747468, 2701892, 2655934, 2592950, 2496464, 2412911, 2379291, 2353206, 2307055, 2254810, 2153015, 2073957, 2040536, 2017741, 1998455, 1943169, 1911471, 1889736, 1822473, 1759749, 1689386, 1647218, 1633276, 1569117, 1500218, 1420950, 1336778, 1255465, 1203006, 1156097, 1111835, 988069, 911966, 849247, 757162, 722766, 697489, 652947, 672239, 670142, 607859, 563044, 558880, 565915, 528574, 530500, 543246, 595277, 604985, 623294, 600510, 498256, 417279, 420481, 460444, 514342, 501610, 519824, 501769, 484799, 497734, 517960, 499149, 499798, 506977, 454345, 421181, 477842, 497538, 462657, 428336, 482610, 490583, 465054]
12729D65054o490l1241q332k4038k9111l6531l615k2745J5274K0801L812L2217
12717C75055j8558j6477L4389L1794l4170J6128K6699j2670q406j2131K7094l524
12705D05223p844j1415J3296Q529M908J3770m4745m0645P895L2763N733m6679
12693C40789k1864M591K2707m111k2039L3477K849J8398N139m1639l2392l7531
12681B68374k4523P497L8418L125l3676k722M9850J6813j6005j7502J3127J6581
12669C19357K131K1784m0901l8856L0722k7359m4979L4498L6449J3002k8110k8692
12657B49046J980L9960k1936l8537J2897o8966n6996J5410J7507m4637k875O7934
12645A70787j5967j38L5288K8690r505j7736k2863m3227L438M6317M926k2364
$$ y = [465054, 458564, 427323, 418991, 394953, 365842, 329311, 325696, 302951, 318225, 339026, 342838, 375055, 356497, 340020, 374409, 406203, 372033, 388161, 414860, 402190, 393784, 381653, 408747, 405223, 397379, 385964, 399260, 407789, 412697, 426467, 381722, 341077, 348972, 381735, 387468, 340789, 318925, 323516, 346223, 342112, 320073, 353550, 356399, 374797, 379936, 338297, 305905, 268374, 243851, 251348, 289766, 292891, 259215, 256493, 306343, 323156, 307151, 289649, 302776, 319357, 321488, 343272, 302371, 263515, 294237, 266878, 221899, 256397, 292846, 305848, 277738, 249046, 251026, 290986, 269050, 230513, 243410, 174444, 117448, 132858, 150365, 105728, 102853, 170787, 154820, 154682, 189970, 218660, 209155, 191419, 168556, 125329, 128767, 175084, 180010, 157646]
12633A57646l8215o003M0625M6301J298M473j657k023j6554j459l4545p303l0556
12620A12028k6572j6475j4464L7754O2611p4j5698k7303j7818K9107O2803L5546
12608B21445n4576l3810j7668L4608M535l2595N214J6894K422m6619k9322L6669
12596A07197J9547K6069N738L3180j516Q609r049j2108k8062k3634L155K7947
12584A57073N154r909M176j1232k2566l660j3641q480L4927O447l6537l2940j0096
12571E8716J6080L5256J1699r652l0437l2932k9850K4668M3444j3575n4276m255
12559A4886N8323L6686L164j7208p418K067m1440J2494J9299l286j7318K783r865
12546E3167J4118K0577k5557m562K9089o310N390M7814M4733j5835k7470J5584
$$ y = [157646, 119431, 113428, 154053, 200354, 201652, 206125, 204468, 202445, 185891, 184432, 149887, 142584, 112028, 85456, 68981, 54517, 92271, 154882, 154808, 139110, 111807, 93989, 123096, 185899, 221445, 166869, 133059, 115391, 149999, 154534, 121939, 127153, 144047, 146469, 99850, 70528, 107197, 126744, 152813, 158551, 191731, 190215, 198824, 189775, 177667, 149605, 125971, 129126, 157073, 162227, 152318, 156494, 145262, 122696, 119036, 105395, 96915, 131842, 138289, 101752, 68812, 58716, 74796, 110052, 121751, 112099, 81662, 48730, 18880, 43548, 86992, 73417, 19141, 14886, 73209, 109895, 113059, 95851, 88433, 90500, 49060, 61554, 80853, 77567, 60249, 63032, 53167, 67285, 87862, 62305, 57743, 86832, 80522, 85912, 133726, 178459, 162624, 135154, 150738]
12534A50738k8296n38j6624n5077K122J1917O953M4688m3989j1463j9182j6612
12522B4637J9084M1295m6731k3812l646M6739Q303J8901L2738K1548L1008j1738
12510A58326m7800j2604p114J4927J8936k7802j5690M429P110N4992j5266j2834
12498A19610j1739M708K4001K573l0554K6187j8754l3143j7857m5892M0751K6605
12486H6496j0951k7982r023J821j9445J0325j907m838J7358K4186J2831K913K3693
12473A05477m3605J924N5111n378k308J8336L2482n1170l1554Q239M992q362q531
12460G5653o4391k3883M9116O3224K0375j7495O536R955L024L1914N525k9331
12448A30222l2272l7302L7685O0096L9308O0016R787j0703q431K0446R218L2937
$$ y = [150738, 122442, 121904, 105280, 50203, 52325, 64242, 71195, 115883, 71894, 60431, 41249, 24637, 43721, 85016, 38285, 14473, 10827, 57566, 65869, 84770, 117508, 139056, 170064, 158326, 110526, 97922, 90808, 105735, 124671, 96869, 81179, 85608, 92718, 147710, 132444, 119610, 107871, 112579, 136580, 139153, 108599, 134786, 116032, 82889, 65032, 19140, 59891, 86496, 75545, 47563, 38540, 40361, 20916, 31241, 29334, 24496, 41854, 66040, 78871, 81784, 105477, 61872, 63796, 118907, 113529, 111221, 129557, 162039, 110869, 79315, 87554, 92546, 84184, 75653, 11262, -12621, 36495, 99719, 120094, 102599, 109135, 119090, 122114, 154028, 159553, 130222, 97950, 60648, 98333, 158429, 197737, 257753, 267540, 256837, 248406, 268852, 278070, 311007]
12436C11007O9703P4884J73241K08583K46487K72770K43089J90297J13847j80857
12426A723051l82894k98246k11238j49653j07166n3229n9814r0211j4955M397
12416C60042p778k1857l6816P12J3405l4860o552j9413j8355j4851l5893l1882
12404A45902M7656K1844m6345m9367k5474K3345M2780L0799l3581n7341o348K5447
12392A19317L2501k2708M3854j8694l7490l2467p830K1539P476L206m3242n7091
12380H371N635o594L9528N4176N689l1958p407r848q458j3673K1418r312K6363
12367G3930J1450k0586N787M531q335L7706p276n7341m6352k5346k6913K6765
12355c1980Q0838L1985J8074L69j2392j8797m8130J4798j5699j0513L8182K0135
$$ y = [311007, 380710, 455594, 628835, 837418, 1083905, 1356675, 1599764, 1790061, 1903908, 1723051, 1340157, 1041911, 830673, 681020, 573854, 520625, 460811, 370600, 355645, 360042, 352264, 330407, 293591, 294303, 307708, 272848, 266296, 246883, 228528, 213677, 177784, 145902, 193558, 215402, 169057, 119690, 94216, 117561, 160341, 191140, 157559, 100218, 93870, 119317, 151818, 129110, 172964, 154270, 116780, 84313, 76483, 98022, 105498, 108704, 65462, 8371, 14006, 7412, 46940, 101116, 106805, 74847, 67440, 57592, 49134, 35461, 56879, 47567, 73930, 85380, 64794, 70581, 75112, 66777, 104483, 97207, 39866, -6486, -31832, -58745, -31980, 48858, 80843, 98917, 99286, 86894, 68097, 19967, 34765, 19066, 8553, 46735, 66870]
12343F6870l2339n676J0994M2352j4561k7503r29l6767n148k666p742N057J6258
12330H200K7540l4193l7526j498L7760L5431J2034j6101J8669O948j512R08K4534
12317H1194l1452j1793J4688J8235J782k0396j0516j6462O22J3734K8578J7610
12305H5824l0539m848l790K6618l39l633J3071k0384j8177L157j7249l2284m2525
12292d5098J3132O6759M442q406r722O521K3505P069K0292J3662m9473l5632o922
12279A29K7156R931j7811r204J244K151L5777J039J7596K935p381J0072n802J8923
12265H6755n809j4870n021j9165m970k883K4778j5684j6524J575N2628j9998n9902
12252I10J6118M1106N71l6708j8370J297L1890J2307k5552K1340q285j1100K6492
$$ y = [66870, 34531, 28855, 39849, 82201, 67640, 40137, 39208, 2441, -2707, -5373, -13115, -8058, 8200, 35740, 1547, -35979, -37477, 283, 35714, 47748, 31647, 50316, 57264, 55752, 56660, 81194, 49742, 37949, 52637, 70872, 72654, 52258, 41742, 25280, 25902, 39636, 68214, 85824, 55285, 50437, 46647, 73265, 72926, 69293, 82364, 61980, 43803, 46960, 29711, -2573, -45098, -31966, 34793, 39235, 30829, 21107, 27628, 51133, 58202, 78494, 92156, 42683, 7051, 129, 27285, 37216, 19405, 10201, 11445, 13596, 49373, 50412, 68008, 70943, 63562, 73634, 67832, 86755, 80946, 66076, 61055, 41890, 36920, 34037, 58815, 43131, 26607, 28182, 80810, 60812, 910, 17028, 58134, 58705, 21997, 3627, 4924, 36814, 49121, 23569, 44909, 36624, 25524, 52016]
12239E2016J4765k0895L0352L745k3082K4033L4766j7241k086l4823k4715j6487
12227B0348j0772k0569J8105K7020P775m574l1097k0590J2980K1510K2874K2288
12215F5298K3960l9533k2038l6606k8230K7951M1775J3867K778j2440l8343l002
12203d563M9124K9649k5646k8516O357L3542j1432k7360M0751Q552j4579j5916
12191C9963j0835J5480P538j6022j483K2427N0139K98k1324j9314J0311n704o9377
12178B097j8804M685l588Q5869j9699n8652J1844L8664L3370J0606R183j3842
12166H1733p768l1806m133M7898L176p3781l1521K5776K7906R519J978Q826M1941
12153I9744K5006J624j0389N586K3887j6505M4470Q3537N0719O787P948Q117J8764
$$ y = [52016, 66781, 45886, 76238, 79983, 56901, 80934, 115700, 98459, 96373, 61550, 36835, 20348, 9576, -10993, 7112, 34132, 41907, 37333, 6236, -14354, -1374, 20136, 43010, 65298, 89258, 49725, 27687, -8919, -37149, -9198, 32577, 46444, 49222, 36782, -1561, -4563, 44561, 74210, 48564, 20048, 26405, 59947, 48515, 21155, 61906, 70458, 55879, 39963, 29128, 44608, 52146, 36124, 34641, 57068, 107207, 107505, 86181, 66867, 77178, 71474, 2097, -16707, -12022, -15610, 70259, 50560, -8092, 3752, 42416, 75786, 86392, 95575, 81733, 73965, 42159, 38026, 85924, 89100, 15319, -16202, 9574, 37480, 46999, 48977, 57803, 99744, 124750, 126374, 115985, 121571, 145458, 128953, 173423, 256960, 307679, 314466, 322414, 330531, 349295]
12140C49295L5123J5801J1548r562m0948k6919k6780k3755J1515O0217J4930l2405
12128C38060l8272l7775l7587L164J8803j6350L3100M1201K2795j5991m6601o630
12116B57917N5666N6071K1448N280j3483m1958j8762J8729J4937m6055o5841l3223
12104B10726L3556l886j3098l2892q753m8054m6406K3428L5003L9418k2262p1657
12092I5123P539K3677j2636P139K4087P055m9805j5998m7881j0009K1588N0950
12080A00829P624p833j3115K51j1331N180k285K1925k6612l0027l3605k4412J6070
12067B659N5915J7811j4401p449k2652o7561l3706J3635m809K2627J8116k9657
12055d9472L83p944J2234M5050k6127k2931L3195J3629j401J6277M9156N396p103
$$ y = [349295, 384418, 400219, 411767, 402205, 361257, 334338, 307558, 283803, 295318, 355535, 370465, 338060, 299788, 262013, 224426, 227590, 246393, 230043, 263143, 304344, 327139, 311148, 264547, 257917, 313583, 369654, 391102, 396382, 382899, 340941, 322179, 340908, 355845, 309790, 243949, 210726, 244282, 240396, 227298, 194406, 185653, 137599, 91193, 114621, 149624, 189042, 166780, 95123, 102662, 126339, 113703, 120842, 144929, 151984, 102179, 86181, 38300, 28291, 49879, 100829, 108453, 100620, 87505, 87756, 76425, 81605, 79320, 101245, 74633, 44606, 11001, -13411, 2659, 58574, 76385, 61984, 54535, 31883, -35678, -69384, -55749, -60558, -37931, -19815, -49472, -49089, -57033, -44799, 251, -25876, -48807, -15612, -1983, -3384, 12893, 62049, 67445, 60342]
12042F0342j1704n0024k3874L807N9514L5872k7879l0506l438K6877M31m2588
12030c170m3415j6680M2854M2622J503L0573M197J3694K370k9514k2265j5116
12018G653N3394J4373j0691N028j5122n3918l1541j1092M7318K4302M5568L6650
12006A11922J9170j6271L246l9661l5194o0988K2645K7469L9442M516m716Q832
11994H0412j9919N568L629j3471k961k4753l2628R883j7176j3123N695r519K0289
11981h074M5261q97n2694j3746J2138l047j8279o441j4461K1631M2969M8865j1335
11968D1890k118m745K8819M0461m3954k9841j2566l1023l9330m2101K1228N8214
11956a5066K6165K1757K5943Q101l4131j1507m5029k5967J9565J6516j4828l1813
$$ y = [60342, 48638, -1386, -25260, -21453, 38061, 73933, 46054, 15548, 12110, 38987, 39418, -3170, -46585, -63265, -20411, 22211, 23714, 54287, 58484, 72178, 74548, 45034, 22769, 7653, 61047, 75420, 64729, 69757, 54635, 717, -30824, -41916, 5402, 29704, 75272, 111922, 131092, 114821, 118067, 78406, 43212, -17776, 4869, 32338, 71780, 76296, 71580, 80412, 60493, 66061, 69690, 56219, 53258, 28505, -4123, 5760, -11416, -24539, -18844, -28363, -8074, 37187, 36290, -16404, -30150, -18012, -21059, -39338, -45779, -60240, -38609, 4360, 53225, 41890, 39772, 35027, 63846, 104307, 60353, 30512, 17946, -13077, -52407, -94508, -73280, -15066, 11099, 32856, 58799, 66900, 32769, 21262, -23767, -49734, -30169, -13653, -28481, -60294]
11944f0294J7527J5350k6357J6500p88m2595P559L6244K6808Q483K7049j1473
11932A4013k2078J8242J7899K924j6524J3242K5718j7628k5742n683j1334J8769
11920A1818j461R173J9721K549j5009J1817Q298J2771K65J9135J7880m7353j6394
11907C3210m469j2815k7797l4720L9204M9110K7227n1087l626Q0j7407j3185k1767
11894c8042n0144M343Q0905J4662J949K5342n118j4442k2854o938K319K009j0588
11881a6597J7404J0767o0926J3795K3217K949M1154J4000l3991k4741N999l7440
11869d4410j3015J5986j3478K106J3429j2844l5874j887J2168N6656O515l2299
11857d6947r033m698M5956M9037O967j1694k3554p2884j7460L5780J2507L01l7077
$$ y = [-60294, -42767, -27417, -53774, -37274, -38062, -80657, -73098, -36854, -10046, -1563, 25486, 14013, -8065, 10177, 28076, 31000, 14476, 27718, 53436, 35808, 10066, 4383, -6951, 11818, 10357, 19530, 39251, 41800, 26791, 38608, 46906, 59677, 59942, 79077, 96957, 49604, 33210, 28741, 15926, -11871, -46591, -7387, 41723, 68950, 17863, 14237, 14317, -3090, -16275, -38042, -88186, -83843, -2938, 11724, 13673, 39015, 33897, 19455, -3399, -10337, -8018, -6009, -16597, 807, 11574, -49352, -35557, -12340, -9391, 31763, 45763, 11772, -12969, -6970, -44410, -57425, -41439, -54917, -52811, -39382, -52226, -88100, -89987, -77819, -21163, -14648, -46947, -55980, -60678, -14722, 34315, 41282, 29588, 6034, -66850, -84310, -48530, -36023, -35722, -72799]
11844g2799L267L6216K2075l514m843l454j294q101J1734L2797L4576l9674R71
11831G957Q302k1124r063r497J5041J315j6811L7417L7857M2805k2463k3271K981
11818E1446n967k1567j6257J0126n0407o971J0989L1567J7376n600M6225K8424
11806H9384m1302k0341k8286Q199r961p171j349Q007k2863O61M9743K0627j3878
11793C1470L828J5642K2908n808k149J4610k057r379n7663k9507L9283K3474j3266
11780C1386j6328m6433l3267Q530M6802k2728k0881K4573k9484r856m810N9424
11768a3072P0522l4356k332O444L8755k2341l7214k9855M3546j3867J5196q943
11756A2483k1583j7845P903N2156j4857n1318o568K8937J110j8008k2599j9383
$$ y = [-72799, -69532, -33316, -11241, -14755, -19598, -23052, -24346, -32447, -20713, 12084, 46660, 6986, 7957, 16259, -4865, -13928, -23425, -8384, -7069, -23880, 13537, 51394, 94199, 71736, 48465, 51446, 45479, 23912, 7655, 17781, -32626, -39597, -28608, 2959, 20335, 14735, 60960, 89384, 48082, 27741, -545, 7654, -2307, -9478, -10827, -2820, -25683, -25022, 24721, 45348, 31470, 35298, 50940, 73848, 68040, 65891, 80501, 78444, 69065, 11402, -18105, 21178, 44652, 31386, 15058, -31375, -64642, -56112, -9310, -32038, -52919, -28346, -57830, -67686, -72496, -13072, 57450, 23094, 20762, 27206, 65961, 43620, 6406, -23449, 20097, 6230, 21426, 12483, -9100, -26945, -19042, 33114, 18257, -33061, -39629, -10692, -9582, -27590, -50189, -69572]
11744f9572p634J7358L7313k5308K0417J9984r099J0268j7280L7564R530L6866
11732F0407n504j7078K2236k237j0753K83k0131m9663q265J9363L6298l975j1701
11719I280J2099K807L1029K3474j3686l6105J4121J9638j9519q751m1790l1436
11707c8839j3459m816J0332Q111J0437L3954j5722n615J174J9535o573J3052n627
11694E944j0578l6928M424Q635N2351r401l7551k9629M4973O2944m061n8593l0935
11681c8405J7649L7382N111r399q256j2601j1238L3809l6207J751J3405j9327
11669b6326K882K1137M6462R100k8116J7876m923l1846O823j3277K894O128j3154
11656d340L1120L250k9109k4923m9061J7965L3484J0588l107j8819L5032Q292
$$ y = [-69572, -77206, -59848, -22535, -47843, -27426, -7442, -16541, -6273, -23553, 14011, 23541, 60407, 54903, 37825, 60061, 57824, 47071, 47354, 27223, -22440, -30705, -11342, 24956, 20981, 9280, 21379, 24186, 55215, 78689, 65003, 28898, 43019, 62657, 43138, 34387, -7403, -38839, -52298, -57114, -46782, -38671, -28234, 5720, -10002, -15617, -14443, 5092, -1481, 11571, 5944, -4634, -41562, -37138, -28503, 23848, 14447, -23104, -52733, -7760, 55184, 51123, -7470, -38405, -20756, 16626, 21737, 12338, 4082, -8519, -19757, 14052, -22155, -20404, -6999, -26326, -23444, -2307, 44155, 53255, 25139, 43015, 38092, 6246, 13069, -208, 2686, 8814, -4340, 26780, 30030, 921, -24002, -73063, -55098, -21614, -11026, -14133, -32952, 2080, 10372]
11644A0372l6890Q597L543L3987p867m4830m1150K477K1016N6302k5208j8215
11632c7866M5481J9999K9723K1262j6907j9166j9335J423k6010m972j2513K2651
11620C770K6232r6m413N935k6733k0725j7244k4619J3961R38K4314O740m092l1766
11606d7798p848J6971J1307K8428J1291k8440L0844l630l4603J4414J2794O0638
11594F4368K6326l5070j8231J397N336j0383J6959K0388j6445J1322M1475j3037
11582I4405k3818n7329k3335L749J2309L0073j204j2515k7153N8426K7808l4471
11570D6945m505j0939j4090M6857N0066j1236o9664l943o459j3555k356m1952
11558c4831m827M3566j9473j7353m10J3897Q351Q088q943n2342l5723K3207M1182
$$ y = [10372, -26518, -17921, -14378, 19609, 11742, -33088, -74238, -71761, -50745, 5557, -19651, -37866, 7615, 27614, 57337, 78599, 61692, 42526, 23191, 24614, -1396, -6368, -18881, 3770, 30002, 29906, 25493, 31428, 4695, -16030, -33274, -57893, -43932, -42994, -18680, -11940, -16032, -47798, -55646, -38675, -27368, 1060, 12351, -16089, 14755, 11125, -23478, -9064, 3730, 64368, 90694, 55624, 37393, 38790, 44126, 33743, 50702, 71090, 54645, 65967, 107442, 94405, 70587, 13258, -10077, -6328, 5981, 36054, 34850, 22335, -4818, 53608, 81416, 46945, 42440, 31501, 17411, 64268, 114334, 103098, 33434, 29491, 23032, 9477, 7121, -34831, -39658, 3908, -15565, -32918, -33328, -19431, -11080, -2992, -11935, -64277, -100000, -76793, -35611]
11545c5611K1042J3837k475p630k316k2127q182o729M8364K2991K5042L5741l8309
11532D3638j5987J734P72q013J840j856l133j066m429K553j7508L454K3366O714
11518C2079P105o490j2050j7966k5768j7043K4020k6315O941K8392m0341k5834
11506g3270K4074N858R572l5412J0068M2396M7266M6946J2282m9325p3608k5783
11494e8936R061K4366N976R085J742l694L0244J3071L461J4126k611p1619l8804
11481f4532o967M0076R599J2760l7394L2953K8563K3185M5943M023m9421n7172
11469a8384p338K1052j3542l0659k6823K1575J055L8646P228K2907k0123l0204
11457c4610J8060J7798p767m1264j7558N3590K4230l6861k1533q978l8758L8770
$$ y = [-35611, -14569, -732, -3207, -10837, -13153, -35280, -43462, -50191, -1827, 21164, 46206, 81947, 43638, 27651, 29385, 30157, 22144, 23984, 22128, 18995, 17929, 13500, 16053, -1455, 1999, 25365, 32079, 39184, 32694, 20644, 2678, -23090, -40133, -16113, -42428, -35487, -7095, -47436, -73270, -49196, -43338, -33766, -69178, -59110, -16714, 30552, 77498, 89780, 40455, -33153, -58936, -49875, -25509, -19533, -10448, -8706, -12400, 17844, 30915, 34376, 48502, 45891, -25728, -64532, -71499, -31423, -21824, -9064, -46458, -13505, 15058, 38243, 84186, 88209, 38788, -18384, -25722, -4670, -18212, -48871, -75694, -54119, -53064, -14418, -7190, 15717, -4406, -34610, -16550, 1248, -6519, -47783, -65341, -11751, 12479, -24382, -45915, -54893, -93651, -54881]
11445e4881K0308L6141O6791l3854k4277l2491k27K375K4520J6425k5445L354
11433a261R330J3409l9292P08l60K3789k0964k2811J4362o083O051K684m0227
11420f0665K1484K2963m239N915J1947j3831p3541L0825L4805K5992O43k9280
11408b6982j190j754K2992k3693O625K6247Q667l0635k58N8686j0139j7241K0307
11395C1632K301k1074Q08p713L219j6241p839m738m905P1175J4805l5432k0712
11382E286j9513j2858j1637l6297P037J3015M8532M0108K2878R112l9326l9518
11370a3181j2404K4002P0543J3861m4055O174o413q194R018o033l8191j9863j8340
11357d3076J8651j9453K853N0818o203j9252J458r482J3206M2172k8226N141K9458
$$ y = [-54881, -34573, 1568, 68359, 34505, 10228, -22263, -22490, -20115, 4405, 20830, -4615, -1261, 8069, 21478, -17814, -17106, -17466, 6323, -14641, -37452, -23090, -29173, -23122, -20438, -60665, -39181, -16218, -20457, -14542, -2595, -16426, -89967, -59142, -24337, 1655, 2298, -26982, -28172, -29926, -6934, -30627, -24002, 2245, 10912, -19723, -19981, 38705, 28566, 11325, 31632, 33933, 12859, 13667, 5954, 9173, -7068, -14907, -19645, -24550, 46625, 61430, 25998, 5286, -14227, -27085, -38722, -75019, -67982, -54967, -6435, 33673, 56551, 65663, 26337, -13181, -25585, -1583, 68960, 82821, 38766, 44940, 38527, 30333, 39351, 33318, -4873, -24736, -43076, -24425, -43878, -41025, 9793, 3590, -15662, -14204, -23686, -10480, 31692, 3466, 8607, 38065]
11344C8065K7491m4056J067r564O084K6361L2627m503r4860n2811l7097M1401
11332f9795N978K370K7398J5740j9618k728J4229M156L5052M0069L2262r886p3816
11319A411n709j8211m087J1435o975m2618m713n291K6453K4553K8206k450j2300
11306a0296K2530m8487m0906L5496j577p449K5439L7740L824J9965k17J3779k7294
11293B2547Q869j9810n238J8524j2076L3694q35k9201L624L171j026K6884J567
11280E0694j4089k0020k5868k3419J2871K4671K8896J2128m6568o4525L0754j121
11268c5596M5584L2311m3231P100Q428p950L7363l93p94K8523j4538j9970m8211
11255a1374l616R242j6807K5354M091l9269n727L1853O732l9519j6541L2895O220
$$ y = [38065, 65556, 21500, 22567, 13003, 19087, 45448, 78075, 73572, -21288, -74099, -111196, -69795, -63817, -61447, -34049, -18309, -37927, -40655, -26426, -22270, 12782, 52851, 85113, 75227, 1411, -4298, -22509, -26596, -15161, -22136, -64754, -69467, -74758, -48305, -23752, 4454, 2004, -10296, 12234, -36253, -77159, -41663, -43240, -50689, -25250, 12490, 16314, 36279, 36062, 49841, 22547, 31416, 11606, 6368, 24892, 12816, 46510, 45675, 16474, 20098, 23269, 22243, 49127, 50694, 36605, 16585, -9283, -32702, -19831, 4840, 33736, 45864, -704, -65229, -34475, -35596, 9988, 42299, -932, 6168, 14596, 6646, 44009, 43616, 42822, 71345, 56807, 36837, -11374, -14990, -5748, -22555, 2799, 6890, -32379, -38106, -6253, 479, -39040, -55581, -22686, -16466]
11242a6466m908k3570K9633O717K9787K4787J682l1041J7534k3869n6756r364
11230e5834J3939l4715j5242M1262j9981l159K8182M0717j1241M2521L5746k6110
11218C6085l6138M242M055P393J9931K1444m0349m4661J6209J966m398n602J3820
11205f003O703k0651K0577j6249l3572J4099M3762k2410j7985J5364J5486p289
11193h168M1540J6555n1929k7810K2490P127k1445L1161J9683J1571j3177l0399
11181b801l0758j2733J028k152m2148k265K8588J5939Q698n884j2634L6738K6152
11168E768k4680j9327K7852K4268L2769j0448m4905l810R765J1654M4559J6124
11156F9589L6655j6217n6173j3093o2130j0917J0219N1662L0562m0062k6810j7959
$$ y = [-16466, -21374, -44944, -15311, -8594, 21193, 45980, 47662, 16621, 34155, 10286, -46470, -55834, -41895, -76610, -91852, -50590, -70571, -73730, -45548, -4831, -16072, 26449, 62195, 36085, -53, 4189, 8244, 15637, 35568, 57012, 16663, -27998, -11789, -9823, -14221, -19823, -6003, 700, -19951, 626, -15623, -49195, -35096, 8666, -13744, -31729, -16365, -879, -8168, 33372, 49927, -2002, -29812, -7322, -195, -21640, 9521, 29204, 40775, 27598, -2801, -33559, -46292, -45264, -47416, -89564, -91829, -63241, -47302, -38604, -44488, -57122, -20384, 5768, -18912, -38239, -10387, 13881, 46650, 36202, -8703, -12513, -2748, 8906, 53465, 69589, 106244, 90027, 33854, 20761, -41369, -52286, -42067, 9595, 40157, 95, -26715, -44674]
11144d4674M1556k5439K1812J1541Q121l6671j2841o310M358K4770K0244l6092
11132b9625K333L7826L376L0825N381j161j7712m2806j7963m3350j4783J2833
11120g4826J8683L6936K3688j3428M7479l54o981l5942k3038k8289Q634K9464
11108a7974m996J036r561P332K9418J5098J1305j4041o759j4172O7j5063O714
11095a1596J4035K3490P996j3891L719j0531M997J3058o6308Q019L280J5333L3441
11082B5042k4023n6657l7878N0751M0249K0083K8675L163j1680j2589p302L0617
11070D8451k6751l39J3363p901j7050l6595K6006q883L2054L8407j771l371m6174
11057I446m413l710l2311J0846k650N972M3733O661J737r071J6487k2454m461
$$ y = [-44674, -3118, -28557, -6745, 4796, 12917, -23754, -36595, -42905, -38547, -13777, 6467, -29625, -27292, 10534, 13910, 44735, 50116, 48955, 31243, -11563, -29526, -72876, -87659, -74826, -56143, -19207, 4481, -8947, 38532, 38178, 31197, -4745, -27783, -56072, -47438, -17974, -22970, -21934, -31495, -24163, 5255, 20353, 31658, 17617, 10858, -3314, -3247, -18310, -11596, 2439, 25929, 33925, 20034, 23753, 13222, 18219, 31277, -35031, -27012, -23732, -8399, 25042, 1019, -55638, -93516, -42765, -2516, 17567, 46242, 49405, 37725, 25136, 17834, 48451, 21700, 21361, 34724, 26823, 9773, -26822, -816, -9699, 22355, 60762, 58991, 55620, 9446, 5033, 1323, -30988, -20142, -22792, -16820, 26913, 33574, 35311, 26240, 42727, 20273, 15812]
11044A5812O9j8602K2515L1234j9455o0257J9522L9018j1983O847k5037m7837
11032d8154N17O3826L173o636m287j810K1771j3589m3989j1826j1080r566K6539
11019c5111K9039k9144J0703O2434M5410l1773k3116q156k0458j2613J263K5886
11007A4364K4206q859k2082k8221l1417k304K4174j822K2836Q251l2265J8710
10995a4429N380k3769K16J3782r6J4991j38j2581k400j249r482M156k6877j8816
10981g1312K7090L6516j1097k007j0625j3759K0717K0705j8209n231K2161k1960
10969b7011k1724j2798j0025M414k0489K94L9063o417K8453M1365K13j2356J8104
10956B1086L4171k807j773k6593Q832O840K2662k1897l6762M83k6810r148k0296
$$ y = [15812, 15881, -2721, 19794, 51028, 31573, -28684, -9162, 29856, 17873, 24720, -317, -48154, -47637, 16189, 19362, 12726, 8439, 6629, 28400, 14811, -29178, -41004, -52084, -61650, -35111, -6072, -35216, -24513, 37921, 83331, 51558, 28442, 20286, -172, -12785, -11522, 14364, 38570, 29711, 7629, -20592, -52009, -54313, -30139, -31961, -9125, -874, -33139, -14429, -9049, -32818, -32602, -18820, -18916, -3925, -4063, -16644, -19044, -20293, -29775, -25619, -52496, -71312, -44222, -7706, -18803, -20810, -31435, -45194, -24477, -3772, -21981, -27212, -5051, -27011, -48735, -61533, -71558, -67144, -87633, -87339, -48276, -54693, -26240, 15125, 15338, 2982, 21086, 55257, 52450, 50677, 24084, 32916, 39756, 62418, 40521, 3759, 4242, -22568, -31716, -52012]
10943e2012j1277L4385L6416m899Q946J1546J2145J3611k3524m2356J834j3735
10931b8920j424J0426J4894k663Q682J3491j9118j8999j484j6026K2743j3082
10919c1480J4988J4912j9205o317p684k7121j0635N1797J406O796q161N652K5504
10906A0452j9969P956L5443K8699l1777k6141R40j6153J7127k3512J9P218J4626
10893D928K5074K9292k5884l0288R786n4186j6018j4028J1056P555n796M4180
10881a4329N2082K0202j5372J0188j2935p5446l8552L537L6754j171l6012L2266
10869c8788K7638m062j0074n30J4390L2865L3955k75N621l3482m1833K3984J083
10856A0492l2937m655K2286K3784j8125k9871j8541J6836J6498k8566l9751J6982
$$ y = [-52012, -63289, -28904, 7512, 2613, 11559, 23105, 35250, 48861, 25337, -17019, -15185, -28920, -30344, -19918, -5024, -7687, 995, 14486, -4632, -23631, -25115, -41141, -18398, -31480, -16492, -1580, -20785, -27102, -34786, -61907, -72542, -20745, -19339, -12543, -20704, -15052, 10452, -9517, -1561, 33882, 62581, 30804, 4663, 5603, -10550, 6577, -16935, -16916, -9698, 4928, 30002, 59294, 33410, 3122, 12908, -41278, -57296, -71324, -60268, -52713, -58509, -14329, 37753, 57955, 42583, 52771, 39836, -35610, -74162, -70625, -33871, -35042, -71054, -38788, -11150, -15212, -25286, -25816, -11426, 21439, 55394, 55119, 60740, 27258, -14575, 9409, 10492, -22445, -27100, -4814, 18970, 845, -29026, -47567, -30731, -14233, -42799, -82550, -65568]
10844f5568J492O3444Q156J666N326k7675J3616M6238L1490K7758J2492l3812
10832H4623J7020K2906r2223j6086k6379l5422N9427k4801l314m651L8056L2038
10820E1194k4160J3711J8729J1714l2094m2325L4331J9866P054p5997m558k3641
10808d6176l1349k4758J2342M8255K0658O4325M097m6497l3439J2765L13M478
10796a4986l8018j1118M9416j1497j8843J2241J37Q193N5873L8989J5245k8541
10784E7091q153j4310m2528j123j1200R19l280j1416j5958l5210l629J6624L7626
10771c4547M0625N0109J4293m3628p49J5133j4766l2818j4597j1876J4433M873
10759a3515M1656N3695j4951j9784j0710k2125k8282L5241l7460l97L0646j5809
$$ y = [-65568, -64076, -632, 7524, 9190, 14516, -13159, 457, 46695, 78185, 105943, 118435, 84623, 101643, 124549, 32326, 16240, -10139, -45561, 13866, -10935, -14249, -18900, 19156, 51194, 27034, 40745, 59474, 71188, 39094, -3231, 31100, 50966, 58020, -17977, -22535, -46176, -77525, -102283, -89941, -41686, -21028, 43297, 47394, 897, -32542, -19777, -19464, -14986, -53004, -64122, -14706, -26203, -45046, -32805, -32668, -24475, 31398, 70387, 85632, 57091, 48938, 34628, -7900, -9023, -20223, -19304, -22584, -34000, -49958, -85168, -88797, -72173, -34547, 6078, 56187, 70480, 26852, 26103, 41236, 26470, -6348, -20945, -32821, -18388, -13515, 28141, 81836, 66885, 47101, 36391, 14266, -14016, 21225, -16235, -16632, 14014, -1795]
10747a795p0064J1846p365m285j4118k439J9345M7668J4729Q292O049K6616k2572
10734A1907j5615K602o771R750J3257R290l6648m2502l364j1464P4K3391L0961
10721a5132M4262k1325r608j2940L0380N627O556J834l2981k9616o251J2672N4511
10708B7989M722k4626p412k666j4897k0992L5221R07k8345n5925k8746K8205K7462
10695e9103j070K3950L1355L0135J395J5914p557p49M2814Q826k4772n2451O261
10682A4948R009o139N117M565k4900O2826L2822k7798o5397l8916k1641M5777
10670i727R865L3376m9876k9071R880k1660p441J3433Q403J6347K6005O2153n945
10657E5742k9638n6038n976J7550L8207M0806m9729m3663L394L7432J0006J0913
$$ y = [-1795, -71859, -60013, -67378, -71663, -85781, -88220, -68875, -21207, -6478, 1814, 7863, 34479, 11907, -3708, -1106, -7877, 1873, 15130, 24420, -12228, -54730, -58094, -69558, -69484, -46093, -15132, 29130, 7805, -1803, -14743, 15637, 21264, 27820, 29654, -3327, -32943, -39194, -26522, 27989, 32711, 8085, 673, -1993, -16890, -37882, -2661, -1754, -30099, -86024, -114770, -86565, -59103, -60173, -36223, -4868, 25267, 26662, 42576, 35019, 34270, 77084, 85910, 61138, 8687, 14948, 23957, 17818, 22935, 27500, 2600, 65426, 98248, 70450, 5053, -33863, -55504, -9727, 138, 33514, -16362, -45433, -35553, -57213, -64654, -51221, -42818, -26471, -466, 61687, 55742, 26104, -29934, -35910, -18360, 19847, 60653, 10924, -32739, -29345, 8087, 18093, 29006]
10645B9006m6930Q66l840J6526K9707j1020M461M0899J1455m4353k0301J6239
10633B2715R410j9223j7826K4310J2917p519K3088K338k0440l3169o7738j0244
10621h1381L3703L5777N0171k3153k0047J3579P207P632K7433m958l933m4450
10609b420L773L6787L0160K133k676j4625m0632k5473L4092L5850k4077m8991
10597a6099n4493j9210p136K8808J5602J8773q624r348M54j025J1266k4530K9064
10584c6498J7948K0792p762k4580j0623P4699J7173n621L220o597N565Q370l1182
10571B4904k7025O250L310K347q724n5590m406K124L1749J0374K9000J6529j6719
10558A4123K51l399n8k7642l6062L4484N3665j049j5133K2646J0318m5013m4107
$$ y = [29006, -17924, -17058, -20898, -4372, 25335, 14315, 18776, 59675, 71130, 26777, 6476, 22715, 32125, 12902, -4924, 19386, 32303, 24784, 47872, 50210, 29770, -3399, -71137, -81381, -47678, -11901, 38270, 15117, -4930, 8649, 15856, 23488, 50921, 45963, 42030, -2420, 1353, 38140, 68300, 70433, 67757, 53132, 12500, -12973, 21119, 56969, 32892, -16099, -70592, -89802, -96938, -68130, -52528, -33755, -42379, -51727, -51273, -52298, -41032, -65562, -36498, -18550, 2242, -5520, -30100, -40723, 33976, 51149, 45528, 48748, 42151, 47716, 56086, 24904, -2121, 4129, 7439, 9786, 1062, -54528, -58934, -56810, -25061, -14687, 14313, 30842, 14123, 14374, 10975, 10917, -16725, -52787, -18303, 35362, 34313, 19180, 41826, 52144, 7131, -36976]
10545c6976N666N2737k3641L7016M3002m8186o1182P982j119K4889r743Q646J1484
10532A0575n163p687L4624K9763J7571N217j2152l5768l6733n016j3542O151J7086
10519D926j7982j8127J9152L569k1521J6342N2990J7632j9755m5114j0526Q814
10507i600N23L912L169j8095k861n1230l0726J028L9737J6002m487J5488r522
10494d6662j05O0670Q202o660l541m0138m9364Q062L263K717k7354K5925J680
10481f3305J4166k261o762K2706j2082j7438J2272K9640l001k5620k4450J3078
10469f3057O3260P639m8506j1427J9442J8927K7135q065m4846k366m040r441J7374
10456c7971q989K9423L2956M5129K8488O32n618l3030l1594l593k2765k644L6032
$$ y = [-36976, -31310, 21427, -2214, 34802, 77804, 29618, -31564, -23582, -24701, 188, -9555, -909, 10575, 5412, -2275, 32349, 62112, 79683, 84900, 72748, 36980, 247, -4769, -18311, -12160, 4926, -13056, -31183, -12031, -8462, -29983, -13641, 39349, 56981, 37226, -7888, -18414, -9600, -9077, -5165, -1996, -20091, -22952, -74182, -104908, -103880, -64143, -48141, -52628, -37140, -46662, -46767, 13903, 22105, 15445, 11904, -28234, -77598, -69536, -66273, -63556, -90910, -64985, -63305, -49139, -51400, -58162, -35456, -47538, -64976, -52704, -23064, -26065, -51685, -76135, -63057, 203, 7842, -40664, -52091, -32649, -13722, 13413, 5348, -39498, -41864, -45904, -55345, -37971, -46960, -17537, 15419, 60548, 89036, 89668, 84050, 51020, 19426, 15833, -6932, -9576, 26456]
10443B6456J475j4489q765j2904p385l4643J5540M7162J8850K2052o880l4543
10431A1926m9154r031J1198m1273j6611O821m0593J859M0643M4926M505J1330
10419b3454n824j8242m796K517m557K6613M3905K2163K5149r964n9785k3833R854
10406b0254K6876j3804p201L1729J5823j9883M568k5093j414L479j6152K2579
10394A253L5458l617o921r904l0475J0413r869l927j9894j5891q335m005R711
10381e6003q224k040L4119K0085P429K1084k5151m840q9q887q629N846K1937J3505
10367A0142m0442j1531r833j0590K623m250L5658m952M639J5912K8965j7657j5399
10354a6715k9521k8147L7485N0484M4532N389l3623m8880J0859l0489k6459J5000
$$ y = [26456, 27931, 13442, 4677, -8227, -15612, -50255, -34715, 12447, 31297, 53349, 46469, 11926, -37228, -46259, -35061, -76334, -92945, -86124, -126717, -124858, -84215, -39289, -34784, -23454, -29278, -47520, -52316, -49799, -54356, -27743, 16162, 38325, 63474, 53510, -6275, -30108, -20254, 6622, -7182, -14383, 17346, 33169, 13286, 17854, -7239, -8653, -5174, -21326, 1253, 36711, 33094, 26173, 16269, -14206, -3793, -13662, -17589, -37483, -53374, -61709, -65714, -56003, -64227, -66267, -32148, -12063, -4634, 16450, -8701, -13541, -13630, -22517, -31146, -25300, -3363, 10142, -30300, -41831, -51664, -62254, -59631, -63881, -28223, -33175, -28536, -12624, 16341, -1316, -16715, -46236, -74383, -36898, 13586, 58118, 63507, 29884, -18996, -8137, -38626, -65085, -50085]
10342e0085J5701K9779R12J0009M4262k7744k8151j1208J4183M384k2123k7104
10330d7185q891n9175j6139L8171J7823K3738K0281l187K1710n9124l8122O080
10318a04020K7140L2407N7403K6646j9278m3145J6025L977j9253q638k5108j9673
10306g5517L0614L4435m2576j2840n257K3271O444j5496j0553L8941N3965J5849
10294D1280n883N075K0464p2024l2375K3077q0k7367j0924K8037J4217j3743K2676
10281g570J6167n505J9058K1111j2315m6132l2813l2433L7997L121l1523N0072
10269b0765M4615r646q682K6098L350k5493J74L2818K8168j3956J0267m0153m2460
10256a5665l5545j4858j405q932N442P6429q027l158J6202L3129k760j2663j8136
$$ y = [-50085, -34384, -4605, -3693, 6316, 50578, 22834, -5317, -16525, -2342, 2042, -20081, -47185, -56076, -115251, -131390, -93219, -75396, -51658, -31377, -34564, -12854, -71978, -110100, -104020, -76880, -44473, 12930, 39576, 20298, -22847, -6822, -2845, -22098, -30736, -55844, -75517, -44903, -10468, -53044, -65884, -71141, -47870, -41426, -56922, -67475, -28534, 25431, 41280, 35397, 40472, 60936, -11088, -43463, -20386, -20466, -47833, -58757, -30720, -16503, -30246, -7570, 8597, 3092, 22150, 43261, 30946, -15186, -47999, -80432, -42435, -39314, -70837, -20765, 23850, 14204, 5522, 31620, 34970, 9477, 9651, 42469, 70637, 56681, 66948, 26795, -15665, -51210, -66068, -67473, -76405, -70963, 5466, -2561, -5719, 10483, 43612, 40852, 28189, 10053]
10243A0053l1623j5348j0123o780N029J5716M2838l8940k4456K5722M5263P293
10231B4644j6521m0166K9454N6054K3249l8112k5641l8183l2734K298k029l504
10219f1191k8229Q910M820P9381M0369j7695m0219n987j8049L746O828j6050j2285
10206e5651j419K6371k359J6551O64L74J8474P79j1871P589r817J9559J9989j3231
10192A6002J6847j528l7202m9277r150L4422N0758r493k4059N124Q461N0756L5184
10179H6845k7006n0245q89J6972l5358L9118L3313k6029o1177q91K7102J2382
10167A4137q955k5097J2057M5413J3603j4751p965L067m1803k1040J0399N898
10155a5037L4781J9533p0110l3741L6281N9667K6431P14L276J4226K1178n7900
$$ y = [10053, -21570, -36918, -47041, -53821, -48792, -33076, 9762, -29178, -53634, -27912, 17351, 24644, 8123, -32043, -2589, 53465, 76714, 38602, 12961, -25222, -57956, -55658, -57687, -61191, -89420, -80510, -75690, 3691, 44060, 26365, -13854, -19841, -37890, -34144, -27316, -43366, -55651, -57070, -30699, -33058, -16507, -15843, -15469, 3005, 3784, -8087, -498, -10315, 9244, 29233, 16002, 32849, 31321, -5881, -55158, -64308, -29886, 20872, 11379, -12680, -7556, 905, 51661, 86845, 59839, 9594, 8705, 25677, -9681, 29437, 62750, 36721, -24456, -25347, 1755, 14137, 5182, -19915, -7858, 37555, 51158, 36407, 28442, 31509, -10294, -31334, -20935, -15037, 19744, 39277, -30833, -64574, -28293, 31374, 57805, 58519, 61795, 76021, 97199, 39299]
10143C9299o1738m2412k6877K9225k866O829L4612K6534k1361K2228L3997J9915
10131E7385j1239p526k3304j8848J3183N0846N4190P619m1374q2596l6236j0953
10119d8853M9391L2231k3188k0883m3120J5769J3658m3441j9550J7902J6727K4608
10107b8749k2470K0063K0218J8335k7100m211K7607N0992K0671l7533k954J704
10095C6573j6385p936k474J7661N754j8619K9639R778q310m4569m4734j666L1647
10082a3641J9900J6266J7587J1397l3431r088j2056J709K7729R299l2006k0353
10070a6688J109r990L1883J0836K2648J6838Q103n6697j2549M9809j1642J6388
10058E0048K5910l9218l330L4709O124L237k4722K2772j9813m5838m1726Q530
$$ y = [39299, -22439, -64851, -91728, -62503, -65369, -58540, -23928, 2606, -18755, 3473, 37470, 57385, 46146, 38620, 15316, -3532, 9651, 60497, 114687, 122306, 80932, -1664, -37900, -48853, 538, 32769, 9581, -11302, -54422, -38653, -24995, -68436, -87986, -70084, -53357, -28749, -51219, -31156, -10938, 7397, -19703, -23914, 3693, 54685, 75356, 37823, 34869, 36573, 20188, 12252, 9778, 27439, 33193, 14574, 44213, 53991, 45681, 1112, -43622, -45288, -13641, 6259, 22525, 40112, 51509, 18078, 8990, -3066, -1357, 26372, 35671, 3665, -16688, -15579, -25569, 6314, 17150, 39798, 56636, 64739, 8042, -4507, 45302, 33660, 50048, 75958, 36740, 33410, 68119, 74243, 77480, 52758, 75530, 55717, 9879, -31847, -23317]
10046b3317o245k33j601K2447M4408K7062j4697J8067m4425k4297l196K481K605
10033i41J832k6934j8667J2478M2570p373j2660l2125j0413l054L8769K2271p516
10020a763J8559J0253J2107j2962j1616J0018p337j9539k8000m1739J5295J6931
10008c9793n148j7787K7491Q061J3712L163k104p609k4984j1260M0774J2246L5682
9995C2444n370m4800k5671N3464M4714l2404Q507J014L1872L7438l2649l6211
9983C2348l3287n013J9715Q630L7061J0444l9500o057M000j8613k2786K9840o173
9970A0609o121r853J9186K9642J1622j6507o6500p220J6740K748M852r213r52
9957b0967j683J7823K4822O800Q50l8636m8549l9971L6086M9810k0600J2404K6198
$$ y = [-23317, -29562, -29795, -31396, -8949, 35459, 62521, 47824, 65891, 21466, -2831, -6027, -3546, -941, 891, -26043, -44710, -32232, 10338, 2965, -9695, -41820, -52233, -55287, -16518, 5753, -1763, 16796, 27049, 39156, 26194, 14578, 24596, 17259, -2280, -30280, -72019, -56724, -39793, -44941, -62728, -35237, -27176, -13464, -10301, -12405, -20014, -44998, -56258, -15484, -3238, 32444, 27074, -17726, -43397, 10067, 54781, 22377, 30884, 31898, 63770, 101208, 68559, 32348, -939, -5952, 13763, 22393, 59454, 69898, 30398, 24341, 28341, 9728, -13058, 16782, 10609, 4488, -5365, 13821, 43463, 55085, 38578, -27922, -35142, -18402, -15654, -10802, -20015, -20967, -22650, -4827, 19995, 26795, 27645, -10991, -59540, -99511, -63425, -13615, -34215, -21811, 4387]
9944D387K071l9098o0948J3302K504Q003L7352N9562L1307k0387n1922K2019m6089
9931c7937m3136R029K4348L2231K3304l0173K595O502L9281Q880k1179P471k5420
9918d204j7349M8905j7709n9250J4021N0974K8998j739l020L0718J3861o2674
9906B1532l3082l089J0202J4822l5243j9954K4432M5770K8394R21J4432k1157
9894D7980J4684O151j0317M15K207n789K8412k2439m9545q516K518J0975N661
9881B2397N9707M410k1357m2260n3083l5472l9420K1163M5301j66l463N11L1464
9868a0268K7800N1786j0948r368o166k4868m3369k0356N0656M7261L4594k1660
9856F5094l5162J5355q634q628j5261j0105L3997J6563M3874q148M561M1027j9502
$$ y = [4387, 6458, -32640, -93588, -80286, -77782, -69779, -32427, 27135, 58442, 38055, -13867, 8152, -37937, -81073, -72044, -47696, -15465, 7839, -22334, -19739, -13237, 26044, 34924, 13745, 21216, -4204, -21553, 27352, 9643, -49607, -35586, 15388, 44386, 42647, 39627, 70345, 84206, 21532, -11550, -14639, -4437, 10385, -24858, -44812, -20380, 25390, 53784, 54705, 69137, 47980, 62664, 68815, 58498, 58913, 61120, 55331, 83743, 61304, 11759, 3243, 5761, 16736, 22397, 82104, 86514, 65157, 22897, -30186, -65658, -105078, -83915, -38614, -38780, -42243, -41732, -10268, 17532, 69318, 58370, 49002, 42836, 17968, -25401, -45757, 4899, 52160, 86754, 65094, 29932, 45287, 36653, 28025, 12764, 2659, 36656, 53219, 97093, 88945, 93506, 134533, 115031]
9843A15031p20l4220m4196k2388j3724M8972L442K7336J2139j7275j6541Q184
9831F6040j7475m5596L1699J6473j6851m0250K6981M4990J4530j0222j1526j5152
9819D3641r431j7771N15J5202q826j5698o895J0050M6540n833j3307K2864J1933
9806G2984k8542J4987j0481m8048k252J1183j5693k6541J2561j788J5759j581
9794g452k7976M9884N3411R175l2761k7898j2098m7554J278K2103k451k1543q681
9781e2563n6494k8972M9167N6003J8408o875L6775M6863j4450k6389j4603p6760
9769f9890J3107N6369J7433k9593J482k663l8055k4123J2288K5385P568K9334
9757a358m1722n6878K1467J5824R272L6678M1833O2236j7074n420N770J168m9642
$$ y = [115031, 114311, 80091, 35895, 13507, -217, 48755, 52197, 79533, 91672, 74397, 57856, 66040, 48565, 2969, 34668, 51141, 34290, -5960, 21021, 66011, 80541, 70319, 58793, 43641, 34210, 16439, 16954, 32156, 23330, 7632, 737, 10787, 57327, 51494, 38187, 61051, 72984, 44442, 59429, 48948, 900, -1352, 9831, -5862, -32403, -19842, -21630, -5871, -7452, -35428, 14456, 67867, 77042, 44281, 16383, 4285, -43269, -41991, -19888, -22339, -43882, -52563, -109057, -138029, -88862, -32859, -14451, -21326, 15449, 62312, 47862, 21473, 6870, -69890, -56783, -414, 17019, -12574, -11092, -13755, -51810, -75933, -63645, -38260, -30692, -1358, -43080, -99958, -78491, -62667, -53395, -16717, 25116, 87352, 70278, 64858, 70628, 71796, 22154]
9744B2154R11q459j9320j9911K1245K2477N193j3194j9672J155k3076K0523M043
9731e931m609J8875J91m775J2185O034k073l7303l5318j7790K0553J0764k3369
9718f2566j9660K0530M2172J3586M9297k2476j3129l4282k5674n75k1704J9830
9706e4651L9329J2937K8257m7825N358k9887O219J8644j3432p473K1407o737o719
9693c4573q857J1422J2681M015M0761K0888l385o706n842l44K0220J4309k5110
9680C9479K1037j475k0263q232l3395o672m915P823K769j7218n8627j1926m388
9667i6003K7948K8684N444j2276p75Q68l3153M3020O7863O700l5182l7199l1165
9654f5226m5233K5978O4863L7536K0988J2706k2955O256J3116l9236j9658J4779
$$ y = [22154, 23065, 14606, -4714, -24625, -3380, 19097, 24290, 11096, -8576, -7421, -30497, -9974, -5931, -10540, 8335, 8526, 3751, 15936, 21970, 19897, -17406, -52724, -70514, -49961, -39197, -62566, -82226, -61696, -19524, -5938, 43359, 20883, 7754, -26528, -52202, -52777, -74481, -54651, -15322, -2385, 25872, -21953, -16595, -46482, -40263, -21619, -35051, -42524, -21117, -27854, -34573, -43430, -32008, -19327, -15312, 25449, 46337, 42952, 36246, 30404, 30060, 50280, 64589, 39479, 60516, 59041, 38778, 30546, -2849, -9521, -14436, -6613, -3844, -21062, -79689, -91615, -96003, -68055, -39371, -33927, -46203, -46978, -46110, -79263, -36243, 31620, 38320, 3138, -34061, -65226, -110459, -84481, -19618, 17918, 38906, 51612, 28657, 34913, 48029, 8793, -10865, 3914]
9642C914L454K6058j6565o1035K3017q66K1780j5871M892j9771j8032J2580j8896
9629e5341K0315Q978m506j472p635N758p61K3922J019O609J8077k1258o060J6201
9615C846Q990L1774j9113n4070l1470M3486K5744l7170j4147O9656M8198J6252
9603I1976k4779o5653j3976L214M2964K3260k6795m3334k4232M5542N7311k1480
9591D4018j1978k5755l1931K000N08m2395l7581K0296M3864M8952J4411j5424
9579H985o1k2557m30L3346N2408k0539l4153k3515o0161Q552L7611N9355J7883
9566E6724K3474j9435m4207N690M2199R206j3151l828m8308k2817L6943K6418
9554D8908N398J9378O269K0865m6942k2569Q796j3396l2635O142k2542J3251j5278
$$ y = [3914, 7368, 33426, 16861, -44174, -21157, -22023, -243, -16114, -11222, -30993, -49025, -36445, -55341, -35026, -26048, -30554, -32026, -39661, -33903, -34664, -10742, -9723, -3114, 14963, -6295, -12355, 3846, 12836, 44610, 25497, -28573, -60043, -16557, 9187, -27983, -42130, 27526, 75724, 91976, 67197, 1544, -12432, -9218, 33746, 57006, 30211, -13123, -37355, 8187, 65498, 44018, 32040, 6285, -25646, -23646, -23138, -65533, -103114, -82818, -38954, 9998, 24409, 8985, 8924, -13633, -14063, 19283, 71691, 51152, 16999, -6516, -66677, -58125, -20514, 38841, 56724, 80198, 60763, 16556, 22246, 64445, 73651, 60500, 56672, 8364, -14453, 22490, 48908, 54306, 73684, 79953, 100818, 53876, 31307, 40103, 26707, -5928, 214, -22328, -9077, -24355]
9541b4355J0427L6821K537r198K7951K9101k3846m8381N507J5082j9887K3258
9529B5017o066k2447M7007P124m7873K47J7969m190m6610j0465l1213K0959j4769
9516f5310J2270K1730O177M0128q576j0835P074J1928Q00p074j0897k4632J7789
9503i428k5226J1906J1808L1160q620n3585k3953K5965n497K2852M7215K4745
9491D9342l9116k9149J690j3796j0879j8262N720M347J4470L0643P860k7305p952
9478c2387L0815J6574K788K7061N8360k5384n1751j629K2382P926l6533o2461
9466d4239M835L5600k595K4623J887j8841l4478K0585l114l4057K3008Q66j2196
9453c8116J8109K0657l699K4304M0291O393L4469l0678j9333k1328j8907o519
$$ y = [-24355, -13928, 22893, 25430, 16232, 44183, 73284, 49438, 1057, 6564, 21646, 1759, 25017, 18951, -3496, 43511, 50635, 2762, 3009, 20978, 16788, -29822, -40287, -71500, -50541, -65310, -53040, -31310, -25133, 14995, 6419, -4416, 2658, 14586, 15386, 8312, -2585, -27217, -9428, -34654, -22748, -10940, 20220, 11600, -41985, -65938, -39973, -45470, -22618, 24597, 49342, 10226, -18923, -17233, -31029, -41908, -60170, -54450, -50103, -35633, -4990, 2870, -24435, -32387, -1572, 15002, 17790, 44851, 103211, 77827, 26076, 24447, 46829, 54755, 18222, -44239, -39404, -3804, -6399, 18224, 20111, 1270, -33208, -12623, -15737, -49794, -26786, -25920, -38116, -20007, 650, -3049, 21255, 61546, 67939, 102408, 71730, 52397, 31069, 12162, 5643]
9441E643j2948k6536K209p485J284O408L367k5987J748J6021m609K7560J5857
9428B532j8419J0455p500n435J5976L2770L1757K1374j7893j489J8394q789k6928
9415D6805j1384O22L758l7775J18j1678l9546J140J8784J2406m707N106j772K818
9401a5305L6315j3390n4498M263R37j3875L1475O0471j336o6922n1122k8842L5382
9388g6447Q2928L1900m8975m4123L0402l7623m387N3102m1480j2754L0898O0950
9376B4391k585m1308K0884R879K4530j8167J1547j0902p5143m5054J5508N4356
9364c2064J5548J187r329k9012J4688L1819o956l609k9023k957O3265M9471j5751
9351D7277k5023k5496K1065M4354m272n957k7158k2567M3093m073l6782N2599
$$ y = [5643, -7305, -33841, -31632, -39117, -37833, -31425, -28058, -54045, -52297, -36276, -40885, -13325, 2532, -15887, -5432, -12932, -18367, -2391, 30379, 62136, 83510, 65617, 64128, 82522, 73733, 46805, 35421, 36043, 39801, 2026, 2144, -9534, -49080, -47940, -29156, -16750, -21457, -16351, -18123, -15305, 21010, 7620, -46878, -42615, -41678, -55553, -24078, 36393, 35057, -31865, -82987, -111829, -76447, 6481, 38381, -10594, -54717, -24315, -61938, -66325, -13223, -54703, -67457, -36559, 24391, 21806, -19502, 1382, 11261, 35791, 17624, 29171, 18269, -56874, -101928, -86420, -32064, -16516, -15329, -24658, -53670, -38982, -7163, -14119, -17728, -46751, -49708, 13557, 63028, 47277, 22254, -3242, 17823, 62177, 57905, 51948, 24790, 2223, 45316, 41243, 4461, 57060]
9339E7060K5325n5869o8828K6463L0796k883J154K2825l9133k6353O20j203j0397
9326d0423J6715L7061p696r863L7697q902k5164l6891M3381K2871J3320k0925
9314B1181l2009K6955J6493q541r100k0610J4971L3065k0460m522J7537j555K4129
9301E7534K9776L0535m4289m2471L8123L8881l3508j3226jl2332l0435m31K9384
9288B7540N4007j6127n2829K4745Q23J7014L2491J4517l8125q739j0316L6567
9276H1568K1679l9684r75J8252J232j100j3286o10J2537J1732J2205N003j7846
9263I0707k7878K1210M3183J9491m6713o5183L2114N5232N786Q103N4189M6524
9251B36765m4895j8699l633J0645l0111K0789K8716l873p081K0974J0333n8497
$$ y = [57060, 82385, 26516, -42312, -15849, 14947, 12064, 13218, 36043, -3090, -29443, -28823, -30026, -40423, -23708, 13353, 5657, -4206, 33491, 24589, -575, -37466, 5915, 28786, 42106, 21181, -10828, 16127, 32620, 24079, 14979, -5631, 9340, 42405, 21945, 17423, 34960, 33405, 57534, 87310, 117845, 73556, 31085, 69208, 108089, 74581, 61355, 61354, 29022, -1413, -1844, 27540, 81547, 65420, 12591, 37336, 38159, 55173, 87664, 102181, 64056, 55317, 45001, 81568, 103247, 63563, 62588, 80840, 82072, 80972, 67686, 67076, 79613, 91345, 103550, 108553, 90707, 62829, 84039, 127222, 146713, 100000, 34817, 66931, 122163, 127949, 136052, 190241, 236765, 191870, 173171, 169538, 180183, 150072, 170861, 199577, 195704, 188623, 209597, 219930, 161433]
9239A61433Q420k607M8826L9067n612O371L4255J1432j6462K5735M3550R470L5105
9226C98983L002M8915L9937K7784L4855J00686P570J3700P2106K8651M0209J08956
9214I25354O4990P9092J42873J62024J42584J14819J64885K03344L10665K95348
9204B605978L48899M21145N14247O50924P94805R13588J103148J218394J352040
9195I923168J403348J230708R64270N98537L5561n25242r67310j196563j270201
9186A0196276j221720j054830q65554p93540o85897n88094m62472l59637k85919
9177C878613k86394k94828k20910k10916j29574j26797j10557j19937j21198j54904
9167B102598j50285r1109n3287o3207p0330o9424l8555m8930l7657n4218j08602
$$ y = [161433, 169853, 167246, 216072, 255139, 249527, 255898, 290153, 301585, 285123, 310858, 354408, 363878, 398983, 401985, 450900, 490837, 518621, 553476, 654162, 661732, 675432, 747538, 776189, 816398, 925354, 990344, 1069436, 1212309, 1374333, 1516917, 1631736, 1796621, 1999965, 2310630, 2605978, 2954877, 3376022, 3890269, 4541193, 5335998, 6249586, 7352734, 8571128, 9923168, 11326516, 12557224, 13521494, 14120031, 14155592, 13630350, 12663040, 11466477, 10196276, 8974556, 7919726, 7054172, 6260632, 5574735, 4986641, 4524169, 4164532, 3878613, 3592219, 3297391, 3076481, 2865565, 2735991, 2609194, 2498637, 2378700, 2257502, 2102598, 1952313, 1861204, 1807917, 1744710, 1674380, 1604956, 1566401, 1517471, 1479814, 1425596, 1316994]
9156A316994p3258o3768j8896l6904l0494q6396n9399j0295k4658P80l9252m4609
9144H29845k5213l0091p2828j4991Q623l792n4271J9861J0675m8733j7145L440
9132F05380J3062J933j033j6541K046O791k3320j0196l6077k4057j3952J692J8277
9119E24005j9433n4889l3241l6122k5206l598j5215j9553K4025K3010P56k5566
9107C38973K5789j1550n6857k7771O896M5042k544j5551K3213n1575m2548p095
9095B24422L5294q285J5736P815j6934m8502k8520K0142J2575J7318n0315N74
9083A81320k0654J6364K4210J9433M0459J9130q6787k9344J901q195N970J7955
9071A81762n794k5949l9480j859J6235O2155N042l2741m1618m4266P685P700k3429
$$ y = [1316994, 1243736, 1179968, 1161072, 1124168, 1093674, 1007278, 947879, 937584, 912926, 913706, 874454, 829845, 804632, 774541, 701713, 686722, 695345, 691553, 637282, 657143, 667818, 619085, 601940, 605380, 618442, 620375, 619342, 602801, 604847, 611638, 588318, 578122, 542045, 517988, 504036, 505728, 524005, 504572, 449683, 416442, 380320, 355114, 351516, 336301, 316748, 340773, 363783, 364539, 338973, 364762, 353212, 296355, 268584, 275480, 320522, 317978, 302427, 325640, 274065, 231517, 224422, 259716, 251431, 267167, 274982, 258048, 209546, 181026, 201168, 213743, 231061, 180746, 181320, 160666, 177030, 201240, 220673, 261132, 280262, 193475, 164131, 166032, 157837, 163807, 181762, 175968, 150019, 110539, 108680, 124915, 187070, 192112, 159371, 117753, 73487, 81172, 88872, 65443]
9058F5443m2312n0595L4715j9129p716K9797K1165J0401j926j9818m732P110j392
9045B1011P199J7367J0145j6532n447j7186J2729K3293k4703K2866m3873j143
9033E726J1082K3015K4869O044m074o354J9075J192m0363k7599k7059p116o89
9020b2251M8489P7388J9573j3136k8496L4842P999l2798n8354n86M6003J3946
9008I2619j8693k4060j3570K1995O06L8056L7697k8757R8L120p1843o7145L8311
8995H434L0892l0764k1114J3037R447k2756j6374L3075L9087L877l6505k9390
8983a9054M5759M08J2686P449j0188l0235k5120L7671m207l4601k0052O24N1369
8970A2509J4346k3027k7395L0342K3467j3814k8942K860O6850j2058n2630L67
$$ y = [65443, 23131, -27464, 7251, -11878, -19594, 10203, 31368, 41769, 39843, 20025, 15293, 22403, 21011, 28210, 45577, 55722, 39190, 33743, 16557, 29286, 52579, 27876, 50742, 6869, 5726, 16808, 39823, 64692, 70736, 66662, 60308, 79383, 80575, 40212, 12613, -14446, -21562, -22251, 26238, 103626, 123199, 110063, 81567, 116409, 124408, 91610, 33256, 32670, 78673, 92619, 73926, 49866, 36296, 58291, 58897, 96953, 134650, 105893, 105991, 109111, 37268, -29877, 8434, 39326, 8562, -12552, 485, 9932, -12824, -29198, 3877, 42964, 46841, 10336, -19054, 26705, 27113, 39799, 47248, 37060, 6825, -18295, 19376, 15169, -19432, -39484, -38860, 12509, 26855, 3828, -23567, 6775, 30242, 16428, -12514, -9654, 57196, 45138, -7492, -7125]
8958g125J401J3661k825N3173L3212j3833l2340k6956k4357l0742J3437M0032
8946A6738J6822J5660J8257l3942m7230M1310M3482j5700n3961m2023K1500J5474
8934c613K873N6972j9952l5649q840k5148j6649K0047K1103J3311K7571K3091
8922E5117k6225l4311N814P565n7451k9272L0919J6337k4360L3836K8233l0994
8910b4792L9754J1180L9044o1975q715k8719j4055L0521n85o317k5273o275K500
8897e3707M6331J1661L7214J3416l0239K4496N6450j2545m1997p0325K830K9351
8885A2936N2800j604k9685k2289l511j0202n041j0799j7007o469K5108M7437N771
8872C7445Q2k6239P418K5423R872k2623m239m2098L618R314l1946n7626J0241
$$ y = [-7125, -5724, 7937, 5112, 58285, 91497, 77664, 45324, 18368, -5989, -36731, -23294, 16738, 33560, 49220, 67477, 33535, -13695, 27615, 71097, 55397, 1436, -40587, -19087, -3613, -740, 56232, 36280, 631, -8209, -33357, -50006, -29959, -8856, 4455, 32026, 55117, 28892, -5419, 395, 7960, -49491, -78763, -47844, -31507, -55867, -22031, 6202, -24792, 14962, 26142, 65186, 3211, -5504, -34223, -48278, -17757, -18342, -24659, -49932, -56207, -53707, -7376, 4285, 41499, 54915, 24676, 49172, 105622, 93077, 51080, -19245, -16415, 12936, 65736, 64132, 34447, 12158, 8647, -1555, -6596, -17395, -34402, -40871, -15763, 31674, 37445, 37527, 11288, 18706, 44129, 54001, 31378, 27139, -14959, -11341, -2027, -33973, -91599, -81358]
8859h1358N4368O1718j9560m8033K0608K7050J9570L0549k4638o3502k2056l976
8847d9260J479N3843M3712j0282l6954J2243p81j9546J7988J2690n5954J8650
8835a2172J7474k78m794n649M5443M60n2461k9238K875K5766K9546M879J304q358
8821A4797N205K8090k3740K29m0931m078K6868q575o370l0864M0806K1101k4194
8808a656k5234l215M3814K3326K0826j0881m363J6088m4502j4077q832m6329M4843
8795a0192K411k7743J9067J013l1491K0016M5710M9003L5531l3323j228J9870
8783H8644Q03l2954m2897l9418R446j7977L2149J9115n5271O738M9836J5467J0588
8770D4269K7819k8958o5503m7562M012k101K6819J6944k4636O83K5129r80n446
$$ y = [-81358, -26990, 34728, 15168, -32865, -12257, 14793, 34363, 64912, 40274, -23228, -45284, -49260, -47781, 6062, 49774, 39492, 2538, 14781, 14000, -5546, 12442, 25132, -30822, -12172, 5302, 5024, 230, -5419, 40024, 40484, -11977, -41215, -38340, -12574, 16972, 21851, 23155, 14797, 20002, 48092, 24352, 24581, -16350, -20428, 6440, -2135, -8505, -39369, 1437, 22538, -1656, -26890, -30105, 13709, 37035, 57861, 46980, 42617, 58705, 14203, 126, -8706, -55035, -10192, -7781, -35524, -16457, -15444, -46935, -26919, 18791, 67794, 103325, 70002, 68774, 88644, 89447, 56493, 13596, -25822, -16376, -34353, -2204, 16911, -38360, -31622, 18214, 33681, 44269, 72088, 43130, -22373, -69935, -65923, -68024, -41205, -24261, -48897, -48214, -23085, -24065, -29511]
8757b9511N9455N8835n682l1269l8042q898l6067k8378k1934K4885j1840J4797
8745e3649K3114P706J6455r358k1874J4564l627M9872K0093J3330k3163o821m1030
8732a4388k1089K9329K0711N3643j0580j2227j0114j8073k9836J3694j6548m0357
8720e5835l1534L2664j003P719J1943J8857J845K5825j6845j0700L1827j3945
8708H18J8949j795l4932n911J698J1282J430R085K2387J6902J0899n480k4827
8695B0505m856K7232K9582k4702n1066n391k9084J5728O595J0172K9815j0889
8683A3641j2718j1781L8075p19m020l4954N180q951l13M688O7113J824l8270m8703
8669b9908k8923M1826j16K62O177L3784j0846m5991J7678L0082L9296J6993p507
$$ y = [-29511, 29944, 88779, 83097, 51828, 13786, 4888, -31179, -59557, -81491, -56606, -68446, -53649, -30535, -22829, -6374, -15732, -37606, -23042, -26669, 23203, 43296, 56626, 33463, 26642, -14388, -35477, -6148, 14563, 68206, 57626, 45399, 35285, 17212, -12624, 1070, -15478, -55835, -87369, -54705, -55708, -47989, -36046, -17189, -15344, 10481, -6364, -17064, 14763, 818, 19767, 17972, -16960, -22871, -21173, -9891, -8461, 624, 23011, 39913, 50812, 45332, 20505, 15649, 42881, 72463, 47761, -3305, -8696, -37780, -22052, -15457, -5285, 24530, 13641, 923, -10858, 27217, 26498, 22478, -12476, -7296, -16247, -16560, -11872, 55241, 57065, 18795, -29908, -58831, -17005, -17121, -16859, -10682, 23102, 12256, -33735, -16057, 14025, 53321, 70314, 62807]
8656F2807l1128n0549K5680l5042j939M1235J9409L5930J1195o8831n6163L0930
8644a6466J9800K3699r976k7031l5112L0634O711J7592K1941J5411l1520J4593
8632C0276L665j1892Q800K7018k079k9782j7624l0037K783L4541M3881j3553m7289
8619a292l7019k0801m14M2229N827J8559j4239m3016K3417K9817k7731Q258J2760
8606c645O110K9065J1677J602o165k6795K629L144L6657q937J5218l9251m9683
8593b8374j0756o835O7M8465j6170j3777N1575J2665L3668K5851o703j450l6340
8580E1886l7223K4123k1296l5902k5120J7692J8447j8243J4371P975p853P968
8568c175k2441q347L7364M2356L4761l1533J5204J0861k3958l2903k8711j8251
$$ y = [62807, 31679, -18870, 6810, -28232, -30171, 11064, 30473, 66403, 77598, 8767, -47396, -16466, 3334, 27033, 17057, -9974, -45086, -14452, -7741, 9851, 31792, 47203, 15683, 30276, 33941, 22049, 30849, 57867, 55788, 26006, 8382, -21655, -18872, 15669, 59550, 45997, -1292, -38311, -59112, -59526, -17297, -11470, 7089, -7150, -50166, -26749, 3068, -24663, -16405, -3645, 2465, 31530, 43207, 44809, 38644, 11849, 14478, 17622, 54279, 45342, 60560, 21309, -28374, -39130, -45965, -45898, 2567, -13603, -27380, 24195, 36860, 70528, 96379, 89676, 88226, 51886, 14663, 38786, 17490, -18412, -43532, -25840, -7393, -25636, -11265, -3290, -11143, -3175, -25616, -33963, 3401, 45757, 80518, 48985, 64189, 75050, 51092, 18189, -10522, -28773]
8556b8773J8685J740K1491J9347L4219J9370j7963k0096j7448J0794j6492l1648
8544f774k5211m2900L45N5257M745j1028J6447j8833j2073K2079J0852K8523k2397
8531i68o67n618m246l4727J8033R558l406k0414K6665L8250J5455J4975M5713
8518I8603J8738k7696l6730l2003k935j3918P203j286J1548N281j039L3444J2454
8505G1664k6023l7009J5251J3506r265j4520n38l408P38J1068L3180Q448J5589
8492G8681p481j2606r044r7j8566j9946M0679K4784O50k4698m0050J8066M812
8479C5184j629n58j418K3670j414J8186k2862n4281j0413L8596J8564j7674j6677
8466G274Q453K5809J0368K655j1422p1638k3765k582K7916O5798k2411j1460j3097
$$ y = [-28773, -10088, -8348, 13143, 32490, 66709, 86079, 68116, 48020, 30572, 41366, 24874, -6774, -31985, -74885, -74540, -19283, -14538, -25566, -9119, -27952, -40025, -17946, -7094, 21429, -968, -1635, -7253, -11499, -46226, -28193, -18635, -22041, -42455, -15790, 22460, 37915, 52890, 98603, 117341, 89645, 52915, 20912, 17977, 4059, 11262, 9976, 21524, 26805, 25766, 59210, 71664, 45641, 8632, 23883, 37389, 28124, 13604, 13066, 9658, 10396, 21464, 54644, 63092, 78681, 71200, 58594, 49550, 49453, 30887, 10941, 51620, 76404, 77054, 52356, 12306, 30372, 35184, 33555, 32997, 31579, 55249, 53835, 72021, 49159, -5122, -15535, 23061, 41625, 23951, 7274, 15727, 41536, 51904, 54559, 43137, -28501, -52266, -54848, -26932, 38866, 16455, 4995, -8102]
8453h102L3384j4079j6159M7107L2954O843Q205o6234M289K9391m621k792j1394
8440C8792o4901k6144N8240J9438L416K9102j6168k7768n2731n1241K1631J5538
8428e2796K9584Q65m5321j1013L7462L0435J6420q665m9371l0790K5897j402L4544
8415b4151O2799j391j3567J3024n322j2055j4879k6143l4543O028j498l942J9705
8402c5935J3335K6225j0895j5712R440J8265Q664j7434j1342L5066J500k90j2053
8389H834O164j9766j8494j4079j158p472q942J8577L1747J3478l7923P209j1559
8376c3384k3716j8628l093j0838R000J8283J0356L0388K3462n971J9044l666j4597
8363c360J2280q253q882q892m2948j0766K1411K1571J4948k4151L7129L2687r062
$$ y = [-8102, 25282, 11203, -4956, 42151, 75105, 81948, 90153, 23919, 28208, 57599, 52978, 50186, 38792, -26109, -52253, 5987, 25425, 28841, 57943, 41775, 14007, -38724, -89965, -68334, -52796, -23212, -22347, -67668, -78681, -41219, -10784, 5636, -3029, -52400, -83190, -57293, -58695, -24151, 38648, 37257, 23690, 36714, 31392, 19337, 4458, -21685, -56228, -50200, -51698, -55640, -35935, -22600, 3625, -7270, -22982, -13542, 4723, 13387, -4047, -15389, 19677, 21177, 20887, 8834, 14998, -4768, -23262, -37341, -38499, -45971, -54913, -36336, -4589, 8889, -29034, -21825, -33384, -57100, -75728, -78821, -89659, -80659, -62376, -52020, -21632, 1830, -4141, 14903, 11237, -3360, 8920, 667, -8215, -17107, -60055, -70821, -49410, -27839, -12891, -37042, 87, 32774, 23712]
8350B3712j0499j2740o940J6450L8369j8249k1501n357l6521k3340l1788K4402
8338f4002j3114N5337L0776j8778q562k5701L4125K2178l1054K7405R339N106
8326B3055O681j7324m3916L2497J1431L089k0284L9373M3724l2359J9514K6337
8314I1818K0843j4132n4167j3437k2871L5167K9675k2434k1756J2313O249l9358
8302G910o339l334k212n131K3890L2317k2099k9640K1667k0318n3346R519j559
8289d8675K1828j303j79K5548k3717L0390L4370k114K1968N172j1650k0477L925
8276C5086j8494J3488P405l6504R849L8523J6691j3620R285l571l8601j8438l582
8263b483J9043K6188K3007J2317p324p058m410n163J5446L980l5854j9524m024
$$ y = [23712, 13213, 473, -6467, 9983, 48352, 30103, 8602, 3245, -33276, -56616, -88404, -64002, -77116, -21779, 8997, -9781, -18343, -44044, -9919, 12259, -18795, 8610, 17949, 23055, 29736, 12412, -31504, 993, 12424, 15513, -4771, 34602, 78326, 45967, 65481, 91818, 112661, 98529, 44362, 30925, 8054, 43221, 72896, 50462, 28706, 41019, 47268, 7910, 1571, -1763, -3975, -9106, 14784, 47101, 25002, -4638, 17029, -3289, -56635, -47116, -48675, -26847, -28150, -28329, -2781, -26498, 3892, 38262, 36148, 58116, 63288, 51638, 31161, 35086, 16592, 30080, 37485, 981, 10830, 49353, 66044, 52424, 61709, 58138, 19537, 1099, -2483, 16560, 42748, 65755, 78072, 70748, 63690, 59280, 54117, 69563, 73543, 37689, 18165, 14141]
8250A4141J9183k0503K6100l1047m166N59k4273P895M2095L8476J1058l1179k3682
8237B4657j2894M3296N091L311m5720M034K140J9222K4083j6658l1128L611k4569
8224a524l4488k902J1599L7601J5068J2732l5476R863l073k5541j4211K3872K5374
8211A8894L0454K873o825J2393J9173l5809k7313j5142j627K2919K2057L879J4200
8198F0126k4596p4876n128M126J505J9100q282L403M2341j0932k7207k8496K447
8185d6469J7174O1998N8743j6168o790m4643n0182l9130K3232M7546M523k0855
8173a1021j13M2544M7792K3737j8470J1154j8722o2563j9438m5116l715K6700
8161b7231J7487j920m2292J4867N0800L4386j8881n393K2718j6189l574l1256
$$ y = [14141, 33324, 12821, 38921, 7874, 3708, 4267, -20006, -12111, 29984, 68460, 79518, 48339, 24657, 11763, 55059, 60150, 63461, 17741, 21775, 23915, 43137, 67220, 50562, 19434, 23045, -1524, -36012, -38914, -27315, 10286, 25354, 38086, 2610, 12473, 9400, -16141, -30352, -6480, 18894, 49348, 52221, 45396, 57789, 76962, 41153, 13840, -1302, -2929, 19990, 42047, 45926, 60126, 35530, -39346, -44474, -40348, -38843, -19743, -28025, -24622, 17719, 6787, -20420, -48916, -46469, -29295, 32703, 91446, 75278, 68488, 23845, -26337, -65467, -42235, 5311, 9834, -11021, -11134, 31410, 79202, 102939, 84469, 95623, 76901, 14338, -5100, -50216, -53931, -27231, -9744, -11664, -53956, -39089, 11711, 46097, 27216, 21823, 44541, 28352, 24778, -6478]
8149f478n1232M3665M0375o99k4954r41p351k1798j9424m665J8783K5634k1609
8136c0694L2430K725J7137p057m2287m4726J9243N3501L728k5499k6957N351r480
8123e2585k6424J607K7006m789n2476j2202K8938J9739M419M6849P503j1914p402
8110c1731K7811M5631J3534J8507j550n5934l8033l0761J9087J8313j2278k3312
8098e0716K2329L518J8637k819n011K301O889Q875K121j3279K5026K0423q870
8085B9424J8376J7381k234n195m2018n1452J3107j0759K5417L7959P139j522J576
8072C7199n6031j1063R920O698r585J4683L4031J3447P447n0949l7494N753N8301
8059B2357P522j290n354k5073J4854K605K6384k7969l2685m9683j6885j526J0053
$$ y = [-6478, -57710, -14045, 26330, 25631, 677, -264, -7615, -29413, -48837, -53502, -34719, -9085, -30694, 1736, 4461, 21598, 14541, -27746, -72472, -53229, 272, 4000, -21499, -48456, -43105, -52585, -79009, -77402, -50396, -55185, -107661, -119863, -90925, -71186, -66767, -19918, -12415, -24329, -31731, -3920, 41711, 55245, 73752, 72202, 16268, -21765, -52526, -33439, -15126, -27404, -50716, -28387, -24869, -6232, -9051, -14062, -11761, -4872, 4003, 6124, -7155, 17871, 38294, 29424, 47800, 65181, 62947, 57752, 15734, -35718, -22611, -33370, -7953, 30006, 37145, 35623, 37199, -18832, -29895, -19975, -13277, -22862, -8179, 25852, 39299, 46746, -4203, -41697, -35944, 22357, 29879, 28589, 23235, -1838, 13016, 15621, 42005, 14036, -18649, -68332, -85217, -86743, -76690]
8046g6690J4392R785J3732K9474O3098j6759N154M4580P25l4759l6271p872k1908
8033a3319Q039J627j5004N3889L7620k5326Q450J4681l8654p883P058M0826l1902
8020D0102o5904q074j5567J7986j2045j0520k3869m918K2474K5256l72K7983K7251
8007A9783R294J0366l683k8138l8512n964l3371K6930K9442L2682K0386l5296
7995C919q619R021L1664k752k1136k3159K996l4864J0518J0192K4583k9504j3832
7982d0973m701J6707L5436O859L5733j2973j5397J4906J0278j763k3290l0878
7970a0056k0055m0487J5382J0573J83L6386K3420J2885l7499j2417l0539M413
7958d7811K2582N084m1435P20K9320J4351p119K0277k0947L3936j9602k0660N0118
$$ y = [-76690, -62298, -52513, -38781, -9307, 53791, 37032, 42186, 86766, 87491, 52732, 16461, 8589, -13319, -5280, -3653, -18657, 35232, 72852, 47526, 55976, 70657, 32003, 24120, 31178, 72004, 40102, -25802, -33876, -49443, -31457, -43502, -54022, -77891, -82809, -60335, -35079, -35451, -7468, 19783, 29077, 39443, 35760, 7622, -30890, -36854, -70225, -43295, -13853, 18829, 39215, 3919, -4700, 4321, 35985, 33233, 12097, -11062, -8066, -42930, -32412, -22220, 2363, -27141, -40973, -45674, -28967, 6469, 13328, 49061, 36088, 20691, 35597, 45875, 44112, 20822, -10056, -30111, -70598, -55216, -44643, -44460, -8074, 15346, 28231, -9268, -21685, -52224, -47811, -25229, -20145, -61580, -60860, -31540, -17189, -24308, -4031, -24978, 8958, -10644, -31304, 18814]
7945A8814L7327L3156P972o467r671l6502l1815J1079J1191k0213j1327j931K1734
7932B3347K025m6372j0088L3119L7054j4277k6536l051j8174J1501J9977J8648
7920B7173n96K097j8837m7200l3802k936M5833K7324J0843K1309J5921j1658j6358
7907A9113Q568P722o928m4057j5344M4839J8619L999k433j9815j718J7502J2569
7894D2636j7777k6253J5130j8636K3052K4293L2728J68o1454O964J2767k6175
7882G443k4165J1056N6423M4060L425o0932j5549O062J9606j2471L003O561l68
7869D4154l8610k2985j5669r864K5277k5888j4007L3504L6084k2429k0112n464
7857c6009l2919P901N1555J2318P76K023J0749K6920j3952K885j7112q7889L6646
$$ y = [18814, 56141, 89297, 97269, 90802, 81131, 44629, 12814, 23893, 35084, 14871, 3544, 1613, 23347, 25372, -21000, -31088, 2031, 39085, 24808, -1728, -4779, -22953, -11452, 8525, 27173, 26577, 28674, 9837, -37363, -71165, -74101, -28268, -944, 9899, 31208, 47129, 35471, 19113, 27681, 35403, 28475, -15582, -30926, 13913, 32532, 36531, 34098, 14283, 12565, 30067, 42636, 24859, -1394, 13736, -4900, 18152, 42445, 75173, 75341, 13887, 20851, 33618, 7443, -16722, -5666, 50757, 94817, 98242, 37310, 21761, 27823, 47429, 34958, 37961, 44522, 44154, 5544, -17441, -33110, -42974, -17697, -43585, -57592, -24088, 11996, -10433, -30545, -36009, -68928, -61027, -9472, 2846, 3622, 5645, 16394, 43314, 29362, 32247, 15135, -72754, -36108]
7844c6108l366M603O151m3137M523j8076L9790K7029M1620L430m47J34J6443k9559
7830A3030m8904M1728j6692l3138K0600K3856p5j3110K7147J3934j7968K3006
7818C3414k3228j0807l245K03l125K7440L2194K0214j2888k1977k0487M6411N7394
7805A21513k8436j4533j9835j8340l7175k4905J042p33j6068L436K1534L3300
7793B0800j9591j4494j5432J6308L2262k4781p595M1313J0390k6187j087j0243
7781A663n782q064L1995Q1425j7064o2025l2034j9605k0954L0973K6231L4467
7769D1226j9239n8324k4178J53L5376L1229m2455j7904L0315j5352k5651m991
7757f9795K263K2859J0591j0323J6958j266m0988k3398J3764K2096K8408L7687
$$ y = [-36108, -39474, -34871, -28720, -71857, -67334, -85410, -45620, -18591, 23029, 26459, 26012, 26146, 42589, 13030, -35874, 5854, -10838, -43976, -23376, 480, 405, -12705, 14442, 28376, 10408, 33414, 10186, -621, -3866, -3663, -6788, 20652, 52846, 73060, 60172, 38195, 17708, 64119, 121513, 93077, 78544, 58709, 40369, 3194, -21711, -20669, -21402, -37470, -34034, -12500, 20800, 1209, -13285, -28717, -12409, 19853, -4928, -12523, 28790, 39180, 12993, 11906, 1663, -4119, -12183, 19812, 101237, 84173, 22148, -9886, -29491, -50445, -19472, 6759, 41226, 21987, -36337, -60515, -60362, -24986, 6243, -36212, -54116, -23801, -39153, -64804, -69795, -67532, -44673, -34082, -44405, -27447, -28713, -69701, -93099, -79335, -57239, -28831, 8856]
7745H856K5802L9779R37k4429k2197o1232N726j319l8917J7903K7916K9535r37
7732G423j1227K1634J3200k3832J0999j1805j7397l8379L0082J4863o042n053
7720a5534k7760L5864K6181l6552p978J6606K1268K1345k5002l8828K02l1766
7708f1954K4814J4812J4049J6265m5431K592K5304M573K4607k333k3820j1997
7696a8519K925K5335J5036K9030K181l6531O263M355j3037m8238k603N910j8037
7683d5930L7286L3735j8063K7473P56k4245k8246J114q473O026K8530k0134J5872
7670E701L2515J3314Q60k5588q977j6661m530j5350O843k5100K2531j2553k1084
7657d8079j0378M704O51L122R208k0136j9489k3380L7553M7173k9113r505L6741
$$ y = [8856, 34658, 74437, 75374, 50945, 28748, -32484, -26758, -28077, -66994, -49091, -21175, 8360, 7423, -3804, 17830, 31030, 7198, 18197, 6392, -11005, -49384, -19302, -4439, -10481, -15534, -43294, -7430, 18751, -17801, -25779, -9173, 12095, 33440, 8438, -30390, -30188, -61954, -37140, -22328, -8279, 7986, -37445, -34853, -9549, -4976, 19631, 17298, -6522, -18519, -15594, 9741, 24777, 53807, 55988, 19457, 25720, 30075, 17038, -31200, -33803, -27893, -45930, -8644, 25091, 7028, 34501, 35257, 11012, -17234, -16120, -24593, -18567, 9963, -10171, 5701, 38216, 51530, 52390, 26802, 17825, 1164, -3366, -18716, -11873, -36973, -14442, -26995, -48079, -58457, -53753, -53102, -49980, -40772, -60908, -80397, -103777, -66224, -19051, -48164, -57669, -20928]
7644b0928J6013L5639J9935K6919K45l6372J6034N458R334k6951j8125j1806P891
7631B3286O652l9148p617L0556M7647L386n9884R42J6877J0483O916L7804k4170
7618E3730l8588k1900O257j3879m2056k6797k3552K2091L6244M4930J756j8721
7606b0485J8645R800J5907L0043L1777j484k6213k3556l3784L2971p628n5354
7594b9361O626j4509l5606k8967J2204K8971q415j3220n017O9920J6008K7487
7582B6121k5773l149L8915p792k449l3496P697J7751p353q967k5628K9406L4030
7569C9313q306k6665l6343J764M4271P115l163j966J4755j5548k6629n58J0807
7556a153J4561M2742k2911K4828L222j16q222m3514Q190K6198M42j3159j8596
$$ y = [-20928, -4915, 30724, 50659, 77578, 77823, 41451, 57485, 62943, 72277, 45326, 27201, 15395, 23286, 29938, -9210, -16827, 13729, 61376, 64762, 4878, 5820, 22697, 33180, 40096, 77900, 53730, 15142, -6758, -501, -14380, -56436, -83233, -106785, -84694, -48450, -3520, -1764, -20485, -1840, 7960, 23867, 53910, 85687, 84203, 57990, 34434, 650, 33621, 25993, -29361, -22735, -37244, -72850, -101817, -89613, -60642, -69057, -82277, -87294, -17374, -1366, 26121, 348, -2801, 36114, 28322, 25873, -7623, 74, 17825, 10472, 1505, -24123, 5283, 39313, 31007, 4342, -32001, -30237, 14034, 21149, 17986, 16020, 30775, 15227, -11402, -11960, -1153, 13408, 56150, 33239, 58067, 61289, 61173, 52951, 9437, 17627, 43825, 44267, 31108, 12512]
7543A2512k8768q846K8592n921O920K067k0306J7296J943l1376j2308n123l0557
7530g3875K6752K8533p364M3369J9248L997N175m972r90j6253l862j9343o832
7517f417j023k2190k1574j9547n716J0711j0116J1257R108J9966L4291J4039k9646
7504a6857J2552N7667j2019O964m4142R788J4115j1842Q670k4242l9198L305L3085
7491b154K6901J5846j9166j2914k1853J5824K0572l1553k124K4851m122m070l9957
7478c3919j2336j4241R015K8102O53n174P107L3766j9737j4307J9097j1489l5442
7465d8905k2164N3863K3071l1470R756K4093O82j0347j6267J1461j812k0172n3568
7452h1779j9432L5053M0712J2691j6216N3360K0474k7072J3787j392L4927L8621
$$ y = [12512, -16256, -25102, 3490, -2431, 4489, 6556, -13750, 3546, 5489, -25887, -38195, -43318, -73875, -47123, -18590, -25954, 17415, 36663, 40660, 45835, 40863, 39873, 23620, 19758, 415, -6417, -7440, -29630, -51204, -70751, -76467, -65756, -75872, -64615, -55507, -35541, -1250, 12789, -16857, -4305, 53362, 41343, 48307, 4165, 13953, 28068, 16226, 24896, 654, -38544, -35239, -2154, 24747, 40593, 21427, 8513, -13340, 2484, 23056, -8497, -10621, 14230, 10108, 6038, -33919, -46255, -60496, -51481, -23379, -22726, -27900, -20793, 12973, -6764, -21071, -1974, -13463, -48905, -71069, -17206, 5865, -25605, -15849, 8244, 8926, -1421, -17688, -6227, -8039, -28211, -81779, -101211, -66158, -25446, -12755, -28971, 24389, 44863, 17791, 31578, 30186, 65113, 103734]
7440A03734l6853k1574J486j559l9974l2707M3337J7599K2614k4256n2920l3536
7428e4609K4334j8753L0863M8603K3215o973j456k6401q875m155k1950l5730j9335
7415g1222n569o347K1545P284J3508j4166p495K3011K9887o472L464J1612k2644
7402b3604j3471n32J8617K0074J2901J2377l3635j9677P811R144j858K1468l449
7389F166K3351o658O85L4626q259j485n701o7242K1886O2178k2917m0199M654
7376A085J782m421r750J3476l1651o0855J5819K5065j0793j4001R997O0158L4427
7363C0338L4632k8679m0269k4764l742M1310L0409m4045j2631N067m1295n0259
7351a03928N102K084K455P4248J6435j141K0043k8220n5187J6451L6271K2662
$$ y = [103734, 66881, 45307, 46793, 45234, 5260, -27447, 15890, 33489, 56103, 31847, -21073, -54609, -30275, -49028, -18165, 30438, 53653, 46680, 45224, 18823, 9948, 5793, -16157, -51887, -71222, -76791, -83138, -61593, -54309, -40801, -54967, -62462, -39451, -9564, -16036, -12572, -960, -23604, -37075, -37607, -18990, 1084, 13985, 26362, -7273, -26950, -19139, -9995, -11853, 9615, 6166, 29517, 22859, 23544, 58170, 49911, 48426, 42725, -24517, -2631, 59547, 36630, -3569, 1085, 2867, -1554, -11304, 2172, -29479, -90334, -74515, -49450, -60243, -74244, -64247, -4089, 30338, 64970, 36291, -3978, -28742, -32484, 8826, 39235, -4810, -17441, -12374, -53669, -103928, -98826, -96742, -94287, -20039, -3604, -4745, 15298, -12922, -68109, -51658, -15387, 7275]
7339G275K6740J0369r385l8067j8090l4504K0091J3577J6325J2276n674q755K133
7326e689L6637L217o534K387k1270j3213K6445J1449M1104J9375j4141j6801k0124
7313D2842j2409n1113j6001M883k8915k668K8099n177Q550J1579K8279j0441k7267
7300b9759M596L2733p722K2802N061l0290q125j8795K6951K2636j3869j4599J1339
7287B959K6423p413k9200m0042j7374j0636o68M0416K6238J7915M9275P437l9785
7274B5545j2770m2612l622J4554K2024M581J4992O164k5237m112R693J06621p047
7261A08774r420l1322n0566k1017L149n7526l7562M5972R73k0627k1070m436K7840
7248f6838K9736L8481K5953k6165M744M9843l7908l7635j4706N627j3436L2975
$$ y = [7275, 34015, 44384, 34999, -3068, -21158, -55662, -35571, -21994, -5669, 6607, 933, -7822, -5689, 30948, 34165, 27631, 30018, 8748, -4465, 21980, 33429, 74533, 93908, 79767, 62966, 42842, 30433, -20680, -36681, -31798, -60713, -63381, -35282, -40459, -31909, -20330, 7949, -2492, -29759, -25163, 7570, -152, 22650, 27711, -2579, -10704, -29499, -2548, 20088, 6219, -8380, 2959, 29382, 21969, -7231, -47273, -64647, -75283, -75951, -35535, -9297, 8618, 57893, 65330, 25545, 12775, -29837, -33459, -18905, 3119, 7700, 22692, 28856, 3619, -493, 9200, 115821, 108774, 99354, 68032, 17466, -3551, -402, -57928, -95490, -49518, -48545, -69172, -90242, -94678, -66838, -37102, 1379, 27332, 1167, 5911, 55754, 17846, -19789, -34495, -28868, -42304, -9329]
7236i329M5974K9934l4378m2926J5408K1533j725j946p716j5167m2562r182K4086
7223b7996N6786o470n0429j4356J1542N798m8188j9040K9712M9700J0276k0303
7211b2968N505J5408p705L3528k944j8118p937m833k1793j47Q128M2898L7066
7198E6088R020m6912j6066K0648J4312j3903M15K1383j7430n5835n487J400K395
7185b9972N933M072K8723J1720m8160j0362N354R125K2714N425l6089k4373j1123
7172f7013L2127K9492n293J5491r726Q175j7120J7608K3334j2124k2547l0503
7160c8099K0485L8124N435r775K814J3477J8220m9894m2848P669M9890J9883j2992
7147B2389K3064J3782Q464N289Q200R168l5298k9568j8695m3041o270J576r465
$$ y = [-9329, 36645, 66579, 32201, -10725, 4683, 26216, 24491, 22545, 14829, -338, -42900, -52082, -27996, 28790, 22320, -28109, -42465, -30923, -25125, -73313, -92353, -62641, -12941, -2665, -22968, -17463, -2055, -9760, 23768, 20824, 2706, -5231, -10064, -31857, -32004, -23876, 19022, 56088, 65108, 18196, 2130, 22778, 37090, 23187, 23602, 44985, 27555, -28280, -33767, -32367, -29972, -24039, -19967, 8756, 20476, -27684, -38046, -32692, -23567, -853, 4572, -31517, -55890, -67013, -34886, -5394, -10687, 4804, -4922, 3253, -13867, 3741, 27075, 14951, -7596, -38099, -17614, 20510, 25945, 16170, 18984, 32461, 50681, 787, -42061, -34392, 15498, 35381, 22389, 45453, 59235, 67699, 72988, 81188, 90356, 55058, 25490, 6795, -36246, -42516, -40940, -50405]
7134e0405R947j4368j0334L9344k4476n1845M8116P2829p442m7397k5896q783
7122g0710O2028L4858R875j3761J201n595m1727j0267k0462j1106J4759K4964
7110b5943M097l7702k4491J392K2349L0252n514L0994L808l608L4371J036m3623
7097a2582l9560P935K0808M3884Q261o898j8744j9553l3589l9459j2127J7224
7085h4400o565J9179K6159j81O129K9978J2764K2515Q508k0832M2383J4419R19
7072G0975m1818J010j2551K8256R255M3337P716r449m0377J4110J503K6676m5027
7059E3616m5180N2949O0654J2915K2150o3190o2626J1575l234j8296l662J917
7047A9588k7210m7386K0662J6218N5266j6734k7668N401l1199l8233K2453M4622
$$ y = [-50405, -40458, -54826, -65160, -25816, -50292, -102137, -54021, 18808, 11366, -36031, -61927, -70710, -8682, 26176, 36051, 22290, 23491, 17896, -23831, -34098, -54560, -65666, -50907, -25943, -21846, -59548, -84039, -82647, -60298, -30046, -35560, -4566, -758, -4366, 30005, 31041, -12582, -52142, -44207, -23399, 20485, 28746, 21848, 3104, -16449, -50038, -89497, -101624, -84400, -90965, -71786, -45627, -45808, -39679, -9701, 3063, 25578, 34086, 13254, 55637, 70056, 70975, 29157, 30167, 17616, 45872, 55127, 98464, 106180, 96731, 56354, 70464, 71967, 98643, 53616, 8436, 61385, 122039, 134954, 157104, 93914, 31288, 42863, 39629, 21333, 17671, 19588, -7622, -55008, -34346, -18128, 37138, 20404, -7264, -1863, -33062, -71295, -48842, -4220]
7035d220K7102M359K2440j1026j7818J333j7021k2108O779Q865j1663l6589J1545
7022c8022K1505j5874N0637O7709k0511l4127j3934N359p139J9558L213J5445
7010E3819p813J1617K7630j0002k0718j8606k2996m934k8213q330N891J1745N139
6997e771j5031K23J0013L9104k173j1890m5007k3911J8445P733J453J9732L3797
6984B6717R8n4230J1921J6827K0112n940j3206l2612k7567l652K4784M3398o329
6971C21J1592l769R857k0131j2277J4239r403n8657n296O0295M7264j2051m2973
6958b0989J2663l617K4687r56j1041k2566n623N315R153K7975j7472j8817j7919
6945c9207j3393N204L504M3261N4747J0631j4088K8505k1495m8992j9790p379
$$ y = [-4220, 22882, 27241, 49681, 38655, 20837, 22170, 5149, -16959, -10180, -1315, -12978, -49567, -38022, -16517, -32391, 18246, 85955, 65444, 31317, 17383, 22742, 15603, 35161, 38374, 53819, 46006, 57623, 85253, 75251, 54533, 35927, 12931, 7997, -20216, -28546, -22655, -10910, -5771, -20802, -20579, -10566, 28538, 26365, 14475, -30532, -54443, -35998, -28265, -26812, -7080, 26717, 26815, -27415, -15494, 1333, 21445, 15505, 2299, -30313, -57880, -61532, -36748, 6650, 321, 11913, 8144, 18001, -2130, -14407, -168, -9571, -68228, -73524, -13229, 34035, 21984, -20989, -8326, -11943, 12744, 11788, 747, -21819, -27442, -22127, -12974, 15001, -2471, -21288, -39207, -52600, -47396, -43892, -631, 54116, 64747, 50659, 79164, 57669, 8677, -11113, -18492]
$$ [...]
##END NTUPLES=NMR SPECTRUM
##END=
