##TITLE=Analysis number 316709
Compound Code cc 23113
Book Reference 423/60
Project Code adrs
Chemist Name bruced
##JCAMPDX= 6.0         $$ Bruker NMR JCAMP-DX V2.0
##DATA TYPE= NMR SPECTRUM
##DATA CLASS= NTUPLES
##ORIGIN= Bruker BioSpin GmbH
##OWNER= nmr
$$ XWIN-NMR		Version 3.5
$$ Wed Jul 12 08:26:23 2006 GMT Daylight Time (UT+1h)  MAYBRIDGE\nmr@NMR_250MHZ
##.OBSERVE FREQUENCY= 250.131544655141
##.OBSERVE NUCLEUS= ^1H
##.ACQUISITION MODE= SIMULTANEOUS (DQD)
##.ACQUISITION SCHEME= undefined
##.AVERAGES= 2
##.DIGITISER RES= 18
##SPECTROMETER/DATA SYSTEM= dpx250
##.PULSE SEQUENCE= zg30
##.SOLVENT NAME= CDCl3
##.SHIFT REFERENCE= (INTERNAL, CDCl3, 0, 16.522)
##AUDIT TRAIL= $$ (NUMBER, WHEN, WHO, WHERE, WHAT)
$$ ##TITLE= Audit trail, XWIN-NMR		Version 3.5
$$ ##JCAMPDX= 5.01
$$ ##ORIGIN= Bruker BioSpin GmbH
$$ ##OWNER= nmr
$$ C:/u/data/dgb/nmr/ADRS/15180/pdata/1/auditp.txt
$$ ##AUDIT TRAIL=  $$ (NUMBER, WHEN, WHO, WHERE, WHAT)
(   1,<2006-01-25 11:41:36.35 +000>,<MAYBRIDGE\nmr>,<NMR_250MHZ>,
      <created by zg, POWCHK disabled, PULCHK disabled
       terminated by command 'halt'
       configuration hash MD5:
       62 19 C7 07 E1 42 D1 B7 37 6C 3D D0 77 39 F9 E6
       data hash MD5: 64K
       6F 23 BF 03 EE 9C 44 AA 96 82 81 A0 2E 9E 7F 32>)
(   2,<2006-01-25 11:41:46.15 +000>,<MAYBRIDGE\nmr>,<NMR_250MHZ>,
      <Start of raw data processing
       ef LB = 0.3 FT_mod = 6 PKNL = 1 SI = 32K 
       data hash MD5: 32K
       A0 D5 A0 48 94 CD 6E 63 44 D1 D1 85 77 0F E8 0E>)
(   3,<2006-01-25 11:41:50.02 +000>,<MAYBRIDGE\nmr>,<NMR_250MHZ>,
      <apk 
       data hash MD5: 32K
       E1 1F D2 E8 2D 4E CA 38 73 3C 46 EF 09 E1 11 98>)
(   4,<2006-01-25 11:41:51.63 +000>,<MAYBRIDGE\nmr>,<NMR_250MHZ>,
      <abs ABSG = 5 
       data hash MD5: 32K
       DE B7 43 5B FB 02 35 40 A8 7A C5 6F DA 05 C5 96>)
$$ ##END=
$$ 
$$ hash MD5
$$ A6 7A 3F AF 13 E1 00 5A AC B4 3D 90 7A 0B 85 C2
##$RELAX= 
##$RELAX= 
##$RELAX= 
##$RELAX= 
##$RELAX= 
##$RELAX= 
##$RELAX= 
$$ Bruker specific parameters
$$ --------------------------
##$DU= <C:\Restored>
##$EXPNO= 15180
##$NAME= <ADRS>
##$PROCNO= 1
##$TYPE= <nmr>
##$USER= <dgb>
##$AMP= (0..31)
100 100 100 100 100 100 100 100 100 100 100 100 100 100 100 100 100 100 
100 100 100 100 100 100 100 100 100 100 100 100 100 100 
##$AQSEQ= 0
##$AQ_mod= 3
##$AUNM= <au_zg>
##$AUTOPOS= <9 >
##$BF1= 250.13
##$BF2= 250.13
##$BF3= 250.13
##$BF4= 250.13
##$BF5= 500.13
##$BF6= 500.13
##$BF7= 500.13
##$BF8= 500.13
##$BYTORDA= 1
##$CFDGTYP= 0
##$CFRGTYP= 5
##$CHEMSTR= <none>
##$CNST= (0..31)
1 1 145 1 1 1 1 1 1 1 1 1 1 1 1 1 1 1 1 1 1 1 1 1 1 1 1 1 1 1 1 1 
##$CPDPRG= <>
##$CPDPRG1= <>
##$CPDPRG2= <>
##$CPDPRG3= <>
##$CPDPRG4= <mlev>
##$CPDPRG5= <mlev>
##$CPDPRG6= <mlev>
##$CPDPRG7= <mlev>
##$CPDPRG8= <mlev>
##$CPDPRGB= <>
##$CPDPRGT= <>
##$D= (0..31)
0 1 0 0 0 0 0 0 0 0.06 0 0 0 0 0 0 0.0002 0 0 0 0 0 0 0 0 0 0 0 0 0 0 
0 
##$DATE= 1138189294
##$DBL= (0..7)
120 120 120 120 120 120 120 120 
##$DBP= (0..7)
150 150 150 150 150 150 150 150 
$$ [...]
##$SUBNAM6= <"">
##$SUBNAM7= <"">
##$SUBNAM8= <"">
##$SUBNAM9= <"">
##$SW= 20.6930455092707
##$SWIBOX= (0..15)
0 0 3 0 0 0 0 0 0 0 0 0 0 0 0 0 
##$SW_h= 5175.983436853
##$TD= 65536
##$TD0= 1
##$TE= 292.16
##$TE2= 300
##$TE3= 300
##$TEG= 300
##$TL= (0..7)
0 120 120 120 120 120 120 120 
##$TP= (0..7)
150 150 150 150 150 150 150 150 
##$TP07= 0
##$TPNAME0= <>
##$TPNAME1= <>
##$TPNAME2= <>
##$TPNAME3= <>
##$TPNAME4= <>
##$TPNAME5= <>
##$TPNAME6= <>
##$TPNAME7= <>
##$TPOAL= (0..7)
0.5 0.5 0.5 0.5 0.5 0.5 0.5 0.5 
##$TPOFFS= (0..7)
0 0 0 0 0 0 0 0 
##$TUNHIN= 0
##$TUNHOUT= 0
##$TUNXOUT= 0
##$USERA1= <user>
##$USERA2= <user>
##$USERA3= <user>
##$USERA4= <user>
##$USERA5= <user>
##$V9= 5
##$VALIST= <valist>
##$VCLIST= <CCCCCCCCCCCCCCC>
##$VD= 0
##$VDLIST= <DDDDDDDDDDDDDDD>
##$VPLIST= <PPPPPPPPPPPPPPP>
##$VTLIST= <TTTTTTTTTTTTTTT>
##$WBST= 1024
##$WBSW= 4
##$XGAIN= (0..3)
0 0 0 0 
##$XL= 0
##$YL= 0
##$YMAX_a= 52547
##$YMIN_a= -76941
##$ZGOPTNS= <>
##$ZL1= 120
##$ZL2= 120
##$ZL3= 120
##$ZL4= 120
##$ABSF1= 16.522
##$ABSF2= -4.171173
##$ABSG= 5
##$ABSL= 3
##$ALPHA= 0
##$AQORDER= 0
##$ASSFAC= 0
##$ASSFACI= 0
##$ASSFACX= 0
##$ASSWID= 0
##$AUNMP= <proc_1d>
##$AZFE= 0.1
##$AZFW= 0.1
##$BCFW= 0
##$BC_mod= 0
##$BYTORDP= 0
##$COROFFS= 0
##$CY= 12.5
##$DATMOD= 1
##$DC= 0
##$DFILT= <>
##$DTYPP= 0
##$F1P= 14.0000005364418
##$F2P= -0.99999901652339
##$FCOR= 0.5
##$FTSIZE= 32768
##$FT_mod= 6
##$GAMMA= 0
##$GB= 0
##$INTBC= 1
##$INTSCL= 1
##$ISEN= 128
##$LB= 0.3
##$LEV0= 0
##$LPBIN= 0
##$MAXI= 10000
##$MC2= 0
##$MEAN= 0
##$ME_mod= 0
##$MI= 0
##$NCOEF= 0
##$NC_proc= -6
##$NLEV= 6
##$NOISF1= 0
##$NOISF2= 0
##$NSP= 0
##$NTH_PI= 0
##$NZP= 0
##$OFFSET= 16.522
##$PC= 1
##$PHC0= 248.1404
##$PHC1= 3.858054
##$PH_mod= 1
##$PKNL= yes
##$PPARMOD= 0
##$PSCAL= 4
##$PSIGN= 0
##$REVERSE= no
##$SF= 250.13
##$SI= 32768
##$SIGF1= 0
##$SIGF2= 0
##$SINO= 400
##$SIOLD= 32768
##$SREGLST= <1H.CDCl3>
##$SSB= 0
##$STSI= 32768
##$STSR= 0
##$SW_p= 5175.98343685301
##$SYMM= 0
##$S_DEV= 0
##$TDeff= 65536
##$TDoff= 0
##$TI= <Analysis number 999999
Compound Code 99
Book Reference 9
Project Code 9>
##$TILT= no
##$TM1= 0
##$TM2= 0
##$TOPLEV= 0
##$USERP1= <user>
##$USERP2= <user>
##$USERP3= <user>
##$USERP4= <user>
##$USERP5= <user>
##$WDW= 1
##$XDIM= 32768
##$YMAX_p= 519390689
##$YMIN_p= -888150
$$ End of Bruker specific parameters
$$ ---------------------------------
##NTUPLES= NMR SPECTRUM
##VAR_NAME=  FREQUENCY,     SPECTRUM/REAL,   SPECTRUM/IMAG
##SYMBOL=    X,             R,               I
##VAR_TYPE=  INDEPENDENT,   DEPENDENT,       DEPENDENT
##VAR_FORM=  AFFN,          ASDF,            ASDF
##VAR_DIM=   32768,         32768,           32768
##UNITS=     HZ,            ARBITRARY UNITS, ARBITRARY UNITS
##FACTOR=    0.157963299565203, 1,           1
##FIRST=     4132.6476996994, 0,             0
##LAST=      -1043.33573715361, 0,           0
##MIN=       -1043.33573715361, -888150,     0
##MAX=       4132.6476996994, 519390689,     0
$$ Real data points
##PAGE= N=1
##DATA TABLE= (X++(R..R)), XYDATA
$$ [...]
$$ plain form
18339 3236724 2847639 2587650 2559334 2651078 2734825 2718204 2622946 2439279 2192004 2071338
18329 2071338 2181536 2592317 2952231 2977457 2762932 2454252 2195896 2142124 2296410 2202917
18319 2202917 1937069 1756921 1544491 1413208 1471446 1737691 2037521 2204565 2632342 2945022
18309 2945022 2651546 2116551 1732446 1512381 1395916 1359222 1487625 1707951 1949100 1903227
18299 1903227 1504990 1120110 875797 748229 631273 611904 553264 434450 277905 92773
18289 92773 94851 134192 193557 240225 343999 298088 327915 346442 352514 350095 419824 443102
18277 443102 414854 374108 255689 269398 287253 224834 283622 334698 374605 272698 194996
18266 194996 103910 41203 36666 -78329 -125500 -154517 -161485 -99408 -34154 24163 43938 53027
$$ packed form
18339C236724l89085k59989k8316R1744Q3747j6621r5258j83667k47275j20666
18329B071338J10198M10781L59914K5226k14525l08680k58356n3772J54286r3493
18319B202917k65848j80148k12430j31283N8238K66245K99830J67044M27777L12680
18309B945022k93476n34995l84105k20065j16465l6694J28403K20326K41149m5873
18299A903227l98237l84880k44313j27568j16956j9369n8640j18814j56545j85132
18289I2773K078L9341N9365M6668J03774m5911K9827J8527O072k419O9729K3278
18277D43102k8248m0746j18419J3709J7855o2419N8788N1076L9907j01907p7702
18266A94996r1086o2707m537j14995m7171k9017o968O2077O5254N8317J9775R089
$$ plain form
18254 53027 -3806 25479 74513 148629 161503 241252 263471 210521 202298 287801 319080 357733
18242 357733 450477 455640 430415 374823 247203 204340 196705 177034 227348 144007 19421
18231 19421 -25417 -24873 20633 119144 156315 139397 186787 345182 369117 235301 125112
18220 125112 133663 232934 340155 467529 406867 310721 250786 193686 217688 328568 322208
18209 322208 306176 260623 99191 -64246 -198894 -124485 51081 176971 179881 94089 44242
18198 44242 -108920 -178494 -94585 -115991 -172050 -124915 -32207 -57556 -37026 3471 39469
18187 39469 54222 -10735 -7381 48569 3790 425 84085 124532 106781 167037 112058 154412
18175 154412 150690 87049 62602 44361 39553 96564 74278 44145 -116015 -208500 -113827 5517
$$ packed form
18254E3027n6833K9285M9034P4116J2874P9749K2219n2950q223Q5503L1279L8653
18242C57733R2744N163k5225n5592j27620m2863p635j9671N0314q3341j24586
18231A9421m4838N44M5506R8511L7171j6918M7390J58395K3935j33816j10189
18220A25112Q551R9271J07221J27374o0662r6146n9935n7100K4002J10880o360
18209C22208j6032m5553j61432j63437j34648P4409J75566J25890K910q5792m9847
18198D4242j53162o9574Q3909k1406n6059M7135R2708k5349K0530M0497L5998
18187C9469J4753o4957L354N5950m4779l365Q3660M0447j7751O0256n4979M2354
18175A54412l722o3641k4447j8241m808N7011k2286l0133j60160r2485R4673J19344
$$ plain form
18163 5517 70557 91753 139051 259207 330211 327678 369829 277110 245106 243835 214911 210331
18151 210331 205062 257659 347543 309888 287311 299644 287184 307110 232611 193059 282427 239634
18139 239634 268622 363241 431902 510644 589974 721207 795485 750137 754318 744973 707376 754453
18127 754453 812730 851442 1013920 1191826 1217968 1200621 1163017 1163181 1431445 1836040 2388226
18116 2388226 3170620 4300973 5849269 8139661 11857221 18260871 30186429 54114384
18108 54114384 78170140 66810250 39780519 22162592 13349629 8818905 6045477
18101 6045477 4515745 3767933 3153387 2614620 2175506 1862207 1605676 1326215 1027226
18092 1027226 800787 771944 886424 913840 837605 643848 595016 693450 722356 654855 564986
$$ packed form
18163E517O5040K1196M7298J20156P1004k533M2151r2719l2004j271k8924m580
18151B10331n269N2597Q9884l7655k2577J2333j2460J9926p4499l9552Q9368m2793
18139B39634K8988R4619O8661P8742P9330J31233P4278m5348M181r345l7597M7077
18127G54453N8277L8712J62478J77906K6142j7347l7604J64K68264M04595N52186
18116B388226P82394J130353J548296K290392L717560O403650J1925558K3927955
18108E4114384K4055756j1359890k7029731j7617927q812963m530724k773428
18101F045477j529732p47812o14546n38767m39114l13299k56531k79461k98989
18092A027226k26439k8843J14480K7416p6235j93757m8832R8434K8906o7501q9869
$$ plain form
18081 564986 534105 559186 572208 475439 501149 557863 467311 387053 472559 466387 430286 454225
18069 454225 432914 326479 273880 342136 383807 411373 327298 320572 332874 276111 191093
18058 191093 285686 424319 531331 544531 497752 602338 625413 514214 305199 312669 355782
18047 355782 266028 207011 283038 312695 420688 325247 316938 245841 212635 174628 191557
18036 191557 236401 220891 190244 277860 345730 365878 411180 448837 495271 383303 200702
18025 200702 178891 165524 170202 234783 294417 328699 323828 230686 160735 133227 191334 141589
18013 141589 67469 78041 -47120 -44180 27755 124600 153721 152740 212615 313980 295790 170848
18001 170848 34482 -37957 45805 103010 303337 408390 274494 90382 -17789 23924
$$ packed form
18081E64986l0881K5081J3022r6769K5710N6714r0552q0258Q5506o172l6101K3939
18069D54225k1311j06435n2599O8256M1671K7566q4075o726J2302n6763q5018
18058A91093R4593J38633J07012J3200m6779J04586K3075j11199k09015P470M3113
18047C55782q9754n9017P6027K9657J07993r5441q309p1097l3206l8007J6929
18036A91557M4844j5510l0647Q7616O7870K0148M5302L7657M6434j11968j82601
18025B00702k1811j3367M678O4581N9634L4282m871r3142o9951k7508N8107m9745
18013A41589p4120J0572j25161K940P1935R6845K9121r81N9875J01365j8190j24942
18001A70848j36366p2439Q3762N7205K00327J05053j33896j84112j08171M1713
$$ plain form
17991 23924 65377 113074 175514 263562 263529 224304 213795 281457 339143 316487 389284 358376
17979 358376 307278 198128 173580 212770 225765 180201 241021 252627 227441 378649 518737
17968 518737 388646 331512 259039 290219 247661 225359 275905 236852 216713 226184 304932
17957 304932 348695 385204 468182 541094 431876 308234 281935 295372 310537 208156 216151
17946 216151 343732 382547 455574 637764 705103 691344 671470 616970 599129 607507 622421
17935 622421 679088 628835 647060 700280 714688 740156 758867 946545 1062010 1026076 1014134
17924 1014134 923116 946080 1118412 1386008 1686483 1853797 1957161 2077903 2181258 2081492
17914 2081492 1973957 2270321 2690714 2855114 2907116 2871454 2771154 2796416 3053277 3648718
$$ packed form
17991B3924M1453M7697O2440Q8048l3l9225j0509O7662N7686k2656P2797l0908
17979C58376n1098j09150k4548L9190J2995m5564O0820J1606k5186J51208J40088
17968E18737j30091n7134p2473L1180m2558k2302N0546l9053k0139R471P8748
17957C04932M3763L6509Q2978P2912j09218j23642k6299J3437J5165j02381P995
17946B16151J27581L8815P3027J82190O7339j3759j9874n4500j7841Q378J4914
17935F22421N6667n0253J8225N3220J4408K5468J8711J87678J15465l5934j1942
17924A014134r1018K2964J72332K67596L00475J67314J03364J20742J03355r9766
17914B081492j07535K96364M20393J64400N2002l5662j00300K5262K56861N95441
$$ plain form
17904 3648718 4513513 5525239 6968163 9120088 12189356 16928978 24606775 37654073
17896 37654073 61503296 98024132 111495601 83282854 51458252 32064551 21653672
17889 21653672 15913498 12671723 10839855 9909816 9215889 8476628 7824973 7470152 7505128
17880 7505128 8117099 9222385 10974011 13517638 17453109 23762740 34461041 52965692
17872 52965692 84202952 108065435 92098836 62348245 43544497 35889589 36199562
17865 36199562 44114173 63150829 93737277 103383924 77213445 48681118 31042174
17858 31042174 21315791 15739451 12337513 10318861 9330794 8636366 7970424 7388892 7088624
17849 7088624 6771745 6777805 7528244 9014208 11352909 14975773 20722540 29988135 46111401
$$ packed form
17904C648718Q64795J011726J442924K151925L069268M739622P677797J3047298
17896C7654073K3849223L6520836J3471469k8212747l1824602j9393701j0410879
17889B1653672n740174l241775j831868r30039o93927p39261o51655l54821L4976
17880G505128O11971J105286J751626K543627L935471O309631J0698301J8504651
17872E2965692L1237260K3862483j5966599k9750591j8803748p654908L09973
17865C6199562P914611J9036656L0586448R646647k6170479k8532327j7638944
17858C1042174r726383n576340l401938k018652r88067o94428o65942n81532l00268
17849G088624l16879O060P50439J485964K338701L622864N746767R265595J6123266
$$ plain form
17840 46111401 73876654 94112515 77203874 48264848 29074768 18663625 12861788
17833 12861788 9456813 7692326 6825625 6197020 5344439 4410554 3773928 3141747 2585264
17824 2585264 2163824 1871920 1875732 2078454 2366518 2613340 2430224 1872116 1475591 1160137
17814 1160137 967704 878277 905192 1019027 1104640 1269019 1400092 1473408 1365535 1169648
17804 1169648 973698 819843 812393 822021 823520 833327 837178 910426 1158751 1398721 1366772
17793 1366772 1180562 979086 821593 808212 825899 997458 1292459 1473560 1336260 1107091
17783 1107091 836441 809015 761093 624205 564986 530039 464260 397370 398418 427608 465048
17772 465048 406689 487135 466002 369357 376067 437335 486290 488831 569399 648948 705120 666044
$$ packed form
17840D6111401K7765253K0235861j6908641k8939026j9190080j0411143n801837
17833A2861788l404975j764487q66701o28605q52581r33885o36626o32181n56483
17824B585264m21440k91904L812K02722K88064K46822j83116n58108l96525l15454
17814A160137j92433q9427K6915J13835Q5613J64379J31073P3316j07873j95887
17804A169648j95950j53855p450R628J499R807L851P3248K48325K39970l1949
17793A366772j86210k01476j57493j3381J7687J71559K95001J81101j37300k29169
17783A107091k70650k7426m7922j36888n9219l4947o5779o6890J048K9190L7440
17772D65048n8359Q0446k1133r6645O710O1268M8955K541Q0568P9549N6172l9076
$$ plain form
17760 666044 537098 595448 652029 575981 561123 638515 646896 574515 571728 624529 594774 546885
17748 546885 599823 492203 370401 276383 214073 280277 326337 391536 445094 306076 132360
17737 132360 51810 228414 294423 265340 281958 254545 226070 135843 165797 314424 412285
17726 412285 395463 370647 341735 304628 221234 166747 246054 313319 403595 474345 333525
17715 333525 256809 82866 -12374 -71918 -29180 94889 259289 289348 182344 -15457
17705 -15457 -115119 -152809 -31364 55518 31232 101476 106921 83442 102192 193648 241293 253392
17693 253392 272550 135394 102621 79557 65227 74040 126884 209788 233410 165033 64900
17682 64900 -39144 -192754 -247750 -49884 68783 119451 184212 162960 104433 139220 114966
$$ packed form
17760F66044j28946N8350N6581p6048j4858P7392Q381p2381k787N2801k9755m7889
17748E46885N2938j07620j21802r4018o2310O6204M6060O5199N3558j39018j73716
17737A32360q0550J76604O6009k9083J6618k7413k8475r0227K9954J48627R7861
17726D12285j6822k4816k8912l7107q3394n4487P9307O7265R0276P0750j40820
17715C33525p6716j73943r5240n9544M2738J24069J64400L0059j07004j97801
17705a5457r9662l7690J21445Q6882k4286P0244N445k3479J8750R1456M7645J2099
17693B53392J9158j37156l2773k3064j4330Q813N2844Q2904K3622o8377j00133
17682F4900j04044j53610n4996J97866J18667N0668O4761k1252n8527L4787k4254
$$ plain form
17671 114966 103134 113963 159343 180858 177537 203925 138085 -2033 -42280 87079 121406
17660 121406 81538 42074 6505 3461 -1271 -51682 -110536 -256 139709 154692 54018
17649 54018 -23916 32840 -325 -21933 -20704 33011 29731 69310 112804 46992 15109 -31861
17637 -31861 -25887 -21589 -7598 -13790 -51097 8428 -11900 13050 -12704 105489 189776 120309
17625 120309 57477 65866 88729 -27195 -40418 37205 66187 18274 -32691 99475 194155
17614 194155 159163 131558 94102 68431 155615 143507 74850 123819 166622 74710 28681
17603 28681 38332 32338 125348 115797 124619 121760 71288 83440 185800 263308 244640 205063
17591 205063 109112 89384 125291 96768 154037 146545 39223 -32019 -60721 -100336 -81837
$$ packed form
17671A14966j1832J0829M5380K1515l321K6388o5840j40118m0247J29359L4327
17660A21406l9868l9464l5569l044m732n0411n8854J10280J39965J4983j00674
17649E4018p7934N6756l3165k1608J229N3715l280L9579M3494o5812l1883m6970
17637c1861N974M298J3991o192l7307N9525k0328K4950k5754J18193Q4287o9467
17625A20309o2832Q389K2863j15924j3223P7623K8982m7913n0965J32166R4680
17614A94155l4992k7605l7456k5671Q7184j2108o8657M8969M2803r1912m6029
17603B8681R651n994R3010r551Q822k859n0472J2152J02360P7508j8668l9577
17591B05063r5951j9728L5907k8523N7269p492j07322p1242k8702l9615J8499
$$ plain form
17580 -81837 -181256 -63808 62299 44498 52226 12679 -61343 -86564 -43729 -9113 42261
17569 42261 105256 157997 210227 149917 123456 103957 122342 117644 109968 72799 96054 84435
17557 84435 108913 95599 157263 128116 67961 24629 48288 108807 164588 154080 131416 155143
17545 155143 72355 183946 241024 233248 189458 101902 87929 64075 6531 -41506 -77554
17534 -77554 -138767 -112499 -27460 39726 52168 141109 174386 65920 29657 72638 95673
17523 95673 104686 136676 145390 151080 134659 68067 81150 148449 136416 46666 -12234 -116228
17511 -116228 -159720 -166442 -124999 20697 34432 52244 79288 119894 87130 112018 208355
17500 208355 202876 141075 101127 96887 52575 100255 123515 92120 -3667 59350 103820 166588
$$ packed form
17580h1837r9419J17448J26107j7801P728l9547p4022k5221M2835L4616N1374
17569D2261O2995N2741N2230o0310k6461j9499J8385m698p676l7169K3255j1619
17557H4435K4478j3314O1664k9147o0155m3332K3659O0519N5781j0508k2664K3727
17545A55143q2788J11591N7078p776m3790q7556j3973k3854n7544m8037l6048
17534g7554o1213K6268Q5039O7186J2442Q8941L3277j08466l6263M2981K3035
17523I5673R013L1990Q714N690j6421o6592J3083O7299j2033q9750n8900j03994
17511a16228m3492o722M1443J45696J3735J7812K7044M0606l2764K4888R6337
17500B08355n479o1801l9948m240m4312M7680K3260l1395r5787O3017M4470O2768
$$ plain form
17488 166588 129425 97414 39435 91640 126980 199882 250541 295138 249908 137951 39015
17477 39015 -23097 -9031 85807 63178 -34356 9786 87534 89399 134095 169234 84614 24678
17465 24678 103654 167497 194708 93933 53 50630 24071 43026 79860 53791 122352
17454 122352 75777 13139 63958 118227 188991 142635 103764 113796 202295 310179 336124
17443 336124 415761 466860 463428 347859 237479 156575 115166 41745 108343 119415 142523
17432 142523 183369 197282 202421 245781 219211 163109 120461 61819 65596 121409 226205 229025
17420 229025 130745 117901 125580 171670 118708 23556 30069 54408 68962 166451 216834 221709
17408 221709 211976 238655 213410 193941 188742 180913 37437 -120616 -125236 -145151 -167975 -44451
$$ packed form
17488A66588l7163l2011n7979N2205L5340P2902N0659M4597m5230j11957r8936
17477C9015o2112J4066R4838k2629r7534M4142P7748J865M4696L5139q4620n9936
17465B4678P8976O3843K7211j00775r3880N0577k6559J8955L6834k6069O8561
17454A22352m6575o2638N0819N4269P0764m6356l8871J0032Q8499J07884K5945
17443C36124P9637N1099l432j15569j10380q0904m1409p3421O6598J1072K3108
17432A42523M0846J3913N139M3360k6570n6102m2648n8642L777N5813J04796K820
17420B29025r8280j2844P679M6090n2962r5152O513K4339J4554R7489N0383M875
17408B21709r733K6679k5245j9469n199p829j43476j58053m620j9915k2824J23524
$$ plain form
17396 -44451 90376 125087 160382 142894 68016 16799 100332 220885 113510 21838 -89999
17385 -89999 -101937 -10714 11119 11134 -36113 2945 11761 17354 44399 34580 -46904 -26066 68648
17372 68648 106023 42714 55886 187737 113894 -24415 -29150 -6913 4103 -10048 -47394
17361 -47394 -50700 -37682 -83698 8456 214049 368252 589350 702163 621954 359885 231856
17350 231856 138776 150298 83650 123583 111490 142862 139447 151576 68460 -40705 -31994 68802
17338 68802 40959 65091 178357 217221 131711 173403 324032 579981 633341 455371 357526
17327 357526 331222 303134 313494 342437 487180 586215 503749 278879 118237 90828 106635
17316 106635 11776 -40928 -30257 29390 -30461 -56938 57436 124120 99562 145763 95991
$$ packed form
17396d4451J34827L4711L5295j7488p4878n1217Q3533J20553j07375r1672j11837
17385h9999j1938R1223K1833J5m7247L9058Q816N593K7045r819q1484K0838R4714
17372F8648L7375o3309J3172J31851p3843j38309m735K2237J1016j4151l7346
17361d7394l306J3018m6016R2154K05593J54203K21098J12813q0209k62069j28029
17350B31856r3080J1522o6648L9933j2093L1372l415J2129q3116j09165Q711J00796
17338F8802k7843K4132J13266L8864q5510M1692J50629K55949N3360j77970r7845
17327C57526k6304k8088J0360K8943J44743R9035q2466k24870j60642k7409J5807
17316A06635r4859n2704J0671N9647n9851k6477J14374O6684k4558M6201m9772
$$ plain form
17305 95991 71840 42631 76354 148212 354542 546661 677629 660011 492855 446057 385115
17294 385115 307419 316814 268497 250536 159083 131309 171761 150120 202010 236872 273785 201949
17282 201949 175868 233763 356039 552347 765619 1080056 1353622 1479795 1584486 1472317
17272 1472317 1163221 878886 621548 375394 194146 70102 39938 8906 -113487 -180714
17262 -180714 -214271 -186715 -92053 -9458 1343 45972 -22410 -25831 -47634 -59765 4817 85910
17250 85910 131704 73238 -34508 -78628 -67107 -20828 66512 128329 115240 59015 -27768
17239 -27768 -63806 -54630 13274 5987 -128591 -86232 -53983 13082 13720 -58732 -26933 63826
17227 63826 141493 143281 7045 -117219 -79062 -92383 -88243 -68759 -52014 -5219 27667 88633
$$ packed form
17305I5991k4151k9209L3723P1858K06330J92119J30968j7618j67156m6798o0942
17294C85115p7696R395m8317j7961r1453k7774M0452k1641N1890L4862L6913p1836
17282B01949k6081N7895J22276J96308K13272L14437K73566J26173J04691j12169
17272A472317l09096k84335k57338k46154j81248j24044l0164l1032j22393o7227
17262a80714l3557K7556R4662Q2595J0801M4629o8382l421k1803j2131O4582Q1093
17250H5910M5794n8466j07746m4120J1521M6279Q7340O1817j3089n6225q6783
17239b7768l6038R176O7904p287j34578M2359L2249O7065O38p2452L1799R0759
17227F3826P7667J788j36236j24264L8157j3321M140J9484J6745M6795L2886O0966
$$ plain form
17215 88633 205876 105409 104495 168669 162289 115508 39653 -31528 -44000 -39611 37997 1610
17203 1610 -54114 24307 118738 73595 86814 80644 57580 1968 -70102 -64495 -82163 -4278
17191 -4278 -29902 -78662 -83976 -40717 -99386 -113782 20572 87021 52373 24242 28010 68054
17179 68054 76855 30637 7520 -36368 -10440 -17048 32156 14956 -41124 34007 109920 113985
17167 113985 223575 244616 159485 221004 477950 552744 618564 717634 644885 558289 398174
17156 398174 215223 44719 -27504 -63137 9318 36256 121964 205105 91018 28236 75496
17145 75496 79064 28505 911 -18966 34673 137132 32271 -39766 36205 91695 117139
17134 117139 43248 -27916 -90121 -132769 -53520 -52658 -46873 -94835 -128951 -157348 -205396 -173512
$$ packed form
17215H8633J17243j00467r14O4174o380m6781p5855p1181j2472M389P7608l6387
17203A610n5724P8421R4431m5143J3219o170k3064n5612p2070N607j7668P7885
17191d278k5624m8760n314M3259n8669j4396J34354O6449l4648k8131L768M0044
17179F8054Q801m6218k3117m3888K5928o608M9204j7200n6080P5131P5913M065
17167A13985J09590K1041q5131O1519K56946P4794O5820R9070p2749q6596j60115
17156C98174j82951j70504p2223l5633P2455K6938Q5708Q3141j14087o2782M7260
17145G5496L568n0559k7594j9877N3639J02459j04861p2037P5971N5490K5444
17134A17139p3891p1164o2205m2648P9249Q62N785m7962l4116k8397m8048L1884
$$ plain form
17122 -173512 -127237 -88293 -71678 -46414 -61304 -42411 5649 9766 14635 42886 -35764 -36484
17110 -36484 35638 24822 -29646 -16851 -21849 -45770 -50506 -32329 -2580 -14302 -11349 -37986
17098 -37986 53216 83118 -22312 16353 -2068 49181 -5113 -13548 9318 73369 62750 27386
17086 27386 23448 55392 108110 86256 15199 22771 100682 120140 71662 106759 118484 -65640
17074 -65640 -57956 44228 70908 100928 124740 105838 39934 -11396 74423 183464 196821
17063 196821 173607 120782 64622 4019 28942 55959 31520 116421 229105 207790 88589
17052 88589 97948 120192 161369 143826 189275 202218 177040 133369 46784 -8037 -6534 -93861
17040 -93861 -164826 -179566 -164382 -202038 -173091 -140754 -136886 -134504 -81932 -106341 -100713 -29443
$$ packed form
17122a73512M6275L8944J6615K5264j4890J8893M8060M117M869K8251p8650p20
17110c6484P2122j0816n4468J2795m998k3921m736J8177K9749j1722K953k6637
17098c7986R1202K9902j05430L8665j8421N1249n4294q435K2866O4051j0619l5364
17086B7386l938L1944N2718k1854p1057P572P7911J9458m8478L5097J1725j84124
17074f5640P684J02184K6680L0020K3812j8902o5904n1330Q5819J09041J3357
17063A96821k3214n2825n6160o0603K4923K7017k4439Q4901J12684k1315j19201
17052H8589R359K2244M1177j7543M5449J2943k5178m3671q6585n4821J503q7327
17040i3861p0965j4740J5184l7656K8947L2337L868K382N2572k4409N628P1270
$$ plain form
17028 -29443 -69815 -40209 -31479 -8072 -35050 -80263 -116702 4252 7117 -8831 -8436 49414
17016 49414 6843 -4870 16887 14383 12426 77122 129448 113802 212326 224019 105681 -22679
17004 -22679 24397 14598 38501 -31654 -45447 39166 71192 -7882 84655 116542 92800 137648
16992 137648 23929 -1994 56967 54843 55941 -5236 27178 27832 35032 27350 25543 23390 -60730
16979 -60730 -95651 -78129 -52071 -40511 5355 -864 -10539 52930 39435 124939 213078 291575
16967 291575 292088 289168 230078 115552 75220 97836 121394 143158 78146 91185 193683 166447
16955 166447 151099 173369 223333 173147 213932 152597 70232 68946 72554 9918 55379 149543
16943 149543 98214 52263 -52224 -74788 -65199 -12188 -18712 30190 16630 -13763 -5088 90553
$$ packed form
17028b9443m0372K9606Q730K3407k6978m5213l6439J20954K865j5948L95N7850
17016D9414m2571j1713K1757k504j957O4696N2326j5646R8524J1693j18338j28360
17004b2679M7076r799K3903p0155j3793Q4613L2026p9074R2537L1887k3742M4848
16992A37648j13719k5923N8961k124J098o1177L2414O54P200p682j807k153q4120
16979f0730l4921J7522K6058J1560M5866o219r675O3469j3495Q5504Q8139P8497
16967B91575N13k920n9090j14526m0332K2616K3558K1764o5012J3039J02498k7236
16955A66447j5348K2270M9964n0186M0785o1335q2365j286L608o2636M5461R4164
16943A49543n1329m5951j04487k2564R589N3011o524M8902j3560l0393Q675R5641
$$ plain form
16931 90553 64747 18301 -33356 43028 97127 56685 69258 90395 7889 -106995 -135711
16920 -135711 -70326 -2042 35483 42192 110869 104208 67145 30430 -6593 7789 104457 71388
16908 71388 23442 3513 -6712 61785 112849 83047 117534 221010 317867 421696 562301
16897 562301 649584 592784 463017 284831 168251 107031 -3625 18397 -13976 5391 80428
16886 80428 127325 90328 37916 79524 96721 103907 97678 127540 63485 62646 22372 25949 38841
16873 38841 125708 255048 384511 400979 393266 336312 301714 317913 287034 172284 74822
16862 74822 -73229 -282624 -442677 -470072 -395756 -287701 -186954 -175406 -272969 -312458 -266128
16851 -266128 -210238 -130241 -118373 -115475 -99602 -81493 -40979 50627 96648 112312 168831 270067
$$ packed form
16931I0553k5806m6446n1657P6384N4099m0442J2573K1137q2506j14884k8716
16920a35711O5385O8284L7525O709O8677o661l7063l6715l7023J4382R6668l3069
16908G1388m7946j9929j0225O8497N1064k9802L4487J03476R6857J03829J40605
16897E62301Q7283n6800j29767j78186j16580o1220j10656K2022l2373J9367P5037
16886H0428M6897l6997n2412M1608J7197P186o229K9862o4055q39m0274L577J2892
16873C8841Q6867J29340J29463J6468p713n6954l4598J6199l0879j14750r7462
16862G4822j48051k09395j60053k7395P4316J08055J00747J1548r7563l9489M6330
16851b66128N5890P9997J1868K898J5873J8109M0514R1606M6021J5664N6519J01236
$$ plain form
16839 270067 374334 555442 624680 764419 882231 1037868 1398946 1922160 2466109 2753186
16829 2753186 2668821 2251284 1787200 1314935 939356 632609 463307 401523 381081 332476
16819 332476 338974 345521 384728 286212 295327 287707 247640 245982 283770 289944 284666 240953 104368
16806 104368 20604 16459 80530 178430 175116 160752 126069 132245 147807 128504 -7131 -36838
16794 -36838 7633 -24912 -35801 23673 62886 94272 112702 96867 88088 88152 170856 193688
16782 193688 124967 91137 229178 249705 196648 210424 252093 314320 345754 334579 289909
16771 289909 303606 277006 286046 393292 578395 616274 710023 727766 647159 477685 398803
16760 398803 267139 229098 265017 364952 450232 489907 550480 599548 623927 670769 551119
$$ packed form
16839B70067J04267J81108O9238J39739J17812J55637L61078N23214N43949K87077
16829B753186q4365m17537m64084m72265l75579l06747j69302o1784k0442m8605
16819C32476O498O547L9207r8516R115p620m0067j658L7788O174n278m3713j36585
16806A04368q3764m145O4071R7900l314j4364l4683O176J5562j9303j35635k9707
16794c6838M4471l2545j0889N9474L9213L1386J8430j5835q779O4Q2704K2832
16782A93688o8721l3830J38041K0527n3057J3776M1669O2227L1434j1175m4670
16771B89909J3697k6600R040J07246J85103L7879R3749J7743q0607j69474p8882
16760C98803j31664l8041L5919R9935Q5280L9675O0573M9068K4379M6842j19650
$$ plain form
16749 551119 506652 539826 492167 519565 582450 634123 725308 768842 918164 1178001 1512716
16738 1512716 1948403 2478236 2981547 3414240 3579380 3577166 3736004 3856009 3791976 3913409
16728 3913409 4260786 4835573 5582924 5977155 6205029 6706804 7429120 8114346 8629657
16719 8629657 9018922 9647071 10949676 13152657 16777874 22343601 31029224 44554920
16711 44554920 66428353 101076431 147917603 201174783 248211930 271628623 262679316
16704 262679316 223842244 170471816 118854260 77902215 50863632 34840124 25365172
16697 25365172 19560133 15735747 13090507 11172716 9636506 8423796 7483962 6730164
16689 6730164 6237070 5858044 5456302 5150424 4704391 4248528 3703961 3154535 2663707
$$ packed form
16749E51119m4467L3174m7659K7398O2885N1673R1185M3534J49322K59837L34715
16738A512716M35687N29833N03311M32693J65140k214J58838J20005o4033J21433
16728C913409L47377N74787P47351L94231K27874N01775P22316O85226N15311
16719H629657L89265O28149J302605K202981L625217N565727Q685623J3525696
16711D4554920K1873433L4648078M6841172N3257180M7037147K3416693q949307
16704B62679316l8837072n3370428n1617556m0952045k7038583j6023508r474952
16697B5365172n805039l824386k645240j917791j536210j212710r39834p53798
16689F730164m93094l79026m01742l05878m46033m55863n44567n49426m90828
$$ plain form
16680 2663707 2405031 2311759 2445033 2803507 3104532 3265496 3278790 3131393 2824172 2531134
16670 2531134 2269530 2075644 1925146 1772256 1661512 1515491 1456166 1302328 1173194 1071035
16660 1071035 973630 965022 868848 793180 740612 793372 745866 711406 741893 742070 675231 635583
16648 635583 568824 605870 586675 530705 469451 450147 438373 504068 550573 493693 443990
16637 443990 417200 395941 407255 451365 449286 440076 447146 410947 416950 406835 356056 340364
16625 340364 319721 239202 221063 211010 168775 196368 219448 268169 235849 161395 77597
16614 77597 30820 63242 83957 100185 111097 106888 118915 119432 137216 148481 92685 126657
16602 126657 191897 196218 -6278 -47649 -8524 31090 67288 7070 -198710 -282301 -153468
$$ packed form
16680B663707k58676r3272J33274L58474L01025J60964J3294j47397l07221k93038
16670B531134k61604j93886j50498j52890j10744j46021n9325j53838j29134j02159
16660A071035r7405q608r6174p5668n2568N2760m7506l4460L0487J77o6839l9648
16648F35583o6759L7046j9195n5970o1254j9304j1774O5695M6505n6880m9703
16637D43990k6790k1259J1314M4110k079r210P070l6199O003j0115n0779j5692
16625C40364k0643q0519j8139j0053m2235K7593K3080M8721l2320p4454q3798
16614G7597m6777L2422K0715J6228J0912m209J2027N17J7784J1265n5796L3972
16602A26657O5240M321k02496m1371L9125L9614L6198o0218k05780q3591J28833
$$ plain form
16591 -153468 -21300 7389 -29179 -2778 113430 123184 144357 214297 96472 45258 74745
16580 74745 53176 41694 99924 80875 -27034 -95386 -128929 -124306 -39635 102662 170705
16569 170705 197806 226217 232753 249718 266225 262218 204534 191168 285171 339960 342843 260524
16557 260524 274347 325976 385964 444320 538404 520855 432623 263987 18986 -190212 -364932
16546 -364932 -372851 -364060 -286399 -210116 -143490 -33453 -14287 1073 -18995 -76054 -36917 -100661
16534 -100661 -98501 -29298 77622 34528 -27467 -10254 -21041 -41917 3886 78932 62347
16523 62347 79966 64610 46759 -1229 -112531 -258147 -376630 -541866 -596545 -560557 -479617
16512 -479617 -436305 -364972 -171387 -91398 -20053 7536 19782 -44742 -33667 67783 110419
$$ packed form
16591a53468J32168K8689l6568K6401J16208R754K1173O9940j17825n1214K9487
16580G4745k1569j1482N8230j9049j07909o8352l3543M623Q4671J42297O8043
16569A70705K7101K8411O536J6965J6507m007n7684j3366R4003N4789K883q2319
16557B60524J3823N1629N9988N8356R4084j7549q8232j68636k45001k09198j74720
16546c64932p919Q791P7661P6283O6626J10037J9166J5360k0068n7059L9137o3744
16534a00661K160O9203J06920m3094o1995J7213j0787k0876M5803P5046j6585
16523F2347J7619j5356j7851m7988j11302j45616j18483j65236n4679L5988Q0940
16512d79617M3312P1333J93585P9989P1345K7589J2246o4524J1075J01450M2636
$$ plain form
16501 110419 133788 41410 -40179 -86608 -104731 -163220 -137904 -99989 -51214 -22886 -64288
16490 -64288 -103281 -143809 -173050 -118298 -175604 -160554 -63797 -62057 -42894 -40965 7956 115465
16478 115465 190572 240577 167385 74586 8269 52282 4996 9573 -32482 -3209 55181 67088
16466 67088 105224 163134 152941 28002 -28734 -21942 -25370 -43963 5169 19580 -44678 -60145
16454 -60145 -21902 -46716 -37052 69328 167514 114624 67277 74812 115529 110606 57092 -32780
16442 -32780 -152070 -92189 -24372 -38167 -23251 -82806 -47254 35859 84164 100296 142119
16431 142119 100637 69121 53853 -221 -73728 -83199 -33580 -28944 -71764 -91357 -86724 -501
16419 -501 26688 -18860 75369 52626 46275 65581 52720 -11878 -53561 -113082 -237652 -296677
$$ packed form
16501A10419K3369r2378q1589m6429j8123n8489K5316L7915M8775K8328m1402
16490f4288l8993m0528k9241N4752n7306J5050R6757J740J9163J929M8921J07509
16478A15465P5107N0005p3192r2799o6317M4013m7286M577m2055K9273N8390J1907
16466F7088L8136N7910j0193j24939n6736O792l428j8593M9132J4411o4258j5467
16454f0145L8243k4814R664J06380R8186n2890m7347P535M0717m923n3514q9872
16442c2780j19290N9881O7817j3795J4916n9555L5552Q3113M8305J6132M1823
16431A42119m1482l1516j5268n4074p3507r471M9619M636m2820j9593M633Q6223
16419e01K7189m5548R4229k2743o351J9306j2861o4598m1683n9521j24570n9025
$$ plain form
16407 -296677 -236933 -178974 -180431 -240613 -241836 -190477 -99911 -93407 -143953 -160647 -85130 -29692
16395 -29692 -8036 50856 25042 -14199 -13023 17901 -41792 -60092 2864 71016 120126 90798
16383 90798 187436 241306 97933 49113 93297 67401 -72954 -139774 -171042 -139175 -92920
16372 -92920 -96692 -117579 -114106 -90883 -76126 914 52167 91364 116742 133215 135378 128198
16360 128198 57828 27844 -87541 -63951 -64712 -7786 8643 65444 9594 -74156 -123372 -146895
16348 -146895 -180788 -128899 -40085 -37315 -125037 -118799 -65307 21892 98026 62141 -26932 -99235
16336 -99235 -47159 -1633 21932 -63461 -102689 -100053 -73891 48290 75662 53463 -4205 -45415
16324 -45415 -74400 -144628 -133501 -103959 -78590 -29401 -3380 1684 -7252 -27271 -15514 44802
$$ packed form
16407b96677N9744N7959j457o0182j223N1359R0566O504n0546j6694P5517N5438
16395b9692K1656N8892k5814l9241J176L0924n9693j8300O2956O8152M9110k9328
16383I0798R6638N3870j43373m8820M4184k5896j40355o6820l1268L1867M6255
16372i2920l772k0887L473K3223J4757P7040N1253L9197K5378J6473K163p180
16360A28198p0370k9984j15385K3590p61N6926J6429N6801n5850q3750m9216k3523
16348a46895l3893N1889Q8814K770q7722O238N3492Q7199P6134l5885q9073p2303
16336i9235N2076M5526K3565q5393l9228K636K6162J22181K7372k2199n7668m1210
16324d5415k8985p0228J1127K9542K5369M9189K6021N064q936k0019J1757O0316
$$ plain form
16312 44802 77300 135182 65784 6163 -7829 13485 52306 -225 -38261 44818 -32785 -48592
16300 -48592 -16420 -52516 -93853 -10469 90643 223784 222901 197966 115416 128849 32691 -34481
16288 -34481 -73465 10282 81635 132936 126810 68227 98678 151874 169586 141699 96707 37425
16276 37425 12449 -18899 25774 26944 954 6979 -65086 -85984 -2438 15431 -19978 -51562
16264 -51562 -40074 -60764 -52901 -15812 115721 157421 86763 -5480 -74740 -99763 -97593 -61400
16252 -61400 -79368 -111975 -146282 -124956 -97320 -28486 30595 7486 7342 71411 103751 30191
16240 30191 -48568 -117968 -85438 -73845 -46766 -66738 -103403 -29912 -53664 -146206 -146347 -84950
16228 -84950 -32905 2027 30318 93322 85680 57886 23973 -22603 29369 37861 6361 -8552
$$ packed form
16312D4802L2498N7882o9398n9621j3992K1314L8821n2531l8036Q3079p7603j5807
16300d8592L2172l6096m1337Q3384J01112J33141q83k4935q2550J3433r6158o7172
16288c4481l8984Q3747P1353N1301o126n8583L0451N3196J7712k7887m4992n9282
16276C7425k4976l1348M4673J170k5990O025p2065k0898Q3546J7869l5409l1584
16264e1562J1488k0690P863L7089J31533M1700p0658r2243o9260k5023K170L6193
16252f1400j7968l2607l4307K1326K7636O8834N9081k3109j44O4069L2340p3560
16240C0191p8759o9400L2530J1593K7079j9972l6665P3491k3752r2542j41O1397
16228h4950N2045L4932K8291O3004p642k7794l3913m6576N1972Q492l1500j4913
$$ plain form
16216 -8552 -35687 -10396 -13549 -50102 -78284 -68868 -67357 -17029 12788 4083 56147 63604 62843
16203 62843 8982 -87470 -51559 -44924 -39885 -19379 -157045 -229577 -184475 -150180 -149260 -132577
16191 -132577 -66690 75756 58515 34946 -29733 -72331 -55193 -67308 -99788 -94775 87867
16180 87867 103135 66001 52340 -20546 -33746 14258 -936 -49624 -102873 -119918 -121471 -133446
16168 -133446 -11112 2622 -1692 50811 55611 -32426 -65007 -7033 36036 -18311 45737 27885
16156 27885 52766 50287 -59801 -104588 -80648 18017 41425 21426 -65438 -84346 52759
16145 52759 14146 -55743 68620 39003 67029 117526 189224 260284 250150 327758 504873
16134 504873 708506 998380 1262894 1408594 1361814 1131132 857122 642478 526353 369616
$$ packed form
16216h552k7135K5291l153l6553k8182R416J511N0328K9817q705N2064P457p61
16203F2843n3861r6452L5911O635N039K0506j37666p2532M5102L4295R20J6683
16191a32577O5887J42446j7241k3569o4679m2598J7138j2115l2480N013J82642
16180H7867J5268l7134j3661p2886j3200M8004j5194m8688n3249j7045j553j1975
16168a33446J22334J3734m314N2503M800q8037l2581N7974M3069n4347O4048j7852
16156B7885K4881k479j10088m4787K3940R8665K3408j9999q6864j8908J37105
16145E2759l8613o9889J24363k9617K8026N0497P1698P1060j0134P7608J77115
16134E04873K03633K89874K64514J45700m6780k30682k74010k14644j16125j56737
$$ plain form
16124 369616 220591 176629 200441 57519 -27650 -13510 -32161 -49662 -36103 61646 113000
16113 113000 20720 -12345 41199 109658 150938 77512 79487 74577 115177 148341 121964 26328
16101 26328 -57186 -10309 -34307 -13828 -24567 -31754 50474 -24285 -131197 -134136 -118268 31730
16089 31730 21084 -33124 -18543 2792 9448 1541 -25720 -29067 52223 58408 25043 14157
16077 14157 29700 43410 8060 -65431 -113032 -95841 -79483 -52836 -1894 87982 111373 31051
16065 31051 -12225 55084 131735 92382 98320 190810 231620 259591 196871 111063 50994 -16574
16053 -16574 -72512 -26289 66680 157294 214497 219194 208674 148629 151364 94400 75909 126220
16041 126220 180918 256719 182777 94415 186007 267731 280809 202638 124830 121206 143631 202945
$$ packed form
16124C69616j49025m3962K3812j42922q5169J4140j8651j7501J3559R7749N1354
16113A13000r2280l3065N3544O8459M1280p3426J975m910M0600L3164k6377r5636
16101B6328q3514M6877k3998K0479j0739p187Q2228p4759j06912k939J5868J49998
16089C1730j0646n4208J4581K1335O656p907k7261l347Q1290O185l3365j0886
16077A4157J5543J3710l5350p3491m7601J7191J6358K6647N0942Q9876K3391q0322
16065C1051m3276O7309P6651l9353N938R2490M0810K7971o2720q5808o0069o7568
16053a6574n5938M6223R2969R0614N7203M697j0520o0045K735n6964j8491N0311
16041A26220N4698P5801p3942q8362R1592Q1724J3078p8171p7808l624K2425N9314
$$ plain form
16029 202945 244303 195796 148952 88128 92062 174005 226737 150393 127640 180839 179581 118533
16017 118533 100373 75934 72986 119674 90059 46330 65755 67033 -27240 -88331 -83265 4317
16005 4317 78346 42633 92347 181215 92146 40042 24637 -5270 102135 139125 73457 50818
15993 50818 69343 22512 16042 18329 121798 226600 208891 221038 229363 175015 127476 39518
15981 39518 9860 -3462 41607 58854 80078 -21760 -59828 -28991 -146208 -108924 -80949
15970 -80949 15077 21146 14188 -33354 -54708 -54279 19582 52754 -41694 -22798 32081 38999 140292
15957 140292 157343 64978 17666 56132 108289 109587 158005 74158 -48781 -46346 -90435 -84134
15945 -84134 -96776 -137778 -87487 -109605 -29794 9981 69174 78039 71970 73265 96898 103310
$$ packed form
16029B02945M1358m8507m6844o0824L934Q1943N2732p6344k2753N3199j258o1048
16017A18533j8160k4439k948M6688k9615m3729J9425J278r4273o1091N066Q7582
16005D317P4029l5713M9714Q8868q9069n2104j5405k9907J07405L6990o5668k2639
15993E0818J8525m6831o470K287J03469J04802j7709J2147Q325n4348m7539q7958
15981C9518k9658j3322M5069J7247K1224j01838l8068L0837j17217L7284K7975
15970h0949R6026O069o958m7542k1354M29P3861L3172r4448J8896N4879O918J01293
15957A40292J7051r2365m7312L8466N2157J298M8418q3847j22939K435m4089O301
15945h4134j2642m1002N0291k2118P9811L9775N9193Q865o069J295K3633O412
$$ plain form
15933 103310 118897 150326 162769 119834 150837 59189 -39048 -70693 -42843 -90460 -52274
15922 -52274 -34003 -101702 -65505 -50107 -19427 -102250 -125419 -52074 -39222 -53337 -30688 31265
15910 31265 1819 70570 65753 -31455 -125585 -39592 22662 49010 49099 61257 -31874 -72236
15898 -72236 -57529 -14122 49629 168158 178050 184130 180784 145851 165591 108989 134537 187149
15886 187149 149630 125275 201892 161345 73583 -30824 -66128 -24291 -34821 -60973 -92486
15875 -92486 -6377 53030 106125 63958 -28161 16391 63654 -5097 -18985 69514 59622 106704
15863 106704 125447 -50104 -70495 -101462 -193996 -180633 -127959 -117457 -105705 -47955 15412
15852 15412 86678 42045 -42473 -81178 -99620 -93910 -21345 -42583 -52135 500 32286 32594
$$ packed form
15933A03310J5587L1429J2443m2935L1003r1648r8237l1645K7850m7617L8186
15922e2274J8271o7699L6197J5398L0680q2823k3169P3345J2852j4115K2649O1953
15910C1265k9446O8751m817r7208r4130Q5993O2254K6348Q9J2158r3131m0362
15898g2236J4707M3407O3751J18529R892O080l346l4933J9740n6602K5548N2612
15886A87149l7519k4355P6617m0547q7762j04407l5304M1837j0530k6152l1513
15875i2486Q6109N9407N3095m2167r2119M4552M7263o8751j3888Q8499r892M7082
15863A06704J8743j75551k0391l0967r2534J3363N2674J0502J1752N7750O3367
15852A5412P1266m4633q4518l8705j8442N710P2565k1238r552N2635L1786L08
$$ plain form
15840 32594 29049 68218 77036 65788 25401 -74857 -74369 -14999 81865 68972 -125264 -81772
15828 -81772 22636 2648 -38064 9650 32300 25529 -1667 -21528 -74055 -19646 1995 105367
15816 105367 137660 99494 -8454 -156028 -130124 -110718 -99861 -2387 60408 25337 12500
15805 12500 -63777 -105175 -115355 -89606 -91548 -26982 -39571 -97335 -104543 -126526 -180438 -164212
15793 -164212 -106624 -67523 -101340 -174302 -193958 -188059 -152154 -90642 -97367 -80337 -64360 -28756
15781 -28756 -101384 -88435 -35700 49006 49668 22929 33668 74401 19741 -51753 -36679 11668
15769 11668 -23077 2791 42315 37711 26676 113390 145994 48544 -55784 -85484 -108012 -36419
15757 -36419 -75634 -116502 -47707 11817 45576 57346 -67622 -102955 -64447 -68429 -15080 -25207
$$ packed form
15840C2594l545L9169Q818j1248m0387j00258M88N9370R6864j2893j94236M3492
15828h1772J04408j9988m0712M7714K2650o771k7196j9861n2527N4409K1641J03372
15816A05367L2293l8166j07948j47574K5904J9406J0857R7474O2795l5071j2837
15805A2500p6277m1398j0180K5749j942O4566j2589n7764p208k1983n3912J6226
15793a64212N7588L9101l3817p2962j9656N899L5905O1512o725J7030J5977L5604
15781b8756p2628J2949N2735Q4706O62k6739J0739M0733n4660p1494J5074M8347
15769A1668l4745K5868L9524m604j1035Q6714L2604r7450j04328k9700k2528P1593
15757c6419l9215m0868O8795N9524L3759J1770j24968l5333L8508l982N3349j0127
$$ plain form
15745 -25207 -59430 -84692 -31530 -49207 18432 81326 60501 78655 86711 67888 46469 29155
15733 29155 -46358 -65387 -68622 -107498 -191709 -192763 -150381 953 26176 -50129 -73292 -73101
15721 -73101 -134945 -101323 -53328 -97103 -143167 -222820 -327581 -261047 -226263 -202035 -88750
15710 -88750 -103125 -81223 -40330 -35670 -59896 -58526 49513 57983 -33463 -139686 -220547 -152080
15698 -152080 -75942 -88730 6409 102304 186122 185385 167843 117461 7933 -12168 89493
15687 89493 73339 40112 36744 23385 -51991 -39088 -1435 42639 48734 52194 32517 11659
15675 11659 7013 28177 -24157 -111368 811 84090 74675 71653 56380 92666 133187 166152
15663 166152 92241 15653 -21529 -18107 -30465 42649 166374 172872 139681 64132 111650 82359
$$ packed form
15745b5207l4223k5262N3162j7677O7639O2894k0825J8154Q056j8823k1419j7314
15733B9155p5513j9029l235l8876q4211j054M2382J51334K5223p6305k3163J91
15721g3101o1844L3622M7995m3775m6064p9653j04761O6534L4784K4228J13285
15710h8750j4375K1902M0893M660k4226J370J08039Q470r1446j06223q0861O8467
15698a52080P6138j2788R5139R5895Q3818p37j7542n0382j09528k0101J01661
15687H9493j6154l3227l368j3359p5376J2903L7653M4074O095L460j9677k0858
15675A1659m646K1164n2334q7211J12179Q3279r415l022j5273L6286M0521L2965
15663A66152p3911p6588l7182L422j2358P3114J23725O498l3191p5549M7518k9291
$$ plain form
15651 82359 -10700 -27868 111 -72538 -172102 -244155 -161970 -61047 -25117 11531 -14992
15640 -14992 -20910 -14529 -3510 -37343 -54057 -65096 -20387 -21699 -62494 64480 16576 -32274
15628 -32274 32078 24496 102142 84315 67278 32755 10837 11006 -69713 -114248 -115463 -119805 -115647
15615 -115647 -80460 -73954 -35966 5747 43137 25117 -16129 -26051 2082 36592 24294 27441
15603 27441 26186 16068 -33392 -34806 29239 -10204 -26942 -34548 16361 33539 -27346 -56032
15591 -56032 -57613 29497 106412 101662 97850 29639 -25788 -93515 -107728 -62597 1268 47788
15579 47788 -2809 -91712 -83332 -22785 -24832 12297 40976 38567 38244 -70645 -110337 -76567
15567 -76567 -107001 -35510 25724 134710 102534 29286 -9932 49158 8357 -12322 94469
$$ packed form
15651H2359r3059j7168K7979p2649r9564p2053Q2185J00923L5930L6648k6523
15640a4992n918O381J1019l3833j6714j1039M4709j312m0795J26974m7904m8850
15628c2274O4352p582P7646j7827j7037l4523k1918J69q0719m4535j215m342M158
15615a15647L5187O506L7988M1713L7390j8020m1246r922K8133L4510j2298L147
15603B7441j255j0118m9460j414O4045l9443j6738p606N0909J7178o0885k8686
15591e6032j581Q7110P6915m750l812o8211n5427o7727j4213M5131O3865M6520
15579D7788n0597q8903Q380O0547k047L7129K8679k409l23j08889l9692L3770
15567g6567l0434P1491O1234J08986l2176p3248l9218N9090m0801k0679J06791
$$ plain form
15556 94469 141191 141111 211413 179428 158718 134119 103594 33182 -65451 -57453 -9289 -27446
15544 -27446 -53299 -70153 -61543 -42087 -65843 -182523 -154908 -92414 -9298 -1528 -79182 -106705
15532 -106705 -125040 -151541 -143690 -118931 -109402 -104818 -7449 121476 104684 3969 -23964 -2891
15520 -2891 16372 -4189 -2415 17326 15687 26905 62127 48805 47604 57675 57809 110939 159511
15507 159511 112549 -14813 -96992 -178960 -157429 -111967 -135504 -146373 -65118 50570 61150
15496 61150 -15578 -98613 -49124 -28889 -42154 -37695 -112463 -161700 -114180 -48751 -64150 -53498
15484 -53498 -99285 -27057 -28259 -40372 -21870 29675 67240 -10073 -109957 -142033 -82569 -22434
15472 -22434 -18076 -63599 -95197 -115533 -28425 37909 65577 137624 38670 -117742 -100696 -93971
$$ packed form
15556I4469M6722q0P0302l1985k0710k4599l0525p0412r8633P998M8164j8157
15544b7446k5853j6854Q610J9456k3756j16680K7615O2494Q3116P770p7654k7523
15532a06705j8335k6501P851K4759R529M584R7369J28925j6792j00715k7933K1073
15520b891J9263k0561J774J9741j639J1218L5222j3322j201J0071J34N3130M8572
15507A59511m6962j27362q2179q1968K1531M5462k3537j0869Q1255J15688J0580
15496F1150p6728q3035M9489K0235j3265M459p4768m9237M7520O5429j5399J0652
15484e3498m5787P2228j202j2113J8502N1545L7565p7313r9884l2076N9464O0135
15472b2434M358m5523l1598k0336Q7108O6334K7668P2047r8954j56412J7046O725
$$ plain form
15460 -93971 -47387 34852 48830 25513 56651 143202 37215 -50415 -67575 -115117 -134075
15449 -134075 -213412 -204828 -235381 -123524 -80998 -120226 -83936 -97728 -144635 -156981 -52777
15438 -52777 -27731 -45491 26007 46406 7083 4113 -12668 -45344 -54107 -22305 6469 -61623
15426 -61623 -56726 -83790 -164208 -154318 -64699 2652 -52383 28135 85309 61584 70269 87986
15414 87986 160495 116064 3150 -13640 3912 -49161 -115685 -159603 -211747 -186132 -96030
15403 -96030 -72128 21655 31630 36543 42431 113615 133496 168040 79125 -45539 -110826 -148190
15391 -148190 -129523 -143804 -129306 -97777 -56411 -56499 11131 -15385 -42821 -62587 -78851 -80488
15379 -80488 -94424 -74221 -41173 8012 56702 78076 64866 42573 -63909 -152563 -126192
$$ packed form
15460i3971M6584Q2239J3978k3317L1138Q6551j05987q7630j7160m7542j8958
15449a34075p9337Q584l0553J11857M2526l9228L6290j3792m6907j2346J04204
15438e2777K5046j7760P1498K0399l9323k970j6781l2676q763L1802K8774o8092
15426f1623M897k7064q0418R890Q9619O7351n5035Q0518N7174k3725Q685J7717
15414H7986P2509m4431j12914j6790J7552n3073o6524m3918n2144K5615R0102
15403i6030K3902R3783R975M913N888P1184J9881L4544q8915j24664o5287l7364
15391a48190J8667j4281J4498L1529M1366q8O7630k6516k7436j9766j6264j637
15379h0488j3936K0203L3048M9185M8690K1374j3210k2293j06482q8654K6371
$$ plain form
15368 -126192 -59902 -51709 -93747 -82263 -33154 -40975 72226 86217 -1880 -13639 -51755 -37109
15356 -37109 -93703 -68762 -41236 -19203 -29066 -129426 -149065 -55345 65451 34216 12995
15345 12995 12909 20159 -17051 -14067 55832 42341 31768 88268 114135 58674 3828 23898 3315
15332 3315 -12817 -78251 -137506 -128425 -81367 -99787 -47971 -99805 -166243 -131089 -35305 91544
15320 91544 163144 77558 18102 -1820 15343 -20227 -17625 81840 66096 65413 92368 12351
15308 12351 48198 136619 102732 144909 137722 101281 65174 1925 -52557 -111357 -94995 -173205
15296 -173205 -95746 -65363 -58043 -40406 58415 136368 48174 -64246 -103029 -61537 -30144
15285 -30144 -71221 -123377 -137499 -180660 -156755 -67155 -59876 -89394 -80892 -111452 -107500 -41651
$$ packed form
15368a26192O6290Q193m2038J1484M9109p821J13201J3991q8097j1759l8116J4646
15356c7109n6594K4941K7526K2033r863j00360j9639R3720J20796l1235k1221
15345A2995q6P250l7210K984O9899j3491j0573N6500K5867n5461n4846K0070k0583
15332C315j6132o5434n9255R081M7058j8420N1816n1834o6438L5154R5784J26849
15320I1544P1600q5586n9456j9922J7163l5570K602R9465j5744o83K6955q0017
15308A2351L5847Q8421l3887M2177p187l6441l6107o3249n4482n8800J6362p8210
15296a73205P7459L0383P320J7637R8821P7953q8194j12420l8783M1492L1393
15285c0144m1077n2156j4122m3161K3905Q9600P279k9518Q502l0560L952O5849
$$ plain form
15273 -41651 -60593 -69801 -66392 7110 -28009 -13150 30640 -53490 -76851 -85067 -76799 -1250
15261 -1250 98189 135261 85295 1629 -97001 -91813 -46292 -87094 -221441 -165802 24854 71499
15249 71499 18633 -51983 -19097 67069 39416 -19986 7647 1284 -51047 -76897 -71013 -22134
15237 -22134 -51896 -58153 -102284 -209866 -175621 -161159 -181485 -81624 -16446 57441 17602 -43671
15225 -43671 -1445 17247 25047 -47472 -115299 -114474 -74121 -50436 -123862 -142143 -33442 45812
15213 45812 66657 85412 61908 93040 140900 227243 296302 213896 159662 9497 3419 -40195
15201 -40195 -63094 -30686 -104613 13858 63379 45989 39294 18180 2357 5100 -15603 -56485
15189 -56485 -61369 18077 70564 39285 29401 62880 96818 84133 -5380 -59713 -48566 -31785
$$ packed form
15273d1651j8942r208L409P3502l5119J4859M3790q4130k3361q216Q268P5549
15261a250R9439L7072m9966q3666r8630N188M5521m0802j34347N5639J90656M6645
15249G1499n2866p0616L2886Q6166k7653n9402K7633o363n2331k5850N884M8879
15237b2134k9762o257m4131j07582L4245J4462k0326R9861O5178P3887l9839o1273
15225d3671M2226J8692P800p2519o7827Q25M0353K3685p3426j8281J08701P9254
15213D5812K0845J8755k3504L1132M7860Q6343O9059q2406n4234j50165o078m3614
15201d0195k2899L2408p3927J18471M9521j7390o695k1114j5823K743k0703m0882
15189e6485m884P9446N2487l1279r884L3479L3938j2685q9513n4333J1147J6781
$$ plain form
15177 -31785 -11784 22375 20881 102050 120719 -28466 -111822 -90559 -45887 17729 39741 -37462
15165 -37462 -84647 -43766 -45645 32388 72451 37718 27950 16851 -45401 -94926 -34282 16533
15153 16533 -50195 -44416 -12015 -32029 6685 94122 85245 26978 -61374 -78560 -123737 -61252
15141 -61252 41418 185430 203921 207597 80099 -23099 19931 32812 66441 115392 91487
15130 91487 109856 125995 173988 137725 145109 140876 53500 20025 -49198 -43855 -55574 -107818
15118 -107818 -155851 -107129 61377 65008 78779 65148 25719 72497 76043 28403 19742 -45224
15106 -45224 -134360 -131202 -84992 -54296 -138792 -184609 -224510 -147531 -82164 -69451 34511 51389
15094 51389 12311 -21189 -27704 -40348 -56030 -100135 -14275 21029 -73429 -24058 -20872 -8827
$$ packed form
15177c1785K0001L4159j494Q1169J8669j49185q3356K1263M4672O3616K2012p7203
15165c7462m7185M0881j879P8033M0063l4733r768j1099o2252m9525O0644N0815
15153A6533o6728N779L2401k0014L8714Q7437q877n8267q8352j7186m5177O2485
15141f1252J02670J44012J8491L676j27498j03198M3030J2881L3629M8951k3905
15130I1487J8369J6139M7993l6263P384m233q7376l3475o9223N343j1719n2244
15118a07818m8033M8722J68506L631J3771j3631l9429M6778L546m7640q661o4966
15106d5224q9136L158M6210L0696q4496m5817l9901P6979O5367J2713J03962J6878
15094E1389l9078l3500o515j2644j5682m4105Q5860L5304r4458M9371L186J2045
$$ plain form
15082 -8827 -46091 -118925 -152033 -140209 -95096 -144699 -200196 -161399 -145238 -149413 -72106 -24631
15070 -24631 -69589 -98925 -15094 27944 -75264 -11262 68071 79597 84047 29457 -25898 -37992
15058 -37992 42308 22228 29878 13805 -69611 -107972 -80537 -99441 -22404 35783 -9430 -52215
15046 -52215 -119620 -122881 -36225 47483 86051 58534 14028 44450 35666 -28734 -53066 -36625
15034 -36625 -36984 -102168 -170791 -127795 -35001 -19156 -6811 35948 -22135 -62447 -6684 38398
15022 38398 62114 92524 110932 57039 26182 20900 21377 8722 -39308 -75116 -98322 -72767
15010 -72767 -49981 -160415 -142773 -72707 -63644 -67287 -12074 -11472 -30070 -46679 46214 34409
14998 34409 -7809 -4961 -44902 -143464 -136294 -65031 -45133 -17077 100273 155184 132398 154001
$$ packed form
15082h827l7264p2834l3108J1824M5113m9603n5497L8797J6161m175P7307M7475
15070b4631m4958k9336Q3831M3038j03208O4002P9333J1526M450n4590n5355j2094
15058c7992Q0300k0080P650j6073q3416l8361K7435j8904P7037N8187m5213m2785
15046e2215o7405l261Q6656Q3708L8568k7517m4506L0422q784o4400k4332J6441
15034c6625l59o5184o8623M2996R2794J5845J2345M2759n8083m0312N5763M5082
15022C8398K3716L0410J8408n3893l0857n282M77j2655m8030l5808k3206K5555
15010g2767K2786j10434J7642P0066R063l643N5213O02j8598j6609R2893j1805
14998C4409m2218K848l9941r8562P170P1263J9898K8056J17350N4911k2786K1603
$$ plain form
14986 154001 143756 153457 206611 164407 68027 21022 68 48743 118055 170266 158742 142005
14974 142005 167729 212430 180597 107343 51229 10721 -48472 -58926 -43099 -100676 -24449
14963 -24449 67344 79727 107706 59930 -88513 -97420 -96886 -47906 -56313 -94194 -80131 29409
14951 29409 92788 80291 112459 99353 46379 2065 -37089 -34308 27483 53320 64078 81565
14939 81565 45494 31643 1222 43731 65149 22331 74146 130523 75464 1210 39135 102083
14927 102083 117745 141745 110560 9557 18229 85789 19254 -14297 13545 5906 3977 -97233
14915 -97233 -162547 -104143 -42242 -8152 -63405 -70306 -62437 -49467 -106508 -102485 -102741 -100121 -36859
14902 -36859 -35555 -70039 -64790 60254 92252 150630 116831 94879 122053 104552 108207 78869
$$ packed form
14986A54001j0245R701N3154m2204r6380m7005k0954M8675O9312N2211j1524j6737
14974A42005K5724M4701l1833p3254n6114m0508n9193j0454J5827n7577P6227
14963b4449R1793J2383K7979m7776j48443q907N34M8980q407l7881J4063J09540
14951B9409O3379j2497L2168j3106n2974m4314l9154K781O1791K5837J0758J7487
14939H1565l6071j3851l0421M2509K1418m2818N1815N6377n5059p4254L7925O2948
14927A02083J5662K4000l1185j01003Q672O7560o6535l3551K7842p639j929j01210
14915i7233o5314N8404O1901L4090n5253o901P869J2970n7041M023k56K620O3262
14902c6859J304l4484N249J25044L1998N8378l3799k1952K7174j7501L655k9338
$$ plain form
14890 78869 4141 -19591 53542 74431 54267 18389 55968 22650 3911 -1299 -46604 -80038
14878 -80038 -12810 -6781 28508 -81023 -100407 -47997 -41811 -35676 -52527 16590 58608 3653
14866 3653 -82305 -153584 -114851 -93859 -110686 -71106 -62121 -24386 -38838 -84729 -65024 42133
14854 42133 96130 -30703 -109421 -161685 -45736 896 -19390 555 24198 17500 32834
14843 32834 30683 69499 93722 350 -66085 -38228 13936 40861 -26215 23701 34936 47147
14831 47147 -108771 -91756 -7385 -25958 -92711 -107364 -51402 -28062 -46303 -39786 -41273 -28509
14819 -28509 -111840 -125210 -157390 -149383 -208657 -192088 -138129 -120051 -138659 -159494 -170874 -125241
14807 -125241 -74635 -70222 -118425 -170204 -163246 -78521 -111151 -71852 -66846 -94239 13590 26158
$$ packed form
14890G8869p4728k3732P3133K0889k0164l5878L7579l3318j8739n210m5305l3434
14878h0038O7228O029L5289j09531j9384N2410O186O135j6851O9117M2018n4955
14866C653q5958p1279L8733K0992j6827L9580Q985L7735j4452m5891J9705J07157
14854D2133N3997j26833p8718n2264J15949M6632k0286J9945K3643o698J5334
14843C2834k151L8816K4223r3372o6435K7857N2164K6925o7076M9916J1235J2211
14831D7147j55918J7015Q4371j8573o6753j4653N5962K3340j8241O517j487J2764
14819b8509q3331j3370l2180Q007n9274J6569N3959J8078j8608k0835j1380M5633
14807a25241N0606M413m8203n1779O958Q4725l2630L9299N006k7393J07829J2568
$$ plain form
14795 26158 7597 129120 174432 59694 -51459 -93967 -23808 53465 112613 59477 -20411
14784 -20411 -84404 -144729 -148258 -55152 -8389 108791 187073 179043 72925 -69618 -96494
14773 -96494 -122275 -75802 34839 -65376 -183693 -153535 -38350 12233 -58417 -50955 -37393
14762 -37393 -47561 -42729 -17807 -18688 -32989 -99720 -138735 -112101 -21954 43685 36250 -6013
14750 -6013 -25216 -40741 -16814 30026 64112 130635 257469 228423 100007 -31426 -7559
14739 -7559 71474 117871 170609 110268 -19874 -52791 -21463 -30394 -76785 -8691 39728 59652
14727 59652 122934 115026 90286 132433 85239 14962 -86021 -112521 -67561 -82958 -11866 65333
14715 65333 133819 76596 -23891 -32267 -36643 -93576 -80494 -63709 45761 94979 52921 51006
$$ packed form
14795B6158j8561J21523M5312j14738j11153m2508P0159P7273N9148n3136p9888
14784b0411o3993o0325l529R3106M6763J17180P8282q030j06118j42543k6876
14773i6494k5781M6473J10641j00215j18317L0158J15185N0583p0650P462J3562
14762c7393j0168M832K4922q81j4301o6731l9015K6634R0147O5639p435m2263
14750f013j9203j5525K3927M6840L4086O6523J26834k9046j28416j31433K3867
14739g559P9033M6397N2738o0341j30142l2917L1328q931m6391O8094M8419J9924
14727E9652O3282p908k4740M2147m7194p0277j00983k6500M4960j5397P1092P7199
14715F5333O8486n7223j00487q376m376n6933J3082J6785J09470M9218m2058j915
$$ plain form
14703 51006 69919 116753 78372 -25314 -21734 -59663 -22279 17815 58703 35834 18869 46213
14691 46213 74020 14288 1226 -40312 -57431 -4591 27697 -907 63072 49032 32539 -39192
14679 -39192 18945 53799 6218 -57856 -110682 -29011 19948 21739 -104536 -141458 -120069 -391
14667 -391 166041 140272 110864 159882 189352 228609 252345 155598 55236 14280 -39656 -44547
14655 -44547 -28633 56699 108928 6811 -28051 -45822 -1367 -2231 23333 29689 14421 11946
14643 11946 29645 52293 60784 11334 37581 64326 37707 23153 57993 154092 112864 9404
14631 9404 -53046 -88435 -108873 -104270 -18408 118975 124830 96218 511 -159303 -227941 -55551
14619 -55551 -5820 -9477 5441 102159 94880 52128 106114 155105 121561 48966 63626 13448
$$ packed form
14703E1006J8913M6834l8381j03686L580l7929L7384M0094M0888k2869j6965K7344
14691D6213K7807n9732j3062m1538j7119N2840L2288k8604O3979j4040j6493p1731
14679c9192N8137L4854m7581o4074n2826Q1671M8959J791j26275l6922K1389J19678
14667c91J66432k5769k9408M9018K9470L9257K3736r6747j00362m0956n3936m891
14655d4547J5914Q5332N2229j02117l4862j7771M4455q64K5564O356j5268k475
14643A1946J7699K2648Q491m9450K6247K6745k6619j4554L4840R6099m1228j03460
14631I404o2450l5389k0438M603Q5862J37383N855k8612r5707j59814o8638J72390
14619e5551M9731l657J4918R6718p279m2752N3986M8991l3544p2595J4660n0178
$$ plain form
14607 13448 -21391 -51398 -27241 -133111 -202486 -95292 48772 44018 22287 16242 -11612
14596 -11612 -90213 -56949 -44973 -58947 -7549 32013 77881 -31812 -62419 -21982 -36206
14585 -36206 12130 95840 71006 15051 3346 56907 86126 37957 36571 73862 119332 32525
14573 32525 -79840 -44052 -10024 -43758 -119663 -153343 -36890 83123 69721 13480 13985
14562 13985 -53771 -74388 -69265 -81994 -47652 -27877 -41842 -80893 33893 99307 52196 18242
14550 18242 4119 -7846 -92232 -168034 -136119 -595 128394 60952 -20216 -73538 -120150
14539 -120150 -161779 -216342 -136959 -44274 -47727 4573 -79380 -174319 -45195 14046 6217 43104
14527 43104 104636 135817 51684 28884 6442 27629 24220 48306 18969 -58447 -17901 68388
$$ packed form
14607A3448l4839l0007K4157j05870o9375J07194J44064m754k1731o045k7854
14596a1612p8601L3264J1976j3974N1398L9562M5868j09693l0607M0437j4224
14585c6206M8336Q3710k4834n5955j1705N3561K9219m8169j386L7291M5470q6807
14573C2525j12365L5788L4028l3734p5905l3680J16453J20013j3402n6241N05
14562A3985o7756k0617N123j2729L4342J9775j3965l9051J14786O5414m7111l3954
14550A8242j4123j1965q4386p5802L1915J35524J28989o7442q1168n3322m6612
14539a20150m1629n4563P9383R2685l453N2300q3953r4939J29124N9241p829L6887
14527D3104O1532L1181q4133k2800k2442K1187l409K4086k9337p7416M0546Q6289
$$ plain form
14515 68388 74536 -5017 -16831 39923 66597 23215 -35732 -79352 1695 32649 -20766 -63028
14503 -63028 -92201 -3873 103634 116851 31172 19236 1898 -10048 -22694 -63584 8081
14492 8081 -60481 -146461 -165653 -104677 -86510 -137377 -76574 33670 25091 -17688 7597 60489
14480 60489 63614 27329 -18663 -58262 -106732 -159241 -121370 -65469 56504 81057 -11058 -24139
14468 -24139 397 9819 -66716 349 -80339 -137882 -153491 -90206 -11202 -28293 -85127 -24503
14456 -24503 7219 13749 -38057 -43825 -31310 3985 -2683 -49836 -48604 -119547 -151094 -105860
14444 -105860 962 21419 -44319 -50394 -20006 6692 21564 22090 14552 -22603 -84727 -125852
14432 -125852 -17741 -30413 47341 24427 2587 87731 41722 29152 4000 -27491 17448
$$ packed form
14515F8388O148p9553j1814N6754K6674m3382n8947m3620Q1047L0954n3415m2262
14503f3028k9173Q8328J07507J3217q5679j1936j7338j1946j2646m0890P1665
14492H081o8562q5980j9192O0976J8167n0867O0803J10244q579m2779K5285N2892
14480F0489L125l6285m5992l9599m8470n2509L7871N5901J21973K4553r2115j3081
14468b4139K4536R422p6535O7065q0688n7543j5609O3285P9004j7091n6834O0624
14456b4503L1722O530n1806n768J2515L5295o668m7153J232p0943l1547M5234
14444a05860J06822K0457o5738o075L0388K6698J4872N26p538l7155o2124m1125
14432a25852J08111j2672P7754k2914k1840Q5144m6009j2570k5152l1491M4939
$$ plain form
14421 17448 -2198 23126 40579 -10770 -7611 5275 39711 34081 -37991 -42793 -19228 -36584
14409 -36584 -246 18605 50777 120472 82147 16793 -23001 -99635 -108999 -10193 12382 -9045
14397 -9045 76943 14030 -46623 -23364 -67402 -38325 27823 123184 119192 34113 8448 72399
14385 72399 78786 145536 143425 88270 59901 50256 111697 86189 -76091 -225272 -198163 -86843
14373 -86843 -81231 -69315 -73778 -67192 -53330 -69100 -13902 28625 89641 181658 175662 110111
14361 110111 5801 6997 -1844 15688 -11179 -130584 -97686 -34808 -41212 802 40443 11613
14349 11613 24402 25192 47268 6911 21526 70128 2046 -56000 -46070 26158 46353 5789
14337 5789 2979 29404 -48766 -32720 74706 96430 37760 -9689 -35383 -12005 -6088 2928
$$ packed form
14421A7448j9646K5324J7453n1349L159J2886L4436n630p2072m802K3565j7356
14409c6584L6338J8851L2172O9695l8325o5354l9794p6634r364R8806K2575k1427
14397i045Q5988o2913o0653K3259m4038K9077O6148R5361l992q5079k5665O3951
14385G2399O387O6750k111n5155k8369r645O1441k5508j62280j49181K7109J11320
14373h6843N612J1916m463O586J3862j5770N5198M2527O1016R2017n996o5551
14361A10111j04310J196q841J7532k6867j19405L2898O2878o404M2014L9641k8830
14349A1613J2789P90K2076m0357J4615M8602o8082n8046R930P2228K0195m0564
14337E789k810K6425p8170J6046J07426K1724n8670m7449k5694K3378N917R016
$$ plain form
14325 2928 -67073 -88864 5508 97159 37168 -67676 -120895 -91979 -28638 53928 -23356 -57811
14313 -57811 -67890 -69115 -124128 -123316 -87091 -24140 55338 67764 34506 2928 -40358 -13241
14301 -13241 58788 127521 203990 220679 18247 1223 106935 77387 25429 -23332 -12663
14290 -12663 -36798 -11454 -53103 -124281 -134637 -40870 -41494 -132186 -173173 -215829 -180299 -69543
14278 -69543 -44977 -54558 54442 69549 -16813 -11405 -80646 -114290 -58370 44397 148675
14267 148675 156996 132579 128473 71693 2623 -25681 5007 24177 13275 -39330 -17134 -5482
14255 -5482 -9397 8699 80971 45762 -15066 19454 32410 77471 154026 222868 172295 131134
14243 131134 111444 71155 84199 -1593 -95137 -112915 -101077 -97098 -68048 -111306 -251973
$$ packed form
14325B928p0001k1791R4372R1651n9991j04844n3219K8916O3341Q2566p7284l4455
14313e7811j0079j225n5013Q12L6225O2951P9478J2426l3258l1578m3286K7117
14301a3241P2029O8733P6469J6689k02432j7024J05712k9548n1958m8761J0669
14290a2663k4135K5344m1649p1178j0356R3767o24r0692m0987m2656L5530J10756
14278f9543K4566r581J09000J5107q6362N408o9241l3644N5920J02767J04278
14267A48675Q321k4417m106n6780o9070k8304L0688J9170j0902n2605K2196J1652
14255e482l915J8096P2272l5209o0828L4520J2956M5061P6555O8842n0573m1161
14243A31134j9690m0289J3044q5792r3544j7778J1838L979K9050m3258j40667
$$ plain form
14232 -251973 -248438 -178307 -72443 -122556 -178265 -164164 -105739 -9251 97395 56656 -52555
14221 -52555 -43001 8233 62730 121005 68435 54557 156093 173698 117226 70079 11704 -10481
14209 -10481 -97022 -134359 -161198 -175022 -108056 -128423 -69791 -64492 35286 67231 21410 -854
14197 -854 70759 122211 101129 -18645 -60173 -60839 -135229 -198154 -159339 -78219 31140 83689
14185 83689 118248 110580 70370 -45733 -95286 -48711 42662 27724 61603 70637 -39058 -7233
14173 -7233 37428 11615 81485 120408 61601 -41647 -54932 40079 60191 98198 127547 98231
14161 98231 71884 73720 96338 135995 84659 112917 186238 277082 344806 391008 380478 384613
14149 384613 441965 567850 787645 1118567 1603413 2526298 3885909 4945670 5309889
$$ packed form
14232b51973L535P0131J05864n0113n5709J4101N8425R6488J06646m0739j09211
14221e2555R554N1234N4497N8275n2570j3878J01536J7605n6472m7147n8375k2185
14209a0481q6541l7337k6839j3824O6966k0367N8632N299R9778L1945m5821k2264
14197h54P1613N1452k1082j19774m1528o66p4390o2925L8815Q1120J09359N2549
14185H3689L4559p668m0210j16103m9553M6575R1373j4938L3879R034j09695L1825
14173g233M4661k5813O9870L8923n8807j03248j3285R5011K0112L8007K9349k9316
14161I8231k6347J836K2618L9657n1336K8258P3321R0844O7724M6202j0530M135
14149C84613N7352J25885K19795L30922M84846R22885J359611J059761L64219
$$ plain form
14140 5309889 5006718 3847575 2542028 1611277 1051277 816589 667154 520050 402439
14131 402439 360113 348418 274474 209395 195492 200857 212654 188068 130322 100466 112429 144802
14119 144802 183315 140405 90194 19649 15441 -329 42172 112932 92818 71322 70635 49927
14107 49927 10570 37750 65790 -21739 -1328 142363 177327 83568 6746 25519 12232
14096 12232 -48758 -64002 14348 -26166 -91938 -19294 -35574 25750 35799 -9136 48915 114031
14084 114031 37881 55948 77517 72606 23781 53736 65503 7136 -8862 31044 65457 72501
14072 72501 41992 49823 73920 37658 -23043 4263 16204 40428 53766 -21325 -43348 -78449
14060 -78449 -63130 23104 5139 22999 -33432 -10916 47737 58980 14110 15906 48234 19281
$$ packed form
14140E309889l03171j159143j305547r30751n60000k34688j49435j47104j17611
14131D02439m2326j1695p3944o5079j3903N365J1797k4586n7746k9856J1963L2373
14119A44802L8513m2910n0211p0545m208j5770M2501P0760k0114k1496o87k0708
14107D9927l9357K7180K8040q7529K0411J43691L4964r3759p6822J8773j3287
14096A2232o0990j5244P8350m0514o5772P2644j6280O1324J0049m4935N8051O5116
14084A14031p6150J8067K1569m911m8825K9955J1767n8367j5998L9906L4413P044
14072G2501l0509P831K4097l6262o0701K7306J1941K4224J3338p5091k2023l5101
14060g8449J5319Q6234j7965J7860n6431K2516N8653J1243m4870J796L2328k8953
$$ plain form
14048 19281 -48846 -77121 8763 -18418 -16030 7553 -15111 -36512 2392 46627 -9817 -77787
14036 -77787 -65686 -4417 -47923 -85116 -38553 23870 130251 104682 25981 -34242 4722
14025 4722 51592 36178 106978 139611 16574 -18790 32220 66880 -12118 -139106 -158622
14014 -158622 -89957 12537 8218 17412 103 13286 90524 46265 -13677 48654 59684 -31612
14002 -31612 -36093 -53542 -46111 -1138 -29685 -28185 -87988 -71191 8174 -11695 -84886 -73539
13990 -73539 -64471 -79109 -39990 -18544 -17779 38175 22094 -58785 -121643 -64416 5992 -20633
13978 -20633 -35053 -104756 -85504 28543 30087 137124 121159 174769 225317 202164 160647
13967 160647 140273 185429 187728 170150 96798 138260 108657 7116 -103708 -62021 -9143
$$ packed form
14048A9281o8127k8275Q5884k7181K388K3583k2664k1401L8904M4235n6444o7970
14036g7787J2101O1269m3506l7193M6563O2423J06381k5569p8701o0223L8964
14025D722M6870j5414P0800L2633j23037l5364N1010L4660p8998j26988j9516
14014a58622O8665J02494m319R194j7309J3183P7238m4259n9942O2331J1030r1296
14002c1612m481j7449P431M4973k8547J500n9803J6797P9365j9869p3191J1347
13990g3539R068j4638L9119K1446P65N5954j6081q0879o2858N7227P0408k6625
13978b0633j4420o9703J9252J14047J544J07037j5965N3610N0548k3153m1517
13967A60647k0374M5156K299j7578p3352M1462k9603j01541j10824M1687N2878
$$ plain form
13956 -9143 44926 -48243 -46579 -91676 -190114 -87083 -58851 -25464 34465 20265 -64449 -105371
13944 -105371 -37730 76480 90447 36373 -32220 -11211 27854 36390 51709 -21102 -38473
13933 -38473 -22414 1664 -80660 -86637 -96300 -151119 -152464 -113418 -92079 -80623 -158472 -179258
13921 -179258 -104812 -80224 -71758 -86680 -190623 -234606 -176884 -49573 34351 -28710 -144791
13910 -144791 -138167 -66762 -73603 -121765 -75801 -15285 -35895 -66005 -86217 -87716 -64038 -33048
13898 -33048 11592 102442 207420 179071 148229 103300 -16572 6383 -55028 -92385 -34777
13887 -34777 4217 -31675 80929 247939 290559 358936 436896 422811 366927 351377 258872
13876 258872 216704 148276 100186 34732 -35535 -23229 -69622 -126001 -65772 -23950 5333
$$ packed form
13956i143N4069r3169J664m5097r8438J03031K8232L3387N9929j4200q4714m0922
13944a05371O7641J14210J3967n4074o8593K1009L9065Q536J5319p2811j7371
13933c8473J6059K4078q2324n977r663n4819j345L9046K1339J1456p7849k0786
13921a79258P4446K4588Q466j4922j03943m3983N7722J27311Q3924o3061j16081
13910a44791O624P1405o841m8162M5964O0516k0610l0110k0212j499K3678L0990
13898c3048M4640R0850J04978k8349l0842m4929j19872K2955o1411l7357N7608
13887c4777L8994l5892J12604J67010M2620O8377P7960j4085n5884j5550r2505
13876B58872m2168o8428m8090o5454p0267J2306m6393n6379O0229M1822K9283
$$ plain form
13865 5333 20872 -45261 -139758 -100085 -51345 -24076 -62378 -56655 41056 89055 53704 -15259
13853 -15259 -85339 -74973 -20631 19853 46143 74915 180307 249040 206895 315386 397416
13842 397416 321440 251925 260733 238169 116066 97104 82122 32862 35886 45836 -54151 -68003
13830 -68003 56585 31420 835 10480 24637 30341 39018 75467 118555 55686 4304 -37234
13818 -37234 6736 51009 41101 49429 -28482 -31461 2570 -22539 18275 61182 70257 51621
13806 51621 -4108 -63894 -105169 -132299 -70454 26330 42402 -2298 -39656 -24455 97300
13795 97300 135686 125290 70899 -2990 -40713 -51065 -39769 -2895 -76230 18610 92360 107453
13783 107453 63110 176708 171858 15161 -34554 121140 91572 41090 27004 24 3505
$$ packed form
13865E333J5539o6133r4497L9673M8740K7269l8302N723R7711M7999l5351o8963
13853a5259p0080J0366N4342M0484K6290K8772J05392O8733m2145J08491Q2030
13842C97416p5976o9515Q808k2564j22103j8962j4982m9260L024R950r9987j3852
13830f8003J24588k5165l0585R645J4157N704Q677L6449M3088o2869n1382m1538
13818c7234M3970M4273r908Q328p7911k979L4031k5109M0814M2907R075j8636
13806E1621n5729n9786m1275k7130O1845R6784J6072m4700l7358J5201J21755
13795I7300L8386j0396n4391p3889l7723j0352J1296L6874p3335R4840P3750J5093
13783A07453m4343J13598m850j56697m9715J55694k9568n0482j4086k6980L481
$$ plain form
13772 3505 102648 83956 50829 15868 30692 6304 52001 56733 8285 32646 66622 111775
13760 111775 64591 -44292 -121216 -56790 36826 61242 90449 250434 231825 211270 259666
13749 259666 226474 256479 327943 384597 384232 225423 203764 176697 113615 -14047 -3933
13738 -3933 57998 109543 103918 130312 157514 175147 149661 131783 133248 198136 173418 62757
13726 62757 -7136 51875 116483 111611 96896 46142 54612 121678 67857 -20245 -5283 38003
13714 38003 21924 -112745 -166389 -137300 48220 120575 46764 -47071 -70409 -96414 -106024
13703 -106024 -106993 -187983 -176124 -189324 -217234 -246425 -184246 -77897 -134857 -95654 -22335 -7259
13691 -7259 -21782 38135 -26309 -106335 -48476 23357 16724 -44012 -63011 -37220 28983 -3416
$$ packed form
13772C505R9143j8692l3127l4961J4824k4388M5697M732m8448K4361L3976M5153
13760A11775m7184j08883p6924O4426R3616K4416K9207J59985j8609k0555M8396
13749B59666l3192L0005P1464N6654l65j58809k1659k7067o3082j27662J0114
13738c933O1931N1545n625K6394K7202J7633k5486j7878J465O4888k4718j10661
13726F2757o9893N9011O4608m872j4715n0754Q470O7066n3821q8102J4962M3286
13714C8003j6079j34669n3644K9089J85520P2355p3811r3835k3338k6005r610
13703a06024r69q0990J1859j3200k7910k9191O2179J06349n6960L9203P3319J5076
13691g259j4523N9917o4444q0026N7859P1833o633o0736j8999K5791O6203l2399
$$ plain form
13679 -3416 12284 84350 98259 124841 43365 -54891 -42191 -35932 -60165 -79776 -135371 -131958
13667 -131958 -50211 55012 93368 69366 65407 64119 26863 32456 19283 55204 109097 151805
13655 151805 106190 44300 14840 28966 68803 14046 -22473 -15128 72958 69737 32223 -35095
13643 -35095 -86392 -63207 -61228 -96707 -147449 -122321 -55707 -21535 -66503 -33853 79709 97856
13631 97856 100700 143174 9074 -96026 -53513 78325 6082 14465 40329 78502 36014
13620 36014 27186 10556 -24579 -79503 -96324 -68695 -67636 -52116 -50435 21298 118147 101104
13608 101104 58306 87998 118001 90836 8268 64685 38090 124829 85297 48590 -8081
13597 -8081 -87920 -80286 -6365 83481 68811 -31170 -77009 -54017 40458 112497 55541 -13645
$$ packed form
13679c416J5700P2066J3909K6582q1476r8256J2700O259k4233j9611n5595L413
13667a31958Q1747J05223L8356k4002l959j288l7256N593j3173L5921N3893M2708
13655A51805m5615o1890k9460J4126L9837n4757l6519P345Q8086l221l7514o7318
13643c5095n1297K3185J979l5479n0742K5128O6614L4172m4968L2650J13562J8147
13631I7856K844M2474j34100j05100M2513J31838p2243Q383K5864L8173m2488
13620C6014q828j6630l5135n4924j6821K7629J059J5520J681P1733R6849j7043
13608A01104m2798K9692L0003k7165q2568N6417k6595Q6739l9532l6707n6671
13597h081p9839P634P3921Q9846j4670r9981m5839K2992R4475P2039n6956o9186
$$ plain form
13585 -13645 -30363 20705 146251 131316 36307 57016 104166 52292 -38200 -65417 -18816
13574 -18816 7253 14608 21083 48779 37740 74352 123629 30484 -126053 -210594 -282769 -244757
13562 -244757 -249444 -139909 -84971 -24369 18199 -23554 26035 103980 101426 161150 165978 91720
13550 91720 39070 69315 30771 5658 6397 -53885 -80948 -103692 -62411 75510 198813 40087
13538 40087 -47302 -35343 -130373 -137248 -48556 43801 85435 30229 -18374 -82761 -124459 -137423
13526 -137423 -8419 30179 11246 27603 5564 -56726 -55952 -35507 -69101 -82110 -139147 -228866
13514 -228866 -190590 -197905 -138258 -116277 -123493 18933 21688 -29042 -111571 4109 65480 115702
13502 115702 111437 135639 107922 107382 35854 -26479 -46492 25414 58743 25096 10381 -72066
$$ packed form
13585a3645j6718N1068J25546j4935r5009K0709M7150n1874r0492k7217M6601
13574a8816K6069P355O475K7696j1039L6612M9277r3145j56537q4541p2175L8012
13562b44757m687J09535N4938O0602M2568m1753M9589P7945k554N9724M828p4258
13550I1720n2650L0245l8544k5113P39o0282k7063k2744M1281J37921J23303j58726
13538D0087q7389J1959r5030o875Q8692R2357M1634n5206m8603o4387m1698j2964
13526a37423J29004L8598j8933J6357k2039o2290P74K0445l3594j3009n7037q9719
13514b28866L8276p315N9647K1981p216J42426K755n0730q2529J15680O1371N0222
13502A15702m265K4202k7717n40p1528o2333k0013P1906L3329l3647j4715q2447
$$ plain form
13490 -72066 -238751 -255756 -158727 -27291 46389 47051 81974 34703 -35253 -70448 -135322 -98598
13478 -98598 -21156 2262 -2060 -37397 -105662 -155603 -157065 -130441 -133912 -28051 9766 93140
13466 93140 33645 57160 38903 5892 -17701 -4814 -29073 23905 -67886 -151205 -185692 -109937
13454 -109937 -70004 -47426 -26422 30352 73254 70430 93579 18258 -6310 -64989 -27508 63116
13442 63116 71283 36757 2091 32890 76006 107700 74141 80110 -12568 -87972 -121983 -91383
13430 -91383 -114171 -87334 -112592 -172467 -147246 -111562 -23821 -101884 -126116 -55111 -184115
13419 -184115 -186112 -121829 -181168 -186054 -100172 -59108 38630 53045 22512 59730 86135 114522
13407 114522 123828 83874 36113 -62879 -124482 -48799 6218 -52673 -147063 -192102 -67749
$$ packed form
13490g2066j66685j7005R7029J31436P3680O62L4923m7271o9956l5195o4874L6724
13478i8598P7442K3418m322l5337o8265m9941j462K6624l471J05861L7817Q3374
13466I3140n9495K3515j8257l3011k3593J2887k4259N2978r1791q3319l4487P5755
13454a09937L9933K2578K1004N6774M2902k824K3149p5321k4568n8679L7481R0624
13442F3116Q167l4526l4666L0799M3116L1694l3559N969r2678p5404l4011L0600
13430i1383k2788K6837k5258n9875K5221L5684Q7741p8063k4232P1005j29004
13419a84115j997O4283n9339m886Q5882M1064R7738J4415l0533L7218K6405K8387
13407A14522R306l9954m7761r8992o1603P5683N5017n8891r4390m5039J24353
$$ plain form
13396 -67749 -22229 -9019 -4623 -19372 -87358 -106010 526 51225 68490 82360 12989 -34857
13384 -34857 -45440 -34565 28376 37579 -45252 20663 58254 55529 8576 42837 21955 42083
13372 42083 21705 -53180 -42688 15451 84631 89310 81595 114516 62269 27059 -50093 -40572
13360 -40572 47625 132545 55255 -45907 -93173 -88668 -70824 -1455 69958 132109 176646 193402
13348 193402 158013 70545 23523 -58012 -48689 -54702 -67285 -30232 -48077 -80009 -93684 -75944
13336 -75944 -29523 -35048 -42619 -30665 -116678 -247203 -211019 -116848 -65225 26588 109927 68818
13324 68818 138226 212373 181421 126235 144341 139719 208485 227919 252079 189853 195996 254241
13312 254241 389511 628927 811836 1028768 1403204 2061920 2605749 2803663 2639282 2164337
$$ packed form
13396f7749M5520J3210M396j4749o7986j8652J06536N0699J7265J3870o9371m7846
13384c4857j0583J0875O2941R203q2831O5915L7591k725m6953L4261k0882K0128
13372D2083k0378p4885J0492N8139O9180M679p715L2921n2247l5210p7152R521
13360d0572Q8197Q4920p7290j01162m7266M505J7844O9369P1413O2151M4537J6756
13348A93402l5389q7468m7022q1535R323o013j2583L7053j7845l1932j3675J7740
13336g5944M6421n525p571J1954q6013j30525L6184R4171N1623R1813Q3339m1109
13324F8818O9408P4147l0952n5186J8106m622O8766J9434K4160o2226O143N8245
13312B54241J35270K39416J82909K16932L74436O58716N43829J97914j64381m74945
$$ plain form
13302 2164337 1687725 1176945 809474 550472 362278 262831 255856 337746 249417 173096
13292 173096 205031 169193 131728 184089 262677 198848 171109 166552 89604 49222 16790 -23085
13280 -23085 27644 28970 -12381 -37525 -47222 -86369 -87243 7064 17078 -20906 27003 -7939
13268 -7939 -23744 -37801 -50223 -46128 -16362 27854 72115 59981 11895 -21050 -10179 -26798
13256 -26798 -112387 -145318 -103710 -93773 -44858 -33379 24912 3598 38566 36788 43238 49103
13244 49103 -76638 -48410 35241 25527 21429 -25199 -103160 -49947 15149 -30865 -41756 -73740
13232 -73740 -62623 -7564 23498 -33651 -10095 15009 -35755 17208 94639 122553 37074 -59555
13220 -59555 -133737 -180385 -143265 -52108 -40802 -18403 86254 19201 63393 89564 21354
$$ packed form
13302B164337m76612n10780l67471k59002j88194r9447o975Q1890q8329p6321
13292A73096L1935l5838l7465N2361P8588o3829k7739m557p6948m0382l2432l9875
13280b3085N0729J326m1351k5144r697l9147q74R4307J0014l7984M7909l4942
13268g939j5805j4057j2422M095K9766M4216M4261j2134m8086l2945J0871j6619
13256b6798q5589l2931M1608R937M8915J1479N8291k1314L4968j778O450N865
13244D9103j25741K8228Q3651r714m098m6628p7961N3213O5096m6014j0891l1984
13232g3740J1117N5059L1062n7149K3556K5104n0764N2963P7431K7914q5479r6629
13220e9555p4182m6648L7120R1157J1306K2399J04657o7053M4192K6171o8210
$$ plain form
13209 21354 -38161 -48347 -5568 18199 -24111 -3600 32705 -96659 -139290 -131045 -119345 -164163
13197 -164163 -238121 -143400 -71171 -40203 -105938 -177310 -103302 -200565 -237113 -203978 -142792
13186 -142792 -101534 -6937 49028 148615 168672 105045 135756 151526 159538 122918 102765 82378
13174 82378 107242 65132 87588 67095 77151 183035 250726 290278 346973 346622 272797 247136
13162 247136 190273 128298 139320 183216 133976 78253 25353 21100 25551 -16233 -72402 -55008
13150 -55008 -83477 -99134 -125409 -61505 42268 -26370 -31953 24400 41553 69134 158503 167360
13138 167360 164305 224981 196148 201889 175482 194444 201607 208565 173559 135399 138347 150623
13126 150623 139345 151123 107146 38961 29006 87050 157958 179340 145705 88605 140737 127719
$$ packed form
13209B1354n9515j0186M2779K3767m2310K0511L6305j29364m2631Q245J1700m4818
13197a64163p3958R4721P2229L0968o5735p1372P4008r7263l6548L3135O1186
13186a42792M1258R4597N5965R9587K0057o3627L0711J5770Q012l6620k0153k0387
13174H2378K4864m2110K2456k0493J0056J05884O7691L9552N6695l51p3825k5661
13162B47136n6863o1975J1022M3896m9240n5723n2900m253M451m1784n6169J7394
13150e5008k8469j5657k6275O3904J03773o8638n583N6353J7153K7581Q9369Q857
13138A67360l055O0676k8833N741k6407J8962P163O958l5006l8160K948J2276
13126A50623j1278J1778m3977o8185r955N8044P0908K1382l3635n7100N2132j3018
$$ plain form
13114 127719 66943 125251 182905 71328 -32312 -16122 -45247 7227 -42962 -60891 51179
13103 51179 -4088 29429 17600 -85983 -14208 62707 75084 61289 185470 239486 202282
13092 202282 210159 36049 2726 31935 -88126 -68638 -45884 49725 189493 272502 334953
13081 334953 385364 428006 385057 287060 278985 287599 237827 173353 106644 127890 182859 254718
13069 254718 399187 529981 688241 912380 1080502 1188638 1046008 913905 673171 350223
13059 350223 167450 137307 139553 208138 248667 279483 368640 334916 322338 326191 294653 257653
13047 257653 142404 46407 19634 187688 244002 196742 190629 301885 359310 368974 448389
13036 448389 504679 474352 472187 409914 371912 252062 111193 -101539 -324623 -556354 -725231
$$ packed form
13114A27719o0776N8308N7654j11577j03640J6190k9125N2474n0189j7929J12070
13103E1179n5267L3517j1829j03583P1775P6915J2377j3795J24181N4016l7204
13092B02282P877j74110l3323K9209j20061J9488K2754R5609J39768Q3009O2451
13081C34953N0411M2642m2949r7997q075Q614m9772o4474o6709K1246N4969P1859
13069B54718J44469J30794J58260K24139J68122J08136j42630j32103k40734l22948
13059C50223j82773l0143K246O8585M0529L0816Q9157l3724j2578L853l1538l7000
13047B57653j15249r5997k6773J68054N6314m7260o113J11256N7425R664P9415
13036D48389N6290l0327k165o2273l8002j19850j40869k12732k23084k31731j68877
$$ plain form
13025 -725231 -658096 -473358 -348229 -271649 -365159 -424648 -447943 -401675 -295560 -139442 -62807
13014 -62807 -144221 -211743 -240106 -200538 31863 280549 520249 654560 742141 822016 808012
13003 808012 835585 788222 703135 595822 536937 467793 432841 421991 377646 290526 181631
12992 181631 225626 262737 223693 196385 208361 192597 222780 279442 408560 441041 375482
12981 375482 483149 554574 536108 498631 470107 516882 476465 442775 446129 436473 533063 626830
12969 626830 537598 562700 584819 571670 441726 354091 290020 300447 417554 506466 451378
12958 451378 460712 548633 609465 597793 564034 692403 825554 852890 1018019 1173908 1185074
12947 1185074 1329266 1632724 2034061 2748950 3730541 4196914 3801574 3370724 3271369 3654861
$$ packed form
13025g25231O7135J84738J25129P6580r3510n9489k3295M6268J06115J56118P6635
13014f2807q1414o7522k8363L9568K32401K48686K39700J34311Q7581P9875j4004
13003H08012K7573m7363q5087j07313n8885o9144l4952j0850m4345q7120j08895
12992A81631M3995L7111l9044k7308J1976j5764L0183N6662J29118L2481o5559
12981C75482J07667P1425j8466l7477k8524M6775m0417l3690L354r656R6590R3767
12969F26830q9232K5102K2119j3149j29944q7635o4071J0427J17107Q8912n5088
12958D51378R334Q7921O0832j1672l3759J28369J33151K7336J65129J55889J1166
12947A185074J44192L03458M01337P14889R81591M66373l95340m30850r9355L83492
$$ plain form
12937 3654861 4184227 3857142 2930965 2192089 1821163 1572162 1398410 1232587 1030991
12928 1030991 1030381 1045790 1049735 1186919 1357502 1434472 1536757 1531651 1504849 1595168 1647517
12917 1647517 1726364 1875564 1997083 2024090 2048790 2125161 2247350 2419426 2616464 2815444
12907 2815444 2955518 3079358 3257773 3560634 3855898 4270325 4747200 5451724 6285210
12898 6285210 7068507 7752756 8481237 9207801 10046831 11103995 12571237 14720368 17169812
12889 17169812 19616746 22030131 24009280 25892465 28442407 32269864 38364303 47281083
12881 47281083 59473599 76398801 100489502 136125356 190445453 273053296 383100329
12874 383100329 479693946 519390689 501983862 422353291 309428913 212776284 147538797
$$ packed form
12937C654861N29366l27085r26177p38876l70926k49001j73752j65823k01596
12928A030991o10J5409L945J37184J70583P6970J02285n106k6802R0319N2349
12917A647517P8847J49200J21519K7007K4700P6371J22189J72076J97038J98980
12907B815444J40074J23840J78415L02861K95264M14427M76875P04524Q33486
12898F285210P83297O84249P28481P26564Q39030J057164J467242K149131K449444
12889A7169812K446934K413385J979149J883185K549942L827457O094439Q916780
12881D7281083J2192516J6925202K4090701L5635854N4320097Q2607843J10047033
12874C83100329R6593617L9696743j7406827p9630571j12924378r6652629o5237487
$$ plain form
12867 147538797 106676699 80834992 63751631 51838207 42814266 35538888 29623648
12860 29623648 24986526 21336767 18750299 16920417 15401353 14018059 12516816 10732041
12852 10732041 9049610 7716071 6761332 6068092 5467730 5130707 5083375 5077594 4987336 4877030
12842 4877030 4644094 4360792 4126729 3827894 3536568 3388010 3356078 3203662 3001233 2808747
12832 2808747 2668287 2580293 2502984 2365372 2222884 2059493 1866724 1713195 1580793 1500189
12822 1500189 1547724 1653170 1715343 1678539 1599881 1451596 1321992 1254041 1151980 1083796
12812 1083796 1174506 1219372 1191006 1185799 1208277 1249768 1154162 1120024 1065879 1020624 1017590 1047127
12800 1047127 1039423 1050029 1009004 911471 781324 764103 802421 902088 878641 824825 838159
$$ packed form
12867A47538797m0862098k5841707j7083361j1913424r023941p275378n915240
12860B9623648m637122l649759k586468j829882j519064j383294j501243j784775
12852A0732041j682431j333539r54739o93240o00362l37023m7332n781r0258j10306
12842D877030k32936k83302k34063k98835k91326j48558l1932j52416k02429j92486
12832B808747j40460q7994p7309j37612j42488j63391j92769j53529j32402q0604
12822A500189M7535J05446O2173l6804p8658j48285j29604o7951j02061o8184
12812A083796R0710M4866k8366n207K2478M1491r5606l4138n4145m5255l034K9537
12800A047127p704J0606m1025r7533j30147j7221L8318R9667k3447n3816J3334
$$ plain form
12789 838159 838812 803916 708820 706949 790971 810274 702112 620029 591947 473309 411340 314973
12777 314973 204430 186161 104143 103740 66749 81094 58070 22066 131760 152117 100689
12766 100689 4016 -6450 -7334 -8316 45126 170123 213709 256922 251569 218013 234070 265847
12754 265847 272569 284868 323934 341318 314682 237037 109166 42369 66569 36702 52541
12743 52541 119685 136037 77457 -45675 28236 230290 481304 581409 676389 714929 676825
12732 676825 557845 506384 419501 512892 630195 643787 687733 650216 649701 751631 931252
12721 931252 1034989 1067067 975734 721792 428742 118362 -61543 -216451 -303261 -294719
12711 -294719 -161712 -71105 -23265 70583 155475 150188 119352 97135 200186 156905 112585
$$ packed form
12789H38159O53l4896r5096j871Q4022J9303j08162q2083k8082j18638o1969r6367
12777C14973j10543j8269q2018m03l6991J4345k3024l6004J09694K0357n1428
12766A00689r6673j0466q84r82N3442J24997M3586M3213n353l3556J6057L1777
12754B65847O722J2299L9066J7384k6636p7645j27871o6797K4200k9867J5839
12743E2541O7144J6352n8580j23132P3911K02054K51014J00105R4980L8540l8104
12732F76825j18980n1461q6883R3391J17303J3592M3946l7517n15J01930J79621
12721I31252J03737L2078r1333k53942k93050l10380j79905j54908q6810Q542
12711b94719J33007R0607M7840R3848Q4892n287l0836k2217J03051m3281m4320
$$ plain form
12700 112585 47545 30712 -67639 -88475 -69916 -69344 -11154 75357 114709 119277 42682 6529
12688 6529 16998 26834 -62703 -285259 -556838 -760056 -888150 -812100 -669360 -440011 -293568
12677 -293568 -179880 -94796 -20618 -14480 -15637 49381 -18745 -14626 -31176 -55899 -22969 -44472
12665 -44472 -73598 -134047 -83205 39920 86444 113173 79744 75496 108133 109284 143863 64026
12653 64026 -7304 6753 6235 4916 68163 152187 166993 167649 254904 223573 159641 236945 313384
12640 313384 302072 332175 415836 451683 390399 397926 278857 204522 180248 93425 59613
12629 59613 21641 59528 78445 32907 47331 108331 201760 252433 181794 70314 56220
12618 56220 78209 88313 110039 71536 58065 70502 74929 54275 -6537 4779 89314 88262
$$ packed form
12700A12585o5040j6833r8351k0836J8559N72N8190Q6511L9352M568p6595l6153
12688F529J0469R836q9537k22556k71579k03218j28094P6050J42740K29349J46443
12677b93568J13688Q5084P4178O138j157O5018o8126M119j6550k4723L2930k1503
12665d4472k9126o0449N0842J23125M6524K6729l3429m248L2637J151L4579p9837
12653F4026p1330J4057n18j319O3247Q4024J4806O56Q7255l1331o3932P7304P6439
12640C13384j1312L0103Q3661L5847o1284P527j19069p4335k4274q6823l3812
12629E9613l7972L7887J8917m5538J4424O1000R3429N0673p0639j11480j4094
12618E6220K1989J0104K1726l8503j3471J2437M427k0654o0812J1316Q4535j052
$$ plain form
12606 88262 2828 -22463 -64939 -30900 55537 36866 17673 56268 96229 128131 125088 53925
12594 53925 -49115 -72532 -73581 -71822 -49221 -108174 -81415 -6481 43726 52938 48479 -50403
12582 -50403 -108986 -136965 -87184 -206817 -216613 -82497 15208 28100 -31270 -131651 -108350
12571 -108350 -149153 -172316 -89321 4238 39948 125222 104461 84982 53461 58803 119361 287647
12559 287647 339700 314224 326395 322076 315635 365240 384263 383631 301887 247206 252575 229355
12547 229355 262224 266132 285788 331182 289593 288320 388911 505963 621064 795129 890345
12536 890345 800944 656699 551180 372377 341430 296954 238524 157866 70538 103860 143994
12525 143994 82781 109451 126326 126716 46142 -18330 -51348 -104629 -170855 -156639 -126189 -131391
$$ packed form
12606H8262q5434k5291m2476L4039Q6437j8671j9193L8595L9961L1902l043p1163
12594E3925j03040k3417j049J759K2601n8953K6759P4934N0207R212m459r8882
12582e0403n8583k7979M9781j19633r796J34116R7705J2892n9370j00381K3301
12571a08350m0803k3163Q2995R3559L5710Q5274k0761j9479l1521N342O0558J68286
12559B87647N2053k5476J2171m319o441M9605J9023o32q1744n4681N369k3220
12547B29355L2869L908J9656M5394m1589j273J00591J17052J15101J74065R5216
12536H90345q9401j44245j05519j78803l0947m4476n8430q0658q7328L3322M0134
12525A43994o1213K6670J6875L90q0574o4472l3018n3281o6226J4216L0450n202
$$ plain form
12513 -131391 -106664 -96846 -22465 51994 158482 136406 8750 38577 77813 85810 65989
12502 65989 28658 94900 122710 128911 129170 127650 77927 134161 237859 433828 525190 406030
12490 406030 292934 133861 5144 -23481 85596 118295 79164 59037 83236 14447 -34217
12479 -34217 -30830 24494 53187 80268 87010 48979 110075 224732 199097 77820 88421 157345
12467 157345 81129 76398 157888 274505 283828 251254 185782 101476 91616 96243 71859 39405
12455 39405 105978 108252 191896 211084 202298 201518 212139 281699 330865 309528 363247 404507
12443 404507 417055 470605 574350 770341 1002455 1336480 1854434 2363158 2706684 2778317
12433 2778317 2402061 1750151 1196611 885302 690853 479704 414190 428809 404681 363823
$$ packed form
12513a31391K4727R818P4381P4459J06488k2076j27656K9827L9236P997j9821
12502F5989l7331O6242K7810O201K59j520m9723N6234J03698J95969R1362j19160
12490D06030j13096j59073j28717k8625J09077L2699l9131k0127K4199o8789m8664
12479c4217L387N5324K8693K7081O742l8031O1096J14657k5635j21277J0601O8924
12467A57345p6216m731Q1490J16617R323l2574o5472q4306r860M627k4384l2454
12455C9405O6573K274Q3644J9188q786p80J0621O9560M9166k1337N3719M1260
12443D04507J2548N3550J03745J95991K32114L34025N17954N08724L43526P1633
12433B778317l76256o51910n53540l11309j94449k11149o5514J4619k4128m0858
$$ plain form
12423 363823 244194 222170 328033 350775 171935 73459 131584 126176 96806 163647 86688
12412 86688 7792 73111 89270 151456 250481 276822 269230 183722 93660 5325 -184581 -204393
12400 -204393 -117240 17439 96083 85632 36288 -41626 -14867 114464 75578 -9713 -64361
12389 -64361 12884 94410 98422 114442 25817 59431 176120 199268 85158 -71832 -36244
12378 -36244 -80844 -131785 -107401 -27135 3211 -30155 -46406 4486 72547 24527 -135819
12367 -135819 -145407 -62794 -70382 29955 59041 73680 146144 125416 75864 65574 47980 37390
12355 37390 42425 -6612 20417 10845 29242 72875 91185 140568 86999 74208 14090 -45097
12343 -45097 -29232 4663 -58674 -62787 -55199 -88629 -40461 36309 -19738 38507 51928 40934
$$ packed form
12423C63823j19629k2024J05863K2742j78840r8476N8125n408k9370O6841p6959
12412H6688p8896O5319J6159O2186R9025K6341p592q5508r0062q8335j89906j9812
12400b04393Q7153J34679P8644j0451m9344p7914K6759J29331l8886q5291n4648
12389f4361P7245Q1526M012J6020q8625L3614J16689K3148j14110j56990L5588
12378c6244m4600n0941K4384Q0266L0346l3366j6251N0892O8061m8020j60346
12367a35819r588Q2613p588J00337K9086J4639P2464k0728m9552j0290j7594j0590
12355C7390N035m9037K7029r572J8397M3633J8310M9383n3569j2791o0118n9187
12343d5097J5865L3895o3337m113P588l3430M8168P6770n6047N8245J3421j0994
$$ plain form
12331 40934 30798 38678 11539 -21208 6582 47272 91529 9832 -73389 -75000 -66038 -55810
12319 -55810 -28642 79613 152674 213281 311722 328072 239443 74620 -88474 -58122 70070
12308 70070 112497 110818 7771 -46404 -9655 -16944 555 -41125 -37582 -77957 -36786 2147
12296 2147 11793 68721 27879 45055 11364 -58956 -11180 16002 67800 35871 12262 9727
12284 9727 11556 -8548 -95851 -156278 -88985 -32869 -63837 -33866 52133 85516 105606 167120
12272 167120 159092 138459 116958 118880 126807 121214 119014 139626 109370 51643 -22294 -27023 -28559
12259 -28559 -12562 14475 12651 -15825 51460 83488 93869 47510 80659 136433 144981 140154
12247 140154 96344 37106 48845 59350 48952 63268 112957 92301 83402 119520 97596 25801
$$ packed form
12331D0934j0136P880k7139l2747K7790M0690M4257q1697q3221j611Q962J0228
12319e5810K7168J08255P3061O0607R8441J6350q8629j64823j63094L0352J28192
12308G0070M2427j679j03047n4175L6749p289J7499m1680L543m0375M1171L8933
12296B147R646N6928m0842J7176l3691p0320M7776K7182N1798l1929k3609k535
12284I727J829k0104q7303o0427O7293N6116l0968K9971Q5999L3383K0090O1514
12272A67120q028k0633k1501J922P927n593k200K0612l0256n7727p3937m729j536
12259b8559J5997K7037j824k8476O7285L2028J0381m6359L3149N5774Q548m827
12247A40154m3810n9238J1739J0505j0398J4316M9689k0656q899L6118k1924p1795
$$ plain form
12235 25801 -29915 12802 21345 32695 28103 95039 69841 56052 21350 -16970 -1168 9179
12223 9179 12257 53952 104928 89674 39556 16084 -24698 -41233 -53045 -26062 21072 3512
12211 3512 20116 -25382 -26439 -27502 -33178 -17346 -57481 -49497 -14669 -12623 -32352 -46398 -22459
12198 -22459 -41688 -76875 -57648 -128117 -168411 -130035 -58309 -67316 -137607 -106671 -64118 16536
12186 16536 37924 -13889 -39023 -36233 -10944 -54848 -110931 -157308 -140224 -135966 -176813 -142220
12174 -142220 -63929 -55300 -30874 -31323 -56001 -85156 -123120 -95107 -113348 -88403 10455 99211
12162 99211 124765 60388 -9974 -39354 9570 78357 36762 -82708 -80613 -5891 20832 124463
12150 124463 114025 1802 24862 11466 -26280 -30233 -10449 63809 74722 84651 26523 -61285
$$ packed form
12235B5801n5716M2717Q543J1350m592O6936k5198j3789l4702l8320J5802J0347
12223I179L078M1695N0976j5254n0118k3472m0782j6535j1812K6983M7134j7560
12211C512J6604m5498j057j063n676J5832m0135P984L4828K046j9729j4046K3939
12198b2459j9229l5187J9227p0469m0294L8376P1726r007p0291L0936M2553Q0654
12186A6536K1388n1813k5134K790K5289m3904n6083m6377J7084M258m0847L4593
12174a42220P8291Q629K4426m49k4678k9155l7964K8013j8241K4945R8858Q8756
12162I9211K5554o4377p0362k9380M8924O8787m1595j19470K095P4722K6723J03631
12150A24463j0438j12223K3060j3396l7746l953J9784P4258J0913R929n8128q7808
$$ plain form
12138 -61285 -72238 -130432 -183682 -199231 -171224 -131777 -71501 -40334 13027 55376 149834 90454
12126 90454 35908 37521 -60001 -75144 -49338 18964 6985 -14220 -9924 13791 15219 43335
12114 43335 119410 192247 131590 104111 43957 -15074 -90302 -85085 -24190 30617 7230 -82589
12102 -82589 4069 46082 67533 -47071 -34947 66097 125841 66551 -4786 -83529 -94310
12091 -94310 -41589 -6327 -57383 -29084 -12811 47141 17322 1842 -24681 20779 95722 38386
12079 38386 15943 -5040 -8299 -28625 -88513 -116665 -65892 -39676 -136571 -216057 -101737 -138263
12067 -138263 -173899 -96829 -77446 -117654 -96675 70884 151038 116933 9518 -16004 72738
12056 72738 57631 16756 40172 49599 54563 55409 139659 189536 79190 18671 29399 -44455
$$ packed form
12138f1285j0953n8194n3250j5549K8007L9447O0276L1167N3361M2349R4458n9380
12126I0454n4546J613r7522j5143K5806O8302j1979k1205M296K3715J428K8116
12114D3335P6075P2837o0657k7479o0154n9031p5228N217O0895N4807k3387q9819
12102h2589Q6658M2013K1451j14604J2124J01044N9744n9290p1337p8743j0781
12091i4310N2721L5262n1056K8299J6273N9952k9819j5480k6523M5460P4943n7336
12079C8386k2443k0983l259k0326n9888k8152N0773K6216r6895p9486J14320l6526
12067a38263l5636P7070J9383m0208K0979J67559Q0154l4105j07415k5522Q8742
12056G2738j5107m0875K3416R427M964Q46Q4250M9877j10346o0519J0728p3854
$$ plain form
12044 -44455 920 29486 10645 75611 60007 9037 -56560 -2091 -350 -43469 72067 213237
12032 213237 228398 84016 -40212 -37215 63474 139698 19148 -39404 -34186 8860 -25000
12021 -25000 5170 -2407 30598 21739 -26484 -44963 -74376 -63216 -72422 -145484 -189696 -150539
12009 -150539 -117818 -134499 -276439 -180913 -175534 -193149 -178456 -97113 -91737 -88027 -30182 59618
11997 59618 3072 -67406 -164073 -157518 -142749 -81320 -12033 14298 -14066 -76506 -30163 20443
11985 20443 2002 -3983 84441 199031 178545 121420 83639 64110 17162 30505 98989 136038
11973 136038 14184 -1201 7527 53327 67521 110392 -10904 -51611 -46199 46579 77783
11962 77783 50860 12669 -12882 44926 -2161 -1304 -64481 -93780 -9716 113321 130323 27652
$$ packed form
12044d4455M5375K8566j8841O4966j5604n0970o5597N4469J741m3119J15536J41170
12032B13237J5161j44382j24228K997J00689P6224j20550n8552N218M3046l3860
12021b5000L0170p577L3005q859m8223j8479k9413J1160r206p3062m4212L9157
12009a50539L2721j6681j41940R5526N379j7615J4693Q1343N376L710N7845Q9800
11997E9618n6546p0478r6667O555J4769O1429O9287K6331k8364o2440M6343N0606
11985B0443j8441n985Q8424J14590k0486n7125l7781j9529m6948J3343O8484L7049
11973A36038j21854j5385Q728M5800J4194M2871j21296m0707N412R2778L1204
11962G7783k6923l8191k5551N7808m7087Q57o3177k9299Q4064J23037J7002j02671
$$ plain form
11950 27652 -20139 -19872 68469 132695 93413 65734 15493 -42298 -5113 18082 12497 -46357
11938 -46357 -63631 -100395 -203771 -162775 -111680 -31134 -7878 -19376 -25336 -72108 11566 109464
11926 109464 120383 75620 63088 23925 -73471 -246653 -284465 -229295 -209787 -119008 -73529
11915 -73529 -36142 46422 15668 15779 7699 1592 -11511 -61020 -31338 58202 39603 -28044
11903 -28044 -84028 -119790 -23670 -27653 -35896 -30803 -4460 -31717 59501 115336 19813 -89158
11891 -89158 -56382 12697 -14481 -50125 -74725 -37518 -98473 -49418 -57888 24922 82601 5883
11879 5883 -77427 -123816 -92868 -125712 -150372 -91616 -29101 38977 816 -68052 -129614 -107544
11867 -107544 -67992 -5061 31096 31269 30815 -11460 -13499 -6042 -3817 -67326 -65910 -68199 -58110
$$ packed form
11950B7652m7791K67Q8341O4226l9282k7679n0241n7791L7185K3195n585n8854
11938d6357j7274l6764j03376M0996N1095Q0546K3256j1498n960m6772Q3674R7898
11926A09464J0919m4763j2532l9163r7396j73182l7812N5170J9508R0779M5479
11915g3529L7387Q2564l0754J11q080o107j3103m9509K9682Q9540j8599o7647
11903b8044n5984l5762R6120l983q243N093K6343k7257R1218N5835r5523j08971
11891h9158L2776O9079k7178l5644k4600L7207o0955M9055q470Q2810N7679p6718
11879E883q3310m6389L0948l2844k4660N8756O2515O8078l8161o8868o1562K2070
11867a07544L9552O2931L6157J73m54m2275k039P457K225o3509J416k289J0089
$$ plain form
11854 -58110 -30980 -53692 21587 66758 113471 77076 35345 76957 70581 -86407 -116078 -93598
11842 -93598 -58899 -111897 -184496 -188541 -185114 -154503 -145171 -86195 -5993 -29516 -97802 -166827
11830 -166827 -165549 -167858 -228677 -142661 -27015 -841 -12962 29508 47538 46762 31138 -25183
11818 -25183 47808 -1722 -6356 36799 -9035 69157 87518 71605 9868 65755 118268 129321
11806 129321 114575 49594 41339 72523 88169 28757 3330 16934 -57863 -159014 -273401
11795 -273401 -230839 -149540 -86125 31285 54606 76386 51136 -117991 -105674 -98950 -70401
11784 -70401 -65075 -51721 -12492 12565 -27657 -94571 -64660 -113900 -102047 -56308 -8165 4458
11772 4458 -6098 25494 51765 37737 20098 -4341 -96958 -98310 4929 -49463 -91060 -78098
$$ packed form
11854e8110K7130k2712P5279M5171M6713l6395m1731M1612o376j56988k9671K2480
11842i3598L4699n2998p2599m045L427L0611R332N8976Q0202k3523o8286o9025
11830a66827J278k309o0819Q6016J15646K6174j2121M2470J8030p76j5624n6321
11818b5183P2991m9530m634M3155m5834P8192J8361j5913o1737N5887N2513J1053
11806A29321j4746o4981q255L1184J5646n9412k5427J3604p4797j01151j14387
11795b73401M2562Q1299O3415J17410K3321K1780k5250j69127J2317O724K8549
11784g0401N326J3354L9229K5057m0222o6914K9911m9240J1853M5739M8143J2623
11772D458j0556L1592K6271j4028j7639k4439r2617j352J03239n4392m1597J2962
$$ plain form
11760 -78098 -50394 -41140 -75622 -106041 6359 102549 28733 -15099 1185 58660 73872 -34796
11748 -34796 -159265 -98327 8007 9868 -9238 21609 127874 155283 114747 129551 102670
11737 102670 139943 124495 94288 43778 117597 106614 -57092 -118076 -83497 -46655 -53374
11726 -53374 -68342 -99525 -55665 16309 -8187 -57340 -111088 26144 167830 218464 231766
11715 231766 168096 125244 95552 82363 71641 103634 148181 123420 79655 81957 83741 98842
11703 98842 553 -132078 -125720 -77964 15690 58747 68743 65252 -15143 -53122 32700 97909
11691 97909 62590 8084 -28909 -27967 -16297 -124686 -78591 -31388 -36614 -95943 -111918 -222
11679 -222 -26159 -42131 -78845 -120518 -108837 -37064 -55648 -109470 -152138 -166622 -64480 1364
$$ packed form
11760g8098K7704R254l4482l0419J12400R6190p3816m3832J6284N7475J5212j08668
11748c4796j24469O0938J06334J861j9106L0847J06265K7409m0536J4804k6881
11737A02670L7273j5448l0207n0510P3819j0983j63706o0984L4579L6842o719
11726e3374j4968l1183M3860P1974k4496m9153n3748J37232J41686N0634J3302
11715B31766o3670m2852k9692j3189j0722L1993M4547k4761m3765K302J784J5101
11703I8842r8289j32631O358M7756R3654M3057R996l491q0395l7979Q5822O5209
11691I7909l5319n4506l6993R42J1670j08389M6095M7203n226n9329j5975J11696
11679b22k5937j5972l6714m1673J1681P1773j8584n3822m2668j4484J02142O5844
$$ plain form
11667 1364 -35541 -49869 62605 90721 -14364 -31025 -58075 -118118 -53375 -16704 -104191
11656 -104191 -142139 -148166 -168207 -105842 58043 86757 70892 79833 56539 132636 99467 -55013
11644 -55013 -85644 10376 39129 30683 68091 86870 41013 -47653 -95344 -41159 -46629 -52550
11632 -52550 -91773 -107104 -57965 31711 -25552 -97300 -185030 -202092 -147809 -101269 -152707 -141628
11620 -141628 -135066 -116442 -88484 -69160 -86027 -67805 -10857 -12234 -26281 -104456 -125309 -38098
11608 -38098 -31994 -116679 -222381 -231125 -188657 -114744 -43136 -35669 -25045 -37550 18001 28264
11596 28264 -48776 -56163 -9881 37191 13670 51977 126613 71534 88044 105635 86454 94431
11584 94431 89772 87299 51256 2420 61838 67308 55377 68086 24794 48083 59023 -31727
$$ packed form
11667A364l6905j4328J12474K8116j05085j6661k7050o0043O4743L6671q7487
11656a04191l7948o027k0041O2365J63885K8714j5865Q941k3294P6097l3169j54480
11644e5013l0631R6020K8753q446L7408J8779m5857q8666m7691N4185n470n921
11632e2550l9223j5331M9139Q9676n7263p1748q7730j7062N4283M6540n1438J1079
11620a41628O562J8624K7958J9324j6867J8222N6948j377j4047p8175k0853Q7211
11608c8098O104q4685j05702q744M2468P3913P1608P467J0624j2505N5551J0263
11596B8264p7040p387M6282M7072k3521L8307P4636n5079J6510J7591j9181P977
11584I4431m659k473l6043m8836N9418N470j1931J2709m3292K3289J0940r0750
$$ plain form
11572 -31727 -120638 -162188 -88881 -72502 -91210 -144335 -179838 -114391 -20225 -74422 -107236 -91267
11560 -91267 -91182 -112570 -94505 -34839 -19402 -99466 -104460 -54776 -134747 -94874 -52751 -6111
11548 -6111 -31607 -103973 -134567 -133634 -112447 -54854 -371 16430 -76957 -125402 -174544 -94466
11536 -94466 -80374 -109282 -215058 -184026 -122626 -88217 -59780 -99100 -166928 -146482 -102309
11525 -102309 -60206 -39412 -34114 -65283 -27860 4111 61751 12422 67035 56176 -5829 -62513
11513 -62513 -97557 -142991 -107763 -93712 -67447 -33952 -15317 -39241 -51813 -23356 2561 63870
11501 63870 109300 105221 49685 124918 144608 31694 11173 -39538 -42055 -59026 -133431 -199415
11489 -199415 -260710 -235884 -192259 -86297 -8977 74990 39186 22077 25240 60643 61144 17678
$$ packed form
11572c1727q8911m1550P3307J6379j8708n3125l5503O5447R4166n4197l2814J5969
11560i1267Q5k1388J8065N9666J5437q0064m994M9684p9971L9873M2123M6640
11548f111k5496p2366l0594R33K1187N7593N4483J6801r3387m8445m9142Q0078
11536i4466J4092k8908j05776L1032O1400L4409K8437l9320o7828K0446M4173
11525a02309M2103K0794N298l1169L7423L1971N7640m9329N4613j0859o2005n6684
11513f2513l5044m5434L5228J4051K6265L3495J8635k3924j2572K8457K5917O1309
11501F3870M5430m079n5536P5233J9690j12914k0521n0711k517j6971p4405o5984
11489a99415o1295K4826M3625J05962P7320Q3967l5804j7109L163L5403N01m3466
$$ plain form
11477 17678 10120 30919 -16987 -59251 -8781 -8390 -23503 17074 83927 99974 22581 11809
11465 11809 -32807 -104465 -97093 -54319 -80772 -49437 -57547 -96457 -80318 -56302 -52861 7279
11453 7279 16275 -48015 -28486 52952 57697 717 40899 132540 95429 20284 -31029 -27856
11441 -27856 -40819 -69937 -28175 -27291 -40405 -74271 31256 61387 -21743 -2277 -26063 -67509
11429 -67509 -60263 -93861 -107462 -96404 -103434 -28694 89358 92355 45253 9440 34896 7463
11417 7463 -40787 -77980 -45706 -69453 -103515 -124341 -141718 -159616 -59858 -20877 -21841 -6650
11405 -6650 55733 99588 20762 58209 80129 19099 -14316 -28996 -38143 -52433 -10203 -24354
11393 -24354 -85017 -61261 25155 66742 28655 70 -29840 -36494 -35064 -20536 58205 53340
$$ packed form
11477A7678p558K0799m7906m2264N0470L91j5113M0577O6853J6047p7393j0772
11465A1809m4616p1658P372M2774k6453L1335q110l8910J6139K4016L441O0140
11453G279Q996o4290J9529Q1438M745n6980M0182R1641l7111p5145n1313L173
11441b7856j2963k9118M1762Q84j3114l3866J05527L0131q3130J9466k3786m1446
11429f7509P246l3598j3601J1058p030P4740J18052K997m7102l5813K5456k7433
11417G463m8250l7193L2274k3747l4062k0826j7377j7898R9758L8981r64J5191
11405f650O2383M3855p8826L7447K1920o1030l3415j4680r147j4290M2230j4151
11393b4354o0663K3756Q6416M1587l8087k8585k9910o654J430J4528P8741m865
$$ plain form
11381 53340 23198 20104 81727 47440 16083 3295 -20034 -53824 -33666 -59769 -87980 -45613
11369 -45613 -53174 -82992 -19460 -8536 11214 2144 24938 102032 153449 129239 67608 -56256
11357 -56256 -69234 -20987 23351 21118 69036 170116 183138 222857 239999 109073 -7174
11346 -7174 -60134 -64456 16743 13731 29932 70764 -5333 -102497 -167965 -85273 -61630 -88970
11334 -88970 -110889 -72030 -132766 -120165 -168553 -158728 -36322 45238 49148 -16920 -14026 41868
11322 41868 57260 49218 64790 -42748 -168073 -106902 -95009 -67089 -8870 -27464 29019
11311 29019 45189 55553 41156 -12803 15965 -962 54174 68446 116696 98741 88996 71329
11299 71329 103724 68256 45236 -19650 -35231 -52644 -54511 -89636 -114305 -85937 -21242 67255
$$ packed form
11381E3340l0142l094O1623l4287l1357j2788k3329l3790K0158k6103k8211M2367
11369d5613p561k9818O3532J0924J9750r070K2794P7094N1417k4210o1631j23864
11357e6256j2978M8247M4338k233M7918J01080J3022L9719J7142j30926j16247
11346g174n2960m322Q1199l012J6201M0832p6097r7164o5468Q2692K3643k7340
11334h8970k1919L8859o0736J2601m8388R825J22406Q1560L910o6068K894N5894
11322D1868J5392q042J5572j07538j25325O1171J1893K7920N8219j8594N6483
11311B9019J6170J0364j4397n3959K8768j6927N5136J4272M8250j7955r745j7667
11299G1329L2395l5468k3020o4886j5581j7413j867l5125k4669K8368O4695Q8497
$$ plain form
11287 67255 129334 78371 39174 -24186 -42791 -91802 -57808 17040 80945 68606 89706 142440
11275 142440 342764 526495 729323 713861 625671 671329 617736 456838 338520 273134
11265 273134 244559 245416 111635 62322 78258 30266 -40492 64926 106696 90690 56264
11254 56264 1330 53653 65929 64339 9364 26714 -17737 -53892 -128403 -72224 63521 81589
11242 81589 123081 102067 -21542 -16779 65520 151992 173404 125832 94513 67110 30315 15562
11230 15562 -5882 -58081 -108289 -81877 -19463 -37203 -85589 -78836 -56353 -40620 -40532 -36867 -72974
11217 -72974 -112173 -98925 -111528 -3731 -11698 22083 -23399 -50082 -57741 28644 24153 -57179
11205 -57179 -21404 -18895 -74947 -159855 -89701 -95213 2957 17506 -49777 -25110 108212 185148
$$ packed form
11287F7255O2079n0963l9197o3360j8605m9011L3994P4848O3905j2339K1100N2734
11275A42440K00324J83731K02828j5462q8190M5658n3593j60898j18318o5386
11265B73134k8575Q57j33781m9313J5936m7992p0758J05418M1770j6006l4426
11254E6264n4934N2323J2276j590n4975J7350m4451l6155p4511N6179J35745J8068
11242H1589M1492k1014j23609M763Q2299Q6472K1412m7572l1319k7403l6795j4753
11230A5562k1444n2199n0208K6412O2414j7740m8386O753K2483J5733Q8L665l6107
11217g2974l9199J3248j2603J07797p967L3781m5482k6683p659Q6385m491q1332
11205e7179L5775K509n6052q4908P0154n512R8170J4549o7283K4667J33322P6936
$$ plain form
11193 185148 146265 86012 38556 -63498 -18266 52396 29983 16379 25962 2652 -12602
11182 -12602 24692 -42887 -62774 -24594 -99858 -57463 -87095 -92393 -48830 -56989 15928 60009
11170 60009 15952 2987 10731 202878 236741 79187 94 74987 133497 249120 363374
11159 363374 522744 686808 674095 612405 592555 631492 618359 467913 333217 203867
11149 203867 120510 168114 171728 191594 205315 139342 138719 133964 -50408 -196485 -105464 -46773
11137 -46773 -59865 -61977 18503 43805 45297 14389 -30759 40325 21637 39330 60000 -26922
11125 -26922 -146188 -86322 -857 35937 47251 18770 -7543 36421 -6841 -132414 -82001
11114 -82001 70903 201856 245001 157571 119298 71806 115516 67681 42625 2018 -103498
$$ packed form
11193A85148l8883o0253m7456j02054M5232P0662k2413j3604R583k3310j5254
11182a2602L7294o7579j9887L8180p5264M2395k9632n298M3563q159P2917M4081
11170F0009m4057j2965P744J92147L3863j57554p9093P4893N8510J15623J14254
11159C63374J59370J64064j2713o1690j9850L8937j3133j50446j34696j29350
11149B03867q3357M7604L614J9866J3721o5973o23m755j84372j46077R1021N8691
11137d6773j3092k112Q0480K5302J492l0908m5148P1084j8688J7693K0670q6922
11125b6922j19266N9866Q5465L6794J1314k8481k6313M3964m3262j25573N0413
11114h2001J52904J30953M3145q7430l8273m7492M3710m7835k5056m0607j05516
$$ plain form
11103 -103498 -130151 -42976 -69956 -162576 -126902 -74823 -76382 -26419 1733 76286 56558 70123
11091 70123 25351 32523 -5188 26722 2415 -95327 -50343 2472 -18654 -43581 -86514 -60464
11079 -60464 -42850 -143049 -252658 -257161 -169511 -164514 -139893 -8651 -8302 -21842 22468 3320
11067 3320 -53155 -10023 -25933 -52361 -87752 -8117 -8286 75706 118892 105617 9268 -106244
11055 -106244 -99061 -54590 -86894 -136067 -145433 -180768 -91071 -100509 -60014 -155892 -158940 -35587
11043 -35587 15088 41915 72510 24414 -3508 6904 27532 -4871 -68419 -29571 33265 102476
11031 102476 1053 -11025 -25962 -66765 -83791 -70085 27753 -31787 -85844 -76917 -56082
11020 -56082 -163662 -130602 -90395 -145256 -160095 -160474 -136201 -181427 -118709 -105991 -158523 -144840
$$ packed form
11103a03498k6653Q7175k6980r2620L5674N2079j559M9963K8152P4553j9728J3565
11091G0123m4772P172l7711L1910k4307r7742M4984N2815k1126k4927m2933K6050
11079f0464J7614j00199j09609m503Q7650M997K4621J31242L49j3540M4310j9148
11067C320n6475M3132j5910k6428l5391P9635j69Q3992M3186j3275r6349j15512
11055a06244P183M4471l2304m9173r366l5335Q9697r438M0495r5878l048J23353
11043c5587N0675K6827L0595m8096k7922J0412K0628l2403o3548L8848O2836O9211
11031A02476j01423j2078j4937m0803j7026J3706R7838n9540n4057Q927K0835
11020e6082j07580L3060M0207n4861j4839l79K4273m5226O2718J2718n2532J3683
$$ plain form
11008 -144840 -124594 -131405 -111795 -53353 -13922 -40469 -23127 5199 43270 116610 137258 136252
10996 136252 166718 133771 -6930 -57818 -44361 -63702 1159 40647 -52800 34345 99724
10985 99724 57213 4065 -39798 -40091 -71239 -98879 -31210 -1450 -5457 -80799 -170464 -79277
10973 -79277 16834 30776 32667 646 64202 84253 60553 48884 -14890 -47937 -32509 -99198
10961 -99198 -53434 15532 -45252 -37320 -53199 -34013 -80290 -15397 -24801 12648 -5137 6717
10949 6717 87363 84063 72594 70089 3221 14746 42577 12119 17192 70045 87296 55326
10937 55326 -12819 -19860 -17742 22403 -12191 -27955 -13578 -1205 -107443 -100088 -34610 8356
10925 8356 32771 -12989 -47077 -35716 -18636 33552 -1223 -40178 -88538 -85102 -88722 -49902
$$ packed form
11008a44840K0246o811J9610N8442L9431k6547J7342K8326L8071P3340K0648j006
10996A36252L0466l2947j40701n0888J3457j9341O4861L9488r3447Q7145O5379
10985I9724m2511n3148m3863k93l1148k7640O7669K9760m007p5342q9665R1187
10973g9277R6111J3942J891l2021O3556K0051k3700j1669o3774l3047J5428o6689
10961i9198M5764O8966o0784P932j5879J9186m6277O4893r404L7449j7785J1854
10949F717Q0646l300j1469k505o6868J1525K7831l0458N073N2853J7251l1970
10937E5326o8145p041K118M0145l4594j5764J4377J2373j06238P355O5478M2966
10925H356K4415m5760l4088J1361J7080N2188l4775l8955m8360L436l620L8820
$$ plain form
10913 -49902 -21492 -31644 -149370 -178359 -201804 -285392 -182361 -138877 -105050 -58556 -25572
10902 -25572 -47424 2993 12592 30525 55537 36812 -5893 -56592 -124192 -83973 -31134 51400
10890 51400 87636 32612 -62234 -52543 -12820 -8489 27094 -79193 -134703 -134818 -24928 26330
10878 26330 9337 27964 82098 95555 104403 130358 84210 2954 -27269 30992 21164 6619
10866 6619 20742 28010 -44504 -12739 33693 41109 60171 73727 36606 25835 -121726 -20767
10854 -20767 96638 125115 38809 51699 406 -69366 -94369 -96314 -121766 -112884 11793 22366
10842 22366 16716 -82837 -142232 -108129 -40876 -25368 48937 78911 104570 37132 -121623 -147847
10830 -147847 -141414 -109038 -4941 43750 92586 140088 149268 73327 47368 30587 35459 111876
$$ packed form
10913d9902K8410j0152j17726k8989k3445q3588J03031M3484L3827M6494L2984
10902b5572k1852N0417R599J7933K5012j8725m2705n0699o7600M0219N2839Q2534
10890E1400L6236n5024r4846R691L9723M331L5583j06287n5510j15J09890N1258
10878B6330j6993J8627N4134J3457Q848K5955m6148q1256l0223N8261r828j4545
10866F619J4123P268p2514L1765M6432P416J9062J3556l7121j0771j47561J00959
10854b0767J17405K8477q6306J2890n1293o9772k5003j945k5452Q882J24677J0573
10842B2366n650r9553n9395L4103O7253J5508P4305K9974K5659o7438j58755k6224
10830a47847O433L2376J04097M8691M8836M7502R180p5941k5959j6781M872P6417
$$ plain form
10818 111876 79527 104227 95070 -19220 -62386 -50032 -96959 -164600 -157843 -95263 -28035 -74443
10806 -74443 -112502 -80050 -30992 -37227 -17923 -6492 -27843 -22807 -24155 -1336 -51971 -93849
10794 -93849 -159844 -129180 -31930 1840 -20889 24917 119893 166633 51064 9903 -27015
10783 -27015 -93339 -145950 -36751 -2830 -5709 64839 92656 37164 -88967 -135127 -148961
10772 -148961 -113129 -26027 33729 -21651 -5160 76732 69381 62629 79596 33001 -77677 -36001
10760 -36001 -26221 69726 152599 148720 105532 117347 45840 24362 18220 -49931 -23015 29538
10748 29538 47378 -13895 -66508 -59820 -12526 125179 142696 97437 123671 194714 290046 444811
10736 444811 687386 1237446 1832897 1790929 1134970 665108 430921 289912 202598 182212
$$ packed form
10818A11876l2349K4700r157j14290m3166J2354m6927o7641O757O2580O7228m6408
10806g4443l8059L2452M9058o235J9304J1431k1351N036j348K2819n0635m1878
10794i3849o5995L0664R7250L3770k2729M5806R4976M6740j15569m1161l6918
10783b7015o6324n2611J09199L3921k879P0548K7817n5492j26131m6160j3834
10772a48961L5832Q7102N9756n5380J6491Q1892p351o752J6967m6595j10678M1676
10760c6001R780R5947Q2873l879m3188J1815p1507k1478o142o8151K6916N2553
10748B9538J7840o1273n2613O688M7294J37705J7517m5259K6234P1043R5332J54765
10736D44811K42575N50060N95451m1968o55959m69862k34187j41009q7314k0386
$$ plain form
10726 182212 144492 63811 15953 6143 -9871 96056 98064 120679 67445 41928 -39543 -93759
10714 -93759 -62961 -5154 19123 -35070 -87598 -203787 -184694 -117402 -85249 -1704 9008
10703 9008 -25896 -20959 -5303 -81976 -124553 -93643 9895 -42639 -87803 -55626 6415 5845
10691 5845 -30161 -109058 -60450 80144 135509 75681 40817 1142 44313 -6487 -90511 -114699
10679 -114699 -57602 -6784 -101 -98989 -40885 85299 46285 -58850 -92427 -72388 -42628
10668 -42628 -52458 -53892 -7699 95786 225599 240229 195821 148332 117433 85890 62440 33772
10656 33772 26934 -35836 -100453 -10130 20804 19208 74958 96563 125632 105757 18825 34840
10644 34840 -96605 -122256 -83635 10519 22861 65998 36006 -41344 -49209 -68854 -72395 -81484
$$ packed form
10726A82212l7720q0681m7858r810j6014J05927K008K2615n3234k5517q1471n4216
10714i3759L0798N7807K4277n4193n2528j16189J9093O7292L2153Q3545J0712
10703I008l4904M937J5656p6673m2577L0910J03538n2534m5164L2177O2041n70
10691E845l6006p8897M8608J40594N5365n9828l4864l9675M3171n0800q4024k4188
10679a14699N7097N0818O683r8888N8104J26184l9014j05135l3577K0039K9760
10668d2628r830j434M6193J03485J29813J4630m4408m7489l0899l1543k3450k8668
10656C3772o838o2770o4617R0323L0934j596N5750K1605K9069j9875q6932J6015
10644C4840j31445k5651L8621R4154J2342M3137k9992p7350p865j9645l541r089
$$ plain form
10632 -81484 -28350 2425 6754 5313 35017 -34746 -35874 -31467 -65342 -128169 -58188 6936
10620 6936 10070 -11572 -25898 -46535 -25434 -382 21238 69870 131430 159418 137415 73859
10608 73859 -20820 -15668 45462 88217 89837 28845 34097 80856 51308 25877 17619 -11280
10596 -11280 -66146 -69149 -60491 -79592 -57537 -28335 -40909 18487 14608 -58573 -18334 -58318
10584 -58318 -78629 -85792 -79440 22003 117541 67227 44036 64906 63779 18391 -6021 20260
10572 20260 64919 65027 15760 85145 56670 36762 -16858 9369 -7068 -20991 -30581 -31129 46043
10559 46043 49768 50253 6174 -68473 -111632 -12364 56284 87266 -22668 -147448 -96846 33252
10547 33252 53654 53800 112337 117847 43289 27019 36808 4059 2432 -23642 23878 50339 49326
$$ packed form
10632h1484N3134L0775M329j441K9704o9763j128M407l3875o2827O9981O5124
10620F936L134k1642j4326k0637K1101K5052K1620M8632O1560K7988k2003o3556
10608G3859r4679N152O1130M2755J620o0992N252M6759k9548k5431q258k8899
10596a1280n4866l003Q658j9101K2055K9202j2574N9396l879p3181M0239l9984
10584e8318k0311p163O352J01443R5538n0314k3191K0870j127m5388k4412K6281
10572B0260M4659J08m9267O9385k8475j9908n3620K6227j6437j3923r590n48P7172
10559D6043L725M85m4079p4647m3159R9268O8648L0982j09934j24780N0602J30098
10547C3252K0402J46N8537N510p4558j6270R789l2749j627k6074M7520K6461j013
$$ plain form
10534 49326 81994 93467 42136 52489 -9673 78731 190031 251368 199347 91020 77983
10523 77983 116258 46651 -40496 -43409 -56424 -29629 -66894 -124225 -159749 -202288 -280130 -242996
10511 -242996 -214763 -142570 -107261 -52922 -22373 36026 32194 -33742 -47952 -48526 -44307 -8566
10499 -8566 -12369 -19805 -40445 55594 55140 106064 180039 152190 122580 202262 84568 51892
10487 51892 106697 40575 -95402 -141872 -78916 -87381 -66015 14201 69885 17361 -41017 -41341
10475 -41341 -44810 10894 -124958 -72718 -71744 -132766 -63031 -11923 -20157 -20996 -50294 -48150 -77354
10462 -77354 -152250 -68325 57060 18190 874 19635 43701 -24059 -31728 -62822 -107326 -184837
10450 -184837 -181601 -133242 -177568 -118576 -46007 -2725 -5380 -1639 -48410 -57683 20370 53975
$$ packed form
10534D9326L2668J1473n1331J0353o2162Q8404J11300O1337n2021j08327j3037
10523G7983L8275o9607q7147k913j3015K6795l7265n7331l5524m2539p7842L7134
10511b42996K8233P2193L5309N4339L0549N8399l832o5936j4210n74M219L5741
10499h566l803p436k0640R6039m54N0924P3975k7849k9610P9682j17694l2676
10487E1892N4805o6122j35977m6470O2956q465K1366Q0216N5684n2524n8378l24
10475d1341l469N5704j35852N2240R74o1022O9735N1108q234q39k9298K144k9204
10462g7354p4896Q3925J25385l8870j7316J8761K4066o7760p669l1094m4504p7511
10450a84837L236M8359m4326N8992P2569M3282k655L741m6771r273P8053L3605
$$ plain form
10438 53975 134594 84538 1320 47170 96293 -13753 -32655 49359 98351 113438 -2946
10427 -2946 -10649 -53211 -81872 70453 143778 52053 12046 26149 22057 -23766 -61195 -47781
10415 -47781 -21341 17306 78101 57532 54506 64696 -35004 -52944 -66582 -27113 -66463 -63786
10403 -63786 -21679 11212 18471 56016 117756 201537 182408 30297 -43374 -21376 56669 6755
10391 6755 18509 106312 92931 79668 89998 115136 16031 -84842 -56702 44098 128675
10380 128675 40710 -13989 -35217 -19475 -25675 23416 40886 44117 -50992 -31641 -51285 -99651
10368 -99651 -95311 -42063 -21529 15312 112268 92949 36541 3659 21435 125605 123799 123806 77875
10355 77875 50251 35081 -60723 23730 12154 -49394 -83341 -154879 -157491 -84622 -110941 -127461
$$ packed form
10438E3975Q0619n0056q3218M5850M9123j10046j8902Q2014M8992J5087j16384
10427b946p703m2562k8661J52325P3325r1725m0007J4103m092m5823l7429J3414
10415d7781K6440L8647O0795k0569l026J0190r9700j7940j3638L9469l9350K677
10403f3786M2107L2891P259L7545O1740Q3781j9129j52111p3671K1998P8045m9914
10391F755J1754Q7803j3381j3263J0330K5138r9105j00873K8140J00800Q4577
10380A28675q7965n4699k1228J5742o200M9091J7470L231r5109J9351j9644m8366
10368i9651M340N3248K0534L6841R6956j9319n6408l2882J7776J04170j806Pm5931
10355G7875k7624j5170r5804Q4453j1576o1548l3947p1538k612P2869k6319j6520
$$ plain form
10343 -127461 -62436 -13851 15844 32032 26998 38363 38916 26089 -32414 -34024 63169 91292
10331 91292 79676 11424 12102 25333 -8071 1585 11146 45799 33939 -12030 -44693 -66276
10319 -66276 -43986 -39009 -34942 -62881 -54738 -54313 1615 49783 63931 40445 24750 -31312 -33188
10306 -33188 34312 -1702 -28031 -81482 -23031 -89626 -47462 55490 129305 146659 140069 80188
10294 80188 41958 120745 117497 175459 204858 234399 300120 270712 281305 252341 228347 148781
10282 148781 157778 196746 118170 125154 153444 124905 97915 -16833 -32778 -5933 -4648 -26831
10270 -26831 -14350 -24059 41632 144663 135630 99977 62905 74733 135706 105409 28222 20297
10258 20297 24772 65323 49691 174860 208868 85462 71582 74712 146216 175484 147384 109114
$$ packed form
10343a27461O5025M8585K9695J6188n034J1365N53j2827n8503j610R7193K8123
10331I1292j1616o8252O78J3231l3404R656R561L4653j1860m5969l2663k1583
10319f6276K2290M977M067k7939Q143M25N5928M8168J4148k3486j5695n6062j876
10306c3188O7500l6014k6329n3451N8451o6595M2164J02952P3815J7354o590n9881
10294H0188l8230P8787l248N7962K9399K9541O5721k9408J0593k8964k3994p9566
10282A48781Q997L8968p8576O984K8290k8539k6990j14748j5945K6845J285k2183
10270b6831J2481r709O5691J03031r033l5653l7072J1828O0973l0297p7187p925
10258B0297M475M0551j5632J25169L4008j23406j3880L130P1504K9268k8100l8270
$$ plain form
10246 109114 171104 125443 67573 83988 -5198 -103148 -153695 -188209 -164772 -80631 -104541
10235 -104541 -128761 -97436 -108575 -73788 2462 76030 162031 113136 56558 105287 195604
10224 195604 210775 203835 175566 106024 73185 31868 15734 86804 99957 83447 86545 137281
10212 137281 154732 159367 129026 79499 125604 174156 139051 53914 14205 -46859 -48304 34680
10200 34680 39924 -52999 -80127 -154199 -76672 -44906 30333 33175 -26076 -54630 -44702 11629
10188 11629 51235 101699 41533 28305 96073 8722 1486 40584 59686 121738 141592 85202
10176 85202 165743 194824 248266 235889 197623 187984 156385 147404 176333 149785 179411 74153
10164 74153 94769 118373 131833 158750 190403 161527 183342 154862 85953 85016 -11281 -43665
$$ packed form
10246A09114O1990m5661n7870J6415q9186r7950n0547l4514K3437Q4141k3910
10235a04541k4220L1325j1139L4787P6250P3568Q6001m8895n6578M8729R0317
10224A95604J5171o940k8269o9542l2839m1317j6134P1070J3153j6510L098N0736
10212A37281J7451M635l0341m9527M6105M8552l5105q5137l9709o1064j445Q2984
10200C4680N244r2923k7128p4072P7527L1766P5239K842n9251k8554R928N6331
10188A1629L9606N0464o0166j3228O7768q7351p236L9098J9102O2052J9854n6390
10176H5202Q0541K9081N3442j2377l8266r639l1599q981K8929k6548K9626j05258
10164G4153K0616K3604J3460K6917L1653k8876K1815k8480o8909r37r6297l2384
$$ plain form
10152 -43665 91817 4670 -11414 -11122 4613 -4542 -3970 36768 62372 79363 41555 22112
10140 22112 -27943 -3577 36072 -66707 -52127 -70919 -78014 -67590 -28892 -44387 -98081 -57616
10128 -57616 -58946 -87780 -14780 128379 133146 -7357 -94906 -57711 33484 143450 104561
10117 104561 72304 -7655 -33881 -29352 56564 -60523 -11482 59525 7342 39351 37488 7778
10105 7778 15760 49812 64118 66036 35089 -21056 61165 92668 119190 78154 2524 -369
10093 -369 100574 174110 138888 -595 -7290 38662 64517 21992 14417 10107 53952 62846
10081 62846 45544 82892 61011 -21939 28849 102989 21762 -86834 -52136 47655 28222
10070 28222 36181 103693 67514 -56951 -99010 -83808 -87377 27149 89044 63720 -33790 18541
$$ packed form
10152d3665J35482q7147j6084K92J5735r155N72M0738K5604J6991l7808j9443
10140B2112n0055K4366L9649j02779J4580j8792p095J0424L8698j5495n3694M0465
10128e7616j330k8834P3000J43159M767j40503q7549L7195R1195J09966l8889
10117A04561l2257p9959k6226M529Q5916j17087M9041P1007n2183L2009j863k9710
10105G778P982L4052J4306J918l0947n6145Q2221L1503K6522m1036p5630k893
10093c69J00943P3536l5222j39483o695M5952K5855m2525p575m310M3845Q894
10081F2846j7302L7348k1881q2950N0788P4140q1227j08596L4698R9791j9433
10070B8222P959O7512l6179j24465m2059J5202l569J14526O1895k5324r7510N2331
$$ plain form
10058 18541 60882 131282 112695 80698 187262 212249 196982 151586 86605 62851 57550 133148
10046 133148 149148 116891 114163 119395 102099 14265 -50896 -88764 -80150 48283 174597 247326
10034 247326 255478 314811 261510 179960 71782 110086 214114 185311 173496 49688 18585
10023 18585 96433 128447 131407 115846 141613 58838 -1040 1045 47233 69016 302 -40027
10011 -40027 -29397 12352 15312 67899 113883 120502 126836 77845 88504 115087 78743 129389
9999 129389 222348 277072 273269 308465 201716 96337 110116 83318 86662 123760 153826 94001
9987 94001 28215 -415 61792 66535 84362 127811 107712 106966 74793 99441 81770 74674 98837
9974 98837 72100 69403 135034 75544 -35052 70572 115771 128998 190324 160112 112703 45809
$$ packed form
10058A8541M2341P0400j8587l1997J06564K4987j5267m5396o4981k3754n301P5598
10046A33148J6000l2257k728N232j7296q7834o5161l7868Q614J28433J26314P2729
10034B47326Q152N9333n3301q1550j08178L8304J04028k8803j1815j23808l1103
10023A8585P7848L2014K960j5561K5767q2775n9878K085M6188K1783o8714m0329
10011d0027J0630M1749K960N2587M5984O619O334m8991J0659K6583l6344N0646
9999A29389R2959N4724l803L5196j06749j05379J3779k6798L344L7098L0066n9825
9987I4001o5786k8630O2207M743J7827M3449k0099p46l2173K4648j7671p096K4163
9974I8837k6737k697O5631n9490j10596J05624M5199J3227O1326l0212m7409o6894
$$ plain form
9962 45809 18016 39963 87146 50838 -10364 -79923 -130864 -84488 -13900 14895 -98499 -166917
9950 -166917 -99515 -44843 53515 85791 80853 66463 -1531 7209 57623 77253 56341 153673
9938 153673 167681 163408 121422 72983 -1027 68281 70154 98747 212381 270493 263082 273428
9926 273428 205777 25546 29445 82186 114130 218305 208146 185413 112386 106908 95067 77533
9914 77533 -3206 -38518 -9230 55725 21745 126371 170025 105650 62896 45354 32498 68803
9902 68803 127493 226337 232276 235639 204068 219668 171238 120272 75557 19895 -51744 -108127
9890 -108127 54752 10954 -27964 -49880 -101714 -59082 -1127 14820 24020 -30027 -50485 -51075
9878 -51075 -65498 5647 63309 39889 17023 91396 113091 102308 109638 207397 199310 197133
$$ packed form
9962D5809k7793K1947M7183l6308o1202o9559n0941M6376P0588K8795j13394o8418
9950a66917O7402N4672R8358L2276m938j4390o7994Q740N0414J9630k0912R7332
9938A53673J4008m273m1986m8439p4010O9308J873K8593J13634N8112p411J0346
9926B73428o7651j80231L899N2741L1944J04175j0159k2733p3027n478j1841j7534
9914G7533q0739l5312K9288O4955l3980J04626M3654o4375m2754j7542j2856L6305
9902F8803N8690R8844N939L363l1571J5600m8430n0966m4715n5662p1639n6383
9890a08127J62879m3798l8918k1916n1834M2632N7955J5947R200n4047k0458n90
9878e1075j4423P1145N7662k3420k2866P4373K1695j0783P330R7759q087k177
$$ plain form
9866 197133 191168 263221 333228 467669 580130 689222 836915 839688 656682 485306 430903
9855 430903 333927 254967 165792 106525 48061 53478 39148 -23307 39173 76950 140997 227536
9843 227536 244628 224531 210169 223287 270358 186615 103608 38225 -29288 -76905 5810 46148
9831 46148 17919 -38761 -48815 31644 75129 60656 48446 63549 88780 152152 203271 220748
9819 220748 183093 160548 244106 192949 170223 137120 112723 155437 338260 399350 290832
9808 290832 206883 112729 23328 -53974 -4909 67006 61120 93619 128935 206946 269109 451500
9796 451500 634338 834251 1027734 1069582 974255 884032 777450 598112 473893 381563
9786 381563 310200 292299 242446 211002 245437 206368 131331 124786 138210 126961 192534 220617
$$ packed form
9866A97133n965P2053P0007J34441J12461J09092J47693K773j83006j71376n4403
9855D30903r6976p8960q9175n9267n8464N417j4330o2455O2480L7777O4047Q6539
9843B27536J7092k0097j4362J3118M7071q3743q3007o5383o7513m7617Q2715M0338
9831D6148k8229n6680j0054Q0459M3485j4473j2210J5103K5231O3372N1119J7477
9819B20748l7655k2545Q3558n1157k2726l3103k4397M2714J82823O1090j08518
9808B90832q3949r4154q9401p7302M9065P1915n886L2499L5316P8011O2163J82391
9796D51500J82838J99913J93483M1848r5327r0223j06582j79338j24219r2330
9786C81563p1363j7901m9853l1444L4435l9069p5037o545J3424j1249O5573K8083
$$ plain form
9774 220617 193625 157854 174744 158898 86663 51906 75363 124237 202418 270019 323492 219255
9762 219255 139070 144503 94185 139189 158419 133263 138237 139459 174742 183339 158844 162281 56561
9749 56561 227 44296 89257 84126 187190 228198 158195 82943 64369 191680 151518 187360
9737 187360 194847 89498 118951 170144 137537 88892 47985 28092 132344 270275 333952
9726 333952 263273 220594 254724 215770 218986 133840 174322 183085 214328 195576 197157 206479
9714 206479 310400 526788 720408 899682 1287652 1964786 3058969 4196815 4074604
9705 4074604 2981275 1901957 1211070 824091 637979 502029 424237 485112 502178 465669
9695 465669 371474 285345 237517 279730 297304 260207 157220 83529 98475 115112 180357
$$ packed form
9774B20617k6992l5771J6890j5846p2235l4757K3457M8874P8181O7601N3473j04237
9762B19255q0185N433n0318M5004J9230k5156M974J222L5283Q597k4495L437j05720
9749E6561n6334M4069M4961n131J03064M1008p0003p5252j8574J27311m0162L5842
9737A87360P487j05349K9453N1193l2607m8645m0907j9893J04252J37931O3677
9726C33952p0679m2679L4130l8954L216q5146M0482Q763L1243j8752J581R322
9714B06479J03921K16388J93620J79274L87970O77134J094183J137846j22211
9705D074604j093329j079318o90887l86979j86112j35950p7792O0875J7066l6509
9695D65669r4195q6129m7828M2213J7574l7097j02987p3691J4946J6637O5245
$$ plain form
9684 180357 196724 143100 180629 142432 82977 148090 190686 201701 187930 190448 265034 313228
9672 313228 257930 175580 102150 221598 276575 184446 113076 92082 67351 58049 -16 55328
9660 55328 90248 108113 66996 51729 117192 96106 77743 67456 103770 134627 190423 153920
9648 153920 199467 172771 171063 188062 190811 275741 274317 267092 368496 377125 328130 329642 340928
9635 340928 280633 273075 253494 188592 241855 224094 203875 104677 70131 73121 80187 54609
9623 54609 75549 147737 171244 138488 79789 149141 231032 302986 328931 346337 342645 271326
9611 271326 242566 172588 201813 183589 94111 122933 219740 204916 234779 174085 136834 125310
9599 125310 146649 130927 80668 63304 -18691 -129267 -118777 -37111 157396 250221 225255
$$ packed form
9684A80357J6367n3624L7529l8197n9455O5113M2596J1015j3771K518P4586M8194
9672C13228n5298q2350p3430J19448N4977r2129p1370k0994k4731r302n8065N5344
9660E5328L4920J7865m1117j5267O5463k1086j8363j0287L6314L0857N5796l6503
9648A53920M5547k6696j708J6999K749Q4930j424p225J01404Q629m8995J512J1286
9635C40928o0295p558j9581o4902N3263j7761k0219r9198l4546K990P066k5578
9623E4609K0940P2188K3507l2756n8699O9352Q1891P1954K5945J7406l692p1319
9611B71326k8760o9978K9225j8224q9478K8822R6807j4824K9863o0694l7251j1524
9599A25310K1339j5722n0259j7364q1995j10576J0490Q1666J94507R2825k4966
$$ plain form
9588 225255 194558 166414 206972 221365 196607 92861 41016 83178 180014 215685 156920
9577 156920 194397 212614 201091 152387 136881 89271 129857 218670 247378 211123 132177 57072
9565 57072 58489 155166 159115 105428 114304 142733 178835 179699 176169 135214 117249 107069 96915
9552 96915 20797 -27637 61801 102571 77745 102891 151145 104754 104028 178392 251412 271278
9540 271278 277533 324372 271113 297803 447328 438762 380286 304585 300611 215240 205625 199552
9528 199552 140088 103869 138539 138799 92058 110914 113287 151350 194042 157381 200173 277582
9516 277582 341204 285049 94925 -26901 -620 116737 186427 211879 193672 254851 294871
9505 294871 213465 304039 403375 411240 402932 384797 414891 477348 421551 338400 322064 407146
$$ packed form
9588B25255l0697k8144M0558J4393k4758j03746n1845M2162R6836L5671n8765
9577A56920L7477J8217j1523m8704j5506m7610M0586Q8813K8708l6255p8946p5105
9565E7072J417R6677L949n3687Q876K8429L6102Q64l530m0955j7965j0180j0154
9552I6915p6118m8434Q9438M0770k4826K5146M8254m6391p26P4364P3020J9866
9540B71278O255M6839n3259K6690J49525q566n8476p5701l974q5371r615o073
9528A99552n9464l6219L4670K60m6741J8856K373L8063M2692l6661M2792P7409
9516B77582O3622n6155j90124j21826K6281J17357O9690K5452j8207O1179M0020
9505B94871q1406R0574R9336P865q308j8135L0094O2457n5797q3151j6336Q5082
$$ plain form
9493 407146 449483 464966 342501 319131 286968 280579 232881 232652 189380 184289 202716 237201
9481 237201 289418 207585 162643 83756 121104 223994 340846 371653 364202 306845 274031
9470 274031 336061 376050 388303 508906 592776 716379 697374 635547 554442 418793 361340
9459 361340 265457 179997 170817 253059 309885 368927 292883 166500 119920 224539 265533
9448 265533 343102 356944 385960 347260 309371 341405 374901 398923 378257 405202 421932 325044
9436 325044 241204 244951 231654 246641 312422 305725 363965 395553 396734 431451 429768 397052
9424 397052 372716 334711 320983 389837 351929 297134 378291 444026 405826 300542 314121
9413 314121 340654 369607 393321 424782 378126 396070 445013 477647 436369 419918 401567 422767
$$ packed form
9493D07146M2337J5483j22465k3370l2163o389m7698k29m3272n091J8427L4485
9481B37201N2217q1833m4942p8887L7348J02890J16852L0807p451n7357l2814
9470B74031O2030L9989J2253J20603Q3870J23603j9005o1827q1105j35649n7453
9459C61340r5883q5460r180Q2242N6826N9042p6044j26383m6580J04619M0994
9448B65533P7569J3842K9016l8700l7889L2034L3496K4022k0666K6945J6730r6888
9436C25044q3840L747j3297J4987O5781o697N8240L1588J181L4717j683l2716
9424C97052k4336l8005j3728O8854l7908n4795Q1157O5735l8200j05284J3579
9413C14121K6533K8953K3714L1461m6656J7944M8943L2634m1278j6451j8351K1200
$$ plain form
9401 422767 422228 351397 319788 414604 420789 437062 461305 464904 534583 551530 533159 552824
9389 552824 564289 544571 457716 494661 500373 462155 446641 436221 450044 526701 553663 577598
9377 577598 613629 584390 468488 415977 474926 517825 595229 551092 478151 448735 548853
9366 548853 628127 644387 664252 624343 686178 671068 698302 696662 647589 630749 648725 641065
9354 641065 633846 756824 775559 738220 762261 767260 738099 755677 764645 779144 765234 599887
9342 599887 602881 643531 646318 672297 692202 759189 784764 798030 861743 919721 856186 862378
9330 862378 753734 700722 667942 650148 600425 560701 663006 738182 851680 891297 843022
9319 843022 756656 662260 694134 703716 642568 643980 718566 798058 791911 831357 788163 752851
$$ packed form
9401D22767n39p0831l1609R4816O185J6273K4243L599O9679J6947j8371J9665
9389E52824J1465j9718q6855L6945N712l8218j5514j0420J3823P6657K6962K3935
9377E77598L6031k9239j15902n2511N8949M2899P7404m4137p2941k9416J00118
9366E48853P9274J6260J9865l9909O1835j5110K7234j640m9073j6840J7976p660
9354F41065p219J22978J8735l7339K4041M999k9161J7578Q968J4499j3910j65347
9342E99887K994M0650K787K5979J9905O6987K5575J3266O3713N7978o3535O192
9330H62378j08644n3012l2780j7794m9723l9724J02305P5176J13498L9617m8275
9319H43022q6366r4396L1874R582o1148J412P4586P9492o147L9446m3194l5312
$$ plain form
9307 752851 785883 824167 900746 981414 966003 980948 953947 921628 993165 1062463 1097479 1075371
9295 1075371 1085220 1069533 987881 965072 941343 985046 1053670 1133560 1167288 1141074 1157049 1199873
9283 1199873 1132989 1182914 1271005 1236313 1233612 1231879 1309553 1354887 1318485 1233121 1284144 1311407
9271 1311407 1361516 1414674 1445712 1488688 1448106 1393521 1447481 1443347 1436581 1438329 1511239 1525187
9259 1525187 1543890 1540860 1537863 1579329 1671844 1618096 1556450 1548942 1611723 1653686 1661482 1668840
9247 1668840 1680245 1683420 1716778 1673597 1692365 1650767 1702902 1819845 1715706 1719626 1792454
9236 1792454 1774156 1853895 1912294 1898567 1861936 1858172 1950442 2041333 2022688 2072134 2129529 2102442
9224 2102442 2105204 2100094 2171460 2244658 2171534 2183193 2235896 2240391 2298604 2309547 2329671 2329713 2375258
$$ packed form
9307G52851L3032L8284P6579Q0668j5411J4945k7001l2319P1537O9298L5016k2108
9295A075371R849j5687q1652k2809k3729M3703O8624P9890L3728k6214J5975M2824
9283A199873o6884M9925Q8091l4692k701j733P7674M5334l6402q5364N1023K7263
9271A311407N0109N3158L1038M2976m0582n4585N3960m134o766J748P2910J3948
9259A525187J8703l030k997M1466R2515n3748o1646p508O2781M1963P796P358
9247A668840J1405L175L3358m3181J8768m1598N2135J16943j04139L920P2828
9236A792454j8298P9739N8399j3727l6631l764R2270R0891j8645M9446N7395k7087
9224B102442K762n110P1366P3198p3124J1659N2703M495N8213J0943K0124M2M5545
$$ plain form
9211 2375258 2450207 2505877 2455539 2385043 2381922 2544931 2667174 2718400 2719292 2811463 2817129 2866604
9199 2866604 3012831 3023742 3013126 3027488 3155534 3275960 3344066 3383436 3470746 3557907 3492968
9188 3492968 3502567 3572854 3670373 3672686 3708865 3839991 4022696 4022746 3930507 3898226 4060059 4205560
9176 4205560 4285785 4366605 4395367 4528002 4605896 4679073 4750198 4804651 4959789 5142671 5259628
9165 5259628 5331348 5361922 5395557 5568962 5779268 5966770 6077140 6205925 6287627 6452727
9155 6452727 6631373 6764133 6968585 7167068 7311095 7491265 7720827 7857237 8088047 8350458
9145 8350458 8565427 8756462 9010430 9304286 9556872 9850123 10159673 10377055 10681674 10879066
9135 10879066 11199524 11510808 11847712 12248091 12658077 13057420 13534239 13978713 14511574
$$ packed form
9211B375258P4949N5670n0338p0496l121J63009J22243N1226Q92R2171N666M9475
9199B866604J46227J0911j0616J4362J28046J20426O8106L9370Q7310Q7161o4939
9188C492968R599P0287R7519K313L6179J31126J82705N0r2239l2281J61833J45501
9176D205560Q0225Q0820K8762J32635P7894P3177P1125N4453J55138J82882J16957
9165E259628P1720L0574L3635J73405K10306J87502J10370J28785Q1702J65100
9155F452727J78646J32760K04452J98483J44027J80170K29562J36410K30810K62411
9145H350458K14969J91035K53968K93856K52586K93251L09550K17382L04619J97392
9135A0879066L20458L11284L36904M00379M09986L99343M76819M44474N32861
$$ plain form
9126 14511574 15038881 15530233 16015206 16591500 17286105 17983055 18800582 19573463 20260008
9117 20260008 20958280 21702851 22541768 23428322 24368681 25383905 26529797 27680251 28828477
9108 28828477 30052861 31329220 32706588 34189193 35708492 37139658 38802366 40499048
9100 40499048 42202529 44028652 46004368 47947280 49987942 52059464 54121809 56220247
9092 56220247 58301325 60401359 62535737 64581290 66545278 68325021 70053210 71698555
9084 71698555 73046071 74214589 75170035 75747637 76143982 76344017 76241046 75715351 74947579
9075 74947579 74045027 72860136 71556621 70142674 68446212 66500522 64436597 62374980
9067 62374980 60273175 58141774 56055317 53931979 51822106 49725929 47681381 45788613
$$ packed form
9126A4511574N27307M91352M84973N76294O94605O96950Q17527P72881O86545
9117B0260008O98272P44571Q38917Q86554R40359J015224J145892J150454J148226
9108B8828477J224384J276359J377368J482605J519299J431166J662708J696682
9100D0499048J703481J826123J975716J942912K040662K071522K062345K098438
9092E6220247K081078K100034K134378K045553J963988J779743J728189J645345
9084G1698555J347516J168518R55446N77602L96345K00035j02971n25695p67772
9075G4947579r02552j184891j303515j413947j696462j945690k063925k061617
9067F2374980k101805k131401k086457k123338k109873k096177k044548j892768
$$ plain form
9059 45788613 43928504 42073324 40260621 38575549 36869580 35322393 33788460 32335997
9051 32335997 31115740 29967962 28769876 27635596 26522237 25425590 24449112 23466384
9043 23466384 22577338 21674772 20829471 20105921 19439160 18792238 17976228 17250444 16532264
9034 16532264 15921790 15363458 14923774 14531390 14004953 13554372 13150185 12760441 12386110
9025 12386110 12029931 11678302 11334779 11011970 10677377 10265865 9940719 9678492 9357710
9016 9357710 9056289 8835015 8615855 8517209 8425814 8202323 7923374 7601733 7305302 7125966
9006 7125966 7066708 6930698 6674074 6525602 6414026 6236055 6037743 5800291 5757858 5695796
8996 5695796 5611228 5450634 5238919 5082517 5018138 4933509 4807897 4677311 4541106 4487081
$$ packed form
9059D5788613j860109j855180j812703j685072j705969j547187j533933j452463
9051C2335997j220257j147778j198086j134280j113359j096647r76478r82728
9043B3466384q89046r02566q45301p23550o66761o46922q16010p25784p18180
9034A6532264o10474n58332m39684l92384n26437m50581m04187l89744l74331
9025A2386110l56179l51629l43523l22809l34593m11512l25146k62227l20782
9016I357710l01421k21274k19160r8646r1395k23491k78949l21641k96431j79336
9006G125966n9258j36010k56624j48472j11576j77971j98312k37452m2433o2062
8996E695796q4568j60594k11715j56402o4379q4629j25612j30586j36205n4025
$$ plain form
8986 4487081 4456718 4357658 4292687 4236716 4117013 3983842 3922656 3921644 3870844 3779035 3631883
8975 3631883 3510310 3544196 3531471 3521589 3423322 3262274 3136624 3060875 3006967 2991930 2987632
8964 2987632 2893581 2902645 2904114 2846174 2800059 2743815 2694758 2691020 2659943 2559539 2394364 2376004
8952 2376004 2315317 2288025 2223622 2212598 2267943 2292074 2307188 2228915 2113101 2142565 2172403
8941 2172403 2223405 2290273 2247271 2072397 2073587 2063240 1981331 1935763 1908015 1861342 1884002
8930 1884002 1874234 1914849 1926430 1845410 1681980 1612155 1614434 1555776 1529614 1574182 1568731 1562211
8918 1562211 1566132 1534511 1536575 1503173 1413040 1379484 1419748 1424841 1319781 1344516 1407869 1460889
8906 1460889 1442191 1407616 1290562 1255641 1256030 1212117 1148219 1082414 1088281 1089028 909135 825285
$$ packed form
8986D487081l0363r9060o4971n5971j19703j33171o1186j012n0800r1809j47152
8975C631883j21573L3886j2725r882r8267j61048j25650p5749n3908j5037m298
8964B987632r4051R064J469n7940m6115n6244m9057l738l1077j00404j65175j8360
8952B376004o0687k7292o4403j1024N5345K4131J5114p8273j15814K9464K9838
8941B172403N1002O6868m3002j74874J190j0347q1909m5568k7748m6673K2660
8930A884002r768M0615J1581q1020j63430o9825K279n8658k6162M4568n451o520
8918A562211L921l1621K064l3402r0133l3556M0264N093j05060K4735O3353N3020
8906A460889j8698l4575j17054l4921L89m3913o3898o5805N867P47j79893q3850
$$ plain form
8894 825285 886325 841138 834644 924469 992729 988247 920667 920221 887763 814123 846719 883235
8882 883235 904976 915823 975925 1014684 986869 974627 910555 886834 895824 858729 774513 667818
8870 667818 770334 783856 745424 725787 762156 848139 910527 856693 821181 794230 822447
8859 822447 882421 912778 882523 875852 876794 735441 654983 694541 753713 732007 569823 598544
8847 598544 707045 730101 728693 753350 806890 816109 712881 634149 668275 623982 629794 603497
8835 603497 634698 750145 765089 763939 765594 707800 639502 618789 636841 628980 589647 566453
8823 566453 488665 410818 378743 392820 494004 558299 547003 558928 598500 493211 420372
8812 420372 443056 513036 495548 573628 544590 461720 451458 464055 483692 517895 500889 436849
$$ packed form
8894H25285O1040m5187o494Q9825O8260m482o7580m46l2458p3640L2596L6516
8882H83235K1741J0847O0102L8759k7815j2242o4072k3721Q990l7095q4216j06695
8870F67818J02516J3522l8432j9637L6369Q5983O2388n3834l5512k6951K8217
8859H22447N9974L0357l0255o671R42j41353q0458L9558N9172k1706j62184K8721
8847E98544J08501K3056j408K4657N3540R219j03228p8732L4126m4293N812k6297
8835F03497L1201J15447J4944j150J655n7794o8298k0713J8052p861l9333k3194
8823E66453p7788p7847l2075J4077J01184O4295j1296J1925L9572j05289p2839
8812D20372K2684O9980j7488P8080k9038q2870j0262J2597J9637L4203j7006o4040
$$ plain form
8800 436849 383341 347602 355092 306398 336700 395316 373544 355072 470552 444096 309702
8789 309702 287529 314637 405338 399283 296015 165179 129415 221219 349589 339493 315604
8778 315604 305597 262212 285760 291495 239699 264638 317860 464636 463885 424389 435063 464606
8766 464606 483059 438515 438865 405516 497026 425131 286042 345367 402414 336268 292779 388515
8754 388515 515236 492453 359934 321829 369251 395339 412403 375153 434257 389355 413345
8743 413345 436069 423837 407310 417766 376767 292649 274246 225241 210593 192668 197046 280302
8731 280302 288517 243439 240393 289294 271934 317086 273949 266189 301931 289327 293442 284276 304135
8718 304135 318060 316174 294379 350883 363706 377758 340714 357283 392860 349998 318276 271748
$$ packed form
8800D36849n3508l5739P490m8694L0302N8616k1772j8472J15480k6456j34394
8789C09702k2173K7108R0701o055j03268j30836l5764R1804J28370j0096k3889
8778C15604j0007m3385K3548N735n1796K4939N3222J46776p51l9496J0674K9543
8766D64606J8453m4544L50l3349R1510p1895j39089N9325N7047o6146m3489R5736
8754C88515J26721k2783j32519l8105M7422K6088J7064l7250N9104m4902K3990
8743D13345K2724j2232j6527J0456m0999q4118j8403m9005j4648j7925M378Q3256
8731B80302Q215m5078l046M8901j7360M5152m3137p760L5742j2604M115r166J9859
8718C04135J3925j886k1795N6504J2823J4052l7044J6569L5577m2862l1722m6528
$$ plain form
8706 271748 339675 392325 318026 284120 316606 312963 333602 324926 193696 192131 254079 290206
8694 290206 322241 384164 463468 463881 418248 396069 346566 329619 255234 256399 284422 266650
8682 266650 262513 294379 372675 403718 329641 200318 187872 221685 191726 233912 201552 184941
8670 184941 278767 338214 281415 228529 336478 427224 420217 369112 363203 331666 252091 225049
8658 225049 295720 331060 282052 257807 336058 314790 246895 272418 298047 305617 321512 343525
8646 343525 278773 237296 243029 181485 162377 234212 261907 286975 289568 344814 315938 257023
8634 257023 272552 279158 231531 228921 300567 366630 426495 388174 361193 382310 396200 417658
8622 417658 418414 428420 430344 452954 505425 464429 385000 436745 568114 513422 488430 551238
$$ packed form
8706B71748O7927N2650p4299l3906L2486l643K0639q676j31230j565O1948L6127
8694B90206L2035O1923P9304M13m5633k2179m9503j6947p4385J165K8023j7772
8682B66650m137L1866P8296L1043p4077j29323j2446L3813k9959M2186l2360j6611
8670A84941R3826N9447n6799n2886J07949R0746p007n1105n909l1537p9575k7042
8658B25049P0671L5340m9008k4245P8251k1268o7895K5523K5629P570J5895K2013
8646C43525o4752m1477N733o1544j9108P1835K7695K5068K593N5246k8876n8915
8634B57023J5529O606m7627k610P1646O6063N9865l8321k6981K1117J3890K1458
8622D17658P56J0006J924K2610N2471m0996p9429N1745J31369n4692k4992O2808
$$ plain form
8610 551238 464259 322467 315797 398481 473313 467613 496856 527689 425384 400080 400739 433902
8598 433902 404039 360274 356393 436867 474489 542077 653920 672182 682398 669113 740172 747857
8586 747857 792941 830288 856305 837098 1075182 1342411 1494613 1555446 1558414 1700171 1825704
8575 1825704 1906790 1975372 2121589 2211131 2233817 2250358 2274013 2100862 1925094 1854473 1801300
8564 1801300 1663993 1491754 1310849 1182047 1042804 940874 807417 758918 745059 653577
8554 653577 558445 485778 472402 518670 438569 264561 276776 357782 426873 467921 447816
8543 447816 365202 283168 178803 121748 189737 237470 187208 113274 68563 192458 338559
8532 338559 334975 309074 240783 195617 217983 326470 423141 381615 265515 266584 277235 345345
$$ packed form
8610E51238q6979j41792o670Q2684P4832n700K9243L0833j02305k5304O59L3163
8598D33902k9863m3765l881Q0474L7622O7588J11843J8262J0216j3285P1059P685
8586G47857M5084L7347K6017j9207K38084K67229J52202O0833K968J41757J25533
8575A825704Q1086O8582J46217Q9542K2686J6541K3655j73151j75768p0621n3173
8564A801300j37307j72239j80905j28802j39243j01930j33457m8499j3859r1482
8554F53577r5132p2667j3376M6268q0101j74008J2215Q1006O9091M1048k0105
8543D47816q2614q2034j04365n7055O7989M7733n0262p3934m4711J23895J46101
8532C38559l584k5901o8291m5166K2366J08487R6671m1526j16100J069J0651O8110
$$ plain form
8520 345345 338937 305776 169631 184738 192451 201867 300029 282912 230163 185218 128737 96500
8508 96500 98602 61027 33438 111971 207608 135295 120926 131140 128383 68130 -16526 73030
8496 73030 100771 127463 124943 112651 58240 27688 55063 4643 19364 79278 155261 229231
8484 229231 241566 179858 132057 81136 84270 102509 145496 239738 195205 131433 127179 130404
8472 130404 99820 138901 52267 69709 82988 110967 138669 129133 182446 150298 106437 54793
8460 54793 -4974 53133 139335 155982 158375 166089 157572 135902 63425 -9458 -21033 3790
8448 3790 106009 176035 103395 115098 107641 71681 2944 -58396 -44370 -41882 18623 104530
8436 104530 94524 89058 115685 116734 121253 141475 115535 76711 104735 122035 70613 39267
$$ packed form
8520C45345o408l3161j36145J5107P713R416R8162j7117n2749m4945n6481l2237
8508I6500K102l7575k7589P8533R5637p2313j4369J0214k757o0253q4656Q9556
8496G3030K7741K6692k520j2292n4411l0552K7375n0420J4721N9914P5983P3970
8484B29231J2335o1708m7801n0921L134J8239M2987R4242m4533o3772m254L225
8472A30404l0584L9081q6634J7442J3279K7979K7702r536N3313l2148m3861n1644
8460E4793n9767N8107Q6202J6647K393P714q517k1670p2477p2883j1575K4823
8448C790J02219P0026p2640J1703p457l5960o8737o1340J4026K488O0505Q5907
8436A04530j0006n466K6627J049M519K0222k5940l8824K8024J7300n1422l1346
$$ plain form
8424 39267 58218 56693 -30767 -69701 -20184 26850 41529 -17544 -101332 37112 82264 -677
8412 -677 38222 24285 35515 31810 63341 55703 74831 58918 135773 215217 229406 245108 285200
8399 285200 287748 194682 66686 24018 13416 61875 154213 92766 113229 125963 26978 -10042
8387 -10042 -33609 -102524 -8041 54258 91782 22493 52726 186691 213477 160900 46723
8376 46723 97858 126791 106213 66162 85684 86072 42113 20385 124972 191306 138574 30009
8364 30009 37050 112616 156172 68099 93112 163890 206326 118797 90130 81234 22303 51231
8352 51231 39702 80898 121022 99562 95683 94559 67253 78772 102268 141708 151589 136408
8340 136408 120012 156468 108344 98763 77829 23830 -13512 -72253 -52560 -24586 36385 76181
$$ packed form
8424C9267J8951j525q7460l8934M9517M7034J4679n9073q3788J38444M5152q2941
8412f77L8899j3937J1230l705L1531p638J9128j5913P6855P9444J4189J5702M0092
8399B85200K548r3066j27996m2668j0602M8459R2338o1447K0463J2734r8985l7020
8387a0042k3567o8915R4483O2299L7524o9289L0233J33965K6786n2577j14177
8376D6723N1135K8933k0578m0051J9522L88m3959k1728J04587O6334n2732j08565
8364C0009P041P5566M3556q8073K5013P0778M2436q7529k8667q896n8931K8928
8352E1231j1529M1196M0124k1460l879j124k7306J1519K3496L9440R881j5181
8340A36408j6396L6456m8124r581k0934n3999l7342n8741J9693K7974O0971L9796
$$ plain form
8328 76181 56231 117495 162433 212995 194413 144969 104322 125730 174063 132269 22745 -47874
8316 -47874 -4204 77663 130657 113808 125619 43022 25256 36906 84807 16771 -37636 -76452
8304 -76452 -65166 -96361 -35954 -16839 -14279 -36483 17297 65965 66716 38109 -45722 -60600
8292 -60600 -54936 -81629 -102987 -116995 -1823 23562 -61968 -58290 41588 41398 -1335 -79773
8280 -79773 -29820 76107 154756 94989 59289 72232 57941 54899 77246 68307 -6849 40887
8268 40887 59754 60353 192183 233121 153377 124144 142888 146982 144377 46517 -32058 -9974
8256 -9974 18583 49888 28870 -53561 -65951 -31725 30910 72972 142972 165921 107570 81940
8244 81940 64990 2876 30675 132200 39637 -25411 -18230 -67984 -91817 -34660 20430 54270
$$ packed form
8328G6181j9950O1264M4938N0562j8582m9444m0647K1408M8333m1794j09524p0619
8316d7874M3670Q1867N2994j6849J1811q2597j7766J1650M7901o8036n4407l8816
8304g6452J1286l1195O0407J9115K560k2204N3780M8668P51k8607q3831j4878
8292f0600N664k6693k1358j4008J15172K5385q5530L678R9878j90m2733p8438
8280g9773M9953J05927P8649n9767l5700J2943j4291l042K2347q939p5156M7736
8268D0887J8867N99J31830M0938p9744k9233J8744M094k605r7860p8575K2084
8256i974K8557L1305k1018q2431j2390L4226O2635M2062P0000K2949n8351k5630
8244H1940j6950o2114K7799J01525r2563o5048P181m9754k3833N7157N5090L3840
$$ plain form
8232 54270 26512 -22343 -76659 -101891 -7518 87598 147458 143905 88814 124316 185046 172752
8220 172752 148430 28699 7951 -29443 -73761 -83410 -102426 -76026 -76469 -156014 -52244 -15049
8208 -15049 -119439 -52542 -29256 101266 178370 145029 94240 32383 17284 -8073 78975
8197 78975 160374 167763 143302 73426 100955 130725 105561 139151 160303 110433 -7181 14735
8185 14735 164 17825 14175 -15007 -6184 -7084 53352 150772 147325 40577 -2269 8167 -61851
8172 -61851 -92922 -30626 41921 53729 63495 86928 95854 175947 219851 176105 88054 82329
8160 82329 -2759 -9869 14765 66550 74734 100760 28847 -14091 61079 45803 -19309 -77990
8148 -77990 -100108 -9040 115623 145101 194160 203670 215600 230041 170892 12758 14841 26568
$$ packed form
8232E4270k7758m8855n4316k5232R4373R5116N9860l553n5091L5502O0730j2294
8220A72752k4322j19731k0748l7394m4318r649j9016K6400m43p9545J03770L7195
8208a5049j04390O6897K3286J30522P7104l3341n0789o1857j5099k5357Q7048
8197G8975Q1399P389k4461o9876K7529K9770k5164L3590K1152m9870j17614K1916
8185A4735j4571J7661l650k9182Q823r00O0436R7420l447j06748m2846J0436p0018
8172f1851l1071O2296P2547J1808R766K3433Q926Q0093M3904m3746q8051n725
8160H2329q5088p110K4634N1785Q184K6026p1913m2938P5170j5276o5112n8681
8148g7990k2118R1068J24663K9478M9059R510J1930J4441n9149j58134K083J1727
$$ plain form
8136 26568 -10357 -3114 -15643 -51990 -36876 -39198 -35238 31894 -7482 38058 -79750 -226944
8124 -226944 -258088 -85190 -12382 -27837 28659 79371 83476 26295 40120 34484 29826 33810
8112 33810 4727 -1742 -14703 -82880 -257266 -291338 -128677 -60311 9053 70403 123520 171541
8100 171541 165859 142288 189826 136451 100002 76007 59769 101781 57533 -6275 -37905 -10117
8088 -10117 -23467 -143887 -142717 17903 70392 72977 25957 37076 62502 -31942 342 82460
8076 82460 49354 119267 175321 43115 -100644 -203410 -182187 -57053 -27485 -121906 -209925
8065 -209925 -214030 -95623 28676 111906 76969 104335 192477 141056 47433 -9360 48716
8054 48716 15770 -35441 -38101 -15766 69022 80901 28387 31323 33591 119593 235329 329105
$$ packed form
8136B6568l6925P243j2529l6347J5114k322L960O7132l9376M5540j17808j47194
8124b26944l1144J72898P2808j5455N6496N0712M105n7181J3825n636m658L984
8112C3810k9083o469j2961o8177j74386l4072J62661O8366O9364O1350N3117M8021
8100A71541n682k3571M7538n3375l6449k3995j6238M2012m4248o3808l1630K7788
8088a0117j3350j20420J170J60620N2489K585m7020J1119K5426r4444L2284Q2118
8076H2460l3106O9913N6054j32206j43759j02766K1223J25134K9568r4421q8019
8065b09925m105J18407J24299Q3230l4937K7366Q8142n1421r3623n6793N8076
8054D8716l2946n1211k660K2335Q4788J1879n2514K936K268Q6002J15736R3776
$$ plain form
8042 329105 368968 298849 179826 52122 -21658 -36116 49769 -13422 -53887 -90546 -145413
8031 -145413 -257511 -256902 -129054 -29803 15447 39292 14639 7648 118663 115148 100689 71520
8019 71520 168256 242330 188143 71779 -209 18836 67827 57357 32805 98182 98687 75144
8007 75144 123032 69784 36131 20080 132221 229417 330092 450695 584752 668931 579227
7996 579227 371026 230782 196297 193476 180112 116976 129120 136118 165342 236145 327932 419908
7984 419908 496770 424462 371807 360732 364855 288043 144252 106773 76812 99758 104713 207413
7972 207413 187042 151493 141130 174693 125110 67150 11075 -10518 -81406 -84900 -84013 -16327
7960 -16327 -18523 -37815 -29220 -12189 -51353 -110219 -71403 -15288 -14663 17080 34778 144992
$$ packed form
8042C29105L9863p0119j19023j27704p3780j4458Q5885o3191m0465l6659n4867
8031a45413j12098O09J27848R9251M5250K3845k4653o991J11015l515j4459k9169
8019G1520R6736P4074n4187j16364p1988J9045M8991j0470k4552O5377N05k3543
8007G5144M7888n3248l3653j6051J12141R7196J00675J20603J34057Q4179q9704
7996E79227k08201j40244l4485k821j3364o3136J2144O998K9224P0803R1787R1976
7984D19908P6862p2308n2655j1075M123p6812j43791l7479k9961K2946M955J02700
7972B07413k0371l5549j0363L3563m9583n7960n6075k1593p0888l494Q87O7686
7960a6327k196j9292Q595J7031l9164n8866L8816N6115O25L1743J7698J10214
$$ plain form
7948 144992 294541 300862 108460 37862 45160 64590 77423 66158 -30262 -9617 -7252 -68812
7936 -68812 -46175 -26252 3034 27754 64647 86269 128971 183227 83365 45526 53158 92989
7924 92989 51220 -26936 -64895 29739 73979 18244 -62024 -171032 -191824 -204047 -120842 -57691
7912 -57691 -113325 -73998 -15981 -24077 7486 18802 -88677 -139983 -150870 -109606 -753 137604
7900 137604 85684 28925 98843 121565 221469 296096 260517 152008 64625 39744 94310
7889 94310 20166 -28354 41481 43726 4194 -69229 -65056 -65599 26843 16954 60109 96787 56541
7876 56541 65294 34299 -7629 -80836 -125322 -52635 -43576 6040 -19011 -99551 -16124 146969
7864 146969 108060 -5293 -607 17907 14597 50121 48047 41636 -3767 78239 98557 57082
$$ packed form
7948A44992J49549O321j92402p0598P298J9430J2833j1265r6420K0645K365o1560
7936f8812K2637J9923K9286K4720L6893K1622M2702N4256r9862l7839P632L9831
7924I2989m1769p8156l7959R4634M4240n5735q0268j09008k0792j2223Q3205O3151
7912e7691n5634L9327N8017q096L1563J1316j07479n1306j0887M1264J08853J38357
7900A37604n1920n6759O9918K2722R9904P4627l5579j08509q7383k4881N4566
7889I4310p4144m8520O9835K245l9532p3423M173n43R2442r889M3155L6678m0246
7876E6541Q753l0995m1928p3207m4486P2687R059M9616k5051q0540Q3427J63093
7864A46969l8909j13353M686J8514l310L5524k074o411m5403Q2006K0318m1475
$$ plain form
7852 57082 84924 83348 62740 8080 -30209 -49169 -33967 10369 -37267 -51850 -126226 -109532
7840 -109532 -83661 -96612 -23594 -24518 -81886 -73229 16285 93819 101424 58553 -22277 34500
7828 34500 121951 119860 31263 -57759 -83530 -98449 -94385 -72693 -54674 -89646 -103343 -80243
7816 -80243 -99107 -94096 -107789 -101853 -37289 64325 106201 -13740 35649 66112 49382 -25299
7804 -25299 -20 41446 -6564 26810 132358 149993 165320 42955 -13160 -82332 -121221
7793 -121221 -26295 48458 115383 132911 35930 -87391 -85494 -122035 -74588 -60802 -75665 -89457
7781 -89457 -51596 14799 65732 133676 84488 63774 54962 55912 41546 -9070 15901 7344 44613
7768 44613 2027 -31053 -2653 1218 11219 28674 11265 63495 56936 62948 77948 135946
$$ packed form
7852E7082K7842j576k0608n4660l8289j8960J5202M4336m7636j4583p4376J6694
7840a09532K5871j2951P3018r24n7368Q657Q9514P7534P605m2871q0830N6777
7828C4500Q7451k091q8597q9022k5771j4919M064K1692J8019l4972j3697K3100
7816h0243j8864N011j3693N936O4564J01614M1876j19941M9389L0463j6730p4681
7804b5299K5279M1466m8010L3374J05548J7635J5327j22365n6115o9172l8889
7793a21221R4926P4753O6925J7528r6981j23321J897l6541M7447J3786j4863j3792
7781h9457L7861O6395N0933O7944m9188k0714q812R50j4366n0616K4971q557L7269
7768D4613m2586l3080K8400L871J0001J7455j7409N2230o559O012J5000N7998
$$ plain form
7756 135946 35776 -1986 3994 78565 44284 -26742 -63837 6313 59466 116381 124417 123215
7744 123215 58561 48741 104513 33599 -89885 -130993 -136012 -61715 -32728 -16075 14577 51557
7732 51557 -11407 -3675 7509 5697 4870 70658 68513 14706 4153 26719 16116 6810 7104
7719 7104 -42929 -15553 -30452 -47833 46090 72400 -57890 -171810 -114977 -9702 -9664 63421
7707 63421 143812 146835 103559 69980 5312 19410 -19438 -108994 -40090 50323 -13247 -143977
7695 -143977 -39024 72743 70814 36311 11582 -11454 -59820 -40381 60571 92153 71806
7684 71806 39992 42348 -38054 -111922 -159366 -107547 -69083 -82151 -9545 -16001 6440 43577
7672 43577 -6685 -24741 25286 42396 45676 -20751 -106975 -104528 -17347 46842 101530 125066
$$ packed form
7756A35946j00170l7762N980P4571l4281p1026l7095P0150N3153N6915Q036j202
7744A23215o4654r820N5772p0914j23484m1108n019P4297K8987J6653L0652L6980
7732E1557o2964P732J1184j812q27O5788k145n3807j0553K2566j0603r306K94
7719G104n0033K7376j4899j7381R3923K6310j30290j13920N6833J05275L8P3085
7707F3421Q0391L023m3276l3579o4668J4098l8848q9556O8904R0413o3570j30730
7695a43977J04953J11767j929l4503k4729k3036m8366J9439J00952L1582k0347
7684G1806l1814K356q0402p3868m7444N1819L8464j3068P2606o456K2441L7137
7672D3577n0262j8056N0027J7110L280o6427q6224K447Q7181O4189N4688K3536
$$ plain form
7660 125066 162068 177309 211144 143402 87530 32534 -9988 -93542 -168450 -162218 -161970 -194403
7648 -194403 -112191 -128362 -131836 -62814 -70481 -61117 -57462 -28947 -64899 -128977 -112434 -904
7636 -904 91482 89695 137940 182841 160835 178831 166744 122326 110594 79557 -5323 -29773
7624 -29773 -73497 -141462 -61293 -2073 29495 9796 17565 -57944 -78720 -39334 65560 85376
7612 85376 211351 152910 73380 -31462 10839 63097 8609 -38575 -95007 -86634 -38123 -53217
7600 -53217 -102352 -134525 -165067 -89467 -39069 -720 81958 141520 139861 126180 120544 137767
7588 137767 157798 99732 66471 -5099 34406 41275 56899 13092 -21642 23494 50340 55781
7576 55781 18346 2272 8111 -25408 -25163 -10456 -28053 -56642 -79721 -94156 -104765 32094
$$ packed form
7660A25066L7002J5241L3835o7742n5872n4996m2522q3554p4908O232K48l2433
7648a94403Q2212j6171l474O9022p667R364L655K8515l5952o4078J6543J11530
7636i04R2386j787M8245M4901k2006J7996j2087m4418j1732l1037q4880k4450
7624b9773m3724o7965Q0169N9220L1568j9699P769p5509k0776L9386J04894J9816
7612H5376J25975n8441p9530j04842M2301N2258n4488m7184n6432Q373M8511j5094
7600e3217m9135l2173l0542P5600N0398L8349Q2678N9562j659j3681n636J7223
7588A37767K0031n8066l3261p1570L9505O869J5624m3807l4734M5136K6846N441
7576E5781l7435j6074N839l3519K45J4707j7597k8589k3079j4435j0609J36859
$$ plain form
7564 32094 60346 24429 42135 -15246 -17273 -19826 -122220 -89453 -8063 -1662 -7331 42580
7552 42580 -6754 -79692 -90272 -116846 -107324 5614 26619 -29001 35306 646 -44013 -26354
7540 -26354 -25254 -36971 -25805 -78745 -109472 -47921 -5955 52198 -464 -59544 -32368 -12694
7528 -12694 -23912 7875 38686 -54627 -140078 -142156 -154297 -99396 17590 51433 58704 4156
7516 4156 -7597 -2724 -30142 -23283 -30615 -82753 -41387 -21466 -43739 -95280 -132556 -151435 -125012
7503 -125012 -101913 -67957 18620 38231 17575 -12591 32233 96173 100570 158667 129876 95784
7491 95784 51880 16384 -43983 -39001 -13458 -13970 -49474 11996 65839 63391 62998 175898 257143
7478 257143 119338 -30489 -111678 -36871 -50991 -27688 -82383 -92580 -71949 51552 -22578
$$ packed form
7564C2094K8252l5917J7706n7381k027k553j02394L2767Q1390O401n669M9911
7552D2580m9334p2938j0580k6574R522J12938K1005n5620O4307l4660m4659J7659
7540b6354J100j1717J1166n2940l0727O1551M1966N8153n2662n9080K7176J9674
7528a2694j1218L1787L0811r3313q5451k078j2141N4901J16986L3843P271n4548
7516D156j1753M873k7418O859p332n2138M1366J9921k2273n1541l7276j8879K6423
7503a25012K3099L3956Q6577J9611k0656l0166M4824O3940M397N8097k8791l4092
7491I5784m3904l5496o0367M982K5543n12l5504O1470N3843k448l93J12900Q1245
7478B57143j37805j49827q1189P4807j4120K3303n4695j0197K0631J23501p4130
$$ plain form
7467 -22578 -75815 -74970 -6296 -1658 86450 118229 65587 -28305 -78494 -32668 45921 -1398
7455 -1398 -141123 -84355 -14540 -29403 -116187 -166135 -145693 -117557 -141183 -146695 -170377 -234974
7443 -234974 -236487 -256478 -250068 -146002 -60538 -13887 -76869 -89743 -38068 16066 -33614 -80426
7431 -80426 -90884 -100966 -93937 -126519 -155797 -136058 38792 120065 87744 62429 6879 -49228
7419 -49228 -85951 -80598 -5296 48790 -10488 -19069 22843 46581 76646 43034 -25489 -88405
7407 -88405 -7885 47267 5676 -8321 6264 -31493 -60596 -12830 2291 -85143 -117533 -27995
7395 -27995 -56826 -97425 -48194 -78894 -134328 -88514 -40493 -9268 35890 41007 66479 54172
7383 54172 -8124 -23138 32235 113766 152488 152126 50997 48418 45762 77393 89767 209242
$$ packed form
7467b2578n3237Q45O8674M638Q8108L1779n2642r3892n0189M5826P8589m7319
7455a398j39725N6768O9815j4863q6784m9948K0442K8136k3626n512k3682o4597
7443b34974j513j9991O410J04066Q5464M6651o2982j2874N1675N4134m9680m6812
7431h0426j0458j0082P029l2582k9278J9739J74850Q1273l2321k5315n5550n6107
7419d9228l6723N353P5302N4086n9278q581M1912K3738L0065l3612o8523o2916
7407h8405Q0520N5152m1591j3997J4585l7757k9103M7766J5121q7434l2390Q9538
7395b7995k8831m0599M9231l0700n5434M5814M8021L1225M5158N117K5472j2307
7383E4172o2296j5014N5373Q1531L8722l62j01129k579k656L1631J2374J19475
$$ plain form
7371 209242 120004 -23556 -18557 35736 52696 90232 44872 -37275 -54490 -50604 -30317 16411
7359 16411 89966 55640 16420 -1445 -61127 -85850 97195 158365 94370 33832 -26735 -66160
7347 -66160 -101937 -167908 -83159 -21110 34139 40672 25479 -27827 -67544 -21706 -6396 83035
7335 83035 100850 29415 -73508 -33246 15238 133863 119996 92889 87800 65913 -10046 -83941
7323 -83941 -32610 23099 -10684 -15884 40046 72292 80421 88475 87827 60607 3396 33419 -51610
7310 -51610 -58707 -19894 -12672 -22027 76954 68182 -46703 -119379 -76909 -9326 27282 63333
7298 63333 42916 4314 -17502 -59831 -53984 -33906 -60194 -98745 -73943 -54305 -111831 -153977
$$ packed form
7371B09242q9238j43560M999N4293J6960L7536m5360q2147j7215L886K0287M6728
7359A6411P3555l4326l9220j7865n9682k4723J83045O1170o3995o0538o0567l9425
7347f6160l5777o5971Q4749O2049N5249O533j5193n3306l9717M5838J5310Q9431
7335H3035J7815p1435j02923M0262M8484J18625j3867k7107n089k1887p5959p3895
7323h3941N1331N5709l3783n200N5930L2246Q129Q054o48k7220n7211L0023q5029
7310e1610p097L8813P222r355R8981q772j14885p2676M2470O7583L6608L6051
7298F3333k0417l8602k1816m2329N847K0078k6288l8551K4802J9638n7526m2146
$$ [...]
##END NTUPLES=NMR SPECTRUM
##END=
