##TITLE=Analysis number 321172
Compound Code cc 29203
Book Reference 468/128
Project Code adrs
Chemist Name colinb
##JCAMPDX= 6.0         $$ Bruker NMR JCAMP-DX V2.0
##DATA TYPE= NMR SPECTRUM
##DATA CLASS= NTUPLES
##ORIGIN= Bruker BioSpin GmbH
##OWNER= nmr
$$ XWIN-NMR		Version 3.5
$$ Wed Jul 26 14:45:19 2006 GMT Daylight Time (UT+1h)  MAYBRIDGE\nmr@NMR_250MHZ
##.OBSERVE FREQUENCY= 250.131544655141
##.OBSERVE NUCLEUS= ^1H
##.ACQUISITION MODE= SIMULTANEOUS (DQD)
##.ACQUISITION SCHEME= undefined
##.AVERAGES= 16
##.DIGITISER RES= 18
##SPECTROMETER/DATA SYSTEM= dpx250
##.PULSE SEQUENCE= zg30
##.SOLVENT NAME= CDCl3
##.SHIFT REFERENCE= (INTERNAL, CDCl3, 0, 16.522)
##AUDIT TRAIL= $$ (NUMBER, WHEN, WHO, WHERE, WHAT)
$$ ##TITLE= Audit trail, XWIN-NMR		Version 3.5
$$ ##JCAMPDX= 5.01
$$ ##ORIGIN= Bruker BioSpin GmbH
$$ ##OWNER= nmr
$$ C:\u/data/dgb/nmr/ADRS/3660/pdata/1/auditp.txt
$$ ##AUDIT TRAIL=  $$ (NUMBER, WHEN, WHO, WHERE, WHAT)
(   1,<2006-07-26 14:44:51.16 +100>,<MAYBRIDGE\nmr>,<NMR_250MHZ>,
      <created by zg, POWCHK disabled, PULCHK disabled
       configuration hash MD5:
       E2 DF 36 D8 04 B2 41 60 5A D7 A3 38 5A 4B D0 FE
       data hash MD5: 64K
       45 CF BD 8E D7 E4 63 DA 6C 7B EB 6B 4C 6F BA 2B>)
(   2,<2006-07-26 14:45:07.54 +100>,<MAYBRIDGE\nmr>,<NMR_250MHZ>,
      <Start of raw data processing
       ef LB = 0.3 FT_mod = 6 PKNL = 1 SI = 32K 
       data hash MD5: 32K
       5E A4 A1 C1 6C 0B C8 36 5E C5 AD EE 8B 5B 1A F3>)
(   3,<2006-07-26 14:45:09.10 +100>,<MAYBRIDGE\nmr>,<NMR_250MHZ>,
      <apk 
       data hash MD5: 32K
       33 55 51 A2 DC 18 21 0E 3E BA 89 86 19 B2 58 1B>)
(   4,<2006-07-26 14:45:09.84 +100>,<MAYBRIDGE\nmr>,<NMR_250MHZ>,
      <abs ABSG = 5 
       data hash MD5: 32K
       71 E9 C3 65 3F 21 5E F5 30 13 98 11 2B 16 D1 F0>)
$$ ##END=
$$ 
$$ hash MD5
$$ CD 12 E9 D3 66 75 5A 24 0F 7E E9 2F D8 CC 66 A3
##$RELAX= 
##$RELAX= 
##$RELAX= 
##$RELAX= 
##$RELAX= 
##$RELAX= 
##$RELAX= 
$$ Bruker specific parameters
$$ --------------------------
##$DU= <C:\u>
##$EXPNO= 3660
##$NAME= <ADRS>
##$PROCNO= 1
##$TYPE= <nmr>
##$USER= <dgb>
##$AMP= (0..31)
100 100 100 100 100 100 100 100 100 100 100 100 100 100 100 100 100 100 
100 100 100 100 100 100 100 100 100 100 100 100 100 100 
##$AQSEQ= 0
##$AQ_mod= 3
##$AUNM= <au_zg>
##$AUTOPOS= <38 >
##$BF1= 250.13
##$BF2= 250.13
##$BF3= 250.13
##$BF4= 250.13
##$BF5= 500.13
##$BF6= 500.13
##$BF7= 500.13
##$BF8= 500.13
##$BYTORDA= 1
##$CFDGTYP= 0
##$CFRGTYP= 5
##$CHEMSTR= <none>
##$CNST= (0..31)
1 1 145 1 1 1 1 1 1 1 1 1 1 1 1 1 1 1 1 1 1 1 1 1 1 1 1 1 1 1 1 1 
##$CPDPRG= <>
##$CPDPRG1= <>
##$CPDPRG2= <>
##$CPDPRG3= <>
##$CPDPRG4= <mlev>
##$CPDPRG5= <mlev>
##$CPDPRG6= <mlev>
##$CPDPRG7= <mlev>
##$CPDPRG8= <mlev>
##$CPDPRGB= <>
##$CPDPRGT= <>
##$D= (0..31)
0 1 0 0 0 0 0 0 0 0.06 0 0 0 0 0 0 0.0002 0 0 0 0 0 0 0 0 0 0 0 0 0 0 
0 
##$DATE= 1153921490
##$DBL= (0..7)
120 120 120 120 120 120 120 120 
##$DBP= (0..7)
150 150 150 150 150 150 150 150 
##$DBP07= 0
##$DBPNAM0= <>
##$DBPNAM1= <>
$$ [...]
##$SUBNAM7= <"">
##$SUBNAM8= <"">
##$SUBNAM9= <"">
##$SW= 20.6930455092707
##$SWIBOX= (0..15)
0 0 3 0 0 0 0 0 0 0 0 0 0 0 0 0 
##$SW_h= 5175.983436853
##$TD= 65536
##$TD0= 1
##$TE= 295.16
##$TE2= 300
##$TE3= 300
##$TEG= 300
##$TL= (0..7)
0 120 120 120 120 120 120 120 
##$TP= (0..7)
150 150 150 150 150 150 150 150 
##$TP07= 0
##$TPNAME0= <>
##$TPNAME1= <>
##$TPNAME2= <>
##$TPNAME3= <>
##$TPNAME4= <>
##$TPNAME5= <>
##$TPNAME6= <>
##$TPNAME7= <>
##$TPOAL= (0..7)
0.5 0.5 0.5 0.5 0.5 0.5 0.5 0.5 
##$TPOFFS= (0..7)
0 0 0 0 0 0 0 0 
##$TUNHIN= 0
##$TUNHOUT= 0
##$TUNXOUT= 0
##$USERA1= <user>
##$USERA2= <user>
##$USERA3= <user>
##$USERA4= <user>
##$USERA5= <user>
##$V9= 5
##$VALIST= <valist>
##$VCLIST= <CCCCCCCCCCCCCCC>
##$VD= 0
##$VDLIST= <DDDDDDDDDDDDDDD>
##$VPLIST= <PPPPPPPPPPPPPPP>
##$VTLIST= <TTTTTTTTTTTTTTT>
##$WBST= 1024
##$WBSW= 4
##$XGAIN= (0..3)
0 0 0 0 
##$XL= 0
##$YL= 0
##$YMAX_a= 298352
##$YMIN_a= -390633
##$ZGOPTNS= <>
##$ZL1= 120
##$ZL2= 120
##$ZL3= 120
##$ZL4= 120
##$ABSF1= 16.522
##$ABSF2= -4.171173
##$ABSG= 5
##$ABSL= 3
##$ALPHA= 0
##$AQORDER= 0
##$ASSFAC= 0
##$ASSFACI= 0
##$ASSFACX= 0
##$ASSWID= 0
##$AUNMP= <proc_1d>
##$AZFE= 0.1
##$AZFW= 0.1
##$BCFW= 0
##$BC_mod= 0
##$BYTORDP= 0
##$COROFFS= 0
##$CY= 12.5
##$DATMOD= 1
##$DC= 0
##$DFILT= <>
##$DTYPP= 0
##$F1P= 14.0000005364418
##$F2P= -0.99999901652339
##$FCOR= 0.5
##$FTSIZE= 32768
##$FT_mod= 6
##$GAMMA= 0
##$GB= 0
##$INTBC= 1
##$INTSCL= 1
##$ISEN= 128
##$LB= 0.3
##$LEV0= 0
##$LPBIN= 0
##$MAXI= 10000
##$MC2= 0
##$MEAN= 0
##$ME_mod= 0
##$MI= 0
##$NCOEF= 0
##$NC_proc= -3
##$NLEV= 6
##$NOISF1= 0
##$NOISF2= 0
##$NSP= 0
##$NTH_PI= 0
##$NZP= 0
##$OFFSET= 16.522
##$PC= 1
##$PHC0= 168.6134
##$PHC1= 6.06887
##$PH_mod= 1
##$PKNL= yes
##$PPARMOD= 0
##$PSCAL= 4
##$PSIGN= 0
##$REVERSE= no
##$SF= 250.13
##$SI= 32768
##$SIGF1= 0
##$SIGF2= 0
##$SINO= 400
##$SIOLD= 32768
##$SREGLST= <1H.CDCl3>
##$SSB= 0
##$STSI= 32768
##$STSR= 0
##$SW_p= 5175.98343685301
##$SYMM= 0
##$S_DEV= 0
##$TDeff= 65536
##$TDoff= 0
##$TI= <Analysis number 999999
Compound Code 99
Book Reference 9
Project Code 9>
##$TILT= no
##$TM1= 0
##$TM2= 0
##$TOPLEV= 0
##$USERP1= <user>
##$USERP2= <user>
##$USERP3= <user>
##$USERP4= <user>
##$USERP5= <user>
##$WDW= 1
##$XDIM= 32768
##$YMAX_p= 380061527
##$YMIN_p= -237000
$$ End of Bruker specific parameters
$$ ---------------------------------
##NTUPLES= NMR SPECTRUM
##VAR_NAME=  FREQUENCY,     SPECTRUM/REAL,   SPECTRUM/IMAG
##SYMBOL=    X,             R,               I
##VAR_TYPE=  INDEPENDENT,   DEPENDENT,       DEPENDENT
##VAR_FORM=  AFFN,          ASDF,            ASDF
##VAR_DIM=   32768,         32768,           32768
##UNITS=     HZ,            ARBITRARY UNITS, ARBITRARY UNITS
##FACTOR=    0.157963299565203, 1,           1
##FIRST=     4132.6476996994, 0,             0
##LAST=      -1043.33573715361, 0,           0
##MIN=       -1043.33573715361, -237000,     0
##MAX=       4132.6476996994, 380061527,     0
$$ Real data points
##PAGE= N=1
##DATA TABLE= (X++(R..R)), XYDATA
$$ [...]
16888G7247q7802k6923N1888K2710k2412P516k9486k3865J8229L2746l3845o5768
$$ 77247 -10555 -37478 14410 37120 14708 22224 -7262 -31127 -12898 19848 -13997 -79765
16876g9765j6645M7864L8901J2111J7276j3819j2102q853n5616j6052R817p3911
$$ -79765 -96410 -48546 -9645 2466 19742 5923 -6179 -15032 -70648 -86700 -76883 -150794
16864a50794k2868O8381L1492J6126J4376k5044L6138M1804J093R333J4678m2829
$$ -150794 -173662 -105281 -73789 -57663 -43287 -68331 -32193 9611 10704 20037 34715 -8114
16852h114j5781j6905M4393m3020l5331K8619j0841J624Q6989J7881o0721n4477
$$ -8114 -23895 -40800 3593 -39427 -74758 -46139 -56980 -55356 31633 49514 -11207 -65684
16840f5684K3926j810j4934n771m416j424M9708K4517k3152l5639M7303k4460
$$ -65684 -41758 -43568 -58502 -64273 -68689 -70113 -20405 4112 -19040 -54679 -7376 -31836
16828c1836l8673n07M3973L3281j5541P688K1797n4403M3874L1219k2818l8904
$$ -31836 -70509 -71016 -27043 6238 -9303 -1615 20182 -34221 9653 40872 18054 -20850
16816b0850k3015K4502Q3981J0594j3599o9458Q166R719l8165k1336K8490K2417
$$ -20850 -43865 -19363 64618 75212 61613 -7845 321 10040 -28125 -49461 -20971 1446
16804A446j4693J3396P1758j4667K1056o1073j7945m71J7493m567l400J8314M6172
$$ 1446 -13247 149 71907 57240 78296 17223 -722 -1193 16300 11733 8333 26647 72819
16791G2819M3350k3942r038l2638J3001K2863Q770k222m3139p9305l7228M1369
$$ 72819 116169 92227 83189 50551 63552 86415 95185 92963 49824 -29481 -66709 -25340
16779b5340O1316j4659j9962r4575J5352N9936N3455j2403N2971k3309o9234P253
$$ -25340 35976 21317 1355 -93220 -77868 -17932 35523 23120 76091 52782 -16452 -9199
16767i199K0415L1903o5594m5389o681K9288J6792M1062P8210J6785k7698k5163
$$ -9199 11216 43119 -22475 -67864 -74545 -45257 -28465 12597 90807 107592 79894 54731
16755E4731q168j1708j0498J4594l5525q1344l5210P0016Q3390J6967j8628j5547
$$ 54731 46563 34855 24357 38951 3426 -77918 -113128 -43112 40278 57245 38617 23070
16743B3070O589l1408j5333J7152J3323K4099J2030k5054m3362r187k9597j323
$$ 23070 29659 -1749 -17082 70 13393 37492 49522 24468 -18894 -28081 -57678 -59001
16731e9001J4883J8020K0043l0273M2362L4584o800m2754o431j1614n7577J3583
$$ -59001 -44118 -26098 -6055 -36328 6034 40618 33818 -8936 -15367 -26981 -84558 -70975
16719g0975J5587P3624J5362M3237k4578p279k0631J2271K5007m5889k7159L524
$$ -70975 -55388 18236 33598 76835 52257 44978 24347 36618 61625 15736 -11423 -7899
16707g899J0649p118J4049N7636j1524L781l1528J133m3759p2039n944M3686L642
$$ -7899 2750 -4368 9681 67317 55793 59574 28046 29179 -14580 -86619 -92563 -48877 -45235
16694d5235O2333K8119j2213m5209m1050L394n116O7998J9237j4113L3596J4298
$$ -45235 17098 45217 33004 -12205 -53255 -49861 -54977 13021 32258 18145 51741 66039
16682F6039l4148k8718J9266M2450m643o3672k1305k0307N929L7485N2353k2353
$$ 66039 31891 3173 22439 64889 60246 -3426 -24731 -45038 -39109 -1624 50729 28376
16670B8376L7562l1796j6951K8425m6044k7943k1091l9265k3736P9437K0631m7501
$$ 28376 65938 34142 17191 45616 -428 -28371 -49462 -88727 -112463 -33026 -12395 -59896
16658e9896n0168J02017Q894q694J4431L6021m0989K071r982n147n661J8378L2819
$$ -59896 -110064 -8047 847 -7847 6584 42605 1616 3687 -6295 -11442 -17103 1275 34094
16645C4094l8789m5153L3605m4947j0799M0744N9723P8127K346n7826l531K9451
$$ 34094 -4695 -49848 -16243 -61190 -71989 -31245 28478 106605 108951 51125 47594 77045
16633G7045n6384r4096m4838M447N8979j4797J3238m108o425M2042P565p817J7474
$$ 77045 20661 -73435 -118273 -113826 -54847 -69644 -56406 -60514 -66939 -24897 -17332 -25149 -7675
16620g675N0450K6833m1289K4471L1181k7665k8438j5595K6378k692j0993L9954
$$ -7675 42775 69608 28319 52790 83971 56306 27868 12273 38651 35959 24966 64920
16608F4920P32Q908j9373n5659k5005M9407k4892l9924l2901p332L8833N2271
$$ 64920 65652 74560 55187 -472 -25477 23930 -962 -40886 -73787 -81119 -42286 9985
16596I985l2204j8508l4247J9333M3854M4964K182L969r334j3121j1962K5311
$$ 9985 -22219 -40727 -74974 -55641 -11787 33177 35359 39328 29994 16873 4911 30222
16584C0222j3252j7093l4702k1250O1382P1206m1806J6427J1764m1054l2430j2
$$ 30222 16970 -123 -34825 -56075 5307 76513 34707 51134 62898 21844 -10586 -10598
16572a0598M2282P627L758m8819p2635K9227J5193l4739Q6937k588m5206K5667
$$ -10598 31684 39311 43069 -5750 -78385 -49158 -33965 -68704 18233 15645 -29561 -3894
16560c894M9116L756K265Q906J4211P9991k1290p8481l1288m6304k2975K1368
$$ -3894 45222 48978 51243 60149 74360 154351 133061 54580 23292 -23012 -45987 -24619
16548b4619O2n0951k6551k7084M709J07539P3899l2865m2824K7428o90J2731J8294
$$ -24619 -24557 -75508 -102059 -129143 -124434 -16895 57004 24139 -18685 8743 8053 20784 39078
16535C9078l6797J8687m2076j9495P15J9348J8660J1661l4748k4436M0511N2359
$$ 39078 2281 20968 -21108 -40603 -39888 -20540 -1880 9781 -24967 -49403 -8892 43467
16523D3467j194m951j7256n915R9387K127m1906q986j0431m4541L730K3829J4765
$$ 43467 42273 37322 20066 14151 113538 115665 73759 64773 54342 9801 13531 37360 52125
16510E2125M82L648p8800m0099K2861L5638m0836k2853K3303J0598K5523M9664
$$ 52125 52607 56255 -22545 -62644 -39783 -4145 -44981 -67834 -44531 -33933 -8410 41254
16498D1254N5485l5628N052K2172P1401n6895p7366o2545k9836k6967J9067K9209
$$ 41254 96739 61111 66163 88335 159736 102841 25475 -37070 -66906 -93873 -74806 -45597
16486d5597K6322L6614L968r0622J5674N0598L4280N8594l8335k8762J97P3586
$$ -45597 -19275 17339 21307 -69315 -53641 -3043 31237 89831 51496 22734 22931 96517
16474I6517Q313k8880k8083l2162m3435M9635K3031J4623o4083o5061M4937P1878
$$ 96517 104830 75950 47867 15705 -27730 21905 44936 59559 -4524 -69585 -24648 47230
16462D7230l8539l6526p0529j3982Q3164O5886m483o2097o1337m2904k0131M1101
$$ 47230 8691 -27835 -98364 -112346 -29182 36704 32221 -29876 -91213 -134117 -154248 -113147
16450a13147M52J5782L0489O5774l9033p5721k0420R680J7834k2705P4635N2342
$$ -113147 -112695 -96913 -66424 -650 -39683 -115404 -135824 -126144 -108310 -131015 -56380 -4038
16438d038M5789N7714j5990N49o8629q5521j7226l370M6728M0955M0308L4035
$$ -4038 41751 99465 83475 84024 15395 -70126 -87352 -90722 -43994 -3039 37269 71304
16426G1304M937J5825K2126k8267p5060r533M7199m7762p0479k6961M9099q148
$$ 71304 76241 92066 114192 85925 10865 1332 48531 769 -69710 -96671 -47572 -55720
16414e5720k898K4298P7833r220l5691j4429j4748l346m7870K7365L1942O138
$$ -55720 -58618 -34320 43513 34293 -1398 -15827 -30575 -33921 -81791 -54426 -22484 -16346
16402a6346r626o5532J6459O615J1336K4972O5288M3171o1k9856j5963J1533l829
$$ -16346 -25972 -91504 -75045 -68430 -57094 -32122 33166 76337 76276 46420 30457 41990 38161
16389C8161n412J2993J078j4995J6728j3813K0984m7090J5304r174J6360r943
$$ 38161 32749 45742 46820 31825 48553 34740 55724 8634 23938 14764 31124 21181
16377B1181N504J9243l6961l807k6125r2798n744J6565o8371K7603L5545J8441
$$ 21181 26685 45928 8967 5160 -20965 -113763 -119507 -102942 -171313 -143710 -108165 -89724
16365h9724L6629P578M0186J5863M9724j0307j4415n0344K066L4547m768L5988
$$ -89724 -53095 -45517 -5331 10532 60256 49949 35534 -14810 -12744 21803 17035 53023
16353E3023J4973l9202l1241N9396J0120o5810l757l4445j5061N599j7259q785
$$ 53023 67996 28794 -2447 56949 67069 1259 -2498 -36943 -52004 -46405 -63664 -72449
16341g2449Q770j2951L7706L4475J8012k4656k1590J4282L6241j5921o0950l5928
$$ -72449 -63679 -76630 -38924 -4449 13563 -11093 -32683 -18401 17840 1919 -59031 -94959
16329i4959L5993R246k2254o628l7084N6267M7133l0151n498P965l844K9547k0921
$$ -94959 -58966 -49720 -71974 -78602 -115686 -59419 -12286 -42437 -47935 -39970 -43814 -14267 -35188
16316c5188K1604k2311L860L2035n143J1142J9437K758j2210m2879j487J857R627
$$ -35188 -13584 -35895 -32035 0 -5143 5999 25436 28194 15984 -26895 -28382 -26525 -16898
16303a6898J8024q460j4089m2885k5542l1386o7981P0371M4608k509N7896K9100
$$ -16898 1126 -7334 -21423 -64308 -89850 -121236 -189217 -118846 -74238 -76747 -18851 10249
16291A0249j6989Q131K9172N7469k8099m6603p8780l2092O0725P2394P3830q4408
$$ 10249 -6740 1391 30563 88032 59933 13330 -65450 -97542 -36817 35577 109407 24999
16279B4999o2774J0769K8654m222J6683o156k2125l8182p626J1133K0666q869
$$ 24999 -37775 -27006 1648 -2574 14109 7953 -14172 -52354 -59980 -48847 -28181 -37050
16267c7050q972K6461J4706P661M3422K6677K5247P803l4002q0413L7834K9200
$$ -37050 -46022 -19561 -4855 2806 46228 72905 98152 105955 71953 -8460 29374 58574
16255E8574J9377l9627k709l3641l1864l9266k8579P6533M8064k7849j1440l0710
$$ 58574 77951 38324 35615 1974 -29890 -69156 -97735 -21202 26862 -987 -12427 -43137
16243d3137j5245r898j2834M868K7791N7952l6079L7903L3831p2565q9703l1980
$$ -43137 -58382 -68280 -81114 -76246 -48455 9497 -26582 11321 45152 -27413 -117116 -149096
16231a49096K546N0105L7677O6222Q491K8989O754l1864l4330k7383J9396P0633
$$ -149096 -146550 -96445 -58768 7454 15945 44934 51688 19824 -14506 -41889 -22493 48140
16219D8140O7431l5636l7075p472K0284l2522n5843o450J2200M0915K2859j2552
$$ 48140 115571 79935 42860 35388 55672 23150 -32693 -39143 -26943 13972 36831 24279
16207B4279m380j0322l414m7531o8391J5249K5240L1215K7156M1498J9357l0368
$$ 24279 19899 9577 6163 -41368 -109759 -94510 -69270 -38055 -10899 30599 49956 19588
16195A9588P895J2093K4606j5318o5801l5243K0786Q646m3066p704r960L8351
$$ 19588 27483 39576 64182 48864 -16937 -52180 -31394 -22748 -65814 -73518 -83478 -45127
16183d5127M3836N1802R274l891j0649p5759j2036k5033m3571j0202P5663O7493
$$ -45127 -1291 50511 59785 55894 45245 -30514 -42550 -67583 -111154 -121356 -45693 21800
16171B1800M6996N1316j9202m7790k1070m2978l142K5281j40O981l4815m0897
$$ 21800 68796 120112 100910 53120 32050 -10928 -14070 11211 11071 18052 -16763 -57660
16159e7660J3261K7929L9072k1445j9448R049M5327K1311k62K6790L7425l8689
$$ -57660 -44399 -16470 22602 1157 -18291 -9242 36085 57396 57134 83924 121349 82660
16147H2660q4801k1451m527k9311j7622k307O7386J9845R501O014J9035M8278
$$ 82660 -2141 -23592 -28119 -57430 -75052 -77359 -9973 9872 19373 25387 44422 92700
16135I2700k5490j3239K0202K3230J5993k9745k0784J0204o172P979m426k9889
$$ 92700 67210 53971 74173 97403 113396 83651 62867 73071 66899 74878 70452 40563
16123D0563k0476l7880m8617k1101j2941M7552O4981O2661P145k6286q095l2617
$$ 40563 20087 -17793 -66410 -87511 -100452 -52900 12081 74742 81887 55601 47506 14889
16111A4889n5825j1j6640k885P5171N7340p2818o5562o6627L5118K1918r487j034
$$ 14889 -40936 -40947 -57587 -60472 14699 72039 -779 -66341 -132968 -97850 -75932 -85419 -86453
16098h6453j2341N0216l7988m4665o564L5288M0464K1200J9053L926m7057j8184
$$ -86453 -98794 -48578 -86566 -131231 -137795 -102507 -62043 -40843 -21790 -17864 -64921 -83105
16086h3105L3113q39j8761Q22O6307N2521j5154j5221o6480l1156L6326j2787
$$ -83105 -49992 -50831 -69592 -68770 -2463 50058 34904 19683 -46797 -77953 -41627 -54414
16074e4414K8558j2359l2395R376k0579N4638J3842r0569L3436P1678n226J8377
$$ -54414 -25856 -38215 -70610 -61234 -81813 -27175 -13333 -103902 -70466 1212 -4014 14363
16062A4363L121k9969l0595J427K1630J9618n444K8204K8355o4312J3229M089
$$ 14363 17484 -12485 -43080 -41653 -20023 -405 -5849 22355 50710 -13602 -373 3716
16050C716k5230K3670K7586q425j0372J1953N4365q49o6279m3971K2897J021n3046
$$ 3716 -21514 2156 29742 21317 10945 22898 77263 76414 10135 -33836 -10939 -9918 -62964
16037f2964l9233M2623R3406L1505N68j4050K0662L3442m1030j6084m944p522
$$ -62964 -102197 -59574 33832 65337 65905 51855 72517 105959 64929 48845 43901 36379
16025C6379J6021o1875n9892k6674Q641R289K8611j1700K8132M9742j3567M950
$$ 36379 52400 -9475 -69367 -96041 -87400 -78111 -49500 -61200 -33068 16674 3107 8057
16013H057n326K4034L9134L0557p6976j2903K5366m5378p2156J3564K1335n2665
$$ 8057 2731 26765 65899 96456 19480 6577 31943 -13435 -85591 -72027 -50692 -103357
16001a03357k5502M4097O1434J572l8945k1510J9756q879N6700M6072j1664l2570
$$ -103357 -128859 -84762 -23328 -21756 -60701 -82211 -62455 -71334 -14634 31438 19774 -12796
15989a2796j2071M7398L0798J2270o1298n4837p3355j1287j3913K6028P4568L2811
$$ -12796 -24867 22531 53329 65599 4301 -50536 -123891 -135178 -149091 -123063 -48495 -15684
15977a5684m8228j5730N8379J8098J0139P010k5492n490K2213m5220K2189M7234
$$ -15684 -63912 -79642 -21263 -3165 6974 13984 -11508 -16998 5215 -40005 -17816 29418
15965B9418L3678o8830l6659K3336m495l305j067j4161k5713n5794J5863M6666
$$ 29418 63096 -5734 -42393 -19057 -23552 -26857 -27924 -42085 -67798 -123592 -107729 -61063
15953f1063K54L3673P9823J7535n323k3938j7004j3419r062l1375n0546N9300
$$ -61063 -60809 -27136 52687 70222 64899 40961 23957 10538 1476 -29899 -80445 -21145
15941b1145J0715j9826J8376Q6526J8233p96k6636m8058K3467K1823J1101j2520
$$ -21145 -10430 -30256 -11880 74646 92879 92083 65447 17389 40856 62679 73780 61260
15929F1260j7647j1078R713k9250j9785k7473j5437K8935K9054o0462O8644R822
$$ 61260 43613 32535 42248 12998 -6787 -34260 -49697 -20762 8292 -52170 16474 26296
15917B6296N4091k3684l3839J8146j3091n0996K335O0697j5300J2553M652K2964
$$ 26296 80387 56703 22864 41010 27919 -23077 -20742 39955 24655 37208 41860 64824
15905F4824m5186n3911J3147j5427o1244j7548K4232j4879n3510K6024Q4334R4555
$$ 64824 19638 -34273 -21126 -36553 -97797 -115345 -91113 -105992 -159502 -133478 -49144 45411
15893D5411M9354l3476n9620p53M2047m5824L9048q332j2902Q39L8612j6783k2156
$$ 45411 94765 61289 1669 916 42963 -2861 36187 27855 14953 15792 54404 37621 15465
15880A5465K6250L8334l78j3480o7122J100K8500r356L4920O988r77k1992j055
$$ 15465 41715 80049 79671 66191 -931 169 28669 19313 54233 61221 60244 38252 37197
15867C7197j3826L0833J2236n4094J4560j447j6648M4562k0022l3341O655j3468
$$ 37197 23371 54204 66440 12346 26906 25459 8811 53373 33351 10 6665 -6803
15855f803Q601l724o134J8147o510k2943m9517J2940K3626K5479N0208q880k1577
$$ -6803 1798 -1926 -8060 10087 3577 -19366 -68883 -55943 -32317 -6838 43370 34490 12913
15842A2913k7885L0098K3520n8363o5472k2411N5560P2111K5104l4508J8052l6403
$$ 12913 -14972 15126 38646 -19717 -85189 -107600 -52040 20071 45175 10667 28719 -7684
15830g684m8181K2061M3941K6274K2323n0230m9081o7445k4370Q7896R778l4259
$$ -7684 -55865 -33804 10137 36411 58734 8504 -40577 -108022 -132392 -44496 -34718 -68977
15818f8977k7255l2333n32j9294K3313P0524N4913j8197q751N658K1944K473K0792
$$ -68977 -96232 -128565 -129097 -148391 -125078 -54554 359 -17838 -26589 -20931 1013 3486 24278
15805B4278K7252O9385l615j10521o0488k9260l1804m227n3199j9232J01005P4531
$$ 24278 51530 120915 117300 6779 -53709 -82969 -114773 -119000 -172199 -191431 -90426 -15895
15793a5895K0825K3315j4319p9946K2729M1847J7459k7361J5041O43j6783l2759
$$ -15895 4930 28245 13926 -66020 -43291 -1444 16015 -11346 3695 4338 -12445 -45204
15781d5204m2532K0250J3994n1948K4212j972j5482J4492J8234K4550l3831j760
$$ -45204 -87736 -67486 -53492 -105440 -81228 -83200 -98682 -84190 -65956 -41406 -75237 -76997
15769g6997j2313M109M6997N8882l7137m516L1352r766K0643k2974M58K4942j9607
$$ -76997 -89310 -85201 -38204 20678 -16459 -20975 10377 611 21254 -1720 -1262 23680 4073
15756D073o950j4517L233m3941K406Q0761R299n0873j1934k009r095n074k3358
$$ 4073 -2877 -17394 -14161 -58102 -55696 25065 34364 -16509 -28443 -30452 -39547 -44621 -67979
15743f7979M84K5148J4398l0912n566K5551O4353m406j2959k3445M2755N9707
$$ -67979 -67495 -42347 -27949 -58861 -64427 -38876 25477 21071 8112 -15333 27422 87129
15731H7129K676k850j5143o3069o9390j1096k0706K2663K4636J2903K8329J7847
$$ 87129 89805 86955 71812 8743 -60647 -71743 -92449 -69786 -45150 -32247 -3918 13929
15719A3929m0812J0171Q270K5349l391j549l1659k4268J3826J7202j9252K2094
$$ 13929 -26883 -16712 -8442 16907 13516 11967 -19692 -43960 -30134 -12932 -32184 -10090
15707a0090k9231l9299M9342N8922J7482j9523R514J821o5228j5971O7666J7006
$$ -10090 -39321 -78620 -29278 29644 47126 27603 37117 38938 -26290 -42261 25405 42411
15695D2411n6431L8076K2691k423k3689j4418j3223K3953L7891Q7309L5328m3100
$$ 42411 -14020 24056 46747 44324 20635 6217 -7006 16947 54838 142147 177475 134375
15683A34375o9908q6723p2963R2298M6342P268o7482m2312O853N2179k6607K2239
$$ 134375 64467 -22256 -95219 -2921 43421 50689 -16793 -59105 -52252 -73 -26680 -4441
15671d441P604j9921K8696k0596o1407J9145M4158k0513l4690k7299l7553L3574
$$ -4441 3163 -16758 11938 -8658 -70065 -50920 -6762 -27275 -61965 -89264 -126817 -93243
15659i3243J31556P1331o4437m431k6566r636l8098p331j4055k5123M429p7241
$$ -93243 38313 109644 45207 40776 14210 4574 -33524 -40855 -54910 -80033 -75604 -152845
15647a52845L3153O2293N1665j6808K1632Q391o6632K1697R2637J1937j9174m8710
$$ -152845 -119692 -57399 -5734 -22542 -910 7481 -59151 -37454 55183 67120 47946 -764
15635g64R263M58k251r9758l0106J3514N1941j34J6737j0944L0486O702l3286
$$ -764 8499 8957 6706 -93052 -123158 -109644 -57703 -57837 -41100 -52044 -21558 -14856 -48142
15622d8142n5817j5733Q4732N5673l8606k5974M0062J3230J9070k073l3621L199
$$ -48142 -103959 -119692 -34960 20713 -17893 -43867 -3805 9425 28495 26422 -7199 -4000
15610d000K0987O3077q4487m3272O5636L8370j5271O293M474k9553M94k7482o2658
$$ -4000 16987 80064 -4423 -47695 17941 56311 41040 47333 51807 22254 22748 -4734 -67392
15597f7392j9630j053L3748N7109J1474L4144m4260l6468K4642J0066n991M9154
$$ -67392 -87022 -88075 -54327 2782 14256 48400 4140 -32328 -7686 2380 -3611 45543
15585D5543J6091n4791j254k2682l4975P2065M1722m4743N3691R56P677k8641
$$ 45543 61634 6843 5589 -17093 -52068 19997 61719 16976 70667 71623 79300 50659
15573E0659O722l6797o9965J5968M2214K4365K8017n6895m5010n6356K9822L702
$$ 50659 57381 20584 -49381 -33413 8801 33166 61183 4288 -40722 -97078 -67256 -63554
15561f3554k3342m604K2831M6082M671N7565N9116N297j248m5728r096P457l7781
$$ -63554 -86896 -91500 -68669 -22587 -17916 39649 98765 104062 102814 57086 47990 55447 17666
15548A7666j14755k5705O3423M3117L2075l9645m4353j8513K9682P080N9666l9776
$$ 17666 -97089 -122794 -59371 -16254 15821 -23824 -68177 -86690 -57008 -49928 9738 -30038
15536c0038n078M7163j3748j8958N4008r024q3145r6548M9378Q3733L3864l9123
$$ -30038 -35116 12047 -1701 -20659 33349 24325 -58820 -155368 -105990 -22257 11607 -27516
15524b7516J7133J0235N6426K1897l5937l4912p0117p2330l9234M7918p191L1120
$$ -27516 -10383 -148 56278 78175 42238 7326 -62791 -135121 -174355 -126437 -133628 -102508
15512a02508J13592k0923k1107J9936j5823l5851R8693K0409j3427k2431j0609
$$ -102508 11084 -9839 -30946 -11010 -26833 -62684 36009 56418 42991 20560 9951
15501I951K3887l923K1333J74j6001p2882l7001M9830o08R512J5542N7748J3583
$$ 9951 33838 29915 51248 51422 35421 -37461 -74462 -24632 -25240 -15728 -186 57562 71145
15488G1145j5531k0328k2789M2736m9405j9630O3498l0419n4021J0918q419k4449
$$ 71145 55614 35286 12497 55233 5828 -13802 49696 19277 -34744 -23826 -32245 -56694
15476e6694L1325L2897p064l8563k3477J8879L3939q30P623j0635N7946r691K6354
$$ -56694 -25369 7528 464 -38099 -61576 -42697 -8758 -9588 -1965 -12600 45346 35655 62009
15463F2009K1611M28j9445l2837m0355j4424K8925j771J6014N1573O5292L5181
$$ 62009 83620 84048 64603 31766 -8589 -23013 5912 4141 20155 71728 137020 172201
15451A72201l3927n0171m0109n5965K8733n716j4900l6367q840M1076M3808l2447
$$ 172201 138274 88103 47994 -7971 20762 15046 146 -36221 -45061 -3985 39823 7376
15439G376j8307N7990j615K3702N178J1643l767k2033M3753m346l9990j3054L3484
$$ 7376 -10931 47059 45444 69146 74324 85967 82200 60167 103920 99574 59584 46530 80014
15426H0014q1100o8927k3821P1295P4721j2922k9015l2005J8585K8278L2829j5220
$$ 80014 -1086 -70013 -93834 -22539 52182 39260 10245 -21760 -3175 25103 57932 42712
15414D2712o817l4709L9478m898l1553o46j3336l48l8303M205m0819j642K3425
$$ 42712 35895 1186 40664 35766 4213 3567 -9769 -10117 -48420 -44215 -85034 -86676 -63251
15401f3251j2828N0718R1851n219l5043l3991k0774K7611K8723m7763l0290k4277
$$ -63251 -76079 -25361 66490 61271 26228 -7763 -28537 -926 27797 -19966 -50256 -74533
15389g4533O466J8819L534M347j2687o062L4702J9224P570L8250k9989l206l9730
$$ -74533 -68067 -49248 -45714 -41367 -54054 -60116 -25414 -6190 1380 39630 9641 6435 -33295
15376c3295p5130N8079J1935j7336k3863L9005O140J3296K2731k6376j0833L2190
$$ -33295 -108425 -50346 -38411 -55747 -79610 -40605 -34465 -21169 1562 -24814 -35647 -3457
15364c457J251k2201o68P277K9030J0761k1768J0540n4933J9632k1959r445O9167
$$ -3457 -2206 -24407 -25075 -17798 11232 21993 225 10765 -44168 -24536 -46495 -55940 13227
15351A3227K7811o5238m6871J3823L5279M4145J053J9955k4545K725o502k1620
$$ 13227 41038 -24200 -71071 -57248 -21969 22176 23229 43184 18639 21364 14862 -6758
15339f758O9629l5247M105K8629n1787q6930m1628J7545N704M1910L833k8545
$$ -6758 62871 27624 31729 60358 8571 -78359 -119987 -102442 -96738 -54828 -50995 -79540
15327g9540J1271j1871K2187K750K2821J34934K9372p1869k21l6599p4118m2796
$$ -79540 -68269 -80140 -57953 -55203 -32382 102552 131924 60055 59834 23235 -50883 -93679
15315i3679l503L86O5266M4693j903j4389J8182L6317j8184l6449l0820j7037
$$ -93679 -97182 -96796 -31530 13163 11260 -3129 15053 51370 33186 -3263 -34083 -51120
15303e1120m5437N2789O472N1431J8445K098k0971O8049J409K978j1546o2161
$$ -51120 -96557 -43768 -37296 14135 32580 34678 13707 81756 83165 86143 74597 12436
15291A2436l2110k4452m6270Q0307R1134m895n0173O807O5963l6806q3941l9743
$$ 12436 -19674 -44126 -90396 -10089 81045 76150 25977 32784 98747 61941 -22000 -61743
15279f1743j1087J4195L1683L63j7507L0137J1252K2190k8144K9545K1016L9295
$$ -61743 -72830 -58635 -26952 -26589 -44096 -13959 -2707 19483 -8661 20884 41900 81195
15267H1195M539j3509M8113r225r2248p4976N381L181q844l287O1218k593Q827
$$ 81195 85734 72225 120338 111113 18865 -56111 -50730 -47549 -56393 -59680 1538 -1055 7772
15254G772M7044r279Q0660M9432l7270o8236p4217n8074L1529N2224j7885l5801
$$ 7772 54816 45537 126197 175629 138359 70123 -4094 -62168 -30639 21585 3700 -32101
15242c2101j4025M6853M0149L3193J1734j28850q0474M9796P1996J9884o746l4367
$$ -32101 -46126 727 40876 74069 85803 -43047 -123521 -73725 -1729 18155 11409 -22958
15230b2958m5968P1775J3740m1554m111n6184Q466M104p95K8305n233J7577L2777
$$ -22958 -68926 2849 16589 -24965 -29076 -85260 -76794 -72690 -73485 -45180 -50413 -32836 -59
15217e9R993K0006l6521m5909k1281L7228O0172r363j6666k0397k3099L1140L3774
$$ -59 9934 29940 -6581 -52490 -73771 -36543 23629 14266 -2400 -22797 -45896 -14756 19018
15204A9018j9726P640Q291k5943L2518L3390K6324J1365j8154m7254J1951j4162
$$ 19018 -708 6932 15223 -10720 21798 55188 81512 92877 74723 27469 39420 25258
15192B5258k6263k6848n369J7369l0196k3959J5689M8516K2863J2957j7381l0244
$$ 25258 -1005 -27853 -33222 -15853 -46049 -70008 -54319 -5803 17060 30017 12636 -17608
15180a7608L5080N2288J2041j4771m8284l7987o8871q321N0935L1856Q2079q938
$$ -17608 17472 69760 81801 67030 18746 -19241 -88112 -96433 -45498 -13642 68437 59499
15168E9499n4295j700k4481k5734l1287M9914O209l95L1013J0015j6779K2758
$$ 59499 5204 3504 -20977 -46711 -77998 -28084 -21875 -22270 8743 18758 1979 24737
15156B4737j6682n6130J3389k8653L8911K9324m1775l508M5679O6715L0876p7701
$$ 24737 8055 -48075 -34686 -63339 -24428 4896 -36879 -40387 5292 72007 102883 25182
15144B5182l6807j2571n4209J3009L7103L8685q580J0093r415j2003k139j2583
$$ 25182 -11625 -24196 -78405 -65396 -28293 10392 1812 11905 2490 -9513 -11652 -24235
15132b4235k2174J2000J7702J2914o885k2026l887O347k0441k4594k4752j6764
$$ -24235 -46409 -34409 -16707 -3793 -10678 -32704 -36591 -30244 -50685 -75279 -100031 -116795
15120a16795N2752R5228Q8968k3350J9304J2185P956k5397n0892n134n728o9990
$$ -116795 -64043 31185 120153 96803 116107 128292 136248 110851 59959 54825 49097 -20893
15108b0893l6465J5299j9860k1370K2731P2210J6163m5320M0779K5030m6873m3353
$$ -20893 -57358 -42059 -61919 -83289 -60558 11652 27815 -17505 23274 48304 1431 -41922
15096d1922M870K3434N144P2321J663p652m5978q9301L838O5575J7582n2125J143
$$ -41922 -37052 -13618 -8474 63847 65510 57858 11880 -77421 -73583 -8008 9574 -42551 -41408
15083d1408O575R73K7994L1986m2734n7387k3218K082j4569J348J3747M8809n032
$$ -41408 -34833 -33860 -5866 26120 -16614 -74001 -97219 -95137 -109706 -108358 -94611 -45802 -50834
15070e0834K7573j7538J169J06965J0371l2978Q164j1977K3211P630j1359l2590
$$ -50834 -23261 -40799 -39630 67335 77706 44728 52892 40915 64126 71756 60397 27807
15058B7807N955J0036M5056p036p667o9346J0089o0384j19436l2191Q0757R6826
$$ 27807 33762 43798 88854 81818 74151 4805 14894 -45490 -164926 -197117 -116360 -19534
15046a9534N450m1849N156Q331j8122n667j4736k9728K7102L3121J5909m079k5082
$$ -19534 -14084 -55933 -50777 -42446 -60568 -66235 -80971 -110699 -83597 -50476 -34567 -38646 -63728
15033f3728M458j8901J0335L8529M611n108J0408J7246J5733M3948n8420K2695
$$ -63728 -59270 -78171 -67836 -29307 -24696 -29804 -19396 -2150 13583 57531 -889 21806
15021B1806O7543K1608q0607q8976j04497k0649M1425J7240L7202J6163N5264
$$ 21806 89349 110957 30350 -58626 -163123 -183772 -142347 -125107 -87905 -71742 -16478
15010a6478O2515K0715l4550k9934n3426M3186J043k3847o3556P017q729m0094
$$ -16478 46037 66752 32202 2268 -51158 -7972 -6929 -30776 -94332 -87315 -96044 -136138
14998a36138M6952Q5450j3922n2403k11M9739j206q961k3581K8917K7871j2979
$$ -136138 -89186 -3736 -17658 -70061 -70272 -20533 -21739 -30700 -54281 -25364 2507 -10472
14986a0472L0004l8649k7413N1702j1426m6589J3976M0172O3214L4373o1905J1926
$$ -10472 19532 -19117 -46530 5172 -6254 -52843 -38867 1305 64519 98892 36987 48913
14974D8913m7636j4150l58l377O2463M6496k6415l3430l5356o3842J3706O056
$$ 48913 1277 -12873 -13231 -16608 45855 92351 65936 32506 -2850 -66692 -52986 -46930
14962d6930l334J6692n728k6912J635j8573K6371M0261J4915L3062L8314K7419
$$ -46930 -50264 -33572 -39300 -66212 -64577 -83150 -56779 -16518 -1603 31459 69773 97192
14950I7192r435n7575Q736L8507j1269K4033r5170n2452N1163M8079L6730R099
$$ 97192 87757 30182 38918 77425 66156 90189 -4981 -57433 -6270 41809 78539 87638
14938H7638l2718l0862j8132k4080K3688K9766k3776n456K3757j2105l1194j7953
$$ 87638 54920 24058 5926 -18154 5534 35300 11524 6068 29825 17720 -13474 -31427
14926c1427L1656P91J5896J3659j322m9884l199L0150M584Q634k3701o4104m3748
$$ -31427 229 1020 16916 30575 29253 -20631 -23830 6320 10904 19538 -4163 -68267 -112015
14913a12015J8093L0449K2554N3366L246k6389o1391n5592L6411J8157N235J9080
$$ -112015 -93922 -63473 -40919 12447 15693 -10696 -72087 -127679 -91268 -73111 -67876 -48796
14901d8796l0484p120O5594K7652k9202l0549Q405Q169p600J1417J2508M779L6612
$$ -48796 -79280 -86400 -20806 6846 -22356 -52905 -44500 -36331 -43931 -32514 -20006 -15227 21385
14888B1385K7650j2644m2378l4859j771n9603J9919l1066L0024O3631j9376n3517
$$ 21385 49035 36391 -5987 -40846 -42617 -102220 -82301 -113367 -83343 -19712 -39088 -92605
14876i2605K5491P7635M5003J2676p3218l4848p114L3466k296L328O432L0472
$$ -92605 -67114 10521 55524 68200 -5018 -39866 -46980 -13514 -15810 -12482 -6050 24422
14864B4422K4906k1726l0511K0168p480j081n5567m432m521N1662M4404M1439
$$ 24422 49328 27602 -2909 17259 9779 8698 -46869 -51301 -55822 -4160 40244 81683
14852H1683k3749j6021m5744k5200M6069p3924j22265k2947P6378R7076q011K7350
$$ 81683 57934 41913 -3831 -29031 17038 -56886 -179151 -202098 -125720 -28644 -36655 -9305
14840i305N4654K0232j7492P728k0094o5554o4984L8174K5761J6693L992K5297
$$ -9305 45349 65581 48089 55817 35723 -29831 -94815 -56641 -30880 -14187 -10195 15102
14828A5102P344Q363M083k8152M1875J0461m6480k929J9484p29L497K4209N69
$$ 15102 22446 30809 34892 6740 48615 59076 12596 9667 29151 28422 31919 56128 56697
14815E6697q905K1497K9948O36o8447l4560P0109L9596m0783l9051K625M501n427
$$ 56697 47792 69289 99237 99873 31426 -3134 66975 106571 65788 26737 29362 33863 28436
14802B8436j3432O211O810j2158L7581k2568n6500k9535M3730M002k7233J5504
$$ 28436 15004 21215 28025 15867 53448 30880 -25620 -55155 -11425 -7423 -34656 -19152
14790a9152P5954j9363l439O898M5719K180o5146j2450N4061P1246J6592n1162
$$ -19152 56802 37439 34000 40898 86617 88797 23651 11201 65262 136508 153100 101938
14778A01938m4641m1842o5099m4932O8125N357n3272L780L8906K3515J3890P6107
$$ 101938 57297 15455 -49644 -94576 -26451 -21094 -74366 -70586 -31680 -8165 5725 81832
14766H1832M0555j8680j9421k0792j9703K4368j9053l4016m4645k0797l63l620
$$ 81832 122387 103707 84286 63494 43791 68159 49106 15090 -29555 -50352 -50715 -54335
14754e4335l3767j8399N522L0512K2501J7523K4222L4876J7011k1326k1753n0425
$$ -54335 -88102 -106501 -100979 -70467 -47966 -30443 -6221 28655 45666 24340 2587 -47838
14742d7838j410N3470L7021o346J9439j2220m3427l9413l7503L6971K4960j0730
$$ -47838 -49248 4222 41243 34897 54336 42116 -1311 -40724 -78227 -41256 -16296 -27026
14730b7026N3849j2891k8268J0889L6979l7624k6988k375j6781J5717k909k4690
$$ -27026 26823 13932 -14336 -3447 33532 -4092 -31080 -33455 -50236 -34519 -37428 -62118
14718f2118l3448n2126J4218R0009P3559n1560l2032N235N5163L2915l9901m8776
$$ -62118 -95566 -147692 -133474 -43465 30094 -21466 -53498 -48263 6900 39815 -86 -48862
14706d8862M0834N082l9914O381N8078j4856m5273j7411M7706M743j339j3971
$$ -48862 -8028 -2946 -42860 -36479 21599 6743 -38530 -55941 -8235 -3492 -4831 -18802
14694a8802l4654l7334J9764M3600j2949r61K3132L9877k233j3438L5667k2107
$$ -18802 -53456 -90790 -71026 -27426 -40375 -41336 -18204 21673 19440 6002 41669 19562
14682A9562N723p680k5336K1768R741j1171k8073q65j5342P534M0542J9105k5964
$$ 19562 25285 17605 -7731 14037 23778 12607 -15466 -16331 -31673 -24139 16403 35508 9544
14669I544J3421K4183j4544j8633K8564k4599q529J9657K604l5518K1723q96K9356
$$ 9544 22965 47148 32604 13971 42535 17936 9407 29064 31668 -3850 17873 16977 46333
14656D6333O0227k9854j0689Q349k6759m3049k8303M1597L019m4357p3263J0132
$$ 46333 106560 76706 66017 74366 47607 4558 -23745 17852 20871 -23486 -96749 -86617
14644h6617K8524N1358o594k1288L7938L0817k0110K3709k8146J0778M7811L6792
$$ -86617 -58093 -6735 -13329 -34617 3321 34138 14028 37737 9591 20369 68180 104972
14632A04972j4617k7429q946Q3991j2709m4345l5538m930l3394l8404L8613K3132
$$ 104972 90355 62926 53980 137971 125262 80917 45379 40449 7055 -31349 7264 30396
14620C0396m0255L1447L858l0055l4013k1806J1209J1913J2912k6293K0600n399
$$ 30396 -9859 21588 25446 -4609 -38622 -60428 -49219 -37306 -24394 -50687 -30087 -35486
14608c5486J5411Q4701j4370j4104k6218m0044k8299l7908j1475L6365K3534J6107
$$ -35486 -20075 64626 50256 36152 9934 -30110 -58409 -96317 -107792 -71427 -47893 -31786
14596c1786l121q895N4762j2946J2006k2064j4417L1190J1854j1404L8240M2436
$$ -31786 -34907 -43802 10960 -1986 10020 -12044 -26461 4729 16583 5179 43419 85855
14584H5855p561l6980n5870R855j69J9980o218n0183O348P329j47k4859L646J1930
$$ 85855 78294 41314 -14556 -4701 -4870 15110 8892 -41291 -34943 -27614 -27761 -52620 -48974 -37044
14570c7044K0063P1239n3330l0952k5609m409l1431k6636J4839L0952p216k994
$$ -37044 -16981 54258 928 -30024 -55633 -60042 -91473 -118109 -103270 -72318 -79534 -82528
14558h2528J11932O1200r513j29033m0141J7787K8330K2835m963j7269m6051J2716
$$ -82528 29404 90604 81091 -47942 -88083 -70296 -41966 -19131 -24094 -41363 -87414 -74698
14546g4698O9428k115l7469J4326J4950k5363k8333M9377K7567J912m0487K500
$$ -74698 -5270 -7385 -44854 -30528 -15578 -40941 -69274 -19897 7670 9582 -30905 -28405
14534b8405J0536o1251j9909L2238Q347O127R266M8572L539o0506J774M4965k2650
$$ -28405 -17869 -79120 -99029 -66791 -58444 -52317 -43051 5521 9060 -51446 -49672 -4707 -27357
14521b7357J642N4209M7754K5823K7906L0039r2772k3281o4844r317R086l784
$$ -27357 -25715 28494 76248 102071 129977 160016 67244 43963 -20881 -30198 -21112 -24896
14509b4896P934L8272J0749p2118j4457M6861L0139m5307J8084K6048J4813P103
$$ -24896 -16962 21310 32059 -40059 -54516 -7655 22484 -22823 -4739 21309 36122 43225
14497D3225n3815o4423j1213N7314j4038n159K8261l7558J3352p29M1640K9062
$$ 43225 -10590 -75013 -86226 -28912 -42950 -48109 -19848 -57406 -44054 -44783 -3143 25919
14485B5919K3243r318k191J5226j0295K4437m4041q5070l9705K8637N4860o4595
$$ 25919 49162 39844 37653 52879 42584 67021 22980 -62090 -101795 -73158 -18298 -82893
14473h2893j2066O5697N9705L5329J67j3681m7775m2929p5262j857N801P0019
$$ -82893 -94959 -29262 30443 65772 65939 52258 4483 -38446 -113708 -115565 -109764 -39745
14461c9745L8171n9135K3802N9056K3086j9625K7584m3402j2423k5327N7931j480
$$ -39745 -1574 -60709 -36907 22149 45235 25610 53194 9792 -2631 -27958 29973 28493
14449B8493n562j7260n0701k9547M33L7942l3763R79P7685K1790o0212J1314J8646
$$ 28493 22931 5671 -45030 -74577 -74144 -36202 -69965 -68986 8699 30489 -29723 -18409 237
14436B37l500L9495m1641j2836N4762n9268k1006J2058k6006k700J07244J9237
$$ 237 -3263 36232 -5409 -18245 36517 -22751 -43757 -31699 -57705 -60405 46839 66076
14424F6076m1455J4033k1679l8537k3074J2062k3276R005p0063J8893M4992J3119
$$ 66076 24621 38654 16975 -21562 -44636 -32574 -55850 -46845 -116908 -98015 -53023 -39904
14412c9904k2018n3631J9441M9611N9097j2153N674p4791K3662J5224m301m388
$$ -39904 -61922 -115553 -96112 -46501 12596 443 6117 -68674 -45012 -29788 -34089 -38477
14400c8477J5602M5748P9322K5015l1914p3044J421Q232L5428j3607n3074l9740
$$ -38477 -22875 22873 102195 127210 95296 22252 23673 31905 67333 53726 652 -39088
14388c9088r232K5220j4445J2782K1075L3572J1927J0280M935l3783l5805j8319
$$ -39088 -48320 -23100 -37545 -24763 -3688 29884 41811 52091 57026 23243 -12562 -30881
14376c0881k5737l0494j5811N1762K7519n4778j7227R364J2324n1178j8155N0650
$$ -30881 -56618 -87112 -102923 -51161 -23642 -78420 -95647 -86283 -73959 -125137 -143292 -92642
14364i2642R7014K5249n0794K1546k2877k29j7321n084o1307J8354J9522N5315
$$ -92642 4372 29621 -21173 373 -22504 -22733 -40054 -45138 -106445 -88091 -68569 -13254
14352a3254J7083k0013j4787l5409J1962K3237k9706l2929m316K758k6482L5006
$$ -13254 3829 -16184 -30971 -66380 -54418 -31181 -60887 -93816 -98132 -95374 -121856 -86850
14340h6850O3512O6406P132J715m2609o8435k6004M7325O0459J9378Q071k3557
$$ -86850 -23338 43068 50200 51915 9306 -59129 -85133 -37808 22651 42029 50100 26543
14328B6543k0554m0666j2176K42Q666L1745L399l5256M1216J0862j8349m0338
$$ 26543 5989 -34677 -46853 -46611 -37945 -6200 -2801 -38057 3159 14021 -4328 -44666
14316d4666k7776J6057P0956L898n0463r1577j015K6827n022L7099m645J8090
$$ -44666 -72442 -56385 14571 18469 -31994 -123571 -124586 -97759 -102781 -65682 -70327 -52237
14304e2237N1257P302K2421l8399l6088k5552K7387M6869L0733L5641M5920M252
$$ -52237 -980 6322 28743 -9656 -45744 -71296 -43909 2960 33693 69334 115254 119506
14292A19506k4628p5282n2839m3745Q141o669m3109J9106K7904M3070k7551j0748
$$ 119506 94878 19596 -33243 -76988 -68847 -75516 -118625 -99519 -71615 -28545 -56096 -66844
14280f6844J3742n7696N0732k2135r149M5541Q529j0331K3903l6966l0986j4831
$$ -66844 -53102 -110798 -60066 -82201 -91350 -45809 -37280 -47611 -23708 -60674 -91660 -106491
14268a06491L4250M2117J4569j25J3733L6768N0846K6314l6436p8847Q783M7566
$$ -106491 -72241 -30124 -15555 -15680 -1947 34821 85667 111981 75545 -3302 5481 53047
14256E3047m8423n2498o794k9287J4890K56N996k5772q955o890k2250k5429J6171
$$ 53047 4624 -47874 -54668 -83955 -69065 -68809 -62813 -88585 -97540 -104430 -126680 -152109 -135938
14243a35938K1357J2304J3505O584P227J1111N0686M5697L480K9262k9978l7584
$$ -135938 -114581 -102277 -88772 -82188 -74961 -63850 -13164 32533 36013 65275 35297 -2287
14231b287Q260L2751J0559l1484n690m2128J3870L8785K5860o6918n682K5003
$$ -2287 5973 38724 49283 17799 12109 -30019 -16149 22636 48496 -18422 -24104 899
14219H99k8771M5278q75q417l227M7273J5929J847j1763m1528l0693N931J2642
$$ 899 -27872 17406 16531 8114 4887 52160 68089 69936 58173 16645 -14048 -8117 4525
14206D525J6240o206j8539k5129j70p674k6485M3584J8040M918q761R728K7145
$$ 4525 20765 14559 -3980 -29109 -29279 -36953 -63438 -19854 -1814 3104 -5657 4071 31216
14193C1216K5864K4133l1109m6574j3342n185K5587P351m5388O824L8515K0771
$$ 31216 57080 81213 50104 3530 -9812 -14997 10590 17941 -27447 -20623 17892 38663
14181C8663n5673j9561L7852J325r435K5961J7465n5877l9783J3954J9686k9274
$$ 38663 -17010 -36571 1281 2606 -6829 19132 36597 -19280 -59063 -45109 -25423 -54697
14169e4697K1039q592N718j5913j6960K5569L1477P2089k0444p648o8655K6912
$$ -54697 -33658 -42250 -36532 -52445 -69405 -43836 -12359 59730 39286 31638 -37017 -10105
14157a0105k5831L280k2560M8526J7681K2366J5476K6604n545p0802O552l4423
$$ -10105 -35936 -32656 -55216 -6690 10991 33357 48833 75437 69892 -910 5642 -28781
14145b8781k9389J265J3851n6948K5192J5432K6941N9059Q991J3906L0378K981
$$ -28781 -58170 -56905 -43054 -100002 -74810 -59378 -32437 26622 35613 49519 79897 82878
14133H2878M020K571k6532n9792l2693o0172n3210K2413K3686L4610l8067j8439
$$ 82878 86898 89469 62937 3145 -29548 -89720 -142930 -120517 -96831 -62221 -100288 -118727
14121a18727M2409N0715L5684L8921L0460l1414m2868k4289j0667N495K7790Q13
$$ -118727 -76318 -25603 10081 49002 79462 48048 5180 -19109 -29776 -24281 3509 4322
14109D322N2316M1351p6934k9774n8263l6530J5560Q2283M4048Q909r054N574
$$ 4322 56638 97989 21055 -8719 -66982 -103512 -87952 -5669 38379 47288 38234 43808
14097D3808j5664L6460K9919m964l425l2225m9985l5452k4075j7832j548K4493
$$ 43808 28144 64604 94523 89559 86134 53909 3924 -31528 -55603 -73435 -74983 -50490
14085e0490J924p224L6754L5846m0596k8620M817K5160Q768l7596K5481L6497
$$ -50490 -48566 -55790 -19036 16810 -23786 -52406 -47589 -22429 -13661 -51257 -25776 10721
14073A0721L6320m61k3291p255n6116n617N753N6357q826l0129N8306r134p3047
$$ 10721 47041 46580 23289 16034 -40082 -45699 -39946 16411 7585 -22544 35762 26628 -46419
14060d6419J0839N1753J0805l3343l5331k1301M1829N2238j3851J6398l077j4920
$$ -46419 -35580 16173 26978 -6365 -41696 -62997 -21168 31070 17219 33617 30540 15620
14048A5620k8885l0523M3823L4068J0329k6669L7960j7281l4305M8247j4237k2922
$$ 15620 -13265 -43788 35 34103 44432 17763 55723 38442 4137 52384 38147 15225
14036A5225J3895J1028j920l7846J0522L6342N726n760m6849L9564k9433j09579
$$ 15225 29120 40148 38228 382 10904 47246 52972 47212 363 39927 10494 -99085
14024i9085K6945Q4117L7198k954K4772j3058n2092l9776J4872k123j5477j004
$$ -99085 -72140 11977 49175 46221 70993 57935 5843 -33933 -19061 -21184 -36661 -37665
14012c7665K81p588k5261l538K1339M8100J5622K2397l7126o4207J4136M609J0060
$$ -37665 -37384 -44972 -70233 -73771 -52432 -4332 11290 33687 -3439 -67646 -53510 -48901 -38841
13999c8841n69j4406K9708M1429K300l9311Q525N5691P009o3865p7902M6883Q6624
$$ -38841 -39410 -53816 -24108 17321 19621 -19690 -11165 44526 51535 -12330 -90232 -43349 43275
13986D3275q5844m4525N1161N8099Q429K3480o2919l4247l273k5721n84J9281
$$ 43275 -42569 -87094 -35933 22166 30595 54075 -8844 -43091 -46364 -72085 -72669 -53388
13974e3388K4728L0787L6894l9106l1838N0410J1022p1072p5139k5911j3601q886
$$ -53388 -28660 2127 39021 -85 -31923 18487 29509 -41563 -116702 -142613 -156214 -165100
13962a65100K1238j2001L7274M9980L790O4464N4576L2777L939k8035j3743N9668
$$ -165100 -143862 -155863 -118589 -68609 -64819 -355 54221 86998 90937 62902 49159 108827
13950A08827L2583l3240p0068l9754l932r032j5336N576n707m5991K1857K8924
$$ 108827 141410 108170 38102 -1652 -5584 -14616 -29952 -24376 -30083 -76074 -54217 -25293
13938b5293l9859L148J9954M2443J4113k3485n5558J6118K8597L5024k3579m675
$$ -25293 -65152 -62004 -42050 393 14506 -8979 -64537 -48419 -19822 15202 -8377 -13052
13926a3052j8262r095K410L9408N4672j825o6844O487L3978Q0792r0556k0770
$$ -13052 -31314 -40409 -37999 1409 56081 54256 -12588 -6101 27877 108669 18113 -2657
13914b657j2898P0403j7821q0049J8119L8560l5341j5595J1104N8545P3173L7370
$$ -2657 -15555 54848 37027 -43022 -24903 13657 -21684 -37279 -26175 32370 105543 142913
13902A42913l9521n151o850m0689j2494K5824L4998l3148m8270k4977J4103j8291
$$ 142913 103392 98241 91391 50702 38208 64032 99030 65882 17612 -7365 6738 -11553
13890a1553k9478o4608j479O6125P1246l2144k2140k3296l4137N2207J7241n2434
$$ -11553 -41031 -105639 -107118 -40993 30253 -1891 -24031 -47327 -81464 -29257 -12016 -64450
13878f4450n17K6384K9704N1094J2048n1349o279J3163n9029P8263k0735l5277
$$ -64450 -64967 -38583 -8879 42215 54263 2914 -3365 9798 -49231 29032 8297 -26980
13866b6980M0229j2571L0661L5127K4919o5485K663m052l0593L7180l6220p668
$$ -26980 13249 678 31339 66466 91385 25900 28563 24511 -6082 31098 -5122 -12790
13854a2790O1245N5343o2462p9534j6436P2219M2193l6906n4341j8690L4584m7335
$$ -12790 48455 103798 41336 -38198 -54634 17585 59778 22872 -31469 -50159 -15575 -62910
13842f2910l7091R719K5987M4388N7467P1780j52r218o4801L8554J7107q8611
$$ -62910 -100001 -90282 -64295 -19907 37560 109340 109188 99970 35169 73723 90830 2219
13830B219n7729J8663p014K3794p539O373m4179J6267Q1915N8325j2637n9592
$$ 2219 -55510 -36847 -43861 -20067 -27606 -21233 -65412 -49145 32770 91095 78458 18866
13818A8866j05663J2502M0012L1489K1030K9897n4532m362J5665o6686k4947K4078
$$ 18866 -86797 -74295 -34283 -2794 18236 48133 -6399 -10761 4904 -61782 -86729 -62651
13806f2651M0766M4043l8137J3516L6199k6229r858J7296j7082k5282K8832j5315
$$ -62651 -21885 22158 -15979 -2463 33736 7507 -2351 14945 -2137 -27419 1413 -13902
13794a3902j8573P4171j0778l6936J02878m9997l3697j3910j9612J5364Q30l444
$$ -13902 -32475 41696 30918 -6018 96860 46863 13166 -744 -20356 -4992 -4162 -7606
13782g606l567J1345Q308l6953O798n5883Q070Q4652N5681l1488K5664m175l0096
$$ -7606 -11173 172 8480 -28473 -21675 -77558 -69488 15164 70845 39357 65021 60846 30750
13769C0750N574N972k7419j7896N2636O1903K8541o3058m9499q519j5545j2618
$$ 30750 36324 42296 14877 -3019 49617 111520 140061 77003 27504 18985 3440 -9178
13757i178k5174j4345J9003Q7655l1645o8187n384P609l094P571O6964J3234k0682
$$ -9178 -34352 -48697 -29694 57961 26316 -41871 -47255 -39646 -42740 -35169 31795 45029 24347
13744B4347r691m7316j6477J3883K637K0751M7319Q778n5042k6240J6101j6449
$$ 24347 14656 -32660 -49137 -35254 -32617 -11866 35453 44231 -10811 -37051 -20950 -37399
13732c7399m0925Q421K446r804J1910L1308K9861P5973k1395k1011k5155j5786
$$ -37399 -78324 -69903 -67457 -77261 -65351 -34043 -4182 71791 50396 29385 4230 -11556
13720a1556o1658M6194l2746j0355K782m0712K1886m1320J3138M7259K6034n2285
$$ -11556 -73214 -27020 -59766 -70121 -67339 -108051 -86165 -127485 -114347 -67088 -41054 -93339
13708i3339l5405N360N235K4709K9008k926l8083n381m587k6044J9084P438K2918
$$ -93339 -128744 -123384 -118149 -93440 -64432 -67358 -105441 -110822 -115409 -141453 -122369 -114931 -92013
13695i2013K8686J3604N096j1036o499M5848M0183O767m2054n0679j1440K6182
$$ -92013 -63327 -49723 -44627 -55663 -62162 -16314 23869 30636 -11418 -62097 -73537 -47355
13683d7355L0099r343O2219k0140p1830N8774L9888Q940J0927m9728k2571M0442
$$ -47355 -17256 -26599 35620 15480 -56350 2424 42312 51252 62179 12451 -10120 30322
13671C0322j2224o4606M7326O8472K2006j2127K3317l4440p7967q7358J1480K9972
$$ 30322 18098 -46508 818 69290 91296 79169 102486 68046 -9921 -97279 -85799 -55827
13659e5827L327K9120o9074r355J0044O9597k9631n2509N5984L5032L6026K8279
$$ -55827 -52500 -23380 -92454 -101809 -91765 -22168 -51799 -104308 -48324 -13292 22734 51013
13647E1013k1550l9920l0376K3751K255j3899m1535k1084J3570N2930O4748R49
$$ 51013 29463 -10457 -40833 -17082 -14827 -28726 -70261 -91345 -77775 -24845 39903 40852
13635D0852j0284j9724N888k5570R788l4096L0153R636n8398K4123M2732k1016
$$ 40852 30568 10844 16732 -8838 950 -33146 -2993 6643 -51755 -27632 15100 -5916
13623e916k6816j9117L9966M5193L0086n9733m8615R2187J719k4381j3884L086
$$ -5916 -32732 -51849 -11883 33310 63396 3663 -44952 47235 48954 24573 10689 13775
13611A3775L8774o7235k321R092l4308K8878j4621j309l5028l8835Q650K4135
$$ 13775 52549 -14686 -17007 -7915 -42223 -13345 -27966 -29275 -64303 -103138 -94488 -70353
13599g0353j450M8996P797k6379m9433P977L8742K0355n3224n0472K9640K1472
$$ -70353 -71803 -22807 -15010 -41389 -90822 -82845 -44103 -23748 -76972 -127444 -97804 -76332
13587g6332j2743M2568L1006k6724j3853J7696o634o87m4570J3474L005O2442
$$ -76332 -89075 -46507 -15501 -42225 -56078 -38382 -45016 -45703 -90273 -76799 -73794 -11352
13575a1352M9204m7936j081J3586J8021J1365J0729Q980M3539q014m7131r3455
$$ -11352 37852 -10084 -11165 2421 20442 31807 42536 51516 95055 87041 39910 -53545
13563e3545J15J7232L1768M1881M0506P990n7427o8565k9364J7019l0158l0049
$$ -53545 -53430 -36198 -4430 37451 77957 85947 28520 -40045 -69409 -52390 -82548 -112597
13551a12597J5091m048J0094m531j2188L9481N8099J3736L97r862L0818o668k0337
$$ -112597 -97506 -101554 -91460 -95991 -108179 -68698 -10599 3137 3534 -6328 24490 17822 -2515
13538b515k8349K1583k4159j0190j9653j3640m4861k8751O7875K3812K7366j9170
$$ -2515 -30864 -9281 -33440 -43630 -63283 -76923 -121784 -150535 -82660 -58848 -31482 -50652
13526e0652J6270Q465L2429L8014j4963k3660k383r056L4722m756m3407j8090
$$ -50652 -34382 -25917 6512 44526 29563 5903 3520 -5536 29186 24430 -18977 -37067
13514c7067K6939M2146l197J743L961l8121p7797k326K3531L781L0792m2418n5846
$$ -37067 -10128 32018 28821 30564 34525 -3596 -81393 -83719 -60188 -56407 -25615 -68033 -123879
13501a23879M6111N4116L9423o92j2372n223J0518Q904J7396o5450m3666p2732
$$ -123879 -77768 -23652 15771 15079 2707 -2516 8002 16906 34302 -31148 -74814 -147546
13489a47546K290O2269R4243k1860q8941O2096j9093o2639L2600L6841K3982K7181
$$ -147546 -145256 -82987 11256 -10604 -99545 -37449 -56542 -119181 -86581 -49740 -25758 1423
13477A423K7061k0211l0444J4589j9493j6652J1728k7176K748M2279l8263m1917
$$ 1423 28484 8273 -22171 -7582 -27075 -43727 -31999 -59175 -56427 -14148 -52411 -94328
13465i4328j1263N7246J07044L9354k5605l2538r4818K9367R4221r6k0393m7904
$$ -94328 -105591 -48345 58699 98053 72448 39910 -54908 -25541 68680 68584 48191 287
13453B87j0883N7507N4408N636o1957j726l4243P241K9854m8184m9326r178k287
$$ 287 -10596 46911 101319 106955 44998 43272 9029 16270 46124 -2060 -51386 -60564 -62851
13440f2851k0782K446M6728M0334L8254J9291o019J3370m0695J0708j666l5381
$$ -62851 -83633 -81187 -34459 5875 44129 63420 57401 70771 30076 40784 39118 3737
13428C737k0376o795p822K4173O3507J0336R757l2222p2367j15118J1447L4884
$$ 3737 -16639 -23434 -31256 -7083 56424 66760 76517 44295 -28072 -143190 -131743 -96859
13416i6859m3693J4215N5865M5711Q9585M8286j4309k7196q395l1496n7786m5942
$$ -96859 -140552 -126337 -70472 -24761 64824 113110 98801 71605 63210 31714 -26072 -72014
13404g2014O2579P5080J449m7938o7028j2934j067j9445m4972n1174L7951L1248
$$ -72014 -9435 65645 67094 19156 -47872 -60806 -61873 -81318 -126290 -177464 -139513 -108265
13392a08265N7722j285m3041r397k2762M2747M1091L1818L1752J4260l6872k9975
$$ -108265 -50543 -51828 -94869 -104266 -127028 -84281 -43190 -11372 20380 34640 -2232 -32207
13380c2207m4610R703j202N3042L6132P4891J4337q1729o9146k8167j1287k013
$$ -32207 -76817 -67114 -68316 -15274 20858 95749 110086 28357 -40789 -68956 -80243 -82256
13368h2256J529m6799O5339L1969L2154j0980k8236P003K2356M5161J4051j0110
$$ -82256 -80727 -127526 -62187 -30218 1936 -9044 -37280 -30277 -7921 37240 51291 41181
13356D1181K4652o4187p5545Q394L452k7327J8411K9435L7p4895m8795M8784q557
$$ 41181 65833 1646 -73899 -65505 -62053 -89380 -70969 -41534 -41497 -116392 -165187 -116403 -124960
13343a24960K8541K7599P1474j1421K2747r965K554L9035q019j2001j7306p671
$$ -124960 -96419 -68820 2654 -8767 13980 4015 6569 45604 37585 25584 8278 607
13331F07m5018m6989K841J08239K4417j2099k2239L763k1296K1885l8641j1613
$$ 607 -44411 -91400 -88559 19680 44097 31998 9759 13522 -7774 14111 -24530 -36143
13319c6143K7146p247n3813j0309L7670m7656M3882Q4780r019K7178l1680L1608
$$ -36143 -8997 -16244 -70057 -80366 -42696 -90352 -46470 38310 29291 56469 24789 56397
13307E6397j129n5868j2828N8796k0608j05233J2054O6100N4025l1398J1893J3035
$$ 56397 55268 -600 -13428 45368 24760 -80473 -68419 -2319 51706 20308 32201 45236
13295D5236m6829n6739K5749K2537N6625k2071m5165K3281L0363o1452r0780Q228
$$ 45236 -1593 -58332 -32583 -10046 46579 24508 -20657 2624 32987 -28465 -119245 -111017
13283a11017J6867l4392Q6246M916k5441N5691N3611j7441p6317l2557k1324L2565
$$ -111017 -94150 -128542 -42296 -37380 -62821 -7130 46481 29040 -47277 -79834 -101158 -68593
13271f8593L2257K5399J4755K122j4170L421K4330J0951j1628K2846j9234n4001
$$ -68593 -36336 -10937 3818 5940 -8230 -4809 19521 30472 18844 41690 22456 -31545
13259c1545J9646N7262k8392K3176m50L4477K1901o0790l6192l444K0635j5178
$$ -31545 -11899 45363 16971 40147 39697 74174 96075 35285 -907 -4351 16284 1106
13247A106k6905J2882J3693j1487K2322K326m1298J0847j4835j4271l5637L2836
$$ 1106 -25799 -12917 776 -10711 11611 13937 -27361 -16514 -31349 -45620 -81257 -48421
13235d8421J9934o8363L1676P434O1008m0278m9921J7884R388K2645j3334l3657
$$ -48421 -28487 -96850 -65174 -57740 3268 -37010 -86931 -69047 -59659 -37014 -50348 -84005
13223h4005J9066J2410J1642l193j3440J9163J8136N7391l4175m4096k6926K9959
$$ -84005 -64939 -52529 -40887 -44080 -57520 -38357 -20221 37170 2995 -41101 -68027 -38068
13211c8068M5047m0413m1591j2776j6847K0581O5814L2644K768k1142q7611j39
$$ -38068 6979 -33434 -75025 -87801 -104648 -84067 -18253 14391 17159 -3983 -91594 -91733
13199i1733L5510l0016K0422J01790O2662Q179J3481r53r125o2269N257k0586
$$ -91733 -56223 -86239 -65817 35973 98635 106814 120295 119342 110217 47948 53205 32619
13187C2619l3837O618k2756J2823K7571J7041N3018M335r3232n6055l2031L626
$$ 32619 -1218 5400 -17356 -4533 23038 40079 93097 97432 4200 -51855 -83886 -80260
13175h0260K8419n032K1104m3759L075N7094n0710o8086L7310M6578l7230O00
$$ -80260 -51841 -56873 -35769 -79528 -76453 -19359 -70069 -138155 -100845 -54267 -91497 -90897
13163i0897Q8523K9580M5624l3825m1212J892j2822P050j8489m725k9620j2078
$$ -90897 -2374 27206 72830 39005 -2207 -315 -13137 -6087 -24576 -29301 -58921 -70999
13151g0999j5386L4662J5670O706k4554R23N5947K6262R688l990p655J2915m4536
$$ -70999 -86385 -51723 -36053 -29347 -53901 -52978 2969 29231 38919 34929 27274 40189 -4347
13138d347j0807M509k6153j4237J4919J7751R774J7672l3143j6685j3538K197
$$ -4347 -15154 -10645 -36798 -51035 -36116 -18365 -8591 9081 -24062 -40747 -54285 -52088
13126e2088J2926L3287J5876k3485l7478O186J6091j6615l9416k809O6273K7272
$$ -52088 -39162 -5875 10001 -13484 -50962 -44776 -28685 -45300 -84716 -87525 -21252 6020
13114F020l0109k994J5960o157L3700l3240k0291N5258L9068j9339k1852j7750
$$ 6020 -24089 -27083 -11123 -17280 16420 -16820 -37111 18147 57215 37876 16024 -1726
13102a726j1943q050L7229J0400m1170K0024L2224K9709N777p1231n9219J2131
$$ -1726 -13669 -21719 15510 25910 -15260 4764 36988 66697 72474 1243 -57976 -45845
13090d5845l5556M9197R6141j1890n6690n297l6574n8480k7469K2450L9151J6090
$$ -45845 -81401 -32204 63937 52047 -4643 -9940 -46514 -104994 -132463 -110013 -70862 -54772
13078e4772l0119L4900L1238L9642k6626k972P106K977K2599M0408K4408M4690
$$ -54772 -84891 -49991 -18753 20889 -5737 -8709 -1603 1374 23973 64381 88789 133479
13066A33479m9645j431m155k4613j3468m400L7809Q1291j5026m4206o870o173
$$ 133479 83834 82403 78248 53635 40167 35767 73576 154867 139841 95635 88765 82592
13054H2592J9944J5788k2490o5460Q819N2255L6259P538m6135k874n5192N226
$$ 82592 102536 118324 95834 30374 39193 91448 127707 135245 89110 86236 31044 36270
13042C6270L2899k690l6109p7718o697j304L8285j4627l3242M9667P1526k3133
$$ 36270 69169 66479 30370 -47348 -54045 -55349 -17064 -31691 -64933 -15266 56260 33127
13030C3127j7400K5870P500m5542j1826m7912l0341O4268P5578J9442j054m8663
$$ 33127 15727 41597 49097 3555 -8271 -56183 -86524 -22256 53322 72764 71710 23047
13018B3047k0648r770n319j3049M5320j1469n0234j247j5551R3560L7133l6981
$$ 23047 2399 -7371 -12690 -25739 19581 8112 -42122 -43369 -58920 34640 71773 34792
13006C4792o2475k6187m1998J9286L7849L5589n096m2681o625M8246K4952n3524
$$ 34792 -27683 -53870 -95868 -76582 -38733 -3144 -8240 -50921 -57546 -9300 15652 -37872
12994c7872l894J7855L364M3351m6146j0316K2035n2585j4302M6150O54Q649J6632
$$ -37872 -41766 -23911 -20547 22804 -23342 -33658 -11623 -64208 -78510 -32360 -31706 -23057 -6425
12981f425l5172k66q859m146j7672k8089N5418Q4861J2546k897m3644l2995k4994
$$ -6425 -41597 -41863 -50722 -54868 -72540 -100629 -45211 39650 52196 49299 5655 -27340 -52334
12968e2334l4728k3133N7749O8254L3789J1129k7961k1481n0182M7343K9720k7866
$$ -52334 -87062 -110195 -52446 15808 49597 60726 32765 11284 -38898 8445 38165 10299
12956A0299N059k3841J7430M1130N8605n3694p3832K24k2321j0085l781L5254
$$ 10299 15358 -8483 8947 50077 108682 54988 -18844 -18620 -40941 -51026 -54807 -19553
12944a9553n690j2079r067M9013J03775j7118r2275j2304L3234k3346k4882n230
$$ -19553 -25243 -37322 -46389 2624 106399 89281 -2994 -15298 17936 -5410 -30292 -35522
12932c5522J843L4322J0463k5586r516L4544K4240l1555m9266K0534j1433M5577
$$ -35522 -33679 643 11106 -14480 -23996 10548 34788 3233 -46033 -25499 -36932 8645
12920H645N8252j1334j8242m8113m8792L6735j8141m624k388L1401O459M526J5702
$$ 8645 66897 55563 37321 -10792 -59584 -22849 -40990 -45614 -48002 -16601 -10142 -5616 10086
12907A0086K5079N9394l9799o6255k5409p301J4406O8836P51j7350J3545k293
$$ 10086 35165 94559 54760 -11495 -36904 -44205 -29799 39037 39788 22438 35983 33690
12895C3690n2135L685L999o3926K165N9906K2642m6748l901q407k0862O9944L3350
$$ 33690 -18445 -14760 -10761 -74687 -72522 -12616 10026 -36722 -40623 -49030 -69892 52 33402
12882C3402J0517j2867k5455m6851j6423K719j835K1266L4811N9116n2015l5545
$$ 33402 43919 31052 5597 -41254 -57677 -54958 -56793 -35527 -716 58400 6385 -29160
12870b9160K7860k4034K9930L9175k4861n4089j6092N0156l248K198Q922k2136
$$ -29160 -1300 -25334 4596 43771 18910 -35179 -51271 -1115 -4363 -2165 6757 -15379
12858a5379p762j8003Q3944M9087j8359K254k2117l8949j062k8279K8294l2419
$$ -15379 -23141 -41144 42800 91887 73528 75782 53665 14716 13654 -14625 13669 -18750
12846a8750k8757j3429j831j4096l4856k7900J873L4363K5672L5287M0647j6639
$$ -18750 -47507 -60936 -62767 -76863 -111719 -139619 -137746 -103383 -77711 -42424 -1777 -18416
12834a8416o8247j1726K2344M0597Q0975L9307j160m5517j6954l3238m1694l9068
$$ -18416 -86663 -98389 -76045 -35448 45527 84834 83674 38157 21203 -12035 -53729 -92797
12822i2797J9348K1586K138R415J1491K3606K1195k6025l3130k1489K8944j3140
$$ -92797 -73449 -51863 -49725 -40310 -28819 -5213 15982 -10043 -43173 -64662 -35718 -48858
12810d8858M6549K3600L145p0937p3607j0338Q0629L0021J0845M5792j5050k0748
$$ -48858 -2309 21291 24436 -46501 -120108 -130446 -49817 -19796 -8951 36841 21791 1043
12798A043k5706J7582N2434O092r8595l3357N4042k2010K924N2913R447j6284
$$ 1043 -24663 -7081 45353 51445 -47150 -80507 -26465 -48475 -45551 7362 16809 525
12786E25j5392L0665J2793n675k7293M5566J2528Q058k1486M057o1076n4001J8847
$$ 525 -14867 15798 28591 22916 -4377 41189 53717 61775 40289 44346 -16730 -70731 -51884
12773e1884M9830R5501r821m8846L021L3716l2401j4997q7947n2276M570J9889
$$ -51884 -2054 93447 83626 34780 37801 71517 39116 24119 -63828 -116104 -111534 -91645
12761i1645L3198P442l3575N6508n692j3232m2842k136j1672k9373J3914K2503
$$ -91645 -58447 -51005 -84580 -28072 -33764 -46996 -89838 -91974 -103646 -133019 -119105 -96602
12749i6602R4183P1053j4750n6521k028O6329R933q1624k917l2480k3618J8192
$$ -96602 -2419 68634 53884 -2637 -4665 61664 71597 -10027 -12944 -45424 -69042 -50850
12737e0850K5641j0629l8809j6151k4619N8206J01683l1021K535O2432j8696j8108
$$ -50850 -25209 -35838 -74647 -90798 -115417 -57211 44472 13451 15986 78418 59722 41614
12725D1614J2058J9002q642l3714N000o3258o0203Q906J7777Q9846L2272k8066
$$ 41614 53672 72674 64032 30318 35318 -27940 -88143 -79237 -61460 28386 60658 32592
12713C2592j0444n995j5320L0395k1959M5342l6244j096n4996J2451M7790Q513
$$ 32592 22148 16153 833 31228 9269 54611 18367 17271 -37725 -25274 22516 31029
12701C1029k5661k4226K7016K5740j4703l6745m2276M2420Q5597R982k1389R620
$$ 31029 5368 -18858 8158 33898 19195 -17550 -59826 -17406 68191 78173 56784 66404
12689F6404K828L1742k9757n0543j7245L5001K5541l6568o2740P05j0115o4835
$$ 66404 69232 100974 71217 20674 3429 38430 63971 27403 -35337 -34632 -44747 -109582
12677a09582K9202L2152P943P824n1119m1744q4618q045P6003P5277M1789R219
$$ -109582 -80380 -48228 -40285 -32461 -83580 -125324 -209942 -217987 -141984 -66707 -24918 -15699
12665a5699n8408K5162K500k4764k5932P858L6012N6231K3749n320K4411k416
$$ -15699 -74107 -48945 -46445 -71209 -97141 -89283 -53271 2960 26709 21389 45800 43384
12653D3384l1769L3266K8134j8365l8748K1508j2486j2979k3712L4718K4979P422
$$ 43384 11615 44881 73015 54650 15902 37410 24924 11945 -11767 22951 47930 55352
12641E5352r348l7734n2932J3973l4439n520j7417P1403J15526L6200n1541k4436
$$ 55352 46004 8270 -44662 -30689 -65128 -70648 -88065 -16662 98864 135064 83523 59087
12629E9087k0867q7550m0641N1593k9422k6615L4022M043k2288M3783J6728k1425
$$ 59087 38220 -49330 -89971 -38378 -67800 -94415 -60393 -56350 -78638 -34855 -18127 -39552
12617c9552M6914L1043n1630n0128K7079P6641l1372p8375N5352N862k2999j4436
$$ -39552 7362 38405 -13225 -63353 -36274 40367 8995 -69380 -14028 -8166 -31165 -45601
12605d5601n7337M8108L7296k5796m770l408m0298n2999O5871P0941J9845n346
$$ -45601 -102938 -54830 -17534 -43330 -48100 -51508 -91806 -144805 -78934 -7993 11852 6506
12593F506j617k0895l9217j8664M2656M6631J2250J6358k1075n4591j0800J8189
$$ 6506 4889 -16006 -55223 -73887 -31231 15400 27650 44008 22933 -31658 -42458 -24269
12581b4269N0298o030j826K9458n0096k4937j1148l5077L60N4678P2023q8888
$$ -24269 26029 19999 18173 47631 -2465 -27402 -38550 -73627 -73267 -18589 53434 -35454
12569c5454n3616k4287q217M0675N3887m4036j964J2196O9883L0214K0069J9822
$$ -35454 -89070 -113357 -121574 -80899 -27012 -71048 -73012 -60816 9067 39281 59350 79172
12557G9172j3034m2001K9290k8383n6362K8391m4004J7329N63k2574k182j6936
$$ 79172 66138 24137 53427 25044 -31318 -2927 -46931 -29602 -29039 -51613 -53795 -70731
12545g0731P659L5738N0000L0819K0146J3390k4719n6196l5153K4059N383m731
$$ -70731 -63072 -27334 22666 53485 73631 87021 62302 6106 -29047 -4988 395 -4336
12533d336k8611q776j7498k3768k0420m077P5242K1377m3699J5585K9567O6133
$$ -4336 -32947 -41723 -59221 -82989 -103409 -107486 -32244 -10867 -54566 -38981 -9414 56719
12521E6719J9314q3156m9334L8782j6658L1421L8617k2606n5497Q9N9357J9614
$$ 56719 76033 -7123 -56457 -17675 -34333 -2912 35705 13099 -42398 -42309 17048 36662
12509C6662r078l7897q410l753o2583M6780L7139M9696o0794l3841J7500k674
$$ 36662 27584 -10313 -18723 -22476 -85059 -38279 -1140 48556 -12238 -46079 -28579 -31253
12497c1253L3772K4609k4545k0211k2452O4000K474j1921k4750j9640l712j1818
$$ -31253 2519 27128 2583 -17628 -40080 23920 26394 14473 -10277 -29917 -33629 -45447
12485d5447O2313K6850L8687j7753l5425q863k1323q9456o4230J9054Q1528K7669
$$ -45447 16866 43716 82403 64650 29225 20362 -961 -90417 -154647 -135593 -54065 -26396
12473b6396R536J1769r463l5739L1332L9386l0004k6485J2933r105p592M173J4112
$$ -26396 -16860 -5091 -14554 -50293 -18961 20425 -9579 -36064 -23131 -32236 -39828 -35655 -21543
12460b1543J5123j2079l1307K8182K7877j8847J0943j2427J5309n9890k8819l1986
$$ -21543 -6420 -18499 -49806 -21624 6253 -12594 -1651 -14078 1231 -58659 -87478 -119464
12448a19464P95O3863J3254m5385J4447L1075Q7945K9517n9797k1J0960n673N3495
$$ -119464 -118669 -54806 -41552 -86937 -72490 -41415 46530 76047 16250 16229 27189 21516 75011
12435G5011K8277o7708p2623l966K5030J6533k8814q161o568l4884j2689P93M4436
$$ 75011 103288 35580 -37043 -41009 -15979 554 -28260 -36421 -42989 -77873 -90562 -89769 -45333
12422d5333M2882N1170o117j2543M160L405l3502n3544N2763N527j747M7469j4614
$$ -45333 -2451 48719 42602 30059 34219 37624 4122 -49422 3341 8868 7121 54590 39976
12409C9976l2717p3072m7775O0056j1755J0340M2326M9457N00l1037o0758m7208
$$ 39976 7259 -65813 -113588 -53532 -65287 -54947 -12621 36836 37336 6299 -54459 -101667
12397a01667N8802O3120j6669n2485K7983L4952M734n4803k6510J10217J4290
$$ -101667 -42865 20255 3586 -48899 -20916 14036 18770 -36033 -62543 47674 61964
12386F1964k4751o0002k0946L7807M6366K0498J1496L3034k4985M9536j5705l0537
$$ 61964 37213 -22789 -43735 -5928 40438 60936 72432 105466 80481 130017 114312 83775
12374H3775J5534m8483o1142K8699M3467r3346m6465M2210Q2453M5606l2461j0125
$$ 83775 99309 50826 -10316 18383 61850 -31496 -77961 -35751 46702 92308 59847 49722
12362D9722k0667j9340o163K1041j0912n094q2039j7562L1926N8405k693K061
$$ 49722 29055 9715 3552 24593 13681 8587 -73452 -91014 -59088 -683 -3376 -1315
12350a315L5233R239J1988j4039p422j5631m8650m8321K5348M5422M230n2902
$$ -1315 33918 43157 55145 41106 33684 18053 -30597 -78918 -53570 -8148 -3918 -56820
12338e6820P2747l1116J79r971k6268P4147L1871k6762m2734n7681m2642L3851
$$ -56820 15927 -15189 -15010 -24981 -51249 22898 54769 28007 -14727 -72408 -115050 -81199
12326h1199L5702O3729K4167M6196J1318n3109o7294O6248O8891K5090m4870q7287
$$ -81199 -45497 18232 42399 88595 99913 46804 -20490 45758 114649 139739 94869 7582
12314G582o839m849m1004L8422j9975J0321m2920j10856K3043K712N2698N5958
$$ 7582 743 -4106 -45110 -6688 -26663 -16342 -59262 -170118 -147075 -144363 -91665 -35707
12302c5707k1476j4964L8956K5757M1450r203m9716R405K2721O3825j813p8298
$$ -35707 -57183 -72147 -33191 -7434 34016 24813 -24903 -15498 7223 71048 69235 -9063
12290i063N59k5190l8416O3309J01966O8664k7060N779m1902k3825M7504J6262
$$ -9063 -8504 -33694 -72110 -8801 93165 161829 134769 140548 98646 74821 122325 138587
12278A38587l9970j04066K5931j8642l2328L6721k8984J353K3890M6550l6823
$$ 138587 98617 -5449 20482 1840 -30488 6233 -22751 -21398 2492 49042 12219
12267A2219j0824j8948m8671k6119j572k924K8415l727N652m962M1073M0565m5570
$$ 12219 1395 -17553 -66224 -92343 -93915 -96839 -68424 -72151 -66499 -71461 -30388 10177 -35393
12254c5393n6560K0843J3330l422L4283K32q9209K9266M3564k1217K408N0619
$$ -35393 -91953 -71110 -57780 -61202 -26919 -26687 -115896 -86630 -43066 -64283 -61875 -11256
12242a1256m359M407k0892L0355k180l2008m2767L009M8826N9901r62j4049l2944
$$ -11256 -15615 -11208 -32100 -1745 -3925 -35933 -78700 -75691 -26865 33036 32074 18025 -14919
12229a4919Q81M8009K8752P268j1176p3521m2575O908K3335L0902k8301k5339
$$ -14919 -14038 33971 62723 69991 58815 -14706 -57281 -50373 -27038 3864 -24437 -49776
12217d9776J6256N3064P4154j487j423m9564l4242L6402K5966j2045K3872l3460
$$ -49776 -33520 19544 93698 92211 90788 41224 6982 43384 69350 57305 81177 47717
12205D7717k6271J8543N119J6770P312J7765M0468K6614l3421o2825J8159K1094
$$ 47717 21446 39989 45108 61878 69190 86955 127423 154037 120616 57791 75950 97044
12193I7044N2633Q7097J31916J18960J18068Q9573R8455J28916K50r1601j66458
$$ 97044 149677 236774 368690 487650 605718 695291 793746 922662 922912 831311 664853
12182F64853j49341r5077j09963j07829m1749k0465J566K4826n0791P805K4617
$$ 664853 515512 420435 310472 202643 160894 140429 141995 166821 116030 123835 148452
12171A48452R289J118o685k1853q836j9532K1724J4506K3188K9350O7749J6585
$$ 148452 157741 158859 152174 130321 121485 101953 123677 138183 161371 190721 258470 275055
12159B75055K521k0387M6426k0615P2050Q3935l6675J8566K0629J0541P4479M8310
$$ 275055 277576 257189 303615 283000 355050 438985 402310 420876 441505 452046 526525 574835
12147E74835N728k2761Q2965Q4188L3398r5843j04948l6771O1251J06580P3883
$$ 574835 580563 557802 640767 724955 758353 662510 557562 520791 582042 688622 762505
12136G62505m4757n48n3505q0222r7587k0144l621J3934o263j75n2577J3817j0632
$$ 762505 717748 717200 663695 583473 485886 465742 462121 476055 469792 469617 417040 430857 420225
12123D20225J9263K540j06277k1094l287l972K7026N6604N429o9285o4937M979
$$ 420225 439488 442028 335751 314657 311370 307398 334424 391028 396457 327172 262235 267214
12111B67214M1523J6936J9521l3008l0417N5647K2333n4293k4918L1156J7778
$$ 267214 308737 325673 345194 312186 281769 337416 359749 305456 280538 311694 329472
12100C29472N9534Q5688l2212j09956q9124l2017j4572P1028R9491L6605L5373
$$ 329472 389006 474694 442482 332526 243402 211385 196813 267841 367332 403937 439310
12089D39310P8226O4494J30771J14041O3260n4933j27702j50290j54893o9621
$$ 439310 517536 582030 712801 826842 890102 835169 707467 557177 402284 332663
12079C32663l881J7941m8478n5687p4621k5327k3402K0784j2714J8104j1410l6631
$$ 332663 328782 346723 298245 242558 167937 142610 119208 139992 127278 145382 133972 97341
12067I7341o07M352l7482J09576Q2818j00287o4592K6481k5683K8300K3008j1694
$$ 97341 96734 101086 63604 173180 255998 155711 91119 117600 91917 120217 143225 131531
12055A31531n7135N3122m341m0582m7930p0077M4488J1714M2233L2513n0608N291
$$ 131531 74396 127518 123177 82595 34665 -35412 9076 20790 63023 95536 44928 50219
12043E0219o0551J3729L4894K4397J9117k7612l9326l8011M3298j1380O865N5177
$$ 50219 -10332 3397 38291 62688 81805 54193 14867 -23144 20154 8774 15639 70816
12031G0816j8840k8938p2239k0999K929O0811N732K6284k4284K4947M3782j2910
$$ 70816 51976 23038 -49201 -70200 -67271 -6460 -728 25556 1272 26219 70001 57091
12019E7091J2288K1112n9196m1360j0122j296M024K0660j8701q5901K5727Q7424
$$ 57091 69379 90491 31295 -10065 -20187 -21483 -17459 3201 -15500 -101401 -75674 11750
12007A1750J6755O188J4849j537K4073n7032r693M693J10L2876j3305l3030k1085
$$ 11750 28505 34693 49542 48005 72078 15046 5353 10046 10156 43032 29727 -3303 -24388
11994b4388n2050J543L0179O9687L709k3152j3102O130J4978k9768K4015R268
$$ -24388 -76438 -74895 -44716 24971 28680 5528 -7574 -1444 13534 -16234 7781 17049
11982A7049K814q870m162l565m836Q4987J7626n0130n1114q2428o208J2654M6385
$$ 17049 19863 10993 6831 3266 -1570 83417 101043 50913 -201 -82629 -88837 -76183 -29798
11969b9798J4962K9613J6719P1944J2225r2340o5277q956L5759P421l6520j8535
$$ -29798 -14836 14777 31496 103440 115665 23325 -41952 -50908 -15149 -7728 -44248 -62783
11957f2783L0788M4846K2732K7756L3651L5784k2726k4012q0990k6441J3064m8465
$$ -62783 -31995 12851 35583 63339 96990 132774 110048 86036 5046 -21395 -8331 -56796
11945e6796P741K3583k6842K7064P7801K4615j1733k4726o1282J8985l769j8111
$$ -56796 -49055 -25472 -52314 -25250 52551 77166 65433 40707 -20575 -1590 -5359 -23470
11933b3470K5768K1299M3512j3249k1576L8924p707j9481J3420l5937m9204J0495
$$ -23470 2298 23597 67109 53860 32284 71208 63501 44020 57440 21503 -27701 -17206
11921a7206j5376o33m3281J0514N22L6685P9256J4078L6179k8113q9900n7446
$$ -17206 -32582 -33215 -76496 -65982 -65460 -28775 50481 64559 100738 72625 -17275 -74721
11909g4721J3582R2850K2756l9395p6529m994N0644O0292o39q114l504j2830l9417
$$ -74721 -61139 31711 54467 15072 -61457 -66451 -15807 44485 43846 35732 32228 19398 -20019
11896b0019q698j2473O6090O4627N4287l0211o6179p6590K1499K8881p079q87
$$ -20019 -28717 -41190 24900 89527 143814 113603 47424 -29166 -7667 21214 14135 13248
11884A3248j0502P088l0215k4901J9339K3817L3050r820k0623M0808k5043j7950
$$ 13248 2746 9834 -20381 -45282 -25943 -2126 30924 21104 481 41289 16246 -1704
11872a704J2253J0445K845N4054m0982k0767j7580m4288M2603O4895k8217L4169
$$ -1704 10549 20994 23839 77893 36911 16144 -1436 -45724 -3121 61774 33557 67726
11860F7726J5692k7089j3486j3133L2023j590M557k2317K6232N001K8256J1169
$$ 67726 83418 56329 42843 29710 61733 60143 64700 42383 68615 73616 101872 113041
11848A13041o4789k6105J4145l7382J7895M9808J3178m9772R555J9287m393j4593
$$ 113041 48252 22147 36292 -1090 16805 66613 79791 30019 39574 58861 54468 39875
11836C9875N536N5690M395J4621j2318q1193p7190K4157K8415N3359k0787l7562
$$ 39875 45411 101101 105496 120117 107799 26606 -50584 -26427 1988 55347 34560 -3002
11824c002m3516k6413M593L1472L3636j2332m0331Q403N1654J2934N5642k100
$$ -3002 -46518 -72931 -68338 -36866 -3230 -15562 -55893 -47490 4164 17098 72740 70640
11812G0640k4712m7711j9665K9503l7865r648l4219n502O6140M6085L901r651
$$ 70640 45928 -1783 -21448 8055 -29810 -39458 -73677 -79179 -13039 33046 36947 27296
11800B7296j3557l9474n235P768L6135N649p6587N0075P6333R718l0881m9788
$$ 27296 13739 -25735 -30970 -23202 12933 18582 -58005 -7930 68403 78121 47240 -2548
11788b548j2394j7347m2952K9437l556K7640K5838j3311L209l1628p5520O5119
$$ -2548 -14942 -32289 -75241 -45804 -49360 -21720 4118 -9193 -5984 -37612 -113132 -48013
11776d8013q350l5224M0219L0070l923o083j2202K750M8238m0035m9120K2759
$$ -48013 -56363 -91587 -51368 -21298 -25221 -31304 -43506 -40756 7482 -32553 -81673 -58914
11764e8914L5328K220j2771K8504j0967j6584J3327Q926R689K4327j6304J471
$$ -58914 -23586 -21366 -34137 -5633 -16600 -33184 -19857 -10931 -1242 23085 6781 8252
11752H252P176L629r51l7257j6645K0015O6705K306l6811m5200q281N8073K8388
$$ 8252 15428 19057 18106 -19151 -35796 -15781 50924 53230 16419 -28781 -37062 21011 49399
11739D9399l1040J2582j4231m2729l8593k8958J0754k1460j677P8562K0140K558
$$ 49399 18359 30941 16710 -26019 -64612 -93570 -82816 -104276 -105953 -27391 -7251 -4693
11727d693J7449M5417J8103K1926k3796j6517l421o868j5081o083K3304O3409
$$ -4693 12756 58173 76276 98202 74406 57889 54468 47600 32519 26436 49740 113149
11715A13149l0317l2783J2286J836M2327j755p1527l7450r816J4618J9547k476
$$ 113149 82832 50049 62335 64171 106498 104743 33216 -4234 -14050 568 20115 17639
11703A7639K5872J7180r950p1582k9868L1182m8181L6778K0208Q02J4343O049
$$ 17639 43511 60691 50741 -20841 -50709 -19527 -67708 -30930 -10722 -9920 4423 10472
11691A0472m9501L2327L2718L1375J8641L4511L6847n4922m7021K643M58K887
$$ 10472 -39029 -6702 26016 57391 76032 110543 147390 92468 45447 48090 48548 51435
11679E1435n3248p8976l4011Q5497L9723k9851K0042L4791k7225M3023O236j4657
$$ 51435 -1813 -80789 -114800 -29303 10420 -19431 611 35402 8177 51200 57436 42779
11667D2779l1176m0875K868j0602O5502J9213r8626l173J7831K9936L4406P0247
$$ 42779 11603 -29272 -26404 -37006 28496 47709 -50917 -54090 -36259 -6323 28083 98330
11655I8330K0115n2073n0680K6637p60L8092j5434j6328M689J3116J0694n1091
$$ 98330 118445 66372 15692 42329 41569 79661 64227 47899 52588 65704 76398 25307
11643B5307l95Q4170l6217o8501m1233J968l037M0169O778L4871J9970l8987q27
$$ 25307 24912 109082 72865 4364 -36869 -34901 -37938 2231 9009 43880 63850 24863 24036
11630B4036K6671m855n2316l4111J0766j3113m4624N2969O5045L755o7908l2014
$$ 24036 50707 45852 -6464 -40575 -29809 -42922 -87546 -34577 30468 34223 -33685 -65699
11618f5699p165R3438j4589o8981n820J6641Q461m7328j9925m9160P3979R1198
$$ -65699 -72864 20574 5985 -62996 -68816 -52175 -43714 -91042 -110967 -160127 -86148 5050
11606E050M902n1673l5772j5526J821j4540k1952M0671M380q739j3962m6277K5087
$$ 5050 9952 -41721 -77493 -93019 -91198 -105738 -127690 -87019 -82639 -91378 -105340 -151617 -126530
11593a26530K5266J3113J1319N1364M7365K5011J7035q0703l1489j472j0979j6286
$$ -126530 -101264 -88151 -76832 -25468 21897 46908 63943 -16760 -48249 -49721 -60700 -76986
11581g6986K8636N047j1557K653L2382j3718j7779N2100K8567L346n415l5564
$$ -76986 -48350 -43303 -54860 -52207 -19825 -33543 -51322 778 29345 32691 27276 -8288
11569h288o0630p0946k4620M1068L9203j9064m4794L4497L225M9424l5945o0649
$$ -8288 -68918 -139864 -164484 -123416 -84213 -103277 -148071 -113574 -110349 -60925 -96870 -157519
11557a57519O3453L8050M442N552j298N056N7986J1609K844k0571o0523r038L6916
$$ -157519 -94066 -56016 -51574 -46022 -47320 -42264 15722 27331 30175 9604 -50919 -59957 -23041
11544b3041M6897K738m0729q2636l54O7610M9317k292k845k8098L1055q285N9655
$$ -23041 23856 26594 -14135 -96771 -97125 -29515 19802 17510 14665 -13433 17622 9337 68992
11531F8992M0416n3089l5309M2666q48o0669l2286q871L192Q2822Q5711P868m0783
$$ 68992 109408 56319 21010 63676 62828 2159 -30127 -38998 -35806 47016 132727 140595 99812
11518I9812J975K9097j5264N713Q7773P8334O8275J84197L44732M38008L38222
$$ 99812 101787 130884 115620 121333 209106 287440 355715 539912 884644 1322652 1660874
11507A660874K67094J86237j44054n88676n11003l01889j75895o2049m2324o9359
$$ 1660874 1927968 2114205 1970151 1381475 870472 568583 392688 330639 288315 218956
11497B18956l1875J7504j2228p382j2050n1295j5905L980L9888o256n4019k0659
$$ 218956 187081 204585 192357 184975 172925 121630 105725 109705 149593 143337 89318 68659
11485F8659m615K9039J6697j9049q848j675J7743J2488k9098K5288L8308K3269
$$ 68659 64044 93083 109780 90731 81883 80208 97951 110439 81341 106629 144937 168206
11473A68206m0589k5772K4914L4663L5116l4172p3199P51Q21k6425m6771j5544
$$ 168206 127617 101845 126759 161422 196538 162366 89167 89918 90739 64314 17543 1999
11461A999L2869N7352J8068L5778l8222o6849o5141j6439O4225R7456K5836p5125
$$ 1999 34868 92220 110288 146066 107844 40995 -24146 -40585 23640 121096 146932 71807
11449G1807k392M8932L6710l0411l271k2916l0055K1390k1322o4208j1877j3063
$$ 71807 69415 118347 155057 124646 121375 98459 68404 89794 68472 4264 -7613 -20676
11437b0676J5061R0996J3035p830j1612J2974k8233p0185k8894m953M3533J0703
$$ -20676 -5615 85381 98416 90586 78974 91948 63715 -6470 -35364 -40317 3216 13919
11425A3919p1M2701J7418k8943k4727N3937j5736J3710k9578Q753K201l5637K5300
$$ 13919 13848 56549 73967 45024 20297 74234 58498 72208 42630 51383 53584 17947 43247
11412D3247k3039m7057K7949O9907P0051k9393l4519k3898k8091n5838K5593M0771
$$ 43247 20208 -26849 1100 71007 141058 111665 77146 53248 25157 -30681 -5088 35683
11400C5683l0461Q3520N1535o7476o8441K5268J6160K5881j0674q4463l9937J6969
$$ 35683 5222 88742 140277 72801 4360 29628 45788 71669 60995 -23468 -63405 -46436
11388d6436N1516K8434M1929J991k23l5241L9584k923k4929o0944L188K5239M904
$$ -46436 5080 33514 75443 77434 77211 41970 81554 78631 53702 -7242 -4054 21185 26089
11375B6089M770o423m7131j950l6241k6700j3523M5835j3750N0790P0349N4563
$$ 26089 30859 24436 -22695 -24645 -60886 -87586 -101109 -55274 -69024 -18234 52115 106678
11363A06678m2761p9005l8366q201k3161P475P5701K4454K8628O8105L0932m366
$$ 106678 63917 -15088 -53454 -61655 -84816 -77341 -1640 22814 51442 119547 150479 146113
11351A46113m0024Q29p419N0807K1209o2309M322J4460j5136k4368m2785n5820
$$ 146113 106089 106918 99499 150306 171515 109206 113528 127988 112852 88484 45699 -10121
11339a0121N4095L9958O3936l2376q7622K712n9637j0188Q3589k437j0391k6026
$$ -10121 43974 83932 147868 115492 27870 30582 -29055 -39243 44346 41909 31518 5492
11327E492l3452J6204P751K7989j0340K1601m3468K7903L1340l473M6004l629
$$ 5492 -27960 -11756 -4005 23984 13644 35245 -8223 19680 51020 47547 93551 89922
11315H9922l6671n262j9080m9385O507N1426O1255m5090R778p666l1648L2155
$$ 89922 53251 47989 28909 -20476 -13969 37457 98712 53622 63400 55734 24086 56241
11303E6241P927p3636o579K6356M7502K7286J04791j2041m476k8409j1682m5506
$$ 56241 64168 -9468 -16047 10309 57811 85097 189888 177847 173371 144962 133280 87774
11291H7774Q75M306J6286K3698l285o8270j569j7321m7670p176Q7400L0058L0320
$$ 87774 88649 92955 109241 132939 129654 61384 59815 42494 -5176 -12352 75048 105106 135426
11278A35426O524k5730m4607q153M0477M6180l260L589j8464l6877J4166L5374
$$ 135426 141950 116220 71613 63460 103937 150117 146857 150446 131982 95105 109271 144645
11266A44645j5093n4261k6492K9886j6623k031M862M7275M9872L6711l3942j5609
$$ 144645 129552 75291 48799 78685 62062 60031 64893 112168 162040 198751 164809 149200
11254A49200m3238M9847P4861j3214p7639l7201k6106r562l7453Q558O5267P551
$$ 149200 105962 155809 230670 217456 139817 102616 76510 66948 29495 38053 103320 110871
11242A10871p4323K8495k692J3878M3210L0114m6161Q896J0766M718J1356r401
$$ 110871 36548 65043 62351 76229 119439 149553 103392 112288 123054 127772 139128 129727
11230A29727j0586K7519J04652Q6725N7949M6715N3495J4553l1741o2880j9302
$$ 129727 119141 146660 251312 338037 395986 442701 496196 510749 479008 416128 396826
11219C96826J3340J7113k1794j5336J6168J8391J5923k0598o7468K7762m26k978
$$ 396826 410166 427279 405485 390149 406317 424708 440631 420033 352565 380327 379901 376923
11207C76923r6348r0156j6166N0011l5641k3518J2244M0934k5040l2304j5541
$$ 376923 280575 190419 174253 224264 188623 165105 177349 218283 193243 160939 145398
11196A45398n8144l0764j8362M858R6188M7129l8297Q989P616N2862M0300J2809
$$ 145398 87254 56490 38128 42986 139174 186303 148006 156995 164611 217473 257773 270582
11184B70582J8503Q0094M9544k4774m3184J5024O7347M1584M5131k0093m6074
$$ 270582 289085 369179 418723 393949 350765 365789 433136 474720 519851 499758 453684
11173D53684J1697k8382K4642m0082k274k1179K7178M0611K3384L2328J9562J9072
$$ 453684 465381 436999 461641 421559 419285 398106 425284 465895 489279 521607 541169 560241
11161E60241N4469N9168O2134N3745P4530P0317J07324K27403K54889L11238M82725
$$ 560241 614710 673878 736012 789757 864287 934604 1041928 1269331 1524220 1835458 2318183
11150B318183P76026J241998J457374J240353R20482P13010m97776k063208j816469
$$ 2318183 3094209 4336207 5793581 7033934 7954416 8667426 8169650 6106442 4289973
11141D289973j065348n17128k66539k36507j75067m9043l6134K0922K8075L8537
$$ 4289973 3224625 2707497 2440958 2204451 2029384 1980341 1944207 1965129 1993204 2031741
11131B031741p958M9548O4355J43907J73816K05997K31154K54321L26994M55115
$$ 2031741 2023783 2073331 2137686 2281593 2455409 2661406 2892560 3146881 3473875 3928990
11121C928990O36006P57011O65658O36919O45472K40155j35230J42537O46566
$$ 3928990 4564996 5322007 5987665 6624584 7270056 7510211 7374981 7517518 8164084
11112H164084R79840J242175J519180J983274K281458K495521L604631N533315
$$ 8164084 9143924 10386099 11905279 13888553 16170011 18665532 22270163 27803478
11104B7803478P908302J1785550J9307990L3257261N3937327O8703544N9934507
$$ 27803478 35711780 47497330 66805320 100062581 153999908 222703452 282637959
11097B82637959M7095138M4418738N909692q9925788j03358884n9985234l2562403
$$ 282637959 329733097 374151835 380061527 290135739 186776855 126791621 94229218
11090I4229218j9600512j3027485q949380o089306m253978l101199k412057j970480
$$ 94229218 74628706 61601221 52651841 46562535 42308557 39207358 36795301 34824821
11082C4824821j791956j853008j808762j510843j344544j278068j192317j093681
$$ 34824821 33032865 31179857 29371095 27860252 26515708 25237640 24045323 22951642
11074B2951642q22563n70928p12569j180895j010778p69305o42458m87092l96786
$$ 22951642 22129079 21558151 20845582 19664687 18653909 17884604 17242146 16755054 16358268
11065A6358268k56341k53798l54547m73154o07006n89921m87337m84134m69274
$$ 16358268 16101927 15848129 15493582 15020428 14413422 13823501 13336164 12852030 12382756
11056A2382756m87607m06863k83597l35085l93108l84693l95661l43011k62616
$$ 12382756 11895149 11488286 11204689 10869604 10476496 10091803 9696142 9353131 9090515
11047I090515k67814k51440k67769k52763k52264j85700j55692k07511j81402
$$ 9090515 8822701 8571261 8303492 8050729 7798465 7612765 7457073 7249562 7068160
11038G068160j98952j92448k12888j28114q3275j70328j51451j18134j43437j15476
$$ 7068160 6869208 6676760 6463872 6335758 6252483 6082155 5930704 5812570 5669133 5553657
11028E553657j70866j45852p2097j6738o4845j12432j19476j31707o7855m264
$$ 5553657 5382791 5236939 5164842 5148104 5083259 4970827 4851351 4719644 4651789 4647525
11018D647525J3902Q4739K36766N32314R06288J501797J782320J412432J166423
$$ 4647525 4661427 4746166 4982932 5515246 6421534 7923331 9705651 11118083 12284506
11009A2284506J150966m79379l210165k506359j281549p40321m96870l45011j93378
$$ 12284506 13435472 12956093 9745928 7239569 5958020 5217699 4720829 4375818 4182440
11000D182440k00519k19034j37730o0061p0654p1304r0254j33466j09646r6692
$$ 4182440 3981921 3762887 3625157 3565096 3494442 3423138 3332884 3199418 3089772 2993080
10990B993080l6588r3939j00804p0494j16239r2770j18192j01690L7503J1124
$$ 2993080 2956492 2862553 2761749 2691255 2575016 2482246 2364054 2262364 2299867 2310991
10980B310991M8610k1733j00031j08135j0008J3330r6158r8452n7122o0436p4454
$$ 2310991 2359601 2337868 2237837 2129702 2119694 2133024 2036866 1938414 1881292 1820856 1746402
10969A746402m5593r3840m5095l7592k4351j1565m3977m6204q6483n42m6457n9910
$$ 1746402 1700809 1606969 1561874 1524282 1499931 1488366 1444389 1398185 1311702 1311160 1264703 1204793
10957A204793K2405q358k3704M3655K6347l0231k7920j6849O886K2837J3023p2104
$$ 1204793 1227198 1218840 1195136 1238791 1265138 1234907 1206987 1190138 1197024 1219861 1232884 1160780
10945A160780q0686m8700o2555m9401j3860o9011m5353J4144m14k1156J8226M0187
$$ 1160780 1080094 1031394 968839 919438 905578 836567 791214 805358 804944 783788 802014 842201
10933H42201K2504l0598m4660L8642m9953l0334L7821P4866J25583J09804J09396
$$ 842201 864705 834107 789447 828089 778136 747802 785623 860489 986072 1095876 1205272
10922A205272J20517l6215j32416j06577j89082j90960p3261K9512J4615k3323
$$ 1205272 1325789 1289574 1157158 1050581 861499 670539 597278 626790 641405 618082
10912F18082k1595l8677J3899N7956j2998J3408q7863j5787J3904m0103r622l2476
$$ 618082 596487 557810 571709 629665 616667 630075 542212 526425 540329 500226 490604 458128
10900D58128o0278L8405O0505m4069n7459n6414L3449R372o674O7804P7072n747
$$ 458128 397850 436255 496760 452691 395232 338818 372267 381639 374965 442769 519841 514094
10888E14094q6786j9272M502J3628j9407J1450k462J6266l6334j01879k1567Q6102
$$ 514094 427308 408036 412538 426166 406759 418209 415747 432013 395679 293800 272233 358335
10876C58335k0997k3763j2095m3212m9380m1210O8890K2089K7904L8291o494n4367
$$ 358335 337338 313575 301480 258268 208888 167678 236568 258657 286561 324852 318358 263991
10864B63991j3151J5664K4269K3635K3930l6730p2494q76m4511k3568M6514R980
$$ 263991 250840 266504 290773 314408 338338 301608 229114 228238 183727 160159 206673 216653
10852B16653p1859J1083j1126k2329N4092l717m2293P63K8969k3619J8188M0071
$$ 216653 144794 155877 144751 122422 176514 172797 130504 131267 160236 136617 154805 194876
10840A94876m4851p6445K5761Q4091N4503k4022k1652n098k2883l8942j9252L098
$$ 194876 150025 73580 99341 183432 237935 213913 192261 187163 164280 125338 106086 109184
10828A09184O0279J2882l3410m342N6257j50o1751k6745J9309j5056R463j8272
$$ 109184 169463 182345 148935 144593 200850 200700 138949 112204 131513 116457 125920 107648
10816A07648K2302j4905j0034L8960N6772p889j3577J5261m1720m9999L3586l9572
$$ 107648 129950 115045 105011 143971 200743 192854 179277 194538 152818 102819 136405 96833
10804I6833m7623L240q623O890r832L31J22377M9536O518m5345m5769J0245R091
$$ 96833 49210 52450 43827 50717 40885 41216 163593 213129 219647 174302 128533 138778 147869
10791A47869j291o404k2233m8178k9753o82j9584J4609O6651O1322k5754l0456
$$ 147869 146578 140174 117941 69763 40010 39328 19744 34353 101004 162326 136572 106116
10779A06116k3960N6378j7128n0670R755O3261p318m935N097n8636k2013j7940
$$ 106116 82156 138534 121406 70736 80491 143752 136434 131499 136596 77960 55947 38007
10767C8007l739M6540L7467j0243l86k0749k1813j7487p667k4935R687L0223k422
$$ 38007 34268 80808 118275 108032 107646 86897 65084 47597 39930 14995 24682 54905 52483
10754E2483n7876J0151P7120J9160n4829k5773L5547K429L0528J2944q3695q8211
$$ 52483 -5393 4758 81878 101038 46209 20436 55983 58412 88940 101884 18189 -70022
10742g0022J6197J3636J7544k2732k0998R1229R1438k6944k6736K1629k3082J1458
$$ -70022 -53825 -40189 -22645 -45377 -66375 24854 116292 89348 62612 84241 61159 72617
10730G2617l533P486M910k9054p4821l2343P8623R4780R256J1839l8624j6542
$$ 72617 69084 76570 81480 52426 -22395 -54738 23885 118665 127921 139760 101136 84594
10718H4594M3635K3579j3509l6462r922l9971j7410j5457k6964N7380N1344l856
$$ 84594 128229 151808 138299 101837 91915 51944 34534 19077 -7887 49493 100837 96981
10706I6981R997L2352l8351j2678L6289l5089j0379L219P325N3553k3911k7817
$$ 96981 106978 139330 100979 88301 124590 89501 79122 82341 89666 143219 119308 91491
10694I1491L2430M7663R790k1472n1923P6009Q0233J03017J31303J18816K63748
$$ 91491 123921 171584 181374 159902 107979 183988 264221 367238 498541 617357 881105
10683H81105L15622L36862K77083K07127o4000m90860m77908l29021j88304o5380
$$ 881105 1196727 1533589 1810672 2017799 1953799 1462939 985031 656010 467706 402326
10673D02326o2182q6604m0216K548Q022n5493j39127k6203N3358P6541K9874o977
$$ 402326 340144 253540 213324 215872 223894 168401 29274 3071 56429 132970 162844 155867
10661A55867n2857j1150M2517p327n1606j7701N0144M9322M9746o3983P630n537
$$ 155867 103010 91860 134377 127050 75444 57743 107887 157209 206955 142972 150602 145065
10649A45065J7021K6300o6052j9885k7223J3056k7031n944L1269L1402K6643l3233
$$ 145065 162086 188386 122334 102449 75226 88282 61251 55307 86576 117978 144621 111388
10637A11388j13543J4083R983l1262l692N1294O3917m4679J7761M1472j3376m6269
$$ 111388 -2155 11928 21911 -9351 -13043 38251 102168 57489 75250 116722 103346 57077
10625E7077J2343M2737l0220n8416j5146j8760m7197M9557J5850Q3648L3776o819
$$ 57077 69420 112157 81937 23521 8375 -10385 -57582 -8025 7825 91473 125249 118430
10613A18430l3010L2136j1773j939j3730n9905n8362J8178K5742J8268k802m539
$$ 118430 85420 117556 105783 103844 90114 30209 -28153 -9975 15767 34035 31233 26694
10601B6694M776L6412L6634K6756l0017r4518l344O3177L006m322q442r499j3411
$$ 26694 31470 67882 104516 131272 101255 6737 3393 66570 69576 65254 56812 47313 33902
10588C3902r917m5641j5096Q857K9770K6898L3988L2877n3159o8456k0592M2560
$$ 33902 23985 -21656 -36752 -27895 1875 28773 62761 95638 42479 -25977 -46569 -4009
10576d009N6048K0554j1271o4069m758n9265J5664J5929N7031J4696k5452o2114
$$ -4009 52039 72593 61322 -2747 -7505 -66770 -51106 -35177 21854 36550 11098 -51016
10564e1016o813Q9245N3191l3748k4270J4743n6661j1093q821j2830j2029l58
$$ -51016 -57829 31416 84607 50859 26589 41332 -15329 -26422 -35243 -48073 -60102 -60460
10552f0460o5677r693K6655M9338p050K0309N3240L6346K6801K4949l6764J3490
$$ -60460 -126137 -135830 -109175 -59837 -66887 -46578 6662 43008 69809 94758 57994 71484
10540G1484L7609N3896k7500n1076l0506n8693j2515N1802L2313l0882l5142K2612
$$ 71484 109093 162989 135489 84413 53907 -4786 -17301 34501 66814 35932 790 23402
10528B3402J0207L1417j9101Q219l2740Q679N759j32O5629l0801p2375L0869M5622
$$ 23402 33609 65026 45925 54144 21404 30083 35842 35710 101339 70538 -1837 29032 74654
10515G4654K596N526n6649k4298L3684N4330j9597j6996J5671J6001J03863R2432
$$ 74654 77250 82776 26127 1829 35513 89843 70246 53250 68921 84922 188785 281217
10503B81217N8273k7108J5112m2770m8664j3845p9949n4520r02l6804j7333L2936
$$ 281217 339490 312382 327494 284724 236060 222215 142266 87746 86844 50040 32707 65643
10491F5643K6069j2354m0309N6491m412r3724Q766O2826M2151k8186l58r0843
$$ 65643 91712 79358 39049 95540 91128 -2596 6170 68996 111147 82961 82603 -8240
10479h240L666N2404L3528k6383j8881p944J2827O6768j9091n3117J5779L874
$$ -8240 -4574 47830 81358 54975 36094 28150 40977 107745 88654 35537 51316 55190
10467E5190M7144L6040j6607n5304K295J2220l4528O6539K7045L8770L1011l1719
$$ 55190 102334 138374 121767 66463 68758 80978 46450 112989 140034 178804 209815 178096
10455A78096k9487K405m9639m3166o577P058R228L433k746q684l8916m3011j5556
$$ 178096 148609 151014 101375 58209 51632 58690 67918 71351 68605 59921 21005 -22006 -37562
10442c7562L369J7170L8335N7554L2232L3899J2994l3485J6283k1581j01267j929
$$ -37562 -34193 -17023 21312 78866 111098 144997 157991 124506 140789 119208 17941 16012
10430A6012O4341J9958m1279j5410q686O035j8851k6308n645p12j2805P2355L3776
$$ 16012 80353 100311 59032 43622 34936 40971 22120 -4188 -9833 -10545 -23350 49005 82781
10417H2781J3704m4q1109p432J0926k454m3004o0602n623L45L9785K0992L2757
$$ 82781 96485 96441 15332 7900 18826 16372 -26632 -87234 -92857 -92512 -52727 -31735 1022
10404A022M2379l797L4760L7908j4811k6986o8l4239n8722K9294K7221M4544l3571
$$ 1022 43401 39604 74364 112272 97461 70475 70407 36168 -22554 6740 33961 78505 44934
10391D4934k6137n5234L0380N3457k1727j8985J4111K392o8948k8170K8737J6322
$$ 44934 18797 -36437 -6057 47400 25673 6688 20799 23191 -45757 -73927 -45190 -28868
10379b8868M186p932K2630J9883n501n1312o4628K8959N2020K5491K2264j3257
$$ -28868 -24682 -32614 -9984 9899 4398 -46914 -111542 -82583 -30563 -5072 17192 3935
10367C935l5460j0924P5516P7775l306l0292m9080N15o5248j1095j3668P0100
$$ 3935 -31525 -42449 33067 110842 107536 77244 28164 28679 -36569 -47664 -61332 8768
10355H768N253O240k075J3940l3816l3472j8223K6789O4419J6030n7741K6638
$$ 8768 14021 20261 18186 32126 -1690 -35162 -53385 -26596 37823 53853 -3888 22750
10343B2750J2164R413K4867j7026m4694l0643L929q840P7656L7052j648l7213
$$ 22750 34914 44327 69194 52168 7474 -23169 -19240 -28080 49576 86628 84980 47767
10331D7767k5977m5978K6966Q328P2590P240k4620K4966k5998J19470J06094L2843
$$ 47767 21790 -24188 2778 11106 83696 90936 66316 91282 65284 184754 290848 323691
10319C23691L9832N9801m2285q9769p0520o2370l2504m4132n7236k2037J1121
$$ 323691 363523 423324 381039 291270 220750 158380 125876 81744 24508 2471 13592
10308A3592M2394L6057m0403j7486K1642N4921J5601m8707k2703j3211N3603M4988
$$ 13592 55986 92043 51640 34154 55796 110717 126318 77611 54908 41697 95300 140288
10296A40288L6640l0242l1857M472J6336m603K8116k5505k6493j8947j9975k0409
$$ 140288 176928 146686 114829 119301 135637 131034 159150 133645 107152 88205 68230 47821
10284D7821K2560j797J6266K8978j8878k0407K1969J2845M1208J9789j19768m5873
$$ 47821 70381 68584 84850 113828 94950 74543 96512 109357 150565 170354 50586 4713
10272D713q288O8974l5368k0832j6148k2880L7243M1806k0644J427P485J929J1687
$$ 4713 -3575 65399 30031 9199 -6949 -29829 7414 49220 28576 30003 37488 39417 51104
10259E1104j2605k5108l1225M0786N8948J7658p365m0964n7148m5029O400k169
$$ 51104 38499 13391 -17834 22952 81900 99558 92193 51229 -5919 -50948 -44548 -46717
10247d6717K9644Q1039P589K4367K1959M384l4364m1240J108k0314q550m4716
$$ -46717 -17073 63966 71555 95922 117881 122265 87901 46661 47769 27455 18905 -25811
10235b5811k637p596K4437p482j4978J6172K9534l6510n2651K5680N3492L5227
$$ -25811 -28448 -36044 -11607 -19089 -34067 -17895 11639 -24871 -77522 -51842 1650 36877
10223C6877q518K0186J4939N8855K5374m7044q1912j7072k1501j5366n743Q4265
$$ 36877 28359 48545 63484 122339 147713 100669 18757 1685 -19816 -35182 -40925 43340
10211D3340N3890o887J88j2981l0574j065K3987L6m4323k4043l378n049M0862
$$ 43340 97230 90343 90531 77550 46976 45911 69898 69934 25611 1568 -1810 -6859 34003
10198C4003K1501K1834j2366j7034n4361J2626Q15j4199L1510J8236l2728j0091
$$ 34003 55504 77338 64972 47938 -6423 6203 7018 -7181 24329 42565 9837 -254
10186b54M9798M2404k07o1027m9895m6921j9484J7519k5693l6888N1531O1141
$$ -254 49544 91948 91741 30714 -19181 -66102 -85586 -68067 -93760 -130648 -79117 -17976
10174a7976N0503L6507m9379J6600r637P439l0019j9172O3959l5331n1756J5601
$$ -17976 32527 69034 19655 36255 26618 34057 4038 -15134 48825 13494 -38262 -22661
10162b2661J6682q989n0504J6227J2677J0862j9738k068k4303o140L4284j1804
$$ -22661 -5979 -14968 -65472 -49245 -36568 -25706 -45444 -47512 -71815 -77955 -43671 -55475
10150e5475n4387M2950l234L8720J484R466N5318J5723k0352k8317m9968J41k394
$$ -55475 -109862 -66912 -70146 -31426 -29942 -20476 34842 50565 30213 1896 -48072 -47931 -50325
10137e0325J0680l1916N979P132L0880K470k1459L4623N0752K2417M851j1975
$$ -50325 -39645 -71561 -65582 -58450 -27570 -25100 -46559 -11936 38816 61233 66084 54109
10125E4109n1157J8359k9782J0627k6751p0119q0420j5139K4479J4305K1383N4453
$$ 54109 2952 21311 -8471 2156 -24595 -94714 -175134 -190273 -165794 -151489 -130106 -75653
10113g5653M0927M2966M1046k568l1871j8472N0564j7070o646J2529R441k7769
$$ -75653 -34726 8240 49286 46718 14847 -3625 46939 29869 23223 35752 45193 17424
10101A7424p6035l7739j4879K4094O9639L6678k7206j06415K891m4409P0328J08253
$$ 17424 -58611 -96350 -111229 -87135 -17496 19182 -8024 -114439 -111548 -155957 -85629 22624
10089B2624j1302k7903l3153J6715L6885N9892k380l1069k9556J6268o8583k8656
$$ 22624 11322 -16581 -49734 -33019 3866 63758 61378 30309 753 17021 -51562 -80218
10077h0218M7993j3028K2839P2087n5057O295J7370o1681o1452L3846P2316j8547
$$ -80218 -32225 -45253 -22414 49673 -5384 911 18281 -43400 -104852 -71006 1310 -17237
10065a7237K0648j7630l2695n9542J5706N4614K8166J9203j5217k0268j8332j243
$$ -17237 3411 -14219 -46914 -106456 -90750 -36136 -7970 11233 -3984 -24252 -42584 -43827
10053d3827p142K6412L5202n76Q811k7468j6532L1989R4188q5693r162n262j9442
$$ -43827 -50969 -24557 10645 10069 18880 -8588 -25120 6869 101057 15364 6202 940 -18502
10040a8502J4233L2342M4452K5027l4182j32510J3314K5530o340j1901J8184M6678
$$ -18502 -4269 28073 72525 97552 63370 -69140 -55826 -30296 -36636 -48537 -30353 16325
10028A6325N8491P6601k3915m3175j6749n2410J7095j0446m0981r862N0948n1578
$$ 16325 74816 151417 127502 84327 67578 15168 32263 21817 -19164 -29026 21922 -29656
10016b9656J1470j2865l9476k5749q978J2025M2381R498k9369J531L1141l929
$$ -29656 -18186 -31051 -70527 -96276 -105254 -93229 -50848 -41350 -70719 -69188 -38047 -41976
10004d1976J1317k8026M0274R3109k6835j0263j7394O487N3214p366j7565l6897
$$ -41976 -30659 -58685 -18411 74698 47863 37600 20206 26693 79907 72541 54976 18079
9992A8079J2145k5524K8712L3571J413j4691J2490K4874j8439j5808p0162n9782
$$ 18079 30224 4700 33412 66983 68396 53705 66195 91069 72630 56822 -13340 -73122
9980g3122M2604K0088J3709J8296P077K3419q7184m2862M0643K4310n9213J530
$$ -73122 -30518 -10430 3279 21575 28652 52071 -35113 -77975 -37332 -13022 -72235 -70705
9968g0705N0649K5705K3394r927J7268J5900p2174K8978J3105l931K4477O359
$$ -70705 -20056 5649 29043 19116 36384 52284 -19890 9088 22193 18262 42739 49098
9956D9098k9339m9940j1763M457O0814O1380j2278n5176M008o2162k116m8616
$$ 49098 19759 -30181 -41944 -37487 23327 84707 72429 17253 21261 -40901 -43017 -91633
9944i1633o5357N7374P4089L1051M0258L767l3847l9138J9182N1602Q968k3078
$$ -91633 -156990 -99616 -25527 5524 45782 49549 15702 -23436 -4254 47348 56316 33238
9932C3238o6666q9278J9534J43404O2271K0233r911m0359K650k7229L6132l1311
$$ 33238 -33428 -122706 -103172 40232 102503 122736 112825 72466 75116 47887 84019 52708
9920E2708m5101p4293m6060m2232q96L8502P599J8881O435K1185M7004J05176
$$ 52708 7607 -66686 -112746 -154978 -155874 -117372 -109773 -90892 -84457 -63272 -16268 88908
9908H8908O3813n4555p1727l1607L85M0757J4409k344P448l370k199l1836k8305
$$ 88908 152721 98166 26439 -5168 -4783 35974 50383 48039 55487 52117 49918 18082 -10223
9895a0223N0968K7271O286j746l9878K7155L4518l5322n5201p851K897Q322J7791
$$ -10223 40745 68016 74302 72556 32678 59833 94351 59029 3828 -4023 -1126 7196 24987
9882B4987O275k826l9766m0358K5799M8690j3421j0350L1156j5341J3465L5164
$$ 24987 31262 28436 -11330 -51688 -25889 22801 9380 -970 30186 14845 28310 63474
9870F3474m2316p5700j5129Q263J9200J4060Q4426K9978l6865N660J7045M966
$$ 63474 21158 -54542 -69671 -61408 -42208 -28148 56278 86256 49391 55051 72096 77062
9858G7062P57l7388q2275J6307O8996o857m4357o22j3505K0733p257M5378L4725
$$ 77062 77819 40431 -41844 -25537 43459 36602 -7755 -8377 -21882 -1149 -8406 36972 71697
9845G1697l8060M4075n389m5458n382N3427J2395l5276n5581j2903p93l4285p9862
$$ 71697 33637 77712 72323 26865 21483 74910 87305 52029 -3552 -16455 -17248 -51533 -131395
9832a31395L9820K7061Q0569O1610Q10p4271p0648O107k204p175O007n381m0905
$$ -131395 -91575 -64514 16055 77665 78475 4204 -66444 -60337 -62541 -69716 -63709 -69090 -109995
9819a09995L2516N5706M0112j3193K2532o745k7721j6260K9270K1903L0951l0076
$$ -109995 -77479 -21773 18339 5146 27678 20933 -6788 -23048 6222 28125 59076 29000
9807B9000j3625k3170k9540p889r896k7429Q918M267j3703k4450j0549k1899K8938
$$ 29000 15375 -7795 -37335 -45224 -55120 -82549 -73631 -69364 -83067 -107517 -118066 -139965 -111027
9794a11027K4557O3133O0665K040K2541m3172O439Q4498P545l3395J8850l6454
$$ -111027 -86470 -23337 37328 39368 61909 18737 25176 109674 117219 83824 102674 66220
9782F6220n0347o8108K04L9579L0862K397k2211m7152k7321L5634P808M5393K2504
$$ 66220 15873 -52235 -52031 -12452 18410 20807 -1404 -48556 -75877 -40243 -32435 12958 35462
9769C5462l2040K6740P2520o5350p7438q7819Q020O7040L8789K1186L8879m104
$$ 35462 3422 30162 102682 37332 -40106 -127925 -119905 -52865 -14076 7110 45989 41885
9757D1885p7834J0232m157j6117L1103Q3700m7922l4453J5909M1674L8946p3205
$$ 41885 -35949 -25717 -29874 -45991 -14888 68812 20890 -13563 2346 44020 82966 9761
9745I761l3382K9344K7882L0624j9971k7721p6600k9748J5139J862K3142L0842
$$ 9761 -23621 5723 33605 64229 44258 16537 -60063 -89811 -74672 -72810 -49668 -18826
9733a8826J4431O955J1565n5357q030K7867K90p132l640L7795K8846k844j0085
$$ -18826 -4395 2560 14125 -41232 -49262 -21395 -21105 -28237 -31877 5918 34764 31920 21835
9720B1835P3549n4426k9316M628q055n8057M114n998J0131J2450M9501j024M703
$$ 21835 95384 40958 11642 16270 8215 -49842 -45728 -51726 -41595 -29145 20356 19332 24035
9707B4035L6266L2790r2121o253k8256m2060J7970R660L1902j4587J1386L7590
$$ 24035 60301 93091 970 -5283 -33539 -75599 -57629 -47969 -16067 -30654 -19268 18322
9695A8322K1536l9737o7749n421K4281m2810J6907Q4436K7088m6800l9537m512
$$ 18322 39858 121 -67628 -73049 -48768 -91578 -74671 9765 36853 -9947 -49484 -53996
9683e3996O7j2479l571l942m3061n657J808N8952R4267j8286K2052N6434P900
$$ -53996 -53929 -66408 -69979 -73921 -116982 -122639 -120831 -61879 32388 14102 36154 92588 100488
9670A00488l1064J6768L798k5567M2624O0318m931m9357J8485J7220J8458k7127
$$ 100488 69424 86192 89990 64423 107047 167365 162434 113077 131562 148782 167240 140113
9658A40113r3975m2338l2509j9825l6375K7461J1717K5672N5937N2213M61m945
$$ 140113 46138 3800 -28709 -48534 -84909 -57448 -45731 -20059 35878 88091 88552 83607
9646H3607n3415k0732N1927k5216m1337J9403J5319N2983J02319K0890J7743j9798
$$ 83607 30192 9460 61387 36171 -5166 14237 29556 82539 184858 205748 223491 203693
9634B03693n0886k0832m9500m6464J8614O6015P4872M1372o914o9406j316p962
$$ 203693 152807 131975 82475 36011 54625 120640 195512 236884 229970 160564 159248 151286
9622A51286N1217P7407L4922J8098L5046K3137q621l7754l612j1640m9649n9320
$$ 151286 202503 279910 314832 332930 367976 391113 382492 344738 341126 329486 279837 220517
9610B20517l2959J8209J0941j938N3736J0484J3723n9312r0863K5415Q7110K1993
$$ 220517 187558 205767 216708 214770 268506 278990 292713 233401 142538 167953 255063 277056
9598B77056j6282m9440o7365k1856K6948Q137K1393o230m6709J2085j6371j4989
$$ 277056 260774 211334 143969 122113 149061 157198 178591 172361 125652 137737 121366 106377
9586A06377J077j2437M5916M0024R093j8420K3391o3903p5082J4076Q4668M1251
$$ 106377 107454 95017 140933 180957 190050 171630 195021 131118 56036 70112 154780 196031
9574A96031M4860L1084r207P0746M8760M5009O8154M3574R515k8995k2027l026
$$ 196031 240891 271975 262768 333514 382274 427283 495437 539011 548526 519531 497504 494478
9562D94478j1266k2996p0422l7859q2604m3845J2367N036j707J2064K1159l4834
$$ 494478 483212 460216 389794 351935 269331 225486 237853 242889 241182 253246 274405 239571
9550B39571L9355J6270N115j1582L705j6367M6809l3809r3037m6041q279k2693
$$ 239571 278926 295196 300311 288729 292434 276067 322876 289067 196030 149989 141710 119017
9538A19017l8936N1419l1018M985Q1955j7962l441m6693L704M5233J1734L878
$$ 119017 80081 131500 100482 105467 187422 169460 166019 119326 123030 168263 179997 183875
9526A83875J1356Q279K1263O0927L2925L4200O0448l609N9303M1101K8335l1429
$$ 183875 195231 203510 224773 285700 318625 352825 413273 409664 468967 510068 538403 506974
9514E06974l5444n1830r3982o2256k8523o5464N374O1849P2580L1613M143K571
$$ 506974 471530 419700 325718 263462 234939 169475 174849 236698 309278 340891 345034 347605
9502C47605J8613m5207j09472n2199J7932l9048o8500n9559N0656P728l7358j007
$$ 347605 366218 321011 211539 159340 177272 138224 69724 10165 60821 68549 31191 30184
9490C0184m5251J7886P3509P8177n1798m7332k5610M837o485O3926l6070j4250
$$ 30184 -15067 2819 76328 154505 102707 55375 29765 34602 28117 92043 55973 41723
9478D1723J6217k7021K7921M2623K881j5707l3882k0907J8755O9207J15076P4520
$$ 41723 57940 30919 58840 101463 104344 88637 54755 33848 52603 121810 236886 311406
9466C11406R769o1014n5727j18034n0895j4421k940J3172L0316m712K0138j8452
$$ 311406 321175 260161 204434 86400 35505 21084 18144 31316 61632 56920 77058 58606
9454E8606K5795J6935l0913j5150j4156l333o2012M1416j801k2108r765N341j206
$$ 58606 84401 101336 70423 55273 41117 37784 -24228 17188 15387 -6721 -16486 -11145 -12351
9441a2351M7816M6888N150n8305n3605m0088R8246P5666m9016k9891Q2205L0922
$$ -12351 35465 82353 87503 29198 -24407 -64495 33751 109417 60401 30510 112715 143637
9429A43637j7630m0682k0883R546J0449K5903L4676j0996j4363J8553m4124m5948
$$ 143637 126007 85325 64442 73988 84437 110340 145016 134020 119657 138210 94086 48138
9417D8138K9227m6525L7K7870N442m334R477l5417p488L9568L2071J3488k393
$$ 48138 77365 30840 30877 58747 64189 59855 69332 33915 26427 65995 98066 111554 109161
9404A09161m4138O157R314q187j1550o0026j3651N478r522j1624J3167j7037j5341
$$ 109161 65023 71180 80494 72307 60757 731 -12920 -7442 -16964 -28588 -15421 -32458 -47799
9391d7799N113K263K57P3316j9594m1168k3470o7793N354P1420M4075L5128k6509
$$ -47799 -42686 -40423 -40166 33150 13556 -27612 -51082 -118875 -113521 -42101 1974 37102 10593
9378A0593n6274K0726j736K0212O7893j5228k7665J5515k1367M0537R847m3343
$$ 10593 -45681 -24955 -26691 -6479 61414 46186 18521 34036 12669 53206 63053 19710
9366A9710j2990j2916J3890J7600j2223J1354J2147l377l8737J3156J8614n9917
$$ 19710 6720 -6196 7694 25294 13071 24425 36572 33195 -5542 7614 26228 -33689
9354c3689P199L2894J9790K6078n3533j1812J8971o5041J4244N3750J8073k0109
$$ -33689 -26490 6404 26194 52272 -1261 -13073 5898 -59143 -44899 8851 26924 6815
9342F815J2074n989k8331J8664R388m8900J9234O416k707N4645P9990K7718m7908
$$ 6815 18889 12900 -15431 3233 12621 -36279 -17045 -10629 -13336 41309 121299 149017 101109
9329A01109k8641K5337L0988J2641M6285k7315n3114j6629k977j5226k9449r149
$$ 101109 72468 97805 128793 141434 187719 160404 107290 90661 87684 72458 43009 33860
9317C3860R625k7421L0283J7658m3205l5238j6019k4085J1480k367J8882L5526
$$ 33860 43485 16064 46347 64005 20800 -14438 -30457 -54542 -43062 -45429 -26547 8979
9305H979k9796m1850M6832O9557k3735O0697l5067j7651N4228K8490k5049q8666
$$ 8979 -20817 -62667 -15835 53722 29987 90684 55617 37966 92194 120684 95635 6969
9293F969k1293l6316L183L7477o223j0727J8939L5012P1251M5788M0955j9679
$$ 6969 -14324 -50640 -47457 -9980 -16203 -26930 -7991 27021 98272 144060 185015 165336
9281A65336p3664k3344n9528l6043l1718J3666P5460j9679m5228n0664j3237O8463
$$ 165336 91672 68328 8800 -27243 -58961 -45295 30165 10486 -34742 -85406 -98643 -30180
9269c0180M6036m2505j1709N6562M8155L5623r900J2639P596l79J9150o396K9385
$$ -30180 15856 -26649 -38358 18204 66359 101982 92082 104721 112317 111938 131088 124692 154077
9256A54077p9103n3734l4525K7912j3319q635L2990P0471L0193K828K0105O92
$$ 154077 74974 21240 -13285 14627 1308 -7327 25663 96134 126327 129155 149260 149952
9244A49952j6939j7931m5492m4431j0735N5351j51J0601j2262k9045k4390K4641
$$ 149952 133013 115082 69590 25159 14424 69775 69624 80225 67963 38918 14528 39169
9232C9169Q053L5091M205m2861J0393l5349L7873J6191l6911k1980J956N249j0068
$$ 39169 47222 82313 86518 43657 54050 18701 56574 72765 35854 13874 15830 21079 11011
9219A1011j3289J9014M2791J3465j9089j2901m7140k0720Q934j1259m1142M628
$$ 11011 -2278 16736 59527 72992 53903 41002 -6138 -26858 -17924 -29183 -70325 -65697
9207f5697L4967O1534P253l9841Q528K4166l668K0700K328P656j1838k8478m1931
$$ -65697 -30730 30804 38057 -1784 6744 30910 27242 47942 50270 57926 46088 17610 -24321
9194b4321L7831N3760j3808p532J8825j7816k0919k0060m00P2331M6679p470m2723
$$ -24321 13510 67270 53462 45930 64755 46939 26020 5960 5560 77891 124570 117100 74377
9181G4377j9116J5905Q243k5482o2406J3827Q9251J4386l7982m6883L2806O2561
$$ 74377 55261 71166 79409 53927 -8479 5348 94599 108985 71003 24120 56926 119487
9169A19487J5319L489L6778j8406m0749l9941P3144N1366l7480K2438p5537N024
$$ 119487 134806 138295 175073 156667 115918 75977 149121 200487 163007 185445 109908 114932
9157A14932r21J0242k4161m2053r855Q8105J0192L6505Q645k1124m1761N9895
$$ 114932 114011 124253 100092 58039 48184 136289 146481 182986 191631 170507 128746 188641
9145A88641J1253l5125j7670M5537j691m2521K7452Q5201q150L6578K395p798
$$ 188641 199894 164769 147099 192636 190945 148424 175876 261077 252927 289505 291900 284102
9133B84102K4182J7640k027L6486J7295r306L442K8381N9465L8218L1547m6967
$$ 284102 308284 325924 323897 360383 377678 368372 371814 400195 459660 497878 529425 482458
9121D82458L8150N4365M6863R2930M646j1907M1679N355P4840J13504Q8625N6712
$$ 482458 520608 574973 621836 714766 719412 707505 749184 754539 829379 942883 1031508 1088220
9109A088220J07194J80924J51131J85680K39409K66999L04435L53352M57189O37040
$$ 1088220 1195414 1376338 1527469 1713149 1952558 2219557 2523992 2877344 3334533 3971573
9099C971573R43177J224124J620909K334389L475828N167571O812333P435335
$$ 3971573 4914750 6138874 7759783 10094172 13570000 18737571 25549904 32985239
9091C2985239O395937M596543J665448l763552q443168q423399o089838m036009
$$ 32985239 39381176 43977719 45643167 41879615 33436447 25013048 18923210 14887201
9083A4887201k784281j862425j401226j101932p55368n94505m73165m20734l63768
$$ 14887201 12102920 10240495 8839269 7737337 6981969 6387464 5914299 5493565 5129797
9074E129797l06060k80704k09133k26244k24202j97003j96328k30605r0021p7674
$$ 5129797 4823737 4543033 4333900 4107656 3883454 3686451 3490123 3259518 3169497 3091823
9064C091823j05370j29683q2949j3351o6171r2377K037k4232j10697q8923r3352
$$ 3091823 2986453 2856770 2773821 2760470 2694299 2601922 2603959 2579727 2469030 2380107 2286755
9053B286755p8778j13140n0983o1125l7566J479O6064l3400k4410l36j0980j0940
$$ 2286755 2207977 2094837 2043854 1982729 1945163 1946642 2012706 1979306 1954896 1954560 1943580 1932640
9041A932640p2037j12249j47692j05539m4447M4324l7337p9940j08817k5021L136
$$ 1932640 1860603 1748354 1600662 1495123 1450676 1495000 1457663 1377723 1268906 1243885 1247021
9030A247021n4178k7465p774O236j0451n245l3872q5388l4134N2128l3634p6285
$$ 1247021 1192843 1165378 1157604 1163840 1153389 1148144 1114272 1028884 994750 1046878 1013244 936959
9018I36959p6286O864l721l560O076p7922L506L2169l69l4396l0628J9847J8431
$$ 936959 860673 867537 863816 860256 866332 788410 791916 824085 823716 789320 758692 778539 796970
9005G96970N5346O1569N9107K0322Q454J8714M7004L3669O586J8664m9398l9534
$$ 796970 852316 913885 972992 993314 1001768 1020482 1067486 1101155 1107741 1126405 1077007 1037473
8993A037473n6982m9619q0554m7731L2384j3305m6206o3740n5508J0037m5399
$$ 1037473 980491 930872 850318 802587 834971 821666 775460 711720 656212 666249 620850
8982F20850J7838m552n1927k3720k3958m1884j00093m7530j427J8832j1298M9337
$$ 620850 638688 634136 582209 558489 534531 492647 392554 345024 343597 362429 351131 400468
8970D00468M107l92J1661M5617k5531O845L6138P333p5375j9226L9278O8179j5293
$$ 400468 404575 404183 415844 461461 435930 442775 478913 486246 410871 391645 430923 499102 483809
8957D83809J1995M8210M7677M6452M6549M8682J2018L0461P6752L0130j6736o6776
$$ 483809 495804 544014 591691 638143 684692 733374 745392 775853 852605 882735 865999 799223
8945G99223o1571o2769n6710o1207p4547m0365k6867o0981m3715k3830k884j7655
$$ 799223 737652 674883 618173 556966 482419 442054 415187 354206 310491 286661 283777 266122
8933B66122N376L6469k2339J0148J1539p099k1590j6947J1802K2210N8557m3659
$$ 266122 271498 307967 285628 295776 307315 300216 278626 261679 273481 295691 354248 310589
8921C10589r5614P42M4919j1980l9845L231j9996j119O468O586O4805L8105Q835
$$ 310589 214975 215717 260636 248656 208811 212042 192046 190927 197395 203981 268786 306891 315726
8908C15726K6335Q4627J1215J7300k9443j7614N4319M1713r208k7971o8165o6413
$$ 315726 342061 426688 437903 455203 425760 408146 462465 504178 494970 466999 398834 332421
8896C32421n3338j10101j03958m5396N2553P7353N2510o44L6518K6831J5010J1226
$$ 332421 279083 168982 65024 19628 72181 149534 202044 201400 237918 264749 279759 290985
8884B90985l1964n0844l3659k9550l1341Q6905o397k5581n7379M1363P9918K6703
$$ 290985 259021 208177 174518 144968 113627 200532 194135 168554 111175 152538 232456 259159
8872B59159n8311m8134l7716L3307K4659J7698K6690r849o6222k1043l8076k9947
$$ 259159 200848 152714 114998 148305 172964 190662 217352 207503 141281 120238 82162 52215
8860E2215N2398K7095J0330N266J7997j2224K3361J3130r3162l2352O7773J7436
$$ 52215 104613 131708 142038 147304 165301 153077 176438 189568 96406 64054 131827 149263
8848A49263n6099J0930q315l571k8897q153p990k0177j1461L838K0769M6750p502
$$ 149263 93164 104094 95779 92208 63311 55158 47168 26991 15530 19368 40137 86887 79385
8835G9385m2989J8620L0186K2611K8150k3857o7662l5812m7205n0342J4948K1889
$$ 79385 36396 55016 85202 107813 135963 112106 44444 8632 -38573 -88915 -73967 -52078
8823e2078L1485P5657N5488l2498o8245N9950q79J7249M485l3119o6383k0952
$$ -52078 -20593 55064 110552 78054 9809 69759 68880 86129 90614 57495 -8888 -29840
8811b9840J18O5219N6894n2899l5587M2252K8655J4383k9177j8241k7973n065
$$ -29840 -29722 35497 92391 39492 3905 46157 74812 89195 60018 41777 13804 8739
8799H739R030J0794J9543N5580o7277r4283J104O2929J2520k1025l5759L0460
$$ 8739 17769 28563 48106 103686 36409 -57874 -56770 6159 18679 -2346 -38105 -7645
8787g645J02223J8536p849k6126j3429l554J5117L6608q432j2297J62l286o5589
$$ -7645 94578 113114 105265 79139 65710 62156 77273 113881 105449 93152 93314 90028 24439
8774B4439o7556L3877L9103J4891j1774K2l6143j4531m5416J00116P7178n9436
$$ 24439 -43117 -9240 29863 44754 32980 33002 -3141 -17672 -63088 37028 114206 54770
8762E4770j5203o657K0462M5960M4948J7379k0593o488l67O74m7146l9584l197
$$ 54770 39567 32910 53372 99332 144280 161659 141066 134578 134211 134885 87739 48155 44958
8749D4958L010j9184k4907P025j5250j5959J4047k095R7817L6199J4686K397o2283
$$ 44958 47968 28784 3877 10902 -4348 -20307 -6260 -8355 89462 125661 140347 142744 80461
8736H0461l5481J8729J2518P8695m1690P220N3127o379n910L7301J3337L6578
$$ 80461 44980 63709 76227 154922 113232 120452 173579 167200 161290 198591 211928 248506
8724B48506j3792n5561k6262k6386j868j1652K0941l2270L5342l6191p3956m6788
$$ 248506 234714 179153 152891 126505 124637 112985 133926 101656 136998 100807 26851 -19937
8712a9937K473J7304K6289J2129J4302l9477K094M6337J4692k3783j4299k1860
$$ -19937 -17464 -160 26129 38258 52560 13083 15177 61514 76206 52423 38124 16264
8700A6264j7202l536Q6027J2070L90J414k8982K8854j0406k8298P4325J9752l2488
$$ 16264 -938 -4474 81553 93623 94013 95427 66445 95299 84893 56595 130920 150672 118184
8687A18184j2122r80L8730n335J763r518O4428j6461L291n112p69Q259Q942r66
$$ 118184 106062 105082 143812 138477 140240 130722 195150 178689 181980 176868 176099 184358 193300 192334
8673A92334J6093l4007o8443L3320N634L4326Q273l1043k2283L9778K7886k7281
$$ 192334 208427 174420 105977 139297 144931 179257 187530 156487 134204 173982 201868 174587
8661A74587k7044M7476M8358O560m6974J5333K3241m9743J5446j714J6295J00847
$$ 174587 147543 195019 243377 249937 202963 218296 241537 191794 207240 205526 221821 322668
8649C22668K9371l9346K661L3857N4222K3667o8334p3934j8500K1458Q1712K5843
$$ 322668 352039 312693 315354 349211 403433 427100 358766 284832 266332 287790 369502 395345
8637C95345L455O0850n0784l765J6365M5640L1510M4249K6515M5074J2857Q9058
$$ 395345 398800 459650 408866 405101 421466 467106 498616 542865 569380 614454 627311 716369
8625G16369R9651l2653o4376L6118R0993N5315J3691K581p9988n1937M6546L1156
$$ 716369 816020 783367 718991 755109 846102 901417 915108 917689 837701 785764 832310 863466
8613H63466o57K404k6804o6210m648j0369K8091J3379j7964M4628P4485K0800
$$ 863466 862809 865213 838409 772199 767551 757182 785273 798652 780688 825316 899801 920601
8601I20601l3218J8245k76r194l9114n5462j6520k1158K0659l9072q5303m5918
$$ 920601 887383 905628 905352 896158 857044 801582 785062 763904 784563 745491 660188 614270
8589F14270n6192q5711o7585j2976K6073k9861j9509K2648m7694k9442k738p760
$$ 614270 558078 472367 404782 391806 417879 388018 368509 391157 343463 314021 311283 303523
8577C03523M3689M4338L2569M0715M5709j1404j5458M559p7950n5968l9979R406
$$ 303523 347212 391550 424119 464834 510543 499139 483681 488240 410290 354322 314343 323749
8565C23749p35j6015J2627J8058L5314k5415o907o1087o7843R168N7111O1479
$$ 323749 323014 306999 319626 337684 372998 347583 340676 279589 211746 220914 278025 339504
8553C39504k7345l4798L4486m180k2953q954k8449o954k1878o3645O3567O542
$$ 339504 312159 277361 311847 307667 284714 275760 247311 240357 218479 154834 218401 224943
8541B24943o1675l5905N032k3988l5893O0334M9017K4455M9806Q4079Q1107J29765
$$ 224943 163268 127363 132395 108407 72514 132848 181865 206320 256126 340205 421312 551077
8529E51077J05479K8419P8012K0106j27693j75448r0876q0714m6030p199R217
$$ 551077 656556 684975 762987 783093 655400 479952 389076 308362 262332 255133 264350
8518B64350k4393k9166k0944O023O169m8187o8186L8737L5206m7355K4053L043
$$ 264350 239957 210791 189847 195870 202039 153852 85666 124403 159609 112254 136307 139350
8506A39350r4551n8070J4396K7305M5466J3028k00M1972k0143l9533j4512L7758
$$ 139350 44799 -13271 1125 28430 73896 86924 86724 128696 108553 69020 54508 92266
8494I2266K7821M4869N755j1008n1794J427K5815k3789R4482J06715P4466Q437
$$ 92266 120087 164956 170711 159703 107909 109336 135151 111362 205844 312559 387025 395462
8482C95462Q556J4425k3481j20773j05362l4651m7287m0561K7677N128K1315M7115
$$ 395462 404018 418443 394962 274189 168827 134176 86889 46328 74005 79133 100448 147563
8470A47563K5763m3660m4877o3425N081r678K7253j4448l0810q856P2936P5820
$$ 147563 173326 129666 84789 21364 26445 16767 44020 29572 -1238 -10094 62842 138662
8458A38662L459J2451K9398Q838m9303j2776Q5394R655j8436m2095j163m687p440
$$ 138662 142121 154572 183970 192808 143505 130729 216123 225778 207342 165247 164084 159397 151957
8445A51957n3165o3609k5391M081L3986N8578L170m7239o5548M5642k8595m5183
$$ 151957 98792 35183 9792 13873 47859 106437 109607 62368 -3180 42462 13867 -31316
8433c1316k1086M1604Q6919n163L969j3392j6743O0376p650j5786L1691m1205
$$ -31316 -52402 -10798 76121 70958 74927 61535 44792 105168 97518 81732 113423 72218
8421G2218q0871n5598K4749K1482J4908J6015J7214M0789k6783K4133L5316J7963
$$ 72218 -8653 -64251 -39502 -18020 -3112 12903 30117 70906 44123 68256 103572 121535
8409A21535j3122L2379M543j2394j8185q2820k8195j1038j4008L2884P1444r4696
$$ 121535 108413 140792 145335 132941 114756 31936 3741 -7297 -21305 11579 83023 -11673
8397a1673n171K8904O3722M3741m2382l3771o4359J6984R7283R663k6472n501
$$ -11673 -16844 12060 75782 119523 77141 43370 -20989 -4005 93278 102941 76469 70968
8385G0968L9862R388J627m5214k9546K0612J0054m4321n4764J3791K2889k3623
$$ 70968 110830 120218 121845 76631 47085 67697 77751 33430 -21334 -7543 15346 -8277
8373h277q232j9957J407j9778K4740L6309L6801l565l8129K2017j6474m0048m872
$$ -8277 -16509 -36466 -35059 -54837 -30097 6212 43013 39448 1319 23336 6862 -33186 -38058
8360c8058L7430K1175L9785K7157l4764n1489m6574Q30Q143N7215N5058q5694
$$ -38058 -628 20547 60332 87489 52725 1236 -45338 -44508 -36365 20850 75908 -9786
8348i786j8938O7997Rl0023L3051Q0193O7526m4658q7939J3898K2143l0326j3630
$$ -9786 -28724 39273 39282 9259 42310 122503 190029 145371 57432 71330 93473 63147 49517
8335D9517j4717L3245K459L1362m668k6344J7594j5031j3489L9960j8436j0339
$$ 49517 34800 68045 70504 101866 97198 70854 88448 73417 59928 99888 81452 71113
8323G1113J312q0496Q863L3052j7767j8880j8708Q08j0621k3570O156J0965J4270
$$ 71113 72425 -8071 792 33844 16077 -2803 -21511 -20703 -31324 -54894 -48738 -37773 -23503
8310b3503K183l2966R356L3857j1824k6050M0803K6491L5630n9263p1121N6773
$$ -23503 -21320 -54286 -44930 -11073 -22897 -48947 -8144 18347 53977 -5286 -76407 -19634
8298a9634J0279j336M3023K8511m8709j7283k782L6664J2399L9012q430N7483
$$ -19634 -9355 -10691 32332 60843 12134 -5149 -7931 28733 41132 80144 71714 129197
8286A29197L437m7640l5837M8081m4044n0042p142O1918L3392m2346k6874j1902
$$ 129197 132634 84994 49157 97238 53194 3152 -3990 57928 91320 48974 22100 10198
8274A0198N1192m400l213P857J5320L1236j6780m1148Q588P8685l9714q0672M2382
$$ 10198 61390 56990 53777 61634 76954 108190 91410 50262 58850 137535 97821 17149 59531
8261E9531M5149j5j0248J8460M2666J3782p8411j7848K5928m6603Q489M068J2140
$$ 59531 104680 104665 94417 112877 155543 169325 90914 73066 98994 52391 60880 64948 77088
8248G7088k0354L0142l109l5059J8455n665J044l0087n202n9902J1856K1560j7263
$$ 77088 56734 86876 83767 48708 67163 61498 62542 32455 27253 -32649 -20793 767 -16496
8235a6496K4325j3776J9070M6091l3741n0845Q400P1946M8103P1625L0119k1856
$$ -16496 7829 -5947 13123 59214 25473 -25372 -16972 54974 103077 174702 204821 182965
8223A82965j1055l7851K2638j2806m2111m5720L28J1859K0917J6853M4617j677
$$ 182965 171910 134059 156697 143891 101780 56060 56388 68247 89164 106017 150634 148957
8211A48957n9456o7096M9392k00O0683O0590R1357L4841p648l2466n9414l6720
$$ 148957 89501 22405 71797 71597 132280 192870 284227 319068 311420 278954 219540 182820
8199A82820j9842q147K356j4156O734m1204m6793P827K5452Q7787J10845N2317
$$ 182820 162978 154831 157187 143031 149765 108561 61768 69595 95047 182834 293679 345996
8187C45996Q4073Q3608J50799J48918J05266J67434J58252J26522O1493j52761
$$ 345996 430069 513677 664476 813394 918660 1086094 1244346 1370868 1432361 1279600
8177A279600k01557j86764k10256j61746q2641m0935o8979j03187l2126K1537
$$ 1279600 1078043 891279 681023 519277 436636 395701 326722 223535 191409 212946
8167B12946p554J1462K8546M7465N6705m7111J5186N960m3784p30J8172j4691
$$ 212946 205392 216854 245400 292865 349570 302459 317645 323605 279821 279091 297263 282572
8155B82572K3722k8606l2759q958n4401o8660p555L912K5205O4114N4677M9100
$$ 282572 306294 277688 244929 235971 181570 112910 105355 109267 134472 198586 253263 302363
8143C02363Q8873O5670M3914J67166K17320K24310L14091L52534M19648L71445
$$ 302363 391236 456906 500820 667986 885306 1109616 1423707 1776241 2195889 2567334
8133B567334R6438j90652l85721m15051l32225k36870k68306k01752j15791q4205
$$ 2567334 2663772 2473120 2087399 1672348 1340123 1103253 834947 633195 517404 433199
8123D33199k5117m2959j3482J3897J9379K3743J9246o543l1427o4367l0468j7905
$$ 433199 408082 365123 351641 365538 384917 408660 427906 421363 389936 325569 295101 277196
8111B77196l8607j8621L9644K7042m737J6729M6817m3242l2395j8978l0966r887
$$ 277196 238589 219968 259612 286654 281917 298646 345463 302221 269826 250848 219882 209995
8099B09995J010l7184K7727J8385L7712J57733J04697J24035J31883J25657R2663
$$ 209995 211005 173821 201548 219933 257645 415378 520075 644110 775993 901650 994313
8088I94313N2882O6059M355n2459q2032j21913j47366j46836j06615m1671n3872
$$ 994313 1047195 1113254 1117609 1065150 983118 861205 713839 567003 460388 418717 364845
8077C64845M0562M978p0042k1017n393l7137k3192k3528j2928N1737K2165l8479
$$ 364845 405407 410385 340343 319326 313933 276796 253604 230076 217148 268885 291050 252571
8065B52571j1236J5302J5103N7728m141k9732J5859j4549l1965L9069K2912K8990
$$ 252571 241335 256637 271740 329468 325327 295595 311454 296905 264940 304009 326921 355911
8053C55911k297j3431K2330J4019j6355M020P628k6149m0338N3114M2926M9129
$$ 355911 353614 340183 362513 376532 360177 364197 371825 345676 305338 358452 401378 450507
8041D50507l826L1594l139l7358l831J7786o2111m4438k7737P6522l774l5234
$$ 450507 446681 478275 475136 437778 433947 451733 389622 345184 317447 393969 390195 354961
8029C54961k40J3555K4526k5335N8238p998k3401q111m5050m840P6737M8181M9180
$$ 354961 354721 368276 392802 367467 425705 417707 394306 386195 341145 336305 413042 461223 510403
8016E10403M8113O826R8199P8031Q2263J19554N3250L6373k3485j80030r4231
$$ 510403 558516 565342 663541 741572 823835 943389 996639 1033012 1009527 829497 735266
8005G35266o9438q5551k9590m3697k2882l3471K89j3778K6764K0141j5189j8616
$$ 735266 665828 580277 550687 506990 484108 450637 450926 437148 463912 484053 468864 450248
7993D50248l2904k2280M626l1463n6976j457k8521J0956K7952j8044M87j8843
$$ 450248 417344 395064 399690 368227 311251 309794 281273 292229 320181 302137 302624 283781
7981B83781p2832K6185P8441L8109j739M1054L5462l6100p2399J08941P4284L1805
$$ 283781 210949 237134 315575 353684 351945 392999 428461 392361 319962 428903 503187 534992
7969E34992n3786L585j8339L7348M469R659j8816l7029l7476l2678j8926o2658
$$ 534992 481206 484791 466452 503800 508269 517928 499112 462083 424607 391929 373003 310345
7957C10345J3733k3953l945J4617K046m7245J6919J7396J1365l7699n353N4218
$$ 310345 324078 300125 296180 310797 312843 265598 282517 299913 311278 273579 268226 322444
7945C22444o8107p4696j3406L9200P4537M1307j4063k5664J5484n6787k1057J5681
$$ 322444 254337 179641 166235 205435 279972 321279 307216 281552 297036 240249 219192 234873
7933B34873K4664K4150J5771n4524n7984J8729L4997J9873j0652l664l1651k3037
$$ 234873 259537 283687 299458 244934 186950 205679 240676 260549 249897 246233 214582 191545
7921A91545J9355K331L7256j9726o3709l1081k7278K0413L8628N5325m9862m0474
$$ 191545 210900 213231 250487 230761 167052 135971 108693 129106 167734 223059 173197 132723
7909A32723K1542M4185K9351J07704M0394m5645n4378m3771N4202l4388m6199
$$ 132723 154265 198450 227801 335505 375899 330254 275876 232105 286307 251919 205720
7898B05720L3371j9014K276q5883p5335n2666O4006j5677n608N8266J0183P0451
$$ 205720 239091 220077 222353 136470 61135 8469 72475 56798 51190 109456 119639 190090
7886A90090P152j657J7244j8792l434n0716k0046k7855k8146j6307j0259n939
$$ 190090 197242 195585 212829 194037 190603 139887 119841 91986 63840 47533 37274 31335
7874C1335K1119J6185k4237j7327j0498j086O3933K9777J1537j5610j6506o0675
$$ 31335 52454 68639 44402 27075 16577 15491 79424 109201 120738 105128 88622 27947
7862B7947j6306N814M0561R6145L4019m3719m9097O8871j9174o3795n918J993
$$ 27947 11641 17455 58016 154161 188180 144461 95364 164235 145061 81266 75348 77341
7850G7341J4958j6839k8059k9760J9342O7182l810n6839p116m3498j9754M79M1499
$$ 77341 92299 75460 47401 17641 36983 104165 100355 43516 36400 -7098 -26852 -26373 15126
7837A5126K3489j4201P4047r90n1011L6219l157j9744m6883K5938M9959K782l5233
$$ 15126 38615 24414 98461 97471 46460 82679 79522 59778 12895 38833 88792 91574 56341
7824E6341l4918n2202J6417J8334R268k1891n0187P27M6142O7265L1775R002l7972
$$ 56341 21423 -30779 -14362 3972 13240 -8651 -58838 -58111 -11969 55296 87071 96073 58101
7811E8101J8128j12o7062q4089j4212j1264L5562L8949N5653j7986m5972l2392
$$ 58101 76229 76117 9055 -75034 -89246 -100510 -64948 -25999 29654 11668 -34304 -66696
7799f6696J1978O4769L4865M8080n021m8802o5416j6840n10l7446l6803l136M983
$$ -66696 -54718 10051 44916 92996 87975 39173 -26243 -43083 -43593 -81039 -117842 -120978 -115995
7786a15995M0150P4212j6053j1879L9009O1327J9666k3765k5332j7337m4280J2463
$$ -115995 -75845 -1633 -17686 -29565 9444 70771 90437 66672 41340 24003 -20277 -7814
7774g814m3724k7183N3844N5440n7687K0671l325N2269J9731N4990q6588n5683
$$ -7814 -51538 -78721 -24877 30563 -27124 -6453 -9778 42491 62222 117212 30624 -25059
7762b5059q16j3702k9329l7929K6822P2203m0981o306O1148J02454j3845m6492
$$ -25059 -25875 -39577 -68906 -106835 -80013 -7810 -48791 -55097 6051 108505 94660 48168
7750D8168O038j6453q2105K1477J1975J314o768J0655J8279m4669L8996J3180
$$ 48168 54206 37753 -44352 -22875 -10900 -9586 -16354 -5699 12580 -32089 6907 20087
7738B0087j3530L3741K4747K599k3334l3759n744J526n9080J3113N6102p532J6248
$$ 20087 6557 40298 65045 67644 44310 10551 4807 6333 -52747 -39634 16468 8936 25184
7725B5184N9603O155n3820N979J1739K9557J5319p633l6771n3868l2460j205R4191
$$ 25184 84787 90942 37122 43101 54840 84397 99716 92083 55312 1444 -31016 -32221 61970
7712F1970n367o6157m798K5200k5291O465j4382J1812P6629k9726n5868k7207
$$ 61970 56603 -9554 -14352 10848 -14443 -7978 -22360 -10548 66081 36355 -19513 -46720
7700d6720M7749O3871r687L0659l2595r8414j0247N7489l965l104q906J238o0598
$$ -46720 1029 64900 55213 85872 53277 -45137 -55384 2105 -1860 -4964 -13870 -12632 -73230
7687g3230k8396l8450l867J7560j3570n198N3362J085J9587O1390K1126l7245
$$ -73230 -101626 -140076 -143943 -126383 -139953 -145151 -91789 -90704 -71117 -9727 11399 -25846
7675b5846m921J3783L3583M2665L479o8124o9395r884M7632Q4100M5634P197J1246
$$ -25846 -30767 -16984 16599 59264 62743 -5381 -74776 -84660 -37028 47072 92706 99903 111149
7662A11149M975k8909o7498j01221n5742K2930K7931M2809N0201K9139j688m670
$$ 111149 116124 87215 19717 -81504 -137246 -114316 -86385 -43576 6625 35764 34076 29406
7650B9406M8499k8546n2542j3836J6265p7224Q243N4106L4306q043J2700O2058
$$ 29406 77905 49359 -3183 -17019 -754 -77978 -69735 -15629 18677 10634 23334 85392
7638H5392m4112n6642j04889M7596N5410J5896j6119p8591l4857Q9776K0148j653
$$ 85392 41280 -15362 -120251 -72655 -17245 -1349 -17468 -96059 -130916 -41140 -20992 -22645
7626b2645m4995L7674O382M2072K7845j2450j3292Q300l1947L7730J7066n0404
$$ -22645 -67640 -29966 -23584 18488 46333 33883 20591 28891 -3056 34674 51740 1336
7614A336l203J3167M5838j5087k5248m5442p0026n1375K1219O4913J8204q3459
$$ 1336 -1867 11300 57138 42051 16803 -28639 -98665 -150040 -128821 -63908 -45704 -129163
7602a29163j760K5904R198m6008P07N0925M2211K9088R289J8816J0196j185k649
$$ -129163 -130923 -105019 -95821 -141829 -141122 -90197 -47986 -18898 -9609 9207 19403 18218 15569
7589A5569l602RN7744M732m5510P157k8740N007M0540L2829j8097j1738k3463
$$ 15569 11967 11976 69720 74452 28942 36099 7359 12366 52906 85735 67638 55900 32437
7576C2437m8348o1679K7533K9919L8214m624q0375J89N7881M7055P8650P095l8314
$$ 32437 -15911 -77590 -50057 -20138 18076 13452 -66923 -66734 -8853 38202 116852 123947 85633
7563H5633k3120N34r6421k7868M9713M6197J4072o6307o2050m405K2904K1845
$$ 85633 62513 63047 -33374 -61242 -11529 34668 48740 -17567 -79617 -84022 -61118 -39273
7551c9273K1198L6941m841J0607N773m1567J1726M2341L704n2852n6912J6034
$$ -39273 -18075 18866 14025 24632 30405 -11162 564 42905 46609 -6243 -63155 -47121
7539d7121p426L3287O2032L2101J5163l2258p6452k7419l9143m3917J0908K9978
$$ -47121 -54547 -21260 40772 72873 88036 55778 -20674 -48093 -87236 -131153 -120245 -90267
7527i0267j7751j4408O7749M9285l19n6181j6456L3874N4757n0429M1767K9545
$$ -90267 -108018 -122426 -54677 -5392 -5711 -61892 -78348 -44474 10283 -40146 1621 31166
7515C1166J5264j9008O409J1320j1325j6611P122k2594m6890l6l3153L5757N4942
$$ 31166 46430 27422 33831 45151 33826 17215 24337 1743 -45147 -45183 -78336 -42579 12363
7502A2363K0112l6604L4789K5053j709K9741K2903k6238j9751l3909j6757m029
$$ 12363 32475 -4129 30660 55713 54004 83745 106648 80410 60659 26750 9993 5964
7490E964L8533L640j1807k9941K4840J4042j7003j9778q1030j8204J3015K8822
$$ 5964 44497 48137 36330 6389 31229 45271 28268 8490 -72540 -90744 -77729 -48907
7478d8907l0271l048m2774M0800O8693K7301L3639P68o5374L7375N6285m4570
$$ -48907 -79178 -82226 -125000 -84200 -15507 11794 45433 46201 -19173 18202 74487 29917
7466B9917o2137n790j8963r150P442R822L7602O6066N652O911k8373k9137j9769
$$ 29917 -32220 -38010 -56973 -66123 -58681 -48859 -11257 54809 60461 67372 38999 9862 -9907
7453i907K9156K4199n435k2349J6050M7648N174J1065j9066m1672R539o800J0945
$$ -9907 19249 43448 38013 15664 31714 79362 84536 95601 76535 34863 44402 37602 48547
7440D8547m813R008n1517k7227P115k2629L3607j8765k2832l7905J7571p005j4115
$$ 48547 43734 52742 1225 -26002 -18887 -41516 -7909 -26674 -49506 -87411 -69840 -76845 -90960
7427i0960J8824p8969l5555K7665O0381L400j7284J4440L3572J722P8959j2431
$$ -90960 -72136 -151105 -186660 -158995 -98614 -95214 -112498 -98058 -64486 -62764 16195 3764
7415C764K150J0573m9418m9033j1895R79L650R53l7210L624M775L2915M2895K5041
$$ 3764 5914 16487 -32931 -81964 -93859 -92880 -89230 -88277 -125487 -121863 -117088 -84173 -41278 -16237
7401a6237m8331l5876M190j4973J0029K3319M0516m9340j16263K785N5773l1564
$$ -16237 -64568 -100444 -96254 -111227 -101198 -77879 -37363 -86703 -202966 -200181 -144408 -175972
7389a75972k1139P6911M3807N9225k8472J4042k811N758l8004n6730m4452j0596
$$ -175972 -197111 -120200 -76393 -17168 -45640 -31598 -34409 -28651 -66655 -123385 -167837 -178433
7377a78433O9557P0445k0376J1535K859j4141J4703L5584K2924M831K822p5690
$$ -178433 -108876 -38431 -58807 -47272 -44413 -58554 -43851 -8267 14657 19488 22310 -53380
7365e3380m3536J5331K2630m7505L3030N026l2053M5389O336k3819o4788L1119
$$ -53380 -96916 -81585 -58955 -106460 -73430 -68404 -100457 -55068 -48732 -72551 -137339 -106220
7353a06220N7381J5152K4954n3976J744K3086J0806J3324J6147l8108k606j573
$$ -106220 -48839 -33687 -8733 -62709 -60965 -37879 -27073 -13749 2398 -35710 -38316 -39889
7341c9889L1905L9131l0571P653L9510l8416J1603O3439O0204j154j2728r9273
$$ -39889 -7984 31147 576 8229 47739 9323 20926 84365 144569 143415 130687 31414
7329C1414n1216j6069Q379K5359M090K4692k8035j8089j5566j4736j9086n7716
$$ 31414 -19802 -35871 -27492 -2133 1957 26649 -1386 -19475 -35041 -49777 -68863 -126579
7317a26579J9328K0684O8935J6351q9486j1180P0164J2377n6923L4093L6154k471
$$ -126579 -107251 -86567 -17632 -1281 -90767 -101947 -31783 -19406 -76329 -42236 -6082 -8553
7305h553J6238l5480P120j4088J3824l496R159L425L3405J3679L2280n736m409
$$ -8553 7685 -27795 -20675 -34763 -20939 -24435 -15276 -11851 21554 35233 67513 61777 57368
7292E7368O951J4293j2884j3814K7577M8082n007n6520m7476j9254L927J4784
$$ 57368 64319 78612 65728 51914 79491 127573 122566 66046 18570 -684 3243 18027
7280A8027J7964M6379M1357J1446n7116k9283o3911m2111K6822L8235K8977j0256
$$ 18027 35991 82370 123727 135173 78057 48774 -15137 -57248 -30426 7809 36786 26530
7268B6530J7031n2182k7700k573j7808M377K4057L7419R031l1448J3512M4868
$$ 26530 43561 -8621 -36321 -38894 -56702 -52325 -28268 9151 18182 -13266 246 45114
7256D5114J955p0737n1797k7692m5574K419k4443J582M2732O7282J1586l2379
$$ 45114 47069 -23668 -75465 -103157 -148731 -146312 -170755 -169173 -126441 -59159 -47573 -79952
7244g9952j7926j4864M577P1241N1215j3673n0376M2750N8862j6818L2813J4337
$$ -79952 -97878 -112742 -108165 -36924 14291 618 -49758 -7008 51854 35036 67849 82186
7232H2186n6395o8258K6797M5929l331j3088m7651K3164O0007k5903n2208J1381
$$ 82186 25791 -42467 -15670 30259 26928 13840 -33811 -10647 49360 23457 -28751 -17370
7220a7370j6975Q389N4835M276K1211L8140L3059q1452q4134J4505L2846m4480
$$ -17370 -34345 -25956 28879 33155 54366 92506 125565 44113 -40021 -25516 7330 -37150
7208c7150n1544P051r30K203N0313l8253k1561K0446K1473Q9214R238n8840M4804
$$ -37150 -88694 -81643 -82573 -80370 -30057 -68310 -89871 -69425 -47952 41262 50500 -8340 36464
7195C6464p072l5630N9673J8379J1364q644k2288n3160m1742n2282n566N2645
$$ 36464 29392 -6238 53435 71814 83178 74534 52246 -914 -42656 -94938 -100504 -47859
7183d7859R9583M7624l2313q8452l3525J6804K0679n1046O0328R4006j9141p0940
$$ -47859 51724 99348 67035 -21417 -54942 -38138 -17459 -68505 -8177 85829 66688 -4252
7171d252k7803K8991m3318L7748j9078Q2021N3083j2914k6183J3802k9311n8132
$$ -4252 -32055 -3064 -46382 -8634 -27712 54309 107392 94478 68295 82097 52786 -5346
7159e346Q972o9702m0031O209j2084O4538L000J5339M223M5395j2072o5188J5289
$$ -5346 3626 -66076 -106107 -99898 -111982 -47444 -44444 -29105 -24882 20513 8441 -56747 -41458
7146d1458L8383O6792O6523n3525q0292p6098j5639J381R8272M3070L165m0276
$$ -41458 -3075 63717 130240 76715 -3577 -79675 -95314 -93933 4339 47409 50574 10298
7134A0298J3153m054m6996j6284O7869R192l5994K3423O3149p1815J1257L7445
$$ 10298 23451 19397 -27599 -43883 23986 33178 -2816 20607 83756 11941 23198 60643
7122F0643l0988K1552J3840J9080p4661N844K6425L9351L9764l7452r1003l8487
$$ 60643 29655 51207 65047 84127 9466 15310 41735 81086 120850 83398 -7605 -46092
7110d6092M2153l4247p7504l6284J7466K1531N4418J5085N3431M4664l1826o8646
$$ -46092 -3939 -38186 -115690 -151974 -134508 -112977 -58559 -43474 9957 54621 22795 -45851
7098d5851j4159N3084M7587M285n7987k8465L9422O1818m1006p0088J7878O8461
$$ -45851 -60010 -6926 40661 44946 -13041 -41506 -2084 59734 18728 -51360 -33482 34979
7086C4979j2161K1421L5300j8324n508j5924p3250Q725J2186l8832m132P1089
$$ 34979 22818 44239 79539 61215 55707 39783 -33467 -24742 -12556 -51388 -55520 15569
7074A5569n7201p3118j5183k595m568O9310m445q109K2658P6372R340R077J4080
$$ 15569 -41632 -114750 -129933 -132528 -137096 -67786 -72231 -80340 -57682 18690 28030 37107 51187
7061E1187l6085m1160k0382N094L976k5526L7504O5410j9760m6315J2545P9911
$$ 51187 15102 -26058 -46440 -41346 -37370 -62896 -25392 40018 20258 -26057 -13512 66399
7049F6399J010m2369p776m7358l4329O6833K1400K931O577p936k8578l0482k9835
$$ 66399 67409 25040 17264 -30094 -64423 2410 23810 26741 33318 25382 -3196 -33678 -63513
7036f3513l5473J4001M4452P219j1540l2918J2124L6755O683O638J0536p746j0108
$$ -63513 -98986 -84985 -40533 -33314 -44854 -77772 -65648 -28893 -22210 -15572 -5036 -12782 -22890
7023b2890L890P2073k6136L326R384J7260k6613O350p5139j9270N3693N2474j8398
$$ -22890 -19000 53073 26937 30263 39647 56907 30294 36644 -38495 -57765 -4072 48402 30004
7010C0004m3369n9782k5761O3216J4666L115M1509Q4490L0879k5827p2872k7025
$$ 30004 -13365 -73147 -98908 -35692 -21026 -17911 23598 108088 138967 113140 40268 13243
6998A3243l5888M422K2875o028l700J1663r676j0533M2096M9899L129N415n8257
$$ 13243 -22645 -18223 4652 -1376 -5076 6587 -3089 -13622 28474 78373 81502 86917 28660
6985B8660p4699p3350p0561j7788K1152J1003M5438j9103J2231N3408M0217K8802
$$ 28660 -46039 -119389 -189950 -207738 -186586 -175583 -130145 -149248 -137017 -83609 -43392 -14590
6973a4590K6181j1596k7039m772q769j8492J0838k7308M7357J8752l6753l8654
$$ -14590 11591 -5 -27044 -31816 -40585 -59077 -48239 -75547 -28190 -9438 -46191 -84845
6961h4845j1899M1981J4666K6044P634q453M1028J4029J9371o417k8561K1227
$$ -84845 -96744 -54763 -40097 -14053 -6419 -14872 26156 40185 59556 53139 24578 45805
6949D5805j8844o0881J1130L1034K9273k979p370j3194K8954N8948j3617K83K0926
$$ 45805 26961 -33920 -22790 8244 37517 34538 27168 13974 42928 101876 88259 88542 109468
6936A09468q4360j1559m789p603R502N3815J5822L535m363O002Q47l5913k7424
$$ 109468 25108 13549 8760 1157 10659 64474 80296 83831 79468 85470 86317 50404 22980
6923B2980J2839q083k537q950J0875j8873o9543m5123j9587O9384J7839M9266
$$ 22980 35819 27736 25199 16249 27124 8251 -61292 -106415 -126002 -56618 -38779 10487
6911A0487M3022k2820R050M0860q982J2499o5263k2981l2754q4926J6197J4107
$$ 10487 53509 30689 39739 80599 71617 84116 18853 -4128 -36882 -121808 -105611 -91504
6899i1504J4437N3562O9601j6417k0983M319K4187k668m9188j8795L4439J1147
$$ -91504 -77067 -23505 46096 29679 8696 13015 37202 34534 -14654 -33449 990 12137
6887A2137j8774m0740P6495J8256n6047j9603L3048K5011K6333m7059n6564J8939
$$ 12137 -6637 -47377 29118 47374 -8673 -28276 4772 29783 56116 9057 -47507 -28568
6875b8568n4943K687P0586K4624N834K6208j8927q3077n5957O425p584k9344K2584
$$ -28568 -83511 -80824 -10238 14386 20220 46428 27501 -55576 -111533 -105108 -112692 -142036 -119452
6862a19452m6469L8925K9538L6826K6638j9058o589K9989k2845P751L7181j151
$$ -119452 -165921 -126996 -97458 -60632 -33994 -53052 -59641 -29652 -52497 -44746 -7565 -8716
6850h716k8026k918j5283M6601K1871J5919k9389o4071R764K0908O096j8714N5740
$$ -8716 -36742 -39660 -54943 -8342 13529 29448 59 -64012 -54248 -33340 -27244 -45958 9782
6837I782k0313n0398O0473J1535m0010J4426K3383m296L74r042M3603k8578l9119
$$ 9782 -10531 -60929 -456 11079 -28931 -14505 8878 4582 4956 -4086 39517 10939 -28180
6824b8180l2653k6783j4541p595O4988L1975l477J8170J536l9004l9594L2729
$$ -28180 -60833 -87616 -102157 -109752 -44764 -12789 -16266 1904 3440 -35564 -75158 -42429
6812d2429N6152M3208j2950k0454j4234J6146J9936m70J7617n507J4122j7923
$$ -42429 13723 56931 43981 23527 9293 25439 45375 44905 62522 57015 71137 53214
6800E3214k4614P487j7105n7208k5458K6896O4036m082l4499k1308J4813N7271
$$ 53214 28600 36087 18982 -38226 -63684 -36788 27248 23166 -11333 -32641 -17828 39443
6788C9443k3985k1882J7570N511N37K5561k4810p1272k7342m499j8024O1767j9934
$$ 39443 15458 -6424 11146 16657 17194 42755 17945 -53327 -80669 -85168 -103192 -41425 -61359
6775f1359j1569L1738m347R542o371J7896K5534j4467m9975L733M3709J6602o800
$$ -61359 -72928 -41190 -45537 -35995 -42366 -24470 1064 -13403 -63378 -59645 -15936 666 -6134
6762f134p0700r806M0454P286J0139L1036j9439R964L7727k7085j0925m6464n119
$$ -6134 -76834 -86640 -46186 -38900 -28761 2275 -17164 -7200 30527 3442 -7483 -53947 -59066
6749e9066M107N269J9655k5164m5279J0049N6091J2031M2106O077p181L1883j4381
$$ -59066 -54959 -49690 -30035 -55199 -100478 -90429 -34338 -22307 19799 25876 18695 50578 36197
6736C6197l6963q736J5147K1828j2055k6995O239k845k7257j088k4787L8682L4167
$$ 36197 -766 -9502 5645 27473 15418 -11577 -5338 -8183 -35440 -36528 -61315 -22633 11534
6723A1534K6054K9757j5388q617j6561q4899K3365M3095J3957l6808l4333j357
$$ 11534 37588 67345 51957 43340 26779 -58120 -34755 8340 22297 -14511 -48844 -50201
6711e0201K5609l4317K1104M6698K085N74K5730K31l8359j8363o7437M47N7634
$$ -50201 -24592 -58909 -37805 8893 10978 11552 37282 37513 -846 -19209 -86646 -86199 -28565
6698b8565Q6513K6112J2906m3778k3260J5690k6003J1646j9347k01R2769K631
$$ -28565 57948 84060 96966 53188 29928 45618 19615 31261 11914 11713 104482 107113
6686A07113p4362j2870J027k4361n7856k6663N2847L7671j9549l6665o3371O8303
$$ 107113 32751 19881 20908 -3453 -61309 -87972 -35125 2546 -17003 -53668 -117039 -48736
6674d8736J04437R846l3310l1993O7143l0935p353M0876K983K6169j2310m5297
$$ -48736 55701 65547 32237 244 67387 36452 29099 69975 72958 99127 86817 41520
6662D1520m2045J1438K912o2556K0699j354K9488K7309k1958j870J8812n0981
$$ 41520 -525 10913 13825 -48731 -28032 -29386 102 27411 5453 3583 22395 -28586
6650b8586k9024O8260k6259m6346k5616P7892R7691k1811q0039j7740N805l6601
$$ -28586 -57610 10650 -15609 -61955 -87571 -9679 88012 66201 -13838 -31578 -25773 -62374
6638f2374m4243L1073k8955n000K2096l104K0039l847L6296K7290l4541k0067
$$ -62374 -106617 -75544 -104499 -109499 -87403 -90507 -70468 -74315 -38019 -10729 -45270 -65337
6626f5337l693L4729L2855l7218k5041m576N669L4473J0418K1147K6060k3549
$$ -65337 -69030 -34301 -1446 -38664 -63705 -68281 -62612 -28139 -17721 3426 29486 5937
6614E937j8256o13K2440l7446j5439p951J0862L5262m2449j1812O7740J1717K3143
$$ 5937 -12319 -12932 9508 -27938 -43377 -51328 -40466 -5204 -47653 -59465 8275 19992 43135
6601D3135n0131P785k7200J4205k5434L9201O2323k588k6657k6574l8406Q6485
$$ 43135 -6996 789 -26411 -12206 -37640 1561 63884 61296 34639 8065 -30341 56144
6589E6144N9210j21150q1303K9993O5020K4292n7870k0102K7182k9026P8301M5106
$$ 56144 115354 -5796 -87099 -57106 7914 32206 -25664 -45766 -18584 -47610 30691 75797
6577G5797q6056k0472Q892l3571L5539J0173m7068L7062K9933N2541P402J4376
$$ 75797 -10259 -30731 -21839 -55410 -19871 -9698 -56766 -19704 10229 62770 70172 84548
6565H4548N304p469n5662k4072M0631J6157r0977L9587N4050J1036j5390j5621
$$ 84548 89852 82383 26721 2649 43280 59437 -31540 8047 62097 73133 57743 42122
6553D2122P0561o700m4603m1041K675n0643J1553k2512j0683j954J9799K7223
$$ 42122 112683 105983 61380 20339 23014 -27629 -16076 -38588 -49271 -51225 -31426 -4203
6541d203K9590M2459K10j1914k5891o3297M034j6678k9273J6530M643j6495L840
$$ -4203 25387 67846 68056 56142 30251 -33046 -29012 -45690 -74963 -58433 -53790 -70285 -66445
6528f6445l2320M9818K1603M6529j378L924l6645m1624m8047K8609J8215J8548
$$ -66445 -98765 -48947 -27344 19185 17807 21731 -14914 -56538 -104585 -75976 -57761 -39213
6516c9213k1702o186L7308Q2474J9994j5476j2080k9416n3993n3549m4998j8979
$$ -39213 -60915 -67101 -29793 52681 72675 57199 45119 15703 -38290 -91839 -136837 -155816
6504a55816Q163R260M5914J5663j570N0338j2395l3896p118O2487J706l0382L2993
$$ -155816 -147653 -138393 -92479 -76816 -78386 -28048 -40443 -74339 -81457 -18970 -17264 -47646 -14653
6491a4653l230m3132J7421j7035k9863l3598M4301K9225K1568l4643l3757Q817
$$ -14653 -17883 -61015 -43594 -60629 -90492 -124090 -79789 -50564 -28996 -63639 -97396 -88579
6479h8579N3427m0353K3864l542P837j2623L2167O174L8975J4604l4408n6659
$$ -88579 -35152 -75505 -51641 -55183 -47346 -59969 -27802 -21628 17347 31951 -2457 -59116
6467e9116O261M398n6459j8689O854M7091K6455L9286m131l6157m4912l6110O4833
$$ -59116 -52855 -48457 -104916 -123605 -116751 -69660 -43205 -3919 -8050 -44207 -89119 -125229 -60396
6454f0396J9975k1650J2980L9805j3367P762j5646p0N2303j3811k900J1713R558
$$ -60396 -40421 -62071 -49091 -9286 -22653 -14891 -30537 -30607 21696 7885 4985 16698 26256
6441B6256k2714J251l0743l9420L0504K493l3699R1122R6899K1767L0918k7276
$$ 26256 3542 4793 -25950 -65370 -34866 -32373 -66072 25050 121949 143716 174634 147358
6429A47358n8358p2684k4220M1662l1486J1915L9053J4784l3011j3376R634L7128
$$ 147358 89000 16316 -7904 33758 2272 14187 53240 68024 35013 21637 31271 68399
6417F8399o2466n3418N667P2194L8460J6992o1998r5665j1302K8089K503J1687
$$ 68399 5933 -47485 -41818 30376 68836 85828 23830 -71835 -83137 -55048 -52545 -40858
6405d0858n164O1248M8695q369j7555o935R580J7128j2685n439k4701o4101K205
$$ -40858 -46022 15226 63921 55552 37997 31062 40642 57770 45085 39646 14945 -49156 -46951
6392d6951J9667p99P484J6175J3710p699m9306p992J00419N4828j5318l1365L2753
$$ -46951 -27284 -28083 -20599 -4424 9286 1587 -47719 -55711 44708 99536 84218 52853 85606
6379H5606k6309n1727k5760K0855P664N037o4585j3837j1702j1494O134m498M1337
$$ 85606 59297 7570 -18190 2665 10329 15366 -49219 -63056 -74758 -86252 -80118 -84616 -43279
6366d3279P781K5668m882j7244L1140j4975o7554L1633L3584j5638J2705O2633
$$ -43279 -35498 -9830 -14712 -31956 -816 -15791 -83345 -51712 -18128 -33766 -21061 41572
6354D1572N2930j1548n1091L800l484L0833k7505q9209J3955N6204O339m3342
$$ 41572 94502 82954 31863 35663 32179 63012 35507 -53702 -39747 16457 22796 -20546
6342b0546r950K1802Q388O9218P1208m3042r0814j100J0073m7807j6240q982K8343
$$ -20546 -30496 -8694 -306 68912 140120 97078 6264 5164 15237 -32570 -48810 -57792 -29449
6329b9449k5517k2463J1942l0953l6892J7487K8337L4827N5676K1017k6805n901
$$ -29449 -54966 -77429 -65487 -96440 -133332 -115845 -87508 -52681 2995 24012 -2793 -8694
6317h694j5188j433n0995l8661M9239M3960N2331J9452L4751p7198p7713J4373
$$ -8694 -23882 -25315 -76310 -114971 -65732 -21772 30559 50011 84762 7564 -70149 -55776
6305e5776J3222M2539N4742l7600p2634m1835l899k4244N4244Q5103K6914m0143
$$ -55776 -42554 -15 54727 17127 -55507 -97342 -101241 -125485 -71241 13862 40776 633
6293F33m078n5671m2783p63K3585q221m6467Q820J1807J8777L914j1774k7558
$$ 633 -3445 -59116 -101899 -102662 -79077 -87298 -133765 -124945 -113138 -94361 -90447 -102221 -129779
6280a29779P6702L9500l037q676m4355o0305K5363L2853M0688j4303J7568M4921
$$ -129779 -53077 -13577 -16614 -25290 -69645 -129950 -104587 -71734 -31046 -45349 -27781 17140
6268A7140N8133L2486n4024k8261j05627Q37M3326L0284l6299l5699j611L5305
$$ 17140 75273 107759 53735 25474 -80153 -79316 -35990 -5706 -42005 -77704 -79315 -44010
6256d4010k681K341j3854j5155r925J7753K4250l5345K1850J0881J6844k5190
$$ -44010 -46691 -44350 -58204 -73359 -83284 -65531 -41281 -76626 -54776 -43895 -27051 -52241
6244e2241k0840M2439M3181L1913l1372k3954P381K0461r961p775k427n3434Q929
$$ -52241 -73081 -30642 12539 44452 13080 -10874 -3493 16968 7007 -768 -3195 -56629 -47700
6231d7700j6699k9029M0840K3651J016j4196k7193K5734J6707K5785N4962M0794
$$ -47700 -64399 -93428 -52588 -28937 -27921 -42117 -69310 -43576 -26869 -1084 53878 94672
6219I4672l6442o4922r748r279k0087n8431l664O7885O6235P9226j0128n1289
$$ 94672 58230 -6692 -16440 -25719 -45806 -104237 -107901 -40016 26219 105445 95317 44028
6207D4028m5872Q691k0966N5594L4929n2816J1856J6486j1425m4475n475j8786
$$ 44028 -1844 6847 -14119 41475 76404 23588 35444 51930 40505 -3970 -9445 -28231
6195b8231K1071O7031j6998j7475m8927m4931l0845k9200L3327N6956L0511m612
$$ -28231 -7160 59871 42873 25398 -23529 -68460 -99305 -128505 -95178 -38222 -7711 -12323
6183a2323p805r733K9368j3919m6873n832Q7345l0274m3855O579l7434j5889O3309
$$ -12323 -20128 -29861 -493 -14412 -61285 -67117 20228 -10046 -53901 -47322 -84756 -100645 -37336
6170c7336m0505p4606P8526N8726r578j9727K1860j6150n1460o6377l0342p493
$$ -37336 -77841 -152447 -73921 -15195 -24773 -44500 -22640 -38790 -90250 -156627 -186969 -194462
6158a94462k1635Q1922M2637J5087N1167n277l3964q929N6988L0k2953l8943n766
$$ -194462 -216097 -134175 -91538 -76451 -25284 -30561 -64525 -73454 -16466 -16436 -39389 -78332 -84098
6145h4098K4704K7894k892P387J0053j2954n75M2676K290P830j3395o36J2639
$$ -84098 -59394 -31500 -34392 -27005 -16952 -29906 -30481 12195 14485 22315 8920 8284 20923
6132B0923k1732l4654j9138Q952N139n8361j8196P8658M4659n7426k638r600K0685
$$ 20923 -809 -35463 -54601 -45649 -40510 -98871 -117067 -38409 6250 -51176 -53814 -63414 -42729
6119d2729J8513K3802J6220M087p081q5821L9221J7966M7884j9164n3240j5387
$$ -42729 -24216 -414 15806 19893 12812 -73009 -33788 -15822 32062 12898 -40342 -55729
6107e5729Q2303O1708L3042M380m6476n0766O6038K49n3511q0580m5657L0679
$$ -55729 26574 88282 121324 125704 79228 28462 94500 94749 41238 -39342 -84999 -54320
6095e4320j3269O5586R395j4720L3980L6637k1101J0205o9665k3858O767J3253
$$ -54320 -67589 -2003 7392 -7328 26652 63289 42188 52393 -17272 -41130 -34363 -21110
6083b1110n8681j3084N5985M820L2622N0543K9740o6331l0937j0191p6640Q116
$$ -21110 -79791 -92875 -36890 -32070 552 51095 80835 14504 -16433 -26624 -103264 -95148
6071i5148J09748N4020k6774r2443k1217N6753N9177l7270n7423j5538p72q707
$$ -95148 14600 68620 41846 -50597 -71814 -15061 44116 6846 -50577 -66115 -66887 -75594
6059g5594m123P5066J5469m7083j6779N1938M7687M475l6664L7161j2698J7605
$$ -75594 -79717 -4651 10818 -36265 -53044 -1106 46581 51056 14392 51553 38855 56460
6047E6460L7822m1061n6319L6425L0301M499j0151K9022L45n9915j7325q1624
$$ 56460 94282 53221 -3098 33327 63628 68127 57976 86998 87343 27428 10103 -71521
6035g1521k4305J3758l5495M1750N9329k494k4408j6207M749R17k1672J8174J3297
$$ -71521 -95826 -82068 -117563 -75813 -16484 -18978 -43386 -59593 -54844 -53927 -75599 -57425 -44128
6022d4128J0172k2409j900m7177N4574L4423M9882K8245l5475J4745p531L3960
$$ -44128 -33956 -56365 -58265 -105442 -50868 -16445 33437 61682 26207 40952 33421 67381
6010F7381m4355k5006J3982k7837K575j6870J659k4668M4910M9873j1125j9862
$$ 67381 23026 -1980 12002 -15835 -13260 -30130 -28471 -53139 -8229 41644 30519 10657
5998A0657P45K6590K1752j2671j992K841l4817j8188K4321q494J8028Q424o5016
$$ 10657 11402 37992 59744 47073 45081 47922 13105 -5083 19238 10744 28772 37196 -27820
5985b7820j7319N8077j0921n7053J3580O2946O6388L7020o2024m0665l0556k2826
$$ -27820 -45139 12938 2017 -55036 -41456 21490 87878 124898 62874 22209 -8347 -31173
5973c1173P753p3191m9454M1520Q797k9493K4340J4058J745Q0544J5622o9529
$$ -31173 -23420 -96611 -146065 -104545 -95748 -125241 -100901 -86843 -85098 -4554 11068 -58461
5961e8461j1533O2098L5974k1560k3244J7423o054J03279M0507n6640o6470l7459
$$ -58461 -69994 -7896 28078 6518 -16726 697 -5357 97922 138429 81789 15319 -22140
5949b2140K990J6420l0002k7770n0398N6852N2952K4727j7880K6349j2147m3212
$$ -22140 -19150 -2730 -32732 -60502 -110900 -54048 -1096 23631 5751 32100 19953 -23259
5937b3259m7749K586M0927O471J6105M0465j779o5627K5718Q938m6299J7096Q8346
$$ -23259 -71008 -68422 -27495 -21024 -4919 35546 33767 -31860 -6142 2796 -43503 -26407 61939
5924F1939l1702m2676O0150L3376j4990l7028J9764K0702l1994l8076k9516k3061
$$ 61939 30237 -12439 47711 81087 66097 29069 48833 69535 37541 -535 -30051 -53112
5912e3112J943Q476J0127j1098N734Q555J5744p992P7785K7045m0461j4934n249
$$ -53112 -51169 -42693 -32566 -43664 -37930 -29375 -13631 -21623 56162 83207 42746 27812 22563
5899B2563j8056k2234L699K4593o0100K7386P1624r311k7411l6283k1126P2064
$$ 22563 4507 -17727 -14028 10565 -49535 -22149 49475 40164 12753 -23530 -44656 27408
5887B7408j535m157k4995N268K5287j2565K3875k5793r6175P703K4731J8466K8276
$$ 27408 25873 21716 -3279 1989 27276 14711 38586 12793 -83382 -75679 -50948 -32482 -4206
5874d206N1778N888k0471L7633J0279p540R05o30l3188m2094M3244M3036m2650
$$ -4206 47572 53460 32989 70622 80901 73361 74266 73636 40448 -1646 41598 84634 41984
5861D1984q007p772K6134n5l6442k0473j4499l0820l5416K8348L8878J6398n5273
$$ 41984 33977 26205 52339 52284 15842 -4631 -19130 -49950 -85366 -57018 -18140 -1742 -57015
5848e7015o255J0411k6563k9431j936M3012L9348N6283M1180m1205r406n48L3182
$$ -57015 -63270 -52859 -79422 -108853 -110789 -67777 -28429 27854 69034 27829 18423 17875 51057
5835E1057L5187m6880k0728J299j3408m7579k062M5733N1219n1938K3657K0297
$$ 51057 86244 39364 18636 19935 6527 -41052 -43114 2619 53838 1900 25557 45854
5823D5854j3968L0657L4742J9127j9204p178n3004k0844P282L58l9618l2112o9944
$$ 45854 31886 62543 97285 116412 97208 90030 37026 16182 23464 23822 -15796 -47908 -117852
5810a17852j7737K4769K2299K8996k5332j8463Q3534M1121J0788o1469n6759N0401
$$ -117852 -135589 -110820 -88521 -59525 -84857 -103320 -19786 21335 32123 -29346 -86105 -35704
5798c5704l5179p6390L8387N7741j1530M1692k7996q499N9662O1811L0552p251
$$ -35704 -70883 -147273 -108886 -51145 -62675 -20983 -48979 -57478 2184 63995 94547 87296
5786H7296l194Q774k5504l2369K9641N255l0247j4250K2868K5384k598k2903l3763
$$ 87296 84102 92876 67372 35003 64644 69899 39652 25402 48270 73654 71056 48153 14390
5773A4390j3351l8883J1922l0942K8085J0641m0466P9627l2734l3274K8392N5863
$$ 14390 1039 -37844 -25922 -56864 -28779 -18138 -58604 21023 -11711 -44985 -16593 39270
5761C9270N890l5197O631K220n319j0271Q774J5427l0741J416K9658o7854j4731
$$ 39270 45160 9963 16594 18814 13495 3224 11998 27425 -3316 -1900 27758 -40096 -54827
5748e4827q680j7822O494J1919O4179j1534k1084l0299L5932K6005K049k7274
$$ -54827 -63507 -81329 -74835 -62916 1263 -10271 -31355 -61654 -25722 283 2332 -24942
5736b4942k6340j4029J3488k8258j046J5150K3064K502l1545j4390l113n337l3024
$$ -24942 -51282 -65311 -51823 -80081 -81127 -65977 -42913 -40411 -71956 -86346 -89459 -94796 -127820
5723a27820J7767P6539K1079k9210o398j280M2609n6369j6732L2116L395j1062
$$ -127820 -110053 -33514 -12435 -41645 -48043 -49323 -6714 -63083 -79815 -47699 -44304 -55366
5711e5366L0517K9073n898J6638J8585K2200n9027p8004J8442K3371L5191q889
$$ -55366 -24849 4224 -1674 14964 33549 55749 -3278 -81282 -62840 -39469 -4278 -13167
5699a3167j1535J913R3332K910l7788J0869j9264K859J0660L2198M3515O879p954
$$ -13167 -24702 -22789 70543 73453 35665 46534 27270 30129 40789 72987 116502 123381 115427
5686A15427j6301m3678n3117k3150m8149m192P8473N5453k6471j0775m030Q653
$$ 115427 99126 55448 2331 -20819 -68968 -73160 5313 60766 34295 23520 19490 28143
5674B8143o4467K8770K1988k4329l5179l8655M2382R7713l5940o1974m5907N836
$$ 28143 -36324 -7554 14434 -9895 -45074 -83729 -41347 56366 20426 -41548 -87455 -81619
5662h1619M7885L7938J5306l943J819N6534n8056l3395k4677k4617k8048L811
$$ -81619 -33734 4204 19510 15567 17386 73920 15864 -17531 -42208 -66825 -94873 -91062
5650i1062K077J2809J5804N5116m277m530j4314k7047k2473m3197O1060P0225
$$ -91062 -88985 -76176 -60372 -5256 -9533 -14063 -28377 -55424 -77897 -121094 -60034 10191
5638A0191l3179j2184L383J436r488K8778L8853J2349m8916m8955n8541K0119
$$ 10191 -22988 -35172 -31789 -30353 -39841 -11063 27790 40139 -8777 -57732 -116273 -96154
5626i6154o6567k8201O6940R234M3119L8124L4271N3193o2545k4334R881K1126
$$ -96154 -162721 -190922 -123982 -114748 -71629 -33505 766 53959 -8586 -32920 -23039 -1913
5614a913M3975m892J2826m5599o1421J1390K9989R595l305j3453J03994J4768
$$ -1913 42062 37170 49996 4397 -57024 -45634 -15645 -6050 -9355 -22808 81186 95954
5602I5954m8623k5061p658J72J0892O3484N8197q171n5644n6534l1066j2504k3274
$$ 95954 47331 22270 14612 14784 25676 89160 147357 139186 83542 27008 -4058 -16562 -39836
5589c9836j9953n2676m8134L5799O7768K2226m4564n7306L0549Q5319J657o0769
$$ -39836 -59789 -112465 -160599 -124800 -57032 -34806 -79370 -136676 -106127 -20808 -19151 -79920
5577g9920N7595P0911L0111q342l5118j9248L274L8606j487J644j9745k8068M1374
$$ -79920 -22325 48586 78697 70355 35237 15989 19263 57869 56382 58026 38281 10213 51587
5564E1587J0284J9779n3485n3162K9920L8480l6516Q496l3391O9241M8675n893
$$ 51587 61871 81650 28165 -24997 4923 43403 6887 15383 -18008 51233 99908 94015
5552I4015j04362o2526Q5585J5285n6943K659J1112K5009O665N239O636l6839
$$ 94015 -10347 -72873 12712 27997 -28946 -26287 -15175 9834 16499 21738 28374 -8465
5540h465J6563j7725l2026m5754L9824J3486q782n0405M9397J8547k5529j3252
$$ -8465 8098 -9627 -41653 -87407 -47583 -34097 -42879 -93284 -43887 -25340 -50869 -64121
5528f4121j1741L1597k2059L0091l3074l9206J4773Q1450q203P4941K9456K818
$$ -64121 -75862 -44265 -66324 -36233 -69307 -108513 -93740 -12290 -20493 54448 83904 86722
5516H6722r0581j1605j1554M3793j7454j7102m182l6430K3456Q9068J8048p2885
$$ 86722 -3859 -15464 -27018 16775 -679 -17781 -21963 -58393 -34937 54131 72179 -706
5504g06L0124P2765J8669m5763o2528O090N2914K8073l0946Q283n6152m6569m8024
$$ -706 29418 102183 120852 75089 12561 18651 71565 99638 68692 76975 20823 -25746 -73770
5491g3770k1438J7351N6713J1567J2383m7070m6719K242O1458N1283k2235r332
$$ -73770 -95208 -77857 -21144 -9577 2806 -44264 -90983 -88741 -27283 24000 1765 -7567
5479g567l9185l7837J110L5813P29m4250K1473M4553J06002K8204q3630k2399
$$ -7567 -46752 -84589 -83479 -47666 -46937 -91187 -69714 -25161 80841 109045 25415 3016
5467C016l2960o3521L8483M4614k1579j7846L3397M0529r664J1264j8266R472
$$ 3016 -29944 -93465 -54982 -10368 -31947 -49793 -16396 24133 14469 25733 7467 16939
5455A6939m876n4102N426J4652N36o4071k3003K4619Q6274P3145m7409l5905L233
$$ 16939 12063 -42039 -36613 -21961 -21425 -85496 -108499 -83880 2394 75539 28130 -7775 -4542
5442d542N3148J2353n917l6056J9293L3816n3923o4202O106O8161o6865l3280
$$ -4542 48606 60959 55042 18986 38279 72095 18172 -46030 -39924 28237 -38628 -71908
5430g1908o4411j9925J824O4420K334j3578j7926K3604N0018K1947j03988K122
$$ -71908 -136319 -156244 -154420 -90000 -87666 -101244 -119170 -95566 -45548 -23601 -127589 -125467
5418a25467O0662K8043N4327k1446k9038p0041l1042L2019J8427M1180J7550J5151
$$ -125467 -64805 -36762 17565 -3881 -32919 -102960 -134002 -101983 -83556 -42376 -24826 -9675
5406i675K3055j0408o5836K1597M3237J2022L7771j1538L921J7782L0427k4780
$$ -9675 13380 2972 -62864 -41267 1970 13992 51763 40225 44146 61928 92355 67575
5394F7575o6329o8401r6978O3519Q3590j1265m2254L653O3609n566L9812N2319
$$ 67575 1246 -67155 -164133 -100614 -17024 -28289 -70543 -66890 -3281 -8847 30965 83284
5382H3284m1754k9336q164J1728N6260p123J1798l8891q1278J7884N6728n4218
$$ 83284 41530 12194 4030 15758 72018 64895 76693 37802 -43476 -25592 31136 -23082
5370b3082l220P7294O6264m0910j4485l1407j1379l7140J3409M6061j7944O0175
$$ -23082 -26302 50992 117256 76346 61861 30454 19075 -18065 -4656 41405 23461 83636
5358H3636O5180m5451l4027l2105q3943o1742j2438j277J5024k3805K3287M7739
$$ 83636 148816 103365 69338 37233 -46710 -108452 -120890 -122167 -107143 -130948 -107661 -59922
5346e9922j3603M2281M5472k4734m9290K3559M0086j2739n1618l3592n3112l1426
$$ -59922 -73525 -31244 14228 -10506 -59796 -36237 3849 -8890 -60508 -94100 -147212 -178638
5334a78638L1110Q098M1254O2276O4516J275m057J4299M304j7794K8685m9806
$$ -178638 -147528 -139430 -98176 -35900 28616 29891 25834 40133 44437 26643 55328 5522
5322E522l8212m6894k4101K854M0530P4688K1961j1750k1284j2086M2974j146
$$ 5522 -32690 -79584 -103685 -100831 -60301 14387 36348 24598 3314 -8772 34202 33056
5310C3056k9393l9057n075M9206o5551o4740K0813J1938k2141Q7184L3511m980
$$ 33056 3663 -35394 -40469 8737 -56814 -121554 -100741 -88803 -110944 -23760 9751 4771
$$ [...]
##END NTUPLES=NMR SPECTRUM
##END=
