##TITLE=Analysis number 310963
Compound Code cc 30113
Book Reference 335/182
Project Code adrs
Chemist Name davee
##JCAMPDX= 6.0         $$ Bruker NMR JCAMP-DX V2.0
##DATA TYPE= NMR SPECTRUM
##DATA CLASS= NTUPLES
##ORIGIN= Bruker BioSpin GmbH
##OWNER= NMR
$$ XWIN-NMR		Version 3.5
$$ Tue Jun 28 14:19:12 2005 GMT Daylight Time (UT+1h)  MAYBRIDGE\NMR@NMR_250MHZ
##.OBSERVE FREQUENCY= 250.131544655141
##.OBSERVE NUCLEUS= ^1H
##.ACQUISITION MODE= SIMULTANEOUS (DQD)
##.ACQUISITION SCHEME= undefined
##.AVERAGES= 16
##.DIGITISER RES= 18
##SPECTROMETER/DATA SYSTEM= dpx250
##.PULSE SEQUENCE= zg30
##.SOLVENT NAME= CDCl3
##.SHIFT REFERENCE= (INTERNAL, CDCl3, 0, 16.522)
##AUDIT TRAIL= $$ (NUMBER, WHEN, WHO, WHERE, WHAT)
$$ ##TITLE= Audit trail, XWIN-NMR		Version 3.5
$$ ##JCAMPDX= 5.01
$$ ##ORIGIN= Bruker BioSpin GmbH
$$ ##OWNER= NMR
$$ C:\u/data/dgb/nmr/ADRS/4920/pdata/1/auditp.txt
$$ ##AUDIT TRAIL=  $$ (NUMBER, WHEN, WHO, WHERE, WHAT)
(   1,<2005-06-28 14:18:52.85 +100>,<MAYBRIDGE\NMR>,<NMR_250MHZ>,
      <created by zg, POWCHK disabled, PULCHK disabled
       configuration hash MD5:
       62 19 C7 07 E1 42 D1 B7 37 6C 3D D0 77 39 F9 E6
       data hash MD5: 64K
       FA 4A 82 50 D4 B2 4E CA 86 0F 89 89 77 F8 8E 42>)
(   2,<2005-06-28 14:19:03.93 +100>,<MAYBRIDGE\NMR>,<NMR_250MHZ>,
      <Start of raw data processing
       ef LB = 0.3 FT_mod = 6 PKNL = 1 SI = 32K 
       data hash MD5: 32K
       EC C7 90 15 4B 93 42 FA 5A 63 BB 2A 4A B0 96 09>)
(   3,<2005-06-28 14:19:05.89 +100>,<MAYBRIDGE\NMR>,<NMR_250MHZ>,
      <apk 
       data hash MD5: 32K
       DF A2 F4 41 FF 91 B5 D2 BF 38 8C 01 F0 2D 60 CB>)
(   4,<2005-06-28 14:19:06.66 +100>,<MAYBRIDGE\NMR>,<NMR_250MHZ>,
      <abs ABSG = 5 
       data hash MD5: 32K
       66 3F 50 CB 07 B5 0D C9 AA 0A EC DE A5 29 68 88>)
$$ ##END=
$$ 
$$ hash MD5
$$ 9D 1A F7 7B 0B 55 06 B5 8A 09 3C 8A F5 DE CC DC
##$RELAX= 
##$RELAX= 
##$RELAX= 
##$RELAX= 
##$RELAX= 
##$RELAX= 
##$RELAX= 
$$ Bruker specific parameters
$$ --------------------------
##$DU= <C:\u>
##$EXPNO= 4920
##$NAME= <ADRS>
##$PROCNO= 1
##$TYPE= <nmr>
##$USER= <dgb>
##$AMP= (0..31)
100 100 100 100 100 100 100 100 100 100 100 100 100 100 100 100 100 100 
100 100 100 100 100 100 100 100 100 100 100 100 100 100 
##$AQSEQ= 0
##$AQ_mod= 3
##$AUNM= <au_zg>
##$AUTOPOS= <42 >
##$BF1= 250.13
##$BF2= 250.13
##$BF3= 250.13
##$BF4= 250.13
##$BF5= 500.13
##$BF6= 500.13
##$BF7= 500.13
##$BF8= 500.13
##$BYTORDA= 1
##$CFDGTYP= 0
##$CFRGTYP= 5
##$CHEMSTR= <none>
##$CNST= (0..31)
1 1 145 1 1 1 1 1 1 1 1 1 1 1 1 1 1 1 1 1 1 1 1 1 1 1 1 1 1 1 1 1 
##$CPDPRG= <>
##$CPDPRG1= <>
##$CPDPRG2= <>
##$CPDPRG3= <>
##$CPDPRG4= <mlev>
##$CPDPRG5= <mlev>
##$CPDPRG6= <mlev>
##$CPDPRG7= <mlev>
##$CPDPRG8= <mlev>
##$CPDPRGB= <>
##$CPDPRGT= <>
##$D= (0..31)
0 1 0 0 0 0 0 0 0 0.06 0 0 0 0 0 0 0.0002 0 0 0 0 0 0 0 0 0 0 0 0 0 0 
0 
##$DATE= 1119964731
##$DBL= (0..7)
120 120 120 120 120 120 120 120 
##$DBP= (0..7)
150 150 150 150 150 150 150 150 
##$DBP07= 0
##$DBPNAM0= <>
##$DBPNAM1= <>
$$ [...]
##$SUBNAM7= <"">
##$SUBNAM8= <"">
##$SUBNAM9= <"">
##$SW= 20.6930455092707
##$SWIBOX= (0..15)
0 0 3 0 0 0 0 0 0 0 0 0 0 0 0 0 
##$SW_h= 5175.983436853
##$TD= 65536
##$TD0= 1
##$TE= 295.16
##$TE2= 300
##$TE3= 300
##$TEG= 300
##$TL= (0..7)
0 120 120 120 120 120 120 120 
##$TP= (0..7)
150 150 150 150 150 150 150 150 
##$TP07= 0
##$TPNAME0= <>
##$TPNAME1= <>
##$TPNAME2= <>
##$TPNAME3= <>
##$TPNAME4= <>
##$TPNAME5= <>
##$TPNAME6= <>
##$TPNAME7= <>
##$TPOAL= (0..7)
0.5 0.5 0.5 0.5 0.5 0.5 0.5 0.5 
##$TPOFFS= (0..7)
0 0 0 0 0 0 0 0 
##$TUNHIN= 0
##$TUNHOUT= 0
##$TUNXOUT= 0
##$USERA1= <user>
##$USERA2= <user>
##$USERA3= <user>
##$USERA4= <user>
##$USERA5= <user>
##$V9= 5
##$VALIST= <valist>
##$VCLIST= <CCCCCCCCCCCCCCC>
##$VD= 0
##$VDLIST= <DDDDDDDDDDDDDDD>
##$VPLIST= <PPPPPPPPPPPPPPP>
##$VTLIST= <TTTTTTTTTTTTTTT>
##$WBST= 1024
##$WBSW= 4
##$XGAIN= (0..3)
0 0 0 0 
##$XL= 0
##$YL= 0
##$YMAX_a= 385505
##$YMIN_a= -559342
##$ZGOPTNS= <>
##$ZL1= 120
##$ZL2= 120
##$ZL3= 120
##$ZL4= 120
##$ABSF1= 16.522
##$ABSF2= -4.171173
##$ABSG= 5
##$ABSL= 3
##$ALPHA= 0
##$AQORDER= 0
##$ASSFAC= 0
##$ASSFACI= 0
##$ASSFACX= 0
##$ASSWID= 0
##$AUNMP= <proc_1d>
##$AZFE= 0.1
##$AZFW= 0.1
##$BCFW= 0
##$BC_mod= 0
##$BYTORDP= 0
##$COROFFS= 0
##$CY= 12.5
##$DATMOD= 1
##$DC= 0
##$DFILT= <>
##$DTYPP= 0
##$F1P= 14.0000005364418
##$F2P= -0.99999901652339
##$FCOR= 0.5
##$FTSIZE= 32768
##$FT_mod= 6
##$GAMMA= 0
##$GB= 0
##$INTBC= 1
##$INTSCL= 1
##$ISEN= 128
##$LB= 0.3
##$LEV0= 0
##$LPBIN= 0
##$MAXI= 10000
##$MC2= 0
##$MEAN= 0
##$ME_mod= 0
##$MI= 0
##$NCOEF= 0
##$NC_proc= -5
##$NLEV= 6
##$NOISF1= 0
##$NOISF2= 0
##$NSP= 0
##$NTH_PI= 0
##$NZP= 0
##$OFFSET= 16.522
##$PC= 1
##$PHC0= -81.0953
##$PHC1= 7.410496
##$PH_mod= 1
##$PKNL= yes
##$PPARMOD= 0
##$PSCAL= 4
##$PSIGN= 0
##$REVERSE= no
##$SF= 250.13
##$SI= 32768
##$SIGF1= 0
##$SIGF2= 0
##$SINO= 400
##$SIOLD= 32768
##$SREGLST= <1H.CDCl3>
##$SSB= 0
##$STSI= 32768
##$STSR= 0
##$SW_p= 5175.98343685301
##$SYMM= 0
##$S_DEV= 0
##$TDeff= 65536
##$TDoff= 0
##$TI= <Analysis number 999999
Compound Code 99
Book Reference 9
Project Code 9>
##$TILT= no
##$TM1= 0
##$TM2= 0
##$TOPLEV= 0
##$USERP1= <user>
##$USERP2= <user>
##$USERP3= <user>
##$USERP4= <user>
##$USERP5= <user>
##$WDW= 1
##$XDIM= 32768
##$YMAX_p= 403533081
##$YMIN_p= -1074022
$$ End of Bruker specific parameters
$$ ---------------------------------
##NTUPLES= NMR SPECTRUM
##VAR_NAME=  FREQUENCY,     SPECTRUM/REAL,   SPECTRUM/IMAG
##SYMBOL=    X,             R,               I
##VAR_TYPE=  INDEPENDENT,   DEPENDENT,       DEPENDENT
##VAR_FORM=  AFFN,          ASDF,            ASDF
##VAR_DIM=   32768,         32768,           32768
##UNITS=     HZ,            ARBITRARY UNITS, ARBITRARY UNITS
##FACTOR=    0.157963299565203, 1,           1
##FIRST=     4132.6476996994, 0,             0
##LAST=      -1043.33573715361, 0,           0
##MIN=       -1043.33573715361, -1074022,    0
##MAX=       4132.6476996994, 403533081,     0
$$ Real data points
##PAGE= N=1
##DATA TABLE= (X++(R..R)), XYDATA
$$ [...]
17148F61090O1988o2927j06202j7372o32L7658j5308j4345M8130R337l5156j08299
17136D57962O1631J45114l5065o621N1921j53436q4811k013J20622r380M165Q6708
17124F36797o7977O4511K2943l5253j8557K1945K6072j7414r071j05427J961J84644
17112G05174N8717o3867P136N3272R7107K1449k1783k8275J0884K0179M2025M6745
17100I48763L9202m4262K5288M3953j1268Q6875J30019L1282K5931J57107O4587
17089A497477K1134M6689J05122K8108o504l3308J5397N668O8689J29024N8605
17078A936101J9787m7879o6422L2624M4343N0314M0618L4287j0968R479M9762
17067B092046l7403k1563J20321R2741J14220M7228P7347K00008K6770k4846L0751
$$ y = [661090, 723078, 660151, 553949, 536577, 535945, 573603, 558295, 543950, 592080, 601417, 566261, 457962, 519593, 664707, 629642, 623021, 674942, 521506, 436695, 434682, 555304, 545924, 550089, 636797, 568820, 633331, 656274, 621021, 602464, 624409, 650481, 633067, 623996, 518569, 520530, 705174, 763891, 700024, 707160, 760432, 857539, 878988, 857205, 828930, 839814, 859993, 902018, 948763, 987965, 943703, 968991, 1012944, 1001676, 1088551, 1218570, 1249852, 1275783, 1432890, 1497477, 1518611, 1565300, 1670422, 1698530, 1692026, 1658718, 1674115, 1679783, 1748472, 1877496, 1936101, 1955888, 1908009, 1841587, 1874211, 1918554, 1968868, 2009486, 2043773, 2032805, 2042284, 2092046, 2054643, 2033080, 2153401, 2246142, 2360362, 2407590, 2484937, 2684945, 2711715, 2686869, 2717620]
17056B717620J38794Q3552L1679J15770J29234J42636J99669J09025L9596M0245
17046C747820J35760K26413J53240Q4677J41730J82545L58577K99511L69377M49564
17036F149214N03552O61204P62063R89183J243382J384316J591682J830817K156582
17027A7271995K392204K254479K000891J341139N41620N3388q3366K12352R59205
17018B6943907J963709L296808M938847O784366Q988250J1742029J4924484J8318125
17010I7900525K1315544K2707713K0992188J5040640O189117l284645j1022083
17003A69838999j5399227j6535303j5187463j2433119r268195o026871l062017
16996I1926804r81486J43797M0657j206456l087023n154972o287461o437431n872171
$$ y = [2717620, 2856414, 2939966, 2971645, 3087415, 3216649, 3359285, 3558954, 3667979, 3707575, 3747820, 3883580, 4109993, 4263233, 4347910, 4489640, 4672185, 5030762, 5330273, 5699650, 6149214, 6652766, 7313970, 8076033, 9065216, 10308598, 11692914, 13284596, 15115413, 17271995, 19664199, 21918678, 23919569, 25260708, 25802328, 25855716, 25772350, 25984702, 26943907, 28907616, 32204424, 37143271, 43927637, 52915887, 64657916, 79582400, 97900525, 119216069, 141923782, 162915970, 177956610, 184145727, 180861082, 169838999, 154439772, 137904469, 122717006, 110283887, 101015692, 94988821, 91926804, 90945318, 91089115, 91129772, 89923316, 86836293, 81681321, 75393860, 68956429, 63084258]
16987F3084258m834201l788224k961180k232126j615435j255253q60452m92831
16979D5044556j79020k128K49018O47148J043992J460066J781393K195259L000193
16970E5240477L832355M558623N180775N330769M632952L534032J893215N09950
16962H4713148K17981J339587L513901O232061R392524J2276494J4333169J5350637
16954A47369502J4739039J1811195O081784j857102j0205893j6475562j9257440
16947A32205523j8801346j6055784j2518390r380446o907650n165585l852601
16940E9523721k780684j952841j293959p49625m79975l44444n95761j148269j791436
16931D8386727k277623k467044k354355j975267j738793j399852j129930j135815
$$ y = [63084258, 58250057, 54461833, 51500653, 49268527, 47653092, 46397839, 45537387, 45044556, 44865536, 44863408, 45112426, 45759574, 46803566, 48263632, 50045025, 52240284, 55240477, 59072832, 63631455, 68812230, 74142999, 78775951, 82309983, 84203198, 84713148, 84931129, 86270716, 89784617, 96016678, 105409202, 117685696, 132018865, 147369502, 162108541, 173919736, 180001520, 178144418, 167938525, 151462963, 132205523, 113404177, 97348393, 84830003, 75449557, 68541907, 63376322, 59523721, 56743037, 54790196, 53496237, 52746612, 52266637, 51922193, 51326432, 50178163, 48386727, 46109104, 43642060, 41287705, 39312438, 37573645, 36173793, 35043863, 33908048]
16923C3908048r01970o64160o60050o19620p62626p87806q70688r18130j018368
16914B6704630j057288j171074j185159j133286j208157j184739j130489r61499
16906A7672939q28098q51324p87486o82174q20503p36167o45970n60363n60659
16897A1200195n22266m94303n34770n10760m71122m75400l51324l47131m31224
16888G061895l73177j95565k93504k86778k04301k34784k91322k70991k23150
16879D688323j82468k80364k31320j08094k23180l75386k16279j75839j72824
16870B722569n0886r1219j04733l9727l2483j54814j42632j41411k16253j39809
16860A608602o5451o8489o5968j39915m4330J05528m9169p3364K497l5020N1459
$$ y = [33908048, 33006078, 32341918, 31681868, 31062248, 30299622, 29511816, 28641128, 27722998, 26704630, 25647342, 24476268, 23291109, 22157823, 20949666, 19764927, 18634438, 17672939, 16844841, 15993517, 15206031, 14523857, 13703354, 12967187, 12321217, 11760854, 11200195, 10677929, 10183626, 9648856, 9138096, 8666974, 8191574, 7840250, 7493119, 7061895, 6688718, 6493153, 6199649, 5912871, 5708570, 5473786, 5182464, 4911473, 4688323, 4505855, 4225491, 3994171, 3886077, 3662897, 3287511, 3071232, 2895393, 2722569, 2671683, 2580464, 2475731, 2436004, 2403521, 2248707, 2106075, 1964664, 1748411, 1608602, 1543151, 1474662, 1408694, 1268779, 1224449, 1329977, 1280808, 1207444, 1209941, 1174921, 1226380]
16849A226380k9622r2680n5614l1518m4506j1687O3711m0314n3000M6173Q702
16838I86025M2602M3411M8807n3584q328P0479Q38K995N265k6666k7524J9069
16826A103389q0665p7195J9512m4652j22117L9075J2579P730l2815L2013L1504
16815H88358k5859J4296j0554N7480l5976j17044q6116l5090N5J6963L1558k6730
16803F71341l7622q137J3366J753R508N5272n6017o3137K1487r9117J4374J34876
16791F57947R7894m1590N9006k0282N2881Q3910m3522o3806p424J9362K5054m4194
16779G75236k8230R929p5066k1187P5417M383K8702k5103k1607L4148n3143j02797
16767F00682j08359O4453P7222M5731P3325o9758m2328K7316N1228n2617o4329
$$ y = [1226380, 1196758, 1104078, 1048464, 1016946, 972440, 960753, 1024464, 984150, 931150, 977323, 986025, 1028627, 1072038, 1120845, 1067261, 1058933, 1129412, 1130250, 1133245, 1138510, 1111844, 1084320, 1103389, 1022724, 945529, 965041, 920389, 798272, 837347, 849926, 857656, 824841, 856854, 888358, 862499, 876795, 866241, 923721, 887745, 770701, 684585, 649495, 649550, 666513, 698071, 671341, 633719, 625582, 638948, 640701, 650209, 705481, 649464, 586327, 607814, 508697, 523071, 657947, 755841, 714251, 773257, 752975, 805856, 889766, 846244, 782438, 775014, 794376, 819430, 775236, 747006, 756935, 681869, 660682, 736099, 740482, 769184, 744081, 722474, 756622, 703479, 600682, 492323, 556776, 633998, 679729, 753054, 683296, 640968, 668284, 719512, 666895, 602566]
16756F02566L63J15529j9728m7953L0076k5423j24129j11125n0720m4084l5626
16745B89746n8343o6458J6938m7305M2669O3095R4491J44323n3627m2026J5954
16734C99457K5187n5646l7529j40945m1427O6852Q8024M8592J3587j623j18131
16723B46398N8525j587p6797M1201P8186J575Q095p1475q2693r7959J0626O6747
16711A80842K2054p0823K181q9500P909n8669N7981Q7849J09084O288j2526K0922
16699B63592O8368J0544K3328p8922p2022J3318K1553n3007r3101q623L9910P6353
16687B11291J0482L7655K0715J440J4210l8992k6501M608o3566k9303R5765L1212
16675B69016m3935N569O2791K5749j01951J9158Q4648m2632J4694K8753j077m2737
$$ y = [602566, 602929, 718458, 698730, 650777, 680853, 655430, 531301, 420176, 369456, 325372, 289746, 231403, 164945, 181883, 134578, 177247, 240342, 334833, 479156, 425529, 383503, 399457, 424644, 368998, 331469, 190524, 149097, 215949, 303973, 352565, 366152, 364529, 246398, 304923, 303336, 226539, 267740, 345926, 347501, 355596, 284121, 201428, 103469, 114095, 180842, 202896, 132073, 134254, 44754, 52663, -6006, 51975, 139824, 248908, 255196, 242670, 263592, 331960, 342504, 365832, 286910, 214888, 228206, 249759, 196752, 103651, 95028, 134938, 211291, 221773, 259428, 280143, 281583, 295793, 256801, 230300, 234908, 171342, 142039, 237804, 269016, 225081, 230650, 293441, 319190, 217239, 236397, 321045, 278413, 293107, 321860, 320783, 278046]
16663B78046m0000j13658j17099k9223K1399L0608N9355K3109o1423R0040L791
16652A44945o9127N6808N8886j7659l1125M4134o6678J6683L7070k718N2605p6714
16640A47110m3302L7789M915Q5468L0676k3446K7626K2431q286J1956k2951m6114
16628B23872K227L1714p344j08960m8540J19401N3593k8804M6118p1183l9832
16617A72262O8394j10303q5068P716Q0000J5126M884n3652j59317m7917K8753
16606g9122j9271J7179M9939Q6867p533o9975L5204J14402o9577m6282K9383n5886
16594a4672J7298P0753M2804j8668O1332j5615J6091J0534m0091j07251o272l7765
16582b1522j9779J11468M7122p3280j6162P0553K3028j4656P8291n841N1200m5568
$$ y = [278046, 238046, 124388, 7289, -21934, -535, 30073, 89428, 112537, 51114, 141154, 144945, 75818, 132626, 191512, 173853, 142728, 186862, 120184, 136867, 173937, 171219, 223824, 147110, 103808, 141597, 146512, 231980, 262656, 239210, 266836, 289267, 280981, 292937, 269986, 223872, 226099, 257813, 250469, 141509, 92969, 212370, 265963, 237159, 283277, 212094, 172262, 240656, 130353, 45285, 53001, 133001, 148127, 153011, 99359, -59958, -107875, -79122, -98393, -81214, -31275, 55592, 48059, -21916, 13288, 127690, 58113, 11831, 41214, -14672, 2626, 73379, 116183, 97515, 158847, 143232, 159323, 169857, 129766, 22515, 16243, -21522, -41301, 70167, 117289, 44009, 27847, 98400, 121428, 106772, 185063, 179222, 230422, 184854]
16570A84854l5837p1578q8193k7494m4541q677R9409P691J5535P7695j7535M994
16558I6323J5487j5942r2248l6819K1728P5495l7716j5954o2340p7075K5506l0243
16546a33798k5408R0054J11611J7250Q455P7390Q2031Q1039K2297n2396n6495
16535B22030m3233J671j12822j6545L8393N1546J31545k4840K5661M515k1907
16524B56014R3418Q1625m823m1492l9330O4010J84766M8927L6712P789j3225j7690
16512F56701m4144n0441J641O0227M9294r2487L734J3594L6300L8096j512J3365
16500F84368j1877p350L0340L7755q3843r1537j83948j28531l8727O4739K2426
16489B93815p1427Q610M41O85J4877N9636k9802l8961j0039j1514J8654o2911
$$ y = [184854, 149017, 77439, -10754, -38248, -82789, -91466, 7943, 15634, 31169, 108864, 91329, 96323, 111810, 95868, 3620, -33199, -11471, 64024, 26308, 10354, -51986, -129061, -103555, -133798, -159206, -69152, 42459, 59709, 68164, 145554, 227585, 308624, 330921, 278525, 222030, 178797, 180468, 67646, 51101, 89494, 141040, 272585, 247745, 273406, 277921, 256014, 349432, 431057, 426234, 384742, 345412, 409422, 594188, 643115, 679827, 687616, 674391, 656701, 612557, 562116, 563757, 623984, 673278, 580791, 584525, 598119, 634419, 672515, 671003, 684368, 672491, 665141, 695481, 733236, 649393, 557856, 373908, 245377, 206650, 271389, 293815, 222388, 230998, 231439, 232124, 247001, 306637, 276835, 237874, 227835, 216321, 234975, 172064]
16477A72064o3535J321P6798R0719N8673M0410k441M3715O7091Q1033P4793K710
16465F43351k2586P396j3725o72K3017K3029j681m270J2526q9140j06544o1014
16453D09687j15191L0627Q0162o473J9363k8764M1243J01291M3296l6616K2764
16442E61389J36684O1280r1171j45768j11979o1423m7868p1973K7770J1606q4492
16431A84055K9074J2145K4695p1927m4258J08874N8002m8184o3174o0564o7453
16420F1285o4312J00603o6018n8974P371J45136P2302k6475j31482o0003Q8882
16409F8315J3062j5727k0715J3368L6717L3504K481L7062n1858J9446l1404k8132
16397G6119o5265J7713l3516n6382l1672p0266m503O0479j8818n7L9642N7086
$$ y = [172064, 108529, 109850, 186648, 277367, 336040, 376450, 374009, 417724, 484815, 565848, 640641, 643351, 620765, 628161, 614436, 613764, 636781, 659810, 658129, 653859, 666385, 577245, 470701, 409687, 294496, 325123, 405285, 398812, 418175, 389411, 430654, 531945, 575241, 538625, 561389, 698073, 759353, 668182, 522414, 410435, 349012, 301144, 229171, 256941, 268547, 184055, 213129, 225274, 249969, 178042, 133784, 242658, 300660, 252476, 189302, 128738, 61285, -3027, 97576, 31558, -27416, -20045, 125091, 197393, 170918, 39436, -20567, 68315, 81377, 65650, 44935, 58303, 95020, 128524, 131005, 168067, 116209, 135655, 104251, 76119, 10854, 28567, -4949, -61331, -93003, -163269, -167772, -107293, -126111, -126168, -86526, -29440]
16385b9440K0353r253p4919p3249P4492K0479L252m3679L373J20351J3569r530
16373A5799L0104n6247k9433j04110n0322J6828R5466L1938j0504k021l8417l6931
16361a37850k8159R9510Q3310R622k509r0214j9101n0685k8852n048j0186J23918
16349e6244L7558K9113M9202j9721j686l7723Q3125k2358j9110M2204r3955o7441
16337g7036P5208K4008k6068P590N9016l0854J8568L5153L4286J6639p1881J0689
16325G5318M8468o9501J0567m8452p1072K5349N3242J0137p4158J7655k1661p0231
16313a14339K041N7276K0302M0621k4007k4358J8084m5181j8219J2563m2537j4653
16301a32407J0363J01156j2719q634l4481j0739m0942K2474O9862J1964M7183
$$ y = [-29440, -9087, -18340, -93259, -166508, -92016, -71537, -68285, -111964, -108591, 11760, 25329, 15799, 45903, -10344, -39777, -143887, -194209, -177381, -81915, -49977, -60481, -62502, -100919, -137850, -166009, -66499, 16811, 26433, 23924, -66290, -85391, -136076, -164928, -169976, -180162, -56244, -18686, 10427, 59629, 39908, 38222, 499, 83624, 61266, 42156, 84360, -9595, -77036, -1828, 22180, -3888, 3702, 62718, 31864, 50432, 85585, 119871, 136510, 64629, 75318, 123786, 54285, 64852, 16400, -54672, -29323, 23919, 34056, -40102, -22447, -44108, -114339, -112298, -55022, -34720, 5901, -18106, -42464, -24380, -69561, -87780, -75217, -117754, -132407, -122044, -20888, -33607, -42241, -76722, -87461, -128403, -105929, -36067, -24103, 23080]
16290B3080m7702N1106N7247n2431K8025L1710j8004p4258j36391j5416o903J00785
16278e9152m1333n0698L8613M3401n0298L1367M5778Q3930L5519o3741k1984n4137
16266f2735p1165J3405J3414m3789M0371N0524O632m2434L6783J5169R1496l3896
16254A3775n3983l319j28853L8273n2189N6815O3372l1393k3940j033J40392M8011
16242F5928n7981o3957l0818J8469j3871j5765L173K1674r778R400J24935K4476
16230G5885r5350p005M1147o2781L247P8067k7474j4848N6427K955n4963j06419
16218a11112l114K0938N2868R9853M8070r1887o4914m3551Q4344J39416q2161
16207D8750j12091o9543m9455M1755P9785r782P8986O4182l9719o1299q5885N3405
$$ y = [23080, -24622, 26484, 83731, 31300, 59325, 91035, 73031, -1227, -137618, -153034, -159937, -59152, -100485, -151183, -112570, -69169, -119467, -88100, -42322, 41608, 77127, 13386, -8598, -62735, -133900, -120495, -107081, -150870, -110499, -59975, -53343, -95777, -58994, -43825, 47671, 13775, -40208, -43527, -172380, -134107, -186296, -129481, -66109, -97502, -121442, -122475, 17917, 65928, 7947, -56010, -86828, -68359, -82230, -97995, -94822, -73148, -82926, -73526, 51409, 75885, -19465, -26470, 14677, -48104, -44857, 33210, 5736, -9112, 47315, 50270, -4693, -111112, -114226, -93288, -40420, 59433, 107503, 15616, -49298, -92849, -8505, 130911, 48750, -63341, -132884, -182339, -140584, -60799, -70581, 8405, 72587, 32868, -28431, -114316, -60911]
16195f0911P0522K0188J2346k2919n3604M2856M2560n5904j2357N4213M9033n9893
16183B6130o9024J2137P737J5897m6732n1446J01198P3201J02890M9584j09599
16172A11973q5937Q49N2474j61653j12811K3543M7798Q4283M4263k4155p360n4791
16160h1524l2846n9435m787R819L483J00167M4552j1499k0893N683K8966j35791
16148a54105k1285P0715N631j3837K3792P7242m1698Q259M5007q4373J06592P8820
16136A00760M3868J2995m0515o1566r7537M0762L9586M4454j6431l9357k6005
16125A014J7483J7572p0519k9050m8215l1580O4466o2725O0110j4082o3037m8632
16113b07195M7293O6683P070O3541o9378o7972M7899R1376l553n5686r539j01022
$$ y = [-60911, 9611, 29799, 42145, 19226, -34378, 8478, 51038, -4866, -17223, 36990, 86023, 26130, -42894, -30757, -23020, -7123, -53855, -105301, -4103, 69098, 171988, 221572, 111973, 26036, 26885, 79359, -82294, -195105, -171562, -123764, -39481, 4782, -19373, -26733, -81524, -114370, -173805, -178592, -168773, -165290, -65123, -20571, -32070, -52963, -47280, -18314, -154105, -175390, -104675, -99044, -112881, -89089, -11847, -53545, -45286, -279, -84652, 21940, 100760, 144628, 157623, 117108, 55542, -41995, -1233, 38353, 82807, 66376, 27019, 1014, 18497, 36069, -34450, -63500, -111715, -143295, -78829, -141554, -81444, -95526, -158563, -207195, -159902, -93219, -86149, -22608, -91986, -159958, -112059, -20683, -24236, -79922, -89461, -190483]
16101a90483O838O7651Q3084L0385p6001N4973J3933k5527k3466m6652l6365K0832
16089a20798N3303J8863l7448k2537o280L038O7010L2128k0132J4763q7610l9377
16077a45077R257j0597O499O1157p2845n7444K7998Q1830K474K369N1214n5065
16065i8230j7366J21979O9748M788l24j02680K7800J0802L6936j1361p4093m0500
16053g2501l0J3324l4978k0002K8483K870P6886Q5586n2834q8434J9610M0652
16041a368K4375M2691j8356o462n8999o9043N0140L581K7107O0446o2422N1428
16029D3118k9703j8248L5362J1701J2865j04921p7243k0339P1798J0968M117k6580
16017h7105k4077j1605J23925m6716o6058J9098N6143K648m357k460M3319j6364
$$ y = [-190483, -183645, -115994, -32910, -2525, -78526, -23553, -9620, -35147, -58613, -105265, -141630, -120798, -67495, -48632, -86080, -108617, -114897, -111859, -44849, -12721, -32853, -18090, -105700, -145077, -135820, -146417, -139918, -78761, -151606, -209050, -181052, -99222, -96748, -94379, -43165, -98230, -115596, 6383, 76131, 80919, 80595, -22085, 5715, 16517, 53453, 42092, -32001, -72501, -72531, -59207, -94185, -114187, -85704, -82834, -5948, 79638, 26804, -61630, -42020, -1368, 23007, 65698, 47342, 40880, -18119, -87162, -37022, -33441, -6334, 54112, -8310, 43118, 13415, -4833, 30529, 42230, 55095, -49826, -127069, -147408, -75610, -64642, -60525, -87105, -111182, -122787, 1138, -45578, -111636, -92538, -36395, -33747, -38104, -40564, 2755, -13609]
16005a3609K6074R769j0403j17443r117j6305N5290J8479l249M2762Q3049J9361
15993H4658m3144m1564n4999J4398Q2192Q747o1400L1633m7147j3706N3416k0472
15981g388p4088l4659J24305N5962p9557O0096M2706n7563q5024l0179j11772
15970a97161K514K1429Q3140O2604L3708n59o8866n9075k836N357P1867Q6671
15958C8793k0230l4268L3212q9084j5256k9489J152j162M7904N3514m0660L3911
15946b1663P4190K5734p1779j36520J0116o459Q329l3552k7195Q262J40913R7897
15934F8273r1323M4255J06462n8649l2522k4167o499L4287K2561M112l6644p61
15922B9385j8439o4399J02046M8591m8798j32616L7542M5489L5100n6321K2694
$$ y = [-13609, 12465, 22234, 11831, -105612, -114729, -131034, -75744, -57265, -60514, -17752, 65297, 84658, 41514, -50, -55049, -40651, 41541, 50288, -11112, 20521, -26626, -40332, 13084, -7388, -81476, -116135, 8170, 64132, -15425, 44671, 87377, 29814, -55210, -85389, -197161, -194647, -173218, -90078, -27474, 6234, 5675, -63191, -122266, -125102, -119745, -47878, 38793, 18563, -15705, 17507, -71577, -86833, -116322, -115170, -116332, -68428, -14914, -55574, -21663, 52527, 78261, 6482, -130038, -119922, -126381, -118052, -151604, -178799, -170537, -29624, 68273, -23050, 21205, 127667, 69018, 36496, 12329, 5830, 40117, 62678, 66790, 30146, 29385, 10946, -53453, 48593, 97184, 48386, -84230, -46688, -1199, 33901, -22420, 274]
15911B74l2018r8970o9146L2863O1713o338q793j1360K2782M6581L5903M8142
15899B1633L7027P370L1206p446n5053m3834j498N6446l3910l3819n9174m7120
15887a28172Q3737m6155l5788L5048p33O1477L0664L4678k5287m417J7516o3364
15875d0796Q4509m5093p8239j9304M3359l6536m3442Q254K2049K9273M7738L5072
15863F844K1538n679m118K1491l3074j34561M8452N5504J5597r764m5915j7937
15851h1622m3597r640R0364L3305o5206m4600J00594j5509M8670j7412J8025k3499
15839a0127p5711k3894L4307R2075P4340q9298p1663o480m5704K1857p573o394
15827a14265O2333K8392m6840k3941j9744N1071M5738Q242J1252N084n9248M403
$$ y = [274, -31744, -130714, -199860, -166997, -105284, -111622, -120415, -131775, -108993, -62412, -26509, 21633, 58660, 66030, 97236, 89790, 34737, -9097, -10595, 45851, 11941, -21878, -81052, -128172, -44435, -90590, -126378, -91330, -92063, -30586, 78, 34756, 9469, 5052, 22568, -40796, 43713, -1380, -79619, -98923, -55564, -92100, -135542, -127288, -105239, -75966, -28228, 6844, 28382, 22703, 18585, 40076, 7002, -127559, -79107, -23603, -8006, -17770, -63685, -81622, -125219, -134859, -44495, -11190, -76396, -120996, -20402, -35911, 12759, -4653, 13372, -10127, -85838, -109732, -75425, 16650, 90990, 1692, -69971, -76451, -122155, -100298, -107871, -114265, -51932, -23540, -70380, -94321, -114065, -62994, -17256, -9014, 2238, 7322, -51926, -47523]
15815d7523K9216K155l7475K1228k2029K5821q0288j5080L6325P7266K113K9208
15803B0937l20n6590K9565m7558q281P8084l425m5199n3065j6004P653L5758J10892
15790E2447K1274k4084l5742o7404q061P9650K2840K6015m6159j3935K9043k7352
15778H532q6692J09254k7241L0134N9395K477L3458p8036l8015j4331j23101L3884
15766i0282R2188j6873K4754L8166j1144p045Q046J7820K2078o943n6544j04987
15754i0766L681N7839o461J7826k5862j24505j05489M3152J04876M8825K4170
15743e2714l1024n6867N1698N7543N3635o384O6796j4408j50433l8008l3775N5520
15731i8421L8112O0835k8922j3820N1025o7678L4159K5898o4006k2897O0710N7169
$$ y = [-47523, -18307, -16152, -53627, -32399, -54428, -28607, -108895, -123975, -87650, -10384, -8271, 20937, 20617, -35973, -6408, -53966, -62247, 15837, 12412, -32787, -85852, -101856, -94203, -58445, 52447, 73721, 49637, 13895, -53509, -61570, 18080, 40920, 66935, 20776, 6841, 35884, 8532, -78160, 31094, 3853, 33987, 93382, 95859, 129317, 51281, 13266, -1065, -124166, -90282, 1906, -14967, 9787, 47953, 36809, 29764, 37810, 55630, 77708, 70765, 14221, -90766, -87085, -29246, -35707, -17881, -43743, -168248, -273737, -230585, -125709, -76884, -52714, -83738, -140605, -88907, -31364, 22271, 15887, 82683, 68275, -82158, -120166, -153941, -98421, -60309, 526, -28396, -42216, 8809, -58869, -24710, 1188, -62818, -85715, -25005, 32164]
15719C2164M7252p2554q5208n9098J2306O5068M1545k7614Q350o06o2802k206
15707a03403M7287L8096j7833p384P1844J05385l3218q960n1202l1388q375K3416
15695B4265R3102j32181q4443o4074P7149O7372J6823O3160j6208q6643J711N9880
15683A9913J19601N7698l3j13004n3957N053l3090k2720j9156J7438m705p7905
15671a04867L0405L623O7938k2159j1493l0601L5552o8426L8205J4030O1230R071
15659B2508O967k7309K8339o7407o2036j9092N7433j4898J6536J928j0945L0950
15647c7026M9676M6931n3510r5323L7003J18572M4256p1320q2547r602k7300J71092
15635I0902R6594m6712j17291P9052m8632q9340k0656Q168j9576j2952J09285
$$ y = [32164, 79416, 6862, -78346, -137444, -125138, -60070, -18525, -46139, -37789, -38395, -101197, -103403, -56116, -18020, -35853, -43237, 28607, 133992, 100774, 91814, 40612, 9224, 849, 24265, 117367, -14814, -99257, -163331, -86182, -18810, -1987, 61173, 44965, -41678, -39967, 19913, 139514, 197212, 197179, 84175, 30218, 35271, 2181, -20539, -39695, -22257, -26962, -104867, -74462, -70839, -2901, -25060, -36553, -67154, -31602, -100028, -61823, -47793, 13437, 22508, 29475, 2166, 30505, -36902, -98938, -118030, -60597, -75495, -58959, -57031, -67976, -37026, 12650, 59581, 6071, -89252, -52249, 66323, 110579, 39259, -43288, -52890, -80190, 90902, 187496, 140784, 23493, 102545, 53913, -35427, -56083, -47915, -67491, -80443, 28842]
15624B8842K8116o7927o0896j2368o343o4631L9457J2810q3869m9967J4202L4956
15612a87618J08132J07391P4914N6709k2348j7302J7479p3402J1526K9465j05447
15601e01q4847R2812R4492L140n8463q996k6621O995L2413J224P9650L8244M3549
15588B13091N9412M7928r1470n4375N788n3000j8102o458n0047l9624j2014j2882
15576a1753L5127O0784J3931m7371K0520j7709m2380l4391j2948O8673N5180J1868
15564I9531m1967K1378k5918K0987j4122j689p2331m4206P1227L6877o0177m9799
15552f0209K7755O0506Q7271p5997j0022m0776o7164P5005P5326j327p8450l3232
15540d1314J6031L1887L7137q164k6800M7228r1659p1500P6610q38O135o3338
$$ y = [28842, 56958, -10969, -71865, -84233, -90576, -155207, -115750, -102940, -186809, -236776, -222574, -187618, -79486, 27905, 102819, 159528, 137180, 119878, 137357, 63955, 75481, 104946, -501, -85348, 7464, 101956, 105096, 46633, 37637, 11016, 18011, 50424, 51648, 131298, 169542, 213091, 272503, 320431, 228961, 174586, 180374, 127374, 109272, 102814, 52767, 13143, 1129, -11753, 23374, 84158, 98089, 50718, 71238, 53529, 11149, -23242, -36190, 32483, 87663, 99531, 57564, 78942, 53024, 74011, 59889, 58200, -14131, -58337, 12890, 49767, -10410, -60209, -32454, 28052, 115323, 39326, 29304, -11472, -78636, -3631, 71695, 70368, -8082, -41314, -25283, 6604, 43741, 35577, 8777, 56005, -35654, -107154, -30544, -31382, -25247, -88585]
15528h8585J10559J47331j3875n2710q097K8971j8392L2572J5374K5388K9187
15517B07723j44854l0721q1495o5893j1315k086j1404O3177n5366J6315J29228
15506A3309q299l0441J02763j6160L2298Q452Q94L747L0356n1681m2620k8744
15494A3874N3970o0876N2881k0848J0983L3716p7953J1279P2711o564l3121K2407
15482G2459j4809r7142k5896K8987J1749o5220k5723j5823l1073O3911j8155J61569
15470D4834l0092j25118l6848J4757L3703k0548O2403L1694O2651n0366j13252
15459a26182m8735L3921P9848m4195R7964j7396j4818p5530k0185P5887P7710
15448A8289P1286Q965j6919q521j11460L7432Q2136k4957m5237J035N3609P3438
$$ y = [-88585, 21974, 169305, 155430, 102720, 94623, 123594, 105202, 137774, 153148, 178536, 207723, 62869, 32148, -49347, -115240, -126555, -128641, -140045, -76868, -132234, -115919, 13309, 5010, -25431, 77332, 61172, 93470, 101922, 102816, 106563, 136919, 85238, 42618, 13874, 67844, 6968, 59849, 39001, 49984, 83700, 5747, 17026, 89737, 83173, 50052, 72459, 57650, -39492, -65388, -36401, -24652, -89872, -115595, -131418, -162491, -98580, -116735, 44834, 14742, -110376, -147224, -132467, -98764, -119312, -56909, -25215, 37436, -12930, -126182, -174917, -140996, -61148, -105343, -7379, -24775, -39593, -115123, -135308, -59421, 18289, 89575, 98540, 81621, 73100, -38360, -928, 81208, 56251, 11014, 12049, 65658, 139096]
15436A39096q7467L1941N2217j8286l6713M0360j6152k3007J7045L2458m765n1805
15424G4922j5339n8985n8412r5996m7486O6586J11373M3969l2825k8826O1446
15413B0427Q1692q4645q9875n365k848J26642K2103J385P1282l6816k5009p782
15401G1191q4598j5817j897p5463Q061J0478L7717M4090Q4712n9830o1992l8058
15389h1406L9977O116J6122k2566M1022J8824j2092o823R5927N4509r8515p9353
15377b8258j2288L349k9674M184Q0660O1773L366l1826q9309n5823P4459m3197
15365f2584j5195J00896j5310K6292l7425j05770k2951j2317M2271J4656l4944
15354a22381k841p1399J9766J26406J7884m3349N3444L4403n1109J6035m5028
$$ y = [139096, 51629, 83570, 135787, 117501, 80788, 121148, 104996, 81989, 99034, 131492, 126727, 74922, 59583, 598, -57814, -153810, -201296, -134710, -23337, 20632, -12193, -41019, 20427, 102119, 17474, -72401, -77766, -80614, 46028, 68131, 69516, 140798, 103982, 78973, 71191, -13407, -29224, -31121, -106584, -98523, -88045, -50328, -6238, 78474, 18644, -43348, -81406, -41429, -35313, -19191, -41757, -735, 18089, 5997, -826, 95101, 149610, 51095, -28258, -40546, -37197, -66871, -62687, 17973, 79746, 83112, 51286, -38023, -93846, -19387, -62584, -77779, 23117, 7807, 34099, -3326, -109096, -132047, -144364, -102093, -87437, -122381, -125222, -196621, -176855, -50449, -32565, -75914, -22470, 11933, -39176, -23141, -68169]
15343f8169R4741L4930j01483j04009k2373k984M3922R9667Q7239P1583K3364
15332A56428j05841k0723q3284M5216J04404M8686o271k7690N1559l4083j71850
15321d3449r0897k7184M3058O2206J16573L6748n3339n8862Q03j39836k5322N7293
15309a22208l0847l5341O8668P3293Q8244n4577j07727J139L6616Q7983M7970
15298E3213m935p0761L254P5656K1696m317p7203q3860P2485J30248K2031j41561
15286d054p0024M1626K6477J7179k1039K6670p5743n3692j5478N450J24538k2424
15274b0514K7701N2388o7514m427j00908L5168M0307j5539J518j9783n1840P4461
15262d8982O925j5076r6010J9937N5100M7351N0769Q6663j30089r9145L0268K9367
$$ y = [-68169, 26572, 61502, -39981, -143990, -166363, -169347, -125425, -25758, 61481, 133064, 156428, 50587, 29864, -53420, -8204, 96200, 144886, 138615, 110925, 162484, 128401, -43449, -134346, -161530, -118472, -56266, 60307, 97055, 43716, -15146, -14343, -154179, -179501, -122208, -153055, -188396, -119728, -46435, 41809, -12768, -120495, -119356, -82740, 5243, 53213, 48278, -22483, -19229, 56427, 78123, 73806, -3397, -87257, -14772, 115476, 137507, -4054, -74078, -32452, -5975, 11204, -9835, 16835, -58908, -112600, -128078, -122628, 1910, -20514, 7187, 59575, -7939, -12366, -113274, -78106, -37799, -53338, -51820, -71603, -123443, -48982, -42057, -57133, -153143, -133206, -78106, -30755, 20014, 106677, -23412, -122557, -92289, -62922]
15250f2922M3577M0857o286p9012l5758J5295m416p080L4640M5624J34031K8437
15238A46987m4163l7640l0435k479p7976r634L7893L1343l0747n801M7851j1312
15226A3887P5155O0470p9672j02900k4234M255O1671J2687k77q835M8050m6811
15214A3446j09057j4314K254J04532K536k3804P1322l5271n4616k6242K2721N1217
15202D724K8508L9991K9935o3086n3207K7536J0852k9390l2409j8166l6242L2910
15190e8044N0739n193K270j7957k0759M908L9162L2128j8398m9795k2682j00193
15178a63814q7353N9059P2524R3757k51J1144n4749o7613l3989Q2737N2148K9262
15166g138q385J2062K0016J0000P1036J4290l0911q9741j06158j4816L2333J936
$$ y = [-62922, -19345, 21512, 15226, -63786, -99544, -84249, -88665, -95745, -61105, -15481, 118550, 146987, 102824, 65184, 34749, 32270, -45706, -55340, -17447, 13896, -16851, -22652, 25199, 13887, 89042, 149512, 69840, -33060, -57294, -53039, 8632, 21319, 21042, 12207, 60257, 13446, -95611, -109925, -107671, -3139, -603, -24407, 46915, 11644, -42972, -69214, -46493, 4724, 33232, 73223, 103158, 40072, -13135, 14401, 25253, -4137, -36546, -54712, -90954, -58044, -7305, -12498, -10228, -28185, -48944, -44036, -4874, 27254, 8856, -40939, -63621, -163814, -251167, -192108, -119584, -25827, -26078, -14934, -69683, -137296, -171285, -88548, -36400, -7138, -15523, -3461, 16555, 26555, 97591, 111881, 80970, -8771, -114929, -129745, -97412, -95476]
15154i5476J9178n6597m6860m3506N9179P6999j6614j18847J8098K1879O0673
15143a21894N6384j2978J2090O7441k4096O1799J6334O7320m6358r3478p9762
15132i7198L8372L1458r1111k0535m9267J54429J19055q1401o8416K2815O7330
15121B5531P7221Q276l2500m9074K4220r671q7750L9621J036j00082r6084l4559
15109b33815P5843m8647K8481L5320q1189o3332J82J35975J40588N6838K1864
15098F8108o4230j8714O8963n2012k0177K3127Q5401k7017o6715j16010K6050
15087i3226J7493O432K5674M6044N282m3387k5914N098r7143k5657J34734J07014
15075F2444L9201M2755p1651j14688M9935k03P2334M1596l9718j9601M085n8607
$$ y = [-95476, -76298, -132895, -179755, -223261, -164082, -87083, -103697, -222544, -204446, -182567, -121894, -65510, -78488, -66398, 1043, -23053, 38746, 55080, 122400, 76042, -17436, -97198, -58826, -27368, -118479, -139014, -188281, -33852, 85203, 3802, -64614, -41799, 25531, 102752, 111028, 78528, 29454, 53674, 44003, -43747, -4126, -3090, -103172, -199256, -233815, -157972, -206619, -178138, -142818, -224007, -287339, -287157, -151182, -10594, 46244, 68108, 3878, -14836, 54127, 2115, -18062, 5065, 90466, 63449, -3266, -119276, -93226, -75733, -69301, -43627, 2417, 7699, -35688, -61602, -56504, -153647, -179304, -44570, 62444, 101645, 144400, 72749, -41939, 7996, 7793, 80127, 121723, 82005, 62404, 66489, 7882]
15063G882o775R460n4142k4123O0362J35090r524j20952J4214M7094J248j4193
15051D5641J415j4424l0392j1655k0880L965n2890Q0078M3844K9701m149o211
15039F4043j3431n7850j09035m326R6216l3772N831O6770n1341m5092j7654J5804
15027h3837J6105P6925K4311R6001r25r6165m5891p233j5849r778K8624K1809
15015D097o2837N2281K2821j4560n2013r7974O9359O6827m7418j1811K7746Q2407
15003C8925J3212k3483j2231J32016O3408j13391j19642l5132J21201O7835j0730
14992A21988k2939l9901j53599L9739P5284m9006N7740R8416l3675p3401j5170
14981E476l2488J7707m0906n2512p1530j722N3365J13302J03829k698p8802n9771
$$ y = [7882, 1107, 10567, -43575, -67698, -7336, 127754, 118230, -2722, 11492, 58586, 59834, 45641, 47056, 32632, 2240, -9415, -30295, -26330, -79220, 858, 44702, 74403, 70254, 64043, 50612, -7238, -116273, -120599, -24383, -58155, -52324, 14446, -36895, -81987, -99641, -83837, -67732, 9193, 33504, 129505, 128580, 32415, -13476, -20709, -36558, -46336, -17712, 4097, -58740, -6459, 16362, 1802, -50211, -148185, -78826, -11999, -59417, -71228, -43482, 38925, 52137, 28654, 16423, 148439, 211847, 98456, -21186, -56318, 64883, 132718, 121988, 99049, 59148, -94451, -54712, 20572, -28434, 29306, 127722, 94047, 20646, 5476, -27012, -9305, -50211, -102723, -174253, -175975, -122610, -9308, 94521, 91823, 13021, -46750]
14969d6750J7394m2980R615M8Q759M4669l9513m9699r2967K8953J1971Q4640N0838
14956a5022J6662r815m9318J5102k3199k4535l1830L0014M7637n4919m1717M4122
14944i6818P1127K8151l8082k7321q595j400M2689P3105O7023O248n6275k2032
14932C7820J101J4394Q9L662o5600j12303p0075N4569Q0576L976o4678q534l4881
14919a59884J039L0417R6589p87k9006m0088N7208J6103N0391M6869J1364K7324
14907A07539K947n6401m0078L5360k061k1591m8768m3015o5832L9634k3422l21
14895a16009k2873o848r7378P8786J0549p8771L8501R6096L4999M1732l5705k6521
14883h3442M466J6421J4423P9438Q888q5086m5511N816m6924P6694J143j2220
$$ y = [-46750, -29356, -72336, -62721, -62673, -53914, -9245, -48758, -98457, -191424, -162471, -150500, -65860, -15022, 1640, -8175, -57493, -42391, -65590, -90125, -121955, -91941, -44304, -99223, -140940, -96818, -25691, 2460, -35622, -62943, -71538, -72938, -30249, 42856, 109879, 116127, 59852, 37820, 38921, 53315, 53404, 57066, -8534, -120837, -190912, -136343, -55767, -51791, -116469, -125003, -159884, -158845, -128428, -31839, -32626, -61632, -101720, -44512, -28409, 21982, 68851, 80215, 107539, 110486, 54085, 14007, 49367, 47306, 25715, -23053, -66068, -131900, -92266, -115688, -116009, -138882, -145730, -243108, -164322, -153773, -232544, -194043, -97947, -62948, -21216, -56921, -83442, -78976, -62555, -48132, 31306, 40194, -44892, -90403, -84587, -131511, -54817, -53674, -65894]
14871f5894L7111O2012O3823J26549r2441j6217J7200m6998j37331l1764k9468
14860a13418K2234M7918K9869J332l2262m8252o328J4355k4660J24786Q7249J0618
14848A13441n5142j9592j2946N0490P72j5606q0140Q92j8709M8758n3681q6899
14836a28362l7727J8836N6731O6312K3095j2141j9275L3562O5122p1622M5982
14825D0513l327n2966J12917M9470o8168r6152j417M513k8228k7547j2543L246
14813g9689m1125J9303L4006q714K0244L0498j5996n141L2850J7210n8577j0906
14801f6037N9479N98j05817L6929N1879k1975m0910q1532J6940J40731L9958j06680
14789g6437o4025n5357O9160R0453L52M981j0333j2204j6579l4246R5972M1189
$$ y = [-65894, -28783, 33229, 97052, 223601, 131160, 114943, 132143, 85145, -52186, -83950, -113418, -91184, -43266, -13397, -12065, -44327, -92579, -98907, -84552, -109212, 15574, 102823, 113441, 58299, 38707, 25761, 76251, 77023, 61417, -18723, -17831, -36540, 12218, -41463, -128362, -166089, -147253, -90522, -24210, -1115, -13256, -32531, 1031, 66153, -5469, 40513, 37186, -15780, 97137, 146607, 78439, -17713, -19130, -14617, -42845, -70392, -82935, -79689, -120814, -101511, -67505, -76219, -55975, -25477, -41473, -46614, -13764, 3446, -55131, -66037, -6558, -5960, -111777, -74848, -22969, -44944, -85854, -167386, -150446, -9715, 30243, -76437, -140462, -195819, -126659, -36206, -35854, -30873, -41206, -53410, -69989, -104235, -8263, 32926]
14777C2926m9399M2696O885K0111j2440J9035l6017o2903m1936o9605o2914M4185
14765a69376M5212j4230L8496P546m5054O819N0161K3343M9689k5773K6979k5048
14753c1236M5825m2323o2245P0874P9840K8920m9418l0097n4865M8505Q5920k4060
14741F5640l5233j3321l6320k9274o5710M2710J15988M9581r566N1832m0983j62714
14729f7370n2630N440j9561J15774J25261J639j03294l0810l7422K7771Q5507
14718E0305l0929N646N3832l2783o0003J6604J8857o1202M854M4884k6377K8713
14706A2401J10255P5800r2805l5805J0730p5780n4458n544n8143N2428K053o9427
14694a28295N6087J8095j8357p881O700m212o3346L5280k2199n8690j0226R663
$$ y = [32926, -16473, 26223, 33108, 53219, 40779, 59814, 23797, -39106, -81042, -150647, -213561, -169376, -124164, -138394, -99898, -92352, -137406, -130587, -80426, -57083, -7394, -33167, -6188, -31236, 14589, -27734, -89979, -19105, 60735, 89655, 40237, 10140, -44725, 3780, 89700, 65640, 30407, 17086, -19234, -48508, -114218, -71508, 44480, 94061, 84495, 136327, 95344, -67370, -120000, -114560, -134121, -18347, 106914, 108553, 5259, -25551, -62973, -35202, 50305, 19376, 25022, 78854, 46071, -13932, 2672, 21529, -39673, -34819, 10065, -16312, 12401, 122656, 198456, 105651, 69846, 80576, 4796, -49662, -55206, -113349, -60921, -58868, -128295, -72208, -54113, -72470, -80351, -73651, -77863, -141209, -105929, -128128, -186818, -197044, -187381]
14682a87381N7821J03890O6482l0701j0748P9009l4755j10864K8013p131k8216
14671g4581M1865R690K9052J06684P0460o7839n6337k6570m7513j4348k5439k4241
14659g9117K4205L0536J249L4429j7225m0566l0863l9976N0061K3338P4965N2066
14647H3102o362p98j0922O7579M177j50805p7192l0760J6173O9314q1245o7301
14635a85040K0206N9068N1431Q871l4044M496R3107P4574m3116o5268j3817M3725
14623A4193L2421L1864o70K2464j1443k8850n3203o7137j3980O9210N1017k9818
14611A6068l8234m1998k6447J3077R0253j14099n4735M5496N1339M3159J9080
14600B959L2647k3778n2731K7449j7466o2633k1299j11636O0104J33809R4962
$$ y = [-187381, -129560, -25670, 40812, 10111, -637, 78372, 43617, -67247, -39234, -46365, -74581, -32716, -23026, 6026, 112710, 183170, 115331, 58994, 32424, -15089, -29437, -54876, -79117, -54912, -24376, -23127, 11302, -5923, -46489, -77352, -117328, -67267, -43929, 31036, 83102, 76740, 75942, 65020, 132599, 136776, -14029, -91221, -121981, -105808, -36494, -117739, -185040, -164834, -105766, -54335, -45464, -79508, -75012, 18095, 92669, 49553, -15715, -29532, 14193, 46614, 78478, 77808, 100272, 88829, 59979, 6776, -60361, -74341, -5131, 45886, 16068, -22166, -64164, -90611, -77534, 12719, -101380, -156115, -110619, -59280, -16121, 2959, 35606, 11828, -40903, -13454, -30920, -93553, -114852, -226488, -166384, -32575, 62387]
14589F2387j17846n4615P4557J23114O1564l4396o7876n6981L2310M3555J13466
14578A79239N0477R2187k1805L8678j25306p6876p6996k2333l9651m2778K6642
14567a8522Q5413N3450l5245m1604o8184k8310K0726j1059K8577J24282m2406
14556F7118j01513n0078M7206k7813K7381M5034P2897m680j37228j50554l0375
14545b42605m2642J17754R7543J5673P3448J8034j3715m3485n8784J21405m1353
14534A273j3008l9713M6688l6480n0478n2819K8470m425Q3806J4930m4479N1650
14522a4585q906j00470L3956J22920P8139r3263o7114P8765j3050K0929N7693
14511I5014K5577o7032J5722M7315J7882j22353j7556M675j16620M3625R6295
$$ y = [62387, -55459, -110074, -35517, 87597, 149161, 114765, 46889, -10092, 22218, 65773, 179239, 229716, 321903, 300098, 338776, 213470, 136594, 59598, 37265, -2386, -45164, -18522, 66891, 120341, 85096, 43492, -24692, -53002, -32276, -43335, -14758, 109524, 67118, -34395, -84473, -37267, -65080, -37699, 7335, 80232, 75552, -61676, -212230, -242605, -285247, -167493, -69950, -54277, 19171, 37205, 23490, -19995, -78779, 42626, 1273, -11735, -51448, -4760, -41240, -91718, -144537, -116067, -120492, -36686, -21756, -66235, -14585, -23491, -123961, -90005, 32915, 111054, 17791, -49323, 29442, 16392, 37321, 95014, 120591, 53559, 69281, 116596, 134478, 12125, -5431, -756, -117376, -73751, 22544]
14500B2544k215R5517K7474l4069N09J2780j3007J2583o661j5806j6294r211m7543
14487B6601j0365j4303k3986j991j0812L39p664o5380K287N8686R3971j18203
14475g0820q8849K7831P5415N7660M7045R677p5312m0531l7963p461P3192k7828
14463e7944j15908j10485J12265N7649m8942L341o290j7021M5128N1764L6553
14452d9890O6633K3044m57m9471P5381J330k0477j7568O890l0934p5591M825Q6625
14439B0340O84j4512L2233Q178q8850j5160J11575K5660k9123q0253o316n6273
14427i1817o5407m1930L0483J5215l3060M2353O0038P4334O2311r4760p0175j0755
14415a23170J3621L1831L7592M0905O7904q407p9753o9354n36M5077K3260n015
$$ y = [22544, 20329, 115846, 143320, 109251, 109760, 122540, 109533, 122116, 115455, 99649, 83355, 74144, 26601, 16236, 1933, -22053, -24044, -34856, -34517, -42181, -107561, -105274, -46588, 47383, -70820, -159669, -131838, -56423, 1237, 48282, 57959, -17353, -57884, -95847, -103308, -30116, -57944, -173852, -284337, -172072, -114423, -163365, -160024, -166314, -183335, -138207, -86443, -49890, 16743, 39787, 39330, -10141, 65240, 66570, 46093, 28525, 35415, 4481, -71110, -66285, 20340, 21024, 6512, 38745, 46923, -41927, -57087, 54488, 80148, 51025, -29228, -35544, -91817, -157224, -199154, -168671, -153456, -186516, -144163, -84125, -9791, 52520, -42240, -112415, -123170, -109549, -77718, -40126, 779, 68683, 60276, -19477, -88831, -89367, -44290, -21030, -26045]
14403b6045N0735j2245m4954q7998m1164p298q778O1236P7462j7472P25n2631
14391a08427j6297L9533N7341K4000l7510j9976J3151O0750Q0749n8502p9624
14380d4812Q385N8597j7682J9028P7238N3044k767o6861k6490l2399K1467L1070
14368G7818r5284n3807n4657L1777J2570Q1368M6889l6625j29900j0195N3822
14357g6224R711k6490j23562J1422K5362L5645M3736J8017o114Q8507J0407j7564
14345g147p1564l5859M0727P0478L0662n0411j1901J21573l6161n913L0948k4983
14333E0449m1099m7796L5737O5216J0642q0132n3187j09377o140N6607L7331K3534
14321e8215k8630p5639L790Q8448O7217j24661k4966M3237n1073R739P6052N8323
$$ y = [-26045, 24690, 12445, -32509, -120507, -161671, -168969, -177747, -116511, -39049, -56521, -55796, -108427, -124724, -85191, -27850, -3850, -41360, -61336, -48185, 12565, 93314, 34812, -44812, -36427, 22170, 4488, 23516, 100754, 153798, 151031, 84170, 57680, 25281, 46748, 77818, -17466, -71273, -125930, -94153, -81583, -215, 46674, 10049, -119851, -130046, -76224, -66513, -93003, -216565, -205143, -179781, -144136, -100400, -82383, -88497, 10, 10417, -7147, -78711, -114570, -73843, -3365, 27297, -23114, -35015, 86558, 50397, 44484, 75432, 50449, 9350, -38446, -2709, 62507, 73149, -6983, -60170, -169547, -175687, -119080, -81749, -58215, -86845, -162484, -158694, -70246, -3029, -127690, -152656, -109419, -160492, -150753, -74701, -16378]
14309a6378N4985J3806k6838P9840P9403M5369J5084k1807o2302P2303M0827q8702
14297A85590L4400j9500k2189k2561q0307p9116j18979m3425O2673M1750n5561
14286a17225k9153O5392o4274l6857K933M5772L835j221M0147K2346O0285k2417
14274c0437M4698M3541J0436L6788N7342n2969j62976q8381m7507J8937Q3623
14263h6905m4398j5723M8284N7934k3486N0514Q4890l7881o8052P1059O9044n6557
14251D8723J4809j6722n2575o7742R798j8979M8065k0059J05297L9126n8587q5489
14239e4335O5250L9530J2759k4480J2149Q0355N2368j5165n2342q441p3662j2369
14227B1617M0479l0683r2630M1922j9330M715p803K43l8775m7082j4672Q17K826
$$ y = [-16378, 38607, 52413, 25575, 105415, 184818, 230187, 245271, 223464, 161162, 233465, 274292, 185590, 219990, 200490, 178301, 155740, 75433, -3683, -122662, -166087, -103414, -61664, -117225, -146378, -80986, -145260, -182117, -179184, -133412, -129577, -130798, -90651, -68305, -8020, -30437, 14261, 57802, 68238, 105026, 162368, 109399, -53577, -141958, -189465, -170528, -86905, -131303, -147026, -98742, -40808, -64294, -13780, 71110, 33229, -34823, 36236, 105280, 48723, 63532, 46810, -5765, -73507, -63709, -82688, -34623, -54682, 50615, 89741, 31154, -54335, 10915, 50445, 63204, 38724, 50873, 131228, 183596, 168431, 116089, 107648, 33986, 21617, 62096, 31413, -61217, -19295, -38625, -33910, -41713, -41470, -80245, -127327, -141999, -141182, -138356]
14214a38356j5525Q5816J43469L8141m6993o494m7323l1444l038j6086Q7822O4397
14202A14386p4759l7944j6328r270m5827P0398O2655l5462N3816P4206m8652r4023
14190A3196l0684j7889N9137l383o6641m0178P644J30995J7909P991M4643o809
14178A15931m0944o5087k0578L055L9498o0412n5821L9423M0738n2772j0148j305
14166f8422j6928j9940J06787k2444r5695M4517J2310R8828K2937n7052n2622
14155d7724J7682M0035q691n2232J4599J51997K336n4738o2048l5304q813K9603
14143a3298O1944o0326l2670M8455P903K5259L6936l9952k8608p2649J9468J32165
14131H4627o1657m1080k5139O3267J34513O800j15101q8922r418N0796K4125L6841
$$ y = [-138356, -153881, -68065, 75404, 113545, 66552, 60058, 12735, -18709, -21747, -37833, 49989, 114386, 39627, 1683, -14645, -23915, -69742, 656, 63311, 27849, 81665, 155871, 107219, 13196, -17488, -35377, 23760, 20377, -46264, -86442, -78798, 52197, 70106, 78097, 122740, 115931, 74987, 9900, -10678, -7623, 31875, -28537, -84358, -44935, -4197, -56969, -67117, -68422, -85350, -105290, 1497, -20947, -116642, -72125, -59815, 39013, 61950, 4898, -47724, -30042, 9993, 1302, -50930, -36331, 115666, 118002, 63264, 1216, -34088, -42901, -13298, 48646, -11680, -44350, 4105, 12008, 37267, 74203, 34251, 5643, -67006, -47538, 84627, 22970, -18110, -43249, 20018, 154531, 161331, 46230, -42692, -52110, -1314, 22811, 59652]
14119E9652L0130l489L9675l1617p4513o9780l431j280m1772L5383Q8608J5814
14107D3380j29448P7168J709k2555P7047l2400n8815N657K1724k4836N6762P0210
14095H5603o9478n706M6508J8391j2306K6593K0612N6653Q019l1151l9520k4526
14083G9692m7376O7629j9454k0927k3278o6690J5097J8150l0577o908L5730p650
14071f562j0265J9023J4392r5974j36819L6088L4879R769P7284L0501n4626K1952
14059f0358R2576K8966j4514n9281L1958P8932M3193m8239J3602O824r6082j631
14047A5946k2947m6762J8953l9950J6951J5043q0788Q8427J05413q0563l440o0515
14035g4232k9369J5293J0800k1584j2179J0501N913N1217N4722m6457N6642J817
$$ y = [59652, 89782, 86293, 125968, 94351, 19838, -49942, -53373, -54653, -96425, -61042, 27566, 43380, -86068, -8900, -7191, -29746, 47301, 14901, -43914, -38257, -16533, -41369, 15393, 85603, 16125, 10419, 56927, 75318, 63012, 89605, 110217, 166870, 174889, 143738, 104218, 79692, 32316, 99945, 80491, 59564, 36286, -30404, -15307, 2843, -27734, -34642, 1088, -6562, -16827, 2196, 16588, -79386, -216205, -180117, -145238, -135469, -58185, -27684, -82310, -60358, 32218, 61184, 46670, -12611, 19347, 98279, 141472, 93233, 106835, 113659, 17577, 15946, -7001, -53763, -34810, -74760, -57809, -42766, -123554, -35127, 70286, -10277, -13717, -74232, -103601, -88308, -77508, -99092, -111271, -100770, -94857, -43640, 11082, -35375, 21267, 23084]
14023B3084M4358K7382j04091m2231K853j2158L730j581j8833M0011O1610m5196
14011b1062j1004M7381K7856p6083J8992m3218o7896M8240J01711L5003R547K641
13999G2108L4844J4269l8468n0168n0662j95274M9999R0750l6668R2K1473M020
13987h3685J2685M4724L2856N831m818l1937J4557k2113j6056O9151O5732n7590
13975B9337r3928L271J5554n4425N8160L7419K8133k7158l6511J5351P283o3160
13963h0674l2003R3401l7312L6936L4257j9137J7504M2819n9742m3539P8182N4789
13951H5481k9920j940P1072j4625j4041P432l3480J2596k5140q978N1694m4888
13939E5263n2756r335P775j8409j1494K0026R4114J2773j3483m0442J1234j7503
$$ y = [23084, 67442, 94824, -9267, -51498, -48645, -60803, -57073, -58654, -77487, -37476, 24134, -21062, -32066, 15315, 43171, -32912, -13920, -57138, -125034, -76794, 24917, 59920, 69467, 72108, 106952, 121221, 82753, 32585, -18077, -213351, -163352, -72602, -109270, -109178, -87705, -83685, -71000, -26276, 6580, 12411, 7593, -24344, -9787, -31900, -47956, 21195, 86927, 29337, -64591, -61320, -45766, -100191, -42031, -4612, 23521, -3637, -40148, -24797, -17514, -80674, -112677, -19276, -56588, -19652, 14605, -4532, 12972, 55791, -3951, -47490, 30692, 85481, 55561, 53621, 124693, 110068, 96027, 103459, 69979, 82575, 57435, 48457, 100151, 55263, 2507, -6828, 947, -17462, -28956, -8930, 85184, 97957, 84474, 44032, 55266, 37763]
13927C7763l7430j8685M5469k5443j0140k7187Q7653K7931n9973j12641l944R963
13915h6664O8326M3064J1160j17091L5610J08040O7718l9136l7366j2429j46680
13904a05448k0672J48695j8440M232J3053m3959k5657P6957P6334q9066j2928
13893C101k676m1139l2146K5785J19612j5833p0768p2814k2333K4219N5876Q1831
13881E2715K8077q3268j14416l7480m474J01395L7133K0933j9986o0182N7137
13870b2416O9480Q8432j8338m8508K4510P9032n7780j12929l4311n0774l9260
13859a22862j972P2807K603N5570l264p1439n8395O0333m307L1428J3254q2657
13847a08901L1493J51831n4276p7456J7564L5835j3140o3281O211L3955J3401
$$ y = [37763, 333, -18352, 27117, 1674, -8466, -35653, 52000, 79931, 19958, -92683, -96627, -86664, -18338, 24726, 35886, -81205, -45595, 62445, 130163, 91027, 53661, 41232, -105448, -126120, 22575, 4135, 8367, 21420, -22539, -48196, 28761, 105095, 16029, 3101, 425, -40714, -72860, -47075, 72537, 56704, -14064, -86878, -109211, -84992, -29116, 52715, 80792, -2476, -116892, -154372, -158846, -57451, -20318, 615, -19371, -79553, -22416, 47064, 135496, 117158, 68650, 93160, 172192, 114412, 1483, -32828, -83602, -122862, -124834, -52027, -49424, 6146, 2882, -68557, -126952, -66619, -70926, -39498, -26244, -108901, -77408, 74423, 20147, -57309, -39745, -3910, -17050, -80331, -74120, -40165, -26764]
13836b6764N6283R632n4557n3054P2989L1135l4171k9968R7306L0464N805N6854
13824A61954p6686j01948m6363K3124L3220J23505m2160p9653L0967j6330r0549
13813h0919N1677L7877L3373j9408J317M6926M7481j8944j07454o9353N2851R2718
13801F8142J4208m5596l6655l6618j2544O3017K6441M3077L837j36316j22833
13790a71840P7897J9645l7486k2711Q988J05278j9489n6192L0365O8526L5725
13779C8706j507J6821q4659j1041p8085Q7595J405j7192j0806O4985j9061j7308
13767c0147M0277j6552l9635o1990m0856O291R8970J9138J196J8080Q0303P1741
13755A46816M47q0295M5942l3605o9827k5211j6519L6985R2395l208n909j7694
$$ y = [-26764, 29519, 39151, -15406, -68460, 4529, 35664, 1493, -28475, 68831, 99295, 105100, 161954, 85268, -16680, -63043, -39919, -6699, 116806, 74646, -5007, 25960, 9630, -80919, -29242, 8635, 42008, 22600, 23917, 70843, 118324, 99380, -8074, -77427, -24576, 68142, 82350, 36754, 99, -36519, -49063, 13954, 40395, 83472, 87309, -49007, -171840, -93943, -74298, -111784, -134495, -125507, -20229, -39718, -95910, -65545, 2981, 38706, 37199, 54020, -30639, -41680, -119765, -32170, -30765, -47957, -58763, 6222, -12839, -30147, 10130, -6422, -46057, -108047, -148903, -142612, -43642, -24504, -23308, -5228, 75075, 146816, 147263, 66968, 112910, 79305, 9478, -15733, -32252, 4733, 97128, 93920, 88011, 70317]
13743G0317L8525k3258L188n4287l2950R5403J0071j9665n8382J3970n8820P027
13731h861M7293j40k8519o9998m0269o15L1139p364j3550L4260N0421P3012j0873
13718E5936p8146j0973P0597J7521j3860Q602k151P5540j453k4860M7027k7950
13706A15830M209j7393j23046o1647L6904L6332J2208Q4015q2359j13027O3234
13695d4740O352L1018q2986l55k2019O3262L2498r172q6680p6847N9862l3070
13683a62877J6054K4237L1070N2735J45556O6909m8926M3483K3175j03894j4026
13672G3496O8546Q25l9674r6856j03686r81K3677n2686l142Q6262M5501K2911
13660B4193M5338n7647j38812j8557O7775R3284j6747N7470O3503j7406K7567
$$ y = [70317, 108842, 85584, 88772, 34485, 1535, 96938, 107009, 87344, 28962, 42932, -15888, -8861, 38432, 38292, 9773, -60225, -100494, -101109, -69970, -77334, -90884, -56624, -6203, 66809, 55936, -22210, -33183, 37414, 54935, 41075, 49677, 47526, 123066, 121613, 96753, 143780, 115830, 120039, 102646, -20400, -82047, -45143, -8811, 3397, 87412, 5053, -107974, -44740, -38388, -7370, -90356, -90711, -112730, -49468, -16970, -26142, -112822, -189669, -129807, -162877, -146823, -122586, -91516, -38781, 106775, 173684, 124758, 168241, 191416, 87522, 73496, 142042, 142867, 103193, 6337, -97349, -98330, -74653, -127339, -130481, -44219, 1282, 24193, 69531, 11884, -126928, -145485, -77710, 15574, -1173, 56297, 119800, 102394, 129961]
13649A29961p02l0559o6829o9463P7476J2312q6938K5721l8997l0995L8686N0432
13637A0105L0639J5729L7415r76q975M3198r2409K1965R7361M6335K551p5290
13625A27648J1961m1623m4037n2698o2070m4086N1330M4869R8633m6322j7636
13614B5969M1678q305j04686M5502K1806J8114P0617J0233o7141n3254l9150M9065
13602A0448O6143p6969r2621m0346J20792q872Q5821l2129j14816R0009K03505
13591B10965p5023n0288o875l8657L7065L1358k2926K2630P6278m0362j02794
13580D1371j8607l726J5545q5046p9090J02150J93568n7994j20305j7334K9752
13569B84J9346O4705L279J8836J1929k2853M0333p6601k3224r092o728j4699P0584
$$ y = [129961, 129259, 98700, 31871, -37592, 39884, 52196, -34742, -9021, -48018, -79013, -40327, 10105, 40744, 56473, 93888, 92912, 83937, 127135, 34726, 56691, 154052, 200387, 202938, 127648, 139609, 97986, 53949, 1251, -60819, -104905, -53575, -8706, 89927, 43605, 25969, 67647, 59342, -45344, 158, 21964, 40078, 110695, 120928, 53787, 533, -38617, 10448, 76591, -378, -92999, -133345, -12553, -21425, 64396, 32267, -82549, 7460, 210965, 135942, 85654, 78779, 40122, 77187, 108545, 85619, 108249, 184527, 144165, 41371, 22764, 19038, 34583, -50463, -129553, -27403, 166165, 108171, -12134, -29468, 284, 19630, 84335, 87614, 106450, 118379, 95526, 135859, 59258, 36034, 26942, 20214, 5515, 76099]
13556G6099o9188L7711O9068P8334K4366j01516M601L4028Q6613L1646q7185m2637
13544A41940m1826K9653Q1020l9047j25117L2651j7242q5773O6379n0458K1185
13533A3365M4385O7491R7107J06748N6186n2650j16254m2958K9326L4308p2008
13522A65046p0215o5051p416O8788M72L8730N3949q2265j2265N183k9857J1962
13510G7061j3864j5448R0522n7821j45689k7358K5045K4917R2191r947p0793l6126
13498f7310O243J9461P1976R705o1897L2506O2399p291m6237L723K6185M8718
13486I8181p7593j28827M6399J8596J18456P2153J9151K514M0661l5055K9266
13475B03902L9556M5221q9523j23108J3730m0336O5199j3667R3263K4111K8195
$$ y = [76099, 6911, 44622, 113690, 192024, 216390, 114874, 119475, 153503, 240116, 271762, 184577, 141940, 100114, 129767, 210787, 171740, 46623, 79274, 62032, -23741, 42638, -7820, 13365, 57750, 125241, 222348, 329096, 385282, 332632, 216378, 173420, 202746, 237054, 165046, 94831, 29780, 22364, 91152, 91624, 130354, 184303, 102038, 89773, 94956, 65099, 77061, 63197, 47749, 138271, 80450, -65239, -92597, -67552, -42635, 49556, 39609, -31184, -67310, -61067, -41606, 30370, 40075, -21822, 10684, 73083, 65792, 19555, 23278, 49463, 98181, 20588, -108239, -61840, -43244, 75212, 147365, 166516, 169030, 209691, 174636, 203902, 243458, 288679, 199156, 76048, 89778, 49442, 114641, 100974, 194237, 218348, 246543]
13464B46543k4636K1204J29806R2476J92757J24772J0960q982k5367L4826L8546
13453H32905o4504k6635j39394n1726l2460M384l8579n1541o4630q6210m9645
13442B31965P4938M54m6722k9378O1158L767L0796j1207L5141L1374N6082n1104
13430C87264M1764O5440Q1891J70891J09061P329L8447K5058K773q923q5676o2395
13418G72924N9949P840j42602j23779j48517m9701m3659k1377q75N0189q4215
13407B76177l1004k4399Q185N6833j3806k4656o6449O8517K7365j20289r1145
13396F5329L2235o5652j1658P5506M6985n3324L9182Q2978L0334n8022q0335K8777
13384A32335Q8566o996j21844M3101N1798k2884L6085K6651L7784n6848M171K5494
$$ y = [246543, 221907, 243111, 372917, 465393, 658150, 782922, 793882, 784900, 759533, 794359, 832905, 768401, 741766, 602372, 550646, 518186, 522570, 483991, 432450, 367820, 281610, 231965, 306903, 307357, 260635, 231257, 292415, 296182, 326978, 315771, 350912, 382286, 438368, 387264, 429028, 494468, 576359, 747250, 856311, 863640, 902087, 927145, 929918, 920995, 835319, 772924, 832873, 840713, 698111, 574332, 425815, 376114, 332455, 311078, 310203, 360392, 276177, 245173, 220774, 228959, 285792, 271986, 247330, 180881, 249398, 276763, 156474, 65329, 97564, 31912, 20254, 95760, 142745, 89421, 128603, 211581, 241915, 183893, 103558, 132335, 220901, 213905, 92061, 135162, 186960, 164076, 200161, 226812, 264596, 207748, 211919, 237413]
13372B37413M4766L2125m2361j0725r8748m0355N5847N4846r3455j124N0533j6440
13360A72322m5203P7217M9083l7138j15164o3973n5662K5214L5974R9339k3279
13349A18730p5152p8232r342n8072k1943R2512L5484l7604P1104j10789q5846
13338a59150J55387K15169j2791j16448n3899p2522M7322M5770l9424P402J23716
13327A40532K2144j07123J2012l2947j5547l3643O3491l2881J14905N785j58192
13316b1464n7847L4687J54362O9234j33530K354N1178J7150l6091J3105R1374
13305A84512j4873o6362l7240L0708N1965n5371p0426J986J0012N3332M448K6585
13293A19276O228o3008o2954Q300M599L4317K3423J2502j02338o9894k4794Q4784
$$ y = [237413, 282179, 314304, 271943, 261218, 162470, 122115, 177962, 232808, 139353, 138229, 188762, 172322, 127119, 204336, 253419, 216281, 101117, 37144, -18518, 6696, 42670, 142009, 118730, 43578, -34654, -43996, -102068, -124011, -31499, 3985, -33619, 37485, -73304, -159150, -3763, 211406, 198615, 82167, 28268, -44254, 3068, 48838, 9414, 16816, 140532, 162676, 55553, 67565, 34618, 19071, -14572, 48919, 16038, 130943, 136728, -21464, -79311, -44624, 109738, 178972, 45442, 47796, 98974, 116124, 80033, 93138, 184512, 169639, 103277, 66037, 96745, 148710, 93339, 22913, 24899, 34911, 88243, 92691, 119276, 125504, 62496, -458, 7842, 12441, 46758, 70181, 82683, -19655, -89549, -114343, -29559]
13281b9559M7786k3379p4703M6716L9492J1914O5965P1966M1187J2197M6914p7819
13269A78677p1466r9286K2846L7557K0761p5075m7976Q3221L3274K000p6688p7958
13257g0113R3917O1562O4129K0313p5655r7457q9416k0371L0006P7753J68524
13246A63192l716j46625M913P0994K9791m2681n4326L578Q9911K7396n4968J5158
13234A02617L5021L1113j03033r486J21019Q911j22543j24312K2141K471M9641
13223A3560M3280k0251m3575M2915m0487m5194k824L5099J5850L6810K2961M6480
13211A04624p0427K0983M8008N141k8968k0516M6727Q0530O145q9397n6617P553
13199E3786M641j8592l4989o4585K8390o016J6149P2485j0810n194N266j7816
$$ y = [-29559, 18227, -5152, -79855, -33139, 6353, 18267, 84232, 156198, 197385, 209582, 256496, 178677, 107211, 7925, 30771, 68328, 89089, 14014, -33962, 49259, 82533, 84533, 7845, -70113, 23804, 85366, 149495, 169808, 94153, -3304, -92720, -113091, -83085, -5332, 163192, 159476, 12851, 17764, 88758, 118549, 75868, 21542, 25120, 115031, 142427, 87459, 102617, 137638, 168751, 65718, 56232, 177251, 186162, 63619, -60693, -38552, -36081, 13560, 56840, 36589, -6986, 35929, -4558, -49752, -52576, -17477, -1627, 35183, 58144, 104624, 34197, 55180, 103188, 108329, 79361, 58845, 105572, 186102, 192247, 102850, 46233, 53786, 58427, 39835, 4846, -59739, -31349, -37365, -21216, 51269, 40459, 35265, 40531, 22715]
13187B2715m0352L0937k6644m7721j033k6020O0803M1158Q892k0304n8506m9293
13175a05368M0828J74674R8415m8778n6476m5777q6168L0353P9525N6540k054
13164A35714L1242o1781p5580j7224N1538j4340j04997o602J00741m1047o2679
13153f5015J7217k1021m6852J6699m6303M9465J04826K3191j3512p9150J013N1195
13141h247M4514k746o2320K1564K3371j3589m7235N2270K2307k7872n59N4524
13129E5982M9972O070N2946l9492j48172M2212K8523p126k5849N8121J4233r7471
13117a0051l4634K1412J37145P709L2825j1933n6448n6976m3705q1334k1498N0443
13105f7045L0037L9833j4303M8905k0026K1244K5431k562M7434l5497o5362Q7013
$$ y = [22715, -17637, 13300, -13344, -61065, -62098, -88118, -27315, 13843, 22735, 2431, -56075, -105368, -64540, 110134, 208549, 159771, 103295, 57518, -28650, 1703, 81228, 137768, 135714, 166956, 105175, 29595, 12371, 63909, 49569, -55428, -62030, 38711, -2336, -65015, -47798, -68819, -115671, -98972, -145275, -95810, 9016, 32207, 18695, -60455, -59442, -8247, 36267, 33521, -28799, -7235, 16136, 2547, -44688, 7582, 29889, 2017, 1458, 55982, 105954, 112024, 164970, 125478, -22694, 19518, 48041, 40915, 15066, 73187, 87420, -10051, -44685, -23273, 113872, 121581, 154406, 142473, 86025, 29049, -14656, -95990, -117488, -67045, -37008, 2825, -11478, 37427, 17401, 38645, 64076, 61514, 108948, 73451, 8089, 95102]
13093I5102J3024N7202J8393o3601j16769O2640l2397J3248L0571m8171J6513
13082D5755L034k0048R118J8136l2452m9768R2508J9566m984n4213k6087N00O3658
13069F4723Q4643J2871o766q286L0304R1327J4247L2563o3095j36215m9097J06767
13057A73986L7195r3347n2772P627M0420m0485p5427j3829P6003r0837k2679K5660
13045b8485K9671Q439J01583N3906o1611J16089Q6188j44286j69830l2764J6825
13034b4275J1924P6385R990j23185q7864K2368N4019N8190j02381L8325N2646
13023a3858J9352Q5291k8263n9043K4824l3752P8742L7524j16615j8934M4669
13012A9937K7004M824M4330Q3649P8744n0245r2048k072M8814M7846p3074l5471
$$ y = [95102, 108126, 165328, 183721, 120120, 3351, 65991, 33594, 46842, 77413, 29242, 45755, 48789, 28741, 37859, 55995, 23543, -26225, 66283, 85849, 80865, 26652, 565, 1065, 64723, 149366, 162237, 155471, 147185, 177489, 268816, 283063, 315626, 252531, 116316, 67219, 173986, 211181, 117834, 65062, 72689, 113109, 72624, -2803, -16632, 59371, -31466, -54145, -28485, 1186, 9625, 111208, 165114, 103503, 219592, 305780, 161494, -8336, -41100, -24275, -12351, 64034, 74024, -49161, -137025, -114657, -60638, -2448, -104829, -66504, -13858, 5494, 90785, 62522, 3479, 28303, -5449, 73293, 110817, -5798, -24732, 19937, 46941, 51765, 96095, 179744, 258488, 208243, 116195, 114123, 162937, 210783, 137709, 102238]
13000A02238K5001m2764L3630J4453O3284L9489l157M926P9474J3852n2004k0007
12988B58415q2587K9331P7900n3607P3419J29799M4802R5908R0988L05775K66650
12977A236793K41172K32417K49150J71951M8982J4017q5580l9200k7705j71320
12967A870677l09579k52976k55595j25404k39357l8895J4179m5746m6709j9278
12957E51317j6813J9837j7013r672m8345o7005N2472O8392j9775j07289n4927
12946C51179o7084K8031L0791Q7350K1580J3151J0851m3591j7889j0284j5612
12935C88473n4527p354M8735j0223J1875j3189o3318o0584L601L0292k396o0458
12923B10927n7843K2263M6527M3809l953L7954k3081n2746m8978q7327L7758N1617
$$ y = [102238, 127239, 84475, 118105, 132558, 195842, 235331, 232174, 237100, 316574, 330426, 278422, 258415, 175828, 205159, 283059, 229452, 302871, 432670, 477472, 573380, 664368, 970143, 1236793, 1477965, 1710382, 1959532, 2131483, 2180465, 2194482, 2108902, 2069702, 2041997, 1870677, 1561098, 1308122, 1052527, 927123, 687766, 648871, 663050, 617304, 570595, 551317, 534504, 554341, 537328, 527656, 479311, 412306, 464778, 533170, 513395, 406106, 351179, 284095, 312126, 342917, 430267, 451847, 464998, 475849, 432258, 414369, 404085, 388473, 333946, 326592, 375327, 365104, 376979, 363790, 300472, 239888, 243489, 273781, 271385, 210927, 153084, 175347, 221874, 265683, 261730, 299684, 276603, 223857, 174879, 87552, 125310, 176927]
12911A76927R3089J3807j04746o2636M9588J35960n3703j19746m4108N447N0103
12900A39982q521j02331j2499M4428L0562k9877J4464J5742J08152K9186j03732
12889A25556r4727o146L0351K2351L6484O5421j6905j08797K099J16626o7611
12878A04702K0837r781R9447J0211n0195J642n0510L1995Q1433O2433j20585m2560
12866A39069J302J4199L4737m5267n1576M960o8905o2536Q9194q626J9078N7193
12854A22822O1297L9683K4161o6356p6510k6393q5043j14837j1265P5099J20981
12843F3639o540P018R3950j4143j1094O540n2635M3705J2524m5468o1073m4221
12831g798k275N2166P5668k7936N5369L235o9000J404j2938n6225P946M9176k6931
$$ y = [176927, 270016, 283823, 179077, 116441, 166029, 301989, 248286, 128540, 84432, 89879, 139982, 131461, 29130, 16631, 61059, 91621, 61744, 76208, 91950, 200102, 229288, 125556, 30829, 24683, 55034, 77385, 113869, 179290, 162385, 53588, 55687, 172313, 104702, 125539, 115758, 215205, 225416, 175221, 176863, 126353, 158348, 239781, 302214, 181629, 139069, 140371, 154570, 189307, 144040, 92464, 97424, 28519, -34017, 55177, 46551, 65629, 122822, 184119, 223802, 247963, 181607, 105097, 78704, -6339, -121176, -132441, -57342, 63639, 57099, 64117, 158067, 143924, 132830, 139370, 86735, 130440, 142964, 97496, 36423, -7798, -10073, 42093, 117761, 89825, 145194, 148429, 79429, 80833, 67895, 11670, 19616, 68792, 41861]
12818D1861M7535J66811R0414J76532K02135M9104J8792L7890j5767J07903M4121
12807I67331J00872M42L6072Q83l9894j0051n1318L6309J8769m8402l3204j12624
12795H65185r7730j47415N1672k4093p1493J8926J3149k9342k7679k1850k2424
12784E06906m6976l3729Q423l9816k1492q007n3873J2188m032M7585k7242J622
12772C41557K3775j1456N4664J0333k7153J6172J21864L9210K952m4626j05632
12761D21660m2368J3068K5564M8182L8690M2420j5958J00683M2407q7752j01734
12750D84862K7719l1942j4787q7054j71464j3707N4167N6004l824j013L4558J00615
12738D34134P428r555l5413P8214J5438j16188m6872K1808r2766p6440Q9205K492
$$ y = [41861, 89396, 256207, 346621, 523153, 725288, 774392, 793184, 831074, 815307, 923210, 967331, 1068203, 1068645, 1104717, 1105600, 1065706, 1055655, 1004337, 1040646, 1059415, 1011013, 977809, 865185, 767455, 620040, 671712, 647619, 576126, 595052, 608201, 578859, 551180, 529330, 506906, 459930, 426201, 434624, 394808, 373316, 365309, 311436, 323624, 319592, 367177, 339935, 341557, 365332, 353876, 408540, 418873, 391720, 407892, 529756, 568966, 571918, 527292, 421660, 379292, 392360, 417924, 466106, 504796, 547216, 531258, 631941, 674348, 586596, 484862, 512581, 480639, 465852, 378798, 207334, 193627, 247794, 303798, 299974, 298961, 333519, 434134, 441562, 432007, 396594, 474808, 490246, 374058, 327186, 348994, 256228, 179788, 268993, 271485]
12726B71485o4578N1223K05696J07943Q5707n3321o1278o4877j4054L7123k473
12715D98596P7111P9830J0531R3237R2148p3257q1577o1316M9537k6715k192J6121
12703F72054K6360K6303K03l0438m4970K9709O4266k5541K2385M0517O208n1963
12691G35093l3267q643O8440n7218o7820P5568J10007m9198M4122N2095M1768
12680I10947l0954l5728M6373M1600o1974j1017m4266l9618k6854M4230p2699
12669G20040j8074j6767K6981m798j5799P39P3648O5287J39405R2703o4068j2178
12657I87119k3280l9133l4240l0117M4676P3006k8437L9055L7202J5773J61054
12646A202678J78709j8714m8809L3550J12400J03136J63614P2157J10046J18688
$$ y = [271485, 206907, 258130, 463826, 571769, 657476, 604155, 542877, 478000, 463946, 501069, 498596, 575707, 655537, 666068, 759305, 851453, 778196, 696619, 635303, 684840, 658125, 655933, 672054, 698414, 724717, 724920, 694482, 649512, 679221, 743487, 717946, 740331, 780848, 787056, 735093, 701826, 693183, 761623, 704405, 636585, 712153, 822160, 772962, 817084, 869179, 910947, 879993, 844265, 890638, 932238, 870264, 859247, 814981, 775363, 748509, 792739, 720040, 701966, 685199, 712180, 707382, 691583, 692322, 765970, 831257, 970662, 1063365, 999297, 987119, 963839, 924706, 890466, 860349, 905025, 978031, 949594, 988649, 1025851, 1041624, 1202678, 1381387, 1362673, 1313864, 1347414, 1459814, 1562950, 1726564, 1798721, 1908767, 2027455]
12636B027455R5154N4223R2117M9699P6114J3341Q5915R7918N6133J14006J6260
12625B778335j34772k3510J46055J42094J97672O3862p248K5911R9413L7082n8110
12614C266784j6259J31204R5917J04120J10408j5095o0074R5495J94615J94423
12604D101538J18514R2897R4917J00241J72226R3699M6372J41228J02373R2547
12594E156552J21256P9956j4281M2983Q0244P7749R8149J51686J61565K49837
12584F205696K19187L45968L98966K87297L05560N47161N41184N80109N67262
12575I998390P58553J008420J165675J323752J506880J902303K228487K463432
12567B2355892K958243L490960M049206M892674O000983P640313J0024080J3075534
$$ y = [2027455, 2122609, 2176832, 2268949, 2318648, 2394762, 2408103, 2494018, 2591936, 2648069, 2762075, 2778335, 2643563, 2620053, 2766108, 2908202, 3105874, 3169736, 3162488, 3188399, 3287812, 3324894, 3266784, 3250525, 3381729, 3477646, 3581766, 3692174, 3677079, 3617005, 3712500, 3907115, 4101538, 4220052, 4312949, 4407866, 4508107, 4680333, 4774032, 4820404, 4961632, 5064005, 5156552, 5277808, 5357764, 5343483, 5386466, 5466710, 5544459, 5642608, 5794294, 5955859, 6205696, 6424883, 6770851, 7169817, 7457114, 7762674, 8309835, 8851019, 9431128, 9998390, 10756943, 11765363, 12931038, 14254790, 15761670, 17663973, 19892460, 22355892, 25314135, 28805095, 32854301, 37746975, 43747958, 51388271, 61412351, 74487885]
12559G4487885J7118821K2275842K8603482L5589879M1722224M5139217M4512007
12552C09449357M0014892L1587885J9078680L402267j2549133k5704307l4472599
12545C30807042l8857997l9436111l6665859l0967614k4293951j8259214j3632643
12538A28693653j0352794q202746o730496n673357n072586m525989m092949l647844
12530H0394892l249720k900906k664621k165444j779092j357307j012762q33890
12522F4431150p62980n25247m86138l46174n61477q41784j059249j270673j513893
12513E7063535j720657j886668k032168k219898k337689k305217k255218k257860
12505D0048160k200764k187815k016920j866994j742093j613584j517922j447700
$$ y = [74487885, 91606706, 113882548, 142486030, 178075909, 219798133, 264937350, 309449357, 349464249, 381052134, 400130814, 403533081, 390983948, 365279641, 330807042, 291949045, 252512934, 215847075, 184879461, 160585510, 142326296, 128693653, 118340859, 110138113, 103407617, 97734260, 92661674, 88135685, 84042736, 80394892, 77145172, 74244266, 71579645, 69414201, 67635109, 66277802, 65265040, 64431150, 63668170, 63142923, 62656785, 62310611, 61749134, 60907350, 59848101, 58577428, 57063535, 55342878, 53456210, 51424042, 49204144, 46866455, 44561238, 42306020, 40048160, 37847396, 35659581, 33642661, 31775667, 30033574, 28419990, 26902068, 25454368]
12497B5454368j378976j322596j247731j103119j067011r90274q85395r17868
12489A6541398q89149q13773p69167o38769o16979o05518o06332o21733o49452
12480A0330526m71598l55379l91774l44628l37063m04883m11471l68819l63746
12471F881165k69356l32759k30579k30697j65684l2496p0847n5820k2517k70471
12461E199939l50127l30425l42174k08759j41159m2723r6794j32895r1451j37822
12451C325610q6636m4927j6811m7380q6149n0604j49660k6854k615l0242o411
12440B777321Q3674q8223j21537k689J6054j4425J82849J62061J32941K12542
12430C340568K87102K58491K63029K07733M5135l2387j25886k80553l36232k82953
$$ y = [25454368, 24075392, 22752796, 21505065, 20401946, 19334935, 18344661, 17459266, 16541398, 15652249, 14838476, 14069309, 13430540, 12813561, 12208043, 11601711, 10979978, 10330526, 9858928, 9503549, 9111775, 8767147, 8430084, 8025201, 7613730, 7244911, 6881165, 6611809, 6279050, 6048471, 5817774, 5652090, 5619594, 5548747, 5492927, 5470410, 5199939, 4849812, 4519387, 4177213, 3968454, 3827295, 3784572, 3687778, 3554883, 3463432, 3325610, 3238974, 3194047, 3177236, 3129856, 3043707, 2993103, 2843443, 2816589, 2813974, 2783732, 2777321, 2860995, 2772772, 2651235, 2648546, 2664600, 2650175, 2833024, 2995085, 3128026, 3340568, 3627670, 3886161, 4149190, 4356923, 4402058, 4369671, 4243785, 3963232, 3627000, 3344047]
12420C344047j67918j33622k63322j53378n7232J0515j9471r1779j33177l5102
12410B299561r4170r5165l1922l0208J2468N559j8212K8286m2793j8239o4883
12399A950282j10364l0901Q4304N2001K7049Q0443J31629J30146R1587J06454
12389B512630P3928p2515j62835k16369r1233O0812L6445l7313o4289j7978J7564
12378B038847r8706m7686j0249K8444P967L3144O0371k2920J9155n8186M7301
12367A997482m6035o9435m386j03135m8301j4024P868l4000R4763m0513j26443
12356A613841n9317J0204j5755p659M0985j5597k3057j03970j07148p9270o6298
12345A186959L1701P7133l474j9506p4170J4918n072q6436p9758P1223l123j11140
$$ y = [3344047, 3176129, 3042507, 2779185, 2625807, 2568575, 2579090, 2559619, 2467840, 2334663, 2299561, 2205391, 2110226, 2078304, 2048096, 2060564, 2066123, 2047911, 2076197, 2033404, 2015165, 1950282, 1839918, 1809017, 1893321, 1945322, 1972371, 2052814, 2184443, 2314589, 2406176, 2512630, 2586558, 2514043, 2351208, 2134839, 2043606, 2104418, 2140863, 2103550, 2039261, 2021283, 2038847, 1940141, 1892455, 1882206, 1910650, 1918617, 1951761, 2012132, 1989212, 2008367, 1950181, 1997482, 1951447, 1882012, 1877626, 1774491, 1726190, 1712166, 1720034, 1686034, 1780797, 1740284, 1613841, 1554524, 1564728, 1548973, 1541314, 1582299, 1566702, 1543645, 1439675, 1332527, 1253257, 1186959, 1218660, 1295793, 1292319, 1272813, 1198643, 1213561, 1208489, 1122053, 1042295, 1113518, 1110395, 999255]
12333I99255j15796m3049l4062p8993l3884O6856J11185L8061k2122j61204m9120
12322F77127L7063N8080N0873k7393r6347j02241N2233m9675P6041k4081j59080
12311D92600j9599L9077q338j1781J913J6354M9306k0115k8028J18934J53756
12300G84079r702J4723j00562j42572j26296J5477p544J55m1693p1081j1702p8834
12288B24448l4690P713R0183J6277L9229J15191J56640O7731P4940J53525R4330
12277A005517O6807k4931o5419q3756q8756M211l7223q0685o8826M7089j3362
12266F60666l1626k2370Q173N4916N0026P4645m8203l6995J08259O8578m765p9588
12254H01716j19527k0087J17643N0650n031L2282L7605o4762K4768J74327J60387
$$ y = [999255, 883459, 840410, 806348, 727355, 693471, 760327, 871512, 909573, 887451, 726247, 677127, 714190, 772270, 823143, 795750, 699403, 597162, 649395, 599720, 675761, 651680, 492600, 473001, 512078, 503740, 491959, 493872, 510226, 559532, 539417, 511389, 630323, 784079, 774377, 789100, 688538, 545966, 419670, 435147, 427603, 427758, 386065, 314984, 303282, 224448, 189758, 197471, 287654, 303931, 343160, 458351, 614991, 682722, 757662, 911187, 1005517, 1072324, 1047393, 981974, 898218, 809462, 813673, 776450, 695765, 626939, 674028, 660666, 629040, 606670, 614843, 669759, 719785, 794430, 746227, 709232, 817491, 886069, 881304, 801716, 682189, 662102, 779745, 830395, 825364, 857646, 895251, 830489, 855257, 1029584, 1189971]
12243A189971R2232J1285K180J00082J38527J74927K26479K18012J11810L7613
12233B303118j16709k10425j60987p7666j55895j61819o8424Q5073m9670j5249
12223A371347k2830M6749N0894M4513j2920j42268q3345J621L3484K9186m5752
12212A270679l110l7677p7593p237o3482p5210l6173M7062L6337k3631n1649k4929
12200I53387K3619Q7597P0249k2220M9868J7346J08033J59955Q384p4467j28879
12189A252872o7768o2029j04716l5869o6317k8524m0661p8118n6205O7438O0225
12178H40328L8760K6048j12205j25980l4654j4189k614m3582k4979K6298M4575
12167F17806k2863L7390J393n8622n3900l7137p0367j1818O2449P8529K1341K102
$$ y = [1189971, 1282203, 1293488, 1295668, 1395750, 1534277, 1709204, 1935683, 2153695, 2265505, 2303118, 2186409, 1975984, 1814997, 1737331, 1581436, 1419617, 1351193, 1436266, 1386596, 1371347, 1348517, 1395266, 1446160, 1490673, 1477753, 1335485, 1252140, 1253761, 1287245, 1316431, 1270679, 1267569, 1229892, 1152299, 1145062, 1081580, 1006370, 970197, 1017259, 1053596, 1029965, 978316, 953387, 977006, 1064603, 1134852, 1112632, 1162500, 1179846, 1287879, 1447834, 1456218, 1381751, 1252872, 1185104, 1123075, 1018359, 982490, 916173, 887649, 846988, 768870, 712665, 780103, 840328, 879088, 905136, 792931, 666951, 632297, 618108, 615494, 571912, 546933, 573231, 617806, 594943, 632333, 633726, 575104, 521204, 484067, 413700, 401882, 464331, 542860, 564201, 566303]
12155E66303m9997o2460M2715P5549j4018j8599p4349o4555p3533J6726K1078
12144C64860J23030J5344k584n5330o3517R9435R2227k774j26174J5710N4762
12133E14989J5783R3054J39483L7801R9678J61318J98402K15599K49815K76998
12123B002920K21132J24390M8393J866k7431j58796l01647k65328j20010k17540
12113A307949k07789j41659j43397M158j2932n2164N0944N6975o4460m7585N3080
12102H03120Q9378o5559m8572L3365P7790J45956L6801j51687q4522O4296O4060
12091I64426l8130N7004M6994P2123m414r2539n3719n1783L4960K6604m8035j10195
12079H03296n5333m3067J21838P2200j5711l5093k4331P9590n769p1074l7341
$$ y = [566303, 516306, 453846, 496561, 572110, 558092, 539493, 465144, 400589, 327056, 343782, 364860, 487890, 503234, 500650, 445320, 381803, 481238, 573465, 570691, 444517, 460227, 514989, 530772, 623826, 763309, 801110, 900788, 1062106, 1260508, 1476107, 1725922, 2002920, 2224052, 2348442, 2396835, 2398701, 2371270, 2212474, 1910827, 1645499, 1525489, 1307949, 1100160, 958501, 815104, 819262, 806330, 754166, 805110, 862085, 797625, 750040, 803120, 892498, 826939, 778367, 811732, 889522, 1035478, 1072279, 920592, 836070, 900366, 964426, 926296, 983300, 1030294, 1102417, 1098003, 1005464, 951745, 899962, 934922, 961526, 913491, 803296, 747963, 704896, 826734, 898934, 883223, 848130, 823799, 903389, 897620, 826546, 789205]
12068G89205O8556J02486J7131N2473j1329k1779j75389k7151M9382q315M3762
12057H79032J37071J23145L6198N2262Q5029Q363P587j09893o6298q179k2171
12046A122146o207m8814Q0010P655j42283q8075j8883l447j8332L057o6044o9234
12034G51549j8227N0039m0759Q150N1887l9925N8159J02505Q683p358K2041k586
12022I44158n0991m8304Q638k8709L2266k2464m797K7450r265J2939N4911J862
12010I17694k8881Q4654O5049P5802P650J1506o4727j03708o8570N5739k9770
11999I22438l603N4461p3543O0748M5254q0856n7126j54292r89l6877l7695K7531
11987F65451O5491N6962q881N4415o6551J4129J10792J13632n3749o3018R4624
$$ y = [789205, 857761, 960247, 977378, 1029851, 1018522, 996743, 821354, 794203, 843585, 835270, 879032, 1016103, 1139248, 1175446, 1227708, 1312737, 1321100, 1328687, 1218794, 1152496, 1144317, 1122146, 1115939, 1067125, 1147135, 1154790, 1012507, 924432, 905549, 902102, 883770, 886827, 820783, 751549, 733322, 783361, 742602, 750752, 802639, 762714, 820873, 923378, 932061, 924703, 946744, 944158, 893167, 844863, 853501, 824792, 857058, 834594, 829797, 857247, 847982, 860921, 915832, 917694, 888813, 973467, 1038516, 1114318, 1121968, 1133474, 1068747, 965039, 896469, 952208, 922438, 918835, 973296, 899753, 960501, 1005755, 924899, 867773, 713481, 712492, 675615, 637920, 665451, 730942, 787904, 779023, 833438, 766887, 781016, 891808, 1005440, 951691, 888673, 983297]
11976I83297p399m6696j8162O5939P8870j0465L337P6384L3760j29309k9450q106
11964I92000M093N6120M3784n384J44319L539r541R266j17433K8777O2213N8173
11952A269926J22866j7953q475p4723n9793p2358Q0743J53091J53380R245k9433
11941A526516J1882P89Q2900Q2529K8073P6455k257N1899J65467Q4967N7831J8430
11929B185481J10200J10430K3475M7034M1021L8990j09724O4081J83905K60822
11919B955715K45800K12657K71895K34407Q7076J72096J16879L1567O9245k9968
11909D367369Q62j7253O6851J19677n3861n9710R0323N4609P8618K13474K18658
11898E079617J51444J37439K07463J09702P2422J44118j0805P5062n829j8461
$$ y = [983297, 975898, 929202, 911040, 976979, 1055849, 1045384, 1048721, 1125105, 1158865, 1029556, 1000106, 992000, 996093, 1052213, 1095997, 1090613, 1234932, 1238471, 1228930, 1238196, 1120763, 1149540, 1211753, 1269926, 1392792, 1374839, 1366364, 1291641, 1231848, 1159490, 1240233, 1393324, 1546704, 1555949, 1526516, 1538398, 1539187, 1622087, 1704616, 1732689, 1809144, 1806887, 1858786, 2024253, 2109220, 2167051, 2185481, 2295681, 2406111, 2429586, 2476620, 2517641, 2556631, 2446907, 2510988, 2694893, 2955715, 3201515, 3414172, 3686067, 3920474, 4007550, 4179646, 4296525, 4328092, 4397337, 4367369, 4368231, 4350978, 4417829, 4537506, 4483645, 4423935, 4514258, 4568867, 4647485, 4860959, 5079617, 5231061, 5368500, 5575963, 5685665, 5758087, 5902205, 5891400, 5966462, 5960633, 5942172]
11888E942172O9866J09557O7650J41048J56685Q8310K13129J65070M25722N18461
11878G897670N43381M67682M83188N17757N13654M89925N16139N31006N04496
11869A2464898N35442N60802P65196P74227R42229Q95061P54766P71871P57245
11860A9221737O35282N22359M91597O43580P79896R83428J233586J750597K160135
11851B8422197K652961L450932M508257N809217P365693Q988482J0893658J2464278
11843H4555675J3177226J2561098R809809M765589j439575o181899q609079q435991
11835A00202853o521865m180776k215322q86030K02728R34947J776514K689758
11827I2002807L222467L415710L036276K389954J726568J366515J585022J983283
$$ y = [5942172, 6012038, 6121595, 6189245, 6330293, 6486978, 6575288, 6788417, 6953487, 7379209, 7897670, 8441051, 8908733, 9391921, 9909678, 10423332, 10913257, 11429396, 11960402, 12464898, 13000340, 13561142, 14326338, 15100565, 16042794, 16937855, 17692621, 18464492, 19221737, 19857019, 20379378, 20870975, 21514555, 22294451, 23277879, 24511465, 26262062, 28422197, 31075158, 34526090, 39034347, 44843564, 52209257, 61197739, 72091397, 84555675, 97732901, 110293999, 120103808, 124869397, 123429822, 117247923, 108638844, 100202853, 93680988, 89500212, 87284890, 86398860, 86601588, 87536535, 89313049, 92002807, 95225274, 98640984, 101677260, 104067214, 105793782, 107160297, 108745319, 110728602]
11819A10728602K491066L114334L716795M078534L950128L167145K131619J147915
11811A34526138R22190J631832L154013N343288P683662J0445926J3750315J7481280
11803A94938644K1830700K6513987L0442518L0661820K4752859J2146033m271540
11796C37015021j8718294k6901542k7944661k4270159j8953593j4114843j0286706
11789A95825223p294448m961960k994539j395692n83294m82719j535289k939354
11781A73637928m101281m553049m155644l365400k459812j722477j242281r81718
11773A51056266j108387j717425k461000k900711k784941k091007j255442j58257
11765A36579096Q19942J932972L088566M441035O020152P791733Q968298Q550280
$$ y = [110728602, 113219668, 116334002, 120050797, 124129331, 128079459, 131246604, 133378223, 134526138, 135448328, 137080160, 140234173, 145577461, 153261123, 163707049, 177457364, 194938644, 216769344, 243283331, 273725849, 304387669, 329140528, 341286561, 337015021, 318296727, 291395185, 263450524, 239180365, 220226772, 206111929, 195825223, 188530775, 183568815, 180574276, 179178584, 178595290, 178112571, 176577282, 173637928, 169536647, 164983598, 160827954, 157462554, 155002742, 153280265, 152037984, 151056266, 149947879, 148230454, 145769454, 142868743, 140083802, 137992795, 136737353, 136579096, 137399038, 139332010, 142420576, 146861611, 152881763, 160673496, 169641794, 178192074]
11757A78192074N552043j25750o871301j2330531j5062947j5064692j3345307
11750A20943589j1060539q882623p100763n666005m601333l818121l380929l100834
11742G3332442k667705k272712k027527j922456j922947j877417j846710j908881
11734E6886087j804210j783192j946215j938662j857275j702393j492271j299279
11726D3062590j089075j217980j429539j388488j491949j519259j600015j558763
11718C1767522j453420j377947j350893j294885j166472j141703j095431j064132
11710B1822639r40449r31379p79231p20986n86869n52287n98057m59144n13911
11701A5740326m61417n32495n06340n05670m83027n86404n11429m55937n16616
$$ y = [178192074, 183744117, 183618367, 176747066, 164416535, 149353588, 134288896, 120943589, 109883050, 101000427, 93899664, 88233659, 83632326, 79814205, 76433276, 73332442, 70664737, 68392025, 66364498, 64442042, 62519095, 60641678, 58794968, 56886087, 55081877, 53298685, 51352470, 49413808, 47556533, 45854140, 44361869, 43062590, 41973515, 40755535, 39325996, 37937508, 36445559, 34926300, 33326285, 31767522, 30314102, 28936155, 27585262, 26290377, 25123905, 23982202, 22886771, 21822639, 20882190, 19950811, 19171580, 18450594, 17863725, 17311438, 16713381, 16254237, 15740326, 15278909, 14746414, 14240074, 13734404, 13251377, 12664973, 12153544, 11697607, 11180991]
11692A1180991m22830l28064k94374k27572k22841k17134j36790j90797k15004
11683H925585k59275k83262k83305l02374l18873l03353l65406l92270l30147
11674F087320k26431k61757j38157o4733m9411j81840k55984k02086j17807n4003
11664D535111j06149k38835j74830n2097n7495j65263p5599o5256k4017j28734
11654C446836j45701j62473q3505J2931n1836o2818R034q6669m7944r0134l0412
11643B707309J0631m8523k5857q8315j65410L6658J07542R0010J04846l466o3267
11632B662158q8750n4464R059Q9922L250j33332j18499O5666L4869j3033P224
11621B464070q7330r1384p3097j7605l5325M4635k109M0834j28794p7416J3926
$$ y = [11180991, 10758161, 10430097, 10135723, 9908151, 9685310, 9468176, 9331386, 9140589, 8925585, 8666310, 8383048, 8099743, 7797369, 7478496, 7175143, 6809737, 6417467, 6087320, 5860889, 5599132, 5460975, 5396242, 5346831, 5164991, 4909007, 4706921, 4589114, 4535111, 4428962, 4190127, 4015297, 3963200, 3905705, 3740442, 3664843, 3599587, 3575570, 3446836, 3301135, 3138662, 3055157, 3068088, 3016252, 2953434, 2962468, 2875799, 2827855, 2737721, 2707309, 2717940, 2669417, 2643560, 2555245, 2389835, 2426493, 2534035, 2624045, 2728891, 2725425, 2662158, 2573408, 2518944, 2528003, 2617925, 2621175, 2487843, 2369344, 2435010, 2469879, 2456846, 2464070, 2376740, 2285356, 2212259, 2194654, 2159329, 2203964, 2201855, 2242689, 2113895, 2036479, 2050405]
11610B050405m0284n8765n6340r9905L8180k8713k6148P2253L054m7657L8195
11599A844275O1655o3068K3019r4550j20904P0235q6164j17796O5544M7012K1521
11588A650779K3249m2234o1508M7254N9j33208j57302k4880M2761j8035m4570
11577A282365q965J6445l836J3632m3572m99j7883m2122m9728k5080K8691n562
11565A143886r1555N5269Q6925j7745j06741m3748k3109o7440l5629J6627j04511
11554H12229o062K0403m6826l1219M3517L8649o0253L6776k6016M4794q7344n4526
11542F84122P051o2853m5953q0680m5096L5569N681M633J4631M1052n5681m3011
11530D59465k0734M7829N6526N359N5023M4181l0802j4853j906l3717P0618O6195
$$ y = [2050405, 2010121, 1951356, 1895016, 1795111, 1833291, 1804578, 1778430, 1850683, 1853737, 1806080, 1844275, 1905930, 1842862, 1865881, 1771331, 1650427, 1720662, 1634498, 1516702, 1582246, 1629258, 1650779, 1674028, 1631794, 1570286, 1617540, 1617599, 1484391, 1327089, 1302209, 1344970, 1326935, 1282365, 1273400, 1289845, 1286009, 1299641, 1256069, 1255570, 1237687, 1195565, 1145837, 1120757, 1149448, 1143886, 1052331, 1107600, 1194525, 1176780, 1070039, 1026291, 1003182, 935742, 900113, 916740, 812229, 806167, 826570, 779744, 748525, 792042, 830691, 770438, 807214, 781198, 825992, 738648, 684122, 691173, 628320, 582367, 501687, 456591, 492160, 497841, 502474, 517105, 558157, 502476, 459465, 438731, 486560, 543086, 548445, 603468, 647649, 616847, 601994, 600088, 566371, 636989, 703184]
11518G03184n7931J2546J2225p7838q3195n0379j8535n0645J6904o390K6141L2979
11506D59066k1626o438l864K8045o8665o2146k3229K6458J46858J38368k4905
11495E87922o0356k2951l1643o4574j0770J29254J16460J2395L2827P898l6698
11484F59764O606o8717j05343L8735J2729J2612K2380K3438M3371r8681p1431
11473D75463Q4800N0035K0804l177j8829q070K4025L311o5496q1555L2984K8767
11461E43062R325o1560N8979j4699k4307N5149l2046m686J4044j9707L2600R9171
11449F55325M0189J3118q0382p5333M0932J27225O089j97135R650L7270j18200
11438D58748K6380P1105O2428N7660Q277o5769n2460m82J7069K9951P7980R4747
$$ y = [703184, 645253, 657799, 670024, 592186, 508991, 458612, 440077, 389432, 406336, 399946, 426087, 459066, 437440, 431002, 427138, 455183, 386518, 324372, 301143, 327601, 474459, 612827, 587922, 527566, 504615, 472972, 408398, 397628, 526882, 643342, 655737, 688564, 696462, 659764, 666370, 597653, 492310, 531045, 543774, 556386, 578766, 602204, 645575, 546894, 475463, 560263, 610298, 631102, 627925, 609096, 601026, 625051, 628362, 562866, 481311, 514295, 543062, 552387, 490827, 549806, 535107, 510800, 565949, 533903, 529217, 543261, 523554, 556154, 655325, 695514, 708632, 628250, 552917, 593849, 721074, 727163, 530028, 539678, 576948, 458748, 485128, 556233, 618661, 676321, 684598, 618829, 566369, 565887, 582956, 612907, 690887, 785634]
11426G85634n3604j14659o4243m4067j0693j26958m7308P8874M9437L8866m9575
11415D41704k4024k5570J7829N0478M675J6082J3339N0586J00567J1667M1694
11404F99027K3235J21447q1964q7948j00551J14254J85873J10030l9576n9991
11394H83836l5676q8327k6984k681m9113o0458K8313m0218j5776K852O544P72
11382F03084N1321Q0604P6360o6274j66742R0610J34335l7499N7464N5751O1208
11371I40222r247N2895m2096o7990L5392N6351k3747m3199k159N9119J41123J36382
11359A233046K79094J71341Q5723J46887J14310J49967j6825r2691j41648j46188
11349A783016j48344q9349n9046p5131j41946n2942L8701k0378j36843j45030
$$ y = [785634, 732030, 617371, 553128, 509061, 498368, 371410, 324102, 402976, 452413, 491279, 441704, 417680, 392110, 409939, 460417, 465092, 481174, 494513, 545099, 645666, 657333, 699027, 722262, 843709, 761745, 673797, 573246, 687500, 873373, 983403, 943827, 883836, 848160, 759833, 732849, 730168, 681055, 620597, 648910, 608692, 592916, 595768, 602312, 603084, 654405, 735009, 811369, 745095, 578353, 668963, 803298, 765799, 823263, 879014, 940222, 930975, 983870, 941774, 873784, 909176, 965527, 941780, 898581, 896422, 955541, 1096664, 1233046, 1512140, 1683481, 1769204, 1916091, 2030401, 2180368, 2163543, 2070852, 1929204, 1783016, 1634672, 1545323, 1486277, 1411146, 1269200, 1216258, 1254959, 1234581, 1097738, 952708]
11339I52708p9323N5207P2909R492L8517P9360k4204K437L784j9396M688m245
11327A091934N7077M5602L1025j1912o4956j9413N1720r3088j14049Q3776K732
11316A060448J2259j8825K7910K3462R2739k4119n5624j12017j36505J5999K8005
11305I13732j03585j62549O9385L6230m2091j62717K971k2027k9554K4645K6247
11294E50687j5034j7679K0940j14085r5114J7473K5182O558K5734M845r597M647
11282D04557o4240K1858q9998j9295N4415P0589p7257n3117L0128m387p6570k874
11270A93809K9825K377p8642l984Q1554k597k9970J0812L83m4839j5947k9467
11258A13314j15956l243M1012n8178K2030K1554L7123J0752J5572M2726N8451
$$ y = [952708, 873385, 928592, 1001501, 1010993, 1049510, 1128870, 1104666, 1107103, 1110887, 1091491, 1096179, 1091934, 1149011, 1194613, 1225638, 1213726, 1148770, 1129357, 1181077, 1087989, 973940, 1057716, 1060448, 1072707, 1053882, 1081792, 1105254, 1197993, 1173874, 1118250, 1006233, 869728, 885727, 913732, 810147, 647598, 716983, 753213, 711122, 548405, 551376, 529349, 499795, 524440, 550687, 535653, 517974, 538914, 424829, 329715, 347188, 372370, 378928, 404662, 409507, 399910, 404557, 340317, 362175, 272177, 252882, 307297, 377886, 300629, 247512, 277640, 273253, 196683, 193809, 223634, 226011, 147369, 143385, 224939, 222342, 192372, 203184, 203567, 158728, 142781, 113314, -2642, -5885, 35127, -23051, -1021, 20533, 57656, 68408, 83980, 126706, 185157]
11247A85157K1954k6370l0635n894L6268J00262J4469j4585L038j69628J5028
11236A29064Q2478L4874M4222p7375M4595l5242q8911l7868q0025l3850J13220
11225I5182J1395R4026J12448l6519o6074m853j8524n5079m8609L6187J8132L1691
11213A69403n5222p8530p3115M4722O8378J01557q568k1324R5840P7079k2452
11202B97768j23109k0378K4343O5120m0650L266q311q4169o652M2806J2169L872
11190A66075k1408J0382m8107j3096p142j49524l5342O569O4127P2522M2256l9072
11178D8240m1297O8789l0995r3877n0156j0703J05662N5461K2108O1656J06856
11167B41744L8832n9820j78269n1551J74387L4914n1552L8621K4117o3122r735
$$ y = [185157, 207111, 180741, 150106, 144212, 180480, 280742, 295211, 280626, 283664, 114036, 129064, 211542, 246416, 290638, 213263, 257858, 222616, 133705, 95837, 15812, -18038, 95182, 106577, 200603, 313051, 276532, 210458, 205605, 187081, 132002, 83393, 119580, 137712, 169403, 114181, 35651, -37464, 7258, 75636, 177193, 168625, 147301, 243141, 320220, 297768, 174659, 154281, 178624, 243744, 203094, 206360, 198049, 113880, 107228, 150034, 162203, 166075, 144667, 155049, 106942, 93846, 86704, -62820, -98162, -91593, -27466, 45056, 87312, 48240, 6943, 75732, 44737, -49140, -99296, -109999, -4337, 51124, 73232, 134888, 241744, 280576, 220756, 42487, -9064, 165323, 200237, 148685, 187306, 211423, 148301, 138566]
11156A38566J7262l9163l94j3365J0028O3391J20529p833n7913o3078j50386q5794
11144f8150K1860M5672k668J4078M9746l7186j22714N4540L6576J32756J32134
11133B56644K0079k3807j23972j16692j30945o569N1164J29478M9455K1048K3341
11122A49224l164k1085q0573L448L2713P475J113J5395k6187J6039K9354k0508
11110A03244j4863O609l5255n671K6408P7117l7297q6716j08560o398m5741n6278
11098a83401k5671P6054Q1549L5912J11149m1061j02781N362P7137M3972M8872
11087A27093K207O706N9095m629l0913k3000N266J7314J28R292n3158k0644N5518
11074A50275o1615m1150J01581n6787r3359o8613R3836L1423k1290o8936j106
$$ y = [138566, 155828, 116665, 116271, 102906, 112934, 176325, 296854, 289021, 231108, 168030, 17644, -68150, -46290, -618, -3286, 10792, 60538, 23352, -99362, -44822, -8246, 124510, 256644, 276723, 252916, 128944, 12252, -118693, -125262, -74098, 55380, 104835, 125883, 149224, 146060, 124975, 44402, 47850, 80563, 88038, 89151, 104546, 78359, 94398, 123752, 103244, 88381, 94990, 59735, 54064, 80472, 157589, 120292, 33576, -74984, -81382, -127123, -183401, -209072, -133018, -51469, -15557, 95592, 54531, -48250, -42888, 34249, 78221, 127093, 129300, 136006, 195101, 190472, 159559, 136559, 141825, 159139, 159267, 168559, 115401, 94757, 150275, 88660, 47510, 149091, 92304, -1055, -69668, 24168, 55591, 34301, -34635, -35741]
11063c5741N8117M3851j4958J2153K3352M9633m72m2987o091n7370J8435J17941
11051A65863L7906k9731j9452m1439p7214k2017N611R5362L7955L4017N2531l1535
11039B07857q4165n3008j17697J4372N0222K2031j0776l734N2398p1197l9851
11028c3548K8410M9963j5385p752m5036O6429R132l8188l1753n4641j538Q0478
11016F571M4243l6138j0402N541k0654l8675k8364j9344J7638Q9991J02301J8631
11004A31339L9040k0580l9672j6746q2888k8700M0427L2779L7148j6160n4326
10993B1661L1484N0588j1871M899o8857L4799L045p7843j35455n04k8303O2346
10981a14011O4163j7540k1895L8607N0765J7282k0168k5563K2093J0842L1908
$$ y = [-35741, 22376, 66227, 51269, 63422, 86774, 136407, 135935, 92948, 86857, 29487, 47922, 165863, 203769, 174038, 154586, 113147, 35933, 13916, 19527, 114889, 152844, 186861, 239392, 207857, 123692, 70684, -47013, -32641, 17581, 39612, 28836, 25102, 77500, 6303, -33548, -5138, 44825, 29440, 21688, -23348, 43081, 52213, 14025, -17728, -72369, -73907, 6571, 50814, 14676, 4274, 9815, -10839, -49514, -77878, -97222, -79584, 10407, 112708, 131339, 170379, 149799, 110127, 93381, 10493, -18207, 22220, 54999, 92147, 75987, 21661, 53145, 103733, 91862, 96761, 27904, 62703, 65748, -12095, -147550, -148054, -176357, -114011, -49848, -67388, -89283, -50676, 89, 17371, -2797, -28360, -6267, 4575, 36483]
10970C6483L2619j7406k8326k5001j7828M7457l4171p5480m6589J25109J16416
10959A13283N3055o9774p5649j03306J7527J22703K2676k0828O9172N9254o9579
10948A18534j88013p6490k5628N0691M7572L3282J03750P2647j023n638j5579
10937A14105L1237P437k8560l827J1736n3865m2778J3261M7056O3779M4313p7936
10925A25958J4371L3557k3826p7044m7028M6922r971O4976Q9177j8653n0173q2390
10913F5876q034Q6693Q942O3467l2747q5351m2573K8363M5299k2159M7432L1963
10901A87171q6767m4607J1211O9230R5346j42175m5600J4888l1620J119l0939
10890b743l9903Q025M5132l7708L1908R8871Q5211r2774n2704L1957O6297L2931
$$ y = [36483, 69102, 51696, 23370, -1631, -19459, 27998, -6173, -81653, -128242, -3133, 113283, 166338, 96564, 20915, -82391, -64864, 57839, 80515, 59687, 128859, 188113, 118534, -69479, -145969, -171597, -120906, -73334, -40052, 63698, 136345, 135322, 129684, 114105, 145342, 152779, 124219, 120392, 132128, 78263, 35485, 48746, 95802, 159581, 203894, 125958, 140329, 173886, 150060, 73016, 25988, 72910, 62939, 127915, 217092, 198439, 148266, 65876, 57842, 144535, 153477, 216944, 184197, 98846, 56273, 84636, 129935, 107776, 155208, 187171, 100404, 55797, 67008, 136238, 231584, 89409, 43809, 58697, 27077, 28196, -2743, -42646, -34621, 10511, -27197, 4711, 103582, 188793, 96019, 43315, 75272, 141569, 174500]
10878A74500o9119j37729j4184Q8368K9476m8311l2456K0729P626R62j1761l2399
10866b4298M8684J4226L2502O8904J4105p7175n2306L2402R9659l5753j4671j1144
10854I5135k7087J3619L8130J3672l8344m2503m0660P2784L4690l2468n4856O8694
10842A00806J0937l2080L3924Q276n8527R344K5291n2287N424k688O5871K5353
10830A39644m0500K7965J5761j19833P4841J17146J11329k380j34989j05113P439
10819I1310K6172R6940K2741l9536o8199l1206J3442m0472O3195O4687r3346P56
10807A06484n7541p298l3324j3659j9053M4254N6009o5337K4488K4555L7206L3800
10795A30584N4212p4374l3729p1831j03664n6089P2514P9342j8824m4610l1751
$$ y = [174500, 105381, -32348, -46532, 41836, 71312, 23001, -9455, 11274, 18900, 19862, 8101, -24298, 24386, 38612, 71114, 140018, 154123, 76948, 24642, 57044, 156703, 120950, 106279, 95135, 68048, 81667, 119797, 133469, 95125, 52622, 11962, 84746, 119436, 86968, 32112, 100806, 111743, 79663, 113587, 121863, 63336, 72680, 97971, 45684, 51108, 48420, 114291, 139644, 99144, 127109, 142870, 23037, 97878, 215024, 326353, 323973, 188984, 83871, 91310, 117482, 214422, 237163, 197627, 129428, 98222, 111664, 71192, 134387, 199074, 105728, 106484, 48943, 41645, 8321, -5338, -24391, 19863, 75872, 10535, 35023, 59578, 96784, 130584, 184796, 110422, 76693, 4862, -98802, -154891, -82377, -3035, -21859, -66469, -98220]
10784i8220J41505k432L9008o322k3527n6374k4903L5076L6442j09186q1105N1855
10772i8183M8772R3414J4402O0392k9553k0812P1262J4351j6313k604n7634j00996
10760b3502m5641n8169k8929l7806m0633P4504J23857J459Q201O0084L0798q1135
10748a6912o6358Q4025J2158K9932Q8128N584j14198q7052M1340j9141l7729j386
10736h1609Q2666M3451k7516M0150p586l899m5478o9713M9675K8949P0163L4199
10724A13452k4904n4437k2965L6504N5153l311K6663k6665q7701r3275k701J09996
10712B5809J42481N4785j21620j0649j0309p3758n2285n1420P3684N3727o3356
10701c2911L841L218O8508p6245o752M3374N6067K3612j13462q8569M7128J39477
$$ y = [-98220, 43285, 40853, 79861, 73539, 50012, -6362, -31265, 3811, 40253, -68933, -150038, -98183, -49411, 44003, 58405, 118797, 89244, 68432, 139694, 154045, 137732, 135128, 77494, -23502, -69143, -127312, -156241, -194047, -234680, -160176, -36319, -34860, -26659, 33425, 64223, -16912, -83270, 755, 12913, 42845, 130973, 136557, 22359, -64693, -23353, -42494, -80223, -81609, 1057, 44508, 16992, 57142, 49556, 45657, 179, -69534, -19859, 9090, 79253, 113452, 88548, 34111, 11146, 47650, 102803, 99492, 126155, 99490, 11789, -81486, -84187, 25809, 168290, 223075, 101455, 90806, 80497, 6739, -45546, -96966, -23282, 30445, -32911, -29070, -25852, 42656, -33589, -40341, 3033, 59100, 82712, -30750, -119319, -72191, 67286]
10689F7286N8193o4684o3322k9006O66P1422M1800K3649j6136J4159k2900l8753
10677D2374l701J4669Q6370q222r5991q4907L0764J7838r0320j94674j9584O0165
10665b45219Q728N5403J00706Q4998L9772k554p671n4053K9027p5342p6712J6972
10653a25945K1203M4486J7927j0017j0938l5542p1429J00635M1767o818L7771
10642C100K9583m313n1857K2120O9027l4907q1289l1371M3664p1790Q6130l8599
10630f0502m9878l682j4896P863J03588M7974N5635r025o3532K5694K3640n6391
10618F488J0252Q1610n235j8255n7465m2995J0872L4283K0969L4401L2761n3336
10606E4350m5356M6222l1584n1841L9838o6014j9473J9957N9612L5186J3091l0107
$$ y = [67286, 125479, 60795, -2527, -31533, -30867, 40555, 82355, 106004, 89868, 104027, 81127, 42374, 38673, 53342, 139712, 131490, 35499, -49408, -18644, -806, -91126, -285800, -305384, -245219, -236491, -181088, -80382, 4616, 44388, 41834, 34163, -19890, 9137, -66205, -142917, -125945, -104742, -60256, -42329, -52346, -63284, -98826, -170255, -69620, -27853, -34671, 3100, 32683, 28370, -23487, -1367, 67660, 32753, -48536, -79907, -36243, -108033, -21903, -60502, -110380, -114062, -128958, -121095, -17507, 30467, 86102, 77077, 13545, 39239, 62879, 6488, 16740, 98350, 93115, 74860, 17395, -25600, -14728, 19555, 40524, 74925, 107686, 54350, 8994, 55216, 23632, -28209, 11629, -54385, -73858, -53901, 5711, 40897, 53988, 23881]
10594B3881p8299O150Q2500J0152j8259p7629j00660K5895J6070K2451J3897K8123
10582d5728P752k9100O4262Q66m9190J2409k3473j10381L6557J75955J18122j5824
10570A42227m1598m838m9479k5597J18691K3609n0341o6245l732r0004k4568o540
10558g8415J613m6498J8157J21116O8517j2174j1427O2270J2960l5706p8346M1623
10546F3690o9471m3141K6088q459O1012n2161j3224M6664K7475O1620m6810j07200
10534e3917m7698N3104O99Q7O1366J01851Q5905J626n4117K4552q425n2972p0916
10521D1145p6976l9019j8880J1019j258k488n738K8036L2898j4479L4171m882
10509a6451j05497K923J16395R5830n696K8540P3089N1000k0383o6441l861o4618
$$ y = [23881, -54418, -48268, 34232, 44384, 26125, -51504, -152164, -126269, -110199, -87748, -73851, -45728, -37976, -67076, -2814, -1948, -51138, -38729, -62202, -172583, -136026, 39929, 158051, 142227, 100629, 95791, 46312, 20715, 139406, 163015, 112674, 46429, 42697, -47307, -71875, -78415, -76802, -123300, -105143, 15973, 84490, 72316, 60889, 123159, 136119, 100413, 22067, 63690, -5781, -48922, -22834, -31293, 29719, -22442, -35666, 10998, 38473, 100093, 53283, -53917, -101615, -48511, -47812, -47725, 13641, 115492, 201397, 203023, 148906, 173458, 165033, 112061, 41145, -35831, -74850, -93730, -82711, -83969, -86457, -92195, -64159, -31261, -45740, -11569, -16451, -121948, -119025, -2630, 93200, 87504, 116044, 189133, 240133, 219750, 153309, 149448, 84830]
10497H4830j05013o5629q2667N013l4624Q286P8632P3838l876M9409L9778M13
10485D8390m9923l4084L2305J3558N223l12j1882K0764l9621K7576M674k2155
10473e487O6604N8751J3903L3814n5565P0060M1521k3363p9451r985L7120M4420
10461A92342P2151r6443l6009l3582p2058l218l2644R9402L3245l8811m5206l725
10449C5444R7545j8898M2363L9193j10535l0359l9816K197l3135O8498m0207K6927
10437C9217o982M5184r062l927M4442j3846N179m6292L2143P488M0869J1667J82
10424A46262n5349Q192m6002p5296k8839M6946P4337l1179l364l2193M832M0783
10412D9130N6375Q6669J1554L732n1327j00357m5178M6991P9730M0687m7803j26794
$$ y = [84830, -20183, -85812, -168479, -163466, -198090, -189804, -111172, -37334, -41210, 8199, 47977, 48390, -1533, -35617, -3312, 10246, 15469, 15157, 3275, 24039, -15582, 11994, 16668, -5487, 61117, 119868, 133771, 167585, 112020, 182080, 223601, 200238, 120787, 110802, 147922, 192342, 264493, 168050, 132041, 98459, 26401, 23183, -9461, 89941, 123186, 84375, 39169, 35444, 132989, 114091, 156454, 195647, 85112, 54753, 14937, 17134, -16001, 52497, 12290, 39217, 32235, 77419, 68357, 64430, 108872, 95026, 100205, 53913, 86056, 93544, 134413, 146080, 146262, 90913, 99105, 53103, -22193, -51032, -4086, 70251, 39072, 35708, 3515, 8347, 49130, 105505, 192174, 203728, 207460, 156133, 55776, 10598, 57589, 137319, 178006, 130203, 3409]
10400C409j448L7326K8082k5735n9243k4211J437k8960R8618P8788L963p1381
10388D0645m6309l620l0583l396J0410J05175J12111K0436J2305q1316m1145j4931
10376G9782k6270n6064n88N5998Q155k7521k885M0243r927P5800j5377j22200
10364h54r750J8686J6821J14905j9575r9868K160j1951J4871J15405M7481m2827
10352A45504O4580L1679p9358j19028m1422j3282Q8982J01815j5435K5164l6164
10341A53035l0841L6075n618Q669j1503j08631M9241K5113K758M8976l3483l3294
10329A00497K7905j13476l1503J13908M3230l9021q1599K7035P0509J1926l2530
10318I6881N0343K7390n6483J9566k8158J7315N0480J8412L3645j14484q1775
$$ y = [3409, 1961, 39287, 67369, 41634, -17609, -41820, -40383, -69343, 29275, 108063, 112026, 40645, -5664, -9284, -39867, -43263, -32853, 72322, 184433, 204869, 217174, 135858, 94713, 79782, 53512, -2552, -3140, 52858, 61013, 33492, 30607, 70850, 60923, 136723, 121346, -854, -10604, 8082, 24903, 139808, 120233, 20365, 22525, 10574, 25445, 140850, 188331, 145504, 210084, 241763, 162405, 43377, 1955, -11327, 77655, 179470, 164035, 189199, 153035, 122194, 158269, 152651, 161320, 149817, 41186, 90427, 115540, 118298, 167274, 133791, 100497, 128402, 14926, -16577, 97331, 140561, 101540, 19941, 46976, 117485, 129411, 96881, 147224, 174614, 118131, 137697, 109539, 126854, 177334, 195746, 229391, 114907, 33132]
10307C3132K9306l0680O0111M8199M8964J7196P0436l9049j4901m0724n2476J9343
10295A48857M4698q4794K268Q9779M8781N2769L7602n4115j4221K5299o424N5890
10283C46389j03716m7456j18792n6456J22697J43988L1703M3785j3977j04515
10273B43650k2137K2383K3848o9529K5969J3829J9944R4245k7917j72581r6300
10262E5404j3055J8534J09800Q9340j13868n7039J1201O0864J03860o654L8198
10251B96585Q672l1634P224M9805p0382j04090p8258M3346J20711Q1600p5539
10240B48040p1836O9159J42726P212J31532K46054P6961Q5979k2760l755O6929
10229I76241O6544n1605j36467k0898p3899k2718j60368q3830m9473l2169L3168
$$ y = [33132, 62438, 31758, 91869, 140068, 189032, 206228, 276664, 237615, 222714, 181990, 129514, 148857, 193555, 108761, 111029, 200808, 249589, 302358, 339960, 285845, 271624, 296923, 290499, 346389, 242673, 195217, 76425, 19969, 142666, 286654, 318357, 362142, 348165, 243650, 221513, 243896, 267744, 198215, 224184, 238013, 257957, 352202, 324285, 151704, 55404, 42349, 60883, 170683, 260023, 146155, 89116, 100317, 161181, 265041, 258387, 296585, 305257, 273623, 280847, 330652, 260270, 156180, 77922, 121268, 241979, 323579, 248040, 176204, 245363, 388089, 395301, 526833, 772887, 849848, 935827, 913067, 909312, 976241, 1042785, 991180, 854713, 833815, 759916, 737198, 576830, 493000, 443527, 411358, 444526]
10218D44526p6396r6999n1040Q3365K844o0713J388j2318n4128l3640L4542l884
10206A77547J7007k0891J12540J19930o6454l3496Q7281J05493N3732L9726L1360
10195F23775J87219K07265Q2887J07831L7138J02463K04254J24847l5997j06779
10185A534903J4492O06p5162k06699j68947m3528J5591o7360j05788j41261q2995
10174F73852N8537O63J5543j19464m1671o122J29867K8027K530k350k739K922
10162G39595q023o0896j14546N7625M2173o7436L5955Q3495l3585p8322P7969
10151F74004J82132J15934J41867J57759N4656J18414P1469l68R730r7177j06766
10140A321654j53843j01422j31829j52017r8375q2473K284M2463p3755P128R54
$$ y = [444526, 368130, 271131, 220091, 303456, 306300, 245587, 246975, 234657, 180529, 146889, 181431, 177547, 194554, 173663, 286203, 406133, 339679, 306183, 393464, 498957, 552689, 592415, 623775, 810994, 1018259, 1101146, 1208977, 1246115, 1348578, 1552832, 1677679, 1641682, 1534903, 1549395, 1550001, 1474839, 1268140, 1099193, 1055665, 1071256, 1003896, 898108, 756847, 673852, 732389, 733052, 748595, 629131, 587460, 581338, 711205, 739232, 741762, 739412, 736673, 739595, 731572, 670676, 556130, 613755, 655928, 588492, 624447, 707942, 674357, 596035, 674004, 856136, 972070, 1113937, 1271696, 1326352, 1444766, 1516235, 1515867, 1525597, 1428420, 1321654, 1167811, 1066389, 934560, 782543, 684168, 601695, 603979, 646442, 572687, 579815, 580769]
10129E80769J822k0613m4107m5642o4747n4960r4P3392L9932r912L289N233M4753
10116E09115K8360J12235K8147l3991p5233L0710m9171r7945L362J20658Q1396
10105F57643j2277p3054j0341k6468M2317M6727J729k3629k6160p3152o0366o7601
10093C75368k0840J2143J3382m7244j951L04r1063O634Q294L9192o3078M7858
10081B78999Q9647M3180J1976J4774M0203j0928j02238o6148J70824J2071j03176
10070C79184R511P3991P5599L569L8860m3088p6394j2226l537R1411J00593J09237
10058G46710J55371J95693J14355K58915K65270l3507k60331l05318j75108j21399
10048H40651n7711r3599J8828l7542m1767o459M8851j4743Q168Q3170M9009L9081
$$ y = [580769, 582591, 561978, 517871, 472229, 407482, 352522, 352428, 425820, 465752, 455840, 459129, 464362, 509115, 537475, 649710, 677857, 643866, 568633, 599343, 550172, 452227, 455589, 576247, 657643, 645366, 572312, 561971, 535503, 577820, 624547, 626276, 602647, 576487, 503335, 442969, 375368, 354528, 366671, 380053, 332809, 330858, 331162, 240099, 246733, 255027, 294219, 231141, 278999, 368646, 411826, 423802, 438576, 478779, 467851, 365613, 299465, 470289, 482360, 379184, 388695, 462686, 538285, 541854, 580714, 537626, 461232, 449006, 445469, 536880, 637473, 746710, 902081, 1097774, 1212129, 1471044, 1736314, 1702807, 1442476, 1137158, 962050, 840651, 782940, 689341, 708169, 670627, 628860, 622401, 671252, 656509, 664677, 747847, 796856, 835937]
10036H35937M4684J6308M5523O343l887O0793L7890K4555K9031j1449L1509P6070
10024A193307l8664L0369P834n5337j17520r215M8885j4061p2963p7432l6732
10013H58471J0162N221M7767L90k0992R366l479K4105m5752n3567k4155Q1192
10001H88729K1593j4901m1168L2053j18381j01454J30477M4718q429n7453J0480
9990G86264l4415J8559M3536J05974J9730J7035N503j0614p875o4397j12606M2630
9978H09324o1922j4698j9720Q0985O3381j24872j8465m6210m1889N0083R412k4263
9966F61146N3228L3811k4341q5246j8409k6841M1208R7396p490p6387M2471P1596
9954G62142o089j08298l3572Q0732O3485o040K0745Q9977L4375L1729J27622R97
$$ y = [835937, 880621, 896929, 942452, 948795, 944908, 1005701, 1043591, 1068146, 1097177, 1085728, 1117237, 1193307, 1154643, 1185012, 1192846, 1137509, 1019989, 1010774, 1059659, 1045598, 972635, 895203, 858471, 868633, 873854, 921621, 922011, 901019, 910385, 906906, 931011, 885259, 831692, 807537, 888729, 910322, 895421, 854253, 886306, 767925, 666471, 796948, 841666, 833237, 775784, 786264, 751849, 770408, 813944, 919918, 939648, 956683, 962186, 951572, 943697, 879300, 766694, 809324, 747402, 732704, 712984, 793969, 857350, 732478, 714013, 667803, 625914, 675997, 685409, 661146, 714374, 748185, 723844, 638598, 620189, 593348, 634556, 731952, 724462, 648075, 690546, 762142, 756053, 647755, 614183, 694915, 758400, 752360, 773105, 863082, 897457, 929186, 1056808, 1057805]
9942A057805n0012K7155N8580r922o203l8268k6485k0666M2777o078r7692R4644
9930A025635J61631q6686K0705j0130m5505q417K9371o1422m4314J24897l0232
9919A075533J9755k5686L5327J765M6886L8253J9226Q1210J28038J54606M4303
9908A619216r6577O8182P5661L5639J87681J42884J57276N2624l2539Q3696M5576
9897B339319L201J37322K31327J77519J88515J96318K29357L23196J77244K09287
9887D212605K09363K18242L10783K72527K47650K66529J90536K06475K17683O7943
9877F420336m7261J4164n5975q0826j38528l8316N8537R0026K22764K43592K19710
9866F908223K61422L13192M33129N31222N88037Q02280R66379J149917J135523
$$ y = [1057805, 1007793, 1034948, 1093528, 1083606, 1077403, 1039135, 1012650, 991984, 1034761, 1028683, 930991, 1025635, 1187266, 1100580, 1121285, 1111155, 1065650, 1057233, 1086604, 1025182, 980868, 1105765, 1075533, 1095288, 1069602, 1104929, 1106694, 1153580, 1191833, 1211059, 1292269, 1420307, 1574913, 1619216, 1522639, 1590821, 1666482, 1702121, 1889802, 2032686, 2189962, 2242586, 2210047, 2293743, 2339319, 2342520, 2479842, 2711169, 2888688, 3077203, 3273521, 3502878, 3826074, 4003318, 4212605, 4421968, 4640210, 4950993, 5223520, 5471170, 5737699, 5928235, 6134710, 6352393, 6420336, 6373075, 6387239, 6331264, 6250438, 6111910, 6073594, 6132131, 6222157, 6444921, 6688513, 6908223, 7169645, 7482837, 7915966, 8447188, 9035225, 9837505, 10803884, 11953801, 13089324]
9857A3089324J022799O59481J93223Q3722O0252k1028j43099l77482n08483n87401
9847A3471308l33529k03747j84794m5983K7706r6832m3370Q5251J43168K27613
9837A3046791K82486M29604N68698O83610P95900R74793R54782J073731J349023
9828B0159418J816563K304980K631343L391931M339401N542742P088956Q818400
9820E6093734J0504226J2092174J3665319J4613903J4251300J1002812M094052
9813A36317520m639860j1097475j3097896j1818037r133345o361439l824877j534243
9805G4810348N67293K345130M161473O081472P624964Q930036R514428R219589
9797A23254733Q249663O830182M837037K601005P89932n14969j368100j774822
$$ y = [13089324, 14112123, 14771604, 14964827, 15048549, 15108801, 15087773, 14944674, 14567192, 14058709, 13471308, 13137779, 12934032, 12749238, 12703255, 12730961, 12634129, 12590759, 12676010, 12819178, 13046791, 13329277, 13758881, 14327579, 15011189, 15807089, 16781882, 17736664, 18810395, 20159418, 21975981, 24280961, 26912304, 30304235, 34643636, 40186378, 47275334, 56093734, 66597960, 78690134, 92355453, 106969356, 121220656, 132223468, 136317520, 131677660, 120580185, 107482289, 95664252, 86530907, 80169468, 76344591, 74810348, 75377641, 77722771, 81884244, 87965716, 95590680, 104520716, 114035144, 123254733, 131504396, 138334578, 143171615, 145772620, 146562552, 146047583, 144679483, 142904661]
9789A42904661j985368k007741j800909j286399o13716M83017K139864M234667
9781A42068076P311280J1446648J6338216K1611795K7464564L2890295L6246182
9774B95377056L4348514K4145535N219082j6812914l2507752l7205955l3467037
9767B39096529k6194867j8793171j2801343q236738m590198j833083R2168J166864
9759A67906161J503767J692773K333677L163341L628704L568108K840543J762150
9751A88399224K75305j400949l366203n927584q476087j0045814j0215037r326624
9743A39916231p514423n291652l320998j656032P3417J724801L539817N578771
9735A33049932P422875R240659J0457026R824615O001221j350619r224198j4157135
$$ y = [142904661, 140919293, 138911552, 137110643, 135824244, 135210528, 135693545, 137833409, 142068076, 149379356, 160826004, 177164220, 198776015, 226240579, 259130874, 295377056, 329725570, 353871105, 359090187, 342277273, 309769521, 272563566, 239096529, 212901662, 194108491, 181307148, 173070410, 168480212, 166647129, 166739297, 167906161, 169409928, 171102701, 173436378, 176599719, 180228423, 183796531, 186637074, 188399224, 188674529, 187273580, 183907377, 177979793, 169503706, 159457892, 149242855, 139916231, 132401808, 127110156, 123789158, 122133126, 122206543, 123931344, 127471161, 133049932, 140472807, 149713466, 160170492, 169995107, 175996328, 174645709, 165421511, 151264376]
9727A51264376j5077590j3821462j1980470j0121384q260804o649659n381907
9720G9971100m402835l693079l288265l023579k785578k657843k424473k393075
9712E5302373k258655k135360j976594j901054j819793j739360j567806j304295
9704D0599456j080583r64101p72638o23323n90104m75986m75859m75073m15394
9695C4726395l77592l62103m91440p49361r55150j029342j319543j577435j745414
9686B6119015j787748j615485j423356j281315j181886j007825q87670p64351
9678A6169379p01728p07449n69430m68828m20114l22367k84072k51531k81987
9669A2161873k73253k02780j72728k71062k86354l36023l10395k88754l02836
$$ y = [151264376, 136186786, 122365324, 110384854, 100263470, 92002666, 85353007, 79971100, 75568265, 71875186, 68586921, 65563342, 62777764, 60119921, 57695448, 55302373, 53043718, 50908358, 48931764, 47030710, 45210917, 43471557, 41903751, 40599456, 39518873, 38554772, 37782134, 37158811, 36568707, 36092721, 35616862, 35141789, 34726395, 34348803, 33986700, 33495260, 32745899, 31790749, 30761407, 29441864, 27864429, 26119015, 24331267, 22715782, 21292426, 20011111, 18829225, 17821400, 16933730, 16169379, 15467651, 14760202, 14190772, 13721944, 13301830, 12979463, 12695391, 12443860, 12161873, 11888620, 11685840, 11513112, 11242050, 10955696, 10619673, 10309278, 10020524, 9717688]
9660I717688k90435l10874l58094l53308l43894k57827j96470k99723l65495l53373
9650F588195k64114k22414j94832j55583j78536k08207j48382k65537k36358j70545
9640D543687j90017j91343k10609j12687j12941r8659p6197m5173l1647k0239
9630C454175k8677o5257r9308m2498m0653r8119r8085j4804n8752q5311j32664
9619B690047m3685n2219j07026n4588O2966O9968K1698K3138J5679l9788R5576
9608B681766p9845l3472O9851p4217k9089m1684j50979l7313J0793K1078r95m655
9596B331239j52952k168P4231p5456l904O8986M0475l3410O581k3189q3482j04940
9584B042011l3680J1607r1447q6274J2554J26288j9988M9900Q0755R987q0953
$$ y = [9717688, 9427253, 9116379, 8758285, 8404977, 8061083, 7803256, 7606786, 7307063, 6941568, 6588195, 6324081, 6101667, 5906835, 5751252, 5572716, 5364509, 5216127, 4950590, 4714232, 4543687, 4353670, 4162327, 3951718, 3839031, 3726090, 3627431, 3551234, 3506061, 3474414, 3454175, 3425498, 3360241, 3260933, 3218435, 3177782, 3079663, 2981578, 2966774, 2908022, 2822711, 2690047, 2646362, 2594143, 2487117, 2432529, 2495495, 2565463, 2587161, 2610299, 2625978, 2586190, 2681766, 2601921, 2568449, 2638300, 2564083, 2534994, 2493310, 2342331, 2305018, 2315811, 2336889, 2335894, 2331239, 2178287, 2176119, 2250350, 2174894, 2170990, 2239976, 2280451, 2247041, 2253622, 2230433, 2146951, 2042011, 2008331, 2019938, 1928491, 1842217, 1854771, 1981059, 1961071, 2010971, 2091726, 2101713, 2020760]
9573B020760N586p8789o5087k2315o2080J6534L3375j5546J0902M4548j16168
9562A771720o8290O2935M3913k7437m5592r4166j43182k3439k6587k0122J9889
9551A449642L5720o8148n4881Q405K4328L8724p7290K3733m7790p6930K1568l318
9539A273763n7920o4576l2885k381p1827l9018k762r879L0964K8251m7093O6412
9527A071049k0222j3285l6273K6579K1948K1510k1044p8868p0746r4828m7363
9516G58457j2098n588M9816l085n4312p0959q4524K512Q8854j7820O7688O6443
9504G85384N2627R808L4356O7076o4600p3678j1345m6026J9346j9000m6338Q0811
9492G88421k0492p9233k1856J22783r374k3218k6182K2662R9710J4292K2980n2844
$$ y = [2020760, 2026346, 1947557, 1882470, 1860155, 1798075, 1814609, 1847984, 1832438, 1843340, 1887888, 1771720, 1703430, 1766365, 1810278, 1782841, 1737249, 1643083, 1499901, 1476462, 1449875, 1429753, 1449642, 1485362, 1417214, 1362333, 1370738, 1395066, 1433790, 1356500, 1380233, 1332443, 1255513, 1277081, 1273763, 1215843, 1151267, 1118382, 1116001, 1044174, 1005156, 1002394, 992515, 1023479, 1051730, 1004637, 1071049, 1050827, 1037542, 1001269, 1027848, 1049796, 1071306, 1050262, 971394, 900648, 805820, 758457, 746359, 740771, 790587, 787502, 733190, 662231, 577707, 580219, 669073, 651253, 718941, 785384, 838011, 847819, 882175, 949251, 884651, 810973, 799628, 753602, 772948, 753948, 707610, 788421, 767929, 688696, 666840, 789623, 780249, 757031, 730849, 753511, 853221, 867513, 890493, 837649]
9480H37649n7328K939P4596K8789J7811N296q89l7066n3681M5908L1438o5894
9468H29568m7455o6367n4094k1699j0448L1515Q5729n5383M3813P1011N5150L7993
9456H99333o0400r1678O6654M2533J8359K6642l0864k7611J2204L4952N5608O8339
9444A014071j5210M942O9735J836N297M4458Q8425K7981K6080k499n8038j49931
9432A057147k15055m6662R8373L5930P1151r304K8758m1610k1984r6832K223P4455
9420I36590K1216o9758k5838Q45P5399R9733L4375n114j03978j8972p1333r8759
9408G74406M2774N3903j5592P5380M6399K8536J09781J32369n3623J39919K36771
9397A571023J87957J03934L912q5234j7269n2296o7138j15046k19118k04675q908
$$ y = [837649, 780321, 783260, 857856, 886645, 904456, 909752, 908863, 871797, 818116, 864024, 895462, 829568, 782113, 715746, 661652, 639953, 629505, 661020, 746749, 691366, 735179, 806190, 861340, 899333, 838933, 747255, 813909, 856442, 874801, 901443, 870579, 842968, 855172, 890124, 945732, 1014071, 998861, 1003803, 1073538, 1075374, 1080671, 1125129, 1213554, 1241535, 1267615, 1265116, 1207078, 1057147, 842092, 795430, 893803, 929733, 1000884, 991580, 1020338, 978728, 956744, 859912, 862135, 936590, 957806, 888048, 862210, 863055, 938454, 1038187, 1072562, 1067448, 963470, 944498, 873165, 774406, 817180, 871083, 855491, 930871, 977270, 1005806, 1115587, 1247956, 1194333, 1334252, 1571023, 1758980, 1862914, 1866826, 1781592, 1764323, 1712027, 1644889, 1529843, 1310725, 1106050, 1097142]
9386A097142k9714M6645j0354j24621o0559o990j3937J5716K1996J8247l9074
9375I14497j02607q1472M2190N7067n8381o1537L7557L2325J76661Q8800j41204
9364I03896J629P1575O0155m6545M3360J09113J13636J88910J86710J68947J75876
9353A977262J07203M5388P8801p7598o8047j32963k15297j10852n4688o8322r9773
9342A381114j55311j41589l4719N6559j7411j33471m8577J646q992l9536o493
9331H53220k047L0451k9218o9357N4730O8043R434R3835p805k1822M4988J02416
9319A126868m1751K8239Q4816J35052N1028J45228K57867L08865J84565J46013
9309B426790J98063k424l3501n8374j69336r4951p1669j86429j91310j14168p364
$$ y = [1097142, 1067428, 1114073, 1103719, 979098, 918539, 911549, 897612, 913328, 935324, 953571, 914497, 811890, 730418, 772608, 829675, 771294, 709757, 747314, 779639, 956300, 1045100, 903896, 905525, 977100, 1037255, 990710, 1034070, 1143183, 1256819, 1445729, 1632439, 1801386, 1977262, 2084465, 2129853, 2208654, 2131056, 2063009, 1930046, 1714749, 1603897, 1549209, 1480887, 1381114, 1225803, 1084214, 1049495, 1106054, 1088643, 955172, 906595, 908241, 899249, 859713, 853220, 851173, 881624, 852406, 783049, 837779, 905822, 915256, 1009091, 1001286, 979464, 1024452, 1126868, 1085117, 1113356, 1198172, 1333224, 1384252, 1529480, 1787347, 2096212, 2280777, 2426790, 2624853, 2622429, 2588928, 2530554, 2361218, 2266267, 2194598, 2008169, 1816859, 1702691, 1695327]
9298A695327O625M5769Q9063J42718O3409K5646j4880R984J7752k5092j27687
9287A928634k6910p7739n0927N3167N2640j5298Q7044N3246k0380N6380K01729
9276B241586L01822K51251L16961K42371K10799M1144j64622k20621k97585l01237
9266B621869k09125j11460l0343N3583o5942j40005j56575m5583L8999Q2458O1741
9255B099617Q631J41039R0789N6344m5659n6919j17978r0459j03597j14172q4968
9244A782668j24506p6195m2022j100L637J22716J90234J97040J14975q9440j33389
9233A944618q1347j41038o2183o1328j30120j21074j15995j66494j04387j1054
9223I49598o3021J01585k2504o2948m00N5051K6179r5975r7401p0881m2829L7400
$$ y = [1695327, 1701952, 1747721, 1836784, 1979502, 2042911, 2068557, 2053677, 2063661, 2081413, 2056321, 1928634, 1901724, 1823985, 1773058, 1826225, 1878865, 1863567, 1950611, 2003857, 1983477, 2039857, 2241586, 2543408, 2794659, 3111620, 3353991, 3564790, 3605934, 3441312, 3220691, 2923106, 2621869, 2412744, 2301284, 2270941, 2324524, 2258582, 2118577, 1962002, 1916419, 1955418, 2037876, 2099617, 2108248, 2249287, 2340076, 2396420, 2350761, 2293842, 2175864, 2085405, 1981808, 1867636, 1782668, 1658162, 1581967, 1539945, 1538845, 1542482, 1665198, 1855432, 2052472, 2167447, 2078007, 1944618, 1863271, 1722233, 1660050, 1598722, 1468602, 1347528, 1231533, 1065039, 960652, 949598, 886577, 988162, 965658, 902710, 902310, 957361, 983540, 887565, 790164, 719283, 676454, 713854]
9211G13854L7004j5674k4467M3147O2782n5666l3611P6446J4490o6981q6541o3935
9199F00848J5649Q1881Q1781m7126o6823k5887p4801K8967R7300N9822P3405j864
9187H23152j9496j14359l9079p732L7037R961M4061Q122k3277k4511k1849k0428
9175F51602n9564l0731l0878K7051L8038m1669J27060O6539m8718J2579J8252
9164G29561N734l2019J4501m1540K424N1790p1734o1923q0405j52760j573J49900
9152E11956J01089L7198L7938o6284p222J7465m1726J7288l4604j287Q0342l3944
9140F18209p4123m6187K0032K552R3431Q7589M7576N531K5622l9554O2282L4852
9128H37812j12652M8097N0499J2097n6981q8352m0168n0946n2226k9696L1087
$$ y = [713854, 750858, 735184, 710717, 753864, 816646, 760980, 727369, 803815, 818305, 751324, 664783, 600848, 616497, 698378, 780159, 733033, 666210, 640323, 565522, 594489, 691789, 751611, 825016, 823152, 803656, 689297, 650218, 642486, 679523, 689484, 733545, 741667, 718390, 693879, 672030, 651602, 592038, 561307, 530429, 557480, 595518, 553849, 680909, 747448, 698730, 711309, 729561, 735295, 703276, 717777, 676237, 678661, 730451, 658717, 596794, 516389, 363629, 362056, 511956, 613045, 650243, 688181, 621897, 614675, 632140, 590414, 607702, 573098, 571811, 652153, 618209, 544086, 497899, 517931, 520483, 613914, 701503, 749079, 754610, 780232, 740678, 802960, 837812, 725160, 773257, 823756, 835853, 778872, 690520, 650352, 599406, 547180, 517484, 548571]
9117E48571Q0194k4431q2377L7483J6018P0254m8088p877J9698J06557J15185
9106H31187n6555K7952J61452m4891r3451p1662O2233O8274K6629j23756j63901
9095F23511N0005m4964M2597M6891L169J25850N0382J14926O9866P0820J8492
9084A171545n651O1404k4111M5832k4552j0134L2740k2819k8784J4868N6341l8956
9072A227723j3232l6198P3051m5166M6087O1685L8261l584k8371q4630l9272L2558
9060A228912K5669J764j22318l3764K7679J43099j8870O243P7563j283j34296
9049A200398k5839N0018M1405n111o555N0615O0596j54468j02248K3496N7961
9038A190268R1670P3857K1481m7599j6758P665N072k5378k1986K0292K8163M6357
$$ y = [548571, 628765, 604334, 521957, 559440, 575458, 645712, 597624, 589747, 609445, 716002, 831187, 774632, 802584, 964036, 919145, 825694, 754032, 816265, 884539, 911168, 787412, 623511, 673516, 628552, 671149, 718040, 721209, 847059, 897441, 1012367, 1082233, 1153053, 1171545, 1165894, 1227298, 1203187, 1249019, 1224467, 1214333, 1247073, 1224254, 1195470, 1210338, 1266679, 1227723, 1214491, 1178293, 1251344, 1206178, 1252265, 1313950, 1352211, 1348627, 1320256, 1235626, 1196354, 1228912, 1254581, 1256345, 1134027, 1100263, 1127942, 1271041, 1252171, 1258414, 1335977, 1334694, 1200398, 1174559, 1224577, 1265982, 1260871, 1254316, 1304931, 1365527, 1211059, 1108811, 1132307, 1190268, 1281938, 1355795, 1377276, 1329677, 1312919, 1320584, 1325656, 1300278, 1278292, 1298584, 1326747, 1373104]
9026A373104q39O0080P7534O4231p050k5276j4254j1515o2367N1789M7927M1045
9014A594409j6365L8508K4591J06956P783j49755p0538l5323R3926P6759l8152
9003A632799R2443O6678l6800R562N5883n9240j19334o5456N8129K5236O6441
8992A726341J26717Q3898L8384o5644o6423j20505j6651M8432P7017M5622N1349
8981A928537L4202O9728P2510r540K1603L4043K7305O9501n5713N859J21269O9299
8969B388603L1339K7273J9202O946k8043k774J52741L1723J0534j6991J9538J9740
8957B659831L6760m7767n302l4163O9752P6144J71208J23456M9536K4924l3019
8946C091360m7661l4459k7845J32421N5868J01545K6818M4386R732O3668J16904
$$ y = [1373104, 1372265, 1432345, 1509879, 1574110, 1567060, 1541784, 1527530, 1516015, 1453648, 1505437, 1553364, 1594409, 1578044, 1616552, 1641143, 1748099, 1755882, 1606127, 1535589, 1500266, 1594192, 1670951, 1632799, 1725242, 1791920, 1755120, 1764682, 1820565, 1761325, 1641991, 1576535, 1634664, 1659900, 1726341, 1853058, 1936956, 1975340, 1909696, 1843273, 1722768, 1706117, 1754549, 1831566, 1877188, 1928537, 1962739, 2032467, 2104977, 2095437, 2117040, 2151083, 2178388, 2247889, 2192176, 2198035, 2319304, 2388603, 2419942, 2447215, 2466417, 2473363, 2445320, 2442546, 2595287, 2627010, 2637544, 2620553, 2640091, 2659831, 2696591, 2648824, 2643522, 2609359, 2679111, 2755255, 2926463, 3049919, 3099455, 3124379, 3091360, 3043699, 3009240, 2981395, 3113816, 3169684, 3271229, 3298047, 3342433, 3352165, 3415833, 3532737]
8935C532737J12007J64557J83819K2695k5194L4081J28131N0480P7342M8918P8270
8924D407843J80524R4122N6336K6050M3331Q2141N5411J58442J03137J29802J07598
8913E444737Q6256J85368J75865J75540J71366J20496J49821J28963P9952J15356
8903F833720J95963J79329J66515R5916J91571K10268K63356J96841K24175J95935
8893H753589J70899J43217J43408J31696J95287J99403K46896L04496L65147K21416
8883A0875454J85836L65651L19570L52448L66641L28860K45028K90097M11259
8874A3740844L62493L40037L82881N03923N83878M72382N12952M52233N43993
8865A7895616O48869O76899O40413O97210P40118P40393P77851P92521R00599
$$ y = [3532737, 3644744, 3809301, 3993120, 4015815, 3990621, 4024702, 4152833, 4203313, 4280655, 4329573, 4407843, 4588367, 4682489, 4738825, 4764875, 4808206, 4890347, 4945758, 5104200, 5207337, 5337139, 5444737, 5530993, 5716361, 5892226, 6067766, 6239132, 6359628, 6509449, 6638412, 6718364, 6833720, 7029683, 7209012, 7375527, 7471443, 7663014, 7873282, 8136638, 8333479, 8557654, 8753589, 8924488, 9067705, 9211113, 9342809, 9538096, 9737499, 9984395, 10288891, 10654038, 10875454, 11061290, 11426941, 11746511, 12098959, 12465600, 12794460, 13039488, 13329585, 13740844, 14103337, 14443374, 14826255, 15330178, 15914056, 16386438, 16899390, 17351623, 17895616, 18544485, 19221384, 19861797, 20559007, 21299125, 22039518, 22817369, 23609890, 24510489]
8856B4510489R40924R98562J135215J110243J234224J376260J402674J593419
8848C4302010J633858J842898J904514J925344K105350K214951K427542K694123
8840E1050590K884479K985895L249811L544556L739358L987843M257932M564438
8832H0264902M799341N009541N212786N391300N501972N626326N662508N560353
8824A23029029N387243N153632M623642M109934L476982K666595J951456J118106
8816A51516619L75605l77462j274181k003973k542701k983078l348515l641374
8808A35720940l708502l870668l890860l776755l825317l738090l667983l574201
8800A05668564l382091l258184l048935k898445k789688k621827k484533k371075
$$ y = [24510489, 25451413, 26449975, 27585190, 28695433, 29929657, 31305917, 32708591, 34302010, 35935868, 37778766, 39683280, 41608624, 43713974, 45928925, 48356467, 51050590, 53935069, 56920964, 60170775, 63715331, 67454689, 71442532, 75700464, 80264902, 85064243, 90073784, 95286570, 100677870, 106179842, 111806168, 117468676, 123029029, 128416272, 133569904, 138193546, 142303480, 145780462, 148447057, 150398513, 151516619, 151892224, 151514762, 150240581, 148236608, 145693907, 142710829, 139362314, 135720940, 132012438, 128141770, 124250910, 120474155, 116648838, 112910748, 109242765, 105668564, 102286473, 99028289, 95979354, 93080909, 90291221, 87669394, 85184861, 82813786]
8792H2813786k261779k282484k249097k063653j809108j761512j908621j812724
8784F6664808j789754j666546j590882j646588j662288j702755j633069j562175
8776E3410751j695595j525778j452822j473077j404580j463130j462950j339332
8768D1593487j293275j262602j312793j295635j173277j100363j091676j152144
8760C1911722j041208r92189r26501r85319r68105q88418p92446q23749q64171
8751B3629616p52004p39533p41765p29792p16570o05740o25799o51717n19217
8742A7547479n11866n92958m96824n00821m30584m17187m25461l61036l12373
8733A3498369l73563m54455m86333l13192l50935k98863l48319l30443k29485
$$ y = [82813786, 80552007, 78269523, 76020426, 73956773, 72147665, 70386153, 68477532, 66664808, 64875054, 63208508, 61617626, 59971038, 58308750, 56605995, 54972926, 53410751, 51715156, 50189378, 48736556, 47263479, 45858899, 44395769, 42932819, 41593487, 40300212, 39037610, 37724817, 36429182, 35255905, 34155542, 33063866, 31911722, 30870514, 29878325, 28951824, 27966505, 26998400, 26109982, 25317536, 24493787, 23629616, 22877612, 22138079, 21396314, 20666522, 19949952, 19344212, 18718413, 18066696, 17547479, 17035613, 16442655, 15945831, 15445010, 15014426, 14597239, 14171778, 13810742, 13498369, 13124806, 12670351, 12184018, 11870826, 11519891, 11221028, 10872709, 10542266, 10312781]
8724A0312781k47473l87786k37227j50695k98077k05738j37901k09828k54235
8715H183821k35624k22456j81972k07610j98550j30931p0532j43398j83587j35375
8705F473786j37019k09202k27821j40880l8376j16147j00290j03311k04191r2119
8695E104430m7981j67745j38294m0568R937M2389j14507l9008o5262n3006n4182
8684D436203j66541j05841p7233r0458O9670k9541j28573m9134j14203n8748j9513
8673C666088j32512q0477O9465L2562o9129j19344j63268j5063q4412P4504N3925
8662C232339n0814j0701M4895n5335o3894K1224q545j512p5649n7666M6087m794
8650C015635L1384k5426p9507L8468K3835q3321j40445m0804j3976p376j0608
$$ y = [10312781, 10065308, 9677522, 9440295, 9289600, 8991523, 8785785, 8647884, 8438056, 8183821, 7948197, 7725741, 7543769, 7336159, 7137609, 7006678, 6936146, 6792748, 6609161, 6473786, 6336767, 6127565, 5899744, 5758864, 5720488, 5604341, 5504051, 5400740, 5196549, 5104430, 5056449, 4888704, 4750410, 4709842, 4719779, 4762168, 4647661, 4608653, 4543391, 4490385, 4436203, 4269662, 4163821, 4086588, 3996130, 4065800, 4036259, 3907686, 3858552, 3744349, 3685601, 3666088, 3533576, 3453099, 3522564, 3555126, 3485997, 3366653, 3203385, 3188322, 3103910, 3178414, 3232339, 3181525, 3170824, 3215719, 3160384, 3096490, 3117714, 3109169, 3107657, 3032008, 2974342, 3020429, 3015635, 3047019, 3021593, 2942086, 2980554, 3004389, 2921068, 2780623, 2739819, 2725843, 2718467, 2707859]
8639B707859N0552j3505o7385m6441n5288R9679l3038j20647o3125j4862M8746
8628B492545P1978K7350K9061n1889N933j66135r112j8427J2755l1659q3627n867
8616B272906J5003p0046p4817k4373M6440L6837L6596l2516K4795P2628j11196
8605B192257m0729j2987m8133p5215j30103L0355l4172j46396l9016o0915l6138
8594A598808L081N5998L1459j9083j5075K3875J9925L521o0654J5281q7394l0564
8582A539178p0362l7978K7247n0620p9335l8718J2645p981k9270Q991l4589K574
8570A241782p37m949J9659M9996L0387k4899o9658j2169m1643m0381l9454q788
8558A099146J00480l6957p705L4571n7561n6804p9101l7379O0932J14589K1352
$$ y = [2707859, 2758411, 2744906, 2677521, 2631080, 2575792, 2675471, 2642433, 2521786, 2458661, 2443799, 2492545, 2564523, 2591873, 2620934, 2569045, 2574978, 2408843, 2399731, 2381304, 2394059, 2362400, 2278773, 2272906, 2287909, 2217863, 2143046, 2118673, 2165113, 2201950, 2238546, 2206030, 2230825, 2303453, 2192257, 2151528, 2138541, 2090408, 2015193, 1885090, 1915445, 1881273, 1734877, 1695861, 1634946, 1598808, 1601889, 1657887, 1689346, 1670263, 1655188, 1679063, 1698988, 1702509, 1641855, 1657136, 1569742, 1539178, 1468816, 1430838, 1458085, 1407465, 1328130, 1289412, 1302057, 1294076, 1264806, 1273797, 1239208, 1241782, 1241045, 1236096, 1255755, 1305751, 1336138, 1311239, 1241581, 1229412, 1187769, 1147388, 1107934, 1099146, 1199626, 1162669, 1154964, 1189535, 1131974, 1075170, 996069, 958690, 1019622, 1134211, 1155563]
8547A155563k4233q3151O4472j9471l7745j13427q3512J0713l7337j4372N5962
8536H73462J0404j5225L6574M8442j680k6443j06411l6870O3159M7345O9760L8608
8524A001125k4062M2777p3541j08120r2739k6155N4991P8645J62658m9891j42009
8513H23679j55557N4003J19886l0205l328p2944Q483N8299L5217p2883J9249Q6932
8501H70831O2577l8832q6322r8688Q8880J04124N5299m1116q5339n1999j6813
8490G62602O6050L0692q4951j12883o6459j1584Q0601Q0658O3698J0375q8646
8479G30153o8406J7912P2511O5819Q1031j8018q8761j5167p23M9213o5685p0357
8467F89522m1232l374Q320n4058l4249L8214J8144j4775O6710l8083k2695J3300
$$ y = [1155563, 1131330, 1048179, 1112651, 1093180, 1055435, 942008, 858496, 869209, 831872, 817500, 873462, 883866, 868641, 905215, 953657, 951977, 925534, 819123, 782253, 845412, 892757, 962517, 1001125, 977063, 1019840, 946299, 838179, 745440, 719285, 774276, 852921, 1015579, 965688, 823679, 668122, 722125, 842011, 811806, 808478, 735534, 744017, 802316, 837533, 764650, 783899, 870831, 933408, 894576, 808254, 709566, 798446, 902570, 957869, 916753, 831414, 779415, 762602, 828652, 859344, 774393, 661510, 595051, 583467, 664068, 744726, 808424, 818799, 730153, 661747, 679659, 752170, 817989, 899020, 881002, 792241, 777074, 776351, 825564, 759879, 689522, 648290, 644916, 653236, 599178, 564929, 603143, 621287, 606512, 673222, 635139, 612444, 625744]
8455F25744M4620N2504M4157p7560o8957m1519O909j110M6405M7573q0363j16313
8443D82090O4806J10711r710m8265p2305J03067L5660n9025r6145m627k2104n5537
8431D28616J05942L3446p2792k8179N5124K3140j05195j00111K8886K7409J8560
8420D14846L1871O0170Q03L0710n2167n5104q2463J347k2147K9740K1782k3761
8408C55627Q9872j1116o9489J5495N7570l0174J6703R5236o5686j06032m9095
8397B98911L3875J704R2317J1327m5978m0236l3166Q9020p269K505l9189R3794
8385D57615P0407p0469n8769j3261j8378j1427L4669P3517O7353M8562l6807n3994
8373D89018j45872j5337M9938P3925k1155L3618R5450J9930j9038l5765j11776
$$ y = [625744, 670364, 722868, 767025, 689465, 620508, 578989, 585898, 584788, 631193, 678766, 598403, 482090, 546896, 657607, 647897, 599632, 527327, 630394, 666054, 607029, 510884, 506257, 484153, 428616, 534558, 568004, 495212, 467033, 522157, 545297, 440102, 339991, 368877, 396286, 414846, 446717, 506887, 507690, 538400, 486233, 431129, 348666, 350013, 327866, 357606, 379388, 355627, 445499, 434383, 364894, 380389, 437959, 407785, 424488, 519724, 454038, 348006, 298911, 332786, 334490, 426807, 438134, 392156, 351920, 318754, 407774, 400505, 403010, 363821, 457615, 528022, 457553, 398784, 385523, 367145, 355718, 390387, 463904, 531257, 579819, 543012, 489018, 343146, 327809, 377747, 451672, 430517, 464135, 559585, 579515, 560477, 524712, 412936]
8362D12936k6715Q4996j2479M7753K3460j0491o43L3402n4581j23321P1627K4167
8350D70111L1583N9060P7454l0681j833J834K4182O6210n70K1451J8443j9964
8338G17280K1782k1356l8035M416j26286p4877q4302K9351j8518j09720k3054
8327B76681P6026O2828K9502n7746l176L5117l3135q7568k2744Q2346j2827l4053
8315C11251j2448Q5854l5654k5542L5001o46N1394K6193L9323J7757j50199k3473
8303C18811J28706L3691L0951J0038l6112j07692K8295k4277l855Q5643j3718
8292D50481l5386l0175L4981L3697j06100j09133j2295o6330L2448L2371M6926
8281B71485l970K2600k2789L9960j5761k5835n1674n9807J16955L5088l7003M4699
$$ y = [412936, 386221, 471217, 458738, 506491, 529951, 519460, 518817, 552219, 497638, 374317, 445944, 470111, 501694, 560754, 638208, 607527, 605694, 607528, 631710, 697920, 697350, 718801, 737244, 717280, 739062, 717706, 679671, 684087, 557801, 482924, 398622, 427973, 409455, 299735, 276681, 352707, 415535, 445037, 387291, 384115, 419232, 386097, 298529, 275785, 358131, 345304, 311251, 298803, 384657, 349003, 323461, 358462, 357816, 409210, 435403, 474726, 492483, 342284, 318811, 447517, 481208, 512159, 522197, 486085, 378393, 406688, 382411, 378556, 464199, 450481, 415095, 384920, 419901, 453598, 347498, 238365, 226070, 159740, 192188, 224559, 271485, 267515, 290115, 267326, 307286, 291525, 265690, 214016, 154209, 271164, 306252, 269249, 313948]
8269C13948L5214r052n6511n6303o8414o8175K0184J21137L6431j21992p8426
8258F8041M7133M9623L5795J0286L4178O1287L7798o9814K6212j38359j2564J49723
8246B99339M1542J8648R744p6950j7904j3035k93j5590k6653M5922k192l0124
8234B32454l1911k5436J0033M4147R9253J1673r7474k6092J7945J4825j4797n1136
8222A83484R510q733n3564k9119J2771M0303L9580M4086l425m7093j853k5163
8210A60784m1083J5356r1152K0132L3449l0563n8995j18204N519K06644J62620
8199B64507J6675j54197k9824J18039O5687j2195k1280p2627k3490m8505L9397
8188A42187O6939N4519k7205Q890q774j2229l4862m1200p4504J9021R2521p3362
$$ y = [313948, 349162, 340110, 283599, 227296, 158882, 90707, 110891, 232028, 268459, 146467, 68041, 115174, 164797, 200592, 210878, 245056, 306343, 344141, 274327, 300539, 162180, 149616, 299339, 340881, 359529, 369273, 292323, 274419, 261384, 261091, 245501, 218848, 264770, 262578, 232454, 200543, 175107, 185140, 229287, 328540, 340213, 242739, 216647, 234592, 249417, 234620, 183484, 192994, 184261, 130697, 101578, 114349, 154652, 194232, 238318, 234893, 187800, 185947, 160784, 119701, 135057, 43905, 64037, 97486, 66923, 7928, -110276, -104757, 101887, 264507, 281182, 126985, 97161, 215200, 280887, 268692, 247412, 174785, 151295, 102790, 142187, 209126, 263645, 236440, 245330, 236556, 224327, 189465, 148265, 73761, 92782, 185303, 111941]
8176A11941j0568j7975R5651M8828l1861m9480M2817m7621K2132O1469N6318L9290
8164C20941p6627j37337K096Q5357J01886j9866j13586L4823P973O960p6136j18324
8152A8160l9457m7861n405N1454k2849K8536J79510M5900L5653o244n8952k8767
8140A49678M097J0941R292M7943r5666p3224j6200O0822M7487K8455K5729M1757
8128B41111n3568N715P1043m8019l5251K7543P064j10903m3621k8622M1150O3089
8116A36731o6158m1604O9902j9430j986k9103P9173M26J02120J2590n5300l2945
8104A54416q4541m265J4632K1754o3987m512l0926P5314R0220j3659P8451m052
8092B28845k0565l4634j0764R1164P1834k4636j48029N0345Q6447p1836K4436
$$ y = [111941, 101373, 83398, 179049, 227877, 196016, 146536, 189353, 141732, 163864, 225333, 281651, 320941, 244314, 106977, 109073, 194430, 296316, 276450, 162864, 197687, 205660, 212620, 136484, 18160, -21297, -69158, -74563, -23109, -45958, -17422, 162088, 207988, 243641, 237397, 178445, 149678, 153775, 164716, 174008, 221951, 126285, 53061, 36861, 97683, 145170, 173625, 199354, 241111, 187543, 193258, 264301, 216282, 181031, 208574, 215638, 104735, 61114, 32492, 73642, 136731, 70573, 28969, 98871, 79441, 77455, 48352, 127525, 127951, 230071, 242661, 187361, 154416, 69875, 65610, 80242, 101996, 38009, 33497, 2571, 77885, 168105, 154446, 232897, 228845, 208280, 173646, 162882, 254046, 325880, 301244, 153215, 203560, 290007, 218171, 242607]
8081B42607p231q6576L9516k8920J4018J1529j28513J762K9051L7873K0748k7320
8069A18544N1458O5507m5270j2413l2184p4804l9769Q2383M5280n2249o7097J09533
8057A48919Q8382m9801l9961l250l2211P7178Q8622j1363n8993o4574k5192L0901
8045A48657R0968p7475p5723J0747J1860L175J28518J5820j05753J3583m7111
8034A17266k3370Q0481L896m4121m7135l5821l8184M3414J5769j03970L1845J11193
8022A11263R3621k0111j44476m2083N9070O9702M9808k8707j6864J17658O0230
8011C09111j2761r275j0372j38113o5731K7595M8092j008o1629L2802L7786j3659
7999A42838k085l8521M2877Q8493q1639K9028j38j08084l7803L0479R179J6411
$$ y = [242607, 235376, 148800, 188316, 159396, 173414, 184943, 56430, 58192, 87243, 125116, 145864, 118544, 170002, 235509, 190239, 177826, 145642, 70838, 31069, 113452, 158732, 106483, 39386, 148919, 237301, 187500, 147539, 144289, 112078, 189256, 277878, 266515, 207522, 142948, 117756, 148657, 239625, 162150, 86427, 97174, 109034, 112209, 240727, 256547, 150794, 164377, 117266, 93896, 174377, 178273, 134152, 87017, 51196, 13012, 56426, 72195, -31775, 70, 111263, 204884, 184773, 40297, -1786, 57284, 126986, 176794, 148087, 131223, 248881, 309111, 296350, 287075, 276703, 138590, 72859, 100454, 148546, 147538, 85909, 118711, 156497, 142838, 140753, 102232, 145109, 233602, 151963, 180991, 180853, 72769, 34966, 65445, 74624, 91035]
7987I1035O1858P239N0701L7922n0430K4588k3883k0098N7324l8059M5760O586
7975B50543q3405N5332K2551j7966q5618j30181j5417K6513J63425K1587k1120
7964A86244m1821n011j3785m9797O2529m735o6116k9183l5889R835M0063M9435
7952A01769j5197L1572N7950L2379m0865M928n0489k8248M8488N8567P383J6024
7940B24261o895J1011j3157j25680r4937j11687P3586Q9551K142J39961K8903
7929B17059N8749r097q774q3727L0179j006r4308n919L9944Q498L127n330J5235
7916A64630l807m8977L2142J9690Q319m365k2089j6801l6015p3110j9153O1588
7904F2052P4010M0735j03242K4784P1474O4511o8057q8005j6401k644q3424m8184
$$ y = [91035, 152893, 160132, 210833, 248755, 198325, 222913, 199030, 178932, 236256, 198197, 243957, 250543, 167138, 222470, 245021, 227055, 141437, 11256, -4161, 22352, 185777, 207364, 186244, 144423, 139412, 125627, 75830, 138359, 133624, 67508, 38325, 2436, 12271, 52334, 101769, 86572, 118144, 176094, 208473, 167608, 172536, 122047, 93799, 142287, 200854, 208237, 224261, 217366, 228377, 215220, 89540, -5397, -117084, -43498, 46053, 48195, 188156, 217059, 275808, 266711, 257937, 174210, 204389, 203383, 109075, 103156, 143100, 151598, 154725, 149395, 164630, 160823, 111846, 143988, 163678, 171997, 167632, 145543, 128742, 92727, 19617, 464, 62052, 136062, 176797, 73555, 98339, 169813, 234324, 166267, 78262, 61861, 59217, -24207, -72391]
7892g2391L8547N5887r4109p7376Q9400J4790j23428j4818M4537P8885J31090
7881G1014Q5149j05858Q662N8930R9589p72J2544j06588p6580j20380l8711r21
7869a13922L7848P2697j2122l6494L623L5585N3209O2691R1035r9443r9081o3457
7857f7831K5379J18433O6988k1728r8447J07212K7306k1122n647J1281L456n3446
7845I1834j5597L9844j0172m9084r8611o3286M4629Q2555o2108n7602k226O875
7833i2949P1434N8125J6626N6707J06872l8450p9204j094j18938P7319n696r3774
7821d3022J13860R5032m1499l4014l2776J798n2848m0921o966L0217L7019J00074
7809A25954J4074J365q999J8336N1088m1777q5695O070N778r3638k0874M0696
$$ y = [-72391, -33844, 22043, -72066, -149442, -60042, -45252, -168680, -183498, -138961, -60076, 71014, 156163, 50305, 58967, 117897, 217486, 216714, 229258, 122670, 46090, -74290, -113001, -113922, -76074, -3377, -15499, -51993, -48370, -12785, 40424, 103115, 194150, 94707, -4374, -67831, -42452, 75981, 142969, 121241, 22794, 130006, 157312, 136190, 130543, 141824, 145280, 91834, 76237, 116081, 105909, 56825, -41786, -105072, -60443, 22112, -39996, -97598, -99824, -92949, -21515, 36610, 53236, 109943, 216815, 178365, 99161, 98067, -20871, 56448, 50752, -43022, 70838, 165870, 124371, 90357, 57581, 59379, 6531, -34390, -41356, -11139, 25880, 125954, 140028, 141393, 132394, 150730, 201818, 160041, 74346, 80416, 86194, -7444, -28318, 12378]
7797A2378O6367J4024j80288o6016J27987L9700K9799j1060o3757P1218p059m906
7785B8387P231Q5301K002k6863J9122k2973j15348J695O7855O103j8070r880j7242
7772G320N4855N1430m5439l7206j6648r054M6181N543J2777K8073j1914O6388
7760A52306J5014k6219O9804N8947n6381l4313K9866k3830k2126j31912o3098
7749c1942o5654K6358J14149O1326J0351L5942R2441L0404j00982m8356k9523
7738I4514r5647N4413M9932J4994q1402o0649M9335L737l3254l8529P099P2515
7726C7058Q7975l1705J7337k2162q7175r5272l1292K2701j9232P0436N3858J0485
7714A3012j34970j03026O0016J13613M6839n8224K3140j8884M8532N3190O2694
$$ y = [12378, 78745, 92769, -87519, -153535, -25548, 14152, 43951, 32891, -30866, 40352, 33293, 28387, 35618, 120919, 122921, 96058, 115180, 92207, -23141, -21446, 46409, 52512, 34442, 24562, 7320, 62175, 113605, 68166, 30960, 14312, 5258, 51439, 56982, 69759, 97832, 85918, 152306, 167320, 141101, 210905, 269852, 213471, 179158, 209024, 185194, 163068, 31156, -31942, -97596, -71238, 42911, 104237, 114588, 150530, 242971, 273375, 172393, 124037, 94514, -1133, 53280, 103212, 118206, 36804, -23845, 25490, 29227, -4027, -42556, -35457, 37058, 125033, 93328, 110665, 88503, 1328, -93944, -125236, -102535, -121767, -51331, 2527, 13012, -121958, -224984, -164968, -51355, -4516, -62740, -39600, -58484, -9952, 43238, 105932]
7703A05932O8389L0374j35475q3801o4098k2666n0545R0589Q5416K9099l0572
7692B2642O0597M5030k6437J5386j11165L2515P6992o001q5695m8534J03399o61
7680G8068m6804R0285Q7885n7895j20300p4882o5629N2487N0448J5705k32K855
7668A1991J8372n4477K2568L1413m7627l0366J02425N061l1451k8421N6913l8712
7656A7689m1990l791J5467K7524O6828L6973m754q611K0239n1073p7869j48811
7644a52179p7210O0793J66355J1926k1457Q1609M7178l6567l8974o8176n3008
7633g9710r93o5373k2433M6075O2552K9153o5526O3845P9352l837k3977M9957
7621F9085j7241j8219K588m1927j17533m9985R4284Q2194O2772o792r455r6734
$$ y = [105932, 174321, 204695, 69220, -14581, -78679, -101345, -151890, -61301, 24115, 53214, 22642, 83239, 128269, 101832, 117218, 6053, 38568, 115560, 109559, 23864, -24670, 78729, 78068, 31264, 121549, 209434, 151539, 31239, -43643, -109272, -56785, -6337, 9368, 9136, 11991, 30363, -24114, -1546, 29867, -17760, -48126, 54299, 59360, 27909, -512, 56401, 17689, -24301, -28092, -12625, 14899, 81727, 118700, 113946, 105335, 125574, 74501, -3368, -152179, -229389, -168596, -2241, 9685, -11772, 69837, 117015, 80448, 41474, -26702, -79710, -80703, -146076, -168509, -122434, -59882, -30729, -96255, -32410, 46942, 43105, 19128, 69085, 51844, 33625, 36213, -5714, -123247, -173232, -78948, 3246, 66018, 59226, 49771, -46963]
7609d6963J32306P6720p3819j1418N070q6124q3730O3779R8866k1078l8147M86
7597A5948R0327K0881l7183j5757m3620M4579K624J768K6030p0508m3426K1304
7585A2967l0888M938l752K3420o4422L0817P2003o0154m5519L0025O2545k0616
7573A1364q6260M5948J08434m4896l3817K3417L7070M2765o2911m9135j6144J4481
7561i684K0075j9466P5864L6357M9516n8357j28382m2963M1025R5143P3874o6963
7549F6039p0133o7196K3987p4806J3320k1089J5733K1181j4152L71L271m7576
7537a51050O1887K6991K2724P4253k155P0396J2065o9965m107n9527k960o11P0595
7524D8536J5198k7161o109J11R4444m1539m1840L2584M9503K2286j9421K8106
$$ y = [-46963, 85343, 162063, 88244, 76826, 81896, -4228, -87958, -24179, 74687, 53609, 15462, 15948, 106275, 127156, 89973, 74216, 30596, 75175, 77799, 79567, 105597, 35089, -8337, 12967, -17921, -12983, -16735, 6685, -57737, -26920, 45083, -15071, -60590, -30565, 31980, 11364, -74896, -28948, 79486, 34590, 773, 24190, 61260, 104025, 41114, -8021, -24165, -9684, 10391, -9075, 66789, 103146, 152662, 94305, -34077, -77040, -36015, 59128, 133002, 66039, -4094, -71290, -47303, -122109, -108789, -129878, -114145, -92964, -107116, -106745, -103474, -151050, -89163, -62172, -39448, 34805, 32650, 103046, 115111, 45146, 41039, -18488, -21448, -22059, 48536, 63734, 36573, 30464, 30575, 125019, 83480, 41640, 74224, 123727, 146013, 126592, 154698]
7512A54698o099p3365L5101j8804n4748m4401J9941l8090n248O8724J7303J2277
7500F7289N6453m8744p441p9248M5625K8448j8000k7478p9447m6083j0540q570
7488a27736j4646N8865P5163k6547j3962k7263P2554L5094M6917L3747L193j34887
7476a9508K9411J36496k5301p7559k5674K7566O0948l5256j9554m2898r9477l4736
7464a25542J115M0048J6413l752l9392P1474l0253k3416K456p7315m146J30129
7452d2181J8840j0250J6104k6518l6005m0460L9084N6837M3999j9119o0373j5418
7440g5460j7569k5037K4153k104l6107N4267K2501N6212M2251O1319J38301J9489
7428B62216r6638j01901O39P7057J8115j7386r7266L8461n82n6126o5706j2471
$$ y = [154698, 148599, 75234, 110335, 91531, 36783, -7618, 12323, -25767, -31015, 37709, 55012, 67289, 123742, 74998, 67557, -11691, 33934, 62382, 44382, 16904, -62543, -108626, -119166, -127736, -142382, -83517, -8354, -34901, -48863, -76126, -3572, 31522, 78439, 112186, 115379, -19508, 9903, 146399, 121098, 43539, 17865, 45431, 106379, 71123, 51569, 8671, -90806, -125542, -124427, -84379, -67966, -71718, -111110, -39636, -69889, -93305, -90849, -168164, -172310, -42181, -23341, -33591, -17487, -44005, -80010, -120470, -81386, -24549, 19450, 331, -60042, -75460, -93029, -118066, -93913, -96017, -132124, -77857, -55356, 856, 43107, 104426, 242727, 262216, 165578, 63677, 64316, 141373, 159488, 142102, 44836, 83297, 82715, 26589, -39117, -51588]
7416e1588O8808L9174r2975m394J0711o3036m8066M602J7507J07075L9286o5654
7404c8550L1088n8070m194J8576Q685n4888o1065j9259J6362J2217K4361M4412
7392h0325l499j14256l0694N3276J40474O6671J1688O5826L124m8122l3983L4865
7380F5045Q3831K2377k0771o0858J6401n588j14341O4595J03327Q9106j07959
7369A35165j46887n8938m7213N1950Q4635l6293J5213K8777p552p9005N4190N4720
7357D8762J48421p960p3097n8710l688L0866K0291p1489l8981j1697k8837J2678
7345c3441p791M4520J7991m8492M678L9489j8522k8269k8948o0436m534Q3693
7333d0062N2998m8857M2570l5081J5489j5018j8426m393M5461J27233Q4836K6598
$$ y = [-51588, 17220, 56394, -36581, -40975, -30264, -93300, -141366, -136764, -119257, -12182, 27104, -38550, -7462, -65532, -69726, -51150, -42465, -97353, -158418, -177677, -161315, -149098, -124737, -80325, -83824, -198080, -228774, -175498, -35024, 31647, 43335, 109161, 112285, 64163, 30180, 65045, 148876, 171253, 150482, 89624, 106025, 100437, -13904, 50691, 154018, 243124, 135165, -11722, -70660, -117873, -65923, 18712, -17581, -2368, 26409, 18857, -60148, -5958, 48762, 197183, 189223, 116126, 57416, 53728, 84594, 104885, 33396, -5585, -17282, -46119, -33441, -41232, 3288, 21279, -27213, -22535, 16954, -1568, -29837, -58785, -119221, -123755, -40062, 12936, -35921, 6649, -28432, -12943, -27961, -46387, -50780, -5319, 121914, 206750, 233348]
7321B33348j19117j33063o8282P2493N5988j7419P6406m0032k0309O1905n2317
7310D9601j03075o112P3242N541j9560l7085N6776L8929k3435l9454m1944L1854
7298a4722M8988L7412j447o2583J47949K2954l0007j7933q4678p1618n6081N0462
7286c1304J9280o0498l801n4250j7521l1625N8947N7088k1435K414L6657m6027
7274i2075n3693k0227J16508Q811K2057M914J02764J6151o2038p7222M8494O9687
7262H4131k2529k8528m9722j13933m9821K8454L3910k2351j8474J3242Q6852Q4587
7250B5818k1082o1428j4391L8105J3412N261l8186l6906j7775K6838L079j8383
7238i5638M5495R4154O2750J2095k7942j2908K5840o383k1038k4762j7557P4218
$$ y = [233348, 114231, -18832, -87114, -14621, 41367, 23948, 100354, 60322, 40013, 101918, 49601, -53474, -59586, 13656, 19197, -363, -37448, 19328, 58257, 34822, -4632, -46576, -14722, 34266, 71678, 70231, 7648, 155597, 178551, 148544, 130611, 45933, -25685, -81766, -31304, -12024, -72522, -76323, -130573, -148094, -179719, -120772, -63684, -85119, -82705, -46048, -92075, -145768, -165995, -49487, -40676, -18619, -13705, 89059, 105210, 43172, -34050, 14444, 84131, 61602, 33074, -16648, -130581, -180402, -151948, -118038, -140389, -158863, -145621, -58769, 25818, 4736, -56692, -71083, -32978, -19566, -14305, -52491, -89397, -107172, -80334, -77255, -95638, -50143, 44011, 106761, 118856, 90914, 78006, 103846, 97463, 76425, 51663, 34106, 108324]
7226A08324P1404J7837n6843o9984J4593K0170m7625n4943j7495r7671K6972P709
7214g7552l3566K1955l541k4800M5786l9609l7630J69239J02641m4950q8613j10279
7202a20919K343J20916M6600J5904L357p1118j0382p0198l4334M3501P2618k3592
7190b5304k6043K7691O3624j550p6135j4388M3610L116K8899J30009m076j21818
7178B7635p5304J4645O7455J5439O1062O9652N0460j1929j29654n5563k7187K7330
7166C4041R440J16475P1592K2865j477l6090r4455r1827o241M5769M313q0459
7154f054k7900K4848J2106L2194R260l2014K6952p5285l6789Q7935K6427J0774
7142E2454j70040J742J02111k4531k9992P7990n2526j3389k7738j29827M9322
$$ y = [108324, 179728, 197565, 140722, 70738, 85331, 105501, 57876, 2933, -14562, -112233, -85261, -77552, -111118, -89163, -92704, -117504, -71718, -111327, -148957, 20282, 122923, 77973, -10640, -120919, -118576, 2340, 48940, 64844, 68201, -2917, -13299, -83497, -117831, -74330, -1712, -25304, -51347, -23656, 39968, 38418, -37717, -52105, -8495, -5379, 23520, 153529, 149453, 27635, -47669, -33024, 34431, 49870, 110932, 180584, 231044, 219115, 89461, 33898, 6711, 34041, 43481, 159956, 231548, 254413, 252936, 216846, 122391, 30564, 24323, 70092, 74405, -6054, -33954, -9106, 3000, 35194, 44454, 12440, 39392, -35893, -72682, 15253, 41680, 52454, -117586, -115844, -13733, -38264, -68256, 9734, -42792, -56181, -83919, -213746, -164424]
7131a64424J16696m498M3030k9702r1398P9121N9983r8095M0782kK8535L1510
7119A1538o2585N9322O1710j7997L763J35193M8043m2211j04835j452r5681n2675
7107e7867P7168L1905j21764j09395p432J00893J19367Q9853j6740n9698m5490
7096H00j20604J4311K4099m8273L6691K6910m1128R8274l0648n1142J5085K4201
7084e1424L173L6439Q4557K5190M728j11078k0679K4814L157L3122l5995j04726
7072a08722k826K8871L5566Q8879M8685k9644n8698N4725K47q9881q5156K6392
7060i1562Q281m0186N2447K877K2731N3918Q0915L6166j32856m0931o742K6834
7048b8108P9258K2613r426p1928k9267M4749Q8241K5994m9462l0169m3987o2685
$$ y = [-164424, -47728, -52226, -9196, -38898, -130296, -51175, 8808, -89287, -48505, -48507, -19972, 11538, -51047, 8275, 69985, 51988, 55751, 190944, 238987, 196776, 91941, 90489, -5192, -57867, 19301, 51206, -70558, -179953, -187385, -86492, 32875, 122728, 105988, 46290, 800, -119804, -105493, -81394, -129667, -92976, -66066, -107194, -8920, -39568, -90710, -75625, -51424, -48251, -11812, 72745, 97935, 102663, -8415, -29094, -4280, -1123, 31999, -3996, -108722, -111548, -82677, -47111, 41768, 90453, 60809, 2111, 56836, 57083, -32798, -117954, -91562, -83281, -123467, -71020, -68143, -45412, 8506, 89421, 125587, -7269, -48200, -54942, -28108, 51150, 73763, 64337, -7591, -36858, 7891, 96132, 122126, 72664, 42495, -1492, -64177]
7036f4177n5346k4942Q5008J2629j946O6119m937j00209n0080M6600R9736L237
7024A1692l5707M6103Q064m7568J1382p127M3669N3058n802l305m0707q6651n7271
7011a10170J7846k5683N2140N1822j4599j17671K2677J24316R0492O9290J13996
7000B74456Q7684o4556j14818l5618q7300L1548J235J6909M3148o9637l2994k9064
6988B0993k5755l2139j6593j7551k1640j03822M5894J17824r665N2953m6629j04119
6976a40249L547R0296J6334J2964j4269r683L3398l575J8413K098j7332l6682
6964d4740N3579J5157l3288K6276M4100m4172m2146j33986O8585J09978j9024
6953C19q418K4818L3009J493k0938m6152q3473J9276Q0228J1380o5464J0895R594
$$ y = [-64177, -119523, -144465, -59457, -46828, -48774, 17345, 12408, -87801, -137881, -91281, 8455, 11692, -24015, 22088, 30152, -17416, -6034, -13161, 30508, 83566, 77764, 74459, 33752, -52899, -110170, -92324, -118007, -65867, -14045, -28644, -146315, -123638, 678, 91170, 160460, 274456, 362140, 297584, 182766, 147148, 59848, 91396, 92631, 109540, 152688, 83051, 50057, 20993, -4762, -36901, -53494, -71045, -92685, -196507, -150613, -32789, -42454, 10499, -36130, -140249, -136702, -46406, -30072, -17108, -31377, -41060, -7662, -11237, 7176, 9274, -8058, -44740, 8839, 23996, -9292, 16984, 61084, 16912, -25234, -159220, -90635, 19343, 319, -8099, 16719, 49728, 51221, 30283, -15869, -99342, -80066, 162, 11542, -53922, -43027, -33433]
6940c3433l1634k0463j8266L792K5315k4376K0298k076k1703Q5197O0566J7996
6928F1213j04592p3001J21858p4329l7493p613Q4892M4274q660K0612P2513O6712
6916A66386q4829j32442r3606j4969K0022J1281N8306J8608L0695m7093l8396
6905a06037J87105j132j10818M011L2085j3413R9865L1896L8391J069o4175k5951
6893G2896q129l2877j09469n342Q4634j9693J4834J8772m4104l9912K217Q583
6881e7590k9835N7742j8591o678J884m6965Q7266J29735r478p7701o1116m0677
6869g2004L9962P965j07285K9657M1003M3311N6692j18111j00922N8580k2063
6858a43215K9161K3141J02475P2853j35813q1277j6219k3475R9853N6487K9917
$$ y = [-33433, -65067, -85530, -103796, -100004, -74689, -99065, -78767, -80843, -102546, -17349, 43217, 61213, -43379, -116380, 5478, -68851, -106344, -113957, -29065, 15209, 6549, 27161, 99674, 166386, 81557, -50885, -144491, -159460, -139438, -128157, -69851, -51243, -20548, -67641, -106037, 81068, 79936, -30882, -26871, 5214, -8199, 91666, 123562, 161953, 163022, 98847, 72896, 64767, 31890, -77579, -82921, 1713, -17980, -3146, 15626, -28478, -68390, -66173, -57590, -87425, -29683, -48274, -54952, -53068, -100033, -12767, 116968, 107490, 29789, -31327, -72004, -32042, -24077, -131362, -101705, -60702, -17391, 39301, -78810, -179732, -121152, -143215, -114054, -90913, 11562, 84415, -51398, -132675, -148894, -172369, -72516, -16029, 13888]
6847A3888n3311k0955J06920n829r8175J793N6806q724j0975n9773j5104r29J06919
6834A2551r42P299J7292j7131O5227J3434j05485q6676N8452K8221k9926J0369
6822b7315P2209n766j3377J3789M6177q84n212n687l4144q5992J024j0271q1625
6809a37074N4471P251O8492L7460j5707k3882o1124m3782L0138P3160K1273k4934
6797a4258J9146k8443J3937j1270K4604P7413N988K1738p051j26278K0113O2316
6785E7955P1198o7187l046k1044j066R064n9223m4996N9590Q722L1904J011p2871
6772b9989r353o3365J1098J00864J01268o4949l8039L6303k7306o3688M1552J3797
6760H193R3193J2697N7342m07k5731j05050m5816M5317P4378j0954m5659j12441
$$ y = [13888, -39423, -60378, 46542, 40713, -57462, -55669, 1137, -7587, -18562, -78335, -93439, -94368, 12551, 11609, 18908, 36200, 19069, 84296, 97730, -7755, -94431, -35979, -7758, -37684, -27315, 44894, 39128, 25751, 39540, 85717, 84833, 79621, 73934, 39790, -46202, -45178, -55449, -137074, -82603, -75352, -6860, 30600, 14893, -8989, -70113, -113895, -83757, -10597, 10676, -14258, 4888, -23555, -9618, -20888, 3716, 81129, 87117, 108855, 101804, -24474, -4361, 57955, 129153, 61966, 58920, 37876, 36810, 45874, -13349, -58345, 1245, 9967, 41871, 42882, -29989, -39342, -102707, -91609, 9255, 110523, 45574, 7535, 43838, 16532, -47156, -5604, 8193, 101386, 114083, 171425, 171018, 145287, 40237, -5579, 39738, 114116, 103162, 57503, -54938]
6748e4938k6170O8310j02780p9663o6413J5567K8776P3931J22657J1510M1765
6737C2552j25844l8759J7041N4105L7603Q9453m888L55J3217O9345J09599l9038
6725B14741n2792p0291n9458k9485k686K2282m680o5402M7643M254l1743k5552
6713e3169N4906P2572m2731J359k535K5975r860N4030R5414K4939l4068o3796
6701A23036P891k650l6372q2833l9316l5539p173l984J01118N944M8410K248j9517
6688F1263k6287j1850q047K0823k7304L5880K212m7105K8575l8309J3547J3785
6676A7183M1089J0622o9297n1322n244o314l2959P1090m2010m1335M1778M5141
6664b1578K4924o1461J5411o1647N0190P7043k4164k5807p5630l553P9836N0952
$$ y = [-54938, -81108, -12798, -115578, -195241, -261654, -246087, -217311, -143380, -20723, -9213, 32552, -93292, -132051, -115010, -60905, -23302, 66151, 61263, 61618, 74835, 144180, 253779, 214741, 161949, 91658, 32200, 2715, 29, 22311, 17631, -47771, -128, 4126, -27617, -53169, 1737, 74309, 31578, 32937, 30402, 56377, 46517, 100547, 195961, 220900, 186832, 123036, 130927, 128277, 91905, 9072, -30244, -65783, -72956, -76940, 24178, 30122, 78532, 80780, 61263, 34976, 23126, 15079, 35902, 8598, 44478, 46690, -415, 28160, -10149, 3398, 17183, 58272, 68894, -403, -51725, -56969, -63283, -96242, -25152, -67162, -108497, -66719, -21578, 3346, -58115, -42704, -104351, -54161, 22882, -1282, -27089, -102719, -106272, -26436, 24516]
6652B4516k2614n350p7247L0903L309K3564l007K2048q3857K2172J22321k3742
6640C3016o7777r8947J4092m6806J5576L3652N3185K5224k2493K2m3373P2205
6628c2424K4476N5159k4159r778j012r268K9452m3902O6589O2641j1009j12839
6616f074q7552J2294L8095l2126J0937L7382p9770R1534N0924j5380j6709k3372
6604a9817P1483K4970r7290o3652L1327M7141q471o31J3849l6002O1407P5327
6592I9641q0318j21904l8222L7098l8489M3341J17514M276q8530q7307R3635J10670
6580E1405q6663J0347N8968J31667N5039n8113j63946l7200M077N0141l4040j2310
6568c0628L1879N3458M3209K9540l7422J1625P346k2070r393m6991K7778p3580
$$ y = [24516, 1902, -3448, -80695, -49792, -46483, -22919, -25926, -3878, -87735, -65563, 56758, 33016, -34761, -133708, -119616, -166422, -150846, -117194, -64009, -38785, -61278, -61256, -104629, -32424, -7948, 47211, 23052, 13274, 12262, 2994, 32446, -11456, 55133, 117774, 106765, -6074, -93626, -81332, -43237, -75363, -64426, -27044, -106814, -15280, 35644, 20264, 3555, -19817, 51666, 76636, -20654, -84306, -52979, -5838, -14309, -14940, -1091, -37093, 24314, 99641, 19323, -102581, -140803, -103705, -142194, -98853, 18661, 22937, -65593, -152900, -59265, 51405, -35258, -24911, 34057, 165724, 220763, 162650, -1296, -38496, -34419, 15722, -18318, -30628, 1251, 54709, 97918, 127458, 90036, 101661, 109007, 86937, 77544, 30553, 58331, -15249]
6556a5249L8368j2718q095j06748O9796K110J9597J8696L6100n1370L6479O7428
6544I4394p3570J6619P8263P2016k5190j8706n8348j02269O060L2414o5751l0590
6532g4658l2102l0358N815L5108j6862o0915P3040N6816J27776O140q3398j4911
6520h509l9581M9988O2793N6926j0251k4635p8510q5843K6692o9545K2837R9300
6508A662J4712K6990K0892r467l5031K3633o1873n1549K1171j2980K7901q4497
6496a18436J7204L3691P2832O0251M816n7845M7455J1201k4915j6643R014o9636
6484c1011k9618N0169M9043K1340Q12l091Q586N8349O691j9401o4023p6610o1355
6471i0119l5382K1993N7356K8433m1974L4116j7835j38611R5288J03406K0192
$$ y = [-15249, 23119, 10401, 2306, -104442, -34646, -32536, -12939, 5757, 41857, -9513, 26966, 94394, 20824, 37443, 115706, 187722, 162532, 143826, 85478, -16791, -10731, 21683, -44068, -74658, -106760, -137118, -131303, -96195, -113057, -173972, -100932, -44116, 83660, 89800, 6402, -8509, -48090, 1898, 64691, 121617, 111366, 86731, 8221, -77622, -50930, -120475, -97638, 1662, 16374, 43364, 64256, 54789, 19758, 43391, -18482, -70031, -48860, -61840, -33939, -118436, -101232, -67541, 5291, 65542, 70358, 12513, 59968, 71169, 46254, 29611, 38625, -31011, -60629, -10460, 38583, 59923, 60735, 57644, 66230, 124579, 131270, 111869, 47846, -28764, -90119, -125501, -103508, -46152, -17719, -59693, -25577, -43412, -182023, -86735, 16671, 36863]
$$ [...]
##END NTUPLES=NMR SPECTRUM
##END=
