##TITLE=Analysis number 321053
Compound Code cc 37601
Book Reference 495/20
Project Code adrs
Chemist Name stevep
##JCAMPDX= 6.0         $$ Bruker NMR JCAMP-DX V2.0
##DATA TYPE= NMR SPECTRUM
##DATA CLASS= NTUPLES
##ORIGIN= Bruker BioSpin GmbH
##OWNER= nmr
$$ XWIN-NMR		Version 3.5
$$ Fri Jul 21 11:28:10 2006 GMT Daylight Time (UT+1h)  MAYBRIDGE\nmr@NMR_250MHZ
##.OBSERVE FREQUENCY= 250.131544655141
##.OBSERVE NUCLEUS= ^1H
##.ACQUISITION MODE= SIMULTANEOUS (DQD)
##.ACQUISITION SCHEME= undefined
##.AVERAGES= 16
##.DIGITISER RES= 18
##SPECTROMETER/DATA SYSTEM= dpx250
##.PULSE SEQUENCE= zg30
##.SOLVENT NAME= DMSO
##.SHIFT REFERENCE= (INTERNAL, DMSO, 0, 16.522)
##AUDIT TRAIL= $$ (NUMBER, WHEN, WHO, WHERE, WHAT)
$$ ##TITLE= Audit trail, XWIN-NMR		Version 3.5
$$ ##JCAMPDX= 5.01
$$ ##ORIGIN= Bruker BioSpin GmbH
$$ ##OWNER= nmr
$$ C:\u/data/dgb/nmr/ADRS/3230/pdata/1/auditp.txt
$$ ##AUDIT TRAIL=  $$ (NUMBER, WHEN, WHO, WHERE, WHAT)
(   1,<2006-07-21 11:27:45.94 +100>,<MAYBRIDGE\nmr>,<NMR_250MHZ>,
      <created by zg, POWCHK disabled, PULCHK disabled
       configuration hash MD5:
       E2 DF 36 D8 04 B2 41 60 5A D7 A3 38 5A 4B D0 FE
       data hash MD5: 64K
       B1 06 07 E1 E0 D7 F3 99 E8 8E 83 65 1F 90 F1 F4>)
(   2,<2006-07-21 11:27:58.31 +100>,<MAYBRIDGE\nmr>,<NMR_250MHZ>,
      <Start of raw data processing
       ef LB = 0.3 FT_mod = 6 PKNL = 1 SI = 32K 
       data hash MD5: 32K
       16 F1 F7 07 A3 44 25 AF D0 E6 36 A9 10 40 32 1C>)
(   3,<2006-07-21 11:27:59.97 +100>,<MAYBRIDGE\nmr>,<NMR_250MHZ>,
      <apk 
       data hash MD5: 32K
       55 7E 18 05 09 22 E4 03 11 11 63 FA 2D A3 A9 6D>)
(   4,<2006-07-21 11:28:00.73 +100>,<MAYBRIDGE\nmr>,<NMR_250MHZ>,
      <abs ABSG = 5 
       data hash MD5: 32K
       77 82 2A 0C DE 72 26 B6 AE 65 2B FA C6 AC C3 69>)
$$ ##END=
$$ 
$$ hash MD5
$$ DC 33 D6 A0 60 81 7B E1 25 6B F9 36 D8 5D 46 E6
##$RELAX= 
##$RELAX= 
##$RELAX= 
##$RELAX= 
##$RELAX= 
##$RELAX= 
##$RELAX= 
$$ Bruker specific parameters
$$ --------------------------
##$DU= <C:\u>
##$EXPNO= 3230
##$NAME= <ADRS>
##$PROCNO= 1
##$TYPE= <nmr>
##$USER= <dgb>
##$AMP= (0..31)
100 100 100 100 100 100 100 100 100 100 100 100 100 100 100 100 100 100 
100 100 100 100 100 100 100 100 100 100 100 100 100 100 
##$AQSEQ= 0
##$AQ_mod= 3
##$AUNM= <au_zg>
##$AUTOPOS= <12 >
##$BF1= 250.13
##$BF2= 250.13
##$BF3= 250.13
##$BF4= 250.13
##$BF5= 500.13
##$BF6= 500.13
##$BF7= 500.13
##$BF8= 500.13
##$BYTORDA= 1
##$CFDGTYP= 0
##$CFRGTYP= 5
##$CHEMSTR= <none>
##$CNST= (0..31)
1 1 145 1 1 1 1 1 1 1 1 1 1 1 1 1 1 1 1 1 1 1 1 1 1 1 1 1 1 1 1 1 
##$CPDPRG= <>
##$CPDPRG1= <>
##$CPDPRG2= <>
##$CPDPRG3= <>
##$CPDPRG4= <mlev>
##$CPDPRG5= <mlev>
##$CPDPRG6= <mlev>
##$CPDPRG7= <mlev>
##$CPDPRG8= <mlev>
##$CPDPRGB= <>
##$CPDPRGT= <>
##$D= (0..31)
0 1 0 0 0 0 0 0 0 0.06 0 0 0 0 0 0 0.0002 0 0 0 0 0 0 0 0 0 0 0 0 0 0 
0 
##$DATE= 1153477664
##$DBL= (0..7)
120 120 120 120 120 120 120 120 
##$DBP= (0..7)
150 150 150 150 150 150 150 150 
##$DBP07= 0
##$DBPNAM0= <>
##$DBPNAM1= <>
$$ [...]
##$SUBNAM7= <"">
##$SUBNAM8= <"">
##$SUBNAM9= <"">
##$SW= 20.6930455092707
##$SWIBOX= (0..15)
0 0 3 0 0 0 0 0 0 0 0 0 0 0 0 0 
##$SW_h= 5175.983436853
##$TD= 65536
##$TD0= 1
##$TE= 295.16
##$TE2= 300
##$TE3= 300
##$TEG= 300
##$TL= (0..7)
0 120 120 120 120 120 120 120 
##$TP= (0..7)
150 150 150 150 150 150 150 150 
##$TP07= 0
##$TPNAME0= <>
##$TPNAME1= <>
##$TPNAME2= <>
##$TPNAME3= <>
##$TPNAME4= <>
##$TPNAME5= <>
##$TPNAME6= <>
##$TPNAME7= <>
##$TPOAL= (0..7)
0.5 0.5 0.5 0.5 0.5 0.5 0.5 0.5 
##$TPOFFS= (0..7)
0 0 0 0 0 0 0 0 
##$TUNHIN= 0
##$TUNHOUT= 0
##$TUNXOUT= 0
##$USERA1= <user>
##$USERA2= <user>
##$USERA3= <user>
##$USERA4= <user>
##$USERA5= <user>
##$V9= 5
##$VALIST= <valist>
##$VCLIST= <CCCCCCCCCCCCCCC>
##$VD= 0
##$VDLIST= <DDDDDDDDDDDDDDD>
##$VPLIST= <PPPPPPPPPPPPPPP>
##$VTLIST= <TTTTTTTTTTTTTTT>
##$WBST= 1024
##$WBSW= 4
##$XGAIN= (0..3)
0 0 0 0 
##$XL= 0
##$YL= 0
##$YMAX_a= 318520
##$YMIN_a= -405940
##$ZGOPTNS= <>
##$ZL1= 120
##$ZL2= 120
##$ZL3= 120
##$ZL4= 120
##$ABSF1= 16.522
##$ABSF2= -4.171173
##$ABSG= 5
##$ABSL= 3
##$ALPHA= 0
##$AQORDER= 0
##$ASSFAC= 0
##$ASSFACI= 0
##$ASSFACX= 0
##$ASSWID= 0
##$AUNMP= <proc_1d>
##$AZFE= 0.1
##$AZFW= 0.1
##$BCFW= 0
##$BC_mod= 0
##$BYTORDP= 0
##$COROFFS= 0
##$CY= 12.5
##$DATMOD= 1
##$DC= 0
##$DFILT= <>
##$DTYPP= 0
##$F1P= 14.0000005364418
##$F2P= -0.99999901652339
##$FCOR= 0.5
##$FTSIZE= 32768
##$FT_mod= 6
##$GAMMA= 0
##$GB= 0
##$INTBC= 1
##$INTSCL= 1
##$ISEN= 128
##$LB= 0.3
##$LEV0= 0
##$LPBIN= 0
##$MAXI= 10000
##$MC2= 0
##$MEAN= 0
##$ME_mod= 0
##$MI= 0
##$NCOEF= 0
##$NC_proc= -6
##$NLEV= 6
##$NOISF1= 0
##$NOISF2= 0
##$NSP= 0
##$NTH_PI= 0
##$NZP= 0
##$OFFSET= 16.522
##$PC= 1
##$PHC0= 152.6041
##$PHC1= 12.01661
##$PH_mod= 1
##$PKNL= yes
##$PPARMOD= 0
##$PSCAL= 4
##$PSIGN= 0
##$REVERSE= no
##$SF= 250.13
##$SI= 32768
##$SIGF1= 0
##$SIGF2= 0
##$SINO= 400
##$SIOLD= 32768
##$SREGLST= <1H.DMSO>
##$SSB= 0
##$STSI= 32768
##$STSR= 0
##$SW_p= 5175.98343685301
##$SYMM= 0
##$S_DEV= 0
##$TDeff= 65536
##$TDoff= 0
##$TI= <Analysis number 999999
Compound Code 99
Book Reference 9
Project Code 9>
##$TILT= no
##$TM1= 0
##$TM2= 0
##$TOPLEV= 0
##$USERP1= <user>
##$USERP2= <user>
##$USERP3= <user>
##$USERP4= <user>
##$USERP5= <user>
##$WDW= 1
##$XDIM= 32768
##$YMAX_p= 421756894
##$YMIN_p= -1086974
$$ End of Bruker specific parameters
$$ ---------------------------------
##NTUPLES= NMR SPECTRUM
##VAR_NAME=  FREQUENCY,     SPECTRUM/REAL,   SPECTRUM/IMAG
##SYMBOL=    X,             R,               I
##VAR_TYPE=  INDEPENDENT,   DEPENDENT,       DEPENDENT
##VAR_FORM=  AFFN,          ASDF,            ASDF
##VAR_DIM=   32768,         32768,           32768
##UNITS=     HZ,            ARBITRARY UNITS, ARBITRARY UNITS
##FACTOR=    0.157963299565203, 1,           1
##FIRST=     4132.6476996994, 0,             0
##LAST=      -1043.33573715361, 0,           0
##MIN=       -1043.33573715361, -1086974,    0
##MAX=       4132.6476996994, 421756894,     0
$$ Real data points
##PAGE= N=1
##DATA TABLE= (X++(R..R)), XYDATA
$$ [...]
16318a06727k71717j34009j89889K01396K76849J19201k6931k77250K4073J02623
16308b82381k22509L1053O2990N3952J14476J42407M3047J88704m8481r2957L24488
16297C14789K17001J19904m05203l5158j59439k23014k71228L2321J75056j22127
16287c57098L47199J3343j02208l0692k06163j50909Q7412J96433j90887l3602
16277d27172J84686L2552J80290J47386k16248k5590j621m8118Q9973k61778j09399
16266d55039j03338o7991M24212M9921j76387L33613J10899j45903o3439j47368
16256b40820j01445R1815J64159K49855J26457p6688R1504j8657J59008Q9089
16246E34277k36658j76152j66188J14908j44923k57588M4956O5960J2440K66369
$$ plain form
16318 -106727 -378444 -512453 -702342 -500946 -224097 -104896 -131827 -409077 -385004 -282381
16308 -282381 -504890 -473837 -410847 -356895 -242419 -100012 -56965 131739 83258 -9699 314789
16297 314789 531790 651694 246491 211333 51894 -171120 -442348 -410027 -234971 -357098
16287 -357098 -9899 3444 -98764 -129456 -335619 -486528 -399116 -202683 -393570 -427172
16277 -427172 -242486 -209934 -29644 117742 -98506 -124096 -125717 -173835 -83862 -345640 -455039
16266 -455039 -558377 -626368 -202156 -152235 -328622 4991 115890 -30013 -93452 -240820
16256 -240820 -342265 -250450 -86291 163564 290021 213333 304837 286180 445188 534277
16246 534277 297619 121467 -44721 70187 -74736 -332324 -287368 -221408 -208968 57401
16236E7401L0634j26374Q8754l1560J4223J4764l05639q3043M9704j7365K13246
16225i5255j16162k18569J41782J72957K58769n8364k19987k024j06836j10473
16215c54162K22957N2171l08301k38171L45558l8805P6756R3022j1219r8106j21580
16204c79880R1802P86j33921J85896L02870O41k66079j06567q4775L6718j36362
16193d88871K98564J76312n7213k42053O8547J42927J30354l29788r3365R6974
16183b97612J67767J04776J45442Q228l4684J20182l9816j72497l1379Q3424k27680
16172a73849K265J30662P2127j8341k30063k67961j50509k4651j42317L22360
16162d80277J74164L076j59542k07299J59211J37298L57522J48894j10024m1352
$$ plain form
16236 57401 88035 -38339 50415 18855 33078 47842 -257797 -340840 -291136 -308501 -95255
16225 -95255 -211417 -429986 -288204 -115247 143522 85158 -134829 -136853 -243689 -354162
16215 -354162 -131205 -79034 -387335 -625506 -279948 -318753 -241997 -148975 -160194 -258300 -379880
16204 -379880 -288078 -287292 -421213 -235317 67553 68194 -197885 -304452 -389227 -352509 -488871
16193 -488871 -190307 -13995 -71208 -313261 -244714 -101787 28567 -301221 -394586 -297612
16183 -297612 -129845 -25069 120373 128601 93917 214099 174283 1786 -29593 53831 -173849
16172 -173849 -171584 -40922 31205 12864 -217199 -485160 -635669 -660320 -802637 -480277
16162 -480277 -306113 -303037 -462579 -669878 -510667 -373369 -15847 133047 23023 -18329
16152a8329j32888j61801k39918J58128k5175j31523R6811J50991L27673J48765
16142A72734J6175O1761k2107P2246M9143m60818m44899k19252N6764J75910K6438
16131e15905o8852K27257R0478j8751L9271j3385n9441j27123n7034J46179J19441
16120b37865O4433K88139j57652O3588l2588L7453J10302L3431o5364q4554J31832
16109A51155O9988J37223k34646R144J2401J15392k32741l67325K12735J37903
16099A1229l18539Q6947K15194j69007K49154J23901N7257l07947k01235K98756
16089D5710m358O5948L19672j40790o8424m696j77881j10591K71391j78899l56157
16078c39075N2488J14724K39684n9114J57891q7857M9264L66412J69223L3912
$$ plain form
16152 -18329 -151217 -313018 -552936 -394808 -419983 -551506 -454695 -303704 23969 172734
16142 172734 188909 250670 228563 300809 349952 -110866 -555765 -775017 -718253 -542343 -515905
16131 -515905 -584757 -357500 -267022 -285773 -246502 -259887 -319328 -446451 -503485 -357306 -237865
16120 -237865 -173432 114707 -42945 20643 -11945 25508 135810 169241 103877 19323 151155
16109 151155 221143 358366 123720 132864 145265 260657 27916 -339409 -126674 11229
16099 11229 -307310 -220363 -5169 -174176 74978 198879 256136 -51811 -253046 45710
16089 45710 41352 107300 426972 286182 217758 213062 35181 -75410 195981 17082 -339075
16078 -339075 -286587 -171863 67821 8707 166598 78741 128005 494417 663640 697552
16068F97552K21372n34357m48717O962J85922j02456j8404O7287K78051K1704
16058C74916l09842k64627O4891N3122O1135o8464j64162j47474J08127L33181
16048D0803J63465k22472Q8711K64577k0766r0496p8657r3053M0589O7489p0001
16037I0189M4494j24735k30283J28379K1184J71582J17312n9404j95222l00069
16027c36573p3863J62633N9112j89888L11719n1850j3372r9081q9681j111o7100
16016c89055j15928k04023j48679J00362J41381K05268J03060L8813k9547R6535
16006b01813P3972j6998O861J49887M3262r6761r8396j07162O2060J93364j89024
15995a80748j40733k0444J10449k23042j65645L6077J72812K71781J57496m2141
$$ plain form
16068 697552 918924 384567 -64150 -57188 128734 26278 7874 75161 353212 374916
16058 374916 65074 -199553 -134662 -81540 -20405 -88869 -253031 -400505 -292378 40803
16048 40803 204268 -18204 70507 335084 314318 223822 145165 52112 92701 160190 90189
16037 90189 134683 9948 -220335 -91956 -70772 100810 218122 158718 -36504 -336573
16027 -336573 -410436 -247803 -188691 -378579 -66860 -118710 -132082 -231163 -320844 -321955 -389055
16016 -389055 -504983 -709006 -857685 -757323 -615942 -410674 -307614 -268801 -298348 -201813
16006 -201813 -127841 -144839 -137978 11909 55171 -41590 -139986 -247148 -185088 8276 -180748
15995 -180748 -321481 -341925 -231476 -454518 -620163 -584086 -411274 -139493 18003 -24138
15985b4138J30173j37199j38898R1280n4587k21002j0022K32211L68074N0782
15975B86674k211N5461r6775k77093j61610k2682j02685N3877j65958K803J36101
15964b94098o8248m8368L9536q551M8308K8035k7030K00815j06356k50169j25834
15953f11960J43062M24551J10773m9568r8546J00765k41600m464l1878q1285n2682
15942c92832j6272j21572r6707O0334O854J93922J86949l7509J93257J63191M8969
15931A88584N6398J60275K30575j83227j66643j61047N3721J17874l07327j5888
15921b6705j36893l35031k02568K38361M52728M5613j67357j14130j18540K19051
15911a45471R7365N9178j77079m4994J20095k86840j14436k9458q6387j05766
$$ plain form
15985 -24138 106035 -31164 -170062 -78782 -133369 -354371 -364393 -132182 235892 286674
15975 286674 284463 339924 243149 -33944 -195554 -218236 -320921 -267044 -433002 -430199 -294098
15964 -294098 -362346 -410714 -371178 -379729 -331421 -303386 -330416 -129601 -235957 -486126 -611960
15953 -611960 -468898 -44347 66426 16858 -81688 19077 -222523 -226987 -258865 -340150 -392832
15942 -392832 -409104 -530676 -627383 -567049 -560195 -366273 -179324 -216833 -23576 139615 188584
15931 188584 244982 405257 635832 452605 285962 124915 178636 296510 -10817 -26705
15921 -26705 -163598 -498629 -701197 -462836 -10108 35505 -131852 -245982 -364522 -145471
15911 -145471 -48106 11072 -166007 -211001 -90906 -377746 -492182 -521640 -608027 -713793
15901g13793Q5061O0055K06549J71970R1385J06107J17897o6438o8698J06437
15891I6532k63940k04098m7039O8330l0506K8337L4342L7007j16673R3604L05824
15880A720j12032j74213J58470J7986k0202r0520N7824l1451q4093Q9270K25705
15869C8464j39873k97549m1012O1394L3984J4370L23000P4073n61R5499M7141
15858B08930R7147k59925l02834j17515K40569K42291o9985k18546p4712l7283
15848b91863K1856J60407K85602j33754j6504j58091j70387l5696k31354k03992
15838g73776J10742L61396K18479l3776K0326M3331j0834M0706J50826j01055
15828B6365l13991N0855M9635J3093K49031j41640l25145n0073O7162L92079L14340
$$ plain form
15901 -713793 -628732 -568677 -362128 -190158 -98773 7334 125231 58793 -9905 96532
15891 96532 -167408 -371506 -418545 -350215 -380721 -352384 -318042 -281035 -397708 -304104 1720
15880 1720 -110312 -284525 -126055 -108069 -128271 -218791 -160967 -192418 -276511 -187241 38464
15869 38464 -101409 -398958 -439970 -378576 -344592 -330222 -7222 66851 66290 161789 208930
15858 208930 306077 46152 -256682 -374197 -133628 108663 38678 -179868 -254580 -291863
15848 -291863 -270007 -109600 176002 42248 25744 -132347 -302734 -338430 -569784 -773776
15838 -773776 -663034 -301638 -83159 -116935 -96609 -53278 -64112 -23406 127420 26365
15828 26365 -287626 -236771 -187136 -174043 74988 -66652 -391797 -441870 -374708 17371 331711
15817C31711m4267q5490L7029o0202k35529L0602j71255P3256k7836M4454J47246
15806C9719l649j57025r8523P7853j3780k26317J85912M0522Q8783q7566J2625
15795a41446j3691L4395r3239p064J48788J26189p6620l16718N03921P7188j73549
15784F8154q6161J78150J45470j49378n3537n7676p7923N8341j5082j44635q8796
15773b23073p6646n9937J80116j05373j15299J68425K24542K4275J25550k82656
15763a40076l88022l90823J26P5211K37369p6748J00753L24668K17126K7653n9596
15752g2359J33562j41152j59776n8894k05582O4105L96986J00079K6744L0191
15742A13904K67150r8200J2598j43157k27015m8858P9726J15882N6682l6006k2050
$$ plain form
15817 331711 287444 201954 238983 178781 -56748 -26146 -197401 -124145 -151981 -107527 39719
15806 39719 36070 -120955 -219478 -141625 -155405 -381722 -195810 -155288 -66505 -154071 -141446
15795 -141446 -155137 -120742 -213981 -221045 -72257 53932 -22688 -339406 164515 241703 68154
15784 68154 -18007 160143 305613 156235 102698 45022 -32901 25440 10358 -134277 -223073
15773 -223073 -299719 -359656 -179540 -284913 -400212 -231787 -7245 17030 142580 -140076
15763 -140076 -528098 -918921 -918795 -843584 -606215 -682963 -582210 -257542 -40416 -12763 -72359
15752 -72359 61203 -79949 -239725 -298619 -504201 -440096 -43110 56969 83713 113904
15742 113904 381054 282854 295452 152295 -74720 -123578 -43852 72030 128712 92706 70656
15731G0656J06190k1922J52268N2809k5960r2379l05682k12229M8905K12174J02321
15720H7151K68941j71860k26465m56435j38116j626L44635M11860M10989M4706
15710E73780j82128k97640j87016j53761m4302P2248M5964j25110L47159J31470
15700A80664o7295j75099J0501j40385j86924q4617j878M4623K24074k68117k14294
15689f78747K68278K23979R9384j78805k22720Q5459L53751K87777k34513k35127
15679b31284m0229j01125q7473Q4946K41418Q766j09451K09203m0290k81515J81709
15668a65325n3523l1924J5877J24118R5378M9077j26763n7260K08281J0207k10032
15657a41889j27725j22963J13614K41742n9271j4104K5611k30784j07632J57821
$$ plain form
15731 70656 176846 154924 307192 360001 334041 241662 -64020 -276249 -227344 -15170 87151
15720 87151 356092 184232 -42233 -498668 -636784 -638410 -293775 118085 529074 573780
15710 573780 391652 94012 -93004 -246765 -291067 -218819 -172855 -297965 49194 180664
15700 180664 113369 -61730 -51229 -191614 -378538 -463155 -465033 -420410 -196336 -464453 -678747
15689 -678747 -410469 -186490 -87106 -265911 -488631 -403172 -49421 238356 3843 -231284
15679 -231284 -271513 -372638 -460111 -375165 -133747 -124981 -234432 -25229 -65519 -347034 -165325
15668 -165325 -218848 -250772 -234895 -110777 -15399 33678 -93085 -150345 57936 68143 -141889
15657 -141889 -269614 -392577 -278963 -37221 -96492 -110596 -84985 -315769 -423401 -265580
15647b65580j01546r4271L35295k3981k28900q1098Q9977L41585J55548J57133
15637B84162J51984p7824k45381q6527p5379P203k6768k58607j13589k9123L8942
15626d30907O5458K88429R8327m30115j64509K78846J02437K09019j2173p6505
15616g1693R0510j27643l12877j32415q6792K18736K40236L8070Q7451n8223J45428
15605C0788q9306k1390k9151k20364k55195n0324l3892K67048J80321j5988j01128
15594c38581M7940R1823P3911R590J18722o6019r990M7146Q3646J08857J1967
15583A79012l2481Q9302j40084p8793j124j09947J330M1437Q3432P2389j91211
15572h6738o3460j15620P7120r400J91830J04490j43491J20723l1214l94120j94229
$$ plain form
15647 -265580 -367126 -461397 -126102 -150083 -378983 -460081 -370104 -28519 127029 284162
15637 284162 436146 358322 112941 26414 -48965 -41762 -68530 -327137 -440726 -469849 -430907
15626 -430907 -365449 -77020 21307 -408808 -573317 -294471 -192034 16985 4812 -71693
15616 -71693 18817 -108826 -421703 -554118 -640910 -422174 -181938 -143868 -56417 -114640 30788
15605 30788 -58518 -79908 -109059 -329423 -584618 -634942 -668834 -401786 -221465 -237453 -338581
15594 -338581 -290641 -198818 -124907 -115317 3405 -62614 -72604 -25458 58188 167045 179012
15583 179012 146531 235833 95749 16956 15832 -94115 -92785 -51348 32084 104473 -86738
15572 -86738 -150198 -265818 -188698 -198098 -6268 98222 -45269 75454 44240 -349880 -544109
15561e44109K43887J80129Q3744k55028l5828n2732n465j70419k20302J45235
15551f30888K88820K75640J17290l36679L9568R7166l0204j61711j44081K23177
15541b61902L65786J7178O0935j13448l5438j64476o4805R5116l198j15381j2920
15530b32553p1766P1951K8563O4601J99695P5705k11916r4161L5419p6227k46287
15519d56976r9401L38169l0041J47032K2320n4985l5314n1280J60946L6461J8903
15508d166j39740j02768P8564J73406L29509j08010q2434K63m0771J6431J31052
15497B51336K13280n2670l1002l67903k13596J97968j31438k92849k8609J78144
15487b77339K57583J32765K6719L3834n1968k03128r065K3082K10105j20032J6492
$$ plain form
15561 -544109 -300222 -120093 -36349 -291377 -327205 -379937 -385402 -555821 -776123 -630888
15551 -630888 -342068 -66428 50862 -285817 -246249 -149083 -179287 -340998 -485079 -261902
15541 -261902 103884 121062 181997 68549 33111 -131365 -196170 -101054 -104252 -219633 -232553
15530 -232553 -304319 -232368 -203805 -139204 60491 136196 -75720 -169881 -134462 -210689 -456976
15519 -456976 -556377 -218208 -248249 -101217 -78897 -133882 -169196 -220476 -59530 -23069 -4166
15508 -4166 -143906 -246674 -168110 5296 334805 226795 144361 144624 103853 120284 251336
15497 251336 464616 411946 380944 13041 -200555 -2587 -134025 -426874 -455483 -277339
15487 -277339 -19756 113009 139728 173562 121594 -81534 -90599 -67517 142588 22556 39048
15476C9048j19720j31644J76476k1256r2801J728O0245n5679J0051J10338N814
15465a7400o081J84656k17213j60221k7477R6464J78090O3593k5918K21219L425
15454B93137j48842J14828Q1335m91550Q6341L43353J5811j70157k77662j16805
15444b70211l8741K26226L41167P8561m4067k48400j44646j74215j47909l4348
15434d56583j99983O4236n5377O5497L20231J36801J85179j85428k51318K07001
15424a69744K33933P1675j04320k48262J35463K81585J22802k33626j35578K29699
15414A83627o8784l16533m3014j37206N2432P4338L2645m5214o4477j56995k2252
15403e11433J85390J91202K75700q2430r3392j99236k43741p2565J92169J20257
$$ plain form
15476 39048 -80672 -212316 -35840 -57096 -149897 -148169 -87924 -143603 -133552 -23214 -17400
15465 -17400 -23481 161175 -56038 -216259 -243736 -147272 30818 94411 68493 289712 293137
15454 293137 144295 259123 340458 -151092 -64751 278602 294413 124256 -153406 -270211
15444 -270211 -308952 -82726 258441 337002 292935 44535 -100111 -274326 -422235 -456583
15434 -456583 -656566 -592330 -647707 -582210 -261979 -125178 60001 -125427 -376745 -169744
15424 -169744 64189 135864 31544 -216718 -81255 200330 323132 89506 -46072 183627
15414 183627 114843 -201690 -244704 -381910 -329478 -255140 -222495 -267709 -332186 -489181 -511433
15403 -511433 -326043 -134841 140859 58429 -34963 -234199 -477940 -550505 -358336 -238079
15393b38079j07831l42549o4894K08133J60581K74903o4655j01865P311J84874
15383h4071J81832k48535J7379K17473J36768n2131J23421r6580k26833Q0143
15373D8866N0585m7180J07936K07655j22890k17069P3955l8778m5910j32975q3701
15362a99506R5536J44782j04035p9267N0658n7868J70157K39149j03100j21613
15352C4893K5421k75144l08775r8949J73277k9322J19528J34342j37555r5362
15342d57646J60121M0552j94807j78139r2061K04919J14231j5457m38581k30106
15332a086974O1268J68527L07489K94322J37925m0770j01874l94379k44452K56258
15322f42660M93183j55257o3010k33608m7643M6361K41627K33778j57921O0196
$$ plain form
15393 -238079 -345910 -688459 -753353 -545220 -384639 -109736 -174391 -276256 -268945 -84071
15383 -84071 97761 -150774 -133395 84078 220846 168715 292136 195556 -31277 48866
15373 48866 99451 52271 160207 367862 244972 27903 101858 63080 17170 -115805 -199506
15362 -199506 -103970 40812 -63223 -142490 -91832 -149700 20457 259606 156506 34893
15352 34893 60314 -214830 -523605 -622554 -449277 -478599 -359071 -224729 -362284 -457646
15342 -457646 -297525 -256973 -451780 -629919 -721980 -517061 -402830 -418287 -856868 -1086974
15332 -1086974 -1025706 -857179 -549690 -255368 -117443 -158213 -260087 -654466 -898918 -642660
15322 -642660 -149477 -304734 -367744 -601352 -648995 -602634 -361007 -127229 -285150 -224954
15312b24954R7914k1127j126P8504J498K9608M7281j75709k51916k18310K76356
15301c61981j686k02933l4248K927j9204J14267K09503L52386j1190k38570l32715
15290e23444r0139L05242L04276j52129m5256k01282k7762N6002k74295J72679
15280d76108L49697k76495k02431K84818o6950n9594J51481O8277J06153m5533
15270a66685M8738j41698j13930q0631J38917K81985O8355J5185L0548k25354
15260a44570q6722P8899L29256k45398j00019l7103J70974k3225j51568j10644
15250c20120J23078J60433k13066k44204q3589J62504J31904L096J859m493j32174
15239d14772k98698J7175J62815J74209K61010N6025O5159k19166M9544L95368
$$ plain form
15312 -224954 -127040 -148167 -149293 -70789 -69291 -39683 7598 -168111 -420027 -638337 -361981
15301 -361981 -363667 -566600 -600848 -597921 -617125 -502858 -293355 59031 47841 -190729 -523444
15290 -523444 -613583 -308341 -4065 -156194 -201450 -402732 -430494 -374492 -648787 -476108
15280 -476108 -126411 -402906 -605337 -320519 -387469 -447063 -295582 -227305 -121152 -166685
15270 -166685 -117947 -259645 -373575 -454206 -315289 -33304 35051 50236 80784 -144570
15260 -144570 -231292 -152393 176863 -68535 -168554 -205657 -34683 -57908 -209476 -320120
15250 -320120 -197042 -36609 -249675 -493879 -577468 -414964 -283060 -279964 -278105 -282598 -414772
15239 -414772 -713470 -696295 -533480 -359271 -98261 -42236 22923 -196243 -146699 248669
15229B48669k14533l42732K18561J23400n167k18272o2013j9898k1477J91397
15219a02065L10453P2310k10375k85142k52051L02228J63475m6498J071k82637
15209c29231j20724K10071J34290j41724P8467J11916j03189K2416j74353R0663
15199b21398J71374J7080q691m900K46284J80051j31596j60019l17362M6444P5084
15188a07649L4411J07711o3575M6322J31594K23928J13394L10850q2407k26675
15178D87904m5804j86399j06547k67094l2892k2802k61673K1113L26743N00642
15168D13191Q4958L0109j38827l52004j53117j06446K97830J46338j93923k3958
15158D151J48258J76452k94372k86224k98349j51852l31666J49811L27085J8569
$$ plain form
15229 248669 34136 -308596 -90035 33365 28198 -190074 -252087 -271985 -293462 -102065
15219 -102065 208388 280698 70323 -214819 -466870 -164642 -1167 -47665 -46594 -329231
15209 -329231 -449955 -239884 -105594 -247318 -168851 -56935 -160124 -137708 -312061 -221398
15199 -221398 -50024 -32944 -41635 -46535 199749 379800 248204 88185 -229177 -182733 -107649
15188 -107649 -73238 34473 -29102 17220 148814 372742 486136 796986 714579 487904
15178 487904 442100 255701 149154 -117940 -150832 -173634 -435307 -414194 -87451 413191
15168 413191 498149 528258 389431 37427 -115690 -222136 75694 222032 28109 4151
15158 4151 152409 328861 34489 -251735 -550084 -701936 -1033602 -883791 -556706 -538137
15148e38137N2824J0180N35301L45843K2276j10567k69869J3979Q750L20740N4705
15137D46025k64834L6605J32884M649k15473k34068J48033P304k13786P0399n9354
15126a41616k07853P8532J97094Q8892r7391J45223K54744j98888l41743p5671
15116b98677N29817L16826k61770l07941J38813J2570K89982P2476j54928k47712
15106H9456l82943k07192P0752O3122K09068K44863J52064J30116l8484j96677
15096A34145m1591j53895l6850J12275P9489j70514k50283J11059J69690K18991
15086A72516j42584l8010M6548j74235O1825J8156K26518l44744k09614L67041
15076a6583K91048K29836k3563l05797r6274j84348L6083J49947k2196j47901
$$ plain form
15148 -538137 -485313 -475133 60168 406011 428287 317720 47851 61830 70580 391320 446025
15137 446025 181191 217796 350680 355329 139856 -94212 53821 61125 -152661 -82262 -141616
15126 -141616 -349469 -270937 -73843 15049 -82342 62881 317625 118737 -223006 -298677
15116 -298677 231140 547966 286196 -21745 117068 129638 419620 492096 337168 89456
15106 89456 -293487 -500679 -429927 -366805 -157737 87126 239190 369306 330822 134145
15096 134145 92554 -61341 -98191 14084 93573 -76941 -327224 -216165 -46475 172516
15086 172516 29932 -8078 38470 -135765 -73940 -55784 170734 -174010 -383624 -16583
15076 -16583 274465 504301 480738 174941 78667 -105681 -69598 80349 58153 -89748
15066h9748j29370L66883n0550o5966k95580k65156j03962l8161q23K3807K09185
15055d39441O5079j57000j75508J01674R8164K80554J53525L6412J10989M4025
15045A18473n658q1023r2334L5394O4850R7127k42107q0060K48152P943k6723
15034D4034O3277n1048k35339j81405Q33j37598J93341K70081K644K74425J9388
15023B62633l96881j05297Q5924Q529m0305k2784N905Q6142j04830j8379l6535
15012b75878O0101j93468j31293J4027R9091m5797J47254K34547m505j46553J20021
15001a22453J16569K5743j21461j51458M2044J1074p3686q6421j34478J73630
14991c20897K59393o3843m1345l2120j63841P8847L07053J69759l2066q2184j38318
$$ plain form
15066 -89748 -219118 147765 97215 31249 -264331 -529487 -633449 -671610 -672433 -648626 -439441
15055 -439441 -374362 -531362 -706870 -605196 -507032 -226478 -72953 -36541 74448 118473
15045 118473 112815 31792 -60542 -25148 39702 136829 -105278 -185338 62814 70757 44034
15034 44034 107311 56263 -179076 -360481 -359648 -497246 -303905 -33824 -31180 243245 262633
15023 262633 -134248 -239545 -153621 -145092 -185397 -208181 -202276 -116134 -220964 -239343 -275878
15012 -275878 -215777 -409245 -540538 -526511 -427420 -473217 -325963 -91416 -95921 -242474 -122453
15001 -122453 -5884 19859 -101602 -253060 -211016 -199942 -273628 -360049 -494527 -320897
14991 -320897 -61504 -125347 -166692 -198812 -362653 -283806 23247 193006 160940 78756 -59562
14980e9562j17386J90064j30372K6624m135J43633L05078l976j75784l15738P7303
14969f4251O616j38935k58376N1418L6304R7951N2650o8105m076K51250N9773
14958B2219M6893J8683j46748j00137J7038K54503R8562J2444q8231k84760l46140
14947d95674o7918J71042P4170p4433j19088k17091R1597N2269Q9425Q3415R3343
14936c18943k3565r2085N9556N38551K26504q2238k75386k16425M1578K82351
14926A39898j05986j50749r3844K45676J76640n4133l08726j49797J9760p3913
14916c55174J90247O4182j26622k1369J29290p7031k35679M9939Q9228j20981
14906d13970P230J28069p3259N3383L69469J96035k3501R6486j61793l80643M0995
$$ plain form
14980 -59562 -176948 13116 -117256 -90632 -94767 48866 353944 349968 174184 -141554 -64251
14969 -64251 -57635 -196570 -454946 -403528 -367224 -269273 -216623 -284728 -288804 -37554 22219
14958 22219 69112 87795 -58953 -159090 -142052 112451 211013 223457 135226 -149534 -495674
14947 -495674 -563592 -392550 -318380 -392813 -511901 -728992 -637395 -585126 -495701 -412286 -318943
14936 -318943 -342508 -434593 -375037 163514 390018 307780 32394 -184031 -142453 139898
14926 139898 33912 -116837 -210681 34995 211635 157502 -151224 -301021 -281261 -355174
14916 -355174 -164927 -100745 -227367 -248736 -119446 -196477 -432156 -382217 -292989 -413970
14906 -413970 -406740 -278671 -351930 -298547 70922 266957 243456 339942 178149 -202494 -161499
14895a61499J42146N5422J59894k75j67267j39300r3155q1045K33946N6896j89244
14884a83481K5358J40000J95741L12656j26364n05481m35148J84493M05537J44573
14874A57884j25828l14275j1j17179P4297J50941n6255J95473n8359J07444J5503
14863B9635K86713J38472k88426j59386n4641L13906j4901j70647m3971N4130
14853I0884K6002Q9892J52113k82267Q8789J31228J17373l16925n045K56888L31900
14842F80832j44296n17735K54807R4918k35037j77321K05425o627j33342P7511
14832I9135j97154J60001J45028P1374Q3613l18498k78894p3414l5002k51679
14822e95490m8475K04561M9937J1938N7908K82283K07029j09766l19141j79397
$$ plain form
14895 -161499 -19353 36069 195963 195688 28421 -110879 -204034 -285079 -51133 5763 -183481
14884 -183481 -158123 -18123 177618 490274 363910 -141571 -576719 -392226 13311 157884
14874 157884 32056 -282219 -282230 -399409 -325112 -174171 -230426 -34953 -93312 14132 29635
14863 29635 316348 454820 166394 7008 -47633 266273 251372 80725 36754 90884
14853 90884 116886 206778 358891 76624 165413 296641 414014 97089 92044 348932 680832
14842 680832 536536 18801 273608 368526 133489 -43832 161593 154966 21624 99135
14832 99135 -98019 61982 207010 278384 361997 43499 -235395 -308809 -343811 -595490
14822 -595490 -643965 -439404 -389467 -377529 -319621 -37338 169691 59925 -259216 -438613
14812d38613j05865j98839L52080K87682M0935n3046J23393J91338k5007J1647
14802A85705j09961l17734j40164L95984L31518j62350J07805J18629K0500p0225
14792C59707j79856j9888n106j46066j6659o2255K94997N1342j7388J55885l21946
14781I2767j66850K86506M8905j27616L1150k33654K2798n7224l0015p5007m7594
14770b55834j63463M2163J27237q7651K743J91098J14113N3095R141J97984r1593
14759A39033L8826K28j54073j6106Q3871q8358k71109N9338K680j19758P8948
14748b46480J50252K3696l35509Q284K82319O0010K26196j31685m3232l46793
14738c52942j60461N866J69628J76032J2929L0640p7504j22830l2693J00164J55243
$$ plain form
14812 -438613 -544478 -743317 -391237 -103555 -62620 -115666 7727 199065 174058 185705
14802 185705 75744 -241990 -382154 13830 345348 182998 290803 409432 429932 359707
14792 359707 179851 159963 154857 8791 -7868 -70123 224874 276216 258828 414713 92767
14781 92767 -74083 212423 261328 133712 164862 -68792 -45994 -103218 -133233 -208240 -255834
14770 -255834 -419297 -377134 -249897 -337548 -334805 -143707 -29594 23501 32642 230626 139033
14759 139033 177859 178087 24014 7908 91779 3421 -267688 -208350 -205670 -325428 -246480
14748 -246480 -96228 -72532 -408041 -399757 -117438 -57428 168768 37083 -6149 -352942
14738 -352942 -513403 -507537 -337909 -161877 -148948 -118308 -195812 -318642 -351335 -251171 -95928
14727i5928K23802o6746j08863j32643j24176M3653M4409r2083j37930J75224
14717b71281L88240j08342m74288R3457M31952Q0799k29303k90349l1483O0635
14707c49963L8323n9755K21555K40059M9558J33154q6690k71449O9793o8521l36128
14696d20064l31476j33042K54716K1781J81065J95699o0033q1928j98584K52947
14686c18919J15018P5704M7616P0472J20939m5839k4672N9428J14261J41167K1902
14675C77077j41794m4335j93484J18808q8201j5821M1668o3961m9926j97665n5430
14664c13064j52131J16367O0950N4860R1217Q8400L3740J65354J16397j62907
14654I9183k11445j74863j05570r0667J41029J26639J20159L58698N898j01329
$$ plain form
14727 -95928 127874 61128 -47735 -180378 -304554 -260901 -216492 -308575 -446505 -271281
14717 -271281 116959 8617 -465671 -372214 59738 140537 -88766 -379115 -410598 -349963
14707 -349963 -311640 -371395 -149840 90219 139777 272931 186241 -85208 -15415 -83936 -420064
14696 -420064 -751540 -884582 -629866 -608085 -427020 -231321 -291354 -373282 -571866 -318919
14686 -318919 -203901 -128197 -80581 -10109 110830 64991 40319 99747 214008 355175 377077
14675 377077 235283 190948 -2536 116272 28071 12250 53918 -10043 -59969 -257634 -313064
14664 -313064 -465195 -348828 -287878 -233018 -141801 -53401 -19661 145693 262090 99183
14654 99183 -112262 -287125 -392695 -483362 -342333 -215694 -95535 263163 269061 167732
14644A67732j04914j4031J50400k8021n3812J36978j10196j67942Q6125K25J36619
14633A99163j42116j35882q5312q8592J64252K4200j37614n6018q2293K7189J14793
14622a98230L88704r9523j06107J84841j80977j25060Q270J7437j38384P6559
14612a72470M788j42706J74810N9463j02954j50630J54049R5208l4263k92423
14602d07128K67115J36784k06717j02578j6105R8947O2024j44051J7359L0107
14592b64243j42291n9697L29843O625l4008m5329l61320l2008M32041L0106l2313
14581a72594M020j02380j97664Q6743J08823O4628N4197K22049P148m8291j18311
14570i1632l5772J78888o179j27600j0317j7665N9415Q8292j08480l27528J7008
$$ plain form
14644 167732 62818 48787 199187 171166 117354 254332 144136 -23806 62319 62544 199163
14633 199163 57047 -78835 -164147 -252739 -88487 -64287 -201901 -257919 -340212 -313023 -198230
14622 -198230 190474 90951 -15156 169685 -11292 -136352 -128082 -110645 -249029 -172470
14612 -172470 -167682 -310388 -135578 -76115 -179069 -329699 -175650 -80442 -114705 -407128
14602 -407128 -140013 -3229 -209946 -312524 -328629 -229682 -167658 -311709 -294350 -264243
14592 -264243 -406534 -466231 -136388 -129763 -163771 -209100 -570420 -602428 -170387 -140281 -172594
14581 -172594 -168574 -270954 -468618 -381875 -273052 -208424 -154227 67822 74970 26679 -91632
14570 -91632 -127404 51484 45305 -82295 -92612 -110277 -50862 37430 -71050 -398578 -381570
14559c81570k10039K45191L93827K46151L3773J2092l19941j42429Q749J12477
14549a719j69990l30464n4861j44125q424M8867J13846l5642J04557J49041J48600
14538a80314J46033j23509J51760K6725j58501n2349J80284p1139L6686K07527
14528A63203q8037k72263j58181J04557R8882j93557m4180j64050j87751J36023
14518f05354L81179J64838o0172n4319k21890J77772K61885j07708j35467J05767
14508i3469K49202K9592k50627l9678o1155j79321o6172l35283k123J27966J28993
14497d92075l2263j05828J5403L87173L46897J58311j38287j69719k8943m5654
14487a04985j24159Q8267K02650m9857M4477l5327j21837J18298J0699K62121
$$ plain form
14559 -381570 -591609 -346418 47409 293560 327333 339425 19484 -122945 -114196 -1719
14549 -1719 -171709 -502173 -557034 -701159 -709583 -660716 -546870 -582512 -477955 -328914 -180314
14538 -180314 -34281 -157790 -6030 20695 -137806 -190155 -9871 -81010 -44324 163203
14528 163203 75166 -197097 -355278 -250721 -151839 -345396 -389576 -553626 -741377 -605354
14518 -605354 -224175 -59337 -119509 -173828 -395718 -217946 43939 -63769 -199236 -93469
14508 -93469 155733 185325 -65302 -104980 -166135 -345456 -411628 -746911 -749034 -621068 -492075
14497 -492075 -524338 -630166 -614763 -227590 119307 277618 139331 -30388 -59331 -104985
14487 -104985 -229144 -140877 61773 11916 56393 21066 -100771 17527 28226 290347
14477B90347J09648l6125j44850k60532r4246J58677K4673k03881j20030J65788
14467a10531j47227l8192o6514n5335J19221q5971k44054J85519J28437J28305
14457a86342M623O4457N501J3423J55087J926m0563M1612J93138J64724Q0385
14446D97971j81160k15740j49922p5788N4112p9918K4344Q1845m9531n4469r3028
14435b41284k76306N4577M12093K00224N2903L832k81645j04789K8262J97230
14425D5097J25267N8429m9977K251P7919K26630K739k37159j17754p5535R5325
14414A53232j42367k01376k06428o143R9956j54054k20614K51485J29644l8223
14404c34888p9537K5250j86461j36634K58673K00493j77465o9244M05568L27476
$$ plain form
14477 290347 399995 363870 219020 -41512 -135758 22919 47592 -156289 -276319 -110531
14467 -110531 -257758 -295950 -362464 -417799 -298578 -384549 -628603 -443084 -314647 -186342
14457 -186342 -181719 -117262 -111761 -98338 56749 58675 18112 59724 252862 417586 497971
14446 497971 316811 101071 -48851 -124639 -70527 -150445 -126101 -44256 -93787 -148256 -241284
14435 -241284 -517590 -463013 -50920 149304 202207 206039 -75606 -180395 -152133 45097
14425 45097 170364 228793 178816 181067 258986 485616 488355 251196 133442 57907 153232
14414 153232 10865 -190511 -396939 -403082 -303126 -457180 -677794 -426309 -296665 -334888
14404 -334888 -414425 -389175 -575636 -712270 -453597 -253104 -430569 -499813 -94245 233231
14394B33231J28940j66663k52175K23544n7337m11320m4425o7072K9410K17857
14384a66010J17114K6696o7635K5758L07042P9883p1319j20676p2695j36646l3416
14373a11904J23604L79452p5531j29106L5831J61482q4914j61716k96921k23845
14363c83568J61270r1022k19805J23771j70586O8981K72901K61492r2161L2617
14353c6110J10695k3090j35427j79282j17644J20051K09180J00567n8678j53379
14343a63117R2588K48691k67356k89850J43589K36836k57851k02266L34696O6846
14333e7194N6244R6303j38709k43992N6044J25092r3755k5353l5930Q2818J62488
14322a5944j06154K95653J8533k66643j40109j21465p4116N3506O6064K71194
$$ plain form
14394 233231 362171 195508 -56667 166877 109540 -301780 -346205 -413277 -383867 -166010
14384 -166010 -48896 -22200 -89835 -64077 242965 322848 251529 130853 58158 -78488 -111904
14373 -111904 11700 391152 315621 186515 222346 383828 298914 137198 -159723 -383568
14363 -383568 -222298 -313320 -533125 -409354 -579940 -510959 -238058 23434 -68727 -36110
14353 -36110 74585 51495 -83932 -263214 -380858 -260807 -51627 48940 -9738 -163117
14343 -163117 -70529 178162 -89194 -379044 -235455 1381 -256470 -458736 -124040 -57194
14333 -57194 -950 95353 -43356 -287348 -231304 -106212 -199967 -225320 -261250 -178432 -15944
14322 -15944 -122098 173555 192088 -74555 -214664 -336129 -410245 -356739 -290675 -19481
14312a9481K7000L5080k66201j65503J05542k1942k54468R7387J92103J51703
14302a18780J0954j77084J08478J49873j53211q4983J07997J46481J96001K6175
14292B11901j10181j05503K04800k79180k46893L6036q4068n030J31014j03872
14282c50976J21611K24115k08586j38801J03422J76928l24231n7561J68303q2437
14272c68213j01166m4371o5662J60339K74530R0059q4041J01350K10029p3922
14262I8932j31955j46791J63694n0795j78227p7650J22403K05002J67292N205
14252A77110k19539J12116q5626N4449R725j09054M5104J07780l49858J10772
14242a47021M907k9695J53508J01807M2477N1083j57580l3388r2424k17982O6654
$$ plain form
14312 -19481 7519 42599 -223602 -389105 -283563 -305505 -559973 -462586 -270483 -118780
14302 -118780 -107826 -284910 -176432 -26559 -179770 -264753 -156756 -10275 185726 211901
14292 211901 101720 -3783 201017 -78163 -325056 -289020 -373088 -378118 -247104 -350976
14282 -350976 -229365 -5250 -213836 -352637 -249215 -72287 -396518 -454079 -285776 -368213
14272 -368213 -469379 -513750 -579412 -419073 -144543 -54484 -138525 -37175 172854 98932
14262 98932 -33023 -179814 -16120 -66915 -245142 -322792 -200389 4613 171905 177110
14252 177110 -42429 69687 -15939 38510 48235 -60819 -15715 92065 -257793 -147021
14242 -147021 -142114 -171809 -18301 83506 125983 177066 19486 -13902 -106326 -324308 -257654
14231b57654N3698k4568R115J17111N1212p9421k03853L6851M12932m4507k7468
14220D3448L7403J39441k14949k61184k06783n2834n2786L20391R6527L61353
14210B10027J98576k15736k03135m6073k55294k51023O3379J08454Q2116m0646
14200c49355J2895K09410J61446j91926k05613K30607K56824j83562k82044R208
14190c32110K78900J99516j58464q8657L5370K6342N4988J35886k9550k25761
14180a03540J9459K72052R2374L13680J9166l50223j79980k54064k15857j5415
14170d02348K83359R2105k38095k04819K45311J44909Q0055k09576p6365J5509
14160b69955J07404K18231q391k75966k51724l4752J61552Q5203M47631n9889
$$ plain form
14231 -257654 -203956 -228524 -219409 -102298 -51086 -130507 -334360 -297509 115423 70916 43448
14220 43448 80851 220292 5343 -255841 -462624 -515458 -568244 -247853 -151326 210027
14210 210027 408603 192867 -10268 -56341 -311635 -562658 -499279 -390825 -308709 -349355
14200 -349355 -336460 -127050 34396 -157530 -363143 -132536 124288 -59274 -341318 -332110
14190 -332110 -53210 146306 -12158 -100815 -65445 -39103 15885 151771 122221 -103540
14180 -103540 -84081 187971 280345 594025 613191 262968 82988 -171076 -386933 -402348
14170 -402348 -118989 -26884 -264979 -469798 -224487 -79578 477 -209099 -285464 -269955
14160 -269955 -162551 55680 47289 -228677 -480401 -515153 -353601 -268398 179233 119344
14150A19344j14464j57724j19187r0446K59451L21098j3863q2245m7067K6649
14140A01546j26690j4123k86951j40534L07191L5921j65268k4118J11600J08133
14130i3293J83947J5494l8587J29402K06406n2663m76473k78002J06089m7466
14120c45146M6296o9740k8031P0871p29K10656N8987K60997k48030k99355j96026
14109e39250J34563J94800L3262q8800k08091K94943K53540k88510k95766l82479
14099h91788P0640L54483L04358J7690j17157J39005r0685j36650Q7889K24140
14089c8075K57561O3314l9015m9321o7619k68210k14863j17662J77020j01994
14079c98864L0456O8877J30344m2732k64469R1053J77051K436L16052M51232k0566
$$ plain form
14150 119344 4880 -152844 -272031 -362477 -103026 218072 204209 121964 74897 101546
14140 101546 -25144 -39267 -326218 -466752 -159561 -123640 -288908 -313026 -201426 -93293
14130 -93293 90654 106148 67561 196963 403369 350706 -125767 -403769 -297680 -345146
14120 -345146 -298850 -368590 -396621 -325750 -326479 -115823 -56836 204161 -43869 -343224 -539250
14109 -539250 -404687 -209887 -176625 -265425 -473516 -178573 74967 -213543 -509309 -891788
14099 -891788 -821148 -466665 -162307 -144617 -261774 -122769 -213454 -350104 -262215 -38075
14089 -38075 219486 282800 243785 194464 126845 -141365 -356228 -473890 -296870 -398864
14079 -398864 -368408 -299531 -169187 -211919 -476388 -385335 -208284 -205848 110204 561436 540870
14068E40870l71062N5862j22084k90129J74815J60547k7267j44195j38152L9178
14058a21617J07532k03720j38339m4899k49790j20098J24230L52362N9529O9427
14048a65383k89247k91513J32650L63363M70141Q8436k9905O7996o8333j2267
14038B65938Q6087O118J7822j93460K0383k68854n1561m7105j03779j62372j22763
14027e53546J10688J02575j58183J85454J80821J23036n2252Q8483p408L9560
14017E9228P0359k87318j79654K2613J52210L32786L6550j21891Q7495l21119
14007a48741k13356Q5608J48222J18168q056m6603j87341O0006R2722N2641K9314
13996a7416Q8441l4367k82590l8959J9629O8903r4583M2595J04195K15838K23972
$$ plain form
14068 540870 169808 225670 103586 -186543 -11728 148819 121552 -22643 -160795 -121617
14058 -121617 -14085 -217805 -356144 -401043 -650833 -770931 -646701 -294339 -234810 -165383
14048 -165383 -454630 -746143 -613493 -250130 220011 308447 278542 346538 278205 265938
14038 265938 352025 358143 375965 182505 202888 -65966 -117527 -164632 -268411 -430783 -553546
14027 -553546 -442858 -340283 -498466 -313012 -132191 -9155 -61407 27076 19668 59228
14017 59228 129587 -157731 -337385 -314772 -162562 170224 206774 84883 172378 -148741
14007 -148741 -362097 -276489 -128267 -10099 -18155 -64758 -252099 -192093 -99371 -46730 -17416
13996 -17416 71025 36658 -245932 -284891 -265262 -196359 -290942 -248347 -144152 71686 295658
13985B95658J83310l01965P610R0354j16064n5972q7205l1639q7988K3758k010
13974h2153J12185j73241j07696j5493j63444K9761J99716J720k27653p022M20317
13963a3003J08645m65341k72179J81645J79804J02802K76414o240l36971j14412
13953c58836M0416j58890N5202J27622J96675O8683J4014j04064K23442M0536
13943A44800k35848k35917n2148K42403p773r9968m1957J40317O1094r8126k65698
13932d48821K28951J74536q2250N5119m0007J33314M440K7198K56517J27476j13076
13921C23397k83237j02243M8673j2239n401k33254J2529N5209J26687K48622R5041
13910B73784K8370J09158k06350m05787K8053O7544K37103K6493j11901j13021
$$ plain form
13985 295658 478968 177003 184613 274967 158903 102931 15726 -15913 -103901 -80143 -82153
13974 -82153 30032 -143209 -250905 -266398 -429842 -400081 -200365 -198645 -426298 -433320 -13003
13963 -13003 95642 -369699 -641878 -460233 -280429 -177627 98787 92547 -244424 -358836
13953 -358836 -318420 -477310 -422108 -294486 -97811 -29128 -15114 -119178 104264 144800
13943 144800 -91048 -326965 -379113 -136710 -144483 -244451 -286408 -146091 -84997 -183123 -448821
13932 -448821 -219870 -45334 -127584 -72465 -112472 20842 25282 52480 308997 436473 323397
13921 323397 40160 -62083 -13410 -25649 -31050 -264304 -251775 -196566 -69879 178743 273784
13910 273784 302154 411312 204962 -200825 -172772 -105228 131875 158368 46467 -66554
13900f6554J16362j7607J02068m7889J6369j37665q3938Q7962l80738N4244J09473
13889b47913Q2002K31247J14595j38593p236k0914K23293j17000j9326J70162
13879B70317J5714m8195j33899j82615J8304J7039k58677m2442j14989K45L59843
13868i9355K89887j48673P8200J36609o0281m4909j34442k97763K37173J14880
13858G1326j80228m8838k23481J12738J95194J00381M275k28301L14272J76817
13848B94155r9264j01195j51892J67903j3579k37272m4314o1247j35903K11212
13838a71396M68979K07375q7078k85071j6201k36258j76234j76315J91224o4730
13828c45705O8133Q8018J67501q732k6430L8169o2059o1225j60665k02425M7308
$$ plain form
13900 -66554 49808 32201 134269 86380 102749 -34916 -118854 -30892 -411630 -357386 -247913
13889 -247913 -165911 65336 179931 41338 34102 13188 236481 119481 100155 270317
13879 270317 286031 237836 103937 -78678 -60374 -43335 -302012 -344454 -459443 -459198 -99355
13868 -99355 190532 41859 120059 256668 196387 151478 17036 -280727 -43554 71326
13858 71326 -108902 -157740 -381221 -268483 -73289 27092 31367 -196934 117338 294155
13848 294155 194891 93696 -58196 109707 96128 -141144 -185458 -246705 -382608 -171396
13838 -171396 297583 504958 417880 132809 116608 -119650 -295884 -472199 -280975 -345705
13828 -345705 -277572 -189554 -22053 -30785 -57215 -19046 -81105 -142330 -302995 -505420 -458112
13817d58112J73962r0404L422p1072M81312L63499n1596l65018Q3543K2195o9456
13806B2275j80598j88146p2308J30041J63646L4604k52555O4697J69125j31323
13796b40542l6736j78074Q5897l6519N1418J78708j16630J08412J1151N5376M19798
13785C02259K67051O094m80260k52557M1599n8653o5749j2234K2634n3343J24345
13774a58814l16526K23962M92067J63581m3839j30870j40919J31567j16127k92191
13764a88109q8308J40014R0604M50R7945J81231k34455j20771o9934k07043J87820
13753b10556J73571r8310k33808k7386J44473L8038J97632q6144J74359J04601
13743A76470P850k94820R4434K55761l9729m42756m12274J76313K66079o4596
$$ plain form
13817 -458112 -284150 -374554 -371132 -442204 39108 402607 351011 -14007 69536 91731 22275
13806 22275 -158323 -346469 -418777 -288736 -125090 -90486 -343041 -278344 -109219 -240542
13796 -240542 -277278 -455352 -369455 -405974 -354556 -175848 -292478 -184066 -172915 -117539 302259
13785 302259 569310 575404 95144 -157413 -115814 -174467 -240216 -252450 -229816 -283159 -158814
13774 -158814 -475340 -251378 240689 404270 360431 229561 88642 220209 104082 -188109
13764 -188109 -276417 -136403 -45799 -45349 52596 233827 -628 -121399 -191333 -398376 -210556
13753 -210556 -36985 -135295 -369103 -396489 -252016 -213978 -16346 -102490 71869 176470
13743 176470 184320 -110500 -16066 239695 199966 -242790 -655064 -478751 -212672 -277268
13733b77268J83997L67666p0232j4573J61607j8765j55668p0374q0408j32431
13723a06449P9856P3077N0002J29828l2729L525O1758N1418N7400p4058m9518
13712B44110l07759k93183J10795J56731r9211K62872M3278j17288R9417j65016
13702f5254J15144M7648N935j38010r8517M4251J78799K8878Q6313K794j41995
13691F5986J59476J57227l40225J45751l6091J51967j02504j57894o3637P9924
13681E9980k00266K9838M50684M5613l09742M0115K06897K8834O2171q015k70896
13670A35213k81973j19596m1421m4470P3431J9479J13990N351J35197p0216P1232
13659c783J86011J04671l9705j14326q309k38559l3886J16599J80059r926N1876
$$ plain form
13733 -277268 -93271 274395 204163 189590 351197 332432 176764 106390 25982 -106449
13723 -106449 -26593 46484 96486 226314 193585 197110 258868 310286 367686 293628 244110
13712 244110 -63649 -356832 -246037 -89306 -188517 74355 117633 345 99762 -65254
13702 -65254 49890 97538 103473 -34537 -133054 -88803 89996 118874 205187 207981 65986
13691 65986 225462 382689 42464 188215 152124 304091 201587 43693 -19944 59980
13681 59980 -140286 -110448 340236 385849 76107 116222 323119 351953 414124 406109 135213
13670 135213 -146760 -266356 -307777 -352247 -278816 -259337 -145347 -139996 -4799 -75015 -3783
13659 -3783 182228 286899 247194 132868 124559 -114000 -147886 -31287 148772 138846 190722
13648A90722J56747j24402k4164j21902j57431k20844J15248R7203k54812N7226
13638b86409L23001J82976P031m87376k16029J32365J62279j21854k1041L84504
13628E9447K21443k08591k2181J7914J73824m5596l05701l20418J04482R7111
13618b28266L29395K63228Q8577n1480r161O9391m2617j62218k40292j49341k03735
13607c36519J22239L43685j728m2045k1943k06708J50250J17222J2032o8612J0264
13596G8137j8069J44691J85884o7259J59456k11035o5636R9137j22875r7300j08981
13585b3850M6321N3589K49765n301j96581J2506J34705l61384j94471p3904J02462
13574b56143R0541k2606K6066J15394k0393m7155m9490j14575J56087M44454P532
$$ plain form
13648 190722 347469 223067 198903 77001 -80430 -301274 -186026 -88823 -343635 -286409
13638 -286409 36592 219568 226599 -260777 -476806 -344441 -182162 -304016 -325057 59447
13628 59447 280890 72299 50118 68032 241856 196260 -109441 -429859 -325377 -228266
13618 -228266 101129 364357 452934 401454 392293 461684 419067 256849 16557 -132784 -336519
13607 -336519 -214280 129405 127677 85632 63689 -143019 7231 124453 136485 67873 78137
13596 78137 60068 204759 390643 323384 482840 271805 206169 305306 182431 85131 -23850
13585 -23850 22471 76060 325825 320524 123943 136449 271154 -90230 -284701 -358605 -256143
13574 -256143 -165602 -188208 -162142 -46748 -67141 -114296 -163786 -278361 -122274 322180 329712
13563C29712k43491L2369K62266P8884j44248j82882k9348J41055r342j40079
13553I4896k36218L0867J32532q7357l98328P3006K11111J25664R6717J3233P5193
13542A31316J43225K63279P1409j61583R6692q4170k03999J98859j98158k15909
13532D0961J7454L9774M36616o4038j33584j76639j38029P7983k31573J6364j25591
13521b40302j37225K45213K37955O3327K04454r0072p7709N6927J95456j5483
13511D42541j22664J2869J68964j61983j15984K6265j98216J6301J32223j43838
13501E6478k5431K24084l7217j22268M380J0561J43457R222m8421k60598O9122
13490B3369K03002R1493j45316j54841L1123K18075n7349m64846j19735J50853
$$ plain form
13563 329712 86221 118590 380856 459740 315492 132610 103262 244317 234975 94896
13553 94896 -141322 -110455 22077 -65280 -463608 -390602 -179491 -53827 42890 56123 131316
13542 131316 274541 537820 609229 447646 544338 460168 256169 455028 256870 40961
13532 40961 58415 98189 534805 470767 337183 160544 22515 100498 -131075 -114711 -240302
13521 -240302 -377527 -132314 105641 168968 373422 283350 205641 262568 458024 442541
13511 442541 319877 332746 501710 339727 223743 250008 51792 68093 200316 56478
13501 56478 31047 255131 217914 95646 100026 110587 254044 263266 214845 -45753 23369
13490 23369 226371 317864 172548 17707 48830 266905 209556 -255290 -375025 -224172
13480b24172M07009K09031n2454j31479j07862k3059l874O1615j60842q7739K06766
13469I2940J47623l81178J77573J69137k33573K17884j78091q3266j9442J33085
13459D2692o917p3936p4954M11964N69059J05238j48207l40708k17237M5466M7430
13448C59890j38090k90768k86805J2452J36897J42277r4172L1582L36050M0129
13438B49442J34812j83271k1966r0430K1262j79258L7419R6529O1810j34615n1068
13427e9334L6972K88814J12589o0549k23375j78205J32101R0485r7633P3079k99352
13416a84408O006J55447N8961l2373M837J90683l6021j31931J32827R0351J51913
13405D06292j40380k58145j23744k8611M1749J19090N7736j58149j05961Q8451
$$ plain form
13480 -224172 182837 391868 339414 207935 100073 77014 73140 134755 -26087 -113826 92940
13469 92940 240563 -140615 36958 206095 -27478 190406 12315 -70951 -90393 42692
13459 42692 35775 -38161 -113115 298849 867908 973146 824939 484231 266994 312460 359890
13448 359890 221800 -68968 -355773 -343321 -206424 -64147 -158319 -126737 209313 249442
13438 249442 384254 200983 179017 88587 109849 -69409 -31990 64539 126349 -8266 -59334
13427 -59334 -22362 266452 379041 318492 95117 -83088 49013 139498 41865 114944 -184408
13416 -184408 -178402 -22955 36006 3633 8470 199153 163132 31201 164028 254379 406292
13405 406292 265912 7767 -115977 -144588 -102839 16251 73987 -84162 -190123 -101672
13395a01672k6742K9161K59797J11566L5723j60375k59134J43686J76070J19324
13385C27404j42013k33433P9514O1183J40922J628j34357j34825J93272j01000
13375E8295k23203Q7706L2324l58870r3076K20846p1554K08002j8687j91468m0767
13364c90452p1810K4675j11482J48520L23813J34314O8389J37901q6428J49949
13354C27389R884j73296j09956r2577O6916K62398j71704k52174j63750K24338
13344g2532q80M931O9306K82941K18658J47892J37743j45916j54494k03149M4718
13333C29218r0110P3106N9001k60702n3644o1786L22654J44651q1769k01794j92032
13322a3207j74118K68733J92402K344J92120L69414l31507o19268n0326N7230
$$ plain form
13395 -101672 -128414 -99253 160544 272110 307833 147458 -111676 32010 208080 327404
13385 327404 185391 -48042 31472 92655 233577 235205 100848 -33977 159295 58295
13375 58295 -164908 -77202 -44878 -403748 -496824 -275978 -347532 -139530 -158217 -349685 -390452
13364 -390452 -462262 -437587 -549069 -400549 -76736 57578 125967 263868 177440 327389
13354 327389 337273 163977 54021 -38556 28360 290758 119054 -133120 -296870 -72532
13344 -72532 -73412 -68481 825 283766 502424 650316 788059 642143 487649 284500 329218
13333 329218 239108 312214 371215 110513 56869 -4917 317737 462388 380619 178825 -13207
13322 -13207 -187325 81408 273810 276154 468274 837688 506181 -113087 -163413 -106183
13312a06183L8820r5293n4607J75275K43961k0126k33051j43005j11335J01938
13302b03606J92568O5936m7416k5253K2428K53792J5825j38873n2868K89161j03607
13291B68087o6701P9718l1530k65380J29373M36539J42644l6601k08202r0852
13281C57095j19977k75452j40616M02722J94519o6886j65084l18794P3464J2963
13271d6046k68292L7450K05495O7975J93794J1956L10176J42146k22465o0438
13261C71751M4844J17665m0584j07714o1433p3664P960J67216j36635R6633k8979
13250C57060p5254j60182j87879J45358K35533J3310k40696k22132P788K57077
13240A29983K68037K45816k33930n3691Q2651J77770j63841k76582j31024j79054
$$ plain form
13312 -106183 -67363 -162656 -217263 -41988 201973 181847 -51204 -194209 -305544 -203606
13302 -203606 -11038 54898 7482 -17771 4657 258449 274274 135401 82533 371694 268087
13291 268087 201386 281104 249574 -15806 113567 550106 692750 656149 447947 357095
13281 357095 237118 -38334 -178950 223772 418291 351405 186321 -132473 -59009 -46046
13271 -46046 -314338 -276888 -71393 -3418 190376 202332 512508 654654 432189 371751
13261 371751 416595 534260 493676 385962 324529 250865 258825 426041 289406 386039 357060
13250 357060 281806 121624 -66255 79103 314636 327946 87250 -134882 -127094 129983
13240 129983 398020 643836 409906 356215 438866 616636 452795 176213 45189 -133865
13230a33865q6976O1887J76958J59239j03143K951K29963j93011J7534J40501
13220B72038K11358J92119M4469j01068k72357j70375J01956n774k47024j86900
13210a61558K61998N1727l7878j93404J08794L2153J32253j5536J21003J36275
13200D35827q5L2370j6275j98120j4273L5175k5145J05847J22976J0204j73060
13189C15441M9432j47441j70861K02786r7537j08100L63678J98255r2131k39910
13179B73612J13435J96329M6891k27501J22743J46714j89908l97943O2564n7752
13169H9184k74677j43322N0218j92838K82337K22927J40325R8620K88785m8887
13159E12672k79147k23100Q3065K80100J51753J02952j44799k30801k527j42924
$$ plain form
13230 -133865 -220841 -158954 18004 177243 74100 77051 307014 114003 131537 272038
13220 272038 483396 675515 719984 618916 346559 176184 278140 272366 25342 -161558
13210 -161558 100440 152167 114289 -79115 29679 61832 194085 178549 299552 435827
13200 435827 435742 468112 451837 253717 239444 274619 249474 355321 478297 488501 315441
13189 315441 364873 217432 46571 249357 151820 43720 407398 605653 513522 273612
13179 273612 387047 583376 630267 402766 525509 672223 482315 84372 146936 89184
13169 89184 -185493 -328815 -278597 -471435 -189098 33829 174154 272774 561559 512672
13159 512672 233525 10425 93490 373590 525343 628295 483496 252695 250168 107244
13149A07244j11907L15203M4589L01341Q7154q5820j51447O5700J60148N7741
13139G89946q5398k20034q2225k560j68441N6990k60368j37505l0888L0627j25255
13128b35111J81988j10424K58978L04662Q3066j08814Q3920R9167J59862K5147
13118G42441k40257j50511K4635l3005J42892L45437M2268j8049l2777j24637
13108F98437o065K59410J02390r8349k78607k8216r80k84560j64864K35876K64660
13097F99132j9739l34897r8256j73245J00190J09258k9339J5205N1230L8951p3883
13086B84607r7413k6382j29575q8562J20269P4022L7829J60106j73901M1996J58635
13075C61631j38374j4501m4228P7540J48585K5360q6126k6343J85546N326q3512
$$ plain form
13149 107244 -4663 310540 355129 656470 743624 657804 506357 572057 732205 789946
13139 789946 704548 484514 402289 399729 231288 288278 27910 -109595 -140483 -109856 -235111
13128 -235111 -53123 -163547 95431 400093 483159 374345 458265 557432 717294 742441
13118 742441 502184 351673 376308 343303 486195 831632 873900 855851 823074 698437
13108 698437 692372 951782 1054172 955823 677216 649000 648020 363460 198596 434472 699132
13097 699132 679393 344496 246240 72995 173185 282443 253104 268309 319539 358490 284607
13086 284607 187194 160812 31237 -57325 62944 136966 174795 334901 161000 202996 361631
13075 361631 223257 208756 164528 242068 390653 416013 329887 303544 489090 494416 410904
13064D10904j87641M5563J57581J30018j19350L8624q8377j01803k86359o666
13054g506P5313K50180J62466m8695o6848l3908K89853L9150j76755j8666N2857
13043E17441K34286k17476l26506j14659J59178M8809l1438j55163j02107K15958
13033B28323p8671k76064K31866K06489Q312l5265O4009l6457J14490K17207J38195
13022G82434K37707r3991m58399J65643n5503J19483J35664K07607l6238n7974
13012I46433r358r0107K8353l0727N8606j52492J1733q251J45719R2982k7721
13001I65170J17596l5170n8142l8503m96410n8139J46950J82895j58922r0487
12991D76838j37084Q6402J75154k27490O4429Q6307J68623R6603j61226j0302
$$ plain form
13064 410904 223263 268826 426407 556425 437075 475699 387322 285519 -840 -7506
13054 -7506 67807 317987 480453 431758 364910 331002 620855 660005 483250 464584 517441
13043 517441 751727 534251 207745 93086 252264 301073 269635 114472 12365 228323
13033 228323 149652 -126412 105454 311943 320255 284990 348999 312542 427032 644239 782434
13022 782434 1020141 926150 467751 633394 577891 697374 833038 1040645 1004407 946433
13012 946433 937075 846968 875321 844594 903200 750708 762441 754190 899909 992891 965170
13001 965170 1082766 1047596 989454 950951 454541 396402 543352 726247 567325 476838
12991 476838 339754 426156 601310 373820 438249 524556 693179 789782 628556 618254
12981F18254J812L11841q3599L5531j19796M144M9752o6149o5422K29587J84529
12970A100484k37188O1168J40239j73770k88881K85254K2973J5906k40226j73744
12960E12215k40291J1521K28556J49091k19953k66413K40230K79434K431n1544
12950F45277N5498r4937l3324o1247k69796o0463p2454J54951N7177J59348J03577
12939E83607m3614J98308j82192J17111k32617j88367j6090M01966M34390k33209
12929H39293j14572q8584L0598J2816K12350j41229j29658m5418L3683K70292
12919H79571O4226K81726j30315m10722k57386M2464R360k9356o9103J82294L85742
12908I48501L09148r5433k46202k20589L7081J52042O0895l3644m4355j60891
$$ plain form
12981 618254 620066 931907 848308 883839 764043 768187 817939 751790 686368 915955 1100484
12970 1100484 863296 924464 1064703 890933 602052 887306 910279 926185 685959 512215
12960 512215 271924 283445 512001 661092 441139 174726 414956 694390 696821 645277
12950 645277 700775 605838 572514 511267 241471 181008 108554 263505 320682 480030 583607
12939 583607 539993 738301 556109 673220 440603 252236 236146 638112 1072502 839293
12929 839293 724721 636137 666735 679551 891901 750672 621014 575596 609279 879571
12919 879571 943797 1225523 1095208 684486 427100 469564 478924 449568 380465 562759 948501
12908 948501 1257649 1162216 916014 695425 732506 884548 945443 911799 867444 706553
12898G06553q340j77755m30202j89731K60633K26258K62760R29k52870r492J94249
12887E82992o8437r4999K29996J96324J80172J17999l59295k66653K57620J38975
12877I14694j1739p2937k39559k5968K23595r1042J37507J91016k14914j84336
12867F26317K2713N905K26952Q740j63164l3344Q7983J99692k75820p6334j32541
12856D97099j73818j43090M4843J79114P0730K14305J70147J28661J09610O6819
12846A164420j81420K3250k32097k34080M8679K32768J04178k03594k02312J3326
12836E33118J58757L0294j79928K96404K51046k63689j39964J46466M78865K69358
12826A580727j65766j65963J86903l87570k14504J38042N5008q4720J45793P6008
$$ plain form
12898 706553 698213 520458 90256 -99475 161158 387416 650176 651105 398235 388743 582992
12887 582992 514555 419556 649552 845876 1026048 1144047 784752 518099 775719 914694
12877 914694 902955 830018 590459 564491 788086 697044 834551 1025567 810653 626317
12867 626317 649030 654935 881887 890627 727463 694119 782102 981794 705974 629640 497099
12856 497099 323281 180191 225034 404148 474878 689183 859330 987991 1097601 1164420
12846 1164420 983000 1006250 774153 540073 588752 821520 925698 722104 519792 533118
12836 533118 691875 722169 542241 838645 1089691 826002 686038 832504 1311369 1580727
12826 1580727 1414961 1248998 1435901 1048331 833827 971869 1026877 942157 1087950 1163958
12816A163958j04262j10525R2089J9782j48940K12306l4600J17268p5553l05618
12806H25905J41907J59658R1091R7796p2814N7847O9467j46255m2802r3681k8986
12795A059133q6603J59329K53027j40917l13664P492P3083n1677J43q0050j88126
12784F91170j33751J00676K70967q509J14761J85148O9588l243k1838j47088L7880
12773A155761M2232M3404q9070M7666O4157J5118P1839J78697j111l1802P4178
12762A571069M0122j36021l72478j76138M4584J96009p4368p7238Q6715L28326
12752A430582j23367l54725J35190K06496J13306j06520j41399j68936K3933q8992
12742I25568o9527n8209Q0215j05609R1926J25720J9380J66268K29388Q505k08984
$$ plain form
12816 1163958 1059696 949171 1041260 1061042 912102 1124408 1089808 1207076 1131523 825905
12806 825905 967812 1127470 1218561 1316357 1243543 1301390 1370857 1224602 1181800 1088119 1059133
12795 1059133 972530 1131859 1384886 1243969 930305 937797 1010880 959203 959346 879296 691170
12784 691170 557419 658095 929062 920553 1035314 1220462 1290050 1286807 1264969 1117881 1155761
12773 1155761 1197993 1241397 1152327 1199993 1264150 1279268 1351107 1529804 1528693 1496891 1571069
12762 1571069 1611191 1475170 1102692 926554 971138 1167147 1092779 1015541 1102256 1430582
12752 1430582 1307215 952490 1087680 1294176 1407482 1300962 1159563 990627 1014560 925568
12742 925568 856041 797832 878047 772438 864364 990084 1009464 1175732 1405120 1413625 1204641
12731A204641j6301j73823j00968L8662M0490j507K03285K23008j8107l34221
12721A065159k9684j2572j4416J15758J9415R7392J29050K67285k21908o03416
12711H12063K6280J66969N3633J01370N2755J5932J80444K02190N4344J34829
12701A800809j16904k15159k58861o521q12K56129K06736r0064j82780J64791
12691A557364J84664J01037m104l9071J1331j52109j89535j65589p7830O9372
12681A295530P9759Q5631k5902m0283K29208J63351R3319J36034j85366Q6497
12671A917778K9013j30432l19932K6363J36398k0669J05674k0309l23849k04640
12661A195395K10442L35450J74752N0060j03026p8457l8955R3218j67346j67946
$$ plain form
12731 1204641 1188340 1014517 913549 952211 992701 991194 1194479 1417487 1399380 1065159
12721 1065159 1035475 1022903 1008487 1124245 1143660 1241052 1370102 1637387 1415479 812063
12711 812063 838343 1005312 1058945 1160315 1213070 1229002 1409446 1611636 1665980 1800809
12701 1800809 1683905 1468746 1209885 1203364 1202552 1458681 1665417 1575353 1392573 1557364
12691 1557364 1742028 1843065 1838961 1799890 1811221 1659112 1469577 1303988 1226158 1295530
12681 1295530 1375289 1460920 1435018 1394735 1623943 1787294 1880613 2016647 1831281 1917778
12671 1917778 1946791 1816359 1496427 1522790 1659188 1638519 1744193 1723884 1400035 1195395
12661 1195395 1405837 1741287 1916039 1966099 1863073 1784616 1745661 1838879 1671533 1503587
12651A503587N6170P7599k08589m6054N7947K22774j88798j0719R0613j52636
12641A401894K7214J55753L7930j35772j73990j68060K7219L44098P5487p8682
12631A513091j35987P7645K08871k09929m06202J74716K43543K55189J67067k84003
12621A604001l60264K86742J32622L90768M37729N8653l56003k87462k1794m8723
12611A836269M6798J75478j66438j7886j22814J62062K98n6907L4668k3064k04045
12600A664419m741K10738k6218j26104K45815K66219K87158k46364o483L41607
12590B606046O9595j78250k20987J38614o6879n0370k21392j95701j22278j82784
12580A575614L63124J03168Q4759J19503J22232j88253k65938o44n6292p9946
$$ plain form
12651 1503587 1559757 1637356 1428767 1382713 1440660 1663434 1474636 1463917 1554530 1401894
12641 1401894 1429108 1584861 1622791 1487019 1313029 1144969 1172188 1516286 1591773 1513091
12631 1513091 1377104 1454749 1663620 1453691 1047489 1222205 1465748 1720937 1888004 1604001
12621 1604001 1243737 1530479 1663101 2053869 2491598 2550251 2194248 1906786 1884992 1836269
12611 1836269 1883067 2058545 1892107 1874221 1751407 1913469 1913767 1856860 1891528 1868464 1664419
12600 1664419 1659678 1870416 1844198 1718094 1963909 2230128 2517286 2270922 2264439 2606046
12590 2606046 2675641 2497391 2276404 2415018 2348139 2297769 2076377 1880676 1758398 1575614
12580 1575614 1938738 2041906 2126665 2246168 2368400 2180147 1914209 1913565 1857273 1777327
12570A777327K91055k0933K8331J13030k38662k27910k62626P1303K67890O2684
12560A861489l1691L13697J12370l6940k9458J48282K5779j32129o2072K2463
12550B191790m52401J01411K75806J005N8760K63428k27371l815K74442r8360
12540B384695J40560K25562J03840m31735j72940J38401J0094J43707o4271l6386
12530B441527o3753j81168J45965J19438P4641n7183j9625L04155J46684k22393
12520B688288J9520J29446J67776R2289j04617j29741j35218l20060j07991K3962
12510B323654k16900j46780m5948L93048J75480P6492R9244j03159m2977j90562
12500B321592l086J40275K06751J13204m4125j56402r4076J97947J1045L8431
$$ plain form
12570 1777327 2068382 2047449 2075780 2188810 1950148 1722238 1459612 1530915 1798805 1861489
12560 1861489 1829798 2143495 2255865 2218925 2189467 2337749 2363528 2231399 2169327 2191790
12550 2191790 1739389 1840800 2116606 2117611 2176371 2439799 2212428 2208613 2483055 2384695
12540 2384695 2525255 2750817 2854657 2422922 2249982 2388383 2398477 2542184 2477913 2441527
12530 2441527 2377774 2196606 2342571 2462009 2536650 2479467 2459842 2763997 2910681 2688288
12520 2688288 2707808 2837254 3005030 3097319 2992702 2862961 2727743 2407683 2299692 2323654
12510 2323654 2106754 1959974 1914026 2307074 2482554 2559046 2658290 2555131 2512154 2321592
12500 2321592 2318506 2458781 2665532 2778736 2734611 2578209 2484133 2682080 2693125 2731556
12490B731556P4703q4538j02081j90837K21498N8515K64892J95692j3656j63982
12480B991762k52152p4777n2418J69435M20299n9120k10585Q4178L15287j7942
12470C313967k7644J06574J77888j7274k34314K5356J12005m75281j86529J29098
12460B923846K22120j54770j89091p0360J62935J37830j77700J81781R9072J16506
12450C252169p8363o808J142k24485J96426J30666J58931k781l04966k57729J38377
12439C002579k26396j74838J86571L05102R5921j00926J58614K21570p7170p7292
12429C313735J6956j11752J09442Q0847J38493J50332k55342j82306J26791K11191
12419C598387n1885j89263n0431J82296N6037J42833J32325R9575k33292k22051
$$ plain form
12490 2731556 2806259 2721721 2619640 2428803 2650301 2708816 2973708 3169400 3155744 2991762
12480 2991762 2739610 2664833 2612415 2781850 3202149 3143029 2932444 3016622 3331909 3313967
12470 3313967 3286323 3392897 3570785 3553511 3319197 3344553 3456558 2981277 2794748 2923846
12460 2923846 3145966 2991196 2802105 2731745 2894680 3032510 2854810 3036591 3135663 3252169
12450 3252169 3173806 3166998 3168140 2943655 3140081 3270747 3429678 3426897 3121931 2864202 3002579
12439 3002579 2776183 2601345 2787916 3093018 3188939 3088013 3246627 3468197 3391027 3313735
12429 3313735 3330691 3218939 3328381 3409228 3547721 3698053 3442711 3260405 3387196 3598387
12419 3598387 3546502 3357239 3306808 3489104 3545141 3687974 3820299 3919874 3686582 3464531
12409C464531K86871K24685n271J79706j81654k13506k74546j40350L73223L49057
12399D062746m8226j08819n8999Q9396P9341j25119j12628q483K44650K67672
12389D281531O0824m9241k93584J21569J86970J87002J00710k6685j38435R4583
12379D525244j45878j10630l4169R5037Q8313j83058o4375l3036R4981N53431
12369D785860J19574l24741n820M3497J89080M2588m73623J53294J88821n5517
12359D663013l6180J33220k0598j85267k01362J94927J89191K238J21131p3609
12349D786704q2300J30666J22294k9314n7000N7041O0357L3365K14984J88312
12339E425109j34331n552j70868j05027L6981R2324K86831p9712M8825J07780
$$ plain form
12409 3464531 3751402 3976087 3970816 4150522 3968868 3755362 3480816 3340466 3713689 4062746
12399 4062746 4014520 3905701 3846702 3936098 4015439 3890320 3777692 3769209 4013859 4281531
12389 4281531 4342355 4293114 3999530 4121099 4308069 4495071 4595781 4569096 4430661 4525244
12379 4525244 4379366 4268736 4234567 4329604 4417917 4234859 4170484 4137448 4232429 4785860
12369 4785860 4905434 4580693 4574873 4618370 4807450 4850038 4376415 4529709 4718530 4663013
12359 4663013 4626833 4760053 4739455 4554188 4352826 4547753 4736944 4739182 4860313 4786704
12349 4786704 4704404 4835070 4957364 4928050 4871050 4928091 4988448 5021813 5236797 5425109
12339 5425109 5290778 5285226 5114358 5009331 5046312 5138636 5425467 5345755 5394580 5502360
12329E502360k26901J66867j36046k55243J5340J29132M1601L0842j18897j71857
12319D977198K05944J08087j11013J66199K29310M2275o5947j52011k61587K21700
12309E360155J92348L3668Q9703R9152k12973k9281K60300K33517m6864j53202
12299E826523J22530K25207j4740O8182j48985M2601j22142n8241M6913q5089
12289E902759j63014L74590M13267J21780j94893k24564n134J58771N0937J67372
12279F601871j5972K4232J16919J06922K33370J69620J447j59848j55685k05547
12269F717329j52788j43696j53445O8900L78291K99785K6881K28396k29289Q8510
12259G128874J68914J43003j35965J61941K26305J4388k50920l36027N3371K58958
$$ plain form
12329 5502360 5275459 5442326 5306280 5051037 5066377 5195509 5237110 5267952 5149055 4977198
12319 4977198 5183142 5291229 5180216 5346415 5575725 5618000 5552053 5400042 5138455 5360155
12309 5360155 5552503 5586171 5675874 5775026 5562053 5532772 5793072 6026589 5979725 5826523
12299 5826523 5949053 6174260 6159520 6227702 6078717 6121318 5999176 5940935 5987848 5902759
12289 5902759 5739745 6114335 6527602 6649382 6454489 6229925 6224791 6383562 6434499 6601871
12279 6601871 6585899 6610131 6727050 6833972 7067342 7236962 7238409 7078561 6922876 6717329
12269 6717329 6564541 6420845 6267400 6336300 6714591 7014376 7041257 7269653 7040364 7128874
12259 7128874 7297788 7440791 7304826 7466767 7693072 7707460 7456540 7120513 7173884 7432842
12249G432842K19529J45182r047J8105k7048P7908J27241k02085Q8081k01801
12239G668907k76250K10557O0069J56777L83932L96267k54033j93265j60299J04313
12229H096975M3212O256m0908k0415K03151J10399q9976r1424P7032j94763P2985
12218H172524J75530P0894J24045L23572R6091q8295N7581J61028q9509K18193
12208I221654R7882j18788J54219K67715k3195L0585q4555k55479j20155r4540
12198I075343M7883p9366J30535K00183J81379J17928K34668O1173r355J38166
12188A0098537j6808j0221M73231K99039J24557J6356k49857j36733J2219r4087
12178A0516233j224r0762J80623L98727M80439L0218l40604l06997J53188p7807
$$ plain form
12249 7432842 7652371 7797553 7788506 7806611 7779563 7857471 7984712 7782627 7870708 7668907
12239 7668907 7392657 7603214 7663283 7820060 8203992 8600259 8346226 8152961 7992662 8096975
12229 8096975 8140187 8146443 8105535 8085120 8288271 8398670 8308694 8217270 8294302 8099539 8172524
12218 8172524 8348054 8418948 8542993 8866565 8962656 8874361 8931942 9092970 9003461 9221654
12208 9221654 9319536 9200748 9354967 9622682 9599487 9630072 9545517 9290038 9169883 9075343
12198 9075343 9123226 9043860 9174395 9374578 9555957 9673885 9908553 9969726 9960371 10098537
12188 10098537 10081729 10071508 10544739 10843778 10968335 10984691 10734834 10598101 10610320 10516233
12178 10516233 10515009 10424247 10604870 11003597 11484036 11514254 11173650 10866653 11019841 10942034
12168A0942034O567l5544Q1181K03033J33893L90200l4019j76476O8891K4387
12158A1604147J75596l1262O0561K8979j9159L6701J35155j34730r9171K55710
12148A2012527K80971J23143J20468j76157m8783N2938K00383R6127k2882J57872
12138A2796607M9023p8700j55192J48857R0238O1461P7028J01617J52017K80252
12128A3523208K01786j70406m90966J33606K25862m6267K00908M45601n8452k96911
12118A3667969j3975K92279L22502K17887p3179K23315j9427j91417R7339Q9625
12108A4612918J57638K685J14303l0376Q7913K87143O1725L1520J41277J72655
12098A5639401j30305K44912k70500k66331j5198K85384O7643K4948p5006N5174
$$ plain form
12168 10942034 10948601 10913057 10994238 11197271 11331164 11721364 11687345 11510869 11579760 11604147
12158 11604147 11779743 11748481 11809042 11838021 11818862 11855563 11990718 11855988 11756817 12012527
12148 12012527 12293498 12416641 12537109 12360952 12312169 12365107 12565490 12661617 12638735 12796607
12138 12796607 12845630 12766930 12611738 12760595 12850833 12912294 12989322 13090939 13242956 13523208
12128 13523208 13724994 13554588 13063622 13197228 13423090 13376823 13577731 14023332 13964880 13667969
12118 13667969 13653994 13946273 14268775 14486662 14413483 14636798 14617371 14425954 14523293 14612918
12108 14612918 14770556 14773241 14887544 14857168 14945081 15232224 15293949 15325469 15466746 15639401
12098 15639401 15509096 15754008 15483508 15217177 15201979 15487363 15555006 15579954 15504948 15560122
12088A5560122L69812L02555K86698k1331j84556l7211J28532r1020K03151O9523
12078A6586275K312R9135J80044j47715P6880K0723J43682J77541J12326j5990
12068A7235213L8875L45122K21025K5074k1673p7658L8518K44226J77457Q5252
12058A8311431q2766P799n8966L3386j70395R2844J79543L52911L579m1844J37328
12047A8764850L24829J39637K04933J95697j55107l1734J55870J3612J63919j0916
12037A9765590J84162K58716K29352K60570L9099j22078J42253K41844L0398j13088
12027B0916818N692K60906K06587o2237l6632k6535j56667J89825M07859K35385
12017B1941001n8995J20138K56817J41495o1315j1024L19454L6460l20099N9121
$$ plain form
12088 15560122 15929934 16232489 16519187 16497856 16313300 16276089 16404621 16313601 16516752 16586275
12078 16586275 16588587 16687722 16867766 16720051 16796931 16817654 16961336 17138877 17251203 17235213
12068 17235213 17274088 17619210 17840235 17865309 17843636 17765978 17804496 18048722 18226179 18311431
12058 18311431 18228665 18236464 18177498 18210884 18040489 18133333 18312876 18665787 18669366 18627522 18764850
12047 18764850 19089679 19229316 19434249 19629946 19474839 19443105 19598975 19612587 19776506 19765590
12037 19765590 19949752 20208468 20437820 20698390 20737489 20615411 20757664 20999508 21029906 20916818
12027 20916818 20922510 21183416 21390003 21327766 21291134 21264599 21107932 21297757 21705616 21941001
12017 21941001 21882006 22002144 22258961 22400456 22339141 22328117 22647571 22684031 22363932 22423053
12007B2423053K95929L44226K57l01724L7736L18390O03369L62389O4100J13434
11997B4261159J05618j73440l27469J98378K40692N7131J51477j99865k10058
11988B4103623M423J01065l54067l28868N7519J15064n7082r0731j7463R8455
11978B3631938p21J50542L29646J0325k67142J22077J42827l2151L56934J41071
11968B4585346r7100k93125j24264j38807k19533L38555j53063p5320J11628J77594
11958B4111911P505j33440j3752L05825P8548j6844J13220N7225M8099N8156Q0598
11947B4697051J91348K55251J88688J44065R1674L41432L41758J28108K33342
11938B6612717J50696j13725k03150J71996K72937K9423J52829L92403K76657
$$ plain form
12007 22423053 22718982 23063208 23063465 22761741 22799477 23117867 23721236 24083625 24147725 24261159
11997 24261159 24366777 24193337 23865868 24064246 24304938 24362069 24513546 24313681 24103623
11988 24103623 24108046 24209111 23855044 23526176 23583695 23698759 23641677 23550946 23533483 23631938
11978 23631938 23631217 23781759 24111405 24121730 23854588 23976665 24119492 24087341 24444275 24585346
11968 24585346 24488246 24195121 24070857 23932050 23712517 24051072 23898009 23822689 23934317 24111911
11958 24111911 24119416 23985976 23972224 24278049 24356597 24339753 24452973 24510198 24558297 24616453 24697051
11947 24697051 24888399 25143650 25332338 25476403 25568077 25909509 26251267 26379375 26612717
11938 26612717 26763413 26649688 26446538 26618534 26891471 26920894 27073723 27466126 27742783
11929B7742783K0492j6748J48104J67917M3542J6508K61112J99108k4074l7733
11919B8521011J09352l991J79001K50800J8635q9865Q5499J68481L89257L90718
11909C0018898J39184K19907J04621j9038j81714q1353n99712k7969O6045M9868
11899B9688737k12538m81224m85138j99333j97578l43989K4044L8113j73752j08117
11889B7549225J23808j45702l05915j78887j13125m01689o8781j68168J71024
11880B6461790k76655l26698J15019L34391l0054k45593j96988K02927j11242
11871B5926897l35228m31568n55067n28195m39012o0529l86186m78975j99270
11862B2512867Q3990l3435k06519j50736k45490k90431n4407N9813k92524r4696
$$ plain form
11929 27742783 27763275 27746527 27894631 28062548 28106090 28122598 28383710 28582818 28558744 28521011
11919 28521011 28630363 28626372 28805373 29056173 29074808 28984943 29070442 29238923 29628180 30018898
11909 30018898 30158082 30377989 30482610 30463572 30281858 30200505 29600793 29572824 29638869 29688737
11899 29688737 29476199 28994975 28509837 28310504 28112926 27768937 27792981 27831094 27657342 27549225
11889 27549225 27673033 27527331 27221416 27042529 26929404 26527715 26458934 26290766 26461790
11880 26461790 26185135 25858437 25973456 26307847 26277793 26032200 25835212 26038139 25926897
11871 25926897 25591669 25160101 24605034 24076839 23637827 23577298 23191112 22712137 22512867
11862 22512867 22596857 22563422 22356903 22206167 21960677 21670246 21615839 21675652 21383128 21288432
11852B1288432O3294K45212J54470l64119l55307P91n3394l4784J20540k39107
11842B0826028m22348k29101o2824j73293j58558k14828P6270m2895k05186j39413
11832A9253852R5720R8171N6661J9554k4482k99745k68827n9353J63120o5073
11822A8969598N9050k3411K1171m6697r1154K6125N0225k58075k27324l34857
11812A8144651j0015Q3303k00415r9507O3178N0205k50362j46265J18037j13542
11802A7639268l25184k25911j63567j12851o3710j33080k53877k05617Q118K2662
11792A6186251n5510J44978J34322m6226j25777l44106N0969j34026k63718K9289
11782A5576446j83475k76395K14659q2257k31288J83312j29789j52091P8712k56732
$$ plain form
11852 21288432 21351726 21596938 21751408 21387289 21031982 21032773 20979379 20944595 21065135 20826028
11842 20826028 20403680 20174579 20111755 19938462 19779904 19565076 19641346 19598451 19393265 19253852
11832 19253852 19349572 19447743 19504404 19523958 19499476 19199731 18930904 18871551 19034671 18969598
11822 18969598 19028648 19005237 19026408 18979711 18888557 18914682 18964907 18706832 18479508 18144651
11812 18144651 18134636 18217939 18017524 17918017 17981195 18031400 17781038 17634773 17752810 17639268
11802 17639268 17314084 17088173 16924606 16811755 16748045 16614965 16361088 16155471 16163589 16186251
11792 16186251 16130741 16275719 16410041 16363815 16238038 15893932 15944901 15810875 15547157 15576446
11782 15576446 15392971 15116576 15331235 15248978 15017690 15201002 15071213 14919122 14997834 14741102
11772A4741102l27138k63570j68715j53085K30747K5676r1285k91081j12150r0784
11762A3499717k99656j29560j88935n9257k56262l10884k7242J56971n9672k90162
11752A2035058J19051J64753j63404l00295k80787j20515n2212R2768k7800L72710
11742A1839327K45520j5004k85579l17067n4313K20643J79242L8645j75981k29783
11732A1445650j32785M3680o706k16702q621j51636k4226j67704n1844l22549
11722A0406557n4133J33844p8071L0784K42352l06373j55940m7496M6749K31029
11712A0449302J6124p0069j9099k09637k45910j6801L8461J10545k72123J45044
11702I925837j90551k58024k7685L4676k04016J04984J03404P6043k62192k35412
$$ plain form
11772 14741102 14413964 14150394 13981679 13828594 14059341 14085017 13993732 13702651 13590501 13499717
11762 13499717 13200061 13070501 12881566 12822309 12566047 12255163 12227921 12384892 12325220 12035058
11752 12035058 12154109 12318862 12155458 11855163 11574376 11453861 11401649 11494417 11466617 11839327
11742 11839327 12084847 12069843 11784264 11467197 11412884 11633527 11812769 11851414 11675433 11445650
11732 11445650 11312865 11356545 11349839 11133137 11124516 10972880 10948654 10780950 10729106 10406557
11722 10406557 10352424 10486268 10408197 10438981 10681333 10374960 10219020 10171524 10218273 10449302
11712 10449302 10465426 10395357 10376258 10166621 9920711 9903910 9942371 10052916 9780793 9925837
11702 9925837 9735286 9477262 9449577 9484253 9280237 9385221 9488625 9564668 9302476 9067064
11692I067064p2134j16097K6302j02045k24817J45457K52289J81656r1556j06443
11682H959676j63097L1562Q1536j481j59607j71908j55720k26539P9384L8064
11672H311870l46408j7531j38554p6380J87385L35048J59331j6169k48275k99793
11662G850524L8670J17084K13485k7331K29239j72546l92754j6011k24235p4417
11652G541708K54536K7204J46768M7149O8135k46812j32112j04823J58436j94940
11642G565249o6758N5907n4480j44565n0525J67521J64025N816k41361o1727m1814
11631G297288K8383Q986M823J2413M5273m5345r8574l10328j39939n7713J10798
11620F856065k4088m3783M3419K12411k38016j61287K28969j33106k20263j92787
$$ plain form
11692 9067064 8994930 8878833 8905135 8803090 8578273 8723730 8976019 9157675 9066119 8959676
11682 8959676 8796579 8828141 8909677 8908196 8748589 8576681 8420961 8194422 8273806 8311870
11672 8311870 7965462 7947931 7809377 7732997 7920382 8255430 8414761 8398592 8150317 7850524
11662 7850524 7889194 8006278 8219763 8192432 8421671 8249125 7856371 7840360 7616125 7541708
11652 7541708 7796244 7823448 7970216 8017365 8085500 7838688 7706576 7601753 7760189 7565249
11642 7565249 7498491 7554398 7499918 7355353 7304828 7472349 7636374 7642190 7400829 7339102 7297288
11631 7297288 7325671 7334657 7339480 7351893 7397166 7351821 7253247 6942919 6802980 6745267 6856065
11620 6856065 6831977 6788194 6831613 7044024 6806008 6644721 6873690 6740584 6520321 6327534
11610F327534l59906M8961K25343Q072N4626j01238L6373j2755r3668j32864J40906
11599F141384J64739Q6020k62580j67593Q4632p8424j61140J18697J944K26288
11589F153967j38384r0433n6190j72632k7470O2281k30977r032l34984k702r9002
11578E054442R4940L26898L40927o7645J72395o5735k49243j75868k39990j83122
11568E007999j00298K58734K61582K9391j43651m9869R8944j85428j49203J46858
11558E175059N3007j704L30246J25095O8067q5078l0327J10094J26049o8315j72050
11547E630143j22722J38344Q6099R6649m5760l02503k66550L0079J3923j52897
11537E104805O2337K54826K6581J39893l3228j23789r216j54767J68360O3104
$$ plain form
11610 6327534 5967628 6016589 6241932 6250004 6304630 6203392 6239765 6227010 6133342 6000478 6141384
11599 6141384 6306123 6392143 6129563 5961970 6046602 5968178 5807038 5925735 5927679 6153967
11589 6153967 6015583 5925150 5868960 5696328 5668858 5731139 5500162 5491130 5156146 5153444 5054442
11578 5054442 5149382 5476280 5817207 5749562 5921957 5856222 5606979 5431111 5191121 5007999
11568 5007999 4907701 5166435 5428017 5457408 5313757 5263888 5362832 5177404 5028201 5175059
11558 5175059 5228066 5226362 5556608 5681703 5749770 5664692 5634365 5744459 5870508 5802193 5630143
11547 5630143 5507421 5645765 5731864 5828513 5782753 5480250 5213700 5243779 5257702 5104805
11537 5104805 5167142 5421968 5448549 5588442 5555214 5431425 5422209 5267442 5435802 5498906
11527E498906J50136K2367o5999r8138r3162L89082j2145o3661p4966J08186M1127
11516E801733m2741o119r3073k12932R5117J10049K63313q9953n4388K35546K64787
11505F271339n0861k38333j19082k88683o7818N4297P840Q2344j06375o2339j08895
11494E373434J62705K7883r934m855L9132J7595J24181q3729Q0465J61287L04426
11483F192590L10404o8082k44691m18737K75451O53443J26582k15273K7851r6369
11473F543169j65907q6158O9891K97894L11782N1955L22512J66230O7707K26550
11463G805625J21537J12858K61189L19965L80052L18124L88038O69776M43707
11454A0820871N23068N18002M47722P98788J061279Q18616J237082J352706J320972
$$ plain form
11527 5498906 5649042 5671409 5605410 5507272 5414110 5803192 5791047 5727386 5652420 5760606 5801733
11516 5801733 5758992 5752873 5659800 5446868 5541985 5652034 5915347 5825394 5771006 6006552 6271339
11505 6271339 6220478 5982145 5863063 5574380 5506562 5560859 5568699 5651043 5544668 5482329 5373434
11494 5373434 5536139 5564022 5554088 5549233 5588365 5605960 5730141 5646412 5726877 5888164 6192590
11483 6192590 6502994 6434912 6190221 5771484 6046935 6700378 6826960 6611687 6639538 6543169
11473 6543169 6377262 6291104 6360995 6658889 6970671 7022626 7345138 7511368 7579075 7805625
11463 7805625 7927162 8040020 8301209 8621174 9001226 9319350 9707388 10377164 10820871
11454 10820871 11343939 11861941 12309663 13108451 14169730 14988346 16225428 17578134 18899106
11445A8899106J249260J475139J647751K044636K155532K478724K804202L065944
11437C5820294L601852M250459M875503N971698O617272P517551Q801638J0089897
11429H7546164J1359174J3553756J5322907J6952008J8696279J9321502J9221425
11422B01973215J8660294J6901172J4697577J1745578P634680K814260j226982
11415B73199794m673138p099123q631632q649405q521931p462487n376797l405631
11407B19379650j473764J55257K289943M655922O968774Q534934J0721917J2172801
11399B63405434J3276763J4218908J5419712J5938621J6504965J6533925J5696601
11392C70994929J4120394J2120465J0003448P731826M806492J979340n27040l124824
$$ plain form
11445 18899106 20148366 21623505 23271256 25315892 27471424 29950148 32754350 35820294
11437 35820294 39422146 43672605 48548108 54519806 61137078 68654629 77456267 87546164
11429 87546164 98905338 112459094 127782001 144734009 163430288 182751790 201973215
11422 201973215 220633509 237534681 252232258 263977836 271612516 274426776 273199794
11415 273199794 268526656 261427533 252795901 244146496 235624565 228162078 222785281 219379650
11407 219379650 217905886 218061143 220351086 225007008 231975782 240510716 251232633 263405434
11399 263405434 276682197 290901105 306320817 322259438 338764403 355298328 370994929
11392 370994929 385115323 397235788 407239236 414971062 419777554 421756894 421229854 418105030
11384D18105030n484247p947963r620016j0948977j2251028j2695230j3008160
11377C46149409j3262520j2917357j2893102j2694373j1870915j0558293r282216
11370B62670633q187043o912057n582433l576437j810497l1858J652536M042799
11362B42265643O519504Q970654J1429827J3841061J5585455J6802702J6432191
11355C31847037J4474289J1372519O840451J828094m210257j0905612j7554196
11348C33692325k2465530k6277796k7606780k6456456k3576060k0564599j7480672
11341A69264432j4510356j2556704j0746365r408296q202512o994622o388376
11334A00457201n779145n160082m604180m145934l986429l476117l269347l044278
$$ plain form
11384 418105030 412620783 404672820 395052804 384103827 371852799 359157569 346149409
11377 346149409 332886889 319969532 307076430 294382057 282511142 271952849 262670633
11370 262670633 254483590 247571533 241989100 238412663 236602166 236570308 238222844 242265643
11362 242265643 248785147 257755801 269185628 283026689 298612144 315414846 331847037
11355 331847037 346321326 357693845 364534296 366362390 362152133 351246521 333692325
11348 333692325 311226795 284948999 257342219 230885763 207309703 186745104 169264432
11341 169264432 154754076 142197372 131451007 122042711 113840199 106845577 100457201
11334 100457201 94678056 89517974 84913794 80767860 76781431 73305314 70035967 66991689
11326F6991689k772432k460355k008669j904929j983784j759371j569053j743982
11318E0789114j606802j591666j499556j761308j323552j093147j210097j317546
11310C9385440j319280j176727j264980j189842q47097p13770o56241q46265q18494
11301C0552744o58829p14507q54952r07193n00108q96843o27701l61143m29178
11292B4602290o02036p14859m66576k16592o50223o77540j25181j20656l68605
11283B0660022n88905m11338l14779j21162n13047l05581l56529n74171o34499
11274A6840011k47575J00198l66571l67316p6842l31977l77516j92716j45564
11265A4834132l85233l66333j51250l73647l10970k85382l43312j64830k98073
$$ plain form
11326 66991689 64219257 61758902 59750233 57845304 55861520 54102149 52533096 50789114
11318 50789114 49182312 47590646 46091090 44329782 43006230 41913083 40702986 39385440
11310 39385440 38066160 36889433 35624453 34434611 33587514 32873744 32217503 31371238 30552744
11301 30552744 29893915 29179408 28324456 27417263 26917155 26020312 25392611 25031468 24602290
11292 24602290 24000254 23285395 22818819 22602227 21952004 21274464 21149283 21028627 20660022
11283 20660022 20071117 19659779 19345000 19223838 18710791 18405210 18048681 17474510 16840011
11274 16840011 16592436 16692634 16326063 15958747 15881905 15549928 15172412 14979696 14834132
11265 14834132 14448899 14082566 13931316 13557669 13246699 12961317 12618005 12453175 12155102
11256A2155102l72638k76681j47863m4667K7739l70994j81509O9026J22985k77426
11246A0703074r8923m21150p8677K56566m24500j42400J09747j07152o6667J62665
11236I892583j8056j24106m39851m03334J79440J846l47362j72009O675O8620
11226H644446p310n34141l18464R7375R069r2880k14321j04883Q8781m0199l49018
11215G178455k46504j60987k16365k0011n4219q7921R6668j40065Q6066j52029
11205F283088j14728m77534j86115P8855P7624J84483l06090k01891j62349P1693
11195E247036k01917M4780K09711r5035l68087j50030K64245N9198Q2494l25099
11185D767296k59713l3300K43239j18708l6027n66m17434m7571J78687N3413j77473
$$ plain form
11256 12155102 11782464 11505783 11357920 11313253 11340992 10969998 10788489 10857515 10980500 10703074
11246 10703074 10604151 10183001 10104324 10360890 9936390 9793990 9903737 9796585 9729918 9892583
11236 9892583 9874527 9750421 9310570 8907236 9086676 9088522 8741160 8569151 8575826 8644446
11226 8644446 8637136 8102995 7784531 7881906 7890975 7798095 7583774 7478891 7567672 7527473 7178455
11215 7178455 6931951 6770964 6554599 6534588 6480369 6392448 6489116 6349051 6435117 6283088
11205 6283088 6168360 5690826 5504711 5583566 5661190 5845673 5539583 5337692 5175343 5247036
11195 5247036 5045119 5089899 5299610 5204575 4836488 4686458 4950703 5009901 5092395 4767296
11185 4767296 4507583 4474283 4717522 4598814 4562787 4562221 4144787 4097216 4275903 4329316 4151843
11174D151843j44859K2442J28874k13495j91664q8217p2136K17916R1690j51426
11164C750968K1335j53449M8731R9585J75590J26218j67276k27570k16857L7591
11154C494866k8566j13082P014N8262K74002n0151l6405j33886j62529j37280
11144C172245L8792J70625M3063r5045k51939P3393j77022J39310n0738p0112
11134B992572L14326J25125k81204n5407q9378j92051O4457J50403n5014k12835
11124B760994j43517L46199l6940n7134N979K9028j04271j71636k16193L3373
11114B445882P4335q3165J73769L61688q721j64275r5214n0876j35418j8637j51302
11103B348066K0417N8621o1165k14890K53664j8909k02889J10059r519m6913M474
$$ plain form
11174 4151843 4006984 4029426 4158300 3944805 3753141 3664924 3592788 3810704 3902394 3750968
11164 3750968 3772303 3618854 3667585 3767170 3942760 4068978 3901702 3674132 3457275 3494866
11154 3494866 3466300 3353218 3360232 3418494 3692496 3642345 3605940 3472054 3309525 3172245
11144 3172245 3211037 3381662 3424725 3329680 3077741 3151134 2974112 3113422 3062684 2992572
11134 2992572 3306898 3432023 3150819 3095412 3006034 2813983 2878440 3028843 2973829 2760994
11124 2760994 2617477 2963676 2926736 2869602 2875581 2904609 2800338 2628702 2412509 2445882
11114 2445882 2520217 2437052 2610821 2972509 2963788 2799513 2704299 2653423 2518005 2499368 2348066
11103 2348066 2368483 2427104 2365939 2151049 2404713 2385804 2182915 2292974 2283455 2236542 2241016
11092B241016J09808k1204J1928j75287j36145j80156k6067J56047J75759j56625
11082A999074j41085L12295m8585j9989P3989j33003k41248j1968L5805j02028
11072A723257P1338j29994p1371Q7055L4966J39531J18022r2916K06500K11459
11062B297847J36941j20659j28604m0618j59663j97919J93387L64347j12750O6316
11052B298625m210j57128N6639L11617K11931P6691K91483l20344l37644m313
11042B423347L62973J74230k3695q1800Q4626m8678j17049J55394K98795j2203
11032C215940j38471o6075q1247L82481L64093J29866K25642J21481k82228k96610
11022C574872J37294j1862k35398j51701k0118k73908k43936L54416L17734P1534
$$ plain form
11092 2241016 2350824 2329620 2341548 2166261 2030116 1849960 1823893 1979940 2155699 1999074
11082 1999074 1857989 2170284 2121699 2101710 2175699 2042696 1801448 1789480 1825285 1723257
11072 1723257 1794595 1664601 1593230 1680285 1715251 1854782 1972804 1879888 2086388 2297847
11062 2297847 2434788 2314129 2185525 2144907 1985244 1787325 1980712 2345059 2232309 2298625
11052 2298625 2294415 2137287 2193926 2505543 2717474 2794165 3085648 2765304 2427660 2423347
11042 2423347 2786320 2960550 2936855 2855055 2939681 2891003 2773954 2929348 3228143 3215940
11032 3215940 3077469 3011394 2930147 3312628 3676721 3806587 4032229 4153710 3871482 3574872
11022 3574872 3712166 3700304 3464906 3313205 3293087 3019179 2775243 3129659 3447393 3518927
11012C518927q4619j26340j9525j10615O8577l22037l42558j66872P3566J89650
11002B678154j21247j40701Q3654k2739j27155M6329q3l31223n4313N3475K0020
10991B084171Q5746J05707K90293K30713K57747j41613r9708m5978K77131J23024
10981C167233n2985J5366j1692J68353l59339m73219O262J39923J2479m5152K64020
10970B831249j04207k8125Q3891p786L0929k17870K0594L29991p7802k73634J9741
10959B606971K64375J35621k63513R6127K13694J75975Q6505o1143K6759k6799
10949C254572J21089K2633k5603j2101l41658j97247n8676J87349j10296q5778
10939B754284J07705j05137j71330J97391J48916k99374l04891r2219J36889J42215
$$ plain form
11012 3518927 3434308 3307968 3288443 3177828 3246405 2924368 2581810 2414938 2488504 2678154
11002 2678154 2556907 2416206 2499860 2477121 2349966 2396295 2396212 2064989 2010676 2064151 2084171
10991 2084171 2169917 2275624 2565917 2796630 3054377 2912764 2813056 2767078 3044209 3167233
10981 3167233 3114248 3129614 3117922 3286275 2926936 2453717 2459979 2599902 2612381 2567229 2831249
10970 2831249 2727042 2698917 2782808 2775022 2805951 2588081 2608675 2938666 2860864 2587230 2606971
10959 2606971 2871346 3006967 2743454 2839581 3053275 3229250 3315755 3254612 3281371 3254572
10949 3254572 3375661 3398294 3372691 3360590 3018932 2821685 2763009 2950358 2840062 2754284
10939 2754284 2861989 2756852 2585522 2782913 2931829 2632455 2327564 2235345 2372234 2514449
10929B514449j8529J3745L3451j08753j761J98509J38786N0010J11229l75690
10919B555446O7335K67184l13245j55338k3424J85251k3699j44783j54882J81218
10909B441063Q9821l40320j64817J62647j02419k06263j76439l82804J86188L19585
10899A826242q3749q3104q0914r9806j007r1671k46187j22396K52046L6688o557
10888A299585R0721N6928r6942q0409K3064J48836j2394k50225j41146J58549
10878A196567J86901K21551J2657k8609J6466l43398j98182O3074K49786Q7271
10868A464084k63148j79331J46420k36390J11506K07050j68456K64755L15176
10859A661666P9046r1345k22191N3564j2973r0509K36431q637l70601k43138j4332
$$ plain form
10929 2514449 2495920 2509665 2543116 2434363 2432602 2631111 2769897 2819907 2931136 2555446
10919 2555446 2622781 2889965 2576720 2421382 2397958 2583209 2559510 2414727 2259845 2441063
10909 2441063 2530884 2190564 2025747 2188394 2085975 1879712 1703273 1320469 1506657 1826242
10899 1826242 1742493 1659389 1578475 1478669 1477662 1385991 1139804 1017408 1269454 1306142 1299585
10888 1299585 1390306 1447234 1350292 1269883 1292947 1441783 1429389 1179164 1038018 1196567
10878 1196567 1383468 1605019 1617676 1589067 1605533 1262135 1063953 1127027 1376813 1464084
10868 1464084 1200936 1021605 1168025 931635 1043141 1250191 1081735 1346490 1661666
10859 1661666 1740712 1649367 1427176 1480740 1467767 1377258 1613689 1605052 1234451 991313 976981
10848I76981O7966J3720J56802o2858j24610J0772Q369J31680N7453L8270k30807
10837A043738K8154Q7579j41013N7085J10029j7901j37750j86847M87o3161l510
10826G76890L0612k3614r5077l77678l6492o539j45162k48589j27084K24045K32267
10815B03579M2322J78270M0298m4593M9074k01630k00742O0868L09701Q1738J3466
10804E32351L8498j74243l06144J22942L65488K13729k29864j47014J822J82709
10794F00274J01350K17739J05585k93758j33744R1126L4659j2543m1475j66698
10784E02515m0578n3145o2366J85116Q5391Q0243k04040j58665j59649Q9499J39131
10773D03452j41725J331J7775N4586K66335N788J12972K6298L9431M5299L1045
$$ plain form
10848 976981 1044947 1058667 1215469 1152611 1028001 1038773 1047142 1178822 1236275 1274545 1043738
10837 1043738 1071892 1159471 1018458 1075543 1185572 1167671 1029921 843074 843561 780400 776890
10826 776890 807502 783888 688811 311133 274641 268102 122940 -125649 -252733 -28688 203579
10815 203579 245901 424171 464469 419876 468950 267320 66578 127446 437147 518885 532351
10804 532351 570849 396606 90462 213404 578892 792621 562757 415743 417565 600274
10794 600274 701624 919363 1024948 731190 597446 688572 723231 710688 669213 502515
10784 502515 461937 408792 346426 531542 616933 697176 493136 334471 174822 264321 403452
10773 403452 261727 263058 280833 335419 601754 607542 720514 746812 786243 831542 862587
10762H62587l95689j82995m459J60000j9643j48800j20892K74814J06455r5787
10752D35591j10210j22408J82778L27598l9206j50191P9674r5422l902L1565k24097
10741C11770Q6940j02852R1191J08855L34205K69012L0292N627j19698j24714
10731H90628n6459J45590J49743R0995k81385k23456L00954K20119j51826l01836
10721G83067j43838r8146R2873K0446r4799R5955k0122j97029n6024K55671j06741
10710E31313p7259L0345R304m9459N1818j51320P4366J50828m6336j05817k6221
10699C91562j08575J2034O3344J12678k0726l9025O1327K29550L75667J72744
10689A250580l23787l96111k58120j0377K15855K3044n4243k56104o2683J8750
$$ plain form
10762 862587 466898 283903 279444 439444 419801 271001 150109 424923 531378 435591
10752 435591 325381 202973 385751 713349 674143 523952 603626 508204 504302 535867 311770
10741 311770 398710 295858 387049 495904 830109 1099121 1129413 1135040 1015342 890628
10731 890628 834169 979759 1129502 1220497 939112 715656 1016610 1236729 1084903 783067
10721 783067 639229 541083 633956 654402 559603 655558 635436 438407 382383 638054 531313
10710 531313 454054 484399 493703 444244 496062 344742 419108 569936 523600 417783 391562
10699 391562 282987 295021 358365 471043 450317 411292 472619 702169 1077836 1250580
10689 1250580 926793 530682 272562 262185 478040 501084 446841 190737 128054 146804
10679A46804l8337O8533J83209j37529K49485K75938J5537l05497j39801m7103
10669B71239J02972P7516K76P2886J30541K21318J04622J20726p1706J9388K49897
10658A299675L46637M29J06819O0495J16033R616l6558K29121j82023l59155J04733
10647A695822L00438L26097N32920K74892J21965L86912O21744R39679J068822
10638F269291J405606O93702O46794P75514J351706J378301J304391J351732J797450
10629A6974487K153074L175799M254057N551026P337932Q995309J0983452J2182546
10621G1607682J2213696J1395826J0984377J1035973J0796652Q982366O374867
10614A43391439M123577N284778R493703J4314653J7784901J8047297J7158917
$$ plain form
10679 146804 108467 177000 360209 222680 472165 748103 763640 458143 318342 271239
10669 271239 374211 451727 452003 524889 655430 876748 981370 1102096 1030390 1049778 1299675
10658 1299675 1646312 1646741 1753560 1814055 1930088 1939704 1903146 2132267 1950244 1591089 1695822
10647 1695822 1996260 2322357 2855277 3130169 3252134 3639046 4260790 5200469 6269291
10638 6269291 7674897 8368599 9015393 9790907 11142613 12520914 13825305 15177037 16974487
10629 16974487 19127561 22303360 26557417 32108443 39446375 48441684 59425136 71607682
10621 71607682 83821378 95217204 106201581 117237554 128034206 137016572 143391439
10614 143391439 147515016 152799794 162293497 176608150 194393051 212440348 229599265
10607B29599265J6876837J6878342J5449435J0242278J569052n453402n030350
10600B80131457K392500J1400871J6989626J7810639J6504610J6301194J5487886
10593C77018783J0497808O86645j3440343k6252305k7260377j8727768q546447
10586B93975996j594464R52437K028226L037706K477458j015822q115582j8208787
10578B73537168k5449138k5138138j9229112j2259534p723022n284317m063496
10571A74390411l762533m199857n954101r242138j2901640j5315653j5493480
10564A07521009j3262623j0489961p759914o167980n150498m269367l558963k827897
10556E4033806k524335k330698k382717k130359j790396j586687j332279j255953
$$ plain form
10607 229599265 246476102 263354444 278803879 289046157 290615209 285161807 280131457
10600 280131457 282523957 293924828 310914454 328725093 345229703 361530897 377018783
10593 377018783 387516591 388203236 374762893 348510588 321250211 302522443 293975996
10586 293975996 292381532 293333969 295362195 298399901 300877359 299861537 291745955 273537168
10578 273537168 248088030 222949892 203720780 191461246 183738224 178453907 174390411
10571 174390411 170627878 166428021 160473920 151231782 138330142 123014489 107521009
10564 107521009 94258386 83768425 76008511 69840531 64690033 60420666 56861703 54033806
10556 54033806 51509471 49178773 46796056 44665697 42875301 41288614 39956335 38700382
10548C8700382j148447j548635j648929j565790q30483o23591j007580j042859
10540B9284068o61785q70470o88154q15272r50393j055121q84492o85708n87997
10531B2084676m45436o98504n31391j68915l90361o22835q61205n18631n18903
10522A7328495o26547k99917k85866n96014j35401J764m66539o90013l48030j78355
10512A3703577k31751l31951j57514k15542j41711l66058l89317Q0180l52236
10503A1597677j64075l92412n13522k18039l28216j51937k14685k24022q4147
10494I306622j40387j60407L3078L2254l48491q5493l67093m03493j35181p9110
10484G652299r4438p8626j04367l45457k56108k38195l2343m7607j34932K6431
$$ plain form
10548 38700382 37551935 36003300 34354371 32788581 31958098 31334507 30326927 29284068
10540 29284068 28622283 27751813 27063659 26248387 25297994 24242873 23358381 22672673 22084676
10531 22084676 21639240 20940736 20409345 20240430 19850069 19227234 18366029 17847398 17328495
10522 17328495 16701948 16402031 16116165 15520151 15384750 15386514 14919975 14229962 13881932 13703577
10512 13703577 13471826 13139875 12982361 12766819 12625108 12259050 11869733 11949913 11597677
10503 11597677 11433602 11041190 10527668 10309629 9981413 9829476 9614791 9390769 9306622
10494 9306622 9166235 9005828 9038906 9071160 8722669 8637176 8270083 7866590 7731409 7652299
10484 7652299 7557861 7479235 7374868 7029411 6773303 6535108 6502765 6455158 6320226 6346657
10474F346657K09197l64208l34259j18924P155j61195j85410j10210j33643p8064
10464E077096k85187j73098j61243N9564k4360j51341k56586l6162J15006j26348
10454D037341k94195j60712L8104P1176J03872K40386k47446L8616K13688R2484
10444D133314l15615k36495p6851j83640k09761k29061k73895r3654K06172L90322
10434C110836j34538O679K47158j61657k04576k22653J1050k19675j90117k29627
10424B012880O9198K23080K4472p4679o8517L939K43275J62101j95672j97904
10414B202173R3186j6570k94676J3638J5605k47470j74260j99064q4014Q6771
10404A395319L67161L62098p869k46910l04029p0160j22228K4114K00084k18212
$$ plain form
10474 6346657 6555854 6191646 5857387 5738463 5745618 5584423 5399013 5288803 5155160 5077096
10464 5077096 4791909 4618811 4457568 4517132 4492772 4341431 4084845 4048683 4163689 4037341
10454 4037341 3743146 3582434 3620538 3691714 3795586 4035972 3788526 3827142 4040830 4133314
10444 4133314 3817699 3581204 3504353 3320713 3110952 2881891 2607996 2514342 2720514 3110836
10434 3110836 2976298 2982977 3230135 3068478 2863902 2641249 2652299 2432624 2242507 2012880
10424 2012880 2082078 2305158 2329630 2254951 2186434 2190373 2433648 2595749 2400077 2202173
10414 2202173 2295359 2278789 1984113 1997751 2013356 1765886 1591626 1392562 1308548 1395319
10404 1395319 1762480 2124578 2116709 1869799 1565770 1495610 1373382 1397496 1597580 1379368
10394A379368p1752J66333o3849j87375m695j9857K26271L68348J38363k00377
10384A730778l01169j14435o5423l83773j45486J71575L27461N99189J17000k90045
10374A645672N9487J61134l04822o5840J07372j25112j05857M6065J4768p8983
10364A353884K9150j37913J04980K13240P7930j14175Q6417M1302n4359r1663
10354A508793J5959k69104j86763J17759K59933J9349k37213J76448M5306j41865
10344A308602l9913l05369O9820J96429n2656J12909J14806l23615O1904K31083
10334A374000R4690K7848j62217J9806Q8407k57987j21607o9594n1672J32052
10324A073726L68340m4699m73803p4649J37349J91722j11568j83708p0183J18489
$$ plain form
10394 1379368 1307616 1473949 1410100 1222725 1218030 1198173 1424444 1792792 1931155 1730778
10384 1730778 1429609 1315174 1249751 865978 720492 892067 1219528 1818717 1935717 1645672
10374 1645672 1705159 1866293 1561471 1495631 1603003 1477891 1372034 1418099 1432867 1353884
10364 1353884 1383034 1245121 1350101 1563341 1641271 1527096 1613513 1654815 1600456 1508793
10354 1508793 1524752 1255648 1068885 1186644 1446577 1465926 1228713 1405161 1450467 1308602
10344 1308602 1268689 963320 1033140 1229569 1176913 1289822 1404628 1081013 1142917 1374000
10334 1374000 1468690 1496538 1334321 1354127 1442534 1184547 1062940 993346 941674 1073726
10324 1073726 1442066 1397367 923564 848915 986264 1177986 1066418 882710 812527 931016
10314I31016L26553j56836R7326L59235J9417j34219l1893k33929r4627j56663
10304I25380j25037J9381p3496M8991N5045J8921n5697q6386J37795r6163j10023
10293F58711l8171J66260M0514J15418j48518q3660M29585p8604p1403N3723j84299
10282H59556k5538J65222K37621M3188J55793L34417L07325M05184K70745J16999
10272B870512Q4001k6759O2755k18549l39042K3760N7627j78910m27460l80670
10262A527265q9107k6944j02334j22186n0036j10359j79283j63405O0094k3670
10252G20035Q0805L2429J84793r4989j33603j58156k7551P9500J9015j36715k89435
10241B76128M3192J27321m8567K79433Q969q1074j44109O8974J67379j6386l28373
$$ plain form
10314 931016 1257569 1100733 1198059 1557294 1576711 1442492 1410599 1176670 1082043 925380
10304 925380 800343 819724 746228 795219 850264 869185 813488 727102 864897 768734 658711
10293 658711 620540 786800 827314 942732 794214 710554 1140139 1061535 990132 1043855 859556
10282 859556 834018 999240 1236861 1280049 1435842 1770259 2077584 2482768 2753513 2870512
10272 2870512 2954513 2927754 2990509 2771960 2432918 2456678 2514305 2335395 1907935 1527265
10262 1527265 1438158 1411214 1308880 1186694 1136658 1026299 847016 683611 743705 720035
10252 720035 800840 833269 1018062 923073 789470 631314 603763 683263 702278 565563 276128
10241 276128 319320 446641 398074 677507 686476 605402 461293 530267 697646 681260 352887
10230C52887k02401K67418J78877J41164k28878P5317M4744j55153J7658q0046
10220D11587q2756L36805M98654l7514l49871l34135K19909J09205J2611j27092
10210F57403K7295Q6132j57018k28948j84292j4355j8604L8878O1816j1771J59301
10199D15837K37812J63499k51631l02615J65643P9474j8063j72927L5418M7693
10189D00140j20994k0951J73193J30111J07515K22236J45461J64831j11631j02442
10179I87469o311J69707L37678K45851l12914k55712J97155P0728m6229Q5395
10169A472817J7821K65830J88443N9842O2540j49707r3459J55133P4724j7769
10159B036215J72444J87364J5051J53742j0888j50569k12492k54163k49947m8135
$$ plain form
10230 352887 150486 417904 596781 737945 509067 584384 629128 473975 491633 411587
10220 411587 328831 665636 1164290 1126776 776905 442770 662679 771884 784495 657403
10210 657403 684698 770830 613812 384864 200572 186217 167613 206491 268307 256536 415837
10199 415837 653649 817148 565517 262902 428545 508019 489956 317029 352447 400140
10189 400140 279146 258195 431388 561499 669014 891250 1036711 1201542 1089911 987469
10179 987469 981158 1150865 1488543 1734394 1421480 1165768 1362923 1433651 1387422 1472817
10169 1472817 1490638 1756468 1944911 2004753 2067293 1917586 1824127 1979260 2053984 2036215
10159 2036215 2208659 2396023 2411074 2564816 2553928 2403359 2190867 1936704 1686757 1638622
10149A638622K52332J88241j39565J57114L9264K915r2707j28156n17573m53000
10139I47487j31212R6817K16221k71534j17086J42010J12948j1022k689l46189
10129F35751N7715K66781q6407k28559j8404J61423j16837j05622P065r0133O347
10118D89120n1878L5218j68817o2579j375J5861R0284J88486L2066k00635O3886
10107D29637n5424j9437K62726K18621m2879K5645m4741N3126J4643K78926J23280
10096A244123j02332l04835k69832j13741J66116k84682k31436l8371J03446K13601
10086C82057r1571K3248J79299J16833k41671j15688J13834J43375K72250j5753
10076G66213k36807n5749k56750Q1164K08208J26353r7570n5919j63994k96592
$$ plain form
10149 1638622 1890954 2079195 1939630 2096744 2136008 2138923 2046216 1918060 1400487 947487
10139 947487 816275 913092 1129313 857779 740693 882703 995651 984629 981940 635751
10129 635751 693466 960247 873840 645281 626877 788300 671463 565841 572906 482773 489120
10118 489120 437242 472460 303643 241064 239689 255550 345834 534320 566386 365751 429637
10107 429637 374213 354776 617502 836123 793244 818889 774148 827274 841917 1120843 1244123
10096 1244123 1141791 836956 567124 453383 619499 334817 103381 65010 168456 382057
10086 382057 290486 313734 493033 609866 368195 252507 366341 509716 781966 766213
10076 766213 529406 473657 216907 298071 506279 632632 535062 479143 315149 18557
10066A8557l197J50307K80438j07547j21274L8545Q2717K13682P0024L0055k68088
10055C84219l37339o4011L43525J94141j62610r9504j1400J93649K69660q3714
10045F26616j73438L2549k19380j77367L6616J71152J21398n6266k29751K22653
10035C54782L1840j96122R3792J1456r0165j4871m0684M4757K06205k09914k35080
10024d4004J13368J232M4931J88253m107K65738l0720j37584k48625P1544N3515
10013B73541j26790K385J11701j11367O527k06573k29018j96121P092L7230K63725
10002a67668K97362R107k05524L984j02968o928J67105J44388j16315k03636N8201
9991a22892L72172j71968k98547K35715r8525j49162K1934N1632J06569J37381
$$ plain form
10066 18557 15360 165667 446105 338558 217284 255829 338546 552228 622252 652307 384219
10055 384219 46880 -17131 326394 520535 357925 258421 247021 440670 710330 626616
10045 626616 453178 485727 266347 88980 125596 296748 418146 361880 132129 354782
10035 354782 386622 190500 284292 295748 205583 190712 150028 194785 400990 191076 -44004
10024 -44004 69364 70596 115527 303780 299673 565411 534691 397107 148482 220026 273541
10013 273541 146751 149136 260837 149470 155997 -50576 -279594 -475715 -468623 -431393 -167668
10002 -167668 129694 138801 -66723 -62739 -165707 -172635 -5530 138858 22543 -181093 -122892
9991 -122892 249280 77312 -221235 14480 -84045 -233207 -211273 -159641 -53072 84309
9981H4309K99134p050J24882j78093R6837q0866j26969k58767m7268J59682n74
9970F5257q247m863p280O0675J58400K41395J61935m6489K4663l82936o3053P7736
9958B77193K94636J39972N2011K38524J10108K19043n7323N6133L67337K89966
9948A987600l469J31257M00546P61749Q07997J060121J611998K633907M674988
9939A4066694Q228920J0697377P251778J682598L451554P077915O204198N087118
9931F3748152J407305j7405048j8387938r692393n223866l044981j823038j525242
9923H052951j053845p51187k52831m15974l68006k44890l62726P2811m24319l34817
9913C917167p9795l48018m48093k46281l94532j13485K14254q2727J75230R59
$$ plain form
9981 84309 383443 376393 501275 323182 420019 339153 212184 -46583 -93851 65831 65257
9970 65257 57010 52147 44867 105542 263942 505337 667272 620783 645446 262510 199457 277193
9958 277193 571829 711801 763812 1002336 1112444 1331487 1274164 1330297 1697634 1987600
9948 1987600 1984131 2115388 2515934 3277683 4085680 5145801 6757799 9391706 14066694
9939 14066694 22295614 32992991 40244769 41927367 45378921 52456836 58661034 63748152
9931 63748152 65155457 47750409 29362471 19670078 14446212 11401231 9578193 8052951
9923 8052951 6999106 6247919 5995088 5579114 5211108 4966218 4603492 4676303 4251984 3917167
9913 3917167 3837372 3489354 3041261 2794980 2400448 2286963 2501217 2418490 2593720 2594679
9903B594679k98907j4073K49182j49669k12918p3201n4367l7119j02173q9486
9893A811948j28276r8790Q4243k07732m27116k3368k2391N3973K68328L34469
9883A645288l2755l15468k36389k77270j80894J74031J3257P7242K66007K49665
9873A382714j25171m34495K01768l846j10478k4751M2019o848l11108j76074j79262
9862B54468J29982j7797K5939k70580J58091L78444J26113j10023n1942k94643
9852C28052r6022R1859J01914K67036m2727k70588J98128k3694j28556k37311
9842A88091o8846J40093J85085O509j26353k65091K7128O8354p4202q6758r3045
9831i9035J0440K3086J39035o096j59142K19635j3273k22348k3175K50314K99937
$$ plain form
9903 2594679 2295772 2281699 2530881 2381212 2168294 2095093 2040726 2003607 1901434 1811948
9893 1811948 1683672 1584882 1669125 1461393 1034277 1010909 988518 1042491 1310819 1645288
9883 1645288 1612533 1297065 1060676 783406 602512 776543 789800 867042 1133049 1382714
9873 1382714 1257543 823048 1024816 1020970 910492 885741 927760 920912 609804 433730 254468
9862 254468 384450 366653 392592 122012 280103 658547 784660 674637 622695 328052
9852 328052 232030 323889 425803 692839 650112 379524 577652 553958 425402 188091
9842 188091 119245 259338 444423 450932 324579 59488 86616 154970 80768 -5990 -99035
9831 -99035 -88595 -65509 73526 67430 -91712 127923 114650 -107698 -130873 119441 419378
9820D19378j40268k25411K353l8258J52089J07779J28661l1969k93150j84530
9810a03326J72815l4718j30498J47215j11402L1063J73200K71734p1768m8918
9800B95397j98507q0031j5260j49775l3862Q5799m3087k12295J43946j3507k01416
9789d22598J8970J45866M43455J24359j68652j27355j6514l0593L4919N6781p5769
9778a7131N9462O8678o8241q0404j89273m3323Q6254J80162K6652J20806K21925
9767C65567J16027k57417k17660m8325j86456r9197J58150L06730Q834o4433j44552
9756f2732j97788j53160l8428j02968K30195k4060m3831J47861j46594j3186M3463
9745c61228Q8049N6132n6314l7479O0613J94746M79338r2045l06880k97016N9362
$$ plain form
9820 419378 279110 53699 56052 17794 169883 277662 406323 374354 81204 -103326
9810 -103326 69489 34771 -95727 51488 -59914 -28851 144349 416083 344315 295397
9800 295397 96890 16859 1599 -148176 -182038 -96239 -139326 -351621 -207675 -221182 -422598
9789 -422598 -403628 -257762 185693 310052 141400 14045 -2469 -33062 1857 58638 -17131
9778 -17131 42331 111009 42768 -37636 -226909 -270232 -183978 -3816 22836 143642 365567
9767 365567 481594 224177 6517 -41808 -228264 -327461 -169311 137419 146253 81820 -62732
9756 -62732 -260520 -413680 -452108 -555076 -324881 -348941 -392772 -244911 -391505 -404691 -361228
9745 -361228 -273179 -217047 -273361 -310840 -250227 -55481 423857 331812 24932 -272084 -212722
9734b12722J24324j27422M1193l6294O7818Q1740j85950j09523R1359L1422j57079
9723c91134k11819r9689J20585L22739K55439L07928M22225l5903l69190k01973
9713A19208K17918j9291r4025Q5935m46163Q2999P8430J89329K24842j22094j95680
9702A21408k54289r2591j70073j21731R5457K72096J90951K63453Q7591j02852
9692B89420j87415Q3828K67543n7702L3164L53736J43781M7637J2425r7660m0888
9681H47869k47604m1716k1669k7010J2150K44186j72369j26629N042K76135K76681
9670A025066N3041q8760n0308J05159R7725k76347J85400J38006p1625J03282
9660A220639K0979j17797M5451P361N8550Q4101J63323J66304l2051k26887j28371
$$ plain form
9734 -212722 -88398 -215820 -174627 -210921 -143103 -61363 -247313 -356836 -265477 -234055 -391134
9723 -391134 -602953 -702642 -582057 -259318 -3879 304049 726274 690371 321181 119208
9713 119208 337126 317835 223810 309745 -136418 -53419 25011 214340 439182 317088 121408
9702 121408 -132881 -225472 -395545 -517276 -421819 -149723 41228 304681 392272 289420
9692 289420 102005 185833 453376 395674 428838 782574 926355 973992 986417 888757 847869
9681 847869 600265 558549 536880 509870 522020 766206 593837 467208 472250 748385 1025066
9670 1025066 1078107 989347 939039 1044198 1141923 865576 1050976 1188982 1117357 1220639
9660 1220639 1241618 1123821 1169272 1176633 1235183 1319284 1482607 1648911 1616860 1389973 1261602
9649A261602j9169P3626j07218j23774J56432J85576j644J96630l02111j01901
9639A218049M4598m1882O2831k07143l48264J04256J06626R1264N1052r530j35232
9628I36625J19876j73145J93216J02795K9655l4295n9093r2319j36906j10154
9618G76255P6349L0821J51610j03524N1619p7997n2811j76367j24479O7482J44698
9607G63656J23037O268J16953k35726j21321m3301k43839J46441k6868l4172l3872
9596D17256j19419J31345J90910R836K8691m8904Q83j86445j05582R7291j02437
9585C13425r4414k01129j44497K6768q1910J25194L76987R5151J8499l22643K1087
9574A32518J23683O566n0960p0465N7977J81387k27600n8113J39983j09118R3438
$$ plain form
9649 1261602 1242433 1316059 1208841 1085067 1241499 1427075 1425431 1622061 1319950 1218049
9639 1218049 1262647 1220765 1283596 1076453 728189 832445 939071 1030335 1081387 1071857 936625
9628 936625 1056501 883356 1076572 1179367 1209022 1174727 1115634 1023315 886409 776255
9618 776255 852604 883425 1035035 931511 983130 905133 852322 675955 551476 618958 763656
9607 763656 886693 892961 1009914 774188 652867 609566 365727 512168 485300 451128 417256
9596 417256 297837 429182 620092 629928 658619 609715 610598 424153 318571 415862 313425
9585 313425 219011 17882 -126615 -99847 -181757 -56563 320424 415575 434074 111431 132518
9574 132518 256201 262767 211807 141342 199319 380706 153106 94993 234976 125858 219296
9563B19296J90045Q7521n6462j5162j62892j85590r8832J03815j97420J00473
9553a5208o9659R2355J05874k49257K487K96566r5261P0936l7003j00211p9520
9542g7901k60669J20382J52229j62863o6542k34506K13808K48461R0678l7594
9532a4517K02231J02501J23280R0366O0163N4789n2166k9351J5878P0373j5448
9521F08099l56568k2743K55684M8463k78039J34360J05057M2956M1828m47920
9511A31177k3780M8718k06756j28533L0824J28136K95593J49352j07769k7115
9501B89847p0699P9559k2960j10673R4141q8663J95417K62577K7738L37464J935
9490I95683R3613J35662M1865J89830j27534k35871j24572k21351k10960R9567
$$ plain form
9563 219296 409341 496862 440400 425238 262346 76756 -22076 81739 -115681 -15208
9553 -15208 -84867 7488 113362 -135895 -133408 163158 67897 138833 101830 1619 -77901
9542 -77901 -338570 -218188 -65959 -228822 -295364 -529870 -316062 -67601 23077 -14517
9532 -14517 187714 290215 413495 503861 564024 618813 566647 537296 553174 623547 608099
9521 608099 251531 228788 484472 532935 254896 389256 494313 537269 579097 131177
9511 131177 107397 156115 -50641 -179174 -148350 -20214 275379 424731 316962 289847
9501 289847 219148 298707 275747 165074 259215 170552 365969 628546 656284 993748 995683
9490 995683 1089296 1224958 1266823 1456653 1329119 1093248 968676 747325 536365 635932
9480F35932K3246k32492j43996r4298j76322R0763R2953J616O5732J82244P8367
9469E23745j22147J11403n2191j50718K7594p2062j33568J70499R9393J6472K5133
9458D43553J45469m251j46777O4563m822J87390K8853J56062k14930k52820j13394
9447B88896K94393l2341r7461j49762j66726q1481J79131K54299j99494l12005
9437b2551J29982J48210P2062L4366N8635J72683j64511o027Q1862r1802L0331
9426D43240K95383L10752o1767L2254J00757k62351L1560K9323o9481j22351j89867
9415E37452j13272L0874n605K73929M5009O503J01806Q6172J0799l78479p7641
9404E17547J09945K09685J00075k57565n7873N9941N4466J62673k38157M1994
$$ plain form
9480 635932 659178 426686 282690 188392 12070 102833 195786 197402 263134 445378 523745
9469 523745 401598 513001 460810 310092 337686 265624 132056 302555 401948 418420 443553
9458 443553 589022 584771 437994 502557 497735 685125 713978 870040 655110 402290 288896
9447 288896 583289 550948 453487 303725 136999 55518 234649 488948 289454 -22551
9437 -22551 107431 255641 327703 362069 420704 593387 428876 422849 504711 412909 443240
9426 443240 738623 1049375 987608 1019862 1120619 858268 889828 919151 849670 727319 537452
9415 537452 424180 455054 449449 723378 768387 774890 876696 962868 973667 595188 517547
9404 517547 627492 837177 937252 679687 621814 681755 736221 898894 660737 702731
9394G02731P8925o7055j66827l3394j54347K64832N6678k1422P3300R176J27N9274
9382H01998p031l2891J5958J38571K59056J62704k00481K711P1986m86362j29811
9371E96408N17737M16618k6961j17889k7695k59187j16088K72586O9080K5179
9361A349788L25798o0868J16053P30J74142J90471J11852K35148j24543n7723
9351B260848j8245J58786J67863L09157L70503O5658J02744K61420K70484M209
9341C953427K76123Q79723O23259N74690M14115N82574R98065J251472J631796
9332A1185244J426924J616710J682016J831738K192327K357000K272286K571326
9324B7135571K762084K875517K754414K623089L100343K678372K288109J822483
$$ plain form
9394 702731 781656 714601 547774 514380 360033 624865 681543 660121 733421 742597 742724 801998
9382 801998 794967 762076 778034 916605 1175661 1338365 1137884 1140595 1212581 726219 596408
9371 596408 1114145 1530763 1503802 1385913 1358218 1099031 982943 1255529 1324609 1349788
9361 1349788 1675586 1614718 1730771 1731501 1905643 2096114 2207966 2443114 2318571 2260848
9351 2260848 2242603 2401389 2569252 2878409 3248912 3314570 3417314 3678734 3949218 3953427
9341 3953427 4229550 5109273 5732532 6307222 6721337 7303911 8301976 9553448 11185244
9332 11185244 12612168 14228878 15910894 17742632 19934959 22291959 24564245 27135571
9324 27135571 29897655 32773172 35527586 38150675 41251018 43929390 46217499 48039982
9316D8039982J363908J082520Q36115M85254J15305j12241o10636k62391K57115
9307E1194931K18639N75629J354974J625442J641836K380958K515821K636280
9299F4144510L192954L610841M143431M717307M886778M975205N613797N641668
9291A00926491O012999O196979N851624O281400N816511N172391M876971M470965
9283A45606331L990472L258342K692928K345394J813818J910949J287615J128474
9275A64034323J026604J015596J009446J105405J014135J397571J597069J308455
9267A73508604J159007J374688J720490K126903K485700K892192L612334M486050
9259A93365968N131583N874961O575654P125135P650918P836936P788906P384696
$$ plain form
9316 48039982 49403890 50486410 51322525 51807779 51923084 51810843 51200207 50937816 51194931
9307 51194931 51413570 51989199 53344173 54969615 56611451 58992409 61508230 64144510
9299 64144510 67337464 70948305 75091736 79809043 84695821 89671026 95284823 100926491
9291 100926491 106939490 113136469 118988093 125269493 131086004 136258395 141135366 145606331
9283 145606331 149596803 152855145 155548073 157893467 159707285 161618234 162905849 164034323
9275 164034323 165060927 166076523 167085969 168191374 169205509 170603080 172200149 173508604
9267 173508604 174667611 176042299 177762789 179889692 182375392 185267584 188879918 193365968
9259 193365968 198497551 204372512 210948166 218073301 225724219 233561155 241350061 248734757
9251B48734757O647833O186855N227800M148632K758340J607448L20724j019788
9243B74612601j871571k985673l636532m077195m155101l701918l635824k974863
9235B47573924k366685j938052j288288m53195J65223r4401J45923l3729P2712
9226B41783432L10494O92791J028957J246941J868537K137928K515472L184493
9218B54769045K543481K539693K441948J283206M00562m19765j025168j840096
9210B60692906k911104l281498l735481l941560m021920m667576m398369m504625
9202B29230773m947270m945825m953853m723220n198592n421552n259212m649654
9194A89131595m306064l829077l656278k893251k277974j849737j378921p93950
$$ plain form
9251 248734757 255382590 261569445 266797245 270945877 273704217 275311665 275632389 274612601
9243 274612601 272741030 269755357 266118825 262041630 257886529 254184611 250548787 247573924
9235 247573924 245207239 243269187 241980899 241527704 241692927 241598526 241744449 241710720 241783432
9226 241783432 242093926 242786717 243815674 245062615 246931152 249069080 251584552 254769045
9218 254769045 257312526 259852219 262294167 263577373 263977935 263558170 262533002 260692906
9210 260692906 257781802 254500304 250764823 246823263 242801343 238133767 233735398 229230773
9202 229230773 224283503 219337678 214383825 209660605 204462013 199040461 193781249 189131595
9194 189131595 184825531 180996454 177340176 174446925 172168951 170319214 168940293 168146343
9186A68146343q21526p79473l50727j83875N45j87921l47753p80701j222078k085873
9176A61386961k868199k985425m005096m528924m825601m782043m954206n274673
9168A27162794n078659m632593m376722m061020l493974k588678k131458j767289
9160I9032401j021105p98419k91627K00441K81377P15035J319501J719188J887955
9151A03044747J975735K096596J700526J342046O78315O37933N40644L80101O72859
9142A13069502N04767L17310Q19480R69745Q55909O99845O11588P68756Q26425
9133A19443327P56538N21404M43952K76838n6662n5925j9437l0448k54505o27692
9123A20397390o35299p13345j395677j471610j548907j376371p41517p1309Q44931
$$ plain form
9186 168146343 167324817 166545344 166194617 166010742 166011287 165823366 165475613 164694912 163472834 161386961
9176 161386961 158518762 155533337 151528241 146999317 142173716 137391673 132437467 127162794
9168 127162794 122084135 117451542 113074820 109013800 105519826 102931148 100799690 99032401
9160 99032401 98011296 97212877 96921250 97121691 97403068 98118103 99437604 101156792 103044747
9151 103044747 105020482 107117078 108817604 110159650 110837965 111475898 112016542 112396643 113069502
9142 113069502 113574269 113891579 114711059 115680804 116536713 117236558 117848146 118616902 119443327
9133 119443327 120199865 120721269 121165221 121442059 121385397 121329472 121310035 121279587 121025082 120397390
9123 120397390 119762091 119048746 117653069 116181459 114632552 113256181 112514664 112443355 113288286
9114A13288286J461826K353439L022028L678726M192384M555214M405347L871324
9106A40828574L463217K905789K289313J549458L71804l88739p90668j511878
9098A48716870j843896j931542k095756k174774k560172k588579k778569k954913
9090A29788669k879778k678560k603238k399292j779261j471341p66735j46107
9082A15064357P11098J286288J929461K455724K992131K764142K531565K313949
9074A32048715K185064J324789M47260j05869j131893j666030k257729k808184
9066A28036123k713616k579554k391397k431568j981398j704940j256543j021671
9058A11955436j281065j136943j342649j185440j232901j479566j907564j929870
$$ plain form
9114 113288286 114750112 117103551 120125579 123804305 127996689 132551903 136957250 140828574
9106 140828574 144291791 147197580 149486893 151036351 151408155 151019416 150228748 148716870
9098 148716870 146872974 144941432 142845676 140670902 138110730 135522151 132743582 129788669
9090 129788669 126908891 124230331 121627093 119227801 117448540 115977199 115210464 115064357
9082 115064357 115775455 117061743 118991204 121446928 124439059 127203201 129734766 132048715
9074 132048715 134233779 135558568 136005828 135899959 134768066 133102036 130844307 128036123
9066 128036123 125322507 122742953 120351556 117919988 115938590 114233650 112977107 111955436
9058 111955436 110674371 109537428 108194779 107009339 105776438 104296872 102389308 100459438
9050A00459438k196714k289170k228114k683600k589392k199372k270808j853218
9042H2149050j295582j216395r97015p52023p75137j038179j452713j268895j396048
9033G1957063j226206j103993r38522m87509l99720o31943o14349k32983m66181
9024F5855657m10799p37142r72099j539914k000915k253805k488120k703374k930666
9015D9818823k902198k526700k438268j784652j160110r53562j046877p20010
9007C6286446l99368l81384n31694m26440q07847j010005q58469r02988j023841
8998B9944410j276411p15083o11745n45557l08471k4458k17495n61377m75461
8989B5208352k47774n51363m97213p27983j086903j515820j197243q52673q87054
$$ plain form
9050 100459438 98262724 95973554 93745440 91061840 88472448 86273076 84002268 82149050
9042 82149050 80853468 79637073 78640058 77888035 77112898 76074719 74622006 73353111 71957063
9033 71957063 70730857 69626864 68688342 68200833 67801113 67169170 66554821 66321838 65855657
9024 65855657 65444858 64707716 63735617 62195703 60194788 57940983 55452863 52749489 49818823
9015 49818823 46916625 44389925 41951657 40167005 39006895 38053333 37006456 36286446
9007 36286446 35887078 35505694 34974000 34547560 33739713 32729708 31871239 30968251 29944410
8998 29944410 28667999 27952916 27341171 26795614 26487143 26462685 26245190 25683813 25208352
8989 25208352 24960578 24409215 23912002 23184019 22097116 20581296 19384053 18531380 17644326
8980A7644326p95634p19751m60074o33796k87646k23215l91886l95977p83241
8971A2953106o12531j3587l24850j87126k39701l26780l29754m03584j80642j72503
8961A0162048m32916l59684j45677j15222q190p8551l10723K1475n964o2283j70478
8950H493835k19277k16944m77861l59854k09865r2946K0776O4330L74093j1657
8940G364630l27104j93113M4093j66993k89939k27251j61576N6979K3828o8094
8930F055460n5908p3635Q4850J30552Q7945k9660j61727j58358r5956p2459n0983
8919E660121m73397k71551j66540K55325L71253j44012j41622K02933R2985O4593
8909E450088k95027j16136k3683q1406K3554J0622k9079j41052J764L61706L7079
$$ plain form
8980 17644326 16848692 16128941 15668867 15035071 14747425 14524210 14132324 13736347 12953106
8971 12953106 12340575 12326988 12002138 11815012 11575311 11248531 10918777 10515193 10334551 10162048
8961 10162048 9729132 9369448 9223771 9108549 9100359 9021808 8711085 8732560 8726596 8664313 8493835
8950 8493835 8274558 8057614 7579753 7219899 7010034 6917088 6937864 7002194 7376287 7364630
8940 7364630 7037526 6844413 6888506 6721513 6431574 6204323 6042747 6099726 6123554 6055460
8930 6055460 5999552 5925917 6010767 6141319 6229264 6199604 6037877 5879519 5783563 5711104 5660121
8919 5660121 5186724 4915173 4748633 5003958 5375211 5231199 5089577 5292510 5385495 5450088
8909 5450088 5155061 5038925 5015242 4933836 4957390 4968012 4938933 4797881 4799645 5161351 5198430
8898E198430j65556l47921M0487l30149K443L7239L2337j07965k47056n1884J32641
8887D193046P4232R3976p4104r07J29139q3882J04833J5626R6948q4373j29506
8876D335028K1897K13002J34501M1643k3796k4227j44366j86218J37866n0642
8866D454688j33391L19473J78001j7121j64952k40441l6880R8672j26591m3179
8856D288279o0601j35939o7567k89753j13795J01901J91939J75779l35580J71708
8846C926371K42746j21431l85772k17960k850o5310N9064J39008M09784O8771
8836D052421j11721J02685K36454j03404k2261k35750p8638k86540j88558J69193
8826C533881J91549j40250j20488j23293M8240J35881J91379J22019n6649q5934
$$ plain form
8898 5198430 5032874 4684953 4725440 4395291 4397734 4434973 4467310 4359345 4112289 4060405 4193046
8887 4193046 4267278 4361254 4287150 4286243 4415382 4331500 4436333 4451959 4548907 4464534 4335028
8876 4335028 4356925 4569927 4704428 4746071 4722275 4698048 4553682 4367464 4505330 4454688
8866 4454688 4321297 4640770 4818771 4801650 4636698 4396257 4359377 4458049 4331458 4288279
8856 4288279 4227678 4091739 4024172 3734419 3620624 3722525 3914464 4090243 3754663 3926371
8846 3926371 4169117 4047686 3661914 3443954 3441104 3375794 3434858 3573866 3983650 4052421
8836 4052421 3940700 4043385 4279839 4176435 4154174 3918424 3839786 3553246 3364688 3533881
8826 3533881 3725430 3585180 3464692 3341399 3389639 3525520 3716899 3838918 3782269 3696335
8816C696335L64686p9702k40302j92923j59468K03476j12027M8655j14906m6861
8806C366963k0265K41732n4430l01830j47242J21795M0556l7979J80441J80234
8796C569975n0077j5414l11497N6100J20700l74340p3758L60693M27762N5422
8786C765566m50344k43691o8131o9317L2575K57371l85796j21052j63642k21420
8776B332119K21951L9412L9413K54564p7214P529o314L8916p5408j00329k70911
8765B403728n2646m9635j07261j01290J49466p9948k48644k31779Q1093P944K80002
8754B051030q7976J29782q2725M2921K9562J32422J82631K8078k4413q4684j6358
8743B300270Q3036j29327n90J65905k09908l2351K15539l21870r0753j43168J50159
$$ plain form
8816 3696335 4061021 3981319 3741017 3548094 3388626 3592102 3480075 3528730 3413824 3366963
8806 3366963 3346698 3588430 3534000 3232170 3084928 3206723 3247279 3209300 3389741 3569975
8796 3569975 3519898 3504484 3192987 3249087 3369787 2995447 2921689 3282382 3710144 3765566
8786 3765566 3315222 3071531 3003400 2934083 2966658 3224029 2838233 2717181 2553539 2332119
8776 2332119 2554070 2593482 2632895 2887459 2810245 2817774 2811460 2850376 2774968 2674639 2403728
8765 2403728 2351082 2301447 2194186 2092896 2242362 2162414 1913770 1681991 1763084 1771028 2051030
8754 2051030 1963054 2092836 2010111 2053032 2082594 2215016 2397647 2425725 2401312 2316628 2300270
8743 2300270 2383306 2253979 2253389 2419294 2209386 2177035 2392574 2070704 1979951 1836783 1986942
8732A986942j24606M10021R2933l5250J19832j55557k59517O345O5353k43971
8722A862525k93800J58748J28230J14580N2893k4684M8615M43885n1552j07592
8712B331848J32677j02369k52805K8988J71214n1285j70899k9926M4686J32070
8702B234199l5112J3331j63340l16736J83431K62424k33975J28807K48720O7115
8692B388864l74804m5772L8742J532q2996Q6576R147J07243l9692J21688J69253
8681B379781k74509l10376r9035J3338L91801J27300j5945j4530j18416k18914
8671A860495K5853J6091J52706Q4430J13916r1396k0978m243K30901P3059j78068
8660B262766j62312J766j05105j42395n8620K6518n8478l1732J15833o7034q1339
$$ plain form
8732 1986942 1862336 2272357 2365290 2330040 2449872 2294315 2034798 2041143 2106496 1862525
8722 1862525 1568725 1727473 1855703 1970283 2023176 1998492 2047107 2490992 2439440 2331848
8712 2331848 2464525 2362156 2109351 2138339 2309553 2258268 2087369 2057443 2102129 2234199
8702 2234199 2199087 2212418 2049078 1732342 1915773 2178197 1944222 2073029 2321749 2388864
8692 2388864 2014060 1968288 2007030 2008562 1925566 2012142 2021289 2128532 2088840 2210528 2379781
8681 2379781 2105272 1794896 1695861 1709199 2101000 2228300 2212355 2197825 2079409 1860495
8671 1860495 1886348 1902439 2055145 2139575 2253491 2162095 2141117 2136874 2367775 2440834 2262766
8660 2262766 2100454 2102220 1997115 1854720 1796100 1822618 1764140 1732408 1848241 1781207 1699868
8649A699868K24765J78498l7393m928j42142r8041k8558l6590p1010J16677M7260
8638A848406J85522Q1700O4106r0120j49183l2426J19535l2062j19637l60952
8628A514889j11306q3984J90345n164k4813o0992j46982l70136J17561K10304
8618A229722J73579J19261j33744j22499k43167o8075K23336J75725j62138R519
8608A201519J37197j16890K5349J07082K43590m2841o6333J14192q7818j66127
8598A348920k64410L82614R3868j9273j4326r7709L6762J2338p2227k28632M8662
8587A226587k3234J96760J38731K5454j38973p744l06737j22981Q6688j74812
8577H99739j58232j24841l9988J88182K87682J83190M05487K76247n6287j49203
$$ plain form
8649 1699868 1924633 2103131 2065738 2060810 1918668 1820627 1792069 1755479 1684469 1801146 1848406
8638 1848406 2033928 2115628 2179734 2089614 1940431 1908005 2027540 1995478 1875841 1514889
8628 1514889 1403583 1319599 1509944 1504780 1479967 1418975 1271993 901857 1019418 1229722
8618 1229722 1403301 1522562 1388818 1266319 1023152 955077 1178413 1354138 1192000 1201519
8608 1201519 1338716 1221826 1247175 1354257 1597847 1555006 1488673 1602865 1515047 1348920
8598 1348920 1084510 1467124 1560992 1541719 1527393 1429684 1466446 1478784 1406557 1177925 1226587
8587 1226587 1203353 1400113 1538844 1564298 1425325 1417581 1110844 987863 1074551 899739
8577 899739 741507 616666 576678 764860 1052542 1235732 1641219 1917466 1861179 1711976
8567A711976l54111l47141j62938O426J18666K99456K6477L6220j7813L3250J13856
8556A464324m4234k59628n6794j33076q4813P8218M76611K02066n9712m5438K55724
8545A793248j13025k99894j69493M9777K1846k10237j20483K65065L83780Q3732
8535A684316j71261m24720q6649J78039K04005o940k67717O7486k3216J6771J22798
8524A292912j62454j19992k27345j24111K06974J70322m9947p2265J9934M9885
8514I83913l5551L1168L7438M6827j42018j25175k73485K01029K91224j35137
8504H80233k71215O770K57619J72215k68560J90782R1914K0506M8636J58168j52120
8493A134948k19387O7247o35P7286P7709j22000j3307j05477j3860P3254J08507
$$ plain form
8567 1711976 1357865 1010724 847786 854212 972878 1272334 1298811 1335031 1317218 1350468 1464324
8556 1464324 1420090 1160462 1103668 970592 885779 963997 1440608 1642674 1582962 1537524 1793248
8545 1793248 1680223 1380329 1210836 1260613 1282459 1072222 951739 1216804 1600584 1684316
8535 1684316 1513055 1088335 1001686 1179725 1383730 1376790 1109073 1176559 1153343 1170114 1292912
8524 1292912 1130458 1010466 783121 659010 865984 1036306 986359 914094 934028 983913
8514 983913 948362 979530 1016968 1063795 921777 796602 523117 724146 1015370 880233
8504 880233 609018 615788 873407 1045622 777062 967844 1059758 1080264 1128900 1287068 1134948
8493 1134948 915561 982808 982173 1059459 1137168 1015168 1001861 896384 882524 955778 1064285
8482A064285k2861j96489j10034R0611K0574P9958j56390o216P9637K18469K42021
8471A303565K23494k9549R3438q1216k59520Q4445j33977j32166J14149P8706
8461A261369N7288l4770m6893j32318r8976j44819J84498M92063k15568m19878
8451I01996j17271J25571j21633R85p157j33745k0277P9435J15510N9254J26774
8440A009442P4321k47629l14106O6703M0119L5880O8166J84275P6308q5865K66160
8429A173774O64j89767p3293J53962o4311J1109J0211L11030k47254k91988l5333
8418G58804J73982k25522j77981K15652L86578p9062L59364L9898k30153m1284
8408A180276J25656o3540j43022k30150K08845p1250l29821L42237J00871J00292
$$ plain form
8482 1064285 1041424 844935 734901 825512 846086 926044 769654 763438 843075 1061544 1303565
8471 1303565 1527059 1497510 1590948 1509732 1250212 1334657 1200680 1068514 1182663 1261369
8461 1261369 1318657 1283887 1236994 1104676 1005700 860881 1045379 1537442 1321874 901996
8451 901996 784725 910296 788663 789648 782491 648746 628469 707904 823414 882668 1009442
8440 1009442 1083763 836134 522028 588731 628850 664730 732896 917171 993479 907614 1173774
8429 1173774 1174438 984671 911378 1065340 1001029 1012138 1022349 1333379 1086125 794137 758804
8418 758804 932786 707264 529283 744935 1131513 1052451 1411815 1451713 1221560 1180276
8408 1180276 1305932 1242392 1099370 869220 1078065 1006815 676994 1019231 1120102 1220394
8398A220394k70617j65179O3705q0113o757j21120j38613L08384K75792j57591
8388I28285j91686L2848j29512k2142L3017r6519K167j71667L9265J56672r3878
8377D86850j48888k04085P408K37377J80794M4910o14j14296K87411K34496r9678
8366I11685l31502L1678J53415J71032j81651l26821j79753m1849N5580J01972
8356C63786J30385N7310k34471p2020L66783N0085J46845L6869q5483p695J84664
8345I37058J25488J27903j09538k43068j52400m2418M09019K07077j74099o059
8335A078963J36921j53796j13252P7500J43638L3364N4037J53691r4175j50045
8325A166846l21159k96997J92723J23127l60234m1050O4728m2101P1167J26753
$$ plain form
8398 1220394 949777 784598 848303 768190 761433 640313 501700 810084 1085876 928285
8388 928285 736599 769447 639935 617793 650810 554291 556458 384791 424056 580728 486850
8377 486850 337962 133877 141285 378662 559456 604366 603752 489456 776867 1011363 911685
8366 911685 580183 611861 765276 936308 754657 427836 248083 206234 261814 363786
8356 363786 494171 551481 317010 244990 611773 661858 808703 845572 760089 752394 937058
8345 937058 1062546 1190449 1080911 837843 685443 643025 1052044 1259121 1085022 1078963
8335 1078963 1215884 1062088 948836 1026336 1169974 1203338 1257375 1411066 1316891 1166846
8325 1166846 845687 548690 741413 864540 504306 463256 527984 485883 557050 683803
8315F83803J76240j40149l32779j52809R062K81772P5770Q403m2104j96188j51109
8304B19912k7915P8701K27928K64267R0865K05147N2863N1835m6196q4442k18510
8293H14455L60016R4092l24139k46206J09497l1290n9885j06793k62604J64636
8283E11779P3275L30123Q9498m2252k47195k2401j41385K2645K3405M5163J12298
8272G54953q2123k66338r4276j5279Q7619J06262K30415k70083P0854J5692q6993
8261D50703J9303j48093l4534O0821J31865n6598j38067J48166K82254N7417k90061
8250D83176O318k4831J50740K21616M5788j77031N7266p3888J9025J70045j42869
8239G35355j53354N0671r4992J7428O9236r2147q5327L1849J28732l858R9478
$$ plain form
8315 683803 860043 719894 387115 234306 243368 525140 600910 609313 567209 371021 219912
8304 219912 191997 270698 498626 762893 853758 1058905 1111768 1163603 1117407 1032965 814455
8293 814455 1174471 1268563 944424 698218 807715 776425 716540 609747 347143 511779
8283 511779 585054 915177 1004675 962423 715228 692827 551442 574087 597492 642655 754953
8272 754953 672830 406492 312216 296937 384556 490818 721233 451150 522004 537696 450703
8261 450703 470006 321913 287379 348200 480065 423467 285400 433566 715820 773237 483176
8250 483176 489494 464663 615403 837019 882807 705776 763042 689154 708179 878224 735355
8239 735355 582001 632672 537680 555108 624344 532197 446870 478719 607451 603593 703071
8228G03071K43726J69269l72653k30343K10033o7622P772K13598K10289j54064
8218I33076j57582j5452j56070J05324Q2846j26667l09097O7600J39666K04010
8208G67654p8551m9716q6194m10917K2973J35269k811m1730J01828R7755N0582
8197E06142l7536N9443l7204m0645o2382J96206K36927P9626j38006l8128r6208
8186F28235j85409K6302L69869Q0178J36709J3241k46246p4534J38288j83600
8176G03033m0947l7700p041m6410L68943J63259j28912j08124j65979j39422k49200
8165C11500L1489J36870J25102R0949n0061K52458N9607p4023n0467k28826j73351
8154D31247k08508J27995J90591j86830R8007O8003J25106k4745k40233j19482
$$ plain form
8228 703071 946797 1116066 743413 513070 723103 655481 663253 876851 1087140 933076
8218 933076 775494 760042 603972 709296 792142 665475 356378 423978 563644 767654
8208 767654 689103 639387 553193 142276 165249 300518 297707 255977 357805 455560 506142
8197 506142 468606 528049 490845 450200 387818 584024 820951 900577 762571 724443 628235
8186 628235 442826 469128 838997 919175 1055884 1069125 822879 748345 886633 703033
8176 703033 662086 624386 617345 570935 939878 1103137 974225 866101 700122 560700 311500
8165 311500 342989 479859 604961 695910 645849 898307 957914 883891 833424 604598 431247
8154 431247 222739 350734 541325 354495 452502 520505 645611 620866 380633 261151
8144B61151O8279J18198N3758J34181j64308m24183K7583N96649J74248k74028
8134E71528j03394J6363k27173k11113L19381J07657J15925J39764l8799K6867
8124G17006o9764m7903J02685N1020l6456p6117J65787R8897l2007j71106j93972
8113E08070L918m23616O6990K13907k3515p1684P9126k4256P2277N331J27450
8102E33998K63142j31661l47230j43482J57553K28105j48649j89684R7329J45942
8092D65363K4526K08598L08603l8916m02353p3158o2888j34863R2839M1265O5199
8081D94215l3844l7001J92508j6258m16497o097l0041Q7754k1601K53209L03012
8070G69359r8785P350k64034j77714O1345J29605Q7581j91218N9910M802k48123
$$ plain form
8144 261151 329430 447628 501386 635567 471259 47076 74659 671308 845556 571528
8134 571528 468134 484497 257324 46211 365592 473249 589174 728938 690139 717006
8124 717006 647242 599339 702024 753044 716588 640471 806258 905155 873148 702042 508070
8113 508070 511988 88372 155362 369269 345754 274070 353196 328940 401217 406548 533998
8102 533998 797140 665479 318249 174767 332320 560425 411776 222092 319421 465363
8092 465363 489889 698487 1007090 968174 565821 492663 429775 294912 387751 429016 494215
8081 494215 460371 423370 615878 599620 183123 177026 146985 234739 213138 466347 769359
8070 769359 670574 677924 413890 236176 297521 427126 514707 323489 383399 388201 140078
8059A40078J64958K31653l4500j38271m8909n9552K16495j87054L73420P0350
8049G28668P4253k87284k41600p9123j41827j82435M9704M7982L46341L63902
8039F78581m5001K8229j93198J4382P7256p8702j12125j74872J49207p3933j96508
8028G3316L07513M11576m3910k38554j90407O7694j40597L91705l0428J48821
8018G56729J29615j04110n7659j62361j22700J35523J72928K23982k65162j86168
8008E20617M4338j29437l2145J29724k18546j53004J22377q9803k26466J22613
7998I0268K6270K3187R4854M73417J00968k00057l35112J72290R8975j4926l8332
7987D91802P5584q337j19269m18593j5000K64754o891K17415Q192k89148k27100
$$ plain form
8059 140078 305036 536689 502189 363918 315009 255457 471952 284898 658318 728668
8049 728668 802921 515637 274037 194914 53087 -129348 -79644 -31662 314679 678581
8039 678581 633580 661809 468611 482993 560249 481547 369422 194550 343757 269824 73316
8028 73316 380829 792405 748495 509941 319534 387228 246631 638336 607908 756729
8018 756729 886344 782234 724575 562214 439514 575037 747965 971947 706785 520617
8008 520617 564955 435518 403373 533097 314551 161547 283924 194121 -32345 90268
7998 90268 116538 139725 234579 707996 808964 608907 273795 446085 545060 530134 491802
7987 491802 567386 559049 439780 21187 6187 270941 264050 481465 489657 200509 -26591
7976b6591p877n0700K87610N10745p1733j04093N7344P1093k44237Q4364l3178
7965D72747j02172j51866j17765j4942J68707O0694l4974J09787J80065n7634
7955E12647l17270j65564J47589j40406J95257J93346K2979J79707j81543k42302
7945B04440q4140M8967J87828P2372o0300o641L3193J22045J8954o782q8316N3349
7933D94969P9394J6798Q8927N2269k76631j85531K7581K19585k50432l56268k85444
7922c74783J61179K51314k2380J80532K2508j99002J37501Q4231K9772K47980
7912E18852R963j45593j53986n7712J13679o8930K05787n3179p4265m93125j28083
7901c26592K11476K01909Q6412P4099K29402J75033r0090n5099M753j84568r159
$$ plain form
7976 -26591 -34468 -85168 202442 713187 641454 537361 594705 665798 421561 505925 472747
7965 472747 370575 218709 100944 86002 254709 315403 280429 390216 570281 512647
7955 512647 195377 29813 177402 36996 232253 425599 448578 628285 446742 204440
7945 204440 120300 169267 357095 429467 369167 362526 395719 517764 536718 529936 441620 494969
7933 494969 574363 591161 680088 732357 455726 270195 297776 517361 266929 -89339 -374783
7922 -374783 -213604 37710 15330 195862 218370 19368 156869 241100 270872 518852
7912 518852 528815 383222 229236 171524 285203 216273 422060 368881 294616 -198509 -326592
7901 -326592 -115116 86793 173205 247304 476706 651739 561649 506550 511303 326735 317576
7890C17576J03772j25283J53021L41598r7728j80930O2642M8459Q807j05816j00318
7879D25800J0611N0351j47535j35394j22184J94323K54834o8545k46192J10495
7869C26564J75885p893l56444J52116o0417k14528k4870j80954r9868M6395j28891
7858c72905J43641J9051J72004K49933J03403N5150j4016K27803j23854l33082
7848A27128j52453o491P7490r1048J1694J58030M8264o3186O0333k58190p1585
7837a60014K68911K56474J8176j13238Q7282L41233k99795j5040k10115N4160
7827B28034k3268m8117K7776K81570j14363k54337J81245J54484o4785r3478k04659
7816G0102j54864J16090L41829J80555R1600j0028j32167l23374j52382J97832
$$ plain form
7890 317576 421348 296065 449086 790684 692956 512026 574668 623127 631934 526118 425800
7879 425800 436411 486762 339227 203833 81649 275972 530806 462261 216069 326564
7869 326564 502449 494556 138112 290228 229811 15283 -9587 -190541 -290409 -244014 -372905
7858 -372905 -229264 -210213 -38209 211724 315127 370277 356261 584064 460210 127128
7848 127128 -25325 -31816 45674 -45374 -33680 124350 172614 109428 169761 -88429 -160014
7837 -160014 108897 365371 383547 270309 357591 698824 399029 383989 173874 228034
7827 228034 204766 156649 184425 465995 351632 97295 278540 433024 368239 274761 70102
7816 70102 -84762 31328 373157 553712 645312 635284 503117 179743 27361 225193
7806B25193L48400N4598l63009j91073o0497K07380L43362k5152j68167k58803
7796A12232J666k58853j7311J08117L4556q0835j4281K82321j4992J64932R5718
7785D13270L9509l49148o2272j14985p6059J28704K82363l0224L534K43529K5139
7774E03360k04157K00768r7210k45059j67756J6565m7367j24937L21121K38197
7764C93525j92356n6577p3583j1631K52342N6032k12145m2162j51011o057L25495
7753B81872K667m2654j80321j91970m5121P7731L04336J41955j33977J59066L6061
7742D09645j55218k66658J2220J21504J33848l3646j80550n4341P2270L84315
7732D43389o5395k47974J8825q3955j39638K63896R5262m4806r2861K3765j59411
$$ plain form
7806 225193 573593 628191 265182 74109 13612 220992 564354 539202 371035 112232
7796 112232 113898 -144955 -162266 -54149 -19593 -100428 -114709 167612 152620 317552 413270
7785 413270 452779 103631 41359 -73626 -149685 -20981 261382 231158 234692 478221 503360
7774 503360 299203 499971 402761 157702 -10054 6511 -40856 -165793 155328 393525
7764 393525 201169 144592 71009 59378 311720 367752 155607 113445 -37566 -43623 281872
7753 281872 284539 241885 61564 -130406 -175527 -97796 206540 348495 214518 373584 409645
7742 409645 254427 -12231 -11 121493 255341 221695 41145 -13196 59074 443389
7732 443389 377994 130020 148845 64890 -74748 189148 284410 239604 146743 170508 11097
7721A1097J61612K82449K3520J77384Q0910j85286k44611j64975P8151K12928
7711D33179n5566P7518J68132q6101K12976j18243j46925k93932k09814L2201
7701A3425J89602M42205k7753k76824k03044k429O3245K0824J7141K04661k8414
7690D12639M286k5439m23083r7314J92380K54528R43l4127k09529j64231K9043
7679e9904O3876J68009J35701N2794m526J23847j47763K2469J32438L59864j28485
7668G18320k87493k82871K4097J35061r5118K63936o81j78373o9696Q9641R0530
7657D07353R8565k95659k11859l9718L39955K89222J6562j79277k08181j26767
7647I0196J54797J11052l6703J18701J21357k41169o0690j1059j77830l07318
$$ plain form
7721 11097 172709 455158 478678 656062 736972 551686 307075 142100 220251 433179
7711 433179 377613 455131 623263 537162 750138 631895 484970 191038 -18776 13425
7701 13425 203027 645232 617479 340655 137611 135182 198427 219251 236392 441053 412639
7690 412639 416925 391486 -31597 -128911 63469 317997 318940 284813 75284 -88947 -59904
7679 -59904 3972 171981 307682 360476 355950 479797 332034 354503 486941 846805 718320
7668 718320 430827 147956 172053 307114 211996 475932 475251 296878 227182 316823 407353
7657 407353 505918 210259 -1600 -41318 298637 587859 604421 425144 216963 90196
7647 90196 244993 356045 319342 438043 559400 318231 257541 246482 68652 -238666
7637b38666j91406L80670L40308L0374j66303M3114K7884r0338Q3041Q8692j6886
7626B90484j78497J23530J42956J1054n599J15913j53032J31252R9232l68762
7616B08531k74456J80368L41344j30860k77739M7063j23139j11127j54739j3074
7606c07828l0223m2066J72990J36794O1611K39223M6780j29643j89598l27859
7596c69819J49940J40949L72110M6062Q8564O5088j47076R962n0558L3599o3497
7585B75324k27538j36912N6171J54563N3647k37538k55080L49466J92240R0199
7575C14542j5222j75900N1270j22565J27349K09811J06429l65028j62118K55275
7565B23843K08899p4439o690l479K03164O6430k53960n982J31459l11493K5011
$$ plain form
7637 -238666 -430072 -49402 290906 321280 154977 198091 225975 135637 218678 307370 290484
7626 290484 111987 235517 378473 389527 383928 499841 346809 478061 577293 208531
7616 208531 -65925 114443 455787 324927 47188 94251 -28888 -140015 -294754 -307828
7606 -307828 -338051 -380117 -207127 -70333 -8722 230501 277281 147638 -41960 -369819
7596 -369819 -219879 -78930 293180 339242 427806 492894 345818 355780 305222 338821 275324
7585 275324 47786 -89126 -32955 121608 175255 -62283 -317363 32103 224343 314542
7575 314542 299320 123420 174690 52125 179474 389285 495714 130686 -31432 223843
7565 223843 432742 358303 351613 348134 551298 617728 363768 357786 489245 177752 202763
7554B02763K44630Q1291L387k8277l02908P1568J19056l1341l9544n8837R134
7543B70922p4875K36095J75535l38890m2054J55289j59068k0528K3409K9683k5308
7532B30210n9537j4041m3923J19914K959N506J07772J80612j33397J43460O1881
7521F01416k54634j38656r7213J05477j15328R7K89316l6823j20780K0262M0452
7510B93586o7989k55339j17173J37201J89232j67286L6039k5042j29924j09908
7500b16603j2206K45952K88560R1716q3577l09121p0426k4402K1345J2906R1412
7489C5556K71972q690l9480r6720k54883J03788K09775r9567m5916J54054K18261
7478D48150J46057k53847k42928n5602k7462L615j87206N2080J53549R0077K86351
$$ plain form
7554 202763 447393 528684 532071 503794 200886 272454 391510 360169 320625 261788 270922
7543 270922 196047 432142 607677 268787 226733 382022 222954 202426 225835 255518 230210
7532 230210 170673 156632 112709 232623 235582 241088 348860 529472 396075 539535 601416
7521 601416 346782 208126 110913 216390 101062 101159 390475 353652 232872 253134 293586
7510 293586 225597 -29742 -146915 -9714 179518 12232 48271 23229 -106695 -216603
7500 -216603 -228809 17143 305703 397419 313842 4721 -65705 -90107 -68762 -55856 35556
7489 35556 307528 298838 259358 162638 -92245 11543 221318 121751 75835 229889 448150
7478 448150 594207 340360 97432 41830 14368 17983 -169223 -117143 36406 126483 412834
7467D12834K7298r0563N5739J62297n6193j48920l18199L3J70393m0196L34088
7456E08611l39134j47840L8799m1349L96717Q0374M0197l6599j92058k93551j21692
7445a07525p5277j18613J63985L48361K67676J69885o0965k00851l1888J1939
7435C66727J4453O2068J46634j30477o2839K41050r7629m25392n8027o6272j52642
7424a62346j31381j1650J46279K42373J17109k0486J99776j89559k01183k37860
7414b48928o9147L07124K69378K46490l9290j28409j12038k39172l66887J1116
7404c69763j910L18865M91922J72868j0694j26277n5395k32699l06464j76709
7394b96256J04874L54195K48059J58097p0641k52814n0732o2554R3935J92962
$$ plain form
7467 412834 440132 349569 405308 567605 511412 362492 44293 44326 214719 174523 508611
7456 508611 169477 21637 60436 19087 415804 496178 536375 499776 307718 14167 -107525
7445 -107525 -182802 -301415 -137430 210931 478607 648492 587527 386676 354788 366727
7435 366727 381180 443248 589882 459405 396566 637616 539987 114595 56568 -9704 -162346
7424 -162346 -293727 -305377 -159098 83275 200384 179898 379674 190115 -11068 -248928
7414 -248928 -318075 -10951 258427 504917 465627 337218 225180 -13992 -380879 -369763
7404 -369763 -371673 -52808 439114 611982 601288 475011 419616 186917 -119547 -296256
7394 -296256 -191382 162813 410872 568969 498328 245514 194782 132228 226163 419125
7384D19125N1138O1709l18302k16443j86220j91223K92413J46759J62337L5597
7374B56890j41554J20518q4403O7301K08717j38156k20710j54447q0166R6517
7364f9493J03937m5825n5315L2119K09919K6380k5812J64432L10k08487O2297
7353A94462O7406L4281K24216j20075m8228p4683j01318Q0917k22555k00331O6368
7342i9540P2562P1473j14803k96698J87573K60930J66001j9404l05382p9296J99636
7331D3052P7747k8883k22930k83538r2228L19785J42682R5497J51125J85416J42820
7320E30545k71066M7206l0230j07093L1670J03372j69200J18924k25241j35992
7310a07105j35254N0371J85636P0956P841J47845q8701p8745L6270o7920N6793
$$ plain form
7384 419125 470263 531972 213670 -2773 -188993 -380216 -87803 58956 221293 256890
7374 256890 115336 235854 151451 218752 427469 289313 68603 -85844 -166010 -69493
7364 -69493 34444 -11381 -66696 -34577 175342 201722 175910 340342 340652 132165 194462
7353 194462 261868 296149 520365 400290 352062 277379 176061 256978 34423 -165908 -99540
7342 -99540 -26978 44495 -70308 -367006 -179433 81497 247498 228094 -77288 -156584 43052
7331 43052 120799 91916 -131014 -414552 -506780 -186995 -44313 51184 202309 387725 530545
7320 530545 259479 306685 276455 169362 201032 304404 135204 254128 28887 -107105
7310 -107105 -242359 -191988 -6352 64604 72445 220290 131589 52844 89114 21194 77987
7299G7987n223k73310r8680J94124O5661J31701J7322R9884j00528O5407J86733
7288C61078Q1798k31987j03420J84756j76206n7662N9709o3887j04034r990J9449
7277d0396J12938j22214n3336K30432Q2882Q7564j29914J13999M5876k10014m9586
7266F8231j01064K87521j09603p35052n9747L12883M21780P2887j82559k7915
7256e2638p0820q2972K62981J25718l4088j53863p6602J02295k67070J17715K09521
7245H0177n1133K82224J29439J12533k46126k27682L390O4155J9879J95614j1680
7234C50790n3136j89900p7504L0142O7370p3125K7652j3530J07042j10484k38358
7223a73041J79201m2642P8364L4724k48900r5473k818J78760J67046J30104J7852
$$ plain form
7299 77987 72764 -200546 -299226 -105102 -39441 92260 109582 209466 108938 174345 361078
7288 361078 442876 210889 107469 292225 116019 58357 118066 54179 -49855 -59845 -40396
7277 -40396 72542 -49672 -103008 127424 210306 297870 167956 281955 327831 117817 68231
7266 68231 -32833 254688 145085 -589967 -649714 -336831 84949 157836 -24723 -52638
7256 -52638 -123458 -206430 56551 182269 148181 -5682 -82284 20011 -247059 -129344 80177
7245 80177 29044 311268 440707 553240 307114 79432 82822 146977 166856 362470 350790
7234 350790 297654 107754 30250 60392 127762 54637 82289 68759 175801 65317 -173041
7223 -173041 6160 -36482 41882 76606 -172294 -267767 -270585 -91825 75221 205325 223177
7212B23177P8464J31015k37824N1045j61277j16228K72457j49179l20186q8135
7202c16671J56625K15468r9079J17516J02705k67162j81292R3450J51909Q6338
7192E9807M3418J5093o0544j64317k02489K13240K8115j96537J0066K57584J235
7181D671P0877J97572J23796L9423J00857m0924n2699p7447k15831M7030R2516
7170B89841j63404j32193k20599k0770K48170k50778L7246L25799k04308O9205
7160b1791J69661J8478J52911r1127L5881Q1225j47755L4498j30537j64328p046
7149f9930j36535l2993r6657K78767K87185J20095j32353k12132J00096M3764
7139A49307J0535n6709k03387J2639J4251J11839J72942j62377J7309P7364j45333
$$ plain form
7212 223177 301641 432656 194832 245877 84600 -31628 240829 91650 -228536 -316671
7202 -316671 -160046 55422 -43657 73859 176564 -90598 -271890 -178440 -26531 59807
7192 59807 103225 118318 57774 -106543 -309032 -95792 -67677 -264214 -254148 3436 4671
7181 4671 75548 273120 396916 436339 537196 496272 443573 366126 150295 197325 289841
7170 289841 126437 -5756 -226355 -247125 1045 -249733 -212487 113312 -90996 -21791
7160 -21791 147870 166348 319259 228132 264013 345238 197483 231981 101444 -62884 -69930
7149 -69930 -206465 -239458 -336115 -57348 229837 349932 217579 5447 105543 149307
7139 149307 159842 103133 -100254 -87615 -73364 38475 211417 49040 66349 143713 -1620
7128a620k0395K06508r3864J67663L35783j25081m89049Q3492K27620P5638J9015
7117C85710N0072k96885k5932J3217j19362j7718j10183R2682J00778j20267j4334
7106f2222J13257m0898r4177L6484k15596q979J48417R1992l1133j2532J2490
7095f2897l0809J36825J93482k16197q8739J00709K01367J15058k2146J38802
7085D65455R2924J78829j10539J39423j18609j93406K30008j05605o3040l1218
7075D84222L3687j07522j48719K43013J52735k18835j80418J77874K4165J3036
7065D73238J58218j72739k94825L0448j31523O4514k6040o0253M9574j05838p2138
7054h7364j76797j01364J88620p514k15673L442J20116K68506Q9348J57177j33923
$$ plain form
7128 -1620 -22015 184493 90629 258292 594075 468994 -20055 63437 291057 366695 385710
7117 385710 435782 138897 112965 126182 6820 -10898 -121081 -28399 72379 -47888 -62222
7106 -62222 51035 10137 -84040 -47556 -263152 -272131 -123714 -31722 -62855 -75387 -62897
7095 -62897 -93706 43119 236601 20404 -68335 32374 233741 348799 326653 465455
7085 465455 558379 737208 626669 766092 647483 454077 684085 578480 515440 484222
7075 484222 517909 410387 261668 504681 657416 438581 258163 436037 460202 473238
7065 473238 631456 458717 163892 194340 62817 127331 101291 41038 90612 -15226 -87364
7054 -87364 -264161 -365525 -176905 -184419 -400092 -396650 -276534 -8028 81320 238497 104574
7043A04574K37065Q6818j73787o4370J423l34113Q4832j03549J6534N0618l21964
7032d15919M3628K68477l9723j17431M7635J7079j46862p8503j34981J27525O0847
7021c68228J09653J93555j87252j54201J83798O7555N0273j94290J34372K4525
7011a40240k71105o3858L38321K50785O312m39873q2973N5685k98599O4807L37414
7000b43324L22763o2199j21066M18Q8272J56661m5195r2926j88951Q4390o4679
6989a65836r4039K09033l4789o7899N9433J39301Q2835J27697J89831o3360k90184
6978I2023j44860k14061j09727J44682O0815p852q3647J44612K19288K46091l8124
6967C09240r802J36486J57615k17725k96085j16402J46514J23482k169J6642J21958
$$ plain form
7043 104574 341639 428457 254670 190300 191723 -142390 -57558 -161107 -144573 -93955 -415919
7032 -415919 -372291 -103814 -143537 -260968 -213333 -196254 -343116 -421619 -556600 -429075 -368228
7021 -368228 -258575 -65020 -252272 -406473 -222675 -155120 -104847 -299137 -164765 -140240
7011 -140240 -411345 -475203 -136882 113903 120215 -319658 -402631 -346946 -645545 -580738 -243324
7000 -243324 79439 17240 -103826 -103408 -15136 141525 96330 3404 -185547 -101157 -165836
6989 -165836 -259875 -50842 -85631 -153530 -94097 45204 128039 255736 445567 382207 92023
6978 92023 -52837 -266898 -376625 -231943 -171128 -178980 -262627 -118015 101273 347364 309240
6967 309240 299438 435924 593539 375814 79729 -36673 109841 233323 231154 247796 369754
6956C69754J4426j55100o1098R3020j9618j99862P2442p8409M0445P2212r2972
6945E5240k6616j86116k0456J81520J07892Q0768j20268J9496P3792j54377J89504
6934B00379J97892o4653R3343o1511j68858l79204j2696K99739P0808n1749j09126
6923A4364J04263J21146j54423N0508k15651J13851N798K6003j94917J24204L27212
6912C22358k06058k04369j67068J21807J75496J42915K08919O2639o7212j89082
6902B00345J26412j28660r3894p4620j86788K44747k5265P2432l2024J27231J66592
6891C96508j58858k27549K86278J65643j50570o0850r8591j78844j36482J07777
6881e5538r8068M3850K70305K02586r8532l25540k9400N5387L6369M9276j55860
$$ plain form
6956 369754 384180 229080 167982 261002 241384 41522 113964 35555 76000 148212 55240
6945 55240 28624 -157492 -177948 3572 111464 192232 71964 91460 165252 10875 200379
6934 200379 398271 333618 426961 365450 196592 -182612 -195308 104431 175239 123490 14364
6923 14364 118627 239773 85350 135858 -79793 34058 39856 65859 -129058 -4854 322358
6912 322358 116300 -88069 -255137 -133330 42166 185081 394000 456639 389427 200345
6902 200345 326757 198097 104203 29583 -157205 87542 62277 134709 102685 229916 396508
6891 396508 237650 10101 296379 462022 311452 250602 152011 -26833 -163315 -55538
6881 -55538 -153606 -109756 160549 363135 264603 -60937 -90337 -34950 1419 50695 -105165
6870a05165j73762j34139K1841l6026J7880L4255J55495J16727L8567J28488J49723
6859B13884j33214j50510K8125K6442p8751K80815J90215k4921k14177k8794K14932
6848C24046O0728j00246q1932j12456o4975J0242n5082J79416Q2793J3910q7498
6837A68946J1135j37397L333J04165k877j24794J40492J04539R6528J98423p2174
6826D90319l04394m1730K76220J82705j7738K3622O7064k02666k10071M7622J29489
6815D40442j0864j28832j76303k49591N474K37180P1804j2861o7004N5993k14102
6804d8664k6334J56324r8917l7304K26794j57510k74359Q4962K38299l54675k79574
6793e70958k5066L01402M27166J3768j97968J02104L2099k9004m6237k23328j10426
$$ plain form
6870 -105165 -278927 -413066 -391225 -427251 -409371 -375116 -219621 -102894 -64327 64161 213884
6859 213884 80670 -69840 -41715 -15273 -94024 186791 377006 352085 137908 109114 324046
6848 324046 384774 284528 202596 90140 25165 35407 -19675 159741 242534 256444 168946
6837 168946 180081 42684 46017 150182 147305 22511 163003 267542 364070 562493 490319
6826 490319 185925 144195 420415 603120 585382 609004 676068 473402 263331 310953 440442
6815 440442 429578 300746 124443 -125148 -119674 117506 189310 176449 109445 165438 -48664
6804 -48664 -74998 81326 -17591 -54895 171899 14389 -259970 -175008 63291 -291384 -570958
6793 -570958 -596024 -294622 132544 146312 -51656 50448 82547 53543 7306 -216022 -326448
6782c26448J33396K37787k6149j8920m2938l78390P2204K20061O8381P7051J24636
6771A40671J14922j22528j39693l52940Q4255J64302P9608P0593J93204R9427
6761C31821j50919J2598m5946P3977J84653l2032p9191L8530k72484m7065J23780
6750A37722k10416j83428l2085j19901j96442K96921L30859q3208L5769J58153
6740A33944K17252O0032j67796p239k06989j84026j58777J64210L73110J97598
6730D21319k25526j30452J45811M2890M4866j77042p0803L2632L6073N4039l34912
6719a61105j77499J36j84166L09610J76680J89876M5594j59246P3661j5068j52146
6708e3673J284K68611N7564j55436R343n1322k22869j95849J25404M1892P30J48996
$$ plain form
6782 -326448 -193052 44735 18586 -334 -43272 -421662 -349458 -129397 -61016 16035 140671
6771 140671 255593 133065 -6628 -359568 -275313 -111011 -31403 39190 232394 331821
6761 331821 180902 193500 147554 221531 406184 374152 294961 333491 61007 13942 137722
6750 137722 -72694 -256122 -288207 -408108 -604550 -307629 23230 -59978 -24209 133944
6740 133944 351196 411228 243432 236193 29204 -154822 -313599 -149389 223721 421319
6730 421319 195793 65341 211152 254042 298908 121866 51063 83695 119768 173807 -161105
6719 -161105 -338604 -338468 -522634 -213024 -36344 153532 199126 39880 113541 98473 -53673
6708 -53673 -52389 216222 273786 118350 127693 76371 -146498 -342347 -216943 -175051 -174321 -25325
6696b5325o913Q7143L8158j05953L0397j61051p4200o8494J25315P5557l4800
6685a20166R14J34435l8366j97235j24976J95373p9722N406L49103j88950j21000
6674a85184L2382L98600P3738J71572p4969j81178M9728P2511j57577j80061L0621
6663E0183l33113o2013k2465o2919K85045N44638J98786l60629m02452q0226N1810
6652a93355M04674J60022k19296n2167r740O788J20085j25185l36388L6205P4272
6641a34085J01360R8614L9900r7402J08868r2502o5081M259p5132j22883j67231
6630d01315k8315P8390J06165J86445K03844K307j19439n9483J90764R4202o7962
6619A85603j74600j01414L8965K49972j15078j13104K5197k6836K5335m9896k16805
$$ plain form
6696 -25325 -32238 54905 93063 -12890 17507 -143544 -217744 -286238 -160923 -85366 -120166
6685 -120166 -119252 15183 -23183 -220418 -345394 -150021 -229743 -224337 124766 -64184 -185184
6674 -185184 -152802 245798 319536 491108 416139 234961 284689 357200 199623 19562 50183
6663 50183 -282930 -344943 -367408 -430327 -145282 399356 598142 237513 -164939 -245165 -193355
6652 -193355 211319 371341 152045 99878 90138 96926 217011 91826 -244562 -208357 -134085
6641 -134085 -32725 65889 105789 8387 117255 24753 -40328 -36069 -111201 -234084 -401315
6630 -401315 -429630 -351240 -245075 -58630 145214 147521 28082 -31401 159363 253565 185603
6619 185603 11003 -90411 -51446 198526 83448 -29656 -4459 -31295 -5960 -55856 -272661
6608b72661Q3215r3053J03310L20448O9346M1868R2281j71457k19092k40378k56881
6597e43054J60081J89816J9065j51913N0361Q0598K27700k14Q5596K74695Q7236
6586D79967j05936n9555K49j92237m18847j90085r8919Q2626o9723K9813K54898
6575b87749K9304R9705J3065J32479J40767l08492o4195j08974l9843O7094l1290
6564c58129K4932J92038K62652O3190k18096N9222O3218p2070j93557m0156k01291
6553d18047J88926L4185p3858J00557j53830j19382L233K23939P5545j00932k51042
6542d90706J19238n4826q9903J8589j06717k7389J71028Q8509j7180Q8028N0855
6531b50474m755K60152m1146r2932r166K17678L76177K1858k50102m19455k79183
$$ plain form
6608 -272661 -189446 -282499 -179189 141259 210605 252473 344754 173297 -45795 -286173 -543054
6597 -543054 -382973 -193157 -174092 -326005 -275644 -195046 32654 32440 118036 392731 479967
6586 479967 374031 314476 314725 122488 -296359 -486444 -585363 -502737 -572460 -542647 -287749
6575 -287749 -258445 -158740 -145675 -13196 127571 -180921 -245116 -354090 -393933 -326839 -358129
6564 -358129 -333197 -141159 121493 184683 -33413 25809 89027 16957 -176600 -216756 -418047
6553 -418047 -229121 -194936 -268794 -168237 -322067 -441449 -438216 -214277 -138732 -239664 -490706
6542 -490706 -371468 -426294 -516197 -497608 -604325 -631714 -460686 -372177 -389357 -301329 -250474
6531 -250474 -255229 4923 -36223 -129155 -138321 79357 455534 477392 227290 -192165 -471348
6520d71348Q3124R717J24113K77258K52651j89274l859o5177j75284J19589K76982
$$ plain form
6520 -471348 -388224 -378507 -254394 22864 275515 86241 82382 17205 -158079 -38490 238492
$$ [...]
##END NTUPLES=NMR SPECTRUM
##END=
