##TITLE=316707	cc 38401	438/78	adrs	antons
##JCAMPDX= 6.0         $$ Bruker NMR JCAMP-DX V2.0
##DATA TYPE= NMR SPECTRUM
##DATA CLASS= NTUPLES
##ORIGIN= Bruker BioSpin GmbH
##OWNER= nmr
$$ XWIN-NMR		Version 3.5
$$ Wed Jul 12 08:27:37 2006 GMT Daylight Time (UT+1h)  MAYBRIDGE\nmr@NMR_250MHZ
##.OBSERVE FREQUENCY= 250.131544655141
##.OBSERVE NUCLEUS= ^1H
##.ACQUISITION MODE= SIMULTANEOUS (DQD)
##.ACQUISITION SCHEME= undefined
##.AVERAGES= 4
##.DIGITISER RES= 18
##SPECTROMETER/DATA SYSTEM= dpx250
##.PULSE SEQUENCE= zg30
##.SOLVENT NAME= DMSO
##.SHIFT REFERENCE= (INTERNAL, DMSO, 0, 16.522)
##AUDIT TRAIL= $$ (NUMBER, WHEN, WHO, WHERE, WHAT)
$$ ##TITLE= Audit trail, XWIN-NMR		Version 3.5
$$ ##JCAMPDX= 5.01
$$ ##ORIGIN= Bruker BioSpin GmbH
$$ ##OWNER= nmr
$$ C:/u/data/dgb/nmr/ADRS/15211/pdata/1/auditp.txt
$$ ##AUDIT TRAIL=  $$ (NUMBER, WHEN, WHO, WHERE, WHAT)
(   1,<2006-01-25 11:15:08.32 +000>,<MAYBRIDGE\nmr>,<NMR_250MHZ>,
      <created by zg, POWCHK disabled, PULCHK disabled
       terminated by command 'halt'
       configuration hash MD5:
       62 19 C7 07 E1 42 D1 B7 37 6C 3D D0 77 39 F9 E6
       data hash MD5: 64K
       28 DD D8 05 7F 99 50 7D FC F5 63 7C 14 10 C2 A6>)
(   2,<2006-01-25 11:15:18.06 +000>,<MAYBRIDGE\nmr>,<NMR_250MHZ>,
      <Start of raw data processing
       ef LB = 0.3 FT_mod = 6 PKNL = 1 SI = 32K 
       data hash MD5: 32K
       32 55 1B C7 3F AC 0D B6 01 EF A1 81 D7 24 1F 0F>)
(   3,<2006-01-25 11:15:20.63 +000>,<MAYBRIDGE\nmr>,<NMR_250MHZ>,
      <apk 
       data hash MD5: 32K
       8F 77 CC 60 10 2E 4A 8E 66 E2 8B 4C A0 2E 45 3B>)
(   4,<2006-01-25 11:15:21.52 +000>,<MAYBRIDGE\nmr>,<NMR_250MHZ>,
      <abs ABSG = 5 
       data hash MD5: 32K
       F8 ED 25 DE 9F E2 5A BD 33 C6 AF 0E 86 B3 5E B4>)
$$ ##END=
$$ 
$$ hash MD5
$$ 1A 03 9C 20 96 60 05 0D 99 B8 21 45 28 C1 1C 2F
##$RELAX= 
##$RELAX= 
##$RELAX= 
##$RELAX= 
##$RELAX= 
##$RELAX= 
##$RELAX= 
$$ Bruker specific parameters
$$ --------------------------
##$DU= <C:\Restored>
##$EXPNO= 15211
##$NAME= <ADRS>
##$PROCNO= 1
##$TYPE= <nmr>
##$USER= <dgb>
##$AMP= (0..31)
100 100 100 100 100 100 100 100 100 100 100 100 100 100 100 100 100 100 
100 100 100 100 100 100 100 100 100 100 100 100 100 100 
##$AQSEQ= 0
##$AQ_mod= 3
##$AUNM= <au_zg>
##$AUTOPOS= <9 >
##$BF1= 250.13
##$BF2= 250.13
##$BF3= 250.13
##$BF4= 250.13
##$BF5= 500.13
##$BF6= 500.13
##$BF7= 500.13
##$BF8= 500.13
##$BYTORDA= 1
##$CFDGTYP= 0
##$CFRGTYP= 5
##$CHEMSTR= <none>
##$CNST= (0..31)
1 1 145 1 1 1 1 1 1 1 1 1 1 1 1 1 1 1 1 1 1 1 1 1 1 1 1 1 1 1 1 1 
##$CPDPRG= <>
##$CPDPRG1= <>
##$CPDPRG2= <>
##$CPDPRG3= <>
##$CPDPRG4= <mlev>
##$CPDPRG5= <mlev>
##$CPDPRG6= <mlev>
##$CPDPRG7= <mlev>
##$CPDPRG8= <mlev>
##$CPDPRGB= <>
##$CPDPRGT= <>
##$D= (0..31)
0 1 0 0 0 0 0 0 0 0.06 0 0 0 0 0 0 0.0002 0 0 0 0 0 0 0 0 0 0 0 0 0 0 
0 
##$DATE= 1138187707
##$DBL= (0..7)
120 120 120 120 120 120 120 120 
##$DBP= (0..7)
150 150 150 150 150 150 150 150 
##$DBP07= 0
##$DBPNAM0= <>
##$DBPNAM1= <>
##$DBPNAM2= <>
##$DBPNAM3= <>
$$ [...]
##$SUBNAM7= <"">
##$SUBNAM8= <"">
##$SUBNAM9= <"">
##$SW= 20.6930455092707
##$SWIBOX= (0..15)
0 0 3 0 0 0 0 0 0 0 0 0 0 0 0 0 
##$SW_h= 5175.983436853
##$TD= 65536
##$TD0= 1
##$TE= 292.16
##$TE2= 300
##$TE3= 300
##$TEG= 300
##$TL= (0..7)
0 120 120 120 120 120 120 120 
##$TP= (0..7)
150 150 150 150 150 150 150 150 
##$TP07= 0
##$TPNAME0= <>
##$TPNAME1= <>
##$TPNAME2= <>
##$TPNAME3= <>
##$TPNAME4= <>
##$TPNAME5= <>
##$TPNAME6= <>
##$TPNAME7= <>
##$TPOAL= (0..7)
0.5 0.5 0.5 0.5 0.5 0.5 0.5 0.5 
##$TPOFFS= (0..7)
0 0 0 0 0 0 0 0 
##$TUNHIN= 0
##$TUNHOUT= 0
##$TUNXOUT= 0
##$USERA1= <user>
##$USERA2= <user>
##$USERA3= <user>
##$USERA4= <user>
##$USERA5= <user>
##$V9= 5
##$VALIST= <valist>
##$VCLIST= <CCCCCCCCCCCCCCC>
##$VD= 0
##$VDLIST= <DDDDDDDDDDDDDDD>
##$VPLIST= <PPPPPPPPPPPPPPP>
##$VTLIST= <TTTTTTTTTTTTTTT>
##$WBST= 1024
##$WBSW= 4
##$XGAIN= (0..3)
0 0 0 0 
##$XL= 0
##$YL= 0
##$YMAX_a= 84006
##$YMIN_a= -110327
##$ZGOPTNS= <>
##$ZL1= 120
##$ZL2= 120
##$ZL3= 120
##$ZL4= 120
##$ABSF1= 16.522
##$ABSF2= -4.171173
##$ABSG= 5
##$ABSL= 3
##$ALPHA= 0
##$AQORDER= 0
##$ASSFAC= 0
##$ASSFACI= 0
##$ASSFACX= 0
##$ASSWID= 0
##$AUNMP= <proc_1d>
##$AZFE= 0.1
##$AZFW= 0.1
##$BCFW= 0
##$BC_mod= 0
##$BYTORDP= 0
##$COROFFS= 0
##$CY= 12.5
##$DATMOD= 1
##$DC= 0
##$DFILT= <>
##$DTYPP= 0
##$F1P= 14.0000005364418
##$F2P= -0.99999901652339
##$FCOR= 0.5
##$FTSIZE= 32768
##$FT_mod= 6
##$GAMMA= 0
##$GB= 0
##$INTBC= 1
##$INTSCL= 1
##$ISEN= 128
##$LB= 0.3
##$LEV0= 0
##$LPBIN= 0
##$MAXI= 10000
##$MC2= 0
##$MEAN= 0
##$ME_mod= 0
##$MI= 0
##$NCOEF= 0
##$NC_proc= -7
##$NLEV= 6
##$NOISF1= 0
##$NOISF2= 0
##$NSP= 0
##$NTH_PI= 0
##$NZP= 0
##$OFFSET= 16.522
##$PC= 1
##$PHC0= -126.5668
##$PHC1= 13.19694
##$PH_mod= 1
##$PKNL= yes
##$PPARMOD= 0
##$PSCAL= 4
##$PSIGN= 0
##$REVERSE= no
##$SF= 250.13
##$SI= 32768
##$SIGF1= 0
##$SIGF2= 0
##$SINO= 400
##$SIOLD= 32768
##$SREGLST= <1H.DMSO>
##$SSB= 0
##$STSI= 32768
##$STSR= 0
##$SW_p= 5175.98343685301
##$SYMM= 0
##$S_DEV= 0
##$TDeff= 65536
##$TDoff= 0
##$TI= <Analysis number 999999
Compound Code 99
Book Reference 9
Project Code 9>
##$TILT= no
##$TM1= 0
##$TM2= 0
##$TOPLEV= 0
##$USERP1= <user>
##$USERP2= <user>
##$USERP3= <user>
##$USERP4= <user>
##$USERP5= <user>
##$WDW= 1
##$XDIM= 32768
##$YMAX_p= 512926972
##$YMIN_p= -978593
$$ End of Bruker specific parameters
$$ ---------------------------------
##NTUPLES= NMR SPECTRUM
##VAR_NAME=  FREQUENCY,     SPECTRUM/REAL,   SPECTRUM/IMAG
##SYMBOL=    X,             R,               I
##VAR_TYPE=  INDEPENDENT,   DEPENDENT,       DEPENDENT
##VAR_FORM=  AFFN,          ASDF,            ASDF
##VAR_DIM=   32768,         32768,           32768
##UNITS=     HZ,            ARBITRARY UNITS, ARBITRARY UNITS
##FACTOR=    0.157963299565203, 1,           1
##FIRST=     4132.6476996994, 0,             0
##LAST=      -1043.33573715361, 0,           0
##MIN=       -1043.33573715361, -978593,     0
##MAX=       4132.6476996994, 512926972,     0
$$ Real data points
##PAGE= N=1
##DATA TABLE= (X++(R..R)), XYDATA
$$ [...]
24756E6106l14487k00589l3647N4710K73182L48794K45377k22327l37410n5614
$$ 56106 -258381 -458970 -492617 -437907 -164725 184069 429446 207119 -130291 -185905
24746a85905L8793J34586j25328N2964K71231j81487n9638j52645p4223K9744
$$ -185905 -147112 -12526 -137854 -84890 186341 4854 -54784 -207429 -281652 -251908
24736b51908l2958K79505j3152j46907j60286p0136N7140K96007l627l59855N4111
$$ -251908 -284866 -5361 -18513 -165420 -325706 -395842 -338702 -42695 -46322 -406177 -352066
24725c52066o1709M313J35423P7185r5912O3227J03389q2859j45156m8336j03362
$$ -352066 -413775 -409462 -274039 -196854 -292766 -229539 -126150 -209009 -354165 -402501 -505863
24714e05863j51645o8267J70900K32414J82555J43323l132j33583j82299l29984
$$ -505863 -657508 -725775 -554875 -322461 -139906 3417 285 -133298 -315597 -645581
24704f45581K9475J99445O6991j0992j55193J45330J65454J38952K00803j00013
$$ -645581 -616106 -416661 -349670 -360662 -515855 -370525 -205071 -66119 134684 34671
24694C4671n8781J96541L23100K6449k53269j03008k18061l84072j22750K69615
$$ 34671 -24110 172431 495531 521980 268711 165703 -52358 -436430 -559180 -289565
24684b89565p7686Q6457j65172l7599M667J28597L1352K9164k37304K18180K98079
$$ -289565 -367251 -280794 -445966 -483565 -478898 -350301 -318949 -289785 -527089 -308909 -10830
24673a0830Q0226M3138n3919j58341l662N4628L4805L9607k49400J08933K18093
$$ -10830 69396 112534 58615 -99726 -103388 -48760 -13955 25652 -223748 -114815 103278
24662A03278k1195l66917J19995L01495J50571J38908j38331l12662k99052q6203
$$ 103278 82083 -284834 -164839 136656 287227 426135 287804 -24858 -323910 -410113
24652d10113M12468J29706J01382M3940j14206j82885m5212K157j46039k33406
$$ -410113 2355 132061 233443 277383 163177 -19708 -64920 -62763 -208802 -442208
24642d42208j83918j46393J54497M8368M2562P496J98177J59085l5077Q0263J59149
$$ -442208 -626126 -772519 -618022 -569654 -527092 -519596 -321419 -162334 -197411 -117148 42001
24631D2001R3602l2059L9655N9144m5010l64953j00590R8042J3423r8912M1047
$$ 42001 135603 103544 143199 202343 157333 -207620 -308210 -210168 -196745 -295657 -254610
24620b54610J83293J01359j76662N8696j29966k31475j147O2909J27232J82263
$$ -254610 -71317 30042 -146620 -87924 -217890 -449365 -450512 -387603 -260371 -78108
24610g8108J12527J17686j93168j2281j9233J34274k7227k22613k34677r4390
$$ -78108 34419 152105 -41063 -53344 -72577 61697 34470 -188143 -422820 -517210
24600e17210K13547J42381M0158m6684K2341J30329o0080P3374j56764L9806K54023
$$ -517210 -303663 -161282 -121124 -167808 -145467 -15138 -75218 -1844 -158608 -118802 135221
24589A35221J65642k7974j33258p6349K2416J79686P411j27239j50621L6095p0765
$$ 135221 300863 272889 139631 63282 85698 265384 272795 145556 -5065 31030 -39735
24578c9735L5750J79672n6196j18319l5368j09082o2129j72676o7866O3446J60559
$$ -39735 -3985 175687 119491 1172 -34196 -143278 -205407 -378083 -445949 -382503 -221944
24567b21944m028J23428L20468P0113j49105l6194m6990k08428O1743K43337o2659
$$ -221944 -225972 -102544 217924 288037 138932 102738 55748 -152680 -90937 152400 89741
24556H9741N4443j16931j02758r2019j00103P977J48644Q3503m0545j17671o3216
$$ 89741 144184 27253 -75505 -167524 -267627 -259650 -111006 -27503 -68048 -185719 -248935
24545b48935j54445j674p8385L7869o2427l0680J69121J45779J48671o7886k0330
$$ -248935 -403380 -405054 -483439 -445570 -507997 -538677 -369556 -223777 -75106 -142992 -163322
24534a63322K14235n6666l28319L6464L88245j8385j34159j91063k2239K29248
$$ -163322 50913 -5753 -334072 -297608 90637 72252 -61907 -252970 -275209 -45961
24524d5961j75865o5610J7458j60319K56279L24993q2439O0836J85355j49217
$$ -45961 -221826 -287436 -269978 -430297 -174018 150975 68536 129372 314727 165510
24514A65510j00080l0193J10304J85338K05614P0204j99751l15566k34854k41116
$$ 165510 65430 35237 145541 330879 536493 606697 406946 91380 -143474 -384590
24504c84590J4828k13084k1544K60840L6868o5328k5279R5340Q3367J20796p8644
$$ -384590 -369762 -582846 -604390 -343550 -306682 -372010 -397289 -301949 -218582 -97786 -176430
24493a76430l38691j01317K02256K34268n326m0353J89507O2105j58312q232p8882
$$ -176430 -515121 -616438 -414182 -179914 -185240 -225593 -36086 26019 -132293 -140525 -219407
24482b19407k38442K09140J42604j84367n1871j1013p9211p9433j5618J50087
$$ -219407 -457849 -248709 -106105 -290472 -342343 -353356 -432567 -512000 -527618 -377531
24472c77531m7443P9738K45850n3061n6483k4672K08289m2550j60400M2279n5201
$$ -377531 -424974 -345236 -99386 -152447 -208930 -233602 -25313 -67863 -228263 -185984 -241185
24461b41185M8711J03945N1328M7195j1656k5514O219j2123j6056k2830q9136
$$ -241185 -192474 -88529 -37201 9994 -1662 -27176 -20957 -33080 -49136 -71966 -161102
24450a61102k89217j13648K08587P7978K88107L09877R1593r3755n9689j43636
$$ -161102 -450319 -563967 -355380 -277402 10705 320582 412175 318420 258731 115095
24440A15095r9763m1672o9802o7206L4137k84825r0018n4433K7241J15298M0889
$$ 115095 15332 -26340 -96142 -163348 -129211 -414036 -504054 -558487 -531246 -415948 -375059
24429c75059L6165K05412o2001q8358l5716K276J4912n0852J3584k7648q0701
$$ -375059 -338894 -133482 -195483 -283841 -319557 -317281 -302369 -353221 -339637 -367285 -447986
24418d47986J59793q443j11175N8898P6316j92718L9509K03512K4738J272m3659
$$ -447986 -288193 -296636 -407811 -348913 -272597 -465315 -425806 -222294 -197556 -196284 -239943
24407b39943K05007P4903j29956k78936J5024k0083J30188O863P2428J57361j02589
$$ -239943 -34936 39967 -89989 -368925 -353901 -373984 -243796 -236933 -164505 -7144 -109733
24396a09733k11807o2581L45267J38022k36214J2527M9689n6488K11921j02229
$$ -109733 -321540 -384121 -38854 99168 -137046 -124519 -74830 -131318 80603 -21626
24386b1626j64421j04964j33873O2600J01663K33072J06021k8337O1290j93353
$$ -21626 -186047 -291011 -424884 -362284 -260621 -27549 78472 50135 111425 -81928
24376h1928j34883P2311j63626j38200j9024J21936q7059o3432m7905K01697K23609
$$ -81928 -216811 -144500 -308126 -446326 -465350 -343414 -430473 -493905 -541810 -340113 -116504
24365a16504j38049l568m2050P5399J55130J47386j37485j86226n8315j13701
$$ -116504 -254553 -258121 -300171 -224772 -69642 77744 -59741 -245967 -304282 -417983
24355d17983r959K4969R0408K21916q8446J4763k50876j85976J71226K93311K19448
$$ -417983 -427942 -402973 -312565 -90649 -179095 -164332 -415208 -601184 -429958 -136647 82801
24344H2801j86438j07265K02674J20530j00735k65344J38757M2172p7266n0176
$$ 82801 -103637 -210902 -8228 112302 11567 -253777 -115020 -72848 -150114 -200290
24334b00290q398m3423r4527J65464K33575R8146l15884k07826L4388M50058P6983
$$ -200290 -208688 -252111 -346638 -181174 52401 150547 -165337 -373163 -338775 111283 188266
24323A88266k07956k5089M3238J50003k1645k60496j3811K7758k40859j120K66981
$$ 188266 -19690 -44779 -1541 148462 126817 -133679 -147490 -119732 -360591 -361711 -94730
24312i4730j57R5418J05252K93580j3036P8932k96937j55268K13955J38928l12704
$$ -94730 -94887 531 105783 399363 386327 465259 168322 13054 227009 365937 53233
24301E3233j48147l1182Q9240N2714j54777j80741L0830K32214P6622m0858L4
$$ 53233 -94914 -126096 -36856 15858 -138919 -319660 -288830 -56616 20006 -20852 -20818
24290b0818J34627l15798q0437j49812q5369J72381K75539j3285m7382J03347
$$ -20818 113809 -201989 -282426 -432238 -517607 -345226 -69687 -82972 -130354 -27007
24280b7007J88748o6571j59361K19308j38686j78440L5170O606O4125k37146k10426
$$ -27007 161741 95170 -64191 155117 16431 -162009 -126839 -120233 -56108 -293254 -503680
24269e03680J8680L33011o8534j97371j39681r7632j36412K27928N53314k978
$$ -503680 -485000 -151989 -220523 -417894 -557575 -655207 -791619 -563691 -10377 -13355
24259a3355l05119J07044k76915J45368L29671l3129l20317M1694K57014K3473
$$ -13355 -318474 -211430 -488345 -342977 -13306 -46435 -366752 -325058 -68044 -44571
24249d4571k74472j8499Q4578m6024L7612j09746j51098r7148K21425K30452q4980
$$ -44571 -319043 -337542 -252964 -298988 -261376 -371122 -522220 -619368 -397943 -167491 -252471
24238b52471l17338k1011J43825J15296l0306j16046J01060J98618P4167J55856
$$ -252471 -569809 -590820 -446995 -331699 -362005 -478051 -376991 -178373 -104206 51650
24228E1650q4021o787K24438j75620j1214k41359k76315L1762K89677Q9902k53476
$$ 51650 -32371 -39158 185280 9660 -1554 -242913 -519228 -487466 -197789 -107887 -361363
24217c61363j95587O0379J16965k12341k11441K14802M4303j15107Q6368J31493
$$ -361363 -556950 -496571 -379606 -591947 -803388 -588586 -544283 -659390 -573022 -441529
24207d41529k2919K32478K70258J08288k18006k12624m3775j5972J59196J3966
$$ -441529 -464448 -231970 38288 146576 -71430 -284054 -327829 -343801 -184605 -170639
24197a70639Q6886p6562j09992K25606L02146l879l51187l39425l06188K09769
$$ -170639 -83753 -160315 -270307 -44701 257445 253566 -97621 -437046 -743234 -533465
24187e33465M09497j18882m09971q4592L30213J0958R1019J83470j1766k03452
$$ -533465 -123968 -242850 -652821 -737413 -407200 -396242 -305223 -121753 -133519 -336971
24177c36971j52691L51453L9901K1523K8951P0834j02727p9142q5337m0700O8147
$$ -336971 -489662 -138209 -98308 -76785 -47834 23000 -79727 -158869 -244206 -284906 -216759
24166b16759j12610M7983q2951J43228J92521o3234L08033M9480p8789k23822
$$ -216759 -329369 -281386 -364337 -221109 -28588 -91822 216211 265691 186902 -36920
24156c6920j44404L3130J9165r3955N2573j819j59392J21136J01892j1721J22880
$$ -36920 -181324 -148194 -129029 -222984 -170411 -172230 -331622 -210486 -108594 -120315 2565
24145B565j40137l8731n9854q3271n537R5514R63k4946P4004J88982J8378q502
$$ 2565 -137572 -176303 -236157 -319428 -324965 -229451 -228488 -253434 -179430 9552 27930 19428
24133A9428j06066k31325J44681K17919l62745n7376j15709l1904M5951L3713
$$ 19428 -86638 -317963 -173282 44637 -318108 -375484 -491193 -523097 -477146 -443433
24123d43433J32770J2317l3126m9195M7961K06537k8711j63452L50858n476j38940
$$ -443433 -310663 -298346 -331472 -380667 -332706 -126169 -154880 -318332 32526 27050 -111890
24112a11890m9087p0612l2442j30945n6469O4373J72501k9555m899L8605M34211
$$ -111890 -160977 -231589 -264031 -394976 -451445 -387072 -214571 -244126 -249025 -210420 223791
24101B23791m3139m35370m1196L1288j21655n0800P8919k52591Q5937J76303J23540
$$ 223791 180652 -254718 -295914 -264626 -386281 -437081 -358162 -610753 -524816 -348513 -224973
24090b24973m1720j00175J96920J03356K609J29308J20099r9550r7231R7781J17927
$$ -224973 -266693 -366868 -169948 -66592 -63983 65325 185424 85874 -11357 86424 204351
24079B04351k29391q9145N0964J19006J6954r3700k57499j19622R0010J03988
$$ 204351 -25040 -114185 -63221 55785 72739 -20961 -278460 -398082 -308072 -204084
24069b04084j13685J6879N3221j53790o8517M6631J76015K00377M8344J16200
$$ -204084 -317769 -300890 -247669 -401459 -469976 -423345 -247330 -46953 1391 117591
24059A17591O6619k38659j8709K6250j35552l0441L2113j2597l3068o612K5651
$$ 117591 184210 -54449 -73158 -46908 -182460 -212901 -180788 -193385 -226453 -233065 -207414
24048b07414l0549k13522q6269K11912K69727n6543n7790P099j24464L8256J79775
$$ -207414 -237963 -451485 -537754 -325842 -56115 -112658 -170448 -163349 -287813 -249557 -69782
24037f9782j52925j06089k22485k3114L23575j0858k02224j32988K07946K76346
$$ -69782 -222707 -328796 -551281 -574395 -250820 -261678 -463902 -596890 -388944 -112598
24027a12598N3407O362O9441m5007M6754j14394j31115J69310J55115j00749L9019
$$ -112598 -59191 -52829 16612 -28395 18359 -96035 -227150 -57840 97275 -3474 35545
24016C5545k97378j43290Q1050J39978M6693J09043j33649j58320N3144n8427
$$ 35545 -261833 -405123 -324073 -184095 -137402 -28359 -162008 -320328 -267184 -325611
24006c25611k0250o0898K2406J46032k4644K28538L14836j52929m16263k94791
$$ -325611 -345861 -406759 -384353 -238321 -262965 -34427 280409 127480 -288783 -583574
23996e83574K12614M26550J22452p4642n743j39719P30L9841K34588m7591k5720
$$ -583574 -370960 55590 178042 103400 97657 -42062 -41332 -1491 233097 185506 159786
23985A59786j99408Q8645J34658K31902M412j29477j0l8469k36848l73328j88853
$$ 159786 -39622 49023 183681 415583 419995 290518 290508 252039 15191 -358137 -546990
23974e46990P345L27614O0417j11824k36486Q98K62693q4649j09577J19974O4970
$$ -546990 -539645 -212031 -151614 -263438 -499924 -499026 -236333 -320982 -430559 -310585 -245615
23963b45615k7165j9429K7800P9446j36195l50653p9084K55275J56711m9881R0951
$$ -245615 -272780 -292209 -264409 -184963 -321158 -671811 -750895 -495620 -338909 -388790 -297839
23952b97839q3332m3056J82883J81991L31169K788j72921J3614q254k04013K3733
$$ -297839 -381171 -424227 -241344 -59353 271816 274604 101683 115297 107043 -96970 -73237
23941g3237j35943r0570K25927P2170j9722m2263K0805J37144l6239l45601O8384
$$ -73237 -209180 -299750 -73823 -1653 -21375 -63638 -42833 94311 58072 -287529 -219145
23930b19145J50064k1598p5631M6177J08811j13275p8953j02463j90656R5223
$$ -219145 -69081 -90679 -166310 -120133 -11322 -124597 -203550 -306013 -496669 -401446
23920d01446K08395r1778j35389m9085K44241K10076J09464L03950j65330m38271
$$ -401446 -193051 -284829 -420218 -469303 -225062 -14986 94478 398428 233098 -205173
23910b05173n3201q5123K19627K69477L2456l64099j63000J5579j48429j2907
$$ -205173 -258374 -343497 -123870 145607 178063 -186036 -349036 -333457 -481886 -494793
23900d94793q7889p2532M21500L04864J341k25761J0938K83171o0185o2838N1379
$$ -494793 -582682 -655214 -233714 71150 72491 -153270 -142332 140839 80654 17816 69195
23889F9195R2751L5524j32884k23711j06443l7817P7157j41561j1367l0894K2638
$$ 69195 161946 197470 64586 -159125 -265568 -303385 -226228 -367789 -379156 -410050 -387412
23878c87412P1263j98587o3003J038Q0131L9516K83683Q7702J13945k67279l68659
$$ -387412 -316149 -514736 -577739 -576701 -496570 -457054 -173371 -85669 28276 -239003 -607662
23867f07662J08924J93455k49572l30172r3566Q6011K39033L78663J99852m3576
$$ -607662 -498738 -305283 -554855 -885027 -978593 -892582 -653549 -274886 -75034 -118610
23857a18610J79780O4703p6917L9422p5292l246M7190l1036k37527j17646j13199
$$ -118610 61170 125873 48956 88378 13086 9840 57030 25994 -211533 -329179 -442378
23846d42378M3425j86209p11J64310L799L2736L7565l5656L9873K7327k3414O9956
$$ -442378 -398953 -585162 -585873 -421563 -417764 -385028 -347463 -383119 -343246 -315919 -339333 -269377
23834b69377R3367J76450p5070j410K46795j18819q756j04277k0097M2819k15663
$$ -269377 -176010 440 -74630 -76040 170755 51936 43180 -61097 -81194 -38375 -254038
23823b54038k31544J44295r4212J3257j53387j29942K56139K21983l7336J0587
$$ -254038 -485582 -341287 -435499 -422242 -575629 -705571 -449432 -227449 -264785 -254198
23813b54198j24841P5673m808k02790K9114R4722r1900N3744k8868k18248J79831
$$ -254198 -379039 -303366 -308174 -510964 -481850 -387128 -479028 -425284 -454152 -672400 -492569
23802d92569L04539j15304P9606l0359j50147j32579o4779K5510J80700K50257
$$ -492569 -188030 -303334 -223728 -254087 -404234 -536813 -601592 -576082 -395382 -145125
23792a45125q5209k62899j3747K23020j61396j81973m5702J51576k0140L9195
$$ -145125 -230334 -493233 -506980 -283960 -445356 -627329 -673031 -521455 -541595 -502400
23782e02400J60426J67966J28102J00839p123j98632k03900j1237J9494J69662
$$ -502400 -341974 -174008 -45906 54933 47810 -150822 -354722 -365959 -346465 -176803
23772a76803k2101j06276L9818K04146O795l56553k34326J89354J34159J60005
$$ -176803 -198904 -305180 -265362 -61216 -54421 -410974 -645300 -455946 -321787 -161782
23762a61782L66024Q9795j11083l62857L130j50474O8928L2573J43646K18066
$$ -161782 204242 294037 182954 -179903 -176773 -327247 -258319 -225746 -82100 135966
23752A35966J5756j35607m3057j07197K75596O8161J8745j42644P435k72413k12838
$$ 135966 151722 16115 -26942 -134139 141457 209618 228363 85719 93154 -179259 -392097
23741c92097J50055J90321J7474J52847K34142J641k38688m1571R7188j40994
$$ -392097 -242042 -51721 -34247 118600 352742 354383 115695 74124 171312 30318
23731C0318n5263q8272J10986J02248l9731j7966M9652j08070k70700j9410J87355
$$ 30318 -24945 -113217 -2231 100017 60286 42320 91972 -16098 -286798 -306208 -118853
23720a18853J44663j71599j64113j35284j20571m1251j07717O0065J65230J19491
$$ -118853 25810 -145789 -309902 -445186 -565757 -607008 -714725 -654660 -489430 -369939
23710c69939M6952J29308j03273J13489N357q1272K30218o317j90983P5028p4055
$$ -369939 -322987 -193679 -296952 -183463 -178106 -259378 -29160 -35477 -226460 -151432 -225487
23699b25487O7832R1276r8193j21724j0706P972J81347M3403L1205J60863j53927
$$ -225487 -157655 -66379 -164572 -286296 -297002 -289030 -107683 -64280 -33075 127788 -26139
23688b6139j99449L02036J02454m7918m11111O905N7083o0508J2009N3834O3415
$$ -26139 -225588 76448 178902 130984 -280127 -273222 -216139 -276647 -264638 -210804 -147389
23677a47389p7218O8562K19304M9809j93871k06964o4240n5271n0345O4749Q7390
$$ -147389 -224607 -156045 63259 113068 -80803 -287767 -352007 -407278 -457623 -392874 -305484
23666c05484R4140K14891r10k25739M5071J61949l6178L57208L51432j61357j16644
$$ -305484 -211344 3547 2637 -223102 -178031 -16082 -52260 304948 656380 495023 378379
23655C78379k00844l05794l82311j96480R5360K44925K79744j71274M4881o6823
$$ 378379 177535 -128259 -510570 -707050 -611690 -366765 -87021 -258295 -213414 -280237
23645b80237J15542P0371k28364j80773n5551N869K4888K09521J5697K6326J2065
$$ -280237 -164695 -94324 -322688 -503461 -559012 -553143 -528255 -318734 -303037 -276711 -264646
23634b64646K22647j99248J611M9283O5227K6079J42088L948r5899j49357m5898
$$ -264646 -41999 -241247 -239636 -190353 -125126 -99047 43041 46989 -48910 -198267 -244165
23623b44165j53284r0710R3285P4596m6116J66819J73569k523J25083o8558n796
$$ -244165 -397449 -488159 -394874 -320278 -366394 -199575 -26006 -28529 96554 27996 22200
23612B2200K85806l6380K14898j04128k26080k43314k18550n8471J23840J40579
$$ 22200 308006 271626 486524 382396 156316 -86998 -305548 -364019 -240179 -99600
23602i9600l7068o0570j0289n1283q7359O6909j94618j42282J01784L32286L8611
$$ -99600 -136668 -197238 -207527 -258810 -346169 -279260 -473878 -616160 -514376 -182090 -143479
23591a43479J98081j25759r5165j28675p2155Q1885J67967J33522J88626l130
$$ -143479 54602 -71157 -166322 -294997 -367152 -285267 -117300 16222 204848 201718
23581B01718k65139j86548J38181J28973j22512R5281j49584j98672j10755J00678
$$ 201718 -63421 -249969 -111788 17185 -105327 -10046 -159630 -358302 -469057 -368379
23571c68379K27596J11928P6308Q240O5638L2484j08895J0299k2291k03630j2492
$$ -368379 -140783 -28855 47453 55693 121331 153815 44920 55219 32928 -170702 -183194
23560a83194r2647n2171K33619p0975j00293r3651R6469r282J22450M3979q658
$$ -183194 -275841 -328012 -94393 -165368 -265661 -359312 -262843 -272125 -149675 -105696 -114354
23549a14354j83000r2849q1966l5276P7252L6636P3467J52632K9539r9433N4835
$$ -114354 -297354 -390203 -472169 -507445 -430193 -393557 -320090 -167458 -137919 -237352 -182517
23538a82517L9793p046j09458o3550P046M6944K24251N4165j97037J30423q8016
$$ -182517 -142724 -149770 -259228 -322778 -315732 -268788 -44537 9628 -187409 -56986 -145002
23527a45002p3486J26717L267j30757j17500r0842j08909O7222L64223j52953
$$ -145002 -218488 -91771 -88504 -219261 -336761 -427603 -536512 -469290 -105067 -258020
23517b58020q7597l6542J02744J3819J6222j58011k08029K44382O4766J07689
$$ -258020 -345617 -382159 -279415 -265596 -249374 -407385 -615414 -371032 -306266 -198577
23507a98577l2456p044j9029J97872J02211N2171k91470n9758K09230N4244k721
$$ -198577 -231033 -238077 -257106 -59234 42977 95148 -196322 -256080 -46850 7394 4673
23496D673o0005J38224J70218L6554o3717j10588j16114j94744m5246r6867k51335
$$ 4673 -55332 82892 253110 289664 225947 115359 -755 -195499 -240745 -337612 -588947
23485e88947K9392Q3583j69447K9659M23363L57949p1844j69832n4682j15938
$$ -588947 -559555 -475972 -645419 -615760 -192397 165552 93708 -76124 -130806 -246744
23475b46744j36836j02806l99785L9530M45418j40344k9326J45992j09510J19145
$$ -246744 -383580 -486386 -886171 -846641 -401223 -541567 -570893 -424901 -534411 -415266
23465d15266K0615J17923L2291k0672J0982j12674J66367K00681l12167j38904
$$ -415266 -394651 -276728 -244437 -265109 -254127 -366801 -200434 247 -311920 -450824
23455d50824j8627L63660j34750o2143j79279N4802L81230K49259l8090k98409
$$ -450824 -469451 -105791 -240541 -302684 -481963 -427161 -45931 203328 165238 -133171
23445a33171K6352j05404j78538J02190p993j71266p7462m6315k7327o9247M1335
$$ -133171 -106819 -212223 -390761 -288571 -296564 -467830 -545292 -591607 -618934 -688181 -646846
23434f46846p488J09167J38230m5705q1183J01J04632L1412j99120J32587J85142
$$ -646846 -654334 -545167 -406937 -452642 -533825 -533724 -429092 -397680 -596800 -464213 -279071
23423b79071J5937J72254O9806k41627j97229K09099L8445R1062R1984M8790l19313
$$ -279071 -263134 -90880 -21074 -262701 -459930 -250831 -212386 -121324 -29340 19450 -299863
23412b99863L2716L0905j91411J44867n492k53091j09736J78595K96264Q0104
$$ -299863 -267147 -236242 -427653 -282786 -288278 -541369 -651105 -472510 -176246 -96142
23402i6142o0037L2071j6503o242K1386o0658j0046K92076L10264j9093j66034
$$ -96142 -156179 -124108 -140611 -146853 -125467 -186125 -196171 95905 406169 387076 221042
23391B21042k5063n5779j14599r1313j22251N813Q7286j1965p7072K4422J44677
$$ 221042 195979 140200 25601 -65712 -187963 -182150 -94864 -106829 -183901 -159479 -14802
23380a4802p8699j39133J72621K7458J51330K00622J47949k05467j54695j27280
$$ -14802 -93501 -232634 -60013 -32555 118775 319397 467346 261879 107184 -20096
23370b0096l9660J72212k35037r7489P8086J11278j30352j32313K8171r602k45425
$$ -20096 -59756 112456 -122581 -220070 -141984 -30706 -161058 -293371 -265200 -274802 -520227
23359e20227j2117n6110J52572M05838J4795n491j65674j65512O1336J00709k360
$$ -520227 -532344 -588454 -435882 -30044 -15249 -20740 -186414 -351926 -290590 -189881 -192241
23348a92241L3288N2205M7488p3840p0531j31506P5561n8188J38114l8228j45974
$$ -192241 -158953 -106748 -59260 -133100 -203631 -335137 -259576 -317764 -179650 -217878 -363852
23337c63852n0775N5662o2667L9873M65701K71838k46645j62090O8261m9729j77525
$$ -363852 -414627 -358965 -421632 -381759 83942 355780 109135 -52955 15306 -34423 -211948
23326b11948P9855k57752j89489J51650J22809J44532n4359j44106R7206J78213
$$ -211948 -132093 -389845 -579334 -427684 -304875 -160343 -214702 -358808 -261602 -83389
23316h3389J75633J69642k58940k49820q4779M7232J65982k05555l32259J81058
$$ -83389 92244 261886 2946 -246874 -331653 -284421 -118439 -323994 -656253 -475195
23306d75195K18859K4460J38687L6073l03517p5975N8990K54653K09513k1069
$$ -475195 -256336 -231876 -93189 -57116 -360633 -436608 -377618 -122965 86548 65479
23296F5479J95995n6675J45375j3002k11219j24l23544j29015N5424r9530K10991
$$ 65479 261474 204799 350174 337172 125953 125829 -197715 -326730 -271306 -370836 -159845
23285a59845J45689r0352j89603j15509L0861L4337J46470l72876m9648o0291
$$ -159845 -14156 -104508 -294111 -409620 -378759 -344422 -197952 -570828 -620476 -680767
23275f80767j1456k9024o4870J56123J37251J8203l2942K82898O4889q2008K7615
$$ -680767 -692223 -721247 -786117 -629994 -492743 -474540 -507482 -224584 -159695 -241703 -214088
23264b14088N432m5077k22422p8415J92020L45649N8007j19391J389k3302J79637
$$ -214088 -208656 -253733 -476155 -554570 -362550 -16901 41106 -78285 -76896 -100198 79439
23253G9439K14718j35174j22449n4857J13811k86968J19644k0582J37682M9869
$$ 79439 294157 158983 36534 -18323 95488 -191480 -71836 -92418 45264 95133
23243I5133k29041l8295m0339j66375j0272M9563L13099j76280m20797K3695J16592
$$ 95133 -133908 -172203 -212542 -378917 -389189 -339626 -26527 -202807 -623604 -599909 -483317
23232d83317J79170J46593l508M1932O5959J4718l5947J69251N8773J89767J03014
$$ -483317 -304147 -157554 -161062 -119130 -53171 -38453 -74400 94851 153624 343391 446405
23221D46405k46524k80329j34026P1398k52545J45960J00910K497j3023j784j32380
$$ 446405 199881 -80448 -214474 -143076 -395621 -249661 -148751 -146254 -159277 -161061 -293441
23210b93441q5393p9005j27370L6993J92077k22060K05126n2722N7939m2544r678
$$ -293441 -378834 -457839 -585209 -548216 -356139 -578199 -373073 -425795 -367856 -410400 -420078
23199d20078n486j62128j58829J8796L05951P7775j02992P5956J30928J26562
$$ -420078 -425564 -587692 -746521 -727725 -421774 -343999 -446991 -371035 -240107 -113545
23189a13545J93368J65417M7650o5036j31648l24624j09663J58736k90247p976
$$ -113545 79823 245240 292890 227854 96206 -228418 -338081 -179345 -469592 -477568
23179d77568J17957K86477L22794k80870k99406n826J33514K40562j81091k84895
$$ -477568 -359611 -73134 249660 -31210 -330616 -336442 -202928 37634 -143457 -428352
23169d28352l41295M5057O612p4346R4080K09690O3683J30554J41365N8279m04
$$ -428352 -769647 -724590 -717978 -792324 -698244 -488554 -424871 -294317 -152952 -94673 -95077
23158i5077o4248j02930j93327K18027J71689j54852Q9477J06382J15899k38427
$$ -95077 -159325 -262255 -455582 -237555 -65866 -220718 -131241 -24859 91040 -147387
23148a47387j85728r0649J22982K47669K29107j48022j24351p5357J87671J30745
$$ -147387 -333115 -423764 -300782 -53113 175994 27972 -96379 -171736 15935 146680
23138A46680k33468k94579p3504J71220J41425K3700L0061j00661j501k0623l3350
$$ 146680 -86788 -381367 -454871 -283651 -142226 -118526 -88465 -189126 -190627 -211250 -244600
23127b44600Q9843m2768j43163j25477j7874J46567Q6282J48591J62433p9722
$$ -244600 -154757 -197525 -340688 -466165 -484039 -337472 -251190 -102599 59834 -19888
23117a9888r0099R1006l9489j42383j93150J80663J95548J02156J823j28573j77437
$$ -19888 -109987 -18981 -58470 -200853 -394003 -213340 -17792 84364 86187 -42386 -219823
23106b19823q0412k5443J35935L9567K8072Q7644k05053L0079J20277q5752k30377
$$ -219823 -300235 -325678 -189743 -150176 -122104 -34460 -239513 -209434 -89157 -174909 -405286
23095d05286J3580J09492K8023k8991j62501k93612J55927K78637j0251k5945
$$ -405286 -391706 -282214 -254191 -283182 -445683 -739295 -583368 -304731 -314982 -340927
23085c40927o0000J47004J1895P6305j0296j25810j5421k42575N4059M2308J22338
$$ -340927 -400927 -253923 -242028 -165723 -176019 -301829 -317250 -559825 -505766 -463458 -341120
23074c41120k2042j37540r7376J47384N9988j79218L08957K17335p70P287J41971
$$ -341120 -363162 -500702 -598078 -450694 -390706 -569924 -260967 -43632 -44402 -37115 104856
23063A04856M898n7082n8517r3869J95412K14192k16721j59660j18251j93215
$$ 104856 109754 52672 -5845 -99714 95698 309890 93169 -66491 -184742 -377957
23053c77957l6762R7768m3710M1612K01503K17114N0640J38987k14849N6361k31893
$$ -377957 -414719 -316951 -360661 -319049 -117546 99568 150208 289195 74346 130707 -101186
23042a01186k44516k26453N9463J93401K21491K183m9774n016l3528k29935j3796
$$ -101186 -345702 -572155 -512692 -319291 -97800 -95617 -145391 -150407 -183935 -413870 -427666
23031d27666J71259K89120O564J55443l8332l19619j56380k41998K6612K34186
$$ -427666 -256407 32713 39277 194720 156388 -163231 -319611 -561609 -534997 -300811
23021c00811K0555j79674L2181r8192K9205J83624N754Q0822J14204j86181n5609
$$ -300811 -280256 -459930 -427749 -525941 -496736 -313112 -307358 -226536 -112332 -298513 -354122
23010c54122J29603Q6462K49607K82416J43942j10827l56602m2840k14958j9503
$$ -354122 -224519 -138057 111550 393966 537908 427081 70479 27639 -187319 -206822
23000b06822J03782J83854J9799l16890j83458J42155J45545j04192J57919j69896
$$ -206822 -103040 80814 100613 -216277 -399735 -257580 -112035 -216227 -58308 -228204
22990b28204n3098m1111J06361m872q9300r4919m8495K38091K91326M820n7648
$$ -228204 -281302 -322413 -216052 -220924 -310224 -405143 -453638 -215547 75779 80599 22951
22979B2951k8056q3764j49794R2205R6567o4231L5715r605J35853j58665k46866
$$ 22951 -5105 -88869 -238663 -146458 -49891 -114122 -78407 -88012 47841 -110824 -357690
22968c57690R793R0197L06613J55453j88826l51359l8924P9635p3197Q8744O9804
$$ -357690 -347897 -257700 48913 204366 15540 -335819 -374743 -295108 -368305 -279561 -209757
22957b09757J66661K93860r10j61609j22306o7857J8329j16853j15222p6927j35109
$$ -209757 -43096 250764 249854 88245 -34061 -101918 -83589 -200442 -315664 -392591 -527700
22946e27700J47514L53993K67728N5208k27325l96265j61739j546J13942q3838
$$ -527700 -380186 -26193 241535 296743 69418 -326847 -488586 -490132 -376190 -460028
22936d60028m2940K03846l6382m3063l7121k0489J82899K0203r2443L1880J95828
$$ -460028 -502968 -299122 -335504 -378567 -415688 -436177 -253278 -233075 -325518 -293638 -97810
22925i7810m3730j52662N5078k24085J10574K7506m7668j57825J03745J53049
$$ -97810 -141540 -294202 -239124 -463209 -352635 -325129 -372797 -530622 -426877 -273828
22915b73828J64064O9790j28729r4044j23624K5845j21231j09680J53554J47581
$$ -273828 -109764 -39974 -168703 -262747 -386371 -360526 -481757 -591437 -437883 -290302
22905b90302J26670L34868O4096j7046m73996j57728q8654J10595k6205k17534
$$ -290302 -163632 171236 235332 218286 -255710 -413438 -502092 -391497 -417702 -635236
22895f35236L02137L02092j25087j7965P2149J3718J81262k33702k08462K3885
$$ -635236 -333099 -31007 -156094 -174059 -101910 -88192 93070 -140632 -349094 -325209
22885c25209K86448J41373k7430j83958J943p4843j30946O283P3992l9660J3441
$$ -325209 -38761 102612 75182 -108776 -106833 -181676 -312622 -306339 -232347 -272007 -258566
22874b58566m5473k36519K25254J55996K73272J21809j22021o3562j06097p5385
$$ -258566 -304039 -540558 -315304 -159308 113964 235773 113752 50190 -55907 -131292
22864a31292k55565j93345J06539R3866J03298O7384q2918j13277L5524J51297
$$ -131292 -386857 -580202 -473663 -379797 -276499 -209115 -292033 -405310 -369786 -218489
22854b18489j75259l57763Q5475K01869J16854J78041J34682Q6455J9069l53676
$$ -218489 -393748 -751511 -666036 -464167 -347313 -169272 -34590 51865 70934 -282742
22844b82742J02408Q3442j28726j07643l9655m7222K44947p9185L8816q517j32642
$$ -282742 -180334 -96892 -225618 -333261 -372916 -420138 -175191 -254376 -215560 -224077 -356719
22833c56719j53152J58583k00929Q4793J54003J07471J22424k47838J35733l1585
$$ -356719 -509871 -351288 -552217 -467424 -313421 -205950 -83526 -331364 -195631 -227216
22823b27216o4898J30740J83891j09782k28370J4387l7658j18016M9714L76455
$$ -227216 -292114 -161374 22517 -87265 -315635 -301248 -338906 -456922 -407208 -30753
22813c0753J73794j24905j44013N1989j30257m5478K91402J39427k50135j19431
$$ -30753 143041 18136 -125877 -73888 -204145 -249623 41779 181206 -68929 -188360
22803a88360j31089J12451q9550M9686J05873O9611n3618K8494J29167J3538j87619
$$ -188360 -319449 -206998 -296548 -246862 -140989 -71378 -124996 -96502 32665 46203 -141416
22792a41416R8931J22716K25450R0630j05161k80172k35250o4790O3780J09767
$$ -141416 -42485 80231 305681 396311 291150 10978 -224272 -289062 -225282 -115515
22782a15515L2726l7604j97858R0021N8880P5171M972m2116P5062N278k12489
$$ -115515 -82789 -120393 -318251 -228230 -169350 -94179 -89207 -131323 -56261 -50983 -263472
22771b63472p4091j12737j7367J16268J25295k14383k35702K05246J94675n2696
$$ -263472 -337563 -450300 -467667 -351399 -226104 -440487 -676189 -470943 -276268 -328964
22761c28964n583L04423J49303M531k64722j15439J68994P7507j14904P280P6445
$$ -328964 -334547 -30124 119179 123710 -141012 -256451 -87457 -9950 -124854 -117574 -41129
22750d1129P9708k5994K2171k98388j86890J55371P3749k3713n7464J4531O1774
$$ -41129 38579 12585 34756 -263632 -450522 -295151 -221402 -245115 -302579 -288048 -226274
22739b26274R3258m77M589r0546Q753K02198J90062j22221m5830j68457j94199
$$ -226274 -133016 -133493 -128904 -219450 -210697 -8499 181563 59342 13512 -154945 -349144
22728c49144m460k27731K8074J65116K59282J02261k73972l1418J43588K9991
$$ -349144 -353604 -581335 -553261 -388145 -128863 -26602 -300574 -331992 -188404 -158413
22718a58413P8936K28994N4601j7328j24726p229J323k84311l1891N2518J23255
$$ -158413 -79477 149517 204118 186790 62064 54835 56158 -228153 -260044 -207526 -84271
22707h4271J18183l8784K548Q269r0767q9431n1366J03911J70510k4101J3396
$$ -84271 33912 -4872 -2324 5945 -84822 -174253 -225619 -121708 48802 24701 38097
22696C8097J26663j94166l4719O2193P7212j7175j48878q3325L1541o4938k03399
$$ 38097 164760 -29406 -64125 -1932 75280 58105 -90773 -174098 -142557 -207495 -410894
22685d10894J03598L36194J9922R4415J91631j50402k24630K7031o8856j01426
$$ -410894 -307296 28898 48820 143235 334866 184464 -40166 -13135 -81991 -183417
22675a83417j44454r6914P3253j9764K9153P6985J26359l8168R9817r8412K11962
$$ -183417 -327871 -424785 -351532 -371296 -342143 -265158 -138799 -176967 -77150 -175562 36400
22664C6400o1454J16848J23376p7582K854j6244j16012k73308j56256k0633n1251
$$ 36400 -25054 91794 215170 137588 140442 124198 8186 -265122 -421378 -442011 -493262
22653d93262J42063j03167J14362J74557j1255J40992K21835n2546r7002j76323
$$ -493262 -351199 -454366 -340004 -165447 -176702 -35710 186125 133579 36577 -139746
22643a39746o007N4846j23220j16293p5548n6944L09009J91929K7998j92696J4996
$$ -139746 -145753 -90907 -214127 -330420 -405968 -462912 -153903 38026 66024 -126672 -111676
22632a11676J60012j34660l90043N0261j78472j41011L12547K57980J84519j5590
$$ -111676 48336 -86324 -476367 -426106 -604578 -745589 -433042 -175062 9457 -6133
22622f133O2045j47057j49571O3186K49815j34936k93317l9225J45377K9671p7735
$$ -6133 55912 -91145 -240716 -177530 72285 -62651 -355968 -395193 -249816 -220145 -297880
22611b97880L6216l3478j67333m8578K32296K64310K37130p4356m14213l73458
$$ -297880 -261664 -295142 -462475 -511053 -278757 -14447 222683 148327 -265886 -639344
22601f39344K94704N06458J34275j32133k18863k69567J07912j36055L9104J22125
$$ -639344 -344640 161818 296093 163960 -54903 -324470 -216558 -352613 -313509 -191384
22591a91384k60699j1529J47279J21740O4751O0088k22600j62696j71125J61204
$$ -191384 -452083 -463612 -316333 -194593 -129842 -69754 -292354 -455050 -626175 -464971
22581d64971J94514l42452j5373J92483J98209l5321N6594K24990K06486j55174
$$ -464971 -270457 -612909 -628282 -435799 -237590 -272911 -216317 8673 215159 59985
22571E9985k74835m08132R4663J97164J67014j0207j17628j41916N436J47884
$$ 59985 -214850 -622982 -528319 -331155 -164141 -174348 -291976 -433892 -428456 -280572
22561b80572n4405n9838q7022J87878K24978n1785r6730j35732J41864J67456
$$ -280572 -334977 -394815 -481837 -293959 -68981 -120766 -217496 -353228 -211364 -43908
22551d3908J29680r2546j04234N4857L1022Q457j58445p5541j40135J13789J13654
$$ -43908 85772 -6774 -111008 -56151 -25129 -16672 -175117 -250658 -390793 -277004 -163350
22540a63350M9834K053K9916q6331J64266j56864j29944l2554L068J19245J14498
$$ -163350 -113516 -111463 -81547 -167878 -3612 -160476 -290420 -322974 -319906 -200661 -86163
22529h6163k37598K2532K08422N1269j32539j52368p3362K7840q320r8961N3634
$$ -86163 -323761 -301229 -92807 -41538 -174077 -326445 -399807 -371967 -380287 -479248 -425614
22518d25614J68108J26288m3130j94994R236j00860j77203m1429L40759j7071
$$ -425614 -257506 -131218 -174348 -369342 -360106 -460966 -638169 -679598 -338839 -355910
22508c55910r970L31793M9897J0442l4258k12069J79624j24920J41722r717k75461
$$ -355910 -365880 -34087 15810 26252 -8006 -220075 -40451 -165371 -23649 -33366 -308827
22497c08827p5133j12775j42745R1494Q5171N1360J91541J80083n9841j88474
$$ -308827 -383960 -496735 -639480 -547986 -462815 -411455 -219914 -39831 -99672 -288146
22487b88146J22989J5440q3788k49924j08728J45938J21590K895O3223k27177
$$ -288146 -165157 -149717 -233505 -483429 -592157 -446219 -324629 -321734 -258511 -485688
22477d85688q5091m5613r578J3037J64445J9915L4487Q6901J41435m1972k90195
$$ -485688 -570779 -616392 -625970 -612933 -448488 -428573 -394086 -307185 -165750 -207722 -497917
22466d97917J37523M33852j95337J00533j63724j13741o1326k4381J48197J86397
$$ -497917 -360394 73458 -121879 -21346 -185070 -298811 -360137 -384518 -236321 -49924
22456d9924N404l38833m5702j53053J04716J87662J81252j3281J66634j61561
$$ -49924 -44520 -383353 -429055 -582108 -477392 -289730 -108478 -121759 44875 -116686
22446a16686P6462N200k00419K6481K27430p189o0186j46492j77429l4743N7991
$$ -116686 -40224 -35024 -235443 -208962 18468 11279 -48907 -195399 -372828 -407571 -349580
22435c49580J74239J96089K37333J89664k99249n70551j29265K21383K33727k0373
$$ -349580 -175341 20748 258081 447745 148496 -422055 -551320 -329937 -96210 -116583
22425a16583J35580j02344j00557J59443M693j076j10859k09114q8018k44569
$$ -116583 18997 -83347 -183904 -24461 -19768 -20844 -131703 -340817 -428835 -673404
22415f73404N4487J79324M24649j05715k98888q7271j5660k159J87440J68810
$$ -673404 -618917 -439593 -14944 -120659 -419547 -506818 -522478 -524637 -337197 -168387
22405a68387q8971o979j08846j41810l388J38827K5572j79936O7867L20960N7478
$$ -168387 -257358 -264337 -373183 -514993 -518381 -379554 -353982 -533918 -466051 -145091 -87613
22394h7613k9267Q8039J12348J03449J47771j59611k96629m3333K50283K70828
$$ -87613 -116880 -28841 83507 186956 334727 175116 -121513 -164846 85437 356265
22384C56265j30958j70546N7076l259P4584p3763n9782k1734l1852j58344j15407
$$ 356265 225307 54761 111837 108578 183162 109399 49617 27883 -3969 -162313 -277720
22373b77720L7653K16111M2063j726J1142K212J18061J00352n3010n07874k07814
$$ -277720 -240067 -23956 18107 16381 27523 29735 147796 248148 195138 -312736 -520550
22362e20550J85070K2216L4256k22324q7826K90002J98042q8563l6754j64760
$$ -520550 -335480 -313264 -279008 -501332 -589158 -299156 -101114 -189677 -226431 -391191
22352c91191J84229K20506K55841k8306l32005j01169P1059K7604j01508N5437
$$ -391191 -206962 13544 269385 241079 -90926 -192095 -121036 -93432 -194940 -139503
22342a39503P2560j21555J21739L57180k02071n0500R242j47117J05075J65069
$$ -139503 -66943 -188498 -66759 290421 88350 37850 47092 -100025 5050 170119
22332A70119j08962K3528J44233m4006r6847j53335p6600j2662Q7970j55067n6062
$$ 170119 61157 84685 228918 184912 88065 -65270 -141870 -154532 -66562 -221629 -277691
22321b77691J47653R9075j1843J25476j19840q4158R2463l0810k6121j40453j79125
$$ -277691 -130038 -30963 -42806 82670 -37170 -121328 -28865 -59675 -85796 -226249 -405374
22310d05374K10711R5527M9354m1647N9311j27208K696K52721O0309j68229k00687
$$ -405374 -194663 -99136 -49782 -91429 -32118 -159326 -156630 96091 156400 -11829 -212516
22299b12516K71159K84938q2627k64875j32682k9389K11696P5726Q1363j58337
$$ -212516 58643 343581 260954 -3921 -136603 -165992 45704 121430 202793 44456
22289D4456m8303J20750j55427k5716N0941k53287j33646J7686L01157J95465
$$ 44456 -3847 116903 -38524 -64240 -13299 -266586 -400232 -382546 -81389 114076
22279A14076P8957p5996l5263J98447j99690l46869R7156L5880M1336o6769J10552
$$ 114076 193033 117037 81774 280221 80531 -266338 -169182 -133302 -91966 -158735 -48183
22268d8183J86658j02196l20483n6493J08939p8579J60408r67Q4594J93594J14934
$$ -48183 138475 36279 -284204 -340697 -231758 -310337 -149929 -150896 -66302 127292 242226
22257B42226j34757j02198j01049K15963N7403K40268p2477J24467K43246K9323
$$ 242226 107469 5271 -95778 120185 177588 417856 345379 469846 713092 742415
22247G42415L9220L89034N15638L04567O482l9219k45898j41231k64152k93513
$$ 742415 781635 1170669 1686307 1990874 1997356 1958137 1712239 1571008 1306856 1013343
22237A013343o6280j94515n8891l18603l30879k55928P133J14597K37742P5749
$$ 1013343 947063 752548 693657 375054 44175 -211753 -204620 -90023 147719 223468
22227B23468J07698P866Q9551K0980j69820k80901k95595R8908J52068p3900j51339
$$ 223468 331166 339032 428583 449563 279743 -1158 -296753 -197845 -45777 -119677 -271016
22216b71016j29069L6922P8746R8340J89094R5018J01601j0088r8874k44114k28427
$$ -271016 -400085 -363163 -284417 -186077 3017 98035 199636 189548 90674 -153440 -381867
22205c81867m824J8685r0516K10800J07430J5707j0655k30030j08912J4264q3006
$$ -381867 -386691 -368006 -458522 -247722 -140292 -124585 -135240 -365270 -474182 -459918 -542924
22194e42924K32875K04443k01029J56869K96981O1684r3456K4216L1782L0486
$$ -542924 -310049 -105606 -306635 -149766 147215 208899 115443 139659 171441 201927
22184B01927j73835j15901j77876j14949k18328o6224J43823J66047J89504O5381
$$ 201927 28092 -87809 -265685 -380634 -598962 -665186 -521363 -355316 -165812 -100431
22174a00431q6188J12877J02809M0002l1350k67461Q815o7210J11379j59150R2884
$$ -100431 -186619 -73742 29067 69069 37719 -229742 -220927 -288137 -176758 -335908 -243024
22163b43024M4778J89603J24689P7379o0625m5667P4884p7718J7440k6175O9492
$$ -243024 -198246 -8643 116046 193425 132800 87133 162017 84299 101739 75564 145056
22152A45056J62206j34379j16817Q8751k40031K71679L3869k97483k00032j53414
$$ 145056 307262 172883 56066 144817 -95214 176465 210334 -87149 -287181 -440595
22142d40595J05223L48500j58019l74413J10510P1680k09233K65126J82282j58959
$$ -440595 -335372 13128 -144891 -519304 -408794 -337114 -546347 -281221 -98939 -257898
22132b57898l2711K88802O0955J14269K53757k35588j17245N0785j15232j11376
$$ -257898 -290609 -1807 59148 173417 427174 191586 74341 125126 9894 -101482
22122a01482j18602J2575Q8762j08148N6099m6876n6118J55812J26773J18155
$$ -101482 -220084 -207509 -118747 -226895 -170796 -217672 -273790 -117978 8795 126950
22112A26950j84282j89009N7448J66280J27143j02840k16130q7922Q3507L60509
$$ 126950 -57332 -246341 -188893 -22613 104530 1690 -214440 -302362 -218855 141654
22102A41654n9233k17158l6472j52496m3897P9609J59669J88466O1287k6363j11497
$$ 141654 82421 -134737 -171209 -323705 -367602 -287993 -128324 60142 121429 95066 -16431
22091a6431j74947p1490j58487j0016K60590k9971j37711M3565J14622o9496M9589
$$ -16431 -191378 -262868 -421355 -431371 -170781 -200752 -338463 -294898 -180276 -249772 -200183
22080b00183r8350k58403J15583K45877o3326q4788k07863J66072J27226Q5185
$$ -200183 -298533 -556936 -441353 -195476 -258802 -343590 -551453 -385381 -258155 -172970
22070a72970K00526M5175m5557k97405q2088j18923L8382q401p2176J55273J66847
$$ -172970 27556 72731 27174 -270231 -352319 -471242 -432860 -441261 -513437 -358164 -191317
22059a91317K68422R9738J06920M1487j86375m58625j42644L1912K50193K33236
$$ -191317 77105 176843 283763 325250 138875 -319750 -462394 -430482 -180289 52947
22049E2947j60648k86974l4775j71587j9783L33388J50792K96534J62117o0864
$$ 52947 -107701 -394675 -429450 -601037 -620820 -287432 -136640 159894 322011 261147
22039B61147j1925k56782k81520q8018K00486K89000j8796n2237K44223n360k51631
$$ 261147 249222 -7560 -289080 -377098 -176612 112388 93592 41355 285578 280218 28587
22028B8587m01236n3044Q9739q8245P6935k7960K6146K53807K56245o9426k46853
$$ 28587 -372649 -425693 -335954 -424199 -347264 -375224 -349078 -95271 160974 91548 -155305
22017a55305J9282j66749l5150K36567K71382k5419l10368m63337p0243J17126
$$ -155305 -136023 -302772 -337922 -101355 170027 144608 -165760 -629097 -699340 -582214
22007e82214K82840K46034P0472M7921J41242o4638j87527j5192K20435K72569
$$ -582214 -299374 -53340 17132 65053 206295 141657 -45870 -61062 159373 431942
21997D31942l02561l63771j31798o4758O2614K34939K73395j40544j13175K8314
$$ 431942 129381 -234390 -366188 -430946 -368332 -133393 140002 -542 -113717 -85403
21987h5403j36800J59157O3364K31603j54804k34621j74458R9780J29126j80147
$$ -85403 -222203 -63046 318 231921 77117 -157504 -331962 -232182 -103056 -283203
21977b83203J0253J85946o0326M2305K94843q3814n1059J49503k09821j72948
$$ -283203 -272950 -87004 -147330 -105025 189818 106004 54945 204448 -5373 -178321
21967a78321K60646R6712L1811k3182J73237O6505k86704O2893J80001k17019
$$ -178321 82325 179037 210848 187666 360903 427408 140704 203597 383598 166579
21957A66579j15232j49269q8920K7524n0239k3150J55515J29585J07507j10412
$$ 166579 51347 -97922 -186842 -159318 -209557 -232707 -77192 52393 159900 49488
21947D9488k48599l3131K06259J91759p8180j49822l7311O5789q6536j43266J05762
$$ 49488 -199111 -232242 -25983 165776 87596 -62226 -99537 -33748 -120284 -263550 -157788
21936a57788r4405j08701r3431J09587Q0768K81640N1092j17856r3539O623K45083
$$ -157788 -252193 -360894 -454325 -344738 -263970 17670 68762 -49094 -142633 -136010 109073
21925A09073p139L5030M1022j69506m6953O8976M8659Q1029j3415j06221p0224
$$ 109073 101934 136964 177986 8480 -38473 30503 79162 160191 146776 40555 -29669
21914b9669l024O4095J23940k84130n2271K2071k8538j29417r7149P9443P4579
$$ -29669 -32693 31402 155342 -128788 -181059 -158988 -187526 -316943 -414092 -334649 -260070
21903b60070O8376o8593p7049J92970j20791j15964l3858p2617j09827Q0670K45895
$$ -260070 -191694 -260287 -337336 -144366 -265157 -381121 -414979 -487596 -597423 -516753 -270858
21892b70858L50556k53841j87882J48586j72002J810K40190L20337j96427l5743
$$ -270858 79698 -174143 -362025 -213439 -385441 -383631 -143441 176896 -19531 -55274
21882e5274K2202o8347m86J34111K57603J9468k51422j18430j68033L02965J67571
$$ -55274 -33072 -101419 -101905 32206 289809 309277 57855 -60575 -228608 74357 241928
21871B41928J68736k13556j97310Q7191q0122J03454M3659k07590j58329k00368
$$ 241928 410664 197108 -202 86989 6867 110321 153980 -53610 -211939 -412307
21861d12307K08313K1958P9894J24407q208j50587j66217K10794J57223l9939
$$ -412307 -203994 -182036 -102142 22265 14057 -136530 -302747 -91953 65270 25331
21851B5331q0608l9342j16515O9323R9814j79073l08670m0428L86207J52888r0108
$$ 25331 -55277 -94619 -211134 -141811 -41997 -221070 -529740 -570168 -183961 -31073 -121181
21840a21181j15368J36376K12402k1711r50J34495K02674j59209j72377J29765
$$ -121181 -236549 -100173 112229 90518 89568 224063 426737 267528 95151 224916
21830B24916K83044m5340j33438K6208j73595j23041q499J2208R3802m687l04576
$$ 224916 507960 462620 329182 355390 181795 58754 50255 62463 156265 151578 -152998
21819a52998k11968p253R1679L60367K02758k47976k56904K21173K645J1605O2021
$$ -152998 -364966 -372219 -280540 79827 282585 34609 -222295 -1122 1523 13128 75149
21808G5149K13283p4892k92860j96571J45651L235J45976j72493K37235J21207
$$ 75149 288432 213540 -79320 -275891 -130240 -127005 18971 -153522 83713 204920
21798B04920j61970j77966r1451p0564J25514M55757M5659k54137r2644k8066
$$ 204920 42950 -135016 -226467 -297031 -171517 284240 329899 75762 -16882 -44948
21788d4948J65310n3867p9374K1086J87547k54726j69954J26195J46147j515M9333
$$ -44948 120362 66495 -12879 8207 195754 -58972 -228926 -102731 43416 41901 91234
21777I1234K816j11468L5933J71313O031j27702q1033l9546j07220O3701J29759
$$ 91234 94050 -17418 18515 189828 195859 68157 -12876 -52422 -159642 -95941 33818
21766C3818j80810r1463K3177K19023j1392j02268n1953K72275j9524J37451K1332
$$ 33818 -146992 -238455 -215278 3745 -7647 -109915 -161868 110407 90883 228334 249666
21755B49666k64724k74547J2871q43j39432q6888J47113J11769J99604M4551k578
$$ 249666 -15058 -289605 -276734 -277577 -417009 -503897 -356784 -245015 -45411 -860 -3438
21744c438r1188N4033J15758M2943l1297j5132j13433K58983j23876k03148p0227
$$ -3438 -94626 -40593 75165 118108 86811 71679 -41754 217229 93353 -109795 -180022
21733a80022J15370K52985L79862n6913j69848K7168j71994p9825J79113J06589
$$ -180022 -64652 188333 568195 511282 341434 368602 196608 116783 295896 402485
21723D02485L41796J03531O171j90432k75087r4370J0641k25667j34366k2479
$$ 402485 744281 847812 853983 663551 388464 294094 304735 79068 -55298 -77777
21713g7777n5712k1892K96990L5135k62611l9730j86136R8790N5219q3558R0151
$$ -77777 -133489 -155381 141609 176744 -85867 -125597 -311733 -212943 -157724 -241282 -151131
21702a51131J67418j54913Q3755P6183p9040j65017J03685J52820j77231j0796
$$ -151131 16287 -138626 -54871 21312 -57728 -222745 -119060 33760 -143471 -154267
21692a54267j93732k41093J96653K42587K26578J32069J73803N6472j45523q3363
$$ -154267 -347999 -589092 -392439 -149852 76726 208795 382598 439070 293547 210184
21682B10184J62927J95520J38714N649k87399j93714j00885J46311K44586p848
$$ 210184 373111 568631 707345 712994 425595 231881 130996 277307 521893 514045
21672E14045r4m94003k48398K3067K12431L41469l0698R3584n3865p5671J79761
$$ 514045 513951 19948 -228450 -205383 7048 348517 317819 411403 357538 281867 461628
21661D61628J67208M9469J7412J87070r6894p4751j08996r9520p4806p4650J40776
$$ 461628 628836 678305 695717 882787 785893 711142 602146 502626 427820 353170 493946
21650D93946J72246j25529m75209r6729L59766N7669l3273L4105J16739p9212
$$ 493946 666192 540663 65454 -31275 328491 386160 352887 386992 503731 424519
21640D24519K7405p6685k46060N7338L4053K02588N9608q288p7966J5658J87922
$$ 424519 451924 375239 129179 186517 220570 423158 482766 474478 396512 412170 600092
21629F00092L67813L81752J49320n4280n4440j16796r8760J09557O1313o8722
$$ 600092 967905 1349657 1498977 1444697 1390257 1273461 1174701 1284258 1345571 1276849
21619A276849j42259j04767K9613J32705K21686K65243m3393k09812J03385L52100
$$ 1276849 1134590 1029823 1059436 1192141 1413827 1679070 1635677 1425865 1529250 1881350
21609A881350K22618L58112N04503M72250N43215L64124L30960J33946l24759
$$ 1881350 2103968 2462080 2966583 3438833 3982048 4346172 4677132 4811078 4486319
21600D486319l04856k42252J26471P5724K25925L84422M34786L72072L88385K69260
$$ 4486319 4181463 3939211 4065682 4141406 4367331 4751753 5186539 5558611 5946996 6216256
21590F216256N2069J21106M93917L77670R0292L89021M34142O68815J064768J329784
$$ 6216256 6268325 6389431 6883348 7261018 7351310 7740331 8174473 8843288 9908056 11237840
21580A1237840J465768J779723K418948L147265L978970N020235O726672R326567
$$ 11237840 12703608 14483331 16902279 20049544 24028514 29048749 35775421 45101988
21572D5101988J4453301K4613277M2147071O7862125R4195105J03441363Q4936086
$$ 45101988 59555289 84168566 126315637 194177762 288372867 391814230 476750316
21565D76750316L6176656l0703417p3221878q8500161p1533616m6205494l0526376
$$ 476750316 512926972 482223555 409001677 320501516 248967900 202762406 172236030
21558A72236030k3167057j8934852j5992154j3698191j1779663j0150998q919147
$$ 172236030 149068973 130134121 114141967 100443776 88664113 78513115 69593968
21551F9593968p769357p295229o522371n461787m941885m463070l794755l598356
$$ 69593968 61824611 54529382 48007011 42545224 37603339 33140269 29345514 25747158
21543B5747158l053302k186930k060688j936693j517577j315500j205707p91651
$$ 25747158 22693856 20506926 18446238 16509545 14991968 13676468 12470761 11679110
21535A1679110n72505l99793q70456r60435m38647K59389L03085J90055p3998
$$ 11679110 11106605 10706812 9836356 8875921 8437274 8696663 8999748 9189803 9115805
21526I115805q18610r27133r24707p31011n73046n03508n53490o69507k93643
$$ 9115805 8297195 7370062 6445355 5714344 5141298 4637790 4084300 3414793 3121150
21517C121150m18648n74442k53985k61302r8371j63414R7745k13045l91985n2373
$$ 3121150 2702502 2128060 1874075 1612773 1514402 1350988 1448733 1235688 843703 791330
21507G91330K7275Q1292R6307j03614m5351q9334k82316R0385J12947q5054q8989
$$ 791330 818605 899897 996204 892590 847239 757905 475589 565974 678921 593867 504878
21496E04878j97795j41061Q7452K01697J73943K28945n1371M1967k87755l1981
$$ 504878 307083 166022 253474 455171 629114 858059 806688 848655 560900 528919
21486E28919P421j73618o0182Q1032j48754l7081m7707j51816j65398L5931J3217
$$ 528919 536340 362722 302540 383572 234818 197737 150030 -1786 -167184 -131253 -118036
21475a18036K93800L09948j01283k98437M3862J34012L7303n9651p7103o2839
$$ -118036 175764 485712 384429 85992 129854 263866 301169 241518 164415 101576
21465A01576J61126k664j3135L925r240j01509K13812N3397J2577j58790N6921
$$ 101576 262702 260038 246903 250828 241588 140079 353891 407288 419865 261075 317996
21454C17996J39860p4672j45484k52286J169r2444j86718q8363J5097q4861J56468
$$ 317996 457856 383184 237700 -14586 -13417 -105861 -292579 -380942 -365845 -450706 -294238
21443b94238L28355J43132J57961Q1713j09543p1628p6047N7516n164Q0483R0843
$$ -294238 34117 177249 335210 416923 307380 235752 159705 217221 212057 292540 383383
21432C83383J14456P3864n29086k28205R7082J34889J48844j38690L1416l3245
$$ 383383 497839 571703 42617 -185588 -88506 46383 195227 56537 87953 54708
21422E4708J41253j80148j48743J94919R295j40993L8453K01679r599j22195j64983
$$ 54708 195961 15813 -132930 61989 71284 -69709 -31256 170423 160824 38629 -126354
21411a26354n3805P3277O7373N4343M4940l54306n2623K04741k12547j70407j14361
$$ -126354 -180159 -106882 -39509 14834 59774 -294532 -347155 -142414 -354961 -525368 -639729
21400f39729L1297J70550K06725j1183P2825P5804j56569Q2351K0594j72723j1027
$$ -639729 -608432 -437882 -231157 -242340 -169515 -93711 -250280 -167929 -147335 -320058 -331085
21389c31085l2559J42781Q2054k0282l55048p4430K44358J32091r5214k8938L8740
$$ -331085 -363644 -220863 -138809 -159091 -514139 -588569 -344211 -212120 -307334 -336272 -297532
21378b97532m687j21390r9104l7248K39939J99999k25491m9442L02875L08058
$$ -297532 -302219 -423609 -522713 -559961 -320022 -120023 -345514 -394956 -92081 215977
21368B15977R0750j11663l12329l10456j47127L33264K17185K3309r9852p2368
$$ 215977 306727 195064 -117265 -427721 -574848 -241584 -24399 -1090 -100942 -173310
21358a73310K3507j06119J19808R6730L3343j37952J0839n6278j3228p3135n1302
$$ -173310 -149803 -255922 -136114 -39384 -6041 -143993 -133154 -189432 -202660 -275795 -327097
21347c27097o0420N1526q8582J82104J56707R7725j93779j8079Q3031p622l4970
$$ -327097 -387517 -335991 -424573 -242469 -85762 11963 -181816 -199895 -116864 -124486 -159456
21336a59456J5543r7746j23977N5497J715K6273k16198K237N9309m9348J65236
$$ -159456 -143913 -241659 -365636 -310139 -308424 -282151 -498349 -496112 -436803 -486151 -320915
21325c20915Q7091l8734P0571j09249M6510q2476R9873K14243Q1981M6500M4915
$$ -320915 -233824 -272558 -201987 -311236 -264726 -347202 -247329 -33086 48895 95395 140310
21314A40310L873R194k90966r0954K3296k02284r6571J75343K84249K99122j22062
$$ 140310 144183 153377 -137589 -228543 -205247 -407531 -504102 -328759 -44510 254612 132550
21303A32550j89308r6556J93428K22109j96416J09009J0710m38864j58537M20648
$$ 132550 -56758 -153314 40114 262223 65807 174816 185526 -253338 -411875 8773
21293H773K32256k21665p5276q7352J2500M3006j70075j8648M6100n8360m28j43186
$$ 8773 241029 19364 -55912 -143264 -130764 -87758 -257833 -276481 -230381 -288741 -289169 -432355
21281d32355j94647K77794R8233R4898L81737N5913k83849r8968J40711n4344
$$ -432355 -627002 -349208 -250975 -156077 225660 281573 -2276 -101244 39467 -14877
21271a4877l4173L54522j07315q8120Q4503O8646k0146Q8409q7670j40117J5118
$$ -14877 -49050 305472 198157 110037 194540 263186 243040 331449 243779 103662 118780
21260A18780Q3085R3164j79401q9827J06285o680n8648J50081N90406M64573N48419
$$ 118780 201865 295029 115628 25801 132086 125406 66758 216839 807245 1271818 1820237
21249A820237M17581Q16317L68239n0645o39248q36439o01931m37819P491j14994
$$ 1820237 2237818 3054135 3422374 3371729 2732481 1896042 1294111 856292 863783 748789
21239G48789j18755k78205k93852j08906k07054Q3190J0472j27149j01388J72597
$$ 748789 630034 351829 57977 -50929 -257983 -174793 -164321 -291470 -392858 -220261
21229b20261L3752n1960o4733K56946j07005j44475n3376l8945J48296K45204
$$ -220261 -186509 -238469 -303202 -46256 -153261 -297736 -351112 -390057 -241761 3443
21219C443J70455J13255l53464k12066p1993R8988K57113n3177j61219K0759n6793
$$ 3443 173898 287153 -66311 -278377 -350370 -251382 5731 -47446 -208665 -187906 -244699
21208b44699j00891j92881R2501J20076j03796K91915K01132n8451j41586O9361
$$ -244699 -345590 -538471 -445970 -325894 -429690 -137775 63357 4906 -136680 -67319
21198f7319j4196Q3249p0648j12039J93215L65470r3129o3569k04295k93012k26389
$$ -67319 -81515 1734 -68914 -180953 12262 377732 284603 221034 16739 -276273 -502662
21187e02662J14549j14267l3902M45669O2577l87395k09058J21586L75046P2790
$$ -502662 -388113 -502380 -536282 -90613 -28036 -415431 -624489 -502903 -127857 -55067
21177e5067q6362j03574J00219Q1238j77178l11898J69018P4721J34006J39980
$$ -55067 -141429 -245003 -144784 -63546 -240724 -552622 -383604 -308883 -174877 -34897
21167c4897k2530J29242o3057R0197l32368n4452J3037L72481J37716j51494r5477
$$ -34897 -57427 71815 8758 98955 -233413 -287865 -274828 97653 235369 83875 -11602
21156a1602j48584Q6427k3366j15133m8645J32156p6693J85068J2081l18325l95718
$$ -11602 -160186 -73759 -97125 -212258 -260903 -128747 -205440 -20372 -8291 -326616 -722334
21145g22334J36516J64401J12469m7553m2348R8130J65351l8501O5208j13723
$$ -722334 -585818 -421417 -308948 -356501 -398849 -300719 -135368 -173869 -108661 -222384
21135b22384n9261l0740K01152n0640O721j05876J09476p0986Q5775l8108j79266
$$ -222384 -281645 -312385 -111233 -161873 -155152 -261028 -151552 -222538 -136763 -174871 -354137
21124c54137L66533J10563l35412R4712J42464j8312J4227J45522j03338j56453
$$ -354137 12396 122959 -212453 -117741 24723 6411 20638 166160 62822 -93631
21114i3631j60679j7683J20796J91049j13411j11448J76725J04553j45465m45745
$$ -93631 -254310 -271993 -151197 39852 -73559 -185007 -8282 96271 -49194 -494939
21104d94939j63941O0455J16292R6750q1284Q6494L8429J03398J39566N0577j02169
$$ -494939 -658880 -598425 -482133 -385383 -466667 -380173 -341744 -238346 -98780 -48203 -150372
21093a50372O5470J36779N7870p8296p8079j6702k21105J22528K55056J56122
$$ -150372 -84902 51877 109747 31451 -46628 -63330 -284435 -161907 93149 249271
21083B49271k09227k4718J31424K7557l37578n7947Q9273j73119L0962Q6443M5631
$$ 249271 40044 15326 146750 174307 -163271 -221218 -131945 -305064 -274102 -187659 -142028
21072a42028r5915J443O0131k05572j3371J91166p8978l6337R7317k5523k4110
$$ -142028 -237943 -236500 -176369 -381941 -395312 -204146 -283124 -319461 -222144 -247667 -271777
21061b71777O3694O6816p930m4227j33843J19495j346n9327k38j09117k12552
$$ -271777 -208083 -141267 -149197 -193424 -327267 -207772 -209118 -268445 -268683 -377800 -590352
21050e90352j1880L53054p0592r5352l5970l571o6169K42381J15831p1538j41943
$$ -590352 -602232 -249178 -319770 -415122 -451092 -454663 -520832 -278451 -162620 -234158 -376101
21039c76101J27880J15772k9719J64384J7223Q031j03390n8492q4305o9871k98628
$$ -376101 -248221 -132449 -162168 2216 19439 27470 -75920 -134412 -218717 -288588 -587216
21028e87216k04122K37475K06880K74948R8796r8800J27452J89341j22623n9422
$$ -587216 -791338 -553863 -346983 -72035 26761 -72039 55413 244754 122131 62709
21018F2709J26092J17826r6243k42714k3567J29739j337q3948j19655k17441j2761
$$ 62709 188801 306627 210384 -32330 -55897 73842 72505 -11443 -131098 -348539 -361300
21007c61300J66775R0603j08775M1846O4445j57701m9360J52952K05949j44118
$$ -361300 -194525 -103922 -212697 -170851 -106406 -264107 -313467 -160515 45434 -98684
20997i8684r7120j46028q651n2915Q6264Q7117q1017K66847J27926Q3640l4945
$$ -98684 -195804 -341832 -350483 -403398 -317134 -230017 -311034 -44187 83739 167379 132434
20986A32434j15218r2739l74014M6146k968L9866J98059m3980k95577r2170K7912
$$ 132434 17216 -75523 -449537 -403391 -406359 -366493 -168434 -212414 -507991 -600161 -572249
20975e72249J94422o631k1147J36543K66510J5335r0918M6219r7675j6800J82073
$$ -572249 -377827 -384458 -405605 -269062 -2552 12783 -78135 -31916 -129591 -146391 35682
20964C5682m9438J262k2590l02104p6493J20385J99000j41617N3273K78696o5226
$$ 35682 -13756 -12494 -35084 -337188 -413681 -293296 -94296 -235913 -182640 96056 30830
20953C0830k89756m2141J6630j41530J81609l2234k08417P8233K11441O7716r3754
$$ 30830 -258926 -301067 -284437 -425967 -244358 -276592 -485009 -406776 -195335 -127619 -221373
20942b21373J61187k61537r4504J18014K04819R5354k64915j20798J67948K90534
$$ -221373 -60186 -321723 -416227 -298213 -93394 1960 -262955 -383753 -215805 74729
20932G4729r7519L0376J25777J46521j40310n6902j15815J57900J5717k22507
$$ 74729 -22790 7586 133363 279884 139574 82672 -33143 124757 140474 -82033
20922h2033k31087L6519R6270Q9019j52694j62503K72840J61886m3453k47280
$$ -82033 -313120 -276601 -180331 -91312 -244006 -406509 -133669 28217 -15236 -262516
20912b62516j39851j6267o0810N7194K92745M02627j40889k39082j1582L9453
$$ -262516 -402367 -418634 -479444 -422250 -129505 273122 132233 -106849 -118431 -78978
20902g8978Q5232J96209j79742J9989J87244p9043p2199k05214m268K82412J47612
$$ -78978 6254 202463 22721 42710 229954 150911 78712 -126502 -130770 151642 299254
20891B99254Q1594j77835J80583J39830j13840n5683J8344N3695L95931M06537
$$ 299254 380848 203013 383596 523426 409586 353903 372247 425942 821873 1228410
20881A228410M45075L65856L2276P1919r0363j80505k28006k18422N1446j47596
$$ 1228410 1673485 2039341 2071617 2143536 2053173 1872668 1644662 1426240 1477686 1330090
20871A330090k02131k4864k56121k90522j97788k19804J641j49991j57498J435
$$ 1330090 1127959 1103095 846974 556452 358664 138860 140501 -9490 -166988 -165553
20861a65553J5426n387M0088j13681j72131p7596j5203J00968j29474K22418M41054
$$ -165553 -150127 -155514 -115426 -229107 -401238 -478834 -494037 -393069 -522543 -300125 140929
20850A40929N5952j82269p4699j35017p7982R4354q5445k63743o7027J65515J56048
$$ 140929 196881 14612 -60087 -195104 -273086 -178732 -264177 -527920 -594947 -429432 -273384
20839b73384J2571Q4265k44738J6133L52672R4290k4129j21888Q1550m7573m12
$$ -273384 -260813 -176548 -421286 -405153 -52481 41809 17680 -104208 -22658 -70231 -70643
20828g0643r8168q1932O8630N4582K26428q5920j05928J04656N6707q3900p8584
$$ -70643 -168811 -250743 -182113 -127531 98897 12977 -92951 11705 68412 -15488 -94072
20817i4072J27758O331l3103M1710O7782o8397j92129j07915J86770J42548l5559
$$ -94072 33686 40017 6914 48624 116406 48009 -144120 -252035 -65265 77283 41724
20806D1724j24480k07979J82080q3689j69002j51906J18318J70330K84279K26160
$$ 41724 -82756 -290735 -108655 -192344 -361346 -513252 -394934 -224604 59675 285835
20796B85835k45959m12167K5555J36822j40568P8146L83825J49412l25956p5905
$$ 285835 39876 -372291 -346736 -209914 -350482 -272336 111489 260901 -65055 -140960
20786a40960N39j36214j42455p8293J07561K90806o7887j3825q3893k4713J77417
$$ -140960 -140421 -276635 -419090 -497383 -389822 -99016 -166903 -180728 -264621 -289334 -111917
20775a11917J44591j26947m1349J20526l10448J0615J93732j02355P7447J45894
$$ -111917 32674 -94273 -135622 -15096 -325544 -314929 -121197 -223552 -146105 -211
20765b11r0927j78774k63743P0222j066l23184J11135K29591J03610j62295O2279
$$ -211 -91138 -269912 -533655 -463433 -464499 -787683 -676548 -446957 -343347 -505642 -443363
20754d43363q054K15864Q8972k3913J3698r900J62353J17322k16432k37623k6443
$$ -443363 -451417 -235553 -146581 -170494 -156796 -166696 -4343 112979 -103453 -341076 -367519
20743c67519J15J79413J21127J6513k51330N661j83244J6091K98404j28889M8796
$$ -367519 -367404 -187991 -66864 -50351 -301681 -296020 -479264 -463173 -164769 -293658 -244862
20732b44862J03800n6020k24160j3086J07467n947p4963j47708J53042M24093
$$ -244862 -141062 -197082 -421242 -434328 -326861 -332808 -407771 -555479 -402437 21656
20722B1656J15612n7673l69545k69994L0609J13626K92373q9257j80622N5246
$$ 21656 137268 79595 -289950 -559944 -529335 -415709 -123336 -212593 -393215 -337969
20712c37969q4114J97556J41878J445l12746j06093j45753J27280J48924o746
$$ -337969 -422083 -224527 -82649 -81204 -393950 -500043 -645796 -518516 -369592 -376338
20702c76338J8365L51019J57872q56l44736j46154q0017K6652K46487J26812K3925
$$ -376338 -357973 -6954 150918 150062 -194674 -340828 -420845 -394193 -147706 -20894 3031
20691C031j01333Q2387k94384l64436M6319M27514J6677j42698o7967J22126J02668
$$ 3031 -98302 -15915 -310299 -674735 -628416 -200902 -184225 -326923 -394890 -272764 -170096
20680a70096J4071p9402J71520K54846J17978j1101j04340k06017L453J47609
$$ -170096 -156025 -235427 -63907 190939 308917 297816 193476 -12541 -9088 138521
20670A38521m7830l9460j56286J4379L60854J86974k08106n6098J73359k050j53793
$$ 138521 90691 51231 -105055 -90676 270178 457152 249046 192948 366307 364257 210464
20659B10464j12135o1367P7903k52507L6927q3306M595J06622r3272N3482o4583
$$ 210464 98329 36962 114865 -137642 -100715 -184021 -179426 -72804 -166076 -112594 -177177
20648a77177L733j4521J97669N5549J83582j83786M268r5033k24711J31543k1760
$$ -177177 -173444 -187965 9704 65253 248835 65049 69317 -25716 -250427 -118884 -140644
20637a40644j12374K41867M5968j59937j95913R726j1196M0762j61071J52267
$$ -140644 -253018 -11151 34817 -125120 -321033 -311307 -322503 -281741 -442812 -290545
20627b90545J62651l4480j53195j60105k12815J5640K77717J00803L54012J8626
$$ -290545 -127894 -162374 -315569 -475674 -688489 -672849 -395132 -294329 59683 78309
20617G8309P3799k02572k45206m6130j57854j75518K24996K53009l1501j21980
$$ 78309 152108 -50464 -295670 -341800 -499654 -675172 -450176 -197167 -228668 -350648
20607c50648m5241J0160M8963N1550j05234K9203l1555L0480k01389P1448P7482
$$ -350648 -395889 -385729 -336766 -285216 -390450 -361247 -392802 -362322 -563711 -492263 -414781
20596d14781K02390N6852M5532O0127N1605J7782j46272K09275k03979q1779N5767
$$ -414781 -212391 -155539 -110007 -49880 1725 19507 -126765 82510 -121469 -203248 -147481
20585a47481k26545j34845L08004J65514r1395j40978j04238K0875R77N4759m882
$$ -147481 -374026 -508871 -200867 -35353 -126748 -267726 -371964 -351089 -350112 -295353 -300235
20574c00235J08153J239k60687N2952J7791J78238N1929K9401J00882J62936J62898
$$ -300235 -192082 -190843 -451530 -398578 -380787 -202549 -150620 -121219 -20337 142599 305497
20563C05497j73924k63319k83271k481J02994j76254L6287N3144M03553J00557
$$ 305497 131573 -131746 -415017 -417498 -314504 -490758 -454471 -401327 2226 102783
20553A02783k75329n9992q0050R6433P1466M7910M5458r6049n2307n1796k60136
$$ 102783 -172546 -232538 -312588 -216155 -144689 -96779 -51321 -147370 -199677 -251473 -511609
20542e11609J60475K37405P0380q1148J45345K34746k07061r6309j41116j32670
$$ -511609 -351134 -113729 -43349 -124497 20848 255594 48533 -47776 -188892 -321562
20532c21562m0301Q5065j5304J51911K473q789P4989k4080j76919j29562M3852
$$ -321562 -361863 -276798 -292102 -140191 -137718 -146507 -71518 -95598 -272517 -402079 -358227
20521c58227n441O5765J9669j36345Q124n8515K42004K76951j18578k89670R772
$$ -358227 -363668 -297903 -278234 -414579 -406455 -464970 -222966 53985 -64593 -354263 -344491
20510c44491n4411j10809m3807J81772J12181k8330q5209o894J04481l19395j51958
$$ -344491 -398902 -509711 -553518 -371746 -259565 -287895 -373104 -379998 -275517 -594912 -746870
20499g46870K02238K66962N7870j92576j00397K09656K54206l3387L5293M8854
$$ -746870 -544632 -277670 -219800 -412376 -512773 -303117 -48911 -82298 -47005 1849
20489A849j19233j50448K20756r3314k39848j05561J12063k53753L1853Q6589
$$ 1849 -117384 -267832 -47076 -140390 -380238 -485799 -373736 -627489 -595636 -509047
20479e09047L1886J6534J16808K37010M7316k38079p9148K96370L32187j56007
$$ -509047 -477161 -460627 -343819 -106809 -59493 -297572 -376720 -80350 251837 95830
20469I5830J05832j30975n5699j46186j48065j02267R3828J32126Q670q7235P4278
$$ 95830 201662 70687 14988 -131198 -279263 -381530 -287702 -155576 -146906 -234141 -159863
20458a59863J00742J32125j62091L2690R5004J92207K62718p2538m05359k32970
$$ -159863 -59121 73004 -89087 -56397 38607 230814 493532 420994 15635 -217335
20448b17335K85190K83062K06294l21580k36065P0934J39884R109K51657o0866
$$ -217335 67855 350917 557211 235631 -434 70500 210384 219493 471150 410284
20438D10284r6483j83248l8604m5604N70388L74719q4852r890Q2123j62983j1042
$$ 410284 313801 130553 91949 46345 616733 991452 906600 896710 978833 815850 804808
20427H04808L4278O0570r2202j05246l2785j50861m3884J85686J45752k866k05176
$$ 804808 839086 899656 807454 702208 669423 518562 474678 660364 806116 803250 598074
20416E98074P4688o3969r8782L4245L9321j1482j85788q8357J28422N135j03717
$$ 598074 672762 608793 510011 544256 583577 572095 386307 297950 426372 431507 327790
20405C27790J47671K09748O6859L51139N80066M19530K52429j71313l32118k33073
$$ 327790 475461 685209 752068 1103207 1683273 2102803 2355232 2183919 1851801 1618728
20395A618728j91753l09866l07189o1983k14043j8503k00979p6375k05485n8665
$$ 1618728 1426975 1117109 809920 747937 533894 515391 314412 238037 32552 -26113
20385b6113L3083M61042L18196j92788J2332k29130l52462j96925K17573J61256
$$ -26113 6970 468012 786208 593420 605752 376622 24160 -172765 44808 206064
20375B06064l6420j10641j11575j37659l8432J01335J70977j5087k6030J22875
$$ 206064 169644 59003 -52572 -190231 -228663 -127328 43649 28562 2532 125407
20365A25407j54275l376J75704q9173j64805O8083l5887P7868J72101J67830k07067
$$ 125407 -28868 -32244 143460 54287 -110518 -42435 -78322 -454 171647 339477 132410
20354A32410k12571m1154O39j41329R1980K72961Q3781k03205J34865K74227p4546
$$ 132410 -80161 -121315 -120676 -262005 -170025 102936 186717 -16488 118377 392604 318058
20343C18058k1921j77231l46091k45506o4799K42590L27411m2264j28333K83707
$$ 318058 296137 118906 -227185 -472691 -537490 -294900 32511 -9753 -138086 145621
20333A45621K58257k06260j44362j2983j86487k42227p8867R6911K85860K85070
$$ 145621 403878 197618 53256 40273 -146214 -388441 -467308 -370397 -84537 200533
20323B00533q5802k99512l1233J80088J00752J86802O903l85321j56771J23537
$$ 200533 114731 -184781 -216014 -35926 64826 251628 258531 -126790 -283561 -160024
20313a60024J85915O1593N6134j67891j97637L7471J12326J52833J00863Q8651
$$ -160024 25891 87484 143618 -24273 -221910 -184439 -72113 80720 181583 270234
20303B70234o5541j33964j15540M01861P6422J26990J03073K20312l75678n03637
$$ 270234 204693 70729 -44811 357050 433472 560462 663535 883847 508169 4532
20293D532j16794K0927n6786k1386m3590l2146q3594J52026J47583N0195k43J57176
$$ 4532 -112262 -91335 -148121 -169507 -213097 -245243 -328837 -176811 -29228 20967 20724 177900
20281A77900P7021q4147r8158j04887j32600O1002j8304j6046j74850q3844J3695
$$ 177900 254921 170774 72616 -32271 -164871 -103869 -122173 -138219 -313069 -396913 -383218
20270c83218Q6630J00761L0011K9728J31800o6823l2683p0914j05818Q3480K0624
$$ -383218 -296588 -195827 -165816 -136088 -4288 -71111 -103794 -174708 -280526 -197046 -176422
20259a76422J3610J94851K00585p1841m26261j78084J48578K92585Q8186J30584
$$ -176422 -162812 32039 232624 160783 -265478 -443562 -294984 -2399 85787 216371
20249B16371k02310k04555J11010R2659O3252j53589O1799O6566j41037j40701
$$ 216371 14061 -190494 -79484 13175 76427 -77162 -15363 51203 -89834 -230535
20239b30535l7989j42749Q7139N7485P9140j08457K31514j32069l28777q6290
$$ -230535 -268524 -411273 -324134 -266649 -187509 -295966 -64452 -196521 -525298 -611588
20229f11588j6854K37634J96707p459j23924O8090m1128J36390j3204k744k43396
$$ -611588 -628442 -390808 -194101 -201560 -325484 -257394 -298522 -162132 -175336 -178080 -421476
20218d21476j76970L30900k41678L8196R9892p3959K79989J29916J07357m2241
$$ -421476 -598446 -267546 -509224 -471028 -371136 -445095 -165106 -35190 72167 29926
20208B9926k77140k18817J56138J99316K935p6016J72105k2758o7362M8350j44159
$$ 29926 -247214 -466031 -309893 -110577 -107642 -183658 -11553 -34311 -101673 -53323 -197482
20197a97482k60854j79382P4507Q7698J52692J27390J00723J51962L68930K3421
$$ -197482 -458336 -637718 -563211 -475513 -322821 -195431 -94708 57254 426184 449605
20187D49605m15476j86301J7607P5963O0425K41897J28034k34198m0754o7060
$$ 449605 34129 -152172 -134565 -58602 1823 243720 371754 137556 96802 29742
20177B9742O3230m6225O1389k51587k01431J12788J49280l5321r2908Q4065j44561
$$ 29742 92972 46747 108136 -143451 -344882 -232094 -82814 -118135 -211043 -126978 -271539
20166b71539K50602K30947j06878j27978J36892l8172J72821l6967J25793J5874
$$ -271539 -20937 210010 103132 -24846 112046 73874 246695 209728 335521 351395
20156C51395l5585N2599J21309J15132k15866J37460J48501k37983l75183j55184
$$ 351395 315810 368409 489718 604850 388984 526444 674945 436962 61779 -93405
20146i3405k1571J60358j37154k24745o5386K89817J58679M4175K5151m7121L0890
$$ -93405 -114976 45382 -91772 -316517 -381903 -92086 66593 110768 135919 88798 119688
20135A19688j534Q7186k33163m35538j10031K10321P7329l906J0967R8711q1565
$$ 119688 118154 205340 -27823 -463361 -573392 -363071 -285742 -289648 -278681 -179970 -261535
20124b61535j34426J04062K67686J38965k68674j06838K32810M9925J66129J7599
$$ -261535 -395961 -291899 -24213 114752 -153922 -260760 -27950 21975 188104 205703
20114B05703K7078K402l20159k27113k2241n4975j55148L04633j20330J6951j70751
$$ 205703 232781 235183 -84976 -312089 -334330 -389305 -544453 -239820 -360150 -343199 -513950
20103e13950j77482R2984K03547k7109P7459L06891j3253j01705j38024O1116
$$ -513950 -691432 -598448 -394901 -422010 -344551 -37660 -50913 -152618 -290642 -229526
20093b29526K79078K40360j04001k0594J84041j78842m1930J66910L72399p8294
$$ -229526 49552 289912 185911 165317 349358 170516 128586 295496 667895 589601
20083E89601k43439j85859J41415K8093m1453p2630j70216o4571J9125J59967
$$ 589601 346162 160303 301718 329811 288358 215728 45512 -19059 66 160033
20073A60033J21382o5881J73567J93875L54855K98566k64027n2386p2056k36896
$$ 160033 281415 215534 389101 582976 937831 1236397 972370 919984 847928 611032
20063F11032P4707J25220j13357J8192l24130J006J55767O3270Q3118m3652r1612
$$ 611032 685739 810959 697602 715794 391664 392670 548437 611707 694825 651173 559561
20052E59561p7005j43954j9781Q0048O978K8827J45127O894k32110k16795L3040
$$ 559561 482556 338602 318821 398869 405847 434674 579801 586695 354585 137790 170830
20041A70830Q0261K75785l9679p1573j90246j46167m8634J65241J07002J56759
$$ 170830 251091 526876 487197 415624 225378 79211 30577 195818 302820 459579
20031D59579L00214o1540j50986m3303J12926K90635K361k75573j96273o4702
$$ 459579 759793 698253 547267 503964 616890 907525 909886 634313 438040 373338
20021C73338j33279J86181R1218M02j14251l56K43725K94222k15837r8604J08287
$$ 373338 240059 426240 517458 517860 403609 403253 646978 941200 725363 626759 735046
20010G35046k4439k32554k40073j90K28810J08579k8847n6578L4173Q6989J1761
$$ 735046 710607 478053 237980 237790 466600 575179 546332 489754 523927 610916 622677
19999F22677j02870k13352P2814j21721J18743M67005O2746j7792k32411k94795
$$ 622677 519807 306455 379269 257548 376291 843296 906042 888250 655839 361044
19989C61044k3925K6361r322j27736L78893L54692j55969m8308k03067j23873
$$ 361044 337119 363480 354158 226422 605315 960007 804038 755730 552663 428790
19979D28790Q0710q212K8289J23481k8249N9118j50561K13229O2140J04321j20653
$$ 428790 509500 501288 529577 653058 624809 683927 533366 746595 808735 913056 792403
19968G92403q4320J9037K5159J45617J96707Q7911J72988m6286k43628k04183
$$ 792403 708083 727120 752279 897896 1094603 1182514 1355502 1309216 1065588 861405
19958H61405l05591J2225r1708L08332N6169M5028L98024M1385M6052K11171J92853
$$ 861405 555814 568039 476331 784663 840832 885860 1283884 1325269 1371321 1582492 1775345
19947A775345o2138Q6117L54062J17514N5138O1795K42602Q8531K57262O58572
$$ 1775345 1713207 1799324 2153386 2270900 2326038 2387833 2630435 2718966 2976228 3634800
19937C634800P46975O95222L72284M80599P23968J074300J305042J374509J772088
$$ 3634800 4381775 5076997 5449281 5929880 6653848 7728148 9033190 10407699 12179787
19928A2179787K362839L838684N285291Q136015J2200447J6181107J8584238J8162802
$$ 12179787 14542626 18381310 23666601 31802616 44003063 60184170 78768408 96931210
19920I6931210J5312514Q078400R05801l945738p813886n558513L307285J2071899
$$ 96931210 112243724 120322124 121227925 117282187 109468301 103909788 107217073 119288972
19912A19288972J6919324J8108592J7204503J3370051J0610237P756104J204803
$$ 119288972 136208296 154316888 171521391 184891442 195501679 203257783 204462586
19905B04462586n144979j0281417j2806654j3967003j4874460r601288O87047
$$ 204462586 199317607 189036190 176229536 162262533 147388073 137786785 138473832
19898A38473832Q769240J0687766P701371R99848r022342j3981603j6587514j9342064
$$ 138473832 147243072 157930838 165632209 166632057 157609715 143628112 127040598 107698534
19890A07698534j8201124j4301329j0715988q141292o710695n781800m917263
$$ 107698534 89497410 75196081 64480093 56338801 49628106 43846306 38929043
19883C8929043m288018l837683l443000l012605k803818k469504j902370j599639
$$ 38929043 34641025 30803342 27360342 24347737 21543919 19074415 17172045 15572406
19875A5572406j600244j623097j527195r11870p61967j092603j097995n87323
$$ 15572406 13972162 12349065 10821870 9910000 9148033 8055430 6957435 6370112
19867F370112n31560l47895m52046q01676l63503j24170R2027o8190k11451k65031
$$ 6370112 5838552 5490657 5038611 4236935 3873432 3749262 3841289 3773099 3561648 3296617
19857C296617k52305k08668j84954n96389q8384L3064K7157k05709j71730J21119
$$ 3296617 3044312 2835644 2650690 2054301 1965917 1998981 2026138 1820429 1648699 1769818
19847A769818q0850N5820k18323j00824O9883k28002k93918j26798J8576j06732
$$ 1769818 1688968 1744788 1526465 1425641 1495524 1267522 973604 846806 865382 758650
19837G58650r1870J70079K7804j8175K79980L7254N9573p3246o8780r1244R1223
$$ 758650 666780 836859 864663 846488 1126468 1163722 1223295 1150049 1081269 990025 1081248
19826A081248J30476o9330j80914k77051J04614l4188k98609l3856J19899K33767
$$ 1081248 1211724 1142394 961480 684429 789043 754855 456246 422390 542289 776056
19816G76056P5288L3258J64909J20242n0628n5665j78261j17990K9668J41495
$$ 776056 851344 884602 1049511 1169753 1119125 1063460 885199 767209 796877 938372
19806I38372J39979K29559n2702R0478j5622J41718O0690l91685l1532R1967J15494
$$ 938372 1078351 1307910 1255208 1345686 1330064 1471782 1532472 1140787 1109255 1201222 1316716
19795A316716L39790L14162K64512R3975K65326J07986j8010K4424j35251j00969
$$ 1316716 1656506 1970668 2235180 2329155 2594481 2702467 2684457 2708881 2573630 2472661
19785B472661K90986L70824J6759q2148j83413j41746J79973L4606k52374q7966
$$ 2472661 2763647 3134471 3151230 3069082 2885669 2743923 2923896 2958502 2706128 2618162
19775B618162j75425L98783N42723R1451K17763N31126L54697O10521O32044N82218
$$ 2618162 2442737 2841520 3384243 3475694 3693457 4224583 4579280 5189801 5821845 6404063
19765F404063O20987O77075K68816J43776O0820M52169N10715O84611J179746
$$ 6404063 7025050 7702125 7970941 8114717 8175537 8627706 9138421 9823032 11002778
19756A1002778J554885J908035K535386L190738M278187O025887Q544664J2985579
$$ 11002778 12557663 14465698 17001084 20191822 24470009 30495896 39040560 52026139
19748E2026139K2183199M0214860O8741174R8426176J06563291Q2340704K3080050
$$ 52026139 74209338 114424198 183165372 281591548 388154839 470495543 493575593
19741D93575593m5208288q4449179q6650486n9847653l5652132k3437926j7817698
$$ 493575593 448367305 363918126 277267640 217419987 181767855 158329929 140512231
19734A40512231j5354715j3387260j1451349j0086267r211934q072792p006388
$$ 140512231 125157516 111770256 100318907 90232640 81020706 72947914 65941526
19727F5941526o443081n838635n335805m620355m034314l924107l688236k979041
$$ 65941526 59498445 53659810 48324005 43703650 39669336 35745229 32056993 29077952
19719B9077952k536555k470374k351574k199766k208677j574437j487623j335682
$$ 29077952 26541397 24071023 21719449 19519683 17311006 15736569 14248946 12913264
19711A2913264j071432p67268n69003o17756n27746n99017o89351m06300j27358
$$ 12913264 11841832 11074564 10505561 9887805 9360059 8761042 8071691 7665391 7538033
19702G538033m43202m80163m86001o50847l50115j41978j45348l82273l28709
$$ 7538033 7094831 6614668 6128667 5477820 5127705 4985727 4840379 4458106 4129397
19693D129397l35016k28595o1429m39715o01443l46161l20959r3382j75516O7014
$$ 4129397 3794381 3565786 3504357 3064642 2463199 2117038 1796079 1702697 1527181 1594195
19683A594195N3751J9339j51951r5815j69696k1946j92519m02274o2672K29019
$$ 1594195 1647946 1667285 1515334 1419519 1249823 1227877 1035358 633084 570412 799431
19673G99431K35928q4484j51878K40406J43653j97961j04155M2659l21254k11956
$$ 799431 1035359 950875 798997 1039403 1183056 985095 880940 923599 602345 390389
19663C90389R4752J24077K29935P1762p3489M7010m4525R6558j35864j92175j83266
$$ 390389 485141 609218 839153 910915 837426 884436 839911 936469 800605 608430 425164
19652D25164K10413R5872K81646p2006R862m6476q1886P3404M3166J2406L3109
$$ 425164 635577 731449 1013095 941089 950951 904475 822589 895993 939159 951565 984674
19641I84674p8895r0558L9960P9504r2993L6882j89651r076J47155j30987j8956
$$ 984674 905779 815221 855181 934685 841692 878574 688923 679847 827002 696015 677059
19630F77059j05751j64901j3377J10343J24229J22569j02955l8720Q3607J47007
$$ 677059 571308 406407 393030 503373 627602 750171 647216 608496 692103 839110
19620H39110K01044J86983K54362o1533n2041O9516k8749O8073j89002k12836
$$ 839110 1040154 1227137 1481499 1419966 1367925 1437441 1408692 1476765 1287763 1074927
19610A074927N9467J41856K85814K25812Q349j96690J14864O4149Q080r9503j83561
$$ 1074927 1134394 1276250 1562064 1787876 1796225 1599535 1714399 1778548 1786628 1687125 1503564
19599A503564r2162k13254j22049n2878K79236J12391R2173m5595k15498j67894
$$ 1503564 1411402 1198148 1076099 1023221 1302457 1414848 1507021 1461426 1245928 1078034
19589A078034N8063L31675j30j26180r3690Q5488N329o9440j76132j42760n9725
$$ 1078034 1136097 1467772 1467642 1341462 1247772 1333260 1338589 1269149 1093017 950257 890532
19578H90532o4760j2158J89049M9107P6285J69809K52996P9719J30251J56701
$$ 890532 825772 813614 1002663 1051770 1128055 1297864 1550860 1630579 1760830 1917531
19568A917531q788J53168K66809L22109L41336J86623L21905O73731M72943L91546
$$ 1917531 1908743 2061911 2328720 2650829 2992165 3178788 3500693 4174424 4647367 5038913
19558E038913N63868R18218J099042J271379J903816L211752N015578P816216
$$ 5038913 5602781 6520999 7620041 8891420 10795236 14006988 19022566 26838782
19550B6838782J1117559J2554135J0186098M953849j321660m183073l2893O800536
$$ 26838782 37956341 50510476 60696574 65650423 64328763 60145690 60112797 66913333
19542F6913333J0477665Q142066K073777n594472j0268718p104756j31451N641197
$$ 66913333 77390998 85533064 87606841 82012369 71743651 64638895 64507444 70148641
19534G0148641P609507N185952O28549m193146n776733j545235M645330P132846
$$ 70148641 77758148 82944100 83572649 79379503 73602770 72057535 76702865 83835711
19526H3835711L543135k537714r614353j3302817j0650852o881940m574665l701424
$$ 83835711 87378846 84841132 75226779 61923962 51273110 44391170 39816505 36115081
19518C6115081k728119k545032k448577k132840j837635j557370j492195j205593
$$ 36115081 33386962 30841930 28393353 26260513 24422878 22865508 21373313 20167720
19510B0167720j211563q18928n46500l09906l20899N19588O46659J452823K434278
$$ 20167720 18956157 18137229 17590729 17280823 16959924 17479512 18126171 19578994 22013272
19501B2013272M468353P612995J1856562J4847848J3061613P834795O07903n278088
$$ 22013272 26481625 34094620 45951182 60799030 73860643 81695438 82303341 77025253
19493G7025253k966901L971733R387556Q582752L102012m575985r889632p941751
$$ 77025253 74058352 78030085 87417641 96000393 99102405 94526420 84636788 76695037
19485G6695037j082805N902436R881030P937341K546605m420099q689604m374720
$$ 76695037 75612232 81514668 91395698 99333039 101879644 97459545 88769941 84395221
19477H4395221L003299P196248M775882j265483r157269j4472741j2992955r177674
$$ 84395221 87398520 94594768 99370650 98105167 88947898 74475157 61482202 52304528
19469E2304528o161897m806801l928085l642022k996563k738390k516372k085696
$$ 52304528 46142631 41335830 37407745 33765723 30769160 28030770 25514398 23428702
19461B3428702j786476j858593j745023j634950j461343j156754j142665r49468
$$ 23428702 21642226 19783633 18038610 16403660 14942317 13785563 12642898 11693430
19453A1693430j132254r35634q67280p23120o18958p50171m86416m79723j84898
$$ 11693430 10561176 9625542 8758262 8035142 7416184 6666013 6179597 5699874 5514976
19444E514976j97501o02730k64624j50082l45354m50444m28427l06195l47239
$$ 5514976 5317475 4714745 4450121 4300039 3954685 3504241 3075814 2769619 2422380
19435B422380j83455J66549J66419k87741k86449N8533j10912q4538k13589j63051
$$ 2422380 2238925 2405474 2571893 2284152 1997703 2056236 1945324 1860786 1647197 1484146
19425A484146k10013q4268J43664J72632j04574k70899l33268j549m2917p146
$$ 1484146 1274133 1189865 1333529 1506161 1401587 1130688 797420 795871 752954 745808
19415G45808n5545j47826J1602K09779k4057k23235j75063J26909K71344n0358
$$ 745808 690263 542437 554039 763818 739761 516526 341463 468372 739716 689358
19405F89358o2765J06187R6261K41735L8141k11247K8777J90837o0161J31402
$$ 689358 626593 732780 829041 1070776 1108917 897670 926447 1117284 1057123 1188525
19395A188525J55034l3686m7751J19566r8749j5792Q74j4022J07624J08067L842
$$ 1188525 1343559 1309873 1262122 1381688 1282939 1267147 1268021 1253999 1361623 1469690 1473532
19384A473532J07506j36935l4859K3361O9138L738n27O5197k00966j09424O8731
$$ 1473532 1581038 1444103 1409244 1432605 1501743 1505481 1504954 1570151 1369185 1259761 1328492
19373A328492J07696J6150p205j1302j07944L8502P8242L2961J2538n5202l59287
$$ 1328492 1436188 1452338 1445133 1433831 1325887 1364389 1442631 1475592 1488130 1432928 1073641
19362A073641j92502n3532N1598l20869l6881J01151j35912J25392n928P5428
$$ 1073641 881139 827607 879205 558336 521455 622606 486694 612086 606158 681586
19352F81586L7785j81360m4263L66909J61624J04338j02636k24975Q726P8593
$$ 681586 719371 538011 493748 860657 1022281 1126619 1023983 799008 807734 886327
19342H86327J95789J76252k19806l25903J42900J35436j61801k9532P9342o3014
$$ 886327 1082116 1258368 1038562 712659 855559 990995 829194 799662 879004 815990
19332H15990J73973j68903R3248j2093Q9545P8672l0286j08345K24943J34751
$$ 815990 989963 821060 914308 902215 991760 1070432 1040146 931801 1156744 1291495
19322A291495J38051j17806p0257O5657o324n7552J92055J44627J80387J43436
$$ 1291495 1429546 1311740 1241483 1307140 1300816 1243264 1435319 1579946 1760333 1903769
19312A903769N5293j49277K6771K25035k0222r6196J21416L6077J52713J37406
$$ 1903769 1959062 1809785 1836556 2061591 2041369 1945173 2066589 2102666 2255379 2392785
19302B392785N03039M80636L0068j06913N30603P36577L85211M22604M98477M37290
$$ 2392785 2895824 3376460 3406528 3299615 3830218 4566795 4952006 5374610 5873087 6310377
19292F310377O68228Q43963J112180J720101K399341L707970O021017R301465
$$ 6310377 6978605 7822568 8934748 10654849 13054190 16762160 22783177 32084642
19284C2084642J2250537J2341387Q798033L570183k336660k575871M080071J1354025
$$ 32084642 44335179 56676566 65474599 69044782 66708122 64132251 68212322 79566347
19276G9566347J4472330J2504647Q434964L17977n607398p073892q898220p702397
$$ 79566347 94038677 106543324 114978288 115296265 109688867 102614975 93716755 86014358
19268H6014358j891884L869443M770290R04861n356322j2186792j3808552r817326
$$ 86014358 84122474 87991917 92762207 93667068 88310746 76123954 62315402 52498076
19260E2498076o733494n055485l862903l499082l374167k864725k111811j942449
$$ 52498076 45764582 40709097 36846194 33347112 29972945 27108220 24996409 23053960
19252B3053960j726093j537826j399151j085197q15356n79511n32335l47393j18453
$$ 23053960 21327867 19790041 18390890 17305693 16490337 15910826 15378491 15031098 14912645
19243A4912645L05256M56016R58878J373981K373348M332984O939543J1352980
$$ 14912645 15217901 15673917 16632795 18006776 20380124 24713108 31652651 43005631
19235D3005631J6187489J7072747J2348185N277697k914795n325056K095680J0253184
$$ 43005631 59193120 76265867 88614052 93891749 90976954 85651898 87747578 98000762
19227I8000762J4555314J4971838J2818903N764422k848610p553755j3273568
$$ 98000762 112556076 127527914 140346817 146111239 143262629 135708874 122435306
19220A22435306j3176711m710094K760006M470772N87913o107671j3560422j6566843
$$ 122435306 109258595 104548501 107308507 111779279 112367192 106259521 92699099 76132256
19212G6132256j2766734q557525o668539n655595m900860l702081l204277l278179
$$ 76132256 63365522 54807997 48139458 42483863 37583003 33880922 30676645 27398466
19204B7398466k919045k704243k189376j937272j686665j638509j596689j154644
$$ 27398466 24479421 21775178 19585802 17648530 15961865 14323356 12726667 11572023
19196A1572023j044664r55037q53566o45322n98349n78191m30862m55189n23267
$$ 11572023 10527359 9572322 8718756 8073434 7475085 6896894 6466032 6010843 5487576
19187E487576m33262o78537l21984L8327q6701l87052l82781m81118k63872j61270
$$ 5487576 5054314 4375777 4053793 4092120 4005419 3618367 3235586 2754468 2490596 2329326
19177B329326j58822p9346l08313j68576M7768M9252j10180j62850k49636J06870
$$ 2329326 2170504 2091158 1782845 1614269 1662037 1711289 1601109 1438259 1188623 1295493
19167A295493j42797m536l33254l16347J83373L89104K57060j96500k10530l33277
$$ 1295493 1152696 1148160 814906 498559 681932 1071036 1328096 1131596 921066 587789
19157E87789q6221K60410K19389J31094k9812l20528l99825k63640K58190L23822
$$ 587789 501568 761978 981367 1112461 1082649 762121 362296 98656 356846 680668
19147F80668j98335j77531O0150M5823k01470o721J95701K08253R4816o4670K05850
$$ 680668 482333 304802 364952 410775 209305 202584 398285 606538 701354 636684 842534
19136H42534j38063j33722k6554q5952j73834n3244P2942j35015M0423O813J9700
$$ 842534 704471 570749 544195 458243 284409 231165 304107 169092 209515 216328 236028
19125B36028n5860j11363j59427K09454Q3251N2608R7223J03425j82136r8156
$$ 236028 180168 68805 -90622 118832 202083 254691 351914 455339 273203 175047
19115A75047O2355J48587N405k3936K5389m80369n2979L12008J9224k81029j57553
$$ 175047 237402 385989 391394 367458 392847 -87522 -140501 171507 190731 -90298 -247851
19104b47851J41295J23402K81880J6870J83576J5650J78j04475p5772m8756n2050
$$ -247851 -106556 16846 298726 315596 499172 514822 515000 410525 334753 285997 233947
19093B33947l252M5129k6065k24063M1751J24746Q4104L8597K43286K19790L64707
$$ 233947 230695 275824 249759 25696 67447 192193 276297 314894 558180 777970 1142677
19082A142677j47977Q0561L52626P7133M11902M79057j15555j87835l08570j68016
$$ 1142677 994700 1075261 1427887 1505020 1916922 2395979 2280424 2092589 1784019 1616003
19072A616003l69253j92020m294l5307m3837k07876m9879j00235k33267m9547
$$ 1616003 1246750 1054730 1050436 1015129 971292 763416 713537 613302 380035 330488
19062C30488o8257J73806K14558j82755k22843j55376k83911k84601l8441J01928
$$ 330488 262231 436037 650595 467840 244997 89621 -194290 -478891 -517332 -415404
19052d15404p4258O5708K27952J44658j60078q2420J44115l4895m8247j5157m0519
$$ -415404 -489662 -423954 -196002 -51344 -211422 -293842 -149727 -184622 -232869 -248026 -288545
19041b88545p5610o737J31284j2457M35291J69911N1645l1489l11125K2594K46838
$$ -288545 -364155 -370892 -239608 -252065 183226 353137 404782 373293 62168 84762 331600
19030C31600L5236R8353N9084k53400J29721K08608L3661J5669j24487j28659
$$ 331600 366836 465189 524273 270873 400594 609202 642863 658532 534045 405386
19020D05386l50865J2851O2540n0162K45849L60602j80933k60319j32635o8225
$$ 405386 54521 67372 129912 79750 325599 686201 505268 244949 112314 44089
19010D4089K86193J45795J11049r641k8062R232L580R4746j82018k75785K76J81073
$$ 44089 330282 476077 587126 577485 549423 558655 562235 656981 474963 199178 199454 380527
18998C80527k08843L9506J38548J89575q4337j74352j54129J4305p0271N1463
$$ 380527 171684 211190 349738 539313 454976 280624 126495 140800 70529 121992
18988A21992j2987l2092k36354J36997L18326J06016J32982l3488J56164j771
$$ 121992 109005 76913 -159441 -22444 295882 401898 534880 501392 657556 655785
18978F55785K3605j16560r7439K86619R0622J82863J26525k07395k34005k3176
$$ 655785 679390 562830 465391 752010 842632 1025495 1152020 944625 710620 687444
18968F87444L4277K56070j34440K5262R308j54961M669j65731L0551L11319J40924
$$ 687444 721721 977791 843351 868613 877921 722960 727629 561898 592449 903768 1044692
18957A044692q7399J4212m2365j72646k10108J22077R7138o6122k29494N2718
$$ 1044692 957293 971505 929140 756494 546386 668463 765601 699479 469985 522703
18947E22703j1795m4341M494J02099p1806j05284p1348k14270J43386L69489k9327
$$ 522703 510908 466567 471061 573160 501354 396070 324722 110452 253838 623327 594000
18936E94000j42065j47359k28171K03571n0020p2474M39064K97450Q1180j55894
$$ 594000 451935 304576 76405 279976 229956 157482 596546 893996 975176 819282
18926H19282N6792K31688q17m32620J21745J37350N123j39091J01330j26848p5809
$$ 819282 876074 1107762 1106945 674325 796070 933420 938543 799452 900782 773934 698125
18915F98125k06912j46964j1480J75333J6339J9907J20924Q5508K97730P8158
$$ 698125 491213 344249 332769 508102 524441 544348 665272 750780 1048510 1126668
18905A126668l58188j15287K64639j1667K57771L67625L26153Q1560Q5886q9955
$$ 1126668 768480 653193 917832 906165 1163936 1531561 1857714 1939274 2025160 1935205
18895A935205p5181K81708P8434j9353J79470J55574J70959J56345J03825K89504
$$ 1935205 1860024 2141732 2220166 2200813 2380283 2535857 2706816 2863161 2966986 3256490
18885C256490N77563O94293O06916M81637R35402J348245J867129K377322L420413
$$ 3256490 3834053 4528346 5135262 5616899 6552301 7900546 9767675 12144997 15565410
18876A5565410N214299Q521693J3703875J8982930K0768485J7979775J2604323
$$ 15565410 20779709 29301402 43005277 61988207 82756692 100736467 113340790
18869A13340790K948719m684317r986227j5707596j6176874j1909798p799150
$$ 113340790 116289509 111605192 101618965 85911369 69734495 57824697 50025547
18862E0025547n203393l921947l661227k908041k556065k424624k336255j580076
$$ 50025547 44822154 40900207 37238980 34330939 31774874 29350250 27013995 25433919
18854B5433919j476525j432004r98235r96853j211524r45615q30624q95581p24444
$$ 25433919 23957394 22525390 21527155 20530302 19318778 18373163 17542539 16646958 15922514
18845A5922514q63964j133142p48642q04688m03395k98250j68682l70107k19399
$$ 15922514 15058550 13925408 13176766 12372078 11968683 11670433 11501751 11131644 10912245
18836A0912245j22830j181M70101P92047R12621J211031J874492K757892L903677
$$ 10912245 10789415 10788234 11258335 12050382 12963003 14174034 16048526 18806418 22710095
18827B2710095N499833Q567504J3919992K0985214K7012647L0100161K9013915
$$ 22710095 28209928 36777432 50697424 71682638 98695285 128795446 157809361
18820A57809361K0085706R580386k362615j5272306k1141831k2898503k1679171
$$ 157809361 177895067 187475453 185112838 169840532 148698701 125800198 104121027
18813A04121027j5888059j0741439q048063o267148n295416m803404m254539l740737
$$ 104121027 88232968 77491529 69443466 63176318 57880902 53077498 48822959 45082222
18805D5082222l093649k860512k722416k724788k485511j959520j900023j719728
$$ 45082222 41988573 39128061 36405645 33680857 31195346 29235826 27335803 25616075
18797B5616075j732308j591434j533563j426020j264793j353943j273773r03480
$$ 25616075 23883767 22292333 20758770 19332750 18067957 16714014 15440241 14536761
18789A4536761m77260n75349r02518o36788n41984m79001q6629k3713J21433K94431
$$ 14536761 14059501 13484152 12581634 11944846 11402862 10923861 10837232 10813519 10934952 11229383
18779A1229383Q70109J040541J861229K586858M256546P545387J2105375J4634901
$$ 11229383 12099492 13140033 15001262 17588120 21844666 29390053 41495428 56130329
18771E6130329J3586492J0951692M804207j917607n854902j0213373j3024144
$$ 56130329 69716821 80668513 85472720 83555113 77700211 67486838 54462694
18764E4462694j0138493o673549m431065l106885k355103k430288k120452j816346
$$ 54462694 44324201 37650652 33219587 30112702 27757599 25327311 23206859 21390513
18756B1390513j769631j568560j254748j138073j028629j040785j045399r82053
$$ 21390513 19620882 18052322 16797574 15659501 14630872 13590087 12544688 11562635
18748A1562635r04222o57061l69201k78845r20357o68324l86171l73567p0525
$$ 11562635 10658413 10001352 9632151 9353306 8432949 7764625 7378454 7004887 6934362
18739F934362j90865o29415m64934k73463m89254l58561n70447j00580k70312
$$ 6934362 6743497 6114082 5649148 5375685 4886431 4527870 3957423 3856843 3586531
18730C586531j43329k96393k09661j24085j77546k12870j99890O617j00971k93544
$$ 3586531 3443202 3146809 2937148 2813063 2635517 2422647 2222757 2229374 2128403 1834859
18720A834859l83368L5034K17762j30368j75990p8617j00965j96946l07932j31845
$$ 1834859 1451491 1486525 1704287 1573919 1397929 1319312 1218347 1021401 713469 581624
18710E81624O9346J61370j9367N1427P0864R8672j32931q017k28613j31416J62525
$$ 581624 650970 812340 792973 844400 915264 1013936 881005 872988 644375 512959 675484
18699F75484k10601K6320K50679L34315J11598r1532N6982j7708l6343k93947
$$ 675484 464883 491203 741882 1076197 1187795 1096263 1153245 1135537 1099194 805247
18689H05247k79831j20789J03348p6644q1990K32306k0614Q5273N0584J79828
$$ 805247 525416 404627 507975 431331 349341 581647 561033 646306 696890 876718
18679H76718K25248l3117P8112j9460k25233k13998j10963J32585r7043l57835
$$ 876718 1101966 1068849 1146961 1127501 902268 688270 577307 709892 612849 255014
18669B55014p7018j3922n1308m9056K5001P2167N7012K95069R0129k35313o2199
$$ 255014 177996 164074 112766 63710 88711 160878 217890 512959 603088 367775 305576
18658C05576m9044O984j23385j25033m5333j61817K1808K79154K2302o22k16888
$$ 305576 256532 263516 140131 15098 -30235 -192052 -170244 108910 131212 130590 -86298
18647h6298m17627M3105K76145K77787J00492l5726m9985n2614K83703J15796
$$ -86298 -503925 -460820 -184675 93112 193604 157878 107893 55279 338982 454778
18637D54778l9487k52299j84576j653N5135j436J68190L1385L57616J25007k31287
$$ 454778 415291 162992 -21584 -23237 31898 30462 198652 230037 587653 712660 481373
18626D81373k15275L9051J2935j89071j77960K14555J25741j00667K0329J18795
$$ 481373 266098 305149 318084 129013 -48947 165608 291349 190682 211011 329806
18616C29806j45501n6270P9215R9684R0075j06745l1136j7460j57485m4800J4477
$$ 329806 184305 128035 207250 306934 397009 290264 259128 241668 84183 39383 53860
18605E3860O3508K0605k4930j58507n8478O223Q9811j72279j59525J64786N1462
$$ 53860 117368 137973 113043 -45464 -103942 -97719 -7908 -180187 -339712 -174926 -123464
18594a23464k2384N8082Q0777J94551M7432o7830K02828l5277n0521j54434N1883
$$ -123464 -145848 -87766 -6989 187562 234994 167164 369992 334715 284194 129760 181643
18583A81643j35438n3559J70856L8424j55517K16654L93202j03863j74354k14542
$$ 181643 46205 -7354 163502 201926 46409 263063 656265 552402 378048 163506
18573A63506j5140r796J63714O9124j89797k21759j42379M8812J72744k0846K3127
$$ 163506 148366 138570 302284 371408 181611 -40148 -182527 -133715 39029 18183 41310
18562D1310l4105k41592q9093J03945L05110J08429O3229M1455k2772r2873r6521
$$ 41310 7205 -234387 -323480 -219535 85575 194004 257233 298688 275916 183043 86522
18551H6522L27689L4360j80602j23541N2691j17533p681M35617J5460j87068k29385
$$ 86522 414211 448571 267969 144428 197119 79586 71905 507522 522982 335914 106529
18540A06529N9709J63521J93269n2576q3585p4906l4220m2646M3605o4116j13171
$$ 106529 166238 329759 523028 470452 386867 311961 277741 235095 278700 214584 101413
18529A01413J20971o4111r6594J13544P7790M3952r6129k04l80115j87752K38886
$$ 101413 222384 158273 61679 175223 253013 296965 200836 200632 -179483 -367235 -128349
18518a28349K78622q6244k36193O6328J10322M4241j91869k69318O5564L46937
$$ -128349 150273 64029 -172164 -105836 4486 48727 -143142 -412460 -346896 41
18508D1J07997P807J1022l19424l68004N6909M99883J44786j30456j18727k24200
$$ 41 108038 115845 126867 -192557 -560561 -503652 -3769 141017 10561 -108166 -332366
18497c32366L56262k8534l89973j81472o2650K70035K76750Q0746M48515j2499
$$ -332366 23896 -4638 -394611 -576083 -638733 -368698 -91948 -11202 437313 424814
18487D24814j12542k40443k60252k81310j78646K02519K17830M7566k2766Q5627
$$ 424814 312272 71829 -188423 -469733 -648379 -445860 -228030 -180464 -203230 -117603
18477a17603J15739R4144J34727j15001r2992K30660j67711j48084J79754q7636
$$ -117603 -1864 92280 227007 112006 19014 249674 81963 -66121 113633 25997
18467B5997k4230R0682r3185j17035j7279K34447J98475j4184j14544K08134J28771
$$ 25997 1767 92449 -736 -117771 -135050 99397 297872 283688 169144 377278 506049
18456E06049r2861k77528o11r0226j6433k10372K1244J78650J06444R8415Q8794
$$ 506049 413188 135660 135049 44823 28390 -181982 -160738 17912 124356 222771 311565
18445C11565j47571l26654k03589N4178Q5224K50577j58013q3112J65728O8014
$$ 311565 163994 -162660 -366249 -312071 -226847 23730 -134283 -217395 -51667 16347
18435A6347q295p5647l24225K13678K85570L986L2253k65122j81196J25988J58007
$$ 16347 8052 -67595 -391820 -178142 107428 111414 143667 -121455 -302651 -176663 -18656
18424a8656j46913N9457j82416K7464M5204K46072K91790O6575l81454k15819
$$ -18656 -165569 -106112 -288528 -261064 -215860 30212 322002 388577 7123 -208696
18414b08696K94481J15142Q4546M2612L6356m3072O7532o8406k60383k37662j36493
$$ -208696 85785 200927 285473 328085 364441 321369 388901 320495 60112 -177550 -314043
18403c14043o7230J48358q8174o5116R2855J04887j64269Q770Q1072o3330K13193
$$ -314043 -381273 -232915 -321089 -386205 -293350 -188463 -352732 -343962 -262890 -326220 -113027
18392a13027J13003j05627k44657q1947q8383L21051K27549P980J80844r1854
$$ -113027 -24 -105651 -350308 -432255 -520638 -199587 27962 35942 216786 124932
18382A24932j66409k3910q0817j44120j73881j72296j74456K56808L21550r9585
$$ 124932 -41477 -65387 -146204 -290324 -464205 -636501 -810957 -554149 -232599 -332184
18372c32184q3782J90704J70355M0438k09458N9739K3824O8464K75410k06905
$$ -332184 -415966 -225262 -54907 -14469 -223927 -164188 -140364 -71900 203510 -3395
18362c395p9757q1415J52751j19892R548J70351K552J4460J3445j50625r797J96089
$$ -3395 -83152 -164567 -11816 -131708 -122160 48191 50743 65203 78648 -71977 -81774 114315
18350A14315K17477K38980q0151q5258J4728J5556m7753J43620K861j99207k26243
$$ 114315 331792 570772 490621 405363 420091 435647 387894 531514 534375 335168 108925
18339A08925m8886r3023j68862R5878N3043k2887j35146j9058J89783j0859l4006
$$ 108925 60039 -32984 -201846 -105968 -52925 -75812 -210958 -230016 -40233 -51092 -85098
18328h5098L4181K676j16540j05595J31981Q5776n4560L031k5750q8751K01611
$$ -85098 -50917 -48241 -164781 -270376 -138395 -52619 -107179 -104148 -129898 -218649 -17038
18317a7038K23689l7118n5406k41431j89755P8348K95948J8708j81920j95591
$$ -17038 206651 169533 114127 -127304 -317059 -238711 57237 75945 -105975 -301566
18307c01566q2263L8705K70259m8724J34673Q05O5083K31891M5915l4703J70202
$$ -301566 -383829 -345124 -74865 -123589 11084 11889 76972 308863 354778 320075 490277
18296D90277M6597J70138K51623k37052k08607J09491j00976j09972K0940j13129
$$ 490277 536874 707012 958635 721583 512976 622467 521491 411519 432459 319330
18286C19330J22265l1758k44194J60J39847N1511k52925k12928k23686J04608
$$ 319330 441595 409837 165643 165803 305650 357161 104236 -108692 -332378 -227770
18276b27770K75066p0364L9602J27005q4068k6572J29390k4368J01245p9849J82435
$$ -227770 47296 -23068 16534 143539 59471 32899 162289 137921 239166 159317 341752
18265C41752O488m9333k76150J7551K09572l19492n0870r0887L77421J21647L3941
$$ 341752 348240 298907 22757 40308 249880 -69612 -120482 -211369 166052 287699 321640
18254C21640l4425n3049m9499k56335p6167R0470J34250K15425K4788p5131O3114
$$ 321640 287215 234166 184667 -71668 -147835 -57365 76885 292310 317098 241967 305081
18243C05081J18036J0989k94102o8752J98657K32169K329j30416r6080l11546
$$ 305081 423117 434106 140004 71252 269909 502078 504407 373991 277911 -33635
18233c3635r5901J52288R107J4628o1023r3437o836n6296k9897J58614J74312
$$ -33635 -129536 22752 31859 46487 -14536 -107973 -114809 -171105 -201002 -42388 131924
18222A31924N2068j21654Q9654q3907O6536j49683j27904J75295j09502l5536
$$ 131924 183992 62338 151992 68085 134621 -15062 -142966 32329 -77173 -112709
18212a12709J71359r8326R5730r4746j19847n0046J1737K3813L5180J11106K88344
$$ -112709 58650 -39676 56054 -38692 -158539 -208585 -196848 -173035 -137855 -26749 261595
18201B61595j68098k75165K33454J38005j0756m0751j75753K9039J13534K49384
$$ 261595 93497 -181668 51786 189791 179035 138284 -37469 -8430 105104 354488
18191C54488r1366p5598l31412j65609j33014j10392L9040J14087J27540J27526
$$ 354488 263122 187524 -143888 -309497 -442511 -552903 -513863 -399776 -272236 -144710
18181a44710Q4031o3615J68587J81008p826j49636k22262j31883p8329O451N4567
$$ -144710 -60679 -124294 44293 225301 217475 67839 -154423 -286306 -364635 -358184 -303617
18170c03617j291L69644Q7108M9188j30419k89606p950Q0044J60103K50696r9980
$$ -303617 -304908 64736 151844 201032 70613 -218993 -226943 -146899 13204 263900 163920
18159A63920j42565O3613J7767P0128l02980k54498J4769n3107L5872O011r9856
$$ 163920 21355 84968 102735 172863 -130117 -384615 -369846 -422953 -387081 -381070 -480926
18148d80926K71784J78516m8705l7457k89332j15744N3032K9781K39915O0859
$$ -480926 -209142 -30626 -79331 -116788 -406120 -521864 -468832 -439051 -199136 -138277
18138a38277j79490j25206q8665J92303J00491J39509k1526q3448L70093j360
$$ -138277 -317767 -442973 -531638 -339335 -238844 -99335 -120861 -204309 165784 164424
18128A64424j91620m3990N5509l1042J57117J10100J36500r4759j36044p5270
$$ 164424 -27196 -71186 -15677 -46719 110398 220498 356998 262239 126195 50925
18118E0925k06834R1792J44197k39651N5136Q2198o0328n1350l74606k0622J74817
$$ 50925 -155909 -64117 80080 -159571 -104435 -22237 -82565 -133915 -508521 -529143 -354326
18107c54326J62959J4904J996r2325j57618Q734N0936J83222k9608M2392J11367
$$ -354326 -191367 -176463 -174467 -266792 -424410 -415676 -364740 -181518 -211126 -168734 -57367
18096e7367J12864L6641r8561k88268j88439P0881K93703L13862R6489m00228
$$ -57367 55497 92138 -6423 -294691 -483130 -412249 -118546 195316 291805 -108423
18086a08423j22619j30154n4116K44929K78657j66055r1321j74376k67439l7084
$$ -108423 -231042 -361196 -415312 -170383 108274 -57781 -149102 -323478 -590917 -628001
18076f28001M7182P5650L68102R3012j51451o9730p7330J82406K39481Q7879l04597
$$ -628001 -580819 -505169 -137067 -44055 -195506 -265236 -342566 -160160 79321 167200 -137397
18065a37397j33672J44557j0240K85516Q8147K7849r7086K9886k48203J236K2662
$$ -137397 -271069 -126512 -136752 148764 236911 264760 167674 197560 -50643 -49407 -26745
18054b6745r9052K21165p1200p7644k47440j29157J49890M56356n7873J04196
$$ -26745 -125797 95368 24168 -53476 -300916 -430073 -280183 176173 118300 222496
18044B22496L090j47639l5244J1334q8018r3061j39693J44877J28786p8918r9118
$$ 222496 225586 77947 42703 54037 -33981 -127042 -266735 -121858 6928 -71990 -171108
18033a71108P5940K25799J96208j4371k23418p5216j66354j33734J20221L32203
$$ -171108 -95168 130631 326839 312468 89050 13834 -152520 -286254 -166033 166170
18023A66170m3571j41216J65373r8908j59983n6726J1569j25023K71313J11816
$$ 166170 122599 -18617 146756 47848 -112135 -168861 -157292 -282315 -11002 100814
18013A00814J88801L05364j26346j54063j36650J48413J92528j16691q9424j20252
$$ 100814 289615 594979 468633 314570 177920 326333 518861 402170 312746 192494
18003A92494k31943L6340k04146j61736m6257M1031J19402K52401J19432j12374
$$ 192494 -39449 -3109 -207255 -368991 -415248 -374217 -254815 -2414 117018 4644
17993D644K9290m0060J9595k6288k16764k09386k2923R4064O7574J47020L6080
$$ 4644 33934 -6126 13469 -12819 -229583 -438969 -461892 -367828 -300254 -153234 -117154
17982a17154j88965K8948J49201J80801J35383M5821J67302J99390k2318k98406
$$ -117154 -306119 -277171 -127970 52831 188214 234035 401337 600727 578409 280003
17972B80003K01376K32534j06899k34677k52515L9012j33285j77157j16518J82618
$$ 280003 481379 713913 607014 372337 119822 158834 25549 -151608 -268126 -85508
17962h5508K34225j33246m2146M7617r8980J49286N6450K2060j5845M8230q2022
$$ -85508 148717 15471 -26675 20942 -78038 71248 127698 149758 133913 182143 100121
17951A00121N6839o9210j23246Q2154K95391N3399j85510l60414p8659K09406
$$ 100121 156960 87750 -35496 46658 342049 395448 209938 -150476 -229135 -19729
17941a9729J15595R6794j16248m9192k03831m46415p1897J62930K19297J28819
$$ -19729 95866 192660 76412 27220 -176611 -623026 -694923 -531993 -312696 -183877
17931a83877P9211J64779k49452p6714J91417O298M6780k78174L8936K33126J92252
$$ -183877 -104666 60113 -189339 -266053 -74636 -68338 -21558 -299732 -260796 -27670 164582
17920A64582n2823J00167j07187o0971k8952q701n9722j87687j518K78604J37804
$$ 164582 111759 211926 104739 43768 14816 6115 -53607 -241294 -242812 35792 173596
17909A73596K00353j03258l46142j23505L6208R566k9660j92450K21813K53878
$$ 173596 373949 270691 -75451 -198956 -162748 -153182 -182842 -375292 -153479 100399
17899A00399k44689j88958l0002K00708J85594J6303k11126l1254J40055J09787
$$ 100399 -144290 -333248 -363250 -162542 23052 39355 -171771 -203025 -62970 46817
17889D6817J4856J33546n2435K57761Q7931j45407n6999j19880k49766J9129K85166
$$ 46817 61673 195219 142784 400545 488476 343069 286070 166190 -83576 -64447 220719
17878B20719K82536l6038k5922O1842r9503L862L0178r0083j64764k33670l46028
$$ 220719 503255 467217 441295 503137 403634 407496 437674 347591 182827 -50843 -396871
17867c96871j04913n4506J33199K54436K05737M72l75456k26674K03370L16309
$$ -396871 -501784 -556290 -423091 -168655 37082 37554 -337902 -564576 -361206 -44897
17857d4897J53432q8269J50475J4232k6771j74763j09424j3203o175m6725R039
$$ -44897 108535 20266 170741 184973 158202 -16561 -125985 -139188 -145363 -192088 -183049
17846a83049J057j46000m8885J80971K52860K48142K14006n1681K314l36888l88383
$$ -183049 -181992 -327992 -376877 -195906 56954 305096 519102 467421 469735 132847 -255536
17835b55536k26925K56621K84413j9013j58923k66161J36979o1483P1210J87174
$$ -255536 -482461 -225840 58573 39560 -119363 -385524 -248545 -310028 -238818 -51644
17825e1644k58510l8466J08863l0233J19430p3563r6945q3188J2937m3539r6422
$$ -51644 -310154 -348620 -239757 -269990 -150560 -224123 -321068 -404256 -391319 -434858 -531280
17814e31280M75286J21996l4432R3311Q4636Q1220K47745O1557j98231k85101
$$ -531280 -55994 66002 31570 124881 209517 290737 538482 600039 401808 116707
17804A16707l12324j14035K24156J18314J24720J84845n5850r3702r6458o6333
$$ 116707 -195617 -309652 -85496 32818 157538 342383 286533 192831 96373 30040
17794C0040j21183o003o4468N3072o3176j10012L78486J36980j60719L8364q6413
$$ 30040 -91143 -97146 -161614 -108542 -171718 -281730 96756 233736 73017 111381 24968
17783B4968k90579l81935K4904K42879K24148J66913J50997K91702J70017n5865
$$ 24968 -265611 -647546 -622642 -379763 -155615 11298 162295 453997 624014 568149
17773E68149m08495o1077j46142j01527J9273L0790j28817P4111K58145M1481
$$ 568149 159654 98577 -47565 -149092 -129819 -99029 -227846 -153735 104410 145891
17763A45891k24381j43633j35646J58325J13836l7231O8173K78594M8001j39725
$$ 145891 -78490 -222123 -357769 -199444 -85608 -122839 -54666 223928 271929 132204
17753A32204l48431j62456r9013J41647R5046K616M8039l5073M9004j14819j64814
$$ 132204 -216227 -378683 -477696 -336049 -241003 -238387 -190348 -225421 -176417 -291236 -456050
17742d56050K11892K24670J84580o6980n4356o2612k05309l22810K6650J71335
$$ -456050 -244158 -19488 165092 98112 43756 -18856 -224165 -546975 -520325 -348990
17732c48990M21100M7576j05915j54611k39812J08911k9134J04027L41097O447
$$ -348990 72110 119686 13771 -140840 -380652 -271741 -300875 -196848 144249 150696
17722A50696j97494O4714n7330j08029j00350K92827J96997q1328q9270k823j05022
$$ 150696 -46798 17916 -39414 -147443 -247793 45034 242031 160703 71433 68610 -36412
17711c6412j58671q737j42126K7939j34025l2445L8101J61424L69597L54196j49247
$$ -36412 -195083 -203820 -345946 -318007 -452032 -484477 -446376 -284952 84645 438841 289594
17700B89594m05282j03239l0461p5720Q6897J97573J01566J5219j73761L5667
$$ 289594 -115688 -218927 -249388 -325108 -238211 -40638 60928 76147 -97614 -61947
17690f1947K95996j30188l37180M0417Q7863M325r0371p8287j48608N8404K54921
$$ -61947 234049 103861 -233319 -192902 -105039 -100714 -191085 -269372 -417980 -359576 -104655
17679a04655P7836J51188J83768k27972k68048o3457k6320J50127K37850l77366
$$ -104655 -26819 124369 308137 80165 -187883 -251340 -277660 -127533 110317 -267049
17669b67049k30427K57398J65033J44212R5905O7969j11595n5041O5240J70404
$$ -267049 -497476 -240078 -75045 69167 165072 233041 121446 66405 131645 302049
17659C02049J74029M2543k69314j63968R001K41677j11964N063Q5724j27338j86437
$$ 302049 476078 518621 249307 85339 94340 336017 224053 229116 314840 187502 1065
17648A065k7367j05794k32159j1392K2480Q8625k03898j19383M2998R1976J25614
$$ 1065 -26302 -132096 -364255 -375647 -353167 -264542 -468440 -587823 -544825 -452849 -327235
17637c27235J51330O0306K40301J32670R6209j19494j23486j47143p768Q642m2596
$$ -327235 -175905 -115599 124702 257372 353581 234087 110601 -36542 -44310 -35668 -78264
17626g8264L5287k30360p1562K66581M6084j15487J17721k9404r730L23161J63377
$$ -78264 -42977 -273337 -344899 -78318 -32234 -147721 -30000 -59404 -69134 254027 417404
17615D17404J40218M0615o3130j29835Q7872k28098L0316p977j57798k82596j65930
$$ 417404 557622 598237 535107 405272 493144 265046 295362 287385 129587 -153009 -318939
17604c18939j18560m705J89067J28990j05970j17621K5459M409J18415K58657
$$ -318939 -437499 -442204 -253137 -124147 -230117 -347738 -322279 -317870 -199455 59202
17594E9202k08948p8036J22562O4033p1951k44753j20030K01018Q0430j16670
$$ 59202 -149746 -227782 -105220 -41187 -113138 -357891 -477921 -276903 -196473 -313143
17584c13143J34719Q0700k377n5477o3452J95231L45117L4201l43882j22315J73743
$$ -313143 -178424 -97724 -100101 -155578 -219030 -23799 321318 355519 11637 -110678 63065
17573F3065n2481J19321K9773j86578k70305m5718o9956M4693j45148j05506R0723
$$ 63065 10584 129905 159678 -26900 -297205 -342923 -412879 -368186 -513334 -618840 -528117
17562e28117L05801K98849j93720O265J02504k70992K13220J51244n6911j15157
$$ -528117 -222316 76533 -117187 -110922 -8418 -279410 -66190 85054 28143 -87014
17552h7014l29078k58683L17622K91212N3780k275k60941L6310J45613j51634
$$ -87014 -416092 -674775 -357153 -65941 -12161 -14436 -275377 -239067 -93454 -245088
17542b45088k15696K04685J51090m4683J40559O7787k45062O2689r834j86332
$$ -245088 -460784 -256099 -105009 -149692 -9133 58654 -186408 -123719 -133553 -319885
17532c19885p2839k01498J16576K69445p370K3139n0414J73900K86951J49262
$$ -319885 -392724 -594222 -477646 -208201 -215571 -192432 -242846 -68946 218005 367267
17522C67267P8196j97135k19670j63788k25864K15777K88364K10170O411j41379
$$ 367267 445463 248328 28658 -135130 -360994 -145217 143147 353317 359728 218349
17512B18349l77260j10023r2877j56769K00444L32237O3068j77279O7928K26714
$$ 218349 -158911 -268934 -361811 -518580 -318136 14101 77169 -100110 -32182 194532
17502A94532j22106l04730j47848J87356j9606j17550Q9397Q0815j19341o4973
$$ 194532 72426 -232304 -380152 -192796 -212402 -329952 -240555 -159740 -279081 -344054
17492c44054J07513K03537M8968J16392j71167j83819R9480J16512K71726L3826
$$ -344054 -236541 -33004 15964 132356 -38811 -222630 -123150 -6638 265088 298914
17482B98914l76193k90755K57371J38312r2019p9169J71034j66240j71391j71214
$$ 298914 -77279 -368034 -110663 27649 -64370 -143539 27495 -138745 -310136 -481350
17472d81350j41224L2965L17990J47557k38996j30693J5269K26819R6402j73325
$$ -481350 -622574 -589609 -271619 -124062 -363058 -493751 -478482 -251663 -155261 -328586
17462c28586O5399L81387k09991j64195q047q00m7224J7361j09826L8652J80103
$$ -328586 -263187 118200 -91791 -255986 -264033 -264833 -312057 -294696 -404522 -365870 -185767
17451a85767K241K11981k47032j66193K67316R347j19610j1229j82328J45310
$$ -185767 -183526 28455 -218577 -384770 -117454 -108107 -227717 -238946 -421274 -275964
17441b75964K2149L5885k5411L24687J29139l5945k95403q9532M8195j13633l7901
$$ -275964 -253815 -217930 -243341 81346 210485 174540 -120863 -210395 -162200 -275833 -313734
17430c13734K14797J48304j26076j28838K5300j0507J1705J65753Q8817q8073
$$ -313734 -98937 49367 -76709 -205547 -180247 -190754 -179049 -13296 75521 -12552
17420a2552M3148k9548r1071K425j8084k3332k1524k8900L3434J05393q3546m7953
$$ -12552 30596 1048 -90023 -87598 -105682 -129014 -150538 -179438 -146004 -40611 -124157 -172110
17408a72110L23922R4570k35794l49954j24255j93189J69512J80513M0565J56343
$$ -172110 151812 246382 10588 -339366 -463621 -656810 -487298 -306785 -266220 -109877
17398a09877j01730o0029m2421K96448L7464k19514J5804P9258K00227k2215j4881
$$ -109877 -211607 -271636 -314057 -17609 19855 -199659 -183855 -104597 95630 73415 58534
17387E8534p4836j04785k79669Q9265Q6735J36598n188j12392N3743J70105j00680
$$ 58534 -16302 -121087 -400756 -311491 -224756 -88158 -93346 -205738 -151995 18110 -82570
17376h2570k23027j04032J28162K78809m6144p9985j53974m6639p546L6783j10172
$$ -82570 -305597 -409629 -281467 -2658 -48802 -128787 -282761 -329400 -336946 -300163 -410335
17365d10335O6161J84763J62629N6576O3832m92399l57695J8982J05534P6007
$$ -410335 -344174 -159411 3218 59794 123626 -368773 -726468 -707486 -601952 -525945
17355e25945K3969m8194k0636K5377K32242K70204L3683k85755j27809J65924
$$ -525945 -501976 -550170 -570806 -545429 -313187 -42983 -9300 -295055 -422864 -256940
17345b56940O0457k0024J12392J84482P7549m28484k06094J24042J33236k8042
$$ -256940 -196483 -216507 -104115 80367 157916 -270568 -476662 -352620 -219384 -247426
17335b47426P6232o0746j92098j74202J00751l4527K52701L65455J38568P813
$$ -247426 -171194 -231940 -424038 -598240 -497489 -532016 -279315 86140 224708 232521
17325B32521O1054Q0202J21377k36787k28081k0808j90756J46834k717k98894
$$ 232521 293575 373777 495154 258367 30286 9478 -181278 -34444 -37161 -336055
17315c36055j04138j1646P6838L7232Q4490O2185J5377j42185k7881p8332j95253
$$ -336055 -440193 -451839 -375001 -337769 -253279 -191094 -175717 -317902 -345783 -424115 -619368
17304f19368j99628J96279L05876K03663J05719k3470J26688r9055m7507K37941
$$ -619368 -818996 -622717 -316841 -113178 -7459 -30929 95759 -3296 -50803 187138
17294A87138J17235l47257j44483K07989L20318N332j26765O3622J22403j24027
$$ 187138 304373 -42884 -187367 20622 340940 346272 219507 283129 405532 281505
17284B81505O914M0630j48265k08659j0472j70993n9679L17515J60322K2129o8964
$$ 281505 288419 329049 180784 -27875 -38347 -209340 -269019 48496 208818 230947 161983
17273A61983j05411M3582p7671j92216q8133J42582K24397M9993j2616j12357
$$ 161983 56572 100154 22483 -169733 -257866 -115284 109113 159106 146490 34133
17263C4133N2381K9963Q9985j87680k06316J67611m2011Q7403j26323r7470N0590
$$ 34133 86514 116477 206462 18782 -187534 -19923 -61934 25469 -100854 -198324 -147734
17252a47734k1149J17780K54880m8598n8199M9600K83796r1620k03242l62304
$$ -147734 -168883 -51103 203777 155179 96980 146580 430376 338756 135514 -226790
17242b26790j449l0509p7579j42549j89768Q9963K29950K55265J17457N043k16932
$$ -226790 -228239 -258748 -336327 -478876 -668644 -578681 -348731 -93466 23991 29034 -187898
17231a87898k25574K55633j5930J32298p0041m6469M0640J06167n3416O7680K03059
$$ -187898 -413472 -157839 -173769 -41471 -111512 -157981 -117341 -11174 -64590 3090 206149
17220B06149O2040j39205K0584K28937j32508j86549p5583k10016r6885L03097
$$ 206149 268189 128984 149568 378505 245997 59448 -16135 -226151 -323036 -19939
17210a9939J22445l7889J66545p8114k39228P027J81151J44044q8095k18381L8449
$$ -19939 102506 64617 231162 153048 -86180 -79153 101998 246042 157947 -60434 -21985
17199b1985j59647k82609J5952J00619J14162K72721L42157J29207J15930l30649
$$ -21985 -181632 -464241 -448289 -347670 -233508 39213 381370 510577 626507 295858
17189B95858m50980l02340J32056K12506k3393o7142O3296J77351N2839M4612
$$ 295858 -155122 -457462 -325406 -112900 -136293 -203435 -140139 37212 90051 134663
17179A34663j02937O065k0276q8190N359j74103j20360O3568J65643J78042J00536
$$ 134663 31726 37791 17515 -70675 -65316 -239419 -359779 -296211 -130568 47474 148010
17168A48010j04777j41321q4716J19881J0188j32540l5890j81786m1193J08047
$$ 148010 43233 -98088 -182804 -62923 -52735 -185275 -221165 -402951 -444144 -336097
17158c36097K746K811o7561M8575L1760l994J92285K48379n0640M6286L7857R2517
$$ -336097 -333351 -330540 -398101 -349526 -317766 -321760 -129475 118904 68264 114550 152407 244924
17146B44924p0782J81027M500l74303j86923J8880j13646k563J20270J62123J78328
$$ 244924 174142 355169 359669 -14634 -201557 -182677 -296323 -298886 -178616 -16493 161835
17135A61835K3506k08675k60850K9345O7618K11094O6062j73717J78971P4356
$$ 161835 185341 -23334 -284184 -254839 -187221 23873 89935 -83782 95189 169545
17125A69545p9880J3089j67181L2866n5726j62214K08508M22466j9057k71043
$$ 169545 89665 102754 -64427 -31561 -87287 -249501 -40993 381473 362416 91373
17115I1373j27824j93745m5270K82741L04348j0648k34369J76986L0798k56843
$$ 91373 -36451 -230196 -275466 7275 311623 300975 66606 243592 274390 17547
17105A7547L3241R1507J42664q6345l48708P9353L25070O5216k65963o4485J23845
$$ 17547 50788 142295 284959 198614 -150094 -70741 254329 319545 53582 -10903 112942
17094A12942j29241p2514k14576j7360M5320L543J2651J1456J82202k0468L8294
$$ 112942 -16299 -88813 -303389 -320749 -275429 -271886 -259235 -247779 -65577 -86045 -47751
17083d7751K00056N6534j24108n7497j61442j07907K7683L7223J47997j04331
$$ -47751 152305 208839 84731 27234 -134208 -242115 -214432 -177209 -29212 -133543
17073a33543j42024P1186n5632L4438n1119O1519k2600J63756r3720P4208o3624
$$ -133543 -275567 -204381 -260013 -225575 -276694 -215175 -237775 -74019 -167739 -93531 -157155
17062a57155k42170m8273M1593J99508J46869J66639K1146J38321L0384J59005
$$ -157155 -399325 -447598 -406005 -206497 -59628 107011 128157 266478 296862 455867
17052D55867l55366k13627J96152P2534k30265j27124R1885K90666K14215N8376
$$ 455867 100501 -113126 83026 155560 -74705 -201829 -109944 180722 394937 453313
17042D53313k02525j99081k83015j3296K06252M0906l1648n9830L5883j58933
$$ 453313 250788 51707 -231308 -244604 -38352 2554 -29094 -88924 -53041 -211974
17032b11974n40J30747j18720K10529L46242r0608m7999L4670k48049j23801k77927
$$ -211974 -212514 -81767 -200487 10042 356284 265676 217677 252347 4298 -119503 -397430
17021c97430N6681N4626J26072J92502r5381O086J38880k2496q0258o3741K25266
$$ -397430 -340749 -286123 -160051 32451 -62930 -56844 82036 59540 -20718 -84459 140807
17010A40807k67445j03964K50307J82181j01638j27839k74241P3270K91124m9051
$$ 140807 -126638 -230602 19705 201886 100248 -27591 -301832 -228562 62562 13511
17000A3511P4520M01331j10303j47420k8922o0926n9468r7419L01797m4565n6769
$$ 13511 88031 489362 379059 231639 202717 141791 82323 -15096 286701 242136 185367
16989A85367r0169j75366n0636J52688Q2293n4419N0548n0283l7839j12706j94428
$$ 185367 95198 -80168 -130804 21884 104177 49758 100306 50023 12184 -100522 -294950
16978b94950K01248r4207j4011j5530N623M88K09K31398j5917o8637j37871l28130
$$ -294950 -93702 -187909 -201920 -217450 -211827 -211339 -211130 20268 4351 -64286 -202157 -530287
16966e30287j29360K59711J12237j02001j80809O2467J03107j06594K17692L12380
$$ -530287 -659647 -399936 -287699 -389700 -570509 -508042 -404935 -511529 -293837 18543
16956A8543r0302j09048l24806p7295J93030o9380n941L32432K31375p7529r9704
$$ 18543 -71759 -180807 -505613 -582908 -389878 -459258 -465199 -132767 98608 21079 -78625
16945g8625J34575k08915n2175K7503J9245Q6303Q404p3503r9760q213k54164
$$ -78625 55950 -152965 -205140 -177637 -158392 -72089 -63685 -137188 -236948 -245161 -499325
16934d99325J42514J93631P7723Q3301J4623j94307j57218M4772j18272k06131
$$ -499325 -356811 -163180 -85457 -2156 12467 -181840 -339058 -294286 -412558 -618689
16924f18689N6182K15026Q5468k90002k34655R3800K20537K94959j32554L0183
$$ -618689 -562507 -347481 -262013 -552015 -786670 -692870 -472333 -177374 -309928 -279745
16914b79745K16894J71006J25759j92832j09011p7559j24873k18023m4044J42271
$$ -279745 -62851 108155 233914 41082 -67929 -145488 -270361 -488384 -532428 -390157
16904c90157o219j4759J10250K27450R9623q9776J58334j83888m01154J70219
$$ -390157 -396376 -411135 -300885 -73435 26188 -63588 94746 -89142 -490296 -320077
16894c20077j22910J85396R7507j43550K15836J07400k46856J19145N26594J00495
$$ -320077 -442987 -257591 -160084 -303634 -87798 19602 -227254 -108109 418485 518980
16884E18980l00310m96974l1363K85840k9217r3008J40848J21752j58078j03916
$$ 518980 218670 -278304 -309667 -23827 -53044 -146052 -5204 116548 -41530 -145446
16874a45446J78888M9482k2813q3329j16190j08641N1779J86846k5468p4055k627
$$ -145446 33442 82924 60111 -23218 -139408 -248049 -196270 -9424 -34892 -108947 -111574
16863a11574r4050R3004K27599K8897l28929J7877l8145K22425J4703r5225K1590
$$ -111574 -205624 -112620 114979 143876 -185053 -167176 -205321 17104 31807 -63418 -41828
16852d1828K1754M234J34425j52134k426n8420q6342p9218L56781N0106j07976
$$ -41828 -20074 -15840 118585 -33549 -35975 -94395 -180737 -259955 96826 146932 38956
16841C8956l6869J7869q9799j8429l79733j08487K16312K82311r6554j1681K28225
$$ 38956 2087 19956 -69843 -88272 -468005 -576492 -360180 -77869 -174423 -186104 42121
16830D2121P9096k96994j50865J52862M0652J83224J49264q8270O009j58161K1759
$$ 42121 121217 -175777 -326642 -173780 -133128 50096 199360 111090 117099 -41062 -19303
16819a9303J0873j85338P9672J23646j4978k69679M7638n8970J08910L7845j24072
$$ -19303 -8430 -193768 -114096 9550 -5428 -275107 -227469 -286439 -177529 -139684 -263756
16808b63756p2203N0883P3909K47222L45439k60657j84003r6509M6295p8379j15990
$$ -263756 -335959 -285076 -211167 36055 381494 120837 -63166 -159675 -113380 -191759 -307749
16797c07749J98827p4653J12841q7250r4919M9020K77785J78447J6814l8207M75
$$ -307749 -108922 -183575 -70734 -157984 -252903 -203883 73902 252349 269163 230956 231431
16786B31431k20172k78511J17665L59609L785o2096k37767j03778J03888K8497
$$ 231431 11259 -267252 -149587 210022 213807 151711 -86056 -189834 -85946 -57449
16776e7449J38072K6542p6465l04231j42602j49068K79250Q5115q0341R5983R5586
$$ -57449 80623 107165 30700 -273531 -416133 -565201 -285951 -200836 -281177 -185194 -89608
16765h9608q1852L396Q187j05931l6220J26355q2803j95199J8733J00391l4857
$$ -89608 -171460 -168064 -159877 -265808 -302028 -175673 -258476 -453675 -434942 -334551 -369408
16754c69408J46551Q7825j8847O7268p9019j15980m350R4513M3390k05279l4124
$$ -369408 -222857 -135032 -153879 -86611 -165630 -281610 -285960 -191447 -148057 -353336 -387460
16743c87460P0834j46608l7710J79971K10270K13522m815j68937j56390m0201
$$ -387460 -316626 -463234 -500944 -320973 -110703 102819 98004 -70933 -227323 -267524
16733b67524M0400L98054j51183k93688K63394K53378J3138j64534k29463R0988
$$ -267524 -227124 170930 19747 -273941 -10547 242831 255969 91435 -138028 -47040
16723d7040K08750K5304n8647M7898J2908n7031k71591j80358J74861J41080p1348
$$ -47040 161710 187014 128367 176265 189173 132142 -139449 -319807 -144946 -3866 -75214
16712g5214k978R1635J21863J590O5227j3467j25215j18618J8419J22852j9816
$$ -75214 -78192 13443 135306 136896 202123 188656 63441 -55177 -36758 86094 66278
16701F6278l56810q6308J59054J88452k7484k17445k5786p0581N5020k36559j97133
$$ 66278 -290532 -376840 -217786 -29334 -56818 -274263 -300049 -370630 -315610 -552169 -749302
16690g49302O5590J33471K75393M04967J34877J7260j08946l05723j32142J93141
$$ -749302 -683712 -550241 -274848 130119 264996 282256 173310 -132413 -264555 -71414
16680g1414J50075J12205K1869Q6123j68875q4689K92819L258l8274J54733q7161
$$ -71414 78661 190866 212735 298858 129983 45294 338113 341371 303097 457830 370669
16669C70669j31500J83710j13740k1937J45634L1406j74497l22275l23918L882
$$ 370669 239169 422879 309139 287202 432836 464242 289745 -32530 -356448 -352566
16659c52566K7505j25863q8270J79124K06155j76859p6879p6715M695O3374L26289
$$ -352566 -325061 -450924 -539194 -360070 -153915 -330774 -407653 -484368 -479673 -416299 -90010
16648i0010L5476p8769j37619J87496L40445M4937k23295j97215m7537k1907p726
$$ -90010 -54534 -133303 -270922 -83426 257019 301956 78661 -118554 -166091 -187998 -195724
16637a95724j4734j3376J68364J49704n5228k21046k45762P6525K7085L9126j7994
$$ -195724 -210458 -223834 -55470 94234 39006 -182040 -427802 -351277 -324192 -285066 -303060
16626c03060r598K44103n2602j06017P48j74367j68600J59812J23131M26585j0614
$$ -303060 -312658 -68555 -121157 -227174 -226426 -400793 -569393 -409581 -286450 140135 129521
16615A29521l72603N9137J85369j6693k794r8562m4682J78273J00317n1616n7120
$$ 129521 -243082 -183945 1424 -15269 -18063 -116625 -161307 16966 117283 65667 8547
16604H547j67042j71719p7866O9428K18941K13768O4546k27039j86323O761N0780
$$ 8547 -158495 -330214 -408080 -338652 -119711 94057 158603 -68436 -254759 -247998 -197218
16593a97218L5909M0091n2438J43555M074j22155j04018J84065o121O6061M6240
$$ -197218 -161309 -121218 -173656 -30101 -26027 -148182 -252200 -68135 -74256 -8195 38045
16582C8045K94603K45957P4762R97l11529j62605K89896M3802l11456j89935J24019
$$ 38045 332648 578605 653367 654364 342835 180230 470126 513928 202472 12537 136556
16571A36556n906K7150k70595k38751J40028j86524L07349K39733j28471j36232
$$ 136556 130650 157800 -112795 -351546 -211518 -398042 -90693 149040 20569 -115663
16561a15663n7194K7075j15636K8887Q3871J8002J45017K38440j42273j12916
$$ -115663 -172857 -145782 -261418 -232531 -148660 -130658 14359 252799 110526 -2390
16551b390J66439j28303j50887O9816M159j16250J69379q6836J30594j4041j42968
$$ -2390 164049 35746 -115141 -45325 -41166 -157416 11963 -74873 55721 41680 -101288
16540a01288M18706R5516k65484J54662l04564j74444o1160R2460K76940O8019
$$ -101288 317418 412934 147450 302112 -2452 -176896 -238056 -145596 131344 199363
16530A99363M6000j34314m384J42734M1173k28740j29394K98455o0763j97667
$$ 199363 245363 111049 106665 249399 290572 61832 -67562 230893 170130 -27537
16520b7537j98374k54367L5004K33836K49302l0897j98880K05572j01716n5932
$$ -27537 -225911 -480278 -445274 -211438 37864 6967 -191913 13659 -88057 -143989
16510a43989J4209j86837K08438L05797J07032l67833n08504j37483O2759J72023
$$ -143989 -129780 -316617 -108179 197618 304650 -63183 -571687 -709170 -646411 -474388
16500d74388K15577q07j5687Q7207Q322J42961L34963k20839k78701j44518j59072
$$ -474388 -258811 -259618 -275305 -188098 -179776 -36815 298148 77309 -201392 -345910 -504982
16489e04982k05763k55911K11375K24594J41946J65429J20088J43334p3534O7739
$$ -504982 -710745 -966656 -755281 -530687 -388741 -223312 -103224 40110 -33424 34315
16479C4315m1006n5622k18681l7996J88646J15699j63617K76279R7844j76115
$$ 34315 -6691 -62313 -280994 -318990 -130344 -14645 -178262 98017 195861 19746
16469A9746j00342n0244J95278L05449J52300k95934k42732j52598J27171J76358
$$ 19746 -80596 -130840 64438 369887 522187 226253 -16479 -169077 -41906 134452
16459A34452K0505j40979J20104j14560j57913r7011L1755J92755j33626j20327
$$ 134452 154957 13978 134082 19522 -138391 -235402 -203647 -10892 -144518 -264845
16449b64845J29140m8299j66857L51862K08482j88789L7688K43205k31457k39292
$$ -264845 -135705 -184004 -350861 1001 209483 20694 58382 301587 70130 -169162
16439a69162P6989m5387M5671j55884K0753J13932n2880K6514L7378M3235o8489
$$ -169162 -92173 -137560 -91889 -247773 -227020 -113088 -165968 -139454 -102076 -58841 -127330
16428a27330j3677M1361l14868k04463K78863l9162j53292K91453Q4435M0623
$$ -127330 -141007 -99646 -414514 -618977 -340114 -379276 -532568 -241115 -156680 -116057
16418a16057J19933K22310k50270n1961j15252k13140r3981J26461K58461K10618
$$ -116057 3876 226186 -24084 -76045 -191297 -404437 -498418 -371957 -113496 97122
16408I7122j44938n4487L50723k9327j68269L421J5156R027K38257j21957n9885
$$ 97122 -47816 -102303 248420 219093 50824 54245 69401 78428 316685 194728 134843
16397A34843l2723j98008P4822K47553J43455k80325j30133j61575j83980L27253
$$ 134843 102120 -95888 -21066 226487 369942 89617 -40516 -202091 -386071 -58818
16387e8818K44836l34647j77236L05303l1190m32685J15747K09923K0736R043
$$ -58818 186018 -148629 -325865 -20562 -51752 -484437 -368690 -158767 -138031 -128988
16377a28988L05322J2483l20984r3178R8372O1708j76680k81190M3440J66122
$$ -128988 176334 188817 -132167 -225345 -126973 -65265 -241945 -523135 -479695 -313573
16367c13573Q4416q7520J37399J74674l5566N5575K13751J53093j18446j68146
$$ -313573 -229157 -316677 -179278 -4604 -40170 15405 229156 382249 263803 95657
16357I5657j42672J05510P2264O0137l01635p3191P2994J57723r0138k06428J57477
$$ 95657 -47015 58495 130759 190896 -110739 -183930 -110936 46787 -43351 -249779 -92302
16346i2302m2439O6539K35387K8920r6729K90932K23660l13314k52643p4316K7417
$$ -92302 -134741 -68202 167185 196105 99376 390308 613968 300654 48011 -26305 1112
16335A112L6523j59171j54687p2262J65726J15250m4985J9151J42537K67874N182
$$ 1112 37635 -121536 -276223 -348485 -182759 -67509 -112494 -93343 49194 317068 322250
16324C22250j89209M260k69736J41616Q8684j08393K3333J19157j47260n6110
$$ 322250 133041 137301 -132435 9181 97865 -10528 12805 131962 -15298 -71408
16314g1408L1330K30668O824j28671j10737k58265J2000J68355K43136k2519j81538
$$ -71408 -40078 190590 197414 68743 -41994 -300259 -288259 -119904 123232 100713 -80825
16303h0825j74093J91949K51552j11439r9019J18268J48338k71893l6844j3366
$$ -80825 -254918 -62969 188583 77144 -21875 96393 244731 -27162 -64006 -77372
16293g7372l0469p3060j23348L30632Q1545J32206M8209j98647Q9618J48015L8532
$$ -77372 -107841 -180901 -304249 26383 107928 240134 288343 89696 179314 327329 365861
16282C65861j93311k44855j04020J58895p4121o9725k88480k6385J67075K35816
$$ 365861 172550 -72305 -176325 -17430 -91551 -161276 -449756 -476141 -309066 -73250
16272g3250K19454p9764m67878j15676K59067P9584p9627n3282Q3723m9187k3408
$$ -73250 146204 66440 -401438 -517114 -258047 -178463 -258090 -311372 -227649 -276836 -300244
16261c00244k44300J35354K56406J27670J08399l799J474K0676K45368J79529
$$ -300244 -544544 -409190 -152784 -25114 83285 79486 80960 101636 347004 526533
16251E26533k57205k90015l2826L27733K24962k04880k65509r7973r0976L526
$$ 526533 269328 -20687 -53513 274220 499182 294302 28793 -69180 -160156 -156630
16241a56630J79220J69178o5483J5866j38342j06210p445J18082n0681J68918
$$ -156630 22590 191768 126285 142151 3809 -102401 -109846 8236 -42445 126473
16231A26473R3632M3753J5909m5759K43296j08088l44881k53317J95958K32478
$$ 126473 220105 263858 279767 234008 477304 369216 24335 -228982 -33024 199454
16221A99454n1171k89508j16478K51574n4390j13534J02460j76709N868l4485
$$ 199454 148283 -141225 -257703 -6129 -60519 -174053 -71593 -248302 -242434 -276919
16211b76919q6400J42222N6625J28235J04557j7040M3820j52664j07314M45105
$$ -276919 -363319 -221097 -164472 -36237 68320 51280 95100 -57564 -164878 280227
16201B80227j40741k23156N9714q4958k38181m8945k81227J28512K83553J46823
$$ 280227 139486 -83670 -23956 -108914 -347095 -396040 -677267 -548755 -265202 -118379
16191a18379L0296m6728R4710K09163j93629k45491j0395J9164L9792l8049J07594
$$ -118379 -88083 -134811 -40101 169062 -24567 -270058 -280453 -261289 -221497 -259546 -151952
16180a51952J58953R9299j67861j83788j76665j30199N7004K05261J93050j73937
$$ -151952 7001 106300 -61561 -245349 -422014 -552213 -495209 -289948 -96898 -270835
16170b70835l8392J19310o3784j04106j11815L8357O9044j56448l0504J65792
$$ -270835 -309227 -189917 -253701 -357807 -469622 -431265 -362221 -518669 -549173 -383381
16160c83381L7343Q4475K0762K10732j9289K82824L8661l13027p6205o8954L6630
$$ -383381 -346038 -261563 -240801 -30069 -49358 233466 272127 -40900 -117105 -186059 -149429
16149a49429M6627Q9008J06565r0014n0093q5826n15J67217J45036J28295j2563
$$ -149429 -102802 -13794 92771 2757 -47336 -133162 -133677 33540 178576 306871 294308
16138B94308J05737m51382k43245l6027J00045Q8359J07127J84503k8283j41104
$$ 294308 400045 -51337 -294582 -330609 -230564 -142205 -35078 149425 121142 -19962
16128a9962N2867J89152J3284Q9905K58598K00745j91608j66522m326j14813j27367
$$ -19962 32905 222057 235341 325246 583844 784589 592981 426459 422133 307320 179953
16117A79953K2800L9446J2760j20251o7747k06733N0093j6950J32837J23549J37390
$$ 179953 202753 242199 254959 134708 66961 -139772 -89679 -106629 26208 149757 287147
16106B87147j12547K24086K02095r5184l48645J61796j64362k61678q1567k9197
$$ 287147 174600 398686 600781 505597 156952 318748 154386 -107292 -188859 -218056
16096b18056j31013L5630K20894J95983k8793j21650n1177o87J71250J38404O43
$$ -218056 -349069 -313439 -92545 103438 74645 -47005 -98182 -98869 72381 210785 211428
16085B11428j20624M9799J16916k23366o6558K37024J44495L7883J05540o5576
$$ 211428 90804 140603 257519 34153 -32405 204619 349114 386997 492537 426961
16075D26961k57769j41205J96903j10566j43808m897J26495J62534j41643l44241
$$ 426961 169192 27987 224890 114324 -29484 -34381 92114 254648 113005 -231236
16065b31236L5473j08609N7158j27221K25736J59417Q5722Q5315M8564j30719
$$ -231236 -195763 -304372 -247214 -374435 -148699 10718 96440 181755 230319 99600
16055I9600p6906o1372N3483J60368Q9903j6114j62920p324P195j5841j79971
$$ 99600 22694 -38678 14805 175173 265076 248962 86042 78718 85913 70072 -109899
16044a09899J26313o9385O1811J6187J05045o0831r1183j6002J62064k54604j45201
$$ -109899 16414 -52971 8840 25027 130072 69241 -21942 -37944 124120 -130484 -275685
16033b75685j63694J246Q6479K7934L41099J81999q0554k92322k19181J23093
$$ -275685 -439379 -438133 -351654 -323720 17379 199378 118824 -173498 -392679 -269586
16023b69586P3236L951M0957p5008j55457q23J85149J80360K90148j27428m61833
$$ -269586 -196350 -192399 -151442 -226450 -381907 -382730 -197581 -17221 272927 145499 -316334
16012c16334k49899O3730K76060M1662r5382J47792K61145j46549O4174J43092
$$ -316334 -566233 -502503 -226443 -184781 -280163 -132371 128774 -17775 46399 189491
16002A89491l2490r1457k04729J1866K3709P8021N5342j45082j31523q5763K51350
$$ 189491 157001 65544 -139185 -127319 -103610 -25589 29753 -115329 -246852 -332615 -81265
15991h1265P4901n3182j78738q7149K30361l0706j38422r6918J73827R1995M2353
$$ -81265 -6364 -59546 -238284 -325433 -95072 -125778 -264200 -361118 -187291 -95296 -52943
15980e2943o6234j35985P2178J84317K03555J2234k85999k50829P8617m9279j38637
$$ -52943 -119177 -255162 -182984 1333 204888 217122 -68877 -319706 -241089 -290368 -429005
15969d29005j88497J16339M32552o269J8351J10943m8024R1422J35878k86109
$$ -429005 -617502 -501163 -68611 -74880 -56529 54414 6390 97812 233690 -52419
15959e2419R7605j77042m2421J04890O6737P4922J41979n8159m6370j14226r9806
$$ -52419 45186 -131856 -174277 -69387 -2650 72272 214251 156092 109722 -4504 -104310
15948a04310k22763l01992l4157O6501Q5084j65408K52619L38137J37848j941
$$ -104310 -327073 -629065 -663222 -596721 -511637 -677045 -424426 -86289 51559 49618
15938D9618J4685p3763j81277q3935K63918l87397m27595j4156K71410M45601
$$ 49618 64303 -9460 -190737 -274672 -10754 -398151 -825746 -839902 -568492 -122891
15928a22891K04886K1752k052p8624j27883q3081O2974k46194q6939L18068k46012
$$ -122891 81995 103747 101695 23071 -104812 -187893 -124919 -371113 -458052 -139984 -385996
15917c85996l37407L05926J92546J762J62526j2257R0860M3802j27471m1530R501
$$ -385996 -723403 -417477 -224931 -223169 -60643 -72900 17960 61762 -65709 -107239 -97738
15906i7738L22783P0456k6304m1230k00884m7068j04784j39249q605J32508P769
$$ -97738 225045 295501 269197 227967 27083 -19985 -124769 -264018 -272623 -140115 -132346
15895a32346K14558k4456k33146k05093K4963j46547l5006J55795r7994J62808
$$ -132346 82212 57756 -175390 -380483 -355520 -502067 -537073 -381278 -479272 -316464
15885c16464K70587Q5514k34340j45717k2789N2292j38892J02521O2706J18419
$$ -316464 -45877 39637 -194703 -340420 -363209 -310917 -449809 -347288 -284582 -166163
15875a66163J55194L9730N6255k30508j9899l842J38819n3078n9481O8076K64345
$$ -166163 -10969 28761 85016 -145492 -165391 -169233 -30414 -83492 -142973 -74897 189448
15864A89448n2100M4360j9212l5540K1226j03953j26128m8228J53960j12401o215
$$ 189448 137348 181708 162496 126956 148182 44229 -81899 -130127 23833 -88568 -94783
15853i4783J02158P8233J00152J29712j30279J28204J4612J08562j51582k89346
$$ -94783 7375 85608 185760 315472 185193 313397 328009 436571 284989 -4357
15843d357O845J14074M6804L5103k21240J93864O0256j48551j38929k3794j58090
$$ -4357 2488 116562 163366 198469 -22771 171093 231349 82798 -56131 -79925 -238015
15832b38015J64876J04378r2029k93024k9951N3082j00696k92670K04401J94508
$$ -238015 -73139 31239 -60790 -353814 -383765 -330683 -431379 -724049 -519648 -325140
15822c25140o0533K28812J39127j10298j17726o2323l0182R7883q5094L9272L09418
$$ -325140 -385673 -156861 -17734 -128032 -245758 -308081 -338263 -240380 -325474 -286202 23216
15811B3216n0780j03045J28099L473L3919j3081l11605N4998K29195J87757K21777
$$ 23216 -27564 -130609 -2510 963 34882 21801 -289804 -234806 -5611 182146 403923
15800D03923N4069O2903J08190j56648m72447k21035L4231m3347j06289P0150
$$ 403923 457992 520895 629085 472437 -10 -221045 -186814 -230161 -336450 -266300
15790b66300Q682l9461L29257L55277q9070m3171J75310p2505j209k78248K64829
$$ -266300 -257618 -297079 32178 387455 298385 255214 430524 358019 356810 78562 343391
15779C43391K66071K39235m6755k44210j16488k76904k35252P8160J50338N828
$$ 343391 609462 848697 801942 557732 441244 164340 -70912 7248 157586 163414
15769A63414l74130J70298l4858m6167J08009l13034K03460l7116J40278K9605
$$ 163414 -210716 -40418 -75276 -121443 -13434 -326468 -123008 -160124 -19846 9759
15759I759n3081J99796J16953j45547k9589R9091L6996K54062n7507l14740j77846
$$ 9759 -43322 156474 273427 127880 98291 197382 234378 488440 430933 116193 -61653
15748f1653N082K53137J4849j76723l5717j21360k56146L0083K10804J97846J86865
$$ -61653 -56571 196566 211415 34692 -1025 -122385 -378531 -348448 -137644 60202 247067
15737B47067O1411P3799p3834j57958J46018j90398k1347j71636j47123j26191
$$ 247067 308478 382277 308443 150485 296503 106105 84758 -86878 -234001 -360192
15727c60192k48943K30265K31167n0730j17538j65927J0797L34648K73305K42799
$$ -360192 -609135 -378870 -147703 -198433 -315971 -481898 -471101 -136453 136852 379651
15717C79651l9001j39270j57599J84076l3776l3933J22138J74097J24092j00859
$$ 379651 340650 201380 43781 227857 194081 160148 282286 456383 580475 479616
15707D79616k51537L217l14147j15125N1862k79422j81320K34831K32341J0650
$$ 479616 228079 231296 -82851 -197976 -146114 -425536 -606856 -372025 -139684 -129034
15697a29034M6150J51206M6089j85237j14758J11381j8014j3914N840o6074M7442
$$ -129034 -82884 68322 114411 -70826 -185584 -74203 -92217 -106131 -100291 -166365 -118923
15686a18923J57871J45547R9677k19203k85550J02626m0857k00271K5740K05210
$$ -118923 38948 184495 284172 64969 -220581 -117955 -158812 -359083 -333343 -128133
15676a28133k22282L3258J50020Q4737j42652n3888j76118J45776J63469K1739
$$ -128133 -350415 -317157 -167137 -82400 -225052 -278940 -455058 -309282 -145813 -124074
15666a24074M5055M4061M6859L66719k1951j39032o5040k57438Q5086n9994J21375
$$ -124074 -79019 -34958 11901 378620 356669 217637 152597 -104841 -19755 -79749 41626
15655D1626j1686k86105j79573P3758P2249P3384j43616k14470K64169L29081
$$ 41626 29940 -256165 -435738 -361980 -289731 -216347 -359963 -574433 -310264 18817
15645A8817J53273n6064P836L36513J40907J74005P095k43749n4418J24010j35847
$$ 18817 172090 116026 123862 460375 601282 775287 782382 538633 484215 608225 472378
15634D72378J4162j17606k09808p5447m3318R3657j7558o1199o4143j85649j2176
$$ 472378 486540 368934 159126 83679 40361 134018 116460 55261 -8882 -194531 -206707
15623b06707m5728J49832K7976Q2802m7920r498p6183j53133r1549R7096J64037
$$ -206707 -252435 -102603 -74627 8175 -39745 -49243 -125426 -278559 -370108 -273012 -108975
15612a08975K01880j9010J6964j12532q8078k6859j90022J65991J84624m9414
$$ -108975 92905 73895 90859 -21673 -109751 -136610 -326632 -160641 23983 -25431
15602b5431j5744n8758L08015K45955j65891l18243j22229o2869J56000o4777
$$ -25431 -41175 -99933 208082 454037 288146 -30097 -152326 -215195 -59195 -123972
15592a23972J08255O6713K04424j22112q0680Q702L85416j3362o1501j69087r9023
$$ -123972 -15717 50996 255420 133308 52628 61330 446746 433384 371883 202796 103773
15581A03773k9574o8233P7879O8463k4444O4626J62663J4409j16028p8046j6438
$$ 103773 74199 5966 83845 152308 127864 192490 355153 369562 253534 175488 159050
15570A59050k06166j9033O8823K5488n5965k3564K00699n7774j6285J5332r9910
$$ 159050 -47116 -66149 2674 28162 -27803 -51367 149332 91558 75273 90605 -9305
15559i305O7195J90994j5147J04910k10327r9784K20531M47990q3076m64833l35289
$$ -9305 57890 248884 233737 338647 128320 28536 249067 697057 613981 149148 -186141
15548a86141n6465J61271n4655k55851r747K09550K43546l47767j14872K32951
$$ -186141 -242606 -81335 -135990 -391841 -401588 -192038 51508 -296259 -411131 -178180
15538a78180J48553K74059P3216o6740k9440k467n073r2644j23232L9013j0778
$$ -178180 -29627 244432 317648 250908 221468 219001 213928 121284 -1948 37065 26287
15527B6287N017j39143K98533j44914l19333K21450K1015k36802P9549N2700l09389
$$ 26287 31304 -107839 190694 45780 -273553 -52103 -31088 -267890 -188341 -135641 -445030
15516d45030O1151J26474R7986L05701J67173r3597p5770N8991k01138M7812j74499
$$ -445030 -383879 -257405 -159419 146282 313455 219858 144088 203079 1941 49753 -124746
15505a24746q4191O5254L26893k20588k41447M2948q661n1476J01814J75873J14207
$$ -124746 -208937 -143683 183210 -37378 -278825 -235877 -244538 -296014 -194200 -18327 95880
15494I5880k36965j9093j63085J43182J26085P3332J05085N4922J19099m6999
$$ 95880 -141085 -160178 -323263 -180081 -53996 19336 124421 179343 298442 251443
15484B51443j93276o0250k69777j61313K71511K66448M1704j96674J40359k9557
$$ 251443 58167 -2083 -271860 -433173 -161662 104786 146490 -50184 90175 60618
15474F0618j47816m2959R1935J75172J29956p7957j64580J0148K18986k37548
$$ 60618 -87198 -130157 -38222 136950 266906 188949 24369 34517 253503 15955
15464A5955j19923N9162j96150k44352J59387L22360K00789j03743J4612j48030
$$ 15955 -103968 -44806 -240956 -485308 -325921 -3561 197228 93485 108097 -39933
15454c9933J54449K57640J04703j08618l78721j35733J63859L619J57626K6272
$$ -39933 114516 372156 476859 368241 -10480 -146213 17646 21265 178891 205163
15444B05163N6753J64599k30225l13644O9384J63527J93987j8362q5638j54534
$$ 205163 261916 426515 196290 -117354 -47970 115557 309544 291182 205544 51010
15434E1010j87898N0967M236J78647J96264P797k71810l5942P9333q9184o8899
$$ 51010 -136888 -85921 -81685 96962 293226 301023 29213 -6729 72604 -16580 -85479
15423h5479O8578o910K52958K21970j60203n68712k48640J84696L56233Q2022
$$ -85479 -16901 -23811 229147 451117 290914 -277798 -526438 -341742 14491 96513
15413I6513j9655j06980j29621O0597J15716j89673j56372j12246O4635K41828
$$ 96513 76858 -30122 -159743 -99146 16570 -173103 -329475 -441721 -377086 -135258
15403a35258j04605K9582K59647R9406j8985j32807q3767J10523L92714O4559
$$ -135258 -239863 -210281 49366 148772 129787 -3020 -86787 23736 416450 481009
15393D81009k04900k06018K3740r2197p3313P5622j1177p4232k23966J51734J81886
$$ 481009 276109 70091 93831 1634 -71679 3943 -7234 -81466 -305432 -153698 28188
15382B8188N0879O8744N8211k14284j27581J74164m7726j41637M1369J7977K3392
$$ 28188 79067 147811 206022 -8262 -135843 38321 -9405 -151042 -109673 -91696 -68304
15371f8304K24227J15434J90328K05345r2147O227j09217o3364l09459k37227
$$ -68304 155923 271357 461685 667030 574883 581110 471893 408529 99070 -138157
15361a38157o5149K54454J44927l53501k63689j56610J07715J89354J44051R876
$$ -138157 -203306 51148 196075 -157426 -421115 -577725 -470010 -280656 -136605 -126729
15351a26729K67874K10658o0317l14682l6807K74851j25790j38438J42289J76834
$$ -126729 141145 351803 291486 -23196 -60003 214848 89058 -49380 92909 269743
15341B69743J1143n0231N2130L3442j85272k70916l71072j68506J20260J46728
$$ 269743 280886 230655 282785 316227 130955 -139961 -511033 -679539 -559279 -412551
15331d12551O7113J78274J60407O4059j67010P2787K47492n4003P5861P532L3926
$$ -412551 -345438 -167164 -6757 57302 -109708 -36921 210571 156568 232429 239961 273887
15320B73887M9278j12013j21412j33316j07004J58104L45027k6910k63260k38748
$$ 273887 323165 211152 89740 -43576 -150580 7524 352551 325641 62381 -176367
15310a76367L1812K10930l0539p8076J49036J57688M8738j05302q1709k1126j07491
$$ -176367 -144555 66375 35836 -42240 106796 264484 313222 207920 126211 105085 -2406
15299b406j32709r6534J45372M4937R7568j54555j19778r3227j9934L2706J51547
$$ -2406 -135115 -231649 -86277 -41340 56228 -98327 -218105 -311332 -331266 -298560 -147013
15288a47013J48856J05288L5441K18167l4075l11066k25181j21312J6486J49671
$$ -147013 1843 107131 142572 360739 326664 15598 -209583 -330895 -314409 -164738
15278a64738l7222j45813J94070k5598J0262P4588R9038L5408j6972q6795j6648
$$ -164738 -201960 -347773 -153703 -179301 -169039 -94451 4587 39995 23023 -63772 -80420
15267h0420O7744K2570J33374O7264P9996O9544m0032j83338k22217j13519J61630
$$ -80420 -12676 9894 143268 210532 290528 360072 320040 136702 -85515 -199034 -37404
15256c7404K73261J57791p8611j73632k13087J2912j54846o6641J23950k6873
$$ -37404 235857 393648 315037 141405 -71682 -58770 -213616 -280257 -156307 -183180
15246a83180l9357L726l4435J41194n8171J9510n9274q6308Q0882P5256J47448
$$ -183180 -222537 -218811 -253246 -112052 -170223 -150713 -209987 -296295 -215413 -140157 7291
15235G291l32594l673M0792J37750m0586m6275J76840L2579j50951l30038j3382
$$ 7291 -325303 -328976 -288184 -150434 -191020 -237295 -60455 -27876 -178827 -508865 -522247
15224e22247K11199J57317J33853J26773j61148M1341M9638J57924n6110j7565
$$ -522247 -311048 -153731 -19878 106895 -54253 -12912 36726 194650 138540 120975
15214A20975L28416K40833n1518k25251k7300j62148j63157J04282p1792M0582
$$ 120975 449391 690224 638706 413455 386155 224007 60850 165132 93340 133922
15204A33922M8496r4208l0604K0260R5363L19987j38680k13435l2290l99873p6455
$$ 133922 182418 88210 57606 77866 173229 493216 354536 141101 108811 -291062 -367517
15193c67517K9217q2329J43012J59428O9866O8207Q2384j27608q493J62741J0910
$$ -367517 -338300 -420629 -277617 -118189 -48323 19884 102268 -25340 -33833 128908 139818
15182A39818j06070K58106J91210n3397n6092k82236j58984L260J44964J59201
$$ 139818 33748 291854 483064 429667 373575 91339 -67645 -64385 80579 239780
15172B39780m5541K8244m2029M5704K12844J21289m8981n6009l0369k91320r3046
$$ 239780 194239 222483 180454 226158 439002 560291 511310 455301 424932 133612 40566
15161D0566O617O8330P1556M5589J1446j20766K7883j78648Q5994j43218l0636
$$ 40566 47183 115513 187069 232658 244104 123338 151221 -27427 58567 -84651 -115287
15150a15287n1140o8678R9595M2579p215K16229J30865j0942k43953o1844j8111
$$ -115287 -166427 -235105 -135510 -92931 -100146 116083 246948 236006 -7947 -69791 -87902
15139h7902p3041J31384J03439j41526k10178K531L26308M36032k9705J00694
$$ -87902 -160943 -29559 73880 -67646 -277824 -275293 51015 487047 457342 558036
15129E58036O7037k32320k45749l82277J03401K4159J5651P5948R7226j30132
$$ 558036 625073 392753 147004 -235273 -131872 -107713 -92062 -16114 81112 -49020
15119d9020R1447M0697J7606J11609o8032j42397n371k09917j19346J4343p241
$$ -49020 42427 83124 100730 212339 144307 1910 -3461 -213378 -332724 -318381 -325622
15108c25622j81512K40229L03418K41785j32931K4500J36587j18885j39422j59357
$$ -325622 -507134 -266905 36513 278298 145367 169867 306454 187569 48147 -111210
15098a11210j44033j36203R9952J44751Q8061K64752m331j14919k7323J23415
$$ -111210 -255243 -391446 -291494 -146743 -58682 206070 201739 86820 59497 182912
15088A82912Q8511k70241j40157k5827j36062J00307L74478p1884n8090L04245
$$ 182912 271423 1182 -138975 -164802 -300864 -200557 173921 102037 43947 348192
15078C48192R5607p5527k38249k66402J9420J78882K72558J8673R5179k3395k39053
$$ 348192 443799 368272 130023 -136379 -116959 61923 334481 353154 448333 424938 185885
15067A85885k44529l9820N3398K6639K24671J73904j69126R5070p6534p9910l4131
$$ 185885 -58644 -98464 -45066 -18427 206244 380148 211022 306092 229558 149648 115517
15056A15517J7923J29199m2122j31968R1627K61008K21249k14906j77863k6524
$$ 115517 133440 262639 220517 88549 180176 441184 662433 447527 269664 243140
15046B43140L45970J53665l96003k08658Q3589K04367J2521j62993k7402L0197
$$ 243140 589110 742775 346772 138114 221703 426070 438591 275598 248196 278393
15036B78393j32658k68754j4553J35727R2539k34085M9168J66287O1819N7838
$$ 278393 145735 -123019 -137572 -1845 90694 -143391 -94223 72064 133883 191721
15026A91721L64555j3446q2607l04626j16592J2869j2968J91555j98358q7440
$$ 191721 556276 542830 460223 155597 39005 51874 38906 230461 32103 -55337
15016e5337Q1622j37548P1330J98385R0897M0787q3056j51289J28646P9736j66990
$$ -55337 26285 -111263 -39933 158452 249349 290136 207080 55791 184437 264173 97183
15005I7183M4109J99509P0822o3958j00496L6262j90981N5875K6438J7462M2878
$$ 97183 141292 340801 411623 347665 247169 283431 92450 148325 174763 192225 235103
14994B35103n8760p6240R057K5319J53325O5126k12997r6161J24448J55337P5648
$$ 235103 176343 100103 109160 134479 287804 352930 139933 43772 168220 323557 399205
14983C99205j0110j00759N9991k10127k20984j51338J61295J63874R9689k00905
$$ 399205 389095 288336 348327 138200 -82784 -234122 -72827 91047 190736 -10169
14973a0169j75771j21922O6149K33060J67415J70209j47884l8035J38904K19062
$$ -10169 -185940 -307862 -241713 -8653 158762 328971 181087 143052 281956 501018
14963E01018r6244l83708j31940M1124j5503p1265k25577L03194K90522n2621
$$ 501018 404774 21066 -110874 -69750 -85253 -156518 -382095 -78901 211621 159000
14953A59000o966O2160J68921j82213R174M93k9149k85529j58347J79155L01983
$$ 159000 152034 214194 383115 200902 210076 210569 181420 -104109 -262456 -83301 218682
14942B18682q0215j64862J52481q6502N3500R6761K31439J91958l0415l03436
$$ 218682 138467 -26395 126086 39584 93084 189845 421284 613242 582827 279391
14932B79391q004j41435j43746j22690k26931P2898K19754J72036Q9285J6049
$$ 279391 271387 129952 -13794 -136484 -363415 -290517 -70763 101273 190558 206607
14922B06607L6637j40920k3162J70402l7389O8792j34674j06225k97424r1058
$$ 206607 243244 102324 79162 249564 212175 280967 146293 40068 -257356 -348414
14912c48414J70879L1171J16167K03894j3511j10334K02O2073O5996j01048J01253
$$ -348414 -177535 -146364 -30197 173697 160186 49852 50054 112127 178123 77075 178328
14901A78328m4086q8272j5962O3232m5813n8569R0915K69695O6938o5219K1981
$$ 178328 134242 45970 30008 93240 47427 -11142 79773 349468 416406 351187 373168
14890C73168J02726j2377k46589k48760K7024k06806Q5443K82122P0374j09294
$$ 373168 475894 463517 216928 -31832 -4808 -211614 -126171 155951 226325 117031
14880A17031j4553N9964K2590N4480j0299n6601j35062q4769K24777l5864K9700
$$ 117031 102478 162442 185032 239512 229213 172612 37550 -47219 177558 141694 171394
14869A71394J9857o2053j61178j48001J0125N6597L09281K65332n6109l5773k5578
$$ 171394 191251 129198 -31980 -179981 -169856 -113259 196022 461354 405245 369472 343894
14858C43894m5584J10623J47059n8572l61300K4031j81069J03701P4566n4783
$$ 343894 298310 408933 555992 497420 136120 160151 -20918 82783 157349 102566
14848A02566k24862p0322j6635K09593Q0753j16517K09053J11175j72833j65310
$$ 102566 -122296 -192618 -209253 340 81093 -35424 173629 284804 111971 -53339
14838e3339K44663M2550k4875O1614k78648p6519K05462O068L306j9156l0810
$$ -53339 191324 233874 208999 270613 -8035 -84554 120908 126976 130282 111126 80316
14827H0316m9853m4988m2955j49517k940J73721J66761q4370m9167J6569K04049
$$ 80316 30463 -14525 -57480 -206997 -209937 -36216 130545 46175 -2992 13577 217626
14816B17626j87346j77393Q4079j38322Q3067L25496O2704M1004Q1718J09849
$$ 217626 30280 -147113 -63034 -201356 -118289 207207 269911 310915 392633 502482
$$ [...]
##END NTUPLES=NMR SPECTRUM
##END=
