##TITLE=Analysis number 317780
Compound Code km 06283
Project Code adrs
Chemist Name melford
##JCAMPDX= 6.0         $$ Bruker NMR JCAMP-DX V2.0
##DATA TYPE= NMR SPECTRUM
##DATA CLASS= NTUPLES
##ORIGIN= Bruker BioSpin GmbH
##OWNER= nmr
$$ XWIN-NMR		Version 3.5
$$ Fri Mar  3 09:05:59 2006 GMT Standard Time (UT+0h)  MAYBRIDGE\nmr@NMR_250MHZ
##.OBSERVE FREQUENCY= 250.131544655141
##.OBSERVE NUCLEUS= ^1H
##.ACQUISITION MODE= SIMULTANEOUS (DQD)
##.ACQUISITION SCHEME= undefined
##.AVERAGES= 16
##.DIGITISER RES= 18
##SPECTROMETER/DATA SYSTEM= dpx250
##.PULSE SEQUENCE= zg30
##.SOLVENT NAME= CDCl3
##.SHIFT REFERENCE= (INTERNAL, CDCl3, 0, 16.522)
##AUDIT TRAIL= $$ (NUMBER, WHEN, WHO, WHERE, WHAT)
$$ ##TITLE= Audit trail, XWIN-NMR		Version 3.5
$$ ##JCAMPDX= 5.01
$$ ##ORIGIN= Bruker BioSpin GmbH
$$ ##OWNER= nmr
$$ C:\u/data/dgb/nmr/ADRS/17430/pdata/1/auditp.txt
$$ ##AUDIT TRAIL=  $$ (NUMBER, WHEN, WHO, WHERE, WHAT)
(   1,<2006-03-03 09:05:25.12 +000>,<MAYBRIDGE\nmr>,<NMR_250MHZ>,
      <created by zg, POWCHK disabled, PULCHK disabled
       configuration hash MD5:
       84 BC 41 DB A1 6E 1D 46 DA 25 12 A5 C1 ED C5 3A
       data hash MD5: 64K
       E4 ED BB A5 51 37 42 E1 56 36 FA 6E 2B 87 18 82>)
(   2,<2006-03-03 09:05:42.98 +000>,<MAYBRIDGE\nmr>,<NMR_250MHZ>,
      <Start of raw data processing
       ef LB = 0.3 FT_mod = 6 PKNL = 1 SI = 32K 
       data hash MD5: 32K
       FC 0D 43 54 10 F2 83 55 79 F5 2B 9E D2 C4 26 C1>)
(   3,<2006-03-03 09:05:45.05 +000>,<MAYBRIDGE\nmr>,<NMR_250MHZ>,
      <apk 
       data hash MD5: 32K
       19 A2 63 15 C9 EB E7 F2 83 35 46 BA 2E AF 29 D7>)
(   4,<2006-03-03 09:05:45.80 +000>,<MAYBRIDGE\nmr>,<NMR_250MHZ>,
      <abs ABSG = 5 
       data hash MD5: 32K
       19 D1 CE B8 54 50 F1 D4 57 1D ED 18 E2 23 B6 3B>)
$$ ##END=
$$ 
$$ hash MD5
$$ 89 AA CD 97 FA 8A 8E 1D FF 2D 63 0E CA EC 6C E3
##$RELAX= 
##$RELAX= 
##$RELAX= 
##$RELAX= 
##$RELAX= 
##$RELAX= 
##$RELAX= 
$$ Bruker specific parameters
$$ --------------------------
##$DU= <C:\u>
##$EXPNO= 17430
##$NAME= <ADRS>
##$PROCNO= 1
##$TYPE= <nmr>
##$USER= <dgb>
##$AMP= (0..31)
100 100 100 100 100 100 100 100 100 100 100 100 100 100 100 100 100 100 
100 100 100 100 100 100 100 100 100 100 100 100 100 100 
##$AQSEQ= 0
##$AQ_mod= 3
##$AUNM= <au_zg>
##$AUTOPOS= <2 >
##$BF1= 250.13
##$BF2= 250.13
##$BF3= 250.13
##$BF4= 250.13
##$BF5= 500.13
##$BF6= 500.13
##$BF7= 500.13
##$BF8= 500.13
##$BYTORDA= 1
##$CFDGTYP= 0
##$CFRGTYP= 5
##$CHEMSTR= <none>
##$CNST= (0..31)
1 1 145 1 1 1 1 1 1 1 1 1 1 1 1 1 1 1 1 1 1 1 1 1 1 1 1 1 1 1 1 1 
##$CPDPRG= <>
##$CPDPRG1= <>
##$CPDPRG2= <>
##$CPDPRG3= <>
##$CPDPRG4= <mlev>
##$CPDPRG5= <mlev>
##$CPDPRG6= <mlev>
##$CPDPRG7= <mlev>
##$CPDPRG8= <mlev>
##$CPDPRGB= <>
##$CPDPRGT= <>
##$D= (0..31)
0 1 0 0 0 0 0 0 0 0.06 0 0 0 0 0 0 0.0002 0 0 0 0 0 0 0 0 0 0 0 0 0 0 
0 
##$DATE= 1141376722
##$DBL= (0..7)
120 120 120 120 120 120 120 120 
##$DBP= (0..7)
150 150 150 150 150 150 150 150 
##$DBP07= 0
##$DBPNAM0= <>
##$DBPNAM1= <>
##$DBPNAM2= <>
$$ [...]
##$SUBNAM7= <"">
##$SUBNAM8= <"">
##$SUBNAM9= <"">
##$SW= 20.6930455092707
##$SWIBOX= (0..15)
0 0 3 0 0 0 0 0 0 0 0 0 0 0 0 0 
##$SW_h= 5175.983436853
##$TD= 65536
##$TD0= 1
##$TE= 293.16
##$TE2= 300
##$TE3= 300
##$TEG= 300
##$TL= (0..7)
0 120 120 120 120 120 120 120 
##$TP= (0..7)
150 150 150 150 150 150 150 150 
##$TP07= 0
##$TPNAME0= <>
##$TPNAME1= <>
##$TPNAME2= <>
##$TPNAME3= <>
##$TPNAME4= <>
##$TPNAME5= <>
##$TPNAME6= <>
##$TPNAME7= <>
##$TPOAL= (0..7)
0.5 0.5 0.5 0.5 0.5 0.5 0.5 0.5 
##$TPOFFS= (0..7)
0 0 0 0 0 0 0 0 
##$TUNHIN= 0
##$TUNHOUT= 0
##$TUNXOUT= 0
##$USERA1= <user>
##$USERA2= <user>
##$USERA3= <user>
##$USERA4= <user>
##$USERA5= <user>
##$V9= 5
##$VALIST= <valist>
##$VCLIST= <CCCCCCCCCCCCCCC>
##$VD= 0
##$VDLIST= <DDDDDDDDDDDDDDD>
##$VPLIST= <PPPPPPPPPPPPPPP>
##$VTLIST= <TTTTTTTTTTTTTTT>
##$WBST= 1024
##$WBSW= 4
##$XGAIN= (0..3)
0 0 0 0 
##$XL= 0
##$YL= 0
##$YMAX_a= 244664
##$YMIN_a= -297130
##$ZGOPTNS= <>
##$ZL1= 120
##$ZL2= 120
##$ZL3= 120
##$ZL4= 120
##$ABSF1= 16.522
##$ABSF2= -4.171173
##$ABSG= 5
##$ABSL= 3
##$ALPHA= 0
##$AQORDER= 0
##$ASSFAC= 0
##$ASSFACI= 0
##$ASSFACX= 0
##$ASSWID= 0
##$AUNMP= <proc_1d>
##$AZFE= 0.1
##$AZFW= 0.1
##$BCFW= 0
##$BC_mod= 0
##$BYTORDP= 0
##$COROFFS= 0
##$CY= 12.5
##$DATMOD= 1
##$DC= 0
##$DFILT= <>
##$DTYPP= 0
##$F1P= 14.0000005364418
##$F2P= -0.99999901652339
##$FCOR= 0.5
##$FTSIZE= 32768
##$FT_mod= 6
##$GAMMA= 0
##$GB= 0
##$INTBC= 1
##$INTSCL= 1
##$ISEN= 128
##$LB= 0.3
##$LEV0= 0
##$LPBIN= 0
##$MAXI= 10000
##$MC2= 0
##$MEAN= 0
##$ME_mod= 0
##$MI= 0
##$NCOEF= 0
##$NC_proc= -4
##$NLEV= 6
##$NOISF1= 0
##$NOISF2= 0
##$NSP= 0
##$NTH_PI= 0
##$NZP= 0
##$OFFSET= 16.522
##$PC= 1
##$PHC0= -109.9211
##$PHC1= 7.45576
##$PH_mod= 1
##$PKNL= yes
##$PPARMOD= 0
##$PSCAL= 4
##$PSIGN= 0
##$REVERSE= no
##$SF= 250.13
##$SI= 32768
##$SIGF1= 0
##$SIGF2= 0
##$SINO= 400
##$SIOLD= 32768
##$SREGLST= <1H.CDCl3>
##$SSB= 0
##$STSI= 32768
##$STSR= 0
##$SW_p= 5175.98343685301
##$SYMM= 0
##$S_DEV= 0
##$TDeff= 65536
##$TDoff= 0
##$TI= <Analysis number 999999
Compound Code 99
Book Reference 9
Project Code 9>
##$TILT= no
##$TM1= 0
##$TM2= 0
##$TOPLEV= 0
##$USERP1= <user>
##$USERP2= <user>
##$USERP3= <user>
##$USERP4= <user>
##$USERP5= <user>
##$WDW= 1
##$XDIM= 32768
##$YMAX_p= 402005947
##$YMIN_p= -807919
$$ End of Bruker specific parameters
$$ ---------------------------------
##NTUPLES= NMR SPECTRUM
##VAR_NAME=  FREQUENCY,     SPECTRUM/REAL,   SPECTRUM/IMAG
##SYMBOL=    X,             R,               I
##VAR_TYPE=  INDEPENDENT,   DEPENDENT,       DEPENDENT
##VAR_FORM=  AFFN,          ASDF,            ASDF
##VAR_DIM=   32768,         32768,           32768
##UNITS=     HZ,            ARBITRARY UNITS, ARBITRARY UNITS
##FACTOR=    0.157963299565203, 1,           1
##FIRST=     4132.6476996994, 0,             0
##LAST=      -1043.33573715361, 0,           0
##MIN=       -1043.33573715361, -807919,     0
##MAX=       4132.6476996994, 402005947,     0
$$ Real data points
##PAGE= N=1
##DATA TABLE= (X++(R..R)), XYDATA
$$ [...]
$$ plain form
23141 10411 111609 36435 -130931 -250430 -384310 -250986 -169748 -233179 -224008 -62164 9454
23130 9454 32346 18391 29582 -77524 -126102 81176 307317 235927 87194 208551 120402
23119 120402 129991 221265 117334 -74795 -95944 -76437 -80205 -162351 -305075 -468484 -337662
23108 -337662 -186353 -133256 -121078 -197080 -388188 -346648 -182492 10837 150274 388811
23098 388811 213320 51771 -229304 -401266 -401938 -240866 -336906 -423628 -221007 -217511 -217138
23087 -217138 -190103 -34801 -121200 145238 163962 60624 -227363 -277612 -243060 -348361
23077 -348361 -85489 46099 208251 121274 -1846 33630 -8404 36454 -174840 -250793
23067 -250793 -120144 -44725 -134996 -59111 182224 442910 194089 177626 198090 236755 318926
$$ packed form
23141A0411J01198p5174j67366j19499j33880J33324Q1238o3431R171J61844P1618
23130I454K2892j3955J1191j07106m8578K07278K26141p1390j48733J21357q8149
23119A20402R589R1274j03931j92129k1149J9507l768q2146j42724j63409J30822
23108c37662J51309N3097J2178p6002j91108M1540J64156J93329J39437K38537
23098C88811j75491j61549k81075j71962o72J61072r6040q6722K02621L496L73
23087b17138K7035J55302q6399K66438J8724j03338k87987n0249L4552j05301
23077c48361K62872J31588J62152q6977j23120L5476m2034M4858k11294p5953
23067b50793J30649P5419r0271P5885K41335K60686k48821j6463K0464L8665Q2171
$$ plain form
23056 318926 107315 -142062 -75198 124363 57032 -16599 -7222 44823 47044 175394 310335
23045 310335 129492 52778 3652 -98584 -272652 -531091 -382181 -203908 66239 183973
23035 183973 -34311 38250 162566 159788 255200 347054 586048 622674 494985 265554 117951
23024 117951 180353 127891 32106 8183 83604 70410 55004 19153 117667 304870 220476
23013 220476 -29755 41659 236381 224320 133649 233719 55748 64444 35171 188366 388531
23002 388531 445833 510158 360822 246832 195591 39849 -123591 -114971 -174824 -441024 -175083
22991 -175083 73649 -50620 -263010 -205350 -83081 -60453 81555 180338 200311 134654
22981 134654 215299 282424 324975 311221 88384 189945 269823 154234 -28327 -36757 -141850
$$ packed form
23056C18926k11611k49377O6864J99561o7331p3631R377N2045K221J28350J34941
23045C10335j80843p6714m9126j02236j74068k58439J48910J78273K70147J17734
23035A83973k18284P2561J24316k778R5412R1854K38994L6626j27689k29431j47603
23024A17951O2402n2462r5785k3923P5421j3194j5406l5851R8514J87203q4394
23013B20476k50231P1414J94722j2061r0671J00070j77971Q696k9273J53195K00165
23002C88531N7302O4325j49336j13990n1241j55742j63440Q620n9853k66200K65941
22991a75083K48732j24269k12390N7660J22269K2628J42008R8783J9973o5657
22981A34654Q0645O7125M2551j3754k22837J01561P9878j15589j82561q430j05093
$$ plain form
22970 -141850 -160780 -13373 -29360 66977 -21259 -88325 -157924 32503 218362 162502 83564
22959 83564 -6542 1387 22185 137582 94537 159753 81126 -3866 -155717 -226629 -193597
22948 -193597 23114 -22788 -30091 -24797 -91221 -31214 -282548 -217637 -53918 -186355 -422657
22937 -422657 -548794 -452256 17402 176014 64475 -73700 -110916 -216469 5988 23710
22927 23710 -135434 -116868 156927 209208 85128 101908 131325 243915 287053 215199 -9868
22916 -9868 97819 126579 -144955 -365526 -420916 -277907 -71254 -28994 354569 461722
22906 461722 312732 183007 8337 141238 274826 272089 64953 -63313 -163637 -102570
22896 -102570 -37702 129863 188561 -47291 -93359 -21804 -110599 -254992 -52066 126997
$$ packed form
22970a41850j8930J47407j5987R6337q8236o7066o9599J90427J85859n5860p8938
22959H3564r0106P929K0798J15397m3045O5216p8627q4992j51851p0912L3032
22948a93597K16711m5902p303N294o6424O0007k51334O4911J63719j32437k36302
22937d22657j26137R6538M69658J58612j11539j38175l7216j05553K22457J7722
22927B3710j59144J8566K73795N2281j24080J6780K9417J12590M3138p1854k25067
22916i868J07687K8760k71534k20571n5390J43009K06653M2260L83563J07153
22906D61722j48990j29725j74670J32901J33588k737k07136j28266j00324O1067
22896a02570O4868J67565N8698k35852m6068P1555q8795j44393K02926J79063
$$ plain form
22886 126997 212071 135426 75284 43734 139846 261398 291578 267419 336825 351270 375039
22875 375039 332418 206311 60576 64894 226870 80440 -125844 -116081 -132506 -40353 -1503
22864 -1503 -27967 -148133 -176128 -308482 -199346 34210 -51254 -77619 -45451 -122323 -412156
22853 -412156 -377323 -72801 -165491 -166953 77984 353823 357084 244545 373850 436652 200569
22842 200569 124311 -29671 -255785 -286127 -40492 150193 112432 136121 415990 323224
22832 323224 197677 210361 277519 229337 148167 105459 -58763 -44790 -31879 -38625 29699
22821 29699 -1253 123220 411896 610586 594691 526024 231553 -44111 61400 35489
22811 35489 12758 210067 -115787 -248543 -415765 -481149 -210974 -54879 11601 -43126
$$ packed form
22886A26997Q5074p6645o0142l1550R6112J21552L0180k4159O9406J4445K3769
22875C75039m2621j26107j45735M318J61976j46430k06284R763j6425R2153L8850
22864a503k6464j20166k7995j32354J09136K33556q5464k6365L2168p6872k89833
22853d12156L4833L04522r2690j462K44937K75839L261j12539J29305O2802k36083
22842B00569p6258j53982k26114l0342K45635J90685l7761K3689K79869r2766
22832C23224j25547J2684O7158m8182q1170m2708j64222J3973J2911o746O8324
22821B9699l0952J24473K88676J98690j5895o8667k94471k75664J05511k5911
22811C5489k2731J97309l25854j32756j67222o5384K70175J56095O6480n4727
$$ plain form
22801 -43126 8519 61854 231256 185408 129405 210699 -127358 -379034 -276249 60183 180263
22790 180263 193069 104068 13436 48066 -63061 69898 213784 156175 85836 208250 297570
22779 297570 482166 358143 188363 -139388 -98606 45390 -37069 -9368 37746 172972
22769 172972 74482 50152 93260 123277 52089 -21068 77079 292958 220974 140935 140180 268245
22757 268245 142295 -53380 -110730 -119551 -52826 97902 45200 176079 266667 76992 -58933
22746 -58933 -41178 116656 337686 479983 559248 247290 -25639 -203008 -94944 120089
22736 120089 107736 134549 27223 -94033 -66718 -176040 -271342 -287079 -113314 -136245 -213416
22725 -213416 -117313 -89398 -159932 -373735 -663577 -487814 -255377 -198794 -89596 -270123
$$ packed form
22801d3126N1645N3335J69402m5848n6003Q1294l38057k51676J02785L36432J20080
22790A80263J2806q9001r0632L4630j11127J32959J43886n7609p0339J22414Q9320
22779B97570J84596j24023j69780l27751M0782J43996q2459K7701M7114J35226
22769A72972r8490k4330M3108L0017p1188p3157R8147K15879p1984q0039p55J28065
22757B68245j25950j95675n7350q821O6725J50728n2702J30879R0588j89675j35925
22746e8933J7755J57834K21030J42297P9265l11958k72929j77369J08064K15033
22736A20089j2353K6813j07326j21256K7315j09322r5302j5737J73765k2931p7171
22725b13416R6103K7915p0534k13803k89842J75763K32437N6583J09198j80527
$$ plain form
22715 -270123 -410519 -329144 -85004 156575 82643 -38744 78940 322267 167888 -173619
22705 -173619 -143709 -158653 -34167 151485 6528 -15648 130412 276188 323001 156422
22695 156422 -59061 -186141 -81302 -26450 -84182 -64238 -118578 -53275 27899 -118002 -136695
22684 -136695 -158532 -109981 -80743 -191963 -359805 -445751 -283872 -283390 -293005 -243189 -77062
22673 -77062 -2130 -262440 -362496 -495800 -332643 -260315 -83134 168793 224918 58010
22663 58010 108962 93310 56784 -95039 -171333 -8220 -263572 -197796 28509 -177575 7122
22652 7122 -13248 -37316 -225965 -165510 26952 -116620 -223337 81473 209192 164126 55246
22641 55246 -637 103077 159216 7155 14262 -193091 -267532 -168500 28409 101192 -67509
$$ packed form
22715b70123j40396Q1375K44140K41579p3932j21387J17684K43327j54379l41507
22705a73619K9910j4944J24486J85652j44957k2176J46060J45776M6813j66579
22695A56422k15483j27080J04839N4852n7732J9944n4340O5303Q1174j45901j8693
22684a36695k1837M8551K9238j11220j67842q5946J61879M82r615M9816J66127
22673g7062P4932k60310j00056j33304J63157P2328J77181K51927N6125j66908
22663E8010N0952j5652l6526j51823p6294J63113k55352O5776K26305k06084J84697
22652G122k0370k4068j88649O0455J92462j43572j06717L04810J27719m5066j08880
22641E5246n5883J03714N6139j52061P107k07353p4441R9032J96909P2783j68701
$$ plain form
22630 -67509 -20911 73893 -113583 66846 180657 210193 -15350 -257294 -311867 -198899
22620 -198899 -137441 44940 210721 325066 381328 172092 86357 249522 275352 49601
22610 49601 -272690 -353252 -291178 -255483 -90317 -146765 -140480 -21499 9089 117178 37855
22599 37855 94111 174082 223117 118711 149157 154109 -2155 -32231 -137103 -157688 -278541
22588 -278541 -438291 -356164 -13747 122422 69478 219008 26527 -117402 -71802 -27632
22578 -27632 -145340 -11748 81477 35807 238423 188902 338660 461632 357770 304137
22568 304137 224438 317065 185022 30876 -144854 -164433 -54277 -3233 194227 225540
22558 225540 308481 98890 21145 -46330 -303489 -285154 -77982 -82522 -506870 -480823 -322755
$$ packed form
22630f7509M6598R4804j87476J80429J13811K9536k25543k41944n4573J12968
22620a98899O1458J82381J65781J14345N6262k09236q5735J63165K5830k25751
22610D9601l22291q0562O2074L5695J65166n6448O285J18981L0588J08089p9323
22599C7855N6256P9971M9035j04406L0446M952j56264l0076j04872k0585j20853
22588b78541j59750Q2127L42417J36169n2944J49530j92481j43929M5600M4170
22578b7632j17708J33592R3225m5670K02616m9521J49758J22972j03862n3633
22568C04137p9699R2627j32043j54146j75730j9579J10156N1044J97460L1313
22558B25540Q2941k09591p7745o7475k57159J8335K07172m540m24348K6047J58068
$$ plain form
22547 -322755 44399 134336 -83069 -78127 -272126 -330252 -111570 -158203 -52635 -121227 -198270
22536 -198270 -227295 38049 -19074 -51468 -89908 142123 295371 268628 86773 80000 -96058
22525 -96058 -103301 -44399 -20967 31594 -87600 -124527 -236446 -228015 25021 7167 224250
22514 224250 116114 -78260 -121038 -161798 -223080 -246316 -159633 21792 -106727 -82773 34252
22503 34252 113803 -88410 -138773 -214493 -200601 -205885 -95626 34409 50911 248696 271696
22492 271696 180047 268045 510595 464194 281873 122621 196530 219556 101546 93741 169728
22481 169728 204715 191775 288271 262776 129066 66417 -53746 -255176 -143394 -1520
22471 -1520 -130284 -335255 -82555 -85877 -14035 -20770 33008 225415 269464 350884 148994
$$ packed form
22547c22755L67154Q9937k17405M942j93999n8126K18682m6633J05568o8592p7043
22536a98270k9025K65344n7123l2394l8440K32031J53248k6743j81855o773j76058
22525i6058p243N8902K3432N2561j19194l6927j11919Q431K53036j7854K17083
22514B24250j08136j94374m2778m0760o1282k3236Q6683J81425j28519K3954J17025
22503C4252P9551k02213n0363p5720J3892n284J10259J30035J6502J97785K3000
22492B71696r1649Q7998K42550m6401j82321j59252P3909K3026j18010p805P5987
22481A69728L4987j2940R6496k5495j33710o2649j20163k01430J11782J41874
22471a520j28764k04971K52700l322P1842o735N3778J92407M4049Q1420k01890
$$ plain form
22460 148994 81712 377805 239768 -84519 -239149 -367851 -117063 40422 -56297 -237254
22450 -237254 -350686 -547040 -484391 -526822 -507286 -336398 -150092 -247654 -350844 -122538
22440 -122538 123329 42264 -239528 -147582 -101867 828 75551 -100171 -366327 -397129
22430 -397129 -235062 -109365 -98232 89602 324990 4259 -316836 -196925 -160810 -14881
22420 -14881 -153442 -3602 61275 -101032 -368325 -164169 17647 119529 112737 -9528
22410 -9528 -86603 -73911 -43725 -233458 -218663 -59438 1338 126747 187030 25865 -117457
22399 -117457 -95598 -153980 -334965 -185054 -43267 -84556 -93717 -184860 -288495 -365672 -383178
22388 -383178 -303343 -91179 15867 132767 380025 257999 112866 185369 171537 112986
$$ packed form
22460A48994o7282K96093j38037l24287j54630j28702K50788J57485r6719j80957
22450b37254j13432j96354O2649m2431J9536J70888J86306r7562j03190K28306
22440a22538K45867q1065k81792R1946M5715J02695P4723j75722k66156l0802
22430c97129J62067J25697J1133J87834K35388l20731l21095J19911L6115J45929
22420a4881j38561J49840O4877j62307k67293K04156J81816J01882o792j22265
22410i528p7075J2692L0186j89733J4795J59225O0776J25409O0283j61165j43322
22399a17457K1859n8382j80985J49911J41787m1289r161r1143j03635p7177j7506
22388c83178P9835K12164J07046J16900K47258j22026j45133P2503j3832n8551
$$ plain form
22378 112986 121010 647 -45720 -61770 30155 -169857 -424279 -430661 -204414 -154248 -285674
22367 -285674 -62860 106200 230141 235347 162307 36349 -11897 -202088 -224705 -200175 -203563
22356 -203563 -184072 -175851 -65751 -207495 -150726 -93296 -273960 -392462 -375387 -104547 -63921
22345 -63921 75822 176647 -5689 -129230 129313 242322 166925 -9533 -136948 -44446
22335 -44446 294768 205586 16299 -76523 56896 -72493 -112664 -519 -90674 -129704 135664
22324 135664 247341 73449 -197997 -139891 -199661 -303097 -452073 -513670 -640757 -517058
22314 -517058 -155940 95574 36566 -188953 -451307 -357923 -364426 -205181 -97702 109676
22304 109676 139090 197059 238912 226524 36909 74223 -139551 -183097 -129341 -116689 99411
$$ packed form
22378A12986Q024j20363m6367j6050R1925k00012k54422o382K26247N0166j31426
22367b85674K22814J69060J23941N206p3040j25958m8246j90191k2617K4530l388
22356b03563J9491Q221J10100j41744N6769N7430j80664j18502J7075K70840M0626
22345f3921J39743J00825j82336j23541K58543J13009p5397j76458j27415R2502
22335d4446L39214q9182j89287r2822J33419j29389m0171J12145r0155l9030K65368
22324A35664J11677j73892k71446N8106n9770j03436j48976o1597j27087J23699
22314e17058L61118K51514n9008k25519k62354R3384o503J59245J07479K07378
22304A09676K9414N7969M1853j2388j89615L7314k13774m3546N3756J2652K16100
$$ plain form
22293 99411 191099 237887 164077 -59597 -21157 -74046 -93211 53273 81458 228943 189590
22282 189590 40313 -52191 81531 305997 213115 -51551 -304171 -211549 57452 202633
22272 202633 248580 348747 593907 407565 194092 229407 90646 66579 59970 -14677 -90103
22261 -90103 -81108 34104 146097 56642 -70852 -257122 -337924 -249767 -96920 -166761 -233850
22250 -233850 -52451 -20402 -51178 165970 112925 -147771 -293362 -266119 -300059 -246884 -125113
22239 -125113 -218310 -496364 -455731 -148994 80129 220881 203824 -8378 -229462 -132943
22229 -132943 -68975 -53707 -36548 -78937 -232020 -415724 -501910 -418413 -283169 -165534 -118468
22218 -118468 -147030 -231912 -205675 -196228 -6208 134310 -98626 -178108 -73262 -74940 62536
$$ packed form
22293I9411R1688M6788p3810k23674L8440n2889j9165J46484K8185J47485l9353
22282A89590j49277r2504J33722K24466r2882k64666k52620R2622K69001J45181
22272B02633M5947J00167K45160j86342k13473L5315j38761k4067o609p4647p5426
22261i0103Q995J15212J11993q9455j27494j86270q0802Q8157J52847o9841o7089
22250b33850J81399L2049l0776K17148n3045k60696j45591K7243l3940N3175J21771
22239a25113r3197k78054M0633L06737K29123J40752j7057k12202k21084R6519
22229a32943O3968J5268J7159m2389j53083j83704q6186Q3497J35244J17635M7066
22218a18468k8562q4882K6237R447J90020J40518k32936p9482J04846j678J37476
$$ plain form
22207 62536 208509 271576 186306 138459 178727 103210 133397 28698 54488 8642 -143513
22196 -143513 -65738 181611 14113 39695 99617 161297 48292 -68447 -84967 86330
22186 86330 -79842 -179591 -20583 120780 217142 105813 6535 24415 92825 169771 117946
22175 117946 209938 90057 2522 -62796 -46112 249269 275268 92924 17937 -63869 -72584
22164 -72584 -30819 75319 89130 154693 130417 352432 500867 448774 38479 -8996 149341
22153 149341 150313 245643 368299 247318 -39648 -129926 -81970 2293 38269 -160164 -306034
22142 -306034 -109660 -95299 -280552 -267316 -178160 -47230 84667 40565 -59001 -224666
22132 -224666 -58634 188402 125030 190452 94875 22675 96067 78460 -81678 -281659 -272976
$$ packed form
22207F2536J45973O3067q5270m7847M0268p5517L0187j04699K5790m5846j52155
22196a43513P7775K47349j67498K5582N9922O1680j13005j16739j6520J71297
22186H6330j66172r9749J59008J41363R6362j11329r9278J7880O8410P6946n1825
22175A17946R1992j19881q7535o5318J6684K95381K5999j82344p4987q1806q715
22164g2584M1765J06138J3811O5563k4276K22015J48435n2093m10295m7475J58337
22153A49341R72R5330J22656j20981k86966r0278M7956Q4263L5976j98433j45870
22142c06034J96374J4361j85253J3236Q9156J30930J31897m4102r9566j65665
22132b24666J66032K47036o3372O5422r5577p2200P3392j7607j60138j99981Q683
$$ plain form
22121 -272976 -305425 -23487 97186 -51794 -379628 -309755 -339303 -545296 -428861 -262582
22111 -262582 67323 152555 26055 7864 39953 118002 178007 -115498 -268086 -184230 53937
22100 53937 1643 -74678 71219 129092 83314 62884 37816 -55996 -260071 -393295 -410673
22089 -410673 -278996 -115475 -248799 -260110 -228212 -300023 -316943 -257573 -182088 -314454 -355995
22078 -355995 -83109 93380 78618 -75850 -196750 54132 216699 217652 150670 123641 118680
22067 118680 56603 -104402 -195971 -175683 -93593 -233818 -580477 -649846 -505009 -210978
22057 -210978 -258752 -412187 -304163 -24058 -35386 -28565 -290621 -199564 36197 -17501 -157095
22046 -157095 -119401 23390 -148875 -334512 -248789 -126017 -319727 -495694 -585089 -489046
$$ packed form
22121b72976l2449K81938J20673j48980l27834O9873k9548k05993J16435J66279
22111b62582L29905Q5232j26500j8191L2089P8049O0005k93505j52588Q3856K38167
22100E3937n2294p6321J45897N7873m5778k0430k5068r3812k04075j33224j7378
22089d10673J31677J63521j33324j1311L1898p1811j6920N9370P5485j32366m1541
22078c55995K72886J76489j4762j54468j20900K50882J62567R53o6982k7029m961
22067A18680o2077j61005r1569K0288Q2090j40225l46659o9369J44837K94031
22057b10978m7774j53435J08024K80105j1328O821k62056R1057K35761n3698j39594
22046a57095L7694J42791j72265j85637Q5723J22772j93710j75967q9395R6043
$$ plain form
22036 -489046 -210578 127264 124769 57260 143309 102716 1035 -111455 -39011 18343 -78191
22025 -78191 247104 479803 402301 272117 464574 356221 118008 -94936 42593 267465
22015 267465 235685 281148 448396 425459 397850 542616 581946 399181 393422 381166 314716
22004 314716 275858 354745 302146 47044 25353 -206252 -290628 -201465 -118209 -81930 -121060
21993 -121060 -52848 3719 237410 143307 -65135 -70733 31594 266304 126260 108819 171272
21982 171272 227987 313942 159739 22027 129652 -59464 -258156 -377390 -283698 -565518
21972 -565518 -474372 -247035 -241340 -316683 -184894 -233010 -249367 -150567 -130127 -91938 -18111
21961 -18111 237224 345628 216844 4118 48114 98252 57052 1746 152511 207833 144862
$$ packed form
22036d89046K78468L37842k495o7509Q6049m0593j01681j12490P2444N7354r6534
22025g8191L25295K32699p7502j30184J92457j08353k38213k12944J37529K24872
22015B67465l1780M5463J67248k2937k7609J44766L9330j82765n759j2256o6450
22004C14716l8858P8887n2599k55102k1691k31605q4376Q9163Q3256L6279l9130
21993a21060O8212N6567K33691r4103k08442n598J02327K34710j40044j7441O2453
21982A71272N6715Q5955j54203j37712J07625j89116j98692j19234R3692k81820
21972e65518R1146K27337N695p5343J31789m8116j6357R8800K0440L8189P3827
21961a8111K55335J08404j28784k12726M3996N0138m1200n5306J50765N5322o2971
$$ plain form
21950 144862 180685 242365 338669 298448 -3192 -30854 127215 16772 -42641 28444 108074
21939 108074 221118 -66068 -100543 -3960 156627 -8891 -57325 -55894 -4274 50521 6658
21928 6658 -78002 -86572 25780 -151963 -221594 -46719 194107 109760 94834 107789 139265
21917 139265 205398 252117 44432 -145461 -4569 -24781 -79470 -260527 -278504 -179275 -26822
21906 -26822 15731 53696 232076 418381 260977 188723 85807 28918 -130826 -413546
21896 -413546 -245198 -162493 -354379 -177117 -25189 84654 99711 -7495 -66327 168261
21886 168261 305845 116218 58704 95423 -11653 28703 37909 25104 17864 65468 80222
21875 80222 146739 280044 186880 94069 -245343 -162404 -266170 -363142 -253622 -41995 -2976
$$ packed form
21950A44862L5823O1680R6304m0221l01640k7662J58069j10443n9413P1085P9630
21939A08074J13044k87186l4475R6583J60587j65518m8434J431N1620N4795m3863
21928F658q4660q570J12352j77743o9631J74875K40826q4347j4926J2955L1476
21917A39265O6133M6719k07685j89893J40892k0212n4689j81057j7977R9229J52453
21906b6822M2553L7965J78380J86305j57404p2254j02916n6889j59744k82720
21896d13546J68348Q2705j91886J77262J51928J09843J5057j07206n8832K34588
21886A68261J37584j89627n7514L6719j07076M0356R206j2805p240M7604J4754
21875H0222O6517J33305r3164r2811l39412Q2939j03766r6972J09520K11627L9019
$$ plain form
21864 -2976 77167 332112 198031 132001 72788 -116462 -182056 -78872 30874 30542 -370267
21853 -370267 -243057 -28870 -149619 -357061 -382820 -298839 -363045 -115722 6202 -84529
21843 -84529 -11422 -153052 -317144 -360333 -363615 -295762 -116600 -171200 -344609 -210096 -127081
21832 -127081 -7292 1610 -194544 -282079 -201722 -215661 -214921 -86241 22630 90194 -32091
21821 -32091 -173127 -150840 -30760 -328537 -303944 -202152 52573 156278 98330 -41661
21811 -41661 -115343 -243818 -246498 -174357 -61381 240576 411605 476337 386372 440729 353253
21800 353253 192676 -50218 64458 69855 -77773 43487 5720 -7658 -88359 -10536 66468
21789 66468 140578 51881 -32622 -216837 -175067 -8292 -41663 -95016 -142085 -106213 -94547
$$ packed form
21864b976Q0143K54945j34081o6030n9213j89250o5594J03184J09746l32m00809
21853c70267J27210K14187j20749k07442k5759Q3981o4206K47323J21924r0731
21843h4529P3107j41630j64092m3189l282O7853J79162n4600j73409J34513Q3015
21832a27081J19789Q902j96154q7535Q0357j3939P40J28680J08871O7564j22285
21821c2091j41036K2287J20080k97777K4593J01792K54725J03705n7948j39991
21811d1661p3682j28475k680P2141J12976L01957J71029O4732q9965N4357q7476
21800C53253j60577k42894J14676N397j47628J21260l7767j3378q0701P7823P7004
21789F6468P4110q8697q4503j84215M1770J66775l3371n3353m7069L5872J1666
$$ plain form
21778 -94547 -127499 -127552 -72542 -157501 -35015 66877 -242816 -579954 -394499 -99659 86092
21767 86092 255990 247904 108744 -23328 30675 36993 -136863 -437381 -302365 -28949 130610
21756 130610 79066 -79803 -167970 -274297 -98560 142101 159063 206015 203224 169048 145079
21745 145079 183066 235061 322862 506542 555143 316129 115984 -83115 -170082 -59927
21735 -59927 331867 461863 343952 143636 -20861 -177459 -298166 -359496 -579960 -579358
21725 -579358 -299667 17803 59233 -33497 -56215 -63785 -340519 -113779 -50834 -7310 112682
21714 112682 -71804 -56348 -49243 -35551 -291367 -297575 -154495 -82785 42026 -4105 -69970
21703 -69970 -329712 -440158 -400886 -214237 -38006 53956 235889 114428 -89041 -234359
$$ packed form
21778i4547l2952n3N5010q4959J22486J01892l09693l37138J85455K94840J85751
21767H6092J69898q086j39160j32072N4003O318j73856l00518J35016K73416J59559
21756A30610n1544j58869q8167j06327J75737K40661J6962M6952k791l4176k3969
21745A45079L7987N1995Q7801J83680M8601k39014k00145j99099q6967J10155
21735e9927L91794J29996j17911k00316j64497j56598j20707o1330k20464O02
21725e79358K79691L17470M1430r2730k2718p570k76734K26740O2945M3524J19992
21714A12682j84486J5456P105J3692k55816o208J43080P1710J24811m6131o5865
21703f9970k59742j10446L9272J86649J76231R1962J81933j21461k03469j45318
$$ plain form
21693 -234359 -171691 -102935 44006 -41440 -242208 -230538 -327656 -222295 -107237 -29380 187878
21682 187878 205994 129834 212668 274515 1264 -220817 -228868 -92655 119059 30062 -317800
21671 -317800 -234661 -62534 32269 30234 1960 -80578 -61687 -32931 144518 291360 329792
21660 329792 333235 156628 -98448 -265083 -41833 240276 159884 125403 151695 108820 -54306
21649 -54306 16643 98239 -64912 -89454 108161 56107 63470 93139 129141 230746 431251
21638 431251 375775 260785 148231 218916 246717 70833 -41874 -177973 -253585 -248937 -188821
21627 -188821 30434 315146 257615 210279 207149 160519 -59723 -175296 -204928 -205559 -224150
21616 -224150 -162007 -453124 -464515 -262623 -126646 -49963 62395 80065 -85138 -228772
$$ packed form
21693b34359O2668O8756J46941q5446k00768J1670r7118J05361J15058P7857K17258
21682A87878J8116p6160Q2834O1847k73251k22081q051J36213K11714q8997l47862
21671c17800Q3139J72127R4803k035k8274q2538J8891K8756J77449J46842L8432
21660C29792L443j76607k55076j66635K23250K82109q0392l4481K6292m2875j63126
21649e4306P0949Q1596j63151k4542J97615n2054P363K9669L6002J01605K00505
21638D31251n5476j14990j12554P0685K7801j75884j12707j36099p5612M648O0116
21627a88821K19255K84712n7531m7336l130m6630k20242j15573k9632o31j8591
21616b24150O2143k91117j1391K01892J35977P6683J12358J7670j65203j43634
$$ plain form
21606 -228772 -34405 22994 -33305 -171857 19256 282397 770 -186420 -173630 -41802
21596 -41802 30803 -224766 -173119 -30064 -175628 -154987 82609 13977 28705 69765 -260442
21585 -260442 -264552 -44206 126554 -12545 -135944 -190735 -51573 -95336 -153158 -241535 -208206
21574 -208206 -58519 30412 -53410 -144823 116526 126111 273775 115532 -140333 -284965
21564 -284965 -393098 -185399 -6858 17584 -260486 -393388 -411555 -196280 31848 -3024
21554 -3024 114579 82336 -52958 -125297 -61307 -78970 -183310 -269942 -109787 -125913 -222686
21543 -222686 -184838 -78989 -33554 -74392 -60441 -182692 -113153 -127532 -295094 -331209 -278161
21532 -278161 -155470 -327483 -176488 37518 99103 174186 161409 286435 331658 257096
$$ packed form
21606b28772J94367N7399n6299j38552J91113K63141k81627j87190J2790J31828
21596d1802P2605k55569N1647J43055j45564K0641K37596o8632J4728M1060l30207
21585b60442m110K20346J70760j39099j23399n4791J39162m3763n7822q8377L3329
21574b08206J49687Q8931q3822r1413K61349R585J47664j58243k55865j44632
21564b84965j08133K07699J78541K4442k78070j32902j8167K15275K28128l4872
21554c024J17603l2243j35294p2339O3990j7663j04340q6632J60155j6126r6773
21543b22686L7848J05849M5435m0838J3951j22251O9539j4379j67562l6115N3048
21532b78161J22691j72013J50995K14006O1585P5083j2777J25026M5223p4562
$$ plain form
21522 257096 38478 28340 226214 382176 373813 128174 61974 182455 351037 366446
21512 366446 270672 -97952 -276287 -185656 -48350 97042 -114310 -118432 -142574 -24902
21502 -24902 297483 385902 366393 348322 231819 325026 383327 420360 401341 174403 -153823
21491 -153823 -252180 -233775 -171279 37115 132423 112365 118480 51943 161809 25389 -7046
21480 -7046 53833 75607 123584 1142 -119937 -39207 9598 116836 172195 181940 33616
21469 33616 -81901 -67114 -82565 63153 135899 103111 -94598 -84384 147681 327130 198786
21458 198786 48486 86839 -37661 103670 52696 -105078 77285 189261 -19983 -43213
21448 -43213 -45583 -99661 -130640 -198220 -220623 -85158 28400 144903 113251 89271 326805
$$ packed form
21522B57096k18618j0138J97874J55962q363k45639o6200J20481J68582J5409
21512C66446r5774l68624j78335R0631J37306J45392k11352m122k4142J17672
21502b4902L22385Q8419j9509j8071j16503R3207N8301L7033j9019k26938l28226
21491a53823r8357J8405O2496K08394R5308k0058O115o6537J09866j36420l2435
21480g046O0879K1774M7977j22442j21079Q0730M8805J07238N5359R745j48324
21469C3616j15517J4787j5451J45718P2746l2788j97709J0214K32065J79449j28344
21458A98786j50300L8353j24500J41331n0974j57774J82363J11976k09244k3230
21448d3213k370n4078l0979o7580k2403J35465J13558J16503l1652k3980K37534
$$ plain form
21437 326805 196548 -237419 -317528 -246826 -357623 -349029 -254551 -134948 -108071 -230060 -97006
21426 -97006 200896 273532 192510 60768 61086 20981 -120380 -294807 -216015 -78170 -118378
21415 -118378 -46621 58080 222258 220610 -22813 -168515 -333216 -271841 -320366 -309410 125183
21404 125183 281542 238474 312519 311388 229079 139666 26667 7582 41953 51672 -12673
21393 -12673 -52529 18689 -59239 -153340 -234008 -200885 -33271 52236 51049 38200 -85800
21382 -85800 -98570 -80573 -28793 62216 103433 30606 8659 -8955 -53433 -225322 -83177
21371 -83177 25867 264936 385377 152912 -59371 -203064 -16254 219781 210336 199819
21361 199819 119707 234428 214553 -44805 -90912 8265 94389 223942 387010 495252
$$ packed form
21437C26805j30257m33967q0109P0702j10797Q594R4478J19603K6877j21989J33054
21426i7006K97902P2636q1022j31742L18m0105j41361j74427P8792J37845m0208
21415a18378P1757J04701J64178j648k43423j45702j64701O1375m8525J0956M34593
21404A25183J56359m3068P4045j131q2309q9413j12999j9085L4371R719o4345
21393a2673l9856P1218p7928r4101q0668L3123J67614Q5507j187j2849j24000
21382h5800j2770J7997N1780R1009M1217p2827k1947j7614m4478j71889J42145
21371h3177J09044K39069J20441k32465k12283j43693J86810K36035r445j0517
21361A99819q0112J14721j9875k59358m6107R9177Q6124J29553J63068J08242
$$ plain form
21351 495252 306449 90024 79130 102897 -9505 65487 116926 119427 -133980 5253 -103833
21340 -103833 -129180 237385 320139 427149 553855 606654 467028 261912 188043 130128
21330 130128 11217 174334 104872 158136 398537 449773 509301 138913 -7489 86598
21320 86598 -29110 -7675 179893 279247 113357 13295 -69482 -97642 -65043 -83601 -45098
21309 -45098 -113160 47535 -225473 -219050 -215571 -255891 -230825 -152230 -78866 -56496 168171
21298 168171 297437 457877 456071 274151 137564 -119347 -144293 -116592 -294175 -82182
21288 -82182 9004 -120462 9325 6087 27557 -80956 -269629 -171502 -206082 -235106 -166781
21277 -166781 -68157 -70744 -74692 -293066 -450665 -319414 -225408 -199069 -65505 68950 166855
$$ packed form
21351D95252j88803k16425j0894K3767j12402P4992N1439K501k53407J39233j09086
21340a03833k5347L66565Q2754J07010J26706N2799j39626k05116p3869n7915
21330A30128j18911J63117o9462N3264K40401N1236N9528l70388j46402R4087
21320H6598j15708K1435J87568R9354j65890j00062q2777k8160L2599j8558L8503
21309d5098o8062J60695k73008O423L479m0320K5066P8595P3364K2370K24667
21298A68171J29266J60440j806j81920j36587k56911k4946K7701j77583K11993
21288h2182R1186j29466J29787l238K1470j08513j88673R8127l4580k9024O8325
21277a66781R8624k587l948k18374j57599J31251R4006K6339J33564J34455R7905
$$ plain form
21266 166855 60862 -30025 -97770 -172469 -85670 -128804 -70889 -108900 -86982 -43554 110332
21255 110332 235190 211466 -12185 70053 -54044 -79707 33469 -56428 -158507 -86562
21245 -86562 -140157 86731 -38117 -301098 -235841 -343540 -405684 -128760 114591 180205
21235 180205 387507 538251 416652 248452 143986 191562 308101 469223 493578 261376
21225 261376 358007 478605 295344 53010 118183 163702 91195 252223 355104 23788
21215 23788 -246872 -136545 -159513 -128804 -86699 -114662 -233376 -128750 56492 -76040
21205 -76040 -83263 -322402 -327955 -27743 321458 304740 -15842 -409442 -285593 -35928 -31932
21194 -31932 -87875 -225499 -134339 -85128 46563 -43059 -96686 -129395 -59523 74735 242810
$$ packed form
21266A66855j05993r0887o7745p4699Q6799m3134N7915l8011K1918M3428J53886
21255A10332J24858k3724k23651Q2238j24097k5663J13176q9897j02079P1945
21245h6562n3595K26888j24848k62981O5257j07699o2144K76924K43351O5614
21235A80205K07302J50744j21599j68200j04466M7576J16539J61122K4355k32202
21225B61376R6631J20598j83261k42334O5173M5519p2507J61028J02881l31316
21215B3788k70660J10327k2968L0709M2105k7963j18714J04626J85242j32532
21205g6040p223k39139n553L00212L49201j6718l20582l93600J23849K49665L996
21194c1932n5943j37624R1160M9211J31691q9622n3627l2709O9872J34258J68075
$$ plain form
21183 242810 261516 200441 127903 49945 300466 486419 276855 350441 432264 348829 364808
21172 364808 328591 353824 434286 385791 551897 635041 676794 746696 569246 270531 175087
21161 175087 122134 161138 339532 481723 490903 468103 88395 34296 146303 216409 360517
21150 360517 292192 367384 166764 103206 -5501 -96145 12010 83835 106277 164250 273492
21139 273492 356527 232631 46504 -7507 -209490 -271733 -118484 -6791 -18642 -4799
21129 -4799 633 95818 -123712 -124518 75861 105618 -37361 79026 91147 166231 202302 215950
21117 215950 142767 63464 -4351 -94896 -94557 -138564 -341353 -467312 -361032 -296311 -270661
21106 -270661 -160806 57629 196084 70191 98549 167102 320933 371338 187691 -32765
$$ packed form
21183B42810J8706o1075p2538p7958K50521J85953k09564P3586Q1823q3435J5979
21172C64808l6217K5233Q0462m8495J66106Q3144M1753O9902j77450k98715r5444
21161A75087n2953L9004J78394J42191R180k2800l79708n4099J12007P0106J44108
21150C60517o8325P5192k00620o3558j08707r0644J08155P1825K2442N7973J09242
21139B73492Q3035j23896j86127n4011k01983o2243J53249J11693j1851J3843
21129d799N432R5185k19530q06K00379K9757j42979J16387J2121P5084L6071J3648
21117B15950p3183p9303o7815r0545L39m4007k02789j25959J06280O4721K5650
21106b70661J09855K18435J38455j25893K8358O8553J53831N0405j83647k20456
$$ plain form
21096 -32765 2987 -90462 -205297 -334921 -415602 -209477 -89872 -62817 -159274 -244015 -71126
21085 -71126 -8988 -10722 120690 29412 -87265 -18847 142845 58085 14790 -76851 47283
21074 47283 225135 199125 151994 292412 283884 263007 14673 -65128 -60700 111968 106788
21063 106788 71417 112922 12385 16036 -70286 -101674 32059 64944 222841 178057 121861
21052 121861 11541 -84608 -135807 -90422 -183624 -285194 -297486 -266863 -110960 166061 205403
21041 205403 162320 93893 -81902 -201944 -107127 59712 12630 58193 -19270 -46552 69064
21030 69064 11504 -182621 -300132 -230908 41117 141143 39917 176063 449060 271285
21020 271285 -156767 -262301 -200783 -56443 44202 -145593 -242231 63851 319647 179938
$$ packed form
21096c2765L5752r3449j14835j29624q0681K06125J19605K7055r6457q4741J72889
21085g1126O2138j734J31412r1278j16677O8418J61692q4760m3295r1641J24134
21074D7283J77852k6010m7131J40418q528k0877k48334p9801M428J72668n180
21063A06788l5371M1505j00537L651q6322l1388J33733L2885J57897m4784n6196
21052A21861j10320r6149n1199M5385r3202j01570j2292L0623J55903K77021L9342
21041B05403m3083o8427j75795j20042R4817J66839m7082M5563p7463k7282J15616
21030F9064n7560j94125j17511O9224K72025J00026j01226J36146K72997j77775
21020B71285m28052j05534O1518J44340J00645j89795r6638L06082K55796j39709
$$ plain form
21010 179938 138298 -116842 -261223 -243271 -285370 -285055 -391092 -260848 -207410 -183052 -21346
20999 -21346 48581 12209 -37429 29096 121137 144167 -28525 -67803 73282 65865 -184533
20988 -184533 -347391 -397034 -329205 -115143 -61437 -62444 -143531 -9885 -117383 -308332 -271420
20977 -271420 67695 61186 -146901 -215190 -276587 -400800 -339846 -300397 -155675 -5816 -83318
20966 -83318 -123177 -54005 -186530 -329192 -168979 77680 340875 100778 13839 -103890
20956 -103890 69347 244752 256821 130751 81288 105871 70801 -77921 -116574 -157532 8514
20945 8514 -145347 -305228 -343939 -171275 -206246 -227195 -241707 -331673 -365809 -235908 -36408
20934 -36408 151275 176744 -37576 -262311 -427395 -522746 -540670 -400127 -208512 -135206
$$ packed form
21010A79938m1640k55140j44381J7952m2099L15j06037J30244N3438K4358J61706
20999b1346O9927l6372m9638O6525R2041K3030j72692l9278J41085p417k50398
20988a84533j62858m9643O7829K14062N3706j007q1087J33646j07498j90949L6912
20977b71420L39115o509k08087o8289o1397j24213O0954L9449J44722J49859p7502
20966h3318l9859O9172j32525j42662J60213K46659K63195k40097q6939j17729
20956a03890J73237J75405J2069j26070m9463K4583l5070j48722l8653m0958J66046
20945H514j53861j59881l8711J72664l4971k0949j4512q9966l4136J29901J99500
20934c6408J87683K5469k14320k24735j65084r5351j7924J40543J91615P3306
$$ plain form
20924 -135206 -201104 -356362 -281736 -82327 55871 248912 21834 -304775 -236922 46327
20914 46327 158211 47127 -161684 -105133 234050 153596 63676 38647 267775 285415 378345
20903 378345 170339 17688 12628 33246 22913 65043 200622 -40549 -30516 54666 -46726
20892 -46726 111402 101265 -127661 -317750 -336503 -279364 -136309 -146381 -203601 -8196 -71298
20881 -71298 -73754 -183463 -236291 -45118 147671 225848 278959 421198 363351 168668 -40560
20870 -40560 -142188 -126867 10701 180407 119217 145683 65899 -24589 98409 29700 14954
20859 14954 -154252 -68591 102517 308487 231987 -22306 42347 83749 316853 336026 375509
20848 375509 249012 90388 -58134 -129352 -8213 -72176 -249252 -505091 -478643 36892
$$ packed form
20924a35206o5898j55258P4626J99409J38198J93041k27078l26609O7853K83249
20914D6327J11884j11084k08811N6551L39183q0454q9920k5029K29128J7640R2930
20903C78345k08006j52651n060K0618j0333M2130J35579k41171J0033Q5182j01392
20892d6726J58128j0137k28926j90089j8753N7139J43055j0072n7220J95405o3102
20881g1298k456j09709n2828J91173J92789P8177N3111J42239n7847j94683k09228
20870d0560j01628J5321J37568J69706o1190K6466p9784r0488J22998o8709j4746
20859A4954j69206Q5661J71108K05970p6500k54293O4653M1402K33104J9173L9483
20848C75509j26497j58624j48522p1218J21139o3963j77076k55839K6448N15535
$$ plain form
20838 36892 334970 271449 247425 403945 466052 312295 196807 171463 42872 91230 283572
20827 283572 315272 334467 390524 283282 56035 -51851 -235663 -116880 -36560 129864
20817 129864 123474 256057 198793 5516 -252649 -97564 146710 92337 115560 -152228
20807 -152228 -204372 -130909 47169 183560 167841 217585 397173 413484 232706 88575
20797 88575 -32025 -71013 32082 49740 -222495 -102255 73867 193426 137467 45657
20787 45657 61225 -72435 -226444 -176516 -23562 36697 157984 247304 408107 259783
20777 259783 269523 353541 370883 314680 282119 300404 373754 295957 296269 192412 154064 342793
20765 342793 443668 375411 30047 -149876 -56823 162608 350546 250697 359419 168357
$$ packed form
20838C6892K98078o3521k4024J56520O2107j53757j15488k5344j28591M8358J92342
20827B83572L1700J9195N6057j07242k27247j07886j83812J18783Q0320J66424
20817A29864o390J32583n7264j93277k58165J55085K44274n4373K3223k67788
20807a52228n2144P3463J78078J36391j5719M9744J79588J6311j80778j44131
20797H8575j20600l8988J03095J7658k72235J20240J76122J19559n5959r1810
20787D5657J5568j33660j54009M9928J52954O0259J21287Q9320J60803j48324
20777B59783R740Q4018J7342n6203l2561J8285P3350p7797L12j03857l8348J88729
20765C42793J00875o8257l45364j79923R3053K19431J87938r9849J08722j91062
$$ plain form
20755 168357 -127423 -170708 -261379 -182628 5850 -14280 -514 261807 363442 304075 87957
20744 87957 -151363 -143009 38751 108016 109096 -40325 -122871 -92364 -94934 -105673 -5843 51361
20732 51361 18997 -153392 -60437 15068 -129798 -209068 -410331 -497862 -499880 -449845 -290643
20721 -290643 -118907 132611 27290 21791 19721 -256708 -516357 -463546 -292017 -148994
20711 -148994 126244 292056 -34979 -279387 6863 93153 115716 137013 141845 120629 235128
20700 235128 105484 17078 97666 35527 -3296 143449 208081 120872 -49885 6374 -12819
20689 -12819 -74260 -131799 -162661 -16364 56032 -123797 -195727 11177 194599 344437 263752
20678 263752 107364 642 -130434 -157285 -162528 -83969 62780 84738 37403 99176 -289706
$$ packed form
20755A68357k95780m3285r0671P8751J88478k0130J3766K62321J01635n9367k16118
20744H7957k39320Q354J81760O9265J080j49421q2546L0507k570j0739R9830N7204
20732E1361l2364j72389R2955P5505j44866p9270k01263q7531k018N0035J59202
20721b90643J71736K51518j05321n499k070k76429k59649N2811J71529J43023
20711a48994K75238J65812l27035k44408K86250Q6290K2563K1297M832k1216J14499
20700B35128j29644q8406Q0588o2139l8823J46745O4632q7209j70757N6259j9193
20689a2819o1441n7539l0862J46297P2396j79829p1930K06904J83422J49838q0685
20678B63752j56388j06722j31076k6851n243P8559J46749K1958m7335O1773l88882
$$ plain form
20667 -289706 -442407 -249897 26216 130606 132481 69130 32096 130766 14780 -22970 54351
20656 54351 351 2635 85259 -19674 -159353 -15593 -57182 14390 53418 -103625 -72340
20645 -72340 102400 47779 729 107519 47883 -157425 -317541 53935 330731 291581
20635 291581 120462 3040 -101940 -182845 -245070 -236346 -323689 -283970 -242595 -142596 -30619
20624 -30619 -46189 216616 330874 137319 45482 8220 23300 -88530 -336706 -214069
20614 -214069 36504 -87273 -69671 -68845 -262916 -208148 -163 -13522 77049 99582 12086
20603 12086 56843 -8433 43594 107731 81396 63289 55662 99131 37635 141947 248074
20592 248074 238994 144513 214880 -21184 -79122 -26789 -79758 -240931 -433347 -399563 -386887
$$ packed form
20667b89706j52701J92510K76113J04390J875o3351l7034R8670j15986l7750P7321
20656E4351n4000K284Q2624j04933j39679J43760m1589P1572L9028j57043L1285
20645g2340J74740n4621m7050J06790n9636k05308j60116L71476K76796l9150
20635B91581j71119j17422j04980q0905o2225Q724q7343L9719M1375R9999J11977
20624c0619j5570K62805J14258j93555r1837l7262J5080j11830k48176J22637
20614b14069K50573j23777J7602Q26j94071N4768K07985j3359R0571K2533q7496
20603A2086M4757o5276N2027O4137k6335j8107p627M3469o1496J04312J06127
20592B48074r080r4481P0367k36064n7938N2333n2969j61173j92416L3784J2676
$$ plain form
20581 -386887 -346779 -198617 -209738 -147552 -225954 -194462 -173625 -220294 -265665 -314685 -226309
20570 -226309 -243094 -295006 -394134 -82041 117044 -67686 -166594 91043 224753 179466
20560 179466 -63675 -199319 -391476 -372764 -251066 -137134 56302 198385 88890 58890
20550 58890 -68312 -272306 -421233 -747338 -807919 -553745 -293673 -54103 -104446 -172326
20540 -172326 -87644 38136 59151 198822 383804 318179 199227 94277 174091 147184
20530 147184 71377 31520 -118396 -10803 46930 -47134 -59148 76796 -39981 -129261 -281789
20519 -281789 -148800 62240 92599 23063 -130673 -122390 -151819 -237273 -212462 -227042 -293001
20508 -293001 -135030 155974 146802 -7671 126682 26468 -44863 -152996 67809 154576
$$ packed form
20581c86887M0108J48162j1121O2186p8402L1492K0837m6669m5371m9020Q8376
20570b26309j6785n1912r9128L12093J99085j84730r8908K57637J33710m5287
20560A79466k43141j35644j92157J8712J21698J13932J93436J42083j09495l0000
20550E8890j27202k03994j48927l26105o0581K54174K60072K39570n0343o7880
20540a72326Q4682J25780K1015J39671J84982o5625j18952j04950P9814k6907
20530A47184p5807l9857j49916J07593N7733r4064j2014J35944j16777q9280j52528
20519b81789J32989K11040L0359o9536j53736Q283k9429q5454K4811j4580o5959
20508b93001J57971K91004r172j54473J34353j00214p1331j08133K20805Q6767
$$ plain form
20498 154576 -14697 -77356 32408 108071 -8024 -23368 -22680 69410 149953 104190 -10716
20487 -10716 -165931 -273350 62143 145712 180486 128558 185891 321887 384145 214383 52178
20476 52178 141409 132503 21369 -143744 -459562 -303927 -69264 140678 198673 269258 204543
20465 204543 -16217 -152967 146435 252856 89990 109735 47436 56131 244117 145853
20455 145853 172083 198345 187788 193724 199978 177510 364025 504352 205000 140867 -99490
20444 -99490 -263826 -17226 206263 133800 74295 -20382 11635 59334 225021 351164 419951
20433 419951 282562 284441 464988 294642 123117 112499 251221 325778 155927 196530
20423 196530 313633 215095 -82687 -108264 38419 39429 1236 84634 104649 303102 201781
$$ packed form
20498A54576j69273o2659J09764P5663j16095j5344O88R2090Q0543m5763j14906
20487a0716j55215j07419L35493Q3569L4774n1928N7333J35996O2258j69762j62205
20476E2178Q9231q906j11134j65113l15818J55635K34663K09942N7995P0585o4715
20465B04543k20760j36750K99402J06421j62866J9745o2299Q695J87986r8264
20455A45853K6230K6262j0557N936O254k2468J86515J40327k99352o4133k40357
20444i9490j64336K46600K23489p2463n9505r4677L2017M7699J65687J26143O8787
20433D19951j37389J879J80547j70346j71525j0618J38722P4557j69851M0603
20423A96530J17103r8538k97782k5577J46683J010l8193Q3398K0015J98453j01321
$$ plain form
20412 201781 70553 201245 301083 468813 419406 286100 204643 254783 207419 71907
20402 71907 57767 197832 141539 -2179 -53660 -139156 1436 104972 137881 -6452 -104921
20391 -104921 -171545 -83023 -21854 107571 67509 -27690 -52809 -203171 -64177 -63750 -113422
20380 -113422 -56165 -36348 91498 131437 140716 251031 369202 295185 288742 278000 172759
20369 172759 105858 92040 -65442 -73784 -156398 -3035 66453 19926 -60238 -227413 -84057
20358 -84057 -73750 -139395 212344 304977 181842 9634 150199 208116 170166 30787 182389
20347 182389 88429 91764 245668 173613 114973 -76555 -50578 10567 -43854 -136639 -101162
20336 -101162 -72836 11726 -10504 161523 208582 306319 204903 181605 134079 -28719 15227
$$ packed form
20412B01781j31228J30692R9838J67730m9407j33306q1457N0140m7364j35512
20402G1907j4140J40065n6293j43718n1481q5496J40592J03536L2909j44333r8469
20391a04921o6624Q8522O1169J29425m0062r5199k5119j50362J38994M27m9672
20380a13422N7257J9817J27846L9939R279J10315J18171p4017o443j0742j05241
20369A72759o6901j3818j57482q342q2614J53363O9488m6527q0164j67175J43356
20358h4057J0307o5645L51739R2633j23135j72208J40565N7917l7950j39379J51602
20347A82389r3960L335J53904p2055n8640j91528K5977O1145n4421r2785L5477
20336a01162K8326Q4562k2230J72027M7059R7737j01416k3298m7526j62798M3946
$$ plain form
20325 15227 95692 370187 499443 222901 101927 -15223 78391 267197 361886 85571
20315 85571 -278539 -130213 -81380 6066 100989 247118 69887 -69515 -126350 132862
20305 132862 432194 503028 336754 213395 244406 271283 387194 550082 427654 177105
20295 177105 173171 169878 -193595 -227627 -295290 -241492 -246890 -156062 -176890 -551 131161
20284 131161 115679 124257 215310 176913 158073 194768 -5958 -197247 -104544 -102592 -194697
20273 -194697 -52663 6040 74043 178602 332959 253166 140219 182302 118718 -38611
20263 -38611 -53567 -146218 -104252 -25636 -125762 -245220 -325038 -258413 46892 78369 -2588
20252 -2588 -100178 -57117 214453 388151 413330 382770 104300 -45838 30912 174597 41197
$$ packed form
20325A5227Q0465K74495J29256k76542j20974j17150R3614J88806R4689k76315
20315H5571l64110J48326M8833Q7446R4923J46129j77231j39402n6835K59212
20305A32862K99332P0834j66274j23359L1011K6877J15911J62888j22428k50549
20295A77105l934l293l63473l4032o7663N3798n398R0828k0828J76339J31712
20284A31161j5482Q578R1053l8397j8840L6695k00726j91289R2703J952r2105
20273a94697J42034N8703O8003J04559J54357p9793j12947M2083o3584j57329
20263c8611j4956r2651M1966P8616j00126j19458p9818O6625L05305L1477q0957
20252b588r7590M3061K71570J73698K5179l0560k78470j50138P6750J43685j33400
$$ plain form
20241 41197 102783 186550 75499 58049 -70078 -255229 -158131 -56886 -210802 -64045
20231 -64045 158961 65684 83662 181372 20970 -23633 94562 -95194 -224764 -41018
20221 -41018 49388 15291 -68485 -155442 -266919 -75889 77471 66466 -128863 -167449 65847
20210 65847 -43921 65548 -41030 -78880 -33389 -146356 -306043 -96360 -7373 -180494
20200 -180494 -244401 -239445 -195277 -93423 81273 148241 225876 107814 22388 98151 81085
20189 81085 232823 417156 494609 431793 388438 280551 219408 114797 170328 311605 652480
20178 652480 642666 486627 329264 182269 271909 322971 280127 199646 151443 305329 371910
20167 371910 476550 384989 66065 -95633 3225 -50350 -140129 195290 368074 250616
$$ packed form
20241D1197O1586Q3767j11051j7450j28127j85151R7098J01245j53916J46757
20231f4045K23006r3277J7978R7710j60402m4603J18195j89756j29570J83746
20221d1018R0406l4097q3776q6957j11477J91030J53360j1005j95329l8586K33296
20210F5847j09768J09469j06578l7850M5491j12967j59687K09683Q8987j73121
20200a80494o3907M956M4168J01854J74696O6968P7635j18062q5426P5763j7066
20189H1085J51738J84333P7453o2816m3355j07887o1143j04611N5531J41277L40875
20178F52480r814j56039j57363j46995Q9640N1062m2844q0481m8203J53886O6581
20167C71910J04640r1561l18924j61698R8858n3575q9779L35419J72784j17458
$$ plain form
20157 250616 107557 137084 4953 54959 -28466 -156878 -175643 -348222 -256195 -236179 -342022
20146 -342022 -180436 8559 11175 -71131 -348799 -470974 -297670 -175035 -26395 69851
20136 69851 -4165 -152558 -243501 -256436 -116241 -12206 155511 28075 -90689 -135297
20126 -135297 -166416 -205755 -137969 65490 -80049 139357 398446 178742 67738 -5348
20116 -5348 -200879 -148073 88337 258307 289988 260533 252265 251256 322077 235189 14224
20105 14224 61855 209194 97285 -82103 -217079 -270509 -196511 -76937 136581 94152
20095 94152 -127692 -175358 -146738 -250921 -280880 55419 200966 66613 -120029 -395013
20085 -395013 -65181 353294 404504 177931 -135562 73721 270967 415088 277204 265045
$$ packed form
20157B50616j43059K9527j32131N0006q3425j28412j8765j72579R2027K0016j05843
20146c42022J61586J88995K616q2306k77668j22175J73304J22635J48640R6246
20136F9851p4016j48393r0943j2935J40195J04035J67717j27436j18764m4608
20126a35297l1119l9339O7786K03459j45539K19406K59089k19704j11004p3086
20116e348j95531N2806K36410J69970L1681k9455q268j009P0821q6888k20965
20105A4224M7631J47339j11909j79388j34976n3430P3998J19574K13518m2429
20095I4152k21844m7666K8620j04183k9959L36299J45547j34353j86642k74984
20085c95013L29832M18475N1210k26573l13493K09283J97246J44121j37884j2159
$$ plain form
20075 265045 164278 1365 93305 56505 36828 179511 139204 78555 -12506 -58449 65212
20064 65212 221668 311923 173097 68276 108664 -1666 -30639 32078 -54034 99239 81313
20053 81313 181590 324348 291334 113389 93288 18510 -115340 -20483 34851 219862 242688
20042 242688 266111 227260 203704 37221 90457 16918 -83383 -113203 -99535 -31930 63339
20031 63339 24107 59631 55307 170106 79940 83600 56834 20753 218510 283890 265801 178493
20019 178493 209111 87552 137436 255487 195655 158001 84112 -65298 -391591 -364910 22964
20008 22964 230826 -154590 -158055 30113 114638 18453 78285 182308 145182 116709 47099
19997 47099 -53637 -97067 -6874 -17678 48225 170092 -148847 -385938 -493251 -319405
$$ packed form
20075B65045j00767j62913R1940l6800j9677J42683m0307o0649r1061m5943J23661
20064F5212J56456R0255j38826j04821M0388j10330k8973O2717q6112J53273j7926
20053H1313J00277J42758l3014j77945k0101p4778j33850R4857N5334J85011K2826
20042B42688K3423l8851k3556j66483N3236p3539j00301k9820J3668O7605R5269
20031F3339l9232L5524m324J14799r0166L660k6766l6081J97757O5380j8089q7308
20019A78493L0618j21559M9884J18051n9832l7654p3889j49410l26293K6681L87874
20008B2964K07862l85416l465J88168Q4525r6185N9832J04023l7126k8473o9610
19997D7099j00736m3430R0193j0804O5903J21867l18939k37091j07313J73846
$$ plain form
19987 -319405 -260570 -172990 248586 271772 290255 303087 381842 406050 420287 396012 440968
19976 440968 220261 134668 275227 449035 684419 855810 844943 790558 979461 804343
19966 804343 651271 484053 545151 556276 387169 196062 150156 295871 647450 849588
19956 849588 731396 479781 504341 599968 694282 700963 656852 509344 442425 342611 297534
19945 297534 268185 256091 139164 258035 440621 573024 816603 752673 549998 427941
19935 427941 266097 186608 120805 8906 -11299 83621 96113 223238 145591 36324 237038
19924 237038 358063 304382 470398 750666 898949 748501 741296 564156 318957 401935
19914 401935 560544 457640 437998 431559 554325 475267 399204 569215 633400 565228 532893
$$ packed form
19987c19405N8835Q7580M21576K3186J8483J2832P8755K4208J4237k4275M4956
19976D40968k20707q5593J40559J73808K35384J71391j0867n4385J88903j75118
19966H04343j53072j67218O1098J1125j69107j91107m5906J45715L51579K02138
19956H49588j18192k51615K4560R5627R4314O681m4111j47508o6919r9814m5077
19945B97534k9349j2094j16927J18871J82586J32403K43579o3930k02675j22057
19935D27941j61844p9489o5803j11899k0205R4920J2492J27125p7647j09267K00714
19924B37038J21025n3681J66016K80268J48283j50448p205j77140k45199Q2978
19914D01935J58609j02904j9642o439J22766p9058p6063J70011O4185o8172l2335
$$ plain form
19903 532893 523460 605726 444621 210506 19067 51096 78642 -87516 -34835 33105 54233
19892 54233 58898 188256 291060 290012 322649 335240 367935 223471 174992 197649 502289
19881 502289 629244 433656 287519 362421 425863 217704 194708 77338 93812 15503
19871 15503 -120909 -162999 -33540 128058 153821 80465 -127875 -12084 155668 274386
19861 274386 216642 128792 -55832 -161128 21902 107786 198989 283462 266931 311915 327034
19850 327034 176695 77861 119244 315959 458553 428471 221281 120800 143755 43268
19840 43268 188366 176696 282168 208757 135668 -46707 -175946 -55067 -13751 249337
19830 249337 398390 303222 306583 185920 407223 575838 643239 544551 535107 588823 645694
$$ packed form
19903E32893r433Q2266j61105k34115j91439L2029K7546j66158N2681O7940K1128
19892E4233M665J29358J02804j048L2637J2591L2695j44464m8479K2657L04640
19881E02289J26955j95588j46137P4902O3442k08159k2996j17370J6474p8309
19871A5503j36412m2090J29459J61598K5763p3356k08340J15791J67752J18718
19861B74386n7744q7850j84624j05296J83030Q5884R1203Q4473j6531M4984J5119
19850C27034j50339r8834M1383J96715J42594l0082k07190j00481K2955j00487
19840D3268J45098j1670J05472p3411p3089j82375j29239J20879M1316K63088
19830B49337J49053r5168L361j20663K21303J68615O7401r8688r444N3716N6871
$$ plain form
19819 645694 596514 665598 741980 650442 565580 419756 184496 279686 390400 406960 480469
19808 480469 555833 630364 782802 830201 977751 1072663 732738 477679 501659 562473 640768
19797 640768 697003 606350 317318 245514 213485 114135 337109 455477 520262 424320 473455
19786 473455 583299 494209 503941 480327 399125 336173 470656 288062 258731 253719 22277
19775 22277 49019 -17114 140777 -71769 -149160 -141580 -80438 289238 556577 702861 625115
19764 625115 264546 300197 322900 209800 106637 50060 -1342 8146 193294 93368 -16574
19753 -16574 -5323 -89317 -55249 95177 12739 -46373 360783 545408 711546 864878 878886
19742 878886 920622 786858 638690 558793 443211 237577 68211 -110977 -182066 187525
$$ packed form
19819F45694m9180O9084P6382r1538q4862j45824k35260R5190J10714J6560P3509
19808D80469P5364P4531J52438M7399J47550R4912l39925k55059K3980O0814P8295
19797F40768N6235r0653k89032p1804l2029r9350K22974J18368O4785r5942M9135
19786D73455J09844q9090R732k3614q1202o2952J34483j82594k9331n012k31442
19775B2277K6742o6133J57891k12546p7391P580O1142L69676K67339J46284p7746
19764F25115l60569L5651K2703j13100j03163n6577n1402R488J85148r9926j09942
19753a6574J1251q3994L4068J50426q2438n9112M07156J84625J66138J53332J4008
19742H78886M1736j33764j48168p9897j15582k05634j69366j79188p1089L69591
$$ plain form
19732 187525 310131 311952 284675 267005 352323 348948 449163 404831 179242 216370 97867
19721 97867 -25216 251102 470154 363461 212615 273375 259405 399375 563071 691848
19711 691848 690834 473858 263204 312789 447714 569000 683930 580389 392831 445626
19701 445626 574050 652089 648271 490906 373895 230430 97468 -47324 -247433 -185818
19691 -185818 35630 189747 89682 128264 268956 432544 183942 229188 499038 423984
19681 423984 221572 59574 -26813 29690 -3915 159468 217087 302914 436915 543096
19671 543096 463754 489061 606388 563005 429104 510465 247084 41690 8440 -212122
19661 -212122 -181776 -74557 75434 102929 136118 9471 93885 127433 2225 139643
$$ packed form
19732A87525J22606J821k7277j7670Q5318l375J00215m4332k25589L7128j18503
19721I7867j23083K76318K19052j06693j50846O0760j3970J39970J63696J28777
19711F91848j014k16976k10654M9585J34925J21286J14930j03541j87558N2795
19701D45626J28424P8039l818j57365j17011j43465j32962j44792k00109O1615
19691a85818K21448J54117j00065L8582J40692J63588k48602M5246K69850p5054
19681D23984k02412j61998q6387N6503l3605J63383N7619Q5827J34001J06181
19671E43096p9342K5307J17327m3383j33901Q1361k63381k05394l3250k20562
19661b12122L0346J07219J49991K7495L3189j26647Q4414L3548j25208J37418
$$ plain form
19651 139643 194334 218414 4662 -197861 -149894 25556 257333 503497 607171 876462
19641 876462 1036807 696427 279612 -36647 -39761 194016 143900 17950 -28430 -21844 166781
19630 166781 338848 218544 180216 275233 362934 271755 218320 58687 43359 109880 109993
19619 109993 -29684 -186746 188453 574873 790954 730211 743168 751418 698241 861849
19609 861849 744974 495241 292644 152961 -39990 -40335 109081 143651 182646 284565
19599 284565 308876 316063 434832 483706 654474 820048 956773 1069730 1131958 1083841 1097573
19588 1097573 1050762 897600 775433 702429 835749 760382 807733 842763 773879 611796
19578 611796 565838 449054 508720 583496 549029 603802 629770 568285 696511 579049 388306
$$ packed form
19651A39643N4691K4080k13752k02523M7967J75450K31777K46164J03674K69291
19641H76462J60345l40380m16815l16259l114K33777n0116j25950m6380O586J88625
19630A66781J72067j20304l8328R5017Q7701r1179n3435j59633j5328O6521J13
19619A09993j39677j57062L75199L86420K16081o0743J2957Q250n3177J63608
19609H61849j16875k49733k02597j39683j92951l45J49416L4570L8995J01919
19599B84565K4311P187J18769M8874J70768J65574J36725J12957O2228m8117J3732
19588A097573m6811j53162j22167p3004J33320p5367M7351L5030o8884j62083
19578F11796m5958j16784N9666P4776l4467N4773K5968o1485J28226j17462j90743
$$ plain form
19567 388306 290476 353679 519672 505276 346864 322554 192282 291017 534465 633105 897981
19556 897981 1055361 965797 915158 890436 898352 764023 703281 591939 666180 832459 891343
19545 891343 849482 765281 912755 925329 943215 1014668 971482 1014448 1140289 1192396 1097768
19534 1097768 821047 918077 959516 886235 808097 861666 1157587 1359532 1252026 1293673
19524 1293673 1087348 701913 491715 678737 718100 644255 637066 713166 502033 266210
19514 266210 242019 285764 441136 677881 580143 446112 757601 906969 892024 858038
19504 858038 894302 1007187 894013 916706 899617 805604 922277 973108 895330 999154 1155962
19493 1155962 1229503 1116452 1159250 1007148 892665 969538 818356 829389 889881 948101
$$ packed form
19567C88306r7830O3203J65993j4396j58412k4310j30272R8735K43448R8640K64876
19556H97981J57380q9564n0639k4722P916j34329o0742j11342P4241J66279N8884
19545H91343m1861q4201J47474J2574J7886P1453m3186M2966J25841N2107r4628
19534A097768k76721R7030M1439p3281p8138N3569K95921K01945j07506M1647
19524A293673k06325l85435k10198J87022L9363p3845p189P6100k11133k35823
19514B66210k4191M3745J55372K36745r7738j34031L11489J49368j4945l3986
19504H58038L6264J12885j13174K2693j7089r4013J16673N0831p7778J03824J56808
19493A155962P3541j13051M2798j52102j14483P6873j51182J1033O0492N8220
$$ plain form
19483 948101 1039191 1022676 763521 697798 783214 837699 1177701 1255048 1277405 1206516 1265293
19472 1265293 1132391 999168 989726 1262809 1381625 1306863 1482943 1643170 1763654 1643014
19462 1643014 1595505 1707014 1700317 1687612 1955919 2077743 2040838 2010182 2134483 2188006 2239803
19451 2239803 2467316 2620337 2726882 2770464 2979065 3100816 3428007 3727412 4182822 4904072
19441 4904072 5364128 5845263 6283073 6471575 6814637 7361086 8060149 8807686 9833016
19432 9833016 11351307 13250033 15992413 19981234 25950371 35090701 48683392 67316183
19424 67316183 87047949 101275677 105125539 96675787 79996169 61875484 47515169
19417 47515169 38025258 32371976 29773920 29247734 30329833 33539675 39796061 50536113
$$ packed form
19483I48101R1090j6515k59155o5723Q5416N4485L40002P7347K2357p0889N8777
19472A265293j32902j33223r442K73083J18816p4762J76080J60227J20484j20640
19462A643014m7509J11509o697j2705K68307J21824l6905l0656J24301N3523N1797
19451B239803K27513J53021J06545M3582K08601J21751L27191K99405M55410P21250
19441D904072M60056M81135M37810J88502L43062N46449O99063P47537J025330
19432I833016J518291J898726K742380L988821N969137R140330J3592691J8632791
19424F7316183J9731766J4227728L849862q449752j6679618j8120685j4360315
19417D7515169r489911n653282k598056n26186J082099L209842O256386J0740052
$$ plain form
19409 50536113 67001361 87032321 103565769 110644542 105234929 89399295 69397183
19402 69397183 51786899 38890783 30289235 24465523 20354490 17417117 15645261 14268267
19394 14268267 13366974 12973690 12721408 12623350 12565059 12765718 12761174 12501038 12185991 12175211
19384 12175211 12453809 12845045 13698523 15324082 17595430 21012895 26518649 35000969
19376 35000969 47868775 65813040 85625175 100945238 106295047 99101954 82944516
19369 82944516 64350660 49151362 39145301 32920563 29530147 28436478 29422103 32624860
19361 32624860 38401101 48384840 63787662 83165804 100050308 108763484 105152430 90273905
19353 90273905 70213872 51924364 38194874 28828556 22562521 18554528 15258361 12744094
$$ packed form
19409E0536113J6465248K0030960J6533448P078773n409613j5835634k0002112
19402F9397183j7610284j2896116q601548n823712m111033k937373j771856j376994
19394A4268267r01293l93284k52282r8058n8291K00659m544k60136l15047j0780
19384A2175211K78598L91236Q53478J625559K271348L417465N505754Q482320
19376C5000969J2867806J7944265J9812135J5320063N349809p193093j6157438
19369H2944516j8593856j5199298j0006061o224738l390416j093669R85625L202757
19361C2624860N776241R983739J5402822J9378142J6884504Q713176l611054j4878525
19353I0273905k0060033j8289508j3729490r366318o266035m007993l296167k514267
$$ plain form
19345 12744094 10970398 9865407 9011076 8441057 7867783 7470150 6931878 6245494 5774288
19336 5774288 5428529 5057989 4608490 4163060 3718051 3527870 3496685 3331862 3007585 2627562
19326 2627562 2619097 2541203 2416341 1989816 1984825 1874297 1671450 1661274 1416970 1350943 1342220
19315 1342220 1204334 1331188 1196040 933485 901450 883219 941709 1313451 1562898 1613887
19305 1613887 1512425 1256445 1130781 1111611 1179650 1373942 1606642 1772236 1761557 1896393
19295 1896393 1997587 2124655 2358277 2209762 2068906 2295354 2417299 2357527 2231585 2160265
19285 2160265 2224203 2266819 2378217 2214773 2226712 2430441 2670156 3019091 3372291 3424212
19275 3424212 3436016 3635796 3654754 3844202 4535872 5215363 5847033 6785325 8226933 10187498
$$ packed form
19345A2744094j773696j104991q54331n70019n73274l97633n38272o86384m71206
19336E774288l45759l70540m49499m45430m45009j90181l1185j64823l24277l80023
19326B627562q465p7894j24862m26525m991j10528k02847j0176k44304o6027q723
19315A342220j37886J26854j35148k62555l2035j8231N8490L71742K49447N0989
19305A613887j01462k55980j25664j9170O8039J94292K32700J65594j0679J34836
19295A896393J01194J27068K33622j48515j40856K26448J21945n9772j25942p1320
19285B160265O3938M2616J11398j63444J1939K03729K39715L48935L53200N1921
19275C424212J1804J99780J8958J89448O91670O79491O31670R38292J441608J960565
$$ plain form
19265 10187498 12722661 16730145 22666708 32248803 48648647 72715786 95376004 108855570
19257 108855570 106938399 90046705 67061905 46259414 32257729 23756646 18494327
19250 18494327 15044092 12674941 11057801 9970558 9330487 9064446 8832358 8664989 8703372
19241 8703372 8670591 8459953 8466774 8620290 8911844 9419435 10571141 12172197 14416402
19232 14416402 17337364 22264784 30419393 44465989 66811062 91468762 108419329
19225 108419329 112277151 99666998 77859183 55564079 39199170 28980499 22671281
19218 22671281 18518177 15856638 14515737 13674719 13596541 14309634 15735978 17914071 21136748
19209 21136748 26296659 34360752 48065228 71094041 100208958 123077399 132219563
$$ packed form
19265A0187498K535163M007484N936563R582095J6399844K4067139K2660218J3479566
19257A08855570j917171j6891694k2984800k0802491j4001685q501083n262319
19250A8494327l450235k369151j617140j087243o40071k66041k32088j67369L8383
19241H703372l2781k10638O821J53516K91554N07591J151706J601056K244205
19232A4416402K920962M927420Q154609J4046596K2345073K4657700J6950567
19225A08419329L857822j2610153k1807815k2295104j6364909j0218671o309218
19218B2671281m153104k661539j340901q41018p8178P13093J426344K178093L222677
19209B1136748N159911Q064093J3704476K3028813K9114917K2868441R142164
$$ plain form
19202 132219563 121980628 97914844 70747370 48710793 34824338 26202887 20907687
19195 20907687 17356364 14857954 13060190 11893922 10848612 10219536 9947004 9586946
19187 9586946 9133170 8735980 8495779 8471830 8661280 9182371 10176513 11917500 14211270
19178 14211270 17201708 21409870 28318407 39903535 59796848 88157205 114417632
19171 114417632 128741960 125234126 104550138 77487839 53210504 36700614 26317067
19164 26317067 19655788 15361767 12487477 10492925 9063668 7619556 6659093 6013115
19156 6013115 5394494 4904020 4590327 4065251 3749357 3357253 3066143 2734046 2352145
19147 2352145 2228481 2293611 2301387 2410441 2415163 2396068 2235385 2218399 2067556 1927737 1798098
$$ packed form
19202A32219563j0238935k4065784k7167474k2036577j3886455q621451n295200
19195B0907687l551323k498410j797764j166268j045310o29076k72532l60058
19187I586946m53776l97190k40201k3949J89450N21091R94142J740987K293770
19178A4211270K990438M208162O908537J1585128J9893313K8360357K6260427
19171A14417632J4324328l507834k0683988k7062299k4277335j6509890j0383547
19164B6317067o661279m294021k874290j994552j429257j444112r60463o45978
19156F013115o18621m90474l13693n25076l15894l92104k91110l32097l81901
19147B352145j23664O5130P776J09054M722j9095j60683j6986j50843j39819j29639
$$ plain form
19136 1798098 1688213 1599137 1348972 1161642 1280802 1091445 822673 615332 626350 756315
19126 756315 639445 620954 654276 725810 846521 897389 984578 997114 1044539 1069271 931881
19115 931881 791917 882705 728153 474470 463846 489200 395939 516820 757936 1050964
19105 1050964 1146422 1015940 960240 974476 819705 595162 643870 674557 396738 178662
19095 178662 230227 237148 268239 212226 357471 636798 813201 779957 760444 387572 -12436
19084 -12436 -226725 -279874 -63953 -8887 -136342 38328 -49547 -224602 -121788 109108
19074 109108 58358 -154190 -62519 68881 -3755 20912 190953 345777 339077 166155 157140
19063 157140 403651 521780 439089 544261 909199 991633 1039433 1173073 1098270 1049544
$$ packed form
19136A798098j09885q9076k50165j87330J19160j89357k68772k07341J1018J29965
19126G56315j16870j8491L3322P1534J20711N0868Q7189J2536M7425K4732j37390
19115I31881j39964R0788j54552k53683j0624K5354r3261J20881K41116K93028
19105A050964R5458j30482n5700J4236j54771k24543M8708L0687k77819k18076
19095A78662N1565O921L1091n6013J45245K79327J76403l3244j9513l72872m00008
19084a2436k14289n3149K15921N5066j27455J74670q7875j75055J02814K30896
19074A09108n0750k12548R1671J31400p2636K4667J70041J54824o700j72922r015
19063A57140K46511J18129q2691J05172L64938Q2434M7800J33640p4803m8726
$$ plain form
19053 1049544 1105115 922182 763322 706133 711352 639326 603095 566156 706364 1049935 946059
19042 946059 824010 936233 884098 645846 428094 284083 243086 328283 330626 353041 433156
19031 433156 146167 156847 162825 -72 -56558 12109 -9841 -56059 13668 52144 -27724
19020 -27724 -34011 158206 149357 212679 300490 419251 480705 411648 113167 -119965 -72298
19009 -72298 241434 347888 539488 446766 357646 195444 292662 468496 660796 635379
18999 635379 470001 554994 540311 656914 579592 432774 636609 929028 1134067 1122650
18989 1122650 1119918 1372256 1115836 650850 440592 216468 117688 246893 248898 54227
18979 54227 -67531 -114980 -147139 -163666 25624 91275 170007 160514 84648 -44870 -107703
$$ packed form
19053A049544N5571j82933j58860n7189N219p2026l6231l6939J40208L43571j03876
19042I46059j22049J12223n2135k38252k17752j44011m0997Q5197K343K2415Q0115
19031D33156k86989J0680N978j62897n6486O8667k1950m6218O9727L8476p9868
19020b7724o287J92217q849O3322Q7811J18761O1454o9057k98481k33132M7667
19009g2298L13732J06454J91600r2722q9120j62202R7218J75834J92300k5417
18999F35379j65378Q4993j4683J16603p7322j46818K03835K92419K05039j1417
18989A122650k732K52338k56420m64986k10258k24124r8780J29205K005j94671
18979E4227j21758m7449l2159j6527J89290O5651P8732r493p5866j29518o2833
$$ plain form
18968 -107703 41088 224369 355288 84484 163970 349074 502433 542495 319714 224663
18958 224663 78661 181693 521952 352596 256802 296740 507851 466575 450858 457982 367006
18947 367006 124471 -79955 -253916 -74609 40287 -109816 -23490 188666 383904 151658
18937 151658 293537 379977 279968 106650 104595 256640 279939 329707 179703 99086 -32211
18926 -32211 92661 159107 285490 317996 132269 227143 278373 243573 278063 364220 392471
18915 392471 286401 260932 386221 418396 245290 174108 379246 381557 480806 335781 347666
18904 347666 291048 64856 -101098 27814 107961 110591 209793 183964 2004 407640 451896
18893 451896 393609 406131 197684 131912 179948 210340 14062 11608 -7381 66053 137404
$$ packed form
18968a07703J48791J83281J30919k70804P9486J85104J53359M0062k22781r5051
18958B24663j46002J03032L40259j69356r5794L9938K11111m1276j5717P124r0976
18947C67006k42535k04426j73961J79307J14896j50103Q6326K12156J95238k32246
18937A51658J41879Q6440j00009j73318k055J52045K3299M9768j50004q0617j31297
18926c2211J24872O6446J26383L2506j85727R4874N1230l4800L4490Q6157K8251
18915C92471j06070k5469J25289L2175j73106p1182K05138K311R9249j45025J1885
18904C47666n6618k26192j65954J28912Q0147K630R9202k5829j81960M05636M4256
18893D51896n8287J2522k08447o5772M8036L0392j96278k454j8989P3434P1351
$$ plain form
18882 137404 122073 68969 91920 368175 509568 645027 549747 499643 608303 742605
18872 742605 814764 661429 747053 837189 744225 609766 446134 179416 233867 422225
18862 422225 410624 358883 425843 399007 708056 968915 1082455 1186847 1197475 889521
18852 889521 606096 440028 252512 279475 301305 353752 114888 215688 408878 512137
18842 512137 383232 232416 159668 92442 -17160 -3517 117986 364438 257858 188929
18832 188929 287016 412537 81003 151040 579494 598701 273103 389919 566249 599631
18822 599631 500103 463247 407991 291604 337815 138855 439623 385502 496856 541054 388205
18811 388205 324000 396101 671641 999129 1130991 1039352 915088 512294 374363 402108
$$ packed form
18882A37404j5331n3104K2951K76255J41393J35459r5280n0104J08660J34302
18872G42605P2159j53335Q5624R0136r2964j34459j63632k66718N4451J88358
18862D22225j1601n1741O6960k6836L09049K60859J13540J04392J0628l07954
18852H89521k83425j66068j87516K6963K1830N2447k38864J00800J93190J03259
18842E12137j28905j50816p2748o7226j09602J3643J21503K46452j06580o8929
18832A88929R8087J25521l31534P0037M28454J9207l25598J16816J76330L3382
18822E99631r9528l6856n5256j16387M6211j98960L00768n4121J11354M4198j52849
18811C88205o4205P2101K75540L27488J31862r1639j24264m02794j37931K7745
$$ plain form
18801 402108 133600 -74956 209861 460137 613983 407658 319025 272795 312824 250254
18791 250254 232881 215701 406878 494071 406491 495007 570968 559588 538233 459526 435400
18780 435400 298083 342465 416584 414942 214021 91508 78906 291292 363739 277805 353495
18769 353495 415829 326028 366474 640519 1356819 2337884 2859259 2492341 1829369 957350
18759 957350 577476 315549 232335 361946 343463 253029 193719 153869 330336 291972 495243
18748 495243 485093 480686 396479 457850 484284 492748 488095 571656 475483 347037 323557 575136
18736 575136 779736 790967 777136 626969 591025 670747 499693 458980 530919 480746 431339
18725 431339 434098 408951 307570 503716 756479 891880 910327 1219820 1223877 1375926 1679388
$$ packed form
18801D02108k68508k08556K84817K50276J53846k06325q8633m6230M0029o2570
18791B50254j7373j7180J91177Q7193q7580Q8516P5961j1380k1355p8707k4126
18780D35400j37317M4382P4119j642k00921j22513j2602K12386P2447q5934P5690
18769C53495O2334q9801M0446K74045P16300R81065N21375l66918o62972q72019
18759I57350l79874k61927q3214J29611j8483r0434n9310l9850J76467l8364K03271
18748D95243j0150m407q4207O1371K6434Q464m653Q3561r6173j28446k3480K51579
18736E75136K04600J1231j3831j50167l5944P9722j71054m0713P1939n0173m9407
18725D31339K759k5147j01381J96146K52763J35401J8447L09493M057J52049L03462
$$ plain form
18714 1679388 2078725 3039837 4401737 5787822 6173403 5529464 4198710 2840146 2085656
18705 2085656 1834446 1550051 1380198 1393062 1038667 1060607 1171254 1218997 1052685 837892
18695 837892 733650 858643 1056681 1186574 1123534 1248067 1291506 1120302 1063822 1141912
18685 1141912 1188876 1376466 1408666 1150041 1139627 1142790 1103228 835361 720123 1077794
18675 1077794 1290798 1314438 1286065 1067108 1273288 1561485 1688077 1742267 1893733 2047968
18665 2047968 2360977 2607638 2478649 2735594 3027604 3109933 3156130 3347539 4192564 5592814
18655 5592814 6977900 7402936 6631630 5587952 4723306 3841044 3521992 3898446 4402830
18646 4402830 4586377 4381066 4548382 4783339 5167154 5718358 6693466 8179232 10621406
$$ packed form
18714A679388L99337R61112J361900J386085L85581o43939j330754j358564p54490
18705B085656k51210k84395j69853J2864l54395K1940J10647M7743j66312k14793
18695H37892j04242J24993J98038J29893o3040J24533M3439j71204n6480P8090
18685A141912M6964J87590L2200k58625j0414L163l9562k67867j15238L57671
18675A077794K13004K3640k8373k18957K06180K88197J26592N4190J51466J54235
18665B047968L13009K46661j28989K56945K92010Q2329M6197J91409Q45025J400250
18655E592814J385086M25036p71306j043678q64646q82262l19052L76454N04384
18646D402830J83547k05311J67316K34957L83815N51204R75108J485766K442174
$$ plain form
18637 10621406 14247019 20670576 32415049 52364173 74155345 81046884 69893023
18630 69893023 50234255 34202013 24720800 19239637 15894290 14299724 13887557 14003833
18622 14003833 15056468 17402618 21662791 29959858 45073868 66103746 78759052 73104517
18614 73104517 55197587 36891013 25249366 18748657 14658197 12356705 11190907 10247301
18606 10247301 9633999 9118921 8909046 8990623 9139857 8811218 8381653 8265441 8708698
18597 8708698 9129606 10033176 11750728 14724403 19207518 26675302 39870061 61036759
18589 61036759 81024531 83499696 69575876 50274722 36685179 29849168 27589965
18582 27589965 28642844 33704490 45104440 63900085 80333772 82548987 74238801 67120575
$$ packed form
18637A0621406L625613O423557J1744473J9949124K1791172O891539j1153861
18630F9893023j9658768j6032242r481213n481163l345347j594566m12167J16276
18622A4003833J052635K346150M260173Q297067J5114010K1029878J2655306n654535
18614G3104517j7906930j8306574j1641647o500709m090460k301492j165798r43606
18606A0247301o13302n15078k09875Q1577J49234l28639m29565j16212M43257
18597H708698M20908R03570J717552K973675M483115P467784J3194759K1166698
18589F1036759J9987772K475165j3923820j9301154j3589543o836011k259203
18582B7589965J052879N061646J1399950J8795645J6433687K215215q310186p118226
$$ plain form
18574 67120575 72144150 86121051 90873592 79787994 60051146 42843822 33032247
18567 33032247 28590462 27491492 29818734 36895009 50965787 67103087 71424404 61311966
18559 61311966 44360188 30289949 21801784 16694446 13550672 11557533 9864052 8670537
18551 8670537 8089532 7718404 7704663 7703008 7463943 7399861 7458398 7832716 8134910 8428156
18541 8428156 9115816 10552595 12914866 16958747 24343370 37842417 57095729 69068589
18533 69068589 64724497 49463225 33309656 22879465 17144800 14135425 12475966 11537031
18525 11537031 11295541 11644091 13102175 16095192 21598214 31639868 47814553 63031392
18517 63031392 64303235 52441744 35855578 23252280 16309566 12236556 9498452 7437696
$$ packed form
18574F7120575N023575J3976901M752541j1085598j9736848j7207324r811575
18567C3032247m441785j098970K327242P076275J4070778J6137300M321317j0112438
18559F1311966j6951778j4070239q488165n107338l143774j993139j693481j193515
18551H670537n81005l71128j3741j655k39065o4082N8537L74318L02194K93246
18541H428156O87660J436779K362271M043881P384623J3499047J9253312J1972860
18533F9068589m344092j5261272j6153569j0430191n734665l009375j659459r38935
18525A1537031k41490L48550J458084K993017N503022J0041654J6174685J5216839
18517F3031392J271843j1861491j6586166j2603298o942714m073010k738104k060756
$$ plain form
18509 7437696 6098941 5051656 4198303 3982997 3881328 3778837 3337703 2845437 2510181
18500 2510181 2175413 1939478 1899657 1977634 1802768 1612316 1621162 1331680 1021800 949716
18490 949716 942981 975566 948391 948933 975066 972019 845422 960116 951580 783450 545527 432552
18478 432552 462946 594065 545756 516545 396379 479839 341977 378878 489346 371557
18468 371557 227932 300134 383252 606079 736703 704691 655793 479706 407366 536200
18458 536200 540063 339369 192204 308534 448459 470708 507703 433229 549275 455693 378959
18447 378959 251382 389171 520085 542869 429168 288300 294229 453854 226662 106784
18437 106784 380118 595538 853960 870867 1085454 1504446 2165002 2777642 3560326 4321211
$$ packed form
18509G437696j338755j047285q53353k15306j01669j02491m41134m92266l35256
18500B510181l34768k35935l9821P7977j74866j90452Q846k89482l09880p2084
18490I49716o735L2585k7175N42K6133l047j26597J14694q536j68130k37923j12975
18478D32552L0394J31119m8309k9211j20166Q3460j37862L6901J10468j17789
18468C71557j43625P2202Q3118K22827J30624l2012m8898j76087p2340J28834
18458E36200L863k00694j47165J16330J39925K2249L6995p4474J16046r3582p6734
18447C78959j27577J37789J30914K2784j13701j40868N929J59625k27192j19878
18437A06784K73334K15420K58422J6907K14587M18992O60556O12640P82684P60885
$$ plain form
18427 4321211 4800695 4651855 3959414 3146085 2590384 2318649 1863702 1501139 1418605 1346015
18417 1346015 1288605 1693818 2071204 2463226 3112783 3694125 4449660 4883568 4877306 4035702
18407 4035702 3451838 2803836 2063357 1583352 1362743 937987 493999 487992 564960 459288
18397 459288 288511 256889 353723 504328 555575 620962 538141 394958 346378 172032 194771
18386 194771 286192 290285 242961 109796 92987 126043 325470 469420 261498 258765 149993
18375 149993 416192 562877 324155 97689 35935 158685 161110 29007 63884 282688
18365 282688 386863 457381 381744 416558 605583 699876 510417 340348 328928 324087 181832
18354 181832 -2809 -289218 -337999 -118998 104109 245465 216633 189286 258983 366938
$$ packed form
18427D321211M79484j48840o92441q13329n55701k71735m54947l62563q2534p2590
18417A346015n7410M05213L77386L92022O49557N81342P55535M33908o262q41604
18407D035702n83864o48002p40479m80005k20609m24756m43988o007P6968j05672
18397D59288j70777l1622R6834J50605N1247O5387q2821j43183m8580j74346K2739
18386A94771R1421M093m7324j33165j6809L3056J99427J43950k07922k733j08772
18375A49993K66199J46685k38722k26466o1754J22750K425j32103L4877K18804
18365B82688J04175P0518p5637L4814J89025R4293j89459j70069j1420m841j42255
18354A81832j84641k86409m8781K19001K23107J41356k8832k7347O9697J07955
$$ plain form
18344 366938 399476 323944 308645 193156 69914 96244 223480 12626 126237 237639
18334 237639 223899 173445 260363 140725 119385 80974 -14082 289369 313350 301749 252845
18323 252845 263117 254388 225861 184126 186727 131773 136044 353809 281494 103790 279314
18312 279314 426167 303373 233437 331830 446260 538767 528398 398910 308142 306391 226708
18301 226708 301849 368209 285607 154026 -59350 56632 299587 283565 338367 298073 266382
18290 266382 319791 119698 98429 97277 90451 108010 119410 257240 165668 190360 59137
18279 59137 60320 -114637 -291785 -336373 -385133 -302254 -429463 -426450 -305129 -229540 -293267
18268 -293267 -155236 -61007 50477 127469 -79970 -162322 160566 211505 235098 248982 263637
$$ packed form
18344C66938L2538p5532j5299j15489j23242K6330J27236k10854J13611J11402
18334B37639j3740n0454Q6918j19638k1340l8411r5056L03451K3981j1601m8904
18323B52845J0272q729k8527m1735K601n4954M271K17765p2315j77704J75524
18312B79314J46853j22794o9936R8393J14430R2507j0369j29488r0768j751p9683
18301B26708P5141O6360q2602j31581k13376J15982K42955j6022N4802m0294l1691
18290B66382N3409k00093k1269j152o826J7559J1400J37830r1572K4692j31223
18279E9137J183j74957j77148m4588m8760Q2879j27209L013J21321P5589o3727
18268b93267J38031R4229J11484P6992k07439q2352L22888N0939K3593J3884J4655
$$ plain form
18257 263637 183285 187221 232987 112236 93081 103259 80810 451653 350176 -161083 -221069
18246 -221069 14214 216699 229531 273867 93421 -24969 -65653 73805 191100 251896
18236 251896 158777 -36138 -97623 -159913 -332471 -205028 69591 138125 21563 175671
18226 175671 147689 -53965 93424 249625 25301 -65502 15040 124918 22352 296721
18216 296721 408183 360867 345005 303320 414129 485180 430577 447621 280253 12348 53324
18205 53324 182750 198349 184522 149555 308689 509962 287219 135971 170968 123960 296525
18194 296525 403778 176344 134850 166333 281346 449912 400903 407020 517127 516772 459020
18183 459020 447948 627907 765640 776213 666757 613287 357310 229651 369773 399261
$$ packed form
18257B63637q0352L936M5766j20751j9155J0178k2449L70843j01477n11259n9986
18246b21069K35283K02485J2832M4336j80446j18390m0684J39458J17295O0796
18236B51896r3119j94915o1485o2290j72558J27443K74619O8534j16562J54108
18226A75671k7982k01654J47389J56201k24324r0803Q0542J09878j02566K74369
18216B96721J11462m7316j5862m1685J10809P1051n4603J7044j67368k67905M0976
18205E3324J29426J5599j3827l4967J59134K01273k22743j51248L4997m7008J72565
18194B96525J07253k27434m1494L1483J15013J68566m9009O117J10107l55n7752
18183D59020j1072J79959J37733J0573j09456n3470k55977j27659J40122K9488
$$ plain form
18173 399261 525079 554822 418793 403064 581738 610118 814201 802551 743776 588769
18163 588769 672423 776388 884405 781605 715787 773971 939870 1021840 959623 1009135 1073291
18152 1073291 1079359 983088 776600 1079045 1553855 1769783 1795127 1609796 1378757 1516134
18142 1516134 1586333 1640488 1765047 1709772 1762279 1974420 2070364 2099598 2267839 2226395 2409079
18131 2409079 2635474 2534630 2832171 3031546 3243731 3497250 3746454 4073350 4323652
18122 4323652 4942473 5442839 6238122 7100109 8134841 9491134 11231548 13423223 16236246
18113 16236246 20237289 25813577 33699953 46135547 67259588 107402427 187091601
18106 187091601 315123433 402005947 373622497 269633097 163268428 100800405 67877696
$$ packed form
18173C99261J25818K9743j36029j5729J78674K8380K04083j1650n8775j55007
18163E88769Q3654J03965J08017j02800o5818N8184J65899Q1970o2217M9512O4156
18152A073291O068r6271k06488L02445M74810K15928K5344j85331k31039J37377
18142A516134P0199N4155J24559n5275N2507K12141R5944K9234J68241m1444J82684
18131B409079K26395j00844K97541J99375K12185K53519K49204L26896K50302
18122D323652O18821N00366P95283Q61987J034732J356293J740414K191675K813023
18113A6236246M001043N576288P886376J2435594K1124041M0142839P9689174
18106A87091601J28031832Q6882514k8383450j03989400j06364669o2468023l2922709
$$ plain form
18099 67877696 49578548 38005353 30108017 24487326 20453458 17673646 15699150 14079909
18091 14079909 12709138 11223222 9698551 8467945 7374199 6432169 6004035 5661965
18083 5661965 5166135 4475210 4169530 3716389 3351279 3054694 2863297 2720700 2919791
18074 2919791 2949614 2808231 2477725 2238741 1811912 1488268 1120304 1003641 1178645 1070081
18064 1070081 1080592 1142305 1274341 1303929 1370539 1714025 2165913 2603591 2610426 2691779 2662476
18053 2662476 2415297 2311392 2303920 2049285 1732481 1487504 1598148 1636188 1474165 1264994
18043 1264994 1047955 883307 763718 654579 500596 572381 729701 703698 566419 335805
18033 335805 63861 36613 201662 401757 533599 426326 456422 410167 372964 404584
$$ packed form
18099F7877696j8299148j1573195p897336n620691m033868k779812j974496j619241
18091A4079909j370771j485916j524671j230606j093746r42030m28134l42070
18083E661965m95830o90925l05680m53141l65110k96585j91397j42597J99091
18074B919791K9823j41383l30506k38984m26829l23644l67964j16663J75004j08564
18064A070081J0511O1713J32036K9588O6610L43486M51888M37678O835Q1353k9303
18053B662476k47179j03905p472k54635l16804k44977J10644L8040j62023k09171
18043A264994k17039j64648j19589j09139j53983P1785J57320k6003j37279k30614
18033C35805k71944k7248J65049K00095J31842j07273L0096m6255l7203L1620
$$ plain form
18023 404584 674637 755582 796206 835111 900207 539693 170342 167007 267540 146509 119684
18012 119684 201133 276990 248788 219907 222048 409351 273716 275595 502862 618480 529728
18001 529728 653628 843208 930168 928665 1200498 1474834 1812434 2307053 2727431 2916080
17991 2916080 3154875 3092389 2975523 3000898 2912192 3018861 3093290 2888554 2757122 2707670
17981 2707670 2653877 2466963 2200010 2005744 1711309 1334340 1022528 778732 697610 360018
17971 360018 293072 368627 296539 183860 205494 354704 346918 248753 275533 364957 250346
17960 250346 206070 189005 163062 281568 302228 367835 568399 655150 757508 877227 934498
17949 934498 1076418 1113188 1126502 1030655 969907 992463 999917 1298595 1585303 1625580 1287721
$$ packed form
18023D04584K70053Q0945M0624L8905O5096l60514l69351l335J00533j21031k6825
18012A19684Q1449P5857k8202k8881K141J87303j35635J879K27267J15618q8752
18001E29728J23900J89580Q6960j503K71833K74336L37600M94619M20378J88649
17991B916080K38795o2486j16866K5375q8706J06669P4429k04736j31432m9452
17981B707670n3793j86914k66953j94266k94435l76969l11812k43796q1122l37592
17971C60018o6946P5555p2088j12679K1634J49210p786r8165K6780Q9424j14611
17960B50346m4276j7065k5943J18506K0660O5607K00564Q6751J02358J19719N7271
17949I34498J41920L6770J3314r5847o0748K2556P454K98678K86708M0277l37859
$$ plain form
17938 1287721 1137112 1247361 1219126 1265004 1150426 1101577 1001232 764521 746908 595441
17928 595441 412734 208565 9595 -97360 -104695 -53638 -64418 -60690 -55651 -167501 -118630
17917 -118630 -41507 21997 134847 -210 -69222 -97705 -84685 -128807 -37520 152576 44271
17906 44271 114540 144011 364899 375052 230173 155588 -40259 102178 269752 309631 129187
17895 129187 1619 -91609 38341 223342 240452 138849 -60577 -130557 -124216 45296
17885 45296 267176 133785 16860 -83749 -271029 -112535 -26471 -116892 -387800 -489577
17875 -489577 -233752 -101761 -331460 -564573 -431556 -327417 -113707 9431 31921 174445
17865 174445 235840 -22168 98378 59468 -234087 -368114 -42959 -24115 -209858 -68105
$$ packed form
17938A287721j50609J10249k8235M5878j14578m8849j00345k36711j7613j51467
17928E95441j82707k04169j98970j06955p335N1057j0780L728N039j11850M8871
17917a18630P7123O3504J12850j35057o9012k8483J3020m4122R1287J90096j08305
17906D4271P0269K9471K20888J0153j44879p4585j95847J42437J67574L9879j80444
17895A29187j27568r3228J29950J85001J7110j01603j99426o9980O341J69512
17885D5296K21880j33391j16925j00609j87280J58494Q6064r0421k70908j01777
17875d89577K55825J31991k29699k33113J33017J04139K13710J23138K2490J42524
17865A74445O1395k58008J20546l8910k93555j34027L25155J8844j85743J41753
$$ plain form
17855 -68105 127168 -43703 -196593 -71348 127159 73672 -49544 235358 388671 419892
17845 419892 405475 397758 189115 133950 -12587 -123607 -214867 -248975 -337807 -333180 -338434
17834 -338434 -356020 -467463 -474181 -300397 -303849 -355398 -341315 -381779 -237836 -65289 22131
17823 22131 -143946 -111167 -55949 -96759 -174832 -244545 -276766 -131302 -74476 -185230 -463424
17812 -463424 -470323 -378751 -287507 -336485 -140566 87933 49072 -212407 -16488 6718 21925
17801 21925 -26356 37759 -150698 -180271 -304219 -236200 -98616 -117685 -222921 -100160 -8481
17790 -8481 -40037 130547 103950 -62065 -168359 -367194 -191592 219622 218711 -8207 -213769
17779 -213769 -122211 -87954 -27359 229267 166893 54992 -75888 -103302 -182928 -237572 -176940
$$ packed form
17855f8105J95273j70871j52890J25245J98507n3487j23216K84902J53313L1221
17845D19892j4417p717k08643n5165j46537j11020r1260l4108q8832M627n254
17834c38434j7586j11443o718J73784l452n1549J4083m0464J43943J72547Q7420
17823B2131j66077L2779N5218m0810p8073o9713l2221J45464N6826j10754k78194
17812d63424o899R1572R1244m8978J95919K28499l8861k61479J95919K3206J5207
17801B1925m8281O4115j88457k9573j23948O8019J37584j9069j05236J22761R1679
17790h481l1556J70584k6597j66015j06294j98835J75602M11214r11k26918k05562
17779b13769R1558L4257O0595K56626o2374j11901j30880k7414p9626n4644O0632
$$ plain form
17768 -176940 -356062 -333689 -161729 -102319 161081 283154 211571 125446 80055 350093
17758 350093 278523 174497 239979 133715 3780 -144971 -60281 -27258 -165377 -115471
17748 -115471 41211 -92439 -192738 -109824 -160495 123268 163946 178522 250479 166644 268763
17737 268763 192850 647 96565 3266 -88766 -176068 -177316 -61711 -4394 -174997 -320565
17726 -320565 -445295 -387082 -256899 -270897 -490167 -258463 -220817 -307299 -10985 137271
17716 137271 -31120 -97640 -207956 -123881 -303572 -363843 -178609 -62998 -47671 48387
17706 48387 16650 -147964 -274972 -239567 -200226 -136494 -31411 20509 132481 80298 -108456
17695 -108456 -128157 3532 262114 208944 208288 222729 83164 -166858 -246967 -43663 39104
$$ packed form
17768a76940j79122K2373J71960N9410K63400J22073p1583q6125m5391K70038
17758C50093p1570j04026O5482j06264j29935j48751Q4690L3023j38119M9906
17748a15471J56682j33650j00299Q2914n0671K83763M0678J4576P1957q3835J02119
17737B68763p5913j92203R5918r3299r2032q7302j248J15605N7317j70603j45568
17726c20565j24730N8213J30183j3998k19270K31704L7646q6482K96314J48256
17716A37271j68391o6520j10316Q4075j79691o0271J85234J15611J5327R6058
17706D8387l1737j64614j27008L5405L9341O3732J05083N1920J11972n2183j88754
17695a08456j9701J31689K58582n3170o56J4441j39565k50022q0109K03304Q2767
$$ plain form
17684 39104 -102441 85777 27485 63469 24514 136484 25138 -229164 -319504 -178851
17674 -178851 -2910 8071 -13958 -15683 -31339 -90608 -34468 55580 78607 -144891 -144100 -296671
17662 -296671 -338765 -377784 -470740 -303971 -132368 -60699 -169986 -122524 -157082 -259425 -93675
17651 -93675 -88583 -140592 -14672 58635 -104559 -122934 -374714 -417825 -504712 -455644 -335915
17640 -335915 -49493 181803 -80976 -118764 -31705 -177006 -172228 -50526 35084 -23524 -7664
17629 -7664 -28123 49655 -70103 9530 193793 216211 -56671 -293593 -161899 -28731 -17951
17618 -17951 -131366 -206466 -223613 -64126 67734 -106189 -152075 74270 -5300 -94035 -138290
17607 -138290 -73846 -84050 -158799 -54603 -8540 -1422 -4860 -125588 -346980 -387698 -458783
$$ packed form
17684C9104j41545J88218n8292L5984l8955J11970j11346k54302r0340J40653
17674a78851J75941J0981k2029j725j5656n9269N6140R0048K3027k23498P91j52571
17662b96671m2094l9019r2956J66769J71603P1669j09287M7462l4558j02343J65750
17651i3675N092n2009J25920P3307j63194j8375k51780m3111q6887M9068J19729
17640c35915K86422K31296k62779l7788Q7059j45301M778J21702Q5610n8608J5860
17629g664k0459P7778j19758P9633J84263K2418k72882k36922J31694J33168J0780
17618a7951j13415p5100j7147J59487J31860j73923m5886K26345p9570q8735m4255
17607a38290O4444j0204p4749J04196M6063P118l438j20728k21392m0718p1085
$$ plain form
17596 -458783 -491107 -355288 -141149 72706 235249 150033 83975 51993 -380557 -587068
17586 -587068 -687344 -643243 -483053 -349811 -72976 -41906 115313 67913 29286 42440
17576 42440 93223 424931 123481 -216490 -215312 -204920 -213092 -227214 -273905 -207962 157667
17565 157667 415154 184744 -125538 -158410 -298740 -342379 -72741 -88585 -99855 228731
17555 228731 285898 102902 35776 157753 168127 14186 -152897 -13793 149496 -103505
17545 -103505 -186087 -311559 -331564 -29996 -6519 88771 226308 358721 261271 -16922
17535 -16922 -124164 -112838 1939 108704 -40666 79319 216807 320410 56010 -191331
17525 -191331 -215641 -243772 -340246 -226647 -170991 -88558 -21737 55203 -45239 31228 53198
$$ packed form
17596d58783l2324J35819K14139K13855J62543q5216o6058l1982m32550k06511
17586e87068j00276M4101J60190J33242K76835L1070J57219m7400l8627J3154
17576D2440N0783L31708l01450l39971J178J0392q172j4122m6691O5943L65629
17565A57667K57487k30410l10282l2872j40330m3639K69638j5844j1270L28586
17555B28731N7167j82996o7126J21977J0374j53941j67083J39104J63289k53001
17545a03505q2582j25472k0005L01568K3477R5290J37537J32413r7450k78193
17535a6922j07242J1326J14777J06765j49370J19985J37488J03603k64400k47341
17525a91331k4310k8131r6474J13599N5656Q2433O6821P6940j00442P6467K1970
$$ plain form
17514 53198 210122 323194 559136 717627 1066043 1504777 2072709 2569619 2604854 2311111
17504 2311111 1822360 1482135 1248404 1043320 900624 705226 436818 568409 683146
17495 683146 623214 693710 1206675 1875783 2350263 2493235 2376030 2080121 1566854 1151148
17485 1151148 657986 376881 188713 -79156 -46683 -79745 -1380 118957 249663 206966
17475 206966 177302 41104 -53356 2973 -35263 -18313 -156757 -76631 5243 218926 36763
17464 36763 22195 148231 138680 242727 440119 512493 517577 506561 731395 911427 1146151
17453 1146151 1660586 1921979 2027566 1777697 1595388 1322238 1010748 512349 494383 505462
17443 505462 573332 1042688 1396952 2171004 2887058 3316792 3227559 3036179 2741985 2602392
$$ packed form
17514E3198J56924J13072K35942J58491L48416M38734N67932M96910L5235k93743
17504B311111m88751l40225k33731k05084j42696j95398k68408J31591J14737
17495F83146n9932P0496N12965O69108M74480J42972j17205k95909n13267m15706
17485A151148m93162k81105j88168k67869L2473l3062P8365J20337J30706m2697
17475B06966k9664j36198r4460N6329l8236J6950j38444Q0126Q1874K13683j82163
17464C6763j4568J26036r551J04047J97392P2374N084j1016K24834J80032K34724
17453A146151N14435K61393J05587k49869j82309k73150l11490m98399j7966J1079
17443E05462O7870M69356L54264P74052P16054M29734q9233j91380k94194j39593
$$ plain form
17433 2602392 2348453 2139099 1809113 1584138 1322715 901890 597066 148100 27584
17424 27584 178801 315201 542823 517680 175779 16668 69454 155665 66729 -57739
17414 -57739 -189657 -102811 -133048 -99757 -124366 -213557 -161658 -149343 12867 174839 132956
17403 132956 145872 -14244 -268007 -211918 -41063 -16093 -348768 -376836 -438877 -599584
17393 -599584 -462292 -28895 139508 175806 509391 409127 -15143 49652 216899 91242
17383 91242 78399 -20984 150512 168129 199620 242017 111770 139151 317336 281685 73717
17372 73717 -206494 -256191 -91479 -224164 -173810 -31553 -85532 -340823 -306483 -157818
17362 -157818 23940 -48645 -102549 -62087 -311625 -408842 -549011 -436006 -291270 -348077
$$ packed form
17433B602392k53939k09354l29986k24975k61423m20825l04824m48966j20516
17424B7584J51217J36400K27622k5143l41901j59111N2786Q6211q8936j24468
17414e7739j31918Q6846l0237L3291k4609q9191N1899J2315J62210J61972m1883
17403A32956J2916j60116k53763N6089J70855K4970l32675k8068o2041j60707
17393e99584J37292M33397J68403L6298L33585j00264m24270O4795J67247j25657
17383I1242j2843r9383J71496J7617L1491M2397j30247K7381J78185l5651k07968
17372G3717k80211m9697J64712j32685N0354J42257n3979k55291L4340J48665
17362a57818J81758p2585n3904M0462k49538r7217j40169J13005J44736n6807
$$ plain form
17352 -348077 -257559 -220810 -252214 -202650 -174189 -387070 -359500 -75210 26721 17030 35062
17341 35062 -196431 -281768 -152370 -165265 -271096 -117993 -1799 130559 365519 431395
17331 431395 155822 65520 304680 209141 92033 107123 -33109 -170597 -291068 -350652
17321 -350652 -99869 171842 138181 41850 -39887 5270 107436 360435 152761 13717
17311 13717 -6185 -62678 -73690 -286760 -500816 -442752 -246735 -71608 -119418 -378711 -318336
17300 -318336 -39662 17984 -13624 -82711 -227460 -329549 -259172 -156321 -33917 148471
17290 148471 172862 -13067 45213 157965 121755 70716 179418 -40583 -215671 -292378
17280 -292378 -194288 -142507 -72336 -256243 -316076 -189196 -369900 -540393 -581075 -606363 -460052
$$ packed form
17352c48077R0518L6749l1404M9564K8461k12881K7570K84290J01931r691J8032
17341C5062k31493q5337J29398j2895j05831J53103J16194J32358K34960O5876
17331D31395k75573r0302K39160r5539j17108J5090j40232j37488j20471n9584
17321c50652K50783K71711l3661r6331q1737M5157J02166K52999k07674j39044
17311A3717j9902n6493j1012k13070k14056N8064J96017J75127m7810k59293O0375
17300c18336K78674N7646l1608o9087j44749j02089P0377J02851J22404J82388
17290A48471K4391j85929N8280J12752l6210n1039J08702k20001j75088p6707
17280b92378R8090N1781P0171j83907n9833J26880j80704j70493m0682k5288J46311
$$ plain form
17269 -460052 -324912 -159321 -4431 -89180 -255249 -226224 -180243 -230758 -254998 -235813 -202258
17258 -202258 -123281 -21816 159722 259642 193759 101871 102341 -20878 -197635 -486142 -616041
17247 -616041 -558988 -366048 -116221 -68685 12875 42604 -130096 -226964 -224459 -372362 -301155
17236 -301155 -193494 -182350 -149088 -288845 -317462 -173366 -111198 -90672 -122064 -102278 3881
17225 3881 -155618 -171476 -389688 -568448 -502183 -111496 215381 57047 -126755 -289443
17215 -289443 -323484 -349496 -302999 -73069 -71308 73939 255210 406369 186009 105797 50540
17204 50540 -275203 -430023 -440600 -506781 -438446 -454859 -524449 -380750 -205180 -8413 134385
17193 134385 176603 -46799 -224996 -275904 -167180 -177328 22100 -16626 -139054 -142382 29472
$$ packed form
17269d60052J35140J65591J54890q4749j66069K9025M5981n0515k4240J9185L3555
17258b02258P8977J01465J81538R9920o5883r1888M70j23219j76757k88507j29899
17247f16041N7053J92940K49827M7536Q1560K9729j72700r6868K505j47903P1207
17236c01155J07661J1144L3262j39757k8617J44096O2168K0526l1392J9786J06159
17225C881j59499j5858k18212j78760O6265L90687L26877j58334j83802j62688
17215b89443l4041k6012M6497K29930J761J45247J81271J51159k20360q0212n5257
17204E0540l25743j54820j0577o6181O8335j6413o9590J43699J75570J96767J42798
17193A34385M2218k23402j78197n0908J08724j0148J99428l8726j22428l328J71854
$$ plain form
17182 29472 70810 -76360 -19557 -28150 -238531 -152246 -198032 -360363 -503958 -623805 -510389
17171 -510389 -209936 -315536 -524509 -537510 -487070 -105792 208510 73374 50176 -27510
17161 -27510 -168826 -26597 20632 -25271 53188 107610 886 126962 134740 51128 241125
17150 241125 356883 18834 51942 80015 2085 -26801 -106776 20050 -22543 -146651 -232767
17139 -232767 -291075 -199142 -77538 45313 -32036 -297415 -484671 -441849 -355640 -138139
17129 -138139 -326359 -428005 -331569 -128440 -59082 -114562 -38704 16117 -23411 -213534 -227089
17118 -227089 -43564 120805 46882 -10886 75759 -27102 -190874 -248915 -179296 -217828 -340893
17107 -340893 -466141 -281633 58669 -247 -81144 -91908 -239978 -264485 -19798 -35837
$$ packed form
17182B9472M1338j47170N6803q593k10381Q6285m5786j62331j43595j19847J13416
17171e10389L00453j05600k08973j3001N0440L81278L14302j35136k3198p7686
17161b7510j41316J42229M7229m5903P8459N4422j06724J26076P778q3612J89997
17150B41125J15758l38049L3108K8073p7930k8886p9975J26826m2593j24108q6116
17139b32767n8308R1933J21604J22851p7349k65379j87256M2822Q6209K17501
17129a38139j88220j01646R6436K03129O9358n5480P5858N4821l9528j90123j3555
17118b27089J83525J64369p3923n7768Q6645j02861j63772n8041O9619l8532j23065
17107c40893j25248J84508L40302n8916q0897j0764j48070k4507K44687j6039
$$ plain form
17097 -35837 -109816 -262601 -225822 -337148 -282078 -34067 123150 53524 13520 51996 11715
17086 11715 -13816 39438 96655 48006 -62292 -88623 -65007 -145483 -115280 -368789 -448866
17075 -448866 -326800 -229391 -264758 -440073 -351932 -103456 154096 167697 -17093 -80838
17065 -80838 58562 -62974 -196947 -96017 23963 114176 156253 121133 260657 310004
17055 310004 103653 -16217 -29636 81668 83073 11958 14476 -87598 155277 129850 132986
17044 132986 24122 9237 -68699 -175890 -60579 -135310 -128636 90525 96047 855 -82486
17033 -82486 -198954 -252370 -274145 -173535 -138768 -136549 -148815 46747 -61427 -256367 -96756
17022 -96756 -149521 -340340 -394181 -452417 -368326 -142499 69347 70636 70301 -131552 -248345
$$ packed form
17097c5837p3979j52785L6779j11326N5070K48011J57217o9626m0004L8476m0281
17086A1715k5531N3254N7217m8649j10298k6331K3616q0476L0203k53509q0077
17075d48866J22066R7409l5367j75315Q8141K48476K57552J3601j84790o3745
17065h0838J39400j21536j33973J00930J19980R0213M2077l5120J39524M9347
17055C10004k06351j19870j3419J11304J405p1115K518j02074K42875k5427L136
17044A32986j08864j4885p7936j07191J15311p4731O674K19161N522r5192q3341
17033h2486j16468n3416k1775J00610L4767K219j2266J95562j08174j94940J59611
17022i6756n2765j90819n3841n8236Q4091K25827K11846J289l35k01853j16793
$$ plain form
17011 -248345 -122468 -49082 -42449 72126 23910 -190213 -349514 -244358 176234 207277
17001 207277 173001 230074 133289 60801 -10168 17025 -175005 -149852 -64367 -127751 -166253
16990 -166253 -387748 -523602 -419233 -370639 -344689 -368124 -228615 -55544 64808 227584
16980 227584 202120 269682 -206706 -351961 -237295 -203741 -293141 -222692 -78435 -12591 76711
16969 76711 19180 24470 -15719 -2815 79191 35552 159659 287627 148781 73326 135981
16958 135981 220448 171114 183044 282557 312791 39164 -158450 -132689 -288712 -264006 -123981
16947 -123981 -20156 -182648 -294784 -90274 -13601 4012 35701 113182 218231 14543
16937 14543 -202375 -218095 -202062 -17344 15408 -167764 -307580 -240480 39533 16765 -262554
$$ packed form
17011b48345J25877P3386O633J14575m8216k14123j59301J05156M20592L1043
17001B07277l4276N7073r6785p2488p0969K7193j92030K5153Q5485o3384l8502
16990a66253k21495j35854J04369M8594K5950k3435J39509J73071J20352J62776
16980B27584k5464O7562m76388j45255J14666L3554q9400P0449J44257O5844Q9302
16969G6711n7531N290m0189J2904Q2006m3639J24107J27968j38846p5455O2655
16958A35981Q4467m9334J1930R9513L0234k73627j97614K5761j56023K4706J40025
16947a23981J03825j62492j12136K04510P6673J7613L1689P7481J05049k03688
16937A4543k16918j5720J6033J84718L2752j83172j39816O7100K80013k2768k79319
$$ plain form
16926 -262554 -212339 -230057 -279734 -244490 -249648 -281962 -241207 -89799 -54654 -15324 -39692
16915 -39692 -231585 -86249 -89168 -155813 46227 111232 -11964 -90789 -155325 56987 277532
16904 277532 191567 215493 197658 373355 545126 370346 69201 198925 249392 107158
16894 107158 219555 354129 188395 143431 -33168 -86486 -166563 -145030 -50841 52609
16884 52609 220904 464223 559767 606141 853522 673139 346708 246881 148187 55793 97888
16873 97888 34095 106808 54709 -31055 95230 335603 337202 125603 171550 202757 14983
16862 14983 68186 386098 511445 409297 87336 99657 96962 238712 239701 154369 -36820
16851 -36820 -136250 -265846 -169619 24722 91197 172106 185273 103239 43253 65744 -49581
$$ packed form
16926b62554N0215j7718m9677L5244n158l2314M0755J51408L5145L9330k4368
16915c9692j91893J45336k919o6645K02040O5005j23196p8825o4536K12312K20545
16904B77532q5965K3926j7835J75697J71771j74780l01145J29724N0467j42234
16894A07158J12397J34574j65734m4964j76599n3318q0077K1533R4189J03450
16884E2609J68295K43319R5544M6374K47381j80383l26431r9827r8694r2394M2095
16873I7888o3793P2713n2099q5764J26285K40373J599k11599M5947L1207j87774
16862A4983N3203L17912J25347j02148l21961J2321k695J41750R89q5332j91189
16851c6820r9430j29596R6227J94341O6475Q0909J3167q2034n9986K2491j15325
$$ plain form
16840 -49581 -21768 27794 193664 304589 442350 457817 422930 482646 370474 317905 188673
16829 188673 85708 38247 192535 539766 359041 258276 493377 638313 724423 894208
16819 894208 926873 849396 802727 865987 758662 733337 855560 1068840 1139111 970961 756287
16808 756287 455049 176460 83598 131144 90808 233158 617053 688366 588393 587574 464623
16797 464623 183197 -10315 -123129 -101645 94805 200145 170741 90869 183557 332455
16787 332455 329225 212351 256095 227446 101588 55034 -61240 45659 107595 219496 149377
16776 149377 24651 110196 157386 55708 -123286 -219754 -272732 -229858 -130686 -96463 -208839
16765 -208839 -66159 90744 253183 392459 312669 62609 -97297 -30823 100230 172433
$$ packed form
16840d9581K7813M9562J65870J10925J37761J5467l4887N9716j12172n2569j29232
16829A88673j02965m7461J54288L47231j80725j00765K35101J44936Q6110J69785
16819H94208L2665p7477m6669O3260j07325k5325J22223K13280P0271j68150k14674
16808G56287l01238k78589r2862M7546m0336J42350L83895P1313r9973q19j22951
16797D64623k81426j93512j12814K1484J96450J05340k9404p9872R2688J48898
16787C32455l230j16874M3744k8649j25858m6554j16274J06899O1936J11901p0119
16776A49377j24726Q5545M7190j01678j78994r6468n2978M2874R9172L4223j12376
16765b08839J42680J56903J62439J39276p9790k50060j59906O6474J31053P2203
$$ plain form
16755 172433 279245 355098 519914 590227 395605 52172 -76285 -1918 3881 -71597 -1232
16744 -1232 80521 77882 204601 396115 392096 265966 331675 451062 462012 337063 203324
16733 203324 122435 133225 57221 187271 279825 218594 75865 66591 104778 17035 -179094
16722 -179094 -216650 -330872 -362763 -290244 -83503 82989 181260 60444 -274399 -145739
16712 -145739 -57005 -84130 -40081 -69614 -132677 -33972 -18804 -9182 96810 313603 50692
16701 50692 24399 106509 242864 84700 -161134 -253826 -256709 -167682 -336474 -173170 -99884
16690 -99884 162426 116784 143065 239128 300203 208030 94202 -2196 -192133 -329840 -362061
16679 -362061 -50027 52790 42544 -22409 12946 1203 -374362 -346435 -216139 -179561 -94099
$$ packed form
16755A72433J06812P5853J64816P0313j94622l43433j28457P4367N799p5478P0365
16744a232Q1753k639J26719J91514m019j26130O5709J19387J0950j24949j33739
16733B03324q0889J0790p6004J30050R2554o1231j42729r274L8187q7743j96129
16722a79094l7556j14222l1891P2519K06741J66492R8271j20816l34843J28660
16712a45739Q8734k7125M4049k9533o3063R8705J5168R622J05992K16793k62911
16701E0692k6293Q2110J36355j58164k45834r2692k883Q9027j68792J63304P3286
16690i9884K62310m5642K6281R6063O1075r2173j13828r6398j89937j37707l2221
16679c62061L12034J02817j0246o4953L5355j1743l75565K7927J30296L6578Q5462
$$ plain form
16668 -94099 188058 203120 25018 145877 362583 280246 261638 10042 -92076 26594
16658 26594 -41832 127956 270859 161044 327964 162366 -172321 -346293 -150714 -5938
16648 -5938 60460 163708 330733 364579 209424 172473 98469 -62944 91049 182996 382849
16637 382849 219874 189979 181261 149295 66198 -148379 -158824 -79290 70366 132620 -89769
16626 -89769 -213284 -151232 -230603 -235717 -7937 61501 27953 45829 111693 137282 152715
16615 152715 57141 -38879 71539 79508 143594 -60879 -322981 -333005 -448555 -360206 -111630
16604 -111630 17043 -19460 60837 41705 66431 42816 -41792 -200928 -270925 -235117 -270242
16593 -270242 -13328 78718 182948 85033 -100806 -275671 -167520 -154452 -163450 -112519 139304
$$ packed form
16668i4099K82157J5062j78102J20859K16706q2337j8608k51596j02118J18670
16658B6594o8426J69788J42903j09815J66920j65598l34687j73972J95579J44776
16648e938O6398J03248J67025L3846j55155l6951p4004j61413J53993R1947J99853
16637C82849j62975k9895q718l1966q3097k14577j0445P9534J49656O2254k22389
16626h9769j23515O2052p9371n114K27780O9438l3548J7876O5864K5589J5433
16615A52715r5574r6020J10418P969O4086k04473k62102j0024j15550Q8349K48576
16604a11630J28673l6503Q0297j9132K4726k3615q4608j59136o9997L5808l5125
16593b70242K56914R2046J04230r7915j85839j74865J08151J3068q998N0931K51823
$$ plain form
16582 139304 143003 -129547 -312227 -409609 -252965 -122006 -30869 -48390 -65189 204461 336798
16571 336798 244067 248670 375654 412138 417106 482741 688294 595228 360243 139309 53039
16560 53039 211380 341168 -4187 -246959 -363709 -159001 109456 241521 101470 176023
16550 176023 105895 -217564 -308046 -85467 25814 229650 207093 253400 212499 121086 158994
16539 158994 234683 414357 218036 156386 137666 15592 -66024 -72328 89294 137679 -5852
16528 -5852 -69054 -31252 19848 -158558 -137534 -210633 -190992 -32194 -29449 -251380 -230646
16517 -230646 -172718 -16599 55176 -4032 22355 24236 810 249392 210634 61029 -40617
16506 -40617 -34673 -151161 -167825 -105100 26030 76761 -98102 49049 8060 64451 204393
$$ packed form
16582A39304L699k72550j82680r7382J56644J30959R1137j7521j6799K69650J32337
16571C36798r2731M603J26984L6484M968O5635K05553r3066k34985k20934q6270
16560E3039J58341J29788l45355k42772j16750K04708K68457J32065j40051P4553
16550A76023p0128l23459r0482K22579J11281K03836k2557M6307m0901r1413L7908
16539A58994P5689J79674j96321o1650j8720j22074q1616o304J61622M8385j43531
16528e852o3202L7802N1100j78406K1024p3099J9641J58798K745k21931K0734
16517b30646N7928J56119P1775n9208K6387J881k3426K48582l8758j49605j01646
16506d0617N944j16488j6664O2725J31130N0731j74863J47151m0989N6391J39942
$$ plain form
16495 204393 108612 -106208 -211013 39544 252374 555535 581724 493484 472706 392080
16485 392080 368135 362233 406461 386944 227779 11755 25157 -69549 132304 293276 298345
16474 298345 287021 19244 -100507 -190631 -109547 115147 157576 46275 70089 56115 26834
16463 26834 -87236 -73828 21823 91460 161821 172910 111321 196649 372044 337782 266539
16452 266539 5410 -261060 -298377 -79424 60773 173391 174962 233129 191146 249647 89330
16441 89330 -24548 108589 296442 159351 66454 -68815 -165982 -73393 226012 233196 174184
16430 174184 123225 220513 214110 177695 86988 76038 153967 -37478 -208117 -352199 -194947
16419 -194947 38108 264317 108910 37112 24674 127257 53099 11313 -102754 43644
$$ packed form
16495B04393r5781k14820j04805K50557K12830L03161K6189q8240k0778q0626
16485C92080k3945n902M4228j9517j59165k16024J3402r4706K01853J60972N069
16474B98345j1324k67777j19751r0124Q1084K24694M2429j11301K3814j3974k9281
16463B6834j14070J3408R5651O9637P0361J1089o1589Q5328J75395l4262p1243
16452B66539k61129k66470l7317K18953J40197J12618J571N8167m1983N8501j60317
16441H9330j13878J33137J87853j37091r2897j35269r7167R2589K99405P184n9012
16430A74184n0959R7288o403l6415r0707j0950P7929j91445j70639j44082J57252
16419a94947K33055K26209j55407p1798j2438J02583p4158m1786j14067J46398
$$ plain form
16409 43644 177283 -115930 -172692 62478 188657 263337 257946 151712 -50643 -120206 -97521
16398 -97521 -153964 -73858 -37763 184864 450339 503170 271076 99747 157084 150713 208438
16387 208438 167415 86309 211455 228192 170924 65990 -36991 34399 51306 190527 340444
16376 340444 258846 404228 347451 148323 15007 54315 -5975 -43600 -184538 36057
16366 36057 156565 -35812 25207 61887 -140008 -144681 197408 531422 379578 442118 252215
16355 252215 150236 333872 580239 483869 270042 183892 -28175 -159447 -26066 7399
16345 7399 104925 25289 -60248 -30010 -63292 -100676 -90859 -205300 -116673 95920 305608
16334 305608 609292 533526 467108 305804 269509 159209 166042 60482 -117559 19128
$$ packed form
16409D3644J33639k93213n6762K35170J26179P4680n391j06234k02355o9563K2685
16398i7521n6443Q0106L6095K22627K65475N2831k32094j71329N7337o371N7725
16387B08438m1023q1106J25146J6737n7268j04934j02981P1390J6907J39221J49917
16376C40444q1598J45382n6777j99128j33316L9308o0290l7625j40938K20595
16366C6057J20508j92377O1019L6680k01895m673L42089L34014j51844O2540j89903
16355B52215j01979J83636K46367r6370k13827q6150k12067j31272J33381L3465
16345G399R7526p9636q5537L0238l3282l7384R817j14441Q8627K12593K09688
16334C05608L03684p5766o6418j61304l6295j10300O833j05560j78041J36687
$$ plain form
16324 19128 25151 -100753 -195380 -242095 -148226 -222329 -202476 -159772 -249368 -268264 -56857
16313 -56857 -114797 -144137 -319822 -494471 -185385 187851 354674 293784 102464 -88915
16303 -88915 -234777 -278255 -18303 235551 281584 172211 240073 203006 201856 40929 -27023
16292 -27023 -110407 -45825 54399 -11059 -225199 -356273 -142631 -134190 -72562 -108082 -101207
16281 -101207 28614 144989 119408 290483 205496 21736 91096 196942 312564 245453
16271 245453 269666 156449 125704 169163 173289 96396 -43226 31035 -99778 -8103 176802
16260 176802 276250 89648 29675 108210 130667 -43100 -190874 -154073 150292 61568 -173272
16249 -173272 -69100 137987 77263 42993 77344 3844 90392 -59020 -90871 42432 124263
$$ packed form
16324A9128O023j25904r4627m6715R3869p4103J9853M2704q9596j8896K11407
16313e6857n7940k9340j75685j74649L09086L73236J66823o0890j91320j91379
16303h8915j45862m3478K59952K53854M6033j09373O7862l7067j150j60927o7952
16292b7023q3384O4582J00224o5458k14140j31074K13642Q441O1628l5520O875
16281a01207J29821J16375k5581J71075q4987j83760O9360J05846J15622o7111
16271B45453K4213j13217l0745M3459M126p6893j39622P4261j30813R1675J84905
16260A76802R9448j86602n9973P8535K2457j73767j47774L6801L04365q8724k34840
16249a73272J04172K07087o0724l4270L4351p3500Q6548j49412l1851J33303Q1831
$$ plain form
16238 124263 198798 175246 -85348 -162552 58031 121700 -42757 -198730 -26801 110522
16228 110522 34860 115219 -15016 69470 55696 -185921 -361592 -206451 -267817 -219831 -225764
16217 -225764 -30994 78634 -77992 -33883 10020 -126709 -75111 -121716 14412 8456 6750
16206 6750 117448 251670 255290 234006 173233 -128818 -240035 -444394 -551911 -351432 -302114
16195 -302114 -387204 -432546 -414882 -315055 39195 98994 -24415 12114 -32482 -56073 -229180
16184 -229180 -278608 -28097 101080 76850 231732 301542 183429 -12275 -7769 31615 66971
16173 66971 223177 153433 64830 -1756 -116214 -212195 -284869 -156356 206628 216244 42231
16162 42231 27122 112503 26673 -2645 41163 56094 -136919 -200263 -92869 11816 -21342
$$ packed form
16238A24263P4535k3552k60594p7204K20583O3669j64457j55973J71929J37323
16228A10522p5662Q0359j30235Q4486j3774k41617j75671J55141o1366M7986n933
16217b25764J94770J09628j56626M4109M3903j36729N1598m6605J36128n956j706
16206F750J10698J34222L620k1284o0773l02051j11217k04359j07517K00479M9318
16195c02114q5090m5342J7664R9827L54250N9799j23409L6529m4596k3591j73107
16184b29180m9428K50511J29177k4230J54882O9810j18113j95704M506L9384L5356
16173F6971J56206o9744q8603o6586j14458r5981p2674J28513L62984R616j74013
16162D2231j5109Q5381q5830k9318M3808J4931j93013o3344J07394J04685l3158
$$ plain form
16151 -21342 38469 -39516 35706 172703 173857 155914 -90858 -58465 128902 225475 76939
16140 76939 -113476 -123730 -232720 13681 86039 58603 160975 283358 379092 306236 104836
16129 104836 -127220 -133902 32690 39741 3661 -45464 129591 254002 228239 79919 -88948
16118 -88948 -174154 -98402 -16695 -167693 -212585 -46436 -210328 -225934 -126395 -56736 2211
16107 2211 -139659 -150301 -45793 -112141 241859 292727 -37831 -244686 -126350 -128711 -273898
16096 -273898 -395754 -323367 -239623 -44604 71711 -227519 -191105 -30435 -37774 -73254 -97979
16085 -97979 -242698 -372131 -357524 -212549 -59726 179069 345860 341423 103134 -142531
16075 -142531 -289545 -161981 -238268 -220682 -213994 -228886 -207584 -108730 -51926 -122205 -71232
$$ packed form
16151b1342N9811p7985P5222J36997J154j7943k46772L2393J87367R6573j48536
16140G6939j90415j0254j08990K46401P2358k7436J02372J22383R5734p2856k01400
16129A04836k32056o682J66592P051l6080m9125J75055J24411k5763j48320j68867
16118h8948q5206P5752Q1707j50998m4892J66149j63892j5606R9539O9659N8947
16107B211j41870j0642J04508o6348L54000N0868l30558k06855J18336k361j45187
16096b73898j21856P2387Q3744J95019J16315k99230L6414J60670p339l5480k4725
16085i7979j44719j29433J4607J44975J52823K38795J66791m437k38289k45665
16075a42531j47014J27564p6287J7586O688j4892K1302R8854N6804p0279N0973
$$ plain form
16064 -71232 -16295 -154687 -402816 -119187 179120 169243 17269 -83217 -198577 -219801
16054 -219801 -137847 -74988 -95027 -126561 -156753 -294093 -258611 175789 364701 176036 -48453
16043 -48453 -231333 -29879 222859 189369 15752 -126549 -75274 -262072 -380025 -431095
16033 -431095 -330867 -144636 -21113 32708 -218720 -239889 -94893 -19208 -16515 -90331 -52618
16022 -52618 -53086 -39840 -14495 -10868 -15352 -88905 -8808 -20306 -236193 -206840 64163 2130
16010 2130 -14582 -21072 -75410 27416 51655 -38128 -26899 271156 211306 63483 -99987
15999 -99987 -102343 39462 275943 351885 231914 174927 -1143 -8034 -7576 -256536 -246787 -93985
15987 -93985 29997 29389 -23280 -257391 -526228 -617254 -579022 -442532 -219230 -111474 -307285
$$ packed form
16064g1232N4937j38392k48129K83629K98307r877j51974j00486j15360k1224
16054b19801Q1954O2859k0039l1534l0192j37340L5482M34400J88912j88665k24489
16043d8453j82880K01454K52738l3490j73617j42301N1275j86798j17953n1070
16033d31095J00228J86231J23523N3821k51428k1169J44996P5685K693p3816L7713
16022e2618m68J3246K5345L627m484p3553Q0097j1498k15887K9353K71003o2033
16010B130j6712o490n4338J02826K4239q9783J1229K98055n9850j47823j63470
15999i9987k356J41805K36481P5942j19971n6987j76070o891M58k48960R749J52802
15987i3985J23982o08n2669k34111k68837r1026L8232J36490K23302J07756j95811
$$ plain form
15976 -307285 -271605 -182339 -61211 84246 168233 -86433 -298541 -261693 -89121 168481
15966 168481 303098 275463 90183 14437 51085 -51254 -146835 -183945 -83706 -26440 -67195
15955 -67195 -69895 -92124 129796 164180 113349 125903 -50130 -128735 -344098 -418344 -297256
15944 -297256 -74687 59744 157447 133570 87102 75807 -45468 -78492 -10857 4232 -148978
15933 -148978 -284045 -156884 33612 -184417 -211745 -223107 -397910 -213252 47523 99257
15923 99257 100734 264537 443468 232342 66928 -19598 -230382 -305651 -394673 -238682 -75564
15912 -75564 13618 -92587 -254724 -275521 -187333 -241570 -229420 -129683 -144229 -280044 -217691
15901 -217691 -209368 -71109 -78203 -156872 -106713 74247 154022 189281 234486 256403 250864 205550
$$ packed form
15976c07285L5680Q9266J21128J45457Q3987k54666k12108L6848J72572K57602
15966A68481J34617k7635j85280p5746L6648j02339r5581l7110J00239N7266m0755
15955f7195k700k2229K21920L4384n0831J2554j76033p8605k15363p4246J21088
15944b97256K22569J34431R7703k3877m6468j1295j21275l3024O7635J5089j53210
15933a48978j35067J27161J90496k18029k7328j1362j74803J84658K60775N1734
15923I9257J477J63803J78931k11126j65414q6526k10784p5269q9022J55991J63118
15912g5564Q9182j06205j62137k0797Q8188n4237J2150R9737j4546j35815O2353
15901b17691Q323J38259p094p8669N0159J80960P9775L5259M5205K1917n539m5314
$$ plain form
15889 205550 56693 -40673 -150825 -192793 -264042 -191077 181342 126925 -51143 -140030 -158811
15878 -158811 -223816 -133091 -52784 15484 148187 105825 -5735 -120370 -78834 -92840 119871
15867 119871 273611 128504 135993 45820 -29486 -21701 -113521 -77320 -119748 -13529 -6696
15856 -6696 -117307 -1914 5113 -64927 105859 184032 200976 188568 170789 -79983 -176174
15845 -176174 -210747 -129748 -369 -32303 118878 229209 64162 58955 194181 287927 265474
15834 265474 56074 -350905 -323463 -222445 -35673 -96355 -108983 -193614 -164264 -108784 27770
15823 27770 61652 -225581 -352164 -207658 -293045 -298904 -236805 -171383 -158079 -56648 -22215
15812 -22215 -230906 -357247 -357106 -113509 -81824 -70497 -61198 -36779 -34740 -216883 -245128 -243052
$$ packed form
15889B05550j48857r7366j10152m1968p1249P2965L72419n4417j78068q8887j8781
15878a58811o5005R0725Q0307O8268J32703m2362j11560j14635M1536j4006K12711
15867A19871J53740j45107P489r0173p5306P785r1820L6201m2428J06219O833
15856f696j10611J15393P027p0040J70786P8173J6944j2408j7779k50772r6191
15845a76174l4573Q0999J29379l1934J51181J10331j65047n207J35226R3746k2453
15834B65474k09400m06979K7442J01018J86772o0682j2628q4631K9350N5480J36554
15823B7770L3882k87233j26583J44506q5387n859O2099O5422J3304J01431L4433
15812b2215k08691j26341J41K43597L1685J1327R299K4419K039j82143k8245K076
$$ plain form
15800 -243052 -221938 13505 -111610 -221813 -192306 -164039 -179157 -12961 244596 150811
15790 150811 133955 73712 -232109 -458486 -440909 -202940 -205748 -242058 -372144 -509747 -484749
15779 -484749 -398488 -315599 -96054 -60131 -120400 -259361 -465058 -147969 54915 100522
15769 100522 -178811 -252439 -203695 -122580 -59167 38206 -171287 -238365 -145719 -101948 -275851
15758 -275851 -156670 152990 -45542 -242579 -177482 -159604 -91742 -121359 -218239 -168810 -62534
15747 -62534 55130 165985 83795 -59344 -51009 61225 -84925 -162763 -157638 -212327 -152337
15736 -152337 -83807 -14577 -48638 46654 55415 142362 296096 363992 393995 200526 -151264
15725 -151264 -366320 -477100 -354507 -171290 82587 -66661 -229147 -96771 -143176 -223206
$$ packed form
15800b43052K1114K35443j25115j10203K9507K8267j5118J66196K57557r3785
15790A50811j6856o0243l05821k26377J7577K37969k808l6310j30086j37603K4998
15779d84749Q6261Q2889K19545L5923o0269j38961k05697L17089K02884M5607
15769A00522k79333p3628M8744Q1115O3413R7373k09493o7078R2646M3771j73903
15758b75851J19181L09660j98532j97037O5097J7878O7862k9617r6880M9429J06276
15747f2534J17664J10855q2190j43139Q335J12234j46150p7838N125n4689N9990
15736a52337O8530O9230l4061R5292Q761Q6947J53734O7896L0003j93469l51790
15725a51264k15056j10780J22593J83217K53877j49248j62486J32376m6405q0030
$$ plain form
15715 -223206 -369403 -258538 -51541 13353 60088 298660 504954 274963 53056 -118951
15705 -118951 -231531 -35501 257024 265269 36710 -36837 157220 331245 166556 9588
15695 9588 24078 -66649 13707 54859 187749 134066 -29684 -84781 -196552 -160155 -215608
15684 -215608 -192337 -184286 -293780 -267753 -229517 -225712 -116235 -175670 -350273 -371510 -153871
15673 -153871 -142130 -167493 -26261 188956 67927 46981 68015 -37634 -37873 25511 74431
15662 74431 13414 -108410 -157595 -163633 -171826 -164167 -135282 -281517 -347451 -441398 -315764 51516
15650 51516 242405 -98730 -175777 -167557 -129440 -131970 -319487 -349327 -264602 -151103 -250855
15639 -250855 -395596 -421901 -391434 -237946 23226 211208 307100 39271 -141950 -99956
$$ packed form
15715b23206j46197J10865K06997O4894M6735K38572K06294k29991k21907j72007
15705a18951j12580J96030K92525Q245k28559p3547J94057J74025j64689j56968
15695I588J4490r0727Q0356M1152J32890n3683j63750n5097j11771L6397n5453
15684b15608K3271Q051j09494K6027L8236L805J09477n9435j74603k1237K17639
15673a53871J1741k5363J41232K15217j21029k0946K1034j05649k39O3384M8920
15662G4431o1017j21824m9185o038q193P659K8885j46235o5934r3947J25634L67280
15650E1516J90889l41135p7047Q220L8117k530j87517k9840Q4725J13499r9752
15639b50855j44741k6305L0467J53488K61172J87982R5892k67829j81221M1994
$$ plain form
15629 -99956 -107431 219715 474696 676243 552379 308836 308415 184593 228153 248418 79731
15618 79731 26238 -14954 63375 33470 -78387 -160280 -114962 -93235 91608 159172 197655
15607 197655 173625 4335 -82599 -231901 -160147 -191762 -79262 -77004 -3881 54521 12897
15596 12897 17102 -51605 -69785 -264702 -319933 -303783 -134876 215269 449723 270130 178967
15585 178967 196603 300897 328694 330912 218965 -3094 141616 141149 16545 -181365 -247847
15574 -247847 -49399 173888 147514 -47858 -205900 -102737 -265313 -348364 -252569 -159411
15564 -159411 -14886 -4358 37737 74306 109068 -130008 -158076 21046 89267 -25735 55738
15553 55738 287791 435591 562612 536695 577643 707244 631842 319829 165582 182844
$$ packed form
15629i9956p475L27146K54981K01547j23864k43543m21j23822M3560K0265j68687
15618G9731n3493m1192P8329k9905j11857q1893M5318K1727J84843O7564L8483
15607A97655k4030j69290q6934j49302P1754l1615J12500K258P3123N8402m1624
15596A2897M205o8707j8180j94917n5231J6150J68907L50145K34454j79593r1163
15585A78967J7636J04294K7797K218j11947k22059J44710m67j24604j97910o6482
15574b47847J98448K23287k6374j95372j58042J03163j62576q3051R5795R3158
15564a59411J44525J0528M2095L6569L4762k39076k8068J79122O8221j15002Q1473
15553E5738K32053J47800J27021k5917M0948J29601p5402l12013j54247J7262
$$ plain form
15543 182844 194529 234796 78494 -154388 -365289 -278811 -24661 179056 141539 -73015
15533 -73015 -281619 -309568 -191357 -160687 -175024 -201317 97365 163696 96053 136413 196289
15522 196289 109678 -35310 60009 6866 58030 70728 79452 231181 -43404 -359099 -397399
15511 -397399 -337009 -179042 -25580 81452 254155 120948 5800 85497 185939 41995
15501 41995 -11684 53065 -3084 -229164 -416900 -360085 -335707 -152905 25837 115072 -68783
15490 -68783 80977 409741 301907 12964 -91767 20715 -130806 -37302 81972 170544
15480 170544 126258 101288 103496 56660 117234 239373 190621 89039 58349 -4319 24613
15469 24613 28425 -152376 -191091 -10544 163421 263530 197513 88538 -89380 -46174 -334792
$$ packed form
15543A82844J1685M0267j56302k32882k10901Q6478K54150K03717l7517k14554
15533g3015k08604k7949J18211L0670j4337k6293K98682O6331o7643M0360N9876
15522A96289q6611j44988R5319n3143N1164J2698Q724J51729k74585l15695l8300
15511c97399O0390J57967J53462J07032J72703j33207j15148P9697J00442j43944
15501D1995n3679O4749n6149k26080j87736N6815K4378J82802J78742Q9235j83855
15490f8783J49760L28764j07834k88943j04731J12482j51521R3504J19274Q8572
15480A70544m4286k4970K208m6836O0574J22139m8752j01582l0690o2668K8932
15469B4613L812j80801l8715J80547J73965J00109o6017j08975j77918M3206k88618
$$ plain form
15458 -334792 -182573 -92972 -20471 -16379 -319758 -313565 -303164 -164521 -98332 -17504 19552
15447 19552 -111745 -102157 29599 96414 682 32057 140001 166458 -13691 16701 219141
15436 219141 265386 -88694 -181502 -76395 -157388 -186162 -180727 -129044 -139622 -55652 269297
15425 269297 496302 416321 220452 -75188 -102204 115422 203100 270890 129649 -389961
15415 -389961 -537041 -332157 -377282 -74015 -43251 206861 233806 254012 169106 -10067
15405 -10067 -66132 -29490 143332 103278 54606 97448 2891 -230002 -278374 -212322 115243
15394 115243 93096 -19538 -67055 14731 148351 71615 -50568 -129894 -4583 -40179 55158
15383 55158 102594 101827 70825 139371 217513 132959 11607 61294 -22500 -197122 -254544 -272339
$$ packed form
15458c34792J52219Q9601P2501M092l03379O193J0401J38643O6189Q0828L7056
15447A9552j31297R588J31756O6815r5732L1375J07944K6457j80149L0392K02440
15436B19141M6245l54080r2808J05107q0993k8774N435N1683j0578Q3970L24949
15425B69297K27005p9981j95869k95640k7016K17626Q7678O7790j41241n19610
15415c89961j47080K04884m5125L03267L0764K50112K6945K0206q4906j79173
15405a0067n6065L6642J72822m0054m8672M2842r4557k32893m8372O6052L27565
15394A15243k2147j12634m7517Q1786J33620p6736j22183p9326J25311l5596R5337
15383E5158M7436p67l1002O8546P8142q4554j21352M9687q3794j74622n7422j7795
$$ plain form
15371 -272339 -170395 -129805 -186359 -143139 88383 252998 -500 -196219 -302150 -310176
15361 -310176 -260098 -92820 -90447 -169091 -46357 18669 184592 203525 -108866 -108353 2555
15350 2555 80303 -45456 -240614 -132400 104213 195238 124453 173162 215811 46534 18330
15339 18330 -119425 -176300 -103403 -44342 148862 187635 186485 72507 -124262 -233073 -88467
15328 -88467 -14081 -181973 -233125 -342579 -472940 -635292 -428711 -420709 -264003 -73393
15318 -73393 51917 183425 190094 16915 3529 97263 170357 39527 154003 184144 206365
15307 206365 186049 176692 202423 293524 317004 265790 180242 155897 295730 191883 -94872
15296 -94872 -309037 -296214 -217823 -235607 -392498 -364779 -181247 -56297 182089 137012 -72809
$$ packed form
15371b72339J01944M0590n6554M3220K31522J64615k53498j95719j05931q026
15361c10176N0078J67278K373p8644J22734O5026J65923J8933l12391N13J10908
15350B555P7748j25759j95158J08214K36613R1025p0785M8709M2649j69277k8204
15339A8330j37755n6875P2897N9061J93204L8773j150j13978j96769j08811J44606
15328h8467P4386j67892n1152j09454j30361j62352K06581Q002J56706J90610
15318g3393J25310J31508O669j73179j3386R3734P3094j30830J14476L0141K2221
15307B06365k0316r357K5731R1101K3480n1214q5548k4345J39833j03847k86755
15296i4872k14165J2823P8391j7784j56891K7719J83532J24950K38386m5077k09821
$$ plain form
15285 -72809 -65000 -207145 -375147 -319934 -270023 -103868 -105781 -202996 -125967 1392 50283
15274 50283 -74504 36181 -100119 -146266 19581 -84055 -166280 -19158 179932 308885
15264 308885 133551 73393 37349 18172 -143092 -229473 -149023 -264457 -279819 -400325 -355992
15253 -355992 -115328 -161288 -320761 -447556 -511895 -332133 -237498 -55467 -43595 -76490
15243 -76490 -87259 -181645 -237977 -155374 -112750 -60933 -173265 -225348 -231770 -6847 178542
15232 178542 236506 286924 185691 137707 72024 59203 -3270 43146 102528 118693 -89588
15221 -89588 79418 179024 203559 96263 -16782 -4383 -462 -2359 -93936 -129468 -24238
15210 -24238 69708 228260 175084 -150924 -176474 145239 156404 149675 219419 157334 77992
$$ packed form
15285g2809P809j42145j68002N5213M9911J66155j913r7215P7029J27359M8891
15274E0283j24787J10685j36300m6147J65847j03636q2225J47122J99090J28953
15264C08885j75334o0158l6044j9177j61264q6381Q0450j15434j5362j20506M4333
15253c55992K40664m5960j59473j26795o4339J79762R4635J82031J1872l2895
15243g6490j0769r4386n6332Q2603M2624N1817j12332n2083o422K24923J85389
15232A78542N7964N0418j01233m7984o5683j2821o2473M6416N9382J6165k08281
15221h9588J69006R9606K4535j07296j13045J2399L921j897r1577l5532J05230
15210b4238R3946J58552n3176l26008k5550L21713J1165o729O9744o2085p9342
$$ plain form
15199 77992 1082 46804 181461 187840 77701 132901 241211 152342 157498 265585 337669
15188 337669 593753 745011 473550 167073 104543 121069 34029 61714 92781 -144867
15178 -144867 -292022 -262618 -240810 -205485 -40044 124062 4297 -86805 53514 140967
15168 140967 112881 55795 -39551 82275 2100 -37609 -67836 -128611 -256963 -323844 -242876
15157 -242876 -4232 226893 390840 213895 241529 400581 264862 95893 158970 177782
15147 177782 57602 -71845 -72780 -36764 -119070 -163405 -196576 -23363 -25544 -170505 -205023
15136 -205023 314679 549198 603455 607701 548257 246385 12337 -52049 53609 -59000
15126 -59000 -216076 -351093 -208029 -15608 116435 97895 110450 272294 225206 89342
$$ packed form
15199G7992p6910M5722J34657O379j10139N5200J08310q8869N156J08087P2084
15188C37669K56084J51258k71461l06477o2530J6526q7040K7685L1067k37648
15178a44867j47155K9404K1808L5325J65441J64106j19765r1102J40319Q7453
15168A40967k8086n7086r5346J21826q0175l9709l0227o0775j28352o6881Q0968
15157b42876K38644K31125J63947j76945K7634J59052j35719j68969O3077J8812
15147A77782j20180j29447r35L6016q2306m4335l3171J73213k181j44961l4518
15136b05023N19702K34519N4257M246n9444l01872k34048o4386J05658j12609
15126e9000j57076j35017J43064J92421J32043j8540J2555J61844m7088j35864
$$ plain form
15116 89342 -54156 -159712 -252451 -283816 -171952 173485 501323 489277 395719 341770 224642
15105 224642 -44069 -346232 -367767 -144666 -45599 31551 40052 60989 126134 278723 -27496
15094 -27496 -162555 -195444 -173875 -282271 -219393 -178696 -124292 -107967 -95586 -1134 267720
15083 267720 257796 -29155 -143875 -40417 -49478 -45653 160571 9166 -162976 -96636 95190
15072 95190 150821 324833 273537 139974 91889 -116672 -310879 -409584 -243860 -124435
15062 -124435 62335 248187 161153 56218 -138391 -169778 -56045 -255832 -159020 -38154
15052 -38154 16763 -211613 -312611 -253719 -83656 -24689 56980 175801 257683 299280 166715
15041 166715 3691 -91111 -63143 -179647 -182326 -189975 -204391 -142471 -78701 -193550 -317541
$$ packed form
15116H9342j43498j05556r2739l1365J11864L45437L27838j2046r3558n3949j17128
15105B24642k68711l02163k1535K23101R9067P7150Q501K0937O5145J52589l06219
15094b7496j35059l2889K1569j08396O2878M0697N4404J6325J2381R4452K68854
15083B67720r924k86951j14720J03458r061L825K06224j51405j72142O6340J91826
15072I5190N5631J74012n1296j33563m8085k08561j94207r8705J65724J19425
15062a24435J86770J85852q7034j04935j94609l1387J13733j99787R6812J20866
15052c8154N4917k28376j00998N8892J70063N8967Q1669J18821Q1882M1597j32565
15041A66715j63024r4802K7968j16504k679p649j4416O1920O3770j14849j23991
$$ plain form
15030 -317541 -125973 140563 115132 90896 64246 -29359 -10008 10941 155421 121467 54415
15019 54415 39786 -67647 -38346 -39155 8299 -142782 -198245 -244386 44166 266845 227040
15008 227040 394579 597984 467428 361454 362817 206365 181128 239186 196785 -98693
14998 -98693 -72947 76956 16372 -113692 -194496 41114 30073 -17681 151379 293835 362970
14987 362970 165976 -34698 39673 325889 251788 131631 114215 356825 381943 187457
14977 187457 -77412 -81208 18760 146612 325015 374947 143449 249668 376286 324085
14967 324085 204461 297868 260935 -50024 -273044 -111691 80484 122186 9605 -7742
14957 -7742 -52427 -62848 118718 145372 53333 151255 145487 27887 -205085 24189 159320
$$ packed form
15030c17541J91568K66536k5431k4236k6650r3605J9351K0949J44480l3954o7052
15019E4415j4629j07433K9301q09M7454j51081n5463m6141K88552K22679l9805
15008B27040J67539K03405j30556j05974J363j56452k5237N8058m2401k95478
14998i8693K5746J49903o0584j30064q0804K35610j1041m7754J69060J42456O9135
14987C62970j96994k00674P4371K86216p4101j20157j7416K42610K5118j94486
14977A87457k64869l796R9968J27852J78403M9932k31498J06219J26618n2201
14967C24085j19624R3407l6933l10959k23020J61353J92175M1702j12581j7347
14957g742m4685j0421J81566K6654r2039R7922n768j17600k32972K29274J35131
$$ plain form
14946 159320 -24911 -60192 55015 63775 -394382 -633579 -373979 -224431 51751 36131
14936 36131 -220347 -160585 -81613 -75699 135811 172726 128525 -165148 -241498 -110412 -126114
14925 -126114 -66996 -9179 175445 220056 303537 255713 270886 80654 -163347 -147457 -291841
14914 -291841 -190227 -309527 -180082 -172339 -116053 -185210 -262753 -190491 -264825 -391835 -150508
14903 -150508 65675 -71867 -47115 -40084 -77487 -169083 -88274 315 -87651 -84240 -234793
14892 -234793 -257927 -62789 1476 17314 23626 -130113 -198888 -272080 -200095 26489 -15391
14881 -15391 -93015 -4356 -220986 -332525 -148857 -80850 -128592 -245374 -245140 32266 179511
14870 179511 66614 70583 126673 12439 -17772 -87496 -235835 -272257 -278859 -83499 -130596
$$ packed form
14946A59320j84231l5281J15207Q760m58157k39197K59600J49548K76182j5620
14936C6131k56478N9762P8972N914K11510L6915m4201k93673p6350J31086j5702
14925a26114N9118N7817J84624M4611Q3481m7824J5173j90232k44001J5890j44384
14914b91841J01614j19300J29445P743N6286o9157p7543P2262p4334j27010K41327
14903a50508K16183j37542K4752P031l7403r1596Q0809Q8589q7966L411j50553
14892b34793k3134J95138O4265J5838O312j53739o8775p3192P1985K26584m1880
14881a5391p7624Q8659k16630j11539J83668O8007m7742j16782K34K77406J47245
14870A79511j12897L969N6090j14234l0211o9724j48339l6422o602J95360m7097
$$ plain form
14859 -130596 -181361 -43251 17268 129532 48249 32450 -53322 -185495 -186667 230966 351928
14848 351928 341595 177249 -50335 -98232 58821 63312 -39831 15244 -18052 -192798 26127
14837 26127 -62051 -294747 -443973 -210966 183629 298361 173581 83536 307965 359392
14827 359392 390822 373438 116913 75804 134935 282217 95758 129335 168382 -46376 -153953
14816 -153953 -128077 -145920 77309 12620 -56267 -20751 -117490 -254387 -290524 -34243 -29711
14805 -29711 -46299 -163623 -41116 117357 59608 -181890 -226004 -11043 65895 -104571
14795 -104571 -113818 -113365 30798 200002 319661 263739 131384 172787 306209 304477 132994
14784 132994 -112324 -166174 -95821 52153 126500 5395 141346 352114 421644 424522 327247
$$ packed form
14859a30596n0765J38110O0519J12264q1283j5799q5772j32173j172M17633J20962
14848C51928j0333j64346k27584m7897J57053M491j03143N5075l3296j74746K18925
14837B6127q8178k32696j49226K33007L94595J14732j24780r0045K24429N1427
14827C59392L1430j7384k56525m1109N9131J47282j86459L3577L9047k14758j07577
14816a53953K5876j7843K23229o4689o8887L5516r6739j36897l6137K56281M532
14805b9711j6588j17324J22507J58473n7749k41498m4114K14961P6938j70466
14795a04571r247M53J44163J69204J19659n5922j32355M1403J33422j732j71483
14784A32994k45318n3850P0353J47974P4347j21105J35951K10768O9530K878r7275
$$ plain form
14773 327247 337966 534085 395463 310473 280550 257420 58804 -167337 -45471 -74223
14763 -74223 -245254 -96537 52152 78631 52448 146594 70902 -17429 -35253 -154300 -268841
14752 -268841 -34038 202704 171722 201313 -15146 -241071 -173925 -58938 -57251 30086 32159
14741 32159 -114675 -83269 -131274 -158290 64398 165968 129454 150122 113387 -41632 -158054
14730 -158054 -191649 -316553 -404171 -276746 -218699 -242287 -216308 52294 115231 56286 106170
14719 106170 122316 252804 189640 41306 10351 92751 223496 136418 77769 -13062 -130131
14708 -130131 -72160 -5388 -44183 -141533 -218680 -155421 -162160 -141470 229271 347735 343304
14697 343304 312842 360903 215094 -4841 -77911 -140527 106587 314257 209305 75874
$$ packed form
14773C27247J0719J96119j38622q4990k9923k3130j98616k26141J21866k8752
14763g4223j71031J48717J48689K6479k6183R4146p5692q8331j7824j19047j14541
14752b68841K34803K36742l0982K9591k16459k25925O7146J14987J687Q7337K073
14741C2159j46834L1406m8005k7016K22688J01570l6514K0668l6735j55019j16422
14730a58054l3595j24904q7618J27425N8047k3588K5979K68602O2937n8945M9884
14719A06170J6146J30488o3164j48334l0955Q2400J30745q7078n8649r0831j17069
14708a30131N7971O6772l8795r7350p7147O3259o739K0690L70741J18464m431
14697C43304l0462M8061j45809k19935p3070o2616K47114K07670j04952j33431
$$ plain form
14687 75874 -130543 -171301 -319196 -137195 -46594 -279723 -342007 -258586 -96410 -268036
14677 -268036 -305923 -195284 -157605 -45232 -69764 -104395 -89340 -163358 -158035 -55375 58581
14666 58581 80213 70213 150485 223140 187260 120672 631 -234594 -351880 -291864 -196495
14655 -196495 -91389 -216759 -378984 -360147 -49613 4824 -93632 -130863 -128686 215707 413449
14644 413449 470193 313454 245921 84161 88982 -18163 -197506 -90208 -43991 -164405
14634 -164405 -160797 -92145 -76927 -228764 -225614 -272045 -75375 -43732 -160780 -337739 -488041
14623 -488041 -458555 -300355 44497 220044 113494 -82803 -50448 -65302 -95038 9065
14613 9065 87216 -95893 -69225 73082 -43832 -95105 -80374 267755 620122 499411 409179
$$ packed form
14687G5874k06417m0758j47895J82001R0601k33129o2284Q3421J62176j71626
14677b68036l7887J10639L7679J12373k4532l4631J5055p4018N323J02660J13956
14666E8581K1632j0000Q0272P2655l5880o6588j20041k35225j17286O0016R5369
14655a96495J05106j25370j62225J8837L10534N4437r8456l7231K177L44393J97742
14644D13449N6744j56739o7533j61760M821j07145j79343J07298M6217j20414
14634a64405L608O8652J5218j51837L150m6431J96670L1643j17048j76959j50302
14623d88041K9486J58200L44852J75547j06550j96297L2355j4854k9736J04103
14613I065P8151j83109K6668J42307j16914n1273J4731L48129L52367j20711r0232
$$ plain form
14602 409179 480854 362453 190418 -75595 -44053 25308 -103913 -360478 -597766 -570054
14592 -570054 -520624 -527949 -462990 -550498 -497594 -343934 -212705 7937 111755 50962 9293
14581 9293 11483 -250066 -263446 -180541 -108445 -225961 -254337 -114056 -136826 -235212 -204618
14570 -204618 199142 365099 113064 -52445 -1649 33051 -44531 -157138 -284196 -360983
14560 -360983 -112546 175430 394838 253681 119286 28804 -269950 -293963 -89465 -31636
14550 -31636 -52650 -133020 -100472 -158590 -119457 -9155 46247 58776 26260 -39819 -17362
14539 -17362 38637 57227 241563 386877 450101 387239 222697 174593 52490 -30534 -102429
14528 -102429 -401543 -336971 -333260 -90949 -26246 65374 436557 293000 153435 -90000
$$ packed form
14602D09179P1675j18401j72035k66013L1542O9361j29221k56565k37288K7712
14592e70054M9430p325O4959q7508N2904J53660J31229K20642J03818o0793m1669
14581I293K190k61549j3380Q2905P2096j17516k8376J40281k2770r8386L0594
14570b04618M03760J65957k52035j65509N0796L4700p7582j12607j27058p6787
14560c60983K48437K87976K19408j41157j34395r0482k98754k4013K04498N7829
14550c1636k1014q0370L2548n8118L9133J10302N5402J2529l2516o6079K2457
14539a7362N5999J8590J84336J45314O3224o2862j64542m8104j22103q3024p1895
14528a02429k99114O4572L711K42311O4703R1620L71183j43557j39565k43435
$$ plain form
14518 -90000 -277537 -118531 -80447 24603 128138 1381 -28191 -47071 -207946 -80789
14508 -80789 48786 5646 124927 161620 100395 -114985 -132103 -250341 -181677 9893 -48563
14497 -48563 7344 325357 284562 146622 168178 -44546 -198539 -56776 -120121 -255072
14487 -255072 -123528 -112657 -137282 20351 -18751 -315527 -275980 -115614 -91990 60473
14477 60473 232535 369370 450105 602534 463020 363454 278978 177466 46921 25587
14467 25587 -107989 -13455 -16914 -77110 -9020 -63444 -25777 -66176 -229844 -134379 26324
14456 26324 -60818 -119194 -110882 -160881 -370693 -345191 -342472 49648 192101 120001 2574
14445 2574 52526 14094 100381 622202 738672 260831 151784 232444 108139 -5730 16656
$$ packed form
14518i0000j87537J59006L8084J05050J03535j26757k9572j8880j60875J27157
14508h0789J29575m3140J19281L6693o1225k15380j7118j18238O8664J91570n8456
14497d8563N5907L18013m0795j37940K1556k12724j53993J41763o3345j34951
14487b55072J31544J0871k4625J57633l9102k96776L9547J60366K3624J52463
14477F0473J72062J36835Q0735J52429j39514r9566q4476j01512j30545k1334
14467B5587j33576R4534l459o0196O8090n4424L7667m0399j63668R5465J60703
14456B6324q7142n8376Q312m9999k09812K5502K719L92120J42453p2100j17427
14445B574M9952l8432Q6287N21821J16470m77841j09047Q0660j24305j13869K2386
$$ plain form
14434 16656 115513 186273 320193 362517 207414 20581 -76800 -68644 -15663 4145 -73184
14423 -73184 70570 51808 -110230 -143158 -28212 20993 159715 231125 77940 -157847
14413 -157847 -139223 -475702 -489599 -467621 -303272 -155327 -61119 65000 157229 192866 259847
14402 259847 345130 364335 286332 8873 2441 104197 74461 -9973 70162 -30700 -305893
14391 -305893 -403644 -288160 -142318 104022 254955 84054 3343 -57020 53568 185914
14381 185914 110133 -2377 -37482 13795 -34601 -76508 -98881 -14893 68790 129259 -50128
14370 -50128 -184812 -365699 -432969 -446653 -345384 -180810 -204383 110167 267408 263296 290859
14359 290859 191836 -24798 -139825 -75577 -101291 -154336 -366499 -405214 -331966 -279919 -228343
$$ packed form
14434A6656R8857P0760J33920M2324j55103j86833r7381Q156N2981J9808p7329
14423g3184J43754j8762j62038l2928J14946M9205J38722P1410j53185k35787
14413a57847J8624l36479j3897K1978J64349J47945R4208J26119R2229L5637O6981
14402B59847Q5283J9205p8003k77459o432J01756k9736q4434Q0135j00862k75193
14391c05893r7751J15484J45842K46340J50933j70901q0711o0363J10588J32346
14381A85914p5781j12510l5105N1277m8396m1907k2373Q3988Q3683O0469j79387
14370e0128j34684j80887o7270j3684J01269J64574k3573L14550J57241m112K7563
14359B90859r9023k16634j15027O4248k5714n3045k12163l8715P3248N2047N1576
$$ plain form
14348 -228343 96089 112150 205305 215829 75654 135795 209926 -22647 -403548 -353566 -117023
14337 -117023 28274 -13740 -227879 -206203 -98947 -42605 11570 -130471 26251 141196
14327 141196 145013 175744 212530 165483 15226 144079 392624 332735 164383 196220 116389
14316 116389 8311 164470 131957 144504 -148004 -220520 -212485 -152280 -181771 -199335 -195964
14305 -195964 -134760 -36117 -173768 -206929 -110840 108221 265638 347935 226178 88184
14295 88184 -583 51571 135295 97738 121744 45663 -90226 -13105 16683 209267 294086
14284 294086 193589 115875 159345 345560 357047 182370 190668 166177 68408 211509 192954
14273 192954 67642 -26937 -167585 -237121 -398987 -387944 -252354 -73563 -121916 -267990
$$ packed form
14348b28343L24432J6061R3155J0524j40175O0141P4131k32573l80901M9982K36543
14337a17023J45297m2014k14139K1676J07256N6342N4175j42041J56722J14945
14327A41196L817L0731L6786m7047j50257J28853K48545n9889j68352L1837p9831
14316A16389j08078J56159l2513J2547k92508p2516Q035O0205k9491j7564L371
14305a95964O1204R8643j37651l3161R6089K19061J57417Q2297j21757j37994
14295H8184q8767N2154Q3724l7557K4006p6081j35889P7121K9788J92584Q4819
14284B94086j00497p7714M3470J86215J1487j74677Q298k4491r7769J43101j8555
14273A92954j25312r4579j40648o9536j61866J1043J35590J78791m8353j46074
$$ plain form
14263 -267990 -203333 -4492 -64115 -240565 -215953 -89284 -33919 -45135 150480 -75372
14253 -75372 -199053 -165727 -145444 -202086 -197985 -118505 -184963 -176028 -59982 235086 259048
14242 259048 77643 -140554 -45954 -92336 -208650 -327080 -348202 -164174 10123 162
14232 162 -75408 -49237 -89459 -273004 -121326 -101670 -104307 -34408 18797 -56945 -107289 -102479
14220 -102479 -219982 -109245 -276067 -383849 -381898 -390301 -232654 20676 -89202 23007
14210 23007 144679 163802 71755 -40856 -4059 647 118835 112177 22007 88734 127543
14199 127543 235780 139085 176786 321671 256032 120369 -44861 -68164 -41632 -1704 234351
14188 234351 96252 228030 348807 266628 129036 290403 144045 -77547 -120614 -107294
$$ packed form
14263b67990O4657J98841n9623j76450K4612J26669N5365j1216J95615k25852
14253g5372j23681L3326K0283n6642M101P9480o6458Q935J16046K95068K3962
14242B59048j81405k18197R4600m6382j16314j18430k1122J84028J74297r961
14232A62p5570K6171m0222j83545J51678J9656k637O9899N3205p5742n0344M810
14220a02479j17503J10737j66822j07782J951q403J57647K53330j09878J12209
14210B3007J21672J9123r2047j12611L6797M706J18188o658r0170O6727L8809
14199A27543J08237r6695L7701J44885o5639j35663j65230k3303K6532L9928K36055
14188B34351j38099J31778J20777q2179j37592J61367j46358k21592m3067J3320
$$ plain form
14178 -107294 -221129 -19154 108390 239526 196752 -190089 -285599 -132747 17807 111746
14168 111746 74449 105476 -36167 -242034 -274944 92668 292985 131335 174823 242455
14158 242455 283242 73515 -207578 -226576 -194931 10453 32525 28597 30974 4301 31160
14147 31160 31448 -8548 -44379 -48606 -156144 -159203 -92341 -56976 -109589 -329537 -306058 -48709
14135 -48709 135095 137495 298126 341811 94398 -197085 -137272 6671 64556 -59291 -106023
14124 -106023 -125898 -217913 -134820 -72160 -5784 132018 189068 -50548 131030 105128 38911
14113 38911 -327925 -388358 -53941 21981 -35285 115061 264393 100351 -113434 -145357
14103 -145357 -102166 -23313 -92475 -3987 -161719 -513404 -401305 -223458 -121940 -72784
$$ packed form
14178a07294j13835K01975J27544J31136m2774l86841r5510J52852J50554R3939
14168A11746l7297L1027j41643k05867l2910L67612K00317j61650M3488O7632
14158B42455M0787k09727k81093j8998L1645K05384K2072l928K377k6673K6859
14147C1160K88l9996l5831m227j07538l059O6862L5365n2613k19948K3479K57349
14135d8709J83804K400J60631M3685k47413k91483N9813J43943N7885j23847m6732
14124a06023j9875r2015Q3093O2660O6376J37802N7050k39616J81578k5902o6217
14113C8911l66836o0433L34417P5922n7266J50346J49332j64042k13785l1923
14103a45357M3191P8853o9162Q8488j57732l51685J12099J77847J01518M9156
$$ plain form
14093 -72784 -6354 81019 116074 147338 201314 -4926 -196080 -182002 -87918 -214482 -266357
14082 -266357 -116428 239809 119795 -118117 24393 306174 219058 92719 132125 231955
14072 231955 242277 65895 -33019 11664 -168905 -325941 -317994 -249468 -66181 18802 -172676
14061 -172676 -197203 -269488 -231648 -101514 -141811 34871 423709 383004 197372 39738
14051 39738 -205952 -345460 -432613 -403799 -401847 -489368 -125062 -34066 -274679 -478314 -494481
14040 -494481 -302404 -190068 -169808 -106821 11030 -105365 -293832 -131453 121513 -62474
14030 -62474 -6046 27975 -90361 89166 134629 113335 155993 175177 291036 453720 269920
14019 269920 97471 89973 66068 131513 213654 225764 93413 100890 19220 -77471 143269
$$ packed form
14093g2784O6430Q7373L5055L1264N3976k06240j91154J4078R4084j26564n1875
14082b66357J49929L56237j20014k37912J42510K81781q7116j26339L9406R9830
14072B31955J0322j76382r8914M4683j80569j57036P947O8526J83287Q4983j91478
14061a72676k4527p2285L7840J30134m0297J76682L88838m0705j85632j57634
14051C9738k45690j39508q7153K8814J952q7521L64306R0996k40613k03635j6167
14040d94481J92077J12336K0260O2987J17851j16395j88467J62379K52966j83987
14030f2474N6428L4021j18336J79527M5463k1294M2658J9184J15859J62684j83800
14019B69920j72449p498k3905O5445Q2141J2110j32351P477q1670r6691K20740
$$ plain form
14008 143269 240611 259575 308913 76631 -172901 -276226 -196940 -18247 -26146 -166975 -147148
13997 -147148 -192304 -264206 -211585 -120913 50291 176053 182047 82342 -35158 25203 155465
13986 155465 282907 168123 94072 60070 -5253 -38904 128653 154744 60421 141250 121209
13975 121209 7772 67336 -136183 -94067 -76836 -61525 -63895 19989 149398 128659 -22190
13964 -22190 -143557 -183121 3274 123859 31343 -157644 -137601 -49262 -260915 -332067 -131458
13953 -131458 -37801 41361 15196 9971 148713 263843 179695 40320 123002 201990 106830
13942 106830 -173967 -182613 -98041 -101575 -152125 30914 153414 104568 186058 9394 -327205
13931 -327205 -559072 -409308 -135784 -55665 -157223 44442 71337 -166462 -235320 -164754
$$ packed form
14008A43269R7342J8964M9338k32282k49532j03325P9286J78693p899j40829J9827
13997a47148m5156p1902N2621R0672J71204J25762N994r9705j17500O0361J30262
13986A55465J27442j14784p4051l4002o5323l3651J67557K6091r4323Q0829k0041
13975A21209j13437N9564k03519M2116J7231J5311k370Q3884J29409k0739j50849
13964b2190j21367l9564J86395J20585r2516j88987K0043Q8339k11653p1152K00609
13953a31458R3657P9162k6165n225J38742J15130q4148j39375Q2682P8988r5160
13942A06830k80797q646Q4572l534n0550J83039J22500m8846Q1490j76664l36599
13931c27205k31867J49764K73524Q0119j01558K01665K6895k37799o8858P0566
$$ plain form
13921 -164754 -222116 -209804 18937 317543 365242 223085 78502 45946 143786 -25812
13911 -25812 -7958 -79277 -112944 50277 156448 95230 -114782 -306574 -208758 -148016 -269222
13900 -269222 -286666 -401264 -374467 -495852 -496434 -285145 -186108 -131989 34768 178568 -60382
13889 -60382 -79399 223254 370638 387669 202567 55110 81755 219973 18255 -104263
13879 -104263 -175121 -139965 -67831 -97761 -206422 -345024 -420000 -447619 -295556 -239573 -252223
13868 -252223 -286994 -73692 -39392 -88760 -65880 -156524 -218280 -257711 -122792 150030 131674
13857 131674 -37597 -329058 -308387 -88260 -23488 40306 -149244 -239492 -114414 -52848
13847 -52848 -133359 -167603 -65674 -61162 -147106 -273478 -518705 -562907 -240288 -33515 43181
$$ packed form
13921a64754n7362J2312K28741K98606M7699j42157j44583l2556R7840j69598
13911b5812J7854p1319l3667J63221J06171o1218k10012j91792R7816O0742j21206
13900b69222j7444j14598K6797j21385n82K11289R9037N4119J66757J43800k38950
13889f0382j9017L02653J47384J7031j85102j47457K6645J38218k01718j22518
13879a04263p0858L5156P2134k9930j08661j38602p4976k7619J52063N5983j2650
13868b52223l4771K13302L4300m9368K2880r0644o1756l9431J34919K72822j8356
13857A31674j69271k91461K0671K20127O4772O3794j89550r0248J25078O1566
13847e2848q0511l4244J01929M512q5944j26372k45227m4202L22619K06773P6696
$$ plain form
13836 43181 -126629 -114683 33793 170970 274451 296870 161460 24210 -72042 -308098
13826 -308098 -226642 -88593 -149014 -181275 -172240 77218 358419 285244 66228 -8634 169264
13815 169264 360098 329887 354188 289667 243216 257303 186932 31338 -9361 30390 97064
13804 97064 304119 349157 338641 278856 334346 243089 194045 114125 -100788 -229855 -283646
13793 -283646 -355203 -292112 -324717 -188344 106448 224700 131421 62312 17673 -107834 -298013
13782 -298013 -139968 98048 235218 368253 382443 203937 78296 -76846 -237035 -158997
13772 -158997 -141562 -52938 192830 38178 78073 236067 42535 153441 127091 59740
13762 59740 14113 100025 -47419 -77465 -127863 -69021 -12357 -67688 -66775 -39613 -60272 -29972
$$ packed form
13836D3181j69810J1946J48476J37177J03481K2419j35410j37250r6252k36056
13826c08098Q1456J38049o0421l2261R035K49458K81201p3175k19016p4862J77898
13815A69264J90834l0211K4301o4521m6451J4087p0371j55594m0699L9751O6674
13804I7064K07055M5038j0516n9785N5490r1257m9044p9920k14913j29067n3791
13793b83646p1557O3091l2605J36373K94792J18252r3279o9109m4639j25507j90179
13782b98013J58045K38016J37170J33035J4190j78506j25641j55142j60189P8038
13772a58997J7435Q8624K45768j54652L9895J57994j93532J10906k6350o7351
13762E9740m5627Q5912j47444l0046n0398N8842N6664n5331R13K7162k0659L0300
$$ plain form
13750 -29972 118251 108375 177315 246116 13148 87458 75734 33688 20070 268291 153931
13739 153931 51402 132313 83932 -246760 -408828 -249750 -87096 89102 219759 389719
13729 389719 193580 83055 79888 -149125 -54951 130145 155941 155728 167141 355476 383780
13718 383780 254403 309183 404476 244288 178777 185438 79484 119874 105138 175841 186448
13707 186448 309802 409112 443886 472819 229801 229800 106661 36816 27486 150111 196450 199423
13695 199423 116185 115720 -13199 -18019 -49143 29527 52265 211755 235594 139738 45141 45075
13683 45075 97729 176783 254832 104543 84498 236455 126333 -84398 -300598 -238498 -214542
13672 -214542 -128228 99165 -16453 -167300 125001 140585 -100794 -208590 -40681 -70855
$$ packed form
13750b9972J48223r876O8940O8801k32968P4310j1724m2046j3618K48221j14360
13739A53931j02529Q0911m8381l30692j62068J59078J62654J76198J30657J69960
13729C89719j96139j10525l167k29013R4174J85096K5796k13J1413J88335K8304
13718C83780j29377N4780R5293j60188o5511O661j05954M0390j4736P0703J0607
13707A86448J23354R9310L4774K8933k43018jj23139o9845r330J22625M6339K973
13695A99423q3238m65j28919m820l1124P8670K2738J59490K3839r5856r4597o6
13683D5075N2654P9054P8049j50289k0045J51957j10122k10731k16200O2100K3956
13672b14542Q6314K27393j15618j50847K92301J5584k41379j07796J67909l0174
$$ plain form
13662 -70855 130427 32616 -257025 -352808 -130971 -89918 -131475 -6534 -33206 95778 89108
13651 89108 -107736 -167177 -266723 -116490 -227506 -280922 -211858 36714 -124731 -262790
13641 -262790 -136232 -163917 -87838 -161876 -108032 9016 166304 363555 244613 289041
13631 289041 37994 115190 9733 -113562 -211644 -167204 -322431 -109930 228 -120539
13621 -120539 32501 73862 5694 63544 158229 201962 49429 -211644 -509378 -421732 -332925
13610 -332925 -364311 -381014 -305158 -128978 524 125151 130084 208801 208888 40679 131858
13599 131858 223667 114039 2971 10509 1024 82923 146699 -111898 -63095 121051 13598
13588 13598 -2984 -33120 22413 112221 -6532 -38175 45104 90666 -23589 -129221 -143152
$$ packed form
13662g0855K01282r7811k89641r5783K21837M1053m1557J24941k6672J28984o670
13651H9108j96844n9441r9546J50233j11016n3416O9064K48572j61445j38059
13641b62790J26558k7685P6079p4038N3844J17048J57288J97251j18942M4428
13631B89041k51047P7196j05457j23295r8082M4440j55227K12501J10158j20767
13621a20539J53040M1361o8168N7850R4685M3733j52533k61073k97734Q7646Q8807
13610c32925l1386j6703P5856J76180J29502J24627M933P8717Q7j68209R1179
13599A31858R1809j09628j11068P538r485Q1899O3776k58597M8803J84146j07453
13588A3598j6582l0136N5533Q9808j18753l1643Q3279M5562j14255j05632j3931
$$ plain form
13577 -143152 -14098 34177 -99156 -213108 -262095 -44933 88217 130026 132277 96673 140071
13566 140071 -10958 -34745 32525 -37485 -73071 37951 62855 145747 -50766 -346103 -320081
13555 -320081 -114087 -54404 -77394 -59499 -138153 -99575 -137212 -245673 -144939 -27061 -115220
13544 -115220 -37793 84154 82995 1694 -101823 -78187 48929 72428 -46462 -262697 -332223
13533 -332223 -336197 106537 431109 269952 -16752 -181115 -117188 26478 130046 226924
13523 226924 57898 -64420 -278535 -231650 -233545 -213431 -85589 -53755 -111014 -350340 -447590
13512 -447590 -306528 -494615 -512428 -275199 -121013 13057 8822 -151667 -245327 -158667
13502 -158667 -84675 -216997 -335388 -196662 -240446 -8186 -45018 -91904 -265791 -492035
$$ packed form
13577a43152J29054M8275j33333j13952m8987K17162J33150M1809K251l5604M3398
13566A40071j51029k3787O7270p0010l5586J11022K4904Q2892j96513k95337K6022
13555c20081K05994N9683k2990J7895p8654L8578l7637j08461J00734J17878q8159
13544a15220P7427J21947j159q1301j03517K3636J27116K3499j18890k16235o9526
13533c32223l974M42734L24572j61157k86704j64363O3927J43666J03568R6878
13523B26924j69026j22318k14115M6885j895K0114J27842L1834n7259k39326r7250
13512d47590J41062j88087j7813K37229J54186J34070m235j60489r3660Q6660
13502a58667P3992j32322j18391J38726m3784K32260l6832m6886j73887k26244
$$ plain form
13492 -492035 -524398 -218474 -49121 130722 251989 138065 22652 -99910 -169210 -133633
13482 -133633 -29704 145484 272117 263713 251016 248917 180623 87656 152576 309214 421019
13471 421019 185460 70556 -6361 -68761 -140421 35625 116083 46611 -151927 -153292 -123398
13460 -123398 78264 293816 411518 450668 216690 51134 -970 -160295 -173071 5555
13450 5555 180780 20229 -160954 -211929 30535 198899 310960 243539 236854 166583 330696
13439 330696 -10791 -148298 -80627 -193955 -210457 -288583 -209246 -116181 8149 218921
13429 218921 343688 169672 158394 -18980 -260075 -246869 -201466 -211959 -316960 -145689
13419 -145689 -104919 -71463 110603 181365 135093 90071 108087 19374 158056 126157 13525
$$ packed form
13492d92035l2363L05924J69353J79843J21267j13924j15413j22562o9300L5577
13482a33633J03929J75188J26633q404j2697k099o8294r2967O4920J56638J11805
13471D21019k35559j14904p6917o2400p1660J76046Q0458o9472j98538j365K9894
13460a23398K01662K15552J17702L9150k33978j65556n2104j59325j2776J78626
13450E555J75225j60551j81183n0975K42464J68364J12061o7421o685p0271J64113
13439C30696l41487j37507O7671j13328j6502p8126P9337R3065J24330K10772
13429B18921J24767j74016j1278j77374k41095J3206M5403j0493j05001J71271
13419a45689M0770L3456J82066P0762m6272m5022J8016q8713J38682l1899j12632
$$ plain form
13408 13525 -187658 -205169 -297857 -241882 -95733 -47889 115473 310599 166908 27507
13398 27507 162606 22952 -87045 -187569 254 77357 -116565 -325942 -277778 -102294
13388 -102294 -73516 36712 56968 -218832 -277705 -60800 197561 365973 352882 75941
13378 75941 216611 380954 487380 316007 144313 -149415 -251856 -180267 103193 210230
13368 210230 145597 157802 245845 278943 449471 455002 265696 146372 159778 211379 163915
13357 163915 43914 -24984 2870 -5606 1929 157582 6551 -35226 -225521 -250450 -200114
13346 -200114 -100854 -33003 106958 52671 -164649 -115006 44279 118635 219178 221059 58194
13335 58194 -13452 -12446 -285889 -372456 -400415 -407675 -191513 -116666 16859 -10438 -110266
$$ packed form
13408A3525k01183j7511r2688N5975J46149M7844J63362J95126j43691j39401
13398B7507J35099j39654j09997j00524J87823P7103j93922k09377M8164J75484
13388a02294K8778J10228K0256k75800n8873K16905K58361J68412j3091k76941
13378G5941J40670J64343J06426j71373j71694k93728j02441P1589K83460J07037
13368B10230o4633J2205Q8043L3098J70528N531j89306j19324J3406N1601m7464
13357A63915j20001o8898K7854q476P535J55653j51031m1777j90295k4929N0336
13346b00114R9260O7851J39961n4287k17320M9643J59285P4356J00543J881j62865
13335E8194p1646J006k73443q6567k7959p260K16162P4847J33525k7297r9828
$$ plain form
13324 -110266 -77398 -28892 -73841 -54662 31211 76689 14271 28372 -5872 -98874 -38704
13313 -38704 76083 17558 1104 147368 94347 78306 -65201 -95599 119197 68453 73399
13302 73399 -109483 -256304 -317470 -311774 -384208 -390378 -520370 -617001 -479751 -272177 -457412
13291 -457412 -479077 -286124 -101223 -197240 -88023 128692 167544 136757 149583 -43473
13281 -43473 -78877 -154469 -193487 -39553 -6782 -153148 -252953 -192651 106309 52596 40267
13270 40267 165805 149825 98523 332009 349983 385573 411956 380425 28394 -28537 -71098
13259 -71098 -136523 -128883 -258411 -232614 -23221 385085 285580 90205 53809 -1113 86927
13248 86927 192576 8918 26996 -186553 -233199 -112431 -129161 46493 89065 34111 95130
$$ packed form
13324a10266L2868M8506m4949J9179Q5873M5478o2418J4101l4244r3002O0170
13313c8704J14787n8525j6454J46264n3021j6041j43507l0398K14796n0744M946
13302G3399j82882j46821o1166N696p2434o170j29992r6631J37250K07574j85235
13291d57412k1665J92953J84901r6017J09217K16715L8852l0787J2826j93056
13281d3473l5404p5592l9018J53934L2771j46366r9805O0302K98960n3713j2329
13270D0267J25538j5980n1302K33486J7974L5590K6383l1531l52031n6931m2561
13259g1098o5425P640j29528K5797K09393M08306r9505j95375l6396n4922Q8040
13248H6927J05649j83658J8078k13549m6646J20768j6730J75654M2572n4954O1019
$$ plain form
13237 95130 35536 -242939 -209404 -39003 2036 -19990 66565 -126672 -404880 -431619 -273782
13226 -273782 -207564 -294693 -311637 -323077 -201588 -68687 -10770 -127159 -60151 -51718 -188122
13215 -188122 -52691 -37891 86573 272570 292759 158732 178440 136160 -13221 -223274
13205 -223274 -353959 -258895 -20069 -10917 -282499 -132649 58130 103489 -180952 -325147
13195 -325147 -154584 131320 383625 532542 606455 429499 134770 220658 231186 214555
13185 214555 339927 291254 346604 447362 365451 159491 192872 516970 526330 184823 -179930
13174 -179930 -162794 -167265 -296316 -265163 -146430 -149651 -247576 -217303 -123531 -14660 -150060
13163 -150060 -199480 -106252 63752 80065 -130829 -315941 -223373 2061 45102 -155305
$$ packed form
13237I5130n9594k78475L3535J70401M1039k2026Q6555j93237k78208k6739J57837
13226b73782O6218q7129j6944j1440J21489J32901N7917j16389O7008Q433j36404
13215a88122J35431J4800J24464J85997K0189j34027J9708m2280j49381k10053
13205b23274j30685R5064K38826R152k71582J49850J90779M5359k84441j44195
13195c25147J70563K85904K52305J48917P3913j76956k94729Q5888J0528j6631
13185B14555J25372m8673N5350J00758q1911k05960L3381L24098R360l41507l64753
13174a79930J7136m471j29051L1153J18733l221r7925L0273R3772J08871j35400
13163a50060m9420R3228J70004J6313k10894j85112R2568K25434M3041k00407
$$ plain form
13153 -155305 -278328 -193392 206943 500064 407264 243730 24348 110376 198448 143074
13143 143074 178234 -15737 -129993 -91475 7868 126997 144980 89002 12219 36610 171579
13132 171579 30388 -107222 -263021 -304138 -235749 -315827 -275505 -303223 -438054 -248594
13122 -248594 -94580 -148940 -225805 -133509 26073 -136419 -327216 -238274 -204559 -180269 -9944
13111 -9944 150753 133896 130450 251085 90261 -123498 -202417 -55961 -95211 40083 322535
13100 322535 421275 190060 -63275 32451 90027 66244 185291 208581 280756 458990 339693
13089 339693 -55239 -151990 -215197 -363750 -130185 43471 30986 94009 424751 550997
13079 550997 413579 145350 114069 172330 209576 192298 154746 144225 217138 391944 319709
$$ packed form
13153a55305j23023Q4936M00335K93121r2800j63534k19382Q6028Q8072n5374
13143A43074L5160j93971j14256L8518R9343J19129J7983n5978p6783K4391J34969
13132A71579j41191j37610j55799m1117O8389q0078M0322k7718j34831J89460
13122b48594J54014n4360p6865R2296J59582j62492j90797Q8942L3715K4290J70325
13111i944J60697j6857l446J20635j60824k13759p8919J46456l9250J35294K82452
13100C22535R8740k31215k53335R5726N7576k3783J19047K3290P2175J78234j19297
13089C39693l94932r6751o3207j48553K33565J73656j2485O3023L30742J26246
13079E50997j37418k68229l1281N8261L7246j7278l7552j0521P2913J74806p2235
$$ plain form
13068 319709 38069 -162138 -215766 -429614 -491181 -296172 43129 160986 94705 -14070
13058 -14070 239677 276981 93160 -15352 -84179 128808 109964 -13354 -126014 -190068
13048 -190068 -313839 -417059 -269899 -157071 -212787 -46283 -208790 -197475 51960 34191
13038 34191 -70776 -35286 210 -185779 -104552 85935 261905 171735 58262 175647
13028 175647 -10298 -192547 105819 24915 -77964 -202424 -342851 -369045 -188339 -142677
13018 -142677 -101569 -28029 -183108 -142116 -10638 31455 -49162 20544 -127482 -392204 -365384
13007 -365384 -403253 -506737 -591458 -565561 -396853 -171865 1008 -147817 -97125 -5233
12997 -5233 85121 396673 644774 561771 241515 246872 188631 21819 236023 303334 287399
$$ packed form
13068C19709k81640k00207n3628k13848o1567J95009L39301J17857o6281j08775
13058a4070K53747L7304j83821j08512o8827K12987j8844j23318j12660o4054
13048a90068j23771j03220J47160J12828n5716J66504j62507J1315K49435j7769
13038C4191j04967L5490L5496j85989Q1227J90487J75970r0170j13473J17385
13028A75647j85945j82249K98366q0904j02879j24460j40427k6194J80706M5662
13018a42677M1108P3540j55079M0992J31478M2093q0617O9706j48026k64722K6820
13007c65384l7869j03484q4721K5897J68708K24988J72873j48825N0692R1892
12997e233R0354L11552K48101q3003l20256N357n8241j66812K14204O7311j5935
$$ plain form
12986 287399 233440 289905 168702 21648 147124 234305 148009 179027 17216 -189443
12976 -189443 -131888 -295359 -402283 -412054 -358108 -319281 -239436 -143314 -137070 -104432 -82458
12965 -82458 16979 80353 231438 175499 57166 -197550 -140461 25094 70980 72343 109972
12954 109972 -10164 -43969 196121 153419 107451 70315 142562 -95034 -136068 -142990 -130798
12943 -130798 -28616 -4108 -55478 261354 274006 149218 7676 -61788 -139790 -302135
12933 -302135 -239030 -72040 31376 100382 385246 502024 444037 214331 201042 353750
12923 353750 347662 343814 319498 134965 278282 404382 288977 98630 -141846 -238113 -245659
12912 -245659 -37062 19957 131968 77630 -16699 241018 169486 150862 245417 323794 252042
$$ packed form
12986B87399n3959N6465j21203j47054J25476Q7181q6296L1018j61811k06659
12976a89443N7555j63471j06924r771N3946L8827P9845R6122O244L2638K1974
12965h2458R9437O3374J51085n5939j18333k54716N7089J65555M5886J363L7629
12954A09972j20136l3805K40090m2702m5968l7136P2247k37596m1034o922J2192
12943a30798J02182K4508n1370L16832J2652j24788j41542o9464p8002j62345
12933c02135O3105J66990J03416O9006K84864J16778n7987k29706j3289J52708
12923C53750o088l848k4316j84533J43317J26100j15405j90347k40476r6267p546
12912b45659K08597N7019J12011n4338r4329K57717p1532j8624R4555P8377p1752
$$ [...]
##END NTUPLES=NMR SPECTRUM
##END=
