##TITLE=Analysis number 318702
Compound Code km 08058
Book Reference b
Project Code adrs
Chemist Name fudan
##JCAMPDX= 6.0         $$ Bruker NMR JCAMP-DX V2.0
##DATA TYPE= NMR SPECTRUM
##DATA CLASS= NTUPLES
##ORIGIN= Bruker BioSpin GmbH
##OWNER= nmr
$$ XWIN-NMR		Version 3.5
$$ Mon Apr 10 15:49:31 2006 GMT Daylight Time (UT+1h)  MAYBRIDGE\nmr@NMR_250MHZ
##.OBSERVE FREQUENCY= 250.131544655141
##.OBSERVE NUCLEUS= ^1H
##.ACQUISITION MODE= SIMULTANEOUS (DQD)
##.ACQUISITION SCHEME= undefined
##.AVERAGES= 16
##.DIGITISER RES= 18
##SPECTROMETER/DATA SYSTEM= dpx250
##.PULSE SEQUENCE= zg30
##.SOLVENT NAME= CDCl3
##.SHIFT REFERENCE= (INTERNAL, CDCl3, 0, 16.522)
##AUDIT TRAIL= $$ (NUMBER, WHEN, WHO, WHERE, WHAT)
$$ ##TITLE= Audit trail, XWIN-NMR		Version 3.5
$$ ##JCAMPDX= 5.01
$$ ##ORIGIN= Bruker BioSpin GmbH
$$ ##OWNER= nmr
$$ C:\u/data/dgb/nmr/ADRS/2470/pdata/1/auditp.txt
$$ ##AUDIT TRAIL=  $$ (NUMBER, WHEN, WHO, WHERE, WHAT)
(   1,<2006-04-10 15:48:57.36 +100>,<MAYBRIDGE\nmr>,<NMR_250MHZ>,
      <created by zg, POWCHK disabled, PULCHK disabled
       configuration hash MD5:
       84 BC 41 DB A1 6E 1D 46 DA 25 12 A5 C1 ED C5 3A
       data hash MD5: 64K
       42 97 DB 33 80 39 2B F6 EA 8F FD 90 BF 55 3A 64>)
(   2,<2006-04-10 15:49:15.89 +100>,<MAYBRIDGE\nmr>,<NMR_250MHZ>,
      <Start of raw data processing
       ef LB = 0.3 FT_mod = 6 PKNL = 1 SI = 32K 
       data hash MD5: 32K
       50 27 57 57 33 B6 3E 63 ED AC CB 27 D1 7D B1 D4>)
(   3,<2006-04-10 15:49:19.08 +100>,<MAYBRIDGE\nmr>,<NMR_250MHZ>,
      <apk 
       data hash MD5: 32K
       67 74 60 97 65 CB 39 0C DA 70 C4 1D 3E 8E 59 FE>)
(   4,<2006-04-10 15:49:19.86 +100>,<MAYBRIDGE\nmr>,<NMR_250MHZ>,
      <abs ABSG = 5 
       data hash MD5: 32K
       7B 92 AF 15 CB AE 24 36 B3 1B 62 88 46 82 66 29>)
$$ ##END=
$$ 
$$ hash MD5
$$ E0 8B 87 70 37 68 63 36 36 39 7F A8 6E 04 95 DB
##$RELAX= 
##$RELAX= 
##$RELAX= 
##$RELAX= 
##$RELAX= 
##$RELAX= 
##$RELAX= 
$$ Bruker specific parameters
$$ --------------------------
##$DU= <C:\u>
##$EXPNO= 2470
##$NAME= <ADRS>
##$PROCNO= 1
##$TYPE= <nmr>
##$USER= <dgb>
##$AMP= (0..31)
100 100 100 100 100 100 100 100 100 100 100 100 100 100 100 100 100 100 
100 100 100 100 100 100 100 100 100 100 100 100 100 100 
##$AQSEQ= 0
##$AQ_mod= 3
##$AUNM= <au_zg>
##$AUTOPOS= <59 >
##$BF1= 250.13
##$BF2= 250.13
##$BF3= 250.13
##$BF4= 250.13
##$BF5= 500.13
##$BF6= 500.13
##$BF7= 500.13
##$BF8= 500.13
##$BYTORDA= 1
##$CFDGTYP= 0
##$CFRGTYP= 5
##$CHEMSTR= <none>
##$CNST= (0..31)
1 1 145 1 1 1 1 1 1 1 1 1 1 1 1 1 1 1 1 1 1 1 1 1 1 1 1 1 1 1 1 1 
##$CPDPRG= <>
##$CPDPRG1= <>
##$CPDPRG2= <>
##$CPDPRG3= <>
##$CPDPRG4= <mlev>
##$CPDPRG5= <mlev>
##$CPDPRG6= <mlev>
##$CPDPRG7= <mlev>
##$CPDPRG8= <mlev>
##$CPDPRGB= <>
##$CPDPRGT= <>
##$D= (0..31)
0 1 0 0 0 0 0 0 0 0.06 0 0 0 0 0 0 0.0002 0 0 0 0 0 0 0 0 0 0 0 0 0 0 
0 
##$DATE= 1144680536
##$DBL= (0..7)
120 120 120 120 120 120 120 120 
##$DBP= (0..7)
150 150 150 150 150 150 150 150 
##$DBP07= 0
##$DBPNAM0= <>
##$DBPNAM1= <>
$$ [...]
##$SUBNAM7= <"">
##$SUBNAM8= <"">
##$SUBNAM9= <"">
##$SW= 20.6930455092707
##$SWIBOX= (0..15)
0 0 3 0 0 0 0 0 0 0 0 0 0 0 0 0 
##$SW_h= 5175.983436853
##$TD= 65536
##$TD0= 1
##$TE= 295.16
##$TE2= 300
##$TE3= 300
##$TEG= 300
##$TL= (0..7)
0 120 120 120 120 120 120 120 
##$TP= (0..7)
150 150 150 150 150 150 150 150 
##$TP07= 0
##$TPNAME0= <>
##$TPNAME1= <>
##$TPNAME2= <>
##$TPNAME3= <>
##$TPNAME4= <>
##$TPNAME5= <>
##$TPNAME6= <>
##$TPNAME7= <>
##$TPOAL= (0..7)
0.5 0.5 0.5 0.5 0.5 0.5 0.5 0.5 
##$TPOFFS= (0..7)
0 0 0 0 0 0 0 0 
##$TUNHIN= 0
##$TUNHOUT= 0
##$TUNXOUT= 0
##$USERA1= <user>
##$USERA2= <user>
##$USERA3= <user>
##$USERA4= <user>
##$USERA5= <user>
##$V9= 5
##$VALIST= <valist>
##$VCLIST= <CCCCCCCCCCCCCCC>
##$VD= 0
##$VDLIST= <DDDDDDDDDDDDDDD>
##$VPLIST= <PPPPPPPPPPPPPPP>
##$VTLIST= <TTTTTTTTTTTTTTT>
##$WBST= 1024
##$WBSW= 4
##$XGAIN= (0..3)
0 0 0 0 
##$XL= 0
##$YL= 0
##$YMAX_a= 425054
##$YMIN_a= -426540
##$ZGOPTNS= <>
##$ZL1= 120
##$ZL2= 120
##$ZL3= 120
##$ZL4= 120
##$ABSF1= 16.522
##$ABSF2= -4.171173
##$ABSG= 5
##$ABSL= 3
##$ALPHA= 0
##$AQORDER= 0
##$ASSFAC= 0
##$ASSFACI= 0
##$ASSFACX= 0
##$ASSWID= 0
##$AUNMP= <proc_1d>
##$AZFE= 0.1
##$AZFW= 0.1
##$BCFW= 0
##$BC_mod= 0
##$BYTORDP= 0
##$COROFFS= 0
##$CY= 12.5
##$DATMOD= 1
##$DC= 0
##$DFILT= <>
##$DTYPP= 0
##$F1P= 14.0000005364418
##$F2P= -0.99999901652339
##$FCOR= 0.5
##$FTSIZE= 32768
##$FT_mod= 6
##$GAMMA= 0
##$GB= 0
##$INTBC= 1
##$INTSCL= 1
##$ISEN= 128
##$LB= 0.3
##$LEV0= 0
##$LPBIN= 0
##$MAXI= 10000
##$MC2= 0
##$MEAN= 0
##$ME_mod= 0
##$MI= 0
##$NCOEF= 0
##$NC_proc= -2
##$NLEV= 6
##$NOISF1= 0
##$NOISF2= 0
##$NSP= 0
##$NTH_PI= 0
##$NZP= 0
##$OFFSET= 16.522
##$PC= 1
##$PHC0= 175.1898
##$PHC1= 5.083078
##$PH_mod= 1
##$PKNL= yes
##$PPARMOD= 0
##$PSCAL= 4
##$PSIGN= 0
##$REVERSE= no
##$SF= 250.13
##$SI= 32768
##$SIGF1= 0
##$SIGF2= 0
##$SINO= 400
##$SIOLD= 32768
##$SREGLST= <1H.CDCl3>
##$SSB= 0
##$STSI= 32768
##$STSR= 0
##$SW_p= 5175.98343685301
##$SYMM= 0
##$S_DEV= 0
##$TDeff= 65536
##$TDoff= 0
##$TI= <Analysis number 999999
Compound Code 99
Book Reference 9
Project Code 9>
##$TILT= no
##$TM1= 0
##$TM2= 0
##$TOPLEV= 0
##$USERP1= <user>
##$USERP2= <user>
##$USERP3= <user>
##$USERP4= <user>
##$USERP5= <user>
##$WDW= 1
##$XDIM= 32768
##$YMAX_p= 284264519
##$YMIN_p= -78589
$$ End of Bruker specific parameters
$$ ---------------------------------
##NTUPLES= NMR SPECTRUM
##VAR_NAME=  FREQUENCY,     SPECTRUM/REAL,   SPECTRUM/IMAG
##SYMBOL=    X,             R,               I
##VAR_TYPE=  INDEPENDENT,   DEPENDENT,       DEPENDENT
##VAR_FORM=  AFFN,          ASDF,            ASDF
##VAR_DIM=   32768,         32768,           32768
##UNITS=     HZ,            ARBITRARY UNITS, ARBITRARY UNITS
##FACTOR=    0.157963299565203, 1,           1
##FIRST=     4132.6476996994, 0,             0
##LAST=      -1043.33573715361, 0,           0
##MIN=       -1043.33573715361, -78589,      0
##MAX=       4132.6476996994, 284264519,     0
$$ Real data points
##PAGE= N=1
##DATA TABLE= (X++(R..R)), XYDATA
$$ [...]
$$ plain form
16919 46749 13894 22164 25241 24407 17359 -6648 -29737 -13822 1278 1243 -13088 -172 34596
16906 34596 48055 35854 7345 8604 16065 27801 36078 -1201 -14206 -18396 -20355 -13950 -308
16893 -308 4613 7761 4215 -7930 -6839 3635 10203 -6569 -32354 -44905 -29597 -14727 -26973
16880 -26973 -21380 3749 4867 5783 14901 9469 2696 -5408 -8836 6580 1333 3776 8214 -3261
16866 -3261 -6816 -3925 -15320 -32272 -29645 -16899 -16643 -20825 -20158 -36933 -40661 -23272 -16306 -1306
16852 -1306 10637 6147 9828 5920 11567 -10697 -16562 -32499 -29571 -8929 13428 18528 204
16839 204 4402 16992 10954 -17480 -24613 -15494 12561 40443 34674 43743 23513 16394 -4448
16826 -4448 -36018 -32963 -35530 -43174 -54000 -42638 -22279 -18820 -1494 -5508 -18227 -22926 -9142
$$ packed form
16919D6749l2855Q270L077q34p048k4007k3089J5915J5100l5j4331J2916L4768
16906C4596J3459j2201k8509J259P461J1736Q277l7279j3005m190j959O405J3642
16893c08M921L148l546j2145J091J0474O568j6772k5785j2551J5308J4870j2246
16880b6973N593K5129J118R16R118n432o773q104l428J5416n247K443M438j1475
16866c261l555K891j1395j6952K627J2746K56m182O67j6775l728J7389O966J5000
16852a306J1943m490L681l908N647k2264n865j5937K928K0642K2357N100j8324
16839B04M198J2590o038k8434p133R119K8055K7882n769R069k0230p119k0842
16826d448l1570L055k567p644j0826J1362K0359L459J7326m014j2719m699J3784
$$ plain form
16813 -9142 15022 14882 14491 13901 14159 16203 28360 25663 8564 -16061 -23788 -19284 -37713 -56556
16799 -56556 -37084 5840 48061 37562 41440 19611 -14872 -6577 -4958 -25530 -19150 -7763
16787 -7763 -9103 -5831 556 687 16357 7784 -999 -15988 -12884 4154 -5142 19330 19661 962
16773 962 7064 -1424 2272 16153 19240 6920 2611 -3352 -19666 -35741 -33066 -25879 -17816 1613
16759 1613 -3971 -2223 9820 -8675 -15477 -19867 -13062 -10056 20021 33476 25266 12139 27914
16746 27914 34214 29965 22331 10501 -12982 -23150 -24787 -19222 -39094 -33460 -31729 -6947 11427
16733 11427 16837 2119 -15082 -1074 17448 36950 22122 -3733 -18444 15374 25391 -3136
16721 -3136 -6190 -1257 2425 -25943 -44132 -23581 -27091 -51039 -48785 -8727 -12673 -28789 -25986
$$ packed form
16813i142K4164j40l91n90K58K044J2157k697j7099k4625p727M504j8429j8843
16799e6556J9472M2924M2221j0499L878k1829l4483Q295J619k0572O380J1387
16787g763j340L272O387J31J5670q573q783j4989L104J7038r296K4472L31j8699
16773I62O102q488L696J3881L087j2320m309n963j6314j6075K675P187Q063J9429
16759A613n584J748J2043j8495o802m390O805L006L0077J3455q210j3127J5775
16746B7914O300m249p634j1830k3483j0168j637N565j9872N634J731K4782J8374
16733A1427N410j4718j7201J4008J8522J9502j4828k5855j4711L3818J0017k8527
16721c136l054M933L682k8368j8189K0551l510k3948K254M0058l946j6116K803
$$ plain form
16708 -25986 -11490 -16102 -31759 -18070 -29760 -47788 -34969 846 16466 12153 18309 9588
16696 9588 -2377 2156 1242 -11859 -2338 16616 8685 -3608 -875 19860 37905 36670 13464
16683 13464 2675 12350 6819 -5584 5503 -292 -2671 -3986 -9804 -17191 -19317 8993 2518
16670 2518 -14571 -24153 -24884 -18179 -22292 -12089 -6428 -25064 -11509 -15044 -12551 -7033 -1209 13251
16656 13251 418 10255 -1129 -19754 -12324 -4942 -27456 -33156 -41573 -32359 -37229 -56010 -53662
16643 -53662 -36822 -29866 -33911 -25591 -5987 13813 29273 26832 27882 6289 -13019 -25906 -29066
16630 -29066 -45624 -35349 -26528 -25579 -35784 -41994 -39506 -31146 -31544 -39181 -25532 12381 21131 5173
16616 5173 -8634 -6286 16637 35578 36829 16360 -23644 -42703 -19748 -14447 -2004 -22044
$$ packed form
16708b5986J4496m612j5657J3689j1690j8028J2819L5815J5620m313O156q721
16696I588j1965M533r14j3101R521J8954p931j2293K733K0735J8045j235k3206
16683A3464j0789R675n531j2403J1087n795k379j315n818p387k126K8310o475
16670B518j7089r582p31O705m113J0203N661j8636J3555l535K493N518N824J4460
16656A3251j2833R837j1384j8625P430P382k2514n700q417R214m870j8781K348
16643e3662J6840O956m045Q320J9604J9800J5460k441J050k1593j9308j2887l160
16630b9066j6558J0275Q821R49j0205o210K488Q360l98p637J3649L7913Q750j5958
16616E173j3807K348K2923J8941J251k0469m0004j9059K2955N301J2443k0040
$$ plain form
16604 -22044 -18332 5907 18285 33524 30146 10135 -15576 -11696 -13182 -5594 -9178 -39968 -33614
16591 -33614 -46076 -31058 4246 35273 35221 5248 8864 3330 -19941 -16450 17784 33631 35898
16578 35898 20566 1690 -11780 5653 26611 31303 32269 20243 10290 -2972 11605 20667 23022
16565 23022 14701 9512 7650 29946 32796 31368 37925 29093 21371 3282 6433 5219 9807 21171
16551 21171 20869 22916 15635 3353 -9259 -37655 -38350 -18418 -6061 -18894 -17694 -9383 6708
16538 6708 5235 1668 5032 -7926 -14849 -5559 -22822 -26808 -15769 -20454 -25632 -8135 -13662 -16609
16524 -16609 -22989 -31642 -18034 12931 -6926 -26871 -23978 -27698 -20823 -22419 -428 17982 6639
16511 6639 4038 -10672 1739 14233 16644 12068 19387 25023 23568 3892 -20670 -16629 -5451
$$ packed form
16604b2044L712K4239J2378J5239l378k0011k5711L880j486P588l584l0790O354
16591c3614j2462J5018L5304L1027n2k9973L616n534k3271L491L4234J5847K267
16578C5898j5332j8876j3470J7433K0958M692R66j2026r953j3262J4577R062K355
16565B3022q321n189j862K2296K850j428O557q832p722j8089L151j214M588J1364
16551B1171l02K047p281j2282j2612k8396o95J9932J2357j2833J200Q311J6091
16538F708j473l567L364j2958o923R290j7263l986J1039m685n178J7497n527k947
16524a6609o380q653J3608L0965j9857j9945K893l720O875j596K1991J8410j1343
16511F639k601j4710J2411J2494K411m576P319N636j455j9676k4562M041J1178
$$ plain form
16498 -5451 14675 19536 18816 11603 12805 22600 34177 18547 -11723 -29445 -25277 -7503 -7084 -5385
16484 -5385 21512 6159 -13178 -7027 2159 4182 18729 23661 13506 -7348 -14308 -16765 -21617
16471 -21617 -15034 -1919 -11706 -14807 8472 6211 7599 33300 17180 -792 -371 874 -10549
16458 -10549 -5128 -8555 3736 -15321 -24357 -28559 -14759 -9537 -25898 -44939 -31569 -29354 -30858
16445 -30858 -27559 -17859 -2057 -12225 -9898 -5697 -8488 -35926 -50670 -42128 -23843 8582 4087
16432 4087 4354 5753 -8012 -6913 5201 13566 15308 311 -17725 -33077 -20437 -13997 3428
16419 3428 8677 -7547 -24107 -27725 -15066 -5959 -2725 6949 2260 -5836 2614 4245 8139 12959
16405 12959 6624 6654 -15917 -42700 -25850 -20350 -25629 -15990 -23946 -14317 -5185 -425 19851 2108
$$ packed form
16498e451K0126M861p20p213J202R795J1577j5630l0270j7722M168J7774M19J699
16484e385K6897j5353j9337O151R186K023J4547M932j0155k0854o960k457m852
16471b1617O583J3115r787l101K3279k261J388K5701j6120j7972M21J245j1423
16458a0549N421l427J2291j9057r036m202J3800N222j6361j9041J3370K215j504
16445c0858L299R700J5802j0168K327M201k791k7438j4744Q542J8285L2425m495
16432D087K67J399j3765J099J2114Q365J742j4997j8036j5352J2640O440J7425
16419C428N249j6224j6560l618J2659R107L234R674m689q096Q450J631L894M820
16405A2959o335L0k2571k6783J6850N500n279R639p956R629R132M760K0276j7743
$$ plain form
16391 2108 -3611 -21147 -10521 -11651 -12347 -11054 -10582 -26712 -47005 -69715 -42811 -27320 -10092
16378 -10092 -3012 24389 6190 -9359 95 14874 11179 10131 -3791 -10911 -180 13789 24158
16365 24158 103 -30497 -17844 -2738 -1741 -7930 -4488 -13864 -16190 -7131 13938 17123 8911
16352 8911 18112 43530 40480 32687 19525 24512 23435 26411 -13464 -32511 -20999 -11827 -4469
16339 -4469 -31253 -42014 -28147 -10571 9549 14444 -5127 -29847 -21674 -1755 1792 13812
16327 13812 32282 37567 24790 11217 2752 1887 11477 23767 26640 24215 14363 6312 -28451
16314 -28451 -38924 -27844 -1872 7134 9462 30733 23807 -13072 -19323 -30244 -19197 -8024
16302 -8024 -19242 -12493 -13287 -16410 -15182 -19298 -18149 -9003 -30059 -37656 -27396 -23645 -8521 -15094
$$ packed form
16391B108n719j7536J0626j130o96J293M72j6130k0293k2710K6904J5491J7228
16378a0092P080K7401j8199j5549R454J4779l695j048j3922p120J0731J3969J0369
16365B4158k4055l0600J2653J5106R97o189L442r376k326R059K1069L185q212
16352H911R201K5418l050p793j3162M987j077K976l9875j9047J1512R172P358
16339d469k6784j0761J3867J7576K0120M895j9571k4720Q173J9919L547J2020
16327A3812J8470N285j2777j3573q465q65R590J2290K873k425r852q051l4763
16314b8451j0473J1080K5972R006K328K1271o926l6879o251j0921J1047J1173
16302h024j1218O749p94l123J228m116J149R146k1056p597J0260L751J5124o573
$$ plain form
16288 -15094 -36307 -36456 -19920 -10795 -20575 -21631 -15237 -28047 -14280 6847 18976 3051 2424
16275 2424 -1511 5493 5258 -298 15189 42416 39364 13439 12779 22918 40720 25918 31095 35239
16261 35239 14373 -3335 9202 3160 -8053 632 1693 10534 29057 16845 10437 26254 13725
16248 13725 -12400 -26994 -13770 15466 19127 -9519 -33092 -56695 -70266 -42829 -6893 15214
16236 15214 37017 43163 34447 16933 -11425 -35530 -9250 -12603 -4265 -8228 384 9092 12959
16223 12959 -3471 -22347 -20592 -27359 -13206 -7222 -11237 692 14656 23085 -2164 -10951 16417
16210 16417 39483 24864 22173 26849 23894 13024 -986 1986 22247 2118 -7848 5085 8074
16197 8074 18011 19819 6961 -2871 -10333 -25696 -28952 -26948 -28604 -20653 5893 12181 -1265 -4801
$$ packed form
16288a5094k1213j49J6536R125r780j056O394j2810J3767K1127J2129j5925o27
16275B424l935P004k35n556J5487K7227l052k5925o60J0139J7802j4802N177M144
16261C5239k0866j7708J2537o042j1213Q685J061Q841J8523j2212o408J5817j2529
16248A3725k6125j4594J3224K9236L661k8646k3573k3603j3571K7437L5936K2107
16236A5214K1803O146q716j7514k8358k4105K6280l353Q338l963Q612Q708L867
16223A2959j6430j8876J755o767J4153N984m015J1929J3964Q429k5249q787K7368
16210A6417K3066j4619k691M676k955j0870j4010K972K0261k0129r966J2933K989
16197H074R937J808j2858r832p462j5363l256K004j656P951K6546O288j3446l536
$$ plain form
16183 -4801 -9329 -26907 -14385 -12000 -13624 -12378 1623 21205 18755 14283 8826 17614 17278 30782
16169 30782 23263 24525 13455 -8 14221 18633 3945 609 -8780 3096 9985 3973 8694
16156 8694 13359 17642 5131 -1768 -7202 -9418 -16321 -31291 -1352 18072 8527 -1038 7157 9404
16142 9404 19670 19684 7264 10796 21234 22185 16131 25014 24072 20664 41014 55131 59096 52407
16128 52407 67856 63413 48932 46121 23094 9199 7971 903 1754 2818 11313 7141 -3661
16115 -3661 -294 -6381 -227 -1718 -10517 714 -1579 9915 34123 23458 25843 32110 28853 14963
16101 14963 6846 -3475 -11527 -20822 -26847 -18081 20226 9947 9904 15558 26063 15916 -408
16088 -408 -368 -1164 -13913 -4188 1261 1688 -33139 -49666 -28203 -8078 -8722 -8432 8528 -2012 -7161
$$ packed form
16183d801m528j7578J2522K385j624J246J4001J9582k450m472n457Q788l36J3504
16169C0782p519J262j1070j3463J4229M412j4688l336r389J1876O889o012M721
16156H694M665M283j2511o899n434k216o903j4970K9939J9424r545r565Q195K247
16142I404J0266J4j2420L532J0438R51o054Q883r42l408K0350J4117L965o689
16128E2407J5449m443j4481k811k3027j3895j228p068Q51J064Q495m172j0802
16115c661L367o087O154j491q799J1231k293J1494K4208j0665K385O267l257j3890
16101A4963q117j0321q052r295o025Q766L8307j0279m3N654J0505j0147j6324
16088d08M0p96j2749R725N449M27l4827j6527K1463K0125o44K90J6960j0540n149
$$ plain form
16073 -7161 434 12884 6079 13833 22617 -1064 -26596 -11421 -38387 -52040 -48447 -22401 -16567
16060 -16567 -16223 -33264 -31029 -22763 -13402 -24995 -6355 7284 -15987 -27228 -18004 -3094 -13555
16047 -13555 -19813 -37721 -39476 -36168 -20886 -4836 -21496 -5280 11836 45660 45697 38311 16211
16034 16211 9007 3327 12159 29648 21648 7346 38 -7136 -7759 16880 11045 1651 -8917 -5397
16020 -5397 13315 3489 6553 4652 8818 11579 -3156 -11952 -27146 -24153 -718 8511 -22371
16007 -22371 -38604 -17530 -24684 -40405 -38072 -31578 -26261 -2105 -10955 -17172 4281 -12363 -22230
15994 -22230 -24200 -30936 -40128 -48522 -34356 -7673 -3147 -3645 9760 -18200 -48080 -53486 -47277
15981 -47277 -39383 -36085 -7037 10344 11154 12402 7181 -3790 2441 27054 31275 50344 36479
$$ packed form
16073g161P595J2450o805P754Q784k3681k5532J5175k6966j3653L593K6046N834
16060a6567L44j7041K235Q266R361j1593J8640J3639k3271j1241R224J4910j0461
16047a3555o258j7908j755L308J5282J6050j6660J6216J7116L3824L7p386k2100
16034A6211p204n680Q832J7489q000j4302p308p174o23K4639n835r394j0568L520
16020e397J8712r826L064j901M166K761j4735q796j5194K993K3435R229l0882
16007b2371j6233K1074p154j5721K333O494N317K4156q850o217K1453j6644r867
15994b2230j970o736r192q394J4166K6683M526m98J3405k7960k9880n406O209
15981d7277P894L298K9048J7381Q10J248n221j0971O231K4613M221J9069j3865
$$ plain form
15968 36479 7338 -506 16 2040 -4595 -3927 10599 16466 15267 -7486 -12423 -3639 10201 7235
15954 7235 -1954 2881 10462 12359 27094 27541 28758 24602 26257 16768 12704 1237 -22526 -42506
15940 -42506 -32873 -10130 -3036 807 -6186 -8676 -6072 -9365 -10642 -21927 -7406 14365 4957
15927 4957 23688 27976 8627 22188 23120 12248 5438 15701 17909 22648 18428 5412 -22608
15914 -22608 -37212 -43768 -19285 -20666 -38279 -49092 -32994 -2279 11245 19828 32884 25793
15902 25793 14079 5491 -2132 -16950 -8523 -34176 -43930 -14181 1367 3706 9923 24295 10272
15889 10272 2253 16117 28047 15213 6214 3149 -9544 -10915 -21304 -32521 -21554 741
15877 741 10331 840 -1174 25328 28151 -2492 -21958 -13402 -7233 -21626 -17629 -37885 -46032 -60809
$$ packed form
15968C6479k9141p844N22K024o635O68J4526N867j199k2753m937Q784J3840k966
15954G235r189M835P581J897J4735M47J217m156J655r489m064j1467k3763j9980
15940d2506R633K2743P094L843o993k490K604l293j277j1285J4521K1771r408
15927D957J8731M288j9349J3561R32j0872o810J0263K208M739m220j3016k8020
15914b2608j4604o556K4483j381j7613j0813J6098L0715J3524Q583J3056p091
15902B5793j1714q588p623j4818Q427k5653r754K9749J5548K339O217J4372j4023
15889A0272q019J3864J1930j2834q999l065j2693j371j0389j1217J0967K2295
15877G41R590r491k014K6502K823l0643j9466Q556O169j4393L997k0256q147j4777
$$ plain form
15863 -60809 -69632 -34380 5262 22701 16727 2070 1930 715 7088 3836 -6402 16099 12049
15850 12049 14941 13987 10629 -9015 -35550 -39652 -10305 -8099 -4240 -7702 -2406 14076 17447 31221
15836 31221 10599 -3322 215 18212 388 -19208 -22128 -27125 -12346 -15641 -28521 -32250 -25041
15823 -25041 -7386 14808 30605 29096 5342 -12297 4606 2437 -6927 -4612 1748 9210 9585
15810 9585 14487 13147 1961 7943 4787 -13567 -1994 6296 6112 3064 -3391 -325 -6257 -15898
15796 -15898 -24607 -28488 -20061 -26179 -28937 -29295 -16455 13063 24864 10161 10812 16666 5937 5880
15782 5880 15253 4122 -11539 9816 9606 16759 18009 21897 -941 -22288 -20442 -19335 -15311 -8979
15768 -8979 -27283 -34665 -25471 -38543 -32554 -9862 -10906 -12657 -13185 -15017 -25253 -43899 -47993 -42030
$$ packed form
15863f0809q823L5252L9642J7439n974j4657j40j215O373l252j0238K2501m050
15850A2049K892r54l358j9644k6535m102K9347K206L859l462N296J6482L371J3774
15836C1221k0622j3921L537J7997j7824j9596k920m997J4779l295j2880l729P209
15823b5041J7655K2194J5797j509k3754j7639J6903k169r364K315O360P462L75
15810I585M902j340j1186N982l156j8354J1573Q290j84l048o455L066n932r641
15796a5898q709l881Q427o118k758l58J2840K9518J1801j4703O51N854j0729n7
15782E880R373j1131j5661K1355k10P153J250L888k2838k1347J846J107M024O332
15768h979j8304p382R194j3072N989K2692j044j751n28j832j0236j8646m094N963
$$ plain form
15754 -42030 -46912 -49965 -46968 -38662 -26925 -16434 -6466 11204 12429 16343 16451 14043 -9299 4357
15740 4357 14901 -2509 -15782 -16109 13255 15308 -10585 -26437 -5649 -10209 -18011 10616 41467
15727 41467 30805 17554 13962 -1705 -9613 -8204 5967 9518 1394 3686 -5186 -14222 -26750
15714 -26750 -23318 -197 23794 22574 25328 28334 20477 30087 32136 22600 26361 12650 20902 6716
15700 6716 -4696 -8381 -10301 -19331 -12096 -7368 -4646 -23256 -12369 17827 -11354 -18838 -25115
15687 -25115 -44966 -53351 -59925 -43679 -17831 -20334 -16465 3152 9491 -5322 -4559 3503 2700 -477
15673 -477 -10828 -22377 -31972 -38941 -23071 -5472 11641 22984 8599 9347 19509 23973 -707
15660 -707 -13612 -25246 -15041 5485 -8004 -12373 -11686 8018 9798 9088 -11155 7085 6957 -22508
$$ packed form
15754d2030m882l053K997Q306J1737J0491R968J7670J225L914J08k408k3342J3656
15740D357J0544j7410j3273l27K9364K053k5893j5852K0788m560p802K8627L0851
15727D1467j0662j3251l592j5667p908J409J4171L551q124K292q872r036j2528
15714b6750L432K3121K3991j220K754L006p857R610K049r536L761j3711Q252j4186
15700F716j1412l685j920r030P235M728K722j8610J0887L0196k9181p484o277
15687b5115j9851q385o574J6246K5848k503L869J9617O339j4813P63Q062q03l177
15673d77j0351j1549r595o969J5870J7599J7113J1343j4385P48J0162M464k4680
15660g07j2905j1634J0205K0526j3489m369O87J9704J780p10k0243J8240j28k9465
$$ plain form
15646 -22508 -26631 -26048 -20421 -19896 -28025 -7046 14741 23813 31535 41493 20285 -4845 12605 -2643
15632 -2643 -17466 6608 14213 -5356 -25720 -25358 -27583 -47662 -44376 -45031 -32142 -2499 28962
15619 28962 40498 12934 -5132 -11384 -14074 -37098 -32541 -9697 -7705 -2255 -9700 -15859 -7498
15606 -7498 11077 21248 22473 14538 22727 22298 16713 -4054 -23828 -25564 -3639 -4824 -12315 -17573
15592 -17573 -27715 -12732 -2940 -9004 -17296 -4839 8619 30601 22310 5806 951 7695 19094
15579 19094 1518 -15678 -21411 -7571 12636 31452 20489 10498 3768 -14077 -28821 -26146
15567 -26146 -22583 -6531 3230 861 8510 -193 342 16716 6615 5751 -5843 -11111 -11016 -12700
15553 -12700 -23222 -4939 23182 28159 35390 22206 3498 15053 33381 38724 12083 23472
$$ packed form
15646b2508m123N83N627N25q129K0979K1787R072P722R958k1208k5130J7450j5248
15632b643j4823K4074P605j9569k0364L62k225k0079L286o55J2889K9643L1461
15619B8962J1536k7564j8066o252k690k3024M557K2844J992N450p445o159Q361
15606g498J8575J0171J225p935Q189m29n585k0767j9774j736K1925j185p491n258
15592a7573j0142J4983R792o064q292J2457J3458K1982q291j6504m855O744J1399
15579A9094j7576j7196n733J3840K0207J8816j0963r991o730j7845j4744K675
15567b6146L563J6052R761k369P649q703N35J6374j0101q64j1594n268R5j684
15553a2700j0522J8283K8121M977P231j3184j8708J1555J8328N343k6641J1389
$$ plain form
15541 23472 37808 55613 60184 50728 35025 25883 20786 21431 16858 6164 16035 9722 2831 7303
15527 7303 14490 14592 14235 5076 -2093 -21567 -24405 -9561 26176 30865 5906 14670 17567 17583 21680
15512 21680 11510 -11841 -22844 -22350 -19567 -18476 -42905 -48396 -21154 -8440 -15051 -29261 -38498
15499 -38498 -17905 -29027 -41423 -44372 -29116 -2159 -8298 -22646 -17451 -6640 7721 13011
15487 13011 -3360 -25263 -19201 -5524 -15065 -44581 -40418 -49136 -42470 -19734 -19028 -7173 -1409
15474 -1409 -5831 2880 17000 13997 -17280 -40410 -54883 -47597 -27918 -28244 -23160 -17969 -25816 3338
15460 3338 13699 25521 10555 -843 -12751 -2700 -74 14841 14615 10285 8389 10242 8256
15447 8256 -15808 -17475 2248 12780 22893 35854 32006 11787 8257 21088 22352 11715 -21185
$$ packed form
15541B3472J4336J7805M571r456j5703r142n097O45m573j0694R871o313o891M472
15527G303P187J02l57r159p169j9474k838J4844L5737M689k4959Q764K897J6M097
15512B1680j0170k3351j1003M94K783J091k4429n491K7242J2714o611j4210r237
15499c8498K0593j1122j2396k949J5256K6957o139j4348N195J0811J4361N290
15487A3011j6371k1903O062J3677r541k9516M163q718O666K2736P06J1855N764
15474a409m422Q711J4120l003l1277k3130j4473P286J9679l26N084N191p847K9154
15460C338J0361J1822j4966j1398j1908J0051K626J4915k26m330j896J853j986
15447H256k4064j667J9723J0532J0113J2961l848k0219l530J2831J264j0637l2900
$$ plain form
15434 -21185 -11864 4203 12369 14407 10743 -7349 -12133 -10849 3505 2106 -14344 -6002 -5851 4663
15420 4663 -5703 14860 21252 5854 3712 2308 -2718 3726 12339 14222 2486 11722 5890 -6873
15406 -6873 -22077 -1742 14948 28773 36962 26047 20245 10706 -3490 -24972 -17397 -9367 -17691
15393 -17691 -25722 -33381 -36980 -29763 -21372 -1033 -14836 -36639 -22198 -20486 -21317 -12585 -18908 -23711
15379 -23711 -39020 -55583 -55121 -62244 -42024 -32678 -18688 2083 -8702 -27746 -35638 -40613 -43570
15366 -43570 -44370 -29526 -11011 14105 18004 1939 1717 -3064 -16098 -13820 -23400 -32978 -34493 -23359
15352 -23359 -7284 -3520 -1405 -2797 -7003 -9899 -1760 -4644 -4768 -6971 6466 26752 18998 7604
15338 7604 -9428 -14214 -14930 -13599 -2010 -2736 -14175 -32618 -28014 -29022 -30564 -51446 -42070 -17160
$$ packed form
15434b1185R321J6067Q166K038l664j8092m784J284J4354j399j6450Q342J51J0514
15420D663j0366K0563O392j5398k142j404n026O444Q613J883j1736R236n832j2763
15406f873j5204K0335J6690J3825Q189j0915n802r539j4196k1482P575Q030q324
15393a7691q031p659l599P217Q391K0339j3803k1803J4441J712q31Q732o323m803
15379b3711j5309j6563M62p123K0220R346J3990K0771j0785j9044p892m975k957
15366d3570q00J4844J8515K5116L899j6065k22m781j3034K278r580r578j515J1134
15352b3359J6075L764K115j392m206k896Q139k884j24k203J3437K0286p754j1394
15338G604j7032m786p16J331J1589p26j1439j8443M604j008j542k0882R376K4910
$$ plain form
15324 -17160 -9057 -1741 5451 -8214 -14222 10165 24484 21085 8568 12343 14124 13828 23885
15311 23885 25071 9221 25440 28233 19120 10856 13991 24390 37045 41096 29776 13085 11338
15298 11338 -2257 -12977 -22844 -31888 -16458 -19744 -29385 -4678 8559 16911 9056 784 8386
15285 8386 30094 28932 33334 38720 10667 -15933 -27968 -32771 -55123 -50049 -36597 -10635 -19088
15272 -19088 -26431 -9943 8579 -17882 -29014 4271 8432 15533 38618 32325 35180 29698 18245
15259 18245 11591 3705 2901 24735 24015 4691 -22028 -27392 -20223 -14742 -25576 -29816 -412 12761
15245 12761 16541 8084 423 2144 -4285 -17687 -14930 -30453 -30109 -13549 -24453 -25795 -12990
15232 -12990 -17902 -10630 -8616 -4559 6439 20250 14552 27403 52872 29239 10323 3272 2578
$$ packed form
15324a7160Q103P316P192j3665o008K4387J4319l399j2517L775J781k96J0057
15311B3885J186j5850J6219K793r113q264L135J0399J2655M051j1320j6691j747
15298A1338j3595j0720r867r044J5430l286r641K4707J3237Q352p855q272P602
15285H386K1708j162M402N386k8053k6600j2035m803k2352N074J3452K5962q453
15272a9088p343J6488J8522k6461j1132L3285M161P101K3085o293K855n482j1453
15259A8245o654p886q04K1834p20j9324k6719n364P169N481j0834m240K9404J3173
15245A2761L780q457p661J721o429j3402K757j5523L44J6560j0904j342J2805
15232a2990m912P272K014M057J0998J3811n698J2851K5469k3633j8916p051o94
$$ plain form
15219 2578 1924 4875 -133 -10058 -26287 -27459 -19355 -11448 -18628 -28577 -16369 -11369 -30585 -14696
15205 -14696 1732 17859 24725 7806 -257 -457 -6777 12837 24277 14917 11207 4309 -19275
15192 -19275 -28966 -29857 -20148 -25478 -32647 -5902 -11234 -25683 -37416 -16858 -19535 -22399 -18193 -3155
15178 -3155 -91 -394 460 4522 -3238 -2059 -26400 -48948 -35530 -11297 2903 14184 4348 507
15164 507 6366 13428 8063 4000 16992 17546 22637 12578 -13816 -22547 -20439 2066 13539 15136
15150 15136 5641 13156 9701 -71 -2693 4785 -13250 -25580 -7559 19899 19039 25207 4117
15137 4117 -23941 -32207 -41290 -40907 -39180 -38212 -31464 -24961 -41093 -43644 -18776 13770 21746 35472
15123 35472 15292 19051 27722 27466 16457 14213 10039 11633 14715 11419 7302 -9111 -25182 -25721
$$ packed form
15219B578o54K951n008r925j6229j172Q104P907p180r949J2208N000j9216J5889
15205a4696J6428J6127O866j6919q063k00o320J9614J1440r360l710o898k3584
15192a9275r691q91R709n330p169K6745n332j4449j1733K0558k677k864M206J5038
15178c155L064l03Q54M062p760J179k4341k2548J3418K4233J4200J1281r836l841
15164E07N859P062n365m063J2992N54N091j0059k6394q731K108K2505J1473J597
15150A5136r495P515l455r772k622P478j8035j2330J8021K7458q60O168k1090
15137D117k8058q266r083L83J727R68O748O503j6132k551K4868L2546P976J3726
15123C5472k0180L759Q671k56j1009k244m174J594L082l296m117j6413j6071n39
$$ plain form
15109 -25721 -27688 -8562 4116 416 -16772 -37774 -34373 -26572 -31061 -12791 -1228 -4007 -5823
15096 -5823 -3077 332 546 1105 14147 21682 16799 12236 -5656 -7092 5659 8205 5426 -17361
15082 -17361 -33109 -42462 -41354 -606 17600 9629 4634 -1827 -13991 7691 20862 18433 -1712
15069 -1712 -4818 -4548 16931 27686 22053 23246 7729 -12620 -37722 -42516 -36347 -21604 -9922
15056 -9922 -18372 -20153 -23950 -21224 -20924 -21466 -27763 -6029 17036 20514 24185 5220 11934 4868
15042 4868 6409 -18027 -3927 -1831 8710 374 -5573 -12325 -7585 17515 23041 2578 -16456
15029 -16456 -19040 -11412 -1313 15202 -1647 -4236 7753 9836 10345 -780 1860 10563 2592
15016 2592 -9674 109 -3611 -17567 -19238 5251 1998 17665 25592 28949 24507 6277 -11601
$$ packed form
15109b5721j967J9126J2678l700j7188k1002L401P801m489J8270J1563k779j816
15096e823K746L409K14N59J3042P535m883m563j7892j436J2751K546k779k2787
15082a7361j5748r353J108M0748J8206p971m995o461j2164K1682J3171k429k0145
15069a712l106K70K1479J0755n633J193j5517k0349k5102m794O169J4743J1682
15056i922q450j781l797K726L00n42o297K1734K3065L478L671j8965O714p066
15042D868J541k4436J4100K096J0541q336n947o752M740K5100N526k0463j9034
15029a6456k584P628J0099J6515j6849k589J1989K083N09j1125K640Q703p971
15016B592j2266R783l720j3956j671K4489l253J5667P927L357m442j8230j7878
$$ plain form
15003 -11601 -15951 7393 22542 20576 20476 4473 -7676 -1490 8017 28225 29396 29298 29332 25863
14989 25863 9741 12531 32043 39258 15606 25274 39956 39820 28149 15392 -4034 -12656 5151
14976 5151 12086 -4490 1034 33313 45430 40359 57129 50187 24972 -9025 -17187 -12120 -10040
14963 -10040 -35582 -59544 -66890 -49345 -41633 -40452 -36256 -20074 -28614 -37834 -36672 -24005 -32392
14950 -32392 -33581 -5961 -165 21419 12226 -856 -15209 -25458 -30591 -32615 -41629 -38620 -24865
14937 -24865 -28545 -18117 -20245 -12792 -19246 -32560 -48638 -53722 -50179 -32178 -3872 5158 9029
14924 9029 6851 11159 21142 36518 31174 -3381 -3298 12700 23668 27208 11243 22646 1112
14911 1112 2134 10926 -11797 -18127 -2486 -8528 -42939 -23525 -24022 -27925 9503 24860 -1283
$$ packed form
15003a1601m350K3344J5149j966j00j6003j2149O186R507K0208J171r8L4l469
14989B5863j6122K790J9512P215k3652R668J4682j36j1671j2757j9426q622J7807
14976E151O935j6576N524L2279J2117n071J6770o942k5215l3997q162N067K080
14963a0040k5542k3962p346J7545P712J181M196J6182q540r220J162J2667q387
14950c2392j189K7620N796K1584r193j3082j4353j0249n133k024r014L009J3755
14937b4865l680J0428k128P453o454j3314j6078n084L543J8001K8306R030L871
14924I029k178M308R983J5376n344l4555Q3J5998J0968L540j5965J1403k1534
14911A112J022Q792k2723o330J5641o042l4411J9414m97l903L7428J5357k6143
$$ plain form
14898 -1283 -35465 -19992 -19065 -30616 -30085 -7278 413 11516 24678 4622 9426 3521 7985
14885 7985 3510 -3670 1920 -4200 -16136 -15248 -19914 -26664 -34454 -25900 -6717 3240 1492 -13896
14871 -13896 5299 11133 -10721 -14746 -21670 -16290 -29176 -34062 -28901 -3917 292 8331 29293
14858 29293 29759 3730 -550 8507 -4073 -18438 1197 7714 7543 18147 39276 26278 17668
14845 17668 30625 15089 176 -14016 -10120 -1113 -8902 -12786 -13904 9260 13755 -11838 -21103
14832 -21103 -31378 -32064 5528 21702 -847 4730 12975 8550 -10015 -28978 -14960 -15729 -10205
14819 -10205 -6780 -8771 -21017 -16996 -15379 1302 -774 2908 14924 26544 34632 22367 -4621
14806 -4621 -6870 9225 3898 13044 27539 41490 22351 -22351 -30314 -38856 -47993 -37253 -24893
$$ packed form
14898a283l4182J5473R27j1551N31K2807P691J1103J3162k0056M804n905M464
14885G985m475p180N590o120j1936Q88m666o750p790Q554J9183R957j748j5388
14871a3896J9195N834k1854m025o924N380j2886m886N161K4984M209Q039K0962
14858B9293M66k6029m280R057j2580j4365J9635O517j71J0604K1129j2998q610
14845A7668J2957j5536j4913j4192L896R007p789l884j118K3164M495k5593r265
14832b1103j0275o86L7592J6174k2549N577Q245m425j8565j8963J4018p69N524
14819a0205L425j991j2246M021J617J6681k076L682J2016J1620Q088j2265k6988
14806d621k249J6095n327R146J4495J3951j9139m4702p963q542r137J0740J2360
$$ plain form
14793 -24893 1988 27922 27165 6341 -19368 -18614 -17569 -11735 12511 7947 -5447 -5578 -8042 -18146
14779 -18146 -17453 -29212 -22420 -8365 -5639 -24249 2794 38564 19851 15894 14201 11020 1728
14766 1728 2143 13885 -12607 -11384 -1843 2120 3270 -5205 441 -4737 -27386 3490 -7736 -10868
14752 -10868 9441 28108 39532 51174 46295 28201 12511 -12920 -19016 -20020 -21552 6244
14740 6244 16539 1118 -485 -12531 -7700 9928 -5489 -6249 2474 6839 -2477 -12614 -10917
14727 -10917 -17258 -18519 -8310 -18341 -33653 -25476 -20452 9394 35099 21193 2786 18428
14715 18428 37788 45721 56343 58014 54094 70173 65516 57284 53952 57621 50555 34239 29201
14702 29201 28213 10052 13164 7772 17146 13662 22540 33782 30194 45215 53431 48681 24834 22787
$$ packed form
14793b4893K6881K5934p57k0824k5709P54J045N834K4246m564j3394j31k464j0104
14779a8146O93j1759O792J4055K726j8610K7043L5770j8713l957j693l181r292
14766A728M15J1742k6492J223R541L963J150q475N646n178k2649L0876j1226l132
14752a0868K0309J8667J1424J1642m879j8094j5690k5431o096j004j532K7796
14740F244J0295j5421j603j2046M831J7628j5417p60Q723M365r316j0137J697
14727a0917o341j261J0209j0031j5312Q177N024K9846K5705j3906j8407J5642
14715A8428J9360P933J0622J671l920J6079m657q232l332L669p066j6316n038
14702B9201r88j8161L112n392R374l484Q878J1242l588J5021Q216m750k3847k047
$$ plain form
14688 22787 24794 37569 49013 34429 12845 -1348 8392 13586 4124 3575 17911 18977 19101
14675 19101 3996 7008 3161 -4777 5777 1055 7644 1116 4921 26503 13151 -14026 -16367
14662 -16367 -15391 -7972 12275 25388 14540 17732 17160 -4883 -26483 -15700 -2932 7948 -1582
14649 -1582 -18487 -16959 -17263 -11113 59 34856 47468 44132 29222 21163 11146 17001 11105
14636 11105 -14827 -30379 -40272 -43630 -32403 -47397 -49664 -15574 4891 32744 38693 15826
14624 15826 -12699 10620 32041 9914 17979 38307 29808 15841 20183 13316 677 11279
14612 11279 -6810 -39102 -39836 -17952 -15961 -16247 -22650 -16047 -5985 2735 3007 -9451 -12099 12596
14598 12596 7482 10257 -1013 -153 5873 5411 17735 9160 5020 -10161 -20465 -14820 -33226 -27949
$$ packed form
14688B2787K007J2775J1444j4584k1584j4193R740N194r462n49J4336J066J24
14675A9101j5105L012l847p938J0554m722O589o528L805K1582j3352k7177k341
14662a6367R76P419K0247J3113j0848L192n72k2043k1600J0783J2768J0880r530
14649a582j6905J528l04O150J1172L4797J2612l336j4910q059j0017N855n896
14636A1105k5932j5552r893l358J1227j4994k267L4090K0465K7853N949k2867
14624A5826k8525K3319K1421k2127Q065K0328q499j3967M342o867j2639J0602
14612A1279j8089l2292p34K1884J991k86o403O603J0062Q720K72j2458k648K4695
14598A2596n114K775j1270Q60O026m62J2324q575m140j5181j0304N645j8406N277
$$ plain form
14584 -27949 -15399 -26608 -34093 -21025 6977 10127 19173 1023 -10420 -8713 -6430 -16024 -18899
14571 -18899 -33738 -23347 -16048 -19143 -14552 -14916 -30776 -37186 -872 15747 25417 6700 -8154
14558 -8154 -382 26198 17656 11474 -14277 -39506 -32799 6887 -859 -6287 -1736 268 22002
14545 22002 22583 12493 1064 5554 3015 503 -10255 -18197 -12295 2810 10591 -7813 -23360
14532 -23360 -19749 4075 3428 -16867 -19076 -3328 8764 -6118 -3264 -8827 -13319 -21790 -18823
14519 -18823 -9924 -14421 -15140 -7647 -5204 -2822 -13676 -4361 -20000 -15928 17902 17741 -6154 -20453
14505 -20453 -23036 -29628 -19240 -5597 -25690 -38372 -42800 -12108 5626 3238 16735 12718 20818
14492 20818 29845 15061 -6952 -4885 4608 22452 5685 198 4116 9971 10792 18439 15029 6131
$$ packed form
14584b7949J2550j1209p485J3068K8002L150R046j8150j1443J707K283r594k875
14571a8899j4839J0391P299l095M591l64j5860o410L6314J6619R670j8717j4854
14558h154P772K6580q542o182k5751k5229O707L9686p746n428M551K004K1734
14545B2002N81j0090j1429M490k539k512j0758p942N902J5105P781j8404j5547
14532b3360L611K3824o47k0295k209J5748J2092j4882K854n563m492q471K967
14519a8823Q899m497p19P493K443K382j0854R315j5639M072L3830j61k3895j4299
14505b0453k583o592J0388J3643k0093j2682m428L0692J7734k388J3497m017Q100
14492B0818R027j4784k2013K067R493J7844j6767n487L918N855Q21P647l410q898
$$ plain form
14478 6131 -1213 -79 4030 4915 33747 31087 22006 -14632 -20516 -14207 -12073 3836 16969 5088
14464 5088 -12977 -11244 -14242 -35673 -34898 -28385 -20227 -27395 -34035 -30660 -30102 -11405 13866 19683
14450 19683 33141 28538 10077 9147 11686 -1924 -19073 -20753 -12301 -14267 -15241 -688 8988 9981
14436 9981 29232 34678 20042 5994 -6311 -24133 -17166 -4244 -13587 -24631 -19491 -5259 -2816
14423 -2816 15649 31518 27207 30277 11113 9814 11638 18093 26457 26330 32987 40172 33212 21978
14409 21978 21859 16008 -1586 -26667 -36221 -35564 -18286 2022 -19148 -44297 -44457 -24996 -20577
14396 -20577 -27155 -15491 -17625 -23344 1079 22316 22433 11186 -781 -20568 -34954 -45941 -40497
14383 -40497 -39637 -33456 -16406 -3276 19931 28223 15349 -9054 -22922 -6161 6035 11449 2073
$$ packed form
14478F131p344J134M109Q85K8832k660r081l6638n884O309K134J5909J3133j1881
14464E088j8065J733k998k1431P75O513Q158p168o640L375N58J8697K5271N817
14450A9683J3458m603j8461r30K539j3610j7149j680Q452j966r74J4553R676R93
14436I981J9251N446j4636j4048j2305j7822O967J2922r343j1044N140J4232K443
14423b816J8465J5869m311L070j9164j299J824O455Q364j27O657P185o960j1234
14409B1978j19n851j7594k5081r554O57J7278K0308k1170k5149j60J9461M419
14396b0577o578J1664k134n719K4423K1237J17j1247j1967j9787j4386j0987N444
14383d0497Q60O181J7050J3130K3207Q292j2874k4403j3868J6761J2196N414r376
$$ plain form
14370 2073 -26144 -29026 -28459 -16674 -10788 -2568 -9666 11023 25368 12959 11862 5867 1020 1547
14356 1547 -3300 940 13815 1891 4393 19285 42165 16962 -6268 6899 16076 17362 11091
14343 11091 1696 -10192 -23918 -15110 6315 -8223 -18886 -4195 -2781 17127 -1601 -37429
14331 -37429 -44150 -47353 -20621 -3623 25027 36636 41274 34902 21878 -7861 -33074 -38376 -21999
14318 -21999 -4469 26292 37257 45071 50730 35392 29176 23611 -2300 -16616 -27085 -38636
14306 -38636 -60726 -55863 -34795 -8660 12038 10826 21408 35696 34060 15277 2288 -10424
14294 -10424 5418 30341 34126 20339 8254 18280 5204 -15972 -29135 -35462 -38345 -32854
14282 -32854 -39396 -39449 -35407 -6915 -4156 -1413 17166 24612 7803 15640 5706 -1790 -4718 -8767
$$ packed form
14370B073k8217k882N67J1785N886Q220p098K0689J4345j2409j097n995m847N27
14356A547m847M240J2875j1924K502J4892K2880k5203k3230J3167R177J286o271
14343A1091r395j1888j3726Q808K1425j4538j0663J4691J414J9908j8728l5828
14331c7429o721l203K6732J6998K8650J1609M638o372j3024k9739k5213n302J6377
14318b1999J7530L0761J0965P814N659j5338o216n565k5911j4316j0469j1551
14306c8636k2090M863K1068K6135K0698j212J0582J4288j636j8783j2989j2712
14294a0424J5842K4923L785j3787j2085J0026j3076k1176j3163o327k883N491
14282c2854o542n3M042K8492K759K743J8579P446j6809P837r934p496k928m049
$$ plain form
14268 -8767 10321 13923 8183 3089 625 1990 -7667 -9245 1786 3921 -6048 -38614 -23296 -4743
14254 -4743 -22080 -32084 -29676 -17153 -2652 -5850 -14683 -5969 -14142 -18326 -20068 -17230 -16721 -12668
14240 -12668 -18311 -4821 -12072 -16842 -6445 14570 28143 24819 13213 2851 3716 18180 15259
14227 15259 7005 20091 15232 -6485 -9613 -10347 -13941 -5109 -8266 -11925 -10241 -16359 -33226 -26544
14213 -26544 -11629 8843 7436 -13175 -9674 984 -1241 -23180 -27090 -8100 -21313 -41575
14201 -41575 -18811 -8967 -15303 -7317 -6947 -12047 -2 10642 11880 9881 9076 -952 -8667 -2204
14187 -2204 2832 -1147 -15240 -6674 -17152 -23011 -12109 -14626 -21617 -20214 -9857 7080 15978
14174 15978 5660 -7075 6830 12260 4809 9694 14743 12444 8929 -7912 7305 26694 21718
$$ packed form
14268h767J9088L602n740n094k464J365r657j578J1031K135r969l2566J5318J8553
14254d743j7337j0004K408J2523J4501l198q833Q714q173m184j742K838N09M053
14240a2668n643J3490p251m770J0397K1015J3573l324j1606j0362Q65J4464k921
14227A5259q254J3086m859k1717l128p34l594Q832l157l659J684o118j6867O682
14213b6544J4915K0472j407k0611L501J0658k225k1939l910J8990j3213k0262
14201d1575K2764R844o336P986L70n100J2045J0644J238j999q05j0028p715O463
14187b204N036l979j4093Q566j0478n859J0902k517o991J403J0357J6937Q898
14174A5978j0318j2735J3905N430p451M885N049k299l515j6841J5217J9389m976
$$ plain form
14161 21718 12552 -13644 -12538 -22972 -41556 -29175 -20699 -37130 -26159 -18361 -22764 -11290 -6540
14148 -6540 -12145 2111 15347 21841 13274 2944 -9652 -10183 12594 20366 21671 27363 18278 13003
14134 13003 -8503 -16578 -8231 15408 17274 15842 17743 15105 5698 -8159 3790 16241 9426
14121 9426 4127 -8326 -12986 -21105 -23217 -25496 -11059 -1442 -6050 -4483 5533 5750 9594 14400
14107 14400 15700 38169 22131 5275 -818 32443 34114 3533 -20001 -22126 -17827 6180 25893
14094 25893 17011 -3750 -6727 -9842 -12668 -17249 -19117 -660 -6241 -12805 6460 15882 4316
14081 4316 379 -1349 1009 9020 10894 4844 19533 9801 -3062 -9200 -29741 -19055 -8246
14068 -8246 2709 19632 7033 1279 -16572 -35713 -34486 -11489 -3048 -14873 -21464 -8614 10377
$$ packed form
14161B1718r166k6196J106j0434j8584J2381Q476j6431J0971P798m403J1474M750
14148f540n605J4256J3236O494q567j0330j2596n31K2777P772J305N692r085n275
14134A3003k1506q075Q347K3639J866j432J901k638r407j3857J1949J2451o815
14121I426n299j2453m660q119k112k279J4437R617m608J567J0016K17L844M806
14107A4400J300K2469j6038j6856o093L3261J671l0581k3534k125M299K4007J9713
14094B5893q882k0761k977l115k826m581j868J8457n581o564J9265R422j1566
14081D316l937j728K358Q011J874o050J4689r732j2863o138k0541J0686J0809
14068h246J0955J6923j2599n754j7851j9141J227K2997Q441j1825o591J2850J8991
$$ plain form
14055 10377 5167 -10047 -15962 -9189 -32280 -22590 2349 13398 -3529 -44273 -65624 -45482
14043 -45482 -16688 3396 476 1173 12400 4349 23744 33767 27726 22350 20182 9856 -7967
14030 -7967 -17745 -6832 2962 15361 7957 -10307 -16692 -11929 -19280 -19580 -19332 -11428 3541 14643
14016 14643 20956 33239 23930 16698 14700 10553 -3985 -3981 -5184 -17720 -35794 -38626 -37989 -43626
14002 -43626 -26782 -12989 5669 10898 12311 10058 15233 22609 23792 52426 45011 24228 25504
13989 25504 12642 22918 31664 30370 30215 31092 29696 11826 16220 19849 11230 11645 14600 21727
13975 21727 25962 6903 -3168 7660 802 -7124 -5298 1735 -3195 -11619 -4732 16602 37348
13962 37348 25168 -6961 -21396 -14021 -5566 -6328 -6564 2880 21073 11801 2494 19363 32930
$$ packed form
14055A0377n210j5214n915O773k3091R690K4939J1049j6927m0744k1351K0142
14043d5482K8794K0084k920O97J1227q051J9395J0023o041n376k168j0326j7823
14030g967r778J0913R794J2399p404j8264o385M763p351l00K48P904J4969J1102
14016A4643O313J2283r309p232j998m147j4538Mj203j2536j8074k832O37n637
14002d3626J6844J3793J8658N229J413k253N175P376J183K8634p415k0783J276
13989B5504j2862J0276Q746j294j55Q77j396j7870M394L629q619M15K955P127
13975B1727M235j9059j0071J0828o858p926J826P033m930q424O887K1334K0746
13962C7348j2180l2129j4435P375Q455p62k36R444J8193r272r307J6869J3567
$$ plain form
13949 32930 28059 8018 13035 43018 24539 -1861 -17067 -5567 6150 23604 44506 7057
13937 7057 -41718 -45504 -25376 -13964 -19388 1437 -9139 -17371 -10561 -5025 4381 -17872 -36910
13924 -36910 -56825 -51897 -26258 12454 26609 20573 3045 -27044 -15839 -2070 -9154 -4923
13912 -4923 1195 -6146 -2174 1175 -2100 8784 17650 18217 -8325 -18542 -7426 8496 -14791
13899 -14791 -26437 1646 12158 -5071 5904 19770 20546 13101 7399 11080 21765 11969 -5645
13886 -5645 -26521 -26022 -12607 3741 25694 36437 25895 -13606 -11133 6385 18877 -4172
13874 -4172 -30895 -30918 -27270 -23476 -20025 -25570 -24507 -18796 -12753 9589 9020 -1581 -6550 -12146 -10520
13859 -10520 -19366 -19661 -28200 -30382 -24573 -7898 -14680 -19313 -6899 1573 5487 -6419 -21475 -21107
$$ packed form
13949C2930m871k0041N017K9983j8479k6400j5206J1500J1717J7454K0902l7449
13937G057m8775l786K0128J1412n424K0825j0576q232O810N536R406k2253j9038
13924c6910j9915M928K5639L8712J4155o036j7528l0089J1205J3769p084M231
13912d923O118p341L972L349l275J0884Q866N67k6542j0217J1116J5922k3287
13899a4791j1646K8083J0512j7229J0975J3866P76p445n702L681J0685r796j7614
13886e645k0876M99J3415J6348K1953J0743j0542l9501K473J7518J2492k3049
13874d172k6723k3L648L794L451n545J063N711O043K2342n69j0601m969n596J626
13859a0520q846k95q539k182N809J6675o782m633J2414Q472L914j1906j5056L68
$$ plain form
13845 -21107 -20500 -18113 -25683 -41375 -35565 -19468 -8275 -19408 -23083 -9581 -13963 -16552 -394
13832 -394 1160 -2541 -5985 -5858 -28926 -54393 -29766 -4787 -8074 -19014 1072 15132 -3894
13819 -3894 -9984 -5005 22600 29148 17217 -6475 -20160 -23152 -18153 -12077 -8591 12912 11391
13806 11391 16315 6493 -27272 -37813 -29492 -23920 -9084 -10795 -16078 -9546 -11102 12558 17414
13793 17414 11495 -12809 -21042 -26219 -46933 -51048 -48838 -48748 -27841 -13227 -5287 -11693 -43198 -40617
13779 -40617 -24614 -7571 10859 5266 -15548 -9976 -10616 -8332 -5282 1799 937 2770 -7154 10814
13765 10814 11622 16775 19441 18009 17025 -423 -17817 -31227 -29188 -10691 -3197 3939 -2856 -412
13751 -412 8035 -1481 -29191 -40050 -36191 -43831 -23451 -11609 4105 8464 -278 -6076 -17283
$$ packed form
13845b1107O07K387p570j5692N810J6097J1193j1133l675J3502m382k589J6158
13832c94J554l701l444J27k3068k5467K4627K4979l287j0940K0086J4060j9026
13819c894o090M979K7605O548j1931k3692j3685k992M999O076L486K1503j521
13806A1391M924r822l3765j0541Q321N572J4836j711n283O532j556K3660M856
13793A7414n919k4304q233n177k0714m115K210R0K0907J4614P940o406l1505K581
13779d0617J6003J7043J8430n593k0814N572o40K284L050P081q62J833r924J7968
13765A0814Q08N153K666j432r84j7448j7394j3410K039J8497P494P136o795K444
13751d12Q447r516k7710j0859L859p640K0380J1842J5714M359q742n798j1207
$$ plain form
13738 -17283 -27195 -24732 -1610 -12946 -6284 -7384 -892 4575 13940 -4438 -12464 -22999 -29536
13725 -29536 -19118 -14601 -21274 -27796 -31367 -47929 -67111 -46690 -12971 4766 8404 8245 -1394
13712 -1394 -7007 7428 9420 6330 -2045 3285 -9936 -35712 -47395 -15392 -6469 -6975 -15586 -13317
13698 -13317 1825 8550 -1085 -13760 -16436 -11245 1349 9097 14773 4248 -14492 -24589 -21085
13685 -21085 8080 5765 -20453 -15474 -656 -7751 -6051 -3202 -9794 -8301 -19071 -16941 1726
13672 1726 16545 16061 9688 3554 2346 -21848 -48549 -64009 -51323 -46185 -37257 -7784 17466
13659 17466 7551 16711 33699 36015 42799 31059 18011 24607 39631 21878 5127 12179 29502
13646 29502 36323 24301 15845 9090 994 12841 39157 7573 -394 5061 9226 19841 32335
$$ packed form
13738a7283r912K463K3122j1336O662j100O492N467R365j8378q026j0535o537
13725b9536J0418M517o673o522l571j6562j9182K0421L3719J7737L638j59r639
13712a394n613J4435J992l090q375N330j3221k5776j1683L2003Q923n06q611K269
13698a3317J5142O725r635j2675k676N191J2594P748N676j0525j8740j0097L504
13685b1085K9165k315k6218M979J4818p095J700K849o592J493j0770K130J8667
13672A726J4819m84o373o134j208k4194k6701j5460J2686N138Q928K9473K5250
13659A7466r915R160J6988K316O784j1740j3048O596J5024j7753j6751P052J7323
13646B9502O821j2022q456o755q096J1847K6316l1584p967N455M165J0615J2494
$$ plain form
13633 32335 17525 10916 11510 23469 14891 -564 -3223 3902 -4475 2227 9550 22834 34367
13620 34367 22016 10783 -14159 -4954 20772 13370 -2828 -14237 -7473 -5652 6179 -1229 -25077
13607 -25077 -12672 -1353 -16079 2808 28625 51441 44224 23218 11047 18743 37848 47267
13595 47267 54859 25978 14218 8966 25517 24193 28637 31983 26109 23691 24201 29241 20027 13978
13581 13978 -1243 -2307 -10057 -11564 7847 13379 12745 15761 -2907 -24086 -28709 -37851 -12831
13568 -12831 1726 -8246 -21786 -57868 -50158 -15394 -11958 -7315 5390 9614 -7250 -1008 21391
13555 21391 25721 28655 50198 42880 20900 12172 1144 1168 -13467 -29519 -17329 -2095 -10723
13542 -10723 -32633 -46402 -45526 -40954 -23516 6393 29729 15089 -2152 -9292 -308 15638 16525
$$ packed form
13633C2335j4810o609N94J1959q578j5455k659P125q377O702P323J3284J1533
13620C4367j2351j1233k4942R205K5726p402j6198j1409O764J821J1831p408k3848
13607b5077J2405J1319j4726J8887K5817K2816p217k1006j2171P696J9105R419
13595D7267P592k8881j1760n252J6551j324M444L346n874k418N10N040r214o049
13581A3978j5221j064p750j507J9411N532o34L016j8668k1179m623r142K5020
13568a2831J4557r972j3540l6082P710L4764L436M643J2705M224j6864O242K2399
13555B1391M330K934K1543p318k1980q728j1028K4j4635j6052J2190J5234q628
13542a0723k1910j3769Q76M572J7438K9909K3336j4640j7241p140Q984J5946Q87
$$ plain form
13529 16525 2851 -18157 -27832 -18152 -6433 -1162 -3987 -6270 -20286 -27850 -19817 -7255 -7512
13516 -7512 -6824 -36 12530 7798 -6225 -17911 -15 26070 27280 5443 -6299 -10409 -11789
13503 -11789 -6154 7254 6381 20988 33434 11257 4849 -9770 -16656 -1771 -14844 -16824 -12877
13490 -12877 -17921 -26629 -31802 -34896 -12314 -16073 -32706 -9375 17883 17260 10109 6946 -6755
13477 -6755 -11436 -12618 -31696 -41893 -19977 -17341 -30179 -32435 -21495 -36409 -32840 -14504 -8479
13464 -8479 6506 23071 28201 38796 14979 -23135 -10948 -4397 -7631 15467 -11291 -24977
13452 -24977 2093 11311 12722 6816 5343 -8989 8134 5716 3202 1492 12086 6689 -8783
13439 -8783 -19395 -4785 -13099 -29039 -37185 -30861 -16569 -21441 -19865 -20992 -23290 -13706 20602
$$ packed form
13529A6525j3674k1008r675R680J1719N271k825k283j4016p564Q033J2562k57
13516g512O88O788J2566m732j4023j1686J7896K6085J210k1837j1742m110j380
13503a1789N635J3408q73J4607J2446k2177o408j4619o886J4885j3073j980L947
13490a2877n044q708n173l094K2582l759j6633K3331K7258o23p151l163j3701
13477f755m681j182j9078j0197K1916K636j2838k256J0940j4914L569J8336O025
13464h479J4985J6565N130J0595k3817l8114J2187O551l234K3098k6758j3686
13452b4977K7070R218J411n906j473j4332J7123k418k514j710J0594n397j5472
13439h783j0612J4610q314j5940q146O324J4292m872J576j127k298R584L4308
$$ plain form
13426 20602 10910 -22245 -15719 -12651 -15612 -10340 -18772 -32818 -17746 -7908 -10862 -1732 2010 -7290
13412 -7290 -14412 -18252 -28020 -42429 -32326 -15036 -7827 -4303 6314 8766 18567 22210 25894 22444
13398 22444 -19684 -32367 -2206 5284 3506 26177 32441 29342 25835 15043 7974 7821 2473
13385 2473 -5257 3105 9301 -5107 -7336 -3068 -154 9764 6640 -10009 -21580 -25877 -9928 10856
13371 10856 13120 9741 11977 1723 -24773 -9571 19665 30497 25166 33171 24223 16726 11572
13358 11572 -3155 -18260 -24051 -9680 -11453 9054 31465 24010 -22598 -29880 -11345 7822
13346 7822 7333 4149 9502 13532 20191 16671 9642 227 -4477 475 11581 3134 -19551 -26818
13332 -26818 -10948 3529 -20560 -32038 -24948 -5981 -6695 -15140 -3621 4109 279 8747 8409
$$ packed form
13426B0602r692l3155O526L068k961N272q432j4046J5072R838k954R130L742r300
13412g290p122l840r768j4409J0103J7290P209L524J0617K452R801L643L684l450
13398B2444m2128j2683L0161P490j778K2671O264l099l507j0792p069j53n348
13385B473p730Q362O196j4408k229M268K914R918l124j6649j1571m297J5949K0784
13371A0856K264l379K236j0254k6496J5202K9236J0832n331Q005q948p497n154
13358A1572j4727j5105n791J4371j773K0507K2411p455m6608p282J8535J9167
13346G822m89l184N353M030O659l520p029r415m704M952J1106q447k2685p267
13332b6818J5870J4477k4089j1478P090J8967p14q445J1519P730l830Q468l38
$$ plain form
13319 8409 1478 -7075 -20735 -16998 -14010 582 5322 -5144 5395 18160 20125 21250 16363
13306 16363 24795 35260 19188 9753 13757 304 -3335 3 2721 -10046 -14402 -14762 518
13293 518 17832 11807 -5183 -27341 -35792 -19579 -7717 -1925 685 -1664 -21043 -10503 -27
13280 -27 7969 20783 10642 6789 21037 6407 10567 7415 -24 -14086 -24152 -6867 -947
13267 -947 8038 11547 6684 7865 8528 27128 43848 43944 29376 9764 -13927 -21132 -19049 1896
13253 1896 -12048 -23988 -20166 -6002 2480 -18406 -22730 -21838 -18439 -11188 -3480 -801 4281 -9428
13239 -9428 -22407 -24557 -29056 -36483 -26940 -27788 -10924 13635 16745 9884 15151 -511 -9194 -4718
13225 -4718 19547 10176 2689 26755 26544 7933 5493 -237 -13456 -1563 4813 6188 -12924
$$ packed form
13319H409o931q553j3660L737K988J4592M740j0466J0539J2765J965J125m887
13306A6363Q432J0465j6072r435M004j3453l639L338K718j2767m356l60J5280
13293E18J7314o025j6990k2158q451J6213J1862N792K610k349j9379J0540J0476
13280b7P996J2814j0141l853J4248j4630M160l152p439j4062j0066J7285N920
13267i47Q985L509m863J181O63J8600J6720R6j4568j9612k3691p205K083K0945
13253A896j3944j1940L822J4164Q482k0886m324Q92L399P251P708K679N082j3709
13239i428j2979k150m499p427R543q48J6864K4559L110o861N267j5662q683M476
13225d718K4265r371p487K4066k11j8611k440n730j3219J1893O376J375j9112
$$ plain form
13212 -12924 -578 2141 -12787 -19902 -6359 -11078 -24484 -4193 2202 -14734 -14709 1541 17500
13199 17500 11666 18064 4389 2282 -2625 529 286 -4218 1873 920 -11615 -14120 -19881 -28435
13185 -28435 -15003 7553 1755 11689 41247 37534 28316 6527 -5702 10218 11575 -247 6668
13172 6668 -320 14061 21726 16369 12864 5601 -1389 -10629 -5044 -8887 -23750 -19021 13166 7343
13158 7343 -22573 -35973 -33737 -21716 -13513 -1127 576 2900 8001 26090 33092 47171 53881
13145 53881 64978 62356 50531 31499 28899 14854 16762 22825 17957 -7653 -18500 17139 41956
13132 41956 35634 6818 19394 36878 38680 36380 37223 52790 27585 23500 45367 40680 17193
13119 17193 -4937 9176 33293 23187 24205 12136 3260 7930 8706 6557 7483 29341 37514
$$ packed form
13212a2924J2346K719j4928p115J3543m719j3406K0291O395j6936K5J6250J5959
13199A7500n834O398j3675k107m907L154k43m504O091r53j2535k505n761q554
13185b8435J3432K2556n798R934K9558l713r218k1789j2229J5920J357j1822O915
13172F668o988J4381P665n357l505p263o990r240N585l843j4863M729L2187n823
13158G343k9916j3400K236J2021Q203J2386J703K324N101J8089P002J4079O710
13145E3881J1097k622j1825j9032k600j4045J908O063m868k5610j0847L5639K4817
13132D1956o322k8816J2576J7484J802k300Q43J5567k5205m085K1867m687k3487
13119A7193k2130J4113K4117j0106J018j2069q876M670P76k149R26K1858Q173
$$ plain form
13106 37514 32755 31914 29506 27439 38207 40112 27514 24950 20429 3714 4703 2163 -7911 12574
13092 12574 32894 27803 38157 37973 36908 31350 23696 21561 27616 21147 11396 9153 -354 -13546
13078 -13546 -27879 -30698 -26132 -15101 -13613 2100 2707 1763 21140 7148 -12354 -21784 -24155
13065 -24155 -33059 -7589 6612 2184 10878 9955 -6265 -9001 -4432 -8455 -4282 18324 42606
13052 42606 34182 25313 8596 13050 28448 12138 -2135 2026 364 -13518 -20067 -30088 -31673
13039 -31673 -12383 16164 20081 8768 51 2228 8039 7825 -7542 -23803 -14176 -1113 -6987
13026 -6987 -7443 -308 -6950 -5191 3118 27097 518 10780 37985 39357 13482 4898 12639 23626
13012 23626 30322 14807 4258 -12094 -6144 26939 13397 2452 -1653 11744 1115 -3191
$$ packed form
13106C7514m759q41k408k067J0768J905j2598k564m521j6715R89k540j0074K0485
13092A2574K0320n091J0354j84j065n558p654k135O055o469r751k243r507j3192
13078a3546j4333k819M566J1031J488J5713O07r44J9377j3992j9502r430k371
13065b4155q904K5470J4201m428Q694r23j6220k736M569m023M173K2606K4282
13052D2606q424q869j6717M454J5398j6310j4273M161j662j3882o549j0021j585
13039c1673J9290K8547L917j1313q717K177N811k14j5367j6261R627J3063n874
13026f987m56P135o642J759Q309K3979k6579J0262K7205J372k5875q584P741J0987
13012B3626O696j5515j0549j6352N950L3083j3542j0945m105J3397j0629m306
$$ plain form
13000 -3191 -2422 16882 32194 13440 -3965 -15749 -31536 -33584 -27051 -16594 -3833 912 -862
12987 -862 -280 3105 11593 20311 32973 23107 3302 15335 -5417 -4443 13865 23355 -7792 -23057
12973 -23057 -29446 -26364 -15981 -10949 -9151 -25946 -12120 -20979 -33509 -34155 -29755 -33791 -19757
12960 -19757 -8335 7584 16391 21317 15039 15671 19269 3963 -10759 -28798 -52283 -39858 -7194
12947 -7194 -1130 -10885 -25338 -27880 -34274 -22193 -7481 -13711 -27158 -9438 6101 29910 25093
12934 25093 5087 8837 15768 25975 12882 2519 -571 -8125 -16432 -3053 -2892 -5382 8418
12921 8418 10934 31624 24919 4062 -13578 -801 18987 26623 32779 14144 -13836 -31632 -28901
12908 -28901 -14629 -14962 -19300 -35733 -25574 -15366 6938 6008 -19190 -55250 -31301 -3714 6856
$$ packed form
13000c191P69J9304J5312j8754j7405j1784j5787k048O533J0457J2761M745j774
12987h62N82L385Q488Q718J2662r866j9805J2033k0752R74J8308R490l1147j5265
12973b3057o389L082J0383N032J798j6795J3826q859j2530o46M400m036J4034
12960a9757J1422J5919Q807M926o278O32L598j5306j4722j8039k3485J2425L2664
12947g194O064r755j4453k542o394J2081J4712o230j3447J7720J5539K3809m817
12934B5093k0006L750O931J0207j3093j0363l090p554q307J3379J61k490J3800
12921H418K516K0690o705k0857j7640J2777J9788P636O156j8635k7980j7796K731
12908b8901J4272l33m338j6433J0159J0208K2304r30k5198l6060K3949K7587J0570
$$ plain form
12895 6856 21113 1922 9404 17241 -3296 -28828 -29007 -19340 -4597 -8328 -14845 -4462 21395
12882 21395 32309 10809 1545 -2300 -1457 -1533 9675 24817 7324 -8653 -2559 -28105 -23073
12869 -23073 -9883 10089 7331 -14036 -38496 -42695 -18198 8983 147 -20110 -25792 -10096
12857 -10096 -17686 -25687 -24934 -17906 -29105 -40753 -25500 -20181 -35926 -42737 -22772 -11960 -3913
12844 -3913 4271 -8378 -12007 -15870 -12512 20078 20606 16098 9466 -6393 1575 3555 9848 23523
12830 23523 38347 13100 -5277 -5463 -12530 -28201 -25256 -26766 -26168 -14129 -987 -2447 -10812
12817 -10812 -14193 6909 3651 6672 23168 21979 24582 36872 29632 21952 44217 39434 11355
12804 11355 -6229 -18211 -22151 -30071 -18536 -149 -8481 -8145 16532 6657 -18678 -12577 17366
$$ packed form
12895F856J4257j9191P482P837k0537k5532j79R667J4743l731o517J0383K5857
12882B1395J0914k1500r264l845Q43p6J1208J5142j7493j5977O094k5546N032
12869b3073J3190J9972k758k1367k4460m199K4497K7181q836k0257n682J5696
12857a0096p590q001P53P028j1199j1648J5253N319j5745o811J9965J0812Q047
12844c913Q184j2649l629l863L358L2590N28m508o632j5859P968J980O293J3675
12830B3523J4824k5247j8377j86p067j5671K945j510N98J2039J3142j460q365
12817a0812l381K1102l258L021J6496j189K603J2290p240p680K2265m783k8079
12804A1355j7584j1982l940p920J1535J8387q332L36K4677r875k5335O101K9943
$$ plain form
12791 17366 20871 12055 3591 -3281 9335 24709 25011 2531 -16057 -22348 -4320 3700 3307 5592
12777 5592 12574 18710 8008 16791 21549 13539 10131 13158 23319 16103 8193 2515 -4256 -2926
12763 -2926 9703 -1513 -14848 -1784 6119 -5242 8381 12656 -19193 -44670 -22203 -27598
12751 -27598 -42706 -46974 -35306 -6894 4420 2536 -2012 -5071 -12968 -13301 2698 -3976 -18609
12738 -18609 -25780 -24613 -14801 -10294 -13267 -5735 -22533 -28893 -20567 9898 -656 -39069 -53533
12725 -53533 -36004 -38202 -47304 -40941 -41865 -31569 -19893 -21435 -17056 -17865 -9686 19019 31287 16220
12711 16220 16367 -2673 2448 3713 -6908 -14808 -17732 -3148 2819 8958 3113 -283 -5290 -2954
12697 -2954 13007 13796 13141 16692 7974 15136 11307 26776 19626 10667 5788 -89 5480 1561 10173
$$ packed form
12791A7366L505q816q464o872J2616J5374L02k2480j8588o291J8028Q020l93K285
12777E592O982O136j0702Q783M758q010l408L027J0161p216p910n678o771J330
12763b926J2629j1216j3335J3064P903j1361J3623M275l1849k5477K2467n395
12751b7598j5108m268J1668K8412J1314j884m548l059p897l33J5999o674j4633
12738a8609p171J167R812M507k973P532j6798o360Q326L0465j0554l8413j4464
12725e3533J7529k198r102O363r24J0296J1676j542M379q09Q179K8705J2268j5067
12711A6220J47j9040N121J265j0621p900k924J4584N967O139n845l396n007K336
12697b954J5961P89o55L551q718P162l829J5469p150q959m879n877N569l919Q612
$$ plain form
12682 10173 13574 20353 22901 -2007 -9252 12485 22786 17834 8161 8186 16590 26465 32005 222
12668 222 8212 9428 -3912 -14420 -8826 14370 18765 1251 2984 -59 -4907 -12167 -20289 -7838
12654 -7838 -10416 -32066 -21116 -8041 -5968 -9825 -7979 1309 -5432 -5035 -10028 -7088 -17998 -20959
12640 -20959 -468 16113 31295 27197 11971 3107 -9140 3239 22475 23569 33775 20764
12628 20764 -15043 -18670 11631 14933 -18513 -19273 -20452 -8232 -7402 -8341 -16396 -15287 -22296 -31662
12614 -31662 -31589 -10601 3536 1757 4545 34 -10337 11244 6612 -8234 -16410 -15869 7320 24458
12600 24458 11678 2422 -20327 -36362 -28898 -20854 -10027 -24999 -21858 -3090 -27382 -27943 -4057
12587 -4057 4576 -17141 -17216 -17764 -11086 -9100 -13292 -6207 -6483 -14754 -11613 -15437 -10664 5152 9671
$$ packed form
12682A0173L401O779K548k4908p245K1737J0301m952r673K5Q404R875N540l1783
12668B22P990J216j3340j0508N594K3196M395j7514J733l043m848p260q122J2451
12654g838k578k1650J0950J3075K073l857J846R288o741L97m993K940j0910k961
12640b0959K0491J6581J5182m098j5226q864j2247J2379J9236J094J0206j3011
12628B0764l5807l627L0301L302l3446p60j179J2220Q30r39q055J109p009r366
12614c1662P3K0988J4137j779K788m511j0371K1581m632j4846q176N41K3189J7138
12600B4458j2780r256k2749j6035P464Q044J0827j4972L141J8768k4292n61K3886
12587d057Q633k1717p5n48O678J986m192P085k76q271L141l824M773J5816M519
$$ plain form
12572 9671 -2349 -9573 -5124 -12549 -31037 -18559 -28133 -43019 -19388 -8189 -1777 7159 20287
12559 20287 36274 27533 17429 -514 6510 34375 36347 23418 24047 30171 7763 6267 -9838
12546 -9838 -21678 -30287 -22409 -12806 11136 15183 3990 -12805 -16150 -5505 6606 974 -14213
12533 -14213 -33681 -21144 -7727 -13793 -353 21241 37634 25196 22238 34749 14492 14245
12521 14245 10197 14821 5989 -3360 11127 9857 16258 7691 10880 15965 -2349 -1200 -1461 -3389
12507 -3389 -15505 -5265 -4668 -1124 -15377 -20488 -9830 -28694 -26072 2038 15663 7721 5121
12494 5121 9885 24051 4075 10053 46813 44357 37501 14241 7640 15198 10567 7470 3573 -3193
12480 -3193 5388 26488 22791 15249 -3590 -16879 -7486 -1477 1031 -5257 -16960 -6139 -3324
$$ packed form
12572I671j2020p224M449p425j8488J2478r574j4886K3631J1199O412Q936J3128
12559B0287J5987q741j0104j7943P024K7865J972j2929O29O124k2408j496j6105
12546i838j1840q609P878R603K3942M047j1193j6795l345J0645J2111n632j5187
12533a4213j9468J2537J3417o066J3440K1594J6393j2438k958J2511k0257k47
12521A4245m048M624q832r349J4487j270O401q567L189N085j8314J149k61j928
12507c389j2116J0240N97L544j4253n111J0658j8864K622K8110J3625p942k600
12494E121M764J4166j9976N978L6760k456o856k3260o601P558m631l097l897o766
12480c193Q581K1100l697p542j8839j3289R393O009K508o288j1703J0821K815
$$ plain form
12467 -3324 -8925 -3896 17244 23278 28288 30368 17810 5108 19080 8423 14982 23815 21061
12454 21061 18814 16018 19859 25293 14321 10815 18735 17150 16325 29181 25251 15852 25128 11248
12440 11248 7813 19596 5583 -12268 -680 2319 12727 17096 17206 17960 8703 -11818 3467
12427 3467 -1411 -11765 -3688 -10490 -9251 -4998 -14183 -12293 -9286 3052 9408 30663 40764 14832
12413 14832 4484 6351 -1472 -25972 -43877 -43235 -36815 -34945 -35991 -29393 -21230 -12640 -20453 -20038
12399 -20038 -16619 -15986 13891 20682 17667 8968 -15770 -15165 12055 19957 22236 3450 17979 11654
12385 11654 -4750 -11664 -14429 -13696 4660 -13224 4937 14962 29992 11941 -7189 -157 -8601
12372 -8601 -28500 -38484 -24940 -6313 5392 -17002 -23300 -35460 -19072 -19452 -30723 -7027 10886
$$ packed form
12467c324n601N029K1140O034N010K080j2558j2702J3972j0657O559Q833k754
12454B1061k247k796L841N434j0972l506P920j585q25J2856l930r399R276j3880
12440A1248l435J1783j4013j7851J1588K999J0408M369J10P54r257k0521J5285
12427C467m878j0354Q077o802J239M253r185J890L007J2338O356K1255J0101k5932
12413A4832j0348J867p823k4500j7905O42O420J870j046O598Q163Q590p813M15
12399b0038L419O33K9877O791l015q699k4738O05K7220P902K279j8786J4529o325
12385A1654j6404o914k765P33J8356j7884J8161J0025J5030j8051j9130P032q444
12372h601j9899r984J3544J8627J1705k2394o298j2160J6388l80j1271K3696J7913
$$ plain form
12359 10886 -1089 -9376 -17895 -22260 -19728 -17247 -3739 -21292 -10173 1351 10260 18373 -5240
12346 -5240 -4845 19319 17979 -565 -2096 8885 -16010 -19519 -8125 3429 -3413 -5063 -528
12333 -528 -26752 -39052 -28919 10326 14746 13730 13351 21069 5073 5104 4551 7673 -2415 -5548
12319 -5548 2894 16137 1325 -14172 -20540 -1735 915 -4396 -34995 -43766 -38155 -49578 -46768
12306 -46768 -19414 -25939 -26711 -19464 -25049 -5381 -1304 1658 12468 28942 18959 460 -5035
12293 -5035 22205 29446 2716 -11769 -14304 -14342 -12629 -20085 -22547 -11121 269 -9046 -11355 8559
12279 8559 14769 22367 24771 14622 9305 -3003 -21849 -22934 -24047 -16352 -29326 -30022 3377 15705
12265 15705 7439 -4120 18838 35467 24055 10018 -2244 351 -146 -16621 -25432 -22602 11193
$$ packed form
12359A0886j1975q287q519m365K532K481J3508j7553J1119J1524Q909Q113k3613
12346e240L95K4164j340j8544j531J0981k4895l509J1394J1554o842j650M535
12333e28k6224j2300J0133L9245M420j016l79P718j5996L1n53L122j0088l133
12319e548Q442J3243j4812j5497o368J8805K650n311l0599q771N611j1423K810
12306d6768K7354o525p72P247n585J9668M077K962J0810J6474r983j8499n495
12293e035K7240P241k6730j4485k535l8J713p456k462J1426J1390r315k309J9914
12279H559O210P598K404j0149n317j2308j8846j085j113P695j2974o96L3399J2328
12265A5705q266j1559K2958J6629j1412j4037j2262K595m97j6475q811K830L3795
$$ plain form
12252 11193 -3053 -12501 -21535 -16804 -8211 14817 16072 -6704 -26515 -14406 14959 18423 3812
12239 3812 -1326 -11047 -35680 -34011 -23644 -15395 -18809 -24498 -22598 -29596 -48227 -46724 -34850 -25024
12225 -25024 -20876 -4766 -20464 -32955 11441 19610 -783 -7395 10761 5275 -435 -14802 -10593
12212 -10593 3841 -421 4663 3401 -528 -7106 -20739 -22482 -16608 979 -3590 -7691 1044 -5696
12198 -5696 3617 -9492 17074 22853 15124 7505 3951 14316 18073 6723 -4485 -4422 5041 21607
12184 21607 16315 9447 16576 15564 -4505 -19619 -20659 -16446 4307 8294 18156 22503 1432
12171 1432 -6090 17801 24706 17330 6389 16665 37282 58433 49398 65150 108074 141620 190378
12158 190378 237709 279344 271804 220827 151547 116233 110100 86465 70973 66668 59319 53136
$$ packed form
12252A1193j4246r448r034M731Q593K3028J255k2776j9811J2109K9365L464j4611
12239C812n138r721k4633J669J0367Q249l414n689J900o998j8631J503J1874R826
12225b5024M148J6110j5698j2491M4396Q169k0393o612J8156n486n710j4367M209
12212a0593J4434m262N084j262l929o578j3633j743N874J7587m569m101Q735o740
12198e696R313j3109K6566N779p729p619l554J0365L757j1350j1208O3R463J6566
12184B1607n292o868P129j012k0069j5114j040M213K0753L987R862M347k1071
12171A432p522K3891O905p376j0941J0276K0617K1151r035J5752M2924L3546M8758
12158A90378M7331M1635p540n0977o9280l5314o133k3635j5492m305p349o183
$$ plain form
12146 53136 59700 61291 39581 30020 28604 26478 33254 50559 40448 24728 18653 16069 37105
12133 37105 25064 17237 29238 29934 45334 69614 102951 120714 138952 184081 247122 286878
12121 286878 288062 245683 188512 118567 85011 67323 40362 26551 34938 37485 31332 19622
12109 19622 31061 42194 46201 44747 25116 16482 13931 28258 38614 39373 55180 61134 65507
12096 65507 49825 34670 20121 6677 -16239 -28685 -2855 1940 12937 38767 34687 27978
12084 27978 18268 6444 3006 8995 16159 15296 17584 17592 22514 44379 19568 -19926 -53267 -45568
12070 -45568 -38445 -28283 -34693 -19869 -2825 21146 32066 41347 13162 7803 2041 -11920 -33980
12057 -33980 -9451 6018 26923 3409 -9538 -6890 -12206 -15383 -15255 473 -6850 -21016 -15028
$$ packed form
12146E3136O564J591k1710r561j416k126O776J7305j0111j5720o075k584K1036
12133C7105j2041p827J2001O96J5400K4280L3337J7763J8238M5129O3041L9756
12121B86878J184m2379n7171o9945l3556j7688k6961j3811Q387K547o153j1710
12109A9622J1439J1133M007j454j9631q634k551J4327J0356P59J5807N954M373
12096F5507j5682j5155j4549j3444k2916j2446K5830M795J0997K5830m080o709
12084B7978r710j1824l438N989P164q63K288QM922K1865k4811l9494l3341P699
12070d5568P123J0162o410J4824J7044K3971J0920R281k8185n359n762j3961k2060
12057c3980K4529J5469K0905k3514j2947K648n316l177J28J5728p323j4166N988
$$ plain form
12044 -15028 3097 -3691 2889 27683 23277 9606 -5417 2935 25430 35498 22887 -5479
12032 -5479 -14606 -8273 -3411 -7151 25013 61793 37968 7631 -7772 -903 -9548 -21762 1413
12019 1413 1197 -4987 -10896 1456 11000 16290 21124 17767 11776 -9954 -24639 -24909 -24749 -26186 2521
12004 2521 36973 57218 58673 48488 27135 27727 27789 19967 471 -14415 22528 43072 12859
11991 12859 1986 -6325 -17721 4773 7032 23477 25766 14601 16125 11545 -7644 -20606 -40234
11978 -40234 -28687 -27150 -14892 -5682 -2743 3008 -1735 -14515 -18800 -3945 35403 52191 25289
11965 25289 16047 25375 11126 -2285 10032 10121 -6898 -18679 -11307 -8350 3351 3711 -20341
11952 -20341 -14974 -4762 -3674 -5063 -8499 -1739 -16807 -17184 -18965 -37214 -23359 -3900 4164
$$ packed form
12044a5028J8125o788O580K4794m406j3671j5023Q352K2495J0068j2611k8366
12032e479r127O333M862l740L2164L6780k3825l0337j5403O869q645j2214K3175
12019A413k16o184n909J2352R544N290M834l357n991k1730j4685k70J60j437K8707
12004B521L4452K0245J455j0185k1353N92O2p822j9496j4886L6943K0544l0213
11991A2859j0873q311j1396K2494K259J6445K289j1165J524m580j9189j2962j9628
11978d0234J1547J537J2258R210K939N751m743j2780m285J4855L9348J6788k6902
11965B5289r242R328j4249j3411J2317Q9j7019j1781P372K957J1701L60k4052
11952b0341N367J0212J088j389l436O760j5068l77j781j8249J3855J9459Q064
$$ plain form
11939 4164 -8808 -53698 -54691 -44985 -19439 -10538 -16898 -13048 -14619 -2650 -341 -11292 -17222 -7967
11925 -7967 10470 12495 24268 6826 -7224 -2456 24351 30990 5241 -23711 -32396 -34737 -12065
11912 -12065 -18266 -6827 -6007 -16081 -4245 9332 4029 -3572 13028 17882 -205 -767 -6379
11899 -6379 -10999 17736 32991 49950 26564 9160 26088 26552 5426 8849 10381 -3709 -5246
11886 -5246 -10588 2711 16055 12102 18927 15683 -6843 -26663 -25205 -29720 -21141 -15538 -31847
11873 -31847 -17949 -4620 -12540 -5280 -17731 -12084 -23074 -25143 -17620 3872 22548 5928 -492
11860 -492 2253 -6275 -15001 -10745 -7887 6939 8996 17513 32472 39354 44050 36080 12813 8616
11846 8616 16728 7903 -19108 -28312 -23355 -1013 -1344 23314 25305 16635 8392 10397 14117 27700
$$ packed form
11939D164j2972m4890r93R706K5546Q901o360L850j571J1969K309j0951n930R255
11925g967J8437K025J1773j7442j4050M768K6807O639k5749k8952q685k341K2672
11912a2065o201J1439Q20j0074J1836J3577n303p601J6600M854j8087n62n612
11899f379m620K8735J5255J6959k3386j7404J6928M64k1126L423J532j4090j537
11886e246n342J3299J3344l953O825l244k2526j9820J458m515Q579N603j6309
11873c1847J3898J3329p920P260j2451N647j0990k069P523K1492J8676j6620o420
11860d92K745q528q726M256K858J4826K057Q517J4959O882M696p970k3267m197
11846H616Q112q825k7011r204M957K2342l31K4658J991q670q243K005L720J3583
$$ plain form
11832 27700 18623 23133 9302 9138 -1302 -15601 1958 -109 -22729 -29361 -8430 -12892 -17080
11819 -17080 -9489 3684 2183 9222 5811 5775 -15239 -22561 -26149 -22951 -161 9712 14465 11572
11805 11572 -17971 627 21657 15307 1781 4342 -13059 -17987 -32582 -41164 -34951 -42266 -29176
11792 -29176 -21101 -29286 -42303 -38284 -14669 15265 35448 26495 31839 5895 -16415 14266 19959
11779 19959 -12833 -9573 2744 8114 -3522 -29559 -5586 16379 12403 2234 10469 36930
11767 36930 45089 26515 13051 -11160 9342 17043 14687 -286 9185 23284 40578 31843 8079
11754 8079 4017 -12708 3480 10987 8644 9217 8176 22537 20421 20506 21317 24956 10301 6196 16209
11739 16209 32025 41502 21320 20717 14272 -6195 -14629 -15883 -3830 39542 55797 37926 22805
$$ packed form
11832B7700r077M510j3831j64j0440j4299J7559k067k2620o632K0931m462m188
11819a7080P591J3173j501P039l411l6k1014p322l588L198K2790R873M753k893
11805A1572k9543J8598K1030o350j3526K561j7401m928j4595q582O213p315J3090
11792b9176Q075q185j3017M019K3615K9934K0183q953N344k5944k2310L0681N693
11779A9959l2792L260J2317N370j1636k6037K3973K1965l976j0169Q235K6461
11767C6930Q159j8574j3464k4211K0502P701k356j4973R471J4099J7294q735k3764
11754H079m062j6725J6188P507k343N73j041J4361k116Q5Q11L639j4655m105J0013
11739A6209J5816R477k0182o03o445k0467q434j254J2053M3372J6255j7871j5121
$$ plain form
11726 22805 -11472 -25615 -11315 -4601 -22981 -36730 -16893 -17755 -17385 -10950 1376 9909 -4230
11713 -4230 -17847 -27220 -52118 -33470 -31477 -14505 4966 27025 25202 6201 8279 -2607 3582
11700 3582 -24894 -47813 -55374 -53443 -31831 -23290 -25297 -30970 -24424 4515 21735 6819 -3053
11687 -3053 5266 -917 -4162 -16803 -3570 -16243 -35775 -10234 -2070 -6552 -13751 -28159 -31474
11674 -31474 -10130 3633 -4044 3552 -6119 -14657 -7672 10025 21463 24780 2503 4941 15536
11661 15536 16845 -3477 -16351 -11264 -1947 -4994 -15162 -1170 -8167 -12695 -4335 -11630 -32086
11648 -32086 -14606 -4030 -6304 4175 20820 19053 9697 -9086 -2405 12329 13479 19327 22853
11635 22853 24515 39187 33634 23552 17903 31343 36145 34659 20786 5057 -5679 19062 13241
$$ packed form
11726B2805l4277j4143J4300O714j8380j3749J9837q62L70O435J2326Q533j4139
11713d230j3617r373k4898J8648J993J6972J9471K2059j823j9001K078j0886O189
11700C582k8476k2919p561J931K1612Q541k007n673O546K8939J7220j4916r872
11687c053Q319o183l245j2641J3233j2673j9532K5541Q164m482p199j4408l315
11674c1474K1344J3763p677P596r671q538O985J7697J1438L317k2277K438J0595
11661A5536J309k0322j2874N087R317l047j0168J3992o997m528Q360p295k0456
11648c2086J7480J0576k274J0479J6645j767r356j8783O681J4734J150N848L526
11635B2853J662J4672n553j0082n649J3440M802j486j3873j5729j0736K4741n821
$$ plain form
11622 13241 2448 -14568 -12921 12993 11523 -5512 -8246 -11612 -5180 4963 8652 17337 -1535
11609 -1535 -1187 -8987 -24077 -19629 -11267 -3421 16139 31842 23989 15501 17337 25127 44457 49868
11595 49868 50227 41846 39103 23081 16812 1855 -11285 -5816 9595 7016 120 -6650 -1207 -3009
11581 -3009 -4824 -7628 -807 -10258 -12816 312 -6362 -16349 -12596 -13567 -9570 8473 33017 40625
11567 40625 20046 -1802 -8498 -7774 9857 17607 6501 -17153 -16133 -1627 22375 13583 25395
11554 25395 33306 33329 45824 51757 39564 32609 21865 -10639 -12418 -10560 -25698 -26389 -6049 -12390
11540 -12390 -7376 -15597 6231 9853 -1974 -24572 -31202 -12575 -14620 -14684 -26567 -5881 7357
11527 7357 -3497 -5650 14160 9575 -10413 -7744 2978 -2037 -11484 -27794 -28308 -42622 -35581
$$ packed form
11622A3241j0793j7016J647K5914j470j7035k734l366O432J0143L689Q685j8872
11609a535L48p800j5090M448Q362P846J9560J5703p853q488J836P790J9330N411
11595D9868L59q381k743j6022o269j4957j3140N469J5411k579o896o770N443j802
11581c009j815k804O821r451k558J3128o674r987L753r71L997J8043K4544P608
11567D0625k0579k1848o696P24J7631P750j1106k3654J020J4506K4002q792J1812
11554B5395P911K3J2495N933j2193o955j0744l2504j779J858j5138o91K0340o341
11540a2390N014q221K1828L622j1827k2598o630J8627k045o4j1883K0686J3238
11527G357j0854k153J9810m585j9988K669J0722n015r447j6310n14j4314P041
$$ plain form
11514 -35581 -8077 12960 28186 3615 2240 -2527 -12792 -2240 12865 19819 -932 -14186
11502 -14186 -9150 -3356 -3492 -10199 -377 1696 2449 -4304 10985 8841 3573 -15637 -7962 -2856
11488 -2856 -12891 -21729 -20260 8241 7107 15296 7570 3476 -4926 16769 12775 -5331 -1355 20727
11474 20727 23806 6365 -21245 -734 -11315 -35674 -37634 -34975 -45342 -29342 -5413 -9788
11462 -9788 -28699 -43829 -34232 -25336 -25197 -31003 -12955 2711 -1125 -21261 -16450 14010 8312
11449 8312 11227 22189 -2358 -25414 -34667 -17703 2448 22123 21067 14765 19327 15223 4030
11436 4030 -11207 -6645 25239 25830 34778 19342 13207 14332 1168 -4036 -2447 3257 11798 40317
11422 40317 58861 75384 63085 32741 34974 24304 16568 2292 -1209 9135 15449 2381
$$ packed form
11514c5581K7504K1037J5226k4571j375m767j0265J0552J5105O954k0751j3254
11502a4186N036N794j36o707R822K073P53o753J5289k144n268j9210P675N106
11488b856j0035q838J469K8501j134Q189p726m094q402K1695l994j8106L976K2082
11474B0727L079j7441k7610K0511j0581k4359j960K659j0367J6000K3929m375
11462i788j8911j5130R597Q896J39n806J8048J5666l836k0136M811L0460n698
11449H312K915J0962k4547k3056r253J6964K0151J9675j056o302M562m104j1193
11436D030j5237M562L1884N91Q948j5436o135J125j3164n204J589N704Q541K8519
11422D0317J8544J6523j2299l0344K233j0670p736j4276l501J0344O314j3068
$$ plain form
11410 2381 -8935 -6815 -24116 -42881 -22955 -15728 -16170 -241 16673 16221 7373 -6876 -1843
11397 -1843 10878 6190 -5840 11838 6579 -4315 2917 7741 16358 32085 15285 -698 17223
11384 17223 36055 30134 -4444 -8078 5968 18321 -240 -14031 -18242 -16575 1660 25304
11372 25304 31564 12684 1798 14713 -4745 -31383 -18470 -8370 -11531 -3034 -5078 -13993 -16378
11359 -16378 -20901 -28053 -20737 -3481 11730 13611 9745 19637 27383 28117 16862 -5857 -1413 15097
11345 15097 26338 21966 12048 19316 2676 1907 14197 7268 -6963 -736 11762 1863 -4829
11332 -4829 -17459 -6254 -22725 -35721 -26328 -3037 -19348 -28191 -25378 -16747 -2488 23068 63699
11319 63699 96979 77246 24104 9304 18343 14990 9764 6888 2951 8441 16969 21610 11941
$$ packed form
11410B381j1316K120j7301j8765J9926P227m42J5929J6914m52q848j4249N033
11397a843J2721m688j2030J7678n259j0894P232M824Q617J5727j6800j5983J7921
11384A7223J8832n921l4578l634J4046J2353j8561j3791m211J667J8235K3644
11372B5304O260j8880j0886J2915j9458k6638J2913J0100l161Q497k044q915k385
11359a6378m523p152P316J7256J5211J881l866R892P746P34j1255k2719M444J6510
11345A5097J1241m372r918P268j6640p69J2290o929j4231O227J2498r899o692
11332d829j2630J1205j6471j2996R393K3291j6311q843K813Q631J4259K5556M0631
11319F3699L3280j9733n3142j4800R039l353n226k876l937N490Q528M641r669
$$ plain form
11306 11941 4228 8237 7392 4635 9224 20993 23913 14689 22332 29773 40573 53055 39288 33764
11292 33764 50844 53452 45655 50775 50327 35463 24767 17022 18428 22865 23093 16195 14275 3079
11278 3079 -5830 -23736 -10405 -9884 -7144 838 425 106 6959 26372 29440 25287 26282 34403 19513
11263 19513 -9279 -16328 -4595 24118 36319 33110 27506 13453 15770 10721 4445 -7233 2202
11250 2202 17012 23648 18251 20397 11773 -2695 8852 25519 15622 5385 11611 20926 28240
11237 28240 27431 28891 28095 12662 5166 5283 -11745 -2893 17520 10422 28211 28317 10012 25820
11223 25820 20645 -4099 -12296 -2605 1327 678 -8054 -6274 -14415 -16324 14813 34627 35181 24788
11209 24788 43507 51768 47836 43733 41247 8668 14101 14893 6494 27966 20388 21340 11681 -5641
$$ packed form
11306A1941p713M009q45k757M589J1769K920r224P643P441J0800J2482j3767n524
11292C3764J7080K608p797N120m48j4864j0696p745J406M437K28o898j920j1196
11278C079q909j7906J3331N21K740P982m13l19O853J9413L068m153R95Q121j4890
11263A9513k8792p049J1733K8713J2201l209n604j4053K317n049o276j1678R435
11250B202J4810O636n397K146q624j4468J1547J6667r897j0237O226R315P314
11237B8240q09J460p96j5433p496J17j7028Q852K0413p098J7789J06j8305J5808
11223B5820n175k4744q197R691L932o49q732J780q141j909L1137J9814N54j0393
11209B4788J8719Q261l932m103k486l2579N433P92q399K1472p578R52r659j7322
$$ plain form
11195 -5641 -16401 -13100 -2681 18298 29638 8633 -13066 -22264 -7479 -6017 -8425 7830 36000
11182 36000 34145 42411 38093 50035 66046 46240 30906 34015 24418 7686 -3675 10820 28458
11169 28458 46931 28413 4852 -8571 -4887 8570 24810 33608 21586 15219 31566 43519
11157 43519 32758 48570 48062 47505 50608 51745 58193 43312 24068 24613 39518 52936 70115
11144 70115 72019 56383 36754 21219 16157 24600 39021 37765 13106 15277 31766 33017 33286
11131 33286 19940 9892 23873 33469 36394 45293 44050 51217 56130 60289 51875 24079 26145
11118 26145 27059 23047 12847 7947 7096 9588 31507 44927 31791 32101 37894 37096 35634 25181
11104 25181 15954 22466 40437 39275 29707 57559 81949 93681 85238 82284 98840 97993 97765 118862
$$ packed form
11195e641j0760L301J0419K0979J1340k1005k1699r198J4785J462k408J6255K8170
11182C6000j855Q266m318J1942J6011j9806j5334L109r597j6732j1361J4495J7638
11169B8458J8473j8518k3561j3423L684J3457J6240Q798j2022o367J6347J1953
11157D3519j0761J5812n08n57L103J137O448j4881j9244N45J4905J3418J7179
11144G0115J904j5636j9629j5535n062Q443J4421j256k4659K171J6489J251K69
11131C3286j3346j0048J3981R596K925Q899j243P167M913M159q414k7796K066
11118B6145R14m012j0200m900q51K492K1919J3420j3136L10N793p98j462j0453
11104B5181r227O512J7971j162r568K7852K4390J1732q443k954J6556q47k28K1097
$$ plain form
11090 118862 147855 194584 255213 304026 397898 542510 768183 1010650 1218508 1447578
11080 1447578 1585360 1521546 1359193 1177375 934527 701117 538760 428833 373871 321815
11070 321815 281804 244176 231287 216377 186630 189826 203106 201652 195933 183774 179124 150073
11058 150073 116163 124555 123396 118184 108514 110463 108802 88100 67669 80011 114298 115414 79680
11045 79680 59786 82855 88330 89810 79108 85010 93528 99765 97405 100202 94795 110390 106409
11032 106409 91657 78489 78134 76639 74589 85858 78930 79196 57805 50197 50914 55504 56572 30053
11018 30053 22664 15562 11853 11710 39790 37870 31130 41147 33277 18329 32977 52795 49370
11005 49370 43343 58152 67715 67288 64427 56470 63969 77574 83929 93126 91556 81932 82092 62388
$$ packed form
11090A18862K8993M6729O0629M8813R3872J44612K25673K42467K07858K29070
11080A447578J37782o3814j62353j81818k42848k33410j62357j09927n4962n2056
11070C21815m0011l7628j2889j4910k9747L196J3280j454n719j2159m650k9051
11058A50073l3910Q392j159n212r670J949j661k0702k0431J2342L4287J116l5734
11045G9680j9894K3069N475J480j0702N902Q518O237k360K797n407J5595l981
11032A06409j4752j3168l55j495k050J1269o928K66k1391p608P17M590J068k6519
11018C0053p389p102l709j43K8080j920o740J0017p870j4948J4648J9818l425
11005D9370o027J4809R563m27k861p957P499J3605O355R197j570r624J60j9704
$$ plain form
10991 62388 66800 65469 67445 50504 54928 69504 71480 59815 62798 72243 77628 84510 68666
10978 68666 32905 29358 61765 55444 56581 60259 80105 79749 82132 74987 75763 81015 89508 74506
10964 74506 50959 33974 41878 62397 62958 54486 60790 47663 41978 52384 75352 75077 83202
10951 83202 110348 149885 153936 157165 140698 112529 97420 81786 82578 88109 54981 27467 41580
10938 41580 52332 47549 48186 47584 40909 70003 93724 112974 141620 196409 239821 274909 291861
10925 291861 274871 262816 254102 197835 149752 104491 105011 66771 48674 81832 89408 94444
10913 94444 78423 70366 70903 64805 59216 46544 58059 69814 64254 59938 57368 49258 71767
10900 71767 76026 40523 24663 52146 76043 85523 88861 95137 105943 107862 122437 112996 102300
$$ packed form
10991F2388M412j331J976j6941M424J4576J976j1665K983R445N385O882j5844
10978F8666l5761l547L2407o321J137L678J9846l56K383p145P76N252Q493j5002
10964G4506k3547j6985P904K0519N61q472O304j3127n685J0406K2968k75Q125
10951H3202K7146L9537M051L229j6467k8169j5109j5634P92N531l3128k7514J4113
10938D1580J0752m783O37o02o675K9094K3721J9250K8646N4789M3412L5088J6952
10925B91861j6990j2055q714n6267m8083m5261N20l8240j8097L3158P576N036
10913I4444j6021q057N37o098n589j2672J1515J1755n560m316k570q110K2509
10900G1767M259l5503j5860K7483K3897R480L338O276J0806J919J4575r441j0696
$$ plain form
10887 102300 102504 102834 104163 105893 127101 121735 108884 100557 107588 103809 104941 110330 108238 127692
10873 127692 140028 113481 100684 99245 101255 118225 108743 89172 76141 69207 48563 40639
10861 40639 20591 37289 33791 29291 16179 -3028 12313 22956 4415 4517 7619 8774 11069
10848 11069 25793 36050 37033 34841 38043 44024 37313 44767 75073 79740 75113 60262 68419 84741
10834 84741 95292 101818 94892 94712 92334 68812 55913 83009 87944 74479 57672 64249 84425
10821 84425 75883 81167 103392 101189 106251 106878 119488 154656 182254 194177 206794 243091 279358
10808 279358 285787 291272 328950 396086 507220 657010 868375 1080089 1226920 1403755 1553116
10797 1553116 1564377 1587555 1440869 1222686 1124929 960287 815320 774810 771699 800201 798944
$$ packed form
10887A02300K04L30J329J730K1208n366j2851q327P031l779J132N389k092J9454
10873A27692J2336k6547j2797j439K010J6970r482j9571j3031o934k0644p924
10861D0639k0048J6698l498m500j3112j9207J5341J0643j8541J02L102J155K295
10848A1069J4724J0257R83k192L202N981o711P454L0306M667m627j4851Q157J6322
10834H4741J0551O526o926j80k378k3522j2899K7096M935j3465j6807O577K0176
10821H4425q542N284K2225k203N062O27J2610L5168K7598J1923J2617L6297L6267
10808B79358O429N485L7678O7136J11134J49790K11365K11714J46831J76835J49361
10797A553116J1261K3178j46686k18183r7757j64642j44967m0510l111K8502j257
$$ plain form
10786 798944 745316 691106 661378 642752 625015 634431 628343 617428 611794 601719 596413 614739
10774 614739 621726 605496 609810 596598 594285 594368 586060 591389 600847 593382 593137 590907 571637 559475
10760 559475 572180 578371 585866 575632 564221 556830 565407 598347 586378 560459 566366 582339
10748 582339 595107 632243 639899 666942 664239 673275 683086 699013 717961 749930 780522 846985
10736 846985 937924 1055060 1230423 1481643 1853276 2321758 2675990 2780321 2752572 2493377
10726 2493377 2044438 1679514 1435578 1290211 1204898 1181207 1191629 1222056 1239037 1237105 1233936
10715 1233936 1236356 1249623 1266326 1290221 1332408 1388504 1434577 1470590 1539160 1616916 1743704
10704 1743704 1868565 2016406 2192000 2382005 2606397 2856103 3173817 3625670 4256530
$$ packed form
10786G98944n3628n4210k9728j8626j7737R416o088j0915n634j0075n306J8326
10774F14739O987j6230M314j3212k313Q3q308N329R458p465k45k230j9270j2162
10760E59475J2705O191P495j0234j1411p391Q577L2940j1969k5919N907J5973
10748E82339J2768L7136P656K7043k703R036R811J5927J8948L1969L0592O6463
10736H46985R0939J17136J75363K51220L71633M68482L54232J04331k7749k59195
10726B493377m48939l64924k43936j45367q5313k3691J0422L0427J6981j932l169
10715A233936K420J3267J6703K3895M2187N6096M6073L6013O8570P7756J26788
10704A743704J24861J47841J75594J90005K24392K49706L17714M51853O30860
$$ plain form
10695 4256530 4922310 5358800 5682043 6213363 7045852 8001643 8810940 9644484 10522265
10686 10522265 11129886 11727519 12712243 13986866 15821920 18623812 22706518 28828940
10678 28828940 38117328 52535890 75541129 111196959 157412579 201284486 237027212
10671 237027212 271509690 284264519 260941239 230479243 196759341 152020535 112684347
10664 112684347 86000921 68668752 57628728 50366957 45305878 41655847 38891337
10657 38891337 36637101 34748825 33188438 31920238 30582344 29119407 27785882 26455793
10649 26455793 24986208 23557743 22284303 21073088 19944846 18966768 18117487 17371775
10641 17371775 16739567 16168497 15662313 15199953 14797255 14401672 14006757 13625651 13243555
$$ packed form
10695D256530O65780M36490L23243N31320Q32489R55791Q09297Q33544Q77781
10686A0522265O07621N97633R84724J274623J835054K801892M082706O122422
10678B8828940R288388J4418562K3005239L5655830M6215620M3871907L5742726
10671B37027212L4482478J2754829k3323280l0461996l3719902m4738806l9336188
10664A12684347k6683426j7332169j1040024p261771n061079l650031k764510
10657C8891337k254236j888276j560387j268200j337894j462937j333525j330089
10649B6455793j469585j428465j273440j211215j128242r78078q49281p45712
10641A7371775o32208n71070n06184m62360m02698l95583l94915l81106l82096
$$ plain form
10632 13243555 12878329 12524650 12187583 11894593 11581910 11295601 11006329 10740081 10475363
10623 10475363 10231751 9966788 9720684 9493953 9281306 9074130 8881071 8638534 8397129
10614 8397129 8201178 8001010 7801793 7615502 7418294 7213827 7031358 6867476 6736403
10605 6736403 6611594 6466935 6355149 6230792 6123644 6046041 5946032 5846097 5778380 5696847
10595 5696847 5608100 5518949 5443473 5364678 5273093 5179841 5084130 4973539 4837600 4702881 4598676
10584 4598676 4496032 4414815 4355540 4275368 4180586 4079620 4001125 3923045 3881591 3830718 3747857
10573 3747857 3664240 3609282 3541450 3462986 3384931 3329548 3297084 3261846 3216043 3197893 3157809
10562 3157809 3107434 3097077 3069890 3042686 3027585 3012818 3009905 3038449 3085092 3197709 3394520
$$ packed form
10632A3243555l65226l53679l37067k92990l12683k86309k89272k66248k64718
10623A0475363k43612k64963k46104k26731k12647k07176j93059k42537k41405
10614H397129j95951k00168j99217j86291j97208k04467j82469j63882j31073
10605F736403j24809j44659j11786j24357j07148p7603j00009r9935o7717q1533
10595E696847q8747q9151p5476p8795r1585r3252r5711j10591j35939j34719j04205
10584D598676j02644q1217n9275q0172r4782j00966p8495p8080m1454n0873q2861
10573C747857q3617n4958o7832p8464p8055n5383l2464l5238m5803j8150m0084
10562C157809n0375j0357k7187k7204j5101j4767k913K8544M6643J12617J96811
$$ plain form
10551 3394520 3755354 4237906 4834230 5570285 6292016 6936522 7494642 7815221 7901431 7786673
10541 7786673 7412484 6775741 6074255 5305634 4583053 4047977 3676869 3417883 3239189
10532 3239189 3117314 3016980 2938432 2870185 2784900 2704725 2624104 2574730 2530067 2484943 2414295
10521 2414295 2332810 2281864 2248403 2198949 2119343 2058613 2038261 1979518 1955548 1950163 1879808
10510 1879808 1832554 1824827 1808650 1787619 1729113 1681813 1637940 1601279 1597765 1585152 1545584 1514678
10498 1514678 1486585 1467361 1454374 1439127 1411778 1379947 1371183 1366517 1336852 1308729 1292246 1277450
10486 1277450 1263378 1251094 1250141 1252798 1247579 1225266 1228960 1240205 1267515 1343497 1412997 1449474
10474 1449474 1486733 1489358 1446241 1432804 1382601 1319688 1242857 1158069 1076183 993806 952121
$$ packed form
10551C394520L60834M82552N96324P36055P21731O44506N58120L20579Q6210j14758
10541G786673l74189o36743p01486p68621p22581n35076l71108k58986j78694
10532C239189j21875j00334p8548o8247q5285q0175q0621m9374m4663m5124p0648
10521B414295q1485n0946l3461m9454p9606o0730k0352n8743k3970n385p0355
10510A879808m7254p727j6177k1031n8506m7300m3873l6661l514j2613l9568l0906
10498A514678k8093j9224j2987j5247k7349l1831q764m666k9665k8123j6483j4796
10486A277450j4072j2284r53K657n219k2313L694J1245K7310P5982O9500L6477
10474A449474L7259K625m3117j3437n0203o2913p6831q4788q1886q2377m1685
$$ plain form
10463 952121 912348 889281 855257 820974 810616 801649 798062 788584 764897 751121 717767 698175
10451 698175 687023 670095 675893 686453 698504 680530 650363 641651 622549 624294 599071 568035
10439 568035 571299 594912 595835 584491 580289 563524 553314 510601 486862 499987 492866 479833
10427 479833 504229 519286 514382 503466 483186 485794 487848 490607 480173 452725 441050 423055
10415 423055 425151 440620 480215 497001 502634 505649 546287 599642 631400 669786 706483 696390
10403 696390 664337 631200 589106 547632 472511 429995 410363 386636 359253 320812 308855
10392 308855 336518 331696 314066 295447 307091 322270 344134 342819 335754 338804 338639 312895 281135
10379 281135 272082 312009 379198 461823 500105 517290 535856 489047 415559 362388 314746 293207
$$ packed form
10463I52121l9773k3067l4024l4283j0358q967l587r478k3687j3776l3354j9592
10451F98175j1152j6928N798J0560J2051j7974l0167q712j9102J745k5223l1036
10439E68035L264K3613R23j1344m202j6765j0210m2713k3739J3125p121j3033
10427D79833K4396J5057m904j0916k0280K608K054K759j0434k7448j1675j7995
10415D23055K096J5469L9595J6786N633L015M0638N3355L1758L8386L6697j0093
10403F96390l2053l3137m2094m1474p5121m2516j9632k3727k7383l8441j1957
10392C08855K7663m822j7630j8619J1644J5179K1864j315p065L050j65k5744l1760
10379B81135r053L9927O7189Q2625L8282J7185J8566m6809p3488n3171m7642k1539
$$ plain form
10367 293207 278823 271533 292011 298561 295834 263042 232692 223424 234786 229638 205918 197344 191757
10354 191757 190356 192338 186298 200887 212226 195084 181188 179769 169913 140098 141208 150950 161477
10341 161477 165095 179506 191610 187487 171438 165462 131852 129671 123176 135570 138872 166323 179657
10328 179657 163322 159477 161939 136514 140264 162260 172993 168200 160155 139906 131741 118969 109228
10315 109228 112071 115426 112639 116691 115859 103303 99041 84876 84208 90801 94011 94007 62297 34750
10301 34750 41687 63641 90499 85354 66347 57943 58196 63991 65054 45812 57611 70734 79986
10288 79986 75282 74208 53712 56018 50201 57041 62216 61714 93170 121911 145815 140089 106720
10275 106720 110068 107286 116890 135289 148235 139840 163608 176979 185163 192639 196927 211334 259261
$$ packed form
10367B93207j4384p290K0478O550k727l2792l0350r268J1362n148k3720q574n587
10354A91757j401J982o040J4589J1339j7142j3896j419r856k9815J110R742J0527
10341A61477L618J4411J2104m123j6049n976l3610k181o495J2394L302K7451J3334
10328A79657j6335l845K462k5425L750K1996J0733m793q045k0249q165j2772r741
10315A09228K843L355k787M052q32j2556m262j4165o68O593L210ml1710k7547
10301C4750O937K1954K6858n145j9007q404K53N795J063j9242J1799J3123R252
10288G9986m704j074k0496K306n817O840N175n02L1456K8741K3904n726l3369
10275A06720L348k782R604J8399J2946q395K3768J3371Q184P476M288J4407M7927
$$ plain form
10262 259261 325445 415529 578059 785127 1040426 1270928 1443451 1563758 1534478 1404660
10252 1404660 1214791 963876 742134 575284 465249 390329 335342 302852 289551 259805
10242 259805 237492 226617 228895 216409 222327 208668 196162 191420 186925 172398 159255 156670
10230 156670 136372 125533 116902 140436 161701 140216 131629 136303 137987 122929 79756 61397
10218 61397 87018 84181 69734 70861 80416 80768 88586 98681 92600 92976 108200 99222 106052 98096
10204 98096 77894 81399 102243 98854 113792 111579 111786 100653 90833 81001 75658 79683 69749 65428
10190 65428 60131 47459 57775 56258 41757 47104 68625 76242 73936 82309 90373 92225 93596
10177 93596 88100 72585 59281 53149 52625 64380 61099 38879 33262 21817 29445 30355 51261
$$ packed form
10262B59261O6184R0084J62530K07068K55299K30502J72523J20307k9280j29818
10252A404660j89869k50915k21742j66850j10035p4920n4987l2490j3301k9746
10242B59805k2313j0875K278j2486N918j3659j2506m742m495j4527j3143k585
10230A56670k0298j0839q631K3534K1265k1485q587M674J684j5058m3173j8359
10218F1397K5621k837j4447J127R555L52P818J0095o081L76J5224q978O830p956
10204I8096k0202L505K0844l389J4938k213K07j1133r820r832n343M025r934m321
10190F5428n297j2672J0316j517j4501N347K1521P617k306Q373Q064J852J371
10177I3596n496j5515j3304o132n24J1755l281k2220n617j1445P628R10K0906
$$ plain form
10164 51261 57541 42774 46046 35643 30447 39413 47819 38962 28126 33693 54715 63793 75138
10151 75138 71692 74874 71438 70487 80487 50597 41246 45872 53598 45805 42835 42595 59885 69486
10137 69486 56595 34553 55344 78018 111062 112523 103822 113721 103480 86045 78726 80878 68096
10124 68096 53718 55295 64390 53834 44752 47594 59717 43413 31926 11648 -3446 8107
10112 8107 20389 13109 24751 46857 68635 44611 29756 36828 35065 27236 19947 33429 68850
10099 68850 56350 32998 34792 30132 29881 42751 31923 17275 22741 26992 26053 15773 21400
10086 21400 32289 18883 27017 39162 33795 30933 43864 58084 28658 12660 16803 15844 16530
10073 16530 20073 21183 25647 7995 -7429 145 17508 33707 33156 44850 50803 70634 56145
$$ packed form
10164E1261O280j4767L272j0403n196Q966Q406q857j0836N567K1022R078J1345
10151G5138l446L182l436r51J0000k9890r351M626P726p793k970k40J7290R601
10137F9486j2891k2042K0791K2674L3044J461q701R899j0241j7435p319K152j2782
10124F8096j4378J577R095j0556r082K842J2123j6304j1487k0278j5094J1553
10112H107J2282p280J1642K2106K1778k4024j4855P072j763p829p289J3482L5421
10099F8850j2500k3352J794m660k51J2870j0828j4648N466M251r39j0280N627
10086B1400J0889j3406Q134J2145n367k862J2931J4220k9426j5998M143r59O86
10073A6530L543J110M464j7652j5424P574J7363J6199n51J1694N953J9831j4489
$$ plain form
10060 56145 36265 25939 19155 24036 35184 36138 44867 67006 48234 5308 -8078 -2343 125
10047 125 7439 7816 6699 2823 1702 12509 7191 5584 2170 -5451 -11520 -5931 -606 8887 15437
10032 15437 9858 5481 5529 3171 7315 8630 20159 34477 35885 30473 12204 2306 1214 26327
10018 26327 20943 24090 37487 33470 31443 7345 2507 -5886 -19151 -7369 4677 9785 17087
10005 17087 20264 16329 61 -4457 15850 32305 33856 24784 26412 16505 1062 -3870 5282
9992 5282 12270 18749 10268 9750 8053 3407 17928 34147 22599 15743 4607 -11866 -23352 -4574
9978 -4574 18504 5262 6970 16640 31602 55472 43385 28694 10526 3760 25366 47189 67156
9965 67156 36042 20227 28575 43238 55686 53097 49161 58915 65737 55348 28178 17264 16702
$$ packed form
10060E6145j9880j0326o784M881J1148R54Q729K2139j8772m2926j3386N735K468
10047A25P314L77j117l876j121J0807n318j607l414p621o069N589N325R493O550
10032A5437n579m377M8k358M144J315J1529J4318J408n412j8269r898j092K5113
10018B6327n384L147J3397m017k027k4098m838q393j3265J1782J2046N108P302
10005A7087L177l935j6268m518K0307J6455J551r072J628r907j5443m932R152
9992E282O988O479q481n18j697m646J4521J6219j1548o856j1136j6473j1486J8778
9978d574K3078j3242J708R670J4962K3870j2087j4691j8168o766K1606K1823J9967
9965F7156l1114j5815Q348J4663J2448k589l936R754O822j0389k7170j0914n62
$$ plain form
9952 16702 -9664 -18881 -21499 416 1637 -19047 -11672 7589 23726 48133 61494 36771 21733
9939 21733 315 6163 34153 14512 3460 9234 27157 30941 30218 7052 -4505 -14414 -17299
9926 -17299 -18711 -6485 -973 6560 12128 22756 28504 10628 -8365 469 4671 -7274 -8996
9913 -8996 -13820 -15519 -14336 -3789 -5937 1811 7350 17181 26063 26307 21281 6596 411 10960
9899 10960 14046 26564 46820 52890 47563 51224 57473 40763 33155 30252 39560 39077 25875 -7152
9885 -7152 -36319 -27799 -20701 160 15048 3089 3341 -3399 -31375 -55023 -46498 -32307 7192
9872 7192 18482 -8679 -20527 -8636 1776 9385 29563 23143 23415 4573 -31339 -50082 -55764
9859 -55764 -16686 21025 10607 3962 -14594 -10679 5910 10904 16975 19968 36511 31369 27363
$$ packed form
9952A6702k6366r217k618K1915J221k0684P375J9261J6137K4407J3361k4723j5038
9939B1733k1418N848K7990j9641j1052N774J7923L784p23k3166j1557r909k885
9926a7299j412J2226N512P533N568J0628N748j7876j8993Q834M202j1945j722
9913h996m824j699J183J0547k148P748N539R831Q882K44n026j4685o185J0549
9899A0960L086J2518K0256O070n327L661O249j6710p608k903R308m83j3202l3027
9885g152k9167Q520P098K0861J4888j1959K52o740k7976k3648Q525J4191L9499
9872G192J1290k7161j1848J1891J0412P609K0178o420K72j8842l5912j8743n682
9859e5764L9078L7711j0418o645j8556L915J6589M994O071K993J6543n142m006
$$ plain form
9846 27363 21585 5992 11326 3413 -1987 9183 22217 22515 13678 -13923 -16015 -9970 10952 44227
9832 44227 41527 15531 2268 2021 -7181 -12703 -14484 -12600 -11514 4581 11834 7543 10224 25705
9818 25705 38449 35391 31037 24402 26564 24487 25010 19104 23433 8271 -11236 -17059 -13723 -8984
9804 -8984 -6057 -9973 -16458 2322 21394 29435 25824 38144 26481 27325 33537 23199 30643 15497
9790 15497 21751 47650 42609 31992 15277 18245 15581 6994 -4354 -5312 -15419 -24785 -13360
9777 -13360 -2449 5544 11932 17182 23062 13554 23777 39043 14863 5275 23374 30607 15709
9764 15709 3872 -12170 4098 25122 8321 -2813 9819 9617 3812 6943 1430 -12735 -12026
9751 -12026 -21654 -20953 -7409 3034 -14784 -14684 -6544 -12794 -7726 -478 -2232 -16070 -22339 -21378
$$ packed form
9846B7363n778j5593N334p913n400J1170J3034K98q837k7601k092O045K0922L3275
9832D4227k700k5996j3263k47r202n522j781J884J086J6095P253m291K681J5481
9818B5705J2744l058m354o635K162k077N23n906M329j5162j9507n823L336M739
9804h984K927l916o485J8780J9072Q041l611J2320j1663Q44O212j0338P444j5146
9790A5497O254K5899n041j0617j6715K968k664q587j1348r58j0107r366J1425
9777a3360J0911P993O388N250N880r508J0223J5266k4180r588J8099P233j4898
9764A5709j1837j6042J6268K1024j6801j1134J2632k02n805L131n513j4165P09
9751a2026r628P01J3544J0443j7818J00Q140o250N068P248j754j3838o269R61
$$ plain form
9737 -21378 -22022 -32755 -31917 -37560 -19114 -9265 -14975 -14842 -7265 10509 14448 9471 20248 10429
9723 10429 173 -8849 -19530 5682 11461 -1304 -15741 -6671 479 -4358 -17307 -21234 -21796
9710 -21796 -23963 -22692 -39129 -33755 -32498 -41474 -50350 -44424 -28780 -35627 -7840 15549 3695
9697 3695 -15565 -9862 19200 17582 -7135 -21250 -23978 -35271 -34192 -14530 -12466 -1226 -7737
9684 -7737 -13355 -11872 -1959 4435 11666 7873 -7954 -5313 13359 19106 9705 -12660 -27308 -7062
9670 -7062 10549 19707 13241 8975 7681 -19667 -20612 -9722 -10992 -33849 -56744 -44698 -1413
9657 -1413 -804 -2582 34298 38171 17411 10313 3895 1729 9663 10086 -13898 -23423 -4786 -1681
9643 -1681 3307 8918 -483 6291 25028 26995 24140 5522 -3647 4212 671 1808 18517 8280
$$ packed form
9737b1378o44j0733Q38n643J8446R849n710J33P577J7774L939m977J0777r819
9723A0429j0256r022j0681K5212N779j2765j4437R070P150m837j2949l927n62
9710b1796k167J271j6437N374J257q976q876N926J5644o847K7787K3389j1854
9697C695j9260N703K9062j618k4717j4115k728j1293J079J9662K064J1240o511
9684g737n618J483R913O394P231l793j5827K641J8672N747r401k2365j4648K0246
9670g062J7611R158o466m266j294k7348r45J0890j270k2857k2895J2046M3285
9657a413O09j778L6880L873k0760p098o418k166P934M23k3984r525J8637L105
9643a681M988N611r401O774J8737J967k855j8618r169P859l541J137J6709j0237
$$ plain form
9629 8280 11842 9768 10476 25604 21326 24189 21065 13484 5222 8759 17613 19570 15658 3325 2077
9614 2077 1221 -11450 2563 3320 -5174 -20022 -26273 -8678 12252 7742 9227 24385 24678 18021
9600 18021 13722 -5266 -16446 -18253 -10002 -6951 -5452 27691 26327 -6248 1440 462 -9012 -16488
9586 -16488 -16028 -8316 -12905 -4258 -13775 -11803 21817 30934 19292 -14051 -17964 2758 13531 22205
9572 22205 37854 39203 15868 11689 6079 13424 14716 3445 -14094 -34933 -26801 -43397 -32009
9559 -32009 -23851 -9111 6204 24157 31540 45469 41943 27185 1126 -13937 -24655 -13673
9547 -13673 31178 42087 23812 14887 33396 8842 -27330 -43941 -30086 -15643 -16761 -9520
9535 -9520 -11077 -8865 -15630 -16801 13264 24702 -1454 -19667 -13823 10588 29868 34786 33477
$$ packed form
9629H280L562k074P08J5128m278K863l124p581q262L537Q854J957l912j2333j248
9614B077q56j2671J4013P57q494j4848o251J7595K0930m510J485J5158K93o657
9600A8021m299j8988j1180j807Q251L051J499L3143j364l2575P688r78r474p476
9586a6488M60P712m589Q647r517J972L3620R117j1642l3343l913K0722J0773Q674
9572B2205J5649J349k3335m179n610P345J292j1271j7539k0839Q132j6596J1388
9559c2009Q158J4740J5315J7953P383J3929l526j4758k6059j5063j0718J0982
9547a3673M4851J0909j8275q925J8509k4554l6172j6611J3855J4443j118P241
9535i520j557K212o765j171L0065J1438k6156j8213N844K4411J9280M918j309
$$ plain form
9522 33477 16944 -9485 -10340 14150 26879 15799 8395 -8187 8999 10892 12382 4295 8490
9509 8490 6767 -4355 4455 11213 20718 26875 15598 -7639 -5198 -805 14791 21043 22452 24950
9495 24950 9796 1671 14515 27416 25442 -2362 1479 13133 -1258 -1481 10375 -5112 -9163
9482 -9163 7289 23325 29743 18446 -2334 -10381 -22908 -34102 -15244 5349 22424 18096 12763
9469 12763 23678 23511 29293 6248 1679 12157 11382 27507 41076 42663 36441 20229 23660 18403
9455 18403 -11331 -19005 -15661 -12147 -17354 -21117 -13744 -2695 -6680 -3280 13955 14328 -17747 -30311
9441 -30311 -21459 -23733 -31157 -27028 -19936 -5920 6641 17070 -4563 -26017 -31397 -26438 -37167
9428 -37167 -43568 -30182 -20832 -12552 -23615 -15867 -14129 -27998 -20059 -12378 -3129 -8955 -9589 15735
$$ packed form
9522C3477j6533k6429q55K4490J2729j1080p404j6582J7186J893J490q087M195
9509H490j723j1122Q810O758R505O157j1277k3237K441M393J5596O252J409K498
9495B4950j5154q125J2844J2901j974k7804L841J1654j4391k23J1856j5487m051
9482i163J6452J6036O418j1297k0780q047j2527j1194J8858K0593J7075m328n333
9469A2763J0915j67N782k3045m569J0478p75J6125J3569J587o222j6212L431n257
9455A8403k9734p674L344L514n207l763P373J1049l985L400J7235L73l2075j2564
9441c0311Q852k274p424M129P092J4016J2561J0429k1633k1454n380M959j0729
9428c7167o401J3386R350Q280j1063P748J738j3869P939P681R249n826o34K5324
$$ plain form
9414 15735 17359 15786 7894 -411 -1293 -3106 -367 -1446 1844 8857 7945 -10161 -14033 -40354 -35882
9399 -35882 -13819 -3149 -1046 -6266 -105 14601 32647 11494 2131 -9837 -26422 -26256 -37518
9386 -37518 -20162 -13066 -13668 -5959 28034 48659 23874 17980 15851 -1779 -10121 -17107 -4332
9373 -4332 4388 16555 16066 13978 17841 -532 -10621 -8096 4866 25506 37965 23189 -4307
9360 -4307 -29618 -7194 328 5466 7604 -11460 -24868 -22993 -36612 -8683 -3678 -7953 -10422
9347 -10422 -4263 1736 8508 11652 32220 23704 -12617 -15071 -12303 -31385 -27764 -26529 -28314 -20638
9333 -20638 -411 4951 11757 19291 30574 29127 19272 9409 1888 10761 20139 -2122 -13551 13821
9319 13821 19400 7880 10867 15379 30114 13292 2286 24124 12603 -14629 -18292 -30734 -30657
$$ packed form
9414A5735J624j573p892q305q82j813K739j079L290P013r12j8106l872k6321M472
9399c5882K2063J0670K103n220O161J4706J8046k1153r363j1968j6585J66j1262
9386c7518J7356P096o02P709L3993K0625k4785n894k129j7630q342o986J2775
9373d332Q720J2167m89k088L863j8373j0089K525J2962K0640J2459j4776k7496
9360d307k5311K2424P522N138K138j9064j3408J875j3619K7929N005m275k469
9347a0422O159N999O772L144K0568q516l6321k454K768j9082L621J235j785P676
9333b0638K0227N362O806P534J1283j447r855r863p521Q873R378k2261j1429K7372
9319A3821N579j1520K987M512J4735j6822j1006K1838j1521k7232l663j2442P7
$$ plain form
9306 -30657 -5587 -829 2814 12924 -4093 5545 8522 -505 9618 7385 5901 24264 10157
9293 10157 -14713 -8173 8024 -17895 -25122 -4594 2164 -8671 -2386 25948 30543 8132 -7494
9280 -7494 -11596 -3692 -16729 -20158 -9005 5623 13890 3758 -24135 -25672 -18379 -14034 -10144 -10003
9266 -10003 15405 17042 -4812 -21466 -31415 -20768 -8376 -3283 -2666 6366 28899 32023 29190
9253 29190 17354 6097 -7256 -15443 13546 21817 13183 18206 18171 28255 41886 18897 -9018
9240 -9018 -33880 -42866 -28334 -34157 -37035 -14738 23337 53168 56682 48212 24225 8766 -17841
9227 -17841 -21072 -27361 -45163 -32308 -10947 -18311 -4948 518 1007 6317 10000 -8318 1727
9214 1727 12352 6765 -6266 -11753 -8382 -22543 -42278 -37998 -16344 6777 6896 11737 3504 -20475
$$ packed form
9306c0657K5070M758L643J0110j7017R638K977r027J0123k233j484J8363j4107
9293A0157k4870O540J6197k5919p227K0528O758j0835O285K8334M595k2411j5626
9280g494m102P904j3037l429J1153J4628Q267j0132k7893j537P293M345L890J41
9266a0003K5408J637k1854j6654r949J0647J2392N093O17R032K2533L124k833
9253B9190j1836j1257j3353q187K8989Q271q634N023l5J0084J3631k2989k7915
9240i018k4862q986J4532n823k878K2297L8075K9831L514q470k3987j5459k6607
9227a7841l231o289j7802J2855K1361p364J3363N466M89N310L683j8318J0045
9214A727J0625n587j3031n487L371j4161j9735M280K1654K3121J19M841q233k3979
$$ plain form
9200 -20475 -39633 -31102 -9198 2699 -1124 -9900 -22327 -19314 -12393 -27065 -16255 -15567 -12694
9187 -12694 3933 10526 12703 16948 11849 18197 24186 -5661 -18885 -34888 -15370 -1608 -17334
9174 -17334 -21258 -7469 16344 49598 37717 22996 354 -8596 -10099 -129 -10401 8166 14150
9161 14150 12589 30531 33524 24203 6834 2696 19967 35475 33869 49534 50856 23046 6242
9148 6242 17629 -759 -73 -8220 -3886 -6134 -5413 2868 24864 18731 14861 22627 28700 37477 27748
9133 27748 19578 22425 25914 9047 6067 2080 -2366 1164 5147 5085 16740 17703 33227 52440
9119 52440 57688 27309 19278 21699 8232 -10722 6995 31463 25530 1650 -5704 1295 22639
9106 22639 37321 48378 52577 56201 56043 25439 13006 27154 20671 17204 32796 52541 64633
$$ packed form
9200b0475j9158Q531K1904J1897l823q776j2427L013O921j4672J0810O88K873
9187a2694J6627O593K177M245n099O348N989k9847j3224j6003J9518J3762j5726
9174a7334l924J3789K3813L3254j1881j4721k2642q950j503R970j0272J8567N984
9161A4150j561J7942K993r321j7369m138J7271J5508j606J5665J322k7810j6804
9148F242J1387j8388O86q147M334k248P21Q281K1996o133l870P766O073Q777r729
9133B7748q170K847L489j6867k980l987m446L530L983o2J1655R63J5524J9213
9119E2440N248l0379q031K421j3467j8954J7717K4468n933k3880p354O999K1344
9106B2639J4682J1057M199L624j58l0604j2433J4148o483l467J5592J9745J2092
$$ plain form
9093 64633 70690 63604 63563 70721 82108 77220 92848 111805 145239 170268 170264 160391 194761 232933
9079 232933 252517 303707 377238 491584 669546 977112 1482638 2291843 3490312 4634528
9069 4634528 4798162 3787341 2659247 1867288 1355697 1039922 834939 731202 646252
9060 646252 569788 504580 462970 419972 369946 358556 355533 346049 315550 278449 255508 246377
9048 246377 244106 231308 211063 214635 215865 195916 172393 165724 168011 157028 173095 197291 187132
9035 187132 163761 172390 175064 174498 151082 149956 164223 157192 139273 124532 118125 132075 130085
9022 130085 129532 128007 122677 115046 102868 102884 110406 114704 123750 126071 95071 90312 100203 119306
9008 119306 107592 111612 99667 77075 63707 76388 89591 96980 97158 88784 87524 65087 46848
$$ packed form
9093F4633O057p086m1P158J1387m888J5628J8957L3434K5029mr873L4370L8172
9079B32933J9584N1190P3531J14346J77962L07566N05526Q09205J198469J144216
9069D634528J63634j010821j128094p91959n11591l15775k04983j03737q4950
9060F46252p6464o5208m1610m2998n0026j1390l023r484l0499l7101k2941r131
9048B46377k271j2798k0245L572J230j9949k3523o669K287j0983J6067K4196j0159
9035A87132k3371Q629K674n66k3416j126J4267p031j7919j4741o407J3950j990
9022A30085n53j525n330p631j2178J6P522M298R046K321l1000m759R891J9103
9008A19306j1714M020j1945k2592j3368J2681J3203P389J78q374j260k2437j8239
$$ plain form
8995 46848 49340 37448 38326 50581 46696 61624 70135 69987 82898 85582 98912 97740 85538 64286
8981 64286 72709 77058 74220 64264 85265 69136 48171 56944 76719 68424 55218 46300 49073
8968 49073 49434 46161 55875 43549 11093 9416 20647 47361 46740 51794 49984 59827 35932 22037
8954 22037 18139 17314 22885 25457 48071 62616 53436 35451 40048 31218 31667 37314 23640 12921
8940 12921 12985 -431 -1925 2138 12356 19163 34242 42088 47110 45539 44805 19117 7153 15467
8926 15467 23763 16781 16500 25324 29986 33015 20523 19151 22790 36714 28698 44255 59352 44804
8912 44804 39966 58580 48556 20274 -1272 8648 4349 3817 -8067 -6149 5262 13963 19737
8899 19737 -2571 -5383 -6295 -11203 -3976 -480 2665 16379 33308 44895 14890 1247 8313
$$ packed form
8995D6848K492j1892Q78J2255l885J4928Q511j48J2911K684J3330j172j2202k1252
8981F4286Q423M349k838r956K1001j6129k0965Q773J9775q295j3206q918K773
8968D9073L61l273R714j2326l2456j677J1231K6714o21N054j810R843k3895j3895
8954B2037l898q25N571K572K2614J4545r180j7985M597q830M49N647j3674j0719
8940A2921O4j3416j494M063J0218O807J5079P846N022j571p34k5688j1964Q314
8926A5467Q296o982k81Q824M662L029j2492j372L639J3924q016J5557J5097j4548
8912D4804m838J8614j0024k8282k1546R920m299n32j1884J918J1411Q701N774
8899A9737k2308k812r12m908P227L496L145J3714J6929J1587l0005j3643P066
$$ plain form
8886 8313 29129 41438 24722 -6287 -5727 11411 17564 5959 10480 40188 66443 47739 33398
8873 33398 2439 -7484 8021 17592 15663 20767 14237 3601 -3970 -3675 -1623 -2059 3728 20717
8859 20717 19575 9286 16081 10871 5907 13979 7300 5764 -4626 -23214 -14287 3908 14767
8846 14767 -2628 -20860 -13921 5042 19938 4024 9677 21409 28650 7619 -24530 -28145 -110
8833 -110 21742 9507 -10773 -19549 -16609 -16983 -16103 -8979 -2014 -7722 -9005 9935 6199 25863
8819 25863 40088 52380 25154 4842 -15114 -329 14508 17829 13267 17555 12260 22366 4096
8806 4096 -2599 -8097 80 10741 -12725 -4685 4423 28339 34226 33213 38791 25682 11759 26833
8792 26833 38026 13044 -12977 1342 5695 5243 9521 -6015 -17907 -23799 -21617 -16078 -6215
$$ packed form
8886H313K0816J2309j6716l1009N60J7138O153j1605M521K9708K6255j8704j4341
8873C3398l0959r923J5505R571j929N104o530j0636p571K95K052m36N787J6989
8859B0717j142j0289O795n210m964Q072o679j536j0390j8588Q927J8195J0859
8846A4767j7395j8232O939J8963J4896j5914N653J1732P241k1031l2149l615K8035
8833a10K1852j2235k0280q776K940l74Q80P124O965n708j283J8940l736J9664
8819B5863J4225J2292k7226k0312j9956J4785J4837L321m562M288n295J0106j8270
8806D096o695n498Q177J0661k3466Q040R108K3916N887j013N578j3109j3923J5074
8792B6833J1193k4982k6021J4319M353m52M278j5536j1892n892K182N539R863
$$ plain form
8779 -6215 10920 22564 25542 17950 20607 10024 25761 14269 10822 20435 5000 -748 8840
8766 8840 -19308 -31422 -10002 -3637 -8126 -1821 4238 7558 484 -17384 -15770 -14364 -12781 -8198
8752 -8198 -28454 -26123 -7853 -3680 -2033 1714 -12234 -10561 697 -28887 -36296 -15155 -10618
8739 -10618 -8597 -12568 -7859 -18438 -29555 -35209 -28326 -22994 7486 16874 9598 4291 18745 18190
8725 18190 2231 -6308 -2562 -22457 -29803 -40829 -46721 -49627 -21922 1476 10581 -3265 -10796
8712 -10796 -10281 -27198 -5420 5222 -25036 -15410 1970 6957 9884 -12273 -21196 -10494 9220
8699 9220 9517 -7097 -16257 -10811 -18684 -35483 -42920 -1052 28383 -18450 -16701 23953 48633
8686 48633 53964 32486 3124 6903 12635 17591 11120 9307 30742 24378 3636 -1027 -11374
$$ packed form
8779f215J7135J1644K978p592K657j0583J5737j1492l447R613j5435n748R588
8766H840k8148j2114K1420O365m489O305O059L320p074j7868J614J406J583M583
8752h198k0256K331J8270M173J647L747j3948J673J1258k9584p409K1141M537
8739a0618K021l971M709j0579j1117n654O883N332L0480R388p276n307J4454n55
8725A8190j5959q539L746j9895p346j1026n892k906K7705K3398R105j3846p531
8712a0796N15j6917K1778J0642l0258R626J7380M987K927k2157q923J0702J9714
8699I220K97j6614r160N446p873j6799p437M1868K9435m6833J749M0654K4680
8686D8633N331k1478k9362L779N732M956o471j813K1435o364k0742m663j0347
$$ plain form
8673 -11374 -24727 -26381 -9567 11951 29803 21791 -10225 -34716 -43419 -8592 3974 2328 -3158
8660 -3158 -25138 -27701 -28180 -19122 7603 19806 27007 28048 16793 7228 21501 16251 9667 4679
8646 4679 -7182 -11177 -17513 -11848 -28600 -42004 -33758 3423 -13 -6412 -9078 -18809 -9839 5778
8632 5778 24008 36398 46799 40101 18947 2379 3224 14333 32403 43930 32719 45284 51768
8619 51768 31203 16461 7109 17336 6102 -6784 16398 17884 -8363 -12359 9341 5966 14297
8606 14297 8940 10788 18682 24642 41546 22225 -2752 1829 8404 7955 23125 25721 13703 27530
8592 27530 37185 28501 40158 56663 64406 75998 66293 49376 41146 31656 26587 15322 -9329
8579 -9329 4330 24082 20498 1695 9839 33807 30540 29396 10300 -6225 12352 15226 4655
$$ packed form
8673a1374j3353j654J6814K1518J7852q012l2016k4491q703L4827J2566j646n486
8660c158k1980k563m79R058K6725J2203P201J041j1255r565J4273n250o584m988
8646D679j1861l995o336N665j6752j3404Q246L7181l436o399k666r731Q970J5617
8632E778J8230J2390J0401o698k1154j6568Q45J1109J8070J1527j1211J2565O484
8619E1768k0565j4742r352J0227j1234j2886K3182J486k6247l996K1700l375Q331
8606A4297n357J848P894N960J6904j9321k4977M581O575m49J5170K596j2018J3827
8592B7530R655q684J1657J6505P743J1592r705j6917q230r490n069j1265k4651
8579i329J3659J9752l584j8803Q144K3968l267j144j9096j6525J8577K874j0571
$$ plain form
8566 4655 4954 14685 34360 29047 -5890 -24347 3213 21219 38760 46238 45436 23100 458
8553 458 15395 31495 32998 15335 22939 38351 32714 41081 46454 28456 30764 19920 13592 18667
8539 18667 14178 13147 28511 42565 17035 20269 24634 24545 26113 5500 -3799 -7361 23156 16439
8525 16439 7638 19989 34558 49957 52735 34880 7947 18953 54492 74519 60722 33661
8513 33661 22234 -3184 -19508 -2762 15044 30032 14740 -10563 -12019 -6146 -15394 -12380 678
8500 678 -11061 -39718 -38676 -17446 -18465 2741 33534 27148 21480 30739 37181 15096 -2966
8487 -2966 -8668 -8744 3843 10031 6233 -3650 -3337 10196 14800 28377 44991 35987 16805 4429
8473 4429 7543 2470 2687 1260 -19910 -29970 -20023 4625 5443 4424 10952 20605 16773 4029
$$ packed form
8566D655K99R731J9675n313l4937j8457K7560J8006J7541P478q02k2336k2642
8553D58J4937J6100J503j7663P604J5412n637Q367N373j7998K308j0844o328N075
8539A8667m489j031J5364J4054k5530L234M365q9J568k0613r299l562L0517o717
8525A6439q801J2351J4569J5399K778j7855k6933J1006L5539K0027j3797k7061
8513C3661j1427k5418j6324J6746J7806J4988j5292k5303j456N873r248L014J3058
8500F78j1739k8657J042K1230j019K1206L0793o386n668R259O442k2085j8062
8487b966n702p6J2587O188l798r883L13J3533M604J3577J6614r004j9182j2376
8473D429L114n073K17j427k1170j0060R947K4648Q18j019O528R653l832j2744
$$ plain form
8459 4029 2173 6156 5545 22503 16821 9240 6387 -5926 -13733 -5031 -8212 -6116 4515 -6867
8445 -6867 -26090 -31176 -24752 -440 -4396 -20339 -33012 -14486 14983 18913 8384 -13624 -29442
8432 -29442 -33466 -5231 -4128 12164 32355 28847 7436 5214 19533 24281 40443 41053 39336
8419 39336 32749 29155 17262 14316 7288 2902 12122 17306 -8389 -4489 7087 4740 -10902 -16562
8405 -16562 -31543 -32501 -25099 -13073 8898 26853 36110 45613 49811 30392 12176 -5783 -15712
8392 -15712 -13612 -23184 -44684 -25673 -20436 -11474 -2666 748 10170 23977 7385 -7501 5721
8379 5721 26997 33589 12138 8606 18606 16647 13568 746 -6706 -14327 -24521 -32822 -23247 -18852
8365 -18852 -9204 9290 19408 11547 -1995 -24654 -12557 -922 -3834 -17120 -13768 12359 13821
$$ packed form
8459D029j856L983o11J6958n682p581k853j2313p807Q702l181K096J0631j1382
8445f867j9223n086O424K4312l956j5943j2673J8526K9469L930j0529k2008j5818
8432b9442m024K8235J103J6292K0191l508k1411k222J4319M748J6162O10j717
8419C9336o587l594j1893k946p028m386R220N184k5695L900J1576k347j5642n660
8405a6562j4981r58P402J2026K1971J7955R257R503M198j9419j8216j7959r929
8392a5712K100r572k1500J9011N237Q962Q808L414R422J3807j6592j4886J3222
8379E721K1276O592k1451l532J0000j959l079j2822p452p621j0194q301R575M395
8365a8852R648J8494J0118p861j3542k2659J2097J1635k912j3286L352K6127J462
$$ plain form
8352 13821 6302 14165 32530 32261 23141 8269 -8772 6389 16814 -3343 -15949 -3041 28376
8339 28376 34643 5874 -20024 -20961 -14830 -12637 -5872 12446 28741 20656 -882 11530 14484
8326 14484 10519 -4099 -5432 -1073 -13635 -9482 -12409 -20317 -15532 -4726 -25342 -17354 -7863 26290
8312 26290 24859 16804 23326 16887 20202 15679 21827 6231 -4064 -23808 -20466 7712 8916 -2446
8298 -2446 -6413 -26277 -31904 -6109 7282 11503 19709 43719 45491 41442 17845 1406 -10080
8285 -10080 -13897 -16637 -25820 -25710 -20019 -1168 13648 4558 -4243 -11068 -24094 -26442 -28829 -14013
8271 -14013 -18057 -29388 -20970 -2480 2411 7495 26 -13697 4702 21606 12489 6287 16683
8258 16683 6190 -16204 -25445 -10151 -445 10857 28456 6794 -12789 -19588 -27418 -16460 -8781
$$ packed form
8352A3821p519P863J8365k69r120j4872j7041J5161J0425k0157j2606J2908L1417
8339B8376O267k8769k5898r37O131K193O765J8318J6295q085k1538J2412K954
8326A4484l965j4618j333M359j2562M153k927p908M785J0806k0616P988R491L4153
8312B6290j431q055O522o439L315m523O148j5596j0295j9744L342K8178J204j1362
8298b446l967j9864n627K5795J3391M221Q206K4010J772m049k3597j6439j1486
8285a0080l817k740r183J10N691J8851J4816r090q801o825j3026k348k387J4816
8271a4013m044j1331Q418J8490M891N084p469j3723J8399J6904r117o202J0396
8258A6683j0493k2394r241J5294R706J1302J7599k1662j9583o799p830J0958P679
$$ plain form
8245 -8781 5658 -6179 -20675 -25451 -15942 12881 5422 -22066 -35818 -18906 -4712 1967 10483
8232 10483 -8574 -22824 -24099 -10910 -20379 -36433 -28144 -19092 -25452 -7021 17406 27183 20681
8219 20681 12864 6483 -891 7654 3114 -21 -11643 221 13680 4244 -18660 -28873 -10313
8206 -10313 -5974 -11614 -10367 -328 -3125 -6642 -4165 6781 20081 44670 40164 24770 27259
8193 27259 20989 5136 -6691 -17182 -18680 2234 7322 13002 904 242 -2576 17537 36200
8180 36200 30529 26331 23998 39770 34256 17690 22111 23848 28337 16191 14711 49463 55279 33146
8166 33146 18706 2110 -14139 -13665 13267 13592 9556 21082 18361 -25143 -44796 -36725 -39817
8153 -39817 -51147 -33969 -2515 9592 1333 -7327 -9673 -24585 -27825 -14415 -27440 -35908 -15728
$$ packed form
8245h781J4439j1837j4496m776R509K8823p459k7488j3752J6912J4194O679Q516
8232A0483j9057j4250j275J3189r469j6054Q289R052o360J8431K4427R777o502
8219B0681p817o381p374Q545m540l135j1622J1864J3459r436k2904j0213J8560
8206a0313M339n640J247J0039k797l517K477J0946J3300K4589m506j5394K489
8193B7259o270j5853j1827j0491j498K0914N088N680j2098o62k818K0113J8663
8180C6200n671m198k333J5772n514j6566M421J737M489j2146j480L4752N816k2133
8166C3146j4440j6596j6249M74K6932L25m036J1526k721m3504j9653Q071l092
8153c9817j1330J7178L1454J2107q259q660k346j4912l240J3410j3025q468K0180
$$ plain form
8140 -15728 1358 -11889 -2798 13191 -7846 -15309 3706 22585 31017 28344 20568 4982 7020
8127 7020 -8700 -13341 -1795 16311 5156 -10153 -5067 -13054 -11642 1881 15407 24622 36022
8114 36022 63798 78000 71461 54700 37592 27848 10412 3917 17112 25974 26936 25719 34612
8101 34612 14490 -18779 -14007 -11688 -6339 5654 21770 41224 41945 42781 38858 14889 6278 3533
8087 3533 -8277 -541 -5745 -8564 1997 14051 7527 5872 33444 72332 53998 44662 40300
8074 40300 33269 38113 30899 43382 35604 18039 31824 24712 41643 33346 13178 6108 3730
8061 3730 27507 48287 38434 26516 23362 6034 2109 27813 29713 20748 40194 18145 5463
8048 5463 19955 32082 42616 61406 69917 79391 73267 66406 68940 73266 83507 71370 57117
$$ packed form
8140a5728J7086j3247R091J5989k1037p463J9015J8879Q432k673p776j5586K038
8127G020j5720m641J1546J8106j1155j5309N086p987J412J3523J3526R215J1400
8114C6022K7776J4202o539j6761j7108r744j7436o495J3195Q862R62j217Q893
8101C4612k0122l3269M772K319N349J1993J6116J9454P21Q36l923k3969q611k745
8087C533j1810P736n204k819J0561J2054o524j655K7572L8888j8334r336m362
8074D0300p031M844p214J2483p778j7565J3785p112J6931q297k0168p070k378
8061C730K3777K0780r853j1918l154j7328l925K5704J900q965J9446k2049j2682
8048E463J4492J2127J0534J8790Q511R474o124o861K534M326J0241j2137j4253
$$ plain form
8035 57117 51428 39901 46405 35951 30264 36261 30999 47806 35901 28522 35310 33398 11727
8022 11727 9348 15320 24199 31134 25629 15550 2193 -966 3328 8377 13069 23793 25853 26177
8008 26177 29652 24680 53101 39116 21105 9155 -15123 -16829 -9434 -5581 20265 37676 44922
7995 44922 20294 -2061 14059 33986 15766 1302 8767 13171 7029 -8680 6008 26667
7983 26667 13786 23825 28139 17297 21590 9686 2181 4802 13269 10024 10778 14471 12379 5156
7969 5156 7234 6233 -9717 -15661 -20931 -32762 -27523 -22353 -25624 -1183 24143 16385 -4049 -12097
7955 -12097 1802 -11624 995 27388 22869 25393 22860 27250 17414 21258 44863 35502 12459
7942 12459 -2298 11658 20576 34405 33422 8184 -4755 -5451 13121 26007 17939 11457 8605
$$ packed form
8035E7117n689j1527O504j0454n687N997n262J6807j1905p379O788j912k1671
8022A1727k379N972Q879O935n505j0079j3357l159M294N049M692J0724K060L24
8008B6177L475m972K8421j3985j8011j1950k4278j706P395L853K5846J7411P246
7995D4922k4628k2355J6120J9927j8220j4464P465M404o142j5709J4688K0659
7983B6667j2881J0039M314j0842M293j1904p505K621Q467l245P54L693k092p223
7969E156K078j001j5950n944n270j1831N239N170l271K4441K5326p758k0434q048
7955a2097J3899j3426J2619K6393m519K524k533M390r836L844K3605r361k3043
7942A2459j4757J3956Q918J3829r83k5238j2939o96J8572J2886q068o482k852
$$ plain form
7929 8605 7057 -604 3948 17374 22725 -1374 -7081 8137 22867 32522 20431 6441 -4
7916 -4 -330 8638 8581 11693 10634 9290 4449 7426 20755 22396 19798 10422 -21838 -4102 17840
7901 17840 3813 -17725 -23051 -3286 649 15273 29816 6467 -20324 -23753 -16262 2930 27061
7888 27061 27559 31968 20124 -13562 -12400 -6714 -18251 1632 19740 -6844 -8863 -18393 -24116
7875 -24116 -15306 1711 -3983 -6977 10366 5251 -14468 -11163 -13270 3541 13043 -1939 2587
7862 2587 12588 3305 1746 -2505 3021 7722 13395 -151 -13787 -32858 -59014 -33873 -20440
7849 -20440 -4425 -2961 -5338 -6224 -10603 -6190 16344 24956 22255 35713 56597 53002 49691 45804
7835 45804 17560 1003 -4311 -2083 -4523 9695 13379 6233 3805 18755 7805 -20336 -27154
$$ packed form
7929H605j548p661M552J3426N351k4099n707J5218J4730R655j2091j3990o445
7916dl26Q968n7L112j059j344m841K977J3329J641k598r376l2260J7736K1942
7901A7840j4027k1538n326J9765L935J4624J4543k3349k6791l429P491J9192K4131
7888B7061M98M409j1844l3686J162N686j1537J9883J8108k6584k019r530n723
7875b4116Q810J7017n694k994J7343n115j9719L305k107J6811R502j4982M526
7862B587J0001r283j559m251N526M701N673j3546j3636j9071k6156K5141J3433
7849b0440J6015J464k377q86m379M413K2534Q612k701J3458K0884l595l311l887
7835D5804k8244j6557n314K228k440J4218L684p146k428J4950j0950k8141o818
$$ plain form
7822 -27154 -19086 -33009 -28595 -25071 -31037 -22439 -30812 -35692 -32390 -44299 -43747 -9572 -1366 1313
7808 1313 12281 -1334 -14404 -29732 -16345 -19082 -3266 8471 -7911 -15664 -27313 -5898
7796 -5898 35979 42633 27034 25150 10290 -1937 -19666 -37249 -15905 -6132 -12353 -4223 7804
7783 7804 8293 -13167 -8347 -14185 -9601 4140 17977 14846 -4583 -10574 -29718 -25111 -19442 -16008
7769 -16008 -18791 712 3173 -20154 -13482 22214 27170 9031 -15967 -26314 -20861 -7726 8136
7756 8136 -19890 -21913 -9446 -6197 2702 7883 2284 -2230 -7761 -22935 -48238 -52508 -10660 -2029
7742 -2029 -14308 -7685 -2787 -15359 -4871 13531 27507 17296 1343 -1393 -3363 -4398 -8416
7729 -8416 4094 14321 4007 5374 -376 8950 7907 8515 18429 17793 11117 15541 9262 -11380
$$ packed form
7822b7154Q068j3923M414L524n966Q598q373m880L302j1909N52L4175Q206K679
7808A313J0968j3615j3070j5328J3387k737J5816J1737j6382p753j1649K1415
7796e898M1877O654j5599j884j4860j2227j7729j7583K1344R773o221Q130J2027
7783G804M89k1460M820n838M584J3741J3837l131j9429n991j9144M607N669L434
7769a6008k783J9503K461k3327O672L5696M956j8139k4998j0347N453J3135J5862
7756H136k8026k023J2467L249Q899N181n599m514n531j5174k5303m270M1848Q631
7742b029j2279O623M898j2572J0488J8402J3976j0211j5953k736j970j035m018
7729h416J2510J0227j0314J367n750R326j043O08R914o36o676M424o279k0642
$$ plain form
7715 -11380 324 -9883 -25643 -29921 -18128 399 12743 3942 -6260 -21325 -17903 -16253 6751
7702 6751 29627 52464 59022 56369 16586 8961 12194 4164 2630 2583 -8458 3261 25561 6124
7688 6124 10196 6275 -1435 -5154 6731 4612 1610 -9146 -26346 -28365 -8478 12908 15450 4141
7674 4141 9782 4139 24149 28098 15181 6640 -7523 -14222 -15313 -10662 -14920 -17023 -16222 -6713
7660 -6713 -8106 -6649 -7142 -10538 -953 21194 24483 10353 -512 8966 18437 16132 1789 27380
7646 27380 29647 7344 -1191 -10094 -12280 -12664 -25654 -5823 13808 11416 10887 -5882 4806 30032
7632 30032 34043 3473 -5420 -8154 -4592 4206 16457 27010 18998 6687 21527 14151 322
7619 322 -7996 1895 22604 29881 22700 6278 -1674 3271 15174 7630 18805 31072 39742 43932
$$ packed form
7715a1380J1704j0207j5760m278J1793J8527J2344q801j0202j5065L422J650K3004
7702F751K2876K2837O558k653l9783p625L233q030j534m7j1041J1719K2300j9437
7688F124M072l921p710l719J1885k119l002j0756j7200k019J9887K1386K542j1309
7674D141N641n643K0010L949j2917q541j4163o699j091M651m258k103Q01R509
7660f713j393J457m93l396R585K2147L289j4130j0865R478R471k305j4343K5591
7646B7380K267k2303q535q903k186l84j2990J9831J9631k392n29j6769J0688K5226
7632C0032M011l0570q893k734L562Q798J2251J0553q012j2311J4840p376j3829
7619C22q318R891K0709P277p181j6422p952M945J1903p544J1175J2267Q670M190
$$ plain form
7605 43932 34195 -9342 -16750 -15555 -11027 -5802 3964 9316 -830 18924 10412 -15319 -26972
7592 -26972 1473 19861 18174 -319 -19193 -4146 11964 5981 2455 5914 -1431 -3599 9112
7579 9112 20428 28232 14520 13102 22936 27963 37667 30844 3106 -16492 -32618 -40805 -47619 -45018
7565 -45018 -6755 7729 -15812 -23049 -5534 18474 25581 32453 13072 -11171 -11980 3364 14898
7552 14898 6368 15486 17010 -2170 -8149 -25621 -14350 815 -16343 -14469 4980 12554 18991
7539 18991 9155 -9052 -10145 -7894 -23501 -7238 -5159 -14634 -15330 -12971 -24327 -37469 -19308
7526 -19308 -15598 -17158 11326 13911 19736 10988 -1563 2120 14676 21254 2426 -14240 -1969
7513 -1969 3065 2716 -16655 -9664 1364 -10331 -26495 -37310 -30662 -26111 -25524 -26979 -9698 -13218
$$ packed form
7605D3932r737m3537p408J195M528N225R766N352j0146J9754q512k5731j1653
7592b6972K8445J8388j687j8493j8874J5047J6110n983l526L459p345k168J2711
7579I112J1316P804j3712j418R834N027R704o823k7738j9598j6126q187o814K601
7565d5018L8263J4484k3541p237J7515K4008P107O872j9381k4243q09J5344J1534
7552A4898q530R118J524j9180n979j7472J1271J5165j7158J874J9449P574O437
7539A8991r836j8207j093K251j5607J6263K079r475o96K359j1356j3142J8161
7526a9308L710j560K8484K585N825q748j2551L683J2556O578j8828j6666J2271
7513a969N034l49j9371O991J1028j1695j6164j0815O648M551N87j455J7281l520
$$ plain form
7499 -13218 -19194 -13875 -19407 -13149 8744 16820 3477 -4905 -12993 -29014 -30101 -14317 -1987
7486 -1987 14355 13662 1506 -1241 5481 -9523 -6600 -13426 -32710 -31632 -3943 10287 33731
7473 33731 51219 54213 60393 42864 35799 36525 26383 30614 7094 2968 27036 3611 -3577
7460 -3577 16558 8333 -894 -10883 -12253 -2046 8329 18311 1571 -26001 -22479 -32407 -37661 -32746
7446 -32746 -13985 8767 25118 9357 14323 25882 21625 6420 -13798 -20388 -19255 -3767 11982
7433 11982 5092 -24665 -14067 10122 1216 -9371 -8181 -13478 -14880 -19839 1236 4871 5077 29115
7419 29115 23198 10566 9091 -12090 -15202 -12491 4523 25831 30714 9818 -13233 -13807 -111
7406 -111 8075 -2551 -7620 1030 -4109 -17160 -33390 -24763 -30225 -28876 -18915 2856 -1396 -7417
$$ packed form
7499a3218n976N319n532O258K1893Q076j3343q382q088j6021j087J5784J2330
7486a987J6342o93j2156k747O722j5004K923o826j9284J078K7689J4230K3444
7473C3731J7488K994O180j7529p065P26j0142M231k3520m126K4068k3425p188
7460c577K0135q225r227r989j370J0207J0375R982j6740k7572L522r928n254M915
7446c2746J8761K2752J6351j5761M966J1559m257j5205k0218o590J133J5488J5749
7433A1982o890k9757J0598K4189q906j0587J190n297j402m959K1075L635K06K4038
7419B9115n917j2632j475k1181l112K711J7014K1308M883k0896k3051n74J3696
7406a11Q186j0626n069Q650n139j3051j6230Q627n462J349R961K1771m252o021
$$ plain form
7392 -7417 24612 12404 1583 13839 -5289 -24187 -27527 -11788 -16601 -26663 -26427 -7970 -7568
7379 -7568 -18539 -13592 -12401 7767 3758 10786 23764 16294 965 -10669 -5606 6428 -2809
7366 -2809 -12540 -99 15830 7254 8631 -5733 -7500 -1601 -19876 -11775 -152 -239 -18730 -29429
7352 -29429 -31163 -46167 -51016 -30583 -18138 -44362 -49407 -20757 -21328 -9493 7235 7510 116
7339 116 -6545 -2177 -6738 -14423 2351 14385 25192 14565 -10429 -16969 -12678 -30787 -28829 -7350
7325 -7350 4819 7975 -17642 -22274 -3284 -1482 -9449 -15522 -9913 464 -1539 4786 3380 -20524
7311 -20524 -45819 -56739 -29119 -2971 4740 -5738 -7645 6792 8852 -12915 -17392 -2912 -11419
7298 -11419 -14520 -16172 4487 14985 33110 19035 -6249 -10004 -10597 -16594 -17955 -2167 17926
$$ packed form
7392g417L2029j2208j0821J2256j9128j8898l340J5739m813j0062K36J8457M02
7379g568j0971M947J191K0168m009P028J2978p470j5329j1634N063J2034r237
7366b809r731J2441J5929q576J377j4364j767N899j8275Q101J1623q7j8491j0699
7352b9429j734j5004m849K0433J2445k6224n045K8650n71J1835J6728K75p394
7339A16o661M368m561p685J6774J2034J0807j0627k4994o540M291j8109J958K1479
7325g350J2169L156k5617m632J8990J802p967o073N609J0377k003O325j406k3904
7311b0524k5295j0920K7620K6148P711j0478j907J4437K060k1767m477J4480q507
7298a1419l101j652K0659J0498J8125j4075k5284l755n93n997j361J5788K0093
$$ plain form
7285 17926 41653 36798 39504 39260 37939 20945 1286 -7253 -19601 -6713 2581 3441 -6177 -16169
7271 -16169 -25791 -24157 -927 -2322 -4423 -20571 -34952 -43422 -25217 -19023 -18638 -9936 -4584 -26638
7257 -26638 -33037 -16380 9837 27676 23033 -871 -5612 -16687 -23452 -16984 -1081 -17078 -31229
7244 -31229 -13344 -32359 -31210 -21708 -14484 -17508 -26337 -22560 2908 7376 10284 -3313 -16510
7231 -16510 -17257 -11688 -8260 -33228 -31800 -33086 -30699 -8372 18347 34341 11442 21847 35430
7218 35430 28917 29020 -2628 -10024 -1948 -11634 10429 24317 23363 25277 10070 6865 -1015 1275
7204 1275 9290 7053 -569 -11742 -5397 14634 -2497 -4377 -17976 -27735 -32541 -17529 -8776 -9175
7190 -9175 18877 21801 3225 2255 15877 4985 544 -12384 -12772 -11524 -1758 18100 22744 2410
$$ packed form
7285A7926K3727m855K706k44j321j6994j9659q539j2348J2888R294Q60r618r992
7271a6169r622J634K3230j395k101j6148j4381q470J8205O194L85Q702N352k2054
7257b6638o399J6657K6217J7839m643k3904m741j1075o765O468J5903j5997j4151
7244c1229J7885j9015J149R502P224l024q829L777K5468M468K908j3597j3197
7231a6510p47N569L428k4968J428j286K387K2327K6719J5994k2899J0405J3583
7218C5430o513J03l1648p396Q076r686K2063J3888r54J914j5207l205p880K290
7204A275Q015k237p622j1173O345K0031j7131j880j3599r759m806J5012Q753l99
7190i175K8052K924j8576r70J3622j0892m441j2928l88J248R766J9858M644k0334
$$ plain form
7176 2410 -10164 -22184 -23753 -3379 -7041 -5074 4568 -1805 2636 -1194 -5127 -559 -3606 -16941
7162 -16941 -26346 -18685 -2350 11376 12949 39999 25817 -3183 -11801 -14833 -27739 -28570 -6736
7149 -6736 -9808 -8274 -20318 -30012 -16027 1903 3733 -1722 -2301 -1394 15245 24825 25274 -6743
7135 -6743 -3448 -8522 160 87 6221 1150 15322 10892 9818 9399 5652 -644 -12447 -23707 -22798
7120 -22798 11856 32861 40579 33534 13148 -11743 -22168 -35340 -37105 -34121 -21814 5403 12818
7107 12818 -1904 -27517 -18250 -25316 -21960 -3934 969 -8517 -8295 -31368 -28299 -46632 -40768 -31780
7093 -31780 -22193 -20925 -31573 -24111 -1967 4016 -7884 -12523 -13880 -25978 -36325 -25755 -22476
7080 -22476 -20866 -25892 -21649 -20373 -22318 -16199 -13889 -15469 -35077 -29305 -14313 -15009 -5493 -14149
$$ packed form
7176B410j2574j2020j569K0374l662J967R642o373M441l830l933M568l047j3335
7162a6941r405P661J6335J3726J573K7050j4182k9000q618l032j2906q31K1834
7149f736l072J534j2044r694J3985J7930J830n455n79R07J6639R580M49l2017
7135f743L295n074Q682p3O134n071J4172m430j074m19l747o296j1803j1260R09
7120b2798L4654K1005P718p045k0386k4891j0425j3172j765K984J2307K7217P415
7107A2818j4722k5613R267p066L356J8026M903r486K22k3073L069j8333N864Q988
7093c1780R587J268j0648P462K2144N983j1900m639j357j2098j0347J0570L279
7080b2476J610n026M243J276j945O119K310j580j9608N772J4992o96R516q656
$$ plain form
7066 -14149 -19087 -6096 -16960 -11053 -11311 -4723 5744 21031 35718 42351 12291 7315 25103
7053 25103 29257 20021 17934 17253 10317 18670 26611 10153 17624 46621 51997 48509 29918 19406
7039 19406 14773 18046 7583 27819 31307 24695 31315 37033 12639 -7252 -9693 -18577 -19787 -13882
7025 -13882 -31025 -34534 -37375 -37550 -35642 -46961 -43033 -32637 -26030 -12466 -2907 27696 25407 9291
7011 9291 3057 22983 14195 -7807 8176 4197 -15784 -31645 -3614 12331 7720 16336 15080
6998 15080 27183 28152 24672 6263 5387 -2926 -31109 -45666 -33501 -6453 2774 -6645 1428 13081
6984 13081 7127 -1076 6969 -5426 -31413 -31848 -22570 -13404 -20062 -31132 -34864 -34281 -24739 -36360
6970 -36360 -25398 -10349 -10985 8510 12070 -2303 -3551 -2297 -18166 982 8257 -25734 -32897
$$ packed form
7066a4149m938J2991j0864N907k58O588J0467J5287J4687O633l0060m976J7788
7053B5103M154r236k087o81o936Q353P941j6458P471K8997N376l488j8591j0512
7039A9406m633L273j0463K0236L488o612O620N718k4394j9891k441q884j210N905
7025a3882j7143l509k841j75J908j1319L928J0396O607J3564R559L0603k289j6116
7011I291o234J9926q788k2002J5983l979j9981j5861K8031J5945m611Q616j256
6998A5080J2103R69l480j8409q76q313k8183j4557J2165K7048R227r419Q073J1653
6984A3081n954q203Q045j2395k5987m35R278R166o658j1070l732N83R542j1621
6970c6360J0962J5049o36J9495L560j4373j248J254j5869J9148P275l3991p163
$$ plain form
6957 -32897 -20859 -930 -3964 -1831 3387 4191 2100 -3991 5116 972 10277 20553 13021 3787
6943 3787 3341 -6768 -15330 -36842 -29063 -19450 -12843 9333 31883 25523 -11892 -32397 -27194 -20578
6929 -20578 -24876 -33302 -40367 -32266 6302 31478 47525 36292 32302 34473 32074 24782 33054 38722
6915 38722 46826 46880 39565 40112 27322 20078 28763 24808 2756 -15556 -24056 -7362 1607 -12132
6901 -12132 -25877 -23903 5507 34465 43089 32112 6790 -3769 7222 7072 -6098 -9196 -23238
6888 -23238 -17911 -15231 -1338 17000 15513 7110 9047 -6401 -7478 -4228 -7113 438 -11302 -17336
6874 -17336 -6292 1939 7361 12216 -4863 5914 -71 1858 7628 -14082 -24791 -3885 16053
6861 16053 26618 9074 -18814 -19975 -12753 -782 7902 -473 -20981 -23073 7849 35017 43484
$$ packed form
6957c2897J2038J9929l034K133N218Q04k091o091R107m144R305J0276p532r234
6943C787m46j0109q562k1512P779R613O607K2176K2550o360l7415k0505N203O616
6929b0578m298q426p065Q101L8568K5176J6047j1233l990K171k399p292Q272N668
6915C8722Q104N4p315N47j2790p244Q685l955k2052j8312q500J6694Q969j3739
6901a2132j3745J974K9410K8958Q624j0977k5322j0559J0991j50j3170l098j4042
6888b3238N327K680J3893J8338j487q403J937j5448j077L250k885P551j1740o034
6874a7336J1044Q231N422M855j7079J0777n985J929N770k1710j0709K0906J9938
6861A6053J0565j7544k7888j161P222J1971Q684q375k0508k092L0922K7168Q467
$$ plain form
6848 43484 21907 -10041 -26325 -4806 -8468 -24472 -21080 2723 -5504 -23069 -20996 -37605 -37248
6835 -37248 -34057 -38859 -31997 -16241 -17998 -20044 -18686 -31931 -34624 -32907 -34234 -28394 -35452 -44261
6821 -44261 -25781 -626 -2581 -7726 6601 6521 -10387 -15796 -18553 -3292 6424 7698 18415 36117
6807 36117 26772 -7818 -30523 -22665 -13599 -11323 -3458 8637 -297 13168 -19525 -43170 -42728
6794 -42728 -31394 -19500 2971 -3960 -10448 -18691 -30650 -33806 -25476 -29402 -25219 -14103 -344
6781 -344 3694 23560 -3536 -23826 -32646 -37707 -34834 -23252 -18378 -22168 -21276 -4868 370 -487
6767 -487 -24962 -45932 -34361 -37037 -27594 -19849 -8525 6370 8737 -4521 4345 15085 8198
6754 8198 -19628 -16230 -10189 -12015 -24299 -29597 -19807 -19077 -15580 -9012 -14055 -29277 -17466 -10725
$$ packed form
6848D3484k1577l1948j6284K1519l662j6004L392K3803q227j7565K073j6609L57
6835c7248L191m802O862J5756j757k046J358j3245k693J717j327N840p058q809
6821d4261J8480K5155j955n145J4327q0j6908n409k757J5261R716J274J0717J7702
6807C6117r345l4590k2705P858R066K276P865J2095q934J3465l2693k3645M42
6794d2728J1334J1894K2471o931o488q243j1959l156Q330l926M183J1116J3759
6781c44M038J9866k7096k0290q820n061K873J1582M874l790Q92J6408N238q57
6767d87k4475k0970J1571k676R443P745J1324J4895K367j3258Q866J0740o887
6754H198k7826L398O041j826j2284n298R790P30L497O568n043j5222J1811O741
$$ plain form
6740 -10725 -9872 277 25237 11737 1280 -3682 11154 10197 8845 10185 12674 -1725 -12719
6727 -12719 -22941 -14137 25497 59288 63234 55623 62235 33965 36795 27593 42785 34367 27304
6714 27304 14145 6907 13745 28377 37887 12022 9666 24234 25554 25960 17395 3711 -815 4925
6700 4925 11338 6700 -5607 -17414 -11728 986 17478 22759 12602 -905 299 -1285 1090
6687 1090 15 -10507 -417 -4507 -2038 -12294 -18398 20834 31541 29398 18020 23062 16459
6674 16459 16623 7554 23542 26545 12421 5876 7481 14703 15407 2187 -2716 7123 -13736 -17212
6660 -17212 -8554 -37460 -56296 -38252 -22978 -26938 -50549 -64106 -44241 -20231 -16552 -34499
6648 -34499 -50016 -46501 -51515 -53100 -43021 -35900 -45245 -45730 -33073 -23664 -18892 -10415 10474 -3177
$$ packed form
6740a0725Q53J0149K4960j3500j0457m962J4836r57j352J340K489j4399j0994
6727a2719j0222Q804L9634L3791L946p611O612k8270K830r202J5192q418p063
6714B7304j3159p238O838J4632R510k5865k356J4568J320M06q565j3684m526N740
6700D925O413m638j2307j1807N686J2714J6492N281j0157j3507J204j584K375
6687A090j075j0522J0090m090K469j0256o104L9232J0707k143j1378N042o603
6674A6459J64r069J5988L003j4124o545J605P222P04j3220m903R839k0859l476
6660a7212Q658k8906j8836J8044J5274l960k3611j3557J9865K4010L679j7947
6648c4499j5517L515n014j585J0079P121r345m85J2657R409M772Q477K0889j3651
$$ plain form
6634 -3177 -13522 -1938 4840 6079 259 -505 -15684 2889 11011 -5263 -4073 -2654 -12891 -21956
6620 -21956 -22786 -42050 -46360 -60979 -37544 -12798 -4168 -17681 -28818 -49905 -40823 -1167 -11266
6607 -11266 -27925 -19466 8640 6190 3090 11280 38792 36068 15914 8164 4202 4383 2228 11420
6593 11420 13119 10025 8563 -1805 -3867 453 -9119 -17099 -22886 -8745 -7773 -15382 -23544 -345
6579 -345 1064 -1053 6056 9304 -8086 30319 33503 20620 12234 11446 -15805 -4433 15916 31909
6565 31909 7130 -27685 -29660 -34997 -9981 8937 -5203 -20312 -26732 -16894 -396 -4977 7184
6552 7184 20883 29891 30487 26225 23502 13348 561 -7097 13332 13425 23755 22177 6099 -16627
6538 -16627 -38337 -26083 -17279 -3902 10657 2651 3306 2443 -1999 1525 -93 -9667 5254 10072
$$ packed form
6634c177j0345J1584O778J239n820p64j5179J8573Q122j6274J190J419j0237r065
6620b1956q30j9264m310j4619K3435K4746Q630j3513j1137k1087R082L9656j0099
6607a1266j6659Q459K8106k450l100Q190K7512k724k0154p750l962J81k155R192
6593A1420J699l094j462j0368k062M320r572p980n787J4141R72p609q162K3199
6579c45J409k117P109L248j7390L8405L184j2883q386p88k7251J1372K0349J5993
6565C1909k4779l4815j975n337K5016J8918j4140j5109o420R838J6498m581J2161
6552G184J3699R008N96m262k723j0154j2787p658K0429R3J0330j578j6078k2726
6538a6627k1710J2254Q804J3377J4559q006O55q63m442L524j618r574J4921M818
$$ plain form
6524 10072 6142 -2621 -12614 -14539 -18907 -23317 -6018 13772 10762 -21484 -39156 -34872 -30655 1527
6510 1527 1730 16303 2503 -1930 10008 -7531 -6439 -18610 -23086 -5440 6881 -13448 -11198
6497 -11198 -11852 -6587 3971 -5580 -16861 -2302 10617 16192 11238 -6204 -8847 -11682 -16863 -24700
6483 -24700 -14188 2656 3669 5346 -11699 -37225 -38856 -28432 -9596 -2569 2869 -3160 6317
6470 6317 8432 15569 -3401 6771 5352 -25593 -19011 -11446 -20107 -22373 -40372 -42163 -28135 -17345
6456 -17345 -10414 -14085 -14466 -14090 -20921 -13688 -2136 398 2259 576 -6628 -15995 -28822 -10765
6442 -10765 7165 -15673 -24056 -15856 -24431 -37037 -44996 -24176 -13767 -9491 -16095 -28885 -20554
6429 -20554 -11606 -10090 15072 17181 15572 8654 222 5366 27676 33680 36948 25491 6439 -5434
$$ packed form
6524A0072l930q763r993j925m368m410J7299J9790l010l2246j7672M284M217L2182
6510A527K03J4573j3800m433J1938j7539J092j2171m476J7646J2321k0329K250
6497a1198o54N265J0558r551j1281J4559J2919N575m954j7442k643k835n181p837
6483b4700J0512J6844J013J677j7045k5526j631J0424J8836P027N438o029R477
6470F317K115P137j8970J0172j419l0945O582P565q661k266j7999j791J4028J0790
6456a7345O931l671l81L76o831P233J1552K534J861j683p204r367j2827J8057
6442a0765J7930k2838q383Q200q575j2606p959K0820J0409M276o604j2790Q331
6429b0554Q948J516K5162K109j609o918q432N144K2310O004L268j1457j9052j1873
$$ plain form
6415 -5434 -12588 -3530 21499 42685 34023 9767 1365 -2506 6973 7274 -2197 -17770 -21903 -24629
6401 -24629 -9295 -11239 -22714 -7699 6614 20239 9413 -16881 -26634 -21236 -15076 5883 24685
6388 24685 15134 5688 16402 11424 -3577 -16244 -17757 -14892 2736 6828 9523 27409 17098
6375 17098 16414 11582 19073 6423 -20320 -21006 -9300 -1609 -13254 -13418 -31459 -31966 -13827 -5548
6361 -5548 -14547 -20986 -28360 -29637 -18946 -12157 -12190 -8779 3679 4707 7839 -5000 -29141 -51606
6347 -51606 -45952 -25112 -18041 -10891 -13577 -6588 -1456 23113 43131 50428 35459 21178 15198
6334 15198 9442 -814 -21059 -13490 15326 26291 19200 17273 11815 1113 2567 2876 6446 10920
6320 10920 19778 31909 31602 14782 -11124 -20482 -10555 17529 29044 1210 -5554 2579 28102
$$ packed form
6415e434p154R058K5029K1186q662k4256q402l871R479L01r471j5573m133k726
6401b4629J5334j944j1475J5015J4313J3625j0826k6294r753N398O160K0959J8802
6388B4685r551r446J0714m978j5001j2667j513K865J7628M092K695J7886j0311
6375A7098o84m832P491j2650k6743o86J1706P691j1645j64j8041n07J8139Q279
6361e548q999o439p374j277J0691O789l3L411J2458J028L132j2839k4141k2465
6347e1606N654K0840P071P150k686O989N132K4569K0018P297j4969j4281n980
6334A5198n756j0256k0245P569K8816J0965p091j927n458j0702J454L09L570M474
6320A0920Q858J2131l07j6820k5906r358R927K8084J1515k7834o764Q133K5523
$$ plain form
6307 28102 24405 14227 -3192 -6688 -4159 -3191 9771 17055 9042 -13454 -27700 -11060 2280
6294 2280 15739 30699 29090 12599 7996 21296 40333 35851 3731 -3166 13195 9702 11192
6281 11192 -698 19554 23412 799 -1235 -4058 -3834 2714 9873 13316 911 5542 16563 -6350
6267 -6350 -12304 -10947 -9920 -3890 -10454 -15393 -7308 10985 13806 16402 34238 38338 30436 27376
6253 27376 31193 21064 25504 42290 38892 6797 -2779 -2134 -12295 -31063 -31287 -27886 -26131 -23261
6239 -23261 -15305 -18395 -25691 -38693 -31817 -7800 -7834 -22337 -34884 -32968 -29685 -32262 -24947 2023
6225 2023 5246 -12011 -12273 -21689 -29578 -26538 -19455 -17716 -24539 -29923 -48573 -34559 -31851 -22377
6211 -22377 -8777 -23388 -34588 -14313 -467 4317 10906 -5007 -4665 -21403 -26765 -16672 -23701
$$ packed form
6307B8102l697j0178j7419l496K529R68J2962P284q013k2496j4246J6640J3340
6294B280J3459J4960j609j6491m603J3300J9037m482l2120o897J6361l493J490
6281A1192j1890K0252L858k2613k034k823K24O548P159L443j2405M631J1021k2913
6267f350n954J357J027O030o564m939Q085J8293K821K596J7836M100p902l060
6253B7376L817j0129M440J6786l398l2095r576O45j0161j8768k24L401J755K870
6239b3261P956l090p296j3002O876K4017l4j4503j2547J916L283k577P315K6970
6225B023L223j7257k62r416p889L040P083J739o823n384j8650J4014K708R474
6211b2377J3600j4611j1200K0275J3846M784O589j5913L42j6738n362J0093p029
$$ plain form
6198 -23701 -45766 -28501 -20585 -19091 -12466 1533 -10451 -16124 -10663 -18781 -20500 -34863 -41699
6185 -41699 -45975 -46394 -33653 -11665 -4044 -9473 -17361 -16527 9279 1376 -19029 -14471 3525 15212
6171 15212 29466 46515 42690 24386 13246 -624 -5028 10352 9358 -1638 -3293 -25288 -20810
6158 -20810 -2901 6453 6920 10338 26362 16590 25861 15831 -7276 -21031 -39043 -41716 -35022
6145 -35022 -27243 -29481 -36846 -39980 -26279 -18524 -9285 3642 6544 4852 21853 28759 -3115 -4268
6131 -4268 -19398 -20980 -9234 -5253 -10720 -8838 -10072 -5196 13286 17160 29649 23961 14036 23337
6117 23337 31233 16289 3464 -16132 -7363 -11980 -31007 -45854 -36430 -16294 4360 -3644 -7973
6104 -7973 -14531 -3000 12650 15274 1234 -24690 -31367 -38928 -50071 -52827 -40049 -41134 -39233
$$ packed form
6198b3701k2065J7265P916J494O625J3999j1984n673N461q118j719j4363o836
6185d1699m276m19J2741K1988P621n429p888Q34K5806p903k0405M558J7996J1687
6171A5212J4254J7049l825j8304j1140j3870m404J5380r94j0996j655k1995M478
6158b0810J7909R354M67L418J6024r772R271j0030k3107j3755j8012k673O694
6145c5022P779k238p365l134J3701P755R239J2927K902j692J7001O906l1874j153
6131d268j5130j582J1746L981n467J882j234M876J8482L874J2489n688r925R301
6117B3337P896j4944j2825j9596Q769m617j9027j4847R424K0136K0654q004m329
6104g973o558J1531J5650K624j4040k5924o677p561j1143k756J2778j085J901
$$ plain form
6091 -39233 -30880 -18074 -23105 -17625 -18569 -26043 -19287 -20606 -9273 -10276 7722 12977 1394 5334
6077 5334 20188 20212 1048 -14361 -13803 -12607 -15550 -14941 -11100 -4187 1165 186 -8560 -6602 118
6062 118 -6728 -13620 -20598 -33195 -27502 -18906 -28714 -48889 -54540 -30459 3392 9920 1995 14273
6048 14273 2042 -19637 -23663 -25390 -25016 -16206 -23909 -9948 4190 -9394 -1459 -8722 -22638
6035 -22638 -19759 -5661 7309 3557 -2595 14651 11575 4964 1842 22211 38989 23475 19846
6022 19846 21144 -1123 13051 -5018 3215 15520 15307 11202 4765 -22995 -39689 -20610 -13778
6009 -13778 -13914 -11125 -23444 -16908 -9813 -6358 12453 16739 22924 22044 44688 55546 53817 32603
5995 32603 20207 18354 18160 7140 15626 29285 22770 880 -17418 -13651 -8187 -11327 2052
$$ packed form
6091c9233Q353J2806n031N480r44p474O756j319J1333j003J7998N255j1583L940
6077E334J4854K4j9164j5409N58J196k943O09L841O913N352r79q746J958O720
6062A18o846o892o978j2597N693Q596r808k0175n651K4081L3851O528p925J2278
6048A4273j2231k1679m026j727L74Q810p703J3961J4138j3584P935p263j3916
6035b2638K879J4098J2970l752o152J7246l076o611l122K0369J6778j5514l629
6022A9846J298k2267J4174j8069Q233J2305k13m105o437k7760j6694J9079O832
6009a3778j36K789j2319O536P095L455J8811M286O185q80K2644J0858j729k1214
5995C2603j2396j853j94j1020Q486J3659o515k1890j8298L767N464l140J3379
$$ plain form
5982 2052 12679 20 -3883 -10158 1575 20281 26172 8971 -7843 11021 23659 36507 15601
5969 15601 -16326 -9385 6447 17729 6668 -4235 2218 526 -11586 -370 10417 12058 6516
5956 6516 -4885 -1258 18758 41248 55401 50247 44870 -1743 -26981 552 13864 13376 10601
5943 10601 14249 10002 13047 10640 32421 42103 39213 20346 6085 9417 -3799 -17900 -17028 -13992
5929 -13992 -25700 -20725 5337 -5369 -25556 -24989 -7466 -10646 -17378 -19101 -7873 -5875 -11581
5916 -11581 -13377 -26771 -18956 3406 144 -14327 -17744 -13458 3465 -2087 -15518 -11884 -9154
5903 -9154 -10507 733 4192 16604 23145 31353 32719 25767 22261 28713 24789 13413 12556 10048
5889 10048 6030 -16812 -36368 -30233 -8129 3932 8740 25289 17218 16881 5182 -11917 -29070
$$ packed form
5982B052J0627j2659l903o275J1733J8706N891j7201j6814J8864J2638J2848k0906
5969A5601l1927O941J5832J1282j1061j0903O453j692j2112J1216J0787J641n542
5956F516j1401L627K0016K2490J4153n154n377m6613k5238K7533J3312m88k775
5943A0601L648m247L045k407K1781R682k890j8867j4261L332j3216j4101Q72L036
5929a3992j1708M975K6062j0706k0187N67J7523l180o732j723J1228J998n706
5916a1581j796j3394P815K2362l262j4471l417M286J6923n552j3431L634K730
5903i154j353J1240L459J2412O541Q208J366o952l506O452l924j1376q57k508
5889A0048m018k2842j9556O135K2104J2061M808J6549q071l37j1699j7099j7153
$$ plain form
5876 -29070 -29167 -605 6669 10261 6740 25261 28496 36302 33514 18960 17520 24006 23827 -785
5862 -785 -17770 -31064 -16810 18717 33191 11317 3034 -6496 930 279 -10082 -19212 3366
5849 3366 2430 3780 19375 11979 32690 35716 25135 13883 3468 -20856 -16313 1508 -1483
5836 -1483 -5822 -19124 -27436 2609 7992 11073 35237 16359 -1946 7234 10711 13238 -4879
5823 -4879 -18604 -21102 -22651 -5120 20398 27265 16992 -6228 9324 7599 -10388 -35931 -42515
5810 -42515 -44261 -25809 -16066 -8904 -17706 -33149 -26969 -16124 5280 20434 18773 -1604 -16715
5797 -16715 -32096 -42932 -54783 -56187 -38935 -19213 -35061 -53304 -35488 -30600 -28954 -13471
5785 -13471 -1631 -21211 -22829 -15573 -30571 -46758 -26316 -28379 -25816 -17386 -18019 -37370 -18893
$$ packed form
5876b9070r7K8562P274L592l521J8521L235P806k788j4554j440O486j79k4612
5862g85j6985j3294J4254L5527J4474k1874q283r530P426o51j0361r130K2578
5849C366r36J350J5595p396K0711L026j0581j1252j0415k4324M543J7821k991
5836a483m339j3302q312L0045N383L081K4164j8878j8305R180L477K527j8117
5823d879j3725k498j549J7531K5518O867j0273k3220J5552j725j7987k5543o584
5810d2515j746J8452R743P162q802j5443O180J0845K1404J5154j661k0377j5111
5797a6715j5381j0836j1851j404J7252J9722j5848j8243J7816M888J646J5483
5785a3471J1840j9580j618P256j4998j6187K0442k063K563Q430o33j9351J8477
$$ plain form
5772 -18893 -7680 2743 6694 -2390 5345 4547 5793 -2411 988 -689 -16144 -28695 -26887 -13364
5758 -13364 5121 -5395 1372 5329 1539 -19984 -27289 3144 20943 15899 -3379 7618 1102
5745 1102 -6035 2210 -2063 -14812 -8045 8649 -5035 -9254 -6021 -4639 8075 1911 8555 29759
5731 29759 14051 85 -6846 -2865 -280 -4986 -23827 -31741 -24023 -24474 -19309 -5809 16904 15557
5717 15557 12596 7833 -1186 -32105 -40254 -32802 -1364 11881 15529 23501 6265 -4215 -21318
5704 -21318 5156 45450 37667 15178 21675 24061 4229 22038 51550 42176 18282 7231 14718
5691 14718 -4647 -47270 -65358 -60257 -45031 -12108 -5945 208 138 -21357 -23284 -2958 -4741
5678 -4741 -22609 -36140 -47209 -22722 2393 1818 402 -1035 -6755 9046 20288 21553 11124
$$ packed form
5772a8893J1213J0423L951r084P735p98J246q204L399j677j5455j2551J808J3523
5758a3364J8485j0516O767L957l790k1523p305L0433J7799n044j9278J0997o516
5745A102p137Q245m273j2749O767J6694j3684m219L233J382J2714o164O644K1204
5731B9759j5708j3966o931L981K585m706j8841p914P718m51N165J3500K2713j347
5717A5557k961m763r019l0919q149P452L1438J3245L648P972j7236j0480j7103
5704b1318K6474M0294p783k2489O497K386j9832J7809K9512r374k3894j1051P487
5691A4718j9365m2623j8088N101J5226L2923O163O153p0k1495j927K0326j783
5678d741j7868j3531j1069K4487K5115n75j416j437n720J5801J1242J265j0429
$$ plain form
5665 11124 1240 -3880 2012 7382 7176 3984 4340 1466 -11746 -35662 -22861 -16024 -29670 -19397
5651 -19397 -4019 -3467 -12678 -18280 -9458 14145 11640 -16374 -15895 -13868 -3538 -9347 -20753 149
5637 149 -11690 -26400 -16713 -4482 -16436 -24418 143 21974 23805 33444 23792 23886 750 -4985
5623 -4985 -18724 -46814 -44167 -29293 -25851 -12867 -897 5616 25652 13608 7359 2029 8926
5610 8926 20257 6637 -4863 -21627 -19395 14976 34334 28220 -2046 4352 6091 6509 10163
5597 10163 16672 7296 -5912 4414 20426 12609 -3356 -19452 -12070 -28718 -27801 -40957 -41805
5584 -41805 -5719 20664 19819 22357 5207 -17136 -12118 -18792 -24765 -13202 2693 25033 4535
5571 4535 -15484 -16617 -33390 -42726 -43610 -26107 -16076 -1887 -4221 14169 26485 39984 42034
$$ packed form
5665A1124r884n120N892N370k06l192L56k874j3212k3916J2801O837j3646J0273
5651a9397J5378N52r211n602Q822K3603k505k8014M79K027J0330n809j1406K0902
5637A49j1839j4710R687J2231j1954p982K4561K1831J831R639r652R4k3136n735
5623d985j3739k8090K647J4874L442J2984J1970O513K0036j2044o249n330O897
5610H926J1331j3620j1500j6764K232L4371J9358o114l0266O398J739M18L654
5597A0163O509r376j3208J0326J6012p817j5965j6096P382j6648R17j3156q48
5584d1805L6086K6383q45K538j7150k2343N018o674n973J1563J5895K2340k0498
5571D535k0019j133j6773r336q84J7503J0031J4189k334J8390J2316J3499K050
$$ plain form
5558 42034 7119 -2104 24016 26899 6734 -12978 609 -11862 2405 -7908 -9940 -14183 7268
5545 7268 38291 19285 -3370 4042 -22189 -12296 -2575 -7079 -9396 -6300 -3502 -566 -10994 -12586
5531 -12586 -19454 -27403 -17687 -30287 -50800 -48245 -41974 -24247 5176 1516 -10726 -4907 -3884
5518 -3884 -13799 -11399 -25414 -30716 -18120 -4475 -8127 -9993 11112 8613 -2781 17125 24788
5505 24788 10122 -7378 -15844 -31479 -11604 12200 2345 -8147 -2022 20100 16631 20166 27843
5492 27843 27830 23026 62 1890 8659 9685 12716 8585 205 -16134 -14100 -7153 2608 -2949 -16511
5477 -16511 -20345 -3175 176 16673 8821 16070 15034 11437 21199 21695 29790 39055 49789 34695
5463 34695 24339 26882 38973 51974 26738 6138 27842 25570 14283 16034 13628 22931 16220
$$ packed form
5558D2034l4915r223K6120K883k0165j9712J3587j2471J4267j0313k032m243K1451
5545G268L1023j9006k2655P412k6231R893R721m504k317L096K798K936j0428j592
5531a2586o868p949R716j2600k0513K555O271J7727K9423l660j2242N819J023
5518c884r915K400j4015n302J2596J3645l652j866K1105k499j1394J9906P663
5505B4788j4666j7500q466j5635J9875K3804r855j0492O125K2122l469L535P677
5492B7843j3m804k2964J828O769J026L031m131q380j6339K034O947R761n557j3562
5477a6511l834J7170L351J6497p852P249j036l597R762M96Q095R265J0734j5094
5463C4695j0356K543J2091J3001k5236k0600K1704k272j1287J751k406R303o711
$$ plain form
5450 16220 8533 21101 12068 24178 20781 4476 4882 3525 -8572 -11475 -13309 -2759 -7326 -7716
5436 -7716 402 14614 21860 25121 -4639 -15334 -14868 -9963 -7090 -1767 9521 -6488 -146 8598
5422 8598 6016 7460 -3748 -22421 -20019 -17242 -8360 -16153 -26091 -3046 19570 25333 8503 -12101
5408 -12101 -29118 -20448 -25151 -15224 -16114 -19056 -14655 -17402 14304 24435 4231 -10878 -27582
5395 -27582 -29225 -6787 -7663 5535 1804 -12613 -7319 -10670 -15929 -23947 -31473 -28665 -49229 -41676
5381 -41676 -39509 -44063 -49313 -43688 -42797 -54204 -45640 -22049 3481 20002 5341 -25910 -37888
5368 -37888 4853 16292 -312 -35403 -23867 2475 -2780 15895 21378 13791 -2318 -17255
5356 -17255 -17200 5130 22084 30438 20222 6474 -3183 -17283 -18893 -29749 -29655 4038 26095 6460
$$ packed form
5450A6220p687J2568r033J2110l397j6305M06j357j2097k903j834J0550m567l90
5436g716Q118J4212P246L261k9760j0695M66M905K873N323J1288j6009O342Q744
5422H598k582J444j1208j8673K402K777Q882p793r938K3045K2616N763j6830k0604
5408a2101j7017Q670m703R927q90k942M401k747L1706J0131k0204j5109j6704
5395b7582j643K2438q76J3198l731j4417N294l351n259q018p526K808k0564P553
5381d1676K167m554n250N625Q91j1407Q564K3591K5530J6521j4661l1251j1978
5368c7888M2741J1439j6604l5091J1536K6342n255J8675N483p587j6109j4937
5356a7255N5K2330J6954Q354j0216j3748r657j4100j610j0856R4L3693K2057j9635
$$ plain form
5342 6460 93 1870 -151 -2609 -12029 -7839 -5841 -12940 -11053 2425 -761 3731 12754 23660
5328 23660 20535 -7333 -20209 -7129 -5537 5011 10762 10803 -3526 -13837 -24283 -15950 788
5315 788 8124 11001 785 2194 -18083 -30948 -31569 -10942 -6613 -2153 -6657 2915 3651 -16949
5301 -16949 -20226 -3650 9932 1583 12326 14931 -408 908 1646 12040 21316 27105 27623 17794
5287 17794 25246 22912 7611 14760 19862 10643 -16635 -36609 -26370 -16872 -12484 -31328 -49486
5274 -49486 -25637 2480 8244 -18069 -19363 -12570 -6512 2283 10525 -14187 -24983 -14220 -16260
5261 -16260 4077 13109 17572 33304 31434 12296 6896 -853 1299 15026 37510 50810 23424
5248 23424 -575 -15263 -12113 -23880 -22494 -8726 -12803 -23049 -14716 6055 -18295 -21834 -1354
$$ packed form
5342F460o367J777k021k458r420M190J998p099J887J3478l186M492R023J0906
5328B3660l125k7868j2876J3080J592J0548N751M1j4329j0311j0446Q333J6738
5315G88P336K877j0216J409k0277j2865o21K0627M329M460m504R572P36k0600
5301a6949l277J6576J3582q349J0743K605j5339J316P38J0394R276N789N18r829
5287A7794P452k334j5301P149N102r219k7278j9974J0239R498M388j8844j8158
5274d9486K3849K8117N764k6313j294O793O058Q795Q242k4712j0796J0763k040
5261a6260K0337R032M463J5732j870j9138n400p749K152J3727K2484J3300k7386
5248B3424k3999j4688L150j1767J386J3768m077j0246Q333K0771k4350l539K0480
$$ plain form
5235 -1354 13563 17834 6259 1463 -1372 8322 -20080 -30626 -20218 -14429 6920 21936 25563
5222 25563 10968 10846 15201 18294 438 -5380 5065 16705 -5450 2991 13634 19555 -3743
5209 -3743 -22738 -25261 -8194 8280 -9979 -27414 -6559 7861 33152 42837 34490 30315 33607
5196 33607 32898 18235 14547 1980 -17098 -5670 -28 16157 12205 9538 16861 12480 23750
5183 23750 23187 31827 35158 5291 -12095 -2693 8969 -16210 -20218 -7222 4420 16904 3543
5170 3543 -19739 -34498 -41751 -49992 -39723 -30935 -30222 -19742 -5662 8637 23255 18035 9437
5157 9437 -11443 -15213 -2684 7433 -178 8178 6886 -5959 -10704 -1088 -1705 3606 9947 6227
5143 6227 6001 -636 -8490 2100 5160 -6853 -19527 -5748 6008 2627 -2991 24837 17355 15666
$$ packed form
5235a354J4917M271j1575m796k835R694k8402j0546J0408N789K1349J5016L627
5222B5563j4595j22M355L093j7856n818J0445J1640k2155Q441J0643N921k3298
5209c743j8995k523J7067J6474j8259j7435K0855J4420K5291R685q347m175L292
5196C3607p09j4663l688j2567j9078J1428N642J6185l952k667P323m381J1270
5183B3750n63Q640L331k9867j7386R402J1662k5179m008J2996J1642J2484j3361
5170C543k3282j4759p253q241J0269Q788P13J0480J4080J4299J4618n220q598
5157I437k0880l770J2529J0117p611Q356j292j2845m745R616o17N311O341l720
5143F227k26o637p854J0590L060j2013j2674J3779J1756l381n618K7828p482j689
$$ plain form
5129 15666 20290 6983 -2228 -7525 -5949 9825 4695 -32793 -41457 -20536 -17755 -22493 -32158 -46387
5115 -46387 -47593 -41740 -1620 31798 27568 15260 36678 50826 41852 38750 17603 4020 681
5102 681 15421 16957 11094 29193 38428 31621 24715 19765 756 -1156 -13760 -23501 -30682 -40699
5088 -40699 -29126 -32285 -36590 -11122 414 -19347 -13996 8830 30111 14319 3054 -19031
5076 -19031 -14043 -7779 -4186 -6604 -8644 -6315 -3024 12852 544 -26041 -38490 -22636 -10487
5063 -10487 -5547 -13190 -16342 -5625 -31693 -17982 8846 -2208 1011 5787 32887 38158 23721
5050 23721 6972 -3334 8019 29085 17209 -4623 2439 31316 32713 15683 3869 -20544
5038 -20544 -40820 -44386 -7136 9850 27536 34594 38007 21280 -3268 -12044 -21528 -11215 1084
$$ packed form
5129A5666M624j3307r211n297J576J5774n130l7488q664K0921K781m738r665j4229
5115d6387j206N853M0120L3418m230j2308K1418J4148q974l102k1147j3583l339
5102F81J4740J536n863J8099R235o807o906m950j9009j912j2604r741p181j0017
5088d0699J1573l159m305K5468J1536j9761N351K2826K1281j5792j1265k2085
5076a9031M988O264L593k418k040K329L291J5876j2308k6585j2449J5854J2149
5063a0487M940p643l152J0717k6068J3711K6828j1054L219M776K7100N271j4437
5050B3721j6749j0306J1353K1066j1876k1832P062K8877J397j7030j1814k4413
5038b0544k0276l566L7250J6986J7686P058L413j6727k4548q776r484J0313J2299
$$ plain form
5025 1084 19240 20719 19303 17333 1663 -3989 -1579 -10630 -16448 -12056 -10604 -12913 9443 10118
5011 10118 15166 7281 -14049 -24294 -16946 -5207 20184 11531 19332 34611 24181 15026 23052
4998 23052 6383 2311 4626 -12951 -20304 -23246 -10402 -16248 -31082 -30280 -15239 -32623 -18087
4985 -18087 -15106 -17953 -25554 -12803 9759 32350 27764 36532 37494 38991 13962 -17057 -26652 -7323
4971 -7323 -5082 -9969 -7584 17394 18891 13280 2460 10674 23323 21555 -7056 -28482 -26945 -25550
4957 -25550 -9752 -5693 11585 33565 47291 35252 14931 5771 -3172 -23927 -41548 -35218 -29806
4944 -29806 -10413 784 -7887 -21099 -10809 11865 31082 21306 -18762 -40862 -24136 -18211
4932 -18211 -6651 9452 14983 12444 -17861 -30315 -22834 -14426 -12422 -5938 1634 18949 17490
$$ packed form
5025A084J8156J479j416j970j5670n652K410r051n818M392J452k309K2356O75
5011A0118N048p885k1330j0245P348J1739K5391q653P801J5279j0430r155Q026
4998B3052j6669m072K315j7577p353k942J2844n846j4834Q02J5041j7384J4536
4985a8087K981k847p601J2751K2562K2591m586Q768R62J497k5029l1019r595J9329
4971g323K241m887K385K4978J497n611j0820Q214J2649j768k8611k1426J537J395
4957b5550J5798M059J7278K1980J3726j2039k0321r160q943k0755j7621O330N412
4944b9806J9393J1197q671j3212J0290K2674J9217r776m0068k2100J6726N925
4932a8211J1560J6103N531k539l0305j2454P481Q408K004O484P572J7315j459
$$ plain form
4919 17490 -175 -116 9155 15921 21602 12014 -10527 -15514 -26557 -37402 -33560 12744 11658 -5239
4905 -5239 -4581 5604 -11547 -1366 56 6473 12358 -1175 -14915 -17083 -21765 -22422 -12379 -10521
4891 -10521 3470 12350 6860 -3495 2911 18319 19861 21081 12542 6498 2588 10602 7757 21071
4877 21071 45077 55844 42032 37278 20472 15514 24306 38025 15111 3846 4023 -2501 3649
4864 3649 9494 7579 33705 27031 3909 -3119 -8469 -8167 -8963 -9691 -22723 -12333 787 7666
4850 7666 1870 5000 -7762 -8461 -796 11286 35637 25128 10824 -6915 -10577 -8051 -3248 -3653
4836 -3653 -14247 -6759 -1473 -23036 -25253 -5709 1538 -5386 -19378 -18461 -19771 3539 3114 5949
4822 5949 4836 -1553 -12904 -36350 -5236 14736 21832 29167 26346 26694 17579 6493 5690 -9086
$$ packed form
4919A7490j7665N9R271O766N681r588k2541m987j1043j0845L842M6304j086j6897
4905e239O58J0185j7151J0181J422O417N885j3533j3740k168m682o57J0043J858
4891a0521J3991Q880n490j0355O406J5408J542J220q539o044l910Q014k845J3314
4877B1071K4006J0767j3812m754j6806m958Q792J3719k2914j1265J77o524O150
4864C649N845j915K6126o674k3122p028n350L02p96p28j3032J0390J3120O879
4850G666n796L130j2762o99P665J2082K4351j0509j4304j7739l662K526M803m05
4836c653j0594P488N286k1563k217J9544P247o924j3992R17j310K3310m25K835
4822E949j113o389j1351k3446L1114J9972P096P335k821L48r115j1086q03j4776
$$ plain form
4808 -9086 -6262 54 8335 6328 15602 10429 8661 22922 28392 26636 20778 27007 22358 13144 3044
4793 3044 3341 4883 14541 4099 -7265 -6458 -909 15233 23128 9440 9820 15308 4612 4572 10598
4778 10598 6020 -12383 -11341 5282 11487 11618 16419 7203 -3889 -14885 -33430 -23387 -13175
4765 -13175 -16044 -4055 22734 17843 28365 18069 -9766 8992 29626 25516 12153 20586 19213
4752 19213 -4470 -5861 -16563 -20251 -12735 -25567 -22678 -16810 -29232 -45389 -37688 -36866 -8151
4739 -8151 10062 -15456 -34907 -28898 -5330 6142 20939 23967 766 -27116 -11660 -15008 -2908
4726 -2908 12928 13885 -2349 -15219 -10362 -6396 -4132 -12625 -18501 -9567 7246 -4647 -26073 -14997
4712 -14997 4788 13087 385 1144 2785 9761 -683 -6363 -10264 -23649 -18833 -29703 -30882 -36128
$$ packed form
4808i086K824O316Q281k007R274n173j768J4261N470j756n858O229m649r214j0100
4793C044K97J542R658j0442j1364Q07N549J6142P895j3688L80N488j0696m0O026
4778A0598m578j8403J042J6623O205J31M801r216j1092j0996j8545J0043J0212
4765a3175k869J1989K6789m891J0522j0296k7835J8758K0634m110j3363Q433j373
4752A9213k3683j391j0702l688P516j2832K889N868j2422j6157P701Q22K8715
4739h151J8213k5518j9451O009K3568J1472J4797L028k3201k7882J5456l348J2100
4726b908J5836R57j6234j2870M857L966K264q493n876Q934J6813j1893k1426J1076
4712a4997J9785Q299j2702P59J641O976j0444n680l901j3385M816j0870j179n246
$$ plain form
4698 -36128 -29214 -20331 -12524 -12771 -32910 -23449 -23890 -7920 9066 8202 19062 19898 26236 16932 22494
4683 22494 7749 -20280 -15401 9312 29052 21672 4597 6452 -5429 12991 19196 12048 10840
4670 10840 870 6637 708 14285 17308 21539 21135 21740 8332 3853 11447 35785 37079 19988
4656 19988 2164 19940 29607 23006 24882 26540 3985 -11687 -30407 -22012 -13183 3247 -2984
4643 -2984 8062 9106 -735 -8772 6682 11519 20578 -1536 -35498 -43938 -28547 -3543 30236
4630 30236 32441 37405 21020 16203 31121 32741 3283 10920 -4462 -3613 14908 -1930 -8734
4617 -8734 8871 11052 6717 -6518 -26676 -23892 -8529 13375 30586 34557 36241 48960 47646
4604 47646 28371 12562 -1731 -24570 -16686 -12826 11787 17094 -567 -13135 -22150 -10878 -4010
$$ packed form
4698c6128O914Q883P807k47k0139R461m41J5970J6986q64J0860Q36O338r304N562
4683B2494j4745k8029M879K4713J9740p380j7075J855j1881J8420O205p148j208
4670A0840r970N767n929J3577L023M231m04O05j3408m479P594K4338J294j7091
4656A9988j7824J7776R667o601J876J658k2555j5672j8720Q395Q829J6430o231
4643b984J1046J044r841q037J5454M837R059k2114l3962q440J5391K5004L3779
4630C0236K205M964j6385m817J4918J620k9458P637j5382Q49J8521j6838o804
4617h734J7605K181m335j3235k0158K784J5363K1904J7211L971J684J2719j314
4604D7646j9275j5809j4293k2839P884L860K4613N307j7661j2568r015J1272O868
$$ plain form
4591 -4010 9748 1785 16901 11193 4099 13270 -4000 -17186 -19498 -9328 -13391 -10799 5189
4578 5189 -3193 462 7725 19356 33331 21690 -4322 -9893 -4710 21510 18040 -82 -6221
4565 -6221 -5619 3832 9175 24599 25416 2843 -8964 -6067 12774 12036 -3542 -12786 -12821 -13595 -11404
4550 -11404 -4655 -16619 -13588 -7167 17837 24926 8584 -2735 -2327 -1661 -20871 -15576 1422 -8843
4536 -8843 -39583 -38529 -14078 -15805 -21420 -5705 -9079 2362 -20639 -38165 -38017 393 17438
4523 17438 6769 3469 5324 5515 267 -31316 -31439 -36255 -19829 8462 2163 -14006 -19633 -33788
4509 -33788 -32927 -10907 7183 30769 16650 546 -9625 -19224 -31440 -39642 -34809 -18405 -13413
4496 -13413 -16652 -16070 -7542 -10867 -3753 20898 30323 7330 -10413 5745 10365 -5132 -38617
$$ packed form
4591d010J3758p963J5116n708p094R171j7270j3186k312J0170m063K592J5988
4578E189q382L655P263J1631J3975j1641k6012n571N183K6220l470j8122o139
4565f221O02R451N343J5424Q17k2573j1807K897J8841p38j5578r244l5p74K191
4550a1404O749j1964L031O421K5004P089j6342j1319M08O66j9210N295J6998j0265
4536h843l0740J054K4451j727n615J5715l374J1441k3001j7526J48L8410J7045
4523A7438j0669l300J855J91n248l1583j23m816J6426K8291o299j6169n627j4155
4509c3788Q61K2020J8090K3586j4119j6104j0171r599j2216q202M833J6404M992
4496a3413l239N82Q528l325P114K4651R425k2993j7743J6158M620j5497l3485
$$ plain form
4483 -38617 -40428 -37093 -34263 -8568 9979 -2339 -16407 -18693 -31682 -31848 -18223 -8567 -13119
4470 -13119 -33535 -42278 -35256 918 4154 225 -7162 -7302 -4823 8666 3634 -13550 -22935 -6216
4456 -6216 12291 23472 2346 -7662 -7890 -5746 3211 1526 -20359 -8210 8990 11189 29786
4443 29786 26523 -11476 -35512 -17210 -10671 3781 4622 -9846 -3678 -15972 -11068 -116 2734
4430 2734 12017 3506 15118 23406 6909 -6348 9664 38123 36906 2215 -4677 -4576 -706 -1461
4416 -1461 4810 3446 -5625 -3435 5932 -2481 -21926 -37070 -29622 -10080 9254 5404 17703 33487
4402 33487 45454 43208 33379 26717 44533 52029 55456 28757 -865 6329 3540 -5200 -5200 -8122
4388 -8122 -7965 -17030 -11280 -17516 -24385 -17415 -29067 -31799 -20206 -5653 -11008 -1583 -15656 -20395
$$ packed form
4483c8617j811L335K830K5695J8547j2318j4068k286j2989j66J3625R656m552
4470a3119k0416q743P022L6174L236l929p387j40K479J3489n032j7184r385J6719
4456f216J8507J1181k1126j0008k28K144Q957j685k1885J2149J7200K199J8597
4443B9786l263l7999k4036J8302O539J4452Q41j4468O168j2294M904J0952K850
4430B734R283q511J1612Q288j6497j3257J6012K8459j217l4691o892J01L870p55
4416a461O271j364r071K190R367q413j9445j5144P448J9542J9334l850J2299J5784
4402C3487J1967k246r829o662J7816P496L427k6699k9622P194k789q740%k922
4388h122J57r065N750o236o869O970j1652k732J1593J4553n355R425j4073m739
$$ [...]
##END NTUPLES=NMR SPECTRUM
##END=
