##TITLE=Analysis number 315000
Compound Code km 10055
Project Code adrs
Chemist Name endeavour
##JCAMPDX= 6.0         $$ Bruker NMR JCAMP-DX V2.0
##DATA TYPE= NMR SPECTRUM
##DATA CLASS= NTUPLES
##ORIGIN= Bruker BioSpin GmbH
##OWNER= NMR
$$ XWIN-NMR		Version 3.5
$$ Wed Nov  2 14:46:12 2005 GMT Standard Time (UT+0h)  MAYBRIDGE\NMR@NMR_250MHZ
##.OBSERVE FREQUENCY= 250.131544655141
##.OBSERVE NUCLEUS= ^1H
##.ACQUISITION MODE= SIMULTANEOUS (DQD)
##.ACQUISITION SCHEME= undefined
##.AVERAGES= 16
##.DIGITISER RES= 18
##SPECTROMETER/DATA SYSTEM= dpx250
##.PULSE SEQUENCE= zg30
##.SOLVENT NAME= CDCl3
##.SHIFT REFERENCE= (INTERNAL, CDCl3, 0, 16.4974)
##AUDIT TRAIL= $$ (NUMBER, WHEN, WHO, WHERE, WHAT)
$$ ##TITLE= Audit trail, XWIN-NMR		Version 3.5
$$ ##JCAMPDX= 5.01
$$ ##ORIGIN= Bruker BioSpin GmbH
$$ ##OWNER= NMR
$$ C:\u/data/dgb/nmr/ADRS/11800/pdata/1/auditp.txt
$$ ##AUDIT TRAIL=  $$ (NUMBER, WHEN, WHO, WHERE, WHAT)
(   1,<2005-11-02 14:44:44.10 +000>,<MAYBRIDGE\NMR>,<NMR_250MHZ>,
      <created by zg, POWCHK disabled, PULCHK disabled
       configuration hash MD5:
       62 19 C7 07 E1 42 D1 B7 37 6C 3D D0 77 39 F9 E6
       data hash MD5: 64K
       0C 40 41 C2 00 E8 68 2D C4 7A F6 D5 81 8A 63 00>)
(   2,<2005-11-02 14:45:31.53 +000>,<MAYBRIDGE\NMR>,<NMR_250MHZ>,
      <Start of raw data processing
       ef LB = 0.3 FT_mod = 6 PKNL = 1 SI = 32K 
       data hash MD5: 32K
       FA 1E A6 33 CA 0E 6A CC 9A C5 50 AA 21 28 57 3D>)
(   3,<2005-11-02 14:45:36.10 +000>,<MAYBRIDGE\NMR>,<NMR_250MHZ>,
      <apk 
       data hash MD5: 32K
       78 9B 6D 1E 71 D6 2E 4F 68 3B ED 49 32 3D 93 07>)
(   4,<2005-11-02 14:45:38.03 +000>,<MAYBRIDGE\NMR>,<NMR_250MHZ>,
      <abs ABSG = 5 
       data hash MD5: 32K
       D6 DD 87 35 CB 34 87 16 E7 7E 45 9F 2C 14 1A 83>)
$$ ##END=
$$ 
$$ hash MD5
$$ 4A C5 F5 33 EB 6D 92 2B D2 BD A6 04 E1 F3 7D A6
##$RELAX= 
##$RELAX= 
##$RELAX= 
##$RELAX= 
##$RELAX= 
##$RELAX= 
##$RELAX= 
$$ Bruker specific parameters
$$ --------------------------
##$DU= <C:\u>
##$EXPNO= 11800
##$NAME= <ADRS>
##$PROCNO= 1
##$TYPE= <nmr>
##$USER= <dgb>
##$AMP= (0..31)
100 100 100 100 100 100 100 100 100 100 100 100 100 100 100 100 100 100 
100 100 100 100 100 100 100 100 100 100 100 100 100 100 
##$AQSEQ= 0
##$AQ_mod= 3
##$AUNM= <au_zg>
##$AUTOPOS= <32 >
##$BF1= 250.13
##$BF2= 250.13
##$BF3= 250.13
##$BF4= 250.13
##$BF5= 500.13
##$BF6= 500.13
##$BF7= 500.13
##$BF8= 500.13
##$BYTORDA= 1
##$CFDGTYP= 0
##$CFRGTYP= 5
##$CHEMSTR= <none>
##$CNST= (0..31)
1 1 145 1 1 1 1 1 1 1 1 1 1 1 1 1 1 1 1 1 1 1 1 1 1 1 1 1 1 1 1 1 
##$CPDPRG= <>
##$CPDPRG1= <>
##$CPDPRG2= <>
##$CPDPRG3= <>
##$CPDPRG4= <mlev>
##$CPDPRG5= <mlev>
##$CPDPRG6= <mlev>
##$CPDPRG7= <mlev>
##$CPDPRG8= <mlev>
##$CPDPRGB= <>
##$CPDPRGT= <>
##$D= (0..31)
0 1 0 0 0 0 0 0 0 0.06 0 0 0 0 0 0 0.0002 0 0 0 0 0 0 0 0 0 0 0 0 0 0 
0 
##$DATE= 1130942682
##$DBL= (0..7)
120 120 120 120 120 120 120 120 
##$DBP= (0..7)
150 150 150 150 150 150 150 150 
##$DBP07= 0
##$DBPNAM0= <>
##$DBPNAM1= <>
##$DBPNAM2= <>
$$ [...]
##$SUBNAM7= <"">
##$SUBNAM8= <"">
##$SUBNAM9= <"">
##$SW= 20.6930455092707
##$SWIBOX= (0..15)
0 0 3 0 0 0 0 0 0 0 0 0 0 0 0 0 
##$SW_h= 5175.983436853
##$TD= 65536
##$TD0= 1
##$TE= 295.16
##$TE2= 300
##$TE3= 300
##$TEG= 300
##$TL= (0..7)
0 120 120 120 120 120 120 120 
##$TP= (0..7)
150 150 150 150 150 150 150 150 
##$TP07= 0
##$TPNAME0= <>
##$TPNAME1= <>
##$TPNAME2= <>
##$TPNAME3= <>
##$TPNAME4= <>
##$TPNAME5= <>
##$TPNAME6= <>
##$TPNAME7= <>
##$TPOAL= (0..7)
0.5 0.5 0.5 0.5 0.5 0.5 0.5 0.5 
##$TPOFFS= (0..7)
0 0 0 0 0 0 0 0 
##$TUNHIN= 0
##$TUNHOUT= 0
##$TUNXOUT= 0
##$USERA1= <user>
##$USERA2= <user>
##$USERA3= <user>
##$USERA4= <user>
##$USERA5= <user>
##$V9= 5
##$VALIST= <valist>
##$VCLIST= <CCCCCCCCCCCCCCC>
##$VD= 0
##$VDLIST= <DDDDDDDDDDDDDDD>
##$VPLIST= <PPPPPPPPPPPPPPP>
##$VTLIST= <TTTTTTTTTTTTTTT>
##$WBST= 1024
##$WBSW= 4
##$XGAIN= (0..3)
0 0 0 0 
##$XL= 0
##$YL= 0
##$YMAX_a= 515083
##$YMIN_a= -594271
##$ZGOPTNS= <>
##$ZL1= 120
##$ZL2= 120
##$ZL3= 120
##$ZL4= 120
##$ABSF1= 16.49743
##$ABSF2= -4.195742
##$ABSG= 5
##$ABSL= 3
##$ALPHA= 0
##$AQORDER= 0
##$ASSFAC= 0
##$ASSFACI= 0
##$ASSFACX= 0
##$ASSWID= 0
##$AUNMP= <proc_1d>
##$AZFE= 0.1
##$AZFW= 0.1
##$BCFW= 0
##$BC_mod= 0
##$BYTORDP= 0
##$COROFFS= 0
##$CY= 12.5
##$DATMOD= 1
##$DC= 0
##$DFILT= <>
##$DTYPP= 0
##$F1P= 14.0000005364418
##$F2P= -0.99999901652339
##$FCOR= 0.5
##$FTSIZE= 32768
##$FT_mod= 6
##$GAMMA= 0
##$GB= 0
##$INTBC= 1
##$INTSCL= 1
##$ISEN= 128
##$LB= 0.3
##$LEV0= 0
##$LPBIN= 0
##$MAXI= 10000
##$MC2= 0
##$MEAN= 0
##$ME_mod= 0
##$MI= 0
##$NCOEF= 0
##$NC_proc= -3
##$NLEV= 6
##$NOISF1= 0
##$NOISF2= 0
##$NSP= 0
##$NTH_PI= 0
##$NZP= 0
##$OFFSET= 16.49743
##$PC= 1
##$PHC0= -102.155
##$PHC1= 40.1919
##$PH_mod= 1
##$PKNL= yes
##$PPARMOD= 0
##$PSCAL= 4
##$PSIGN= 0
##$REVERSE= no
##$SF= 250.130006143453
##$SI= 32768
##$SIGF1= 0
##$SIGF2= 0
##$SINO= 400
##$SIOLD= 32768
##$SREGLST= <1H.CDCl3>
##$SSB= 0
##$STSI= 32768
##$STSR= 0
##$SW_p= 5175.98343685301
##$SYMM= 0
##$S_DEV= 0
##$TDeff= 65536
##$TDoff= 0
##$TI= <Analysis number 999999
Compound Code 99
Book Reference 9
Project Code 9>
##$TILT= no
##$TM1= 0
##$TM2= 0
##$TOPLEV= 0
##$USERP1= <user>
##$USERP2= <user>
##$USERP3= <user>
##$USERP4= <user>
##$USERP5= <user>
##$WDW= 1
##$XDIM= 32768
##$YMAX_p= 385029955
##$YMIN_p= -529763
$$ End of Bruker specific parameters
$$ ---------------------------------
##NTUPLES= NMR SPECTRUM
##VAR_NAME=  FREQUENCY,     SPECTRUM/REAL,   SPECTRUM/IMAG
##SYMBOL=    X,             R,               I
##VAR_TYPE=  INDEPENDENT,   DEPENDENT,       DEPENDENT
##VAR_FORM=  AFFN,          ASDF,            ASDF
##VAR_DIM=   32768,         32768,           32768
##UNITS=     HZ,            ARBITRARY UNITS, ARBITRARY UNITS
##FACTOR=    0.157963299565203, 1,           1
##FIRST=     4126.50246770327, 0,            0
##LAST=      -1049.48096914974, 0,           0
##MIN=       -1049.48096914974, -529763,     0
##MAX=       4126.50246770327, 385029955,    0
$$ Real data points
##PAGE= N=1
##DATA TABLE= (X++(R..R)), XYDATA
$$ [...]
19767b333k535M689n38l516m925l898J693L084M145M170m49q153k458K517N933
19752b574Q488l512o889o459o488N056J174P363K005K961R05j89K000j987l565
19737a711p15Q043L20k516j614m576M853L866k665K035q47k244Q05L113k570m331
19721g54n292j38L096J880L74K208l62K171Q64k980m665m41N17l00M470R47Q24
19704B419K129n134r3Q23o50j021k182j445J053K938L785k294L301K76k474N897
19688G328j410n296L03M065p92r07n579l702K778k28Q7j61m945k413O644P312
19672C084k919j945K684Q95j279n11M839P602p749n827j303L99j342l637M405
19657b604N793l442o292K044K567J325M420m312n063J810j625L478N8l85J019
$$ plain form
19767 -2333 -4868 -179 -717 -4233 -9158 -13056 -11363 -8279 -4134 36 -413 -8566 -11024 -8507 -2574
19752 -2574 5914 2402 -4487 -10946 -17434 -12378 -11204 -3841 -1836 1125 2030 1841 3841 1854 -1711
19737 -1711 -2426 5617 5937 3421 1807 -2769 2084 5950 3285 5320 4473 2229 3034 6147 3577 -754
19721 -754 -6046 -6184 -3088 -1208 -834 1374 1012 3183 4047 1067 -3598 -4039 -3522 -3822 648 1595 2419
19704 2419 4548 -586 -679 144 -506 -1527 -3709 -5154 -4101 -1163 2622 328 3629 3905 1431 7328
19688 7328 5918 622 925 4990 4198 3291 -2288 -5990 -3212 -3440 -3353 -3514 -8459 -10872 -4228 3084
19672 3084 165 -1780 904 1799 520 9 4848 12450 4701 -1126 -2429 -2030 -3372 -7009 -2604
19657 -2604 3189 -253 -6545 -4501 -1934 -609 3811 -501 -5564 -3754 -5379 -1901 -1843 -2228 -1209
19642a209j292l565M797J410l948J424r59K138M620R56J012m112m065K382o13
19627a024J780J072M247j40k348J540j4n306o28J70K739K740k24o547j293Q85
19611b351J686R59N33j355j139K922M64l927K291M365M254m571j4829o50Q997
19596b351J100l210O37o61K00K624K622K549k823r22j181J420j634l123p317o099
19580a8169J386J0282R351j467J564L631o531q85k946m80j181P032L55J408M177
19565G527j617M542M049N61k694p267m428M546o74Q6k886J874n72l788M365o714
19549c090n682j73J686k767K788L717K156j210J651P25j947M274M401K614n054
19534D089j696l918L543O214j002m884K882O692n797k633j356L102j850J251M154
$$ plain form
19642 -1209 -2501 -6066 -1269 141 -3807 -2383 -3342 -1204 3416 4372 5384 1272 -2793 -411 -1024
19627 -1024 756 1828 6075 5935 3587 5127 5113 -193 -821 -651 2088 4828 4604 -1943 -3236 -2351
19611 -2351 -665 294 827 -528 -1667 1255 1719 -2208 83 4448 8702 4131 -10698 -11348 -2351
19596 -2351 -1251 -4461 -3824 -4485 -4285 -1661 961 3510 687 -235 -1416 4 -1630 -4753 -12070 -18169
19580 -18169 -16783 -6501 2850 1383 2947 6578 47 -838 -3784 -4264 -5445 1587 1942 3350 7527
19565 7527 5910 10452 14501 15062 12368 5101 673 5219 4545 4631 1745 3619 3047 -741 3624 -3090
19549 -3090 -8772 -8945 -7259 -10026 -7238 -3521 -1365 -2575 -924 -199 -2146 2128 6529 9143 4089
19534 4089 2393 -1525 2018 8232 7230 2346 5228 11920 6123 3490 2134 5236 3386 4637 8791
19519H791o189l139j635R04N384M631k872Q05L373j17j287n982J4M98j808J765
19503C136k298r42O34k428m575k101l09k78j77j521J500J79k347K941M121q93
19487e358M990k026k127J376p70n1J835M719o142k844K937P537m093p523N067
19472b473L170l286o525j579L50J1967N295L874l24q544j553o009J018Q271P030
19457A0682l716o631k3q00J39n218L256Q832O731l907r65L970o285p897J43j143
19441b832L212o0n18l950p877J392M581L15Q39l72L900n07n334J236O840M583
19425E448o16K073j479q80n747k285L705K768M93K495J394o890q294k193P279
19410b729L926j46j652M112K223n456J400P98j501k450n846M198j562K598N174
$$ plain form
19519 8791 2602 -537 -2172 -1268 4116 8747 5875 6680 10053 9936 8649 2667 2681 3179 1371 3136
19503 3136 838 -104 530 -1898 -6473 -8574 -8883 -9161 -9338 -10859 -9359 -9180 -11527 -8586 -4465 -5358
19487 -5358 -368 -2394 -4521 -3145 -3915 -3966 -2131 2588 -3554 -6398 -3461 4076 -17 -7540 -2473
19472 -2473 697 -2589 -9114 -10693 -10343 1624 6919 10793 10469 1925 372 -5637 -4619 3652 10682
19457 10682 6966 335 312 -488 -349 -5567 -2311 6521 13252 9345 8380 12350 6065 -1832 -1689 -2832
19441 -2832 380 320 -198 -4148 -12025 -10633 -6052 -5737 -4898 -5270 -1370 -1877 -7211 -5975 865 5448
19425 5448 4832 6905 5426 4546 -1201 -3486 219 2987 3480 5975 7369 479 -7815 -10008 -2729
19410 -2729 1197 1051 -601 3511 5734 278 1678 2476 975 -1475 -7321 -3123 -4685 -2087 3087
19395C087L605K613r692n054K951P001k198k952p858L300N253J078j32k137K104
19380I69n47j092J090j001n508N78P32m051l367O873O836j043j150M002J570P11
19364E602P69O80M11j190Q12N7k19R09K726k236p032k904P38O874M87p88l675
19347B021j2528N512N511K21n72j664k523K953N683P18n127k658P594M106o604
19332B643o597K363k982K62j939l165K928N560N404K978O080j310l957j412j691
19317E165K472N224p82m022J297l853m75K848J953p802m19P690N429j159l59R75
19301A4182L904K22l050k205l071k990K531r92j896L649o945l858M185R62K873
19286G501n651l104j155P02K385l893J677J135l36L066n20q424J766j88K803L652
$$ plain form
19395 3087 6692 9305 -387 -5441 -2490 4511 2313 -639 -8497 -5197 56 1134 1002 -1135 969
19380 969 422 -670 420 -581 -6089 -5511 -4779 -8830 -12197 -5324 1512 469 -681 3321 4891 5602
19364 5602 6371 7051 7462 6272 7084 7141 6922 7831 10557 8321 1289 -1615 -877 5997 6484 5696 2021
19347 2021 -10507 -4995 516 737 165 -1499 -4022 -1069 4614 5332 205 -2453 5141 9247 2643
19332 2643 -3954 -1591 -4573 -4311 -6250 -9415 -6487 -927 4477 7455 13535 12225 8268 6856 5165
19317 5165 7637 12861 12079 8057 9354 5501 5026 7874 9827 2025 1606 9296 14725 13566 13207 14182
19301 14182 18086 18308 15258 13053 9982 6992 9523 8531 6635 10284 3339 -519 3666 4628 7501
19286 7501 1850 -1254 -2409 -1707 678 -3215 -1538 -403 -739 2327 1807 -6617 -4851 -5039 -2236 1416
19270A416o758J450O819m389K276j300K310M397K017q25N56j737P08l860K608
19255E688L843K57K306m055M176j565n180M87l428p766l748L829R691J13p994
19240c346q494Q88j285j18N864j225j04Q096J011k967J99k857L927N984j56o308
19224h91J730P507j053J645j24j217N566p640k712l087M280J193k634O129M431
19209A3123J172P85k509p506n743l532N324P672k055j791m374n540p80k337L822
19194d269K342M027k019l0l977q82Q8J014m632M588K126j722J432j748L743l064
19178b983m89l92Q933K69r489l140O632K653L615n348m528k468J083M544Q784
19163G676l531K273k12L395K532J815m598L173K166L007J848k493m973l643m022
$$ plain form
19270 1416 -5342 -3892 2927 -1462 814 -486 1824 6221 8238 7413 7969 6232 6940 3080 5688
19255 5688 9531 9788 12094 8039 12215 10650 5470 5957 2529 -5237 -8985 -5156 4535 4648 -3346
19240 -3346 -11840 -10952 -12237 -12355 -6491 -7716 -7820 276 1287 -1680 -1481 -4338 -411 5573 5417 -891
19224 -891 839 8346 7293 8938 8814 7597 13163 5523 2811 -276 4004 5197 2563 8692 13123
19209 13123 14295 15080 12571 5065 -678 -4210 1114 8786 6731 4940 566 -4974 -5754 -8091 -4269
19194 -4269 -1927 2100 81 51 -3926 -4808 -4720 -3706 -8338 -3750 -1624 -3346 -1914 -3662 81 -2983
19178 -2983 -3472 -3864 5069 5338 -4151 -7291 -659 1994 5609 261 -4267 -6735 -5652 -1108 7676
19163 7676 4145 6418 6206 9601 12133 13948 9350 12523 14689 17696 19544 17051 12078 8435 4413
19148D413L034m667J773J002k384r6M749K080L032k651j929R77j616n351o839
19133d473k334L684R667N038o701j624m812m943J415K199N649J345L342n69n251
19118A632N501m696k971R01N201l234j908k528K103K518l222K195N80j32j898
19103D2J679L390m129K639j526k703m370m980k975J035q3J763K020n06K534L86
19087e784J837L06O484k067K78L676J500j35l809N717K094j918P428k956m291
19072H360k090l319K777l036M446k663l409j2159n66N867N792R71q351q0O661
19057g99p55K874O12p849K93P168P994k714j0465m081j07M645l713k620N3L592
19041e872L394M867M181J06m227n013j293p90J679J351J709n621l396l48k356
$$ plain form
19148 4413 7447 2780 4553 5555 3171 3075 7824 9904 12936 10285 8356 9333 7717 2366 -4473
19133 -4473 -6807 -3123 6544 11582 4881 3257 -1555 -6498 -5083 -2884 2765 4110 7452 6883 1632
19118 1632 7133 2437 -534 367 5568 2334 426 -2102 1 2519 -703 1492 2072 1940 42
19103 42 1721 5111 982 3621 2095 -608 -4978 -9958 -12933 -11898 -11981 -10218 -8198 -8704 -6170 -5784
19087 -5784 -3947 -3641 2843 776 1054 4730 6230 6095 2286 8003 10097 8179 15607 12651 8360
19072 8360 6270 2951 5728 2692 7138 4475 1066 -11093 -11659 -5792 0 971 -7380 -7460 -799
19057 -799 -1554 1320 1932 -5917 -5624 1544 9538 6824 -3641 -7722 -7829 -3184 -6897 -9517 -9464 -5872
19041 -5872 -2478 2389 6570 6676 2449 -2564 -3857 -4647 -2968 -1617 92 -5529 -8925 -9273 -11629
19026a1629L985L590L700J287L956k738p481j581R07O576k991k657Q480j647q15
19011I42l686m236Q82M046L989O927L600l780k32o656j015m540l740N973P126
18996E600p198m677P367L175n555L06j789K686p95L627P161N399J82m191k479
18981H819L905l18l681n991p26O943O978K700m368q166n512j68j98j905O29k448
18965c507R43P86K503j367J250n7j653J404J392J829k239L765J20J122j536J79
18949D934o88l12L323l658k601n154l721M158j665j44N378J927Q20k936j079J970
18933E52n495m728l089j619L865L464M030J667m698j69M012O49k348k217l26M734
18917a716N4k517K848n495j221N942J651K63l55M158J037m337L56J786M292p638
$$ plain form
19026 -11629 -7644 -4054 -354 933 4889 2151 -5330 -6911 -6004 572 -2419 -5076 3404 1757 942
19011 942 -2744 -6980 -6098 -2052 1937 8864 12464 8684 8452 1796 781 -3759 -7499 -1526 5600
18996 5600 -1598 -6275 1092 4267 -1288 -982 -2771 -85 -880 2747 9908 15307 15489 11298 8819
18981 8819 12724 12406 8725 2734 2008 8951 15929 18629 14261 6095 583 415 217 -1688 -1059 -3507
18965 -3507 -2564 -1778 725 -642 608 551 -1102 302 1694 3523 1284 5049 5169 6291 4755 4934
18949 4934 4246 3934 7257 3599 998 -4156 -7877 -3719 -5384 -5528 -150 1777 2597 -339 -1418 552
18933 552 -4943 -9671 -12760 -14379 -10514 -7050 -3020 -1353 -6051 -6220 -2208 -1559 -3907 -6124 -6450 -1716
18917 -1716 -1662 -4179 -1331 -6826 -8047 -2105 -454 -191 -546 3612 4649 312 668 2454 6746 -892
18901h92J570n47M426K223k048p213j959j937K252J185Q557r6k977l993N063O408
18885A0022N71J828k715p638l001q406j027j471K528L623J921M030l231l439L775
18870b630L906N288k94k349N156o607n894O182j640k053m749m80J453O533j62
18855A660l332N22K643N584N740n86j317k376k779K268L661j112n741N766J573
18840A2174l204k909J588M777K013o624o268p57K29P525N680K853R504j792j0478
18825A4311k649M90l038J492N254M861q960l558K06N65q187m66R52q10M099J518
18809F080m443O20N734K695r642L60o981p889m00o84J914O750P757K783m87o15
18793C552j163Q7J720Q544R67q753o80M540N59n012L462j218P26J199O65q214
$$ plain form
18901 -892 678 131 4557 6780 4732 -2481 -4440 -6377 -4125 -2940 5617 5521 2544 -1449 3614 10022
18885 10022 10593 12421 9706 2068 -933 -9339 -10366 -11837 -9309 -5686 -3765 265 -2966 -6405 -2630
18870 -2630 1276 6564 6270 3921 9077 2470 -3424 2758 1118 -935 -5684 -6164 -4711 1822 1660
18855 1660 -1672 -1150 1493 7077 12817 12231 10914 8538 5759 8027 11688 10576 4835 10601 12174
18840 12174 8970 6061 7649 12426 14439 7815 1547 790 1019 8544 14224 17077 26581 24789 14311
18825 14311 11662 12152 9114 10606 15860 20721 11761 8203 8409 8974 787 321 1273 463 4562 6080
18809 6080 1637 2257 7991 10686 1044 1404 -5577 -13466 -13866 -14550 -12636 -5886 1871 4654 4167 3552
18793 3552 2389 2476 4196 12740 13707 4954 4274 8814 9373 4361 7823 6605 7331 8530 9195 981
18777I81p160J825N333Q261m30L948k82l61K861O080R739J0006J2080J7551n428
18762F5004k2464k921j851o646q127p041l132o807n205J07O338M127j54L303n10
18747A4021m418P133k700l176n616n368K080l138j275M148O289l717J780L413
18733I456m1J540K651j291q438L84j223k77Q225k087L32L028N142K695j130Q58
18717A9824k349l424j091j0567L175M723o266L931J194O663L935o356q483j290
18703C619Q94l759J663j386O061J062j565n762l896L000K136N095l263p897l417
18688g415N509q924K351J1316M673K87n02p498p766M018k462M903P978K08M33
18673G109k085L167K339p732k338K985K757k707j80M965k89k34j618m534l198
$$ plain form
18777 981 -6179 -4354 979 9240 8810 12758 12476 12115 14976 21056 30795 40801 52881 70432 65004
18762 65004 42540 39619 37768 31122 22995 15954 12822 6015 810 917 7255 11382 11228 14531 14021
18747 14021 9603 16736 14036 10860 5244 -124 1956 -1182 -2457 1691 7980 4263 6043 9456
18733 9456 9415 10955 13606 12315 3877 4261 3038 2761 10986 8899 9231 12259 17401 20096 18966 19824
18717 19824 17475 14051 12960 2393 5568 10291 4025 7956 9150 15813 19748 13392 4909 3619
18703 3619 4513 754 2417 1031 7092 8154 6589 827 -3069 -69 2067 7162 3899 -3998 -7415
18688 -7415 -1906 -10830 -8479 2837 7510 7797 7295 -203 -7969 -3951 -6413 -1510 6468 6676 7109
18673 7109 5024 8191 10530 2798 460 3445 6202 3495 3315 8280 7991 7757 6139 1605 -1593
18658a593o308m824M941P389n387k498L554O438J04q619n433O693J0951L801r860
18643f51p460M528n37n021K702L773K034K181m37M98k069m338j923n50K036L571
18627a663L414q31J097K172l46k282l705j421J567j393J592K815k510L90R96l535
18611c643k702j699P453P312J148m538j587L128K865l98N50J584M911K806m357
18596A2833o049N419k406M97o786j123N494r68p546l612o26L274O537J526R61
18581G425M69k428k551R9M010K490J793L388L008L857O297j075k691p30m002R971
18565B9330M831l277j084m094j230m312J633m978n786J698J651l25M247j702n078
18550A1524k064m316q19O173K147r430n303O867O68k400m368l993O362K098k382
$$ plain form
18658 -1593 -7901 -12725 -7784 -395 -5782 -8280 -4726 1712 1816 -6803 -12236 -5543 5408 9209 -651
18643 -651 -8111 -3583 -4120 -9141 -6439 -2666 -632 1549 1112 1610 -459 -4797 -6720 -7270 -5234 -1663
18627 -1663 1751 920 2017 4189 3843 1561 -2144 -3565 -1998 -3391 -1799 1016 -1494 -1104 -108 -3643
18611 -3643 -6345 -8044 -591 6721 7869 3331 1744 4872 7737 7339 7889 9473 14384 17190 12833
18596 12833 6784 12203 9797 10294 3508 2385 7879 6911 -635 -4247 -4873 -1599 4938 6464 7425
18581 7425 7894 5466 2915 3014 7024 9514 11307 14695 17703 21560 27857 26782 24091 23361 19359 29330
18565 29330 34161 30884 29800 25706 24476 20164 21797 16819 11033 12731 14382 14057 18304 16602 11524
18550 11524 9460 5144 4325 10498 12645 3215 -2088 4779 5447 3047 -1321 -5314 1048 3146 764
18535G64o49M953M047r35J393L447L026L476j014r132P36M141j841p939m111J812
18519B174k223N145K441l0l761j317j082P3J920J1725K579o062k92N739o48p241
18503I140j075R6K362j115k952L370j643n291L751j59p73M832N452K07j471l49
18487A4382l408j929j219M489N601m29j3700j305l212P07Q560K925m455m805l876
18472a674k887k201J227P672m385k581L086j367l762o30L326P416K34J644K216
18457G334O142j839J896L402m73O57l686j457o706n85O086l049l800J556O885
18442A2363N82l854m786J65Q710k852q790L741n394n10l424M311N204o289J262
18427D39l28K435Q94k738j715N510K597k375o168k968k922M472J2771M519P28
$$ plain form
18535 764 115 5068 9115 8180 9573 13020 16046 19522 18508 9376 10112 14253 12412 4473 362 2174
18519 2174 -49 5096 7537 7507 3746 2429 1347 1420 3340 15065 17644 11582 11290 17029 16381 9140
18503 9140 8065 8161 10523 9408 6456 9826 8183 2892 6643 6484 5711 10543 15995 16202 14731 14382
18487 14382 10974 9045 7826 12315 17916 17487 3787 2482 -730 -23 8537 11462 7007 2202 -1674
18472 -1674 -4561 -6762 -5535 2137 -2248 -4829 -1743 -3110 -6872 -7502 -4176 3240 3474 5118 7334
18457 7334 13476 11637 13533 16935 16462 17119 13433 11976 5270 4685 10771 7722 3922 5478 12363
18442 12363 12945 9091 4305 4470 13180 10328 1538 5279 -115 -625 -4049 262 5466 -823 439
18427 439 111 2546 3440 702 -1013 4497 7094 4719 -1449 -4417 -7339 -2867 9904 14423 15151
18412A5151J1141O059k464q048K888k617l081k293m146m93j015O09L719N52N402
18397B1364n607q715k815J470N083r40J809l865k190p79j468p92j156j02L261
18382D558Q141J498j462k523Q92J94k224R28j080L193Q00k556j760m327k022N44
18366B794J3607Q856l924m417p33J787l633m729o431K55Q606k696j171N007L358
18351A6536N394o59n17L2j499L20j1039r156q15P620N239k650p296K526m317m21
18335g02Q780R530O54l432n707L071P953J869p261m976k929l924K328M848P010
18320A7112j069r545K858Q474M692j907J274o17q48P381l841o25K153m945o009
18305A4538n806l491J795L050r85N52N080L643K695o760m991j9o26M083K660L545
$$ plain form
18412 15151 26292 32351 29887 21839 24727 22110 19029 16736 12590 12097 11082 11691 15410 15962 21364
18397 21364 15757 7042 4227 5697 10780 9840 11649 7784 5594 4815 3347 2555 1399 1297 4558
18382 4558 12699 14197 12735 10212 11104 11298 9074 10002 8922 12115 12915 10359 8599 4272 2250 2794
18366 2794 16401 25257 21333 16916 16183 17970 14337 9608 3177 3432 12038 9342 8171 13178 16536
18351 16536 21930 21271 20754 20786 19287 19607 8568 -588 -1403 6217 11456 8806 1510 4036 -281 -702
18335 -702 8078 17608 18262 14830 9123 12194 20147 22016 14755 9779 6850 2926 5254 10102 17112
18320 17112 16043 6498 9356 17830 22522 20615 21889 21272 20424 27805 23964 23339 25492 20547 14538
18305 14538 8732 5241 7036 10086 9101 9653 14733 18376 21071 14311 9320 9301 8675 12758 15418 18963
18289A8963L989p14k257m568j027N355J384j79J0115L52p051o848M960r29o447
18274A5098J709K36M15k534l643n417l898n35K087r08j260M711J14o031q561j174
18258i591K893N016M348M499J2085Q727J603m664k06K364o442m53j721k424m025
18243A2009J074O262M19O24J0534m26m231j727M135J480j0586K375L015K355M734
18228C2046O78N8j730m194n40j77n148n482N123J784P008O108j798j263n93K94
18212C2174N925l903k316Q35N063N655J215n977j446o432Q50P020p945p181P804
18197C1341P486m010J215P080J179n574l812N182k02n544M086k367M951O081m309
18182D2783l069p68M462L187J145l265K366K259o392N81Q996P822n97l989O08
$$ plain form
18289 18963 22952 22238 19981 15413 14386 19741 21125 20946 31061 31413 24362 17514 22474 21545 15098
18274 15098 16807 17043 17458 14924 11281 5864 1966 1431 3518 2610 1350 6061 6175 144 -8417 -9591
18258 -9591 -6698 -1682 2666 7165 19250 27977 29580 24916 24710 27074 20632 20179 18458 16034 12009
18243 12009 13083 19345 19764 20388 30922 30496 26265 24538 28673 30153 19567 21942 24957 27312 32046
18228 32046 32724 32782 31052 26858 26318 26141 20993 15511 20634 22418 29426 35534 33736 32473 31880 32174
18212 32174 38099 34196 31880 32715 37778 43433 44648 38671 37225 30793 31643 38663 30718 23537 31341
18197 31341 38827 34817 36032 43112 44291 38717 34905 40087 39885 34341 38427 36060 41011 47092 42783
18182 42783 39714 38946 43408 46595 47740 44475 46841 49100 42708 43289 52285 60107 59510 55521 56129
18167E6129P365l668n841K266J076O397k175l324N383J326m298K246J054N479
18153F9415N78K890R293J215n904j066j293K002L635J3530O722J182l159L306
18139A02346Q282O784K537J987J2603O966L028O831O006M905Q842P478P688J2130
18125A98413K1271J9256J2248K1000K2104K4304L2110N0941O1085O7924Q1555
18114F12211R2227J18112J63666K28433L13680M49982P27140J294646K452325
18105F452422L700450J742444j884542k106727j153660j580214j984251j314080
18097A871842p01118m28350k84425j75824j17252o9648m4083k2301j8715j3088
18087b962r858j0878r394m744l355o294P0L407m95k037O43o292l467p64J360M500
$$ plain form
18167 56129 63494 59826 53985 56251 57327 63724 61549 58225 63608 64934 60636 62882 63936 69415
18153 69415 69993 72883 82176 83391 77487 76421 75128 77130 80765 94295 101017 102199 99040 102346
18139 102346 110628 117412 119949 121936 134539 141505 144533 151364 157370 162275 171117 178595 186283 198413
18125 198413 219684 238940 251188 272188 294292 318596 350706 401647 462732 530656 612211
18114 612211 704438 822550 986216 1214649 1528329 1978311 2705451 4000097 6452422
18105 6452422 10152872 11895316 10010774 7904047 6750387 5170173 3185922 1871842
18097 1871842 1170724 742374 457949 282125 164873 95225 51142 28841 10126 -2962
18087 -2962 -12820 -23698 -33092 -37836 -41191 -47485 -47415 -44008 -44503 -46540 -45897 -52189 -55656 -56420 -55060 -50560
18071e0560K965l297q15Q09J093R6L088j385k555n992k921K327Q05M538q90o08
18055e3302m560k052Q67O441Q23N216k007l244M208N334k643j139L296Q00J398
18040d0564M457k93m594L087P164o165l093L068M20j137K957N933j726j1526n804
18025d7816R131P887M891j745l187r07m181O08Q41P22l398L451N353M22p391J0
18009c5309M765J9J113r13O154L026j585j75n0J857o59o089m936N390L242j1993
17993c6143Q15L515j054M058P566N142n190k898J934L488J310k100O08n060o180
17978c0189p41O727M303o889J75J569k966o120k618J1054J973o53j767r96K358
17963b4780K743p219l285K260P503j709m556l238L785K355q29R438J3707R897
$$ plain form
18071 -50560 -47595 -50892 -51707 -50898 -49805 -49709 -46621 -48006 -50561 -56553 -59474 -57147 -56342 -51804 -52694 -53302
18055 -53302 -57862 -59914 -59047 -52606 -51783 -46567 -48574 -51818 -47610 -42276 -44919 -46058 -42762 -41962 -40564
18040 -40564 -36107 -36400 -40994 -37907 -30743 -36908 -40001 -36933 -36513 -37650 -34693 -28760 -30486 -42012 -47816
18025 -47816 -38685 -30798 -25907 -27652 -30839 -31746 -35927 -35319 -34478 -33756 -37154 -33703 -28350 -27928 -35319 -35309
18009 -35309 -30544 -30525 -29412 -30325 -24171 -21145 -22730 -22905 -22955 -21098 -21757 -27846 -32782 -27392 -24150 -36143
17993 -36143 -35328 -31813 -32867 -28809 -21243 -16101 -21291 -24189 -22255 -18767 -17457 -19557 -18949 -24009 -30189
17978 -30189 -30930 -24203 -19900 -26789 -26614 -25045 -28011 -34131 -36749 -25695 -23722 -24375 -26142 -27138 -24780
17963 -24780 -22037 -29256 -32541 -30281 -22778 -24487 -29043 -32281 -28496 -26141 -26970 -17532 -3825 6072
17949F072N589K263j254l887Q58j2258r694r02M35k597J609M087j0099j601L059
17934a8320j470j573N546l457R29L370L791M33n426l54K621p111k772K054J722
17919b0017k233r94N659j426n85Q563K049o7k330l227j851L28P12l704K913k353
17903a8563o574k458P479J0404J206m205K153k553k058J173j640o24L233n06k38
17888a3771m265k742k61N51N684L981L579m234m910j143K288K216k680j332K273
17873a4766Q21M110R96O488l409p761R44n686k969O596n64l129L360L584N00P49
17857a0136k014O75N409M272n263o583Q01K947q90L800J799p600p128p38P708
17842a2941L131L300k735k829j440P77j993K13P243l190m982n51L555j727K930
$$ plain form
17949 6072 11661 13924 12670 8783 9641 -2617 -12311 -13213 -12778 -15375 -13766 -9679 -19778 -21379 -18320
17934 -18320 -19790 -21363 -15817 -19274 -18345 -14975 -11184 -10751 -16177 -16531 -13910 -21021 -23793 -21739 -20017
17919 -20017 -22250 -23244 -17585 -19011 -19596 -11033 -8984 -9051 -11381 -14608 -16459 -16131 -15419 -19123 -16210 -18563
17903 -18563 -25137 -27595 -20116 -9712 -8506 -12711 -10558 -13111 -15169 -13996 -15636 -16260 -13027 -13533 -13771
17888 -13771 -18036 -20778 -21039 -20488 -14804 -10823 -7244 -11478 -16388 -17531 -15243 -13027 -15707 -17039 -14766
17873 -14766 -13945 -9835 -8839 -2351 -5760 -13521 -12577 -18263 -21232 -14636 -15200 -18329 -14969 -11385 -10885 -10136
17857 -10136 -12150 -11475 -6066 -1794 -7057 -13640 -12839 -9892 -10782 -6982 -5183 -12783 -19911 -20649 -12941
17842 -12941 -9810 -6510 -9245 -12074 -13514 -12737 -14730 -14517 -7274 -10464 -15446 -15997 -12442 -14169 -11239
17827a1239N180K527k015L12n361J708R154r17K19l231l977L996r5l686l908r719
17811b1052l203k4N416M020O709P215j583m248m958p475k131J981r90m006M412
17796a9917K717j550J951N758O088k800J70K48J980l437Q586q45m742n148j906
17781a2847j218o59J117L020K354k912k475k236J132L957o77k139J814o812K353
17766a6228N504P984j741l907o489L633M858J563j308k663K468j908k415r46K44
17751a1351L225J74r496l895L829M70K262Q63M244P753L368P20j776p189m34K7
17735g206p057j352M061L000L049K754l68j946l358m943n952L064R462O127O45
17720b0n82j589l878k41M71q45k240J897M882j776j495L701q57m060j738o368
$$ plain form
17827 -11239 -6059 -3532 -5547 -5235 -10596 -8888 266 -651 -432 -3663 -7640 -3644 -3739 -7425 -11333 -21052
17811 -21052 -24255 -24279 -18863 -14843 -8134 -919 -2502 -6750 -11708 -19183 -21314 -19333 -20323 -24329 -19917
17796 -19917 -17200 -18750 -16799 -11041 -4953 -7753 -7583 -7335 -5355 -8792 -206 -1051 -5793 -10941 -12847
17781 -12847 -14065 -14724 -13607 -10587 -8233 -11145 -13620 -15856 -14724 -10767 -11444 -13583 -11769 -18581 -16228
17766 -16228 -10724 -2740 -4481 -8388 -14877 -11244 -6386 -4823 -6131 -8794 -6326 -8234 -10649 -11595 -11351
17751 -11351 -8126 -7952 -17448 -21343 -17514 -17044 -14782 -13919 -9675 -1922 1446 2166 390 -6799 -7233 -7206
17735 -7206 -14263 -15615 -11554 -8554 -5505 -2751 -3119 -5065 -8423 -13366 -19318 -16254 -6792 -665 -20
17720 -20 -602 -2191 -6069 -6310 -5839 -6684 -8924 -7027 -2145 -3921 -5416 -1715 -2572 -6632 -8370 -14738
17704a4738l71O165n484J139O669J903N309L279m596q85l683j196L303p395q62
17689a1443J923k165j169j668j468l062o746j96M13N182L888L283J786j123J422
17674a1143J901J154M371l553k439J1897M481j248j88m237k324J848P87j104N307
17659E510J284o189j0682N123K284q735m223o028M926J642N312J488j325n240
17645a4853K480M321N106m248J326J384m228m435K6M355J777n073m791j567O680
17630a1740O761j056j701p06j852j887k304L63p77k211M172J341O702L087l426
17615e234j2724r35O338P401J312l265p31j087j142l600L866P46k855k415k543
17600a6868k946q5L481K975K745O954j727m688K936N810P321j067l767l677M102
$$ plain form
17704 -14738 -15109 -8944 -14428 -13289 -6620 -4717 592 3871 -725 -1610 -5293 -6489 -3186 -10581 -11443
17689 -11443 -9520 -11685 -12854 -14522 -15990 -19052 -25798 -25994 -25581 -20399 -16511 -13228 -11442 -12565 -11143
17674 -11143 -9242 -8088 -3717 -7270 -9709 2188 6669 5421 5233 996 -1328 520 1307 203 5510
17659 5510 6794 605 -10077 -4954 -2670 -11405 -15628 -21656 -16730 -15088 -9776 -8288 -9613 -14853
17645 -14853 -12373 -8052 -2946 -7194 -5868 -4484 -8712 -13147 -13121 -8766 -6989 -12062 -16853 -18420 -11740
17630 -11740 -4979 -6035 -7736 -8442 -10294 -12181 -14485 -14122 -14899 -17110 -12938 -11597 -4895 -1808 -5234
17615 -5234 -17958 -18893 -12555 -5154 -3842 -7107 -7838 -8925 -10067 -13667 -9801 -9055 -11910 -14325 -16868
17600 -16868 -19814 -19899 -16418 -13443 -10698 -3744 -5471 -10159 -7223 -1413 5908 4841 1074 -2603 1499
17585A499L057j316k875k498J528m031p633j244M50L045R79J626m95l982m063
17570a5953R48K761M787K582J697M382J863k298o757l250k079M481K475J749j032
17555c644K629M549k067k996P898p53o942n344j508j267j473j978k704J012N269
17540i319K958j00O68k632M339r26l836k697J170n556J38R750O137l91o7J834
17524A470O05q29j553J501k517m817J980J70m757J558M642O20q50k642n966L085
17508h300M277p376N9k3L222J920p722l074M724q5N909K874M082L389q348m196
17492h668J747N449o9j705M79k093m015P283M6p383l379L671K600J517L282j07
17476a345k167n141n90J33K958j422k570M713N833l283k515J466L94o990q660
$$ plain form
17585 1499 4556 3240 365 -2133 -605 -4636 -12269 -13513 -13063 -10018 -9039 -7413 -7908 -11890 -15953
17570 -15953 -15005 -12244 -7457 -4875 -3178 1204 3067 769 -5988 -9238 -11317 -6836 -4361 -2612 -3644
17555 -3644 -1015 3534 1467 -1529 6369 5616 -1326 -6670 -8178 -9445 -10918 -12896 -15600 -14588 -9319
17540 -9319 -6361 -6461 -5793 -8425 -4086 -5012 -8848 -11545 -10375 -15931 -15793 -6043 94 -297 -364 1470
17524 1470 2075 1246 -307 1194 -1323 -6140 -4160 -3990 -8747 -7189 -2547 -1927 -2777 -5419 -11385 -8300
17508 -8300 -4023 -11399 -11340 -11363 -8141 -6221 -13943 -17017 -12293 -12378 -6469 -3595 487 3876 -4472 -8668
17492 -8668 -6921 -1472 -1541 -3246 -2767 -4860 -8875 -1592 -1546 -8929 -12308 -8637 -6037 -4520 -1238 -1345
17476 -1345 -3512 -8653 -9243 -9110 -6152 -7574 -10144 -5431 402 -2881 -5396 -3930 -3536 -10526 -19186
17461a9186N089L155K783N259l48N924J74n140k48k882j79O87r42n44j255k10
17445g863J0135M058j518q3J946K496J0022J6707J5348K365j2129o310n001j1949
17431A8224q581j656k932n141J024J396m182j522O352m511m591j683j942P538
17417b207O337Q341r07m338J621l624j328l702k857J667L829m839j0M850k673
17402A60J011P18J668O959L550l766n284K661J068l981k345K893p858q685M232
17387f999L191M655r30j484o438n526J766m69j391Q316M568k432J092m15m865
17372g361K294L120p98K296l143J04j168m237l653j170o34J267Q581M929j0298
17357i871l946M193M009K662j954L832l120j000J49K278K745J011m889l102O42
$$ plain form
17461 -19186 -14097 -10942 -8159 -2900 -3248 2676 2850 -2290 -2538 -5420 -5599 -4912 -5854 -6398 -7653 -7863
17445 -7863 2272 6330 4812 4729 6675 9171 19193 35900 51248 53613 41484 35174 30173 18224
17431 18224 9643 7987 5055 -86 938 2334 -1848 -3370 2982 -1529 -6120 -7803 -9745 -2207
17417 -2207 4130 12471 11564 7226 8847 5223 3895 193 -2664 -997 2832 -2007 -2017 2833 160
17402 160 1171 1889 3557 10516 14066 10300 5016 7677 8745 4764 2419 5312 -2546 -11231 -6999
17387 -6999 -3808 847 -83 -1567 -8005 -13531 -11765 -12234 -13625 -5309 -741 -3173 -2081 -2496 -7361
17372 -7361 -5067 -1947 -2745 -449 -3592 -3488 -4656 -8893 -12546 -13716 -14350 -13083 -4502 427 -9871
17357 -9871 -13817 -9624 -5615 -2953 -4907 -1075 -4195 -5195 -5046 -2768 -23 988 -3901 -7003 -6361
17342f361n72k27o81K321k369P80M46l197p67J480l068j430K532J516M383J186
17326d028n695j403L658K713N23J140M881j432j0478p680M478K969K380P23M494
17311b757K416k577J926J935m103o071k111K509l8m28M763M374q879j139o148
17296a6328p010M289k095q26Q507O246J836K533K240o06p135o403j486R8L73M964
17280a0803j311j973p75M725j435O681N591J083M13M134J055k852m038J083J83
17265A761L580K199m308J086J047k019j432p622L089q48n934k017J561k13j32
17250a0202L542j86N530l042j0549l716L39K144M397L270l66N816m9n672m364
17235a3108l862J0454L571J016j942o20m639N46O152O607m086k544N355m351O48
$$ plain form
17342 -6361 -6933 -7160 -7841 -5520 -7889 -7109 -6663 -9860 -10627 -9147 -12215 -13645 -11113 -9597 -5214 -4028
17326 -4028 -9723 -11126 -7468 -4755 -4232 -3092 1789 357 -10121 -17801 -13323 -10354 -7974 -7251 -2757
17311 -2757 -341 -2918 -992 943 -3160 -9231 -11342 -8833 -8871 -9299 -4536 -162 -9041 -10180 -16328
17296 -16328 -23338 -19049 -21144 -21970 -13463 -7217 -5381 -2848 -608 -1214 -8349 -14752 -16238 -16140 -15767 -10803
17280 -10803 -12114 -14087 -14862 -10137 -11572 -4891 700 1783 2196 6330 7385 4533 495 1578 1761
17265 1761 5341 7540 3232 4318 5365 3346 1914 -5708 -2619 -3467 -9401 -11418 -9857 -10070 -10202
17250 -10202 -6660 -6846 -1316 -4358 -14907 -18623 -18284 -16140 -11743 -8473 -8839 -3023 -3072 -8744 -13108
17235 -13108 -16970 -6516 -2945 -1929 -3871 -4491 -9130 -8584 -2432 4175 89 -2455 2900 -1451 -803
17220h03k137M53P94j857l6j889M772k867j0433M61K169M130L496N53n400l031
17204a1625O971l379j079O079K863N40Q46j577m56j208o976m852j466L1O904K781
17188e603L257j303m993N619l80r091p613J215J0838R869K210j052k982n013O504
17173A482N061m359k963p69J773l273k678q71k95K438l538L67K577K624l229p073
17157a2726J881n54n44J2609K103n38j334k781l411J448K79r532l316r36J469
17142a5883N09M442J1575L330k486q335o523P19P612L579K453O396p222k072k285
17127d191N048l500O53J349l341R78j917o164k841J63L264O750o940K573N278
17112b838J827Q44l901l145j541l917P22L650r84n678M341N030K493K708l013
$$ plain form
17220 -803 -2940 -2487 -1693 -3550 -3586 -5475 -703 -3570 -14003 -13542 -11373 -7243 -3747 -3194 -8594 -11625
17204 -11625 -4654 -8033 -9112 -3033 -170 370 1216 -361 -817 -2025 -9001 -13853 -15319 -15288 -8384 -5603
17188 -5603 -2346 -3649 -8642 -3023 -3403 -12494 -20107 -18892 -8054 1815 4025 2973 -9 -5022 1482
17173 1482 6543 2184 -779 -1548 225 -3048 -5726 -6597 -6892 -4454 -7992 -7625 -5048 -2424 -5653 -12726
17157 -12726 -10845 -11399 -11943 666 2769 2231 897 -1884 -5295 -3847 -3568 -13100 -16416 -17352 -15883
17142 -15883 -15374 -10932 643 3973 1487 -6848 -13371 -12652 -5040 -1461 992 7388 166 -1906 -4191
17127 -4191 857 -2643 -1990 -641 -3982 -3004 -4921 -11085 -13926 -13763 -10499 -3749 -10689 -8116 -2838
17112 -2838 -1011 -167 -4068 -7213 -8754 -12671 -11949 -8299 -9283 -14961 -10620 -5590 -3097 -389 -3402
17097c402j512o14j94N579n82M032mk560K389o565l05K236m037M564M624p220
17081c571K679P49n662o539J264R248k300L43Q216N73P24n990o198j983J587j529
17065h389J726k05j950q385k439R753P837N87k7L882k382j246r65k248J605K916
17049G0P97j157p79j0678l640J143Q052k889j581q37P721L667p325k387J863J945
17033f015p0k04k611L770k131j754p680N59K252J444j282j398O972N757j824j563
17017e778n581J493K403L441k89K85l16M703j233J155L586J664M27J677K234j222
17001H649rj097J27Q70o181K409P19p171l294M735k556o79m45o909k58J0049N916
16984D875q448l247M425N005L438k110r16j90j201K416j757l717j78O533K989
$$ plain form
17097 -3402 -4914 -5528 -5722 -143 -725 3307 3303 743 3132 -3433 -3738 -1502 -5539 -975 3649 -3571
17081 -3571 -892 -143 -5805 -12344 -11080 -1832 -4132 -3789 4427 5000 5724 -266 -6464 -8447 -6860 -8389
17065 -8389 -6663 -6868 -8818 -17203 -19642 -9889 -2052 -1465 -1492 2390 8 -1238 -2203 -4451 -2846 70
17049 70 867 -290 -1069 -11747 -15387 -14244 -6192 -9081 -10662 -11499 -3778 -111 -7436 -9823 -7960 -6015
17033 -6015 -6085 -6289 -8900 -5130 -7261 -9015 -16695 -16136 -13884 -12440 -13722 -15120 -8148 -2391 -4215 -5778
17017 -5778 -11359 -9866 -7463 -4022 -4311 -4026 -4342 361 -872 283 3869 5533 5960 7637 9871 8649
17001 8649 8640 7543 7670 8540 2359 4768 5487 -1684 -4978 -243 -2799 -3478 -3923 -10832 -11090 -1041 4875
16984 4875 -3573 -6820 -2395 2610 6048 3938 3022 2832 1631 4047 2290 -1427 -1605 4928 7917
16969G917M238N400Q05L13j052L581k2l871Q962L556j793P281N996J127r698j0457
16953B2283p267l687m067j135K522j259K282j754l029l305K038k262M057J6K89
16938E722O52j242n206L644l25J606Q79R20L691K335J1106L689R323N844m788
16923C7850m442n116k202j19l425o032r594P52N555m522o345p320k228m316k095
16908a3599J425K041J415k910n319J830M862L161K56l81P018j318k311l458j232
16893h520N212J029n264J034J419J439M67p902L003O571P22N42r592l871J310
16878a2401L094N320l438J454J557p805N16O553O360k747j574l450j077n22K678
16863e482K364K096k173j349n651j449M885N186J621M568J375r11m178M88j182
$$ plain form
16969 7917 12155 17555 18360 18673 17621 21202 21180 17309 26271 29827 28034 35315 41311 42438 32740 22283
16953 22283 15016 11329 7262 6127 8649 7390 9672 7918 4889 1584 3622 1360 5417 5433 5722
16938 5722 6374 5132 -74 3570 3245 4851 5730 6650 10341 12676 23782 27471 36794 42638 37850
16923 37850 33408 28292 26090 25971 22546 16514 6920 7672 13227 8705 2360 -4960 -7188 -11504 -13599
16908 -13599 -12174 -10133 -8718 -11628 -16947 -15117 -10255 -7094 -6838 -7219 -201 -1519 -3830 -7288 -8520
16893 -8520 -3308 -2279 -7543 -6509 -5090 -3651 -3184 -11086 -8083 -1512 -790 -248 -9840 -13711 -12401
16878 -12401 -9307 -3987 -7425 -5971 -4414 -12219 -11703 -5150 1210 -1537 -3111 -6561 -7638 -8160 -5482
16863 -5482 -3118 -1022 -3195 -4544 -10195 -11644 -6759 -1573 48 4616 5991 5080 902 1390 208
16848B08m479r89q408P40K981N153K987M487M022O7o019n22J15l591O759K879
16832F390n089K86K59m199k157L668N606n64l687L687k495m742j296l255k826
16817a0414p759k63J3269J0929Q825j319j032r25r718n527L448L165O256k592
16803F343n33k060K46J52k628l885K25M843n57l600n909Q227j572p370M516q259
16787a1821O428L849Q34M260l590n744j907K261K649p61j586m960M711R26P67
16772c684J503o046j548P842L932J588J013j234j185J960j994J830O058k239o017
16757A779K864J430j35K521R39J42K18l778m286J524L574o199K632k504j089K112
16741A744j526L159j322o841J689Q555L396l698m069r885m273l08P509N807j797
$$ plain form
16848 208 -4271 -5260 -13668 -12928 -9947 -4794 -1807 2680 6702 6769 750 228 343 -3248 3511 6390
16832 6390 1301 1587 1846 -2353 -4510 -842 4764 4200 513 4200 1705 -3037 -4333 -7588 -10414
16817 -10414 -18173 -18436 -5167 5762 14587 13268 12236 11311 1593 -3934 -486 2679 8935 6343
16803 6343 5810 3750 3996 4148 1520 -2365 -2140 2703 2146 -1454 -7363 864 -708 -8078 -3562 -11821
16787 -11821 -5393 -1544 -710 3550 -40 -5784 -7691 -5430 -2781 -3542 -5128 -10088 -5377 -4451 -3684
16772 -3684 -2181 -8227 -9775 -1933 1999 3587 4600 3366 2181 4141 2147 3977 10035 7796 1779
16757 1779 4643 6073 5938 8459 9398 9540 9758 5980 1694 3218 6792 593 3225 721 -368 1744
16741 1744 218 3377 2055 -4786 -3097 5458 8854 5156 1087 -8798 -13071 -13379 -5870 -63 -1860
16726a860K82l145k264j725Q9P0K888K812J761m803n933O036K252J745o18k821
16710e234l569K088O165K707n92m571K623m230M17L734M460M783K634J431j0889
16695A957O43q64J774L302L874p256o520m262n38N415N768N91n635L070J343k514
16679A48j786m296J219K87K419J0434J883n440P11l923l197K426K675l012p034
16664f486j480J420K371r49O743k084r798L461O365q32n702m37M783O890N26p140
16648b349n426P841J0779N572l496k406m151o622n705L126j880l199J714L62k110
16633g950j112j363K514P174J535l804o413m121K272N808N949n21q92J563q594
16618g955m35R058P206P30r365o799o61K146M774J809K232O236K220l991o668
$$ plain form
16726 -1860 -1578 -4723 -6987 -8712 -8623 -8553 -5665 -2853 -1092 -5895 -11828 -5792 -3540 -1795 -2413 -5234
16710 -5234 -8803 -6715 -550 2157 1565 -3006 -383 -4613 -4196 -462 3998 8781 11415 12846 1957
16695 1957 2600 1736 3510 6812 10686 3430 -3090 -7352 -7890 -2475 3293 3884 -1751 1319 2662 148
16679 148 -1638 -5934 -4715 -4428 -2009 8425 10308 4868 5579 1656 -1541 885 3560 548 -6486
16664 -6486 -7966 -6546 -4175 -5124 1619 -465 -10263 -6802 -437 -1269 -6971 -7408 -2625 4265 4791 -2349
16648 -2349 -7775 66 10845 16417 12921 10515 6364 -258 -5963 -2837 -4717 -7916 -6202 -5840 -7950
16633 -7950 -9062 -10425 -7911 -737 798 -3006 -9419 -13540 -11268 -5460 489 -32 -924 639 -7955
16618 -7955 -8390 668 7874 8604 -761 -7560 -8221 -6075 -1301 508 2740 8976 11196 7205 537
16603E37L669j338k402j884O03N800K424r61j577J032j90m489K755M94j894l895
16587a316k295l974q27Q67l479k811L385l291N77O995K280P51o95N105l405j275
16571c408o47l98K001O126O557n24R1J257o777j436j341o301l845j358J797j568
16555i774K714J230k080j402K438O592j830k833Q78R907R00j206k440k125P777
16540H746l012l998k455q96m217q24R399N993J580r432q407M657Q981k251L90
16525D254O611j329j184L275n85j721O521k374j1164j1250J691L480K628k279
16511c426m205K242N66K615l432l330J147J0408M435J212L322M16r777p034M467
16496c74O757l169L184P28r627l236P194N219l774n598q42j160L319P931m534
$$ plain form
16603 537 4206 2868 466 -1418 -815 4985 7409 6448 4871 5903 5713 1224 3979 4473 2579 -1316
16587 -1316 -3611 -7585 -8412 -7545 -11024 -13835 -10450 -13741 -13164 -6169 -3889 -3138 -3833 1272 -2133 -3408
16571 -3408 -4055 -4453 -2452 3674 10231 9707 9798 11055 4278 2842 1501 -4800 -8645 -10003 -8206 -9774
16555 -9774 -7060 -5830 -7910 -9312 -6874 -282 -2112 -4945 -4067 5840 6740 5534 3094 969 8746
16540 8746 5734 1736 -719 -1615 -5832 -6656 2743 8736 10316 884 -7523 -2866 6115 3864 4254
16525 4254 10865 9536 8352 11627 11042 9321 15842 13468 2304 -8946 -7255 -3775 -1147 -3426
16511 -3426 -7631 -5389 -4823 -2208 -5640 -8970 -7823 2585 7020 8232 11554 11970 2193 -4841 -374
16496 -374 6383 3214 6398 7126 -2501 -5737 1457 6676 2902 -2696 -3538 -4698 -1379 6552 2018
16481B018N0L304O74k086l198K445J977K31o471o788M752K472J529Q818j101p63
16465G863q007o694j332J0135N382o477k824j989p48J077m38J929l621L991L254
16450A501j739N071k574r84l228K803O070P146l749J683p314o926J982J433K131
16435C306K758m905m825m83P4N22l711J684M863k580m454o49P171O485O491K368
16419A4115j994Q442K021m420n502O231J7499J1559J7594J539p591r249q699j1818
16405B9727l455l76n652o833j2494j002L84l545j841j696J924K259L240k37J993
16390B396m15k128J172N42l368l651j515J019M486L409J214M469k734l974K607
16375C529N485m208L286K767n217k394J984n537r19K803k352r295j187P767J2022
$$ plain form
16481 2018 2068 5372 6046 3960 762 3207 5184 5415 -1056 -7844 -3092 -620 909 9727 8626 7863
16465 7863 -144 -6838 -8170 1965 7347 870 -1954 -3943 -4691 -3614 -4052 -2123 -5744 -1753 1501
16450 1501 -238 4833 2259 1275 -1953 850 6920 14066 10317 12000 4686 -2240 -258 1175 3306
16435 3306 6064 1159 -3666 -4149 -4075 -3553 -7264 -5580 -717 -3297 -7751 -8400 -1229 5256 11747 14115
16419 14115 12121 20563 22584 18164 12662 18893 36392 47951 65545 67084 59493 50244 41545 29727
16405 29727 26272 25896 20244 13411 917 -85 299 -3246 -5087 -6783 -4859 -2600 640 403 2396
16390 2396 1981 -147 1025 1567 -1801 -5452 -6967 -5948 -1462 1947 3161 7630 4896 922 3529
16375 3529 9014 4806 8092 10859 5642 3248 5232 -305 -1224 1579 -773 -10068 -11255 -3488 8534
16360H534p32o391r815l107J94o96j286M070N68p012L015Q544Q675M350N192n82
16344A3521q385m068M354K700J076K44j749k72Q58p178m567j095Q5j373j690K595
16328d944O026M085l043q267O835l743j838j964K522K613Q81R61j72l031n02O082
16312B501N169N669P899L988L881J2485J2257P936m778j1842m911j0461j1431
16299A8362j1220k527j889L444M176o295n417m322k415O694r82k852L654M634
16285C045N506P37J657q52J506O152J84P920N67J025Q973M040M982N377J487o163
16269D6143j3375j3235k818kq384m406m639J290J07k180J23m83N310P482K1n808
16253E146q100j988J950N02j491L650J563m44K93N71K248M523q57n106n126J50
$$ plain form
16360 8534 7802 1411 -8404 -11511 -11317 -12013 -13299 -9229 -8661 -15673 -12658 -4114 4561 8911 14103 13521
16344 13521 5136 1068 5422 8122 9198 9442 7693 7421 8279 1101 -3466 -4561 -4476 -5849 -7539 -4944
16328 -4944 1082 5167 2124 -6143 692 -3051 -4889 -6853 -4331 -1718 -837 124 -48 -3079 -3581 2501
16312 2501 7670 13339 21238 25226 29107 41592 53849 61785 57007 45165 40254 29793 18362
16299 18362 7142 4615 2726 6170 10346 4051 -1366 -5688 -8103 -1409 -2391 -5243 -1589 3045
16285 3045 8551 9288 10945 10093 11599 17751 17935 25855 26422 27447 36420 40460 45442 50819 52306 46143
16269 46143 32768 19533 16715 16713 8329 3923 -716 574 681 -1499 -1376 -1859 3451 10933 10954 5146
16253 5146 -2954 -4942 -2992 -2490 -3981 -331 1232 788 1081 1652 3900 8423 7566 2460 -2666 -2516
16237b516M460J174k886P96j586N635q567l89N399O677j620J261k093l31k415
16222B999n504m80K375K953o85j321n287l751Q005k10L786R61L433l53k593Q51
16206E179j835K355J06j595m221M049j161K126K003k783m582l615L427N213j096
16191C570N73m562k581L070Q298J514m842p442K200N948L374M157l794k929N941
16176A2495J1017J575j807l387q604m991O1o801k366K765P037Q78n806Q12L407
16161F285O30L74M993K808l026j584m614R21J685l569J134J761L394l583o038
16146A571o264K48N373p33L915Q487o47m184m445K840O477p385P08r02J808m210
16130B657o323P481M120n997J850O517o65m366j21l98j260k970P100M070K35K370
$$ plain form
16237 -2516 1944 3118 232 1028 -558 5077 -3490 -3879 1520 8197 6577 7838 5745 5414 2999
16222 2999 -2505 -2985 -610 2343 1658 337 -4950 -8701 -696 -906 2880 3841 7274 6921 4328 5179
16206 5179 3344 5699 5805 4210 -11 4038 2877 5003 7006 4223 -359 -3974 -547 4666 3570
16191 3570 4143 -419 -3000 70 8368 9882 5040 -2402 -202 5746 9120 13277 9483 6554 12495
16176 12495 23512 25087 23280 19893 11289 6298 6359 -442 -2808 -43 6994 7872 2066 2878 6285
16161 6285 6915 7289 12282 15090 12064 10480 5866 6787 8472 4903 6037 7798 11192 7609 1571
16146 1571 -4693 -4445 928 195 4110 12597 11950 7766 3321 6161 12638 5253 5961 5059 6867 2657
16130 2657 -3666 3815 7935 1938 3788 10305 9640 5274 5153 4755 3495 525 7625 11695 11930 14300
16114A4300l990K153j663k325J421O169K349M393j827q327l765Q594P1j837k365
16099A3351l648m459k00K861Q404J882l214p874j532J097l985M688O409L850K375
16084B0005J668m561K929Q843J451O939N298J2941J7990L3660N0622N6860O0626
16071B75271O3859L5409M529j725m487l2879m9375m0581l7669m5155m2008k4257
16059A00932j5624k2999j9902p749p580l690J403p848k899l685m83J317J176j98
16045A2171j097k773m085n443m094J461Q874L287q47L052J785L4J192q91R03k35
16029A3294m355p075l95M256J017k21m6K360L492M927j383l566k002l837l221
16014C245m882L056j235o463M146J09O712K73k331K91p376P386N719l46J709p172
$$ plain form
16114 14300 10310 12463 10800 8475 9896 16065 18414 22807 20980 12653 8888 17482 17553 15716 13351
16099 13351 9703 5244 5044 7905 16309 18191 14977 7103 5571 6668 2683 7371 13780 17630 20005
16084 20005 21673 17112 20041 28884 30335 37274 42572 55513 73503 107163 157785 214645 275271
16071 275271 339130 374539 379068 377343 372856 339977 290602 250021 212352 167197 125189 100932
16059 100932 85308 62309 42407 34658 27078 23388 24791 16943 14044 10359 9876 11193 12369 12171
16045 12171 11074 8301 4216 -1227 -5321 -3860 5014 8301 7454 10506 12291 12325 13517 12626 13529 13294
16029 13294 8939 1864 1469 5725 6742 6521 6475 8835 12327 17254 15871 12305 10303 6466 3245
16014 3245 -1637 1419 184 -6279 -2133 -2024 4688 4961 2630 2921 -4455 2931 8650 8304 10013 2841
15998B841o097K612k386o78N044O950N4k821k20K394Q22o812l787k235O47O145
15982B473P362K636p33l188j924j424k841K166j030k263L782o081o373Q064L423
15967D049J255k96l051K001O650n024l912l898j805p58M249r54M047J531l951
15952A33k095n735J504l957N462O448L789J782k166l081n053p729j746N436P336
15937C28l060K925O161K158J924N38p103m663P472K541o145k822L60N297M60L401
15921I772l373P44j237N216M394j1238k932K995L555J975m259j738k127j0260
15907h513m425J631J0924J154M270l76j054R72J791k780l668O089n15o514j403
15892b417j156M9j181J146J469M842j707n65J0762J2506k701r845p920j905M47
$$ plain form
15998 2841 -3256 -644 -3030 -3708 1336 8286 8340 5519 5299 7693 8515 1703 -2084 -4319 -3672 2473
15982 2473 9835 12471 11738 8550 6626 5202 2361 4527 3497 1234 5016 -1065 -7438 626 4049
15967 4049 5304 5008 1957 3958 10608 5584 1672 -2226 -4031 -4789 -540 -1494 2553 4084 133
15952 133 -1962 -7697 -6193 -10150 -4688 1760 5549 7331 5165 2084 -2969 -10698 -12444 -7008 328
15937 328 -2732 193 6354 8512 10436 10974 3871 -792 6680 9221 3076 254 614 5911 6371 9772
15921 9772 6399 7143 5906 11122 15516 4278 1346 4341 7896 9871 5612 3874 1747 -8513
15907 -8513 -12938 -11307 -383 771 5041 4665 3611 4583 6374 3594 -74 6015 5500 -1014 -2417
15892 -2417 -3573 -3524 -4705 -3559 -2090 2752 1045 480 11242 23748 21047 11202 3282 1377 1824
15877A824L986k716K884j777l867K309j089R24k858m750J926O677J0219K430n217
15862A0905o866n824M84J881J340Q52k515m229J676P18k813N87R111L126L932
15847A2365K895m712j2447k940K874L084L102n180j446M040P975Q325r945p223
15833G67J748M564j950m945M477L086n484J271M122N3k785k200K848R66j750k846
15817A942j982m707L249M215P66k039j967K508P516M355o266p332j289L291K8
15802B288m133m313N56j204M44K31M207N857J182m439K392O710L887j843j958
15787I864n167l556m077m220k995O8J0109J1732k024q692m182J680k46J990N435
15772E719J585K97N606k210o342j134K28l966L966K015N321o18o663L181M216
$$ plain form
15877 1824 5810 3094 5978 4201 334 2643 1554 2478 -380 -5130 -3204 3473 13692 16122 10905
15862 10905 4039 -1785 -1301 580 1920 2772 257 -3972 -2296 -1578 -4391 -3804 5307 8433 12365
15847 12365 15260 10548 -1899 -4839 -1965 1119 4221 -959 -2405 1635 9610 17935 7990 767
15833 767 2515 7079 5129 184 4661 7747 2263 3534 7656 7709 4924 2724 5572 6538 4788 1942
15817 1942 -40 -4747 -1498 2717 3483 1444 -523 1985 9501 13856 7590 258 -1031 2260 2288
15802 2288 -1845 -6158 -5602 -6806 -6362 -6131 -1924 3933 5115 676 3068 9778 13665 11822 9864
15787 9864 4697 1141 -2936 -7156 -10151 -10083 26 11758 9734 1042 -3140 -1460 -1706 284 5719
15772 5719 7304 7601 13207 10997 4655 3521 3749 -217 3749 5764 11085 10467 3804 6985 11201
15757A1201k316m70m798o63n004k423K83j101L819M553Q062M039n100j0756n083
15742e757J729J235j473N10k260j011O005Q302M898O73N266n58n916m290m227
15727C126J08j11R6M515L124p505q832L728J675L54K801L758j95o175L375J93
15711D035j178K321k353j569J703M656j146k708L087l487j677L143K343J600R74
15696I744J0385K523J684k381m162L559j069N87M062j468l795k549R77O67r84
15681A7780N224L53m31p809l746k643l270j754K64J572l014K718P665l211j1663
15666a965n148P263N387P068P548N181o681j1075J972l277J993k350Q78L963K507
15651A3264P061l860n927L270J709J267J723J707l78L402n469n383n545K541R304
$$ plain form
15757 11201 8885 8415 3617 2954 -2050 -4473 -4190 -5291 -1472 3081 11143 15182 10082 -674 -5757
15742 -5757 -4028 -2793 -4266 -3756 -6016 -7027 -1022 7280 12178 12851 18117 17559 11643 7353 3126
15727 3126 3234 3123 3219 7734 10858 3353 -5479 -1751 -76 278 3079 6837 6642 467 3842 4035
15711 4035 2857 5178 2825 1256 2959 7615 6469 3761 6848 3361 1684 4827 7170 8770 9744
15696 9744 20129 22652 24336 21955 17793 21352 20283 20870 24932 23464 19669 17120 18097 18764 17780
15681 17780 23004 23357 22926 15117 11371 8728 5458 3704 3968 5540 2526 5244 12909 9698 -1965
15666 -1965 -7113 150 5537 12605 20153 25334 18653 7578 9550 6273 8266 5916 6794 10757 13264
15651 13264 20325 16465 10538 13808 15517 16784 18507 20214 19836 23238 17769 12386 6841 9382 18686
15636A8686L856Q58o585j1810k883j156L122M187p842K351O157p34J351J330M70
15621A1358M158L848M097L401M985M273K421l710m327j1909k145O248m526l224
15607A4948L600j956n546l184K237L503L871o208j271P056M408o626o54l516p68
15592I894L343N251P356k084k264l425m595k67j395J314l091M006L458j707l315
15577A2479L026k169j677N872j638K849J243m042j749k409J715Q087k51K868j572
15562B2632q292m033K976m752J996m022l46O849P123l316q676n23K747l132k974
15547D257K126M032M788l630J906J176J693m709J156K740k900j1345J12Q708M881
15532A4991l864N689k709l9n72j885N53L389m458j0048K265O659K144j5m687L24
$$ plain form
15636 18686 22542 23400 16815 5005 2122 966 4088 8275 433 2784 8941 8207 9558 10888 11358
15621 11358 15516 19364 23461 26862 31847 36120 38541 34831 30504 18595 16450 22698 18172 14948
15607 14948 18548 16592 11046 7862 10099 13602 17473 11265 9994 17050 21458 14832 14178 10662 9894
15592 9894 13237 18488 25844 23760 21496 18071 13476 13209 11814 13128 10037 14043 17501 15794 12479
15577 12479 15505 13336 11659 17531 15893 18742 19985 15943 14194 11785 13500 21587 21336 24204 22632
15562 22632 14340 10307 13283 8531 10527 6505 6159 13008 20131 16815 8139 7616 10363 7231 4257
15547 4257 6383 10415 15203 11573 13479 14655 16348 11639 12795 15535 12635 1290 1402 10110 14991
15532 14991 11127 16816 14107 14068 13496 11611 12164 15553 11095 1047 3312 9971 12115 12100 7413 7737
15516G737O686K418K732k751l710j588m106l618k024R190O689J775o956R40K325
15501A5739k248l019k954K317K054k91K773J328k630m673L074m06K673N687j294
15486A8130l695j903j086L022n13n177q05j673j253K323J316L041K244k73P841
15471B1539k568l444R68j211o625n818L112M149M036P68K834Q24Q379N008m325
15456B7626j3949m524K924N201Q39J995m768K26k86p96L118K690P285m15j350
15441B5816l400l909l694K512K237N095J965j405j399j485K528l284j227K913
15427B3263K007k910J981l110p814j765k839O21M004O644M207l283n498j709Q108
15412B1907j840r88K097P844K913n837p91j605n496j0593p632J217O500L016K33
$$ plain form
15516 7737 14423 16841 19573 16822 13112 11524 7418 3800 1776 10966 17655 19430 12474 13414 15739
15501 15739 13491 10472 7518 9835 11889 11598 14371 15699 13069 8396 11470 11064 13737 19424 18130
15486 18130 14435 12532 11446 14468 13955 8778 7973 6300 5047 7370 8686 11727 13971 13698 21539
15471 21539 18971 15527 16495 15284 8659 2841 5953 10102 14138 14906 17740 18564 26943 31951 27626
15456 27626 13677 9153 12077 17278 18117 20112 15344 15570 15284 14488 17606 20296 27581 27166 25816
15441 25816 22416 18507 14813 17325 19562 24657 26622 25217 23818 22333 24861 21577 20350 23263
15427 23263 25270 22360 24341 21231 13417 11652 8813 9434 13438 20082 24289 21006 15508 13799 21907
15412 21907 20067 19079 21176 29020 31933 26096 25305 23700 18204 7611 -21 1196 7696 10712 10945
15397A0945L671L482K93J137m803k795J302k144m585j502M231O407L959n73l985
15382A5040J159J1073l585jn032k102K593M241k296m828K368O598K74j0666p077
15367G759j475K307N915J2514m94m377l371N10O060k62K006O03J229m493K38j448
15351B3221j756j60K298J216J66k706L316J589l796k571j48O363J608K490L406
15336C4536O18l714O588M38o486o211L293o343R79M618R80L751K407L997o829
15321C2622k350P040Q02m73n1K608q91l210L536P654k551l700j426J42j250K862
15305D1364R67r67L29l751J812k81L893L872p8M700m8J174m52k52n202l681M670
15288D8069J0336P478P01K252Q311O82K246K031K282M822n413qL853K644j942
$$ plain form
15397 10945 14616 18098 18391 19528 14725 11930 13232 11088 6503 5001 9232 15639 19598 19025 15040
15382 15040 16199 27272 23687 23686 18654 16552 19145 23386 21090 16262 18630 25228 25502 14836 7759
15367 7759 6284 8591 14506 27020 26526 22149 18778 19288 25348 25086 27092 27695 28924 24431 24669 23221
15351 23221 21465 21305 23603 24819 24985 22279 25595 27184 23388 20817 20669 27032 28640 31130 34536
15336 34536 35154 31440 38028 38466 31980 25769 29062 22719 23698 28316 29296 33047 35454 39451 32622
15321 32622 30272 37312 38114 37641 37590 40198 39307 36097 39633 47287 44736 41036 39610 39752 38502 41364
15305 41364 42331 41364 41693 37942 39754 39473 43366 47238 47160 51860 51812 52986 52534 52282 47080 43399 48069
15288 48069 58405 65883 66584 68836 77147 77829 80075 82106 84388 89210 83797 83789 87642 90286 88344
15273H8344J159K159J873R306J0953J7477L984M399J07N912J1057J6955J5168
15260A88853J1053J3706J8462J7475J9735K2156K4455K4002L7604L7692M4868
15249D60061M6237N6080O9741P7439Q5688R8140J17251J29076J32331J33148J30876
15238A536068J15170Q1677N5862J2598l1459q1723j12527j36573j49411j46516
15228A143166j37016j22261j14071r4425p7963p4346o2450m9901m3731l8779l5559
15217B92664l1575k6069j3775j7606k0909k2406j7554j0452j905m655l777j1520
15205A10461j0103m358k961m581J576q510j2989m229n373q567m87m939j0971k523
15191C1446K489j254N539J492K885J017l892m1k136L889r70q306k558m151l34
$$ plain form
15273 88344 89503 91662 93535 102841 113794 131271 135255 139654 139761 145673 156730 173685 188853
15260 188853 199906 213612 232074 249549 269284 291440 315895 339897 377501 415193 460061
15249 460061 506298 562378 632119 709558 795246 893386 1010637 1139713 1272044 1405192 1536068
15238 1536068 1651238 1732915 1788777 1801375 1769916 1688193 1575666 1439093 1289682 1143166
15228 1143166 1006150 883889 769818 675393 597430 523084 460634 410733 367002 328223 292664
15217 292664 261089 235020 221245 203639 182730 160324 142770 132318 130413 125758 121981 110461
15205 110461 100358 96000 93039 88458 90034 81524 68535 64306 58933 50366 49879 44940 33969 31446
15191 31446 33935 32681 38220 39712 42597 43614 39722 39681 37545 41434 40464 32158 29600 25449 25115
15176B5115K8o091j2706J701R615R12j0831K486P897O192k170o103l098j653J360
15161A2654J72J911P51k777j108L669L68n314J685M042N682k937j072J033K887
15146B1646J3o150q61N356j926j297j5J871M135K864j436k977p350n17N577j727
15130A7206l835P453L12k525N359Q391j382k91N22n87k670r634k116L691J0890
15115C0784J264p499o407j731N400l32j3362p878Q846K99k118q93M765Q45l921
15100H062l99m608q57M295M874P41n954J191l027K782K574K46O247O39k275j276
15084A3255j716O20L078K577M59j15L556o56j589l005k33N50m839l286l752N695
15068A0599L704p944n347M354N63m07p024r99K891J859K85k9J15k325m446L467
$$ plain form
15176 25115 25143 19052 6346 8047 17662 18574 7743 10229 18126 24318 22148 16045 12947 11294 12654
15161 12654 12826 14737 15488 12711 11603 15272 15640 10326 12011 16053 21735 18798 17726 18759 21646
15146 21646 21659 15509 14648 20004 18078 16781 16766 18637 22772 25636 24200 21223 13873 13356 18933 17206
15130 17206 13371 20824 21136 18611 23970 32361 30979 30688 31210 30623 27953 18319 16203 19894 30784
15115 30784 32048 24549 18142 16411 21811 21479 8117 239 9085 9384 7266 6373 11138 11983 8062
15100 8062 7663 3055 2198 6493 11367 12108 6154 7345 4318 7100 9674 9920 16167 16806 14531 13255
15084 13255 11539 12159 15237 17814 18273 18158 21714 21058 19469 16464 16231 16781 11942 8656 4904 10599
15068 10599 14303 6359 1012 5366 5929 5522 -1502 -2501 390 2249 2534 2505 2620 295 -4151 -684
15052f84Q777M588L01l307j0785J330K727R235K402m072j991K483l783j994k30
15037D997O02l006l096R827k072o527L102k132P948O040r12l123l122K02K64j850
15021G142l912k213O453P661n950m619j760M233Q836P186o88n561l072Q64K688
15006A7288J707l494j707n28l81l928O94L380N000M533K042n422p565j40M878
14991A6357l853j0419L12M134N923o35j825P441K250l071l032k897k551J585K615
14976A2334O713l309k17P858o37l673O24k970k799m833K348M620m263m198o90
14961F908L882O270p5P08N692J2112O599J3648K4670N1108O4991Q665l8777l1206
14947A35195k2964l0039k8308j2591j0453q848Q55M026O244r00q045r103m715
$$ plain form
15052 -684 8093 12681 12982 9675 -1110 220 2947 12182 14584 10512 8521 11004 7221 5227 4997
15037 4997 5599 2593 -503 9324 7252 725 3827 1695 9643 15683 14771 11648 8526 8728 8992 7142
15021 7142 3230 1017 7470 15131 9181 4562 2802 7035 15871 23057 22369 16808 13736 14600 17288
15006 17288 18995 15501 13794 13266 12885 8957 9651 13031 18031 22564 24606 19184 11619 11479 16357
14991 16357 12504 2085 2397 6531 12454 11819 9994 17435 19685 16614 13582 10685 8134 9719 12334
14976 12334 19047 15738 15521 23379 22742 19069 19693 16723 13924 9091 11439 16059 11796 7598 6908
14961 6908 10790 17060 16985 17693 23385 35497 42096 55744 80414 131522 196513 205178 166401 135195
14947 135195 112231 82192 53884 41293 30840 21992 22847 26873 33117 32217 24172 15069 10354
14934A0354L357N596M92m976p044n568k3l528N791O969j501o384J771m684k611
14919a989P864K394j744r31M462J0905Q471n8p045L23p065m159L972J906M78l423
14903A4361k731k36M047n84M890O33j841n544k798K229l073q324N521K811O568
14888A5929J479N44m512Q86L291j761l996J627l835r93r290L048L103L392L607
14873A2519J858M031m916o578k683k712j817L230Q528n6j549l563K634N554K864
14858A7344n598n581J722j181K971N324K313l67P132K290l720K279L402K947k319
14843B8958o284n269r694L075J359o682k642K741J062L101M243M01l285q644o136
14828c696k127M162o44N620J1716K558l550M127Q281k354m292L524j769p373R61
$$ plain form
14934 10354 13711 19307 19799 14823 7779 2211 2188 -1340 4451 11420 9919 3535 5306 622 -1989
14919 -1989 5875 8269 6525 5594 10056 20961 29432 29374 22329 22652 15587 11428 15400 17306 17784 14361
14903 14361 11630 11394 15441 14857 19747 20380 18539 12995 10197 12426 9353 1029 6550 9361 15929
14888 15929 17408 17952 13440 14326 17617 15856 11860 13487 9652 8659 -631 2417 5520 8912 12519
14873 12519 14377 18408 13492 6914 4231 1519 -298 2932 11460 11404 9855 6292 8926 14480 17344
14858 17344 11746 6165 7887 6706 9677 15001 17314 16947 24079 26369 22649 24928 28330 31277 28958
14843 28958 22674 17405 7711 10786 12145 5463 2821 5562 6624 9725 13968 14369 11084 2440 -3696
14828 -3696 -5823 -1661 -2305 3315 15031 17589 14039 18166 26447 24093 19801 23325 21556 14183 15144
14813A5144l886m161J957K753L457j099n317K996J694J932j89k02L401O432M671
14798B9583k853L42m502n687l157j30N241P831J751r45M392l00Q24J756j801k2
14782C2323k88l803l285M57L38J006l030l698J947J967N035j09q596p127J792
14767A4929M881L84l488N287L51m746p59m379p15O63L700O048O65n962l10K581
14751A9130n358q42k621j433J631k528J797K962k58r48j938M470l542j576J204
14736A0150J333M017R498L459q034p428K202J963m442j909m393L339m350l877
14722A528R391J829J546K726l739O049P758L707n11K782o70o086N641r057q304
14707A4590k775K233L483j285O0N183R62k880m430N10J957K467m632J386Q009
$$ plain form
14813 15144 11258 7097 9054 11807 15264 14165 8848 11844 13538 15470 15281 15079 18480 24912 29583
14798 29583 26730 27072 22570 16883 13726 13596 18837 26668 28419 27474 31866 31566 32390 34146 32345 32323
14782 32323 32035 28232 24947 25404 25742 26748 23718 20020 21967 23934 28969 28860 20264 13137 14929
14767 14929 19810 20194 16706 21993 22344 17598 16839 12460 11745 12408 16108 22156 22821 16859 16549 19130
14751 19130 13772 12930 10309 8876 10507 7979 9776 12738 12480 11532 9594 14064 10522 8946 10150
14736 10150 11483 15500 24998 28457 20423 12995 15197 17160 12718 10809 6416 9755 5405 1528
14722 1528 10919 12748 14294 17020 13281 19330 27088 30795 30284 33066 32396 26310 31951 22894 14590
14707 14590 11815 14048 17531 16246 16306 21489 22451 19571 15141 15651 17608 20075 15443 16829 24838
14692B4838L269j069n00J214l609k383k304l54M253K785J7n45N706J141N82m148
14676B8893m650M996K705j021k33j213L546o375l853N818j27l865K873m494l995
14661A9005j696j905L271j249o6k023J337M371j448m273M760J314p14M789n783
14646A9690m765p80J675L523K914j999j335O97m613q70K786M420L877m10n062
14631A9748m169q652m551O861K240p14L333o84l307M739k457K877k952L388P749
14616B3449j983j341K843l776p388L51L077N020k881l646K111M751J253j212l547
14601A7081p045n120j834K866M540K113k275n307k870N254Q957N716l832k790
14587A5454Mn105L794L974J769L653j882o932Q94J0884N467K032j348k994n295
$$ plain form
14692 24838 28107 27038 26538 27752 24143 21760 19456 19102 23355 26140 26157 25612 31318 32459 33041 28893
14676 28893 24243 29239 31944 30923 30690 29477 33023 26648 22795 28613 28486 24621 27494 23000 19005
14661 19005 17309 15404 18675 17426 17360 15337 16674 21045 19597 15324 20084 21398 20684 25473 19690
14646 19690 14925 14145 15820 19343 22257 20258 18923 19620 15007 14137 16923 21343 25220 24810 19748
14631 19748 15579 6927 2376 9237 11477 10763 14096 13412 10105 14844 12387 15264 12312 15700 23449
14616 23449 21466 20125 22968 19192 11804 12155 15232 20252 17371 13725 15836 20587 21840 20628 17081
14601 17081 10036 4916 3082 5948 10488 12601 10326 5019 2149 7403 16360 22076 18244 15454
14587 15454 15458 10353 14147 18121 19890 23543 21661 14729 15623 26507 31974 34006 32658 29664 24369
14572B4369p379J610M632L506J338l270l083j155K58L644j568k854j142p935l128
14557G843p30K403P383k031k227P29K457Q76J933O57M388l552p367m404J743Q0
14541A0181P993J387K160j664l222p00o060k167n04M711N303L118k973J260j663
14526A7160k315m02K43L802J684k763k697M954J579o778k138J0792K712r43j692
14511B3198j887l580j268K911K147o033l747j52l888j432N291O995m73N489L431
14496B7002M59L26J16L512m056m366q953j132J792J864K959J247K283N344m150
14481B4247k795j726j478J611L201o528j332J272L82M281K78K76L838J439l271
14466B3695k297p422p712M226Q91O70K696J2036M521j05N511Q57o373l684m082
$$ plain form
14572 24369 16990 18600 23232 26738 28076 24806 21723 20568 20826 24470 22902 20048 18906 10971 7843
14557 7843 7113 9516 16899 14868 12641 13370 15827 16703 18636 19293 23681 20129 12762 8358 10101 10181
14541 10181 18174 19561 21721 20057 16835 16135 10075 7908 7404 12115 17418 20536 17563 18823 17160
14526 17160 14845 14443 14686 18488 20172 17409 14712 19666 21245 14467 12329 23121 25833 24890 23198
14511 23198 21311 17731 16463 19374 21521 15488 11741 11589 7701 6269 11560 18555 18082 23571 27002
14496 27002 27461 27787 27903 31415 27359 22993 14040 12908 14700 16564 19523 20770 23053 28397 24247
14481 24247 21452 19726 18248 19859 23060 16532 15200 16472 16854 21135 21413 21689 25527 26966 23695
14466 23695 21398 13976 6264 10490 11381 12051 14747 26783 31304 31199 36710 37567 31194 27510 23428
14451B3428j198M113O471J166j400q87p645q243L400K652o629q576l56K580R128
14436A8004l444m513j314j579M94M490K635J204r10L926O154O56J150M03k6L320
14420C0650j673K577m55j630L85j213o541M02n66K441N180K499q818m875k159
14405A6204l842O308O149o21P17m876n524K781L808K97o406j032m29l28K108K946
14389A8260O753L107M120J091o481k727J710K010K864m182j0318O11J516k399
14375A5935Q302L552l169n324J325K854j878j910p897M819R912J484m97n386K249
14360B4371o22Q34k356J777k073J410M741j297m825l430k233J631K514Q256K930
14345C1628L124m71o75L529l06l643l282M556m528p104n756M59L861J114j177
$$ plain form
14451 23428 22230 26343 32814 33980 32580 31693 24048 15805 19205 21857 15228 6652 6296 8876 18004
14436 18004 14560 10047 8733 7154 7648 12138 14773 15977 15067 18993 25147 25803 26953 27356 27330 30650
14420 30650 28977 31554 31099 29469 29854 28641 22100 22502 21936 24377 29557 32056 23238 18363 16204
14405 16204 12362 18670 24819 24198 24915 20039 14515 17296 21104 21401 14995 13963 13534 13206 15314 18260
14389 18260 25013 28120 32240 33331 26850 24123 25833 27843 30707 26525 16207 16818 18334 15935
14375 15935 24237 27789 24620 19296 20621 23475 21597 19687 11790 16609 26521 28005 27508 22122 24371
14360 24371 23749 24583 22227 24004 21931 23341 28082 26785 21960 18530 16297 17928 20442 28698 31628
14345 31628 34752 34281 33606 37135 36829 33186 29904 34460 29932 22828 17072 17531 21392 22506 21329
14330B1329l290J103J10K127j146J808k715k51M156l5M927j007M264L691L771
14315C8842J526k437l778k010M952P63k327J132k209j677N538n493p888n112R34
14300B0756O069M740l049m744k587K521N030N608l654j508j880q29K577k088M46
14285B7408K256N439M703k687J626L96q68N134J589J201m945p693j726k941j640
14270B7252P299P595j368l316o419j918P114k202k604k818p09m638L380J606J275
14255B9529M302P151n486n592j655k296K478j683j869K103L839L041k587n492
14241B5783k642O061M412K726J657j418J813p904p078r11O58m75J530K255k811
14226B3656N976M109l019l684m869P82K472N012O301J549N87m28o791L120n046
$$ plain form
14330 21329 18039 19142 19252 21379 20233 22041 19326 19075 23231 23196 28123 27116 31380 35071 38842
14315 38842 40368 37931 34153 32143 37095 37858 35531 36663 34454 32777 38315 32822 24934 19822 20756
14300 20756 26825 31565 28516 23772 21185 23706 28736 34344 30690 29182 27302 26473 29050 26962 27408
14285 27408 29664 35103 39806 37119 38745 39141 38273 43407 44996 46197 41252 33559 31833 28892 27252
14270 27252 34551 42146 40778 37462 31043 29125 36239 34037 31433 28615 27906 23268 26648 28254 29529
14255 29529 33831 40982 35496 29904 28249 25953 28431 26748 24879 26982 30821 33862 31275 25783
14241 25783 23141 29202 33614 36340 37997 36579 38392 30488 23410 22499 23157 22682 24212 26467 23656
14226 23656 29632 33741 30722 27038 22169 22951 25423 30435 36736 38285 38872 38444 31653 34773 29727
14211B9727m243j874L052M554O95O484Q576N237J424l870q411O313J5012K5879
14197H8555K8023L8517N1218N6432M8497K0954j1592l3666m1247m4025m4263l6549
14185A20854k3862k0247j4081l016N03n263m790J418J331J500o478o286M662M10
14171D6655O95J483q022k889k822l900j400j603M474O44k827j784N190J386N187
14156D0467K113q10m433j187J398N126K30l011q599j851p16L063R155J384L744
14141D6073L40L50l345o949k669J80M734N17J707l940m552j546Q51N15j087N096
14125C6275k96L683J702o515j071O12p40n138k82j657P704K998L080L685k692
14110D1348o525J183J949N515L493n734k134O151K944p822k756n413ok980j36
$$ plain form
14211 29727 25484 23610 26662 31216 31911 38395 46971 52208 53632 49762 41351 47664 62676 88555
14197 88555 116578 155095 206313 262745 311242 332196 320604 286938 245691 201666 157403 120854
14185 120854 96992 76745 62664 59648 60151 54888 50098 51516 52847 54347 47869 41583 46245 46655
14171 46655 47350 48833 40811 37922 35100 31200 29800 28197 32671 33315 30488 28704 33894 35280 40467
14156 40467 42580 41770 37337 36150 37548 42674 42904 39893 31294 29443 28727 31790 40945 42329 46073
14141 46073 46413 46763 43418 36469 33800 33980 38714 39231 40938 36998 32446 30900 31751 32266 31179 36275
14125 36275 35979 39662 41364 34849 33778 34390 33650 28512 28230 26573 34277 37275 40355 44040 41348
14110 41348 34823 36006 37955 43470 46963 41229 39095 45246 48190 40368 37612 32199 32193 29213 29077
14095B9077r78J649o87K914L529m360p834m451N230O793N94K853m803j233O807
14080C5100M045N963J030m420P24N603k539m98j602j971m960k321j153K711N869
14065D1581L539k960p259q806N950L050l951Q43k761k847O088N150Q94n960k823
14050B9728J5425O423l293m027O366Pn580m036p7M587K418R39m94j591o042J029
14034D1782j952J39N008K106m930J992P898k366j529J47R10L401q477J533K631
14019D8293K432m365q336J423J0850O206n006l622j685L139J686j449J26n060
14005D4632l97j394m058l74j970m762m926M044K372O479M805k2L520r75m395k230
13989D0349K195K351L127M644q27p304k765K547O62l041J079K387m774l884N858
$$ plain form
14095 29077 28099 29748 29061 31975 35504 31144 23310 18859 24089 30882 31476 34329 29526 28293 35100
14080 35100 39145 45108 46138 41718 42442 48045 45506 45008 43406 41435 36475 34154 33001 35712 41581
14065 41581 45120 42160 34901 26095 32045 35095 31144 31987 29226 26379 32467 37617 38511 32551 29728
14050 29728 45153 51576 48283 44256 50622 50629 45049 41013 40936 45523 47941 48880 48386 46795 40753 41782
14034 41782 39830 39969 44977 47083 42153 44145 52043 49677 48148 48295 49205 52606 44129 45662 48293
14019 48293 50725 46360 38024 39447 50297 56503 51497 47875 46190 49329 51015 49566 49692 44632
14005 44632 44235 42841 38783 38409 36439 31677 26751 30795 33167 39646 44451 44429 47949 46974 42579 40349
13989 40349 42544 44895 48022 52666 51839 44535 41770 44317 44979 41938 43017 45404 40630 36746 42604
13974D2604N550N076L832M813J59l060M750j267r458l89j034n75O55R98J802p36
13958E3720J2487L399m476q142j826j385k023j635K444R17o72R70r859l701J350
13943D1568l505K629M813L051M01O916N132m675o521L93j900j482L185K638L657
13928E6300k727m457l596M088L91l590L04K392L067j393l357J317P39P190L19
13913E6987k616L764m667p704J349L986M940k639j430M543k452n915O860k380
13899E2626l050K350l05N91O029K077k088K971K468n591j0405n946J530O811L871
13884E3939m81P489R597L02J063j439n348l529q865j845J457p445L489M042L48
13869E2774k682J218n371Q97N146L167l10l095k71j100J215r73l465L508J748
$$ plain form
13974 42604 48154 53230 57062 61875 62034 58974 63724 62457 52999 52610 51576 51001 51656 52654 54456 53720
13958 53720 66207 69606 65130 56988 55162 53777 51754 50119 52563 53480 52808 53778 43919 40218 41568
13943 41568 38063 40692 45505 48556 48957 55873 61005 56330 49809 50202 48302 46820 50005 52643 56300
13928 56300 53573 49116 45520 49608 49999 46409 46713 49105 52172 50779 47422 48739 49478 56668 56987
13913 56987 54371 58135 53468 45764 47113 51099 56039 53400 51970 56513 54061 48146 55006 52626
13899 52626 49576 51926 51621 52212 58241 60318 58230 61201 63669 58078 47673 41727 43257 50068 53939
13884 53939 53458 60947 70544 70846 71909 70470 65122 61593 52728 50883 52340 44895 48384 52426 52774
13869 52774 50092 51310 45939 46836 51982 55149 54839 51744 51473 50373 51588 50615 47150 50658 52406
13854E2406P086M360m504j836P53J33N41m303k699j842m36R24L348Q137N712m958
13838F2822k640l900m188j948n844m963k676O873j09N623R394K381j830M170k982
13823F0183m584J46m257L043Q827O185K75J69m256j1711j610Q173K671K008j132
13808F4130L256q70o933m683M221O98R52k924L25N850J80l290K087M659l527n366
13792E8765p588Q25M730J4423O854q88j1299k910O05M80L639l9O831J402l973
13777G1857l697R134L100M471P671K724k392n118J186j465m197L06O554M607N470
13762A00211P612J4972J8565K1013L6493O6114N4684j8161l7208k3943k7844l6524
13750A75984l1514j8520j6645m864n343q716m395N17k917K280J2431J005J788
$$ plain form
13854 52406 59492 63852 59348 57512 58265 58398 58939 54636 51937 50095 49659 50583 53931 62068 67780 62822
13838 62822 60182 56282 52094 50146 44302 39339 36663 43536 43427 49050 58444 60825 58995 63165 60183
13823 60183 55599 55745 51488 54531 63358 69543 69818 69987 65731 54020 52410 60583 63254 65262 64130
13808 64130 67386 66516 59583 54900 59121 59819 60771 57847 58172 64022 64202 60912 62999 67658 64131 58765
13792 58765 51177 52002 56732 71155 78009 77121 65822 62912 63517 63997 67636 67597 74428 75830 71857
13777 71857 68160 77294 80394 84865 92536 95260 92868 87750 88936 87471 83274 83580 90134 94741 100211
13762 100211 107823 122795 141360 162373 198866 264980 319664 301503 264295 240352 212508 175984
13750 175984 144470 125950 109305 104441 99098 90382 85987 86504 83587 85867 98298 99303 101091
13737A01091O023o416o190J130P091r60k140J897j173O21R345Q371R024N161M532
13722A37407O062K262O687P347K407J1007R619J5691J7084M854O017J6302K0063
13709B62809L5477L3962K5535K4102K5255K8329K2405J5991J1898O357l091L791
13697D92820k905j0173p163p483l900m517n556r026J223L522M652J8890K2789
13684D93173J7266K0474K3779K6059K0196K2887K0114J8660J3398J5389J6844
13673G08239J3278J0210m616l290q007j2377j2537j2354k0131o778o117j3490
13661F32030j8253k1647k0176j2913l853o285n569j5173r723j0882r590j3901
13649D84065p378K846J0590O452J5844J4661J5573J3913N896K840m145n703j1540
$$ plain form
13737 101091 107114 100698 94508 95638 102729 101769 99629 101526 100353 100974 110319 118690 127714 132875 137407
13722 137407 143469 145731 152418 159765 162172 173179 182798 198489 215573 220427 226444 242746 262809
13709 262809 298286 332248 357783 381885 407140 435469 457874 473865 485763 492120 489029 492820
13697 492820 489915 479742 472579 465096 461196 456679 451123 442097 443320 446842 451494 470384 493173
13684 493173 510439 530913 554692 580751 600947 623834 643948 662608 676006 691395 708239
13673 708239 721517 731727 727111 723821 715814 703437 690900 678546 658415 651637 645520 632030
13661 632030 613777 592130 571954 559041 555188 548903 543334 528161 518438 507556 497966 484065
13649 484065 476687 479533 490123 496575 512419 527080 542653 556566 562462 565302 561157 555454 543914
13636E43914j6834k6425l0941k5273m2640m1364l2961k2296k0954k0126k3081
13625B41019k6194j7683j5509j0670m619k998m821j255k537l433J496P31J549
13612A55076r878o935j1120p505m041j327N735M593k853K738q687p090k204l276
13598A03226k314l541J606L898j812n740L698J538o684j059L160M900J690M31
13584A02997M018Q15j181k557N128K967k233l04m106K501P133L129J826l588p694
13569A08851p569j2131J351l40j088o191O56l17K641Q977k030j239p833M506L998
13554I2242l760l733K56J3887N169q5j327n214l831k182k299O120Q8K162j628
13539I5865j113J113O754J162r4L821k281j0969l34K726L289O76J696m24P90j320
$$ plain form
13636 543914 527080 500655 469714 444441 401801 360437 327476 305180 284226 264100 241019
13625 241019 214825 197142 181633 170963 166344 163346 158525 157270 154733 151300 152796 153527 155076
13612 155076 145198 138263 127143 119638 115597 114270 120005 124598 121745 124483 115796 108706 106502 103226
13598 103226 100912 97371 98977 102875 101063 95323 99021 100559 93875 92816 95976 100876 102566 102997
13584 102997 107015 107830 106649 104092 109220 112187 109954 109650 105544 108045 115178 118307 120133 116545 108851
13569 108851 101282 89151 90502 90162 89074 82883 83539 83222 85863 94840 92810 91571 83738 88244 92242
13554 92242 88482 84749 85005 98892 104061 103976 102649 97435 93604 91422 89123 95243 95331 97493 95865
13539 95865 94752 95865 102619 103781 103687 107508 105227 94258 93924 96650 99939 100615 102311 101887 102677 101357
13523A01357K287j429k789K883k46K924N399L148m506N779M987j226M564K228
13509A25360k604k928K300K660N584n556N052j556l214N840J291N719K060m680
13495A35328n074M686o03l263k245N32M026J0941J1137J0366R200J804N206J3029
13481A95070J9623J9343K0879J7822J9125L3502N0872O5506Q9287J47729K49709
13470I28467L92593N04076L29776o3176k52395k33467k56643k92337k43741j66826
13460F46327j27660j14102r5642o9983m1220l0211j6911j0232n034L137Q782M748
13448A51999O347J4189J8378M0509P1670Q7583P6152L8909j5627m7423n3681m8979
13436C40026n0874m2380l8493k4199j1044M835k055r04J3620K0030K6793K6414
$$ plain form
13523 101357 103644 102215 99426 102309 102063 104987 110386 113534 109028 114807 119794 118568 123132 125360
13509 125360 122756 119828 122128 124788 130372 124816 129868 128312 125098 130938 132229 137948 140008 135328
13495 135328 130254 134940 134337 131074 128829 129361 133387 144328 155465 165831 175031 176835 182041 195070
13481 195070 214693 234036 254915 272737 291862 325364 376236 441742 531029 678758 928467
13470 928467 1321060 1825136 2154912 2091736 1839341 1605874 1349231 1056894 813153 646327
13460 646327 518667 404565 308923 238940 197720 167509 150598 140366 135332 138469 147251 151999
13448 151999 158346 172535 190913 231422 303092 390675 466827 505736 490109 442686 389005 340026
13436 340026 289152 246772 208279 184080 173036 177871 175816 174912 188532 208562 235355 261769
13424B61769K1941J8418J6205J2301m257j9233q248J0866L1768N1603O5955N7894
13412E16982K5949o215k7517n0891n8001m5750m3021k0760O014J5810J0027J304
13400C23931O423L820j5488k9027k7512j7286j4060j8454j3045j199P016Q629
13388B13748J5207K7131N8092P8334Q9013O0337O424l3828o0674o5037p1112o1754
13376B55881l6178l2625j9174j1028o820j5430p476K469m578n956r26j046j6N177
13362A22274K630m739q314m336j296N760k865o47j859j673j365n568N385L916
13348A07303M655M175Q678N013N634K764J655o411l726k981o457j143L094l106
13334A19147L06J624N09m661k094n635o353m493o651k05m520k509m673j7J087
$$ plain form
13424 261769 283710 302128 318333 330634 326377 307144 298896 309762 341530 393133 459088 516982
13412 516982 542931 536716 509199 458308 400307 354557 311536 290776 296790 312600 322627 323931
13400 323931 330354 334174 318686 289659 262147 244861 230801 212347 199302 198103 205119 213748
13388 213748 228955 256086 314178 392512 481525 541862 548286 514458 453784 388747 317635 255881
13376 255881 219703 187078 167904 156876 150056 134626 127150 129619 125041 119085 118159 117113 117097 122274
13362 122274 124904 120165 111851 107515 106219 111979 109114 108467 106608 104935 103570 98002 103387 107303
13348 107303 111958 116133 124811 129824 135458 138222 139877 133466 129740 126759 120302 119159 122253 119147
13334 119147 119453 121077 121586 116925 114831 109196 102843 98350 91699 91494 86974 84465 79792 79775 80862
13319H0862k891k689m381n146p207K014q60n167q753l893q449k2291k2310j5393
13305b6554J3654O1659R8148O8786K8135K1219K2540N196j1102j1164n050n104
13293B60363j36k082k162l482O16Q73n852K131n978j4462j4319j1051o554k820
13279A95085l183m748M743Q794J9321J1119J138j126j178l937j0364j3372r684
13266A92608q538K114R061K783p791o358M480q65k626L772J2873J3572R063O270
13252B30418J1051J5469K1009L0564K4227J4138J8898K3368m442k9209k6701j6512
13240C12278j635j7704k3930m469N837j373j3J485J4247K2049L6023O0277Q9757
13227D92829O2645k4071o5177n6663n5658n4467l8166l2667j7057M388J8565J4508
$$ plain form
13319 80862 77971 75282 70901 65755 58548 60562 59702 54535 45782 41889 33440 11149 -11161 -26554
13305 -26554 -12900 48759 146907 215693 243828 265047 287587 292783 281681 270517 265467 260363
13293 260363 260227 258145 255983 252501 253117 253990 248138 250269 244291 229829 215510 204459 197905 195085
13279 195085 191902 187154 191897 200691 220012 231131 232269 231143 229965 226028 215664 202292 192608
13266 192608 184070 186184 195245 198028 190237 183879 188359 187494 184868 188640 201513 215085 224148 230418
13252 230418 241469 256938 277947 308511 332738 346876 365774 389142 384700 355491 328790 312278
13240 312278 310643 292939 269009 264540 270377 269004 268991 270476 284723 306772 342795 403072 492829
13227 492829 555474 531403 466226 409563 353905 299438 261272 228605 211548 215936 234501 249009
13215B49009J4414J5523Q209K818k106J333m777j0855q995j4264j3644q037j6529
13202B12099j9333j2418K078J3060J0399J1451J3452J2120J8228J3869J1131L494
13190B89630j3959j6041k7524k5103j6878p324O1M727J0516J6985Q338J5475K2273
13177B61176J325j0412j7630j6662j6652j8866j2829O662J636k442L547J6436
13165A95289K8252K7100J3795R939J3725O729l281k1781l2906l2728l1604n2482
13153A20047n7419p5029j05177j54177j71424q6584P7222J59757J48012J49278
13143D506J43169J04204O8796N5721M6301K7638J5464M992N997N000R874K9786
13131E21448O9008J19145J47980J18860N3113j6119m1126l9811m6718o6755m9491
$$ plain form
13215 249009 263423 278946 287155 289973 287867 289200 284423 273568 264573 250309 236665 228628 212099
13202 212099 192766 180348 182426 195486 205885 217336 230788 242908 261136 275005 286136 289630
13190 289630 275671 259630 232106 207003 190125 182801 182862 187589 198105 215090 223428 238903 261176
13177 261176 262501 252089 234459 217797 201145 182279 169450 176112 177748 175306 178853 195289
13165 195289 223541 250641 264436 274375 288100 294829 291548 269767 236861 204133 172529 120047
13153 120047 62628 -12401 -117578 -271755 -443179 -529763 -452541 -292784 -144772 4506
13143 4506 147675 251879 320675 376396 422697 450335 465799 470791 476788 481788 491662 521448
13131 521448 590456 709601 857581 976441 1029554 1013435 972309 932498 885780 819025 769534
13120G69534k908K3564K1149J5306J1455l20m2843n2987m9945l4055o547P874
13108F59277M635L497K765m203j3983k0894j6604j4353j6726n77O455M939l122
13095E91106j2257M128J2892K0367J9381J3071J8028K5908K7117L1191J5031O668
13083G72631R310R262R360J1464J0983k190o666m795j0765j1277O147K8869L5130
13070H57463L0679J7689J7424L6488N2779P4498J28992K24571L82108N04058M52234
13059B778983J60275j30563k43704k66268k89410k61470j69994p8866j4852K1863
13049A505994Q719j6653j1646l098Q878L2402N8509P8611J15548J21687Q3291
13038A982242M1257K4948J4723K7863M9431O1494O4873P4382O9130N1993O8003
$$ plain form
13120 769534 766626 790190 811339 826645 838100 837780 794937 741950 692005 657950 651403 659277
13108 659277 663912 667409 670174 665971 651988 631094 614490 600137 583411 582834 589289 594228 591106
13095 591106 578849 582977 595869 616236 635617 648688 666716 692624 719741 750932 765963 772631
13083 772631 781941 791203 800563 812027 823010 820820 814154 809359 798594 787317 793464 822333 857463
13070 857463 888142 905831 923255 959743 1012522 1087020 1216012 1440583 1822691 2326749 2778983
13059 2778983 2939258 2808695 2564991 2298723 2009313 1747843 1577849 1498983 1484131 1505994
13049 1505994 1514713 1498060 1486414 1483316 1492194 1524596 1583105 1661716 1777264 1898951 1982242
13038 1982242 2023499 2048447 2063170 2091033 2140464 2201958 2266831 2341213 2410343 2462336 2530339
13027B530339J10193J31802J55149J61941J46519J31912J50864J66883J76187
13018C861789J83321K22258K97425L73096M47652N28589N82187O52314P62871
13009G911502Q97095J117279J538617K121903K597101K709366K805803L417391
13001B5116057M562278O303630R043382J3128805J9793264L1725452N2924477
12994A62597345Q4139754R6396226M1896630l2487203n0999813m1743092n0280394
12987B09519453n8709679m6935633l0720087k0205837j3815802r304488o171410
12980B3656517m013543k711913k270436k064575j691236j360614j197565j083399
12972G263236r01190p01541n65209m59027l84612l46685l08126k64902k34137
$$ plain form
13027 2530339 2640532 2772334 2927483 3089424 3235943 3367855 3518719 3685602 3861789
13018 3861789 4045110 4267368 4564793 4937889 5385541 5914130 6496317 7148631 7911502
13009 7911502 8808597 9925876 11464493 13586396 16183497 18892863 21698666 25116057
13001 25116057 29678335 35981965 45025347 58154152 77947416 109672868 162597345
12994 162597345 246737099 343133325 385029955 352542752 301542939 259799847 209519453
12987 209519453 150809774 103874141 73154054 52948217 39132415 29827927 23656517
12980 23656517 19642974 16931061 14660625 12596050 10904814 9544200 8346635 7263236
12972 7263236 6362046 5660505 5095296 4636269 4251657 3904972 3596846 3331944 3097807
12963C097807k27105k34143k03008j57142j24189j06800j09355j37243j47310
12954A651512j28754j09560j00916r3202p3699p5353r1962p9376n8890m4768k2869
12943G72163k1609j6797m792r873k3210k2119k4903k5346l5072j8785o057o460
12931E57140J4230J3486j9500q514N942M670Q94j6212k2070j2771n472j4882j5965
12918D80976j2527j9546k5582j0768K563L895n67L158O569L221o664r771M515
12905D19472J2457P846K9307K6342J6994Q703K538K58M663O474o587r147o620
12892E12700K0420K0056P618k654L224O799R285J589L600n419k2256k6795l3456
12879D94711k5594j846J512j749m44o4O793J4908J5178J0488M507j1155k6514
$$ plain form
12963 3097807 2870702 2636559 2433551 2276409 2152220 2045420 1936065 1798822 1651512
12954 1651512 1522758 1413198 1312282 1219080 1145381 1070028 978066 898690 839800 795032 772163
12943 772163 750554 733757 728965 719092 695882 673763 648860 623514 588442 569657 563600 557140
12931 557140 571370 584856 565356 556842 562784 567454 568348 552136 530066 517295 511823 496941 480976
12918 480976 468449 448903 423321 412553 415116 419011 418444 421602 428171 431392 424728 414957 419472
12905 419472 431929 439775 469082 495424 512418 521121 523659 523917 528580 535054 528467 519320 512700
12892 512700 533120 553176 560794 558140 561364 568163 577448 579037 582637 577218 554962 528167 494711
12879 494711 469117 467271 468783 467034 466590 466526 473319 488227 503405 513893 518400 507245 480731
12866D80731l5271k0789J3264O540j1558q354R469R655n06L035R435J5584J3541
12853D84776Q519k892p536j3658l4554m2243l6770j7442k295l401j057J5058M0421
12840C86926O9432J24085J99064K05631P8240m6737p0112o6259r2527j15701j05187
12829E66855q2684o0126m4016k4297n445K408O28P519J2328P559J732m814j9287
12816C58360j7580j2400p328p715j4568k3619k4304k7510l5719l7543o801r773
12804A33500r834R603L1982L1671N610N897o591j9311l0566k5912k1416k2660
12792H1973j8493l360J0931J5027J3846J8982K4211K0821K1337O919o736r496
12780A75962p985j6529p322j020r147j8061j3164r661j884k891J633R845J9567
$$ plain form
12866 480731 445460 424671 437935 444475 432917 424563 434032 443687 443181 446216 455651 471235 484776
12853 484776 493295 490403 482867 469209 434655 392412 355642 338200 335905 332504 331447 346505 386926
12840 386926 456358 580443 779507 985138 1063378 1016641 946529 880270 787743 672042 566855
12829 566855 484171 424045 380029 355732 350287 352695 353323 360842 373170 380729 382461 377647 358360
12816 358360 340780 328380 321052 313337 298769 275150 250846 223336 187617 150074 143273 133500
12804 133500 123666 133269 165251 196922 202532 208429 201838 182527 151961 126049 104633 81973
12792 81973 63480 60120 71051 86078 99924 118906 143117 163938 185275 192194 185458 175962
12780 175962 167977 151448 144126 143106 133959 115898 102734 93073 91189 88298 89931 99776 119343
12767A19343L1579L9745L2895K2793L4519L3138K2725J5974J3920J0388M528j602
12755C79945j3068p119j1547r382j3514j6957j0370j258M253j332L898M097O436
12742C14082J7947K8486K3083J3304O146R825K1457K9442K4977J5114Q641J2575
12730E25079Q082J6259J4142N851k954P84n625k661k785j4416j5471n393p297
12717E13595j2026j1805j1812j9249j7074j5053j4779L419k342j966J1345J0306
12705D32559J0941J1085J5845R022J1611J1522J2829J5031P888M041j416p414
12693E33544j8218k3647j8022j6610l1975k7965k5832k2219l3834l7319k2312
12682B55591L1181R0096Q1787L5204K0369K4015R951o167q514j3585j5124q425
$$ plain form
12767 119343 150922 190667 223562 246355 280874 314012 336737 352711 366631 377019 381547 379945
12755 379945 366877 359758 348211 338829 325315 308358 297988 296730 300983 299651 303549 307646 314082
12742 314082 332029 360515 383598 396902 403048 412873 434330 463772 488749 503863 512504 525079
12730 525079 533161 549420 563562 569413 566459 567243 561618 558957 556172 541756 526285 520892 513595
12717 513595 501569 489764 477952 458703 441629 426576 411797 415216 412874 410908 422253 432559
12705 432559 443500 454585 470430 479452 491063 502585 515414 530445 538333 542374 540958 533544
12693 533544 515326 491679 473657 457047 425072 397107 371275 349056 315222 277903 255591
12682 255591 286772 376868 458655 493859 514228 538243 548194 542027 533513 519928 504804 496379
12670D96379n872l126L03n501j5776n949m675n264k921n374k98o447o257o186
12656D23036q391j1013j2669l174q849q921L027l69K65k472j0177q47r407j1467
12642C38572p304k441p390k909M331K993M684o713j0865o951J36l983Q542Q946
12628C19648N855K0202K6199K7610K7049K4134K7107L604J643O818k970j289J28
12615D85738M222O458J7577J6113J4927J0470l115m472M063K736N393P123L389
12602E70622k698K000n400j768O492P335J1715J1979Q577J2748Q224J3306J5866
12589F58998J2024R890J2401J1543J2217J1299K1328J4419J4970K4750J4242R220
12577H27301N336M809J948k792m09j1726j3531k843R116K0785K8069K8591L6442
$$ plain form
12670 496379 490507 487381 487684 482183 466407 460458 455783 450519 447598 442224 441926 435479 429222 423036
12656 423036 414645 403632 390963 387789 378940 370019 373046 372677 372942 370470 360293 359446 350039 338572
12642 338572 331268 328827 321437 318528 322859 325852 330536 323823 312958 306007 306143 302160 310702 319648
12628 319648 325503 345705 371904 399514 426563 450697 477804 481408 483051 489869 486899 485610 485738
12615 485738 489960 496418 513995 530108 545035 555505 552390 547918 551981 554717 560110 567233 570622
12602 570622 567924 569924 564524 562756 569248 576583 588298 600277 608854 621602 629826 643132 658998
12589 658998 671022 680912 693313 704856 717073 728372 749700 764119 779089 803839 818081 827301
12577 827301 832637 837446 839394 836602 836193 824467 810936 808093 817209 837994 866063 894654 931096
12564I31096L7220L7755L3053J6802K4148L3846K5017L6529M0146L0285K6910
12553A272807K5586K6213J7556K1998J5312Q674Q211J2983J8187K1096K1598K1829
12541A492050R178O256R606O354M435R564J6261J9289K4400L3334L6698L8253
12529A705678L2431K8176R468j9595l6628q449K1427J8859J2228L4568N8320P0843
12517A927326Q1395J11356J34456J65045K43468L70385N09281M86140J48683j62712
12507D014823k00318j79240k17118k00398j12749j7186M5810Q9951J29435J55479
12497C508489J78387J94663K02619K14373K33788K69179L19870L64935M48391
12488E934694N34764O38989P83186R56577J168220J444930J778980K187118K681494
$$ plain form
12564 931096 968316 1006071 1039124 1055926 1080074 1113920 1138937 1175466 1215612 1245897 1272807
12553 1272807 1298393 1324606 1342162 1364160 1379472 1388146 1396357 1409340 1427527 1448623 1470221 1492050
12541 1492050 1501228 1507484 1517090 1523444 1527879 1537443 1553704 1572993 1597393 1630727 1667425 1705678
12529 1705678 1738109 1766285 1775753 1756158 1719530 1711081 1732508 1751367 1763595 1798163 1856483 1927326
12517 1927326 2008721 2120077 2254533 2419578 2663046 3033431 3542712 4028852 4177535 4014823
12507 4014823 3814505 3635265 3418147 3217749 3105000 3087814 3133624 3223575 3353010 3508489
12497 3508489 3686876 3881539 4084158 4298531 4532319 4801498 5121368 5486303 5934694
12488 5934694 6469458 7108447 7891633 8848210 10016430 11461360 13240340 15427458 18108952
12479A8108952L211641L692397L992619L954252L513245K702941J627198M22126
12471D1225371p34187j650817k226845k455303k395136k117023j680009j180785
12463B6785266o82938k49234R8973L53845N44243P20716R46470J265174J704170
12454C1486685K260511K927886L648130M346587M929178N286989N359914N096142
12446F5342022M459586L484924K283555J029045k0474p24970j068128j164499
12438G3621061j139710j121698j193696j357664j537772j652465j639995j486282
12430F2491779j267124j057929r29757q48260p58661o22233m35058j23210L68485
12421E6818032J065336J965105L010310M131631N220650O109649O583147O342409
$$ plain form
12479 18108952 21320593 25012990 29005609 32959861 36473106 39176047 40803245 41225371
12471 41225371 40491184 38840367 36613522 34158219 31763083 29646060 27966051 26785266
12463 26785266 26102328 25853094 25952067 26305912 26850155 27570871 28517341 29782515 31486685
12454 31486685 33747196 36675082 40323212 44669799 49598977 54885966 60245880 65342022
12446 65342022 69801608 73286532 75570087 76599132 76578658 75853688 74785560 73621061
12438 73621061 72481351 71359653 70165957 68808293 67270521 65618056 63978061 62491779
12430 62491779 61224655 60166726 59236969 58388709 57630048 57007815 56572757 56449547 56818032
12421 56818032 57883368 59848473 62858783 66990414 72211064 78320713 84903860 91246269
12413I1246269N273966L487158J342400o67173k197884l142553l571375l651289
12405H8119519l533899l337031l166046l097397l189912l348574l451668l382031
12397F1612961l106108k672290k169024j690435j369094j272176j350279j499982
12389D6483573j580641j512292j260727q37609l01415L18045R55724J564617K131686
12380D5960961K643494L109380L525677L804636L762426L324120K561182J676253
12372G0368129Q38556K7329q65452j949118l181234m344940n250642n770993n909154
12363D3962481n703705n239551m612178l934656l277465k703462k205063j798216
12355A4488185j470271j196596r79338q07766o64978n50266m54556l79423l23819
$$ plain form
12413 91246269 96520235 100007393 101349793 100682620 98484736 95342183 91770808 88119519
12405 88119519 84585620 81248589 78082543 74985146 71795234 68446660 64994992 61612961
12397 61612961 58506853 55834563 53665539 51975104 50606010 49333834 47983555 46483573
12389 46483573 44902932 43390640 42129913 41292304 40990889 41308934 42264658 43829275 45960961
12380 45960961 48604455 51713835 55239512 59044148 62806574 66130694 68691876 70368129
12372 70368129 71206685 71234014 70368562 68419444 65238210 60893270 55642628 49871635 43962481
12363 43962481 38258776 33019225 28407047 24472391 21194926 18491464 16286401 14488185
12355 14488185 13017914 11821318 10841980 10034214 9369236 8818970 8364414 7984991 7661172
12346G661172k69699k26295j90491j48100j09427o6760l1710O764N4171R9958
12336F779583J55925K15115K76954L48271M31964N28329O23455P44284Q83674
12327A0987554J054605J246160J487310J793412K153786K586274L104154L689148
12319B8102403M302820M896395N317273N470714N265425M713747L942938L031845
12311F5043560K084156J102255J5083j078227k032747k778562l315400l605542
12303E5434576l664441l539260l271257k878744k399052j841634j232909n96757
12295C6010522J2953N23102Q85100J076272J096886R43708P27287N76966N40757
12286D2393553O12629P53671R17541J022110J021793Q98443O69321L59889K8230
$$ plain form
12346 7661172 7391473 7165178 6974687 6826587 6717160 6650400 6618690 6625454 6679625 6779583
12336 6779583 6935508 7150623 7427577 7775848 8207812 8736141 9359596 10103880 10987554
12327 10987554 12042159 13288319 14775629 16569041 18722827 21309101 24413255 28102403
12319 28102403 32405223 37301618 42618891 48089605 53355030 58068777 62011715 65043560
12311 65043560 67127716 68229971 68245054 67166827 65134080 62355518 59040118 55434576
12303 55434576 51770135 48230875 44959618 42080874 39681822 37840188 36607279 36010522
12295 36010522 36023475 36546577 37431677 38507949 39604835 40548543 41275830 41852796 42393553
12286 42393553 43006182 43759853 44677394 45699504 46721297 47619740 48289061 48648950 48677180
12277D8677180k88234n57122p84945r71942j161226j353635j576261j814634j994920
12268C8174261k093840k103373k051464j939904j733512j463259j147755p91798
12260B4849356m07661m2876K59961M51816N05486M26137K69318R3864o9001k28782
12250B6107618l61130m04652l87728l96841m88443o64338q95695j155051j379274
12241A9974466j520024j571526j523258j414255j275759j114723r58843q15415
12233I780663o87595n83033m91286m16661l46326k90013k48593k16173j84301
12224F316682j56433j36333j21425j11199j07135j10115j06929j12103j01647
12215E253363r3178q7676p1961o3127n5721m5072l5389k2157j7914j0515J2850
$$ plain form
12277 48677180 48388946 47831824 47046879 46074937 44913711 43560076 41983815 40169181 38174261
12268 38174261 36080421 33977048 31925584 29985680 28252168 26788909 25641154 24849356
12260 24849356 24441695 24398819 24658780 25110596 25616082 26042219 26311537 26405401 26336400 26107618
12250 26107618 25746488 25341836 24954108 24557267 24068824 23404486 22508791 21353740 19974466
12241 19974466 18454442 16882916 15359658 13945403 12669644 11554921 10596078 9780663
12233 9780663 9093068 8510035 8018749 7602088 7255762 6965749 6717156 6500983 6316682
12224 6316682 6160249 6023916 5902491 5791292 5684157 5574042 5467113 5355010 5253363
12215 5253363 5160185 5072509 5000548 4937421 4881700 4836628 4801239 4779082 4761168 4750653 4763503
12204D763503K5122L5049N0509O4954P0065Q5323R9881J09125J29615J35008J52931
12193E721085J64965J70666J94853K28116K54530K81556L26307L78685M34040
12184H154803N00079N78465O74331P82221R14584J074278J260250J486001J757864
12175A7182876K091036K484972K944184L485151M057559M610004N029164N145894
12167D7030840M788856L871191K456632P59612r17758k328672l302760l757550
12159D8600391l774555l470633k988753k448808j932137j475296j091180p44618
12151C0674411l90134l106M13255Q72425J321364J705591J949637K025721J965150
12142D0534314J852865J760615J776345J930111K162572K390725K511786K424938
$$ plain form
12204 4763503 4788625 4823674 4874183 4939137 5009202 5094525 5194406 5303531 5433146 5568154 5721085
12193 5721085 5886050 6056716 6251569 6479685 6734215 7015771 7342078 7720763 8154803
12184 8154803 8654882 9233347 9907678 10689899 11604483 12678761 13939011 15425012 17182876
12175 17182876 19273912 21758884 24703068 28188219 32245778 36855782 41884946 47030840
12167 47030840 51819696 55690887 58147519 58907131 57989373 55660701 52357941 48600391
12159 48600391 44825836 41355203 38366450 35917642 33985505 32510209 31419029 30674411
12151 30674411 30284277 30281171 30694426 31566851 32888215 34593806 36543443 38569164 40534314
12142 40534314 42387179 44147794 45924139 47854250 50016822 52407547 54919333 57344271
12134E7344271K053251J406110M99448n54471j628686k608403l388684l893169
12126D9229667m095862m018961l714551l250284k704569k162647j685971j287485
12118B6309337r83107p42657n20580k89812j7660L11737O97460J129044J585622
12109B7479384J983347K255176K315344K082348J541736P37289k58366j276891
12101C6859367k182942k833579l204468l297227l178456k916794k579968k225534
12093A4440399j891374j595768j344959j130696r56780q12584o93967n88611m98222
12084D927438m32465l82939l34698k87911k46028k16905j93692j80522j61843
12075B490435j49430j41554j22594j06186j03271r7537p8908o4169o1777n6850
$$ plain form
12134 57344271 59397522 60803632 61303080 60748609 59119923 56511520 53122836 49229667
12126 49229667 45133805 41114844 37400293 34150009 31445440 29282793 27596822 26309337
12118 26309337 25326230 24583573 24062993 23773181 23755521 24067258 24764718 25893762 27479384
12109 27479384 29462731 31717907 34033251 36115599 37657335 38394624 38136258 36859367
12101 36859367 34676425 31842846 28638378 25341151 22162695 19245901 16665933 14440399
12093 14440399 12549025 10953257 9608298 8477602 7520822 6708238 6014271 5425660 4927438
12084 4927438 4494973 4112034 3777336 3489425 3243397 3026492 2832800 2652278 2490435
12075 2490435 2341005 2199451 2076857 1970671 1867400 1769863 1690955 1626786 1565009 1508159
12065A508159m1997l8031n0097m4324l9491n2570m8849m5676l6873l4657l3843
12054A041751l4531k8606k6900k3496j3219j9047k6462j8371j6661j2070j6813
12043H05575k1594k8047k8503k8842j6104j4614k0910j2093j2610m810l202m513
12031F09733j4815j3810n594j3299p985q411l033l984m608r12P199l49J113J1549
12017E52794J1296J9597K2392K0720K8149K1441Q136Q869M351Q017O96j69q19
12004G05470j2536k5866k0020k6817k7731j7278k2966j5781r048q556O86k67O494
11991E25784R911J6131J3659K0610J5997O744O191J3850K2446K0300R592J2381
11979F93596K5841K3214K5468L0040K0430R373J0724P901N814N442o936j2727
$$ plain form
12065 1508159 1466162 1428131 1378034 1333710 1294219 1241649 1192800 1147124 1110251 1075594 1041751
12054 1041751 1007220 978614 951714 928218 914999 895952 869490 851119 834458 822388 805575
12043 805575 783981 755934 727431 698589 682485 667871 646961 634868 622258 617448 614246 609733
12031 609733 594918 581108 575514 562215 554230 545819 542786 538802 534194 533282 540481 540132 541245 552794
12017 552794 564090 583687 606079 626799 654948 676389 684525 693394 697745 705762 706458 706289 705470
12004 705470 692934 667068 647048 620231 592500 575222 552256 536475 527427 518871 519557 519290 525784
11991 525784 535695 551826 565485 586095 602092 608836 615027 628877 651323 671623 681215 693596
11979 693596 719437 742651 768119 798159 818589 827962 838686 846587 852401 857843 850907 838180
11967H38180j4733j3768j9912k6461k4630l5157l2583k5564k1409k0775j4703
11956E88485o323J171K96L443R113J1255R412J1096R169M969J0171J2632J4472
11943F79361J3467J7641L226p151q609n633p998r910j2552j1198q727j6286k2801
11930F02830j3311j4119k1600k4905k0916j6697p232j1648r202p7P137K8101M6879
11917E45240O3571J06060J59139K87683N52105Q96242P77623m2581m93564l59516
11907B492002l46308m86635m36489k73155j57114j11911p1943m0260l7064l1155
11897D99968k8181j8994k4243k7479k1427k0010k4770l5222k7034j7913k1354
11886B33341k0711j2428o64J0052J0259N009n596n278m842J510J921J1910K2184
$$ plain form
11967 838180 823447 809679 789767 763306 738676 703519 670936 645372 623963 603188 588485
11956 588485 582162 583333 583629 587072 596185 607440 616852 627948 637117 642086 652257 664889 679361
11943 679361 692828 710469 713695 706544 697935 692302 684304 674394 661842 650644 641917 625631 602830
11930 602830 589519 575400 553800 528895 507979 491282 484050 472402 463200 463123 470260 498361 545240
11917 545240 608811 714871 874010 1161693 1713798 2610040 3387663 3345082 2851518 2492002
11907 2492002 2145694 1659059 1222570 949415 792301 680390 608447 568187 531123 499968
11897 499968 471787 452793 428550 401071 379644 359634 334864 299642 272608 254695 233341
11886 233341 212630 200202 199538 209590 219849 224858 219262 213984 209142 210652 212573 224483 246667
11873B46667K3339J2752J1227K1672J4074P332P301N766p971j8690k5009k2085
11861B76375j8177m339o341r572k96Q67P947J5881K0442K0788J2583Q333j213
11848C23278j150l390m488j572M46K761K442N358J0264J3031R416J2250J0640
11835C79286M887n124n811j2990j6440j4292j9085k1502k2358j4919j6816j3220
11823B21616N02o72j1723j5117m49L278M417p431P3P442K138J1532J1858J0707
11809B38171R934J1657J5157M242k955j280r052j3780k0013j8359j9587j4634
11797A79501j6970j4558r210j0710p241n344k057P539m160o355m577k703J704
11784A04859p339j314O482M16j057L742p831j6373n863m21J073m987m444k423
$$ plain form
11873 246667 270006 282758 293985 315657 329731 337063 344364 350130 342159 323469 298460 276375
11861 276375 258198 253859 247518 237946 237650 238517 246464 262345 282787 303575 316158 324491 323278
11848 323278 322128 318738 314250 312678 313124 315885 318327 323685 333949 346980 356396 368646 379286
11835 379286 384173 379049 373238 360248 343808 329516 310431 288929 266571 251652 234836 221616
11823 221616 222118 221446 209723 194606 194157 197435 201852 194421 194494 201936 204074 215606 227464 238171
11809 238171 248105 259762 274919 279161 276206 274926 265874 252094 232081 213722 194135 179501
11797 179501 162531 147973 138763 128053 120812 115468 113411 120950 116790 110435 105858 103155 104859
11784 104859 97520 96206 102688 103104 102047 105789 97958 81585 75722 75301 76374 71387 66943 64520
11770F4520J501R904N641m397j0446m908O022J894k2l144j493Q611j784k696M700
11755G3903k912l597P97R79L909K866K165j56r42N742L152Q458K71K178k456p193
11739H7164M26J0583N629K296P123J1013J7486R718J9423K1460K3049K5512L1823
11726B72705K3605J4486Q846j221q30j21j9623j8476k1298j4238r307r619j6073
11713B08836j1309n196n53J509k916j326J3406J2093O127R132Q232J0869J7918
11700B66822R987J8332J6080L175P352J4551M434L81M79K376m717j4707j4986
11687C09559j1740j6566k3508k2614j4248j1217j3369j1080j1244j0825k371n810
11675A54967j822l415m600n928L973R611R126J3185J1325J1908J1693J2320J2001
$$ plain form
11770 64520 66021 75925 81566 77169 66723 61815 67837 69731 69709 66565 65072 73683 71899 69203 73903
11755 73903 70991 67394 68191 69170 73079 75945 78110 77954 77012 82754 85906 94364 94635 96813 94357 87164
11739 87164 87590 98173 103802 106098 113221 124234 141720 151438 170861 192321 215370 240882 272705
11726 272705 296310 310796 319642 318421 317591 317470 297847 279371 258073 243835 234528 224909 208836
11713 208836 197527 192331 191778 193287 190371 189045 202451 214544 220671 229803 238035 248904 266822
11700 266822 276809 295141 311221 314396 321748 336299 340733 341114 341593 343969 339252 324545 309559
11687 309559 297819 281253 257745 235131 220883 209666 196297 185217 173973 163148 160777 154967
11675 154967 153145 149730 145130 139202 143175 152786 161912 175097 186422 198330 210023 222343 234344
11662B34344K770o248j4125k3219l0579k1917r226r306j6685j6459j1866o084
11650G1400r701n566j3313m60j502j1365j173K112k886l228l873l709l615n029
11636H092p309l715j794r10QM084l988j30P24L710N88K660M146M228K593n174
11620G813k607r34l641N326l672p040K516K718J994L562K245K681K978n386k29
11605H324j18k732r024N621N016q69n574R9N627L482n530m546L614j820M360R21
11589F851L47J662j891k233J822Q510K919k237j653n48l816n83j661M009j313
11574A0185o848l938K376k713p206k39N529M89K887k013J539K764k014J209N049
11559G056N064R68l721k890k958k934j163M797j69L68Q280n79L462n305m387R72
$$ plain form
11662 234344 237114 230866 216741 193522 162943 141026 131800 122494 105809 89350 77484 71400
11650 71400 61699 56133 42820 42360 40858 29493 28320 30432 27546 24318 20445 16736 13121 8092
11636 8092 783 -2932 -4726 -5636 -5628 -1544 -5532 -5662 -4938 -1228 -640 2020 6166 10394 12987 7813
11620 7813 5206 4272 631 5957 2285 -4755 -2239 479 2473 6035 8280 10961 13939 8553 8324
11605 8324 8206 5474 -3550 2071 7087 6218 644 743 6370 9852 4322 -224 3390 1570 5930 6851
11589 6851 7198 8860 6969 4736 6558 15068 17987 15750 14097 13549 9733 9150 7489 11498 10185
11574 10185 3337 -601 1775 -938 -8144 -8383 -2854 -2365 522 -1491 48 2812 798 2007 7056
11559 7056 12120 13088 9367 6477 3519 585 -578 4219 4050 4418 12698 12119 15581 10276 5889 6861
11543F861l08M20O980J273m204j103k925o9m609n193j80O121O743n79l817l335
11527B076j451J468m125M160k269k439O09n3l698L390N372J286M142n447n130
11512b109O703J959M920k274R97k745q921m121M042P825N447m120q217N16L905
11497C807K816L49J616J492n35k211n196j875J889J708J041K893M968n393k102
11482E267L814j1305j96K296L031O347K729l359L165J090p913n48J280K104l004
11467D798n181M064l85R276R390L227l989L726j780l147l539J049l617K071K551
11452A8514L638j504j0578o243P534N595K312J440k275m482j309m582p404O134
11438F790M090K891M652L862k782m989j753m751j125r06L646L814l150N453n266
$$ plain form
11543 6861 6553 6973 13953 15226 11022 9919 6994 6925 2316 -2877 -3057 3064 9807 9228 5411 2076
11527 2076 625 2093 -2032 2128 -141 -2580 -1971 -2024 -5722 -2332 3040 4326 8468 3021 -2109
11512 -2109 4594 6553 11473 9199 10196 7451 -1470 -5591 -1549 6276 11723 7603 -614 -98 3807
11497 3807 6623 6972 8588 10080 9545 7334 2138 263 2152 3860 4901 7794 12762 7369 5267
11482 5267 9081 -2224 -2420 -124 2907 9254 11983 8624 11789 12879 4966 4418 5698 7802 4798
11467 4798 -383 3681 3296 12572 21962 25189 21200 24926 23146 19999 16460 17509 13892 15963 18514
11452 18514 22152 20648 10070 3827 11361 16956 19268 20708 18433 13951 12642 8060 656 6790
11438 6790 10880 13771 18423 22285 19503 14514 12761 8010 6885 5979 9625 13439 10289 15742 10476
11423A0476K441N248P17M061l297p206l481J0530j622k189k056N61k194j747J12
11408A0354m644l991n722l126O640R041j796p659J957K642J296P293J24j705j366
11393I338k63o095K660k507l669M385P078j96o252q70N669j418p27k384l716J232
11377B265O293J401n952K980R021J018J825o855l475n387n787K653N131M806L807
11362A3744N29K746k285p239r547m623L332J358Q85L955L840j809l484L66K290
11347D058m225j140M621M108K890o639J467K342J309O437L594r691o055m171l162
11332d257P83M924O193J2785J420r698k719O3M108l445m687k579L540M762j623
11317I570j739k387j877M30P286m240J77N809J981l224n831n173Q0K371J509n921
$$ plain form
11423 10476 12917 18165 18882 22943 19646 12440 8959 19489 17867 15678 13622 14183 11989 10242 10354
11408 10354 5710 1719 -4003 -7129 -489 8552 6756 -903 1054 3696 4992 12285 12409 10704 9338
11393 9338 9075 2980 5640 3133 -536 3849 10927 10731 4479 3609 9278 7860 7133 4749 1033 2265
11377 2265 8558 9959 4007 6987 16008 17026 18851 11996 8521 3134 -2653 0 5131 9937 13744
11362 13744 14273 17019 14734 7495 -2052 -6675 -3343 -1985 -1100 2855 6695 4886 1402 1768 4058
11347 4058 -167 -1307 3314 7422 10312 3673 5140 7482 8791 15228 18822 9131 3076 -1095 -4257
11332 -4257 -3474 1450 7643 20428 21848 12150 9431 9494 13602 10157 5470 2891 6431 11193 9570
11317 9570 7831 5444 3567 3997 11283 7043 7220 13029 15010 11786 5955 782 862 3233 4742 -1179
11301a179L95J864M596R481j60o6m530O098j853q245o013m936N592O965L843l935
11285G917q191K197j74k488K492M060l722J462M50L209K899L90J888k207r787
11270C95m023R756N405m840L169J97p411k802J215J839O80R085J447k322q028
11255C762j191n91n178K827M20O776L157m000m727k475p01n90m545m86P021J268
11239G47q2j919o1K592K869P289N934N910l116k423m444p792k784M644M829P704
11223A9897N27o580m696j43j687J442k646j522N436K237J822L61j231j166p774
11208D277O412J0671m722o604j0472l996R425P206K173o901N116m70k563K083
11194A1635M659P339j464q208k913k441L593K352L093k191n210l837l435n319
$$ plain form
11301 -1179 -784 1080 5676 15157 14997 14931 10401 16499 14646 6401 388 -4548 1044 8009 11852 7917
11285 7917 -274 1923 1749 -739 1753 5813 2091 3553 4003 7212 10111 10501 12389 10182 395
11270 395 -3628 6128 11533 6693 9862 10059 2648 -154 1061 2900 3580 12665 14112 11790 3762
11255 3762 2571 1980 -3198 -371 49 6825 9982 5982 1255 -1220 -1921 -2511 -7056 -7542 -521 747
11239 747 665 -1254 -1315 1277 4146 11435 17369 23279 20163 17740 13296 5504 2720 7364 12193 19897
11223 19897 20424 13844 9148 9005 7318 8760 6114 4592 10028 12265 14087 14448 13217 12051 4277
11208 4277 10689 21360 16638 10034 -438 -4434 4991 12197 14370 7469 12585 12115 9552 11635
11194 11635 16294 23633 22169 13961 11048 8607 12200 14552 17645 15454 10244 6407 2972 -2347
11180b347N446m47K551l932L865M64N967K619k907k657o932K858Q316O905M96
11165B0265m146m685L678M968o65l463n796j485K638L711K595Q054k143p646m134
11150A1746l137j663M46k940l877k943L677M430J114o544K78q83l48M677M587
11135H620J798J72L056j151J066j153J298o25o082l073O881K399l095k727O371
11120A3755k716m471p21N13l267q40Q807J171J592n7o897j443m279L459M454K11
11104I271k840L944m125M266Q891n70j907J05k945K717N110m103n133L580P024
11089B3285n967j47k142p757J860K891P759p6l517p035k369p20k281M695K282
11074A0761k438L161L235p39j0112q978L416J457j599K242N659K772p22J768K158
$$ plain form
11180 -2347 3099 2652 5203 1271 5136 5600 11567 14186 11279 8622 1690 4548 12864 19769 20265
11165 20265 16119 11434 15112 20080 19415 15952 10156 8671 11309 15020 17615 25669 23526 15880 11746
11150 11746 8609 6946 7392 4452 575 -2368 1309 5739 6853 309 587 -296 -644 4033 8620
11135 8620 10418 10590 13646 12495 13561 12408 13706 13081 6999 3926 10807 13206 10111 7384 13755
11120 13755 11039 6568 5847 6360 3093 2253 11060 12231 13823 13766 6869 5426 1147 4606 9060 9271
11104 9271 6431 10375 6250 10516 19407 18837 16930 17035 14090 16807 21917 17814 12681 16261 23285
11089 23285 17318 17171 15029 7272 9132 12023 19782 19706 16189 9154 6785 6065 3784 8479 10761
11074 10761 8323 11484 14719 13980 3868 -5110 -1694 -237 -1836 406 6065 8837 8115 9883 12041
11059A2041j790N924R89J15n682L318r70P055J0321K62k093k043N659j50J499
11044C4455J0311J7265J2031K8982N3343M8054L7404L1311L1204O1310O6720K3722
11032D56112k1733l4271j3611j8100l9168n3615n3776m7124l3423l2205k7972
11021H1114k1030j4610p027q975m267j495o981n870L493O65j161m732m744n91
11007C789K902M15m412L687J145l534J402K631J471p313o953l083n45K38P87R899
10991B526L954K204k18o06m843j0066L818m78J561L737l342k93P33K851k012K878
10975B404L249j914N305P213J712o389q760o059o342L319J941l144N347o776l322
10960a2216N441l21K275jk080l510m846k796K271Q454M998n307N188P83M04p21
$$ plain form
11059 12041 10251 16175 17164 17279 11597 14915 13945 21000 31321 31583 29490 27447 33106 32956 34455
11044 34455 44766 62031 74062 103044 156387 204441 241845 273156 304360 365670 432390 456112
11032 456112 434379 400108 386497 368397 329229 275614 221838 174714 141291 109086 81114
11021 81114 60084 45474 38447 29472 25205 23710 16729 10859 14352 15017 13856 9124 4380 3789
11007 3789 6691 7106 2694 6381 7526 3992 5394 8025 9496 2183 -4770 -7853 -8398 -8160 -7373 2526
10991 2526 6480 8684 8466 7860 3017 -7049 -3231 -3709 -2148 1589 -1753 -2046 -1313 1538 -474 2404
10975 2404 5653 3739 9044 16257 17969 11580 2820 -3239 -9581 -6262 -4321 -7465 -2118 -8894 -12216
10960 -12216 -6775 -7096 -4821 -4822 -6902 -10412 -15258 -18054 -15783 -7329 -2331 -7638 -2450 -1667 -1263 -1984
10944a984j127K108L934j09l779N962j063r69P713O143m954l433n145n517J966
10929b54N077L811J017r40l937K166o338J097L23j707o763l374J0625L146r475
10914e526m986j709K292M860K366L299J216l331k364J218N640k468o766l825M298
10899e786K403J554k642m240J632N127J455p155j699K111P98l94J084p53J409
10884e096L353k04j993j53j030K622P277N882n383m547J169l222k127K253K476
10869A277j0803J338P576R184r23n516j804M301M53q508n569o246K218Q530L729
10854g63O255j697p41n051k154j870l759M971l821o088j087M351J658K663j413
10839h546J333j497m928L111K246M743K86j469K442j060L338J449q625R740M914
$$ plain form
10944 -1984 -3111 -1003 2931 2822 -957 5005 3942 2973 10686 16829 11875 8442 3297 -2220 -254
10929 -254 4823 8634 9651 8711 4774 6940 602 1699 2022 315 -6448 -9822 803 3949 -5526
10914 -5526 -10512 -12221 -9929 -5069 -2703 596 1812 -1519 -3883 -2665 2975 507 -6259 -10084 -5786
10899 -5786 -3383 -1829 -4471 -8711 -7079 -1952 -497 -7652 -9351 -7240 -6442 -6836 -5752 -6505 -5096
10884 -5096 -1743 -1947 -3940 -4093 -5123 -2501 4776 10658 5275 728 1897 -1325 -3452 -1199 1277
10869 1277 -9526 -8188 -612 8572 7649 2133 329 4630 5083 -3425 -8994 -15240 -13022 -4492 -763
10854 -763 5492 3795 3054 -1997 -4151 -6021 -9780 -4809 -8630 -14718 -15805 -11454 -9796 -7133 -8546
10839 -8546 -7213 -8710 -13638 -10527 -8281 -3538 -3252 -4721 -2279 -3339 -1 1448 -7177 2563 7477
10824G477l29l809j0674l092P413m432K107O601P688k077m290m178o053m72L277
10809d843L702j995J845L066j320L86R406K526o077k847o817j898j585k750J451
10794g750P556L877l439l562K298k720J328K661k333k121O258L4L454j014M350
10779H877J037J798q24l395l256l791j493k651J151L968j78l713j960K029n801
10764h202n141O858J965j801j995J69K020l960j881Q76N730P362J024q386j1751
10749a7113j114R86Q02N079j668Q158L881L474K565N611o163r366L08J403m058
10734g215k528P568Q018R735L316k416p813o616l615l539k220Q88m020n395N368
10719a0484K031J612P046J993N001P85j506j962M905l373m444K728N650j0431
$$ plain form
10824 7477 7148 3339 -7335 -10427 -3014 -7446 -5339 1262 8950 6873 2583 -1595 -7648 -8120 -4843
10809 -4843 -1141 -3136 -1291 1775 455 841 10247 12773 6696 3849 -2968 -4866 -6451 -9201 -7750
10794 -7750 -194 3683 244 -3318 -1020 -3740 -2412 249 -2084 -4205 2053 2087 5541 4527 8877
10779 8877 9914 11712 10888 7493 4237 446 -1047 -3698 -2547 1421 1243 -2470 -4430 -2401 -8202
10764 -8202 -13343 -6485 -4520 -6321 -8316 -8147 -6127 -10087 -11968 -11092 -5362 2000 3024 -5362 -17113
10749 -17113 -18227 -17241 -16439 -11360 -13028 -4870 -989 2485 5050 10661 4498 -4868 -4560 -3157 -7215
10734 -7215 -9743 -2175 5843 15578 18894 16478 8665 2049 -1566 -5105 -7325 -6437 -10457 -15852 -10484
10719 -10484 -8453 -6841 205 2198 7199 7984 6478 4516 9421 6048 1604 4332 9982 -449
10705d49k573L386K275Q98p190k801M66n496k08M702J571q89j176k723L377M047
10689b783j236N00k864N91j209K693O234N993K999l338j1221k471M334p88J183
10674a383P64k94L346Q20p177k564Q75P78O443N317O28P14m636p20j10j249j733
10657a81m204o349o96L129M406j583j0233j291M997M519L438j029J075K476O550
10642E024K238k763J606q776n756n126P85M637M912n40q47r8M760K337n968J44
10626c431L870N6p691R026j870n933K855N30m414m713m784O802M539r81j0174
10611a6313j689R84l92K284J074o187l25M571j814k215L474J0622N188R394k412
10596F244j044p544k24j718k694l462J331M090m369l59J786J984l476m124Q905
$$ plain form
10705 -449 -3022 364 2639 3537 -3653 -6454 -5988 -11484 -11692 -6990 -5419 -6308 -7484 -10207 -6830 -2783
10689 -2783 -4019 -3519 -6383 -5792 -7001 -4308 1926 7919 10918 7580 -3641 -6112 -1778 -2566 -1383
10674 -1383 -619 -913 2433 3253 -3924 -6488 -5613 -4835 1608 6925 7553 8267 3631 2911 2801 1552 -181
10657 -181 -4385 -10734 -11430 -8301 -3895 -5478 -15711 -17002 -12005 -7486 -4048 -5077 -4002 -1526 5024
10642 5024 7262 4499 6105 -2671 -8427 -13553 -12768 -8131 -3219 -3759 -4606 -4704 56 2393 -3575 -3431
10626 -3431 439 495 -7196 1830 -40 -5973 -3118 -2588 -7002 -11715 -16499 -9697 -5158 -6139 -16313
10611 -16313 -18002 -17018 -17410 -15126 -14052 -20239 -20564 -15993 -17807 -20022 -16548 -5926 -738 8656 6244
10596 6244 5200 -2344 -2568 -4286 -6980 -10442 -9111 -5021 -9390 -9749 -7963 -5979 -9455 -13579 -4674
10581d674P883p873o018n560j518P652O848k439m453N957J897k609M072M13K100
10566A678j604N24N570N19r753n258L966J647k173N219K824n872J60J396j0320
10551a1477q42K90K686J765O140L532M99L863p62p337r968k766j19N595o494O86
10535a4709J258j852j661K374K102R296k871j919N679j724o382l921k01j92l085
10520a7808k593O079J702n37p57k126k0N275K059O035M165j210j741n562m935
10505a1974K094P62j143N459m114q502J404J23n566K256L924N574o826n141L487
10490a8183N242p4K769N405L423k328O14p883k795Q12L46N289M822K841J760l541
10474a481l988j447j683L214j796j386O369m948k925M368J479K116J553M320p28
$$ plain form
10581 -4674 3209 -4664 -10682 -16242 -17760 -10108 -3260 -5699 -10152 -4195 -2298 -4907 -835 -422 1678
10566 1678 74 598 6168 6687 -3066 -8324 -4358 -2711 -4884 335 3159 -2713 -2553 -1157 -11477
10551 -11477 -12319 -12029 -9343 -7578 -1438 2094 2593 6456 5694 -1643 -11611 -14377 -14496 -8901 -15395 -14709
10535 -14709 -13451 -15303 -16964 -14590 -12488 -3192 -6063 -7982 -2303 -4027 -10409 -14330 -14531 -14723 -17808
10520 -17808 -20401 -14322 -12620 -13157 -13914 -16040 -16060 -10785 -8726 -2691 1474 264 -1477 -7039 -11974
10505 -11974 -9880 -9118 -10261 -4802 -8916 -17418 -16014 -15891 -21457 -19201 -15277 -9703 -16529 -21670 -18183
10490 -18183 -12941 -13015 -10246 -4841 -1418 -3746 -3132 -11015 -13810 -12998 -12652 -7363 -2541 300 2060 -1481
10474 -1481 -5469 -6916 -8599 -5385 -7181 -8567 -2198 -7146 -10071 -5703 -4224 -2108 -555 3765 3037
10459C037l266n305j527L401Q96m742J24N474J838m78M9o408m768r76l92k561
10443a5604k016nR288j281l741J679J78L383p98k0J37n810J442R061q32J00K870
10426a969J970l346j770k02J325k575K119m626o082R682J624j112k01Q76n81J797
10410c071M46l330r22J33M268M370L536k163o072M119J458o399j725L056k711
10395e007l893M369K354R38k571j1973n126P663Q094P899O341J725m430j3482
10381g099r578o050N298M758j121N607L60J666O034Q7L110N469O720m699n066
10366E496q09k985k816o947k987P507k064K760l118M367N377L130m919n184o67
10351c859M83O573K192k972n642J990O940L395M956N573M202N275M894l477L806
$$ plain form
10459 3037 -229 -5534 -7061 -3660 -2764 -7506 -7382 -1908 -70 -548 -499 -6907 -11675 -12651 -13043 -15604
10443 -15604 -17620 -17625 -8337 -9618 -13359 -11680 -11502 -8119 -8917 -8937 -8800 -14610 -13168 -4107 -4939 -4839 -1969
10426 -1969 1 -3345 -5115 -5317 -3992 -6567 -4448 -9074 -15156 -5474 -3850 -4962 -5163 -4287 -4868 -3071
10410 -3071 -2625 -5955 -6877 -6744 -2476 1894 5430 3267 -2805 1314 2772 -3627 -5352 -2296 -5007
10395 -5007 -8900 -4531 -2177 -1239 -3810 -15783 -20909 -13246 -5152 2747 9088 10813 6383 -7099
10381 -7099 -16677 -22727 -17429 -12671 -13792 -8185 -7825 -6159 -125 -38 3072 8541 15261 10562 5496
10366 5496 4687 1702 -1114 -8061 -11048 -3541 -5605 -2845 -5963 -1596 3781 6911 1992 -3192 -3859
10351 -3859 -3376 3197 5389 2417 -3225 -1235 5705 9100 14056 19629 23831 29106 34000 30523 34329
10336C4329O168M54j40l308k608k46o295k873m854p80l986n468L127m07r978p446
10320d311p584J955O229M714K678L782r30J122K086J639p591p64n454j519l970
10305g918m96n79l056K784R852L391L333L186N176N243M152P784L713P539J2530
10290E6634J5693R410L012J437O941K943m916p739j373o807j1154p71o242p824
10276D9244p186l066p826q917k913q345l248l252J88R87O412Q134M435M223K67
10261B9137P37J531j0767m554l956l100k398j055O08m215k506M973K676J019P247
10246A5377J22n525k230P743N122M243Q074O673M581L281P219O567M438n68r24
10231F4193n63n436p093j0572o206k976j315m203k373m372q813m285RM781O024
$$ plain form
10336 34329 40497 40951 40811 37503 34895 34649 28354 25481 20627 19847 15861 10393 13520 13113 3135 -4311
10320 -4311 -11895 -9940 -3711 1003 3681 7463 6533 7655 9741 11380 3789 3025 -2429 -3948 -7918
10305 -7918 -8414 -8993 -12049 -9265 587 3978 7311 10497 15673 20916 25068 32852 36565 44104 56634
10290 56634 72327 81737 84749 86186 93127 96070 91154 83415 82042 75235 64081 63310 57068 49244
10276 49244 42058 38992 31166 22249 19336 10991 7743 4491 4679 5666 12078 20212 24647 28870 29137
10261 29137 29874 31405 20638 16084 12128 9028 6630 5575 6183 1968 -538 4435 7111 8130 15377
10246 15377 15499 9974 7744 15487 20609 24852 32926 39599 44180 47461 54680 61247 65685 65117 64193
10231 64193 63630 58194 51101 40529 34323 31347 30032 25829 23456 19084 10271 5986 5995 10776 16800
10216A6800n03j681o16j984l99m512l743m4O732k17j971o295r113q52K207O121
10200g0L856k376l253P67M11k695j397M594j143j451j988J228K143J005N224j053
10184C802n329M15q698j951Q385K043R20N234K252p038m787j756L840q33l933
10169g434k413J544J022J095O150m329j223N505K730j285j008J751N83k445P998
10154H241Q50j922l441k244M021L296L469n346l204K303J636L330o547q65M2n75
10138C044k19J768m217n42L908M320K625K019j701J774K577p604p129R50L782
10123E355O413l80M1m467k901l403K693N975n137l509m846n97N767l126J169J591
10107F38r036n451L062N630M438L426N690p354n637N15K77K052N238k811m315
$$ plain form
10216 16800 16297 14616 14000 12016 11617 7105 3362 3318 10050 9833 7862 1567 -7546 -8398 -6191 -70
10200 -70 3786 1410 -1843 -1076 -665 -3360 -4757 -163 -1306 -2757 -4745 -3517 -1374 -369 4855 3802
10184 3802 -1527 -1112 -9810 -11761 -3376 -1333 -413 4821 7073 35 -4752 -6508 -2668 -3501 -7434
10169 -7434 -9847 -8303 -7281 -6186 -36 -4365 -5588 -83 2647 1362 354 2105 2688 243 8241
10154 8241 9091 7169 3728 1484 5505 8801 12270 6924 3720 6023 7659 10989 4442 3577 3619 3044
10138 3044 2825 4593 376 -166 3742 8062 10687 12706 11005 12779 15356 7752 623 1573 5355
10123 5355 11768 11388 11429 6962 4061 658 3351 9326 4189 680 -4166 -4763 1004 -2122 -953 638
10107 638 -8398 -13849 -10787 -5157 -719 2707 8397 1043 -4594 -4079 -3802 -1750 3488 677 -3638
10092c638Q49p25Q952K231q5j719j978k586K521L429p18o237j344N307N959j939
10076H279j0675o655L855N702m03k314r52o989j531O183J099J627k089K75Q820
10061D232M34j171l413L03p780k141K04J313L12N194K662L330J57L175N79l741
10045C649n464N88k523l515Q129O683k184l165k210L517K284O39l287l922j143
10030a924J898K747k336k002K019O046R65k597L256K566L424j368k95N50k822
10015A0127J199L360K193m473q041K809N711N46j485n535m502J129O46m178K652
10000B158L391Q835O348R10k506P46r8p256m137L559M720p395m99M152j601N732
9984A7059L733K530r06n539n034L867K039J687R421p55Q905N065o517r833o871
$$ plain form
10092 -3638 -2789 -3514 5438 7669 7584 5865 3887 1301 3822 7251 6533 296 -1048 4259 10218 8279
10076 8279 -2396 -9051 -5196 506 103 -2211 -3163 -10152 -11683 -5500 -4401 -2774 -4863 -4588 4232
10061 4232 4666 3495 82 385 -7395 -9536 -9332 -8019 -7707 -2513 149 3479 3636 6811 7390 3649
10045 3649 -1815 -1227 -3750 -7265 864 7547 5363 2198 -12 3505 5789 6428 3141 -781 -1924
10030 -1924 -26 2721 385 -1617 402 6448 7413 4816 8072 10638 14062 12694 12399 12949 10127
10015 10127 11326 14686 16879 12406 4365 7174 12885 13431 11946 6411 1909 3038 3684 -494 2158
10000 2158 5549 14384 20732 21642 19136 19882 19784 12528 8391 11950 16670 9275 8776 12928 11327 17059
9984 17059 20792 23322 22416 16877 11843 15710 17749 19436 28857 28102 37007 42072 35555 25722 18851
9969A8851j489l54l883P38K202N146j649m413M678o48n740N65J483O706J237K632
9953B6062k106k746k898O031L534l869l834o58n549l442R208M773o419M3M951
9938B3081J258M333K931K911J658n600J138K528M744M296l959j477K063j341L36
9923C8900n057m836M25K444J857J33K80p700j920j697J0341Q461M339j396M373
9908D8947k819q718nP150R45k958K240K347l400j583J523M711K375k99K71k01
9892E0526O615O371K985m502m903j003O508J0454L863p504O54R320M944J378L228
9877H8934K948n716J162l830j361O439P965O532o093m510k78K005J5711Q486R807
9862A28201j785m464n056M555Q356O35P981P993L063O311J5336J6406J8048J2991
$$ plain form
9969 18851 17362 17008 13125 13863 16065 21211 19562 15149 19827 19179 13439 14004 15487 22193 23430 26062
9953 26062 23956 21210 18312 24343 27877 24008 20174 19516 13967 10525 19733 24506 18087 18130 23081
9938 23081 24339 28672 31603 34514 36172 30572 31710 34238 38982 43278 39319 37842 39905 38564 38900
9923 38900 33843 29007 29432 31876 33733 33866 34146 26446 24526 22829 33170 41631 45970 44574 48947
9908 48947 46128 37410 37405 44555 45500 42542 44782 47129 43729 42146 43669 48380 50755 50456 50727 50526
9892 50526 57141 63512 66497 61995 57092 56089 62597 73051 76914 69410 70064 79384 84328 85706 88934
9877 88934 91882 86166 87328 83498 82137 88576 96541 103073 96980 92470 92192 94197 109908 118394 128201
9862 128201 126416 121952 116896 121451 129807 130442 138423 146416 149479 155790 171126 187532 205580 218571
9848B18571k583n918l840L455p529o478l187J279K701K500M770J0180R854M952
9834B28727M992K694O059L899P720P386K616P807M759O138Q922Q634Q036N938
9820C14327R330J2370Q427P023P752J6464R688J0288J5420J8652J3841J4915J9179
9807D77676K1976J8221R761J7365K5644J9857K1669K6680K7274L3303L3233L1750
9795G64409K7578L6840L3351M1001M3359M6718N3507N5042N4329N8254N1976M4637
9783A311001M7597N1416N1907M7859N7855O5181O2361O4094O1196O2107O5250
9772A947824N9063O3051O1762O0359N6611N9763N4590N1858L6400K6812K4668
9761B502761J3547M383k129j3562j5765k5527l3264l3652m1419n0244n1061n4355
$$ plain form
9848 218571 215988 210070 206230 209685 202156 195678 192491 193770 196471 198971 203741 213921 223775 228727
9834 228727 233719 236413 242472 246371 254091 261477 264093 271900 276659 282797 291719 300353 308389 314327
9820 314327 323657 336027 344454 351477 359229 375693 385381 395669 411089 429741 443582 458497 477676
9807 477676 499652 517873 527634 544999 570643 590500 612169 638849 666123 699426 732659 764409
9795 764409 791987 828827 862178 903179 946538 993256 1046763 1101805 1156134 1214388 1266364 1311001
9783 1311001 1358598 1410014 1461921 1509780 1567635 1632816 1695177 1759271 1820467 1882574 1947824
9772 1947824 2006887 2069938 2131700 2192059 2248670 2308433 2363023 2414881 2451281 2478093 2502761
9761 2502761 2516308 2520691 2518562 2505000 2489235 2463708 2430444 2396792 2355373 2305129 2254068 2199713
9749B199713n5071o8060o8201n3868n1872n7034o0162n3263m9381n8026o2110
9738A562665o3044n4759m5210m9861n3649n7413m7097m5121m2759l9226m3715
9727A020811l7531l3430m1751l7624l0353j8714j8785j8548j8139k2701k3259
9716G19976j8327k2987k7386k6233k5235k3774k2448k5994j9713j4070q113j8459
9704D67237j8621j4804r698j3382j0654o968p685j4900p751l655P87J434l487
9691C57853o7j817j0726o480m931j2691j2829q049m730j1123l306j1375p648l753
9677B58328q321j4081j2440o836J646o383n170J242n614o116l790l696m564J503
9663A85708j613k886k399m853r135o670J085k51o137Q01M331o812l518o847r869
$$ plain form
9749 2199713 2144642 2076582 2008381 1954513 1902641 1845607 1785445 1732182 1682801 1624775 1562665
9738 1562665 1499621 1444862 1399652 1349791 1296142 1238729 1191632 1146511 1103752 1064526 1020811
9727 1020811 983280 949850 908099 870475 840122 821408 802623 784075 765936 743235 719976
9716 719976 701649 678662 651276 625043 599808 576034 553586 527592 507879 493809 485696 467237
9704 467237 448616 433812 424114 410732 400078 393110 385425 370525 362774 359119 359906 361340 357853
9691 357853 357786 355969 345243 338763 333832 321141 308312 300263 295533 284410 281104 269729 262081 258328
9677 258328 250007 235926 223486 216650 218296 211913 206743 207985 202371 196255 192465 188769 184205 185708
9663 185708 184095 181209 178810 173957 164822 158152 159237 158986 152849 153650 157981 151169 147651 140804 130935
9648A30935k484m610R59N797P32N665M483k954j176l854q091N96k858n616m175
9633A13349m650N28k538l181J000M637M34m19k362m382o460M001o786j137K797
9618I4831k056K738m59k702j155J751j775k936m924J693R62R4j563q391K81N00
9602G6889m135p121m025M203L907L098k963l029m935M204Q451J090m921j440l718
9587F5555n813J959N229k154o955j243j632n026K168k592j764l66N664N75k714
9572E0891J406k560L46L402m893R56j718J607l908k179k821Q11j312O346j047
9557D5327l247j731L827J243r004n419N532O381K684j166m068k190m08k318K168
9542C7611k943K12P076P99l057j519Q77r6N23k079M958m36n599k554M590j237
$$ plain form
9648 130935 128451 123841 124800 130597 131329 136994 141477 138523 137347 133493 125402 125998 123140 117524 113349
9633 113349 108699 109227 106689 103508 104508 109145 109579 109160 106798 102416 95956 99957 93171 92034 94831
9618 94831 92775 95513 95054 92352 91197 92948 91173 88237 83313 85006 85968 86062 84499 76108 76389 76889
9602 76889 72754 65633 61608 65811 69718 72816 69853 66824 61889 66093 74544 75634 70713 69273 65555
9587 65555 59742 61701 66930 64776 57821 56578 54946 49920 52088 49496 47732 47366 53030 53605 50891
9572 50891 52297 49737 50083 53485 48592 49548 47830 49437 45529 43350 40529 41340 40028 46374 45327
9557 45327 42080 40349 44176 45419 36415 30996 36528 42909 45593 44427 40359 38169 37761 35443 37611
9542 37611 34668 34880 41956 42755 39698 38179 39056 38960 39483 37404 42362 41926 36327 33773 38363 37126
9526C7126P20J209k796n32j727K94j547N270J577q427j407k112k208l977P39k152
9510B0050j513n24O388P642K115K35m012J900m991n631J99J3442Q79n918q6K175
9494C2350j563q1j098k766r432l252O480M712j716n589J217M536o37N064M532
9479C2757N490q048k747n4l448l529r99K065L354o98l447L2O309M27k528p2Q75
9462B5739m902m012L39N291J93N764n33n799r460l252J101J109l549M893N628
9447A8550O326N312p35n887n541l101K430n20j390K595J261J270j162J067l078
9432A7397n32M143K414J363j135K143K285l68M84o592k385K131l366l389J26l950
9416A0769k381r58K12J431K944O518K042p655m816j225k96m173Q43N469L828J763
$$ plain form
9526 37126 37846 39055 36259 35727 34000 34294 32747 38017 39594 31167 29760 27648 25440 21463 22202 20050
9510 20050 18537 18013 24401 32043 34158 34393 30381 32281 27290 21659 21858 35300 36179 30261 30175 32350
9494 32350 30787 30706 29608 26842 17410 14158 20638 25350 23634 18045 19262 23798 23161 28225 32757
9479 32757 38247 30199 27452 27398 23950 20421 19422 21487 24841 24143 20696 20728 27037 27464 24936 24864 25739
9462 25739 20837 16825 17164 22455 22648 28412 27879 22080 12620 9368 10469 11578 8029 12922 18550
9447 18550 24876 30188 29453 23566 18025 14924 17354 16834 15444 18039 19300 20570 19408 20475 17397
9432 17397 16865 21008 23422 24785 23650 25793 28078 27710 28194 21602 19217 21348 17982 14593 14719 10769
9416 10769 8388 7430 7642 9073 12017 18535 20577 12922 8106 6881 6585 2412 3255 8724 12552 14315
9400A4315l806l442J793R404n49M195n99M171k751R02j534o268l087l145K414
9385A2013N248N579l2l615J857L565l484k122m295j853j947p554j0920N237O321
9370C998j224M965K592j169n89R00q92j267o775K552M429R43q123m524J832M540
9354B188P843n90m099p17O041M726k635P72L152J433j863k474n854k472k880J644
9338D215P450Q272k898k759n857m266M154K374j070o01K588l241l744q68R77O274
9322A1000L833k058P55q693o847Q34M509L770n085K630K886k699o051l613k074
9307f903P56k22K122M98K137K624j950L36K810O776N324o244o129J450J370l519
9291A236l423J060J528O947N091R66o676J833k306p64N867l010J108N190N45o617
$$ plain form
9400 14315 10509 7067 8860 18264 17715 21910 21311 25482 22731 23633 22099 15831 12744 9599 12013
9385 12013 17261 22840 22808 19193 21050 24615 21131 19009 14714 12861 10914 3360 -7560 -2323 3998
9370 3998 2774 7739 10331 9162 8573 9473 8581 7314 539 3091 7520 8463 340 -4184 -2352 2188
9354 2188 10031 9441 5342 4625 10666 15392 12757 13529 16681 18114 16251 13777 7923 5451 2571 4215
9338 4215 11665 19937 17039 14280 8423 4157 8311 10685 9615 9014 11602 8361 4617 3749 4726 11000
9322 11000 14833 12775 13530 4837 -2010 -1176 3333 7103 2018 4648 7534 4835 -1216 -4829 -6903
9307 -6903 -6147 -6369 -4247 -3749 -1612 1012 -938 -602 2208 8984 14308 8064 1935 3385 4755 1236
9291 1236 -2187 -1127 401 7348 12439 13405 6729 8562 6256 5492 11359 8349 9457 14647 15192 8575
9275H575K056j583m943K142J992j286J058M777L481p032r528L775M320J533o66
9260H671J453q177l491l388j441M148Q805J0855N76m924j0383k011J562N113M477
9245A1845K816m809l811l725L990L431m66L750O978M448Q80m635m461o26M2l645
9229A2002p396M79N792J659j371m720Q00O45Q37P856J1812O349O534Q462m634
9214D5106p952m008l372j2876O1K48k026l206l646J988O587L588m628r469q752
9199b357l189M725K405L133K825l915J704R295N741o043k838j98K388m898l300
9184E478n17qN561j532N544J5553O032j197J386P306O876L479j1028q021n444
9169B9468n388j979n107p448m842j043J629L769O694k580o575J846M003M709K536
$$ plain form
9275 8575 10631 9048 4105 6247 8239 6953 8011 12788 16269 9237 -291 3484 7804 9337 8671
9260 8671 10124 1947 -1544 -4932 -6373 -2225 6580 17435 18011 13087 2704 693 2255 7368 11845
9245 11845 14661 9852 6041 2316 6306 9737 9271 13021 19999 24447 25327 20692 16231 15605 15647 12002
9229 12002 4606 5085 10877 12536 11165 6445 7245 7890 8727 16583 28395 34744 41278 49740 45106
9214 45106 37154 33146 29774 16898 16959 17207 15181 11975 8329 10317 16904 20492 15864 6395 -2357
9199 -2357 -5546 -821 1584 4717 7542 3627 5331 14626 20367 14324 11486 11288 13676 8778 5478
9184 5478 4961 4953 10514 8982 14526 30079 36111 34914 36300 43606 50482 53961 42933 34912 29468
9169 29468 24080 22101 16994 9546 4704 3661 5290 9059 15753 13173 6598 8444 12447 17156 19692
9154A9692n43p118p144l994k85L603J174L813N27J575k193M345O315P11k265p958
9138A0255j463L593K34l317K617K098L057p970m527Q97m705q29k52N534k82K004
9122F944J567l2j032n485k816m624k838K492N864N744J748m891j048k57L376j93
9106D519J078n232r578J547L235o727O62M211p47L444P379j739j016L916m070
9091H82o25N450j746l978P502l110R1N573P08n934k338j038N219L383j501k976
9075E562j748q7J447M475K40l032l735o657l099n33J514K833L184l154p700p518
9059a8008L772N946J880L526M708P207m956k923M361M2m766M54m545o552N668
9044d186N819K99P331n515q83j949q102j95M486L922L789o66J001M651m773j6716
$$ plain form
9154 19692 19149 12031 4887 893 608 4211 5385 9198 9725 11300 9107 13452 19767 20478 18213 10255
9138 10255 8792 12385 12619 9302 11919 14017 17074 9104 4577 5474 769 -60 -312 5222 4940 6944
9122 6944 8511 8479 7447 1962 -854 -5478 -8316 -5824 40 5784 7532 2641 1593 1336 4712 4519
9106 4519 5597 365 -9213 -7666 -4431 -11158 -10496 -6285 -7032 -3588 3791 2052 1036 4952 882
9091 882 257 5707 3961 -17 7485 4375 4466 10039 10747 4813 2475 1437 6656 10039 8538 5562
9075 5562 3814 3727 5174 9649 9889 6857 3122 -3535 -6634 -7167 -5653 -2820 364 -2790 -10490 -18008
9059 -18008 -14236 -8290 -6410 -2884 1824 9031 4075 1152 5513 5555 789 1243 -3302 -9854 -4186
9044 -4186 1633 1932 9263 3748 2865 916 -7186 -7381 -2895 1027 4816 4150 5151 9802 5029 -11687
9028a1687l405J1336J2062J457j139M447k607o672n189j802k15Q080M291O431
9014A5388m543j1103K236J940Q76l787Q01K259l03L951J696o170J164l319k810
8999a724L905M210k603K14J061k678j261M013K883M74P99l34K242K406m036k590
8983F981j215o538p295O204M667R07L810K317L096q11k898l823p939n962M76Q773
8967G50L577p014l454N995O250L403n549p408J0210j134p627n299n805M759J0414
8952B068O471j227o901L088K226K102n020r876J688O973L452M447j218n382k843
8937D8L254K998n121l255j147j56M246L809L51p17J44J054m139J447n431n257
8921g872O679l26Q34K986J394m491n113K596R362j963l164q594l070L476N194
$$ plain form
9028 -11687 -15092 -3756 8306 9763 8624 13071 10464 3792 -1397 -3199 -3414 4666 8957 15388
9014 15388 10845 -258 1978 3918 4794 1007 1808 4067 3764 7715 9411 3241 4405 1086 -1724
8999 -1724 2181 6391 3788 4002 5063 2385 1124 5137 8020 8494 9293 8959 11201 13607 9571 6981
8983 6981 5766 -772 -8067 -1863 2804 3711 7521 9838 12934 12123 9225 5402 -2537 -8499 -8023 750
8967 750 4327 -2687 -6141 -146 6104 9507 3958 -3450 6760 5626 -2001 -7300 -13105 -8346 2068
8952 2068 8539 7312 411 3499 5725 7827 2807 -7069 -5381 1592 5044 9491 8273 2891 48
8937 48 3302 6300 1179 -2076 -3223 -3379 867 4676 5027 4310 4454 5508 1369 2816 -2615 -7872
8921 -7872 -1193 -1519 -685 2301 3695 -796 -5909 -3313 6049 4086 922 -7672 -10742 -7266 -2072
8906b072K873k655O461O328l378l401k672n535j873K148L448l098m562K518P944
8891B474N68M345N830M192l282n021q48k152J42K135k862m982l368m825k039N481
8875d212j850k327N236O878O190N997n120q602o016n64N912J246j74j459n99k769
8859b233K936j760m773R15M416O104R83m733j562l116k769N646n60N46J476k57
8843A259K269J802j393k859J111O407L749k80o33K586j667r98o614p795K33P544
8827D721J419k73o39K234P47q2N69J823L658l118r711m930L34N113j216o864j615
8810g830k582N902J4022N800q467n402L613L910o101J197J253j760J638j760j876
8795A557J259k875J986k437L270R388M044l46k637L398j965m208q577k430k275
$$ plain form
8906 -2072 801 -1854 4607 10935 7557 4156 1484 -4051 -5924 -3776 -328 -3426 -7988 -5470 2474
8891 2474 3042 7387 13217 17409 14127 9106 8258 6106 6248 8383 5521 539 -2829 -7654 -9693 -4212
8875 -4212 -6062 -8389 -3153 3725 9915 15912 10792 2190 -3826 -4390 1522 2768 2594 1135 536 -2233
8859 -2233 703 -1057 -5830 -4915 -499 5605 6588 1855 293 -2823 -5592 54 -506 40 1516 1259
8843 1259 3528 5330 3937 1078 2189 8596 12345 12065 11432 14018 12351 11353 4739 -3056 -2823 4721
8827 4721 6140 5867 5228 7462 8209 8127 8696 10519 14177 11059 1348 -3582 -3248 1865 649 -6215 -7830
8810 -7830 -10412 -4510 9512 15312 6845 1443 5056 8966 2865 4062 5315 3555 5193 3433 1557
8795 1557 2816 -59 1927 -510 2760 12148 16192 15846 13209 16607 14642 10434 1857 -573 -2848
8780b848J996L114O485K067M597J317L04l395j509Q11l468o323O787l78O997N188
8764B1742K925n804j652N23p63j2701l446L441j979O704j647L344j321P90M579
8749A4735K359p64K838l813l311J30N87K382j465m493N76L901K576j251p38l664
8733A0585o222K057M797K914p06n918m434k401n306l65M209J772L377M310O812
8718A5481l233L781K786j998K745m316j731o199N28l807m506k065N225j898R6
8703H89J872L765N74k303q71L780k063l934k30L398K957k379k667J527K189j433
8687E071k414K398J417k883N38J152q59j091N531J788l318k759m652L035j963
8672I91K149N136K569K422j730j374o77n27n010j569q621N24Q210K220l39N332
$$ plain form
8780 -2848 -852 2262 8747 10814 15411 16728 17032 13637 12128 12939 9471 3148 9935 9557 16554 21742
8764 21742 24667 18863 17211 17734 16971 4270 824 4265 2286 8990 7343 10687 9366 10156 14735
8749 14735 17094 16330 19168 15355 12044 12174 12761 15143 13678 9185 9761 13662 16238 14987 14249 10585
8733 10585 4363 6420 11217 14131 13425 7507 3073 672 -4634 -4999 -790 982 4359 8669 15481
8718 15481 12248 16029 18815 16817 19562 15246 13515 7316 7844 4037 -469 -2534 2691 793 889
8703 889 2761 6526 7100 4797 3926 7706 5643 1709 1479 4877 7834 5455 2788 4315 6504 5071
8687 5071 2657 5055 6472 3589 4127 5279 4420 3329 8860 10648 7330 4571 -81 2954 991
8672 991 3140 8276 10845 13267 11537 10163 9486 8959 3949 2380 -6241 -5717 2493 4713 4374 9706
8656I706K517L458J069m900o239M319K24n160K022L67J313o84L143J447J846L043
8640A7491J4l98l219J487L021N028J961p223l634P42J271n35l57J0848P907K618
8624C7022j0422p055n522l556j051K057O146j506k598N78N135N982L716l313m387
8609B1226k401p783n700o80L742k16j861N383N22k17l404O66L51M905O11P11Q38
8592A6693J384k127J977j159K597m847r3J641l777k171j817M731L102k891R68
8577A4211q888M459M421J0594M967o203n051J136m061O39k31j927j113n839q30
8562F284K265J1041K78j724r07j81K486m577k559k516r57l66P706Q532J742K993
8546B9540J943r712o518k946L397R30J43L941N776j910N47R326Q66N489N004j474
$$ plain form
8656 9706 12223 15681 16750 11850 5611 9930 10154 4994 7016 7383 8696 8012 11155 12602 14448 17491
8640 17491 17505 17107 13888 15375 18396 23424 25385 18162 14528 15270 16541 16006 15649 26497 34404 37022
8624 37022 26600 19545 14023 10467 9416 11473 17619 16113 13515 14093 19228 25210 28926 25613 21226
8609 21226 18825 11042 5342 4662 8404 8188 6327 11710 12232 12015 8611 9277 9628 14533 15144 15855 16693
8592 16693 18077 15950 17927 16768 19365 14518 14425 16066 12289 10118 8301 13032 16134 13243 14211
8577 14211 5323 9782 14203 24797 29764 23561 18510 19646 15585 16224 15993 14066 12953 7114 6284
8562 6284 8549 19590 19868 18144 17237 17056 19542 14965 12406 9890 8933 8567 16273 24805 26547 29540
8546 29540 31483 21771 15253 12307 15704 16634 16777 20718 26494 24584 25131 34457 35323 40812 45816 44342
8530D4342J333J942J04J417O271K546O579K480j750O629J0848K583N078l651q053
8515G8698n068l523j1404r042o802J878j309q796r640m421M01q953o853J291N45
8500G002M159J054L270n926m205L424O657O90n984m636j022K937K671k200J843
8485I734l25j596J910j333N332m445j070K940M15k238j785J867o19K392P035L563
8469B1777m912m401j155l904j261j372L077K320j569J956P647k969j595K979l686
8454A2932l938N379l52o384K656K802m554l480k891L203P192l483K97k870j0255
8439c746J457R410K389j092N600N03l394j0605K30N945K214l168o944j762L674
8424G11P514J2864J662k485Q126K743m818n159j161l244j119m084L685J860J51
$$ plain form
8530 44342 45675 47617 47721 49138 55409 57955 64534 67014 65264 71893 82741 85324 90402 86751 78698
8515 78698 73630 70107 58703 49661 42859 44737 43428 34632 24992 20571 20972 12019 5166 6457 7002
8500 7002 11161 12215 15485 9559 5354 8778 15435 16125 10141 5505 4483 7420 10091 7891 9734
8485 9734 9409 7813 9723 8390 13722 9277 8207 11147 11562 9324 7539 9406 8787 11179 18214 21777
8469 21777 16865 12464 11309 7405 6144 4772 7849 10169 8600 10556 18203 15234 13639 16618 12932
8454 12932 8994 14373 14021 7637 10293 13095 8541 5061 2170 5373 12565 9082 9379 6509 -3746
8439 -3746 -2289 7121 9510 8418 14018 14521 11127 522 752 6697 8911 5743 -1201 -2963 711
8424 711 8225 21089 22751 20266 28392 31135 26317 21158 19997 16753 15634 11550 15235 17095 17246
8409A7246N953L822j210l041m091k638q245m984J30l648l995n46N56K378K872
8394E59N557j763j149j023k7L803O006J075K335n506m419l43m552l492K746j064
8378a257L452L878Q184n7O804J195K279L880M350M040o780l829J0781O649K296
8363D5865N292J0386L715m321m144p215m398m703r551o918k927M099p06L812R131
8348C7417J132q464N305j4l430j267l971k199L039K196L013L170k22m745l677
8333B7283l354J97J224J896M778j559P125K04o153J255J810q46q15L263l204n870
8317B7234K848R020M377M862j044k812j013m436M146L095j0580o162J052m083
8303B6504n199j601j899M94n46J676N569j2641m62L630K883L570K575L922m649
$$ plain form
8409 17246 23199 27021 25811 22770 18679 16041 7796 2812 2942 -706 -4701 -5247 -4691 -2313 559
8394 559 6116 4353 3204 2181 2154 5957 11963 13038 15373 9867 5448 5105 553 -2939 -193 -1257
8378 -1257 2195 6073 14257 14200 21004 22199 24478 28358 32708 36748 29968 26139 36920 43569 45865
8363 45865 51157 61543 65258 60937 56793 49578 45180 40477 30926 24008 21081 25180 24474 28286 37417
8348 37417 38549 30085 35390 35376 31946 30679 26708 24509 27548 29744 32757 35927 35705 30960 27283
8333 27283 23929 24126 25350 27246 32024 30465 37590 37794 31641 32896 34706 33860 33045 36308 33104 27234
8317 27234 30082 39102 43479 48341 47297 44485 43472 39036 43182 46277 35697 29535 30587 26504
8303 26504 21305 19704 17805 18299 17753 19429 24998 12357 11895 15525 18408 21978 24553 28475 23826
8288B3826j2120r596N145J0463M414L295l544p714j1821j30L328k162k99K610
8274E695O983L827j044o463r290l940K161M022N097k881o962n266l703O973L890
8259i01K315J527k569j282j124j713K263O670R94K268o48q28l18M651l20p363
8243C622o893J094K437K955L799J436L823L502q46l654j0810J480M158k7K407
8228H483r7n299n078l961k008K798J828M070O82j566k639k718N69j708P128J233
8212A717j311k395R58Q39l057J985R96J77K773J579l57j047n100n851M32J457
8196f205M037K707N292P495N00q422p003m081N238L012K518K379L414n086J068
8181F863l053r0j0207j246K162N310L336l240l669J918L452j478P288k897p36
$$ plain form
8288 23826 11706 2110 7255 17718 22132 25427 21883 14169 2348 2218 5546 3384 3085 5695
8274 5695 12678 16505 15461 8998 -292 -4232 -2071 1951 7048 4167 -2795 -8061 -11764 -4791 -901
8259 -901 1414 2941 372 -910 -2034 -3747 -1484 5186 6180 8448 7800 6972 6654 11305 10985 3622
8243 3622 -3271 -2177 260 3215 7014 8450 12273 15775 14929 11275 465 1945 6103 6076 8483
8228 8483 8386 3087 -1991 -5952 -7960 -5162 -3334 736 1418 -148 -2787 -5505 -4936 -6644 484 1717
8212 1717 406 -1989 -1031 -192 -3249 -1264 -268 -91 2682 4261 3904 2857 -2243 -8094 -7662 -6205
8196 -6205 -2168 539 5831 13326 13826 5404 -1599 -5680 -442 2570 5088 7467 10881 5795 6863
8181 6863 3810 3720 -6487 -7733 -5571 -261 3075 -165 -3834 -1916 1536 58 7346 4449 3713
8166C713J438N792J261q951r196M491J0037l381p671J443J624n101p271L250N049
8151c473j659m380J103P041K002k906l601K742K309K781Q731m164l483L305m824
8136A524J227M048M891p59J578q23j139K257o023l724O693K919k702n161l66m464
8120b4o896m254J883O687M727o7q847l307K635M713M323N11j630l273m906N457
8104b268j917L387J0540m58q623r54q179o73L574O007k504J713K655o578r49O126
8088H99J525j662l48J535J504k912m394M737Q288m139K214r6m150k574l205J937
8072h41J29n796m249L482j394P95J760O496J1326m589j692j430L078k37K025k003
8056F860m547K309K36J128m524m869j840j460J197K492k112j33J55N543l723L738
$$ plain form
8166 3713 5151 10943 12204 3253 -5943 -1452 8585 5204 -2467 -1024 600 -4501 -11772 -8522 -3473
8151 -3473 -5132 -9512 -8409 -1368 634 -2272 -5873 -3131 -822 1959 10690 6526 3043 6348 1524
8136 1524 2751 6799 11690 10931 12509 11686 10547 12804 6781 3057 9750 12669 9967 4806 4440 -24
8120 -24 -6920 -11174 -9291 -2604 2123 2056 -6791 -10098 -7463 -2750 1573 2084 454 -2819 -7725 -2268
8104 -2268 -4185 -798 9742 9284 661 -293 -8472 -9145 -5571 436 -2068 -355 2300 -4278 -5227 899
8088 899 2424 762 414 1949 3453 541 -3853 884 9172 5033 7247 7151 3001 427 -2778 -841
8072 -841 -712 -6508 -10757 -7275 -8669 -7874 -6114 382 11708 7119 5427 3997 7075 6838 8863 6860
8056 6860 2313 4622 4858 5986 1462 -3407 -5247 -6707 -5510 -3018 -5130 -5263 -5108 435 -3288 450
8040D50P820J867K867O63P262k011q596r980K144K318K906M989n27J621j005J263
8024A4051q53J683q05j51J98J061N340m609n542p082n054M047M182O627J061m964
8008I190j892J447N556M377Q82j298j324J203j290l979k958O7N928P141P383J952
7992C2385J045k421q010l2J0869Q082j364o824o345q562q405m837n574J930M654
7977F591l136j387O002O139N166j710k985l676k090k74J378m641k044K809R763
7962A5905K166k391J43L43j225N067M094o208O456O40n708J482n414k26N442N025
7946B5591N515r06k489m880K039K562r49R74r749J292k10l578J114j090k418k202
7930A0616K798Q59k499J79J493Q677K839J567l293k550l995J226m078k737J929
$$ plain form
8040 450 8270 10137 13004 13667 20929 18918 10322 342 2486 4804 7710 12699 12172 13793 12788 14051
8024 14051 13198 14881 14076 13925 14123 15184 20524 15915 10373 3291 -1763 2284 6466 13093 14154 9190
8008 9190 7298 8745 14301 18678 19560 18262 16938 18141 16851 12872 9914 9981 15909 23050 30433 32385
7992 32385 33430 31009 22999 22967 33836 41918 40554 33730 27385 18823 10418 5581 7 1937 6591
7977 6591 3455 2068 8070 14209 19375 17665 14680 11004 8914 8640 10018 5377 3333 6142 15905
7962 15905 18071 15680 15823 16166 14941 20008 24102 17894 24350 24990 19282 20764 15350 15124 20566 25591
7946 25591 31106 30200 27711 22831 24870 27432 26483 27457 17708 19000 18790 15212 16326 15236 12818 10616
7930 10616 13414 14273 11774 11953 13446 22123 24962 26529 23236 20686 16691 17917 13839 11102 13031
7915A3031k881k690M342k114l064M53l37j993L096N572m44k519n987J850m973
7900A342K356M725L063n970m063M17J0149N713k933k04L810o36n58j86P03r937
7884G791J584J0070N264m101k407M934l638q894n386P488O08k911M047k235j038
7869A1176L93l010M662K384K232M416p582l004N479n10p593p342K342M889p776
7854A156k164M623P338L074Q88o080r9k909O051l881o845J999N654M48n693l463
7838I7m652j392N260R390R03K206l303j0353R46j005P246k449o500l033N836P96
7822go92L849j144n906N756J4772j194m249o402o082J609K527k338K859N959l106
7806F211m538N45Q750O116l881k335k111k993O735J994j795j056L097m006k375
$$ plain form
7915 13031 10150 7460 11802 9688 6624 7077 6740 4747 7843 13415 12971 10452 4465 6315 1342
7900 1342 3698 8423 11486 5516 1453 1870 12019 17732 14799 14595 18405 17769 17211 17025 17728 7791
7884 7791 9375 19445 24709 20608 18201 23135 19497 10603 5217 12705 13313 10402 14449 12214 11176
7869 11176 11569 8559 13221 15605 17837 22253 14671 11667 17146 16636 9043 1701 4043 8932 1156
7854 1156 -1008 3615 10953 14027 14915 8835 8736 5827 11878 7997 1152 3151 8805 9253 3560 97
7838 97 -4555 -5947 -687 8703 9606 11812 8509 -1844 -898 -1903 5343 2894 -3606 -6639 -803 -7
7822 -7 -699 3150 2006 -3900 1856 16628 15434 11185 4783 -1299 310 2837 499 3358 9317 6211
7806 6211 1673 2218 10968 17084 13203 10868 8757 5764 12499 14493 12698 11642 14739 10733 8358
7791H358j115R11j021l977l572l956l738l959J389K444m951M98N058J635N647
7776c49k139M57m885k047M549O162l725m168K750K10J0540Q140l982k776p437
7761A300p798O143N858k802p722M371L037m849L563K527K567L390o466l912m934
7746e727k160j958J217j11N00j768R93J544K955L981N656J809o94k546l347j230
7730h86p2O648J442o443j953k24O830j347q713N49O022N010j976M101K384k321
7714I051j3379k957L381M100M394n263n729o997j092N341n96o668M703Q080R656
7699F025O267J752n135n921p460L14Q240L500l258o287n572j710J921R79J823
7684d522J856j717J50l460J91J2446K398o727m173K668R96Q84j426l73k660l800
$$ plain form
7791 8358 7243 8154 7133 3156 -416 -4372 -8110 -12069 -10680 -8236 -13187 -12689 -7631 -5996 -349
7776 -349 -2488 -2031 -6916 -8963 -4414 1748 -1977 -6145 -3395 -3185 7355 15495 11513 8737 1300
7761 1300 -6498 -355 5503 2701 -5021 -650 2387 -2462 1101 3628 6195 9585 3119 -793 -5727
7746 -5727 -7887 -9845 -8628 -8739 -8239 -10007 -9014 -7470 -4515 -534 5122 6931 6237 3691 344 -886
7730 -886 -958 5690 7132 689 -1264 -1488 5342 3995 -4718 -4169 1853 6863 4887 8988 11372 9051
7714 9051 -4328 -7285 -3904 196 4590 -673 -6402 -13399 -14491 -9150 -9746 -16414 -11711 -3631 6025
7699 6025 12292 14044 8909 2988 -4472 -4158 4082 7582 4324 -1963 -7535 -9245 -7324 -6345 -4522
7684 -4522 -2666 -4383 -4233 -7693 -7502 4944 7342 615 -3558 -890 106 990 -436 -809 -3469 -7269
7668g269J322J233M326J399j031j590l129k660N682k087k777p38j733L256j843
7653g639r67r70k068j091m510Q405L018l578M145r37m474j541N608R152L518L089
7637I160l070n837k167k729o230J219K125L08O656K925o272l048o382J584Q89
7622a0869M524L343n676k91R21N158K494Q41M294j181m962o353o96L118N794J934
7606B393J887j450l557O84P557J73j048N156J19n651p040m993q38M551l07m268
7590f632O21j143R46M47j924N195L242o53p529o368K760N346k574l009J558J0100
7574C83j543n109J443K221P58K434L130K386p248q935p563M365N853K120n48N545
7558c08K973L722j270p175m660O58J4388j398k372n42r07j362l301j800M47K542
$$ plain form
7668 -7269 -5947 -4714 -388 1011 -20 -1610 -4739 -7399 -1717 -3804 -6581 -7319 -9052 -5796 -7639
7653 -7639 -8606 -9576 -11644 -12735 -17245 -8840 -5822 -9400 -5255 -6192 -10666 -12207 -6599 2553 6071 9160
7637 9160 6090 253 -1914 -4643 -10873 -9654 -7529 -7221 -565 2360 -3912 -6960 -13342 -11758 -10869
7622 -10869 -6345 -3002 -8678 -8969 -8048 -2890 -396 445 4739 3558 -1404 -7757 -8453 -5335 459 2393
7606 2393 4280 2830 -727 -43 7514 7687 6639 11795 11914 6263 -777 -5770 -6608 -2057 -2364 -6632
7590 -6632 -6011 -7154 -6208 -5761 -7685 -2490 752 99 -7430 -13798 -11038 -5692 -8266 -11275 -9717 383
7574 383 -1160 -6269 -4826 -2605 -1847 587 3717 6103 -1145 -10080 -17643 -13278 -7425 -5305 -5853 -308
7558 -308 2665 6387 5117 -2058 -6718 -6060 8328 6930 4558 4016 3109 1747 -1554 -3354 -2907 -365
7542c65K792L617J521L409K257r601q240N056J008j293M434Q75l574m094K789
7527E91l524K084M81L372K044k961m056K969l882o304j961j822l958O320J479
7512i128O584o3p81J055j499K230k474l414l923J488J400K769K602L125N992Q31
7496F794l645l307n979M259J648M587K556J244k831j832m157r281p248O08R774
7481f810J328L789n80n073l457M437N896k26m333K921L913l579k140K721k302
7466c495n380j39O138k50N572Q196P976j2080n315L411j601l523k306k504R69
7451d331k096O308N356M163q879k544P67k526J911P476L930r20L347J958l853
7436A0067O95m182l748J341o86l338j597O133O534k631l598k242j896m311O87
$$ plain form
7542 -365 2427 6044 7565 10974 13231 3630 -4610 446 1454 161 4595 5470 1896 -2198 591
7527 591 -2933 -849 -368 3004 5048 2087 -1969 1000 -2882 -9186 -11147 -12969 -16927 -10607 -9128
7512 -9128 -2544 -2607 -3388 -2333 -3832 -1602 -4076 -7490 -11413 -9925 -8525 -5756 -3154 -29 5963 6794
7496 6794 3149 -158 -6137 -1878 -230 4357 6913 8157 5326 3494 -663 -9944 -17192 -16584 -6810
7481 -6810 -5482 -1693 -2273 -7346 -10803 -6366 -470 -696 -5029 -2108 1805 -1774 -3914 -1193 -3495
7466 -3495 -8875 -9014 -2876 -3126 2446 10642 18618 6538 1223 4634 3033 -490 -2796 -5300 -4331
7451 -4331 -6427 -119 5237 9400 521 -2023 -1256 -3782 -1871 5605 9535 8615 11962 13920 10067
7436 10067 10762 6580 2832 4173 3487 149 -1448 4685 11219 8588 4990 2748 852 -3459 -2772
7421b772o90l414o6K749Q359r03l516m236P54L132M677K073n035k883K557K056
7405B842K506m57K356l312l179M243K972n808q079J083Q150J170N72J018J344
7390G421n707N48O237J004P70l26N117J98k294o247m326m759j561K987k883Q97
7374b924L995l570n354n595N855N138K965o32o106l847j88J193k693j559R124
7359d198N711m34K166p92l482n084m268j278J045Q68J24J803M877j815j617M676
7343a698k923P61p20o156r33N638J814N043k62l879L610L460M703l316o02J665
7327F205O012j074j833k577m998q021K305M605P053K465m873o979J993O56l138
7312b199K268J984J462m334p318k961M640M778j004L781J645l447p6K55k436k57
$$ plain form
7421 -2772 -3462 -6876 -6942 -4193 4166 3263 -253 -4489 -3735 -603 4074 6147 1112 -1771 786 2842
7405 2842 5348 4891 7247 3935 756 4999 7971 2163 -5916 -4833 3317 4487 5059 6077 7421
7390 7421 1714 2262 8499 9503 10273 9947 15064 15262 12968 6721 2395 -2364 -3925 -938 -3821 -2924
7374 -2924 1071 -2499 -7853 -13448 -7593 -2455 510 -122 -6228 -10075 -10263 -9070 -11763 -13322 -4198
7359 -4198 1513 1079 3245 2453 -1029 -6113 -10381 -11659 -10614 -9746 -9622 -7819 -2942 -4757 -6374 -1698
7343 -1698 -4621 -3860 -4580 -10736 -11669 -6031 -4217 826 564 -3315 295 3755 8458 5142 4540 6205
7327 6205 12217 11143 9310 6733 1735 -6286 -3981 624 7677 10142 5269 -1710 283 939 -2199
7312 -2199 69 2053 3515 -819 -8137 -11098 -6458 -1680 -2684 1097 2742 -705 -781 -526 -2962 -3219
7296c219L175K390m119j91p14O939N761K3m96o828K348J344o851o56J591M203
7280D700n53K12m844m688n834L22k609k48M814O290M708Q62N27j387k734j86J009
7263C61K808l437k767l46K357N994L183o555j187J738J244R58n136p455k615J660
7247i195J351P598J0202l258j164m370k06N518K562m735l529l49J979O373k420
7232F357n711L850l091n047n96j411k323n048Q07N608M922o88M863L47m300r482
7216a0943o994j665L056J699P20M245R847K53k27o374m084R98L466M192N698L757
7200G644J645Q28p041n84j596o481j1398r23M404J013p52l373K119J4857j112
7185g50o880k221J117O231O496m64n84p286R78k467l90L78l68p66k764n43J483
$$ plain form
7296 -3219 -44 2346 -1773 -1964 -2678 4261 10022 10045 9549 2721 5069 6413 -438 -1094 497 4700
7280 4700 4147 4359 -485 -5173 -11007 -10685 -13294 -13542 -8728 -2438 2270 3132 3659 2272 -462 -648 361
7263 361 3169 -268 -3035 -3381 -1024 4970 8153 1598 411 2149 3393 4351 -785 -8240 -10855 -9195
7247 -9195 -7844 -246 9956 6698 5534 1164 958 6476 9038 4303 774 425 2404 8777 6357
7232 6357 646 4496 1405 -3642 -4238 -5649 -7972 -13020 -12213 -6605 -1683 -2371 2492 2839 -1461 -10943
7216 -10943 -17937 -19602 -16546 -14847 -14127 -9882 -35 218 -9 -6383 -10467 -9469 -6003 -1811 3887 7644
7200 7644 9289 10117 3076 2492 896 -5585 -16983 -17906 -13502 -12489 -13241 -16614 -14495 362 -750
7185 -750 -7630 -9851 -8734 -2503 3993 3529 2945 -4341 -3363 -5830 -6220 -5842 -6210 -6976 -9740 -10283 -8800
7168h800Np49j435K907O805N576o224J282J597o950k783m88J093m95j146L482
7152f323K259K184j482p31O206L128p782o973N633P950J665J647K042n074m744
7137c95J371k636n311O37N43k95L110K40n067J608L908O236L078O031L155l561
7121A2652j1878l888k698k117J68P151m77m405n1m21r4p78M70r83k357M427m59
7104e738m885K158J53r79l94N297j960r46K876J214j549N916N33k903K426k224
7088a005k524m115K590j310j548M45L134M424m657r574J329P792N42J731o317
7073i063J083M510K421n70L97P30k848l824j751L322K594K207K753k719L17O55
7057B14J76N39m480k720N964J932n695L667o15l197j377N312J029L169M776k8
$$ plain form
7168 -8800 -8795 -9544 -10979 -8072 -1267 4309 -1915 -633 964 -5986 -8769 -9257 -8164 -8659 -9805 -6323
7152 -6323 -4064 -1880 -3362 -4093 2113 5241 -2541 -9514 -3881 4069 5734 7381 9423 4349 -395
7137 -395 976 -1660 -6971 -6334 -5791 -6086 -2976 -2736 -7803 -6195 -2287 3949 7027 13058 16213 12652
7121 12652 774 -3114 -5812 -7929 -7761 -610 -1087 -5492 -5543 -5964 -6058 -6836 -6366 -7349 -9706 -5279 -5738
7104 -5738 -10623 -8465 -8312 -9291 -9685 -4388 -6348 -7294 -4418 -3204 -4753 1163 1696 -1207 1219 -1005
7088 -1005 -3529 -7644 -5054 -6364 -7912 -7467 -4333 91 -4566 -14140 -12811 -5019 -4477 -2746 -9063
7073 -9063 -7980 -3470 -1049 -1619 -1222 -492 -3340 -7164 -8915 -5593 -2999 -792 1961 -758 -441 214
7057 214 390 929 -3551 -6271 -307 1625 -4070 -403 -1018 -4215 -5592 -280 749 3918 8694 8666
7041H666n326J946m50k053K723j267m26o356r161J619K696J546P951O300j814
7026F594j987j274j245l293K17O691P92o406r218j0201N265R101l75j68L599N394
7010C486K521l194k827n326J333N625M970m629O00M323l894p93p592K347K353
6995f97m192l433l293j50J887M113P556L721q83J714l752m386l086O57M559j161
6979h26k797Q09m221m052m035L340O669K477m555k997j674M638Q100O099O479
6964A3454o062o492r586q03L509k994j28J96N6l37P423L071n10O1m835k54K617
6947a614J858L958k140k799L480N873M147p573r432K552J0165L192m325p759k264
6932b681l679l683M750L191l429J374N217N957j357n394n147N15K727L8K48O24
$$ plain form
7041 8666 3340 5286 4836 2783 5506 4239 3813 -2543 -11704 -10085 -7389 -5843 2108 8408 6594
7026 6594 4607 3333 2088 -1205 -988 5703 6495 89 -9129 -19330 -14065 -4964 -5339 -5507 -1908 3486
7010 3486 6007 2813 -14 -5340 -4007 1618 6588 1959 2559 6882 2988 2195 -5397 -3050 -697
6995 -697 -4889 -8322 -11615 -11765 -9878 -5765 1791 5512 4629 6343 2591 -1795 -4881 -4224 335 -826
6979 -826 -3623 -2814 -7035 -11087 -15122 -11782 -5113 -2636 -7191 -10188 -11862 -7224 876 6975 13454
6964 13454 7392 900 -8686 -9489 -5980 -8974 -9102 -8906 -8850 -9187 -1764 1307 797 858 -3977 -4231 -1614
6947 -1614 244 4202 2062 -737 2743 8616 12763 5190 -4242 -1690 8475 11667 7342 -417 -2681
6932 -2681 -6360 -10043 -5293 -2102 -5531 -4157 1060 7017 5660 266 -4881 -4366 -1639 -1601 -1353 -729
6916g29r700m420N089N809j610l883j650K517J311K02l847P39M683P85l202J273
6900f633Q053k765n73K399M711M153j84o269l644L830l252l848n908J203j254
6885i981j680J02L27l910Q546O773K300M166k725q291j78K485J882p155L834K783
6869g22J807J919l48m534j345j344j459L665J203R95o564n954K394N251J529n928
6853i435m908j849K576p80N137N502M782o00q896r466N114R419J502K330j657
6838a229l031l816L18K699N32n86j123j326J049M093p096l028N465j607r55l569
6822a3210J85N838J115o253j565J799N014J778J547j853p371l940J400O592N228
6807c696J170n394j336j148J555L459R45k695l420k315N25k584J26L042j316o584
$$ plain form
6916 -729 -10429 -14849 -9760 -3951 -5561 -9444 -11094 -8577 -7266 -7064 -10911 -10172 -5489 -4704 -7906 -6633
6900 -6633 1420 -1345 -1918 481 5192 9345 9161 2892 -752 3078 -174 -4022 -9930 -8727 -9981
6885 -9981 -11661 -11559 -11232 -15142 -6596 177 2477 6643 3918 -4373 -4551 -2066 -184 -7339 -3505 -722
6869 -722 1085 3004 2656 -1878 -3223 -4567 -6026 -2361 -1158 -163 -6727 -12681 -10287 -5036 -3507 -9435
6853 -9435 -14343 -16192 -13616 -14396 -9259 -3757 1025 425 -8471 -17937 -12823 -3404 -1902 428 -1229
6838 -1229 -4260 -8076 -7758 -5059 -4527 -5113 -6236 -7562 -6513 -2420 -9516 -12544 -7079 -8686 -9641 -13210
6822 -13210 -13025 -7187 -6072 -12325 -13890 -12091 -7077 -5299 -3752 -5605 -12976 -16916 -15516 -8924 -3696
6807 -3696 -2526 -7920 -9256 -10404 -8849 -5390 -4445 -7140 -10560 -12875 -12350 -14934 -14808 -11766 -13082 -19666
6791a9666N604N836K591l645j562Q096M583p137q990R43N391R659M079l195k116
6776D71k314k354o96k216K231K236k896l087L702K852l45K888j790k139J372M787
6760B702n486m407K886K631n22Q78k834M867k756o293L378N888N207M335m77o136
6744C861K125K487J259m623n16l854m822l749l64l021O30L440N83J55m48j306
6728h163l787l193J14M989L426qO366k980m418l456K208m081l598m318P002K588
6712a1309J575K593l820Q46M711l825o414L54P501O6J312J349m932q19P860N478
6696B526j598m220J047o80o174n61M012p93k443O1K870P42j398K761K064l145
6680d929n378n293q57N393O357N674O921Q142K156n669p01n009M139l590m619
$$ plain form
6791 -19666 -14062 -8226 -5635 -9280 -10842 -2746 1837 -5300 -14290 -13347 -7956 1703 5782 2587 471
6776 471 -1843 -4197 -4893 -7109 -4878 -2642 -5538 -8625 -4923 -2071 -2416 472 -1318 -3457 -2085 2702
6760 2702 -2784 -7191 -4305 -1674 -2196 -1318 -4152 715 -2041 -8334 -4956 932 6139 10474 9997 3861
6744 3861 5986 8473 9732 5109 4593 739 -4083 -7832 -8196 -11217 -10587 -7147 -6564 -6409 -6857 -8163
6728 -8163 -11950 -15143 -15029 -10040 -6614 -6622 -256 -3236 -7654 -11110 -8902 -12983 -16581 -20899 -13897 -11309
6712 -11309 -9734 -7141 -10961 -10115 -5404 -9229 -15643 -15289 -7788 -7722 -6410 -5061 -9993 -10812 -2952 2526
6696 2526 928 -3292 -2245 -2925 -9099 -9660 -5648 -6441 -8884 -8823 -5953 -5211 -6609 -3848 -1784 -4929
6680 -4929 -10307 -15600 -16457 -11064 -4707 967 7888 16030 18186 12517 11816 6807 10946 7356 2737
6665B737n668l849J497r3J1437l178o815Q51J1045m90J427l72R973J3713J7378
6650D9593J8764K4512M5626N9042O8080O3514K4468k7033m3609m3325n0164m9906
6638A39562l9596l2141k2268q284J876j0377r548l446K049k093l508r9j753J448
6624A1822R84J062K392K096M795J226r995p131j650j002m067K994M852M42q14
6609H006K35j698L391L260O73l66n517j110J329o415k944K240k470J860P80l536
6593b282J271K098j787J355k089k858J677l132K063Q969j837q137j246M073J167
6578f95p673m09K242M834j923l76M554m98r752j381J1392J67l525m957Q53M967
6562b180q068J391L668M420j477k301M086j995J992K331J400N875r367j4898n034
$$ plain form
6665 2737 -2931 -6780 -5283 -5376 6061 2883 -3932 -3081 7964 7474 8901 8529 18502 32215 49593
6650 49593 68357 92869 138495 197537 265617 329131 353599 326566 282957 239632 189468 139562
6638 139562 99966 67825 45557 37273 39149 28772 19224 15778 17827 15734 12226 12127 10374 11822
6624 11822 12806 13868 16260 18356 23151 24377 14382 7251 5601 4599 532 3526 8378 8820 8006
6609 8006 8241 6543 9934 13194 13867 13501 7984 6874 8203 1788 -1156 1084 -1386 474 1254 -2282
6593 -2282 -1011 1087 -700 655 -1434 -4292 -2615 -5747 -3684 5285 3448 -4689 -5935 -1862 -695
6578 -695 -8368 -8777 -6535 -1701 -3624 -4000 554 56 -9696 -11077 315 482 -3043 -8000 -7147 -2180
6562 -2180 -10248 -8857 -5189 -769 -2246 -4547 -461 -2456 -464 1867 3267 9142 -225 -15123 -20157
6547b0157N703P67N490P309j460n437J305k179m501P95P289J397j743L34J070
6532d018L468j920k462n029K227M275M104L298J405k15m42k800k926m745P320
6517A540O668l14J717k634j491j192J196K106l089l416m354n628k903l456L576
$$ plain form
6547 -20157 -14454 -13687 -8197 -888 -2348 -7785 -6480 -8659 -13160 -12365 -5076 -3679 -5422 -5088 -4018
6532 -4018 -550 -2470 -4932 -9961 -7734 -3459 645 3943 5348 5133 4691 1891 -1035 -5780 1540
6517 1540 8208 7894 9611 6977 5486 4294 5490 7596 4507 1091 -3263 -8891 -11794 -15250 -11674
$$ [...]
##END NTUPLES=NMR SPECTRUM
##END=
