##TITLE=Analysis number 318295
Compound Code mo 00094
Project Code adrs
Chemist Name ugmt
##JCAMPDX= 6.0         $$ Bruker NMR JCAMP-DX V2.0
##DATA TYPE= NMR SPECTRUM
##DATA CLASS= NTUPLES
##ORIGIN= Bruker BioSpin GmbH
##OWNER= nmr
$$ XWIN-NMR		Version 3.5
$$ Thu Mar 23 07:33:00 2006 GMT Standard Time (UT+0h)  MAYBRIDGE\nmr@NMR_250MHZ
##.OBSERVE FREQUENCY= 250.131544655141
##.OBSERVE NUCLEUS= ^1H
##.ACQUISITION MODE= SIMULTANEOUS (DQD)
##.ACQUISITION SCHEME= undefined
##.AVERAGES= 16
##.DIGITISER RES= 18
##SPECTROMETER/DATA SYSTEM= dpx250
##.PULSE SEQUENCE= zg30
##.SOLVENT NAME= CDCl3
##.SHIFT REFERENCE= (INTERNAL, CDCl3, 0, 16.522)
##AUDIT TRAIL= $$ (NUMBER, WHEN, WHO, WHERE, WHAT)
$$ ##TITLE= Audit trail, XWIN-NMR		Version 3.5
$$ ##JCAMPDX= 5.01
$$ ##ORIGIN= Bruker BioSpin GmbH
$$ ##OWNER= nmr
$$ C:\u/data/dgb/nmr/ADRS/1250/pdata/1/auditp.txt
$$ ##AUDIT TRAIL=  $$ (NUMBER, WHEN, WHO, WHERE, WHAT)
(   1,<2006-03-23 07:32:29.91 +000>,<MAYBRIDGE\nmr>,<NMR_250MHZ>,
      <created by zg, POWCHK disabled, PULCHK disabled
       configuration hash MD5:
       84 BC 41 DB A1 6E 1D 46 DA 25 12 A5 C1 ED C5 3A
       data hash MD5: 64K
       C2 50 37 AB E3 64 6A B4 9F 46 2A 8F E9 2D 91 46>)
(   2,<2006-03-23 07:32:50.01 +000>,<MAYBRIDGE\nmr>,<NMR_250MHZ>,
      <Start of raw data processing
       ef LB = 0.3 FT_mod = 6 PKNL = 1 SI = 32K 
       data hash MD5: 32K
       27 A4 6C A2 60 5B 6D 34 E5 AA 6F 78 2C AE 22 B2>)
(   3,<2006-03-23 07:32:51.54 +000>,<MAYBRIDGE\nmr>,<NMR_250MHZ>,
      <apk 
       data hash MD5: 32K
       27 75 79 4B 68 DF 85 78 18 7F 52 B8 9A 11 B1 D8>)
(   4,<2006-03-23 07:32:52.32 +000>,<MAYBRIDGE\nmr>,<NMR_250MHZ>,
      <abs ABSG = 5 
       data hash MD5: 32K
       7A B2 40 5E 81 BB 3A FC 67 26 69 90 96 56 0D 46>)
$$ ##END=
$$ 
$$ hash MD5
$$ 63 52 4B BF 81 D9 D2 8F 6D E7 E9 D5 9B 2F 92 26
##$RELAX= 
##$RELAX= 
##$RELAX= 
##$RELAX= 
##$RELAX= 
##$RELAX= 
##$RELAX= 
$$ Bruker specific parameters
$$ --------------------------
##$DU= <C:\u>
##$EXPNO= 1250
##$NAME= <ADRS>
##$PROCNO= 1
##$TYPE= <nmr>
##$USER= <dgb>
##$AMP= (0..31)
100 100 100 100 100 100 100 100 100 100 100 100 100 100 100 100 100 100 
100 100 100 100 100 100 100 100 100 100 100 100 100 100 
##$AQSEQ= 0
##$AQ_mod= 3
##$AUNM= <au_zg>
##$AUTOPOS= <53 >
##$BF1= 250.13
##$BF2= 250.13
##$BF3= 250.13
##$BF4= 250.13
##$BF5= 500.13
##$BF6= 500.13
##$BF7= 500.13
##$BF8= 500.13
##$BYTORDA= 1
##$CFDGTYP= 0
##$CFRGTYP= 5
##$CHEMSTR= <none>
##$CNST= (0..31)
1 1 145 1 1 1 1 1 1 1 1 1 1 1 1 1 1 1 1 1 1 1 1 1 1 1 1 1 1 1 1 1 
##$CPDPRG= <>
##$CPDPRG1= <>
##$CPDPRG2= <>
##$CPDPRG3= <>
##$CPDPRG4= <mlev>
##$CPDPRG5= <mlev>
##$CPDPRG6= <mlev>
##$CPDPRG7= <mlev>
##$CPDPRG8= <mlev>
##$CPDPRGB= <>
##$CPDPRGT= <>
##$D= (0..31)
0 1 0 0 0 0 0 0 0 0.06 0 0 0 0 0 0 0.0002 0 0 0 0 0 0 0 0 0 0 0 0 0 0 
0 
##$DATE= 1143099149
##$DBL= (0..7)
120 120 120 120 120 120 120 120 
##$DBP= (0..7)
150 150 150 150 150 150 150 150 
##$DBP07= 0
##$DBPNAM0= <>
##$DBPNAM1= <>
##$DBPNAM2= <>
##$DBPNAM3= <>
$$ [...]
##$SUBNAM7= <"">
##$SUBNAM8= <"">
##$SUBNAM9= <"">
##$SW= 20.6930455092707
##$SWIBOX= (0..15)
0 0 3 0 0 0 0 0 0 0 0 0 0 0 0 0 
##$SW_h= 5175.983436853
##$TD= 65536
##$TD0= 1
##$TE= 294.16
##$TE2= 300
##$TE3= 300
##$TEG= 300
##$TL= (0..7)
0 120 120 120 120 120 120 120 
##$TP= (0..7)
150 150 150 150 150 150 150 150 
##$TP07= 0
##$TPNAME0= <>
##$TPNAME1= <>
##$TPNAME2= <>
##$TPNAME3= <>
##$TPNAME4= <>
##$TPNAME5= <>
##$TPNAME6= <>
##$TPNAME7= <>
##$TPOAL= (0..7)
0.5 0.5 0.5 0.5 0.5 0.5 0.5 0.5 
##$TPOFFS= (0..7)
0 0 0 0 0 0 0 0 
##$TUNHIN= 0
##$TUNHOUT= 0
##$TUNXOUT= 0
##$USERA1= <user>
##$USERA2= <user>
##$USERA3= <user>
##$USERA4= <user>
##$USERA5= <user>
##$V9= 5
##$VALIST= <valist>
##$VCLIST= <CCCCCCCCCCCCCCC>
##$VD= 0
##$VDLIST= <DDDDDDDDDDDDDDD>
##$VPLIST= <PPPPPPPPPPPPPPP>
##$VTLIST= <TTTTTTTTTTTTTTT>
##$WBST= 1024
##$WBSW= 4
##$XGAIN= (0..3)
0 0 0 0 
##$XL= 0
##$YL= 0
##$YMAX_a= 530775
##$YMIN_a= -520093
##$ZGOPTNS= <>
##$ZL1= 120
##$ZL2= 120
##$ZL3= 120
##$ZL4= 120
##$ABSF1= 16.522
##$ABSF2= -4.171173
##$ABSG= 5
##$ABSL= 3
##$ALPHA= 0
##$AQORDER= 0
##$ASSFAC= 0
##$ASSFACI= 0
##$ASSFACX= 0
##$ASSWID= 0
##$AUNMP= <proc_1d>
##$AZFE= 0.1
##$AZFW= 0.1
##$BCFW= 0
##$BC_mod= 0
##$BYTORDP= 0
##$COROFFS= 0
##$CY= 12.5
##$DATMOD= 1
##$DC= 0
##$DFILT= <>
##$DTYPP= 0
##$F1P= 14.0000005364418
##$F2P= -0.99999901652339
##$FCOR= 0.5
##$FTSIZE= 32768
##$FT_mod= 6
##$GAMMA= 0
##$GB= 0
##$INTBC= 1
##$INTSCL= 1
##$ISEN= 128
##$LB= 0.3
##$LEV0= 0
##$LPBIN= 0
##$MAXI= 10000
##$MC2= 0
##$MEAN= 0
##$ME_mod= 0
##$MI= 0
##$NCOEF= 0
##$NC_proc= -1
##$NLEV= 6
##$NOISF1= 0
##$NOISF2= 0
##$NSP= 0
##$NTH_PI= 0
##$NZP= 0
##$OFFSET= 16.522
##$PC= 1
##$PHC0= 172.5604
##$PHC1= 6.321657
##$PH_mod= 1
##$PKNL= yes
##$PPARMOD= 0
##$PSCAL= 4
##$PSIGN= 0
##$REVERSE= no
##$SF= 250.13
##$SI= 32768
##$SIGF1= 0
##$SIGF2= 0
##$SINO= 400
##$SIOLD= 32768
##$SREGLST= <1H.CDCl3>
##$SSB= 0
##$STSI= 32768
##$STSR= 0
##$SW_p= 5175.98343685301
##$SYMM= 0
##$S_DEV= 0
##$TDeff= 65536
##$TDoff= 0
##$TI= <Analysis number 999999
Compound Code 99
Book Reference 9
Project Code 9>
##$TILT= no
##$TM1= 0
##$TM2= 0
##$TOPLEV= 0
##$USERP1= <user>
##$USERP2= <user>
##$USERP3= <user>
##$USERP4= <user>
##$USERP5= <user>
##$WDW= 1
##$XDIM= 32768
##$YMAX_p= 302430795
##$YMIN_p= -36612
$$ End of Bruker specific parameters
$$ ---------------------------------
##NTUPLES= NMR SPECTRUM
##VAR_NAME=  FREQUENCY,     SPECTRUM/REAL,   SPECTRUM/IMAG
##SYMBOL=    X,             R,               I
##VAR_TYPE=  INDEPENDENT,   DEPENDENT,       DEPENDENT
##VAR_FORM=  AFFN,          ASDF,            ASDF
##VAR_DIM=   32768,         32768,           32768
##UNITS=     HZ,            ARBITRARY UNITS, ARBITRARY UNITS
##FACTOR=    0.157963299565203, 1,           1
##FIRST=     4132.6476996994, 0,             0
##LAST=      -1043.33573715361, 0,           0
##MIN=       -1043.33573715361, -36612,      0
##MAX=       4132.6476996994, 302430795,     0
$$ Real data points
##PAGE= N=1
##DATA TABLE= (X++(R..R)), XYDATA
$$ [...]
20223 7071 10178 15023 17285 15820 18832 17891 14747 9583 5124 3802 1400 4744 15114 21195 21877
20208 21877 23172 17999 15749 13974 12592 17019 24573 23354 22326 21408 23857 21708 20416 15134 15472
20193 15472 19571 24802 26325 29273 33034 36634 42936 40719 50358 57517 48086 40292 41399 43451
20179 43451 47752 52669 54318 55475 44927 39275 39239 33319 36957 45392 50710 48480 47795 45076 34798
20164 34798 31974 40632 48518 44898 41689 39909 41117 42990 55082 64377 65285 63348 66734 68240
20150 68240 68591 66098 72870 69459 67409 73361 75603 72849 75488 75188 77343 72645 67892 63934 63203
20135 63203 68202 68056 68438 72802 70985 63416 61826 56067 54288 60582 65287 67720 71807 79262 86747
20120 86747 89022 82059 82977 90965 97704 100358 99917 96477 95934 102611 104216 108557 111838 112188 117272
20105 117272 116680 124627 132424 145523 151160 158022 167422 177264 183847 196487 212699 232887 256657
20092 256657 277576 294713 311736 326975 342484 357907 381237 409901 442545 478134 508302
20081 508302 541379 575326 599798 619169 634440 641414 648913 672092 724805 798600 906439 1046413
20069 1046413 1207819 1404661 1653743 1972660 2385171 2928470 3655610 4645376 5928291
20060 5928291 7405041 8918607 10480000 12300528 14540798 16749724 17773214 17267438
20052 17267438 15321296 12698083 10806620 9914762 9843311 10506913 11761216 13079290 13619145
20043 13619145 13075169 11576988 9585839 7884668 6698563 5913996 5395222 5070470 4894029
20034 4894029 4826511 4855412 4989434 5249840 5693018 6389019 7451680 8997710 10972372
20025 10972372 12871851 13923538 13879612 12917523 11593087 10755574 10710365 11495959 13216451
20016 13216451 15831359 18535781 19839739 19452176 17709794 15270994 13274356 11710597
20008 11710597 10244166 8751703 7348538 6231117 5410680 4799803 4324869 3940069 3614586
19999 3614586 3345641 3118939 2925801 2762146 2618722 2490756 2378387 2269122 2177981 2090408
19989 2090408 1994680 1893445 1786927 1671236 1570460 1476378 1375483 1277739 1186711 1114029
19979 1114029 1056758 1010202 960461 910729 857063 801990 742862 684763 629788 586781 553183
19968 553183 522930 493687 469127 441254 412179 388101 366165 344475 323728 309747 293624
19957 293624 271191 259174 249271 228749 212613 206329 199987 190506 186097 176959 170613 166915 163545
19944 163545 155917 146435 145785 140821 135146 132526 134014 125339 117261 115856 107220 93904 89361 92477
19930 92477 91949 81418 72754 68981 69908 71086 73858 78066 76444 66025 57914 58964 57257 52499
19916 52499 56438 56735 53590 45901 44118 43615 44423 45522 51441 50313 44016 55045 61026 63317 59383
19901 59383 57663 64737 69620 60401 58909 60829 63217 63102 61368 57769 60625 54051 44337 38451 36946
19886 36946 45794 50292 46639 45705 47825 53999 53270 51868 53380 52294 48688 45112 42121 42439 48763
19871 48763 53208 52137 48546 50589 54206 52652 51984 52479 48232 52927 53113 48206 51718 50068 47643
19856 47643 45863 46187 49446 50837 42876 42275 47383 49620 54202 54357 50492 49956 45874 44468 46715
19841 46715 43265 39697 34707 27370 28265 28227 27599 30343 26899 28445 25147 18313 14743 17046 21157
19826 21157 23272 22505 21607 20134 18684 20420 20896 15530 16179 20654 21941 22441 20634 23172 25194 23079
19810 23079 27202 30553 27760 28274 24315 20398 21174 25590 23456 23436 26455 25745 22002 16542 16141 21518
19794 21518 27028 23919 24818 25753 21951 19306 15068 14564 18682 19654 17866 19797 25164 21509 23073
19779 23073 25890 23181 20904 13583 8370 11891 20148 24449 22429 16422 19215 18864 18144 20774 23672
19764 23672 22076 26688 27802 25656 19233 18300 17321 16907 17533 19667 17789 13465 15449 19378 17828
19749 17828 21706 25142 18999 12819 12756 16358 16855 15629 11217 4855 854 905 5110 7221 13336 14263
19733 14263 15165 16087 13357 10318 6968 8938 8961 13287 15397 14817 13128 11517 10237 6372 5096 8844
19717 8844 9516 13259 14387 9536 3986 1618 11439 13284 6365 3426 -1663 -5041 -2199 -3584 -1171
19702 -1171 2410 3908 1666 1030 9452 6026 409 2910 2500 3931 7836 12494 15199 13641 8539
19687 8539 5801 8441 8193 14944 15840 14391 14430 12020 16185 18137 15879 8822 8065 13768 18085 22690
19671 22690 16583 15531 12760 8540 10421 13245 8555 5009 5789 6929 9639 5690 9223 13147 15928
19656 15928 18698 20956 18051 22050 24164 17466 15980 12895 14243 15400 12063 11057 7271 5174
19642 5174 769 -4683 -7908 -1334 2505 1864 2031 4481 9148 11697 9184 524 2116 2348 882
19627 882 5480 9761 6834 10230 6580 11161 17637 15954 15789 13938 7425 6671 10302 10719 10936 12624
19611 12624 15770 13971 16516 16142 16273 10116 1811 5762 5466 4771 7049 10295 9510 9301 8883 6608
19595 6608 7378 691 941 7306 18454 24083 19276 10836 11285 14487 15880 13547 10505 14759 23386
19580 23386 18598 14858 10975 11089 13292 8161 11068 14227 15208 16155 16910 19176 21709 19401 24256
19565 24256 25660 21349 13192 11908 13983 13670 10799 10940 12535 13103 11801 11076 14021 12406 10542
19550 10542 8248 5333 4784 3296 1429 1202 3522 7368 10764 9949 5446 4816 6389 10183 11804
19535 11804 7673 3043 4524 4908 5835 8410 8531 9783 3784 2527 8429 7270 4953 8438 9267
19520 9267 10276 9791 6424 456 -1069 7001 9272 11806 10630 6039 1044 3886 10548 11564 11418
19505 11418 16176 17237 15405 17423 17512 18398 16198 14761 16563 22322 20481 17995 18222 28777 33969
19490 33969 42837 53413 62740 80992 94116 100475 99530 89382 80040 75295 79946 77499 68333 57205
19476 57205 52620 43298 39345 38518 39207 40610 45407 42211 41264 43594 41953 41725 46445 43265 45355
19461 45355 54900 59380 54340 55863 62427 66319 69490 70485 72405 80580 82777 84446 86846 100695
19447 100695 114585 122321 121073 117776 104824 88564 74256 64757 51850 40807 34257 32280 35598
19434 35598 33118 34256 37641 32255 27854 24328 25356 23364 19323 17061 15097 12278 9194 10916
19420 10916 15168 15746 14737 14649 17580 16475 13216 11347 11969 13207 13837 21760 22803 26087 21314 16017
19404 16017 13414 11155 9707 13082 12519 9949 14472 16810 11654 13022 16609 11716 8039 7263 6715
19389 6715 2915 -525 2850 2782 -3749 -3037 -10 4305 10350 13987 11014 10878 8094 9460 12224 14416
19373 14416 19665 15726 9614 7741 6084 4355 1672 -1611 -2300 -5408 -3635 2790 10373 10983 3644
19358 3644 6706 6608 7103 9445 16004 14393 6751 9429 8513 12713 12852 4460 -97 2447 6485 6802
19342 6802 7002 3821 4144 11834 17346 16632 9428 6064 7218 8416 7940 10564 10006 10209 7427 12549
19326 12549 11848 12703 12079 10844 5942 6743 8346 3542 7265 10488 10244 7149 12972 12867 14013 15057
19310 15057 16428 22839 23250 24115 20654 17554 15562 18910 17597 21213 24465 17961 6824 4203 4787
19295 4787 6229 11108 15917 14539 8166 5235 5609 9742 14733 16408 16495 17765 14773 12203 10791
19280 10791 10703 9561 16756 16143 7797 9814 8569 5602 6553 7135 6357 5778 7321 6165 11638 11392
19264 11392 8865 10469 13462 4192 -1628 746 3831 7409 10306 8771 6832 6373 2204 1568 2910
19249 2910 8682 7710 11615 10869 11648 10355 12273 7630 4983 3003 5455 5179 9286 8492 8253 5892
19233 5892 11029 13692 5494 570 4350 9791 14730 16066 13527 10270 18081 17904 12311 7059 10093
19218 10093 10072 10428 8587 2957 9114 14487 18125 15634 17297 17995 18198 15696 12747 12224 10092 7810
19202 7810 6802 6874 8268 11612 10228 13695 9604 4795 6969 9706 13499 15811 9444 10402 13401
19187 13401 10050 13943 13436 13401 11922 17990 17101 14102 13890 14971 13212 8445 9762 11927 13940 13954
19171 13954 13756 12227 9823 11328 15429 17021 15612 14321 10790 7581 9693 14547 13954 9460 8765
19156 8765 12314 17535 19279 16127 16319 19783 20782 22393 15798 15235 7563 5281 11409 15390 18547
19141 18547 20440 22609 19879 18188 16967 12216 7546 9244 12292 16552 15625 9880 10133 8279 8427
19126 8427 12446 13431 12149 14097 12473 14614 24013 31609 27186 21195 13589 15268 16842 18232 17286
19111 17286 18351 12893 8227 11319 10988 13484 17521 16595 15092 17509 19846 23951 26783 23642 16679
19096 16679 19365 17290 13439 18027 20503 20474 23107 22770 24518 23667 21124 17756 19580 16631 17579 28256
19080 28256 31797 27715 22139 18147 12700 10170 7729 13430 19187 18888 27507 31364 23687 21667 20985
19065 20985 24655 24742 23471 22797 21114 22068 21495 21743 21743 23575 24746 29832 27657 17404 15246 23996
19049 23996 26967 25791 24788 23454 24630 22263 20069 23391 26569 28374 23932 26366 30699 28067
19035 28067 30365 31632 26802 19256 19989 20726 23583 23955 30078 37663 39997 41778 47303 53300 68778
19020 68778 86811 96415 97884 93330 91907 94869 88486 84342 81881 73856 65367 60642 67817 69368
19006 69368 70401 79950 95508 99832 97932 95396 93199 95090 94261 83293 69079 62958 60428 55009
18992 55009 47885 53817 55030 61851 64686 63605 71239 82039 91777 100097 98066 98338 94703 95088 97315
18977 97315 84623 77787 79768 75463 66371 69863 84868 99562 96727 94316 96504 100991 104247 98939
18963 98939 91629 79991 67579 59701 54542 50063 55589 61510 59571 50043 45237 41797 40727 42317
18949 42317 38932 33379 29272 29829 32000 36510 44691 44597 39328 37360 38748 37088 37979 43535 48741
18934 48741 47391 42908 37861 36079 34545 33754 35879 43001 46924 48639 42118 33805 28255 30607 40098
18919 40098 46326 37625 29177 28408 31214 30261 35350 39820 39659 39728 36698 38809 35165 31691 34238 38656
18903 38656 37653 40294 41518 38306 40828 42457 44924 47932 48121 47991 52603 51272 49376 43027 48859
18888 48859 46039 46094 51865 48285 44794 49934 48223 53949 59501 62209 69337 72771 77706 80240 82986
18873 82986 86668 91889 98812 100665 102932 104918 103377 102321 97298 95144 96402 92220 90801 83914
18859 83914 74920 71793 67455 66289 69437 71132 72087 72251 72131 71598 74023 71346 60674 61151 65345
18844 65345 71497 73724 72699 73270 75562 70368 65333 63340 64524 67932 65977 70030 73968 74578 72080
18829 72080 74606 78678 81138 78772 75777 75124 70987 68810 67305 62841 68694 73124 70499 70695 72738
18814 72738 78177 82331 86709 90512 91356 91037 88721 85732 83701 89411 96578 98750 98917 103827 105276
18799 105276 97714 94662 94017 97141 100983 98928 108409 114917 109125 101569 98704 102733 102472 103805 102597
18784 102597 103732 99131 103963 111024 114320 111183 110628 115231 113315 115147 121384 122912 126428 131963
18770 131963 133857 135394 138902 137452 140912 152569 166013 185971 184940 168308 159787 154790 157161
18757 157161 163455 170558 167118 166242 171918 175978 180029 180418 179387 180118 182821 187947 191546 194472 196242
18742 196242 198236 196724 197582 193264 185477 180299 184343 186217 190065 196801 207137 210600 213078 211181
18728 211181 209499 212609 217323 219721 220545 224174 228749 236571 240523 241606 250437 251502 258659 268119
18714 268119 276560 283024 282169 275381 278611 282202 284679 292829 298390 303313 308947 310283 307793 309221
18700 309221 312135 316477 322625 332180 340237 344504 347164 352997 354858 354315 357859 365262 375634 382955
18686 382955 387360 393361 403849 404111 403143 412245 421381 429203 437804 447107 455276 468786 477544 485134
18672 485134 497548 503958 505687 516084 531823 548066 557719 566362 582228 592924 605941 620560
18660 620560 630903 641633 659458 676623 686561 698346 714869 729147 744144 764157 783794 812177
18648 812177 836402 855800 880055 906411 928223 953503 975849 997083 1019644 1042926 1079896
18637 1079896 1113958 1151271 1188163 1221269 1251880 1285130 1326356 1375032 1412243 1452867 1498096
18626 1498096 1543447 1586611 1637777 1689743 1741786 1796163 1853940 1912346 1958237 2018318 2076337
18615 2076337 2135039 2194695 2254767 2319576 2384860 2448657 2511948 2581713 2652013 2717151 2783681
18604 2783681 2849218 2907787 2967964 3036382 3095211 3153865 3209514 3264026 3319555 3369807 3412061
18593 3412061 3457153 3492355 3516886 3544068 3568764 3585773 3591468 3588052 3580182 3575117 3556727 3543148
18581 3543148 3525177 3499687 3461549 3426039 3390188 3346074 3291461 3239786 3188446 3127169 3070446
18570 3070446 3006353 2946595 2887560 2822249 2761199 2703158 2650146 2593535 2537530 2480749 2416783
18559 2416783 2351758 2299214 2248120 2197005 2144622 2096565 2046546 1995573 1946498 1899117 1851472
18548 1851472 1799877 1755331 1714840 1674085 1632163 1589326 1553837 1521596 1485232 1450835 1427574
18537 1427574 1402537 1365077 1339318 1323989 1293103 1266242 1239569 1215968 1195148 1176584 1163931
18526 1163931 1157979 1144793 1127801 1116054 1105932 1093407 1087512 1083048 1086305 1089730 1097731 1119264
18514 1119264 1143597 1180203 1222238 1266532 1328278 1406120 1503633 1638333 1822207 2040347 2316614
18503 2316614 2684174 3170078 3804373 4666605 5874301 7454358 9236561 10903685 12437551
18494 12437551 14361983 17126148 19921782 20639307 18797022 15461396 12619782 11036732
18486 11036732 10444861 10658828 11662407 13336353 14965385 15332675 14036610 11660957
18478 11660957 9378623 7786676 6775078 6135874 5720668 5457034 5303995 5243343 5282665
18469 5282665 5424627 5708385 6180636 6929257 8098948 9867296 12173577 14289585 15041592
18460 15041592 14189289 12403127 10937229 10330615 10541921 11597338 13662887 16704990
18452 16704990 19729111 20806183 19449932 16583448 14132745 12573597 11238109 9743146
18444 9743146 8208663 6902124 5938841 5238747 4703942 4269390 3898752 3585388 3326523
18435 3326523 3119536 2949337 2804731 2668790 2536298 2398794 2259370 2115444 1986002
18426 1986002 1868219 1753683 1639865 1535142 1439718 1347892 1263378 1188937 1125122 1067415
18416 1067415 1006866 949556 897919 859855 818413 769982 726866 688923 653437 625012 593789
18405 593789 570162 549093 527800 504315 480692 455488 434538 419324 405408 387016 371734
18394 371734 356506 345448 335840 319338 300499 292144 293659 291670 283827 276020 268243 267286 261011
18381 261011 252716 244495 233678 222050 213107 215806 213858 208187 201264 199039 198034 200450 189576
18368 189576 181931 178794 172453 160128 152838 149793 148748 151304 149213 144273 139374 132750 129155 132721
18354 132721 134821 133744 132039 132150 130783 130081 126448 128825 130200 128625 128831 124345 120405 119508 119729
18339 119729 118976 114195 113553 113071 108260 110104 114705 119299 122824 120440 120967 117679 114239 112497 108129
18324 108129 110531 116500 116653 116371 120077 122826 117791 113786 109620 109578 108889 113133 113266 116822 123321 137352
18308 137352 150086 153464 152955 154644 144104 139560 139186 132677 123816 111953 107590 112505 106115 103814
18294 103814 102489 106532 113642 115414 108561 105805 98804 102644 100250 93688 91286 92620 93780 91694
18280 91694 93564 93025 89817 94626 96600 93953 84862 81597 82252 78842 80018 76860 80659 75689 76951
18265 76951 80394 74856 67008 62796 62040 68307 66696 63484 66003 66648 64408 64837 64917 64937 62976 65054
18249 65054 66885 66532 68616 70360 70596 76147 71481 61860 55612 54915 53982 56411 64022 70289 74804
18234 74804 72451 66673 66818 67203 62189 62084 65131 64515 58449 47800 45877 49294 53741 51080 46496
18219 46496 48688 46925 48580 49362 52674 54517 50633 44885 47316 48337 48932 57476 56223 45820 45333
18204 45333 46770 50296 55238 59641 61233 59530 57899 58982 55490 47266 41096 42923 45686 46897
18190 46897 43772 47104 51987 54948 51977 47923 50709 54695 56684 53504 53018 45421 40985 38030 36903
18175 36903 39873 44269 44848 50442 51911 55726 53549 47365 44260 45791 48317 49368 49024 44628 41475
18160 41475 41514 42839 47919 48727 52592 55028 51725 53013 59171 60832 59615 58477 56979 57020 56838 54577
18144 54577 50200 47074 51787 61909 67342 75887 74806 70060 67878 72161 71187 74678 73728 67902 63474
18129 63474 64412 77159 92120 96576 100418 109490 124266 141139 158159 185993 226629 270701 314922
18116 314922 375860 463387 564138 686470 845664 1052619 1331231 1719384 2310197 3297543
18106 3297543 4937381 7135766 8453793 6825972 4471546 3070648 2296925 1832855
18098 1832855 1528395 1310489 1144523 1018716 915467 834497 765405 698854 642209 609388
18088 609388 583452 560252 542245 525531 502867 476779 447072 411936 380804 362124 338688
18077 338688 312342 285875 261367 244951 234414 223949 204591 193286 178988 166221 161644 154653
18065 154653 151496 145250 134662 129756 128906 120130 110824 107425 102247 93218 91504 89061 86696 84854
18051 84854 77769 77129 72499 65865 63077 60076 62430 58502 54069 51685 48746 48335 45324 52942 53702
18036 53702 50335 40486 40910 42024 41383 47938 50905 45613 42144 41482 39536 42809 44678 40293 40605
18021 40605 36911 28187 29224 33945 33060 28177 22963 25420 26400 23497 25219 23127 24337 27592 30245
18006 30245 35276 35000 30928 33901 36422 32846 31402 27291 25847 29142 33157 25899 23089 26397 33102
17991 33102 35276 40133 33843 30332 32895 27110 28258 31297 31512 31415 33707 33760 35382 43286 49771 52945
17975 52945 62395 74847 80408 77620 79526 83238 85663 84474 80804 74260 63141 62596 61650 52340
17961 52340 56029 68211 82268 90004 95559 95852 91895 89203 89177 86179 78011 70068 62097 51046
17947 51046 44959 45364 48919 52699 49236 43727 50619 58254 70798 74237 75421 79442 78169 79591
17933 79591 87815 85575 78529 72459 65337 63503 61398 61405 67279 69034 74339 82633 91250 95863 93948
17918 93948 86297 77353 70424 62700 53867 47230 43324 38431 36642 35655 33459 35577 33380 32948 31405
17903 31405 29257 30308 29611 25847 19693 18711 22049 17353 13728 14550 16868 21276 24391 23827 18845
17888 18845 21669 20497 13958 18325 28018 25595 16336 11687 15045 19164 24024 18793 15854 15770 16372
17873 16372 20008 17422 10399 10103 15604 13082 9910 9272 13272 7614 5763 8993 4037 5340 10518
17858 10518 12414 6549 7166 5721 10813 14889 12221 13977 16248 15303 17925 17337 13183 9595 6975
17843 6975 7795 13908 11393 13120 15841 14785 15708 15475 11833 6839 8236 11584 12546 7282 6684 6300
17827 6300 4314 2455 931 39 -544 6266 11906 15493 13317 10339 7854 4756 2638 1229 8851
17812 8851 18313 15860 8556 6382 13838 13669 4293 6790 3787 1532 4460 -976 2015 4080 3836
17797 3836 5035 6925 8663 9471 11204 12049 13247 8693 12687 15576 14039 10213 3801 4962 1317
17782 1317 338 6717 9642 8921 14311 15242 12126 11232 12630 8112 6880 10820 10527 8041 9233 10267
17766 10267 13638 11246 5529 -1359 2765 3987 4003 2089 -1884 526 6061 7508 943 1892 2900
17751 2900 4772 1986 -2499 3461 10450 6727 4953 5032 7668 10306 7001 4123 3660 2852 -600 9274
17735 9274 11893 6349 6907 8807 7176 5293 8060 11478 11128 5996 4569 6580 1817 459 -2237
17720 -2237 -7391 -2959 -4155 1182 6060 8241 12188 15538 15220 12293 4483 3552 -343 555 854 4817
17704 4817 3214 2846 9295 7016 6221 11257 13260 10759 4086 5647 7152 1562 -2173 2733 6383
17689 6383 6237 10148 9179 10419 6939 8012 9254 9477 8725 6474 2039 -290 5461 6103 -1141 -4916
17673 -4916 -4483 -368 3374 510 -4492 -7561 -590 2393 4224 5330 3671 4943 10586 17647 15857
17658 15857 11934 12214 9874 12989 15225 11242 11013 11782 9873 8849 6470 -773 -6236 -8074 -4084
17643 -4084 3380 5190 6488 9157 5779 7343 9103 9735 11520 12419 4713 6136 2810 -4360 -785
17628 -785 7416 6202 3118 -2086 -4803 -500 4123 826 -151 3561 6371 6225 5681 8857 6643 -867
17612 -867 5877 13891 13620 16169 11798 3064 -2878 651 609 1553 6613 11390 16152 13376 2989 4607
17596 4607 5674 9399 1391 -1954 -2309 2043 6339 8572 7235 9544 13162 14769 16794 16119 16368
17581 16368 14114 11354 6398 5563 4865 9858 14057 12035 4057 9124 13117 10273 6672 7341 11236
17566 11236 11050 9005 9025 10553 13218 11863 6545 4204 6254 8408 8665 7797 3202 886 -346 -2365
17550 -2365 5904 9483 6446 6731 13071 9941 5962 7171 6706 1170 674 3060 3112 -897 -4581 -7217
17534 -7217 -257 7434 7915 2805 2399 3514 7132 7790 9033 5899 5598 5883 5584 6486 7757 4345
17518 4345 3449 646 824 6947 8268 6223 -2541 -2513 5174 6080 7274 11621 12888 14443 15001 9505
17502 9505 6822 7889 4936 -332 -2961 -2502 -3516 -924 1033 96 2809 5135 5228 5836 2657 4054
17486 4054 3896 1096 1196 1212 547 3229 1579 2524 870 -2592 -1848 -4659 -6954 -2552 2403 5070
17470 5070 11848 10926 6528 1227 2424 5706 4035 2174 3958 6812 11696 8299 9130 11734 11947
17455 11947 13590 9067 2072 6561 8098 1682 3053 5671 2810 -3764 44 8207 9889 16174
17441 16174 21859 30468 42242 56083 61717 48024 35784 26153 21667 17521 15459 13329 6982
17428 6982 3599 -4033 -8072 -8226 -2873 1185 1230 1903 6723 11142 3623 6554 11619 4805 -3603 -506
17412 -506 -5 -681 -598 -2836 -387 -562 -995 -6087 -13850 -15195 -10403 -5048 -3494 451 -1281 -1200 -1818
17395 -1818 -1914 1150 2092 2044 4615 6638 241 -5504 -184 6351 8080 4026 591 5830 5815 3962
17379 3962 795 3465 2215 6109 8039 8869 7519 5025 1935 -713 -5740 -2837 901 -6126 -8801
17364 -8801 -3300 3658 5912 4945 6418 251 20 -2762 -1733 -4974 -4838 2797 -568 -5497 -7602
17349 -7602 -5352 -2778 2212 7777 7313 6208 10133 11207 7042 7584 8313 5917 10961 8059 6046
17334 6046 5765 3892 4117 14015 17971 15859 21063 16110 5724 35 -3664 -3809 -2795 2135 878
17319 878 4483 3156 -6352 -7775 -2892 -6794 -8887 -662 980 -1479 -3439 -3910 297 5229 3479
17304 3479 -1711 -3685 2739 5048 4334 2071 1872 2285 228 2189 -292 -7553 -9050 -7262 1638
17289 1638 4255 -4802 -4707 -1754 1130 -1614 -3745 -3142 4080 9499 9523 7213 3577 -1585 -437 4022
17273 4022 527 9099 7406 1278 -269 265 2187 6038 5170 223 -2769 2168 10067 13254 5275
17258 5275 2805 6715 8350 -1381 -2513 2399 6886 3063 2391 5239 7624 5049 -248 -8891 -7059
17243 -7059 -320 6819 6643 4461 5036 6739 2049 -517 -3828 -7615 -8601 -7645 -4761 276 4135 5603
17227 5603 6439 2051 1483 4563 3973 9659 3412 2911 6061 3273 -603 205 3303 1956 -1057 -3124
17211 -3124 -6428 -2666 2206 1812 1205 994 2829 2317 -592 -132 712 4010 851 -3048 -5147 -1434
17195 -1434 2630 10004 7286 151 -2435 4917 10529 15496 11063 7954 4410 -3778 -9600 -6768 -7277
17180 -7277 -7081 1250 5821 2349 5408 5619 5177 5003 343 -4139 -857 -4840 -2714 2045 11918 9632
17164 9632 4721 1342 20 4327 2544 3157 3808 -1224 -1415 175 -1316 -6973 -9875 -6141 -4385
17149 -4385 -1513 2633 1018 -3307 973 572 -5111 -7365 -5147 -2862 -6829 -7622 -6530 -8156 -5225
17134 -5225 1697 7107 9225 7409 5066 2771 -8497 -3298 4903 8543 4884 1237 5112 5582 4774
17119 4774 1903 1849 3948 1187 4061 7136 3617 1310 -2398 -39 3215 1898 -2111 -1248 2189
17104 2189 2110 7220 13645 11303 8979 7139 10320 6870 7761 8976 6618 3094 1257 1558 747 -1505
17088 -1505 6532 13561 5777 1334 -1662 -471 -997 2589 2071 -5134 -6693 -5207 604 1545 -2026
17073 -2026 -6098 -11286 -12308 -6292 -2577 -734 -2633 -6580 3783 2066 -2345 1484 -2986 -4304
17059 -4304 566 8296 10781 12005 13619 8378 7576 7501 6726 3576 1621 -5109 -6844 -1891 2286 -199
17043 -199 3987 8747 4612 5025 4868 768 -1769 -609 1104 -1341 -7519 -9391 -11047 -9126 -5291
17028 -5291 -6702 -3602 -2267 -2965 -3906 -2415 4172 5992 -1415 -10814 -8140 -3353 195 2590 5348
17013 5348 4835 1897 3547 6442 3862 6010 1991 1567 7041 2793 -4764 -4092 -3397 -3324 -1633 -2144
16997 -2144 -2780 -5813 -1065 3033 1452 1531 -4210 -5305 -4871 -2270 -1709 -5614 -12468 -13100 -9963 -11162
16981 -11162 -7349 -5883 -8826 -5872 2047 6036 5240 4797 524 -1053 -6783 -8593 -7449 -2817 5354
16966 5354 5783 2881 -566 -1668 -521 -2155 -3281 100 5986 11724 7186 2696 1845 6174 5119
16951 5119 562 -6375 -6548 -3657 -5419 -5191 -1848 1952 7768 5570 -632 -5676 -5618 1211 8186 7920
16935 7920 3690 230 -3652 -3799 -2977 1161 3480 6677 4858 2626 1688 1715 2092 -872 -1647 1328
16919 1328 1648 3411 -1758 -4151 -2183 443 -2047 -139 5627 6078 9703 17262 11347 4142 -3284
16904 -3284 -7821 -9969 -12577 -16283 -10943 -8415 -9125 -9132 -4863 -1637 -1166 -2365 -7279 -9028 -5613 350
16888 350 -2354 -2021 5257 4880 7465 3220 4302 3874 4565 453 -9169 -11349 -4777 -880 1924 1035
16872 1035 -6852 -12822 -8122 -2770 -62 -568 1149 1607 -6001 -9263 -1742 -774 -5987 -7334 -6608 -1661
16856 -1661 7674 8563 7050 9055 9528 11837 15169 17595 16390 10656 10083 10504 4646 2112 6542 9269
16840 9269 7416 6344 6588 3446 1908 2193 5317 6465 2145 -1297 -981 1111 5255 8845 9714 11196
16824 11196 13288 9766 9798 8653 4909 594 -3995 -7187 -6824 -2493 223 1304 647 -949 -225 -253
16808 -253 1921 -489 1729 4747 7129 10536 6193 -3056 -4200 -548 -1947 794 2042 4235 1598
16793 1598 -1930 2096 -6571 -12035 -7085 -2384 -1404 -3366 -1928 4553 3424 8066 6132 2031 -1146
16778 -1146 -1084 4568 -722 -9179 -10378 -9056 -10086 -10104 -4492 1600 6916 8401 10872 7170 4464 7114
16762 7114 9007 8889 6709 3587 2928 7606 4944 63 5151 9706 9236 7198 4744 -8 -1378
16747 -1378 2117 -1720 -3000 7608 11259 6408 2962 -4117 -5433 -4719 -9690 -10588 -5237 3984 8296
16732 8296 8737 6186 4722 11143 9277 4836 2712 5273 3489 123 2051 9322 9575 10950 8128
16717 8128 5364 7230 5244 405 -1 -858 -4333 -1666 -3056 -1416 154 277 5956 6316 1903 -2001
16701 -2001 -3342 -6908 -6789 138 5049 5165 2482 2538 -3108 -10276 -6881 -3356 -384 -2858 -4765 -6675
16685 -6675 -700 -343 2587 3194 7661 9028 8143 5743 5323 2336 4243 9490 6991 -833 -2748 -4792
16669 -4792 -9800 -13804 -13106 -6071 -237 -3924 2680 5903 3264 -4415 -4910 1504 1862 -2528 -836
16654 -836 -3249 -3089 2334 7907 5479 2241 4053 7784 7394 6738 6687 1101 -3661 -7697 -4156 5864
16638 5864 12069 4943 -1090 -2014 3753 2333 -1064 -2810 -1402 2775 5342 5444 9282 6547 -500
16623 -500 302 1155 -1519 -4970 -7947 -6181 -1520 2725 4352 -570 148 3431 1501 5167 6741 8215
16607 8215 7686 2798 -3353 -4430 -2326 2348 2733 1374 911 -2460 -3013 1916 8542 5684 -2200 -2194
16591 -2194 -1546 -5302 -7417 -1342 1246 -781 -1065 -1310 -6392 -5123 -4372 -9538 -9641 -3222 834 344
16575 344 443 1693 1510 5805 8410 7482 4824 662 -4852 -9128 -8883 -6160 -6632 -9290 -12134 -14345
16559 -14345 -9525 606 715 -232 -367 2629 6974 7430 5628 4646 2753 5442 5482 -2994 -5957 4854
16543 4854 1297 -2781 787 7630 7946 7620 7292 8499 15092 15490 6394 -5066 -3124 -847 -7043
16528 -7043 -8493 -5923 -1978 3946 9177 7740 1719 4719 9561 9040 4219 4168 3629 1951 5734 9314
16512 9314 10864 11130 9333 10084 7832 4424 -363 -953 -5519 -9448 -11632 -7855 -6843 -340 -3912
16497 -3912 -7439 -9914 -12584 -10476 -2059 4673 3443 317 3033 3700 9940 7207 4235 -401 -1806
16482 -1806 5179 13822 16603 6950 772 -2994 -4817 -6979 -9191 -6170 -5689 -2988 955 989 9645
16467 9645 13554 11593 9603 6041 3646 3528 1582 4801 7151 6753 3733 2023 4436 214 555
16452 555 -1486 -5175 -1529 6700 8076 11056 5105 -4057 -2373 5066 2743 -5767 -8596 -4900 -1008
16437 -1008 6939 13347 14195 10088 1326 -1777 3630 392 -3647 -4446 -1963 2537 3512 6591 5668 -4790
16421 -4790 400 6459 4190 7188 5991 4687 1993 -1296 -452 -124 298 919 -3492 -5180 -6033 -5229
16405 -5229 -1830 -174 -967 2790 3011 5255 9321 12935 11736 8170 5333 -1180 1987 6793 7461
16390 7461 1526 -6155 -905 3452 1512 -2237 4067 2608 1217 -5947 -7033 -6598 -8123 -9005 -8609
16375 -8609 -1443 6791 5891 8441 6295 4811 912 -1182 1499 2912 -167 -4139 -9939 -7536 -12527
16360 -12527 -14498 -10515 -5950 -6035 -6311 2930 2978 -5437 -8600 -7933 -679 -1906 -5407 249 7288 8691
16344 8691 7095 4316 -3254 -3700 -5737 -6376 -10070 -5551 -5934 -2790 1349 2392 5188 3636 -2403
16329 -2403 -3242 -2810 2894 8362 9587 4825 -929 -10040 -10019 -5008 1397 -4543 -8886 -9559 -1595 -3230
16313 -3230 -1834 -1752 -101 4614 2716 1300 -2427 -2200 -3075 -3301 -1274 -2481 219 2888 4074 4595
16297 4595 3101 -2457 -6333 -4334 4015 6287 5158 -1421 -6312 -5256 -4843 -1775 1485 -120 -2103
16282 -2103 -1713 -5767 -8941 -4193 1092 4758 2181 78 155 -956 -4133 -4259 -7970 -12442 -2639 8011
16266 8011 11482 10362 7963 3748 -2617 -4536 -4260 -3888 -4541 -540 2144 -3673 -8418 -7342 -5154
16251 -5154 -7158 -473 6548 2191 -91 4184 12401 7082 -2476 -3019 -3072 -38 5967 5414 3507 3899
16235 3899 -547 -6287 -9213 -8784 -10208 -8258 -2094 1504 -6376 -7544 -4174 -6185 -9200 -11235 -10270
16220 -10270 -12591 -9065 -406 2363 -4541 -8663 -12986 -12977 -14680 -13492 -9740 -10674 -10394 -722 1073 -3204
16204 -3204 -10749 -9618 -16178 -14735 -9095 -4790 1753 1902 -991 -920 7355 6494 2522 -2443 -3313 -3298
16188 -3298 1182 120 -2781 -4141 -1406 1561 8751 14584 11750 9145 7183 -1672 -2183 -546 3041
16173 3041 2718 1964 5394 6373 5470 1358 9976 9166 5893 8 554 7816 10750 6791 4694 2617
16157 2617 3116 -257 389 -3783 -4211 70 9015 10004 5870 -557 -1526 -5618 -8700 -5817 -2111 2783
16141 2783 5893 8561 4617 7574 1141 -3943 -9814 -11131 -331 2473 -2487 -92 7601 8902
16127 8902 10071 7632 4563 3884 -1863 -10072 -15537 -19238 -15443 -8457 -1372 -49 902 386 3557
16112 3557 5494 4456 8153 6086 3090 6239 3098 -2585 -5072 -7918 -7230 923 4409 -35 -4822
16097 -4822 -4215 -9170 -12499 -6490 1756 7067 4940 -3140 -11308 -10053 -8919 -4028 1627 6139 7133
16082 7133 4643 1241 4850 8234 3633 3107 4687 2976 2925 -1672 206 2373 -7915 -12639 -6848
16067 -6848 -2753 2291 7576 1853 -2920 118 4406 5983 9538 1742 -3092 -1842 -4408 -3140 1161
16052 1161 -831 2648 843 3287 1873 -2966 -2420 -2957 -1933 -1745 3710 -2105 -1889 -745 535 4893
16036 4893 10294 7344 6186 5315 896 3979 2554 -2358 827 3958 3063 537 -2701 -8158 -15381
16021 -15381 -11208 -5661 -4556 -4121 1998 4387 5548 4652 343 -1603 3788 10791 10652 834 1576
16006 1576 979 207 1320 -6378 -8472 -1398 -422 4026 5207 3848 2031 -1183 -3731 -5430 -9898
15991 -9898 -9409 412 8230 13010 13431 7411 1307 1169 4274 5815 5232 6259 8674 15263 16629 6607
15975 6607 -531 667 1102 -6743 -10075 -4923 -777 4118 1621 3697 6480 7905 5008 919 1782
15960 1782 2735 6765 10233 9300 11501 7582 6442 6386 10333 11898 13136 13702 7957 -3242 -4169 -4383
15944 -4383 -7109 -5218 1421 5637 2458 1654 -553 -5435 -2650 -2289 -416 1733 59 -2374 -2595
15929 -2595 824 4904 -1998 -7534 -5747 -5957 -7501 -5316 -8509 -14721 -9412 -8370 -4038 303 2463
15914 2463 1193 -5370 -5683 -1986 -1626 -1943 -6501 -2584 -5652 -10709 -10642 -15506 -15702 -4918 -2463 -4841
15898 -4841 -5311 1070 4919 -3313 -3437 -3392 -2183 1954 1748 3960 6566 12031 7747 820 47 485
15882 485 1902 889 414 4605 3830 -4117 -3679 592 1324 3190 6106 2359 -1892 -6435 -6025 -3101
15866 -3101 1890 8095 8341 3472 149 1876 -48 -1662 -5966 -8325 -8810 -8751 -8542 -8416 -5399 1587
15850 1587 727 -1127 -1691 -7739 -8983 -900 1818 1670 3608 8415 4014 2355 6380 9235 6234
15835 6234 4513 11050 8773 4711 4194 5966 9445 9028 8122 9417 8473 7852 12368 14056 7657 2386
15819 2386 1627 -1442 -4672 -8633 -2355 5579 3572 810 -393 1329 -1438 -3886 -5418 -7122 -2092
15804 -2092 1915 4332 2851 -2908 1492 7383 6882 10315 10069 7986 9301 13421 16294 10909 3010
15789 3010 6449 9368 9111 6786 -1165 -6019 -1268 516 3761 4451 -121 794 3832 -99 -4293
15774 -4293 -4189 -3732 -4268 -3734 -146 117 3447 2636 -846 -1828 -6591 -14057 -15952 -10465 -11355 -8314 -1958
15757 -1958 866 2211 -2030 877 -4486 -1088 -171 1510 6662 7842 5824 2143 837 3739 -1958
15742 -1958 -4611 2215 6038 6690 6880 3063 3676 -1375 -4509 551 3182 7946 8571 -1532 -7587
15727 -7587 -5530 -2929 -4237 -10415 -9046 -5806 -2382 -3024 -1109 -2564 -7548 -10285 -8240 -5808 -5523
15712 -5523 -5157 -2988 967 689 -994 -2033 770 260 435 2095 4681 4758 4362 7284 2507 2168 -3613
15695 -3613 -8290 -7867 1786 5868 6232 6808 5262 1884 235 -1858 -2055 -3986 -1598 1250 5826 3852
15679 3852 4602 2982 6456 8066 7554 7635 8086 4262 1605 810 5287 4016 834 7246 14315 10528
15663 10528 6166 2962 2840 1864 602 765 931 2185 1591 2687 4106 2032 1090 169 -1003 -5464
15647 -5464 -11552 -15672 -11428 -10400 -12965 -16379 -7279 -4612 -7812 -7761 -5902 -7230 -6897 -732 1472
15632 1472 865 1618 4734 6734 6786 6037 3119 -2413 -5373 -5661 -5087 -5822 -2902 8 -5682 -4116 2169
15615 2169 1534 1742 -3453 -2811 2975 1120 -512 -1076 3235 8018 8865 4623 -2532 -6398 -3718 -1657
15599 -1657 -1689 -2383 -2878 -4085 -4174 -2057 740 3414 5126 2576 4180 3697 -60 791 -1960 -668 283
15582 283 -2561 -5935 -8154 -9058 -4332 1969 -700 -430 8631 4755 1392 4743 3562 -302 336 3191
15566 3191 3813 2511 3949 775 -143 -156 2643 3471 5748 3979 4413 2736 1765 6874 7747 10943 5594
15549 5594 -207 -392 3058 5910 8122 5599 1589 -3189 -6682 -5271 -3348 -5075 -1131 -1912 -599
15534 -599 210 -2463 -1263 1433 7251 10736 11864 9195 6986 7473 10250 14056 7822 1350 924 -3339
15518 -3339 -416 3165 1713 -1390 -2829 -10544 -13872 -10383 -4214 -1153 1479 -961 305 -3653 -5590
15503 -5590 -4617 -2314 2255 5957 1189 1137 -668 -4029 -3759 -4256 -2010 -1177 1246 -721 -1753 3331
15487 3331 3900 -3893 -4984 -430 -1631 -1203 -924 -3246 -2261 -310 -1156 -3018 -5922 -283 -184 -2666
15471 -2666 -5592 -5932 -6382 -9393 -7873 -2265 -1940 427 4172 -2924 -7032 -1798 2481 -1172 -7869
15456 -7869 -7598 -8740 -9526 -4811 -4542 -7281 -6633 -1230 -1948 -8046 -5713 -1350 5144 6868 95 -945
15440 -945 -2328 -3171 -5991 -7826 -8851 -6546 -8935 -5432 5212 12985 13869 8222 -67 -4385 1524
15425 1524 1337 1559 3423 6497 3279 1034 -1094 -26 367 -1636 -4573 -703 10570 7534 3251
15410 3251 4262 3084 -81 -1465 -1599 -1022 898 567 -1010 -6979 -7909 -5097 -1161 2678 -592 -4236
15394 -4236 -4095 -6786 -2809 -3140 -2363 2940 -1809 -7214 -6751 -3491 -1863 1323 2706 3714 5010 -526
15378 -526 -3244 -3331 -7596 -6966 -127 1947 37 614 7165 5804 -2065 -821 -1021 3972 5687 4838
15362 4838 1164 -231 2937 613 -4410 -2653 -732 -2783 -3247 -4305 -6759 -9856 -8188 -2631 3386
15347 3386 -543 -2834 -1136 -5677 -2527 4138 5789 8863 7360 10133 10669 10888 8042 7202 396
15332 396 -510 -3188 -2217 235 -341 3578 3769 2836 -1977 -810 2890 4013 -2839 -4144 -2863 -4400
15316 -4400 -3137 572 6131 7123 11994 14314 15977 12163 14921 14575 -240 -6572 -6184 2095 2749
15301 2749 6117 3864 2462 5452 9357 787 622 3418 10732 8514 742 -545 1821 4032 4315
15286 4315 10135 5382 -618 1972 3943 6999 13167 8194 2455 2112 2233 7171 6681 4974 -1811
15271 -1811 -5624 -4611 -3181 -381 -1141 -537 -2172 2771 5383 -823 -4060 980 7897 12617 18448
15256 18448 21287 14743 9273 4436 1888 1067 2129 1289 576 952 1665 10107 14778 11164 8111 6288
15240 6288 8446 9587 8525 7221 4840 6888 4722 7847 5422 -1326 -8174 -10556 -8446 -357 5644
15225 5644 562 -1864 -871 3917 8422 16765 20403 14172 10413 6739 1128 -277 402 411 -800 2834
15209 2834 -2883 2859 6352 4694 5482 5647 4223 1173 120 -4946 -5224 -2507 -1815 2078 3284 3300
15193 3300 5998 6254 6361 13678 11567 3320 1600 5299 2779 48 -2116 -2033 5866 4343 -1376 1864
15177 1864 2758 5425 3216 2666 224 922 1482 5143 7689 2930 -2201 -4088 -101 176 -2328 -6734
15161 -6734 -10524 -11827 -10421 -7268 -6751 -9784 -6366 -2797 3069 2778 -3557 -3585 -409 1889 8345 7844
15145 7844 3276 6153 1204 -1848 -181 -749 2901 3620 7946 9834 4718 1937 1448 5679 698
15130 698 815 -1949 -180 2785 2274 -3531 -5307 -3117 -316 -5046 -4453 988 1602 -2562 -1289 5278
15114 5278 5844 -2160 -5497 -681 4254 7286 11134 4631 -1010 2513 9028 4468 2487 2042 5958
15099 5958 7127 1686 295 -4185 -7224 -4673 2053 -3072 -2588 -2491 -4764 -4224 1109 -647 479 440
15083 440 976 -1051 72 4572 5347 786 -3504 -4582 -13267 -16401 -7069 -1114 2168 -7807 -15724
15068 -15724 -15272 -13196 -9346 -1276 2429 4925 8108 3880 1407 1928 2096 -1563 161 1324 -708
15053 -708 -5645 -7925 -9055 -3033 7 -1473 -3647 -4052 -3371 1504 3634 5215 -347 -3037 -5004
15038 -5004 -5599 -4119 -1256 -4053 -1542 3582 4016 333 -2202 -1330 -1977 -222 -3462 -3084 -2601 -3756
15022 -3756 -4846 -6273 -6488 -4548 163 5485 4777 216 -1577 6341 5917 2413 4419 3852 6680 10186
15006 10186 7496 7238 8712 618 1396 3699 3697 -2303 -10156 -5012 865 3677 1185 -2576 -8540 -8969
14990 -8969 -6998 -10718 -10446 -7603 -7282 -11626 -9087 -8455 -4881 -2955 -4754 -3528 -583 3905 3343 3497
14974 3497 2252 -5201 -13063 -7864 126 231 -6076 -2885 715 -1226 1249 -4622 -6640 -5688 -2901
14959 -2901 -304 -1935 -1313 -8508 -13476 -3709 5645 4898 2405 788 -2564 -5744 -4606 2203 6276
14944 6276 3801 3182 4042 1176 -3991 -3877 -2240 4596 6286 11546 14170 9965 1050 800 7628 13540
14928 13540 14355 7339 2870 3753 4038 -153 1426 3461 2711 427 -2583 -3554 -5007 -2121 -729 734
14912 734 -1493 -1606 3678 -3889 -7573 -9676 -3833 3996 9090 8776 11168 13171 13470 8202 -1522 -3558
14896 -3558 -4305 1149 -1483 -1309 6484 5308 7021 2070 -3135 -4931 -6156 -4682 -1194 -3191 -3524
14881 -3524 -5996 -7313 -3345 -4185 -11527 -9325 -11121 -12324 -4848 -1167 764 2682 1704 -869 -1011
14866 -1011 1234 -547 -2321 -3699 -3565 -2951 227 -1964 -6273 521 1878 163 -4120 -3902 841
14851 841 237 -1676 683 4594 5298 3828 3535 2357 5090 3260 1176 1392 1377 -1269 5254 4650 5591
14834 5591 751 -3868 1376 2187 -5911 -2177 2526 8376 6174 5909 11546 12593 8125 1623 3529
14819 3529 9217 9556 425 -189 -3006 -4527 -3572 -1535 -6453 -5122 -502 2273 2461 10674 10059 425
14803 425 3756 9897 9719 10309 14885 14636 12472 9801 10489 12099 11420 4810 141 -3014 -5470 -998
14787 -998 -1155 -2548 -9275 -9279 -8977 -10785 -7679 -3966 -1091 691 -1843 -3625 -6293 -5495 -3574 -5017
14771 -5017 -1097 2261 2416 -417 3166 5446 924 -7573 -3943 4738 5360 7958 -184 -7374 -3793
14756 -3793 -2741 -6054 -4619 -5197 -9070 -9548 -3380 -2347 -6666 -4414 -3033 -1595 -3564 1117 6373
14741 6373 3105 3588 6801 4107 1865 -3591 -9558 -2170 3652 2859 5930 3077 -4095 -1165 2790
14726 2790 7126 3277 4245 9629 8488 5425 427 3175 5225 6177 2297 10432 12879 11037 7544
14711 7544 155 53 793 -8375 -10340 -5388 -4139 -1427 -654 -977 1970 1309 -2207 1620 4889 -2956
14695 -2956 -2991 -3479 -8870 -8848 -7225 -5475 -5099 -6759 -2457 -862 1065 -1539 -3672 1579 -1301 -2948
14679 -2948 433 3061 4847 11379 14728 8474 2016 305 -2458 -8874 -8982 -3507 -3887 -3550 -7197
14664 -7197 -7973 -9302 -5036 -2827 -2200 -3890 -2055 -4252 -3988 -8220 -4777 -3676 -1492 -5770 -10870
14649 -10870 -10788 -9422 -6423 -4354 -4428 334 4174 6018 7930 7840 5327 6172 9302 8996 5304 9860
14633 9860 8674 3172 2325 2450 2407 882 -4156 -6547 -6980 -13182 -9436 -323 3183 4348 221 -2835
14617 -2835 -2838 -261 2835 -1085 -6864 -8345 -1780 -448 -2029 4105 5075 913 -3248 -3381 1687 -1492
14601 -1492 -742 2809 7104 2737 -2412 442 -969 179 -1364 -5043 -1699 792 866 -1620 1549
14586 1549 5423 3857 -3829 -8338 -8319 -11725 -6499 -6061 -7368 -10241 -14541 -13151 -5954 -4807 -2922
14571 -2922 -1522 2605 5584 1768 -78 5677 8745 2391 -1010 4132 7625 -1251 -2552 -1237 -4467
14556 -4467 -6038 -7463 -513 1528 -1633 158 151 -2980 -4923 2257 5715 6230 686 -5184 -4753 -6716
14540 -6716 -11461 -4939 -995 -7548 -11497 -12818 -8565 -6343 -8500 -3334 2500 -1165 -602 404 135
14525 135 1665 2768 7044 11596 4418 461 4720 5258 5411 13053 8846 6851 1533 -2277 3191
14510 3191 3855 -43 -5775 -6373 -484 2700 1112 -1232 6347 7571 1898 -1366 1596 6925 11097
14495 11097 8056 7574 5061 5094 7071 780 1470 2326 1770 3533 3882 5019 7221 8251 2601 -708
14479 -708 7378 8127 8749 8285 5903 4326 4156 5131 6131 2521 1864 7270 8559 11293 12609 4518
14463 4518 2022 -122 1094 3621 3004 4714 7241 9262 8228 10210 13469 7973 1258 -1036 2028
14448 2028 4772 3114 3398 -3352 -4852 -1533 -269 -815 -5976 -3732 -378 2004 3897 -736 -947
14433 -947 -176 3358 5001 8814 1789 -1040 1371 6064 6693 4734 5974 3718 278 -1505 -587 6965
14417 6965 9846 7549 8618 8569 3483 -1075 -810 -3505 -5247 -9656 -13801 -6843 1204 7208 6801 -1980
14401 -1980 -1738 1436 2477 2293 1512 1473 -1033 2417 5638 6083 3654 -3166 -7105 -9933 -8513 -5101
14385 -5101 707 6212 -654 -45 3311 3971 2758 3752 6925 3317 2105 -1914 -2574 -6430 -2335 2085
14369 2085 3747 -5713 -5082 -3179 -2191 -2519 -2614 -1937 -2544 -1433 -2613 -5603 -8991 -14494 -12448 -11369
14353 -11369 -10477 -4129 -1602 1638 8267 17000 16645 12938 6609 6812 12018 12473 6874 -4042 -6245
14338 -6245 -2856 699 2340 267 -1177 -9061 -6500 -3948 -1116 -5824 -4803 -8568 -6402 4214
14324 4214 1856 1556 2065 124 1849 4316 3079 1679 4869 1360 -5415 -7225 -4006 -4078 -46 8859
14308 8859 4752 93 -3003 -3774 -6565 -7811 -8620 -10098 -11502 -13103 -11808 -6392 1258 5987 7702
14293 7702 4884 1707 3077 -107 2533 -2622 -2928 2647 3641 1987 1522 -2429 -1150 2088 3195
14278 3195 -895 -6243 -7767 -8549 -14495 -7080 1173 -1352 914 5205 455 -7250 -5459 -5590 -4537
14263 -4537 -1327 -6098 -5670 -2656 -674 7899 17140 18048 15192 3103 517 3266 3400 -2099 -3263
14248 -3263 721 1711 -168 907 7869 8800 5772 5125 -724 2379 2618 -972 -701 -4059 -3636 -4066
14232 -4066 -1849 -721 -464 1133 -2045 -2811 -150 3824 8221 9676 10897 9841 11885 3779 -3250
14217 -3250 -4962 -4872 -6929 -1302 -5986 -12013 -9333 -5125 278 4563 8537 8695 12477 12591 7250 2259
14201 2259 -3710 -4700 2849 1663 -4451 -2456 1075 3615 8098 7456 4293 3717 -1506 -6732 -7804
14186 -7804 -4791 -1237 4976 6749 5535 450 -1396 2934 6579 3577 -3656 448 -83 -3705 -11196
14171 -11196 -9239 -7513 -5799 2502 -269 1529 -739 -3973 -6147 -9603 -7168 -3026 -5018 -6551
14157 -6551 -8307 -11057 -5395 -2363 -3099 -3896 -8329 -9175 -3706 -3115 -1797 1531 5041 4895 3657 705
14141 705 4252 7528 3676 -1782 1193 -201 -1389 -3908 1712 7474 5041 5297 5870 2641 -420
14126 -420 5367 4053 6491 11169 14263 7411 5466 16682 20269 20769 20131 17761 7928 320 3804
14111 3804 5475 3815 7126 -920 -6671 -7670 -9467 -3927 1568 839 -3370 -3612 536 -1610 -1642 2645
14095 2645 2478 -5677 -3199 -4741 -7962 -5653 -1585 214 -346 3333 3925 -72 -5622 -2590 272
14080 272 694 -937 -1415 -3890 -9334 -6581 -3171 1494 1080 1272 4138 4515 2125 1425 1139 1008 -3632
14063 -3632 -3107 -3896 -8964 -11720 -9904 -10807 -13863 -7505 1170 4793 9293 10325 8202 4340 2980
14048 2980 7799 12328 13704 8570 4745 -1772 -8958 -8612 -1179 5530 2668 818 4402 3244 3957
14033 3957 2262 7 8 -7230 -9971 -6889 -5463 -11195 -10330 -12168 -11990 -8669 -10615 -13322 -14581 -13701
14017 -13701 -20869 -14462 -5596 -4835 -4933 -3312 -4129 -709 2515 2168 3347 1841 -3937 -4478 -5317 -4144
14001 -4144 2606 9480 6725 7629 5958 2926 -1565 -4743 -3920 -1403 1199 5296 19904 22485 19631
13986 19631 9704 7491 9503 4210 -320 60 -3854 -5485 -5108 2865 1323 203 3562 3649 3737 2565
13970 2565 3733 5086 2051 1072 -796 1035 3488 7360 5889 6178 4454 1800 -4367 -4001 -2009
13955 -2009 3673 2117 1757 2018 -7628 -14839 -13310 -9061 -2831 -2140 5735 12135 12591 4627 2437 3171
13939 3171 5136 2981 -4396 -1492 1312 3696 6203 4627 1481 261 692 3036 1451 -92 -4264
13924 -4264 -2935 -73 7221 5471 5255 -2548 -8771 -6880 -3101 -2525 -4148 -406 4519 7993 5860
13909 5860 654 183 4386 3169 -3804 -8797 -4626 938 -1953 -2296 -3433 -6773 -4775 -2772 1451
13894 1451 -1082 -1350 -1579 1030 3268 -2117 -838 -2264 -411 3875 884 -2040 -434 3611 2435
13879 2435 -3870 -3124 6385 8140 5620 1848 1681 232 2036 -3392 -5542 -4315 -3220 -2471 -2725 5827
13863 5827 6953 3783 5448 2296 4637 -138 -6466 -4344 3152 2391 -631 -6785 -1797 -439 2131
13848 2131 5297 750 1199 -610 -6691 -6523 -1313 3151 1960 3238 1315 -3401 -2215 -562 -1435
13833 -1435 180 2228 1395 -671 -401 2393 3885 -4506 -8766 -12462 -10477 -5309 574 2274 -6490
13818 -6490 -7998 -4643 -6746 -7855 -4972 2055 1835 275 -4301 -5397 -7631 146 1843 -48 6088
13803 6088 9775 4573 443 1517 367 3560 1757 -6157 -5346 -1166 2533 159 -3053 -3743 -2050
13788 -2050 2218 2860 3296 2608 6257 167 3384 13653 12482 9230 7930 3594 4683 -197 -1094
13773 -1094 968 -1148 -6849 -8558 -8316 -7667 -8016 -3983 -2091 -8442 -7619 -12343 -11062 -8997 -6272 165
13757 165 -2695 -2293 3797 1249 903 9257 9726 1135 1886 3793 4006 4650 -822 -4367 -3279 -9868
13741 -9868 -6076 6111 5186 3428 -2475 -9442 -4152 235 1554 4230 7935 5388 1887 142 -825
13726 -825 1948 2046 1241 5348 3266 2400 1129 350 7094 7829 5306 291 -3180 1649 3108 -250
13710 -250 -1642 -2120 -2546 -2767 -456 -2982 -6838 -8952 -13199 -8413 -6925 -3770 -7052 -14124 -12995 -11536
13694 -11536 -8794 -5995 1997 3452 8005 4133 -1312 391 -2202 -6158 -975 3799 6680 5278
13680 5278 -169 5480 10170 11205 6449 6173 3116 1898 -1874 -1607 -1088 -908 1638 5331 3946 937
13664 937 -2333 -7310 -5214 -4849 1830 1928 -883 1342 2203 1472 -1590 -1895 6987 7135 6011 4177 8148
13647 8148 14751 15322 11154 6180 7304 7248 7088 7161 6934 3433 1012 3829 3281 1943 937 2192 3855
13630 3855 7776 6097 -544 -4850 -2503 1451 -901 242 3901 -884 -6466 -2960 -4074 -3572 -1221
13615 -1221 -4430 -9422 -7284 -2841 -4045 -1048 -2617 -5441 1644 6612 2457 -3854 -6181 -6278 -5297
13600 -5297 -691 144 -2242 1572 3509 3767 8992 12197 7168 2856 645 -2584 5023 -5041 -8568
13585 -8568 -2845 3365 3579 3427 4197 677 -458 -966 -461 -41 -2082 -5718 -2246 7753 4070 5433
13569 5433 6894 247 -4799 -5192 -5780 -8631 -10479 -4280 -23 -3211 -6446 -12060 -11222 -11081 -5226 -2679
13553 -2679 1192 2039 -2572 -6157 -5011 -4731 -1389 1516 3481 5608 4609 1168 642 919 -3039 1806
13537 1806 1583 -891 439 5935 9563 6883 3174 -1265 -7037 -3812 -1739 155 4966 176 -3535
13522 -3535 -4395 -2606 -1595 -982 68 -324 4000 6592 1011 -6386 -3053 1145 -886 -4968 -2271
13507 -2271 -2903 -2917 193 -189 -1300 1835 3594 6873 9473 13304 13705 8591 7149 698 732 -464
13491 -464 -3319 -3186 3000 976 -1597 -7505 -2559 2043 223 36 321 -3504 -1429 1713 -1695 -2647
13475 -2647 -3650 -2939 -10802 -11395 -5085 -1928 335 102 1419 -1553 -4157 -2465 -3528 -4508 789 3923
13459 3923 -1722 -322 1145 3463 2004 118 -596 5237 4553 961 -4195 -2834 1664 5491 11246
13444 11246 11694 11279 10649 13187 11194 9559 6565 1800 -4323 -6681 -6930 -799 4668 217 -3548
13429 -3548 -8038 -9245 -4723 2558 3920 4672 685 -4244 -6267 -3887 -4623 -6601 -5116 -2542 1631
13414 1631 5094 9166 14018 16116 13516 10633 -1205 -2644 -1440 2235 3796 7585 12972 11060
13400 11060 3944 -3109 -8173 -1815 4678 5508 3354 928 1974 5113 9791 4897 -5741 -3461
13386 -3461 -3744 -8646 -3543 6226 2963 -2388 493 5192 9211 3331 357 1181 1470 -1257 -1998 161
13370 161 5418 9117 5098 2381 1083 1429 3159 -1082 -4396 -6760 -11525 -12481 -13747 -14011 -3918
13355 -3918 -304 -7183 -5508 -406 -4888 -8480 -10043 -14665 -8875 -4222 -520 2792 -8629 -13446
13341 -13446 -8679 -7743 -3737 229 1308 2648 2600 715 -270 -3967 -2838 555 1288 3272 3922 507
13325 507 15 -3096 1741 5955 -915 -4228 -2356 770 1470 -2235 1821 2446 -3294 223 -238 -1016
13309 -1016 325 5602 5232 -459 -599 165 4364 6276 5322 2933 -1992 -1285 33 2247 2354 -73
13293 -73 2965 -1162 -7090 -6403 -6659 -7108 -7126 -600 2277 -1338 -2889 -2598 -5911 -6533 -4462 -6510 -6698
13276 -6698 -8387 -5056 -3043 -761 -1517 -6897 -9901 -6172 -7766 -12342 -5658 -5772 -6723 -3687 -1225
13261 -1225 1844 1379 -3152 -6258 -7026 -4929 337 -635 -1563 -6968 -5890 -3585 -170 582 -2350 -1513
13245 -1513 -2797 -10201 -11206 -8026 -3739 -6522 -1266 -3001 -5384 -351 5880 5588 -1076 -4037 -4124
13230 -4124 -1093 1104 3814 6801 14141 9432 5210 2615 -5251 -7025 -4802 416 271 -3177 -2973
13215 -2973 -4043 -5025 -5456 -4461 -5598 -3982 -2616 -3974 -4877 3681 3214 7179 6230 3602 -1546 -5181
13199 -5181 -9787 -6222 -3637 -5717 -4680 -13560 -12753 -9848 -4194 -4741 -4734 3460 12589 17485 18690 21932
13183 21932 35732 39400 30341 20801 14426 13693 11215 6726 7108 10083 11597 6894 2732 3404 4667
13168 4667 2626 521 3325 6406 11106 7811 5173 1861 2671 -1348 -1764 1285 -3043 -490 1469
13153 1469 4585 6899 6835 4915 4681 5943 4520 5203 13936 19337 22464 21545 32219 46383 59102
13138 59102 82622 102803 111329 107132 92105 71853 55692 46951 39586 30679 24348 18174 18151 21400
13124 21400 19438 20065 21250 15484 9304 2307 5259 8339 9130 6529 7662 6950 4211 2526 2458 -1375
13108 -1375 -3580 -4473 -3419 -5539 1509 10562 8394 11110 10812 8880 20236 25117 28193 34611 54252
13093 54252 83854 101139 114712 115174 95235 69034 50699 38916 26405 22507 17433 15956 16592
13080 16592 14546 19204 19432 16154 9463 6724 13663 8746 10519 12197 14589 8575 11650 9951 10119
13065 10119 13201 13117 2064 3174 3870 -2696 -320 -683 1917 4713 4024 5907 10853 11017 10307 9668
13049 9668 21001 23849 31193 35499 35122 28861 24700 22001 17394 12417 12569 8074 412 -3092 1285
13034 1285 13852 17570 7641 3881 4932 5492 2477 3296 6057 2795 -1706 -737 4249 3945 2144
13019 2144 995 -3626 -9429 -5604 -436 8861 8385 -442 -318 -711 -2337 -3018 729 1043 -6209 -3822
13003 -3822 5790 7988 1752 1276 2238 -4139 -6787 -2396 1906 1733 -1658 817 4843 4236 9500 2833
12987 2833 -3204 2854 7976 7619 1063 4665 8190 2728 216 -3833 -6646 -10979 -8636 -6316 -5981
12972 -5981 -3547 971 -758 -4330 -9558 -11440 -12427 -8638 -10150 -9936 -4399 2877 1697 1527 5969
12957 5969 5355 678 533 249 5066 3986 3305 3627 1630 1163 4951 5878 3400 -2303 -5850 -5843 -7198
12940 -7198 -7348 1693 7877 6319 5774 5693 5417 6344 278 -5497 96 -3754 -5470 -11521 -13998 -8490
12924 -8490 -7733 -9162 -7112 -5955 -2475 1425 2673 -1393 1638 70 -3800 -6278 -5749 1193 -2641
12909 -2641 -3859 -4327 -483 -350 538 -1721 -8298 -14189 -17162 -15449 -12516 -12818 -8595 -4635 -545 4194
12893 4194 4392 5924 3910 3292 1388 -5633 -13116 -11900 -8518 -13227 -15927 -10711 -2800 23 -1823
12878 -1823 -1707 -3171 -2816 -12120 -13819 -13118 -8641 -150 3916 -3356 -7529 -5921 -5817 -4428 -5778 -7594
12862 -7594 -3922 -3285 -4520 -5865 -4110 1938 -833 -140 6046 6174 3727 -4645 -2930 2564 3880
12847 3880 5345 6189 2034 -1805 2855 2486 -1419 4858 7721 9890 6562 4895 7549 11993 14669
12832 14669 9507 4003 -6892 -6420 -11427 -10816 -6082 60 -1145 -2732 -6499 -4393 2324 2132 -1105
12817 -1105 -3747 -3646 -143 -2623 -10579 -10242 -12337 -8019 -4268 -3354 -7501 -6053 -6496 -11521 -8534 -6156
12801 -6156 -2823 4234 3043 2187 5815 1839 -3370 -7657 -5695 -1268 6029 4519 6123 7336 8771
12786 8771 12790 3043 -1188 -782 -3581 1003 5332 8000 -1225 -5996 -8478 -4190 -2944 -14024 -17801
12771 -17801 -8478 -4027 -5978 -12778 -14077 -9572 -3025 -3456 -1352 3590 3880 3565 385 2232 5524
12756 5524 5484 2459 8548 7836 1108 -1671 -4466 -3846 1081 7314 3190 -6514 -12223 -9144 -7615 -4269
12740 -4269 -160 191 5830 8424 266 -3821 2416 5260 184 -1359 -1300 -4938 -4094 -4734 -4809 -4536 -3044
12723 -3044 -754 3509 1608 2112 3180 4782 5288 1451 -2907 -2951 -23 -3707 -4608 -3114 149 -1981
12707 -1981 -9538 -7739 -4827 1287 -3156 -5313 -3956 2220 2092 -1616 -2597 94 6546 6399 6605 1518
12691 1518 -4723 -9589 -13132 -11035 -13181 -13819 -10058 -9272 -10434 -10348 -5078 7819 4158 1011 2289
12676 2289 -2271 -11531 -13149 -12278 -8472 -3174 -1827 3917 5218 3001 -1321 -4855 -7600 -7056 -1889
12661 -1889 -2974 -4189 1768 -2435 -9343 -5237 -5784 -7081 -2985 -2880 -6865 -5366 -5082 -5032 871 -276
12645 -276 -2040 -3766 -5163 -12920 -13363 -8951 -3854 -4942 -7065 -5775 43 4291 7641 5826 2101
12630 2101 6642 2944 1866 1853 2396 -1034 3582 4546 3238 2305 5565 7122 2151 -4519 -6716 -4124
12614 -4124 -7688 -14911 -14368 -8823 -6982 -11719 -9602 -8033 -8242 -7166 -9418 -12397 -10430 -7568 -930
12599 -930 1479 169 -992 1309 3895 2671 7228 5864 4417 4792 9055 7805 2624 -3508 -3836
12584 -3836 -8911 -7516 -1833 -2269 -7563 -10061 -4257 -2043 -4207 -2165 2572 4764 -2575 -12343 -12750
12569 -12750 -9858 -6858 -4798 -6044 -5027 -3506 -7639 -7385 -4119 717 271 -1089 -4570 -9962 -7468
12554 -7468 1004 7298 7434 6671 6575 515 -5448 -5728 -3037 -951 703 200 3343 1459 -3738 -6226
12538 -6226 -9698 -14957 -11504 -5367 1393 2009 -5135 -8735 -13594 -8698 -3331 -3405 -8423 -8682 -6426 -3227
12522 -3227 -1885 -1576 -5065 -5191 -2889 -1508 -7352 -7655 -7391 -3802 -2301 -1420 2837 5137 -428 -6256
12506 -6256 -4965 -2220 3762 5609 3620 -5237 -4751 -511 354 -977 -9648 -9867 -9666 -9348 -7284 -2436
12490 -2436 1829 4661 1502 3099 4190 5383 8946 3661 -2763 -3864 2059 115 -2652 -3629 -6963
12475 -6963 -6528 -1364 128 -1908 -132 1371 -5380 -6964 -6824 -3977 -4351 -5381 -1931 4313 6938
12460 6938 11015 8025 5620 6213 6635 5376 2669 -1774 568 2703 377 3839 0 -4405 -6219
12445 -6219 -5670 -7333 -2389 5515 7652 3318 -7483 -8498 -3883 -4360 -7874 618 1435 -2830 -7935
12430 -7935 -6243 -4944 -7030 -4562 -7459 -5397 -1128 1131 -2307 -10725 -14443 -7365 -6787 -9564 -4951
12415 -4951 -6650 -8775 -5462 -2371 -284 -6656 -5634 -3649 -932 -5384 -7431 -703 -3649 -4409 -4376
12400 -4376 -6598 -1833 -939 -3172 362 373 3563 -1150 -8315 -6120 -5724 922 8166 7382 11237 8629
12384 8629 1379 -4618 -2338 -1403 -5698 -12810 -11915 -10057 -7403 -2900 575 -1352 -1487 5934 11526
12369 11526 5870 -835 -982 1960 -1885 -3751 -98 -4724 -5584 -1077 -5518 -1451 1610 4501 304
12354 304 -5434 -9118 -10335 -4563 1185 4980 6250 3462 -1149 -5912 -12032 -13457 -4933 5161 6703
12339 6703 964 -8135 -5924 -296 -4880 -3422 4754 2585 -2382 -3251 -1338 1844 2598 1226 1762
12324 1762 4433 7357 7436 1944 -3787 -1368 -1921 -2294 336 -676 -4180 1748 3776 94 -324 1921
12308 1921 -1157 -4504 -7037 -3303 303 5589 76 512 4009 3908 3308 4037 -1558 -7784 -5601 -3771
12292 -3771 -4013 -1562 -864 1995 1692 -2981 -3819 -3780 -2906 -1045 -2583 -10314 -11897 -4519 4191 10028
12276 10028 6523 562 -3973 -10286 -8000 -6463 -12254 -11454 -2671 -1216 618 6736 9906 13676 14734
12261 14734 14011 1342 -8426 -2779 552 1922 -3340 -4171 -1626 -4441 -6181 -3665 -771 1013 -3686
12246 -3686 -7541 -6146 -7422 -3804 566 -6875 -13264 -5654 1802 5206 9265 9783 3335 -211 -3261
12231 -3261 -7937 -3614 -4588 -8669 -5459 -2416 -3684 -2991 833 -4949 -6712 -5675 -4196 -3651 -3785 -956
12215 -956 3202 4212 -1977 -6830 -6918 -5188 -7247 -12078 -13924 -15284 -9590 -5886 -5545 -8958 -8303 -14572
12199 -14572 -14916 -7581 -4801 -5233 -133 9231 9969 811 -389 3877 1721 1410 -3594 -6188 -9762
12184 -9762 -7551 -10264 -6631 -6389 -10865 -15092 -10205 -4230 897 -1800 -12851 -11108 -8781 -5767 -2720
12169 -2720 396 3482 -549 -1238 -4241 -7475 -7859 -4659 644 -3094 -4032 -3053 767 -705 -1955 -5511
12153 -5511 -9294 -4743 511 -5368 -6430 -1880 965 -151 -3561 -7167 -9223 -6144 -2921 -600 6789
12138 6789 8683 2452 -3946 -8640 -4462 -5116 -3643 -4859 -4894 -9523 -10913 -14949 -13073 -8394 -6500
12123 -6500 -4711 -5860 -3170 -2958 -8425 -6951 -8125 -3478 -4191 3883 -3109 -2617 -4220 -7386 -4100
12108 -4100 -1096 -3653 -740 2987 -1812 -4167 -1739 -4279 886 -1405 -7434 -13484 -13951 -10621 -9312
12093 -9312 -5161 2519 6905 12257 5109 6070 4091 3642 2927 8031 10475 7952 868 4425 3882 -5064
12077 -5064 -5212 -5338 -8706 -9210 -10735 -13946 -7941 -5080 -7844 -10799 -6728 -8727 -1795 -2458 -6769 -3705
12061 -3705 172 3589 4788 2468 462 72 3045 -115 -5934 -9101 -3962 -5875 -8713 -3361 1612
12046 1612 3306 956 4831 4300 6019 4349 2876 -3459 -4033 1978 3214 -1616 -1872 -4524 -7682
12031 -7682 -9594 -5165 2304 3720 2646 3614 2916 -573 -5395 -931 -942 -7303 -9522 -7676 -9965 -6695
12015 -6695 -3458 -2075 -2539 -3187 -3333 -3717 -10066 -11558 -8582 -2108 159 -4882 -6764 -6536 -4567 -2663
11999 -2663 2620 2123 -3953 -2422 -2898 -6465 -7046 -4331 -5773 -4986 -1500 -216 849 5863 4607 510
11983 510 -4725 -7224 -1457 3523 6760 5800 3680 6067 6710 8326 6149 3089 5497 2570 -5018
11968 -5018 -1403 -484 2085 6242 13102 8541 3248 -1780 -6106 -10498 -2802 1474 3536 465 -6357
11953 -6357 -13018 -10537 -8059 -7499 -1287 952 2056 -3961 -7134 -5683 -2037 -588 692 2335 3973
11938 3973 -497 -10463 -8957 -5311 -6649 -3340 -3108 -6483 -8083 -4579 -1373 -3119 -1157 -151 -8110
11923 -8110 -13420 -4818 2309 6608 8692 4527 4163 -1574 -7819 -2314 -3839 -9980 -11537 -8850 -1671
11908 -1671 3765 862 -4537 -7793 -6174 -10054 -5312 388 4875 6954 3117 -719 2316 6378 5768
11893 5768 918 -763 -1720 -3523 -11427 -11729 -3775 -8204 -9460 -3171 1627 2640 -51 1820 -945
11878 -945 -2697 4246 2653 2460 1341 -1616 -2781 -2740 3661 7846 7230 4213 6701 4085 -2990 -1104
11862 -1104 -2761 -2729 3430 -1195 -4783 -650 -2681 -5002 -14265 -18675 -10899 -4399 -4244 -7188 -12158
11847 -12158 -5679 -2717 -1853 5795 4833 650 -2217 -7795 -9553 -9989 -11256 -15643 -8802 -8617 -6979
11832 -6979 -6228 -5040 -7808 -9912 -10465 -8851 -577 7695 11479 6714 993 -3343 -10074 -14732 -11998
11817 -11998 -10313 -6431 -9603 -9342 -4975 -3622 -813 -5515 -7470 -9621 -8945 -4875 -4120 -2338 -8302
11802 -8302 -9343 -4963 -5954 -8640 -6598 -2769 -11032 -12795 -4881 924 3930 -3548 -3332 -2024 -3794
11787 -3794 -5316 -5829 -11843 -11199 -3897 952 1352 4631 849 -6063 -10586 -12777 -9209 -8228 -6140 -9226
11771 -9226 -7455 -921 -2805 -4604 -6015 -8317 -9274 -2518 -291 4792 7653 5008 4739 1602 -8955
11756 -8955 -11276 -5556 -3549 -4314 -7064 -6629 -3719 1533 -6609 -5238 961 4236 5588 3155 -5516
11741 -5516 -1408 1824 1637 -2568 -3268 -1563 -306 -6158 -9381 -8035 -4152 -8388 -7785 2266 4941
11726 4941 6083 7063 6348 6838 10401 8180 7502 6403 716 -8579 -14990 -12750 -11659 -11554 -8293 -4570
11710 -4570 510 1665 -4034 -6823 -948 -2546 -2746 -3241 -2827 1670 700 -2857 -2669 -1124 -2437 1108
11694 1108 2018 239 -2369 -1636 -2129 -4265 -8628 -6873 -3355 -4542 -1178 -1237 -2747 -6381 -7807 660
11678 660 5477 5296 -2387 -9284 -6971 -1942 2644 2782 5306 83 -7094 -12026 -10072 -12986 -11091
11663 -11091 -5654 -2044 -3687 -3542 -7447 -5554 -4231 -2978 -168 -3834 -8725 -4620 -5295 -9002 -10541
11648 -10541 -9572 -2173 -739 -5234 -673 -2812 -7896 -545 4142 5686 8001 10810 9363 4111 4806
11633 4806 2647 -4144 -3881 746 1138 -5948 -7346 -3875 1325 3757 3656 2579 1072 -477 2887
11618 2887 2619 2046 -809 -3212 -6436 -2600 1380 229 -2011 352 4075 6520 5128 66 -3063
11603 -3063 -5801 -5617 -3227 -2908 -3506 -7478 -10846 -7672 -4255 -7410 -5491 -4996 127 605 -54 -8471
11587 -8471 -14451 -4881 464 -4242 -1943 -2091 -2270 -1161 1239 -1063 -8989 -9469 -7788 -7208 -9511 -5942
11571 -5942 -2816 -4297 -1508 -2861 -2847 6133 -38 -6195 -5895 -3739 2700 5929 3990 878 -9292
11556 -9292 -14394 -13356 -7292 -3490 -2976 657 -788 -1078 -3147 -3919 -3150 179 -1528 451 -2739 -8148
11540 -8148 -9927 -12800 -14539 -15471 -14620 -10216 -6525 -2130 -4248 -3514 2716 9189 -517 -3070 1830
11525 1830 7879 11707 1998 -4432 -1760 869 2894 -2231 -1579 -3302 -2411 1316 2230 2432 5770 6629
11509 6629 953 278 2681 -1495 955 2487 7710 8500 6680 1290 -4264 -3080 -2886 -1530 712
11494 712 2743 998 -3218 -3809 -1171 2275 2299 -242 -1976 -5597 -6362 -3308 -375 1218 -2948 -2265
11478 -2265 2569 5907 7816 1595 -7404 -7498 -9868 -13633 -13721 -7828 -3403 -2803 258 3923 1032 -6327
11462 -6327 -2081 -163 153 -3435 -6439 -4020 -1190 4490 4467 -126 -2172 2102 7279 8717 -764
11447 -764 -922 293 -7444 -12263 -10247 -6049 -9269 -16158 -11146 -8420 -3905 -434 80 -485 1444 7581
11431 7581 3717 1094 -5798 -10446 -9201 -2654 955 -3941 -9646 -9493 -6181 -6378 -6827 -5593 -11727
11416 -11727 -17701 -13526 -9477 -5324 -1599 -510 -1125 5794 5499 3280 -7947 -9545 -83 975 2775
11401 2775 -164 -6212 -6685 -7723 -7385 -6683 -3541 -2691 -1838 5147 5200 797 76 -693 813 -3394 -4410
11384 -4410 -428 -5645 -9648 -6832 -2241 -241 -3421 -6033 -9931 -11108 -7747 -6362 -4686 -10123 -11843
11369 -11843 -10303 -12230 -11486 -7095 -5651 -4543 -3622 -3479 -5340 -8051 -7324 -7668 -6100 -1062 2742 558
11353 558 -4975 -8179 -2778 4775 646 -3856 2 924 3484 1594 2647 3814 2036 2283 878
11338 878 2345 4169 -2617 -1280 375 -1698 -6495 -6683 -2364 -1012 -1850 2770 5924 4765 1516
11323 1516 -3326 436 2835 -3989 -2491 -1139 -4946 -8825 -5899 -5971 -2895 -5914 -10348 -6878 -7357
11308 -7357 -9695 -15593 -16846 -13206 -14136 -10484 -8033 -11337 -12752 -13673 -12116 -8823 -4586 -2274 -6207
11293 -6207 -10583 -14039 -14466 -12239 -11302 -10302 270 3535 1650 1049 -746 -4720 1181 8607 5188
11278 5188 1865 5032 5266 -1379 -4750 -3168 -4506 -4609 -2941 -3870 228 2231 212 23 -4111 -5648
11262 -5648 -2741 -1945 151 -4134 -4091 -6276 -6846 -2166 3025 519 -4001 -3312 -302 267 1565 2043
11246 2043 5309 6177 7944 5818 1557 -7109 -11069 -10717 -6942 -4212 -3570 -1862 833 3456 7902
11231 7902 12050 10311 1075 1808 10113 7233 -1114 -4878 -6269 -9542 -11886 -11837 -8932 -1686 290
11216 290 3034 -2706 -4266 63 2516 4337 57 -81 -3024 -8832 -11388 -7611 -7933 -5488 402
11201 402 638 3375 -114 -2668 -3033 -468 4951 9172 7929 7097 632 -8199 -7564 -1241 318 1047
11185 1047 -2597 -1139 391 515 -2448 -4584 -990 -6763 -5751 2413 2640 -1442 -5749 1255 -1999
11170 -1999 -3429 -774 -2763 -2846 -4336 -1806 1867 1573 -2515 2988 5246 -342 -5339 -7305 -3028
11155 -3028 -547 -1757 -5219 -7513 -7048 -1872 1813 2432 -1942 -5467 -1514 -3117 -1368 -2381 -220
11140 -220 1269 -3584 -9017 -10387 -9061 -4675 -2425 -1596 -7511 -6858 -9184 -7719 -470 -4929 -8218
11125 -8218 -9044 -9237 -10309 -9654 -6672 -6648 -1893 5891 6262 2069 -3064 -5586 1953 838 -2342 3382
11109 3382 12056 13260 9891 3190 -1951 -10151 -11076 -9035 -6483 -1000 -2985 -6005 -5012 -7307 -854
11094 -854 1226 -1260 -919 -2877 2351 2254 2861 3177 -485 -129 3106 -661 -2698 -5380 -8861 -11961
11078 -11961 -12734 -11662 -11910 -13357 -12870 -11917 -13831 -9344 -9331 -5485 -415 -3701 259 32 -1815 -4015
11062 -4015 -8259 -7576 -4864 -7067 -7105 -8841 -11994 -13700 -14664 -6057 -3865 -6202 -6719 899 3415 -4201
11046 -4201 -9238 -10533 -8198 -6967 -4598 -5737 -8262 -8750 -10004 -9392 -16814 -18324 -12807 -9745 -5651
11031 -5651 1031 2619 4470 -6200 -9320 -8694 -12318 -9341 -1467 -4560 -8872 -7634 -4002 4729 4482
11016 4482 1612 -4040 -4330 -6651 -4444 -2691 2530 -1497 -6045 -1084 807 6829 10817 10703 13952
11001 13952 7635 -3388 -7136 -8930 -8334 -2708 -6863 -15060 -13872 -8013 -8146 -9311 -7678 -9302 -8686
10986 -8686 -7270 171 681 -4068 2835 -3763 -2165 2679 -633 -2322 -3916 -5719 -11371 -11618 -8629
10971 -8629 -7335 -8401 -10923 -8819 -8402 -2973 4676 2693 -867 5969 4906 -428 -1876 -5240 -2178
10956 -2178 3394 2512 3633 -2701 -1686 4621 8668 10476 7451 783 1353 -536 4037 -2103 -9222
10941 -9222 -11964 -9094 -8723 -10294 -11486 -11397 -6328 -7102 -6119 -740 1585 -5271 -868 -620 1269 -4995
10925 -4995 -8148 -13208 -15751 -7136 -1519 1005 -412 -2879 -7724 -7202 -984 -1368 -4254 -4188 -3790 -5513
10909 -5513 -5844 -5250 -7223 -7666 -2912 -2132 -6108 -6291 -2160 196 519 2861 1786 -2914 -12847 -10306
10893 -10306 -2496 2883 -3754 -5722 -5702 -5535 -6062 -1710 1265 -2329 -4032 -2516 -5324 -9381 -10907
10878 -10907 -11543 -8935 -6894 -4530 -3478 -6079 -3055 -4767 -7259 -5328 -8062 -3782 -5157 -2959 -118
10863 -118 1879 9212 7756 -98 -2741 -10771 -13566 -9941 -5381 -5967 -8720 -5826 -5392 -3950 -2876
10848 -2876 -2362 -1609 -4669 -653 571 -1619 -7249 -5284 -1416 1033 4534 4776 -1159 -7259 -7338 -983
10832 -983 2513 3489 901 -2851 -2311 -5624 -9904 -7550 -190 3046 2186 639 4535 6574 3563 -3034
10816 -3034 -8970 -9019 -6929 -7260 -6585 -3570 -8563 -7288 -4075 445 -184 -1562 -2993 -2010 -4225 -4657
10800 -4657 -8597 -13376 -8968 -11290 -10762 -6226 -1231 -7166 -12631 -13732 -12977 -7464 -2791 -128 -548
10785 -548 -8290 -13504 -14445 -16045 -11869 -7595 -7355 -8139 -5008 -2396 -1614 -4150 -4603 -4077 2098 -2508
10769 -2508 -5750 -516 4679 4687 5801 10361 13229 9385 4094 -2504 -8859 -7590 -6188 -4443 -4689 -3630
10753 -3630 -3638 -3398 -7104 -3011 -1068 -2612 -2463 -2460 -2945 -3154 878 453 -1760 -5227 -5541 -9667 -17428 -21961
10735 -21961 -18363 -14144 -9203 -3751 -8076 -3583 -6252 -6625 -789 -107 922 1923 1899 4473 757
10720 757 -5975 -5388 -4320 -2127 -2228 -2061 -5009 -7965 -10348 -13249 -11891 -7587 -7120 -1679 487 1800
10704 1800 -650 -3804 416 -1615 -4737 -3205 -1588 -5136 -8067 -9769 -4301 -4786 -5704 -3203 -2154
10689 -2154 -347 -3468 -7822 -8214 -11445 -12336 -6830 -1689 -2564 -5797 -9539 -10643 -11891 -10401 -6582
10674 -6582 1457 4631 2528 1949 1578 3607 1047 -828 1005 359 -6011 -9329 -4245 -3045 -7794
10659 -7794 -1552 17 3249 725 3021 4712 1563 -257 -6970 -14534 -3659 5277 3501 1965
10645 1965 -70 -2232 -3815 -5292 -5382 -8734 -2745 2287 3020 145 1558 -1165 -1346 2743 5554 3398
10629 3398 -2927 -4017 -9304 -6033 6269 5163 2584 139 -1688 -8963 -10372 -11466 -10550 -12205 -12620
10614 -12620 -10382 -1188 4945 3239 2998 5050 5836 4133 4744 4563 -769 -6797 -4579 -6273 -8659
10599 -8659 -10538 -4991 -4285 -6259 -6621 -5237 -1166 -4718 -3402 -6223 -12536 -10634 -6096 -1684 1415
10584 1415 2874 -2437 -5107 -2347 -405 -8512 -14277 -8041 91 1063 1589 -214 -2893 -6694 -11952
10569 -11952 -9849 1291 5743 3318 6141 9241 4695 -1908 -3374 -1336 1817 1264 -749 -7680
10555 -7680 -11136 -6189 -4054 -7101 -5563 -3475 -5178 -7615 -4050 -2987 -5940 -7551 -4231 -3416 -9322
10540 -9322 -640 6845 1725 -2790 -8053 -8666 -10560 -9274 -469 5172 4692 3657 931 -1798 -10982
10525 -10982 -16121 -13897 -6950 -3743 -1987 -2302 506 -3840 -4415 -3104 -2643 -6949 -4830 -1208 101
10510 101 -6825 -12596 -10882 -11035 -12964 -6129 -7016 -9414 -3247 584 2031 829 371 -1746 -3948 105
10494 105 2027 -2818 -9109 -10417 -8534 -10046 -11205 -7407 -4636 -4990 -6753 -5213 -53 -908 3675
10479 3675 2295 -1984 -4637 -4359 222 2944 -194 -2096 -1368 -2173 873 1209 1701 -12 6537 15960
10463 15960 14222 5221 -2517 -5175 -2758 1739 2242 -1308 -2600 -3140 -6019 -3527 1324 -164 -2785
10448 -2785 -4371 -7994 -7424 -9148 -8965 -6245 1350 1743 -1199 -3059 -11307 -13479 -15859 -8181 -3097
10433 -3097 938 627 -3015 149 -312 2073 3594 3760 7466 4769 835 -1576 -1234 -2550 941 -1936
10417 -1936 -2054 -5327 -6610 -5105 -2445 690 -2034 -3198 -359 3973 3224 1949 7157 9103 14979
10402 14979 8435 -2416 -10250 -7736 -9577 -12887 -17283 -10277 -9611 -13855 -7919 -8145 -9292 -10096 -9805
10387 -9805 -7253 -451 687 -6537 -9966 -5065 -3707 -3133 -6293 -11167 -16412 -10253 -5921 -6103 -7044
10372 -7044 -6850 -4539 -6105 -10117 -7925 -5994 -3345 -1217 -3646 -1920 2256 946 -1087 -1331 -847
10357 -847 -3685 -922 -2550 309 5151 2321 -566 -789 -1692 -2625 -6787 -687 3391 2354 -4435 -9100
10341 -9100 -5535 -4566 -4579 -4696 -4354 -4355 -5195 -2642 -1370 -4431 -4149 -396 -4230 -8844 -6553 705 3072
10324 3072 3136 1825 -2799 -7779 -2729 -4067 -2967 -1607 -536 -2409 -5051 -2190 -2789 -765 919
10309 919 -2186 -5117 -798 1550 -1342 -3616 -7219 -7325 -4052 -1523 -2839 -2243 -1611 -3613 -1403 -408
10293 -408 -4245 -3362 2601 -741 -1024 -1782 -3142 -3411 -5743 -8018 -4264 -1319 6871 15657 13679 3329
10277 3329 -863 1259 7683 5925 -3223 -10460 -15408 -13633 -12965 -7764 -8438 -5668 -7214 -2562 3849
10262 3849 3633 -4423 -8426 -7089 -5962 -12264 -14826 -15955 -14366 -10207 -4018 -4901 -7813 -7261 -8186 -10217
10246 -10217 -8974 -12548 -9138 -6026 -6972 -4376 440 -1868 407 2901 -3071 -4689 -8096 -9970 -13363
10231 -13363 -13514 -14830 -13239 -11260 -10954 -8426 -1593 -2350 -347 -5239 -9892 -11249 -4914 -3933 -5758
10216 -5758 -3579 6868 8556 3588 5015 5593 6386 10808 11735 9199 4651 -2749 -10491 -7713 -4141
10201 -4141 -3038 1193 5103 2132 -4114 -3293 1318 -2501 -7224 -11498 -5289 4161 8732 8481 3988
10186 3988 -416 -3062 907 1357 -3601 -9192 -12191 -13080 -15300 -13468 -16200 -10804 -12097 -12077 -8455 -3053
10170 -3053 -2180 -3397 -3404 -7850 -7112 -8921 -14716 -12961 -10085 -6940 -11070 -11372 -4553 -7749 -8684 -6307
10154 -6307 -2728 -3940 -1523 -1741 -2043 1207 -4641 2637 4776 -2496 -8030 -5648 -8667 -2921 -3050
10139 -3050 -1540 -1474 -2422 -39 1062 274 372 -3128 -7697 -4350 6533 6214 -3333 -6547 265 1145
10123 1145 1256 -3121 -6709 -3208 -1551 -6088 -3609 -1283 1434 3699 2746 695 1502 -2827 -3471 -1458
10107 -1458 1100 -1942 -3663 3362 3870 3739 5395 4309 1513 -1052 -1242 239 3241 7072 5133
10092 5133 5215 7243 4547 -1008 -3658 -3851 -9146 -7375 -5558 -3466 -3557 -4806 -10525 -14772 -18609 -7825
10076 -7825 -389 11 -3802 -6722 -6606 -4692 -11474 -18144 -15113 -6630 -3665 -2370 -6412 -10586 -11578
10061 -11578 -10077 -4359 -1582 -2993 -2860 261 -741 3698 1536 -1581 -381 -364 -1352 -3303 -1106
10046 -1106 -3029 210 3341 158 3121 1053 1698 1107 2095 7490 9730 10064 7951 9625 10644 8914
10030 8914 6301 2457 6870 5423 3815 628 -3445 2492 2246 -4206 -2657 -8378 -8987 -10800 -9481
10015 -9481 -8308 -5859 -5195 -4455 -1146 -2735 -3335 -2553 786 -1111 -1638 838 3561 -757 -5377 -4954
9999 -4954 -5833 -9944 -12345 -3653 294 -2942 -1715 -3102 -3056 -3113 -2948 -2842 -3365 -2911 -1499 2944 3211
9982 3211 1331 -350 789 8073 9742 5157 -5602 -3961 -2352 -7733 -6603 880 637 2981 1195
9967 1195 -30 -1622 -6640 -9452 -4875 -4430 -3179 -565 3177 3266 357 4572 853 -1316 902 6710
9951 6710 7271 4636 4276 3579 -1653 1897 -544 1073 4569 9418 16722 16740 11048 9901 7740 4575
9935 4575 -2926 -2710 -5847 -5423 -8318 -1915 -3986 -1899 5754 12195 8379 1558 -1948 462 3510
9920 3510 7971 8616 3311 2231 5105 4124 1291 -4045 -5918 -7675 -11752 -12293 -7514 -3413 797 4831
9904 4831 6514 11500 9231 7318 6270 2366 -3151 -1087 -3795 1414 4616 3546 5920 4361 -780
9889 -780 -1807 -2875 -4671 -2064 2675 1698 929 2823 3300 5714 8032 8311 6931 7410 2707 5163
9873 5163 8824 10168 8263 6495 10131 5795 -362 -541 4843 2283 4735 5811 3840 -18 2551
9858 2551 3450 8179 10555 13281 16316 13714 15784 18030 22910 24452 21986 27784 38128 44597 47070
9843 47070 50046 47088 50553 62632 73957 87027 110001 141070 176970 238624 335429 460752
9831 460752 563198 564586 462866 340249 256733 208895 187850 179467 170087 173386 180598 189012
9819 189012 197378 213672 234419 262850 302647 347437 393206 454511 540437 648992 782368
9808 782368 946247 1142314 1351740 1524736 1592576 1522541 1349966 1146405 962856 811462
9798 811462 693776 601555 518520 457756 407217 371601 339675 306711 277958 257325 241109
9787 241109 237507 224579 212623 198655 185720 172790 160524 153941 146129 135649 121681 109397
9775 109397 104507 101816 94019 87262 81815 81629 74677 61255 57222 55303 57239 57274 58846 56508 53129
9760 53129 50054 41776 32825 27109 21920 25347 22827 25602 27070 27043 29215 25474 24827 22619 15726
9745 15726 9893 6742 13930 15243 12580 11768 13188 18166 21470 23787 16297 12659 15727 18314 9927
9730 9927 4267 4310 10888 10925 7964 2534 -3511 -7236 -9772 -1650 957 269 3387 7472 7806 6937 10972
9713 10972 10794 9293 6061 -2690 -2931 3577 2591 -931 70 -1078 -1358 -1054 -8726 -7920 -1721 4135
9697 4135 6426 1767 28 7869 10898 7181 4824 2836 -3481 -10574 -9670 -5975 -1874 -819 -1633
9682 -1633 -141 2477 -1688 -3187 2787 404 123 3619 7429 15186 17451 11055 10689 7025 6680 6838
9666 6838 4493 7040 5756 861 -5653 -4232 -2756 1823 -9 -2040 -2825 -4108 223 4349 -6197
9651 -6197 -8495 -4277 -3512 -7672 -8804 -13257 -9204 -4916 3432 10483 12956 4570 4387 8002 7992 5930
9635 5930 7130 6213 1149 -5011 -4781 2878 -505 -2769 -3453 -6425 -11386 -11539 -2556 -2116 5194 1328
9619 1328 3774 6816 3091 2237 1099 3453 1317 163 882 -4432 -2307 820 -2769 -5715 -6657 -8213
9603 -8213 -7105 -1255 9691 7535 545 219 5115 7847 6535 5115 -1816 -9340 -3391 3815 6536
9588 6536 6372 8701 5876 9275 16674 13727 2477 -7612 -9669 -6624 -3964 -5431 -3832 -3267 -3760
9573 -3760 -3415 -7470 -9638 -9165 -5618 4003 5246 1316 -384 604 -704 -1317 3011 1105 -9651 -10626
9557 -10626 -6089 -3459 -2058 -3008 -7138 -2689 -357 -1332 -5435 -1197 4617 8230 11436 3642 -3840
9542 -3840 -3935 -1730 -325 5217 11352 14768 9287 3946 2127 4707 4315 5849 977 -2479 -1819 -1009
9526 -1009 -68 3230 9187 11166 6949 7416 12506 15679 13935 6025 -287 -4628 5569 9660 13986
9511 13986 13020 3397 -2217 -5902 -7746 -6859 -5701 -6720 -4531 -54 728 695 2713 136 2538 2983
9495 2983 -2984 -2188 -637 -2995 -4515 -852 38 8182 7814 4792 9146 11014 6448 1556 5663 4119
9479 4119 -452 1015 6733 4327 4956 6377 1627 -1642 261 -4540 1287 6980 4235 -75 2 6050
9463 6050 6062 5167 779 -1749 -1639 1784 6350 8167 8991 3240 -2479 -5628 -6727 -5243 -1331 4673
9447 4673 -2428 229 6758 1511 -534 -2855 -4539 793 1865 1521 5008 9312 1042 -427 1060
9432 1060 2498 1150 1264 -574 -916 -1838 -4983 -11629 -14872 -11410 -4244 -575 -6099 -5005 -734 6562
9416 6562 7142 3198 -246 -2410 -595 3347 646 -3072 -7264 -9334 -8184 -7680 -6406 -7696 -11984
9401 -11984 -10127 -8441 -6653 -6799 -8884 -10280 -6101 3217 22 -3017 -4153 -2628 -2153 -2438 1016
9386 1016 -2666 -7779 -4119 1996 352 -5461 -7983 -9732 -10376 -1669 4571 -3385 -17848 -16412 -8495
9371 -8495 -1600 -5434 -7912 -9101 -3879 -5499 -7985 -7001 -4193 -7258 -4205 -2901 -898 2764 3862
9356 3862 -1531 -1820 482 246 98 -4923 -7479 -3004 1836 8574 12506 8108 -753 -1583 -2476 -2793
9340 -2793 2573 -602 -3713 6906 9014 11582 7885 10167 12872 9023 307 1166 5606 8567 927
9325 927 -1554 1846 2424 3100 4583 3262 -2765 -2928 3364 7457 -676 -5521 -5980 -11802 -12739 -10898
9309 -10898 -3676 1827 975 -103 -3076 -2761 5248 6340 -475 5385 5453 -2071 -7871 -9072 -1123 4729
9293 4729 3871 1603 2588 -6580 -5718 -3394 -3176 -5396 -2947 -3578 -2978 32 8795 8141 1317 849 635
9276 635 1088 1811 4444 786 -2383 7379 11516 4398 3951 3899 113 -3854 -388 -177 -1312 -1535 -6764
9259 -6764 -6400 -6267 -4969 434 1403 6467 5904 5068 2193 846 669 409 2707 -5551 -7603 -4473 1150
9242 1150 6455 7016 1458 5917 12448 14469 16892 14893 13106 3688 -2953 -5097 3117 9498 10178
9227 10178 9140 6677 3287 6283 9052 12584 18220 18431 14765 14057 14200 13395 8282 5320 7471 8094
9211 8094 1792 -3664 5051 11193 12666 11916 14403 16016 16895 18413 19763 19546 18897 17763 15178 15261
9195 15261 17618 16723 17924 29402 30129 27480 21218 15443 12022 9395 11809 17749 18720 16970 11240
9180 11240 6055 5010 4591 8545 15467 14874 17812 17303 12657 12354 11249 5514 6036 7361 5829 5741
9164 5741 1284 -4358 -147 3544 189 -4989 -5108 -1378 9097 11176 4138 247 -7465 -15094 -25454
9149 -25454 -35524 -36612 -24629 -22744 -27043 -25096 -24113 -22918 -24954 -23486 -19330 -18428 -17928 -20867 -21631
9134 -21631 -14365 -17756 -21298 -18668 -6854 65 -257 -3084 1674 -1382 -5096 -7150 -643 4719 2497
9119 2497 -2455 1976 11388 15745 20427 23017 23077 23540 28256 29795 28468 36342 43203 52379 57598 60975
9103 60975 66957 72760 75836 90329 110795 130656 149074 181624 211182 249695 303033 365763
9091 365763 456997 573238 705784 839291 965994 1057810 1105065 1094171 1026884 925201 803020
9080 803020 675832 560405 462044 397360 351677 312566 280259 248571 227302 217539 203902
9069 203902 196959 184396 175430 171024 164213 153854 150670 142474 124663 114728 107704 97707 88867 83126
9055 83126 72545 66744 62177 59271 60152 59707 52688 45238 48963 53161 54250 47064 38407 34823 39932
9040 39932 44070 47769 51571 56948 56609 54225 52095 46849 40747 41745 39674 35378 31278 28526 29310
9025 29310 30883 33310 31842 27307 20295 20405 21739 26342 28311 27886 29180 24091 19260 14534 13820
9010 13820 12510 10640 13183 21136 26690 27961 27254 37798 48128 55156 55289 51373 45071 37267 42098
8995 42098 40989 38915 35120 32786 31409 31827 31739 38353 37309 32030 35060 41649 34146 26514 29070
8980 29070 30111 23913 21108 17074 20299 24371 28054 32090 29006 23264 21892 21977 26313 23325 23061
8965 23061 23376 27200 31339 31082 32320 39799 50986 52230 50244 57351 70589 78269 82767 99882
8951 99882 112913 134133 158156 170511 185580 201719 212061 215396 218836 231454 257463 285090
8939 285090 287585 266496 245457 222725 193708 150116 114418 106268 96442 89744 82455 76171 67459
8926 67459 61358 57813 50508 54694 56018 48877 46386 51913 53690 42659 37839 29206 24236 21716
8912 21716 23228 34742 47000 53545 59863 61080 62293 69346 73214 72242 64772 59878 61323 55042
8898 55042 43951 47184 59610 60351 57775 58344 60543 66018 63391 62488 58636 58209 62441 60826 71564
8883 71564 83678 91741 92959 95787 101036 99366 87102 60623 41896 44019 57885 65957 62082
8870 62082 58883 49789 49660 62500 66671 64896 60863 49253 33599 31020 30601 32202 38981 47553
8856 47553 54247 51578 49708 48825 47188 37942 26874 28132 28821 36982 36087 33146 37256 37665 49121
8841 49121 82690 115562 113016 92751 78677 84425 94909 93492 93971 98951 111192 124695 145710
8828 145710 167611 182646 203817 227268 241057 260334 275480 296561 322353 355341 386302 406903
8816 406903 418255 432059 454543 489497 527011 530858 465636 351694 256395 203516 175816 165268
8804 165268 162589 153042 135000 121167 121842 132193 143136 157983 164300 168607 171040 163472 174248
8791 174248 185916 199517 212954 233438 252480 264430 274139 283052 297217 312074 330408 339332
8779 339332 345741 350199 364111 377083 387003 397226 399391 394682 392135 390034 384657 377136 371099 375636
8765 375636 381259 388133 406211 420260 435269 450331 468078 489175 495935 497648 501720 507526 513482
8752 513482 518586 532146 551364 572466 588529 602748 611839 624710 636201 661951 697701 731105
8740 731105 764498 778110 770715 753638 730593 715211 722309 756942 797221 856162 926352 993620
8728 993620 1054643 1094605 1123833 1162811 1239106 1353151 1499677 1634720 1735264 1821878 1911573
8717 1911573 2009897 2121975 2256054 2403143 2573748 2784224 3045161 3370189 3765569 4219259
8707 4219259 4759442 5432558 6313034 7454315 8904317 10746009 12968787 15453552 18152245
8698 18152245 21020164 24074538 27536259 31800856 37533849 45229683 55522763 69528380
8690 69528380 89309712 118613243 162724724 223492313 284446102 302430795 254962576
8683 254962576 187530000 137694827 106114018 85805902 71921023 61912092 54477907
8676 54477907 48890449 44747547 41768325 39584931 37565018 35099587 32431402 30147945
8668 30147945 28327625 26846772 25601326 24329526 22816727 21149151 19522668 18032362
8660 18032362 16676967 15415963 14248558 13184369 12220871 11354944 10573486 9859466 9206379
8651 9206379 8619774 8088461 7626127 7248653 6901442 6533129 6139073 5754437 5408820 5104403
8641 5104403 4832094 4569951 4321541 4080066 3838906 3609527 3381716 3155949 2945977 2760909
8631 2760909 2612925 2504060 2422032 2351981 2262385 2139473 2003556 1886889 1783204 1687747
8621 1687747 1612819 1549423 1496811 1441097 1385348 1331230 1276596 1212461 1156074 1114634 1079992
8610 1079992 1046122 1020078 994603 969419 940856 906821 874040 848575 819048 782713 743853
8599 743853 711548 688015 659048 639280 627293 626243 620422 606057 583440 571604 559153 557671
8587 557671 572018 582250 599957 637027 699095 742271 708839 626917 561523 517747 485798 465147
8575 465147 459800 477760 498757 511229 520169 521876 519975 515418 506568 495942 489370 468830 437197
8562 437197 383966 315607 249287 211948 213501 236719 250484 240989 225980 213918 214550 220830 226758
8549 226758 226742 225639 220429 224065 225908 232479 236576 243331 255116 271948 292589 332828 372062 374504
8535 374504 340912 319947 304296 294359 292638 299235 306494 306977 311858 326428 332929 333154 336556 336113
8521 336113 331094 322165 312804 312359 305978 305172 305032 306995 309779 311189 305451 299865 295603 291279 285835
8506 285835 278996 266599 255179 243708 244886 242206 237032 239332 239349 235251 230399 231412 215869 189063
8492 189063 170912 172068 178793 180786 180458 179311 177603 182169 183980 175504 164024 155004 150345 145639
8478 145639 146939 149072 148957 143396 142582 144011 145524 134812 128418 123962 111696 103379 105008 108697
8464 108697 110717 114180 112761 114334 115551 116756 118673 115111 115954 111763 103500 95691 94259 97581 101869
8449 101869 105582 109698 119774 120813 113724 111573 113866 118858 122467 125632 132335 141202 150171 149830
8435 149830 147836 147760 143342 131182 116347 110225 112826 110727 109925 107557 97831 92669 84917 76455 79657
8420 79657 79679 78858 73611 70100 68099 61498 55229 59975 65602 66807 70481 72018 68765 67970 75766 82182
8404 82182 81224 84827 89578 90174 88176 86647 86057 85558 81076 83975 82756 85475 86276 87372 86629 84282
8388 84282 76574 75913 73809 69891 65920 67803 70751 77233 75568 71769 78505 84195 83141 77385 69152
8373 69152 63346 61207 56196 51206 52155 69491 86077 89352 86340 83368 83770 81879 82935 86318 92862
8358 92862 93092 96135 93570 94295 91675 89441 82851 80332 78856 80608 83522 83997 81903 84061 79086
8343 79086 70008 65625 67545 64412 64112 61561 61314 62131 56996 53142 53573 56420 62907 66799 64058 63977
8327 63977 65942 63794 68782 71957 73389 74547 69648 72522 73347 72066 72546 70777 67907 67999 66994 64820
8311 64820 61931 60682 58262 60025 62011 65663 63780 64167 67918 75578 79258 82251 91963 97336 103503
8296 103503 113854 125875 140516 164911 185592 210210 241059 274091 317742 386954 475211 583447
8284 583447 715824 857978 990903 1087087 1130633 1112419 1046375 939266 809205 675345
8274 675345 561070 469415 406855 360429 321713 292918 265752 245088 230353 215576 207502 193919
8262 193919 178260 169168 161800 158749 156379 148106 137067 132827 130364 128379 126309 125828 118742 111804
8248 111804 105964 100941 93067 94409 86333 84720 84470 82675 80268 77825 83138 88880 91364 85198 81589
8233 81589 85087 89732 91977 90539 94027 97265 93713 85583 87516 92422 95510 95701 84904 76163 67896
8218 67896 64999 58553 47490 43094 45127 54190 59610 59972 62864 66397 57058 49182 42640 41773 40463
8203 40463 41069 40034 38175 32413 24660 23526 22465 23412 29969 29615 33558 34456 31493 34277 37950 34838
8187 34838 33122 30962 26237 24875 24073 25870 30126 33386 33627 34137 34148 37903 40192 38940 37775 37677
8171 37677 34516 31030 26452 19913 26257 33398 31175 29828 29133 32902 31257 24653 21974 24933 28510
8156 28510 26089 24430 20479 15199 16969 17138 19293 20173 19620 21581 19565 17634 13745 13304 15710 10057
8140 10057 14247 20680 24743 19371 23614 30524 30626 35712 36650 32943 32419 29697 20849 18543 22083
8125 22083 23503 24885 28246 26936 27605 33960 37898 38073 34697 28808 24237 19807 21376 23266 21971
8110 21971 21370 19653 25177 34224 31046 25990 27007 27950 30198 29680 31865 32454 29571 26187 20975 22909
8094 22909 29557 33275 34782 34171 25610 23521 26794 26411 22215 23656 24960 23719 28368 37791 37743 38261
8078 38261 35770 26007 24421 23004 24111 30635 39688 35465 28236 27660 25304 23199 18115 19621 28747
8063 28747 33781 29936 25483 20629 11894 10920 21802 22848 21561 23220 22144 25036 31171 32447 30166
8048 30166 30524 26731 23664 22905 22999 16258 14764 21006 28997 28629 30161 36124 37879 39697 39245 40127
8032 40127 44034 40245 41141 45642 46440 48246 53729 56862 55630 50858 48660 43618 48230 52854 55281
8017 55281 57796 62506 65675 66710 66444 66286 71406 66964 60473 55478 53547 53993 57594 60423 56319
8002 56319 53076 48077 53705 53015 53588 59859 60104 53381 57071 60662 67099 75494 82731 88309 98668
7987 98668 114573 127018 138558 156213 169160 168490 155649 136148 121517 111864 96118 92613 91560
7974 91560 94778 100343 109292 120063 121892 112367 96127 84801 75721 70988 64314 57853 57789 56758
7960 56758 56387 56097 58899 61623 57555 56464 57303 54429 55163 55134 55821 62487 71089 75005 72581 72439 71974
7943 71974 82531 97177 115272 127941 135766 139437 141465 133010 120041 108429 94271 92019 96879
7930 96879 101504 110272 112279 99836 88360 79310 72327 68311 59516 53726 46053 39489 35912 35649
7916 35649 38617 43337 41658 39518 36438 36107 35726 34593 34102 38899 42438 40350 35923 38915 42605
7901 42605 43524 47583 50033 55747 54951 52679 51238 47411 44479 44349 39708 40401 38875 43009 37856 31840
7885 31840 29515 26293 22098 15897 13332 14745 14576 14558 16274 14122 17036 19098 18040 17118 17046 17942
7869 17942 23232 17021 9445 4416 8179 13179 20856 18806 14256 12328 5165 6340 4353 9564 14978
7854 14978 6792 6453 9210 5243 4054 5303 9084 7249 9594 16537 14087 14341 13202 10710 9564
7839 9564 6013 8511 14890 12409 4633 786 500 6083 7157 10737 12645 8971 10323 9970 13208
7824 13208 15165 11267 10521 18015 21122 21838 18150 15114 16497 15347 14095 16887 16335 17330 16309 13187
7808 13187 8757 12370 14333 14365 8813 12896 15276 11069 13028 15441 13631 9506 11690 18883 22660
7793 22660 16512 10690 15045 20031 22798 16756 16834 15184 7271 8382 2731 -356 1363 -232 -2397
7778 -2397 -5998 -6121 4383 10317 8547 3916 1906 1822 317 -3419 -4573 -1893 1267 2663 6671
7763 6671 11168 8617 10947 12475 2271 2829 6431 7680 9835 9602 4143 3019 -374 -1731 -2076
7748 -2076 -833 4857 13036 16077 8870 6980 10581 13179 14297 9792 10756 13621 9435 4462 8586
7733 8586 14140 10795 13759 11870 7008 12095 16958 21105 14113 10515 13395 13236 15095 13100 10797
7718 10797 9624 13108 8495 2180 -1380 -3879 -199 4662 4292 10595 15196 12862 13652 13662 11537 10214
7702 10214 8015 5372 -479 -4819 -6676 -7373 -5761 -864 4496 6372 1278 1713 10461 12358 11568
7687 11568 8237 2820 7270 6701 1707 3766 1728 1950 573 3717 9570 14266 16138 15384 17776
7672 17776 15605 8142 9981 9291 9168 16065 18236 13764 14600 10951 9962 11944 16086 14919 12860 9646
7656 9646 11768 16916 11182 7901 9348 13206 10134 5039 -1868 2987 5327 8425 16504 18525 17614
7641 17614 18620 20360 20346 16540 14271 14935 22041 18912 8017 9076 9502 11239 6432 10436 11777
7626 11777 8301 7629 9651 6842 3982 4667 12946 8708 9674 1501 -866 2543 8302 11111 9418
7611 9418 7353 7187 13290 14678 12511 10709 7084 9835 17267 14363 10230 11266 7214 8589 9314
7596 9314 7919 3616 -1062 2460 3893 3097 535 2447 2952 6415 13723 13885 8353 9129 10862 14752
7580 14752 10705 6378 2316 -495 -1965 -1546 4812 8981 11233 9775 7987 5532 8598 10692 8409
7565 8409 10026 14334 9580 7338 8294 12162 10226 6895 3361 4254 4038 7357 6723 4507 -1397 -2484
7549 -2484 1375 4918 7478 12860 15413 20580 21966 12250 10278 8012 4008 12565 14918 6503 6896
7534 6896 14858 14837 10363 3241 5779 4711 6606 3982 5256 7288 7975 8834 9287 12187 9799 7658
7518 7658 9249 11150 5953 6014 5852 8598 13228 20025 18018 12919 13514 12359 7203 9296 13921 12806
7502 12806 7944 2441 3607 16494 18568 8141 8481 9535 13615 10697 9316 14430 17342 16240
7488 16240 12017 12923 13259 12504 9260 8556 5915 4637 -615 -2782 3105 2746 -469 4957 -1376 -4523
7472 -4523 -958 -540 -3 -2495 -3185 -1185 6097 8868 6498 5789 5536 2180 -2501 2147 13061 16986
7456 16986 7987 4159 3652 3907 4695 6655 7634 7141 3938 5235 7939 9179 6226 1765 2854 991
7440 991 -25 -4128 -6269 -3364 4877 10667 13309 11297 4486 4190 5588 8615 6693 5353 9660
7425 9660 15131 15503 13024 6372 12709 14956 14548 19450 22286 19148 16876 14467 11001 11057 7799 5692
7409 5692 10447 13135 9629 10330 13464 12583 -638 -3963 -3866 -1760 3290 7841 9128 16103 14392 13755
7393 13755 14051 5793 3891 1233 1082 5517 7473 590 -2982 208 -1610 5276 11108 1345 -3239
7378 -3239 529 161 -7480 -3388 -3749 -822 5198 4674 6670 7733 11190 5889 -831 -5848 -4459 -2968
7362 -2968 1840 5146 2927 -4363 -2152 554 446 4972 12812 17481 11204 6658 2957 4730 12940
7347 12940 12217 9961 7213 7413 5191 -1948 1804 2157 2844 8092 14361 14076 8518 5671 6567 10893
7331 10893 13837 11346 7296 9075 11859 15178 14209 10167 13366 17322 16328 8808 6716 13450 15476
7316 15476 14494 6172 37 -5137 -906 1993 8394 10434 13103 13534 12593 7727 -1638 -578 5073
7301 5073 6007 -843 -2937 -892 811 -2052 -4651 -5956 -2912 6227 4124 -2844 -2846 4377 13162 9077
7285 9077 7451 8705 7620 3478 4960 11537 3697 -3416 -5985 -1540 6400 9469 11994 8518 5368
7270 5368 8083 6422 4771 5332 1044 217 1656 3084 3183 2934 8117 9265 5894 9883 13212 15736
7254 15736 12536 4340 1559 8452 5772 7055 4675 5983 7180 7327 5304 4319 1593 836 1774 1246
7238 1246 3028 2446 4924 6280 8392 8437 8208 7337 6971 9070 7525 6491 -647 -5650 -3151 -1932
7222 -1932 2341 2942 5742 1056 1355 2095 4804 2454 -2526 -1991 3195 4403 4145 5942 4992 6496
7206 6496 2341 1945 3753 7582 14332 16267 11741 10043 12478 9703 1776 -3017 -4480 -210 2758
7191 2758 2083 -1059 -2394 1765 3216 4960 7857 11253 11000 7753 8622 7437 3305 -5083 -7309 -1423
7175 -1423 2206 -120 1042 1008 2868 1204 -6405 -4019 1566 4526 5991 3908 7746 7780 5849 4557
7159 4557 4143 5507 7685 10668 11900 2482 -4530 -559 2792 4790 4741 3398 -2371 -2341 979 875
7143 875 6151 9667 16483 12971 7510 8528 8004 11193 12707 11141 9466 9272 5609 4556 7928 14799
7127 14799 15878 15522 13426 4973 -558 6162 10667 8454 4509 2197 1483 3403 4051 -244 2020
7112 2020 5214 5758 562 4192 6268 8580 8938 8971 8643 9583 12150 8504 5830 5972 5311 747 -806
7095 -806 -1966 1725 4605 2254 -1671 169 -2820 -5125 -5763 -2989 3810 2093 -949 1117 -304
7080 -304 -4168 -2603 -2587 2829 2267 251 -139 -878 2343 9387 11889 15522 15648 16055 13052 9266 5225
7063 5225 1902 4287 7006 6021 7417 2946 10162 11403 8369 3235 4452 4507 4156 4338 -3901 -3760
7047 -3760 3959 9494 4943 8009 12273 10243 7000 9034 4231 10879 15626 15884 11306 8849 4624
7032 4624 7439 9788 6722 7311 5159 107 321 4714 2831 5033 3937 6169 10862 9208 3355
7017 3355 5388 6602 1136 4921 1076 -775 564 4439 5703 -2514 -4829 -5626 -3339 2171 7273
7002 7273 5850 4587 8094 6852 3909 1354 1774 4065 -356 -1148 2989 -423 -1927 4819 6262
6987 6262 2170 -2074 -5377 -7244 -1468 1025 1213 3396 5194 4159 1670 -6241 -7697 -6189 -4026
6972 -4026 1093 -2733 -6157 2749 6735 5535 10307 10383 12034 14603 15563 9434 7204 8095 9405 8401
6956 8401 7313 4117 -2991 1822 4668 5391 6135 4548 826 9260 10451 5561 3006 669 5286
6941 5286 5845 9335 9885 7413 2512 -399 4606 12517 16530 14296 13492 10079 6416 4682 1391 946
6925 946 -1043 -1133 -3192 -11218 -7383 -5657 -7680 -662 2599 3068 -2260 -5245 -4720 -900 5950 1855
6909 1855 5844 4640 2489 5669 6202 8755 8712 5247 6660 473 -2985 -2974 -4265 -2845 -8935 -2646
6893 -2646 6005 5823 6618 6805 5725 4331 7676 8190 12668 11605 6342 3887 3643 5681 11113 11424
6877 11424 15789 10902 10456 10823 8687 10402 9232 4840 3537 7541 8108 14037 17947 19265 15038
6862 15038 8040 10565 11871 9973 804 -7816 -6456 -8371 -5807 1555 5228 6996 -150 -6557 -7408
6847 -7408 -2380 -2572 -3732 -2140 -2140 -2004 827 3078 6850 7135 6420 3654 227 -739 -3421 -6924 -6663
6830 -6663 -9684 -8813 -7686 -1261 1658 -649 2594 6914 6030 7689 -1514 -4947 -3223 -1325 1687
6815 1687 5286 7268 473 -5113 -280 2356 2971 1142 12213 14902 8803 1306 -3543 -7250 -1976
6800 -1976 -958 -1981 1288 7127 6974 2259 8262 16418 20084 16247 10346 5930 3629 2835 5726
6785 5726 5664 5098 4097 4126 -837 -1088 150 183 913 5048 1119 -3542 -9670 -4928 -5477 -2281 4648
6768 4648 4716 9365 4235 2480 2227 -322 -2575 4447 1283 276 3086 4405 6345 5755 -1347 911
6752 911 3901 1844 4647 6466 5554 3740 4882 4552 6334 7894 10455 13862 13144 10969 10834 4215
6736 4215 2604 950 2152 180 -592 -4557 -3787 1140 502 8520 13511 11867 3232 -2387 -842 1826
6720 1826 2865 1503 -869 -2770 813 1699 -1630 -1336 7079 9216 12341 10327 14258 11725 6313
6705 6313 5480 4149 -87 4938 10077 5567 487 3061 8444 7803 6976 2925 3306 6806 4279 -3932
6689 -3932 869 5248 5545 847 104 -2124 -4632 -2230 7840 9996 9563 9831 10145 7569 1245 -6699
6673 -6699 -6511 -7763 -7111 -8902 -4851 1326 6003 7105 13517 12668 17184 17567 10358 9145 10888 12049
6657 12049 7089 -3896 -1572 3301 2409 6480 12455 6164 -3249 1405 6944 7283 7973 6837 3557
6642 3557 1763 -142 -837 1266 5989 4248 387 -1389 -5615 -3164 4723 483 -129 -1436 -5271
6627 -5271 -6275 -3415 -4513 -6826 -6612 -9537 2266 6748 5271 4967 3312 2397 2654 4122 9840 6151
6611 6151 2890 -3595 -5022 -2229 1598 -3361 -3237 2349 -2976 -3684 2862 4614 -1808 -4892 -5091 4438
6595 4438 5373 8656 11669 10150 10368 9355 7806 -279 -5488 -6264 -5956 -4467 -5804 -5448 -3426 1879
6579 1879 3285 4034 2765 2014 8161 6266 5763 5699 7456 8831 8130 10721 7316 4162 6570 7037 2964
6562 2964 -6012 -2604 2975 8112 839 -2742 397 5974 6186 2471 2514 3138 3855 9774 8137 8403
6546 8403 7105 4415 3318 5381 5288 1369 -3872 -3940 -1107 1064 482 2991 2246 -4094 -1645 4628
6530 4628 6302 3115 3875 6195 3386 -1724 -1091 -696 -2055 -447 1427 827 -473 1834 4864 2998
6514 2998 -104 265 1871 3048 -3824 -6483 -5595 -4756 -5841 -3258 429 6171 4162 9640 15583 8746
6498 8746 327 -5202 -6684 -1934 1055 2365 8348 7622 9430 7299 4250 3948 2565 -1022 -3449
6483 -3449 -2148 -5925 -8002 -6284 -2166 -1475 -2935 -5123 -4614 -3526 1814 4922 5665 2429 6434 10416
6467 10416 10601 10457 7038 240 -1063 4649 4288 3377 9617 2381 -3968 -480 -1549 166 -6829 -8591
6451 -8591 -6671 -7517 -10659 -12036 -8128 -7310 -5390 -4130 -1799 -1103 -2857 242 4693 2142 -1656 4
6435 4 5245 7142 693 -4803 -423 4628 6048 6108 9070 5680 1240 -1458 -4092 -4068 -1534 -3228 3517
6418 3517 6103 8161 5502 4438 -1740 -4505 -7531 -8640 -7482 -2772 2387 2105 2110 2548 -1964 -5459
6402 -5459 -2561 -4763 -4741 -1937 -4310 -10393 -1222 6973 7783 4275 2329 1009 -2048 -1496 1387 918
6386 918 1570 -373 1055 2816 6175 9883 5820 3717 6804 7176 10372 13048 17558 14026 5781 329
6370 329 4727 2742 -518 2810 739 2938 5716 2532 -8992 -5681 -1467 2404 4417 10792 10265
6355 10265 6880 7951 4618 -5471 -10818 -12611 -8798 372 3232 365 4646 5051 5701 5747 7246
6340 7246 6244 7081 3931 2928 3245 7120 1515 -2957 -7143 -8070 1925 5174 7506 9891 10187 9421
6324 9421 8909 4233 -1071 -750 -1307 2069 -1918 -1753 -92 547 1193 4380 7010 6646 8937 6564 -1911
6307 -1911 -434 289 1373 389 -1054 4589 6223 5225 -3638 -10471 -12752 -7051 2947 2489 1065 4827
6291 4827 6764 6582 4254 -3519 -2422 2771 2372 -437 -4114 2994 9425 6518 -3904 -2993 -2243 -2423
6275 -2423 -1571 -4891 -6173 -4650 -9113 -9181 -4509 -7730 -6570 -1445 394 -2274 4034 5832 3348 3459
6259 3459 2400 -4959 -5116 -3191 -3067 -4048 2628 7681 7495 1249 -5681 -11788 -8940 -12217 -16226 -11080
6243 -11080 -5886 -5742 -5609 -3126 -6684 -4303 28 1132 6039 2921 -1391 -1882 3618 11242 9025
6228 9025 2833 55 -1301 4314 4542 1630 -9 1542 811 -1135 -1051 -3488 -4784 -1712 5641 7889
6212 7889 6012 9006 6539 4107 4583 11252 5959 2608 4309 -4487 -5302 -5255 -2825 -2785 -4679 -4148 -1021
6195 -1021 -3996 -4298 -5161 -7542 -5505 -5444 -4435 -4892 -3859 -1463 -815 -394 -4190 -6338 -4181 187 5176
6178 5176 3403 -336 2363 5608 4964 4144 2789 4650 4846 4727 -157 4382 9156 7814 5646 6065
6162 6065 -1638 -6299 -7378 -7001 -3615 -1295 5782 4794 3057 4281 4457 99 339 1 1013 6260
6146 6260 8584 9641 2734 -5234 -8397 -3801 1413 1674 6066 297 1522 -1140 -1547 1314 8661
6131 8661 17906 12540 2220 -135 319 -94 -2006 158 7769 12075 13706 7065 967 2578 1111
6116 1111 5296 8408 780 3043 4695 4702 2440 -1506 -9491 -10000 -6386 -3191 1022 5211 5661 2335
6100 2335 2088 2112 4770 7205 4771 -368 -2511 3709 4488 679 -3399 -3259 -1565 -1122 -6461 -10371
6084 -10371 -8826 -13787 -9233 -4134 -4611 -4888 -710 -1709 -1556 3370 5947 140 -7151 -7851 996 2742
6068 2742 953 3413 5149 2042 -4742 -7887 -13765 -9709 -6852 -10377 -8690 -490 -3070 -6000 -2296
6053 -2296 -1422 -5088 -4050 -6307 -2531 -802 2923 4910 1901 3399 -1475 -4526 -3218 1591 3371
6038 3371 4772 5494 6953 2826 6333 9225 6519 5228 4951 -2414 -5156 -30 4914 5727 4152 -4424
6022 -4424 -3447 -2815 -1362 -5937 -5738 -3163 -4142 2928 9976 9792 3049 3732 9173 6030 912 -3407
6006 -3407 637 5559 4096 3502 4117 2890 -297 -8556 -14573 -14762 -10539 -3479 -4492 -762 128 1783
5990 1783 2139 4920 6464 5798 -23 -4968 -3937 577 5420 2756 93 -1921 -8411 -14231 -16102
5975 -16102 -5938 -3281 -6723 -7223 -2258 -1237 2588 3342 -24 -6568 -1199 5828 2082 -2192 376
5960 376 -4057 -3381 -2494 -1090 3772 -933 -3901 1378 5068 7372 12120 9000 6366 4975 2237 5031
5944 5031 8389 -802 211 581 1462 -3359 -8210 -11671 -6822 -5190 1048 2918 1388 3162 3751 -614
5928 -614 -4858 -3732 -9003 -8672 -1143 2771 3162 6196 -702 -2701 4877 3855 5500 4457 1022 -361
5912 -361 -3394 -8734 -7156 -4150 -2749 -1263 -290 147 1726 2247 3171 1094 -1394 764 4813 1295
5896 1295 3927 6974 8351 13332 7432 6944 2907 -1867 -1059 1893 -3826 -11584 -8878 -975 1860
5881 1860 4822 7023 8143 6529 4572 3522 814 3306 1511 1092 3264 2106 1396 -1412 -3859
5866 -3859 -212 7839 11651 15775 12228 5845 5108 5465 3004 1114 149 -6815 -8333 -3797 -467 6730
5850 6730 6191 406 -2877 -519 5064 4388 1545 3726 5543 9509 13077 14314 10091 9303 4894 2705
5834 2705 3368 5631 5198 990 -309 -817 -3625 -3080 -1208 -2335 -294 975 1310 1307 -399 2485 -2814
5817 -2814 -7460 -6397 -6106 -3957 -4499 -6239 -10659 -5875 -1120 -7543 -12513 -8833 -3874 2902 8538
5802 8538 5904 4127 4672 2394 2590 7017 11162 14144 9814 6780 2482 4626 4186 5349 8557 12477
5786 12477 11195 4398 7658 10705 3223 -843 -4082 -4495 1037 1679 1011 3962 -882 -6048 -7705
5771 -7705 -8539 -10531 -10028 -8149 -5088 3619 11193 10030 9356 724 -6468 -12464 -7150 -1762 -3319 -989
5755 -989 -5029 -2575 -2571 108 7357 8482 3131 3108 -424 -1955 -2863 -2931 -2104 -750 3439 2856 -1947 -5613
5737 -5613 -3811 5528 6033 3747 5206 7061 7759 5427 2427 3532 3709 -1456 -3040 -5187 -110 4929
5721 4929 3650 6459 7555 9563 14588 16276 12879 6993 1723 3187 4509 5905 2682 5006 9869
5706 9869 7371 2035 1789 4309 5260 5635 7414 6158 -355 -3049 -5150 -1402 4734 2153 609 6415
5690 6415 10041 10701 7830 6441 -965 -4744 -5528 283 3234 2501 -1707 -8987 -4989 -6953 -13778 -16150
5674 -16150 -11286 -4931 456 1456 5892 6159 7244 9907 7395 -554 -4523 -9076 -10823 -10587 -4160
5659 -4160 3490 6185 2406 2610 -839 4363 4864 608 -1362 2245 5543 13164 10197 2167 2200 7905
5643 7905 11911 9452 6122 3759 3709 -678 -3037 -783 1212 9488 9710 10963 12443 2100 -2819
5628 -2819 -2783 -1813 -1016 -2802 -8663 -14714 -12178 -10582 -11614 -10445 -5329 -5295 -5952 635 -2571 2352 4151
5611 4151 -2837 -967 7283 11978 7978 6291 10658 10265 9218 10558 7412 1590 1795 -115 4193
5596 4193 10475 8579 1918 3735 6698 2198 1364 4489 5071 4650 4230 2347 6322 5585 -939 -6583
5580 -6583 -2326 3769 10632 6914 -1516 -42 238 2818 1381 1372 -339 3112 5955 4353 1354 1788
5564 1788 -2639 -9594 -10711 -4562 -449 1950 374 -6423 -10073 -8147 -3156 -4693 -3376 -1069 -1484
5549 -1484 -1288 4220 6345 3131 9204 10717 8463 9617 10410 10175 4348 -2131 -944 3231 2537 1136
5533 1136 1706 -873 -4195 -2129 -3536 -4464 -3263 -3493 1044 635 -7575 -3086 -1320 516 2858 7391
5517 7391 2605 379 -3389 -6045 -2810 -378 -6477 -9440 -2899 883 5517 1817 73 77 -541 -1765
5501 -1765 1143 4659 1280 -2646 -6826 -5888 -102 6796 11237 9761 5196 2329 1617 664 850 3644
5485 3644 1605 778 1262 -518 -893 145 3414 7708 8408 2295 1869 2624 -3908 -2576 3281 9042
5469 9042 6815 3840 -5003 -3239 1574 5502 3861 4509 5383 1019 3509 5682 4305 8103 11882
5454 11882 13339 13859 11917 9934 7656 9079 5289 5152 6666 7361 9487 11305 8627 11658 13383
5439 13383 7718 8712 6132 4136 1825 -3042 -1639 4667 3399 1704 -2893 -6952 -5845 -7089 -8517
5424 -8517 -3742 -324 2922 4670 4819 3380 5763 8510 5909 2655 9577 9944 9534 7271 4187 1071
5408 1071 -5656 -5230 4318 4019 -1839 -2162 -340 -3509 -2917 -5665 -8778 -5098 -177 -3400 -868 2021
5392 2021 4251 3559 4581 -27 -1101 -3502 -1888 -1205 739 3161 -78 -6982 -5387 -8338 -7349 -2901
5376 -2901 -1783 -2056 4742 4508 715 -2385 -4473 3273 7963 2242 -5879 -7530 -7158 -10974 -11680 -5390
5360 -5390 -1869 2789 8801 6555 651 672 -1364 353 -4421 -4600 -4516 -6155 -3481 677 -4884 -5538
5344 -5538 -7569 -5943 -1999 3410 -166 -5522 -4102 1005 -4812 -5607 -6336 -10660 -14372 -13270 -14079 -11295
5328 -11295 -8092 -7720 -3925 246 6014 9255 7974 5907 3851 4106 6059 1239 -1637 856 1730
5313 1730 520 -1545 1678 4208 -2151 -6687 -3677 -1685 4908 10420 11102 7074 5581 7742 8641
5298 8641 1967 -349 1826 3660 1883 3367 5632 3278 9060 13080 11663 3522 347 2217 765
5283 765 2561 2539 -1122 620 831 -1730 -2553 765 4557 1843 4859 4218 6376 7965 92 -4247
5267 -4247 -2737 -2923 -4970 -2825 -3974 -3988 -1937 3530 2925 2929 6162 1401 -1098 -6200 -10915 -16877 -15947
5250 -15947 -11099 -9670 -9709 -6420 -3636 2082 1666 127 -1409 274 879 -595 2474 -1675 -640 3797
5234 3797 4127 1639 3361 3381 -1364 -2487 2918 8720 5156 7206 5550 1609 -1084 -414 -1987 -6370
5218 -6370 -9165 742 5679 3056 5635 6099 457 1586 400 -3173 -4073 1819 3522 7247 5933
5203 5933 1284 -2043 154 365 -3067 1574 2748 520 210 -1265 -6290 -2668 -4392 -3205 -1040
5188 -1040 -2433 -12583 -12659 -8259 -2986 6008 14970 11619 6528 3948 6089 6928 5344 -2637 -829
5173 -829 2574 1045 5515 13059 12769 16045 10332 5025 3015 -4486 -6239 -6744 -4171 -2965 7275
5158 7275 12738 13503 6864 -114 2903 1044 -1899 4625 5650 3017 8122 6116 -363 -6253 -4107
5143 -4107 3718 9122 1628 -4346 -6031 -10062 -10150 -7745 -2989 -2100 171 596 -5093 -6875 -4465 1934
5127 1934 9457 8980 5109 3320 -5596 -97 1694 2307 -3381 17 3134 1578 3650 3000 -1162 -10712
5111 -10712 -6707 1001 3639 8636 5526 1407 -7937 -13733 -9256 -7562 -7076 -8756 -3391 1829 -632
5096 -632 -4663 -342 6759 8072 4843 5903 10366 14790 11424 7894 6880 12323 15996 9575 -3946
5081 -3946 -5755 -4374 -8783 -9910 -4167 -1716 3409 9556 12364 3903 -5680 -8830 -3915 1765 -275
5066 -275 1017 -2181 -2898 1850 3486 2934 2589 8417 8107 3296 -4032 -8179 -5608 -2143 -4049 -9270
5050 -9270 -9125 -9409 -2361 -710 -969 -6653 -11396 -5412 -4416 -5207 -4695 -6812 -4643 -2278 -3401 6366
5034 6366 8573 3407 7177 8754 3823 -1003 -3431 3811 7778 5285 7674 6325 1163 -1431 548
5019 548 4543 5293 5175 -420 -3925 -3265 -2366 -2336 -357 -610 -1907 -2012 -660 1097 4622 3643 -291
5002 -291 3592 5677 4248 7656 12744 9223 2810 -1347 3018 9160 3921 -3864 -7502 -7634 -3330
4987 -3330 4012 4239 2794 1037 2993 7159 12002 8312 5973 6733 8230 10903 9466 6788 7335 1738
4971 1738 -5703 -11135 -8312 -7025 -6672 -7756 -8245 -8591 -9748 -11453 -4152 3421 1160 3830 6217 7551
4955 7551 6089 6822 -1536 -401 5302 3476 -3402 -6843 -4995 -1323 5683 6238 5210 4791 3821 4450
4939 4450 -3617 -8879 -9384 -9627 -8057 -6038 -2071 3421 -1159 -7949 -8995 -1996 3767 6692 5295
4924 5295 -890 -802 -1261 -7077 -7148 -9286 -6916 -1537 1229 -1614 -856 -3270 -4032 -5432 -5695 -3835 -3525
4907 -3525 -1561 -1526 -5682 -7020 -9977 -5883 -412 56 5464 6695 1449 -1587 -4238 -6374 -5129 -3759
4891 -3759 2830 2052 -345 -1813 -3486 -6219 -5339 1875 -1659 -12467 -6413 -2355 -4489 -8485 -10249
4876 -10249 -6963 -4715 -2525 -192 792 2205 5005 4362 6864 6525 4772 9732 9897 9065 9337 7655
4860 7655 6994 5073 946 760 4166 -1681 -8224 -4255 3338 -514 -4135 -10201 -8724 -13620 -14561 -11845
4844 -11845 -12768 -11741 -6395 -1195 -66 -1018 -6787 -7264 -5797 -5999 -1563 233 -1180 2436 2731 636
4828 636 -2808 -2027 -1293 -4994 -2089 27 2827 5765 7356 4010 4906 3822 2547 3956 3201 500
4812 500 -1864 -6737 -6430 -10216 -11687 -13074 -12146 -3634 -4396 -4875 -2497 -4957 -64 8280 9280 5842
4796 5842 252 3422 4966 8440 2999 -1286 1233 5395 3026 -2563 115 522 1860 8348 6922
4781 6922 1330 1009 4568 -3758 -10297 -11649 -7408 -4688 -2703 -4224 -301 2579 1212 -4737 -4435
4766 -4435 4289 6310 946 -127 2249 -3438 -5646 -5505 -8211 -2106 2568 -434 -3981 -1089 3608
4751 3608 -1499 -2932 -9595 -15584 -13006 -9314 4040 3691 -1242 -1472 3751 4718 118 -5539 -10385
4736 -10385 -16071 -16236 -13599 -8767 2819 36 -5238 -9148 -7222 -4652 -10526 -13124 -8093 -3905 -4969
4721 -4969 -7287 -2732 -2507 -4916 -5140 -8398 -5145 -5070 -3337 -5199 -2139 71 2163 5712 8200 4519
4705 4519 3849 1158 -138 3465 3428 1794 3167 884 1355 4525 8051 4643 2874 -384 -758 -2668
4689 -2668 -726 -1143 572 697 5014 6306 241 -3651 -6792 -14283 -13083 -4828 -770 3121 4970
4674 4970 3887 1332 -5418 -7416 -6250 -4874 -10587 -13648 -10308 -6588 -964 -6144 -6855 -4541 -208
4659 -208 2877 321 2939 4268 -1989 -188 4575 8011 2860 4332 7371 7790 6639 7309 5064 3179
4643 3179 2336 -2171 4256 5532 -2204 -4443 -2741 951 6559 8137 8935 12455 11736 9540 8258 5847
4627 5847 4378 6881 8592 9813 5889 2033 4220 6931 -3461 -3734 -152 2433 -1334 -1870 4873
4612 4873 1693 -2803 -1484 -479 -3772 2233 9997 4529 -2883 -8549 -8423 -5709 -5448 -1683 108
4597 108 5017 7128 -822 -2724 586 -1038 4903 3050 -162 -3055 -8234 -10525 -10091 -3780 342
4582 342 -3128 -5998 -7093 -5396 -5302 -152 4720 3094 6154 2949 1723 -1945 -5960 -4195 -6085 -1756
4566 -1756 4194 5776 2787 -2019 -4512 -2541 -3541 354 -2134 -5902 -7848 -4179 -3971 -3890 -6336 -6574
4550 -6574 -7133 -2310 2415 3417 -3946 511 2619 -117 -3543 -417 4213 852 661 759 -2652 -8277
4534 -8277 -11274 -6474 -6986 -1963 -3817 -1276 1265 -962 -1206 -2116 -2078 -4304 -704 87 487 -3799 -5567
4517 -5567 -4612 -4487 768 -391 -2228 -4294 -2453 -1035 -571 -3448 -3462 -5458 -8085 -11198 -11540 -3756
4501 -3756 -4317 -3750 819 -129 3585 7644 3192 796 -8007 -10150 -11982 -10411 -1279 2422 4970 4231
4485 4231 927 3539 8194 5934 3333 6823 7270 3072 863 1587 -1294 -127 1647 3852 3088 5884
4469 5884 7829 7184 4433 7979 13588 11111 10562 8347 4825 12976 16909 9531 -167 -2816 -1941 -2527
4453 -2527 -5509 -130 6063 8877 15984 19561 12589 6764 5228 8982 7482 2317 863 2578 1726
4438 1726 -2080 -1661 -4793 -4303 -2361 -1207 2311 722 -1436 386 1955 2720 -2263 -8562 -10972 -7927
4422 -7927 -4539 -2844 -1650 -2488 -5706 -1825 6236 5088 2166 2144 2036 1210 1296 3634 2042 -2755 -1783
4405 -1783 -438 1607 3074 3676 2238 -1182 -921 7344 8692 1424 -640 -4770 -1944 391 -927
4390 -927 -5540 -4682 3248 4521 5718 5531 7416 3877 46 -1859 347 -4975 -5426 -3587 -3299 -3212 -386
4373 -386 -808 1902 2444 -5313 304 6502 3244 -5518 -5760 -6423 -8487 -9602 -10873 -8633 1759 5024
4357 5024 3671 8823 7908 -183 -3051 -674 1880 1275 2103 4120 3263 4310 7023 947 -3428 -1528
4341 -1528 -3137 -2177 -7625 -8902 -7494 -6095 -2225 5230 8585 4545 7187 9143 7911 7809 5103
4326 5103 -219 863 -1412 621 1404 1633 6540 8169 2264 -3744 -2919 3366 -1571 -5155 -1313 874
4310 874 -2826 -4166 -3090 -2456 -7762 -9415 -6910 -1985 -289 -6133 -11415 -5204 -852 -1335 -2324 -1499
4294 -1499 -5363 -7997 -6913 -8462 -9886 -3369 -1714 -3521 -3512 -877 462 2086 2862 4982 4159 -1506
4278 -1506 -465 -864 2575 3225 2878 479 5596 3859 264 1127 3405 -1258 4567 4184 3219 2511 3499
4261 3499 3505 8550 10081 4506 -2627 -5700 -10164 -10701 -11250 -7030 -5888 -4992 -3998 -7376 -8911 -7823 -4014
4244 -4014 65 4215 1738 6592 6958 2598 4854 4941 2985 -374 -1100 893 1818 3798 1879 1417
4228 1417 -1010 -5289 -4844 -3329 -9581 -11529 -14403 -6627 1462 -4251 -10162 -6831 -4654 -136 3475
4213 3475 6614 5205 1941 5050 5419 10063 3012 -1419 -3847 -5703 -376 222 583 4540 3252 2625
4197 2625 -86 4164 5698 75 -5725 -8431 -6792 -4884 -1069 3053 1052 198 4418 5766 1409
4182 1409 521 4572 -2216 -4449 -706 2242 10664 16867 16981 13498 6399 7690 5983 1067 1938 -544
4166 -544 -191 2722 4325 4429 3452 8227 13760 10042 5631 -141 -819 4219 6292 5773 3177 1659
4150 1659 3445 7851 4438 -1807 -1128 -1344 -1333 -3021 -2023 633 4321 1634 -215 323 -239 -7597 -9312
4133 -9312 -3576 3509 -1297 -4873 -3898 -5957 -2654 -741 -4576 -5163 -4355 548 1859 3838 130 4853
4117 4853 10058 9803 7574 5203 4836 5576 837 -1253 -2822 -4437 -860 -2924 -7296 -5185 -252 641
4101 641 -1866 -4673 -9047 -6322 -1804 1774 -1063 -3565 -5290 -8776 -6170 4187 9931 7855 1910
4086 1910 -410 -5444 -7296 -9377 -7012 -6138 -2934 -842 5125 7850 6806 7038 3164 -1238 -1564 1003
4070 1003 2563 1985 1866 514 -4786 -4709 -4652 -7147 -11431 -6369 -2774 -959 1180 907 -780 -6961 -11344
4053 -11344 -11421 -11799 -7152 -1256 -449 -2392 2998 3327 -534 -5687 -3520 654 6012 9908 11972 10649
4037 10649 8430 -989 -2969 -6934 -14293 -14272 -10842 -3408 -2741 -4181 -8146 -5911 105 3723 -3305
4022 -3305 -6942 -8044 -6904 -6926 -142 4250 1588 -2461 -2824 1427 -269 -1896 1194 2465 7455 6405
4006 6405 3353 10203 12945 7688 5577 4552 3620 -883 -6571 -9959 -4511 -1795 -3160 -4397 -5236
3991 -5236 -4705 3047 4801 -1458 -2889 -4667 -8992 -6764 -4740 -1122 -2407 -3471 -3686 -1118 4417
3976 4417 5823 1965 -3329 -2283 -366 -4829 -8001 -3859 613 -3315 1018 3640 6860 8189 4664
3961 4664 4719 11931 9050 1323 -6558 -2123 1229 -1200 -4744 -1752 -291 245 -2167 -3238 -7376 -10446
3945 -10446 -4351 1773 7151 910 -4950 -7106 -11979 -11900 -8967 310 4137 3485 5557 -462 -1044 -1755
3929 -1755 -2541 -58 1928 -4798 -5784 -123 5317 2581 -2654 -2331 1668 -2445 -6527 -9717 -14218 -11567
3913 -11567 -1188 6660 1284 -984 2547 3819 -2213 -3786 2131 6716 10877 12418 9546 1432
3899 1432 -7760 -4839 -4346 -5847 -4414 746 4519 9564 7527 6492 9316 8698 14639 13976 10718 8536
3883 8536 4099 1464 -552 -4328 -3676 -1602 1170 2875 7558 9353 2042 1791 2501 1388 -978 -31
3867 -31 3931 4878 491 215 10654 17852 14338 9388 3018 1168 1280 1409 2378 -920 -1690 -2176 -3984
3850 -3984 300 5343 2010 -4743 -7435 -4354 -7733 -9891 -5785 -6095 -2395 -3010 -3874 3860 4688 -1010
3834 -1010 5063 2181 -1092 2266 6084 6983 8763 7462 -669 -2972 3237 7000 5925 5698 9145
3819 9145 10829 6854 -4649 -12756 -9210 -6342 -2900 -3830 -5790 -3037 4412 8650 4360 2010 -79
3804 -79 -4239 -2802 3029 5514 7871 12625 9274 2041 -2642 -3212 -4094 -3513 -3238 -365 -2335 -1091
3788 -1091 1907 -1698 205 4536 5849 10650 10412 7882 7867 6239 5235 4484 -1240 543 3194 4012
3772 4012 2085 -490 -2965 4184 6324 7742 6359 4398 2090 1534 4484 8440 7759 1506 5949
3757 5949 7500 8228 640 -3730 -1140 3171 3682 -1103 -4849 -2811 -102 -3815 -2897 -5099 -8675 -5392
3741 -5392 -7673 -3837 -2081 -1774 -2536 -4083 -5212 -204 7108 10481 12102 12225 9974 7039 2030 -1700
3725 -1700 -1359 2022 -8839 -11326 -7428 -8300 -8728 -10414 -3110 -1204 -1358 -4220 2363 8370 9537 9077
3709 9077 5913 8267 5913 2077 9038 13899 15427 8084 -3933 -7389 -1882 -4094 -11852 -8673 -4426
3694 -4426 -3089 -2916 -4244 -1555 -304 -1062 -1289 -6721 -11422 -7618 -4335 -2255 831 7920 10452 10601
3678 10601 11784 9664 3822 6497 11975 5604 4209 5516 75 339 3777 -3330 -13226 -16998 -14809
3663 -14809 -11639 -7530 -4823 -4702 -2791 -1243 894 -779 1074 4174 4394 -722 -2643 -4714 -3862
3648 -3862 -2719 3539 4302 3413 6609 9169 2002 2421 1305 -5231 -3545 -1148 590 3073 204 3382
3632 3382 4083 2192 -1436 -1133 -1863 -1395 -229 3054 5140 642 -4854 -1974 -5392 -2541 4467 8856
3616 8856 8670 6582 6241 7023 5144 4204 4799 5501 -1724 -55 4287 5984 5927 3472 -994 -1813 3096
3599 3096 11113 10123 7638 6165 5290 3542 7389 11784 12660 4102 -5692 -3650 4969 3492 280 -881
3583 -881 -821 -1680 168 1482 7571 2697 -831 -3198 -761 409 -2695 -7011 -6697 -4715 -5944 -11269
3567 -11269 -11065 -4402 -4478 -2382 1182 7135 7250 4830 3242 2451 -2419 3395 5937 1079 4187 9843
3551 9843 5136 5132 3706 2383 60 162 -3621 -4255 -304 -2659 -9241 -8561 -6512 -2065 -663 953
3535 953 -2080 -6919 -8134 -7044 -5774 5799 11579 6290 -1692 -8556 -8989 -3611 1751 -454 -4760
3520 -4760 1704 4867 -1248 1825 3308 3149 1183 -6707 -9624 -11332 -5407 -1487 -2975 -1284 2157
3505 2157 -984 1130 2935 8654 2193 -1944 2960 9038 7661 -187 -53 -459 5409 4527 5415 4935
3489 4935 6023 711 2132 5665 9583 8601 -1927 -6541 -3911 -2918 -3619 4316 10806 7884 3187
3474 3187 -1525 -9055 -12644 -2811 1124 -4519 -5034 -4445 -4337 -3661 -816 2277 6111 834 -4033 -8478
3458 -8478 -14221 -16593 -13066 -3962 1849 5087 4357 -937 1320 -5635 -8852 -3224 -1634 -3007 -2806
3443 -2806 -982 305 3087 6340 1720 1478 434 1770 3081 -4242 -8284 -6113 -2270 -316 5802
3428 5802 7341 5728 -1108 -2834 -5740 -2609 -2732 -1173 12 -3524 -7598 -6113 657 2428 -2613
3413 -2613 275 4239 6570 163 -4542 -1106 90 1024 4583 6310 8517 -1320 -5449 -4208 -1890
3398 -1890 -3643 -1816 3213 -573 643 -4822 -1292 -2832 -8739 -5624 -1221 1067 -4976 -9037 -6108
3383 -6108 -2654 2539 1943 -4602 1920 2665 -1886 -1774 -2439 3848 749 355 8394 12432 8733 3139
3367 3139 1021 4150 1878 1695 3281 3322 -1964 -6147 -11796 -1855 -1903 -1825 -3014 -2836 -1513 -579 1408
3350 1408 -1133 5240 5733 1872 -1282 -3103 -6651 -9004 -7361 -6341 -3466 -5869 -4266 -4237 -943 2993
3334 2993 -2382 -9562 -2665 -1811 -5690 -7300 -10386 -8583 -4773 -1534 -1029 -6087 -6765 -3727 -2476 -6646
3318 -6646 -11739 -15346 -16638 -11173 -9928 -8919 -7193 -9576 -7687 -6760 -3575 -2322 -5725 -3422 -2297
3303 -2297 3004 4116 -1850 -12280 -12634 -5065 -1473 -2032 -6977 -10183 -8713 -7022 2528 2956 -1076
3288 -1076 2762 2179 -478 -1897 -4316 -4069 -4052 -5186 -13065 -11541 -7713 -6075 -1727 -2698 -5733 -4006
3272 -4006 4482 12425 5480 1055 1076 40 -8662 -11439 -11691 -1318 762 -2437 -5626 -5260 -11284 -10049
3256 -10049 -6123 -65 -56 -2265 -827 3600 2576 -6882 -17567 -7576 2062 9712 6217 1414 160
3241 160 -1964 -511 -2576 -3048 642 3780 2704 3144 2806 5527 -6246 -7342 892 439 -5868 -4451
3225 -4451 3652 5338 6493 6916 7815 6405 6325 2532 -3497 -7080 -8260 -11833 -8496 -1954 -898 -3021
3209 -3021 -6569 -7470 -1943 889 2807 4866 9236 10192 6341 -1554 -8 -72 -2234 -474 4994 3362
3193 3362 1486 3300 3162 2851 -2746 -2790 -295 2053 1491 -4388 -3307 -1595 -5049 -7242 -15277 -18355
3177 -18355 -10045 -10028 -9330 -4168 -4291 -7055 -8992 -5862 -2768 -1827 4629 473 -2139 -678 -803 -49
3161 -49 3836 3822 4110 2415 1490 498 -965 -4489 -6065 -2244 524 -5409 -6159 -4522 -1067 6079 4508
3144 4508 1637 -2590 -2680 -5234 -8408 -10316 -6331 -2815 -1677 -42 2722 5819 5082 3252 -768 -1389
3128 -1389 -1943 -3280 -3475 -2891 -4764 -5294 -4653 -10065 -10469 -7175 -3046 -304 4099 5373 6171 5677 4690
3111 4690 10775 10736 4451 -3214 263 7490 3884 3069 6052 6631 2342 2412 409 -2903 -4433 -5980
3095 -5980 -3994 -391 -1601 -611 6032 7449 7224 2345 297 -3477 -3290 553 2028 -1915 -3861 951
3079 951 1215 7008 5614 4123 1779 -2886 -10283 -13897 -14403 -7122 -565 7247 9596 3478 3819 6245
3063 6245 377 1564 4261 6024 4638 -1629 -4253 2313 2127 3578 11994 12311 9626 7446 5167
3048 5167 6930 1476 -1702 1878 2926 4057 3652 3217 2577 3820 4235 6274 2361 -2444 -9309 -7439
3032 -7439 4640 12840 8790 -860 -1307 -3001 -1720 57 -1672 1897 9796 8202 2475 -4824 -12594
3017 -12594 -13799 -12918 -4841 -2857 -2100 1870 3699 -2992 -6302 -8825 -9132 -9893 -2513 2992 4497 4643
3001 4643 4881 7949 4035 2245 12445 8992 1958 -2874 3499 -1532 -4963 -5100 -4063 -4020 701 9344
2985 9344 9514 2996 3307 9590 11038 10503 5935 -132 -1589 -4021 -2341 -1903 -1017 -1749 -70 6196
2969 6196 12545 6528 -2797 -7233 -4544 2 -4628 -3896 -1782 -3845 -3554 -1110 4508 3040 -3907
2954 -3907 -3732 -2572 -6140 -9390 -4476 -1668 -1615 6535 7865 12212 10607 1678 -4471 -9241 -3688 -2602
2938 -2602 -2162 2126 3759 1943 -6980 -12697 -5512 1097 240 -1331 -7413 -8665 -7898 -5193 -5958 -10610
2922 -10610 -5384 -5016 -9783 -4817 -246 1218 -1845 -8120 -7871 -3866 -484 1018 -3762 -3363 2636
2907 2636 6973 9385 7649 3103 560 805 -2695 -866 1940 4560 9901 7383 316 -1486 -282
2892 -282 -3623 -4460 -2553 -4172 -7380 -783 4500 11443 10907 6100 8616 5929 4280 4142 6060 8145
2876 8145 4404 -191 1199 424 268 2418 -827 566 2815 4346 1986 -4405 -7107 -957 3916
2861 3916 8383 11194 12546 9761 4213 3001 195 -4979 -2609 -1933 -998 -3353 -5768 1368 2837
2846 2837 5397 6487 -137 910 -2486 -2955 -6022 -16297 -16327 -8937 -3400 2509 4479 1356 2225 7171
2830 7171 4592 1439 -2134 444 3640 2842 3460 5547 5430 -944 -6223 -2794 677 1955 -1434 -3562
2814 -3562 192 -1771 654 1460 -191 -2182 426 -917 -6274 -2920 -3821 -5629 -8567 -1228 -896 2855
2798 2855 2207 -220 1543 3007 -1916 -2717 -900 4717 10367 13063 7149 -1680 -6911 -2174 2174
2783 2174 4363 -1175 -7497 -10326 -13720 -16468 -12854 -6450 2721 2070 -4392 -5324 -3758 -7009 -5451
2768 -5451 278 796 -4343 -3618 -7243 -6244 -1519 1322 -1300 1033 118 -3324 -4066 -6570 2239 4304
2752 4304 -2710 -2039 8155 9969 5556 213 -4596 -7108 -4591 -1873 -372 1316 -608 -5149 -8230
2737 -8230 1316 1944 -4702 -7467 -6247 -5088 -9511 -14234 -13235 -5450 -1885 3197 3940 4627 5058 -236
2721 -236 -6695 -9280 -9784 -7299 -2871 -4633 -5683 -2582 -805 -4494 -6571 -5178 -2278 -650 4891
2706 4891 6049 -486 -7468 -4826 -2666 568 263 1939 2967 4362 4244 -2117 -3197 -1500 -98
2691 -98 2853 354 1214 -2574 -2872 -770 2579 10028 12226 8189 933 -486 2273 -1268 -1707 4552
2675 4552 6711 309 -765 -313 -1770 -2767 -6226 -7904 -6497 -5984 -7111 -8025 -8415 -5506 -5951 -6053 -3801
2658 -3801 -5649 -7582 -5286 330 4641 4152 -8 -1200 -175 2353 -564 -4342 -12808 -11945 -12039 -10900
2642 -10900 -10990 -4387 3149 4307 1930 -2815 -2672 -2427 727 8190 1867 -1958 -604 -3279 -5750 -4140
2626 -4140 2231 3654 -3818 -9257 -8074 -4778 1474 3762 3704 1374 -1407 -6067 -10670 -10932 -6936 -2134
2610 -2134 234 2894 3406 3010 7116 1329 -4247 -9741 -6557 -6533 -8520 -8609 -4633 3921 3420 -2075 -4378
2593 -4378 -701 -984 2130 3765 7527 7882 7798 8836 4622 3885 1816 -1014 -3958 -166 7443 9134
2577 9134 5297 3872 1999 4843 2186 -1193 -5047 -3902 -5247 -5115 -2971 -1182 -2786 -5837 -4088
2562 -4088 1944 -962 -7144 -7808 -5548 -3818 -4300 -7025 -4173 -451 1109 1824 905 -4480 123 -466
2546 -466 -262 -451 -476 1571 3689 8672 8992 -2316 -6045 -1557 2501 1176 4537 3509 -906 -1109
2530 -1109 957 7077 3042 -1577 -2962 37 -1422 814 5063 5552 6035 1264 -4349 -3579 -1382 4193
2514 4193 6075 9359 1676 5484 8039 4128 1868 748 -4552 -4846 -4698 -7524 -2216 -490 -1671
2499 -1671 -2370 -7160 -8759 -7558 -5910 -5900 -13290 -9279 -12358 -12995 -7947 -10718 -12524 -13296 -13913 -10373
2483 -10373 -5875 -582 2852 6155 2420 -8947 -11558 -5795 95 -528 -1225 -2755 -840 -3846 -5252
2468 -5252 -4095 -8819 -9803 -11673 -12476 -8194 -3999 -2100 2144 7510 195 -2228 539 -2747 -4938
2453 -4938 -1551 -3426 -7257 -5713 -1058 -6307 -3343 -3801 -9432 -12889 -12992 -9215 -4447 -6211 -306
2438 -306 8026 6106 4778 -790 -1226 -2304 1422 6526 998 -5299 91 6266 581 -2863 81
2423 81 -2008 119 6361 4221 -3292 -3399 4054 6500 7096 2947 4465 7003 4035 -3506 -3891 -1059
2407 -1059 1432 -878 -3133 -8695 -7636 -1971 -2529 2373 6048 -313 -1907 489 4025 6859 10912
2392 10912 6090 -2658 -4378 -6900 -8872 -1043 11111 10177 10507 13594 12668 10164 7433 1283 5230
2377 5230 4566 4153 4696 -251 2639 851 -3744 -11394 -16616 -17201 -12431 -5885 -2302 -118 727 -2371
2361 -2371 -5689 -6567 -4036 -6699 -8623 -5059 -5289 -2914 -1638 -3773 -1502 -2079 -4609 1627 6027 2923
2345 2923 -2854 -7946 -11707 -15080 -12803 -10203 -6584 -3086 -1078 -2422 -1228 -706 -5635 -2723 -372
2330 -372 -1120 6983 4905 4467 6165 10068 7463 3778 6199 7699 2785 -1802 -1479 -128 2714 -273
2314 -273 -6158 -5681 -1231 1799 697 5242 768 -3167 5176 9109 6689 172 -575 -2068 -817 -1186
2298 -1186 -9301 -8233 -4011 -2346 -642 6124 6928 783 -1531 995 1155 -4042 -2260 1786 -1819
2283 -1819 246 1978 -295 -697 865 4473 1298 -3882 -4775 -1566 2490 5680 2842 606 1633
2268 1633 -398 -1391 -1841 1737 4595 66 -191 2791 5405 -1506 -3245 -2727 2412 2980 -4777 -4819 -6173
2251 -6173 -5831 -6426 -7583 -9789 -11633 -10028 -7705 -3166 670 1504 2945 1808 2915 5201 5056 1453
2235 1453 1797 -737 -750 -3350 -2752 -1986 -2666 2116 3456 1644 -1278 -3235 -7850 -5191 -2017 -3749
2219 -3749 -3469 -2521 -12106 -13012 -8053 -4431 -5209 -3296 -503 2885 1276 4094 3511 675 -1813 -589
2203 -589 2091 -2378 -5227 -4461 -7853 -11541 -13767 -3645 3642 5551 5583 4652 2041 -2384 -9846 -11372
2187 -11372 -6477 -8756 -12501 -9168 -7299 -5417 -8980 -8340 -4301 -1171 4582 2158 -4157 -3004 -2178
2172 -2178 2350 5971 -3105 -2773 1364 268 -4580 -1108 510 426 996 3324 7959 2166 -5823 -7612
2156 -7612 -2696 828 831 4976 11359 13624 10986 4327 128 -4318 -11597 -15189 -12546 -11080 -6437 428
2140 428 4050 4063 3297 -160 151 1490 -1937 -1647 -6051 -4716 1285 4122 4512 8456 7795 776 -3435
2123 -3435 -2063 3675 3291 1639 -2994 62 -2853 -4380 -3024 -4254 -10205 -9973 -3220 3038 6679
2108 6679 2807 2726 6973 5730 430 3709 -1985 -6750 -2347 -675 2841 6267 4022 -4552 -5735
2093 -5735 -7295 142 5175 2839 1591 -2198 -8269 -14859 -14165 -11055 -4900 -5165 -8178 -6089 -4772
2078 -4772 -1957 -5143 -8675 -8704 -5460 -4411 -9124 -6445 -7420 -5837 -4806 -7778 -10905 -14741 -12095 -4213
2062 -4213 439 3575 -2235 -7333 -7663 -14475 -16156 -14394 -6473 -7664 -12895 -4183 2779 -2395 -919
2047 -919 3036 6553 5825 2579 -4752 -65 -130 2553 1877 -250 -1313 1364 6387 9082 6195 1235
2031 1235 5062 7831 2180 -1437 58 -5527 -2474 -2400 -7200 -9056 -6777 -3611 -9650 -11957 -10829
2016 -10829 -2995 4641 9884 7448 1067 -4629 -3774 -200 6044 2667 4696 3179 -3173 216 141
2001 141 -2234 -2653 -3969 -4063 1666 4392 4964 -1105 -4855 -3368 117 -1974 -5993 -2936 1125 5963
1985 5963 7853 3818 -2551 -2399 -210 -2449 -4120 -7501 -8288 -6592 -1646 4462 8605 3640 7133
1970 7133 10700 7417 6528 6314 6206 2580 -2030 -5084 -279 4695 6081 9495 5544 1118 4436 3331
1954 3331 -115 -504 -1391 2067 -3765 783 -2823 -6071 605 4961 2072 -3442 2172 6071 1292
1939 1292 -2331 -986 2203 4695 4385 78 -1655 6337 13815 12264 5808 3955 887 -1058 -292
1924 -292 2116 161 3888 4199 3664 9089 8469 3445 3624 1319 1767 3438 5501 7889 11564 2447
1908 2447 83 3884 5293 8868 6683 3479 3537 12513 15997 9823 4139 1263 -6791 -12802 -16090
1893 -16090 -13570 -11322 -5898 -5119 -742 2310 -644 -2039 987 -424 -934 -975 4561 12514 5830 2081
1877 2081 2093 997 -72 -580 392 -692 -6069 -6016 378 2785 -200 3577 -1692 -5352 -679 -2997
1861 -2997 226 12172 12419 10867 5525 3887 6672 4802 817 -4701 -2087 3237 4378 -1547 -10961
1846 -10961 -12361 -3774 707 3187 5980 6576 1140 -3948 -4659 -4642 -1176 2990 7026 3104 9162 5659
1830 5659 623 -4314 -2476 -6027 -4369 -7132 -6309 -5099 1175 561 -7750 -8153 -8573 -3901 -2122 2936
1814 2936 7978 85 564 7054 5650 2333 5850 11183 9718 8301 2188 3409 2833 81 -7324
1799 -7324 -6422 -2856 -5515 247 3055 -2820 -4848 -1843 -3282 -4603 -5296 -4836 -6823 -5050 -2759 3851
1783 3851 1316 -4705 -6275 -7978 -4375 -6374 -4092 -5044 -4164 607 1806 -1243 -2641 -3388 -2832 -736
1767 -736 -434 -3015 -1807 -3467 -4044 -9065 -7848 3666 8723 5790 5318 -343 4837 4286 3270 3720
1751 3720 -3337 -9363 -10919 -3444 2102 2725 4204 78 -3957 -3104 -3935 -7042 -5647 -6710 -8738 -9010
1735 -9010 -13083 -11256 -1833 2312 754 253 -6794 -13652 -11473 -1570 408 -2538 -2157 -1418 -879 -3181
1719 -3181 -6559 -9252 -9941 -8845 -14119 -13877 -7122 -7554 -5317 -1515 -1902 -4020 5091 8360 6059 4011
1703 4011 1237 -2563 -3201 -3239 -1451 4058 -275 -6070 -7904 -6940 -4521 -9035 -11489 -7525 -2263 -2821
1687 -2821 335 1154 -7167 -8859 -3078 1434 2446 2748 -1885 -7595 -3923 -484 3602 3735 3697 5072
1671 5072 4058 3661 9121 11575 9583 12366 11471 12255 11944 4330 -7065 -7188 -4467 -1077 1275 8396
1655 8396 8583 7998 9707 1724 -4122 2495 4650 3325 6497 10001 6043 2545 -4391 -7409 -2410
1640 -2410 7683 4567 2512 -1148 266 1198 -609 -1696 -1006 -3252 -580 -520 -8208 -6326 2812 10355
1624 10355 12867 14985 12551 5069 2054 -1601 -7514 -4609 996 2839 7461 8700 3552 3781 324
1609 324 720 9224 8315 1809 4529 4201 938 -605 -2438 2965 9822 12124 1332 -1658 1956 1039
1593 1039 -2715 -7736 -4440 -5325 -2055 -4668 -7504 -7671 -4695 -5040 -17 5522 4078 4544 3969 2953
1577 2953 -3608 -9847 -5236 3155 8997 11927 6397 4155 3319 3281 2498 897 -3233 -1901 -1938 358
1561 358 4280 4797 6263 15781 18683 11734 1866 -6289 -5245 -2231 2824 932 829 2576 -2212 -3584
1545 -3584 -3612 636 4011 -138 -2896 -6910 -8967 -6374 -1340 4997 7982 6415 1746 2967 -3402
1530 -3402 -9791 -5135 -1523 4475 7952 11600 14496 5574 743 -1993 -517 2557 1553 2814 942
1515 942 4572 6346 2585 -1766 -2268 -2695 635 96 1730 -1343 626 6600 9908 5010 6879 9961
1499 9961 11410 16423 13691 4354 191 -1681 -21 -1178 -1011 -1975 -922 -3763 -6929 -7313 -4874 -2420
1483 -2420 -9270 -11029 -1130 202 -1939 -1097 -1992 -489 -1624 -22 -922 -3283 2809 5144 3491 5311
1467 5311 2550 -291 502 6365 6503 1530 580 2451 4193 5282 6241 8231 6801 8000 4875 -950
1451 -950 301 2478 1894 -1968 -3650 -3628 -6110 -7225 -8407 -7256 -2834 -1319 -1201 5878 2862 -647
1435 -647 -2151 -902 -3108 1358 4787 490 -7974 -8719 -6159 -1285 -3001 1061 3010 -778 -1245 -5334
1419 -5334 -2274 -369 -1358 1376 3936 723 -3596 -8111 -6290 -4247 1414 339 -270 3976 1456
1404 1456 -2004 -476 622 3822 7303 4475 1507 1424 3439 7297 3088 3146 3789 -1295 -3715 489
1388 489 2046 -2291 864 2856 -2212 -1506 1828 408 -1082 -3291 -3342 23 -7691 -5645 -518 -723
1372 -723 -2748 -4752 -6358 -5471 -1636 -3080 -5307 315 2008 1304 1578 -188 -4795 -5091 -3603 -2095
1356 -2095 3546 895 -9023 -5137 -3535 -4763 -7837 -4768 -896 -3681 -5657 1955 5951 5970 5970 7491
1340 7491 7768 5818 3171 -961 -2338 -3566 -8309 -8711 -2299 -4620 -6993 -6090 -586 2815 -2157 -6003
1324 -6003 2517 4242 7785 7940 3029 -3030 -3968 -6259 -10341 -13716 -10745 -2834 -3868 -5556 -6057 -3107
1308 -3107 -4924 -6636 -7723 264 369 -2708 6117 6634 3516 2778 -4768 -5994 -6856 -5671 -1266 990
1292 990 -2481 -4949 -10465 -7512 3799 8487 9325 6026 3767 631 1572 3131 2408 1030 -2864 -9399
1276 -9399 -5869 -8746 -6286 -4004 -5628 -9415 -8676 -2884 -764 444 -4531 -10547 -13380 -13364 -12005 -16285
1260 -16285 -14979 -10944 -6841 -4228 -2603 2396 4917 3176 -4317 -4711 -769 -6111 -13812 -13413 -3127
1245 -3127 -548 -643 715 28 3093 -466 -2096 -3632 -3554 -4713 -4853 -3492 -6854 -1071 1861 545
1229 545 6698 3506 -747 -1078 4511 3080 -3394 -4656 -3244 -142 -730 -4051 -1842 -1048 -5621 -7764
1213 -7764 -7548 -5003 -8525 -8222 -4515 -4108 -13566 -17148 -11901 -11686 -7371 -3608 -2233 -41 2066 1754
1197 1754 2514 3556 -18 2177 4272 -3230 -5451 -2589 -5067 -7164 -11993 -6760 2512 6776 3830
1182 3830 1960 5345 4568 4463 7711 -4480 -7672 -1529 2504 -872 -6016 -1896 3481 4300 3714 1257
1166 1257 -131 -1282 -6938 -6841 -2021 -456 -2005 -1843 -3589 -2113 2031 4133 6601 6242 1553 281
1150 281 -1951 -5707 -6474 -6289 851 1021 3037 -1815 -8051 -5541 929 -1500 2506 -513 -170 612
1134 612 2872 277 -3845 -8048 -12540 -15705 -7932 -2029 -5206 -7952 -7144 -1203 -2068 -694 8365 13892
1118 13892 14573 9072 4140 3452 5362 5371 6428 9903 8307 4712 4470 3974 886 499 -2407 -5154 -1299
1101 -1299 -2125 -8067 -9144 -4401 -5229 -3756 925 2809 6593 5875 3737 10416 8974 318 -3915 -7794
1085 -7794 -5636 -1430 -358 -5136 -7227 -8792 -4431 240 2187 4113 -464 -2791 -2832 532 8085
1070 8085 13330 14537 12194 11196 14829 12680 14821 14629 9982 4636 893 -1026 -1924 5850 11486 8105
1054 8105 4797 300 -4817 -5409 -317 3171 2942 4328 6548 5551 3947 4896 3071 -1960 -6857 -5247
1038 -5247 -64 -737 3471 11933 9737 10171 4443 -721 -4454 428 9593 13752 10260 6930 11911
1023 11911 8880 4323 2611 5180 5002 -353 35 -3470 -3373 -1561 -1696 -127 -1317 -3218 -7615 -14525
1007 -14525 -8225 -637 -3871 -6730 -5424 4367 1935 -1046 -741 1029 127 1866 3243 5957 1226
992 1226 -1813 -3258 -4960 -853 72 -405 -3818 -5620 -3562 25 776 -4812 -6057 1858 10622 4201
976 4201 -1774 -6470 -4606 -2296 971 8608 10003 9933 2254 -2311 -4541 -2928 -2324 -1157 4580 4589 354
959 354 -3029 -6282 -6068 -5881 -3464 -5214 -5073 -2492 -2551 1347 -6344 -7172 -5803 -8338 -2004 10719 9428
942 9428 5248 -1481 -9574 -8566 -3405 2631 2564 -2511 -765 4291 2643 -2731 -2985 616 6560 5439
926 5439 3488 -6062 -11581 -5042 -4078 -5567 -5867 -7297 -3577 3618 8130 6985 6210 9406 6481 -1437
910 -1437 -2951 -215 3329 4375 9083 14700 7783 -1152 -5538 -4329 -1301 -2731 -1832 -5386 -4437 -1998
894 -1998 -1767 -643 -384 -1685 -4597 -3765 -3110 -3159 -1429 -2571 -2714 3626 8009 9220 8622 7442 7971
877 7971 5825 8175 6805 3469 1343 6406 17380 17987 14803 11750 4989 4263 6974 7000 5366 2901
861 2901 3604 5079 7792 3461 -2134 -1419 383 2704 7201 9970 8999 -429 -3431 -5837 -9959 -7373
845 -7373 -6261 -6772 -9498 -10997 -6649 -8223 -1012 5793 7848 11114 10141 12197 13305 11160 6408 7241
829 7241 8327 4750 5254 6323 5855 2854 1172 5598 -1568 -5214 -4491 -7166 -3563 3991 6856 4483
813 4483 -1105 -3917 -2706 -5076 -1221 2452 2399 -534 -868 -3756 1670 4651 3611 4904 3686 2295
797 2295 384 -2202 -5848 -2153 -3564 -4456 -3826 -2861 1443 6770 10651 9368 3672 -3496 -7846 -2533
781 -2533 4423 -211 394 -3347 -5798 290 533 -1070 -3664 -6873 -11923 -11649 -11587 -11986 -12388 -12166 -8108
764 -8108 -8586 -2331 798 -2041 -4844 -2767 -2948 -7800 54 11679 10486 3485 1837 5808 1234
749 1234 -1222 -113 -2997 -557 5446 6553 -2391 -5311 -4408 -4569 1668 6252 11035 13226 9479 12179
733 12179 4108 68 1911 4104 3716 5314 8219 6096 5009 2614 2790 5500 8436 13642 14523 9709
717 9709 3976 903 4854 4992 1614 -3177 -4975 2026 787 -5733 -1645 -2405 -6992 -7221 -9044 -8732
701 -8732 -12265 -12784 -9499 -7292 -5757 -2532 -1328 -5672 -10683 -6846 -9905 -9624 -6719 -1299 -3177 -2349
685 -2349 1759 -61 -712 -175 6798 5081 2480 2636 3445 1720 -899 -3910 -660 -190 549 4010 5276
668 5276 4652 1281 2320 5925 4119 2614 3870 7658 7703 6548 -2557 -11314 -8978 -1343 -2930 -4513
652 -4513 -6509 -5530 -4867 -8598 -11746 -9731 -6467 -4402 2744 2961 7236 6208 5371 -1261 -1539 5111
636 5111 5494 951 560 8878 11683 4211 6344 6162 1195 381 -374 3264 6095 6385 -2662 -4794 -2734
619 -2734 1274 288 2471 -283 2544 2268 0 -2145 -1487 -92 -2657 -5726 -7091 -4267 -14 665
603 665 -4567 -5051 -2096 7246 6319 3138 263 437 -114 -3701 -7130 -8133 -8928 -10875 -10367 -6638 -2061
586 -2061 687 -1139 -530 -1137 -5851 -9327 -10040 -4960 -5106 -7587 -12827 -12631 -5593 -4382 -8005 -1547
570 -1547 4042 3926 1751 -5701 -5155 -2887 2684 1144 -919 -1915 2278 2507 -6067 -5463 -1952 366
554 366 -3491 1023 -2736 -3355 -4177 -4889 -7026 -8155 -6564 -5590 -2399 3362 8043 5471 10368 15184
538 15184 11477 6382 2523 3490 7019 8137 320 -5665 -2134 242 2031 3327 -2942 -1508 -1099
523 -1099 -1098 -9492 -14837 -10908 -7649 -7533 -289 983 2694 2638 4585 7871 11698 9912 7305 4713 33
506 33 2585 5993 1256 -1038 -874 -543 -4644 -3895 -249 -2365 -1345 -2303 -7196 -6027 -1298 1106 4049
489 4049 4053 3479 -2754 -4506 -4843 -2684 428 643 3054 202 4585 8891 10016 7755 2557 -2626 -4530
472 -4530 45 -3294 -6046 -1992 2230 85 -7450 -8368 -6034 3319 9780 9272 6384 1822 -5448 -3129
456 -3129 4192 5405 3266 -1278 -2720 4774 5457 3682 6647 8723 5969 7231 595 -5816 -6658 -7114
440 -7114 -4956 -4016 -1834 2213 -452 4904 7838 7180 5728 2321 -2578 -5245 -3180 -3016 -4577 755
424 755 8194 7499 -1057 -6902 -3249 -271 443 1331 1946 -690 -4593 -7467 -10641 -11457 -10871 -8103 -2647
407 -2647 -597 -5239 -7566 -11362 -10365 -12842 -10771 -6971 -3096 320 -2369 -468 2828 -1662 -3339
392 -3339 -423 2655 7632 4201 2246 -2115 -2155 2309 8579 2835 1036 6669 9583 5425 3985 4068
376 4068 1897 1966 3979 4420 2292 -320 299 4070 1908 262 1607 3279 3584 4869 4601 5846 5897
359 5897 5216 6471 5597 -1578 -4264 1164 1895 5596 5466 3348 861 -1953 -1136 3361 6157 5283 6421
342 6421 3930 2988 2343 -44 -6459 -6707 -7488 -2505 -660 1208 -1153 541 -3976 -8367 2858 8044
326 8044 5295 2768 1037 -666 3069 2910 2044 -7277 -14522 -5227 -146 -5054 1231 5033 2359 -4751
310 -4751 -6317 -2976 -6238 -6071 -3946 -3850 -2526 -501 3246 3618 3395 3095 -3893 -7012 -7179 -3511 -2859
293 -2859 -2168 -1083 -1552 5882 10316 5457 -1223 -3602 186 -1301 -3382 -5465 -5462 -3046 1039 -1326
277 -1326 -1765 3035 9023 5089 -253 -2866 -616 4710 7599 7574 4463 735 -3653 -1138 642 -197
261 -197 -1658 4326 519 12 1804 744 1554 1695 -104 -3313 -3013 -2385 -7127 -7152 -11499 -15154 -13656
244 -13656 -10483 -9141 -10124 -11615 -7438 -6170 -8678 -5081 -669 -976 -3589 -6866 -7079 -4505 -7068 2927
228 2927 8578 5884 16 -1618 -3547 -6929 -9756 -10625 -9695 -3833 1961 7572 3007 -2377 543 257
212 257 321 701 -4289 -3811 1702 4656 515 -2902 -1123 -597 -4370 -2204 750 3738 999 -5519 -5655
195 -5655 2425 9709 3489 -2607 -4527 -1504 2725 4856 2666 3461 1799 2503 -499 -807 -675 850
179 850 724 -43 -2640 300 4200 5441 2040 -2607 -5639 -4858 -243 5266 6794 2320 -356 1356
163 1356 692 650 807 -1060 -6697 -8662 -7515 -7650 -9493 -3496 501 -1899 -1787 -1978 -889 -3481 -8795
146 -8795 -7969 -4071 -7086 -3113 3622 3864 5936 1685 -4650 58 5127 6480 5523 5911 9390 4030
130 4030 245 -392 1852 4509 7422 6544 2884 -256 440 2995 5198 3452 2372 2145 3298 4096
114 4096 5768 2831 2854 5753 4311 3787 2111 22 2731 -566 -3217 2415 2044 1237 6974 6715 4844
97 4844 1550 -4425 -1217 1847 5060 4443 531 -3774 -2309 -459 -5983 -6475 -6399 -6933 -2745 3033 -260
80 -260 -2561 -3233 -1908 -3288 -1715 -1059 -3615 -3523 -532 445 2443 -865 1006 3178 1647 2044 -1227
63 -1227 -6612 -1721 100 -322 -4757 -3705 -4227 -4582 58 4722 1634 -4012 -2116 7971 9387 4479
47 4479 6689 2789 1167 2064 -182 717 1315 1687 3451 -97 -1665 -2013 -1886 2427 5980 1255 -4151
30 -4151 -5305 -4835 -912 -1122 -4018 -3355 -2609 -268 -4114 -6341 -865 1425 425 649 2741 1941 375
13 375 -1625 2014 3981 1333 -1194 -4058 -3182 -5459 -3874 -855 -180 -3797 -1757
0 -1757
$$ Imaginary data points
##PAGE= N=2
##DATA TABLE= (X++(I..I)), XYDATA
32767 16189 19967 21567 23312 23250 19376 16405 16221 18048 17631 21217 21272 24030 26389 25853 21363 16928
32751 16928 17748 20057 19719 19379 17349 18810 19057 19383 17133 16023 17044 21881 23285 27628 33621 34251
32735 34251 34159 32417 27791 25965 28350 26380 26118 25562 27771 27264 28162 30431 31024 28062 23821 24043
32719 24043 26822 31442 32181 27931 28909 32552 34120 34784 39100 42130 41651 41813 41657 38519 33174 29086
32703 29086 29892 31832 31996 32814 33227 35775 39656 39774 37052 32598 32304 32379 31838 36030 38377 34789 33868
32686 33868 33797 31989 34902 37045 38801 40950 39451 38449 36095 34783 33618 40200 43544 39722 35077
32671 35077 35740 40038 40540 42587 41512 38249 39626 40954 41875 40119 46504 51355 52123 50066 50903 50755
32655 50755 50597 49247 45735 40481 39761 43135 44859 47711 50234 51296 46940 45025 49006 50763 48896
32640 48896 49281 52084 53655 51680 51533 53208 48987 46484 49947 55342 52447 45849 51337 57742 58672
32625 58672 56833 56192 54108 51403 54393 62841 64061 56977 53180 54311 54169 55568 53674 55522 59700
32610 59700 58390 58509 58748 55296 51035 54089 56272 55570 54879 51833 53548 57915 54601 51697 53086
32595 53086 58677 61517 63870 67852 70981 72912 67870 67553 69662 66309 66120 67231 61166 56121 60118
32580 60118 64198 64415 65652 66823 66213 62578 62120 62963 64207 62331 63854 63846 61940 60260 59194 63166
32564 63166 64317 65441 68530 66913 66572 64486 59115 60428 62070 63325 62835 66147 66966 66346 65402 67723
32548 67723 68625 68796 71047 67839 72405 74311 71275 72411 71659 81318 82658 77513 75872 76387 68646
32533 68646 66238 65209 65094 67127 75913 82890 80075 75026 74361 73276 72078 71880 68992 64541 61412
32518 61412 61857 64120 62410 60383 65048 71515 70918 68678 76655 82818 84241 81322 81169 80903 82067
32503 82067 79520 77549 75223 78954 81003 76805 77144 75134 75109 75100 75554 80376 77765 76503 77399 75108
32487 75108 78532 77215 72174 74323 72146 73013 73432 72198 74394 79364 77600 73352 75936 78310 76538
32472 76538 71103 72652 73909 75004 79203 80896 81777 84568 78006 77061 80456 80013 81194 83782 80890
32457 80890 74225 71564 72060 73412 74912 74540 76783 76387 78805 84283 90659 95044 95717 89313 87822
32442 87822 88694 88177 92115 90738 90986 85786 82777 78896 81577 84411 87319 89103 93785 95302 89414
32427 89414 82001 80932 87259 89962 88559 87620 89652 90041 84382 84365 83420 81866 84052 82130 89128 94793
32411 94793 97656 99829 95200 89352 84279 86425 81574 83028 81666 86316 90097 87006 87502 89215 86956
32396 86956 88776 86708 84228 91930 90316 87955 89067 96500 98825 98832 101741 98820 91343 93366 94063
32381 94063 96397 95505 96491 96141 97797 99570 101543 104354 98959 95232 98302 95363 87183 84421 87455
32366 87455 93678 97765 100743 99880 105189 101822 99966 96367 89544 91780 94386 97709 103001 105765 101256
32351 101256 99259 99240 100067 97240 96928 95723 100190 99652 95182 97913 100809 96858 99238 102105 97338
32336 97338 88880 88263 93374 91985 90020 87555 90513 94671 97681 97718 94898 94903 90298 89057 93531 96202
32320 96202 94866 96213 94606 89731 91666 97957 104411 104012 103890 110810 106739 101471 104994 103339 103982
32305 103982 102673 102145 99630 98691 96433 97549 95955 91787 88447 88523 90304 93111 97351 93701 94706
32290 94706 99713 100277 101822 100008 98222 97046 95938 98449 101341 106554 107551 111476 109434 106000 98880
32275 98880 102568 102781 97363 106077 107171 109320 108867 113119 110284 105083 105341 99715 96354 99309 99572
32260 99572 97447 91788 94472 92805 89486 85028 86552 92273 95284 100728 102364 98308 97280 98814
32246 98814 105719 110531 103707 111414 115236 108861 102118 101470 104626 104091 100274 98884 101094 107926 108862
32231 108862 107821 105057 101194 102084 100394 101582 102247 104640 104951 109540 106138 104368 106032 114306 112716
32216 112716 107348 106857 113317 109480 104037 99496 95292 91589 95641 104036 103282 98628 96766 99316 98815
32201 98815 102085 107237 108272 106588 103851 106217 108306 110132 106313 107629 109708 106001 106174 108574 109815
32186 109815 103569 98951 99015 99100 99560 101217 103122 108432 109081 108160 102138 99014 101213 104975 104911 101207
32170 101207 100920 105533 107647 106781 109882 116598 117139 106104 102719 101897 107729 110271 111570 111082 106302
32155 106302 100978 101065 107365 111164 108677 108777 110684 105685 100306 106007 110297 115463 112705 106980 105253
32140 105253 107917 111950 112247 113660 110274 107598 108618 109098 110607 107109 101984 99573 97312 93510 96344
32125 96344 92756 90062 91793 94842 104920 110311 109998 106597 106769 104523 102950 99598 98240 100853 107513
32110 107513 115485 115244 111761 110474 104354 102472 98376 95941 95634 99177 102753 103780 103755 99786 103837
32095 103837 102181 95874 96374 98087 101954 97753 93294 91513 93754 94542 95725 101730 107577 112983 109433
32080 109433 106940 101295 99407 105194 105506 101393 105339 107450 105063 98484 103583 99888 97340 100823
32066 100823 99426 98558 97880 104786 103756 97901 96160 102396 108894 115302 116182 115069 106024 97361 99812
32051 99812 107077 109324 110433 107060 105403 104491 105934 109458 108053 108589 108079 105057 105280 107344 105456
32036 105456 104130 104815 104283 109864 111949 108154 103158 99394 100629 106112 107016 107421 102278 97622 94904
32021 94904 94612 98118 99985 106858 111204 111868 102738 95011 102836 104343 109133 108271 111429 113704 110461
32006 110461 108000 106391 109343 110714 109779 105076 104004 108265 115247 119159 117101 113023 114057 115288
31992 115288 114178 111777 106107 107573 106265 111147 112737 115354 113080 111116 108868 114246 115629 107235
31978 107235 106350 107293 105326 105019 103347 103784 104841 102741 104631 102441 102028 103476 105203 105789 110132 110372
31962 110372 102702 100402 102099 99552 99943 102706 105244 112090 111363 105332 101361 110384 106501 102312 102011
31947 102011 106259 100614 100756 105367 106378 107738 107396 109354 108674 103661 106360 104398 103575 102284 101484
31932 101484 107245 101659 96013 99044 95366 95584 98315 101465 106526 111823 113424 114519 111311 112149 115397
31917 115397 111147 108298 108748 109067 107269 110120 108806 109705 112142 112956 109373 101382 105195 107777 105374
31902 105374 104256 101720 101285 104360 105508 107391 107937 103697 103698 102188 103117 102693 104742 103083 106176 109912
31886 109912 106468 104054 105424 105306 106168 105710 101855 99994 101361 111018 116541 117519 114320 110458 110971
31871 110971 109699 113503 112212 106657 107125 114513 109037 109338 112302 114301 111955 107357 102908 105207 105525
31856 105525 105393 107880 105386 106130 111295 116328 113563 107874 109468 110276 112992 111345 102520 99671 99744
31841 99744 101272 98527 98389 96446 95328 103816 106724 109227 106901 106282 106545 103906 105799 108041 109227
31826 109227 106027 109580 111697 113847 118483 114987 115572 111950 108782 103505 102415 104222 112556 111218
31812 111218 108168 98977 97344 104241 109145 108818 106646 105961 105724 106469 116865 119647 114936 114895 119328
31797 119328 116457 107575 101482 102897 103631 106322 108686 110743 113140 110554 113728 108319 105885 108753
31783 108753 114091 114413 111111 111801 109728 110718 102898 104440 100428 104121 104978 105973 101606 95311 102254
31768 102254 102837 106732 114443 115462 110173 103438 101621 101350 101003 101149 105547 104774 105325 105902 113498 117119
31752 117119 109614 106377 108949 110175 109288 106028 105116 102149 103894 105701 104429 101317 106118 109797 108702
31737 108702 106787 105836 100462 104768 105452 103905 102401 107484 110622 113059 105432 103250 106516 108234 106128
31722 106128 103486 104027 103603 103542 110726 117259 121552 115857 107880 100368 103915 111338 110584 105616 105951 107864
31706 107864 104302 107119 112546 111070 113297 108532 104329 105311 105487 105639 104695 107688 110818 111864 111899 116279
31690 116279 116840 114577 117163 119895 116293 111910 105741 98476 94444 92949 97358 104843 106546 102448
31676 102448 100399 97119 96012 100926 105067 108304 110613 111332 112328 115247 111509 104686 99049 96590 96478
31661 96478 102767 100015 101574 107841 113330 114886 116801 118481 115625 112605 112243 111868 110389 108757 108033
31646 108033 109595 115661 115406 110355 103952 99515 103461 108291 108167 109526 110133 115457 118651 113727 103646
31631 103646 100399 99955 107622 107304 104998 107613 104518 103463 109718 108663 98900 90927 90441 98017 100119
31616 100119 110164 118384 122093 116173 110506 105721 107181 109995 111941 110405 109811 113129 116970 109987
31602 109987 103712 104722 110400 108198 108040 113658 114042 102560 95135 98171 105098 105769 109130 107155 105237
31587 105237 106469 107590 105285 105282 104403 98689 98147 106481 113365 112573 104776 98182 100807 105903 111128 106323
31571 106323 105363 103558 106116 107021 108347 106369 104662 105899 105640 107018 104684 101825 106017 108154 108279
31556 108279 108135 104356 103421 104528 107525 101846 103845 102277 102980 106966 113374 112806 103813 103589 105854
31541 105854 103061 104440 107684 110110 108204 104079 96310 96492 101506 102963 103031 104891 107872 109814 112332
31526 112332 101902 100353 104162 104610 109550 119112 118180 112687 118531 120717 122907 120505 115091 111939
31512 111939 107516 100846 99595 102740 98493 97814 104461 106533 107869 106185 109455 109531 110225 113428 113081
31497 113081 107813 102055 110017 107965 110184 116715 113038 109608 107474 103894 105255 107281 102167 101849
31483 101849 102827 104204 106641 112945 112096 108335 110959 105172 104405 111248 117384 114255 111281 112451 111310
31468 111310 113263 117874 121084 120796 113804 105238 99620 103725 107096 112461 118655 119097 116974 115945 114966
31453 114966 115335 117318 114202 107616 105690 103210 103908 113807 115922 115818 119944 114567 108387 108341 110720
31438 110720 109373 107300 109522 114224 113081 107315 99485 98859 104172 107869 110499 114395 118520 117558 116877
31423 116877 115216 114094 116522 115503 113196 113846 113581 113903 116083 117794 117987 114201 109023 108579 109991
31408 109991 108998 102883 103904 113910 116275 111980 103839 98726 98649 100019 103200 109422 113708 111577 107926
31393 107926 105952 108144 111983 110105 111710 112361 114795 117628 119515 122316 119097 118647 117515 116855 116259
31378 116259 110964 102397 100838 106766 106094 109906 111075 103517 107010 108509 108031 113043 108751 101971 100933
31363 100933 101332 103269 111976 113808 105164 99972 101980 104552 102471 99134 98780 100724 101810 108941 112428
31348 112428 111212 112917 118588 121038 116700 116934 124132 123398 118815 109776 106118 104060 103866 109400 112239
31333 112239 111797 103192 99759 99716 101505 109138 115850 113297 107804 105708 109730 110588 109529 107622 108769
31318 108769 107359 113338 112646 112723 112420 110292 110181 111720 107780 108433 107917 106912 111405 110904 105923 99086
31302 99086 100230 100071 97911 99947 99808 100455 108133 111955 111738 107632 105916 112634 113928 108688 104617
31287 104617 107569 109834 106828 108278 110432 111459 103574 94699 99150 96779 97981 95426 95685 106372
31273 106372 117307 119673 117406 117310 117885 118291 108187 105231 107066 107216 109261 112603 112246 114151 118594
31258 118594 121243 118032 113832 113384 110073 107292 114620 118745 114761 111055 111525 118486 117951 109624 106384
31243 106384 104210 102765 102604 107950 115586 115416 113046 107890 105207 108511 107104 110198 114066 118671 114401
31228 114401 112872 113730 114654 111919 114135 121243 127468 125648 121514 114027 112608 109906 107672 105911 108741
31213 108741 114562 114120 113210 110268 106463 105386 110025 106746 102782 100080 106609 107759 105941 100098 97015
31198 97015 99505 102068 109879 115269 110585 107971 104882 108264 108932 106106 101370 103793 109776 111709 103862
31183 103862 102584 109446 112717 111597 106304 105283 106101 110260 107607 106826 108589 105035 101803 100630 104232
31168 104232 108163 108633 110795 117462 114489 109439 107721 107864 104751 100830 100491 107262 108234 111412 110046
31153 110046 112360 114493 118878 120789 119529 117465 118733 115625 110587 113932 109467 107821 109371 110914
31139 110914 111546 108113 109005 107213 104251 99184 99957 103991 105037 107960 116578 117847 111589 116737 124305
31124 124305 127747 120739 114100 114863 116695 109667 103170 103497 104954 106257 109372 110481 108726 104393 105130
31109 105130 108724 115396 118857 120884 119740 111720 107068 104534 107514 108170 102447 102164 100378 104648 110527
31094 110527 112913 108596 110793 110849 111807 108358 106192 103040 102334 102647 102667 103185 107166 109291 107628 107999
31078 107999 109909 115438 117561 114610 114252 114181 116401 113079 115138 117439 117197 113048 109367 109016 112774
31063 112774 115399 116237 117594 110765 109819 110419 107583 107260 110357 109948 106516 104592 105716 104644 108415
31048 108415 114179 115839 114039 110393 106468 105284 102232 108811 114875 108710 106222 114606 113835 111369
31034 111369 113415 112968 108917 106910 105260 110170 112400 115051 113406 109238 110369 108847 106336 106769 107759
31019 107759 104257 107512 112215 113924 112081 110061 103146 98888 99106 104563 107959 106759 105913 99746 102580
31004 102580 107018 104307 102768 106380 106087 106035 110618 113949 112646 110849 109598 110076 113922 116996 116782
30989 116782 120758 119906 118939 117958 115990 115616 111855 109615 109520 111197 111660 109418 107473 104434 101079 99470
30973 99470 103433 102219 101328 100415 99690 98658 100287 105373 112003 115263 113464 114863 113199 111190 112569
30958 112569 113430 115935 118385 117520 116276 112690 113564 111270 111372 110187 113580 119124 123580 120859 111362
30943 111362 107033 114636 116077 115632 117426 115522 112830 112279 111844 112765 113749 110774 106184 105284 110302 114611
30927 114611 115966 111880 110634 111740 115435 113996 114393 114305 115980 121104 115304 113916 113860 114510 107458 102399
30911 102399 107161 108363 111154 112992 110049 95691 97906 104310 104395 113343 113254 110993 115616 116912 115047
30896 115047 110612 118834 121624 117664 112886 114103 121950 123833 127055 123831 116175 108114 104736 108898
30882 108898 104643 101601 107116 112679 109282 112281 115203 113848 114711 117060 110552 108706 111407 116687
30868 116687 120825 117287 121665 121460 120411 117351 116112 113733 110223 109902 111052 109771 107697 107668 106937
30853 106937 110385 108426 108529 111966 116658 116459 115558 117143 114740 111059 106596 107824 111377 110706 115705
30838 115705 115230 112640 106458 103868 99320 105932 110048 110055 114233 112420 108429 109146 111440 117496 117737 114624
30822 114624 111530 113039 117995 116107 113941 112296 111501 111668 113482 107143 106854 113278 108945 107322 108047
30807 108047 112160 113013 112344 111123 110877 112636 116766 119811 122214 119930 117090 113318 110247 112815 117882
30792 117882 121843 119478 113947 113940 112890 115030 114715 113404 113752 114930 113049 112153 106489 107300 108394 112429
30776 112429 109654 103619 106118 113328 118024 118783 122066 121748 123469 125584 121410 120667 123702 124676 126627
30761 126627 121623 117291 119841 122444 125653 126775 125504 121266 119665 116094 119856 113454 107456 110902
30747 110902 116933 116113 112974 109092 107931 111826 109107 106246 110169 112870 112420 119214 121288 120738 118702
30732 118702 116114 117562 116631 114934 110841 109205 107697 101959 100564 105734 110607 117468 120343 116871
30718 116871 114505 118283 116941 112927 112161 109775 101996 112347 119989 119472 120079 122162 118642 117954 111054
30703 111054 110141 112476 115355 116685 113689 113460 115828 119198 120798 122378 116570 113388 110928 115708 116177
30688 116177 117729 116474 115679 126042 125065 124526 122793 123216 121332 120330 118096 116227 114626 117521 115767
30673 115767 113706 113693 115571 122363 123891 122012 120553 121537 122904 121351 124822 119346 116814 115948 119292
30658 119292 122231 125918 128919 125302 115428 113898 115086 115986 114350 111776 113172 115691 120219 115525
30644 115525 112874 112100 118320 113090 118487 119927 115467 115199 115138 108815 109286 109185 108431 117006 117164 113801
30628 113801 119286 119794 116209 119374 121220 119994 119829 115586 113082 117483 118306 118277 110713 108245 112863
30613 112863 111388 112257 111962 116866 119076 121140 120869 116209 115795 115140 110318 111763 109583 108662 110848 114249
30597 114249 113710 113780 116675 120883 115950 115907 119962 112559 107214 106248 104922 103277 109603 111025 114191 115380
30581 115380 122410 124972 121242 116454 118936 122434 116715 105976 106291 111853 115252 117371 119923 122606
30567 122606 120854 113959 110146 108301 110651 117327 123916 128739 127482 124241 120358 121699 122088 121440 124623
30552 124623 120682 121023 122277 121128 124912 122515 116662 115800 118722 116502 118305 108270 99874 102327
30538 102327 103182 106048 111781 114651 117949 117018 117522 121290 122418 118098 113669 113293 109136 105109 108371
30523 108371 114866 115174 112475 114773 120155 119380 119530 115794 112123 112923 113037 111547 115057 117815 119827
30508 119827 120246 113801 113667 110489 111921 119491 118978 120115 120228 114352 110127 116077 118472 116671 114392
30493 114392 122670 129328 126051 126052 117984 112186 107598 105316 104496 105441 106483 101095 105097 113061 120185
30478 120185 123218 123154 119385 113309 114425 111718 117019 120199 113264 111882 115742 116531 115335 116770 118043
30463 118043 121108 123920 123066 123899 121382 121453 116967 114403 113784 119303 118864 116418 117912 123198 119682 115956
30447 115956 107656 102696 103608 108859 113480 119159 121904 122486 119968 116138 115708 112581 114957 116008 111602
30432 111602 106663 114235 123072 120804 117765 118869 120898 120119 118367 118891 117659 113732 121065 125610 124596
30417 124596 130439 130517 125978 122579 120896 119419 116245 117318 116822 116908 113745 114992 117696 119698 117296
30402 117296 115270 109667 110527 115984 121812 123392 115062 114482 118112 117684 121901 124256 127624 129409 125843
30387 125843 125711 121625 123441 124347 123317 126634 128658 128811 129916 125302 127931 123238 122476 124044 125069
30372 125069 125707 120099 117674 118060 115947 113568 119031 123952 127056 122584 118010 117139 118133 113384 109904
30357 109904 108050 109979 117164 118073 120787 121078 122050 117132 114636 114376 119239 122081 122073 119857 110577 101642
30341 101642 100733 111636 113217 114832 119503 119102 120811 123060 112417 114588 116038 114911 116709 120653
30327 120653 120834 116851 121062 126455 122596 121958 125311 125027 122160 122012 117139 112369 111257 118806 120603
30312 120603 119779 121433 123227 118830 120114 121225 112037 108683 112905 114538 119634 119826 119634 122149 119618
30297 119618 119248 120533 121398 117558 111017 115179 116376 119506 119927 117439 115600 115408 117110 117223 111070
30282 111070 107033 111240 111187 112691 114563 109334 109654 109561 115133 120223 122294 123907 126374 124093 118396
30267 118396 114875 112525 121443 120088 115615 111899 115194 119005 115441 115806 106635 106149 112352 113208 114847
30252 114847 121878 125092 121704 115097 114588 110418 104296 110692 116470 114741 121586 119615 110281 111426
30238 111426 117479 121419 123320 123392 121574 114105 114238 116542 117116 114787 117991 124801 119494 114391 113126
30223 113126 111139 114595 117146 111543 113329 116144 117241 114780 107217 102806 107467 111343 114709 120615
30209 120615 124897 122404 120201 124269 121904 115830 117496 112210 104788 105686 108992 114433 114254 118437 111791
30194 111791 106765 112062 119581 123089 114776 113629 121761 129045 123237 121547 121408 120878 124905 127044 122667
30179 122667 118199 122373 126441 124975 125908 129624 121496 112352 112654 114233 116678 120388 124829 123728 117166
30164 117166 112587 108309 111654 113497 115129 118764 121480 117577 113013 112010 112611 113263 115907 120606 122459
30149 122459 113081 109810 109795 105341 113220 118903 119811 119341 115285 121883 129207 130332 120757 118491 121051
30134 121051 121040 119751 116792 117303 115370 111396 116790 118402 120950 119586 120609 116764 114209 109381 111711
30119 111711 121796 120233 113810 112261 116742 119165 116087 114375 118532 124285 125020 120311 118678 115982
30105 115982 117665 121371 123776 124806 119455 114438 117752 122446 122397 118941 116513 114319 115644 116241 115022
30090 115022 118713 119390 119563 115473 114146 122150 126249 124560 122138 121337 120541 118462 119711 123205 123518
30075 123518 121986 126611 122119 118563 119667 118936 118492 117872 115005 113080 115803 123453 120941 123237 121121
30060 121121 118912 117341 115867 115040 116965 119181 114464 111408 106040 108349 116650 117726 118320 123749 131579
30045 131579 133559 121950 120368 127948 135481 129988 125431 127391 128599 127954 125899 120734 114991 115832
30031 115832 117994 121352 122437 124911 121332 119058 121772 119031 118633 128702 128570 128179 126837 128338 122972
30016 122972 121447 119050 120034 118025 118818 118818 122548 123239 114518 107945 107750 111064 116781 117586 122876 127420
30000 127420 122254 122683 123923 120458 116865 117186 116537 115952 115017 119190 120553 125033 125534 122974 122751 113868
29984 113868 107473 109528 119357 120677 123180 124111 126169 132267 134785 127448 125531 125626 123771 118024 111431
29969 111431 106144 102695 104817 112164 117825 124081 123603 117245 121309 129507 124833 117183 112900 113800 118218
29954 118218 116517 114338 113961 117694 119009 119742 119385 118818 117385 115533 118403 119604 118608 117106 118088 116372
29938 116372 114121 112295 109317 109636 114526 115828 116462 119779 123195 122299 122423 127976 130418 125814 129924
29923 129924 130682 128966 122172 122291 121085 121165 117288 116304 122495 131324 128565 123549 117786 109653 108300
29908 108300 116499 122625 125930 124685 122532 126822 127030 124092 121534 123551 127521 122740 116022 115745 115432
29893 115432 116436 117085 123513 124540 124431 128388 129680 131855 129875 128201 133342 136614 129143 124232 124656
29878 124656 122821 121588 118397 109193 113882 116227 123530 125641 122801 115975 114383 115238 117558 113997
29864 113997 117169 122768 119299 116911 119407 123012 121441 119011 124560 129573 128691 124715 121358 116297
29850 116297 114960 119813 117386 118781 118679 125893 130990 132261 132947 127777 119694 116032 122701 120345 120295
29835 120295 119476 123313 124631 122589 125008 125156 120688 118961 125378 128969 125240 126118 125613 120358 118868
29820 118868 122706 120283 118215 119008 124600 120345 122090 126051 130093 126373 126512 127610 130207 135659 133040
29805 133040 130986 130270 134158 132385 132719 128206 121589 122814 123142 119121 121192 124981 131025 133057 121596
29790 121596 124828 127055 127660 124098 124521 125125 126436 122919 120432 123129 127861 128235 125018 120279 122477
29775 122477 120673 122378 122223 122436 121456 116194 117325 125525 127847 130093 131283 131918 131808 126010 121953
29760 121953 126883 128621 125655 122191 123605 122067 115136 112535 118894 125889 123399 120040 119254 116341
29746 116341 111840 114617 115745 120700 123111 119813 119212 129214 124358 120981 120182 124566 126616 126065 125947
29731 125947 124143 123908 120288 111185 107582 115272 120317 122022 122852 122121 125348 125998 126515 130116 130304 125692
29715 125692 126472 120715 120505 122991 129461 127874 122471 123080 123625 119746 122611 125194 121698 118489 115466
29700 115466 112030 113644 116794 121005 119599 112899 114860 118394 118941 119355 123869 123912 115062 115376 120978
29685 120978 124371 121302 121625 120803 122930 125194 123414 125136 125172 124292 121089 120306 122806 123664 126326 123623
29669 123623 121282 124060 121278 116656 118670 128655 129726 131414 129736 130775 136639 137536 136797 131390 129690
29654 129690 126802 119945 117306 113596 116767 121775 122902 125558 125373 125946 130391 127669 123615 123233 123818
29639 123818 130091 137221 137726 133670 132529 128595 124150 125713 125527 128490 120314 118639 120432 124478 122278
29624 122278 122975 124223 127637 126077 124443 124966 122048 115867 113426 116178 123182 119990 121618 128663 129176
29609 129176 132550 129267 121679 124108 122396 120911 125177 127269 120349 122601 122841 122717 125131 119153 114700
29594 114700 117502 119636 116550 111638 115757 115669 115895 118730 119709 119893 123762 125260 126757 121284 117484
29579 117484 111066 112359 114732 112947 115306 120385 120822 123748 117078 111600 114296 118771 119445 119805 119550
29564 119550 116885 115313 118370 118542 115631 110641 112938 113620 113923 115742 118893 120382 119532 121848 117450
29549 117450 112131 109590 108739 110783 113710 119000 125934 127488 129023 124839 122912 126913 121045 118072
$$ [...]
##END NTUPLES=NMR SPECTRUM
##END=
