##TITLE=Analysis number 314616
Compound Code mo 00101
Project Code adrs
Chemist Name ugmt
##JCAMPDX= 6.0         $$ Bruker NMR JCAMP-DX V2.0
##DATA TYPE= NMR SPECTRUM
##DATA CLASS= NTUPLES
##ORIGIN= Bruker BioSpin GmbH
##OWNER= NMR
$$ XWIN-NMR		Version 3.5
$$ Fri Oct 21 09:37:21 2005 GMT Daylight Time (UT+1h)  MAYBRIDGE\NMR@NMR_250MHZ
##.OBSERVE FREQUENCY= 250.131544655141
##.OBSERVE NUCLEUS= ^1H
##.ACQUISITION MODE= SIMULTANEOUS (DQD)
##.ACQUISITION SCHEME= undefined
##.AVERAGES= 16
##.DIGITISER RES= 18
##SPECTROMETER/DATA SYSTEM= dpx250
##.PULSE SEQUENCE= zg30
##.SOLVENT NAME= DMSO
##.SHIFT REFERENCE= (INTERNAL, DMSO, 0, 16.522)
##AUDIT TRAIL= $$ (NUMBER, WHEN, WHO, WHERE, WHAT)
$$ ##TITLE= Audit trail, XWIN-NMR		Version 3.5
$$ ##JCAMPDX= 5.01
$$ ##ORIGIN= Bruker BioSpin GmbH
$$ ##OWNER= NMR
$$ C:\u/data/dgb/nmr/ADRS/11190/pdata/1/auditp.txt
$$ ##AUDIT TRAIL=  $$ (NUMBER, WHEN, WHO, WHERE, WHAT)
(   1,<2005-10-21 09:37:03.44 +100>,<MAYBRIDGE\NMR>,<NMR_250MHZ>,
      <created by zg, POWCHK disabled, PULCHK disabled
       configuration hash MD5:
       62 19 C7 07 E1 42 D1 B7 37 6C 3D D0 77 39 F9 E6
       data hash MD5: 64K
       DC 03 83 E0 AE 36 F9 4A D1 C0 D0 F3 AB 81 F1 FF>)
(   2,<2005-10-21 09:37:13.77 +100>,<MAYBRIDGE\NMR>,<NMR_250MHZ>,
      <Start of raw data processing
       ef LB = 0.3 FT_mod = 6 PKNL = 1 SI = 32K 
       data hash MD5: 32K
       0A 11 AE E4 4F F1 A9 CF 8E D9 AE 70 B3 33 72 85>)
(   3,<2005-10-21 09:37:15.60 +100>,<MAYBRIDGE\NMR>,<NMR_250MHZ>,
      <apk 
       data hash MD5: 32K
       45 75 C9 CF 94 CD 69 DB 15 98 CD 5C EE ED 39 33>)
(   4,<2005-10-21 09:37:16.35 +100>,<MAYBRIDGE\NMR>,<NMR_250MHZ>,
      <abs ABSG = 5 
       data hash MD5: 32K
       87 1C 72 14 9B 0C FA DB 1E 19 2F 78 FB F3 21 E8>)
$$ ##END=
$$ 
$$ hash MD5
$$ A6 BD 18 D1 F6 3E C3 F1 1D 82 BC 5B 32 A0 2C C7
##$RELAX= 
##$RELAX= 
##$RELAX= 
##$RELAX= 
##$RELAX= 
##$RELAX= 
##$RELAX= 
$$ Bruker specific parameters
$$ --------------------------
##$DU= <C:\u>
##$EXPNO= 11190
##$NAME= <ADRS>
##$PROCNO= 1
##$TYPE= <nmr>
##$USER= <dgb>
##$AMP= (0..31)
100 100 100 100 100 100 100 100 100 100 100 100 100 100 100 100 100 100 
100 100 100 100 100 100 100 100 100 100 100 100 100 100 
##$AQSEQ= 0
##$AQ_mod= 3
##$AUNM= <au_zg>
##$AUTOPOS= <9 >
##$BF1= 250.13
##$BF2= 250.13
##$BF3= 250.13
##$BF4= 250.13
##$BF5= 500.13
##$BF6= 500.13
##$BF7= 500.13
##$BF8= 500.13
##$BYTORDA= 1
##$CFDGTYP= 0
##$CFRGTYP= 5
##$CHEMSTR= <none>
##$CNST= (0..31)
1 1 145 1 1 1 1 1 1 1 1 1 1 1 1 1 1 1 1 1 1 1 1 1 1 1 1 1 1 1 1 1 
##$CPDPRG= <>
##$CPDPRG1= <>
##$CPDPRG2= <>
##$CPDPRG3= <>
##$CPDPRG4= <mlev>
##$CPDPRG5= <mlev>
##$CPDPRG6= <mlev>
##$CPDPRG7= <mlev>
##$CPDPRG8= <mlev>
##$CPDPRGB= <>
##$CPDPRGT= <>
##$D= (0..31)
0 1 0 0 0 0 0 0 0 0.06 0 0 0 0 0 0 0.0002 0 0 0 0 0 0 0 0 0 0 0 0 0 0 
0 
##$DATE= 1129883822
##$DBL= (0..7)
120 120 120 120 120 120 120 120 
##$DBP= (0..7)
150 150 150 150 150 150 150 150 
##$DBP07= 0
##$DBPNAM0= <>
##$DBPNAM1= <>
##$DBPNAM2= <>
##$DBPNAM3= <>
$$ [...]
##$SUBNAM7= <"">
##$SUBNAM8= <"">
##$SUBNAM9= <"">
##$SW= 20.6930455092707
##$SWIBOX= (0..15)
0 0 3 0 0 0 0 0 0 0 0 0 0 0 0 0 
##$SW_h= 5175.983436853
##$TD= 65536
##$TD0= 1
##$TE= 295.16
##$TE2= 300
##$TE3= 300
##$TEG= 300
##$TL= (0..7)
0 120 120 120 120 120 120 120 
##$TP= (0..7)
150 150 150 150 150 150 150 150 
##$TP07= 0
##$TPNAME0= <>
##$TPNAME1= <>
##$TPNAME2= <>
##$TPNAME3= <>
##$TPNAME4= <>
##$TPNAME5= <>
##$TPNAME6= <>
##$TPNAME7= <>
##$TPOAL= (0..7)
0.5 0.5 0.5 0.5 0.5 0.5 0.5 0.5 
##$TPOFFS= (0..7)
0 0 0 0 0 0 0 0 
##$TUNHIN= 0
##$TUNHOUT= 0
##$TUNXOUT= 0
##$USERA1= <user>
##$USERA2= <user>
##$USERA3= <user>
##$USERA4= <user>
##$USERA5= <user>
##$V9= 5
##$VALIST= <valist>
##$VCLIST= <CCCCCCCCCCCCCCC>
##$VD= 0
##$VDLIST= <DDDDDDDDDDDDDDD>
##$VPLIST= <PPPPPPPPPPPPPPP>
##$VTLIST= <TTTTTTTTTTTTTTT>
##$WBST= 1024
##$WBSW= 4
##$XGAIN= (0..3)
0 0 0 0 
##$XL= 0
##$YL= 0
##$YMAX_a= 421863
##$YMIN_a= -262387
##$ZGOPTNS= <>
##$ZL1= 120
##$ZL2= 120
##$ZL3= 120
##$ZL4= 120
##$ABSF1= 16.522
##$ABSF2= -4.171173
##$ABSG= 5
##$ABSL= 3
##$ALPHA= 0
##$AQORDER= 0
##$ASSFAC= 0
##$ASSFACI= 0
##$ASSFACX= 0
##$ASSWID= 0
##$AUNMP= <proc_1d>
##$AZFE= 0.1
##$AZFW= 0.1
##$BCFW= 0
##$BC_mod= 0
##$BYTORDP= 0
##$COROFFS= 0
##$CY= 12.5
##$DATMOD= 1
##$DC= 0
##$DFILT= <>
##$DTYPP= 0
##$F1P= 14.0000005364418
##$F2P= -0.99999901652339
##$FCOR= 0.5
##$FTSIZE= 32768
##$FT_mod= 6
##$GAMMA= 0
##$GB= 0
##$INTBC= 1
##$INTSCL= 1
##$ISEN= 128
##$LB= 0.3
##$LEV0= 0
##$LPBIN= 0
##$MAXI= 10000
##$MC2= 0
##$MEAN= 0
##$ME_mod= 0
##$MI= 0
##$NCOEF= 0
##$NC_proc= -5
##$NLEV= 6
##$NOISF1= 0
##$NOISF2= 0
##$NSP= 0
##$NTH_PI= 0
##$NZP= 0
##$OFFSET= 16.522
##$PC= 1
##$PHC0= -80.02483
##$PHC1= 7.690391
##$PH_mod= 1
##$PKNL= yes
##$PPARMOD= 0
##$PSCAL= 4
##$PSIGN= 0
##$REVERSE= no
##$SF= 250.13
##$SI= 32768
##$SIGF1= 0
##$SIGF2= 0
##$SINO= 400
##$SIOLD= 32768
##$SREGLST= <1H.DMSO>
##$SSB= 0
##$STSI= 32768
##$STSR= 0
##$SW_p= 5175.98343685301
##$SYMM= 0
##$S_DEV= 0
##$TDeff= 65536
##$TDoff= 0
##$TI= <Analysis number 999999
Compound Code 99
Book Reference 9
Project Code 9>
##$TILT= no
##$TM1= 0
##$TM2= 0
##$TOPLEV= 0
##$USERP1= <user>
##$USERP2= <user>
##$USERP3= <user>
##$USERP4= <user>
##$USERP5= <user>
##$WDW= 1
##$XDIM= 32768
##$YMAX_p= 329853291
##$YMIN_p= -497147
$$ End of Bruker specific parameters
$$ ---------------------------------
##NTUPLES= NMR SPECTRUM
##VAR_NAME=  FREQUENCY,     SPECTRUM/REAL,   SPECTRUM/IMAG
##SYMBOL=    X,             R,               I
##VAR_TYPE=  INDEPENDENT,   DEPENDENT,       DEPENDENT
##VAR_FORM=  AFFN,          ASDF,            ASDF
##VAR_DIM=   32768,         32768,           32768
##UNITS=     HZ,            ARBITRARY UNITS, ARBITRARY UNITS
##FACTOR=    0.157963299565203, 1,           1
##FIRST=     4132.6476996994, 0,             0
##LAST=      -1043.33573715361, 0,           0
##MIN=       -1043.33573715361, -497147,     0
##MAX=       4132.6476996994, 329853291,     0
$$ Real data points
##PAGE= N=1
##DATA TABLE= (X++(R..R)), XYDATA
$$ [...]
25823A6559J00616m8665q2396M5013l8699L4366N1243K2455J6063k6678r3991
25812d114n4324j5867l6073j25218J5244J18312J3225M9990O7407N3137J0656
25801I2375J019j46842L2878N4624m6666L6582O0673m8062n3734m1293J1148n2088
25789i9386m2661q9142M6114n667l7563J47760J12582j5391M1238K8197j27194
25778d1113M519M5421n7549l6810M3575N8470R4718O3118j10618q7141j1973r8239
25766a33622L1325r876J48223L6645k3947j21841j35896K6752J00747K538O0577
25755a8375n5397M1166K2962p6765n3139q0228K7920O7614N1148M7246R2325L1789
25743I8266n6448r370J7946p5919n4771L4315l1858L972j3647K9412J7429j1701
$$ y = [16559, 117175, 68510, -13886, 31127, -7572, 26794, 78037, 100492, 116555, 89877, -4114, -58438, -74305, -110378, -235596, -220352, -102040, -88815, -38825, 28582, 81719, 92375, 93394, -53448, -20570, 34054, -12612, 23970, 84643, 36581, -17153, -58446, -47298, -99386, -142047, -231189, -185075, -190742, -228305, -80545, 32037, 16646, 57884, 86081, -41113, -36594, 8827, -48722, -85532, -41957, 16513, 111231, 174349, 63731, -23410, -35383, -133622, -102297, -112173, 36050, 72695, 48748, -73093, -208989, -182237, -81490, -78952, -18375, -73772, -32606, -9644, -86409, -139548, -219776, -191856, -124242, -73094, -25848, 66477, 98266, 41818, 32448, 50394, -25525, -80296, -45981, -77839, -73867, -87514, -58102, -40673, -52374]
25731e2374l8866P6044K3576k3297K6011J10355j0219o4012K3359o4646L3778
25720C9709o2264M380j4481J18318K8635k4863p2246K9704r9663r8431N0042J24887
25708B3727j9069r4253o448p6918J28805M9381j3835o1030j40470M4571M8262
25697a17277Q565J4713N2753j11540n9728k929Q5799J4207k1224p006J91897n2332
25685d102J1851n0846j49860j08309P1387R3481P0001K7400l3631r5184m6798
25674b14610N2274J39138O822J9392J21658L4443j47571m315L2836j8715p2263
25663e0911N482j2269l3376R3944P6360j1906Q064k8428j60627k6619N5468M6239
25651c8579j5214J16647J61291p9341q0324o7825k1580n7526K1193p5646L6038
$$ y = [-52374, -91240, -15196, 8380, -14917, 11094, 121449, 111230, 47218, 70577, 5931, 39709, -22555, -18175, -32656, 85662, 114297, 89434, 17188, 46892, -52771, -151202, -101160, 23727, 4658, -89595, -96043, -172961, -44156, 5225, -8610, -69640, -210110, -165539, -117277, -108712, -93999, -41246, -152786, -212514, -215443, -129644, -115437, -136661, -143667, 48230, -4102, 7749, -43097, -192957, -301266, -229879, -136398, -66397, -38997, -72628, -167812, -214610, -162336, -23198, -16376, 3016, 124674, 159117, 11546, 7231, 40067, 21352, -50911, -45429, -57698, -91074, 2870, 79230, 67324, 75388, 46960, -113667, -140286, -84818, -38579, -53793, 62854, 224145, 144804, 64480, -3345, -24925, -82451, -61258, -136904, -100866]
25640a00866J26296R371k699n814p216o5923m4520J04559J23960K6054l5731o2267
25628F5204n6842m7265j1838O9822m6516r9992O22Q787J3543k2798q247N1752
25616h3768q0561j1395j4646J77726J36319J5808K3259k1657J7337r8997j6753
25605D2672n0439M5231K6254K4776j8138J10415q2267n973M3368q0237k0661j00358
25593f5357o3742N2957j1274l8637l8841m642q7134J13797J52598j09876j6189
25582a16340N731J07076o489K2496l019Q3142K919k9083j3523q6536M3819M4606
25570E4799q1405p6415P39J43868N4787r0596n9912j4367P966O973k5269K6452
25558e2380j0551k5244l9038J14769R7641O427N3874O3660J3221j07807N9455
$$ y = [-100866, 25430, 34801, 32102, 26288, 19072, -46851, -91371, 13188, 137148, 163202, 127471, 65204, 8362, -38903, -50741, 19081, -27435, -127427, -126805, -118018, -104475, -127273, -135520, -83768, -164329, -175724, -190370, -12644, 123675, 139483, 162742, 141085, 158422, 59425, 42672, -7767, 37464, 63718, 88494, 70356, 180771, 98504, 92531, 135899, 55662, 35001, -65357, -129099, -76142, -87416, -126053, -164894, -169536, -256670, -142873, 9725, -100151, -116340, -110609, -3533, -10022, 12474, 9455, 92597, 95516, 66433, 52910, -33626, 10193, 54799, -26606, -103021, -102282, 41586, 96373, 5777, -54135, -68502, -60536, -53563, -78832, -52380, -62931, -88175, -127213, -12444, 85197, 91624, 145498, 209158, 222379, 114572, 174027]
25547A74027K2160q4303J7712o4639j00759M6850R9457K9163n8125p128M621n1617
25535B7419l7089m0732P8203L7486k5577q725l0108Q2445j9518r0362j13362J6447
25523a23473k8574l0646O5702n06O9335m2455M1462r1079m7114J6879J53026N9644
25511D2201j2024N5461n2091j00345j32242k6225J24545J66019O724N3041j3293
25500A11771r401l2333p584n5288n1541m2743j0958q0934J51417J47840l9562
25489H0684m3354j3775J06022N6789j54842j01682O8145l7115J6403l5810m2003
25478a00538p8074K9460O5466J34185R9467K3165j40868p1029l1815o7849K3402
25467a15028J19000O4221P5521N6726M1201p1555l0757L9113n5830r3676m3389
$$ y = [174027, 196187, 111884, 129596, 64957, -35802, 11048, 110505, 139668, 81543, 74415, 79036, 27419, -9670, -50402, 27801, 65287, 39710, 30985, 877, 83322, 63804, -26558, -139920, -123473, -152047, -182693, -116991, -117497, -48162, -90617, -49155, -140234, -187348, -170469, -17443, 42201, 30177, 85638, 33547, -66798, -199040, -225265, -100720, 65299, 72023, 125064, 111771, 102370, 70037, 62453, 7165, -44376, -87119, -98077, -179011, -27594, 120246, 80684, 37330, 23555, 129577, 186366, 31524, -70158, -2013, -39128, -22725, -58535, -100538, -178612, -149152, -83686, 50499, 149966, 173131, 32263, -38766, -70581, -138430, -115028, 3972, 68193, 143714, 200440, 241641, 170086, 139329, 178442, 122612, 28936, -14453]
25456a4453k6594P4151j4175k2758l7391q12M7440R9262N5843p6263q5477n4629
25444e5856m829O3055J19285L6758q1086K9833M476o5437L4674m7165l0934O1361
25432F4135j6423N2728J56415q2938j9717l6970o494o8892m0364P1338N5731j9317
25420A09232r8477o1210q3906o5265q471o2438J21122J68769L6460n0492L0517
25409C5841K4366p0220n28j22361L0227j8750k7407L6423P0408l043N0404k2987
25397a7627J8394O8727J113o0820P7925n0622k3468j5882M8571j1567J6651r197
25385D2198L9101K4681k3588n6570n8721R1172n2508j50226M6073j3454P2427
25374c9415J56802j4304k8358o0029p0977P3512Q0295k1037p1361N8841M1435
$$ y = [-14453, -41047, 33104, 18929, -3829, -41220, -42032, 5408, 104670, 160513, 84250, -1227, -55856, -60685, 2370, 121655, 158413, 77327, 107160, 111636, 46199, 80873, 33708, 2774, 64135, 47712, 100440, 256855, 173917, 154200, 117230, 110736, 41844, 1480, 72818, 128549, 109232, 10755, -50455, -134361, -199626, -208097, -270535, -149413, 19356, 55816, 5324, 35841, 60207, -10013, -10541, -132902, -102675, -121425, -148832, -112409, -42001, -45044, 5360, -17627, 767, 69494, 70607, 9787, 87712, 37090, 13622, -2260, 46311, 34744, 51395, 42198, 81299, 105980, 82392, 25822, -32899, 58273, 5765, -144461, -98388, -111842, -39415, 117387, 103083, 74725, 14696, -56281, 17231, 97526, 76489, 5128, 63969, 105404]
25363A05404j69486j05093l15j02455J02677J07972J78598j4927j26885o3627
25353h8137N8217K324L7250K5706Q485n3657K3266L6267O5907L4540k0503j13797
25341A5868j15894l5000K573n8545K4004O3973Q2242k1328K3971j18583q3105
25330b19824M6623O4446J08579k4985l523k4622k4131o5105r4872o4821J7378
25319b84857L5991L7120k0604j0962J2144K525Q3304m7777k9299P4164P5586K5849
25307d6816K9345M0119m5090o8764q5491J0577M7951J03771O4636M1102q0021
25296A1319p2846o8889K7382q3888o9482J11174J48323K986j797j9639P9651J04957
25284A69251m9460j13343r3385K929o3042O6087J6164K0307M1589J55816L4000
$$ y = [105404, -64082, -169175, -169490, -271945, -169268, -61296, 117302, 102375, -24510, -88137, -29920, -27596, 9654, 35360, 43845, -9812, 13454, 49721, 115628, 150168, 129665, 15868, -100026, -135026, -132453, -190998, -166994, -103021, -20779, -42107, -18136, -136719, -219824, -173201, -108755, -176, -25161, -28684, -53306, -77437, -142542, -237414, -302235, -284857, -248866, -211746, -232350, -243312, -231168, -228643, -145339, -193116, -222415, -148251, -72665, -46816, -17471, 22648, -22442, -91206, -176697, -166120, -118169, -14398, 50238, 91340, 11319, -61527, -130416, -103034, -186922, -256404, -145230, 3093, 6079, 4282, -15357, 64294, 169251, 119791, 6448, -86937, -84008, -147050, -80963, -64799, -44492, -2903, 152913, 186913]
25273A86913M6778L426o3327j28261o1890j0119r0131l6514j6709Q8115Q8647
25262F928j0602p8927o68N4976o1652n2166p8889L3269N2466N6016J0679p5840
25250a44410j2840N7930M5642o2614L5202O5539o5044O6437K9790q7834R8713
25239B6511O0493P9189l0849l2418q0698p9409M0858P7260P7750m8030o117o6278
25227A8262P2652L8270M7251n7j07807k6216Q3528O9394p0647n2357K5881j17186
25215a9032l5989Q6664l9502N298P2458L0576Q288p072n4244q0812j63572k7372
25203b24311J06106O3642M9498j40672r9131j0706J29194J57080N233L9148K2936
25192I8017p4274j41219P8958J7912N0078M7465j0569j8792p5688K6486l9217
$$ y = [186913, 233691, 237117, 173790, 45529, -16361, -26480, -116611, -153125, -169834, -81719, 6928, -3674, -82601, -83269, -28293, -89945, -142111, -221000, -187731, -135265, -79249, -68570, -144410, -157250, -99320, -53678, -116292, -81090, -15551, -80595, -14158, 15632, -72202, 26511, 87004, 166193, 135344, 102926, 22228, -57181, -16323, 60937, 138687, 90657, 84540, 18262, 90914, 129184, 176435, 176378, 68571, 42355, 125883, 195277, 124630, 72273, 98154, -19032, -55021, 31643, -7859, -2561, 69897, 100473, 108761, 101689, 47445, -33367, -196939, -224311, -118205, -54563, -5065, -145737, -244868, -255574, -126380, 30700, 35933, 75081, 98017, 23743, -117476, -38518, -20606, 29472, 76937, 66368, 47576, -28112, -1626, -40843]
25181d0843p4323P1957L9467Q211j00400n8273M4933Q8152J15011q5009j63086
25170a54203r7952j9787J3821J06726j3605N9413L1230L7952m5040q931j22775
25159b13151q4716O9539J34096J9953j42601M7174K52798J21879r9576p9140r1109
25148f4854K1318j38317m9860l8314R59P7794N0012O1415L6552K8163J8725J6215
25136A9808J08728j01211j53008r6723Q4538J65602m9336p1912P8433J0287r4860
25125i9654k1927m980M5793J7108N1251O4537K1538k5938L614M4581o4140N7713
25113H9496K7183j75566o2658n0651K1552J7954q0523K5396J79232Q0029m1717
25102B9727J1144Q37k2485J66557l201j09976p7882n867k9427N4283q5823m9619
$$ y = [-40843, -115166, -43209, -3742, 4469, -95931, -154204, -109271, -21119, 93892, 8883, -154203, -252155, -271942, -258121, -151395, -165000, -105587, -74357, -36405, -81445, -90376, -213151, -297867, -228328, -94232, -74279, -216880, -169706, 83092, 204971, 105395, 26255, -64854, -43536, -181853, -231713, -270027, -269068, -191274, -141262, -79847, -43295, -15132, 3593, 19808, 128536, 27325, -125683, -222406, -137868, 27734, -21602, -93514, -15081, -4794, -99654, -121581, -126561, -80768, -63660, -12409, 52128, 73666, 47728, 51342, 95923, 31783, 89496, 116679, -58887, -121545, -172196, -150644, -132690, -213213, -187817, -8585, 71444, 29727, 40871, 41708, 19223, 185780, 182579, 72603, -5279, -11146, -40573, 13710, -72113, -121732]
25090a21732M3640l8355n3243J7103J65274j5161q4353j26049n6764P3873N9494
25079a36273Q4487Q3723m3356L5506Q571r6410q7351L1285L4057l6308q790K8887
25067a01972L4118j2001K7534J2644J3646j67257m1789J10601N6174j8952p954
25056i5208J40289N8800p3084k8063J32090p5489n5266P7971J2140j18262p0405
25045i4487j0677n468o958J04182J51255r453p3619j92845J7477N0728J6430k2439
25033g5874O8360p0515J4962K6384J20593J05447o3j10163p7934O4208J69777
25022B35182j0795j07576r3550j44876J932J89167J06613j6375j13819k11267
25012a65364k0255O6049M2717m033M0741p5435l9084L5812j3958J04648J58164
$$ y = [-121732, -78092, -116447, -169690, -152587, 12687, -2474, -86827, -212876, -269640, -195767, -136273, -51786, 31937, -11419, 24087, 32658, -63752, -151103, -119818, -85761, -122069, -130859, -101972, -67854, -79855, -52321, -39677, -26031, -193288, -235077, -124476, -68302, -87254, -95208, 45081, 103881, 30797, 2734, 134824, 59335, 4069, 82040, 94180, -24082, -94487, -105164, -110632, -117590, -13408, 137847, 128394, 54775, -138070, -120593, -69865, -53435, -75874, -7514, -78029, -63067, -36683, 83910, 189357, 189294, 79131, 1197, 65405, 235182, 224387, 116811, 23261, -121615, -119683, 69484, 176097, 159722, 45903, -165364, -185619, -119570, -76853, -80886, -40145, -115580, -154664, -118852, -132810, -28162, 130002]
25001A30002J09090j20284q5944k4237k4456p720k3156M1347m3557K9787P3441
24990E4313q9571p1078p1862K0726L9731J12704L5541J1016O2110P885n316k6562
24978G9637p7265R7280M7104K2560j5989p7110K066n2103j44715l4439J0422O5811
24966g6741j964R3934P6905q1258l6396K0199n3113q4003m4545M2825J7750P6550
24954d9857R045n6570M9449O1423q798k4186L435j47991O4254J06955O0401j01474
24942c3914q8769q9827L0596m3610L8930O2968J82751k5640l9748m7214J8859
24931c4618N6276J29044o064l3991K8104p7639n7653K4259L7702l3447N95J6507
24919D9075J8149L633j41842P9452l3141j4062J10109l7916j20964o9307j7561
$$ y = [130002, 239092, 118808, 32864, 8627, -15829, -23549, -46705, -5358, -48915, -19128, 54313, -35258, -106336, -178198, -157472, -117741, -5037, 30504, 41520, 103630, 111515, 106199, 79637, 2372, 99652, 146756, 169316, 153327, 76217, 78283, 26180, -118535, -152974, -142552, -76741, -78705, 15229, 92134, 10876, -25520, -5321, -58434, -142437, -186982, -144157, -126407, -49857, -40812, -97382, -47933, 13490, 4692, -19494, -16059, -164050, -99796, 7159, 67560, -33914, -122683, -212510, -181914, -225524, -186594, -123626, 59125, 33485, -6263, -53477, -34618, 21658, 150702, 144638, 110647, 138751, 61112, 3459, 27718, 65420, 31973, 32568, 49075, 67224, 70857, -70985, 8467, -24674, -38736, 71373, 33457, -87507, -156814, -174375]
24908a74375R6636L3523n9396m4003J03647n9226o4106J44794k620n4241N5233
24897b4134N9201q5686j3707P0949J11718j7743p3180l9438K4229o0226p7406
24886a25423o4046Q1401P4916L504j13564M5890J9337q778m1128o1867P4078p6127
24874a91807M434N0421Q2821L2641o7848J2085J9347q3831K6218Q9697L9210N7868
24862G1256J7473K0274j01302J23554O0336j01922j70481p6540Q2789j0663l8418
24851a23644M1522K8181n8265M2612L9575K4740m6614r9746k9837l6302O1761
24840a56017O8296Q1702m845j38615L5436J27530l6511o8511K3127J00696n3709
24829b1421k3205j17781l2202R8048J17431p9216j59015j14406L3804K03082J09347
$$ y = [-174375, -77739, -44216, -103612, -147615, -43968, -103194, -167300, -22506, -25126, -79367, -24134, 35067, -50619, -64326, 6623, 118341, 100598, 27418, -12020, 12209, -48017, -125423, -189469, -108068, -33152, -29648, -143212, -97322, -77985, -86763, -127891, -189758, -115680, -191807, -187373, -136952, -54131, -21490, -89338, -77253, -57906, -141737, -115519, -25822, 13388, 71256, 88729, 109003, 7701, 131255, 191591, 89669, -80812, -157352, -74563, -85226, -123644, -82122, -53941, -112206, -69594, -30019, -5279, -51893, -151639, -181476, -217778, -156017, -87721, -6019, -10864, -149479, -114043, 13487, -23024, -91535, -68408, 32288, -21421, -44626, -162407, -194609, -96561, 20870, -58346, -217361, -331767, -297963, -94881, 14466]
24818A4466j8339n4956m761J56j7056k8042N2918J24480n3165p4124K319l2441
24806h8545J03717P5801m8395j29461Q8399Q9055l5031l3023J24749O1540j15611
24795I3195j58625n5845O083m5765J51472O3238L257M5357k2128q5007m553P8850
24783F9529L7244r3223m5312l6661O4817M6594m9715m405K5216p7797r5424R6559
24771f2578K34846l2646J9570J9653k7814q2980m2441K0503n0734k6248P8083
24760D7214k220o1343r2097J20024Q4600O4733m3450k1675j38840k0501o0737
24749a24292n6514L900J53845Q1190K9288J000j32002o1218m4696l9948j16358
24738c05805J50445J78145p260j2182l0005Q6604J51721J07131o7982j04276m4730
$$ y = [14466, -3873, -58829, -63590, -63434, -80490, -108532, -55614, 68866, 15701, -58423, -56104, -88545, 15172, 90973, 42578, -86883, 1516, 90571, 55540, 22517, 147266, 208806, 93195, -65430, -121275, -115192, -160957, -9485, 53753, 57010, 102367, 80239, -4768, -9321, 69529, 106773, 13550, -31762, -68423, -3606, 42988, -6727, -11132, 14084, -63713, -159137, -62578, 172268, 139622, 159192, 178845, 151031, 68051, 25610, 46113, -4621, -30869, 47214, 44994, -16349, -108446, 11578, 96178, 160911, 117461, 95786, -43054, -63555, -124292, -180806, -176906, -23061, 58129, 87417, 88417, -43585, -104803, -149499, -189447, -305805, -155360, 22785, 15525, 3343, -26662, 59942, 211663, 318794, 250812, 146536, 101806]
24727A01806o0595k1785Q1909R6407j19643l7598p7151k4711Q4597l9271Q399
24716g636o251Q2335K0235n6643j53181M8927K8295P4650Q9226j04150j26647
24705a10840k6975M3084n7482J36251K8702k8466j04461L9987R7270M033n6295
24694c5192n1724r8729k6640Q4107P8774l0302P1024K7691J7462K7667R6679p6414
24682H4403k4180m4650j9239K6471j30605k6469P3097m1611l8222N1928Q556j595
24670h2116P3129O0962Q1596m4839j61880L2996N3454l8470n1029O3865m7785
24659f0117k9722j35L980K8652L1806o832J6304m8536m8835j48119o6624J49120
24647a79058J53435N0333k8680K4792k2759p8147M8530O3491P5176N6254n5381
$$ y = [101806, 41211, 19426, 101335, 197742, 78099, 40501, -36650, -61361, 23236, -16035, -7636, -13887, 68448, 88683, 32040, -121141, -72214, -43919, 30731, 119957, 15807, -110840, -137815, -94731, -152213, -15962, 12740, -15726, -120187, -80200, 17070, 21103, -35192, -86916, -185645, -212285, -128178, -49404, -79706, -8682, 19009, 36471, 64138, 160817, 84403, 60223, 15573, -3666, 22805, -107800, -134269, -61172, -102783, -141005, -89077, -80521, -82116, -8987, 51975, 133571, 88732, -73148, -40152, 13302, -25168, -76197, -12332, -60117, -89839, -89974, -85994, -57342, -25536, -32368, -16064, -64600, -113435, -261554, -328178, -179058, -25623, 24710, -3970, 20822, -1937, -80084, -31554, 31937, 107113, 163367, 107986]
24636A07986j25289j42066J1828l4796j3150J26308p1931q069O5915J21361N9605
24625I7702j2305J9334p5485p2247j1023R7932L2998k1597n3750o1644J61283
24614A01198P2232j53826k0118M0257M1064P1335L9460j66231n2618R11Q0170
24603E3834j03341q4406r3703M8483L7756P0098J78179N7578p3849m9923j7368
24592B3338M4433l1198R90l9067o1664M68o707J6083o5434P2363m6614N3776L408
24579c5825Q2473o4808O9565M3864n4344o0813r0713N6844J07343R7149L7370
24568A88105l9581j83767k2112L1531K2479N0967M6922J8763q1894Q2880m0670
24557G3623N703l0443J26860o7568j97095o3282P8253J00086J1108j2159r0237
$$ y = [107986, -17303, -159369, -147541, -182337, -195487, -69179, -141110, -149179, -83264, 38097, 97702, 85397, 104731, 29246, -43001, -54024, 43908, 76906, 55309, 1559, -60085, 101198, 173430, 19604, -514, 39743, 80807, 152142, 191602, 25371, -27247, -26336, 53834, -49507, -133913, -227616, -179133, -141377, -71279, 106900, 164478, 90629, 40706, 23338, 67771, 36573, 37563, -1504, -63168, -62700, -69407, -53324, -118758, -46395, -93009, -39233, -35825, 46648, -18160, 51405, 95269, 40925, -19888, -110601, -53757, 53586, 150735, 188105, 148524, -35243, -57355, -25824, -3345, 47622, 94544, 113307, 31413, 114293, 73623, 79326, 48883, 175743, 108175, -88920, -152202, -73949, 26137, 37245, 25086, -65151]
24546f5151j96719R3555K48909P0349M4212k2088k7902o7336L5464L1201q0799
24535F3695p9245l0425K0573j45847L1248K9669N3123J8848l7316L6681M5666
24524F670L1996L194j2002p0066K2652J00449K6694j58046r4226m0264J10435
24513g2514K4621n9868O6548M1353j32480Q468P4123m3579k1825K663J19026N1618
24501E8154m407K0262K2523o0659p4693K8330L5380J6889N5208L0096j2919Q894
24489A23058j06971o3680m5852L7870J0331J291n275j9549P005P3637P3785P0185
24477A55835L1144j30520n8276Q816n6347p5611J4349K1746l885L727O5923J8100
24465d999j19555k1073M3340k1332j4120J5026K5852o1270N8075J66577J16529
$$ y = [-65151, -261870, -168315, 80594, 150943, 195155, 173067, 145165, 77829, 113293, 144494, 63695, -15550, -45975, -25402, -171249, -140001, -110332, -57209, -38361, -75677, -38996, 6670, 38666, 41860, 29858, -40208, -17556, 82893, 109587, -48459, -142685, -182949, -72514, -47893, -107761, -41213, 140, -132340, -123872, -49749, -93328, -115153, -112490, 6536, 58154, 53747, 74009, 96532, 35873, -38820, -10490, 24890, 41779, 96987, 127083, 114164, 123058, 16087, -47593, -93445, -55575, -45244, -43953, -49228, -68777, -61772, 11865, 85650, 155835, 186979, 56459, -1817, 6999, -49348, -124959, -110610, -88864, -92749, -89022, -23099, -4999, -124554, -145627, -102287, -123619, -137739, -122713, -96861, -158131, -100056, 66521, 183050]
24454A83050j19707n474p4989l7972j5798P7628P2575J2903j2247j4286r0615
24443b4932k5389J2124l5793K2105J4425K5659J17993N770K9952J161j05644j01937
24431f4506K7918J51646k9079l5350J8446J7823n3691m2130p0707J7290o3720
24420a26060J00979j196k32696m0020J64807j9977q6002N3327J0036L7829J06607
24409c2366M7510o8137n8289m6618p9623J47203j02948K8414O3424P7439M9692
24398B5701N620n5030o6727J52799K5188k7679L2952K10185O6313q3000r1848
24387A94474K2000K4588k48428j75195J086R1032Q6325O5488o0648j30240q8476
24376b17994Q2415P0664j2538m6537P2990J66652k0995l2931q2766q5141r5214
$$ y = [183050, 63343, 57869, -17120, -55092, -70890, 6738, 79313, 92216, 79969, 65683, -24932, -50321, -38197, -73990, -51885, -37460, -11801, 106192, 111962, 141914, 143075, 37431, -64506, -36588, 115058, 85979, 50629, 69075, 86898, 33207, -8923, -79630, -62340, -126060, -25081, -26277, -258973, -298993, -134186, -154163, -240165, -186838, -176802, -138973, -32366, 15144, -52993, -111282, -157900, -237523, -90320, -193268, -164854, -101430, -23991, 25701, 31321, -23709, -90436, 62363, 87551, 59872, 92824, 303009, 369322, 286322, 194474, 216474, 241062, -7366, -182561, -181475, -90443, -4118, 61370, 722, -129518, -217994, -135579, -64915, -77453, -123990, -51000, 115652, 94657, 61726, -21040, -106181, -201395]
24365b01395J22507O4721J17188J23932m9856n6470r6880j05094J49659J2130
24355H0442K4084q532j37314J05202N4685N8588l8967j00242K3145o8809j35709
24344a43427M6269J27186J90684l9631j20032m1114L1342L9912n0677J9997N5744
24333A16253P3544n9156o8369J5468n8841q0880n1007N0334M3554r669L6049R199
24321A6479o6674k3619L8938P6887j8584j39900q0422L3177M2964K0426L7965
24310f2363P5666l8370L8172L0434p4558K8178j954N465L8460K7719p4294j89611
24298a97056m9210Q9803R4887R35N4521j6723m4414j8570O2716P2292Q8150K3662
24286A60993j01188j36608L0714J9257k1383O3877j6599m5605Q0369o8834j37799
$$ y = [-201395, -78888, -14167, 103021, 226953, 177097, 120627, 23747, -81347, 68312, 80442, 104526, 95994, -41320, 63882, 118567, 177155, 138188, 37946, 61091, -7718, -143427, -97158, 30028, 220712, 181081, 61049, 19935, 51277, 91189, 40512, 60509, 116253, 189797, 130641, 62272, 77740, 18899, -61981, -112988, -62654, -19100, -28769, 7280, 16479, -50195, -73814, -34876, 42011, 23427, -116473, -196895, -163718, -120754, -100328, -62363, 13303, -25067, 13105, 43539, -31019, -2841, -4795, 670, 39130, 66849, -7445, -197056, -246266, -156463, -61576, -60641, -6120, -22843, -67257, -85827, -23111, 49181, 137331, 160993, 59805, -76803, -46089, -26832, -48215, 15662, -937, -46542, 33827, -35007, -172806]
24275a72806l1768K7165M6786O3705K5399r6963n7J8843P8445N596n5123K4224
24263f6554Q1052o5251l6797R6420m7672j33P4166L9041m5999K4988k7193q6566
24251f0498K891J51567L5397m6037o1937j30276M6785J20760Q9833o7739k8733
24240E2013Q1048L6918n7786j10222m308L4645Q0169n0853o0604j03725J13627
24229A0922O2986N2705L8522l2826j52009o4457k8782r893N6771n2996p6616N681
24217a89992J6731J25701R5214j10603j07071L5769R6427N136l6948M7607l5395
24206e7424j183J34786L5098K7608k27258P164K52000J91081J7987q0356k33918
24195F5585p7995M5612m2109j05094Q0002M2282l7318L0539L0434n9120j2995
$$ y = [-172806, -204574, -177409, -130623, -66918, -41519, -138482, -138539, -119696, -41251, -35655, -90778, -66554, 14498, -50753, -87550, 8870, -38802, -38935, 35231, 74272, 28273, 53261, 26068, -60498, -57607, 93960, 129357, 83320, 21383, -108893, -62108, 58652, 148485, 80746, 52013, 133061, 169979, 112193, 1971, -2337, 32308, 112477, 61624, 1020, -102705, 10922, 73908, 126613, 165135, 132309, -19700, -84157, -112939, -122832, -66061, -119057, -195673, -189992, -173261, -47560, 47654, -62949, -170020, -134251, -37824, -32688, -69636, -22029, -57424, -58607, 76179, 111277, 138885, -88373, -81209, 170791, 361872, 379859, 299503, 65585, -12410, 33202, -8907, -114001, -33999, 8283, -29035, 1504, 31938, -27182, -40177]
24184d0177M4274N9452o7660j29027k2334Q7382M4709P059P2783N6868Q435o8162
24172E3602J02662l4165o4430J05937N9297j30984j13196J3466K9042p0138j17883
24161a66790Q081J04565R0161k7125L596K2930r7491j08486O8715J10668m7305
24150c8481n4747Q8018O6449m2666m1036R0058O4615r0237j63919j7559O0008
24139g9497O3013O157n4964J0187J04507M9450p8725L2846l3962j34379L9170
24128g6197Q8911j0585o0072q1603J4821Q2552J28116L6423M981l642j24298O5463
24116F4870Q9210j3185j5613R6847N4817j41338k839J729n2091l226O9876J4593
24104A63650k5949j19774m5893K567M3175j16618K748P7436N1337r8333O299J71627
$$ y = [-40177, 4097, 63549, -4111, -133138, -155472, -68090, -23381, -16322, 56461, 113329, 121764, 53602, 156264, 122099, 57669, 163606, 222903, 91919, -21277, -7811, 21231, -48907, -166790, -158709, -54144, 36017, 8892, 12488, 35418, -62073, -170559, -101844, 8824, -38481, -93228, -5210, 61239, 18573, -22463, 67595, 132210, 41973, -121946, -139505, -79497, -16484, -10327, -65291, -55104, 49403, 98853, 20128, 52974, 19012, -115367, -76197, 12714, 2129, -57943, -139546, -124725, -42173, 85943, 122366, 127347, 123705, -593, 64870, 154080, 140895, 125282, 222129, 276946, 135608, 132769, 134498, 82407, 79181, 149057, 163650, 137701, 17927, -27966, -25399, 17776, -98842, -96094, -18658, 32679, -65654, -59355, 112272]
24092A12272n1275o8945P7505o9111j01913k7312O5721j43p3891L4099M5308L8631
24080a9054k9948R5836J77064q2634j33482O74l9105N4011k9862j33019P4658
24069f4861l2046o2395J6554M8897K11879N0179r2157l9763p4199K0706J16108
24058I8902K0674o3506m0479j2314p8796l4115J3425N7674J25621k4832R3603
24047A55857R364j54757l7315Q257M718L0248L2670K5488n6857o2057m7320Q0019
24035a1685K7236j1055k2954p5580q7132L4318O2639P5909J21613k4446j14433
24024b5570J0506m183P0001K3302M548J20944q6247k8307P8481J3951j3465r5032
24012F8929m6148P3887J24219l3200p4050r9096q5794n031J7214m8681J08122
$$ y = [112272, 60997, -7948, 69557, 446, -101467, -128779, -63058, -63201, -137092, -102993, -57685, -19054, -49002, 46834, 223898, 141264, 7782, 8456, -30649, 23362, -6500, -139519, -64861, -96907, -159302, -142748, -93851, 118028, 168207, 76050, 36287, -37912, -17206, 98902, 119576, 56070, 15591, 3277, -75519, -109634, -96209, -38535, 87086, 62254, 155857, 165221, 10464, -26851, -18594, -13876, 16372, 49042, 74530, 17673, -44384, -91704, -11685, 15551, 4496, -18458, -94038, -181170, -146852, -84213, -8304, 113309, 88863, -25570, -15064, -19247, 50754, 74056, 78604, 199548, 113301, 84994, 163475, 177426, 163961, 68929, 22781, 96668, 220887, 187687, 113637, 14541, -71253, -76284, -59070, -107751, 371]
24001C71M9939N0861N7015j6896j32868n3630J21338k1721m764K15715K6264n8073
23989B33551l2109j39130N08r9856N2589R3345L5644R686o7193j6256P0309N811
23977A46899K5545J0952L1860k65o2834j84574K5002R5019r5643N3277J6029K9274
23965I0541R8701K8186j09027p3423l6510l4112P210n269N1240M1073q1172j12118
23953a34680J01606J9136K8552K7793K8384n9643m6062O1873J0022Q0181j2415
23942A04747M6762p0439m8161o1081l641L1401j6547m5402J1315j4793M226R6630
23930C5017L847k5463K7341P5248k2722o497L5671n8326j8616J6403M568N7396
23918A23867J0158r7948M1151r5949k3836N3528N1080j16414O672N7633m4462
$$ y = [371, 50310, 101171, 158186, 141290, 8422, -45208, 76130, 54409, 49645, 265360, 291624, 233551, 201442, 62312, 62820, -37036, 15553, 108898, 144542, 154228, 87035, 70779, 141088, 146899, 172444, 183396, 215256, 214991, 152157, -32417, -7415, 87604, -8039, 45238, 61267, 90541, 189242, 217428, 108401, 34978, -1532, -35644, -28434, -33703, 17537, 58610, -22562, -134680, -33074, -13938, 14614, 42407, 70791, 11148, -34914, 26959, 36981, 117162, 104747, 151509, 81070, 32909, -28172, -31813, -412, -16959, -62361, -51046, -65839, -61613, 35017, 38864, 13401, 40742, 115990, 93268, 86771, 122442, 64116, 45500, 61903, 66471, 123867, 134025, 36077, 77228, -18721, -42557, 10971, 62051, -54363, -47691, 9942, -34520]
23907c4520k5518O8651J85935p2700n3377j4659j01617j9577L3297Q9702O7673
23896A23290Q8880O5763j11728l7051J6848j01945O1990k5128j11132O6531K5347
23885F1665K0341M9637J7411K0641q5620L0054o0960q2860j1911M2238O1656n6747
23873E545M5494q9063J5800R1910J2215J5621J6293o571o7358k9563O4332q7129
23861a2474J4969M0807p3403n7198n1616N371m488J21914N6974Q9958L6064o5619
23849A01259q6960P5460J15544r7703r1364P7375m3406j17923Q001M8859Q4639
23838G3781J4592m962K0539J981p4923M6897R4477O0829M0083p4238l6955r2047
23826G0054n5620O5855j8415J18586J07397N5868n6484j98799j10404J08880M367
$$ y = [-34520, -60038, 8613, 194548, 121848, 68471, 53812, -47805, -67382, -34085, 55617, 123290, 212170, 277933, 166205, 129154, 146002, 44057, 106047, 80919, -30213, 36318, 61665, 82006, 131643, 149054, 169695, 84075, 114129, 53169, -29691, -41602, 636, 62292, 5545, 51039, -38024, -22224, 69686, 81901, 97522, 113815, 107244, 39886, 10323, 74655, -12474, 2495, 43302, -30101, -87299, -138915, -133544, -138032, -16118, 40856, 130814, 166878, 101259, 14299, 89759, 205303, 107600, 16236, 93611, 50205, -67718, -59717, -10858, 73781, 88373, 83411, 103950, 105931, 31008, 77905, 172382, 233211, 273294, 199056, 162101, 70054, 14434, 80289, 61874, 180460, 287857, 343725, 287241, 88442, -21962, 86918, 91285]
23815I1285k6715l761N5593J9408j11032m2144R0333m8263K6525j8697l2948j17981
23803a18397n7104J34443J58239J6457m1411n9151r7998J0791K7640l418O8834
23792C8925J33521l4471l0400J0109p387q7708J0179P8498P9624K6352j5955l3831
23780A67456n1617K2206Q0763L673p7683l6590q8092j49563n5187M6749J37520
23769c65J05420p0566m4355M2053J6736j13998k2234o514p3135J12366M7495k2206
23757b9303k6162O3231J19752M2914O994l6j06657L676p960m7442p1507o5194
23745a17694m8150J28684k2974p3023O513K44378K888q1618M0513P682M6455j0737
23733A22917j71453n2808L397K685K9774l9668M819q1629q8855J7910L0096L1186
$$ y = [91285, 64570, 60809, 116402, 135810, 24778, -17366, 72967, 24704, 51229, 32532, -416, -118397, -175501, -41058, 117181, 133638, 92227, 33076, -64922, -54131, -26491, -29909, 38925, 172446, 137975, 107575, 117684, 110297, 22589, 32768, 111266, 190890, 217242, 201287, 167456, 115839, 138045, 218808, 222481, 144798, 108208, 20116, -129447, -184634, -137885, -365, 105055, 34489, -9866, 32187, 48923, -65075, -87309, -93823, -166958, -54592, -7097, -29303, -55465, 7766, 127518, 170432, 177426, 177390, 70733, 74409, 66449, 19007, -52500, -117694, -165844, -37160, -60134, -133157, -126644, 117734, 120622, 39004, 79517, 87199, 133654, 122917, -48536, -101344, -97947, -95262, -65488, -105156, -100337, -181966, -270821, -252911, -222815, -191629]
23721a91629O8008J10297O3110R349p1556J10519M6024q4157j8881L1864j59602
23710h6654p4157m8823K6503Q3369O7284n4282m4673l1557R392R4231M8625r857
23698b0599m7745k7759k2054M2563K3414l1953l5752l2888J14002O8335K0739
23687E0303K5729n168k3725q748j72592N0033R1169p249o9584M1416K0031K0921
23675A2536l0076M848n0008k1472J21129O7982M4877R4024j00492j62232p5171
23664i4055p9545k2698J17160J4863N8176K5806M460l3117M2233k3524r1452o8604
23652a50297J49521N5923n5023O2649k8219l9398k5472M1746Q9739J4003k9649
23641H5523p0332m6270P223K509j8685P1835P9845p3621k5272o9211J4317M7785
$$ y = [-191629, -123621, -13324, 49786, 59135, -12421, 98098, 144122, 59965, 41084, 72948, -86654, -160811, -209634, -183131, -99762, -32478, -86760, -131433, -162990, -153598, -59367, -10742, -20599, -68344, -96103, -118157, -75594, -52180, -84133, -119885, -152773, -38771, 29564, 50303, 76032, 70864, 47139, 38391, -134201, -84168, 7001, -248, -69832, -28416, -8385, 12536, -17540, -12692, -62700, -84172, 36957, 104939, 149816, 243840, 143348, -18884, -94055, -173600, -196298, -79138, -64275, -6099, 19707, 24167, -8950, 33283, 9759, -81693, -150297, -776, 55147, 124, 62773, 34554, -4844, -30316, 11430, 101169, 115172, 85523, 15191, -31079, -23856, -21347, -40032, 31803, 111648, 38027, 12755, -56456, -42139, 5646]
23629E646R5076j20793l7680J02627k395r8272J637j04268l8145N7738J06658
23618c2171q06m78k8499K4232L4960M996L0747J33727l5636r5107R2425p6030
23606E2360k5448R2914L8494j15252j00554O8218l0617j66503m2819J05006J41948
23595A7747M5589p4009l8291J18804J5296p3128J7280n6859k3038O7742m5184
23584b8051K8134Q0915M4387o0975R132k450l1198l0032k4027N0236J18244M3415
23572A97730m831k4644k0230K0459m5982k82R396j37451k4904p2131J09416N4183
23560F0729k904j2883j22540k2848K5916N171M1971L918k03J51156Q5082P8173
23548B90738o9375r7655L3256k404j23984M8225n9498j29818P0734R7920j1960
$$ y = [5646, 100722, -20071, -57751, 44876, 42481, -55791, -54154, -158422, -196567, -138829, -32171, -32977, -33455, -61954, -37722, -2762, 2234, 32981, 166708, 131072, 35965, 128390, 52360, 26912, 119826, 158320, 43068, -57486, 10732, -19885, -186388, -229207, -124201, 17747, 63336, -10673, -48964, 69840, 85136, 12008, 29288, -27571, -50609, 17133, -28051, 83, 80998, 125385, 64410, 73542, 71092, 39894, 9862, -14165, 36071, 154315, 197730, 192899, 168255, 148025, 168484, 122502, 122220, 131616, -5835, -30739, -102870, 6546, 60729, 57825, 44942, -77598, -100446, -74530, -69359, -27388, -23470, -23673, 127483, 212565, 290738, 221363, 123708, 156964, 154560, 30576, 78801, 19303, -110515, -39781, 58139, 46179]
23537D6179L7496J1039N0410O7457o5165l5131K4499n2329j34523m9185J26409
23526B7156L5688l6089N849j025R8598q780j31558P4930Q3312j8629L5751K3557
23514A88760l0768O6487K5728p2341O3160k6433r6254p4805j2566P9462J8097
23503A28527j27478n1664m830l0033N2269J05013k0263m4654k6980n2404M1440
23492c1057J69299M4498o3450L9531o1247j90187j06558N8532R0607P4154j9227
23481D895Q1277J2319o3071q8644j8258J29792l1587o3257l8429K5745R7580L8272
23469H6634o5508q3025k24j015k9304N8603Q8132J9689l394q5540p2871p2903
23457a60726P4953J89767M2367j65j07173k3104P8299j489m9375M3120L8395j30574
$$ y = [46179, 83675, 94714, 145124, 212581, 147416, 112285, 136784, 84455, -50068, -99253, 27156, 62844, 26755, 32604, 31579, 130177, 121397, -10161, 64769, 148081, 129452, 165203, 188760, 157992, 224479, 250207, 177866, 241026, 214593, 118339, 43534, 30968, 110430, 128527, 1049, -50615, -55445, -85478, -33209, 71804, 51541, 6887, -20093, -72497, -31057, 138242, 182740, 119290, 158821, 97574, -92613, -199171, -140639, -50032, 24122, 4895, 86172, 98491, 35420, -53224, -71482, 58310, 26723, -36534, -74963, -49218, 48362, 86634, 21126, -61899, -62123, -63138, -92442, -33839, 54293, 73982, 70588, -14952, -87823, -160726, -85773, 103994, 146361, 146196, 39023, 15919, 94218, 92729, 43354, 86474, 124869, -5705]
23445e705p3479m3818M3293J29149k1940r1690k7847J2996N5623R0949J15144
23434A82675m0819K0363k9459j33239o7396M2243M4592L8987j3205R043j1063
23423D2722j3036N0014L2899K2364K2291Q0145k609m9808J06440m0887o6501l1378
23411A52656K1232l372j60998P1746N634l9630L5980k4111j45946o9351R9151
23400e7009Q5788J30200q2228j66456p4467J61665K09419j09056j42296J16630
23390G2190Q9686l4569j1364j4813q5025K8491n5919j31315N2822P4929P7393
23379F2506j06349m3079J68198P7314K9105p3015p0799o964J29252R649j29840
23368D5978p7044o1151O4040J09589N5213J3002m2422m2735j03396j03382O086
$$ y = [-5705, -79184, -123002, -79709, 49440, 27500, -64190, -92037, -79041, -23418, 67531, 182675, 141856, 162219, 132760, -479, -67875, -25632, 18960, 57947, 44742, 53785, 42722, 29686, 79700, 112599, 134963, 157254, 237399, 234790, 184982, 291422, 250535, 184034, 152656, 173888, 170516, 9518, 81264, 86898, 47268, 83248, 59137, -86809, -156160, -57009, 28779, 158979, 76751, -89705, -164172, -2507, 206912, 97856, -44440, 72190, 161876, 127307, 115943, 101130, 16105, 44596, -11323, -142638, -89816, -14887, 62506, -43843, -86922, 81276, 158590, 187695, 114680, 43881, 36917, 166169, 175818, 45978, -31066, -92217, -28177, 81412, 136625, 149627, 107205, 64470, -38926, -142308, -136222]
23357a36222P2271J62860L5476m6479r9948J1152J08669Q5851m3498k724p8915
23346F8493j15351k6865O2709P5229j12315j6438J23574J75092l965j35638j60913
23335f6388J42073J1007J7007J5016n9789j5927L2997L153q014Q163k0942p537
23323E0819n309j1944Q6497J07773m1526r7866J01737M713p505O0573o818j03138
23311A38006k2289k6612P2687J23284l1480j08001j34720K5196M8492N5713p4730
23300F5546N7395P7863j45331q6403r960K9701L9085m7168J20877L797m2851K9975
23288I2526Q9674l2127M6857K8706J1294j7273n3194r0671J795L2835J11165k3462
23276A98125r7263M8970q0112K1759K6213N2966Q6345j12654q7539j0000N6118
$$ y = [-136222, -63951, 98909, 134385, 87906, -12042, -890, 107779, 193630, 150132, 147408, 68493, -46858, -73723, -11014, 64215, -48100, -64538, 59036, 234128, 230163, 94525, -66388, 75685, 86692, 103699, 118715, 58926, 42999, 75996, 79149, 71135, 79298, 58356, 50819, 45510, 33566, 120063, 227836, 186310, 88444, 190181, 194894, 187389, 247962, 241144, 138006, 115717, 89105, 161792, 285076, 253596, 145595, 10875, 36071, 84563, 140276, 65546, 122941, 200804, 55473, -30930, -40890, -11189, 27896, -19272, 101605, 105402, 62551, 92526, 182200, 150073, 196930, 225636, 236930, 219657, 166463, 75792, 77587, 110422, 221587, 198125, 100862, 149832, 69720, 91479, 117692, 170658, 257003, 144349, 56810, 46810, 102928]
23265A02928J8983J4056j56979L1996J15829m469k6716l601k20869j0953J67415
23254B7620J42195K4337K0961k4532q0132p5844J6735Q4111J14715j22854r4972
23243C2340J46880J39648j6479p8273j37145j00975m6938k0619o399p2254n1717
23232b11931J70175J69257L6956L475O3930l4063j06452j30193R1112l2085Q0127
23221A00308P7064m1755J87L93j31138J2248N6318m6168Q569K9410J5587J42430
23209B23453l3971k3512M3417r2027l1638K0335q7388L098L9021O9218J4996K1651
23197A66653n2160o9417r6477R7555J50828N0248j59599L6826l615j60703M9655
23186I794P4359j594K4499l4955N1388J39511k2017k32433p3430r559J31702M5287
$$ y = [102928, 121911, 135967, -21012, 10984, 126813, 122344, 95628, 92027, -128842, -139795, 27620, 169815, 194152, 215113, 190581, 110449, 34605, 51340, 135451, 250166, 127312, 32340, 179220, 318868, 302389, 224116, 86971, -14004, -60942, -81561, -87960, -160214, -211931, -41756, 127501, 164457, 167932, 231862, 197799, 91347, -38846, 52266, 20181, 100308, 177372, 135617, 135804, 136197, 5059, 17307, 73625, 27457, 36026, 65436, 81023, 223453, 189482, 165970, 209387, 117360, 85722, 106057, 18669, 21767, 60788, 130006, 145002, 166653, 114493, 45076, -51401, 46154, 196982, 247230, 87631, 124457, 120842, -39861, 9794, 84153, 82559, 107058, 72103, 123491, 263002, 240985, 8552, -64878, -74437, 57265, 102552]
23174A02552K3586J48412N9984r9684j23809R531J72947p34J4462J859p3059r0585
23162A45462J2320O3999p4777j09444j19414p3145N2281Q5790M6006k77J15166
23151A43967P1771q0783r5025M4745J1767Q7120K8802p8678q0169J7826r141j2291
23139D9911o0159J6231Q3122M2054q4551Q864J34291n8944o481N953M8723J44125
23127C23139j00242l8423O4446M2842o3045r8471J64P5258j72468M1123P1269
23116A45592L1495q1662O938o5003j19380m7874P6828K6671L6128Q1060J0144
23105A00937M3459j06128j17223J28839N3659k8776j27619j22734O8625N5620
23095e1341J92750M8978j34669l6526L5984J1727l1944m0940Q2568p85o1417R6263
$$ y = [102552, 126138, 274550, 334534, 234850, 111041, 120572, 293519, 292785, 307247, 309106, 236047, 145462, 157782, 221781, 147004, 37560, -81854, -154999, -102718, -16928, 29078, 28801, 143967, 215738, 134955, 39930, 84675, 96442, 183562, 212364, 133686, 53517, 71343, 62202, 49911, -10248, 5983, 89105, 131159, 46608, 55472, 189763, 130819, 124338, 130291, 179014, 323139, 222897, 184474, 248920, 291762, 228717, 130246, 130410, 205668, 33200, 74323, 145592, 177087, 95425, 102363, 37360, -82020, -129894, -53066, -26395, 9733, 90793, 100937, 144396, 38268, -78955, 49884, 103543, 74767, -52852, -175586, -106961, -51341, 141409, 190387, 55718, 19192, 55176, 66903, 34959, -5981, 76587, 75802, 14385, 110648]
23083A10648p4804J05348M6065j9968n4259p001o315O248l015J4613L7945M8540
23071B04045o9378P2078R8223l5556k2616J3970j12338l2151N5731J6983N7088
23060B46079R6092M1789j2668n7047q4782J1726r446j26539o3458J09955P4186
23049B25887R3246o5882o9725q9835j15019K6558N8925N3934N2067l5589R2509
23038B27076q681k5406q6215O3358J56076j1895r242K1595o3923Q036q0981q3842
23026A05956m133m3536L8829J07955J7228N788j07930j08037l9514O0343R4673
23015A27622j9000N9950J63k8357N7979R923m1247L9840n1540L7362j6014M0118
23003B16799k3502l6853P9235j14570Q5574o0140O272n6898P3007L318o303J9350
$$ y = [110648, 35844, 141192, 187257, 167289, 113030, 106029, 99714, 105962, 102947, 117560, 155505, 204045, 134667, 206745, 304968, 269412, 246796, 260766, 148428, 116277, 172008, 188991, 246079, 342171, 383960, 371292, 314245, 229463, 241189, 231743, 105204, 41746, 151701, 225887, 319133, 253251, 183526, 93691, -21328, 5230, 64155, 118089, 170156, 134567, 227076, 218395, 192989, 106774, 170132, 326208, 314313, 305071, 326666, 262743, 270779, 189798, 105956, 101823, 58287, 97116, 205071, 222299, 228087, 120157, 12120, -27394, 32949, 127622, 108622, 168572, 168735, 140378, 198357, 208280, 167033, 206873, 155333, 192695, 176681, 216799, 193297, 156444, 235679, 121109, 206683, 146543, 152815, 95917, 168924, 172242, 165939, 185289]
22991A85289K7895Q2069k9813o5291m2167Q443q7919l8309N1002L6014M0232l0888
22979A36557O5690l1529N5841R9336r5990o6273P873q0986k3444q607m0717J8186
22967C5937J00879J33843O0614j46322l0125o9869j025r696k2879O6588J15540
22956B33485K4504o2811m8311R0765L9138O5744q5901q0254k4339k2816O4328
22945A93532J964k8635L1017L8923j468k39308q0760J18510K662o7604j3525O9314
22933B4622j06999k2540M5957J4754L4853L3870L5130o9159q5615P7172Q6681
22922F8726J19120k0970j12922K6714J5262L8401O2532J13759R0632O4933k07931
22911B58256j19032L7774R1719m2684j46018j10110P0794J19667M7202M7704n6510
$$ y = [185289, 213184, 295253, 265440, 200149, 157982, 166425, 78506, 40197, 91199, 127213, 167445, 136557, 202247, 170718, 226559, 325895, 229905, 163632, 171505, 90519, 67075, 58468, 17751, 35937, 136816, 270659, 331273, 184951, 154826, 84957, 83932, 74236, 51357, 117945, 233485, 257989, 195178, 146867, 237632, 276770, 342514, 256613, 176359, 152020, 129204, 193532, 195496, 166861, 197878, 236801, 235333, -3975, -84735, 33775, 36437, -31167, -44692, 24622, -82377, -104917, -58960, -44206, -9353, 24517, 59647, -9512, -95127, -17955, 68726, 187846, 166876, 53954, 80668, 95930, 134331, 196863, 310622, 401254, 466187, 258256, 139224, 176998, 268717, 226033, 80015, -30095, 40699, 160366, 207568, 255272, 198762]
22900A98762q3740o8426L6198j4812q7553o794k0854o0267M3494J88027J20860
22889B44895J19255j13605j34036k363R839j4926J2354O749N6037K2860K4031
22878B31090j2080q4541j7553O5780N2593k617l4413m8005M908P3615j8579q7535
22866A22663j02543k929Q0764J46750Q8562M9917K0882j33974j14447O5424L535
22855B24604P5710N2589p3973o7915k7366p1699Q3981R1975l4994k5673J221L2170
22843B60630j8326q4795j1851J9790r893R7462O5085q9898J7M0863k0992K7564
22831B75656K1266q0545j36682N6794k7640J25470n565O5165J7523Q1284q1715
22820C11011j54058j59351M4425J22791M1991P4548J2530p6500K3238M7731R726
$$ y = [198762, 115022, 46596, 82794, 67982, -19571, -26365, -47219, -107486, -63992, 124035, 244895, 364150, 250545, 116509, 114146, 123985, 109059, 121413, 128162, 184199, 207059, 231090, 219010, 134469, 116916, 182696, 235289, 232672, 198259, 150254, 155162, 228777, 210198, 122663, 20120, 17191, 97955, 244705, 333267, 383184, 404066, 270092, 155645, 221069, 224604, 300314, 352903, 278930, 211015, 183649, 111950, 195931, 287906, 252912, 227239, 228460, 260630, 242304, 157509, 145658, 165448, 155555, 253017, 318102, 228204, 228221, 269084, 248092, 275656, 296922, 216377, 79695, 136489, 108849, 234319, 228754, 293919, 311442, 392726, 311011, 156953, -2398, 42027, 164818, 206809, 281357, 293887, 217387, 240625, 288356, 298082]
22809B98082L7413M417l8989K9631J3368K2887l8742P156J02093j26783r5456
22798B15077m6593L7874j4294p1564J9288J0302P1303J15462L7218m8605k445
22787C23023j9148j21154m651q781J6560R2027N7644k0679K6825j5304L4838m5809
22775C15391q8387N6373J12566O4593j3530r3505Q3078l1040k1535N0053l9420
22764C94637j43810k413P8730o8088n5077q2605n6197L1181O6036m8427l4290
22753G9677Q227P6724R9150L5277m1277p3004Q7266Q4816k4195r8085J2559j2158
22741B34977n5765j1518Q9191Q1262j5888p0914j23228J11521J18078j15902j8242
22730B23572n0540q3715J3678K3280R0410k0328p9623L3402R2812j056N9034m0878
$$ y = [298082, 335495, 339912, 300923, 330554, 343922, 366809, 328067, 335223, 437316, 310533, 215077, 168484, 206358, 192064, 120500, 139788, 150090, 221393, 336855, 374073, 325468, 323023, 303875, 182721, 178070, 169289, 185849, 277876, 335520, 314841, 341666, 326362, 361200, 315391, 227004, 283377, 395943, 460536, 447006, 353501, 436579, 405539, 384004, 434057, 394637, 250827, 248414, 327144, 259056, 203979, 121374, 65177, 96358, 162394, 113967, 79677, 87904, 164628, 263778, 299055, 257778, 184774, 272040, 356856, 332661, 234576, 247135, 234977, 179212, 167694, 256885, 338147, 322259, 251345, 128117, 239638, 357716, 241814, 223572, 173032, 89317, 102995, 126275, 216685, 196357, 116734, 150136, 242948, 241892, 300926, 260048]
22718B60048j01495j57772P9889J47316K3636k4370n8831j4459q9002k2412M7980
22707I0528n0893M620J83930J23417K2361j1270p4969j8326j8910p2085J18073
22696B96476J62243n8962R673Q2998l5527j49531k1149k531P9242p393j25628
22685B29911k1280J21640M7623m4631j07520L2566J50803j0278o1845o3028m3680
22674B30281l7897k7888j9403q964l0673N324j7204P5385J72589q660O6522J3501
22662D12913j03082k00095m012K9352J68973j03114r4588N0743J1624k8823N7645
22651A97536J51546J3834q1337L117n209N5099o8931j09918p9987K4555J44223
22640B44528R8374k9349j06069j19964R0004J79035P6745J1392n3012o4247k532
$$ y = [260048, 158553, 781, 80670, 227986, 251622, 227252, 168421, 153962, 64960, 42548, 90528, 39635, 44255, 228185, 351602, 373963, 362693, 287724, 269398, 250488, 178403, 296476, 458719, 399757, 409430, 492428, 456901, 307370, 286221, 283690, 362932, 355539, 229911, 208631, 330271, 377894, 333263, 225743, 258309, 409112, 398834, 336989, 273961, 230281, 192384, 164496, 145093, 136129, 105456, 110780, 93576, 168961, 341550, 332890, 399412, 412913, 309831, 109736, 105724, 135076, 304049, 200935, 106347, 157090, 168714, 139891, 197536, 349082, 362916, 281579, 284696, 279487, 334586, 265655, 155737, 75750, 100305, 244528, 342902, 313553, 207484, 87520, 177524, 356559, 433304, 444696, 391684, 327437, 324905]
22629C24905m9933K7326m0728l8580o638N0863J05473j26508j08314q592R4115
22618B23389J48939p1652l1838P7288O0535r7397r3943J2305O6826j9851p9962
22607A94639l8921R0654L7178J5698k5531j02002m0225R7374l3401K1184J06288
22596C22935n4032J0962N068O4711N1941J26130J6012L3372m0036j05426j12372
22585C19265l3055l2212L2652q0184j8332k927J29889J7787j304J17830q2773
22574C66636o7519k4637N6217o4141J6028N6268P0138j6260j05358J0739k1276
22563B76835K7920K9303K4064K0096L7708m3646J6919P6700j48898p0461K3721
22552B70261o7396J14951J00809J4064j0837j07761j58676m1182N1782P2848Q7099
$$ y = [324905, 274972, 302298, 261570, 222990, 216352, 267215, 372688, 246180, 137866, 129274, 223389, 372328, 300676, 268838, 346126, 406661, 309264, 215321, 227626, 294452, 274601, 194639, 155718, 246372, 283550, 299248, 273717, 171715, 131490, 228864, 195463, 216647, 322935, 268903, 279865, 284933, 349644, 401585, 527715, 543727, 577099, 537063, 431637, 319265, 286210, 253998, 286650, 206466, 188134, 185207, 315096, 332883, 331579, 449409, 366636, 299117, 274480, 330697, 266556, 282584, 338852, 408990, 392730, 287372, 298111, 276835, 304755, 334058, 358122, 378218, 415926, 372280, 389199, 465899, 317001, 246540, 270261, 202865, 317816, 418625, 432689, 421852, 314091, 155415, 114233, 166015, 238863, 325962]
22541C25962R3945M5040j49296r0121P612j6019q3852o2499Q54R1280J14854Q9819
22529C67579M6039m2280K9739O8131k8044k3016n876N5277m5668p9704n2684M2471
22517C31964K286L7153J7798m246l7941j17233K8090l6105J50398k8596j6309
22506C27259M918J1546n6515r8305j0748L2928K1862n444O2300P170m6526k801
22494B47644R8005K6738q516Q6905P6308O9659K0275j61703p8368j8275n6687
22483C01985L9485R4697J3552q2810m7400J23814P5838p3182j46851Q1543R7968
22472D78639p421j1656m2298q8173J06877K1105P461n8331l0305N4512M274j0673
22460D24011n3757q8189N8073P4588J15353P34n5564l0690L4847r614j09801j45060
$$ y = [325962, 419907, 464947, 315651, 225530, 233142, 217123, 133271, 70772, 71626, 162906, 277760, 367579, 413618, 371338, 401077, 469208, 441164, 418148, 412272, 467549, 421881, 342177, 289493, 331964, 334250, 371403, 389201, 384955, 347014, 229781, 257871, 221766, 372164, 343568, 327259, 332177, 343723, 287208, 188903, 178155, 211083, 232945, 227501, 289801, 296971, 250445, 247644, 345649, 372387, 363871, 450776, 527084, 596743, 617018, 455315, 376947, 358672, 301985, 341470, 436167, 449719, 366909, 319509, 443323, 519161, 445979, 299128, 380671, 478639, 471218, 459562, 417264, 329091, 435968, 457073, 464534, 406203, 375898, 430410, 434684, 424011, 370254, 282065, 340138, 414726, 530079, 530813, 475249, 444559, 479406, 469792, 359991, 214931]
22448B14931j0160O4467J51586J09479j2736L6995l694k0989L097j52064O5539
22437D46451M3695m8869l1276L9264N5810Q2020M780L39k1461m9468j20995l5325
22425C64965O1947L6000L7595K394N168K0744j0364K7076M7122j050l6962m8902
22413E05733n0244P1938m2783l5282R8555m2382m9497K8897J2561L4534N1001
22402E83031m3599R156j01268j38578p3723J02474J50260J6161n1499J00735J02607
22391F55757O1979j43700k2286m7158r6106j08187l5236J24785N632j37033k7444
22380B31003J0612J7458N1443P4939L6546P5203R4736q001p3139j24007k2891
22369C63902k3181l8838o960Q9762J06988J26267m3755l9046j7240k3804j09278
$$ y = [214931, 204771, 269238, 420824, 530303, 517567, 554562, 550868, 529879, 532976, 380912, 446451, 490146, 441277, 410001, 449265, 505075, 587095, 591875, 592214, 570753, 521285, 400290, 364965, 426912, 462912, 500507, 502901, 508069, 528813, 518449, 545525, 592647, 591597, 554635, 505733, 455489, 527427, 484644, 449362, 547917, 505535, 456038, 484935, 497496, 532030, 583031, 539432, 548588, 447320, 308742, 235019, 337493, 487753, 503914, 452415, 553150, 655757, 717736, 574036, 551750, 504592, 408486, 300299, 265063, 389848, 395480, 258447, 231003, 241615, 259073, 310516, 385455, 422001, 497204, 591940, 583939, 510800, 386793, 363902, 340721, 301883, 294923, 384685, 491673, 617940, 574185, 535139, 517899, 494095, 384817]
22358C84817L2484M8292o9157n1339R9307Q2946J7792j10534p179R8405k4159
22347E01675n7576k4729j8288K9802K9516O1232L725N4737K4956Q500L093r7L6798
22334F53344l3212k7600j28605J42776Q9889q7092r7665L4441L7392j50780M3019
22323D75907M1622P5565n0585n1616j4791Q28q6641n7358J14108P6335Q5146J04500
22311G13020j9574p829M8205m1699j2823P008n0747j2287J2666l2750K9027o8359
22299E63858j03852p069N0689o439j009n0938M0573J48288m1915r8292m1274K6629
22287D79249l9425K5305R3871N4020q4282j02007k9330l8865q5897k9074J74391
22276D17956J32129L9072P221K7206K5893K3551J32739m0120j76350j9237j1451
$$ y = [384817, 417301, 465593, 396436, 345097, 444404, 527350, 545142, 434608, 427429, 525834, 501675, 444099, 419370, 401082, 430884, 460400, 521632, 525357, 580094, 605050, 613550, 616643, 616546, 653344, 620132, 592532, 463927, 606703, 696592, 609500, 511835, 546276, 583668, 432888, 475907, 517529, 593094, 542509, 490893, 476102, 476930, 390289, 332931, 447039, 523374, 608520, 713020, 693446, 685617, 733822, 692123, 679300, 686308, 635561, 623274, 635940, 603190, 632217, 563858, 460006, 452937, 503626, 497187, 496178, 445240, 485813, 634101, 592186, 493894, 452620, 479249, 439824, 465129, 559000, 613020, 528738, 426731, 397401, 358536, 272639, 243565, 417956, 550085, 589157, 596378, 623584, 649477, 673028, 805767, 765647, 589297, 570060, 558609]
22265E58609J36595Q9252l5729j8321p3001m5433P7016k0668l4653r2923J1247
22254E51991K6975j5298n603p3157L4919L7162M4501J19215K943r4383p5151J2676
22242E66790P3867O8933k0307m2036r796k4408L0323J4772n4909j1823j3126P9788
22230F58068O800q0l2799J10188L3478o1148J688M3883Q7335J7253L947q5717
22218G82896o7292O466R9851R8692j3494j50955n3375J05475Q6998j04545j24392
22207F66325r6358k3444k3840j7229J91637n411J56326J08874n6293q8681j22034
22196F89872J7118L5264j145q0486J28l7717Q2419O8412j2032p7582q986n7428
22184F17837K7376N956J7923J52619J27101j22944r1384L1204l4176k29J06267
$$ y = [558609, 695204, 784456, 748727, 730406, 657405, 611972, 688988, 668320, 633667, 540744, 551991, 578966, 563668, 558065, 484908, 519827, 556989, 601490, 720705, 723648, 629265, 554114, 566790, 640657, 709590, 689283, 647247, 637451, 613043, 643366, 658138, 603229, 591406, 578280, 658068, 664868, 664788, 631989, 742177, 775655, 714507, 716195, 760078, 847413, 864666, 868613, 782896, 715604, 722070, 821921, 920613, 907119, 756164, 702789, 808264, 895262, 790717, 666325, 569967, 546523, 522683, 505454, 697091, 691680, 848006, 956880, 900587, 811906, 689872, 706990, 742254, 741109, 660623, 660751, 623034, 705453, 773865, 761833, 684251, 675265, 617837, 645213, 651169, 669092, 821711, 948812, 825868, 734484, 765688, 731512, 731283, 837550]
22173H37550l3715N3690P814p5227M1056M3334q5934j75557N2941L0182L6737
22162G32871j8248L0812j7891l6537M5891l8855M1029k0455Q7997J2879L6468
22151H55961N0111J16393j021k14417p2261p544L8859m3988k7245m6877q151l3334
22139F06486P8050P4260N3828J07685J02684J7421j2719q4284j9193l9996p5478
22128H08744l5613J01710M3289n7676j17220r4253J25364J56931K3384j19041
22118H35619n6416K4387p4340M5235J00066P837j4069O9499l3222n5476j5537
22107H33583M7854J66670M0276j409J9095q0589q5800n5843L0025n084M7359k0138
22095I35999M5577O225O1227l1244l0239m8786K6019j6216q0376K2386J5058P5084
$$ y = [837550, 803835, 857525, 865339, 790112, 831168, 874502, 788568, 613011, 665952, 696134, 732871, 714623, 745435, 727544, 691007, 736898, 698043, 739072, 718617, 806614, 819493, 855961, 906072, 1022465, 1021444, 807027, 734766, 727222, 766081, 722093, 694848, 647971, 639820, 606486, 684536, 758796, 812624, 920309, 1022993, 1040414, 1027695, 943411, 924218, 884222, 808744, 773131, 874841, 918130, 860454, 743234, 648981, 774345, 931276, 954660, 835619, 779203, 803590, 729250, 774485, 874551, 882388, 868319, 937818, 904596, 849120, 833583, 881437, 1048107, 1088383, 1086974, 1106069, 1025480, 939680, 883837, 913862, 908778, 956137, 935999, 981576, 987801, 1049028, 1017784, 987545, 938759, 964778, 948562, 868186, 890572, 905630, 980714]
22083I80714m0432m8282K0421j9398r4109o3104L7514K3188K8898j2791k3507
22072G89112O3488J6444o806M5202Q1879Q0646J15590r2492j16498O7221K2944
22061A066730o7572k9045q3901j2512J4054N1659J6732N031R6144J3893J4784
22050A085997q0652o4010P7902P320j48353k1353J30309P1348p2412N1740n1921
22039I85915j43608O7456r0113j1374J19362M5407L6347m7952K829p8997q881
22028H76391L2693j72j2351l0949O2457Q2942J10891R132j19529r3690O2885J89820
22016A170520N0299j25530O9085J2076l6306Q7247r0053j62306m4883L0816J10516
22005A071481l8828r3124N0848J22679O9411k8036p4826q401m2502l1253j5796
$$ y = [980714, 940282, 892000, 912421, 893023, 798914, 735810, 773324, 796512, 825410, 812619, 789112, 852600, 869044, 862238, 907440, 989319, 1069965, 1185555, 1093063, 976565, 1043786, 1066730, 999158, 970113, 886212, 873700, 887754, 939413, 956145, 961176, 1057320, 1071213, 1085997, 1005345, 941335, 1019237, 1026557, 878204, 856851, 987160, 1058508, 986096, 1037836, 985915, 842307, 909763, 819650, 808276, 927638, 973045, 1009392, 961440, 964269, 885272, 876391, 909084, 908912, 896561, 865612, 928069, 1011011, 1121902, 1131034, 1011505, 917815, 980700, 1170520, 1220819, 1095289, 1164374, 1176450, 1140144, 1227391, 1137338, 975032, 930149, 960965, 1071481, 1032653, 939529, 990377, 1113056, 1182467, 1154431, 1079605, 1071204, 1028702, 997449, 981653]
21994I81653q6995L0548O2543O0237L8361L675J4161O4527J6294N7004J00108
21983A342116K589j4372l2342K4581k4138L944J5201K6077k1911J0241l8049j72222
21971A121715q4947R3454J24301q2166M3650R6842P650K1340K4005j11472q8553
21960A165819N091n1104K0013L4194J00422j4221l0599N7824r472M722L8784L8632
21948A360105l8670o9922n1679N633l8257M2187K0716l8762Q1819K5155p9014
21937A219311o5071o2940P6788O6586J1340M5172J50475M5353p2356k2581J4317
21926A406394o2863j34067J25718Q1043L2625j09512n6237M8725J75275K2763
21916A529864j21259j80571R8382J11119O13Q704R3253M9763q7728j71196J06688
$$ y = [981653, 894658, 925206, 987749, 1047986, 1086347, 1090022, 1104183, 1168710, 1185004, 1242008, 1342116, 1344705, 1330333, 1297991, 1322572, 1298434, 1302378, 1317579, 1343656, 1321745, 1331986, 1293937, 1121715, 1036768, 1130222, 1254523, 1172357, 1216007, 1312849, 1320499, 1341839, 1365844, 1254372, 1165819, 1170910, 1119806, 1139819, 1174013, 1274435, 1260214, 1229615, 1287439, 1277967, 1282689, 1321473, 1360105, 1321435, 1251513, 1199834, 1205467, 1167210, 1209397, 1230113, 1191351, 1273170, 1298325, 1219311, 1154240, 1091300, 1168088, 1234674, 1246014, 1291186, 1441661, 1487014, 1414658, 1392077, 1406394, 1343531, 1209464, 1335182, 1416225, 1448850, 1339338, 1283101, 1331826, 1507101, 1529864, 1408605, 1228034, 1326416, 1437535, 1438148, 1446852, 1540105, 1589868, 1502140, 1330944, 1437632]
21905A437632J89606L6742j01108j61632m070J55593N4174J00534J5157j14341
21895A608287k2527q8360m8457K390J0318M3918J2442m0089j5305M609J7903Q6344
21883A571473p2445M1528P5067n2015K8753J9646n511K284P0383K5714K293p7627
21871A629543O2220L7920K0360j29574r2891m8083L594M4051M1123Q6295L3774
21860A688332p1495n9676m0781j618O9582m2646O610m281N6665j0459L8761J9862
21848A648856n3250J65195L3410j13221p2358M0048N1971L8298P572l8758L8751
21837A746514O4180J2890j2894M8600j1360N142J12234O2455n1163L2270P28j11482
21825A898114o1704j01107q350Q2027K2148R8383K7361j20890o1588O104K7728
$$ y = [1437632, 1627238, 1663980, 1562872, 1401240, 1397170, 1552763, 1606937, 1707471, 1722628, 1608287, 1585760, 1497400, 1448943, 1451333, 1461651, 1505569, 1518011, 1477922, 1462617, 1467226, 1485129, 1571473, 1499028, 1540556, 1615623, 1563608, 1592361, 1612007, 1606496, 1608780, 1679163, 1704877, 1707170, 1629543, 1691763, 1729683, 1750043, 1620469, 1527578, 1479495, 1483089, 1527140, 1568263, 1654558, 1688332, 1616837, 1557161, 1516380, 1514762, 1584344, 1541698, 1548308, 1544027, 1600692, 1590233, 1628994, 1648856, 1595606, 1760801, 1794211, 1680990, 1608632, 1648680, 1700651, 1738949, 1746521, 1707763, 1746514, 1810694, 1823584, 1810690, 1859290, 1847930, 1853072, 1965306, 2027761, 1976598, 2008868, 2009596, 1898114, 1836410, 1735303, 1726953, 1808980, 1831128, 1929511, 1956872, 1835982, 1774394, 1780498, 1808226]
21814A808226m6758m045O6543J24737N2961j20001l0157L2162P9561M3900j22669
21803A884460q2816Q5795N3184K3101M2790l9509j00346K8517P8046p1148r8297
21792A803777J8072O1485n6336l1404N8084K6577J66079j8515l8842K1297m3908
21781A966366K3370l2181J0783j6508O3723Q6655o0858J69311J02898j69955n9546
21770B084058J28598P5094r7700l5365p0923K9828Q9343p713m8756L5031n649
21759B175846o895L9429Q490Q1476L5708j21807m1756P2807P1027K7280N8814
21748B400419l7512j4175l8065n8971Q0672J39223l682l8002m184j07341o1258
21737B257124m7268R0963O3616J44377O7009o0265K2222p3381r8526n6397l5690
$$ y = [1808226, 1761468, 1757423, 1823966, 1948703, 2001664, 1881663, 1851506, 1883668, 1963229, 2007129, 1884460, 1801644, 1887439, 1940623, 1963724, 2006514, 1967005, 1866659, 1895176, 1973222, 1902074, 1803777, 1821849, 1883334, 1826998, 1795594, 1853678, 1880255, 2046334, 2027819, 1988977, 2010274, 1966366, 1989736, 1957555, 1968338, 1951830, 2015553, 2102208, 2041350, 2210661, 2313559, 2143604, 2084058, 2212656, 2287750, 2190050, 2154685, 2083762, 2113590, 2202933, 2195220, 2146464, 2181495, 2175846, 2168951, 2208380, 2216870, 2298346, 2334054, 2212247, 2170491, 2243298, 2314325, 2341605, 2400419, 2362907, 2348732, 2310667, 2251696, 2332368, 2471591, 2467909, 2429907, 2425723, 2318382, 2257124, 2209856, 2300819, 2364435, 2508812, 2575821, 2515556, 2537778, 2464397, 2365871, 2309474, 2273784]
21726B273784j07464L4038J47910L9723N1122K9340p9685k8408m8443J10589J8287
21715B440793L3167P8132J4962K09254O4175j11708o3084n3370R9971O0465Q431
21704B781188j21399l4602m950m0456Q078N6697P6689O5573Q4L5741O4914K8868
21692B916425O4165P865q0728j45610q2379Q5038J11883q8442O7803J22872j41005
21681B837887j1513n7567J888L7756K7686N0811J28140p2363J4687R5740j12j7501
21669C035539o1182p5333N4428R3849k2523j19415j2673J91755J30983m4594r6087
21658C074747j5714l5262O3859k4486M0061o9451O0826R0096P3101j0514k0178
21647C227085m3942k4836J3218K11922n4571O37N1802m4066O2283Q5335q7843
$$ y = [2273784, 2166320, 2200358, 2348268, 2387991, 2439113, 2468453, 2388768, 2360360, 2311917, 2422506, 2440793, 2473960, 2552092, 2567054, 2776308, 2840483, 2728775, 2665691, 2612321, 2712292, 2772757, 2781188, 2659789, 2625187, 2620237, 2579781, 2587859, 2644556, 2721245, 2786818, 2786902, 2822643, 2887557, 2916425, 2980590, 2988455, 2907727, 2762117, 2679738, 2764776, 2876659, 2788217, 2856020, 2978892, 2837887, 2826374, 2768807, 2770695, 2808451, 2836137, 2886948, 3015088, 2942725, 2957412, 3053152, 3053040, 3035539, 2974357, 2899024, 2953452, 3047301, 3024778, 2905363, 2892690, 3084445, 3215428, 3170834, 3074747, 3059033, 3023771, 3087630, 3063144, 3103205, 3033754, 3094580, 3184676, 3257777, 3247263, 3227085, 3183143, 3158307, 3171525, 3383447, 3328876, 3329513, 3381315, 3337249, 3399532, 3484867, 3397024]
21636C397024j24611J9863J3739J27059J42747J254j19608j4021Q0348N6294n3330
21625C526758J1439k2571m1556K1009k217M2777L6433P837m6506j5609M7056Q0368
21613C645218m9172N3734M5982R9299L0057Q3859J6827j1338J2467M2125p02O7382
21601D035738Q052j28438k187n3288j9704O7953L4701l2342p5004q3621O0973
21590C812833Q3237l2773j6858P9060R1504p326R3134n68j07914l889K720J13918
21578D107078R3494o1476L1925N1951K3112P4158Q643Q1165o1542j27597L4467
21567D255378L2050J5394n667o2958k8032L3108J51374Q4220N3098J04499J5696
21556D648160n2671K786J48918J1148K4261l4455K5016k0210J6890N0722J1960
$$ y = [3397024, 3272413, 3292276, 3306015, 3433074, 3575821, 3577075, 3457467, 3443446, 3523794, 3580088, 3526758, 3538197, 3515626, 3474070, 3495079, 3492862, 3535639, 3572072, 3579909, 3533403, 3517794, 3564850, 3645218, 3596046, 3649780, 3695762, 3795061, 3825118, 3908977, 3925804, 3914466, 3926933, 3969058, 3968356, 4035738, 4043790, 3915352, 3913165, 3859877, 3840173, 3908126, 3942827, 3910485, 3835481, 3751860, 3812833, 3896070, 3863297, 3846439, 3925499, 4017003, 4009677, 4102811, 4102243, 3994329, 3990440, 3993160, 4107078, 4200572, 4139096, 4171021, 4222972, 4246084, 4320242, 4328885, 4410050, 4348508, 4220911, 4255378, 4287428, 4302822, 4297155, 4234197, 4206165, 4239273, 4390647, 4474867, 4527965, 4632464, 4648160, 4595489, 4598275, 4747193, 4758341, 4782602, 4748147, 4773163, 4752953, 4769843, 4820565, 4832525]
21545D832525m8089M8860J60089J34826j72989m3249Q556N2796Q169J19356j4648
21534E086202o9264J09463O2792l405j9759m3269M5891O0311J23135Q5410L822
21523E441329l0359p7170N7418l3329K9114Q4905j5509K515P105Q6154K3849n5462
21511E520560L4581R9791M9400k6582k1633p408J52530J75587Q5083N1594P8613
21500F192116l2965j9672p1918k0632l2187R2374J5567p2603l446J8774O4179
21489F129587J38037O0767n2238M2344O3231O0701K0511k9078l3622q797O4846
21478F456289j955J17956J53621J61478N2963q4318L6583j4797l2910K4494R9081
21467F968485K9890O8932R4385k5615L0300O4499j4117J00957P4371R180m2928
$$ y = [4832525, 4784436, 4833296, 4993385, 5128211, 4955222, 4911973, 4920529, 4973325, 4981494, 5100850, 5086202, 5016938, 5126401, 5189193, 5185788, 5166029, 5122760, 5168651, 5228962, 5352097, 5437507, 5441329, 5410970, 5333800, 5391218, 5357889, 5387003, 5471908, 5456399, 5458914, 5466019, 5552173, 5576022, 5520560, 5555141, 5654932, 5704332, 5677750, 5656117, 5648709, 5801239, 5976826, 6061909, 6113503, 6192116, 6159151, 6139479, 6067561, 6046929, 6014742, 6107116, 6122683, 6050080, 6046634, 6065408, 6129587, 6267624, 6328391, 6276153, 6318497, 6381728, 6442429, 6462940, 6433862, 6400240, 6391443, 6456289, 6454334, 6572290, 6725911, 6887389, 6940352, 6856034, 6892617, 6877820, 6844910, 6869404, 6968485, 6998375, 7067307, 7161692, 7136077, 7166377, 7230876, 7216759, 7317716, 7392087, 7401267, 7358339]
21456G358339M7444J44446Q9227J20492J13037o7079j83870N3086K14205j3053
21446G876274L0867Q5656k7356k2595K211M2183L2600j1581N2593L9601J72869
21435H273322P9160j7172l7115p729P8231L1207R3086J53238J11665K5697m5986
21424H737604M8090J22755M1158J3230l9769l5833J15365Q8127J2017N5302J17584
21413I275630M2834n5979R0186Q5232Q1875J44416l5627K8068J28809L8444P1740
21402I895628J41558M1918N8435P5900J21670R2928J03525l6033q0088k6579J04940
21391A0493802J43800J67276Q7373Q4988K4499P8050J22043N5400J46337J17728
21381A1521296Q6089Q9174Q4711o306R5941J15846N8519m1817P3485M6099N9785
$$ y = [7358339, 7405783, 7550229, 7639456, 7759948, 7872985, 7805906, 7622036, 7675122, 7889327, 7876274, 7907141, 7992797, 7965441, 7942846, 7945057, 7987240, 8019840, 8008259, 8060852, 8100453, 8273322, 8352482, 8335310, 8298195, 8290466, 8368697, 8399904, 8492990, 8646228, 8757893, 8783590, 8737604, 8785694, 8908449, 8949607, 8962837, 8923068, 8887235, 9002600, 9090727, 9102744, 9158046, 9275630, 9318464, 9262485, 9352671, 9437903, 9519778, 9664194, 9628567, 9656635, 9785444, 9823888, 9895628, 10037186, 10079104, 10137539, 10213439, 10335109, 10428037, 10531562, 10495529, 10415441, 10388862, 10493802, 10637602, 10804878, 10892251, 10977239, 11001738, 11079788, 11201831, 11257231, 11403568, 11521296, 11607385, 11696559, 11781270, 11774964, 11870905, 11986751, 12045270, 12003453, 12076938, 12123037, 12182822]
21370A2182822J79459J4085n6880j7656M0683J49130L04712J86001R611L9995
21360A3031962R8848R8219L4048J33800J18604O6917R969N1310J12175K7320O1428
21349A3844600K55877J47828O2626P1297J65462O5761L6555J21578J04039R1899
21339A4967522J37624J53418J37128O9010L2182J60189P0045J23092K61237J89762
21329A6301209L2937K6878N1745Q6416Q1234J27149J37446j2691J29652K08165
21319A7170140K34647K61761K51345J00459J67061J81501J77938K30660K38734
21310A9014246J18494J4760K02810J97104P6124P3342K45737R7614O6243K68933
21300B0375407J37998J9300L3466J64950K92259K58295J49006J72078J20970K06955
$$ y = [12182822, 12362281, 12376366, 12319486, 12301830, 12342513, 12491643, 12796355, 12982356, 12991967, 13031962, 13130810, 13229029, 13263077, 13396877, 13515481, 13582398, 13592367, 13643677, 13755852, 13783172, 13844600, 14100477, 14248305, 14310931, 14382228, 14547690, 14613451, 14650006, 14771584, 14875623, 14967522, 15105146, 15258564, 15395692, 15464702, 15496884, 15657073, 15727118, 15850210, 16111447, 16301209, 16334146, 16361024, 16412769, 16499185, 16580419, 16707568, 16845014, 16832323, 16961975, 17170140, 17404787, 17666548, 17917893, 18018352, 18185413, 18366914, 18544852, 18775512, 19014246, 19132740, 19147500, 19350310, 19547414, 19623538, 19696880, 19942617, 20040231, 20106474, 20375407, 20513405, 20532705, 20566171, 20731121, 21023380, 21281675, 21430681, 21602759, 21723729, 21930684]
21290B1930684J46997K70828J92725J73425K32611J87057P1775J75545K85453
21281B3667100K76992K02069K47015Q1767P6503N8421J63935L66925M23851L36135
21271B5900713J80873K43472K94735K36628K15519K86045L25076K82783R3827
21262B8059671O6687K31694L70434K52080J57480K94192L33325L22462L03787
21253C0391812L15511K73608K62454K60711L69827K49269K29421M24374M93758
21244C3270745K20028L05620L05863L47779L08092L36473L47973L81131M52097
21235C6275801L80883L78378N62084N27315M37876O35070N65717L81594M87421
21226D0632139L90560L28501L13682M57168M41149M79010N01845L78402M32876
$$ y = [21930684, 22077681, 22348509, 22541234, 22714659, 22947270, 23134327, 23206102, 23381647, 23667100, 23944092, 24146161, 24393176, 24474943, 24551446, 24609867, 24773802, 25140727, 25564578, 25900713, 26081586, 26325058, 26619793, 26856421, 27071940, 27357985, 27683061, 27965844, 28059671, 28126358, 28358052, 28728486, 28980566, 29138046, 29432238, 29765563, 30088025, 30391812, 30707323, 30980931, 31243385, 31504096, 31873923, 32123192, 32352613, 32776987, 33270745, 33490773, 33796393, 34102256, 34450035, 34758127, 35094600, 35442573, 35823704, 36275801, 36656684, 37035062, 37597146, 38124461, 38562337, 39197407, 39763124, 40144718, 40632139, 41022699, 41351200, 41664882, 42122050, 42563199, 43042209, 43544054, 43922456, 44355332]
21217D4355332L01670L15519L29706K98140K18576K87436L86184M12746L91068
21208D7296377M46347N24317L99105L34742N13821N58213N84496L86832L92584
21199E1436834N96507N91797M57392N10681O09536O00999N89273N50944N00483
21190E6444446N27400N87447N95014N98410M85459M67361N62645O67032P18566
21181F1653780N73652N53128O33482O45878N92046N90667N26764P15725P08592
21172F7193714P19652O75167P07908O57072P31437P28580O59475O91645O58685
21163G3423335O55968P78037O19661N99213O95475P58541O39625O78038O07840
21154G9455733O64961O30451P25545Q24947P20409P01069P46598O78490O38347
$$ y = [44355332, 44657002, 44972521, 45302227, 45600367, 45818943, 46106379, 46492563, 46905309, 47296377, 47742724, 48267041, 48666146, 49000888, 49514709, 50072922, 50657418, 51044250, 51436834, 52033341, 52625138, 53082530, 53593211, 54202747, 54803746, 55393019, 55943963, 56444446, 56971846, 57559293, 58154307, 58752717, 59238176, 59705537, 60268182, 60935214, 61653780, 62227432, 62780560, 63414042, 64059920, 64651966, 65242633, 65769397, 66485122, 67193714, 67913366, 68588533, 69296441, 69953513, 70684950, 71413530, 72073005, 72764650, 73423335, 74079303, 74857340, 75477001, 76076214, 76771689, 77530230, 78169855, 78847893, 79455733, 80120694, 80751145, 81476690, 82301637, 83022046, 83723115, 84469713, 85148203, 85786550]
21145H5786550P85727O26612O59446O55459N98392O29002P07040O99290M53391
21136I1600909M84433O44293P60774O12413N66838N45141O03842N62628M65904
21127I6847175M95381N90867N12262N21778M53135M93224N12397M26204L98681
21118A01251104M92091L14979L58348L82854L66067L97981J91068K46627L83484
21109A04384603J73709K53950J38584J32210P6259R5020J11346R3607O1082M3823
21099A05564193J04203K9588j8333O2081j09726j79924j45388n4310n1639k41680
21089A04959065k69922r9865j40607j45920l35527l56708l46203l55717k27383
21080A02681213m14729l95831l72642m56214m67641m28215l85285l61429m98645
$$ y = [85786550, 86572277, 87198889, 87858335, 88513794, 89112186, 89741188, 90448228, 91147518, 91600909, 92085342, 92729635, 93490409, 94102822, 94669660, 95214801, 95818643, 96381271, 96847175, 97342556, 97933423, 98445685, 98967463, 99420598, 99913822, 100426219, 100852423, 101251104, 101743195, 102058174, 102416522, 102799376, 103165443, 103563424, 103754492, 104001119, 104384603, 104558312, 104812262, 104950846, 105083056, 105159315, 105254335, 105365681, 105459288, 105520370, 105564193, 105668396, 105697984, 105679651, 105741732, 105632006, 105452082, 105306694, 105252384, 105200745, 104959065, 104689143, 104589278, 104448671, 104302751, 103967224, 103610516, 103264313, 102908596, 102681213, 102266484, 101870653, 101498011, 101041797, 100574156, 100145941, 99760656, 99399227, 98900582]
21071I8900582n53277n04716n50860n30063n44697n55337n48622o94361o00745
21062I3817904o38167o82751n75807o30171n80877n02657n76383n67028n93221
21053H8470842p10949p71165q39920o38194n82225p03675p20236n95930o42437
21044H2266111o77546o79573q49458o54613o84699n27496o30471p11601o95637
21035G6155017o88208p24694p16795p71310p98936o99409o34827o02069p47010
21026F9771759p72172o67167o56468o91281n26798n26428o41180o38068o07695
21017F4044502n68159o42709p02182p57753o66012n79877o04137n79771o25207
21008E8318695o68590o22779n13027m36041n11602o12398n28248n64240n08469
$$ y = [98900582, 98347305, 97842589, 97291729, 96761666, 96216969, 95661632, 95113010, 94418649, 93817904, 93179737, 92496986, 91921179, 91291008, 90710131, 90207474, 89631091, 89064063, 88470842, 87759893, 86988728, 86148808, 85510614, 84928389, 84224714, 83504478, 82908548, 82266111, 81588565, 80908992, 80059534, 79404921, 78720222, 78192726, 77562255, 76850654, 76155017, 75466809, 74742115, 74025320, 73254010, 72455074, 71755665, 71120838, 70518769, 69771759, 68999587, 68332420, 67675952, 66984671, 66457873, 65931445, 65290265, 64652197, 64044502, 63476343, 62833634, 62131452, 61373699, 60707687, 60127810, 59523673, 58943902, 58318695, 57650105, 57027326, 56514299, 56078258, 55566656, 54954258, 54426010, 53861770, 53353301]
20999E3353301n30707o15782n18355m35629n31233m78161n81974o07531n56926
20990D8497003n24340l73506l09574m10299m32219m78417m99143m19220m38165
20981D4612120n46515n55053l77682l17720l81069n01814m38923k53314l85365
20972D0854665m71978m42978l89890k65400l80306l74136m09555m76083l94758
20963C7249581l77930k78355l65669l71231l94426k64279k69282k95952m51987
20954C4180470l75379l35109l29323k05900k02749l11673l42310l67306l10170
20945C1400551k87179k66345k39135l01965j81867j45605j98693l84136k15787
20936B9179839j94565k54561m40326l49798k10549j57675k55807l30825k18906
$$ y = [53353301, 52822594, 52206812, 51688457, 51252828, 50721595, 50243434, 49661460, 49053929, 48497003, 47972663, 47599157, 47289583, 46879284, 46447065, 45968648, 45469505, 45050285, 44612120, 44065605, 43510552, 43132870, 42815150, 42434081, 41932267, 41493344, 41240030, 40854665, 40382687, 39939709, 39549819, 39284419, 38904113, 38529977, 38120422, 37644339, 37249581, 36871651, 36593296, 36227627, 35856396, 35461970, 35197691, 34928409, 34632457, 34180470, 33805091, 33469982, 33140659, 32934759, 32732010, 32420337, 32078027, 31710721, 31400551, 31113372, 30847027, 30607892, 30305927, 30124060, 29978455, 29779762, 29395626, 29179839, 28985274, 28730713, 28290387, 27940589, 27730040, 27572365, 27316558, 26985733, 26766827]
20927B6766827j21090k06198k93323k27121j96883k36368k96707o8685k25017
20918B4895435j86529k88800k24026j66372j37274k68628j56336j52623k02903
20909B3111944k19247j87869j13812k86889j96301k51452k69499j51865k07573
20900B1227437j36728k53555k55280k15172j49404j82946j78617K3456p0024j45012
20890A9664155j85890k89234m9640j18414j56084j32856j90803j43353P4616o7876
20880A8404621j44932j74248p1609j86300j16406n9943k79193k45991j84493q6936
20870A6854570j86302j95209q2364j61900q0419J0835O0552m0127k30529j49047
20860A5800060j63912j78725r5348K5965j87351j68196j60991j98161j49843j02778
$$ y = [26766827, 26645737, 26439539, 26146216, 25919095, 25722212, 25485844, 25189137, 25120452, 24895435, 24708906, 24420106, 24196080, 24029708, 23892434, 23623806, 23467470, 23314847, 23111944, 22892697, 22704828, 22591016, 22304127, 22107826, 21856374, 21586875, 21435010, 21227437, 21090709, 20837154, 20581874, 20366702, 20217298, 20034352, 19855735, 19879191, 19809167, 19664155, 19478265, 19189031, 19139391, 19020977, 18864893, 18732037, 18541234, 18397881, 18472497, 18404621, 18259689, 18085441, 18013832, 17827532, 17711126, 17651183, 17371990, 17125999, 16941506, 16854570, 16668268, 16473059, 16390695, 16228795, 16148376, 16159211, 16219763, 16179636, 15949107, 15800060, 15636148, 15457423, 15362075, 15388040, 15200689, 15032493, 14871502, 14673341, 14523498, 14420720]
20850A4420720j27n8494r2001j97888j13798p8978m6384o5237J255n3040o3097
20839A3652931j65187j95242j04882K1919j07099j52784o3520j24063r5661L9020
20829A2705432O2308r0834J4582N9740j54952j11379r336j21586j54025q98j02387
20818A2096665k19584j50130L1769J11624j49106j58061j03683l7090J4717j18355
20808A1318766p6974k5164j43747k43404j47762r5529p7132m9863J44073n2289
20798A0550975j20983j20217j08078m6821l7354j0338K462k4617o4678j55456
20788I864895m6449l5012k8870n2416k20322o4622j2495l7354j01983J1327K2919
20777I299618j2328j76058o7078m8972j08885P9644r9751k28002j15148p1263
$$ y = [14420720, 14420593, 14362099, 14270098, 14072210, 13958412, 13879434, 13833050, 13767813, 13769068, 13716028, 13652931, 13487744, 13292502, 13187620, 13209539, 13102440, 12949656, 12886136, 12762073, 12666412, 12705432, 12767740, 12676906, 12691488, 12751228, 12596276, 12484897, 12475561, 12353975, 12199950, 12199052, 12096665, 11877081, 11726951, 11758720, 11870344, 11721238, 11563177, 11459494, 11422404, 11437121, 11318766, 11241792, 11216628, 11072881, 10829477, 10681715, 10586186, 10509054, 10459191, 10603264, 10550975, 10429992, 10309775, 10201697, 10154876, 10117522, 10107184, 10109646, 10085029, 10020351, 9864895, 9818446, 9783434, 9754564, 9702148, 9481826, 9417204, 9404709, 9367355, 9265372, 9276699, 9299618, 9287290, 9111232, 9044154, 8995182, 8886297, 8965941, 8866190, 8638188, 8523040, 8451777]
20767H451777p1142K0774M481J172q7024m760Q100m6750j51003m3617N0282m3861
20755H088429q7232j02924L2441K4858j53507k71735j25506N7478J06458M6553
20745G615313N8707L29m0620j23696j38411J0141m823R7140p3922j71606j31352
20734G097200n8336J358n8842l5796l1676p612k1737o5994L2553N2414L771l6846
20722F870457R4453P5859j5404j6297k061K3224K8008P0806K5466j52985p7743
20711F923783q5822m3242J7005q7755j29060m6588K7811N7426O10K6752r2398
20700F568522q8311k5891j53355l7772J13520P3775j21633j88382p0839N7964
20690F127598n4388K091q5856n6876M3180j196j920n9394j06597q287K4234J7347
$$ y = [8451777, 8380635, 8401409, 8405890, 8407062, 8320038, 8315278, 8323378, 8276628, 8125625, 8082008, 8132290, 8088429, 8001197, 7898273, 7930714, 7955572, 7802065, 7530330, 7404824, 7462302, 7568760, 7615313, 7674020, 7674349, 7633729, 7510033, 7371622, 7381763, 7376940, 7474080, 7400158, 7228552, 7097200, 7038864, 7040222, 6981380, 6945584, 6913908, 6906296, 6884559, 6818565, 6851118, 6903532, 6907303, 6870457, 6964910, 7040769, 7025365, 7009068, 7007007, 7030231, 7058239, 7129045, 7154511, 7001526, 6923783, 6837961, 6794719, 6811724, 6723969, 6594909, 6548321, 6576132, 6633558, 6634168, 6660920, 6568522, 6480211, 6454320, 6300965, 6263193, 6376713, 6450488, 6328855, 6140473, 6069634, 6127598, 6073210, 6075301, 5989445, 5932569, 5975749, 5974553, 5972633, 5913239, 5806642, 5798355, 5822589, 5839936]
20678E839936Q1578Q9158J3772j35287j98413l0014K7833R9522P1290R4586k5431
20667E928530l3816n6452j4104k5978m0683o13q4311j5643p528J43443Q5594K9776
20655E908215j08653j72738o3929r9547j14985m3275J24943L737n2818o1401l2847
20644E286702l4726Q8324O3229N2913j07111q4221M2155r350j30077j33114P3678
20633E108402J11715J43577m0341Q445J75359k7905n6428j8079J29872l4181p7755
20622E422681R296J40095K09871J38235J46151Q1298P9595K89271K91717K53659
20612G061869J62448L7829J13160K12606L71122K95211P4335J10300J39644K42199
20602H820723K81636K75606L23909K71299M95631M62681K18620K78725L60595
$$ y = [5839936, 5921514, 6010672, 6024444, 5889157, 5690744, 5660730, 5688563, 5788085, 5859375, 5953961, 5928530, 5894714, 5838262, 5824158, 5798180, 5757497, 5756884, 5672573, 5656930, 5649402, 5792845, 5878439, 5908215, 5799562, 5626824, 5562895, 5463348, 5348363, 5305088, 5430031, 5433768, 5380950, 5319549, 5286702, 5251976, 5340300, 5403529, 5456442, 5349331, 5265110, 5307265, 5297915, 5167838, 5034724, 5108402, 5220117, 5363694, 5323353, 5331798, 5507157, 5479252, 5422824, 5404745, 5534617, 5500436, 5422681, 5431977, 5572072, 5781943, 5920178, 6066329, 6147627, 6227222, 6516493, 6808210, 7061869, 7224317, 7262146, 7375306, 7587912, 7959034, 8254245, 8328580, 8438880, 8578524, 8820723, 9102359, 9377965, 9701874, 9973173, 10468804, 10931485, 11150105, 11428830, 11789425]
20593A1789425O41034P86966Q12312R21780J017077J203683J525930J827273K487235
20584B3012715L248529M213541O033968R315740J4511625K2933151L4242051M4251433
20576A61762753M3612386K6815359l1634o709110J0827295K7456183K9160564
20569B92893796J4561131l292103J625132R309984k338045k4511423k2151500
20562B66096972j540323J0939448M421507k0542259m5870029m4876842l2535787
20555A36092687k2815287j6084493j1544336q911718p270502o209765n558082
20548E7698504m761057m095591l880991m062759l794943l366619l071142k643709
20540B8021693k295510j984521j546405j251028j252236j294499j309437j148421
$$ y = [11789425, 12430459, 13217425, 14029737, 14951517, 15968594, 17172277, 18698207, 20525480, 23012715, 26261244, 30474785, 36508753, 45824493, 60336118, 83269269, 117511320, 161762753, 205375139, 232190498, 232158864, 225449754, 236277049, 263733232, 292893796, 307454927, 304162824, 305787956, 315097940, 312759895, 288248472, 266096972, 264556649, 275496097, 279917604, 259375345, 213505316, 168628474, 136092687, 113277400, 97192907, 85648571, 76736853, 69466351, 63256586, 57698504, 52937447, 48841856, 44960865, 40898106, 37103163, 33736544, 30665402, 28021693, 25726183, 23741662, 22195257, 20944229, 19691993, 18397494, 17088057, 15939636]
20532A5939636r63799o43793n96138q74401o90687o26651m80652n71342o00185
20523I891988n93032k81789k93191m36774n83381m25203m60122l86008l80731
20514F051757l74753k52033j64893j02055j75831j82008j50317j33551m5819m4839
20504D425658j67606p6471m1486o9681j23349p0578P6441K6963j18337j57123
20494C704431j4082m6749k7025j7530Q3503o9994j25774k14272l7606J5784n945
20483C244741R914J3792r3545j16132j1432o3263M5751M9150q4174r1459n5526
20472B847817P1467o4357j8164N5097Q4925r8223K2081Q1279o547k00809n8517
20461B716049n2522O2236K066j48581L6311J41352N4572R934n8796J28700J0441
$$ y = [15939636, 14975837, 14332044, 13735906, 12861505, 12170818, 11544167, 11063515, 10492173, 9891988, 9298956, 9017167, 8723976, 8287202, 7703821, 7278618, 6818496, 6432488, 6051757, 5677004, 5424971, 5260078, 5158023, 4982192, 4800184, 4649867, 4516316, 4470497, 4425658, 4258052, 4181581, 4140095, 4070414, 3947065, 3876487, 3952928, 3979891, 3861554, 3704431, 3690349, 3643600, 3616575, 3599045, 3682548, 3612554, 3486780, 3272508, 3234902, 3250686, 3244741, 3254655, 3268447, 3174902, 3058770, 3047338, 2984075, 3029826, 3078976, 2994802, 2903343, 2847817, 2919284, 2854927, 2836763, 2891860, 2976785, 2878562, 2900643, 2981922, 2975375, 2774566, 2716049, 2663527, 2725763, 2727829, 2579248, 2615559, 2756911, 2811483, 2821417, 2762621, 2891321, 2901762]
20450B901762Q5600k11k4259j05856j3997r8896J7442J6239m5556j11321m5167
20439B575780n9178j04208Q6680L6504N7428j32675j79784O0766P4790o1778K8618
20428B382943R12L0947j75624j92924m3187Q9537J10766j0291j7339p656J5255
20417B183339n6478N0181N7056L984J5544J189O1185l3499k9493R4002M0534l0318
20405B357226P989r17k0085O107L4304M1989m4741p2455r449l6317k853q7115
20393B173683q4712J124Q7583J15897K670K047k7614r512n4581k7876r36P3457
20381B251230M123m4674j30132L1976J9615K0393j0395Q731o4244n98l759P498
20369B089764P586r6741n1293p0612o1039R8491M2794r3810K9446J1030J47032
$$ y = [2901762, 2987362, 2987151, 2962892, 2857036, 2843039, 2744143, 2761585, 2777824, 2732268, 2620947, 2575780, 2516602, 2412394, 2499074, 2535578, 2593006, 2460331, 2280547, 2341313, 2416103, 2354325, 2382943, 2383855, 2414802, 2239178, 2046254, 2003067, 2092604, 2203370, 2193079, 2175740, 2168084, 2183339, 2126861, 2177042, 2234098, 2238082, 2253626, 2254815, 2316000, 2282501, 2253008, 2347010, 2387544, 2357226, 2365215, 2364298, 2344213, 2350320, 2384624, 2426613, 2381872, 2309417, 2299968, 2263651, 2260798, 2173683, 2088971, 2090095, 2177678, 2293575, 2296245, 2298292, 2270678, 2261166, 2206585, 2178709, 2177773, 2251230, 2255353, 2210679, 2080547, 2112523, 2132138, 2152531, 2142136, 2150867, 2086623, 2086025, 2082266, 2089764, 2097350, 2000609, 1949316, 1878704, 1817665, 1916156, 1958950, 1865140, 1894586, 1905616, 2052648]
20358B052648J74977m1536r3648o5296j02689j07682J6757J10095N8636n63j3716
20347A987983n4830l1929j0730Q1411N2209N1620J5869M8084r5758j06216m0867
20336A896846J27809O0933K1502J38607N830j38930j08307P6960j00681m6717
20326A933852p8944o3270K964K753L5909l400j65458o1016j08375K1389J62327
20315A678731N3419p7335p0409j8834q9614j9219J14998J77274k2604j10345k9389
20304A586673M2671L3227P556j25130n4236K9742M7892m4758K4438j73525r703
20293A364847M3454M8227J27088o9905L297j166M682n6554J3307P1257R1748q0202
20281A560080p1240q9452l5514O9881r0372m3229R3841k36r8776l0771J67976
$$ y = [2052648, 2227625, 2186089, 2092441, 2027145, 1924456, 1816774, 1833531, 1943626, 2002262, 2001699, 1987983, 1933153, 1901224, 1890494, 1971905, 2024114, 2075734, 2091603, 2139687, 2043929, 1937713, 1896846, 2024655, 2085588, 2107090, 2245697, 2251527, 2112597, 2004290, 2081250, 1980569, 1933852, 1854908, 1791638, 1794602, 1797355, 1833264, 1829864, 1664406, 1603390, 1495015, 1516404, 1678731, 1732150, 1654815, 1584406, 1565572, 1475958, 1456739, 1571737, 1749011, 1726407, 1616062, 1586673, 1629344, 1662571, 1670127, 1544997, 1490761, 1520503, 1568395, 1523637, 1548075, 1374550, 1364847, 1408301, 1456528, 1583616, 1513711, 1517008, 1515842, 1520524, 1463970, 1477277, 1548534, 1640282, 1560080, 1488840, 1399388, 1363874, 1433755, 1343383, 1300154, 1393995, 1393759, 1294983, 1264212, 1432188]
20270A432188J56812k038q0230j29944q9331M4523J16667J3450l8681M0745p7337
20259A386824n8248J0602j10651k7951J77312M9629j69876L7321R8557J88794
20249A582313j09062j68864N6964j6512L4191J3250q2577M7382j4582p4932q7899
20238A179672p7291k636R0747Q6662k7090k0664j5327j17718j097M8320l5205
20227A108373P1436P2815q898r8976j59739N1266n09k1917K9384J84896J29620
20216A357751j41627j48806j29780Q0327R3255o8078l8464M5068P3486R0335k0185
20205A193282o2408q710P3951N8996k3681l9099j02234m4528K7029N3K8172P2114
20193A172937j08407n353N1997m7556o4713P5844J90959J0169r7675j56598q691
$$ y = [1432188, 1589000, 1586962, 1506732, 1376788, 1287457, 1331980, 1448647, 1462097, 1423416, 1464161, 1386824, 1328576, 1339178, 1228527, 1200576, 1377888, 1427517, 1257641, 1294962, 1393519, 1582313, 1473251, 1304387, 1361351, 1344839, 1379030, 1392280, 1309703, 1357085, 1342503, 1267571, 1179672, 1102381, 1099745, 1190492, 1277154, 1250064, 1229400, 1214073, 1096355, 1095258, 1143578, 1108373, 1179809, 1252624, 1243726, 1144750, 985011, 1036277, 1035768, 1013851, 1043235, 1228131, 1357751, 1216124, 1067318, 937538, 1017865, 1111120, 1043042, 1004578, 1049646, 1123132, 1213467, 1193282, 1130874, 1122164, 1196115, 1255111, 1231430, 1192331, 1090097, 1045569, 1072598, 1072651, 1100823, 1172937, 1064530, 1059177, 1111174, 1063618, 998905, 1074749, 1265708, 1275877, 1178202, 1021604, 1012913]
20182A012913J7848J48781P2996j9752q4967m0177J340p4138m5079M6891r1365
20171I45291J3174L3831m3052k3135N6324O7350J05816l7883o2078q8081l0521
20160I37036j8651p5313K0086J02358M4163p60K9173J26440J43258o3042J8920
20149A263668m2526J1203M792q6490m4500O5424q229l3915o878M0869j31118J0925
20137A043225K1687R0623p4776p7283k1582o8940J18018j4323M9966K4617j00965
20126I90267o0252j2732J5273m1028p4628j9724k2428O8629J02510P3480J3172
20115A032539P9610J6000j38841j01382M2394l979p4604o5659L0466L1480J52619
20104A000643J3425p4342l2952M3974n5750L0686J05783o3699j9263M0161k466
$$ y = [1012913, 1030761, 1179542, 1252538, 1232786, 1147819, 1107642, 1108982, 1034844, 989765, 1036656, 945291, 958465, 992296, 949244, 926109, 982433, 1049783, 1155599, 1117716, 1055638, 967557, 937036, 918385, 843072, 863158, 965516, 1009679, 1008919, 1038092, 1164532, 1307790, 1244748, 1263668, 1221142, 1232345, 1237137, 1150647, 1106147, 1171571, 1163342, 1129427, 1122549, 1163418, 1032300, 1043225, 1064912, 1155535, 1080759, 1003476, 981894, 912954, 1030972, 1016649, 1066615, 1091232, 990267, 930015, 917283, 932556, 891528, 816900, 797176, 774748, 843377, 945887, 1019367, 1032539, 1112149, 1128149, 989308, 887926, 930320, 926341, 851737, 786078, 816544, 848024, 1000643, 1014068, 939726, 906774, 950748, 894998, 925684, 1031467, 967768, 948505, 988666, 986200]
20093I86200j22878r7149k3846J10442J23267k6684r1526o9545r651K5713n9669
20082G44674O1083L8798M9643M6488J1333j8240p5301m6552L7247l065k4198Q2000
20070I03910k8145j31254M8929L8315k1645m5593Q5564J22789M8994j83099p234
20059H31531K2605j4397o2670j7571n422N6374O236k5057j0026J01824j13584
20048G69843N1677l6800J26548J0572k2451j03000n0280n8509K8028K7481N6324
20037G99433n9558j3351Q7477O20J4480L630K1518P5130K5387p7656j17261k5557
20025G34292N1186Q9988K2906K4920j12144j3941J0981r6480o0435O6029n177
20014G12125K0367p635o3139J2132R8699J6729q1322J9489K99R996j36706r3577
$$ y = [986200, 863322, 766173, 742327, 852769, 976036, 949352, 857826, 788281, 778630, 804343, 744674, 805757, 844555, 894198, 940686, 952019, 933779, 858478, 811926, 849173, 846108, 821910, 903910, 875765, 744511, 793440, 831755, 810110, 764517, 850081, 972870, 1021864, 838765, 831531, 854136, 839739, 777069, 759498, 754076, 810450, 816686, 791629, 781603, 883427, 769843, 821520, 784720, 911268, 921840, 899389, 796389, 746109, 687600, 715628, 743109, 799433, 739875, 726524, 814001, 814621, 829101, 832731, 854249, 929379, 954766, 877110, 759849, 734292, 785478, 875466, 898372, 923292, 811148, 797207, 808188, 711708, 651273, 717302, 712125, 732492, 724857, 661718, 673850, 772549, 789278, 707956, 727445, 727744, 737740, 601034, 507457]
20002E07457L7415P0944O0691p5183O5694R5683J2997j8793k2387K7250l6849
19991G24919K1985r1113N8085l4985K735j9090n236K0932k3491R94j1123k7788
19979F16824M813O3458N8452j5802N1085J28962n3264o7887l0279m6878J3013
19968G22497j02054q9799N2916j7840N3036J10204J930L1997o5497l4864O939
19957F69465M0181R6003J1179o162j3748l6864n8742Q5204j34359q6640j7438
19946E48079L0326J08572J6479r1217L5201M381p6156k403K6259P3355J12001
19935G84877J27725q5682j22871m6068K1384J5783Q831k1283k915J10169M9210
19924H39160j22787p4027J03511J39080K1641p1001R1805J20856O9392J11561
$$ y = [507457, 544872, 615816, 676507, 601324, 667018, 762701, 775698, 756905, 734518, 761768, 724919, 746904, 655791, 713876, 678891, 681626, 662536, 657300, 678232, 654741, 655735, 644612, 616824, 621637, 685095, 743547, 727745, 778830, 907792, 854528, 786641, 756362, 709484, 722497, 620443, 530644, 583560, 565720, 618756, 728960, 730890, 762887, 697390, 662526, 669465, 709646, 805649, 816828, 810666, 796918, 760054, 701312, 786516, 652157, 565517, 548079, 578405, 686977, 703456, 612239, 647440, 651821, 575665, 573262, 599521, 672876, 784877, 912602, 826920, 704049, 657981, 679365, 695148, 703979, 682696, 679781, 789950, 839160, 716373, 642346, 745857, 884937, 906578, 835577, 927382, 1048238, 1117630, 1229191]
19914A229191J13563K334P553J56287J29578J53537J58798K8654M4377L9709Q5921
19903B149502O3647M4653j70084r3150m1098J51286n9769j30004r3553k12355
19893A609075j11948j08796l4140j16151k07008k3151l1404p1472M5545Q4390
19883A034940R1626J77634K18476J48965K1105n1196r0168m1435l861O9804L0444
19872A606334Q6183J34252O4123P1140K01610j7206q4218l8969q6339j90286j82063
19861A564561n5025K8483O9188K4530P3316M9109j16648j33672k07248j48292
19851A148302r0795L6718j8563m3903m7641j22973j25411j19457m4293J3513M4801
19840F30298J94812O1733l6818p4170l2282L6154n3990o0879L0436P7224l0286
$$ y = [1229191, 1342754, 1345088, 1352641, 1508928, 1638506, 1792043, 1950841, 1979495, 2023872, 2063581, 2149502, 2213149, 2257802, 2087718, 1994568, 1953470, 2104756, 2044987, 1914983, 1821430, 1609075, 1497127, 1388331, 1354191, 1238040, 1031032, 1007881, 976477, 905005, 950550, 1034940, 1126566, 1304200, 1522676, 1671641, 1692746, 1641550, 1551382, 1509947, 1506086, 1575890, 1606334, 1692517, 1826769, 1890892, 1962032, 2163642, 2146436, 2062218, 2023249, 1936910, 1746624, 1564561, 1509536, 1538019, 1607207, 1631737, 1705053, 1754162, 1637514, 1503842, 1296594, 1148302, 1057507, 1094225, 1075662, 1031759, 984118, 861145, 735734, 616277, 571984, 585497, 630298, 825110, 886843, 850025, 775855, 743573, 779727, 725737, 664858, 695294, 772518, 742232]
19829G42232n9660m5118r132k8118l3837P821m1761O7184P0097p0519j30327K6783
19817D95645m5974Q351K2024J02171M6332p2324R4693j03200p8483r795l5850
19806D23590P5122K4882l6318Q538J9836j0063p3514p0981m4092J42212Q5435
19795E44647j30045n3769m6370N1524K9377J0576o4007M6415l0013K4194q493
19784C74036j22047N6563N0026P6136R9342m6514J18997n849j43457p9235r9186
19773B78812l8982J15837J07395P9268J9593J5783n595p6303P5087Q460j51503
19762D27852j8276n8667M9087J01838L6074m5259l7601k8734k6713N2261L2716
19751D84578m6652L2857O8952j691o8845j58228J8029Q2831K8919r3103J23281
$$ y = [742232, 682572, 637454, 628322, 600204, 566367, 574188, 532427, 599611, 669708, 599189, 468862, 495645, 449671, 458022, 480046, 582217, 628549, 556225, 650918, 547718, 469235, 459440, 423590, 498712, 523594, 487276, 495814, 515650, 505587, 432073, 361092, 317000, 459212, 544647, 414602, 360833, 314463, 365987, 395364, 405940, 341933, 388348, 358335, 382529, 374036, 251989, 308552, 358578, 434714, 534056, 487542, 606539, 600690, 457233, 377998, 278812, 239830, 355667, 463062, 542330, 561923, 577706, 572111, 495808, 570895, 579355, 427852, 409576, 350909, 399996, 501834, 537908, 492649, 455048, 426314, 399601, 451862, 484578, 437926, 470783, 539735, 538044, 469199, 310971, 329000, 411831, 440750, 347647, 470928]
19740D70928M8425k9179p8755r4904M2980L9110m1886R6033M8181K2186N10r1690
19728D31939p9453p9964J35578Q0697j51619r8170K9394L3916P3218J33890P2690
19717E82116j16899q4683q5185N730J72958N5527j4361K7938q516p1636j22758
19706C40231J789k7952m5181L9235n6647K261J70321k8295o4969j52475M9910
19695B28228R4164L5127k8171J5552N2694n7064n5157M3232K2781n0563n9996
19684B40827l3613P6081O8006O4483l4040K0417j4675l1586p012m5276j3437M087
19672B94262J12278n9678o6609n055k3780N784J6925J6340J839m0619l1615R7739
19660C17811J02989j0374p328P953m8836r1339o103P0091R8680j30007m0763N8754
$$ y = [470928, 519353, 490174, 411419, 316515, 359495, 398605, 356719, 452752, 500933, 523119, 523629, 431939, 352486, 272522, 408100, 488797, 337178, 239008, 268402, 302318, 375536, 509426, 582116, 465217, 380534, 295349, 301079, 474037, 529564, 515203, 543141, 534625, 462989, 340231, 342020, 314068, 268887, 308122, 251475, 253736, 424057, 395762, 330793, 178318, 228228, 322392, 357519, 329348, 344900, 397594, 340530, 285373, 328605, 351386, 300823, 240827, 207214, 283295, 351301, 415784, 381744, 402161, 387486, 355900, 348888, 303612, 290175, 294262, 406540, 346862, 280253, 275198, 251418, 257202, 274127, 290467, 292306, 251687, 220072, 317811, 420800, 410426, 403098, 411051, 362215, 270876, 264773, 334864, 433544, 303537, 262774, 321528]
19648C21528Q8722k8202R390O7118K1165n4761L2895Q0610j18661p0805n9853
19637B89146J02327K0451p7333R951Q687l798P519J80149N9005j95152j11664
19626B89288J6685m9679L6073J15051k6790r2315o9627K1190J60471R6159l2403
19615D64103n4541L7073N4865m3613O485J9643q1064n1129J29540P086M3524q339
19603E23633K37m2086P2846L6939J6359n7982l2555J3828J24507j22859r1188
19592D41679R0258r2629m7413J05216J19775J16115j1418p6812N4651M2921j23311
19581F19032p5923P169j23420j07511k9464j6756J9969J48525O9882m6879J7934
19570D82558n5528k4902j01828j33248P2359P4666K4111q7551J864k7209j29444
$$ y = [321528, 410250, 382048, 391438, 458556, 479721, 424960, 457855, 538465, 419804, 348999, 289146, 391473, 411924, 334591, 344542, 353229, 349431, 356950, 537099, 596104, 400952, 289288, 305973, 256294, 292367, 407418, 380628, 288313, 218686, 239876, 400347, 496506, 464103, 409562, 446635, 501500, 457887, 464372, 484015, 402951, 351822, 481362, 488448, 531972, 523633, 523870, 481784, 554630, 591569, 607928, 549946, 517391, 531219, 655726, 532867, 441679, 531937, 439308, 391895, 497111, 616886, 733001, 721583, 644771, 699422, 742343, 619032, 543109, 550278, 426858, 319347, 289883, 273127, 293096, 441621, 511503, 464624, 482558, 427030, 402128, 300300, 167052, 239411, 314077, 338188, 250637, 252501, 225292, 95848]
19559I5848K2623R7850P9802K2942K0152J53384K7093n3609M92N2442l7881J1313
19547D92451J08338N1313L5371k2303n125j41980j20674j544L2358L8227M4115
19536E10547p6734P316m3322L8590J3957o205N2826j11239P80R4003m4527j4318
19524D21674j1097m3689o4617J2246n19N6467M6981q042M4463p3872l6837O7567
19512D10725o4053l5456O1806q443r8810l4537n9723Q1568J06024o5029m5577
19501B48495J11769L2176n3478j8941m8037j3847l5979n8671m274R7376P5670
19490C32259q653L6116N3197k56q9473L4222J21677q261m1718l7920k3385n5769
19478C12036o2331m191N8934O2786R0263K3379P6k8971O710q4825j8336M1549
$$ y = [95848, 118471, 216321, 296123, 319065, 339217, 492601, 519694, 466085, 466577, 519019, 481138, 492451, 600789, 652102, 687473, 665170, 660045, 518065, 397391, 395847, 428205, 466432, 510547, 433813, 441129, 397807, 436397, 450354, 444149, 496975, 385736, 386516, 480519, 435992, 421674, 410577, 366888, 302271, 314517, 313998, 370465, 417446, 409404, 453867, 379995, 343158, 410725, 346672, 311216, 373022, 364579, 265769, 231232, 171509, 253077, 359101, 294072, 248495, 360264, 392440, 338962, 320021, 271984, 258137, 222158, 163487, 159213, 256589, 332259, 323606, 359722, 412919, 412663, 323190, 357412, 479089, 470828, 429110, 391190, 367805, 312036, 249705, 245514, 304448, 367234, 457497, 480876, 480952, 451981, 458691, 373866, 355530, 397079]
19466C97079k4740N1447O1425K3079L590l8476k96L6011p5787M0730O8152n3533
19454D88681m2564l946M536J09386M8893j32355n0425j2400M7894J59054p4393
19443E42361j03313N382n1390O213r074N2656J4190l3040j0128M3109n6622j51704
19431B48640L196K47164J6119k23256q870j021M6768p7679n1071o2781k7216n4011
19419E5982P1043P0508Q2446K1455j07567k5170O2809K9110p2204K3422J0142
19408B21976r8561K4834l5987J6757R7935k4798r2833j56967n1220J21166J63792
19397A86094J1901n182j48101l3379J00106J38546r2781r8975n8881j6833J07699
19386I0214k327m4854M5243j3017j07736O8012J20890O8297l7897N6210l2492
$$ y = [397079, 372339, 423786, 485211, 508290, 511880, 473404, 473108, 509119, 433332, 474062, 542214, 488681, 446117, 442171, 446707, 556093, 604986, 472631, 422206, 409806, 457700, 616754, 542361, 439048, 444430, 393040, 399253, 390179, 442835, 457025, 423985, 413857, 456966, 400344, 248640, 251836, 499000, 515119, 291863, 282993, 281972, 328740, 251061, 199990, 137209, 109993, 55982, 127025, 197533, 279979, 301434, 193867, 168697, 231506, 260616, 188412, 211834, 221976, 123415, 148249, 112262, 129019, 226954, 202156, 109323, -47644, -98864, 22302, 186094, 197995, 192813, 44712, 11333, 111439, 249985, 157204, 58229, -652, -17485, 90214, 87887, 43033, 88276, 75259, -32477, 35535, 156425, 224722, 186825, 243035, 210543]
19375B10543M2317J82638r7066q9736m0521P8368J17478j17674p438Q8450N9925
19364D27284P7776L6324J20538P7957j06584k51293j78593O7346J57779K9285
19354D57819J9267j9296R1697O0753J32119j18416R0355K8279j9327p2527O8124
19343G18847N2857q5275M8102m1896n1196o1203m0247n024o1187m5651P4806J55788
19331F58721J519p2301L7279o372l8551J0232O6100L7214k0378R3070r067q9880
19319F67586l2695L6436J96916N7777J4259n1890j4703j3482l6077k9674l4994
19308G59459L3934M33R6756J26769N9515j16453j98531O0989P3956n5861J59868
19297A000834m5839j29941l9980j19296k1227l415L1718Q9207J32460P6815p2699
$$ y = [210543, 252860, 435498, 338432, 248696, 208175, 286543, 404021, 286347, 278909, 367359, 427284, 505060, 541384, 661922, 739879, 633295, 382002, 203409, 270755, 428534, 457819, 477086, 457790, 549487, 610240, 742359, 623943, 714298, 742577, 723250, 650723, 718847, 771704, 686429, 734531, 692635, 641439, 580236, 539989, 534965, 473778, 428127, 502933, 658721, 660240, 587939, 625218, 618846, 580295, 590527, 656627, 693841, 673463, 766533, 757466, 667586, 634891, 671327, 868243, 926020, 940279, 888389, 873686, 860204, 824127, 794453, 759459, 793393, 793826, 890582, 1017351, 1076866, 960413, 761882, 822871, 896827, 840966, 1000834, 954995, 825054, 785074, 665778, 644551, 641136, 672854, 762061, 894521, 971336, 898637]
19286H98637m3669k0015o7553l1409O1811R3212J07381K7758l9270j6435Q6653
19275A057101R1691q9384k7158P4471J26711J42058L5296M853K07956K98567L78219
19264B300381J69202k170q2793j00661L1151Q6854P8477J38847K60451K78610
19254C158349K43426J32565J75457J93053k4565r5830J4251Q9430K03184K82418
19244D371738N32290O04065N14592M78410K85792R2328J21072K32978M21571O35336
19234H290172Q56002J120144J439497J698467K052310K312126K811696L891471
19226B4471885O297708J0546442J7141893K7648457M0290679M5251646L1081017
19219B02729727m529540l3655623k9198850j5210350k102474J1901722K8608694
$$ y = [898637, 854968, 834953, 767400, 735991, 797802, 891014, 998395, 1026153, 986883, 970448, 1057101, 1148792, 1059408, 1032250, 1106721, 1233432, 1375490, 1410786, 1415639, 1623595, 1922162, 2300381, 2469583, 2467413, 2384620, 2283959, 2315110, 2401964, 2480441, 2619288, 2879739, 3158349, 3401775, 3534340, 3709797, 3902850, 3878285, 3782455, 3796706, 3886136, 4089320, 4371738, 4904028, 5508093, 6022685, 6501095, 6786887, 6879215, 7000287, 7233265, 7654836, 8290172, 9146174, 10266318, 11705815, 13404282, 15456592, 17768718, 20580414, 24471885, 30769593, 41316035, 58457928, 86106385, 126397064, 171648710, 202729727, 198200187, 164544564, 135345714, 120135364, 118032890, 129934612, 158543306]
19212A58543306M6222839N5363002M8006045K1718099j345954j6230434m4553066
19205B67723837n5078407l9349066k2009596p147017P527583K2930559L3878522
19198B08476415K8758311J577179l7169369m6957107l4474254k3728426j6751495
19191G9731254j1868929q691918o604576n056973m074183l209451k805797k957051
19183C4462376l252809l217097k766287k369239j974739j615850j482082j372624
19175A6411649j413577j194893j051186j070623j055919r94411p30339o64153
19167H236548n39109l45455l19014k04073l24594l84637l96794l90589n67090
19158D765193m64648k15886k89660k50528j01574k37102K313j48647l08158l03699
$$ y = [158543306, 204766145, 260129147, 308135192, 329853291, 328507337, 312276903, 267723837, 212645430, 173296364, 151286768, 144139751, 151667334, 174597893, 208476415, 237234726, 238811905, 201642536, 154685429, 120211175, 96482749, 79731254, 67862325, 59170407, 52565831, 47508858, 43434675, 40225224, 37419427, 34462376, 31209567, 27992470, 25226183, 22856944, 20882205, 19266355, 17784273, 16411649, 14998072, 13803179, 12751993, 11681370, 10625451, 9631040, 8900701, 8236548, 7697439, 7351984, 7032970, 6828897, 6504303, 6119666, 5722872, 5332283, 4765193, 4300545, 4084659, 3794999, 3544471, 3442897, 3205795, 3208108, 3059461, 2751303, 2447604]
19148B447604l32369j65253l5409r7152q9631m5089k2069j4667j65315n7242n8670
19137A364738k7087m8091j4634j65729n1820m4121P2439j3517j89347p7511J7545
19126H22865Q0103K0005n7824r0633J10435J2766J0824O3806m6328o6529j9935
19115H39555q1294R327M8657o7440l8340r571M4797n6885p3902N9256J35402P5016
19103H84578o3959p6912j2915m0551M0815p6870l7681Q1162K1652k7916M5694
19092G37097M3232J7731q253o0127k2497N8892k6315Q4367J09375j741p0086K5405
19080H87080q6225m7576J1733O0533P172j4121j63796k7361L3785n5773r1026
19069E14425L1553r3145q2772j3296m9559M7135M2786p4676j00764j1580o6763
$$ y = [2447604, 2115235, 1949982, 1914573, 1817421, 1727790, 1682701, 1660632, 1645965, 1480650, 1423408, 1364738, 1337651, 1289560, 1274926, 1109197, 1057377, 1013256, 1085695, 1072178, 882831, 805320, 822865, 902968, 922973, 865149, 774516, 884951, 897717, 908541, 972347, 926019, 859490, 839555, 758261, 767588, 816245, 748805, 710465, 700894, 745691, 688806, 614904, 674160, 809562, 884578, 820619, 743707, 730792, 690241, 731056, 654186, 616505, 697667, 719319, 691403, 737097, 780329, 798060, 789807, 729680, 707183, 766075, 739760, 824127, 933502, 931761, 861675, 887080, 800855, 753279, 765012, 825545, 832717, 818596, 654800, 627439, 661224, 605451, 514425, 545978, 452833, 370061, 356765, 307206, 354341, 397127, 322451, 221687, 210107, 143344]
19058A43344k7696m4860Q0628P5858R8861M0230L6554J63434J13608j0649j54253
19047E15059K3449J00343q2511j10968j08250J9819J72722N7051l06m360J4261
19036E96309L5500M7239P1168L261q0948q9990j02033k7293m2449K1842r539L8504
19024D61571L434q5492k3624O2981J53572Q4568L33n6434P297O8266N7104q7471
19012F46105m7927j24189n9637p9022k9707L5683P9524J9195n8336n9986n9577
19001B62126r193L6145j7467j771o9829J8840P7601K600j5334L564J7307j2420
18989B92169m6087o5052O8123J23638M554m1850m5730M6745p2399l6785j31072
18978I6254R826R6705K2725n3114n2171J8462N5022n5338k0757J3969O6510N8647
$$ y = [143344, 115648, 70788, 151416, 227274, 326135, 366365, 402919, 566353, 679961, 669312, 515059, 538508, 638851, 556340, 445372, 337122, 356941, 529663, 586714, 586408, 582048, 596309, 631809, 679048, 750216, 753477, 672529, 582539, 480506, 453213, 410764, 432606, 423067, 461571, 465005, 379513, 355889, 418870, 572442, 657010, 657343, 600909, 608206, 676472, 733576, 646105, 598178, 473989, 414352, 335330, 305623, 341306, 420830, 440025, 381689, 321703, 262126, 252933, 289078, 271611, 269840, 200011, 218851, 296452, 299052, 283718, 287282, 304589, 292169, 246082, 181030, 249153, 372791, 377345, 335495, 289765, 336510, 264111, 227326, 96254, 106080, 202785, 225510, 172396, 120225, 138687, 193709, 138371, 117614, 131583, 198093, 256740]
18966B56740o3983q07J3005K6165M1134N242j12187j05329k8311l0872N6656p818
18954D9635O8658J25661Q647O3075l1422L4194k3596o0559L3962n0803n100J11881
18942C24233m1742j16929q1033K2658L4309L1161P0072M4116M4195Q6800p1950
18931C45890l6992m7869p0937j19802J6699M5028N266J06629O0529n7557L336
18920B50220q1997L2474J33344k2899j04198L0553m7971l9971K8249j3547M6261
18909B10518Q5483k4488P4830m4122n5925O2863R2339r5483j20828L7032M5101
18898B67320P9900r5292m9482k5425m6658J5898M1516m6058j02042J095M1740
18887H2512M8524J44792L4500J7917j74335l6295L013O1323O8654K7732j23576
$$ y = [256740, 192757, 191950, 204955, 231120, 272254, 277496, 165309, 59980, 31669, 797, 57453, 49635, 118293, 243954, 252601, 315676, 284254, 318448, 294852, 234293, 268255, 217452, 212352, 324233, 282491, 165562, 84529, 107187, 141496, 172657, 242729, 286845, 331040, 417840, 345890, 308898, 261029, 190092, 70290, 86989, 132017, 137283, 243912, 304441, 246884, 250220, 168223, 200697, 334041, 311142, 206944, 237497, 189526, 149555, 177804, 164257, 210518, 296001, 271513, 346343, 302221, 246296, 309159, 401498, 306015, 185187, 222219, 267320, 347220, 251928, 202446, 177021, 130363, 146261, 187777, 141719, 39677, 40772, 82512, 131036, 275828, 310328, 328245, 153910, 117615, 120628, 181951, 250605, 278337, 154761]
18876A54761L8686k7103l1651j5837o8375r2868m1070N8633J79675J17396p9232
18865A93015n3170o5090q5050k906k9565Q2315K0704n2614R255j5549o546M3068
18853C7867R6325N8945N1542n8251q0153m73m8400j9564K9419o1419p7149P4398
18841C087k8950m3965N3298J40199p8225j84048J21330J60896k3243m6320M7279
18830A21338m7946j456n362o0390Q1332M6671k8702k0020K2387J17236q1755j70958
18818b7625l0536J02830J19582M3478j69801L0727P8152k6820J7524M3592o1021
18807A20082j19362o7319O2256J65114n5721n6689n3671J0097k5914m9550L6855
18796c3822R1729p8098j42721P0252P1192R0140O89j2988R8146Q5652n3975m6586
$$ y = [154761, 193447, 166344, 134693, 118856, 50481, -42387, -83457, -24824, 154851, 272247, 193015, 139845, 74755, -10295, -13201, -42766, 39549, 60253, 7639, 16894, 1345, -5201, 37867, 134192, 193137, 244679, 186428, 106275, 105802, 57402, 37838, 67257, 5838, -71311, 3087, -25863, -69828, -16530, 123669, 45444, -138604, -17274, 143622, 120379, 74059, 121338, 73392, 71936, 66574, 6184, 87516, 134187, 105485, 85465, 107852, 225088, 143333, -27625, -58161, 44669, 164251, 207729, 37928, 68655, 146807, 119987, 137511, 181103, 120082, 720, -66599, -4343, 160771, 105050, 48361, -5310, 4787, -21127, -70677, -33822, 57907, -20191, -162912, -92660, -21468, 68672, 69361, 56373, 154519, 240171, 186196, 139610]
18784A39610J2734m71Q0027J4150l3093r5103j3413K5110J57621P2178n6495j43521
18772A59334o3029L1501j20107j08361J29139M3701j26714l1729J05246M0699
18762E9680M9247K4462J710k5311q4008m9445J13154R6880l0567n8515p5535J7923
18750C9675L8153o6320j16955j4494J23632O7262J23189P863k257l9486q737p7984
18738G3541l0216L5851L359J6868l8874j631K5875J8593j21567q528k3407j36239
18726a86375m2941J24198N3695O1963J3287P9056K571L5062l9673j6717J736k809
18714H3053P8924M0900q98J8408J00909J01706k3173r2478k3443M1027M7746K8832
18702D01513l8462j27023j43275J1595P0679O8163p3840l1902J06585l3287l4991
$$ y = [139610, 152344, 151873, 231900, 246050, 212957, 117854, 104441, 129551, 287172, 359350, 302855, 159334, 96305, 127806, 7699, -100662, 28477, 72178, -54536, -86265, 18981, 59680, 108927, 133389, 135099, 109788, 25780, -23665, 89489, 186369, 155802, 97287, 21752, 39675, 77828, 11508, -105447, -119941, 3691, 70953, 194142, 202005, 199748, 160262, 151525, 73541, 43325, 79176, 82535, 99403, 60529, 58898, 84773, 103366, -18201, -26729, -50136, -186375, -229316, -105118, -51423, 10540, 23827, 102883, 105454, 140516, 100843, 84126, 85862, 83053, 161977, 202877, 201979, 220387, 321296, 423002, 399829, 307351, 283908, 324935, 372681, 401513, 363051, 236028, 92753, 104348, 175027, 243190, 169350, 137448, 244033, 210746, 175755]
18691A75755k2684Q7719j184j39626m9500O5611K6612p6522K6072N2265O6944
18680B11462l9883r8100M8189K0387j13488L3921J13094J1113l2175M1681m0810
18669A55391j0399O4105J06062J81162J48559R3170K03839O5322J11065J50248
18659A268524J27663M4918j6366p7802o0719j50356J5793j00586N4249Q3411J09650
18648A298379O7878j2532k7822k6318k6433p3638j44483j17411j26610q9640o3283
18637F58087k7139L2160J0871p3311p3507j47835j7794L6927P9387o0861m7115
18626C69870L7014O436p2585n0440j7518O6552J07376p8612n1262K1007k4431
18615C13407j8085o6504l0981N66O1643K4603j02359q155L3950j40666n1140R3482
$$ y = [175755, 153071, 240790, 239606, 99980, 50480, 116091, 142703, 66181, 92253, 144518, 211462, 171579, 73479, 121668, 142055, 28567, 62488, 175582, 186695, 154520, 196201, 155391, 144992, 209097, 315159, 496321, 644880, 738050, 941889, 1007211, 1118276, 1268524, 1396187, 1441105, 1424739, 1346937, 1286218, 1135862, 1151655, 1051069, 1105318, 1188729, 1298379, 1366257, 1353725, 1325903, 1299585, 1273152, 1199514, 1055031, 937620, 811010, 721370, 658087, 630948, 663108, 673979, 600668, 527161, 379326, 361532, 398459, 477846, 416985, 369870, 406884, 413320, 340735, 290295, 272777, 339329, 446705, 368093, 316831, 337838, 313407, 295322, 228818, 197837, 198403, 260046, 284649, 182290, 174135, 208085, 67419, 16279, 109761]
18603A09761O8566k3077r449q0701J1757M7566J20206p4024l5524j4718l9539
18592H0824p521P1080J7210n4305O6612P4503L9754k9928j08228m4648M5314j43023
18580G644L1309M3148N1492k887k3045P6362K028l7909n3071M7945M5649O6694
18568B55359m207m4784O5534J17856k9419k8507j84600N3830O9236L7456N1131
18557C58885L972o4629J46267K04158K06547J67570N0097k6562j5000j30169o476
18546H94660K3113K7670J13818K40056K12660Q146j10862j27928n5371l5410j2970
18535A177582j70037m3287P6960L5577l4821K7409L0902r8418k08450j53762j06092
18524E33563j71572l2065m1500k2431p1881p7752J9730N3312M3724N3605O982
$$ y = [109761, 178327, 155250, 145801, 65100, 76857, 124423, 244629, 170605, 135081, 120363, 80824, 73303, 144383, 161593, 107288, 173900, 248403, 288157, 258229, 150001, 105353, 150667, 7644, 38953, 82101, 133593, 130706, 107661, 184023, 186051, 148142, 95071, 143016, 188665, 255359, 251152, 206368, 271902, 389758, 360339, 331832, 147232, 201062, 270298, 307754, 358885, 362857, 298228, 444495, 648653, 855200, 1022770, 1072867, 1046305, 1031305, 901136, 894660, 917773, 945443, 1059261, 1299317, 1511977, 1520123, 1409261, 1281333, 1225962, 1190552, 1177582, 1007545, 964258, 1041218, 1076795, 1041974, 1069383, 1100285, 1001867, 793417, 639655, 533563, 361991, 329926, 288426, 265995, 194114, 116362, 136092, 189404, 233128, 286733, 293715]
18513B93715p3048Q82j00909j00173J08597J7520l649L079j15201M7194J34772
18502B12779P9384p6315r2497l3476l9908J47289J53173r8955j04192k8735m991
18491A13556K4921Q8944j02209J2470J9828L3694M7799m0251j5774q5677j02294
18480d993m8084m2514J53393O4289n2403j10444L992M2862O3333P2238j16553
18469B5116l825J46849J12145j05235n4314l1926j56417j5725J18032J3217q016
18458C9901m0711K4032M2370J14935Q6639j46053K8120N964r4383m8662J176K9550
18446D2878P2217m66j07122k1516R5281K3090j6269l8821J5560n7190j958j77
18434E507n9558n5137J52879J0012m5838K4272J09911O4376O903m6354q3055l7972
$$ y = [293715, 220667, 221549, 120640, 20467, 129064, 146584, 142935, 146014, 30813, 78007, 212779, 292163, 215848, 123351, 89875, 49967, 197256, 350429, 251474, 147282, 118547, 113556, 138477, 227421, 125212, 137682, 157510, 191204, 239003, 198752, 182978, 97301, -4993, -53077, -95591, 57802, 122091, 69688, -40756, -36764, 6098, 69431, 141669, 25116, 21291, 168140, 280285, 175050, 120736, 88810, -67607, -83332, 34700, 47917, 39901, -810, 23222, 65592, 180527, 267166, 121113, 149233, 155197, 60814, 12152, 13328, 42878, 115095, 114629, 7507, -14009, 81272, 104362, 88093, 49272, 64832, 7642, 5684, 5507, -54051, -109188, 43691, 53703, 7865, 32137, 142048, 206424, 213327, 166973, 83918, 45946]
18422D5946N8757L3447O3062j1783M1006p8659M975l7361l9092M9422O9265L1752
18410B30737j51584j71782N129Q2669J11746J87554r0529p2523J00648R4642L8669
18399C65376m8444j08477n6112o9395p8604l9614o6882P5500K34122j02771j48090
18388d3391m1123K3809J00025N8931M5806K3582o9504K4194J14081j423j37528
18377I7459n6720L0451Q0333R6462j18056j07360P7985M1716j43605j37126l9027
18366a77488m6017J24607J12079N3719O9909p3031n9602J74887m6842q5333p1054
18355b4166J07023N8715N2228n440l3097j39210M809J81339p6737j3771M1834
18344A53527P0382J30811J7314j6610o9158m0361j17958o6176J09897J10355L6837
$$ y = [45946, 104703, 138150, 201212, 189429, 230435, 151776, 156751, 119390, 80298, 129720, 198985, 230737, 79153, -92629, -87500, -4831, 106915, 294469, 203940, 131417, 232065, 326707, 365376, 316932, 208455, 152343, 82948, 4344, -35270, -102152, -26652, 207470, 104699, -43391, -84514, -60705, 39320, 98251, 144057, 167639, 98135, 122329, 236410, 234987, 97459, 40739, 71190, 151523, 247985, 129929, 22569, 100554, 142270, -1335, -138461, -177488, -223505, -98898, 13181, 66900, 136809, 63778, 4176, 179063, 132221, 46888, -24166, 82857, 141572, 193800, 188360, 155263, 16053, 20862, 202201, 125464, 111693, 153527, 223909, 354720, 372034, 355424, 286266, 245905, 127947, 61771, 171668, 282023, 318860]
18333C18860L2021q6806k6730P6463k3635l4636j22658K4511L6149P597r4959
18322A06177j48632J04612R0966k3847O977J973L6161J8265M6293l9138o4495
18311A35312J4997K9664J4368j2566l087p763m1133j22506k0737P0444L2247M7697
18299A36937K044J19635j9611j11345n917p452k658J2890p4762J4087K8449j6094
18287G6203l6371j39837J6151J5459m9866M9025Q9308o715L504R718q1776P079
18275d8118M57j4179J8652j01590k0283q4360k8593L4144Q2691P0540j1983J38752
18263C6130q2999o9266o1328n341L9512L7330l2419M5337L5266k2821K8512P6642
18251B4555K2441K8037O0364O2460j16194l7735O9589N9773r3966L8906Q7523
$$ y = [318860, 350881, 264075, 237345, 313808, 290173, 255537, 132879, 157390, 193539, 201136, 106177, -42455, 62157, 153123, 129276, 136253, 138226, 174387, 192652, 238945, 199807, 135312, 150309, 179973, 194341, 181775, 178688, 170925, 129792, 7286, -13451, 56993, 89240, 136937, 138981, 258616, 239005, 127660, 121743, 114291, 111633, 124523, 49761, 63848, 92297, 76203, 39832, -100005, -83854, -68395, -118261, -69236, 20072, 13357, 16861, 26579, -55197, -48118, -47661, -61840, -43188, -144778, -165061, -249421, -278014, -243870, -161179, -90639, -102622, 36130, -46869, -116135, -177463, -182804, -143292, -105962, -138381, -93044, -57778, -80599, -52087, 24555, 46996, 75033, 135397, 197857, 81663, 43928, 113517, 173290, 79324, 118230, 205753]
18240B05753J2814J0658J69199P683J978j9593j67308p447J07531Q2598J16178
18229E20044J1549p8872q7215K9013P6110m0745o2376P2062l9331n3294O1044
18218D07989P6572M1776j77168k33530Q4874J41322O9836O8449M3470P1502m2068
18207E53024J3245K1863j26301m0075L1717K2030J4917J01993k1574m8690n6656
18196D65493L2929Q7925M3978Q2343m469j12473Q4061L4369j6130r04R5112l734
18184G88500k2730L1217R7815N1675J41924L03106L63379L48009J87911j72598
18174B118208j52116J3222K2441J35296J88310J57808n5212l62654k70451k61953
18164A532899j11636O6729m359q4369k65980m1513Q7121J2375O4100m4248K7843
$$ y = [205753, 218567, 229225, 398424, 406107, 408085, 388492, 221184, 213737, 321268, 403866, 520044, 531593, 452721, 365506, 394519, 470629, 429884, 367508, 439570, 400239, 346945, 407989, 484561, 526337, 349169, 115639, 200513, 341835, 411671, 480120, 523590, 595092, 553024, 566269, 588132, 461831, 421756, 453473, 475503, 490420, 592413, 570839, 522149, 465493, 498422, 586347, 630325, 712668, 708199, 595726, 679787, 714156, 698026, 697122, 792234, 788500, 765770, 796987, 894802, 946477, 1088401, 1391507, 1754886, 2102895, 2290806, 2118208, 1966092, 1979314, 2001755, 2137051, 2325361, 2483169, 2427957, 2065303, 1794852, 1532899, 1421263, 1487992, 1483633, 1399264, 1133284, 1091771, 1178892, 1191267, 1255367, 1211119, 1238962]
18153A238962m5900j5755p0263J16177J02217K11460J27685j3940o8237k6377
18143A556029N3938o4638j82791j25792O5830J36714J94666J27330N84R8275J15575
18132A975720K5458J44788J04892K25492L73937K34820L06637K02656J54594L38208
18122D087202J98274K24001K74448K44676K80509L33519N64047O15468O13294
18113G435438O73215P27790Q31446R89847J099963J368789J597276J908130K318540
18104A8950434K858987L781404N372010Q381078J3054648K0087125L0362354M1612945
18096A44460985M5637512L4000810O551866j2232488j863862J5598320K0319704
18089B52472847O090872k0714334l0463536j4276494P797506K5419673L0268008
$$ y = [1238962, 1193062, 1177307, 1107044, 1223221, 1325438, 1536898, 1664583, 1650643, 1582406, 1556029, 1609967, 1545329, 1362538, 1236746, 1302576, 1439290, 1633956, 1761286, 1761870, 1860145, 1975720, 2001178, 2145966, 2250858, 2476350, 2850287, 3085107, 3391744, 3594400, 3748994, 4087202, 4285476, 4509477, 4783925, 5028601, 5309110, 5642629, 6206676, 6822144, 7435438, 8108653, 8836443, 9667889, 10657736, 11757699, 13126488, 14723764, 16631894, 18950434, 21809421, 25590825, 30962835, 39343913, 52398561, 72485686, 102848040, 144460985, 190098497, 224099307, 230651173, 218418685, 216554823, 232153143, 252472847, 258563719, 237849385, 207385849, 193109355, 200906861, 226326534, 256594542]
18082B56594542J6523783j0237286j8913929k645452J2576204J0913693j0533809
18075B54277746m0294974m6648941l4962565k3936085j6855426j2213294r295291
18068G0071170p373165o126845m802187m043775l616354l527694l726011l456557
18060C3398582l149284k891465k614952k398925j924195j689987j458651j472432
18052A5798691j418789j233509j017481r08776o51926o92885p19592o91064n10114
18043G954555n25995m41132n31242m77687m14554n28575m80124m12314l55484
18034C787448k73557k08585j79428k32036k77542k59528k50000J0642M8998q5022
18024B081390j9404q0442l6367k2153j29506j20413p6919r2185K9603m7954j25670
$$ y = [256594542, 273118325, 262881039, 243967110, 241321658, 253897862, 264811555, 254277746, 213982772, 167333831, 132371266, 108435181, 91579755, 79366461, 70071170, 62698005, 56571160, 51768973, 47725198, 44108844, 40581150, 36855139, 33398582, 30249298, 27357833, 24742881, 22343956, 20419761, 18729774, 17271123, 15798691, 14379902, 13146393, 12128912, 11220136, 10568210, 9875325, 9155733, 8464669, 7954555, 7428560, 6987428, 6456186, 5978499, 5563945, 5035370, 4555246, 4142932, 3787448, 3513891, 3305306, 3125878, 2893842, 2616300, 2356772, 2106772, 2117414, 2166412, 2081390, 2061986, 1981544, 1945177, 1923024, 1793518, 1673105, 1596186, 1504001, 1533604, 1485650, 1359980]
18013A359980l7221p0098j18177j09333n9254R956q8582O9064J8720O6018L2081
18002A073154n9874j34624q2556k6968O5614J61250J14655r4779j70482k9610
17992H15780Q1944l2137j12960q9283n170o9867l396M9459q570l6769N2273j00092
17980E41212q0967Q4287J03412q499r7777o4626p0595j43821l2381J17692J09201
17969D57138P5215m9787j5642k5864M5243n7935l2991N6556Q4169K4445j7287
17958E43260m8302j7217P7647n051l6125n7341N6717R3695K9636j54308j50615
17947C31996m6935M1063O1975K7577k19210m4558R2321J1779R9770N1075j00960
17936C05893l5346Q9760j03148K3826J06799p4843j28653n806O3125J29662J03401
$$ y = [1359980, 1322759, 1252661, 1134484, 1025151, 965897, 975853, 887271, 956335, 975055, 1041073, 1073154, 1013280, 878656, 796100, 769132, 834746, 995996, 1110651, 1015872, 845390, 815780, 897724, 865587, 752627, 663344, 658174, 588307, 584911, 634370, 625800, 589031, 641304, 541212, 460245, 544532, 647944, 639445, 541668, 477042, 406447, 262626, 230245, 347937, 457138, 532353, 482566, 466924, 441060, 486303, 428368, 395377, 451933, 536102, 560547, 543260, 494958, 477741, 555388, 550337, 514212, 456871, 513588, 607283, 636919, 482611, 331996, 285061, 326124, 388099, 415676, 196466, 151908, 244229, 256008, 355778, 406853, 305893, 270547, 360307, 257159, 280985, 387784, 312941, 184288, 178482, 241607, 371269, 474670]
17925D74670N0560m1513j8568L2276J939L0937J38581J1493j7986n7078m9053
17914E56258o6973o9218l0148n5222J06417K2189j13997k9529R0697k0098L6213
17903D26589L593j25163m7481N2862J88717j857l7144L2203o0621m8776j7244
17892C65678L291J04008K1179O5508j2891j01508N3435P4252o3214j41574j08533
17881B59631O1991m0630j42360j22521J5691n3660L6971L0798N7962J5243J6954
17870A36070M6366M7432l8299r8567K164m6916O311R0223Q4086L1047j9893M2183
17858B82207R7460N0983n0658K6687l8930J06170p9961q9972j62345J4753l8422
17847A17972j2044q7806L0303O3439O5544P121l4589M7085N7162l548N9503J51948
$$ y = [474670, 525230, 483717, 465149, 497425, 499364, 530301, 668882, 680375, 662389, 605311, 556258, 489285, 420067, 389919, 334697, 441114, 463303, 349306, 319777, 410474, 390376, 426589, 430182, 305019, 257538, 310400, 499117, 497260, 460116, 492319, 431698, 382922, 365678, 368969, 472977, 494156, 559664, 546773, 445265, 498700, 572952, 509738, 368164, 259631, 321622, 280992, 138632, 16111, 31802, -21858, 15113, 45911, 103873, 119116, 136070, 182436, 229868, 191569, 93002, 95166, 48250, 54561, 144784, 228870, 259917, 240024, 282207, 379667, 430650, 379992, 406679, 367749, 473919, 393958, 303986, 141641, 156394, 117972, 105928, 18122, 48425, 111864, 177408, 184529, 149940, 197025, 254187, 250639, 310142, 462090]
17835D62090j22266k44162r8322J6779o505l0317r14N6176N0279J10663O0840
17824B54341L6629R6692R6389L641r372m4546n6272J0989j10699j30498j6580
17813A30714L9572l3767J29082j1774l9944j1730J8355K5150P2139N1794m6934
17802C22657J5417J5905J3296j11044n5515M583o9912K8385o941N2374O2809O488
17790B78502n4972n3446k491M8900n6866l26J3495J28457j0661j30540m468J6031
17778A71615L0872n4659r558j9759l253j22O5971P5400n3846m6509J4926J27065
17766B98143o2815O2123m7105N1598m1885J8077Q0586m4752l7984L6372p5114
17755B37244j18891j35305k800O6518Q8388j277n5254M1644K0305J1636Q9774
$$ y = [462090, 339824, 95662, -2660, 14119, 7614, -22703, -23617, 32559, 82838, 193501, 254341, 290970, 387662, 484051, 487692, 478320, 433774, 377502, 388491, 277792, 147294, 130714, 170286, 136519, 265601, 253827, 213883, 202153, 220508, 245658, 317797, 369591, 322657, 338074, 353979, 367275, 256231, 200716, 205299, 135387, 163772, 156831, 209205, 272014, 278502, 223530, 170084, 167593, 216493, 159627, 159301, 172796, 301253, 290592, 160052, 155584, 171615, 202487, 147828, 138270, 118511, 115258, 115136, 181107, 256507, 202661, 156152, 171078, 298143, 235328, 297451, 250346, 301944, 260059, 278136, 358722, 313970, 275986, 312358, 237244, 118353, -16952, -19752, 46766, 135154, 133877, 78623, 120267, 140572, 152208, 241982]
17744B41982Q2240j6599J4196k9831q7524m8086Q0965M6836o1950n7965j23677
17733D0587j04270J10649l6442q1940r1625J20401J17619o1405N1736P716r5339
17722b2313M6364M8515r295P7312q2133j30340O073J04152j1224l6710j6070k3002
17710d8671j03116N5577M1634O3346J8904o827J7633n9491M232M4672J01142k9604
17698I9431N4614l5000p2496J8011Q3155Q2079N6595k3420l9064J08189m3758
17687B88336M167K2395l7170j3872M6136M7110R454J07468j08432o8430J2294
17676C09456K0387p807q2782m5263m9273n8351q1133K5540O975l0320N4343J09214
17664A70986N9808j02061q7528m749m1102J3664k359J6990j1148O2880n5767k5099
$$ y = [241982, 324222, 307623, 321819, 291988, 204464, 156378, 237343, 284179, 222229, 164264, 40587, -63683, 46966, 10524, -71416, -163041, -42640, 74979, 13574, 65310, 73026, -22313, 24051, 72566, 63271, 140583, 58450, -71890, -65817, 38335, 27111, -9599, -25669, -48671, -151787, -96210, -54576, 8770, 27674, 20847, 38480, -21011, -16779, 27893, 129035, 99431, 154045, 119045, 46549, 64560, 147715, 229794, 286389, 262969, 223905, 332094, 288336, 292503, 314898, 277728, 263856, 309992, 357102, 366556, 474024, 365592, 297162, 309456, 329843, 322036, 239254, 193991, 144718, 86367, 5234, 30774, 37749, 7429, 61772, 170986, 230794, 128733, 41205, 36456, -4646, 9018, 6659, 23649, 12501, 75381, 19614, -5485]
17652e485R6323J0289p1578N217j1120l2541m1029k1374M4319n5735R7778Q3027
17640I8091L0344o8905k9083R8753K5701j34757m5968R8037R4362j30725j22956
17629h7106J0832L9813P540K231J06844o7314l3417r8988j3659M3647M0980m073
17617e2670L4325L7696M6319M0294j6926j22878L3332J25582K2445j407j24824
17606B1288K5829O883N6111L863O0677L9195k9835K7067j06628Q0715l3379j67217
17594a5431N6497m0123m1374m8340m5841R7959M2334k3710M3683J7111N8480L409
17582A04654l4378q7134J01170L8371l0953J6707Q4654K5248N6022q2244q0552
17571A11565o0650j7085N9730m1528J12591Q2859p395n0293n1096O360j17583
$$ y = [-5485, 90838, 101127, 29549, 34766, 23646, -8895, -49924, -71298, -26979, -82714, 15064, 98091, 128435, 59530, 30447, 129200, 154901, 20144, -25824, 72213, 166575, 35850, -87106, -76274, -36461, -28921, -26690, 80154, 12840, -20577, -119565, -133224, -89577, -48597, -52670, -18345, 19351, 65670, 105964, 89038, -33840, -508, 125074, 147519, 146112, 21288, 47117, 54000, 110111, 113974, 174651, 213846, 184011, 211078, 104450, 185165, 151786, -15431, 41066, 943, -40431, -88771, -134612, -36653, 5681, -18029, 25654, 42765, 101245, 104654, 70276, -16858, 84312, 122683, 91730, 108437, 193091, 218339, 274361, 192117, 111565, 50915, 33830, 93560, 52032, 164623, 247482, 240087, 189794, 138698, 145058, 27475]
17560B7475n2248k1550R8913m214j9366Q5269K98p765N2619J24648j46449j22679
17548A4951l3135O6414M037N5516J09193L1576j32719P3762m2855j06386L3811
17537G4165j1094K878K6091J00826P6309k3280j1719n8905N3633L0270O1196P2323
17525C92693J22409K01270J70192P1204M8502J34139L8225o9755Q8528K29208
17515A426615P8137j21716j18730j06823J14601l1857N4370K2060r3921p095P9744
17504A295385J40817j31478j38999q2186j76250j32869k5853j26778j01705N3687
17494E73771n2043K4136l921p581j42944j03347k6187N3204M6912k4712q5070
17483B52218o711m422J11477J72302k492j04527O0636r5999l7104P9653p0892
$$ y = [27475, -24773, -46323, 52590, 48376, 29010, 114279, 114577, 106812, 159431, 284079, 137630, 14951, -18184, 48230, 52267, 107783, 216976, 248552, 115833, 189595, 146740, 40354, 74165, 63071, 65949, 92040, 192866, 269175, 245895, 234176, 175271, 228904, 259174, 320370, 392693, 515102, 716372, 886564, 957768, 1006270, 1140409, 1178634, 1108879, 1197407, 1426615, 1504752, 1383036, 1264306, 1157483, 1272084, 1240227, 1294597, 1316657, 1222736, 1215641, 1295385, 1436202, 1304724, 1165725, 1083539, 907289, 774420, 748567, 621789, 520084, 573771, 521728, 545864, 541943, 534362, 391418, 288071, 261884, 315088, 362000, 337288, 252218, 245507, 241085, 352562, 524864, 522372, 417845, 478481, 382482, 345378, 425031, 354139]
17472C54139o6092M403j6106J04086Q9449o3171o2817m8448J2601o9916n7442
17461A80686j9440k6293j8097Q2730L6936j14113j03769j5459P2568m526j15676
17450d4453r1713K7131J18724m0219m1270l1345R5650m1027L4469J18090J12999
17439B17036k7736n9657n9767q0495r1304o2821k3007M2532J9942l5619P4804
17428h6092N8645j09372n3756N1598J66595N1864j18178N7057K8674m3228K0468
17417B4275O616K3442N5508o0507j2424J2910j0830q2970n9024J08840N7684M4214
17405A07734J0530j00142l2639R6353O678p5697q5506N0052N9893L3604K4079
17394I4939m6697k45662o961J65481J60183l0322k4573K0417M5966R600k273p3990
$$ y = [354139, 288047, 292450, 276344, 380430, 469879, 406708, 343891, 295443, 308044, 238128, 180686, 161246, 134953, 116856, 199586, 236522, 122409, 18640, 3181, 75749, 71223, -44453, -136166, -109035, 9689, -30530, -71800, -103145, -7495, -48522, -14053, 104037, 217036, 189300, 129643, 69876, -10619, -101923, -164744, -187751, -145219, -125277, -160896, -86092, -27447, -136819, -190575, -138977, 27618, 79482, -38696, 18361, 47035, 3807, 24275, 30891, 54333, 109841, 49334, 36910, 49820, 38990, -43980, -103004, 5836, 63520, 107734, 118264, 18122, -14517, 81836, 88514, 12817, -72689, -22637, 37256, 70860, 94939, 48242, -197420, -204381, -38900, 121283, 90961, 66388, 86805, 132771, 142371, 140098, 66108]
17382F6108o136N2582O941j4436o1740J9622Q5997K8301j09778j161L7316J2078
17370A15694l3285o6853l9638l7519K1801K1687j21732j42174P9782J44157J6023
17359d2057k8926l7180j06461l8627M7566P6398l2295l7639N6728J03543N3648
17348A4698q0523J3658Q5001K9843k6939l6171j19640O0119P0278K285J25698
17337A38307n6427q3136J04844Q6948r4188j32629l2988J64855P5259r4736r4475
17326a8366j6548L767q1760N2090O2241J13419j191n9486r9082j9339P6368M0314
17314E2427R5305J1822p9575j2398L8083L4072N6597K0420K7487q6314o9388J02468
17302A91006N6658p7913j04047J2065k7138N9803N4955m3172j05530r1146j1474
$$ y = [66108, 59972, 112554, 119495, 105059, 43319, 62941, 148938, 177239, 67461, 66300, 103616, 115694, 82409, 15556, -24082, -61601, -39800, -18113, -139845, -282019, -202237, -58080, -42057, -70983, -108163, -214624, -253251, -205685, -129287, -161582, -199221, -142493, -38950, 14698, -65825, -52167, 32834, 62677, 35738, -433, -120073, -59954, 10324, 12609, 138307, 81880, -1256, 103588, 190536, 96348, -36281, -69269, 95586, 170845, 76109, -18366, -34914, -31147, -112907, -60817, 1424, 114843, 113652, 54166, -44916, -64255, 12113, 52427, 147732, 159554, 79979, 67581, 105664, 139736, 196333, 216753, 244240, 157926, 88538, 191006, 247664, 169751, 65704, 77769, 50631, 110434, 165389, 122217, 16687, -74459, -85933]
17291h5933m1659o286k859M2331K2910R154N9729j4760l2094l345l1584j5274
17279i9670R169l8294K795J52334K8137n5274j4782J6941N8040m5140M0074j512
17267E2818n6439m5472P187q9199N198M3263M0400K1195l646K2651N5366M6876
17255A00198o345k7581K5460M4231k0674l6923q9366r2320n470J26711J6888J4138
17243D8947m0435L9141O6208r5656M6079j2697K4870J7209j5148j19335P541l5092
17231f8368Q25J28830L6955l755K3795k0667j29861j04978m0603P2672J53554
17220D8399K2580l477l4004m2822J2938Q231J328j0734M8564P931l4941m6742
17208b2749j00172n555J2252Q2461j420l9906P7756Q1921N9752J9400n5270j67990
$$ y = [-85933, -127592, -133878, -136737, -94406, -71496, -62342, -2613, -17373, -49467, -52812, -84396, -99670, -90501, -128795, -126000, 26334, 54471, -803, -15585, 1356, 59396, 14256, 54330, 52818, -3621, -49093, -41906, -131105, -125907, -82644, -42244, -21049, -24695, -2044, 53322, 100198, 93853, 66272, 91732, 135963, 115289, 78366, -11000, -103320, -108790, 17921, 34809, 48947, 8512, 47653, 113861, 18205, 64284, 51587, 76457, 93666, 78518, -40817, -33276, -68368, -67543, 61287, 98242, 94487, 118282, 97615, -32246, -137224, -177827, -105155, 48399, 70979, 67502, 33498, -9324, 3614, 11845, 13173, 2439, 51003, 58934, 23993, -22749, -122921, -128476, -116224, -33763, -35183, -75089, 2667, 84588, 144340, 163740, 108470, -59520]
17196e9520r0215L9586L8393l7684M1983K5285R5592R6411j19227k3168M5375
17185E2811j20916n9093J01128J08974L521k628j54719r1448j9537O0958L8974
17174h1975q3235O2670M4190K7518J5323K0288P7016M1751J0189R100K4343j67690
17162e12j42291Q6695R6154K6937j7456N872p2466n6042o0838K6763O2734K0702
17150b3748p5096J27302m699Q7561M1787m2256p8243O2453L6336j03663j2287
17139A5447k6475n8072n7892P9909Q688O179J61312J12028N2084j20138j43842
17128B9228K7997m3585l7175N0083J16833J3281j41599q1703m4763K9156K5731
17117e6516q3384m6489R4886n7428k3147N8793m2009q4606p1156K1118Q9693J60275
$$ y = [-59520, -149735, -110149, -71756, -109440, -67457, -42172, 53420, 149831, 30604, 7436, 52811, -68105, -127198, -26070, 82904, 86425, 83797, -70922, -162370, -181907, -120949, -81975, -165210, -102540, -58350, -30832, -15509, 4779, 81795, 123546, 133735, 142835, 167178, -512, -142803, -56108, 40046, 66983, 49527, 55399, -17067, -73109, -133947, -107184, -44450, -23748, -98844, 28458, 23759, 111320, 153107, 110851, 32608, 95061, 131397, 27734, 15447, -11028, -69100, -126992, -47083, -38395, -32216, 129096, 241124, 293208, 173070, 29228, 57225, 13640, -23535, 26548, 143381, 156662, 15063, -66640, -111403, -82247, -56516, -139900, -186389, -91503, -148931, -172078, -113285, -155294, -239900, -311056, -289938, -200245, -39970]
17105c9970O8575j1758o2133K3393m3886m0846J39281o120o8785m4320Q6153N9053
17093E8637Q0155M0804j33683j35023M6295o0865q991M7349N1083p5178o710M5309
17081e0818J35456p0297n5346j0147k6582N066L3979K00n2899p2320j4333L0728
17069a47313L773J2818O6541Q4562P2574J07402r824j44309n6799q156l7215O6391
17057A0445J08091q5164q5615l6653J8417R6675P0474j6344L0162q8738o598j4757
17045C95o8440O8478R125q1161l0312J7648l1636J2434P0345M9043L5959q441
17033D3437j9398l6756k3097q7488M3009K6104L5129Q8990k5205l3707P7779p8774
17021A0023M7972P138J41292K1386k4061p7240j10946n4106L5177J22438J8666
$$ y = [-39970, 28605, 16847, -45286, -21893, -65779, -106625, 32656, 26536, -42249, -86569, -416, 58637, 138792, 179596, 45913, -89110, -42815, -103680, -112671, -65322, -14239, -89417, -96127, -50818, 84638, 14341, -41005, -51152, -77734, -72668, -38689, -38489, -91388, -163708, -178041, -147313, -143540, -130722, -64181, 20381, 92955, 200357, 190533, 46224, -10575, -18731, -55946, 10445, 118536, 33372, -52243, -88896, -70479, 26196, 96670, 80326, 110488, 21750, 15152, 395, -68045, 433, 9558, -71603, -101915, -84267, -115903, -103469, -33124, 15919, 51878, 43437, 24039, -12717, -35814, -123302, -80293, -54189, -19060, 69930, 44725, 11018, 88797, 10023, 57995, 65133, 206425, 227811, 203750, 126510, 15564, -38542, -3365, 119073, 137739]
17010A37739l1335k1221J5680J1276j27170l086j8218j8916O1214K2393K8481
16999E6837L7962j03707k3636l4413N2805L5982J24105j07447r3108j01005J4142
16988a41483j7298J9653K8603K2432J83370K2877l0564j12073k4308j49249j05790
16977c03830M3270L5545J26880P9615O3434J0177j0857o8694J4769l0041o9645
16966a09377Q6412j1247o6278k9974k4817M761K4757p8075O7151Q3497j07866
16955a61056k2426K058k1692R201O8348L2730K4011Q3432N8936j5755r5738q2269
16943a20220J59275L4494o0618o1599p9704R297l2174p8101m0856O5854j7366
16932b21718J5940l3709m4651J37868P3505L3060j2381k1329o9105K191J39096
$$ y = [137739, 106404, 85183, 100863, 112139, -15031, -18117, -36335, -55251, 5963, 28356, 56837, 94799, -8908, -32544, -66957, -14152, 21830, 145935, 38488, -54620, -155625, -141483, -158781, -139128, -110525, -88093, 95277, 118154, 87590, -24483, -48791, -198040, -303830, -260560, -225015, -98135, -18520, 44914, 55091, 44234, -24460, -9691, -39732, -109377, -22965, -34212, -100490, -130464, -155281, -150520, -125763, -203838, -136687, -53190, -161056, -183482, -181424, -203116, -193915, -125567, -92837, -68826, 14606, 73542, 57787, -37951, -120220, 39055, 73549, 12931, -48668, -128372, -119075, -151249, -229350, -270206, -204352, -221718, -205778, -239487, -284138, -146270, -72765, -39705, -52086, -73415, -142520, -140329, -1233]
16921a233P6754m9741o4946L4738j6367n4251j03396L168l008R4576L5541o229
16909e4394k3818J7884J27557J3715J1043o4383j30278j23914P3232M4442K6352
16898h2562k5023K00765m4425n7454N0727o6477n7425k7567m3346l032j2332p3936
16886b42087J05775J76375l2164k5895N4544J3819K5473n8100q5342J3911l291
16875e6982j06184l6110L916K0498o4071j1843l719N5781M2858L0613l1498k6363
16863a83104O0392K3663k5511R5015p7904r0304j6666K4707m3129m1565L1672
16852b42734M8940L1617l8556p1681K0588N4010J33872M9147K9238n1964J17691
16841H0168m4777o3766r4108r7652L486M8754P4790M3262R8280P9283K1344j9268
$$ y = [-1233, 75521, 25780, -39166, -4428, -20795, -75046, -178442, -175274, -178282, -83706, -48165, -54394, -78212, -60328, 67229, 80944, 91987, 27604, -102674, -226588, -153356, -108914, -82562, -107585, 93180, 48755, -8699, 42028, -24449, -81874, -109441, -152787, -155819, -168151, -242087, -136312, 40063, 7899, -17996, 36548, 50367, 75840, 17740, -67602, -53691, -56982, -163166, -199276, -195360, -174862, -238933, -250776, -254495, -198714, -155856, -125243, -156741, -183104, -122712, -99049, -124560, -29545, -107449, -197753, -214419, -189712, -232841, -274406, -242734, -193794, -162177, -200733, -272414, -251826, -197816, -63944, -14797, 14441, -37523, 80168, 35391, -28375, -122483, -220135, -216649, -167895, -93105, -49843, 48437, 127720, 149064, 129796]
16829A29796P9265p4749r8699j55245m4649l2474K5590p9554Q2301J47553K9387
16818H522q0409j5937M6539J21411o504j0741M6700m4591L7982J7740j26287j37506
16806a43081j469j126j9477N8706Q8707J9961J8101o8345j9454n3208P3585N4295
16794G195l321K5504j27471l9286K5690l139j5740n8642L8595K7392P5109R932
16782c8182o5085k7910N4239N4742n8185o5338j02196m7129R0458O106M7485M1903
16770a09092J3970M4325n233J7767k3465j12884L2649Q8883N8157o00j52J605
16758E930k3982j1859n6433L3590q4128o0706J00358P9771o7750J7244K6190n8721
16746a00496J6098o7935O5100O5833J20159j4198m4948j08024k0313q602O598
$$ y = [129796, 209061, 134312, 35613, -119632, -164281, -196755, -171165, -250719, -168418, -20865, 8522, -71887, -87824, -41285, 80126, 73622, 62881, 109581, 64990, 102972, 120712, -5575, -143081, -144550, -145676, -165153, -106447, -17740, 2221, 20322, -48023, -67477, -120685, -47100, 7195, 3874, 29378, -98093, -137379, -111689, -114828, -130568, -189210, -150615, -123223, -48114, -38182, -103267, -131177, -76938, -22196, -80381, -145719, -247915, -295044, -204586, -198480, -150995, -109092, -95122, -50797, -56030, -38263, -61728, -174612, -141963, -53080, 5077, 4477, 4325, 5930, -18052, -29911, -86344, -52754, -136882, -197588, -97230, -17459, -85209, -67965, -41775, -100496, -84398, -152333, -87233, -21400, 98759, 84561, 39613, -68411, -88724, -97326, -90728]
16735i0728p1034l6751J3691L1471K294R1670P4358Q9898n4790l0953L2170K640
16723E3936p4665n7836r2349N9963L1289m1145R4720P5130j0428j02102j02365
16712a65852O811J85271P8028p2324r3581K5637m6002L1255J20786o297p900Q6246
16700A42078o3530k29605j02368N8811J80794j9522p0578l9439K1437N354O0268
16689e6300k1879R2427K295m4963J7842j6978j503m5197M9494O7622m831j09428
16677g1399j81522o2966J32320N6367J4356P2647O5366J40233O621m8214k088
16666A21721o0119r5213q3374j06439L9188O1350J04505q8022J4379L3085j11795
16655a70734j2734P5803J447n393N2973L026P5329J0792N3775L5784k5260j9468
$$ y = [-90728, -161762, -198513, -184822, -153351, -151057, -59387, 14971, 104869, 50079, 19126, 51296, 53936, -20729, -78565, -170914, -110951, -79662, -120807, -26087, 49043, 38615, -63487, -165852, -159041, 26230, 104258, 31934, -61647, -36010, -82012, -50757, 70029, 63732, 55832, 142078, 78548, -151057, -253425, -194614, -13820, -33342, -103920, -143359, -121922, -116568, -56300, -78179, 14248, 16543, -28420, -10578, -27556, -29059, -74256, -24762, 42860, 38029, -71399, -252921, -315887, -183567, -127200, -112844, -40197, 25169, 165402, 172023, 123809, 121721, 61602, -33611, -116985, -223424, -184236, -122886, -18381, -106403, -92024, -58939, -170734, -183468, -107665, -106218, -111611, -58638, -55612, 19717, 30509, 84284, 120068, 94808, 75340]
16643G5340N3577Q199q9640k8036q2923M7804O1021m6509o6368l8541n2630J9085
16631a39621J01358O9400K7714J65R30j18596q9761M0907J24883j0791j2746N0559
16619D4401J5873q866J7957q5946l3532P0923P6356Q9947o421n3302o9226n6135
16607B029j21211k7143J28282J7490Q424l8453L6706J2214L5575N5495n5360J8826
16595G2874j0645Q9140l2253k57479j08949Q2416J02092L9203o0872J5784K703
16584f5986R86m8746L0607J02541k0387M912q3991J8340L6954l0673m7602J5554
16572h7491K0329R9620J01389M0959j05104l2741N3430l9462p7397p7712m1231
16561a45411O0386O8964L3658M7507M4299R4539r1253j40034j44767J0084P2888
$$ y = [75340, 128917, 137116, 47476, 19440, -63483, -15679, 45342, -1167, -67535, -106076, -158706, -139621, -38263, 31137, 58851, 59016, 59946, -58650, -148411, -107504, 17379, 6588, -6158, 44401, 60274, 51408, 69365, -16581, -50113, 20810, 97166, 187113, 180692, 127390, 58164, 2029, -119182, -146325, -18043, -553, 7871, -30582, 6124, 18338, 53913, 109408, 54048, 72874, 62229, 151369, 119116, -138363, -247312, -164896, -62804, -23601, -84473, -68689, -65986, -65000, -113746, -83139, 19402, -985, 3927, -80064, -61724, -24770, -55443, -103045, -87491, -67162, 32458, 133847, 174806, 69702, 36961, 90391, 50929, -26468, -104180, -145411, -85025, -16061, 17597, 65104, 109403, 203942, 112689, -27345, -172112, -162028, -89140]
16550h9140K1119P1964L1906M106J82405O2178j10385Q404k6573j01183j9648
16539C5153N5802r4991q1008k2812N3839J3968l7413J7688K0536Q7635l6879J4508
16527B6026N2485M127P2638J7502p9929j08471o0537k0146o6446J65004P4143
16516G6396n3382L4309L9464m7308p2561j46385J3694L0423L4554K1409N4642
16505a4745K7154K9773n8029o5991J03314l9343n0731K5013J1905k3182q6670
16494a41532M1242P4574k7181J05739N178o2802r4642j1473J23355m5552j0136
16483d3230N5437P750j06833j26733J05756J4886j9650R308R0681K1911k0361
16472a1078q2828K1081J3587m1893J41780Q9053M0718n2383k7709r561K7221O450
$$ y = [-89140, -68021, 3943, 35849, 39955, 222360, 284538, 174153, 182557, 155984, 54801, 35153, 90955, -4036, -85044, -107856, -54017, -40049, -77462, -59774, -39238, 48397, 11518, 26026, 78511, 82638, 155276, 172778, 92849, -15622, -76159, -96305, -162751, 2253, 76396, 23014, 57323, 96787, 49479, -23082, -169467, -155773, -125350, -90796, -69387, -14745, 12409, 42182, -15847, -81838, 21476, -17867, -68598, -43585, -31680, -54862, -141532, -100290, -25716, -52897, 52842, 58020, -4782, -99424, -110897, 12458, -33094, -43230, 12207, 19957, -86876, -213609, -107853, -92967, -112617, -103309, -12628, 9283, -11078, -93906, -72825, -59238, -101131, 40649, 129702, 170420, 118037, 90328, 80767, 107988, 114438]
16460A14438p7247q3268j7283M5702J17086l8190q4277O2776Q5058L1401K3913
16449A80109p6927j45797j03031J0791M0160O4534j05202K6080J03505m9927j0033
16438f5738o7012j04400m3583L3780K0930J74016J13989M6929l6572J36142n9204
16427A49277p7165j6838j08194j2293j06193Q7044L111q092j2711J4745m4291
16416a31600O9537L5593L3953n7300q2356J05546l845M7888l8823O2900M3890
16405H5383k10404o4008M9745O4438P928L1822J6625P7405j4774p7978l0896K2466
16393d2248N9953n6177J7288l483l5497m3268j2513J35865O5297q4598l1067k983
16381c3431o3389J8467J04948J09494M4089M5972K3774j6856l3878k7711p4938
$$ y = [114438, 37191, -46077, -63360, -17658, 99428, 61238, -23039, 39737, 124795, 156196, 180109, 103182, -42615, -145646, -134855, -94695, -30161, -135363, -109283, -5778, -55705, -65738, -132750, -237150, -280733, -246953, -226023, -52007, 61982, 108911, 72339, 208481, 149277, 72112, 55274, -52920, -65213, -171406, -84362, -81251, -89343, -102054, -87309, -131600, -62063, -26470, 7483, -49817, -132173, -26627, -30472, 17416, -21407, 41493, 85383, -125021, -189029, -139284, -74846, -66918, -35096, -18471, 58934, 44160, -33818, -64714, -42248, 17705, -38472, -21184, -24667, -60164, -103432, -115945, 19920, 85217, 619, -30448, -33431, -96820, -78353, 26595, 136089, 180178, 226150, 249924, 233068, 199190, 171479, 96541]
16370I6541M3772k6480n0380o6944K8313L2535O1212l450n1145j25190r1054q3581
16358b35851p501l5043R7157J34263J06181j09717N5016r024l0953n8160l6599
16347a30231J10068M8224j292L2627Q0294m7668j35297o3884r117M6048O5500
16336d728n2988l2224j8437L1825O2886l3098n3789l6860j8116n6441M1996J20387
16324d9587j8155k7220n0227j077P4935R9642R0335p5281M7226O13L5009k382
16312A23831L0602k0157o266r1621k4066m7441j4071o7657n9327L0146l3969N5926
16300a24070N1000Q6509p4619j15348q4031o7513Q594k6411M8586N3690K9529
16289b14084j4164J33101L0290k6819p401L0532M2349M7398j3460j07530l8000
$$ y = [96541, 140313, 113833, 63453, -3491, 24822, 57357, 118569, 115119, 63974, -61216, -152270, -235851, -243352, -278395, -181238, -46975, 59206, -50511, 4505, -4519, -35472, -93632, -130231, -20163, 28061, 26769, 59396, 139690, 92022, -43275, -107159, -116276, -70228, -4728, -57716, -89940, -108377, -76552, -13666, -46764, -100553, -137413, -155529, -211970, -169974, -49587, -67742, -94962, -145189, -146266, -71331, 28311, 118646, 43365, 90591, 91204, 126213, 123831, 154433, 134276, 128010, 36389, 12323, -35118, -49189, -116846, -176173, -146027, -179996, -124070, -73070, 13439, -61180, -176528, -260559, -328072, -319478, -345889, -297303, -243613, -214084, -228248, -95147, -64857, -91676, -99077, -68545, -26196, 21202, 7742, -99788, -137788]
16278a37788J17495J84198n303j40451r2384M2557J33494M26j03406n4380o3971
16267a19513L4117J20467n5270l6608K1233n0113P0095k8339j6536O6154p5529
16256f9842j15707J1190J84382N7526m0324n4870n8642N5432P2705n7876m8424
16245f4450R0670M5038Q2472N5645N4374O667J0038j69933k51707j0045M0445
16234a10786n0344p8725Q8396m1681n1111Q1637J21463P5352M3824k1036j11676
16223e4687j1294Q0888K3090M6643j73330r4379N0937r811J53351R8718j43686
16212c3560j0387M1298N483J40227l5225m6264m3689P7795K4326j2589P9760j4655
16200A72520p1629m6338L3277l7726j14530o8796J8205M419k192O5938j1648m1203
$$ y = [-137788, -20293, 163905, 158602, 18151, -74233, -31676, 101818, 102244, -1162, -55542, -119513, -85396, 35071, -20199, -56807, -35574, -85687, -15592, -43931, -60467, 5687, -69842, -185549, -174359, 10023, 67549, 27225, -27645, -86287, -30855, 41850, -16026, -64450, 26220, 71258, 153730, 209375, 263749, 270416, 280454, 110521, -141186, -151231, -110786, -161130, -239855, -151459, -193140, -244251, -162614, -41151, 34201, 78025, 56989, -54687, -65981, 14907, 37997, 84640, -88690, -183069, -132132, -141943, 11408, 110126, -33560, -43947, -2649, 2834, 143061, 107836, 61572, 17883, 95678, 120004, 107415, 187175, 172520, 100891, 54553, 87830, 50104, -64426, -133222, -115017, -110598, -112790, -46852, -58500, -99703]
16188i9703p3672p6583J30540L4230J4481J4581R9548l6213n8316L212Q0880r6525
16176f3540k1098l5527Q3552r615l2788K3663L2467K3360P1903r615k5648o6417
16164b9303J8435j7158K2241j21418j03738J25052q470N1002K6957j0012O6665
16153B0253j48151j5290P9759o8161n8512o0562L2450K16163N9239n0465l4309
16142b7586K5503M7044r1979k4976k210K2743M8503k5317m0426P166n4640k1809
16130a37984k3297m5742j16586K5157J51102R0762j4768Q2781O1191q7913l123
16119a8420P863o7834o4516n2101M7260J4081K3416N9100Q3216n5548j06240J2755
16107a16968J81898K0630J3909J24931O4010p7463n7165j12340O407k6629o2320
$$ y = [-99703, -173375, -249958, -119418, -85188, -70707, -56126, 43422, 7209, -51107, -47895, 32985, -63540, -84638, -120165, -36613, -46228, -79016, -55353, -22886, 474, 72377, 62762, 37114, -29303, -10868, -28026, -5785, -127203, -230941, -105889, -114359, -63357, -36400, -46412, 20253, -127898, -143188, -63429, -131590, -190102, -250664, -218214, -2051, 57188, 6723, -27586, -2083, 44961, -47018, -71994, -74204, -51461, -2958, -28275, -68701, -61535, -116175, -137984, -161281, -207023, -323609, -298452, -147350, -56588, -71356, 11425, 72616, -15297, -18420, -10557, -78391, -142907, -195008, -147748, -133667, -110251, -51151, 32065, -23483, -129723, -116968, 64930, 85560, 99469, 224400, 288410, 210947, 153782, 41442, 47849, 21220, -41100]
16096d1100q9113M2651N797K7991k8285O3976O0342m9825J19668N4093j48639
16085A7556j33035J2769L2458J5668o4845m0675J47526k2764r5399l8038K7715
16074a41064J29296l514j17954j3388O1766N9057N0118P2861J9189L0373o4394
16063H2346j65873q524M2836K7885J4421m4388l2994J8628P3565M7369n9574o1384
16051f5687o8451j5283J13370Q8184P4886k7440p9375j46757M8414P4589j3627
16040a7177K7580p5488P419N937r9263l6200N5175L3752O2628L057j5155K7501
16028b0234K5070j41414o5681L3047O8231j7450R0463k5718l2039J18476J03399
16017A36150K9018j09172p9698j05543j9409m3873m7636L4415J1227R171L2880
$$ y = [-41100, -130213, -87562, -81765, -53774, -82059, -18083, 42259, -7566, 112102, 166195, 17556, -115479, -102710, -70252, -54584, -119429, -160104, -12578, -35342, -130741, -168779, -141064, -11768, -15282, -133236, -146624, -84858, -25801, 24317, 97178, 116367, 146740, 82346, -83527, -92051, -49215, -21330, -6909, -51297, -84291, -65663, 7902, 55271, -4303, -65687, -134138, -149421, -36051, 52133, 127019, 99579, 20204, -126553, -78139, -3550, -17177, 10403, -65085, -57666, -51729, -150992, -187192, -132017, -98265, -35637, -32580, -47735, -20234, 4836, -136578, -202259, -169212, -100981, -118431, -27968, -53686, -85725, 32751, 136150, 165168, 55996, -23702, -129245, -148654, -192527, -240163, -205748, -194521, -185350, -152470]
16006a52470L6570N8519L7645l6941Q5352J8497l4996m8504L4546M4311N7618
15995A00147l400k214N7933l3819j32909l5573L7970P9420m9751k5151j1394j15143
15983a33884q232L1195J7983q105j02506P1600l667o3962m8421l1366k9144K7573
15971b80936K1982O8739J33161L2532l0317j11859q7738P8693J6722M6106J39464
15960B6549L1399j9782O042J311j7634J4135n2696j13240n7987O0810m8828J6139
15948a53782p1960N5413K7980N2205j02409K8307Q5709o7016k1282J45481N6828
15937C5474k3818M9210J8544p8861j0334k8041K2176K4758L7758j0897n7622N5971
15925C4318J9834j7638m0136K3418P2705o8384r2396P853k6056J01112J5135j0144
$$ y = [-152470, -115900, -57381, -19736, -56677, 28675, 47172, 12176, -36328, -1782, 42529, 100147, 96747, 94533, 152466, 118647, -14262, -49835, -11865, 67555, 17804, -7347, -18741, -133884, -142116, -110921, -92938, -101043, -203549, -131949, -135616, -199578, -247999, -279365, -308509, -280936, -258954, -190215, -57054, -24522, -54839, -166698, -254436, -175743, -159021, -112915, 26549, 57948, 38166, 44208, 45519, 27885, 42020, -10676, -123916, -181903, -121093, -169921, -153782, -225742, -170329, -142349, -90144, -192553, -164246, -78537, -145553, -166835, -21354, 35474, 11656, 60866, 79410, 549, -9785, -37826, -15650, 9108, 46866, 35969, -21653, 34318, 54152, 36514, -3622, 19796, 92501, 24117, -68279, -60426, -86482, 14630, 29765, 19621]
15913A9621n6293j80670n3228N4205O8861r472q9923Q3841Q6515L2912k6230r8171
15901a68032K3947J5297O0553J25713K1031m0990j1352k6947J862j11677J03069
15890g526j3143M4559l758j0498Q8495o3262n6051O0969J25655j327m2251o6506
15878E5356l8862r3579M9759M5743n5118j9910p382N5436M6965K1099l7960j0988
15866A0559j21371o9438J42312J46164j8283j20083r6899K1200o3801J46340J07195
15855H3895l1896n3011J8141j23420L2319O3194K2829l1058k8256J23338J28658
15844B04733q6445j15131M3507R4174P5857l270r5251l1513J0106j50825q2217
15833a36275j1054J03878J5764r0379j06649Q5519N8327l8480J17666N9203l4434
$$ y = [19621, -36672, -217342, -270570, -216365, -147504, -156976, -246899, -163058, -76543, -43631, -69861, -168032, -144085, -128788, -68235, 57478, 78509, 37519, 26167, -780, 1082, -110595, -7526, -20669, 23890, 20132, 9634, 98129, 34867, -21184, 39785, 165440, 164113, 121862, 55356, 16494, -77085, -27326, 18417, -36701, -56611, -63993, -8557, 38408, 59507, 21547, 10559, -110812, -180250, -37938, 108226, 89943, -30140, -127039, -105839, -169640, -23300, 83895, 51999, -1012, 17129, -106291, -73972, -10778, 12051, -19007, -47263, 76075, 204733, 118288, 3157, 46664, 140838, 216695, 213425, 118174, 86661, 96767, -54058, -136275, -147329, -43451, -27687, -118066, -224715, -139196, -80869, -119349, -1683, 57520, 23086]
15822B3086j27920n804O7054o8999J0819M096J7650p3325J46415J5474j0338N1207
15810D9415K3113N8220K6413J9219p9558r1274m6626L7076j2062m1895O9020J14457
15798A25518R277j34269j4922n7694o4473P83R054j7050Q0976P4099l1847k7571
15786d8119L9875J4157O0809j4213L4594l5722L9225n7179j22908K3046K3457
15775d2978P9347k3485n273L5248K6912k9428q5812N0909Q6427m6113o5420l5440
15763e5106N1210N244k6531J6947k5927k7116l7336M985J19406K756r6295J5989
15751e1774P7160L4484j00391K5556j8653j7505k7975M6705O3822n3679q1286
15740a03536M8826N0379K5716L2746j14366M7774L3740q4078K489o9406O6223
$$ y = [23086, -104834, -110638, -43584, -112583, -101764, -97668, -80018, -153343, -6928, 8546, -1792, 49415, 72528, 130748, 157161, 176380, 96822, 5548, -41078, -4002, -16064, -57959, 11061, 125518, 134795, 526, -14396, -72090, -136563, -135780, -126726, -143776, -62800, 11299, -20548, -48119, -8244, 5913, 66722, 52509, 87103, 51381, 90606, 33427, -89481, -66435, -42978, 36369, 12884, 7611, 42859, 69771, 40343, -45469, 5440, 91867, 45754, -19666, -55106, -3896, 1348, -25183, -8236, -34163, -61279, -98615, -93630, 25776, 28532, -67763, -51774, 25386, 59870, -40521, -14965, -33618, -51123, -79098, -32393, 31429, -22250, -103536, -54710, -4331, 21385, 54131, -60235, -12461, 21279, -62799, -60310, -129716, -63493]
15729f3493J0580K2996N3229J59774P5875j35796q3025M6125m6357n6002j00700
15718a16794P8967N9323p3953j03319O5263K7710o7324N3864K3594l0102Q4757
15707A986K2382q2603m0392N9451J42822r4530j46854k8363M7924n4490n021o9711
15695b47399k2294O7362J04417j11600O856j3310N43J24282P6605j08825O3492
15684e9871O86l0167L7417k7793k7655K8800R44m2154r6733O966M6921J01463
15672f1176M6962L9267J07254j1632o0862O0968M305N910j94519l5892J8876R6566
15660A6027O8297j4677k9449j43161k9313L3948J04566J55386P2442p8593p9576
15649G5897o9891r6650r85J35521P7874L6345k5955q695r0728j10827l5579O8398
$$ y = [-63493, -52913, -29917, 23312, 183086, 258961, 123165, 40140, 86265, 39908, -16094, -116794, -37827, 21496, -52457, -155776, -90513, -62803, -130127, -76263, -52669, -82771, 1986, 24368, -58235, -98627, -39176, 103646, 9116, -137738, -166101, -118177, -172667, -177688, -247399, -269693, -202331, -97914, -209514, -202658, -215968, -215425, -91143, -14538, -123363, -59871, -59185, -89352, -51935, -79728, -107383, -78583, -77639, -119793, -216526, -209560, -162639, -61176, -14214, 25053, 132307, 120675, 59813, 120781, 125086, 130996, -63523, -99415, -80539, 16027, 84324, 69647, 40198, -102963, -132276, -98328, 6238, 161624, 234066, 155473, 75897, 6006, -90644, -91629, 43892, 121766, 158111, 132156, 123461, 32733, -78094, -113673, -45275]
15637d5275K7307K3502n5735m7049m7150J8339J8470M3848J28264J70327M12k49334
15625a4074O5499r2442j16459M3996N2014J5484J21229L2162n1015l6239J8110
15614C8265O2769O1118j23926l2625j13555Q441Q5577J6011r5437o8758k3818
15603a85938K0148p2084k5382J27957j2936k0239J5772r8401J13599P3744J80872
15592A17112R2372j54327j25881p3559O6807R5899M7617M8015J5662l3477p9124
15581A7116j29771p0637Q7133n0257j1141P9600q431M5507P857O0532O2267M3153
15569A32928q7351j2234Q420j0252L1732J31580M996K1313j42636j28673k8708
15558g8885l4722j6762O2145L594J73619o5349j69623M9239R6549l1169r012P0668
$$ y = [-45275, -17968, 5534, -50201, -97250, -144400, -126061, -107591, -63743, 64521, 234848, 235260, -14074, 51425, -41017, -157476, -113480, -61466, -45982, 75247, 107409, 56394, 20155, 38265, 101034, 162152, 38226, 5601, -107954, -99513, -13936, 2075, -93362, -162120, -185938, -165790, -237874, -263256, -135299, -148235, -168474, -152702, -251103, -137504, -63760, 117112, 209484, 55157, -70724, -144283, -77476, 18423, 66040, 114055, 129717, 96240, 17116, -112655, -183292, -96159, -146416, -157557, -77957, -86388, -40881, -33024, 27508, 89775, 132928, 45577, 33343, 41763, 31511, 63243, 194823, 199819, 221132, 78496, -50177, -78885, -113607, -130369, -68224, -64630, 108989, 43640, -125983, -76744, 19805, -11364, -20376, 50292]
15546E0292J7334o6458l2796L65L160r208K1049N2780K7619k8747j45680Q2146
15534b8144J62432l7063p3585N1491l395K929O5063l532o8981n5703l3591Q6687
15522F4608R4539p127j44864j30427m9781N6774N205j4207n1837l6757N9606K09656
15510E5388J60884p9791j02991R9220J61987L713n4329j49462j59456p1075P1664
15499f4248M7583N2215k0533L398Q4406n1041j43231p0807J73966J10947p7051
15488D5604k5816l1976m8227N6693p976L5920r5144k0117l6706j6519J5862p7047
15476b05449J26726n303o5639j3062l514M508N5965J59639o7337P125O6373K3852
15464H3884k3013q2227k0641J3236R7191J7375r1270m8944n7139j2954L6568O7877
$$ y = [50292, 67626, 1168, -31628, -31263, -28103, -37311, -16262, 36518, 64137, 35390, -110290, -28144, 134288, 97225, 23640, 75131, 71736, 74665, 139728, 136196, 67215, 11512, -22079, 64608, 159147, 152020, 7156, -123271, -173052, -116278, -111073, -125280, -177117, -213874, -154268, 55388, 216272, 136481, 33490, 132710, 294697, 298410, 244081, 94619, -64837, -135912, -64248, -16665, 35550, 15017, 18415, 102821, 51780, -91451, -162258, 11708, 122655, 45604, 19788, -12188, -60415, -3722, -11698, 24222, -70922, -91039, -127745, -144264, -128402, -205449, -78723, -84026, -149665, -162727, -166241, -161733, -105768, 53871, -13466, -6341, 60032, 83884, 60871, -21356, -41997, -28761, 68430, 85805, -5465, -54409, -111548, -124502, -87934, -20057]
15452b0057m8574n2825j3596Q9712l3457Q9091k5656j31746n7513O6819O8120
15441f9682L9676L6865p055J33241N7452n7191R741Q4592l4346o1733j9762j48843
15429c7045j42404J258Q5889M5100L9403J6763j9320L2492P5218o4353n8622r3234
15417a18855M6494m1228L5758R5551O4213q5849M7540m2093N0720N3834n3958
15406E2127M2809m329k3957r4623J1567q7694L8784k5881L7544N8657n4424J52572
15394A03152R5099L2018j22254j04704Q0130O0505N5027l0633m4078j5231o444
15383A02587j1596j9201M9840P747M6419j23426j23431o4267p9253j20579M4388
15372b90772j14310P323J37876J93824j3497J6673N2119m8616P0988O2614k8330
$$ y = [-20057, -68631, -121456, -135052, -45340, -78797, 10294, -15362, -147108, -204621, -137802, -69682, -30006, 6859, -196, 133045, 190497, 133306, 143047, 227639, 193293, 131560, 111798, -37045, -179449, -178191, -92302, -47202, -7799, 8964, -10356, 22136, 97354, 33001, -25621, -118855, -72361, -113589, -77831, 17720, 81933, -3916, 43624, 1531, 52251, 106085, 52127, 94936, 90607, 66650, -27973, -16406, -104100, -65316, -91197, -53653, 5004, -49420, 103152, 198251, 230269, 108015, 3311, 83441, 143946, 198973, 168340, 124262, 109031, 102587, 90991, 71790, 121630, 129377, 175796, 52370, -71061, -135328, -214581, -335160, -290772, -405082, -397759, -259883, -66059, -79556, -62883, -10764, -59380, 11608, 74222, 45892]
15361D5892m3620Q124k6287L7025J14074k7970o8288k8919o4294p9294N2203N4117
15349b7237n6687J9597L5391o5514K1209M5721J57584J32275j92403j21000l6749
15338h7813K4611P5782P0590r2490j03790J12955R4618p6971L619j01934j59151
15327b39974J9746J23131N0630J0079l39J01718R3674j27351j9080r3821j5046
15316i6633M5454k6746J00554J21218J8099m1992j12736k3985M2592K4661n510
15305D4976j05105o0632n4975N9801N7611l4172P402J9878l5928o9160K6626L9091
15293a04587n2540L5557Q9837P7894n9203J7349k0792J24689M3339j5816j24072
$$ y = [45892, 2272, 10396, -15891, 21134, 135208, 107238, 38950, 10031, -54263, -133557, -81354, -27237, -83924, -64327, -28936, -94450, -73241, -27520, 130064, 262339, 69936, -51064, -87813, -63202, 12580, 83170, -9320, -113110, -155, 94463, 17492, 21111, -80823, -239974, -220228, -97097, -46467, -36388, -36727, 64991, 158665, 31314, 12234, -81587, -96633, -51179, -77925, 22629, 143847, 161946, 119954, 7218, -16767, 25825, 50486, 44976, -60129, -120761, -175736, -115935, -58324, -92496, -85094, -65216, -101144, -170304, -143678, -104587, -157127, -121570, -31733, 46161, -13042, 4307, -16485, 108204, 151543, 135727, 11655]
$$ [...]
##END NTUPLES=NMR SPECTRUM
##END=
