##TITLE=Analysis number 316217
Compound Code mo 00450
Project Code adrs
Chemist Name fudan
##JCAMPDX= 6.0         $$ Bruker NMR JCAMP-DX V2.0
##DATA TYPE= NMR SPECTRUM
##DATA CLASS= NTUPLES
##ORIGIN= Bruker BioSpin GmbH
##OWNER= nmr
$$ XWIN-NMR		Version 3.5
$$ Thu Jan  5 12:53:19 2006 GMT Standard Time (UT+0h)  MAYBRIDGE\nmr@NMR_250MHZ
##.OBSERVE FREQUENCY= 250.131544655141
##.OBSERVE NUCLEUS= ^1H
##.ACQUISITION MODE= SIMULTANEOUS (DQD)
##.ACQUISITION SCHEME= undefined
##.AVERAGES= 16
##.DIGITISER RES= 18
##SPECTROMETER/DATA SYSTEM= dpx250
##.PULSE SEQUENCE= zg30
##.SOLVENT NAME= CDCl3
##.SHIFT REFERENCE= (INTERNAL, CDCl3, 0, 16.4349)
##AUDIT TRAIL= $$ (NUMBER, WHEN, WHO, WHERE, WHAT)
$$ ##TITLE= Audit trail, XWIN-NMR		Version 3.5
$$ ##JCAMPDX= 5.01
$$ ##ORIGIN= Bruker BioSpin GmbH
$$ ##OWNER= nmr
$$ C:\u/data/dgb/nmr/ADRS/14230/pdata/1/auditp.txt
$$ ##AUDIT TRAIL=  $$ (NUMBER, WHEN, WHO, WHERE, WHAT)
(   1,<2006-01-05 12:52:37.95 +000>,<MAYBRIDGE\nmr>,<NMR_250MHZ>,
      <created by zg, POWCHK disabled, PULCHK disabled
       configuration hash MD5:
       62 19 C7 07 E1 42 D1 B7 37 6C 3D D0 77 39 F9 E6
       data hash MD5: 64K
       48 14 CE D8 F0 7D E3 A0 C2 F9 C4 53 3E E4 94 2F>)
(   2,<2006-01-05 12:52:56.52 +000>,<MAYBRIDGE\nmr>,<NMR_250MHZ>,
      <Start of raw data processing
       ef LB = 0.3 FT_mod = 6 PKNL = 1 SI = 32K 
       data hash MD5: 32K
       5E E3 A4 D7 0D 60 0C 69 15 4A 09 C3 5D 0D 9D B5>)
(   3,<2006-01-05 12:53:03.34 +000>,<MAYBRIDGE\nmr>,<NMR_250MHZ>,
      <apk 
       data hash MD5: 32K
       5F F0 1A D6 F7 44 2B ED 88 6D 79 0B 24 13 B4 1F>)
(   4,<2006-01-05 12:53:04.85 +000>,<MAYBRIDGE\nmr>,<NMR_250MHZ>,
      <abs ABSG = 5 
       data hash MD5: 32K
       59 BE 57 17 40 0F 20 BD 83 DD 65 26 9F F1 A3 2F>)
$$ ##END=
$$ 
$$ hash MD5
$$ 55 8A 36 11 B1 0E 96 61 79 D9 A7 E6 88 93 CA B4
##$RELAX= 
##$RELAX= 
##$RELAX= 
##$RELAX= 
##$RELAX= 
##$RELAX= 
##$RELAX= 
$$ Bruker specific parameters
$$ --------------------------
##$DU= <C:\u>
##$EXPNO= 14230
##$NAME= <ADRS>
##$PROCNO= 1
##$TYPE= <nmr>
##$USER= <dgb>
##$AMP= (0..31)
100 100 100 100 100 100 100 100 100 100 100 100 100 100 100 100 100 100 
100 100 100 100 100 100 100 100 100 100 100 100 100 100 
##$AQSEQ= 0
##$AQ_mod= 3
##$AUNM= <au_zg>
##$AUTOPOS= <42 >
##$BF1= 250.13
##$BF2= 250.13
##$BF3= 250.13
##$BF4= 250.13
##$BF5= 500.13
##$BF6= 500.13
##$BF7= 500.13
##$BF8= 500.13
##$BYTORDA= 1
##$CFDGTYP= 0
##$CFRGTYP= 5
##$CHEMSTR= <none>
##$CNST= (0..31)
1 1 145 1 1 1 1 1 1 1 1 1 1 1 1 1 1 1 1 1 1 1 1 1 1 1 1 1 1 1 1 1 
##$CPDPRG= <>
##$CPDPRG1= <>
##$CPDPRG2= <>
##$CPDPRG3= <>
##$CPDPRG4= <mlev>
##$CPDPRG5= <mlev>
##$CPDPRG6= <mlev>
##$CPDPRG7= <mlev>
##$CPDPRG8= <mlev>
##$CPDPRGB= <>
##$CPDPRGT= <>
##$D= (0..31)
0 1 0 0 0 0 0 0 0 0.06 0 0 0 0 0 0 0.0002 0 0 0 0 0 0 0 0 0 0 0 0 0 0 
0 
##$DATE= 1136465556
##$DBL= (0..7)
120 120 120 120 120 120 120 120 
##$DBP= (0..7)
150 150 150 150 150 150 150 150 
##$DBP07= 0
##$DBPNAM0= <>
##$DBPNAM1= <>
##$DBPNAM2= <>
$$ [...]
##$SUBNAM7= <"">
##$SUBNAM8= <"">
##$SUBNAM9= <"">
##$SW= 20.6930455092707
##$SWIBOX= (0..15)
0 0 3 0 0 0 0 0 0 0 0 0 0 0 0 0 
##$SW_h= 5175.983436853
##$TD= 65536
##$TD0= 1
##$TE= 294.16
##$TE2= 300
##$TE3= 300
##$TEG= 300
##$TL= (0..7)
0 120 120 120 120 120 120 120 
##$TP= (0..7)
150 150 150 150 150 150 150 150 
##$TP07= 0
##$TPNAME0= <>
##$TPNAME1= <>
##$TPNAME2= <>
##$TPNAME3= <>
##$TPNAME4= <>
##$TPNAME5= <>
##$TPNAME6= <>
##$TPNAME7= <>
##$TPOAL= (0..7)
0.5 0.5 0.5 0.5 0.5 0.5 0.5 0.5 
##$TPOFFS= (0..7)
0 0 0 0 0 0 0 0 
##$TUNHIN= 0
##$TUNHOUT= 0
##$TUNXOUT= 0
##$USERA1= <user>
##$USERA2= <user>
##$USERA3= <user>
##$USERA4= <user>
##$USERA5= <user>
##$V9= 5
##$VALIST= <valist>
##$VCLIST= <CCCCCCCCCCCCCCC>
##$VD= 0
##$VDLIST= <DDDDDDDDDDDDDDD>
##$VPLIST= <PPPPPPPPPPPPPPP>
##$VTLIST= <TTTTTTTTTTTTTTT>
##$WBST= 1024
##$WBSW= 4
##$XGAIN= (0..3)
0 0 0 0 
##$XL= 0
##$YL= 0
##$YMAX_a= 563775
##$YMIN_a= -595501
##$ZGOPTNS= <>
##$ZL1= 120
##$ZL2= 120
##$ZL3= 120
##$ZL4= 120
##$ABSF1= 16.4349
##$ABSF2= -4.25827
##$ABSG= 5
##$ABSL= 3
##$ALPHA= 0
##$AQORDER= 0
##$ASSFAC= 0
##$ASSFACI= 0
##$ASSFACX= 0
##$ASSWID= 0
##$AUNMP= <proc_1d>
##$AZFE= 0.1
##$AZFW= 0.1
##$BCFW= 0
##$BC_mod= 0
##$BYTORDP= 0
##$COROFFS= 0
##$CY= 12.5
##$DATMOD= 1
##$DC= 0
##$DFILT= <>
##$DTYPP= 0
##$F1P= 14.0000005364418
##$F2P= -0.99999901652339
##$FCOR= 0.5
##$FTSIZE= 32768
##$FT_mod= 6
##$GAMMA= 0
##$GB= 0
##$INTBC= 1
##$INTSCL= 1
##$ISEN= 128
##$LB= 0.3
##$LEV0= 0
##$LPBIN= 0
##$MAXI= 10000
##$MC2= 0
##$MEAN= 0
##$ME_mod= 0
##$MI= 0
##$NCOEF= 0
##$NC_proc= -4
##$NLEV= 6
##$NOISF1= 0
##$NOISF2= 0
##$NSP= 0
##$NTH_PI= 0
##$NZP= 0
##$OFFSET= 16.4349
##$PC= 1
##$PHC0= 71.14575
##$PHC1= 38.0246
##$PH_mod= 1
##$PKNL= yes
##$PPARMOD= 0
##$PSCAL= 4
##$PSIGN= 0
##$REVERSE= no
##$SF= 250.130021783811
##$SI= 32768
##$SIGF1= 0
##$SIGF2= 0
##$SINO= 400
##$SIOLD= 32768
##$SREGLST= <1H.CDCl3>
##$SSB= 0
##$STSI= 32768
##$STSR= 0
##$SW_p= 5175.98343685301
##$SYMM= 0
##$S_DEV= 0
##$TDeff= 65536
##$TDoff= 0
##$TI= <Analysis number 999999
Compound Code 99
Book Reference 9
Project Code 9>
##$TILT= no
##$TM1= 0
##$TM2= 0
##$TOPLEV= 0
##$USERP1= <user>
##$USERP2= <user>
##$USERP3= <user>
##$USERP4= <user>
##$USERP5= <user>
##$WDW= 1
##$XDIM= 32768
##$YMAX_p= 396885295
##$YMIN_p= -107884
$$ End of Bruker specific parameters
$$ ---------------------------------
##NTUPLES= NMR SPECTRUM
##VAR_NAME=  FREQUENCY,     SPECTRUM/REAL,   SPECTRUM/IMAG
##SYMBOL=    X,             R,               I
##VAR_TYPE=  INDEPENDENT,   DEPENDENT,       DEPENDENT
##VAR_FORM=  AFFN,          ASDF,            ASDF
##VAR_DIM=   32768,         32768,           32768
##UNITS=     HZ,            ARBITRARY UNITS, ARBITRARY UNITS
##FACTOR=    0.157963299565203, 1,           1
##FIRST=     4110.86196600503, 0,            0
##LAST=      -1065.12147084798, 0,           0
##MIN=       -1065.12147084798, -107884,     0
##MAX=       4110.86196600503, 396885295,    0
$$ Real data points
##PAGE= N=1
##DATA TABLE= (X++(R..R)), XYDATA
$$ [...]
24576a7237K5103J1911p137j4345j9245K081J4137N551O670N005k3859M616K17
24563f532P929J7937R700K983n857j186J0344Q085j1078J647J0171P205j8187
24550C3161q663l278j0374q532j4522k4660M257L5969l970n667J7448j718p265
24537B186k7159l874j406P266J2775K7362L1140k0712j6405j3792n376K090k013
24524g918j4233l158r487K621L7782J5695k2127k4260N5204J4069k1770j3042
24512I376r879L666j4402J5242L7178j8416J6495k5777j8567J8767q09j675M66
24499A1665R4j3619q436j12j5448j1594L421k8126m814K0589J3096K0126L632
24486i526k878k488m96p675J9514J2036J7724L09j0297J1071J6722k9260l8123
$$ y = [-17237, 7866, 19777, 12640, -1705, -20950, -18869, -4732, 819, 7489, 12494, -11365, -6749, -6532, 1397, 19334, 29034, 32017, 26160, 24974, 35318, 43403, 32325, 33972, 44143, 51348, 33161, 24498, 21220, 10846, 2314, -12208, -36868, -32611, 3358, -612, -6279, 11169, 9451, 2186, -24973, -28847, -30253, -22987, -10212, 17150, 48290, 27578, 11173, -2619, -7995, -5905, -7918, -22151, -25309, -34796, -32175, 5607, 21302, -825, -25085, 30119, 44188, 22418, 9376, -503, 3163, -11239, 4003, 41181, 22765, 39260, 13483, -5084, 13683, 12874, 11199, 11665, 11759, -1860, -10296, -10408, -25856, -37450, -34029, -62155, -66969, -46380, -33284, -13158, -9526, -12404, -14892, -15388, -23063, -3549, 8487, 26211, 26520, 16223, 27294, 44016, 14756, -23367]
24473b3367j335j19O53j5644j0771R927L081J5624j364l43R20o250j9819K6434
24459b2373K2677k11L0751l468k6955Q329J6629n117o892q286L31l870L494P264
24445A2303M842j072J3086n69j4465J557m282m924J8089R501p472j9866k4408
24432a7680j4136r589J239J4274j2228J8970Q959L04j0408K0459M4242o322j5101
24419B2983k1791j4128p549n553J0396m977K3363N925J379p596j0356p509J826
24406a3587K965o006J7561K8813K903o736r390o899k093j4500J7447K0690Q869
24393D0037j9365N299J3540j9332m867O203l3653l0654K091M678J6618K2280o486
24380c611q280J0568L487m998k0889J726j0520n10K9681L1456J4531j9515l4293
$$ y = [-23367, -24702, -24821, -24168, -39812, -50583, -40656, -37575, -21951, -23315, -23658, -22738, -28988, -48807, -22373, 304, 93, 30844, 27376, 421, 8750, 25379, 20262, 13370, 5084, 5415, 1545, 5039, 12303, 17145, 16073, 29159, 28590, 14125, 15682, 11400, 6476, 24565, 34066, 26594, 6728, -17680, -31816, -41405, -40166, -25892, -38120, -19150, -10191, -9887, -20295, 164, 44406, 38084, 22983, 1192, -12936, -20485, -26038, -15642, -20619, 2744, 8669, 10048, 2452, -7904, -15413, -13587, -10622, -16628, 933, 29746, 32649, 25913, 16523, 9624, 7531, -6969, 10478, 31168, 40037, 20672, 25971, 39511, 20179, 15312, 21515, -12138, -42792, -40701, -36023, -19405, 2875, -3611, -11891, -1323, 2164, -2834, -23723, -21997, -32517, -33027, -3346, 28110, 42641, 23126, -11167]
24367a1167k0062n929K580J439K0566L1795J4k4497k0214j2442L271J7194J7809
24354C57L9341J5938l4364k283J4150k6477n680J7543q819k3419J9310J6864j663
24341B0798j8843p50k4584o302K0343J9667p292J5088N935j7832J6925J7863K261
24328D3277j3300l3437l1315o833L930r104p4J2843K8672K2881k8132R175J2605
24315A1188j9649K603K1556k1324j1723K5720J6011k330Q510j3211j2550R696
24303A4497m110R07j1025j8127J7436j8099k4746n296K7236L4938N595j395j0302
24290G509k3169m121M484J1565j4132k4080J1302k451J4525N377m171k694N551
24277a4505J0130N396k44p388j3456M670J291j7832k6338P754M0512O893j1431
$$ y = [-11167, -31229, -37158, -34578, -33139, -12573, 19222, 19236, -5261, -25475, -37917, -34646, -17452, 357, 39698, 55636, 21272, 18989, 33139, 6662, 982, 18525, 9706, -13713, 5597, 22461, 20798, 1955, 1205, -23379, -29681, -9338, 10329, 3037, 18125, 24060, 6228, 23153, 41016, 43277, 29977, -3460, -34775, -41608, -37678, -46782, -46856, -34013, -5341, 17540, -10592, -1417, 11188, -8461, -5858, 15698, -5626, -17349, 8371, 24382, 22052, 30562, 17351, 4801, 14497, 10387, 11294, 269, -17858, -422, -18521, -43267, -48563, -21327, 13611, 19206, 17811, 7509, -15660, -19781, -15297, -3732, -17864, -41944, -30642, -33093, -18568, -13191, -17362, -20056, -14505, -4375, 1021, 777, -6611, -20067, -15397, -14106, -31938, -58276, -50522, -10010, -3117, -14548]
24264a4548j5926M039n585k1836K3991J6400P691J6595j4809Q79j5283o859J7181
24251h070J6304Q112j5598l1298j0694Q147K5322J5303n992j3560r595J4920M792
24238a907N866j182J6515J3557J0087j2531k7564k1217k6126l09N315K8830K0930
24225A0264j4107l4945r648l26J0321N8298L4892l8427j0570j038L475k8372o645
24212b6828j8214J9794K2948j1944j3911J5889k8643K5774J4090l586J3328j0010
24200a313j4241R886m157R702J5213M239R364j6372R988k84R484k2840k5799j7902
24186c5032K389P061j583j3307O103J2837L0041K3477J8711o340j9989M569l604
24173B5333k8466k8063p422n078J6594K4425J8113L943l5678j0185j785l3661
$$ y = [-14548, -30474, -26435, -32020, -53856, -29865, -13465, -5774, 10821, -3988, -3109, -18392, -25251, -8070, 8234, 16346, 748, -30550, -41244, -33097, -7775, 7528, 1536, -12024, -21619, -6699, -1907, 3959, 2777, 19292, 32849, 42936, 30405, 2841, -18376, -44502, -44811, -39496, -10666, 10264, -3843, -38788, -48436, -48762, -38441, 19857, 54749, 16322, 5752, 4714, 8189, -20183, -26828, -45042, -25248, -2300, -14244, -28155, -12266, -40909, -15135, -1045, -4631, 8697, -1313, -15554, -5668, -9825, -123, 15090, 19329, 28693, 12321, 22309, 22025, 31509, 8669, -17130, -35032, -32643, -25582, -27165, -40472, -34369, -21532, 8509, 31986, 50697, 44357, 24368, 28937, 25333, -3133, -31196, -38618, -43696, -27102, -2677, 15436, 19379, -16299, -26484, -28269, -61930]
24161f1930p267R475L5827J3932J4180j0689O513p632m640R160R211k789q921
24148e570K018J6190K3640k220m757n667K581l4835k1698l787j7491m090K8033
24135b7653J5930j2219j997j0598Q112R649K6077p262J1643J5843q422J3517J2501
24122D5121j5612o454j418l402M676n418k855J4459K6935l3270k8310N909n857
24109e496R992K0511J2526K392j6345j6199m0776k3164K1382L342M395n353p450
24096d0243j5806p230J4899K6956J7592j0185j4384q660R258J3801J6058k3777
24084b1721j3726K3358K0326N615N165J4624n380Q175o791j7581l1153j108j9165
24071c9362j0226K42k583N150M3528L939j2527J6213K1957l0264r776k0378J0126
$$ y = [-61930, -69197, -59722, -23895, -9963, 4217, -6472, 41, -7591, -12231, -3071, 6140, 3351, -5570, -3552, 12638, 36278, 34058, 29301, 23634, 26215, -8620, -30318, -34105, -51596, -55686, -27653, -11723, -23942, -25939, -36537, -28425, -18776, 7301, 39, 11682, 27525, 19103, 32620, 45121, 29509, 23055, 21637, 18235, 22911, 17493, 14638, 29097, 56032, 22762, -5548, 361, -5496, 4496, 25007, 37533, 39925, 23580, 7381, -33395, -56559, -35177, -31835, -27440, -32793, -40243, -56049, -63279, -48380, -21424, -3832, -14017, -28401, -37061, -27803, -14002, 2056, -21721, -35447, -12089, 8237, 13852, 19017, 33641, 28261, 36436, 29645, 12064, -19089, -20197, -39362, -49588, -49346, -51929, -46779, -3251, 688, -11839, 4374, 26331, -3933, -13709, -34087, -23961]
24058b3961J7818j4380L962K84k1214j7224K622K2216L1408L9849N069o501j477
24045C8471j852N888J50j9994k923K999O053K4718n614l1276j6012L2214O339
24032C9161j5597k4948k5744K7978J7281j8606L995q137j4505J1876L706K770
24020g70J0203k9395j5905J1666J5636k4947K002J4116J6838J3954j7518j4916
24008a9036j0372p116j1869J62J505K299L9493J5561o523j0620J3233K0698Q901
23995C6316q248j8611Q205K2827p342k5131j8495l6523j3785K8071p122R758K3757
23982f323L0917j3708j4037N225Q949k5081j532J6593L039J7191J0447k945k5744
23969B991l6736j6459j805M2857P444k0914L5478K3386p330M338k926k6932j0536
$$ y = [-23961, -6143, -20523, -16561, -16277, -37491, -54715, -52093, -29877, 1531, 41380, 46449, 39948, 38471, 36619, 42507, 42657, 22663, 19740, 22739, 28792, 53510, 47896, 16620, 608, 32822, 39161, 23564, -1384, -27128, 850, 18131, -475, 3520, -4617, -19122, -7246, -3540, -770, 9433, -19962, -35867, -24201, -8565, -33512, -31510, -17394, -556, 13398, -4120, -19036, -29408, -36524, -48393, -48231, -46726, -44427, -4934, 10627, 4104, -6516, 6717, 27415, 36316, 28068, 9457, 17662, 40489, 33147, 8016, -10479, -47002, -60787, -32716, -39838, -30080, -6323, 24594, 10886, -3151, 2074, 11023, -14058, -15590, 1003, 4042, 21233, 31680, 28735, 2991, -33745, -50204, -52009, -9152, -1708, -22622, 12856, 36242, 28912, 33250, 30324, 3392, -7144]
23956g144P274K179m763J525m1006q817O718J2513M1847K5554j6782j6425K1730
23943B4403K0639J7789l7858J2815p388k1882j7526K1703j3313j2012q383l4789
23931e5802K8795L4771N986l1108K464L58O552k4536m828R959K3768L7463j3102
23918B0740j4829L437j1248q272l959R633K873N240j8039L768J0598N098j8192
23905a3152j1748k101K4618j116j8295Q9k8296p04J6644K5443J8865J7049k2880
23892D416m2257j0338N4775N0142J2665l4924l2796k4488P863j3578k914J3843
23880a7591l041M649J659J8155j2173j1565N495k0744r325J2966K6923M59k7511
23867c1644j3886j2185J5134L1089j859m754J4372k5830k5052K2742j2700j8543
$$ y = [-7144, 130, 2309, -2454, -929, -41935, -50752, -44034, -31521, 10326, 35880, 19098, 2673, 24403, 45042, 62831, 24973, 37788, 30400, 8518, -9008, 12695, -618, -12630, -21013, -55802, -27007, 7764, 13750, -17358, -14894, -14536, -7984, -32520, -37348, -27389, -3621, 33842, 20740, 5911, 9348, -1900, -10172, -14131, -4498, -1625, 3615, -14424, -10656, -58, 5040, -13152, -24900, -27001, -2383, -3499, -21794, -21705, -50001, -50705, -34061, -8618, 10247, 27296, 4416, -37841, -48179, 6596, 56738, 69403, 34479, 1683, -22805, -14942, -28520, -31434, -17591, -20632, -15983, -14324, 3831, -8342, -19907, -14412, -35156, -44481, -31515, -4592, -4133, -31644, -45530, -57715, -42581, -11492, -13351, -18105, -3733, -29563, -54615, -31873, -44573, -63116]
23855f3116K1242J8032J5359K676j5352k4073L3749K0925j6659l149J2700j3974
23843a1640l4791k848J4651O846K3422R22m303J3110k3745J1207J9675J1409j0601
23830A3314l1211j3600k559K5749J643K9979K6361J588q032K340K2219M910k4428
23817D8273k6051l5321R104p850o876n318J6164l942L4547J4747j531j13l4283
23804A550j5511L6990J6276k7655j3792j6833j1445K7087O440K686K2173m063
23792B3903N51J0836j9404p635N556l928j16J2559J1729Q11l3876o928L434l0146
23778c2654j0629J5469J8581R09l8903j4880K3430J6185k930P527J2569j6452
23766b1778j5982M150J8514J6879j0419J1332j2631m1522J0730K2008K5978p830
$$ y = [-63116, -41874, -23842, -8483, -5807, -21159, -45232, -11483, 9442, -7217, -10366, 2334, -11640, -46431, -49279, -34628, -27782, -4360, -3438, -7741, 5369, -18376, -7169, 12506, 23915, 13314, -17897, -31497, -34056, -8307, -6664, 23315, 49676, 51264, 43232, 45572, 67791, 72701, 48273, 22222, -13099, -3995, -11845, -18721, -24039, -7875, -11817, 22730, 37477, 35946, 35833, 1550, -13961, 23029, 39305, 11650, -2142, -18975, -30420, -3333, 3107, 5793, 27966, 23903, 24454, 35290, 15886, 8251, 13807, 9879, 9763, 22322, 34051, 34862, 986, -5942, -2508, -32654, -43283, -27814, -9233, -8324, -47227, -62107, -38677, -22492, -25422, -17895, -5326, -21778, -37760, -33610, -15096, 1783, -8636, 2696, -9935, -51457, -40727, -18719, 7259, -571]
23754e71p357j1571j7872O201P778j489L2487J1730n195n086j4108p563o701r419
23740b8736k4089Q563L6385L074N540j7142j7598Q356L1125J560k0866J3339O947
23727F458k727p276j5776o482N281P466r858j2912Q585L772L560Q18Q26K8366
23713A0101J7173k239L05q733j5632j169O611K9250J0214j5018j0144l5217k2441
23700c6939N3149K8704O698M593r656m2461l4993J5911J3874k777K361P407j1998
23687f127m765M3J82J9240P160J6550L2410k0686P351K8579j0896l5491N652k1066
23673A8136j3718k7375j500J5199M0565J8923k2590l421L6810J1275j5389K2845
23661G9760K0232J3125J3567l151M0288N7207P8637J11085M8017M0701Q840p5795
$$ y = [-571, -7928, -19499, -37371, -31170, -23392, -24881, 7606, 19336, 14141, 9055, -5053, -12616, -19317, -28736, -52825, -44262, -7877, -4803, 737, -16405, -34003, -25647, 5478, 7038, -13828, -489, 6458, 3731, -3545, -19321, -25803, -20522, -13056, -22914, -35826, -27241, -23469, -19909, -19091, -18265, 10101, 27274, 25035, 25340, 16607, 975, -194, 6417, 35667, 45881, 30863, 20719, -14498, -36939, 16210, 44914, 51612, 56205, 46549, 4088, -30905, -14994, -1120, -3897, -1536, 5871, -6127, -10892, -10849, -10667, 8573, 15733, 32283, 64693, 44007, 51358, 79937, 69041, 33550, 39202, 18136, 4418, -22957, -24457, -9258, 31307, 50230, 27640, 24219, 61029, 72304, 56915, 79760, 99992, 113117, 126684, 123533, 163821, 221028, 299665, 410750, 458767, 499468, 508308, 432513]
23649D32513r6904q7190q5514n9090m3533m454k3711j7663j7830P399p162j8751
23637b1890R848K1240R843L1346J6844k2287l9963p225l629q228k153n572k447
23624b4273j4343K2358n009R98P803Q812K7858K5237M334k0117K330o145j1483
23611A8360q386m8713j8362N2322K7921L388j9573l009J5927o362j0359J7250
23599B0404K5637j502j4304L719M495j282j2817j1573j7007m846J1851k79q841
23586f345M523L589p556m134P643P6j5138j4723l848Q952K3412o192j3145j9751
23572d2637K4150O171k5970J2949R004j2400j0842k59j9020j3179J5672K8869
23560b7492r788N513K8365M3059Q813l966k0274j352R248n082j4704R666R19k0615
$$ y = [432513, 335609, 248419, 162905, 103815, 60282, 55828, 32117, 14454, -3376, 4023, -3139, -21890, -12042, 9198, 19041, 50387, 67231, 44944, 4981, -2244, -5873, -14101, -16254, -21826, -24273, -38616, -16258, -21267, -20269, -12466, -3654, 24204, 49441, 53775, 33658, 35988, 29843, 18360, 9974, -38739, -57101, -4779, 23142, 26530, 6957, 3948, 19875, 13513, 3154, 20404, 46041, 44539, 30235, 33954, 38449, 37167, 24350, 12777, -4230, -9076, 2775, 2496, -6345, -1822, 1767, -5789, -9923, -2280, -2204, -17342, -32065, -35913, -26961, -3549, -9741, -22886, -42637, -18487, -12316, -38286, -25337, -16333, -28733, -39575, -39834, -58854, -72033, -56361, -27492, -37280, -31767, -3402, 39657, 48470, 44504, 24230, 22878, 32126, 27044, 12340, 22006, 22925, 2310]
23546B310m5743N316K8080K5120r283k4198j4680J3615L2492o633l1950j8828
23534d4382j9516K9328K4602k2339n894R860o074J1955R185j5513J133Q771j9771
23521c8655K803r291r761K2918Q898j0746k0722n119K3595N710J2020Q581m736
23508a4505m8982K8916K6928K8602K4364k4983k4818j2327j451k9334k7279K8162
23496d6707M8379r848l548Q454j3804l4678r253P194J7683J827K906K3019p024
23483a5400k30j3280J5231j1710j9093j0898r532K2005R300p250N383J0367N24
23470b4583K5009P319k2626l3729q797J6145m867p263J9366j4877m511L7024R505
23457f885j0324q057K172J4249K0318N086j7988N403K9675j0676j1279R814l5328
$$ y = [2310, -43433, -38117, -10037, 15083, 5800, -18398, -33078, -19463, 13029, 6396, -25554, -44382, -63898, -34570, -9968, -32307, -38201, -28341, -34415, -22460, -13275, -28788, -27655, -18884, -38655, -35852, -45143, -54904, -31986, -23088, -33834, -54556, -59675, -36080, -30370, -18350, -9769, -14505, -63487, -34571, -7643, 20959, 45323, 20340, -4478, -16805, -18256, -47590, -74869, -46707, 1672, -8176, -11724, -3270, -17074, -51752, -61005, -53811, -36128, -34301, -31395, -8376, -15400, -15630, -28910, -13679, -25389, -44482, -55380, -64912, -42907, -33607, -40857, -35474, -25107, -24583, 426, 7745, -14881, -48610, -57407, -41262, -46129, -53392, -34026, -48903, -53414, -16390, -6885, -17209, -25266, -23094, -8845, 11473, 16559, -1429, 3974, 33649, 22973, 11694, 21508, -13820]
23444a3820k2391J9268M2222J6948m5623k6545J6260J9928k9416l129J8081L0422
23432B2205R937j2282L305M655j5124k3200j9120M447L894j9414R182j2950o641
23419e1106K4601K1596m423N510q176R058K6600L2604l7279o1717m516K6823P957
23406a2468J488L8422K7072j7213k8967k9466Q48m431j6832L2721o50k0479K7474
23393b481J4862j615O959j6498j5213o387J4955n30j2093K9291j5894j6994J66
23380b1472k7485j9391K248J9060m772O999K2734J3719k353Q430J0457j2742j1790
23367a6358J6854k983M269J2143P998K076P117k5622M059K2765J7152m169l9147
23354F154n182m19k3258L9355K0500j4357j0423K0335K18l1781R636j2591p571
$$ y = [-13820, -36211, -16943, 25279, 42227, -3396, -29941, -13681, 6247, -23169, -26298, -8217, 22205, 32142, 19860, 23165, 27820, 12696, -10504, -29624, -25177, -21283, -40697, -31515, -44465, -51106, -26505, -4909, -9332, -3822, -11998, -2940, 23660, 56264, 18985, -42732, -47248, -20425, -12468, -10980, 27442, 54514, 37301, 8334, -21132, -20284, -24715, -41547, -8826, -9476, -29955, -2481, 12381, 10766, 17725, 1227, -13986, -20373, -5418, -5948, -18041, 11250, -4644, -21638, -21472, -48957, -68348, -66100, -47040, -51812, -44813, -22079, -8360, -10713, -2283, 8174, -4568, -16358, 496, -2487, 1782, 13925, 21923, 23999, 31116, 5494, 9553, 32318, 49470, 45301, 6154, 972, 553, -22705, 16650, 37150, 22793, 12370, 32705, 32923, 1142, 10778, -1813, -9384]
23341i384j5379J998J4388O609n729P901j4008J1593j3608L944l085M1039K7104
23328E3383l1431N895j0200l2294J067q033N233J835j59j5550l7681q6J2253j548
23314e7316M989L2565K3912M470j3636j8710N058J2181j0263L5415M137o369p582
23301H851J157m134J6549J7105j0625J9000K0435k420o537l9481k1416J4165J0797
23288B3446k8509j1358J4471J885j283J2621J8042j2870l0946j1469j5099o887
23276d7956k7197m914J5753L8510L7744J5729O0n318n569N578k78J6765J5819
23263E4726j0174q812J462k5711m1674J6078j3233l3966J6699J4132K0554J348
23251h571j425N907K324R016R605j5200n498P035O104j5586j1233j3189j1151
$$ y = [-9384, -24763, -22765, -8377, -1768, -7497, 404, -13604, -2011, -15619, -11675, -14760, 26279, 53383, 21952, 27847, 17647, -14647, -13580, -21613, -16380, -14545, -14704, -30254, -67935, -68021, -55768, -57316, -52327, -19762, 4150, 8620, -5016, -23726, -18668, -6487, -16750, 18665, 22802, 16433, 8851, 10008, 5874, 22423, 39528, 28903, 47903, 68338, 65918, 59381, 19900, -1516, 12649, 23446, -5063, -16421, -1950, -65, -1348, 11273, 29315, 16445, -14501, -25970, -41069, -47956, -75153, -80067, -64314, -25804, 11940, 27669, 27729, 22411, 16842, 22420, 22142, 38907, 54726, 44552, 35740, 37202, 11491, -30183, -14105, -27338, -61304, -44605, -30473, -9919, -8571, -9996, -4089, -1765, 7251, 16856, 1656, -3842, 3193, 9297, -6289, -17522, -30711, -41862]
23238d1862j0080l377l547K8451L3841p660l7132J675P794K666j667L013k566
23225c0451k9734k2309L0327K8690K550J4008J2832k2610N80m351O314J0074J8592
23212A4512O437L101q910j7724N114j2747m746K4345k139n235k357R057j4368
23199e660k6116q390L6391k837r531j237q729K2822J6203J3711M589j0766J3200
23186C3650K8805m3306m4944J495K3665K686J9213j965k1877k0315o658P594P626
23173a4331O452m616K3679J152r454J3344K3014k3632j2511j9392k6969J8448
23161b4816k0188J9776j859o316j9242L3198J8401r668j2018o89p750p988M370
23148c4789K0277k7477k3619K1475L151O262N85J8660m491J4140J1173r899j1027
$$ y = [-41862, -51942, -55319, -58866, -30415, 3426, -4234, -41366, -39691, -31897, -29231, -30898, -27885, -30451, -60185, -82494, -52167, -23477, -20927, -6919, 5913, -16697, -16117, -20468, -14154, -4080, 14512, 20949, 24050, 15140, -2584, 2530, -10217, -14963, 9382, 7243, 2008, -349, 8708, -5660, -31776, -40166, -3775, -6612, -16143, -17380, -26109, -3287, 12916, 26627, 31216, 20450, 33650, 62455, 19149, -25795, -24300, -635, 2051, 21264, 19299, -2578, -22893, -29551, -21957, -14331, -7879, -12495, 11184, 12336, 2882, 16226, 39240, 15608, 3097, -16295, -43264, -24816, -45004, -25228, -27087, -33403, -52645, -19447, -1046, -10714, -22732, -23421, -31171, -39159, -34789, -14512, -41989, -65608, -44133, -40982, -34720, -34135, -15475, -19966, -5826, 5347, -4552, -15579]
23135a5579k739j1988N241J7126m323l1063J459K3329L7879P822j1647q575j3408
23122f466j2368k3165M865J475P817K5994n706O029J3863l7754j5211Q133N7j7604
23108e0041J3577L2474j6159n186m597J0292L54O234p816o257K2184K2397Q046
23095B5502n754j3876J554k0847k0272k20O423K2014j4040k1562k753M723J7147
23082b1961J4179J501l500L0740k2361q042Q431o429m302j3616L787j390j7391
23069d0354J2658J709N236R428J024j9781L3281K2451k237L987q663K718j3379
23056H078K155j5717K2966K6688M264N675j2689k0372k7899l458P710J573k2390
23043b3416K261k4634Q395M1972K42l497n766l25j6776J084j0943K1413R337r036
$$ y = [-15579, -18318, -30306, -25065, -7939, -12262, -43325, -41866, -18537, 19342, 27164, 15517, 6942, -6466, -18834, -41999, -37134, -35659, -27842, -1848, -7554, -1525, 12338, -25416, -40627, -32494, -32437, -50041, -36464, -3990, -20149, -25335, -29932, -19640, -19286, -13052, -20868, -27125, -4941, 17456, 25502, 19748, 5872, 7426, -13421, -33693, -33913, -27490, -5476, -19516, -41078, -43831, -39108, -21961, -7782, -6281, -9781, 20959, -1402, -9444, -1013, -7442, -11744, -25360, -21573, -22963, -40354, -27696, -25987, -20751, -11323, -10299, -30080, 3201, 25652, 23415, 27402, 18739, 21457, 8078, 10233, -5484, 17482, 44170, 48434, 54109, 41420, 21048, -6851, -10309, -2599, -1026, -23416, -21155, -45789, -37394, 4578, 4820, 1323, -4443, -4768, -21544, -20460, -31403, -9990, -653, -9689]
23029i689n09L172J6116j8654m3085J3382J8643J4219o68k4391P503K2752J7982
23016A6773j0155j6806k882P049J0513K0358j1808J0034M714l3761k3225J357
23004b7839K5826L0050l0798n2932K7923K7334J2251j1182L31k3396R208K3567
22992A0343k982j1095k677k260l87N12j5358j8070K0067K0937k2674j1368J5713
22979a9299J9955j407m270N374O801l2181j5127j2648N100J4724J3479R837m621
22966a4283J5699J9731L5j055j9163j1963K357L4244K3412J3393J210J1874j8371
22953E7120k3371j6585j3299N420j3189J1450R224j6221j4518j460O306n226K56
22940a4093J2610J2355k799k7816J4855K483Q621J0972j2473l1731J2207j2926
$$ y = [-9689, -10198, -7026, 9090, -9564, -52649, -39267, -20624, -6405, -7073, -31464, -23961, -1209, 16773, 6618, -10188, -13070, -6021, 4492, 24850, 13042, 23076, 27790, -5971, -29196, -27839, -2013, 28037, -2761, -55693, -27770, -436, 11815, 633, 964, -22432, -13224, 10343, 7361, -3734, -6411, -8671, -9058, -8546, -23904, -41974, -21907, -970, -23644, -35012, -19299, 656, -751, -5021, 353, 7154, -25027, -40154, -52802, -47702, -32978, -19499, -9662, -14283, 1416, 21147, 21182, 20127, 964, -10999, -8642, 25602, 49014, 62407, 63617, 75491, 57120, 33749, 17164, 3865, 9285, -3904, 7546, 16770, 549, -13969, -15429, -9123, -14349, -14093, -1483, 10872, 8073, -19743, -4888, -2405, 6216, 17188, 4715, -27016, -14809, -27735]
22928b7735j647k404k79K1328J9097j4166k3252J455l509M1252O753k6244Q509
22915h42j283k983J660k062M964n065J9108N414K0290j5819R845J9219J469p510
22901D6405L092K009k0370k3301Q697j2167j1319J547n829J5223r456k6996j526
22888c3991P282q885K8008l427k536M427J0099R562J2714P927l7127k1443K3409
22875c981L6840J7784j4577l3424l0177m390K9263K5043K2835j5733k2891k6653
22863b0061J3839J9075l075l2739m864j4062K3434k5798J0091K5387q038L676
22851a3135L744n905J6605k5825P742J800O367P151p521j0992R860J0790J064
22838A745r323q632L662j7871k0195J2504J9466R32l6245o560M3174K1912K2936
$$ y = [-27735, -29382, -31786, -32065, -10737, 8360, -5806, -29058, -27603, -31112, 10140, 16893, -9351, -842, -2125, -5108, -3448, -5510, -546, -5611, 13497, 18911, 39201, 23382, 33227, 52446, 53915, 46405, 49497, 51506, 31136, 7835, 16532, 4365, -6954, -5407, -11236, 3987, -5469, -32465, -33991, -26709, -35594, -7586, -11013, -13549, -9122, 977, 10539, 23253, 31180, -5947, -27390, -3981, 32859, 50643, 36066, 2642, -27535, -31925, -2662, 22381, 45216, 29483, 6592, -20061, -6222, 12853, 9778, -22961, -27825, -41887, -18453, -44251, -34160, -8773, -16811, -13135, -9391, -15296, 1309, -24516, -16774, -14974, -8607, -1456, -8977, -19969, -10109, 681, 1745, -7578, -16210, -12548, -30419, -50614, -38110, -18644, -17712, -53957, -60517, -17343, 4569, 27505]
22825B7505L1697N276P334l6895l1155r121M0664K1894k1202j0811j5212q971
22813A003j7470O635j3545J0418j1046N417M050J7095R411j9808k574M1629J5697
22800D6912q580j5584M302l4912k052J7475M4080q541k5602P133J4340l5983l3611
22787c0623j408J9464n727J2968J7933n063q607r896j9836j8503M405n477J2459
22774c7911K0270q548k2309k340K6297O551j4779j1271l987K1520J6589L0049
22762B0131P011m0990r969p0m767J0537n877L7159J6078n73l179R358n0629k6026
22748d1806j8185K1233L751K2098J9001p309j4127k104M839l835q708K1944M1774
22735C8566l543o481j8377j0735j9486J0721m28k2991R791K4530j0390j2736R412
$$ y = [27505, 59202, 64478, 71812, 34917, 3762, -5359, 35305, 57199, 35997, 25186, 9974, 1003, -16467, -9832, -23377, -12959, -24005, -18588, -14538, 2557, 11968, -7840, -10414, 31215, 46912, 38332, 22748, 27050, -7862, -9914, 7561, 51641, 43100, 17498, 24631, 38971, 2988, -30623, -32031, -12567, -18294, -5326, 12607, 7544, -1063, -10959, -30795, -49298, -44893, -50370, -37911, -17641, -26189, -48498, -50838, -24541, -17990, -32769, -44040, -48027, -26507, -9918, 20131, 27142, -13848, -23817, -23887, -28654, -18117, -23994, 13165, 29243, 28670, 25491, 34849, -15780, -41806, -59991, -38758, -35007, -12909, 6092, -1217, -15344, -17448, -12609, -16444, -25152, -3208, 38566, 35023, 28542, 10165, -570, -20056, -9335, -9763, -32754, -22963, 1567, -8823, -21559, -12147]
22722a2147J2135j6176J113q416K0399J4150k5017O635j7013J6311J5674J156
22710H804P595j911K899m682O05j2053O830R557k889N098j8903j0014q334j2693
22696c0091Q847Q326j1546k7973O942K0508J3094J7535J2125k182j3210j4173
22684a1798J4096N348k4077n631l666l182j2100J2836K6513J4025J8276N817k2521
22671A3936k9005j2898O040K1534j827L1980J8751l6820k6147j5862l1300N029
22659e6589J0587j0704N968O960M284J8342l475P559J7971Q92J3873j8653m0617
22646d3602r219j1170j685J1513J9212J5677N106n2986J188M6700K8067J2301
22634B1102n255j9024j101q913o701k0619j1376K6992J7041m527N080K8482l513
$$ y = [-12147, -12, -16188, -15075, -23491, -3092, 11058, -13959, -7324, -24337, -8026, 7648, 8804, 16399, 14488, 17387, 12705, 13310, 1257, 8087, 17644, 14755, 19853, 950, -9064, -17398, -30091, -21244, -12918, -24464, -52437, -45495, -24987, -11893, 5642, 17767, 15585, 2375, -11798, 2298, 7646, -16431, -22062, -25728, -28910, -41010, -28174, -1661, 12364, 30640, 36457, 13936, -15069, -27967, -21927, -393, -2220, 29760, 48511, 11691, -14456, -30318, -61618, -56589, -46002, -56706, -50738, -43778, -39494, -21152, -24627, -17068, 903, 1795, 15668, -2985, -43602, -52821, -63991, -65676, -54163, -34951, -19274, -14168, -67154, -65966, -19266, 8801, 21102, 15847, -3177, -4278, -13191, -19892, -40511, -51887, -24895, -7854, -12381, -7301, 21181, 17668]
22621A7668j6041k6463j5552k021N836j4883j6197J5546L9927K0223R664k1921
22609d214l1883j6431j4729j8895K9885J6673j4928K3501O244J3684J1258R900
22597A0065J0842k9693j0727K9028J9685k4553j262k7460r368L7864J0877J1809
22585B7107j7196o473k2721j0734J3820M7128L6256K3151k2887O252k1145l4933
22573A7625l3631J3382J9762l662j8427j7391j942k215j4740J6893j3656J0052
22561b7950J4584P184j6139Q480J7714P926M191p627J35P266N007j7696k9984
22548b6909k9384j0495K0604J7413J9094q602o160O762J1585J2519o577k6354
22536b6504N187k693j3926j9813J925K0774K8249k2831P747L0915k0551p142j299
$$ y = [17668, 1627, -24836, -40388, -42409, -36573, -51456, -67653, -52107, -12180, 8043, 17707, -4214, -36097, -52528, -67257, -86152, -56267, -39594, -54522, -31021, -24777, -11093, 165, 10065, 20907, -8786, -19513, 9515, 29200, 4647, 3385, -24075, -33443, 4421, 15298, 27107, 9911, 3438, -19283, -30017, -16197, 30931, 67187, 90338, 67451, 73703, 52558, 17625, -16006, -2624, 17138, 13476, -4951, -22342, -24284, -26499, -41239, -24346, -38002, -27950, -13366, -6182, -22321, -13841, 3873, 11799, 15990, 8363, 8498, 15764, 20771, 3075, -26909, -56293, -66788, -46184, -28771, -9677, -18279, -24439, -17677, -6092, 6427, -150, -26504, -21317, -24010, -37936, -57749, -55824, -35050, -6801, -29632, -21885, 9030, -11521, -18663, -19962]
22523a9962P527L1120j2105k9797N075j8823k0309r20K3501K4751k654J2986R944
22510A0334q33l29k9842j5384J9593p420p103K4380J9160Q282Q42M473J025j0255
22496A6923j3131k8694L091O366p915L2903J9645j2165m053N78j0445J837K902
22483G842p444J809l4982N833L6006J2792k8349K156N611k9324L950J3299n012
22470a5813j1642K0353L715Q560J1882J5121q962n2964k409J3698J9193J5394
22458A6126K1057q259l3784l9838Q26M960J5221M937K2087J5327n489j9045l8078
22445d3952l0683Q53M3848O843M922J2383O399m406K7794k7936k7415l230N16
22432c4064N14K2174L3388j0135j9688l3247j8613M0777L9571k67q743J2700o930
$$ y = [-19962, -12435, 18685, 6580, -23217, -18142, -36965, -57274, -58194, -34693, -9942, -12596, 390, 10334, 9501, 9172, -20670, -36054, -16461, -23881, -30984, -6604, 12556, 20838, 21680, 26153, 27178, 16923, 3792, -24902, -21811, -15445, -23360, 9543, 29188, 17023, 12970, 13548, 3103, 4940, 7842, 398, 2207, -32775, -26942, 9064, 21856, -6493, -4337, 1274, -28050, -24100, -10801, -15813, -27455, -7102, -3387, 5173, 17055, 32176, 23214, -29750, -32159, -18461, 732, 16126, 37183, 28924, -4860, -44698, -43872, -38912, -23691, -18754, 3333, 18660, 13171, -5874, -43952, -74635, -73782, -29934, -23091, -18169, -5786, 613, -3793, 24001, -3935, -31350, -34580, -34064, -33550, -11376, 22012, 11877, -7811, -41058, -59671, -18894, 20677, 20410, 11667, 24367, 17437]
22419A7437j9571k3894J022K1618q831n10m959k7961K153k7027O946K6781Q454
22406b8342L863K7268R9j1051J2449M199l4262J0417M984n176K5347L239j8049
22393e015k9162j6283l43M31K3691L8622K0101j3478m8737l629J2883L119k1628
22380c9428N089J6891J0084k1790o668J1062P560p857J9217N76R287k257m0151
22367c8385l3116J3875J9973K8207K4484O634J320o558k2356k9002k8215J2072
22355e1067M515K0234J5651n530N476n424r138K2210L9021J9511j4956j1933Q721
22342C7291K685k5067j6276N921n71k310l3221J6672P339R875j8339k2230M747
22329c3484K0977R253L10r526j3226j5991o866p029R74J0324Q650j0514J8676
$$ y = [17437, -2134, -26028, -25006, -3388, -12219, -12729, -17688, -45649, -43496, -70523, -63577, -36796, -28342, -24479, 2789, 2888, -8163, 4286, 8485, -25777, -15360, -10376, -15552, 9795, 13034, -5015, -34177, -50460, -50803, -50372, -26681, 11941, 32042, 18564, -30173, -33802, -20919, -17800, -39428, -34339, -17448, -7364, -29154, -35822, -24760, -17200, -25057, -5840, -5264, 4023, 1766, -38385, -71501, -57626, -37653, -9446, 15038, 21672, 22992, 16434, -5922, -34924, -63139, -51067, -46552, -26318, -10667, -16197, -10721, -16145, -25283, -3073, 35948, 55459, 40503, 28570, 37291, 39976, 14909, -1367, 4554, 3983, 1673, -31548, -14876, -7537, 2338, -16001, -38231, -33484, -12507, -3254, -2944, -12470, -25696, -41687, -48553, -55582, -54608, -44284, -35634, -46148, -27472]
22316b7472L4556j3313L910J0537J6303l449j5284J5869K455J6478n407R606j474
22303D3315m1887J109J7630j644j080j9924J419J8276K8013o488l3056l547L806
22290E942j246k0990j7277j8820K7036K4576J4532j6942k2642k488N211j0879
22278c3987P860J5624M88p00k3197k7219L1146J9277K3139J515j9635k5265o478
22265c7432L5873K7658R525j6759p971k0380j6277J4921J4167L065J1879o346
22253A1923n556k3281L862k372j2779k5724j9595K1368k883L6185k6326o970L0724
22240b1424P349J0030j1976P634K7340J000l2050k0785J7237J9235J7818j3870
22228G538j5589j8920k421j1799j0681O307J0727K1269R132K185n667K340J067
$$ y = [-27472, 7084, -6229, -2319, 8218, 24521, 21072, 5788, 21657, 24112, 40590, 35183, 44789, 43315, 1428, 2537, 20167, 18523, 17443, -2481, -1062, 17214, 45227, 38739, 5683, 2136, 5942, 4696, -16294, -33571, -52391, -25355, -779, 13753, -3189, -25831, -28319, -23108, -33987, -26127, -10503, -10015, -10715, -33912, -61131, -29985, -10708, 12431, 13946, -5689, -30954, -37432, -1559, 26099, 35624, 18865, 10894, -9486, -25763, -10842, 3325, 6390, 18269, 11923, 6367, -16914, -13052, -15424, -28203, -53927, -73522, -52154, -55037, -18852, -45178, -52148, -21424, -14075, -4045, -16021, -8387, 18953, 19953, -12097, -32882, -15645, 3590, 21408, 7538, -8051, -26971, -29392, -41191, -51872, -45565, -34838, -13569, -4437, -2252, -7919, -5579, -4512]
22215d512L276R834j7300j8072J3400J6811j3707j2647l922Q340k3902J1351J9330
22202a1720k17r246J8131j2962J4737M856p962j8063J162J4397J750j2498o018
22189b3653j443j8935k0030m797M75M2187L521J0069J3718J6362j0601l0330j1170
22176c4627J3595K1689J0118j3700J0103j1615j346J1677J366k7945j0578q386
22164c9649p598J0507L3979J0110J5910r013k5300n031J3065P308l325k7411j2418
22151c8866R602J0126J3652J488j0195N681m27j9451q713J8402J395L4537N003
22138B2234j5766k4295j4097N649O490J0521L4309J4817j0030k5244k3220L3595
22126A4963R803j022j7529k76J215J0947k5492n702K0037O63q473J4579Q614L1642
$$ y = [-4512, -1236, 8598, -8702, -26774, -13374, 3437, -10270, -22917, -26839, -18499, -42401, -31050, -11720, -11937, -21183, -3052, -16014, -1277, 3579, -4383, -22446, -21284, -6887, -5137, -17635, -23653, -25096, -44031, -64061, -68858, -68383, -26196, -22675, -12606, 1112, 17474, 6873, -23457, -34627, -21032, 657, 10775, -2925, 7178, -4437, -5783, 5894, 7260, -20685, -31263, -39649, -47247, -36740, -2761, 7349, 23259, 14246, -11054, -16085, -3020, 4288, 963, -26448, -38866, -29264, -19138, -5486, -3998, -14193, -8512, -8939, -28390, -37103, -18701, -17306, 17231, 22234, 6468, -17827, -31924, -26275, -19785, -9264, 25045, 39862, 29832, 4588, -18632, 14963, 24766, 23744, 6215, 5939, 7154, 18101, -7391, -13093, 6944, 7607, -866, 13713, 22327, 53969]
22112E3969J9908q572m2480l1540L707M885J5899j2091k6597J5059k825K281M2384
22099C3987J2445j7765j8506K5408j3390j9240J5644J1484j0299k9862k626j0552
22087b3272j1014k4060p37J6308l124O067J4631L5074n8J4313R390p948o025j0796
22073H749j2925M243j5924Q739j239K38J4850j5652j2644K3513n325k8928l4993
22060f7298P945K3272J4909K8435M441o082m502j6236j8989J3081J6741m228j2463
22047b0974K0229K2046Q721k5726j912J628k2467j2189K2527P810k4611l0536
22035e5454p932L3132K4104k574j1660o674j5656n65J8679J9025K3238J9718r250
22022B8131o156k045Q125r203j052p110m2669j0694L6141J8907J3644j8072r37
$$ y = [53969, 73877, 65305, 22825, -8715, -5008, -123, 15776, 3685, -22912, -7853, -10678, -8397, 33987, 46432, 28667, 10161, 35569, 22179, 2939, 18583, 30067, 19768, -10094, -12720, -23272, -34286, -58346, -59083, -42775, -45899, -39832, -25201, 9873, 9815, 24128, 33518, 25570, 19545, 8749, -4176, 67, -15857, -7118, -8357, -8119, 6731, -8921, -21565, 1948, -3377, -32305, -67298, -59353, -36081, -21172, 7263, 11704, 5622, 1120, -15116, -34105, -21024, -4283, -8511, -20974, -745, 21301, 30022, 4296, 2384, 4012, -18455, -30644, -8117, -307, -24918, -55454, -63386, -30254, -6150, -8724, -20384, -27058, -42714, -43279, -24600, -5575, 17663, 37381, 28131, 21975, 19930, 28055, 18852, 17800, 10690, -31979, -42673, -6532, 12375, 26019, 7947, 7010]
22009G010q079L623r931l678n282q386K4888J210L332J7084r71k111n63j6145
21995B001k0922j2192K1683J6606K2029n997O800k6479k6703J5878N8j6842q59
21982b4939m994j1874j6034Q224J0155J6256K2951K444k9470j9120N533J7305
21970b3563P391J3636k1251j1538M422K1305J6359n495r636J5846J3106j8614
21958A968j3142N618K67Q962J0038j5931m069l0408J4119O490j8007n504J4026
21945b5573K1242p013j86O162Q69R94k8529o584j558o386J3035J1988J1559j704
21931a1684k0163k408J6255M1738K2881k9934k9093l1788J0848L5446j4291j2857
21919b5050j680P533l652M831j1186o957J8517K7490M272j8919j9386l461J3694
$$ y = [7010, -1069, 2554, -7377, -11055, -16337, -24723, 165, 1375, 4707, 21791, 20820, 18709, 18146, 2001, -18921, -31113, -9430, 7176, 29205, 23208, 30008, 3529, -23174, -7296, -7238, -24080, -24939, -29933, -41807, -57841, -49617, -39462, -23206, -255, 2189, -27281, -46401, -40868, -23563, -16172, -2536, -23787, -35325, -30903, -9598, 6761, 1266, -8370, 7476, 20582, 1968, -11174, -5556, -5289, 3673, 13711, -2220, -6289, -36697, -22578, -16088, -34095, -39599, -25573, -4331, -11344, -11530, -5368, -4499, -3505, -32034, -38618, -40176, -46562, -33527, -21539, -9980, -11684, -31847, -34255, -18000, 23738, 46619, 16685, -12408, -44196, -33348, 2098, -12193, -25050, -26730, -19197, -22849, -18018, -29204, -36161, -17644, 9846, 14118, -4801, -24187, -27648, -13954]
21906a3954K7194j615k5262j6195K101J9225j2001P484K983J871K311L0902J255
21893B6299j6284q526L376k9001j5862p356K701m105K9051p831j2390Q762N867
21880b5299q1N048N964m930m55J5680K4171L0041J294k6389k4923J89K7785l8726
21866a0631j7511R67J5598k198R131o530k2721K195M9187J1330k0755l677j0833
21853f448J1048O065j4848j5766m500j6112l983J1813j1471R152m22n836j8438
21840e9746M701L6893o604o711j1025J4642j792l546J7612R001J2336K2616R543
21827C7920k8353o317Q649j9415K5593J0658l2327j2896L615j3943l814j5877
21815d6507j8071J6158J5897K0385P166Q587O35j5365m481l432R811J4511j0157
$$ y = [-13954, 13240, 11625, -13637, -29832, -27731, -8506, -20507, -13023, -10040, -8169, -5858, 25044, 26299, 10015, 1489, 4865, -24136, -39998, -47354, -44653, -48758, -19707, -27538, -39928, -31166, -25299, -25380, -20332, -14368, -19298, -19753, -4073, 20098, 50139, 51433, 25044, 121, 310, 28095, -10631, -28142, -27175, -11577, -13775, -4644, -11174, -33895, -31700, 17487, 28817, 8062, 4385, -6448, 4600, 10665, -4183, -19949, -24449, -40561, -44544, -32731, -44202, -35050, -35472, -41308, -59746, -55045, -18152, -24756, -31467, -42492, -27850, -29642, -33188, -15576, -6575, 5761, 28377, 37920, 9567, 3250, 11899, -7516, 18077, 28735, -3592, -16488, -12873, -26816, -30630, -46507, -64578, -48420, -32523, -12138, -4972, 3615, 4250, -11115, -15596, -19028, -9217, 5294, -4863]
21802d863q704R276p172R392j4993j4924J8014j4012K527L9002J3319K3310j6152
21789C4020l0473J298q576j7756j4197k000R486k7933N125K2184p340j4639K524
21776d8277K4894p283k552J5770K4307K717J617j5713j7437p271R972L083O288
21763i885J607o460j1920m394L29K5763j7966p704L17p577J5423K40j4630K0282
21749a6575K6175k4054j8088J3571K1744k0237k286J2962J3677l330J475n225
21737a91k5302k5458k3256J0693K5459L024K0423P420J1489J2062K340J7707j5791
21724B0619k3966J3347L0526j742q96k2688j8480j0463P551q925p033j3985l142
21711c9277P752M0493R104l9988k0413J8668M2204j5948j5374J5025J555m242
$$ y = [-4863, -13567, -4291, -11463, -2071, -17064, -31988, -13974, -27986, -25459, 13543, 26862, 50172, 34020, 3547, 4845, -3731, -21487, -35684, -37684, -28198, -56131, -51006, -28822, -36162, -50801, -48277, -23383, -30666, -33218, -17448, 6859, 9576, 11193, -4520, -21957, -29228, -19256, -16173, -9885, -8278, -14738, -26658, -31052, -30723, -4960, -22926, -30630, -30313, -37890, -22467, -22227, -36857, -16575, 9600, -14454, -32542, -18971, 2773, -17464, -19750, -6788, 6889, 3559, 5034, -191, -25493, -50951, -74207, -63514, -38055, -35031, -14608, -7188, 4301, 16363, 18703, 36410, 20619, -3347, 10000, 40526, 38784, 37888, 15200, -3280, -13743, -6192, -15117, -22150, -36135, -39277, -31525, 8968, 18072, -21916, -42329, -23661, 18543, 2595, -12779, 2246, 3801, -441]
21699d41k1081J082L0900N418J533q435J7849K3643k7065q658n699o103K7094
21686C0037K845j8080j9380l4983N768J9209k710J1580J1009m877l79J332o844
21673e473l600J0043L2312J639j7287m589l7136j4611J6609J2733K148K5845J764
21660B0397m76o467j074O692k1179J8135K7568R246j5332m8697l0513K589j3684
21647e2795j6887J7672L0566K1658j3839J8606K6216l3773n47L0563j3030k8522
21635a4112J1682j9648k3418L8170J5340J483L1j6468L909r452l5207J754L3950
21622a1986M666J6396m29q447j8813L1252L6845j3798j6002k6900j8213o250P368
21609b4311J1575K9731L258m5686k4662J8721K1105M5r033Q39q652p889K748m290
$$ y = [-441, -21522, -20440, 10460, 15878, 17411, 8976, 26825, 50468, 23403, 14745, 9046, 2943, 30037, 32882, 14802, -4578, -39561, -33793, -14584, -17294, -5714, 5295, 418, 39, 1371, -5473, -9073, 970, 33282, 34921, 17634, 13045, -24091, -38702, -22093, -9360, -7212, 18633, 20397, 19921, 13454, 12380, 19072, -2107, 16028, 43596, 52842, 37510, -11187, -41700, -39111, -52795, -69682, -52010, -21444, 214, -13625, 4981, 31197, -2576, -3123, 27440, 14410, -14112, -2430, -22078, -45496, -7326, 8014, 9497, 9528, -6940, -3031, -12483, -47690, -45936, -11986, -7320, 9076, 8647, 200, -18613, 12639, 49484, 35686, 19684, -7216, -25429, -31679, -24311, -12736, 16995, 20253, -25433, -50095, -31374, -10269, -10224, -19257, -18418, -27070, -34959, -32211, -36501]
21595c6501N833l807N70K0656K6876L564k2166k0173k242o963j1376N015M673
21582c6041M5862L920j4011j4574j2931K0806j2415J2928J4969m744j3483k0299
21570c0013j90J277r502q978M7370K3763L725J1943k3360j9573r14J0242J1512
21557A7302n015k7179m1392p034K5382J4116J5893O438O341L1541j3840k4121
21545a568P477j768o860K3105j3634o279J1508l099j6844j4472k888K6135J0102
21532A0915O632k2751k4195n481j83n395K6244k3511r539K5792J4046j0050L841
21519a3635o004K115L8562J126j282q844P753r782o966l9026k1699N391J3534
21506c8757j4555O398K418J0069M2127L825j5865J9404J9914M886l034j2749J3426
$$ y = [-36501, -30668, -34475, -33905, -13249, 13627, 17191, -4975, -25148, -27390, -34353, -45729, -40714, -36041, 9821, 13741, -270, -14844, -27775, -6969, -19384, -6456, 8513, 3769, -9714, -30013, -30203, -28926, -38428, -47406, -36, 23727, 27452, 39395, 16035, -3538, -4452, 5790, 17302, 12287, -14892, -56284, -63318, -37936, -23820, -7927, -1489, 4852, 36393, 22553, -1568, 5909, 4141, -2719, 20386, 6752, 473, 11981, 8882, -7962, -22434, -25322, 813, 10915, 17547, -5204, -29399, -34880, -35063, -40458, -14214, -37725, -47264, -21472, -7426, -17476, -13635, -19639, -17524, 21038, 22164, 20882, 12038, 19791, 10009, 3043, -35983, -57682, -52291, -38757, -53312, -46914, -44496, -34427, 7700, 11525, -4340, 15064, 34978, 39864, 36830, 24081, 37507]
21493C7507p741k0599j4176r411J1619L5110O379k7817j9896q294j5415j5025
21481d7759j9682n406K5720J9110M3709q442Q384p031m9046k5075K7409N1093
21469A2984q817l7107j7535J0836J2228K353o5J0801K5987K0039k4903l2775m152
21456c0126p553j6692k7045K6625O610J6189m548m4637k6707M2294M2871M845
21444a7874j1299J4509r31k849r184l170K3223j487O900J4050o086k4110q331
21431b6639r430L1281J5492Q269n864j3090l302p161J3606M767l1215m251j1652
21418c9189M35J1401m634K7273M273m182j0787k902P707J0911j0755k205P060
21405e594p39K1548q279j1546j0767K4146J5763M373n003r134m6544n549n943
$$ y = [37507, 29766, 9167, -5009, -14420, -2801, 32309, 38688, 10871, -9025, -17319, -32734, -47759, -67441, -72847, -47127, -28017, 15692, 7250, 15634, 8603, -40443, -65518, -38109, 12984, 4167, -32940, -50475, -39639, -27411, -25058, -25123, -14322, 11665, 31704, 6801, -25974, -30126, -37679, -54371, -81416, -54791, -48181, -31992, -36540, -81177, -107884, -65590, -22719, -17874, -29173, -14664, -15595, -18444, -27628, -30798, -7575, -9062, -2162, 11888, 5802, -18308, -26639, -36069, -4788, 10704, 18973, 13109, 19, -3283, -10444, 3162, 7929, -23286, -27537, -39189, -38754, -27353, -31987, -4714, -441, -4623, -15410, -18312, -10605, 306, -10449, -12654, -5594, -6333, 15215, 6936, -4610, -15377, 8769, 24532, 28905, 23902, 14768, -31776, -37325, -43268]
21392d3268j5413M927J033q99j5860K6164J9841K6921j8946p823J5569l840k9235
21379d0829k1376L6913J5545J879j757R221K8910J3972J024K739k436j2956j2954
21366A7895J68O563p470l4769k9166j0600K5084L7698j234l4434L526R798J8599
21353A658k0377m2263J6301K8794l45j559K0756M353k808j7833l3684K1107J0125
21340a5775L515o072q749L422J1271j1751n060K4115M235j8864j1035j6015m202
21327e0965L263K3915J5962O696j7142j5779K7258r060l1909J0880K9338J7824
21315A0281n001o921J5487j8567k5575P633M29l987p3r020O410k1463k1585K5186
21301d6766L2777J90k1218L669Q351l3261m014K5071K3167q10O002o307K0467
$$ y = [-43268, -58681, -53754, -52721, -53620, -69480, -43316, -23475, 3446, -15500, -23323, -7754, -11594, -40829, -62205, -25292, -9747, -7868, -9625, -404, 28506, 42478, 43502, 46241, 43805, 30849, 17895, 18063, 24626, 17156, -17613, -46779, -57379, -32295, 5403, 4169, -30265, -26739, -16941, 1658, -18719, -60982, -44681, -15887, -16232, -17791, 2965, 7318, 4510, -13323, -47007, -25900, -15775, -12260, -18332, -27081, -23659, -12388, -24139, -29199, -5084, -849, -19713, -30748, -46763, -50965, -47702, -23787, -7825, -1129, -18271, -34050, -6792, -15852, -47761, -36881, -7543, 10281, 5280, -1641, 13846, -4721, -30296, -22663, -22234, -26221, -26294, -35314, -28904, -50367, -71952, -46766, -13989, -13799, -35017, -31348, -22997, -56258, -60272, -35201, -12034, -12844, -6842, -13149, 7318]
21288G318Q961N613K278L899Q209K755j6997k0688j0563k9493K0498L0208J0650
21275B2648j3355j2560N94J3366J5366M47N950k4886K1581r012K23j2569l4340
21262b6547l390r539R428M251K5138n023j6190M03Q487M878r20k0998K457J3130
21248a4435p015j3310L0529K2495l973j9272j3477j192K3918J0218r59j382Q499
21235B0644J648j0580q10k3714q240K0178J3733N70O420k2221K141O188j2847
21222f890j7366l982J9870j526j61K450k2854Q792J1946j8301k6697k795J9109
21209c8405K315q954j311n796N0436K3779j725M702K316O064n56k7183m0433l7337
21195g2088r76J1465M908L6077k783J9703o578Q241R140j5579J1426K254n423
$$ y = [7318, 16279, 21892, 24170, 28069, 36278, 39033, 22036, 1348, -9215, -38708, -18210, 11998, 22648, 9293, -3267, -2673, 10693, 26059, 26506, 32456, 7570, 29151, 20139, 20362, 7793, -26547, -29937, -39476, -30048, -25797, -659, -5682, -21872, -21469, -12982, -8104, -9024, -30022, -27565, -14435, -21450, -34760, -4231, 18264, 14291, -4981, -18458, -19650, 4268, 14486, 13527, 12145, 20644, 22292, 11712, 10902, -12812, -21052, -874, 12859, 13429, 19849, -2372, -231, 5957, -6890, -24256, -28238, -8368, -9894, -10055, -7605, -30459, -21667, -9721, -28022, -54719, -57514, -38405, -36090, -45044, -46355, -52151, -1715, 22064, 20339, 25041, 27357, 33421, 32865, 5682, -34751, -72088, -73064, -61599, -56691, -20614, -23397, -3694, -10272, -2031, 7109, -8470, 2956, 5210, -213]
21182b13j5629R705l207J3347P186n437N848j5811j295j0909n912j908k611J4782
21168a2064M681K482l1029R65J6744J1048R172n142J726N677j1339J2292K9531
21155C4744k414k8208k1524J1650J8267k1912M351k2540K072j8999l121M6146
21143a488K1442j6216M772J9646j2358j8502J5105J3383j7447q850R857L4292
21131D3636j5589k8339J1664k0288j2116k775M770J9732P724j740j0609Q537J6365
21118B0972k3084j139J246j6134j5550k9936K2992L7179j9711K284M310n492K109
21105a9954l291M577K512l198p706J3717J6926R42m785J1723o44j8099p178k188
21091a6646K991j6673j4297J7951J0509J4750l83O117k2869J970j424j74j9911
$$ y = [-213, -15842, -6137, -9344, 4003, 11189, 5752, 11600, -4211, -5506, -16415, -22327, -24235, -26846, -12064, -7383, -4901, -35930, -34965, -18221, -7173, 1999, -3143, -1417, 4260, -7079, 5213, 34744, 32330, 4122, -17402, -5752, 12515, -9397, -5046, -27586, -25514, -44513, -47634, -1488, 19954, 3738, 8510, 28156, 15798, -2704, 12401, 25784, 8337, -513, 9344, 43636, 28047, -292, 11372, -8916, -21032, -23807, -19037, 695, 8419, 6679, -3930, 4607, 20972, -2112, -3251, -2005, -18139, -33689, -63625, -40633, -3454, -23165, -20881, -16571, -22063, -19954, -23245, -18668, -16156, -19354, -27060, -13343, 3583, 4525, -260, 11463, 10819, -7280, -14458, -16646, -13655, -30328, -44625, -26674, -16165, -1415, -1798, 4319, -18550, -16580, -18004, -18178, -38089]
21078c8089J4389l067K278J5856J2725j95j0494o608n954J6322J1713Q636j1692
21065E820p298k135m314J4859j8613j3869o316K869n120o796j110j7329J8542
21052d0810O1019J1113k9753j0737O18m215j1754o116k2256n984J3824L437l880
21039d5494J6589N092j957j1523L383J7702J0144j580j5624l672j7954J6282j1335
21026c9947j8512K8775J5622o944k3751j3374P442k3184m110J7432P898M326M1587
21013f740L7296L40r699k1435j2429k675p782j5811K7783J6417N2j99q572J6032
20999A2578J4364j7252l989J8074k2541K2641J4559j3875j2692q947k6415l231
20987b6726Q844J0371L4642K800j3920k625J5239n03P218Q333k9421l1677r528
$$ y = [-38089, -23700, -26767, -24489, -8633, 4092, 3897, -6597, -13205, -19159, -2837, 8876, 17512, 5820, -1478, -3613, -7927, 6932, -11681, -25550, -31866, -28997, -34117, -40913, -42023, -59352, -40810, 20209, 31322, 1569, -9168, -8550, -12765, -24519, -30635, -52891, -58875, -45051, -41614, -45494, -28905, -23813, -25770, -37293, -33910, -16208, -6064, -7644, -23268, -26940, -44894, -28612, -39947, -58459, -29684, -14062, -21006, -44757, -58131, -50689, -73873, -77983, -60551, -52653, -48327, -6740, 30556, 30896, 21197, -238, -12667, -15342, -23124, -38935, -11152, 5265, 5317, 5118, -3454, 12578, 26942, 9690, 5701, 23775, 1234, 23875, 38434, 24559, 11867, 2920, -23495, -26726, -17882, -7511, 27131, 29931, 16011, 13386, 28625, 28122, 35340, 43673, 14252, -17425, -26953]
20974b6953M1269j123k1036n625q854k411J0278L301K1006J3002J0752j0524N450
20961B8532j3472r94p424k231J2464k1280q390j4733l295M054M7484K2229J0051
20948E2995j3511k1413l0969j5204j765P163Q902l8871j2082N0162L078J6507
20936D992N284m1511j3695K441L2051q604O81l530j7893p391J1029L934j0251
20923d2463q482L4226J5210K770l8269K815K9014L1766J9523j7816n2843l404
20911b7953l017k690k815l1754r197J1456p17J6577M004j0045K964L0423L0872
20898H108j5841j0568j780J3280J033L8717K6067k070j4355k031k4682j018K0779
20885C5639j6052o179l035j0160k3682L095J6524q750k922K0535J334j434J5349
$$ y = [-26953, 14316, 13193, -7843, -13468, -22322, -24733, -14455, -11154, 9852, 22854, 33606, 23082, 28532, 15060, 14066, 6642, 4411, 16875, -4405, -12795, -27528, -30823, -26769, 20715, 42944, 52995, 39484, 18071, -12898, -28102, -29867, -22704, -13802, -52673, -64755, -14593, -11515, 4992, 10276, -31235, -44930, -42489, -10438, -19042, -18361, -21891, -39784, -47175, -36146, -32212, -42463, -50945, -16719, -1509, 1261, -37008, -34193, -5179, 26587, 46110, 28294, -24549, -27953, -30970, -33660, -36475, -68229, -77426, -65970, -66687, -50110, -46106, -56151, -53187, -22764, 8108, -7733, -18301, -20081, -6801, -5768, 32949, 59016, 56946, 42591, 40560, 15878, 14860, 35639, 19587, 13408, 10373, 213, -23469, -20374, -3850, -12600, -15522, 5013, 6347, 4913, 20262]
20872B0262k2773k7484r468O025J2896J635r299J9003J065J2964J5809J4911o987
20859B8559p953l022j6318j7210j3798k2477j7547L7115K1496k1223J0268L7946
20847A5836K8913r964j5899l483j350m382j8302N599r172j5843J2756J0604j0316
20834a5003m847K4455L3966k4427l6008J7849K715N996K3647K1069k9271l4058
20822a3917l9982J5668J0461j2877J6667k1689k6388L0408O597J7802J6559k4509
20810b5200o904j2449J7394O014K2211J0223p585k9986j1777r401K796K3871k749
20797b3542P363J7180O534j7327m3664QK8244J1400j4414P182r903M644O508o320
20783b6107j4026r773l688K5998J0996L983J4674J711j9395p013j3922J6340r475
$$ y = [20262, -2511, -29995, -39463, -33438, -20542, -18907, -28206, -9203, -8138, 4826, 20635, 35546, 28559, 20606, 17584, 1266, -15944, -29742, -52219, -69766, -32651, -11155, -32378, -22110, 15836, 44749, 34785, 18886, 15403, 14053, 9671, -8631, -3032, -12204, -28047, -15291, -4687, -15003, -19850, 4605, 38571, 14144, -21864, -4015, -1300, 4696, 28343, 49412, 20141, -13917, -53899, -38231, -27770, -40647, -23980, -45669, -72057, -41649, -35052, -17250, -691, -25200, -32104, -44553, -27159, -21145, 1066, 11289, 3704, -26282, -38059, -47460, -44664, -20793, -23542, -16179, 1001, 7535, -9792, -53456, -53448, -25204, -13804, -28218, -21036, -30939, -26295, -19787, -26107, -40133, -49906, -53594, -27596, -16600, -12617, 2057, 3768, -15627, -22640, -36562, -20222, -29697]
20770b9697J2261J9342L681P28k0027M727K3691j7109j5009k2548l626j539L640
20757d1485K8006J5309N520m321J237n877Q686k9958p919k412m856M033L773m356
20743c4620K0258o845j3311Q252J6017j3273j0099j5428J2823l620j9425k820
20731f2091M0879J8706r942k57K2060J5940P024k3236k8973R661o471K5616P610
20718A6526j2321k9779l862p260l49J860n897L1322J8484l9259o189l075Q008
20705c1791Q435k60M494J7650L2825k6823j8747K61L446R842J4013J1104j5489
20692H960j8657K3151J5849L0818J0635m493k5105m1808j6833k0486j6444J4166
20680d0247K1484o989J4128K5787m975r859L626K5532p852k7798n193j1269k1466
$$ y = [-29697, -17436, 1906, 5587, 6315, -13712, -8985, 14706, -2403, -17412, -39960, -43586, -45125, -41485, -13479, 1830, 7350, 3029, 4266, -1611, 7075, -22883, -30802, -33214, -38070, -34037, -30264, -34620, -14362, -21207, -34518, -26266, -10249, -23522, -33621, -49049, -36226, -39846, -59271, -62091, -21212, -2506, -12448, -12705, 9355, 25295, 32319, 9083, -19890, -10229, -16700, 8916, 16526, 4205, -25574, -29436, -36696, -37045, -35185, -41082, -9760, 8724, -30535, -36724, -39799, -31791, -23356, -23616, -19122, -1472, 31353, 4530, -14217, -13956, -10510, -668, 13345, 24449, 8960, -9697, 13454, 29303, 60121, 70756, 66263, 41158, -650, -17483, -37969, -54413, -40247, -18763, -25752, -11624, 14163, 9188, -671, 2955, 28487, 20635, -7163, -12356, -23625, -45091]
20667d5091J0669J1650J7336J4530J3338N993m4129j1843K5672k1979l879O691
20655b1042Q446M8032k3371O354M148K974j8058k7999o476J3876L739L202k543
20642h718L1114K2979k1115o153k9009k6288K2393J1115k471r461L452j6130n424
20629c3716r771J742L738L393J1485j0701N24L2098L6279j7929k7261M719J649
20616c751k2565L826K5296j836k1489M046J3651M6617K9521k8007l3147k7988
20604a5826J7069p336j3970m211l777R865j767K6784Q827k4861k4705j7134J4230
20591c6812K0696n72k649O595J5141L799q760o453J921K956n966q32J2178j8160
20577a6918j2129l080J1767K9685L651p991o435j7055J8724K4500Q348j6473Q342
$$ y = [-45091, -34422, -22772, -5436, 9094, 22432, 28425, -15704, -27547, -1875, -23854, -27733, -21042, -12596, 35436, 12065, 18419, 22567, 25541, 7483, -20516, -26992, -13116, -9377, -6175, -8718, 22396, 45375, 24260, 18107, -10902, -37190, -14797, -3682, -6153, -15614, -12162, -28292, -33716, -43487, -41745, -38007, -34614, -23129, -33830, -33306, -1208, 35071, 17142, -10119, -5400, -3751, -26316, -22490, 2806, 970, -20519, -16473, -2822, 43795, 73316, 45309, 12162, -15826, 1243, -6093, -20063, -24274, -28051, -18186, -19953, 6831, 15658, -9203, -33908, -51042, -36812, -16116, -16688, -19337, -12742, 2399, 6198, -2562, -9015, -7094, -4138, -10104, -10936, 1242, -16918, -29047, -32127, -20360, 9325, 12976, 4985, -1450, -18505, 219, 24719, 33067, 16594, 24936]
20564B4936L893J3585k894r564O001J3232j3362m1569j995J3240L520j6455K6757
20551A9325J640m434J8832p854k1741O051K874j1178J4965M635j4165j8608P89
20538h869m595j6199l671J2550K8977J981Q794k2423P494N135j4732j8068o598
20525c0224N8K2859J6196J4470j4922j1220K907L595n449J2955K5308j3583l1948
20512h998J892L4669q790k705j6281k5182p875L5598L6009k3151k0704j267n365
20499a2150j3638J9122r778L5004J4200k797k5810j1183L0570j2272k6601K3393
20487H060j941J4215r294q23l865j6049l4265J1473L4316P445O691k8686j4604
20474b7327o919p679m683J6479P107J685R709k0421j2865J4900J9296K7296o922
$$ y = [24936, 28829, 42414, 39520, 29956, 35957, 49189, 35827, -5742, -7737, 5503, 9023, -7432, 19325, 20965, 16531, 35363, 27509, 5768, 11819, 14693, 3515, 18480, 23115, 8950, -9658, -8869, -13464, -29663, -33334, -20784, 8193, 10174, 18968, -3455, 4039, 9174, -5558, -23626, -30224, -30166, -7307, 8889, 23359, 8437, -2783, 124, 3719, -1730, 11225, 36533, 22950, -8998, -7106, 27563, 18773, 16068, -213, -25395, -33270, 2328, 38337, 15186, -5518, -6785, -12150, -25788, -6666, -16444, 18560, 32760, 29963, 4153, -7030, 23540, 11268, -15333, 8060, 6119, 20334, 11040, 10217, 6352, -9697, -43962, -32489, 1827, 9272, 15963, -12723, -27327, -34246, -41925, -46608, -30129, -23022, -21337, -11628, -32049, -44914, -30014, -10718, 16578, 9656]
20461I656j676j2768K3710J0398m5920m1437J2271K5957J8830J6190L11j1082
20449D440K382N256j5976n415j3314L715M902l855p433j1n0861j7213L8822J9294
20435c5267J3108M860K6057K184j4520r883J0100J2069p926j4396k374P39n387
20422b0636l331N175J1847j3575k2922K1758R364l180J4934J0156L2223J902j7305
20409B6410Q713M509l5456j6776j0596J1847J2426L3153K8743k4965l5615M94
20397B887j2184J2745J4264k1444k4477J5014K7957M089o694l3074R843M091J4829
20384G846n121j6226L1576K4381l812k2693n3131q654L2514m078k8683k8138N061
20371f9158M7975J7333N895L9941J8258j8758k1240p615J4886J4498k9312q387
$$ y = [9656, 7980, -4788, 18922, 29320, -16600, -58037, -45766, -19809, -979, 15211, 15522, 4440, 6822, 12078, -3898, -9313, -22627, -18912, -14010, -17865, -25298, -25309, -76170, -93383, -54561, -35267, -22159, -17299, 8758, 10942, -3578, -13461, -3361, 8708, 782, -13614, -15988, -15249, -20636, -23967, -18792, -6945, -20520, -43442, -21684, -12320, -15500, -566, 9590, 41813, 43715, 26410, 35123, 39632, 4176, -12600, -23196, -11349, 1077, 34230, 62973, 38008, 2393, 2887, -9297, 3448, 17712, -3732, -28209, -13195, 14762, 18851, 12157, -20917, -11074, -6983, 7846, 2725, -13501, 18075, 42456, 38644, 15951, -37180, -45834, -13320, -17398, -46081, -74219, -69158, -21183, -3850, 2045, 41986, 60244, 41486, 20246, 12631, 27517, 42015, 12703, 4316]
20359D316J7625j0336k3512j1834Q198J0889J0812P909j9534k7220l35R727L436
20346a9859m682K789J8596O804j469J1705q280j6545j8274q825K7671K5137j135
20333A3633o012l862J452J4393j0617k2134L339J6076K649k288k1859l3251J9427
20320b9054P984N467J5462J0180l402m686L95J4682J9552J7507p884m652j5664
20307B5887j6903j23q745J2046O378K3710l205J0937o103j9948p702n020j4142
20294b933q913j419J7436J4949j8281j7862J5370l147k1522l026J2703j486N259
20281a2872K4633J5550l2995j5801M0076L1117k3858j2455J7690J1467J7442k7841
20269C2153k8979j4365m928N192K1207J1181j388j5005k2141J4956J4658J5939
$$ y = [4316, 21941, 11605, -11907, -23741, -15543, -4654, 6158, 14067, -5467, -32687, -33022, -23295, -19859, -24541, -21752, -3156, 3648, 2179, 13884, 5604, -10941, -29215, -38040, -10369, 14768, 13633, 7621, 3759, 5211, 19604, 8987, -13147, -9808, 6268, 8917, 6629, -15230, -48481, -29054, -21070, -15603, -141, 10039, 6637, 1951, 2346, 17028, 36580, 54087, 46203, 41551, 25887, 8984, 8861, 116, 12162, 18540, 42250, 39045, 49982, 43879, 23931, 16229, 11209, -2933, -11846, -13265, 4171, 19120, 839, -17023, -1653, -4800, -26322, -29348, -16645, -18131, -12872, 11761, 27311, -5684, -21485, 18591, 49708, 25850, 13395, 31085, 42552, 59994, 32153, 3174, -11191, -16119, -10927, 10280, 21461, 20073, 5068, -17073, -2117, 12541, 28480]
20257B8480J7604O011K056k0614q864M324k0457N430n86M284R70K1900j9331l3676
20243a2469O888O087L059k1581l3824j3966J2621L8420O375j0840R496j637q828
20230b0199L1301q568j7455m214L2501O549k1196j7335j2296N36K4696K7558J6054
20217C7932L3854L701m6504k2453l261j606J2894l0461j3369J1383R095J863K2649
20204A5717k361j6310l026L0477j8855m5190j0601L2914L7638J4875j497j9717
20192A4064L630K147k0923k4814R877J4697j9261j9988L4850K9832j2866j3129
20180a884n397m300n939K7521K761j9463R846k6672k5213O1296M2375j9714l6253
20167a036k9088k417K3582J7970N409j3226j925K7861J1493n758j1958j9334K0417
$$ y = [28480, 46084, 52095, 54151, 33537, 24673, 28997, 8540, 13970, 13384, 17668, 18638, 40538, 21207, -12469, -5581, 506, 3565, -18016, -51840, -65806, -53185, -14765, -8390, -19230, -9734, -11371, -20199, 11102, 2534, -14921, -19135, 13366, 19915, -1281, -18616, -30912, -30376, -5680, 21878, 37932, 71786, 75487, 28983, 6530, 3269, 1663, 14557, -15904, -29273, -17890, -8795, -6932, 15717, 13356, -2954, -5980, 24497, 5642, -39548, -50149, -17235, 20403, 35278, 33781, 14064, 17694, 19841, -1082, -25896, -16019, -1322, -20583, -40571, -5721, 24111, 11245, -1884, -7281, -11581, -17520, 10001, 12762, -6701, 3145, -23527, -48740, 12556, 54931, 35217, -1036, -30124, -32541, -8959, 9011, 14420, 1194, -731, 27130, 38623, 32865, 20907, 1573, 21990]
20154B1990K7164p240J4127r669k2955k7067k474m902l3551J8171K1607k1105
20142b5904k0783K8036K9697J7599k4086p936j849k2111j616K185J80j7267J7616
20129b6239l672J9254K4990j9969k9657Q746J3429P887K0041K3091k4055l1277
20117a7431J6100J800J865K0344j4689R391j697O871P426L7176O113k3104l9670
20104A0495j2132R646j4919r081J9642O069j0566j7191L0173J5267K7565n977
20092D8991m6817j5156J4390M983J0979P161k9312r244N250j3141m98Q038N927
20079h449J4366j2736j3043k474M789J7089N140N141k1417k5030j5114k366J9608
20066c4496J6385R567J7067j4717q998K667J7900J5752j0980j8266P185j2159
$$ y = [21990, 49154, 41914, 56041, 46372, 23417, -3650, -6124, -11026, -44577, -26406, -4799, -25904, -46687, -18651, 11046, 28645, 4559, -3377, -5226, -27337, -28953, -26768, -26588, -43855, -26239, -29911, -10657, 14333, -5636, -35293, -26547, -13118, -5231, 14810, 37901, 13846, -17431, -1331, 469, 2334, 22678, 7989, 17380, 15683, 22554, 29980, 67156, 73269, 50165, 10495, -1637, 8009, -6910, -15991, 3651, 9720, -846, -18037, 12136, 27403, 54968, 48991, 2174, -12982, 1408, 6391, 17370, 24531, -4781, -14025, -8775, -21916, -22414, -14376, -8449, 5917, -6819, -19862, -22336, -17547, -458, 4682, 9823, -11594, -36624, -51738, -54104, -34496, -18111, -8544, 8523, -6194, -15192, -12525, 5375, 21127, 10147, -8119, -934, -13093]
20054a3093q92J5634L1302K5363k0624j8421k7726k1709j865K1890K0298j1160
20042a003r916O80K4673L9220j8506j1560j0773o344j9596p442J3519o77m013
20029a1738r97j3848j3219L0315J8448j0614O71m620j5390M508j18j4856O84K3209
20015g565J8422j075K8602o000k8100m128P447Q285k1188r247J0783L4239q644
20002B1831l0552M58J1673J1764K2224M922m443J8670p399L212l0641k1553j8023
19989a7857Q761J2903k675q026J7667J4596n52l408j6298q143K253J3302n173
19976G350j3249L489J2142q721k2857Q47k3357j7054m006K0106l92L8567J8042
19963A0907j5375O601r262q094P52K1029o149j8433J4058k3679j0280j0972K3049
$$ y = [-13093, -13985, 1649, 32951, 58314, 37690, 19269, -8457, -30166, -32031, -10141, 10157, -1003, -10919, -10239, 14434, 53654, 35148, 23588, 12815, 6471, -13125, -20567, -7048, -7725, -11738, -12735, -26583, -39802, -9487, 8961, -1653, -982, -5602, -20992, -16484, -16602, -31458, -30774, -7565, 10857, 9782, 38384, 32384, 4284, 156, 7603, 15888, -5300, -14547, -3764, 30475, 21831, -8721, -8263, 3410, 15174, 37398, 42320, 37877, 56547, 49148, 52360, 21719, 166, -17857, -9096, 3807, 1132, -6894, 10773, 25369, 24817, 21409, 5111, -3032, -779, 12523, 7350, -5899, -2410, 9732, 1011, -21846, -20999, -44356, -61410, -65416, -45310, -45702, -7135, 10907, -4468, 2133, -7129, -15223, -14471, 6558, 409, -18024, -3966, -27645, -37925, -48897, -25848]
19950b5848J5794O87J8173o782Q334j0756N605J4621J9711P857n405l91k3956
19937A7644N046p902j1309Q682J1601K4890Q66j4962K0210K650l0258J5045j1529
19924C0674p115k0507J1052k844j1674l8727o113M3792N061L417K6195j4342j9887
19911a018j555n088j25K6701J1935j1030r939R45N71J4507M864M860J0006K6084
19897G1718o577k8330l262L737L462j5500n687Q077K1067m249j5554P193o721
19884B9374n950N886K0l960j9688J5229J2416q492k6926J0503L9003p596j824
19871C7995j5688k7131j5054j2591j5082L0154N7302N625k4770n904J368L3507
19859D9731K8067K344j5244k2687k0568k2081q091N829k2677Q355j3913K0950
$$ y = [-25848, -10054, -9367, 8806, 2024, 10358, -398, 5207, 19828, 39539, 47396, 41991, 41600, 17644, 22690, 14788, 3479, 12161, 23762, 48652, 49518, 34556, 54766, 57416, 27158, 42203, 30674, 23559, 3052, 14104, 11260, -414, -39141, -45254, -1462, 3599, 7016, 33211, 18869, -1018, -2573, -7661, -7786, 18915, 30850, 19820, 9881, 10826, 11397, 25904, 30768, 35628, 45634, 71718, 65141, 36811, 33549, 37286, 40748, 25248, 19561, 27638, 48705, 44456, 28902, 36095, 29374, 23424, 29310, 29330, 25370, 5682, 20911, 33327, 24835, -2091, 8412, 47415, 39819, 37995, 22307, -4824, -19878, -32469, -47551, -17397, 39905, 45530, 20760, 14856, 16224, 49731, 77798, 80142, 64898, 42211, 21643, -438, -8529, -2700, -25377, -17022, -30935, -9985]
19847i985J9771j3146k6053K6378J8221L264k0311K359L5682p397k6085k9766
19835b7068k6707K5261N6770J6751j6699j7147r693j2242j5110k0552q250J8684
19823c6002R646L4049l967J642K0498j7624j7541J8180J354J1147m795j8711J5808
19810A3684L9140J2780k3848k0557l6658j1906N1669K2956K872Q18j6662K962
19798C7250j00R04j7858K524J1963n447r637o314r33p830M235M07K064K3275k533
19783C1970k3365k2690J1232J1976J3125Q436J0628K0660m364q699l0742j6507
19771A660J847Q011J7294L102R317K847L4040O280k6591j3422k5329q06r782K939
19757A1407P228j864j0345L573o503Q33l1953J0142R062Q680K9361k333J3360
$$ y = [-9985, 9786, -3360, -29413, -3035, 15186, 18450, -1861, 498, 36180, 28783, 2698, -27068, -53775, -28514, 28256, 45007, 28308, 11161, 1468, -10774, -25884, -46436, -54686, -36002, -26356, 7693, 3726, 5368, 25866, 8242, -9299, 8881, 10235, 21382, 16587, -2124, 13684, 52824, 65604, 41756, 21199, -15459, -27365, 24304, 47260, 50132, 50950, 34288, 37250, 37150, 38054, 20196, 22720, 34683, 29236, 19599, 13285, 12352, 4522, 8757, 9164, 11228, 34503, 31970, 8605, -14085, -2853, 9123, 22248, 30684, 41312, 61972, 57608, 48909, 18167, 1660, 3507, 11518, 28812, 31914, 41231, 44078, 78118, 84398, 57807, 44385, 19056, 18250, 8468, 11407, 18635, 16771, 6426, 9999, 3496, 4329, -27624, -17482, -8420, 260, 29621, 27288, 40648]
19744D0648K3035J496q360O147k2025Q034k4736k9966j1076J2144J2434P589K749
19731A8113J1498J8965o194k6713m825O74j714L445J5288O208J7871l740O611
19718E5487n711L415J468k1511l271K4717k0320q679J2603j3899O338Q46N440
19705C6923k207J253k733m989L262n528j0647m752J0661K3060K3317O641J5066
19692H9327j8818k0218l7324Q865L3522r089J8006J7454P839j5289k6706J5354
19680F2923P363l483m443j4713j5820j2189J2036J0709j8021N106K4947j6500
19668C7915o395J8148k826L765J2242j175J2490n356j4654m8205P58J3904l1937
19655a1326L013L1364q286j7899J2704K2247N060J783J0060Q080j0012J3328j4534
$$ y = [40648, 63683, 65179, 56819, 62966, 40941, 48975, 24239, -5727, -16803, -4659, 7775, 15364, 18113, 29611, 48576, 42382, 15669, 10844, 11518, 9804, 13249, 28537, 34745, 52616, 48876, 55487, 49776, 53191, 54659, 33148, 29877, 54594, 34274, 25595, 38198, 24299, 30637, 31483, 36923, 34716, 35969, 33236, 28247, 31509, 25981, 15334, 10582, 21243, 44303, 67620, 74261, 89327, 70509, 50291, 12967, 21832, 55354, 46265, 64271, 81725, 89564, 74275, 47569, 62923, 70286, 66803, 62360, 47647, 31827, 19638, 31674, 42383, 24362, 29468, 54415, 37915, 31520, 49668, 46842, 50607, 62849, 61674, 74164, 68808, 54154, 5949, 6707, 20611, -11326, -8313, 23051, 14765, -3134, 9570, 31817, 36877, 38660, 48720, 56800, 46788, 60116, 45582]
19642D5582k2332K0358r683m3095J052p991K1383K1689J0809J7132m318J4611
19630F5197j970k9143k642Q353q308J3995K0419K2261k2020n289J2317k6539k3181
19617B3450k373p643R477J4238L450k9012m612L3321l514J468Q51j0165j5337
19604A3599P606j4185o619J6453J5635j6539L378R181J7830L2628K4310q706j8178
19591G6393l6263j180O682Q839M000r492O264K667r691j1624r467j6907K4508
19578C4729j7633l5527L3661K2928K6531p960k5089j2684j6258J6335O974j4286
19566A1721k517J5153K4272J1694j7769l531J8184K675p8O032J5069J4061m723
19553I0243j1617P448j8710k2003p142J2513l2156j8024K0664K742R788k751r372
$$ y = [45582, 23250, 43608, 33925, -9170, -8118, -16109, 5274, 26963, 37772, 54904, 50586, 65197, 63227, 34084, 31442, 39795, 31487, 45482, 65901, 88162, 66142, 60853, 73170, 46631, 23450, 21077, 13434, 22911, 37149, 40599, 11587, 6975, 40296, 36782, 38250, 39101, 28936, 13599, 21205, 7020, 401, 16854, 32489, 15950, 19328, 28509, 46339, 78967, 103277, 94571, 76393, 40130, 38950, 45632, 54471, 58471, 48979, 55243, 57910, 48219, 36595, 27128, 10221, 34729, 17096, -18431, 15230, 38158, 64689, 56729, 31640, 18956, 2698, 19033, 26007, 11721, 9204, 24357, 48629, 60323, 42554, 39023, 57207, 59882, 59804, 65836, 80905, 94966, 90243, 78626, 86074, 67364, 45361, 38219, 50732, 18576, 552, 21216, 23958, 33746, 30995, 21623]
19540B1623J2002J1525j5505J2383R24r077K496q629l569Q736J8271K6423O90
19527G8293k7797j3287k3176K4929J5249K0968J0889l1491m762O273n700K0937
19515G1325K5095K5558n795m129q655k2415n308K0685J937k8431k2334k2642J2688
19502C7579M6283J2584l0447l609L105j441j0450N771J8433K6670j336k9543k5827
19489D7772j9324K5523J8804j9238l0970J5475m645L922n414J8978J300K7989
19477H0172L1397q787j7542m940J707j756j3094R947j057J1156R687o898k936
19464H7056n550M731R670M496q163j6727p113J11R17j0762K042K3774Q329j0007
19450H2804j1235l0996j884P585J7522J7493K0717L6778K0161K072m6941m1604
$$ y = [21623, 33625, 45150, 29645, 42028, 42952, 33875, 36371, 27742, 24173, 32909, 51180, 77603, 78293, 50496, 37209, 14033, 38962, 54211, 75179, 86068, 54577, 49815, 56088, 50388, 71325, 96420, 121978, 116183, 112054, 103399, 80984, 75676, 96361, 98298, 69867, 47533, 24891, 37579, 83862, 96446, 65999, 62390, 65495, 64054, 53604, 59375, 77808, 104478, 103142, 73599, 47772, 28448, 53971, 72775, 53537, 22567, 38042, 33397, 37319, 31905, 50883, 52183, 80172, 111569, 102782, 85240, 80300, 82007, 80251, 67157, 77104, 76047, 87203, 96890, 89992, 87056, 81506, 86237, 95907, 100403, 92240, 75513, 68400, 68511, 69428, 58666, 60708, 84482, 92811, 82804, 71569, 40573, 38689, 46274, 63796, 81289, 102006, 138784, 158945, 161017, 114076, 72472]
19438G2472J0097j200J7156o64l599J8132K754n804M828l9385n809K8565j3327
19425H4216j4546j0280n564P909l014K5981K237L935R17m833J1029j4927j6269
19412F6791j2742m423J171n143k774L0010J8124k1758l0245J4261K7318L2607
19400A13197k095j0304K7504Q816k1498j4993k9896l5280j2597J5462K4643O9
19388F3028O492Q095l0368o135j3713R040L3684N620j1172k880J3372N20J6124
19375I1707J6918K909l3686j5425J1641K4815j7559l1609J5768K4224J2287j293
19363A00697j1070J4264p614k4282o24J4764K3327o140j396J1332K802j5749m3655
19350E6656k035J2512L29M0487J7904R691K070J4981j6187j9285K9768K4344l2546
$$ y = [72472, 82569, 81369, 98525, 97861, 94262, 112394, 115148, 109344, 114172, 74787, 68978, 97543, 84216, 69670, 59390, 53826, 61735, 58721, 84702, 86939, 90874, 91791, 86958, 97987, 83060, 66791, 54049, 49626, 50797, 45654, 42880, 72890, 91014, 69256, 39011, 53272, 80590, 113197, 111102, 100798, 128302, 137118, 115620, 100627, 70731, 35451, 22854, 38316, 62959, 63028, 69520, 77615, 47247, 41112, 27399, 36439, 70123, 75743, 64571, 61691, 75063, 75583, 91707, 108625, 111534, 77848, 62423, 74064, 98879, 81320, 49711, 65479, 89703, 101990, 100697, 89627, 103891, 96277, 71995, 71371, 86135, 109462, 103322, 101926, 113258, 116060, 100311, 56656, 54621, 67133, 67462, 107949, 125853, 135544, 137614, 152595, 136408, 117123, 146891, 171235, 138689]
19337A38689m2750K7572L2413K474P210K0377L0196L6065L8026J9190L6104M6440
19325C92006J03761J58759K21451J59821M0012j5617N5189J09947J50131J05182
19315A480642O7610m4928j60829j59055m3701l541m7667j14403j81048j83567
19305F09513j34151q9610m2816o1038k5997k0822j020j510n35k174k834k320L922
19292B28608K1984l449k4412k1492K335j720O899K6193R712O524J161J2753M226
19279B69322J4355L3624J8482O6551J41425J60426K05016K28485Q2334n965k5950
19268A188105Q0211J66732J40596J15118R23j58778j88999r0518l068K9954j10033
19257A170243j91519k12084j82379j44332p9354n6113k8379l342K6024L7319P0129
$$ y = [138689, 95939, 123511, 155924, 158398, 165608, 185985, 216181, 252246, 290272, 309462, 345566, 392006, 495767, 654526, 875977, 1035798, 1075810, 1060193, 1115382, 1225329, 1375460, 1480642, 1548252, 1503324, 1342495, 1183440, 1139739, 1136198, 1088531, 974128, 793080, 609513, 475362, 385752, 342936, 281898, 255901, 235079, 234059, 232549, 232014, 229840, 227006, 224686, 228608, 250592, 247143, 222731, 201239, 203574, 201854, 208753, 234946, 244658, 251182, 252343, 265096, 269322, 283677, 317301, 335783, 402334, 543759, 704185, 909201, 1137686, 1220020, 1214055, 1188105, 1268316, 1435048, 1575644, 1690762, 1691685, 1532907, 1343908, 1253390, 1250322, 1280276, 1170243, 978724, 766640, 584261, 439929, 360575, 304462, 276083, 272741, 298765, 336084, 406213]
19246D06213O7721R7237J69122R9900l1103p1127p7227m6313J8007R8069J07945
19235H38444K0206r4177j21507j26741j11835q2118o1864r191J074o875m231p069
19223B34116P578K9889l416J3597j0418k9724K5343j06j6768l019N368J513k3112
19210B30841l460M0405K2220O417M889j8989M3508P9567P4253J01291J44206J79340
19198I04488R7794m5287m4569l1631P161P4310K07767K46794K20961O0361j42299
19187A555850k13386j74327j30738k0192O7551J36098Q1397l4013p4548q0176
19177A113516K84J03138J14378K7812L2112J20674K19733J57689m4148j70758
19167A674430k03811q4870k9688j06200j77678k12053j81048j40151q9616k9280
$$ y = [406213, 473934, 571171, 740293, 840193, 809090, 737963, 660736, 614423, 632430, 730499, 838444, 858650, 764473, 642966, 516225, 404390, 322272, 260408, 251217, 252291, 245416, 241185, 234116, 241694, 271583, 268167, 281764, 271346, 241622, 266965, 266859, 250091, 247072, 252440, 253953, 230841, 227381, 267786, 290006, 296423, 301312, 282323, 325831, 405398, 479651, 580942, 725148, 904488, 1002282, 956995, 912426, 880795, 887956, 962266, 1170033, 1416827, 1637788, 1698149, 1555850, 1342464, 1168137, 1037399, 1017207, 1084758, 1220856, 1302253, 1268240, 1193692, 1113516, 1113800, 1216938, 1331316, 1359128, 1391240, 1511914, 1731647, 1889336, 1845188, 1674430, 1470619, 1385749, 1356061, 1249861, 1072183, 860130, 679082, 538931, 449315, 420035]
19157D20035m6228r384k915K3991O377Q787L6030L5430J7384O9022J08287J72386
19145H39202K21691J11282j460j07056j35073o8796J3433J12530J68547O1892
19135A216192m7681j29306k05402j50936p3603p1041m8291j6897J0930N8529P5826
19124F18320J58349K24679K51335J85054R0706J11548J72510K89830J99842p1456
19114B230717k44980k29607j20444o9636j33879k19865k35321k06512j55903j08308
19104E06262o6360l5301l2190l0756k3638j5380J3835j8779l2011Q375Q407p96
19092B81668K599j7289N469k290j1081n345j150j215k2148j7430k4341P069K5287
19079B19803L5809L1094K2220j0027k6704p485n136K8412J9332n056J5384O941
$$ y = [420035, 373807, 364423, 361508, 385499, 391876, 400663, 436693, 472123, 489507, 558529, 666816, 839202, 1060893, 1172175, 1170715, 1063659, 928586, 859790, 873223, 985753, 1154300, 1216192, 1168511, 1039205, 833803, 682867, 609264, 538223, 489932, 473035, 483965, 542494, 618320, 776669, 1001348, 1252683, 1437737, 1528443, 1639991, 1812501, 2102331, 2302173, 2230717, 1985737, 1756130, 1635686, 1566050, 1432171, 1212306, 976985, 770473, 614570, 506262, 439902, 404601, 372411, 341655, 318017, 302637, 316472, 297693, 265682, 274057, 282464, 281668, 284267, 266978, 272447, 270157, 259076, 253731, 252581, 251366, 229218, 211788, 187447, 194516, 219803, 255612, 286706, 308926, 298899, 272195, 264710, 259574, 287986, 307318, 302262, 317646, 324587]
19067C24587O725N600O405k7128k3599L261m526N1801J8034l169K4881o806k4180
19054C51886j0281J6125J6809K8312J3471n749p375J4384k4525j1306j284j0742
19042C69725j7029j8623m523L5738O2795K4821p90o679R044J7426p552l3059j8668
19029D12626J4978P631k0842k050P481M016J1038J6464L12M1434J7252j2064J5432
19016E13708K2276J9850J7595J423j1718j4989q964j9087J4959O0966M3994K9094
19004F69107J3987K491j1148k5302J8791j9538j8407k988j7911K1811R363j1935
18992F28321j288o305P240J2406J032q069m4713l0608m819J5426O797k4422j5799
18979E35199n184n706m7708J0385K6439L1673K5680q699j5603j5650K2111N4289
$$ y = [324587, 331312, 336912, 343317, 316189, 292590, 295851, 291325, 343126, 361160, 357991, 382872, 376066, 351886, 341605, 357730, 374539, 402851, 416322, 410573, 403198, 417582, 393057, 381751, 380467, 369725, 352696, 334073, 329550, 365288, 428083, 452904, 452114, 445435, 454479, 471905, 464353, 431294, 412626, 427604, 435235, 414393, 412343, 419824, 423840, 434878, 451342, 451654, 493088, 510340, 498276, 513708, 535984, 555834, 573429, 574852, 563134, 548145, 539181, 520094, 535053, 596019, 640013, 669107, 683094, 685585, 674437, 649135, 667926, 648388, 629981, 626993, 609082, 630893, 640256, 628321, 627033, 620728, 627968, 640374, 641406, 633337, 588624, 558016, 553197, 568623, 575420, 550998, 535199, 530015, 524309, 476601, 486986, 513425, 545098, 570778, 562079, 546476, 530826, 552937, 607226]
18967F07226R906J039M0046J3305J9056K3418l332o540k3955O841K5205N9630
18955G71845O4165O6688R2767P2217Q5292P4180j5364J7825N7691N7938L5045
18944A380289J3799L3021L448j6927J361k1712r205j3927m9626o1926q3018n8730
18932A116847m2488m8734p0864o5746k3445J2369J7953j4131k9397k2321l4252
18921G95791k2544J1725K0051J4220M4074j1007J6072K5412K1773M3244N5008
18910A013819M4222N404k4360J3845N1903M2459L4515M7170J26183J35351R0287
18899A580798N0122N3441P9710P8548Q7047N9453O6101P5176Q419M477L5161L3298
18887B211751l1918q7214j19131r6286j01788o8848n1961k0217L5489K085m3411
$$ y = [607226, 617132, 618171, 658217, 671522, 690578, 713996, 710664, 704124, 680169, 687010, 712215, 771845, 836010, 902698, 995465, 1067682, 1152974, 1227154, 1211790, 1229615, 1287306, 1345244, 1380289, 1394088, 1427109, 1430557, 1413630, 1414991, 1393279, 1384074, 1370147, 1320521, 1258595, 1175577, 1116847, 1074359, 1025625, 954761, 889015, 865570, 877939, 895892, 881761, 852364, 830043, 795791, 773247, 784972, 805023, 819243, 863317, 852310, 868382, 893794, 915567, 958811, 1013819, 1058041, 1063445, 1039085, 1052930, 1104833, 1147292, 1181807, 1228977, 1355160, 1490511, 1580798, 1630920, 1684361, 1764071, 1842619, 1929666, 1989119, 2055220, 2130396, 2138815, 2143292, 2178453, 2211751, 2179833, 2092619, 1973488, 1877202, 1775414, 1706566, 1654605, 1634388, 1669877, 1671962, 1628551]
18876A628551l7369k9355k6046m9250n9587l9510K7800O1450M7699k2894j6367
18865A485122j1940Q40J7000L8569M5918P0570N4135M9468M6128L9174J04279
18854A939263J25011Q7351K445k1030q507L853N3959Q3674R4339J23137J61520
18843B645015J55320J38150J53310J75011K06378J34264L6821l0751l1254L3916
18833C616180N6426Q1612J16451J86274K81145L41006M50242N61977N27708M01538
18823F620559L00339K30564K63617L78065M92394N47929O30742N62703N24960
18814A0551872N59552O78266Q77700J081864J393099J668577J907598K290113
18806B1008641K898465L718857N003498O967609J0399773J6490326K6079483L4161157
$$ y = [1628551, 1591182, 1561827, 1535781, 1486531, 1426944, 1387434, 1415234, 1476684, 1524383, 1501489, 1485122, 1473182, 1474022, 1491022, 1529591, 1575509, 1646079, 1700214, 1749682, 1795810, 1834984, 1939263, 2064274, 2151625, 2154070, 2133040, 2124533, 2128386, 2182345, 2266019, 2360358, 2483495, 2645015, 2800335, 2938485, 3091795, 3266806, 3473184, 3607448, 3644269, 3613518, 3582264, 3616180, 3672606, 3754218, 3870669, 4056943, 4338088, 4679094, 5129336, 5691313, 6219021, 6620559, 6920898, 7151462, 7415079, 7793144, 8285538, 8833467, 9464209, 10026912, 10551872, 11111424, 11789690, 12667390, 13749254, 15142353, 16810930, 18718528, 21008641, 23907106, 27625963, 32629461, 39597070, 49996843, 66487169, 92566652, 126727809]
18798A26727809K4611470N891265M24899O554902K1418086K8613085K1692650
18791B35934166J4933590p386783k7288574k6055130j3200022M528867K475415
18784A83941529j9012748l0121637l2281575k7639777j9650151j2952101q130786
18777C4152754n049405l127283j901601j247703q66074p85385q99307o23986j26486
18768A9525524L59276M62939J80833J218L7694J82110N43387J053048J431623
18759B3777652J683277J692479J919071K676294L996625N766529Q114318J1864933
18751F1491178J8245771K8506905L9462263L4089980J2796298M108737J0382325
18744B09083457K9639582M9738417N1824740L7475690k785904l9719544m4424494
$$ y = [126727809, 151339279, 157230544, 157655443, 164210345, 185628431, 214241516, 235934166, 250867756, 243480973, 216192399, 190137269, 176937247, 181466114, 183941529, 164928781, 134807144, 102525569, 74885792, 55235641, 42283540, 34152754, 29103349, 25976066, 24074465, 22826762, 21960688, 21175303, 20275996, 19652010, 19525524, 19884800, 20347739, 20528572, 20529790, 20567484, 20749594, 21292981, 22346029, 23777652, 25460929, 27153408, 29072479, 31748773, 35745398, 41511927, 49626245, 61491178, 79736949, 108243854, 147706117, 181796097, 194592395, 198701132, 209083457, 238723039, 288461456, 340286196, 377761886, 374975982, 335256438, 290831944]
18737B90831944k8038725J179230J4168694o259149l0594927m6238163m7761910
18730A47286994l9616764k8980798j9469126j2564556q123184n387816l801581
18723B9343169k899952k270148j897238j574052j091238o22985m85787n50867
18715A7950902l22959m6018L3948K3186O1538J45237L21218O43804J180507J959616
18705B1950979K917182M531373P503939J2232320J5961804R967915j594882p087433
18697F6383197q012120m827419O81368O765934J0816988R564681R387275J5816619
18689A06576523K9184674M4342896L5804976L2523k2778548k9237471k2302138
18682A41623435m803214J7375914L4687227K1542904j3362575l2429935l8532529
$$ y = [290831944, 262793219, 263972449, 278141143, 271881994, 241287067, 195048904, 147286994, 107670230, 78689432, 59220306, 46655750, 38532566, 33144750, 29343169, 26443217, 24173069, 22275831, 20701779, 19610541, 18987556, 18501769, 17950902, 17627943, 17581925, 17615873, 17639059, 17700597, 17845834, 18167052, 18810856, 19991363, 21950979, 24868161, 29399534, 36903473, 49135793, 65097597, 75065512, 73470630, 66383197, 58371077, 53543658, 54225026, 60990960, 71807948, 81372629, 90759904, 106576523, 135761197, 180104093, 215909069, 215941592, 193163044, 163925573, 141623435, 136820221, 154196135, 188883362, 210426266, 197063691, 164633756, 126101227]
18675A26101227l4049703k4363032j5684120r577679n898597l890596k818363
18668B9819137k146353j743179j269593n76132R7272N63032O54886P60952J042966
18659B7202988J567616K403654L376880M210052M943061O166628Q039368J0836869
18651F8747116J5645780K4052901L8276901N9586660P4680508M6925472n933343
18644C21981995l2805644l7665472k2750260N694850L8888752N7974937L7408698
18637C68727856J3564702J1380712k280411k7407107l1382631j6797657J0348348
18630C26153812K5201311P846681k75692J3581232K4377951j22010l0374409l4348795
18622C32040081j8713190P427547N169631l0237222n1242181n6318290m9678954
$$ y = [126101227, 92051524, 67688492, 52004372, 42426693, 36528096, 32637500, 29819137, 27672784, 25929605, 24660012, 24083880, 24181152, 24744184, 25399070, 26160022, 27202988, 28770604, 31174258, 34551138, 38761190, 43704251, 49870879, 57910247, 68747116, 84392896, 108445797, 146722698, 206309358, 280989866, 327915338, 321981995, 289176351, 251510879, 228760619, 234455469, 273344221, 331319158, 368727856, 382292558, 393673270, 391392859, 363985752, 332603121, 315805464, 326153812, 351355123, 359201804, 358926112, 372507344, 396885295, 396763285, 366388876, 332040081, 313326891, 320754438, 325924069, 295686847, 244444666, 188126376, 138447422]
18615A38447422l6266937k4566975j6578193j1505775q372613o155923m335053
18608C0665953l066397k474698k155971j841741j692655j509473j268245r66658
18600A5690115o33231m98228n29669n47365m32711k27973l4557J93176N15395
18591A3494952Q14721J074160J337706J795396K572582L783176N659827Q798951
18583C9331471J4295498K0650563J7667419L652176l895433l438200L410130Q360751
18575A00034375J2793p788799q041576o189953p324397r224368p903241m547004
18567D9027830M9537L34706m714263p554849q114898p164920n216981l465007
18559A3181155k258682j568656j198210r27966o59214m63012l63253l53895l96974
$$ y = [138447422, 102180485, 77613510, 61035317, 49529542, 41156929, 35001006, 30665953, 27599556, 25124858, 22968887, 21127146, 19434491, 17925018, 16656773, 15690115, 15056884, 14558656, 14028987, 13481622, 13048911, 12820938, 12786381, 12979557, 13494952, 14309673, 15383833, 16721539, 18516935, 21089517, 24872693, 30532520, 39331471, 53626969, 74277532, 91944951, 95597127, 91701694, 88263494, 91673624, 100034375, 100047168, 92258369, 84216793, 78026840, 70702443, 61478075, 53574834, 49027830, 49077367, 49412073, 44697810, 37142961, 29028063, 21863143, 16646162, 13181155, 10922473, 9353817, 8155607, 7227641, 6568427, 6105415, 5742162, 5388267, 4991293]
18550D991293l68847l73902l38414k53448j96264j39612j27967j50802j60573
18541B881464j27215j31128j65499j61798j10245o8669m1843l5621m9881k5559
18531A964006j9378m1555n7165o2637l8128m7971l8217k2142j568l3989n9878
18520A541378k4789k2006L0748L3230j0791l7719n4851o6925o9299m8576n4328
18509A216072n810N140J5782J5750J867J6988J3004k3033l8166n7662m6235m7826
18497A065871k4709l5159j1629J9920k5055m4646k1773p843j1706m501j8135l1949
18485H48686n7192j5293M0895K3991J8301J5149M5519J4834r584k7900q107j1658
18473H77641K5851k0714n0248m9487J357L7076K5853J3735K0966N0204L8043K5102
$$ y = [4991293, 4622446, 4248544, 3910130, 3656682, 3460418, 3320806, 3192839, 3042037, 2881464, 2754249, 2623121, 2457622, 2295824, 2185579, 2116910, 2075067, 2039446, 1989565, 1964006, 1944628, 1903073, 1845908, 1783271, 1745143, 1697172, 1658955, 1636813, 1635245, 1601256, 1541378, 1516589, 1494583, 1525331, 1558561, 1547770, 1510051, 1455200, 1388275, 1318976, 1270400, 1216072, 1210262, 1215402, 1231184, 1246934, 1248801, 1265789, 1278793, 1255760, 1217594, 1159932, 1113697, 1065871, 1041162, 1006003, 994374, 1014294, 989239, 944593, 922820, 914977, 903271, 898770, 880635, 848686, 791494, 776201, 817096, 841087, 859388, 874537, 920056, 934890, 925306, 897406, 889299, 877641, 903492, 882778, 832530, 783043, 784400, 821476, 847329, 861064, 882030, 932234, 970277, 995379]
18461I95379K9989l1976k5306m3816j9881L1025L1422J144l0363n291m964j8898
18449I08464j9303l0080M86L295J8002R331O547L7570M6669R082o238O9293O1211
18436A114329M6875Q0077J47842J65880K70901M15868O37046J009709J351398
18427E239925Q72165j77307q30102j071176r70703p05021m30165k73359j46082
18418A508175j04565n5307k2141L3661M3595K3880L3588N0907O3084Q9220O5665
18407A729762K6398L1593L5562K0692L2310O2010M6757K1749O5849R7740J46943
18396B317365K05505K48136L26974L87094L56564K18037J82968K10524K63398
18387D716565K49129J86595K22046L60961N17052N40205N00424M89836M95379
$$ y = [995379, 1025368, 993392, 968086, 924270, 904389, 935414, 966836, 967980, 937617, 932326, 927362, 908464, 889161, 859081, 859567, 862862, 880864, 890195, 896742, 934312, 980981, 990063, 983825, 1053118, 1114329, 1161204, 1241281, 1389123, 1555003, 1825904, 2241772, 2878818, 3888527, 5239925, 6112090, 5934783, 5104681, 4033505, 3062802, 2357781, 1927616, 1654257, 1508175, 1403610, 1348303, 1326162, 1359823, 1403418, 1427298, 1460886, 1511793, 1574877, 1664097, 1729762, 1756160, 1787753, 1823315, 1844007, 1876317, 1938327, 1985084, 2006833, 2072682, 2170422, 2317365, 2522870, 2771006, 3097980, 3485074, 3841638, 4059675, 4242643, 4453167, 4716565, 4965694, 5152289, 5374335, 5735296, 6252348, 6792553, 7292977, 7782813, 8278192]
18378H278192O84299J102411J607920J902871J516777J183811J273627J806366
18370A9356274K811245M015314N599502Q182901J2348447J9639860L2107006M4880307
18362A48940856L4435273m29502k2085897k9328965k5826100j5119922k642213
18355H7943530J1183586K6424520L2606459J2017171j5527832k8665132l1725153
18348I4257149k6486801j8703139j2204679p583989m581686k689448j666638j288183
18340A9052586r55515n31430m4950K10109J60324J87445N24322J123272J493251
18331B1219414J451700J499347J796242K643565M229675O798596J0894600J7499684
18323F8032823K8328917L8058133K5186213l186048j6853674j9605970j2786288
$$ y = [8278192, 8962491, 10064902, 11672822, 13575693, 15092470, 16276281, 17549908, 19356274, 22167519, 26182833, 31782335, 39965236, 52313683, 71953543, 104060549, 148940856, 183376129, 182946627, 160860730, 131531765, 105705665, 90585743, 87943530, 99127116, 125551636, 158158095, 170175266, 154647434, 125982302, 94257149, 67770348, 49067209, 36862530, 29278541, 24696855, 22007407, 20340769, 19052586, 18097071, 17565641, 17520691, 17730800, 17891124, 18078569, 18602891, 19726163, 21219414, 22671114, 24170461, 25966703, 28610268, 32839943, 39638539, 50533139, 68032823, 96361740, 134419873, 159606086, 156420038, 139566364, 119960394, 107174106]
18316A07174106j98049J5160778L5778109N9311626N7297258Q312419l2645047
18309B50191200m8159484m7649856l4567127j8870923l713828J1480583K2916091
18302A31626656J5217687p935314k1767679k6371587k4029783j7817279j2058745
18295C6863956p777175m889903l004314j861285j329552j008083q02881n47177
18287A5643586k47672j59452j24136K32820Q16351J140917R21796O68723P96883
18278A9689816J434152K641607M517962P599648J2679768K1007553K9733687K1819674
18270A21123867k426760j5774920j9658959j6273428q666769p49365P919181J8305898
18262H3798745K3659053R005657j1074269j9742816k1781102j8161973j2885775
$$ y = [107174106, 106976057, 122136835, 157914944, 217226570, 274523828, 282836247, 250191200, 202031716, 154381860, 119814733, 100943810, 97229982, 108710565, 131626656, 146844343, 138909029, 117141350, 90769763, 66739980, 48922701, 36863956, 29086781, 24196878, 21192564, 19331279, 18001727, 16993644, 16190763, 15643586, 15395914, 15236462, 15112326, 15345146, 16161497, 17302414, 18224210, 18892933, 19689816, 21123968, 23765575, 28283537, 35883185, 48562953, 69570506, 99304193, 121123867, 118697107, 102922187, 83263228, 66989800, 58323031, 57573666, 65492847, 83798745, 107457798, 116463455, 105389186, 85646370, 63865268, 45703295, 32817520]
18255C2817520q495993n380671l395474k362941j723833j150197o10327k64617
18247I433467j96222m65581o59695o15624m32435l45568l37800m07071m89619
18238E483852n04315m28323l27768k83531k45481j79739j11997j54041k00630
18229C048027k02819k10102j87775j41469p9399n1692o5724q4976n0029l6470
18219A937572k5415k352M0677J27994J41093K10486L28353L22116J34393R025
18209C223942k9938p1540j23601j11690l1655O6307J87457K03290K07480K58192
18199C778244J98860j55416m64183n43204m63840l83016k03186j17831j17306
18190A529122j12174r6293r1007m0151o1146o3724j2564L959O691q356j8456k3788
$$ y = [32817520, 24321527, 18940856, 15545382, 13182441, 11458608, 10308411, 9698084, 9433467, 9237245, 8771664, 8111969, 7496345, 7063910, 6718342, 6380542, 5973471, 5483852, 4979537, 4551214, 4223446, 3939915, 3694434, 3514695, 3402698, 3248657, 3048027, 2845208, 2635106, 2447331, 2305862, 2226463, 2174771, 2109047, 2024071, 1974042, 1937572, 1912157, 1909805, 1950482, 2078476, 2219569, 2430055, 2758408, 3080524, 3214917, 3223942, 3194004, 3122464, 2998863, 2887173, 2855518, 2921825, 3109282, 3312572, 3520052, 3778244, 3977104, 3821688, 3357505, 2814301, 2350461, 1967445, 1764259, 1646428, 1529122, 1416948, 1320655, 1229648, 1189497, 1128351, 1064627, 1052063, 1056022, 1062713, 1054357, 1035901, 1012113]
18178A012113k8947k6533K9951O886J3834L7996N5330R0941R7719J70394K64986
18167A724670K27556J32166O8087J9439J4949J43j5403P2478K09140J81972p3507
18156B561690k45537k73126k90944j67841k4179O3842O8333j2802j27855j95574
18146A356007k02628j46362r4134n8158m1438m0783o072J6415K5451K4093l355
18135H29036J2537M7846M3337J0309J9567L0361K2592N8444P7744N3778R8352
18124A303903J37795J49036J46321K30144L11680M01281M82440N60439P29819
18115D452858R80367J344703J956394L043080N279610R482861J3189137P043089
18107D6772099l792443q208394r415273p828576n344187l316931j884564j017023
$$ y = [1012113, 983166, 956633, 986584, 993470, 1007304, 1045300, 1100630, 1191571, 1289290, 1459684, 1724670, 1952226, 2084392, 2152479, 2171918, 2186867, 2187010, 2171607, 2244085, 2453225, 2635197, 2561690, 2316153, 2043027, 1752083, 1584242, 1560063, 1623905, 1692238, 1679436, 1551581, 1356007, 1153379, 1007017, 912883, 854725, 813287, 772504, 766432, 782847, 808298, 832391, 829036, 841573, 889419, 932756, 943065, 962632, 992993, 1015585, 1074029, 1151773, 1205551, 1303903, 1441698, 1590734, 1737055, 1967199, 2278879, 2680160, 3162600, 3723039, 4452858, 5433225, 6777928, 8734322, 11777402, 17057012, 26539873, 39729010, 46772099, 42979656, 34771262, 25355989, 17527413, 12183226, 8866295, 6981731, 5964708]
18099E964708p46490p33501o56417n10211l49108l11948l28455l23976l15125
18090A689477k52638j72607j25022j04503p9438o6728m9784p2060k8421j6908
18080G21368l5171l5322k1292k7220m0583j007r220o795l1823k4006j2603J728
18068D78054J0545J44k1614m878O114P850j7475J4863p863m076J6450J6919J7123
18055E12156O5858J15027J37629J68873K10679J40388K5492Q5322J86760K30150
18045A878334P0974j32385j81565j41889q6610j15075j62703j76280j33426j33707
18035F85668j26280p4380l4896l2165k9868k880k2120n664N453M922j159k9104
18023C37527k6821k6416j1710j3522j2193M676L609K1224m23k2257R504j51j9021
$$ y = [5964708, 5218218, 4484717, 3828300, 3318089, 2968981, 2657033, 2328578, 2004602, 1689477, 1436839, 1264232, 1139210, 1034707, 955269, 888541, 838757, 766697, 738276, 721368, 686197, 650875, 629583, 602363, 561780, 560773, 551553, 544758, 512935, 488929, 476326, 478054, 488599, 488743, 467129, 462251, 468365, 476215, 458740, 473603, 465740, 461664, 478114, 495033, 512156, 578014, 693041, 830670, 999543, 1210222, 1350610, 1376102, 1461424, 1648184, 1878334, 1949308, 1816923, 1635358, 1493469, 1406859, 1291784, 1129081, 952801, 819375, 685668, 559388, 485008, 450112, 417947, 388079, 385199, 363079, 357415, 362868, 367790, 366631, 337527, 310706, 284290, 272580, 259058, 246865, 251541, 255150, 276374, 275951, 253694, 263198, 263047, 244026]
18010B44026j6421k5274j819J9141K3837k1725j6457L2816L1497O864j9386j1394
17998B45705L346K26k6513j918L955O587j1783M530J0704O229m331R456K0564
17985B66757j3570l4747k7800l0211j1617J4405K7117K3433K2220R311m537k888
17973B37873j9107k2928k8445l2763K6372L5388Q212k4688j0700K7326L0246k56
17961B26530Q31o836N216O287l0141m254J4666j1164j939L166L869k1931j1317
17948A72983q757K6692J2473k3975l1079l4670j1294J242r067n527J4203K2141
17936A25365J8352K9398k6370k8284K5743j5182j677K6298Q529K970J1527J1266
17924A87935j1098L698J5729m305j7782J1083k0831k3464J827J9627j8762o897
$$ y = [244026, 227605, 202331, 200512, 219653, 243490, 221765, 205308, 238124, 269621, 276485, 257099, 245705, 249051, 249277, 222764, 220846, 224801, 231388, 219605, 224135, 234839, 241068, 236737, 246193, 266757, 253187, 218440, 190640, 160429, 148812, 163217, 190334, 213767, 235987, 245298, 240761, 237873, 218766, 195838, 167393, 134630, 161002, 196390, 204602, 179914, 169214, 196540, 226786, 226530, 227361, 220525, 225741, 232028, 201887, 197633, 212299, 201135, 199196, 202362, 206231, 184300, 172983, 164226, 190918, 203391, 179416, 148337, 113667, 102373, 103615, 94548, 89021, 103224, 125365, 143717, 173115, 146745, 118461, 144204, 129022, 127345, 153643, 162172, 165142, 176669, 187935, 176837, 180535, 196264, 191959, 174177, 185260, 164429, 140965, 142792, 162419, 143657, 136760]
17912A36760J2021O18R670o984m0660j1746r24m057k0413J1264K6094R861Q728
17899A30232j6219p546J0064j2589N609K7067J773L061J8852k1415j2206K2469
17887A49152J876k5514L388J8871Q499l12k115j748j8786K526o567J2567m733
17874A37104O147o729j3181j679K003K1477K1362M256p20j0456J6365j7814m4143
17861A13992l845J7914M414J783J7539K4158L1754K1633l535K923K8253M1639
17849B98622L1572N7000R4059J51026K14876P7849l1351o7289j06101k3098K7124
17838G24289R1122J19345M1797r4277j70824j56329j17897r0654p7897l9261m4833
17827A84581o009J1200J8359J0642n856j3885k8345j4918l684L751j5250K258
$$ y = [136760, 148781, 149399, 159069, 152085, 111425, 99679, 98755, 94698, 74285, 85549, 111643, 121504, 130232, 114013, 106467, 116531, 103942, 109551, 136618, 138391, 141452, 160304, 138889, 126683, 149152, 151028, 125514, 128902, 147773, 156272, 155960, 153845, 152097, 133311, 135837, 129270, 141837, 137104, 143251, 136522, 123341, 121662, 123665, 145142, 166504, 170760, 170040, 159584, 175949, 158135, 113992, 110147, 128061, 132475, 134258, 151797, 175955, 207709, 229342, 225807, 228730, 256983, 298622, 330194, 387194, 481253, 632279, 847155, 925004, 893653, 826364, 720263, 697165, 724289, 815411, 934756, 976553, 882276, 711452, 555123, 437226, 346572, 268675, 229414, 184581, 178572, 189772, 208131, 218773, 212917, 199032, 170687, 155769, 152085, 155836, 140586, 142844]
17815A42844K6134M0927J2814J6886J4659J6849K189K4956L3020O7208J14210
17804E12696J74786K04755J12530n535p8427p8111l0616O2675K10650L16999K49771
17793A652173j195k10600k61145k34502j52921l4269O4462P7911J0124p3089j39111
17782F97838j28015j24520j10243p3343m7848n988j0417l908k1010k8255K777
17771A47068K6899j6540l9923j8283q895J7560Q123J9274J7722P093r009R365
17759A60454M7059K2898K4792L7400O7739Q5653J86780J78091j0777p0416q4589
17748F45084q0869n1884K7876J13283J20415O83q6677j39635j30988r4419r1607
17737B31262l8769l8008N990l0597m9516k9271k174j3016n175J4028k939K9230
$$ y = [142844, 168978, 209905, 222719, 239605, 254264, 271113, 273302, 298258, 331278, 398486, 512696, 687482, 892237, 1004767, 999232, 920805, 842694, 812078, 874753, 1085403, 1402402, 1652173, 1650978, 1440378, 1179233, 944731, 791810, 757541, 822003, 899914, 910038, 836949, 697838, 569823, 445303, 335060, 261717, 213869, 207881, 197464, 193556, 172546, 144291, 147068, 173967, 157427, 117504, 99221, 90326, 107886, 116009, 135283, 153005, 160098, 151089, 160454, 207513, 230411, 255203, 292603, 360342, 445995, 632775, 810866, 800089, 729673, 645084, 564215, 512331, 540207, 653490, 773905, 774588, 687911, 548276, 417288, 322869, 231262, 192493, 154485, 160475, 129878, 80362, 51091, 48917, 35901, 30726, 44754, 41815, 71045]
17725G1045J0787J7902J0046Q391R12k0659l6239j8861L511J3563l690J3636K8776
17712I9120K5539j0159j2664k086j3782m626J4216j1573k2374K3292N972j0153
17700H0722L5951p46J2613o778M592k0322m4025J179O940R707J5514l6267j2057
17687D7023L793J6240k525k3231L2152K8872j0357m2490p287M46L1576J4604K875
17674I1691L91r838j742M0508K4333K0430J1124K4848J5952l477n054k1413K1067
17661B08820M1327O76l9970m4889k6224q835m1151q6m785k2633n194L0595j4237
17648G3414j6912k1470Q180N968j6816P229Q924J4155k001o501J370J8236j301
17635G2475J6541P230k5620n2858K326O0802j0321k6802J7476J1529P87p186J3815
$$ y = [71045, 81832, 99734, 109780, 118171, 119083, 98424, 62185, 43324, 46835, 60398, 56708, 70344, 99120, 124659, 114500, 101836, 99750, 85968, 81342, 95558, 83985, 61611, 84903, 90875, 80722, 116673, 115927, 128540, 121762, 126354, 106032, 62007, 63186, 70126, 79833, 95347, 59080, 47023, 50816, 67056, 64531, 41300, 73452, 102324, 91967, 49477, 42190, 42636, 74212, 88816, 91691, 92082, 82244, 80502, 121010, 145343, 165773, 176897, 201745, 217697, 214220, 209166, 187753, 208820, 250147, 250823, 210853, 165964, 139740, 130905, 89754, 89668, 84883, 62250, 57056, 87651, 73414, 56502, 35032, 43212, 49180, 32364, 39593, 48517, 62672, 60671, 54170, 55540, 73776, 72475, 89016, 96246, 70626, 17768, 20094, 80896, 70575, 43773, 61249, 72778, 73565, 66379, 80194]
17622H0194K8071L0606m5207N759L3335M7279l117J8398M2915k1124n5796k7954
17610A33359K4263J6754K3908L0814K2455m7598n5804l3497k3613j8547J777J573
17598G5844k1261J45j1990J5093J4715j7244J446O324p000n951J746J2599L8455
17585A02921k986k1834j8765M053J8804K2008l602j0014k8326J527p328j2361
17573D4097l933M164j5565k751P560R956o43k5105k5656J2612J1851m196L2071
17560D4462J4343j6179n601K5615l39q325j3820l5239N649O1158K4981m887l3447
17547E8371k7440O888O040K027J0666m701J311L6179J3370k6591j4848J3629l448
17534G1453L1522J7145J4237J5353q401j6429l8354N247L0526P231j4711j392
$$ y = [80194, 108265, 138871, 93664, 99423, 132758, 180037, 176920, 195318, 238233, 217109, 161313, 133359, 157622, 174376, 198284, 229098, 251553, 203955, 148151, 114654, 91041, 72494, 74271, 75844, 54583, 54728, 42738, 57831, 72546, 55302, 56748, 63072, 56072, 50121, 51867, 64466, 102921, 99935, 78101, 59336, 63389, 82193, 104201, 100599, 90585, 62259, 63786, 56458, 44097, 40164, 44328, 28763, 26012, 33572, 43528, 42885, 17780, -7876, 4736, 16587, 12391, 44462, 58805, 42626, 37025, 62640, 62301, 53976, 40156, 4917, 10566, 71724, 96705, 91818, 58371, 30931, 37819, 43859, 45886, 56552, 51851, 53162, 89341, 102711, 76120, 61272, 74901, 71453, 102975, 120120, 134357, 149710, 141309, 124880, 86526, 91773, 122299, 129530, 114819, 113427]
17522A13427k786L853l5653m5044l4482Q224m931j3537p606J321J0566J8650J8694
17509C0696K8696J1429k214o423k5k6332P208L627p315L696L1598L126j3503l6057
17495B8207k5801j9734K297K6614J0312L5664L3080j53P841K4553K7977k0018
17483A30839J341J5440J187k9725J465M941k8358m135L5846K2735M881k1433l1905
17470A03119k2684j4439j5295J3777J8550k1756m260Q987Q510k3755j3847q22
17458C6085J664K515R657O334j1361L592r28k3235p798J6558J3696Q298K9239
17445H4316K7472K3838M9849P5140M6089P172O970n8933p0374k7721p624k5019
17433A31175j3081l0168j0152J0589M050j0935K1525J4279k093l1012j5413l0885
$$ y = [113427, 110641, 114494, 78841, 33797, -685, 7539, 2608, -10929, -18535, -17214, -6648, 12002, 30696, 59392, 70821, 68607, 62184, 62159, 35827, 43035, 46662, 39347, 43043, 74641, 77767, 64264, 28207, 2406, -17328, -15031, 11583, 21895, 57559, 90639, 90486, 98327, 122880, 150857, 130839, 132180, 147620, 148807, 119082, 120547, 125488, 97130, 92995, 128841, 151576, 156457, 135024, 103119, 80435, 65996, 50701, 64478, 83028, 61272, 57012, 65999, 74509, 50754, 36907, 36085, 37749, 40264, 49921, 56255, 44894, 48486, 47558, 24323, 16525, 33083, 46779, 55077, 84316, 111788, 135626, 185475, 260615, 306704, 313876, 320846, 261913, 191539, 163818, 156194, 131175, 118094, 87926, 77774, 88363, 92413, 81478, 103003, 117282, 115189, 84177, 68764, 37879]
17421C7879l6092r398P297J3660q31J180m557L4007K7200j657j1916l9424j2287
17408E061J0577m586N768K2420O218j4787k2390L210k2158Q351J9687K5772M87
17395D3630j1203L1554j1641k0802n079J1953n323P777J628j5421R893r422j438
17382B6106J1806r930k1392J067P920K3227j1570k1361Q829k016Q431j082L3226
17369E3261O839k595j5808L609j608K2363J3651j3707M546r72j9070J6865K5738
17356I3112j8336k1748j5694q887j650j4039J2337j4093m239l706Q575J7392j2736
17343A6288R00K4263O407j2963j7642r209N791J9891m211p130j4156l0449l7801
17330f0021J6228L5794J3551O560j870J2614J1701l986N444r520m881j7857L6689
$$ y = [37879, 1787, -7611, -314, 13346, 12515, 13695, 9138, 43145, 70345, 68688, 56772, 17348, 5061, 15638, 11052, 16820, 39240, 45458, 30671, 8281, 11491, -10667, -2316, 17371, 43143, 43630, 32427, 63981, 52340, 31538, 26459, 38412, 33089, 40866, 42494, 27073, 36966, 27544, 26106, 37912, 27982, 6590, 7657, 15577, 38804, 27234, 5873, 14702, 12686, 21117, 20035, 53261, 60100, 57505, 41697, 45306, 43698, 66061, 79712, 66005, 70551, 69579, 50509, 67374, 93112, 74776, 53028, 37334, 28447, 26797, 12758, 25095, 11002, 6763, 3057, 11632, 29024, 16288, 17188, 41451, 47858, 34895, 17253, 8044, 13835, 33726, 29515, 22385, 8229, -22220, -60021, -43793, -7999, 5552, 12112, 10242, 22856, 34557, 30571, 36015, 26495, 21614, 3757, 40446]
17317D0446J5003j8528k8830j7742J8836J7997P238O477J9561L803P63n381O902
17304F6545J0373k6439l3473N604J4136J9914j0375o415m3388k5318J3500j011
17292a6347P70J7997J4685k712j1715K440p427N14N121n757k9046J5737K771J5121
17278B152j1559k5725O83K9222L7462m117R203l182k9697K978J17j0838M133J4606
17264A5438Q881j0851R296p360k3447J1533L1378p155k5222k254J3631p967Q090
17251A3991j3549k9507j077M737K7620j5982k2214o857L3817J6954Q486K927k8639
17238i293p262P602J3176J3299p196J1317J1956j111j7573k153L04J1360L273
17225B7699R571m658J1530j1171L930K0922j8239j9132J4830p17j4268k1247k4358
$$ y = [40446, 55449, 36921, 8091, -9651, 9185, 27182, 34420, 40897, 60458, 64261, 65024, 59643, 66545, 76918, 50479, 17006, 22610, 36746, 56660, 46285, 39870, -3518, -28836, -15336, -16347, -15577, 2420, 17105, 14393, 2678, 5118, -2309, -1795, 3326, -2431, -31477, -15740, -12969, 2152, -9407, -35132, -34449, -5227, 32235, 28118, 37321, 34139, 4442, 7420, 7537, -3301, 832, 15438, 24319, 13468, 22764, 15404, -8043, 3490, 34868, 27713, 2491, 237, 13868, 5901, 13991, 442, -29065, -30142, -25405, 2215, -13767, -35981, -42838, -9021, 7933, 16419, 19346, -9293, -16555, -8953, 4223, 17522, 10326, 21643, 33599, 32488, 14915, 12762, 13066, 24426, 27699, 37270, 32612, 44142, 32971, 36901, 57823, 39584, 20452, 35282, 34565, 20297, -950, -25308]
17212b5308j6562K99l753N938K4460K6806L624o947j2438j8014J1358L4537J1843
17199C5843l3569k6621j2084o446L7368M1277J2174j9343k3964l83J5134k272
17187A7114q833m963K0005J7259J7606j8381j1252O640J2708q530k605J3477J7906
17174F8151J2876k2940J1151j3168r586O379J4899k7176k4348k66J8128Q252R632
17161E1984J3540j4492k2752M01j0806j2880Q134K6937J3969l4505l370k2146
17149e986l0367J4965M3683J2249k425l1345M914L3199j393q332j6237k645J877
17136A2157J1713J8422j2790j3898J9351R883p935o818j4483K1626R721J1423
17124E8372J4574j3820k6913j2726k044j2426J4210J9475O900k0086k4670n167
$$ y = [-25308, -41870, -41571, -45324, -39386, -14926, 11880, 15504, 8557, -3881, -21895, -10537, 24000, 35843, 2274, -24347, -36431, -42877, -5509, 35768, 47942, 28599, 4635, 4252, 19386, 17114, 8281, 3318, 23323, 40582, 58188, 39807, 28555, 35195, 47903, 39373, 36768, 50245, 68151, 81027, 58087, 69238, 56070, 46484, 52863, 67762, 40586, 16238, 15972, 34100, 42352, 51984, 65524, 51032, 28280, 28681, 17875, 4995, 13129, 40066, 54035, 19530, 16160, -5986, -36353, -21388, 22295, 34544, 32119, 774, 5688, 38887, 37494, 29162, 12925, 10280, 12157, 23870, 42292, 29502, 15604, 34955, 44838, 36903, 30085, 15602, 37228, 46949, 58372, 72946, 59126, 32213, 19487, 17443, 5017, 19227, 38702, 45602, 25516, 846, -4321]
17112d321k6231J2128p689k862J3776L0019m06M0948n632j9761k5081k429O022
17099H481K5663J6894n538j3319j6265l4713J8281R358j4741J0424N373j0027
17087a29J3438j4677P283J5214P062j9543J5037J0086K367M278l906m0613q015
17074a2118L5146L1388o015l3239p217K1603j8070j1917K4161J215R166J933Q52
17061C6888J2536L70j2873m111l3061k8703Q168M749L4848P728M762J930L6783
17048G0014J4619Q49l4561k0495j225K514O48j0226K991j5913m3546J5737J8555
17035c9l573m898K0082N010j4801l760J3908J4743k3093j6454J350K059j99J8425
17021H760J8380o643j3059j0618l425M990J7187L0534J5712j2375j3899k0483
$$ y = [-4321, -30552, -18424, -26113, -28975, -15199, 14820, 14414, 55362, 49730, 29969, 4888, 2459, 8481, 34144, 51038, 45500, 32181, 15916, -18797, -516, 8842, -5899, 4525, 9898, -129, 13309, -1368, 5915, 21129, 28191, 8648, 23685, 33771, 36138, 40416, 36510, -4103, -12118, 23028, 54416, 48401, 15162, 7945, 29548, 11478, -439, 23722, 24937, 34103, 36036, 36888, 49424, 49794, 36921, 32810, -251, -28954, -20786, -16037, 18811, 26539, 31301, 33231, 70014, 84633, 85482, 50921, 30426, 29201, 31715, 32363, 22137, 25128, 9215, -34331, -18594, -39, -3612, -8510, 11572, 16582, 1781, -1979, 11929, 26672, 3579, -12875, -11525, -9466, -9665, 8760, 27140, 20497, 7438, -3180, -6605, -1615, 15572, 46106, 61818, 49443, 35544, 15061]
17009A5061j6136Q477P422M760K5635k165k2059n029k4798k0431J2423L3093l236
16996A3017j9778J455J0941J1003j9669m0183j8530J3225P093K3517L3640J3463
16984B9194L498k2293j0097L4465Q471k4832J1427q464k5300r271K5050K794J4781
16971B9423O558q378Q737J966j9157n415o169N524j0091m917j1180n373J2002
16958f470M4189J910j201q042R52j0754L739J8494J4704q963m1074j9548K1243
16945I179l121p627m556J582q104l8031j3893L0138J4367K0807P967Q820L574
16932B1102j1785n137j6613j2063p445K4150J0191N781j0986j6970J4145K1951
16920A6321O736q349j6971K9370k761k0323r262o071j6198m309q061J9685j4370
$$ y = [15061, -1075, 7402, 14824, 19584, 45219, 43054, 20995, 15966, -8832, -29263, -16840, 16253, 13017, -6761, -5306, 5635, 16638, -3031, -43214, -61744, -48519, -41426, -17909, 15731, 29194, 32692, 10399, 302, 34767, 43238, 18406, 29833, 21369, -3931, -13202, 11848, 14642, 29423, 35981, 27603, 36340, 38306, 19149, 13734, 7565, 13089, 2998, -1919, -13099, -18472, -6470, 37719, 39629, 38428, 30386, 31338, 20584, 24323, 42817, 57521, 48558, 7484, -12064, 9179, 6058, -1569, -6125, -4543, -12647, -50678, -64571, -34433, -20066, 741, 8708, 17528, 21102, 9317, 4180, -12433, -24496, -31941, -7791, 2400, 8181, -2805, -19775, -5630, 16321, 23057, 14708, -2263, 27107, 24346, 4023, -5239, -11310, -27508, -31817, -39878, -20193, -34563]
16907c4563j950j6791J1759Q224M756j5065Q487J3702l026n590K9805K0689j4817
16894E620l687k3510M338J0377J0363m520r475k212J803R105m7350k6425N1430
16881b4143J2527o206J6766j6408l289j367J2599j2329K1273J9119n980o673J5287
16868B1176q107J148L2544k3317j0674J1947j0636j2411J1385J6717j0636J5405
16856C4541M511o946j2103j0058J8850M103p247n496N76P102K2105l5232k3861
16843i155K1910K2976l1311M405J3488J929j2095j1706J8489J5545j6175j9745
16831a445J4216K5294q473J533k0369J8956J9507j4366j7760j0539N359J2486
16819B4399Q488o644J4488l2533j4060J2385K8786j9123j1286L019r19M833J116
$$ y = [-34563, -36513, -53304, -41545, -33321, -28565, -43630, -35143, -21441, -24467, -30057, -252, 20437, 5620, 1933, -21577, -17239, -6862, 3501, -1019, -10494, -12706, -10903, -1798, -49148, -75573, -24143, -11616, -17822, -1056, -17464, -20753, -22120, -9521, -21850, -577, 18542, 12562, 5889, 21176, 13069, 14217, 46761, 23444, 12770, 24717, 14081, 1670, 13055, 29772, 19136, 34541, 39052, 32106, 20003, 9945, 28795, 32898, 25651, 20155, 20731, 27833, 49938, 14706, -9155, 12755, 35731, 4420, 8825, 22313, 24242, 12147, 441, 18930, 34475, 18300, -1445, 12771, 38065, 29592, 31125, 10756, 29712, 49219, 34853, 17093, 6554, 11913, 24399, 32887, 26243, 40731, 8198, -5862, 6523, 35309, 16186, 4900, 7919, 7000, 11833, 12949]
16806A2949K882j0083j1744J2603P368j4644K79P071r695O467j8502J4196j7435
16793a8288n515J2346N258k1300L270J6582j6198j9786J8388k443N928J9538K873
16780F53J4323J4233m3118j3531J6704K87P501K3019L8533m931j4540r47J4152
16767E2338l514l8936n417p686j831j699J2838J4513O260J0219j8683n1730j6683
16754e0011M3005J7139n39j0558P780o318j4955j0646J6785K4132J0027L790j195
16741B8436j3973K6302K5923l497k3182m0089r294M2642o298k8864L476r423n1758
16728e9599k0318J4170L6312M7516P725P338j4360K5372j2334j2752K2423J583
16716D3076j7018l146j6991m9445k4889J3933J5631P63q866J9847M1461j2634
$$ y = [12949, 15831, 5748, -5996, 6607, 13975, -669, -390, 6681, -3014, 3453, -15049, -853, -18288, -23803, -11457, -6199, -27499, -24229, -7647, -23845, -43631, -25243, -27686, -21758, -2220, 653, 14976, 29209, -13909, -27440, -10736, -10449, -2948, 20071, 58604, 53673, 39133, 38186, 52338, 48824, 9888, 4471, -3215, -5046, -6745, 6093, 20606, 26866, 37085, 18402, -33328, -50011, -7006, 10133, 9594, -964, 6816, 498, -14457, -25103, -8318, 15814, 25841, 29631, 28436, 14463, 40765, 66688, 63191, 40009, -80, -9374, 33268, 26970, -1894, 1582, -7841, -59599, -79917, -65747, -29435, 18081, 25806, 33144, 18784, 44156, 31822, 19070, 41493, 43076, 26058, 22912, 5921, -43524, -68413, -54480, -38849, -38086, -46952, -27105, 14356, 1722]
16704A722K8363K1446k2047j4675L70P204o38j289k5021j2931J976j2266J0559
16691a7227L0927j3956l2571J9866R845k1478N138K7915n232m434L569j3358j0708
16678b1704J0436O829o528M038p154J2781K1828K311J6726m4597q715J6171j1033
16665h611j3100j6667j8145K1756k8366K2676J7095j0748q484J261k3283P137
16653e7479M3437l479o52J4863J6723j061N352O15j5822p021j3757n85K2838J8113
16639B2085j0722M65j17M75q426q360M2683J8509o540m504J304j6965m1727l1605
16625d3445M090J195j8476J677J9558K1127L6796K7924j6455j5883P272m691R791
16612C0480n661j5852J6805J5381l6876J2787J4067j5056k2915R426J4599l804
$$ y = [1722, 30085, 51531, 29484, 14809, 15179, 22383, 21745, 20456, -4565, -17496, -15520, -27786, -17227, 13700, -256, -32827, -12961, -3116, -24594, -19456, 8459, 3227, -1207, 2362, -10996, -21704, -11268, -4439, -10967, -6929, -14083, -1302, 20526, 22837, 39563, -5034, -13749, 2422, -8611, -21711, -38378, -56523, -34767, -63133, -40457, -23362, -34110, -42594, -41333, -64616, -57479, -14042, -17521, -18173, -3310, 13413, 12352, 17704, 18319, 2497, -4524, -18281, -18866, 3972, 22085, 11363, 11828, 11711, 12186, 3760, -4600, 38083, 56592, 50052, 45548, 46852, 29887, -11840, -43445, -39355, -38160, -56636, -54959, -35401, -14274, 22522, 50446, 33991, 18108, 25380, 20689, 30480, 24819, 8967, 25772, 41153, 4277, 17064, 31131, 16075, -6840, 2586, 17185, 13381]
16600A3381J3710o777q557j0108l7946o36K6255p292j4029K0724M752O223L653
16587C353J5034J133j1535j5266l6773J0404J4319l977N154Q411n898K847j1721
16574b4515J0795J2193k088M839J2524j3177q007J9687P91k7358j9451O638J7774
16561i355Q507o541k7245O139L6008K7131J374J4102m996j031j6343j0551j0320
16548F879p046R793R482m350q777J7376j3706l69J7629l311j1913R059j1020k0196
16534a0470k9315K2232J0536q12J5749j6300o409k709K0683l406k790k045M6121
16521D1065K6678j1191N436j2132k0947L474J0547L4560K1521k4472n326k9665
16509C9548l9740j7974R623k46j1812j7277K2605J4623j8178J5796J5250M570
$$ y = [13381, 27091, 20314, 11757, 1649, -36297, -36933, -10678, -17970, -31999, -11275, -6523, -300, 3353, 18387, 19520, 7985, -7281, -44054, -33650, -19331, -23308, -18154, -9743, -15641, -12794, -24515, -13720, -1527, -3615, 1224, 13748, 571, -7436, 12251, 13042, -14316, -33767, -27129, -9355, -848, -7389, -34634, -28495, 7513, 34644, 36018, 50120, 45124, 44093, 27750, 17199, 6879, -167, 9626, 19108, 14758, 5981, 23357, 9651, 9282, 26911, 23600, 11687, 20746, 9726, -10470, -39785, -17553, -7017, -7829, 7920, -8380, -14789, -17498, 3185, -221, -3011, -5056, 41065, 67743, 56552, 61988, 49856, 28909, 32383, 42930, 77490, 99011, 74539, 69213, 39548, -192, -18166, -8543, -8789, -20601, -37878, -15273, -650, -18828, -3032, 12218, 16788]
16497A6788o570k4472J0377J8330L3418j976m7516j5425M2751j8965k4687J0917
16485g030J6025k6027o238K9812K6092j6372j4759j692M1711m977n3689j2586
16473b9730K2385J4566P894J0066J7280Q005n453j8544J296J8262m836m56M798
16460D5533k2310l7004Q367M0354N882j6514r753J2935J683j6592J9679j4365
16448A7895k5480J0590J4455l169j8568n965j1207K5012K3784J620o090k5514
16436b637l2581m003p421n232L3788K0167j4288J5066L168j0290L56K9852j806
16423B4139o459k7233o005K1299j2772r07O596n216r816j3475J6542K8507r801
16410E399j8173J4390J9718r152J8725J4794j0705o603j2469k608N514N425m38
$$ y = [16788, 10218, -14254, -3877, 14453, 47871, 45895, -1621, -17046, 25705, 6740, -17947, -7030, 8995, -17032, -23270, 6542, 32634, 16262, 1503, -189, 41522, 36545, -17144, -29730, -7345, 7221, 15115, 25181, 42461, 50466, 45013, 26469, 27765, 46027, 41191, 40735, 45533, 23223, -13781, -5414, 34940, 40822, 24308, 14555, 27490, 29173, 12581, 32260, 17895, -7585, 3005, 17460, 14291, -4277, -10242, -21449, 3563, 27347, 28967, 22877, -2637, -35218, -39221, -46642, -51874, -18086, 2081, -12207, 2859, 6027, -4263, -3907, 25945, 24139, 17680, -9553, -15558, 5741, -7031, -7938, -1342, -6558, -16374, -29849, -13307, 15200, 5399, -12774, 1616, 21334, 12182, 30907, 45701, 34996, 28393, 15924, 13316, 18830, 24255, 23817]
16397B3817P021j5663J113J2692M1718m688k3019m2951j4393j8863J7889j7538
16385c2865L1212J1738J2814O351L645J0268j4766k6468R09J9613J3734q567j1888
16372A5730J4537J9060P280j7168n266j7799l442j876N611J540j688j7019k7815
16359b8315j6920J2004l52Q564M1018N074L67p6k620j303n195J807j3031j5692
16345a4670J3031R227O573l994j7861l5695l157L7365J4141K3181K6812m2920
16333A2033q5n676k9133l9811j4646K4216N967K8334M9778L605k7135o874N487
16320F060j7102m144J1513r904L5096j2701K527J8884L37l429j4229j2789N09
16307F28Q937N70K4690k4639k1984J301N220L2061J6581q920k6261J288J6456
$$ y = [23817, 30838, 15175, 16288, 28980, 70698, 66010, 42991, 40, -14353, -33216, -15327, -32865, -1653, 10085, 22899, 29250, 32895, 43163, 28397, 1929, 2838, 22451, 36185, 27618, 15730, 30267, 49327, 56607, 39439, 34173, 16374, 12932, 11056, 16667, 18207, 16519, -500, -28315, -45235, -33231, -33583, -25019, 15999, 21073, 21440, 21364, 18744, 17441, 12246, 14053, 1022, -14670, -1639, 7588, 14161, 10167, -7694, -43389, -46546, -9181, 4960, 28141, 54953, 12033, 11948, 6272, -22861, -62672, -77318, -53102, -47135, -18801, 30977, 34582, 7447, 573, 6060, -11042, -15186, -3673, -13577, 21519, 8818, 11345, 30229, 30566, 27137, 12908, 119, 628, 9565, 10135, 34825, 10186, -11798, -10497, -5277, 26784, 43365, 34445, 8184, 9472, 25928]
16294B5928J810L281J6968k3784J1033L9064k2780l0359k1418k7150l7745K1468
16282d3684L2261J2597Q424K8632k5526j5755j6909P280k422L325P908J5048j5556
16269d377j578K3740K2136j9718j0069j5706j5123m530J8057M1868J556r563L8
16256B6731l4794K0163J7421n967j3713J5004J5570k4836n4334j6660n134K2340
16244c8209M2390L5325m848k0355N126L6216j487j5676K953K4950j1040j1017
16232D4328k7665j3970L071k729j4384J0097j9167j6863J8632p277K0140M1689
16220C5902j6905k0635R205k008l751J3068K0853J815j2364K0502o973j0871L0766
16207E8604j5837j7227J1717K127q061j731k0727k686n367K6976m858l3156l7798
$$ y = [25928, 27738, 31019, 47987, 24203, 35236, 74300, 51520, 21161, -257, -27407, -65152, -43684, -11423, 1174, 9598, 38230, 12704, -3051, -19960, -12680, -15102, -11777, -3869, 11179, -4377, -5955, 17785, 39921, 20203, 10134, -5572, -20695, -25225, -7168, 34700, 36256, 26693, 26731, -8063, 12100, 29521, 23554, 9841, 24845, 40415, 15579, -38755, -55415, -60549, -38209, 4181, 39506, 34658, 14303, 19429, 55645, 54158, 38482, 41435, 66385, 55345, 44328, 16663, 2693, 5764, 3035, -11349, -1252, -20419, -37282, -18650, -25927, -5787, 35902, 18997, -1638, 7567, 5559, 1808, 14876, 35729, 37544, 25180, 45682, 38709, 27838, 58604, 42767, 25540, 37257, 39384, 31323, 29592, 8865, 6179, 812, 27788, 22930, -10226, -48024]
16194d8024L536M6032j2877M290J172r247P811P806j0100N585q500q911j791K5
16180b3193K2824J9717k1095J7684M907k8648j5757M368J2455k2074J5091j9748
16168c3469J9281K8428k0940k5755o379J1921J0378j778k841K0717o426K018Q048
16155C203J3679K1083J2138k6585j5188j1184n923l9l105J8483J945J3668M045
16142B6220k0391m195j7320j0658J8003J4706J5025J6520K981k76j3730j9772
16130G113l0424P654O536j5072J0085K3080J9270j8100q390k389j8247J2501M501
16117a882O391J5221r985J81l1611J1437J6193J3222r156k2235j7441K0693L5440
16104B6468R45k2490j9402p551J0220p21J1545J6029n679p608j5029m347J3298
$$ y = [-48024, -44488, 1544, -11333, -7043, -5871, -15118, -7307, 499, -9601, -4016, -12516, -21427, -23218, -23193, -369, 19348, -1747, 15937, 20844, -7804, -23561, -19193, -6738, -28812, -13721, -33469, -14188, 14240, -6700, -32455, -38834, -26913, -16535, -18313, -21154, -437, -6863, -4845, 3203, 16882, 37965, 50103, 23518, 8330, -2854, -8777, -8816, -11921, 6562, 8507, 22175, 26220, 5829, 1634, -15686, -26344, -8341, 6365, 21390, 37910, 40891, 40615, 26885, 7113, -23311, -15657, -9121, -24193, -14108, 8972, 28242, 10142, 1752, -637, -18884, -6383, -1882, 4509, 19730, 9745, 9926, -21685, -10248, 5945, 19167, 10011, -12224, -29665, -8972, 26468, 27413, 4923, -14479, -22030, -11810, -12531, -986, 15043, 9364, 1756, -13273, -17620, -4322]
16091d322K1238r899k6473j5727O434J3144J9419n054q260J4273N425k9051O001
16078a2852L4331k685j7707K1177o950k9835N723L0990J3882k8142k2768O005
16066h831n599o989j4352J3749L3014J967n303J8361j715j3827J1731j0396j8914
16053g104k116J2833J9686n823k0218K374q538k165M2575L2185j2487l6960m8074
16040c3832j3135L2674J8632J074N900J3896m662j0657l698p581j0445J853L1896
16027B1915k390p26l469k561J4103L3260N768k7728k3178l0770k3582K1921n548
16014b2985Q157K297n87K4741m455J658j9676m3184m46Q948J6321O870p573o579
16000c6493L2392J8359p839j51q909J2584J2362j6236o645o243o112L822J6541
$$ y = [-4322, 16916, 7017, -19456, -35183, -28749, -15605, 3814, -1240, -9500, 4773, 10198, -18853, -12852, 21479, 18794, 1087, 22264, 15314, -14521, -8798, 22192, 36074, 7932, -14836, -8831, -14430, -21419, -35771, -22022, 10992, 12959, 7656, 26017, 24302, 10475, 22206, 11810, -7104, -9220, 3613, 23299, 17476, -2742, -368, -8906, -11071, 31504, 63689, 51202, 14242, -33832, -46967, -14293, 4339, 5413, 11313, 25209, 20547, 9890, 6192, -1389, -11834, -9981, 21915, 19525, 18799, 15330, 12769, 26872, 60132, 65900, 38172, 14994, -15776, -39358, -17437, -22985, -14828, -12531, -13118, 11623, 7168, 8826, -10850, -54034, -54480, -45532, -29211, -22341, -29914, -36493, -4101, 14258, 6419, 6268, -2641, 9943, 22305, 6069, -576, -6819, -12931, -9109, 7432]
15987G432O471L445P383j0807N632J0062M31J7374j189N06k5342k6700k0661j388
15973b7351M160K4116j3152j0775K1071P530L1504Q064m386l1722P517K344L899
15960B2819k0839j5175J3800J7933j7911j3574k8489l2493J050J3318O174m929
15948e8316P926K4390J3004J1413L524J6119j3239l3937J398n860J5679J5673
15936b226O828q353j9423N7487O323r641q134K756m130J35J6311j0201k8695j0996
15922a1959j1215P213q505J1708J3194J5655k2512L171Q928k5056n298K106J696
15909b0874k395K8723j5340q961J5141Q980K3088K1058k4544l5563j1466j3512
15897c5665J6171L2481K2677k3650j3529K806L0186J1113m1182l2354J041K984
$$ y = [7432, 13903, 17348, 24731, 13924, 19556, 29618, 30049, 47423, 46234, 46740, 21398, -5302, -25963, -27351, -23191, 925, -12227, -23002, -1931, 5599, 37103, 45167, 40781, 9059, 16576, 18920, 22819, 1980, -13195, 605, 18538, 627, -12947, -41436, -73929, -72879, -59561, -53387, -58316, -50390, -26000, -12996, -1583, 1941, 18060, 4821, -29116, -27718, -33578, -17899, -2226, 4602, -3751, -23174, 34313, 40636, 30995, 22861, 25617, 21487, 21622, 37933, 27732, -963, -11959, -23174, -15961, -24466, -12758, 436, 16091, -6421, -3250, 5678, -19378, -24676, -22570, -20874, -23269, 5454, -9886, -18847, -3706, 5274, 28362, 49420, 24876, -10687, -22153, -35665, -19494, 12987, 35664, 12014, -1515, 1291, 31477, 42590, 1408, -30946, -29905, -26921]
15885b6921P106J9495L2898r704j8855J6193O886j1164n684j4829l4462J51M8598
15872I708K9993L631k7331O501j1997m3359k7962M1564J9109o52M893j1546N678
15859a770K101j3744n797o881J368M046k108L410J7533K5229j3232k011k1107
15846a2963o377O945R210L0329K7456k2925j5957R360l5883j8063N594R624k5096
15833c8746p478j2037J3718m587K9934J0797K243O63j9016j3282J1197O285j3214
15820c3523k1257j4617L6646q48J5648K7425K215Q638j3725r210J4228J4341k5581
15807C80P867M3061k2062n6841k236q034J4704R179J6736P563q052N263J0488
15794A8016K373m212J8481m589k3833Q491p062k844L5034j2998j0909J438m154
$$ y = [-26921, -19815, -320, 32578, 22874, 4019, 20212, 27098, 15934, 10250, -4579, -39041, -38890, 9708, 39701, 43332, 16001, 22502, 10505, -32854, -60816, -19252, -143, -795, 4098, -7448, -1770, 331, -13413, -19210, -26091, -24723, -20677, -22785, -19375, -1842, 23387, 10155, 8144, -12963, -19340, -12395, -3185, 27144, 54600, 31675, 15718, 25078, -10805, -28868, -23274, -13650, -38746, -46224, -58261, -44543, -49130, -19196, -8399, -6156, -5493, -24509, -37791, -26594, -20309, -33523, -54780, -69397, -32751, -33599, -17951, 9474, 11689, 20327, 6602, -2608, 11620, 25961, 380, 8247, 51308, 29246, -27595, -29831, -37865, -23161, -13982, 2754, 10317, 2265, 7528, 18016, 20389, 16177, 34658, 30069, 6236, 14727, 7665, 4821, 39855, 26857, 15948, 17386, 13232]
15781A3232l500L2947k281k4906O914r0Q17j7344r23M014L6907J2190j905o852
15767D9220n1081n3939K1216j818Q386J2209k0413L409J0977m389j6252J0490
15755c1985k764K1361J122k861j7450Q363n099l2401j9220N5701p661R075J0487
15742a3332r321J2581O839J6723K0337k1843l1847j1079p089J9975K3289P854
15730A3087l2129k6655J6113J1798m344L2744J519J0688l700o498J6103K89j4452
15717A4563k8518j7651j0322k3808K3089M4539K8931j0867j0695q418m438J7450
15705A3855j3320k2067Q642M484l457j224j6756j1812K6766K1192J1131j1718
15693E716J3953k616j3627k9119N109J2720k2491j1998K1342K735P73p210o033
$$ y = [13232, 9732, 42679, 40398, 15492, 22406, 22316, 23133, 5789, 4866, 8880, 45787, 57977, 56072, 49220, -1861, -55800, -34584, -36402, -28016, -15807, -36220, -32811, -21834, -26223, -42475, -31985, -34749, -13388, -12266, -15127, -32577, -24214, -29313, -61714, -80934, -25233, -32894, -23819, -13332, -22653, -10072, -3233, 13490, 33827, 11984, -19863, -30942, -38031, -18056, 5233, 13087, -19042, -45697, -29584, -17786, -22130, 10614, 12133, 22821, 19121, 12623, 28726, 29015, 14563, -13955, -31606, -41928, -65736, -42647, 1892, 30823, 19956, 9261, 843, -3595, 13855, 535, -21532, -12890, -8406, -11863, -13087, -29843, -41655, -14889, 6303, 17434, 5716, 19669, 17053, 3426, -25693, -20584, -7864, -30355, -42353, -21011, -18276, -17503, -24713, -30746]
15680c0746L338j1621l5296O335K4947O365J2189P141J9815N42j156J7051J2954
15667C1858r35j1139j0557j1387K850l5908m3022J0769J9330j0320J7704K0841
15655a9916N851J2583K0559J2187J1356j0563p145k257k2172K511k915J170j1289
15642a0040O602J933K4619K3135m311l9915r691j0154R387K6845q964j3338r28
15629d820M952p756K2331J4786j5697j5665r052L382K5705J7687J2624l477k2707
15616B2293p488l870k4825k7315K965J1814L6833J449l6535j3542J7035J1630
15604i556L429p234k556j2016R729L0029j7881p011k297k931L808k662O300J4023
15590C174o760q935O078k2524Q810K5507N309j0177j4840K1086J2266k3539J669
$$ y = [-30746, -27408, -39029, -74325, -67990, -43043, -36678, -24489, -17348, 2467, 3009, 1853, 18904, 31858, 30923, 19784, 9227, -2160, 690, -35218, -78240, -67471, -48141, -58461, -40757, -19916, -14065, -1482, 19077, 31264, 42620, 32057, 24912, 22655, 483, 2994, 79, 1249, -10040, -3438, -1505, 23114, 46249, 41938, 2023, -7668, -17822, -8435, 18410, 9446, -3892, -4820, 132, -7624, 14707, 29493, 13796, -1869, -10921, -7539, 18166, 35853, 48477, 45000, 22293, 14805, 10935, -13890, -41205, -38240, -26426, 10407, 11856, -24679, -38221, -21186, -9556, -6127, -13361, -15917, -27933, -18204, 11825, -6056, -13067, -15364, -18295, -14487, -17149, -10849, 3174, -3586, -12521, -6443, -28967, -20157, 5350, 10659, 482, -14358, 6728, 18994, -4545, -2876]
15577b876L1854K9571o771q972k3668P104j5021k5305j5132J6088q642j6638K6514
15564a1894K6257J0703o965M159K705k3662k5966J7214P232r452j7543k4180K6082
15551b5310K3344K2068K1880Q414p754l8184M276M366n065k5110k280J0480K1259
15538A2384p292o743K997L37q777M577J5983l0749M116K099K5375L906k6346P7
15524h056j7952N172K2126m4271j6377K7292K3556O987R262o110j9550j3064J5375
15511a5610j4605J9612k225M08j8058J456J9757J1282j6374K111Q125L1360j9236
15498H003P011N323N583J6716M645l6314k5872n22r035r779J738M828P823R337
15484a0515L7022J1120j7399M936L650m245l119j0343r47j1926l522K2348J1712
$$ y = [-2876, 28978, 58549, 51778, 42806, 19138, 26242, 11221, -14084, -29216, -13128, -21770, -38408, -11894, 14363, 25066, 18101, 22260, 24965, 1303, -24663, -7449, -217, -9669, -27212, -51392, -25310, -1966, 20102, 41982, 50396, 42642, 4458, 8734, 13100, 8035, -17075, -19355, -8875, 12384, 5092, -1651, 1346, 1683, -7094, -2517, 13466, -17283, -13167, -11068, 14307, 18213, -8133, -8056, -26008, -20836, 1290, -42981, -59358, -32066, -8510, -1523, 7739, 1629, -17921, -30985, -15610, -30215, -10603, -12828, -12420, -30478, -29022, -9265, 2017, -14357, -12246, -4121, 27239, 8003, 15014, 20337, 25920, 42636, 47281, 10967, -14905, -15427, -24462, -34241, -32503, -27675, -19852, -10515, 26507, 37627, 20228, 25164, 28814, 24569, 21450, 11107, 10160, -1766, -5288, 17060, 28772]
15471B8772O018p971k5949k0753M2934K980k9539l2613j0244O163n430j898R670
15458c7860J349K1923M8747J097j3201q269l226j6858J1137K6124j3464j6019
15446A480j7389k3949q014J8298R970j1668J6459J9915j191m411L467k697j9322
15433a9052q493M703J5978J2864k3454j1188q118O130L6598M7830k8930k8063
15421c195k4816Q059J3711n86R189k3892m137J6188j0856j8825K8117K940K209
15408e894N082N875j5320j7811J8481K455l878K466K7299J8245M374p380p961
15395B6033J8214n617l8915l0080p503K9646N253N536o777j7323k5267k617k699
15382e2116K7587K0683q880k022N449J2752r157j7441q484p269p302J025j9139
$$ y = [28772, 34790, 26819, 870, -19883, 23051, 26031, -3508, -36121, -46365, -40202, -45632, -47530, -37860, -36511, -14588, 34159, 35256, 22055, 13786, 10560, -6298, 4839, 30963, 17499, 1480, -15909, -39858, -47872, -29574, -19604, -31272, -14813, 5102, 3911, -500, 2967, 270, -19052, -27545, -22842, -6864, 6000, -17454, -28642, -36760, -30630, 5968, 53798, 24868, -3195, -28011, -19952, -6241, -6827, 2362, -21530, -25667, -9479, -20335, -39160, -11043, -8103, -5894, -812, 5063, -10257, -28068, -9587, -7132, -11010, -8544, 18755, 37000, 41374, 33994, 26033, 44247, 38630, -285, -30365, -37868, -8222, -2969, 2567, -4210, -21533, -46800, -49417, -52116, -24529, -3846, -12726, -14748, -9299, 3453, -5704, -23145, -31629, -38898, -46200, -45175, -64314]
15369f4314k861O065L6278q727j5377J1287K2713J2321K2603K568k8318M618J5264
15356A4120m61r81j2218k4057J5569J1134n665q813J457l996M75q502l100j0996
15342c6034k868k807O709K3771K989l5872J6882q051J2280K6561K4645j8653k2360
15329a2808K1624O426l1332o235j6781N879k444k0854k60P899K145J6598k8101
15316e8244l224J0166P930L2044O736L767Q613K988K0036K494o048j3350J6066
15303B9974j7458k6692j8434j926m755k470K2028l029j5181q798j1284Q88J3218
15290d3919j1413K7230K6947L2393l92P107l344k4580j3546K2760j9540l6595
15278c6892r117j852R671J946l8244L6576N1161R801k9789j3533j1728j545J2238
$$ y = [-64314, -67175, -61110, -24832, -33559, -48936, -37649, -14936, -2615, 19988, 22556, -5762, -1144, 14120, 13659, 12678, 460, -23597, -8028, 3106, -2559, -11372, -9915, -13911, -13436, -21938, -25038, -36034, -38902, -41709, -35000, -11229, -8240, -44112, -27230, -35281, -23001, 3560, 28205, 9552, -12808, 8816, 15242, -16090, -22325, -39106, -33227, -35671, -56525, -56785, -48886, -46741, -30143, -58244, -61468, -51302, -43372, -11328, -4592, -825, 7788, 10776, 30812, 33306, 27258, 13908, 29974, 12516, -14176, -32610, -34536, -39291, -41761, -19733, -22762, -37943, -46741, -58025, -57137, -43919, -55332, -28102, -1155, 31238, 30846, 37953, 34609, 10029, -3517, 19243, -297, -36892, -46009, -47861, -38190, -36244, -74488, -37912, 13249, 23050, -6739, -20272, -32000, -33545, -21307]
15265b1307K459J5253K4842q545k0697n919K1286j7555j4709O834j5302M678L518
15252b5164P061R345L1401p469o431L843J3073j9300j0213J0691K07r49L90l3777
15238b7292j6575J8418O492O413L026j942j2661j266r138l0379K529P220J5452
15225c9703L1210K7974K291p774k8342K1891J2197j3816P463K2093K0579j923
15213E4140r060J5557q304k8778j3044k443K4172k3909j6096J390J6499K6691
15201C6815j1670L933j882m787O463K4434k5967l9549p520J6080M2259R517K511
15188E0637k1012J1427q869k1868j7319J0168Q557j0178q497L4599J5276j1893
15176C1028j0314j86O964J1947K5714J6629k0653n8280j2828K3195L28k8149l8284
$$ y = [-21307, -18848, -3595, 21247, 12702, -7995, -13914, 7372, -10183, -24892, -18058, -33360, -28682, -25164, -18103, -8758, 22643, 15174, 8743, 12586, 25659, 6359, -3854, 6837, 7044, 6095, 6485, -27292, -43867, -25449, -18957, -12544, -9518, -11460, -24121, -25387, -34525, -64904, -62375, -55155, -39703, -8493, 19481, 21772, 13998, -14344, 7547, 19744, 5928, 13391, 35484, 56063, 54140, 45080, 60637, 52333, 23555, 10511, 8068, 32240, 8331, -7765, -6375, 10124, 36815, 25145, 29078, 27196, 22409, 28872, 53306, 27339, -12210, -19730, -3650, 38609, 48126, 50637, 29625, 41052, 32183, 10315, -7004, 3164, 11721, 1543, -6954, 27645, 42921, 31028, 20714, 20528, 27492, 39439, 65153, 81782, 61129, 2849, -9979, 13216, 13544, -14605, -52889]
15163e2889J6299N5159k452q591J403J5963j977n476j5183k6589j1195O420L4104
15150D996J1765n4979k363J0816n414k6178J6420L8376M1100n204k383k0869j6387
15137a0304R491L778l039l7215k2845k495L5979m104K854K6788m654K105k624
15124f285J065J1133J4646J1010j8906R271M09n847k8279J010P982L269j226l6098
15110c6846q030j2973M942J5513J5645L3060K0068K045L2317j1716j4599k5728
15098A3698k6191o274L393N422L5977J0749J1896N400k30n736k0516r679j2983
15085D926j2220O114J0085P979J2417J2349J3353n132k3866q164j6723O997R263
15072A7378l1290O36J6117j054J2145K6860J214l0974J7642M42j7913l1993m367
$$ y = [-52889, -36590, 18569, 16117, 7526, 8929, 24892, 22915, 17439, 2256, -24333, -35528, -29108, 4996, 16761, -38218, -40581, -29765, -35179, -61357, -44937, -6561, 34539, 29335, 26952, 6083, -10304, -813, 2965, -74, -37289, -60134, -62629, -26650, -30754, -27900, -1112, -5766, -3661, -6285, -5220, 5913, 20559, 31569, 12663, 21934, 22343, 16496, -11783, -10773, -2791, 478, -748, -36846, -44876, -57849, -52907, -37394, -21749, 11311, 31379, 33424, 65741, 54025, 39426, 13698, -12493, -18767, -15374, -9952, 26025, 36774, 48670, 54070, 53840, 48104, 27588, 17909, 4926, -7294, -1180, 8905, 16884, 29301, 41650, 55003, 49871, 26005, 17841, 1118, 8115, 17378, -13912, -13276, 2841, 1787, 13932, 40792, 42006, 11032, 28674, 29116, 11203, -20790, -25157]
15059b5157K5039Q010j0720N928J0381J5928J1394n797k7528j6950K4071L4239
15047D8838q681l80L1352K3441n0868j6740J9579n2405l3351K141o483K728R340
15034c1489K2150K7259R816q752r592j9399m208n691K1140L0554j2209l1920J0108
15021b233n545m886R868J6168K2265L358j4130j8857R464J246m524q135k426M147
15007E780J116k6093J4553J3540j066R023J3965j2405J0549j2968j9460j0079
14995a3545n410L451J8252K4843P740O6184O2343K5762m034l849n0625k2979k3901
14982H4232k2329k1793J8222l4230k8171k2298j3902J7273K0176Q514L26q411
14970b391j2624J1857L8171l2693k3683L1852R474J846J4940j7827J1086l5405
$$ y = [-25157, -118, 7892, -2828, 3100, 13481, 29409, 40803, 35006, 7478, -9472, 14599, 48838, 40157, 39777, 71129, 94570, 43702, 26962, 46541, -5864, -39215, -37074, -43557, -40829, -31489, -9339, 17920, 27736, 18984, 9392, -10007, -14215, -19906, 1234, 31788, 19579, -12341, -2233, -7778, -12664, -2796, 13372, 35637, 38995, 24865, 6008, 15472, 16718, 12194, 4059, 1633, 5780, 6896, -19197, -4644, 8896, 7830, 16853, 30818, 18413, 28962, 15994, -3466, -13545, -18955, -15504, 2748, 27591, 35331, 101515, 163858, 189620, 185586, 181737, 131112, 108133, 84232, 61903, 40110, 58332, 24102, -4069, -26367, -40269, -22996, -2820, 5694, 6020, -2391, -15015, -3158, 35013, 2320, -21363, 10489, 19963, 21809, 36749, 18922, 30008, -5397]
14958e397L966J0892k1929K5052O651k4403R562J4391Q618j0368k5917J6485k730
14945D873m459n02n532k1939q749j2803P274k831J5337Q385M518k1962l0850J3982
14931e5258L9078L0159Q887n281j0761R000j7713q18o766L259O049L3306j1022
14918B2119O976O818k1065k6830k4222R146K2088p131K676R337p488J2315p68
14905C971j0637K7474K403j9049J182q409j2118r817Q378k677j3416L2813J6660
14892A6758J0471J190L477k3705j2004j2051k289L02Q073o926p94j1875J4201
14879a5172P633O826r894P138R396j4798k3739n856K3452j7621k8733j2509K3451
14866e0426J3738L4466J9374J2761J1222l4146m3168j5011J2174J3213J4843Q653
$$ y = [-5397, -1431, 9461, -12468, 12584, 19235, -5168, 4394, 18785, 27403, 17035, -8882, 7603, 4873, 414, -88, -5620, -27559, -36308, -49111, -41837, -44668, -29331, -20946, -16428, -38390, -69240, -55258, -16180, 13979, 22866, 17585, 6824, 15824, -1889, -2707, -9473, -6214, -165, 33141, 22119, 29095, 35913, 14848, -11982, -36204, -27058, -4970, -12101, -9425, -88, -7576, 4739, 3971, -6666, 20808, 23211, 4162, 5344, -3065, -15183, -25000, -16622, -19299, -32715, 98, 16758, 27229, 28419, 31896, 8191, -3813, -15864, -18153, -17851, -9778, -16704, -17498, -29373, -15172, -7539, -713, -10607, -3469, 5927, -8871, -32610, -38466, -15014, -32635, -61368, -73877, -50426, -36688, -2222, 17152, 29913, 41135, 6989, -36179, -51190, -39016, -25803, -10960, -2307]
14854b307j5419J2261L525o576N033j727j8320L545K7404n210k6420l389K082
14841b5518K6856j3459l1079K1452O2789J9033J4592j5765l6537m6262j2689K059
14829c4528J2577L2574P061j3756K048p198o288J369J3301P215K1826O665k6449
14816A6417j9708J9438M9K1939K8596j1712j0921l5877m0327J4030K7066j5009
14804f019J0522J0198J9827l867l6602k8255K0206L7809J7966j3577n513m299
14792A8396j1805n65l768J7146j7079j3460J473k8275K0401L5511j8365j3617
14780a4007Q0O253L8383O13j4357k3444l219l878j0954K4479J6758k0742j9199
14767b3234j3881L492K5066J595k1253J3350K0147m905j6261k297k384O982p74
$$ y = [-2307, -17726, -5465, -1940, -8516, -3483, -5210, -23530, -19985, 7419, 2209, -24211, -27600, -25518, 1338, -12121, -43200, -21748, 41041, 60074, 74666, 58901, 22364, -23898, -36587, -34528, -21951, 10623, 17684, 3928, 5976, -1222, -7510, -6141, 7160, 14375, 36201, 42866, 16417, -3291, 16147, 16196, 38135, 66731, 55019, 44098, 8221, -32106, -18076, 8990, -6019, 4503, 14701, 34528, 30661, -5941, -34196, -13990, 23819, 41785, 28208, 22695, 18396, 6591, 6026, 2258, 19404, 2325, -11135, -9662, -37937, -17536, 17975, -390, -14007, -13927, -7674, 30709, 31322, 16965, -6479, -9698, -13576, -24530, -51, 16707, -4035, -23234, -37115, -33623, -8557, -6962, -28215, -14865, 5282, 377, -15884, -18181, -20565, -13583, -14357]
14754a4357J5723k2909j8125j3638Q435K9723o825r025k0664j3869o619J3405
14742e8745K1171J75o388J8188J639p874K2437k714J2703M23k3155k5488L3677
14729a3951j3459k874j8347K2759K0164J9809j4397j0402N471j7020j4509O858
14717b9898J4544J0825K4883k6171k0101j483M472K0994j9054m014J3453O876
14705d674N957r94j2946K4969k669k8325n776n587J1397M8944K365m4010J0106
14692a243M330l0003o252l0819k6094M629K0868L1214Q514J0449O626k4064q286
14679d0131J6647J1326M22J1490m690l59j1303O153J0848J3341j1953j2787O348
14666d648N478j4681k3158j9013j2171J0265K3535L3627J0650J4083P392k1997
$$ y = [-14357, 1366, -21543, -39668, -53306, -44871, -15148, -21973, -30998, -51662, -65531, -72150, -58745, -37574, -37399, -43787, -25599, -23960, -31834, -9397, -12111, 592, 1015, -22140, -47628, -13951, -27410, -30284, -48631, -25872, -5708, 14101, -296, -10698, -5227, -22247, -36756, -29898, -15354, -4529, 20354, -5817, -25918, -27401, -22929, -1935, -20989, -25003, -11550, -4674, 1283, 289, -12657, 12312, 9643, -18682, -24458, -30045, -18648, 30296, 32661, -11349, -1243, 3087, -26916, -33168, -63987, -90081, -85452, -64584, -33370, -24856, -14407, -7781, -31845, -40131, -23484, -12158, -11736, -246, -4936, -5295, -16598, -10445, 403, 13744, 1791, -10996, -4648, 830, -13851, -37009, -56022, -68193, -57928, -34393, -766, 9884, 23967, 31359, 9362]
14654I362N213J3367J529J1780L900n413k5710L176Q027j6319M735M572K35J1566
14640C0020N608l5587j0514K2453m853j6212j2299M079k4194l1265P929K7316
14628c7519j275J5724N220L958P700k4662J6005J8705O490M901K4492j6456j3237
14615A0046k919j316j3564n816j3269K8102R164r67P08Q700q061n2901r644K6049
14601b5688M432L851M711K5265N342k8837j3498j9219l00n714p002O795J9311
14588c0551j5452P745J8646R250j0630k7304L350K2957L1040k497k1327l513k6937
14575d5223K134N0026L9316K858k0997k3320M630K3368Q751q549l0988J3147J2923
14562B8076j1843j4756l7904k3420R711o02n827J9367O664j7161J5525J3528J2569
$$ y = [9362, 14575, 27942, 29471, 41251, 45151, 39738, 14028, 17204, 25231, 8912, 13647, 18219, 18454, 30020, 35628, 41, -10473, 11980, 7127, -9085, -21384, -17305, -41499, -72764, -64835, -37519, -38794, -23070, -17850, -13892, -6192, -30854, -14849, 3856, 10346, 15247, 39739, 23283, 10046, 7127, 5811, -7753, -13569, -26838, 1264, 10428, 9461, 10169, 18869, 10808, -42093, -51737, -25688, -21256, -17405, -12694, 12571, 17913, -10924, -24422, -43641, -43941, -49655, -56657, -49862, -30551, -46003, -38258, -19612, -10362, -20992, -48296, -44946, -21989, 9051, 6554, -14773, -18286, -45223, -43089, 6937, 46253, 49111, 28114, 4794, 9424, 32792, 41543, 32994, 2006, 15153, 28076, 16233, 1477, -36427, -59847, -50136, -50738, -56565, -37198, -30534, -47695, -32170, -18642, -6073]
14549f073K2343j3803j5597j896j4003J6684L350k4181J39L9149J168k0489l3004
14536d6213R92J2594J0958J9541O40j2384j3647m302n393M462m904l19j2855N018
14522d5812O09p22L2607J1711q265R116m499N967j6473N00k3012J365J6058o277
14508b7127J9930l997j6936J0698J7789Q241L247Q104o772Q170j1140k4101m779
14495a8673j2174j9555j846J2778O7508J1713j7034n338N244O483J646q800j531
14482B0421p341L675j8576P587K8980j1950Q729J9924m8729k7671L642k840K3651
14469d98L4112j591k2290M82Q863j0868j0371m731K2912r391k9698K0982j822
14456c909J5383k649o617O507k8466l2346k8472R745K5994J3010j3872j8527M0814
$$ y = [-6073, 16270, 2467, -13130, -15026, -29029, -12345, -8995, -33176, -33037, 6112, 7280, -13209, -46213, -45221, -32627, -21669, -2128, -1488, -13872, -27519, -31821, -37214, -32752, -37656, -37975, -50830, -45812, -45203, -45925, -13318, -1607, -9872, -756, -5255, 712, -15761, -15261, -38273, -36908, -20850, -27127, -7197, -11194, -28130, -17432, 357, 8598, 11845, 19949, 13177, 21347, 10207, -13894, -18673, -30847, -50402, -52248, -39470, 28038, 39751, 22717, 17379, 22623, 29106, 30752, 21952, 20421, 13080, 16755, -1821, 5766, 34746, 22796, 31525, 51449, 2720, -24951, -21309, -24149, -498, 33614, 32023, 9733, 10215, 19078, 8210, -2161, -6892, 16020, 6629, -23069, -2087, -3909, 11474, 8825, 2208, 8715, -19751, -52097, -80569, -70824, -44830, -31820, -45692, -64219, -23405]
14443b3405J8062L0723J4410l4814J3898J9296k0249j6729j6236j0448j4735J0513
14431b9714J0789r439K3183J0785M000J5374j3124k9801J4227m290j6381J3834
14419a0557n300l2787r611K5011N772R536P88J0332O428J1917j0696l6174J3376
14406b1965J2256J8009j1239j0450j998K355Q177j9982m28j333j6285j1294J6554
14393c7623O63j3980j032J7190O256J4451R67o183q871R326J5647K798p550r799
14379a7740L2645O782O404k8900l7858L2179L4407P936p971k5826J6242J104k8378
14366h974k6119j9584j6301J8313K9412K7252J1889l5196k7692j925R093J0608
14354b9224l71J9788J1096Q578O800j5976k2008m675K533J1145k292K778J4064
$$ y = [-23405, -5343, 25380, 39790, 4976, 18874, 38170, 17921, 1192, -15044, -25492, -40227, -29714, -18925, -28364, -5181, 5604, 9604, 24978, 11854, -17947, -3720, -8010, -24391, -10557, -15857, -48644, -58255, -33244, -27472, -17936, -17148, -6816, -388, 11529, 833, -35341, -21965, -9709, 8300, -2939, -13389, -15387, -13032, -4855, -24837, -25265, -26598, -42883, -54177, -37623, -36960, -50940, -51972, -34782, -28526, -14075, -13108, -19291, -28162, -18836, -3189, -391, -7941, -17740, 14905, 21687, 28091, -809, -38667, -6488, 27919, 35855, 27884, 2058, 18300, 19404, -8974, -35093, -54677, -70978, -52665, -23253, 3999, 15888, -19308, -47000, -48925, -39832, -29224, -29595, -9807, 1289, 9867, 16667, 691, -21317, -25992, -23459, -12314, -14606, -11828, 2236]
14341B236P495j4830J103L2801k132R537j6424k4208j8617J2213K412q580J5691
14328a303j112O92q493J476j8023k12J7190J854j2816j960O10N304J632m460r
14313a9630k210j6388N714L174q878J6668J1057O821p241j5972j7649J0553o569
14300d0550K0012K9500j556k0480l269Q827J4719j018j2047j585k2540J628J7581
14287a0778q678K4150M545l2360j6515N670J2108J1863Q801J0728j0763K3051
14275B1822n087k406k0458K43K0759k6369j4425j2028L067M0746K5645r339j8410
14262C760J2753j8777j1859J2036J0163m77J2468R321j5738q560j043M991j5182
14249f144j5897m388j1877L3324J311m563j3572p409J9947K665K1137J4286M735
$$ y = [2236, 9731, -5099, -3996, 28805, 26673, 36210, 19786, -4422, -23039, -10826, -8414, -16994, -1303, -2415, -1723, -10216, -8740, -26763, -26975, -9785, -7931, -20747, -22707, -22097, -16793, -15161, -19621, -19630, -21840, -38228, -32514, -29340, -38218, -21550, -10493, -3672, -10913, -26885, -44534, -33981, -40550, -20538, 8962, 7406, -13074, -16343, -7516, 7203, 6185, -5862, -7447, -29987, -28359, -10778, -19456, 4694, 9239, -23121, -39636, -33966, -21858, -9995, -1194, 9534, -1229, 21822, 16735, 14329, -6129, -5886, 14873, -11496, -25921, -37949, -34882, 5864, 31509, 22170, 3760, 16513, -2264, -14123, -2087, 8076, 7599, 20067, 29388, 13650, 5090, 4047, 9038, -6144, -22041, -26429, -38306, -4982, -3671, -8234, -21806, -29215, -9268, -6603, 14534, 28820, 33555]
14236C3555K892p946m1128N67J9164J6719o356j4896p452M150M227J1680j0312
14223D864M706j9353N211J1537R952k4435N614k65j1132J788R743j3672L594j6025
14209b7873j4384N95l69J3761J8126P275K4905k858j1621p09p217m8554j7030
14196f5953K1807Q677K3583J1404P238j6209l6476J0181j4559L0719N352J2771
14184a465k0622K0263O362j5388J0796q198j0074J7149j3279m556J1253k430R371
14171h18J1302m422L90M421J3529j6171l7920J3335K0312J086R895r826J429j4351
14157g809k7252N714M0780J179j1953r34J9524K107k3404R234P51m5945J9074
14144a8934j992j0144J8160K2048L1675j3099j9177j0625N775m215J5289k5168
$$ y = [33555, 36447, 28501, -12627, -12060, 7104, 23823, 17467, 2571, -4881, -731, 3496, 15176, 4864, 9570, -9783, -4572, 6965, 16917, -7518, -1904, -2169, -13301, -11513, -1770, -15442, -11848, -27873, -42257, -41662, -42031, -28270, -10144, -2869, 22036, 19178, 7557, 6848, -369, -48923, -65953, -44146, -35469, -11886, -482, 6756, -9453, -45929, -35748, -50307, -19588, -14236, -1465, -22087, -1824, 4538, -10850, -54, -8252, -18326, -1177, -14456, -19012, -7759, -10189, -818, 10484, 6062, 6452, 10873, 24402, 8231, -29689, -16354, 3958, 5044, 14939, 5113, 6542, -7809, -35061, -29347, 11433, 12612, 659, -275, 19249, 21356, -2048, 7186, 7937, -38008, -18934, -20926, -31070, -12910, 9138, 40813, 27714, 8537, -2088, 3687, -528, 14761, -10407]
14132a0407n440J5943l90J3903l070l0801q166J3859r343k3261l1409K4277J0512
14119d3793K3962L5844J5517q610J080O203m8L335R067M333m1238l2632K8318
14106A338M0059L129r340k6893j6571k5782K5563K4785o375k0013K1275J8425
14094B9600k1202l5599P048J6106r551q508k3118J5255J2027j5644m924R542J0526
14081a8442J1349J366p108J2410k4196N539J4974j1790k291r759j3540J4719J6752
14068a0017j2343J6452M625j6757j2533j4038J7015K4203J6735p571l1202l5747
14056f1178J6249K0921K8007N59k7487M217K8873q890M83j1148j5821m170l1885
14043f1270j5010J0574J0554L3403J5991j1082N47j041j3247m337L1754L3129
$$ y = [-10407, -15847, 96, -294, 13609, 10539, -20262, -28428, -14569, -23912, -47173, -78582, -54305, -43793, -19831, 16013, 31530, 22920, 24000, 30203, 30155, 33490, 42557, 46890, 5652, -26980, 1338, 41397, 44526, 35186, 8293, -8278, -34060, -8497, 16288, 9913, -10100, 11175, 29600, 8398, -27201, -20153, -4047, -13598, -22106, -45224, -29969, -17942, -33586, -38510, -28968, -18442, -7093, -5727, -12835, -425, -24621, -19082, -4108, -15898, -18189, -27948, -41488, -26769, -10017, -22360, -5908, -1283, -18040, -30573, -44611, -27596, -3393, 13342, 5771, -25431, -61178, -44929, -24008, 3999, 4558, -22929, -18712, 10161, 1271, 1754, -9394, -25215, -29385, -61270, -76280, -65706, -55152, -21749, -5758, -16840, -16293, -17334, -30581, -34918, -3164, 29965]
14031B9965J7734n359J732J959k8732k1011j7632k265J5132j0268j0499o799K310
14018c3733l582l296N366J9015R069k62j944o39j3821j7415N130J619N4844l244
14004A7107j1286l2702k0361J1612M4553L0309R635j836j2857j7713k1974R068
13992C555Q764P413K560j0436n029n722j5823K9634r260J0295J7880k0536m4085
13979c0790K0513n46K1344M0498r032k0572j3862j6673J0719K4447j0727j6878
13967a559j4123n348R938N947j6430N087q80k7662J0689K6025M156j3498j4367
13954c2025j9509Q328j2496N433K5969j1084k4122K9819J1534J8305J4663j6747
13942a932P274J4605J462k9183J3429K7032p523P393j226j3734j600k4062k6132
$$ y = [29965, 47699, 42340, 44072, 46031, 17299, -3712, -21344, -23609, -8477, -18745, -29244, -36043, -33733, -37315, -40611, -35245, -16230, -7161, -7423, -9367, -10006, -23827, -41242, -36112, -34493, 20351, 17107, 5821, -26881, -47242, -35630, 8923, 39232, 48867, 47031, 34174, 16461, -5513, 3555, 12319, 19732, 22292, 11856, 6827, 1105, -14718, 14916, 5656, 15951, 33831, 13295, -30790, -10277, -10823, 10521, 51019, 41987, 21415, 7553, -9120, 1599, 26046, 15319, -1559, -15682, -21030, -11092, -5145, -21575, -16488, -17368, -45030, -34341, -8316, -4160, -17658, -32025, -51534, -43206, -55702, -50269, -24300, -35384, -59506, -29687, -18153, 152, 14815, -1932, 5342, 19947, 21409, -7774, 5655, 32687, 25164, 32557, 31331, 17597, 15997, -8065, -34197]
13929c4197J2426Q078k3636j4177K2528N468j0150J992O850M793q401p498K4631
13916a1293j43J0926K1549J9517p297l1431j8040l3131k3781M6901Q219j8288
13904c6292N427K4036P294J1963k6943l3906q983L5019O059O227K379J6959P681
13891A6920j5469m549j1882j6478O717J9164M3672J09l5420k4933l5690k1453
13879g9292O268J4553J750j1596k0579J6973L0211J6575L47j1915J4850L973r961
13866b7843R449J9873L2972n421k1595P538J1143M245K0430L118j7903j4380P585
13853B9211O58P362J109l160j4324q590R34k992K8640L455k1683r450l763m134
13839C273j0433l013Q401q230j7979j751o210Q217J0121K2292K048j0031q761
$$ y = [-34197, -21771, -13693, -37329, -51506, -28978, -23510, -33660, -31668, -24818, -20025, -28426, -35924, -11293, -11436, -510, 21039, 40556, 33259, 1828, -16212, -49343, -73124, -26223, -18004, -36292, -30865, -6829, 465, 12428, -14515, -48421, -57404, -22385, -16326, -10099, -7720, 9239, 16920, 1451, -3098, -14980, -31458, -24741, -5577, 38095, 38204, 2784, -22149, -57839, -79292, -73024, -58471, -56721, -68317, -88896, -71923, -41712, -25137, -24790, -36705, -21855, -17882, -27843, -18394, 1479, 34451, 29030, 7435, 14973, 26116, 30361, 50791, 53909, 36006, 21626, 29211, 29869, 37231, 38340, 35180, 20856, 12266, 13200, 10208, 38848, 42303, 20620, 11170, 7407, 3273, -7160, -10173, -1772, -10002, -27981, -29732, -35942, -27725, -17604, 4688, 6736, -3295, -12056]
13826a2056j0722m217L343j2431R574J2972j1098n097L7895K5957j3639o321k233
13813A1927j0000J5653J6958r527J7186J4815q710j1420j6844k0467j1686J2497
13801C82J102k9104q55K319R089j3616k7127q401L3793J33K9256J1464Q370l2466
13787a5661k7884O295l547K7328K9000P772K2324k1920l6159j4936J430J5435
13775a0523j9759j2789J7072L1062k386j8882j3753j0383K876K1294j576l951
13763b1698M3977P892j0968m067p279j3806q314p156j6766J9809J7249j8080j8066
13750c7273j7754M4374K2270j3081j6738p881L2255J4059j5165O75J5832j6021
13738E552l502k1579q952R877K9062J3792k8973j5426j4094l244j404K3104M1352
$$ y = [-12056, -22778, -26995, -23652, -36083, -26509, -13537, -24635, -29732, 8163, 34120, 20481, 14160, 11927, 1927, 17580, 34538, 25011, 42197, 57012, 48302, 36882, 20038, -429, -12115, 382, 1484, -27620, -28475, -26156, -17067, -30683, -57810, -66211, -32418, -32285, -3029, 8435, 16805, -15661, -43545, -37250, -40797, -13469, 15531, 23303, 45627, 23707, -12452, -27388, -25958, -10523, -30282, -43071, -25999, 5063, 2677, -16205, -29958, -40341, -37465, -16171, -17747, -21698, 22279, 30171, 19203, 15136, 7857, -5949, -14263, -21419, -38185, -18376, -1127, -19207, -37273, -55027, -10653, 11617, -1464, -18202, -26083, 6172, 20231, 5066, 5741, 21573, 5552, 2050, -19529, -28481, -18604, 10458, 24250, -4723, -20149, -34243, -37487, -38891, -15787, 25565]
13725B5565J65r083j4157j3479l310o646N970q992j267J8539J4462M520J0023
13712B2310J8286J5343p18j7168j8554j7735R749q361j6437k7525j6103K7031
13700b9882J6410K0588k3190N691J1558J729p811J4076j0275n146O809j0272k8782
13687c8497l2383P502J7622K852j5736n780n893L1874K1120o655m991m828q9J5087
13673a8795K8384J3746J0235l174M047m615P95j0199L746m372q886k6165p686
13660b2939J0428m414n479m735K3498K6512j2008j3590J3398j0924j1374r405
13648b1032k3771J3767j1860J2553K6079M9637n029j6541n67J0353q546j5374
13636I669J0211r316k7243m193J1824L0867k1207j7917j1017L616o754L796M674
$$ y = [25565, 25730, 16647, 2490, -10989, -14299, -20945, -14975, -23967, -25234, -6695, 7767, 12287, 22310, 40596, 55939, 55221, 38053, 19499, 1764, 11513, 3152, -13285, -40810, -56913, -29882, -13472, 7116, -16074, -10383, 1175, 2904, -4907, 9169, -1106, -6252, 557, -9715, -38497, -70880, -63378, -45756, -42904, -58640, -64420, -70313, -38439, -17319, -23974, -28965, -33793, -33882, -18795, 9589, 23335, 33570, 30396, 34443, 29828, 30623, 20424, 24170, 19798, 10912, -15253, -22939, -12511, -16925, -22404, -27139, -3641, 22871, 10863, -2727, 10671, -253, -11627, -21032, -44803, -31036, -42896, -30343, -4264, 45373, 40344, 23803, 23236, 33589, 25043, 9669, 19880, 10564, -16679, -20872, -9048, 21819, 612, -17305, -28322, -24706, -31460, -27664, -22990]
13623b2990M602P018J0257O686j687k1914Q670K9883m715l7779k2703J9369k1115
13610d6418Q534K3462N649J1086q771j713J7334J0284K5275k761k7252j2798j557
13597C54j8j3763j8679k690L3852J5086K1084j9772m8294m6j3321k7956K3657
13584e0506L6791j1271l6381M388K3822M107j4086j0848J9189L1787r782P038
13572e752M2165N241m6215l0612j2045K4281J1350J4764P84J4519j3058N165J7259
13559B7846j1816j7934q149R659p157k0822m138k048j9635M191K0302J4630P038
13546h033j629N304m580O240K4494J5991J5867Q758m2532k1124k6414k1663L709
13533d5612J8677Q929k224K655m592K2487k2651l555K4014J7873M926J483j2278
$$ y = [-22990, -18388, -11370, -1113, 5573, 3886, -18028, -9358, 20525, 15810, -21969, -44672, -25303, -46418, -37884, -14422, -8773, 2313, -6458, -8171, 9163, 19447, 44722, 41961, 14709, 1911, 354, 336, -13427, -32106, -34796, -944, 14142, 35226, 15454, -32840, -32886, -46207, -74163, -50506, -13715, -24986, -61367, -56979, -33157, -29050, -43136, -53984, -34795, -3008, -12790, -5752, 36413, 41654, -4561, -35173, -47218, -22937, -11587, 3177, 3961, 18480, 5422, 10587, 27846, 16030, -1904, -10053, -394, -7551, -28373, -32511, -34559, -54194, -50003, -29701, -15071, -8033, -9662, -4358, -8938, -2698, 21796, 37787, 53654, 62412, 19880, -1244, -27658, -49321, -45612, -26935, -18006, -20230, -17575, -22167, 320, -22331, -25886, -1872, 16001, 20927, 22410, 10132]
13520A0132j6994J4775k545J8280K772q774M718k4588k8101j1220J2271l347J356
13507c1265K4878j986k9668j1467l455J1976J6114l782j2806R872K2003j1383
13495b0969l810p496K2211K577n760j171J2807J7428l399l7678K870K305J2202
13482g883L0565J2326p153j7592J700m345j8850J7443o533k90j576o661Q526j2008
13468a2331r836r568J6362J2517N518j4699j1660J0712O514K4094L1163k1086
13456B7700j3843k0680k4498j4362J5614J4974J3556O778j3994k537J9469j2347
13444d170k5740j8617k0535J7542J0177L5268J4697N885J0378j6322k3988j3851
13432b9276N353J7319M464M606K5770j5663j6909j1701n664o294L2091J8166l7110
$$ y = [10132, -6862, 7913, 5368, 23648, 26420, 17646, 22364, -2224, -30325, -41545, -29274, -32621, -31265, -6387, -8373, -38041, -49508, -52963, -40987, -24873, -28655, -41461, -31589, -9586, -20969, -24779, -32275, -10064, -7487, -13247, -14418, -1611, 15817, 12418, -25260, -22390, -20085, -7883, 22682, 35008, 27855, 10263, 11963, 7618, -11232, 6211, -322, -612, -2188, -8849, -323, -12331, -22167, -31735, -15373, -2856, 2662, -12037, -23697, -12985, -6471, 17623, 48786, 27700, 13857, -6823, -31321, -45683, -30069, -15095, -1539, 5239, -8755, -11292, 8177, -4170, -29910, -48527, -69062, -51520, -41343, -6075, 8622, 14507, 24885, 8563, -15425, -29276, -23923, -6604, -2140, 2466, 28236, 12573, -4336, -16037, -21701, -27995, 4096, 22262, -14848]
13419a4848k2266r762K4690K141J1307j9288j3231M133M5037L688k7746M786L950
13406g409j3571p612K3040K2875K1472M33l0250l0798j28k700J7207Q465Q779
13393I803n849k4902j5425j044k6859K8012L0700O463J62j4535k1168O49K7133
13380f860K3585j3444M872J8902J3332l3513q292J5963J2980J6371K853r391K779
13367D0137l227j8606o788J6256n216J4735n5K2478r735j1821o068j0537j406
13354B0147j7105r695J5379K995j4300l8641J1640K2693j8990J2319J7131N282
13342H855M117k020L904P617k2974K355J0854m323j8405K816J0738J6974L905
13329B4413k1980J8782J424j2813K7435P300J127o568p615j7024L18J2931k387
$$ y = [-14848, -37114, -46876, -22186, -20045, -8738, -28026, -41257, -37124, 7913, 11601, -16145, -11359, -7409, -20980, -28592, -5552, 17323, 38795, 39228, 8978, -21820, -21948, -24648, -7441, 1024, 9803, 3954, -20948, -36373, -37417, -64276, -36264, -5564, 899, 1061, -13474, -34642, -33993, -6860, 16725, 3281, 8153, 27055, 40387, 6874, -1418, 14545, 27525, 43896, 46749, 37358, 40137, 36910, 18304, 11516, 27772, 22556, 37291, 37236, 59714, 49979, 38158, 32090, 21553, 20147, 3042, -6653, 8726, 11721, -2579, -41220, -29580, -6887, -25877, -13558, 3573, 8855, 12972, 10952, 14856, 22473, -501, 1854, 12708, 8385, -10020, -7204, 3534, 20508, 24413, 2433, 21215, 22639, 9826, 37261, 44561, 45688, 39120, 31505, 14481, 14799, 27730, 25343]
13316B5343j1751P059m3692l8531J7837K1335L2034J4830q943j590K1765j4027
13304B1669j2493j3145N036J9447L178l0048k0303J2289L9946K3873k8841k8784
13292h176Q059K4372j5652L497m779j4526l249O471L0728P850l417j5391j4627
13279A160K530o03P512p664q608N258L922k2753k0378J4846M64J6726K4210M411
13265B1033J0991O808m795N29m0097q304J7619j3877K2488J8582k2690J1919O679
13252B6885j4576M00Q935l752j8619n386k9652l2829P747K5548j757K527J0796
13239b3733r712K1843J2573M0842j1073l3274P491L7395o039k1612L810m256k2346
13226h091m116J4556l1404j5412P214J8468J7153r57J5279P958j5163k7342L7359
$$ y = [25343, 13592, 20651, -23041, -61572, -43735, -22400, 9634, 24464, 15521, 13931, 35696, 21669, 9176, -3969, 1067, 20514, 23692, -6356, -26659, -14370, 25576, 49449, 20608, -8176, -117, 24255, 8603, 12100, 7321, -7205, -10454, -3983, 26745, 34595, 31178, 15787, 1160, 3690, 3087, 10599, 2935, -5673, -415, 3507, -19246, -39624, -24778, -24314, -7588, 16622, 21033, 32024, 38832, 34037, 34566, -5531, -13835, 3784, -10093, 12395, 30977, 8287, 20206, 26885, 12309, 12709, 21644, 17892, -727, -6113, -35765, -68594, -60847, -35299, -37056, -34529, -23733, -33445, -11602, 971, 41813, 30740, -2534, 4957, 42352, 36313, 14701, 18511, 14255, -8091, -12207, 2349, -29055, -44467, -37253, -18785, -1632, -2589, 12690, 20648, 5485, -21857, 15502]
13213A5502K5146j2357l5916j2497J036q396k319K2998P426k579N211j8988P717
13200h016j099l869j2177J2656J6306l619O474k4179O738L1156J4089j8644L490
13187A9306O031n853N3k2639j0952J0661K5986J9871j418J2232k1381M873K2336
13174E9106O863j6167k8789k9159J711k4R994j0018J7578O983l1745k938j840
13161a8445J1353n322l93J5939K9724L0119l9987m9287m385l787L1067P783j3432
13148i053k3850o323J3073L8569J829k8185l0126j1762J852J2468l233K3280R043
13135a2418L2559K3524m8303l1293J1612M570j753O467N006J7871Q833N523r098
13122A3100j905k9010k2117K0780K1349j9224J4348K3608J826k0645m063N14k9240
$$ y = [15502, 40648, 28291, -7625, -20122, -19086, -27482, -29801, -6803, 623, -1956, 3255, -15733, -8016, -9115, -12984, -25161, -12505, 3801, 182, 6656, -17523, -10785, 20371, 34460, 15816, 19306, 25337, 19484, 19537, -3102, -14054, -3393, 22593, 42464, 41046, 53278, 31897, 36770, 59106, 65969, 49802, 21013, -8146, -6435, -6459, 3535, -6483, 11095, 18078, -13667, -16605, -18445, -7092, -12414, -12807, 3132, 32856, 62975, 22988, -26299, -30684, -34471, -3404, 4379, -9053, -32903, -39226, -26153, 12416, 14245, -13940, -44066, -55828, -53976, -41508, -44741, -21461, -12418, 20141, 43665, -4638, -35931, -24319, -19749, -21502, -15035, -10029, 7842, 16675, 22198, 13100, 11195, -17815, -39932, -19152, 2197, -17027, -2679, 20929, 22755, 2110, -1953, -1439, -30679]
13109c0679j8017L5254J5272j7863K078Q870M2889J5097k0849q356m0273p732
13097b4309p723k5007r42O963j0208J6196L7164L8129j2951k2708j1327n955o932
13084b9610m14L8947O868k2814l562K762J2292J898p675k5207L556p198j3931
13071d4088J8280R096J2771L6688n582J6813j1653k3181j8673N342r964p794l632
13058b5577k355L4886M199o663j3780q281N573k659N04K3652N482k3926j6300
13045b5245j3678K912J6307L1645m272k9699L173O80j5258K074j5075r623J5197
13032d0862K3583J4398R868J6467q967p09J8546L35m773o153n751M323j067k2591
13018c353m039P852K4098J0550J4012K9326J2365l9140l6540m324k3156p359J4828
$$ y = [-30679, -48696, -13442, 1830, -16033, -13955, -5085, 37804, 52901, 32052, 23696, -16577, -24309, -32032, -57039, -57981, -51018, -61226, -45030, -7866, 30263, 17312, -5396, -16723, -22678, -29610, -30024, 8923, 15791, -7023, -10585, -7823, 4469, 6367, -1308, -26515, -22959, -30157, -44088, -25808, -16712, -3941, 32747, 27165, 43978, 32325, 9144, -9529, -4187, -14151, -21945, -25577, -27932, 6954, 11153, 4490, -9290, -17571, -11998, -14657, -14153, 9499, 14981, -8945, -25245, -38923, -36011, -19704, 11941, 7669, -22030, -18857, -18177, -33435, -31361, -46436, -56059, -40862, -17279, -2881, 6987, 23454, 14487, 13778, 32324, 32659, 27886, 21733, 15982, 20305, 19238, -3353, -7392, 460, 24558, 35108, 49120, 78446, 90811, 51671, 15131, 10807, -12349, -19708, -4880]
13005d880J2825J5771j240k779J3835m4918m2087J6756K2955r395n131J4278J126
12992a2884J4797o29J3185N628j8202l7083j2965J7627N3793J328j5465j3157
12980d027m026j3429L454K2646K2277O686j6639n072K4133j272q557j0391J4893
12967C0676K8980j2511k9196m780m745j8739k015j9144J1788K1329J9989m95l8283
12954a7146k2736J9808K0675J1563k6549n552Q792p669j5142J5748N236j2878
12942b5850J5241J4296K2573k462q544k2655J8750M049j0123p6224k4567J1583
12930h3933P127R76J6528K8385k424k2576j5449J038K4325J9791Q593J4702k1613
12917b4530m168P362K0871K8786R231J9096j9270R56q714j0168K0440N681J1306
$$ y = [-4880, 7945, 23716, 22476, 19697, 33532, -11386, -53473, -36717, -13762, -23157, -28288, -14010, -12884, 1913, 1284, 14469, 20097, 1895, -35188, -48153, -30526, 23267, 24595, 9130, -4027, -8053, -21482, -18028, 4618, 26895, 33581, 16942, 11870, 36003, 34731, 26174, 15783, 30676, 59656, 47145, 17949, 13169, 8424, -10315, -12330, -31474, -19686, 1643, 21632, 21137, -17146, -39882, -20074, 601, 12164, -14385, -19937, -11145, -18814, -33956, -18208, -12972, -25850, -10609, 3687, 26260, 23798, 15254, -7401, 11349, 15398, 5275, -70949, -95516, -83933, -76806, -75830, -59302, -30917, -33341, -55917, -71366, -70328, -46003, -26212, -17619, -2917, -24530, -28698, -21336, -465, 28321, 37552, 56648, 37378, 38334, 29620, 19452, 39892, 45573, 56879]
12904E6879n332j6970j282K3569J2777j9425o08m375n2112k43L210K7721O307
12891C0116J672J803R674j9782r484j4712K422O587J0795k8627l340K8954l0800
12878a4722N42K4491k3948l3590M92n037K3630J3596q508o612J4408J2541J7277
12865A4560j2133j7551J8794L4817j4973J8790R941M08K0903N697K5924M0634
12853A45811k158L9950J45849K10734L40428N44586M87623N2653k90728m10136
12843A264612l60638k65620j68155j46938r5283m1844k7469n376k3903O691j0326
12832A25751k9766k9025p29J7247j3724Q259J947l923j1155k1937j6333L451N42
12819C0605K235p5p60n501o021j3718j991J5366l765k6834J2910J0633k2539n474
$$ y = [56879, 51547, 34577, 33295, 56864, 69641, 50216, 49608, 45233, -6879, -7122, -3912, 23809, 30116, 31788, 33591, 43265, 23483, 13999, -713, 1709, 8296, 19091, -9536, -12876, 16078, -14722, -14180, 10311, -13637, -47227, -46735, -51772, -28142, -14546, -23054, -29666, -15258, -2717, 14560, 2427, -15124, 3670, 38487, 23514, 42304, 52245, 52653, 73556, 79253, 105177, 145811, 143653, 183603, 329452, 540186, 880614, 1425200, 1912823, 1965476, 1674748, 1264612, 903974, 638354, 470199, 323261, 227978, 186134, 158665, 153289, 129386, 136077, 125751, 95985, 66960, 66231, 83478, 69754, 78013, 79960, 76037, 64882, 42945, 26612, 30063, 30605, 32840, 32765, 32005, 26504, 20483, 6765, 4774, 20140, 16375, -10459, 2451, 13084, -9455, -14929]
12805a4929O539K7755L3638k8019j0117o029j3779K449J2178p734j0439J8018
12793I531j5790k3678j1071L028K7890J8464M6828L8700j0518l7532l618j2086
12781C0148k1817R93L0427l1141m6428K1204O237n281J7065J8474j1416j2442
$$ y = [-14929, -8390, 19365, 53003, 24984, 14867, 8838, -4941, -2492, 9686, 1952, -8487, 9531, -6259, -29937, -41008, -37980, -10090, 8374, 55202, 93902, 83384, 45852, 42234, 30148, 8331, 9324, 39751, 8610, -37818, -16614, -10377, -15658, 1407, 19881, 8465, -3977]
$$ [...]
##END NTUPLES=NMR SPECTRUM
##END=
