##TITLE=Analysis number 317734
Compound Code mo 00539
Book Reference 475/4
Project Code adrs
Chemist Name janep
##JCAMPDX= 6.0         $$ Bruker NMR JCAMP-DX V2.0
##DATA TYPE= NMR SPECTRUM
##DATA CLASS= NTUPLES
##ORIGIN= Bruker BioSpin GmbH
##OWNER= nmr
$$ XWIN-NMR		Version 3.5
$$ Thu Mar  2 08:41:56 2006 GMT Standard Time (UT+0h)  MAYBRIDGE\nmr@NMR_250MHZ
##.OBSERVE FREQUENCY= 250.131544655141
##.OBSERVE NUCLEUS= ^1H
##.ACQUISITION MODE= SIMULTANEOUS (DQD)
##.ACQUISITION SCHEME= undefined
##.AVERAGES= 16
##.DIGITISER RES= 18
##SPECTROMETER/DATA SYSTEM= dpx250
##.PULSE SEQUENCE= zg30
##.SOLVENT NAME= DMSO
##.SHIFT REFERENCE= (INTERNAL, DMSO, 0, 16.522)
##AUDIT TRAIL= $$ (NUMBER, WHEN, WHO, WHERE, WHAT)
$$ ##TITLE= Audit trail, XWIN-NMR		Version 3.5
$$ ##JCAMPDX= 5.01
$$ ##ORIGIN= Bruker BioSpin GmbH
$$ ##OWNER= nmr
$$ C:\u/data/dgb/nmr/ADRS/17260/pdata/1/auditp.txt
$$ ##AUDIT TRAIL=  $$ (NUMBER, WHEN, WHO, WHERE, WHAT)
(   1,<2006-03-02 08:41:03.45 +000>,<MAYBRIDGE\nmr>,<NMR_250MHZ>,
      <created by zg, POWCHK disabled, PULCHK disabled
       configuration hash MD5:
       84 BC 41 DB A1 6E 1D 46 DA 25 12 A5 C1 ED C5 3A
       data hash MD5: 64K
       F2 67 7C 49 D0 74 5E 79 35 36 70 7E C4 C4 B9 BA>)
(   2,<2006-03-02 08:41:31.45 +000>,<MAYBRIDGE\nmr>,<NMR_250MHZ>,
      <Start of raw data processing
       ef LB = 0.3 FT_mod = 6 PKNL = 1 SI = 32K 
       data hash MD5: 32K
       FA 6B C3 48 D1 0A F7 C8 AD 1C B3 A9 93 21 E7 9B>)
(   3,<2006-03-02 08:41:35.34 +000>,<MAYBRIDGE\nmr>,<NMR_250MHZ>,
      <apk 
       data hash MD5: 32K
       AA A3 FC 1D AB FE F1 04 25 E5 09 6D 4D AB A4 42>)
(   4,<2006-03-02 08:41:36.75 +000>,<MAYBRIDGE\nmr>,<NMR_250MHZ>,
      <abs ABSG = 5 
       data hash MD5: 32K
       7F B6 38 18 C1 E8 7E 75 D1 46 8A 53 C2 2B 98 07>)
$$ ##END=
$$ 
$$ hash MD5
$$ 4A 25 11 18 F9 57 21 D0 53 85 67 A5 FB 89 74 78
##$RELAX= 
##$RELAX= 
##$RELAX= 
##$RELAX= 
##$RELAX= 
##$RELAX= 
##$RELAX= 
$$ Bruker specific parameters
$$ --------------------------
##$DU= <C:\u>
##$EXPNO= 17260
##$NAME= <ADRS>
##$PROCNO= 1
##$TYPE= <nmr>
##$USER= <dgb>
##$AMP= (0..31)
100 100 100 100 100 100 100 100 100 100 100 100 100 100 100 100 100 100 
100 100 100 100 100 100 100 100 100 100 100 100 100 100 
##$AQSEQ= 0
##$AQ_mod= 3
##$AUNM= <au_zg>
##$AUTOPOS= <3 >
##$BF1= 250.13
##$BF2= 250.13
##$BF3= 250.13
##$BF4= 250.13
##$BF5= 500.13
##$BF6= 500.13
##$BF7= 500.13
##$BF8= 500.13
##$BYTORDA= 1
##$CFDGTYP= 0
##$CFRGTYP= 5
##$CHEMSTR= <none>
##$CNST= (0..31)
1 1 145 1 1 1 1 1 1 1 1 1 1 1 1 1 1 1 1 1 1 1 1 1 1 1 1 1 1 1 1 1 
##$CPDPRG= <>
##$CPDPRG1= <>
##$CPDPRG2= <>
##$CPDPRG3= <>
##$CPDPRG4= <mlev>
##$CPDPRG5= <mlev>
##$CPDPRG6= <mlev>
##$CPDPRG7= <mlev>
##$CPDPRG8= <mlev>
##$CPDPRGB= <>
##$CPDPRGT= <>
##$D= (0..31)
0 1 0 0 0 0 0 0 0 0.06 0 0 0 0 0 0 0.0002 0 0 0 0 0 0 0 0 0 0 0 0 0 0 
0 
##$DATE= 1141288861
##$DBL= (0..7)
120 120 120 120 120 120 120 120 
##$DBP= (0..7)
150 150 150 150 150 150 150 150 
##$DBP07= 0
##$DBPNAM0= <>
##$DBPNAM1= <>
$$ [...]
##$SUBNAM7= <"">
##$SUBNAM8= <"">
##$SUBNAM9= <"">
##$SW= 20.6930455092707
##$SWIBOX= (0..15)
0 0 3 0 0 0 0 0 0 0 0 0 0 0 0 0 
##$SW_h= 5175.983436853
##$TD= 65536
##$TD0= 1
##$TE= 293.16
##$TE2= 300
##$TE3= 300
##$TEG= 300
##$TL= (0..7)
0 120 120 120 120 120 120 120 
##$TP= (0..7)
150 150 150 150 150 150 150 150 
##$TP07= 0
##$TPNAME0= <>
##$TPNAME1= <>
##$TPNAME2= <>
##$TPNAME3= <>
##$TPNAME4= <>
##$TPNAME5= <>
##$TPNAME6= <>
##$TPNAME7= <>
##$TPOAL= (0..7)
0.5 0.5 0.5 0.5 0.5 0.5 0.5 0.5 
##$TPOFFS= (0..7)
0 0 0 0 0 0 0 0 
##$TUNHIN= 0
##$TUNHOUT= 0
##$TUNXOUT= 0
##$USERA1= <user>
##$USERA2= <user>
##$USERA3= <user>
##$USERA4= <user>
##$USERA5= <user>
##$V9= 5
##$VALIST= <valist>
##$VCLIST= <CCCCCCCCCCCCCCC>
##$VD= 0
##$VDLIST= <DDDDDDDDDDDDDDD>
##$VPLIST= <PPPPPPPPPPPPPPP>
##$VTLIST= <TTTTTTTTTTTTTTT>
##$WBST= 1024
##$WBSW= 4
##$XGAIN= (0..3)
0 0 0 0 
##$XL= 0
##$YL= 0
##$YMAX_a= 305668
##$YMIN_a= -359641
##$ZGOPTNS= <>
##$ZL1= 120
##$ZL2= 120
##$ZL3= 120
##$ZL4= 120
##$ABSF1= 16.522
##$ABSF2= -4.171173
##$ABSG= 5
##$ABSL= 3
##$ALPHA= 0
##$AQORDER= 0
##$ASSFAC= 0
##$ASSFACI= 0
##$ASSFACX= 0
##$ASSWID= 0
##$AUNMP= <proc_1d>
##$AZFE= 0.1
##$AZFW= 0.1
##$BCFW= 0
##$BC_mod= 0
##$BYTORDP= 0
##$COROFFS= 0
##$CY= 12.5
##$DATMOD= 1
##$DC= 0
##$DFILT= <>
##$DTYPP= 0
##$F1P= 14.0000005364418
##$F2P= -0.99999901652339
##$FCOR= 0.5
##$FTSIZE= 32768
##$FT_mod= 6
##$GAMMA= 0
##$GB= 0
##$INTBC= 1
##$INTSCL= 1
##$ISEN= 128
##$LB= 0.3
##$LEV0= 0
##$LPBIN= 0
##$MAXI= 10000
##$MC2= 0
##$MEAN= 0
##$ME_mod= 0
##$MI= 0
##$NCOEF= 0
##$NC_proc= -5
##$NLEV= 6
##$NOISF1= 0
##$NOISF2= 0
##$NSP= 0
##$NTH_PI= 0
##$NZP= 0
##$OFFSET= 16.522
##$PC= 1
##$PHC0= 243.282
##$PHC1= 5.480825
##$PH_mod= 1
##$PKNL= yes
##$PPARMOD= 0
##$PSCAL= 4
##$PSIGN= 0
##$REVERSE= no
##$SF= 250.13
##$SI= 32768
##$SIGF1= 0
##$SIGF2= 0
##$SINO= 400
##$SIOLD= 32768
##$SREGLST= <1H.DMSO>
##$SSB= 0
##$STSI= 32768
##$STSR= 0
##$SW_p= 5175.98343685301
##$SYMM= 0
##$S_DEV= 0
##$TDeff= 65536
##$TDoff= 0
##$TI= <Analysis number 999999
Compound Code 99
Book Reference 9
Project Code 9>
##$TILT= no
##$TM1= 0
##$TM2= 0
##$TOPLEV= 0
##$USERP1= <user>
##$USERP2= <user>
##$USERP3= <user>
##$USERP4= <user>
##$USERP5= <user>
##$WDW= 1
##$XDIM= 32768
##$YMAX_p= 453615651
##$YMIN_p= -1213504
$$ End of Bruker specific parameters
$$ ---------------------------------
##NTUPLES= NMR SPECTRUM
##VAR_NAME=  FREQUENCY,     SPECTRUM/REAL,   SPECTRUM/IMAG
##SYMBOL=    X,             R,               I
##VAR_TYPE=  INDEPENDENT,   DEPENDENT,       DEPENDENT
##VAR_FORM=  AFFN,          ASDF,            ASDF
##VAR_DIM=   32768,         32768,           32768
##UNITS=     HZ,            ARBITRARY UNITS, ARBITRARY UNITS
##FACTOR=    0.157963299565203, 1,           1
##FIRST=     4132.6476996994, 0,             0
##LAST=      -1043.33573715361, 0,           0
##MIN=       -1043.33573715361, -1213504,    0
##MAX=       4132.6476996994, 453615651,     0
$$ Real data points
##PAGE= N=1
##DATA TABLE= (X++(R..R)), XYDATA
$$ [...]
23961B50641q155L2374Q6030j69998k78140L10572L15995K55472N364k63292j99823
23950C37040p813j86090k77193K65782K69742R9022k6514J15075l5483j74295
23940C79273M527j85612q5011L9609K32080j3851K8588K5146o5423o1910j0014
23929B87402r4999J16821m1076m0775J0616K6523J12997K6530r318Q0079j27112
23918C47688j16316j23191P6564O6454r6909k46838l9538J81271k2792J77287
23908B03680K49239J73675K4490R2724L5151j50844j91249j35694r5598K78084
23898D83658M3011j1541r9050K0833L09610L00443Q326k64783m75698P9745k7629
23887C66925j76233J33016J95822m9768l03965r0671K24559J33035p5441K4242
$$ plain form
23961 250641 242486 274860 360890 190892 -87248 223324 539319 794791 800155 536863 337040
23950 337040 329227 143137 -134056 131726 401468 500490 473976 589051 553568 379273
23940 379273 383800 198188 113177 152786 384866 371015 399603 424749 359326 297416 287402
23929 287402 192403 309224 268148 227373 237989 264512 377509 404039 394721 474800 347688
23918 347688 231372 108181 184745 251199 154290 -92548 -132086 49185 26393 203680
23908 203680 452919 626594 651084 743808 778959 628115 436866 301172 205574 483658
23898 483658 526669 515128 416078 436911 746521 1046964 1055290 790507 314809 394554 366925
23887 366925 190692 323708 519530 469762 165797 75126 299685 432720 357279 381521
23877C81521j8135p6142M6006J46618J18843q0767j3350J71522L4027N904j13143
23866F02904N8301j62536j45979q8159L06024J75188J5756L3609j72927k11081
23856D11100k20896P6519J66877L79245r240j08286P131P153P0417P5286j51593
23845G03713l43481j43530K41504r804q7260K05777K4961k14126L01464K30522
23835I09740J04356r4263K7035N5329J7342m3081j45206j15284k51053q2540N2850
23824D35225J63858L8940j0875j36960j05010j4019J31630P9433l1278J35008
23814F85952M037r705J57421L2613L1529m4255k22269J55633J50986J29928j01522
23803I70348l2256j60115r4293l45203r0964J37950J347K37881L25593J54721
$$ plain form
23877 381521 363386 287244 333250 479868 598711 517944 504594 676116 710143 716047 602904
23866 602904 661205 498669 352690 264531 570555 745743 761499 795108 622181 411100
23856 411100 190204 266723 433600 812845 803605 695319 702450 709603 780020 855306 703713
23845 703713 360232 216702 458206 448402 361142 566919 591880 377754 679218 909740
23835 909740 1014096 919833 946868 1002197 1019539 976458 831252 715968 464915 382375 435225
23824 435225 599083 638023 627148 490188 385178 371159 502789 582222 550944 685952
23814 685952 689989 680284 837705 870318 901847 857592 635323 790956 941942 1071870 970348
23803 970348 938092 777977 683684 338481 247517 385467 386814 624695 950288 1105009
23793A105009J3851l5619k24186j5721M20721Q7184j32099j53185L2888P1625
23783A170468j40956J60041q1422j65046R131r9688P5489K03206P9384k6046K62428
23772A446989m4640m18368k17602J92099l76L26025m0074k32370j20980p391M1192
23761I24504J46801L7037r5819j85795j14301o6701k2944Q4718O531K86900K92855
23750A293786j44856m7776j137k56668L55217O2513l23846O0544J54580j15473
23740A036884N6352J34342q817L4558j09851q57l47866o7147M11120j71639l80831
23729E86248l49736M61446M87072J07938J95341L25422P754J18463l0224M1447
23719A951171J04720j41269j23926m6997N7925m5155J38201r4625k05694P1187
$$ plain form
23793 1105009 1118860 1083241 859055 843334 1264055 1351239 1219140 1065955 1098843 1170468
23783 1170468 1029512 1189553 1108131 943085 952216 852528 928017 1131223 1210607 1184561 1446989
23772 1446989 1402349 983981 766379 958478 958102 1284127 1244053 1011683 890703 883312 924504
23761 924504 1071305 1108342 1012523 826728 712427 645726 622782 707500 714031 1000931 1293786
23750 1293786 1148930 1101154 1100017 843349 1198566 1261079 937233 997777 1152357 1036884
23740 1036884 1093236 1227578 1218761 1253319 1143468 1142611 794745 727598 1138718 967079 586248
23729 586248 236512 697958 1185030 1292968 1488309 1813731 1821485 1939948 1909724 1951171
23719 1951171 2055891 1914622 1790696 1743699 1801624 1756469 1894670 1800045 1594351 1665538
23709A665538K24622Q6358J69753k8957J06668l7942J43209j11070l83034q8657
23699A746488L7861n3270N252J87387K07070J61991k45652k12016j24146K50976
23689A961941k3068l8543J36237L12893j97632j38831M58929K12681Q2563j45951
23679B621219P6889K4177R1140q2263j65071O9041J04895K79192J20915Q6021
23669C226155J70446O8782o5493K35687j07591j96131j27058j49l3908K45195
23659C415935K93935J72713M6860j41307O8248L38986L14594L2317p7875j886
23649D462520j8708L6045M88322J56698j31288r5547P1829K35717N1400K4678
23639E281666J09792J47516K70721L07863J78465j36827J56241L79269K90019
$$ plain form
23709 1665538 1890160 1976518 2146271 2117314 2223982 2186040 2329249 2218179 1835145 1746488
23699 1746488 1784349 1731079 1736331 1923718 2130788 2292779 2047127 1835111 1710965 1961941
23689 1961941 1938873 1900330 2036567 2349460 2151828 2012997 2471926 2684607 2767170 2621219
23679 2621219 2698108 2722285 2813425 2731162 2566091 2635132 2740027 3019219 3140134 3226155
23669 3226155 3396601 3465383 3399890 3635577 3527986 3331855 3204797 3204648 3170740 3415935
23659 3415935 3709870 3882583 3929443 3788136 3856384 4195370 4509964 4542281 4464406 4462520
23649 4462520 4443812 4479857 4968179 5124877 4993589 4898042 4969871 5205588 5256988 5281666
23639 5281666 5391458 5538974 5809695 6117558 6296023 6159196 6315437 6694706 6984725
23630F984725J22081N0095K69206L17861K41676J81624Q5198K94441K32082J10572
23620H889561L08868P5328L46928K81573J56690K46891L95713O08729J37207L87975
23610A1835463L86891K60998O07494N44311O66031M05983K51275M23361N11900
23601A5893707Q11767O81929M41628N57319P36989R75014Q54599P28305O94583
23592B2375840J008601J218685J193398J129565J140218J141659J133730J370616
23584C1712312J833321J720457J626776J681837J902613K251344K351969K205352
23576D7285981K423256K532462K823334K788245K723973K957018L382294L293687
23568G0210250L551097L837760M088492L923041L853296L867068L847727L614783
$$ plain form
23630 6984725 7106806 7156901 7426107 7743968 7985644 8167268 8252466 8546907 8778989 8889561
23620 8889561 9198429 9273757 9620685 9902258 10058948 10305839 10701552 11310281 11447488 11835463
23610 11835463 12222354 12483352 13090846 13635157 14301188 14707171 14958446 15381807 15893707
23601 15893707 16705474 17387403 17829031 18386350 19123339 20098353 20952952 21681257 22375840
23592 22375840 23384441 24603126 25796524 26926089 28066307 29207966 30341696 31712312
23584 31712312 33545633 35266090 36892866 38574703 40477316 42728660 45080629 47285981
23576 47285981 49709237 52241699 55065033 57853278 60577251 63534269 66916563 70210250
23568 70210250 73761347 77599107 81687599 85610640 89463936 93331004 97178731 100793514
23560A00793514L407478L669892L149483K464955J987542J551045R19527O85245
23552A18628681j34092n37314p61682j418612k098156k398319l058206l458560
23544A04763740l797075l886792l931920l987313l635078l409599l429459l598727
23536G5087777l771827l384907l030555k899832k923299k959546k620662k460965
23528E1036184k126179k425908k255043k212451k148487j797874j529623j538226
23520C5002393j554692j497629j292113j174280j244234j052018j192548j029994
23512B4964885j019463q12008r36050q08939p01231j246483q43552m90517m45732
23503A7660910o85494o23348q25583l71815k52827m98278q64304m68886l38986
$$ plain form
23560 100793514 104200992 107870884 111020367 113485322 115472864 117023909 117943436 118628681
23552 118628681 118494589 117957275 117195593 115776981 113678825 111280506 108222300 104763740
23544 104763740 100966665 97079873 93147953 89160640 85525562 82115963 78686504 75087777
23536 75087777 71315950 67931043 64900488 62000656 59077357 56117811 53497149 51036184
23528 51036184 48910005 46484097 44229054 42016603 39868116 38070242 36540619 35002393
23520 35002393 33447701 31950072 30657959 29483679 28239445 27187427 25994879 24964885
23512 24964885 23945422 23133414 22197364 21388425 20687194 19440711 18597159 18106642 17660910
23503 17660910 16975416 16352068 15526485 15154670 14901843 14403565 13539261 13070375 12731389
23494A2731389l11453m76512k38382m61290m39411o3458l12919l98414j36597
23485I892953k96108k65669l18503j22637k85737l19898j96271J59877k53297
23476G994710k20340j26526k72688k65696k38904n9170k81712j83683l54879r4671
23466E896441r5617n1184j92767l23657J113j63859J41395L42550l31680m00299
23456D822436j51538j47511L414l2241o1207K6604j51520m5190k47888j23964
23446C891395K6551j79083l42221L955J67774o0049j00537j65077j727K96308
23436C537289Q0731J30931K1237k58057o0160j34851l79396j21391k33456m9152
23426B533725J50617k132j8521J68432R9480J39042K6489k06058l33872p3639
$$ plain form
23494 12731389 12419936 11943424 11705042 11243752 10804341 10740883 10427964 10029550 9892953
23485 9892953 9596845 9331176 9012673 8890036 8604299 8284401 8088130 8248007 7994710
23476 7994710 7774370 7647844 7375156 7109460 6870556 6811386 6529674 6345991 5991112 5896441
23466 5896441 5800824 5749640 5556873 5233216 5234329 5070470 5211865 5554415 5222735 4822436
23456 4822436 4670898 4523387 4526801 4494560 4433353 4459957 4308437 4263247 4015359 3891395
23446 3891395 3917946 3738863 3396642 3400597 3568371 3508322 3407785 3242708 3240981 3537289
23436 3537289 3618020 3748951 3770188 3512131 3451971 3317120 2937724 2816333 2582877 2533725
23426 2533725 2684342 2682210 2663689 2832121 2931601 3070643 3097132 2891074 2557202 2483563
23416B483563n8725l3124o4386r3419k5926J42935O4552j43220j76817j0614J10900
23405B195719r4908k08471J03874J35573J74201j78658j6470k5411k07561L7068
23395A914956M31049J23955r362J6490k03492k27584N458r5586k89403n6499j493
23384A608489K5566j57985k0688Q839o333J79373j43249K88153J46871j87702
23374A741334j71148o0926k21309j18863L46916K68572n923q9208l9169L7119
23364A687395j02933k10250l9952m6593m42497K3096K93982k21278m3429l0466
23354H67075j63279N8420L52971N9450j7683J607j15961K70938J97242k18251
23344A292529K4062k73830j91684J90593J3608K8287N7892p4934k83163L4631
$$ plain form
23416 2483563 2424838 2391714 2327328 2233909 2207983 2350918 2415470 2272250 2095433 2084819 2195719
23405 2195719 2100811 1892340 1996214 2131787 2305988 2127330 2110860 2085449 1877888 1914956
23395 1914956 2346005 2469960 2460598 2477088 2273596 2046012 2051470 1955884 1666481 1609982 1608489
23384 1608489 1634055 1476070 1455382 1464221 1457888 1637261 1494012 1782165 1929036 1741334
23374 1741334 1570186 1509260 1287951 1169088 1516004 1784576 1778653 1689445 1650276 1687395
23364 1687395 1584462 1374212 1334260 1287667 845170 868266 1162248 940970 897541 867075
23354 867075 703796 762216 1115187 1174637 1156954 1158561 1042600 1313538 1510780 1292529
23344 1292529 1316591 1042761 851077 1041670 1055278 1083565 1141457 1066523 783360 817991
23334H17991O584J90819j16124j29705l8700J18461K66064M3980j50365k10216
23324G98789j209q542j19309L5588Q4360m9186j46694P7027J61832l0571K10716
23313A012801o8162K9195q3517j88129Q4091J17408J36569L3925j28048k31607
23303G14526J78470j6090k34033Q6651J51423R313j13486j25663j43947n7504
23293D49660j54083j26712K76632J64701j12321L3578Q2446l5485j81494q98k10836
23282A85188J17989N5312J1388J70988k4554k75534k5629L22570k7213Q7427o0694
23271E37238k4028J14666l1166N1965J04184m14534k64232K15552J09742K40901
23261F40288l45940q4213J79002J9100r7578k14732K3681K88845Q6277j76755
$$ plain form
23334 817991 824575 1015394 899270 769565 730865 849326 1115390 1159370 1009005 798789
23324 798789 797580 789038 669729 705317 789677 740491 593797 670824 832656 802085 1012801
23313 1012801 944639 973834 890317 702188 786279 903687 1040256 1074181 946133 714526
23303 714526 892996 876906 642873 729524 880947 890260 776774 651111 507164 449660
23293 449660 295577 168865 445497 610198 497877 531455 613901 578416 396922 396024 185188
23282 185188 303177 358489 369877 540865 516311 240777 215148 537718 510505 597932 537238
23271 537238 513210 627876 596710 648675 752859 338325 74093 289645 399387 640288
23261 640288 294348 210135 389137 408237 310659 95927 119608 408453 494730 317975
23251C17975l6572R2088j1115k0252J22946K29527L5589n55853k08867O9048M5552
23240H0066J26940Q9249n0891M562J06519l6475K21400N2805r8878p085j29829
23229C58383M7793k0254j85661j47775J06283j67173l9540L81241K5298M5995
23219D04590m645m00944m222M90546K0602k74970j07321N4492j66230q2215m7720
23208a18037l8279J40537J4567q111L3003r1226k063K01916K71403n6143P4390
23197D21957j2800J0744K10664o5323J78925k56413j72113j81115J10081R9186
23187C43793J20096O5515k19203m19526j85678N8182j35094J65273M10062K42885
23177D46305j53136k48111O150P5220J54892K00904j6786j10734m38388Q7418
$$ plain form
23251 317975 281403 373491 362376 342124 465070 694597 730186 174333 -34534 34514 80066
23240 80066 207006 296255 245364 249926 356445 319970 541370 594175 495297 488212 358383
23229 358383 406176 385922 200261 52486 158769 -8404 -47944 333297 358595 404590
23219 404590 399945 -999 -5221 485325 505927 230957 123636 178128 11898 -70317 -118037
23208 -118037 -156316 -15779 -1212 -9323 23680 -67546 -69609 132307 403710 347567 421957
23197 421957 409157 419901 630565 565242 744167 487754 315641 134526 244607 343793
23187 343793 463889 529404 310201 -109325 -295003 -236821 -371915 -206642 203420 446305
23177 446305 293169 45058 51208 126428 281320 482224 465438 354704 -83684 3734
23167C734L31662k2789O1845Q6816p8971p4953L2680K29933k81106k80249j57934
23156a49332J97416K00034J6510j4925q1755k35860K2196M56908R8195j65464
23146C43923l2838J01306o3402l8300j76512j26572j32895K5520J03824m6649
23136d2595j53324J05375k213P7281K3945R3778N6037M3509j01190k3310L04434
23125C81727K73108p0043j59332j57903L5569J4459j09701q8419l5892k32174
23115a48601J44347Q8326j62368j6777L8501L5401j36583J12629j59438J69735
23105c4828J64108R0231n874r6404r6435p3585k07480k43600K76874M15446j6194
23094A72259m16148j00291M69551K38278r9999J29999M3415n5877k29960O9286
$$ plain form
23167 3734 335396 312607 374452 461268 382297 307344 340024 569957 288851 8602 -149332
23156 -149332 48084 248118 264628 249703 167948 -67912 -45716 411192 509387 343923
23146 343923 311085 412391 348989 310689 134177 7605 -125290 -99770 4054 -42595
23136 -42595 -195919 -90544 -92757 -15476 8469 102247 158284 201793 100603 77293 381727
23125 381727 654835 584792 425460 267557 303126 317585 207884 119465 83573 -148601
23115 -148601 -4254 84072 -78296 -95073 -56572 -21171 -157754 -45125 -204563 -34828
23105 -34828 129280 219511 213637 117233 20798 -52787 -260267 -503867 -226993 188453 172259
23094 172259 -243889 -344180 125371 363649 263650 393649 437064 381187 151227 220513
23084B20513L19442R1426k47542q4926Q9381k55278J0052K50959K37800R714r4978
23073E46563l24788o0141j26149j2953j56417k23019K29138R1474j2030O5211
23063A6889J70987j54989K29325J77101O9880j52489k19072L2361J96329L0291
23053C96613l89029P662J42067M328o8315q7758j03600j77534J17273J53931J05177
23042A00815M4830O4402j22121j57049M0068J71722K05619q7036k86054K46430
23032B21626P6971p0123k16247j11789l031O9494j90890J23632J91716k00324
23022a08965j33393j0445J40072l0024O0673J47660j28651k21076K7469j34885
23012c91565j97269k05619J54059L96399K50595j29072o6734K18494r9698k34158
$$ plain form
23084 220513 539955 631381 383839 298913 388294 133016 143068 394027 631827 641541 546563
23073 546563 221775 161634 35485 22532 -133885 -356904 -127766 -36292 -48322 16889
23063 16889 187876 32887 262212 439313 509193 356704 137632 169993 366322 396613
23053 396613 7584 15246 157313 161641 93326 5568 -98032 -275566 -158293 -4362 100815
23042 100815 145645 210047 87926 -69123 -29055 142667 348286 261250 -24804 221626
23032 221626 298597 228474 12227 -99562 -102593 -33099 -223989 -100357 91359 -108965
23022 -108965 -242358 -252803 -112731 -142755 -82082 65578 -63073 -284149 -256680 -391565
23012 -391565 -588834 -794453 -640394 -243995 6600 -122472 -189206 29288 -70410 -304568
23002c04568K47567Q7103k939J48767m7061k44412l94628r4283k1425J69957Q6521
22991c69401K4854J77J1360L60990J42014M837K8083K8742R6665P4965l9459l5749
22979C28078J23130j23147r3687q5641M7110p2865N4614r1740J50565j31608k88062
22968a83253j98942j24497K28284N7515l2074J6028N1322M6557q1776j47548O9376
22957b99008M768J30062J20028p7514N7501M8018m07989K36407K67774J29360
22947B09407j32131K4727K59446l5077m42184l61051M3940J29098K08536K131
22937i3158k26199P6990J884O0110j96209j43616K78592J66339K58115j3896r7234
22926G1718l89071K23091K20248R5564R3513j28739O0904j00301k6624Q8079k59034
$$ plain form
23002 -304568 -57001 30102 27163 175930 128869 -115543 -510171 -604454 -625879 -455922 -369401
22991 -369401 -344547 -344370 -333010 27980 169994 174831 202914 231656 328321 403286 363827 328078
22979 328078 451208 328061 234374 148733 195843 122978 177592 85852 236417 104809 -183253
22968 -183253 -382195 -506692 -278408 -220893 -252967 -236939 -185617 -139060 -220836 -368384 -299008
22957 -299008 -294240 -164178 -44150 -121664 -64163 -16145 -424134 -187727 80047 209407
22947 209407 77276 102003 361449 326372 -115812 -476863 -432923 -303825 -95289 -93158
22937 -93158 -319357 -242367 -240483 -180373 -376582 -520198 -241606 -75267 182848 168952 71718
22926 71718 -317353 -94262 125986 221550 315063 186324 247228 146927 120303 208382 -50652
22915e0652j52810K84679P9135j99127l46265J25589J89928L72075j53126k26803
22905g7377J66744p9779k61420l40556L01220K84571p1341o3986K74516J08198
22895B40790K3552k50696P3545k9375j05422L9798K93575K15391o8009j67023
22885B66126j43865r8779J57951l00698k90453J75304K68753j15673j4850R0285
22875e899M10148n7648k16551m6138k71206M0200J07007k31435M5053L2568O7200
22864a26701K18490N0291Q4450o8523k92471K7141J47874J13237j6142n5985q4607
22853b946l0732J68099j80321K0054J97968P9868j35303O4755K74160J55998j76091
22842D35509k08289L390J5375Q1585k3076j60887j70580N4949K58969K21877l84525
$$ plain form
22915 -50652 -203462 81217 160352 -38775 -385040 -259451 -69523 302552 149426 -77377
22905 -77377 89367 9588 -251832 -592388 -291168 -6597 -77938 -141924 132592 240790
22895 240790 264342 13646 87191 57816 -47606 -7808 285767 501158 433149 266126
22885 266126 122261 23482 181433 -119265 -409718 -234414 34339 -81334 -96184 -5899
22875 -5899 404249 346601 130050 83912 -187294 -147094 -40087 -271522 -226469 -193901 -126701
22864 -126701 91789 142080 226530 158007 -134464 -107323 40551 153788 137646 81661 -2946
22853 -2946 -33678 134421 -45900 -25846 172122 251990 116687 181442 455602 611600 435509
22842 435509 227220 230610 245985 327570 304494 143607 -26973 27976 286945 508822 124297
22831A24297J83450k3895j07888M6701J0166j01458j61519J42627k6587k60382
22821a74488l02880J6845L4726k9272q6256J31946N2116q8432P3518J34900O4388
22810a72889j90827k21634L16668R1457k80998P7142K06947o5566j54812k96801
22800f91313k5982L26513J07757J23312J06620J8155j16181J17478N1961j20691
22790a02371K1616j13929Q4716r1795L71567j60591j34017K07222J84709j80788
22780H6339l89436j15857j03882K77990J31236n5338j86822j00178j60719J12498
22770e04169K85885j80374K20071K25110j19419J23210k41363Q7910j1649J66528
22760E1740P6904P1672k35963m62487k31662L73584K31485r2471j56561j4179
$$ plain form
22831 124297 307747 283852 175964 222665 232831 131373 -30146 112481 85894 -174488
22821 -174488 -477368 -460523 -425797 -455069 -541325 -409379 -357263 -445695 -372177 -237277 -172889
22810 -172889 -363716 -585350 -268682 -177225 -458223 -381081 -174134 -239700 -394512 -691313
22800 -691313 -717295 -390782 -283025 -159713 -53093 -34938 -151119 -33641 18320 -102371
22790 -102371 -80755 -194684 -109968 -201763 169804 9213 -124804 82418 267127 86339
22780 86339 -303097 -418954 -522836 -244846 -113610 -168948 -355770 -455948 -616667 -504169
22770 -504169 -218284 -398658 -178587 46523 -72896 50314 -191049 -103139 -114788 51740
22760 51740 128644 200316 -35647 -498134 -729796 -356212 -124727 -217198 -373759 -387938
22750c87938j28451K18048K49595o9882j50234J5173K9361Q9263Q7107Q4772J7856
22739E4670K4398L38138j9022k83242o632j71196J1785K53736n4878j45341p9892
22728g7476J23311n8016j09852o042K74662K70440j00973j85717L0198K47158
22718D07693j18438j71668L91442j1026l03756k5545q6372m9958M7963J18996
22708A99331q4710l0169J3706p5289k6094L6260J89449K01507j52810k21313O3161
22697A13029k1183J13373K65482J53193j08301k38375L1417r754q6898P6748k90031
22686a300m5187L7622j13709Q0894j7499k9033P472L1875P1282j19229j65024
22675b61836K1313P4005L21048l6938j27277q2956l10268J17631J43834K77986
$$ plain form
22750 -387938 -516389 -298341 -48746 -118628 -268862 -253689 -224328 -135065 -47958 36814 54670
22739 54670 79068 417206 398184 114942 108310 -62886 -51101 202635 147757 2416 -77476
22728 -77476 45835 -12181 -122033 -128075 146587 417027 316054 130337 160535 407693
22718 407693 289255 117587 509029 498003 194247 168702 82330 32372 80335 199331
22708 199331 114621 84452 98158 22869 -3225 33035 222484 423991 271181 49868 113029
22697 113029 91846 205219 470701 623894 515593 277218 308635 298881 211983 288731 -1300
22686 -1300 -46487 -8865 -122574 -41680 -59179 -88212 -80740 -48865 22417 -96812 -261836
22675 -261836 -240523 -166518 154530 117592 -9685 -92641 -402909 -285278 -141444 136542
22665A36542J1287l21378j12915L19004J80485J58046q1670K41529j1761l24980
22655A94189o917j93477o3854r750j66361k8243Q8623j49521p1910J99147J0164
22644a97910J38951k7104q6127j11997J61886K09660J04087j31194l05679k83577
22634e29004o2019K65057L57326P2891l4526P3449k09139R515j2896J52627K63596
22623C46877j9644l98561j34088Q2715p9418K2051p4548K9418l2161J82856P4265
22612b38l12400l38595q1066P8954N57324K60091k06188P0092m9928J12734R6357
22601A87137j54936j78737O4753K36310J76682o4203l99885J16313k2567p0985
22591a10118Q0816k43984J19455L56282j24391J44763p0402k11201k56971J3247
$$ plain form
22665 136542 147829 -173549 -286464 32540 213025 371071 289401 530930 519169 194189
22655 194189 187272 -6205 -70059 -79809 -246170 -274413 -185790 -335311 -407221 -208074 -197910
22644 -197910 -58959 -86063 -172190 -284187 -122301 87359 191446 60252 -245427 -529004
22634 -529004 -591023 -325966 31360 104251 69725 143174 -65965 -56450 -69346 83281 346877
22623 346877 327233 -71328 -205416 -122701 -202119 -180068 -254616 -225198 -257359 -74503 -238
22612 -238 -312638 -651233 -732299 -653345 -96021 164070 -42118 27974 -21954 90780 187137
22601 187137 32201 -146536 -81783 154527 331209 267006 -132879 -16566 -39133 -110118
22591 -110118 -29302 -273286 -153831 202451 78060 222823 152421 -58780 -315751 -302504
22581c02504J67802P9351J83721O6923j51772K76258n9121m63861J0157l10939
22571e03985r5376J60874l11109j43779J68781M95143P4716P4371n3178K809n6669
22560a87402M4864k2061l36803K8459L8076p0376l1759P6988J56992m2447o6176
22549d11645j68698L0231J32272r8283q8627J89773J62625K89193l0959J68124
22539A74006q9929r6987N409J65069N2641o9865m425l0364k23300R0316K8827
22528A398k6593l141n584K27479j95871J75172J15849O5161k18197k31333k65017
22517c60677o9119J40393J92938K06342L93975Q2228k69397K5264N8093r8705
22507C01335k24978k1910m0474j23469K5550J3707o0388J44003p2623k26946R0097
$$ plain form
22581 -302504 -134702 -55351 128370 195293 43521 319779 260658 -203203 -193046 -503985
22571 -503985 -599361 -438487 -749596 -893375 -724594 -229451 -154735 -80364 -133542 -130733 -187402
22560 -187402 -142538 -164599 -501402 -472943 -434867 -505243 -537002 -460014 -303022 -345469 -411645
22549 -411645 -580343 -550112 -417840 -516123 -604750 -414977 -252352 36841 5882 174006
22539 174006 84077 -12910 -7501 157568 210209 140344 135919 105555 -117745 -27429 1398
22528 1398 -25195 -28336 -33920 193559 -2312 172860 288709 353870 135673 -95660 -360677
22517 -360677 -429796 -289403 -96465 109877 503852 586080 316683 341947 400040 301335
22507 301335 76357 54447 13973 -109496 -83946 -70239 -130627 13376 -59247 -286193 -196096
22496a96096o9714n7220L98519J43506j14246j32039l2298k54851J59068K03345
22486D7974j53125j57182n8615J23914K60435J15482O1109q491k78281k05847
22476b52627k00128k1238j3573N8879K98973K58126j6410K1787j15855j5221O2689
22465F5402j37452K35973p254J92618j18120m04875J5779Q4121J0848p342r01
22454g1203J01851o207j42965j15998P9834J84515R0973m2587J60428K53736j15959
22443C76418j41434K7857L3340j71166q781r3609k6052Q1044o4333j28095L753
22432a11058q6031r165M52011L38486o8384k58730j57956L0088p6069J35020Q8203
22421B76415J41881l29304L2479L7271M649n1493Q7576J75001p0198j44586j96050
$$ plain form
22496 -196096 -265810 -323030 75489 218995 104749 -27290 -59588 -314439 -155371 47974
22486 47974 -105151 -262333 -320948 -197034 63401 178883 239992 231501 -46780 -252627
22476 -252627 -452755 -473993 -487566 -428687 -129714 128412 112002 133789 17934 2713 65402
22465 65402 -72050 163923 156669 349287 231167 -173708 -157929 -73808 -62960 -70302 -71203
22454 -71203 30648 24441 -118524 -234522 -154688 29827 120800 78213 238641 492377 376418
22443 376418 234984 262841 296181 125015 116234 22625 -3427 77617 13284 -114811 -111058
22432 -111058 -197089 -206254 245757 584243 515859 257129 99173 129261 53192 188212 276415
22421 276415 418296 88992 121471 158742 163391 111898 199474 374475 304277 159691 -36359
22410c6359l41401Q0239J73212M2740p8586Q3596k52559q7933K11431J96987J06387
22399I7754j89109j92281J29932R7338o04q0764m7781J23287J82835J38282l8562
22388B20327k73030M4962P6491o0490j66915j64327K41874K95490l71800l88548
22378e45966j04090L12223M78898J71967P7504k19033j51923j03859j30337K21448
22368F832L01021p7742P2953J31769K90256o621l47479k74441N7662k09709j0226
22357f5725M0685K03730R352k72503k10535J17971J44825K6318j27247n3977K7688
22346a59418J49413K2627k6557q8665J7805m04728j59537j16031O8628R3902k0508
22335f23069N7831R8890j05267j10627J75316J08062P2413J30709K8349Q510P5775
$$ plain form
22410 -36359 -377760 -297521 -124309 -81569 -160155 -76559 -329118 -417051 -205620 -8633 97754
22399 97754 -91355 -283636 -153704 -56366 -56970 -137734 -185515 -62228 120607 258889 220327
22388 220327 -52703 -7741 68750 8260 -158655 -322982 -81108 214382 -157418 -545966
22378 -545966 -650056 -337833 141065 313032 390536 171503 19580 -84279 -214616 6832
22368 6832 307853 230111 303064 434833 725089 718468 370989 96548 154210 -55499 -65725
22357 -65725 -25040 178690 188042 -84461 -294996 -177025 -32200 -5882 -133129 -187106 -159418
22346 -159418 -10005 12622 -13935 -102600 -84795 -489523 -649060 -765091 -696463 -602561 -623069
22335 -623069 -565238 -466348 -571615 -682242 -506926 -398864 -326451 -195742 -167393 -158883 -83108
22324h3108m2231K16951K11803r7901l39537j52122P6274P1865j75392j87743
22314e01141K7077K38345J20531j98904K31728L42928j20730l31439j96516j5842
22304d03963J45151K8287L13892K11113k8366L5337j49072j42130j56115M0398
22294a05468R2371M2431k3373K5814J8268r5420O9663J72001L1615J04663q0732
22283B51833l00380k87752q5562J65600K71437l6062k33145k18432p1161J35657
22273d07967J17905R2682j25573m2078J51667J63973Q9434l6390k28077k18106
22263d42530J7020L19777L9766l37022l01156K4078K85216K53251J80561k9776
22253I185J64287J68812J07734P1172j28380k83270p9106K62889p8102j14861
$$ plain form
22324 -83108 -125339 91612 303415 205514 -134023 -286145 -209871 -138006 -313398 -501141
22314 -501141 -474064 -235719 -115188 -314092 -82364 260564 139834 -191605 -388121 -403963
22304 -403963 -258812 -230525 83367 294480 266114 301451 152379 10249 -145866 -105468
22294 -105468 -13097 29334 5961 31775 50043 -45377 24286 196287 227902 332565 251833
22283 251833 -48547 -336299 -421861 -256261 15176 -20886 -254031 -472463 -543624 -407967
22273 -407967 -290062 -197380 -322953 -365031 -213364 -49391 40043 3653 -224424 -442530
22263 -442530 -425510 -105733 -65967 -402989 -704145 -680067 -394851 -141600 38961 9185
22253 9185 173472 342284 450018 521190 392810 109540 30434 293323 215221 100360
22243A00360l30392J73239K58360j37031q9778J66572J0007l6967j01677o6269
22233e3576n4818q2064J00296q9692J18186j02051K89436j29206J6795J30169
22223A43475j01552j68509J09563k48248J8837R2804L59914K90111q4422j42630
22213B69343k34608m19095k64359O6612K58360K14238n5829Q3656J86131L5275
22203A39724p1934j4171J80275l1561N4286K13189M1455k19428k14801R0747J15469
22192B83250J9433j56938n9589K2927j15319k70612m292N5075k27326K2299L40449
22181i0643K00314j09100r7381J68149j73843j73607q428K15707P5201N5049N6884
22170A18302O2072j35828k55674j26669l636q0368J85516j26960k26868M175J43153
$$ plain form
22243 100360 -230032 -56793 201567 64536 -25242 141330 151337 114370 12693 -53576
22233 -53576 -108394 -190458 -90162 -179854 -61668 -163719 125717 -3489 13306 143475
22223 143475 41923 -126586 -17023 -265271 -246434 -153630 206284 496395 411973 269343
22213 269343 34735 -384360 -648719 -582107 -323747 -109509 -165338 -81682 104449 139724
22203 139724 67790 53619 233894 202333 256619 469808 511263 291835 77034 167781 283250
22192 283250 302683 145745 86156 109083 -6236 -276848 -281140 -226065 -453391 -431092 -90643
22181 -90643 109671 571 -96810 71339 -102504 -276111 -284539 -68832 6369 61418 118302
22170 118302 180374 44546 -211128 -337797 -341433 -421801 -236285 -363245 -590113 -585938 -442785
22159d42785K4380K31209M38884j95299m72598j25686L24635K82211Q983n6875
22149A7059l5148j436Q0225n4247P9547J03893J67362k57125j95597l9145K44744
22138A10132j72586k32290R4832J15187l2105K04477j35580k931L893J50448J13992
22127B17469k19856r1709P6412R5420j42121M8133l549j56964J81354o9700q1710
22116a46821j42536R8758K9927q7552K5345J45275K8294j61573J91810O6120N9047
22105A06094l10509O1768J23993J12775J19465J20031J69905j44557r4K93608
22095F52479r0675j56703r8117J24686K316k31819j13533r740J41055L20359q9128
22084D51180l5068n0911K1593l532k39089j21479K40886L53338m24006k06121
$$ plain form
22159 -442785 -418405 -187196 251688 56389 -416209 -541895 -217260 64951 73934 17059
22149 17059 -18089 -19525 60700 6453 86000 189893 357255 100130 -95467 -134612 110132
22138 110132 -62454 -294744 -199912 -84725 -116830 87647 -47933 -50864 -46971 103477 217469
22127 217469 -2387 -94096 -17684 77736 -64385 -16252 -19801 -176765 4589 -65111 -146821
22116 -146821 -289357 -190599 -160672 -248224 -222879 -77604 -49310 -210883 -19073 47047 106094
22105 106094 -204415 -142647 -18654 94121 213586 333617 503522 358965 358871 652479
22095 652479 561804 405101 306984 431670 433986 202167 88634 78894 219949 540308 451180
22084 451180 416112 365201 386794 383262 144173 22694 263580 616918 192912 -13209
22074a3209r4661M0662K53030L47103o2658k41023J59194J68150j95709r2120
22064B68759J07534J20526J2272k1767J30809J04326n8896n14268p0736L29913
22054D08472L97459J17304j43992j0600p2121l81615m9388k0166N6627J67870
22044D69850j21442L0000O2411J7656p0042k41628J46753m696k30458J8444j44673
22033f7825r979Q9479J08372k2715R3443j66990j71354n8613L3461L24172O2981
22022B14432Q660j42564k13263k56281J01458J54685o0972j3765L10955K81262
22012C84607J18895j46082k59839j90506N2722j62665j35864J911k13981j22804
22002f73606j09202L67321r9969J31320L57365L28013j40769k69146R5779m0933
$$ plain form
22074 -13209 -107870 -67208 185822 532925 470267 229244 388438 556588 360879 268759
22064 268759 376293 496819 509091 487324 618133 722459 663563 149295 78559 408472
22054 408472 805931 923235 779243 768643 696522 314907 265519 245353 301980 469850
22044 469850 348408 378408 440819 458475 388433 146805 293558 288862 58404 76848 -67825
22033 -67825 -77804 11675 120047 97332 190775 23785 -147569 -206182 -172721 151451 214432
22022 214432 223092 80528 -132735 -389016 -287558 -132873 -193845 -207610 103345 384607
22012 384607 503502 357420 97581 -92925 -40203 -202868 -338732 -336821 -550802 -673606
22002 -673606 -782808 -415487 -515456 -384136 -26771 301242 160473 -108673 -12894 -53827
21992e3827J89390L9346J47282j1012J9003r9332J27582k50487j48896j66534
21982b07485p1531j49400J6671M76570J92735k92074m22191J5289K40678L01136
21972A00398Q8492l92526o116K70106j48347n3064J84684K6538j63926J24829
21962C1068J51358M8547K8109J830k74371j20541j35072j00410j48507L4744K90845
21951a92400K88311l11574j17605K09663M2978P0984k5633J08111M3572j80664
21941f4257j15832K9576P0106K17400M599p5567j98486o2574K95421j04235p4729
21930g8578K67168N6078j48245j62282J2330J09505L59496m4014l90186K6181
21920G453j63325j65923K64791M17029J33065k4188j44647J07449j99759J70416
$$ plain form
21992 -53827 135563 174909 322191 311179 330182 230850 358432 107945 -40951 -207485
21982 -207485 -279016 -428416 -411745 64825 257560 -34514 -456705 -441416 -200738 100398
21972 100398 188890 -203636 -209752 60354 -87993 -141057 43627 70165 -93761 31068
21962 31068 182426 230973 259082 260912 -13459 -134000 -269072 -369482 -517989 -483245 -192400
21951 -192400 95911 -215663 -333268 -123605 -80627 -9643 -35276 72835 116407 -64257
21941 -64257 -180089 -150513 -80407 136993 141592 66025 -132461 -195035 100386 -3849 -78578
21930 -78578 188590 244668 96423 -65859 -53529 55976 415472 371458 -18728 7453
21920 7453 -155872 -321795 -57004 360025 493090 468902 324255 431704 231945 402361
21910D02361Q6190l06976j88212o8221k34941l0686J34130K91408K20734j75824
21900A29963k44935o9250O2242L52806K75354K18242m62814k30747J51947m9273
21890A33535j06700l3326k76079L403M634J80217j77588j610K32887p1241l7952
21879a49820J74611j05778J12008J48374o2531M6294N6078k93905j23051m9836
21869b47556k82839K3319R403p1426K28033K5759l5688j0091K43614J37293o2804
21858d2983J60690K87248m5259J13496l9402m08889O3791N6451R980j85341k7994
21847e8212J14175j0975l2329L32539m9294j91411Q6348j37117k33843j63066
21837c43185J77422L98849j96356j98578K25356J17877K4510k11361p2035Q8766
$$ plain form
21910 402361 488551 181575 -6637 -74858 -309799 -340485 -206355 85053 305787 129963
21900 129963 -114972 -184222 -121980 230826 506180 724422 261608 30861 182808 133535
21890 133535 26835 -6491 -282570 -279167 -274533 -94316 -271904 -273514 -40627 -111868 -149820
21879 -149820 24791 -80987 31021 179395 116864 163158 219236 -74669 -197720 -247556
21869 -247556 -530395 -507076 -497673 -569099 -341066 -315307 -350995 -361086 -117472 19821 -42983
21858 -42983 117707 404955 359696 473192 433790 24901 88692 145143 155123 -30218 -58212
21847 -58212 55963 44988 12659 345198 295904 104493 190841 53724 -180119 -343185
21837 -343185 -165763 233086 36730 -161848 63508 181385 205895 -5466 -77501 11265
21827A1265j97013k52360r171L33558j3055J30150M7723j86392J58180L23142
21817C46027j70948q5271j17492m2018n7126R6569J09176o3477j4302q6623j02519
21806a88004J61967k97179N65J40801J52602L9130J62889J29280j47463j70135
21796a5547j2816L72374K95118j7215j67967l19126k05879J02503k07050k68098
21786d43703J18899J29145J40796M7451p2932k63914M4831j74923j10066J73612
21776d10804L29962N2947r7332j2174L7457J46596J16932j86468l1702j01084
21766a55670k04876r8246p1567R428M0472L6957j2225J34703J0881K0283K6371
21755b63489r3581Q4180Q4991O2565R2861q0561N792j05742j97743J46524M093
$$ plain form
21827 11265 -185748 -438108 -447279 -113721 -126776 3374 51097 -135295 22885 346027
21817 346027 175079 89808 -27684 -69702 -126828 -30259 78917 15440 1138 -85485 -188004
21806 -188004 -26037 -323216 -322651 -181850 -29248 9882 172771 302051 154588 -15547
21796 -15547 -28363 344011 639129 621914 453947 134821 -71058 31445 -175605 -443703
21786 -443703 -324804 -195659 -54863 -7412 -80344 -344258 -299427 -474350 -584416 -410804
21776 -410804 -80842 -27895 -125227 -137401 -99944 46652 163584 -22884 -54586 -155670
21766 -155670 -360546 -458792 -530359 -520931 -480459 -443502 -455727 -321024 -310143 -289860 -263489
21755 -263489 -357070 -272890 -187899 -125334 -32473 -113034 -107242 -212984 -410727 -264203 -260110
21744b60110P5806n5093K11884M0097m459j75829r723n7692j96587j86497p1884
21733f90087M29186J12306j46325n1676J19672m3970R9916K00890r8035k3545
21723i1668j98051k8661P8141M29200L09692r9647n5324k14971l95641J69259
21713i7671L9536J31253J02610j91319p0341o9299j48186m0502l42891R4284J69450
21702d23076m085l7813J65901K07244K47173J15119m65987j72461L16784l8358
21692h9559n7930J30127k20250Q1328R2518p8928m945J61041J42979J0429k44698
21681g7888J574O8877k81951J90543L02634J48815l3112j67512m40744l80644
21671f69408J22798l9842j43264M1010L94089K93034K4553P2261k63613q1796
$$ plain form
21744 -260110 -184304 -239397 -27513 12584 8125 -167704 -177427 -235119 -431706 -618203 -690087
21733 -690087 -260901 -148595 -294920 -346596 -226924 -270894 -170978 29912 -68123 -91668
21723 -91668 -289719 -318380 -240239 188961 498653 399006 343682 128711 -266930 -97671
21713 -97671 -58135 73118 175728 -15591 -85932 -155231 -303417 -343919 -686810 -592526 -423076
21702 -423076 -427161 -464974 -299073 -91829 155344 270463 -195524 -367985 -51201 -89559
21692 -89559 -147489 -17362 -237612 -156284 -63766 -142694 -147639 13402 156381 166810 -77888
21681 -77888 -76314 -7437 -289388 -98845 203789 352604 319492 151980 -288764 -669408
21671 -669408 -546610 -586452 -729716 -688706 -294617 -1583 22970 95231 -168382 -250178
21661b50178M8233J53825k5467j4590k8483m8954P1325p8519o4725J14492O0919
21650f2122m1758p6674k5966j02863j75479j59710K37378J79933N5777Q9102K7968
21639e4414k48902k26211K11873J55364J87747K4874k7762j11892l6549j17573
21629b43445j10934J891J2775L6985J62216K44134R214k8814J81932J14679Q4480
21618D65113k14036p5878j84j7702n3575K5653Q5726n5484k60137k5590J46668
21607B0574K33292k26224m6491j78899k73628J15205K85063j28888O6502m156
21597a37650q0340l0088p3691j2962M1149M1815J77867j86776m67616N9842K52310
21586d16140J55395J3009L25304j10148k52797k51103l30272K14300L79413J16119
$$ plain form
21661 -250178 -201945 -48120 -73587 -88177 -116660 -165614 -94289 -172808 -237533 -123041 -62122
21650 -62122 -103880 -180554 -206520 -309383 -484862 -644572 -407194 -227261 -171484 -82382 -54414
21639 -54414 -303316 -529527 -317654 -162290 25457 50331 22569 -89323 -125872 -243445
21629 -243445 -354379 -352488 -339713 -302728 -140512 103622 112836 84022 265954 380633 465113
21618 465113 251077 175199 175015 157313 103738 129391 215117 159633 -100504 -126094 20574
21607 20574 253866 27642 -18849 -197748 -471376 -356171 -71108 -199996 -133494 -137650
21597 -137650 -217990 -248078 -321769 -334731 -293582 -251767 -73900 -260676 -728292 -668450 -416140
21586 -416140 -260745 -247736 77568 -32580 -285377 -536480 -866752 -652452 -273039 -156920
21576a56920j03363j42393p6196K6475N4184J24155j07119p2684Q6480J80069
21566a87312P2595K8248j31732k9656O2161J50522K90918p996k07989j14462k05979
21555b80682J42291J10078r9877j43448k37184J18796K45498p5438P6159j92694
21545c36501K07352R4707p2679j18841J83377n4616Q2265J84624r265J17827j79198
21534I9052l9575k54621J40204J50068J58967l29654p521J68441q1328j80700
21524a76667j46740L35676J54540l93989j35299R6866J05335m5824m6859M8606
21514b04355L9231L20735j13526J8967j15044q0371N7409J77873j26311q0576
21504a05968M8368L05892J20303k04288m21987o5568L48017L7982j06257L55688
$$ plain form
21576 -156920 -260283 -402676 -478872 -452397 -398213 -274058 -381177 -453861 -367381 -187312
21566 -187312 -114717 -86469 -218201 -247857 -185696 -35174 255744 247748 39759 -74703 -280682
21555 -280682 -138391 -28313 -128190 -271638 -508822 -390026 -144528 -219966 -143807 -336501
21545 -336501 -129149 -34442 -107121 -225962 -42585 -97201 -14936 169688 160423 278250 99052
21534 99052 59477 -195144 -54940 95128 254095 -75559 -83080 85361 4033 -176667
21524 -176667 -323407 12269 166809 -227180 -362479 -265613 -160278 -206102 -252961 -204355
21514 -204355 -165124 155611 42085 61052 -53992 -134363 -76954 100919 -25392 -105968
21504 -105968 -57600 248292 368595 164307 -257680 -323248 24769 62751 -43506 312182
21494C12182j2720j21135l32714p4462K48941j16980N8093j12994N5165j2921
21484a09545j87264L16512K90205n3968k78792J27029j06539j25693O9257k02921
21474b61719l06001r8573K37044L19191K23408k58592j55261J67688q9889m06
21464b23110J06309p0406J20088M3313r1794Q903J82329j58899m1162j2198o4579
21453b01206j10752K71194Q4567l5946j27199m40204m2439K63869Q41m7876J07117
21442b78034j74436j59449K30206L16077J23376j21048j9806o8353M6078J14862
21432I473j29977K9065m880j09169j28413M6722O5109L35248P8623L6414M8385
21421B76600l02301k67029K13774o9046k38253J00875J0076J68482j74423N6323
$$ plain form
21494 312182 299462 178327 -154387 -228849 20092 -96888 -38795 -151789 -96624 -109545
21484 -109545 -296809 19703 309908 255940 -22852 104177 -2362 -128055 -58798 -261719
21474 -261719 -567720 -666293 -429249 -110058 113350 -145242 -300503 -132815 -222704 -223110
21464 -223110 -116801 -187207 -67119 -23806 -115600 -106697 75632 -83267 -124429 -136627 -201206
21453 -201206 -311958 -40764 43803 7857 -119342 -559546 -601985 -338116 -337275 -385151 -278034
21442 -278034 -452470 -611919 -381713 -65636 57740 -63308 -83114 -151467 -105389 9473
21432 9473 -120504 -91439 -96319 -205488 -333901 -287179 -222070 113178 191801 228215 276600
21421 276600 -25701 -292730 -78956 -148002 -386255 -285380 -275304 -106822 -281245 -224922
21411b24922L9591k99787m6984J11524J07175j17415J16862K23490M13648r1177
21401B32005m30637n7556K11652Q6767j00326L2352Q9099J12852J1468k73831
21391h6155J91406Q4624P2834j87332r8877K27875o7748p0706p3939j80045j70733
21380c58796K12123J14835j9353j54322J63826n8590j14125p8314K35072L08453
21370B50809j628j74795J77377Q1730m8357l0346k0613n36500J5717K04483k1698
21359a03821N6231n8144j15481K11992J09013p193m4610q7657q6368k10531J6198
21348c20371K5866L17615J17698j23183n581L26581k73215j52164K892L90318
21338C06456K78518k35464j23370j93761J76339o8142q0550j06654o076L52874
$$ plain form
21411 -224922 -185331 -485118 -532102 -420578 -313403 -430818 -313956 -90466 323182 232005
21401 232005 -198632 -256188 -44536 42231 -58095 -25743 63356 176208 187676 -86155
21391 -86155 105251 189875 262709 75377 -23500 204375 136627 65921 -8018 -188063 -358796
21380 -358796 -146673 -31838 -51191 -205513 -41687 -100277 -214402 -292716 -57644 250809
21370 250809 249181 74386 251763 333493 285136 254790 234177 -302323 -286606 -82123 -103821
21359 -103821 -47590 -105734 -221215 -9223 99790 92597 47987 -39670 -126038 -336569 -320371
21348 -320371 -294505 23110 140808 17625 12044 338625 65410 -86754 -83862 306456
21338 306456 584974 349510 226140 32379 208718 140576 60026 -46628 -52704 300170
21328C00170P410J32290j49793l8550q3802Q1628J3086l24574j15967j36179J73054
21317a41227m8128l0180K00733k54558L7159K93221J23400N4859N9002m1283M3974
21306B96972L17j9571j27278j5449J48332k55232J18827m8204p7981L12815L4339
21295C67887N3674p81o4022j83876k33366K20409J05886j15782l29273j59046
21285c38290j22322J44624K59550j68129J92591k32239j24078O0071J13167Q6007
21275a29048J68963J32288K4912q5402N119n6152n7517p1595K8461p5208K37584
21264A22405m2448j46054R4082J919L0138J5470p9760k22933J28672K47991K34602
21253C84084j07055k11771l6255r1243P1604J08012J37812m0379k37301n01100
$$ plain form
21328 300170 307580 439870 290077 251527 167725 249353 262439 -62135 -178102 -314281 -141227
21317 -141227 -189355 -219535 -18802 -273360 -236201 57020 180420 235279 294281 252998 296972
21306 296972 297289 277718 150440 134991 283323 28091 146918 98714 20733 333548 367887
21295 367887 421561 420780 356758 172882 -60484 159925 265811 150029 -179244 -338290
21285 -338290 -460612 -315988 -56438 -224567 -31976 -264215 -388293 -328222 -215055 -129048
21275 -129048 39915 172203 197115 111713 116832 60680 3163 -68432 -39971 -115179 122405
21264 122405 79957 -66097 27985 29904 60042 75512 -4248 -227181 -98509 149482 384084
21253 384084 277029 65258 29003 -62240 9364 117376 255188 214809 -22492 -523592
21243e23592n2053K48453J18863J22669J04885q8461P7183j10332j07226K6459
21233a83152J46529j66886j76375L47936R3061j92582r9689J40584k42265j86647
21223e19486j33667K64209K51151Q4801k30712l8870K1155q1805j18776k6968
21213e28968j01118J56790L07006L08722J45529k52811l85148O1454L49234J90153
21203B50843p0852k35685k01647J04248L539J65028o9624p6090m5493j6534r0663
21192b82930K60997j79426j48254k30044r3481O0381L41951L61999k58345n38367
21182g05519q9735J87717m759J56076J45246K2026N2609J85283J68899l5598n2848
21171B9397J27619L13924K01222j75186j74363o5391m9289J2939l4151J51521
$$ plain form
21243 -523592 -575645 -327192 -208329 -85660 19225 -69236 7947 -102385 -209611 -183152
21233 -183152 -36623 -203509 -379884 -31948 61113 -131469 -231158 -90574 -332839 -519486
21223 -519486 -653153 -388944 -137793 -52992 -283704 -322574 -301419 -383224 -502000 -528968
21213 -528968 -630086 -473296 -166290 142432 287961 35150 -349998 -288544 60690 250843
21203 250843 179991 -55694 -257341 -153093 -149554 15474 -54150 -130240 -175733 -192267 -282930
21192 -282930 -21933 -201359 -349613 -579657 -673138 -612757 -270806 91193 -167152 -705519
21182 -705519 -795254 -607537 -612296 -456220 -310974 -288948 -236339 -51056 117843 82245 29397
21171 29397 157016 470940 672162 496976 322613 257222 207933 220872 186721 338242
21161C38242p232k63493l6641n3682J28501J92152J40879k17163l69688m27095
21151e75220k38034J3635M7708K58346J60615M0943J72257K9963Q9638j00595
21141a00744k96103r5237J82725k3326J12344J98807j6123k36263j08655j62858
21131e45433J43555L04132K71452l6749j64665j99446J73339k1201j95957O5237
21121b05736M41793J32014l41816l14116J77268P5324p4165L5671N9998j53517
21111a67282k53569M0663K53023K00408j29314l41155J98346L53146P7927q0241
21101A51952k71102j87802r634Q3377L25708J07552K4893r6705j7934k59522j58732
21090c07949o5093j68509p3667L3706L92421J29353k57620N4967O6955P095o4535
$$ plain form
21161 338242 331010 67517 30876 -22806 105695 297847 438726 221563 -148125 -575220
21151 -575220 -813254 -799619 -751911 -493565 -332950 -292007 -119750 -89787 -149 -100744
21141 -100744 -396847 -492084 -309359 -332685 -220341 -21534 -37657 -273920 -382575 -545433
21131 -545433 -401878 -97746 173706 136957 -27708 -227154 -53815 -75016 -270973 -205736
21121 -205736 236057 368071 26255 -287861 -110593 -35269 -109434 -73763 -13765 -167282
21111 -167282 -420851 -380188 -127165 73243 -56071 -397226 -198880 154266 232193 151952
21101 151952 -119150 -306952 -316586 -233209 92499 200051 224944 128239 110305 -149217 -307949
21090 -307949 -373042 -541551 -615218 -581512 -189091 -59738 -317358 -262391 -195436 -188341 -252876
21079b52876J6303L50531J0559k10586k71638Q3746J67031J06375P0410l7993
21069C1862m088j99943o2473J64433M3035k0631K95009J66626j85664k73732k53661
21058b99227n7120K30979R9682j59165n1339j19938k76736J14378L93568j1350
21048a36268J67334J06211k51958n6430Q6736r565k83474J16839J90614p2460
21038a42421r3787L0902J57879k2314k94521n5691n53L4172J14741j36518M0587
21027c67524K53091J20439N2245J23737p5144m8361J21268R5639l3919j03816
21017A37655p3039k8515M2689Q7010j47256l16892l15754P7974K59762K35012
21007d1354j22943o4965j2753l3259K03276J74322q3681N7309l7711j59860n4598
$$ plain form
21079 -252876 -236573 113958 124517 -86069 -357707 -273961 -106930 -555 69855 31862
21069 31862 27774 -172169 -234642 -70209 -27174 -47805 247204 413830 228166 -45566 -299227
21058 -299227 -356347 -125368 -25686 -184851 -236190 -356128 -632864 -518486 -124918 -136268
21048 -136268 31066 137277 -114681 -171111 -84375 -93940 -377414 -260575 -69961 -142421
21038 -142421 -236208 -205306 -47427 -69741 -364262 -419953 -420506 -386334 -271593 -408111 -367524
21027 -367524 -114433 6006 58251 181988 106844 58483 179751 275390 241471 137655
21017 137655 64616 36101 78790 165800 18544 -298348 -614102 -536128 -276366 -41354
21007 -41354 -164297 -229262 -242015 -275274 -71998 102324 18643 75952 38241 -121619 -176217
20996a76217r1635r7016j6762R2190O7079m8553L85829q5404l4725p3708M1664
20985c7258n6240l2187L33333k4496J89002L7133J61288r9917p4325m498l03902
20974H7933L5346l7506j20133J22861J23581k5423j29290j23622R7844J32144
20964A63735o1128k05780M1928L7701J3695q9042J65589q7782l8166j67900o0797
20953b87947l97o6507J64858K67690j08279L0490j31208k17643J71441O6542K34077
20942A23117L00801N8401o4229k4651j33894m4765K41848p8273p3080k83775K3696
20931D5196p0431J20043k047j90309k010j33027J82144L25710q4560O0582l9592
20920B11699l22906j04132J01850j23588q5526m7096l2392J81529K78313L03234
$$ plain form
20996 -176217 -267852 -364868 -381630 -289440 -222361 -270914 114915 29511 -5214 -78922 -37258
20985 -37258 -93498 -125685 207648 183152 372154 409287 570575 470658 396333 391835 87933
20974 87933 123279 85773 -34360 88501 212082 186659 57369 -66253 31591 163735
20964 163735 102607 -103173 -61245 -23544 -9849 -98891 66698 -21084 -59250 -227150 -287947
20953 -287947 -288344 -354851 -189993 77697 -30582 -92 -131300 -348943 -177502 -110960 123117
20942 123117 423918 482319 418090 393439 259545 214780 456628 378355 305275 21500 45196
20931 45196 -25235 94808 92761 -97548 -99558 -232585 -50441 275269 190709 251291 211699
20920 211699 -111207 -215339 -113489 -237077 -322603 -369699 -402091 -220562 57751 360985
20910C60985l2960k28684k96610J74498l5272M5368o8421j66354o126o5116J5300
20899c03392M37207P2014m36427j40497L4553K2169r0694P1493j85578J00337
20889d18815j92865O58J72367J97361K42298K70694j29118k64052j53728K16202
20879e8998k87381P6048J51457r4894j75519J3133J51487K10031m924P70N4585
20868C5795j72190k55451o2934J26701o6984N9421Q3934J86566N9805j00009j84613
20857b89959P2558J86419N2740Q3837j15055j68980J64428j63144k51174k55895
20847f84225J7111K94504P1946L215J82584M69464j47174k40070P7993Q2811J9036
20836A47195n7804M5974o8022l34301k7330l1198n9048N0278K73224K7106K78627
$$ plain form
20910 360985 328025 99341 -197269 -22771 -58043 -12675 -81096 -247450 -253576 -318692 -303392
20899 -303392 133815 205829 -230598 -371095 -336542 -314373 -405067 -333574 -519152 -418815
20889 -418815 -611680 -611022 -438655 -241294 1004 271698 142580 -121472 -275200 -58998
20879 -58998 -346379 -270331 -118874 -213768 -389287 -376154 -224667 -14636 -19560 -18790 35795
20868 35795 -136395 -391846 -454780 -328079 -395063 -335642 -251708 -65142 -5337 -105346 -289959
20857 -289959 -217401 -30982 21758 105595 -9460 -178440 -14012 -177156 -428330 -684225
20847 -684225 -667114 -372610 -300664 -297449 -114865 354599 207425 -32645 45348 128159 147195
20836 147195 89391 135365 67343 -266958 -294288 -325486 -384534 -334256 -61032 -33926 244701
20825B44701J52966n48365j4544L05515J71739o3495j81386r386n5439j77009
20815a74703J25409J52446O6080K4834j13291q4730j16787p2397K15830J27805
20805A50496r9891Q3951k454l52286k41336N2619M3152J63703j0189J54275l1590
20794h9550K26700J30184r8399j39316O9316j04391k24989m2253o2384j68091
20784e03173q2163O166K76180P2282L92303K19810j12657O2924j17865l79192
20774a65385k0909K95797J15065j41253M2409j98739J57200r7234k98140j96324
20764e07513M8493N3144l3208j08133r2102L27969L9506J11873J16418P0453p8516
20753e1616p9269L7049q6482l0209k44194O0812M0932K23006J76444Q4588Q6247
$$ plain form
20825 244701 397667 -150698 -165242 140273 312012 248517 67131 57745 2306 -174703
20815 -174703 -49294 103152 169232 194066 80775 -3955 -120742 -193139 22691 150496
20805 150496 50605 134556 132102 -220184 -461520 -408901 -365749 -202046 -212235 -57960 -89550
20794 -89550 137150 267334 168935 29619 98935 -5456 -230445 -272698 -335082 -503173
20784 -503173 -585336 -579170 -302990 -230708 161595 381405 268748 331672 213807 -165385
20774 -165385 -186294 109503 224568 83315 125724 -73015 84185 -13049 -311189 -507513
20764 -507513 -459020 -405876 -439084 -547217 -639319 -311350 -271844 -159971 -43553 26900 -51616
20753 -51616 -130885 -93836 -180318 -210527 -454721 -393909 -352977 -129971 46473 131061 217308
20742B17308j48881j28127p3809j24810j12854j67962J2761O4012o9916L617n5417
20731e84078K07419K32118P4287n8828l738j1122L96144k5395m61305j9753k0363
20720b74614K28781J96949Q8996J00103j01817k59760l69870j84638L7922J0229
20710e27719J45075N8279r5362L32884L41176k0295j74152n5253j7754P0703Q9127
20699A46709J29971j15613m24933k39502M10897K37158J33508J10120K269n9507
20689C31077m5126l85872j95675J02167J54922L4617l33475J00301L78815j16944
20679B4807n01k31770j18129J83131J88157O5430P3137J0457r6423j13638j64200
20668a79542M9220K0104M7810P5790O7238K59830j36727k39773Q930J30113l1575
$$ plain form
20742 217308 68427 -59700 -133509 -258319 -371173 -539135 -526374 -462362 -532278 -528661 -584078
20731 -584078 -376659 -144541 -70254 -129082 -132820 -143942 252202 226807 -234498 -254251 -274614
20720 -274614 -45833 151116 240112 340215 238398 -21362 -391232 -575870 -537948 -527719
20710 -527719 -382644 -324365 -419727 -86843 254333 234038 59886 4633 -13121 57582 146709
20699 146709 276680 161067 -263866 -503368 -92471 144687 278195 388315 390584 331077
20689 331077 285951 -99921 -295596 -193429 -38507 -3890 -337365 -237064 141751 24807
20679 24807 24306 -207464 -325593 -142462 45695 111125 184262 194719 98296 -15342 -179542
20668 -179542 -130322 -110218 -62408 13382 80620 340450 203723 -36050 -27120 102993 71418
20657G1418J4835j07090O97J91386J72471J79230j63846o01536l59104n3040R4947
20646e59632M77946K94992j0799j53871Q420r5163j52768j78991j99798K08173
20636c61491l0294k21580J52349K65881j8127j20867J57717L45105J27328j25273
20626A70748k00165j05934k28093j03970K17843j41711J86013K04555k69735Q4614
20616a85835r8848k1589j0972K20741o0855l61300K07724J01306J56191j97348
20606b50785p8255j2054J7254K22005O7785p6485r2121k98897N6161J88638j61169
20595d17923P4697L08561K61812K43513m8206k50870L2316J18052j69081k81712
20585a28841j1943K86708N0836k6536l1201J5754k6988j54325j0381j74286l24268
$$ plain form
20657 71418 86253 -20837 -20140 171246 343717 522947 359101 -242435 -601539 -654579 -559632
20646 -559632 -81686 213306 202507 48636 57056 -38107 -190875 -369866 -569664 -361491
20636 -361491 -391785 -613365 -461016 -195135 -213262 -334129 -176412 168693 296021 170748
20626 170748 -29417 -135351 -363444 -467414 -249571 -391282 -205269 -714 -270449 -185835
20616 -185835 -284683 -306272 -317244 -96503 -157358 -518658 -310934 -209628 -53437 -250785
20606 -250785 -329040 -341094 -323840 -101835 -34050 -110535 -202656 -501553 -445392 -256754 -417923
20595 -417923 -343226 -34665 227147 470660 422454 171584 203900 321952 152871 -128841
20585 -128841 -140784 145924 196760 170224 139023 154777 127789 -26536 -36917 -211203 -535471
20574e35471P1357J44268J95064K65622R1123n3686n7162k21515k3127J35889
20564A2362k05336m00907m445M66545L65648J18327j01345k49275k35122n3674
20554b87222j0389j724j30378p908p1223J96780r1208r2881O0537J38464J37940
20543a59212K67117O2287J07759J84217J7249p4687m20629l11698j19125L8350
20533d08372J29793J2499k40071J93595L6801J6853K4568j008k25684J76352K3879
20522b60795l60292M1845L80462j09291k99942r786J37924L51842r5408R6391
20512a27050K10432k2146L3701o8029J73104J85145o9823l51292J1691J48889
20502A24622j84534p3233J30079Q1613p1185p6878J60824O6266J45990n2392j55456
$$ plain form
20574 -535471 -464114 -319846 -124782 140840 231963 178277 121115 -100400 -123527 12362
20564 12362 -192974 -593881 -598326 -131781 233867 352194 250849 1574 -233548 -287222
20554 -287222 -297611 -299335 -429713 -437621 -508844 -312064 -403272 -496153 -435616 -297152 -159212
20543 -159212 107905 170192 277951 462168 479417 404730 -15899 -327597 -446722 -408372
20533 -408372 -278579 -266080 -506151 -312556 -275755 -258902 -234334 -235342 -461026 -284674 -260795
20522 -260795 -621087 -579242 -198780 -308071 -608013 -617799 -479875 -128033 -223441 -127050
20512 -127050 83382 61236 94937 26908 200012 385157 315334 -35958 -24267 124622
20502 124622 -59912 -133145 -3066 78547 7362 -69516 91308 157574 303564 251172 95716
20491I5716J33578o7735j16828L3474m4368m9897j44397j1218R2639l12428P2173
20480c19291J67518Q0508j16006l0620q9112L53406J55709j39911L7350M863P9514
20469A83928j43531q4243k50737j25345N32331Q8969r2816J0245Q9925q7213l90478
20458b68965k16362K46905p864k99608L0100K95939j36179m2696M9561K25106
20448a24063J22205J57425L49484j34562k46348M8236n6940p0466q2258l99541
20438d36828j78609K61645k4760n8384k99647o1971M28987L57588J5495j20104
20428a16588n4922p6161j75924l1731R5626K27822M80739J04188J92235k79572
20418C65712o32254j87485Q8101J86826j3461j24999R0883J07760L562J76610
$$ plain form
20491 95716 229294 161559 44731 78205 33837 -16060 -160457 -171675 -79036 -391464 -319291
20480 -319291 -151773 -71265 -187271 -217891 -307003 46403 202112 62201 99551 104414 183928
20469 183928 40397 -43846 -294583 -419928 112403 201372 108556 118801 208726 121513 -268965
20458 -268965 -485327 -238422 -246286 -545894 -515794 -219855 -356034 -398730 -349169 -124063
20448 -124063 -1858 155567 505051 370489 124141 172377 115437 44971 -37287 -436828
20438 -436828 -615437 -353792 -378552 -436936 -736583 -798554 -369567 -11979 3516 -116588
20428 -116588 -171510 -247671 -423595 -455326 -359700 -131878 348861 453049 645284 365712
20418 365712 -266542 -454027 -365926 -179100 -192561 -317560 -226677 -118917 -115355 61255
20408F1255P2621k88885j9785L3254J52341j31879m8441J79527K36445K00130
20398D46583j34805K08435p7774n12128k24616L93474n7775k4795q6161j45708
20388b15270k0513J59163j69694N4534J08770q9228k3029J68954J25729j684k63769
20377a66037m5710M21754j8902J24429k2209m08873l8132r9228J08051J0137L7172
20366i7548P4110K5222l0673L731j63523j36626K36740K48780j8610j4134O3973
20355A91442j6228j28947L10650J20728k45543k15212j36148N9610n855J63493
20345I7990P5221l903l4310j55636K6880m19190k06565O4835M1937K32318j96351
20334d76774N5097J68200L31125L84556p3315j08187k25371l40976J9077K13618
$$ plain form
20408 61255 133876 -155009 -174794 -141540 10801 -121078 -169519 10008 246453 446583
20398 446583 311778 520213 442439 -69689 -294305 99169 41394 16599 -69562 -215270
20388 -215270 -235783 -76620 -246314 -191780 -83010 -172238 -195267 -26313 99416 97732 -166037
20377 -166037 -211747 210007 191105 315534 293325 -115548 -153680 -252908 -144857 -134720 -97548
20366 -97548 -23438 1784 -28889 -25158 -188681 -325307 -88567 160213 141603 127469 191442
20355 191442 175214 46267 356917 477645 232102 16890 -119258 -59648 -65503 97990
20345 97990 173211 169308 134998 -20638 6242 -412948 -619513 -554678 -512741 -280423 -476774
20334 -476774 -421677 -253477 77648 462204 388889 280702 55331 -285645 -266568 -52950
20324e2950j16041O4923j63249M9708J75264L51248q3777l2941J42124n10382
20314a76073j82837r9013J26375J06394j0947l5767j07612l5544j17194J31157
20304d01061Q8249l7532O8149J48305P5914k25128n6861k50213n7647L6772L7266
20293e73787j5337j31192R1764K40231j8338J70988N8602J06597j05696o5471
20283b41639p5443j83384n1761L07518L48266J3670J10696J71778k61648j03238
20273C4815K71015k4726k1405m4584j63309K6084K4650p4119j07898l2121l4281
20262a45879j56949j24695J89718J92509K0765J44303j79818j02143j2179J84941
20252A0573j53581q687j30130k19205Q3636K05253R4232k62590l71190Q8159M6800
$$ plain form
20324 -52950 -168991 -104068 -267317 -217609 -42345 308903 225126 192185 334309 -176073
20314 -176073 -358910 -457923 -331548 -225154 -236101 -271868 -379480 -415024 -532218 -401061
20304 -401061 -312812 -350344 -282195 -133890 -57976 -283104 -339965 -590178 -647825 -611053 -573787
20293 -573787 -589124 -720316 -628552 -388321 -406659 -235671 -177069 -70472 -176168 -241639
20283 -241639 -317082 -500466 -552227 -244709 103557 117227 227923 399701 138053 34815
20273 34815 305830 281104 259699 215115 51806 77890 102540 28421 -79477 -111598 -145879
20262 -145879 -302828 -427523 -237805 -45296 -24531 119772 -60046 -162189 -174368 10573
20252 10573 -143008 -151695 -281825 -501030 -417394 -212141 -117909 -380499 -751689 -663530 -616730
20241f16730K79535K16145j86892l7602j19862K0510K25388K81604J69995l8098
20231A93993m4409m5120j70410j81533J84497l12354l78445K17430K02155J17053
20221b17143J41935L12716K83197m26587n78866J06301J08851O7966k40282Q6044
20211c55868J71050j05761J18205J25685o8387K40294j37009N1780J32672J48607
20201C21268j76445j08569J22802J63068j46420n8064j5561j62858q5653N2121
20191i4311M6087j85486k8838L79043l3780j01517K09568K62515j16024m1734
20181B95523k49864j5461N3321j04577J42506j42857P0314P6387j30022l00577
20171c05307k59100J02194l4011P0898L86537J44847j07204K8586J32376j66986
$$ plain form
20241 -616730 -337195 -121050 -307942 -345544 -465406 -444896 -219508 62096 232091 193993
20231 193993 149584 104464 -65946 -247479 -62982 -375336 -753781 -536351 -334196 -217143
20221 -217143 -75208 237508 520705 94118 -484748 -378447 -269596 -201630 -441912 -355868
20211 -355868 -184818 -290579 -172374 -46689 -115076 125218 -11791 39989 172661 321268
20201 321268 144823 36254 159056 322124 175704 117640 102079 -60779 -146432 -94311
20191 -94311 -48224 -233710 -262548 116495 82715 -18802 190766 453281 337257 295523
20181 295523 45659 30198 83519 -21058 121448 -21409 48905 125292 -4730 -305307
20171 -305307 -564407 -462213 -496224 -425326 -38789 106058 -1146 27440 159816 -7170
20161g170j56692j60694O9819K8071k91901j94568K64194K53382N8342l3475k0684
20150a91376J89355p3032j04903K6147j77080j23053J19350l7781k5940r7419
20140d95732Q8333K36217K0476M4354q9933m42674J76990J42885J97566P4594
20130d6924Q3994m09070Q641M1616J65416j13435j93456M6935P9693J1404L27347
20119B161m8561j04428j85054M9173j10473J9572L08403j9094j24932O2876n5042
20108b05399j57034K42445M8549j51j16336n9692L4237j15744q7914K8502O7835
20097c20702K4003O9612p511l2814j38097n1286Q7821J55900J04716K22970j30505
20086a5893j6835K28748k41258j11155L2981p2568j49616N0596J96666j03789
$$ plain form
20161 -7170 -163862 -324556 -254737 -226666 -518567 -713135 -448941 -195559 -137217 -170692 -191376
20150 -191376 -2021 -75053 -179956 -153809 -330889 -453942 -334592 -372373 -398313 -495732
20140 -495732 -407399 -171182 -150706 -106352 -196285 -638959 -461969 -319084 -121518 -46924
20130 -46924 37070 -372000 -363359 -321743 -156327 -269762 -463218 -416283 -336590 -325186 2161
20119 2161 -46400 -150828 -335882 -286709 -397182 -377610 -69207 -88301 -213233 -150357 -205399
20108 -205399 -362433 -119988 -71439 -71590 -187926 -247618 -213381 -329125 -417039 -388537 -320702
20097 -320702 -296699 -227087 -234598 -267412 -405509 -456795 -368974 -213074 -108358 114612 -15893
20086 -15893 -32728 196020 -45238 -156393 -123412 -195980 -345596 -295000 -98334 -202123
20076b02123k6067J15994J44597L3459k3164q5892J22672k0534R716L1404J94835
20065B94897k7162r2176k21171q658q8884R6062N5356r2672K64035J71891j34216
20054B17302j21103j58124j47045J58536K33114l8506l85484k58520J99396L54704
20044E4270K24633p4556p3696L5929J21700r2468o8888k09128P6756n3152l66765
20033d25365q761L59452K09484K1293R4394K4760J1658o3564j86436j19725Q7450
20022D640J34933J37096j43058J90351r6697l71353J36000J32690k73218j91180
20012c39796P0420j8748J79602J89592J94925K2537j92100j41789K4881o4981
20002g5457j78882j11645J36252R9496j64811Q2014K64636Q7982J49866j39482
$$ plain form
20076 -202123 -228190 -112196 32401 65860 42696 -43196 79476 58942 68658 100062 294897
20065 294897 267735 175559 -45612 -54270 -143154 -47092 8264 -84408 179627 351518 217302
20054 217302 96199 -61925 -208970 -50434 182680 144174 -241310 -499830 -300434 54270
20044 54270 278903 204347 130651 166580 288280 195812 126924 -82204 -5448 -58600 -425365
20033 -425365 -434126 -74674 134810 156103 250497 275257 286915 223351 36915 -82810 4640
20022 4640 139573 276669 133611 323962 227265 -144088 -8088 124602 -148616 -339796
20012 -339796 -269376 -288124 -108522 81070 275995 298532 106432 -35357 -10476 -75457
20002 -75457 -254339 -365984 -229732 -130236 -295047 -213033 51603 139585 289451 149969
19992A49969j70453k33585n8440J35049o9483j38070n9749j78891M3556K93584
19982b86513J65335J10425l20301M1307K26071K2367n9190p6722o3961O4892J75115
19971a175k88866o6436O8614P1825p7461j19983n838K59171P4983m26301K01720
19960c09747K18341m4703r2376K19199j61573j79642L83805K12513k39874j96653
19950a90710j4331K10114J47643k83743k13594j07264J36790J57251j08221n5424
19940c21489K48560j00455n5074R2249K0741q0601j03894j24434l0398q4963P4074
19929d65684O2289o5124J90095L57169J94293j02759o3803q6196j28950j71714
19919b80384l180j24862j86914j1139J98823K82037j29944k16934P3169N9110
$$ plain form
19992 149969 -20484 -254069 -312509 -177460 -246943 -385013 -444762 -623653 -580097 -286513
19982 -286513 -121178 -10753 -331054 -289747 -63676 -41309 -100499 -177221 -241182 -176290 -1175
19971 -1175 -290041 -356477 -287863 -216038 -293499 -413482 -419320 -160149 -85166 -511467 -309747
19960 -309747 -91406 -136109 -228485 -9286 -170859 -350501 33304 245817 5943 -190710
19950 -190710 -205041 5073 152716 -131027 -344621 -451885 -315095 -157844 -266065 -321489
19940 -321489 -72929 -173384 -228458 -136209 -115468 -196069 -299963 -424397 -454795 -539758 -465684
19929 -465684 -403395 -468519 -278424 78745 273038 170279 106476 20280 -108670 -280384
19919 -280384 -283564 -408426 -595340 -606479 -407656 -125619 -255563 -472497 -399328 -340218
19909c40218K3981J5754J5261Q7346l2976j64209J75602K03929m5893Q6875J36286
19898A61738L9575j43668m06903O9532L86319J66550j12042m06532j3589N9518
19888a99502k1300J43277k7944k27094m5456K09193o4279p5441J49230L64345
19878B05029R0332j16433k35812k31973m7879m2254J93490P5044n9847K2950j23662
19867b71015k26980r31K43779J35777m6298K63357Q5096O8488j97023J1757k43178
19856a77171p8008P5690J58822J68015n0974l54479J26410J47141j96689m5357
19846b26600j6828n6642j58492J79476L30326M1977j37766p4970J50600n7794
19836b6713m4922P4825j12672n3319m0158j67940N50J93999K20299J64845j5905
$$ plain form
19909 -340218 -316237 -300483 -285222 -197876 -230852 -395061 -219459 -15530 -61423 25452 161738
19898 161738 201313 57645 -349258 -279726 106593 273143 161101 -245431 -259020 -199502
19888 -199502 -220802 -77525 -105469 -332563 -378019 -168826 -233105 -308546 -159316 205029
19878 205029 295361 178928 -56884 -288857 -336736 -378990 -185500 -110456 -170303 -147353 -271015
19867 -271015 -497995 -498926 -255147 -119370 -165668 97689 182785 251273 54250 66007 -177171
19856 -177171 -255179 -179489 -20667 147348 96374 -258105 -131695 15446 -181243 -226600
19846 -226600 -243428 -300070 -458562 -279086 51240 93217 -44549 -119519 31081 -26713
19836 -26713 -71635 3190 -109482 -162801 -202959 -370899 -370349 -176350 43949 208794 192889
19825A92889N1931n817j01027o7314j1066P2358L72981l6565j46823l7008j14683
19814A69856q3099K445J32054n3055k43953q889J19724p0584j5048K64903K4072
19803B38426j00696l98933l65354L1050M03743K78768j9376N0076N3193l37533
19793a66636n714M2152l4398k42431R0298Q0522M16064P5700k77254m02421j46173
19782e70291K28332M53390J68362j40024m56189j45648o1724K01034j29015j26106
19772e77879J54025K80244m9351j94089j08332k12339k23816J35313L27314M01329
19762f7581K78154r759k14505o4736J33166l6847j88110P2739J53946P7216R0757
19751B24440o6176j656j12092j37351J9508J18512p9240K31032K19506L9927j54141
$$ plain form
19825 192889 244820 239003 137976 70662 59596 131954 504935 468370 321547 284539 169856
19814 169856 86757 89202 221256 168201 -75752 -84641 35083 -35501 -50549 214354 238426
19803 238426 137730 -261203 -626557 -595507 -191764 87004 67628 117704 170897 -166636
19793 -166636 -172350 -130198 -164596 -407027 -316729 -236207 179857 255557 -21697 -424118 -570291
19782 -570291 -341959 111431 279793 139769 -316420 -462068 -523792 -322758 -451773 -577879
19772 -577879 -423854 -143610 -192961 -387050 -495382 -707721 -931537 -796224 -468910 -67581
19762 -67581 210573 200814 -13691 -78427 54739 17892 -170218 -97479 56467 133683 224440
19751 224440 158264 156608 44516 -92835 -73327 45185 -34055 196977 416483 456410 302269
19740C02269l08264k79560J06099L7816o8507l44761j48684P3711K26775M23158
19730B0052K61358O8055p5161M8675k03135l14547j19515L3385K2565P5164J57307
19719b5797R278o369p8352K9522p1250p6776j22181L4461n4010J12435Q8597j37449
19707b97891J80316N2451j65992j84084k0472J35119j60059j95663j0328M937
19697f61666K83894M32011p3629k5588p0240j44672l0874J5449J550J83109J55430
19686F4774k96344j38790L25286M93609j7102j82900M2274j4136k71490n08509
19676e03328j41182L72212K87658L28045K51619r0344k47244k08122k12699j27836
19666b91221J87490N5427j08634J8303l2087k69509j1996J13618k5631j0253l4415
$$ plain form
19740 302269 -5995 -285555 -179456 -141640 -210147 -554908 -703592 -629881 -403106 20052
19730 20052 281410 349465 274304 322979 119844 -194703 -314218 -280833 -258268 -183104 -25797
19719 -25797 -16519 -22888 -101240 -71718 -142968 -219744 -341925 -307464 -361474 -249039 -160442 -297891
19707 -297891 -117575 -65124 -231116 -415200 -435672 -300553 -460612 -656275 -666603 -661666
19697 -661666 -377772 54239 -19390 -44978 -115218 -259890 -290764 -275315 -273765 -90656 64774
19686 64774 -231570 -370360 -45074 448535 431433 248533 290807 276671 5181 -503328
19676 -503328 -644510 -272298 15360 343405 595024 504680 257436 49314 -163385 -291221
19666 -291221 -103731 -48304 -156938 -138635 -170722 -440231 -452227 -338609 -364240 -374493 -408908
19655d08908l1407K46774K99002K8306j38019q1680l30j58827j12915J42262K51687
19644C5945k5840K5910j79793R3591K70182q2976J56776K78419k54471j89238
19634A28505k24354j55762L9461J55106L27312j1032j20681k3448j2532o6942
19624C5633N7042m445j74950l22954m52824O0128K74918q5347k305Q1671M53707
19613g9726n6667k28183P9821J90822J1447l17912l62284r443J35573J24924J06592
19602d05036j03462J1004j87261j6760L34704j35246q8312L14781j15381j38169
19592e29138J33541M25147K8508k2795K9534l8132j94785j66217j35386L23763
19582a45960O9172j96438K87847K11749o9546l68058p6290O2764j57656J03540
$$ plain form
19655 -408908 -440315 -193541 105461 133767 -4252 -85932 -86262 -245089 -358004 -215742 35945
19644 35945 10105 36015 -143778 -50187 219995 137019 293795 572214 317743 128505
19634 128505 -95849 -251611 -212150 -57044 270268 259236 138555 115107 102575 35633
19624 35633 92675 88230 -86720 -409674 -862498 -802370 -527452 -612799 -615104 -533433 -79726
19613 -79726 -136393 -364576 -284755 -93933 -82486 -400398 -762682 -772125 -636552 -511628 -405036
19602 -405036 -508498 -497494 -684755 -701515 -366811 -502057 -590369 -275588 -390969 -529138
19592 -529138 -395597 29550 58058 35263 64797 26665 -168120 -334337 -469723 -145960
19582 -145960 -76788 -273226 14621 226370 156824 -211234 -287524 -224760 -382416 -278876
19572b78876J41466J80540K46931n4743l21075k80305O9615K50631P8765p7839
19562d4890J68729r1490J1271P426k5113J40525Q5924R4157p9776j44521j38442
19551a6200k24433J39591l17161j30989P7176K62800K53924R5299r2260o9571
19541b1824K04750q0125k26015J58137p1571j23244L22876J85661k0084p53J23347
19530D51155J49206k31729R0255J01015k92228l99701J63554J26211L58916M4533
19520E61187n4218r5708L12712L32804j60579K41092J62202K02657j24320l59927
19510A017902q532k08690m34171m98561Q6477M35631j62577q7688J46344K19385
19500E05520R6069l00748j02912J36849J31091J26929k46412j68358j5203j60837
$$ plain form
19572 -278876 -137410 43130 290061 235318 -85757 -366062 -296447 -45816 32949 -44890
19562 -44890 123839 32349 43620 51046 25933 166458 252382 346539 266763 122242 -16200
19551 -16200 -240633 -101042 -418203 -549192 -472016 -209216 44708 140007 47747 -21824
19541 -21824 182926 102801 -123214 34923 -36648 -159892 162984 348645 328561 327808 451155
19530 451155 600361 368632 458887 559902 267674 -132027 31527 157738 516654 561187
19520 561187 506969 411261 723973 1056777 896198 1137290 1299492 1502149 1377829 1017902
19510 1017902 1009370 800680 366509 -132052 -45575 390056 227479 139791 286135 505520
19500 505520 601589 300841 197929 334778 465869 592798 346386 178028 162825 1988
19490A988r505K12494o2237j30746J4502K03852J36508k34082n8204K35802K3426
19479C33798L4023k00166j0603k12149K8441k9890j72944O8158K43766J53747
19469B36181j11375K14961j26105K0840J45879K57969N8030K84089J97714k50529
19459I27654l7789j94285j12565r086j11691j60348L2898p5171k68896k36978
19449b46257K71346L24591k62652j00961j91157j4065o0878L52189M00746j01504
19439C71398k17958j75295Q7524k01981j17616m10405k3512j71380O2403M35338
19429c61484K52489R1891j53548K25427j66397p0165J90016J26454J08560m8701
19419A94542p0354R2344k9488j9298O7316J11654m880k26501j59980k03838j19290
$$ plain form
19490 1988 -7517 204977 142740 11994 26496 230348 366856 132774 74570 310372 333798
19479 333798 367821 167655 157052 -55097 -26656 -56546 -229490 -161332 82434 236181
19469 236181 124806 339767 213662 234502 380381 638350 696380 980469 1178183 927654
19459 927654 889865 695580 583015 573929 462238 301890 334788 259617 -9279 -246257
19449 -246257 25089 349680 87028 -13933 -205090 -219155 -280033 72156 472902 371398
19439 371398 153440 -21855 65669 -136312 -253928 -664333 -687845 -859225 -796822 -361484
19429 -361484 -108995 -17104 -170652 54775 -111622 -181787 8229 134683 243243 194542
19419 194542 124188 216532 187044 167746 235062 346716 341836 115335 -44645 -248483 -367773
19408c67773k5120j6995N7792P525j03896n6314K46064K33481J95535J85619q9384
19397B66534K0484j20682l53542j69392K81406J63015k77718J946n0843j76747
19387d15539m0698Q9974K01745L6917M4029r1920l2442Q5039L0268k78331k95159
19376f66117l3034L24718K63180R6250q9075O6151j35870j87684J18313L79992
19366A36824k7405o8537r8317k3996Q6599j09382k41695N4907R0174j38562j70404
19355e09794l86879l0168L31821L05671j87793j07406J79068J01954J2507M4614
19345b46405J18295Q1478k7391J45355M7107K2444l13785k32579J98524k12113
19335d19070l6229M30745J53379K01558j32260m56362R0163N25704J22304J18891
$$ plain form
19408 -367773 -392893 -409888 -352096 -344571 -448467 -504781 -258717 -25236 170299 355918 266534
19397 266534 287018 166336 -187206 -356598 -75192 87823 -189895 -187949 -238792 -415539
19387 -415539 -456237 -366263 -164518 -127601 -83572 -175492 -207934 -122895 -92627 -370958 -666117
19376 -666117 -699151 -374433 -111253 -15003 -104078 -37927 -173797 -361481 -243168 136824
19366 136824 109419 40882 -57435 -81431 5168 -104214 -345909 -291002 -200828 -339390 -509794
19355 -509794 -896673 -926841 -595020 -289349 -477142 -584548 -405480 -303526 -291019 -246405
19345 -246405 -128110 -46632 -74023 71332 118439 140883 -172902 -405481 -206957 -419070
19335 -419070 -455299 -24554 128825 330383 198123 -258239 -168076 357628 479932 598823
19325E98823q10o1072q2489n02092k08591J55301L63184J44978m7141J37818L674
19314E01583l996j88629p1843l8928p9326l0498l0881j76410K7417M18412q0293
19303B46608j65541j43421j93838k6745K07648M20874L4369j68730l23348p0460
19293a82584J59874M8271J86114k3090N906j9872k91307j15153J8582q0306J67234
19282a26331J91811K17593p2340l69080q2063j01878K08378J94587r1470J9790
19272a1003K46968k64217j22341J66890k10925j69997K41977J89376j11711N1429
19262F446J85908n4860j86864k88599J7399L46336j4127j09660K49392k8749j01207
19251B1415n4548K87001m499p6612j42268P1380P844j57134K3817K68059L8542
$$ plain form
19325 598823 598013 536941 454452 -47640 -256231 -100930 262254 407232 360091 497909 501583
19314 501583 497587 308958 237115 198187 118861 88363 57482 -118928 -91511 326901 246608
19303 246608 81067 -62354 -256192 -282937 -75289 345585 379954 211224 -112124 -182584
19293 -182584 -22710 25561 211675 188585 194491 174619 -116688 -231841 -213259 -293565 -126331
19282 -126331 65480 283073 210733 -158347 -240410 -342288 -133910 60677 -30793 -11003
19272 -11003 235965 -28252 -150593 16297 -194628 -364625 -122648 66728 -44983 6446
19262 6446 192354 137494 -49370 -337969 -320570 25766 11639 -98021 151371 122622 21415
19251 21415 -33133 253868 249369 172757 30489 101869 109713 -47421 -23604 244455 282997
19240B82997K12749o8939o0095J20264j1801j02907Q0651J48271n5426n8930m5299
19229D41535k29214L16720r6003j66513J18401R1020l4469j19114p6862L1217
19219B76718R726q6479R090k95788j82491L31104J80586R7747N6413q6689j58034
19208A51903K9213k595J90429J4372l00130m34724K12092K71259r7552Q1587m3200
19197G2654j8351q7123O1528M9721K18647K99947l10730j57766o7697j79664p2953
19186a91787k4434J71783J68126J16157K91757k9612K88950J12850l36744n5525
19176E11521m1268l36865k03888j10602k8782J43637l7956K21351j95745k80082
19166c58679j94916O0910L87290L18811j30186k87049j55801J62385M64122j57066
$$ plain form
19240 282997 495746 426807 366712 486976 475175 372268 452919 601190 545764 486834 441535
19229 441535 212321 529041 433038 266525 384926 475946 441477 322363 245501 276718
19219 276718 286444 199965 209055 -86733 -269224 61880 242466 340213 396626 309937 151903
19208 151903 181116 178521 368950 383322 83192 -351532 -139440 131819 34267 115854 72654
19197 72654 54303 -32820 28708 78429 297076 597023 286293 128527 60830 -118834 -191787
19186 -191787 -216221 -44438 123688 239845 531602 501990 790940 903790 567046 511521
19176 511521 470253 133388 -70500 -181102 -209884 -66247 -104203 117148 -78597 -358679
19166 -358679 -553595 -492685 -105395 213416 83230 -203819 -359620 -197235 266887 109821
19156A09821j62227q932k15593j01180m6423M93316N2093m0368j87665J90737
19146H3579J94620R9734P8891J01862K27773k00728n81612o9111J0520J79122
19136A24650K74725j1972l12078J99344J80531j28420P5402Q6411l18664j25805
19126D4124J09819n2623j95591q7814j57343J69920Q4915J1094r1753R5606P9255
19115I609k01497m4167L5621J4349p612J21074l95p2613p6345J595k1382p2616
19103c14379L6495M63275k9364k5731J14904J48558j20733j53649q7792j56281
19093a24697m6098K36947Q5791M0988Q2665j5229o2558N6062K0056L0099k43898
19082F0128k23205j72112j33141l1819K98560M87379L3016j14718j14068J29656
$$ plain form
19156 109821 -52406 -61338 -276931 -378111 -424534 68782 120875 80507 -107158 83579
19146 83579 278199 377933 456824 558686 786459 585731 4119 -64992 -54472 124650
19136 124650 399375 387403 75325 274669 455200 326780 402182 488593 169929 44124
19126 44124 153943 101320 -94271 -182085 -339428 -169508 -84593 -73499 -165252 -69646 9609
19115 9609 -191888 -236055 -200434 -186085 -193697 -72623 -73018 -145631 -221976 -220381 -241763 -314379
19103 -314379 -277884 185391 156027 130296 245200 393758 273025 119376 31584 -124697
19093 -124697 -170795 66152 151943 192931 275596 260367 197809 253871 273927 304026 60128
19082 60128 -163077 -335189 -468330 -500149 -201589 285790 318806 204088 90020 219676
19072B19676m1539J29646K8403k45485R9690J09598l7210Q1909m1013j39123p4658
19061H9894r726l3487K37033R280J40404p4690J68285K57774m1112j87876J57418
19050G13197J5386J19320p4251j73994J98683q1218k05930J39051L3047N5330
19040G38621K27295J52211k459J37196K46487r2985K6786j41917N1813N1424J06620
19029A501092K76891J41963J83361K31274K5000O2338L36364N71796O60734J229596
19019E220409R49369J98121l5111m61932k20360k46038j92612n8352L19593Q09971
19009F283058O62882R77296J390983J235311J617041K153358K843150L443981
19001B0607060M584066O372730Q756765J2577920J8921563K9592921M5428982
$$ plain form
19072 219676 178137 307783 336186 90701 190391 299989 262779 344688 303675 164552 89894
19061 89894 80168 46681 283714 292994 433398 358708 526993 784767 743655 555779 713197
19050 713197 728583 847903 773652 599658 798341 717123 511193 650244 683291 738621
19040 738621 965916 1118127 1115668 1252864 1499351 1406366 1433152 1291235 1343048 1394472 1501092
19029 1501092 1777983 1919946 2103307 2334581 2359581 2421919 2758283 3330079 3990813 5220409
19019 5220409 6169778 6367899 6332788 5870856 5650496 5404458 5211846 5153494 5473087 6283058
19009 6283058 6945940 7923236 9314219 10549530 12166571 14319929 17163079 20607060
19001 20607060 25191126 31563856 40320621 52898541 71820104 101413025 146842007
18994A46842007O3001670O6735671M5254480R358483k2105529m3570430n6039092
18987B09477260n5414472m3304749k9121759j8556831j2850675r167742o754905
18980C4306127n086922l699409l156513k620742j911395j357865j102824j118766
18972A4251691l10480o8499O3194L40713M16382O60450N87007k6608o12773q74552
18962A4426525r28480q64746n03280k72460k22046L35360N93588J070063J517104
18953A5151628K171083K746418L273474M952529O310329Q588817J2389634J8125750
18945G3709662K7967873M4146661O4498760P6147480O0887383K2812636j6130576
18938C54039879m3019638n9971906o4085199n3590832l6543753k3287398j5523877
$$ plain form
18994 146842007 209843677 276579348 321833828 331192311 309086782 265516352 209477260
18987 209477260 154062788 110758039 81636280 63079449 50228774 41061032 34306127
18980 34306127 29219205 25519796 22363283 19742541 17831146 16473281 15370457 14251691
18972 14251691 13941211 13872712 13935906 14276619 14693001 15353451 15940458 15913850 15301077 14426525
18962 14426525 13498045 12633299 12130019 11857559 11635513 11970873 12564461 13634524 15151628
18953 15151628 17322711 20069129 23342603 28295132 34605461 43194278 55583912 73709662
18945 73709662 101677535 145824196 210322956 286470436 347357819 370170455 354039879
18938 354039879 311020241 251048335 186963136 133372304 96828551 73541153 58017276
18931E8017276j0723168q140201n882096m809113l883071l049753k353306j901764
18923A7274804j808915j370712j054058p95062m48937l82873l81515q6222M1225
18914A0987735l27962j05006p74907q91910q99178q36652q29175l41839o06190
18905E374916p38751p37279p3489k43812l14251M8640k19976l51753J0240J21062
18895B875547K00862N4629J83528K12309R3943k44120k67167p5759j12070J72834
18885C094536J33619j38260m37061k25596R4868J33426L41825R6508q2463k2040
18875B989362j84129k61367l37700m50008j39007J61131o093q0938j15292r2044
18865A483915Q101p4148l59776l00276j35945j21513l4550k7614J00758M1146
$$ plain form
18931 58017276 47294108 39153907 33271811 28462698 24579627 21529874 19176568 17274804
18923 17274804 15465889 14095177 13041119 12246057 11797120 11414247 11032732 10946510 10987735
18914 10987735 10659773 10554767 9779860 8887950 7988772 7152120 6322945 5981106 5374916
18905 5374916 4636165 3898886 3825397 3581585 3267334 3315974 3095998 2744245 2754485 2875547
18895 2875547 3076409 3131038 3314566 3526875 3620818 3376698 3109531 3033772 2921702 3094536
18885 3094536 3228155 3089895 2652834 2427238 2522106 2655532 2997357 3093865 3011402 2989362
18875 2989362 2805233 2543866 2206166 1756158 1617151 1778282 1772189 1691251 1575959 1483915
18865 1483915 1492016 1417868 1058092 757816 621871 500358 465808 438194 538952 580098
18855E80098l84527k16277n9414K36670P8613K14824K12914K4298j41609j61019
18845C84571K01716m8924j95036o9514Q7499j6176l05068p5302p154j65873J10733
18834i8528J90623J16469j43428p3162J23880J44288L10578M8625Q3919j12995
18824E90269p8390j25846q0113L06120n0510l65058M1525j17601J54830J31154
18814D06380l510J79640J9978k62069m8933k7801n2981K5212j0543P6733j65890
18803A36216O0959Q8523J92883P7371l3634L17426R9405k67297j23243l0768p2909
18792D44932L19085J9954k23933k81819J77368J02719k61923p9364P1407J18928
18782D07354m5141j06177k34330p4059K10515J46613k57967K8134J80608K03184
$$ plain form
18855 580098 195571 -20706 -80120 156550 235163 449987 662901 687199 545590 384571
18845 384571 586287 537363 342327 272813 360312 344136 39068 -36234 -43388 -209261 -98528
18834 -98528 92095 208564 65136 -8026 115854 260142 570720 619345 703264 590269
18824 590269 511879 386033 305920 612040 561530 196472 237997 120396 275226 406380
18814 406380 402870 582510 602488 340419 291486 263685 210704 235916 225373 302106 136216
18803 136216 197175 285698 478581 555952 522318 839744 939149 671852 548609 517841 444932
18792 444932 764017 783971 560038 278219 455587 558306 296383 217019 288426 407354
18782 407354 362213 256036 21706 -52353 158162 304775 46808 74942 255550 458734
18772D58734J82107r6090k03844j12249j22367q2788Q346J63015j10213k96284
18762b11633J17909K44647l4453k44050K7751L83917L3935k09072k53500K32290
18752H7741j1048J98572q2136l32318J9530J24943K24801K95084K49001l69098
18742D05072l06853j0517r310O4590J29345P8962j96529k58106J45503K3833k7206
18731C8784J71507J6984J42112L88893m5781k7118L8567l05448j20443K26226
18721E24283O65l79515k87848N8402K7710L43778k5982l33628l3501k29739k65947
18710f01322p5937M43942K26402P4846J7736O2704k72544J46808J85926J05338
18700C13899J93951m03370j35830q2174j37868q8402J37561J9004K27327P5414
$$ plain form
18772 458734 640841 544751 340907 228658 106291 23503 31849 194864 84651 -211633
18762 -211633 -93724 150923 116470 -127580 -99829 284088 318023 108951 -144549 87741
18752 87741 76693 275265 193129 -139189 -119659 5284 230085 525169 774170 405072
18742 405072 98219 87702 78392 142982 272327 351289 154760 -103346 42157 65990 38784
18731 38784 210291 227275 369387 758280 712499 685381 723948 418500 298057 524283
18721 524283 524948 145433 -142415 -84013 -56303 287475 261493 -72135 -105636 -335375 -601322
18710 -601322 -677259 -233317 -6915 67931 85667 148371 -124173 22635 208561 313899
18700 313899 507850 104480 -31350 -113524 -251392 -339794 -202233 -183229 44098 119512
18690A19512j69179J94456n8690l78393M0463J5163j82230R2859p6503P6563P3168
18679b52811J52756J16822K26947P1732J65333j70150m23296M2523J00385j37636
18669a07395P9982M8873M9490q4747N0712J87750L9404k0502J08137r8268l6368
18658B17068R1696j07911O0587j04595j146L8344p7843N8753K34150K91968m9657
18647F51414L4474R030j04867k35148j80977J12456J66006R1835L28988O7217
18637I40428k9629J5414k61571l6953J76212r0304j76947J25000r6467k85502
18627B79681J89q0224m5630R5476k51390J98868J21704j02490O8393J33448l22111
18616I5914k8216J5036P1193j26149k06487j00938K00991K64100r0792j92731
$$ plain form
18690 119512 -49667 144789 86099 -292294 -251831 -236668 -418898 -326039 -402542 -325979 -252811
18679 -252811 -100055 16767 243714 315446 480779 310629 -112667 -70144 30241 -107395
18669 -107395 -27413 21460 70950 -13797 36915 224665 264069 243567 351704 253436 217068
18658 217068 308764 200853 261440 156845 155699 194043 116200 174953 409103 701071 651414
18647 651414 685888 694918 590051 354903 173926 286382 452388 544223 873211 940428
18637 940428 910799 926213 664642 627689 803901 713597 536650 661650 565183 279681
18627 279681 279870 199646 154016 249492 -1898 196970 318674 216184 284577 418025 95914
18616 95914 67698 82734 153927 27778 -178709 -279647 -78656 185444 94652 -98079
18606i8079M485K50581L4118j15226J90278j12548j29213j60625m14264r5221
18596f45714J47999K51727R9732R303j60173Q0714K35157q8444K03589J42028
18586B75918k66980j39257K9751J83336m2492J6937R2407M665J907l4936M2527
18575A63783r4382J92939Q1124J50736J2434l67793o9965J13722O4473M8453J7658
18564C13182K78617J31474n6362q6468j9395O5028j91540j54776J48728m4056
18554C84432k07733J98287K85876K37937Q4894k867n2548l67757j94066j44598
18544B21857J19446P8886J60144k53785k77840k33629o013J30072J95174J19216
18534B53528j28674k8894J72274O8041j06850p1278q3046o4635j20312q4073N1276
$$ plain form
18606 -98079 -93594 156987 191105 75879 266157 153609 24396 -136229 -550493 -645714
18596 -645714 -497715 -245988 -146256 -136953 -297126 -216412 18745 -69699 133890 275918
18586 275918 8938 -130319 -100568 82768 40276 57213 149620 154285 156192 121256 163783
18575 163783 69401 262340 343464 494200 506634 138841 68876 182598 247071 295524 313182
18564 313182 591799 723273 666911 580443 561048 626076 434536 279760 428488 384432
18554 384432 176699 374986 660862 898799 983693 980826 928278 560521 366455 221857
18544 221857 341303 420189 580333 326548 48708 -184921 -190934 -60862 134312 253528
18534 253528 124854 95960 268234 336275 229425 158147 75101 10466 -109846 -193919 -142643
18523a42643L5693K84011M3339l5721L10170j43887j43633O616j24745k22411
18513a33211j9942J74946K95656J51545k30347L964K6891k56925J69433M04971
18503E86981K74216n6081n49922l28030l9795n3222j3014j03130O7665p5513j84068
18492d73913l4608L48689K27566L9218q9642q9880K75316L4084j06944j13507
18482A6379p3399L97576O8638n3829M3179K32363j09441k411M5316N0244J21720
18471G36335j5541J37363K95554L15231J10508Q0110R8558p1183K53525K17692
18461B158152J29722k34345m57618k96657J38913K22039k54635k06107K14437
18452A413901L84476J97603R122k13346j26159l5942o9264m20354l03473j40344
$$ plain form
18523 -142643 -106950 177061 220400 184679 494849 350962 207329 213945 89200 -133211
18513 -133211 -153153 21793 317449 468994 238647 242611 269502 12577 182010 586981
18503 586981 861197 805116 255194 -72836 -112631 -165853 -178867 -281997 -214332 -289845 -473913
18492 -473913 -508521 -159832 67734 106952 17310 -72570 202746 236830 129886 16379
18482 16379 -57020 340556 409194 355365 398544 630907 521466 519055 564371 614615 736335
18471 736335 720794 858157 1153711 1468942 1579450 1659560 1758118 1686935 1940460 2158152
18461 2158152 2287874 2053529 1595911 1299254 1438167 1660206 1405571 1199464 1413901
18452 1413901 1798377 1995980 2005102 1791756 1665597 1629655 1560391 1140037 836564 696220
18442F96220L6099o028j20844k58617K2643L74207K57550p8455p5974K80352L86823
18431A513976J7200j45939R0309k66676j85359J93888J75490M1638N0813M13239
18421A898579M00921K92315J73734L11516M80688L82044k5873J09762K29588L89614
18411D642888Q5989J30256K8150M1880J23296L86756O08677P58453R78346O64502
18401H449193Q05251O45513Q03883O30708R13533N17161P77035J327171J649844
18392A6519292J916306K270008K537642K972547L972315N382236O994285R775092
18384E2339723J3846591K0442595L0726462M4944234N7949223N9416833M3853703
18377C23519364J5030788j4005123l2989588m2000605m0264171k7466402r158603
$$ plain form
18442 696220 732319 726291 605447 346830 369473 743680 1001230 922775 846801 1127153 1513976
18431 1513976 1531176 1385237 1475546 1208870 1023511 1217399 1392889 1434527 1485340 1898579
18421 1898579 2299500 2591815 2765549 3077065 3557753 3939797 3913924 4023686 4253274 4642888
18411 4642888 4728877 4859133 4887283 4929163 5052459 5439215 6047892 6806345 7784691 8449193
18401 8449193 9254444 9899957 10703840 11334548 12248081 12765242 13542277 14869448 16519292
18392 16519292 18435598 20705606 23243248 26215795 30188110 35570346 42564631 52339723
18384 52339723 66186314 86628909 117355371 162299605 220248828 279665661 323519364
18377 323519364 338550152 324545029 291555441 249554836 209290665 181824263 172665660
18370A72665660R834443K9825481M7686078N3416173L8276913J0220273j9934385
18363C41990636m2709245n4794557n5724848m6714844l3639712k2856091j5400186
18356G0151153j0879911q065408o567608n455615m488348l811656l110700k285849
18348B5486058k051786k169709j810039j464656j282898j126189j206216j269531
18340A3105034j101596j098390j068304p85731n97678o37838m22809j82422k26181
18331F984085n91855m87434q7835k31693k74112k63210n6921k61723j35530j12314
18321D481458l85161l80255Q2414L4338L7111Q79l78929l10471k13399K76342
18311C244327M799j15595K34727J96350k85912j90926j32526l1544l9439k90943
$$ plain form
18370 172665660 182500103 212325584 260011662 313427835 351704748 361925021 341990636
18363 341990636 299281391 244486834 188761986 142047142 108407430 85551339 70151153
18356 70151153 59271242 51205834 44638226 39182611 34694263 30882607 27771907 25486058
18348 25486058 23434272 21264563 19454524 17989868 16706970 15580781 14374565 13105034
18340 13105034 12003438 10905048 9836744 9051013 8453335 7815497 7392688 7210266 6984085
18331 6984085 6392230 5904796 5816961 5585268 5311156 5047946 4991025 4729302 4593772 4481458
18321 4481458 4096297 3716042 3798456 3832794 3869905 3870784 3491855 3181384 2967985 3244327
18311 3244327 3249126 3133531 3368258 3564608 3278696 3087770 2955244 2923700 2884261 2593318
18301B593318m93479n06320l20708P6777j78513R5844J31409L42068J33253m0512
18291A833137j9925m33306j74576L9155l4775r7313j2745n8485O6651K47687k2355
18280A333150j09764N7983K37939p4731K8172j64674r1469J17019L00122L00402
18270A934149L98608K57493j01467o0966k00510j24011k48005j15427L2615j48150
18260A624329j37419K90211j0840j63522k42061l35223q3571P32L42066K57537
18250A542239j14460p4287j18197j51727q0024k27835m9803j6525N31843P5621
18240A316845P1903M43757Q2737J27874P2016K03802j33098j49581k27489p6820
18230A731946m9956k15902L2788K02895M7515K12304m00977k09904K84558R2715
$$ plain form
18301 2593318 2099839 1593519 1272811 1349588 1171075 1266919 1398328 1740396 1873649 1833137
18291 1833137 1813212 1379906 1205330 1244485 1209710 1112397 1099652 1041167 1107818 1355505 1333150
18280 1333150 1223386 1281369 1519308 1444577 1472749 1308075 1216606 1333625 1633747 1934149
18270 1934149 2332757 2590250 2488783 2427817 2227307 2103296 1855291 1739864 1772479 1624329
18260 1624329 1486910 1777121 1766281 1602759 1360698 1025475 941904 942636 1284702 1542239
18250 1542239 1427779 1353492 1235295 1083568 1003544 775709 725906 709381 1241224 1316845
18240 1316845 1388748 1832505 1915242 2043116 2115132 2318934 2185836 2036255 1808766 1731946
18230 1731946 1681990 1466088 1498876 1701771 1749286 1961590 1560613 1350709 1635267 1727982
18220A727982J32084J51952K15848j12316O9413q4314l17379m4450K07308J20717
18210B066845j49500n3817n5413j64827l2627R6203j69090k44929j26650J63881
18200A330076M65553J14971j04940K80876l3268k92674r5486l89831l20883j56914
18190G97480k23580j73968J55476J86260p0774k50625l48867Q6477n1542M9129
18180A55466K9821M20970K3230n0689P8358j31123J32644J5631m71776q5973J1839
18169A28398O2759J32173P2955Q5519K07350K09072K60474j49059k70225j26082
18159F13334j47574j36665R0116M07137K23811k29180J59313L39552L56793M80839
18149B157476K77130J57972m4597r1145n71931q05169k44391O5209k54738l85173
$$ plain form
18220 1727982 1860066 2012018 2227866 2115550 2184963 2100649 1783270 1738820 1946128 2066845
18210 2066845 1917345 1863528 1808115 1643288 1610661 1706864 1537774 1292845 1166195 1330076
18200 1330076 1795629 1910600 1805660 2086536 2053268 1760594 1665108 1275277 954394 797480
18190 797480 573900 399932 555408 741668 670894 420269 71402 157879 106337 155466
18180 155466 185287 606257 629487 578798 657156 526033 658677 674308 202532 116559 128398
18169 128398 191157 323330 396285 481804 689154 898226 1158700 1009641 739416 613334
18159 613334 465760 329095 419211 826348 1050159 820979 980292 1319844 1676637 2157476
18149 2157476 2434606 2592578 2547981 2456836 1884905 1079736 835345 900554 645816 260643
18139B60643k2186j63411j92305K90311J10037k21408n8721J00184j03287q7790
18129h7933M49428j01984l06463K84841L69898K08544Q8943k14561k66902j76450
18119B47361K3343n2519O6183J52132j25650m31010j21779L31094K2578K3188
18109A34921J62878j26606k48746J61896L81587K01345K24582J38860K58675J32485
18099A421877O3061j27194k98644q9197n3046k21708M0301N0217k90198k9780
18089D65689j5216J44264j47752N1108J72876K6030l58508l70048J71792K01397
18079C41632k01457Q750m4728j9792J24697k39006r5420Q8025M049M9210J15264
18068A31224P5674P7898r8521q1953k73928J48029K23965L56680j37808r8648
$$ plain form
18139 260643 238457 75046 -117259 173052 283089 61681 2960 103144 -143 -87933
18129 -87933 361495 259511 -46952 237889 607787 816331 905274 690713 423811 247361
18119 247361 270704 218185 284368 436500 310850 -120160 -241939 89155 111733 134921
18109 134921 297799 171193 -77553 84343 465930 667275 891857 1030717 1289392 1421877
18099 1421877 1484938 1357744 1059100 969903 916857 695149 735450 785667 495469 465689
18089 465689 450473 594737 446985 498093 670969 696999 338491 -31557 140235 341632
18079 341632 140175 148925 104197 84405 209102 -29904 -125324 -37299 -33250 15960 131224
18068 131224 206898 284796 186275 104322 -169606 -21577 202388 559068 421260 322612
18058C22612J40968J90305k69285j82759l1287J29641J70692J4807k3737j79683
18048B82274l5720N2238j43893j58501M0141l66807O979J46629r2055l3429m7992
18037c50136J44317J95184Q2735N5569j5098j15616P9193K28480J32324k10375
18027B26577j07523J54682K41417J09147k3646r0769l42998j55495m3625r9689
18017a31922J28715L49586j9040j00072J3525L76983j00691j95778J68669P85
18007D90760j01000J06234j9457O7745j19254j271J39920l9346k26669p1249j57494
17996F8919J7455K04057M66825L15415r9581P8395j47672k21657r6471O8734k15193
17985D39226J00252J13223J71314n5620r6574K42056J26801K2452J60149K72896
$$ plain form
18058 322612 463580 653885 384600 201841 170554 300195 470887 485694 461957 282274
18048 282274 246554 298792 154899 -3602 36539 -330268 -323289 -176660 -268715 -302144 -350136
18037 -350136 -205819 -10635 72100 127669 112571 -3045 76148 304628 436952 226577
18027 226577 119054 273736 515153 624300 600654 509885 166887 11392 -32233 -131922
18017 -131922 -3207 346379 327339 227267 240792 617775 517084 321306 489975 490760
18007 490760 389760 495994 476537 544282 425028 423757 563677 524331 297662 226413 68919
17996 68919 86374 290431 757256 1072671 973090 1051485 903813 682156 585685 654419 439226
17985 439226 539478 652701 824015 768395 671821 913877 1040678 1063130 1223279 1496175
17975A496175M47303M8729K91145K02287R1481k56585k79054K16461J90798p86
17965B447954J19877J78288O82167N87015K74860K36202L03095J86221J72407
17956E188086L26378N25282L27681J093310J582006J413868J705329J872183K098490
17947A6132613K978957M328841N786475Q533980J3101004K0488379L1753300M1606586
17939A44710135L7249787J4984106m733226j6123013k5545051k8667211k1146785
17932A00728742j0389191o42848R231933K0049381L0616378L0416612J2458485
17925A92469492p571427j9091299k7391235l2047962k7947130j9619326j2759462
17918D6041651q277688n584690m351949l247014k319297j786388j697343j177344
$$ plain form
17975 1496175 1943478 1992207 2283352 2485639 2577120 2320535 2041481 2257942 2448740 2447954
17965 2447954 2567831 2746119 3428286 4015301 4290161 4526363 4829458 5015679 5188086
17956 5188086 5514464 6039746 6367427 7460737 9042743 10456611 12161940 14034123 16132613
17947 16132613 19111570 23440411 29226886 37760866 50861870 71350249 103103549 144710135
17939 144710135 181959922 196944028 192210802 176087789 150542738 121875527 100728742
17932 100728742 90339551 89696703 98928636 118978017 149594395 180011007 192469492
17925 192469492 184898065 165806766 138415531 106367569 78420439 58801113 46041651
17918 46041651 37763963 32179273 27827324 24580310 22261013 20474625 18777282 17599938
17910A7599938j183102r05321p28669n67720j55228k37731k07327k11405J41390
17901A3544825M08435N27398J015733J180866J526653K297542L385514M791784
17893B8678750O844298J0499043J6100694K5196933L5786553L6736704J9711779
17886A79554754p10284j2327070k1509245k6772495k2484501j2693804l107656
17879G9949699N936998J5715066K6841898L2090107J9437129k763120j5853292
17872A61354485k4379019l1158167k9122805k0901094j3088841q440652o018681
17865B8245226m294143k902802k388326j585999r72776p38253r46269j197622
17857A3219036j043866q13836j01716n87104r03586r14589j074676r19632n33052
$$ plain form
17910 17599938 16416836 15511515 14782846 14215126 14059898 13822167 13614840 13403435 13544825
17901 13544825 13953260 14480658 15496391 16677257 18203910 20501452 23886966 28678750
17893 28678750 35523048 46022091 62122785 87319718 123106271 159842975 179554754
17886 179554754 178844470 166517400 145008155 118235660 95751159 83057355 79949699
17879 79949699 85886697 101601763 128443661 160533768 179970897 177207777 161354485
17872 161354485 136975466 105817299 76694494 55793400 42704559 34263907 28245226
17865 28245226 23951083 21048281 18659955 17073956 16101180 15362927 14416658 13219036
17857 13219036 12175170 11361334 11259618 10672514 9768928 8854339 7779663 6860031 6326979
17848F326979l75879q2496l446m82174k04388o3016n08715m30645k50452l51080
17838C574688k66688j96272l78626l51929K45075J53406j21668k34335j48564
17829B275087j06544k34900m4117j45727p7446j62894l75260J94671J43867j27623
17819A339114M9731N1135k27695l9099k09788k46027L16038J21744l70903l2648
17809G51602J99695j2543j79834l90137j97426J98213J5871j12375M7099L67904
17799F88069L9160K41751n982l47416J71109J51481o3393j40958M0109j66832
17789F07098j83375k3016O8284R7383j21688l02072l0938K22524K03557j69571
17779C68186K5192L11824J80905l8488l52854j16052K69557j89286J24883j9537
$$ plain form
17848 6326979 5951100 5868604 5865158 5382984 5178596 5115580 4606865 4176220 3925768 3574688
17838 3574688 3308000 3111728 2733102 2381173 2626248 2779654 2657986 2423651 2275087
17829 2275087 2168543 1933643 1889526 1743799 1666353 1503459 1128199 1322870 1466737 1339114
17819 1339114 1388845 1439980 1212285 1173186 963398 717371 1033409 1155153 784250 751602
17809 751602 951297 938754 758920 368783 171357 369570 385441 273066 320165 688069
17799 688069 727229 968980 962998 615582 786691 938172 874779 733821 773930 607098
17789 607098 423723 400707 468991 566374 444686 142614 111676 334200 537757 368186
17779 368186 393378 705202 886107 847619 494765 378713 648270 458984 583867 564330
17769E64330r1203K873l8790j06726Q310J0093k5615o4786N0612j17823J53634
17758C44909K34951j74175k77867J97946N5144o7811n1620J8562K64590J34826
17748F79455k0801j34147k1011r9726j14357j99940J52204L19905J14406k69981
17738D06007j06538J3805O1564M6734n404l20742l8325K23648p264P4720R120
17727C57325j35926J2732p2780K38642M98016J40316k3955K53287P0085l01676
17717A036066j94946K11137O344Q4583j8832J16868j8507k77316N0208J80831
17707A176436M16474R9810j58296j65043l31026l37832k06963P8221K83883J27740
17697I83404J78179k45186j07697K62040N2610m8965k4867m69395j18309m19685
$$ plain form
17769 564330 473127 476000 437210 330484 338794 348887 323272 258486 309098 191275 344909
17758 344909 579860 405685 127818 325764 380908 313097 261477 280039 544629 679455
17748 679455 658654 524507 503496 403770 289413 89473 241677 561582 675988 406007
17738 406007 299469 313274 374838 421572 416168 95426 57101 280749 273485 348205 357325
17727 357325 221399 234131 161351 399993 898009 1038325 1014370 1267657 1337742 1036066
17717 1036066 841120 1052257 1058601 1143184 1124352 1241220 1222713 945397 995605 1176436
17707 1176436 1592910 1692720 1534424 1369381 1038355 700523 493560 571781 855664 983404
17697 983404 1161583 916397 808700 1070740 1123350 1074385 1049518 580123 461814 42129
17687D2129J25188J12468J71286j09108O32K3183m4345j8240l2152M5932J06371
17676D23344k715J603M3299L68705l1916o2870O3468M5014m8634k96627k4411
17665D78260K81686L14068M2555o5039k36912q6077j96218L32710L44232j10975
17655A098290q6801r4732N8776J72647m2367k89376N9880J88678P7277p8609l26930
17644G36733k65659l04283J09497j01473l5790J03004J03665k4007M2704J63701
17634E28092R9503n30994m23978R8844O8344J79789J90304r7429l6640J08988
17624A84823j97912k68692j64530J48678K91135n9647j57615Q2104K42112K66225
17614C66681j69791m9536j25344k54711p0168p1K71758L20740j897m22659J23359
$$ plain form
17687 42129 167317 279785 451071 341963 342595 365778 321433 303193 271041 316973 423344
17676 423344 420629 422232 465531 834236 802320 739450 802918 847932 799298 502671 478260
17665 478260 759946 1074014 1116569 1051530 814618 728541 532323 865033 1209265 1098290
17655 1098290 1011489 916757 975533 1148180 1105813 816437 876317 1064995 1142272 1063663 736733
17644 736733 471074 166791 276288 174815 139025 242029 345694 321687 364391 528092
17634 528092 627595 96601 -327377 -228533 -160189 19600 209904 112475 75835 184823
17624 184823 -13089 -281781 -446311 -297633 -6498 -66145 -223760 -141656 100456 366681
17614 366681 196890 147354 22010 -232701 -302869 -302940 -31182 289558 287661 -134998 -11639
17603a1639J83446K87487J65380p2695l37315j89419J5724j60211J72597J70540
17593B23895k1021k94891j73987K13039K38638k18560J23679L6507J38495r9609
17583A66185j88182n34j00482j54197L62089L16522p6304j06481j55563k26094
17573a63041K62572l9940k83250j60576R9887J18126J29432k55904j36748K34407
17563a95035Q480l3034J30690J96768P8817R4802J99167P17m9160l63624k07420
17552a38832j09043L20118R5555j20190m6973j64659M874o9783N5353p5458J1357
17541b37681Q9273L5584N11L1380K28113n5655k34054p3632J22576J21745j30922
17530a02762m0775M1263l8935K15935M2216k10893j23270R7904J56709O7578K27128
$$ plain form
17603 -11639 171807 459294 624674 551979 214664 25245 40969 -119242 53355 223895
17593 223895 202874 -92017 -266004 -52965 185673 -32887 90792 127299 265794 166185
17583 166185 -21997 -22531 -123013 -277210 84879 401401 325097 218616 63053 -163041
17573 -163041 99531 59591 -223659 -384235 -284348 -166222 -36790 -292694 -429442 -195035
17563 -195035 -186555 -219589 -88899 107869 186686 281488 480655 481372 432212 68588 -138832
17552 -138832 -247875 72243 167798 47608 635 -164024 -159150 -228933 -173580 -249038 -237681
17541 -237681 -148408 -112824 -112313 -80933 147180 91525 -142529 -216161 -93585 28160 -102762
17530 -102762 -143537 -102274 -141209 74726 116942 -93951 -217221 -119317 37392 104970 332098
17519C32098M0316J79882m0811N700k19386l42903j52005j06266J30534K99105
17509A26264j995j96364m5760J06221O035l8437J8597j29695j55606J3788J06518
17498a90434P1161k6629k443K13937m9223J044k3882j71547J7835k575p5926q4405
17486c23087L00839l7386k06980j17842K12334K38065k7720N7770o6529J92150
17476B21614K001l6156m7604r7517R6932K12314M3693k25716J8601p5311k68525
17465a55674l9786j5615L97594N02013l43156k85094k09714J86520J12854j50906
17455i64l00625J8349j11552j29632J03029M6956J80907M13452L76537N3328j44596
17444E05189k1281P914l19768k27889n2928Q7986l56999j55669K81598K51862
$$ plain form
17519 332098 372414 552296 511485 517185 297799 -45104 -197109 -303375 -172841 126264
17509 126264 124269 -72095 -117855 -11634 -5599 -44036 -25439 -155134 -310740 -296952 -190434
17498 -190434 -119273 -145902 -148345 65592 16369 17413 -6469 -178016 -160181 -162756 -238682 -323087
17486 -323087 -22248 -59634 -266614 -384456 -172122 65943 38223 95993 29464 221614
17476 221614 223615 187459 139855 42338 139270 351584 395277 169561 188162 112851 -155674
17465 -155674 -195460 -211075 186519 688532 345376 60282 -149432 37088 149942 -964
17455 -964 -301589 -283240 -394792 -524424 -421395 -374439 -193532 219920 596457 649785 505189
17444 505189 483908 491822 172054 -55835 -108763 -20777 -377776 -533445 -251847 15
17434A5j0330k83298O195K09045k8156J21001R2526J33846K99128l59778j02791
17423G7403J34262l1181k37520j00771J39545K3649j24061M9066K75623N2821
17413B58836O2474J58550k8323Q2753J904l39382L5256K76309J81609P0512q5251
17402F75247m54786j40425J55137L60836Q8148L7002L31411j11857j14069j99023
17392F27621J10307j79475k67534O5486J17008q3767p923J97281j53133l20395
17382A05476q8958j7298p6115j01949p6131j1472L62641J9531k93072O2909J58928
17371D4490l8024J053Q1773J44804j55553J11306J50005j54422J66267K01812
17361E53511J30479L5816K975o0139K46466J45171k7482L0441k4495o5200j84822
$$ plain form
17434 15 -10315 -293613 -287418 -78373 -106529 14472 106998 240844 539972 180194 77403
17423 77403 211665 180484 -57036 -157807 -18262 5387 -118674 -69608 206015 258836
17413 258836 321310 479860 451537 534290 536194 196812 232068 508377 689986 760498 675247
17402 675247 220461 80036 235173 596009 684157 721159 1052570 940713 826644 627621
17392 627621 737928 558453 290919 356405 473413 389646 381723 579004 425871 105476
17382 105476 16518 -780 -76895 -178844 -254975 -266447 96194 115725 -177347 -114438 44490
17371 44490 6466 7519 89292 234096 78543 189849 339854 185432 351699 553511
17361 553511 683990 719806 722781 662642 909108 1054279 1026797 1057238 1032743 967543 782721
17350G82721j15167J0822L33127N8278l51883l19285m7491R8636j74356O1293
17340C36695j90923J74535M5940j09892k06951j66517K1362J21337L22397K2533
17330C70516k23446J61674J13100j76834j7022J44488j68916k31158J0922k56579
17320b73255m3073R4336L3896J35624K51000q1498j14182M7504K88095J38697
17310D77144l79958r3163J06667l5436k13558l45947Q2525K87915J71376j09077
17300e1512R1621j39266j83540J85869J06532j26043K2669J27471k59133q6487
17290c11819R1240L04621n5044Q8273j27303n8196o7506m47512j00033K35930
17280d47349K72463J71366O1674j4484k15078o2269K23644r267n4906J77397O6733
$$ plain form
17350 782721 667554 678376 1011503 1069781 717898 398613 351122 449758 275402 336695
17340 336695 145772 320307 366247 256355 49404 -117113 -95751 25586 347983 370516
17330 370516 147070 308744 421844 245010 227988 372476 203560 -27598 -16676 -273255
17320 -273255 -316328 -221992 -188096 -52472 198528 117030 2848 50352 338447 477144
17310 477144 97186 4023 110690 75254 -138304 -484251 -401726 -113811 57565 -51512
17300 -51512 40109 -99157 -282697 -96828 9704 -116339 -93670 33801 -225332 -311819
17290 -311819 -220579 84042 28998 117271 -10032 -68228 -135734 -583246 -683279 -447349
17280 -447349 -174886 -3520 58154 43670 -171408 -233677 -10033 -19300 -74206 103191 169924
17269A69924j54030k79745k71730J39145K79460l2426P3271k27815j26618n5262
17259d85826O4224O3735K97292K06111j14577n3784K1935q2526o02003k9291J26896
17248e87814P7535K67437j93973m019K60991J24005j27519J10283J7126n2663
17238a08611j30893J99612K40569J05541j11360o0404j45522k04449J54607j59639
17228b20549k25723J1791K9116M26189N0029k3797K46834k54083J17664K45002
17218D02473N8442j29760j06683j38242r6567R9844J12985r2576p1262J47105
17208A85759K7163Q2423l0998j08273k03309n43410l02006J69996J43895K41779
17198c36981M6131j46237J05642M5490K08258K62326m0974k2543q9657P0226j14587
$$ plain form
17269 169924 15894 -263851 -535581 -396436 -116976 -149402 -76131 -303946 -430564 -485826
17259 -485826 -421602 -357867 -60575 145536 30959 -22825 -890 -83416 -685419 -714710 -587814
17248 -587814 -510279 -242842 -436815 -440834 -179843 -55838 -183357 -73074 -55948 -108611
17238 -108611 -239504 -39892 200677 306218 194858 134454 -11068 -215517 -60910 -220549
17228 -220549 -446272 -434481 -405365 20824 70853 47056 293890 39807 157471 402473
17218 402473 460915 331155 224472 86230 -10337 89507 202492 109916 38654 185759
17208 185759 212922 295345 264347 156074 -47235 -590645 -892651 -722655 -578760 -336981
17198 -336981 -290850 -437087 -331445 -285955 -77697 184629 143655 121112 31455 101681 -12906
17187a2906j14425l1590P054l5615j47032k8906L17121J41021j68318J43495O2184
17176A32083l3738k4411k679J47478j27075K7316l5819m9500L263O8054J35054
17165B40026j21193K6313K26771R4412j9839L5379j78055n403J31648k19152l86783
17154a75876k64269K01457J09846R6911q3638m08377J2810L15373n8777J19112
17144a35428J6417j72880j15445j08309j02256O8032L8291K38756J45127J83693
17134E5998j20960M5166L3112K00372j3118J3943r6902l20535l2688J91188j2874
17123e7298j86342K8962J15819j33154Q9939J46007K01795p6760j61631K42974
17113B10311P8569o044M4214p6120l71998n68445k28442K07197M19803K66682
$$ plain form
17187 -12906 -127331 -158921 -151867 -187482 -334514 -363420 -46299 94722 -73596 69899 132083
17176 132083 98345 73934 71255 218733 91658 118974 83155 33655 36918 104972 240026
17165 240026 118833 145146 371917 466329 446490 481869 303814 298411 430059 210907 -175876
17154 -175876 -440145 -238688 -128842 -31931 -115569 -523946 -511136 -195763 -254540 -135428
17144 -135428 -119011 -291891 -407336 -515645 -617901 -549869 -511578 -272822 -127695 55998
17134 55998 -64962 -19796 13316 213688 200570 214513 117611 -202924 -235612 -44424 -57298
17123 -57298 -243640 -214678 -98859 -232013 -142074 3933 205728 128968 -32663 210311
17113 210311 288880 282836 327050 250930 -121068 -689513 -917955 -710758 -290955 -24273
17103b4273j76127o4978Q1455R2464L12376k77658j72269R9409L07153K37212
17093D14764P4041l06494l37125P5485j10146L506J64774J39392J18446p755j98738
17082C0150l23261j04805P8787k8947J956J4793J56635o8562o5196l4979p6913
17071d20342J52650j36946K8464j01871p571L67787K60771K02541l370l31596
17061A0517m02794L10339J39666Q7607j4914l7467j87775j66474J10412J2086
17051a38797p6411J86111L128J69079K45648r2741j47542k5177R2781L5840K20086
17040D72005J00298k48601l04129l8797Q9458L55684O9476j03726l12217j07121
17030b7670J13303L49081l031m6831R920n7004k77392o1581O6079k24927N6595
$$ plain form
17103 -24273 -200400 -265378 -183923 -91459 220917 -56741 -229010 -129601 177552 414764
17093 414764 488805 182311 -154814 -79329 -189475 -185969 -21195 118197 236643 228888 30150
17082 30150 -293111 -397916 -319129 -348076 -346120 -331327 -174692 -243254 -308450 -343429 -420342
17071 -420342 -267692 -404638 -376174 -478045 -485616 -117829 142942 345483 342113 10517
17061 10517 -392277 -81938 57728 145335 130421 92954 -94821 -261295 -150883 -138797
17051 -138797 -215208 -29097 -25969 143110 388758 296017 148475 123298 216079 251919 472005
17040 472005 572303 323702 19573 -19224 70234 425918 495394 391668 79451 -27670
17030 -27670 85633 434714 431683 384852 394772 337768 60376 -1205 64874 -160053 -103458
17019a03458J19648L5158R6186M719j17406J29522k23238m6950M0482J28874j38599
17008g5062p5580j74567L04855L53514L0086l66375k66949K8615K31559J67957
16998A58053j60166J03018o9648M2002P098j55936L9789K69029j85883l81240
16988c33884L5100J01415k15533N750L86935R0892m0596j23902K34153K03647
16978C43977l00870k07722m2756R2134j37932R9807L80335Q346l0525l6690R5745
16967B63849j30825k20034j70284j40543K0419K67470K51183R4868J22679j98458
16957A60324j73671k4608J16551k89029j34481J92448K11290J1019l46171N3530
16947b22798N1703J7658j87700L90225R7848j1781j56604j85923j57019K46663
$$ plain form
17019 -103458 16190 51348 147534 152253 34847 164369 -58869 -105819 -65337 63537 -75062
17008 -75062 -150642 -325209 -20354 333160 363246 -3129 -270078 -241463 -9904 158053
16998 158053 -2113 100905 31257 73259 80357 -75579 -35790 233239 47356 -333884
16988 -333884 -298784 -197369 -412902 -407152 -20217 70675 30079 -93823 140330 343977
16978 343977 43107 -164615 -207371 -115237 -253169 -153362 226973 235319 204794 168104 263849
16967 263849 133024 -87010 -257294 -397837 -377418 -109948 141235 236103 358782 160324
16957 160324 -13347 -37955 78596 -210433 -344914 -152466 58824 69843 -276328 -222798
16947 -222798 -171095 -153437 -341137 49088 146936 135155 -21449 -207372 -364391 -117728
16937a17728L17831l0633J496P5767P8500L3005j18168n9481j7139j65913k86511
16926b88974K11587J96131K3269M1670k01268O3229J33498K5113m7900k66303
16916a09948J29176J39672K1869j39138J55253L73670j54617l52460q4832L33323
16906C11968K704l75322l23169J88953J10671N3132L26435L23017k25465n93201
16896b00277k15853K01171N0048J88974k44576j80697K1703K07342M0162K86286
16886A54283m7745k47749j68979J0642J12794k16911O0976j16310P5756J42159
16876b41084K61477J85661r8744K4878k00911N0730L50103J18378l95431j7824
16866C7233J67025j69337j42449n8497K75463R5220q2984k77167n282J31658K07630
$$ plain form
16937 -117728 200103 169470 170966 246733 325233 358238 240070 180589 163450 -2463 -288974
16926 -288974 -77387 118744 142013 183683 -17585 45644 179142 204255 156355 -109948
16916 -109948 19228 158900 180769 41631 196884 570554 415937 63477 -21355 311968
16906 311968 314672 -60650 -383819 -194866 -84195 -31063 295372 618389 392924 -200277
16896 -200277 -416130 -214959 -164911 24063 -220513 -401210 -379507 -172165 -132003 154283
16886 154283 106538 -141211 -310190 -299548 -186754 -403665 -342689 -458999 -383243 -241084
16876 -241084 20393 206054 107310 132188 -68723 -17993 332110 450488 55057 37233
16866 37233 204258 34921 -107528 -166025 109438 204658 121674 -155493 -160775 -29117 178513
16855A78513M3724k30650k18054K78664J39479m19868j61141L35107J75486k0634
16845A00626j24519j5981m4525k22444r4960M24775J88295k1315k5901l29173
16835a65122k51757K94493L2780l0032P9230O8020P280j22517K81720r047N0811
16824B35859J17953M1327k23773q6965j10533l14673J81697N84622l6268m82670
16814i3424n8185L29004L67055j8197k68028j97260j59421J71643q7548n0088
16804f4449j66738l34206J49972K06014k20512k76560K47074J18783K50158r9996
16794a90460k14271K68257J00491k53962k23583J40383k9550L6013J82638L38489
16784A54445m7457k32620j4456P3929m3729j424K1585j91894K3808K38566K15965
$$ plain form
16855 178513 222237 -8413 -226467 52197 191676 -228192 -389333 -54226 121260 100626
16845 100626 -23893 -39874 -84399 -306843 -401803 22972 211267 189952 164051 -165122
16835 -165122 -416879 -122386 -89606 -119638 -40408 27612 34892 -87625 194095 185048 235859
16824 235859 353812 395139 171366 84401 -26132 -340805 -159108 425514 389246 -93424
16814 -93424 -151609 177395 544450 526253 258225 60965 -98456 73187 -14361 -64449
16804 -64449 -231187 -565393 -415421 -209407 -429919 -706479 -459405 -340622 -90464 -190460
16794 -190460 -404731 -136474 -35983 -289945 -513528 -373145 -402695 -366682 -184044 154445
16784 154445 106988 -125632 -140088 -66159 -109888 -111312 -89727 -281621 -257813 -19247 196718
16773A96718j09509o8516Q3530N2789J24937M5520j58471k51223J50718q3248
16763a6755p3809o4940Q2622K48129j89519R145K75712p4340j90644Q5286q8548
16752B339k22277J69678J62564l59958R8489J29624J8677L47881K12564j70748
16742C88833j49013k3959m3936k42918J09787K47364J21762l53311k12685K5919
16732a32157M3737K71264Q7299r4741j21339J8754q4112k12042k45549k0522O628
16721d82780k38960M9489K96120Q6973n5195l1318M7088n5338N3407j29133J37327
16710c22320K47930J48132J03482n4563K17958K71271k47837j59010j35654J13104
16700A82493N1477J17464k54714j76322L59053J1716j30663m6900J32171k7370
$$ plain form
16773 196718 87209 18693 102223 155012 279949 325469 166998 -84225 66493 -16755
16763 -16755 -90564 -155504 -72882 175247 -14272 -5127 270585 196245 5601 90887 2339
16752 2339 -219938 -50260 112304 -247654 -149165 -19541 -864 347017 559581 388833
16742 388833 239820 215861 171925 -70993 38794 286158 407920 54609 -158076 -132157
16732 -132157 -88420 182844 270143 175402 54063 72817 -11295 -223337 -468886 -489408 -482780
16721 -482780 -721740 -672251 -376131 -289158 -344353 -375671 -328583 -383921 -330514 -459647 -322320
16710 -322320 -74390 73742 177224 122661 340619 611890 364053 205043 69389 182493
16700 182493 233970 351434 96720 -79602 279451 291167 160504 113604 245775 218405
16690B18405k96080r9780p4985N8299j07870K07794J78845L0033p293k05968k78637
16679c77237p1637J34834K31248j9155N3835M8046K23903J70813l29466R3022
16669A58206O9923k82181l19367J22889K27060j14179j75956L36150K52916j02828
16659A72633j06609R5039J2873q3644m4261J85699m2181J43608J7671m7716j07810
16648A95302L6479J99211l08539p6163k40814L61536J05716j76823k64362j20724
16638b89181r2779J5846J55427K4871j09627J21393N507j77375j43885j54031
16628f43834K11095J13332k16058k2574L50813m2049m1902J35269K15616J03675
16618A63383Q5466j07827j14013J24567J67910J94527J08667q0019l47040j59691
$$ plain form
16690 218405 -77675 -177455 -252440 -194141 -302011 -94217 84628 114661 107368 -98600 -377237
16679 -377237 -448874 -314040 -82792 -101947 -48112 -66 223837 394650 65184 158206
16669 158206 228129 -54052 -373419 -250530 -23470 -137649 -313605 22545 275461 172633
16659 172633 66024 161063 173936 90292 46031 231730 189549 333157 350828 303112 195302
16648 195302 231781 430992 122453 46290 -194524 167012 272728 95905 -168457 -289181
16638 -289181 -381960 -366114 -210687 -185816 -295443 -174050 -168543 -345918 -489803 -643834
16628 -643834 -432739 -319407 -535465 -558039 -207226 -249275 -291177 -155908 59708 163383
16618 163383 248849 141022 27009 151576 319486 514013 622680 542661 195621 35930
16608C5930j51621j1173K45682J989l29323Q4958p8019k59767K42767M5289j11149
16597b84437P4573J84510J19812P1563M4918R4452M3508l54986k1901j15l44541
16586c72644j19965K47038K77535N9570P5015n319l58865K7253O7357j44518l67393
16575f14936J32480K32402J04818l3646K08868J37980J59005l51832j99397K15940
16565h318K12413L4925j34659o8225J15643p6689j30399k23072l79861J74597
16555d83645J94072J05285J75757J41272k03558j96891k43687K28720M45037j44243
16545A8119j18185M1649J31678J02285l832k41391r0895L27890R8580M5424j52512
16534A58810J03786p1214j19310r9406q6093K15861J71772k35902k44684j31954
$$ plain form
16608 35930 -115691 -126864 118818 120807 -208516 -123558 -201577 -461344 -218577 -173288 -284437
16597 -284437 -209864 -25354 94458 166021 210939 305391 348899 -6087 -27988 -28103 -372644
16586 -372644 -492609 -245571 31964 91534 166549 161230 -197635 -170382 -103025 -247543 -614936
16575 -614936 -482456 -250054 -145236 -178882 29986 167966 326971 -24861 -224258 -8318
16565 -8318 204095 239020 104361 36136 151779 75090 -55309 -278381 -658242 -483645
16555 -483645 -289573 -184288 -8531 132741 -70817 -267708 -511395 -282675 162362 18119
16545 18119 -100066 -58417 73261 175546 171714 -69677 -160572 167318 265898 311322 158810
16534 158810 262596 191382 72072 -27334 -113427 102434 274206 38304 -206380 -338334
16524c38334J15568J86161L01258K27911j56572l81495k64076k9724K89055M3797
16514f451k65634o1821J54214J07302r5264K75033J17296k73245k55709j76653
16504d80932r397l7283M7244K26307j47801M3377Q6499N7663q8775l7117J4848
16493c25367p2037K10376P6452K44741k41984j96077r096L522J75773J06016r5353
16482a23034j00470J09676K2690o1997Q4712q1052o0129j71708R4559k5466L1654
16471b80565L67257K3443m73717M4118J59614L54929k71412k13870p8443M9133
16461c19513J60133K00087o6238K7243J65876j95134K18346N5290n4445j50883
16451D0762k84202j76295K11640j333k63778P0212J10023J34307j57724N6281
$$ plain form
16524 -338334 -222766 -36605 264653 492564 335992 -45503 -309579 -339303 -50248 -6451
16514 -6451 -272085 -333906 -179692 -72390 -167654 107379 224675 -48570 -304279 -480932
16504 -480932 -490329 -527612 -480368 -254061 -401862 -358485 -271986 -214323 -303098 -340215 -325367
16493 -325367 -397404 -187028 -110576 134165 -107819 -303896 -312992 -309470 -133697 -27681 -123034
16482 -123034 -223504 -113828 -91138 -153135 -68423 -149475 -209604 -381312 -286753 -312219 -280565
16471 -280565 86692 110135 -363582 -319464 -159850 195079 -76333 -290203 -368646 -319513
16461 -319513 -159380 40707 -25531 1712 167588 -27546 190800 246090 191645 40762
16451 40762 -243440 -419735 -208095 -209428 -473206 -402994 -292971 -158664 -316388 -260107
16441b60107O6796J32663R9176L4496J91812N4433j68754j11021K216O8299n7759
16430E2250P37R3092Q8940L904M0111O4474j23811J62027m799k41855j2101M4661
16418A67630J30974k84345j75946j62327L8955N3875j94849J06225L3873j0284
16408b96219M4592J96203M4329K17826M3731j91037k99446j30173r90K14090k2028
16397a79122k19307L45952Q9060k68998K97412K12354j35532j67436J95209J50914
16387C20506k55427M1930J68397L9340K54305k23100l67317p8053J13740J21569
16377A35890J65075L93283j27479n54064n43812j02055M00684K63224j69956l41960
16367d81170j97415L3914l4896K49185J89986J62657O1986K2172Q3995P8133j75690
$$ plain form
16441 -260107 -193311 -60648 38528 73024 264836 319269 150515 39494 41710 110009 52250
16430 52250 52987 146079 235019 238923 279034 343508 219697 381724 376925 135070 122969 167630
16418 167630 298604 14259 -161687 -324014 -285059 -231184 -426033 -319808 -285935 -296219
16408 -296219 -251627 -55424 -11095 206731 250462 59425 -240021 -370194 -371184 -157094 -179122
16397 -179122 -398429 -52477 36583 -232415 64997 277351 141819 -25617 169592 320506
16387 320506 65079 107009 275406 314746 569051 345951 -21366 -99419 14321 135890
16377 135890 300965 694248 566769 12705 -531107 -633162 -232478 30746 -139210 -481170
16367 -481170 -678585 -644671 -679567 -430382 -240396 -77739 -15753 6419 90414 168547 -7143
16356g143l11611Q9617K71957J76570O6375k31214q8999J22284K96762J90663
16346E75261l87991k28097r3936k46652k92448J02559J38360J07019L8497j24990
16336d12418P4858L02676L88655m1865k24791j31788j46611K52086M8216o0391
16326D8627l502O5591j2973p3696J80297K82457l3423p7699R4518j23014j00245
16315B46938o1706Q3233J79011j29964k33880q6188o5259J0514N3018j58811j82372
16304c45466k40004K23912K13349N581k06877K53866L05464j68705r260J1733
16294D3593j88177k9374L03852M12365k7128k56976m3513j45262j01348J07986
16284G6018N3487j21013l47670k59549J04568R3374P5519K12128k9638Q414m6971
$$ plain form
16356 -7143 -318754 -229137 42820 219390 285765 54551 -34448 87836 384598 575261
16346 575261 187270 -40827 -134763 -381415 -673863 -571304 -432944 -325925 -287428 -412418
16336 -412418 -337560 -34884 353771 311906 87115 -44673 -191284 60802 109018 48627
16326 48627 45125 110716 97743 24047 204344 486801 453378 375679 470197 347183 246938
16315 246938 185232 268465 447476 317512 83632 -2556 -67815 -57301 -4283 -163094 -345466
16304 -345466 -585470 -361558 -148209 -142628 -349505 -95639 209825 41120 31860 43593
16294 43593 -144584 -173958 129894 542259 515131 258155 214642 69380 -31968 76018
16284 76018 129505 8492 -339178 -598727 -494159 -400785 -325266 -113138 -142776 -134362 -181333
16273a81333J8643M7249K5017R281J4714K9788p5678K0107k5572N1634P8663j97676
16261a85163j30410O6552K18447o3253P7303N3250k84623K8122L38315j52699
16251c4159k37147j14899O7044j44631J77516M8927O6909L75606L9477l71869
16241a27226P1525P4978k40464j12140J34365K81359n772j33431L1820j48597
16231a73583k8305R9288J9723k36699j77908n613l05024K6459J62399L00269J70746
16220a48248j57220q4889N4646K27736L84596k3723l6402k5000k14299o5924J59676
16209G0949k54900j94642K521R7724J39808M1234k10917j95337J70302L665P3809
16198b55784j49724L29056M35578j76059l08612j30272O58M9973L24382l8173
$$ plain form
16273 -181333 -162690 -115441 -90424 -81143 -66429 -36641 -112319 -92212 -117784 -66150 12513 -185163
16261 -185163 -315573 -249021 -30574 -93827 -16524 36726 -247897 -219775 118540 -34159
16251 -34159 -271306 -386205 -319161 -463792 -286276 -237349 -170440 205166 244643 -127226
16241 -127226 -55701 19277 -221187 -333327 -198962 82397 76625 -56806 -24986 -173583
16231 -173583 -201888 -102600 -82877 -319576 -497484 -503097 -808121 -781662 -619263 -318994 -148248
16220 -148248 -305468 -390357 -335711 -107975 276621 252898 216496 191496 -22803 -88727 70949
16209 70949 -183951 -378593 -376072 -278348 -138540 -97306 -308223 -503560 -333258 -329593 -255784
16198 -255784 -405508 -76452 359126 183067 -125545 -255817 -255159 -205186 119196 81023
16188H1023k14201m52226o0069J53194k6896o346J90972j37904l7222p4299N0492
16177e33482L0244o4780k07263J46682M27531L04398O0982j16661K62073k9435
16167B80289n1957k00401m2531q4450j9069K70997r2982n8845j62805L43574K24191
16156D06011l90406j68725l7158J60539j04535Q6668K78500l7078l82863M1736
16146a47311j07752K632N1179K96970R9701k66819l7970N1580J1942r0114l4496
16135a70458j42622J2209P5419Q5453J51331Q7533J73449n275j50778M0829j23421
16124C3669j21934k25842J2658n2064J57346J25648J30419q4731J25560q6017
16114A4712k78683j56625K17151O7133p768J2130k27525P2664j4019J18027M17243
$$ plain form
16188 81023 -133178 -585404 -645473 -492279 -519175 -525521 -334549 -472453 -509675 -583974 -533482
16177 -533482 -503238 -568018 -775281 -628599 -201068 103330 164312 47651 309724 280289
16167 280289 228332 27931 -14600 -99050 -118119 152878 59896 1051 -161754 181820 406011
16156 406011 15605 -153120 -190278 -29739 -134274 -47606 230894 193816 -189047 -147311
16146 -147311 -255063 -252431 -201252 95718 195419 -71400 -109370 -57790 -45848 -135962 -170458
16135 -170458 -313080 -300871 -225452 -139999 11332 98865 272314 267039 116261 157090 33669
16124 33669 -88265 -314107 -301449 -353513 -196167 -70519 59900 -24831 100729 14712
16114 14712 -263971 -420596 -203445 -136312 -144080 -131950 -359475 -286811 -300830 -182803 234440
16103B34440J59317k96654r3428l5677k25941O6907Q3816j3906K17971N5827m6055
16092A06617K88754j20164m52373J3455J43855k3794j52637k08178J95447O3397
16082a45621J18937J16749J28756J13137N6431j55115j1074J37073p3385n7103
16072B28785n5842j15336k07776j56558J37580J65123j01594j74117K16911J83130
16062A20306N9200j0346k0985j09369k96592j02120p3683L59435J44757j68039
16052i7436J08411J17579j16473k01212J3536L90862K82986k77252j24463N4996
16042A51534j27703j73657p9956l5647K26403L29834j07817k5178k51098q2539
16032a75824J55872J25731j25734j46426J52115P0663m8869p6548j0282n8454
$$ plain form
16103 234440 393757 97103 3675 -32002 -257943 -191036 -107220 -121126 96845 152672 106617
16092 106617 395371 275207 -177166 -163711 -19856 -43650 -196287 -404465 -209018 -145621
16082 -145621 -26684 90065 218821 331958 388389 233274 222200 359273 285888 228785
16072 228785 172943 57607 -150169 -306727 -169147 -4024 -105618 -279735 -62824 120306
16062 120306 179506 169160 148175 38806 -257786 -359906 -433589 -74154 70603 -97436
16052 -97436 10975 128554 12081 -189131 -175595 215267 498253 221001 96538 151534
16042 151534 23831 -149826 -229782 -265429 -39026 290808 182991 157813 -93285 -175824
16032 -175824 -19952 105779 -19955 -166381 -14266 56397 7528 -69020 -79302 -137756
16022a37756K40165K98641K731j52562k10222k34447N1151J63675J0480M0238
16012G2094J38625J07526j08313j23808K3490N6694k6449N5402K817N7133J3846
16001B69057M3749o9425P3074O9628j37662k39113j11955q8371K6849K33537L12970
15990C82338J82765O4036n0440j76383k08286J19162j54613l64702J58020K07879
15980A59776K17200N166j31964j57995m35773J06194J91407L21795J76615O0346
15970E12767j07300k26530l95209j07301j36814J75736j6792j95111K86420m7167
15960b57301q0732n2478K4634L94694K15580R7038Q3120q64o7444m09961p7203
15949a30917l6117j39787j41240Q5737J86562P0916J58897J20023M5019L3012
$$ plain form
16022 -137756 102409 401050 403781 251219 40997 -193450 -142299 21376 31856 72094
16012 72094 210719 318245 209932 86124 109614 166308 139859 195261 198078 255211 269057
16001 269057 312806 243381 316455 386083 248421 9308 -102647 -191018 -164169 69368 382338
15990 382338 565103 629139 578699 402316 194030 313192 158579 -206123 -48103 159776
15980 159776 376976 382142 250178 92183 -343590 -237396 -45989 275806 452421 512767
15970 512767 405467 178937 -216272 -323573 -460387 -284651 -301443 -496554 -210134 -257301
15960 -257301 -338033 -390511 -365877 28817 244397 341435 424555 423691 356247 -53714 -130917
15949 -130917 -167034 -306821 -448061 -362324 -175762 -104846 54051 174074 219093 252105
15939B52105K71831m57373j92193R4571p8810J41350m7153M9840J61272n8020
15929A37420j48210l33916m6003J65245J6779o3849L45795P528k44876j13426
15919b77513o2154j72332j50443j3597J79966Q2424j60884j9213J53586L35276
15909a04884O9395m9392J21500K19511k95003k65489j16266K51955K30923K45731
15899C07981k8764k08684J49957J82288j65841m9662m00943R2454K19604J52371
15889B50761o0492l47649j55687K04455m0049j58082J00203M45677K86829r5670
15879D30296l65653k92358n5082L3737J35976j04630P316J39505P3866j70401
15869a67428J93404O4131r6105R0279K53457k23667L9430n4828r5764N420P7277
$$ plain form
15939 252105 523936 66563 -125630 -31059 -109869 31481 -15672 34168 195440 137420
15929 137420 -10790 -344706 -390709 -225464 -208685 -272534 73261 80789 -164087 -277513
15919 -277513 -339667 -511999 -662442 -676039 -496073 -413649 -574533 -593746 -440160 -104884
15909 -104884 -35489 -84881 36619 256130 -38873 -304362 -420628 -168673 62250 307981
15899 307981 279217 70533 220490 402778 236937 187275 -213668 -121214 98390 250761
15889 250761 190269 -157380 -313067 -108612 -148661 -306743 -206540 239137 525966 430296
15879 430296 64643 -227715 -282797 -249060 -113084 -217714 -210398 -70893 2973 -167428
15869 -167428 25976 90107 -5998 84281 337738 114071 153501 98673 2909 8329 85606
15858H5606K59451J15652q8244j94494o8739k54821N8263j20153j37051l19071
15848f63601K64375N70411n8302j60831J31945k6449j83234J35888L42609J27113
15838D79924j67570l85225O6676J18700l69615P6587J40934k5853K31852R356
15828A75766k3787O3442K0614j49971j57004r7568p4747R9434L23380L791j43360
15817C9990L6561J42032K80066N3030l6964k57237l53938q1495N7592k14556L6053
15806b98866q910J9956K25585J38752j43505j16814K43768K0143K1548L8820j74813
15795c4336J74707K6596k53893k07319J18750K555j59272N4465O7314K67151J32747
15784A89465j2764j48755j49802q9085N8577p0316k24907J15936K79057j67226
$$ plain form
15858 85606 345057 460709 372465 177971 109232 -145589 -87326 -207479 -344530 -663601
15848 -663601 -399226 171185 112883 -47948 83997 57548 -125686 10202 352811 479924
15838 479924 312354 -72871 -6195 112505 -257110 -180523 -39589 -65442 166410 175766
15828 175766 151979 215421 236035 86064 -70940 -168508 -243255 -143821 179559 183350 39990
15817 39990 76551 218583 498649 551679 514715 257478 -96460 -177955 -120363 -334919 -298866
15806 -298866 -307776 -287820 -62235 76517 -66988 -183802 59966 80109 101657 140477 -34336
15795 -34336 140371 166967 -86926 -294245 -175495 -172940 -332212 -277747 -210433 56718 189465
15784 189465 176701 27946 -121856 -210941 -152364 -222680 -447587 -331651 -52594 -219820
15774b19820j5024J25312j58343R3628K00125K37342M21243j82045l46063j51362
15764D993j18811m9453J2153Q2013j61623J12142m626J17709K01309j37949k27625
15753a69768k3692P4584K56398K22986j34220j67853l98006m0964J11447O2884
15743b06204j53455k07717o0550J30483j56944M0881L67323J66014J25626j37568
15733i2111m23L49943K36150j24588l40752l08914p8925p8261L36966L7629J18835
15722E5549J52783O8314j46137k12040N3935o4016J39416k02285l15466J20460
15712c49487K61700j3256j17279N9718N0783j43997l23710R6823J91280p8862
15702c66287J04938K77754N8100k8760m35662J44962Q7536j21374p2626k86772
$$ plain form
15774 -219820 -234844 -109532 -267875 -174247 25878 263220 684463 502418 156355 4993
15764 4993 -113818 -163271 -151118 -69105 -230728 -118586 -123212 -5503 195806 57857 -169768
15753 -169768 -193460 -118876 137522 360508 226288 58435 -339571 -380535 -269088 -206204
15743 -206204 -359659 -567376 -627926 -497443 -654387 -613506 -246183 -80169 45457 -92111
15733 -92111 -92534 257409 493559 368971 28219 -280695 -359620 -437881 -100915 -63286 55549
15722 55549 208332 276646 130509 -81531 -27596 -91612 47804 -154481 -469947 -349487
15712 -349487 -87787 -101043 -218322 -158604 -107821 -251818 -575528 -478705 -287425 -366287
15702 -366287 -261349 16405 74505 45745 -389917 -244955 -157419 -278793 -351419 -638191
15692f38191J12981L43779L6921k41318J22353J13523O9070R3815j81862j03906
15682b72835J25234O2281j06662J63649J89531Q7934l05430k26235N0215Q9966
15672a42352O7185k13990L021J1667J76460J99521J61531J02482k18920k08612
15662f2007l3050P8640j82371j65460J52800K08639K37642N7579l63174j36208
15652b06970q8583j14168j04643K21106K16464K40680k26028k84527q8682K41519
15642a93832L17127j9140l25732m0067K27955j12000K3551P265J54730K98569
15632C38426N0866k7494J44608k64229k32870k00876k56124j67154L79980J62895
15622g1972k6069L36955q5564j36710j15220N1857J54471r7844j48630J70571
$$ plain form
15692 -638191 -525210 -181431 -144510 -385828 -263475 -149952 -80882 12933 -168929 -272835
15682 -272835 -147601 -85320 -191982 -28333 161198 249132 -56298 -282533 -232318 -142352
15672 -142352 -75167 -289157 -286136 -274469 -98009 101512 263043 365525 146605 -62007
15662 -62007 -95057 -16417 -198788 -364248 -211448 -2809 234833 292412 -70762 -206970
15652 -206970 -295553 -409721 -514364 -293258 -76794 163886 -62142 -346669 -435351 -193832
15642 -193832 123295 104155 -221577 -261644 -33689 -145689 -122138 -114873 39857 338426
15632 338426 389292 361798 506406 242177 9307 -191569 -447693 -614847 -234867 -71972
15622 -71972 -98041 238914 153350 16640 -98580 -46723 107748 9904 -138726 31845
15612C1845j49181k60451J5732k4595J23929K91761N3338k08684l731J42907q8686
15601g5816j13564j41742K31928K91559J67075l2509k65423n9566J61964l5045
15591A28861n6329R5030L71413l2707l80041J85502J56692O7613L05143p7780
15581G63397j60632q3723j44598k30524m98901j60208J21272L5195J42652L61875
15571A45805l8713q9351J5326j60726j89927J23079J92968k28329j43201O3963
15561c09106K60355J14869l51436k61261L4767J67161L49924L2904j06229J59207
15551I1155K34993K95992j80990j63026J42086J36321O731j25350j19317k07255
15541A11340k37289J16194K15594J58413R0116J5460r3428J04909m1101j34204
$$ plain form
15612 31845 -117336 -377787 -362055 -386650 -262721 29040 82378 -126306 -130037 12870 -75816
15601 -75816 -189380 -331122 -99194 192365 359440 326931 61508 1942 163906 128861
15591 128861 72532 167562 538975 506268 126227 311729 468421 536034 841177 763397
15581 763397 602765 519042 374444 143920 -354981 -515189 -393917 -358722 -216070 145805
15571 145805 107092 17741 33067 -127659 -317586 -194507 -1539 -229868 -373069 -309106
15561 -309106 -48751 66118 -285318 -546579 -511812 -344651 5273 38177 -68052 91155
15551 91155 326148 622140 441150 278124 420210 556531 563262 437912 318595 111340
15541 111340 -125949 -9755 205839 364252 454368 469828 376400 481309 440208 306004
15531C06004j91167N8532j33170k27039Q422N5583M4143r7457k44370K89284J84885
15520E3650O3849j30208P4339N3035j8164k59979j50820L6637L31152N7815l34469
15509b23163r1649L57626J43572j30898k64326L6620J00077K25382j08226l06356
15499b61341j7606J06554o7759l3471J11175K28555P1848k66348J99777k1838
15489D9546n0418r262m8759q565K0945m1995J59340k9727J51121j37203j6064
15478C8959j3852q9404k64697j62855J53097R267P2555j22399p8790K3371P0398
15467c64350J17203Q6096K0072K92841j14899j27794J39303L2536j35277Q5293
15457C1024j9354l9510j88073N231j15834j13817K74611K51570K23573J32059
$$ plain form
15531 306004 114837 173369 40199 -186840 -178418 -122835 -78692 -176149 -420519 -131235 53650
15520 53650 117499 -12709 61630 114665 96501 -163478 -314298 -277661 53491 111306 -223163
15509 -223163 -314812 42814 186386 55488 -208838 -172218 -72141 153241 45015 -261341
15499 -261341 -278947 -172393 -240152 -273623 -162448 66107 137955 -128393 71384 49546
15489 49546 -872 -10134 -58893 -67458 -46513 -88508 70832 41105 192226 55023 38959
15478 38959 25107 -64297 -328994 -491849 -338752 -329485 -256930 -379329 -458119 -434748 -364350
15467 -364350 -247147 -161051 -140979 151862 36963 -90831 48472 81008 -54269 31024
15457 31024 11670 -27840 -215913 -210682 -326516 -440333 -165722 85848 309421 441480
15447D41480L02601j52308l29937j91732N0160k90426k1790J23724K19843k23418
15437g1803j07106K84931L18534N0332K3166j36175j23597j1784R9405N9754J48272
15426E33929j02751K4394Q068j34266m12424k69311n5743J09757K48909K15783
15416A66345J0105O5401k02311p0939J88990M5915j01219j93262j11395k20540
15406d22910J63080K39920p2343k14852J63241K08693J05382j6407p2259o1235
15396B0310j90915j80297j54394J60808K2712R3966J54354K71513P1000K3225
15386B92282l18163j83897Q6059M74760k43187k07243m3432n20971j36361N1760
15376g48393M44797M35773J16193n2732O0303j2479k48333r9672K66055K78303
$$ plain form
15447 441480 744081 591773 261836 70104 120264 -170162 -191952 -68228 151615 -71803
15437 -71803 -178909 106022 424556 474888 498054 361879 238282 226498 325903 385657 533929
15426 533929 431178 455572 463640 329374 -83050 -352361 -408104 -298347 -49438 166345
15416 166345 176450 241851 39540 -31399 157591 203506 102287 -90975 -202370 -422910
15406 -422910 -259830 -19910 -92253 -307105 -143864 64829 170211 153804 81545 20310
15396 20310 -170605 -350902 -505296 -344488 -321776 -227810 -73456 198057 269057 292282
15386 292282 -25881 -209778 -123719 351041 107854 -99389 -142821 -663792 -800153 -748393
15376 -748393 -303596 132177 248370 195638 255941 243462 -4871 -104543 161512 439815
15366D39815r811l2200j94902r5761j73674j09130k1078q4002j05845N4783j6955
15355c48760j82756P9264K70498J83810l1392j98921R8121J34916j20891l05893
15345d22004J25337M8995J30218j9024O2229k06863K5921M6909J79050M68638
15335D39406Q6446k99508k46813m4772q2112l0027K82543K630j57658m71M0420
15324i916l0470j416R8923J08309j75033k73369k12148N5332K0915Q5066J85208
15313a48599J90603J45684K5126k67909K1635Q211M2440k3552m9157J90683j93750
15302e8585p4364j05165o6217L46948J34588k03400K6781J96625J60098q1411
15292B75898J05532K921k54611l66982j67968L78728K37866m2914K1797M3799
$$ plain form
15366 439815 430004 397804 202902 107141 -66533 -175663 -196741 -280743 -386588 -331805 -348760
15355 -348760 -531516 -452252 -181754 2056 -29336 -228257 -130136 4780 -116111 -422004
15345 -422004 -296667 -247672 -117454 -136478 -74249 -281112 -255191 -208282 -29232 439406
15335 439406 525852 226344 -20469 -65241 -147353 -177380 105163 107793 -49865 -50336 -9916
15324 -9916 -40386 -41802 57121 165430 -9603 -282972 -495120 -439788 -418873 -333807 -148599
15313 -148599 42004 187688 212814 -55095 -33460 -25249 17191 -6361 -55518 135165 -58585
15302 -58585 -132949 -238114 -304331 42617 177205 -26195 586 197211 357309 275898
15292 275898 381430 384351 129740 -237242 -405210 -26482 211384 168470 190267 234066
15282B34066k58126k40532J93165N8092L4049r4540n6884J83942J90574k6843
15272B16963O8605j50318q3698j88951L8311j1327k88694J02112Q568P26m5630
15261c33333K98357K18372Q9738j30837K06322j71110k85722j6744l252l26528
15251d54737K62295J16556l0910p859j70848J52079J07967k068K14351J19636
15241C06462q4910l0997l12895k02183K6890Q2714m9244j38661j68441J28970
15231d42295J26586L48329K0346k3642R3423j27360J7698K26035M8567l50230
15221f2543j02669K28710R6687k40108m8559J2838m13737O28N35188m0755j030
15210c5350J21422J590J49284J10596O0195N8824n0182k43958n98680m5413J71066
$$ plain form
15282 234066 -24060 -264592 -71427 -13335 20714 -73826 -130710 53232 243806 216963
15272 216963 285568 135250 51552 -137399 -99088 -110415 -399109 -296997 -288429 -287703 -333333
15261 -333333 -34976 183396 273134 142297 348619 177509 -108213 -124957 -128209 -454737
15251 -454737 -192442 -75886 -106796 -114655 -285503 -133424 -25457 -27525 186826 306462
15241 306462 221552 190555 -122340 -324523 -297633 -214919 -264163 -402824 -571265 -442295
15231 -442295 -315709 32620 52966 29324 122747 -4613 13085 239120 287687 -62543
15221 -62543 -165212 63498 160185 -79923 -128482 -115644 -529381 -528753 6435 -34320 -35350
15210 -35350 86072 87662 236946 347542 407737 466561 416379 172421 -426259 -471672 -300606
15199c00606J37230K40890K15410l10352j66430j47093J67483K27305k50604l0663
15189b17430O8433M5166j38763n105O6993J42639L0617k03902j4588J00178L6879
15178h8883l7367J11416k6122L5787k84034J04862P2214k18208l6354m704k01027
15167e72420Q7588K93356K7204R7698J31423j1510m01291Q7782j1798J14320Q7955
15156f9693R6693m9189L9782j49970O3431K2159k33919k22006n7811J8476O3244
15145d78803J56394L01059Q0619o8623J68203J10582k05351j4956j75978j47195
15135b74049k9478J80385K62257K63611J1804k23674m8910K12280k26384l6306
15125I1536O1436l56013O9024J21235O8125j048J3509j9619J23976P4471J76476
$$ plain form
15199 -300606 -163376 77514 292924 -17428 -183858 -330951 -163468 63837 -186767 -217430
15189 -217430 -148997 -103831 -242594 -247699 -180706 -38067 -7450 -211352 -225940 -125762 -88883
15178 -88883 -126250 -14834 -40956 -5169 -289203 -184341 -112127 -330335 -366689 -371393 -572420
15167 -572420 -484832 -191476 -164272 -66574 64849 53339 -347952 -260170 -271968 -157648 -69693
15156 -69693 27000 -22189 17593 -132377 -68946 -46787 -280706 -502712 -560523 -542047 -478803
15145 -478803 -322409 -21350 59269 -9354 158849 269431 64080 49124 -126854 -274049
15135 -274049 -303527 -123142 139115 402726 414530 190856 141946 354226 127842 91536
15125 91536 152972 -203041 -134017 -12782 55343 54295 67804 48185 172161 246632 423108
15114D23108k00306j26518j35869n5337K33161j6962k87930Q6708l5086r0080
15104b05111k18942J38511O4534K27929K84112K65761m9275j64863m11276l59233
15094d27853Q0780P7891O5854R9128J17634L05K09380M8425j29543j50211j49081
15083a57291r1744K37070K53948q4884q3549N3362j62750j92990J06008K00546
15073G7726J51323k35248l48876N8477K17412j50896k83551R8249J23089J86714
15063a05581K63065J04931J22165j29513Q7984l4558j33041k01334Q1092O3179
15053A18389J71051o3541j87531J24469J60336l666j43399o9942O088j15836l1691
15042c5273k7918J70886Q2233j33631k05568Q6022K85038k72062k68804J20503
$$ plain form
15114 423108 222802 96284 -39585 -94922 138239 121277 -166653 -79945 -115031 -205111
15104 -205111 -424053 -285542 -221008 6921 291033 556794 507519 342656 -68620 -427853
15094 -427853 -347073 -269182 -203328 -104200 13434 13739 223119 271544 142001 -8210 -157291
15083 -157291 -249035 -11965 241983 157099 73550 126912 -35838 -228828 -122820 77726
15073 77726 229049 -6199 -355075 -296598 -79186 -230082 -513633 -415384 -292295 -105581
15063 -105581 157484 262415 384580 255067 343051 308493 175452 -25882 55210 118389
15053 118389 289440 225899 38368 162837 323173 319507 176108 106166 112254 -3582 -35273
15042 -35273 -63191 107695 189928 56297 -149271 -63249 221789 -50273 -319077 -198574
15032a98574M7436o230l6853l66283j50249J99850K34612K25305N4359P4742l4703
15021D3412m5803k57040j69466J60225M6272j336M65192n73J47235j09653j75238
15010A03227N550R8572p6047k26746j38265J14709K28955K8656j49730J69913
15000A58794j67673k55213p8257j1229J06706Q1929q2295M6821J24741K3006P6076
14989B3406j60098J16257L18107j66759j22964J21822Q9341K8387r2022m1194
14979A14283q5358p8741R3925J25312Q4720o5010M5420O7278q167j0225O8671
14968C52108O9158j54316k53024l2471J0398J74688l2616O1439M18188K71018
14958H84570l13192m15199o8269k23446R4653M3384l9951L35517j94919j77879
$$ plain form
15032 -198574 -151138 -157368 -194221 -560504 -710753 -510903 -276291 -50986 3373 78115 43412
15021 43412 -2391 -259431 -428897 -268672 -222400 -223736 241456 240883 388118 278465 103227
15010 103227 108777 207349 131302 -95444 -233709 -119000 109955 138611 -11119 158794
15000 158794 -8879 -264092 -342349 -353578 -246872 -164943 -247238 -200417 -75676 -52670 23406
14989 23406 -136692 -20435 297672 130913 7949 129771 219112 247499 155477 114283
14979 114283 28925 -49816 44109 169421 254141 189131 234551 301829 293662 283437 352108
14968 352108 421266 266950 13926 -18545 -8147 166541 133925 195364 613552 884570
14958 884570 571378 156179 87910 -135536 -40883 2501 -37450 298067 103148 -74731
14948g4731P7890L32000K9376J09410l8357j64389K074J27872o6056j84852m64
14937A49773J59759J19199O0019l18837K3701K30852j18361Q2016Q0200L6429
14927E04750K76065k55036m20196r5831N9279J56024K49456k51897k56131r5975
14917a29492O1726k20994o5704N09114J97410m1762q9697n0591l2990j12539j02471
14906g7990k00414P7809K29826n0594j49607j95363l07660l68732K29538M65548
14896c47639M64839q8255j64230J45321J91114r73k62187j12394K12402J6831
14886E4829j62104K3094J58321J61239j18031k81462k90676r7071N0136p9863
14876e81588Q3643j30664R260J48195J38189J29285L5778j53844L15599M61776
$$ plain form
14948 -74731 3159 335159 364535 473945 435588 271199 273273 401145 335089 150237 149773
14937 149773 309532 428731 488750 169913 193614 424466 306105 388121 468321 504750
14927 504750 780815 525779 105583 9752 69031 225055 474511 222614 -33517 -129492
14917 -129492 -67766 -288760 -354464 154650 352060 310298 220601 170010 137020 24481 -77990
14906 -77990 -278404 -200595 29231 -21363 -170970 -366333 -673993 -1042725 -813187 -347639
14896 -347639 117200 28945 -135285 10036 201150 200177 -62010 -174404 37998 54829
14886 54829 -107275 -84181 74140 235379 117348 -164114 -454790 -551861 -501725 -581588
14876 -581588 -497945 -628609 -619349 -471154 -332965 -203680 -167902 -321746 -6147 455629
14866D55629Q5882j91046l8389j06246k58140m65251k05180L23132K41918n2175
14856b09866l8517J41532J24149j106k06611j16041J43163J51388l8665j82139
14846b32713J17579M4550K7786r0452J28793j46797Q5783J63530r2210j86881
14836a81032K18648L12074k5765j65970j66147o1025O9845K2866j45494k14375
14826c36375j48027n695N16116j8811m25549k18175K70532L06439o7428n9064
14816a86037k50278j25114L11028K81937j54005R1142J14452m36088j51699j50280
14806f54942R7773N39788L93067J89907K55402r0809m75801k56352K3643M2854
14796F4530j8951k10698N6086k8137j09859K41442L69413J1433q0190k0866j02171
$$ plain form
14866 455629 541511 350465 312076 205830 -52310 -517561 -722741 -399609 -157691 -209866
14856 -209866 -248383 -106851 17298 16192 -190419 -306460 -163297 -11909 -50574 -232713
14846 -232713 -115134 -70584 -42798 -133250 -4457 -151254 -65471 98059 5849 -181032
14836 -181032 37616 349690 323925 157955 -8192 -69217 628 23494 -122000 -336375
14826 -336375 -484402 -490097 26019 7208 -418341 -636516 -365984 -59545 -126973 -186037
14816 -186037 -436315 -561429 -250401 31536 -122469 -31327 83125 -352963 -504662 -654942
14806 -654942 -557169 -17381 375686 565593 820995 730186 254385 -1967 21676 64530
14796 64530 45579 -165119 -109033 -137170 -247029 -5587 363826 375259 295069 274203 172032
14785A72032l41082q2766K42041j8226j04458q4583P655J95536j9795k8475k7447
14774h9568K01039J17180P3188l00747o3534J61746J46824q0490Q9851j22195
14764A33294k14276L59620K09169j44638j21330J3759j66556n3764K87574j24411
14754A78441k52875j97029Q1403K29520J7118J16757J25607k09134l16492K1405
14744b05279J85883M0329Q2671m1054L2920N0160K7519j68878Q0484K20063k36622
14733F8196k03732j21591M477P6172K10953l003K40619J37740Q5005m4004j41993
14722C08839k23931N9503l2640L497j42661l98065j20081j27199R1185K61804
14712c19749O9796K8025M3829j08543M51067J71520R2196j7521k48072k2472J06217
$$ plain form
14785 172032 -169050 -251816 -9775 -28001 -132459 -217042 -209387 -13851 -33646 -62121 -89568
14774 -89568 111471 228651 301839 1092 -62442 99304 246128 165638 255489 133294
14764 133294 -80982 278638 487807 343169 221839 235598 69042 15278 302852 178441
14754 178441 -74434 -271463 -190060 39460 56578 173335 298942 89808 -226684 -205279
14744 -205279 -19396 20933 103604 62550 95470 145630 173149 4271 84755 304818 68196
14733 68196 -135536 -257127 -252650 -176478 34475 31472 272091 409831 494836 450832 308839
14722 308839 84908 144411 111771 115268 -27393 -425458 -545539 -672738 -581553 -319749
14712 -319749 -249953 -221928 -178099 -286642 164425 335945 428141 410620 162548 140076 246293
14701B46293j43099k66573q3297K00396q3690j55328p1688j5643k0110J93001
14691a99738N0810k92274J65713n1763l79002k3310K33937J81924K11748J76984
14681G5029k80516l0130N9470R3646R3740j88120n4186J8424K04815j1914j93477
14670b13219j24652J5374J46624j67911K71087K0404k01743j87508J34559l3557
14660c40542J01577N44713K32433O696j97310n12613Q6277Q9664k38901j30034
14650c58040K845J19194L05495q2113j20038L1062Q473L46746m0531j1914r6007
14639A05172L098m420K26714L140o2174j04288j10179J11857K29835j62555k35060
14628A140k74299l27196p9658K42017L48502J9809J1104N6505l5455L9124j3740
$$ plain form
14701 246293 103194 -163379 -246676 -46280 -129970 -285298 -356986 -372629 -392739 -199738
14691 -199738 -148928 -441202 -275489 -327252 -706254 -729564 -495627 -313703 -101955 75029
14681 75029 -205487 -235617 -176147 -82501 11239 -176881 -231067 -212643 -7828 -19742 -213219
14670 -213219 -337871 -322497 -175873 -343784 -72697 -52293 -254036 -441544 -306985 -340542
14660 -340542 -238965 305748 538181 544877 347567 -165046 -78769 10895 -228006 -358040
14650 -358040 -355195 -236001 69494 -12619 -132657 -101595 -93122 253624 213093 201179 105172
14639 105172 108270 103850 330564 333704 271530 167242 57063 168920 398755 236200 1140
14628 1140 -273159 -600355 -680013 -437996 -89494 -69685 -58581 -2076 -37531 1593 -12147
14617a2147j17091J72478L26312P1711k37469m09329j36365j76295j89493J66807
14607e40881L7876J67560j4505L05017K70991J09402k86487j32981m5767p0891
14597b00666L37401K96663J05748K654l07261k59639o7212j57700r6408n7652
14587d04072J49449L09485j2088Q8278j06229j69249J89389L64090N9293l79296
14577H9050k26333K83447J09242q9616l97017O1392l7986r2042o6000o9138m8484
14566d83485J30322J70720K2128J82640m1794k4700R2142J59882L2403k49155
14556h897n4923k5815j10919K55964J91341j14248j83212K41674o338k24485k58414
14545b98272L5547Q2116j63828J51785J82687J93932K51277j49350k17841n7006
$$ plain form
14617 -12147 -129238 43240 369552 441263 203794 -205535 -341900 -518195 -707688 -540881
14607 -540881 -503005 -335445 -349950 -44933 226058 335460 48973 -84008 -129775 -200666
14597 -200666 136735 433398 539146 541800 234539 -25100 -92312 -250012 -346420 -404072
14587 -404072 -254623 54862 42774 131052 24823 -144426 44963 409053 468346 89050
14577 89050 -137283 146164 255406 165790 -231227 -169835 -207821 -299863 -365863 -435001 -483485
14566 -483485 -353163 -182443 -160315 22325 -19469 -44169 47973 207855 240258 -8897
14556 -8897 -63820 -89635 -200554 55410 246751 132503 -50709 190965 184627 -39858 -298272
14545 -298272 -262725 -180609 -344437 -192652 -9965 183967 435244 285894 68053 11047
14535A1047r8280K16524k6800k17673m2765o5367j34396K01694O3598J72790j50418
14524g0046J39013J54872j31612L2479j38609q0982J38365j59043J28501J02170
14514A15108j77305l89425k7691K08890J21872j31219p00L62624J01870k55343
14504g1319n34511m8061R3100K10105K00784J25923K91061Q812j49494J22114
14494B48514j17505j45220J37816q6678j10352J43545J36380j86968j02041J51748
14484F9239j12700j56824J78694L29208j34644j53630j87785p6970J69526N6525
14474a9361l08793q2789J93580N7315K03239J08884j09041j15479N1149J09376
14464H8080j56965l5649J00095J16090n1070k43657J16621q4050k00448K9771
$$ plain form
14535 11047 -87233 129291 102491 -115182 -157947 -223314 -357710 -156016 -92418 80372 -70046
14524 -70046 68967 223839 92227 124706 -13903 -94885 43480 -115563 12938 115108
14514 115108 -62197 -451622 -479313 -270423 -148551 -279770 -280470 82154 184024 -71319
14504 -71319 -605830 -653891 -560791 -350686 -149902 -23979 267082 275894 126400 248514
14494 248514 131009 -14211 123605 36927 -73425 70120 206500 19532 -82509 69239
14484 69239 -43461 -200285 -21591 307617 172973 19343 -168442 -245412 -75886 -19361
14474 -19361 -328154 -410943 -217363 -160048 43191 152075 43034 -72445 -21296 88080
14464 88080 -68885 -104534 -4439 111651 60581 -183076 -66455 -150505 -350953 -321182
14454c21182K62298J20018K16914J51358m1149n8797K18614J21182j63611l92488
14444A13157j7949J29911J06497J4053k04794J13659K01353Q9011j57454l10837
14434G6607m2502m9973k34008l710J73615M0973q9848L2079N7026j02935J35813
14423f863j41043N7673L60426o1028m00451j4888l116j27870J37780J46333J30947
14412G7900l4588k10339j11743j02371k40701k5989l2602K63155N70364J45963
14402B99049J71203m5556m34221k87855J44630K08410r6540j48498K287q6550
14392b73641k742J40397M834R0554k8904j68175J63323O9559J05263j54649J76043
14381A21862j21303P8040J08168k15020J12869K6605k36496k12586j81056k61976
$$ plain form
14454 -321182 -58884 61134 278048 429406 388257 329460 548074 669256 505645 113157
14444 113157 95208 225119 331616 345669 140875 254534 455887 544898 387444 76607
14434 76607 34105 -15868 -249876 -253586 -79971 -38998 -128846 -96767 -39741 -142676 -6863
14423 -6863 -147906 -90233 270193 209165 -191286 -206174 -209290 -337160 -199380 -53047 77900
14412 77900 43312 -167027 -278770 -381141 -621842 -647831 -680433 -417278 153086 299049
14402 299049 470252 424696 -9525 -297380 -152750 55660 -40880 -189378 -187091 -273641
14392 -273641 -276383 -135986 -131152 -40598 -69502 -237677 -74354 -4795 100468 -54181 121862
14381 121862 559 78599 186767 -28253 84616 111221 -125275 -337861 -518917 -780893
14371g80893q3771M39178M11173Q1225O8037k47856J65896j24587j05485R8468
14361g8615P0111N2039J10035j15285M010r3423p5770J79443K09289K96899K21847
14350G80580R633j08577l21440k85942j34380J45880J9237O9597J6702K51066
14340D42356J29565j59171l39666l71929j55715J89684J28606J43448L11184j33394
14330A84968J08159k71904k92852j50226J16796L50542K07384J81779j06383k26026
14320A02237m10181k6101q4433K22248j48606K24828K21138n8154j72632r9280
14310b28936l6472j31060q5027P421P5009K98214N4035n0123j15299j07467K85529
14299c4176J16266J67915j02345l33009j41222j65597K4037J46710m9405J2014
$$ plain form
14371 -780893 -864664 -425486 -14313 66912 134949 -112907 52989 -71598 -177083 -78615
14361 -78615 -8504 43535 153570 38285 42295 -51128 -126898 52545 261834 558733 780580
14350 780580 790213 681636 360196 74254 -60126 85754 104991 174588 191290 442356
14340 442356 571921 412750 73084 -298845 -454560 -264876 -136270 7178 318362 184968
14330 184968 293127 21223 -271629 -421855 -305059 45483 252867 434646 328263 102237
14320 102237 -307944 -334045 -418478 -196230 -344836 -120008 101130 42976 -129656 -228936
14310 -228936 -265408 -396468 -481495 -474074 -399065 -100851 -46816 -96939 -212238 -319705 -34176
14299 -34176 82090 250005 147660 -185349 -326571 -492168 -468131 -321421 -370826 -358812
14289c58812K6380N4215P0124k30370K85846J25585j53958J18114j9042k04226
14279b86144M0093N25052k9224k08984k84533l9348Q3658R9433J10864p4152m9478
14268a12763k79783Q4244M85093r8945k36335J66071p2309k92082l16029L30246
14258c42592J76896R3546j3218p2710m3429J71012J34256p6663P7821j79093j53350
14247b27524j03472k33550K93292P7361P3031o1077J7662J41326j88565R1748
14237a19768o5689j31594J06552O449q6112j6753l7214J64911P2349q4327K81831
14226I0635K43604l6982K029j21819l23274j77004J12326J71810j52053k58365
14216d49093q8758q0911K05728l0528k97063j14708L5378L1658M45778P3984j07882
$$ plain form
14289 -358812 -332432 -278217 -208093 -438463 -152617 -27032 -180990 -62876 -81918 -286144
14279 -286144 -246051 279001 249777 40793 -243740 -283088 -199430 -99997 10867 -63285 -112763
14268 -112763 -392546 -308302 176791 77846 -158489 7582 -64727 -356809 -672838 -342592
14258 -342592 -165696 -72150 -85368 -158078 -201507 -30495 103761 27098 104919 -74174 -227524
14247 -227524 -330996 -564546 -271254 -193893 -120862 -181939 -164277 -22951 -211516 -119768
14237 -119768 -185457 -317051 -210499 -204050 -290162 -306915 -344129 -179218 -106869 -191196 90635
14226 90635 334239 297257 299286 177467 -145807 -322811 -210485 -38675 -190728 -449093
14216 -449093 -537851 -618762 -413034 -443562 -740625 -855333 -819955 -788297 -342519 -268535 -376417
14205c76417k00710o9459K51231k7389K42266K04902P6443k65122j00804R7786
14195a67273J13771l12429K16214L20858k39801j42467j50134O2097N08237L13593
14185E22666l91943j1868K40940l5965j72759q4289q9750P3848Q1482R4586j373
14174B25575q239k72854l02224P8933J41446Q7409P4159J43838j66524k79600
14164b78081K29875J89933P7916j38045p0553J82221j1889k7245r9380k08386
14154a53634l9187J82183K67847L07454J41415o8107q5206q605j53179q9390j59901
14143A41690j66826j0298R6845K42475j520n14309o5099J26340n8102k19925o0754
14132d89483J30142K70272L34154j07922j10931p1644M2130J41589k00524p4732
$$ plain form
14205 -376417 -577127 -646586 -395355 -422744 -180478 24424 100867 -164255 -265059 -167273
14195 -167273 -53502 -365931 -149717 171141 -68660 -211127 -361261 -299164 209073 522666
14185 522666 130723 118855 359795 323830 151071 66782 -22968 50880 132362 226948 225575
14174 225575 217336 -55518 -357742 -278809 -137363 -49954 24205 168043 1519 -278081
14164 -278081 -48206 141727 219643 81598 11045 193266 181377 154132 54752 -153634
14154 -153634 -192821 -10638 257209 564663 706078 637971 552765 544160 390981 301591 141690
14143 141690 -25136 -35434 61411 303886 302366 -211943 -277042 -150702 -208804 -428729 -489483
14132 -489483 -359341 -89069 245085 137163 26232 -45412 -3282 138307 -62217 -136949
14122a36949N0077R082j4495j7539j67303j32596J43558N7750J08689j34254J77741
14111e6239K35501J88690j79014l0681o4141j13640J62974j7261N9105j36610
14101D8684j09923j22060J65268j79376j99072j82985L36787L24487J54004L1220
14091B67034J93113j58512m08877j52876R3140r8004R7134J43810n1512J84505
14081A08955Q7266K5031l17190k93873O152P3837N58181J93944k06426j08388
14071A27489k51465P0985m6708M0884J05349q1934n9577J6127p0345k16759j48596
14060e14550L0408j73760P7591M3859k367N54303K49287j55658q0865j91977j61321
14049c25050K9997L23716L01572j88131J2706R246M4077l02110j45371j8248K3496
$$ plain form
14122 -136949 -86872 -77790 -92285 -109824 -277127 -409723 -266165 -208415 -99726 -233980 -56239
14111 -56239 179262 367952 188938 158257 94116 -19524 143450 126189 185294 48684
14101 48684 -61239 -183299 -18031 -197407 -396479 -579464 -242677 81810 235814 267034
14091 267034 460147 301635 -107242 -260118 -166978 -264982 -167848 -24038 -75550 108955
14081 108955 196221 221252 -95938 -389811 -383659 -309822 248359 442303 235877 127489
14071 127489 -123976 -52991 -99699 -58815 46534 -35400 -94977 -78850 -149195 -365954 -514550
14060 -514550 -484142 -657902 -580311 -536452 -538819 15484 264771 109113 28248 -163729 -325050
14049 -325050 -295053 28663 330235 142104 154810 164056 208133 -93977 -239348 -257596 -234100
14038b34100J36515l2965j22313K50168k3290j73430n3006K92724J61094J66986
14028C68383j52486J87368Q8124Q5095k62562j36084J80802R0723k47756L6601
14018B38208K35086k8377p9995J01842p4906m60136j83528M2247J17456J16323
14008B4220O2212j83764n8854k82270j27129J4131K18381o0811J24840N01969
13998B32925K16017q5723k60841j83940J11404K5110r0863n8763k1925M2781K23822
13987A50004J2513r652k01607M7233L0326N4359j07815j1846J28439L13248O242
13976D11444k40697j56109N6748J25895j05083k91009q9485J06146J58757J20754
13966I7361P6547k09566o8714J93062r1478o8481k04082k8580K19816R4322k05877
$$ plain form
14038 -234100 -97585 -130550 -252863 -2695 -25985 -199415 -252421 40303 201397 368383
14028 368383 215897 403265 491389 576484 313922 177838 358640 449363 201607 238208
14018 238208 473294 444917 364922 466764 391858 -68278 -251806 -209559 -92103 24220
14008 24220 86432 -97332 -156186 -438456 -565585 -551454 -333073 -393884 -269044 232925
13998 232925 448942 363219 102378 -81562 29842 54952 -35911 -94674 -116599 -73818 150004
13987 150004 162517 152865 -48742 -1509 28817 83176 -24639 -36485 91954 405202 411444
13976 411444 170747 14638 71386 197281 92198 -198811 -288296 -182150 -23393 97361
13966 97361 173908 -35658 -104372 88690 -2788 -71269 -275351 -303931 -84115 10207 -195670
$$ [...]
##END NTUPLES=NMR SPECTRUM
##END=
