##TITLE=Analysis number 315236
Compound Code mo 00752
Project Code adrs
Chemist Name endeavour
##JCAMPDX= 6.0         $$ Bruker NMR JCAMP-DX V2.0
##DATA TYPE= NMR SPECTRUM
##DATA CLASS= NTUPLES
##ORIGIN= Bruker BioSpin GmbH
##OWNER= NMR
$$ XWIN-NMR		Version 3.5
$$ Wed Nov 16 13:13:59 2005 GMT Standard Time (UT+0h)  MAYBRIDGE\NMR@NMR_250MHZ
##.OBSERVE FREQUENCY= 250.131544655141
##.OBSERVE NUCLEUS= ^1H
##.ACQUISITION MODE= SIMULTANEOUS (DQD)
##.ACQUISITION SCHEME= undefined
##.AVERAGES= 16
##.DIGITISER RES= 18
##SPECTROMETER/DATA SYSTEM= dpx250
##.PULSE SEQUENCE= zg30
##.SOLVENT NAME= CDCl3
##.SHIFT REFERENCE= (INTERNAL, CDCl3, 0, 16.522)
##AUDIT TRAIL= $$ (NUMBER, WHEN, WHO, WHERE, WHAT)
$$ ##TITLE= Audit trail, XWIN-NMR		Version 3.5
$$ ##JCAMPDX= 5.01
$$ ##ORIGIN= Bruker BioSpin GmbH
$$ ##OWNER= NMR
$$ C:\u/data/dgb/nmr/ADRS/12460/pdata/1/auditp.txt
$$ ##AUDIT TRAIL=  $$ (NUMBER, WHEN, WHO, WHERE, WHAT)
(   1,<2005-11-16 13:13:38.09 +000>,<MAYBRIDGE\NMR>,<NMR_250MHZ>,
      <created by zg, POWCHK disabled, PULCHK disabled
       configuration hash MD5:
       62 19 C7 07 E1 42 D1 B7 37 6C 3D D0 77 39 F9 E6
       data hash MD5: 64K
       E4 84 7D C1 4B 67 12 DE 29 8B 13 48 17 7E 01 4C>)
(   2,<2005-11-16 13:13:49.56 +000>,<MAYBRIDGE\NMR>,<NMR_250MHZ>,
      <Start of raw data processing
       ef LB = 0.3 FT_mod = 6 PKNL = 1 SI = 32K 
       data hash MD5: 32K
       CC C6 5A AE E5 22 0D 63 30 B8 4C B9 89 55 7D 44>)
(   3,<2005-11-16 13:13:51.46 +000>,<MAYBRIDGE\NMR>,<NMR_250MHZ>,
      <apk 
       data hash MD5: 32K
       07 D4 7F 55 C2 D0 9C DA DA A0 99 2F 40 7B FB DE>)
(   4,<2005-11-16 13:13:52.20 +000>,<MAYBRIDGE\NMR>,<NMR_250MHZ>,
      <abs ABSG = 5 
       data hash MD5: 32K
       19 ED E6 CD DF A6 F4 71 32 96 E2 D7 1A 88 66 5A>)
$$ ##END=
$$ 
$$ hash MD5
$$ 10 F3 01 CC CF 9E B3 67 17 07 97 E3 69 C0 F3 AD
##$RELAX= 
##$RELAX= 
##$RELAX= 
##$RELAX= 
##$RELAX= 
##$RELAX= 
##$RELAX= 
$$ Bruker specific parameters
$$ --------------------------
##$DU= <C:\u>
##$EXPNO= 12460
##$NAME= <ADRS>
##$PROCNO= 1
##$TYPE= <nmr>
##$USER= <dgb>
##$AMP= (0..31)
100 100 100 100 100 100 100 100 100 100 100 100 100 100 100 100 100 100 
100 100 100 100 100 100 100 100 100 100 100 100 100 100 
##$AQSEQ= 0
##$AQ_mod= 3
##$AUNM= <au_zg>
##$AUTOPOS= <28 >
##$BF1= 250.13
##$BF2= 250.13
##$BF3= 250.13
##$BF4= 250.13
##$BF5= 500.13
##$BF6= 500.13
##$BF7= 500.13
##$BF8= 500.13
##$BYTORDA= 1
##$CFDGTYP= 0
##$CFRGTYP= 5
##$CHEMSTR= <none>
##$CNST= (0..31)
1 1 145 1 1 1 1 1 1 1 1 1 1 1 1 1 1 1 1 1 1 1 1 1 1 1 1 1 1 1 1 1 
##$CPDPRG= <>
##$CPDPRG1= <>
##$CPDPRG2= <>
##$CPDPRG3= <>
##$CPDPRG4= <mlev>
##$CPDPRG5= <mlev>
##$CPDPRG6= <mlev>
##$CPDPRG7= <mlev>
##$CPDPRG8= <mlev>
##$CPDPRGB= <>
##$CPDPRGT= <>
##$D= (0..31)
0 1 0 0 0 0 0 0 0 0.06 0 0 0 0 0 0 0.0002 0 0 0 0 0 0 0 0 0 0 0 0 0 0 
0 
##$DATE= 1132146817
##$DBL= (0..7)
120 120 120 120 120 120 120 120 
##$DBP= (0..7)
150 150 150 150 150 150 150 150 
##$DBP07= 0
##$DBPNAM0= <>
##$DBPNAM1= <>
##$DBPNAM2= <>
$$ [...]
##$SUBNAM7= <"">
##$SUBNAM8= <"">
##$SUBNAM9= <"">
##$SW= 20.6930455092707
##$SWIBOX= (0..15)
0 0 3 0 0 0 0 0 0 0 0 0 0 0 0 0 
##$SW_h= 5175.983436853
##$TD= 65536
##$TD0= 1
##$TE= 294.16
##$TE2= 300
##$TE3= 300
##$TEG= 300
##$TL= (0..7)
0 120 120 120 120 120 120 120 
##$TP= (0..7)
150 150 150 150 150 150 150 150 
##$TP07= 0
##$TPNAME0= <>
##$TPNAME1= <>
##$TPNAME2= <>
##$TPNAME3= <>
##$TPNAME4= <>
##$TPNAME5= <>
##$TPNAME6= <>
##$TPNAME7= <>
##$TPOAL= (0..7)
0.5 0.5 0.5 0.5 0.5 0.5 0.5 0.5 
##$TPOFFS= (0..7)
0 0 0 0 0 0 0 0 
##$TUNHIN= 0
##$TUNHOUT= 0
##$TUNXOUT= 0
##$USERA1= <user>
##$USERA2= <user>
##$USERA3= <user>
##$USERA4= <user>
##$USERA5= <user>
##$V9= 5
##$VALIST= <valist>
##$VCLIST= <CCCCCCCCCCCCCCC>
##$VD= 0
##$VDLIST= <DDDDDDDDDDDDDDD>
##$VPLIST= <PPPPPPPPPPPPPPP>
##$VTLIST= <TTTTTTTTTTTTTTT>
##$WBST= 1024
##$WBSW= 4
##$XGAIN= (0..3)
0 0 0 0 
##$XL= 0
##$YL= 0
##$YMAX_a= 238254
##$YMIN_a= -233407
##$ZGOPTNS= <>
##$ZL1= 120
##$ZL2= 120
##$ZL3= 120
##$ZL4= 120
##$ABSF1= 16.522
##$ABSF2= -4.171173
##$ABSG= 5
##$ABSL= 3
##$ALPHA= 0
##$AQORDER= 0
##$ASSFAC= 0
##$ASSFACI= 0
##$ASSFACX= 0
##$ASSWID= 0
##$AUNMP= <proc_1d>
##$AZFE= 0.1
##$AZFW= 0.1
##$BCFW= 0
##$BC_mod= 0
##$BYTORDP= 0
##$COROFFS= 0
##$CY= 12.5
##$DATMOD= 1
##$DC= 0
##$DFILT= <>
##$DTYPP= 0
##$F1P= 14.0000005364418
##$F2P= -0.99999901652339
##$FCOR= 0.5
##$FTSIZE= 32768
##$FT_mod= 6
##$GAMMA= 0
##$GB= 0
##$INTBC= 1
##$INTSCL= 1
##$ISEN= 128
##$LB= 0.3
##$LEV0= 0
##$LPBIN= 0
##$MAXI= 10000
##$MC2= 0
##$MEAN= 0
##$ME_mod= 0
##$MI= 0
##$NCOEF= 0
##$NC_proc= -4
##$NLEV= 6
##$NOISF1= 0
##$NOISF2= 0
##$NSP= 0
##$NTH_PI= 0
##$NZP= 0
##$OFFSET= 16.522
##$PC= 1
##$PHC0= 81.82836
##$PHC1= 15.17792
##$PH_mod= 1
##$PKNL= yes
##$PPARMOD= 0
##$PSCAL= 4
##$PSIGN= 0
##$REVERSE= no
##$SF= 250.13
##$SI= 32768
##$SIGF1= 0
##$SIGF2= 0
##$SINO= 400
##$SIOLD= 32768
##$SREGLST= <1H.CDCl3>
##$SSB= 0
##$STSI= 32768
##$STSR= 0
##$SW_p= 5175.98343685301
##$SYMM= 0
##$S_DEV= 0
##$TDeff= 65536
##$TDoff= 0
##$TI= <Analysis number 999999
Compound Code 99
Book Reference 9
Project Code 9>
##$TILT= no
##$TM1= 0
##$TM2= 0
##$TOPLEV= 0
##$USERP1= <user>
##$USERP2= <user>
##$USERP3= <user>
##$USERP4= <user>
##$USERP5= <user>
##$WDW= 1
##$XDIM= 32768
##$YMAX_p= 309288784
##$YMIN_p= -627062
$$ End of Bruker specific parameters
$$ ---------------------------------
##NTUPLES= NMR SPECTRUM
##VAR_NAME=  FREQUENCY,     SPECTRUM/REAL,   SPECTRUM/IMAG
##SYMBOL=    X,             R,               I
##VAR_TYPE=  INDEPENDENT,   DEPENDENT,       DEPENDENT
##VAR_FORM=  AFFN,          ASDF,            ASDF
##VAR_DIM=   32768,         32768,           32768
##UNITS=     HZ,            ARBITRARY UNITS, ARBITRARY UNITS
##FACTOR=    0.157963299565203, 1,           1
##FIRST=     4132.6476996994, 0,             0
##LAST=      -1043.33573715361, 0,           0
##MIN=       -1043.33573715361, -627062,     0
##MAX=       4132.6476996994, 309288784,     0
$$ Real data points
##PAGE= N=1
##DATA TABLE= (X++(R..R)), XYDATA
$$ [...]
25206a11257r6051J28142P7474o9592j5343J25463R5027j41235R6964M8122P1714
$$ -111257 -207308 -79166 -1692 -71284 -86627 38836 133863 -7372 89592 137714 209428
25195B09428R385M9140j66022l05907P1496j1920j55990j7366l5049J18534O9939
$$ 209428 218813 267953 101931 -203976 -132480 -144400 -300390 -317756 -352805 -234271 -164332
25184a64332O9254k9523k8476L1939N4516m106J61915K3601k78338K1565J32755
$$ -164332 -95078 -124601 -153077 -121138 -66622 -70728 91187 114788 -163550 -141985 -9230
25173i230K4483m538j7877M2151n9479l7224M5259j22046k24381j9714R0375J64337
$$ -9230 15253 10715 -7162 34989 -24490 -61714 -16455 -138501 -362882 -382596 -292221 -127884
25161a27884j80125j43369P2711j7916Q4579J74962m5910j15857R8956Q5365K2033
$$ -127884 -308009 -451378 -378667 -396583 -312004 -137042 -182952 -298809 -199853 -114488 -92455
25150i2455P2011j4220J6323P0978N4327r5793K1029K5650J1891j58802J57620
$$ -92455 -20444 -34664 -18341 52637 106964 11171 32200 57850 69741 -89061 68559
25139F8559k1720j19983m7833q1261P1371M4033l4381j4265M3347J22597l5658
$$ 68559 46839 -73144 -120977 -202238 -130867 -86834 -121215 -135480 -92133 30464 -5194
25128e194q2310k3895p3804l7556O6638J578N2190m8751k7741n8607N8170J15988
$$ -5194 -87504 -111399 -185203 -222759 -156121 -154543 -102353 -151104 -178845 -237452 -179282 -63294
25116f3294j1499J19605J11267p5665j25595k6102j49610p0636L086j31055l1821
$$ -63294 -74793 44812 156079 80414 -45181 -71283 -220893 -291529 -288443 -419498 -451319
25105d51319M1885J88285J06230n829J6170J44159J05993J13685p8997p3016J60979
$$ -451319 -409434 -221149 -114919 -120748 -104578 39581 145574 259259 180262 107246 268225
25094B68225m0411M7610j39173J5551J05753L3178j29935l1291L7135j31931r9744
$$ 268225 227814 275424 136251 151802 257555 290733 160798 129507 166642 34711 -65033
25083f5033J9319J03443N473j3240r4825o2317N0623R47j4164J5885P6333J96917
$$ -65033 -45714 57729 63202 49962 -44863 -107180 -56557 -55610 -69774 -53889 22444 219361
25071B19361J71028O1101M6732q5926j29481k3976J1337j22846j1743m3426j55562
$$ 219361 390389 451490 498222 412296 282815 258839 270176 147330 135587 92161 -63401
25060f3401j01852J35350P2631q6590P7475K1452r9049m8593N7220p0157J14228
$$ -63401 -165253 -29903 42728 -43862 33613 55065 -43984 -92577 -35357 -105514 8714
25049H714N9233j56195p0054p529K08782j29582j06796J54191L6447J5888O0012
$$ 8714 67947 -88248 -158302 -165831 42951 -86631 -193427 -39236 -2789 13099 73111
25038G3111M6507j00047p4069O3727q3984M0030K4657R2407J54281p779k56459
$$ 73111 119618 19571 -54498 9229 -74755 -34725 -10068 82339 236620 228841 -27618
25027b7618m6705R6135l4047P3348J79588J39957k18078q5133L2653p8739O4655
$$ -27618 -74323 21812 -12235 61113 240701 380658 162580 77447 110100 31361 96016
25016I6016p6714n3738p90q0222P8738N1672p2246j38218j14331L8290P4633J61212
$$ 96016 19302 -34436 -35226 -115448 -36710 14962 -57284 -195502 -309833 -271543 -196910 -35698
25004c5698M5451j46697Q5780J36431j15974l08647p9822o1017Q5706J68819J19952
$$ -35698 9753 -136944 -51164 85267 -30707 -339354 -419176 -480193 -394487 -225668 -105716
24993a05716O5316L366n6122J52959O9140Q5914q1048k563M5861o7259k05638
$$ -105716 -40400 -37034 -93156 59803 128943 214857 133809 131246 177107 109848 -95790
24982i5790k42401j23213R3687J95281J26210J0594p688j52460k9863O6630j2618
$$ -95790 -338191 -461404 -367717 -172436 -46226 -35632 -43320 -195780 -225643 -159013 -171631
24971a71631J4777J08590j02832j42571K5384J96726J48328j1870n9066J39768
$$ -171631 -156854 -48264 -151096 -293667 -268283 -71557 76771 64901 5835 145603
24961A45603J23843n5110p1977l6889j08940J3617j07775J71553Q1333J3756j61747
$$ 145603 269446 214336 142359 105470 -3470 10147 -97628 73925 155258 169014 7267
24950G267n6419R254n4525m9347R6723m5680N2999l3093N7878J26291J1479J07438
$$ 7267 -49152 -39898 -94423 -143770 -47047 -92727 -39728 -72821 -14943 111348 122827 230265
24938B30265q3401j35883k00284j59707J41429J1690k4032j0090K12618L8276
$$ 230265 146864 10981 -189303 -349010 -207581 -195891 -219923 -230013 -17395 20881
24928B0881J17558J03948k4463j39164k87811n3516P5987Q9880K5610M6079J03915
$$ 20881 138439 242387 217924 78760 -209051 -262567 -186580 -96700 -71090 -25011 78904
24917G8904J20213J10168K23899m9817m0812j34933k1924r3836j16749l3812O3139
$$ 78904 199117 309285 533184 483367 442555 307622 285698 191862 75113 41301 104440
24906A04440j07385j0572j17940m2257j8270J67351K05387J56178j53580j27372
$$ 104440 -2945 -13517 -131457 -173714 -191984 -24633 180754 336932 183352 55980
24896E5980N8169m2781l9921N9334l4358p5681K10758M159j37859J774q5656m3987
$$ 55980 114149 71368 31447 90781 56423 -19258 191500 195659 57800 59574 -26082 -70069
24884g0069J9674P1373J6737O9445K2410j58636L0770J58772j9191l4112j7693
$$ -70069 -50395 20978 37715 107160 129570 -29066 1704 160476 141285 107173 89480
24873H9480M258O1035O388j03483k29081j69042N9338J28816K16226K9613O674
$$ 89480 93738 154773 161161 57678 -171403 -340445 -281107 -152291 63935 93548 100222
24862A00222k159J16k2498J8007j40929J15536O9265j08872j88964m8286j01913
$$ 100222 98063 98179 75681 93688 -47241 68295 137560 28688 -160276 -208562 -310475
24851c10475O6923J03277O9259J14464K865n8870J16833p6274j29943O0479k70164
$$ -310475 -243552 -140275 -71016 43448 46313 -12557 104276 28002 -101941 -41462 -311626
24840c11626J761J14829K6328J82401n7147L9968o2435j36936J15357J21922o1639
$$ -311626 -309865 -195036 -168708 13693 -43454 -3486 -65921 -202857 -87500 34422 -27217
24829b7217L2143J48644l3613k27427P6833P8459M9148n8699L5136q4590k42654
$$ -27217 4926 153570 119957 -107470 -30637 47822 96970 38271 73407 -11183 -253837
24818b53837r575M833N2250L7252J09666Q1319q928M1659K3827p5759q8625J7651
$$ -253837 -263412 -258579 -206329 -169077 -59411 21908 12980 54639 78466 2707 -85918 -68267
24806f8267O8304O5371Q0496j17805J42577J26630L8794l8188P186j65742j84211
$$ -68267 37 65408 145904 28099 170676 297306 336100 297912 305098 139356 -44855
24795d4855l170M2208O7649L4430j66809j21627p7956J21015J81704k6677M4005
$$ -44855 -48025 -5817 61832 96262 -70547 -192174 -270130 -149115 32589 5912 49917
24784D9917n8310J2066R4022j67701m5400K68366J11381j23577r4748q7595j2706
$$ 49917 -8393 3673 97695 -70006 -115406 152960 264341 140764 46016 -41579 -54285
24773e4285j8133k0013L19849p1119j19287j59322Q156J09776m1351j85386O5264
$$ -54285 -72418 -92431 227418 156299 37012 -122310 -114154 -4378 -45729 -231115 -165851
24762a65851J61780K42445j92192l4267O8453r7597j12499q7115n4900l0166J7335
$$ -165851 -4071 238374 46182 11915 80368 -17229 -129728 -216843 -271743 -301909 -284574
24751b84574J09580L1390L8250M5015J09139K06593m5153k06378n3077k1840j00093
$$ -284574 -174994 -143604 -105354 -60339 48800 255393 210240 3862 -49215 -71055 -171148
24740a71148J44276J97967o1304k12284J21724J0347J7080R3871J62794Q247k9509
$$ -171148 -26872 171095 109791 -102493 19231 29578 46658 140529 303323 311570 282061
24729B82061K2967j61988j06654j38155K4590J29177l608j04315q9663J40575
$$ 282061 305028 143040 36386 -101769 -77179 51998 48390 -55925 -145588 -5013
24719e013J84145J04623p3492L5099j9723j7449q5975N2261N4247j30298j31498
$$ -5013 179132 283755 210263 245362 225639 208190 122215 174476 228723 98425 -33073
24708c3073n7486J14393r0277j08514j6822K66828R0135M4363J037o5594n4678
$$ -33073 -90559 23834 -66443 -174957 -191779 75049 165184 209547 210584 144990 90312
24697I0312k1504J30812J8499k7703j40427o7734K7949Q2514M3398j99626K0764
$$ 90312 68808 199620 218119 190416 49989 -17745 10204 92718 136116 -63510 -42746
24686d2746J93927M4145j13346j46853N8J9949N6514J60250J26520j68390r7434
$$ -42746 151181 195326 81980 -64873 -64815 -44866 11648 171898 298418 130028 32594
24675C2594j21636j32725J053Q2205J18756P5655K2310n0702m5019J33062m6641
$$ 32594 -89042 -221767 -220714 -138509 -19753 55902 78212 27510 -17509 115553 68912
24664F8912N5457l6235p1172K24920L7594k11345j6337O4457Q4856K5763j38416
$$ 68912 124369 88134 16962 241882 279476 68131 51794 116251 201107 226870 88454
24653H8454r2762P8869N1398l8560r0303o585J15419M7532J15772P7166o0171
$$ 88454 -4308 74561 125959 87399 -2904 -9489 105930 153462 269234 346400 286229
24642B86229o8376Q239j08382j89497j45634m1595J39111J92144o3129q7972L9455
$$ 286229 217853 226092 117710 -71787 -217421 -259016 -119905 72239 9110 -78862 -39407
24631c9407m1922L976N7712J70605K567j73797m2137J53451o2220j2798q5384
$$ -39407 -81329 -77353 -19641 150964 153531 -20266 -62403 91048 28828 16030 -69354
24620f9354K26235J34563o7166j83964q9163o0762r0489N1291k1542Q3860Q4794
$$ -69354 156881 291444 224278 40314 -48849 -109611 -200100 -148809 -170351 -86491 -1697
24609a697m1151r3733L6281J866q5146K5726M6675j25426n167K1119R8980K69920
$$ -1697 -42848 -136581 -100300 -98434 -183580 -157854 -111179 -236605 -241772 -220653 -121673 148247
24597A48247K01j95772q633O0485n3293R7683J50293J32330j9413k79651j09491
$$ 148247 148448 -47324 -55957 4528 -48765 48918 199211 331541 312128 32477 -77014
24586g7014n7692n6866O1330J28662l940j35606l1597M5784o1612O5813J21594
$$ -77014 -134706 -191572 -130242 -1580 -5520 -141126 -172723 -126939 -188551 -122738 -1144
24575a144J05082j97044j28824n5510J2146J03113L6314n9748K27847J40587j34382
$$ -1144 103938 -93106 -221930 -277440 -265294 -162181 -125867 -185615 42232 182819 48437
24564D8437j66968j5000p6942k5170N8455J11636M1218M5812m9613q6641j46751
$$ 48437 -118531 -133531 -210473 -235643 -177188 -65552 -24334 21478 -28135 -114776 -261527
24553b61527m4458J32658R9960j3836P6563j9572j20400R5934l6736L162J52523
$$ -261527 -305985 -173327 -73367 -87203 -10640 -30212 -150612 -54678 -91414 -88252 64271
24542F4271N0794k12247J5082K52066L9508k5102p3275l6378J630J0568m0386
$$ 64271 115065 -97182 -82100 169966 209474 184372 111097 74719 76349 86917 46531
24531D6531Q1753M711N474q0683m5966J13413j80531o5286J86222J43924M8041
$$ 46531 128284 132995 138469 57786 11820 125233 -55298 -120584 65638 209562 257603
24520B57603L5877j07238j23912j11808j5468K6029J6426j19604r7935l7019J87083
$$ 257603 293480 186242 62330 -49478 -64946 -38917 -22491 -142095 -240030 -277049 -89966
24509h9966J65704L5007k3678k0489O5209j5285q4421j86740J42420J62156k6035
$$ -89966 75738 110745 87067 66578 131787 116502 32081 -154659 -12239 149917 123882
24498A23882k3945j03060l3669j5312j78605P3596L6191j1898r6691m4333K07337
$$ 123882 99937 -3123 -36792 -52104 -230709 -157113 -120922 -132820 -229511 -273844 -66507
24487f6507O7219o8700K7971m2209q156N4163P4547J22530k284j34703k22503
$$ -66507 712 -67988 -40017 -82226 -90382 -36219 38328 160858 158574 23871 -198632
24476a98632k6745R3241J23417n8548j51941o6060O8223P1495P4916j33916k4533
$$ -198632 -225377 -132136 -8719 -67267 -219208 -285268 -217045 -145550 -70634 -204550 -229083
24465b29083j00692N6311j0228j02924M5708j16622R0358K29256J49075n8713
$$ -229083 -329775 -273464 -283692 -386616 -340908 -457530 -367172 -137916 11159 -47554
24455d7554Q3162J0542j64266J58552O2235m4803j40903J09836P1671m2250J26713
$$ -47554 35608 46150 -118116 40436 102671 57868 -83035 26801 98472 56222 182935
24444A82935J0882k51267q8297n5719Q3773m1200O0571J50372q2973p2o2884L3720
$$ 182935 193817 -57450 -145747 -201466 -117693 -158893 -98322 52050 -30923 -30995 -93879 -60159
24432f0159j0342r4807r0829N0654O2666Q9730Q6748j2710l2301J03025m6402
$$ -60159 -70501 -165308 -256137 -205483 -142817 -53087 33661 20951 -11350 91675 45273
24421D5273p5791o3604J132J0314J33254P1860J11050p2801j31505j42438J13880
$$ 45273 -30518 -94122 -92990 -82676 50578 122438 233488 160687 29182 -113256 624
24410F24K46697j37611l8023Q8243l2864N1443J04020N3265R6240j74882N5052
$$ 624 247321 109710 71687 159930 127066 178509 282529 335794 432034 257152 312204
24399C12204K476l45720k01102l899Q993M2359m4887n2824l3547J24875K4067
$$ 312204 314680 -31040 -232142 -236041 -227048 -184689 -229576 -282400 -315947 -191072 -167005
24388a67005M6386N3150K87440P9232j36134J12195r68k56092n9813J00787K20428
$$ -167005 -120619 -67469 219971 299203 163069 275264 274296 18204 -41609 59178 279606
24377B79606R1893j56066J5943O4176o1484o8310j12482P3224J09538j24690j00618
$$ 279606 371499 215433 231376 295552 234068 165758 53276 126500 236038 111348 10730
24366A0730q2892Q6115K56930r6826j18003M6234J37471O6727j80846n5116P7840
$$ 10730 -72162 13953 270883 174057 56054 102288 239759 306486 125640 70524 148364
24355A48364P8995J11339j72074j07657j378O6125n302j59344j70100J48052j6437
$$ 148364 227359 338698 166624 58967 57589 123714 118412 -40932 -211032 -62980 -79417
24344g9417n5248m3120L134J52609J49172O4363J22642P6508j52138k09153n9909
$$ -79417 -134665 -177785 -174651 -22042 127130 191493 314135 390643 238505 29352 -30557
24333c0557l6212l8067M0048R4294N6735J1197p8105j43946N3052M0367J75001
$$ -30557 -66769 -104836 -64788 29506 86241 97438 19333 -124613 -71561 -31194 143807
24322A43807j48762m1310N9938r8817j83937n2697N2213J12558J59030J09048
$$ 143807 -4955 -46265 13673 -85144 -269081 -321778 -269565 -157007 2023 111071
24312A11071j37816o3881j9385o7384m387J88893L9496j9774r7093K3989J61772
$$ 111071 -26745 -90626 -110011 -177395 -181782 7111 46607 26833 -70260 -46271 115501
24301A15501o70j5579k3316k9085J45202r4772p3964p4143p255o1374m3900n3196
$$ 115501 114831 99252 75936 46851 192053 97281 23317 -50826 -58081 -119455 -163355 -216551
24289b16551M2050n9659N1894j9588k502P5282J32047l3547Q9310J44294r3955
$$ -216551 -174501 -234160 -182266 -201854 -204356 -129074 2973 -30574 58736 203030 109075
24278A09075J18458R9021j43878p3599m2340p0046J15934L8640J58078N9727q0297
$$ 109075 227533 326554 182676 109077 66737 -3309 112625 151265 309343 369070 288773
24267B88773p1829j98753k6721J26034j42518j6036r6147r9573M1369J14958p058
$$ 288773 216944 18191 -8530 117504 -25014 -41050 -137197 -236770 -195401 -80443 -87501
24256h7501n8450L4987l1971n1803J41981j5301q6960o8967J64665J66022J66986
$$ -87501 -145951 -110964 -142935 -194738 -52757 -68058 -155018 -223985 -59320 106702 273688
24245B73688j11836k30748o3806P5254Q8578k9745p4134m8965P5343J23824J78444
$$ 273688 161852 -68896 -132702 -57448 31130 1385 -72749 -121714 -46371 77453 255897
24234B55897J47035q4721r139m2572j59285o9693K40912j450L7433j6699l7266
$$ 255897 402932 318211 309072 266500 107215 37522 278434 276984 314417 297718 260452
24223B60452j23268j49287j09689K68267J755j63728L6877O9873j77870k0047
$$ 260452 137184 -12103 -121792 146475 148230 -15498 21379 91252 -86618 -106665
24213a06665J88622j2132j36922J214o0342N2174M5456k3669j33240L8065k1594
$$ -106665 81957 69825 -67097 -65883 -126225 -74051 -28595 -52264 -185504 -147439 -169033
24202a69033J62658L9610j57608r4276j09098K2475m0871m6584M3740J55661K06291
$$ -169033 -6375 33235 -124373 -218649 -327747 -305272 -346143 -392727 -348987 -193326 12965
24191A2965K0371j63411o8797R487L27359K01897P6979l24531l18436J08326q7799
$$ 12965 33336 -130075 -198872 -189385 137974 339871 416850 92319 -226117 -117791 -205590
24180b05590k0972m4591j15728K12452Q6352p5214l0473J53108Q0471r7159l5244
$$ -205590 -226562 -271153 -386881 -174429 -88077 -163291 -193764 -40656 39815 -57344 -92588
24169i2588n5733O7213K3432j180l4289j8763N3202K17129m1865m2059j27731
$$ -92588 -148321 -81108 -57676 -58856 -93145 -111908 -58706 158423 116558 74499 -53232
24158e3232j84812p7720P0598K13026R6999k30269j01589J50053R8550o0527J46544
$$ -53232 -238044 -315764 -245166 -32140 64859 -165410 -266999 -116946 -18396 -78923 67621
24147F7621R5539j95397j76784N3799l5557J12628J49454J4834q37L5212K821
$$ 67621 163160 -32237 -209021 -155222 -190779 -78151 71303 86137 85300 120512 123333
24136A23333q0052J2564N4620n4659P4142J27930J43760l7882j0962j28218l8806
$$ 123333 43281 55845 110465 55806 129948 257878 401638 363756 352794 224576 185770
24125A85770j01917p7418J27956l5658j40106P7713Q3700r4860J2973L1686o7996
$$ 185770 83853 6435 134391 98733 -41373 36340 120040 25180 38153 69839 1843
24114A843N5414j41327N834N7142j03552p8259K74366J55985r8193j15671P7461
$$ 1843 57257 -84070 -78236 -21094 -124646 -202905 71461 227446 129253 13582 91043
24103I1043R8436N8945o8397j75561k07899J02108J88967K5987j49805o4501m115
$$ 91043 189479 248424 180027 4466 -203433 -101325 87642 113629 -36176 -100677 -104792
24092a04792L9390J05865m9019k01881K0612K08572L125k4281m0728N0707M5016
$$ -104792 -65402 40463 -8556 -210437 -189825 18747 21872 -2409 -43137 7570 52586
24081E2586J6658J6412q2688j37949j70593m4085n6726R9917O3933P391k9201
$$ 52586 69244 85656 2968 -134981 -305574 -349659 -406385 -306468 -242535 -235144 -264345
24070b64345j77726J42114J72605l860J59193L3876j9270M0629K5895j96336N65
$$ -264345 -442071 -299957 -127352 -131212 27981 61857 42587 83216 109111 -87225 -86660
24059h6660m4421l770q9449J6996M6819K07371J94506o5338o0116o7417Q5604
$$ -86660 -131081 -134851 -224300 -207304 -160485 46886 241392 176054 115938 48521 134125
24048A34125p5563l9531K11737M6259j31028P6376K0437j20072k8706j05040j87586
$$ 134125 58562 19031 230768 277027 145999 222375 242812 122740 94034 -11006 -198592
24037a98592n1515L09527L09985R9535j74546J0391j12359j54545j23019m8940
$$ -198592 -250107 59420 369405 468940 294394 304785 192426 37881 -85138 -134078
24027a34078p7159L3675J40222N0702j15166J06399J61836k9203p1026q6519P6826
$$ -134078 -211237 -177562 -37340 13362 -101804 4595 166431 137228 66202 -20317 56509
24016E6509N7107R7429Q6988l7216j15018j39154l4777j04123N1044K0384N9878
$$ 56509 113616 211045 298033 260817 145799 6645 -28132 -132255 -81211 -60827 -949
24005i49J3390o6870m331j07917M9543J41143J38R2451P2844J41393l463k02750
$$ -949 12441 -54429 -58760 -166677 -117134 24009 24147 116598 189442 330835 327372 124622
23993A24622r2883P2467j77009j00035J03648J53544j18284p3265r2699O6159
$$ 124622 31739 104206 -72803 -172838 -69190 84354 -33930 -107195 -199894 -133735
23983a33735K35501k6547k04473k2042k2501n7971o5860M9263J41743j80334k9710
$$ -133735 101766 75219 -129254 -151296 -173797 -231768 -297628 -248365 -106622 -286956 -316666
23972c16666R0987k4214j38434P6718J45917R8527j9983J23555J81959J21167
$$ -316666 -225679 -249893 -388327 -311609 -165692 -67165 -87148 36407 218366 339533
23962C39533O6805k43862j17402o7995M2176J5883P6399p7744R744n4899j4155
$$ 339533 406338 162476 45074 -22921 19255 35138 111537 33793 43537 -11362 -25517
23951b5517j14314o4246K6315n846k5109J00612l9412M398K4315O3696J4176k6671
$$ -25517 -139831 -204077 -177762 -183608 -208717 -108105 -147517 -143119 -118804 -55108 -40932 -67603
23939f7603q3264q7959J74658K35582j039N5495p5798j68001j04855N1274j00316
$$ -67603 -150867 -238826 -64168 171414 170375 225870 150072 -17929 -122784 -71510 -171826
23928a71826l7638m3674J494L4035R2378J14839M80J0958J44058j63486j57345
$$ -171826 -209464 -253138 -251644 -217609 -125231 -10392 -9912 1046 145104 -18382 -175727
23917a75727k8179J47682M3573m820R0559P1989k02607o4651J51480m5063j26718
$$ -175727 -203906 -56224 -12651 -17471 73088 145077 -57530 -122181 29299 -15764 -142482
23906a42482N5814J15400K21361L16346l9343l06744l29234j83877J06996J14065
$$ -142482 -86668 28732 250093 566439 527096 220352 -108882 -292759 -185763 -71698
23896g1698q2546N0019J08681q9450k5643L8747n8718M4111Q8392m8014o1442
$$ -71698 -154244 -104225 4456 -84994 -110637 -71890 -130608 -86497 1895 -46119 -107561
23885a07561Q3496K5740o4702n7244k5977J24082n4938Q7029l7705p9276j9670
$$ -107561 -24065 1675 -63027 -120271 -146248 -22166 -77104 9925 -27780 -107056 -126726
23874a26726J02461J44475k4893o0799J02698q5584M9966N2918O0516j794n9545
$$ -126726 -24265 120210 95317 34518 137216 51632 101598 154516 215032 213238 153693
23863A53693J34864j9102q5847J8370L9768m5138o6661q611J1868R4013l3271
$$ 153693 288557 269455 183608 201978 241746 196608 129947 121336 133204 227217 193946
23852A93946m3553J5058r3260k4021j00816o1870K5423J5183j41852O0125N8951
$$ 193946 150393 165451 72191 48170 -52646 -114516 -89093 -73910 -215762 -155637 -96686
23841i6686o0890m0749j07018Q1854J08102J54805P2535j31695n4733J9519L1741
$$ -96686 -157576 -198325 -305343 -223489 -115387 39418 111953 -19742 -74475 -54956 -23215
23830b3215L6482J6767J64096J0543j9655j08584k10456j73830m3340J07066K31346
$$ -23215 13267 30034 194130 204673 185018 76434 -134022 -307852 -351192 -244126 -12780
23819a2780q5810J84890K88302O0533j25293j18628j4251o2444j77754p1430O9608
$$ -12780 -98590 86300 374602 435135 309842 191214 176963 114519 -63235 -134665 -65057
23808f5057J00072j46024M7883k690K4670j1209P8224N2964o9006J50735K6515
$$ -65057 35015 -111009 -63126 -65816 -41146 -52355 25869 78833 9827 160562 187077
23797A87077k9589j43468l3121M7728j23682J35290Q6347j37322R5343M634j30384
$$ 187077 157488 14020 -19101 28627 -95055 40235 126582 -10740 84603 89237 -41147
23786d1147J26935J44836k1044m1507j32657K00315K6639j89314o1893l5898r095
$$ -41147 85788 230624 209580 168073 35416 235731 262370 73056 11163 -24735 -33830
23775c3830q3192j5902P368L9562l2864m2825J59885J09349l9511O305K4037j18543
$$ -33830 -117022 -132924 -125556 -85994 -118858 -161683 -1798 107551 68040 74345 98382 -20161
23763b0161j66036j23956J34659J46570Q745j07528l1530J47003J19537J47145
$$ -20161 -186197 -310153 -175494 -28924 -20179 -127707 -159237 -12234 107303 254448
23753B54448J24484n4176j79149l547k04469j06389J8780M8390P2500p7233l7328
$$ 254448 378932 324756 145607 142060 -62409 -168798 -150018 -101628 -29128 -106361 -143689
23742a43689J83512N4948m2987j09024j5485k590j34702J06690J64004M7056j92678
$$ -143689 39823 94771 51784 -57240 -72725 -75315 -210017 -103327 60677 107733 -84945
23731h4945j14904j00884q4882J21462R7678R2807N1212k6313p3601j11985J13373
$$ -84945 -199849 -300733 -385615 -264153 -166475 -73668 -22456 -48769 -122370 -234355 -120982
23720a20982P7587p3737j07573r261K14896l0116Q1478n5180n9491l5515j12103
$$ -120982 -43395 -117132 -224705 -233966 -19070 -49186 32292 -22888 -82379 -117894 -229997
23709b29997Q3442N3566R6480J3765J2369o2612j66903k02254K05681J83417J656
$$ -229997 -146555 -92989 3491 17256 29625 -32987 -199890 -402144 -196463 -13046 -11390
23698a1390p9650J03900K3076j56138j48818J70504L1092J16828j01147p8214
$$ -11390 -91040 12860 35936 -120202 -269020 -98516 -67424 49404 -51743 -129957
23688a29957p8555p211J91980k2294m3671j9634n3145L9642Q6241J30912j72315
$$ -129957 -208512 -215723 -23743 -46037 -89708 -109342 -162487 -122845 -36604 94308 -78007
23677g8007k41487j333J55425J77685J54324r898r9584j01021Q3285j0931m7913
$$ -78007 -319494 -320827 -165402 12283 166607 156709 57125 -43896 39389 28458 -19455
23666a9455k3541j5596q8631o6898K6186k6789L7529M344N3430J17500Q3598o1053
$$ -19455 -42996 -58592 -147223 -214121 -187935 -214724 -177195 -172851 -119421 -1921 81677 20624
23654B0624n3070n8155n8065q8162j4854j52583n6000K05900J46673L5987J67183
$$ 20624 -32446 -90601 -148666 -236828 -251682 -404265 -460265 -254365 -107692 -71705 95478
23643I5478P7002j13007p628Q4832n4762k09512L5354J30279l6956m4569M0939
$$ 95478 172480 59473 51845 136677 81915 -127597 -92243 38036 1080 -43489 -2550
23632b550j52320j92831O6201J31040R2220M777k6559j98526n4620O2478J28653
$$ -2550 -154870 -347701 -281500 -150460 -58240 -53463 -80022 -278548 -333168 -270690 -142037
23621a42037P2780J79953K0402j70262O7426R5304J854j17323K7923J34559p8663
$$ -142037 -69257 110696 131098 -39164 28262 123566 125420 8097 36020 170579 91916
23610I1916k46913l8236J8034R4674o0925L4690J10086L8946j10694n706M9723
$$ 91916 -154997 -193233 -175199 -80525 -141450 -106760 3326 42272 -68422 -74128 -24405
23599b4405j13929J15566P9034m5428J28865o0019j84263p405j43208M964J33958
$$ -24405 -138334 -22768 56266 10838 139703 79684 -104579 -111984 -255192 -250228 -116270
23588a16270Q4328q1253j03311J11845Q6212k09693o6574J02350O0631J29690
$$ -116270 -31942 -113195 -216506 -104661 -18449 -228142 -294716 -192366 -131735 -2045
23578b045J94899P1608j54249j43367m8565o3132K2239k1038J75648J07749k4227
$$ -2045 192854 264462 110213 -33154 -81719 -144851 -122612 -143650 31998 139747 115520
23567A15520q2271j29231l0529R0695l9482k8502l5171J2035J05319n7080m3208
$$ 115520 33249 -95982 -126511 -35816 -75298 -103800 -138971 -126936 -21617 -78697 -121905
23556a21905N8680Q9051N3540J4020K2398L6623j14478J50244P7904j35713j0620
$$ -121905 -63225 25826 79366 93386 115784 152407 37929 188173 266077 130364 119744
23545A19744q0571j04006M5444L6670Q1235M5644j06966J01945J69864J4228O9820
$$ 119744 39173 -64833 -19389 17281 98516 144160 37194 139139 309003 323231 393051
23534C93051j6082J1957k16011L4837K1354J03170r4387o3488j46315o1510O0842
$$ 393051 376969 388926 172915 207752 229106 332276 237889 174401 28086 -33424 27418
23523B7418P9698k60434j54637O4397P7503M7784q076k3692r8360Q355r1800l0971
$$ 27418 107116 -153318 -307955 -243558 -166055 -118271 -126347 -150039 -248399 -240044 -331844 -362815
23511c62815M83O4012M7583K17566J04049O5067K8976o8507j07489r3464P4076
$$ -362815 -362332 -298320 -250737 -33171 70878 135945 164921 96414 -11075 -104539 -30463
23500c0463k7343l1805N7984N7169n6554P1948k6172r8632l9473k4848Q9568J35648
$$ -30463 -57806 -89611 -31627 25542 -31012 40936 14764 -83868 -123341 -148189 -58621 77027
23488G7027J63561M7951k08503q9277L3101j57552j65054N2112M7394R9023o044
$$ 77027 240588 288539 80036 -9241 23860 -133692 -298746 -246634 -199240 -100217 -106261
23477a06261J13816P2876p233p3248k14197J76150j7775j39271M8839o6763j51772
$$ -106261 7555 80431 73198 -50 -214247 -38097 -55872 -195143 -146304 -213067 -364839
23466c64839n598L5181p8150J87442l2950m3567n1836J14644J34055n1624j27470
$$ -364839 -370437 -335256 -413406 -225964 -258914 -302481 -354317 -239673 -105618 -157242 -284712
23455b84712m6134J3097J31360N8810k51525O558M1073J06683K89672Q0677n0529
$$ -284712 -330846 -317749 -186389 -127579 -379104 -372546 -331473 -224790 64882 145559 95030
23444I5030n3438k14951l00217j00754J25642L33121M6030o588J41038K37375
$$ 95030 41592 -173359 -473576 -574330 -448688 -115567 -69537 -76125 64913 302288
23434C02288J84401m6668k66155n6741N0937k64135K7762K2541K08487J1873q7794
$$ 302288 486689 440021 173866 117125 168062 -96073 -68311 -45770 162717 174590 86796
23423H6796j08912j74328J20876J25988j5881j1099J58504o4026j75121q8935
$$ 86796 -22116 -196444 -75568 50420 34539 23440 181944 117918 -57203 -146138
23413a46138l3204K6550J20925j6153n5142J19624j1677q7587K3173K09152Q9760
$$ -146138 -179342 -152792 -31867 -48020 -103162 16462 4785 -82802 -59629 149523 239283
23402B39283R909k43699j29267J850O1407j7873K0082J00393j00138J28119J05840
$$ 239283 249192 5493 -123774 -121924 -60517 -78390 -58308 42085 -58053 70066 175906
23391A75906K5848r2886o5331o7231m8703J381p6273K4381j549m9610k0843L1347
$$ 175906 201754 108868 43537 -23694 -72397 -71016 -147289 -122908 -124457 -174067 -194910 -163563
23379a63563J20461J30224l9014k5771K3410q5409p50j37789j51023J5281j1251
$$ -163563 -43102 87122 48108 22337 45747 -39662 -40412 -178201 -329224 -313943 -325194
23368c25194O3838K72098J69607m338k47032n1224J20407q6106m0473J07107J83768
$$ -325194 -261356 10742 180349 176011 -71021 -122245 -1838 -87944 -128417 -21310 162458
23357A62458j42682k3799L8010J51465p8314p0439K4509o8732r6822P9459J07420
$$ 162458 19776 -4023 33987 185452 107138 36699 61208 -7524 -104346 -24887 82533
23346H2533j15079O0761j3152j36015J72063P0740k96J66737Q434j39130j02040
$$ 82533 -32546 28215 15063 -120952 51111 121851 121555 288292 296726 157596 55556
23335E5556j18592r6950R4901J52988L6299n0080m7606j38942j2499p5888J22701
$$ 55556 -63036 -159986 -65085 87903 124202 74122 26516 -112426 -124925 -200813 -78112
23324g8112J11751K2047J21001n1309k9182j72957L8296J6917K79168l8981m9177
$$ -78112 33639 55686 176687 125378 96196 -76761 -38465 -21548 257620 218639 169462
23313A69462N7932o5364j18707J66940p2263J9192P4557p8259K996l4862j02814
$$ 169462 227394 162030 43323 210263 138000 157192 231749 153490 156486 121624 18810
23302A8810j23675r4440J579R0040J14974r7086P1074L5339J21239J30170m8872
$$ 18810 -104865 -199305 -197726 -107686 7288 -89798 -18724 16615 137854 268024 219152
23291B19152j84059j48742m8211m7041p7269J42067o8309M0961K8441J03629p5938
$$ 219152 35093 -113649 -161860 -208901 -286170 -144103 -212412 -171451 -143010 -39381 -115319
23280a15319P1799K39964n0511k54744p0723J74509j12266J091l4081J14930J64052
$$ -115319 -43520 196444 145933 -108811 -179534 -5025 -117291 -116200 -150281 -35351 128701
23269A28701j47455p5707N0504J61348J81582J04364J242j5568j34273o4267N2415
$$ 128701 -18754 -94461 -43957 117391 298973 403337 404579 389011 254738 190471 242886
23258B42886q5440k3374j40187O4922M7254o4285j73815j59124n2417o5526R7239
$$ 242886 157446 134072 -6115 58807 106061 41776 -132039 -291163 -343580 -409106 -311867
23247c11867Q4584n0209R4981O0117J05930O1871j0372J10407M5940J57j15220
$$ -311867 -227283 -277492 -182511 -122394 -16464 45407 35035 145442 191382 191539 76319
23236G6319n2925J42869K2246J05406r4319k23096k20864q02J38207J98274j01184
$$ 76319 23394 166263 188509 293915 199596 -23500 -244364 -245166 -106959 91315 -9869
23225i869j18509K1197J18288Q4531j243l2964q8081K5279j8431j46990r5303
$$ -9869 -128378 -107181 11107 95638 94395 61431 -26650 -1371 -19802 -166792 -262095
23214b62095j06255P5384J45918P8361J22212L14693L7864k453j78381q6062j59782
$$ -262095 -368350 -292966 -147048 -68687 53525 368218 406082 403629 225248 139186 -20596
23203b0596r0732R5135k6794k34926L6556N5983M251K0988M4498q5422j68985
$$ -20596 -111328 -16193 -42987 -277913 -241357 -185374 -181123 -160135 -115637 -201059 -370044
23192c70044P7675K09753J26165J17801l0513O0421j21854p1197k5502Q569J32257
$$ -370044 -292369 -82616 43549 161350 130837 191258 69404 -1793 -27295 -18726 113531
23181A13531j7917K1109l4913j06381j38863J41630R9111J84114O7985j53507
$$ 113531 95614 116723 81810 -24571 -163434 -21804 77307 261421 329406 175899
23171A75899j14754j3220k5899j27076j12720j9311L6324j48203J8690J67873
$$ 175899 61145 47925 22026 -105050 -217770 -237081 -200757 -348960 -330270 -162397
23161a62397j814l6782O5276J6942p0013Q8931N9316p6285K9169k4788j8292M3526
$$ -162397 -164211 -200993 -135717 -118775 -188788 -99857 -40541 -116826 -87657 -112445 -130737 -87211
23149h7211P1688o290j9556n0272j56717O5202K40384J62994P9984j14794j40687
$$ -87211 -15523 -21813 -41369 -91641 -248358 -183156 57228 220222 300206 185412 44725
23138D4725j20460o0694L7200p2917p8774J13645K06214r2173K0674P2905M1804
$$ 44725 -75735 -136429 -99229 -172146 -250920 -137275 68939 -23234 -2560 70345 112149
23127A12149r3411j36192n9067k7360k0051k09176n566J24283Q3819K20434M8307
$$ 112149 18738 -117454 -176521 -203881 -223932 -433108 -438674 -314391 -230572 -10138 38169
23116C8169j56656J09009l7559N9400J48444k0201l8342O9704L3902p9161q463
$$ 38169 -118487 -9478 -47037 12363 160807 140606 102264 171968 205870 126709 118246
23105A18246j25269k2759p9950j2376p9927q8500Q3123L4696J24339O6622j09558
$$ 118246 -7023 -29782 -109732 -122108 -202035 -290535 -207412 -172716 -48377 18245 -91313
23094i1313r0716j7838Q1518q8752p9574k1868m2734q6332J78182K3199J90822
$$ -91313 -182029 -199867 -118349 -207101 -286675 -308543 -351277 -437609 -259427 -236228 -45406
23083d5406N3480J88223M0408j24998O5093k1331k08464j6622j48750L6894n060
$$ -45406 8074 196297 236705 111707 176800 155469 -52995 -69617 -218367 -181473 -186533
23072a86533O2269j7497r4041n3425J37002K23302p0453o5989o9359K2738M7293
$$ -186533 -124264 -141761 -235802 -289227 -152225 71077 624 -65365 -134724 -111986 -64693
23061f4693J16777n4058p3387j53736P2319J38315J75534J23100l7315j30005
$$ -64693 52084 -1974 -75361 -229097 -156778 -18463 157071 280171 242856 112851
23051A12851q0631j17919j33529J37885J12180J081L4828K978j46301m6162K15236
$$ 112851 32220 -85699 -219228 -81343 30837 31918 66746 69724 -76577 -122739 92497
23040I2497O0500m3732l2277m9492j26561r3001j79221o67K9361M5009O0117p0348
$$ 92497 152997 109265 76988 27496 -99065 -192066 -371287 -371954 -342593 -297584 -237467 -307815
23028c07815R8706r7164j8248P4817J02906R1274k2909K04394K35016L0704j70901
$$ -307815 -209109 -306273 -324521 -249704 -146798 -55524 -78433 125961 360977 391681 220780
23017B20780j9760J1132r9636j6018n9670k16756L8618Q1078j64721j75156l6425
$$ 220780 201020 212152 112516 96498 36828 -179928 -141310 -60232 -224953 -400109 -436534
23006d36534K01054J94365Q9258p6947K5526k3802N1631J6652k6585L586o2553
$$ -436534 -235480 -41115 48143 -28804 -3278 -27080 24551 41203 14618 18204 -44349
22995d4349j54682J46643N6069j33763o5193N1650n2592k7242O1052J23320r3642
$$ -44349 -199031 -52388 3681 -130082 -195275 -143625 -196217 -223459 -162407 -39087 -132729
22984a32729n5204l6720K5118L506L8862q258K0797M1572P3l1588j179K5839J2460
$$ -132729 -187933 -224653 -199535 -196029 -157167 -165425 -144628 -103056 -102983 -134571 -135750 -109911 -97451
22971i7451N1894J49372j489Q4392l1880J3828o1706r9263j18584j56504j08024
$$ -97451 -45557 103815 102326 186718 154838 168666 106960 7697 -110887 -267391 -375415
22960c75415K01343K23669j46461p5750O8313k418o5953J00715K06842p7076n5845
$$ -375415 -174072 49597 -96864 -172614 -104301 -106719 -172672 -71957 134885 57809 1964
22949A964l4246J32832L9728N8319L4171j70420J4802J84192j7827o9214j00518
$$ 1964 -32282 100550 140278 198597 232768 62348 77150 261342 243515 174301 73783
22938G3783J6765n0544M3902j14312N9289M1653j3001J12700j18774o7816L6011
$$ 73783 90548 40004 83906 -30406 28883 70536 57535 170235 51461 -16355 19656
22927A9656J68164m5001k42495r0898M9803k8396J69524M0810j12373n3202M0726
$$ 19656 187820 142819 -99676 -190574 -140771 -169167 357 41167 -71206 -124408 -83682
22916h3682L8271k4219m5832j34183J9075K16891J57793p2323o5857j24575N3874
$$ -83682 -45411 -69630 -115462 -249645 -230570 -13679 144114 71791 5934 -118641 -64767
22905f4767J62806J84676j11418n4364l4359k71905L4492J3016j29165j92957
$$ -64767 98039 282715 171297 116933 82574 -189331 -154839 -141823 -270988 -463945
22895d63945K21285J22911k391K67477K43518p563q3875o3624j16353j47248n9326
$$ -463945 -242660 -119749 -122140 145337 388855 381292 297417 233793 117440 -29808 -89134
22884h9134R550M410j0377q464K4974j18677R372j3703K4594J3377O3415N7248
$$ -89134 -79584 -75174 -85551 -94015 -69041 -187718 -178346 -192049 -167455 -154078 -90663 -33415
22872c3415q0730j19620M8585J40334J479K4232K6585K02616J7718j71449k48993
$$ -33415 -114145 -233765 -185180 -44846 -43367 -19135 7450 210066 227784 56335 -192658
22861a92658J1064J39244M3323r3731j63422l3646K2327J32150N0186Q8516O5179
$$ -192658 -181594 -42350 973 -92758 -256180 -289826 -267499 -135349 -85163 3353 68532
22850F8532m6426L1360M4672p1726N0478o8082l1604M8230R7914J04812j14746
$$ 68532 22106 53466 98138 26412 76890 8808 -22796 25434 123348 228160 113414
22839A13414n7051J14327p6812m3952m6447p7936j5780n343p1580N290P3853L0217
$$ 113414 56363 170690 93878 49926 3479 -74457 -90237 -95580 -167160 -161870 -88017 -57800
22827e7800J34129j01592j76909O2436Q9753k68838j59317J42519K28151Q2796
$$ -57800 76329 -25263 -202172 -139736 -49983 -318821 -478138 -335619 -107468 -24672
22817b4672j04479l8869J59686n2728n5345K17702J46346n4423j39630J05431
$$ -24672 -129151 -168020 -8334 -61062 -116407 101295 247641 193218 53588 159019
22807A59019j14153j87087j13564j2527N3394J65218J28753l1008j30060j16849
$$ 159019 44866 -142221 -255785 -268312 -214918 -49700 79053 48045 -82015 -198864
22797a98864m0747J55815R1573N4571n928m7342K1261q6876j36275n7551K3535
$$ -198864 -239611 -83796 7777 62348 56420 9078 30339 -56537 -192812 -250363 -226828
22786b26828m4167J78956n5729m1825J37748k4679j3189K3872O1779N6894p0755
$$ -226828 -270995 -92039 -147768 -189593 -51845 -76524 -89713 -65841 -4062 52832 -17923
22775a7923q0976p1284N6771J27520j62005j92708K16504J76028J23410j35724
$$ -17923 -98899 -170183 -113412 14108 -147897 -340605 -124101 51927 175337 39613
22765C9613k05386J04806J46510p6468j63999q898o009j4267J81449q0911j33913
$$ 39613 -165773 -60967 85543 9075 -154924 -163822 -169831 -184098 -2649 -83560 -217473
22754b17473k19932P8350J86030M9475P4233l3646K9475p0087Q9574j6413r7092
$$ -217473 -437405 -359055 -173025 -123550 -49317 -82963 -53488 -123575 -34001 -50414 -147506
22743a47506Q0685J87314J84163j08823k18314j58248J58160J55352j25198n5955
$$ -147506 -66821 120493 304656 195833 -22481 -180729 -22569 132783 7585 -48370
22733d8370Q9946M4595j7262m4959j06081j0594m8962j31262L2781R7598J58543
$$ -48370 41576 86171 68909 23950 -82131 -92725 -141687 -272949 -240168 -142570 15973
22722A5973j49052j1281M874J88372J85724K9901k7897R3158j49787o6279j96263
$$ 15973 -133079 -144360 -139486 48886 234610 264511 236614 329772 179985 113706 -82557
22711h2557L2685M1161n3290N8148J46727J33604P708j76399P0797k8763k7026
$$ -82557 -49872 -8711 -62001 -3853 142874 276478 284186 107787 178584 149821 122795
22700A22795k02481K6275q9304j99855N8090J69504n593l0224n7187o7979m1550
$$ 122795 -79686 -53411 -142715 -342570 -284480 -114976 -120569 -150793 -207980 -275959 -317509
22689c17509o3992O4056J81761M0138K2184J63807J1073j61902k06994Q2440m5329
$$ -317509 -381501 -317445 -135684 -95546 -73362 90445 101518 -60384 -267378 -184938 -230267
22678b30267r8511K37228J08674J25339k9724j44927J24402q1663j41491K1652
$$ -230267 -328778 -91550 17124 142463 112739 -32188 92214 10551 -130940 -109288
22668a09288J4828P7418O7988r1911o5987Q3795P9843r640j603P5723l4331L4211
$$ -109288 -94460 -17042 50946 -40965 -106952 -23157 56686 47046 45443 121166 86835 121046
22656A21046Q5924q9077m4931N2039O3519P9846k3256M225j65175j03783L4633
$$ 121046 206970 117893 72962 125001 188520 268366 245110 249335 84160 -19623 15010
22645A5010j08861M0427J08343p2719J26766M5894j2487j21872j6471m7670n9123
$$ 15010 -93851 -53424 54919 -17800 108966 154860 142373 20501 4030 -43640 -102763
22634a02763n2857J42237j30975k3899N1229o0366o1449j2673Q4901P8567l617
$$ -102763 -155620 -13383 -144358 -168257 -117028 -177394 -238843 -251516 -166615 -88048 -91665
22623i1665p392R4869o0142K7183n8170k4716O6604p7521j350j27771R1875L0217
$$ -91665 -99057 -4188 -64330 -37147 -95317 -120033 -53429 -130950 -132300 -260071 -168196 -137979
22611a37979L8853J59967l4647l5800l6851j72834J18987L3757l2304J31690q7856
$$ -137979 -99126 60841 26194 -9606 -46457 -219291 -100304 -66547 -98851 32839 -55017
22600e5017j32815R98j1072p0152L0242K37373J11293P0632n2629J21686m0374
$$ -55017 -187832 -186834 -197906 -268058 -237816 -443 110850 181482 128853 250539 210165
22589B10165k24245J67107J7506j4049k51820j63749J75770J91053M9373L4811
$$ 210165 -14080 153027 170533 156484 -95336 -259085 -83315 107738 157111 191922
22579A91922N7042j99663q5813R8225m1449M6358P4379O8562j0552p0438p9057
$$ 191922 248964 49301 -36512 61713 20264 66622 141001 209563 199011 128573 49516
22568D9516k04308K6679P8299m6478j09839O1597R0800J84142n4285L9851m8423
$$ 49516 -154792 -128113 -49814 -96292 -206131 -144534 -53734 130408 76123 115974 67551
22557F7551j78935J32400M4302k6907p1530J44690N5756j33450P438j44192O9676
$$ 67551 -111384 21016 65318 38411 -33119 111571 167327 33877 41315 -102877 -33201
22546c3201K76804J11678j31077j40698N5017j06417q5857p9450K08121O384J28229
$$ -33201 243603 355281 224204 83506 138523 32106 -53751 -133201 74920 81304 209533
22535B09533R1178j34680j43915j63869r954J44539o2692J9418O1043l5552j95001
$$ 209533 300711 166031 22116 -141753 -151707 -7168 -69860 -50442 10601 -24951 -219952
22524b19952q9245P7038R1035P5714N9849M0676m6923J705p0480j04614J05615
$$ -219952 -309197 -232159 -141124 -65410 -5561 35115 -11808 -10103 -80583 -185197 -79582
22513g9582K2466J90064R9524r0135j97153k29149J13941N0990J27226J65059
$$ -79582 -57116 132948 232472 142337 -54816 -283965 -170024 -119034 8192 173251
22503A73251L0760j26946j56950J04059Q8298J12871o9999m8285M8203K148j54156
$$ 173251 204011 77065 -79885 24174 112472 225343 155344 107059 155262 157410 3254
22492C254j12366R1834L5062j30973r1624O5848J69427O6193J39408Q2214j38160
$$ 3254 -109112 -17278 17784 -113189 -204813 -138965 30462 96655 236063 318277 180117
22481A80117q2004j02337k2702K8246M9347K9847j0380r5575o258j51777r0349
$$ 180117 98113 -4224 -26926 1320 50667 80514 70134 -25441 -31699 -183476 -273825
22470b73825O5056O9023k7290K23594K00096M6962q2545l15011j90171J2763Q1211
$$ -273825 -208769 -139746 -167036 56558 256654 303616 221071 -93940 -284111 -271348 -190137
22459a90137K3477N5947j26688j28672J61605J74504j78079n5131K4788o0636
$$ -190137 -166660 -110713 -237401 -366073 -204468 -29964 -208043 -263174 -238386 -299022
22449b99022k7525o6212J19922m411J13587P0824J22207J68840j59809j41356
$$ -299022 -326547 -392759 -272837 -277248 -163661 -92837 29370 198210 38401 -102955
22439a02955R9305J07985L662j5159k52873j50787m8926J0569Q9493o4259Q1615
$$ -102955 -3650 104335 107997 92838 -160035 -310822 -359748 -349179 -259686 -323945 -242330
22428b42330K43370K13552M2034m7478k74366r7469N5065J36422J28450m6732
$$ -242330 1040 214592 256626 209148 -65218 -162687 -107622 28800 157250 110518
22418A10518k31456q8005o9233J29013k3945L8330j1920J76070J19462m8681p4636
$$ 110518 -120938 -208943 -278176 -149163 -173108 -134778 -146698 29372 148834 100153 25517
22407B5517n5296l6145l5945k7384r5011L1570R3229J78044J20904J07849n0215
$$ 25517 -29779 -65924 -101869 -129253 -224264 -192694 -99465 78579 199483 307332 257117
22396B57117l5792k35463Q9265R6627J62509q6802k99838j1934o0951J86185P1801
$$ 257117 221325 -14138 75127 171754 334263 247461 -52377 -64311 -125262 60923 132724
22385A32724P1144o0281k75105R5027J5134K4163m6474o5016l9136J27217J12602
$$ 132724 203868 143587 -131518 -36491 -21357 2806 -43668 -108684 -147820 -20603 91999
22374I1999j4319J36038K6005p231j36059n7180o6248k27582J49881J0250j6801
$$ 91999 77680 213718 239723 232492 96433 39253 -26995 -254577 -104696 -94446 -111247
22363a11247O5986J00845N5387q2877k0526j6261m7408j46524q4473Q9079J5700
$$ -111247 -45261 55584 110971 28094 7568 -8693 -56101 -202625 -287098 -198019 -182319
22352a82319L6468J57888R0402m8289j6839N2464R1244R7627r7857k84541J6095
$$ -182319 -145851 12037 102439 54150 37311 89775 181019 278646 180789 -103752 -87657
22341h7657O0398J06785j28376j06650l2722m5133o7215L9219K17466M1143l9776
$$ -87657 -27259 79526 -48850 -155500 -188222 -233355 -300570 -261351 -43885 -2742 -42518
22330d2518n8118l0108n9944M2491J8160j27088p2790j7002J69506J06305J27484
$$ -42518 -100636 -130744 -190688 -148197 -130037 -257125 -329915 -346917 -177411 -71106 56378
22319E6378m6580p7054Q8632N7113J31656Q4792j31765k67354J22079R7195m3536
$$ 56378 9798 -67256 21376 78489 210145 294937 163172 -104182 17897 115092 71556
22308G1556J40243j50273m2062k7828j55994j26122O6054M7330K4213J72329m0750
$$ 71556 211799 61526 19464 -8364 -164358 -290480 -224426 -177096 -152883 19446 -21304
22297b1304N968J74335R5460n9176N2043J53990o5433L8567l9265j1227j41102
$$ -21304 -15336 158999 254459 195283 247326 401316 335883 374450 335185 323958 182856
22286A82856k10464l3503O8535n1055o5158R6344M2465L2503j6588P7723l0539
$$ 182856 -27608 -61111 7424 -43631 -108789 -12445 30020 62523 45935 123658 93119
22275I3119o9707J1920j04863o0695K5342J41662o940j04358J14216J77548K9952
$$ 93119 23412 35332 -69531 -130226 -104884 36778 29838 -74520 39696 217244 247196
22264B47196j77508j70673r4930O1726K09206O1625m1507q9644n9423q1871J53703
$$ 247196 69688 -100985 -195915 -134189 75017 136642 95135 5491 -53932 -135803 17900
22253A7900J20254k8925j08212R9477k4567m4435J40826q194r3100N5482N5751
$$ 17900 138154 109229 1017 100494 75927 31492 172318 164124 71024 126506 182257
22242A82257Q1588j13243o4439L1326m0727j57134j25720J29835k6427M8726K15244
$$ 182257 263845 150602 86163 117489 76762 -80372 -206092 -76257 -102684 -53958 161286
22231A61286k4145j69830N1440j06768l272N4450N308r1765p7911L8494q6547
$$ 161286 137141 -32689 18751 -88017 -91289 -36839 -31531 -123296 -201207 -162713 -249260
22220b49260K2577J90084J76127J83532j32404J4692l5206n5914P4329N24Q3638
$$ -249260 -226683 -36599 139528 323060 190656 205348 170142 114228 188557 189081 272719
22209B72719o8954m6353J743J14102n3081o1628k38179r5805q7069j06519P4572
$$ 272719 203765 157412 159155 273257 220176 158548 -79631 -175436 -262505 -369024 -294452
22198b94452r6747N9795J07063K2072N2661j31579N0927J47968J69489O7038M0801
$$ -294452 -391199 -331404 -224341 -202269 -149608 -281187 -230260 -82292 87197 154235 195036
22187A95036j36447O4831P1804l3838k6506M0642M1279j17186j13173n7024J03609
$$ 195036 58589 123420 195224 161386 134880 175522 216801 99615 -13558 -70582 33027
22176C3027R9879k1868N6091L8635j08582p1405o3592p3071N1245l1164j24892
$$ 33027 132906 111038 167129 205764 97182 25777 -37815 -110886 -59641 -90805 -215697
22165b15697q0787K9903K54636k3504K4801J0016j13041j63015J06299K51728
$$ -215697 -296484 -266581 -11945 -35449 -10648 -632 -113673 -276688 -170389 81339
22155H1339J0922J0398r3112j6976j04425k86624q7537J4309N6977J23944K6366
$$ 81339 92261 102659 9547 -7429 -111854 -398478 -486015 -471706 -414729 -290785 -264419
22144b64419O2571J51574m642N9884j74210j91906J14560K77047J67787j63945
$$ -264419 -201848 -50274 -54916 4968 -169242 -361148 -246588 30459 198246 34301
22134C4301k29628N1473P6162Q280N5711j245q8067j12180K08551L1886J3732
$$ 34301 -195327 -143854 -67692 -59412 -3701 -4946 -93013 -205193 3358 35244 48976
22123D8976l0534j0157j24907R6370J07294r147J79719j21807j25407M0468O0538
$$ 48976 18442 8285 -116622 -20252 87042 77895 257614 135807 10400 50868 111406
22112A11406j03336p2756J41970K25758L201l22232j50602O9501K87959j12970
$$ 111406 8070 -64686 77284 303042 306243 -15989 -166591 -97090 190869 77899
22102G7899k1877J09670l5492j73501n7003J61683L1170j83530L9164L9200J9909
$$ 77899 56022 165692 130200 -43301 -100304 61379 92549 -90981 -51817 -12617 7292
22091G292J50012J07417j03805J8716j61902j91555q2160J1651J07757o0552p7115
$$ 7292 157304 264721 160916 179632 17730 -173825 -255985 -244334 -136577 -197129 -274244
22080b74244l0180m2135L3768K30183J56371l8737j690J61752n3208j21332q1537
$$ -274244 -304424 -346559 -312791 -82608 73763 35026 33336 195088 141880 20548 -60989
22069f0989j16947j49786Q8226K20281N2897P6562m8792p6301n308k7861m1663
$$ -60989 -177936 -327722 -239496 -19215 33682 110244 61452 -14849 -20157 -48018 -89681
22058h9681k1877j5017j6494P7702J14127o6323k8134l3058J24478J56465q5864
$$ -89681 -111558 -126575 -143069 -65367 48760 -17563 -45697 -78755 45723 202188 116324
22047A16324j84148j05496O4706N2859j2181Q8053J9139p3226l6080R1587k5229
$$ 116324 -67824 -173320 -108614 -55755 -67936 20117 39256 -33970 -70050 21537 -3692
22036c692j5430N2849k7627o8479J19161k746j03710P6482K35131j3327p7007
$$ -3692 -19122 33727 6100 -62379 56782 54036 -49674 26808 261939 248612 171605
22025A71605j45583j29591r586K896P2783K02061K4279j79099r3777q0095k8474
$$ 171605 26022 -103569 -113155 -110259 -37476 164585 188864 9765 -84012 -164107 -192581
22014a92581J42028o8764K1522j38501r0953J16320J25610O8530k1573J41050
$$ -192581 -50553 -119317 -97795 -236296 -327249 -210929 -85319 -16789 -38362 102688
22004A02688j12703L5122N1339P4201n217n0434r8447k17270o3184o0102l0684
$$ 102688 -10015 25107 76446 150647 145430 94996 -3451 -220721 -283905 -344007 -374691
21993c74691Q0998L9490M6106J15679k6525N7451J07317o4488q7956R5986Q8998
$$ -374691 -293693 -254203 -208097 -92418 -118943 -61492 45825 -18663 -106619 -10633 78365
21982G8365M7559J00461j43538p2890k02752q905J17612J17201K14254N6051j4655
$$ 78365 125924 226385 82847 9957 -192795 -201700 -84088 33113 247367 303418 288763
21971B88763M5234k18458q7536o7830R8036N8017j19855j35253J17999J01053
$$ 288763 333997 115539 28003 -39827 58209 116226 -3629 -138882 -20883 80170
21961H0170O2592j65319k1284K26893k9250j27262K4444k4527n9575J06433q124
$$ 80170 142762 -22557 -43841 183052 153802 26540 50984 26457 -33118 73315 65191
21950F5191j59597J6785Q2086K08046j01799k02846o1785m0346K51934n8328p0878
$$ 65191 -94406 -77621 4465 212511 110712 -92134 -153919 -194265 57669 -659 -71537
21939g1537N7403O9131L5749m8458n1047o3471l5051Q3296K6713M047J03470k5214
$$ -71537 -14134 54997 90746 42288 -8759 -72230 -107281 -23985 2728 6775 110245 85031
21927H5031o0097P4970J18218L2881j2291j09612l273o0354k9952j85427p1616
$$ 85031 24934 99904 218122 251003 238712 129100 125827 65473 35521 -149906 -221522
21916b21522J18159J11009J43758m6432L9302N1662P0983j01837q0742n0422K2192
$$ -221522 -103363 7646 151404 104972 144274 195936 266919 165082 84340 33918 56110
21905E6110K25814r11r4925J22858k7413j89128j01784J41366O1992n1258K1567
$$ 56110 281924 281013 186088 308946 281533 92405 -9379 131987 193979 142721 164288
21894A64288k8322r2215P8804N0552J1767q9592j34773L0499J8151o1549o8606
$$ 164288 135966 43751 122555 173107 184874 95282 -39491 -8992 9159 -52390 -120996
21883a20996l8495J58803N6732j1735q953n7973J6395r8269R8776J60267P826
$$ -120996 -159491 -688 56044 44309 35356 -22617 -6222 -104491 -5715 154552 162378
21872A62378j22141M1469l2512j05393j4438l2821j15529l0223N0133J24216J48774
$$ 162378 40237 81706 49194 -56199 -70637 -103458 -218987 -249210 -199077 -74861 73913
21861G3913J03756j38675n0352K45614l8778k31444k33734n6629n5350K22628
$$ 73913 177669 38994 -11358 234256 195478 -35966 -269700 -326329 -381679 -159051
21851a59051K03160k0367k02686j53105l0500J71048L18012J06294j29308j81203
$$ -159051 44109 23742 -178944 -332049 -362549 -191501 126511 232805 103497 -77706
21841g7706j96798P6493L14624j546o2539k2276m6545j09988O183J80101p107
$$ -77706 -274504 -198011 116613 115067 52528 30252 -16293 -126281 -120098 60003 52896
21830E2896j46102j38634K52390J45059j54107j42476J20543P3357O9545O0675
$$ 52896 -93206 -231840 20550 165609 11502 -130974 -10431 62926 132471 193146
21820A93146n6241j2942j24249R134j31706P6199J07330j07170j55621O2979q3346
$$ 193146 136905 123963 -286 8848 -122858 -46659 60671 -46499 -202120 -139141 -222487
21809b22487K4756m9202o7988j0014J41986J08183L4820N1625J28757P6642j62902
$$ -222487 -197731 -246933 -314921 -324935 -182949 -74766 -39946 11679 140436 217078 54176
21798E4176J97J3734p1942r0223P3161k6309j01892m5311J2085J43484M7930N0587
$$ 54176 54373 68107 -3835 -94058 -20897 -47206 -149098 -194409 -182324 -38840 9090 59677
21786E9677p5214N893K059j49356q305J57590L6343N8717m7061j08910p5539J19269
$$ 59677 -15537 -9644 -7585 -156941 -165246 -7656 28687 87404 40343 -68567 -144106 -24837
21774b4837K1698m8689K5080q2700m1219P6444N8971L421M9191k17349m649J78334
$$ -24837 -3139 -51828 -26748 -109448 -150667 -74223 -15252 -11831 37360 -179989 -184638 -6304
21762f304M7436j24277j80508j28336P4166Q4942J3508J60765j91386M1907P8172
$$ -6304 41132 -83145 -263653 -391989 -317823 -232881 -219373 -58608 -249994 -208087 -129915
21751a29915m9375m2722o6525L0084O8350Q8970M1257K93026P073k4320j57354
$$ -129915 -179290 -222012 -288537 -258453 -190103 -101133 -59876 233150 240223 215903 58549
21740E8549l0291K7438k4672l5444j35832L3922K45527o4698o6608L8083J12876
$$ 58549 28258 55696 31024 -4420 -140252 -106330 139197 74499 7891 45974 158850
21729A58850M1488j75312j63312J13782Q6423j7942j23211J3130J2887O3130J20634
$$ 158850 200338 25026 -138286 -24504 61919 43977 -79234 -66104 -53217 9913 130547
21718A30547Q1846J81117k4881l39476j70988k8843J06738j16635q7414L3699
$$ 130547 212393 393510 368629 29153 -141835 -170678 -63940 -180575 -267989 -234290
21708b34290K32686J44411j998J65505J41037j66666j03167j28145k9351J06037
$$ -234290 -1604 142807 140809 306314 447351 280685 177518 49373 20022 126059
21698A26059R5607k9073p3533j42217j26683Q8383Q6468m8831j78924k28992J13067
$$ 126059 221666 192593 119060 -23157 -149840 -61457 25011 -23820 -202744 -431736 -318669
21687c18669L51038J94090J53850j22165n5859k0606j76777p6465J91679O3942
$$ -318669 32369 226459 380309 258144 202285 181679 4902 -71563 120116 184058
21677A84058J3990J04409m4391l7386M5662p6719j38522Q1638M8631n4989j08567
$$ 184058 198048 302457 258066 220680 266342 189623 51101 132739 181370 126381 17814
21666A7814r5005j1692J26035Q0949P4038p5571j56534J7141K61901K7199r3564
$$ 17814 -77191 -88883 37152 118101 192139 116568 -39966 -22825 239076 266275 172711
21655A72711l2873j18966O0565K4421N8342k33336j38234P5896J31634K0105j29789
$$ 172711 139838 20872 81437 105858 164200 -69136 -207370 -131474 160 20265 -109524
21644a09524j10300Q0077N706j14124K20196n6517j36527J06079O7195R8892m3892
$$ -109524 -219824 -139747 -134041 -248165 -27969 -84486 -221013 -114934 -47739 51153 7261
21633G261p2069q7950N6229J1638o1907k6324r1449R5939l1483P439o2128J61404
$$ 7261 -64808 -152758 -96529 -84891 -146798 -173122 -264571 -168632 -200115 -192676 -254804 -93400
21621i3400N5063J81852j2817M1819o095q7316J19195j24509j07673n2233m7592
$$ -93400 -38337 143515 130698 172517 166422 79106 198301 73792 -33881 -86114 -133706
21610a33706J91490L4693m661n819q3710M3516M1846J13082K0769l9233j5844
$$ -133706 57784 92477 87816 81997 -1713 41803 83649 196731 217500 178267 162423
21599A62423J26666n8681m2194M4171l0351K515m3652O1852j72133m047j49006
$$ 162423 289089 230408 188214 232385 202034 204549 160897 222749 50616 46569 -102437
21588a02437q2223p1543k3517L9432Q7660P3311J35701m5261o4777n8179r1729
$$ -102437 -184660 -256203 -279720 -240288 -152628 -79317 56384 11123 -53654 -111833 -203562
21577b03562J30485P7419O1640k9033M3557K10367N2083j25769j59927k23831
$$ -203562 -73077 4342 65982 36949 80506 290873 342956 217187 57260 -166571
21567a66571j12681K61355J32851l4018j142K1108M8681P459k9430n9672k0227
$$ -166571 -279252 -17897 114954 80936 79794 100902 149583 157042 127612 67940 47713
21556D7713m4131L2114j88936p8643J05293J16633j82648j23282l6026j09458
$$ 47713 3582 35696 -153240 -231883 -126590 -9957 -192605 -315887 -351913 -461371
21546d61371M7225J72088J07220K6107P766L5311J66795N9138l9127j30359n4392
$$ -461371 -414146 -242058 -134838 -108731 -100965 -65654 101141 160279 121152 -9207 -63599
21535f3599l0894J65413l240n2601j71527J51037J81785J3656p2869r4996J9384
$$ -63599 -94493 70920 67680 15079 -156448 -5411 176374 190030 117161 22165 41549
21524D1549j51923o9914J44413R3570O3200m0791n4965N0625L0391o2930k14349
$$ 41549 -110374 -180288 -35875 57695 120895 80104 25139 75764 106155 43225 -171124
21513a71124l1891J3611N4979K02315R7133o4158q9073n0872J06924O591k2656
$$ -171124 -203015 -189404 -134425 67890 165023 100865 11792 -39080 67844 74435 51779
21502E1779j64917o4597J18939j5072l8309m0936R6638Q5884l7589Q2909J06749
$$ 51779 -113138 -177735 -58796 -73868 -112177 -153113 -56475 29409 -8180 74729 181478
21491A81478P7824j6180k04314p9459O9627l7998j7970P9515K0618p5553Q8232
$$ 181478 259302 243122 38808 -40651 28976 -9022 -26992 52523 73141 -2412 85820
21480H5820J2636j87690Q3736J19097N7016j20255q669N722n6528r1637J12015
$$ 85820 98456 -89234 -5498 113599 170615 50360 41691 47413 -9115 -100752 11263
21469A1263r1585n0198O9438J84818l0911m7663P5773j0643l6723K539p6680J04881
$$ 11263 -80322 -130520 -61082 123736 92825 45162 120935 110292 73569 76108 -572 104309
21457A04309R8581j3743l2164K2918j24303j14314J47775J02947M1506k4728k9430
$$ 104309 202890 189147 156983 179901 55598 -58716 89059 192006 233512 208784 179354
21446A79354O8908N3077k934Q5980j00881l01567N4529L51089j86485r9122J32165
$$ 179354 248262 301339 298405 384385 283504 -18063 36466 387555 201070 101948 234113
21435B34113q3806j8692m6876j01292K0753j6533j8045L0448j08084p1752K1578
$$ 234113 150307 131615 84739 -16553 4200 -12333 -30378 70 -108014 -179766 -158188
21424a58188k0780P3130m622k0097R4348Q5459J95537Q0276M6691j15749k16511
$$ -158188 -178968 -105838 -110460 -130557 -36209 49250 244787 325063 371754 256005 39494
21413C9494K1188L24584J6719n69m6957j74709K0585m8608q4893n6764L3783M2694
$$ 39494 60682 385266 401985 401416 354459 179750 200335 151727 66834 10070 43853 86547
21401H6547p4476j69485R6594m9478K9798J55305J0168p5574L8249N6089n6739
$$ 86547 12071 -157414 -60820 -110298 -80500 74805 84973 9399 47648 103737 46998
21390D6998j2956J9354J8114J27869K3150l2777j44185j63335J10707K07433L7007
$$ 46998 34042 53396 71510 199379 222529 189752 45567 -117768 -7061 200372 237379
21379B37379j1818r8616k731j05798m7523P2135j02621j82956r6911J89604K9869
$$ 237379 225561 126945 124214 18416 -29107 43028 -59593 -242549 -339460 -149856 -119987
21368a19987n8711R4509J87482J6898j277j22577j25067J24380J13948n8703k20554
$$ -119987 -178698 -84189 103293 120191 118914 -3663 -128730 -4350 109598 50895 -169659
21357a69659o6905J76051O0214j4990j6292L5638j23609j99179J09666P5675R505
$$ -169659 -236564 -60513 -299 -15289 -31581 4057 -119552 -318731 -209065 -133390 -123885
21346a23885o2909Q0217K1706J14695l5408M8596j69272j43461Q2289K6292n3894
$$ -123885 -186794 -106577 -84871 29824 -5584 43012 -126260 -269721 -187432 -161140 -215034
21335b15034N1503m6643j09680m5870N9079J74844J72082L528q9116m8897J96979
$$ -215034 -163531 -210174 -319854 -365724 -306645 -131801 40281 43809 -45307 -94204 102775
21324A02775N7974o8684q2386P9581K1032O0500Q092j60725J39691j32686k60643
$$ 102775 160749 92065 9679 89260 110292 170792 178884 18159 157850 25164 -235479
21313b35479j707J20708k2626l8611m7096P3656m5127J9564J10978n3109o6029
$$ -235479 -237186 -116478 -139104 -177715 -224811 -151155 -196282 -176718 -65740 -118849 -184878
21302a84878J46641J25078L2481l1956j39525K000J5470O4507L7411k02631m1073
$$ -184878 -38237 86841 119322 87366 -52159 -50159 -34689 29818 67229 -135402 -176475
21291a76475q066O5080P4537k9665O5153j13164R168N1406q0980R1293N236P2697
$$ -176475 -184541 -119461 -44924 -74589 -9436 -122600 -113432 -62026 -143006 -51713 -46477 26220
21279B6220K3862o1519K03350J48424j55450p3974R9124M0718K870O456J36422
$$ 26220 50082 -11437 191913 340337 184887 110913 210037 250755 253625 260081 396503
21268C96503O9405j76303j76540K0926J80001J42356j80611r4107r9492K14285
$$ 396503 465908 289605 113065 133991 313992 456348 275737 181630 82138 296423
21258B96423m932K0609L4362j98469r7966p6786n4179o4549O7835J27196j5660
$$ 296423 291491 312100 346462 147993 50027 -26759 -80938 -145487 -77652 49544 33884
21247C3884k1549m9407J56074J72348N6448r9806K2900j32236j3149N3990r265
$$ 33884 12335 -37072 119002 291350 347798 247992 270892 138656 125507 179497 170232
21236A70232J48182M5220j45579j9911J76147m4543o2827L1782r5091j7806L824
$$ 170232 318414 363634 218055 198144 374291 329748 266921 298703 203612 185806 189630
21225A89630m6286O6668j10112l0278m5468J9954R5346j71769L355P0426k4582
$$ 189630 143344 210012 99900 69622 24154 44108 139454 -32315 -28960 41466 16884
21214A6884J59593K51733O4898J27752K2355l023n6160J67523j489k38626j17360
$$ 16884 176477 428210 493108 620860 643215 640192 584032 751555 750066 511440 394080
21203C94080K13250j50712k25403Q5744N0887J63106K08801K11413Q2358j64330
$$ 394080 607330 456618 231215 316959 367846 530952 739753 951166 1033524 869194
21193H69194r4330k15636j85743k3409o5428k01024m2642j361l0870M3518L5452
$$ 869194 774864 559228 373485 350076 284648 83624 40982 39621 8751 52269 87721
21182H7721N8719J3572j14351r0545J51445O6966l7511j13225n0662l3152n2775
$$ 87721 146440 160012 45661 -44884 106561 173527 136016 22791 -27871 -61023 -113798
21171a13798m2020l9559J27109N400J2903j38298J18820J01970o8152O3928K4603
$$ -113798 -155818 -195377 -68268 -62868 -49965 -188263 -69443 32527 -35625 28303 52906
21160E2906q2660k0122j4265L3599J8564j23676o8173o7657L4375n2392Q4474
$$ 52906 -29754 -49876 -64141 -30542 -11978 -135654 -203827 -271484 -237109 -289501 -205027
21149b05027Q4177R0708n7680N5005j24400j19875o6635J6385K15744K11654J7134
$$ -205027 -120850 -30142 -87822 -32817 -157217 -277092 -343727 -327342 -111598 100056 117190
21138A17190k1138N128Q4486j58536k19631J05507J53924m6270l6858R5926J3339
$$ 117190 96052 101180 185666 27130 -192501 -86994 66930 20660 -16198 79728 93067
21127I3067j15327R9523m7827j8658J391O4132k3441l0360k5410K1134P9224Q9661
$$ 93067 -22260 77263 29436 10778 12169 76301 52860 22500 -2910 18224 97448 187109
21115A87109J67517j64504j24715j23768Q8307M2057l163l11659R4762k9963j72831
$$ 187109 354626 190122 65407 -58361 29946 72003 68840 -242819 -148057 -178020 -350851
21104c50851R5316J57904J15440J0914r7115p8728J28818q8622J56206Q990J46
$$ -350851 -255535 -97631 17809 28723 -68392 -147120 -18302 -106924 49282 58272 58418
21093E8418j12723N233K3445J22543R7979q141o2358k9495j48472P7900J00107
$$ 58418 -54305 -49072 -25627 96916 194895 186754 124396 94901 -53571 24329 124436
21082A24436N5468j06475O2105J4222N8047N3751r3007J3664J30222n1680K2151
$$ 124436 179904 73429 135534 149756 207803 261554 168547 182211 312433 260753 282904
21071B82904O2701Q8369j26962K1893j39239j73311j4291j12014k0630R432j0002
$$ 282904 345605 433974 307012 328905 189666 16355 2064 -109950 -130580 -121148 -131150
21060a31150J24695K4807J32444j18312k43613n034J11211J51960M4668p7448
$$ -131150 -6455 18352 150796 32484 -211129 -216163 -104952 47008 91676 14228
21050A4228j64380M0197J1763j35555j50932P6428J36070m6484K21986K24194
$$ 14228 -150152 -109955 -98192 -233747 -384679 -308251 -172181 -218665 3321 227515
21040B27515J0451K8925j48957m1729j76921k53181P5879J56659m0109N681j6862
$$ 227515 237966 266891 117934 76205 -100716 -353897 -278018 -121359 -161468 -155787 -172649
21029a72649j37428J01291K52071J45731j43928j09188Q3152p9387r6230K193
$$ -172649 -310077 -208786 43285 189016 45088 -64100 19052 -60335 -156565 -154372
21019a54372j2667M2917J47877j36606j8731J04367j84666O3393J99610J47130
$$ -154372 -167039 -124122 23755 -112851 -131582 -27215 -211881 -148488 51122 198252
21009A98252J23627n1334l8120O5683j06879j62136j88135r5890k329J98285K61072
$$ 198252 321879 270545 232425 298108 191229 29093 -159042 -254932 -257261 -58976 202096
20998B02096J12330M4721k06919q5651j12381R7487J06618j3100q1210j53627
$$ 202096 314426 359147 152228 66577 -45804 51683 158301 145201 63991 -89636
20988h9636J02217J64499r9842n2941J19831Q2622m3949n3842R4199j2888L9414
$$ -89636 12581 177080 77238 24297 144128 226750 182801 128959 223158 210270 249684
20977B49684j11368m7800m8109N0656P7133o7341n9840n6214O7321N0642k9641
$$ 249684 138316 90516 42407 93063 170196 102855 43015 -13199 54122 104764 75123
20966G5123n402M598j07404l339P0439J55271q671r5039q1772n8715K4902P9473
$$ 75123 69721 74319 -33085 -36424 34015 189286 180615 85576 3804 -54911 -30009 49464
20954D9464m0032q3338o7274Q7056q5117K2127K00158N1972j1417j02375k02140
$$ 49464 9432 -73906 -141180 -54124 -139241 -117114 83044 135016 123599 21224 -180916
20943a80916M0284J68060J57491j31037k20264q5227p8567k9081k80M9368L2327
$$ -180916 -140632 27428 184919 53882 -166382 -251609 -330176 -359257 -359537 -310169 -277842
20932b77842M9507J38790O1442J38995n0804j35792N2614N2307J7017J05029J96287
$$ -277842 -228335 -89545 -28103 110892 60088 -75704 -23090 29217 46234 151263 347550
20921C47550M21J8530k8471j12578o4057J15592O3426n1287J7265N0756r6362
$$ 347550 347971 366501 338030 225452 161395 276987 340413 289126 306391 357147 260785
20910B60785j90602o8396K27197K07462r875Q5425q3343k38197M4017P5800j83187
$$ 260785 70183 1787 228984 436446 426571 511996 428653 190456 234473 310273 127086
20899A27086r7940j743Q4195k1200L8004K25342m2435n8341M7979P2048N3736
$$ 127086 29146 27403 111598 90398 128402 353744 311309 252968 300947 372995 426731
20888D26731o9810o6536j48092j85473J8847O4765Q8982J56017L0931p6748M799
$$ 426731 356921 290385 142293 -43180 -24333 40432 129414 285431 316362 239614 244413
20877B44413P0143r4603o5710M608N2077r7086j67295j02689j15680j5202K10583
$$ 244413 314556 219953 154243 158851 210928 113842 -53453 -156142 -271822 -287024 -76441
20866g6441N2642J00303J91210M5348K7543o9901n1604k664j31487j66854m2056
$$ -76441 -23799 76504 267714 313062 340605 270704 219100 216436 84949 -81905 -123961
20855a23961J86101N5720Q9704K26268j3624k13291p500L8230J6113j80485j03199
$$ -123961 62140 117860 207564 433832 420208 206917 199417 237647 253760 73275 -29924
20844b9924q9325p8439J30045o6408j21197k2281j7148J06089J22419R8271J86353
$$ -29924 -119249 -197688 -67643 -134051 -255248 -277529 -294677 -188588 -66169 32102 218455
20833B18455j8501j47786J1247Q4494q7344j89241r5694P1651P0794K5232R287
$$ 218455 199954 52168 63415 147909 60565 -128676 -224370 -152719 -81925 -56693 -47406
20822d7406J07735m6441l0401K22291N0274j32811q2130o949n882O877R9144o5245
$$ -47406 60329 13888 -16513 205778 256052 123241 41111 34162 28280 35157 134301 69056
20810F9056j43955p7999K01095Q0533j14960m7910K6035k9712P091o2478N945
$$ 69056 -74899 -152898 48197 128730 13770 -34140 -8105 -37817 -30726 -93204 -87259
20799h7259q6275J04757K56858m0145m9971L5968j5472M3169J42830j91373j02839
$$ -87259 -173534 -68777 188081 147936 97965 133933 118461 161630 304460 113087 10248
20788A0248Q4733O9834J55167j34836j18918N1115m6519j5449k1178K1571J53535
$$ 10248 94981 164815 319982 185146 66228 117343 70824 55375 34197 55768 209303
20777B09303R9366l6001j26094K0761P468j47211j716J48756O8520O8258r5973
$$ 209303 308669 272668 146574 167335 174803 27592 25876 174632 243152 311410 215437
20766B15437q6207J12621o0355J35807Q7604j37909p1514J59378j70675k4770
$$ 215437 129230 241851 181496 317303 404907 266998 195484 354862 184187 159417
20756A59417J19952J40327R894l065P6411r2517J8149M7154l3721O3905K9102
$$ 159417 279369 419696 429590 426525 502936 410419 428568 475722 442001 505906 535008
20745E35008K200j80036M8297J20115k0172o8772j11614J716Q0404J01816p7186
$$ 535008 537208 357172 405469 525584 505412 436640 325026 326742 407146 508962 431776
20734D31776j69665k03879J89727K06495O1572m4004j05794j46372p5083J07118
$$ 431776 262111 58232 247959 454454 516026 472022 366228 219856 144773 251891
20724B51891J53190k9834n6076o1937k9492J34518J20901M6321J39810J69763
$$ 251891 405081 375247 319171 257234 227742 362260 483161 529482 669292 839055
20714H39055Q4982o4402p640m0995J9472K7655J79488J03294P6538K9293J26200
$$ 839055 924037 859635 851995 811000 830472 858127 1037615 1140909 1217447 1246740 1372940
20703A372940O6825R0787K51534K31916L26183K72068J78394K93772J79492J69681
$$ 1372940 1439765 1530552 1782086 2014002 2340185 2612253 2790647 3084419 3263911 3433592
20693C433592L10323L72736K50809L56469N72536R26468R88421Q08959J097257
$$ 3433592 3743915 4116651 4367460 4723929 5296465 6222933 7211354 8020313 9117570
20684I117570J215075J495468J475638J939495K852077M417406P022139J1830113
$$ 9117570 10332645 11828113 13303751 15243246 18095323 22512729 29534868 41364981
20676D1364981J9321593K2252341K0468309K1386254J7200111P896879k44997
$$ 41364981 60686574 82938915 103407224 124793478 141993589 149890468 149645471
20669A49645471n083021j5225162j9773852j7674869j3289989p921888J924734
$$ 149645471 144562450 129337288 109563436 91888567 78598578 70676690 72601424
20662G2601424J3927554J8136061J7320512J8926551J3684070L789880l979706
$$ 72601424 86528978 104665039 121985551 140912102 154596172 158386052 154406346
20655A54406346q810321j9155705k3432174k1932069j8744115j5583887j1249446
$$ 154406346 145596025 126440320 103008146 81076077 62331962 46748075 35498629
20648C5498629p325776m722697l143662k432471k009053j671117j475338j316665
$$ 35498629 28172853 23450156 20306494 17874023 15864970 14193853 12718515 11401850
20640A1401850j180734r43258p54296n81546n45909n46306n49536m23497l63611
$$ 11401850 10221116 9277858 8523562 7942016 7396107 6849801 6300265 5876768 5513157
20631E513157m78925m33910l16436l84852k79073l21559m53477k72451j28215
$$ 5513157 5034232 4600322 4283886 3899034 3619961 3298402 2844925 2572474 2444259
20622B444259j84957l3177m643l22708k11835j45538P013m5168j07875M5487r8868
$$ 2444259 2259302 2226125 2221482 1898774 1686939 1541401 1548414 1503246 1395371 1440858 1341990
20611A341990j33612j04758r4726j45220n3802j34303j8956J02931N6395j41939
$$ 1341990 1208378 1103620 1008894 863674 809872 675569 656613 759544 815939 674000
20601F74000J4018Q0286J07630J05377l3535j45683j07087j34102p4227l8051
$$ 674000 688018 768304 875934 981311 947776 802093 695006 560904 486677 448626
20591D48626r2477L8741J09792l9327n2121K6242P5960j74647l3502l9601J46630
$$ 448626 356149 394890 504682 465355 413234 439476 515436 340789 307287 267686 414316
20580D14316L6622M4143L6989n498P8291J7161J23583J6227J5115q8572j93722
$$ 414316 450938 495081 532070 526572 604863 622024 745607 761834 776949 688377 494655
20569D94655l819j82682j7708K43488J13275k3949l672j3689j0618N7784j01017
$$ 494655 490836 308154 290446 533934 647209 623260 619588 605899 595281 653065 552048
20558E52048k34259J12816j072J38570R6487k56285j33213p8681m5762J38992
$$ 552048 317789 430605 429533 568103 664590 408305 275092 196411 150649 289641
20548B89641m6983q7751j19613n5392n4637J24425K61943J55138o9707r0177o7657
$$ 289641 242658 154907 35294 -20098 -74735 49690 311633 466771 397064 306887 239230
20537B39230j23264r5327M4816J4336J72446J82775J55082m8730L4610k55075
$$ 239230 115966 20639 65455 79791 252237 435012 590094 541364 575974 320899
20527C20899p8538J35122J3984n6760L2743J22123Q005j46708m0132Q9438Q6099
$$ 320899 242361 377483 391467 334707 367450 489573 497578 350870 310738 400176 486275
20516D86275M1691K90443L38361K28114J01291O9173J47216J01670j78871o5957
$$ 486275 527966 818409 1156770 1384884 1486175 1555348 1702564 1804234 1625363 1559406
20506A559406p0885j35010l72648k65693k78851k83873j22362J38871J49464N724
$$ 1559406 1488521 1353511 980863 715170 436319 152446 30084 168955 318419 324143
20496C24143k62613q6028R0027q1587J5566N9487K3834k317L8472M7255J21697
$$ 324143 61530 -24498 65529 -16058 -492 58995 82829 80512 118984 166239 287936
20485B87936K13820j06070j22031o1491L917J02080j87700P3338J61107L3990
$$ 287936 501756 395686 273655 212164 216081 318161 130461 203799 364906 398896
20475C98896Q5530Q557j10495j15138l12927r4267K02391L2604k01113j09432
$$ 398896 484426 492983 382488 267350 -45577 -139844 62547 95151 -105962 -215394
20465b15394J69273P8667J49652O8261r8427r3852r0611R936K1321j31721N9165
$$ -215394 -46121 32546 182198 250459 152032 58180 -32431 -22495 -1174 -132895 -73730
20454g3730N8436j22525M9161J04803q2336k2352L6030r0454J74197k5924j86952
$$ -73730 -15294 -137819 -88658 16145 -66191 -88543 -52513 -142967 31230 5306 -181646
20443a81646p1427L44053J02757p4369J49404N5275l3503j61449q6989j08744
$$ -181646 -253073 90980 193737 119368 268772 324047 290544 129095 42106 -66638
20433f6638r3425l2902Q4083J25984K9920j8241J1644j837j0110J29442J01178
$$ -66638 -160063 -192965 -108882 17102 47022 28781 40425 38588 28478 157920 259098
20422B59098N1668n772J72046P6364n3962l9649J13030k28065j10149k0051j00785
$$ 259098 310766 304994 477040 553404 499442 459793 572823 344758 234609 214558 113773
20411A13773Q7840K70561o8240j02156r446P0535J47604P8211j61552j64686n327
$$ 113773 201613 472174 403934 301778 292332 362867 510471 588682 427130 262444 257117
20400B57117j47817j52149N5493J94501j11186o0122N6459N174N9534r5875O0553
$$ 257117 109300 -42849 12644 207145 95959 35837 92296 97470 157004 61129 121682
20389A21682j43699L9706m0296k81608j02552J95154J71638p4701N5174j27030
$$ 121682 -22017 17689 -22607 -304215 -406767 -211613 -39975 -114676 -59502 -186532
20379a86532j6642J46581J05017L948j69549m3270K6868N6338P2242Q7876O014
$$ -186532 -203174 -56593 48424 52372 -117177 -160447 -133579 -77241 -4999 82877 88891
20368H8891l6086l0725K14226Q404m5925j32961j21941P8228J3009j3381j00561
$$ 88891 52805 22080 236306 244710 198785 65824 -56117 22111 35120 21739 -78822
20357g8822j3287N538K0081J97369L6406L0055L2083K2197J22687J58889k46569
$$ -78822 -92109 -86571 -66490 130879 167285 197340 229423 251620 374307 533196 286627
20346B86627m0426k93339l4085j308L7797J3371j8225J2661L5643j00102m5003
$$ 286627 246201 -47138 -81223 -82531 -44734 -31363 -49588 -36927 -1284 -101386 -146389
20335a46389m7895J2993J09692P8118J79786K9188j07297j670r0949j26487j21630
$$ -146389 -194284 -181291 -71599 6519 186305 215493 108196 106526 15577 -110910 -232540
20324b32540K4705L0405l7356J73900J88983j3372q9455M6669J21844O0302p901
$$ -232540 -207835 -177430 -214786 -40886 148097 134725 45270 91939 213783 274085 266184
20313B66184q8510r1662J0175O6113J4418r1818L4236P2313j59951k08114l322
$$ 266184 177674 86012 96187 162300 176718 84900 119136 191449 31498 -176616 -179938
20302a79938Q2280n7782r69J46184J05244N1836j1692n554l6605n5906J331J67442
$$ -179938 -97658 -155440 -156409 -10225 95019 146855 135163 129609 93004 37098 38429 205871
20290B05871j05360n8632j00870J41132j28279j32821P5485J7143k14891l3076
$$ 205871 100511 41879 -58991 82141 -46138 -178959 -103474 -86331 -301222 -334298
20280c34298J50322J9799j41649J35357J78188P1099j05614j2647J34876R0271
$$ -334298 -183976 -164177 -305826 -170469 7719 78818 -26796 -39443 95433 185704
20270A85704j3205R0304k08343k830p6093m1446Q2725J99210J11649J5312j9160
$$ 185704 172499 262803 54460 51630 -24463 -65909 16816 216026 327675 342987 323827
20259C23827L9946M3119M1159o5864n972j56505k55635j71932M3135J07809J72703
$$ 323827 363773 406892 448051 382187 376215 219710 -35925 -207857 -164722 -56913 115790
20248A15790M6078K7179j24918p9807n8015K9354Q0118J25940M5246j00307j73703
$$ 115790 161868 189047 64129 -15678 -73693 -44339 35779 161719 206965 106658 -67045
20237f7045J9912L0904j1654p1940N5757K7545p8527M3188J42633J02425O7952
$$ -67045 -47133 -16229 -27883 -99823 -44066 -16521 -95048 -51860 90773 193198 261150
20226B61150J090J24417l0175M5167j53387l9946N9787o972M9937j9634M830L5710
$$ 261150 262240 386657 356482 401649 248262 208316 268103 261131 311068 291434 296264 331974
20214C31974k6815N9375L3154j78810r4656Q2794K01877Q784m866K678p9687j02449
$$ 331974 305159 364534 397688 218878 124222 207016 408893 417677 412811 415489 335802 233353
20202B33353P8016P954j85129J32254n7019j15114O8634n5169J0661Q6158j6768
$$ 233353 311369 319323 134194 266448 209429 94315 162949 107780 118441 204599 187831
20191A87831N7250k2914J91772K7297k9815j39372m6577q9797o6169J795R3061
$$ 187831 245081 222167 413939 441236 411421 272049 225472 135675 69506 71301 164362
20180A64362j70553n4910N5210K87508M8779j22858n8216n0969o4388O0893K26518
$$ 164362 -6191 -61101 -5891 281617 330396 207538 149322 98353 33965 94858 321376
20169C21376Q2542Q387j45205k07021P3870Q821L396O0423N7213K38135J48463
$$ 321376 403918 412305 267100 60079 133949 142770 146166 206589 263802 501937 650400
20158F50400j13447j57312n9306J08324n0424M328P1831J49450p224m67L9188
$$ 650400 536953 379641 320335 428659 378235 382563 454394 603844 596620 596153 635341
20147F35341m4965j54918k04355j41992r3475j31100Q3456O2874J86131r4829
$$ 635341 590376 435458 231103 89111 -4364 -135464 -52008 10866 196997 102168
20137A02168m9574J28934J08738L0487R3728R0242K35936R2727p8233m4800K01447
$$ 102168 52594 181528 290266 320753 414481 504723 740659 833386 755153 710353 911800
20126I11800L2805j02388j92634j07382o9575j17923j1829J88811J34812K87293
$$ 911800 944605 842217 649583 542201 472626 354703 342874 531685 666497 953790
20116I53790J39454q3771j48622O0621P5586l33793k41420p7247j36136j12807
$$ 953790 1093244 1009473 860851 921472 997058 663265 421845 344598 208462 95655
20106I5655j11299J33545o2964r9627m5759M3038l4110L6525J44671J23792q0978
$$ 95655 -15644 117901 54937 -44690 -90449 -47411 -81521 -44996 99675 223467 142489
20095A42489j67485j49916Q9684K08318K53326n9150j71846L0990J14744j11573
$$ 142489 -24996 -174912 -85228 123090 376416 317266 145420 176410 291154 179581
20085A79581r8329R9425K7786j62705m4447J62991M8098R955j71560J9962L519
$$ 179581 81252 180677 208463 45758 1311 164302 212400 222355 50795 70757 74276
20074G4276J3702P1811j65403J79990o4067n7067J9855M4673N6836j6404l3938
$$ 74276 87978 159789 -5614 174376 110309 53242 73097 117770 174606 158202 124264
20063A24264L1872J53562K01066m8694o2451l1687N5696n7530n0312j70584m7576
$$ 124264 156136 309698 510764 462070 399619 367932 423628 366098 315786 145202 97626
20052I7626N1460O8718M1482L5296K0571R3406o3904j89336p1846j7889N7305
$$ 97626 149086 217804 259286 294582 315153 408559 344655 155319 83473 65584 122889
20041A22889j05568k0572k3209o9699R5451j7088k7626J43815M8399l6959J03849
$$ 122889 17321 -3251 -26460 -96159 -708 -17796 -45422 98393 146792 109833 213682
20030B13682J31466K2696r8721j44905J149K27986R8145M3022J8170r2627M7977
$$ 213682 345148 367844 269123 124218 125367 353353 451498 494520 512690 420063 468040
20019D68040L2367J21528q9851K6989J18209l4446J8297n3073R5656J59316J27809
$$ 468040 500407 621935 532084 559073 677282 642836 661133 608060 703716 863032 990841
20008I90841p9323j2387J343J6059j7591O4835J67880J35761N1802J44825O5943
$$ 990841 911518 899131 900474 916533 898942 963777 1131657 1267418 1319220 1464045 1529988
19997A529988j60996m6572N7382M3401J86313L03679L42341K66718K61358K41411
$$ 1529988 1368992 1322420 1379802 1423203 1609516 1913195 2255536 2522254 2783612 3025023
19987C025023L37607L67170L22007L60322J34630j18323M64K30971L48916L48251
$$ 3025023 3362630 3729800 4051807 4412129 4546759 4428436 4428900 4659871 5008787 5357038
19977E357038M48826Q69370J171693J399545J520218J745688J749000J988549
$$ 5357038 5805864 6675234 7846927 9246472 10766690 12512378 14261378 16249927
19969A6249927K280723K977374L533193M691498P401233J2360182K2486695L8199374
$$ 16249927 18530650 21508024 25041217 29732715 37133948 49494130 71980825 110180199
19961A10180199M2883855L6702500L1464778J7447058J1491831J0106839M61105
$$ 110180199 153064054 189766554 221231332 238678390 250170221 260277060 260738165
19954B60738165o153062k0937748l5773549l9151072l5603175l0870707k3566756
$$ 260738165 254585103 233647355 197873806 158722734 123119559 92248852 68682096
19947F8682096j4323065p236266l267164n1580L613287R563195J9555612K3377050
$$ 68682096 54359031 47122765 43855601 43804021 47417308 56980503 76536115 99913165
19939I9913165R477669n169286j1023578j4691338j7112491j4682333r398302
$$ 99913165 109390834 104221548 93197970 78506632 61394141 46711808 37313506
19932C7313506m599370j270385J320343M809873J0373858J9350850K2262880Q476322
$$ 37313506 32714136 31443751 32764094 37573967 47947825 67298675 89561555 98037877
19924I8037877n342649j0882872j4536687j6668842j4391404r756165o014419
$$ 98037877 92695228 81812356 67275669 50606827 36215423 26459258 20444839
19917B0444839l695774k351137j705662j301036r78041q79704o25119m62884m22315
$$ 20444839 16749065 14397928 12692266 11391230 10413189 9533485 8908366 8445482 8023167
19908H023167l98102n56563k90097k91806j39793m2778K61267R2261J93192L76615
$$ 8023167 7625065 7068502 6778405 6486599 6346806 6304028 6565295 6657556 6850748 7227363
19898G227363N84677J84614m5219M83869N40874N68193Q33644J127018J514779
$$ 7227363 7812040 7996654 7951435 8435304 8976178 9544371 10378015 11505033 13019812
19889A3019812K301743L300808M795582P922103J4293773K5167722L0122089J4567075
$$ 13019812 15321555 18622363 23417945 31340048 45633821 70801543 100923632 115490707
19881A15490707l899204j1727318j5986659j9216970j6972797j0837250n254343
$$ 115490707 111591503 99864185 83877526 64660556 47687759 36850509 31596166
19874C1596166j459274J716820N892283J2747591K3791764K7893111J1641082
$$ 31596166 30136892 31853712 37745995 50493586 74285350 102178461 113819543
19867A13819543n873292j2857348j7125665k0046742j7659360j1954410p150906
$$ 113819543 107946251 95088903 77963238 57916496 40257136 28302726 21151820
19860B1151820m120873k815139k156174j520635r72821p03720n81278o69599o91355
$$ 21151820 17030947 14215808 12059634 10538999 9566178 8862458 8281180 7611581 6920226
19851F920226n01593m26822m42860l66363m15542l35678k52521l96133n22591
$$ 6920226 6418633 5991811 5548951 5182588 4767046 4431368 4178847 3782714 3260123
19842C260123n5769j62713l62873n9845l9857J14902j62484j10610L9157n9920
$$ 3260123 3204354 3041641 2678768 2618923 2579066 2693968 2531484 2420874 2460031 2400111
19832B400111j37989l49631k82930p4936l4175j29478k18938o8068J7682K4097
$$ 2400111 2262122 1912491 1629561 1554625 1520450 1390972 1172034 1103966 1121648 1145745
19822A145745j23243k7450K2656j7919j06670J22609K7184J19250j5860j51357
$$ 1145745 1022502 995052 1017708 999789 893119 1015728 1042912 1162162 1146302 994945
19812I94945j82440M3514q7869n1629j3906K4823J36320M0937j05137j5830K17447
$$ 994945 812505 856019 768150 716521 702615 727438 863758 904695 799558 783728 1001175
19801A001175m3806j40120n5964j81841o2153J2895M5661m7566k9687J21755k9176
$$ 1001175 957369 817249 761285 579444 517291 530186 575847 528281 498594 620349 591173
19790E91173J6942Q9626M3727O6212J63302r4816k96355L4332k4213j7883l4099
$$ 591173 608115 697741 741468 807680 970982 876166 579811 614143 589930 572047 537948
19779E37948j52454l8933J96451L00872Q8085j00708j14951q3733j88796j9456
$$ 537948 385494 346561 543012 843884 931969 831261 716310 632577 443781 424325
19769D24325O3382j62621l7772m8520j3380j99057L874M0562r0567L6669o0880
$$ 424325 487707 325086 287314 238794 225414 26357 30231 70793 -19774 16895 -43985
19758d3985K7162J73914K23875o2364j23997n8781n0185R9911J20098j10577J00551
$$ -43985 -16823 157091 380966 318602 194605 135824 85639 185550 305648 195071 295622
19747B95622j2059r8437j69714J44188Q8210r6599o5524J78320J8605J94543l9465
$$ 295622 283563 185126 15412 159600 247810 151211 85687 264007 282612 477155 437690
19736D37690k20511r0693J50524k8047O3062o0247j19337J0707J8635M0061l30973
$$ 437690 217179 126486 277010 248963 312025 251778 132441 143148 161783 201844 -129129
19725a29129j76869J07921J66585K9690J2383M9766p3237J15274j22386O7170
$$ -129129 -305998 -198077 -31492 -1802 10581 60347 -12890 102384 -20002 47168
19715D7168J55524j8792R423R0148j88583j98259p0863R2969J75297m2133M3767
$$ 47168 202692 183900 193323 283471 94888 -103371 -174234 -81265 94032 51899 95666
19704I5666J52768J5166k4414j4259j17803Q1581q1516j69247K1993O7154j0812
$$ 95666 248434 263600 239186 224927 107124 188705 107189 -62058 -40065 27089 16277
19693A6277O7537M5036J60560O5807j09149P5360J69033J02103R9928M2084P6744
$$ 16277 83814 128850 289410 355217 246068 321428 490461 592564 692492 734576 811320
19682H11320J27405p5091k58560l9265K6928p1539l15122n0666P5870k7867k26490
$$ 811320 938725 863634 605074 565809 592737 521198 206076 155410 231280 203413 -23077
19671b3077p7011J377q7907R884K45860J4902k6781Q3962j68435j16453M1756
$$ -23077 -100088 -98711 -186618 -176734 69126 84028 57247 141209 -27226 -143679 -101923
19660a01923p2316j54387J09741R5576n1764J0085j27777J6169l0889l6346o0316
$$ -101923 -174239 -328626 -218885 -123309 -175073 -164988 -292765 -276596 -307485 -343831 -404147
19649d04147M8767M5087R1232K84522K00773l715m2610p8942j45170n8740K6942
$$ -404147 -355380 -310293 -219061 65461 266234 262519 219909 140967 -4203 -62943 -36001
19638c6001L8253R2281P2230r4502j7903L1194Q880l9197j40370J12078J48039
$$ -36001 2252 94533 166763 72261 54358 85552 94432 55235 -85135 26943 174982
19627A74982r4177r5551R864L6151K30513J94121N4026o2163o7451j0191j62176
$$ 174982 80805 -14746 -4882 31269 261782 455903 509929 447766 380315 370124 207948
19616B07948q5167j4327j25336K3407O9157L561N8881J49196J93489O4591k2752
$$ 207948 122781 108454 -16882 6525 75682 79243 138124 287320 480809 545400 522648
19605E22648j85780k28506n8549K28908J81791j57387j41968Q852k786n3974J12909
$$ 522648 336868 108362 49813 278721 460512 303125 161157 170009 167223 113249 226158
19594B26158K8945p6883o0498J34142n3106k8556j26790p7438K7168p5575M8478
$$ 226158 255103 178220 117722 251864 198758 170202 43412 -34026 -6858 -82433 -33955
19583c3955J99793j3860l9679O5048J4441K2575l4018J34351J70177n6552o2887
$$ -33955 165838 151978 112299 177347 191788 214363 180345 314696 484873 428321 365434
19572C65434J11443r7588k25860K4470R7246J24709Q7245J24071m8349k00222
$$ 365434 476877 379289 153429 177899 275145 399854 487099 611170 562821 362599
19562C62599j30308P844r63N0495j11613j96980p2959Q2049K21828R4546O2948
$$ 362599 232291 240135 239172 289667 178054 -18926 -91885 -9836 211992 306538 369486
19551C69486l8921j33865j65484k50453Q4768P8745J4205N6055o7013R2012j06726
$$ 369486 330565 196700 31216 -219237 -134469 -55724 -41519 14536 -52477 39535 -67191
19540f7191N5648J20851P8514j76498j26654M582n3628L260J42967J03988Q696
$$ -67191 -11543 109308 187822 11324 -115330 -110748 -164376 -161116 -18149 85839 94535
19529I4535Q750j54854J9689L5057J42957J3642j38742P172R5380N0494p5044
$$ 94535 103285 -51569 -31880 3177 146134 159776 21034 28206 123586 174080 99036
19518I9036n6248l7829Q9800m980j2459L2602m674K7529J03770p3224k10531m1976
$$ 99036 42788 4959 94759 89779 77320 109922 105248 132777 236547 163323 -47208 -89184
19506h9184O5510M3689o5567M7419Q4357l7524j08918m3211M3632j8951R7939
$$ -89184 -23674 20015 -45552 1867 86224 48700 -60218 -103429 -59797 -78748 19191
19495A9191o4004J6276l4315j01259L8750K75692k11945m2536N7267o8986l2868
$$ 19191 -44813 -28537 -62852 -164111 -125361 150331 -61614 -104150 -46883 -115869 -148737
19484a48737K35808L6952l2448j08906m9823J31753J34097J89495j55475p5858
$$ -148737 87071 124023 91575 -17331 -67154 64599 198696 388191 232716 156858
19474A56858J0192j24922k4397L8361k2551M2650n225J48769Q9540p8848j21189
$$ 156858 167050 42128 17731 56092 33541 76191 70966 219735 309275 230427 109238
19463A09238k20957n553N6781J10089o2187p0755J39712J28210m1635P7409o0507
$$ 109238 -111719 -117272 -60491 49598 -12589 -83344 56368 184578 142943 220352 159845
19452A59845r204J18105J58637j9704k57842M395M979j62458K20914o0087j05696
$$ 159845 150641 268746 427383 407679 149837 154232 159211 -3247 217667 157580 51884
19441E1884J08536R1354M7117o2660j18483L4796J69921K4003n0289l7754J52947
$$ 51884 160420 251774 298891 236231 117748 152544 322465 346468 296179 258425 411372
19430D11372k9797n2548l8783K11068m3936j84898j95847P0279J35652K32434
$$ 411372 381575 329027 290244 501312 457376 272478 76631 146910 282562 514996
19420E14996Q4223Q0402j36104l5715l5624J49267J9293P5502K8111J57938J39988
$$ 514996 599219 679621 543517 507802 472178 621445 640738 716240 744351 902289 1042277
19409A042277O9680J10500R8227L21569L90689M01590K70499J33092L33928K77702
$$ 1042277 1111957 1222457 1320684 1642253 2032942 2434532 2705031 2838123 3172051 3449753
19399C449753K13696K49561J49523K93965K13677L06446J68235K0486J19027K56866
$$ 3449753 3663449 3913010 4062533 4356498 4570175 4876621 5044856 5065342 5184369 5441235
19389E441235L96662P93343J118561J561177J911720K852268M157417P011583
$$ 5441235 5837897 6631240 7749801 9310978 11222698 14074966 18232383 25243966
19381B5243966J2696269K0487718J8408040R962445J2042496K0130263J8261194
$$ 25243966 37940235 58427953 76835993 86798438 98840934 118971197 137232391
19374A37232391O137138n969399p517089m361316q675729j8494621j8452212j5369939
$$ 137232391 143369529 137400130 129883041 125521725 116845996 98351375 79899163 64529224
19366F4529224j4712063j3249632r641720o036077l779340k304490j622166j119055
$$ 64529224 49817161 36567529 26925809 20889732 17110392 14805902 13183736 12064681
19358A2064681p59993n03360n21879m81555l72819l46595l81128l41364J75154
$$ 12064681 11304688 10801328 10279449 9797894 9425075 9078480 8697352 8355988 8531142
19349H531142K58062l5186m40884l68496l89234l02935o27453n19049n00081k87391
$$ 8531142 8789204 8754018 8313134 7944638 7555404 7252469 6625016 6105967 5605886 5318495
19339E318495q5530j55968p8255O6280k4519K52701K77754N12699O07668P25277
$$ 5318495 5232965 5076997 4998742 5065022 5040503 5293204 5570958 6083657 6691325 7416602
19329G416602J085444J575909K296206L423602N671399J0075425J6498986J5194767
$$ 7416602 8502046 10077955 12374161 15797763 21469162 31544587 48043573 63238340
19321F3238340Q087540R461977J6386868J5443208N338658n087962o336904l605240
$$ 63238340 71325880 80787857 97174725 112617933 117956591 112868629 106531725 102926485
19313A02926485o827689j5373244j5411399j2639663j1961116j1273349p899488
$$ 102926485 96098796 80725552 65314153 52674490 40713374 29440025 21540537
19306B1540537m935856l143749j936649j486597j224118p85395o85285o30362
$$ 21540537 16604681 13460932 11524283 10037686 8813568 8028173 7342888 6712526
19298F712526l83361l48778k48349j93224k21001l63427k93221k03776k67626
$$ 6712526 6329165 5980387 5732038 5538814 5317813 4954386 4661165 4457389 4189763
19289D189763k51961l8823j45199l24958m23587l21202l12370k91392k67353j37763
$$ 4189763 3937802 3898979 3753780 3428822 3005235 2684033 2371663 2080271 1812918 1675155
19279A675155k3601j05082n0518j03809k42947o6616J7892r9986j88037J5952
$$ 1675155 1651554 1546472 1495954 1392145 1149198 1082582 1100474 1000488 812451 828403
19269H28403j12403j47155j13526J5540J0873J05060N5817K24645J3009j54342
$$ 828403 716000 568845 455319 470859 481732 586792 642609 867254 880263 725921
19259G25921j9820N5650k37870j93289J72036K7692o0362k44864J14790J34275
$$ 725921 706101 761751 523881 330592 502628 530320 469958 225094 339884 474159
19249D74159L8452R9410n4235j22117Q6761K6870J5888M6111j22446j07434m7791
$$ 474159 512611 612021 557786 435669 522430 549300 565188 611299 488853 381419 333628
19238C33628j29134n5922j661P0753l2522M5826J17447n2131k10544m6124R0609
$$ 333628 204494 148572 146911 217664 185142 230968 348415 296284 85740 39616 130225
19227A30225L1971J88804O0098k00823j23125J44841K09483M7396k9674j03001
$$ 130225 162196 351000 411098 210275 87150 231991 441474 488870 459196 356195
19217C56195n587j46065N6209Q4377j99347o2028R5409j15379j21325J46537J93213
$$ 356195 350608 204543 260752 345129 145782 83754 179163 63784 -57541 88996 282209
19206B82209J01616J8235q9147J19930k9842j45277q3687n6903k3345o1722j02770
$$ 282209 383825 402060 312913 432843 403001 257724 174037 117134 93789 32067 -70703
19195g0703m002J24120p0815L933P8433j646L5277N2557m1017K0382J12376j37538
$$ -70703 -74705 49415 -21400 -17467 60966 59320 94597 147154 106137 126519 238895 101357
19183A01357k10993j22682k15563J42493P1126J37155J7551N7950l9712m7004
$$ 101357 -109636 -232318 -447881 -305388 -234262 -97107 -79556 -21606 -61318 -108322
19173a08322Q3084j18433n1834J64389L4732j41179k97186L3212J84099O5734
$$ -108322 -25238 -143671 -195505 -31116 3616 -137563 -434749 -401537 -217438 -151704
19163a51704J68122K2071j28559q8427J8795j10680N2206m995J1415J75598J29972
$$ -151704 16418 38489 -90070 -178497 -159702 -270382 -218176 -223171 -211756 -36158 93814
19152I3814J7272o3390j29603N0214K52034m6365j17074j06201j06741M8456L4018
$$ 93814 111086 47696 -81907 -31693 220341 173976 56902 -49299 -156040 -107584 -73566
19141g3566l6030j35121N5267L89876J44383p438j23929j63355R7707m6341j03824
$$ -73566 -109596 -244717 -189450 200426 344809 337371 213442 50087 147794 101453 -2371
19130b371l6537N0894m2058q6175m345q085R36m2398l0871n4212j14807l1999
$$ -2371 -38908 11986 -30072 -116247 -120592 -128677 -127741 -170139 -201010 -255222 -370029 -402028
19118d02028J89322K52651j04780j47113J12134R2587m1469l4965m1636K18471
$$ -402028 -212706 39945 -64835 -211948 -99814 -7227 -48696 -83661 -125297 93174
19108I3174Q627j37249R3134o3387Q6127J24254K857j24120j20016k9906j2318
$$ 93174 101801 -35448 57686 -5701 80426 204680 207537 83417 -36599 -66505 -78823
19097g8823J24916J40122J0775O2378j67990j96464J34540k5790j40371o9703
$$ -78823 46093 186215 196990 259368 91378 -105086 29454 3664 -136707 -206410
19087b06410l8529r8156K3069l5703j47018J12436Q0854K75760R7197L5542j70314
$$ -206410 -244939 -343095 -320026 -355729 -502747 -390311 -309457 -33697 63500 99042 -71272
19076g1272k6032m4680N8536J16552j54997m9430j8566J56803P3534O1062L9847
$$ -71272 -97304 -141984 -83448 33104 -121893 -171323 -189889 -33086 40448 101510 141357
19065A41357j13618r9727M7107L4433L3366J55279P0883j38286k85142j52588
$$ 141357 27739 -71988 -24881 9552 42918 198197 269080 130794 -154348 -306936
19055c06936l7304j0612J61454M2724L1496n0301n6450J49287j21510M451K19098
$$ -306936 -344240 -354852 -193398 -150674 -119178 -169479 -225929 -76642 -198152 -193701 25397
19044B5397M6336k33050J8571L1834O1812o890P6327n1290j09246J9924m2717
$$ 25397 71733 -161317 -142746 -110912 -49100 -55990 20337 -30953 -140199 -120275 -162992
19033a62992J8455J56949Q934J4948j31942n7099O7476M0268j53914J68822M6563
$$ -162992 -144537 12412 21346 36294 -95648 -152747 -85271 -45003 -198917 -30095 16468
19022A6468j99099p4197m9928J24810J88998l6585l17413l2010J50437J93168
$$ 16468 -182631 -256828 -306756 -181946 7052 -29533 -346946 -378956 -228519 -35351
19012c5351q392n8856R6490l4780J05773M0883O3912K4055j1822k2320q6907k20842
$$ -35351 -43743 -102599 -6109 -40889 64884 105767 169679 193734 181912 159592 72685 -148157
19000a48157P1541L6577L2128q1185L4758J72455R8742q3379j1128o8314O7240
$$ -148157 -76616 -40039 -7911 -89096 -54338 118117 216859 133480 122352 54038 121278
18989A21278l7226l5487j01476n796M3497K846j28471p8660N6627j7711j45511
$$ 121278 84052 48565 -52911 -58707 -15210 -12364 -140835 -219495 -162868 -180579 -326090
18978c26090p2681K35881L11989j08330k02348O1855J00288K2401m4927n5481
$$ -326090 -398771 -162890 149099 40769 -161579 -99724 564 22965 -21962 -77443
18968g7443J18526Q0609p8940k7777L006J6595n7640j16745N3628N4140J24733
$$ -77443 41083 121692 42752 14975 17981 34576 -23064 -139809 -86181 -32041 92692
18957I2692q722k812r2089j3587n6007j61136Q255o915n9845n9357J29691J74159
$$ 92692 83970 81158 -10931 -24518 -80525 -241661 -233406 -240321 -300166 -359523 -229832 -55673
18945e5673j17728k6235K71225P2215j14322J3876p9594o3963J64845Q8054j4760
$$ -55673 -173401 -199636 71589 143804 29482 43358 -36236 -100199 64646 152700 137940
18934A37940q5833M6107J10933J51779j16947j36419p6024L9734L3380p5020j31322
$$ 137940 52107 98214 209147 360926 243979 107560 31536 71270 104650 29630 -101692
18923a01692Q2283J4383K4117L0226J0169l6800q1985P0805r9598q0800j51097
$$ -101692 -19409 -5026 19091 49317 59486 22686 -59299 11506 -88092 -168892 -319989
18912c19989K188n2608J70771O7508j17658J01709K26261R1629K5318m1314n8657
$$ -319989 -317801 -370409 -199638 -132130 -249788 -148079 78182 169811 195129 153815 95158
18901I5158j18651J8377J08798n8708j13804j83169K8834J56026o0944M3706R3415
$$ 95158 -23493 -5116 103682 44974 -68830 -251999 -223165 -67139 -128083 -84377 9038
18890I038J8267m3543j40300Q860M1029j5766l4021M7689J15017L9142J41223
$$ 9038 27305 -16238 -156538 -147678 -106649 -122415 -156436 -108747 6270 45412 186635
18879A86635R0850j8177L5163k03617j93408m6292q3533j19647J05171J97576
$$ 186635 277485 259308 294471 90854 -102554 -148846 -232379 -352026 -246855 -49279
18869d9279j34079p6950N5497K02931p2229M4452L0636k43996R4410J34350O1090
$$ -49279 -183358 -260308 -204811 -1880 -74109 -29657 979 -243017 -148607 -14257 46833
18858D6833J38658r0489o6512L8391o020Q9361j8157q6790j47942J34777L8689
$$ 46833 185491 95002 28490 66881 60861 150222 132065 45275 -102667 32110 70799
18847G0799j00223n6142N0062N7725m706J99993K53052J2066J64957J96124p1298
$$ 70799 -29424 -85566 -35504 22221 17515 217508 470560 482626 647583 843707 772409
18836G72409l2648O2733j37886r3370k466j52094k63591m6297O0321j91931m0780
$$ 772409 739761 802494 664608 571238 568772 416678 153087 106790 167111 -24820 -65600
18825f5600J02759p7547j0984l4111q4002Q6307R5001n1428r5894J8856L4222
$$ -65600 37159 -40388 -51372 -85483 -169485 -83178 11823 -39605 -135499 -116643 -82421
18814h2421p2269n5477J93100J9076j01113k5998J30414l1532K7523L4292J6462
$$ -82421 -154690 -210167 -17067 2009 -99104 -125102 5312 -26220 1303 35595 52057
18803E2057k6180J10943j00629j03561j17976p7640K995J55147K16206M6005k7834
$$ 52057 25877 136820 36191 -67370 -185346 -262986 -259991 -104844 111362 157367 129533
18792A29533N2871j46184o6349Q8748J27788O8997o8429J9307K9658k2987o392
$$ 129533 182404 36220 -30129 58619 186407 255404 186975 206282 235940 212953 206561
18781B06561O6218K47403K26088r6172q2735q0436J13729M9342j13368q8990r1743
$$ 206561 272779 520182 746270 650098 567363 486927 600656 649998 536630 447640 355897
18770C55897p274O2572N2341P9896K46361M05999M12307R9979k01771L19k15830
$$ 355897 348623 411195 463536 543432 789793 1195792 1608099 1708078 1506307 1506626 1290796
18759A290796m11267k17317l37777k68876r3962j35071J70431J13397j44429j10351
$$ 1290796 879529 662212 324435 55559 -38403 -173474 -3043 110354 -34075 -144426
18749a44426M5659J25142L3271J98909K2094l5491j74375p3510N3555O4192J88111
$$ -144426 -98767 26375 59646 258555 280649 245158 70783 -2727 50828 115020 303131
18738C03131O0588r0193O8764l1075j46222n7256l1356P4008j63045l3747J85405
$$ 303131 363719 273526 342290 311215 164993 107737 76381 150389 -12656 -46403 139002
18727A39002q8870M5364M4155j04211q7947r655k7694M0757O8652n7434n516R0667
$$ 139002 50132 95496 139651 35440 -52507 -62162 -89856 -49099 19553 -37881 -43397 47270
18715D7270O3580J0916K09732P4100Q525m6768j75814j16591j03178m412l846
$$ 47270 110850 121766 331498 405598 414123 367355 191541 74950 -28228 -32640 -36486
18704c6486P6295J03614o7060n5964j01089n566K4375O9266p9971j7907N7856
$$ -36486 39809 143423 76363 20399 -80690 -86256 -61881 7385 -72586 -90493 -32637
18693c2637P184p3163q8280J25648J83783m6129l8972K3940j68582J02113P6379
$$ -32637 -25453 -98616 -186896 -61248 122535 76406 37434 61374 -107208 -5095 71284
18682G1284n4151j08691J24176O3238j6790p8239k11759l6682J13770k0809M5379
$$ 71284 17133 -91558 32618 95856 79066 827 -210932 -247614 -133844 -154653 -109274
18671a09274L8369n4789k1393O9140o3292N0335J06337J4208k91156q9722J37155
$$ -109274 -70905 -125694 -147087 -77947 -141239 -90904 15433 29641 -261515 -351237 -214082
18660b14082J42218m8993j24434N3272J90135J50221Q0485j14571k2549n8350
$$ -214082 -71864 -120857 -245291 -192019 -1884 148337 228822 114251 91702 33352
18650C3352k0913M4917q1521p0211r0246l9835o2066p7136O3362N3420q491J78119
$$ 33352 12439 57356 -24165 -94376 -184622 -224457 -286523 -363659 -300297 -246877 -255368 -77249
18638g7249J68394j990M94O3510K3592j68871M736p4546j902l7292K45970J32952
$$ -77249 91145 89155 89649 153159 176751 7880 12616 -61930 -63832 -101124 144846 277798
18626B77798q361K9537j79524j84894j28232J21724J32686O6037o1907o3836J03907
$$ 277798 269437 298974 119450 -65444 -193676 -71952 60734 126771 64864 1028 104935
18615A04935O408j04779J23572N497l02471j2969P3633n4576L1439R8311q209
$$ 104935 111343 6564 130136 135633 -166838 -179807 -106174 -160750 -129311 -31000 -39209
18604c9209N0746J22545m2085J2114k1467m0691M3565P4271N9555n4513p8338
$$ -39209 11537 134082 91997 104111 82644 41953 85518 159789 219344 164831 86493
18593H6493j50438r5861J05484J88660J22535O4553K0291r6112n9092o5214n8858
$$ 86493 -63945 -159806 -54322 134338 256873 321426 341717 245605 186513 121299 62441
18582F2441j9875j59869j0203K0671O9862J0114M1204j16536k48434m4830R2307
$$ 62441 42566 -117303 -127506 -106835 -36973 -26859 14345 -102191 -350625 -395455 -303148
18571c03148l9998Q6387K45243j1983j75091o2433J19815O6818L1152J04889j10698
$$ -303148 -343146 -256759 -11516 -23499 -198590 -261023 -141208 -74390 -43238 61651 -49047
18560d9047m3607k4894K25003J72417k0760p6318l0116p3904K6014k05499j92965
$$ -49047 -92654 -117548 107455 279872 259112 182794 152678 78774 104788 -100711 -293676
18549b93676N4976R5597n0787n0628o472J68324J62840J03513k6200r4819o9486
$$ -293676 -238700 -143103 -193890 -244518 -250990 -82666 80174 183687 157487 62668 -6818
18538f818r9078j50655K64053J47943k1479j18823j41126n4004M9426K47444K35437
$$ -6818 -105896 -256551 7502 155445 133966 15143 -125983 -179987 -130561 116883 352320
18527C52320l7815m0045J77122O50P1967j6468j77044j02549k25052j15219K2129
$$ 352320 314505 274460 451582 452232 524199 507731 330687 228138 3086 -112133 -90004
18516i0004J3816Q0272j23648j9767P2217O6116j56317o5944L2836K59430O0217
$$ -90004 -76188 4084 -119564 -139331 -67114 -998 -157315 -223259 -190423 69007 129224
18505A29224n6805j73290N124R2110o6257L4402J43260k0657k62739j38511N7984
$$ 129224 72419 -100871 -95747 -3637 -69894 -35492 107768 87111 -175628 -314139 -256155
18494b56155J50779k8849Q8747p3060L2716N4170L6691n8072q6871P9211j19187
$$ -256155 -105376 -134225 -45478 -118538 -85822 -31652 5039 -53033 -139904 -60693 -179880
18483a79880P643P554m7878P9814J41384J28523q2965j31551m7869l8019K2762
$$ -179880 -172237 -164683 -212561 -132747 8637 137160 54195 -77356 -125225 -163244 -140482
18472a40482Q5298n218L0631N3827Q7390q0091n3321O3037r9032l26785j95722
$$ -140482 -55184 -60402 -29771 24056 111446 31355 -21966 41071 -57961 -384746 -580468
18461e80468J20928J70385J31116R455O9276o9844o4833M3688R5045J37590J52545
$$ -580468 -459540 -289155 -158039 -148584 -79308 -149152 -213985 -170297 -75252 62338 214883
18450B14883j08971o0655p5083k2777j8932j40721j46981k6950j8215K21173Q6376
$$ 214883 105912 45257 -29826 -52603 -71535 -212256 -359237 -386187 -404402 -183229 -96853
18439i6853O3397n615M9809J24592k0826o8023j26002j33412K6642j60471j5420
$$ -96853 -33456 -39071 10738 135330 114504 46481 -79521 -212933 -186291 -346762 -362182
18428c62182n1683O4532J39096J54788p0660j94575J7389J01861Q9158J8223k02509
$$ -362182 -413865 -349333 -210237 -55449 -126109 -320684 -303295 -201434 -112276 -94053 -296562
18417b96562k9907J44927J48982K0457q8101l2050j11116J94926R0869m2853J59340
$$ -296562 -326469 -181542 -32560 -12103 -100204 -132254 -243370 -48444 42425 -428 158912
18406A58912r7635l01342O8484J33205Q774J30048K07724J08303j01243k30612
$$ 158912 61277 -240065 -171581 -38376 -29602 100446 308170 416473 315230 84618
18396H4618J6151p6141M3449p2926K9507N3119Q4199m4538n2262p6628O6868L2315
$$ 84618 100769 24628 68077 -4849 24658 77777 161976 117438 65176 -11452 55416 87731
18384H7731P586N448J1676j28292k9745m452j17979P6418J60306J35916M1194
$$ 87731 95317 100765 112441 -15851 -45596 -50048 -168027 -91609 68697 204613 245807
18373B45807l2381q9574j92768L8893L5159q2961j81439j8546N8606l080R7268
$$ 245807 213426 123852 -68916 -30023 5136 -77825 -259264 -277810 -219204 -222284 -125016
18362a25016K46058K80679J75387j58103k09988K276j17618r6130o5855J66685
$$ -125016 121042 401721 577108 419005 209017 211293 93675 -2455 -68310 98375
18352I8375O4840J3792j03057R1427K3111j41309m5877N6532R4450r2101L0472
$$ 98375 163215 177007 73950 165377 188488 47179 1302 57834 152284 60183 90655
18341I0655p4643M6832j53826j25164K74965J68792j8112k8438k5206R6877q284
$$ 90655 16012 62844 -90982 -216146 58819 227611 209499 181061 155855 252732 244448
18330B44448j61917m6415K73267R4158j50968m0466n3848j32428j72688J63505
$$ 244448 82531 36116 309383 403541 252573 212107 158259 25831 -146857 16648
18320A6648K03661o0305o5361l0509l9252J57207n8497p5970Q5502N5815j857
$$ 16648 220309 160004 94643 64134 24882 182089 123592 47622 133124 188939 187082
18309A87082J4658j22775J82k0388n6972o9460N0776j39711j31078L6177K34099
$$ 187082 201740 78965 79147 58759 1787 -67673 -16897 -156608 -287686 -251509 -17410
18298a7410K84266L79054J33115j87463k46584j82024r5359k7559j27020k77676
$$ -17410 266856 645910 779025 591562 344978 162954 67595 40036 -86984 -364660
18288c64660q2499j78R2588J21957N3882R4087o0265o5133j57119q8900j0999
$$ -364660 -447159 -447337 -354749 -232792 -178910 -84823 -145088 -210221 -367340 -456240 -467239
18277d67239J56846O8361K11290J4481j76387j40255k3731K7595J40571K27151
$$ -467239 -310393 -242032 -30742 -16261 -192648 -332903 -356634 -329039 -188468 38683
18267C8683N7748L2649j57982q4751Q8129J2789j59245o5783m0366J03948N7346
$$ 38683 96431 129080 -28902 -113653 -25524 -12735 -171980 -237763 -278129 -174181 -116835
18256a16835R6757O3944m3144m9653N0148j8249r1836N604o8578r9452q8133O3871
$$ -116835 -20078 43866 722 -48931 1217 -17032 -108868 -103264 -171842 -271294 -359427 -295556
18244b95556J14687o5365k8589J91311p1420l5548J3002j09195n1796n555K33898
$$ -295556 -180869 -246234 -274823 -83512 -154932 -190480 -177478 -286673 -338469 -344024 -110126
18233a10126K58823K9171j09862P4783J37029J4932M7630j6912j30686l54590
$$ -110126 148697 177868 68006 142789 279818 294750 342380 325468 194782 -159808
18223a59808j30646K1181J73555O4373m0630Q7589j6592Q8822q6671m6765L4616
$$ -159808 -290454 -269273 -95718 -31345 -71975 15614 -978 87844 1173 -45592 -10976
18212a0976M1389R4244R1459o3573O3519j71589K52975K06579j42568k3231N3625
$$ -10976 30413 124657 216116 152543 216062 44473 297448 504027 361459 338228 391853
18201C91853j65231j89371k03610j25428J71782Q4662r958j47562O0416K2094
$$ 391853 226622 37251 -166359 -291787 -120005 -35343 -45301 -192863 -132447 -110353
18191a10353J49059j3569o0211j8473k4621j39424p8414Q9371m5594M0424K04298
$$ -110353 38706 25137 -35074 -53547 -78168 -217592 -296006 -206635 -252229 -211805 -7507
18180g507N4621q268j15765j54318R1185P7950L9823J32689K5481J1627O3493
$$ -7507 47114 38846 -76919 -231237 -140052 -62102 -22279 110410 135891 147518 211011
18169B11011N8562M0316n4823j36842r2237k6276J1048R3453n7035m9512R5671
$$ 211011 269573 309889 255066 118224 25987 -289 10759 104212 47177 -2335 93336
18158I3336J45369j2658k8441l499J6522p6641K56669J41458n0195q1613j58613
$$ 93336 238705 226047 197606 194107 210629 133988 390657 532115 481920 400307 241694
18147B41694L9797L5829N0460Q1736O2878K9486J2611O7N5021J54464k1975J77727
$$ 241694 281491 317320 367780 449516 512394 541880 554491 554558 609579 764043 742068 919795
18135I19795J48309O2980N8136J0428J10383N6366N660J90562K47778L34652L49699
$$ 919795 1068104 1131084 1189220 1199648 1310031 1366397 1372057 1562619 1810397 2145049 2494748
18124B494748L77371M79371P33909N77213N03896O49602Q48243J034718J397708
$$ 2494748 2872119 3351490 4085399 4662612 5166508 5816110 6664353 7699071 9096779
18115I096779J865961K959558L892561N389275P561383J1861459K0298671L9681962
$$ 9096779 10962740 13922298 17814859 23204134 30765517 42626976 62925647 102607609
18107A02607609Q3298958J03756426J9625791k6912495l7175276m9332948o1766513
$$ 102607609 185906567 289662993 309288784 282376289 245201013 195868065 134101552
18100A34101552m8612969k8217041j5574380r067152o043611m386317l339471
$$ 134101552 85488583 57271542 41697162 32630010 26586399 22200082 18860611
18093A8860611k434324j954582j749553j472207j076133q10263p83570o95968
$$ 18860611 16426287 14471705 12722152 11249945 10173812 9363549 8579979 7884011
18085G884011p40498o66979m94180m53783m57038m21655l66312l30950k65716
$$ 7884011 7143513 6476534 5982354 5528571 5071533 4649878 4283566 3952616 3686900
18076C686900l06244l80693j65923j64544j02755k13932M030j19426j64257j27945
$$ 3686900 3380656 2999963 2834040 2669496 2566741 2352809 2356839 2237413 2073156 1945211
18066A945211j55184j80714L7154j79057j62932k33148o0368M8474J47305l3402
$$ 1945211 1790027 1609313 1646467 1467410 1304478 1071330 1010962 1059436 1206741 1173339
18056A173339j68215r1866r3307j86402j44068P6285r403k05408J90588J20383
$$ 1173339 1005124 913258 819951 633549 489481 565766 556363 350955 541543 661926
18046F61926K19795j70304j16603J1284J81680j35097j61285K2771O8580p866
$$ 661926 881721 711417 594814 606098 787778 652681 491396 514167 582747 574881
18036E74881o9376j45177p114l463k9485N6536J06469P7587M2821r2251j38862
$$ 574881 505505 360328 353214 349751 320266 376802 483271 560858 603679 511428 372566
18025C72566j15302J64581m1591j25579K15330O2192j48877k13837J23709Q3626
$$ 372566 257264 421845 380254 254675 470005 532197 383320 169483 293192 376818
18015C76818j35229L8238R4509K5857l4147m0971L8937j31166o1971J03406n5072
$$ 376818 241589 279827 374336 400193 366046 325075 364012 232846 170875 274281 219209
18004B19209m7318P782n845p3150p5940k0410j28014J8929J97053Q3456o1060
$$ 219209 171891 179673 173828 100678 24738 4328 -123686 -104757 92296 175752 114692
17993A14692j9664J64683M7613j03596J5761l0099K77989J4628p2030j60322q7620
$$ 114692 95028 259711 307324 203728 219489 189390 467379 482007 409977 249655 162035
17982A62035j9600j85928J34296l1902J06069n4542j149K63030k9495k38664P6438
$$ 162035 142435 -43493 90803 58901 164970 110428 109279 372309 342814 104150 180588
17971A80588K73919P2820j84969k0612k0961k2562Q5915P1158J30590o5881K218
$$ 180588 454507 527327 342358 321746 300785 278223 364138 435296 565886 500005 502223
17960E02223o3619k60451k08873m246K63688J52503Q922o2872J4844j9375m5751
$$ 502223 438604 178153 -30720 -34966 228722 381225 390147 327275 342119 322744 276993
17949B76993M597L5551l4060O5054k09536j14284R6989N3999J7581J5298j02306
$$ 276993 281590 317141 283081 348135 138599 24315 121304 175303 192884 208182 105876
17938A05876j30932n8221K10235O9664r370J4073Q6843k21175O8722K23275n246
$$ 105876 -25056 -83277 126958 196622 187252 201325 288168 66993 135715 358990 353744
17927C53744K8965K26J30421q0374l0949j16392M8727L4349j60578o6897o9117
$$ 353744 382709 382935 513356 432982 402033 285641 334368 368717 208139 141242 72125
17916G2125m7055k63337j31337L1856R5765J70135L5536n006k00071r5241J61196
$$ 72125 25070 -238267 -369604 -337748 -241983 -71848 -36312 -41318 -241389 -336630 -175434
17905a75434J35353P1365l7544j58876J05950R1591o9190q0736M6689L8113m0734
$$ -175434 -40081 31284 -6260 -165136 -59186 32405 -36785 -117521 -70832 -32719 -73453
17894g3453P8293K6968o6629k07466J0035m3194M4606K38989K1226L1539J45243
$$ -73453 4840 31808 -34821 -242287 -232252 -275446 -230840 8149 29375 60914 206157
17883B06157R1375j88897j43133Q3964P7327n452J7775n7173j27602K5413q5348
$$ 206157 297532 108635 -34498 49466 126793 121341 139116 81943 -45659 -20246 -105594
17872a05594p1042O3067M5665J87183O4931p2522o9351L9548J60786J53140J6687
$$ -105594 -176636 -113569 -67904 119279 184210 111688 42337 81885 242671 395811 412498
17861D12498p3772r7376j35338l5919j4860L8104j9586J5650j25908J1801J41137
$$ 412498 338726 241350 106012 70093 55233 93337 73751 89401 -36507 -24706 116431
17850A16431k1886l0624m7665J08225J9206j5279j01182r2635J31742Q3144j4205
$$ 116431 94545 63921 16256 124481 143687 128408 27226 -65409 66333 149477 135272
17839A35272j81102r3207N5735N4580j32173P8517k9817J6967j10909j03958J22420
$$ 135272 -45830 -139037 -83302 -28722 -160895 -82378 -112195 -95228 -206137 -310095 -187675
17828a87675l3911J68271p2774k52299q4278K10918K50267j06871k81646M1120
$$ -187675 -221586 -53315 -126089 -378388 -462666 -251748 -1481 -108352 -389998 -348878
17818c48878R7168J37419R0902R5159J19563L8166r0439j41937l7710N5513J4123
$$ -348878 -251710 -114291 -23389 71770 191333 229499 139060 -2877 -40587 14926 29049
17807B9049o6738j62032K8415k140O7514J69116j25626k782o2697k6614n4988
$$ 29049 -37689 -199721 -171306 -173446 -105932 63184 -62442 -65224 -127921 -154535 -209523
17796b09523K05630J43831J24794o0339k53751j09870J56064n5909q835M137l6642
$$ -209523 -3893 139938 264732 204393 -49358 -159228 -3164 -59073 -67908 -63771 -100413
17785a00413J07262J80412m6250j61404O0522J09112M6374j87508j11272J09640
$$ -100413 6849 187261 141011 -20393 40129 149241 195615 8107 -103165 6475
17775F475q5810R910J32838j6488q419p2421O1328P0374K6050L209r2611j98489
$$ 6475 -79335 -69425 63413 46925 38506 -33915 27413 97787 123837 127046 34435 -164054
17763a64054Q6995J27851M0758r9507m750J23815K8772K27698K6031k50752N3355
$$ -164054 -77059 50792 91550 -7957 -12707 111108 139880 367578 393609 142857 196212
17752A96212N1771k31747o3105N4752r7301r6872p5096J07746J03335o665j63577
$$ 196212 247983 16236 -46869 7883 -89418 -186290 -261386 -153640 -50305 -56970 -220547
17741b20547O8078m7398o3196J1511K0051k23741j9293J11021J69870P2743R1709
$$ -220547 -152469 -199867 -263063 -251552 -231501 -455242 -474535 -363514 -193644 -120901 -29192
17730b9192n1292j08070j5041J83673J11135q260j58066j06071O3618M7673K58716
$$ -29192 -80484 -188554 -203595 -19922 91213 82953 -75113 -181184 -117566 -69893 188823
17719A88823J48896l6763r7945J8558K2686o8754m5517j97359Q2915j05227O8289
$$ 188823 337719 300956 203011 221569 244255 175501 129984 -67375 15540 -89687 -21398
17708b1398J67884J49857k8206j53637n0472o7280o8842p4806j11190J58370J51373
$$ -21398 146486 296343 268137 114500 64028 -3252 -72094 -146900 -258090 -99720 51653
17697E1653m3572j8505k7032n8080j35889O3343J45562P6122k0902l931Q759N1392
$$ 51653 8081 -10424 -37456 -95536 -231425 -168082 -22520 53602 32700 28769 37528 88920
17685H8920J04688j00925j72429q7367J15083J09572j41103J10192P2725m7383
$$ 88920 193608 92683 -79746 -167113 -52030 57542 -83561 26631 99356 51973
17675E1973n315q7119j51177q9378J00976M0871J07753N4556k22467q3564K1296
$$ 51973 46658 -40461 -191638 -281016 -180040 -139169 -31416 23140 -199327 -282891 -261595
17664b61595k1436K1198L7612l0761J35647J90134K387j65464p8451J0336l9197
$$ -261595 -283031 -261833 -224221 -254982 -119335 70799 73186 -92278 -170729 -160393 -199590
17653a99590k1579P657J65938Q1417M6543J3584Q1162J62786j44406k22167P196
$$ -199590 -221169 -213512 -47574 33843 80386 93970 175132 337918 193512 -28655 -21459
17642b1459Q1090K7274k8113q3496k2963P8137L6660P5366r2172l325n749J45401
$$ -21459 59631 86905 58792 -24704 -47667 30470 67130 142496 50324 46999 41250 186651
17630A86651O1611Q3570k9806q9524j57283k08430O3663L6315N6826j0792r2478
$$ 186651 248262 331832 302026 212502 55219 -153211 -89548 -53233 3593 -7199 -99677
17619i9677K8141p3102j72830J33066l2739q0813J2777J20420M0605L3403J26788
$$ -99677 -71536 -144638 -317468 -184402 -217141 -297954 -285177 -164757 -124152 -90749 36039
17608C6039m7364k04795K8201J45090Q238n8299J87301J02691k9394k1856m0684
$$ 36039 -11325 -216120 -187919 -42829 -34591 -92890 94411 197102 167708 145852 105168
17597A05168n767J8906k02498k49119N2501L18347J35094n3966p5130p0925O9029
$$ 105168 99401 118307 -84191 -333310 -280809 37538 172632 118666 43536 -27389 41640
17586D1640O648r8354M9354J76018p784J7207j09859k06189n1522P0719O4524
$$ 41640 48288 -50066 -712 175306 167522 184729 74870 -131319 -182841 -112122 -47598
17575d7598R30j88021r0172J23594O8602o3353J14109J37985L0704L328J38431
$$ -47598 -46668 -234689 -324861 -201267 -132665 -196018 -81909 56076 86780 90108 228539
17564B28539m3310j01321j52556j34387Q2275J89110J1625n6182M2892o6880k21679
$$ 228539 185229 83908 -68648 -203035 -120760 68350 79975 23793 66685 -195 -221874
17553b21874Q7697P7604p2969p0742k7731K3009j06380J67791Q9905j41915m2934
$$ -221874 -134177 -56573 -129542 -200284 -228015 -205006 -311386 -143595 -53690 -195605 -238539
17542b38539P9697P7453l6550N3284J3478k08843j46792P0150J85230K3025J17960
$$ -238539 -158842 -81389 -117939 -64655 -51177 -260020 -406812 -336662 -151432 -128407 -10447
17531a0447P379k3894j1092Q5226P7425O0917L4398m4784p1866o0889k7962n404
$$ -10447 -3068 -26962 -38054 47172 124597 185514 219912 175128 103262 42373 14411 9007
17519I007m1989K16564L8794o4754m2338J8700o69p9127Q3214j0238p6086m5671
$$ 9007 -32982 183582 222376 157622 115284 133984 133315 54188 137402 127164 51078 5407
17507E407o9049J07205j08128k3831r4780K1741M9600N0560K65996L3621K3774
$$ 5407 -63642 43563 -64565 -88396 -183176 -161435 -111835 -61275 204721 238342 262116
17496B62116O2748j84271j51234m203Q9430J17075k00238M9164m4990o8724P5040
$$ 262116 324864 140593 -10641 -14844 74586 191661 -8577 40587 -4403 -73127 1913
17485A913M7179O6931j7760m4163k1296j98665k8405o4547K04195l9459j54081
$$ 1913 49092 116023 98263 54100 32804 -165861 -194266 -258813 -54618 -94077 -248158
17474b48158K61613J90273P4529o5673j44896j12317m7612Q2602K3681j49n5687
$$ -248158 13455 203728 278257 212584 67688 -44629 -92241 -9639 14042 13893 -41794
17463d1794K2075K9673J19211l0618J71257M8875j41198k48632k39363J34329
$$ -41794 -19719 9954 129165 98547 269804 318679 177481 -71151 -310514 -176185
17453a76185J47779J47981q381k18931j1043p445M8606M3750J62195K41988J73202
$$ -176185 -28406 119575 111194 -107737 -118780 -126225 -77619 -33869 128326 370314 543516
17442E43516J62024L49955M93951K53727j81971k59116k25956l39066l09037m5878
$$ 543516 705540 1055495 1549446 1803173 1621202 1362086 1136130 797064 488027 442149
17432D42149L690K3649j80464j85970j0770j4447J7440n430J7407l8822q8652
$$ 442149 445839 469488 289024 103054 92284 77837 95277 89847 107254 68432 -20220
17421b0220K5500J32648K06390r461k18866j52895Q8856J85039n0368r626m8654
$$ -20220 5280 137928 344318 334857 115991 -36904 51952 236991 186623 176997 128343
17410A28343j39044J19841J55344L4808k22644P21O9310J03974Q8226m047o5312
$$ 128343 -10701 109140 264484 299292 76648 77369 146679 250653 338879 334832 269520
17399B69520o1589Q2714r7167j25450j39150J2673k4940J0450o7928j3130J37133
$$ 269520 207931 290645 193478 68028 -71122 -58449 -83389 -72939 -140867 -153997 -16864
17388a6864K27047n931p0484n8598p4265N9630J8117q7693o45j32632p880Q7198
$$ -16864 210183 204252 133768 75170 905 60535 78652 -9041 -9686 -142318 -150198 -63000
17376f3000N2561o6738k1501K21185p9818r4455j44137l9382P2234J60558m1090
$$ -63000 -10439 -77177 -98678 122507 42689 -51766 -195903 -235285 -163051 -2493 -43583
17365d3583m152K07477O2339j72180k47299N611J22006J08554l9187k71855R9869
$$ -43583 -47735 159742 222081 49901 -197398 -191787 -69781 38773 -414 -272269 -172400
17354a72400Q9620k3772l2797j18309O2250J07610j2659j39916j19378j8501J5804
$$ -172400 -82780 -106552 -139349 -257658 -195408 -87798 -100457 -240373 -359751 -378252 -362448
17343c62448K04178k2039N8763K2154J3451J08497j17198q5893j10803j39322
$$ -362448 -158270 -180309 -121546 -99392 -85941 22556 -94642 -180535 -291338 -430660
17333d30660L9630K76325K23036J24438Q2463j6752j36703j75090R6608L569L431
$$ -430660 -391030 -114705 108331 232769 315232 298480 161777 -13313 83295 86864 90295
17322I0295j0573j59733j16585K00399o2218o0450k0656M5025J79079q4649j77688
$$ 90295 79722 -80011 -196596 3803 -58415 -118865 -139521 -94496 84583 -66 -177754
17311a77754J08551P9503J3818L87L1953R0888m5304j07805r6584n8815j8718
$$ -177754 -69203 10300 24118 24505 56458 147346 102042 -5763 -102347 -161162 -179880
17300a79880J32497K28896J35288O7201q0126k84538o2371j09950n2905J47359
$$ -179880 -47383 181513 316801 384002 303876 19338 -43033 -152983 -205888 -58529
17290e8529p1902q7998R7904J36172N932n7345L0452l9443J61034p2111q6453
$$ -58529 -130431 -218429 -120525 15647 21579 -35766 -5314 -44757 116277 44166 -42287
17279d2287M2990k7478Q3673N300k00005n972n2375O42J83857J42746P2131n9219
$$ -42287 703 -26775 56898 62198 -137807 -143779 -196154 -195512 -11655 131091 203222 144003
17267A44003J63781q2178k11192k9247M5885j09299K3373j02011j16023R9875
$$ 144003 307784 225606 14414 -14833 31052 -78247 -54874 -156885 -272908 -173033
17257a73033M5253l2427O5904n740l0787K4603K15914R5809m1465j33460q0589
$$ -173033 -127780 -160207 -94303 -100043 -130830 -106227 109687 205496 164031 30571 -50018
17246e0018j80293q4032L7815Q0410p0200n6196o6231J2165J38309L2530J2307
$$ -50018 -230311 -314343 -276528 -196118 -266318 -322514 -388745 -376580 -238271 -205741 -193434
17235a93434J03666J54739j25459j01554O5449o4738r0652N9000P5781j3705j26281
$$ -193434 -89768 64971 -60488 -162042 -96593 -161331 -251983 -192983 -117202 -130907 -257188
17224b57188K729N8783j73302j32765O5491Q6144J16404Q1417J13521N9834n7646
$$ -257188 -254459 -195676 -368978 -501743 -436252 -350108 -233704 -152287 -38766 21068 -36578
17213c6578k9537p3728j59833L3668Q2374K3854o5484m4176J24202J88038j7389
$$ -36578 -66115 -139843 -299676 -266008 -183634 -159780 -225264 -269440 -145238 42800 25411
17202B5411n2927N4483N6392n6321m5104j7756N4796R232r6158j282J8154J22246
$$ 25411 -27516 26967 83359 27038 -18066 -35822 18974 28206 -67952 -69234 -51080 71166
17190G1166j2426j37078j0467o9181N077Q8946P9209K4490n479J5317N4160p60
$$ 71166 58740 -78338 -88805 -157986 -152909 -63963 15246 39736 34257 49574 103734 102974
17178A02974j05233q1575J24346R85J6622J5935l5636j4093o182O0311K9318k4868
$$ 102974 -2259 -83834 40512 41497 58119 74054 38418 24325 18143 78454 107772 82904
17166H2904p4598O9994L5558j22050j6706M8649R1643L6294J2225N2349M7588
$$ 82904 8306 78300 113858 -8192 -24898 23751 115394 151688 163913 216262 263850
17155B63850k51798M5827R3325q5284j21952j75051J80020J1465j10487P6696
$$ 263850 12052 57879 151204 65920 -56032 -231083 -51063 -39598 -150085 -73389
17145g3389O2377J4722K3944l4556J891N9821K3685p5522j00648n1587R1158o5285
$$ -73389 -11012 3710 27654 -6902 -5011 54810 78495 2973 -97675 -149262 -58104 -123389
17133a23389k4552J58767J7126j0654J62412k1523n5959r5140p003n3244j06904
$$ -123389 -147941 10826 27952 17298 179710 158187 102228 7088 85 -53159 -160063
17122a60063P3438P1762q0837p6667J15137l3323r5689J32135M4579m9248N758
$$ -160063 -86625 -14863 -95700 -172367 -57230 -90553 -186242 -54107 -9528 -58776 -53018
17111e3018J38156J33283j03028k04986j47215J01628J66740n9066o7121M1488
$$ -53018 85138 218421 115393 -89593 -236808 -135180 31560 -27506 -94627 -53139
17101e3139Q2696o5797r4027P3536K14549k7685P3609M4235n725q467r005k41123
$$ -53139 29557 -36240 -130267 -56731 157818 130133 203742 247977 242252 233785 224780 -16343
17089a6343k57033j62158J90679K35623K5272q4253k7333o5946q348J0019J6126
$$ -16343 -273376 -435534 -244855 -9232 16040 -68213 -95546 -161492 -169840 -159821 -143695
17078a43695J11624j202m9242L3184L2351m6787j43213j25801J28619P5324m8968
$$ -143695 -32071 -33273 -82515 -49331 -16980 -63767 -206980 -332781 -204162 -128838 -177806
17067a77806J11564o6601l3199o2513k6177Q6436J48563O3610J38159k6365j31488
$$ -177806 -66242 -132843 -166042 -228555 -254732 -168296 -19733 43877 182036 155671 24183
17056B4183M7610l0523q0289r6331l3602k8864Q3654L3820j61154J08834J19969
$$ 24183 71793 41270 -39019 -135350 -168952 -197816 -114162 -80342 -241496 -132662 -12693
17045a2693Q0400j04179j84158j9183L0162K73505L0857j19612P3463K3607j46455
$$ -12693 67707 -36472 -220630 -239813 -209651 63854 94711 -24901 48562 72169 -74286
17034g4286k2409J13534m6418j09431k42160J12038J76517J43960R2939p55K0537
$$ -74286 -96695 16839 -29579 -139010 -381170 -269132 -92615 51345 144284 143529 164066
17023A64066j7671M7924j14176j23529N0997J40034o3064J4209Q4102r5837j84055
$$ 164066 146395 194319 80143 -43386 7611 147645 84581 98790 182892 87055 -97000
17012i7000j2939O3752J65950J36667J11707j16785j97636j95246M7260L14229
$$ -97000 -109939 -46187 119763 256430 368137 251352 53716 -141530 -94270 219959
17002B19959J27322l5434k3193J1867j33437q8033m1630o2770k6981m2015k6295
$$ 219959 347281 311847 288654 300521 167084 79051 37421 -25349 -52330 -94345 -120640
16991a20640m6865p3099M4490n2641j07722P591n4123K24191J08092P195J9176
$$ -120640 -167505 -240604 -196114 -248755 -356477 -348886 -403009 -178818 -70726 -63531 -44355
16980d4355M35J4540k8140j22508O5990J17249M7215N7652m0485o1573J9520O9086
$$ -44355 -43920 -29380 -57520 -180028 -114038 3211 50426 108078 67593 6020 25540 94626
16968I4626O5256J65748j25732k2591j2906o3702K2189n8676q8811j35100Q0286
$$ 94626 159882 325630 199898 177307 164401 100699 122888 64212 -24599 -159699 -79413
16957g9413o9093J31239J17003n9472q5194L3786M646j98055j2600J50633J34295
$$ -79413 -148506 -17267 99736 40264 -44930 -11144 -6498 -204553 -217153 -66520 67775
16946F7775P2606j5362j64612j21604J2234K1525J126R8168m1603P668k9384J2698
$$ 67775 140381 125019 -39593 -161197 -148963 -127438 -126312 -28144 -69747 -62079 -91463 -78765
16934g8765J69354Q4391N7415R2393j56461k51693k55289O1042K61737K34274
$$ -78765 90589 174980 232395 324788 168327 -83366 -338655 -277613 -15876 218398
16924B18398J94243k84158j42210K01524j25701j36703R9613j5201O2957R2285
$$ 218398 412641 128483 -13727 187797 62096 -74607 25006 9805 72762 165047
16914A65047n9391N7741Q4220N0750j7987k2561l8915q8298q3610M4890j7126
$$ 165047 105656 163397 247617 298367 280380 257819 218904 130606 46996 91886 74760
16903G4760L2117k7299k5588k04966l2574J92558Q5580k22444j78726m604p520
$$ 74760 106877 79578 53990 -150976 -183550 9008 94588 -127856 -306582 -311186 -318706
16892c18706J26043J46383l1362J4611R1386P9402j0765o3163o5937j3664K0117
$$ -318706 -192663 -46280 -77642 -63031 28355 107757 96992 33829 -32108 -45772 -25655
16881b5655p8417j53047p0469J22934J27780J41371J6694j48348j62293J34465
$$ -25655 -104072 -257119 -327588 -204654 -76874 64497 81191 -67157 -229450 -94985
16871i4985o9576k85091K42384l2666J46829J4818j0270l6997L6496o2545R0858
$$ -94985 -164561 -449652 -207268 -239934 -93105 -78287 -88557 -125554 -89058 -151603 -60745
16860f0745R0119Q3943j45348M8584l7999q5099J0404R1395J2254J0647m0184
$$ -60745 29374 113317 -32031 16553 -21446 -106545 -96141 -4746 7508 18155 -22029
16849b2029J1618L3581o3477j45878N1268L9781L2566Q2791n7810p3952n6929
$$ -22029 -10411 23170 -40307 -186185 -134917 -95136 -62570 20221 -37589 -111541 -168470
16838a68470o6621o2420j05461O2087O816P1553J72357J86036O8904m2776j2841
$$ -168470 -235091 -297511 -402972 -340885 -334069 -262516 -90159 95877 164781 122005 109164
16827A09164L6050Q070o4537Q4080j7612j21701l9710j11428N0667J55204k3589
$$ 109164 145214 153284 88747 172827 155215 33514 -6196 -117624 -66957 88247 64658
16816F4658J9380l2122j39727l6898K1321O7543R5770R7783J42005j74326k94643
$$ 64658 84038 51916 -87811 -124709 -103388 -35845 59925 157708 299713 125387 -169256
16805a69256p5034J21086O1602P4094K52229J14584k1535j25779j00847m9200
$$ -169256 -244290 -123204 -61602 12492 264721 379305 357770 231991 131144 81944
16795H1944M0422J48451q6427q0398p4099o4805o275p2655J52201j5466k15586
$$ 81944 122366 270817 184390 103992 29893 -34912 -41187 -113842 38359 22893 -192693
16784a92693L6051J18433r370P1080N8215L5818J64285n2652k19118j63343K00354
$$ -192693 -156642 -38209 -47579 23501 81716 117534 281819 229167 10049 -153294 47060
16773D7060J19481o5180L021n6346j10888j52067j27209J2974J41615J31634L9357
$$ 47060 166541 101361 104382 48036 -62852 -214919 -342128 -329154 -187539 -55905 -16548
16762a6548J05936M3452q6564j16540J30644N530o1201k05637r24Q2024R8307
$$ -16548 89388 132840 46276 -70264 60380 65910 4709 -200928 -201852 -119828 -21521
16751b1521J20236R2030k2480n6369O1765J12052j02567o8182q4807j20674k30634
$$ -21521 98715 190745 168265 111896 173661 285713 183146 114964 30157 -90517 -321151
16740c21151J02114K87131N9021j15642n3092r3196J3395P4453J02895j17030
$$ -321151 -219037 68094 127115 11473 -41619 -134815 -121420 -46967 55928 -61102
16730f1102j1876j41881k72557O7113K16597P412p6449j02890r9049K10238M8264
$$ -61102 -72978 -214859 -487416 -420303 -203706 -196294 -272743 -375633 -474682 -264444 -216180
16719b16180r9108O3323O7737m7101j05687q5805r7514L1064K53585O4841J41175
$$ -216180 -315288 -251965 -184228 -231329 -337016 -422821 -520335 -489271 -235686 -170845 -29670
16708b9670Q990P061K735O5023J9484j79708p7756p2101k4679M1304P7904J57928
$$ -29670 -20680 -13619 -10884 54139 73623 -106085 -183841 -255942 -280621 -239317 -161413 -3485
16696c485J50226J03353j64982n0919R2486k8653p0625J92226P8608m8405k7590
$$ -3485 146741 250094 85112 34193 126679 98026 27401 219627 298235 249830 222240
16685B22240O588M2746J0509k44727m4301j44779j73763R4459l4353P8503Q2286
$$ 222240 228828 271574 282083 37356 -6945 -151724 -325487 -231028 -265381 -186878 -104592
16674a04592J21382M1895M0672J29638m8090O767j91748j25143R9150j47361m038
$$ -104592 16790 58685 99357 228995 180905 187672 -4076 -129219 -30069 -177430 -181468
16663a81468O9424P2956Q3622j1812o3881n1301j29923k15206O1816K84264m4060
$$ -181468 -112044 -39088 44534 32722 -31159 -82460 -212383 -427589 -365773 -81509 -125569
16652a25569J10046J77858N2977j25865r3922p0125k21388P1806J39951m736r1864
$$ -125569 -15523 162335 215312 89447 -4475 -74600 -295988 -224182 -84231 -88967 -180831
16641a80831K20563j70423r1876L6525O4850K302J1339J22478J46418K8255n0549
$$ -180831 39732 -130691 -222567 -186042 -121192 -118890 -107551 14927 161345 189600 139051
16630A39051o7137j03774R576J34775R7650J2834J1917p9156N5450J8295j0748
$$ 139051 71914 -31860 -22284 112491 210141 222975 234892 155736 211186 229481 218733
16619B18733N5586P5237k6060j53867L011K35510R1733j04310k51853r7938J31023
$$ 218733 274319 349556 323496 169629 172640 408150 499883 395573 143720 45782 176805
16608A76805L9441L8791J3036j09332p6175P3461J0872j12254j12699k1681j52536
$$ 176805 216246 255037 268073 158741 82566 156027 166899 54645 -58054 -79735 -232271
16597b32271Q2829K7947Q817M9360J09090r8143j15498J62693K04178p2914o3339
$$ -232271 -149442 -121495 -112678 -63318 45772 -52371 -167869 -5176 199002 126088 62749
16586F2749R6702j94315j18445O1709J80734J21724k09988j32322j7094P966k1232
$$ 62749 159451 -34864 -153309 -91600 89134 210858 870 -131452 -148546 -140580 -161812
16575a61812L045k2552M1454K14j5833K2619M012J33388j9307j06607P5265J92379
$$ -161812 -158767 -181319 -139865 -139651 -155484 -132865 -128853 4535 -14772 -121379 -46114 146265
16563A46265J11904K0413n437K253N6220n7496j68047J7896j09074j97747K750
$$ 146265 258169 278582 273145 275398 331618 274122 106075 123971 14897 -182850 -180100
16552a80100J52353Q4346q6517L3736j49261j36904R4531K89795m9179J00629
$$ -180100 -27747 56599 -29918 3818 -145443 -282347 -187816 101979 52800 153429
16542A53429L1147j52090p0062k7159j5749J18754o5290m3031J03284L2238M0409
$$ 153429 184576 32486 -37576 -64735 -80484 38270 -27020 -70051 33233 65471 105880
16531A05880k5236p1209J48394n2419k2019j17559P415M2630J41332k3604j35559
$$ 105880 80644 9435 157829 105410 83391 -34168 -26753 15877 157209 133605 -1954
16520a954K3762j9047j49438K7033K77221Q3643j45856L3270P604q4228L9835
$$ -1954 21808 2761 -146677 -119644 157577 241220 95364 128634 136238 52010 91845
16509I1845O1281j875o6798j51843k0553J05426R4502O6973j74700q3902o7619
$$ 91845 153126 151251 84453 -67390 -87943 17483 111985 178958 4258 -79644 -147263
16498a47263N5818N2695j12372J4107N66o0691J21113Q4557j17019j62462M3948
$$ -147263 -91445 -38750 -151122 -137015 -136449 -197140 -76027 8530 -108489 -270951 -227003
16487b27003O2532l2759q9076p2273l7546j1094R3938J85299J8189j0058L9546
$$ -227003 -164471 -197230 -286306 -358579 -396125 -407219 -313281 -127982 -109793 -119851 -80305
16476h0305J08351n0482L7930R1906m6587o3957Q8856n370K20561O1493p9836
$$ -80305 28046 -22436 15494 107400 60813 -3144 85712 80342 300903 362396 282560
16465B82560j20259P7506j15635j67155j39737M4490J7561J24812J30896J7034
$$ 282560 162301 239807 124172 -42983 -182720 -138230 -120669 4143 135039 152073
16455A52073j04312k63011N0051J01056K4658K1414j6720R0643J44935Q0531l5071
$$ 152073 47761 -215250 -165199 -64143 -39485 -18071 -34791 55852 200787 281318 246247
16444B46247m3967J06461q9840q1956r0326j00977p5111J2J41170O9042L65n8956
$$ 246247 202280 308741 218901 136945 46619 -54358 -129469 -129457 11713 80755 81120 22164
16432B2164j12551j74748J4473J68259K37509J4777q9872l805R28j51159k22979
$$ 22164 -90387 -265135 -250662 -82403 155106 169883 80011 76206 77134 -74025 -297004
16421b97004J33423L05740N5989J08861M3611n5170P5339j47850j53164K5197
$$ -297004 -163581 142159 198148 307009 350620 295450 370789 222939 69775 94972
16411I4972P6105r3544j55354L981l6320P0564r1159j31899j75153K5020R6347
$$ 94972 171077 77533 -77821 -73840 -110160 -39596 -130755 -262654 -437807 -412787 -316440
16400c16440L6085L6898r0341j657K55899R1714l2015M4995J5263R5972L7172
$$ -316440 -280355 -243457 -333798 -335455 -79556 12158 -19857 25138 40401 136373 173545
16389A73545K525K3543L339j38256j23108L036j30740M6503R5035j57505j41472
$$ 173545 176070 199613 202952 64696 -58412 -55376 -186116 -139613 -44578 -202083 -343555
16378c43555R7979Q1690Q0202K7915k6703k5177J20100k7144l056o9024p1337
$$ -343555 -245576 -163886 -83684 -55769 -82472 -107649 12451 -14693 -17749 -86773 -158110
16367a58110J22544M6170j80674R2311J18495J07760j78591j52467L6686J06014
$$ -158110 -35566 10604 -170070 -77759 40736 148496 -30095 -182562 -145876 -39862
16357c9862j2988K14173r4308n3854R8910p2003j39316P2905k8606O5134k402
$$ -39862 -52850 161323 67015 13161 112071 40068 -99248 -26343 -54949 10185 7783
16346G783R0792K07757J9147j49998j72064j23278m144J57111P8664k02476q3851
$$ 7783 98575 306332 325479 175481 3417 -119861 -124005 33106 111770 -90706 -174557
16335a74557J59349M0128q0479j5353O5368R5605m2314j88373P2272m7167j11670
$$ -174557 -15208 24920 -55559 -70912 -5544 90061 47747 -140626 -68354 -115521 -227191
16324b27191J43335P6825L3625o4974j19211k4935J19452o7213J24546k4631n7479
$$ -227191 -83856 -7031 26594 -38380 -157591 -182526 -63074 -130287 -5741 -30372 -87851
16313h7851q3059K6884P6509J34371O7559J32831o4611m1746M403M9739N3616
$$ -87851 -170910 -144026 -67517 66854 134413 267244 202633 160887 165290 215029 268645
16302B68645j49835p9494J15930m7270j01057M520Q6200k2870J26075O5342j44676
$$ 268645 118810 39316 155246 107976 6919 11439 97639 74769 200844 266186 121510
16291A21510l3403L0772K1915Q5012n1603k4212M3233k8819k7145N1883j98191
$$ 121510 88107 118879 140794 225806 174203 149991 193224 164405 137260 189143 -9048
16280i048j12079o2558M3150J47330l9327r9348q7872K4049n9321l7331J49082
$$ -9048 -121127 -183685 -140535 6795 -32532 -131880 -219752 -195703 -255024 -292355 -143273
16269a43273J7266P2993K9320P7671j73655J44915K30860o1872j58798j451J3332
$$ -143273 -126007 -53014 -23694 53977 -119678 25237 256097 194225 35427 33976 47308
16258D7308j09926m0885r8028O4216L9934L2286N6863L2204l1653J1416J1128
$$ 47308 -62618 -103503 -201531 -137315 -97381 -65095 -8232 23972 -7681 3735 14863
16247A4863R0079J37808j43941p3133L0918l8286j82005Q189j7313j3101m3774
$$ 14863 104942 242750 98809 25676 56594 18308 -163697 -155508 -172821 -185922 -229696
16236b29696M8325M4984j0375O5777J27456o2555O644M1092m2256p5819n5123
$$ -229696 -181371 -136387 -146762 -80985 46471 -16084 -9440 31652 -10604 -86423 -141546
16225a41546M0207J35889K12993M4436K625j23488m9952k13321N328k08128L9290
$$ -141546 -101339 34550 247543 291979 294604 171116 121164 -92157 -86829 -294957 -255667
16214b55667J38038Q7128K8315k08038O297K7790l7496K1607l05601P7159M24462
$$ -255667 -117629 -30501 -2186 -210224 -203927 -176137 -213633 -192026 -497627 -420468 3994
16203C994J85551N5214L3745k73656p3621N8607l0358J44182k5138k29710o5831
$$ 3994 189545 244759 278504 4848 -68773 -10166 -40524 103658 78520 -151190 -217021
16192b17021J34263J22340J1006o9165q2851J7280R1705P1978o123j21858M2925
$$ -217021 -82758 39582 50588 -18577 -101428 -84148 7557 79535 73412 -48446 -5521
16181e521K4705m54968n6782R4262J82806N7562J4032l5225O0134O362K9756j47511
$$ -5521 19184 -435784 -492566 -398304 -215498 -157936 -143904 -179129 -118995 -112633 -82877 -230388
16169b30388m8270J23044q4113Q7704J33492K06580n967j1320n893j26684O075
$$ -230388 -278658 -155614 -239727 -152023 -18531 188049 182082 170762 164869 38185 44260
16158D4260j28314j33708J03499J630J05611L555l0192k9392Q9870k39483j7121
$$ 44260 -84054 -217762 -114263 -112633 -7022 -3467 -33659 -63051 26819 -212664 -229785
16147b29785K22034J86503p1305p9880m5578P2775J1994r085J50591q6830j58393
$$ -229785 -7751 178752 107447 27567 -18011 54764 66758 57673 208264 121434 -36959
16136c6959K0849k9110J11316O9155j57793j07684p2911j27678L3302J62041J24378
$$ -36959 -16110 -45220 66096 135251 -22542 -130226 -203137 -330815 -297513 -135472 -11094
16125a1094n9056K5937R3427N5326Q500n137m1943m6904o1110j4569Q4001m8873
$$ -11094 -70150 -44213 49214 104540 113040 107903 65960 19056 -42054 -56623 27378 -21495
16113b1495q0456K8168P7979J0536j4631Q0213J53772j16505j13855j53256J53563
$$ -21495 -101951 -73783 4196 14732 101 80314 234086 117581 3726 -149530 4033
16102D033K02869J07976M2551K5589R4245j55368j54137M0043k8392j37414j06510
$$ 4033 206902 314878 357429 383018 477263 321895 167758 207801 179409 41995 -64515
16091f4515m3693K32302J86603r0463j44719J60118q6498m7344q1513p3279l5254
$$ -64515 -108208 124094 310697 220234 75515 235633 149135 101791 20278 -53001 -88255
16080h8255o6600P8641J780n0754M8460P012m3889K1437k573J15622M7240l9282
$$ -88255 -154855 -76214 -74434 -125188 -76728 -69716 -113605 -92168 -94741 20881 68121 28839
16068B8839M551o9307K5900O1874M4079j7104N6249j44123M9169m6353l0568m2362
$$ 28839 33390 -35917 -10017 51857 95936 78832 135081 -9042 40127 -6226 -36794 -79156
16056g9156J19011O4358q684O9302j00227k7204n1294n9583q675j6692L9052J95013
$$ -79156 39855 104213 95529 164831 64604 37400 -13894 -73477 -82152 -98844 -59792 135221
16044A35221k2252K408K54583j31245j94633q7331N681l8363J09221K050j61997
$$ 135221 112969 115377 369960 238715 44082 -43249 -37568 -75931 33290 35340 -126657
16033a26657n7494l1551P0310J86302N2315j22944P8163J05708l1613l6635m8483
$$ -126657 -184151 -215702 -145392 40910 93225 -29719 48444 154152 122539 85904 37421
16022C7421M9936q6950R913K15121N1645j47514n8179p7581P8163o5931j27506
$$ 37421 87357 407 10320 225441 277086 129572 71393 -6188 71975 6044 -121462
16011a21462k0384k6515j02103N6735J03262j09163p9790k3873Q9993O0386J87463
$$ -121462 -141846 -168361 -270464 -213729 -110467 -219630 -299420 -323293 -233300 -172914 14549
16000A4549Q9462q0119q0093J64940J64037r7701j12051K5995P818o3853P6902
$$ 14549 104011 23892 -56201 108739 272776 175075 63024 89019 96837 32984 109886
15989A09886N3731j43251j29322R1399j35474M835R7539K5160l2840K8654n4894
$$ 109886 163617 20366 -108956 -17557 -153031 -148196 -50657 -25497 -58337 -29683 -84577
15978h4577Q8784K93533r5394k91911J35010K0750j35227M5929j8635P0694J6177
$$ -84577 4207 297740 202346 -89565 45445 66195 -69032 -23103 -41738 28956 45133
15967D5133k6882P013n2407L4785J09610k429j80019K5783o3209m4503P1053J9445
$$ 45133 18251 25264 -27143 7642 117252 114823 -65196 -39413 -102622 -147125 -76072 -56627
15955e6627J73771K1092N9243l4556j35188k7841K20885P3566j77472j03393j29562
$$ -56627 117144 138236 197479 162923 27735 -106 220779 294345 116873 13480 -116082
15944a16082P486j00814r3407k8570l9378K21801J72376q2433K9908J39617M0100
$$ -116082 -108596 -209410 -302817 -331387 -370765 -148964 23412 -59021 -29113 110504 150604
15933A50604P3461n4354q5456O3369K3773n7686j61871l1571q450j44835o0890
$$ 150604 224065 169711 84255 147624 171397 113711 -48160 -79731 -88181 -233016 -293906
15922b93906O5560j517m4888L7862L3309j30795J0010K1694P4132j44898o0836
$$ -293906 -228346 -229863 -274751 -236889 -203580 -334375 -324365 -302671 -228539 -373437 -434273
15911d34273K60878K5194q8535j08809q1511J09711J104j76824k5387K01590K28553
$$ -434273 -173395 -148201 -236736 -345545 -427056 -317345 -316241 -493065 -518452 -316862 -88309
15900h8309R5845k27857q0057j7921K12092J38106j680p2993P3155k5290Q87j09471
$$ -88309 7536 -220321 -300378 -318299 -106207 31899 30219 -42774 30381 5091 5978 -103493
15888a03493m246K9272l3096P3416K67466J98798P710j15754k49408r1152K8052
$$ -103493 -107739 -78467 -111563 -38147 229319 428117 435827 320073 70665 -20487 7565
15877G565l3972M8279K6634o2168o9051n6006n9137P9724j73824n6710J30976
$$ 7565 -26407 21872 48506 -13662 -82713 -138719 -197856 -118132 -291956 -348666 -217690
15866b17690K12653L5160n7575K1656P9507J21522N6684l1625j11651j01788Q1861
$$ -217690 -5037 30123 -27452 -5796 73711 195233 251917 220292 108641 6853 88714
15855H8714n5781j71906l4446o5403R3795N1073l6476k836N5225P2895j06109
$$ 88714 32933 -138973 -173419 -238822 -145027 -93954 -130430 -133266 -78041 -5146 -111255
15844a11255n2906m7336j7593M4990n8793n6167o6169M8031K7347L4821j866O2646
$$ -111255 -164161 -211497 -229090 -184100 -242893 -299060 -365229 -317198 -289851 -255030 -256896 -194250
15832a94250J92936L3874L6209J8837J11319O6837o1995l4245j99857j13212J39766
$$ -194250 -1314 32560 68769 87606 198925 265762 203767 169522 -30335 -143547 -3781
15821c781J32713n1074J59507J35593j59029N5647o7689n4570j07597j20844m7690
$$ -3781 128932 77858 237365 372958 213929 269576 201887 147317 39720 -81124 -128814
15810a28814j12697L1693K21527n0635k14132j6274J09236J27373j954O1286j67427
$$ -128814 -241511 -209818 11709 -38926 -253058 -269332 -160096 -32723 -34677 26609 -140818
15799a40818J43644O1380k1024N4819J23293J7252k17453r9214J58992r0921q9874
$$ -140818 2826 64206 43182 98001 221294 238546 21093 -78121 80871 -10050 -99924
15788i9924J68900m4307j04697Q4519Q850o0352n5445m8474J4183N4140N0792
$$ -99924 68976 24669 -80028 4491 13341 -47011 -102456 -150930 -136747 -82607 -31815
15777c1815J02653o0560O9235P4419k47698j66570n074J97878k0285p4256J53
$$ -31815 70838 10278 79513 153932 -93766 -260336 -265410 -67532 -87817 -162073 -161920
15766a61920l9572l817P700O2306J55029R4421j2253J27305K6220j57993l7675
$$ -161920 -201492 -205309 -197609 -135303 19726 114147 101894 229199 255419 97426 59751
15755E9751l2913j29944k820J39752J16876K8937j46294J05722J0287j56715q3048
$$ 59751 26838 -103106 -105926 33826 150702 179639 33345 139067 149354 -7361 -90409
15744i0409Q659O8755M431R86j8528n5745M6230n570j09741q2774n8759P6584
$$ -90409 -81750 -12995 -8564 -7578 -26106 -81851 -35621 -41191 -150932 -233706 -292465 -215881
15732b15881L91669n9120j05880L2847P9884O8843r8752o7912n9899L8206L3012
$$ -215881 175788 116668 10788 43635 123519 192362 93610 25698 -34201 4005 37017
15721C7017r3645j13212J03390Q9077O9873J48397K7541o5608j31877j13461K4284
$$ 37017 -56628 -169840 -66450 22627 92500 240897 268438 202830 70953 -42508 -18224
15710a8224j6554o1833R1143O6153M3755k2828L385J8756j07684j51969r4053
$$ -18224 -34778 -96611 -5468 60685 104440 81612 84997 103753 -3931 -155900 -249953
15699b49953L7154O8215k6522J5884O0709j09478j25191O480J78371P2769Q7869
$$ -249953 -212799 -144584 -171106 -155222 -94513 -203991 -329182 -322702 -144331 -71562 16307
15688A6307N1918j89154P7363L9325j21949J1417P0396j13630J317N815K6655
$$ 16307 68225 -120929 -43566 -4241 -126190 -114773 -44377 -158007 -156690 -150875 -124220
15677a24220N6753Q3615j01468J1431j29369N4021O6103J55400m3578j62772O1028
$$ -124220 -67467 16148 -85320 -73889 -203258 -149237 -83134 72266 28688 -134084 -73056
15666g3056J92746j7550n6028j00264l1434L8311Q3236O3576N4457Q733O2166
$$ -73056 119690 102140 46112 -54152 -85586 -47275 35961 99537 153994 162727 224893
15655B24893j78634j09157q836k4019p7481J08271M2038n7505m2517P2610j26470
$$ 224893 46259 -62898 -71734 -95753 -173234 -64963 -22925 -80430 -122947 -50337 -176807
15644a76807J26626K0042j74691m9000K0582J93214J32425j09497N827l3590q4256
$$ -176807 -50181 -30139 -204830 -253830 -233248 -40034 92391 -17106 -11279 -44869 -129125
15633a29125O2443J92632R9192j09659k13478n3475P9118o297o3734J0516J17119
$$ -129125 -66682 125950 225142 115483 -97995 -151470 -72352 -78649 -142383 -131867 -14748
15622a4748k40074j78448Q7151J57112R6264J08773J69826q4414j23999O9709
$$ -14748 -254822 -433270 -346119 -189007 -92743 16030 185856 101442 -22557 47152
15612D7152J35435J10208M7046j04467j47475j30028j29575k6310K20758p0287
$$ 47152 182587 292795 339841 235374 87899 -42129 -171704 -198014 22744 -47543
15602d7543m7949m329P55Q391P2525j51729j36942J9806r1934J37190N8272n6501
$$ -47543 -95492 -99821 -99066 -90675 -18150 -169879 -306821 -287015 -378949 -241759 -183487 -239988
15590b39988J47345R4941k4212N0818j21622o2037J53529R5673n5372j76455q6327
$$ -239988 -92643 2298 -21914 28904 -92718 -154755 -1226 94447 39075 -137380 -223707
15579b23707j09596J59996J32075O1832K7421J66645R8851j71761n1747M972j33215
$$ -223707 -333303 -173307 -41232 20600 48021 214666 313517 141756 90009 94981 -38234
15568c8234l2916J87888m0316M6230J7233L3398P4943N6647j26331n9153J03143
$$ -38234 -71150 116738 76422 122652 139885 173283 248226 304873 178542 119389 222532
15557B22532j0747P9610Q8721j92582K6935K3338j63415J13975J11769J5633j3284
$$ 222532 211785 291395 380116 187534 214469 237807 74392 188367 300136 315769 302485
15546C02485j89490p6377O9532j60218J04434l7920l0361J33363O2017k66579
$$ 302485 112995 36618 106150 -54068 50366 12446 -17915 115448 177465 -89114
15536h9114j71955l3916K6005K5688K1235j89494l4743L02929K19523M5415k4825
$$ -89114 -261069 -294985 -268980 -243292 -222057 -411551 -446294 -143365 76158 121573 96748
15525I6748K675k5333P898r7309j39639k6300J41733O1153m046n1838p2152K9598
$$ 96748 99423 74090 81988 -15321 -154960 -181260 -39527 21626 17580 -34258 -106410 -76812
15513g6812k0375j09293J9253j05891o64K10561K4640Q104k4892j40776j24105
$$ -76812 -97187 -206480 -187227 -293118 -293782 -83221 -58581 -50477 -75369 -216145 -340250
15502c40250K73754J87500j18241n4306K36357j9706k47090j3628O4950J63034
$$ -340250 -66496 121004 2763 -51543 184814 165108 -81982 -95610 -30660 132374
15492A32374j21226M4173P5477j77185j55489l0159J272P448q8808n0754J53647
$$ 132374 11148 55321 130798 -46387 -201876 -232035 -230763 -223315 -312123 -362877 -209230
15481b09230k0210o4115J11526K43621J72386J47145r09j53475j46666r7361p5261
$$ -209230 -229440 -293555 -182029 61592 233978 381123 380214 226739 80073 -17288 -92549
15470i2549P8969R255K5548K5683J9744J09453j14413L0706q7042k6963p496j33414
$$ -92549 -13580 -4325 21223 46906 66650 176103 61690 92396 5354 -21609 -29105 -162519
15458a62519J08021Q5522J71468J1092o7159r6850P9742J18326q1892k1760p2282
$$ -162519 -54498 31024 202492 213584 146425 49575 129317 247643 165751 143991 71709
15447G1709p2989n9760o7575j06106J17153J06154l0379P1032m3360j05775J65417
$$ 71709 -1280 -61040 -128615 -234721 -117568 -11414 -41793 29239 -14121 -119896 45521
15436D5521L03359l7518j64651p2710L2770j6558J17310L25j94434j06343P4306
$$ 45521 348880 311362 146711 74001 106771 90213 207523 207848 13414 -92929 -18623
15425a8623J06802L8388j77722N6283K21329q8766k61368m9764L5695O5698P5540
$$ -18623 88179 126567 -51155 5128 226457 137691 -123677 -173441 -137746 -72048 3492
15414C492K5322P6255j93780j7384P8624l3175m4113O3100l6464j15213j7647
$$ 3492 28814 105069 -88711 -106095 -27471 -60646 -104759 -41659 -78123 -193336 -210983
15403b10983J15920J48725J66294j5376j59094k15545j56072l8056K64799J41136
$$ -210983 -95063 53662 219956 204580 45486 -170059 -326131 -364187 -99388 41748
15393D1748o0252j50150K7735J3045j8731j4913J59723J65449k394j43111l5379
$$ 41748 -18504 -168654 -140919 -127874 -146605 -161518 -1795 163654 161260 18149 -17230
15382a7230M1445o5735n6726k2919r8762l3160m0609J17245J29968M6945r8819
$$ -17230 24215 -41520 -98246 -121165 -219927 -253087 -293696 -176451 -46483 462 -98357
15371i8357K8180l3620o6962r8360J29864J45125J35853j18905j26224P7049j38671
$$ -98357 -70177 -103797 -170759 -269119 -139255 5870 141723 22818 -103406 -26357 -165028
15360a65028r0600J29877O5196q7271O370J16316k2047P1917j2065Q3141k8398
$$ -165028 -255628 -125751 -60555 -147826 -141456 -25140 -47187 24730 12665 95806 67408
15349F7408n0943p5524K2786J80678J46542j1217K4531j0269J00074j42273m2244
$$ 67408 16465 -59059 -36273 144405 290947 279730 304261 293992 394066 251793 209549
15338B09549j12791K026P3620M4902O0072M5561j89334o0935j32218l5272M3704
$$ 209549 96758 98784 172404 217306 277378 322939 133605 72670 -59548 -94820 -51116
15327e1116n4297N3518M3420L0101p8239O3333O720m3040J11553l0183j84950
$$ -51116 -105413 -51895 -8475 21626 -56613 6720 13440 -29600 81953 51770 -133180
15316a33180J9794J04159j02207J99540J95014l4088p5177J8765n7111K1624k0628
$$ -133180 -113386 -9227 -111434 88106 283120 249032 173855 192620 135509 157133 136505
15305A36505n5690q1907K6926M7982J10685j85847o3890K5134j73615j6614R3846
$$ 136505 80815 -1092 25834 73816 184501 -1346 -65236 -40102 -213717 -230331 -136485
15294a36485J82106j4074j21647n9760J54962q1548m0472j0904N1943L5532k0838
$$ -136485 45621 31547 -90100 -149860 5102 -76446 -116918 -127822 -75879 -40347 -61185
15283f1185J75664Q8249M886L9579p4750l6130p6790j07460R3341Q7401J04839
$$ -61185 114479 202728 207614 247193 172443 136313 59523 -47937 45404 132805 237644
15272B37644M5828j4736j73703O5354N2948j38807R856K4861j24585j56643k4306
$$ 237644 283472 268736 95033 160387 213335 74528 84384 109245 -15340 -171983 -196289
15261a96289j3433n174M2849M0688o2552J81605M467l3512O6252Q4161r717J8148
$$ -196289 -209722 -214896 -172047 -131359 -193911 -12306 -7839 -41351 24901 109062 99345 117493
15249A17493r7936K964n3976j59511O339J31455N9372M0116k2585p8064K048Q929
$$ 117493 19557 22521 -31455 -190966 -184627 -53172 6200 46316 23731 -54333 -52285 -43356
15237d3356N221K3229q8206n960j16374j04649j59871J59382N5478k436Q4390
$$ -43356 -38135 -14906 -103112 -109072 -225446 -330095 -489966 -330584 -275106 -277542 -193152
15226a93152K4125k4132R7870j8991j26152o8688J79272J13737J25056p8609k4557
$$ -193152 -169027 -193159 -95289 -114280 -240432 -309120 -129848 -16111 108945 30336 5779
15215E779n007j56121k5144K0849O1465j234J4640J41357R9421N3739j26648P8189
$$ 5779 772 -155349 -180493 -159644 -98179 -99413 -84773 56584 156005 209744 83096 161285
15203A61285l6408r8052J1392j12j4176K4704P0937j56583j60344N8115J24825
$$ 161285 124877 26825 38217 38105 23929 48633 119570 -37013 -197357 -139242 -14417
15192a4417M1361p2275l0436R2406k0517j70404J0188K02431K8831r7923R227
$$ -14417 26944 -45331 -75767 16639 -3878 -174282 -164094 38337 67168 -30755 -21528
15181b1528K1719m1733p083J4435r7981r0784j03385o7279K80191M6437J29616
$$ -21528 191 -41542 -48625 -34190 -132171 -222955 -326340 -393619 -113428 -66991 62625
15170F2625J20649m3224n1905n6309n6896P6282p266m1188j06605m7587j18178
$$ 62625 183274 140050 88145 31836 -25060 51222 43956 2768 -103837 -151424 -269602
15159b69602j1735L9950j27752N2059K01045q2435N1940J43671k04309l7980Q6139
$$ -269602 -281337 -241387 -369139 -317080 -116035 -198470 -146530 -2859 -207168 -245148 -159009
15148a59009J01300O8504j62821j13249J36151J32261L1538k20615J2108P1624
$$ -159009 -57709 10795 -152026 -265275 -129124 3137 34675 -185940 -173832 -102208
15138a02208r2666O0005J95937R9642J8985j17866J9945l8902k5375L9561q9752
$$ -102208 -194874 -134869 61068 160710 179695 61829 81774 42872 17497 57058 -32694
15127c2694O9697j44391j18579n6939P6573P9997j7127J13733K9498j14575k9249
$$ -32694 37003 -107388 -225967 -282906 -206333 -126336 -143463 -29730 -232 -114807 -144056
15116a44056J29852K4259k9143O6578j14820O7492J67112r0014N3546J83051p3383
$$ -144056 -14204 10055 -19088 47490 -67330 162 167274 77260 130806 313857 240474
15105B40474O1064n8192j08514j05545M1151O83M3610j74556j6540k7391l2858
$$ 240474 301538 243346 134832 29287 70438 71121 114731 -59825 -76365 -103756 -136614
15094a36614K2520k8570k3328P1372K29631l834j05601j27812p5360l1591J75121
$$ -136614 -114094 -142664 -165992 -94620 135011 131177 25576 -102236 -177596 -209187 -34066
15083c4066P5584J20389J40181J24990j01559j11007j17452P072j11655j82826
$$ -34066 41518 161907 302088 427078 325519 214512 97060 104132 -7523 -190349
15073a90349J35580l2575j19911q7897Q3392J06892k4496k71508j5603K11102
$$ -190349 -54769 -87344 -207255 -295152 -211760 -104868 -129364 -400872 -416475 -205373
15063b05373K37418N892q9284o9041J8084j59031p4872l5037j51177J20419K26468
$$ -205373 32045 37937 -51347 -120388 -102304 -261335 -336207 -371244 -522421 -402002 -175534
15052a75534J01894j7371J95549r280k18267j05421P9401K6749K9269J37047j14714
$$ -175534 -73640 -91011 104538 95258 -123009 -228430 -149029 -122280 -93011 44036 -70678
15041g0678j84643j1416K46598M8573m8257m8589M392J3430N2392K7490Q6225
$$ -70678 -255321 -266737 -20139 28434 -19823 -68412 -64020 -50590 1802 29292 115517
15030A15517m3725j16565Q9340l5872N7452q7809j37835P6284o434K0010l0152
$$ 115517 71792 -44773 44567 8695 66147 -21662 -159497 -83213 -89647 -69637 -99789
15019i9789j12932N062J09789n717n3467J01541R4933l9757p6434P7263J54910
$$ -99789 -212721 -207659 -97870 -103587 -157054 -55513 39420 -337 -76771 492 155402
15008A55402K10L6237j40276q137q6992M7339n0031J59530l0016j87752J67643
$$ 155402 155612 191849 51573 43436 -43556 3783 -46248 113282 83266 -104486 63157
14997F3157M0024k06564o5987J3097l3070O7767M7887J98123Q4424j48781k25345
$$ 63157 103181 -103383 -169370 -156273 -189343 -121576 -73689 124434 208858 60077 -165268
14986a65268k7520J31942J879p2044M7582P3590l5739q165N1760r9272K3470M6461
$$ -165268 -192788 -60846 -58967 -131011 -83429 -9839 -45578 -53743 -1983 -101255 -77785 -31324
14974c1324j50680n2615R6181K04242K081j46732L9095j8556j07932k3832j1685
$$ -31324 -182004 -234619 -138438 65804 67885 -78847 -39752 -58308 -166240 -190072 -201757
14963b01757n4062m2398J36619L37182J27538o7080r9245p0617p7123K3619k0759
$$ -201757 -255819 -298217 -161598 175584 303122 236042 136797 66180 -10943 12676 -8083
14952h083j9200J0432j09257P4744k0129p4448l0604P1979r8238m2330p6621p4068
$$ -8083 -27283 -16851 -126108 -51364 -71493 -145941 -176545 -104566 -202804 -245134 -321755 -395823
14940c95823J97632R6307J7508Q2320n8699o4724N6257k73120J56841J26321j831
$$ -395823 -198191 -101884 -84376 -2056 -60755 -125479 -69222 -342342 -185501 -59180 -61011
14929f1011k8577J5379R2254M7946j11883N2957K7635k0938J8813J1916J06220
$$ -61011 -89588 -74209 18045 65991 -45892 7065 34700 13762 32575 44491 150711
14918A50711r4285j5704J85208J30885k1699o147o0667P900j06794p3926J01212
$$ 150711 56426 40722 225930 356815 335116 328969 268302 276202 169408 95482 196694
14907A96694J11061J940n5365r3878j09741O82L0135K6136o4418r6015R5203J03454
$$ 196694 307755 309695 254330 160452 50711 51393 81528 107664 43246 -52769 42434 145888
14895A45888j07415p3706j3359M6104o0918m7809r4p7621P6659j2931l5576K24729
$$ 145888 38473 -35233 -48592 -2488 -63406 -111215 -111309 -188930 -112271 -125202 -160778 63951
14883F3951o7162J4114J44287n6176P9055o7046k64271j36281P0638o7631K75351
$$ 63951 -3211 10903 155190 99014 178069 111023 -153248 -289529 -218891 -286522 -11171
14872a1171K87743K9708k28941j10657N5091N7506J6204l8648j43711o7477P6621
$$ -11171 276572 306280 77339 -33318 21773 79279 95483 56835 -86876 -154353 -77732
14861g7732j3244q4623m6978j3724m5217P7371J09878J26949J5385n5780J27921
$$ -77732 -90976 -175599 -222577 -236301 -281518 -204147 -94269 32680 48065 -7715 120206
14850A20206l1409k085n3449j18198Q9273j8006o9110m2353j3370J27184n3406
$$ 120206 88797 86712 33263 -84935 4338 -13668 -82778 -125131 -138501 -11317 -64723
14839f4723N3770J29271o3495l12509J12468J08421m6857m7392K5816J3207N7090
$$ -64723 -10953 118318 54823 -257686 -145218 -36797 -83654 -131046 -105230 -92023 -34933
14828c4933K2904M3444m9906j40649Q7227Q8930m2719J394Q9265Q4167L1970N1614
$$ -34933 -12029 31415 -18491 -159140 -71913 17017 -25702 -24308 64957 149124 181094 232708
14816B32708j07787m2870L4804j7207N742K41222o3268j24241j71392Q9486j08864
$$ 232708 124921 82051 116855 99648 105390 346612 283344 159103 -12289 77197 -31667
14805c1667k4945l1895l530J2164L2131M001J04417M0434n559p7730N6161O0626
$$ -31667 -56612 -88507 -92037 -79873 -47742 -43741 60676 101110 95551 17821 73982 134608
14793A34608m7297j53783j24163J72152J06771J0419R083o4096l7352j58898J02596
$$ 134608 87311 -66472 -190635 -18483 88288 98707 107790 43694 6342 -152556 -49960
14782d9960R8976O4084J18492j24827k17418j56347O1227O6019J62830J60407
$$ -49960 49016 113100 231592 106765 -110653 -267000 -205773 -139754 23076 183483
14772A83483k3491j02534M6277j07466j19856J18305N0146k40960N9374L5119
$$ 183483 159992 57458 103735 -3731 -123587 -5282 44864 -196096 -136722 -101603
14762a01603J71339J21844o5961j33080o4108j3741j89402j6958P6017J72374
$$ -101603 69736 191580 125619 -7461 -71569 -85310 -274712 -291670 -215653 -43279
14752d3279j360j575k05500k6888J24740Q630q703Q6425j331K5535j11542l665
$$ -43279 -44639 -46214 -251714 -278602 -153862 -145232 -153935 -67510 -68841 -43306 -154848 -158513
14740a58513l0728j22768m3523P9381K3367R7745n071Q3311J47885P179k2890
$$ -158513 -189241 -312009 -355532 -276151 -252784 -155039 -160110 -76799 71086 78265 55375
$$ [...]
##END NTUPLES=NMR SPECTRUM
##END=
