##TITLE=Analysis number 318293
Compound Code mo 00753
Project Code adrs
Chemist Name ugmt
##JCAMPDX= 6.0         $$ Bruker NMR JCAMP-DX V2.0
##DATA TYPE= NMR SPECTRUM
##DATA CLASS= NTUPLES
##ORIGIN= Bruker BioSpin GmbH
##OWNER= nmr
$$ XWIN-NMR		Version 3.5
$$ Wed Mar 22 16:03:18 2006 GMT Standard Time (UT+0h)  MAYBRIDGE\nmr@NMR_250MHZ
##.OBSERVE FREQUENCY= 250.131544655141
##.OBSERVE NUCLEUS= ^1H
##.ACQUISITION MODE= SIMULTANEOUS (DQD)
##.ACQUISITION SCHEME= undefined
##.AVERAGES= 16
##.DIGITISER RES= 18
##SPECTROMETER/DATA SYSTEM= dpx250
##.PULSE SEQUENCE= zg30
##.SOLVENT NAME= CDCl3
##.SHIFT REFERENCE= (INTERNAL, CDCl3, 0, 16.522)
##AUDIT TRAIL= $$ (NUMBER, WHEN, WHO, WHERE, WHAT)
$$ ##TITLE= Audit trail, XWIN-NMR		Version 3.5
$$ ##JCAMPDX= 5.01
$$ ##ORIGIN= Bruker BioSpin GmbH
$$ ##OWNER= nmr
$$ C:\u/data/dgb/nmr/ADRS/1230/pdata/1/auditp.txt
$$ ##AUDIT TRAIL=  $$ (NUMBER, WHEN, WHO, WHERE, WHAT)
(   1,<2006-03-22 16:01:59.12 +000>,<MAYBRIDGE\nmr>,<NMR_250MHZ>,
      <created by zg, POWCHK disabled, PULCHK disabled
       configuration hash MD5:
       84 BC 41 DB A1 6E 1D 46 DA 25 12 A5 C1 ED C5 3A
       data hash MD5: 64K
       E6 A6 E8 B9 23 CF A5 85 00 1C 3D 40 F6 A9 38 19>)
(   2,<2006-03-22 16:02:21.55 +000>,<MAYBRIDGE\nmr>,<NMR_250MHZ>,
      <Start of raw data processing
       ef LB = 0.3 FT_mod = 6 PKNL = 1 SI = 32K 
       data hash MD5: 32K
       47 4C 4B 5D 85 6E 16 1C 5B BA 3E FE 36 30 82 0E>)
(   3,<2006-03-22 16:02:32.30 +000>,<MAYBRIDGE\nmr>,<NMR_250MHZ>,
      <apk 
       data hash MD5: 32K
       AD BF E5 B5 F9 63 99 C1 CD 64 4C 55 AF 4C E5 AE>)
(   4,<2006-03-22 16:02:35.60 +000>,<MAYBRIDGE\nmr>,<NMR_250MHZ>,
      <abs ABSG = 5 
       data hash MD5: 32K
       DA 27 08 56 DF 82 E4 6E 40 FE 4F 8D 54 39 A8 84>)
$$ ##END=
$$ 
$$ hash MD5
$$ 65 FC 42 D0 FA 7E 36 A3 AA 51 C9 66 EA 7A 65 EA
##$RELAX= 
##$RELAX= 
##$RELAX= 
##$RELAX= 
##$RELAX= 
##$RELAX= 
##$RELAX= 
$$ Bruker specific parameters
$$ --------------------------
##$DU= <C:\u>
##$EXPNO= 1230
##$NAME= <ADRS>
##$PROCNO= 1
##$TYPE= <nmr>
##$USER= <dgb>
##$AMP= (0..31)
100 100 100 100 100 100 100 100 100 100 100 100 100 100 100 100 100 100 
100 100 100 100 100 100 100 100 100 100 100 100 100 100 
##$AQSEQ= 0
##$AQ_mod= 3
##$AUNM= <au_zg>
##$AUTOPOS= <51 >
##$BF1= 250.13
##$BF2= 250.13
##$BF3= 250.13
##$BF4= 250.13
##$BF5= 500.13
##$BF6= 500.13
##$BF7= 500.13
##$BF8= 500.13
##$BYTORDA= 1
##$CFDGTYP= 0
##$CFRGTYP= 5
##$CHEMSTR= <none>
##$CNST= (0..31)
1 1 145 1 1 1 1 1 1 1 1 1 1 1 1 1 1 1 1 1 1 1 1 1 1 1 1 1 1 1 1 1 
##$CPDPRG= <>
##$CPDPRG1= <>
##$CPDPRG2= <>
##$CPDPRG3= <>
##$CPDPRG4= <mlev>
##$CPDPRG5= <mlev>
##$CPDPRG6= <mlev>
##$CPDPRG7= <mlev>
##$CPDPRG8= <mlev>
##$CPDPRGB= <>
##$CPDPRGT= <>
##$D= (0..31)
0 1 0 0 0 0 0 0 0 0.06 0 0 0 0 0 0 0.0002 0 0 0 0 0 0 0 0 0 0 0 0 0 0 
0 
##$DATE= 1143043316
##$DBL= (0..7)
120 120 120 120 120 120 120 120 
##$DBP= (0..7)
150 150 150 150 150 150 150 150 
##$DBP07= 0
##$DBPNAM0= <>
##$DBPNAM1= <>
##$DBPNAM2= <>
##$DBPNAM3= <>
$$ [...]
##$SUBNAM7= <"">
##$SUBNAM8= <"">
##$SUBNAM9= <"">
##$SW= 20.6930455092707
##$SWIBOX= (0..15)
0 0 3 0 0 0 0 0 0 0 0 0 0 0 0 0 
##$SW_h= 5175.983436853
##$TD= 65536
##$TD0= 1
##$TE= 294.16
##$TE2= 300
##$TE3= 300
##$TEG= 300
##$TL= (0..7)
0 120 120 120 120 120 120 120 
##$TP= (0..7)
150 150 150 150 150 150 150 150 
##$TP07= 0
##$TPNAME0= <>
##$TPNAME1= <>
##$TPNAME2= <>
##$TPNAME3= <>
##$TPNAME4= <>
##$TPNAME5= <>
##$TPNAME6= <>
##$TPNAME7= <>
##$TPOAL= (0..7)
0.5 0.5 0.5 0.5 0.5 0.5 0.5 0.5 
##$TPOFFS= (0..7)
0 0 0 0 0 0 0 0 
##$TUNHIN= 0
##$TUNHOUT= 0
##$TUNXOUT= 0
##$USERA1= <user>
##$USERA2= <user>
##$USERA3= <user>
##$USERA4= <user>
##$USERA5= <user>
##$V9= 5
##$VALIST= <valist>
##$VCLIST= <CCCCCCCCCCCCCCC>
##$VD= 0
##$VDLIST= <DDDDDDDDDDDDDDD>
##$VPLIST= <PPPPPPPPPPPPPPP>
##$VTLIST= <TTTTTTTTTTTTTTT>
##$WBST= 1024
##$WBSW= 4
##$XGAIN= (0..3)
0 0 0 0 
##$XL= 0
##$YL= 0
##$YMAX_a= 370522
##$YMIN_a= -370790
##$ZGOPTNS= <>
##$ZL1= 120
##$ZL2= 120
##$ZL3= 120
##$ZL4= 120
##$ABSF1= 16.522
##$ABSF2= -4.171173
##$ABSG= 5
##$ABSL= 3
##$ALPHA= 0
##$AQORDER= 0
##$ASSFAC= 0
##$ASSFACI= 0
##$ASSFACX= 0
##$ASSWID= 0
##$AUNMP= <proc_1d>
##$AZFE= 0.1
##$AZFW= 0.1
##$BCFW= 0
##$BC_mod= 0
##$BYTORDP= 0
##$COROFFS= 0
##$CY= 12.5
##$DATMOD= 1
##$DC= 0
##$DFILT= <>
##$DTYPP= 0
##$F1P= 14.0000005364418
##$F2P= -0.99999901652339
##$FCOR= 0.5
##$FTSIZE= 32768
##$FT_mod= 6
##$GAMMA= 0
##$GB= 0
##$INTBC= 1
##$INTSCL= 1
##$ISEN= 128
##$LB= 0.3
##$LEV0= 0
##$LPBIN= 0
##$MAXI= 10000
##$MC2= 0
##$MEAN= 0
##$ME_mod= 0
##$MI= 0
##$NCOEF= 0
##$NC_proc= -3
##$NLEV= 6
##$NOISF1= 0
##$NOISF2= 0
##$NSP= 0
##$NTH_PI= 0
##$NZP= 0
##$OFFSET= 16.522
##$PC= 1
##$PHC0= 178.5108
##$PHC1= 6.592904
##$PH_mod= 1
##$PKNL= yes
##$PPARMOD= 0
##$PSCAL= 4
##$PSIGN= 0
##$REVERSE= no
##$SF= 250.13
##$SI= 32768
##$SIGF1= 0
##$SIGF2= 0
##$SINO= 400
##$SIOLD= 32768
##$SREGLST= <1H.CDCl3>
##$SSB= 0
##$STSI= 32768
##$STSR= 0
##$SW_p= 5175.98343685301
##$SYMM= 0
##$S_DEV= 0
##$TDeff= 65536
##$TDoff= 0
##$TI= <Analysis number 999999
Compound Code 99
Book Reference 9
Project Code 9>
##$TILT= no
##$TM1= 0
##$TM2= 0
##$TOPLEV= 0
##$USERP1= <user>
##$USERP2= <user>
##$USERP3= <user>
##$USERP4= <user>
##$USERP5= <user>
##$WDW= 1
##$XDIM= 32768
##$YMAX_p= 331035797
##$YMIN_p= -231083
$$ End of Bruker specific parameters
$$ ---------------------------------
##NTUPLES= NMR SPECTRUM
##VAR_NAME=  FREQUENCY,     SPECTRUM/REAL,   SPECTRUM/IMAG
##SYMBOL=    X,             R,               I
##VAR_TYPE=  INDEPENDENT,   DEPENDENT,       DEPENDENT
##VAR_FORM=  AFFN,          ASDF,            ASDF
##VAR_DIM=   32768,         32768,           32768
##UNITS=     HZ,            ARBITRARY UNITS, ARBITRARY UNITS
##FACTOR=    0.157963299565203, 1,           1
##FIRST=     4132.6476996994, 0,             0
##LAST=      -1043.33573715361, 0,           0
##MIN=       -1043.33573715361, -231083,     0
##MAX=       4132.6476996994, 331035797,     0
$$ Real data points
##PAGE= N=1
##DATA TABLE= (X++(R..R)), XYDATA
$$ [...]
20743 -81138 -71409 -78601 -60587 24258 75877 40988 60677 35915 40646 37126 64249 102609
20731 102609 74311 87309 107913 61374 -18088 -81732 -47870 41699 113059 103410 11604 29348
20719 29348 54806 54756 11091 17207 19361 10676 -38991 -20740 -771 5634 31865 41060 14783
20706 14783 -13320 36165 36182 -45618 -64772 -18063 65514 80643 99772 73714 35438 -19656
20694 -19656 -86159 -36309 60537 65530 55747 23040 -29817 -57265 -125380 -92479 -4375 -23021
20682 -23021 -87649 -73687 60540 77704 53766 -13040 -23373 -23958 -43625 3241 52458 13986
20670 13986 -6918 27414 10061 -28831 -12645 -16053 -39763 -48872 -39287 -23285 8271 18493
20658 18493 45709 72139 133096 146326 73229 47581 -5418 -39803 -100405 -79542 -80244 -117976
20646 -117976 -28773 23273 29651 47593 43968 122699 127815 90011 54569 42159 9452 -9798
20634 -9798 -21304 -63830 -79082 -25045 3242 -39004 -28935 -39600 -45255 -58282 -45128 13857
20622 13857 49931 112920 112898 38195 29731 66565 -4485 36366 99745 117582 188012 222797
20610 222797 112950 55836 35495 6397 -32270 -13267 -81109 -47746 -16843 -7186 -24198
20599 -24198 -48064 8832 46604 21247 -32076 -68039 -24476 -23798 18035 16539 -44758 -90595
20587 -90595 -113355 -106809 -56351 -34105 -41192 3411 15688 -9171 -3250 8722 -15040 -70401
20575 -70401 -47522 379 -1865 43772 13640 -24975 -61108 24377 65480 32038 18686 -5864
20563 -5864 -17008 -8100 23893 -19180 -28716 17449 13188 -19458 -2659 -220 2288 -38197 -97077
20550 -97077 -148935 -130418 -62842 -24949 -25033 -52120 -94360 -69447 -52591 -43890 -1270 -14714
20538 -14714 -31877 -72219 -97794 -66306 -21124 49466 81568 75545 76903 37793 34314 34282 91533
20525 91533 41702 -30984 -7908 49126 58046 58235 117390 84998 84739 62175 142229 120167 53957
20512 53957 13187 6101 5779 -4046 -45205 -68799 -36012 -21898 -54549 -86848 -94293 -49788 -48711
20499 -48711 -10257 -24883 -12868 35842 62180 61088 78878 27808 -35579 -60604 -61450 24437
20487 24437 43207 -21079 3473 44415 -12279 1289 9288 -20835 29069 34047 72446 131849
20475 131849 126408 125152 47378 -22291 2711 40819 5192 51538 59394 41984 4593 -66721
20463 -66721 -76781 -40330 -5355 53856 22016 1745 36449 53563 23284 -27812 -49707 -116817
20451 -116817 -101497 -65873 -34020 6393 23396 57415 94877 92217 -1680 -33682 37873 94390
20439 94390 6579 -846 71822 85390 85567 18934 -30549 -23705 17455 24249 3726 18460 8777
20426 8777 14742 55153 32960 -2980 -30235 -27234 -231 -15451 30084 58782 48141 48752 44200
20413 44200 47377 52009 1935 -41366 -87433 -61262 5115 -37146 -62412 -56933 -28697 -25714
20401 -25714 -9606 -42167 -4900 26272 -23327 -49785 -35067 28229 86362 8365 -22332 30221
20389 30221 78923 50732 22483 15426 2024 -44148 -69239 -36792 21116 65266 6042 -18598
20377 -18598 -18863 -41296 -58663 -44387 -23365 2563 20187 68256 56168 31340 -4083 21394
20365 21394 25964 -36587 -64358 -23741 -18835 -2819 -38355 -67969 -39512 43687 32402 -29666
20353 -29666 21814 17881 26656 56177 8635 -61146 -100545 -96143 -75603 -59258 -32057 -10028
20341 -10028 50932 36142 -8370 -36907 -65809 -38549 -19755 -64116 -28171 18462 9398 -3639
20329 -3639 47716 34246 30028 -54789 -85967 -42937 -18553 11770 28341 75177 108472 129226
20317 129226 107283 84349 60405 31402 -2453 -56214 -26551 39775 79741 57413 79292
20306 79292 41037 44789 82461 39048 53161 15025 -44947 -64483 -9834 9345 -8326 -12383
20294 -12383 17553 70662 36677 44131 63765 43371 -41998 -87425 -35522 7664 -8827 7758
20282 7758 16337 -19298 10552 5458 16915 44173 40717 34429 -31000 -69928 -58443 41167 74476
20269 74476 105514 69336 55238 74699 73610 -29685 -94346 -49137 -27879 -22529 -38977 -15951
20257 -15951 510 -11796 57092 18577 24925 49806 26776 27235 81 -6458 -17588 -4783
20245 -4783 -13397 17653 15815 2291 -16080 63933 87810 125097 79175 14543 -38531 -2564
20233 -2564 13623 -32338 -12982 -3233 29726 -7468 -23339 -31655 -100327 -94178 -68864 -2011
20221 -2011 12736 11469 40244 49605 26479 5453 30203 -13272 -25835 2098 -20023 -36025
20209 -36025 41884 29837 40149 81723 47551 15329 -5273 56087 120632 133807 139766 92655
20197 92655 48512 44628 35721 67117 72159 74292 78661 91391 126779 84329 35180 11734 -2827
20184 -2827 6364 19479 35683 4286 31733 12866 10365 57118 31045 264 28973 2406
20172 2406 -100023 -113031 -34276 -26259 -62737 -97085 -60195 -36453 -9705 -51231 -92806 -58230
20160 -58230 -12144 -26080 -49560 545 16253 83467 142462 170499 26522 10301 72941
20149 72941 58359 46152 73852 29823 -32188 14670 8277 -14824 -35140 -21275 -45374 -35802
20137 -35802 19217 -4583 -56558 -64935 -5033 -11600 -41469 -46608 6954 57425 42873 26236
20125 26236 8432 13474 43351 78770 37991 31715 34667 -6199 -40336 53810 20338 -14844
20113 -14844 -22721 38604 73074 69604 46826 54733 90863 41397 52790 81894 51908 -32177
20101 -32177 -59265 -61054 -113665 -120135 -127363 -50981 14287 -16977 -42701 -4650 41265 113153
20089 113153 131578 156632 156907 130570 127196 73333 -814 -15406 -4022 -38935 11810 59161
20077 59161 76583 91584 20046 10650 19881 -12838 -94104 -76856 -47461 -11960 1348 -14413
20065 -14413 -5304 48578 51453 82713 61479 6710 13744 41242 -1258 6315 17230 81044
20053 81044 53720 23841 6042 -65664 -87639 -98085 -14432 31790 68133 51636 -8889 -31417
20041 -31417 -14116 -9283 37692 -4339 -74501 -131587 -98168 -48753 -14095 41122 69163 43094
20029 43094 5585 -60752 -31990 21673 53681 33813 56333 41606 42585 26931 -9050 -75111
20017 -75111 -85938 -110030 -23206 -19818 -2199 -19881 -6474 33714 45959 -1380 -544 7100
20005 7100 -27533 -53335 9852 67437 82596 64863 23250 3347 -12167 -40093 -12170 -29567
19993 -29567 27355 58386 59441 58704 26343 45317 49061 1206 30754 91051 65784 51711
19981 51711 36067 -19202 -39563 3071 72110 62742 80721 47806 -38393 -85706 -5671 52583
19969 52583 79507 60161 52088 79123 55600 57344 -4757 -39632 -29914 -50983 -108638 -92467
19957 -92467 -34278 3550 19499 -37685 -21999 2504 -25320 -26702 -62311 -42058 -14195 -7992
19945 -7992 -29644 -8282 24735 -23829 -38309 -24099 -22715 -2614 14266 60991 89077 15687
19933 15687 45005 39928 71497 108176 115716 92073 59514 99370 131868 61790 29628 36695
19921 36695 45875 45974 -4953 -37377 -90396 -69218 -87217 -71364 -19757 -9452 -42488 -33532 11732
19908 11732 60587 109952 121051 109767 62512 57819 33413 10131 -3218 53240 101942 80052
19896 80052 16291 -42912 -22984 27316 54014 43643 38684 -3931 -17381 -14221 17497 80407
19884 80407 76940 64508 37352 15295 17935 -14531 -59026 -20618 35351 31639 7515 72385
19872 72385 134428 142765 149861 107021 103079 170544 190109 194381 187444 201973 209450 248126 297113
19859 297113 339431 311194 333030 354509 352876 364204 372229 368118 340054 358478 368529 412228
19847 412228 404226 332360 331785 353157 395990 425119 405441 436746 394481 320352 241829 245623
19835 245623 242826 204295 169239 164738 181177 191985 159461 91094 113829 105448 77925 112331
19823 112331 99893 86512 74391 116552 131526 114432 91778 98385 156718 208985 181540 73056
19811 73056 68350 96661 131540 162786 144308 90827 46822 122346 119261 67491 71583 53969
19799 53969 -16849 -104496 -94991 -9075 76311 112167 84673 81722 144281 151577 122517 89530
19787 89530 71001 60799 52691 69967 52402 70001 89954 8845 -4849 54392 15615 20195
19775 20195 -38119 -65681 -33631 -4449 55286 41311 -44183 -67532 -30686 -55951 -134710 -168762
19763 -168762 -137077 -93104 -50907 -42774 -8335 -28175 31309 22427 4607 19836 44221 65405
19751 65405 50164 -18740 -52457 -1941 67443 168152 155666 141868 115526 87680 50791
19740 50791 72185 53320 610 -50315 -31664 7036 68464 79402 51405 22139 61300 80099
19728 80099 101208 76871 -1665 64591 94021 82936 94341 140656 122774 97186 97196 94237
19716 94237 71788 35711 79308 62572 -456 23522 9479 32910 43213 42730 51607 -33053
19704 -33053 -10319 -26541 -14850 -4315 5628 46148 52038 74181 83317 79349 146399 130833
19692 130833 96507 80802 29761 60619 81622 21666 5841 33491 62437 86419 89775 83023
19680 83023 18422 -18946 -29846 1377 110516 129671 116402 112197 70322 51604 105989 127074
19668 127074 149563 152020 200420 164855 136905 119825 125709 108241 135728 193144 149788 114022
19656 114022 80137 84075 115311 116770 77133 118487 111296 160105 114306 144787 124916 56706
19644 56706 35348 31252 50608 94019 141331 177788 258059 236032 159620 219497 276774 300398
19632 300398 382559 460532 518316 480275 527628 496005 387941 390752 413956 349331 279645
19621 279645 288646 258295 195022 111027 128474 124297 84698 69894 118303 147722 144712 140186
19609 140186 94930 63602 83464 113837 96468 -6791 -56477 -36699 -28154 -17449 40408
19598 40408 55169 80399 80858 70554 96143 167108 191471 212636 215574 159716 183220 230706
19586 230706 258421 332160 361786 383327 424994 435003 505649 567402 573295 513882 345507
19575 345507 295073 306075 250171 187956 171113 220749 246128 224014 263508 279350 285006 282291
19563 282291 258328 216271 252498 289256 231103 174414 158137 106724 148473 145131 103192 110408
19551 110408 96917 77780 121170 150774 172784 172019 174558 176868 181753 205975 217829 163047
19539 163047 87649 58738 130934 182173 134621 120327 149137 185810 165839 159697 91882 50789
19527 50789 32105 86046 116498 91059 117681 129381 172778 175904 124386 132576 217697 184199
19515 184199 130497 96068 123345 111491 64750 136365 201647 190236 185705 164896 122663 135052
19503 135052 114368 180842 171999 153168 178547 190357 235675 242549 183473 172203 177295 178666
19491 178666 179515 211949 217207 209585 187138 213262 168408 135735 153158 176075 211551 208484
19479 208484 156269 142796 138167 165853 194248 190648 187933 174153 218794 223664 159693 151047
19467 151047 155240 99383 111073 119329 127211 126501 97553 122642 132630 153699 108432 112668 121055
19454 121055 131745 162429 157246 206262 216558 89780 60980 84836 113417 111367 128582 86101
19442 86101 164237 207321 198719 154974 177565 187953 183269 184528 197188 220736 169071 131316
19430 131316 137741 199298 199657 276780 300030 262212 301425 319126 262617 319528 276571 269302
19418 269302 324411 325819 287990 297204 286979 331695 377283 375117 330946 317077 337449 450044
19406 450044 494308 470873 496219 488483 487800 490332 449866 391300 385152 438071 464677 453204
19394 453204 424978 437213 473863 520756 536162 537936 507195 486600 521507 519492 475019 521417
19382 521417 552813 577482 551746 512780 513143 506575 537381 541987 600521 625433 630540 657725
19370 657725 774190 864617 898148 813874 768984 793368 840604 884131 904847 986809 1106449
19359 1106449 1181496 1193560 1215233 1326660 1479901 1637837 1738537 1865122 2076092 2276841
19349 2276841 2530401 2768108 3035495 3313931 3606307 3934436 4352088 4807470 5295044
19340 5295044 5937157 6717560 7639357 8834344 10364067 12323234 14912264 18304118 22345989
19331 22345989 26937699 32072285 37953825 44038232 49633381 54017141 57864637 61138437
19323 61138437 63237478 64852516 66124469 67008980 66956986 67402776 68511478 69246932 68796866
19314 68796866 67990978 66542136 63857674 60254570 56020361 51089885 45100748 39471163
19306 39471163 34663882 30421332 26580349 23311462 20827459 18936857 17419139 16124225
19298 16124225 14965598 13979490 13136754 12335117 11632562 10921787 10297584 9706793 9216391
19289 9216391 8720678 8115191 7484767 6896789 6390389 6000631 5674044 5303927 5002456
19280 5002456 4741688 4509376 4242080 3999914 3781081 3582336 3361833 3140304 2943586
19271 2943586 2792824 2669330 2568740 2402339 2231310 2075161 1958802 1824340 1707813
19262 1707813 1628468 1544363 1419658 1379344 1332958 1276443 1240365 1123234 1099320 1057017 992129
19251 992129 954748 882646 804568 778978 794308 728255 718393 701586 662586 675952 636360 634177
19239 634177 651814 659711 615251 684106 702522 646570 632612 629484 649094 647113 660632 622450
19227 622450 629608 655083 665502 647000 610897 639225 607177 591562 555672 519541 593006 587205
19215 587205 539888 497387 474038 441967 394059 388215 368404 352296 380160 394490 408588 394095
19203 394095 410543 370354 324275 341031 362905 316866 322475 344308 350406 363845 378063 392034
19191 392034 376851 365082 382269 412792 371752 394132 417512 392107 418029 436221 426074
19180 426074 411751 403481 414968 435836 432056 398570 406491 416348 431163 434334 492947 541534
19168 541534 507583 483255 472488 434836 463636 446324 464956 464191 401710 430282 458601 480888
19156 480888 409636 374332 363946 395538 505716 533816 510254 522837 507854 476789 467999
19145 467999 517481 556496 600420 604202 619274 646429 642648 621592 664318 717099 774019 817162
19133 817162 890587 1018651 1093358 1150434 1197915 1214872 1268765 1426273 1592383 1735218 1906761
19122 1906761 2122666 2244682 2303381 2365960 2440629 2603000 2884346 3080669 3334252 3583058
19112 3583058 3861979 4259584 4818573 5554627 6561668 7847765 9529847 11864947 15069445
19103 15069445 19499311 25368529 32629661 40738609 48658151 54708072 57563529 56757441
19095 56757441 51967574 45285457 37611352 30354216 24483012 20077543 16916049 14631261
19087 14631261 12937884 11677760 10673248 9901379 9294792 8820088 8516694 8244659 8031393
19078 8031393 7923158 7883158 7887926 7927940 7831759 7692263 7525105 7306162 7108683 6899988
19068 6899988 6723109 6562010 6525019 6622692 6785238 6995506 7287519 7722904 8317968 9239576
19058 9239576 10591519 12386260 14821848 18172832 22745019 29000043 37237927 47288758
19050 47288758 58126114 68106685 74857451 77244891 74398272 66868779 57370124 47020294
19042 47020294 37779897 30419497 24912434 20983201 18182390 16081300 14457463 13192519
19034 13192519 12144285 11236275 10546542 10073428 9660981 9364713 9046421 8734032 8548376
19025 8548376 8312989 7938854 7510579 7067223 6578674 6116254 5664303 5209765 4701689
19016 4701689 4285018 3938875 3679358 3417435 3183737 2918419 2716799 2597080 2448722
19007 2448722 2254844 2177894 2077531 1968777 1883765 1812452 1758914 1656322 1589641 1468956
18997 1468956 1396757 1376168 1285855 1249670 1175292 1047099 972716 910045 953730 926450 779687
18986 779687 730400 735411 665497 634169 645940 631535 563340 544763 513218 444106 402692 457289
18974 457289 514125 452170 419944 391143 400636 402584 419756 477755 489822 439127 396640 394763
18962 394763 363314 360228 358968 406124 420160 405511 324643 308247 248574 158024 168810 171934
18950 171934 275449 314681 295822 244301 271580 297221 259208 190651 156906 165659 252403
18939 252403 331963 348120 363862 278936 234630 257164 273742 297051 268029 268963 243464 224838
18927 224838 248802 184287 135017 98028 86406 115809 89595 82841 88299 164749 242996 258627
18915 258627 273722 255264 185222 216047 189918 147660 117664 126367 176473 184375 163751 210697
18903 210697 304741 324420 274654 229074 200638 195146 213714 191118 236252 275705 259452 262181
18891 262181 252963 239529 286348 343493 284898 253902 214158 250047 266502 187315 132053 38543
18879 38543 16464 56381 86059 156513 186558 205256 212825 278245 290271 258291 236431 177490
18867 177490 173100 212563 203225 196206 129098 200156 265845 235210 203912 197643 193562 198158 237896
18854 237896 210284 199601 179604 176861 158241 145944 160799 174499 156987 147226 166030 202556
18842 202556 251255 274491 254015 221987 210354 272184 291521 259532 305489 382517 371342
18831 371342 310464 321770 307966 325555 317634 311474 309033 316412 375482 327432 298443 325831
18819 325831 365189 389847 347568 364237 377663 421631 473885 510172 536781 511999 506306 565717
18807 565717 615598 575562 579884 573065 536216 565700 630261 649396 683027 772362 811242 815532
18795 815532 812749 915690 1050211 1203646 1346438 1388295 1396469 1484034 1574828 1724218 1915450
18784 1915450 2095469 2201518 2252603 2451249 2619407 2839221 3077080 3324251 3524645 3909839
18774 3909839 4380849 4863016 5436447 6252889 7375068 8833322 10802419 13287843 15934063
18765 15934063 18503495 21164274 24645611 28752091 32147078 33536065 33571110 34875386
18757 34875386 37712942 40155673 40176073 38550087 37903767 38927957 40561353 40825001 38822755
18748 38822755 36133573 35029908 35022226 34054757 30904158 26967503 24045579 21943638 19844066
18739 19844066 17525502 15366234 13715299 12442787 11487530 10756046 10214009 9744919 9314986
18730 9314986 8939097 8663832 8423340 8195587 8029191 8022491 8079720 8177467 8359172 8768276
18720 8768276 9396162 10354265 11733444 13416506 15105266 16724515 18603278 21218148
18712 21218148 24124301 26280292 26779621 26806127 28138905 30298213 31648692 31055635 29827303
18703 29827303 29613823 30603010 31559779 31206459 29228812 27314977 26807934 26764464 25566528
18694 25566528 22796873 19895388 17749324 16161651 14513366 12627307 10975710 9701556
18686 9701556 8782567 8063451 7490882 6934237 6413488 6030187 5670601 5301652 4987651
18677 4987651 4721269 4459218 4266695 4045726 3870895 3666373 3449958 3192115 2971270
18668 2971270 2820285 2638101 2457129 2261754 2123656 2022139 1913789 1784228 1684301 1627014
18658 1627014 1542643 1430950 1276454 1115854 1085391 1042388 996421 932656 863620 826253 766683
18647 766683 764900 731520 663548 615705 585377 493412 454075 456716 484739 440027 352011 388549
18635 388549 375909 371007 373291 385215 358288 366860 351383 346734 364450 327618 223281 197312
18623 197312 230613 243839 276277 344393 328145 284811 194505 175149 163375 124603 134141 176667
18611 176667 147261 80734 61030 71218 54949 80416 60636 126051 191039 206756 217215
18600 217215 184946 192063 197630 206545 162399 115916 87146 112350 200611 294026 220257 171819
18588 171819 167538 223598 214737 156545 128050 127510 122726 91702 80128 57201 3253 44496
18576 44496 77866 128430 106619 47834 114993 168030 171707 213240 246874 240664 183054 155082
18564 155082 156181 167199 128113 171187 218136 240581 314991 320722 376624 496839 593535 649739
18552 649739 553712 474780 394922 354867 300160 240409 168660 160094 135734 194391 226186 211450
18540 211450 195693 174702 240784 259175 168932 112799 101351 99436 82956 67314 138315 218663
18528 218663 239164 232515 229192 222611 204750 159977 49412 -8530 -17264 40165 38615 39025 -13712
18515 -13712 -35386 3792 72093 85366 95033 111117 95307 190376 256563 232010 216889 277986
18503 277986 274313 327920 304515 255626 237311 234879 267186 256521 242789 211758 177999 157531
18491 157531 142527 66315 39907 39328 25898 73759 123001 143605 126190 69332 37734 21918
18479 21918 37872 50506 72741 103512 -2361 17142 -4239 -43964 -20886 18697 -12274
18468 -12274 -26397 -39781 -28466 -19340 345 21284 68682 4158 -112743 -136525 -79329 -101598
18456 -101598 -5449 31434 18558 49108 53822 29057 37637 11168 42093 86956 83674 122289
18444 122289 104840 82346 111594 103621 35588 -24936 -48473 -33493 9513 -5877 -79685 -70217
18432 -70217 -62381 -2579 60648 33906 4955 -50495 -8171 -67031 -80097 -74461 -59832 -105212
18420 -105212 -112364 -20378 16570 43778 42095 43318 39636 27470 -81975 -65447 12667 61826
18408 61826 96595 30622 -27195 -38295 22985 6669 -18005 5164 93539 138441 104133 27485
18396 27485 43324 89488 67414 23688 56591 25408 9087 75202 96401 36773 -1099 20165
18384 20165 2090 -50889 2572 26126 62291 40944 24251 16062 -27679 51092 143030 125037
18372 125037 81596 37838 -33265 -12150 -26775 9146 19081 32162 16976 745 39479 113033
18360 113033 133556 124239 124305 64518 -8838 -33740 35476 67837 64241 87822 67316 30343
18348 30343 63000 73003 1489 -7472 -43949 -137634 -132981 -58078 32724 88722 108122 52227
18336 52227 -6 10297 25195 -20724 -3687 35289 6182 -51343 -129765 -104133 -111844 -77225
18324 -77225 35369 36604 42932 48573 32405 46833 71408 91259 85253 66407 7937 14197
18312 14197 -13668 4678 64899 68322 109345 82412 50710 36069 40380 59467 40654 16438
18300 16438 -20967 -75617 -114902 -128121 -118177 -62812 20411 83059 102105 130517 128832 97404
18288 97404 85014 83036 55749 50234 118578 152814 114985 51368 23917 9560 -14145 10455
18276 10455 23541 -2398 19112 35968 48871 64070 89080 112418 62484 36680 59255 46414
18264 46414 39094 91444 63737 16923 -43572 -61235 -9729 19502 -24582 -70458 -111052 -81247
18252 -81247 -63906 -28662 -4536 20282 12403 41499 -1901 42246 132467 178451 185059 206015
18240 206015 243063 236554 200608 176828 160017 133268 135044 136722 176636 241131 297683 271352
18228 271352 253558 251895 231820 224987 176726 125649 112609 91277 105526 122856 161945 164715
18216 164715 105902 32537 77476 130844 146147 98061 77789 75325 89280 134419 160402 143064
18204 143064 161720 167950 164010 224908 190231 173240 172137 202570 154571 192778 235099 265208
18192 265208 228386 222329 216056 184237 197398 237824 346848 370508 361988 342355 326472 337622
18180 337622 303422 268745 294397 302430 370331 276533 220345 202116 191705 241598 257145 229330
18168 229330 252186 276965 279099 310789 229138 274860 239940 218112 208729 166960 155414 142521
18156 142521 142716 199349 256533 275711 332254 308522 301981 313713 328613 372682 425824 446881
18144 446881 505739 523627 511794 477849 508797 457887 454282 459131 507736 532521 537130 580082
18132 580082 600949 612731 730796 833264 891694 961658 1156285 1296032 1422086 1591357
18122 1591357 1765915 1965279 2202241 2535059 2844876 3236973 3787103 4498721 5400617
18113 5400617 6571796 8234063 10419268 13297582 17365309 23235737 31973637 44926823
18105 44926823 59687933 68257303 62106178 45073439 31644525 23616097 18709650 15383826
18097 15383826 13050043 11359063 10066244 9064021 8192724 7412069 6779691 6246851 5776500
18088 5776500 5388532 5143563 5007856 4967031 4910522 4804238 4560188 4201773 3850534 3536673
18078 3536673 3293239 3037367 2805461 2544743 2429226 2294929 2061973 1841967 1734702
18069 1734702 1655688 1620895 1559441 1407840 1335291 1222275 1126364 1081662 996686 948338 877628
18058 877628 860620 812143 794096 824409 752221 705621 702026 691810 646843 618003 522397 473370
18046 473370 479239 459248 418871 379380 404784 331770 260405 273480 287391 264951 246525 256270
18034 256270 213191 216934 214460 253381 269348 235479 189941 101007 137519 142817 135275 124199
18022 124199 176845 164040 117850 91079 124949 104006 118144 102143 91203 57811 84948
18011 84948 91270 125201 112275 65419 96829 63179 28145 58388 101551 147339 129169 103659
17999 103659 55084 104605 121760 75542 -10284 -13252 37821 33785 12646 -7525 -8207 -32753
17987 -32753 -51747 -34558 -5496 26053 80863 120647 48654 -16868 9715 -9684 -21526 48001
17975 48001 63963 63194 14522 -7265 34566 63178 56417 46347 7816 24878 128016 95402
17963 95402 69509 105452 68900 66592 40138 22720 18002 72139 106827 58439 65849 89276
17951 89276 112749 114178 89693 -18974 -612 42896 80459 124325 120842 90573 21080 -57333
17939 -57333 -58803 22151 16298 11268 15846 71482 62335 82051 111361 109411 71981 35606 78824
17926 78824 110809 104291 77242 67248 63793 55489 16198 6347 -4277 12565 55145 37533 538
17913 538 80331 90547 46511 44127 90956 110451 46214 -33790 -57059 -9838 7650 -11109
17901 -11109 74536 39432 -41742 -7837 -22809 -15776 4650 -9114 -55464 -8464 39732 69702
17889 69702 79433 85172 85238 40260 70544 51194 60785 108773 83267 -212 -30075 -14938 6147
17876 6147 34872 -42993 -71277 -51144 -60525 -77590 -45781 -7921 -37043 -70729 -3650 40917
17864 40917 32065 110738 167601 118965 28822 12865 76808 82685 28887 -29443 -54149 -60328
17852 -60328 -25059 -27888 17081 11600 -29661 -52977 -14968 -11650 47012 72256 104494 106878
17840 106878 85309 29900 20405 -97457 -128519 -91813 -53262 -71672 -50655 -38736 5640
17829 5640 62666 85709 83832 54583 126778 178083 128935 60474 70425 86360 61789 -323
17817 -323 -51266 -42109 -62584 -60049 -68441 -47015 19772 73034 101082 58045 87933 77067 20798
17804 20798 25457 -3636 -75465 -127623 -66182 36675 51646 -5536 -6441 -14204 7924 -1191
17792 -1191 25851 30174 -7962 -48295 -58951 -59454 -50841 -67629 -22151 -5295 -17617 -21237 -39377
17779 -39377 -80989 -98271 -82219 -72008 -80032 -64313 -88775 -80624 -52048 15909 18077 -28362
17767 -28362 -12480 17277 10234 -4661 -14627 -1081 38563 -26087 -24308 -38769 -44606 -61684
17755 -61684 -61992 -62037 -67333 -86808 -65438 -39696 9104 -14017 -69358 -106840 -104825 -61067 -2987
17742 -2987 -4086 23808 28994 13025 -12447 -51489 -38422 -58497 -78025 -43284 -75374 -75670 -20252
17729 -20252 -32249 -42087 -14888 -65240 -100942 -108150 -76449 -24051 22286 57397 43128 81460
17717 81460 77319 65726 51483 4424 -29331 -6226 28436 23881 57135 74211 88574 35876
17705 35876 60890 87333 26144 43503 12797 -66384 -64962 22438 65572 -3563 -40274 -19518
17693 -19518 73333 45675 58899 74397 -16915 -82238 -36943 -22527 -27979 -22825 -48762 -22438
17681 -22438 39047 36650 -52556 -67119 31619 90001 68423 62039 -12572 -77097 -62380 -46875
17669 -46875 1479 -31425 -63299 -105214 -125203 -91385 -3996 10807 -20390 -4030 -11887 -52766
17657 -52766 -34530 3689 65017 28993 1036 -277 22351 20608 2230 19387 28336 -24927
17645 -24927 -81178 -91524 -43823 -57277 -88099 -90140 -67319 -9962 37500 55832 -872 11908
17633 11908 26429 -21228 -95476 -121231 -55331 6844 23995 19019 46354 18791 -30256 -26618
17621 -26618 9576 22559 62631 6731 -29184 4017 -30049 -95262 -150180 -56606 -10607 -73902
17609 -73902 -110688 -113653 -114587 -92056 -103808 -12205 62072 86438 65493 -5506 15115 -13037
17597 -13037 -49383 201 12288 36757 -9588 -39132 -1438 -14996 -98947 -122314 -130559 -66010
17585 -66010 -43389 -73580 -7811 5082 -41541 -75241 -104056 -147902 -175330 -144149 -56134 -36997
17573 -36997 -87957 -88552 6585 14500 -1551 -24495 -94267 -104058 -117190 -78980 -85100 -90570 -60435
17560 -60435 -18984 -23887 -14660 -23532 -60903 -45260 33187 18709 -9302 -11320 -58155 -60412 -39601
17547 -39601 -32988 -100807 -121842 -112217 -62553 -37355 -29060 16761 13507 20924 70510 32626 -13187
17534 -13187 63844 138902 112596 99367 53190 -2254 -43345 -27868 -5016 -7444 -2776 21447
17522 21447 40978 62646 -5019 -21772 -54601 -33111 -1692 -15395 5705 -26509 -57021 -6226
17510 -6226 59190 49007 89935 65304 -10741 -4366 16862 -69288 -38115 17647 3598 -12857
17498 -12857 1096 20495 -16012 -51504 -57880 -50481 -32720 27302 55960 29137 59800 12312
17486 12312 15904 -44850 -134670 -167328 -129297 -156630 -110608 -34934 11234 -16672 -5036 -22988
17474 -22988 -2880 -19312 -73498 -89744 -31267 -18473 20187 11705 -12540 -32015 -60411 -24302
17462 -24302 13105 -21354 -24770 -15761 14297 37893 5020 15745 9076 -57564 -77136 -53558
17450 -53558 -81190 -47264 -47079 -73950 -148853 -94558 -77535 -63911 -24693 39936 156963 190641
17438 190641 258771 303011 239591 184557 76701 39126 -14815 -37113 -16583 -34723 -7900
17427 -7900 201 32462 23098 -24592 -81952 -78704 -47985 -66587 -104224 -120191 13094 53206
17415 53206 52301 47473 1706 -5428 11332 14777 10574 2708 41017 16195 -34445 -35929 2276
17402 2276 24591 -2318 -60494 -32363 20739 12476 -2711 -63193 -102908 -67737 -14648 -30546
17390 -30546 -55435 -60944 -111297 -145109 -75693 -82062 -106229 -124663 -94162 -108312 -102114 -65934
17378 -65934 -16141 -4676 -36083 -89913 -66837 -36953 -45715 -7147 13851 -46369 -83814 -96977
17366 -96977 -26152 -17336 4539 78104 68661 76614 29366 -49325 -94347 -66670 -8940 -65921
17354 -65921 -54056 15455 -20218 -99465 -103199 -19987 -62628 -88529 -86386 -95645 -68417 -112162
17342 -112162 -129181 -59808 -14088 -27456 -97722 -89590 -77996 -51723 40160 88578 106975 66048
17330 66048 39731 87044 28275 -35660 -16320 44762 13141 16755 16826 -21267 28227 33698 45761
17317 45761 47056 47773 -63467 -114281 -70242 6832 30146 -29646 -94919 -73601 -64918 -61329
17305 -61329 -48107 -9419 36297 57684 62312 -2119 -10103 16037 6224 -35302 -80495 -65622
17293 -65622 -19901 -18688 37243 42408 18145 23077 68837 59069 -40976 -86468 -61842 -17992
17281 -17992 -24945 -27957 -2976 -12283 -20034 -22916 -12404 16931 -51 -26045 -23777 -28718 14544
17268 14544 15293 39143 8380 -3309 41006 -11681 -74572 -29024 43625 117634 149784 126812
17256 126812 95596 26674 -61633 -75151 -52908 58981 120585 91105 69077 54617 32816
17245 32816 -57712 -45471 -5610 -19433 -41348 -15550 47615 35292 -35213 -105429 -139871 -121262
17233 -121262 -91920 -46172 18433 32557 5846 -5504 -26136 18894 78675 75567 -15127 -46960
17221 -46960 8231 84571 95481 95113 105544 60366 58582 -11074 -82279 -40395 2652 8559
17209 8559 -38883 -40678 6692 41601 -66017 -116853 -43250 54133 44647 62721 37993 11703
17197 11703 87653 127168 71229 -29592 -13075 -4799 11432 42482 36297 24299 -5893 -34399
17185 -34399 -55127 -18441 -66942 -62204 16046 55309 102971 104607 51062 36233 44687 -15117
17173 -15117 -42660 -12211 -21616 -63374 -34407 -35853 -40815 -83631 -124587 -133974 -124593 -80304 -63746
17160 -63746 -15128 -37123 -36066 -25125 -47581 -83981 -19080 -28702 -93009 -99439 -40308 31057
17148 31057 86888 70341 13498 13773 18750 -25778 -47523 -70266 -44887 -13858 37177 14772
17136 14772 73383 118374 109013 27454 -18285 63303 96677 33782 21961 62772 81825 71166
17124 71166 62255 19222 21613 108354 99970 47820 12549 -54062 -77909 -23884 -33529 -16565
17112 -16565 27855 115600 112089 63455 12011 -30880 -49435 -126254 -139307 -113933 -70010 -42148
17100 -42148 -10955 -2598 -19401 -63755 -79466 -78175 -80693 -88309 -67192 11985 14885 -78588 -101726
17087 -101726 1526 17059 18191 41401 8394 -22733 -57241 -19860 2173 17808 36809
17076 36809 10770 42972 6568 -59318 -14041 -16736 -23734 -65496 -86620 -55315 -5370 50530
17064 50530 75634 44931 -6599 -28522 -55116 -37025 -31171 -34108 -69323 -58217 -57651 -78741
17052 -78741 -94259 -82285 -49657 -34854 -47992 -112319 -119501 -56422 -58497 -69516 -71439 -27695
17040 -27695 -5264 -28162 -79279 -110782 -113784 -113941 -78635 -15710 -25700 -21159 -27085 12999 21126
17027 21126 -24838 -8937 32672 46247 -7824 -19102 64012 67136 26474 31589 53072 18667
17015 18667 -42141 -11853 -4899 -31342 -80372 -101257 -77089 -84921 -148930 -136855 -105115 -83585
17003 -83585 -57582 -49982 -58296 -24316 13797 50989 13623 16240 34837 -40718 -87408 -131115
16991 -131115 -162831 -81059 -66428 -30685 -70139 -14934 8410 24604 33173 -3544 -57638 -85735
16979 -85735 -82447 -76533 -66703 24419 71757 84002 111325 66879 50148 19982 -34849 -37434
16967 -37434 -27841 -21066 -34379 -6644 26207 6888 -41133 -35754 -13710 -43230 -12455 78238
16955 78238 99203 3126 -40734 -82576 -149251 -117454 5320 19040 -42516 -46779 -38368 -48496
16943 -48496 -80660 -85295 -85112 -51599 102553 138726 61669 48069 54298 9269 47795 80671
16931 80671 63922 30137 75786 72314 -235 -92427 -71668 -22658 -16331 -37736 -108946 -115414
16919 -115414 -93202 -75192 -100859 -88985 -53508 -100498 -91455 -84587 -120098 -111757 -91879 -41815
16907 -41815 -38975 -36994 -17299 34959 -10981 -123630 -165585 -140536 -78329 -65203 -55176 -85399
16895 -85399 -86334 -20687 33251 49353 52961 100001 143769 58650 -45286 -92461 -85665 -54886
16883 -54886 -58876 -42860 -37895 5909 16112 -14782 -66250 -60514 -55241 -52880 -72149 -24827 -6966
16870 -6966 -36586 -77646 -5023 17247 6723 -30793 11156 -20741 -100180 -143228 -107556 -40856
16858 -40856 -666 -32650 -27116 -24258 64779 28075 -4591 -12947 -32108 -7008 -21087 -128976
16846 -128976 -169251 -196562 -125172 -68565 -17221 -45495 -28144 -45711 -20632 21402 60339
16835 60339 27135 -47533 -28892 -52446 -38337 -32142 -29175 -31215 12196 29283 -8792 545
16823 545 11730 51490 144826 86405 29742 5789 -17104 35771 -5712 14799 65013 70016
16811 70016 68678 45627 58661 64121 11468 -29983 -18338 50090 57553 -3888 7461 -8635
16799 -8635 -11585 -20747 -11595 -70537 -50170 -1829 7200 -71541 -113041 -80237 1886 46403 59756
16786 59756 11733 42785 27425 -4300 9754 17014 -22865 -69590 -89882 -98172 -73522 -90426
16774 -90426 -73647 5212 66557 48443 50804 68465 74147 15320 -39383 -14344 38947 19319
16762 19319 -64192 -97409 -49004 -7175 -97441 -140613 -144734 -122987 -80353 -8823 14156 -12611
16750 -12611 -15742 7209 70313 104343 11647 -58984 -29810 -23587 -55423 -97033 -64048 -31530
16738 -31530 806 -14949 -15123 -13186 -5764 -22691 -65236 -63290 -43492 7362 29717 -34154 -75769
16725 -75769 -11957 -12843 -1142 43230 49953 -5694 47210 12172 -23788 -72111 -33426 -28792
16713 -28792 -51590 2707 26368 23340 -9995 4992 24959 -21476 -56131 -261 4541 -52278
16701 -52278 -81528 -58392 -56602 -23034 16847 -6563 20218 48693 53584 52291 16120 22921
16689 22921 -19750 -48055 -28679 -20210 -74081 -77946 -14752 -2356 1486 -511 25298 5074
16677 5074 -47250 -47622 19549 55079 66731 61220 31821 15721 -44905 -29986 -86313 -137794
16665 -137794 -79979 -49735 -33710 1077 39599 46887 83245 84195 57576 57861 55665 -15435 -64260
16652 -64260 -36118 -12742 -27929 -87948 -88524 -74087 -18033 17515 47510 57850 33115 45173
16640 45173 56831 57858 77184 77601 27748 10522 704 -22419 -16701 -37711 -70828 -74321 -47401
16627 -47401 -11208 -28915 -80254 -46175 16068 47010 52527 -13022 -49236 -31622 -22408 -41153
16615 -41153 -66267 -57367 -3871 -5485 16530 19198 14634 -78585 -77025 -33013 26768 11568 -32906
16602 -32906 -15279 24247 -4004 29942 79566 90524 67517 65713 78295 73315 82086 129544
16590 129544 157617 149171 151149 172303 113273 71076 62206 26952 4840 -16611 18769 -11967
16578 -11967 -11670 81741 106587 75531 79132 47709 79564 85080 87580 61469 -6488 -38187 -101563
16565 -101563 -119681 -136922 -122808 -41857 -8290 -25535 -41846 -57089 -32784 -26833 -11430 -48780
16553 -48780 -62252 -91496 -22210 -45769 -100981 -91391 -40770 16902 25282 -17247 -32897 -48936
16541 -48936 -112619 -103348 -82788 -92392 -95625 -41026 -17253 -58180 -104124 -41461 2312 34689
16529 34689 47577 7729 1442 -4021 1144 21642 25978 42487 7189 -111758 -175278 -131152
16517 -131152 -385 69282 49676 3120 -39480 -6109 18092 64972 103748 89788 59452
16506 59452 70882 34441 -4710 -59382 -76908 -99023 -128827 -131555 -117305 -64197 -92368 -71506
16494 -71506 -77267 -101499 -79875 -96538 -93931 -146453 -99144 -116450 -131648 -125056 -98817 -8677
16482 -8677 15678 23160 -31561 -19545 26006 8341 -33611 -66697 -75263 -52281 -101752 -88693
16470 -88693 -919 14972 -64959 -138055 -167577 -125372 -62492 -55655 -68697 -15322 70158 58538
16458 58538 62728 41289 30448 60060 94395 71150 91158 91100 10189 -32936 -48845 -59566
16446 -59566 -19438 3326 22453 -47787 -42692 -18262 40367 79602 78758 33498 -15157 -19172
16434 -19172 -20086 -41376 -75712 -79462 -113200 -45982 44166 65307 55216 60517 65314 56016 8772
16421 8772 49584 34147 15813 -18236 -64618 -127787 -134439 -98875 3398 62235 37230 22553
16409 22553 -10533 -42493 -1131 -90339 -42777 7468 -84312 -115736 -75168 -52814 -64478 -47104
16397 -47104 3007 78072 123142 54003 -21230 -83605 -69620 -9914 49537 71160 106079 127220
16385 127220 165368 135542 69831 24369 -13372 2064 -21213 -34317 -65674 -25044 -75909
16374 -75909 -163728 -133005 -29030 -56134 -20606 -2589 -41468 12580 110321 124309 76035
16363 76035 63785 41644 -18745 -74930 -72180 -26794 -43042 49955 55856 70353 62893 36173
16351 36173 18184 24833 -8183 -516 61451 73831 45651 31106 5845 -63233 -45037 -67206
16339 -67206 -47072 -20079 4266 61181 11743 -44157 -16047 -21440 36797 84800 62274 41426
16327 41426 43236 14858 -47543 -110783 -56276 -26466 5507 9739 -4371 7317 5604 -46207
16315 -46207 -221 47118 -9923 -64301 -49219 -13565 -23927 -92176 -69806 -46256 -67288 -38473
16303 -38473 6578 -17719 -30633 -2112 -6204 -36566 -38994 15585 4308 -17000 -11652 3835
16291 3835 -64848 -100226 -72126 -98651 -70269 17245 31424 4978 -20045 33433 102968 135103
16279 135103 45831 17531 71566 103929 37309 30674 50254 46038 31077 45645 80589 75129
16267 75129 10884 -14244 -4788 49343 48675 -1048 -43940 -11482 3019 21583 -36724 2516
16255 2516 7663 -63254 -43135 -34382 -6303 16539 50339 5001 23750 82136 86250 32409
16243 32409 21094 26293 3515 -13410 -23798 -2893 -36872 -23945 5790 59640 30833 34647
16231 34647 -22568 -7890 -24822 -54749 -47815 -40194 27894 21254 -13568 -19119 -7715 -51525
16219 -51525 -20697 14483 -17906 -81039 -98650 -119928 -79052 -51046 -23875 7570 -9480 -34921
16207 -34921 -41665 30064 56316 64540 56877 41952 -8920 -6466 10836 -22393 20393 66953
16195 66953 46167 38705 31850 -7596 55289 99233 86864 96176 101407 103804 35297 -2970 -20253
16182 -20253 -63354 -64465 -8996 -9431 3626 19371 45364 78381 97878 6614 -91029 -109742
16170 -109742 -115799 -118174 -101980 -27947 -43547 -40980 -18368 17967 61154 81875 52202 57165
16158 57165 20377 -21620 -27227 -32593 -109568 -95514 -23032 -15388 6666 7300 -47748 -79189 -94966
16145 -94966 -69047 -31739 28072 57185 42022 16931 -13588 -5667 19870 24374 -35951 -77487
16133 -77487 -67777 -82662 -64465 -52389 -121704 -125168 -62383 87048 132710 100741 109658 94810
16121 94810 100651 39985 -26648 -51444 7253 7713 -48187 -65876 -49642 -10970 -37269 -85412
16109 -85412 -77567 -28735 39669 74242 83735 23866 -44079 -80516 -133698 -117662 -30986 -31678
16097 -31678 13575 50345 49017 26548 7176 -12775 -28723 -20743 1748 -11314 4748 -35138
16085 -35138 -20833 14289 -475 -51653 -34473 11374 59621 -18326 -38733 -71788 -109428 -150682
16073 -150682 -184368 -117150 -41547 -62863 -157775 -126435 -67213 -26097 13862 77413 88626
16062 88626 7441 -55590 -32738 -6279 11239 58625 65385 45533 18609 -11165 1319 -12954
16050 -12954 -23930 -55325 -40293 -20840 1633 36698 60871 17407 22600 6659 -15921 -16996
16038 -16996 -45802 -75307 -40386 -42068 -7603 44924 39967 7639 -31860 -36203 -15817 -16991
16026 -16991 -10671 -32043 28781 69466 -6577 -4598 39355 -8828 -3714 -17623 10613 30042
16014 30042 44271 41334 47187 61969 42116 52410 17990 -79539 -33788 2153 23640 45324
16002 45324 23268 5295 58389 67565 87977 115979 82897 46449 34408 27437 20742 15725
15990 15725 14175 -63132 -17108 62595 37065 17486 -49108 -72010 -45510 -56921 -94420 -78956
15978 -78956 -101526 -105945 -69178 -94089 -114121 -72406 -59308 -59944 -12810 -1795 59022 65263
15966 65263 54267 77318 1912 14074 78411 128393 71188 38962 -5307 -4718 32493 52978
15954 52978 85166 55906 -21093 -71257 -68640 -57572 -63699 -69169 -40875 10541 25764 19154
15942 19154 85095 105272 122159 118206 93819 76529 85735 87893 75084 77109 53651 10269
15930 10269 -49009 -70697 -61799 -42597 -23715 6481 12927 11679 23106 -13083 -35783 -67912
15918 -67912 -26954 46124 71108 37222 -24617 -63440 -73113 -84309 -110135 -94321 -6153 21192
15906 21192 -38781 -83608 -82815 -54047 -56060 -54320 -4551 22427 55689 51769 -34735 -96978 -35849
15893 -35849 13462 47362 33773 -676 -23990 -42058 -50583 -57457 -46689 -91219 -105038 -59045
15881 -59045 18168 15615 -2391 47651 39561 -7451 32910 16721 -13868 -53275 -104089 -99465
15869 -99465 -59449 -82396 -10154 33008 -1187 -14209 -52436 -79216 -49733 -17818 13404 32334
15857 32334 -26831 -62161 -19894 47274 29760 13762 -3933 42704 24894 -41313 -4093 -10458
15845 -10458 -62629 -75428 -98595 -39187 23087 68613 140698 73666 61673 41739 78701 68992
15833 68992 75087 22849 -58248 -39938 -61794 -85835 -100538 -77285 -22643 -1296 -15352 -29443
15821 -29443 -10685 27131 -17397 -16223 3736 -30099 -29634 15066 -21166 -77140 -91666 -12094
15809 -12094 60389 103898 137600 52257 -23853 12628 41247 36584 34871 21750 54699 54939
15797 54939 1969 11818 91748 137485 95544 71944 34699 -29319 1173 86625 49542 30469
15785 30469 34880 60514 54706 88795 79911 58825 23756 33512 27859 14629 37959 85578 45491
15772 45491 -20147 -20758 -102570 -78507 -87671 -100587 -56229 -56077 -22211 -9547 -23761 11761 91343
15759 91343 129127 61515 -35632 -85603 -93862 -51063 -57096 -55470 -42515 -50895 -88545 -77868
15747 -77868 -85055 -27127 -8188 11018 73290 79206 46820 -13601 -83507 -114847 -115706 -27554
15735 -27554 50748 62543 48353 35303 -20867 -55191 -32480 -15404 35310 18683 13693 4661
15723 4661 16036 60634 105784 102000 97304 93437 73389 105618 71866 4694 -15764 -453
15711 -453 59874 60034 43552 9369 -67064 -60432 13686 77036 128459 99868 -1175 -9198 12293
15698 12293 19685 9012 -21023 -24113 -31544 -20254 -36720 -57355 -100190 -93367 -92262 -102883 -69870
15685 -69870 -61015 -76624 -70629 -55994 -49704 -55646 -35727 -23160 -24203 -154 15571 14146 24660
15672 24660 19713 22365 -20179 -10355 86728 101242 85144 37988 29953 30377 54289 25405 30421
15659 30421 117354 152769 126632 89978 72013 45605 -19601 -48094 -14039 29963 51406 27533
15647 27533 32312 18772 -9183 -20469 -12359 40202 87026 97824 63108 17678 641 -10824
15635 -10824 31888 31198 27125 42860 10930 -38639 -46098 -65591 -99271 -114433 -121223 -128999 -53812
15622 -53812 23091 -1067 -11561 50944 80926 62242 -36204 -64739 -54634 -30621 -62850 -92291
15610 -92291 -67367 -59155 -53910 16816 101743 51769 -37132 -33718 -9123 -7482 -22757 -63030
15598 -63030 -86981 -36900 26904 34989 -44500 -76225 -66617 -68040 -94724 -54865 -1696 10413
15586 10413 -6701 -11723 -47074 -17603 -9921 14704 64277 -48745 -82239 -70171 -40725 -85119
15574 -85119 -36226 24839 45645 -12327 -75146 -72703 -48787 -68802 -42853 -82875 -88786 -76815
15562 -76815 -35431 -51273 -119521 -155347 -127669 -105557 -83067 -43084 33420 57982 21461 3850
15550 3850 9848 30364 -15014 9018 -4974 -95659 -96011 -35928 -66817 -121881 -111481 -45462
15538 -45462 -1222 -21550 -7729 -7591 4009 42534 58162 55463 22084 4128 -12467 -13710
15526 -13710 72633 63088 -23026 -70254 -53938 8424 -44763 -49022 -28600 -72662 -86330 -51776
15514 -51776 -52097 -64101 -45019 -11577 11523 43357 57698 48649 56803 26462 8348 -3981
15502 -3981 -12247 -12972 -19372 -8592 32816 -26806 -21299 20559 23660 9496 23380 -18801 -686
15489 -686 -28234 -60460 -30818 17281 51052 38125 32073 21624 30571 13276 -32274 -29998 -70565
15476 -70565 -105736 -74427 -4963 15076 -14566 -662 -14825 -44780 -76723 -124622 -93185 -14733
15464 -14733 23220 8586 -41038 -59693 -79994 -33576 42934 25274 -7592 -41843 -101321 5878
15452 5878 60167 -14300 -43259 -33529 -53324 -48188 -25336 36555 60048 101888 121463 108792
15440 108792 101022 22354 -23320 -17561 37630 53394 27462 7 -559 -41946 -30217 -42629
15428 -42629 -13630 5680 -10369 48475 119964 101950 -974 -29759 4209 -117 13468 -22431
15416 -22431 -25379 3694 -7810 47458 61143 98304 99630 66085 58621 60542 54987 57909 105390
15403 105390 70193 66399 78163 60114 6654 30560 -19935 -59150 -35107 31184 72931 73260
15391 73260 108298 24247 -44888 -61659 -89302 -64446 -16203 -40261 -42577 -61067 -31422 -17288
15379 -17288 -54693 -34751 -26182 -45505 -71751 -76255 -41165 35554 -7848 -74566 8370 76762
15367 76762 57565 -5212 -55263 -56768 -47457 -58786 3805 43148 -3695 -11653 45511 94929
15355 94929 98993 62501 70642 99255 60075 47432 53215 44394 44578 3812 18747 38523 -13574
15342 -13574 -52694 -25773 18399 26726 13247 -15037 -98332 -95252 -12365 -9273 -51882 -123117
15330 -123117 -96830 -50805 -29304 -37621 -106308 -146603 -117945 -71653 -81757 -96580 -121478 -110637
15318 -110637 -68638 -79531 -38754 10226 52447 -5610 -31642 -26824 -37341 -22989 60686 23376
15306 23376 12171 92107 88799 88481 98850 96695 69717 82112 83442 103769 80050 29540 64352
15293 64352 40296 25012 26246 -6724 -10749 23033 41373 -10766 -22357 40896 44173 -23165
15281 -23165 -73432 -115042 -137751 -88006 -56616 23995 -10302 28535 114648 91807 31099 21768
15269 21768 35037 26388 21738 33330 -19821 -72825 -100496 -50484 -52140 -113182 -76098 -54995
15257 -54995 -26184 -4188 -10264 -48380 -76241 -87751 -126254 -108466 -69575 -54138 -51097 2666
15245 2666 -23730 -19528 -45868 -74380 9919 71094 27478 -74287 -135730 -118534 -84946 -38890
15233 -38890 -36238 51348 22054 -14206 11164 -3827 51531 25174 -43301 -21565 -9738 -29510
15221 -29510 -42226 -26387 -2772 -37204 -57694 20772 51780 -12928 -43701 -8836 -15329 -66448
15209 -66448 -53669 -82672 -77813 -69339 -59462 -18674 -6605 19121 23581 -9047 -7581 16182 -10951
15196 -10951 -15367 24484 62239 78890 34779 -30345 -47073 -11841 -15840 -10349 -11448 -1165
15184 -1165 43498 86120 77111 106830 104468 69527 55753 14346 -39464 -76312 -86219 -99459
15172 -99459 -61752 -38953 -47110 -55278 -29616 44289 48773 54756 46110 114357 113234 83129 110193
15159 110193 69817 67861 89163 115476 34125 21953 57668 14126 7664 -38000 -59257 -97934
15147 -97934 -145924 -107263 -22182 -48657 -68267 24209 98397 92057 55693 53839 10002 -24652
15135 -24652 -8305 19320 134 -65295 -51051 -56318 -17929 -43303 -60847 -66150 -38112 -27154
15123 -27154 -44958 -52538 -77757 6102 103721 75260 12893 -54280 -55559 -25106 -22371 -39626
15111 -39626 -13888 -8783 -48608 -37213 15217 593 -27104 1734 -49390 -57857 -53439 -16524
15099 -16524 -1142 -40307 24552 46382 31606 83521 140471 41260 -14924 282 -4070 17868
15087 17868 -7158 -8347 2104 -8613 -2735 22483 -26013 -43557 -45528 -60846 -117104 -135992
15075 -135992 -114481 -75581 -56090 -13204 1968 -42676 41880 62454 56479 15880 -13694 -23101
15063 -23101 556 -19505 -65720 -20980 -16 -14492 -14405 -11887 -3344 3262 14736 49042 34256
15050 34256 19425 52616 27609 21115 23074 4918 -34703 -78325 3429 12927 -32988 -41628
15038 -41628 -10981 15162 50214 17371 -42646 -80525 -52816 -48308 -15250 14002 17546 33233
15026 33233 68155 63024 29657 -35036 -59474 -30486 34124 36616 64149 103332 84868 83754
15014 83754 47128 47001 -15539 4549 29738 79096 46563 -59541 -94960 -56084 1644 50675
15002 50675 81094 104502 117430 80063 25739 -32383 7667 -17244 -35569 -34952 8330 21238
14990 21238 -18168 -27780 -67767 -43786 3633 -37015 -2649 49622 67114 52470 71295 42278
14978 42278 -487 -21021 -69728 -78371 6542 2796 -6202 -19949 -14429 -3267 -36580 -13541
14966 -13541 -55130 -48357 5317 8758 13568 39213 73073 30588 1867 18226 37762 12338
14954 12338 20951 55090 33676 1664 41482 436 -31301 -3202 -20794 -50410 -38263 -37754
14942 -37754 -99214 -79452 -30926 17518 29108 15012 21727 29189 46755 61053 79344 28058
14930 28058 36633 94284 6633 -27295 -38737 -26642 -1438 36078 45628 44916 104119 113170 65563
14917 65563 24430 35269 -11188 -42873 -24869 21367 55167 98988 107675 62080 44833 9565
14905 9565 -16579 -5965 -14068 1187 65330 62734 47044 -5561 -7153 -44255 -43194 -27098 -32657
14892 -32657 -38586 -84055 -68865 -26355 42609 69633 79437 123027 140358 120145 37501 -8309
14880 -8309 15690 26564 48509 64097 110712 37424 5209 39821 68374 31400 14918 -6545
14868 -6545 -4936 18058 14522 8570 54433 35652 -29777 -60961 -8549 -10248 -51948 -95780 -86277
14855 -86277 -33261 11360 54330 71705 61383 15346 -6941 -41735 -61652 -43390 -50297 -55329
14843 -55329 -36126 -13460 -21125 -31701 32854 96775 75322 50083 -30750 -99778 -106993 -6696
14831 -6696 19582 -45712 479 41230 -33668 -73606 -53467 -108464 -193641 -181080 -78068 -23393
14819 -23393 -78137 -73775 -37342 -58728 -47605 32 12026 -40312 -89744 -154360 -135730 -51600
14807 -51600 6318 -12051 4919 -78 -50200 -27496 17064 91806 122533 74359 35016 79356
14795 79356 60917 24092 -20417 -19694 -10943 50300 119373 55696 43331 65736 7950 -58485
14783 -58485 -29621 -4503 -4923 -10491 29993 43961 42756 31477 49377 47092 24315 46908 94720
14770 94720 128634 122865 104863 85816 26130 -29465 -24189 45369 11013 21461 35658 106
14758 106 -15538 -22514 -17795 39167 54238 81508 114084 70852 -11592 -75716 -37135 -32875 -88148
14745 -88148 -151662 -143978 -85313 -47298 5629 72481 60539 37909 -3201 45994 69291 49182
14733 49182 50797 59479 43363 31404 50514 119785 52004 -49689 -99127 -124892 -90321 -67146
14721 -67146 -72766 -127517 -115048 -85687 -104891 -98636 -64727 -91446 -92981 -31640 -16661 -38216
14709 -38216 -4058 31213 61326 142514 154154 138045 93367 -14471 -34756 -94583 -70542
14698 -70542 -11704 26895 43623 -13916 -12029 -39444 -38561 -8405 -15401 -24352 -40553 -43550 -50800
14685 -50800 -31485 -7920 19641 -2801 -5283 72196 75812 33397 26702 6590 -42691 -111571
14673 -111571 -107366 -83243 -91508 -97129 -62195 -77022 -91203 -111084 -73738 328 16433 13420
14661 13420 25002 31794 42375 -12638 -85334 -65339 -5032 13647 43648 38255 74047 -4735
14649 -4735 -59293 42862 19624 -38896 -77262 -11932 55961 -37060 -69625 -27641 -5288 32607
14637 32607 -32869 -34626 -16492 -56148 -49368 -24601 -48876 -36929 -36108 -73229 -96718 -84215
14625 -84215 -90660 -41373 -58963 -96897 -94816 -83003 -63372 -69924 -143 45956 18812 19256 38812
14612 38812 -6185 -22602 -17602 -52372 -58725 -37106 43645 10448 7065 47767 41357 -11715
14600 -11715 39036 80053 76856 52088 5917 48074 55625 1435 -42454 -83270 -90306 -65419
14588 -65419 -62625 -107981 -129391 -131151 -104900 -44692 14943 -24903 -91072 -79532 -59654 -4552
14576 -4552 53064 44132 -8635 -8989 36289 66103 48517 -24545 -83351 -33202 11710 14785 -7454
14563 -7454 -17263 -36829 -24688 -22103 64440 59904 30615 26796 -19844 -27604 -39158 13208 51096
14550 51096 -22028 -43573 31 47324 93082 140428 107912 30115 23275 15842 -20373 -58306
14538 -58306 -49545 -64122 -54671 -33743 -66192 -99928 -77740 -73298 -58772 -26637 -42255 -132316
14526 -132316 -115428 -114602 -97318 -102718 -148778 -133613 -75436 -36837 -13092 -9627 -50452 -7076
14514 -7076 33050 59995 23827 -33167 10843 22837 55650 29300 2297 40646 70533 -2004
14502 -2004 -35082 -36803 9696 -24955 -81813 -71998 80942 110951 71000 76357 36916 45592
14490 45592 51066 34342 5588 -37643 -89174 -79596 -73448 -110638 -92321 -40701 -11878 45443
14478 45443 68762 40064 40677 70137 2000 -30517 26928 55010 51490 46853 10909 -62319
14466 -62319 -39601 -36947 -36863 -70887 -123131 -111571 -42416 32131 -5640 11 11935 -23665 -29532
14453 -29532 -51579 -29110 -75160 -89643 -150584 -173755 -99959 -37255 -14048 7364 39769 97127
14441 97127 101696 88932 55051 57219 62241 54590 59912 41266 46394 6153 -11801 15265 18588
14428 18588 15754 59372 81415 103831 128232 32280 8567 67622 131049 131536 133129 100488
14416 100488 82009 61529 13092 -5509 -73295 -85955 -12809 -19387 -11769 24959 35925 -4564
14404 -4564 23071 58598 49408 69689 54257 -48437 -53680 -21699 -67112 -37148 -53476 -36402
14392 -36402 -20082 -58908 -97491 -51183 -13302 -65627 -35995 -17028 -38924 -6441 25503 2694
14380 2694 27496 49898 55399 6676 -14342 61665 121319 111291 31961 -27314 -53396 -35499
14368 -35499 -45365 -28238 -22519 -16570 -44447 -27400 -8675 -7286 -11025 -37342 24255 13775 -12095
14355 -12095 -4847 47299 110480 114453 6669 -76317 -94551 -85452 -81809 -121180 -124011 -97445
14343 -97445 -37856 -20624 -58803 -52556 -5098 -20557 -11125 3435 -389 27457 66178 70407
14331 70407 38739 -10158 -10645 56538 25659 5495 -45103 -19167 -16128 -9522 41622 25131
14319 25131 1752 -18928 -23445 61983 106783 62994 32806 -148 -16244 7673 59573 50566
14307 50566 33519 21590 3582 4976 -24120 -81387 -42968 24184 7014 -26475 24291 53383
14295 53383 82251 122988 164770 191991 127196 58560 64965 130329 101883 68800 17301 5194
14283 5194 27618 53023 44972 -13032 55395 147698 172059 176606 160079 119899 37737 -15623
14271 -15623 -39385 -26256 11845 39524 -6243 34580 29947 169 34485 75276 100257 105096
14259 105096 99993 79633 46506 21341 67002 89658 84751 61967 86969 105156 48015 42296
14247 42296 31277 11361 -7177 13576 -32421 -47190 17449 39484 13936 -17757 -83962 -117743
14235 -117743 -109656 -46624 2430 48720 62637 55560 51347 59588 32082 -4732 20215 27679
14223 27679 44026 15680 -66551 -74841 -80908 -58383 -28554 -46176 -94338 -52568 -32190 2880
14211 2880 -18591 1981 -17025 -65624 -33307 -28460 11235 9953 -3985 -35856 15331 29366
14199 29366 -18146 -94673 -58799 -17143 -19060 -34329 -18785 8792 758 -1444 -57174 -29460
14187 -29460 30492 35425 196 -18056 2854 23656 29023 14827 6261 6873 3892 -41514 -86934
14174 -86934 -81545 -29530 -26855 -20045 -2646 -50179 -9203 84726 78708 -5001 -74908 -104867
14162 -104867 -74451 -64534 -117162 -142707 -77082 27745 98996 97033 90571 82255 59458 32692
14150 32692 -28886 -53040 -5983 33975 58534 51944 65077 34933 -13554 5886 1120 26472
14138 26472 24428 -29001 -32669 -65128 -60642 -34325 -32024 -41200 -35769 17624 67548 80933 20796
14125 20796 -8870 -42468 -41125 -53903 -60646 -37588 -34401 -27292 -14377 -16827 -34255 -4807 362
14112 362 18884 54873 69330 21051 10815 30867 34704 59660 -70462 -105121 -50102 -16834
14100 -16834 18280 57281 28639 3878 14633 16984 7662 -8402 -54743 -52093 -51778 31218 68131
14087 68131 26321 4139 -37064 -42099 14875 38152 -41486 -62323 -25183 -40235 -3836 84732
14075 84732 49558 -12171 26657 38258 -7061 4300 49447 70697 48252 -2274 -48737 -21267
14063 -21267 -33912 -16615 9435 21655 -26845 873 65878 130025 137938 61654 89008 185367
14051 185367 153371 44848 9895 3651 12397 37632 30815 -23517 -39010 -49694 -41455 -62146
14039 -62146 2732 31557 3292 34649 40279 27155 4375 -2845 25606 68951 16803 51676
14027 51676 80279 9686 -56875 37789 87011 68864 26213 -20894 61443 63487 78900 108309
14015 108309 95356 97178 128238 69390 11477 32720 30193 48409 46057 87867 125371 87204
14003 87204 45740 5595 -1397 -10204 36932 56346 27737 24739 574 3030 11207 -9898 70121
13990 70121 61177 -18286 -42525 -55346 -96587 -82312 -54872 -43292 14207 51409 2932 -62487
13978 -62487 -85708 -45429 -11128 55098 41261 44235 56175 22169 -36847 -46635 -5428 62863
13966 62863 100230 124202 123586 100591 68847 66244 51105 50836 31367 12324 44270 62342 1888
13953 1888 -19126 2102 -16784 50862 83532 72425 18687 47008 85641 62361 14726 -40557
13941 -40557 -9068 47563 29788 2598 -3828 16389 -32490 -39425 -46004 -84499 -118557 -152707
13929 -152707 -122746 -23654 -40978 -75995 -94662 -43969 18588 -21379 -54600 -46183 -10549 1423
13917 1423 6760 3270 27957 63329 71025 29706 34156 24139 35223 38853 40242 16619 38012
13904 38012 40780 -1333 -12069 52143 65102 69821 43127 9136 -53885 -21976 -19252 6632
13892 6632 38139 12305 17764 848 -39385 -86451 -65262 -3333 3065 -92762 -99225 -84918
13880 -84918 -50838 22390 52053 4799 45059 84992 87807 92356 138813 102113 24926 -23480
13868 -23480 5605 -16151 8549 26845 17422 11228 63768 55930 52620 52395 45035 47467 53754
13855 53754 49834 43190 88466 112016 147749 141215 96032 137595 172550 116499 40531 -7256
13843 -7256 -34599 -52446 -83698 -105036 -118341 -103436 -75743 -13499 50131 52072 44201 93805
13831 93805 89373 43661 62411 41187 9207 -3699 -17670 6980 -2245 35523 19816 -41398
13819 -41398 9621 14282 -11476 44455 52066 65006 76336 11920 -27633 -23503 -21447 -9877
13807 -9877 -12295 -18109 7181 60482 60678 27698 -21611 -34306 -11036 -14467 -12543 -34141 -74828
13794 -74828 -88198 -113951 -141571 -96532 -38506 -32352 -48707 7586 6277 -64611 -91311 -95921
13782 -95921 -50576 -11654 -9625 18595 68 -1582 31732 -32531 -64074 -61672 -91038 -74345
13770 -74345 -43385 -3379 26918 12475 8504 4671 -53098 -40418 -29201 -50022 -22335 -20944
13758 -20944 -7729 26842 58643 59122 41634 33099 38589 4108 -50108 -90079 -85572 -14727 18264
13745 18264 20685 13457 -12314 12457 14943 -51534 -64265 -82682 -37358 34765 57379 46331
13733 46331 10686 -5000 -1110 21045 -2301 -4399 71111 109488 59175 -9779 -29325 4313
13721 4313 -2164 43691 72794 38908 45859 23838 21616 -3015 55284 55400 -22381 -11336 16482
13708 16482 18135 14554 19179 6692 -78665 -78126 -82640 -58221 -68449 -58611 -24038 41313 66090
13695 66090 77163 74689 24477 -10713 -60502 -21098 12409 2439 21906 25067 -37213 -94395
13683 -94395 -97448 -148713 -86480 23731 40657 21033 482 9219 7714 -57416 -18510 49789
13671 49789 104005 130356 130192 80403 -22025 -16204 78930 85012 71994 3823 5637 -45958
13659 -45958 -3222 42096 23167 -1173 -24036 -66194 -71439 -71635 -81905 -51737 -79430 -17282
13647 -17282 15657 -98325 -138121 -72084 5565 -12956 -55111 -45169 -17867 88640 130803
13636 130803 104428 67306 14637 -6419 18652 37646 31652 13406 28506 118472 146676 49344
13624 49344 27733 -21207 -32115 -47525 -29462 -20018 310 5034 4344 13890 42797 28590 10291
13611 10291 55495 98102 91888 83947 69378 12253 -18675 -6772 -8116 47662 64607 81888
13599 81888 116527 139973 102068 3457 2582 38555 51924 32969 42235 56068 74824 -14929
13587 -14929 -10570 21716 23982 39861 52489 94461 94726 63563 33568 72400 102300 63698
13575 63698 41539 94 -3139 -13806 -13506 134 -6750 -10819 -1771 23629 2124 -357 6793
13562 6793 38168 48786 581 -9397 -15351 -70182 -115034 -102983 -62405 7346 2950 -32351
13550 -32351 -48728 -20998 -7281 8077 -34750 -35382 1259 -7176 -31467 -14982 -45273 -53386
13538 -53386 -17663 -20407 2831 16310 12073 27262 62554 40701 44300 36938 6079 -302 -6291
13525 -6291 -42250 -52183 -90615 -100928 -21454 -18613 16904 26812 72221 89950 82252 51913 28354
13512 28354 17925 40488 -50327 -83832 -83018 -72287 -74720 -27492 9111 57059 67897 40993
13500 40993 15908 -38691 -68147 -39631 17303 24462 26846 18677 101908 107097 46697 -16025
13488 -16025 -1935 22162 65567 13138 -35484 -12954 5397 15250 40645 32300 4609 -20679
13476 -20679 -81412 -116973 -87795 -22762 4261 -8809 659 51474 57379 32694 -18586 -57152
13464 -57152 -91297 -151491 -105546 -32173 53042 85982 108032 84238 32643 -37814 -52883 -68825
13452 -68825 -13094 -96781 -40839 -72578 -109859 -67990 4 -4311 -22855 27190 27089 -6922
13440 -6922 -49786 -61152 -5856 31405 9782 3716 17900 9703 -38689 -124634 -201650 -191866
13428 -191866 -109455 -73378 -106303 -129674 -119477 -57986 -97120 -117278 -55616 18224 95750
13417 95750 87374 8734 -46133 -11135 -20096 -13459 8947 26582 70805 55652 20907 34915
13405 34915 36717 13455 10943 -36462 -42244 24175 48249 28132 -60831 -87676 -77326 -88595
13393 -88595 -125838 -77071 -19038 44330 107242 87922 40471 11958 48022 89745 105002 100252
13381 100252 80685 74075 65638 137048 192986 165188 127510 109805 123485 139146 118697 73289
13369 73289 -427 -103471 -98263 -24734 -19313 -28901 11510 63342 71310 7641 -63223 -30722
13357 -30722 7390 28143 26901 68432 90328 51973 -8660 -68901 14052 39749 -13421 23218
13345 23218 38146 31255 42450 3423 -2269 -2948 13548 27571 18847 69784 65986 20174 -33912
13332 -33912 44491 105152 91063 1357 -19215 -79359 -117386 -82044 -44975 14734 -6349 15550
13320 15550 64527 -26617 -103151 -78985 -6758 3401 -29475 38302 67660 98380 88210 61801
13308 61801 8007 -24468 -73855 -96425 -77023 -14728 2583 -19318 -37695 -76835 -112393 -43062
13296 -43062 55854 117347 44649 6235 -20515 -50289 -46630 -33285 -29708 -14882 -15902 -2120
13284 -2120 53086 46199 20536 49306 7060 -30844 -83913 -106488 -59305 50003 56324 22494
13272 22494 43398 127129 96801 83959 140384 135388 159333 67856 6529 39273 46080 77077
13260 77077 38244 28000 11282 33902 80452 47110 55417 47398 65734 74862 9521 -6333
13248 -6333 4087 7409 -49394 -43425 -10005 -40087 -6639 42957 -10912 -90913 -104890 -85170
13236 -85170 -64683 30898 41914 20848 13938 -62933 -109828 -61317 -39656 -21589 -872 21396
13224 21396 22976 31387 29760 55782 114670 136260 118767 39924 -4931 -31734 13770 64410
13212 64410 97911 51303 -23486 -89007 -86840 -12027 -11208 -43325 -76175 -67888 -96958 -109438
13200 -109438 -79269 -94550 -80895 -45035 -44687 -21386 6367 14683 12449 32714 16517 12523
13188 12523 -52535 -136000 -147903 -61471 -30707 -22799 -52225 -31103 -10653 10108 30296 -25276
13176 -25276 -119833 -155635 -140115 -156183 -79763 31479 116347 58839 45331 94770 62784
13165 62784 26779 22486 -25780 -77090 -16512 38695 23614 25543 27279 -27703 18718 53346
13153 53346 -5509 -41573 -37623 -52226 -64 -5025 461 22129 30409 77487 152138 127692
13141 127692 -18746 -52923 -34561 -59744 -21640 81534 76816 46507 21751 -30508 -73933
13130 -73933 -84221 -95694 -123496 -114633 -58123 -36335 3942 42898 17587 -798 756 48694
13118 48694 44152 68197 44385 25859 47348 58439 32171 9318 -13271 -38516 -77877 -91958
13106 -91958 -78215 -44550 -16130 -9285 -5640 -54712 -40244 -3577 -17060 -16651 2749 -45196
13094 -45196 -54499 -12503 57395 70698 63536 32763 -5053 -8059 -15460 -57876 -113840 -89886
13082 -89886 -63315 -62095 11628 -32972 -68304 -92231 -102316 -90039 -51813 -69060 -66902 -20613
13070 -20613 -54039 -64882 1651 -34427 -22600 26768 104532 79565 59333 97573 66633 78760
13058 78760 61687 20679 50973 85937 131500 118896 94544 108538 123887 91986 16876 -18306
13046 -18306 -60740 -78600 -71667 -41347 -28866 14156 47984 85100 86656 41926 8637 53070
13034 53070 94781 147989 131993 91542 42980 23842 -28167 -61933 -60281 -81494 -38806 -19979
13022 -19979 -16567 -3809 32442 80239 22519 -9562 -7501 11064 49069 94888 53452 43495
13010 43495 36713 67164 131093 156863 78340 56648 86574 78854 88375 44141 -13053 -15122
12998 -15122 -13693 -737 4208 7774 -18101 12928 76947 48800 -30197 -53364 -8465 -5943
12986 -5943 -31841 -62856 -39237 -26638 -39882 30491 48471 -28084 -73224 -10067 55313 102761
12974 102761 69558 60000 69043 94919 77274 155 27932 -35207 -29544 -19423 -11295 24047
12962 24047 3209 -16965 -39713 -26940 15858 -7962 -442 -3444 -26872 -996 68335 77058
12950 77058 21888 9427 3078 -38729 -42636 6214 39154 44368 28942 10587 -6834 27042
12938 27042 20431 47781 54330 2617 21436 25790 27735 -23711 -95914 -81263 -30687 -21777 2928
12925 2928 6746 19339 37634 14081 -30233 -21385 27917 62211 80803 34894 -1888 62262
12913 62262 67035 5045 -4508 -18217 -3745 -7030 -70413 -92752 -69525 -44408 -62263 -68355
12901 -68355 -30129 25614 48902 10494 -30363 34146 80361 111635 64591 55824 -895 -26888
12889 -26888 -54347 -18973 21051 54664 32265 24349 -2124 -1809 29666 13736 666 10341
12877 10341 14066 27715 44905 32893 32667 16677 31413 49092 11694 35331 72173 43939
12865 43939 -12701 -43610 -29122 -13977 -6384 -28856 -33534 15947 30764 -15140 -46748 22456
12853 22456 48209 86414 45061 34438 72362 53201 53811 70324 22846 27594 65337 119335
12841 119335 84485 72604 128670 106041 26639 32086 54300 41139 25512 57838 19823 5519
12829 5519 9199 15147 545 40855 84993 102053 41539 -28407 -3134 -11780 -23775 -25446 -39345
12816 -39345 -29183 -17568 -14055 -13703 13934 -52151 -73370 -78864 -66633 -67363 -83094 -128964 -134441
12803 -134441 -87979 -46586 -7341 -90229 -120122 -36432 -63738 -92023 -156776 -146158 -61281
12792 -61281 36048 71954 31831 -2808 -5643 16776 16012 -16513 -49604 -69224 -68617 -61714 -78732
12779 -78732 -66347 -55987 -84467 -106957 -195033 -121217 -37265 -85480 -111320 -38769 -34515 -38660
12767 -38660 1491 -21600 858 67661 65551 -7151 -13205 -20110 -4995 -39899 -3203 64585
12755 64585 108912 98500 103621 46064 27960 24701 28119 -5765 -29315 -29967 -11209 30473 24951
12742 24951 35396 -3292 -36075 50911 49580 18001 38319 14866 16618 53455 17643 15201
12730 15201 29920 10344 -14364 -53305 -77437 -106608 -10438 72652 72037 38008 20259 -30251
12718 -30251 -24087 1936 40996 10308 -12357 27228 17920 -28676 -20409 -47740 -39484 1445
12706 1445 24695 56380 122927 82696 67469 100864 117998 65425 43104 -22189 -15753 93586
12694 93586 150475 118494 89079 75663 60947 23260 54290 56583 44198 40474 5878 -27080
12682 -27080 -30118 -40446 -63754 -75055 -61610 -13403 -16734 -42621 -26398 -74384 -37738 -11196
12670 -11196 31681 30517 11772 66029 74564 82108 38292 3374 -34346 -32882 17101 -43027
12658 -43027 -42659 -1600 65953 112137 91707 23020 -82712 -65865 -23405 20391 -29089 -68095
12646 -68095 -82521 -15364 24888 21622 37326 66457 9709 -49085 -65332 -25850 11931 91438
12634 91438 135053 122551 79017 79657 47440 23395 -33147 -23433 -28943 2276 15827 7608 -7454
12621 -7454 60746 108583 24149 -10983 -62838 -91570 -95779 -75314 -48186 -2520 51698 -4641
12609 -4641 -29543 -21035 35424 22130 13490 -10938 -60417 -40302 7318 -289 29797 19829 57508
12596 57508 22695 -53234 -28397 21132 43219 70765 59100 47716 13229 -35503 -58648 -23719
12584 -23719 18910 64924 44163 66222 102550 42374 25208 -1153 -22879 -27260 -51393 -36082
12572 -36082 -24668 -43001 -74275 -25616 -26172 -27676 17154 -33859 -48690 -26557 16371 17766
12560 17766 3997 17546 44560 -5431 -62670 -51345 -26110 -35761 -67418 -23943 23163 4586
12548 4586 7582 -61663 -99284 -115392 -81716 -86230 -63276 -8536 -737 -23966 3879 46626
12536 46626 -1254 24682 36435 -29373 -10244 4618 12272 -10925 -33633 -28693 -44395 23687
12524 23687 3452 -27893 24229 64689 30107 22828 23954 9685 -5446 -51293 -51079 -11274
12512 -11274 27379 47886 28853 13684 5602 21477 60545 39793 28040 31610 13700 13448
12500 13448 42344 55876 924 -63772 -24949 31799 61537 16465 -49808 -53599 -34600 -65860
12488 -65860 -45023 -14842 35226 -30265 -96567 -31808 -6144 27489 68078 69646 53995 29701
12476 29701 -34325 -64113 -74662 -48199 -56018 -51480 -46605 -32863 -41317 -68736 -65156 -46050 -16790
12463 -16790 48566 128906 98300 11228 -7848 -35499 -20069 25685 24126 2130 43265 42742
12451 42742 38408 41028 -14054 13612 74798 105122 84014 59450 50767 97064 110110 53425
12439 53425 57354 100417 110640 86890 53645 7194 29810 48867 26198 32350 73173 130835
12427 130835 182651 174265 24142 -54442 -20934 3582 2675 -35836 -73868 -32971 -29399 -27064
12415 -27064 -11936 -34089 -59964 9259 -2003 -5043 30039 86462 37834 -83615 -176999 -140025
12403 -140025 -81420 -50715 -78360 -40883 18552 -364 -373 18476 -1422 62765 104154 36723
12391 36723 6398 19346 68177 87898 59001 -10810 -87706 -140335 -155559 -116030 -75762 -25114
12379 -25114 -21022 -21928 -44937 -35713 -35915 -90978 -44246 -7150 -56893 -115394 -75378 -24584 -21646
12366 -21646 -26880 -42225 -15371 -24517 -3705 17548 1485 2988 38635 29404 16164 7997 11214
12353 11214 -21731 21335 -21176 -43291 -70774 -71321 -10706 46511 44260 28556 9995 52499
12341 52499 63093 79238 32710 50713 37727 -3831 5188 29636 -12815 5928 -7477 -8231
12329 -8231 -44236 -53527 -9993 47463 107857 74805 100753 94487 71472 95654 73798 76594
12317 76594 39642 42441 34903 33684 32329 52569 73916 -9214 -43289 -42418 -25774 -59478 -74818
12304 -74818 -98349 -39437 -75027 -25427 -64552 -159658 -135751 -123918 -98887 -56124 -45930 67825
12292 67825 102721 83725 -6203 -50510 -43538 -4190 -16983 -33421 -26893 15754 18965 11027
12280 11027 36193 39515 -22198 -438 37655 21046 13003 28673 44654 11133 -39104 -39827
12268 -39827 19 5445 16581 16448 35522 77006 10268 -13086 -13060 42061 98243 114813 89059
12255 89059 21092 -34453 -17972 -31241 -11081 55552 88320 87443 27749 -34519 -65078 -88051
12243 -88051 -40716 -54710 -47824 -70819 -129456 -94647 -12849 49366 36651 -5799 -26427 -13391
12231 -13391 12830 13274 3138 24819 38260 24606 -21083 -3056 24843 -43967 -70787 -39288
12219 -39288 450 -13804 -63217 -69808 -41304 31199 2783 -68807 -114020 -184878 -204775 -136140
12207 -136140 -66261 -73495 -66342 -11907 19421 -14560 -46225 -36641 -9662 -87288 -90541 -41758
12195 -41758 -15899 -12509 540 -12096 -20825 -44569 -45720 -21694 -36472 -17469 23748 -538
12183 -538 49689 72973 80039 532 8476 21114 37578 116732 11596 -50163 -92998 -36244
12171 -36244 65962 118556 107041 39864 -7824 -29472 -32544 -14067 -4655 -17153 10688 36332
12159 36332 35607 40413 17256 -2358 -41517 -27497 -19706 -8865 -20770 9245 71714 130618
12147 130618 162269 149425 72611 63115 8273 46962 67317 46134 71937 32813 1340 -4636
12135 -4636 17761 -18493 -40534 -45008 -54687 6869 36684 56887 74888 71453 99344 106345 76803
12122 76803 91555 108734 57687 -12257 -21746 -23584 -9136 33804 63136 86976 65373 2598
12110 2598 -12795 8564 -33128 -60875 -32165 20975 34967 24885 22046 25466 47823 -14319
12098 -14319 -28738 -50703 -36469 -10330 -24918 -70454 -123422 -105244 -33035 34739 -471 -13476
12086 -13476 1489 23437 19470 -7836 -27127 -70686 -63625 -50176 -59954 -37508 -65325 -88663
12074 -88663 -44575 51820 118128 74751 719 -57693 -46599 -22180 -35641 -40622 6024 32135
12062 32135 10647 -55903 -80644 -60184 -119219 -99435 -66474 -63887 -92526 -132313 -110883 -96388
12050 -96388 -146792 -134737 -142850 -121162 -46139 35037 66280 103172 80480 21850 44070 63662
12038 63662 14611 14965 53571 104224 127162 80999 81585 73073 37658 12395 47206 84249 72605
12025 72605 12308 49766 3150 -8472 6663 9325 27984 66379 30514 42744 19782 -47732
12013 -47732 -54610 -30419 7051 449 -35730 -17396 21725 -14217 18381 32941 29031 17027
12001 17027 -24915 -73567 -69312 -26616 -15512 -19292 -7458 7062 -10328 37786 25292 -19523
11989 -19523 -3060 36052 33749 79384 133911 133789 109675 90817 117304 162101 152708 67010
11977 67010 43325 61005 79233 57376 10277 13419 32063 19981 2081 23582 49185 46690
11965 46690 -23608 14899 51625 2570 9088 -35691 -35101 -10765 -30669 -27755 -7916 20409
11953 20409 -50632 -66735 -17795 -146 12906 5275 -368 49171 23294 -13473 -1137 22084
11941 22084 31278 47380 55192 101891 97410 26735 23279 64095 91020 53774 45882 50372 81015
11928 81015 73768 58297 22985 -37940 -17744 5813 17970 3627 -216 57544 58569 88372
11916 88372 62067 98019 106510 31816 -60555 -95829 -69807 -54074 -30598 -548 -25826 -58277
11904 -58277 -75621 -74156 -11787 -36662 -57252 -85007 -48064 -7043 43517 -4906 -24966 -61219
11892 -61219 -59107 -67827 -112194 -97043 -72605 -29810 -27089 -85756 -87610 -13763 -355 -11342
11880 -11342 9614 70587 67763 9882 -1142 -23340 41817 12117 -55371 -42534 -57870 -38798
11868 -38798 -9294 -24623 -69098 -37737 14710 -8043 7077 -44912 -25333 53231 135549 157814
11856 157814 141795 102663 58990 -2489 -33196 -85112 -63336 -46828 -21908 10652 2364 29177
11844 29177 7261 -30671 -22960 -7306 55423 40973 70675 12444 -17000 -28348 -24332 -5634
11832 -5634 -72727 -94417 -53825 -4115 38683 36246 25226 18876 -4568 10647 -34853 -74438
11820 -74438 -63714 -18613 -12875 -26434 -2846 -4588 -36653 -17508 -36586 -35656 65666 111533
11808 111533 94022 90647 24019 -29985 -7841 75803 63946 36107 -6858 -46716 -48428 11571
11796 11571 9630 82945 88430 64704 22364 29753 47273 27904 40860 58029 -7551 -82395
11784 -82395 -40363 -13390 -16808 -25893 -70047 -71526 -37878 2862 100052 128231 98601 54233
11772 54233 61756 60850 -26245 -48998 -8923 26890 32383 -67573 -100924 -51121 -44720 -37770 -19050
11759 -19050 18347 36596 6841 37679 59381 94783 81482 70405 27910 -4244 22895 50640
11747 50640 45085 44478 96035 180691 186499 103562 41176 8571 14465 30896 -6191 -44392 -51890
11734 -51890 -43152 -27601 -53926 -62908 -27918 -65639 -2914 32701 -10997 -10848 30394 59943
11722 59943 53443 60199 38014 24692 20231 -10215 -17558 47094 80470 63470 42434 65784
11710 65784 44303 51508 -5983 -71994 -20460 -20221 -98201 -169220 -140837 -60510 -45500 -54063
11698 -54063 -92781 -139523 -113551 -98320 -111327 -138498 -149827 -168354 -165218 -115834 -76943 -68317
11686 -68317 -44873 -16985 24239 -3635 48252 3298 -20529 -312 -13543 21347 35850 28643
11674 28643 25687 50492 53084 -47879 -91185 -15871 36660 -32123 -119167 -128138 -35105 -16661
11662 -16661 -115699 -153981 -65575 -27676 4492 49576 89792 120564 84128 32769 47579 34691
11650 34691 59694 79209 92967 99374 57587 27695 33377 44703 42831 55460 47057 12766
11638 12766 53132 77366 36546 4642 -37693 -106279 -141889 -73932 -23831 -2813 -34564 -24949
11626 -24949 25957 44677 70601 41172 6451 5973 -19844 -62642 42524 59246 75362 44403
11614 44403 11706 -4327 31951 47415 34960 -35006 -90608 -112591 -127907 -80991 10598 35529
11602 35529 32816 55917 60248 54195 202 -77849 -97701 -52346 -73150 -45682 51730 102641
11590 102641 77043 112605 97261 58977 46830 35469 763 9281 9215 -100 -14974 86888
11578 86888 108591 73331 71452 41271 48903 98599 110113 71447 6224 -27015 -46248 -4123
11566 -4123 -271 49124 46123 81546 118455 77017 14782 54257 46500 11819 -25599 -24759 17591
11553 17591 -3316 -25838 -37451 -42642 -6283 19164 50212 74517 45405 29438 39251 47575
11541 47575 68219 63951 46848 17848 -33274 -55356 -12905 4453 32147 76132 96908 61665
11529 61665 61226 -29188 -146858 -153956 -89005 -82347 -90054 -22275 -4291 41312 117634 121645 54168
11516 54168 62326 13374 1073 -11140 -38385 -35186 -40678 -30674 -9398 -2570 -2900 1917 46868
11503 46868 17234 -24751 -47278 8913 62566 60257 16344 14374 77987 50580 -30641 -32831
11491 -32831 10635 34500 -14668 11489 7019 17733 31682 62238 -1738 -50996 -59753 -41799
11479 -41799 -86885 -109434 -133475 -78571 -82881 -67769 -37592 -47873 -12002 -17187 -35566 -65690
11467 -65690 -89531 -97406 -67414 -55500 -41103 -22582 33278 5589 24440 27347 60716 31039
11455 31039 2108 32008 14434 -8012 -22431 -12444 -37682 -45301 -5616 50096 38969 12178
11443 12178 28338 41365 38843 69306 68320 62983 34368 30206 16570 55254 47286 7028 34758
11430 34758 25128 -67383 -83818 -78954 -61596 -35899 -21256 28327 68868 101872 59814 -38951
11418 -38951 -72995 -74151 -2077 47540 20947 19618 46034 46926 88083 81766 86846 71608 81161
11405 81161 57007 13394 8189 -4557 7585 6952 14891 -17767 -14629 -15082 -22585 -87305 -84719
11392 -84719 -32637 -24311 3519 5728 -33882 -8213 7262 19888 47558 82503 22605 -38039
11380 -38039 -50664 -31738 -53577 -64418 1836 77863 46808 8883 7848 41658 106785 136491
11368 136491 122228 115240 104778 84235 111189 101057 59095 41345 36719 59445 55080 76553
11356 76553 108635 80507 70015 90828 86204 69947 -25298 -16679 -9034 -2135 24265 28564 28733
11343 28733 26335 1926 -4841 25256 43493 20575 8671 -14449 -22953 -55749 -20554 -21889
11331 -21889 16373 62173 65172 48165 4254 13720 -47839 -74625 -46859 78722 84173 40907
11319 40907 -13916 -49740 -14839 -17463 49973 29022 83862 127202 116410 28238 -34989 -21174
11307 -21174 59845 40474 16059 -3606 55176 116861 168031 146882 76816 27797 48115 80165
11295 80165 29851 23637 37678 32016 70249 86950 114246 52773 30636 53582 70914 31855
11283 31855 -60166 -4402 35930 38869 11552 -17420 -5451 54226 -25901 -49722 -35133 -41159
11271 -41159 -28753 5969 3458 41793 102531 105789 39212 55384 100351 63883 36772 -7284
11259 -7284 6685 32826 62608 39316 43595 41959 2512 -11778 -4598 17056 69740 16172
11247 16172 46689 73576 91167 62529 45521 62236 99661 88704 40874 18255 8412 -21269
11235 -21269 -53963 -74865 24755 79529 106532 90348 99043 65591 73030 81357 107371 125843
11223 125843 84644 26325 -6178 -36308 -42088 -26987 -7135 24663 90700 101195 65008 -20781
11211 -20781 -88321 -97208 -74384 -36589 9815 81867 48582 41484 72136 85687 48211 74125
11199 74125 113124 136231 127365 83934 79171 47689 76305 112673 138853 116166 116250 102295 76849
11186 76849 27713 17455 58452 171051 124889 146156 211866 142777 67828 42918 -9272
11175 -9272 -21472 11083 12477 -18064 -48825 -30010 -11569 25429 53540 132409 161755 185530
11163 185530 174636 138039 127440 147377 132428 149685 90430 106810 131238 161827 167564 161073
11151 161073 144427 58721 37070 109584 175813 113000 127782 123054 119489 97889 68805 8900
11139 8900 3547 74289 116945 145802 144973 38420 -1700 76798 133393 152325 199345 199801 193552
11126 193552 160324 154223 152036 157649 223214 209286 217008 235358 243062 279375 314298 328578
11114 328578 323326 305759 346222 465308 607268 689537 886436 1146636 1289782 1419745
11104 1419745 1618133 1745182 1877659 1920159 1855071 1687983 1543443 1397657 1247010 1066709
11094 1066709 855097 695264 553989 479001 446629 391528 357127 389316 388018 352642 279079
11083 279079 206657 217843 223257 180411 242320 282828 248233 253153 217445 202215 223842 176991
11071 176991 124134 175213 202343 160127 153145 139216 164745 194573 189764 191328 187226 167479
11059 167479 172363 174748 189718 152614 125676 94483 92237 147260 137476 113856 152674 192559
11047 192559 149424 76204 86367 78061 47952 41553 90573 128624 174954 168495 114441 100586
11035 100586 130283 159226 166912 118552 60779 72923 46354 76648 69228 43137 91474 110349
11023 110349 156247 154199 158062 145491 117780 101923 99500 93665 141708 124982 93425 38569
11011 38569 36170 92011 68390 42014 69544 49528 146948 172059 118916 71656 71334 101207
10999 101207 119397 89549 20021 23026 101272 109975 147874 210605 255729 238354 191817 130850
10987 130850 123595 163424 156942 115036 80337 112164 115835 102450 88116 66286 129507 190531
10975 190531 201794 143176 76866 132309 222259 203974 194370 177997 171014 163218 211913 248921
10963 248921 309304 427529 410478 351885 310394 268917 351753 477149 491301 445735 452612
10952 452612 455016 422212 400758 460032 494900 503059 501418 577021 530871 422829 400771 376102
10940 376102 304169 257988 194614 167783 165828 213640 231354 190518 145809 112857 145819 180729
10928 180729 228920 266143 238351 194700 172287 167299 178132 184094 207369 213379 165367 190801
10916 190801 209622 217637 174000 98723 36705 75062 102030 108145 130610 184170 176719 182340
10904 182340 195695 225126 277745 323895 215539 95694 126289 226838 245538 256775 225292
10893 225292 220437 251959 259782 250670 236976 236926 285037 293460 282674 327288 305923 291529 270646
10880 270646 266188 316704 389484 381956 345320 324069 312320 287282 285802 342906 317731 338578
10868 338578 339592 339437 387474 311715 274450 294371 270475 251402 272364 284623 316776 346287
10856 346287 342522 334039 377090 376749 286106 224175 200737 202461 160168 170110 173853 188764 218648
10843 218648 191585 230682 340383 388938 387423 439054 443495 430861 405240 381509 295146 241952
10831 241952 256304 240490 266526 287593 320486 409564 471129 500602 529384 541901 583899
10820 583899 604908 597088 610245 581082 560830 536640 486169 429425 443510 459231 454534 472099
10808 472099 517207 529447 583095 656114 666794 621485 616875 619957 632744 644627 679342 739729
10796 739729 733945 682939 693556 739592 794787 748322 764880 799814 877746 959799 1003145 1058808
10784 1058808 1182859 1259585 1190259 1105034 1035099 1054401 1101920 1096608 1064726 1119448 1120524
10773 1120524 1075390 1113482 1159815 1153730 1109145 1098568 1129396 1208444 1342054 1332396 1346294
10762 1346294 1407794 1389457 1457016 1532614 1577496 1592274 1589992 1599790 1634774 1682172 1735826 1791404
10750 1791404 1886235 1963913 2052708 2098466 2120571 2213824 2337449 2440537 2446019 2558387 2746531
10739 2746531 2915232 3075371 3283397 3459244 3617821 3810903 4054949 4249125 4467256
10730 4467256 4805385 5137367 5512944 5913150 6391706 6956830 7654941 8478112 9436610
10721 9436610 10644988 12067939 13714707 15476186 17294949 19296757 21525495 24019826
10713 24019826 26779981 29908983 33640906 38411560 44642534 52840285 63919601 79103680
10705 79103680 99995137 128105875 162504969 198895644 231811786 261385282 289720513
10698 289720513 314393884 330688134 331035797 317511973 293419982 266380523 239359776
10691 239359776 209718220 177504984 145305909 119693406 101581208 88688110 79184680
10684 79184680 72030355 66543836 62170494 58569168 55442568 52654781 50152259 47804972
10676 47804972 45469293 43061090 40598626 38025876 35505304 33079090 30644125 28261573
10668 28261573 26135072 24132296 22334059 20683773 19187832 17886181 16705832 15634988
10660 15634988 14665867 13780088 12938325 12233846 11513946 10858404 10339424 9811066 9246264
10651 9246264 8687593 8264972 7811494 7381418 6980507 6606119 6219649 5850418 5531609
10642 5531609 5248245 4910196 4541909 4209316 3938742 3754233 3571042 3404638 3269823
10633 3269823 3118602 2950634 2839426 2740991 2556242 2437206 2317776 2229165 2092753 1995087
10623 1995087 1913597 1775699 1689006 1618484 1502995 1441098 1427499 1379505 1323710 1276976 1209442
10612 1209442 1156931 1120687 1088605 1038539 919602 891944 846953 850847 893920 867629 816647
10601 816647 783559 724021 722753 706252 650205 642489 644326 624335 608102 578588 606929 550476
10589 550476 492588 482185 535978 558510 595181 607684 552731 523602 555058 554819 540117 515726
10577 515726 523806 541939 597198 629363 597422 573926 587736 657218 673021 637464 675105 695463
10565 695463 645351 633340 577874 508666 453831 377207 404202 409965 351945 355174 374800 435486
10553 435486 468280 511111 519573 515835 547089 580151 624012 610203 568549 568319 536667 517021
10541 517021 506711 468830 470765 450630 436847 462919 473905 458523 441776 435958 410456 366564
10529 366564 324033 277169 238206 267354 314693 339743 327516 305559 294954 293560 303485 311782
10517 311782 317505 312701 272838 237009 252917 304801 248072 170393 152226 221465 229996 229814
10505 229814 195762 166344 157477 206844 225458 227452 286532 291293 311039 343180 297734 214400
10493 214400 145245 107068 138658 160800 193798 192373 179350 164903 102070 162297 183852 190568
10481 190568 168100 192203 209176 127763 161283 215139 227760 245409 256729 204738 163807
10470 163807 122476 136093 227183 308024 298537 230514 151914 175867 159837 137916 118644 137870
10458 137870 88654 82127 142984 194653 183748 184004 109719 85543 38769 47961 74702 39342
10446 39342 44752 108454 111484 78202 85683 85902 107146 99276 105402 110181 141478 141644 112308 145910
10432 145910 155843 134566 159946 150422 166200 199045 203815 129783 135442 161940 149443 89954
10420 89954 123346 169261 167350 185908 100756 47153 22803 -27633 -11826 43208 85285 108858
10408 108858 192139 183976 112377 114157 116285 75872 10370 -10781 -21394 -11537 26442 62211
10396 62211 2035 -12726 125827 213663 196868 186360 166055 102090 96659 7398 12276 12908
10384 12908 23144 8181 42555 97376 99053 76173 90880 116322 131779 169005 160110 109102
10372 109102 114196 120919 152141 84105 52834 79341 78498 77630 65087 36311 41739 56685 75656
10359 75656 42587 36597 29098 8953 -7029 5032 21881 45840 49459 25801 86903 65169
10347 65169 -18748 -28779 -22321 28606 125833 141335 80543 66176 29691 -25168 -23281 -50812
10335 -50812 -80185 -56540 -49573 -46478 22235 91294 113421 78486 6769 24042 64189 23296
10323 23296 2172 -3185 6190 33485 11898 -4885 -40241 -17791 -2494 -6930 16320 42769
10311 42769 86457 117454 89979 62239 56808 124787 102210 50616 81481 160133 181956 210690
10299 210690 223749 232771 318733 449833 563595 752455 959074 1126846 1211486 1331057
10289 1331057 1400339 1508693 1619269 1676799 1664510 1554041 1412077 1285272 1131183 1022631
10279 1022631 844936 679978 608282 480863 394473 338570 302760 327066 301015 287040 288868
10268 288868 355939 405502 351136 304097 233231 196519 163152 144865 173254 180733 130313 129451
10256 129451 93068 38560 31951 72086 80385 60577 6062 21174 82011 83264 139727 150528
10244 150528 62940 26581 34650 8391 -53954 -51138 -16591 -3230 62086 76439 27971 48754
10232 48754 17472 -3165 32221 91402 93358 17828 -43272 -61469 -57342 -73581 -85803 -48593
10220 -48593 -70731 21087 90091 175343 144827 106970 72453 64327 35854 -17267 12726 1252
10208 1252 -34336 61086 84835 43652 41976 47263 75005 58955 -74096 -103018 -94804 -65232
10196 -65232 -46187 13393 -6151 -18046 -4499 47892 33690 9746 11685 -47665 -60176 -12856
10184 -12856 -35349 -33041 19555 22912 6059 -33298 -102426 -162221 -115648 -45518 -16100 5437
10172 5437 -6951 -42050 10906 6059 21475 18499 32690 46917 5413 -12584 8156 76982
10160 76982 63437 9089 7979 -4276 12308 21188 -43412 -113670 -74317 10071 -54669 -78117
10148 -78117 -12496 -2815 -4844 -19427 -24949 -48107 -63027 -107897 -84127 -43269 -18038 -46908
10136 -46908 4041 66460 7950 -12588 -36152 -25213 24247 28688 22373 40135 32625 -35578
10124 -35578 -25528 2900 -1754 -50160 -33202 -15076 -20780 -5978 20811 29570 9145 24225
10112 24225 -15693 -70647 -103271 -99166 -49668 -20971 -45030 -35453 -25053 -30418 -22076 28965
10100 28965 49225 60006 74153 72680 35731 21227 44918 108831 119117 88212 56679 43218
10088 43218 12609 -3589 5742 7645 68813 76033 17470 17448 93245 49435 48653 74562 79952
10075 79952 87257 98236 67094 47492 39751 46161 60237 45432 77261 106743 68259 32829
10063 32829 38489 39738 23720 30499 118360 70570 43829 53431 87143 104853 144612 209548
10051 209548 273695 312077 375628 409372 379127 277492 238865 291124 330444 210433 135427
10040 135427 117934 137120 98407 78374 94036 169013 215215 181228 109068 86450 54015
10029 54015 52778 102678 62142 75128 100469 109130 91393 70090 -6463 48141 57121 47352
10017 47352 60785 56626 -11219 -82590 -70283 -34588 -23647 39116 36577 13124 53508 43451
10005 43451 -25231 -54607 -46656 10672 11779 12571 -70326 -68581 -50004 70956 90298 -25382
9993 -25382 -70816 -10639 7420 35069 16754 56149 82211 77469 49290 75270 118757 135083
9981 135083 110346 110201 123500 87854 55748 103577 67129 25245 -2152 7458 46786 -13054
9969 -13054 -79220 -70254 -37198 -26780 -32414 -80177 -94024 -68944 -21957 54447 108029 148822
9957 148822 129204 87071 59589 122196 105292 160270 232515 238629 213390 222671 214723 193926
9945 193926 267306 329386 453319 644784 805243 1067925 1458721 1733849 1629247 1195154
9935 1195154 874443 628173 522704 414472 385035 380416 329418 281923 262278 206558 175003
9924 175003 142769 79770 100196 109080 127800 138047 137664 149522 121042 72019 75953 96100
9912 96100 148876 201977 159365 111097 89603 115467 149560 138397 39684 24243 74715 96587
9900 96587 120812 128523 40098 27787 -8817 -25781 -53950 -79732 -15260 42516 6655 -8117
9888 -8117 2185 -5966 67 -69590 -51191 40249 13505 -36691 26413 40635 -5647 -78943
9876 -78943 -98641 -52464 2034 19742 52795 55909 17619 -39994 10216 10251 5404 40497 -15220
9863 -15220 -48380 -28506 1454 -10792 78478 99755 66574 31902 -3716 18506 55066 60901
9851 60901 -9802 27127 68591 116945 65961 1155 -32569 -18530 13958 13975 19121 -17866 -34838
9838 -34838 -25504 36472 14087 -2929 -16362 -43962 -89799 -57426 -26171 -28792 56967 69139
9826 69139 53021 -50405 -100491 -52558 -5780 70050 72134 58730 24276 -2921 22580 23563
9814 23563 -4 -22239 15278 79084 87701 60084 50764 -2506 -7339 29079 50247 31286
9802 31286 53148 45289 -21675 -111244 -54970 -12831 -21101 -25648 -38815 -32200 5735 22093 24659
9789 24659 -994 -88543 -102970 -59714 -34990 1499 -12901 -25972 -68559 -43712 -34255 -51181
9777 -51181 -47126 -37056 -16439 -13219 8794 -24961 -2071 46942 75810 88979 71053 19699
9765 19699 -12995 -22358 -8651 -862 -30802 38377 39584 -44686 -90354 -48696 -37465 -66877
9753 -66877 -64179 -106898 -150345 -117669 -144447 -123378 -75289 7437 43739 -5754 -38866 -59045
9741 -59045 -93357 -58987 -15511 -9483 -23928 -20014 -10130 -20430 -28068 -45297 -30947 -21427 -77081
9728 -77081 -129794 -71396 -34392 -46493 -22910 24646 43060 31754 59686 -21502 -48448 -22046
9716 -22046 -95197 -75464 -6021 148 -36160 -36038 38121 34536 535 -18584 -44709 -59516 -91367
9703 -91367 -71648 -16784 -88747 -80741 -24563 16434 -17171 -36846 -33799 -22968 -34541 -42310
9691 -42310 2935 -8308 40750 52606 40061 42863 7045 -65865 -91566 -42082 -27740 -27979
9679 -27979 -39961 -21682 17824 12315 -27775 -33328 16417 31430 48176 12112 -29637 -40536
9667 -40536 47554 89049 66461 5882 -72955 -115289 -70824 -9937 -14188 -31694 -52909 -16718
9655 -16718 41295 34238 44203 14334 -64653 -137533 -179126 -113097 -39737 32881 44962 47349
9643 47349 35652 1 -66 -45157 -65583 -39539 -39178 -61950 -46241 -25972 250 -22161 -36273
9630 -36273 8401 -10797 60530 100844 96954 18733 -13776 30656 27156 -2649 -53573 -42328
9618 -42328 -13794 -23151 -24387 -21373 -55685 -64292 -5562 62600 16319 18592 17184 65074 80104
9605 80104 26775 -7819 3451 2035 -21655 6983 27562 14011 -2283 -48220 -59166 -54073
9593 -54073 -65042 -129823 -170149 -122878 -54003 689 32627 49065 48423 20943 24128 -43770
9581 -43770 -72185 -105566 -69758 -24157 -4379 -5549 -36768 -138072 -178069 -71643 25135 -26157
9569 -26157 -16444 8432 -24167 -14828 -17934 -72524 -73927 -34876 -592 35204 33929 29420 -22453
9556 -22453 -59252 -61923 -43489 -25359 38417 11311 42177 17583 21319 39349 -18772 -54194
9544 -54194 -29962 -2695 6420 6702 32338 -11192 -19592 36430 70537 40602 -25867 -37565 -15717
9531 -15717 -30687 -92072 -100351 -136776 -103926 11186 35813 17290 -95663 -134831 -83823 -55750
9519 -55750 -66226 -59889 -53566 -27708 -19987 -15348 -16308 -52805 -68955 -42384 8767 55856 -16444
9506 -16444 -49927 -75520 -75087 -20500 -33134 -20569 21530 -26067 -37777 20059 12545 -46142
9494 -46142 -59547 -103831 -75114 -1513 1752 -99211 -89681 -52161 -55797 -45251 -9525 -32408
9482 -32408 -70043 -59821 -54597 -11301 10462 23164 7699 5765 41133 -35702 -74296 -35022
9470 -35022 -12144 -52205 -81741 -72824 -36952 -179 1422 -24855 28964 28016 33761 -6259 -55063
9457 -55063 -51425 -48899 -15733 -1393 53122 50654 45639 -55789 -114638 -113180 -67256 -80714 -95510
9444 -95510 -82478 -76393 -29339 -6711 15607 2692 -556 1297 -43376 -87098 -111776 -95874
9432 -95874 -112459 -168891 -130811 -57009 -18917 -65999 -49063 -55088 -60625 -3691 48717 91792
9420 91792 83684 83121 114942 75573 37616 41190 -4043 -24611 -8978 12104 -37755 -33293 8440
9407 8440 46940 114511 88124 22315 -14095 5730 7102 -17666 284 90817 82203 -19303
9395 -19303 -56713 6487 55243 108005 87637 -1666 26105 66308 69549 131769 81680 38616
9383 38616 -19381 -65039 13958 54768 48192 56890 55208 2680 -47645 -43320 -50461 -67851 -45447
9370 -45447 -63909 -59052 -88414 -127658 -138017 -76168 -59059 -63990 -7021 17117 7778 45199
9358 45199 59438 67566 69655 95204 115341 88721 80421 89959 84084 85411 53875 25279 -6700
9345 -6700 -48524 -101717 -72692 13876 63869 83985 40061 -41137 -6320 -11787 -7736 -3705 -44240
9332 -44240 -34537 -47597 -60330 -102915 -59269 -35960 -37987 -31613 -3445 -31538 -15503 -63162
9320 -63162 -49431 21502 18540 -25618 -54774 -9729 41132 85082 15548 -21779 -4845 79474
9308 79474 148068 125289 169970 158998 154873 133313 144185 123847 135468 120007 75185 79577
9296 79577 25740 47816 109826 96075 61307 36517 5875 -75034 -99337 -105797 -123409 -99333
9284 -99333 -69264 -69030 -52190 -51099 -73001 -119554 -104401 -38020 -3165 -56837 -67947 -101669
9272 -101669 -84661 -25097 -28376 -47919 -5284 36865 79816 66505 27669 31197 -13087 -55828
9260 -55828 -81297 -72599 78181 146030 115106 76160 65449 32317 -24913 -50396 -26163 75903
9248 75903 110675 40656 -2983 -48819 -45408 4725 40826 34605 -26067 14277 101730 114557
9236 114557 83761 1230 -39212 24763 56891 16268 7590 26679 57202 45121 12313 18820
9224 18820 14860 8785 32814 68963 63531 21150 38039 30152 50487 57837 -35160 -41383 6050
9211 6050 29841 48116 94296 46718 -7560 -26403 14917 61188 -14309 12760 42629 36132
9199 36132 7490 -14725 -11576 -15168 -18100 17232 23403 -20514 -10412 8031 54300 83435 130584
9186 130584 81365 -1236 -29876 -47139 -8578 75349 103826 76773 72315 37038 36299 -13127
9174 -13127 2125 18662 -14403 -76303 -43255 36378 123976 135346 138406 98589 128476 161300
9162 161300 94263 89266 77811 -13281 -10636 -23396 -35404 -1406 19016 46956 61023 71937
9150 71937 104135 128950 90674 47434 53174 111692 111345 125113 144165 179632 185591 156921 136303
9137 136303 129662 118586 140778 196740 212198 205971 214100 213796 212505 226097 145213 97884 52143
9124 52143 135626 271831 335044 321758 265167 244864 249633 195319 233332 270037 272220 277387
9112 277387 346546 374804 370058 357098 375478 442413 548541 498598 446252 463279 504421 613873
9100 613873 742084 848934 901007 967992 1073850 1141223 1238313 1375124 1512057 1692789
9090 1692789 1852919 1994748 2130133 2381021 2724708 3162543 3627228 4039404 4397858 4805006
9080 4805006 5162007 5435219 5599595 5658072 5528349 5303252 4997415 4631634 4223019 3811873
9070 3811873 3493285 3193325 2912019 2644366 2475886 2277849 2102492 1995630 1871326 1803470
9060 1803470 1722183 1573522 1448184 1354158 1273678 1267335 1213039 1146759 1059529 986689 932419
9049 932419 901791 872902 839995 793761 808490 753216 635275 579894 564648 530487 495356
9038 495356 497692 475357 416502 368428 370796 397968 459408 408373 302069 257827 203347 249970
9026 249970 259782 317028 337854 278245 193915 180831 219464 252268 227081 172477 180543 260925
9014 260925 252465 194450 158209 126580 136652 156519 190382 166979 166737 103743 36445 52038
9002 52038 65544 108814 178055 139733 131467 109915 92443 116844 80604 57138 71524 68327
8990 68327 72385 34488 28910 18750 51309 42330 42924 8679 -28172 -17598 -6463 -42881 9782
8977 9782 61928 116089 123189 97289 59583 -40242 -49438 -11078 -14768 -59801 -72392 -45512 23509
8964 23509 30803 -4325 -9749 19337 -24194 19223 9873 -17987 51262 41848 28804 108554 145487
8951 145487 146838 88337 35396 38325 7227 50427 119873 55807 48333 77210 32667 33500 -14070
8938 -14070 -28791 -50748 -22179 -13398 -24490 -15506 -5755 -676 -23336 -63477 -75459 -68277 -13302
8925 -13302 60975 97876 84072 54699 43503 40575 59357 47769 -11183 -49377 -62752 -16042
8913 -16042 34775 12536 -5973 -9617 -77229 -90817 -34131 -24286 2427 -8912 -26588 18871
8901 18871 55242 85664 71915 70042 38796 31869 46260 66899 87301 55662 12356 7964
8889 7964 33431 67397 51123 -1428 -52604 -61055 -51434 -29362 -56868 -79744 -110159 -125070
8877 -125070 -134191 -90657 -34391 1622 8311 4007 -32116 -23888 -39723 -28988 -63862 -57245 29435
8864 29435 69835 40577 3121 -26567 -57752 -36265 -91938 -128697 -105155 -53583 -59724 -72431
8852 -72431 -24701 -27244 5160 55729 66652 1143 -20271 -10207 14074 21783 30523 83017
8840 83017 100254 63374 35747 59949 -7632 -56671 -30638 26479 56964 51683 21552 39648
8828 39648 43817 38751 519 -14753 -13657 -28590 -75801 -98045 -71579 -26989 1348 4349 -11788
8815 -11788 1261 -7586 -27368 -27242 -39758 -72915 -84028 -45497 10382 63185 64710 88481 107227
8802 107227 180423 119012 65347 47055 34002 -19172 -22620 -30513 -13425 -15216 -20620 -68778
8790 -68778 -61943 -4864 -18223 -116176 -114349 -81908 -50579 -77452 -115656 -114203 -131631 -80887
8778 -80887 -68357 -55229 -65870 -93747 -62060 7344 -652 9067 -10092 20908 8623 -2330
8766 -2330 48841 37336 -27085 -38403 -41587 -11192 -5817 -42245 -26288 32027 26480 15347 -6776
8753 -6776 9370 -14489 31578 19583 58508 90349 103050 52651 21333 24830 43803 11129
8741 11129 4493 -20453 -20038 7478 6780 46770 43751 47255 10757 17671 -9798 23727 28783 18626
8727 18626 -9060 -8243 78935 121656 128244 85976 89442 13182 -74699 -74559 -70575 -105725 -113204
8714 -113204 -71103 -53652 -76785 -38006 -26183 -54299 -33288 -4984 -21808 -2142 -13742 -23780
8702 -23780 -30299 -26110 -41193 -44804 -57543 -58285 -63839 -27678 -42363 -117604 -100714 -74129 -115632
8689 -115632 -136481 -106013 -76989 -61947 -16758 42560 35440 25804 31405 66830 48447 17555
8677 17555 6312 -33816 -20594 -26813 -16930 -17383 545 31938 16584 29783 22770 9127 7991
8664 7991 -8101 -63147 17474 37023 -43898 -22977 -8919 27328 14371 -19875 31994 46064
8652 46064 -11727 -19824 26295 39701 -18782 -69190 -12469 56299 28244 -39891 19902 82699
8640 82699 74248 100062 93477 59826 79412 89638 41420 38488 15828 67121 73633 96214 50044
8627 50044 37962 20739 39344 43953 54887 81113 103502 83783 113867 182846 237829 190881
8615 190881 129623 77764 90039 97379 145987 194211 164818 97317 99746 121570 95640 51335
8603 51335 99048 120681 172150 209423 153139 174160 218987 217327 154990 78466 139746 166606
8591 166606 146894 166517 162065 179138 203270 161967 119217 117327 136563 137571 104563 97011
8579 97011 117953 130881 91532 59627 40813 83288 96557 97367 51576 56700 52250 36376 49719
8566 49719 49756 104021 66143 29907 58387 65588 21644 -27396 22498 52071 53482 55235 46590
8553 46590 80795 64619 47348 84835 101223 125684 97431 81730 55364 16808 -2027 -21120
8541 -21120 -48108 -56300 -3412 21755 57205 94938 99979 67561 -788 -55494 -60764 -12290
8529 -12290 24289 72051 104969 96972 83376 122974 160429 152836 47071 5993 26026 111032
8517 111032 116214 102914 66382 12169 22483 16965 -19642 -22583 -48764 -93417 -47372 1658
8505 1658 20043 16775 43483 13044 30487 23324 25777 104838 111227 53527 31119 45494 -4136
8492 -4136 -2466 35645 11445 -25996 15184 -9038 -30834 36266 75580 64498 29759 -14608
8480 -14608 -135077 -92111 -72231 -94041 -84448 -8268 54647 6228 39256 41721 -13960 -62558
8468 -62558 -71519 -32638 -42829 -60221 -64976 -62508 -64963 -61847 -56325 9151 49897 -2144 -9418
8455 -9418 -27781 -62357 -32860 31803 53574 51442 -9808 -23177 921 48621 116950 120025
8443 120025 32809 -19334 -21690 4975 -16041 -44171 -89822 7181 84932 97046 120831 139996
8431 139996 -4121 -83344 -15256 -30791 -37352 -10799 -12205 226 -18713 -9976 -26410 -45092
8419 -45092 -72071 -57639 -271 86784 109978 27211 20253 -15904 -61566 12248 9295 8790 29446
8406 29446 83964 110219 71982 34233 80129 151509 103608 51580 484 -13063 -34923 16986
8394 16986 58553 23989 3893 -23922 -45426 -72966 -84482 -59998 -39410 9534 94461 77367
8382 77367 51647 17050 -18147 -28079 -12137 92590 88693 46856 72963 72089 19307 -45057
8370 -45057 -78827 -64089 -34085 -20493 -5852 25863 57013 55049 21300 29231 -1177 -25836
8358 -25836 -95127 -96733 -72873 -67087 -15757 -8003 -16905 -2427 -17269 -65556 -95619 -54999 15519
8345 15519 48347 66424 46154 -4269 -67088 -69877 5340 87016 113881 149463 111766 87269
8333 87269 44694 65583 58342 50879 23979 -32859 -57743 -13142 4630 -16655 -11532 -46454
8321 -46454 -41875 28337 50637 35883 20116 39131 35379 80400 75951 30501 73945 49217
8309 49217 -1846 -18889 20102 -25244 -17722 -6550 10143 43938 -2929 -45364 -74915 -27389
8297 -27389 -52045 -70292 -70290 -13925 -20985 1613 -10554 -66448 -72948 -112975 -104091 -53438 15151
8284 15151 -27432 -44160 -36326 -89837 -111067 -75553 -35085 40199 101698 76136 32900 40845
8272 40845 9202 -53152 -91033 -120322 -69549 -30007 28681 818 23158 29474 56152 51367
8260 51367 84493 43313 29855 73983 69316 2925 -12983 40916 122222 122424 92041 57310
8248 57310 48717 57741 82515 68574 68112 123783 167756 180621 172866 164844 134684 127971 101239
8235 101239 30251 -48088 -98067 -52339 -39891 -26533 -64341 -45377 12364 18774 -31086 8899
8223 8899 22115 -33930 -88672 -69695 -37493 -15466 -5986 -28683 -12823 46702 89671 88788 75008
8210 75008 17387 -46138 -57030 -43216 -11113 -14810 28450 71791 56716 50507 -5033 -12848
8198 -12848 -48112 -15205 -25095 -52176 21086 34562 -46702 -50524 -21766 10295 50944 35008
8186 35008 -40476 -36505 -34943 8690 54197 11394 35217 10053 -38367 -89429 -79909 -15576
8174 -15576 -10095 -44748 -84872 -92329 -49977 -58743 -87713 -85984 -59657 -48202 -2541 4518 25358
8161 25358 -13153 -69350 -99834 -59627 -10054 -18939 65073 73606 -3212 -45586 -35232 -2579
8149 -2579 -46360 -30864 -68476 -80470 -38627 5353 43043 69709 91666 67722 30978 33612
8137 33612 19145 -17372 -80782 -87513 -60781 -49827 -16539 -23338 -65268 -128404 -113267 -83626
8125 -83626 -78940 -27083 59625 98915 105724 89216 70535 59148 45891 -46210 4301 3042
8113 3042 -1513 33945 30467 -26169 -20962 -13895 23016 -38595 -56324 -14067 21850 24720 15153
8100 15153 42457 24467 -14348 23765 43992 67816 87518 49762 34938 24787 -8762 -39062
8088 -39062 12494 -13776 -30408 -7719 -32361 -53461 23881 33594 82397 61628 29095 48258
8076 48258 88982 44944 -1928 -17565 16089 68131 78163 89248 81458 43498 -885 -10754
8064 -10754 9965 -58905 -120475 -146090 -107387 -22723 -10680 -5276 647 24616 14706 39586
8052 39586 7800 -15735 -2484 35971 23177 -31630 -12341 -3233 -23550 -6774 19659 38901
8040 38901 13135 42333 70162 11888 9582 25010 12362 -69686 -67429 37969 64338 36657
8028 36657 4226 6433 34774 77364 77367 66555 86023 69061 88190 98747 87287 35856 1514
8015 1514 -2472 24577 84244 75689 67496 83306 98893 63156 88948 122266 153656 230968 236341
8002 236341 204192 256874 265642 245847 204782 191604 183378 138868 98213 108578 68252 116042
7990 116042 143885 138450 151988 212053 207612 129239 99073 79114 36196 62319 107459 107427 128658
7977 128658 132793 120698 114615 39088 28852 -21694 -13882 13452 22975 21024 -5176 20273 44962
7964 44962 114035 122419 120983 114664 87307 93552 70630 115579 128644 114354 64749 75726 127171
7951 127171 167138 163161 153039 191660 226739 200058 156921 130235 145841 167678 166980 160800
7939 160800 120808 55457 64134 48644 49153 63480 70490 33179 37483 -9365 -10461 -46049 32415
7926 32415 82234 -26747 20226 129376 136735 93773 80288 138725 141160 103461 87191 108833
7914 108833 161145 173597 86282 85951 72619 69013 56707 101536 155510 116955 69741 32391
7902 32391 48578 107747 64189 41915 25243 -7648 -10461 -21948 -25307 -90034 -75680 -59958
7890 -59958 -54706 -56451 -34867 -81834 -63371 -48986 -26423 33711 56751 4455 7033 18260
7878 18260 -17180 -60754 5004 4890 -20668 7764 87901 138000 110025 63611 58702 64966 47170
7865 47170 -54930 -122192 -141836 -172456 -140003 -111791 -114852 -112241 -80113 -36485 -58353 -89971
7853 -89971 -36767 -17357 40447 62678 73193 48132 -92482 -157532 -140827 -122256 -86666 -82938
7841 -82938 -107793 -87797 -28144 -17018 -53959 -70531 -111390 -98082 -12955 -18791 -20812 31546
7829 31546 84351 60228 56494 -22609 -37150 -20555 -2357 14018 33993 6082 34670 98340
7817 98340 94710 144112 62794 -9075 -26456 -38166 -73141 -55912 533 4548 -24408 -27746
7805 -27746 622 -4022 -21785 3073 77788 86853 63576 78328 94286 67759 9906 -5436
7793 -5436 -24547 41781 68676 -12946 -91363 -78004 -98655 -109982 -74624 -112953 -105262 -122474
7781 -122474 -73973 -40599 -32524 10601 11137 10555 3754 -15544 -117373 -113056 -58217 -23559 -36505
7768 -36505 -95339 -89297 -73946 -67983 6777 41639 13853 -2619 65315 152267 80339 11002
7756 11002 13686 -3893 17097 58918 -9669 -70007 -30023 -31220 16914 29725 7605 -24281
7744 -24281 -33361 -104310 -136238 -74545 -72311 -29192 -29905 -33839 -60238 -63690 -58731 -67518 -87993
7731 -87993 -61585 -73832 -106226 -51236 -20074 -71559 -46841 -63197 -67475 -47922 -29235 -40022
7719 -40022 -60847 -36416 -48683 -43368 -82387 -77861 -60126 -22301 18218 -15614 -59785 -32309
7707 -32309 -37515 5295 16120 61270 74680 63643 49199 -349 35884 37732 69019 25766
7695 25766 29951 68042 140790 128448 91984 100063 62267 -329 -46810 -31619 532 -18015
7683 -18015 -52122 -16313 4971 4728 41839 62242 47046 16354 22179 -16788 -18781 -1610 -22706
7670 -22706 -58603 -43201 -22853 -46680 -83987 -69226 -86247 -67112 -48204 -23943 -23134 20287
7658 20287 48314 9644 -52448 -49217 -73099 -119664 -95071 -29523 -75533 -136878 -165147 -133984
7646 -133984 -147702 -189634 -161676 -131550 -92487 -113055 -115745 -125100 -132101 -125702 -63546 -815
7634 -815 37312 12733 -4238 -3854 9420 15874 1778 4028 38385 -10793 -39245 30831 55092
7621 55092 36480 -10223 -54799 -59416 -13155 12958 -44387 -31845 -27130 -37721 -1036 -1791 25757
7608 25757 28686 73337 50754 35892 -11639 28745 54392 24800 21742 20336 46958 51049 26934
7595 26934 -13866 2150 47899 20816 26479 11176 -19971 -89419 -91454 -85757 -42658 15497
7583 15497 32868 73146 67806 76241 70977 156489 134690 47583 31080 -27000 -67653 -61672 -28660
7570 -28660 12269 41862 62460 32874 -3449 -4132 -16693 11216 62751 123705 130409 165457
7558 165457 168621 188542 153299 72111 -23952 -19493 14359 61986 54516 80821 36277 -41215
7546 -41215 -52744 -78163 -62292 8723 29569 47934 -37837 -74610 -14855 35818 -81 -56467
7534 -56467 -25345 47939 79903 98364 64885 40579 34396 -17278 -63544 -86163 -140548 -128919
7522 -128919 -101985 -114639 -67313 -59402 -87919 -106096 -98366 -80967 -44881 -64945 -9052 18002
7510 18002 60557 20547 -382 71205 84337 17296 -31259 9770 33462 -51959 -81456 -35202
7498 -35202 -9801 -5325 -34683 -25336 -35056 -55495 -42501 11004 53162 48053 9372 42814 17059
7485 17059 25000 17629 52383 5301 -39650 -31591 -8712 -34739 -59586 -34143 -46620 -41307 -74655
7472 -74655 -60564 -36429 -60260 8515 63037 -6935 -89230 -94864 -113077 -126442 -122795 -60614
7460 -60614 -64119 -38315 15403 -4717 -28235 -18920 -67250 -70305 8602 81884 107100 115183 114500
7447 114500 119539 105328 52674 51372 94376 91946 54917 -38724 -37824 -39983 -43834 22621 21254
7434 21254 -56013 -16977 34808 27840 54612 43435 2050 -41749 -51828 -70421 -86104 -113212
7422 -113212 -54705 1593 46515 21434 6811 35861 -32494 -91675 -107591 -50222 -84187 -137408
7410 -137408 -145705 -145854 -108026 -113449 -122088 -111068 -89839 -82347 -102235 -96159 -21499 27988 -6381
7397 -6381 -51382 18038 13928 -5299 -18585 -36979 -12492 -4293 -86111 -77194 -32709 -49949 -26883
7384 -26883 -12415 -31727 9439 19803 -5534 -27540 -23915 -11324 17738 39481 5082 -27322
7372 -27322 -33852 749 -38855 -92588 -134250 -65683 -103926 -115596 -123237 -57071 30221 -18832
7360 -18832 -21659 -29529 -27509 -23388 22974 3126 763 42120 5449 28663 68283 104069 37178
7347 37178 -3182 5351 7573 29137 82311 149504 107223 50799 41570 52957 86982 2262
7335 2262 -21622 27049 60878 14513 -39984 -93213 -74951 -52123 -34580 15612 39700 39055
7323 39055 29387 21187 17577 -33772 -94577 -77555 -54044 -37423 -58724 12131 29390 24797 46736
7310 46736 77492 102465 64886 65623 77766 11983 489 16961 8985 -35355 -22648 -14815 14590
7297 14590 21928 21165 23891 -58545 -111121 -6189 -67478 -67003 860 59916 49167 3389 -69982
7284 -69982 -119729 -122445 -87113 -57580 -45527 -28040 3824 3331 -8073 -32143 -33593 -19113 5464
7271 5464 52510 -3565 -51225 -34720 -43592 -35404 -31047 -7481 29652 -2430 -36337 3347 46316
7258 46316 72769 8756 14622 24033 -5589 -43051 -12699 -2570 31967 38101 72027 -30032
7246 -30032 -103776 -105799 -124520 -83173 -41487 -22600 -10489 -62368 -119871 -156208 -137029 -75920
7234 -75920 31423 35059 -379 -31445 -70370 -67569 -24047 -44372 -34986 30470 15601 -17998
7222 -17998 2494 -16829 23880 1374 -35002 -60784 -51976 -35713 -44899 -192 -19408 15229
7210 15229 27406 86465 97929 50172 -38738 -89889 -89605 -116018 -162857 -127984 -80676 -3708
7198 -3708 -18162 -80933 -81658 -84361 -152265 -159092 -99913 -73279 -47468 -30444 -62824 -129402 -141756
7185 -141756 -128026 -58256 -19978 -28543 -49595 -32896 66494 119189 75449 47401 44971 39313
7173 39313 -42314 -134492 -116598 -41309 -17248 -32781 11820 -58141 -78978 -71641 -72885 -56365
7161 -56365 20540 54801 40577 80622 37056 13818 39686 78488 43666 -45015 -77674 16731
7149 16731 55660 47763 -16838 12198 54298 5441 25451 -2184 -38694 7367 67131 70433
7137 70433 66809 84213 16690 -4948 -48310 10383 70925 62400 43376 66036 73710 135783
7125 135783 114742 34980 29855 68144 88640 90460 91123 33347 35064 49946 38305 63236 58768
7112 58768 -19646 -44806 663 38708 -58576 -95477 -76267 -93133 -91279 -66575 -48042 -40170
7100 -40170 -18068 6686 -11319 14817 5765 46 -56946 -60637 -47339 -58730 -54048 -47754 -78445
7087 -78445 -31685 -26753 -52627 -63960 -62416 -62487 -62527 -49365 -30109 -61764 -36522 35040 -20174
7074 -20174 -74399 -63729 -72379 1256 59821 41936 65427 100954 55756 36932 43335 14019
7062 14019 -103247 -87225 -74248 -74125 -50517 -21572 -9302 10582 32528 33680 -14480 -76918
7050 -76918 -63523 -9146 23 -48207 -76459 -122432 -102554 -21709 25986 28471 4772 -14928
7038 -14928 -17988 1376 26451 20856 -13714 6452 54573 103297 84596 34727 -31198 -66527
7026 -66527 -59091 -70162 -56080 -17190 -32322 -53300 -50898 -9023 11477 -1177 78284 73220
7014 73220 28410 50155 45379 16296 54210 50124 9649 9838 15437 16089 24691 -19940 -59738
7001 -59738 -80487 -40095 -15256 -16502 -25071 -47547 -62811 -1690 13085 -52511 -54104 -24284
6989 -24284 1513 -42160 -42111 -53069 -26497 13412 46918 31156 14260 33934 -16201 -87583
6977 -87583 -124235 -144602 -141383 -110380 -81769 -46016 -33496 -40016 -67615 -34772 18606 -5138
6965 -5138 54300 98385 87742 64083 3490 -3894 -37633 -69343 -50544 -8574 18651 -25400
6953 -25400 -40896 -17106 -39589 -12449 6515 -3331 -9921 -37285 -130388 -120337 -98342 -41613
6941 -41613 -30678 -18328 -27379 -35162 -19680 -16363 23215 62523 121819 95794 9138 -59292
6929 -59292 -119408 -82766 -103664 -138416 -139437 -100249 -2544 27905 -4946 -81165 -95929 2137
6917 2137 29191 -26769 -45614 -38221 -22080 -3557 -53376 -73412 -53940 -53144 -33004 -25243 7325
6904 7325 73698 95759 6627 -74104 -87511 -31666 -58670 -55159 -25306 -53712 -58685 -107358
6892 -107358 -100981 -66902 -57786 -61224 -22270 40396 58049 14030 39914 12388 -27301 -75028
6880 -75028 -28799 -2310 -20559 1998 23158 -6588 16016 53539 -20312 -8226 56339 51065
6868 51065 9965 5419 -12288 -31894 12113 39263 27691 -6741 -44431 -54529 -13090 -7400
6856 -7400 -72968 -82234 -34684 -39317 -6044 39629 -32446 -56041 -7555 56873 18913 -21398
6844 -21398 -46153 -98947 -28928 2626 -41000 -4679 5314 -16337 -9325 -34416 -101472 -97763
6832 -97763 -45517 -40342 -69896 -83433 -51043 -29810 2218 31342 6421 -79525 -68545 23878
6820 23878 14473 -216 2160 79722 66753 10261 -2090 -27950 -121698 -133640 -83429 -64621
6808 -64621 -48100 -94873 -122731 -118059 -81533 -70308 -83144 -73345 -104605 -47485 -17180 1567
6796 1567 13347 -5044 -4058 45650 93423 81915 70394 27090 -23402 -24117 35778 60765 38987
6783 38987 12408 -23881 -74598 -58132 1505 -48542 -102925 -52959 -49073 -62853 -5990 7850
6771 7850 -71273 -105452 -75013 -95265 -129270 -92159 -16769 15847 -12735 -91288 -65253 -50424
6759 -50424 -99092 -110946 -101806 -82480 -3607 -62888 -72977 10199 42253 -24259 -40565 -21835
6747 -21835 -13160 29365 71774 84234 85953 47759 43896 96454 76245 25415 64418 94889
6735 94889 74500 82228 68740 9701 -16223 20406 36392 58869 17846 -14312 631 70418
6723 70418 20553 -45603 -51613 23340 40308 10019 26293 57668 36458 26660 -13460 -53165
6711 -53165 -20483 -10479 -2688 15773 12766 -5081 -3091 -13002 5818 37944 -7316 8328 21249
6698 21249 19362 52933 42524 50623 34111 -29859 13689 14172 -61773 -87242 -56383 -67542 -45716
6685 -45716 -86625 -96159 -31940 24303 26771 67280 59315 44901 75654 35345 54071 107326
6673 107326 110256 80746 83593 78395 10825 28334 35072 16508 41355 58362 83150 31545
6661 31545 -22402 -26168 -8765 -30609 -70600 -69294 -11509 -6304 -20589 10035 9138 -35891 -57774
6648 -57774 -62505 -56592 -34352 -84571 -94981 -67317 -121071 -48467 62965 101995 17332 14612
6636 14612 -12145 30946 51963 -27648 -59644 -38442 -44338 -69940 -81644 -47939 4481 -29700
6624 -29700 -48192 -18127 59869 45727 14609 -2078 -106611 -148010 -111320 -49137 -11417 -6162
6612 -6162 12009 -30650 -50569 -33499 -64 18437 -338 -12678 -49767 -43971 -46807 -27667
6600 -27667 -20846 -11141 23142 32233 47376 15719 7420 26625 6260 26826 41791 51448 5801
6587 5801 33014 35536 22214 2851 -564 -41785 -63695 -51520 6373 2203 -842 -61424 -32928
6574 -32928 16256 -22187 -36085 -320 -11460 -88875 -66900 -36695 -51091 -52873 -7470 11120
6562 11120 -14451 -59855 -105003 -130531 -65413 -39620 156 -413 -4368 -85312 -114876 -102535
6550 -102535 -117404 -15292 -8415 -58322 -44441 296 -5229 -45559 -67272 -86104 -45395 3187
6538 3187 -23055 -39357 -41528 -25665 -10231 24900 -15150 -49703 -20639 19182 59120 100909
6526 100909 122625 41612 17501 43670 26418 7707 27851 20228 -6083 -10486 -15344 -19779
6514 -19779 51727 106408 89691 72619 21964 -22903 -956 9745 48874 55265 39777 27614
6502 27614 59951 94495 73029 60925 91730 56913 15078 -20797 -10442 -77236 -56352 13118
6490 13118 52957 47194 60780 59966 42676 22495 83331 56423 49933 105787 80031 62837 18716
6477 18716 -2859 1722 8695 48569 60892 59315 33697 -23707 -44770 -60196 -16962 34007
6465 34007 16799 -2591 -911 -7756 -83800 -102769 -51022 -72952 -52567 -3306 50316 -29500
6453 -29500 -95986 -78198 -9131 -44090 -53158 -80820 -105235 -50903 -57879 -100722 -79999 -1233
6441 -1233 47445 50231 41993 69467 71578 74404 70855 1508 -14974 -25961 -60184 -94581 -58809
6428 -58809 -9465 -8151 -67017 -136307 -112770 -52312 -50812 -11020 -38131 -66876 -93820 -106321
6416 -106321 -115997 -96251 -23952 -10828 41455 110476 53462 -23138 -38168 26993 52566 29124
6404 29124 11290 -38421 -96205 -77941 2210 10220 25374 20819 14326 -3621 10534 -3697
6392 -3697 -34586 -76465 -77706 -13970 4545 -45432 -23515 17320 51587 84704 27293 -49895
6380 -49895 -56640 -78706 -19614 -36696 -54935 -90532 -63760 4353 465 24441 31148 -36241
6368 -36241 -12538 -29096 -36698 -28282 -3513 24023 7273 -8853 -20980 31827 74818 9814
6356 9814 -60302 -48723 -729 13020 -1829 21909 -29330 3637 113162 127122 115990 154829
6344 154829 43213 -33506 -77001 -61413 -125228 -147656 -85933 -42405 -24083 -33871 -68270 9211
6332 9211 38882 12268 -54730 -72190 -34906 5121 81022 45423 -39560 -80827 9801 107382
6320 107382 66311 20526 37147 15498 43958 54644 24914 -39401 -58393 -63859 -77657 -110780
6308 -110780 -100843 -80435 -30650 28787 -30186 -89973 -92446 -62830 -16830 211 -15381 -3544
6296 -3544 -26288 -56741 -49291 -28172 31061 62254 82929 67403 62906 98066 104463 91054 81042
6283 81042 15129 -69413 -41939 -4831 1136 29495 57401 15317 43366 18582 -1270 -5443
6271 -5443 -60642 -28663 -12955 19397 37932 50687 53853 14585 -10668 43127 53709 65967
6259 65967 65937 77824 10671 -67603 -49361 37520 70938 79115 77195 130117 143285 101985 7662
6246 7662 -22822 -73374 -83745 -89214 -74441 -80588 -113589 -43632 -32648 -11328 30854 56562
6234 56562 71236 101445 59512 44345 56903 64020 -15418 -80174 -8064 63211 38887 -13716
6222 -13716 -38760 -41147 -73450 -96362 -85061 -86202 -73682 16733 57914 66054 -41292 -79233
6210 -79233 -94383 -80415 -73798 -39990 -29505 -63805 -46613 -34500 -22099 23474 6454 34959
6198 34959 87687 107398 143096 121603 55234 -1440 -35284 -81944 749 70704 49240 -30650
6186 -30650 -64004 -80438 -84372 -70583 -81842 -54395 -33128 -27639 -84869 -60672 -23820 -36204
6174 -36204 -36898 -81413 -101441 -65735 -13637 862 16572 42881 13963 -36370 -33496 -61335
6162 -61335 -64675 -23712 603 -25809 33080 46857 7394 2272 21680 -22556 -17293 592
6150 592 40806 38345 37467 11111 -4086 -40142 -93149 -95560 -81162 -111073 -147492 -72448 4129
6137 4129 95082 115247 56638 20964 25909 50736 22815 36933 17867 71052 -35189 -86642
6125 -86642 -82836 4055 23339 28712 48994 90518 67087 65539 70964 -7012 -31421 -82875 -15682
6112 -15682 31059 39105 30332 22125 30115 -9962 -48002 -69680 -103865 -61190 -16160 14052 18421
6099 18421 -5208 -43233 -30506 1600 -801 -17321 11765 10139 10936 5929 -33462 -27356 -66414
6086 -66414 -106456 -18516 13629 -29791 -42463 -23248 -17520 54112 126528 141968 28577 -23576
6074 -23576 16398 -12862 -13774 -62685 -14816 -19330 -8491 -5484 -3233 8900 -53475 -29695 32196
6061 32196 46997 -424 11292 10332 -9390 -31959 -62609 -80287 -91175 -55800 -30166 -80190
6049 -80190 -79522 -12709 -30858 -58557 -3597 17804 3994 5604 -5793 17298 42090 -24841
6037 -24841 -88287 -56284 -25546 -69924 -93815 -36563 -48366 -63188 -19130 29567 -25936 8427
6025 8427 -29791 -33085 -48899 -22268 -36589 -36416 -957 53410 8266 -68123 -96527 -76734 -83748
6012 -83748 -94242 -69914 -29721 30288 79247 76195 -20784 -42912 4567 -56556 -117235 -78613
6000 -78613 -6119 -10876 -48184 -66671 -75019 -50684 11217 -26459 -53387 -35165 -25706 -40237
5988 -40237 -36267 -65595 -46836 14438 -29296 -50684 -44795 -44012 -37967 17305 39220 14531 -79614
5975 -79614 -124844 -99624 -30979 11563 11764 2821 52959 39920 -21627 -21561 42863 34082 9083
5962 9083 -23092 22035 12878 26868 103459 66490 40312 26771 -7833 17236 -91 314 -22438
5949 -22438 -8356 -9918 -19533 -22602 19954 8876 -15928 13247 -4180 -31298 -74680 -75705 -102637
5936 -102637 -79083 -26800 -33132 -30549 28650 74727 91114 97968 66023 31587 -53203 -102665
5924 -102665 -70213 -9906 -10086 -73345 -122478 -109538 -74077 -26063 1878 -2759 6146 61646
5912 61646 77302 36818 26035 19137 -32892 -22435 22013 43482 62766 80412 32805 39703
5900 39703 16542 -18639 -27491 2592 -14009 -45834 -15592 -9643 3804 42786 49172 81348
5888 81348 90034 73020 -38198 -86902 -31683 -17515 -12512 -44415 -110434 -102866 -42083 20827
5876 20827 -49347 -30597 -18027 14819 64915 44037 10727 -27901 -37997 17512 29014 37082
5864 37082 13421 5268 -12065 -21967 -19762 -6731 55191 86883 -12006 -67611 -72608 3558 124797
5851 124797 86337 -1315 -44302 -39373 31171 87797 18032 -39547 -11871 -2812 -23321 -18554
5839 -18554 -14702 -24595 -24840 12225 786 -19256 -33848 -38836 -67137 -42501 26309 4913 -33654
5826 -33654 -4412 76656 73208 29146 2864 -24496 -64382 -59417 -4397 175 -83815 -164983
5814 -164983 -167102 -89172 23281 44713 24957 32910 17537 4502 37992 65219 56094 -813
5802 -813 30693 15736 -22201 -10674 25210 74535 101182 76720 34686 32184 2593 -19404
5790 -19404 -31541 -65660 -104890 -120686 -140189 -63573 -14595 -7349 -7005 -3199 37291 58480 61908
5777 61908 8778 -17924 20136 35375 52815 123533 80491 59194 25325 24467 5457 2610
5765 2610 68685 80211 13150 9798 11554 22466 46273 64194 21302 -42130 -21463 -20203 -25839
5752 -25839 -363 19532 -9676 -97182 -155880 -152382 -140837 -84636 -64307 -71647 -95356 -68389
5740 -68389 -28792 -13607 -33647 -41344 -29616 -15751 -52775 -69086 -15956 30673 31205 51770
5728 51770 61767 -9489 -79278 -51021 59884 82943 21646 1411 16527 -1727 -550 31276
5716 31276 31749 -15335 23148 1110 -26083 6714 43650 -5345 -91225 -48502 -18219 -37986
5704 -37986 -64261 -35368 -13429 19225 27118 43386 -12728 -42674 596 -6086 -27615 -35808
5692 -35808 -40612 -52845 -80497 -79442 -33817 59324 159114 98146 15650 5225 14341 19320 25746
5679 25746 51720 61289 82309 31986 -17927 -26208 -43243 -90887 -121372 -74603 -25880 3322
5667 3322 18381 65208 103637 80905 19208 -36619 -71248 -11801 -13107 -38492 -76840 -37724
5655 -37724 8010 26351 -8283 -9419 -48174 -62685 -43923 -54431 -49364 -30422 -8668 80540
5643 80540 133834 62746 2704 -27852 -18595 -16736 14959 -17545 -71967 -63759 -45442 -44727 -33222
5630 -33222 -31216 24801 2861 -9912 5324 32934 13570 -7089 8405 -5116 -43540 -50582
5618 -50582 -11816 -27420 -71972 -87375 -66728 -50851 -15339 -24103 -21855 4254 -19213 -11567
5606 -11567 32335 73312 98711 94899 62409 19114 2835 -40732 -83889 -98348 -2730 109248
5594 109248 191682 152507 100056 118103 102697 9130 -40343 -67609 -77390 -6416 48823 73818
5582 73818 104635 112430 69095 -17630 -36039 28064 60726 63205 8761 -127441 -201304 -183782
5570 -183782 -167804 -83776 -71676 -103248 -97007 -50645 -11362 -76870 -113320 -80099 31604 -5083
5558 -5083 2876 78863 93535 50108 -48929 -51978 43616 17989 37667 79848 116906 93716
5546 93716 43911 46167 16703 -37884 -6316 40679 64570 4184 -27014 53963 85454 56535
5534 56535 22382 -27792 -20679 -20721 28386 62610 101324 99801 88069 10438 16558 23890 -7813
5521 -7813 52741 51199 67041 55834 40819 25856 -7001 -55998 -39247 -5108 16348 11847
5509 11847 38239 -4703 -32145 12941 491 -21888 -64889 -68156 -28280 -21136 -47292 -41779
5497 -41779 -77475 -51075 11323 27797 16797 16121 19287 58049 13642 13044 -71284 -82638 -56964
5484 -56964 1132 35873 66919 105996 88527 64014 48145 74306 84272 12682 -13703 -13311
5472 -13311 22447 51770 21694 -7484 -37049 -63660 -64506 -2273 212 -15957 18281 39055
5460 39055 1420 3088 9459 -39368 -72929 -100709 -92303 -96745 -75872 -39820 -53623 -23831 81221
5447 81221 70095 -21567 -107609 -89605 -42503 -10353 53882 54415 14123 44797 -45868 -51913
5435 -51913 -68635 -118913 -95391 -83176 -65535 -82439 -83802 -27718 10256 31979 26630 70239
5423 70239 96063 128422 89725 63941 36964 49428 46958 -8774 -4223 71299 84986 61273
5411 61273 64225 36019 46616 -14155 -33473 -55195 -52818 13345 10504 -20383 -32953 -50827
5399 -50827 -27433 5864 -20491 -42242 -30283 37100 95687 111904 113824 120765 69452 23721
5387 23721 -16772 -60340 -70022 -54146 -4517 54908 52493 58388 44051 -38845 -55259 -59863 -70764
5374 -70764 -57603 26838 68647 52682 33712 26805 49158 317 -9634 22106 40493 28738
5362 28738 75000 126188 156858 140361 56759 -29321 -78255 -99040 -83874 -31679 8733 -9031
5350 -9031 41326 85118 60117 30560 27931 50624 54637 16998 -36629 -40323 -35839 12911 -12383
5337 -12383 -19644 -40229 -50525 -89850 -99056 -43628 35524 32655 -50666 38057 101467 115459
5325 115459 84133 64312 29970 38190 76008 90441 85483 69508 82269 55886 86465 91044
5313 91044 46023 8846 -11259 -30377 -38441 7704 31007 3922 -32675 39866 92275 78301
5301 78301 61247 73414 27026 -48542 -51898 -64614 -100387 -31057 -42199 -78299 -34565 8932
5289 8932 -29232 -60906 -108505 -90154 -93347 -58929 -46735 -5358 37560 5116 600 -26453
5277 -26453 -53070 -68944 -52157 -79443 -76150 -41366 -96127 -90483 -84706 -81961 -86406 -72053 11308
5264 11308 38194 14380 -33627 -53602 5707 35940 -17986 -90609 -53397 50120 82784 39439
5252 39439 44367 33389 -23192 -57204 -47890 -26352 -6460 -57626 -70381 -55373 -23277 33171
5240 33171 71698 83618 50007 -2830 -19068 -5522 17099 -14445 -42913 -85075 -77479 -32801
5228 -32801 -47473 -20429 -44382 -51551 -35463 5152 -16819 -16957 19559 69497 63729 47272 19579
5215 19579 -19959 -28962 -11862 -25937 -21256 -46642 -42875 -4107 42081 -18968 -51057 -49968 -61954
5202 -61954 -61382 -107046 -106440 -10167 30501 55607 14691 -32131 -34576 -100872 -75223 38405 56083
5189 56083 -26648 -69741 -31064 -25655 -89477 -35923 -46523 -67875 -11727 55625 38382 23355
5177 23355 43427 -4217 -23958 -40157 -18551 -28937 35941 54602 36444 19491 20692 38652
5165 38652 12828 16122 24131 31387 -17629 -52305 -29297 -55864 -99892 -31593 50766 111737
5153 111737 60980 74041 59631 57643 47157 52508 71819 68597 35655 5258 9601 43749
5141 43749 10563 -42689 -78811 -35430 -7067 -27750 -34647 -6611 13756 99651 60308 52293
5129 52293 49735 50613 -12120 -10719 5176 31222 60634 64676 43051 48563 27193 80947 106083
5116 106083 74132 52670 90106 64349 -23517 -67024 -60901 -63649 -85050 -90718 -95377 -61521
5104 -61521 -14172 -5270 -15472 -38898 -18590 -14650 -10459 27208 65652 59170 54711 -4498 -46118
5091 -46118 32378 73730 96991 22169 -34736 40949 65532 -5953 7227 90559 97299 22930
5079 22930 -79474 -104310 -46305 -85708 -73703 -29679 -6084 -20512 -9881 5249 -4109 -7826
5067 -7826 55223 37325 22844 85199 69209 29453 -24100 -44269 -18713 -26279 -40185 -67211
5055 -67211 -49360 -14926 -31034 -47999 -96079 -91106 -18079 -35725 -36257 -31514 -43831 -51111 -5249
5042 -5249 12323 63978 46320 10012 657 -5029 -1244 -7661 -68387 -55570 -13215 3302 11084
5029 11084 13103 25445 12152 26054 16215 39665 46232 -18472 -30220 -33603 -4814 -56989 -96731
5016 -96731 -57678 15321 27777 31966 16577 -37233 -120526 -123279 -79991 12572 34763 48399
5004 48399 1257 -43527 -33231 -11427 -52762 -63407 27944 78697 69042 82744 59291 29186
4992 29186 -827 18377 32276 -13024 -25661 -44599 22633 84761 78985 60849 2332 11928
4980 11928 -9533 -58704 -23943 -7296 -21164 30328 39536 63868 117939 124181 51740 27376
4968 27376 42961 29550 56213 67715 19449 15149 -14505 -40854 -47263 -74687 -28088 -41223
4956 -41223 14474 6629 -9642 -21888 -70717 -100281 -76343 -13400 27923 -17118 -23290 33991
4944 33991 53284 21295 55557 70671 92613 69015 6848 10704 -16784 -23858 -5323 -31449
4932 -31449 -82063 -106967 -100430 -117646 -98864 -91160 -81526 -30043 -2130 -1748 -15148 -31058 -11810
4919 -11810 -13934 -53442 -67010 -21650 507 -6368 -28963 37339 75735 107175 111471 78417
4907 78417 9481 1168 5728 43279 45216 17782 23527 -1297 20623 -7184 -8019 -28927 -37403
4894 -37403 -5816 -51249 -126924 -99411 33155 65389 50976 74249 43295 36328 26188 -26162
4882 -26162 -24595 35223 73294 48846 -35641 -50293 -53975 -67490 -53622 21597 -38036 -40936
4870 -40936 -42128 -124394 -90795 -38911 -45366 21138 28487 4929 6388 27120 61226 44596 -28045
4857 -28045 -41414 1502 41794 28398 36974 61285 32869 26023 7346 24089 -11944 -44644
4845 -44644 -41820 -34636 10306 39681 1127 -31800 -40697 -10834 43426 74533 70950 5611 -72287
4832 -72287 -107309 -100332 -95339 -93349 -110125 -33211 63399 88024 60288 46955 71454 94656
4820 94656 39295 55818 26637 39955 22005 -12042 -18784 -26674 71739 129574 123706 49940
4808 49940 37810 -25463 -18837 -32130 -31764 -29830 -32346 -57496 40370 152904 124326 46968 27768
4795 27768 4181 -33192 -55858 -9826 34230 2877 13618 73177 93148 83239 82768 50691
4783 50691 44493 81929 75843 -611 -36447 -41686 -48666 -115400 -146641 -52256 -22503 1027 -4306
4770 -4306 -23356 -1992 13214 30539 -2472 -47182 -57801 -35968 21275 17261 -8839 -42122
4758 -42122 306 -20983 -5516 -22086 -13108 -66713 -113929 -120699 -107676 -14631 97077 99402
4746 99402 101764 56875 -8749 -2618 5191 13002 39594 48764 13827 -6975 -34551 -41278 -33788
4733 -33788 -59119 -70080 -41889 -51340 -22430 -7190 -66133 -93178 -11770 63489 7185 7132 21763
4720 21763 -30339 3974 42428 63233 20141 15770 -7617 -15248 -26806 -24977 -38774 -23352
4708 -23352 -15124 -65220 -49801 7784 52423 57060 34274 16927 37850 48827 69620 88686
4696 88686 69594 55826 4691 -17724 -23422 -26838 -64717 -70166 -87836 -107596 -99996 -59130 -11102
4683 -11102 -22611 -34325 -20363 29956 57752 39169 1490 -1660 54526 84127 94623 84867
4671 84867 100376 65217 18990 34971 29117 -47149 -21539 -4777 -29111 -24422 10041 44048
4659 44048 9528 -46524 -31476 68004 116546 74649 62654 31960 48916 6088 -10570 -13281
4647 -13281 -40765 -1573 -3975 31708 54149 14490 -16910 -46691 -60683 -118830 -169290 -135746
4635 -135746 -92672 -40829 41172 118580 147235 102526 39012 5577 -3339 -43412 -50922 -14185
4623 -14185 23727 40001 -28164 -17994 2760 65195 55379 27559 26786 17191 53072 7509 -20116
4610 -20116 14390 43885 46078 101111 103644 100757 52645 43058 69463 128502 156373 154081 148368
4597 148368 121362 91687 73343 45963 103684 79230 47191 21587 55813 93614 87083 52853
4585 52853 -28671 -40107 10650 44361 17718 -15340 -39800 -6584 -52810 -3831 -11008 -18473
4573 -18473 -19970 -44484 -79595 -81318 -84812 -40648 -49560 -45980 -10775 18512 43173 48541 33710
4560 33710 28540 50870 82275 31200 -12444 56454 94843 104979 56194 2321 3981 36220
4548 36220 72991 36498 27800 3128 2145 7421 7177 90 -3914 -52227 -68338 -8466 -18151 -10779
4534 -10779 12698 60962 61630 26456 31932 -10134 7305 60617 61784 53110 50739 77481 95537
4521 95537 -2566 -72743 -94211 -106213 -94461 -42918 8306 29566 2739 11212 -2357 18159
4509 18159 20748 42055 29864 53935 76933 42923 -9822 -1023 52350 52539 9233 -21409 2416
4496 2416 4486 -19199 -26722 37209 69956 123520 103169 62918 73287 74138 64534 103606 125849
4483 125849 50165 38179 32583 5911 4883 38684 45308 36352 55047 24598 -27421 -24859 9940
4470 9940 89540 75530 37352 34907 76199 72570 13704 -38667 13296 70812 118668 94330
4458 94330 73588 45936 722 9975 16813 37176 14392 -18096 -42707 -41903 -56535 -117769 -74757
4445 -74757 -33820 -16859 7307 39768 65820 21090 14458 -41240 -76827 -64202 -46071 -9683
4433 -9683 8435 -84968 -176601 -171549 -145897 -106483 -62311 -90787 -107255 -80921 -71646 -60801
4421 -60801 -111525 -103191 -79576 -102317 -88203 -68088 -33871 15300 56451 28922 75892 24038
4409 24038 -8415 -63363 -145102 -127815 -80301 -43310 -80952 -67737 25819 55006 -48522 -56981
4397 -56981 5340 74939 63157 67356 32365 -37530 -76499 -123486 -120079 -90874 -62485 -91534
4385 -91534 -135840 -96543 -58892 -34651 -9702 39295 13559 9620 -31960 -56273 -59053 -5725
4373 -5725 59135 79818 106344 66498 -6796 -24112 2731 31338 83078 55507 -35396 -75321
4361 -75321 -80517 -69589 -101602 -119038 -125972 -28348 29534 -44359 -59816 -62743 -59891 -86498 -23028
4348 -23028 -43671 -38495 -53134 -37483 -7982 6383 3783 49897 38603 1501 -34130 -36334
4336 -36334 -93350 -115422 -59240 -77781 -75195 -30142 -72908 -63408 -36501 5300 8862 14350 12950
4323 12950 22438 78502 97711 57065 20169 68377 26489 -50907 -13495 17937 17850 -14244 -2267
4310 -2267 13899 -49761 49682 134705 105625 110374 113872 120759 85948 42232 -52690 -62337 13690
4297 13690 31601 -15362 -51762 -11532 44118 63127 8197 -14722 23566 76813 73814 103174
4285 103174 90449 96683 46880 69445 40248 17064 25716 58999 55630 39524 74449 85793
4273 85793 114990 194802 150492 22161 14872 18345 -21340 4784 27646 -5228 -19674 -8063
4261 -8063 1923 30419 14344 12605 -51781 -92741 -103934 -80211 -37098 -57978 -24902 -7933
4249 -7933 -10619 -3845 -43800 10855 28581 57781 64271 4327 61753 16965 -60096 -51067 33628
4236 33628 15528 -22978 -70166 -110265 -56925 -68691 -68448 -34924 45382 156274 140564 29677
4224 29677 -7990 -37253 -25252 3126 59586 53933 30228 19036 -14251 -40006 -40034 -4665 25816
4211 25816 12452 -15252 -15495 -4126 13796 29568 49473 11855 28873 -3064 -40331 21431
4199 21431 -6337 33131 15471 36245 37778 -35491 -59357 -50726 -37933 -36394 -8032 19581
4187 19581 16884 11208 -15058 2730 -45532 -49951 -29943 -14765 -9870 -17058 44934 -2599 36099
4174 36099 68905 57543 96526 102543 71288 149117 136133 89482 17958 -24700 -58185 -48165
4162 -48165 -48059 -36165 14649 29063 38477 -52336 -78259 -34595 17261 29684 64944 81324
4150 81324 75984 58889 96693 103218 45529 68018 -12917 -60491 -73158 -46162 792 24037
4138 24037 -21927 -39032 -4306 73086 73856 20551 -8 14868 37777 90221 110578 91365
4126 91365 91172 78041 73787 40640 17055 55780 77050 12301 -14934 39375 9622 -89062
4114 -89062 -122090 -98159 -80243 -36452 28620 98104 113371 68590 -7703 -5997 -27410 -10634
4102 -10634 -34278 -20059 -69660 -96514 -118859 -118998 -93648 -58163 -78075 -83699 7195 34069
4090 34069 18469 2704 -3109 -2809 436 -27038 -33596 -5872 -25700 -13237 8434 55277 93532
4077 93532 54849 11926 -5424 2387 11382 -5041 5672 -43637 -38493 5275 8233 -13806 -38350
4064 -38350 -29203 -15165 -21718 -23954 43244 56949 20479 15512 23747 -10852 113 -20973 -8525
4051 -8525 16152 61683 119377 128360 78683 46080 38585 -120 4643 37165 49230 -16357 -59086
4038 -59086 -53696 -77254 -43428 -41700 -50796 1865 22080 -23507 1231 34991 21515 -26408
4026 -26408 -25923 -30575 -38128 -25027 -96687 -150315 -80094 -25425 8701 -29957 -66016 -23922 29485
4013 29485 72782 72807 23532 -4620 -43242 -68252 -67648 -74563 -15244 -25076 -99827 -105350 -23702
4000 -23702 -36368 -82031 -59659 -44406 -24275 -74696 -100507 -97301 -124627 -118428 -112829 -100549
3988 -100549 -80953 -75283 -17812 7718 30548 40741 47393 38028 3570 10001 6350 -16380 -65707
3975 -65707 -102775 -109144 -90377 -102288 -114559 -125724 -94235 -96794 -111203 -104440 -73708 -62608
3963 -62608 -46544 -4001 62266 36604 -49786 -109085 -86512 -31994 -12283 -37140 -1958 10928
3951 10928 39501 22752 53052 87069 107495 79856 73969 60645 55885 -6032 -14009 42537
3939 42537 12251 -28097 -36642 -67217 -93487 -109164 -50457 21069 -15245 3663 -17297 -24487
3927 -24487 7584 55690 40118 -21450 -78424 -55782 -41928 -42827 11840 -7530 4772 51157
3915 51157 120163 127461 39956 41230 10594 -26057 6027 -163 -14912 -3987 -45106 -20046
3903 -20046 -10582 -14508 -6371 12810 -57996 -122990 -50559 43773 33321 44621 51021 610 -27971
3890 -27971 -10043 31565 -22207 -35100 -2399 -50455 -88870 -97527 -24278 37021 60371 64532
3878 64532 11745 -16420 -55623 -70519 -62319 -9150 14461 5910 -33832 -52587 -107104 -91377
3866 -91377 -52257 -3488 40654 113977 88632 80865 89643 110145 73494 20171 39339 57782
3854 57782 25605 56062 13190 -17089 14059 24696 45842 73836 99103 114480 35207 -25588
3842 -25588 -40933 -39881 -3820 15091 39310 44585 37700 16496 47602 71127 44801 46090 -13822
3829 -13822 -63312 -51923 -38385 -14232 3153 122394 94000 32578 -28995 -3731 24524 -8838
3817 -8838 -76901 -89871 -62896 -40671 -38780 11041 53274 42472 57595 15901 -40088 -16955
3805 -16955 91139 126067 80747 34327 -19431 -1909 86060 104502 52406 21186 -7673 -1572
3793 -1572 -94784 -87274 296 -35076 -20179 7866 -1816 -13942 50176 65576 34461 -19612
3781 -19612 -25023 -15324 -47142 -35353 -23723 -42085 -59323 -41897 -26375 -28357 -50809 -18493
3769 -18493 11190 60976 17997 -18145 -50588 -38098 26250 12014 -23771 -569 -30222 -15912
3757 -15912 -76 49786 50970 7028 -39678 -35271 -71929 -133267 -165645 -106142 -75315 -91288
3745 -91288 -94220 -54476 -15293 16131 -1602 -26548 -15928 10164 14808 35174 -4805 -7643
3733 -7643 52001 71564 51523 62356 97001 148467 117604 6999 -42277 2255 54364 76361
3721 76361 115728 75513 43628 22768 -35157 -101486 -68920 47406 100029 59718 5379 -7132
3709 -7132 13272 49091 70385 10702 -31421 -73635 -85291 -91815 -57073 -83805 -90759 -95177 -79904
3696 -79904 -60571 -64975 26941 16122 6967 2995 25817 72817 72521 46516 66311 102862 71522
3683 71522 84726 137918 129778 61588 26129 59583 36694 -19011 -30745 -6875 13453 28850
3671 28850 51110 53669 101928 83589 11273 -3647 15993 -10080 -25089 -3735 56953 88608
3659 88608 104961 96224 60089 43484 43594 -3144 -18823 11897 27777 18455 47721 21807 -16712
3646 -16712 9577 65236 23037 34116 49984 40150 66731 85774 86603 83439 28902 -21291 -52243
3633 -52243 -38894 -24115 1640 24034 39430 44274 45822 13019 -6474 10525 -13441 9136
3621 9136 -15217 -34357 1710 78452 52190 76307 96115 22398 -14121 -64472 -84069 -61685
3609 -61685 -36661 -51033 -14504 -20241 -16055 60093 -18071 -88424 -66697 -88697 -84214 -67031
3597 -67031 -26109 17190 24190 6277 -61518 -105000 -114609 -111459 -61495 -61041 -22038 -30800 25935
3584 25935 58621 -27225 -125344 -112306 -48479 -15783 279 2910 -19763 5421 -8287 24612
3572 24612 63907 93719 71655 67338 69595 33461 56535 71295 38212 30035 7836 -10810
3560 -10810 -21167 -51 -5630 -24266 -6635 20561 13646 -57639 -76074 -102798 -52425 -12670
3548 -12670 -23213 -37722 3468 82583 53332 4410 22337 31572 33954 23179 -19800 -48931
3536 -48931 -28535 -6239 7936 -21267 -34301 26639 56224 65384 -15151 -43547 -21000 -44877
3524 -44877 -73569 -21200 -15289 -14059 -42040 -20158 10307 -17003 -71721 -129357 -107482 -71160
3512 -71160 -34600 -32564 5953 41402 25092 34105 8242 -36796 -57774 -36491 5178 40494
3500 40494 71506 24918 1349 -30862 -71376 -100376 -126875 -178409 -147127 -84257 -12751 2584
3488 2584 -40251 -49559 37849 24293 4411 60224 22723 39583 69022 21474 -1161 -64156
3476 -64156 -109355 -124458 -34145 23578 100655 144097 105991 78438 56087 22047 -69361 -76894
3464 -76894 7004 -1210 -54909 -84084 -140918 -163525 -119902 -113990 -141792 -156069 -118969 -82808
3452 -82808 -34938 -51628 -61146 -29594 -18980 15295 46579 38518 39766 32558 8766 20245 -3312
3439 -3312 18106 58676 87753 115712 110456 42840 26677 -6994 -62997 -77699 -96863 -110941
3427 -110941 -97122 -42000 -8686 90242 89065 49201 -19162 33804 26837 5717 5918 -54801
3415 -54801 -37021 -895 41583 52957 97385 161352 158266 126473 84751 34267 44608 55770
3403 55770 59828 38060 70882 83518 56703 32890 -3148 -62037 -60767 -24941 31330 8204
3391 8204 32157 34764 26515 81532 30541 -15469 -123 20448 -6790 14102 20849 -34061 -93760
3378 -93760 -88437 7479 -4612 -82426 -108531 -65883 2455 -7793 -40576 7401 15461 19047
3366 19047 49965 10121 11278 -41218 -111573 -92076 -46161 2681 30602 -13542 -74449 -89895
3354 -89895 -67371 -63518 -23271 -9330 11979 -743 -34566 -76816 -97864 -48271 8543 3037
3342 3037 -50911 -7585 7312 25016 49901 -5253 -7307 -46042 -74363 -32590 58882 127628
3330 127628 122955 29727 -7826 -11385 10095 62808 7165 7394 13523 5056 4088 -25284 -39139
3317 -39139 -72190 -148268 -47078 -50703 -80606 -23006 -36473 -45727 -27972 -24222 26831 67506
3305 67506 138706 136821 39476 -39139 -54751 -33506 589 -22859 -56325 -26064 -32293 -76326
3293 -76326 -33737 -26686 -27059 74725 97812 68136 -8053 -48885 -65684 -45957 -18038 27460
3281 27460 90037 54741 20041 28344 75947 94802 117988 115811 47192 5880 69599 98613
3269 98613 96717 49191 44853 -40556 -25996 -76583 -46907 -20072 -37676 17203 73839 14416
3257 14416 8646 -4132 38841 19947 -18565 -123192 -188242 -195793 -95011 -10985 -11715 -614
3245 -614 27718 -5076 15973 -14799 55812 27284 43559 63208 76508 11769 -18391 -69643
3233 -69643 -40293 7124 60086 44715 52609 72774 55237 105371 36923 60372 107642 42129
3221 42129 -9297 14662 -32479 -86620 -75467 -72302 -2444 31830 30728 59435 50533 2041
3209 2041 19290 27 16357 3104 -7678 -15395 -11238 48530 4095 -23317 -21926 -52283 -84903
3196 -84903 -71195 -64906 -35130 49471 96179 18755 -10436 -40454 -20810 22753 49144 -2895
3184 -2895 -53675 -74769 -96327 -121984 -80128 -4366 40165 40151 -1232 17701 71203 82082 33105
3171 33105 31483 1249 -2104 8390 18898 10780 14899 -13542 22327 98640 47307 17815 23525
3158 23525 -3239 -50361 -18169 -30193 -70534 -101209 -120717 -85969 -83547 -59898 -51444 -31496
3146 -31496 -10127 18581 25905 31680 46935 -29593 -36286 -9437 -15703 -37526 5540 6133 -24261
3133 -24261 -47063 -30653 10802 -28806 -6000 1052 21655 44787 -17047 -47827 -31026 -32729
3121 -32729 18844 -12143 -19715 -8131 33350 51885 42478 71966 36362 -25726 -41715 9837
3109 9837 24882 35048 -16533 -19971 11714 7552 -67228 -95865 -69591 -52540 -69933 -22498
3097 -22498 37454 21667 -136280 -187370 -170345 -123229 -96154 -68096 -30831 2970 23836 44997
3085 44997 15945 -17820 -32180 -52665 -1954 25012 30245 11965 -13748 14847 44733 37317
3073 37317 35307 79318 100285 101634 58547 52423 66758 66464 42834 -21175 -39369 -5594 36105
3060 36105 61298 17475 -2779 31695 21274 9057 116907 74765 -17454 -44864 -72745 -72559
3048 -72559 -151476 -66984 -6009 43794 74067 61176 -36466 -36901 2363 18443 74245 75786
3036 75786 98525 36375 42654 81745 88609 86722 76433 61085 32041 -36261 10598 4636 -23636
3023 -23636 39765 57023 9403 -34022 -79870 -135115 -150854 -95480 -27636 -3756 -941 -123041
3011 -123041 -231083 -164635 -162983 -156925 -157227 -163150 -131118 -82038 14194 35103 21308 25680 32338
2998 32338 -7078 -50991 -42545 -773 17551 -32056 -37336 -27920 -27077 -38042 7612 20090 2258
2985 2258 56671 70899 98511 37339 7175 -54220 -67885 -51701 47495 28724 -35755 -28059
2973 -28059 -71868 -131021 -142721 -92850 -64387 -279 13207 -7842 -19556 -50494 -12983 6103
2961 6103 -14 5456 -52879 -57410 7009 71052 4978 -48902 -84221 -122627 -144294 -146040 -136366
2948 -136366 -137563 -80980 -57967 -5467 42472 41858 16288 8465 11298 20232 39238 82226 111155
2935 111155 87947 21750 -47234 -75802 -48422 -11285 481 36953 126581 185862 131211 60443
2923 60443 12929 42783 24072 -2551 10597 219 -83135 -111739 -64135 6176 10453 -40648
2911 -40648 -121518 -114654 -120313 -102194 -52291 -7822 37445 -29921 -52582 -86747 -65147 -39608
2899 -39608 -744 6165 -9051 -41110 -71253 -39784 28379 38502 53266 46510 39993 111201
2887 111201 83215 14339 -63434 -57866 -20204 -46096 -50919 -1676 3125 13228 -6525 -10594
2875 -10594 -2028 -31322 14107 54459 98116 18127 26172 72124 -2361 -75215 -50311 -50607 -28535
2862 -28535 30540 43230 -1870 41616 46162 30990 -22574 -21507 20436 -60042 -118248 -88360
2850 -88360 -83371 -61076 -40112 -93179 -126192 -112838 -115884 -103697 -55312 -104984 -69422 -46273
2838 -46273 -14866 -24699 -72223 -111097 -159517 -193221 -144711 -86290 -31310 -52894 -85197 -7758
2826 -7758 18250 31928 30640 -14178 -62469 -6064 4936 -53787 -50477 23675 44095 -10228
2814 -10228 6122 7199 -13981 -29623 9866 6388 -2132 1103 -15197 -17449 -3159 26374 -1883
2801 -1883 -48635 -47524 -24048 -55842 -75008 -71623 -60213 -34858 -6458 -43727 -44519 -19199 -35500
2788 -35500 18522 71967 37091 38439 -5285 20569 17142 28028 38446 68971 108780 91834
2776 91834 110928 59631 -1788 10511 -31748 -29299 13779 48476 58542 88668 116649 150295
2764 150295 65657 16702 20493 -14600 11835 200 28286 57230 60304 7996 -12946 5550
2752 5550 74137 91836 51618 1050 -18783 -5758 -8826 13512 2296 -29311 -28526 15919 11911
2739 11911 53245 12611 -14838 931 -14001 -39074 -68267 -41094 17235 41928 26298 12733
2727 12733 -44507 -58102 -40734 -26817 -23661 -55921 -59698 19296 116073 109675 90040 78109
2715 78109 121051 121816 48814 28799 31503 102846 112938 111837 59053 103250 60730 44608 41605
2702 41605 27312 -27135 10283 -10865 -26883 -32679 -14881 2867 -13532 -25801 -97709 -80585
2690 -80585 -42048 -44425 10146 -874 -24088 3544 -158 859 -73092 -103045 -95431 -77971 -90291
2677 -90291 -132682 -88312 -24720 -33557 -41943 -80921 -46647 -6653 47334 47383 -1712 -64036 -43152
2664 -43152 32681 7633 -65846 -71548 -31882 3784 5019 -28962 -36469 5362 2514 -50309 -10888
2651 -10888 -4783 24751 65330 116118 90187 30388 -36380 -12194 15271 -56221 -61465 -29681
2639 -29681 -39984 -50598 -51339 -28498 42105 64180 -51565 -122936 -86428 -57312 -24271 71757
2627 71757 126991 69537 -19357 65339 56881 3809 -40583 41243 67603 35318 89072 122860
2615 122860 49054 -39263 -22725 -11854 -10561 -4886 9181 -3487 -9139 15789 -30085 -50625
2603 -50625 -43301 -19187 -47060 -88961 -2892 31483 13904 -35464 -19871 -11195 5889 -60198
2591 -60198 -125148 -107750 -67170 -51299 -7090 3921 -17976 -18122 -26191 -68846 -98909 -96301 -117194
2578 -117194 -103534 -74988 -25401 -5324 62442 54298 27924 -29976 11906 59335 27692 15254
2566 15254 3372 33870 62826 75925 26096 8205 48337 77677 79989 61353 29377 19042
2554 19042 33877 20362 51199 54428 19645 -38123 -31167 28989 57074 51124 -35462 -78313
2542 -78313 -119784 -75167 -44360 -47637 -51507 -29137 -68531 -50573 -40040 -60691 -67401 15796
2530 15796 10668 -35186 -16169 -18396 -13950 -47910 -143472 -140417 -143482 -141808 -156961 -132215 -73752
2517 -73752 27096 51943 38882 52735 41925 7983 68351 86099 98496 58141 10921 -38921
2505 -38921 -24920 -27363 -24778 -59558 -11343 42140 37791 12669 -9734 -14945 -40533 -81768 -98659
2492 -98659 -55449 -36632 -10319 51665 66019 26692 -13317 202 14453 7845 9892 4493
2480 4493 4748 27488 42448 28721 31743 64628 91874 57079 -3562 4416 66320 75972 -11168
2467 -11168 30913 6264 13499 59461 94716 122294 65439 66688 48898 19087 -19875 14864
2455 14864 27473 28617 41686 14562 34822 80332 64131 87081 96450 23223 -23370 -52926
2443 -52926 -92268 -97262 -79167 -38622 -15936 -619 -21600 -34188 -59951 -54020 -81187 -94345
2431 -94345 -120380 -138642 -61430 18592 26312 -9709 -17247 -8344 -22003 -62191 -70408 -53499 15868
2418 15868 -49423 -86409 -113983 -139932 -21232 2677 -109310 -155461 -84543 -52391 -42485 -29871
2406 -29871 -20462 -20396 4173 38327 4684 -32537 -58247 -95605 -108849 -106578 -120763 -87299 -9751
2393 -9751 43021 78234 121912 99898 7218 40007 96262 48567 51883 20295 -29909 -40449
2381 -40449 -58660 -109151 -150994 -88395 -13123 60665 99658 78308 100909 126944 61899 34329
2369 34329 -12834 -46822 -28499 -13990 34782 30094 35102 41498 60862 26203 -74912 -145067
2357 -145067 -131564 -62634 -55417 -4470 11311 36752 13219 28857 14675 -43871 -65752 -88537
2345 -88537 -43753 445 -26181 -65908 -109971 -56798 -30726 -11665 28574 52029 37894 16680
2333 16680 -13185 2571 61675 25275 -27927 -5979 54898 55630 38850 78970 35978 20722
2321 20722 20981 1489 -36528 -22814 2264 63746 76823 51260 60273 31442 -30205 -24137 -8438
2308 -8438 -37532 -5671 51856 151741 107280 75798 95660 101633 83754 101939 99324 93879 117488
2295 117488 46532 -26890 13412 4320 -67701 -79088 -6127 72713 39739 27892 62860 99721
2283 99721 9258 -65530 -49963 -1876 18648 54986 26396 -3568 7464 -9829 33079 25747
2271 25747 55134 55985 5077 -12932 28567 14520 14789 87142 100558 89848 77684 22491 17640
2258 17640 53572 91417 23208 10453 46833 64133 64933 4970 -37339 -6757 16526 27064
2246 27064 -20724 -75374 -47284 -83549 -32130 6445 20205 20150 -9243 -63904 -121767 -145604
2234 -145604 -183660 -122381 -28052 6295 13799 -62783 -65676 -56967 50529 85718 69527 53382
2222 53382 26216 -26703 -52558 -4668 12884 84760 109511 71679 72971 101970 45504 -43299
2210 -43299 -85383 -30249 -19113 -47438 -11817 99837 93560 28725 -29344 -38566 -34778 -2656
2198 -2656 12688 75974 59367 -14851 -17053 23899 10299 11880 -16051 -31986 -56263 -20484
2186 -20484 -19461 -7507 28876 38619 85378 95674 53978 103531 87504 46833 64190 79900
2174 79900 90514 23879 4166 38095 33019 1459 -46853 -88220 -60243 -7862 11536 -22471
2162 -22471 -24159 -1521 -35800 -83513 -37614 -30880 -94167 -95226 -5331 -36291 -70348 -54292
2150 -54292 -57295 -3460 69952 125140 120336 117108 98590 102070 101205 108802 65480 -22891 -36465
2137 -36465 -53931 -19712 -12996 15166 47996 53367 26691 67742 62582 51617 73722 54546
2125 54546 -6090 -5358 -403 -13471 33655 110014 67491 15230 -2608 30239 129213 165076
2113 165076 165909 101414 37866 17255 29349 -5939 -11934 1063 5953 -31412 -30052 40308 54650
2100 54650 94503 103913 56310 31101 -35030 -48857 -61461 -111881 -92918 -120034 -47281 3955
2088 3955 -11106 -7846 36993 47901 71460 154204 211879 177398 93837 26342 -22810 -15953
2076 -15953 -6693 -32950 -25114 -33604 -75796 -101289 -125769 -96735 -80560 -70959 -92007 -89863 -35690
2063 -35690 -59893 -61821 8276 23795 -11052 -38103 -7632 48786 72523 13183 -70997 -40793
2051 -40793 -54384 -57299 -35156 32600 46468 43586 -26987 -83447 -130107 -131328 -115095 -113484 -75420
2038 -75420 -10332 -10020 -31627 -32798 -86202 -79941 -106372 -85339 -17034 25815 -3933 -32242 -69503
2025 -69503 -27559 36369 71376 60561 33016 41600 4734 6280 58460 61370 30400 6161
2013 6161 19808 56643 61774 4950 8253 44535 22571 24820 11589 -18185 -35593 -49829 -44613
2000 -44613 -26878 -36069 -1959 16298 -16180 -13132 22715 80389 58427 -31270 -91086 -64484
1988 -64484 -59772 -68157 -101960 -113426 -77738 -68840 -31030 -47 19115 67874 11878 -14021
1976 -14021 -69091 -43114 31155 3716 5918 58569 50739 60668 85205 25805 8065 -26794
1964 -26794 -51944 -74037 -31322 5563 22382 64720 91968 82097 38225 17096 14822 27839
1952 27839 50534 85795 87148 67675 53073 76936 100535 71820 54347 2945 15551 63213
1940 63213 128216 79878 -2420 -32540 -50250 -58563 -47417 -56773 -1827 31836 49101 15544
1928 15544 -16225 -39459 -93740 -67184 36460 57740 47203 45061 -6198 -75018 -55522 21658
1916 21658 51821 -13532 -58376 -48818 -82891 -89731 -58547 -46850 -23233 -29002 6626 47014
1904 47014 26085 -10705 -4059 -8031 -45470 -16207 7935 14471 773 -77357 -135722 -170853
1892 -170853 -188425 -145322 -79516 -58130 -41216 -20012 21079 -11877 -50804 -35338 30374 56298
1880 56298 30864 89398 75174 63638 31436 -28372 -49667 -3083 5813 27270 -28885 -27485
1868 -27485 -19554 4657 -17033 -18304 25887 46880 80073 67196 25471 62801 47232 59124
1856 59124 118863 91389 61365 47064 80618 114521 46794 -71015 -150635 -89580 2965 30323
1844 30323 11853 23068 32803 60530 28595 -22232 -15772 910 4767 -43386 -112886 -38835
1832 -38835 -35699 -11121 40603 56162 56302 27259 5601 -20217 -26918 -52572 -1937 72298 71555
1819 71555 4945 7943 37459 41490 49469 43332 70802 33411 -22433 -39701 -42711 -58974 -34555
1806 -34555 -28301 -12416 -4302 -59321 -76531 -3524 25325 -25065 -50541 -23741 11754 7963
1794 7963 -54557 -58004 -42521 -78905 -50480 39839 56223 42564 57750 85548 25197 12918
1782 12918 36683 77250 126531 95795 52507 5834 -14401 7768 -313 24906 -4183 -25742
1770 -25742 13764 11743 -36315 -40075 -23826 -2395 62481 131978 103153 75973 83049 76278 26114
1757 26114 8086 22674 1663 -17999 16853 45114 59125 81864 47565 6276 52685 76440
1745 76440 86267 112133 73671 64578 32359 9819 11022 51512 50215 8799 1728 33765 35009
1732 35009 29267 26217 28171 67214 97042 95180 65143 41605 39056 18746 98459 120519 33448
1719 33448 -14708 -20283 26474 74400 58722 -2154 -60237 -63051 -54309 -60052 -42125 -67631 -40620
1706 -40620 -40417 19697 47531 6450 -22560 -10317 22590 90574 96667 98050 110815 84694 55569
1693 55569 -1054 -8556 49419 13634 -46055 8987 -30485 -13757 -17971 -70114 -129489 -136613
1681 -136613 -140095 -97929 -16876 -37096 -80824 -59453 -129450 -120096 -116537 -112662 -85688 -84655 -53761
1668 -53761 -16449 31400 55417 31447 38075 37052 -25135 -122885 -11068 97713 110085 101767
1656 101767 76310 93783 66371 -8760 -78240 -90183 -47059 3943 40667 14923 -43213 -40286
1644 -40286 -14906 229 1795 18979 -20432 -30111 -41927 -54359 -19895 48163 39937 13328
1632 13328 -432 -56144 -35950 55867 92616 26927 -7812 -10087 -43384 -40581 -26331 61028
1620 61028 33699 -11977 462 -5802 13784 -37119 -13976 -26146 -17799 -52435 -97146 -101450
1608 -101450 -83715 -119208 -105490 -56925 -37914 -73291 -96948 -117376 -127458 -94023 -120422 -123623
1596 -123623 -80353 -35997 54884 63820 27472 25880 76782 96256 83934 69886 -25473 -96134
1584 -96134 -84944 -44406 -55400 -47741 -78394 -42400 -24359 20422 11773 -15594 -12224 18473
1572 18473 30912 78962 129785 113562 29210 12530 33147 35339 14539 -24720 -58293 -41981
1560 -41981 2950 7936 -41047 -11126 -68858 -65985 -8362 -17884 -78850 18 92553 129401
1548 129401 96486 88093 50492 21737 12950 62031 49469 40125 4353 -68119 -113297 -80576
1536 -80576 -47059 9589 42781 52623 61391 88376 93954 59440 44460 12352 3939 6437 45252
1523 45252 13607 -50698 -13151 27122 94567 139647 84767 34017 57153 79865 11749 3767
1511 3767 42153 -13598 -19272 16305 30894 55697 72769 47883 14910 -15947 -27261 -28421
1499 -28421 -55753 -95902 -50397 13583 82440 89594 3496 -31242 7230 31304 30664 11947
1487 11947 -33784 -71458 -103077 -91190 -10484 89597 67740 -43519 -36306 48143 76622 53749
1475 53749 51733 -16739 -56913 -43956 25760 93049 49323 71705 82261 59128 14494 3967
1463 3967 -13197 -21263 -35553 -56366 -122263 -127790 -115378 -49726 -25745 -13063 25935 12899
1451 12899 28807 -10163 -12041 -395 35499 54354 32998 -37396 -39069 -13870 51845 108966
1439 108966 128566 121585 99985 65705 62306 84414 42426 52153 55676 17625 32676 74250
1427 74250 69107 23321 -16295 -22218 -70591 -48526 3652 19026 2369 -28518 -86257 -75577
1415 -75577 -24769 34609 98113 134504 151888 78124 73115 46149 65141 66355 49124 47819
1403 47819 47875 87301 66896 103641 95335 91375 93195 99134 43613 3404 6669 44413 80369
1390 80369 116803 109940 68538 23552 -1588 -38280 -96182 -94266 -71799 -37446 38549 53780
1378 53780 87861 52397 54989 70762 74030 47202 96353 107417 104026 76294 17905 -21427
1366 -21427 -64474 -26458 53617 121609 109110 35375 -43281 -14645 22052 18090 -25048 -73680
1354 -73680 -43307 -33579 -31244 -84220 -27423 22027 -1638 -80683 -73066 -31711 -40774 -4895 13304
1341 13304 14295 -57032 -75220 -56401 -75056 -5253 23037 -47142 -83738 -24053 -3391 -27916
1329 -27916 -28397 -32736 -62095 -86561 -70425 -25558 4585 -53338 -36372 12210 46495 46064 43744
1316 43744 42731 -15677 -77112 -42232 -46759 -64478 -97402 -130064 -103353 -78916 -14764 14256
1304 14256 28014 -27363 -19873 -15835 -20648 -10313 -47691 -38588 -14220 -17149 -2356 33496 -18270
1291 -18270 -26816 -42635 -41216 -105193 -86913 -31263 31467 60927 -5676 -43081 -33686 -33705 -20456
1278 -20456 55736 12581 -39025 -33216 -40238 4756 12493 40183 64920 10786 28466 9307
1266 9307 -14650 -58345 -47965 5822 14976 30013 18797 -34171 -30965 -15297 -13369 -39823 -20821
1253 -20821 3906 -17002 -25060 -31786 10409 61671 1340 -36547 26263 46795 39876 25056
1241 25056 -901 15203 15137 38626 39052 14473 35100 28987 43879 26441 -7396 -34041 -57520
1228 -57520 -68484 -24179 -3428 -71650 -83274 -36546 -2088 25613 52823 -20973 -22736 6801
1216 6801 42 -13329 38299 47729 10765 67184 22050 -26186 -5205 39943 59619 19001
1204 19001 18433 4451 -8372 35385 16051 23002 4151 -8089 18602 34158 38282 863 -10943
1191 -10943 20420 25439 54234 66465 30306 -6191 -29124 -32228 13617 -31672 -10587 7210
1179 7210 24902 45736 37045 40923 47209 35819 37092 81627 32430 -33530 -50218 -9448 -27591
1166 -27591 -25782 -30578 -10760 14112 13678 -25263 -73531 -78383 -31952 -9942 -6403 33186 6175
1153 6175 59541 37816 -18036 -39803 -42794 -64979 -35381 -15930 -8065 -35985 -31188 12870 40124
1140 40124 48504 38398 6015 -77475 -54044 12964 40866 -13963 -68676 -62425 -96998 -71833
1128 -71833 -62921 -89733 -93273 -74285 -55683 -28910 10595 -8640 -42111 -7221 -13773 -42254
1116 -42254 -3939 -1758 -46152 -66784 -42238 14525 8788 -26918 -79692 -61390 -68117 -95194
1104 -95194 -119743 -65849 18516 47346 34047 8764 52426 32535 -52974 -84664 -49704 9275
1092 9275 29222 16304 42404 22429 42719 49131 69702 20418 -8196 2315 44487 91033
1080 91033 67334 44840 50596 43900 -29677 -74538 -10809 81772 116113 58117 -11879 -14394
1068 -14394 2209 971 28529 100884 140491 124865 127563 83090 23772 -44909 -89270 -72672
1056 -72672 -70751 -44923 -35078 -6600 34291 104504 139122 127386 110537 142980 71789 -9467
1044 -9467 -57726 -30199 -13302 -64026 -53767 7597 32063 20578 13905 30595 22803 -46198
1032 -46198 -90839 -122770 -76610 -85737 -67143 -86922 -50965 -21030 17852 -35656 -683 9441
1020 9441 -3858 8969 -14358 -99458 -68432 -39204 1760 8789 -77944 -85202 -62607 -47245
1008 -47245 -8004 34578 26510 -31445 -20555 16187 36646 23084 63056 84108 70879 10058
996 10058 10982 14913 31529 210 -9442 10146 66012 57964 -3646 -72881 -71141 -15007 -14702 18871
982 18871 34750 48046 98600 111390 91899 61379 -14274 31955 58100 90172 60879 23167
970 23167 -25244 -28904 381 60684 107391 102690 79238 4008 -33994 -18968 -21701 -69084 -56303
957 -56303 -45421 29282 64264 73662 67927 46449 24009 -21284 -18344 40848 35073 -5415 24338
944 24338 36607 37080 6849 6071 -17018 -28955 2258 -32685 -83818 -29385 15591 -24094 -58612
931 -58612 -35396 -30243 -49792 -4624 4510 5097 9977 -5838 -1274 25886 13992 33458 -10987
918 -10987 -73853 -98983 -97439 -99962 -37451 48274 34091 -16923 -3519 31486 20084 30241
906 30241 74433 61274 26566 6742 -15069 -15857 -7602 15511 66935 30190 -36932 -57792 -21449
893 -21449 33869 -5451 -6948 10324 -15392 -16686 10095 -45397 -59415 -2179 -6663 -32787 -13506
880 -13506 20017 39048 43823 3990 -9401 -62277 -74928 -37368 1230 17340 -1466 13170
868 13170 -17403 -1400 27642 66603 137659 104384 62827 81094 80136 48524 45923 62388 16720
855 16720 -24230 -38265 -17291 22383 20967 -8793 57223 87225 86106 64191 1576 -10142
843 -10142 -9326 -42699 -96909 -24176 39790 -9766 -88306 -84708 -44052 -24784 -30387 496 29168
830 29168 954 -5244 12217 27332 -29775 -55263 -3242 25099 17757 -16116 -48071 -33125
818 -33125 -22962 -75714 -61992 -75888 -101199 -65835 -53877 -53061 -57542 -69856 -70545 -61712 -42779
805 -42779 36616 -18096 -8516 -14087 28131 73364 888 -26392 -75160 -108979 -82635 -29006
793 -29006 19378 6320 6877 29774 20318 -38155 -72182 -52690 -106345 -84598 -89791 -91411 -106163
780 -106163 -103536 -49305 -26909 -31411 -53614 -30307 -5865 8304 86939 113648 41914 -5147
768 -5147 -63816 -34047 34544 15239 8286 915 7396 -32938 9991 40082 47599 62487 91630
755 91630 102645 75465 85637 124026 50900 -48231 -59390 -54924 -46894 -47885 -38781 -1009 -3074
742 -3074 15029 44607 43468 -3136 39062 43111 121395 128031 59893 54811 29553 34128 -36844
729 -36844 -29321 -3849 27218 15521 37970 33410 28094 20772 8912 2002 51743 52324 47652 64378
715 64378 71434 43182 -27943 -115490 -135700 -30542 14075 -28228 -49485 -34323 -36869 -63220
703 -63220 -41850 -16694 -62553 -19060 -143 -34340 -19530 19698 4323 -52273 -91541 -35131
691 -35131 21 25787 35160 8535 -52029 -17375 -9561 -29153 -73499 -86922 -113542 -85380
679 -85380 -20979 24000 -9886 -64704 -110911 -76845 -43949 -47480 -17215 4837 -46866 -33036
667 -33036 14557 42561 -18349 1767 24728 -4951 -42417 -48603 -23109 -44718 -51266 -33073
655 -33073 -47295 -89817 -97634 -84461 -76199 -6426 36467 42221 -4044 -18522 -4282 -54770 -18144
642 -18144 -927 -21888 -86530 -66843 -26433 -13237 1229 -38376 -83263 -84361 -49334 -54686
630 -54686 -2665 20064 14037 9618 -16568 10949 11961 17173 31800 23196 1267 -13045 -58690
617 -58690 -54674 -57967 -45049 -30936 -117093 -161338 -131986 -25459 -57067 -66698 -20311 -31501
605 -31501 -73836 -94466 -53582 -13795 -4147 13503 24902 3637 -23107 6177 -45277 -97966
593 -97966 -58594 -605 -5826 -29327 -60425 -141461 -137320 -79892 -62200 -80808 -53694 -21579
581 -21579 68734 66920 -55460 -120718 -104734 -32382 84627 62413 11654 -8999 -64338 -109984
569 -109984 -100073 -50213 -31725 23129 86336 20770 47306 19886 -38221 15212 23592 -21497
557 -21497 -8292 44452 29422 47725 38236 -16250 -61401 -83804 -68707 -54871 -31696 -40682
545 -40682 -43271 27004 27819 23114 -26195 -2856 47912 39442 44690 69200 87673 77807 -3956
532 -3956 -11598 21822 43847 12721 -40333 2837 -10456 -59988 -77632 -50540 -53347 -51503 -28644
519 -28644 22071 43663 -44142 -57445 -47126 -56312 -80848 -124851 -117226 -69779 -4674 37789
507 37789 6611 -29008 -45314 -22748 25268 37980 -19278 24469 32617 8592 4825 -4243 -31010
494 -31010 -44227 -27161 41726 -938 -55970 -32989 15588 19559 -21280 -113152 -122819 -106832
482 -106832 -116906 -67164 33654 12356 -17669 -3950 -23410 -9996 -25332 -59609 -13383 -10448
470 -10448 59069 139155 118634 70209 92028 24393 -38913 -52844 -14728 19225 19828 -571
458 -571 16764 -15532 6831 -4710 9436 -23455 -39768 10543 61108 497 -5976 -6399 -35404
445 -35404 -37545 -16395 6554 42085 67576 3659 10530 -27695 -41328 -64190 -62914 -36383 -37967
432 -37967 -104882 -130582 -98065 -82580 -74107 -92348 -101458 -170239 -160737 -110946 -66118 -43043 -17132
419 -17132 -43460 41369 96666 76740 89279 68550 37421 46217 24264 -17678 -27444 -28887 -33244
406 -33244 -103566 -141223 -54153 4241 -17442 -63225 -79707 -17368 20975 442 60367 78535
394 78535 56006 81550 69710 21843 23476 6394 16278 33519 36364 15669 34306 58701 72049
381 72049 28548 18892 -16065 10259 -1556 23787 10346 -37008 -88668 -58179 13523 35025
369 35025 1772 -27671 12969 22491 -4064 17531 7464 -16295 -67412 -83089 -74434 -22468
$$ [...]
##END NTUPLES=NMR SPECTRUM
##END=
