##TITLE=Analysis number 313989
Compound Code mo 00859
Book Reference 439/67/20
Project Code adrs
Chemist Name ronp
##JCAMPDX= 6.0         $$ Bruker NMR JCAMP-DX V2.0
##DATA TYPE= NMR SPECTRUM
##DATA CLASS= NTUPLES
##ORIGIN= Bruker BioSpin GmbH
##OWNER= NMR
$$ XWIN-NMR		Version 3.5
$$ Fri Sep 30 14:12:36 2005 GMT Daylight Time (UT+1h)  MAYBRIDGE\NMR@NMR_250MHZ
##.OBSERVE FREQUENCY= 250.131544655141
##.OBSERVE NUCLEUS= ^1H
##.ACQUISITION MODE= SIMULTANEOUS (DQD)
##.ACQUISITION SCHEME= undefined
##.AVERAGES= 16
##.DIGITISER RES= 18
##SPECTROMETER/DATA SYSTEM= dpx250
##.PULSE SEQUENCE= zg30
##.SOLVENT NAME= CDCl3
##.SHIFT REFERENCE= (INTERNAL, CDCl3, 0, 16.4494)
##AUDIT TRAIL= $$ (NUMBER, WHEN, WHO, WHERE, WHAT)
$$ ##TITLE= Audit trail, XWIN-NMR		Version 3.5
$$ ##JCAMPDX= 5.01
$$ ##ORIGIN= Bruker BioSpin GmbH
$$ ##OWNER= NMR
$$ C:\u/data/dgb/nmr/ADRS/10140/pdata/1/auditp.txt
$$ ##AUDIT TRAIL=  $$ (NUMBER, WHEN, WHO, WHERE, WHAT)
(   1,<2005-09-30 14:12:17.46 +100>,<MAYBRIDGE\NMR>,<NMR_250MHZ>,
      <created by zg, POWCHK disabled, PULCHK disabled
       configuration hash MD5:
       62 19 C7 07 E1 42 D1 B7 37 6C 3D D0 77 39 F9 E6
       data hash MD5: 64K
       D6 9A E6 3E D0 AA 82 11 E3 7B 38 03 88 31 FA C5>)
(   2,<2005-09-30 14:12:28.34 +100>,<MAYBRIDGE\NMR>,<NMR_250MHZ>,
      <Start of raw data processing
       ef LB = 0.3 FT_mod = 6 PKNL = 1 SI = 32K 
       data hash MD5: 32K
       12 09 7D 07 FC A3 3F 22 F4 05 0F EB D2 80 CE FE>)
(   3,<2005-09-30 14:12:30.02 +100>,<MAYBRIDGE\NMR>,<NMR_250MHZ>,
      <apk 
       data hash MD5: 32K
       10 3A A8 CE 90 72 EE 29 E4 97 B5 C9 4C 48 55 C3>)
(   4,<2005-09-30 14:12:30.70 +100>,<MAYBRIDGE\NMR>,<NMR_250MHZ>,
      <abs ABSG = 5 
       data hash MD5: 32K
       C8 CC 3A 20 C5 BA 82 71 5A A1 5E D0 EF 99 5B A9>)
$$ ##END=
$$ 
$$ hash MD5
$$ 9C 38 6B 01 98 93 8F 6F 45 23 91 6D CF 7A 8C 7F
##$RELAX= 
##$RELAX= 
##$RELAX= 
##$RELAX= 
##$RELAX= 
##$RELAX= 
##$RELAX= 
$$ Bruker specific parameters
$$ --------------------------
##$DU= <C:\u>
##$EXPNO= 10140
##$NAME= <ADRS>
##$PROCNO= 1
##$TYPE= <nmr>
##$USER= <dgb>
##$AMP= (0..31)
100 100 100 100 100 100 100 100 100 100 100 100 100 100 100 100 100 100 
100 100 100 100 100 100 100 100 100 100 100 100 100 100 
##$AQSEQ= 0
##$AQ_mod= 3
##$AUNM= <au_zg>
##$AUTOPOS= <50 >
##$BF1= 250.13
##$BF2= 250.13
##$BF3= 250.13
##$BF4= 250.13
##$BF5= 500.13
##$BF6= 500.13
##$BF7= 500.13
##$BF8= 500.13
##$BYTORDA= 1
##$CFDGTYP= 0
##$CFRGTYP= 5
##$CHEMSTR= <none>
##$CNST= (0..31)
1 1 145 1 1 1 1 1 1 1 1 1 1 1 1 1 1 1 1 1 1 1 1 1 1 1 1 1 1 1 1 1 
##$CPDPRG= <>
##$CPDPRG1= <>
##$CPDPRG2= <>
##$CPDPRG3= <>
##$CPDPRG4= <mlev>
##$CPDPRG5= <mlev>
##$CPDPRG6= <mlev>
##$CPDPRG7= <mlev>
##$CPDPRG8= <mlev>
##$CPDPRGB= <>
##$CPDPRGT= <>
##$D= (0..31)
0 1 0 0 0 0 0 0 0 0.06 0 0 0 0 0 0 0.0002 0 0 0 0 0 0 0 0 0 0 0 0 0 0 
0 
##$DATE= 1128085936
##$DBL= (0..7)
120 120 120 120 120 120 120 120 
##$DBP= (0..7)
150 150 150 150 150 150 150 150 
##$DBP07= 0
##$DBPNAM0= <>
##$DBPNAM1= <>
$$ [...]
##$SUBNAM7= <"">
##$SUBNAM8= <"">
##$SUBNAM9= <"">
##$SW= 20.6930455092707
##$SWIBOX= (0..15)
0 0 3 0 0 0 0 0 0 0 0 0 0 0 0 0 
##$SW_h= 5175.983436853
##$TD= 65536
##$TD0= 1
##$TE= 295.16
##$TE2= 300
##$TE3= 300
##$TEG= 300
##$TL= (0..7)
0 120 120 120 120 120 120 120 
##$TP= (0..7)
150 150 150 150 150 150 150 150 
##$TP07= 0
##$TPNAME0= <>
##$TPNAME1= <>
##$TPNAME2= <>
##$TPNAME3= <>
##$TPNAME4= <>
##$TPNAME5= <>
##$TPNAME6= <>
##$TPNAME7= <>
##$TPOAL= (0..7)
0.5 0.5 0.5 0.5 0.5 0.5 0.5 0.5 
##$TPOFFS= (0..7)
0 0 0 0 0 0 0 0 
##$TUNHIN= 0
##$TUNHOUT= 0
##$TUNXOUT= 0
##$USERA1= <user>
##$USERA2= <user>
##$USERA3= <user>
##$USERA4= <user>
##$USERA5= <user>
##$V9= 5
##$VALIST= <valist>
##$VCLIST= <CCCCCCCCCCCCCCC>
##$VD= 0
##$VDLIST= <DDDDDDDDDDDDDDD>
##$VPLIST= <PPPPPPPPPPPPPPP>
##$VTLIST= <TTTTTTTTTTTTTTT>
##$WBST= 1024
##$WBSW= 4
##$XGAIN= (0..3)
0 0 0 0 
##$XL= 0
##$YL= 0
##$YMAX_a= 348849
##$YMIN_a= -313941
##$ZGOPTNS= <>
##$ZL1= 120
##$ZL2= 120
##$ZL3= 120
##$ZL4= 120
##$ABSF1= 16.44937
##$ABSF2= -4.243803
##$ABSG= 5
##$ABSL= 3
##$ALPHA= 0
##$AQORDER= 0
##$ASSFAC= 0
##$ASSFACI= 0
##$ASSFACX= 0
##$ASSWID= 0
##$AUNMP= <proc_1d>
##$AZFE= 0.1
##$AZFW= 0.1
##$BCFW= 0
##$BC_mod= 0
##$BYTORDP= 0
##$COROFFS= 0
##$CY= 12.5
##$DATMOD= 1
##$DC= 0
##$DFILT= <>
##$DTYPP= 0
##$F1P= 14.0000005364418
##$F2P= -0.99999901652339
##$FCOR= 0.5
##$FTSIZE= 32768
##$FT_mod= 6
##$GAMMA= 0
##$GB= 0
##$INTBC= 1
##$INTSCL= 1
##$ISEN= 128
##$LB= 0.3
##$LEV0= 0
##$LPBIN= 0
##$MAXI= 10000
##$MC2= 0
##$MEAN= 0
##$ME_mod= 0
##$MI= 0
##$NCOEF= 0
##$NC_proc= -3
##$NLEV= 6
##$NOISF1= 0
##$NOISF2= 0
##$NSP= 0
##$NTH_PI= 0
##$NZP= 0
##$OFFSET= 16.44937
##$PC= 1
##$PHC0= -58.96444
##$PHC1= 5.44044
##$PH_mod= 1
##$PKNL= yes
##$PPARMOD= 0
##$PSCAL= 4
##$PSIGN= 0
##$REVERSE= no
##$SF= 250.130018164957
##$SI= 32768
##$SIGF1= 0
##$SIGF2= 0
##$SINO= 400
##$SIOLD= 32768
##$SREGLST= <1H.CDCl3>
##$SSB= 0
##$STSI= 32768
##$STSR= 0
##$SW_p= 5175.98343685301
##$SYMM= 0
##$S_DEV= 0
##$TDeff= 65536
##$TDoff= 0
##$TI= <Analysis number 999999
Compound Code 99
Book Reference 9
Project Code 9>
##$TILT= no
##$TM1= 0
##$TM2= 0
##$TOPLEV= 0
##$USERP1= <user>
##$USERP2= <user>
##$USERP3= <user>
##$USERP4= <user>
##$USERP5= <user>
##$WDW= 1
##$XDIM= 32768
##$YMAX_p= 536213784
##$YMIN_p= -572886
$$ End of Bruker specific parameters
$$ ---------------------------------
##NTUPLES= NMR SPECTRUM
##VAR_NAME=  FREQUENCY,     SPECTRUM/REAL,   SPECTRUM/IMAG
##SYMBOL=    X,             R,               I
##VAR_TYPE=  INDEPENDENT,   DEPENDENT,       DEPENDENT
##VAR_FORM=  AFFN,          ASDF,            ASDF
##VAR_DIM=   32768,         32768,           32768
##UNITS=     HZ,            ARBITRARY UNITS, ARBITRARY UNITS
##FACTOR=    0.157963299565203, 1,           1
##FIRST=     4114.48107446356, 0,            0
##LAST=      -1061.50236238945, 0,           0
##MIN=       -1061.50236238945, -572886,     0
##MAX=       4114.48107446356, 536213784,    0
$$ Real data points
##PAGE= N=1
##DATA TABLE= (X++(R..R)), XYDATA
$$ [...]
$$ plain form
16461 -5783 -35536 -11787 56311 43326 -11753 -30637 -46881 -24779 2849 -9952 -17670 -22668
16449 -22668 -1514 20708 16583 14002 15695 -29501 -2184 8882 -34647 -7501 10284 -21132
16437 -21132 -346 32596 76996 89055 57687 12668 -6238 -10115 -11017 -7408 3937 2969 -29832
16424 -29832 -22381 25172 10727 -15796 -3839 -36548 -49838 -50715 -41991 -42018 -51428 -68138 -61680
16411 -61680 -86337 -83299 -95883 -70750 -35136 -9650 -19481 -11957 36756 64465 21 -53189
16399 -53189 -41744 -52480 -41533 -7922 -25242 -29476 -36258 24189 85110 83519 78456 121341
16387 121341 107275 33087 3668 -15897 -21851 -34455 -36110 -26840 -15816 -47756 -46499 -40458
16375 -40458 -18951 24956 32611 47557 39906 29641 10647 17512 20004 39771 11548 11967 9230
$$ packed form
16461e783k9753K3749O8098j2985n5079j8884j6244K2102K7628j2801p718m998
16449b2668K1154K2222m125k581J693m5196K7317J1066m3529K7146J7785l1416
16437b1132K0786L2942M4400J2059l1368m5019j8906l877r02L609J1345r68l2801
16424b9832P451M7553j4445k6523J1957l2709j3290q77Q724k7r410j6710O458
16411f1680k4657L038j2584K5133L5614K5486r831P524M8713K7709o4444n3210
16399e3189J1445j0736J0947L3611j7320m234o782O0447O0921j591n063M2885
16387A21341j4066p4188k9419j9565n954j2604j655R270J1024l1940J257O041
16375d0458K1507M3907P655J4946p651j0265j8994O865K492J9767k8223M19k737
$$ plain form
16362 9230 2583 -544 9096 96436 107751 80503 46406 -5725 -44873 -65074 -59050 -20217 -12125
16349 -12125 -18360 -67785 -77286 -53668 -30778 8131 36811 35838 21206 -39738 -44185 -33656 -74310
16336 -74310 -128359 -75156 -59437 -61895 -45496 -23149 -28315 -16855 -22369 4982 -22444 -29941
16324 -29941 -35667 -22652 14413 -4821 13711 9794 11295 24483 46762 23342 -39789 -52051
16312 -52051 -55051 -60485 -16181 -3069 -8311 9250 17196 72652 76743 45020 20396 42679 24818
16299 24818 10568 41118 70997 66849 30615 -6808 -39880 -52844 -31368 448 6278 4185
16287 4185 18635 36702 18930 9234 5631 -37576 -61892 -1803 -776 -13940 -10220 -15590 -24309
16274 -24309 -202 20296 35385 24949 17434 -8408 -13488 -11102 -13855 -22922 43285 105521 57004
$$ packed form
16362I230o647l127R640Q7340J1315k7248l4097n2131l9148k0201O024L8833Q092
16349a2125o235m9425r501K3618K2890L8909K8680r73j4632o0944m447J0529m0654
16336g4310n4049N3203J5719k458J6399K2347n166J1460n514K7351k7426p497
16324b9941n726J3015L7065j9234J8532l917J501J3188K2279k3420o3131j2262
16312e2051l000n434M4304J3112n242J7561P946N5456M091l1723k4624K2283j7861
16299B4818j4250L0550K9879m148l6234l7423l3072j2964K1476L1816N830k093
16287D185J4450J8067j7772r696l603m3207k4316O0089J027j3164L720n370q719
16274b4309K4107K0498J5089j0436p515k5842n080K386k753r067O6207O2236m8517
$$ plain form
16261 57004 -8484 -25998 5366 17917 26624 3241 -29614 -15313 -16041 -23074 -18729 9550 19684
16248 19684 18580 13228 7398 -8756 -16834 24679 8443 -52632 -86100 -105717 -57544 -10830
16236 -10830 -480 -1992 15655 28214 21279 35431 18006 -16777 -42207 -44189 -26260 -12970
16224 -12970 26042 43593 38912 51894 70373 62335 -8974 -56744 -42144 -11177 -28741 -30662
16212 -30662 -35291 -43081 -20929 -30107 -77740 -60783 5585 -23501 -73265 -77546 -91495 -67676
16200 -67676 -62085 -36274 -30050 879 10007 15622 -2853 -3416 33322 29454 12236 5644 38819
16187 38819 36700 20767 -16038 813 -39735 -78708 -60476 -43682 -26570 -60700 -104186 -76991
16175 -76991 -26831 -38083 -45570 -25478 30654 51003 71311 72049 32191 3848 20395 21002 5752
$$ packed form
16261E7004o5488j7514L1364J2551Q707k3383l2855J4301p28p033M345K8279J0134
16248A9684j104n352n830j6154q078M1513j6236o1075l3468j9617M8173M6714
16236a0830J0350j512J7647J2559o935J4152j7425l4783k5430j982J7929J3290
16224a2970L9012J7551m681J2982J8479q038p1309m7770J4600L0967j7564j921
16212c0662m629p790K2152r178m7633J6957O6368k9086m9764m281j3949K3819
16200f7676N591K5811O224L0929R128N615j8475n63L6738l868j7218o592L3175
16187C8819k119j5933l6805J6851m0548l8973J8232J6794J7112l4130m3486K7195
16175g6991N0160j1252p487K0092N6132K0349K0308P38l9858k8343J6547O07j5250
$$ plain form
16162 5752 13023 23474 4038 -40591 -62678 -49837 -45655 -17996 -27617 -40406 -6366 5374
16150 5374 14502 9526 13949 -11127 -31635 -63266 -35324 10253 11938 29444 30118 -18062 -1555
16137 -1555 -13862 -44631 -54471 -63163 -89491 -65745 -61407 -32426 -50794 -42980 2946 9040 -27928
16124 -27928 -49662 -66208 -66888 -80943 -65888 -13997 -24220 -4906 24690 -8217 -45374 -32915
16112 -32915 15822 15786 65651 69469 7690 -24724 -36298 5921 49405 54403 26042 28251 83343
16099 83343 78728 69878 88218 50455 23185 10103 -13516 -29580 -12218 6798 -9083 -29657
16087 -29657 -22704 19350 23786 2071 -6399 -15380 -31768 -18897 -35427 -35312 -39273 4616 1945
16074 1945 -2121 -17703 -25413 -5461 -21924 -23278 -45487 -54098 -38935 -37031 -69235 -104820 -87511
$$ packed form
16162E752P271J0451j9436m4629k2087J2841M182K7659r621j2789L4040J1740
16150E374R128m976M423k5076k0508l1631K7942M5577J685J7506O74m8180J6507
16137a555j2307l0769r840q692k6328K3746M338K8981j8368P814M5926O094l6968
16124b7928k1734j6546o80j4055J5055N1891j0223J9314K9596l2907l7157J2459
16112c2915M8737l6M9865L818o1779l2414j1574M2219M3484M998k8361K209N5092
16099H3343m615q850J8340l7763k7270j3082k3619j6064J7362J9016j5881k0574
16087b9657O953M2054M436k1715q470q981j6388J2871j6530J15l961M3889k671
16074A945m066j5582p710J9952j6463j354k2209q611J5163J904l2204l5585J7309
$$ plain form
16061 -87511 -71114 -8034 -32500 -23009 -19198 -47195 -53444 -80915 -50783 34730 27890 -19806
16049 -19806 -42103 -31775 -11048 16225 43336 18479 41822 79586 54031 8868 -7182 -12535
16037 -12535 -48792 -48051 -33071 10849 49230 52784 65496 45424 38214 38833 17508 39319 29266
16024 29266 -12614 -36350 1208 22393 19144 -3581 -21531 -40103 -28160 -10056 -5106 -25018
16012 -25018 -33952 -20930 -9545 17042 24474 55897 77865 40907 -26181 16068 44659 59115
16000 59115 33830 24230 59487 57215 54288 73304 74747 60720 24896 15158 24971 13076 -35576
15987 -35576 -64609 -45932 -66787 -90752 -76054 -68086 -64069 -86920 -103605 -43647 -20265 -40334
15975 -40334 -30618 53983 99509 57579 60401 35337 31493 8060 -6306 -12503 17145 7570 15529
$$ packed form
16061h7511J6397O3080k4466R491L811k7997o249k7471L0132Q5513o840m7696
16049a9806k2297J0328K0727K7273K7111k4857K3343L7764k5555m5163j6050n353
16037a2535l6257P41J4980M3920L8381L554J2712k0072p210O19k1325K1811j0053
16024B9266m1880k3736L7558K1185l249k2725j7950j8572J1943J8104M950j9912
16012b5018q934J3022J1385K6587P432L1423K1968l6958o7088M2249K8591J4456
16000E9115k5285r600L5257k272k927J9016J443j4027l5824r738R813j1895m8652
15987c5576k9033J8677k0855k3965J4698P968M017k2851j6685N9958K3382k0069
15975d0334R716Q4601M5526m1930K822k5064l844k3433j4366o197K9648r575P959
$$ plain form
15962 15529 1967 -16322 -16215 2114 -28841 -4086 23187 -13415 -13877 -16468 -33726 -82203 -87357
15949 -87357 -64447 -42873 -35371 -46264 -15744 -45783 -62467 -46792 5267 53819 43844 -3336
15937 -3336 8936 9647 -22028 -25580 27707 60129 33738 -1282 4582 67252 96048 66407 46944
15924 46944 927 2171 1643 17929 21495 15211 -38740 -19124 37608 42426 49014 -13871 -40295
15911 -40295 -32564 -8297 -15594 -25651 -3812 31206 52788 28306 -23970 -8444 38387 17014
15899 17014 43481 -9603 -18300 -17413 -1658 18139 -3395 -5459 -39029 -60449 -55989 -13337 -32973
15886 -32973 -45601 -24979 -2474 25785 7889 19404 22572 34907 59152 62052 45251 1378
15874 1378 -81400 -108475 -56032 -38737 -27976 13428 27196 26387 25794 41483 68699 60565 15785
$$ packed form
15962A5529j3562j8289J07J8329l0955K4755K7273l6602m62k591j7258m8477n154
15949h7357K2910K1574P502j0893L0520l0039j6684J5675N2059M8552r975m7180
15937c336J2272P11l1675l552N3287L2422k6391l5020N864O2670K8796k9641j9463
15924D6944m6017J244n28J6286L566o284n3951J9616N6732M818O588o2885k6424
15911d0295P731K4267p297j0057K1839L5018K1582k4482n2276J5526M6831k1373
15899A7014K6467n3084q697Q87J5755J9797k1534k064l3570k1420M460M2652j9636
15886c2973j2628K0622K2505K8259j7896J1515L168J2335K4245K900j6801m3873
15874A378q2778k7075N2443J7295J0761M1404J3768q09n93J5689K7216q134m4780
$$ plain form
15861 15785 -5200 -7624 -7944 -24124 -32806 -19201 37811 92639 70193 58988 39151 10276
15849 10276 -15401 -26987 -60186 -24302 29840 -5681 1670 -15123 -58900 -35775 -46799 -22494
15837 -22494 -1301 29569 59151 50204 22157 -27589 -62933 -52106 -15551 -26942 -55735 -56752
15825 -56752 -43404 -10103 -26690 -43960 -46117 -24028 -13076 13395 -16273 13794 33805 55043
15813 55043 64389 31636 -15175 -12411 13298 51073 67288 33583 -11932 -40695 -56223 -62113
15801 -62113 -45261 -12137 -8688 -50275 -68705 -85428 -86190 -75095 -60233 -19304 5904 -67386
15789 -67386 -77230 -62553 -49325 -25058 14011 -7138 15045 43754 47119 27674 9166 12342
15777 12342 -4062 -12408 4342 13229 -740 -4158 -4632 -8468 -54910 -59352 -36874 -32263 -41338
$$ packed form
15861A5785k0985k424l20j6180q682J3605N7012N4828k2446j1205j9837k8875
15849A0276k5677j1586l3199L5884N4142l5521P351j6793m3777K3125j1024K4305
15837b2494K1193L0870K9582q947k8047m9746l5344J0827L6555j1391k8793j017
15825e6752J3348L3301j6587j7270k157K2089J0952K6471k9668L0067K0011K1238
15813E5043R346l2753m6811K764K5709L7775J6215l3705m5515k8763j5528n890
15801f2113J6852L3124L449m1587j8430j6723p62J1095J4862M0929K5208p3290
15789f7386r844J4677J3228K4267L9069k1149K2183K8709L365j9445j8508L176
15777A2342j6404q346J6750Q887j3969l418m74l836m6442m442K2478M611r075
$$ plain form
15764 -41338 -5177 -2578 -33680 -32519 -17916 30851 13189 -27895 -10802 2305 11194 3432
15752 3432 27467 40870 53692 7733 -606 41596 5165 -73936 -122747 -100788 -113129 -116115
15740 -116115 -83889 -42733 -45123 -2992 21730 24450 25249 35384 39585 87763 81531 47457 49584
15727 49584 69095 38780 11973 49038 65175 31308 11499 33164 92697 86934 22776 -8345
15715 -8345 -8547 -28587 -63769 -86933 -44900 5403 7140 -24391 -19111 13342 607 71 -1665
15702 -1665 -21628 -20548 -10908 -15528 -32509 -19566 -6317 -3560 18136 19703 25001 22794 42672
15689 42672 -6256 -53959 -47650 -28555 -29256 -68570 -73605 -32097 -2039 24478 -25886 -66722
15677 -66722 -45528 -19974 -5313 5048 -4483 -16709 -45704 -35126 15156 16499 27170 40802
$$ packed form
15764d1338L6161K599l1102J161J4603M8767j7662m1084J7093J3107Q889p762
15752C432K4035J3403J2822m5959q339M2202l6431p9101m8811K1959j2341k986
15740a16115L2226M1156k390M2131K4722K720P99J0135M201M8178o232l4074K127
15727D9584J9511l0315k6807L7065J6137l3867j9809K1665N9533n763o4158l1121
15715h345k02k0040l5182k3164M2033N0303J737l1531N280L2453j2735n36j736
15702a665j9963J080R640m620j6981J2943J3249K757K1696J567N298k207J9878
15689D2672m8928m7703O309J9095p01l9314n035M1508L0058K6517n0364m0836
15677f6722K1194K5554J4661J0361r531j2226k8995J0578N0282J343J0671J3632
$$ plain form
15665 40802 22892 15480 58300 91003 42524 38250 84035 102612 108995 62948 11930 -20433
15653 -20433 -25888 -15778 7035 -20230 -20728 4450 29197 63252 46470 38337 11442 -41125
15641 -41125 -47782 -2749 8579 3091 -18901 -29223 -5347 19685 6186 1557 11426 -4376
15629 -4376 -6744 22190 22304 18328 -17854 -62903 -57169 -30767 20965 62024 12575 10031 7030
15616 7030 -30299 -83555 -94508 -56412 -34234 -28759 -20646 8498 1836 -45063 -38952 28886 52313
15603 52313 58337 38497 -3658 -29229 -659 19299 24485 40034 16902 -1126 -1371 37891
15591 37891 17764 -16874 -29851 -25510 -43248 -59347 -64456 -45100 -10183 16396 13904 -782
15579 -782 -12344 6957 33266 43989 79804 37317 23313 75514 58491 72996 88021 62994
$$ packed form
15665D0802j7910p412M2820L2703m8479m274M5785J8577O383m6047n1018l2363
15653b0433n455J0110K2813k7265m98K5178K4747L4055j6782q133k6895n2567
15641d1125o657M5033J1328n488k1992j0322K3876K5032j3499m629R869j5802
15629d376k368K8934J14l976l6182m5049N734K6402N1732M1059m9449k544l001
15616G030l7329n3256j0953L8096K2178N475Q113K9144o662m6899O111O7838K3427
15603E2313O024j9840m2155k5571K8570J9958N186J5549k3132j8028k45L9262
15591C7891k0127l4638j2977M341j7738j6099n109J9356L4917K6579k492j4686
15579g82j1562J9301K6309J0723L5815m2487j4004N2201j7023J4505J5025k5027
$$ plain form
15567 62994 26665 42527 52627 29353 -12004 1636 3646 -4011 -46532 -45876 -54996 -60965 -55398
15554 -55398 -40323 -30356 -33740 -36101 -43764 3899 43534 26587 -4243 -17523 -87887 -96754 -82044
15541 -82044 -77732 -68261 -83392 -85369 -93390 -44611 -56528 -42989 -22459 -3500 2242 10972 10052
15528 10052 -44310 -67267 -22181 -15336 -30341 -37836 -13547 29866 59084 56496 47136 20217
15516 20217 -20510 -51960 -47811 -30559 -32393 -21247 -22468 -54346 -22393 -2462 -12958 -29511
15504 -29511 -42759 2807 10160 12648 29497 42548 75720 69717 92604 77282 32100 23302
15492 23302 15308 11371 -3036 21109 31807 26539 24144 23128 23901 10829 3345 61089 85046
15479 85046 27131 -31999 27026 7579 -27690 992 13971 4422 -10421 -73649 -73470 -53451
$$ packed form
15567F2994l6329J5862J0100k3274m1357J3640K010p657m2521O56r120n969N567
15554e5398J5075R967l384k361p663M7663L9635j6947l0830j3280p0364q867J4710
15541h2044M312R471j5131j977q021M8779j1917J3539K0530J8959N742Q730r20
15528A0052n4362k2957M5086O845j5005p495K4289M3413K9218k588r360k6919
15516B0217m0727l1450M149J7252j834J1146j221l1878L1953J9931j0496j6553
15504b9511j3248M5566P353K488J6849J3051L3172o003K2887j5322m5182q798
15492B3302p994l937j4407K4145J0698n268k395j016P73j3072p484N7744K3957
15479H5046n7915n9130N9025j9447l5269K8682J2979r549j4843o3228J79K0019
$$ plain form
15467 -53451 -46815 -24736 -30773 -36272 -21476 -6026 1711 -5382 20483 -23572 -59879 -16331 7990
15454 7990 415 -61819 -82687 -41888 -3324 29917 -5606 -30061 -1063 -14520 -6518 11646
15442 11646 7759 -13258 -8971 36613 14991 17751 9075 3268 10620 25211 13976 45368 95283
15429 95283 65004 23542 7326 8871 56820 71627 19279 5740 13515 -7689 32377 45755
15417 45755 -12621 -26571 -21000 -8376 40010 62262 35865 -1706 17454 37724 40421 47781
15405 47781 58450 53425 27578 24014 42745 37255 49054 43388 48099 43843 21838 27167 21711
15392 21711 -10254 -10829 -5225 -5353 -19804 -9382 30183 9563 -11365 3777 51407 64748 27129
15379 27129 3897 9655 16630 20843 6657 3424 19313 36700 30508 13632 -9125 -21001 5542
$$ packed form
15467e3451O636K2079o037n499J4796J5450P737p093K5865m4055l6307M3548K4321
15454G990p575o2234k0868M0799L8564L3241l5523k4455K8998j3457Q002J8164
15442A1646l887k1017M287M5584k1622K760q676n807P352J4591j1235L1392M9915
15429I5283l0279m1462j6216J545M7949J4807n2348j3539P775k1204M0066J3378
15417D5755n8376j3950N571J2624M8386K2252k6397l7571J9160K0270K697P360
15405D7781J0669n025k5847l564J8731n490J1799n666M711m256k2005N329n456
15392B1711l1965n75N604j28j4451J0422L9565k0620k0928J5142M7630J3341l7619
15379B7129k3232N758O975M213j4186l233J5889J7387o192j6876k2757j1876K6543
$$ plain form
15366 5542 28373 -4099 -20736 9062 -13343 -63948 -61924 -55048 -53630 -48066 -30474 -31105 -22626
15353 -22626 -40434 -1849 19641 -27942 -46967 -45172 -38327 -6252 893 9433 -30925 -29140 -7705
15340 -7705 19393 26701 14343 -3932 -45082 -39460 -15486 7605 -23747 -39787 -33098 -27907 -28942
15327 -28942 -12043 -2263 -6954 27393 49280 93616 92769 63050 46726 31105 13869 11321 1422
15314 1422 -22748 -70260 -77050 -55315 -56183 -91757 -103087 -116158 -89908 -35757 -47957 -37279
15302 -37279 -19646 -26208 -29059 -35325 -8907 15805 -1026 19817 41404 38668 11022 -47923
15290 -47923 -57955 -39671 -39184 -45021 8796 13439 -24624 -46570 -34554 -19148 -19999 -18485 -13551
15277 -13551 4403 23170 25658 5586 18858 54187 28202 -1341 -20897 -18541 28870 51315
$$ packed form
15366E542K2831l2472j6637K9798k2405n0605K024O876J418N564J7592o31Q479
15353b2626j7808L8585K1490m7583j9025J795O845L2075P145Q540m0358J785K1435
15340g705K7098P308j2358j8275m1150N622K3974K3091l1352j6040O689N191j035
15327b8942J6899R780m691L4347K1887M4336q47k9719j6324j5621j7236k548r899
15314A422k4170m7512o790K1735q68l5574j1330j3071K6250N4151j2200J0678
15302c7279J7633o562k851o266K6418K4712j6831K0843K1587k736k7646n8945
15290d7923j0032J8284M87n837N3817M643l8063k1946J2016J5406q51J514M934
15277a3551J7954J8767K488k0072J3272L5329k5985k9543j9556K356M7411K2445
$$ plain form
15265 51315 40786 52603 29013 39723 28076 33316 28239 26775 55742 57270 30711 36772 24942
15252 24942 -18571 -38832 -18580 1731 -5312 -6318 -27127 -47980 -66980 -41211 -14102 -20090
15240 -20090 -10447 20804 22698 4815 3342 24411 103363 108335 80446 38666 50386 36672
15228 36672 -1704 31251 39743 9482 11013 29951 -4502 -12140 8983 -5431 -44826 -84699
15216 -84699 -92922 -69930 -33321 2188 27026 -2608 -8078 -24122 -1473 -4176 -33978 -74764
15204 -74764 -42900 -3465 -11163 6281 6229 -5495 -39533 -73059 -24668 -22518 2109 2656 22511
15191 22511 30842 18113 16875 -30705 -57028 -85196 -35997 -6466 -7653 30394 51218 46088
15179 46088 49631 93275 88940 48488 9835 19280 43423 75162 87510 91663 51242 6726
$$ packed form
15265E1315j0529J1817k3590J0710j1647N240n077j464K8967J528k6559O061j1830
15252B4942m3513k0261K0252K0311p043j006k0809k0853j9000K5769K7109n988
15240b0090R643L1251J894j7883j473K1069P8952M972k7889m1780J1720j3714
15228C6672l8376L2955Q492l0261J531J8938l4453p638K1123j4414l9395l9873
15216h4699q223K2992L6609L5509K4838k9634n470j6044K2649k703k9802m0786
15204g4764L1864L9435p698J7444n2j1724l4038l3526M8391K150K4627N47J9855
15191B2511Q331j2729j238m7580k6323k8168M9199K9531j187L8047K0824n130
15179D6088L543M3644m335m0452l8653R445K4143L1739J2348M153m0421m4516
$$ plain form
15167 6726 -3175 -21834 -19127 -30772 -47523 -1382 23856 -11011 -3511 -15513 2044 -747 9010
15154 9010 30717 34685 49019 16807 6218 -8117 -42803 -52963 -56703 -32463 -9153 -10995
15142 -10995 -7859 -10686 -2440 -4241 -124 39736 5386 -401 20182 -12509 -8600 -13327 8556
15129 8556 35691 44262 67437 73825 71134 57763 14984 -30027 -14592 -22457 -40070 -26819 -577
15116 -577 35420 46256 32783 34515 46630 40721 16291 38340 39911 19051 16040 -40937 -43366
15103 -43366 -13472 -1848 12335 -4234 1483 16789 8819 -21843 -48315 -41047 -47012 -29326
15091 -29326 -63170 -42063 -15126 25317 15135 -2487 5862 798 -18421 -58422 -4623 37280
15079 37280 55286 45354 49200 20647 -6334 -9043 -5713 14734 454 7405 15757 -10088 -75631
$$ packed form
15167F726r901j8659K707j1645j6751M6141K5238l4867P500j2002J7557k791R757
15154I010K1707L968J4334l2212j0589j4335l4686j0160l740K4240K3310j842
15142a0995L136k827Q246j801M117L9860l4350n787K0583l2691L909m727K1883
15129H556K7135Q571K3175O388k691j3371m2779m5011J5435p865j7613J3251K6242
15116e77L5997J0836j3473J732J2115n909k4430K2049J571k0860l011n6977k429
15103d3366K9894J1624J4183j6569N717J5306p970l0662k6472P268n965J7686
15091b9326l3844K1107K6937M0443j0182j7622Q349n064j9219m0001N3799M1903
15079C7280J8006r932L846k8553k6981k709L330K0447j4280O951Q352k5845o5543
$$ plain form
15066 -75631 -78455 -41411 22643 73674 117722 119498 71677 43846 19232 2159 -19835 20953
15054 20953 6116 -27716 -33182 -30634 -42308 -35091 7970 33883 10568 -11127 7981 -29193
15042 -29193 -98898 -77868 -22836 13731 16360 -13163 -13114 8155 20365 65467 52223 42691 22430
15029 22430 -3312 -17679 -14563 -6700 31764 50542 3940 -24681 -71734 -70596 -1716 61433
15017 61433 51578 3975 -24562 -11950 59008 60790 18713 7829 10097 20570 21329 33316 25294
15004 25294 21753 31195 43024 46899 29544 61434 81561 25856 6400 10865 13312 22037 19619
14991 19619 32243 2547 -30940 -41917 -26550 -20888 -6664 -14132 7157 40819 31268 24143
14979 24143 15420 -22902 -31488 -35650 -36561 -47233 -32217 -21581 -27597 -46260 -18108 -25893 -51095
$$ packed form
15066g5631k824L7044O4054N1031M4048J776m7821k7831k4614j7073k1994M0788
15054B0953j4837l3832n466K548j1674P217M3061K5913k3315k1695J9108l7174
15042b9193o9705K1030N5032L6567K629k9523M9K1269J2210M5102j3244r532k0261
15029B2430k5742j4367L116P863L8464J8778m6602k8621m7053J138O8880O3149
15017F1433r855m7603k8537J2612P0958J782m2077j0884K268J0473P59J1987q022
15004B5294l541R442J1829L875j7355L1890K0127n5705j9456M465K447Q725k418
14991A9619J2624k9696l3487j0977J5367N662J4224p468K1289L3662r551p125
14979B4143q723l8322q586m162r11j0672J5016J0636o016j8663K8152p785k5202
$$ plain form
14966 -51095 -71860 -135314 -114749 -85796 -30518 -8957 318 15544 31944 38599 13049 21659
14954 21659 20587 -7024 -34886 -24292 766 18883 8147 -36199 -48447 -41978 -56719 -8366
14942 -8366 31990 50093 6935 -31041 -8222 10548 -24891 -76540 -61285 -38706 -26420 6961
14930 6961 32875 32755 22838 -54174 -99736 -86784 -69597 -46731 -34831 -16565 8614 12325 -4701
14917 -4701 -16269 -3495 -13031 -3197 -37583 -58947 -57371 -41296 14662 33285 36019 37361 49281
14904 49281 28357 -12731 -22473 -35947 -44161 -77828 -40178 -10699 7111 6130 13007 42690 41363
14891 41363 14773 -33379 -85825 -64311 -34295 -38296 -34673 -32204 -1016 33117 10213 -10626
14879 -10626 -17673 11364 14153 21731 -1036 -19532 -24732 -59906 -66871 -42036 -18423 5188 -25310
$$ packed form
14966e1095k0765o3454K0565K8953N5278K1561R275J5226J6400O655k5550Q610
14954B1659j072k7611k7862J0594K5058J8117j0736m4346j2248O469j4741M8353
14942h366M0356J8103m3158l7976K2819J8770l5439n1649J5255K2579J2286L3381
14930F961K5914j20r917p7012m5562J2952J7187K2866J1900J8266K5179L711j7026
14917d701j1568J2774r536R834l4386k1364J576J6075N5958J8623K734J342J1920
14904D9281k0924m1088r742j3474q214l3667L7650K9479J7810r81O877K9683j327
14891D1363k6590m8152n2446K1514L0016m001L623K469L1188L4133k2904k0839
14879a0626p047K9037K789P578k2767j8496n200l5174o965K4835K3613K3611l0498
$$ plain form
14866 -25310 -24825 1889 -35460 -67161 -49774 -10141 12545 7870 -25381 -56596 -56893 19071 39414
14853 39414 49663 25391 -13306 -47060 -74044 -81522 -96574 -65650 -16507 -25166 -17645 -5834
14841 -5834 6753 -15245 -44332 -49964 -55828 -12922 25158 19959 46705 59961 84061 48089
14829 48089 25685 15764 -6688 21686 26884 7667 9405 -1972 -15685 1482 -40405 -21184
14817 -21184 11259 30677 60024 60113 39254 7968 -18029 -18233 16809 51409 54801 44918 15430
14804 15430 2548 -10941 -7941 -47494 -41817 -36504 -60235 -71455 -52562 -23635 -12189 -16426
14792 -16426 -43285 -39946 -40348 -19920 -7050 -11997 -10432 -36662 -44042 -44566 -42117 -20516 -43630
14779 -43630 -59291 -22480 -6730 8635 -30321 -35169 -4421 4971 10248 -11970 -39159 -43856
$$ packed form
14866b5310M85K6714l7349l1701J7387L9633K2686m675l3251l1215k97P5964K0343
14853C9414J0249k4272l8697l3754k6984p478j5052L0924M9143q659P521J1811
14841e834J2587k1998k9087n632n864M2906L8080n199K6746J3256K4100l5972
14829D8089k2404r921k2452K8374N198j9217J738j1377j3713J7167m1887J9221
14817b1184L2443J9418K9347Q9k0859l1286k5997k04L5042L4600L392r883k9488
14804A5430j2882j3489L000l9553N677N313k3731j1220J8893K8927J1446m237
14792a6426k6859L339m02K0428J2870m947J565k6230p380n24K449K1601k3114
14779d3630j5661L6811J5750J5365l8956m848L0748R392N277k2218k7189m697
$$ plain form
14767 -43856 -36582 -17896 -2137 -4379 -16025 6297 59554 72946 38850 15893 26260 50900
14755 50900 60670 19282 1990 13689 846 672 -16177 -32893 -78913 -26003 -2302 -4156
14743 -4156 7597 40739 56407 42877 46268 39396 23801 32069 42960 81068 42944 26225
14731 26225 35191 28490 64847 55307 34449 1297 -27967 -3885 5270 -18548 -28509 -32824 -24283
14718 -24283 -33547 -16332 -21249 -48507 -26412 -13318 -16324 33283 37564 11504 -9703 -22171
14706 -22171 -46754 -51950 1614 55157 60789 35676 28290 20672 34844 44666 47684 64248 52023
14693 52023 35206 27353 40039 57043 46924 38697 11486 -12885 2858 -8722 -44899 -52368
14681 -52368 -31029 -59369 -60516 -40369 -26288 -3447 -22559 -73180 -48027 -16736 -71 -5640
$$ packed form
14767d3856P274J8686J5759k242j1646K2322N3257J3392l4096k2957J0367K4640
14755E0900R770m1388j7292J1699j2843j74j6849j6716m6020N2910K3701j854
14743d156J1753L3142J5668j3530L391o872j5595Q268J0891L8108l8124j6719
14731B6225Q966o701L6357r540k0858l3152k9264K4082R155k3818r961m315Q541
14718b4283r264J7215m917k7258K2095J3094l006M9607M281k6060k1207j2468
14706b2171k4583n196N3564N3543N632k5113p386p618J4172R822L018J6564j2225
14693E2023j6817p853J2686J7004j0119q227k7211k4371J5743j1580l6177p469
14681e2368K1339k8340j147K0147J4081K2841j9112n0621K5153L1291J6665n569
$$ plain form
14669 -5640 8454 11404 36147 59766 49426 31706 -13429 -31839 -1056 443 20907 40784
14657 40784 16231 -27703 -30650 -40916 -75879 -68600 -74587 -91638 -65014 -24614 -9744 -23106
14645 -23106 -43440 -54970 -58179 -34998 -3998 -15869 -42648 -58792 -43345 -27027 -35902 -16982
14633 -16982 -37357 -56999 -59296 -22388 -15402 7262 14701 -5374 -5985 52 -6586 -16809 -11246
14620 -11246 -29329 -32425 -741 49185 112352 64154 3422 -21928 13022 10542 -10091 -24479
14608 -24479 -62150 -70080 -54947 -47878 -39105 -15025 -30010 -27081 -13698 2194 7357 16610 38230
14595 38230 67595 55199 22317 18199 -28548 -35356 -34505 -50649 -7276 29424 58740 35460
14583 35460 17519 -13332 -56368 -57316 -76869 -99918 -51640 -59722 -35238 20488 11472 -20418
$$ packed form
14669e640J4094K950K4743K3619j0340j7720m5135j8410L0783J499K0464J9877
14657D0784k4553m3934k947j0266l4963P279n987j7051K6624M0400J4870j3362
14645b3106k0334j1530l209K3181L1000j1871k6779j6144J5447J6318q875J8920
14633a6982k0375j9642k297L6908O986K2664P439k0075o11O037o638j0223N563
14620a1246j8083l096L1684M9926O3167m8198o0732k5350L4950k480k0633j4388
14608b4479l7671p930J5133P069Q773K4080j4985K929J3383J5892N163R253K1620
14595C8230K9365j2396l2882m118m6747o808Q51j6144M3373L6700K9316k3280
14583C5460j7941l0851m3036r48j9553k3049M8278q082K4484N5726r016l1890
$$ plain form
14571 -20418 -17342 18893 -3107 4913 32871 -4767 16853 52351 49942 5542 -1311 1636 -7424
14558 -7424 2879 -12105 35841 47227 13113 9209 660 -2339 477 33418 39708 -845 -46976
14545 -46976 -34912 1060 11281 30635 12147 40012 28513 28294 46436 15110 13772 -3389
14533 -3389 3528 4007 -1234 -16284 -16740 -19269 -50 -4736 -56443 -52059 -33888 -17793 -64867 -29768
14519 -29768 3186 -14871 -10284 9772 29539 41628 43456 47362 57409 74025 34711 4680
14507 4680 16425 10157 6639 -22427 -15707 -14494 -28000 -45524 -31297 23870 2689 -10956 28511
14494 28511 31913 28416 34832 63547 39249 80151 77996 43439 31117 55663 80426 35525
14482 35525 20888 -13123 -46777 -17542 11902 69005 97210 46998 23871 17285 27988 28528
$$ packed form
14571b0418L076L6235k2000Q020K7958l7638K1620L5498k409m4400o853K947r060
14558g424J0303j4984M7946J1386l4114l904q549k999K816L2941O290m0553m6131
14545d6976J2064L5972J0221J9354j8488K7865j1499k19J8142l1326j338j7161
14533c389O917M79n241j5050m56k529J9219m686n1707M384J8171J6095m7074L5099
14519b9768L2954j8057M587K0056J9767J2089J828L906J0047J6616l9314l0031
14507D680J1745o268l518k9066O720J213j3506j7524J4227N5167k1181j3645L9467
14494B8511L402l497O416K8715k4298M0902k155l4557j2322K4546K4763m4901
14482C5525j4637l4011l3654K9235K9444N7103K8205n0212k3127o586J0703N40
$$ plain form
14470 28528 21442 34956 49163 49052 65092 75877 48290 85568 90401 100695 105643 45137 3175
14457 3175 -7585 3558 13464 8140 -18586 -11947 23751 6853 21807 59635 82337 36485
14445 36485 11650 8414 23503 10175 -20576 -31913 229 -15104 -3250 8229 11028 41334
14433 41334 23202 -11368 -21461 -22449 -7050 2117 47436 58218 22195 -5462 -40295 -61078
14421 -61078 -34736 -20674 6272 -7026 -16835 15693 42613 48540 52646 74885 56156 -7307
14409 -7307 -15746 -5632 6308 14826 9066 -2039 30573 28594 2821 -25609 -21027 -13603 -4667
14396 -4667 15651 -2589 -28668 -60069 -41280 -54345 -82279 -41217 -17539 -25696 -1677 37130
14384 37130 57204 52115 18965 915 26478 36540 -10304 16461 20079 10656 22559 27173
$$ packed form
14470B8528p086J3514J4207j11J6040J0785k7587L7278M833J0294M948o0506m1962
14457C175j0760J1143R906n324k6726O639L5698j6898J4954L7828K2702m5852
14445C6485k4835l236J5089j3328l0751j1337L2142j5333J1854J1479K799L0306
14433D1334j8132l4570j0093r88J5399R167M5319J0782l6023k7657l4833k0783
14421f1078K6342J4062K6946j3298r809L2528K6920N927M106K2239j8729o3463
14409g307q439J0114J1940Q518n760j1105L2612j979k5773k8430M582P424Q936
14396d667K0318j8240k6079l1401J8789j3065k7934M1062K3678q157K4019L8807
14384C7130K0074n089l3150j8050K5563J0062m6844K6765L618r423J1903M614
$$ plain form
14372 27173 9257 32128 64547 59096 16359 2050 35408 51612 24089 3775 -5888 -21083
14360 -21083 -12181 -19189 27787 4629 -24874 -18542 3333 22059 -13204 -11046 -3565 -22048 -37773
14347 -37773 -31024 -14517 -11493 1428 33672 4705 -27779 -61036 -3607 8190 6011 11369
14335 11369 40253 45599 4923 5940 29629 102 -10266 -26503 -16344 32318 66170 61753
14323 61753 43986 6774 6700 24627 55 -11175 5724 13778 20948 17738 43881 44654 1984
14310 1984 -41088 -66614 -42959 -24014 -53375 -54156 -39661 -57795 -31661 11110 -20691 -38494
14298 -38494 21857 36536 7811 23899 62101 82437 45542 24032 15303 7633 31304 55430
14286 55430 64328 13511 -2413 -18593 -1975 31822 4112 -30506 -56307 -69072 -129354 -150363
$$ packed form
14372B7173j7916K2871L2419n451m2737j4309L3358J6204k7523k0314r663j5195
14360b1083Q902p008M6976k3158k9503O332K1875J8726l5263K158P481j8483j5725
14347c7773O749J6507L024J2921L2244k8967l2484l3257N7429J1797k179N358
14335A1369K8884N346m0676J017K3689k9527j0368j6237J0159M8662L3852m417
14323F1753j7767l7212p4J7927k4572j1230J6899Q054P170l210K6143P73m2670
14310A984m3072k5526K3655J8945k9361p81J4495j8134K6134M2771l1801j7803
14298c8494O0351J4679k8725J6088L8202K0336l6895k1510q729p670K3671K4126
14286E5430Q898n0817j5924j6180J6618L3797k7710l4618k5801j2765o0282k1009
$$ plain form
14274 -150363 -128143 -88581 -73704 -53631 -72507 -59427 -66508 -82610 -72219 -25909 3016 -857
14262 -857 -49258 -34419 29419 9462 -2482 13770 42821 55899 43598 30348 -13622 3037
14250 3037 -9821 -33988 -14690 5557 12902 7382 8679 9137 41712 43438 25882 14445 -14597
14237 -14597 -16099 15405 23189 -2530 8364 -18976 -27946 -34591 -14321 7630 -8994 -37224
14225 -37224 -37383 -22511 5440 25478 -3483 -2034 37789 47206 13293 15813 -6807 -47764 -68230
14212 -68230 -79252 -75584 -47912 -50675 -28393 10532 -36755 -81490 -60209 17903 44626 30916
14200 30916 13205 6964 -9573 -15920 -23373 7656 39910 49266 64975 67461 15535 -38604 -41503
14187 -41503 5600 20746 26803 53070 45741 -34366 -14518 18504 -3581 -12386 16894 31117
$$ packed form
14274a50363K2220L9562J4877K0073j8876J3080p081j6102J0391M6310K8925l873
14262h57m8401J4839O3838j9957j1944J6252K9051J3078j2301j3250m3970J6659
14250C037j2858k4167J9298K0247P345n520J297M58L2575J726j7556j1437k9042
14237a4597j502L1504P784k5719J0894k7340q970o645K0270K1951j6624k8230
14225c7224j59J4872K7951K0038k8961J449L9823R417l3913K520k2620m0957k0466
14212f8230j1022L668K7672k763K2282L8925m7287m4735K1281P8112K6723j3710
14200C0916j7711o241j6537o347p453L1029L2254R356J5709K486n1926n4139k899
14187d1503M7103J5146O057K6267p329q0107J9848L3022k2085q805K9280J4223
$$ plain form
14175 31117 17815 20153 -32719 -11185 37745 68487 84851 64309 21223 20559 22473 29519 38018
14162 38018 46438 38353 38128 24881 32945 6229 733 6867 10428 33255 94346 112546 109696
14149 109696 71719 39309 -6537 2052 35463 39862 35325 26001 8389 -8666 -21019 -15535
14137 -15535 -14865 -6645 25183 43107 27622 30811 26431 38797 47114 11779 -23336 -36730 -49802
14124 -49802 -21865 -17985 -8803 39329 63987 45218 40608 83998 78555 94825 91680 73759 54985
14111 54985 64304 43613 -11566 -41412 1865 47019 26755 -23775 3299 11628 3007 28344
14099 28344 24779 18908 -9578 -34648 -43593 -21312 20930 21848 -6791 30515 48376 21248 3302
14086 3302 -27904 -52032 -34329 3834 53532 64547 -5475 -35857 -6563 9026 5828 -20842
$$ packed form
14175C1117j3302K338n2872K1534M8930L0742J6364k0542m3086o64J914P046Q499
14162C8018Q420q085k25j3247Q064k6716n496O134L561K2827O1091J8200k850
14149A09696l7977l2410m5846Q589L3411M399m537r324j7612j7055j2353N484
14137a5535O70Q220L1828J7924j5485L189m380J2366Q317l5335l5115j3394j3072
14124d9802K7937L880R182M8132K4658j8769m610M3390n443J6270l145j7921j8774
14111E4985R319k0691n5179k9846M3277M5154k0264n0530K7074Q329q621K5337
14099B8344l565n871k8486k5070q945K2281M2242R18k8639L7306J7861k7128j7946
14086C302l1206k4128J7703L8163M9698J1015p0022l0382K9294J5589l198k6670
$$ plain form
14074 -20842 -39969 -12614 -17651 -22037 -12735 33979 72555 73835 43925 29078 40133 -6054
14062 -6054 -2202 -8856 17791 -6953 -3591 42216 42400 14324 -43329 -61178 -5169 15288 51138
14049 51138 59616 15996 -18671 -17175 4099 19870 368 -2299 -28972 -46411 -43038 -27389
14037 -27389 -41126 -58168 -43995 -17245 28826 55732 64174 34228 -19791 -28992 -30078 -23084
14025 -23084 9492 43710 38113 -9142 8958 16310 11891 6596 6523 4592 -2723 -34921 -29372 -31972
14011 -31972 -52016 -28250 -370 33151 28413 22570 4492 30925 26951 16837 -15418 -45421
13999 -45421 -21251 -11111 11066 29381 1433 -5709 6421 2942 6836 228 2110 37665 36338
13986 36338 14098 24114 29723 40231 24208 21524 17259 10986 2585 5687 -19267 -83111 -125476
$$ packed form
14074b0842j9127K7355n037m386R302M6714L8576J280k9910j4847J1055m6187
14062f054L852o654K6647k4744L362M5807J84k8076n7653j7849N6009K0457L5850
14049E1138Q478m3620l4667J496K1274J5771j9502k667k6673j7439L373J5649
14037b7389j3737j7042J4173K6750M6071K6906Q442k9946n4019r201j086O994
14025b3084L2576L4218n597m7255J8100P352m419n295p3j931p315l2198N549k600
14011c1972k0044K3766K7880L3521m738n843j8078K6433l974j0114l2255l0003
13999d5421K4170J0140K2177J8315k7948p142J2130l479L894o608J882L5555j327
13986C6338k2240J0016N609J0508j6023k684m265o273q401L102k4954o3844m2365
$$ plain form
13973 -125476 -148227 -97901 1938 10276 2291 -36911 -68085 -75896 -30927 14296 10328 -16417
13961 -16417 -22056 -8553 -15618 -44077 -55587 -69886 -82184 -59133 -21012 11098 14475 33383
13949 33383 52633 16313 -414 -34339 -97522 -116167 -97908 -85640 -55396 -40743 -26193 -19927
13937 -19927 37963 29871 -5518 5114 40567 35122 17248 -29035 -67270 -58980 -28418 -8583
13925 -8583 -47492 -41034 14676 7217 34463 27025 -9909 32767 130606 126956 121413 67762 21233
13912 21233 -9825 -8334 22047 28463 25015 30673 40598 -11949 -12599 -8523 -21836 -49932 -66832
13899 -66832 -67486 -76291 -57721 -83359 -98825 -101486 -80979 -33414 -42892 -17309 -5756 -6708 10446
13886 10446 29217 58198 102877 35407 -43001 -18901 28641 6118 24721 49083 49190 -2585
$$ packed form
13973a25476k2751N0326R9839Q338p985l9202l1174p811M4969M5223l968k6745
13961a6417n639J3503p065k8459j1510j4299j2298K3051L8121L2110L377J8908
13949C3383J9250l6320j6727l3925o3183j8645J8259J2268L0244J4653J4550O266
13937a9927N7890q092l5389J0632L5453n445j7874m6283l8235Q290L0562J9835
13925h583l8909O458N5710p459K7246p438l6934M2676R7839l650n543n3651m6529
13912B1233l1058J491L0381O416l448N658R925n2547o50M076j3313k8096j6900
13899f6832o54q805J8570k5638j5466k661K0507M7565r478K5583J1553r52J7154
13886A0446J8771K8981M4679o7470p8408K4100M7542k2523J8603K4362J07n1775
$$ plain form
13874 -2585 -13906 -23841 -29582 24374 36421 38008 7841 -38758 -27731 26362 44768 6041
13862 6041 -3090 -6535 -20334 -8480 10687 -5314 -15489 -12314 9317 62873 59218 6768 -4757
13849 -4757 -42255 -46911 -70149 -60949 -19408 21695 62772 70880 61873 61185 42848 45950 35587
13836 35587 15444 -38906 -30566 -5105 45498 62120 42368 54149 78501 68012 57644 50888
13824 50888 49644 41398 20458 -1890 32955 64371 58702 -5576 9754 38514 20316 -28216
13812 -28216 -27565 -52848 -20046 -15916 -37145 -19177 5932 -2160 -45856 -42804 -5425 59877 69738
13799 69738 37096 -5066 30428 23714 23268 -3151 -6126 -23041 -32000 -25065 -14603 -545 -16368
13786 -16368 9877 37614 59787 40102 2118 -16637 -14771 -20931 -53798 -65843 -79348 -65642
$$ packed form
13874b585j1321r935n741N3956J2047J587l0167m6599J1027N4093J8406l8727
13862F041r131l445j3799J1854J9167j6001j0175L175K1631N3556l655n2450j1525
13849d757l7498m656k3238R200M1541M1103M1077Q108r007o88j8337L102j0363
13836C5587k0143n4350Q340K5461N0603J6622j9752J1781K4352j0489j0368o756
13824E0888j244q246k0940k2348L4845L1416n669o4278J5330K8760j8198m8532
13812b8216O51k5283L2802M130k1229J7968K5109q092m3696L052L7379O5302R861
13799F9738l2642m2162L5494o714m46k6419k975j6915q959O935J0462J4058j5823
13786a6368K6245K7737K2173j9685l7984j8755J866o160l2867j2045j3505J3706
$$ plain form
13774 -65642 4852 -3195 -16507 -5725 -15185 -34204 1200 -386 -9105 39891 52727 80799
13762 80799 81963 28972 27058 -28291 -35270 4495 29994 21636 -26727 -38408 -3194 -24958
13750 -24958 -29066 2296 15617 13446 -4051 -45693 -29983 -2440 -17756 -33584 11519 5337
13738 5337 -38543 -43528 -15382 23585 35106 60005 69308 51357 41320 24404 25749 57014
13726 57014 22642 3571 11281 6961 -12809 -3279 41768 72961 56644 -547 16593 -17156
13714 -17156 -70819 -108047 -84531 -23274 25285 25744 16177 3982 -15187 21315 39635 58533
13702 58533 63006 80578 119692 121052 74945 17221 -7868 -25573 -48343 -20970 2243 63937
13690 63937 69846 -7126 -20630 -31061 -41548 -50976 -65402 -63129 -37120 -37234 -50067 -20794 -21936
$$ packed form
13774f5642P0494q047j3312J0782r460j9019L5404j586q719M8996J2836K8072
13762H0799J164n2991j914n5349o979L9765K5499q358m8363j1681L5214k1764
13750b4958m108L1362J3321k171j7497m1642J5710K7543j5316j5828M5103o182
13738E337m3880m985K8146L8967J1521K4899R303j7951j0037j6916J345L1265
13726E7014l4372j9071P710m320j9770R530M5047L1193j6317n7191J7140l3749
13714a7156n3663l7228K3516O1257M8559M59r567j2195j9169L6502J8320J8898
13702E8533M473J7572L9114J360m6107n7724k5089j7705k2770K7373K3213O1694
13690F3937N909p6972j3504j0431j0487r428j4426K273K6009j14j2833K9273j142
$$ plain form
13677 -21936 -2365 23357 44847 42845 70702 76750 26827 2197 -16432 -8825 -14545 -32757
13665 -32757 -16600 -14405 -821 -403 -8094 -30193 -27982 6335 5632 16267 13140 4422 10521 21822
13651 21822 46291 49412 30996 33230 58742 46555 16794 19008 33563 41116 58428 44402
13639 44402 -21550 -7862 5045 -62771 -86438 -19216 -406 -26394 -7034 15466 19075 -11898
13627 -11898 -10345 26706 14136 -39199 -31882 21903 50653 38804 34848 -22543 -38023 -1895
13615 -1895 9070 40073 59818 77761 101842 74209 35111 26091 16928 -8859 -40973 -49558
13603 -49558 -9732 26131 30709 16691 36925 34839 33638 9494 -12993 -45048 -48345 -44052 -49962
13590 -49962 -29801 14280 39612 18392 -16572 4798 44897 65212 35577 37826 18627 -6314
$$ packed form
13677b1936J9571K5722K1490k002K7857O048m9923k4630j8629P607n720j8212
13665c2757J6157K195J3584M18p691k2099K211L4317p03J0635l127q718O099J1301
13651B1822K4469L121j8416K234K5512j2187k9761K214J4555P553J7312j4026
13639D4402o5952J3688J2907o7816k3667O7222J8810k5988J9360K2500L609l0973
13627a1898J553L7051j2570n3335P317N3785K8750j1849l956n7391j5480L6128
13615a895J0965L1003J9745J7943K4081k7633l9098r020r163k5787l2114q585
13603d9558L9826L5863M578j4018K0234k086j201k4144k2487l2055l297M293n910
13590d9962K0161M4081K5332k1220l4964K1370M0099K0315k9635K249j9199k4941
$$ plain form
13578 -6314 -4565 -25381 -34177 -14438 -4559 -13654 159 18950 25468 12104 22254 -5733 -12496
13565 -12496 2480 41193 40311 39025 63761 55510 38233 20671 -18203 -27689 -5012 39821 26220
13552 26220 -7642 837 -22379 -23075 -12980 12366 11251 -2309 -16078 6006 -2709 -20373 13379
13539 13379 -7862 -37064 -22642 4693 -23659 -74660 -44739 12012 64318 94767 98572 86555
13527 86555 63160 76431 99179 73249 60624 25608 41936 50694 11912 -46930 -16141 777
13515 777 -9996 -18781 28638 31191 31755 15502 -30473 -43631 -25581 -47769 -33010 -27054 -28338
13502 -28338 -41625 2748 5552 11275 21622 -10646 -30199 -26414 -22881 14282 4707 23004 14545
13489 14545 36681 39444 22967 -4466 10756 24060 44062 36248 18793 -14873 17789 15015
$$ packed form
13578f314J749k0816q796J9739R879r095J3813J8791O518j3364J0150k7987o763
13565a2496J4976L8713q82j286K4736q251j7277j7562l8874r486K2677M4833j3601
13552B6220l3862Q479k3216o96J0095K5346j115j3560j3769K2084q715j7664L3752
13539A3379k1241k9202J4422K7335k8352n1001K9921N6751N2306L0449L805j2017
13527H6555k3395J3271K2748k5930j2625l5016J6328Q758l8782n8842L0789J6918
13515G77j0773q785M7419K553N64j6253m5975j3158J8050k2188J4759N956j284
13502b8338j3287M4373K804N723J0347l2268j9553L785L533L7163r575J8297q459
13489A4545K2136K763j6477k7433J5222J3304K0002p814j7455l3666L2662k774
$$ plain form
13477 15015 -14036 -12097 -19266 -58067 -50077 872 1081 -30542 -16589 -216 7086 14013 29441
13464 29441 23238 7825 28931 18829 -29016 -53260 -41883 -28668 -41974 -26513 -28401 -69509
13452 -69509 -85064 -97578 -116161 -91216 -87377 -52085 25922 27834 26358 6560 -7697 18736
13440 18736 -29092 -27915 17087 48640 46367 45992 27140 21133 17585 -25635 -17817 45056 101042
13427 101042 112974 57271 6101 13595 50444 28873 45476 54185 44846 41620 21884 23306
13415 23306 7376 31113 67470 40666 -13179 -29208 -52024 -16006 7706 8886 2564 16545
13403 16545 38208 36725 1272 -21178 -37824 -45330 -24540 -13942 -4184 18543 16113 17703 36663
13390 36663 17784 -446 52769 86972 62525 22351 23262 6447 -28010 -17151 -13296 4990
$$ packed form
13477A5015k9051J939p169l8801P990N0949K09l1623J3953J6373P302O927J5428
13464B9441o203j5413K1106j0102m7845k4244J1377J3215j3306J5461j888m1108
13452f9509j5555j2514j8583K4945L839L5292P8007J912j476j9798j4257K6433
13440A8736m7828J177M5002L1553k273l75j8852o007l548m3220P818O2873N5986
13427A01042J1932n5703n1170P494L6849k1571J6603Q709r339l226j9736J422
13415B3306j5930K3737L6357k6804n3845j6029k2816L6018K3712J180o322J3981
13403A6545K1663j483l5453k2450j6646p506K0790J0598R758K2727k430J590J8960
13390C6663j8879j8230N3215L4203k4447m0174R11j6815l4457J0859L855J8286
$$ plain form
13378 4990 1053 16455 77865 81475 40686 38522 47230 18625 33222 22547 20092 -1553 -16442
13365 -16442 -9065 31715 72800 30114 -34518 -18146 -38421 -59940 -74793 -81014 -45495 64610
13353 64610 57855 24710 7699 -31960 -47480 -53275 -33085 -47524 -91959 -57145 -44919 -61571
13341 -61571 -60654 -34673 22069 41820 60294 63583 37556 12108 -11646 -19931 -2169 -10229 -7154
13328 -7154 -5264 -17303 12992 -32722 -50152 -37332 -17272 -43913 -37875 4278 41 16411
13316 16411 37403 4212 4606 -22387 -43147 -8655 -6170 -702 -12993 -22019 -63416 -81124 -58907
13303 -58907 -23559 -2918 -37496 -50871 -6393 32400 46584 58035 58473 20315 -38014 -45314
13291 -45314 -12990 -9895 -23541 -35195 -9464 -26139 -21085 -37672 -67900 -41756 10618 61708
$$ packed form
13378D990l937J5402O1410L610m0789k164Q708k8605J4597j0675k455k1645j4889
13365a6442P377M0780M1085m2686o4632J6372k0275k1519j4853o221L5519J10105
13353F4610o755l3145j7011l9659j5520n795K0190j4439m4435L4814J2226j6652
13341f1571R17K5981N6742J9751J8474L289k6027k5448k3754q285J7762q060L075
13328g154J890j2039L0295m5714j7430J2820K0060k6641O038M2153m237J6370
13316A6411K0992l3191L94k6993k0760L4492K485N468j2291r026m1397j7708K2217
13303e8907L5348K0641l4578j3375M4478L8793J4184J1451M38l8158n8329p300
13291d5314L2324L095j3646j1654K5731j6675N054j6587l0228K6144N2374N1090
$$ plain form
13279 61708 48543 32416 25413 3428 870 14266 30045 47146 20736 10884 -15346 -54956
13267 -54956 15826 66653 51806 13762 -6139 33612 85197 91793 72516 15639 1178 -13951
13255 -13951 -28390 -58861 -91643 -67245 -36916 2212 2809 -624 26691 14841 3264 -105
13243 -105 6696 3753 -11787 -11169 -42831 -75300 -61303 -51480 -11985 37119 41559 -3485 -26201
13230 -26201 13406 -8299 -18777 2071 7721 19791 16418 -29562 -27737 -7654 -8552 12253 47833
13217 47833 35518 15394 -5667 -20417 -11714 32188 18420 13080 -10634 9205 15538 29496
13205 29496 4501 14772 16539 19808 818 -6188 4272 25352 39950 30399 21709 4815 13106
13192 13106 37656 32450 -532 -7978 -2887 1681 12919 55924 64865 7364 11497 25934 -1423
$$ packed form
13279F1708j3165j6127p003k1985k558J3396J5779J7101k6410r852k6230l9610
13267e4956P0782N0827j4847l8044j9901L9751N1585O596j9277n6877j4461j5129
13255a3951j4439l0471l2782K4398L0329L9128N97l433K7315j1850j1577l369
13243a05O801k943j5540O18l1662l2469J3997R823L9495M9104M440m5044k2716
13230b6201L9607k1705j0478K0848N650J2070l373m5980J825K0083q98K0805L5580
13217D7833j2315k0124k1061j4750Q703M3902j3768n340k3714J9839O333J3958
13205B9496k4995J0271J767L269j8990p006J0460K1080J4598r551q690j6894Q291
13192A3106K4550n206l2982p446N091M568J1238M3005Q941n7501M133J4437k7357
$$ plain form
13179 -1423 -8738 -29352 -31161 -21582 -19907 1331 -11441 -22677 -53186 -45003 -45743 -36878 -35667 -20494
13165 -20494 -14639 1023 18074 26019 24104 10019 -3372 -7064 -9895 28138 33962 15533 -1302
13152 -1302 -42357 -88698 -79740 -47953 -20116 20305 45997 24427 27058 57790 62723 18762
13140 18762 25476 42943 32905 -5799 -26143 -380 28323 21025 30060 50241 69115 91884
13128 91884 81060 90078 56980 73819 83916 84355 39757 35304 36177 59779 12299 -29819 -27139
13115 -27139 -41041 -62463 -45015 -21847 -8832 -13313 10181 -7973 -28027 -50364 -34385 -4295
13103 -4295 51587 72591 83019 67152 32076 15610 -26992 -93957 -66413 -42228 -37710 -43650
13091 -43650 476 62917 32903 -6052 -790 12077 19349 28405 7670 -10490 -29045 -5000
$$ packed form
13179a423p315k0614j809R579J675K1238j2772j1236l0509Q183p40Q865J211J5173
13165b0494N855J5662J7051P945j915j4085j3391l692k831L8033N824j8429j6835
13152a302m1055m6341Q958L1787K7837M0421K5692k1570K631L0732M933m3961
13140A8762O714J7467j0038l8704k0344K5763K8703p298R035K0181J8874K2769
13128I1884j0824R018l3098J6839J0097M39m4598m453Q73K3602m7480m2118K680
13115b7139j3902k1422J7448K3168J3015m481K3494j8154k0054k2337J5979L0090
13103d295N5882K1004J0428j5867l5076j6466m2602o6965K7544K4185M518n940
13091d3650M4126O2441l0014l8955N262J2867P272R056k0735j8160j8555K4045
$$ plain form
13079 -5000 -20947 -26015 -29295 -29294 -31566 -48546 -47692 -34224 -72411 -59970 -63594 -57239 -75387 -123048
13065 -123048 -87938 -41714 -23077 -20048 17477 35352 29543 60156 101314 68258 41798 16638
13053 16638 -10246 -1717 11017 -2132 -19560 -19170 4326 10420 -11767 37057 55371 60311 72538
13040 72538 45986 49642 47092 40032 7712 -19021 -65365 -4292 42448 38232 48752 27549
13028 27549 5979 28513 60816 35265 -4385 -12369 7450 -6329 -14966 15143 23122 -5662
13016 -5662 -12271 -49384 -81475 -72383 -54575 -24008 9926 12326 16584 -5217 -45534 -54123 -33619
13003 -33619 3582 30051 -9119 -81000 -100310 -79350 -33974 -467 48151 13169 -9746 -6935
12991 -6935 -5706 4642 -9334 -37855 -44925 -77109 -111723 -109653 -92903 -17588 -7518 -61623
$$ packed form
13079e000j5947n068l280Jk272j6980Q54J3468l8187J2441l624O355j8148m7661
13065a23048L5110M6224J8637L029L7525J7875n809L0613M1158l3056k6460k5160
13053A6638k6884Q529J2734j3149j7428L90K3496O094k2187M8824J8314M940J2227
13040G2538k6552L656k550p060l2320k6733m6344O1073M6740m216J0520k1203
13028B7549k1570K2534L2303k5551l9650p984J9819j3779q637L0109P979k8784
13016e662o609l7113l2091R092J7808L0567L3934K400M258k1801m0317q589K0504
13003c3619L7201K6469l9170p1881j9310K0960M5376L3507M8618l4982k2915K811
12991f935J229J0348j3976k8521p070l2184l4614K070J6750P5315J0070n4105
$$ plain form
12979 -61623 -62503 -38455 -19973 1594 57312 78204 36540 67309 34016 11912 39241 58735
12967 58735 55657 26834 23030 7015 -36847 -45531 5340 65154 81433 49751 17438 19908
12955 19908 31165 30263 -6175 -31767 -36356 -23623 -20235 -17533 -70707 -83435 -70643 -48636 -12378
12942 -12378 1184 16089 29789 31215 54673 36886 -3493 -39686 -27245 -10701 -11136 22328
12930 22328 26657 17555 12947 41353 43749 35750 45146 64155 53510 53057 36299 30555 -23367
12917 -23367 -33126 -32394 3790 10263 7485 26396 48414 21201 15034 30952 54519 80593 68798
12904 68798 25796 -27558 -26882 -25742 -42461 -42823 -47273 -21549 -22712 -12542 3726 26262 40306
12891 40306 23598 53521 35352 28480 -24906 -46062 -26416 -14738 -43627 -21204 6989 -3946
$$ packed form
12979f1623q80K4048J8482K1567N5718K0892m1664L0769l3293k2104K7329J9494
12967E8735l078k8823l804j6015m3862q684N0871N9814J6279l1682l2313K470
12955A9908J1257r02l6438k5592m589J2733L388K702n3174j2728J2792K2007L6258
12942a2378J3562J4905J3700J426K3458j7787m0379l6193J2441J6544m35L3464
12930B2328M329r102m608K8406K396p999R396J9009j0645m53j6758n744n3922
12917b3367r759P32L6184O473k778J8911K2018k7213o167J5918K3567K6074j1795
12904F8798m3002n3354O76J140j6719l62m450K5724j163J0170J6268K2536J4044
12891D0306j6708K9923j8169o872n3386k1156J9646J1678k8889K2423K8193j0935
$$ plain form
12879 -3946 6089 34378 42574 11830 -19021 -23252 -15693 -23243 -33116 -36848 -26045 4590 11517
12866 11517 -7656 -24946 -58481 -65693 -12055 -17239 -12605 -12190 -40354 -37886 -12837 -10813 -11807
12853 -11807 -34034 -15214 -22532 -46928 -37781 14461 20906 24473 42882 67336 62863 5416 -16925
12840 -16925 12812 10357 8436 -20668 -45613 -65674 -98697 -105157 -78755 -115647 -102473 -43816
12828 -43816 -13009 -9350 -13492 900 36921 28496 24640 23072 43515 46777 20872 -20923 -46565
12815 -46565 -39622 -30669 -10517 -22579 -47336 -41940 -18831 -14965 -3839 60717 48529 -36852
12803 -36852 -20374 -28216 -59377 -21068 13504 -8995 -49129 -38134 -4616 -26072 10066 32218
12791 32218 54174 68293 76224 65472 62496 4114 -44579 -14211 39433 39924 -9240 -32766
$$ packed form
12879c946J0035K8289Q196l0744l0851m231P559p550r873l732J0803L0635O927
12866A1517j9173j7290l3535p212N3638n184M634M15k8164K468K5049K024r94
12853a1807k2227J8820p318k4396R147N2242O445L567J8409K4454m473n7447k2341
12840a6925K9737k455j921k9104k4945k0061l3023o460K6402l6892J3174N8657
12828d3816L0807L659m142J4392L6021q425l856j568K0443L262k5905m1795k5642
12815d6565O943Q953K0152j2062k4757N396K3109L866J1126O4556j2188q5381
12803c6852J6478p842l1161L8309L4572k2499m0134J0995L3518k1456L6138K2152
12791C2218K1956J4119P931j0752k976n8382m8693L0368N3644M91m9164k3526
$$ plain form
12779 -32766 -20627 5024 -24196 -23452 -28407 -59572 -82838 -30926 14692 44119 41574 56493
12767 56493 38814 216 -2812 12329 5899 -15435 -6020 -6416 -21126 -977 12568 10991 -15489
12754 -15489 -9409 -13789 7189 23757 7275 -36282 -45772 -10551 -19228 950 2621 2420 13109
12741 13109 29458 16972 25702 7405 12217 16401 -10265 -2526 26071 -3740 -14579 7273
12729 7273 2442 18643 9187 16829 16100 37813 62920 53595 -33308 -51020 -16247 15997 4132
12716 4132 -41967 -46813 -35405 -17446 -33443 -21122 22293 -1511 -17110 5106 -3025 28605
12704 28605 49329 45728 18166 28612 11950 -31464 -62862 -58400 -38807 -48853 -49712 -21960
12692 -21960 -35843 -23510 -17936 -30375 -31194 -20138 -16613 21239 39383 40147 16892 24523 22585
$$ packed form
12779c2766J2139K5651k9220P44m955l1165k3266N1912M5618K9427k545J4919
12767E6493j7679l8598l028J5141o430k1334R415l96j4710K0149J3545j577k6480
12754a5489O080m380K0978J6568j6482m3557r490L5221q677K0178J671k01J0689
12741A3109J6349j2486Q730j8297M812M184k6666P739K8597k9811j0839K1852
12729G273m831J6201r456P642p29K1713K5107r325q6903j7712L4773L2244j1865
12716D132m6099m846J1408J7959j5997J2321M3415k3804j5599K2216q131L1630
12704B8605K0724l601k7562J0446j6662m3414l1398M462J9593j0046q59K7752
12692b1960j3883J2333N574j2439q19J1056L525L7852J8144P64k3255P631j938
$$ plain form
12679 22585 1658 30216 81885 81752 117650 91979 80928 52085 67815 29537 11045 18998
12667 18998 39204 42318 26214 24093 49485 41333 18173 33749 60297 74613 31919 -16883
12655 -16883 -19926 -24809 -30811 -67712 -120021 -115055 -71897 -53189 -9506 40878 56030 22211
12643 22211 8141 29128 200 -7427 3095 -481 -31545 -90329 -105773 -63928 -32208 -38888
12631 -38888 -55485 -26888 -31679 24744 57986 25415 17974 19818 6227 13576 35887 31185 28641
12618 28641 36811 29914 11745 25962 43872 75086 49494 42504 57080 37840 58650 59520 -6862
12605 -6862 -24268 -5837 25882 34603 21425 33680 -37255 -52649 8501 29059 32411 -7969
12593 -7969 -2045 21127 30931 50801 33608 8093 15756 -2074 -46689 -40142 -40636 -79483 -82929
$$ packed form
12679B2585k0927K8558N1669j33L5898k5671j1051k8843J5730l8278j8492P953
12667A8998K0206L114j6104k121K5392q152k3160J5576K6548J4316m2694m8802
12655a6883l043m883o002l6901n2309M966M3158J8708M3683N0384J5152l3819
12643B2211j4070K0987k8928p627J0522l576l1064n8784j5444M1845L1720o680
12631c8888j6597K8597m791N6423L3242l2571p441J844j3591P349K2311m702k544
12618B8641Q170o897j8169J4217J7910L1214k5592o990J4576j9240K0810Q70o6382
12605f862j7406J8431L1719Q721j3178J2255p0935j5394O1150K0558L352m0380
12593g969N924K3172R804J9870j7193k5515P663j7830m4615O547m94l8847l446
$$ plain form
12580 -82929 -80184 -85274 -71188 -58975 -59278 -29577 8214 12152 52050 59370 33741 -12869 -38197
12567 -38197 -11513 9428 22360 28816 -880 -11066 -28103 -36949 -56256 -23262 18467 55350
12555 55350 22423 -6938 -20010 -70878 -63164 -5735 25267 31417 52424 50862 -2131 -34737
12543 -34737 -29043 -24856 -21973 -28590 1552 -5737 -4054 4103 576 1052 -16690 -53583 -32689 -10369
12529 -10369 37906 25858 19171 31838 7667 -14431 6878 39499 29577 -5008 -32440 -26169
12517 -26169 -22691 -14803 -19431 8428 31979 38952 34205 55020 37731 39561 29920 27549 14848
12504 14848 4212 -19971 -8597 10224 34464 19384 -28906 -60831 -68429 -40236 -16237 5624
12492 5624 7133 -19059 -52909 -56281 -65897 -44805 -10645 5541 13669 -37075 -33085 -23418 -66744
$$ packed form
12580h2929K745n090J4086J2213l03K9701L7791L938L9898P320k5629m6610k5328
12567c8197K6684K0941J2932O456k9696j0186j7037q846j9307L2994M1729L6883
12555E5350l2927k9361j3072n0868P714N7429L1002O150K1007j562n2993l2606
12543c4737N694M187K883o617L0142p289J683Q157l527M76j7742l6893K0894K2320
12529a0369M8275j2048o687J2667k4171k2098K1309L2621r922l4585k7432O271
12517b6169L478P888m628K7859K3551O973m747K0815j7289J830r641k371j2701
12504A4848j0636k4183J1374J8821K4240j5080m8290l1925p598K8193K3999K1861
12492E624J509k6192l3850l372r616K1092L4160J6186Q128n0744L990R667m3326
$$ plain form
12479 -66744 -68090 -57191 -50925 -51526 -46936 -9319 -44280 -43637 8080 38002 39047 19766 -30435
12466 -30435 -68292 -40062 -11524 7404 50074 35610 6853 9506 15749 24260 31406 58848
12454 58848 83705 83045 65047 4044 -21173 -1643 25789 2795 -4764 -3205 -37780 -18100
12442 -18100 53820 38765 21597 35082 5116 -10050 -9754 28185 7363 -37688 -54909 -84434
12430 -84434 -95346 -131305 -130265 -82909 -37920 -66715 -102061 -105580 -96190 -49564 -40972 -22048
12418 -22048 -2288 11260 42342 58221 39485 -2318 -41813 -35540 -4103 44378 54264 35981
12406 35981 17767 26209 60087 36022 24165 13735 41389 63978 52333 72830 82551 73502
12394 73502 61447 25738 42121 46122 41664 11920 -39305 -45626 -12833 -28024 -51231 -38156
$$ packed form
12479f6744j346J0899O266o01M590L7617l4961O43N1717K9922J045j9281n0201
12466c0435l7857K8230K8538J8928M2670j4464k8757K653O243Q511P146K7442
12454E8848K4857o60j7998o1003k5217J9530K7432k2994p559J559l4575J9680
12442a8100P1920j5055j7168J3485k9966j5166K96L7939k0822m5051j7221k9525
12430h4434j0912l5959J040M7356M4989k8795l5346l519R390M6626Q592J8924
12418b2048J9760J3548L1082J5879j8736m1803l9495O273L1437M8481R886j8283
12406C5981j8214Q442L3878k4065j1857j0430K7654K2589j1645K0497R721r049
12394G3502j2055l5709J6383M001m458k9744n1225o321L2793j5191k3207J3075
$$ plain form
12382 -38156 -22890 -9936 -48946 -68517 -43571 -43468 -11323 -8381 -41840 -73910 -59973 -22300
12370 -22300 -11797 -22978 -20426 -13601 -41973 -15303 49328 52690 -1140 -16274 23488 26424
12358 26424 -20763 -67697 -56709 -55910 -89251 -30206 34995 43347 -6317 -57309 -67760 -58480
12346 -58480 -50061 -51 8210 -35352 -52781 -80159 -79354 -25261 436 19401 -22041 -42551
12334 -42551 -13430 2217 -15565 -23458 -11393 -6856 -12496 2212 27670 20002 -3884 3731 23073
12321 23073 54851 35280 659 -12602 -24149 -45795 -41186 -47894 -13644 7598 -29978 -55904
12309 -55904 -18290 8368 5819 7571 45758 111218 129303 118028 104458 53607 25594 -12872
12297 -12872 7341 11661 -12788 -18137 3629 60350 111531 66039 22093 19209 31827 3057
$$ packed form
12382c8156J5266J2954l9010j9571K4946J03L2145K942l3459l2070J3937L7673
12370b2300J0503j1181K552O825k8372K6670O4631L362n3830j5134L9762K936
12358B6424m7187m6934J0988P99l3341N9045O5201Q352m9664n0992j0451R280
12346e8480Q419N0010Q261m3562j7429k7378Q05N4093K5697J8965m1442k0510
12334d2551K9121J5647j7782p893J2065M537n640J4708K5458p668k3886P615J9342
12321B3073L1778j9571l4621j3261j1547k1646M609o708L4250K1242l7576k5926
12309e5904L7614K6658k549J752L8187O5460J8085j1275j3570n0851k8013l8466
12297a2872K0213M320k4449n349K1766N6721N1181m5492m3946k884J2618k8770
$$ plain form
12285 3057 -5487 -19582 -20564 -13488 -13343 -38937 -3065 27622 33729 53736 -7950 -47435 -65294
12272 -65294 -57213 -69335 -78858 -68493 -37637 -34007 8873 1512 -44816 -53989 -92436 -70078 -19045
12259 -19045 -5979 16866 11523 6544 13783 13775 -8819 -9801 7925 -2839 -4263 -13960 -17690 -18381
12245 -18381 -25643 -29081 -24057 5308 2557 -11853 4785 31190 38235 -29500 -43082 -35819 -32358
12232 -32358 -53797 -56669 -52159 -45549 -39960 -50983 -17987 -12276 -46256 -51150 -29973 -59085 -35985
12219 -35985 13348 44743 66582 64781 32983 11233 27619 47182 77998 116517 108297 67229
12207 67229 37741 45141 57949 60680 58199 69156 84613 74894 28612 35901 46216 54921 63073
12194 63073 27308 21346 44573 31441 35453 30047 26508 69003 51281 34098 8775 -31386
$$ packed form
12285C057q544j4095r82P076J45k5594L5872L0687O107K0007o1686l9485j7859
12272f5294Q081j2122r523J0365L0856L630M2880p361m6328r173l8447K2358N1033
12259a9045J3066K2845n343m979P239qk2594r82J7726j0764j424r697l730o91
12245a8381p262l438N024K9365k751j4410J6638K6405P045o7735j3582P263L461
12232c2358k1439k872M510O610N589j1023L2996N711l3980m894K1177k9112K3100
12219c5985M9333L1395K1839j801l1798k1750J6386J9563L0816L8519q220m1068
12207F7229k9488P400J2808K731k481J0957J5457r719m6282P289J0315Q705Q152
12194F3073l5765n962K3227j3132M012n406l539M2495j7722j7183k5323m0161
$$ plain form
12182 -31386 -4889 12020 18730 15581 9005 43988 69131 40994 33660 35767 31205 18925 17542
12169 17542 16270 22752 17811 12438 19518 4885 22889 19637 -43171 -67368 -45961 3383 1522
12156 1522 -3163 35815 38867 1515 -43773 -67331 -86298 -56569 5997 45964 35036 34632 22676
12143 22676 16555 46476 29785 33452 64299 23702 1506 -14331 -34425 -12626 -10638 -12696
12131 -12696 24654 -9953 -14262 15020 -20334 -52473 -38026 -3175 -21046 -21944 10009 7205
12119 7205 37750 42283 48671 73797 101029 46811 -4287 -13301 1673 10666 21017 -28097 -38270
12106 -38270 -47998 -66996 -10107 7351 42969 26547 30989 38596 48042 31394 8780 -52449
12094 -52449 -48797 -22791 -8248 -11127 3443 8267 58204 37571 10505 -20108 -14913 -22098 -40484
$$ packed form
12182c1386K6497J6909O710l149o576L4983K5143k8137p334K107m562j2280j383
12169A7542j272O482m941n373P080j4633J8004l252o2808k4197K1407M9344j861
12156A522m685L8978L052l7352m5288k3558j8967K9729O2566L9967j0928m04j1956
12143B2676o121K9921j6691L667L0847m0597k2196j5837k0094K1799J988k058
12131a2696L7350l4607m309K9282l5354l2139J4447L4851j7871q98L1953k804
12119G205L0545M533O388K5126K7232n4218n1098r014J4974Q993J0351m9114j0173
12106c8270r728j8998N6889J7458L5618j6422M442P607R446j6648k2614o1229
12094e2449L652K6006J4543k879J4570M824M9937k0633k7066l0613N195p185j8386
$$ plain form
12081 -40484 -67514 -46745 11579 60818 72938 54543 23607 25557 3425 -11349 -30782 -55395
12069 -55395 -18831 -326 3717 -22083 -59584 -75820 -25675 -15395 -37340 -25974 21168 17819
12057 17819 25071 19176 32576 8615 -30008 273 51800 48542 5428 -1528 20896 40749
12045 40749 48794 41588 27769 -16211 -1590 -6841 -29040 1353 12647 2723 28261 21234 23342
12032 23342 25873 40088 39047 16221 -20728 -44146 -27627 -1888 6790 44787 55928 9776
12020 9776 1304 -16856 -35107 -6078 -4441 28379 52450 33452 39133 9582 20257 15725 4644
12007 4644 -11059 -88465 -118166 -100072 -84963 -78668 -28335 7137 7285 -5612 -60488 -62940 -46242
11994 -46242 -8987 19376 -14192 -17373 -6365 9367 43786 39821 -14230 -37381 -58222 -35525
$$ packed form
12081d0484k7030K0769N8324M9239J2120j8395l0936J950k2132j4774j9433k4613
12069e5395L6564J8505M043k5800l7501j6236N0145J0280k1945J1366M7142l349
12057A7819P252n895J3400k3961l8623L0281N1527l258m3114o956K2424J9853
12045D0749Q045p206j3819m3980J4621n251k2199L0393J1294r924K5538p027K108
12032B3342K531J4215j041k2826l6949k3418J6519K5739Q678L7997J1141m6152
12020I776q472j8160j8251K9029J637L2820K4071j8998N681k9551J0675m532j1081
12007D644j5703p7406k9701J8094J5109O295N0333L5472J48j2897n4876k452J6698
11994d6242L7255K8363l3568l181J1008J5732L4419l965n4051k3151k0841K2697
$$ plain form
11982 -35525 -40151 -31968 -15011 -24138 -42673 -13546 -4893 -33863 -18730 1645 468 -35698 -23686
11969 -23686 56502 65610 48198 42472 23315 9854 -23522 471 -11295 1311 -15510 -10414
11957 -10414 -59495 -90950 -35861 -4198 21031 11929 -10826 -33060 -68031 -84844 -77129 -103796
11945 -103796 -55339 -721 17141 32260 40731 75110 85838 12790 8972 28099 55404 36780
11933 36780 34147 33868 4941 -6357 12869 19167 -27841 -68101 -24291 -25064 -85524 -88429 -41418
11920 -41418 -32177 -17109 -45599 -36422 11883 58872 52161 31748 51616 18470 6328 43507
11908 43507 87428 80062 41570 22995 -13979 -55152 -34174 -3546 12576 10156 36973 78140
11896 78140 104542 73875 1574 -10934 32075 67321 46468 12020 -688 -2413 -14280 -44701
$$ packed form
11982c5525m626Q183J6957r127j8535K9127Q653k8970J5133K0375j177l6166J2012
11969b3686Q0188R108j7412n726j9157j3461l3376K3993j1766J2606j6821N096
11957a0414m9081l1455N5089L1663K5229r102k2755k2234l4971j6813P715k6667
11945a03796M8457N4618J7862J5119Q471L4379J0728p3048l818J9127K7305j8624
11933C6780k633k79k8927j1298J9226O298m7008m0260M3810p73o0460k905M7011
11920d1418R241J5068k8490R177M8305M6989o711k0413J9868l3146j2142L7179
11908D3507M3921p366l8492j8575l6974m1173K0978L0628J6122k420K6817M1167
11896G8140K6402l0667p2301j2508M3009L5246k0853l4448j2708j725j1867l0421
$$ plain form
11884 -44701 -28767 -10546 25205 31153 -32328 -47682 -47724 -39446 -54721 -41196 -11230 3556 -10474
11871 -10474 13598 56129 47817 9546 -11983 7217 -4753 -10274 -25361 21231 74633 47332
11859 47332 32583 23041 24182 41773 66942 18990 1612 25045 32257 24077 -8235 -2550 -982
11846 -982 -31621 -25708 -8023 5195 -52104 -27799 2206 9232 29027 -13665 -47542 -20376
11834 -20376 13462 30745 -1394 -13585 7390 27348 23655 -14984 2974 -17946 -44863 -4561
11822 -4561 39937 44033 30800 20977 32863 43382 37951 -2377 -1711 2564 -26270 -14666 23283
11809 23283 54218 60210 17437 -58004 -85232 -50663 -37781 13497 46999 28731 -42283 -36315
11797 -36315 5466 31538 -27405 -66491 -58836 -22884 15701 42782 52227 50492 43067 25564
$$ packed form
11884d4701J5934J8221L5751N948o3481j5354m2Q278j5275J3525K9966J4786j4030
11871a0474K4072M2531q312l8271k1529J9200j1970n521j5087M6592N3402k7301
11859D7332j4749r542J141J7591K5169m7952j7378K3433P212q180l2312N685J568
11846i82l0639N913J7685J3218n7299K4305L0005P026J9795m2692l3877K7166
11834b0376L3838J7283l2139j2191K0975J9958l693l8639J7958k0920k6917M0302
11822d561M4498M096j3233r823J1886J0519n431m0328O66M275k8834J1604L7949
11809B3283L0935N992m2773p5441k7228L4569J2882N1278L3502j8268p1014N968
11797c6315M1781K6072n8943l9086P655L5952L8585K7081R445j735p425j7503
$$ plain form
11785 25564 19110 10972 22490 -805 -32491 -44872 -61805 -26463 -17455 -11653 -35207 -42729 -17453
11772 -17453 -839 -19794 -14490 741 42831 50763 10548 -1488 -17005 8122 27619 49207
11760 49207 52749 65887 42333 34976 36010 31784 11861 -14707 -61997 -44060 -51318 -64601 -17194
11747 -17194 5927 60561 82983 67015 67102 22368 -21523 -23651 -30035 -44055 -12874 3492 -4176
11734 -4176 -5779 -20207 -50520 -41978 -10149 -6552 -49251 -76214 -87923 -42422 -17472 -34405
11722 -34405 -63372 -77209 -53967 -40905 -45965 -67424 -18465 15098 35030 36202 16007 2765
11710 2765 -5747 -14670 -14436 -1323 14293 -8860 -51217 -9691 44838 17288 -8720 -19109 4898
11697 4898 72890 117303 111577 82407 67183 76518 66458 81524 90092 63817 12395 -1339
$$ packed form
11785B5564o454q138J1518k3295l1686j2381j6933L5342R008N802k3554p522K5276
11772a7453J6614j8955N304J5231M2090P932m0215j2036j5517K5127J9497K1588
11760D9207L542J3138k3554p357J034m226j9923k6568m7290J7937p258j3283M7407
11747a7194K3121N4634K2422j5968Q7m4734m3891k128o384j4020L1181J6366p668
11734d176j603j4428l0313Q542L1829L597m2699k6963j1709M5501K4950j6933
11722c4405k8967j3837K3242J3062n060k1459M8959L3563J9932J172k0195j3242
11710B765q512q923K34J3113J5616k3153m2357M1526N4529k7550k6008j0389K4007
11697D898O7992M4413n726k9170j5224R335j0060J5066Q568k6275n1422j3734
$$ plain form
11685 -1339 13359 57007 58387 63412 70110 41921 29927 26215 4830 -40195 -78258 -92223 -90347
11672 -90347 -44802 -25765 -42189 -17684 -5409 -7711 44177 80177 125580 97176 68068 48448
11660 48448 -4246 -51936 -47624 -14961 21004 30766 22077 -11964 -33468 -10262 16827 19259
11648 19259 61076 81923 79439 55070 42044 10679 -49304 -3704 31811 48157 53239 57639
11636 57639 17741 15613 16058 46970 35683 19281 -12556 24491 27575 22516 -12399 -36719 -16145
11623 -16145 -38469 -70541 -77281 -88577 -41943 -11045 -35015 -9953 3482 9751 31609 60979
11611 60979 19214 -46456 -37296 -25259 1138 35111 7219 -25031 -50135 -26087 30254 32320
11599 32320 -10195 -36340 -3745 41471 41743 26534 -19644 -21185 19996 -18391 -2805 35889
$$ packed form
11685a339J4698M3648J380N025O698k8189j1994l712k1385m5025l8063j3965J876
11672i0347M5545J9037j6424K4505J2275k302N1888L6000M5403k8404k9108j9620
11660D8448n2694m7690M312L2663L5965R762q689l4041k1504K3206K7089K432
11648A9259M1817K0847k484k4369j3026l1365n9983M5600L5515J6346N082M400
11636E7639l9898k128M45L0912j1287j6402l1837L7047L084n059l4915k4320K0574
11623a6145k2324l2072o740j1296M6634L0898k3970K5062J3435O269K1858K9370
11611F0979m1765o5670R160J2037K6397L3973k7892l2250k5104K4048N6341K066
11599C2320m2515k6145L2595M5216K72j5209m6178j541M1181l8387J5586L8694
$$ plain form
11587 35889 74509 89525 80774 98573 92642 68656 28385 75847 74546 94311 94662 55313 65910
11574 65910 41394 50631 53957 -15936 -15274 4858 31031 -5317 -68144 -82990 -74869 -55496 -27402
11561 -27402 5828 15990 52715 100437 89993 74747 67892 22550 26896 62614 32009 -47517
11549 -47517 -49141 3985 -14267 -18342 -12798 -6311 26496 44198 14237 -3954 -15559 -43532
11537 -43532 -64218 -21696 17742 11933 -13035 -13799 -19737 -32414 -8364 8270 15218 36935 76592
11524 76592 39504 6502 -3417 -3028 -27674 16290 30377 37713 10487 -24652 -16621 24388 42217
11511 42217 63886 57400 34137 3049 -9793 27897 44364 -10904 -27853 -45164 -32281 -3249
11499 -3249 23555 16593 -25493 14649 64894 64799 45194 50738 42678 29052 -1347 19571 35802
$$ packed form
11587C5889L8620J5016q751J7799n931k3986m0271M7462j301J9765L51l9349J0597
11574F5910k4516R237L326o9893O62K0132K6173l6348o2827j4846Q121J9373K8094
11561b7402L3230J0162L6725M7722j0444j5246o855m5342M346L5718l0605p9526
11549d7517j624N3126j8252m075N544O487L2807J7702k9961j8191j1605k7973
11537d3532k0686M2522L9438n809k4968p64n938j2677K4050J6634O948K1717L9657
11524G6592l7088l3002r919L89k4646M3964J4087P336k7226l5139Q031M1009J7829
11511D2217K1669o486k3263l1088j2842L7690J6467n5268j6949j7311J2883K9032
11499c249K6804o962m2086M0142N0245r5j9605N544q060j3626l0399K0918J6231
$$ plain form
11486 35802 27346 30939 42142 32432 31742 31888 12242 -11263 -61263 -79606 -46143 -13385 -58570
11473 -58570 -62558 -24134 1626 11136 11064 -1796 -24242 -25535 -42209 -45918 31208 88305 91608
11460 91608 93703 41546 16023 14940 11477 14008 58092 51690 10849 -14077 -3333 -20105 -80453
11447 -80453 3081 36615 24070 36233 12811 -4689 39610 83036 47849 12610 15529 19562
11435 19562 15607 -1123 -31276 -20175 3467 20117 11795 13646 13124 81146 101062 54872 42459
11422 42459 66624 68303 30939 46831 51572 45664 59285 44407 -6658 -45598 -45990 -11160 7708
11409 7708 11022 11145 46651 82030 41842 21553 25338 10491 50098 29439 35021 35494 10991
11396 10991 -18975 -39602 2476 23256 -1265 -30242 -41246 -69353 -11719 -4729 1903 8216
$$ packed form
11486C5802q456L593J1203r710o90J46j9646k3505n0000j8343L3463L2758m5185
11473e8570l988L8424K5760R510p2j2860k2446j293j6674l709P7126N7097L303
11460I1608K095n2157k5523j083l463K531M4084o402m0841k4926J0744j6772o0348
11447h0453Q3534L3534j2545J2163k3422j7500M4299M3426l5187l5239K919M033
11435A9562l955j6730l0153J1101K3642J6650q322J851n22O8022J9916m6190j2413
11422D2459K4165J679l7364J5892M741n908J3621j4878n1065l8940l92L4830J8868
11409G708L314J23L5506L5379m0188k0289L785j4847L9607k0659N582M73k4503
11396A0991k9966k0627M2078K0780k4521k8977j1004k8107N7634O990O632O313
$$ plain form
11384 8216 18574 66438 55011 59195 41260 3864 -19688 -45850 -4502 40714 29842 12469
11372 12469 38517 40418 12095 3291 750 -5634 24515 51638 76275 62783 -2806 -43825
11360 -43825 -57839 -53641 -21008 1712 26980 -12970 -68665 -42184 4204 5483 -12929 -57669
11348 -57669 -62477 -25166 -323 18309 -15244 3294 -11140 -28048 -21024 18658 49486 36571
11336 36571 13578 -9345 5842 54819 51531 39255 47418 38241 31388 44452 -10719 -37773
11324 -37773 -23313 19804 54460 37267 19728 -9411 9861 14589 -3214 22498 63224 58698
11312 58698 65139 23294 -18663 -21822 -10822 34207 48038 11654 12666 25202 17174 2333
11300 2333 -7302 4007 -5477 -20574 -30435 -18854 -6150 -15357 -38659 -65930 -60623 -35432 -13824
$$ packed form
11384H216J0358M7864j1427M184j7935l7396k3552k6162M1348M5216j0872j7373
11372A2469K6048J901k8323q804k541o384L0149K7123K4637j3492o5589m1019
11360d3825j4014M198L2633K2720K5268l9950n5695K6481M6388J279j8412m4740
11348e7669m808L7311K4843J8632l3553J8538j4434j6908P024L9682L0828j2915
11336C6571k2993k2923J5187M8977l288j2276Q163r177o853J3064n5171k7054
11324c7773J4460M3117L4656j7193j7539k9139J9272M728j7803K5712M0726m526
11312E8698O441m1845m1957l159J1000M5029J3831l6384J012J2536q028j4841
11300B333r635J1309r484j5097r861J1581J2704r207k3302k7271N307K5191K1608
$$ plain form
11287 -13824 -20315 -37395 2354 -15131 -23402 522 21253 55910 86931 71448 65621 91498
11275 91498 78312 19486 -47211 -75512 -46961 -36613 9834 4173 -18449 -10961 -37999 -64110
11263 -64110 -82851 -81448 -73048 -51793 -20216 24579 12856 -20932 17075 8268 -27505 -22919
11251 -22919 -3320 34086 71827 76593 65939 69573 47976 32883 43299 -13298 -9415 -20102
11239 -20102 -28034 -5984 -3788 -35537 -55442 -47271 -66084 -90814 -43807 -27594 -43625 -60860
11227 -60860 -98947 -73036 -60832 -13458 43665 30150 -10177 -31063 -78817 -49884 -17030 -13681
11215 -13681 -47659 -33613 -58496 -28313 -11372 -46333 -58654 -75941 -72462 -44178 -50455 -21329
11203 -21329 30547 48750 45876 -2564 -8199 38056 61424 11284 13996 26798 46701 58835
$$ packed form
11287a3824o491j7080L9749j7485q271K3924K0731L4657L1021j5483n827K5877
11275I1498j3186n8826o6697k8301K8551J0348M6447n661k2622P488k7038k6111
11263f4110j8741J403Q400K1255L1577M4795j1723l3788L8007q807l5773M586
11251b2919J9599L7406L7741M766j0654L634k1597j5093J0416n6597L883j0687
11239b0102p932K2050K196l1749j9905Q171j8813k4730M7007J6213j6031j7235
11227f0860l8087K5911J2204M7374N7123j3515m0327k0886m7754K8933L2854L349
11215a3681l3978J4046k4883L0183J6941l4961j2321j7287L479K8284o277K9126
11203b1329N1876J8203k874m8440n635M6255K3368n0140K712J2802J9903J2134
$$ plain form
11191 58835 75312 55701 65076 72944 71907 13805 -33755 -47387 -619 8523 -31181 -34755 14633
11178 14633 9421 24332 -7893 -27031 -16540 8658 8915 -13694 -10180 -12155 -33531 -27069 -31311
11165 -31311 -41144 -4422 32844 46536 65691 80908 62253 46072 54380 58817 37339 22381
11153 22381 -20588 -37658 -8115 30334 25454 16234 25664 4629 -17748 -26302 -37184 -28922 -8972
11140 -8972 16975 9291 -21292 8857 10657 53501 61799 81515 77954 42683 35648 -6044 -60107
11127 -60107 -68006 -21899 -6208 5881 10929 34868 64476 29902 31205 36629 59604 78390
11115 78390 18877 -19796 -2839 -12405 24625 58889 55500 63156 48210 39816 62525 110095
11103 110095 78533 67401 51520 67900 132909 135121 92819 90026 60234 33535 34117 35309
$$ packed form
11191E8835J6477j9611R375P868j037n8102m7560j3632M6768R142l9704l574M9388
11178A4633n212J4911l2225j9138J0491K5198K57k2609L514j975k1376O462m242
11165c1311r833L6722L7266J3692J9155J5217j8655j6181Q308M437k1478j4958
11153B2381m2969j7070K9543L8449m880r220R430k1035k2377q554j0882Q262J9950
11140h972K5947p684l0583L0149J800M2844Q298J9716l561l5271p035m1692n4063
11127f0107p899M6107J5691J2089N048K3939K9608l4574J303N424K2975J8786
11115G8390n9513l8673J6957r566L7030L4264l389P656j4946q394K2709M7570
11103A10095l1562j1132j5881J6380O5009K212m2302k793k9792k6699N82J192
$$ plain form
11091 35309 21148 14809 39968 107844 132511 144921 127420 86585 86335 78682 89381 78891
11079 78891 30781 -16868 4673 42019 47738 61290 85070 44893 9867 -6487 -41885 -42121
11067 -42121 17760 16070 4787 -18661 -17335 10668 25592 8613 -14802 -7650 -35347 -53862
11055 -53862 -39762 -65331 -87320 -71130 -26911 6759 31290 20171 -11112 -5415 -27830 567
11043 567 49865 78951 100257 116292 60581 45208 39422 5471 5400 51872 66920 93172 65933
11030 65933 57397 59171 44580 35159 12496 -8510 9412 33332 21876 32947 9660 -872
11018 -872 1004 -2620 16996 38651 40488 37111 22492 5704 -2082 6423 23970 13716 24360
11005 24360 42929 30532 26377 3536 15647 36723 25327 22491 51737 59613 60386 59072 70769
$$ packed form
11091C5309j4161o339K5159O7876K4667J2410j7501m0835k50p653J0699j0490
11079G8891m8110m7649K1541L7346N719J3552K3780m0177l5026j6354l5398k36
11067d2121N9881j690j1283k3448J326K8003J4924j6979k3415P152k7697j8515
11055e3862J4100k5569k1989J6190M4219L3670K4531j1119l1283N697k2415K8397
11043E67M9298K9086K1306J6035n5711j5373n786l3951p1M6472J5048K6252k7239
11030F5933q536J774j4591r421k2663k1006J7922K3920j1456J1071k3287j0532
11018h72J876l624J9616K1655J837l377j4619j6788p786Q505J7547j0254J0644
11005B4360J8569j2397m155k2841J2111K1076j1396k836K9246P876P73j314J1697
$$ plain form
10992 70769 34848 -1433 -28897 -14561 -4283 -10636 20036 51477 49851 56600 75971 67371
10980 67371 21444 31875 17002 23571 73361 60406 36594 49918 68758 34858 4455 30903
10968 30903 39842 42004 33082 2398 -35995 16102 23695 53944 67232 72354 90693 121319 141938
10955 141938 100548 72342 80421 106304 118611 125506 104614 85528 91458 116266 111991 51248
10943 51248 74586 135420 143302 126587 150955 171750 227823 336788 476214 692980 1073441
10932 1073441 1664310 2360550 2863150 2845322 2502315 2047370 1464182 1012773 757668 510874
10922 510874 343373 275282 210219 164224 147701 154235 144456 126887 128968 135079 87603 49798
10910 49798 57635 65874 74848 94181 113975 99833 66727 40423 44589 66885 88089 57289
$$ packed form
10992G0769l5921l6281k7464J4336J0278o353L0672L1441j626O749J9371q600
10980F7371m5927J0431j4873O569M9790j2955k3812J3324J8840l3900l0403K6448
10968C0903Q939K162q922l0684l8393N2097P593L0249J3288N122J8339L0626K0619
10955A41938m1390k8206Q079K5883J2307O895k0892j9086N930K4808m275o0743
10943E1248K3338O0834P882j6715K4368K0795N6073J08965J39426K16766L80461
10932A073441N90869O96240N02600j7828l43007m54945n83188m51409k55105k46794
10922E10874j67501o8091o5063m5995j6523O534r779j7569K081O111m7476l7805
10910D9798P837Q239Q974J9333J9794j4142l3106k6304M166K2296K1204l0800
$$ plain form
10898 57289 45557 34339 49523 70667 65571 62831 26782 12389 -22532 -28931 10614 39819
10886 39819 24257 38882 46182 13791 -20134 -24052 49544 85013 75792 71677 73640 88625 62305
10873 62305 56763 38652 72110 85034 65775 68906 99390 87233 72650 46892 10715 -12385
10861 -12385 -16661 4747 -7271 -23610 -3253 -20302 9814 27046 69473 78091 48170 32063
10849 32063 28007 37169 60572 67748 95222 141252 137391 101720 77181 86724 101404 133782 137113
10836 137113 136014 149836 127388 148700 95074 58337 38414 93 15159 13555 32745 15974
10824 15974 4308 -29565 -43424 12086 44428 41398 31942 25192 -17746 -27340 -15225 -25285
10812 -25285 6215 14783 39382 65099 60847 74300 82667 92758 54627 61050 87284 78935 69447
$$ packed form
10898E7289j1732j1218J5184K1144n096k740l6049j4393l4921o399L9545K9205
10886C9819j5562J4625P300l2391l3925l918P3596L5469r221m115J963J4985k6320
10873F2305n542j8111L3458J2924j9259L131L0484j2157j4583k5758l6177k3100
10861a2385m276K1408j2018j6339K0357j7049L0116J7232M2427Q618k9921j6107
10849C2063m056R162K3403P176K7474M6030l861l5671k4539R543J4680L2378L331
10836A37113j099J3822k2448K1312n3626l6737j9923l8321J5066j604J9190j6771
10824A5974j1666l3873j3859N5510L2342l030r456o750m2938r594J2115j0060
10812b5285L1500Q568K4599K5717m252J3453Q367J0091l8131O423K6234q349r488
$$ plain form
10799 69447 84833 105755 143429 115637 72676 70109 95872 103088 96683 62466 99527 138487
10787 138487 149802 158063 109982 113612 177681 250603 206632 150307 173272 264774 353932 375387
10775 375387 328153 271646 230636 214453 240057 273867 193274 116749 140014 154763 112005
10764 112005 63250 71274 91727 98104 71627 66241 101116 121565 137688 153688 132225 111320
10752 111320 146100 160731 121404 63913 78580 130876 139911 108209 139116 132848 144740 129632
10740 129632 153403 162454 166815 172655 149540 174451 216091 219202 233197 233212 158294 125210 69639
10727 69639 36800 21214 38171 68850 95085 90387 69049 67156 153772 277476 462428 702954
10715 702954 822919 705995 528198 392429 300186 245551 209593 214399 209633 214207 276714
$$ packed form
10799F9447J5386K0922L7674k7792m2961k567K5763P216o405l4217L7061L8960
10787A38487J1315Q261m8081L630O4069P2922m3971n6325K2965R1502Q9158K1455
10775C75387m7234n6507m1010j6183K5604L3810q0593p6525K3265J4749m2758
10764A12005m8755Q024K0453O377k6477n386L4875K0449J6123J6000k1463k0905
10752A11320L4780J4631l9327n7491J4667N2296R035l1702L0907o268J1892j5108
10740A29632K3771R051M361N840k3115K4911M1640L111J3995J5p4918l3084n5571
10727F9639l2839j5586J6957L0679K6235m698k1338j893Q6616J23704J84952K40526
10715G02954J19965j16924j77797j35769r2243n4635l5958M806m766M574O2507
$$ plain form
10704 276714 306189 303855 246517 232708 244170 201403 134834 88696 64041 80368 69928 97637
10692 97637 94911 73438 98700 110350 131282 189481 228496 269799 297995 298947 281784 235888
10680 235888 135923 57529 18348 34027 69739 110230 77783 64635 83412 88004 112064 115442
10668 115442 144233 153682 146320 128876 111970 60690 16214 26865 44678 67704 133017 250479
10656 250479 373984 411747 304267 116162 51912 65146 139732 171930 270340 350615 351726
10645 351726 331485 341865 330812 328036 389587 427905 454549 438410 406145 398429 397231 332550
10633 332550 314197 285677 220343 218676 209567 221987 247575 297090 306307 319739 351422 389434
10621 389434 408059 410122 402217 426286 464651 474180 457709 451775 471667 490911 508810 491269
$$ packed form
10704B76714K9475k334n7338j3809J1462m2767o6569m6138k4655J6327j0440K7709
10692I7637k726k1473K5262J1650K0932N8199L9015M1303K8196R52j7163m5896
10680B35888r9965p8394l9181J5679L5712M0491l2447j3148J8777M592K4060L378
10668A15442K8791R449p362j7444j6906n1280m4476J0651J7813K3026O5313J17462
10656B50479J23505L7763j07480j88105o4250J3234P4586L2198R8410Q0275J111
10645C51726k0241J0380j1053k776O1551L8318K6644j6139l2265p716j198o4681
10633C32550j8353k8520o5334j667r109J2420K5588M9515R217J3432L1683L8012
10621C89434J8625K063p905K4069L8365R529j6471n934J9892J9244J7899j7541
$$ plain form
10609 491269 463611 467042 466053 462334 450456 436468 464553 482413 492832 514483 524460 555557
10597 555557 600141 606222 619297 651739 667900 605833 588424 598943 630439 605656 590264 678004
10585 678004 752342 720360 734169 760798 762668 833570 883893 886374 905049 973177 1022169 1073437
10573 1073437 1079691 1084464 1096277 1133213 1172551 1219929 1269715 1343610 1462483 1576956 1719302
10562 1719302 1743556 1733220 1771535 1840215 1891448 1997256 2160154 2325331 2519553 2768366
10552 2768366 3113863 3546101 4173480 4936057 5865552 6892082 7715989 8271125 8834296
10543 8834296 9609846 10447422 11034632 11469316 12124606 13093947 14374612 16313994 19285408
10534 19285408 23777722 30168309 39272977 53015404 74648554 109915138 169953262
$$ packed form
10609D91269k7658L431r89l719j1878j3988K8085J7860J0419K1651R977L1097
10597E55557M4584O081J3075L2442J6161o2067j7409J0519L1496k4783j5392Q7740
10585F78004P4338l1982J3809K6629J870P0902N0323K481J8675O8128M8992N1268
10573A073437O254M773J1813L6936L9338M7378M9786P3895J18873J14473J42346
10562A719302K4254j0336L8315O8680N1233J05808J62898J65177J94222K48813
10552B768366L45497M32238O27379P62577R29495J026530Q23907N55136N63171
10543H834296P75550Q37576N87210M34684O55290R69341J280665J939382K971414
10534A9285408M492314O390587R104668J3742427K1633150L5266584O0038124
$$ plain form
10527 169953262 266051488 396729303 513410472 536213784 476053886 392122994 294572461
10520 294572461 201178806 134219249 92220524 66398620 50097328 39217186 31454092
10513 31454092 25656183 21231664 17991182 15779852 14449014 13670370 12795040 11730098
10505 11730098 10841853 10140574 9594471 8837792 7795840 6745246 5755699 4920156 4243772
10496 4243772 3750294 3372231 3072531 2829773 2586441 2395813 2248448 2043541 1817372
10487 1817372 1651147 1539685 1436422 1362646 1286355 1249261 1238967 1228926 1205765 1119968 1056972
10476 1056972 972118 901581 820054 793762 758362 742620 722003 687263 661112 648873 593741
10465 593741 568487 563129 581384 606681 616329 627629 591856 506898 419179 355646 308850 295106
$$ packed form
10527A69953262R6098226J30677815J16681169K2803312o0159898q3930892r7550533
10520B94572461r3393655o6959557m1998725k5821904j6301292j0880142p763094
10513C1454092n797909m424519l240482k211330j330838p78644q75330j064942
10505A1730098q88245p01279n46103p56679j041952j050594r89547q35543o76384
10496D243772m93478l78063k99700k42758k43332j90628j47365k04907k26169
10487A817372j66225j11462j03263p3776p6291l7094j0294j0041k3161q5797o2996
10476A056972q4854p0537q1527k6292l5400j5742k0617l4740k6151j2239n5132
10465E93741k5254n358J8255K5297R648J1300l5773q4958q7719o3533m6796j3744
$$ plain form
10453 295106 266289 249798 275495 284783 281453 271288 317128 302469 302951 302689 309514 286199 257393
10440 257393 283301 257280 224772 183416 186572 156792 179993 186241 192199 210926 187183 155387
10428 155387 155523 185368 179184 166273 166342 167904 182947 228396 214317 180575 178812 162985 143163
10415 143163 134771 93812 87803 65525 43934 -6677 -4754 45399 77212 48531 26943 15473
10403 15473 -11898 -33979 -11772 80478 190319 240442 268444 243423 185579 128459 123889 135826
10391 135826 170605 206087 196724 219858 202313 146675 123300 96573 85072 97514 86477 58366
10379 58366 84394 90592 72510 74350 81371 56448 65159 110175 79726 15815 -27776 -37664 -48389
10366 -48389 -28586 -10368 -9271 17415 42463 101361 84132 36596 42335 21605 38543 56730
$$ packed form
10453B95106k8817j6491K5697R288l330j0165M5840j4659M82k62O825k3315k8806
10440B57393K5908k6021l2508m1356L156k9780K3201O248N958J8727k3743l1796
10428A55387J36K9845o184j2911O9J562J5043M5449j4079l3742j763j5827j9822
10415A43163q392m0959o009k2278k1591n0611J923N0153L1813k8681k1588j1470
10403A5473k7371k2081K2207R2250J09841N0123K8002k5021n7844n7120m570J1937
10391A35826L4779L5482r363K3134j7545n5638k3375k6727j1501J2442j1037k8111
10379E8366K6028O198j8082J840P021k4923Q711M5016l0449o3911m3591r888j0725
10366d8389J9803J8218J097K6686K5048N8898j7229m7536N739k0730J6938J8187
$$ plain form
10354 56730 29080 -7467 13370 24546 -26506 -72132 -101777 -166705 -176236 -202844 -175896 -117052
10342 -117052 -50825 -29564 -24179 -5374 -27815 -137341 -292131 -458441 -556493 -572886 -545112
10331 -545112 -479278 -302018 -103658 5009 34249 25836 40388 53912 107999 121908 119630
10320 119630 56131 543 -34998 -21925 -16449 -44381 -64207 -55369 -43792 -40386 -24145 -33393
10308 -33393 -24935 -33220 -34073 -24613 -11143 4938 2166 15178 5178 -19617 -22774 -39061 -29467
10295 -29467 -38872 -34493 -52391 -45745 -14751 -6174 -17103 -7819 -24202 -36791 -4995 27134 70444
10282 70444 29598 -22221 -30782 -35247 1160 -4629 -21074 -11777 -54189 -46445 -7490 -19959 -74504
10269 -74504 -107018 -78884 14112 76915 61817 62162 86056 92349 62105 -14092 -82066 -82926 -33003
$$ packed form
10354E6730k7650l6547K0837J1176n1052m5626k9645o4928r531k6608K6948N8844
10342a17052O6227K1261N385J8805k2441j09526j54790j66310r8052j6393K7774
10331e45112O5834J77260J98360J08667K9240q413J4552J3524N4087J3909k278
10320A19630o3499n5588l5541J3073N476k7932j9826Q838J1577L406J6241r248
10308c3393Q458q285q53R460J3470J6081k772J3012j0000k4795l157j6287R594
10295b9467r405M379j7898O646L0994Q577j0929R284j6383j2589L1796L2129M3310
10282G0444m0846n1819q561m465L6407n789j6445R297m2412P744L8955j2469n4545
10269g4504l2514K8134R2996O2803j5098L45K3894O293l0244p6197o7974q60M9923
$$ plain form
10256 -33003 18097 55482 64866 84147 74273 53478 48277 48088 30037 70430 68122 22798 32670
10243 32670 8200 20636 34202 12615 15764 13352 -19024 -1504 4159 3705 -51273 -12609 -1522
10230 -1522 -3594 -7987 5316 -3336 21827 33019 -31 -53801 -17376 3218 -5378 6922 22940
10217 22940 16062 17743 38652 49722 8128 -28002 -66938 -99372 -113699 -130155 -100098 -45297
10205 -45297 29991 38741 35367 58242 23459 -7403 7661 38892 65591 51067 -1181 -19883
10193 -19883 -14559 19509 40175 7312 5073 -22492 -27185 -54910 -57928 -60819 -30079 -48979 -86799
10180 -86799 -93269 -49254 -14401 258 3452 31081 42393 13141 26568 26803 12970 7010 45386
10167 45386 55443 72362 82446 67126 74348 79646 58044 55258 -13388 -31948 -24555 3912
$$ packed form
10256c3003N1100L7385R384J9281r874k0795n201j89j8051M0393k308m5324R872
10243C2670k4470J2436J3566k1587L149k412l2376J7520N663m54n4978L8664J1087
10230a522k072m393J3303q652K5163J1192l3050n3770L6425K0594q596J2300J6018
10217B2940o878J681K0909J1070m1594l6130l8936l2434j4327j6456L0057N4801
10205d5297P5288Q750l374K2875l4783l0862J5064L1231K6699j4524n2248j8702
10193a9883N324L4068K0666l2863k239k7565m693k7725l018k891L0740j8900l7820
10180h6799o470M4015L4853J4659L194K7629J1312k9252J3427K35j3833n960L8376
10167D5386J0057J6919J0084j5320P222N298k1602k786o8646j8560P393K8467
$$ plain form
10155 3912 33182 65720 22143 38149 41388 60201 79121 56875 31245 58959 11215 -35060
10143 -35060 -42697 -24004 -20991 6574 -2095 -3701 36962 20460 21359 36854 61234 54499 80200
10130 80200 74369 91479 106172 112569 129579 168956 202009 213756 186919 168890 216803 342948
10118 342948 585995 953078 1459868 2124046 2686011 2761562 2421146 1959307 1427901 969586
10108 969586 663461 469604 297984 213899 178594 171259 188232 179643 151950 77047 34992
10097 34992 21074 33616 46563 12323 21440 51869 61747 86754 106039 105721 37738 15300
10085 15300 -14161 -44737 -61743 -6460 7570 -7184 -19492 -39128 -37201 -45065 -24064 31278
10073 31278 21664 6186 55634 49499 4349 -20254 -2187 -21151 -21486 5037 -7511 -56257
$$ packed form
10155C912K9270L2538m3577J6006L239J8813J8920k2246k5630K7714m7744m6275
10143c5060p637J8693L013K7565q669j606M0663j6502Q99J5495K4380o735K5701
10130H0200n831J7110J4693O397J7010L9377L3053J1747k6837j8029M7913J26145
10118C42948K43047L67083N06790O64178N61965P5551l40416m61839n31406m58315
10108I69586l06125j93857j71620q4085l5305p335J6973q589k7693p4903m2055
10097C4992j3918J2542J2947l4240R117L0429R878K5007J9285l18o7983k2438
10085A5300k9461l0576j7006N5283J4030j4754j2308j9636J927p864K1001N5342
10073C1278r614j5478M9448o135m5150k4603J8067j8964l35K6523j2548m8746
$$ plain form
10061 -56257 -80971 -90146 -74652 -58002 -39506 -8875 4204 -10803 -34133 -30752 -9975 -16779
10049 -16779 -9283 -2098 -6182 -19900 2089 15500 3965 8772 10531 14040 23914 23258 37365
10036 37365 23812 12807 -25765 -7911 2401 -25834 -56020 -62745 -39459 -32217 -25878 -5198
10024 -5198 1484 -21777 -41158 -51128 -13724 4178 -10371 -30609 -38160 -37948 -21648 -32989 -98503
10011 -98503 -33767 30034 30213 8589 -23408 -36033 -53434 -3469 17320 39736 2915 -6212
9999 -6212 3581 13974 21375 17021 -2458 -45079 -59245 -54358 -44941 -34166 -31356 -3596 -3713 -13155
9985 -13155 -2908 -20032 -29303 -57989 -62491 1118 28534 46002 44259 73639 19386 -30955
9973 -30955 -9680 44464 24605 4600 14332 1362 8031 -20682 -19978 -12999 -5886 -20947 -40274
$$ packed form
10061e6257k4714r175J5494J6650J8496L0631J3079j5007k3330L381K0777o804
10049a6779P496P185m084j3718K1989J3411j1535M807J759L509R874o56J4107
10036C7365j3553j1005l8572J7854J0312k8235l0186o725K3286P242O339K0680
10024e198O682k3261j9381r970L7404J7902j4549k0238p551K12J6300j1341o5514
10011i8503O4736O3801J79k1624l1997j2625j7401M9965K0789K2416l6821r127
9999f212R793J0393P401m354j9479m2621j4166M887R417J0775K810K7760j17r442
9985a3155J0247j7124r271k8686m502O3609K7416J7468j743K9380n4253n0341
9973c0955K1275N4144j9859k0005R732j2970O669k8713P04O979P113j5061j9327
$$ plain form
9960 -40274 -20097 15454 52768 58843 52176 43867 62484 58840 45508 4264 -10683 -21149 1204
9947 1204 -23700 -33679 -31762 -31956 -41532 -28035 -13136 -11705 11745 468 45382 94263 105462
9934 105462 123196 116261 78206 69143 38749 -2557 -49028 -63211 -59532 -55561 -32341 20200
9922 20200 46524 48835 43304 6195 9631 20367 31551 16933 -30642 -53631 -51855 -20711 -22258
9909 -22258 -47206 -59807 -77462 -73053 -58876 -69372 -74395 -124386 -142858 -112392 -86232 -43649
9897 -43649 -10165 -24367 -26788 -25173 43802 69141 72864 44294 4813 -14552 -36546 -70694
9885 -70694 -101507 -66528 12871 68445 93113 44014 25723 6115 7516 -26302 -89408 -69843
9873 -69843 -50579 -51236 -51572 -54759 -32816 -30723 -33127 1770 28275 2506 -11279 -19183 18753
$$ packed form
9960d0274K0177L5551L7314O075o667q309J8617l644j3332m1244j4947j0466K2353
9947A204k4904r979J917j94r576J3497J4899J431K3450j1277M4914M8881J1199
9934A05462J7734o935l8055r063l0394m1306m6471j4183L679L971K3220N2541
9922B0200K6324K311n531l7109L436J0736J1184j4618m7575k2989J776L1144j547
9909b2258k4948j2601j7655M409J4177j0496n023m9991j8472L0466K6160M2583
9897d3649L3484j4202k421J615O8975K5339L723k8570l9481j9365k1994l4148
9885g0694l0813L4979P9399N5574K4668m9099j8291j9608J401l3818o3106J9565
9873f9843J9264o57l36l187K1943K093k404L4897K6505k5769j3785p904L7936
$$ plain form
9860 18753 27188 16825 19868 2793 36807 53975 42280 29127 18859 29206 -7600 -9749
9848 -9749 7900 -5241 -8983 5372 -18177 -68859 -111502 -35878 19004 52749 60654 40166
9836 40166 16655 4091 916 -23237 -59498 -26737 -12165 -35477 -71529 -80003 -63213 -90592
9824 -90592 -122533 -121216 -103269 -56621 -12961 2344 15427 30533 32264 51183 10163 -31675
9812 -31675 -2639 6040 1728 2552 -5393 14461 2424 -21788 -14708 12435 -13020 -37205 -52971
9799 -52971 -56823 -45443 -15044 -4953 -52229 -76299 -69345 -67780 -56489 -49481 -100648 -135676 -120591
9786 -120591 -93104 -78014 -85105 -87058 -105723 -123477 -103387 -88886 -96837 -134529 -121556 -48383
9774 -48383 20344 21201 65492 49675 1629 -7076 -10993 2654 19650 18529 37016 60191 35914
$$ packed form
9860A8753Q435j0363L043j7075L4014J7168j1695j3153j0268J0347l6806k149
9848i749J7649j3141l742J4355k3549n0682m2643P5624N4882L3745P905k0488
9836D0166k3511j2564l175k4153l6261L2761J4572k3312l6052q474J6790k7379
9824i0592l1941J317J7947M6648M3660J5305J3083J5106J731J8919m1020m1838
9812c1675K9036Q679m312Q24p945J9854j2037k4212P080K7143k5455k4185j5766
9799e2971l852J1380L0399J0091m7276k4070O954J565J1291P008n1167l5028J5085
9786a20591K7487J5090p091j953j8665j7754K0090J4501p951l7692J2973P3173
9774d8383O8727Q57M4291j5817m8046q705l917J3647J6996j121J8487K3175k4277
$$ plain form
9761 35914 52289 69265 49566 31091 8819 -26224 3399 37960 15976 14807 15780 6150 8240
9748 8240 1310 -24656 -47647 -24982 3914 23363 48177 74519 19524 -19506 -19105 6139 5793
9735 5793 12814 25547 -3945 3744 33197 22694 -43355 -31743 -48494 -19852 -14735 -13799 -38138
9722 -38138 -37303 -13601 -20725 -58153 -70901 -76288 -35528 -45222 -18695 22016 35043 -11770 -42957
9709 -42957 -30533 -24083 -19861 10900 45278 51158 8020 -17394 -1983 19871 5616 -13094
9697 -13094 -25940 -35746 -50553 -64041 -42345 -3795 7581 11552 -11187 -16809 -25402 -23448 -40146
9684 -40146 -57018 -57797 -52466 -69323 -77596 -48177 -38478 -5035 294 -10456 11066 -2898 3115
9671 3115 15142 -3882 -5881 4130 -5016 -32396 -6591 17114 32547 40639 16314 36462 13336
$$ packed form
9761C5914J6375J6976j9699j8475k2272l5043K9623L4561k1984j169R73r630K090
9748H240o930k5966k2991K2665K8896J9449K4814K6342n4995l9030M01K5244l46
9735E793P021J2733k9492P689K9453j0503o6049J1612j6751K8642N117R36k4339
9722c8138Q35K3702p124l7428j2748n387M0760r694K6527M0711J3027m6813l1187
9709d2957J2424O450M222L0761L4378N880m3138k5414J5411K1854j4255j8710
9697a3094j2846r806j4807j3488K1696L8550J1376L971k2739n622q593J954j6698
9684d0146j6872p79N331j6857q273K9419R699L3443N329j0750K1522j3964O013
9671C115J2027j9024j999J0011r146k7380K5805K3705J5433Q092k4325K0148k3126
$$ plain form
9658 13336 -15444 -25150 -23156 -49153 -79346 -99980 -84937 -37965 -26933 -34161 -12758 -6677 -7541
9645 -7541 21924 25134 4715 -5419 -7505 -36199 -64939 -96131 -65012 -9569 -2544 -25327 -30712
9632 -30712 -31806 -55587 -47679 -35275 -2750 14017 23261 37942 12670 -26308 -5581 90808
9620 90808 99277 44591 -23881 -8911 -10170 -7476 -40909 -12624 5035 -25936 -21497 -25852 -24844
9607 -24844 -19669 -42229 -52943 -21174 -25324 -20979 -16674 27139 6216 -17537 -27603 -76921 -73455
9594 -73455 -47279 -28660 -48686 -35412 -22646 22602 2924 -8307 -7903 -3070 1475 -493 1856
9581 1856 -10576 -13922 -27055 -23871 -21705 -49499 -63547 -16714 -2030 -14147 -2014 21235 32426
9568 32426 20611 5068 16944 40241 20309 21457 18887 25318 5260 -30598 -22942 -19850 -1271
$$ packed form
9658A3336k8780r706J994k5997l0193k0634J5043M6972J1032p228K1403O081q64
9645g541K9465L210k0419j0134k086k8694k8740l1192L1119N5443P025k2783n385
9632c0712j094k3781P908J2404L2525J6767R244J4681k5272l8978K0727R6389
9620I0808Q469n4686o8472J4970j259K694l3433K8285J7659l0971M439m355J008
9607b4844N175k2560j0714L1769m150M345M305M3813k0923k3753j0066m9318L466
9594g3455K6176J8619k0026J3274J2766M5248j9678j1231M04M833M545j968K349
9581A856j2432l346j3133L184K166k7794j4048M6833J4684j2117J2133K3249J1191
9568C2426j1815j5543J1876K3297j9932J148k570O431k0058l5858P656L092J8579
$$ plain form
9555 -1271 46385 68238 41379 34388 23916 13899 29938 52990 42497 13721 -32135 -21652
9543 -21652 -16022 -33968 -14496 -12636 -20636 -13149 -5100 -45077 -61176 20460 37347 32703 13229
9530 13229 5526 77907 70194 35371 20816 6382 -18195 -24309 -16826 -46298 -23346 18868 4537
9517 4537 -28876 -43683 -61528 -40782 -1829 16638 11995 32590 23156 10886 -15171 9242
9505 9242 7754 -9158 -15238 -27497 -47199 -67349 -34933 -6405 -4880 -2954 20883 38833 43171
9492 43171 31891 39611 23187 -14676 -46858 -24779 7001 18394 2150 -29756 -28464 -6948
9480 -6948 73474 88726 47330 16205 14524 -2433 -15560 -14683 -8596 -7885 -17918 9000 8720 14141
9466 14141 44793 58095 3695 -22872 -25505 -5643 41080 33537 -18415 -40164 -43141 -11308
$$ packed form
9555a271M7656K1853k6859o991j0472j0017J6039K3052j0493k8776m5856J0483
9543b1652N630j7946J9472J860q000P487Q049l9977j6099Q1636J6887m644j9474
9530A3229p703P2381p713l4823j4555j4434k4577o114P483k9472K2952M2214j4331
9517D537l3413j4807j7845K0746L8953J8467m643K0595r434j2270k6057K4413
9505I242j488j6912o080j2259j9702k0150L2416K8528J525J926K3837J7950M338
9492D3171j1280P720j6424l7863l2182K2079L1780J1393j6244l1906J292K1516
9480f948Q0422J5252m1396l1125j681j6957j3127Q77O087P11j0033K6918k80N421
9466A4141L0652J3302n4400k6567k633J9862M6723p543n1952k1749k977L1833
$$ plain form
9454 -11308 -14327 -36478 -5130 -11001 -19391 -9786 -18804 -11590 31134 49951 11412 -59076 -51786
9441 -51786 -9780 177 8349 -24310 -42760 -79895 -79982 -46876 -26286 -15609 -12490 -56205 -77293
9428 -77293 -43114 -37767 -150 33717 53481 87691 36101 17282 18399 47643 58580 67203
9416 67203 51436 53469 71018 40281 22605 27592 -6762 1592 -8387 10141 35558 56910 27966
9403 27966 40968 54901 47700 55016 67350 20689 5807 -2369 -2478 3608 30938 42136 44144
9390 44144 109260 116823 98318 68103 55031 49616 11920 -21679 -14792 24424 35492 23123
9378 23123 14004 15312 27617 53342 61784 -2377 1936 29081 26209 40884 47980 23313 1673
9365 1673 -9018 -2942 14191 21880 15282 18983 6668 3991 3654 25926 75012 62455 25308
$$ packed form
9454a1308l019k2151L1348n871q390R605r018P214M2724J8817l8539p0488P290
9441e1786M2006R957Q172l2659j8450l7135q7L3106K0590J0677L119m3715k1088
9428g7293L4179N347L7617L3867J9764L4210n1590j8819J117K9244J0937Q623
9416F7203j5767K033J7549l0737j7676M987l4354Q354r979J8528K5417K1352k8944
9403B7966J3002J3933p201P316J2334m6661j4882q176j09O086K7330J1198K008
9390D4144O5116P563j8505l0215j3072n415l7696l3599O887L9216J1068j2369
9378B3123r119J308J2305K5725Q442o4161M313K7145k872J4675P096k4667k1640
9365A673j0691O076J7133P689o598L701j2315k677l37K2272M9086j2557l7147
$$ plain form
9352 25308 -32848 -56303 -33757 -1670 30484 37077 65502 50356 57380 64336 92907 89071 47830
9339 47830 38204 52356 -2454 -33828 -41957 -12321 6317 8778 7995 43928 34319 43157 17085
9326 17085 40599 24855 20669 11234 31029 30177 -36342 -84119 -45836 10166 29561 59875 76299
9313 76299 52248 32170 11404 54888 88116 119194 83882 74817 73012 24447 6503 11289
9301 11289 53437 59288 65406 41640 87565 122523 85850 32870 20596 8182 6169 10573 22865
9288 22865 61654 71875 66508 43115 29773 23696 61096 97881 89852 63136 74022 74297 77079
9275 77079 66397 74842 107294 127047 124575 112576 72428 14664 27521 60513 53982 29923
9263 29923 46052 35547 6056 -389 -5435 -738 16848 44913 54706 31694 -1989 65403 126337
$$ packed form
9352B5308n8156k3455K2546L2087L2154O593K8425j5146P024O956K8571l836m1241
9339D7830r626J4152n4810l1374q129K9636J8638K461p83L5933r609Q838k6072
9326A7085K3514j5744m186r435J9795q52o6519m7777L8283N6002J9395L0314J6424
9313G6299k4051k0078k0766M3484L3228L1078l5312r065j805m8565j7944M786
9301A1289M2148N851O118k3766M5925L4958l6673n2980j2274j2414k013M404J2292
9288B2865L8789J0221n367k3393j3342o077L7400L6785q029k6716J0886K75K782
9275G7079j0682Q445L2452J9753k472j1999m0148n7764J2857L2992o531k4059
9263B9923J6129j0505k9491o445n046M697J7586K8065R793k3012l3683O7392O0934
$$ plain form
9250 126337 73460 30437 36552 9280 12231 54207 86402 97496 131455 132049 117911 107550
9238 107550 111244 113276 92375 108299 115728 49923 20129 13456 24964 51489 45012 20095 11195
9225 11195 -9565 1446 21212 54299 66545 61227 44786 39536 84793 92390 74300 41759
9213 41759 61114 62902 51248 46832 42767 66755 90231 104338 103383 134923 114239 96432 93494
9200 93494 99765 127954 136865 150379 129974 111542 122874 158319 160082 112770 34867 50153
9188 50153 93259 90371 112265 96006 82167 60185 62544 122196 138389 133497 178142 239321
9176 239321 239255 206877 201239 196234 215820 203106 213592 256450 320288 316577 323093 300066 263882
9163 263882 253932 257686 306554 360443 369995 387481 404732 408673 445392 474705 480199 489237 545312
$$ packed form
9250A26337n2877m3023O115k7272K951M1976L2195J1094L3959N94j4138j0361
9238A07550L694K032k0901J5924P429o5805k9794o673J1508K6525o477k4917q900
9225A1195k0760J1011J9766L3087J2246n318j6441n250M5257P597j8090l2541
9213D1759J9355J788j1654m416m065K3988K3476J4107r55L1540k0684j7807k938
9200I3494O271K8189Q911J3514k0405j8432J1332L5445J763m7312p7903J5286
9188E0153M3106k888K1894j6259j3839k1982K359N9652J6193m892M4645O1179
9176B39321o6l2378n638n005J9586j2714J0486M2858O3838l711O516k3027l6184
9163B63882r950L754M8868N3889R552J7486J7251L941L6719K9313N494R038N6075
$$ plain form
9150 545312 589945 603757 617634 690877 782653 875976 948091 986951 1033906 1103256 1186858 1304768
9138 1304768 1410792 1534415 1696703 1845240 2051931 2331580 2651415 3044414 3500877 4030514
9128 4030514 4743393 5657860 6885123 8483728 10533491 13256260 16837182 21365002 26620386
9119 26620386 31945000 36035644 37663690 36500663 33089702 28498036 23576585 19009401
9111 19009401 15171240 12132711 9828304 8036275 6665981 5553734 4681969 4014229
9103 4014229 3450422 3037986 2697469 2400736 2136298 1891413 1723544 1566385 1424700 1318835
9093 1318835 1208748 1082042 969974 896476 863533 825226 724518 650575 632271 611453 579765
9082 579765 531264 505489 473369 429309 354692 364489 346705 311277 277405 243301 218861 186235
$$ packed form
9150E45312M4633J3812J3877P3243R1776R3323P2115L8860M6955O9350Q3602J17910
9138A304768J06024J23623J62288J48537K06691K79649L19835L92999M56463N29637
9128D030514P12879R14467J227263J598605K049763K722769L580922M527820N255384
9119B6620386N324614M090644J628046j163027l410961m591666m921451m567184
9111A9009401l838161l038529k304407j792029j370294j112247q71765o67740
9103D014229n63807m12436l40517k96733k64438k44885j67869j57159j41685j05865
9093A318835j10087j26706j12068p3498l2943l8307j00708p3943j8304k0818l1688
9082E79765m8501k5775l2120m4060p4617R797j7784l5428l3872l4104k4440l2626
$$ plain form
9070 186235 182577 177860 172334 179966 170160 138601 138639 153521 132738 111836 118294 128041 144834 169518
9056 169518 182202 215025 238233 233873 204158 168702 111635 58758 89388 106564 96611 78762
9044 78762 70670 80622 80368 97733 133010 131768 106726 90537 83161 55456 70789 111222 116064
9031 116064 62693 74129 102259 102810 41994 28773 28388 16089 -31495 -8432 21605 45222
9019 45222 51367 55496 31894 -14734 -4665 21581 58336 48684 48668 46717 24979 35610 45437
9006 45437 33749 61646 64907 33440 13696 20816 14688 -14517 -45339 8821 70968 110076
8994 110076 109998 75247 64696 83243 102661 79462 37482 3674 -13892 -1221 31526 24479
8982 24479 12055 -22707 -54081 -47251 4490 48393 65058 86072 64746 65037 49510 15460
$$ packed form
9070A86235l658m717n526P632r806l1559L8J4882k0783k0902O458R747J6793K4684
9056A69518J2684L2823K3208m360k9715l5456n7067n2877L0630J7176r953j7849
9044G8762q092R952k54J7365L5277j242k5042j6189p376k7705J5333M0433M842
9031A16064n3371J1436K8130N51o0816j3221l85j2299m7584K3063L0037K3617
9019D5222O145M129k3602m6628J0069K6246L6755r652j6j951k1738J0631R827
9006D5437j1688K7897L261l1467j9744P120o128k9205l0822N4160O2147L9108
8994A10076p8l4751j0551J8547J9418k3199m1980l3808j7566J2671L2747p047
8982B4479j2424l4762l1374O830N1741M3903J6665K1014k1326K91j5527l4050
$$ plain form
8970 15460 -40816 -40466 -3230 16064 12509 -12196 -6123 5260 -9432 21318 24276 57542 78419
8957 78419 62842 24535 47783 37741 25895 72477 105123 80388 43802 36709 67253 76425
8945 76425 55365 39918 -2961 -21714 -17088 4464 2085 -43266 -80809 -73408 -37598 -21312
8933 -21312 -48751 -58493 -49459 -27994 -21835 -18501 -18023 -15329 -5514 -21377 -3091 31139 33002 42920
8919 42920 48191 46948 44001 -6828 -24335 -41693 -16898 8382 41018 31571 4256 -13102 989
8906 989 7943 14407 3890 9576 39367 50364 47135 19963 -34940 -6459 2221 3876 41400
8893 41400 81178 75485 66665 87031 56812 65763 99248 64774 27290 31646 59271 50731 4888
8880 4888 27473 49445 10104 31728 40800 60252 2557 10762 29794 35400 9201 -3681 16525
$$ packed form
8970A5460n6276L50L7236J9294l555k4705O073J1383j4692L0750K958L3266K0877
8957G8419j5577l8307K3248j0042j1846M6582L2646k4735l6586p093L0544R172
8945G6425k1060j5447m2879j8753M626K1552k379m5351l7543P401L5810J6286
8933b1312k7439r742R034K1465O159L334M78K694R815j5863J8286L4230J863R918
8919D2920N271j243k947n0829j7507j7358K4795K5280L2636r447k7315j7358J4091
8906I89O954O464j0517N686K9791J0997l229k7172n4903K8481Q680J655L7524
8893D1400L9778n693q820K0366l0219Q951L3485l4474l7484M356K7625q540m5843
8880D888K2585K1972l9341K1624R072J9452n7695Q205J9032N606k6199j2882K0206
$$ plain form
8867 16525 28330 10665 7999 -4472 -8018 -7256 30439 33741 51764 65570 65278 59618 30987
8854 30987 -28250 -30301 23214 12236 2552 26879 24756 -3199 22962 25327 22730 58739 50313
8841 50313 15528 21453 64427 43662 57683 54282 39755 18767 18743 27870 -24081 -44266 -24049
8828 -24049 -26084 -24850 -14141 477 1388 -9563 3648 63378 78387 33388 50560 76206 54957
8815 54957 48844 33934 8524 -28135 -44486 -50804 -35774 -55893 -85527 -65273 -38780 -29008
8803 -29008 -3336 -21429 -17620 11007 73795 75507 65163 28077 15946 7722 8161 286 31788
8790 31788 51343 55760 34117 57494 69560 74651 43637 25471 26981 -24356 -43737 -21303
8778 -21303 23447 23724 4158 12553 4077 4858 4935 -26398 -39681 -28250 -28632 -10012 6779 26259
$$ packed form
8867A6525J1805j7665k666j2471l546P62L7695L302J8023J3806k92n660k8631
8854C0987n9237k051N3515j0978r684K4327k123k7955K6161K365k597L6009q426
8841E0313l4785N925M2974k0765J4021l401j4527k0988k4R127n1951k0185K0217
8828b4049k035J234J0709J4618R11j0951J3211N9730J5009m4999J7172K5646k1249
8815E4957o113j4910k5410l6659j6351o318J5030k0119k9634K0254K6493R772
8803b9008K5672j8093L809K8627O2788J712j0344l7086j2131q224M39p875L1502
8790C1788J9555M417k1643K3377J2066N091l1014j8166J510n1337j9381K2434
8778b1303M4750K77j9566Q395q476P81P7l1333j3283J1431l82J8620J6791J9480
$$ plain form
8764 26259 17549 -9512 -39822 -42163 -24359 -15807 -9814 8740 25223 62898 81729 80449 102629
8751 102629 95473 96257 114896 73635 71672 79289 73894 75611 34655 5465 -20138 -41536 -48235
8738 -48235 -11611 -16431 -38596 -15986 -41399 -29456 -45562 -8005 28482 -2724 22532 48265
8726 48265 55765 67655 42429 18583 22247 59202 78976 100489 46491 10694 -14178 -17727
8714 -17727 8165 -6686 -4122 38380 52934 17192 14773 56272 71602 85475 110665 117670
8702 117670 123242 58208 16841 47189 61397 20869 -26321 10874 48404 69599 125545 119526
8690 119526 114884 82724 46559 17959 14933 32992 95707 52196 26564 10981 27535 63014
8678 63014 44315 33443 61536 92688 92515 45086 33544 78808 90068 47260 39975 11922
$$ packed form
8764B6259q710k7061l0310k341J7804Q552N993J8554J6483L7675J8831j280K2180
8751A02629p156P84J8639m1261j963P617n395J717m0956k9190k5603k1398o699
8738d8235L6624m820k2165K2610k5413J1943j6106L7557L6487l1206K5256K5733
8726D8265P500J1890k5226k3846L664L6955J9774K1513n3998l5797k4872l549
8714a7727K5892j4851K564M2502J4554l5742k419M1499J5330J3873K5190P005
8702A17670N572o5034m1367L0348J4208m0528m7190L7195L7530K1195N5946o019
8690A19526m642l2160l6165k8600l026J8059O2715m3511k5632j5583J6554L5479
8678F3014j8699j0872K8093L1152j73m7429j1542M5264J1260m2808p285k8053
$$ plain form
8666 11922 9841 66067 70031 85452 119926 101612 96901 87697 43244 -19997 -8282 25868 40554
8653 40554 14840 21501 25880 -8403 -9687 25132 79873 86838 37859 36801 79112 60349 52759
8640 52759 117461 100090 104714 93218 88014 80341 105027 110988 95408 45296 34688 48492 31086
8627 31086 1516 15532 -13644 12744 43473 22109 5739 28604 74010 64033 71586 86774
8615 86774 64463 58061 91352 100629 42156 52705 19027 27883 66299 91364 99599 93693 62984
8602 62984 42260 80899 82823 101175 112162 130124 136547 170975 162348 141558 147388 104110 65381
8589 65381 47489 53928 60772 45425 57157 89548 75821 65594 61561 50477 44641 21713 32334
8576 32334 56625 39732 43343 52314 31397 28110 27732 53952 67135 88477 67495 22269 6464
$$ packed form
8666A1922k081N6226L964J5421L4474j8314m711r204m4453o3241J1715L4150J4686
8653D0554k5714O661M379l4283j284L4819N4741O965m8979j058M2311j8763p590
8640E2759O4702j7371M624j1496n204p673K4686N961j5580n0112j0608J3804j7406
8627C1086k9570J4016k9176K6388L0729k1364j6370K2865M5406r977P553J5188
8615H6774k2311o402L3291R277n8473J0549l3678Q856L8416K5065Q235n906l0709
8602F2984k0724L8639J924J8352J0987J7962O423L4428q627k0790N830m3278l8729
8589F5381j7892O439O844j5347J1732L2391j3727j0227m033j1084n836k2928J0621
8576C2334K4291j6893L611Q971k0917l287l78K6220J3183K1342k0982m5226j5805
$$ plain form
8563 6464 -12590 -11628 3313 28043 47745 40499 26736 14613 -5292 -45590 -94213 -141807 -130123
8550 -130123 -36946 26463 51496 58390 93534 48175 3006 -32302 25406 65575 58869 48498
8538 48498 13422 2273 -7150 10680 42498 55043 22549 -15254 1701 -11766 -14189 -3607
8526 -3607 38196 18707 4959 31650 7112 34627 51504 42548 24872 -22130 -15149 -2094
8514 -2094 -17140 -13961 38437 33837 22755 1871 -48720 -93931 -62623 -41071 -21757 -22204 -11460
8501 -11460 -22361 14290 15224 22322 11304 18046 -16064 13032 7320 7700 2450 -19456 -27204 -15551
8487 -15551 -19201 15567 70260 65680 -26311 -62015 -26159 -14576 -25110 -19492 -14458 5878 14681
8474 14681 37502 27398 3999 -35484 -5406 22366 -9715 -10599 21969 41284 -13958 -15756
$$ packed form
8563F464j9054R62J4941K4730J9702p246j3763j2123j9905m0298m8623m7594J1684
8550a30123R3177O3409K5033O894L5144m5359m5169l5308N7708M0169o706j0371
8538D8498l5076j1149r423J7830L1818J2545l2494l7803J6955j3467k423J0582
8526c607M1803j9489j3748K6691k4538K7515J6877q956j7676m7002O981J3055
8514b094j5046L179N2398m600j1082k0884n0591m5211L1308K1552J9314m47J0744
8501a1460j0901L6651R34P098j1018O742l4110K9096n712L80n250k1906p748J1653
8487a5551l650L4768N4693m580r1991l5704L5856J1583j0534N618N034K0336Q803
8474A4681K2821j0104k3399l9483L0078K7772l2081q84L2568J9315n5242j798
$$ plain form
8462 -15756 11047 32737 3975 35287 55099 8826 26497 41178 15835 -1021 -5665 -8303
8450 -8303 -14340 -38803 -68716 -64722 -66800 -55292 -1718 15581 4110 -11962 -32607 -52907 -76921
8437 -76921 -102134 -90291 -72858 -50019 -10329 -4147 -27233 -21816 8798 23569 -6274 -41776
8425 -41776 -39445 36346 53118 17474 -17742 6127 36362 39500 41 -49508 -45802 -20363
8413 -20363 10149 40143 17608 32666 62069 4708 1803 25041 26300 47242 84784 104953
8401 104953 79648 30566 3982 17829 15596 -24931 -22786 -22324 33558 36111 3094 -51935 -69673
8388 -69673 -46938 -35905 -51604 -39646 -16636 43493 54385 18630 26728 25173 26961 59136
8376 59136 41364 47598 54316 16125 -45519 -31190 29682 56212 24926 18554 -34374 -63944
$$ packed form
8462a5756K6803K1690k8762L1312J9812m6273J7671J4681k5343j6856m644k638
8450h303o037k4463k9913L994k078J1508N3574J7299j1471j6072k0645k0300k4014
8437g6921k5213J1843J7433K2839L9690O182k3086N417L0614J4771k9843l5502
8425d1776K331P5791J6772l5644l5216K3869L0235L138l9459m9549L706K5439
8413b0363L0512K9994k2535J5058K9403n7361k905K3238J259K0942L7542K0169
8401A04953k5305m9082k6584J3847k233m0527K145M62N5882K553l3017n5029j7738
8388f9673K2735J1033j5699J1958K3010O0129J0892l5755Q098j555J788L2175
8376E9136j7772O234O718l8191o1644J4329O0872K6530l1286o372n2928k9570
$$ plain form
8364 -63944 -89776 -75953 -88345 -73154 -31982 17804 25936 24342 22472 14619 684 -19428 -8319
8351 -8319 -1029 -39050 -20698 9357 992 -66611 -113237 -51869 -20501 -28739 -45516 -19331 -16725
8338 -16725 -25233 -48800 -27263 3284 32085 33392 -20021 -45534 -35586 -18872 -14749 -15936 7763
8325 7763 15280 -31590 -94623 -93280 -81398 -45842 7768 22782 2949 7034 3681 -23531 -29933
8312 -29933 -280 36457 46862 1158 -29696 -15426 -31381 -23343 10306 28071 36274 33975
8300 33975 21706 34482 54601 56012 56933 2018 -41950 -18697 -12503 1255 11541 28279 -30613
8287 -30613 -93593 -92661 -86510 -73153 -11069 22 -24877 -62635 -72153 -70142 -79832 -79192 -103243
8274 -103243 -79153 -44910 -54488 -18606 -20057 -38683 -20024 5387 27690 -5175 -12622 -23529
$$ packed form
8364f3944k5832J3823j2392J5191M1172M9786Q132j594j870p853j3935k0112J1109
8351h319P290l8021J8352L0055q365o7603m6626O1368L1368q238j6777K6185K606
8338a6725q508k3567K1537L0547K8801J307n3413k5513R948J6714M123j187K3699
8325G763P517m6870o3033J343J1882L5556N3610J5014j9833M085l353k7212o402
8312b9933K9653L6737J0405m5704l0854J4270j5955Q038L3649J7765Q203k299
8300C3975j2269J2776K0119J411R21n4915m3968K3253O194J3758J0286J6738n8892
8287c0613o2980R32O151J3357O2084J1091k4899l7758r518K011r690O40k4051
8274a03243K4090L4243r578L5882j451j8626J8659K5411K2303l2865p447j0907
$$ plain form
8262 -23529 10745 23014 56714 41921 58090 29156 -27177 -54216 -54305 -58617 -56041 -18060 -3491
8249 -3491 -8857 -8998 -31692 -55403 -42631 -21019 -55270 -70188 -66923 -37080 -31088 -16760 42506
8236 42506 91414 101017 64688 26104 41952 46708 66430 65801 43160 25253 4774 558 10224
8223 10224 9241 -2877 2404 31237 20498 -31736 -46500 15439 78004 57619 -15602 -43005
8211 -43005 -60817 -98102 -86106 -75419 -80692 -63552 -63988 -33177 -14065 590 36535 33157 49954
8198 49954 67864 81536 42530 -10576 -31492 -16770 -16623 -33560 -14262 11958 17784 10019 -5427
8185 -5427 18833 13065 41191 45002 -7791 -3224 4992 -55516 -36547 -8748 -27046 -57700 -56134
8172 -56134 -44048 -36420 -35355 -3172 -5398 8885 5599 -6208 -17132 -50291 -91856 -78115 -56070
$$ packed form
8262b3529L4274J2269L3700j4793J6169k8934n6333k7039q9m312K576L7981J4569
8249c491n366j41k2694k3711J2772K1612l4251j4918L265K9843N992J4328N9266
8236D2506M8908R603l6329l8584J5848M756J9722o29k2641j7907k0479m216R666
8223A0224r83j2118N281K8833j0739n2234j4764O1939O2565k0385p3221k7403
8211d3005j7812l7285J1996J0687n273J7140m36L0811J9112J4655L5945l378J6797
8198D9954J7910J3672l9006n3106k0916J4722J47j6937J9298K6220N826p765j5446
8185e427K4260n768K8126L811n2793M567Q216o0508J8969K7799j8298l0654J566
8172e6134J2086P628J065L2183k226J4283l286j1807j0924l3159m1565J3741K2045
$$ plain form
8159 -56070 -33410 -12542 -28900 -32418 -47546 -76906 -66537 -85371 -74896 -54479 -16065 11444
8147 11444 79 8976 5790 6490 9250 12296 31364 48989 41095 23779 -7122 -14165 -31853
8134 -31853 -46067 -68632 -34621 25045 31239 43814 68216 17812 10096 25171 -1575 -21683
8122 -21683 -24368 -20876 2024 40216 47180 19388 3555 22365 -8438 -38770 -49093 225
8110 225 251 -18119 -2268 -9742 1916 -11823 38580 77862 59051 19714 -8015 -39007 -76220
8097 -76220 -93135 -48036 -30704 -2208 22242 15086 -22432 -27677 -25478 -49881 -38455 -25794
8085 -25794 -12968 -15060 11417 3299 2516 2447 -7924 37409 27391 25010 13629 19247 256 11190
8071 11190 47217 63860 77036 86063 97649 84041 72069 79503 77778 130015 135951 114047 12816
$$ packed form
8159e6070K2660K0868j6358l518j5128k9360J0369j8834J0475K0417L8414K7509
8147A1444j1365Q897l186P00K760L046J9068J7625p894j7316l0901p043j7688
8134c1853j4214k2565L4011N9666O194J2575K4402n0404p716J5075k6746k0108
8122b1683k685L492K2900L8192O964k7792j5833J8810l0803l0332j0323M9318
8110B25K6j8370J5851p474J1658j3739N0403L9282j8811l9337k7729l0992l7213
8097g6220j6915M5099J7332K8496K4450p156l7518n245K199k4403J1426J2661
8085b5794J2826k092K6477q118p83o9j0371M5333j0018k381j1381N618j8991J0934
8071A1190L6027J6643J3176R027J1586j3608j1972P434j725N2237N936k1904j01231
$$ plain form
8058 12816 -49152 -45448 -39005 -16193 -61687 -93477 -47605 -18006 9864 -12358 26939 32071
8046 32071 9721 15371 -3351 -35904 -27510 -1242 44543 68870 71834 63993 70683 59787 8412
8033 8412 12994 12475 38982 90619 81493 66995 71711 76865 57583 79680 118636 142443 179504
8020 179504 148680 89240 67655 67286 63946 93095 121525 63832 -387 -8509 -5166 48786 54571
8007 54571 58747 57622 45547 36114 -21216 13962 48475 85773 83155 97919 107479 88413 61623
7994 61623 86742 124793 101918 76384 110921 100081 73910 119113 128958 119717 130466 123053
7982 123053 98263 94948 40808 26942 19046 32861 37156 24315 26132 14124 -5517 17561
7970 17561 15844 1625 -8523 -25182 -2516 59563 41277 24424 22972 40044 26071 30216
$$ packed form
8058A2816o1968L704O443K2812m5494l1790M5872K9599K7870k2222L9297N132
8046C2071k2350N650j8722l2553Q394K6268M5785K4327K964p841O690j0896n1375
8033H412M582n19K6507N1637r126j4498M716N154j9282K2097L8956K3807L7061
8020A79504l0824n9440k1585l69l340K9149K8430n7693o4219q122L343N3952N785
8007E4571M176j125j2075r433n7330L5178L4513L7298k618J4764R560j9066k6790
7994F1623K5119L8051k2875k5534L4537j0840k6171M5203R845r241J0749p413
7982A23053k4790l315n4140j3866p896J3815M295j2841J817j2008j9641K3078
7970A7561j717j4219j0148j6659K2666O2079j8286j6853j452J7072j3973M145
$$ plain form
7958 30216 54325 46068 65752 27570 9689 31762 75255 21143 -33 36841 63473 41088
7946 41088 -2932 -40651 -39965 -76214 -62061 -64572 -69386 -33288 -4279 26237 26342 14376 59277
7933 59277 85403 65052 51467 14913 3067 1425 -16779 11941 16149 -32309 -30681 -41732
7921 -41732 -878 11061 -5409 -38044 -47463 -71346 -56362 -22735 -54797 -96624 -44646 26152
7909 26152 15052 10627 -5662 16563 18369 30758 47903 45152 44118 29948 13788 17051 16687
7896 16687 5497 1988 -11703 -28808 -30809 -12325 -16968 -30286 -33739 -48918 -58195 -60246 -40866
7883 -40866 -39281 -17354 -2680 -62597 -81515 -65104 -88985 -49169 -27021 -30173 26508 27216 37457
7870 37457 37442 10465 26764 22724 30906 51137 26991 -20881 19123 21021 -22674 31067 88950
$$ packed form
7958C0216K4109q257J9684l8182j7881K2073M3493n4112k1176L6874K6632k2385
7946D1088m4020l7719O86l6249J4153k511m814L6098K9009L0516J05j1966M4901
7933E9277K6126k0351j3585l6554j1846j642j8204K8720M208m8458J628j1051
7921d1732M0854J1939j6470l2635r419k3883J4984L3627l2062m1827N1978P0798
7909B6152j1100m425j6289K2225J806J2389J7145k751j034j4170j6160L263l64
7896A6687j1190l509j3691j7105k001J8484m643j3318l453j5179r277k051J9380
7883d0866J585K1927J4674n9917j8918J6411k3881L9816K2148l152N6681P08J0241
7870C7457j5k6977J6299m040Q182K0231k4146m7872M0004J898m3695N3741N7883
$$ plain form
7857 88950 78404 24883 30386 23819 21090 4253 -4454 -5640 7877 9299 19909 38318 76733
7844 76733 56594 5703 -30236 -10115 21685 27879 26549 -6578 -24962 -18325 -2368 2368 -41414
7831 -41414 -86857 -87061 -60543 -61528 -61999 -19556 5052 20829 698 21226 61632 89304 34375
7818 34375 -23003 -16378 13074 12532 -14077 -16300 -12263 10473 32317 15677 -57016 -83971 -84269
7805 -84269 -97800 -77305 -46283 -35988 -63952 -76721 -70493 -54015 -49690 -18193 -3149 175
7793 175 1527 36045 41427 49048 44313 50995 44698 26238 25423 25936 3514 34652 52739 61743
7779 61743 -21654 -36377 -26954 -37341 -59390 -74588 -68309 -60312 -23831 -142 6054 29526 -6425
7766 -6425 -19207 -8215 4809 -28267 -9950 15029 36117 7768 -46904 -64434 -58122 -13030
$$ packed form
7857H8950j0546n3521N503o567k729j6837q707j186J3517J422J0610J8409L8415
7844G6733k0139n0891l5939K0121L1800O194j330l3127j8384O637J5957M736m3782
7831d1414m5443k04K6518r85m71M2443K4608J5777k0131K0528M0406K7672n4929
7818C4375n7378O625K9452n42k6609k223M037K2736K1844j6640p2693k6955k98
7805h4269j3531K0495L1022J0295k7964j2769O228J6478M325L1497J5044L324
7793A75J352L4518N382P621m735O682o297j8460q15N13k2422L1138J8087R004
7779F1743q3397j4723R423j0387k2049j5198O279P997L6481K3689O196K3472l5951
7766f425j2782J0992J3024l3076J8317K4979K1088k8349n4672j7530O312M5092
$$ plain form
7754 -13030 5284 21107 14067 8758 -6229 -46305 -12401 -12907 6647 39543 50834 56982 62253
7741 62253 47530 29230 22485 27869 8556 27027 27094 6017 -9067 7265 -3300 -19600 25242
7728 25242 -11770 -58899 -48395 -32372 -29849 -7536 13094 23118 4456 -3279 52101 60383
7716 60383 39493 53775 -1972 -37799 -7307 14846 -5513 5599 20491 18481 38044 3715
7704 3715 -33778 -88087 -66526 -52366 -55599 -40076 -27098 -7206 15229 56935 68889 60743
7692 60743 -14348 -13406 -3260 -17935 -50819 -6799 24812 17362 -19993 -63860 -47413 -25891
7680 -25891 -8015 8448 11004 -2484 15816 10242 -6971 -11872 -48803 -68205 -34998 14032
7668 14032 87599 84543 33319 26004 13150 -20156 -48635 -25175 -20797 -25254 -22141 26294 54691
$$ packed form
7754a3030J8314J5823p040n309j4987m0076L3904n06J9554L2896J1291O148N271
7741F2253j4723j8300o745N384j9313J8471O7k1077j5084J6332j0565j6300M4842
7728B5242l7012m7129J0504J6023K523K2313K0630J0024j8662p735N5380Q282
7716F0383k0890J4282n5747l5827L0492K2153k0359J1112J4892k010J9563l4329
7704C715l7493n4309K1561J4160l233J5523J2978J9892K2435M1706J1954q146
7692F0743p5091R42J0146j4675l2884M4020L1611p450l7355m3867J6447K1522
7680b5891J7876J6463K556j3488J8300n574j7213m901l6931j9402L3207M9030
7668A4032P3567l056n1224p315j2854l3306k8479K3460M378m457L113M8435K8397
$$ plain form
7655 54691 46923 21657 49979 37105 16946 -19550 -12803 11842 1863 -8108 -32163 -5165 15589
7642 15589 -7743 -8930 -1807 -25234 -63462 -41257 10643 53625 66440 13101 -20701 -57931
7630 -57931 -86958 -69511 -38020 -6427 -2816 -36413 -40469 -69299 -80374 -73989 -55343 -36746
7618 -36746 -7662 -10578 -34523 -29399 -21969 -37694 -103794 -136876 -116903 -74405 -26000 -42341
7606 -42341 -42750 -70838 -66966 -37093 -35568 -31570 -22461 -12751 -19371 -28513 -31990 -50394 -68838 -47618
7592 -47618 -63125 -52217 -21742 -35886 -16767 -8424 6327 9773 1243 -12493 -400 20159
7580 20159 22570 63954 62711 17784 5158 -26466 -18958 -451 10443 35608 13130 19493 32680
7567 32680 76520 137412 105676 52667 42439 17652 11692 22044 33115 14666 45309 68253
$$ packed form
7655E4691p768k5266K8322j2874k0159l6496O747K4645r979r971k4055K6998K0754
7642A5589k3332j187P123k3427l8228K2205N1900M2982J2815n3339l3802l7230
7630e7931k9027J7447L1491L1593L611l3597m056k8830j1075O385J8646J8597
7618c6746K9084k916k3945N124P430j5725o6100l3082J9973M2498M8405j6341
7606d2341m09k8088L872K9873J525L998R109R710o620r142l477j8404j8444K1220
7592d7618j5507J0908L0475j4144J9119Q343J4751L446q530j3736J2093K0559
7580B0159K411M1384j243m4927j2626l1624P508J8507J0894K5165k2478O363J3187
7567C2680M3840O0892l1736n3009j0228k4787n960J0352J1071j8449L0643K2944
$$ plain form
7555 68253 56468 32977 -14434 -55334 -22807 23613 19209 18263 15778 -5449 -8457 -10792 -2036
7542 -2036 13441 18554 -18212 -41441 -91218 -80472 -33440 24303 12521 -2109 -32851 -50927
7530 -50927 -49268 -27100 -35250 -61331 -63721 -32671 -16744 -1062 -11881 -43597 -30523 122
7518 122 21420 8305 -38064 -75660 -73647 -13653 20851 32720 16271 27059 60281 42992
7506 42992 42731 47995 9314 -13275 1343 -27003 -44216 -30736 -35460 -37071 -2305 22444 47306
7493 47306 82629 78703 26280 -51011 -30473 -33437 -5621 -2237 7501 57966 86321 49001 39890
7480 39890 25827 10596 30467 49930 2961 4873 41796 88871 74686 20394 18686 31418
7468 31418 51282 51197 47530 -21822 -29204 -33336 -40061 -23703 -33022 -25527 -32549 -4148 45982 58268
$$ packed form
7555F8253j1785k3491m7411m0900L2527M6420m404r46k485k1227l008k335Q756
7542b036J5477N113l6766k3229m9777J0746M7032N7743j1782j4630l0742j8076
7530e0927J659K2168q150k6081k390L1050J5927J5682j0819l1716J3074L0645
7518A22K1298j3115m6369l7596K013N9994L4504J1869j6449J0788L3222j7289
7506D2992k61N264l8681k2589J4618k8346j7213J3480m724j611L4766K4749K4862
7493D7306L5323l926n2423p7291K0538k964K7816L384R738N0465K8355l7320r111
7480C9890j4063j5231J9871J9463m6969J912L6923M7075j4185n4292j708J2732
7468C1418J9864q5l667o9352p382m132o725J6358r319P495p022K8401N0130J2286
$$ plain form
7454 58268 36674 10385 7057 -2695 -12521 -1227 -31869 -49200 -56233 -25044 -52825 -53443 -53162
7441 -53162 -45031 -8711 2967 -5227 4919 -5676 -16346 -61887 -59518 -38325 3636 15061
7429 15061 21247 54009 58195 72074 61832 36552 16548 19971 28546 18609 11686 4088 -34547
7416 -34547 -44223 -55609 -66476 -116831 -115021 -50081 -1764 -16642 -42764 -43491 15876 38359 37163
7403 37163 11404 -4900 -21837 -39648 -18289 21412 41724 13198 -13858 -20499 -42640 -77601
7391 -77601 -70413 -58768 -40298 -30464 4163 -7473 -24313 10096 18911 24313 27682 25487 50210
7378 50210 47436 -1556 -11547 -40569 -16258 19931 43732 48183 28218 24277 38135 17420 -15311
7365 -15311 -39812 -41677 -64921 -68932 -59152 -21823 -5200 -539 -6842 -7314 -35507 -28729 5463
$$ packed form
7454E8268k1594k6289l328r752r826J1294l0642j7331p033L1189k7781o18K81
7441e3162Q131L6320J1678q194J0146j0595j0670m5541K369K1193M1961J1425
7429A5061O186L2762M186J3879j0242k5280k0004L423Q575r937o923p598l8635
7416c4547r676j1386j0867n0355J810O4940M8317j4878k6122p27N9367K2483j196
7403C7163k5759j6304j6937j7811K1359L9701K0312k8526k7056o641k2141l4961
7391g7601P188J1645J8470R834L4627j1636j6840L4409Q815N402L369k195K4723
7378E0210k774m8992r991k9022K4311L6189K3801M451j9965l941J3858k0715l2731
7365a5311k4501j865k3244m011R780L7329J6623M661o303m72k8193O778L4192
$$ plain form
7352 5463 24760 59247 65425 56247 22786 -7079 2539 32196 13735 -3011 -8741 -2985 -11722
7339 -11722 -34957 -53954 -63974 -81538 -46834 -13896 -15524 -32739 -30502 -62423 -76702 -52429
7327 -52429 -19240 -4648 -156 -22827 -42900 -22581 6863 -2420 -8883 -4320 1068 -36813 -22437
7314 -22437 14965 -25021 -21478 -37207 -80851 -50107 -28487 -32086 -44342 -15545 12126 7877
7302 7877 33751 8075 -45846 -22442 -6732 16100 -3234 -58390 -75398 -46059 -13028 -40781
7290 -40781 -20556 42180 11860 -6974 -36725 749 -26593 -34797 -43239 -24582 4177 -22623
7278 -22623 -14663 -2152 -337 22547 47983 23947 -6474 21820 17775 -16601 -14055 -10246 -44313
7265 -44313 -67214 -64003 -7504 18286 17553 -696 18832 260 -7128 -13150 4800 33564 22363
$$ packed form
7352E463J9297L4487O178r178l3461k9865R618K9657j8461j6746n730N756q737
7339a1722k3235j8997j0020j7564L4704L2938j628j7215K237l1921j4279K4273
7327e2429L3189J4592M492k2671k0073K0319K9444r283o463M563N388l7881J4376
7314b2437L7402l9986L543j5729m3644L0744K1620l599j2256K8797K7671m249
7302G877K5874k5676n3921K3404J5710K2832j9334n5156j7008K9339L3031k7753
7290d0781K0225O2736l0320j8834k9751L7474k7342q204q442J8657K8759k6800
7278b2623P960J2511J815K2884K5436k4036l0421K8294m045l4376K546L809l4067
7265d4313k2901L211N6499K5790p33j8249J9528j8572p388o022J7950K8764j1201
$$ plain form
7252 22363 7715 79927 103857 72740 58573 24621 -33786 -53915 -61639 -46533 -83572 -84615
7240 -84615 -40926 -33782 -77687 -93810 -67008 -21616 -34323 -42193 -33987 -33578 1605 37698 41054
7227 41054 54090 36178 54943 51645 24915 23977 14160 44184 80014 59082 24972 2736 -3794
7214 -3794 2750 -13864 -16333 427 7628 -65758 -112761 -118553 -109637 -93970 -92938 -31673 -13440
7201 -13440 -29547 7010 3432 -20470 4876 23473 10201 23473 33250 12698 -1300 -48347
7189 -48347 -78680 -42830 -37671 -43000 -34448 -42171 -43934 -47588 -69317 -49692 7729 -8058 -29185
7176 -29185 -44796 -31968 -16253 -11528 -1150 7486 -3233 -10352 -13107 13572 -18785 -51758 -71894
7163 -71894 -137837 -146151 -101191 -32176 28485 37553 3058 -10254 -42310 -37525 -7714 5605
$$ packed form
7252B2363j4648P2212K3930l1117j4167l3952n8407k0129p724J5106l7039j043
7240h4615M3689P144m3905j6123K6802M5392j2707p870Q206M09L5183L6093L356
7227D1054J3036j7912J8765l298k6730r38r817L0024L5830k0932l4110k2236o530
7214c794O544j6614k469J6760P201p3386m7003n792Q916J5667J032O1265J8233
7201a3440j6107L6557l578k3902K5346J8597j3272J3272R777k0552j3998m7047
7189d8347l0333L5850N159n329Q552p723j763l654k1729J9625N7421j5787k1127
7176b9185j5611J2828J5715M725J0378Q636j0719p119k755K6679l2357l2973k0136
7163g1894o5943q314M4960O9015O0661R068l4495j3312l2056M785K9811J3319
$$ plain form
7151 5605 26678 45790 27336 16009 34099 33430 10413 -11239 -22492 -17366 12258 4084 5296
7138 5296 35527 54916 53248 8027 34 47910 69310 58928 7797 -20001 -59741 -54216 -51428
7125 -51428 -37690 -3372 43441 52364 51760 32839 5994 17045 21737 2540 -45979 -21241 -2594
7112 -2594 -16128 -19579 12388 26737 10361 16839 8008 -10489 -30236 -22590 -5910 9176 29
7099 29 -43294 -14938 16418 23513 -1788 -12092 -12283 -27329 -18557 9888 421 -20208 -35461
7086 -35461 -45622 -50440 -88114 -71030 -11438 22623 7524 -26525 -40008 -31161 -1227 9358
7074 9358 20131 10125 -26613 -77959 -90367 -103937 -129225 -137858 -160454 -93125 -50087 -66854
7062 -66854 -66885 -77670 -74432 -58539 -49046 -13831 -22192 -11094 9125 -11677 -4389 -20849 -10135
$$ packed form
7151E605K1073J9112j8454j1327J8090o69k3017k1652j1253N126K9624q174J212
7138E296L0231J9389j668m5221p993M7876K1400j0382n1131k7798l9740N525K788
7125e1428J3738L4318M6813Q923o04j8921k6845J1051M692j9197m8519K4738J8647
7112b594j3534l451L1967J4349j6376O478q831j8497j9747P646J6680J5086r147
7099B9m3323K8356L1356P095k5301j0304j91j5046Q772K8445r467k0629j5253
7086c5461j0161m818l7674J7084N9592L4061j5099l4049j3483Q847K9934J0585
7074I358J0773j0006l6738n1346j2408j3570k5288q633k2596O7329M3038j6767
7062f6854l1j0785L238J5893R493L5215q361J1098K0219k0802P288j6460J0714
$$ plain form
7049 -10135 44164 32201 30558 5155 -47687 -95255 -98691 -29327 -5846 -14314 -26282 -35876 -32150
7036 -32150 -38213 -50594 -29542 -269 27852 26758 -30172 -82402 -58295 -45007 -31894 -54036
7024 -54036 -80845 -88339 -68493 -62060 -59555 -75134 -48896 1438 36106 43823 3134 -27046 -3150
7011 -3150 -37490 -61807 -92901 -103510 -71258 -54853 -22262 262 -6010 -24914 -1716 6163
6999 6163 12781 38227 53313 40213 -9473 -36439 -7211 -35924 -40168 -39121 4214 53089 25202
6986 25202 2209 -10015 25357 69827 85434 79522 9894 -47222 -36251 3709 41915 18409
6974 18409 -27761 -16265 16190 18490 4589 22410 39757 53045 41563 13968 3894 6880
6962 6880 -10806 -22187 -22147 -34578 -25983 -39923 -64102 -67675 -54255 -36640 -19465 -9461 -7104
$$ packed form
7049a0135N4299j1963j643k5403n2842m7568l436O9364K3481q468j1968r594L726
7036c2150o063j2381K1052K9273K8121j094n6930n2230K4107J3288J3113k2142
7024e4036k6809p494J9846O433K505j5579K6238N0334L4668P717m0689l0180K3896
7011c150l4340k4317l1094j0609L2252J6405L2591K2524o272j8904K3198P879
6999F163O618K5446J5086j3100m9686k6966K9228k8713m244J047M3335M8875k7887
6986B5202k2993j2224L5372M4470J5607n912o9628n7116J0971L9960L8206k3506
6974A8409m6170J1496L2455K300j3901J7821J7347J3288j1482k7595j0074K986
6962F880j7686j1381M0j2431Q595j3940k4179l573J3420J7615J7175J0004K357
$$ plain form
6949 -7104 -34076 -55023 -52398 -34705 12048 11751 -31256 -49808 -64624 -55577 -62691 -61109 -46034
6936 -46034 -13572 13394 -4515 -2893 -22 -25630 25416 5246 -27901 -86347 -106515 -81762
6924 -81762 -72991 -72290 -69244 -44247 -13438 -11667 -33308 -41617 -54412 -22700 -30359 14042 32989
6911 32989 -1089 -5065 -20923 14349 -15536 -92151 -149862 -129124 -69270 -10812 -17382 -72809
6899 -72809 -82317 -80372 -43338 -41932 -57726 -68002 -48915 -22223 -45140 -66684 -36606 -48898
6887 -48898 -43976 -40023 -6674 15037 8359 -14883 -17650 -6507 39743 34654 -25205 -28710 -9358
6874 -9358 -7229 -20932 -38309 -54343 -75474 -80878 -52898 -18585 20421 -6822 -20919 -5643
6862 -5643 -18248 7822 -20989 -8862 58270 54379 5462 -32705 2338 22132 -32239 -36643
$$ packed form
6949g104k6972k0947K625J7693M6753k97m3007j8552j4816R047p114J582J5075
6936d6034L2462K6966j7909J622K871k5608N1046k0170l3147n8446k0168K4753
6924h1762Q771P01L046K4997L0809J771k1641q309j2795L1712p659M4401J8947
6911C2989l4078l976j5858L5272k9885p6615n7711K0738N9854N8458o570n5427
6899g2809r508J945L7034J406j5794j0276J9087K6692k2917k1544L0078j2292
6887d8898M922L953L3349K1711o678k3242k767J1143M6250n089n9859l505J9352
6874i358K129j3703j7377j6034k1131n404K7980L4313L9006k7243j4097J5276
6862e643j2605K6070k8811J2127O7132l891m8917l8167L5043J9794n4371m404
$$ plain form
6850 -36643 -34020 -60117 -52438 -31901 -26958 -33200 35382 100362 77100 63394 38142 57429 58833
6837 58833 26239 30287 34542 2968 -1174 -3514 -23079 -20651 -27872 -39452 -746 15871 22769
6824 22769 39219 45634 44443 48104 45867 -8599 -49416 -64432 -30169 20003 28625 51238 59651
6811 59651 32384 9889 -18032 -16228 12304 8135 5158 -17401 4507 -3719 -43855 -18000 2080
6798 2080 52007 53923 7867 -16010 39206 95600 83871 79008 10628 -13612 -18370 12755 -30358
6785 -30358 -72696 -44399 2168 27312 47192 41276 31614 9296 23520 41482 59165 86272
6773 86272 75984 55027 22980 -12966 9890 4497 -9713 -29265 -38892 -824 44829 78269
6761 78269 56976 51616 53410 27794 61056 92469 30853 459 38860 57660 69077 73050
$$ packed form
6850c6643K623k6097P679K0537M943o242O8582O4980k3262j3706k5252J9287J404
6837E8833l2594M048M255l1574m142k340j9565K428p221j1580L8706J6617O898
6824B2769J6450O415j191L661k237n4466m0817j5016L4263N0172Q622K2613Q413
6811E9651k7267k2495k7921J804K8532m169k977k2559K1908q226m0136K5855K0080
6798B080M9927J916m6056k3877N5216N6394j1729m863o8380k4240m758L1125m3113
6785c0358m2338K8297M6567K5144J9880n916r662k2318J4224J7962J7683K7107
6773H6272j0288k0957l2047l5946K2856n393j4210j9552r627L8068M5653L3440
6761G8269k1293n360J794k5616L3262L1413o1616l0394L8401J8800J1417L973
$$ plain form
6749 73050 66970 29183 40750 24083 49201 46631 41840 30332 9282 5140 -6803 41770 20949
6736 20949 -19494 -9472 66881 95187 90096 82147 73120 99624 139521 209732 284286 358431
6724 358431 532664 770492 1088987 1398459 1481821 1339049 1140087 925514 627104 350157
6714 350157 239690 151881 136599 135926 127331 86408 77019 54050 52963 58326 81186 73373 21069
6701 21069 3719 42172 62533 42886 16265 35518 45977 61111 58322 49634 39012 23817
6689 23817 -9761 17850 37647 5225 -20457 -35468 -48194 -65339 -37488 -32658 -7298 20428
6677 20428 11484 -10295 -26668 -54928 -61249 -33966 -37003 30325 54222 66032 27314 5905
6665 5905 29518 -3277 -24029 -17170 286 4857 3658 12591 30190 3703 6373 49639 35937
$$ packed form
6749G3050o080l7787J1567j6667K5118k570m791j1508k1050m142j1943M8573k0821
6736B0949m0443J0022P6353K8306n091p949r027K6504L9897P0211P4554P4145
6724C58431J74233K37828L18495L09472Q3362j42772j98962k14573k98410k76947
6714C50157j10467q7809j5282o73q595m0923r389k2969j087N363K2860p813n2304
6701B1069j7350L8453K0361j9647k6621J9253J0459J5134k789q688j0622j5195
6689B3817l3578K7611J9797l2422k5682j5011j2726j7145K7851M830K5360K7726
6677B0428q944k1779j6373k8260o321K7283l037O7328K3897J1810l8718k1409
6665E905K3613l2795k0752O859J7456M571j199Q933J7599k6487K670M3266j3702
$$ plain form
6652 35937 5065 15891 15429 16971 -11717 6311 13663 3998 24160 6654 4165 -14322 27241
6639 27241 22559 -30843 -77223 -51266 -22148 1406 -2507 18414 2217 -4015 44938 56081
6627 56081 69198 47719 9197 -11211 -9757 -4702 8014 13450 57173 40787 16771 13027 43031
6614 43031 72396 93311 74780 27313 -42716 -49298 3791 14217 -1771 6449 50054 22447
6602 22447 11362 27790 16561 13471 -12244 -38549 -57142 -17523 22043 38745 22361 7231
6590 7231 -3702 29778 14822 22132 57311 50126 32182 -6517 -28129 -13337 -28479 -18012
6578 -18012 -1270 25278 15957 -11062 -32112 -974 36130 14551 1958 -924 -16115 13133
6566 13133 -16457 -35403 -53899 -49855 -19638 -27513 -48153 -16441 8463 7292 -23977 -28178 19950
$$ packed form
6652C5937l0872J0826m62J542k8688J8028P352r665K0162j7506k489j8487M1563
6639B7241m682n3402m6380K5957K9118K3554l913K0921j6197o232M8953J1143
6627E6081J3117k1479l8522k0408J454N055J2716N436M3723j6386k4016l744L0004
6614D3031K9365K0915j8531m7467p0029o582N3089J0426j5988Q220M3605k7607
6602B2447j1085J6428j1229l090k5715k6305j8593L9619L9566J6702j6384j5130
6590G231j0933L3480j4956P310L5179p185j7944l8699k1612J4792j5142J0467
6578a8012J6742K6548r321k7019k1050L1138L7104k1579j2593k882j5191K9248
6566A3133k9590j8946j8496M044L0217p875k0640L1712K4904j171l1269m201M8128
$$ plain form
6553 19950 42423 65611 55268 10544 -14645 38687 46269 16352 17469 46090 46968 17999 -4733
6540 -4733 -10983 12026 -5359 -824 7120 20650 -8246 8385 -5344 -44269 -15905 -35292 -42334
6527 -42334 -72170 -64076 -36008 13942 -25048 -16799 -26704 -38733 -8683 11573 -13936 -68105
6515 -68105 -98634 -79826 -15001 -8960 -11210 -10560 -4066 -12848 -56420 -117646 -97714 -19218 17320
6502 17320 29065 57104 68256 35721 9898 -21426 -39253 -6431 -9744 -73568 -90744 -64728
6490 -64728 -40849 -35970 -36468 -44603 -27680 31219 28517 -10531 -29459 -85393 -69945 -27796 -41740
6477 -41740 -56685 -59279 -67054 -26595 4491 -21963 -67111 -75158 -10268 37372 12705 8169 5840
6464 5840 -38108 -54010 -27052 -2736 8434 4748 -12785 -18050 -28477 -48391 -28950 -40778
$$ packed form
6553A9950K2473K3188j0343m4724k5189N3332P582k9917J117K8621Q78k8969k2732
6540d733o250K3009j7385M535P944J3530k8896J6631j3729l8925K8364j9387p042
6527d2334k9836Q094K8068M9950l8990Q249r905j2029L0050K0256k5509n4169
6515f8105l0529J8808O4825O041k250O50O494q782m3572o1226J9932P8496L6538
6502A7320J1745K8039J1152l2535k5823l1324j7827L2822l313o3824j7176K6016
6490f4728K3879M879m98q135J6923N8899k702l9048j8928n5934J5448M2149j3944
6477d1740j4945k594p775M0459L1086k6454m5148q047O4890M7640k4667m536k329
6464E840m3948j5902K6958K4316J1170l686j7533n265j0427j9914J9441j1828
$$ plain form
6452 -40778 -35953 -17732 -28513 16574 41664 -2120 -1173 -21420 -58840 -57989 -8956 20393 -11509
6439 -11509 -24175 -11249 12672 10984 7402 15096 20928 -3936 -37269 -87880 -67587 -30707 -14431
6426 -14431 -30641 7471 7370 -2166 -8394 3700 263 28898 -6656 -27274 1188 10369 16295
6413 16295 5931 -9613 -29295 -37691 -50780 -50564 -19629 47052 69959 43414 8301 8685 25282
6400 25282 12158 -14823 -82815 -66786 -54844 -68698 -55026 -31762 -37193 -48568 -54479 -16153
6388 -16153 1467 26570 65879 75017 -2722 -23805 -50773 -87790 -102904 -62933 -74797 -75462
6376 -75462 -81315 -115755 -103481 -92060 -85929 -96999 -83433 -57485 -62383 -52841 -8303 -32472 -4998
6363 -4998 -7846 -4640 1825 -4782 -38571 -36038 -24040 -13334 -48014 -54265 -37884 -65514 -80813
$$ packed form
6452d0778M825J8221j0781M5087K5090m3784R47k0247l7420Q51M9033K9349l1902
6439a1509j2666J2926K3921j688l582P694N832k4864l3333n0611K0293L6880J6276
6426a4431j6210L8112j01r536o228J2094l437K8635l5554k0618K8462R181N926
6413A6295j0364j5544j9682q396j3089K16L0935O6681K2907k6545l5113L84J6597
6400B5282j3124k6981o7992J6029J1942j3854J3672K3264n431j1375n911L8326
6388a6153J7620K5103L9309R138p7739k1083k6968l7017j5114L9971j1864o65
6376g5462n853l4440J2274J1421O131j1070J3566K5948m898R542M4538k4169K7474
6363d998k848L206O465o607l3789K533J1998J0706l4680o251J6381k7630j5299
$$ plain form
6350 -80813 -26614 -2201 -6049 6184 17615 -1324 17374 49723 84888 78608 36782 25701
6338 25701 10928 -1677 177 4192 6346 1063 955 -5163 -3588 -13853 -35906 -10407 11012
6325 11012 40936 51168 50556 44615 -14891 -3709 4983 -10836 -36064 -30828 24152 -5332 -43156
6312 -43156 -69299 -62632 -43561 -46095 -31947 -23202 -82805 -96278 -49813 -35057 -49098 -43588 -58686
6299 -58686 -57863 -27391 -45845 -88698 -62620 -55217 -65808 -86357 -38457 10565 -957 -26144
6287 -26144 -22716 10946 -19477 -39074 -39675 -40381 3068 40843 42918 -13156 -36048 -63007 -26423
6274 -26423 5888 -32553 -52166 21102 4416 -12070 -25449 -1933 -21148 -48072 -67932 -60442
6262 -60442 -48024 -26023 16695 24730 -2495 -8430 -29127 -30558 -31059 -34736 -19783 -5338 -29398
$$ packed form
6350h0813N4199K4413l848J2233J1431j8939J8698L2349L5165o280m1826j1081
6338B5701j4773j2605J854M015K154n283j08o118J575j0265k2053K5499K1419
6325A1012K9924J0232o12n941n9506J1182Q692j5819k5228N236N4980k9484l7824
6312d3156k6143O667J9071k534J4148Q745n9603j3473M6465J4756j4041N510j5098
6299e8686Q23L0472j8454m2853K6078P403j0591k0549M7900M9022j1522k5187
6287b6144L428L3662l0423j9597o01p06M3449L7775K075n6074k2892k6959L6584
6274b6423L2311l8441j9613P3268j6686j6486j3379K3516j9215k6924j9860P490
6262f0442J2418K2001M2718Q035k7225n935k0697j431n01l677J4953J4445k4060
$$ plain form
6249 -29398 -19958 -13037 -27808 -52143 -26631 -19913 -12315 -6811 -2676 13658 29563 40422 53366
6236 53366 80674 101395 73827 50541 27481 10299 4301 26312 15173 23541 44033 1211
6224 1211 -45097 -29521 -15831 -15116 -21730 -30926 -21787 -25437 -19853 -30430 -20466 -30346 -10434 2578
6210 2578 -1574 -21707 5346 11825 13037 27421 40849 28842 -7270 -38914 -3198 -28245 -58006
6197 -58006 -77943 -81659 -30945 -11253 9340 26648 18510 54018 51164 24321 22302 37167 47755
6184 47755 6684 14741 12157 -3199 -24540 -59707 -93651 -78934 -39092 -44438 -29258 -26297 -38651
6171 -38651 -24832 -59012 -63699 -39045 -22822 -47745 -18569 33746 11012 -29031 -70556 -87666
6159 -87666 -66965 -77445 -74643 -15088 1950 12600 8728 30278 56258 56427 21265 -34053 7394
$$ packed form
6249b9398R440O921j4771k4335K5512O718P598N504M135J6334J5905J0859J2944
6236E3366K7308K0721k7568k3286k3060j7182n998K2011j1139Q368K0492m2822
6224A211m6308J5576J3690P15o614r196R139l650N584j0577R964r880J9912J3012
6210B578m152k0133K7053O479J212J4384J3428j2007l6112l1644L5716k5047k9761
6197e8006j9937l716N0714J9692K0593J7308q138L5508k854k6843k019J4865J0588
6184D7755m1071Q057k584j5356k1341l5167l3944J4717L9842n346J5180K961j2354
6171c8651J3819l4180m687K4654J6223k4923K9176N2315k2734m0043m1525j7110
6159h7666K0701j0480K802N9555J7038J0650l872K1550K5980J69l5162n5318M1447
$$ plain form
6146 7394 20668 58616 50456 35715 1906 -31140 -8358 -20280 -17692 2789 14988 7058 -26045
6133 -26045 -30778 -24659 -9678 -49060 -61744 -54251 -67086 -57430 -18569 20579 38911 17901 23816
6120 23816 303 -4663 12562 36356 -16285 -49319 -31545 -21123 25984 33439 -30067 -21030
6108 -21030 15685 17537 59373 110066 39656 -2236 -6964 -31551 -37012 -34677 -25162 -7612 -25847
6095 -25847 -9606 565 22527 -14413 -23174 -68987 -77708 -47062 -922 3470 -27508 -24907 -44707
6082 -44707 -36263 -47836 -53851 -54264 -66205 -65717 -77188 -66469 -79628 -69935 -45037 -16600 -35419
6069 -35419 -27481 -23863 -27191 -22989 -37797 -23091 17243 16111 -1320 7964 23544 16262 36937
6056 36937 17415 25859 32273 41341 32736 -108 -12132 -18054 -35588 5099 11925 -2224 -18163
$$ packed form
6146G394J3274L7948q160j4741l3809l3046K2782j1922K588K0481J2199p930l3103
6133b6045m733O119J4981l9382j2684P493j2835R656L8861L9148J8332k1010N915
6120B3816k3513m966J7225K3794n2641l3034J7774J0422M7107P455o3506R037
6108b1030L6715J852M1836N0693p0410m1892m728k4587n461K335R515J7550j8235
6095b5847J6241J0171K1962l6940q761m5813q721L0646M6140M392l0978K601j9800
6082d4707Q444j1573o015m13j1941M88j1471J0719j3159R693K4898K8437j8819
6069c5419P938L618l328M202j4808J4706M0334j132j7431R284J5580p282K0675
6056C6937j9522Q444O414R068q605l2844j2024n922j7534M0687O826j4149j5939
$$ plain form
6043 -18163 -909 -5959 -14054 374 -12126 -31596 -19730 -24102 -17899 -7082 25842 25371 29841
6030 29841 15886 16270 13404 -7480 -30052 -79890 -64343 -14578 25879 -5944 1479 -38312 -52122
6017 -52122 -37602 -42567 -64788 -45754 -17778 -37122 -34975 -10068 -57195 -82313 -67660 -55075
6005 -55075 -45137 -16318 -22586 -17523 -7549 12850 -34001 -47505 -37040 -24432 -69763 -91754 -93904
5992 -93904 -40019 -14323 -40326 -40767 -55261 -41094 -36536 -7671 -7397 -42269 -72959 -42432 -33132
5979 -33132 26980 58857 24131 -21666 -15925 -36749 -27223 -24468 -45549 -59779 -50847 17939 12753
5966 12753 30434 38172 18023 -15996 2390 43638 37076 -29340 -56781 -24779 -48938 -57374
5954 -57374 -29196 -11101 22445 33289 29067 -28956 -82688 -51172 -38138 18762 81157 89661
$$ packed form
6043a8163J7254n050q095J4428j2500j9470J1866m372O203J0817L2924m71M470
6030B9841j3955L84k866k0884k2572m9838J5547M9765M0457l1823P423l9791j3810
6017e2122J4520m965k2221J9034K7976j9344K147K4907m7127k5118J4653J2585
6005e5075R938K8819o268N063R974K0399m6851j3504J0465J2608m5331k1991k150
5992i3904N3885K5696k6003m41j4494J4167M558K8865K74l4872l0690L0527R300
5979c3132O0112L1877l4726m5797N741k0824R526K755k1081j4230Q932O8786n186
5966A2753J7681P738k0149l4019J8386M1248o562o6416k7441L2002k4159q436
5954e7374K8178J8095L3546J0844m222n8023n3732L1516J3034N6900O2395Q504
$$ plain form
5942 89661 64610 35140 19725 -5467 -26507 -56550 -104789 -74971 -85112 -75699 -73758 -42100
5930 -42100 4398 9479 17144 3486 18855 31172 21600 -33455 -75510 -68126 -2565 -14385 -20711
5917 -20711 -9551 6985 -9227 -19456 -10694 -52232 -50691 -49084 -54963 -32731 -40042 -43538 -26391
5904 -26391 -5533 -5348 -38983 -68339 -80359 -55712 -20127 -3541 7156 15539 5060 55226
5892 55226 56961 39364 19638 19903 6115 -2454 175 -10689 -38498 -40485 -36270 -17089 5489
5879 5489 12599 17090 18136 15655 4843 5794 58053 73870 47102 18965 -11737 -42337 -37213
5866 -37213 -51781 -45328 -12995 -16524 -5912 28019 1269 34756 26450 -2136 -48383 -45250 -14147
5853 -14147 21674 39036 -12246 -53672 -25859 -15501 -39645 -45020 -23995 -32245 -65222 -91190
$$ packed form
5942H9661k5051k9470j5415k5192k1040l0043m8239K9818j0141R413J941L1658
5930d2100M6498N081P665j3658J5369J2317r572n5055m2055P384O5561j1820o326
5917b0711J1160J6536j6212j0229Q762m1538J541J607n879K2232p311l496J7147
5904b6391K0858J85l3635k9356j2020K4647L5585J6586J0697Q383j0479N0166
5892E5226J735j7597j9726K65j3788q569K629j0864k7809j987M215J9181K2578
5879E489P110M491J046k481j0812R51N2259J5817k6768k8137l0702l0600N124
5866c7213j4568O453L2333l529J0612L3931k6750L3487q306k8586m6247L133L1103
5853a4147L5821J7362n1282m1426K7813J0358k4144n375K1025q250l2977k5968
$$ plain form
5841 -91190 -94830 -59256 -57389 -42219 -59926 -118115 -65392 -39035 -33138 -36701 6980 11223 115
5828 115 1632 34054 41544 8420 1886 33202 -1192 -17021 -11974 16295 49263 19865 3170
5815 3170 -26723 -25135 -10706 -14792 -19939 -15864 3502 -23058 -57727 -54084 -51170 -48866 -6936
5802 -6936 19569 26068 2413 -30922 -49318 -66093 -16111 -21 15063 32228 31261 17469 -5451
5789 -5451 -25515 -799 19249 12355 1247 -18728 -51422 -38806 -26727 -10741 29619 9802
5777 9802 -9768 -20973 9392 38368 59627 28428 539 1401 -3470 -23095 -15091 -4368 2785
5764 2785 7903 6171 16908 23043 -685 -32085 -34992 -37222 -46891 -64263 -67435 -56091 -57796 -44499
5750 -44499 20573 14243 -9314 14630 37655 68250 91298 82615 352 -29357 -3669 12743
$$ packed form
5841i1190l640L5574J867J5170j7707n8189N2723K6357N897l563M3681M243j1108
5828A15J517L2422P490l3124o534L1316l4394j5829N047K8269L2968k9398j6695
5815C170k9893J588J4429m086n147M075J9366k6560l4669L643K914K304M1930
5802f936K6505O499k3655l3335j8396j6775M9982J6090J5084J7165r67j3792k2920
5789e451k0064K4716K0048o894j1108j9975l2694J2616J2079J5986M0360j9817
5777I802j9570j1205L0365K8976K1259l1199k7889Q62m871j9625Q004J0723P153
5764B785N118j732J0737O135k3728l1400k907k230r669j7372l172J1344j705J3297
5750d4499O5072o330k3557K3944K3025L0595K3048q683q2263k9709K5688J6412
$$ plain form
5738 12743 30905 62534 58816 40546 74734 77269 54156 28908 -12013 -23905 -21886 -23971 -45624
5725 -45624 -34836 2824 -9468 -5981 15996 19894 432 -5874 -4935 -33276 -39100 8615 33338
5712 33338 23423 -15794 -45503 -23207 -11211 30539 21548 10878 1960 5481 28728 1065 -7709
5699 -7709 13095 15159 31987 52850 68331 62158 29256 17661 13725 21283 3450 -46730 -1375
5686 -1375 41697 62482 42786 27129 17568 52542 61098 30249 42477 16070 -40847 -2983
5674 -2983 75307 69102 33555 49110 35438 45491 20233 -4092 21200 53034 4456 -2733
5662 -2733 15015 24825 38207 14725 18793 39245 54477 45366 69789 51011 7201 -5488 -27184
5649 -27184 -13741 -12861 -36027 -42801 -45491 -34978 -33381 -33842 -47376 -35354 -10196 46527 50650
$$ packed form
5738A2743J8162L1629l718j8270L4188K535k3113k5248m0921j1892K019k085k1653
5725d5624J0788L7660j2292L487K1977L898j9462o306R39k8341n824M7715K4723
5712C3338r915l9217k9709K2296J1996M1750q991j0670q918L521K3247k7663q774
5699g709K0804K064J6828K0863J5481o173l2902j1595l936P558j7833n0180M5355
5686a375M3072K0785j9696j5657r561L4974Q556l0849J2228k6407n6917L7864
5674b983P8290o205l5547J5555j3672J0053k5258k4325K5292L1834m8578p189
5662b733J7748R810J3382k3482M068K0452J5232r111K4423j8778m3810j2689k1696
5649b7184J3443Q80k3166o774k690J0513J597m61j3534J2022K5158N6723M123
$$ plain form
5636 50650 16776 -8836 -32608 -52492 -52691 -46924 -58308 -32205 -29240 -44109 -21496 -7195 7693
5623 7693 19550 12791 -7749 -44 40963 68737 76045 79608 76305 49092 6874 -25087 -23898
5610 -23898 -950 8920 22519 41058 7132 -40400 -51669 -58502 -48664 33028 75955 59060
5598 59060 66629 82693 63909 54139 44091 35231 31719 25616 8529 20284 39251 1789 -18441
5585 -18441 3503 60515 83862 58505 62897 50059 36293 20741 43099 49605 38572 32656
5573 32656 21109 22612 51110 55520 29810 32245 -9111 -77077 -47854 48260 64255 27305
5561 27305 -12890 -14572 12905 26705 -5798 -60184 -67713 -41730 -13191 14379 36356 47571
5549 47571 77226 101797 83675 92470 78639 60915 29779 29736 20868 15127 16873 33529 -2963
$$ packed form
5636E0650l3874k5612k3772j9884j99N767j1384K6103K965j4869K2613J4301J4888
5623G693J1857o759k0540P705M1007K7774P308L563l303k7213m2218l1961J189
5610b3898K2948R870J3599J8539l3926m7532j1269o833R838Q1692M2927j6895
5598E9060P569J6064j8784r770j0048q860l512o103j7087J1755J8967l7462k0230
5585a8441K1944N7012K3347k5357M392j2838j3766j5552K2358O506j1033n916
5573C2656j1547J503K8498M410k5710K435m1356o7966K9223R6114J5995l6950
5561B7305m0195j682K7477J3800l2503n4386p529K5983K8539K7570K1977J1215
5549D7571K9655K4571j8122Q795j3831j7724l1136m3q868n741J746J6656l6492
$$ plain form
5536 -2963 -25856 -64537 -114536 -97762 -30990 1961 -40529 -69751 -63956 -40062 -66777 -74872
5524 -74872 -10978 -10630 -28083 -47928 -54988 -28416 404 5445 12134 52651 58637 61573 21020
5511 21020 13629 26535 1055 -19686 -8854 -18430 -41221 -56509 -36711 -12020 -21307 -21840 14392
5498 14392 17340 5993 -23247 5769 19152 -7764 15999 28979 -12980 -12658 -23607 -40400
5486 -40400 -70426 -95700 -73988 -54234 -27683 -8464 -32338 -35877 -48429 -54755 -37953 -577
5474 -577 5657 19914 11527 29953 40486 41335 54534 7831 -16228 14628 17584 38079 37787 55497
5460 55497 54451 23449 28649 25648 -13866 -23875 -23767 -20398 -20643 -42886 -86496 -92790 -84493 -88543
5446 -88543 -66007 -50974 -52685 -84650 -67926 -36627 16878 56939 35309 -14177 -39378 -48011
$$ packed form
5536b963k2893l8681m9999J6774O6772L2951m2490k9222N795K3894k6715q095
5524g4872O3894L48j7453j9845p060K6572K8820N041O689M0517N986K936m0553
5511B1020p391J2906k5480k0741J0832r576k2791j5288J9798K4691r287n33L6232
5498A4392K948j1347k9240K9016J3383k6916K3763J2980m1959L22j0949j6793
5486d0400l0026k5274K1712J9754K6551J9219k3874l539j2552o326J6802L7376
5474e77O234J4257q387J8426J0533Q49J3199m6703k4059L0856K956K0495k92J7710
5460E5497j046l1002N200l001l9514j0009J08L369k45k2243m3610o294Q297m050
5446h8543K2536J5033j711l1965J6724L1299N3505M0061k1630m9486k5201q633
$$ plain form
5434 -48011 -53858 -42037 -32271 -48513 -72681 -70244 -53408 -79444 -86164 -43872 -15133 -38217 -67656
5421 -67656 -71462 -53156 -42729 -17767 -8169 -20314 5635 28277 8914 18433 8300 -25881
5409 -25881 -39197 -52820 -42811 -47525 -16898 -28951 -50639 -38816 -8887 30552 -4174 -25142
5397 -25142 -25539 -5108 -226 -8530 -58709 -9074 -5082 -8280 -10995 -26149 -11104 10320 16359
5384 16359 9444 -46688 -60498 -2603 31057 52020 39705 35886 30098 10380 -42225 -29503
5372 -29503 1520 -973 -41671 -10788 27065 30070 15596 49558 27769 -19063 -25932 -16966 -33628
5359 -33628 -35211 -17850 -20902 -24415 7326 32001 22592 6831 -27874 -43570 -47522 -68419 -45967
5346 -45967 -36646 -21643 -9747 -10317 -30379 -53384 -53553 -41874 -31598 15118 31988 49806 10010
$$ packed form
5434d8011n847J1821R766j6242k4168K437J6836k6036o720M2292K8739k3084k9439
5421f7656l806J8306J0427K4962R598j2145K5949K2642j9363R519j0133l4181
5409b5881j3316j3623J0009m714L0627j2053k1688J1823K9929L9439l4726k0968
5397b5142l97K0431M882q304n0179M9635L992l198k715j5154J5045K1424O039
5384A6359o915n6132j3810N7895L3660K0963j2315l819n788j9718n2605J2722
5372b9503L1023k493m0698L0883L7853L005j4474L3962k1789m6832o869Q966j6662
5359c3628j583J7361l052l513L1741K4675r409j5761l4705j5696l952k0897K2452
5346d5967R321J5003J1896n70k0062k3005j69J1679J0276M6716J6870J7818l9796
$$ plain form
5333 10010 -21138 -23840 1906 -11032 -3454 -21861 -40679 -34422 -28314 15233 47935 42648 40330
5320 40330 6301 14590 18342 11504 3381 -11096 -35857 -31893 -40217 -24196 29066 27514 12204
5307 12204 18406 -20015 -22098 -2394 19950 15537 -3046 40023 89681 77948 78048 68765 49254
5294 49254 42023 -9473 -62208 -31810 370 6717 16745 -6896 -45744 -52955 -65341 -91798
5282 -91798 -91183 -74447 -65826 -18137 -7074 13796 39870 56562 11651 -20874 -32929 -10618
5270 -10618 -12999 -44250 -67036 -33653 7725 15719 15531 27696 35436 -7496 -46373 -46058 -32864
5257 -32864 9208 -8726 -38883 -10422 -16757 16384 9572 7459 14820 -22714 -600 19648 -7437
5244 -7437 -28424 12666 56592 91598 101258 74644 12960 -40579 -35892 30307 63033 38998
$$ packed form
5333A0010l1148k702K5746j2938P578j8407j8818O257O108M3547L2702n287k318
5320D0330l4029Q289L752o838q123j4477k4761L964q324J6021N3262j552j5310
5307A2204O202l8421k083J9704K2344m413j8583M3069M9658j1733J00r283j9511
5294D9254p231n1496n2735L0398L2180O347J0028k3641l8848p211j2386k6457
5282i1798O15J6736Q621M7689J1063K0870K6074J6692m4911l2525j2055K2311
5270a0618k381l1251k2786L3383M1378P994j88J2165P740m2932l8877L15J3194
5257c2864M2072j7934l0157K8461o335L3141o812k113P361l7534K2114K0248k7085
5244g437k0987M1090M3926L5006R660k6614o1684n3539M687O6199L2726k4035
$$ plain form
5232 38998 -13 -2629 34482 54145 52720 6458 16688 33916 13880 18785 31562 7768
5220 7768 5226 -3372 22573 9549 17586 -3529 3955 13645 -38312 -94017 -93946 -41248 -5509 -31761
5206 -31761 -48470 5606 76137 56193 -4597 -78193 -67258 -22372 -31181 -35007 4760 63854
5194 63854 30261 -16815 -17668 19467 26099 23182 18344 33809 54695 30621 736 8786 22847
5181 22847 34476 318 11234 -16457 -36195 6520 46501 59842 70769 95249 86817 101275
5169 101275 92977 65193 48105 71467 73034 41245 48928 67439 42885 15502 -4655 -13768
5157 -13768 -27488 -28874 -29400 3501 -3736 15166 16177 -7885 -15422 -61617 -65864 -40057 -14495
5144 -14495 -25211 817 28418 5283 -24393 -24223 -56286 -16373 36417 9704 20249 -505
$$ packed form
5232C8998l9011k616L7111J9663j425m6262J0230J7228k0036M905J2777k3794
5220G768k542q598K5945j3024Q037k1115P484R690n1957n5705P1N2698L5739k6252
5206c1761j6709N4076P0531j9944o0790p3596J0935M4886q809l826L9767N9094
5194F3854l3593m7076q53L7135O632k917m838J5465K0886k4074k9885Q050J4061
5181B2847J1629l4158J0916k7691j9738M2715L9981J3341J0927K4480q432J4458
5169A01275q298k7784j7088K3362J567l1789P683J8511k4554k7383k0157r113
5157a3768j3720j386n26L2901p237J8902J011k4062p537m6195m247K5807K5562
5144a4495j0716K6028K7601k3135k9676J70l2063L9913N2790k6713J0545k0754
$$ plain form
5132 -505 18172 23588 7242 22663 21677 -14442 -10641 26491 40711 34289 1781 -37033 -65335
5119 -65335 -76697 -87613 -73715 -26640 -26012 -33118 -12556 -41392 -39023 23530 17949 -12906 8326
5106 8326 9583 48807 56709 50004 53922 37227 68876 82040 57482 68509 95510 76577 -5003
5093 -5003 -41913 7611 18938 -17935 -51362 -19022 -29132 -2046 20723 9276 -45471 -55483
5081 -55483 -42560 17803 31064 36815 39875 5985 -12276 -41923 -73798 -57052 -34282 -32056
5069 -32056 -75916 -75704 -55309 -41900 -60829 -18748 8362 14461 -27506 -8560 24994 23655 23496
5056 23496 3624 -7845 -22639 -45079 -33131 17463 17561 48086 71313 72902 27932 83439 91330
5043 91330 51998 1336 17508 782 6845 54173 58926 35348 -16306 25752 55228 13268
$$ packed form
5132e05J8677N416j6346J5421r86l6119L801L7132J4220o422l2508l8814k8302
5119f5335j1362j0916J3898M7075O28p106K0562k8836K369O2553n581l0855K1232
5106H326J257L9224P902o705L918j6695L1649J3164k4558J1027K7001j8933q1580
5093e003l6910M9524J1327l6873l3427L2340j0110K7086K2769j1447n4747j0012
5081e5483J2923O0363J3261N751L060l3890j8261k9647l1875J6746K2770K226
5069c2056m3860K12K0395J3409j8929M2081K7110O099m1967J8946L3554j339j59
5056B3496j9872j1469j4794k2440J1948N0594R8L0525K3227J589m4970N5507P891
5043I1330l9332n0662J6172j6726O063M7328M753k3578n1654M2058K9476m1960
$$ plain form
5031 13268 342 776 14859 6756 -7922 -6300 3513 6799 36210 17903 15731 44330 54046
5018 54046 80717 57992 5030 -116 35735 67332 48330 -7328 -23646 -42315 -43985 -47089
5006 -47089 -20365 -343 -25852 2273 2559 -46466 -43160 -55125 -77087 -55431 -21844 -26316 -57146
4993 -57146 -5112 -378 -40632 -44306 18358 44895 35230 16651 10344 20271 24984 34527 22553
4980 22553 -4637 -12719 -35739 -82603 -123547 -85485 -65383 -14356 29795 38511 12975 18752
4968 18752 32532 17311 -12838 -15022 -23977 -37075 -35933 -37715 -12273 29321 56993 49462 46870
4955 46870 7503 -20872 -27348 -53101 -41148 1214 17352 4266 -15829 -34666 -19637 10598
4943 10598 -8247 -20939 -19509 -3597 15196 50129 41149 32154 81127 69093 3176 -11023
$$ packed form
5031A3268j2926M34J4083q103j4678J622R813L286K9411j8307k172K8599R716
5018E4046K6671k2725n2962n146L5851L1597j9002n5658j6318j8669j670l104
5006d7089K6724K0022k5509K8125K86m9025L306j1965k1962K1656L3587m472l0830
4993e7146N2034M734m0254l674O2664K6537r665j8579o307R927M713R543j1974
4980B2553k7190q082k3020m6864m0944L8062K0102N1027M4151Q716k5536N777
4968A8752J3780j5221l0149k184q955j3098J142j782K5442M1594K7672p531k592
4955D6870l9367k8375o476k5753J1953M2362J6138j3086k0095j8837J5029L0235
4943A0598j8845j2692J430J5912J8793L4933q980q995M8973j2034o5917j4199
$$ plain form
4931 -11023 -27124 -23235 -31187 -56841 -60679 -91646 -53924 -7790 -8705 31967 41372 -16601 -59268
4918 -59268 -45029 -22150 166 17741 37096 30425 50495 57006 41263 -8592 -30098 1629
4906 1629 -2568 -62808 -70156 -47008 4222 12797 301 -18870 -16171 -2581 -13474 -59221 -71566
4893 -71566 -44146 -11957 4016 -6319 -1693 -12775 -924 26703 386 9848 10290 22270 21055
4880 21055 4117 -54089 -79330 -85506 -38180 7552 -16774 -22003 -19395 -48313 -83845 -31665
4868 -31665 -25446 -4362 -79718 -156457 -137087 -132832 -110877 -49856 -15091 22486 9940 -54578
4856 -54578 -35417 22074 28747 10014 7381 17794 -964 -33425 -51948 -65357 -34298 22689
4844 22689 21497 -5435 3529 12219 -25987 -73440 -73011 -51498 -11114 731 -46418 -89426 -32547
$$ packed form
4931a1023j6101L889p952k5654l838l0967L7722M6134r15M0672R405n7973m2667
4918e9268J4239K2879K2316J7575J9355o671K0070O511j5743m9855k1506L1727
4906A629m197o0240p348K3148N1230Q575j2496j9171K699J3590j0893m5747j2345
4893g1566K7420L2189J5973j0335M626j1082J1851K7627k6317R462M42J1980j215
4880B1055j6938n8206k5241o176M7326M5732k4326n229K608k8918l5532N2180
4868c1665O219K1084p5356p6739J9370M255K1955O1021L4765L7577j2546o4518
4856e4578J9161N7491O673j8733k633J0413j8758l2461j8523j3409L1059N6987
4844B2689j192k6932Q964Q690l8206m7453M29K1513M0384J1845m7149m3008N6879
$$ plain form
4831 -32547 -16867 -8030 37529 15673 -22532 -10873 -16699 -52885 -38611 -18992 -4397 -21298
4819 -21298 -19495 9339 2815 -25904 -15511 23463 26149 2514 -15338 -54835 -53722 -26863 -20323
4806 -20323 -45437 -42490 -18306 34534 66501 56907 33356 12263 462 40647 46663 19166
4794 19166 17602 -4081 31813 70732 52463 32887 26147 -1037 -30962 -42356 -45176 -57901
4782 -57901 -20779 -27998 -11405 -10204 -23255 -3021 33861 7046 -25181 -37536 -29058 -9974
4770 -9974 724 -16109 21091 53347 30124 14692 -28338 -62199 -92136 -100543 -102202 -43187
4758 -43187 -8407 10204 2917 -11154 -8588 9160 11472 -3322 -35367 -35566 -18000 -28630 -27667
4745 -27667 10350 11064 11917 35757 48046 5302 -65808 -59206 -23655 -41304 -43980 -42184 -35025
$$ packed form
4831c2547J5680Q837M5559k1856l8205J1659n826l6186J4274J9619J4595j6901
4819b1298J803K8834o524k8719J0393L8974K686k3635j7852l9497J113K6859O540
4806b0323k5114K947K4184N2840L1967r594k3551k1093j1801M0185O016k7497
4794A9166j564k1683L5894L8919j8269j9576o740k7184k9925j1394k820j2725
4782e7901L7122p219J6593J201j3051K0234L6882k6815l2227j2355Q478J9084
4770i974J0698j6833L7200L2256k3223j5432m3030l3861k9937q407j659N9015
4758d3187L4780J8611p287j4071K566J7748K312j4794l2045j99J7566j0630R63
4745b7667L8017P14Q53K3840J2289m2744p1110O602L5551j7649k676J796P159
$$ plain form
4732 -35025 36386 32799 3747 3023 13647 19778 25389 9539 -12827 -9953 29235 24993 34974
4719 34974 -6630 -39269 -13134 -5386 4993 20331 8804 -2436 -2915 6594 -13437 22648 9952
4706 9952 -17401 -24817 -59137 -29570 468 -31573 -56883 -66489 -61235 -84029 -22974 46276 61266
4693 61266 37989 3938 8567 41196 55873 66155 53605 49302 36239 614 -4439 -36757
4681 -36757 -57823 -37404 804 -3941 -13333 -24178 1925 -8559 -19606 -39886 -17728 10698
4669 10698 -3410 -24083 -67289 -79654 -10410 -238 2123 12627 38934 -16629 -32893 12397
4657 12397 30669 11587 -33578 -62584 -38326 -798 -22445 -83547 -93993 -55956 -58040 -6510
4645 -6510 9932 35505 45125 34217 26798 12284 -710 13888 20109 20219 -5586 -12331 37480
$$ packed form
4732c5025P1411l587k9052p24J0624O131N611j5850k2366K874L9188m242R981
4719C4974m1604l2639K6135P748J0379J5338j1527j1240m79R509k0031L6085j2696
4706I952k7353p416l4320K9567L0038l2041k5310r606N254k2794O1055O9250J4990
4693F1266k3277l4051M629L2629J4677J0282j2550m303j3063l5625n053l2318
4681c6757k1066K0419L8208m745r392j0845K6103j0484j1047k0280K2158K8426
4669A0698j4108k0673m3206j2365O9244J0172K361J0504K6307n5563j6264M5290
4657A2397J8272j9082m5165k9006K4258L7528k1647o1102j0446L8037k084N1530
4645f510J6442K5573R620j0908p419j4514j2994J4598O221J10k5805o745M9811
$$ plain form
4632 37480 31588 55720 72922 63661 41343 13931 -15752 2497 -3856 -2254 -1694 12868 18093
4619 18093 16680 27198 34020 81556 67859 15363 7854 42065 25328 -3799 31284 -27131
4607 -27131 -54299 -25279 -3772 -7992 23770 50430 41974 15093 2401 -8630 9543 30715
4595 30715 17136 2895 6530 41072 17483 -34290 -33977 -17897 10608 19281 10358 51909 45707
4582 45707 42727 65180 32590 -12547 -15952 5053 -1817 -14823 -13947 2497 -23241 -20578 -40901
4569 -40901 -57018 -46586 -24206 -12543 -22713 -29860 -33290 -37246 -26441 -27236 -38756 -35480 -39400
4556 -39400 -30794 -33310 -44502 -22497 -5893 -41719 -41025 -68191 -50274 -21102 -3616 42634 51316
4543 51316 4639 -35019 -71536 -30779 9864 26595 4314 21925 82158 78888 17192 16923
$$ packed form
4632C7480n892K4132J7202r261k2318k7412k9683J8249o353J602N60J4562N225
4619A8093j413J0518O822M7536j3697n2496p509L4211j6737k9127L5083n8415
4607b7131k7168K9020K1507m220L1762K6660q456k6881j2692j1031J8173K1172
4595C0715j3579j4241L635L4542k3589n1773L13J6080K8505Q673q923M1551o202
4582D5707k980K2453l2590m5137l405K1005o870j3006Q76J6444k5738K663k0323
4569d0901j6117J0432K2380J1663j0170p147l430l956J0805p95j1520L276l920
4556c9400Q606k516j1192K2005J6604l5826O94k7166J7917K9172J7486M6250Q682
4543E1316m6677l9658l6517M0757M0643J6731k2281J7611O0233l270o1696k69
$$ plain form
4531 16923 38759 -5700 -37262 -45014 -31150 -48564 -58105 -47817 -48645 -41972 -33126 -38585 -57015
4518 -57015 -44559 -37234 -27970 -4037 -59313 -86584 -85942 -69106 -38591 18313 63154 62253 58028
4505 58028 49823 15651 -15560 -3188 29411 40818 43189 59617 20509 -5425 -18651 -25499
4493 -25499 -30150 -20272 -6848 8914 6050 40416 -15221 -64745 -38246 -21778 -15479 -50150 -24603
$$ packed form
4531A6923K1836m4459l1562p752J3864j7414r541J0288q28O673Q846n459j8430
4518e7015J2456P325R264K3933n5276k7271O42J6836L0515N6904M4841r01m225
4505E8028q205l4172l1211J2372L2599J1407K371J6428l9108k5934j3226o848
4493b5499m651R878J3424J5762k864L4366n5637m9524K6499J6468O299l4671K5547
$$ [...]
##END NTUPLES=NMR SPECTRUM
##END=
