##TITLE=Analysis number 318297
Compound Code mo 00919
Book Reference 423/34
Project Code adrs
Chemist Name bruced
##JCAMPDX= 6.0         $$ Bruker NMR JCAMP-DX V2.0
##DATA TYPE= NMR SPECTRUM
##DATA CLASS= NTUPLES
##ORIGIN= Bruker BioSpin GmbH
##OWNER= nmr
$$ XWIN-NMR		Version 3.5
$$ Wed Mar 22 16:32:25 2006 GMT Standard Time (UT+0h)  MAYBRIDGE\nmr@NMR_250MHZ
##.OBSERVE FREQUENCY= 250.131544655141
##.OBSERVE NUCLEUS= ^1H
##.ACQUISITION MODE= SIMULTANEOUS (DQD)
##.ACQUISITION SCHEME= undefined
##.AVERAGES= 16
##.DIGITISER RES= 18
##SPECTROMETER/DATA SYSTEM= dpx250
##.PULSE SEQUENCE= zg30
##.SOLVENT NAME= CDCl3
##.SHIFT REFERENCE= (INTERNAL, CDCl3, 0, 16.4523)
##AUDIT TRAIL= $$ (NUMBER, WHEN, WHO, WHERE, WHAT)
$$ ##TITLE= Audit trail, XWIN-NMR		Version 3.5
$$ ##JCAMPDX= 5.01
$$ ##ORIGIN= Bruker BioSpin GmbH
$$ ##OWNER= nmr
$$ C:\u/data/dgb/nmr/ADRS/1270/pdata/1/auditp.txt
$$ ##AUDIT TRAIL=  $$ (NUMBER, WHEN, WHO, WHERE, WHAT)
(   1,<2006-03-22 16:32:05.96 +000>,<MAYBRIDGE\nmr>,<NMR_250MHZ>,
      <created by zg, POWCHK disabled, PULCHK disabled
       configuration hash MD5:
       84 BC 41 DB A1 6E 1D 46 DA 25 12 A5 C1 ED C5 3A
       data hash MD5: 64K
       1D 62 90 EF 35 79 76 A5 5A 02 5D B3 3B C5 EB 0D>)
(   2,<2006-03-22 16:32:17.08 +000>,<MAYBRIDGE\nmr>,<NMR_250MHZ>,
      <Start of raw data processing
       ef LB = 0.3 FT_mod = 6 PKNL = 1 SI = 32K 
       data hash MD5: 32K
       E5 27 39 38 EC EE 89 A5 DB 6F 1D 9C 38 B7 34 7E>)
(   3,<2006-03-22 16:32:18.58 +000>,<MAYBRIDGE\nmr>,<NMR_250MHZ>,
      <apk 
       data hash MD5: 32K
       99 E7 51 F9 36 42 9E A0 16 A2 4A 56 2F 74 86 82>)
(   4,<2006-03-22 16:32:19.29 +000>,<MAYBRIDGE\nmr>,<NMR_250MHZ>,
      <abs ABSG = 5 
       data hash MD5: 32K
       CE 55 1A 4E 85 1B 20 FE 77 C0 E9 36 DB F7 11 A9>)
$$ ##END=
$$ 
$$ hash MD5
$$ 9C F7 BD 67 BF AF CD CD C1 F3 1A 62 49 C4 4F 6D
##$RELAX= 
##$RELAX= 
##$RELAX= 
##$RELAX= 
##$RELAX= 
##$RELAX= 
##$RELAX= 
$$ Bruker specific parameters
$$ --------------------------
##$DU= <C:\u>
##$EXPNO= 1270
##$NAME= <ADRS>
##$PROCNO= 1
##$TYPE= <nmr>
##$USER= <dgb>
##$AMP= (0..31)
100 100 100 100 100 100 100 100 100 100 100 100 100 100 100 100 100 100 
100 100 100 100 100 100 100 100 100 100 100 100 100 100 
##$AQSEQ= 0
##$AQ_mod= 3
##$AUNM= <au_zg>
##$AUTOPOS= <55 >
##$BF1= 250.13
##$BF2= 250.13
##$BF3= 250.13
##$BF4= 250.13
##$BF5= 500.13
##$BF6= 500.13
##$BF7= 500.13
##$BF8= 500.13
##$BYTORDA= 1
##$CFDGTYP= 0
##$CFRGTYP= 5
##$CHEMSTR= <none>
##$CNST= (0..31)
1 1 145 1 1 1 1 1 1 1 1 1 1 1 1 1 1 1 1 1 1 1 1 1 1 1 1 1 1 1 1 1 
##$CPDPRG= <>
##$CPDPRG1= <>
##$CPDPRG2= <>
##$CPDPRG3= <>
##$CPDPRG4= <mlev>
##$CPDPRG5= <mlev>
##$CPDPRG6= <mlev>
##$CPDPRG7= <mlev>
##$CPDPRG8= <mlev>
##$CPDPRGB= <>
##$CPDPRGT= <>
##$D= (0..31)
0 1 0 0 0 0 0 0 0 0.06 0 0 0 0 0 0 0.0002 0 0 0 0 0 0 0 0 0 0 0 0 0 0 
0 
##$DATE= 1143045125
##$DBL= (0..7)
120 120 120 120 120 120 120 120 
##$DBP= (0..7)
150 150 150 150 150 150 150 150 
##$DBP07= 0
##$DBPNAM0= <>
##$DBPNAM1= <>
$$ [...]
##$SUBNAM7= <"">
##$SUBNAM8= <"">
##$SUBNAM9= <"">
##$SW= 20.6930455092707
##$SWIBOX= (0..15)
0 0 3 0 0 0 0 0 0 0 0 0 0 0 0 0 
##$SW_h= 5175.983436853
##$TD= 65536
##$TD0= 1
##$TE= 294.16
##$TE2= 300
##$TE3= 300
##$TEG= 300
##$TL= (0..7)
0 120 120 120 120 120 120 120 
##$TP= (0..7)
150 150 150 150 150 150 150 150 
##$TP07= 0
##$TPNAME0= <>
##$TPNAME1= <>
##$TPNAME2= <>
##$TPNAME3= <>
##$TPNAME4= <>
##$TPNAME5= <>
##$TPNAME6= <>
##$TPNAME7= <>
##$TPOAL= (0..7)
0.5 0.5 0.5 0.5 0.5 0.5 0.5 0.5 
##$TPOFFS= (0..7)
0 0 0 0 0 0 0 0 
##$TUNHIN= 0
##$TUNHOUT= 0
##$TUNXOUT= 0
##$USERA1= <user>
##$USERA2= <user>
##$USERA3= <user>
##$USERA4= <user>
##$USERA5= <user>
##$V9= 5
##$VALIST= <valist>
##$VCLIST= <CCCCCCCCCCCCCCC>
##$VD= 0
##$VDLIST= <DDDDDDDDDDDDDDD>
##$VPLIST= <PPPPPPPPPPPPPPP>
##$VTLIST= <TTTTTTTTTTTTTTT>
##$WBST= 1024
##$WBSW= 4
##$XGAIN= (0..3)
0 0 0 0 
##$XL= 0
##$YL= 0
##$YMAX_a= 314948
##$YMIN_a= -364126
##$ZGOPTNS= <>
##$ZL1= 120
##$ZL2= 120
##$ZL3= 120
##$ZL4= 120
##$ABSF1= 16.45228
##$ABSF2= -4.240892
##$ABSG= 5
##$ABSL= 3
##$ALPHA= 0
##$AQORDER= 0
##$ASSFAC= 0
##$ASSFACI= 0
##$ASSFACX= 0
##$ASSWID= 0
##$AUNMP= <proc_1d>
##$AZFE= 0.1
##$AZFW= 0.1
##$BCFW= 0
##$BC_mod= 0
##$BYTORDP= 0
##$COROFFS= 0
##$CY= 12.5
##$DATMOD= 1
##$DC= 0
##$DFILT= <>
##$DTYPP= 0
##$F1P= 14.0000005364418
##$F2P= -0.99999901652339
##$FCOR= 0.5
##$FTSIZE= 32768
##$FT_mod= 6
##$GAMMA= 0
##$GB= 0
##$INTBC= 1
##$INTSCL= 1
##$ISEN= 128
##$LB= 0.3
##$LEV0= 0
##$LPBIN= 0
##$MAXI= 10000
##$MC2= 0
##$MEAN= 0
##$ME_mod= 0
##$MI= 0
##$NCOEF= 0
##$NC_proc= -2
##$NLEV= 6
##$NOISF1= 0
##$NOISF2= 0
##$NSP= 0
##$NTH_PI= 0
##$NZP= 0
##$OFFSET= 16.45228
##$PC= 1
##$PHC0= 178.0806
##$PHC1= 8.736368
##$PH_mod= 1
##$PKNL= yes
##$PPARMOD= 0
##$PSCAL= 4
##$PSIGN= 0
##$REVERSE= no
##$SF= 250.130017438719
##$SI= 32768
##$SIGF1= 0
##$SIGF2= 0
##$SINO= 400
##$SIOLD= 32768
##$SREGLST= <1H.CDCl3>
##$SSB= 0
##$STSI= 32768
##$STSR= 0
##$SW_p= 5175.98343685301
##$SYMM= 0
##$S_DEV= 0
##$TDeff= 65536
##$TDoff= 0
##$TI= <Analysis number 999999
Compound Code 99
Book Reference 9
Project Code 9>
##$TILT= no
##$TM1= 0
##$TM2= 0
##$TOPLEV= 0
##$USERP1= <user>
##$USERP2= <user>
##$USERP3= <user>
##$USERP4= <user>
##$USERP5= <user>
##$WDW= 1
##$XDIM= 32768
##$YMAX_p= 267805811
##$YMIN_p= -94741
$$ End of Bruker specific parameters
$$ ---------------------------------
##NTUPLES= NMR SPECTRUM
##VAR_NAME=  FREQUENCY,     SPECTRUM/REAL,   SPECTRUM/IMAG
##SYMBOL=    X,             R,               I
##VAR_TYPE=  INDEPENDENT,   DEPENDENT,       DEPENDENT
##VAR_FORM=  AFFN,          ASDF,            ASDF
##VAR_DIM=   32768,         32768,           32768
##UNITS=     HZ,            ARBITRARY UNITS, ARBITRARY UNITS
##FACTOR=    0.157963299565203, 1,           1
##FIRST=     4115.2090944514, 0,             0
##LAST=      -1060.77434240161, 0,           0
##MIN=       -1060.77434240161, -94741,      0
##MAX=       4115.2090944514, 267805811,     0
$$ Real data points
##PAGE= N=1
##DATA TABLE= (X++(R..R)), XYDATA
$$ [...]
14831A1129j2900L5206m736j8776R669L08j1521j5712j4237J096K391J2912K2815
$$ 11129 -1771 33435 28699 9923 19592 19900 8379 -7333 -21570 -20474 -18083 -5171 17644
14818A7644K1173j5850R094j8899j1372P216R431P83j5576J5044K920Q059j8548
$$ 17644 38817 22967 32061 13162 1790 9006 18437 19220 3644 18688 21608 29667 11119
14805A1119J8493J2901J0034j0576l5410j7941J4257k8220j9096l725J4827N1316
$$ 11119 29612 42513 52547 41971 6561 -11380 2877 -25343 -44439 -48164 -33337 17979
14793A7979J0509k4036k9303J620n120j8565Q969J6921J8785r470l0770N129M3808
$$ 17979 28488 4452 -24851 -23231 -28351 -46916 -37947 -21026 -2241 -11711 -42481 -37352 6456
14780F456K7280k1868K146k316l5414l972K0846K9062J9235j7454k8649K3497
$$ 6456 33736 11868 14014 11698 -23716 -27688 -6842 22220 41455 24001 -4648 18849
14768A8849J8220j6913m615j0010K1019r059j6312l959n834j1151j987J7620K3415
$$ 18849 37069 20156 15541 5531 26550 17491 1179 -2780 -8614 -19765 -21752 -4132 19283
14755A9283K1008k044r667k0714j6948K6885M164j9658k3752L377J9360J8119
$$ 19283 40291 38247 28580 7866 -9082 17803 21967 2309 -21443 -18066 1294 19413
14743A9413J6696q971m951l6110l4311k4997R855J5992J7913j925P426O028m251
$$ 19413 36109 27138 22187 -13923 -48234 -73231 -63376 -47384 -29471 -31396 -23970 -17942 -22193
14730b2193L47o704M733m360J3843K1650j5389j0045J3398J7212J4782P782j7545
$$ -22193 -21846 -28550 -23817 -28177 -14334 7316 -8073 -18118 -4720 12492 27274 35056 17511
14717A7511L591J7958j715J2864l933j298J4440k495l9072k5050j7579Q322P698
$$ 17511 21102 39060 37345 50209 46276 44978 59418 56923 17851 -7199 -24778 -16456 -8758
14704h758R365Q032J5433j2834l2997o335L2854R162k4428k7979K5092L6862R70
$$ -8758 607 8639 24072 11238 -21759 -28094 4760 13922 -10506 -38485 -13393 23469 24439
14691B4439o621k3509n968r280J3764J6756J1481n833Q566L519N349q040j5050
$$ 24439 17818 -5691 -11659 -20939 -7175 9581 21062 15229 23795 27314 32663 24623 9573
14678I573j8029O084J9182L761k1460l782J3051l021r033K550j0382k0092k345
$$ 9573 -8456 -2372 16810 20571 -889 -4671 8380 5359 -3674 -1124 -11506 -31598 -33943
14665c3943R184J7763O543j3607l051J0105j1446J0971n181j5052j7686J5934
$$ -33943 -24759 -6996 -453 -14060 -17111 -7006 -18452 -7481 -12662 -27714 -45400 -29466
14653b9466L1120j9182m316J5885r57P429l699l415J3353r857k5565k8479Q654
$$ -29466 1654 -17528 -21844 -5959 -6916 513 -3186 -6601 6752 -3105 -28670 -57149 -48495
14640d8495K7185K0924l279j7247K6046k984O03Q257R352j4916j7081k6191O277
$$ -48495 -21310 -386 -3665 -20912 5134 2150 2753 11010 20362 5446 -11635 -37826 -31549
14627c1549L2343j0407k5631K4122j7221j0894K9368K520j4243k1707m1775Q724
$$ -31549 794 -9613 -35244 -11122 -28343 -39237 -9869 -7349 -21592 -43299 -85074 -76350
14615g6350K4776L3073N48Q383J1333l0647j4270j524R107j7280N77K6655K7013
$$ -76350 -51574 -18501 -17953 -9570 1763 -28884 -43154 -44678 -35571 -52851 -52274 -25619 1394
14602A394J3893r228j3300N261P946J4579Q204k943N858k1774k8552j8319J7038
$$ 1394 15287 6059 -7241 -1980 5966 20545 28749 25806 31664 9890 -18662 -36981 -19943
14589a9943K7009K3534K2963J1095l1518l0889J0678r549o964J7489K6290j5284
$$ -19943 7066 30600 53563 64658 33140 2251 12929 3380 -3584 13905 40195 24911
14577B4911l9831k2426K5306Q029r875J0682j5280j1614p525J4849M6210p960
$$ 24911 -14920 -37346 -12040 -4011 -13886 -3204 -18484 -30098 -37623 -22774 23436 15476
14565A5476j0406M04j5851N051J6279j0253j6258J8848L4205j4686j0057K5207
$$ 15476 5070 5474 -10377 -5326 10953 700 -15558 3290 37495 22809 12752 37959
14553C7959J7655N800n924j5482l277K4490n74N186j0214k3765J7866J817k0732
$$ 37959 55614 61414 55490 40008 36731 61221 60647 65833 55619 31854 49720 51537 30805
14540C0805j149K811l3270j4445J9517K3427m5877j794K8320P444j2943J7775
$$ 30805 29656 32467 -803 -15248 4269 27696 -18181 -19975 8345 15789 2846 20621
14528B0621m40j4720j0838n273J3489J7596K1569J2946l0949j5362K7582J5041
$$ 20621 20181 5461 -5377 -10650 2839 20435 42004 54950 24001 8639 36221 51262
14516E1262o302K231L8138k0344k4999j3976r287R228m169j4020P92J6242M090
$$ 51262 44960 47191 85329 64985 39986 26010 16723 25951 21782 7762 8554 24796 28886
14503B8886q691k9129l751J437Q174Q533J8793J2227j1818J6494l8064m6206O374
$$ 28886 20195 -8934 -12685 -11248 -3074 5459 24252 36479 24661 41155 3091 -43115 -36741
14490c6741K3094J7353P415L831J4620r053k2018j358l569R63J3885m179j407
$$ -36741 -13647 3706 11121 14952 29572 20519 -1499 -2857 -6426 -5463 8422 4243 2836
14477B836m692r715P773k7264j1220m891K2522P682K799J3240L303O001j5585
$$ 2836 -1856 -11571 -3798 -31062 -42282 -47173 -24651 -16969 -14170 -930 2373 8374 -7211
14464g211O002J4345j656o000O000N029P936j1139J7153J5573R667J2373j2489
$$ -7211 -1209 13136 11480 5480 11480 16509 24445 13306 30459 46032 55699 68072 55583
14451E5583k6155k551N143j4865k501q218J7345J4361l4583j6504l959J651j4783
$$ 55583 29428 26877 32020 17155 14654 6436 23781 38142 3559 -12945 -16904 -15253 -30036
14438c0036J7809K1066q497r869J4133k452N072K1721k4356k1228O768J7200k2731
$$ -30036 -12227 8839 342 -9527 4606 2154 7226 28947 4591 -16637 -9869 7331 -15400
14425a5400p976j8511O77J3283j0575J3520L872K877J1973J2722P885j8099o450
$$ -15400 -23376 -41887 -41210 -27927 -38502 -24982 -21110 -18233 -6260 6462 14347 -3752 -10202
14412a0202k2028j698K2101N080N838M880K790j6199q177M53J563m823r163K4464
$$ -10202 -32230 -33928 -11827 -6747 -909 3971 6761 -9438 -17615 -17162 -15599 -20422 -29585 -5121
14398e121r561M020o705j2212J3469n766k9808m531O786M1616J4575j5198j9090
$$ -5121 -14682 -10662 -17367 -29579 -16110 -21876 -51684 -56215 -49429 -7813 6762 -8436 -27526
14385b7526J2431Q480l784L643J7589K7990l0411k5021k1608N068N126r282J2406
$$ -27526 -15095 -6615 -10399 -6756 10833 38823 8412 -16609 -38217 -33149 -28023 -37305 -24899
14372b4899K9882j5782l420L3384P815l3009O474Q848j0038J2005K1077J1570
$$ -24899 4983 -10799 -14219 19165 26980 -6029 445 9293 -745 11260 32337 43907
14360D3907k7444k9963J0123K1582J457n192J9r2j1012j4229M87j3615J3080K7149
$$ 43907 16463 -13500 -3377 18205 19662 14470 14489 14397 3385 -10844 -10357 -23972 -10892 16257
14346A6257K5653k6179p837J504J3536J5481q492K378n32K6810k73l2608j8349
$$ 16257 41910 15731 7894 9398 22934 38415 29923 32301 31769 58579 58306 25698 7349
14333G349N488p947m442L035j2620M418j928N061n126M832k2367o112K9611M48
$$ 7349 12837 4890 448 3483 -9137 -4719 -6647 -1586 -6712 -1880 -24247 -30359 -748 -300
14319c00k3180r101J61R6K0154P878j7718p320P777K5667K6153K4617j7855k3972
$$ -300 -23480 -32581 -32420 -32324 -12170 -4292 -22010 -29330 -21553 4114 30267 54884 37029 13057
14305A3057K3639J9242J1323k5512j8283k2844j8510J9159j6977Q012R995j6127
$$ 13057 36696 55938 67261 41749 23466 622 -17888 1271 -15706 -7694 2301 -13826
14293a3826j4771M794K8782K5342O703j4010m543q566j2331J1702K3610P150N496
$$ -13826 -28597 -23803 4979 30321 37024 23014 18471 9905 -2426 9276 32886 40036 45532
14280D5532j3409j680m894Q102o103m0503k0672J1635K028K0857K0958l0535l2660
$$ 45532 32123 30443 25549 33651 27548 -12955 -33627 -21992 -19964 893 21851 -8684 -41344
14267d1344q85K3169K4304m6080l931J7508M306J5876K8400J0164j4744j8482
$$ -41344 -42229 -19060 5244 -40836 -44767 -27259 -22953 -7077 21323 31487 16743 -1739
14255a739j532k664o193J0607J8685L474p171k372J672n902k3375j7488J2158
$$ -1739 -3271 -5935 -12128 -1521 17164 20638 13467 11095 12767 6865 -16510 -33998 -21840
14242b1840J0857J5591K2985Q204p547k0611j7731j7291J9089L7823m797j8035
$$ -21840 -10983 4608 27593 35797 28250 7639 -10092 -27383 -8294 29529 24732 6697
14230F697r577J432K875o0l252j5794M675M516K399O701k0123M083m54J1653J7376
$$ 6697 -2880 -1448 1427 1367 -1885 -17679 -13004 -8488 -6089 612 -19511 -15428 -15882 -4229 13147
14215A3147P531k3964N77P025k7183k360M4425J0656k8990j8732l50j4656j637
$$ 13147 20678 -3286 -2709 4316 -22867 -25227 19198 29854 864 -17868 -18218 -32874 -34511
14202c4511R395j2117q410M837j0337K8714J6154K214k5608K0139q655L525O340
$$ -34511 -25116 -37233 -45643 -40806 -51143 -22429 -6275 -4061 -29669 -9530 -18185 -14660 -8320
14189h320l899J763k6392j3082K3043n599J4737J7671R886K6306j1732j2500j8603
$$ -8320 -12219 -10456 -36848 -49930 -26887 -32486 -17749 -78 9808 36114 24382 11882 -6721
14176f721P185K2927q013n415K078L639k511j5107j2603k712k327n283J0255Q158
$$ -6721 464 23391 15378 9963 12041 15680 13169 -1938 -14541 -17253 -19580 -24863 -14608 -6450
14162f450j1418J1389J8588p261K585j3117p753l699J5218K0456q731m170j0075
$$ -6450 -17868 -6479 12109 4848 7433 -5684 -13437 -17136 -1918 18538 9807 5637 -4438
14149d438J6469q440j1238J7905J9279k5599j5000j5580l054R019K481K6133Q695
$$ -4438 12031 3591 -7647 10258 29537 3938 -11062 -26642 -29696 -20677 -18196 7937 16632
14136A6632n903j0816r409J4917J4125J821j3202k5355j1459j5074p110J0376
$$ 16632 10729 -87 -9496 5421 19546 21367 8165 -17190 -28649 -43723 -50833 -40457
14124d0457R842J1873m930K1779K2379J1740j7588j3631k1223Q57L789J3591K0328
$$ -40457 -30615 -18742 -23672 -1893 20486 32226 14638 1007 -20216 -19359 -15570 -1979 18349
14111A8349j6718k7292q160K4039O097J591J1456k922k237j0119Q374l0045l898
$$ 18349 1631 -25661 -33821 -9782 -3685 -2094 9362 6440 4203 -5916 2458 -27587 -31485
14098c1485K0393n794K3133K2455o700J9742k284q608k459j5570k8656k557m234
$$ -31485 -11092 -16886 6247 28702 22002 41744 39460 30852 28393 12823 -15833 -18390 -22624
14085b2624Q005J0656j3613J6384J1802Q505n629K1225n549j1170n350k653P19
$$ -22624 -14619 -3963 -17576 -1192 10610 19115 13486 34711 29162 17992 12642 9989 10708
14072A0708J2937j234L114m531r59j3985L705r285r910L134L4735j2060j8419
$$ 10708 23645 22411 25525 20994 20035 6050 9755 470 -9440 -6306 28429 16369 -2050
14059b050M949p431j3494j7305O863J2668J920O035O398j6224l7271P100K3207
$$ -2050 2899 -4532 -18026 -35331 -28468 -15800 -13880 -7845 -1447 -17671 -54942 -47842 -24635
14046b4635R619Q659N507r226R742O123J9176M260j8834j1234P504K150k8890
$$ -24635 -15016 -6357 -850 -10076 -334 5789 24965 29225 10391 -843 6661 8811 -20079
14033b0079j9501J7054N810P2J9372J5370o669r979k5931p021J4611N508J3476
$$ -20079 -39580 -22526 -16716 -16644 2728 18098 11429 1450 -24481 -31502 -16891 -11383 2093
14020B093J0457j7158p379q932P303N173o600J3675J8284Q299j3677o295j2154
$$ 2093 12550 -4608 -11987 -20919 -13616 -8443 -15043 -1368 16916 25215 11538 5243 -6911
14007f911k4332n559P005K677q589J5701R124k8219Q793M997j919k555O701j730
$$ -6911 -31243 -36802 -29797 -27120 -35709 -20008 -10884 -39103 -30310 -25313 -27232 -29787 -23086 -24816
13993b4816J971K854J423J0836J68J1683o965k0535j7139j630L5897K1460k9887
$$ -24816 -22845 -19991 -18568 -7732 -7564 4119 -2846 -23381 -40520 -42150 -6253 15207 -14680
13980a4680k4659L0541J3254K335m155o33k374O316j0156M704J8795R29j5802
$$ -14680 -39339 -8798 4456 6791 2636 2003 -371 5945 -4211 493 19288 20217 4415
13967D415j2292p950L137J0153K5429J9046q441k8280k0650J3973j4628q484O103
$$ 4415 -7877 -15827 -12690 -2537 22892 41938 33497 5217 -15433 -1460 -16088 -24572 -18469
13954a8469J1510k3177Q597K5948N1l890p223k0297P091N045M637r65l2917o696
$$ -18469 -6959 -30136 -21539 4409 4460 570 -6653 -26950 -19859 -14814 -10177 -11142 -44059 -50755
13940e0755M4405L9083K469j6233j712j4793j9664L964J1428K0805L650j3406
$$ -50755 -6350 32733 35202 18969 17257 2464 -17200 -13236 -1808 18997 22647 9241
13928I241k1672j5296n225M59j529M68o005o052J8717j7386j3737J4868J4277
$$ 9241 -12431 -27727 -32952 -32493 -34022 -33554 -39559 -45611 -26894 -44280 -58017 -43149 -28872
13915b8872k897J30l349O281K360k8754L78o645J1213L8046K4816j6936k8633
$$ -28872 -31769 -31639 -34988 -28707 -26347 -55101 -54723 -61368 -50155 -12109 12707 -4229 -32862
13902c2862j2631O33J4021M866m40L2331K0727m003m089m784L342Q392J5573j0633
$$ -32862 -45493 -44860 -30839 -25973 -26413 5918 26645 22642 18553 13769 17111 25503 41076 30443
13888C0443l2779j162K1639J4803j4688l0122m3707p12K1147J4312J6601J3802
$$ 30443 -2336 -3498 18141 32944 18256 -11866 -55573 -56285 -35138 -20826 -4225 9577
13876I577M777K3207o912j1179j9419k471L0546j2781m694Q390k997J6808J5367
$$ 9577 14354 37561 30649 19470 51 -2420 28126 15345 10651 19041 16044 32852 48219
13863D8219l717j2110k9140n879J7960j1000j1357O521M911R389j777j1804q98
$$ 48219 44502 32392 3252 -2627 15333 4333 -7024 -503 4408 13797 12020 216 -682
13850f82Q763J8550j5891K662J7356k8326k4936N211L1550J9103j6155M55J5375
$$ -682 8081 26631 10740 13402 30758 2432 -22504 -17293 14257 33360 17205 17660 33035
13837C3035k6415p722K1031q447k2290j3236k536J5341N682q651j920n420P09
$$ 33035 6620 -1102 19929 11482 -10808 -24044 -26580 -11239 -5557 -14208 -16128 -21548 -20839
13824b0839L7181J9385j6308l2056j6805K4138J4841j3246m995K108k0576p042
$$ -20839 16342 35727 19419 -12637 -29442 -5304 9537 -3709 -8704 -6596 -27172 -34214
13812c4214K8491Q330n455k0164L149K5563L5313N890l4879k7843p587J0197K500
$$ -34214 -5723 2607 -2848 -23012 -19863 5700 41013 46903 12024 -15819 -23406 -13209 -10709
13799a0709N332K873j5147q86P768J4801J7323j2083k5287l542J231J3313q80
$$ -10709 -5377 -2504 -17651 -18537 -10769 4032 21355 9272 -16015 -19557 -18326 -5013 -5893
13786e893J0934j3901L961M920J2924q195j6734l3450P457L3799L173q84K586
$$ -5893 5041 -8860 -4899 21 12945 4750 -11984 -45434 -37977 -4178 -1005 -1889 697
13773F97O156M694P091O310k5294k6049k2894N424K4848j3863J3491o984j830
$$ 697 6853 11547 18638 24948 -346 -26395 -49289 -43865 -19017 -32880 -19389 -26373 -28203
13760b8203j0900j2521R443J4610J5898N866J0329J1697q609K1273M8691l587
$$ -28203 -39103 -51624 -42181 -27571 -11673 -5807 4522 16219 7610 28883 77574 73987
13748G3987k6644l0574j7265J6764Q775j646N97p514Q520r465J55l612O533R91
$$ 73987 47343 16769 -496 16268 25043 23397 23994 16480 25000 15535 15690 12078 18611 19602
13734A9602o670J6093L7823j6807m8729j510L650R162K402Q50r295j3731J693
$$ 19602 12932 29025 66848 50041 1312 -198 3452 12614 15016 15866 6571 -7160 -5467
13721e467O113j1534J0649J1415J9555n495j1592m255M674N476o165j5809j0090
$$ -5467 646 -10888 -239 11176 30731 25236 13644 9389 14063 19539 13374 -2435 -12525
13708a2525j0986n0K9929J1516p809J0475j9664n984r184K899L951j2443j7032
$$ -12525 -23511 -23561 6368 17884 10075 20550 886 -5098 -14282 -11383 -7432 -19875 -36907
13695c6907l3056J2223R706J581Q031k458N082J7239J526j3163J2852j4262P689
$$ -36907 -69963 -57740 -48034 -46453 -38422 -40880 -35798 -18559 -17033 -30196 -17344 -31606 -23917
13682b3917K8890Q883N625j0011k1030J031L717n091k0430L29J8412J0035M556
$$ -23917 4973 13856 19481 9470 -11560 -10529 -6812 -11903 -32333 -32004 -13592 -3557 999
13669I99Q926J0646j695Q174q966j0317p950J6687K0027k117k9525K699O365k6765
$$ 999 9925 20571 18876 27050 18084 7767 -183 16504 36531 34414 4889 7588 13953 -12812
13655a2812k0311N872M5230O12j9472J9250K0640J364j1989l0986n250J7543M2036
$$ -12812 -33123 -27251 17979 18591 -881 18369 39009 40373 28384 -2602 -7852 9691 51727
13642E1727Q935l0656l2271j6471M796j3077O138K173K064n686M52o568j9906
$$ 51727 60662 30006 -2265 -18736 -13940 -27017 -20879 -18706 -16642 -22328 -21876 -28444 -48350
13629d8350o177K5913J7876J6089J8456L528j4088l510J44j9978j5695J4183p694
$$ -48350 -54527 -28614 -10738 5351 23807 27335 13247 9737 9881 -10097 -25792 -11609 -19303
13616a9303m015M305j0471o521k123j2723K2465K5502l2921k2512J9293J6352
$$ -19303 -23318 -19013 -29484 -36005 -38128 -50851 -28386 -2884 -35805 -58317 -39024 -22672
13604b2672o103k502J8449K2365O379j4582l2304L483L0491j3615k1479L604J9327
$$ -22672 -28775 -31277 -12828 9537 15916 1334 -30970 -27487 3004 -10611 -32090 -28486 -9159
13591i159O434L328l912K656k5628M239M041K6406K6459j3954k3695j1336J2726
$$ -9159 -2725 603 -3309 -653 -26281 -22042 -18001 8405 34864 20910 -2785 -14121 -1395
13578a395J9461k5928j0114J2924J9353K2131J1745l2218j440M724l889L858j6247
$$ -1395 18066 -7862 -17976 -5052 14301 36432 48177 15959 14519 19243 15354 19212 2965
13565B965p616K236J0188j0378k2968N521M397m221R847J5125j2278r098k4040
$$ 2965 -4651 -2415 7773 -2605 -25573 -20052 -15655 -19876 -10029 5096 -7182 -16280 -40320
13552d0320m170n304J2778Q258j2498O76J3916J9400k6585K6157J6999j4403M739
$$ -40320 -44490 -49794 -37016 -28758 -41256 -40580 -26664 -7264 -33849 -7692 9307 -5096 -357
13539c57p240j2706k082J6284M197k2702k9063P888L2798R754J338K3565o324
$$ -357 -7597 -20303 -22385 -6101 -1904 -24606 -53669 -45781 -12983 -3229 -1891 21674 15350
13526A5350k2378J538M1383M649k1316p794J5466O943l3772k0115N621J384m498
$$ 15350 -7028 -5490 35893 40542 19226 11432 26898 33841 69 -20046 -14425 -13041 -17539
13513a7539r720M308l312N673J4176J2938L212q732J4548p097k9022N296K4585
$$ -17539 -27259 -22951 -26263 -20590 -6414 6524 9736 1004 15552 8455 -20567 -15271 9314
13500I314k0386P075K7631N2K4629J5527n028l4711k0702k6351Q629K1114k314
$$ 9314 -11072 -3997 23634 23686 48315 63842 58814 24103 3401 -22950 -14321 6793 4479
13487D479J0383J5300p881k3823j0020j5256m301l583n691J3446K4869R966J2543
$$ 4479 14862 30162 22281 -1542 -11562 -26818 -31119 -34702 -40393 -26947 -2078 7888 20431
13474B0431J997q378k9270P348J3022J749p163L060K0280j1162l542J7351p624
$$ 20431 22428 14050 -15220 -7872 5150 6899 -264 2796 23076 11914 8372 25723 18099
13461A8099j852K0153r857o384N459k3662n650K0473K6605m22j3440p111j389
$$ 18099 16247 36400 26543 20159 25618 1956 -3694 16779 43384 42962 29522 22411 21022
13448B1022j8639j7683J2564K1013L193O980K2602L328j2670j8424j7619K2760
$$ 21022 2383 -15300 -2736 18277 21470 28450 51052 54380 41710 23286 5667 28427
13436B8427P893l2110J0268J9o665J4465j8662n685O133l653J3736K0832J2764
$$ 28427 36320 4210 14478 14497 7832 22297 3635 -2050 4083 430 14166 34998 47762
13423D7762k3613j9899j704j3259k718J1457j6998k0323J0168J6905J9665P329
$$ 47762 24149 4250 2546 -10713 -13431 -1974 -18972 -39295 -29127 -12222 7443 14772
13411A4772j7794k3884k1065j940J5288k3821r547O347J3612q841j0191J704N735
$$ 14772 -3022 -26906 -47971 -49911 -34623 -58444 -67991 -61644 -48032 -56873 -67064 -65360 -59625
13398e9625J7574P082J3461J5684k972l3676n004M266J2287o797r504J8785j1929
$$ -59625 -42051 -34969 -21508 -5824 -8796 -42472 -47476 -43210 -30923 -37720 -47224 -28439 -40368
13385d0368k3916j1568K5683K1866J3933q025n071J4412p252J6401L2696q810
$$ -40368 -64284 -75852 -50169 -28303 -14370 -22395 -27466 -13054 -20306 -3905 28791 19981
13373A9981k4619k0354J6457M5663O903j9843p450j473L946M625k5869p02N958
$$ 19981 -4638 -24992 -8535 37128 44031 24188 16738 15265 19211 23836 -2033 -2735 3223
13360C223J0814K723j9188j0047J4061N102p712k2270O041K8013J4197j6123M465
$$ 3223 14037 16760 -2428 -12475 1586 6688 -1024 -23294 -17253 10760 24957 8834 13299
13347A3299P196O15q115l733k1002o401J7911J9968j1252R368j1729J653o380
$$ 13299 20495 21110 12995 9262 -11740 -18141 -230 19738 8486 17854 6125 7778 1398
13334A398q37O530l855J303q487j0466K447K780R809l405O844J0827N183j2746
$$ 1398 561 7091 3236 4539 -3948 -14414 -11967 -9187 622 -2783 4061 14888 20071 7325
13320G325o662J937J0006K5581n556j6050j2733J6012M197j5559j8977l092J4232
$$ 7325 663 2600 12606 38187 32631 16581 3848 19860 24057 8498 -10479 -13571 661
13307F61j364M025K514j4315M506j0221j1098o008R901J6022J3422j6490k484
$$ 661 -703 3322 5836 -8479 -3973 -14194 -25292 -31300 -21399 -5377 8045 -8445 -10929
13294a0929P397J6353J7318J2755j2139j0250k282k5940J1476J9627P912j5792
$$ -10929 -3532 12821 30139 42894 30755 20505 18223 -7717 3759 23386 31298 15506
13282A5506r744J1269q451L3376n817l401j6569J2062Q062j7933l1156Q104Q683
$$ 15506 5762 17031 8580 41956 36139 32738 16169 28231 36293 18360 -12796 -4692 3991
13269C991l5358J8420L1840O189r455k5884l4800j881L526J1343K4378N329k292
$$ 3991 -31367 -12947 18893 25082 15627 -10257 -45057 -46938 -43412 -32069 -7691 -2362 -4654
13256d654J694m344p296n961k3907J8781J5950M360j8226j0979J055m691l953
$$ -4654 -2960 -7304 -14600 -20561 -44468 -25687 -9737 -5377 -23603 -34582 -33527 -38218 -42171
13243d2171M661J4723K9375O847j7718r06K5659J0822k0933r666M137k2968l5950
$$ -42171 -37510 -22787 6588 13435 -4283 -5189 20470 31292 10359 693 4830 -18138 -54088
13230e4088J8479r46l013M7540J2171Q9j5012j7972J1323l0294k5566K0083J0006
$$ -54088 -35609 -36555 -39568 7972 20143 20232 5220 -12752 -1429 -31723 -57289 -37206 -27200
13217b7200j0504K0120K7847K1r920R785p854l14l155j9594J073J4163L30k1936
$$ -27200 -37704 -17584 10263 10284 364 10149 2295 1981 -1174 -20768 -19695 -5532 -5202 -27138
13203b7138K2953J5020j491q402O565j763K2416K2186K2022k2150K478m164m0836
$$ -27138 -4185 10835 9344 942 7507 5744 28160 50346 72368 50218 52696 48532 7696
13190G696l4934J9138K2325O520J2255J4515m016K40k8875m574O933j4607Q086
$$ 7696 -27238 -8100 14225 20745 33000 47515 43499 43739 14864 10290 17223 2616 10702
13177A0702J479n50l266k2841j5716J2026R41k514Q674J8045K2419j4096r969
$$ 10702 12181 11631 8365 -14476 -30192 -18166 -17225 -19739 -11065 6980 29399 15303 5334
13164E334j8176r479j4178L405j2256l618J8114J070k561Q982l873L769M815K712
$$ 5334 -12842 -22321 -36499 -33094 -45350 -48968 -30854 -29784 -32345 -23363 -27236 -23467 -18652 -15940
13150a5940l505L339J8463O47o905m4583j5929R540k305J282M3186L0767q991
$$ -15940 -19445 -16106 2357 3004 -3901 -48484 -64413 -54873 -57178 -55896 -12710 18057 9066
13137I066j3527L3679Q406j2950L48K488K0342q902r509k3272n357R997j8830
$$ 9066 -4461 29218 37624 24674 25022 27510 47852 38950 29441 6169 812 10809 -8021
13124h021O334K2150L856j919n237j2112p653O615j4802Q352n946J1202K1752
$$ -8021 -1687 20463 24319 22400 17163 5051 -2602 4013 -10789 -2437 -8383 2819 24571
13111B4571N227j0616J602m807j2895o557M282M460K2726k7302k0958K3080R940
$$ 24571 29798 19182 20784 15977 3082 -3475 807 5267 27993 691 -20267 2813 12753
13098A2753j2792P146J0464M747J0697j482j2285k723J8682J2917k1825k6996
$$ 12753 -39 7107 17571 22318 33015 31533 19248 16525 35207 48124 26299 -697
13086f97j4531J6995O812j1004j501k0890R082J6023N295J4913J3599J985j895
$$ -697 -15228 1767 8579 -2425 -3926 -24816 -15734 289 5584 20497 34096 36081 34186
13073C4186j3886K02J195o492n632R474J6226j5921j9266j494P610R702J5746
$$ 34186 20300 20502 21697 15205 9573 19047 35273 19352 86 -1408 6202 15904 31650
13060C1650R605n661j3269L083K4537R292P854k8472o311k3333j5003K5821O446
$$ 31650 41255 35594 22325 25408 49945 59237 67091 38619 32308 8975 -6028 19793 26239
13047B6239q954k8361k3476J8134J3041J862K0500j1485m012j9491l850j050K5655
$$ 26239 17285 -11076 -34552 -16418 -3377 -1515 18985 7500 3488 -16003 -19853 -20903 4752
13034D752K6123j5826k1881l952q154j1074J8928L2464m270l6728J5760j4523
$$ 4752 30875 15049 -6832 -10784 -18938 -30012 -11084 21380 17110 -19618 -3858 -18381
13022a8381J5970K747j607j4728m066O11l434M040l432J742L7969J1404p802l0859
$$ -18381 -2411 336 -1271 -15999 -20065 -19454 -22888 -18848 -22280 -20538 17431 28835 21033 -9826
13008i826j5067J712n510J2558J6769o625k6193q550l358n728j2061L1954L09
$$ -9826 -24893 -23181 -28691 -16133 636 -5989 -32182 -40732 -44090 -49818 -61879 -29925 -29616
12995b9616N31J1925L2482j8174p337K7096r842k0408J5066K4685r765p228k4761
$$ -29616 -29085 -17160 15322 -2852 -10189 16907 7065 -13343 1723 26408 16643 9415 -15346
12982a5346k1673P46Q130K1443j739R163j0450l6514j875K3671P073o526j806
$$ -15346 -37019 -36273 -28143 -6700 -8439 724 -9726 -46240 -48115 -24444 -17371 -23897 -25703
12969b5703J0523j2095P470J140l67q466J0913J5913O193J6429l82k2422o596
$$ -25703 -15180 -27275 -19805 -18665 -19032 -27498 -16585 -672 5521 21950 21568 -854 -7450
12956g450J6070l1264K653L985l845K4293O964K236j5600k7476R468P153M76j3728
$$ -7450 8620 -22644 -19991 -16006 -19851 4442 11406 13642 -1958 -29434 -19966 -12813 -12337 -26065
12942b6065o704K320J4265N896k254k3914J001J4609P565p205q286J1025R267
$$ -26065 -32769 -30449 -16184 -10288 -12542 -36456 -35455 -20846 -13281 -20486 -28772 -17747 -8480
12929h480j1087j1697L1365q002j6587j1364L2748K0327K1588r874Q968P38k3763
$$ -8480 -19567 -31264 101 -7901 -24488 -35852 -3104 17223 38811 28937 37905 38643 14880
12916A4880j3537j2089j5363k995R94m246n738J0635K1772P189r296j0911k9686
$$ 14880 1343 -10746 -26109 -29104 -28110 -32356 -38094 -27459 -5687 1502 -7794 -18705 -48391
12903d8391J0143J3450j7967J373J270Q428L6411J3677j5143Q488J7070K0614
$$ -48391 -38248 -24798 -42765 -41392 -40122 -31694 4717 18394 3251 11739 28809 49423
12891D9423j0900n651j6911r946j6888j0023M949j1535j32J8118m827m136O063
$$ 49423 38523 32872 15961 6015 -10873 -20896 -15947 -27482 -27614 -9496 -14323 -18459 -12396
12878a2396k5804j7902K3406K2251Q055J4292J0495n394j8709j1993j9139j832
$$ -12396 -38200 -56102 -32696 -10445 -2390 11902 22397 17003 -1706 -13699 -32838 -34670
12866c4670K179Q601K4849k5526k5643k0418j3500J7373L1794Q15M538R333L0540
$$ -34670 -32491 -23890 959 -24567 -50210 -70628 -84128 -66755 -34961 -34146 -29608 -20275 10265
12853A0265j658J852k684K798o134j089j2953m894p983J7689J1269q998k4318
$$ 10265 8607 10459 7775 10573 4439 3350 -9603 -14497 -22480 -4791 6478 -2520 -26838
12840b6838k5423L9350K2305j5293L483J6172J3504K4030j3429p289L06k4081
$$ -26838 -52261 -12911 9394 -5899 -2416 13756 27260 51290 37861 30572 30878 6797
12828F797l4615j4259n54J3388K3486j7055m0010J335P954L24j7317Q86J6269
$$ 6797 -27818 -42077 -42631 -29243 -5757 -22812 -62822 -61487 -53533 -53209 -70526 -69640 -53371
12815e3371K634K2644m951J5276l522J2922J0350j1183J5447J4005j3835j1909
$$ -53371 -50737 -28093 -33044 -17768 -21290 -8368 1982 -9201 6246 20251 6416 -5493
12803e493J6832M912k2143j8980k275O187K4113R405l051k560n276q176Q075J2423
$$ -5493 11339 16251 -5892 -24872 -27147 -20960 3153 12558 9507 6947 1671 -6505 1570 13993
12789A3993J2125K872j1336L122j9030j8755J1756q253q813l6297j2257K6401
$$ 13993 26118 28990 17654 20776 1746 -17009 -5253 -13506 -22319 -58616 -70873 -44472
12777d4472L241l1820k891L4488L8009j2300k4405j8544J004Q911O170L3095K1371
$$ -44472 -41231 -73051 -75942 -41454 -3445 -15745 -40150 -58694 -57690 -48779 -42609 -9514 11857
12764A1857M606k0555l119k898L664J1102q981L814N730L395J1405l588r880K3184
$$ 11857 16463 -4092 -7211 -10109 -6445 4657 -4324 -510 5220 8615 20020 16432 6552 29736
12750B9736p960k1855M143J016P259K839j0056n123R266J39j1890j6295O882J4978
$$ 29736 21776 -79 4064 5080 12339 15178 5122 -1 9265 9404 -2486 -18781 -11899 3079
12736C079J9440r588R495p304J2495J4821K262j3738j3302j4385R706j4108j3381
$$ 3079 22519 12931 22426 15122 27617 42438 44700 30962 17660 3275 12981 -1127 -14508
12723a4508j7958M969k3963j5780J4128M2460J4787N038k528q167K5962K2568
$$ -14508 -32466 -27497 -51460 -67240 -53112 -10652 4135 9173 6645 -1522 24440 47008
12711D7008r568l177k353O295n465j9618j6449J3751j8092k8040K097R451o118
$$ 47008 37440 34263 31910 38205 32740 13122 -3327 10424 -7668 -35708 -33611 -24160 -30278
12698c0278K112O302K3141L2391n828J477k7499j4811j7696k8879n584J0213K2337
$$ -30278 -28166 -21864 1277 33668 27840 29317 1818 -12993 -30689 -59568 -65152 -54939 -32602
12685c2602J6835n964j9574q140K5256J410l5139J7949j896K9572J0871K59q859
$$ -32602 -15767 -21731 -41305 -49445 -24189 -22779 -57918 -39969 -41865 -12293 -1422 -1163 -10022
12672a0022k1419K0524J0266j2216n916K9373K2830m4745k4928J2862J3760J274
$$ -10022 -31441 -10917 -651 -12867 -18783 10590 33420 -11325 -36253 -23391 -9631 -8357
12660h357k5134o697K7991M699O981J3387O661p842r625J1058M782j0289J2942
$$ -8357 -33491 -40188 -12197 -7498 -517 12870 19531 11689 2064 13122 17904 7615 20557
12647B0557L252J0257r211k3430k1365j4021K2238P591K0640M573m713j4806M069
$$ 20557 23809 34066 24855 1425 -19940 -33961 -11723 -4132 16508 21081 16368 1562 5631
12634E631L327q586O350R454L819q488o918Q198K6650N421k7469p622q149r60
$$ 5631 8958 372 6722 16176 19995 11507 4589 12787 39437 44858 17389 9767 1618 658
12620F58q102p119K0987J6139q618L667l0745J1359M831J0441J0754p785l923
$$ 658 -7444 -14563 6424 22563 13945 17612 -13133 -1774 3057 13498 24252 16467 12544
12607A2544K2092r20k3873k0203N748J390j800k4200O313J3692J7662r703j3277
$$ 12544 34636 33716 9843 -10360 -4612 -3222 -5022 -29222 -22909 -9217 8445 -1258 -14535
12594a4535p789j2596J075M4278k333j1600K7519J071L936j2572J7141j7066j3563
$$ -14535 -22324 -34920 -33845 10433 8100 -3500 24019 25090 29026 16454 33595 16529 2966
12581B966j6027l1543j4932j4278j210J3798J7549J5668J5561r234o486J3451
$$ 2966 -13061 -44604 -59536 -73814 -75024 -61226 -43677 -28009 -12448 -21682 -28168 -14717
12569a4717J9400p64j2436r956j0684K4766J0127j1228j789J6977J4419J6238
$$ -14717 4683 3919 -8517 -18473 -29157 -4391 5736 -5492 -7281 9696 24115 40353
12557D0353K6593j3091l5445j3234q620K657J6734l5001k1618J4444l569P667
$$ 40353 66946 53855 18410 5176 -3444 -787 15947 -19054 -40672 -26228 -29797 -22130
12545b2130J7331J0183J438o206j1053O801j6057j5626J1879J9286K3572n011
$$ -22130 -4799 5384 6822 616 -10437 -3636 -19693 -35319 -23440 -4154 19418 14407
12533A4407K550j2068m728j5065J0648k551M36L0419P550j3861j3632N153K982
$$ 14407 16957 4889 161 -14904 -4256 -6807 -6371 24048 31598 17737 4105 9258 12240
12520A2240m682p783Q874k3483k621J1762J3804J15q859p18r421j1864J1780J0710
$$ 12240 7558 -225 8649 -14834 -17455 -5693 8111 8226 -633 -1351 -10772 -22636 -10856 -146
12506a46k1594j7721K1663K6917j06O420M87j4294l0373J7608J3675l2110n584
$$ -146 -21740 -39461 -17798 9119 9013 15433 15920 1626 -28747 -11139 2536 -29574 -35158
12493c5158k832J0809J8136M07O953k133n779j440j034P563j1550j3859J299m770
$$ -35158 -37990 -27181 -9045 -8638 -1685 -3818 -9597 -11037 -12071 -4508 -16058 -29917 -28618 -33388
12479c3388o439j5502K3557L9534J8051j0732l4552O086P155q986j1214j2527
$$ -33388 -39827 -55329 -31772 7762 25813 15081 -19471 -13385 -6230 -15216 -26430 -38957
12467c8957J5425J6524Q9K601j4114r924O444o022o030n61J0555M945M1959O489
$$ -38957 -23532 -7008 -6919 -4318 -18432 -28356 -21912 -27934 -33964 -34525 -23970 -19025 22934 29423
12453B9423k2528J0328O527j3688r623j0058k634j194J627k2353l256R609r762
$$ 29423 6895 17223 23750 10062 439 -9619 -12253 -13447 -11820 -34173 -37429 -27820 -37582
12440c7582j8500j8337K8726K9002p315j1026j7309J7286M2330J3131Q827j4457
$$ -37582 -56082 -74419 -45693 -16691 -24006 -35032 -52341 -35055 7275 20406 29233 14776
12428A4776O699k3783r327o149K620Q125J5737J1731o247J2722L595N675j4254
$$ 14776 21475 -2308 -11635 -17784 -15164 -7039 8698 20429 14182 26904 30499 36174 21920
12415B1920j9663q703J581m817K635K2512k149k0602j8757j0615J2379K3061J8060
$$ 21920 2257 -6446 -4865 -9682 -7047 15465 13316 -7286 -26043 -36658 -24279 -1218 16842
12402A6842K1874L125n643j6901o96j8453j3116J1864j7072M66J8797J2929j4237
$$ 16842 38716 41841 36198 19297 18601 148 -12968 -1104 -18176 -17710 1087 14016 -221
12389b21o375l346J0869m738J2864r077R004K504o145J3535K129o743J7726n098
$$ -221 -6596 -9942 927 -3811 9053 -24 8980 11484 5339 18874 21003 14260 31986 26888
12375B6888j5645J1168J6033K846j0717J625j84j6322l9768j1879J7034K88N469
$$ 26888 11243 22411 38444 41290 30573 32198 32014 15692 -24076 -35955 -18921 -18633 -13164
12362a3164K9084K6954Q938r496m6587J3498j5125o876K1075k89j4563Q0J3176
$$ -13164 15920 42874 51812 42316 -4271 9227 -5898 -12774 8301 8012 -6551 -6471 6705
12349F705k0842k2126J4066p673m256j0302k240J0944J462q115q026l273M1034
$$ 6705 -14137 -36263 -22197 -29870 -34126 -44428 -46668 -35724 -34262 -42377 -50403 -53676 -12642
12336a2642j530o755J6717O370o083j5250j7781K6938p90J8555K77o561j6950
$$ -12642 -14172 -20927 -4210 2160 -3923 -19173 -36954 -10016 -10806 7749 8026 1465 -15485
12323a5485J4965K3249J0597k7753k3135k7728k068l313J4975J065J5254J5415
$$ -15485 -520 22729 33326 5573 -17562 -45290 -47358 -50671 -35696 -34631 -19377 -3962
12311c962O457M460j5837k0706L695K1034O056J6562j1152m598K4800K0894P849
$$ -3962 2495 6955 -8882 -29588 -25893 -4859 1197 17759 6607 2009 26809 47703 55552
12298E5552j934j3869k1134k0905o951L035J579o779p458J8502J5531l6782m6167
$$ 55552 53618 39749 18615 -2290 -9241 -6206 -4627 -11406 -18864 -362 15169 -21613 -67780
12285f7780j2073K5075L5326L1464j1378r275K211m932k1606n951J2802K5450
$$ -67780 -79853 -54778 -19452 12012 634 -8641 -6430 -11362 -32968 -38919 -26117 -667
12273f67j4412j2341K0799J1164K3104k526k0561N130q602l314j5368L773L033
$$ -667 -15079 -27420 -6621 4543 27647 25121 4560 9690 1088 -2226 -17594 -13821 -10788
12260a0788p751J272l169r31Q012j8981L900r77P232j2068j8928o563M9696O299
$$ -10788 -18539 -17267 -20436 -21367 -13355 -32336 -28436 -29413 -22181 -34249 -53177 -59740 -10044 -3745
12246c745k5716P685L1279K179n006k506n120j3953M473n661J5782K1443L72j3220
$$ -3745 -29461 -21776 9503 11682 6676 4170 -950 -14903 -10430 -16091 -309 21134 21506 8286
12232H286k4542r713J4603j8408k0553j680P916K2095K5010J538J2116O226l149
$$ 8286 -16256 -25969 -11366 -29774 -50327 -52007 -44091 -21996 3014 4552 16668 22894 19745
12219A9745j3560j7009j8374P135j5665o741K5698J7653p637k2205j8187l3064
$$ 19745 6185 -10824 -29198 -22063 -37728 -44469 -18771 -1118 -8755 -30960 -49147 -82211
12207h2211M97L8972K9626J386j4450q789r608j8415l181J4949J8910j8053j3057
$$ -82211 -81714 -42742 -13116 -11730 -26180 -34969 -44577 -62992 -66173 -51224 -32314 -50367 -63424
12194f3424N411J4593L851M552k493Q757K3215o360r322J3437J5238J1476k3720
$$ -63424 -58013 -43420 -39569 -35017 -37510 -28753 -5538 -11898 -21220 -7783 7455 18931 -4789
12181d789L34K1164J1239L620K618n219K292J4279k516r535J403j3578m88k0928
$$ -4789 -4455 16709 27948 31568 34186 28967 31259 45538 43022 33487 34890 21312 20824 -104
12167a04M192J1692k751j1820j401p830K916n754k3188n493K5815K4943m328J1165
$$ -104 4088 15780 13029 1209 -192 -8022 -5106 -10860 -34048 -39541 -13726 11217 6889 18054
12153A8054k5911k1376J2402J0751J7640j4417J384k911k8840l745K3497J6743
$$ 18054 -7857 -29233 -16831 -6080 11560 -2857 -1473 -4384 -33224 -36969 -13472 3271
12141C271N476J3045J1625l344K129J7105N146j8773k9945k2058k0205K7654J4779
$$ 3271 8747 21792 33417 30073 32202 49307 54453 35680 5735 -16323 -36528 -8874 5905
12128E905J2045L1996k3449m2303j4368M241L888k1416k3651J7352J2130L5230
$$ 5905 17950 49946 26497 -15806 -30174 -25933 -22045 -43461 -67112 -49760 -37630 -2400
12116b400K1300N369p994k2353J5230J5133J2573j6964j4404L5356Q793r965j1306
$$ -2400 18900 24269 16275 -6078 9152 24285 36858 19894 5490 40846 49639 39674 28368
12103B8368k3584j4050p817j0025j0813j3382J558J1700K4740K3592n414Q402
$$ 28368 4784 -9266 -17083 -27108 -37921 -51303 -49745 -38045 -13305 10287 4873 13275
12091A3275J0451l7035k9605o859L909L1939K4096o94j4982n517L340K5360r145
$$ 13275 23726 -13309 -42914 -49773 -45864 -13925 10171 9477 -5505 -11022 -7682 17678 8533
12078H533J96J7147J0689o033J4336j3334r305J4362j3630L250O598l495n534
$$ 8533 8729 25876 36565 30532 44868 31534 22229 36591 22961 26211 32809 29314 23780
12065B3780J2535j2966k5759n700n157j4473j8866J0659K3824J2512J8919M805
$$ 23780 36315 23349 -2410 -8110 -13267 -27740 -46606 -35947 -12123 389 19308 24113
12053B4113l3613j5483Q98J8196l317k041N514n750l244j1508J4316K1556p819
$$ 24113 -9500 -24983 -24085 -5889 -9206 -11247 -5733 -11483 -14727 -26235 -11919 9637 1818
12040A818J452k1257k3394k999L7338K2310K1679j0618k4819j0953n942j8687
$$ 1818 3270 -17987 -41381 -44380 -7042 15268 36947 26329 1510 -9443 -15385 -34072
12028c4072p17Q25p337J6255J7371K2986J5637J9827m514q792l2291n689p524
$$ -34072 -34789 -33964 -41301 -25046 -7675 15311 30948 50775 46261 37469 5178 -511 -8035
12015h035p932j3860o817j1384l037m463J5918K024J684J7791K193M923J2613
$$ -8035 -15967 -29827 -36644 -48028 -51065 -55528 -39610 -37586 -35902 -18111 -15918 -10995 1618
12002A618J2225j468R274J2221K1798k892q661j1547j1587k8309k1370n145J2737
$$ 1618 13843 12375 21649 33870 55668 52776 44115 32568 20981 -7328 -28698 -33843 -21106
11989b1106Q241j7232o120J8043J5854k1688n609K58J1791M581J8706R69l330
$$ -21106 -12865 -30097 -36217 -18174 -2320 -24008 -29617 -29359 -17568 -12987 5719 6688 3358
11976C358J3024n837j285J5471o556j9405R593o62J5473L497k3120k8699l1518
$$ 3358 16382 10545 9260 24731 18175 -1230 8363 7701 23174 26671 3551 -25148 -56666
11963e6666J9345M9745K6628K911o163n664j9622m547P750k0408k5563L3705L4581
$$ -56666 -37321 12424 39052 41963 35800 30136 10514 5967 13717 -6691 -32254 1451 36032
11950C6032p771j9073j3615p877j748K6429K4748J384p87j0783n932n613j1970
$$ 36032 28261 9188 -4427 -12304 -14052 12377 37125 38509 37722 26939 21007 15394 3424
11937C424k4593R093J6148q907j0380M837j3863r067j3380J9374K0009l1520k1682
$$ 3424 -21169 -12076 4072 -4835 -15215 -10378 -24241 -33308 -46688 -27314 -7305 -38825 -60507
11924f0507j0704L7121K2513j5368j6610Q007j2145j8916J313N400J1330J9084
$$ -60507 -71211 -34090 -11577 -26945 -43555 -35548 -47693 -66609 -65296 -59896 -48566 -29482
11912b9482K9312r673K4825J239k4098J429J8473R705J56j5548l3913R236K9451
$$ -29482 -170 -9843 14982 16221 -7877 -6448 12025 21730 21886 6338 -27575 -18339 11112
11899A1112N010k0740p458J2841k6961j5413l449R943Q922K6288j1979p671J1642
$$ 11112 16122 -4618 -12076 765 -26196 -41609 -45058 -35115 -26193 95 -11884 -19555 -7913
11886g913L3260L663m0079K1373L6447P965j1066m2113m735N458l177J0012r717
$$ -7913 25347 29010 -11069 10304 46751 54716 43650 1537 -3198 2260 -917 9095 -622
11873f22l2655r188M821J0085k7279j3947J8555Q621j3833N53J0838J2796m554
$$ -622 -33277 -42465 -37644 -27559 -54838 -68785 -50230 -41609 -55442 -54889 -44051 -31255 -35809
11860c5809l5250J4881J3455M265K5355j034k2805P755K1934k1385k7046M469
$$ -35809 -71059 -56178 -42723 -38458 -13103 -14137 -36942 -29187 -7253 -28638 -55684 -51215
11848e1215N495J0996L5630K2738R15j3830n39J1507R394P090J2445k1363j4105
$$ -51215 -45720 -34724 906 23644 24559 10729 10190 21697 31091 38181 50626 29263 15158
11835A5158l4287k2430l637K322K0287L407N755J1467j0759n934P230j3852P797
$$ 15158 -19129 -41559 -45196 -42874 -22587 -19180 -13425 -1958 -12717 -18651 -11421 -25273 -17476
11822a7476P133j3937Q422J8104K139j7164R963j5964J8729J3648n247J8378p460
$$ -17476 -10343 -24280 -15858 2246 4385 -12779 -2816 -18780 -51 13597 8350 26728 19268
11809A9268K025L384j6448j6681j2895J8786K2275m628l1672n390J896r687Q75
$$ 19268 21293 24677 8229 -8452 -21347 -2561 19714 15086 -16586 -21976 -20080 -29767 -28892
11796b8892j3672M068J0636K0841o980j8118k2915M5593K4837k322M012L559l831
$$ -28892 -42564 -38496 -27860 -7019 -13999 -32117 -55032 -9439 15398 13076 17088 20647 16816
11783A6816N211K0450P796m8749j3686Q290r03k9241J286L0028Q996N057m593
$$ 16816 22027 42477 50273 1524 -12162 -3872 -4775 -34016 -32730 -2702 6294 11351 6758
11770F758j4915j2353n093J8801j2773k6211j0841L8533J5942L856k1422j2940
$$ 6758 -8157 -20510 -25603 -6802 -19575 -45786 -56627 -18094 -2152 1704 -19718 -32658
11758c2658K2130J0103j1214l569K382K500L964L0828K0751r794m364j9358j0850
$$ -32658 -10528 -425 -11639 -15208 -12826 -10326 -6362 24466 45217 35423 31059 11701 851
11745H51j0784L346L050J8958J5462O269m851k4218k3528k795L448j5855L829
$$ 851 -9933 -6587 -3537 15421 30883 37152 32301 8083 -15445 -18240 -14792 -30647 -26818
11732b6818P835j251O902K2137k842j3575r498Q00J292L618j1742P650k2319n415
$$ -26818 -18983 -20234 -13332 8805 5963 -7612 -17110 -16310 -15018 -11400 -23142 -15492 -37811 -43226
11718d3226R156K876l914j4983J9512Q311n26m186J2867J8822K0894j4462l6750
$$ -43226 -34070 -31194 -35108 -50091 -30579 -22268 -22794 -26980 -14113 4709 25603 11141 -25609
11705b5609j4511J3828n883q766K6480J6853j5838j5157j8352o319J857L772L7599
$$ -25609 -40120 -26292 -32175 -40941 -14461 2392 -13446 -28603 -46955 -53274 -51417 -47645 -10046
11692a0046O252o843L952N520p528j5438l425K9257K5224m055r918P806k4749
$$ -10046 -3794 -10637 -6685 -1165 -8693 -24131 -27556 1701 26925 22870 12952 20758 -3991
11679c991k4226k3622J9500M702j6828q992N260J3683K1877J1679r076J5091L265
$$ -3991 -28217 -51839 -32339 -27637 -44465 -53457 -48197 -34514 -12637 -958 -10034 5057 8322
11666H322j7406K947o235J9675j245J4370K0181k5469k2332P848p480l2176k5155
$$ 8322 -9084 -6137 -12372 7303 6058 20428 40609 15140 -7192 656 -6824 -39000 -64155
11653f4155J1742J3351R674J9732o210k948j3165J2917l215K0143m595J3378J448
$$ -64155 -52413 -39062 -29388 -9656 -15866 -18814 -31979 -19062 -22277 -2134 -6729 6649 8097
11640H097q930N33j7600p795M947L403J898J0666N203J5356p345j6818J0963m388
$$ 8097 -833 -300 -17900 -25695 -20748 -17345 -15447 -4781 422 15778 8433 -8385 2578 -1810
11626a810k0437J2128K0820P243k4443l5294L178Q682J12n156m850M573K7098
$$ -1810 -22247 -10119 10701 17944 -6499 -41793 -38615 -29933 -29821 -34977 -39827 -35254 -8156
11613h156m348J6775j2378r437N334L509m735l126p472l738J2250J3926j2521
$$ -8156 -12504 4271 -8107 -17544 -12210 -8701 -13436 -16562 -24034 -27772 -15522 -1596 -14117
11600a4117K1323Q977K2232j9977J4985L496n0872k2248Q812J3162K078j6688
$$ -14117 7206 16183 38415 18438 33423 36919 -13953 -36201 -27389 -14227 -12149 -28837
11588b8837j2690J2684L395J3832O374R857j2397M963K4222P972k4553k4463q000
$$ -28837 -41527 -28843 -25448 -11616 -5242 4615 -7782 -2819 21403 29375 4822 -19641 -27641
11575b7641l201J4816o182J7211j388n547r623K342j9467l227j556P171J0740
$$ -27641 -30842 -16026 -22208 -4997 -6385 -11932 -21555 -19213 -38680 -41907 -43463 -36292 -25552
11562b5552j1054j0619K4518j500k3677J1530L8449J2727j3603j5839o268j1145
$$ -25552 -36606 -47225 -22707 -24207 -47884 -36354 2095 14822 1219 -14620 -20888 -32033
11550c2033j2543K475P241K604J4892K4842K4702N99r509J1090j6955q794m126
$$ -32033 -44576 -42101 -34860 -32256 -17364 7478 32180 32779 23270 34360 17405 8611 4485
11537D485J417Q592k068j8205j5259L3303P775K67J8456l0217m460L24o566m640
$$ 4485 5902 14494 12426 -5779 -21038 12265 20040 20307 38763 8546 4086 4410 -2156 -6796
11523f796j0341Q742K1498J1679j3957k5939K108j039r223R626K4607K3896M840
$$ -6796 -17137 -8395 13103 24782 10825 -15114 -13006 -14045 -23268 -13642 10965 34861 39701
11510C9701R630l3848k1997o756J0068R986K7321K0351r582m0262j6329o035K2147
$$ 39701 49331 15483 -6514 -13270 -3202 6784 34105 54456 44874 4612 -11717 -17752 4395
11497D395j0028j8971n319P677R03j9126k3734P001M1495J7871j1655J0130K0867
$$ 4395 -5633 -24604 -29923 -22246 -21343 -40469 -64203 -57202 -15707 2164 -9491 639 21506
11484B1506o658M998J1722k2270m024K716L9902j4806j1360L208r635m585j9422
$$ 21506 14848 19846 31568 9298 5274 7990 47892 33086 21726 24934 15299 10714 -8708
11471h708J8680N605n70j0329q135j3683L765K388J5833p041N969n564j7665j2500
$$ -8708 9972 15577 15007 4678 -3457 -17140 -13375 -10987 4846 -2195 3774 -1790 -19455 -31955
11457c1955q928J9759N600j0449M489q285Q2J3246p218j4855j3772Q790L5664
$$ -31955 -40883 -21124 -15524 -25973 -21484 -29769 -29687 -16441 -23659 -38514 -52286 -43496 -7832
11444g832q468P846K214k3814j813P94J0245K1994L1193l043k3394q575k5614
$$ -7832 -16300 -8454 -6240 -30054 -31867 -31073 -20828 1166 32359 29316 5922 -2653 -28267
11431b8267K3695L7281k479p974J5747k3212n0433j217J5418K1441q892j2773
$$ -28267 -4572 32709 30230 22256 38003 14791 -35642 -36859 -21441 0 -8892 -21665
11419b1665J0768p929K5883L1160n566j7941J8246R590J5479R079j1121m1719
$$ -21665 -10897 -18826 7057 38217 32651 14710 32956 42546 58025 67104 55983 14264
11407A4264j9145J5562j1868j7713O955J5340L744r303J4992k458M3654M520j396
$$ 14264 -4881 10681 -1187 -18900 -11945 3395 7139 -2164 12828 10370 54024 58544 57148
11394E7148K5496j4602l3692j4260j1355p459k12k3608j9371J2133P345o397L272
$$ 57148 82644 68042 34350 20090 8735 1276 1064 -22544 -41915 -29782 -22437 -28834 -25562
11381b5562L996N012j3249N025Q761QJ0752J3560k530n100N061J5502j6364j2969
$$ -25562 -21566 -16554 -29803 -24778 -16017 -16009 -5257 8303 5773 673 5734 21236 4872 -8097
11367h097j6106L0849L7068r739q824r931k19o803n133Q896J6466J8652J1835
$$ -8097 -24203 6646 43714 33975 25151 15220 15001 8198 3065 11961 28427 47079 58914
11354E8914O926k5272q874J895k9707l3215j0133J6929K2504P133j26P6j9049
$$ 58914 65840 40568 31694 33589 3882 -29333 -39466 -22537 -33 7100 6974 7050 -11999
11341a1999j2118p1R811Q267O80K46J0197r575N253k0832j2634O339L245N988
$$ -11999 -24117 -24188 -14377 -6110 -5430 -5184 5013 -4562 691 -20141 -32775 -26436 -23191 -17203
11327a7203O673O450j0915P778k8215r639K6999J7337J145k576k0349l1759l630
$$ -17203 -10530 -4080 -14995 -7217 -35432 -45071 -18072 -735 410 -2166 -22515 -54274 -57904
11314e7904J4240K3548J1397J0742N362k24k5138j0845j1655O89m358P217P678
$$ -57904 -43664 -20116 -8719 2023 7385 7161 -17977 -28822 -40477 -39788 -44146 -36929 -29251
11301b9251J4966J6989J1481l552P807j9N871K446l445J1058J4452L2437K2632
$$ -29251 -14285 2704 14185 10633 18440 18421 24292 26738 23293 34351 48803 81240 103872
11288A03872j4100J6672L6364P3520J04762R5099M5898n6927q6256p0770o8322
$$ 103872 89772 106444 142808 216328 321090 416189 462087 405160 318904 248134 179812
11277A79812l7105l8070l3259q54n939j7361o815n669n45K1567Q894j2460K518
$$ 179812 142707 104637 71378 70524 64585 47224 40409 34740 34195 55762 64656 52196 54714
11264E4714O600r303q639j653n214j0091r102J9733k52rM440r708k1527k5556
$$ 54714 61314 52011 43372 41719 36505 26414 17312 37045 36793 36784 41224 31516 9989 -15567
11250a5567K3560K3659n582j9033j5552k4686o109J1686P848J4844j2135J9438
$$ -15567 7993 31652 26070 7037 -8515 -33201 -39310 -27624 -19776 -4932 -17067 2371
11238B371J1330j9245j2645r989K0661J5043M200q215j1101J0097j3801R948J0197
$$ 2371 13701 -5544 -18189 -28178 -7517 7526 11726 3511 -7590 2507 -11294 -1346 8851
11225H851o62l257j2106J6351j2039r720j8717k8838J7084K6499K1083J0362k413
$$ 8851 8189 4932 -7174 9177 -2862 -12582 -31299 -60137 -43053 -16554 4529 14891 12478
11212A2478j7279m732J2815M843L732L820k2761k9020Q529j7485K6446K7569K1579
$$ 12478 -4801 -9533 3282 8125 11857 15677 -7084 -36104 -27575 -45060 -18614 8955 30534
11199C0534l231l9704l35J7587J5985J630j5711J2959N959p913l4001j7496K0078
$$ 30534 27303 -12401 -12736 4851 20836 22466 6755 19714 25673 17760 -16241 -33737 -13659
11186a3659j1962j5362O126J5673J9433K5408j8680j5120L518n058j634k0988
$$ -13659 -25621 -40983 -34857 -19184 249 25657 6977 -8143 -4625 -9683 -11317 -32305
11174c2305j7011K941K3310P452q866J8174k6666l89N846P274q414q065P926N183
$$ -32305 -49316 -46375 -23065 -15613 -24479 -6305 -32971 -33360 -27514 -20240 -28654 -36719 -28793 -23610
11160b3610l51J3943Q53M3089O692l1637j0100L4019j578j5489J0425J8552J5056
$$ -23610 -23961 -10018 -9165 33924 40616 8979 -1121 32898 31320 15831 26256 44808 59864
11147E9864k535k662r79j8223n479J4409n212P115j570l588j9050q193L166M19
$$ 59864 57329 54667 53688 35465 29986 44395 39183 46298 44728 41140 22090 13897 17063 17482
11133A7482k1765q897J3312K7525k720j1532j3818j3385J8640Q341j4620J5210
$$ 17482 -4283 -13180 132 27657 24937 13405 -413 -13798 4842 13183 -1437 13773
11121A3773J7272k1746J7656q98k732l673j8029l6270j4566L8971M2764K1605
$$ 13773 31045 9299 26955 26057 23325 19652 1623 -34647 -49213 -10242 32522 54127
11109E4127k7147l3106m372K214j8917J8053L5749j4061l0870j4895K4688q78
$$ 54127 26980 -6126 -10498 -8284 -27201 -9148 26601 12540 -18330 -33225 -8537 -9415
11097i415n501o426K6847o834K022K418K6592J6122l4128j4358j1595j4630L4415
$$ -9415 -14916 -21342 5505 -1329 693 3111 29703 45825 11697 -2661 -14256 -28886 5529
11084E529L0068j214p649n759k7792J0945p333n872P124M749k617J1450P298j1367
$$ 5529 35597 34383 26734 20975 -6817 4128 -3205 -9077 -1953 2796 179 11629 18927 7560
11070G560j3277j225N561j8414m241j1933R016J4123K6382R053j4062k8738K332
$$ 7560 -5717 -6942 -1381 -19795 -24036 -35969 -26953 -12830 13552 22605 8543 -20195 -17863
11057a7863L679O722K0770J301J7831J3205J429o972j8261l4069j4077O83m288
$$ -17863 -14184 -7462 13308 14609 32440 45645 47074 40102 21841 -12228 -26305 -25622 -29910
11044b9910J3194K5945k509p431l00P968K1016r586l4896j6554N045K5058J2788
$$ -29910 -16716 9229 6720 -711 -1011 6957 27973 18387 -16509 -33063 -28018 -2960 9828
11031I828J8586j7205j5493j6676k497k3849l594N659J3365J9141J7158k561j8184
$$ 9828 28414 11209 -4284 -20960 -23457 -47306 -50900 -45241 -31876 -12735 4423 1862 -16322
11018a6322j992J1420J889r620m604L964k6817O334K9798O1630L5468j0646o058
$$ -16322 -18314 -6894 -5005 -14625 -19229 -15265 -42082 -35748 -5950 55680 91148 80502 74444
11005G4444J2533O670l4703l2512k3066K8106L5932J5125j5157k6814j967n699
$$ 74444 86977 93647 58944 26432 3366 31472 67404 82529 67372 40558 38591 32892
10993C2892J0454J1321K1102j3219j7362K0823r769k1786J2388K5617k3162m855
$$ 32892 43346 54667 75769 62550 45188 66011 56242 34456 46844 72461 49299 44444
10981D4444K685p50K8485J7681Q439j414K5357j8274l7293J8157J2478J4150q554
$$ 44444 47129 46379 74864 92545 100984 99570 124927 106653 69360 87517 99995 114145 105591
10968A05591j4497j582J9475L371R783k037j3733R325q598j9144j0818n123Q857
$$ 105591 91094 89512 108987 112358 122141 120104 106371 115696 107098 87954 77136 72013 80870
10955H0870K8780j441k8048J934L7247N486M743M877r705J585M1006K1538J8052
$$ 80870 109650 108209 80161 82095 119342 124828 129571 134448 124743 126328 167334 188872 206924
10942B06924k9415m2048J3267O920N299k105K253N037l052K5525K7332k4510k5637
$$ 206924 177509 135461 148728 155648 160947 158842 161095 166132 163080 188605 215937 191427 165790
10929A65790K1284K8028n030q052K6967K293L0494J0964N074l8441M555J7536
$$ 165790 187074 215102 210072 202020 228987 231280 261774 272738 277812 239371 243926 261462
10917B61462J5248L2061J6940K2530K9500P860L1143L9698K3013N5580L1349O5948
$$ 261462 276710 308771 325711 348241 377741 385601 416744 456442 479455 535035 566384 632332
10905F32332Q8055J10132J26203J27122K22345K21725J70557J04204P9360J73619
$$ 632332 720387 830519 956722 1083844 1306189 1527914 1698471 1802675 1882035 2055654
10895B055654K67965L43636M97094O68651Q30419R65525J169325J518365J962750
$$ 2055654 2323619 2667255 3164349 3833000 4663419 5628944 6798269 8316634 10279384
10886A0279384K551529L436468M838693P069176J0583980J5075366J7560843J3024016
$$ 10279384 12830913 16267381 21106074 28175250 38759230 53834596 71395439 84419455
10878H4419455L57882j5286074k0158433j4533015q902488n516456l617815k499422
$$ 84419455 84777337 69491263 49332830 34799815 25897327 20380871 16763056 14263634
10870A4263634j836393j365268j079294q01750o36564n64777n47530m96857m29221
$$ 14263634 12427241 11061973 9982679 9180929 8544365 7979588 7432058 6935201 6505980
10861F505980l25238j86371o919O1337k5820k31883m11358m49644l63809l30856
$$ 6505980 6180742 5994371 5987452 6048789 6022969 5791086 5379728 4930084 4566275 4235419
10851D235419k94619k91902k92816k28300j94875j82397k14324j78900j44205
$$ 4235419 3940800 3648898 3356082 3127782 2932907 2750510 2536186 2357286 2213081
10842B213081j06189j25139j18074j34347j59379j11790p9702o4065j02076q1909
$$ 2213081 2106892 1981753 1863679 1729332 1569953 1458163 1378461 1314396 1212320 1130411
10832A130411m0913l6018n9153n1058o3131p5211p563l2575o0715k9749j3316
$$ 1130411 1089498 1053480 994327 943269 880138 804927 797364 764789 704074 674325 661009
10821F61009j3182p0867n6947r964k1718p162k9662l1510k8918j8705N72Q667
$$ 661009 647827 576960 520013 510049 488331 481169 451507 419997 391079 372374 372946 381613
10809C81613K436k3866J8673K095l2755l8985j8060j5090j104j3766O38k4859
$$ 381613 384049 360183 378856 380951 348196 309211 291151 276061 274957 261191 261829 236970
10797B36970j6950k504p829P946j596J605k0331m531l0261R946q718L049j7570
$$ 236970 220020 217516 209687 217633 216037 217642 197311 192780 162519 172465 163747 166796 149226
10784A49226K218j5894J459n89q868j0707K9559j8136k4094p769j2433j7896j6557
$$ 149226 151444 135550 137009 136420 127552 116845 146404 128268 104174 96405 83972 66076 49519
10771D9519j0805Q211M07O141L659O89R488Q140J3258J7448L6711j4503k1923
$$ 49519 38714 46925 47332 53473 57132 57821 67309 75449 88707 106155 142866 128363 106440
10758A06440J9419L8180m535m5598j8622p783q713J4007J5814K1145J8920K931
$$ 106440 125859 164039 159504 113906 95284 87501 78788 92795 108609 129754 148674 151605
10746A51605q973j8802o519j7184j0148m837k0378j1024o060j078J9160K3867
$$ 151605 142632 123830 117311 100127 89979 85142 64764 53740 47680 46602 65762 89629
10734H9629j782J402j8593K1258J9900J7495p406m2329j9851k2943L5527M7356
$$ 89629 87847 89249 70656 91914 111814 129309 121903 79574 59723 36780 72307 119663
10722A19663M586k26m585N562K7535K8828J0026k1684k9584j6276Q787M081k5100
$$ 119663 124249 124023 119438 125000 152535 181363 191389 169705 140121 123845 132632 136713 111613
10709A11613j7306k3036N394O656J958j9941j9876J1601J7111J9762J2895J7120
$$ 111613 94307 71271 76665 83321 85279 65338 45462 57063 74174 93936 106831 123951
10697A23951j3487j5851J6642J1669m915o08m879k3516j4974p374K3437l62j74
$$ 123951 110464 94613 111255 122924 118009 117401 112522 89006 74032 66658 90095 89733 89559
10684H9559j8774m327N138k7685J2673j553n359j7706K834k1274j6556N233N715
$$ 89559 70785 66458 71596 43911 56584 55031 49672 31966 34800 13526 -3030 2203 7918
10671G918P985j7157L311L5197L760L768M197j4254j6146P207K3975K8202k3643
$$ 7918 15903 -1254 2057 37254 41014 44782 48979 34725 18579 25786 49761 77963 54320
10658E4320j350L813m803j6807M047J2520q099k821k0187J3273j1808J0340m855
$$ 54320 52970 56783 51980 35173 39220 51740 43641 40820 20633 33906 22098 32438 27583
10645B7583o211J7972O603R320o791O67K5897L597j7702j9359K8894K7090L3292
$$ 27583 21372 39344 45947 55267 48476 49143 75040 78637 60935 41576 70470 97560 130852
10632A30852L1817R371l984K5751M9397J6778J7875N6177J06822J43242J97382
$$ 130852 162669 172040 168056 193807 243204 259982 277857 334034 440856 584098 781480
10621G81480K77619L65950L78520K21729o2124k71662j38298J02687J98584J15095
$$ 781480 1059099 1425049 1803569 2025298 1963174 1691512 1553214 1655901 1854485 1969580
10611A969580j35410l90773l81032k79152j79232j01968l6276m6087l9164k9233
$$ 1969580 1834170 1443397 1062365 783213 603981 502013 465737 419650 380486 351253
10601C51253j4619l1491j8373K788k1426j9897L633k2026K46k735J766l5667K0370
$$ 351253 336634 305143 286770 289558 268132 248235 251868 229842 230088 227353 229119 193452 213822
10588B13822K2868R894j3083l975J9947j0243j3136J6745J1758j210J0780J4389
$$ 213822 236690 246584 233501 229526 249473 239230 226094 242839 254597 253387 264167 278556
10576B78556N1082O3990M7843L9022N0125R8659J85449K36214L54744M75150O05332
$$ 278556 329638 393628 441471 480493 530618 629277 814726 1050940 1405684 1880834 2486166
10565B486166N50312J87292l43274o79669n82809m09256k67484j85677j21949
$$ 2486166 3036478 3223770 2880496 2200827 1618018 1208762 941278 755601 633652
10556F33652j01358o0535k4054k8856l4892l1339p617l575k6822l0761j1735k681
$$ 633652 532294 471759 447705 418849 383957 352618 345001 341426 314604 283843 272108 269427
10544B69427L168J4974l0274k4875j7089p714k7004l1992l354K7523o959k6057
$$ 269427 272595 287569 257295 232420 215331 207617 180613 148621 145267 172790 165831 139774
10532A39774j3227o415j94K534N7l34n031L088k718p721j5041l5299k1100J3138
$$ 139774 126547 120132 119938 122472 122529 122195 117164 120252 117534 109813 94772 59473 38373 51511
10518E1511J6523m775M913P235K609k8458m7894j8304Q130K2807P801j14L034
$$ 51511 68034 63259 68172 75407 78016 49558 1664 -16640 -8510 14297 22098 21984 25018
10505B5018L393K370j4608n6n544K1863K7070o288l716m693m119j3331K1750J6813
$$ 25018 28411 30781 16173 16117 10573 32436 59506 53218 49502 44809 40690 27359 49109 65922
10491F5922J3506j0975j6495j4658j5547k7457L192J5814R904J5087J0612K5876
$$ 65922 79428 68453 51958 37300 21753 -5704 -2512 13302 23206 38293 48905 74781
10479G4781j5682j3098J8787L0155L2315N5671M7980Q3685J00096N6563L813r9665
$$ 74781 59099 46001 64788 94943 127258 182929 230909 314594 414690 471253 475066 375401
10467C75401j17560p3182j2660k8621q073k8016k8442k8016k0588K9446K2105
$$ 375401 257841 184659 171999 143378 135305 107289 78847 50831 30243 59689 81794
10456H1794l4882k872O249p308L297M547P146J9463k506k1982o844m938j8127
$$ 81794 46912 44040 50289 42981 46278 50825 57971 77434 74928 52946 46102 41164 23037
10443B3037k869j2672L7447Q412o484J3902J5910j6701j5242j1745J0938K0526
$$ 23037 20168 7496 44943 53355 46871 60773 76683 59982 44740 32995 43933 64459
10431F4459j6164n148k140l950k791J4097J3660Q175l1362J1516J3791j092N344
$$ 64459 48295 43147 41007 37057 34266 48363 62023 70198 38836 50352 64143 63051 68395
10418F8395j9440J5920j0386j4538J3226k843K26j6447l172k754Q845K8380K0757
$$ 68395 48955 64875 54489 39951 53177 50334 50560 34113 30941 28187 37032 65412 86169
10405H6169j9675l0481j6389k310K848J36J5670m947l3699p889J4998J2711n926
$$ 86169 66494 36013 19624 17314 20162 20298 35968 31021 -2678 -10567 4431 17142 11216
10392A1216j608r193r722L448J427M962P049j5472J9358L950k823J1470j7366
$$ 11216 9608 415 -9307 -5859 -4432 530 7579 -7893 11465 15415 12592 24062 6696
10379F696j7385J8586K8201o248K479k5693m803Q98P649J3441N862j1551k6096
$$ 6696 -10689 7897 36098 29850 32329 6636 1833 2731 10380 23821 29683 18132 -7964
10366g964K471j1751M81Q462K618q292k1458K1509n182q495L6762J7771K874j982
$$ -7964 -5493 -17244 -16763 -8301 -5683 -13975 -35433 -13924 -19106 -27601 9161 26932 29806 27824
10352B7824J0946r600j2800j8041o394q02k6070M42K5884L5199J3755k1957J751
$$ 27824 38770 29170 16370 -1671 -8065 -8867 -34937 -34495 -8611 26588 40343 18386 20137
10339B0137R633j4801j4208m884L1133j0202k1513j5956J2795M215Q563J7819
$$ 20137 29770 14969 761 -4123 27010 16808 -4705 -20661 -7866 -3651 4912 22731
10327B2731j251l0869l8041J1309K6482J0867j1153j4449k6986J7406K2486J1343
$$ 22731 21480 -9389 -47430 -36121 -9639 1228 -9925 -24374 -51360 -33954 -11468 -125
10315a25K150j4243q969L3832O447L111o582j0483M157J292j8014o881M264J3547
$$ -125 2025 -12218 -21187 12645 19092 22203 15621 5138 9295 10587 -7427 -14308 -10044 3503
10301C503K7870j2689j5349j3703j3244P503J4185L672N801j344j0034k1829L09
$$ 3503 31373 18684 3335 -10368 -23612 -16109 -1924 1748 7549 6205 -3829 -25658 -25349
10288b5349N948J2620J1175j7561L622J5720M010k8333O48M612J8250L0246r24
$$ -25349 -19401 -6781 4394 -13167 -9545 6175 10185 -18148 -17500 -12888 5362 35608 34684
10275C4684j8666m0231k1526J8634J5934K5359K3206m2593j1404n991J0143N872
$$ 34684 16018 -24213 -45739 -27105 -11171 14188 37394 -5199 -16603 -22594 -12451 -6579
10263f579O251J6375J1164m818Q024k312J786K1278j122n268j2761k7141p707
$$ -6579 -328 16047 27211 22393 30417 28105 29891 51169 50047 44779 32018 4877 -2830
10250b830j4449N649J4517r644K2609q581P002J2896o989k4065k301M219j5461
$$ -2830 -17279 -11630 2887 -6757 15852 7271 14273 27169 20180 -3885 -6186 -1967 -17428
10237a7428r226M341J3768R995q403k189P397J5895l4962j1954K1187j084J8203
$$ -17428 -26654 -22313 -8545 1450 -6953 -9142 -1745 14150 -20812 -32766 -11579 -12663 5540
10224E540J6792k782j9917j0124j3670J8335J3770j0011L402J5243n18Q750o999
$$ 5540 22332 19550 -367 -10491 -24161 -5826 7944 -2067 1335 16578 16060 24810 17811
10211A7811k4045j291J5850l389n30K023K264N907K016K100p217j1844j3332n742
$$ 17811 -6234 -7525 8325 4936 4406 6429 8693 14600 16616 18716 11499 -345 -13677 -19419
10197a9419M901o995j1701K159j6185O914K6635J9858o556K9442J2503n074k7992
$$ -19419 -14518 -21513 -33214 -31055 -47240 -40326 -13691 6167 -389 29053 41556 36482 8490
10184H490k4667j0518j1642J1917J8243K3178L8528j8400o618n795O271j7648
$$ 8490 -16177 -26695 -38337 -26420 -8177 15001 53529 35129 28511 22716 28987 11339
10172A1339J2948M2281l774j0410j0790j3742j6988k6398n66o835Q339K7395K1265
$$ 11339 24287 66568 62794 52384 41594 27852 10864 -15534 -16100 -22935 -14596 12799 34064
10159C4064J0665j1202M409k450O859k799K064K3628q12j3623n497j0900l8938
$$ 34064 44729 33527 37936 35486 42345 39546 41610 65238 64426 50803 45306 34406 -4532
10146d532m2216m373J6218L0535K5060J3467k2602k3720J4690K7819R2k2693o408
$$ -4532 -46748 -51121 -34903 -4368 20692 34159 11557 -12163 2527 30346 30438 7745 1337
10133A337r346R495J3160n078K956p207M470p048k9016j0171K5492M596m643P368
$$ 1337 -8009 1486 14646 9568 12524 5317 9787 2739 -26277 -36448 -10956 -6360 -11003 -3635
10119c635L3149k6449M820k1773k0657K164N042m273L04P995l763q149K7647L627
$$ -3635 29514 3065 7885 -13888 -34545 -32381 -27339 -31612 -31308 -23313 -27076 -35225 -7578 -3951
10105c951j3743l984j826J8895N080P790j0116m30l036J3154J790J3645R410j1194
$$ -3951 -17694 -21678 -23504 -4609 471 8261 -1855 -2285 -5321 7833 9623 23268 32678 21484
10091B1484K066l445K9777N264r355q815m332j4034O989J3730j0405L542J5638
$$ 21484 23550 20105 49882 55146 45791 36976 32644 18610 25599 39329 28924 32466 48104
10078D8104j502l480j621r33R751R088k9755O950o876j75K9251L5872K895K2613
$$ 48104 46602 43122 41501 40568 50319 59407 29652 36602 29726 29551 58802 94674 97569 120182
10064A20182O58j0726L0421L4276J8915K6525O7052R3192J24207J82184K74790
$$ 120182 120840 110114 140535 174811 193726 220251 287303 380495 504702 686886 961676
10053I61676L62731N55065Q89275J075504P14724j46842j220562j173081o50899
$$ 961676 1324407 1879472 2768747 3844251 4558975 4412133 3191571 2018490 1367591
10044A367591l50721k40453j14495j09915n8804l8735m0509m6327l9155l6657
$$ 1367591 1016870 776417 661922 552007 493203 454468 413959 367632 328477 291820
10034B91820k7256o600M071j5171k208J8384O070r332j8022k6779O167J2533r743
$$ 291820 264564 257964 262035 246864 244656 263040 269110 259778 241756 214977 221144 233677 223934
10021B23934p408J2468j1460l9124l0373m4789n7119o008L2055J075r145k09j7945
$$ 223934 216526 228994 217534 178410 148037 103248 46129 40121 72176 73251 64106 63897 45952
10008D5952q601o843Q484L600J0529j5939j6959J2361O463j0030r197J2788K869
$$ 45952 37351 30508 38992 42592 53121 37182 20223 32584 39047 29017 19820 32608 35477
9995C5477L921j9880m652J7920m425K019k6055k8431K446L933K5568K0339P954
$$ 35477 39398 19518 14866 32786 28361 30380 4325 -24106 -21660 -17727 7841 28180 36134
9982C6134J297L347o916j353j6268O456K4026K7037k2504j4546l2845j8063j6924
$$ 36134 37431 40778 33862 32509 16241 22697 46723 73760 51256 36710 3865 -14198 -31122
9969c1122J1404K1365K6206j3322j37j1546j5063j2863J3204j4272J8036K5992
$$ -31122 -19718 1647 27853 14531 14394 2848 -12215 -25078 -11874 -26146 -8110 17882
9957A7882K709j9724j7520J4426J623Q395J805k7493k496j2622j1281K194O637
$$ 17882 20591 867 -16653 -2227 -604 7791 9596 -17897 -20393 -33015 -44296 -42102 -35465
9944c5465J5137j242K2797J0913K0882m035j3962J6735m94M067l4951k1255J1267
$$ -35465 -20328 -21570 1227 12140 33022 28987 15025 31760 31266 35333 382 -20873 -9606
9931i606p925l977P010Q393K2409j3533n061J7922R327l015j4922q356P469J1900
$$ -9606 -17531 -21508 -14498 -6105 16304 2771 -2290 15632 24959 21944 7022 -1334 6135 18035
9917A8035L276k0139l3405p329O28J7413J2299r961k2102L1353K7245K0121M466
$$ 18035 21311 1172 -32233 -39562 -38934 -21521 -9222 -19183 -41285 -9932 17313 37434 41900
9904D1900l2254j7730l1j190P858R040P522j700Q618J1J0727K6047N922l485k3255
$$ 41900 9646 -8084 -8115 -9305 -1447 7593 15115 13415 22033 22044 32771 58818 64740 61255 38000
9889C8000p776J078j4347J503j4713O181K6241q0k6383r715o725J002K3434q96
$$ 38000 30224 31302 16955 18458 3745 9926 36167 36087 9704 -11 -6736 -5734 17700 16804
9875A6804j6809n356P339J3148P537k160J8012k0836l0161K919J5699J2059j3677
$$ 16804 -5 -5361 1978 15126 22663 20503 38515 17679 -12482 -9563 6136 18195 4518
9862D518m888r004rN894J1122p820j2642K1191j3115o023J6536j5512k4745K407
$$ 4518 -370 -9374 -9383 -3489 7633 -187 -12829 8362 -4753 -10776 5760 -9752 -34497 -32090
9848c2090L870Q665J6848L2219m678j9954l1895J6530K2948p853k3713R47l543
$$ -32090 -28220 -19555 -2707 29512 24834 4880 -27015 -10485 12463 4610 -19103 -18156 -21699
9835b1699j6392N36N267P295O715m766J4896j3301J5976k633j1039M78p593l5719
$$ -21699 -38091 -37555 -32288 -24993 -18278 -23044 -8148 -21449 -5473 -8106 -19145 -18667 -26260 -61979
9821f1979J1425L6648O534Q536m401l7973j9907J8261M4863L1318k6456J1630
$$ -61979 -50554 -13906 -7372 1164 -3237 -41210 -61117 -42856 2007 33325 6869 18499
9809A8499J6105Q277k2740k1139j4347o77j396J45N189j3175l380l956N716M384
$$ 18499 34604 42881 20141 -998 -15345 -16022 -17418 -17273 -12084 -25259 -28639 -32595 -26879 -22495
9795b2495M652K7175M306l2527m379J8314j0000n908J0711j3306q528K8074K3090
$$ -22495 -17843 9332 13638 -18889 -23268 -4954 -14954 -20862 -10151 -23457 -31985 -3911 19179
9782A9179j339J1013j2453k7750m4514j9436M785J0623M1194M3293R272j0371
$$ 19179 17840 28853 16400 -11350 -55864 -75300 -70515 -59892 -18698 24595 33867 23496
9770B3496j9488p007K1545J9350O36K1733j4450k9367j6349r915J2151n450j5181
$$ 23496 4008 -2999 18546 37896 38532 60265 45815 16448 99 -9816 2335 -3115 -18296
9757a8296J2391K9985n762k1360P19J3827p850P448K5307L5384j2408j1910k6499
$$ -18296 -5905 24080 18318 -3042 -2323 11504 3654 11102 36409 71793 59385 47475 20976
9744B0976J3300J123m0156l1424m858J3541K0704Q260L2180Q462k8675j5147J0205
$$ 20976 34276 35399 -4757 -36181 -41039 -27498 -6794 1466 33646 42108 13433 -1714 8491
9731H491j273J865o227m055J0062J1376q560q438p030P231r259L0357K0039k1089
$$ 8491 7218 9083 2856 -1199 8863 20239 11679 3241 -3789 3442 -5817 24540 44579 23490
9717B3490k0501Q862m148j438o258L653l332l732j3921K645j30l909k633P735
$$ 23490 2989 11851 7703 6265 7 3660 328 -3404 -17325 -14680 -14810 -18719 -21352 -13617
9703a3617K340l816j1539q920L7361J0805J3137Q668j5403k27O545m835n891Q125
$$ -13617 -11277 -15093 -26632 -35552 1809 12614 25751 34419 19016 18789 25334 20499 14608 22733
9689B2733k20k2514k0705L1585J5304j0055k5255j867K1895j8121m911J3887q560
$$ 22733 22513 -1 -20706 10879 26183 16128 -9127 -10994 10901 -7220 -12131 1756 -6804
9676f804m425J5908J2997j3220Q114j2430j2524j3811q706m409J5067L844P996
$$ -6804 -11229 4679 17676 4456 12570 140 -12384 -26195 -34901 -39310 -24243 -20399 -12403
9663a2403J7540l017p765J730k4211k3930o980J5146K4728K2964R109K1570J0901
$$ -12403 5137 2120 -5645 -3915 -28126 -52056 -59036 -43890 -19162 3802 12911 34481 45382
9650D5382k6110m8407q078M270K2611L6543J2811m526R838J7674j1369k2578j7271
$$ 45382 19272 -29135 -37213 -32943 -10332 26211 39022 34496 44334 62008 50639 28061 10790
9637A0790m2839l861L6293k811j485q941K001L1675K3170K377k1910O493k205
$$ 10790 -32049 -35910 383 -2428 -3913 -12854 -10853 20822 43992 46369 24459 30952 28747
9624B8747k4464J8169K5650k8744j4370L062K2674j5499J2384j4392l7607k5495
$$ 28747 4283 22452 48102 19358 4988 8050 30724 15225 27609 13217 -24390 -49885
9612d9885O018q093o493J3478K674M486M4914K1411o509k532j9997j4460Q032
$$ -49885 -43867 -51960 -58453 -44975 -42301 -37815 7099 28510 22001 19469 -528 -14988 -6956
9599f956K1612J2312l590q255n783M206j6342j6809j8026J653K2878J1100j1810
$$ -6956 14656 26968 23378 15123 9340 13546 -2796 -19605 -37631 -35978 -13100 -2000 -13810
9586a3810o12J7493r067p125Q303J4489k3952j5571K0215J6709k493L27Q083J3437
$$ -13810 -14422 3071 -5996 -13121 -4818 9671 -14281 -29852 -9637 7072 4579 4906 12989 26426
9572B6426k1075N861R66N339j0770r807q945J599n260o934J8034J1640N648n314
$$ 26426 5351 11212 12178 17517 6747 -3060 -12005 -10406 -15666 -22600 -4566 7074 12722 7408
9558G408k4433L210j3313j0829K9202L4032N939q688k5032j533J8906J3702P045
$$ 7408 -17025 -13815 -27128 -37957 -8755 25277 31216 22528 -2504 -4037 14869 28571 35616
9545C5616k2229k6043j3833N863j968J863J0970R51k2695K6846O181j3367j3483
$$ 35616 13387 -12656 -26489 -20626 -22594 -20731 -9761 -8810 -31505 -4659 1522 -11845 -25328
9532b5328J5602R982K6353j353l619J3399J6460q078j8070j1227J1498k665o519
$$ -25328 -9726 256 26609 25256 21637 35036 51496 43418 25348 14121 25619 22954 16435
9519A6435j9633j0359l733J2506M303j5044j1842L7792M0205n727j1493J610Q23
$$ 16435 -3198 -13557 -17290 -4784 -481 -15525 -27367 10425 50630 44903 33410 35020 35843
9506C5843N18Q68j7555m0904l2621K6258J7878J6769L3687R267q275k7428l7885
$$ 35843 36361 37229 19674 -21230 -53851 -27593 -9715 7054 40741 50008 41733 14305 -23580
9493b3580J8185L6946j2065M111m431N220p824q008Q826J0753k621p128p720m200
$$ -23580 -5395 31551 19486 23597 19166 24386 16562 8554 17380 28133 25512 18384 10664 6464
9479F464l754r515J489J008J0300p244j9153L3311K6193l3547k8283J1068J6491
$$ 6464 2710 -6805 -5316 -4308 5992 -1252 -20405 12906 39099 5552 -22731 -11663 4828
9466D828L1480j2864k4139L745J3039M407J3576J665J1189M4819M819n410J5053
$$ 4828 36308 23444 -695 3050 16089 20496 34072 35737 46926 91745 96564 91154 106207
9453A06207K7929j5749k3785k5248l7004L403K1303Q413O780L5978L5661p537
$$ 106207 134136 118387 94602 69354 32350 35753 57056 65469 72249 108227 143888 136351
9441A36351R436J4300J0442L063P216j1852l5008j1837j3881k8923m9293j6203
$$ 136351 145787 160087 170529 173592 180808 168956 133948 122111 108230 79307 30014 13811
9429A3811j1418L9892O726k8266j4163L958M2264K5923o792j8180m0782l7693
$$ 13811 2393 42285 49011 20745 6582 10540 52804 78727 71935 53755 12973 -24720
9417b4720L2515L7093Q915R662k3815j5896r898l372J2465k385o708K0411j9305
$$ -24720 7795 44888 53803 63465 39650 23754 13856 10484 22949 20564 13856 34267 14962
9404A4962K5667Q330r828j1340J0678q795j7822J0305M193k795k3002j3197R367
$$ 14962 40629 48959 39131 27791 38469 29674 11852 22157 26350 23555 553 -12644 -3277
9391c277m749p987P864J9886j7878K799K9816j3895m249J6601j5343k5934J4786
$$ -3277 -8026 -16013 -8149 11737 -6141 -3342 26474 12579 8330 24931 9588 -16346 -1560
9378a560L4571K459k1839j8695l0542J060O592k252l5L0291j169J1591K5868K980
$$ -1560 33011 35470 13631 -5064 -35606 -34546 -27954 -30206 -30241 50 -1119 10472 36340 39320
9364C9320k6210M941K4573j2786k4961k3880J0637K0700n658j3900j0392L5968
$$ 39320 13110 18051 42624 29838 4877 -19003 -8366 12334 6676 -7224 -17616 18352
9352A8352K2479k2946j0658J6971N355k2101l5691m305K8142J2663O071n433j888
$$ 18352 40831 17885 7227 24198 29553 7452 -28239 -32544 -4402 8261 14332 8899 7011
9339G011J4059k4983j144N07J0401j2625J0505L853l933j1200q330k4574K3473
$$ 7011 21070 -3913 -5057 -4550 5851 -6774 3731 7584 3651 -7549 -15879 -40453 -16980
9326a6980L18P181J7529L0296o330j6573J6390K0367n694j1728j6584J747j6941
$$ -16980 -16662 -9481 8048 38344 32014 15441 31831 52198 46504 34776 18192 19939 2998
9313B998O825p338j313l636M139M007l524k792j0651J3611J1650J3685n505l6707
$$ 2998 9823 2485 1172 -2464 1675 5682 2158 -634 -11285 2326 13976 27661 22156 -14551
9299a4551p890K312q14N8O798Q688r498j6405L342K4851M4881l965k6085j6688
$$ -14551 -22441 -20129 -20943 -20885 -14087 -5399 -14897 -31302 -27960 -3109 41772 37807 11722 -4966
9285d966r998o696J2475Q652o523p489p603R483P010k432Q473l7337k1822J3228
$$ -4966 -14964 -21660 -9185 -533 -7056 -14545 -22148 -12665 -5655 -8087 386 -36951 -58773 -45545
9271d5545K6514K013L4592J3220l105k3815j7909j9316q526J5959J1641j164J39
$$ -45545 -19031 -17018 17574 30794 27689 3874 -14035 -33351 -41877 -25918 -14277 -15441 -15302
9258a5302J7779n386L8060K7372k006r23O416J6303o877l8246l1359n625n272
$$ -15302 2477 -2909 35151 62523 60517 59594 66010 82313 75436 37190 5831 206 -5066
9245e066m311J7852M274K1637j0925k4028L526j8929N104p216K6076L0523K6653
$$ -5066 -9377 8475 12749 34386 23461 -567 2959 -15970 -10866 -18082 7994 38517 65170
9232F5170J7058m295k0782k0296j9575J2069o473K0900j499l498K0269j5586J7554
$$ 65170 82228 77933 57151 36855 17280 29349 22876 43776 42277 38779 59048 43462 61016
9219F1016j8976k3060J0909k872j631K3376k976j8841p016j4224k7412J9821L7740
$$ 61016 42040 18980 29889 27017 25386 48762 45786 26945 19929 5705 -21707 -1886 35854
9206C5854J1939k5165K0999j1012j4737j927J5643K0154R164M631K2066J5653
$$ 35854 47793 22628 43627 32615 17878 15951 31594 51748 60912 65543 87609 103262
9194A03262p772K8289N5985K7727J2825J1694p473k2898k3128Q929j9128j9309
$$ 103262 95490 123779 179764 207491 220316 232010 224537 201639 178511 187440 168312 149003
9182A49003j8369m459J5577K8139L6522R695p295m039O934J7886K9327L9710P8668
$$ 149003 130634 126175 141752 169891 206413 216108 208813 204774 211708 229594 258921 298631 377299
9169C77299J02494P9355R0652J11334Q4362Q3917R9427M9785J4476k3880o3531
$$ 377299 479793 559148 649800 761134 845496 929413 1028840 1078625 1093101 1069221 1005690
9158A005690r3105p6178q1300q2608o7504l5196m4791m0171k9621j8127k673j8495
$$ 1005690 912585 836407 755107 672499 604995 569799 525008 484837 455216 437089 434416 415921
9146D15921j3788N26K1390Q144q806L248j3693K0930Q715K705J4610K0608m568
$$ 415921 402133 402659 424049 432193 423387 426635 412942 433872 442587 445292 459902 480510 475942
9133D75942m703L773L177K8847J6113L8775K0902J179J8090K8639M4071M7077
$$ 475942 471239 475012 478189 507036 523149 561924 582826 584005 602095 630734 674805 721882
9121G21882R6670O7005L8025P6002R5545Q8653J09524J26038J67223J81357J75261
$$ 721882 818552 885557 923582 999584 1095129 1183782 1293306 1419344 1586567 1767924 1943185
9110A943185K21292J97262K02287J78017J41317J37308P2347K5188l7490r2922
$$ 1943185 2164477 2361739 2564026 2742043 2883360 3020668 3093015 3118203 3080713 2987791
9100B987791j27971j82466j61623j40743j57702j55399j66887j53760j53182j15101
$$ 2987791 2859820 2677354 2515731 2374988 2217286 2061887 1895000 1741240 1588058 1472957
9090A472957q5439q5215q0247p0715q1397m3368k9479k2816o8794n6355o140m3246
$$ 1472957 1387518 1302303 1222056 1151341 1069944 1026576 997097 974281 905487 849132 842992 799746
9078G99746m0863l8657n9574m6987o0704n7475n0607l5224j6780o978j0048l5713
$$ 799746 758883 720226 660652 613665 552961 495486 444879 409655 392875 385897 375849 340136
9066C40136m5183l330M27k2716O65Q867l0375l0220k0987j4728M7081J6970k3110
$$ 340136 294953 291623 292050 269334 269999 278866 248491 218271 197284 182556 229637 246607 223497
9053B23497j2390k3799k8866R34K1305J7680k0200O261N720l362j801p568k2038
$$ 223497 211107 187308 158442 159376 180681 198361 178161 184422 190142 186780 184979 177411 155373
9040A55373l949k214J3549n935m811K1772J7567j043p061L568J8017k811O698
$$ 155373 151424 149210 162759 156824 152013 173785 191352 190309 183248 186816 204833 202022 208720
9027B08720K2546L7600N425K6238L2435j1218j1522K038l062l7104l1914o625
$$ 208720 231266 268866 274291 300529 332964 321746 310224 312262 309200 272096 240182 233557
9015B33557j8963k1944m566o082j0769k323o60q551n681n2754l9754K2340L8413
$$ 233557 214594 192650 188084 182002 171233 168910 168250 159699 154018 101264 61510 83850 122263
9002A22263J6333r869k2818k4386m077l0710j7705K5546P412k780L198j2717k7893
$$ 122263 138596 128727 105909 81523 77446 46736 29031 54577 61989 59209 62407 49690 21797
8989B1797O252P409O258K0107J5340o308k4710k9676k9392J1207N434K1809j5971
$$ 21797 28049 35458 41716 61823 77163 70855 46145 16469 -12923 -1716 3718 25527 9556
8976I556k5096r514M0134Q933J6283J5988k8988q999p377l059L240l3511j0455
$$ 9556 -15540 -25054 15080 24013 40296 56284 27296 18297 10920 7861 11101 -22410 -32865
8963c2865L3287K5630J7844L422J1769k2379J1867m793p117k0234M099k1159j9696
$$ -32865 422 26052 43896 47318 59087 36708 48575 43782 36665 16431 20530 -629 -20325
8950b0325k348J5246K7040M9346K0014k9258j1527L6533j7503j5841R660k734
$$ -20325 -22673 -7427 19613 68959 88973 59715 48188 84721 67218 51377 61037 58303
8938E8303j312L057j8009J1864N021j8877j0423L4111J881k3052M654K2524L347
$$ 58303 56991 60048 42039 53903 58924 40047 29624 63735 65616 42564 47218 69742 73089
8925G3089J8635j3704k6168j5437m0911r213K7950L6979J6752p606j632o57K6271
$$ 73089 91724 78020 51852 36415 -4496 -13709 14241 51220 67972 60366 58734 58077 84348
8912H4348r281l7423J250k036l305k2496L705k133N748K4761K0270p652R29k955
$$ 84348 75067 37644 38894 36858 33553 11057 14762 12629 18377 43138 63408 55756 56685 53730
8898E3730J596P187j797Q482K4440O3748O6391L6640r59n632p27k0647Q981Q302
$$ 53730 55326 62513 60716 69198 93638 157386 223777 260417 259458 253826 253099 232452 241433 249735
8884B49735l084J8936j5438k4937J9613L5928j1566j1199N947K4098L4827Q870
$$ 249735 246651 265587 250149 225212 244825 280753 269187 257988 263935 288033 322860 331730
8872C31730k048J533Q685K0804o298j887J8166o124n242N437N568L0916K5716
$$ 331730 329682 331215 339900 360704 354406 352519 370685 364561 359319 364756 370324 401240 426956
8859D26956K9848L1675R87Q696J6998K8405J7491l617l5987j8176J8153m70J6209
$$ 426956 456804 488479 489466 498162 515160 543565 561056 557439 521452 503276 521429 520959 537168
8846E37168J8695K0490L6480J2745K4358K421k5389j1422o483k7296J8401L058
$$ 537168 555863 576353 612833 625578 649936 652357 626968 615546 609063 581767 600168 603226
8834F03226J5548K4395M0931L0726M7339K6927Q225J7185J6803O0105K5818j3480
$$ 603226 618774 643169 684100 714826 762165 789092 797317 814502 831305 891410 917228 903748
8822I03748m427N1399K2322J9725M3719M3939j532O035K2897L1279M3866N4555
$$ 903748 899321 950720 973042 992767 1036486 1080425 1078893 1084928 1107825 1139104 1182970 1237525
8810A237525P1484O0745L1653J2341L4095N9690O1352J6442M6423R7271R1250
$$ 1237525 1309009 1369754 1401407 1413748 1447843 1507533 1568885 1585327 1631750 1729021 1820271
8799A820271J03659J15322J59107J73653J48942J80496J80336J82313K58549K93549
$$ 1820271 1923930 2039252 2198359 2372012 2520954 2701450 2881786 3064099 3322648 3616197
8789C616197L42374L92673M64572N81897P11489Q00808R39320J092891J290334
$$ 3616197 3958571 4351244 4815816 5397713 6109202 6910010 7849330 8942221 10232555
8780A0232555J527502J866797K318602K861120L423380M064492M748426N596194
$$ 10232555 11760057 13626854 15945456 18806576 22229956 26294448 31042874 36639068
8772C6639068O857272Q725793J1402826J5153042K0448849K7657032L6143244
$$ 36639068 43496340 52222133 63624959 78778001 99226850 126883882 163027126
8765A63027126M2702502M0045046K2031137q538617l6853984m6151891l9165321
$$ 163027126 205729628 245774674 267805811 259267194 222413210 176261319 137095998
8758A37095998k8549717k0089072j4231850j0318616p703661n882998m633519
$$ 137095998 108546281 88457209 74225359 63906743 56203082 50320084 45686565
8751D5686565l743899l113423k646657k416626k262265k008435j663011j325999
$$ 45686565 41942666 38829243 36182586 33765960 31503695 29495260 27832249 26506250
8743B6506250j045187q96832r58674j131303j241983j327993j255584j193446
$$ 26506250 25461063 24564231 23605557 22474254 21232271 19904278 18648694 17455248
8735A7455248j122397j055707r93121r35685q52000p84746p29029o90883o36392
$$ 17455248 16332851 15277144 14284023 13348338 12496338 11711592 10982563 10291680 9655288
8726I655288n94128n61231n11201m98260m59019m26518l96091l70866l35196k90071
$$ 9655288 9061160 8499929 7988728 7490468 7031449 6604931 6208840 5837974 5502778 5212707
8716E212707k67214k72438k34646k11840j84357j78081j89633j93487k04042j52422
$$ 5212707 4945493 4673055 4438409 4226569 4042212 3864131 3674498 3481011 3276969 3124547
8706C124547j15770j08807j17059j28790j28905j22385j08123j33913j03850p7365
$$ 3124547 3008777 2899970 2782911 2654121 2525216 2402831 2294708 2160795 2056945 1979580
8696A979580m1767l3898k5525o9475o1390q1303p9192q3657m1317o6978q8345
$$ 1979580 1937813 1903915 1878390 1808915 1747525 1666222 1587030 1503373 1462056 1395078 1306733
8685A306733n4175l6379m8986n2145o1163m9101k0279k2535l5474k8990l9043
$$ 1306733 1252558 1216179 1167193 1115048 1053885 1004784 984505 961970 926496 897506 858463
8674H58463m3184j5197k7894m3180j1063k1812k7390k1842j3554l3868o076P288
$$ 858463 815279 800082 772188 729008 717945 696133 668743 646901 633347 599479 593403 600691
8662F00691q5j3809l530k3611N946k4070o343l1662l2949l1474j1099k439K0069
$$ 600691 600606 586797 583267 559656 565602 541532 535189 503527 470578 439104 428005 425566 445635
8649D45635N5877P282J6528Q101O255K2887K1029P519L3103J7592M635j7943m3630
$$ 445635 501512 508794 525322 533423 539678 562565 583594 591113 624216 641808 646443 628500 584870
8636E84870m227n169q293J7769L9600J350k2735R12j7783j3906o224k3891Q06
$$ 584870 580643 575474 567181 584950 624550 625900 603165 604077 586294 572388 566164 542273 543079
8623E43079J5398J3847K2181J2305L8589O6663O0813L5935j9163q2957j00522
$$ 543079 558477 572324 594505 606810 645399 712062 772875 808810 789647 706690 606168
8612F06168o1461l6149L944J3421j5421p748j7238m830K3744l497l4111J5842
$$ 606168 544707 508558 512502 525923 510502 502754 485516 480686 504430 500933 466822 482664
8600D82664J5824K934J8837m520M550J5357K1740M306k0963j7300r404j5923L477
$$ 482664 498488 501422 520259 515739 520289 535646 557386 561692 540729 523429 514025 498102 501579
8587E01579j0887j4795k2193l5607q933M79O791j5206n236q099J2302L3123K4241
$$ 501579 490692 475897 453704 418097 409164 409643 416434 401228 395992 387893 400195 433318 457559
8574D57559j7349r649Q428j3785m7191k5853j4092l4793M180l762J0174J0703
$$ 457559 440210 430561 438989 425204 378013 352160 338068 303275 307455 303693 313867 324570
8562C24570o87J2119m047K049l67j0573k8644j3265q882j6327j0614n931Q62j5542
$$ 324570 323883 336002 331955 334004 333637 323064 294420 281155 272273 255946 245332 239401 240263 224721
8548B24721K0600j319j3311k6458J68l751J874j724K4090L18m1587J348K2608
$$ 224721 245321 244002 230691 204233 204401 200650 202524 200800 224890 225208 183621 184969 207577
8535B07577K803j1916L80J8284R43J2775j1704p62L473k7191j0295M176o189L1587
$$ 207577 210380 198464 198844 217128 218071 230846 219142 218380 221853 194662 184367 188543 182354 213941
8521B13941L042k699j1847r824P453L92J7095M687k463k4562m721P963j5406k0781
$$ 213941 216983 214284 202437 192613 200066 200458 217553 222240 219777 195215 190494 198457 183051 162270
8507A62270J0683J2081M016n577k0497o896k8221R206J3191j0131o147l428k083
$$ 162270 172953 185034 189050 183473 162976 156080 127859 137065 150256 140125 133978 130550 128467
8494A28467N777o43l2720r626M296J2442R128J080k3031N460J6217r081j2294
$$ 128467 134244 133601 100881 91255 95551 107993 117121 118201 95170 100630 116847 107766 95472
8481I5472K6K5716q0J2207N062m089j3887Q390K6004j5173J3319J8176m339J5629
$$ 95472 95498 121214 121134 133341 138403 134314 120427 128817 154821 139648 152967 171143 166804 182433
8467A82433M525J1999J3214m780N34J0033l721J6032L3417j4770k3359q735k2032
$$ 182433 186958 198957 212171 207391 207925 217958 214237 230269 263686 248916 225557 216822 194790
8454A94790l3205L331j683k4126l8556j1228M240K595J3527J5530J3041m148l504
$$ 194790 161585 164916 163233 139107 100551 89323 93563 96158 109685 125215 138256 134108 130604
8441A30604o52j518j6415j3256l6440n606j1184K7081M3368m806L339K3955j4766
$$ 130604 129952 128434 112019 98763 62323 56717 45533 72614 115982 111176 114515 138470 123704
8428A23704K40l205l4129J265r845K0768L1219j2891j2169O272M654j5736l454
$$ 123704 123944 120739 86610 87875 78030 98798 130017 117126 104957 111229 115883 100147 96693
8415I6693K7171K3787k2904n6627N754L4383J4228j7047p505J6087j6628j5980
$$ 96693 123864 147651 124747 68120 73874 108257 122485 105438 97933 114020 97392 81412
8403H1412J1539J1615R300q473J463J3985J2598j2368q96l0169k4024K5070L7871
$$ 81412 92951 104566 113866 105393 106856 120841 133439 121071 120175 90006 65982 91052 128923
8390A28923j3937l1255j6318N935M748J6863L8722J9682J1091j5796j0441k4260
$$ 128923 114986 83731 67413 73348 78096 94959 133681 153363 164454 148658 138217 113957
8378A13957j0742Q660K3428r96K2048M3218J3122J8834L6040M6768L9683N6450
$$ 113957 103215 111875 135303 134307 156355 199573 212695 231529 267569 314337 354020 410470
8366D10470R2620R5822O9862O4879R7458J19797R6096L2532l5258n6872q1232
$$ 410470 503090 598912 668774 733653 831111 950908 1047004 1079536 1044278 987406 906174
8355I06174p0808p5310j15044r7093o2692m7617n0393l1314m3455k9723m994j2272
$$ 906174 835366 760056 645012 547919 485227 437610 387217 355903 312448 282725 277731 265459
8343B65459l0731j457P020l825j7817j9713k5136K768J1656k7389O624K4503o331
$$ 265459 234728 233271 240291 236466 218649 198936 173800 176568 188224 160835 167459 191962 185631
8330A85631j1398j2835l190l0981l34k8470J1672K6383M58l1605j2819J5729P979
$$ 185631 174233 161398 158208 127227 126893 98423 110095 136478 136936 105331 92512 108241 116220
8317A16220O683K8428j6786j4242n483j3680j2037j9521j530m49J3427P929R732
$$ 116220 122903 151331 134545 120303 114820 101140 89103 69582 68052 67603 81030 88959 98691
8304I8691j4041J0068l5790M965J3858m916Q515K6350Q104m958j0145m861k2635
$$ 98691 84650 94718 58928 63893 77751 72835 81350 107700 115804 110846 100701 95840 73205
8291G3205k3837l264L3631m361l0584J6375J2995P417J4721J3876j0746j4825
$$ 73205 49368 46104 79735 75374 44790 61165 74160 81577 96298 110174 99428 84603
8279H4603p331o320q15N920k578M14l7965k7587M887J1254J1538K7119o102j3505
$$ 84603 77272 70952 70137 76057 73479 73893 35928 8341 13228 24482 36020 63139 57037 43532
8265D3532j3350J6273L1830J3218j5142l1120k49J7418R18k4072k7193k3936K1427
$$ 43532 30182 46455 78285 91503 76361 45241 44992 62410 63328 39256 12063 -11873 9554
8252I554L6701J717j4049j5019j1080K6632l368J9912j1227j829K4675m590r37
$$ 9554 46255 47972 33923 18904 7824 34456 31088 51000 39773 37944 62619 58029 57092
8239E7092j9398J088J5500k7380p156P415L276q403R451J1052K4554K8381k503
$$ 57092 37694 38782 54282 26902 19746 27161 30437 22034 31485 42537 67091 95472 92969
8226I2969j1181j2547j4908k2072k681M7011K5938K974j6830j0999Q414r339j5729
$$ 92969 81788 69241 54333 32261 29580 76591 102529 105503 88673 77674 86088 76749 61020
8213F1020O506o90R866J069pj3823l768Q606o45k741J047J5570K629r614j8628
$$ 61020 67526 66836 76702 77771 77764 63941 60173 68779 68134 65393 66440 82010 84639 75025 56397
8198E6397R040o855k2317K4801K5881J696R868l4610k4398K2771J893m424m220
$$ 56397 65437 58582 36265 61066 86947 88643 98511 63901 39503 62274 64167 59743 55523
8185E5523o463j7999p1N124P194J1153q528K17m353j6456J1454M968l0851j1197
$$ 55523 49060 31061 30990 36114 43308 54461 45933 46150 41797 25341 36795 41763 10912 -285
8171b85K5049J9068J8730q836k6726k5464Q792J4803L028o949L5919O068l8864
$$ -285 24764 43832 62562 53726 27000 1536 10328 25131 28159 21210 57129 63197 24333
8158B4333k8089k2750L6091K5799J8008J4741K0047K3210l905n127k5553N047
$$ 24333 -3756 -26506 9585 35384 53392 68133 88180 111390 107485 102358 76805 81852
8146H1852o149k86l4059o445K0674K0988K271j9646k0481p013k6847J7160K0813
$$ 81852 75703 75417 41358 34913 55587 76575 78846 59200 38719 31706 4859 22019 42832
8133D2832J4208J0887m838K607r613J1096k0069l2935q682j7431K1749K766R333
$$ 42832 57040 67927 63089 65696 56083 67179 47110 14175 5493 -11938 9811 12577 21910
8120B1910O066K3729R316j5220j236n092n521j5570j5923k799j674q325K9004
$$ 21910 27976 51705 61021 45801 44565 39473 33952 18382 2459 -340 -2014 -10339 18665
8107A8665K2573k4487n490J1533K3222L2196J3905p668j9987M543k4484k5711
$$ 18665 41238 16751 11261 22794 46016 78212 92117 84449 64462 69005 44521 18810
8095A8810o139j7261J0192L4620O983j9796O167j4265j4904K6384J2334m630j9585
$$ 18810 12671 -4590 5602 40222 47205 27409 33576 19311 4407 30791 43125 38495 18910
8082A8910k687j636J0766Q082k621P061J5256j0512j0407J5003j46m410k1155
$$ 18910 16223 14587 25353 33435 30814 37875 53131 42619 32212 47215 47069 42659 21504
8069B1504K917k605K4611j1867j8227q298l809Q170J5151L9871k8015j1054J3383
$$ 21504 24421 21816 46427 34560 16333 8035 4226 12396 27547 67418 39403 28349 41732
8056D1732M197m530K072k0530l002M47j6508n456P636N57M379j37J424O100M4630
$$ 41732 45929 41399 43471 22941 19939 20386 3878 -1578 6058 6615 10994 10857 12281 18381 63011
8041F3011J2304k7379l3455p321l627r550K843K176J3754J8036j4945J660j3902
$$ 63011 75315 47936 14481 7160 3533 -6017 -3174 -998 12756 30792 15847 17507 3605
8028C605l952K4347K470J932N254K2507j5926l776J2933P092L459O892M489k0986
$$ 3605 -347 24000 26470 28402 33656 56163 40237 36461 49394 56486 59945 66837 71326 50340
8014E0340j0819o10J1836j9661p744K0527r675j0777L7557P240j2327j04K8329
$$ 50340 39521 38911 50747 31086 23342 43869 34194 23417 60974 68214 55887 55783 84112
8001H4112J0677k9148j2767q71K03O410k10j6433n369L2577p139P981M30q787
$$ 84112 94789 65641 52874 52003 52206 58616 58406 41973 36604 69181 62042 70023 70453 61666
7987F1666j743q58k4345j9377J9389K2191l8609k1419J8824J6538O385o124R016
$$ 61666 59923 59065 34720 15343 34732 56923 18314 -3105 15719 32257 38642 32518 41534
7974D1534J9322M628k8542m0025L669j3004K3194N498l4464K7964O346M500j5149
$$ 41534 60856 65484 36942 -3083 586 -12418 10776 16274 -18190 9774 16120 20620 5471
7961E471k0701l234J5032L4844K5101j252k0232j6430K433O642K6288K1763j2971
$$ 5471 -15230 -18464 -3432 31412 56513 55261 35029 18599 21032 27674 53962 75725 62754
7948F2754j6295J1054k4544k623M800J8955J7113J3165j4565n724m901p679j0369
$$ 62754 46459 57513 32969 30346 35146 54101 71214 84379 69814 64090 59189 51510 41141
7935D1141M484j983l784q963K920J8785N108O779p534J1861J0833M037k2760k0661
$$ 41141 45625 43642 39858 30895 33815 52600 57708 64487 56953 68814 79647 83684 60924 40263
7921D0263o407J0835O432L039R01J3054r626l8728O205j1017m340L3991M432j4662
$$ 40263 33856 44691 51123 54162 55063 68117 58491 19763 25968 14951 10611 44602 49034 34372
7907C4372Q585K6297J1485k5525j0627K245K4963l185K473J1522k3477m694J4339
$$ 34372 42957 69254 80739 55214 44587 46832 71795 68610 71083 82605 59128 54434 68773
7894F8773J1459O114p722Q507j9879k6797P998l803q972k2888k608M1626K9803
$$ 68773 80232 86346 78624 87131 67252 40455 48453 44650 35678 12790 10182 51808 81611
7881H1611q445k9617n731o271J5223r727k4183j9211J9056L4216o308K0545l080
$$ 81611 73166 43549 37818 31547 46770 37043 12860 -6351 12705 46921 40613 61158 58078
7868E8078k3858k4938P146j4174J5071M302K2956j048O441j1497p905j6536j2372
$$ 58078 34220 9282 16428 2254 17325 21627 44583 43535 49976 38479 30574 14038 1666
7855A666R929J4657j3036J8039q43m625j4200j7210P981J9776n724J706R985l3311
$$ 1666 11595 26252 13216 31255 30412 25787 11587 -5623 2358 22134 16410 18116 28101 -5210
7841e210j5210l722L383K9488l967o007o568m40K6285Q508Q917L719J3806k6160
$$ -5210 -20420 -24142 -20759 8729 4762 -1245 -7813 -8253 18032 26540 35457 39176 52982 26822
7827B6822k3417J5914N595r606j4068p177K730n373P694J3744o877m279j0747
$$ 26822 3405 19319 24914 15308 1240 -5937 -3207 -8580 -886 12858 5981 1702 -9045
7814i045k0294R144N725O39J321l782J5399K5705l058M089j9808k1690J894K0781
$$ -9045 -29339 -20195 -14470 -13831 -12510 -16292 -893 24812 21754 25843 6035 -15655 -13761 7020
7800G020o298k5779J1209K3629L73j373O935K0187k102j0813J0195r118j0134
$$ 7020 722 -25057 -13848 9781 10154 8781 15716 35903 33801 22988 33183 24065 13931
7787A3931n551j7002L044J845j5138j9787J9370O939K5849K2840L392j5357k6700
$$ 13931 8380 -8622 -5578 -3733 -18871 -38658 -19288 -12349 13500 36340 39732 24375 -2325
7774b325O18J354q552M455K1843N692l318Q287p47K661j1719k0381K357J1972
$$ -2325 -1707 -353 -8905 -4450 17393 23085 19767 28054 27307 29968 18249 -2132 225 12197
7760A2197o608k096O965J1286J0347q365k2103P100j2240J0523j5219p716Q560
$$ 12197 5589 3493 10458 21744 32091 23726 1623 8723 -3517 7006 -8213 -15929 -7369
7747g369K5682J8574q209L171j2688j869p513r315r791j6012N947j763q383o079
$$ -7369 18313 36887 28678 31849 19161 17292 9779 464 -9327 -25339 -19392 -21155 -29538 -35617
7733c5617o749r601K6520K4818J1737k3024j9679m710J4844k486l24K5558J1340
$$ -35617 -42366 -51967 -25447 -629 11108 -11916 -31595 -36305 -21461 -23947 -24271 1287 12627
7720A2627j4125m04K3314Q316j8059k0627j510J4167j1745J3900Q383m406j3539
$$ 12627 -1498 -1902 21412 29728 11669 -8958 -10468 3699 -8046 5854 14237 9831 -3708
7707c708R732L2881J1658M288k0552k489j3847k5624K4874o675n01p216k0179
$$ -3708 6024 38905 50563 54851 34299 31810 17963 -7661 17213 10538 10037 2821 -17358
7694a7358j499o399m991k853L8022L465o534J2489m361q320J440K1270q711q715
$$ -17358 -18857 -25256 -30247 -33100 4922 8387 1853 14342 9981 1661 3101 24371 15660 6945
7680F945N227j9990J8507M6545j2448p457k0515r019j2054k6220N956L3070K6665
$$ 6945 12172 -7818 10689 57234 44786 37329 16814 7795 -4259 -30479 -24523 8547 35212
7667C5212J1119P497r203J244j3502j9818P622J3567j7878l4903j5352K244J8285
$$ 35212 46331 53828 44625 45869 32367 12549 20171 33738 15860 -19043 -34395 -32151 -13866
7654a3866R209L3818k5528p5L3200J61j435j8062m92P031j7767p60J2500k1461
$$ -13866 -4657 29161 3633 3558 36758 36919 35484 17422 16930 23961 6194 5434 17934 -3527
7640c527m976L148k432K2662k469L368N106r883k923p12o119J7384M445J6504
$$ -3527 -8503 -5355 -7787 14875 12406 15774 20880 10997 8074 7362 1243 18627 23072 39576
7626C9576K1217j9308j9155K1510j2205j8573j0975R935J0429J2564J5114j1060
$$ 39576 60793 41485 22330 43840 31635 13062 2087 12022 22451 35015 50129 39069
7614C9069k7459p25J189j9804M6q739J9369K8554M170m434k7066o042j9145N717
$$ 39069 11610 10885 12074 -7730 -7684 -16423 2946 31500 35670 31236 4170 -1872 -21017 -15300
7600a5300j264O709K011n106r653N718J5809K37J653l4892j462J0521K6591j9651
$$ -15300 -16564 -9855 -7844 -12950 -22603 -16885 -1076 -839 814 -34078 -35540 -25019 1572 -18079
7586a8079l1329p282L4424K1519J7473j8808L345K423n363r205R922J0215K109
$$ -18079 -49408 -56690 -22266 -747 16726 -2082 1263 3686 -1677 -10882 -960 9255 11364
7573A1364j5217l882O79J2076n072Q003Q739J5896k0488k8431q941J4725P700
$$ 11364 -3853 -7735 -7056 5020 -52 7951 16690 32586 12098 -16333 -25274 -10549 -2849
7560b849m177j5437K3024K1177r222j0923N228J511l257o63J2954q390j2800M501
$$ -2849 -7026 -22463 561 21738 12516 1593 6821 8332 5075 4412 17366 8976 -3824 677
7546F77j0428j7900j2469j4963J8299M7467J9172M491M46r566L420K0736J6549
$$ 677 -9751 -27651 -40120 -55083 -36784 10683 29855 34346 34792 25226 28646 49382 65931
7533F5931l9383j5952o19k8933o792J9992Q665J1656p555q644P318L1246q991
$$ 65931 26548 10596 9977 -18956 -25748 -5756 2909 14565 7010 -1634 5684 36930 27939
7520B7939l5094k265K187J3018L818P90k2522j6651j337K6070M08j7580k1855
$$ 27939 -7155 -9420 -7233 5785 9603 10393 -12129 -28780 -30117 -4047 -3639 -21219 -43074
7507d3074J6031J285K7988M1218K032m024l318j9729r299k6293J1701K0264O453
$$ -43074 -27043 -25758 2230 43448 45480 41456 38138 18409 9110 -17183 -5482 14782 21235
7494B1235P972j3848k870l310j2665p991N713m985J1663J8557k3550n567q991
$$ 21235 29207 15359 12489 9179 -3486 -11477 -5764 -10749 914 19471 -4079 -9646 -18637
7481a8637j8845J7805j2225m146J0507K3752J2860J5924J3974j9813j9961k252
$$ -18637 -37482 -19677 -31902 -36048 -25541 -1789 11071 26995 40969 21156 1195 -1057
7469a057N614P144N243j5533j7892N247J7570J1245q922k9428q003J2369L148
$$ -1057 4557 11701 16944 1411 -16481 -11234 6336 17581 8659 -20769 -28772 -16403 -13255
7456a3255j9712j5443K5980j0863j5424P528K2136L2730N910j2085j8435n103
$$ -13255 -32967 -48410 -22430 -33293 -48717 -41189 -19053 13677 19587 7502 -10933 -16036
7444a6036k04p232P627M250J0087K5491K9275J6613k171l0696k4285j6969J9797
$$ -16036 -16240 -23472 -15845 -11595 -1508 23983 53258 69871 67700 37004 12719 -4250 15547
7431A5547k559k3779M667K1528j196L289R674k2167q809n615o114k0252K371R846
$$ 15547 12988 -10791 -6124 15404 14208 17497 27171 5004 -3805 -9420 -15534 -35786 -33415 -23569
7417b3569K8277K1673m569m190M755Q041o252p534j2692l060K1151N339r240k19
$$ -23569 4708 26381 21812 17622 22377 30418 24166 16632 3940 880 22031 27370 18130 17911
7403A7911l025j707q403j109K1747r653k3075j6489J5271K4333J9657J1788k0109
$$ 17911 14886 13179 4776 3667 25414 15761 -7314 -23803 -8532 15801 35458 47246 27137
7390B7137k4783n951O315J8881O308l203k0806r950J3953J257J7570p898k871
$$ 27137 2354 -3597 2718 21599 27907 24704 3898 -6052 7901 9158 26728 18830 15959
7377A5959Q559l355k0454j825N682k4447J5243L3863j0945j8222N719j2328K294
$$ 15959 24518 21163 709 -1116 4566 -19881 -4638 29225 18280 58 5777 -6551 -4257
7364d257J5196j0314L0961J68m062k2378j485K6524J3218j1157m692p179k2790
$$ -4257 10939 625 31586 31754 27692 5314 3829 30353 43571 32414 27722 20543 -2247
7351b247k0834k2293m078K7595L5016k255k0835r053j0511R947j5341J4280L3243
$$ -2247 -23081 -45374 -49452 -21857 13159 10904 -9931 -18984 -29495 -19548 -34889 -20609 12634
7338A2634P913M333j1611k0466j8599J3929l80K176q95J39L68P21j8101l6518
$$ 12634 20547 24880 13269 -7197 -25796 -11867 -12247 -10071 -10966 -10827 -10459 -9738 -27839 -64357
7324f4357j876L3082K4350p37l0687Q015P845J4115j0653J5869N017P197l408
$$ -64357 -66233 -33151 -8801 -9538 -40225 -32210 -24365 -10250 -20903 -5034 -17 7180 3772
7311C772J8958R298k5119l2749N150L1199L271n362p198J8793J3351k0248k625
$$ 3772 22730 32028 6909 -25840 -20690 10509 13780 8418 1220 20013 33364 13116 10491
7298A0491L930k110L631j2593l0231M0222K1444m155p880P163j8510k6918m247
$$ 10491 14421 12311 15942 3349 -26882 13340 34784 30629 22749 29912 11402 -15516 -19763
7285a9763j0079J386N3527K1888O209O324j7620J952m286r217Q395j0278q244
$$ -19763 -29842 -28456 25071 46959 53168 59492 41872 43824 39538 30321 38716 28438 20194
7272B0194M917J328J6344M218j6010l640P029j279L920J6993n762k0174j0644
$$ 20194 25111 26439 42783 47001 30991 27351 34380 33101 37021 54014 48252 28078 17434
7259A7434J5437r348k1616J565K4285Q313m2146K34O296J5774j681j5350j7565
$$ 17434 32871 23523 1907 3472 27757 36070 -6076 -5842 454 16228 14547 -803 -18368
7246a8368o599j909P853K8187J4279p785K5585l456j4181j2650l7219j6532J0642
$$ -18368 -24967 -26876 -19023 9164 23443 15658 41243 37787 23606 10956 -26263 -42795 -32153
7233c2153K4018J8447n90k145p285J4366K363j7286l3720k7198J8710K0790L2995
$$ -32153 -8135 10312 9722 7577 292 14658 17021 -265 -33985 -61183 -42473 -21683 11312
7220A1312J6429n961N38R502n79j5303L615M402P089J1257j6790o958J7829N498
$$ 11312 27741 21780 22318 31820 31241 15938 19553 23955 31044 42301 25511 18553 36382 41880
7206D1880m372l763P103J8153j2177J0232J3890j7224k2550j2923m90J906J0184
$$ 41880 37508 33745 40848 59001 46824 57056 70946 53722 31172 18249 17759 19665 29849
7193B9849k2786k4506M87j423K5710p577j9851L930J2112k126J5750K8539q436
$$ 29849 7063 -17443 -16956 -18379 7331 -246 -20097 -16167 -4055 -6181 9569 38108 29672
7180B9672k6429k1658O949N677K8276J7261j2719n775j8662k6203m8306J8316
$$ 29672 3243 -18415 -11466 -5789 22487 39748 27029 21254 2592 -23611 -71917 -53601
7168e3601J9657J7082r171k2244L5813K4476k6976p174K3908L390P950j7756l0547
$$ -53601 -33944 -16862 -26033 -48277 -12464 12012 -14964 -22138 1770 5160 13110 -4646 -35193
7155c5193k491J8206J9137O764l695m249k9546j1884J5718J2148J4512N492j179
$$ -35193 -37684 -19478 -341 6423 2728 -1521 -31067 -42951 -27233 -15085 -573 4919 3740
7142C740K539j6821M888j212M1093j0389k8606L746J80J885j9282M040j1507j8405
$$ 3740 6279 -10542 -5654 -6866 34227 23838 -4768 -1022 -842 1043 -18239 -14199 -25706 -44111
7128d4111K174J6280J8145J8921Q266P495N426l539J9971J3457k5299k0223p737
$$ -44111 -41937 -25657 -7512 11409 19675 27170 32596 29057 49028 62485 37186 16963 9226
7115I226j3008K2449k759J4210j1860K3253J367k5436p077n122j278l0114j2123
$$ 9226 -3782 18667 15908 30118 18258 41511 42878 17442 10365 5243 3965 -26149 -38272
7102c8272L715J0524k2879r91K1183L7961K0285P880k073J9341P843k5953j3935
$$ -38272 -34557 -24033 -46912 -47903 -26720 11241 31526 39406 37333 56674 64517 38564 24629
7089B4629j0903j3188o727K6836L2804N019j3478k8429J848K0449m921j2597J3299
$$ 24629 13726 538 -6189 20647 53451 58470 44992 16563 18411 38860 33939 21342 34641
7076C4641Q29j9320j9148r731O343K5407R863J8548j6940l4636j1815J9959j115
$$ 34641 35470 16150 -2998 -12729 -6386 19021 28884 47432 30492 -4144 -15959 4000 2885
7063B885j0626J0100J2864J4301J0182k1995M54l835j4452j5603l649J1343N046
$$ 2885 -7741 2359 15223 29524 39706 17711 18165 14330 -122 -15725 -19374 -8031 -2985
7050b985K2639J1277r376J3616k029n153J0933j1958l188j6345j9847P261l280
$$ -2985 19654 30931 21555 35171 33142 27989 38922 26964 23776 7431 -12416 -5155 -8435
7037h435k0707k2353K5618L627p244q996R005P102L830J4868J8003J5523N801
$$ -8435 -29142 -51495 -25877 -22250 -29494 -38490 -29485 -22383 -18553 -3685 14318 29841 35642
7024C5642J542j1361k1894j4847J3478O660K1480Q836n782L648j6050q55J553
$$ 35642 37184 25823 3929 -10918 2560 9220 30700 39536 33754 37402 21352 20497 22050
7011B2050j7995j9535Q283q65j068j0710q483l838j8253j005J3046k777o958M833
$$ 22050 4055 -15480 -7197 -8062 -9130 -19840 -28323 -32161 -50414 -51419 -38373 -41150 -48108 -43275
6997d3275J0454l0786o106L0340K7270K3628R959k2184p327j3261J3800J589N68
$$ -43275 -32821 -63607 -69713 -39373 -12103 11525 21484 -700 -8027 -21288 -7488 -5899 -5331
6984e331K9759J5156j2562j1136p494M398J276q292q793j157L587J1373L1421
$$ -5331 24428 39584 27022 15886 8392 12790 14066 5774 -3019 -4176 -589 10784 42205
6971D2205J5706l0154l5727L0566K3210m553j7136l016J0201p271j040k1684k0052
$$ 42205 57911 27757 -7970 22596 45806 41253 24117 21101 31302 24031 22991 1307 -18745
6958a8745l782K1621R884l885K6K6045j111r331j8140K0880o074j0023j5471J5415
$$ -18745 -22527 -906 8978 5093 5119 31164 30053 20722 2582 23462 17388 7365 -8106 7309
6944G309Q051Q566K4613Q158l0716l8592K4930K4955j6604K50K4212L759l0799
$$ 7309 15360 23926 48539 56697 25981 -12611 12319 37274 20670 20920 45132 48891 18092
6931A8092l5688l088K1328K9958K6170p709j7599M043j8123n103r96k790m180
$$ 18092 -17596 -20684 644 30602 56772 49063 31464 35507 17384 12281 11285 8495 4315
6918D315j6819J6634J2309J2860J6295P034n624l1691j0957J6254Q290j7192n017
$$ 4315 -12504 4130 16439 29299 45594 52628 47004 15313 4356 20610 28900 11708 6691
6905F691p604K2545o837k2270n220J5369R839n108j5890j197K1413P170j4134
$$ 6691 -913 21632 14795 -7475 -12695 2674 12513 7405 -8485 -9682 11731 18901 4767
6892D767j6214j6467j275j252P343N331j0840o819J2413k02M391J2267j1352R929
$$ 4767 -11447 -27914 -29189 -30441 -23098 -17767 -28607 -35426 -23013 -23215 -18824 -6557 -17909 -7980
6878g980K396J9617L571k586q705k7189O644K1433J2628J889j7794m065k440J1154
$$ -7980 -5584 14033 17604 15018 6313 -20876 -14232 7201 19829 21718 3924 -141 -2581 8573
6864H573N984j3231j2132o575o492R267J2415Q716p627j0074J658q170q111P196
$$ 8573 14557 1326 -10806 -17381 -23873 -14606 -2191 6525 -1102 -11176 -9518 -17688 -25799 -18603
6850a8603K1162j3244j4981J3117Q166J6669l0746o806m790K2962K9101l262j8325
$$ -18603 2559 -10685 -25666 -12549 -4383 12286 -18460 -25266 -30056 -7094 22007 18745 420
6837D20J252R894J6976M6438j0327n588q439j8416j2456j782j7123M60J5218l4150
$$ 420 1672 11566 28542 74980 64653 59065 50626 32210 19754 17972 849 1309 16527 -17623
6823a7623m68K4807J1539R549j7087j9848J923m527J3357K5733J0021k7278j3537
$$ -17623 -18091 6716 18255 27804 10717 -9131 -7208 -11735 1622 27355 37376 10098 -3439
6810c439k7777J4789J6369P589J0461q559J0262k192j3565l2039k7814m120J3110
$$ -3439 -31216 -16427 -58 7531 17992 9433 19695 17503 3938 -28101 -55915 -60035 -46925
6797d6925J0849J974K2193L5095M829R198J650j3705r432J567K1136p096j2055
$$ -46925 -36076 -34102 -11909 23186 28015 37213 38863 25158 15726 17293 38429 31333 19278
6784A9278M49J625J6782j0014k4592j0759m770o840j9096Q39J4150J0968K9197
$$ 19278 19727 21352 38134 28120 3528 -7231 -12001 -18841 -37937 -37098 -22948 -11980 17217
6771A7217O229K188J4451j7627j0859j5398n748j743K0351J525l0893j2369K6051
$$ 17217 23446 25634 40085 22458 11599 -3799 -9547 -11290 9061 10586 -20307 -32676 -6625
6758f625J1955N654k4322j7009J823J9877J9378Q602k050l307K8030p994q580
$$ -6625 5330 10984 -13338 -30347 -28524 -8647 10731 19333 17283 13976 42006 34012 25432
6745B5432K804K41J8937J5066K2212K4653P869j2600k853j04R600J147j1598j740
$$ 25432 28236 28477 47414 62480 84692 109345 117214 104614 101761 101657 111257 112404 100806 99066
6731I9066L4379M4108M3960J7514K5344L1047N2969N3975P6368J48649K16303
$$ 99066 133445 177553 221513 239027 264371 295418 348387 402362 478730 627379 843682
6720H43682K63798L87204M97641N89244M50955j5413n36114p01216n13043l13388
$$ 843682 1107480 1494684 1992325 2581569 3032524 3017111 2480997 1779781 1266738 953350
6710I53350j92644j19312j05246o3222n3303n5056n1355j5922j6877q293p56k5319
$$ 953350 760706 641394 536148 472926 419623 364567 313212 297290 280413 272120 271364 246045
6698B46045k1734K2266K7091o794J837J6753k0388k6982k7209k3250k9087k29
$$ 246045 224311 246577 273668 266874 268711 285464 265076 238094 210885 187635 158548 158319
6686A58319j0641l2963o402K2781k4671J0213k311N927j082k1501j9597p076j2845
$$ 158319 147678 114715 108313 131094 106423 116636 114325 120252 119170 97669 78072 70996 58151
6673E8151p738p121J0906K0681j439J1955j8395K312R613j988O745n468l3477
$$ 58151 50413 43292 54198 74879 73440 85395 67000 69312 78925 76937 83682 78214 44737
6660D4737q628R602j4888k822j7976R877o434R4l45O961J3253N471J5812R755
$$ 44737 36109 45711 30823 28001 10025 19902 13468 13562 13217 20178 33431 38902 54714 64469
6646F4469k4352k3381L661j0394K5510M4099l593j142q397j7824k3199l05k5934
$$ 64469 40117 16736 20397 10003 35513 79612 76019 74877 66480 48656 25457 25152 -782
6633g82J1228L1612J8268q625k4584j1421r12p35J4428M535p017k2807k616J2123
$$ -782 10446 42058 60326 51701 27117 15696 14784 14049 28477 33012 25995 3188 572 12695
6619A2695J5152J6373j6913M65k4388l0965K664R678K5580j5501k6198K5445M451
$$ 12695 27847 44220 27307 27772 3384 -27581 -24917 -15239 10341 -5160 -31358 -5913 -1462
6606a462j6551j1007K0645k585q261o71K975j5157q085J0936L3005j7179R03J1167
$$ -1462 -18013 -29020 -8375 -10960 -19221 -19892 -16917 -32074 -40159 -29223 3782 -13397 -12494 -1327
6592a327k4893k0268J6314L8101K7575K691j9093j6188l2393k629L5255N97l1082
$$ -1327 -26220 -46488 -30174 7927 35502 38193 19100 2912 -29481 -32110 3145 3742 -27340
6579b7340j14J3501K5956p050q194j6836j6762M0246m576r987J704j921K4695
$$ -27340 -27454 -13953 12003 4953 -3241 -20077 -36839 3407 -1169 -11156 -9452 -11373 13322
6566A3322K097j6865j6420J6121J6423K5435p286m920j125j3301j7581M881k456
$$ 13322 15419 -1446 -17866 -1745 14678 40113 32827 27907 26782 13481 -4100 781 -1675
6553a675q419r521M076K5308J0742j757O89O444J4482M272j2771k5849n390j970
$$ -1675 -10094 -19615 -15539 9769 20511 18754 19443 25887 40369 44641 31870 6021 631 -1339
6539a339J3718K8760L454j8956r879k5570j831J0057r324Q235K6208k7657q870
$$ -1339 12379 41139 44593 25637 15758 -9812 -11643 -1586 -10910 -2675 23533 -4124 -12994
6526a2994J3862r404K9280Q385k823l9995j3815K2414J8101R296M89J3389j5622
$$ -12994 868 -8536 20744 29129 26306 -13689 -27504 -5090 13011 22307 22796 36185 20563
6513B0563O431j0781k6532r73K493l065M922p072K257J1079R608j2666k6620K1388
$$ 20563 26994 16213 -10319 -11292 -8799 -11864 -6942 -14014 -11757 -678 8930 -3736 -30356 -8968
6499h968m35J570M5134R609R755p953k1225j6426j7026j555q160K273J2424l829
$$ -8968 -9403 -7833 37301 46910 56665 48712 27487 11061 -5965 -7520 -15680 -13407 -983 -4812
6485d812j5770J0261K849O325j2339j4078M240k0160K6874L3911K4964l4055k4625
$$ -4812 -20582 -10321 -7472 -1147 -13486 -27564 -23324 -43484 -16610 17301 42265 8210 -16415
6472a6415j3851J3908j3818j6401J3797L0928J560q191Q13k68j0086j6052J0224
$$ -16415 -30266 -16358 -30176 -46577 -32780 -1852 -292 -8483 -7670 -7938 -18024 -34076 -23852
6459b3852J8739j744j518j1136K5393K4936j1905j3106p197j8524l073K0811O978
$$ -23852 -5113 -6857 -8375 -19511 5882 30818 18913 5807 -1390 -19914 -22987 -2176 4802
6446D802J2787O78J5644j5296k9784j2236j6861O997J6914p962O992M2974J4260
$$ 4802 17589 18267 33911 18615 -11169 -23405 -40266 -33269 -16355 -24317 -17325 25649 39909
6433C9909M087M030K892o504J3912O582l368n3814k0875R920P11J7422J4755j2488
$$ 39909 43996 48026 50918 44414 58326 64908 61540 7726 -13149 -3229 -2518 14904 29659 17171
6419A7171n360O597J1704l9062k4492O86K4529K1309K4044R779j2432N90o233
$$ 17171 11811 18408 30112 -8950 -33442 -32756 -8227 13082 37126 46905 34473 35063 28830
6406B8830l17j2797j3317q381K1642K7652n710j6126k8995J0102J6797j46k9694
$$ 28830 28513 15716 2399 -5982 15660 43312 37602 21476 -7519 2583 19380 19234 -10460
6393a0460J6067J5604k942r956P425k0320j9135J9042J053o050K6130k083k5174
$$ -10460 5607 21211 18269 8313 15738 -4582 -23717 -4675 -3622 -9672 16458 14375 -10799
6380a0799P643K0600j1632p759J6168l969k3634P943m066k025n519j780k5233
$$ -10799 -3156 17444 5812 -1947 14221 10252 -13382 -5439 -9505 -11530 -17049 -18829 -44062
6367d4062l054P620O133M0081K9422J481K093j7462l5034m762l66j4342j7620
$$ -44062 -47116 -39496 -33363 6718 36140 37621 39714 22252 -12782 -17544 -17910 -32252 -49872
6354d9872L602J5897L6989L3327o070k4116j0576M996K693j9217K1365J6184J785
$$ -49872 -46270 -30373 6616 39943 33873 9757 -819 4177 6870 -12347 9018 25202 26987
6341B6987o915n425n136M384J1231O193O06j7931K3971P810k741o161j972j6357
$$ 26987 20072 14647 9511 13895 25126 31319 31925 13994 37965 45775 43034 36873 34901 18544
6327A8544r824Q958K5179N518p656l7993q205M397k419r279j4904J662j579P622
$$ 18544 8720 17678 42857 48375 40719 2726 -5479 -1082 -3501 -12780 -27684 -26022 -27601 -19979
6313a9979j6933l557J6992J8130K5564R338k4391k7246L6479K9226j8927n6469
$$ -19979 -36912 -40469 -23477 -5347 20217 29555 5164 -22082 14397 43623 24696 -31773
6301c1773M054K3208L642J5865P009J6463m971j3311M230o150O138R947q104j2403
$$ -31773 -27719 -4511 -869 14996 22005 38468 33497 20186 24416 18266 24404 34351 26247 13844
6287A3844n256j6386J846J4870O802O074j3914R516k4174l67L937q195o328m2416
$$ 13844 8588 -7798 -5952 8918 15720 21794 7880 17396 -6778 -7145 -3208 -11403 -17731 -60147
6273f0147J6719n353L0179Q34j8573r258J9546j5512J2870Q24j507J6987R758
$$ -60147 -43428 -48781 -18602 -17768 -36341 -45599 -26053 -41565 -28695 -27871 -29378 -12391 -2633
6260b633N262k0280j8054J2194K7302K5343n234M207l291k6487l1045n163O584
$$ -2633 2629 -17651 -35705 -23511 3791 29134 23900 28107 24816 -1671 -32716 -37879 -31295
6247c1295J411j0821L978L7137j0183N651k7824j0582O339l354J9633J9616l82
$$ -31295 -29884 -40705 -36727 410 -9773 -4122 -31946 -42528 -36189 -39543 -19910 -294 -676
6234f76l7422k3979K7693K3186J1671K1022p32j6340j1911k692n483J3676p975
$$ -676 -38098 -62077 -34384 -11198 473 21495 20763 4423 -7488 -10180 -15663 -1987 -9962
6221i962k0474O866J6715n714j384k194J5375J9236q3P51k4345k9694J2900K7301
$$ -9962 -30436 -23570 -6855 -12569 -13953 -16147 -772 18464 18381 19132 -5213 -34907 -22007 5294
6207E294K8889J6959j6534k1146O13j3097j3070N208J6510J3995M924p385k637
$$ 5294 34183 51142 34608 13462 14075 978 -12092 -6884 9626 23621 28545 21160 18523
6194A8523j79l2385j7948j859r03J6599N275K5511L9350j1033k1085k355p940
$$ 18523 18344 -14041 -31989 -33848 -34751 -18152 -12877 12634 51984 40951 19866 17511 9571
6181I571o604p622R043Q888j8997j0622K3513K3552l09k6812p578n302j4369P950
$$ 9571 2967 -4655 4388 13276 -5721 -16343 7170 30722 30413 3601 -3977 -9279 -23648 -15698
6167a5698K1821J3600q540j146j527o300l29L3160j0623k280K0115L185K812j8994
$$ -15698 6123 19723 11183 10037 8510 2210 1881 35041 24418 22138 42253 45438 48250 29256
6153B9256j5602j1330o251R419L2156n524k1909j7924l1429L883m49j118L0309
$$ 29256 13654 2324 -3927 5492 37648 32124 10215 -7709 -39138 -35255 -35704 -36822 -6513
6140f513J1747j4918P113L256k1684O59K8018J3638j0794k2860k2075l514J7893
$$ -6513 5234 -9684 -2571 685 -20999 -20340 7678 21316 10522 -12338 -34413 -37927 -20034
6127b0034J2976J980p646j3205j3457O158L5020J6565J5753j726k1868l2275l467
$$ -20034 -7058 -5078 -12724 -25929 -39386 -33228 1792 18357 34110 32384 10516 -21759 -25226
6114b5226o870j4185Q595J3111m327J5355M5203J0953j9748r939L167p623k6497
$$ -25226 -32096 -46281 -37686 -24575 -28902 -13547 31656 42609 22861 12922 16089 8466 -18031
6101a8031L682k453K8279K4466k4940l8653R751K0024r20l50K0136K6688k8370
$$ -18031 -14349 -16802 11477 35943 11003 -27650 -17899 2125 1205 855 20991 47679 19309
6088A9309J167P713o124j5823r11n29K939O120J077N677j0870o30r860j1158j0291
$$ 19309 20476 28189 22065 6242 5331 4802 7741 13861 14938 20615 9745 9115 -745 -11903 -22194
6073b2194j6357l06J8070P063J8362J815Q594J613n742l892o599j0899K4951l600
$$ -22194 -38551 -38857 -20787 -13724 4638 6453 15047 16660 10918 7026 427 -10472 14479 10879
6059A0879J3057j4906n276M632J1415K909o109k931m5359l7382J1989J8880K1957
$$ 10879 23936 9030 3754 8386 19801 22710 16601 13670 -31689 -69071 -57082 -38202 -16245
6046a6245J1160J2654n158j7949j2053J5233k2805k1782j8443J2434L9155K6632
$$ -16245 -5085 7569 2411 -15538 -27591 -12358 -35163 -56945 -75388 -62954 -23799 2833
6034B833J8402n013p786j1248L2326p135l0778m474n116L960K7405k5417j0735
$$ 2833 21235 16222 8436 -2812 29514 22379 -8399 -12873 -17989 -14029 13376 -12041 -22776
6021b2776J3409N521k401J4035K3973P551Q742N957k7225J2185M960k6947j6936
$$ -22776 -9367 -3846 -6247 7788 31761 39312 48054 54011 26786 38971 43931 16984 48
6008D8n132q38j6977J7797K4743j6116q465j5763q11K6465J6973j3230j4985j2914
$$ 48 -5084 -5922 -22899 -5102 19641 3525 -4940 -20703 -21514 4951 21924 8694 -6291 -19205
5994a9205j1872j4851l2822J6953R611j9974J1527J8058K7153L430l172k1856
$$ -19205 -31077 -45928 -78750 -61797 -52186 -72160 -60633 -42575 -15422 -11992 -15164 -37020
5982c7020K7265J6288J3645N910j4136j3317J17J7276j4071j2907k236l007p968
$$ -37020 -9755 6533 20178 26088 11952 -1365 -1248 16028 1957 -10950 -13186 -16193 -24161
5969b4161r066j4687K2632J9637n710J5288K1308R95L635J0387K0309J1089k723
$$ -24161 -33227 -47914 -25282 -5645 -11355 3933 25241 26236 29871 40258 60567 71656 68933
5956F8933k5400j7776j6284m653j1015o762J7847j4348q796j657k928J7111J0011
$$ 68933 43533 25757 9473 4820 -6195 -12957 4890 -9458 -18254 -19911 -22839 -5728 4283
5943D283n283K709q991r062P39J4102K7164k0698l7366Q106J0914J7528n831k466
$$ 4283 -1000 1709 -7282 -16344 -15605 -1503 25661 4963 -32403 -24297 -13383 4145 -1686 -4152
5929d152K3019K7499P746J3100L185J318k5898j6949j2749J147p699L6565O38
$$ -4152 18867 46366 54112 67212 70397 71715 45817 28868 16119 17266 9567 46132 46770
5916D6770j0811r668r768j4694j2270m14j1048M834O05k313O640N907k63p501
$$ 46770 35959 26291 16523 1829 -10441 -10855 -21903 -17069 -16464 -18777 -12137 -6230 -6493 -13994
5902a3994j2078N054j417K747j734R423J9294R625l7203o838J728L0793J8784
$$ -13994 -26072 -21018 -22435 -19688 -21422 -11999 7295 16920 -20283 -27121 -25393 5400 24184
5889B4184n115l108K1228j7969l1532m0024n039K8580J9281J8148K6945j0718
$$ 24184 19069 15961 37189 19220 -12312 -52336 -57375 -28795 -9514 8634 35579 24861
5877B4861l2355q905L042K3397l45k0680j7551K2710P010j9433j0365J2301k740
$$ 24861 -7494 -16399 -13357 10040 9695 -10985 -28536 -5826 1184 -18249 -28614 -16313 -19053
5864a9053j3158l471J1444J8388N137M889j283j6097j298J846r677J2163P922
$$ -19053 -32211 -35682 -24238 -5850 -713 4176 2893 -13204 -14502 -12656 -22333 -10170 -2248
5851b248n896r902K8264q124l4283j1819J7678K3226J0658J09l2301l333J4440
$$ -2248 -8144 -18046 10218 2094 -32189 -44008 -26330 -3104 7554 7663 -24638 -27971 -13531
5838a3531O866r931j5665k507m697j3512K0853R637N325q110P756j1265L610J1291
$$ -13531 -6665 -16596 -32261 -34768 -39465 -52977 -32124 -22487 -17162 -25272 -17516 -28781 -25171 -13880
5824a3880K1223l674p622j1550j4800K8456J001o064J1159K6295P127J0439N182
$$ -13880 7343 3669 -3953 -15503 -30303 -1847 -846 -6910 4249 30544 37671 48110 53292
5811E3292m0488j1594k774l4173L182J6340J7305K0508M261n679j9003j9509r635
$$ 53292 12804 1210 -1564 -35737 -32555 -16215 1090 21598 25859 20180 1177 -18332 -27967
5798b7967n060r863M046N54j6445P684K7565j860j5279j3275K1766M664j9305
$$ -27967 -33027 -42890 -38844 -38290 -54735 -47051 -19486 -21346 -36625 -49900 -28134 -23470 -42775
5785d2775j0557R214j1904p242K2257J0354K0106J7318N041J5250o95j9642k2904
$$ -42775 -53332 -44118 -56022 -63264 -41007 -30653 -10547 6771 11812 27062 26367 6725 -16179
5772a6179j1717l127p833p476N065R79N194J778r42k703K5293M845k944J3903
$$ -16179 -27896 -31023 -38856 -46332 -41267 -40288 -35094 -33316 -34258 -36961 -11668 -6823 -9767 4136
5758D136N790R541j2846M661J4418k394j3053J701j2405m972J1263K8344j5925
$$ 4136 9926 19467 6621 11282 25700 23306 10253 11954 -451 -5423 5840 34184 18259
5745A8259j0162k5796k7331J0270O128J1365L22k014M667O920R299J1014L4278
$$ 18259 8097 -17699 -45030 -34760 -28632 -17267 -16945 -18959 -14292 -7372 1927 12941 47219
5732D7219j2074o189j316k4756j7404P694K543r660l0788l827J338L401k1217
$$ 47219 35145 28956 27640 2884 -14520 -6826 -4283 -13943 -44731 -48558 -47220 -43819 -65036
5719f5036j2436J0355K9025k516L826J0958n707J9421K9988l812k0741j4331j562
$$ -65036 -77472 -67117 -38092 -40608 -36782 -25824 -31531 -12110 17878 14066 -6675 -21006 -22568
5706b2568m605K8040q615p924K811J6571l840p680P677j1281K657l336J3836K3994
$$ -22568 -27173 867 -7748 -15672 -12861 3710 -130 -7810 -133 -11414 -8757 -12093 1743 25737
5692B5737J6799J774j4747m979r275k422l4851p288K7840K3965l199k4640j0216
$$ 25737 42536 44310 29563 24584 15309 12887 -21964 -29252 -1412 22553 19354 -5286 -15502
5679a5502P634Q825K6918J1262O908K4209n698j9785j8768j8045m720p522k8690
$$ -15502 -7868 957 27875 39137 46045 70254 64556 44771 26003 7958 3238 -4284 -32974
5666c2974o037J0807J0946J0310M1361Q489k6396j0395J1742J4693P990j2721
$$ -32974 -39011 -28204 -17258 -6948 34413 42902 16506 6111 17853 32546 40536 27815
5654B7815j8349j6503j0491j1149q675J2778L8698j1052j2400k5124J8032K0296
$$ 27815 9466 -7037 -17528 -28677 -37352 -24574 14124 3072 -9328 -34452 -16420 3876
5642C876p114K5403J0007k6547k6691L141K6988j3085r67J9850K112M396m6k2153
$$ 3876 -3238 22165 32172 5625 -21066 -17925 9063 -4022 -4989 14861 16973 21369 21323 -830
5628h30n060l7903j3236K8169M5703J2748k2190j4004j4070o817J8782J1946K3922
$$ -830 -5890 -43793 -57029 -28860 16843 29591 7401 -6603 -20673 -27490 -8708 3238 27160
5615B7160j7723M94p736O703p565j7661k2487j3685M2056K0442p240k6016j5404
$$ 27160 9437 9931 2195 8898 1333 -16328 -38815 -52500 -10444 9998 2758 -23258 -38662
5602c8662J6460N401J2300J9371J4463o435K263J270L666M017p744j055O257J2930
$$ -38662 -22202 -16801 -4501 14870 29333 22898 25161 26431 30097 34114 26370 25315 31572 44502
5588D4502j3735n802L883J3306j7653l1660L429J391Q821R466j4461J3419l329
$$ 44502 30767 24965 28848 42154 24501 -7159 -3730 -2339 6482 15948 1487 14906 11577
5575A1577o469j6734k1583R063J2573q432l956K0769K194k2219K0796R41K60J031
$$ 11577 5108 -11626 -33209 -24146 -11573 -20005 -23961 -3192 -998 -23217 -2421 -1480 -1220 -189
5561a89k8579l0344q651K6599L9400j4588k7155P910K1906J9974j5303o004L698
$$ -189 -28768 -59112 -67763 -41164 -1764 -16352 -43507 -35597 -13691 6283 -9020 -15024 -11326
5548a1326N64j2148J0850j784n273L0387J853o625j1078j0143k4237j2414J6993
$$ -11326 -10762 -22910 -12060 -13844 -19117 11270 13123 6498 -4580 -14723 -38960 -51374 -34381
5535c4381J4416K8847N9K30j1253j9495R517J2249J520l9405j3937L9008L2229
$$ -34381 -19965 8882 8941 9171 -2082 -21577 -12060 189 1709 -37696 -51633 -12625 19604
5522A9604J0344k7571j4148J1594J2926r955M835P988K285k5304k8900K4269M253
$$ 19604 29948 2377 -11771 -177 12749 2794 7629 15617 17902 -7402 -36302 -12033 -7780
5509g780n456k625L64p968J609j8364L0121L5904L4120R096k5719j3197k1239
$$ -7780 -13236 -15861 -15497 -23465 -21856 -40220 -10099 25805 59925 69021 43302 30105 8866
5496H866k0929q279O80j117J7394R346K536k1105k488L1552K0336j8987k7639
$$ 8866 -12063 -20342 -19662 -20779 -3385 5961 8497 -12608 -15096 16456 36792 17805 -9834
5483i834j570k5820K8866K6464j9126l2480j1128l9J2428J3588j340j325N516
$$ -9834 -11404 -37224 -8358 18106 -1020 -33500 -44628 -44667 -32239 -18651 -19991 -21316 -15800
5470a5800L724p308o738j1677K4033J9551p915k023j7010j4494J9526K2956J3377
$$ -15800 -12076 -19384 -26122 -37799 -13766 5785 -2130 -4153 -21163 -35657 -16131 6825 20202
5457B0202j8770r902L4060O011j3013k261k3497r570K462J9758K2655k596o417
$$ 20202 1432 -8470 25590 31601 18588 16327 -7170 -16740 -14278 5480 28135 25539 19122
5444A9122j0611M247n75m784k4936m714Q150k1863n878J7100K3142J2436K3508
$$ 19122 8511 12758 12183 7399 -17537 -22251 -14101 -35964 -41842 -24742 -1600 10836 34344
5431C4344P828m221m569p823N05l024j9926m535J1578J6018K062k3997j9664K7360
$$ 34344 42172 37951 33382 25559 26064 23040 3114 -1421 10157 26175 28237 4240 -15424 11936
5417A1936K0559j3996k603P919j527l6384l4335P628K0273J0023n50M7632O404
$$ 11936 32495 18499 15896 23815 22288 -14096 -48431 -40803 -20530 -10507 -11057 36575 42979
5404D2979o548j8207j1283l151r300O583k35j9339q030j8790K8255K6363j7589
$$ 42979 36431 18224 6941 3790 -5510 1073 838 -18501 -26531 -45321 -17066 9297 -8292
5391h292k2840p014m870o136n236J1348M5284L0318R957j1785k3681k4951J7986
$$ -8292 -31132 -38146 -43016 -49152 -54388 -43040 2244 32562 42519 30734 7053 -17898 88
5378H8j1379m7427k6414J5858J4798R675j6358m043P074L2862J3034j8383j0763
$$ 88 -11291 -58718 -85132 -69274 -54476 -44801 -61159 -65202 -58128 -25266 -12232 -30615 -41378
5365d1378K3522J742N577k0849k6053J9435K8190j4894j8971R842J5497J7579
$$ -41378 -17856 -16114 -10537 -31386 -57439 -38004 -9814 -24708 -43679 -33837 -18340 -761
5353g61n23J3672k853j228j000k5230r071O234P623k6122j441K1706L287J2859
$$ -761 -1284 12388 9535 8307 7307 -17923 -26994 -20760 -13137 -39259 -40700 -18994 -15707 -2848
5339b848K179J9740Q175o709j0068j2749l4603j0344K756J6412J3205j054r540
$$ -2848 -669 19071 27246 20537 10469 -2280 -36883 -47227 -44471 -28059 -14854 -15908 -25448
5326b5448J7462K363R96q78J4102J7606K9773l3510k2110p19O543k9j7429K0297
$$ -25448 -7986 -5623 -4627 -5505 8597 26203 55976 22466 356 -363 6180 6151 -11278 9019
5312I019J5258j622L781O54M01k7560K947L240n741K856j0727J655K176j4929
$$ 9019 24277 22655 26436 27090 27491 -69 2878 6118 377 3233 -7494 -5839 -3663 -18592
5298a8592R983j162J1676j3355P831L665J1720N6689M18k6945L473r836k0861
$$ -18592 -8609 -9771 1905 -11450 -3619 46 11766 68455 68873 41928 45401 35565 14704
5285A4704L149M702k7757m378k0335M775K0894j4760q877K6159L096k9157n756
$$ 14704 17853 22555 -5202 -9580 -29915 -25140 -4246 -19006 -27883 -1724 1372 -27785 -33541
5272c3541k6940j8169J7520k99M209M3923J7256M793o785m632K611j1804q066
$$ -33541 -60481 -78650 -61130 -61429 -57220 -13297 3959 8752 1967 -2665 -54 -11858 -19924
5259a9924n204J0180J1455J5176j1149j5738j7974j4430J8352K4825L4541J7808
$$ -19924 -25128 -14948 -3493 11683 534 -15204 -33178 -47608 -29256 -4431 30110 47918
5247D7918j2487k8717O071J0871k826j1995k0158K234J7526J4807j6299J0210
$$ 47918 35431 6714 12785 23656 20830 8835 -11323 -9089 8437 23244 6945 17155
5235A7155l415j0797L108j598j3113J2836j3549P186j5888j1223m146J9363N245
$$ 17155 13740 2943 6051 4453 -8660 4176 -9373 -2187 -18075 -29298 -33444 -14081 -8836
5222h836J5233J9891j0541O471k7192L514J0278n212K303R016J6793n275l4796
$$ -8836 6397 26288 15747 22218 -4974 -1460 8818 3606 5909 14925 31718 26443 -8353
5209h353J9955J7191j2435k6497K1667J4072k580J2390m521L668N745q504M485
$$ -8353 11602 28793 16358 -10139 11528 25600 23020 35410 30889 34557 40302 31798 36283
5196C6283L967j5883J1k8694j6361J9292j4656N550J0872J4524L1034j0902p604
$$ 36283 40250 24367 24378 -4316 -20677 -1385 -16041 -10491 381 14905 45939 35037 27433
5183B7433m4506j6620N958J6937l824P37J2416J7292J0110p29l083j3385j0432
$$ 27433 -17073 -33693 -27735 -10798 -14622 -13885 -1469 15823 25933 25204 22121 8736 -1696
5170a696J4305p435l018J9511J9431Q425p978l9017j5170j052K8543J1154k2058
$$ -1696 12609 5174 2156 21667 41098 49523 41545 2528 -12642 -13694 14849 26003 3945
5157C945j0907Q903k180J5651j4160j6976r714k9517R009Q009j9659K7862L4550
$$ 3945 -6962 1941 -239 15412 1252 -15724 -25438 -54955 -45946 -37937 -57596 -29734 4816
5144D816J5082r15M205j0679k021J4848J345k6676o386p917N364K1907l9213j6909
$$ 4816 19898 18983 23188 12509 10488 25336 26681 5 -6381 -14298 -8934 12973 -26240 -43149
5130d3149K5286K6417j3884k8981j0412Q182j7827J2839L1549j0049l3821j4486
$$ -43149 -17863 8554 -5330 -34311 -44723 -36541 -54368 -41529 -9980 -20029 -53850 -68336
5118f8336K0726K1706J3643k0196j6461j4897n619M0395K0118J5914K3691o796
$$ -68336 -47610 -25904 -12261 -32457 -48918 -63815 -69434 -29039 -8921 6993 30684 23888
5106B3888j3071k45J1243q820q431j5385j5132J5054J5952l3332N596M3434k242
$$ 23888 10817 10572 21815 12995 4564 -10821 -25953 -10899 5053 -28279 -22683 20751 18509
5093A8509r240n421k6876Q410Q139q341j1771O391k716k270l0801J1955L1578
$$ 18509 9269 3848 -23028 -14618 -6479 -14820 -26591 -20200 -22916 -25186 -55987 -44032 -12454
5080a2454k979K504o966O622J4772r125l562l606Q197Q858J5994K984j799N882
$$ -12454 -15433 -12929 -19895 -13273 1499 -7626 -11188 -14794 -6597 2261 18255 21239 19440 25322
5066B5322j5868K0398m784j8672r164K359j1683L166M057K2073k4395k6563J033
$$ 25322 9454 29852 25068 6396 -2768 -409 -12092 -8926 -4869 17204 -7191 -33754 -32721
5053c2721O029J7480J3696j4314o776J5311o053k4714m779N534K198R375M476
$$ -32721 -26692 -9212 4484 -9830 -16606 -1295 -7348 -32062 -36841 -31307 -29109 -19734 -15258
5040a5258M1853J6860k3867k7290k0026j551J7876l590j7108k127N301J8341K2433
$$ -15258 26595 43455 19588 -7702 -27728 -29279 -11403 -14993 -32101 -34228 -28927 -10586 11847
5027A1847j6716j3547K3080O409q282k824J763m936J9411K7231j1383l0397N209
$$ 11847 -4869 -18416 4664 11073 2791 -33 1730 -3206 16205 43436 32053 1656 6865
5014F865L0464R295j3792j4275L707n466k0357J523j1130o671j5318n185L5652
$$ 6865 37329 46624 32832 18557 22264 16798 -3559 -2036 -13166 -19837 -35155 -40340 -4688
5001d688K8207k0602j6393q153j1430K7288J5252j4729k169R512j741k6070L0024
$$ -4688 23519 2917 -13476 -21629 -33059 -5771 9481 -5248 -7417 2095 354 -25716 4308
4988D308J7275j4185Q534J6061J125k2107j3074q267K042j3003r181K400r109
$$ 4308 21583 7398 15932 31993 33118 11011 -2063 -10330 -8288 -21291 -30472 -28072 -37181
4975c7181k2144K9521j6501j1582L5640L7337P863j3786k3394J6020J3829J666
$$ -37181 -59325 -29804 -46305 -57887 -22247 15090 22953 9167 -14227 1793 15622 17288
4963A7288p593L498J7833R337k9825q143k7897j15L2088K1604J8572p923P866
$$ 17288 9695 13193 31026 40363 10538 2395 -25502 -25617 6471 28075 46647 38724 46590
4950D6590J2338O830l0368j6318j1485n698K054j8424Q348q924j7381J148k46
$$ 46590 58928 65758 35390 19072 7587 1889 3943 -14481 -6133 -15057 -32438 -31290 -31536
4937c1536j9099M822J8639R269K881l57l839K914Q331L0301m692P173J3737l3370
$$ -31536 -50635 -45813 -27174 -17905 -15024 -15381 -19220 -16306 -7975 22326 17634 24807 38544 5174
4923E174j5518N407J0830P441N045j7085j7878J1988J3523n127j934o449L039
$$ 5174 -10344 -4937 5893 13334 18379 1294 -16584 -4596 8927 3800 1866 -4583 -1544
4910a544m989k8405j7214j1817K5535K5452J5652Q101K15j0916P505q657j1404
$$ -1544 -6533 -34938 -52152 -63969 -38434 -12982 2670 10771 10986 70 7575 -1082 -12486
4897a2486j727K3075O782j305m846j6593K046k561o050N870J3034p245j7664n87
$$ -12486 -14213 8862 15644 14339 9493 -7100 -5054 -7615 -13665 -7795 5239 -2006 -19670 -20257
4883b0257L342p387R571J1961j4916L059o146j2410N380R467p422O493k063J4229
$$ -20257 -16915 -24302 -14731 -2770 -17686 -14627 -20773 -33183 -27803 -18336 -25758 -19265 -21328 -7099
4869g099M217J3081O625J447M494L740J5686j7542k7234k6503J8649M2707j624
$$ -7099 -2882 10199 16824 18271 22765 26505 42191 24649 -2585 -29088 -10439 32268 30644
4856C0644o771j1531k1138q134k0540J6738J3639J4931r039k1946N864N865J9321
$$ 30644 23873 12342 -8796 -16930 -37470 -20732 -7093 7838 -1201 -23147 -17283 -11418 7903
4843G903K1801R46k7992k8201k5861K475J1248K3674j1433r616l399r29O40q515
$$ 7903 29704 30650 2658 -25543 -51404 -48929 -37681 -14007 -25440 -35056 -38455 -39384 -38744 -47259
4829d7259O383J4982P682J6675o139k225K1229R508j531n364M989o376p989l23
$$ -47259 -40876 -25894 -18212 -1537 -7676 -9901 11328 20836 19305 13941 18930 12554 4565 4242
4815D242J5403l3333l1411O957N490R424O100K8159K7827J4353q399J477l1991
$$ 4242 19645 -13688 -45099 -38142 -32652 -23228 -17128 11031 38858 53211 44812 46289 14298
4802A4298k1702J0793j0023J428K1853j4857O753j398j9492j4618j4134J192J4686
$$ 14298 -7404 3389 -6634 -5206 16647 1790 8543 7145 -12347 -26965 -41099 -39907 -25221
4789b5221N690m994J587O91k2297Q394M949O057J8754Q439L446J8935j3034j5726
$$ -25221 -19531 -24525 -22938 -22247 -44544 -36150 -31201 -25144 -6390 2049 5495 24430 11396 -4330
4775d330n309m237j7433J8990L6408r395j4958n191J3670j9457J183K2636j655
$$ -4330 -9639 -13876 -31309 -12319 24089 14694 -264 -5455 8215 -11242 -10059 12577 10922
4762A0922N908J3L080J799j0343k5758k0822J7504R556k0557j1601j5843L647
$$ 10922 16830 16843 19923 21722 11379 -14379 -35201 -17697 -8141 -28698 -40299 -56142 -52495
4749e2495N0929Q634j5137k2643J1141o564j1526l393m2l059J9115J1327Q946
$$ -52495 -1566 7068 -8069 -30712 -19571 -26135 -37661 -41054 -41096 -44155 -25040 -13713 -4767
4736d767O367K4886j0075j6619j6068O63r108K0997O003M085J9532l026j7524
$$ -4767 1600 26486 16411 -208 -16276 -15613 -24721 -3724 2279 6364 25896 22870 5346
4723E346q923k9216J230K3984N251L747M997l1559k6341K3714K1102k4439j6481
$$ 5346 -3577 -32793 -31563 -7579 -2328 1419 6416 -25143 -51484 -27770 -6668 -31107 -47588
4710d7588L286K1897N177J7440K0776n499L036N760M3872q728j9730l2969j6974
$$ -47588 -44302 -22405 -17228 212 20988 15489 18525 24285 68157 59429 39699 6730 -10244
4697a0244J8334J6941k879Q767p546j3774m0823o079O768M0668R938j9027k0924
$$ -10244 8090 25031 22152 30919 23373 9599 -31224 -37303 -30535 10133 20071 1044 -19880
4684a9880j952K512K081j8666L840j92k012j0975J9469k4372j2212M548K5843
$$ -19880 -21832 -19320 -17239 -35905 -32065 -32257 -34269 -45244 -25775 -50147 -62359 -57811 -31968
4671c1968J1548L8565l795k4886o399J4296K845k092N708k294K0031J498k8100
$$ -31968 -20420 18145 14350 -10536 -16935 -2639 206 -1886 3822 1528 21559 23057 -5043
4658e043l3554K4184K4491j2570q447m058j550k2696J0783q343K3153L9j0322
$$ -5043 -38597 -14413 10078 -2492 -10939 -14997 -16547 -39243 -28460 -36803 -13650 -13611 -23933
4645b3933j0546j1565J133M1735O552j2100k3259k6961j678J0327O070J7763J1360
$$ -23933 -34479 -46044 -44911 -3176 3376 -8724 -31983 -58944 -60622 -50295 -44225 -26462 -15102
4632a5102N915q861k4858J963r736K149J1269J4620m059M608K147J8332K0811
$$ -15102 -9187 -18048 -42906 -40943 -50679 -48530 -37261 -22641 -26700 -22092 -19945 -1613 19198
4619A9198J922j0680k5742J9096P17r605k1285k0385J3650K0097k511k1833L859
$$ 19198 21120 10440 -15302 3794 4511 -5094 -26379 -46764 -33114 -13017 -15528 -37361 -33502
4606c3502K2832R370Q683J5034r720k7397K0900J5577r226K7745L79j1867L13
$$ -33502 -10670 -1300 7383 22417 12697 -14700 6200 21777 12551 40296 40675 28808 29121
4593B9121j6581j0641n579L992j3254Q786o285j7694J3505L4655l616l3407J194
$$ 29121 12540 1899 -3680 312 -12942 -4156 -10441 -28135 -14630 20025 16409 -16998 -15804
4580a5804J5386j0899l6717Q202K6071L652J0107J1403M019j6629J0726N308k0403
$$ -15804 -418 -11317 -48034 -39832 -13761 -10109 -2 11401 15420 -1209 9517 14825 -5578
4567e578k2962R013J575j9308M929k804O17j4166j7924O985J5805k249k7903L5588
$$ -5578 -28540 -19527 -17952 -37260 -32331 -35135 -34518 -48684 -66608 -59623 -43818 -46067 -73970 -38382
4553c8382L1486j0172j44J0141j2215P324Q435L282R663j1809j0161k158Q092
$$ -38382 -6896 -17068 -17212 -7071 -19286 -11962 -3527 -245 9418 -2391 -12552 -14710 -6618
4540f618J6164J0053J0636k469M318J3149M729l0474q455j3215M901J3842J0063
$$ -6618 9546 19599 30235 27766 32084 45233 49962 19488 11033 -2182 2719 16561 26624
4527B6624m1692p092M975R377o978J1416l15p988J909J7722m422p683j0615Q408
$$ 26624 -15068 -22160 -17185 -7808 -14786 -3370 -3685 -11673 -9764 7958 3536 -4147 -14762 -6354
4513f354L977j7892K92J4764r972k8268K456L6375K5710k9874r468P329R238m6948
$$ -6354 -2377 -20269 -19977 -5213 -15185 -43453 -40997 -4622 21088 -8786 -18254 -10925 -1687 -48635
4499d8635n931L4906K5707M320r259P816J6039l006j9528l8595p247J0828K5735
$$ -48635 -54566 -19660 6047 10367 1108 8924 24963 21957 2429 -36166 -43413 -32585 -6850
4486f850J1170J8047o893k5307J072J8267J3101l8994k5327p375J0806P778M04
$$ -6850 4320 22367 15474 -9833 -8761 9506 22607 -16387 -41714 -49089 -38283 -30505 -30101
4473c0101J7295j092k3066J3950J1289j0376j3110J9111J0132M859m931m600J3753
$$ -30101 -12806 -13898 -36964 -23014 -11725 -22101 -35211 -16100 -5968 -1109 -6040 -10640 3113
4460C113N866j9669J45j7732j9093q71O248J515N649j4268K0662R988K4283K0485
$$ 3113 8979 -10690 -10545 -28277 -47370 -48241 -41993 -40478 -34829 -49097 -28435 -18447 5836 26321
4446B6321m885P212o37o854n406j1303k3408L921J2789J3924M702k1935j5834
$$ 26321 21436 28648 28011 21157 15751 4448 -18960 -15039 -2250 11674 16376 -5559 -21393
4433b1393O089m519J6469L857j3068k2469J6096J0968j0172p906J4058L543l801
$$ -21393 -15304 -19823 -3354 503 -12565 -35034 -18938 -7970 -18142 -26048 -11990 -8447 -12248
4420a2248l8696k1540J3935K951L4432L6453O462o211n680r448N504J135o819
$$ -12248 -50944 -72484 -58549 -55598 -21166 15287 21749 15538 9858 410 5914 7049 230
4407B30k9286l2017o3J0920L706J0142L5746L8567j7545k8483k8144K2957K3060
$$ 230 -29056 -61073 -61136 -50216 -46510 -36368 -622 37945 20400 -8083 -36227 -13270 9790
4394I790j1270N464K4401J4629J4960J1902r160r90k0752l2461k2167K6109Q549
$$ 9790 -1480 3984 28385 43014 57974 69876 60716 59726 38974 6513 -15654 10455 19004
4381A9004L78j2288m929j0355k1417o047Q906j1428j7161n515K3211K6601k4134
$$ 19004 19382 7094 2165 -8190 -29607 -35654 -26748 -38176 -55337 -60852 -37641 -11040 -35174
4368c5174r171j640J6301L7468k4812k0940L8300K8237K619l3686k6022O544J0614
$$ -35174 -44345 -45985 -29684 7784 -17028 -37968 332 28569 31188 -2498 -28520 -21976 -11362
4355a1362j0342p277J6144M108J6833J1718J5049J3975k1535j337P363j7078j0084
$$ -11362 -21704 -28981 -12837 -8729 8104 19822 34871 48846 27311 25974 33337 16259 6175
4342F175k321k1770j0818j9857J0928N535q649r823M743J9890J3011K0386J4446
$$ 6175 3854 -17916 -28734 -48591 -37663 -32128 -40777 -50600 -45857 -25967 -12956 7430 21876
4329B1876l123j8990k1049J5203m28j2572p851M239j1351o278J4512J0679J1083
$$ 21876 18753 -237 -21286 -6083 -6511 -19083 -26934 -22695 -34046 -40324 -25812 -15133 -4050
4316d050J0076K0975K160M848j3851j4409O963j230j7284q546j8072M61O516K7803
$$ -4050 6026 27001 29161 34009 20158 5749 12712 11482 -5802 -14348 -32420 -31959 -25443 2360
4302B360p058j8162K2835O928N216J0380k177k4059k8283n277K549J1636Q938
$$ 2360 -4698 -22860 -25 6903 12119 22499 20322 -3737 -32020 -37297 -34748 -23112 -14174
4289a4174J2967J9809O611j7352Q082o332Q953r737j5743k1377q17N859L5532
$$ -14174 -1207 18602 25213 7861 15943 9611 18564 8827 -6916 -28293 -29110 -23251 12281
4276A2281q81P170m656k3133k8278l812K3436K9307j2848M336J2355J8202q947
$$ 12281 11400 18570 13914 -9219 -37497 -41309 -17873 11434 -1414 2922 15277 33479 24532
4263B4532k3911p717N938j8186J451l972Q832M08l770P056M510j1876P224K960
$$ 24532 621 -7096 -1158 -19344 -17893 -21865 -13033 -12625 -16395 -9339 -4829 -16705 -9481 -6521
4249f521m760K1621J3172l544J6747k604n968K650j7459j1574j4535p336r499
$$ -6521 -11281 10340 23512 19968 36715 34111 28143 30793 13334 1760 -12775 -20111 -29610
4236b9610J1578l945J9889l691k116K050j0851p159q448N987r465j1235K0808
$$ -29610 -18032 -21977 -2088 -5779 -7895 -5845 -16696 -23855 -32303 -26316 -35781 -47016 -26208
4223b6208J1456q255J4466L3330J7895j4909k2526k6928j2912R035r948j2621
$$ -26208 -14752 -23007 -8541 24789 42684 27775 5249 -21679 -34591 -25556 -35504 -48125
4211d8125J7411j306n720n165J1834J1938o665J3248L7244J2149j3235q678j4421
$$ -48125 -30714 -32020 -37740 -42905 -31071 -19133 -25798 -12550 24694 36843 23608 14930 509
4198E09K3352p721j3829j2632J4024M609K0374R487J0001O600L267R11k0320j6999
$$ 509 23861 16140 2311 -10321 3703 8312 28686 38173 48174 54774 58041 58952 38632 21633
4184B1633m0096j2953l564J7941P251L1410J4632l8797k4466j7329J1363N0245
$$ 21633 -18463 -31416 -34980 -17039 -9788 21622 36254 -2543 -27009 -44338 -32975 17270
4172A7270O92j3795R648l331J7698J742J1535L522R74m4110j2495R099j9873J4618
$$ 17270 17962 4167 13815 10484 28182 29924 41459 44981 45955 1845 -10650 -1551 -21424 -6806
4158f806J2051J2446J6849j7685k4206j0577m044j2738j031J906l598J0079K7651
$$ -6806 5245 17691 34540 16855 -7351 -17928 -21972 -34710 -35741 -33835 -37433 -27354 297
4145B97N810M585L572J8496J9389J3941k3927M118L98R802l2072k8869K367o883
$$ 297 6107 10692 14264 32760 52149 66090 42163 46281 46679 56481 24409 -4460 -2093 -8976
4131h976l1791J2550M1562L001n268P268p722l4991p328J6923j530K622J2838
$$ -8976 -40767 -28217 13345 16346 11078 18346 10624 -24367 -31695 -14772 -16302 -13680 -842
4118h42J6314k1174k5111n903L803J1510J5912j0169L751K5229O885l8599j2335
$$ -842 15472 -5702 -30813 -36716 -32913 -21403 -5491 -15660 -11909 13320 20205 -18394 -30729
4105c0729L7917K2360k3109j7860j5055J471O985m298n363k0272J8216P333K27
$$ -30729 7188 29548 6439 -11421 -26476 -25005 -18020 -22318 -27681 -47953 -29737 -22404 -22177
4092b2177L8695K0617o65k0729j8097l35N173n4n333J5783p014R519K6217l1607
$$ -22177 16518 37135 36470 15741 -2356 -2691 2482 2428 -2905 12878 5864 15383 41600 9993
4078I993k0081p928J0274K0437K064p417k1286M388J9447M8318l49l5443k7166
$$ 9993 -10088 -18016 -7742 12695 14759 7342 -13944 -9556 9891 58209 57860 22417 -4749
4065d749J8913K0386L476r687N9j2244n313o649j1943M87k1656q597M481j5567
$$ -4749 14164 34550 38026 28339 28398 16154 10841 4192 -7751 -7264 -28920 -37517 -33036 -48603
4051d8603L2678N2066j596j9826N304N987j0793j0667L963j0693Q084P625M564
$$ -48603 -15925 36141 34545 14719 20023 26010 15217 4550 8513 -2180 5904 13529 18093
4038A8093r465j7729k93K0131k4732j519J0694K0438K0330K934M618k8264j551
$$ 18093 8628 -9101 -9394 10737 -13995 -15514 -4820 15618 35948 38882 43500 15236 13685
4025A3685N01M147Q657k5063o466L2325j0348l0773O965j2030k365r194k4924
$$ 13685 14186 18333 26990 1927 -4539 27786 17438 -13335 -6370 -18400 -20765 -29959 -54883
4012e4883p160J1058J5539o563l9462r933M820J7752Q541M634M006L7219L0533
$$ -54883 -62043 -50985 -35446 -42009 -81471 -91404 -86584 -68832 -60291 -55657 -51651 -14432 16101
3999A6101J4769J3876N41m4340j3710K3889n642j7530j1218L1198m301l9619j9491
$$ 16101 30870 44746 45287 947 -12763 11126 5484 -12046 -23264 7934 3633 -35986 -55477
3986e5477L4710M0699J30o1275l7039K3215J6427J8056J1444p719M116j3029m905
$$ -55477 -20767 19932 20062 -41213 -78252 -55037 -38610 -20554 -9110 -16829 -12713 -25742 -30647
3973c0647q936o662J3584n265J1489Q2J4015O124N363k8447M165L8721J5926j4242
$$ -30647 -39583 -46245 -32661 -37926 -26437 -26355 -12340 -6216 -853 -29300 -25135 13586 29512 15270
3959A5270l5383j2920L030j04J6669r764j0358k7491P503O0692J340J0521J0584
$$ 15270 -20113 -33033 -30003 -30107 -13438 -23202 -33560 -61051 -53548 7144 8484 19005 29589
3946B9589k9360j2347J7708J2406J2143j0073k744k2548k4203M1656M3885j5747
$$ 29589 229 -12118 5590 17996 30139 20066 17322 -5226 -29429 12227 56112 40365
3934D0365k8927j7148l454k110M545N445P422P888J5915Q152K249p065k1950n2394
$$ 40365 11438 -5710 -9164 -11274 -6729 -1284 6138 14026 29941 38093 40342 33277 11327 -41067
3920d1067n963P073K2298L6958q162k6828l2525j8243K0083L289K4728q26j5492
$$ -41067 -47030 -39957 -17659 19299 11137 -15691 -48216 -66459 -46376 -43087 -18359 -19185 -34677
3907c4677P175j426J5176R150j7172j894K1556K388J9776Q684k868p931R535Q580
$$ -34677 -27502 -28928 -13752 -4602 -21774 -23668 -2112 276 20052 28736 25868 17937 27472 36052
3893C6052J2335j6950j2543j8810j2921K268O296q336l6056j9831J8970J6036
$$ 36052 48387 31437 18894 84 -12837 -10569 -4273 -12609 -48665 -68496 -49526 -33490
3881c3490K3026m159J1297P5n553J0387K891j8375J682J4366l591j7512J4476
$$ -33490 -10464 -14623 -3326 -3251 -8804 1583 4474 -13901 -12219 2147 -1444 -18956 -4480
3868d480K2045M225l3692J0630o395q826J0228L2576j2997j1105N598k521L314
$$ -4480 17565 21790 -11902 -1272 -7667 -16493 -6265 26311 13314 2209 7807 5286 8600
3855H600M680q232j2584J4892J5997k74M78j4541J5184j4184M132P121l466j9414
$$ 8600 13280 5048 -7536 7356 23353 23079 23557 9016 24200 10016 14148 21269 17803 -1611
3841a611M237J9370j0951R414P637j8555k507l524j6517P583J754J944J3758j4587
$$ -1611 2626 21996 11045 20459 28096 9541 7034 3510 -13007 -5424 -3670 -1726 12032 -2555
3827b555k6358n127K5701J2578j1244j0928r921j0898O115K0938M0539J7018R882
$$ -2555 -28913 -34040 -8339 4239 -7005 -17933 -27854 -38752 -32637 -11699 28840 45858 55740
3814E5740n772j0753l6802j0062J6123J3283k362k3811r486m053j6091J4992J8478
$$ 55740 49968 39215 2413 -7649 8474 21757 19395 -4416 -13902 -17955 -34046 -19054 -576
3801e76L033j9953j2337P771L4104l234q516J754J0352K3143J999l8605k2772
$$ -576 2457 -17496 -29833 -22062 12042 8808 292 2046 12398 35541 37540 -1065 -23837
3788b3837N0R07L1666J6706M958J8161j4166k2135J885M523L3652j4884r822L4332
$$ -23837 -23787 -22880 8786 25492 30450 48611 34445 12310 14195 18718 52370 37486 27664 61996
3774F1996j4155l7851j5542l7494N529J0131k2944J1908J3864M758j1589j463
$$ 61996 47841 9990 -5552 -43046 -37517 -27386 -50330 -38422 -24558 -19800 -31389 -32852
3762c2852l068K3134L2997j3082l8339L353J6396K7598j1411k1312j3198m0P616
$$ -32852 -35920 -12786 20211 7129 -31210 -27857 -11461 16137 4726 -16586 -29784 -29824 -22208
3749b2208J4661J7775j6734l021j2698j8091j2330l778M6395M339L821P305J9243
$$ -22208 -7547 10228 -6506 -9527 -22225 -40316 -52646 -56424 -10029 -5690 -1869 5436 24679
3736B4679k4105k3943l5426J9944q540m342o859K3950K3021N307J8894J2140O804
$$ 24679 574 -23369 -58795 -38851 -47391 -51733 -58592 -34642 -11621 -6314 12580 24720 31524
3723C1524L411l665J0699p039m3929j8797L5768K9571j193J539j4619P133K0908
$$ 31524 34935 31270 41969 34930 -8999 -27796 7972 37543 36350 37889 23270 30403 51311
3710E1311K1759j3343k8824k7403q61k3811J525M2424j9543j5491N296Q308k463
$$ 51311 73070 59727 30903 3500 2639 -21172 -19647 22777 3234 -12257 -6961 1347 -1116
3697a116r959l0608j886K7876N674n445J5466K0205j0614k5356l0888Q073J1048
$$ -1116 -11075 -41683 -43569 -15693 -10019 -15464 2 20207 9593 -15763 -46651 -38578 -27530
3684b7530K3281J2571l425k3900j775r162M738P622J3825k819j1738J5056J6193
$$ -27530 -4249 8322 4897 -19003 -20778 -29940 -25202 -17580 -3755 -6574 -18312 -3256 12937
3671A2937l443l8402j0812K0387J5023K979O844K2660r75k8848j3478L3468r600
$$ 12937 9494 -28908 -39720 -19333 -4310 -1331 5513 28173 27198 -1650 -15128 18340 8740
3658H740p066Q723M36l8576o400M030j9884J5096r304J167J4300J0832k1236O027
$$ 8740 1674 10397 10833 -27743 -34143 -30113 -49997 -34901 -44205 -43038 -28738 -17906 -39142 -33115
3644c3115q671N809J6892K1609N13j057j8444J5734J9644p868l3921o751j960
$$ -33115 -41786 -35977 -19085 2524 3037 1980 -16464 -730 18914 11046 -22875 -29626 -31586
3631c1586j2780p28J6362K2246J111K0773J8592j2165P901p133j0570r796K7411
$$ -31586 -44366 -45094 -28732 -6486 -5375 15398 33990 21825 29726 22593 12023 2227 29638
3618B9638N683R25l352L188j1472k5520k5868J4985K7901k0479j1138J1703J4155
$$ 29638 35321 36246 32894 36082 24610 -910 -26778 -11793 16108 -4371 -15509 -3806 10349
3605A0349K703P12j9437J7121J9331K096j7625J0676j7799q007J7536j3975N502
$$ 10349 13052 13764 -5673 11448 30779 32875 15250 25926 8127 120 17656 3681 9183
3592I183K1076j0285j0166j602J1864k2505k8684L366J1591P358P986j542p137
$$ 9183 30259 19974 9808 8206 20070 -2435 -31119 -27753 -16162 -8804 -818 -2360 -9497
3579i497p832o702K8210k69n0299j5820J9244J9444K2770J0981j5036M457K6235
$$ -9497 -17329 -24031 4179 3910 -46389 -62209 -42965 -23521 -751 10230 -4806 -349 25886
3566B5886j0536Q501M957p681k026J3912n8J235k303j6009P493j1829l099K9786
$$ 25886 15350 23851 28808 21127 19101 33013 32955 34190 31887 15878 23371 11542 8443 38229
3552C8229R027j1972k802o715J736n745j5725q384O015N168q448j2402l6279J781
$$ 38229 47256 35284 32482 25767 27503 21758 6033 -2351 3664 8832 384 -12018 -48297 -46516
3538d6516K1936n489J161Q882O939j9946K321K3855K0874j1002j1303J4108J9728
$$ -46516 -24580 -30069 -28908 -20026 -13087 -33033 -30712 -6857 14017 3015 -8288 5820 25548
3525B5548K0728k638j1609n22j2341j9k2738n139m746k8335O274K6655Q301r591
$$ 25548 46276 43638 32029 31507 19166 19147 -3591 -8730 -13476 -41811 -35537 -8882 -581 -10172
3511a0172j3629j180L145l808J0637J8348J0351K0693j057j5828j2854l542L329
$$ -10172 -23801 -24981 -21836 -25644 -15007 3341 13692 34385 33328 17500 4646 1104 4433
3498D433J0350J5426J5940k2423j2839j3656J1840L3517q590l4534r467M0617
$$ 4433 14783 30209 46149 23726 10887 -2769 9071 42588 33998 -536 -10003 30614
3486C0614r619l1819l3196Q18J5102J1592M4521R131k0178J1797L561n509k6154
$$ 30614 20995 -10824 -44020 -43202 -28100 -16508 28013 37144 16966 28763 32324 26815 661
3473F61L8419L1233l2750m915k293j7366k9849j3436J2482L1506J1560j9027J1692
$$ 661 39080 70313 37563 32648 30355 12989 -16860 -30296 -17814 13692 25252 6225 17917
3460A7917P326j3350l7024P551K4939j7429k0751l940j0868L421R006J1168M368
$$ 17917 25243 11893 -25131 -17580 7359 -10070 -30821 -34761 -45629 -42208 -33202 -22034 -17666
3447a7666J1790J3569j2703p302n213j4044r099k0741J3722K9680J2807K826j7875
$$ -17666 -5876 7693 -5010 -12312 -17525 -31569 -40668 -61409 -47687 -18007 -5200 -2374 -20249
3434b0249j6844K7670K2419M413j146j0267j2363K78J3343o703k1j026k4106R635
$$ -20249 -37093 -9423 12996 17409 16263 5996 -6367 -6089 7254 551 530 -496 -24602 -14967
3420a4967j5126J5417L6019J1850k1228j284R783j4717j5939l449k514j955J0602
$$ -14967 -30093 -14676 21343 33193 11965 10681 20464 5747 -10192 -13641 -16155 -18110 -7508
3407g508K1914j4119j1520L1480j920l0159k3338mJ8680j3283l29o529J2255J3890
$$ -7508 14406 287 -11233 20247 18327 -11832 -35170 -35174 -16494 -29777 -30106 -36635 -24380 -10490
3393a0490J4007k2501r714m133M249P772N791J1629OJ0639O628l4576j8694R788
$$ -10490 3517 -18984 -28698 -32831 -28582 -20810 -15019 -3390 -3384 7255 13883 -20693 -39387 -29599
3379b9599J4260M627j0010K163n584j6216j4989J4119J7832J2057K0947N149K5641
$$ -29599 -15339 -10712 -20722 -18559 -24143 -40359 -55348 -41229 -23397 -11340 9607 14756 40397
3366D0397p541j7641R937r656j8105J2984K4954J0561j0971j9598k804p377j97
$$ 40397 32856 15215 25152 15496 -2609 10375 35329 45890 34919 15321 12517 5140 4943
3353D943J4318M645n848J1375k9663r40L0133K522j4014J666O879K548p187j0232
$$ 4943 19261 23906 18058 29433 -230 -1170 28963 31485 17471 19137 26016 28564 21377 11145
3339A1145j6240M500N685O616O990J163n848j9350J5926K8723k2664J0295Q876
$$ 11145 -5095 -595 5090 11706 18696 19859 14011 -5339 10587 39310 16646 26941 35817
3326C5817n532M985k2161o489J546J0504o497j0314J0673J0420N887J1074k7727
$$ 35817 30285 35270 13109 6620 8166 18670 12173 1859 12532 22952 28839 39913 12186
3313A2186j7807P443N585j932j7074M216l7597q445J5171l658j775J2347M619
$$ 12186 -5621 1822 7407 5475 -11599 -7383 -44980 -53425 -38254 -41912 -43687 -31340 -26721
3300b6721k695K9734J0293J5483o104j1072J6422J2037k2041q839j394n681l0797
$$ -26721 -29416 318 10611 26094 19990 8918 25340 37377 15336 6497 5103 -578 -31375
3287c1375o181J5635p687R672L339j2532l0047J2315J4692n717J0294n154K593
$$ -31375 -37556 -21921 -29608 -19936 -16597 -29129 -59176 -46861 -32169 -37886 -27592 -32746 -30153
3274c0153Q223j0315n291J0945J8453L449J0744L467k3749p831K1385k448L661
$$ -30153 -21930 -32245 -37536 -26591 -8138 -4689 6055 9522 -14227 -22058 -673 -3121 540
3261E40R86K0739J5306j7444L878O582p298k4406j4174J6228J550j848j0103l761
$$ 540 1526 22265 37571 20127 24005 30587 23289 -1117 -15291 937 2487 639 -9464 -13225
3247a3225k844J1059J2269j9127J2713j5389o439M347J503K2719K0754r559j591
$$ -13225 -16069 -5010 7259 -11868 845 -14544 -20983 -16636 -15133 7586 28340 18781 17190
3234A7190P974j3827n288P911K378j5347l67p131O675N806r905J4117j7414M109
$$ 17190 25164 11337 6049 13960 16338 991 624 -6507 168 5974 -3931 10186 -7228 -3119
3220c119J9577p83j962k5069J5238J4280j123l063j2399k3647J4718J6433q798
$$ -3119 16458 15675 13713 -11356 3882 18162 17039 13976 1577 -22070 -7352 9081 283
3207B83j6431l9381L3069L8677j7059l55J1059n922m82o921j0932J1803o163J4366
$$ 283 -16148 -55529 -22460 16217 -842 -1197 9862 3940 3458 -3463 -14395 -2592 -8755 5611
3193E611N668k8274n020J0464p847p879R138j1577K113N309J3220j235p778L5274
$$ 5611 11279 -16995 -22015 -11551 -19398 -27277 -18139 -29716 -27603 -22294 -9074 -10309 -18087 17187
3179A7187O397j7332r909j5367N81j6967j3536L3317Q033J2071J3717j3497m2843
$$ 17187 23584 6252 -3657 -19024 -18443 -35410 -48946 -15629 -7596 4475 18192 4695 -38148
3166c8148m718J5617L1705j5573j3680K3251J4131O972j6967j474M0985O79k3568
$$ -38148 -42866 -27249 4456 -11117 -24797 -1546 12585 19557 2590 1116 42101 42780 19212
3153A9212Q52k525J7348m063j6432j8299j112Q937R706M220k2153j8450j0270
$$ 19212 20064 17539 34887 30824 14392 -3907 -5019 3918 13624 17844 -4309 -22759 -33029
3140c3029o07J7847L90K6548n27l895l752l4137j9976L2836j149p324o015K0839
$$ -33029 -33636 -15789 -15399 11149 10622 6727 2975 -31162 -51138 -18302 -19451 -26775 -32790 -11951
3126a1951J0515O273J0667k0180j0208l718k0346J2602J1460J2260K1138P057
$$ -11951 -1436 4837 15504 -4676 -14884 -18602 -38948 -26346 -14886 -2626 18512 25569
3114B5569k213j4673R409J571r725j0796J080N333r217J7489q239l6072R968L6985
$$ 25569 23356 8683 18092 19663 9938 -858 222 5555 -3662 13827 5588 -30484 -20516 16469
3100A6469R836j1058r652j3553j957m569J1579K6099J4632j871j3929j0046j6937
$$ 16469 26305 15247 5595 -7958 -9915 -14484 -2905 23194 37826 35955 22026 11980 -4957
3087d957l447p82q183j8206J6227J6940j450P318J8739J1015l385J2237l241k1742
$$ -4957 -8404 -9186 -17369 -35575 -19348 -2408 -3858 3460 22199 33214 29829 42066 38825 17083
3073A7083k2921j0033K6247O615j3021j6591k331j6036J3647k2948k098M552J3263
$$ 17083 -5838 -15871 10376 16991 3970 -12621 -14952 -30988 -17341 -40289 -42387 -37835 -24572
3060b4572q230R185L2480J985j0262N348j4871j1869K2809j5733K208M255J0322
$$ -24572 -32802 -23617 8863 10848 586 5934 -8937 -20806 2003 -13730 -11522 -7267 3055
3047C055L95p145J672N724K238N438q920J0754N008k6339J6756J1620K4446M457
$$ 3055 3450 -3695 -2023 3701 5939 11377 2457 13211 18219 -8120 8636 20256 44702 49159
3033D9159k225J0342J86j8534k3442n404o720j1450k8206J7612J7176J660P909
$$ 49159 46934 57276 57462 38928 15486 10082 3362 -8088 -36294 -18682 -1506 154 8063
3020H063l174k680Q269P136J6370L313m8227k942M410J9815k1412k0724K4447
$$ 8063 4889 2209 10478 17614 33984 37297 -10930 -13872 -9462 10353 -11059 -31783 -7336
3007g336N646L22J2995j8o83l833J0181L633j5314k9929k3631J4899K0290K3476
$$ -7336 -1690 -1368 11627 11609 10926 7093 17274 20907 5593 -24336 -47967 -33068 -12778 10698
2993A0698O254n011m6470R37M6653N998j3818r786j6171K278O013l8109k5234
$$ 10698 16952 11941 -34529 -33592 13061 19059 5241 -4545 -20716 -18438 -12425 -50534 -75768
2980g5768J3243K9570K6525J0363q432l067K7457K833k1508j379J7856P669L092
$$ -75768 -62525 -32955 -6430 3933 -4499 -7566 19891 22724 1216 -163 17693 25362 28454
2967B8454L894K6953j4954j4561j3913m493J2329M342j0404j4036o18n379k5062
$$ 28454 32348 59301 44347 29786 15873 11380 23709 28051 17647 3611 2993 -2386 -27448
2954b7448M879K5998J719Q874J8226L51j0343J1324J4166q528n918l4538k254
$$ -27448 -22569 3429 5148 14022 32248 32599 22256 33580 47746 39218 33300 -1238 -3492
2941c492K0J3789l625k5139j527J0482J0054P469j6295M144J1716j2116k2170
$$ -3492 -3472 10317 6692 -18447 -19974 -9492 562 8031 -8264 -4120 7596 -4520 -26690
2928b6690n569j3061M412k477N820K129L2291O883l0646j4799J1550J8312k4871
$$ -26690 -32259 -45320 -40908 -43385 -37565 -35436 -3145 3738 -26908 -41707 -30157 -11845 -36716
2915c6716r032J0878p440K488K8397L399p314Q022P96J1867q540l766k970j5005
$$ -36716 -45748 -34870 -42310 -39822 -11425 -8026 -15340 -7318 -6522 5345 -3195 -6961 -9931 -24936
2901b4936j5867P855K3879J1992J2574q803j2862k0753l742K3364N799j7192R837
$$ -24936 -40803 -32948 -9069 2923 15497 6694 -6168 -26921 -30663 -7299 -1500 -18692 -8855
2888h855K5289p956K174J7326j103j699q322J0313j2855m623n136K104l504j8907
$$ -8855 16434 8478 10652 27978 26875 25176 16854 27167 14312 9689 4553 6657 3153 -15754
2874a5754K6634J9722l2631O62J9849Q228J2014Q762j1755l5706m4417R71k8471
$$ -15754 10880 30602 -2029 -1367 18482 26710 38724 47486 35731 25 -44392 -43421 -71892
2861g1892K4757K9771L6873K0192m4520k0874K2347n100j4451J2279j4707k0465
$$ -71892 -47135 -17364 19509 39701 -4819 -25693 -3346 -8446 -22897 -10618 -25325 -45790
2849d5790K987L789l108R962J8849j957M155R522k3686K275j7089j9266O262K2848
$$ -45790 -42803 -39014 -42122 -32160 -13311 -15268 -11113 -1591 -25277 -23002 -40091 -59357 -53095 -30247
2835c0247J4978Q828J690L203J4687J2346j1511j2788k4857m166J1439K9603L596
$$ -30247 -15269 -6441 -4751 -1548 13139 25485 13974 1186 -23671 -27837 -16398 13205 16801
2822A6801l4783j0230L0691J203j7058j5124Q487K7078k672r619J3916j159p295
$$ 16801 -17982 -28212 2479 3682 -13376 -28500 -20013 7065 4393 -5226 8690 7531 236
2809B36O62J2685R954L910j7516l5336Q934J465R248N733M863j607l960k156J1589
$$ 236 898 13583 23537 27447 9931 -25405 -16471 -15006 -5758 -25 4838 3231 -729 -2885 8704
2794H704k0445m690J7075Q491j2392K1841J2586j1009k3641p691Q29K1009M56
$$ 8704 -11741 -16431 644 9135 -3257 18584 31170 20161 -3480 -11171 -10342 10667 11123
2781A1123k8311J1755K2206L138J0223j026J5489j6770j4828J7980j8898m99j0303
$$ 11123 -17188 -5433 16773 19911 30134 29108 44597 27827 12999 30979 12081 11582 1279
2768A279j294M058l0585j2407M4240M4872R140p171j3784j0786j8639P802q684
$$ 1279 -15 4043 -26542 -38949 5291 50163 59303 52132 38348 27562 8923 16725 8041
2755H041m425K380m414P148k8818q612N63J1401J597q967n59J6546L825J0721
$$ 8041 3616 5996 1582 8730 -20088 -28700 -28137 -16736 -15139 -24106 -24665 -8119 -4294 6427
2741F427k2689M242p139j5945p619O207Q617O457l2247p319K3367J3337j5749
$$ 6427 -16262 -12020 -19159 -35104 -42723 -36516 -27899 -21442 -53689 -61008 -37641 -24304 -40053
2728d0053M848m842q104J4261j620l834j0414J5692J2476J6131k495J6982o51
$$ -40053 -35205 -40047 -48151 -33890 -35510 -39344 -49758 -34066 -21590 -5459 -7954 9028 8377
2715H377q871N249l024k4135J5262J7661Q891j2832j9168J427R27J2718L900m963
$$ 8377 -494 4755 1731 -22404 -7142 10519 19410 6578 -12590 -11163 -10236 2482 6382 1419
2701A419k2973O195N350l5817k691M6860J9482L729k646n418J3985L038j7953
$$ 1419 -21554 -15359 -10009 -45826 -48517 -1657 17825 21554 18908 13490 27475 30513 12560
2688A2560l0085l1047J7599J0053N799J083J2894l452j9717m327J9105J4991J6213
$$ 12560 -17525 -48572 -30973 -20920 -15121 -14038 -1144 -4596 -24313 -28640 -9535 5456 21669
2675B1669J247p499L966Q054j1782p678P139l724M700o176m937p356j3296j0587
$$ 21669 22916 15417 19383 27437 15655 7977 15116 11392 16092 9916 4979 -2377 -15673 -26260
2661b6260M784j5032J4035j3132K481L2509Q928N759K3437j963k5280j8761K3571
$$ -26260 -21476 -36508 -22473 -35605 -33124 -615 8313 14072 37509 35546 10266 -8495 15076
2648A5076J689k4101j5530q266J7870m854l1698J924K1760O347Q638p877m369
$$ 15076 16765 -7336 -22866 -31132 -13262 -18116 -49814 -47890 -26130 -19783 -11145 -19022 -23391
2635b3391K4250k162O571j2543r803l019J1907q657O471J9876J863J7094K4383
$$ -23391 859 -1303 5268 -7275 -17078 -20097 -8190 -16847 -10376 9500 11363 28457 52840
2622E2840k1616q955J0947J133k0415R226j8183j2718N310R804R899O183r876
$$ 52840 31224 22269 33216 34349 13934 23160 4977 -7741 -2431 7373 17272 23455 13579
2609A3579k1062q810j5094j1494J5427K3115j413m410P655r94p19J1093K0638
$$ 13579 -7483 -16293 -31387 -42881 -27454 -4339 -5752 -10162 -2507 -3501 -4220 6873 27511
2596B7511q799j2181L633j337R374J6218l0927Q362L591J4096P267j4055j570
$$ 27511 18712 6531 10164 8827 18201 34419 3492 11854 15445 29541 36808 22753 21183
2583B1183J4055o020j2978L790K547j0546k6827M0571J2059J0539J1910j4585
$$ 21183 35238 29218 16240 20030 22577 12031 -14796 25775 37834 48373 60283 45698
2571D5698k3265k3498l522m842r969K1323Q163K947L240L897j2851j4757J1211
$$ 45698 22433 -1065 -4587 -9429 -19398 1925 10088 13035 16275 20172 7321 -7436 3775
2558C775j7025N956l122K170L1376K4228r716J717j7699j7289o521J1023J9082
$$ 3775 -13250 -7294 -10416 -8246 23130 47358 37642 39359 21660 4371 -2150 8873 27955
2545B7955J2092l838R321l278K5856K461k5624k6983M933L932r508o966k8203
$$ 27955 40047 36209 45530 42252 68108 70569 44945 17962 22895 26827 17319 10353 -17850
2532a7850k6798j1049M6609K3059P578K3062n260k1836m6054p467J0774J2144
$$ -17850 -44648 -55697 -9088 13971 21549 44611 39351 17515 -28539 -36006 -25232 -13088
$$ [...]
##END NTUPLES=NMR SPECTRUM
##END=
