##TITLE=Analysis number 317756
Compound Code mo 00927
Project Code adrs
Chemist Name ugmt
##JCAMPDX= 6.0         $$ Bruker NMR JCAMP-DX V2.0
##DATA TYPE= NMR SPECTRUM
##DATA CLASS= NTUPLES
##ORIGIN= Bruker BioSpin GmbH
##OWNER= nmr
$$ XWIN-NMR		Version 3.5
$$ Thu Mar  2 14:35:09 2006 GMT Standard Time (UT+0h)  MAYBRIDGE\nmr@NMR_250MHZ
##.OBSERVE FREQUENCY= 250.131544655141
##.OBSERVE NUCLEUS= ^1H
##.ACQUISITION MODE= SIMULTANEOUS (DQD)
##.ACQUISITION SCHEME= undefined
##.AVERAGES= 16
##.DIGITISER RES= 18
##SPECTROMETER/DATA SYSTEM= dpx250
##.PULSE SEQUENCE= zg30
##.SOLVENT NAME= CDCl3
##.SHIFT REFERENCE= (INTERNAL, CDCl3, 0, 16.522)
##AUDIT TRAIL= $$ (NUMBER, WHEN, WHO, WHERE, WHAT)
$$ ##TITLE= Audit trail, XWIN-NMR		Version 3.5
$$ ##JCAMPDX= 5.01
$$ ##ORIGIN= Bruker BioSpin GmbH
$$ ##OWNER= nmr
$$ C:\u/data/dgb/nmr/ADRS/17290/pdata/1/auditp.txt
$$ ##AUDIT TRAIL=  $$ (NUMBER, WHEN, WHO, WHERE, WHAT)
(   1,<2006-03-02 14:34:47.14 +000>,<MAYBRIDGE\nmr>,<NMR_250MHZ>,
      <created by zg, POWCHK disabled, PULCHK disabled
       configuration hash MD5:
       84 BC 41 DB A1 6E 1D 46 DA 25 12 A5 C1 ED C5 3A
       data hash MD5: 64K
       05 2D 57 9D D5 7E 0A D4 43 F0 0B 02 E2 FA 13 16>)
(   2,<2006-03-02 14:35:00.48 +000>,<MAYBRIDGE\nmr>,<NMR_250MHZ>,
      <Start of raw data processing
       ef LB = 0.3 FT_mod = 6 PKNL = 1 SI = 32K 
       data hash MD5: 32K
       26 1D 45 D8 D1 5C 11 F0 9E 36 EF 9C 02 3C 98 DE>)
(   3,<2006-03-02 14:35:02.25 +000>,<MAYBRIDGE\nmr>,<NMR_250MHZ>,
      <apk 
       data hash MD5: 32K
       1D 9F C2 B2 AC F0 7D CA C4 43 F6 80 26 23 F2 E5>)
(   4,<2006-03-02 14:35:03.15 +000>,<MAYBRIDGE\nmr>,<NMR_250MHZ>,
      <abs ABSG = 5 
       data hash MD5: 32K
       B9 E2 0C A5 2C 36 BE C8 F1 52 69 C0 CB DF 66 CE>)
$$ ##END=
$$ 
$$ hash MD5
$$ 26 DF 36 0F 77 5E 5D DA 37 C6 39 D9 B5 AB 0B 46
##$RELAX= 
##$RELAX= 
##$RELAX= 
##$RELAX= 
##$RELAX= 
##$RELAX= 
##$RELAX= 
$$ Bruker specific parameters
$$ --------------------------
##$DU= <C:\u>
##$EXPNO= 17290
##$NAME= <ADRS>
##$PROCNO= 1
##$TYPE= <nmr>
##$USER= <dgb>
##$AMP= (0..31)
100 100 100 100 100 100 100 100 100 100 100 100 100 100 100 100 100 100 
100 100 100 100 100 100 100 100 100 100 100 100 100 100 
##$AQSEQ= 0
##$AQ_mod= 3
##$AUNM= <au_zg>
##$AUTOPOS= <28 >
##$BF1= 250.13
##$BF2= 250.13
##$BF3= 250.13
##$BF4= 250.13
##$BF5= 500.13
##$BF6= 500.13
##$BF7= 500.13
##$BF8= 500.13
##$BYTORDA= 1
##$CFDGTYP= 0
##$CFRGTYP= 5
##$CHEMSTR= <none>
##$CNST= (0..31)
1 1 145 1 1 1 1 1 1 1 1 1 1 1 1 1 1 1 1 1 1 1 1 1 1 1 1 1 1 1 1 1 
##$CPDPRG= <>
##$CPDPRG1= <>
##$CPDPRG2= <>
##$CPDPRG3= <>
##$CPDPRG4= <mlev>
##$CPDPRG5= <mlev>
##$CPDPRG6= <mlev>
##$CPDPRG7= <mlev>
##$CPDPRG8= <mlev>
##$CPDPRGB= <>
##$CPDPRGT= <>
##$D= (0..31)
0 1 0 0 0 0 0 0 0 0.06 0 0 0 0 0 0 0.0002 0 0 0 0 0 0 0 0 0 0 0 0 0 0 
0 
##$DATE= 1141310086
##$DBL= (0..7)
120 120 120 120 120 120 120 120 
##$DBP= (0..7)
150 150 150 150 150 150 150 150 
##$DBP07= 0
##$DBPNAM0= <>
##$DBPNAM1= <>
##$DBPNAM2= <>
$$ [...]
##$SUBNAM7= <"">
##$SUBNAM8= <"">
##$SUBNAM9= <"">
##$SW= 20.6930455092707
##$SWIBOX= (0..15)
0 0 3 0 0 0 0 0 0 0 0 0 0 0 0 0 
##$SW_h= 5175.983436853
##$TD= 65536
##$TD0= 1
##$TE= 293.16
##$TE2= 300
##$TE3= 300
##$TEG= 300
##$TL= (0..7)
0 120 120 120 120 120 120 120 
##$TP= (0..7)
150 150 150 150 150 150 150 150 
##$TP07= 0
##$TPNAME0= <>
##$TPNAME1= <>
##$TPNAME2= <>
##$TPNAME3= <>
##$TPNAME4= <>
##$TPNAME5= <>
##$TPNAME6= <>
##$TPNAME7= <>
##$TPOAL= (0..7)
0.5 0.5 0.5 0.5 0.5 0.5 0.5 0.5 
##$TPOFFS= (0..7)
0 0 0 0 0 0 0 0 
##$TUNHIN= 0
##$TUNHOUT= 0
##$TUNXOUT= 0
##$USERA1= <user>
##$USERA2= <user>
##$USERA3= <user>
##$USERA4= <user>
##$USERA5= <user>
##$V9= 5
##$VALIST= <valist>
##$VCLIST= <CCCCCCCCCCCCCCC>
##$VD= 0
##$VDLIST= <DDDDDDDDDDDDDDD>
##$VPLIST= <PPPPPPPPPPPPPPP>
##$VTLIST= <TTTTTTTTTTTTTTT>
##$WBST= 1024
##$WBSW= 4
##$XGAIN= (0..3)
0 0 0 0 
##$XL= 0
##$YL= 0
##$YMAX_a= 430516
##$YMIN_a= -457998
##$ZGOPTNS= <>
##$ZL1= 120
##$ZL2= 120
##$ZL3= 120
##$ZL4= 120
##$ABSF1= 16.522
##$ABSF2= -4.171173
##$ABSG= 5
##$ABSL= 3
##$ALPHA= 0
##$AQORDER= 0
##$ASSFAC= 0
##$ASSFACI= 0
##$ASSFACX= 0
##$ASSWID= 0
##$AUNMP= <proc_1d>
##$AZFE= 0.1
##$AZFW= 0.1
##$BCFW= 0
##$BC_mod= 0
##$BYTORDP= 0
##$COROFFS= 0
##$CY= 12.5
##$DATMOD= 1
##$DC= 0
##$DFILT= <>
##$DTYPP= 0
##$F1P= 14.0000005364418
##$F2P= -0.99999901652339
##$FCOR= 0.5
##$FTSIZE= 32768
##$FT_mod= 6
##$GAMMA= 0
##$GB= 0
##$INTBC= 1
##$INTSCL= 1
##$ISEN= 128
##$LB= 0.3
##$LEV0= 0
##$LPBIN= 0
##$MAXI= 10000
##$MC2= 0
##$MEAN= 0
##$ME_mod= 0
##$MI= 0
##$NCOEF= 0
##$NC_proc= -2
##$NLEV= 6
##$NOISF1= 0
##$NOISF2= 0
##$NSP= 0
##$NTH_PI= 0
##$NZP= 0
##$OFFSET= 16.522
##$PC= 1
##$PHC0= -108.0257
##$PHC1= 3.913122
##$PH_mod= 1
##$PKNL= yes
##$PPARMOD= 0
##$PSCAL= 4
##$PSIGN= 0
##$REVERSE= no
##$SF= 250.13
##$SI= 32768
##$SIGF1= 0
##$SIGF2= 0
##$SINO= 400
##$SIOLD= 32768
##$SREGLST= <1H.CDCl3>
##$SSB= 0
##$STSI= 32768
##$STSR= 0
##$SW_p= 5175.98343685301
##$SYMM= 0
##$S_DEV= 0
##$TDeff= 65536
##$TDoff= 0
##$TI= <Analysis number 999999
Compound Code 99
Book Reference 9
Project Code 9>
##$TILT= no
##$TM1= 0
##$TM2= 0
##$TOPLEV= 0
##$USERP1= <user>
##$USERP2= <user>
##$USERP3= <user>
##$USERP4= <user>
##$USERP5= <user>
##$WDW= 1
##$XDIM= 32768
##$YMAX_p= 323859888
##$YMIN_p= -126965
$$ End of Bruker specific parameters
$$ ---------------------------------
##NTUPLES= NMR SPECTRUM
##VAR_NAME=  FREQUENCY,     SPECTRUM/REAL,   SPECTRUM/IMAG
##SYMBOL=    X,             R,               I
##VAR_TYPE=  INDEPENDENT,   DEPENDENT,       DEPENDENT
##VAR_FORM=  AFFN,          ASDF,            ASDF
##VAR_DIM=   32768,         32768,           32768
##UNITS=     HZ,            ARBITRARY UNITS, ARBITRARY UNITS
##FACTOR=    0.157963299565203, 1,           1
##FIRST=     4132.6476996994, 0,             0
##LAST=      -1043.33573715361, 0,           0
##MIN=       -1043.33573715361, -126965,     0
##MAX=       4132.6476996994, 323859888,     0
$$ Real data points
##PAGE= N=1
##DATA TABLE= (X++(R..R)), XYDATA
$$ [...]
24461b0878k9366Q998L2942J9009L3172k998L446N925j635n286l2086J6607j6898
24448A0952l3403j0066j0127J3219j1722J0363L0324J2682o07j7967J075q290
24436a3567j5621j3649m439P311n765l687j6464M583K4113M0484M3066m658m7684
24423e977k464J8212m863j5517J1706l2676o2968J1624K465J4535J7872O034J3092
24410b8925J381L318j5007J8279r300R07J8184o455M770j954m047K7935J4087
24397B3173J4497R720j5108m538k3762j1806k360R762J3133M292K0972o084k663
24384B9228O542k4050j3374p052K3282J1300J8393l035O77J1275j0170N670j6627
24371C2059l4856k1082j2385K329J8028Q813L974j2212k878J1476M9256Q898k9637
$$ y = [-20878, -50244, -41246, -8304, 10705, 43877, 40879, 44325, 50250, 48615, 43329, 11243, 27850, 10952, -22451, -32517, -42644, -29425, -41147, -30784, -460, 12222, 11615, -6352, -5277, -13567, -29188, -42837, -47276, -39965, -45730, -49417, -65881, -61298, -37185, 3299, 46365, 41707, -5977, -8441, 9771, 4908, -10609, 1097, -31579, -94547, -82923, -80458, -65923, -48051, -42017, -28925, -27544, -24226, -39233, -20954, -30254, -29347, -11163, -17618, -12848, -14802, -18849, 9086, 23173, 37670, 47390, 32282, 27744, 3982, -7824, -10184, -422, 12711, 17003, 37975, 31891, 29228, 35770, 11720, -1654, -8706, 14576, 25876, 44269, 41234, 41911, 53186, 43016, 48686, 32059, -2797, -23879, -36264, -33935, -15907, -7094, -3120, -15332, -18210, -6734, 42522, 51420, 21783]
24358B1783k4328N597J5843k0969l4M728n841j0656o817k690k0351j2057K5998
24345b9794O062J1757Q491N425m0987n59N1285k2478p620l787l831k3675O930
24332d2781J5009J7717k542R18J0672L7192p413k7238m867l1973m7710K8741L3598
24319b0677J0923P794J9645j5760l5943j6949p322R814N1937L3352J5503j5931
24307C6386k2947k8190k8627k3656K9090J4796l25l2005k939L0567K8040L4858
24295C5048l479m2438j6982K0150K4953N530J3261j5367m017J5820k3317M588
24283A3750j3356K7012j3994j6551r650K8992K2648J8045q96l7428l639j205l3673
24270a9945j0315J6290K974r669L3279L1024j5904k832j0993l3955l765J5247
$$ y = [21783, -2545, 3052, 18895, -2074, -2108, 2620, -3221, -13877, -20694, -23384, -43735, -55792, -29794, -23732, -11975, -3484, 1941, -39046, -39605, 11680, -10798, -18418, -22205, -26036, -49711, -42781, -27772, -10055, -12597, -11679, -1007, 36185, 28772, 1534, -3333, -35306, -83016, -54275, -20677, -9754, -1960, 17685, 1925, -34018, -50967, -58289, -48475, 3462, 36814, 52317, 36386, 13439, -14751, -43378, -67034, -37944, -23148, -23473, -55478, -58417, -27850, 190, 35048, 31569, -10869, -27851, -7701, 17252, 22782, 36043, 20676, 16659, 32479, 9162, 13750, 394, 27406, 13412, -3139, -12789, 16203, 38851, 56896, 56000, 18572, 14933, 13728, -19945, -30260, -13970, -10996, -20665, 12614, 43638, 27734, 24902, 13909, -20046, -23811, -8564]
24258h564L587p899p291J6372l082K717J337J0895j961K063k0588L467J6100J7412
24244B4565K3526k3237m2400L3816K0407j5484k98j1131k8537j0394p459K5349
24232a1277j19K3983j0917k5174n921n911o873k2559J1985J7354R279J2739j1107
24219b4518k1493J5421J0586m005M025L9236K9295j4933k9424j1713k1798J881
24207b7440M296J4391j7087N795J4598q750k6346j8394r5K1913L0096J3543l043
24194C477m3926J0191L1086j7286k8439r202Q791J4355J5940k3276j3747j9116
24182g1152L1438J4498J2866j27k9608J818J8554m230P675k3577q93L4923K8486
24169B0671J7186m179l5446J0621M5942j4719j7336O014P132j1173j6004Q391
$$ y = [-8564, -4977, -12876, -20167, -3795, -6877, -4160, -2823, 8072, 6111, 8174, -12414, -8947, 7153, 24565, 48091, 24854, -17546, 16270, 36677, 21193, 20895, 9764, -18773, -29167, -36626, -11277, -11396, 12587, 1670, -23504, -29425, -35336, -42209, -64768, -52783, -35429, -26150, -13411, -24518, -46011, -30590, -20004, -24009, -19984, 19252, 48547, 33614, 4190, -7523, -29321, -27440, -23144, -8753, -25840, -20045, -5447, -14197, -40543, -58937, -59032, -37119, -7023, 6520, 3477, -40449, -30258, 828, -16458, -44897, -54099, -45308, -30953, -15013, -38289, -52036, -71152, -39714, -25216, -12350, -12477, -42085, -40267, -21713, -25943, -18268, -41845, -42738, -7815, 20671, 37857, 33678, -1768, 8853, 54795, 40076, 22740, 28754, 35886, 24713, 8709, 17100]
24157A7100Q610J1079p707k5226m789r916Q638j4140J33J1321K0144k719k144
24144A0384J2948J0014K697L1192m678p806K859l9719k9383j4531K8910r984J5662
24131H565J1250R893j1796j5489P721k275j6348l2017M775N1905K7246r041k1042
24118A3347K4002l532l2179J2110J1292j6821j9915j1140P902j5365k8116l686
24106f2101P982L3922J5745k713K7715n081j2980j3096M27q873j8388k644L9384
24093g01K8721j9219r36K9233K356k3480m1119j0328K5776J9457j7274Q036q863
24080h341j2776j1071P7o266J2775K2563j633M592k3953k0052O529m445p646K0177
24066b9470L0901l130L668L4986J4131n938j7343l0163M816k014M295k5044J5041
$$ y = [17100, 25710, 36789, 29082, 3856, -933, -10849, -2211, -16351, -16218, -4897, 15247, 12528, 10384, 23332, 33346, 36043, 67235, 62557, 54751, 57610, 17891, -11492, -26023, 2887, -7097, 8565, 19815, 29708, 17912, 2423, 10144, 7869, -8479, -40496, -35721, 16184, 43430, 34389, 13347, 37349, 33817, 1638, 13748, 25040, 8219, -11696, -22836, -14934, -30299, -58415, -62101, -54119, -20197, -4452, -7165, 20550, 15469, 2489, -10607, -10180, -19053, -37441, -40085, -701, 28020, 8801, 7865, 37098, 39454, 15974, -25145, -35473, -9697, 9760, -7514, 522, -8341, -21117, -32188, -32111, -38377, -25602, -3039, -4672, -80, -24033, -44085, -37556, -42001, -49647, -29470, 1431, -1699, 1969, 36955, 51086, 45148, 27805, -2358, 2458, 444, 4739, -20305, -5264]
24053e264k3572n814L2307J1065N7150M4580j5333l9903n2896k5897J8104J0414
24041D941k5727R500J4353J9052P482k038L088k6906j9283o123M144r120L658
24028b2979P505k66j1192K5420O464l179j3431K2312L2691n365j1653j4977m126
24015G224o471M285J0134k7624j48R868K5866j1910j2407k1147N581P012L2482
24002B2745M2871j9767m885k9384l0282L023K5354j7082j2789j9477M72K5996
23990a3205o822J9586O371j0151q37J6079R398J2290j4331n675k1812k8210N781
23977c1538K3127J2305j8838j3675J8218K1071j8315L303J3627P252k617m4479
23965c0559K4565J3321O089p644L744M257J7741L155m6843l0098K5057K6627r619
$$ y = [-5264, -28836, -34650, -2343, 8722, 65872, 110452, 95119, 55216, 2320, -23577, -5473, 4941, -20786, -11286, 3067, 22119, 29601, 27563, 30651, 3745, -15538, -21661, -17517, -26637, -22979, -15474, -15740, -26932, -1512, 4952, 1773, -11658, 10654, 43345, 37980, 26327, 11350, 7224, 753, 5038, 15172, -12452, -12600, -2732, 23134, 11224, -1183, -22330, -16749, -9737, 22745, 65616, 45849, 40964, 11580, -18702, -15679, 9675, -7407, -20196, -39673, -39201, -13205, -20027, -441, 5930, -4221, -5058, 11021, 20419, 32709, 18378, 12703, -9109, -37319, -31538, -8411, 3894, -14944, -28619, -10401, 10670, -7645, -4342, 9285, 16537, 13920, -30559, -5994, 7327, 13416, 5772, 9516, 13773, 31514, 34669, -12174, -42272, -17215, 9412, -207]
23952b07j5288J3634N5K5251J0172j5893k8049k0392J6160K7230J3025r680K730
23939A8748j2375j2716Q141L7541K763J142R825K553k4944q471q98n633j5483
23926A93k382J3007K83j291J7156l1935q069K4314K1197j0584K189j8391j1090
23913e403L4369j1433k8575J707o634N786k2262J7994K4307k7974j0977k0633
23901d9728p967M5685K1466j3837n544k8178j3126K8239L7361k3627j4162J0458
23889a2960P896r27p59j5576l1176j3187M546M5001L2588L8673j1888k8122m6356
23876c2247k2181K3108O998O635q693K4484K2908j2578j5231j1336R641P589M1708
23863D0805K0036J714l038J5047J4746l7680j0762R364J1997k2256M540J8545
$$ y = [-207, -15495, -1861, -1806, 23445, 33617, 17724, -10325, -30717, -14557, 12673, 25698, 16018, 18748, 6373, -6343, 1798, 39339, 42102, 43244, 53069, 55622, 30678, 22207, 21309, 15676, 193, -2189, 10818, 11101, 9810, 26966, -4969, -13038, 11276, 32473, 21889, 24078, 5687, -5403, 28966, 17533, -11042, -9335, -15969, -10183, -32445, -14451, 9856, -18118, -29095, -49728, -57695, -12010, 9456, -4381, -9925, -38103, -51229, -22990, 14371, -9256, -23418, -12960, -5064, -5991, -6750, -22326, -53502, -66689, -62143, -17142, 15446, 54119, 42231, 14109, -32247, -54428, -31320, -24322, -17687, -26380, -1896, 21012, 8434, -6797, -18133, -8492, -903, 40805, 60841, 62555, 59517, 74564, 89310, 51630, 40868, 50232, 62229, 39973, 44513, 63058]
23851F3058r407k5288j4673Q099j5523K1336J366k0111j9166l817K2661L3582
23839D2117l630k3176p530k0492J7045j2933K004K059K0947K4741J2397r259J7866
23826F2156O03r213l2547k6511j1374j1234M0769K2237j7227l0731J781j1968
23814b3259K3109J2026K1429m983J0327j5803k4824p37j7391Q305J0975j0678
23802a1504k5663K3838M6165K5613k7886k8718R621M40l7570r417N817L9453L1086
23789D1275m3267j3473j614k4048j4191P306L7722L1179j458j1340L066J5551
23777B6708Q89l0197j6899M0759K4736Q460k8872j3677J3103J9693q34l3894m5016
23764c5041K9829K8445j5268Q055J0658j480k4998j7003L3273M0266k0486j3122
$$ y = [63058, 53651, 28363, 13690, 21789, 6266, 27602, 28968, 8857, -10309, -14126, 8535, 42117, 38487, 15311, 7781, -12711, 4334, -8599, -6595, -4536, 16411, 41152, 53549, 44290, 62156, 62759, 53546, 20999, -5512, -16886, -28120, 12649, 34886, 17659, -13072, -11291, -23259, -150, 11876, 33305, 28322, 38649, 22846, -1978, -2715, -20106, -11801, -826, -11504, -37167, -13329, 32836, 58449, 30563, 1845, 11466, 11906, -25664, -35081, -29264, 10189, 41275, -1992, -15465, -17079, -41127, -55318, -48012, -10290, 20889, 19431, 8091, 11157, 26708, 27597, -2600, -19499, 21260, 45996, 54456, 25584, 11907, 25010, 44703, 43869, 9975, -35041, -5212, 23233, 7965, 16020, 26678, 25198, 200, -16803, 16470, 56736, 36250, 23128]
23752B3128L546o671j8946P597J7117k4476l803J5139J7138j0565m878M644q934
23739A0036L2816J0545o096l3220j4999J0332K124N193k3451p417N080l887Q702
23726d242j7959l8724q696K1688K5457l50J0603J6583L8705l1308m0655P800r417
23713c0515J0171q864o955K6775L1338R500j4199q962j2669j5647J1920J6742
23701H635J5960J4587J5729k1127l3537N51J0492j221m87p789k9640L001J4691
23688a0155M837O422L3768J4080m6493l4854j3492J3937j3189K284L0654J5132
23676B931O240q236q791L5336l2598N320M8721j3271K8794m0726m7053k111Q157
23663a7287N813K9397j2143j9891K177J1804J2957j0313m7259J733L6258J886
$$ y = [23128, 26674, 20003, 1057, 8654, 25771, 1295, -2508, 12631, 29769, 19204, 14326, 18970, 10036, 42852, 53397, 47301, 14081, -918, 9414, 11538, 16731, -6720, -14137, -9057, -12944, -4242, -22201, -60925, -69621, -47933, -22476, -22826, -12223, 4360, 43065, 11757, -28898, -21098, -30515, -20344, -29208, -36163, -9388, 21950, 31450, 17251, 8289, -4380, -20027, -8107, 8635, 24595, 39182, 54911, 33784, 247, 798, 11290, 10069, 9582, 1793, -27847, -24846, -10155, -5318, 1104, 34872, 48952, 2459, -32395, -45887, -31950, -45139, -42855, -12201, 2931, 9171, 935, -7856, 27480, -5118, 202, 48923, 35652, 64446, 23720, -23333, -25444, -17287, -11474, 17923, 5780, -14111, -11934, -130, 12827, 2514, -44745, -43012, -6754, -4868]
23651d868K2341K8903j0822J2529k570k9629K202J8622l341k5196J08K3780K639
23638C4698L626j9399O908M232q686j1378j3417m285j2485J6961J6854j0391l0965
23625b7727k1520J2049J3154M3088j825J0109k6499j0484K7428k2459l0901J3175
23613b2412j969r37K0373L7432r052m4965K9016L4638Q091k6607k7020P270Q643
23600A2501O503j0335k3567j895M1099J2199r032k5643j1579j7414Q85j9979J3866
23587c2391J6649k0377M638M5522N1082K8498j3936j9222j6911j9024j0523O053
23575B0058L4305L6299j95m4921N167K9064l1775K0172J6397l5963k7733J7452
23563C8327J0919j7063m1806p255K463K1964M4952r14j2239m0562n222L751J4129
$$ y = [-4868, 17473, 46376, 35554, 48083, 45513, 15884, 18086, 36708, 33367, 8171, 8279, 32059, 34698, 38324, 18925, 25833, 30065, 21379, 10001, -3416, -7701, -20186, -3225, 13629, 3238, -27727, -49247, -37198, -24044, 19044, 17219, 27328, 829, -9655, 17773, -4686, -35587, -22412, -24381, -25318, -4945, 32487, 23435, -21530, 7486, 42124, 50215, 23608, -3412, 3858, 12501, 19004, 8669, -14898, -16793, 24306, 36505, 27473, 1830, -9749, -27163, -26278, -46257, -32391, -15742, -36119, -31481, 14041, 65123, 93621, 79685, 60463, 43552, 24528, 14005, 20058, 54363, 90662, 90467, 45546, 50713, 79777, 48002, 68174, 84571, 48608, 20875, 38327, 49246, 32183, -9623, -16878, -14415, 7549, 52501, 51587, 39348, -1214, -6436, -2685, 11444]
23550A1444P659j686K6860l1552k8675L1678K3588q963l1496L44J4168O523N760
23537B5652l4769l1392K7879L6153k259R760j9714j5311R809p027O683o29M465
23524I300J3932K161J014J0660k0135j0213k374J431j829J5170n081j5230p699
23511h893J6510J6064K1831J9106r326k7307L514k5981m4319K1460K3328j5505
23499i518j4468j9538J5602J023k530o651l3218M688M5997M2964K4340k1914k0708
23486F069k4217q658J9404J4695o861q328P522R829J988j8587P583o403o894j2989
23472b5847l643K5583J9783o09k4418r613P841l923k5260k314J7184O659J2288
23459f289j8434J8743R805o70n596l4259l308L2721J6326k916j534k8636j9153
$$ y = [11444, 19103, 17417, 44277, 12725, -15950, 15728, 39316, 30353, -1143, -799, 13369, 19892, 25652, -9117, -40509, -12630, 23523, 21264, 31024, 11310, -4001, 5808, -1219, 5464, 4835, 9300, 23232, 25393, 26407, 37067, 16932, 6719, 4345, 5776, 3947, 19117, 14036, -1194, -8893, 7617, 23681, 45512, 64618, 55292, 27985, 31499, 5518, -38801, -17341, 5987, -9518, -23986, -43524, -27922, -26899, -29429, -36080, -69298, -64610, -18613, 24351, 48691, 26777, 6069, -18148, -26806, -7402, 7293, 432, -7896, -374, 9455, 11443, -7144, 439, -5964, -12858, -25847, -29490, -3907, 15876, 15267, -9151, -18764, -10923, -14846, -40106, -42420, -25236, -18577, -6289, -24723, -5980, 3825, 3155, -2441, -36700, -40008, -7287, 9039, 6123, 4589, -24047, -43200]
23446d3200K0487p399L0528P5O117J478k3321j961J4524k3849j6152K6622J4111
23433a940l1641J5081J442N680K4275J1556n78l2034j3684K1083L4979l256j1974
23420A8989P3q849m7297J090K987j0391P143p964k508Q34j0514J0184j0969K4134
23406c3058N022k749K778l730J3386K769J4362q224l7071j2060K4048J0020j7666
23393d2173J6493K5935k9468l4139J3984L7082J5821L3711j4110j4765j023J7420
23381B4768o308j0852n94J7078L191M590l3785j8232J6881N714J9850k6730k7140
23368c1569K0301K1846j194p575j9729k5999p102K0726J3161L2025j7574n1925
23356e4608J769L1760j234j1946J4485Q840N790o962j5058k1938j4743K4337L4955
$$ y = [-43200, -22713, -30112, 416, 491, 6608, 8086, -15235, -17196, -2672, -26521, -42673, -16051, -1940, -33581, -18500, -17058, -11378, 12897, 24453, 23875, -8159, -21843, -760, 34219, 30963, 18989, 19062, 10213, -37084, -35994, -33007, -43398, -36255, -44219, -46727, -45893, -56407, -46223, -57192, -33058, -28036, -30785, -28007, -31737, -18351, -15582, -1220, -9444, -46515, -58575, -34527, -24507, -42173, -25680, 255, -29213, -63352, -49368, -12286, 3535, 37246, 23136, 8371, 7348, 24768, 18460, 7608, 7014, 24092, 27283, 31873, -1912, -20144, -3263, 2451, 22301, -4429, -31569, -11268, 10578, 9384, 1809, -17920, -43919, -51021, -30295, -17134, 14891, -2683, -54608, -52839, -21079, -22313, -34259, -19774, -10934, -5144, -12106, -27164, -49102, -63845, -39508, -4553]
23343d553l555q207L714J1983M6273l748m1624j8999J2538o019k3618R875J9868
23330f072J2529l193l2291m9128K2847L0959L3113K0831m553m181l0368M006J5462
23317I961k4890J6418K0114j5337j412K6939j0321j8124j5218R421J439L036k630
23304f04P416J0561r530l3316k4078L4192J3765l7133m770j038p910J8242Q771
23291b5432L0261n028L632p450r389J2782J4835J6069j1217M916K2806L381k3565
23278B6601k1079N300k7920j7278J6116l377k515n125n901O260L564j945K3732
23265c567K3065r088j6225l1836j2049n085j5886M1336L8162J0394k9673M049
23253f403O661l4917J628l463j6929m6424J1784J01216K5949k1064l3535k6326
$$ y = [-4553, -8108, -16315, -12601, -618, 45655, 41907, 283, -18716, -6178, -12197, -35815, -25940, -6072, 6457, 3264, -29027, -78155, -55308, -24349, 8764, 29595, 25042, 20861, -9507, -5501, 9961, -14929, 1489, 21603, 6266, 4854, 31793, 21472, 3348, -11870, -2449, -1010, 2026, -604, 6812, 17373, 7843, -25473, -49551, -15359, -1594, -38727, -43497, -44535, -52445, -34203, -25432, 4829, -199, 3433, -4017, -13406, -624, 14211, 30280, 19063, 23979, 46785, 50166, 26601, 5522, 10822, -17098, -34376, -18260, -21637, -24152, -29277, -35178, -28918, -25354, -27299, -3567, 19498, 10410, -5815, -37651, -49700, -54785, -70671, -29335, 8827, 19221, -10452, -6403, 258, -34659, -33031, -36494, -53423, -99847, -88063, 13153, 39102, 18038, -15497, -41823]
23241d1823K6449K5149j460J6396M18o958j1520Q597j8988j9723N104K0941j898
23228F84j7308N953J116J3276r362m619k4349j7269o873J9621P256O878K5714
23215G18L2145M402J339j4667l5476j5872J0439J6304N0352q611M0761P958l4104
23202E5688m4892q858R055K339j9051p513J4750l109J8347q7l9864P06L8617j700
23188A4428l9110j6083J3559J2943L6709l898m3865j1021k7073L876J7844M422
23176c7269K5499J5353L8537J0794k479k654J5068J8658o918j8678m6463k1452
23164a2004Q310O933O796N560J0585L4993j7919j7440j7654j8003j3806k3324
23152d6973M849j3956k6150J8721R110J2598L1265P709j2982n998L0690K2510
$$ y = [-41823, -15374, 9775, 8315, 24711, 25129, 18171, 6651, 15248, -3740, -23463, -18359, 2582, 684, -16624, -10671, -9555, 3721, -5641, -10260, -34609, -51878, -58751, -39130, -31874, -24996, 718, 32863, 37265, 38604, 23937, -11539, -27411, -16972, -668, 49684, 41073, 81834, 89792, 55688, 10796, 1938, 10993, 13332, -5719, -13232, 1518, -1591, 16756, 16669, -23195, -22489, 16128, 14428, -24682, -40765, -27206, -14263, 22446, 18548, -25317, -36338, -63411, -59535, -41691, -37269, -11770, 3583, 42120, 52914, 50435, 47781, 62849, 81507, 74589, 55911, 9448, -12004, -3694, 3239, 10035, 15595, 26180, 61173, 43254, 25814, 8160, -9843, -23649, -46973, -42124, -56080, -82230, -63509, -54399, -41801, -10536, -2827, -15809, -21807, 8883, 31393]
23140C1393J6814j5036k0999O773j2159l4007o056J3163q757J0547N5395r001
23128B8070q929m5141r122J7845J5521K1676L326j6319k0003j1186K2593Q580
23116F911j2855l268j4826Q527k377O716j6494o081j1259K0614J8564R94j583
23103f417K2531K536K7114K0634M393m3806N388m37l7950j7234L1653m379P5J3038
23089A7139k572J8580J4802M338l7011k8333l8109k5922L7850K3351j2589j7637
23077d6113K489K3591l459k0550P34j0460o340J3985Q296P371O749P674j4286
23064c0319r893L315l430J2915J7067K1011L753n201p307K471j2378q540K0297
23051C761K8399P041l2986K5041K4815L427o800k3096m0123k5264K3362Q471k2874
$$ y = [31393, 48207, 33171, 12172, 18945, 6786, -27221, -33277, -20114, -28871, -18324, 37071, 28070, 19141, -26000, -35122, -17277, -1756, 19920, 23246, 6927, -13076, -24262, -1669, 6911, -5944, -9212, -24038, -15511, -17888, -11172, -27666, -33747, -45006, -24392, -5828, -4834, -6417, 16114, 18650, 45764, 66398, 70791, 26985, 32373, 31936, -6014, -23248, 8405, 4026, 4101, 17139, 14567, 33147, 47949, 52287, 15276, -13057, -51166, -77088, -39238, -15887, -28476, -46113, -43624, -20033, -23492, -44042, -43308, -53768, -60108, -46123, -37827, -30456, -23707, -16033, -30319, -40212, -36897, -40327, -27412, -10345, 10666, 14419, 9218, 1911, 4382, -7996, -16536, 3761, 32160, 39201, 6215, 31256, 56071, 59498, 52698, 29602, -10521, -35785, -12423, -3952, -26826]
23038b6826q93P122k1453N322P851j1411K5246J132j7207J3034K2940j9105o000
23025b0248j3892R809p33K645L397N654M62K0697P12j3914N748k1064m080p1M0115
23010A5237J2330k7959j4835M000nk423j2607j5113p468Q513L6031L2866m295
22997B4272j5598k1861P311J8935l655j5985M683J9464l1459o282J5472l0422
22985c5125l9138K4243M0809K4078J2580j1993n0862j9257K8188n402m384J8936
22973a7327L0212K550K1611l885j9459j3678J3378J0788M366K2981J7004j2876
22961E5665m726l8878n0098j0609K1622J148J5386K6128o841r568l1434J3428
22949a8777J5551L508L4469J2711K3370J2220n28k4844k8099k1222l9494J141
$$ y = [-26826, -27719, -20597, -42050, -36728, -28877, -40288, -15042, -13910, -31117, -18083, 4857, -14248, -20248, -34140, -24331, -25064, -22419, -19022, -13368, -12906, 7791, 8503, -5411, 337, -20727, -24807, -24878, 15237, 27567, -392, -15227, -11227, -11232, -13655, -26262, -41375, -48843, -40330, -4299, 28567, 24272, 8674, -13187, -5876, 13059, 9404, -6581, -1898, 17566, -13893, -20175, -4703, -35125, -74263, -50020, -9211, 14867, 27447, 15454, -35408, -54665, -26477, -31879, -36263, -17327, 12885, 15435, 37046, 33161, 13702, 24, 13402, 24190, 28556, 51537, 68541, 55665, 50939, 12061, -38037, -48646, -27024, -25876, -10490, 15638, 8797, -771, -32205, -18777, -3226, 282, 34751, 47462, 70832, 83052, 82524, 57680, 29581, 8359, -31135, -29994]
22937b9994J0275k8437K2171l119j1928K6597K177m3568m726L0641J2292K3446
22925E827J2090m3096k7231m5335J7436J2628K8819j2869R727K6468J9208R150
22913A2822k1800o152l531j4003J56K4894o496M984K7919P40J2554J3583J5848
22900F1518k0888j5715K2893J8705J3302j5695k1137m8293K910j63j0753J7767
22888D451R363K193j8945j2098m298P487L9427J8201k2908M560m848J7955o336
22875C4204o95k7783J0702r413j964O790q625r52k3343p185L481K7622J6202j8179
22861H62L506J0359j830m609j219N627J1693L7020J1805l158k0041k8381J3895
22848C5529J3482k0209k124q287j5160l2826o286K5602K1036K831m00o220J980
$$ y = [-29994, -19719, -48156, -25985, -29104, -41032, -14435, -12258, -55826, -60552, -29911, -17619, 5827, 17917, -25179, -52410, -97745, -80309, -67681, -38862, -51731, -42004, -15536, 3672, 12822, -8978, -15130, -18661, -32664, -32508, -7614, -14110, -9126, 18793, 19533, 32087, 45670, 61518, 40630, 24915, 47808, 66513, 79815, 64120, 42983, -5310, -2400, -2563, -13316, 4451, 13814, 16007, -2938, -15036, -19334, -11847, 27580, 45781, 22873, 27433, 22585, 40540, 34204, 33509, 5726, 16428, 7015, 5051, 11841, 3216, 2264, -21079, -28264, -24783, 2839, 19041, 862, 4368, 14727, 12897, 8288, 7069, 12696, 24389, 61409, 73214, 70056, 50015, 21634, 35529, 49011, 28802, 26678, 18391, 3231, -29595, -35881, -10279, 10757, 13588, 13188, 6968, 8948]
22835H948k1763j533R145j3005J0669L7218o655O117L988m894r670k1648M82K6174
22821B3573o918K2171k4519j8761j709K267m3230l2277J5352L3239p018j511K0044
22808a9297K2268K0518j2335J0224q014r667k473k7711j344J7209p999L0930L1081
22795D3390N079k9462L835l2053k0564j3171J8197J6027M563l573p419K0022N846
22782A0717r081J8748j6767j2872J2866M625P999k0242q128j0073K0519j137j0865
22769a3691p369J2792m677q999M0404p9O613J0941O624J8092k0638m9294j3540
22756b2821j2K8702j6036j7149r544j63J3612j0028P507L0803m558k8724K5819
22743b592K1810m59l2503k3379q114Q653K8755K1229J9961M407l085j0771k0547
$$ y = [8948, -12815, -14348, -5203, -18208, -7539, 29679, 23024, 29141, 33129, 28235, 18565, -3083, -2601, 23573, 16655, 38826, 14307, -4454, -6163, -3896, -47126, -79403, -64051, -30812, -37830, -39341, -19297, 2971, 23489, 11154, 21378, 13364, 3697, 1224, -26487, -27831, -10622, -18621, 12309, 43390, 48469, 19007, 22842, -9211, -29775, -42946, -24749, -8722, -4159, -7732, -15151, 4871, 10717, 1636, 20384, 3617, -9255, 3611, 8236, 16235, -4007, -12135, -22208, -1689, -2826, -13691, -21060, -8268, -12945, -21944, 18460, 18381, 24994, 35935, 42559, 60651, 40013, -9281, -22821, -22833, 5869, -10167, -27316, -36860, -37023, -23411, -33439, -25932, 4871, 313, -28411, -2592, 19218, 18759, -13744, -37123, -45237, -36584, -7829, 13400, 33361, 37768, 34683, 23912, 3365]
22730C365J6996k1273J5777m690k2369J0338j420l833l390L3450J3736m2028L6109
22717C0768J2049j4919k2292j3360o344k5938l2168L2847M1200k0798j5401J2405
22705b1951K1256j3910k3566j3619J3708l994r518K9227l66r088M488K0515M978
22692a840m96K4503J4980j637k5976n565n395J955j5446R94M6469K5833j3974
22679D4405K3223k312j6388N13J1268M278L465L898j8313k7320j3646j5950N884
22666C005R517J1504P845m541k2488r509j6672p992P509L366N2724L1348r788
22653E5828j3436L783j448o692r114n839J953k204j7211q101Q082j3239l7512
22640d5150k3873q864J9851K9679J474J3385k1755J0146J3817M439q657k526j3353
$$ y = [3365, 20361, -912, 14865, 10175, -12194, -1856, -3276, -7109, -10499, 22951, 36687, -5341, 30768, 42817, 27898, 5606, -7754, -14098, -40036, -72204, -39357, 1843, -18955, -34356, -21951, -695, -14605, -38171, -51790, -38082, -42076, -51594, -22367, -22733, -31821, -27333, -6818, -1840, -2336, 22167, 37147, 35510, 9534, 3969, -1426, 529, -14917, -13923, 32546, 58379, 44405, 67628, 65316, 48928, 49441, 60709, 64987, 68452, 72350, 54037, 26717, 13071, -2879, 3005, 12522, 24026, 31871, 27330, 4842, -4667, -21339, -29331, -21822, -18456, 34268, 65616, 55828, 42392, 46175, 44727, 38035, 28921, 23082, 25035, 22831, 5620, -2481, 5601, -7638, -45150, -69023, -77887, -58036, -28357, -26883, -13498, -35253, -25107, -11290, -6851, -15508, -18034, -31387]
22627c1387k6993l896Q623L1805J3645M213n858k2417J21M2136n546o642r345
22614a1541r843K4400Q317j6451o544N083R086j413j337J0355K4878K4302k9486
22601B9806m3254k4171k2159L2704j042k3550M665R239K0147K6706K5162k2424
22589A1829O174l645J0978O297O903j581r023J1097p76l1056K3691J3299J8358
22576F2545m195l0260q693r256j9777Q44J0701k1998j7818J8128J2479N468P938
22563F106j2016k682j0705J6032K5664k745k1058k4210K0111J638k1444k2392
22551d7701K4188J9702k3932P146n202K5405J6097j443j2529j8679l38K0801J0400
22538A3915j5896l6487K0220J9206r308N374l6600k6581M7950L1275L959q681
$$ y = [-31387, -58380, -62276, -53653, -21848, -8203, -3990, -9848, -32265, -32144, 9992, 4446, -2196, -11541, -21384, 3016, 11333, -5118, -11662, -6579, 2507, 1094, -243, 10112, 34990, 59292, 29806, -13448, -37619, -59778, -27074, -28116, -51666, -47001, -37762, -17615, 9091, 34253, 11829, 18003, 14358, 25336, 31633, 38536, 36955, 27932, 39029, 38253, 7197, 30888, 44187, 62545, 58350, 28090, 19397, 10141, -9636, -8792, 1909, -20089, -37907, -19779, -7300, -1832, 6106, -5910, -8592, -19297, -3265, 22399, 19654, -1404, -25614, -5503, -3865, -25309, -47701, -23513, -3811, -27743, -20597, -25799, -394, 15703, 14260, 1731, -16948, -17286, 3515, 13915, -1981, -38468, -18248, 958, -8350, -2976, -39576, -66157, -18207, 13068, 17027, 8346]
22526H346J70l942l6529K7073L4251J9322k0492n9899N413R950K9789k2478j1935
22513b0961j4451K0239j4374j818L8828k1904j1216J3394o160j9785O167j7003
22501d9044L208K5789K9397N359j1217K12m922j2435j1293J5016q143K1951K6059
22488B9937k3210r678J7184J507J0754j3167J2021K1410j9197j6307o767j9289
22476a4802m353o330K0071J9065J0626M600K4799j6419n0762k223L3895j2744
22464E423K9367L6123j4593j656l6123j2824j0451R577j1695K500j082k1770l170
22451c0374J2726N731K7475o796l2699k1653j9747O589Q201J8410Q046J7866J6847
22438A0622j5279J4103j700j7755j410q092J7306N2265J2014O479K7917J2874
$$ y = [8346, 8516, 4574, -31955, -4882, 29369, 48691, 28199, -31700, -26287, -16337, 13452, -9026, -20961, -35412, -15173, -29547, -31365, 7463, -14441, -25657, -12263, -18423, -38208, -32041, -49044, -45836, -20047, 9350, 14709, 3492, 3704, -1218, -13653, -24946, -9930, -18073, 3878, 29937, 6727, -2951, 14233, 15740, 26494, 13327, 25348, 46758, 27561, 11254, 4487, -14802, -19155, -25485, -5414, 13651, 24277, 28877, 53676, 37257, -13505, -15728, 18167, 5423, 34790, 70913, 56320, 54664, 18541, 5717, -4734, 4843, -6852, -4352, -5434, -27204, -30374, -17648, -11917, 15558, 8762, -23937, -45590, -65337, -58748, -50547, -32137, -24091, -6225, 10622, -4657, 9446, 7746, -10009, -11419, -19511, -2205, 50060, 62074, 68553, 96470, 109344]
22426A09344j4293L748r199k3495j4776k2309k5540K0133L4270p321j4685j4176
22414B1701j1821R257m519j3117k4559k9049q326J1028j328j5612K1793J9764
22402b4788J4509P566m345J47L2614J6043j0351j1183j8256J1549j3069Q772O1
22389I269K6093Q051J213q033k5778k7723O392K7655J197j2645j6779j0681J3055
22376h714O043k5796J6340o054o545M794J3199K6383L6711l2505k3179R565K4816
22363C5058K3417N746m0431k0112K8241J8404k8836l4086k1296J7265N034q028
22351a9624l8058J6714N0940l080l8148K124K992P240j4928K168K645J1776j3451
22338c0690J1374L1889k946l1425N232j2385j1937J7296r641L070K8463Q800j3770
$$ y = [109344, 95051, 98799, 89600, 66105, 51329, 29020, 3480, 23613, 57883, 50562, 35877, 21701, 9880, 19137, 14618, 1501, -23058, -52107, -60433, -49405, -50733, -66345, -44552, -24788, -10279, -2713, -7058, -6911, 25703, 41746, 31395, 20212, 1956, 13505, 436, 9208, 9269, 35362, 43413, 44626, 36593, 10815, -16908, -10516, 17139, 18336, 5691, -11088, -21769, -8714, -2671, -28467, -12127, -18181, -24726, -19932, -6733, 19650, 56361, 23856, 677, 10242, 35058, 58475, 64221, 23790, 3678, 31919, 50323, 21487, -12599, -33895, -16630, -11596, -19624, -57682, -40968, 9972, 6892, -31256, -29132, -26140, -18900, -33828, -31660, -29015, -17239, -30690, -19316, 12573, 9627, -21798, -16566, -28951, -40888, -23592, -33233, -30163, -1700, 7100, -6670]
22325f670m4183R950K2818M0152L9889J7964k9709l0454j2320l488K0959P259
22313C2167N625k3847k58j8260j8220j2818l063K6767L88M152p12k7427q47K5297
22299a1056j1453K8680l992l3754k0983j440K0375j554k0588J9069r880k4957
22287g1533L0664J7344J646J1284j0577r025O517L5900L8175J690m9399j6778
22275a4092p741J4310J8877k530m455l2507o788J7928N62n582k3716J0761J5941
22262a9032m005K2408R681L915m34K95K7902J314j1198k8663k6428K2174P103
22249E032j0631j3210k2105M7869J3025j3314l70p792l3625l4585K4309o486j8485
22236g0368L0665J6223l4071j7519O8K402L7607K0962l8870n490k3783J2809J4704
$$ y = [-6670, -50853, -40903, -18085, 22067, 61956, 79920, 50211, 19757, 7437, 3949, 24908, 32167, 37792, 13945, 13687, -4573, -22793, -35611, -38674, -11907, -11519, -7367, -8079, -35506, -36353, -11056, -22509, 6171, 2179, -31575, -52558, -53998, -33623, -35177, -55765, -36696, -46576, -71533, -40869, -23525, -21879, -10595, -21172, -30197, -23680, 12220, 50395, 52085, 2686, -14092, -21833, -7523, 11354, 8824, 4369, -28138, -34926, -16998, -16436, -22018, -45734, -34973, -19032, -23037, -629, 9052, 12967, 12533, 12828, 40730, 42044, 30846, 2183, -24245, -2071, 5032, -5599, -18809, -40914, 6955, 19980, 6666, 6296, -1496, -35121, -69706, -45397, -51883, -70368, -39703, -23480, -57551, -75070, -75002, -72600, -34993, -14031, -52901, -58391, -82174, -69365, -54661]
22223e4661N2271L33j6354N114L526O992Q028J3641p16j0601q155j7392L894J8721
22209D641j3923l2913k9283q719M3405K6879J0626J1185K334Q466j0439j5827
22197c568l524l0250j62J9402J4384J5272K3228j1994j1516q413j7842l398J2665
22184e716K9279M1038Q218j3916m9677J1160L6923Q582k0730j0683l3256L071
22172D293J2865J7996j1430l7375L235J921l4097j9280J0106N149L7154K4031
22160A4568j7597j9477o315K767r209J6185J7316K47J4194O062O917k5559l4993
22147c4894l1843K7981M1204K3643j0598q018L895N882l841k430q154j3811L267
22134g717J3158n930j4703J4125j5467j416O649K4295j5173j2894K164K1426K6972
$$ y = [-54661, -2390, -2057, -18411, -13297, -9771, -2779, 5249, 18890, 18174, 7573, -582, -17974, -14080, 4641, -9282, -42195, -71478, -80197, -36792, -9913, 713, 11898, 14232, 22698, 12259, -3568, -7092, -37342, -37504, -18102, -3718, 11554, 34782, 22788, 11272, 2859, -14983, -18381, -5716, 23563, 64601, 72819, 58903, 9226, 20386, 57309, 65891, 45161, 34478, 1222, 4293, 17158, 35154, 23724, -13651, -10416, -8495, -42592, -61872, -51766, -46617, -9463, 14568, -3029, -22506, -28821, -26054, -35263, -19078, -1762, -1515, 12679, 18741, 25658, 99, -34894, -66737, -38756, 2448, 26091, 15493, 7475, 11370, 17252, 13411, 10981, 2827, -10984, -7717, 5441, -489, -15192, -1067, -16534, -17950, -11301, 12994, -2179, -15073, -12909, 8517, 35489]
22121C5489K0764l623k0669m3614k7188J4079L0193j119o652m3135k3990P94O614
22108f2057K3968M0078J4310P479Q377j1030j3328P272O80k5590r587Q362J4022
22095B956J7910J2202J3983J0777j8357p359J2003l8313q773k3511J7924K3871
22083A5313k6315k9789r959O947N4387M0124j213k1154O472J5206j4821m8762
22071a3564k6182J0589O791Q333j203r609N564J220o850K0275J4711J4985J2192
22058C7252K573j0710O667p835k5615j5985m7736K792M7018K2823R410j1831l528
22045E295Q627L0933M961k0666o05j5325j7812O345p921J9165K5342p733j7105
22032A3501l3111j8673j3372j2994K0481j376n04O643L8958K7406l2929J5033
$$ y = [35489, 56253, 52630, 31961, -11653, -38841, -24762, 5431, 4312, -2340, -45475, -69465, -68671, -62057, -38089, 1989, 16299, 23778, 32155, 21125, 7797, 15069, 15749, -9841, -19428, -11066, 2956, 20866, 33068, 47051, 57828, 39471, 32112, 44115, 5802, -2971, -26482, -8558, 15313, -11002, -40791, -50750, -43803, 10584, 50708, 49495, 28341, 34813, 50019, 35198, -13564, -39746, -29157, -22366, -14033, -15236, -24845, -19281, -18061, -24911, -4636, 10075, 25060, 37252, 39825, 29115, 35782, 27947, 2332, -13653, -61389, -58597, -11579, 11244, 20654, 8823, 5295, 13922, 44855, 49816, 29150, 28545, 13220, -4592, 1753, -6168, 12997, 38339, 30606, 13501, -19610, -38283, -51655, -64649, -44168, -45544, -46048, -39405, -447, 26959, -5970, 9063]
22020I063K4827j4995k9956j0806K9301N289l96m08j0888j6186k796N0080L1564
22007F3693m667j9156l4048N398p673j5444l316M2385k2367j022n403J8132J5074
21994C1586j9982k7840J4711O449k7187n093O607l309J9361J4936J999l709k7265
21981a8736R748j0584k1652j191J2061J774L0809K3695j1722k2651l9000M0525
21969f924J7729j160k3789m2860J2257J7477L5176N656j2159l0690M978M5428
21957B1119P821q875k905k0483r687N448K4112J1914L2117l5765l2791k2649J1122
21944a9502j2631n967K5139K3379k3993k0771K050P907L6061K5884j5425J9486
21932D1617k0518j7500r675j1688J6027j692k7403k5965J9828K992m604j0773
$$ y = [9063, 33890, 18895, -11061, -21867, 7434, 12723, 12327, 11919, 1031, -15155, -17951, 32129, 63693, 59026, 39870, 5822, 11220, 3547, -11897, -15213, 27172, 4805, 3783, -1620, 16512, 31586, 11604, -16236, -1525, 4924, -22263, -27356, -20749, -24058, -4697, 10239, 12238, 8529, -18736, -8988, -19572, -41224, -42415, -30354, -28580, 2229, 25924, 14202, -8449, -47449, -6924, 10805, 9645, -14144, -57004, -44747, -27270, 7906, 13562, 1403, -29287, -24309, 21119, 28940, 20065, 17160, -3323, -13010, -7562, 16550, 28464, 60581, 24816, -7975, -30624, -19502, -32133, -38100, -12961, 10418, -13575, -34346, -32296, -24389, 11672, 37556, 22131, 41617, 21099, 3599, -6076, -17764, -1737, -3429, -30832, -56797, -36969, -33977, -38581, -49354]
21920d9354k3433k2031J6306K7896L0039K0576j9897j8814k6415K3238J8186O883
21908a6820J5208n320j0411j7451K1261o320l0965N574j446q805J6286k0950J854
21895e8305M0623J7217j3507p854J4513j8276J8835L0729j0304n367k349N842
21883A1797k2007j4117K4170K3805L475N078J3244j3906n0562J600N3163K2664
21871E8404k871k0187j8851J3432j1799j5737Q941j366l2268j9763k0361N550
21859e6876O333M699K5988L1662k2597k9928o263N68L4953K4933Q055n326J2283
21846B8484R524m967n9524j0976K9725p951j2366L4968j1768k000N082J6549j5723
21833i43N021j1925l1920R219j2763j8850j9007L6723M6910J526q082k8887l76
$$ y = [-49354, -72787, -94818, -78512, -50616, -20577, -1, -19898, -38712, -65127, -41889, -23703, -16820, -1612, -6932, -17343, -34794, -13533, -19853, -50818, -45244, -46690, -55495, -39209, -60159, -58305, -17682, -465, -13972, -21826, -7313, -25589, -6754, 23975, 13671, 8304, 5955, 11797, -10210, -24327, -157, 23648, 27123, 32201, 45445, 31539, -19023, -17423, 35740, 58404, 55533, 35346, 16495, 29927, 18128, 2391, 11332, 9966, -22302, -42065, -62426, -56876, -50543, -45844, -19856, 11806, -10791, -40719, -46982, -46414, -11461, 13472, 21527, 16201, 28484, 38008, 33041, -26483, -37459, -7734, -15685, -28051, 6917, -4851, -6851, -1769, 14780, -943, 4078, -7847, -39767, -30548, -43311, -62161, -81168, -44445, 2465, 3991, -4091, -32978, -33354]
21820c3354J9693O856n748M24M336M188j0460o393j3041K091J7546J1204J9464
21807A6806j334K331J588J525J1736N958j90J3990O244k4233k3211q021o698n062
21793h571J3859p18k654k4925K4683L7318J278j3830L4742M5567j5768l9082l3597
21780A8302r308l1752Q628J2652j8279K5691J5236k6266j8022M086q220K4555
21768b697M1035J3428k2640K440P485N819J06j868l0526l8373J6902J7218m5425
21755c7096n2846k6291K4542N5648N0954j5077K2013j904q085r714J990O842j9823
21742h847J2388n491l5614n856K2837Q972k5920K822O510J3991J5379K0302J886
21729B3359k7532m026M103k2826J876K914n133L0329J4750J3834J5726k5830n9818
$$ y = [-33354, -13661, -6805, -12553, -12129, -7793, -3605, -14065, -20458, -33499, -31408, -13862, -2658, 16806, 15472, 17803, 19391, 20916, 32652, 38610, 38420, 52410, 58654, 34421, 11210, 3189, -3509, -8571, 5288, 4570, 1916, -23009, 1674, 38992, 40270, 26440, 61182, 106749, 90981, 51899, 18302, 8994, -22758, -14130, -1478, -19757, 5934, 21170, -5096, -23118, -19032, -27252, -2697, 38338, 51766, 29126, 31566, 39051, 44870, 44976, 43108, 12582, -25791, -8889, 8329, -37096, -89942, -116233, -91691, -36043, 14911, -166, 21847, 19943, 11858, 2144, 4134, 10976, -8847, 3541, -1950, -37564, -43420, -20583, -11611, -37531, -34709, -28199, -14208, 1171, 21473, 23359, -4173, -8199, -4096, -26922, -25046, -22132, -27265, 3064, 17814, 31648, 47374, 21544, -38274]
21716c8274j1677Q634K3550N687M014P060J8630K5626m1787l1559n986J6822O090
21703a3170q362j8615J5384j0974k4340J0849K7850L08j5610j3822J8627O1531
21691B9656L1300j277l5907m3686m894q656j112M603L683l966k381k4041p333
21678f4011J4888L4122r658j7188j9357K216M411k4876O045J3101L7145J7896
21666e266k3824j6200K5175M7148O730J9605j9132j6803k3747m776k7393j9326
21654e7809M2056K0657j6176j329O530k2136J2403J1607K0156J6212n20j7815
21642A3836R975P911l2475j1857n862j0959j1313O133p407n593J7747p049k321
21629c9234j4458r139j1165M3579J3004j0501K7692j8865L767k2932l3848L579
$$ y = [-38274, -49951, -41317, -17767, -12080, -8066, -1006, 17624, 43250, 1463, -30096, -36082, -19260, -13170, -21532, -40147, -24763, -35737, -60077, -49228, -21378, -21070, -36680, -50502, -31875, 29656, 60956, 59679, 23772, -19914, -24808, -33464, -34576, -29973, -26290, -30256, -32637, -56678, -64011, -49123, -15001, -24659, -41847, -61204, -58988, -54577, -79453, -73408, -60307, -23162, -5266, -29090, -45290, -20115, 27033, 33763, 53368, 34236, 17433, -6314, -11090, -38483, -57809, -15753, 4904, -11272, -12601, -6071, -28207, -15804, -4197, 15959, 32171, 31651, 13836, 23811, 31722, -753, -12610, -18472, -29431, -40744, -34611, -42018, -47611, -29864, -36913, -39234, -53692, -62831, -73996, -30417, -17413, -27914, -222, -19087, -15320, -38252, -72100, -68521]
21617f8521N0690N2160L539m3434j7383J8554O611k118j2416j8941k7548Q926
21605d9881J0846j920j0444l4902J2071K3160M3924L1523J4706j6974j9934j1345
21593i170R782K2466R710l936k3748M446K2623R011P911O61j1727m4582K349P324
21579C120o116k7154j2221K7984K2562L7450j5132l6996m206k8766J3964M3302
21567A7791O037J9032r684L970K021l4443j5024k647j7901j4462J7396J7478j2979
21554b3415n636K834p517J5579K1349J8184l054k9612K792J3430P322Q960J7078
21541C8294m814j8680j4322k2677J21L437J1962P818J213P587R353k1316r356
21528a1380K1614O634k125j6885q48n595j3135k9623J6995J9539M0022J615j7165
$$ y = [-68521, -17831, 34329, 37868, -5566, -22949, -4395, 2216, 98, -12318, -31259, -58807, -49881, -39035, -40955, -51399, -86301, -74230, -51070, -7146, 24377, 39083, 22109, 2175, -9170, 612, 23078, 32788, 28852, 5104, 9550, 32173, 41184, 49095, 49756, 38029, -6553, -4204, 3120, -2996, -30150, -42371, -14387, 8175, 45625, 30493, -6503, -10709, -39475, -25511, 17791, 23828, 42860, 33176, 37146, 39167, 4724, -10300, -12947, -30848, -45310, -27914, -10436, -23415, -29051, -26217, -33734, -18155, 3194, 21378, 18324, -11288, -8496, 4934, 12256, 21216, 38294, 33480, 14800, 478, -22199, -22078, -18641, -6679, 1139, 2352, 9939, 19292, -2024, -11380, 10234, 16868, 14743, -2142, -2990, -8585, -21720, -51343, -34348, -14809, 25213, 26828, 9663]
21515I663J67M961R615L654m9386o032j5048j9588J117M0240P827p153k1634J1317
21501c0280K0445K376q420K1748K601l536j4365l895J0180K1474M702k1238j4023
21488a2231j4529j2348J1931K2198P878j516J738m682K919m091M797J1197k7184
21475a3923m033K5340R689k7735l0592K656j5522K2751J7798J9408j5924j095
21463a1182J8745P732K380j7539l9248K165L5175K3891L669R478k235M821P638
21450D5490k727j3415j8327j0198J5321K4295l468j1369l7201k4906p120J9434
21438b4191M1003j3419J56k3890j6709j342J3064P197j0709j1230L5344K6001
21426B1275p214r630k0626L5470K6969l6795k6333j7154J3871K2987L9250j4797
$$ y = [9663, 9830, 14791, 24406, 28060, -21326, -27358, -42406, -61994, -60877, -20637, -12810, -19963, -41597, -30280, -9835, -7459, -15879, 5869, 8470, 4934, -9431, -13326, -3146, 18328, 23030, 1792, -12231, -26760, -39108, -27177, -4979, 2899, 1383, 3121, -1561, 1358, -2733, 2064, 13261, -13923, -17956, 7384, 17073, -10662, -41254, -38598, -54120, -31369, -13571, 5837, -10087, -11182, 7563, 15295, 17675, 136, -39112, -36947, -1772, 22119, 25788, 35266, 33031, 37852, 45490, 42763, 29348, 11021, 823, 16144, 40439, 36971, 25602, -11599, -36505, -43625, -24191, 16812, 3393, 3549, -20341, -37050, -38392, -25328, -18131, -28840, -40070, -4726, 21275, 14061, 4431, -16195, 19275, 46244, 9449, -16884, -34038, -20167, 2820, 42070, 27273]
21414B7273m6248l2227K493M9861J6130J7288L1739k5692l0926J0487K3141k579
21402D0740j4656r134n672k0784j0590K608R36L8838K5922l4822l5575r694J6499
21389a5384O323k279k2637p84l877M1202K7858l1914o712r281p430R142J5276
21376d97J1980K5420J2203k225n6758k0103R924j66k5743L0288L3647N327r208
21363A4089K806j2689O94P575J9951p88p801l06m575k3633q59k4328j158R574
21349b1448K8435K0164p40j6971R572L3654k1637k9155k1336m721O202K7054J5952
21336B5025j1289K196J5882k0003r422l746K871K5883O026l872j0962k4671N476
21323f06K5344o291o295P983q731l405r108Q714q440k856J2310k784p676j843
$$ y = [27273, -18975, -51202, -48709, 1152, 17282, 34570, 66309, 40617, 9691, 20178, 43319, 40740, 26084, 16950, 11278, -9506, -20096, -17488, -16552, 22286, 48208, 13386, -22189, -31883, -15384, -9061, -11340, -33977, -34761, -38638, 2564, 30422, -1492, -8204, -17485, -24915, -15773, -497, 11483, 36903, 49106, 46881, -9877, -29980, -20056, -20222, -45965, -15677, 17970, 23297, 14089, 16895, 4206, 4900, 12475, 32426, 31638, 23837, 23531, 18956, -4677, -5536, -29864, -31022, -21448, 6987, 27151, 26411, 9440, 19012, 52666, 31029, 1874, -19462, -24183, -17981, 9073, 25025, 13736, 15932, 31814, 11811, 2389, -1357, 1514, 27397, 33423, 29551, 18589, -6082, -606, 24738, 18447, 12152, 20135, 11404, 7999, -1109, 7605, -835, -3691, 8619, 5835, -1841, -3684]
21309c684J6254M0866r857m4728l0816k1771k0150M7961M0972M0174L6463j6941
21297G4743p444k0102j7822k7442o433k0977J5945j4946N124J3193J601J9005
21285A4445K4270K012M632j1592K3042Q217l9543l1738p105J0135R868j8906j0058
21272b2321k0007j3423L749j0983l051R067M0130J1809Q746K430R754k087J9279
21259C3092j0902m9958j7342m502J5966L4830J0631j3713q07N743q739j8366Q215
21246a5852L9126j7516j5725K879p53J3685J1672j4545j2198m729J6595p401l6137
21233d0899j8673r182K6766M0822K3418K9655K398O4l6233k6371q495j7398K5722
21220h406J4924l8672j532N889L7046N293k9873J6811o605l7157k4945j7225J4448
$$ y = [-3684, 12570, 53436, 43579, -1149, -31965, -53736, -73886, -25925, 15047, 55221, 91684, 74743, 67299, 47197, 29375, 1933, -4500, -25477, -9532, -24478, -19354, -6161, -4560, 14445, 38715, 40727, 45359, 33767, 56809, 65026, 25483, -6255, -13360, -3225, 6643, -12263, -22321, -42328, -55751, -52002, -62985, -66036, -56969, -16839, -5030, 3716, 6146, 15900, 13813, 33092, 22190, -27768, -45110, -49612, -33646, 1184, 11815, -1898, -2705, 3038, -5701, -24067, -15852, 23274, 5758, -9967, -7088, -7841, 5844, 17516, 2971, -9227, -13956, 2639, -4762, -40899, -59572, -68754, -41988, -1166, 22252, 51907, 54305, 54369, 18136, -8235, -16730, -34128, -8406, 6518, -32154, -33686, -27797, 9249, 14542, -15331, 1480, -5125, -42282, -67227, -84452, -70004]
21207g0004L0304K6698J5163K5070K943N833J6977K2704l4548m3478r60O670q115
21194d743KQ687J9473M113j1010P67j8196p050k8548n737K037K1154M426J593
21180a3032P162K9044o223l0230l6207L4596L7256K9623j6314k6503q539q205
21168g572j1668K6135J4019j1594j6870N710m708o010m80K5877n211m1838k1105
21155e5315J3017K2588m980J7200q103k1937J2431J7955L273P70K5454Q7J1876
21142C4316p861K398J4931l593j3817j8301K8983J3748o697j5118j2804K156L472
21129B1813K0480j6985m899j5922j7219j2216j1077j3603J1808J7433j4668J6589
21117a8466J3503Q501n960N725Q978r163l0227o058J4738J3725j3422M139J916
$$ y = [-70004, -39700, -13002, 2161, 27231, 30174, 36007, 52984, 75688, 41140, -2338, -3298, 3372, -4743, -4741, 3946, 23419, 27532, 16522, 17289, -907, -7957, -36505, -42242, -40205, -19051, -14625, -13032, -5870, 23174, 16951, -13279, -49486, -14890, 22366, 51989, 35675, 9172, 633, -7572, -19240, 6895, 20914, 9320, -7550, -1840, -6548, -12558, -13038, 12839, 7628, -34210, -55315, -42298, -19710, -24690, -7490, -15593, -37530, -25099, -7144, -3871, -3101, 22353, 22440, 34316, 26455, 28853, 43784, 40191, 26374, 8073, 37056, 50804, 44107, 28989, 16185, 18341, 21813, 42293, 25308, 20409, 4487, -12732, -24948, -36025, -49628, -37820, -20387, -35055, -18466, -4963, 3538, -2422, 3303, 12281, 3118, -27109, -33167, -18429, -4704, -18126, -13987, -12071]
21104a2071L0288K974k1256J8212J9042m2355o059J119l078K726O67o390k1710
21091c7891J2984K2156k2808R739J0202K6911N359k1562j5263P62J3555M41J753
21078F338J961n981j6336j0095K1102l014J0558J6883p319Q565K6427p034J7221
21065E9276m055n269j924j0274j4526k1470k4050Q358K3479j1534m200j5103j4308
21052c5600K7009l893m671r985m099J9665k743K3291n601k9959M600rJ2336j0398
21038b0057j1603j5559k4030J001J0246J9505J4331M312j9476L7453N467M419
21026F009k192p949P497j6711J0735K7480O767j3614l5697k8035K2209N775n22
21013a8248J6099m438Q384j5492j4118L1438o911l6954J9053K2911n849N1553
$$ y = [-12071, 18217, 21191, -65, 18147, 37189, -5166, -11225, -10106, -13184, -10458, -9791, -16181, -37891, -24907, -2751, -25559, -15820, -5618, 21293, 26652, 5090, -10173, -9411, 4144, 4585, 6338, 8299, 2318, -14018, -24113, -3011, -6025, 4533, 21416, 14097, 22662, 49089, 42055, 59276, 55221, 49952, 48028, 37754, 23228, 1758, -22292, -13934, 9545, -1989, -6189, -21292, -35600, -8591, -12484, -17155, -27140, -31239, -11574, -14317, 8974, 3373, -26586, -21986, -21995, -9659, -20057, -31660, -47219, -71249, -70248, -60002, -40497, -26166, -21854, -41330, -3877, 1590, 6009, 3817, -4132, 3365, -13346, -2611, 24869, 31636, 18022, -17675, -45710, -23501, -17726, -18248, -2149, -6587, 1797, -13695, -27813, 3625, -3286, -40240, -21187, 1724, -4125, 47428]
21001D7428J909m1609j8102K0635r443j2205j7805M174J7761K7544M931m153j4647
20988F418J2983j5864j3079p959l1122k4041J8688O8195L4674k4897j0735j6842
20976c581l260j8288P043Q03M095j5488j4470J3846J5791M51k2583L7782K3368
20963B5509j3130l0432l590l81J3548L174j1209l0642k1259K8034N3759k12k809
20950A0360J2789k0145J3297J9056l5355l9632K0608K1997l523m65j2317J0538
20938b792r92j4565J8086K3721k885L7210P123j1285j4494j6240L686n070K003
20925B3506J2382k5615j1413J8111j0999O741K262J239n562j7829o998r680k87
20912b4142K9601j5084Q288K8689J9726j5277K583o990J4151M207J322O108j5140
$$ y = [47428, 49337, 7728, -10374, 10261, 818, -11387, -29192, -25018, -7257, 20287, 25218, 21065, 6418, 19401, 3537, -9542, -17501, -48623, -72664, -53976, 14219, 48893, 23996, 13261, -3581, -6841, -25129, -18086, -17283, -13188, -28676, -43146, -29300, -13509, -13058, -35641, 2141, 25509, 12379, -18053, -21643, -22024, -8476, -5302, -16511, -47153, -68412, -40378, 13381, 13169, 10360, 23149, 3004, 16301, 35357, 2, -39630, -19022, 2975, -548, -1013, -13330, -2792, -3784, -18349, -263, 23458, 20573, 57783, 64906, 53621, 39127, 22887, 26573, 21503, 23506, 35888, 10273, -1140, 16971, 5972, 12713, 14975, 16214, 10652, -7177, -14175, -23855, -24142, 5459, -9625, -1337, 27352, 47078, 31801, 34384, 27394, 41545, 45752, 47074, 53182, 38042]
20899C8042q175j6871l0111J6786J234J071j2711k1463J1240k5521J9511r597
20887c6565K9477L4308r377J5915J5115k3963J2147l1319n085j2975j4843l1202
20875e8367L783N644P437K5635L9934k2819q026N305j8143k8039Q16K0146L586
20862b3108O994l381J3441K0253k0282J1214J9665K1449L283o683k9439J7037
20850C0443m010K144r015l2696j485R996k8394R713K0225J8976N297N242J2076
20837C8512m3002K8261K4247p986l8401l758l8301k1705K6289J411J4250K7112
20825F929o246j1930K1641J7643M918l6439O29j0694j0240N4403J2622J7013R836
20812G0085j5491m9270k3793K5946j9841J634J0726J6651o076j1723R23N741l5339
$$ y = [38042, 29867, 12996, -17115, -329, 905, 1976, -10735, -32198, -20958, -46479, -26968, -36565, -7088, 27220, 17843, 33758, 48873, 24910, 37057, 5738, 653, -12322, -27165, -58367, -54584, -48940, -41503, -15868, 24066, 1247, -6779, -1474, -19617, -47656, -46840, -26694, -23108, -16114, -19495, -6054, 14199, -6083, 5131, 24796, 46245, 49528, 42845, 13406, 30443, 26433, 28577, 19562, -13134, -14619, -4623, -33017, -23304, -3079, 15897, 21194, 26436, 38512, -4490, 23771, 48018, 40032, 1631, -2127, -40428, -62133, -35844, -34433, -20183, 6929, 683, -11247, 10394, 28037, 32955, -3484, -2855, -13549, -23789, 30614, 43236, 60249, 70085, 54594, 5324, -18469, 7477, -12364, -10730, -4, 16647, 10571, -1152, -229, 5512, -29827]
20799b9827l55q650n647N0494K373k7556j573q917K785J6402L941K944Q551j5231
20785a0266R568J9411k8116r407J2612L695j0599J4606j4663J3305o844L362o742
20772a0078j5285L966K4872j0023j2185p260J3313J1749O406N656p255k180P730
20759I426q859l2330N87N0233L0983l4423M478J0108l0975O46K9705L01j0162
20746A9718P6J1394R474k2832l0435j0110j382M445k68R360J0851K40l1542j2648
20732d3659O563L9619J3610o963J33K1962n706J3840O52m3379k7174l45J0404
20719b0443k417k5964j651J4552o782n004L8934k626P456j6575J2440K2693j5185
20706e72O054p976J5956N064k2506p011o266J6834J7517K851K496j1812j7587
$$ y = [-29827, -30182, -38832, -44479, 6015, 8388, -19168, -20741, -29658, -26873, -10471, -6530, -3586, 4965, -10266, -698, 18713, -9403, -18810, -6198, -2503, -13102, 1504, -13159, 146, -6698, -3336, -10078, -25363, -21397, 3475, -6548, -18733, -25993, -12680, -931, 5475, 11131, 3876, 1696, 9426, 567, -31763, -31176, 19057, 50040, 15617, 20095, 30203, -772, -126, 29579, 29880, 19718, 19794, 31188, 40662, 17830, -12605, -22715, -24097, -19652, -19920, -10560, 291, 531, -31011, -43659, -37096, 2523, 16133, 9170, 9303, 31265, 25559, 39399, 40051, -3328, -30502, -30847, -20443, -22860, -48824, -50475, -35923, -42705, -47709, -8775, -11401, -3945, -20520, -8080, 14613, -572, 5482, -2494, 13462, 18526, -3980, -10991, -17257, -423, 17094, 19945, 22441, 10629, -6958]
20693f958j3146J4530l496r505Q480K346M263j3769j0032m397j253J5388K314
20680a5235J4533N574K4574J0142j6588r899j7886J9300j1142j5917J277Q050
20668c217N072K499J4428K749k5141J2196O542j7984J4890j052k747O229j581
20655A2883k0583o719j8215J3907J6095J0506J439r847j2230k1134J1323K0732
20643a843R595O204j2571j1191O869l5131j0714K4099Q542j0323J4333r918k273
20630b4322J3465j6989q300P957J9291J9195n593l4381o042K1281K4420j2580
20618b598K2063j5859l1186j4965M063j7346m343L2457n745j3330j4497M753K4791
20605c1742K152K2808n052j5481K1297J1329K0212l8856l1567J2363J4733J4216
$$ y = [-6958, -20104, -5574, -9070, -18575, -10095, -7749, -3486, -17255, -27287, -31684, -32937, -17549, -15235, -702, 4872, 29446, 39588, 23000, 13101, -4785, 14515, 3373, -12544, -11267, -3217, 1855, 4354, 18782, 21531, -3610, 8586, 15128, -2856, 12034, 10982, 8235, 14464, 12883, -7700, -14419, -32634, -18727, -2632, 7874, 9313, -534, -12764, -33898, -22575, -1843, 7752, 13956, 1385, -9806, -2937, -38068, -48782, -24683, -16141, -26464, -12131, -22049, -24322, -10857, -27846, -36146, -28189, -8898, 10297, 4704, -29677, -35719, -14438, 9982, -2598, 19465, 3606, -27580, -42545, -38482, -55828, -60171, -27714, -33459, -46789, -61286, -56533, -31742, -29590, -6782, -11834, -27315, -6018, 5311, 25523, -13333, -44900, -32537, -17804, -3588]
20593c588R530R423o775q677j7818j6812n965j2698j3610J3128N4114J7240R670
20580B7162q135n920k0416q960J6055J4459J5009n5022m0945J2317K8328J6622
20568i446J2428K560J6761J9542r767m0722m684J219N847L6520j7538J12p57Q979
20554B1054K682l2360l0859Q345K1708o996K1181K4686Q779O687j0394k5451j5306
20541f244j6907R748N645q222q178J4205k0920m801l3817m03L4373N4810Q256
20528B7545J7333J413m843J0750k2973J0431k7015m2719J7831P401J5559J2319
20516B3032J8175m141l59j2954k5046k5501j8976K7854j2033K3370k50k1073J9951
20503g951l0359l111j383J3033l463l624j1097K1819L8037q536q080J0311j5712
$$ y = [-3588, 5942, 15365, 8590, -87, -17905, -34717, -40682, -53380, -66990, -53862, 252, 17492, 27162, 19027, 13107, -7309, -16269, -214, 14245, 29254, -25768, -66713, -54396, -26068, -9446, 2982, 5542, 22303, 41845, 32078, -8644, -13328, -12109, -6262, 30258, 12720, 12832, 12075, 21054, 23736, -8624, -39483, -31138, -9430, -16426, 4755, 29441, 38220, 44907, 34513, 9062, -6244, -23151, -13403, -7758, -15980, -24158, -9953, -30873, -35674, -69491, -69894, -35521, 19289, 27545, 44878, 46291, 41448, 52198, 29225, 39656, 12641, -30078, -12247, -4846, 10713, 23032, 41207, 37066, 36707, 23753, -1293, -26794, -45770, -17916, -29949, -6579, -6829, -27902, -7951, -38310, -41421, -42804, -29771, -33234, -36858, -47955, -26136, 11901, 3365, -4715, 5596, -10116]
20490a0116j6828j2495r067R630k361J3064K7414N731Q619K9120k1869k7992j7712
20477b4862o856n879Q554k7258j0439M5327J9490k0790p36J5123j5790J4804R851
20464E39k0762L9557n854k1967M843J0762K4219J0542j0051j9711l587J0701J4667
20451C3898k4126k0799m959k7095j1342J4650J9657j0787K2178J8706J494O003
20439A7478p182j6650J4458q035k5938L907n616J2192K6277k09j4465J2032k5843
20426a7594k9221n030J4376K7864Q660j1592p159m038N878j1291P364M7281O595
20413C2093j1575J6695m848k4907j7747l2285N691J3130L5894K0922k0863l1058
20401a8858n594m592m733L871M5634k723l5424j2666k2625j8200J3425J6846q222
$$ y = [-10116, -26944, -39439, -48506, -38876, -41237, -28173, -759, 4972, 13591, 42711, 20842, -7150, -24862, -31718, -37597, -29043, -56301, -66740, -21413, -1923, -22713, -23449, -8326, -24116, -9312, 539, -20223, 19334, 13480, -8487, -3644, 7118, 31337, 41879, 31828, 12117, 8530, 19231, 33898, 9772, -11027, -15986, -43081, -54423, -39773, -20116, -30903, -8725, 9981, 11475, 17478, 10296, -6354, 8104, 69, -25869, -21962, -27578, -15386, 10891, 10682, -3783, 8249, -17594, -46815, -51845, -37469, -9605, -945, -12537, -19696, -23734, -17856, -29147, -21783, 25498, 32093, 20518, 37213, 32365, 7458, -10289, -42574, -36883, -23753, 12141, 33063, 12200, -18858, -24452, -29044, -33777, -29906, 15728, 13005, -22419, -35085, -57710, -75910, -62485, -45639, -53861]
20388e3861j2019K5034L9842J5868j6442j5942n037L41L406j7723L3457J7247
20376A4171N244K1822M98l0119k4392m4580r679M261k2166J7848N6659K2467n929
20363F105k200K837L6426p215m461k1385k9698L971k0143j5696N2891K2248j8237
20350E443j1575j2663k2173l0311J7863k1298k802L8439J6016q521K9928L7078
20338C5424j3090k8620j3851k8797J3322M2300K9745l4342q647o78J0861M1098
20326D4725J2497l5425O758Q427j0505J9558j0267k0902l3634j815r09k4323j3197
20313e9012R191L6319K8194J9021j8694j4825J276L594j9362J608Q844M816m6367
20300d5397L16J0791J1943K7535r023j439J3175K974K34k41O097j2619K040Q285
$$ y = [-53861, -65880, -40846, -1004, 14864, -1578, -17520, -22557, -22216, -18810, -36533, -3076, 14171, 19415, 41237, 41735, 11616, -12776, -57356, -67035, -62774, -84940, -67092, -10433, 12034, 6105, 3905, 6742, 43168, 35953, 31492, 10107, -19591, -15620, -35763, -51459, 1432, 23680, 5443, -6132, -18795, -40968, -71279, -53416, -74714, -77516, -39077, -23061, -31582, -1654, 35424, 22334, -6286, -20137, -48934, -35612, 6688, 36433, 2091, -6556, -7234, 3627, 44725, 57222, 21797, 28555, 36982, 26477, 46035, 35768, 14866, -18768, -20583, -21492, -45815, -59012, -49821, -13502, 14692, 33713, 15019, 194, 1470, 5064, -14298, -12690, -3846, 970, -45397, -45081, -34290, -22347, 5188, -3835, -5274, 7901, 10875, 11109, 10868, 16965, 4346, 6386, 14671]
20286A4671K2252J6018j6529k0270j8130m3266l528O325q246K4126L2973K1965
20274B8361j1984l1605l1996j2983K5658O974M551M2255M2439j3269n5948Q282
20262G35L6186J0739j7184K707R976Q357q628l0057j6156k4552O250K5348K1693
20249B5414j5081P377L864O084J9241K3625k1908p389P500K564k6957k0437n144
20236a247j5403J0018J9151n656l1380l3869M4961K6549j7149K1459K210K3679
20224D3323j4498l4062J533J2813P28r860j5631p838K6302M992O229j941r25l1641
20210b0476m0973p40L3305j7142J0569N1661N511j46j5714m0842o469K5008L1806
20197A5358K90k7898j8941J3956j5585N373M34K7542n709j4085j2846j1109K7653
$$ y = [14671, 36923, 52941, 36412, 16142, -1988, -45254, -48782, -42457, -50703, -26577, 6396, 28361, 16377, -15228, -47224, -60207, -34549, -27575, -23024, 19231, 61670, 48401, -7547, 735, 36921, 47660, 30476, 33183, 43159, 51516, 42888, 12831, -3325, -27877, -21627, 3721, 25414, 10333, 17710, 21574, 27658, 46899, 70524, 48616, 41227, 48727, 51291, 24334, 3897, -1247, -16650, -6632, 12519, 6863, -24517, -58386, -13425, 13124, -4025, 17434, 19644, 43323, 28825, -5237, -3704, 9109, 9837, -23, -15654, -23492, 2810, 7802, 14031, 12090, 11165, -20476, -61449, -62189, -28884, -46026, -35457, 16204, 21715, 21569, 5855, -34987, -41456, -16448, 15358, 15648, -12250, -31191, -17235, -32820, -27447, -27013, 529, -5180, -19265, -32111, -43220, -15567]
20184a5567J2622r005J1225j237O807L675m29k710J1762J3356k1364K035L028
20171A4198L115k8692j0274j3811j5057J5287J2439K1079K9646J0897o936m782
20159B7109j2807j6217J249j4761j352L1859J466K0774N41o300j935k3072n6081
20146d9527l94K5537M995l240k5331N170m549k1197L6489N7925K581k1152j2358
20133e051k25J7901L829j3045p294j7061K3966J8985j1983l5572j3338K4772L789
20120a0327K0519K9999l012l0018j3133K9653L9057M573l1443j7482L069j7081
20108D374n39J0149j4717k555L036O904k7166J9112O646l062J1446J536j2131
20095C033R28k3178l1614J5556N7910p141k9598Q870P785L7052L1199o666l7022
$$ y = [-15567, -2945, -11950, -725, -1962, 4845, 8520, 8091, 5381, 17143, 30499, 9135, 11170, 14198, 17313, -11379, -21653, -35464, -50521, -35234, -22795, -1716, 27930, 38827, 31891, 27109, 14302, -1915, -666, -15427, -16779, 15080, 16546, 37320, 37861, 31561, 29626, 6554, -49527, -49921, -24384, -19389, -22629, -47960, -42790, -47339, -68536, -32047, 25878, 28459, 7307, -5051, -5276, 12625, 16454, 3409, -3885, -20946, 3020, 22005, 10022, -25550, -38888, -14116, -10327, 10192, 40191, 37179, 7161, -5972, 23681, 62738, 67311, 35868, 18386, 21455, 4374, 3835, 13984, -733, -3288, -252, 6652, -20514, -1402, 5244, 2182, 13628, 15164, 3033, 3961, -19217, -50831, -35275, 22635, 15494, -14104, -5234, 2551, 39603, 70802, 64136, 27114]
20082B7114N519q123j0478q358j2143l466K9593N601j1947n4662j7250Q879M445
20069d5276o017J6619j552j4632j337M522j5635L1203j240R501m584k2221j004
20056e1653q583k734J132L8190K5777k8141P710R39K90M305O487q139P267q363
20042a5516K3094K2368j2731L389p185K0178k0041r742P633M582k9853l9717J5429
20029c8112L6897K0455K09j1849o076k1022k319j0801j5627J3600K2654K4281
20017A2290n336j6588j873J7707P552l5675l2762J1048J9641n666K1967M2279
20005C4584p4n2385m8033K3691M903j8979R179K4935J4205p894J880L1947J0057
19992B8016q754P6j3820K274J5349K3504L625k4596j4803k0218l8384j1627p140
$$ y = [27114, 32633, 24510, 14032, 5674, -6469, -9935, 19658, 25259, 13312, -41350, -58600, -49721, -45276, -51293, -34674, -36226, -50858, -52195, -47673, -63308, -32105, -33345, -23844, -28428, -50649, -51653, -60236, -62970, -61838, -23648, 2129, -26012, -18302, -17363, -17073, -12768, -6281, -14420, -7153, -15516, 7578, 29946, 17215, 20604, 13419, 33597, 13556, 3814, 11447, 16029, -13824, -53541, -38112, -1215, 19240, 19449, 7600, 1524, -19498, -21817, -32618, -48245, -34645, -11991, 12290, 6954, -9634, -11507, 6200, 13752, -21923, -54685, -43637, -23996, -29662, -7695, 34584, 34510, -17875, -65908, -42217, -37314, -56293, -47114, -22179, -7974, -15868, -13988, 17959, 28016, 19262, 19338, 5518, 7792, 23141, 46645, 50270, 25674, 10871, -9347, -47731, -59358, -66498]
19979f6498j1098r78K402K0935O50K3322l7758M718M3650M4120J0696q957J4251
19966C9455J0377o96k3706j2232p736k3304j0791j5719l4478K1025L1896p056
19954c2965L96K1152K1501o334j6505K652R034K2193J3300n544j4319l6025r659
19941c1123Q674L0187K6737k4678k1171J3996K878L109K6284J0515j330n393l9410
19928g25l5451J3879n304q49q94J0791J8916j2378l3826K7108K6214J2393j4799
19915E075j6597J7474P363k5942j943L2116K1340j1755L29k661j4549p035K3378
19902B6593J7823q481k71r34n366j1184k4521k3508Q732r842K887J8428j9807
19889b9451M738L2185K019k4907K5566j8507p850J7320n351P617O994j9742P180
$$ y = [-66498, -77596, -78574, -76172, -55237, -54587, -31265, -69023, -64305, -20655, 23465, 34161, 25204, 39455, 49832, 49136, 25430, 13198, 5462, -17842, -28633, -44352, -78830, -57805, -25909, -32965, -32569, -11417, 10084, 3750, -12755, -10103, -1069, 21124, 34424, 28880, 14561, -21464, -31123, -22449, 7738, 34475, 9797, -11374, 2622, 5500, 8609, 34893, 45408, 44078, 38685, -725, -36176, -22297, -27601, -28450, -29344, -18553, 363, -12015, -45841, -18733, 7481, 19874, 5075, -11522, 5952, 13315, -12627, -14570, 17546, 38886, 27131, 27460, 24799, 10250, 3215, 26593, 44416, 35935, 35664, 34730, 29364, 18180, -6341, -29849, -21117, -30959, -28072, -9644, -29451, -24713, 7472, 9491, -15416, 10150, -8357, -16207, 1113, -4238, 3379, 10373, -9369, -2189]
19876b189j7190P838J8534J2263q736J0172L2440J5026n1962m4552k649R591K4310
19863B896k520J2126P924k4697k8993j9691J6988M0119O361k4188j5912J8948
19851a0639N128J2786Q783n372P202J3691O596l2966l174J0417k3895J1149J4824
19838A4530K3040J2602M651l2377m6506K861K1969j5377l1294L0055J6886j1670
19826a0630O315k2485J3472n327j2208L5834L5211k9542k9855m2923l024J6732
19814d8430J4831R858P167K9711M5003M460n0421j978j382p960K329k1680p985
19801b6477J7138M2615K3305l0163n3779j494M2214L034j7275j9867k3252l1780
19789g5781L5457J5165k4520J7630R142J107l3877j6012m720R875P563J4455K1711
$$ y = [-2189, -19379, -11541, 6993, 19256, 10520, 20692, 53132, 68158, 16196, -28356, -31005, -21414, 2896, 376, 12502, 20426, -4271, -33264, -52955, -35967, 4152, 10513, -13675, -29587, -10639, -5511, 7275, 16058, 10686, 17888, 31579, 38175, 5209, 2035, 12452, -11443, -294, 14530, 37570, 50172, 54823, 22446, -24060, -21199, 770, -14607, -45901, -15846, 1040, -10630, -4315, -26800, -13328, -18655, -30863, 4971, 40182, 10640, -19215, -62138, -65162, -48430, -33599, -23741, -16574, 13137, 58140, 62600, 12179, 10201, 8819, 859, 3188, -18492, -26477, -9339, 33276, 56581, 26418, -27361, -28855, 13359, 16393, -882, -20749, -44001, -75781, -40324, -25159, -49679, -32049, -22907, -21800, -55677, -71689, -76409, -66534, -58971, -44516, -22805]
19776b2805K852J9166R279M532K4318Q639m3114j6193m266R111J9606K1925L288
19763C6338r995n85p353j0653M321k4212k6887j7116R754o395J9398M09p439O392
19749c4023p410r078N319q34K9860K0730l0869j9833q640J545K2598J9190k063
19736a3508j6905m347K1829L558K5210M5530j1533L43k2788l4670J8092L3379
19724D4190R992m2955k9588q305p438l747K0560L8649j7807k8749j3218j162M525
19711c5053p316K1401l311O316J1855Q072k37j6531p330o791L3765O791k6011
19698a4380K5563l558r633N553J7251m947l0406O382Q845J457j4665Q220L137
19685a181J4222j0006L936j2317K5429J808k7881j1057r71J1402J4066k862N895
$$ y = [-22805, -19953, -787, 8492, 13024, 37342, 45981, 2867, -13326, -17592, -8481, 11125, 33050, 36338, 26343, 25758, 18405, 7752, 12073, -12139, -39026, -56142, -46388, -52783, -33385, -32976, -40415, -34023, -41433, -50511, -45192, -46026, -16166, 4564, -26305, -46138, -54778, -53233, -30635, -11445, -13508, -30413, -34760, -12931, -9373, 15837, 61367, 49834, 50177, 27389, -7281, 10811, 44190, 54182, 11227, -18361, -26666, -34104, -37851, -17291, 21358, 3551, -25198, -38416, -39578, -35053, -42369, -20968, -24279, -17963, -6108, 1964, 1727, -14804, -22134, -28925, 4840, 11631, -14380, 11183, 7625, -2008, 3545, 20796, 15849, -14557, -8175, 670, 2127, -12538, -4318, -1181, 13041, 3035, 6971, -5346, 20083, 21891, -5990, -17047, -18018, -6616, 7450, 4588, 10483]
19672A0483m198N570j7562p259j156J0612K9271P677j2490p797k2880N971j0040
19659a3798k4600L0348K8557Q611o50k6776m632j5917J2086k293k7025p936L4651
19646i374J2380J597K478P439k7374j3839m695M0321K5971j454r050m2530j0822
19633b8952N891K4799J5049k4310k227K3359R375j6574m047M151K8907j1744j7942
19620E735p797J0003J2337J6083j0999j3058l8484k7728l893L1155K8195m4307
19608d2758J6235N3552O3Q897j437k657k0226k7384l0935R68K9100L2426R195
19595B5039P855o633j8531l7799k116Q388k037K0520K636J7921o541N536q410
19582E828k5330l408J2125j3992j0537J1625L9595j852N253J895o671m309n384
$$ y = [10483, 6285, 11855, -5707, -12966, -14122, -3510, 25761, 33438, 20948, 13151, -9729, -3758, -13798, -38398, -8050, 20507, 29118, 28468, 1692, -2940, -18857, -6771, -9064, -36089, -44025, -9374, 3006, 4603, 7081, 14520, -12854, -26693, -31388, 8933, 34904, 33450, 24400, -18130, -28952, -23061, 1738, 16787, -7523, -9750, 13609, 22984, 6410, 2363, 6514, 35421, 23677, 5735, -2062, 7941, 20278, 36361, 25362, 12304, -26180, -53908, -57801, -26646, 1549, -42758, -26523, 27029, 27092, 35989, 34552, 31895, 11669, -15715, -46650, -45682, -16582, 15844, 25039, 32894, 26261, 7730, -30069, -32185, -23797, -25834, -5314, -2678, 15243, 8702, 14238, 5828, -19502, -22910, -10785, -24777, -35314, -23689, 15906, 14054, 19307, 21202, 14531, 10222, 4838]
19569D838O073q13O131j1834j1677j725J4677k5943m460J355j9711j1719K9801
19556b5007Q797k2845k9753J7059M8654J3752K122q238J0121K514K6843j0222
19544C3797k8650Q31R832j192r600O283K4904m1287m9195M8547P319J1578J0020
19531B3187M113J6327j2055j7965n935o062o008n225l1104J347J0309m679K081
19518c1669j8373Q6N7489P883k2523l949R996J335k3232q210j548J352o910L3431
19504d842M578l1295K1910Q812l0506J6364K4996K1030r487j7103l63N212m638
19491D668m848R603k307j4559N519K382P641l506K636j0777O812Q10O069J8162
19477B8305l6649L899L0958J1439J2241m943l5028k5737n120K816J50q27K9520
$$ y = [4838, 10911, 10098, 16229, 4395, -7282, -9007, 5670, -20273, -24733, -23378, -43089, -54808, -25007, -16210, -39055, -68808, -51749, -3095, 10657, 12779, 4541, 14662, 17176, 44019, 33797, 5147, 5978, 15810, 14618, 5018, 11301, 36205, -5082, -54277, -5730, 1589, 13167, 23187, 27300, 43627, 31572, 13607, 7672, 1610, -4398, -9623, -40727, -39380, -29071, -33750, -31669, -50042, -49956, 7533, 15416, -7107, -11056, -1060, 275, -22957, -31167, -32715, -31363, -38273, -4842, -264, -31559, -9649, -837, -31343, -14979, 10017, 31047, 21560, 4457, 4094, 9306, 4668, -180, 9423, 7116, -7443, -1924, 458, 8099, 4593, 7229, -3548, 3264, 4074, 10143, 28305, -8344, -4445, 26513, 37952, 50193, 45250, 10222, -15515, -20635, -17819, -17669, -18496, 11024]
19464A1024M340k8889j0483Q96j2161J3898J9698K2667K7899m094O046j606l2744
19451A6491j6270k0720L5237L3243J5997k0135k9833l6323j3855N034L6380L1935
19439C7181n678m0214N891K8792m25j3172j046N800j3056J7501J9928r784j1575
19426B0143n62j5515r089j1725r694r194K370L5793Q214k4326K0950J4596l8553
19413a6592j5093J1832Q298l079K1286R496L7376j4396j6979j2229j2341K003
19401d18j8604j7441J3379j1790q117L2882j3860j6789Q51j413R043r374J6186
19388b5465J3804J6129R34j7679k2594p38L6365M3910j6357j9419j3157n454l8014
19375d7735J221J4469J2708m301N186M184J2820K227L1124M7804M19m5865l7065
$$ y = [11024, 15364, -13525, -24008, -23112, -35273, -21375, -1677, 20990, 48889, 44795, 50841, 49235, 16491, 221, -20499, 14738, 47981, 63978, 43843, 14010, -22313, -36168, -31134, 5246, 37181, 31503, -8711, -2820, 25972, 25547, 12375, 11329, 17129, 4073, 21574, 41502, 31718, 20143, 19581, 4066, -5023, -16748, -26442, -35636, -33266, 2527, 10741, -13585, 7365, 21961, -16592, -31685, -19853, -11555, -14634, 6652, 16148, 53524, 39128, 22149, 9920, -2421, -418, -19022, -36463, -23084, -34874, -42991, -10109, -23969, -40758, -39907, -41320, -32277, -41651, -25465, -11661, 4468, 5402, -12277, -34871, -35609, 756, 44666, 28309, 8890, -4267, -9721, -47735, -46514, -32045, -19337, -23638, -18452, -14268, -1448, 779, 31903, 79707, 80126, 34261, -2804]
19362b804R88j1010J822O121K607J3280q521j9167m4353l6403M3774L0368j2135
19349c5433k0228J5073K3779J5492n99L583k5185M2936j4164j0690K7131Q276
19337B9971J838j4885K6692p402J6243J5069J251O096k3195j7681q184k6173q666
19324i026K1642j5059O635M1609K471J1509q402j4001n6466k2735j4153n627L2502
19311b9101L1283K5770J4382nP708J9544j7626l6387k1816K2091O781j6005K9241
19298C5860K2635j1955j8104o684q070K1838K043l2531j0288k1153O485J6254
19286c670n03L1240j686j5105K2091P19j9385n094J9961K5151J7889j3436k7776
19273C0396j3076j1645K3848M422j9975k5555L4213J4944j1385l993J7906n212
$$ y = [-2804, -1816, -12826, -11004, -4883, -2276, 11004, 2483, -16684, -61037, -97440, -53666, -23298, -35433, -55661, -40588, -16809, -1317, -1916, 1667, -23518, 19418, 5254, -5436, 21695, 29971, 31809, 16924, 43616, 36214, 52457, 67526, 68777, 74873, 51678, 33997, 25813, -360, -9026, 12616, -2443, 4192, 45801, 48272, 59781, 51379, 37378, -19088, -41823, -55976, -61603, -29101, 2182, 27952, 42334, 42329, 50037, 69581, 51955, 15568, -6248, 15843, 22624, 6619, 35860, 58495, 46540, 28436, 21752, 13682, 35520, 37563, 5032, -5256, -26409, -19924, -3670, -4173, 27067, 25381, 10276, 32367, 33086, 13701, 8607, 28568, 53719, 71608, 58172, 30396, 17320, 5675, 29523, 33945, 13970, -11585, 22628, 37572, 26187, 22194, 40100, 34888]
19261C4888l0175l5318N507O0315K3557l3016k5002J377k115k2767O878J6641
19249G70K0139o892l8966j3599M876K7630K6594J2642q00j5874j6903j6171L1462
19236A4908L5554j3755N079K95l1003j7065j607J9758j553K4P250K3144l1859
19223I170k9757K8568K1718k1Q945k8361l4071K1347K0038k3198k640P811j4693
19210a5144l5330j418O306J8468N191K7434k4244j8229J7866J7699k0908L4141
19198A1832N221q418j9966p370m518O090K1473L0547J3859k739p715l6506j1427
19185i637j4853J69J8457L9338K436l3471k3067N644j6213J3245k1665k896L4653
19172g860J0315N313J1714l0960l6886O969o013J1385J4203K876J9360M121j948
$$ y = [34888, 4713, -30605, -25098, 35217, 58774, 25758, 756, 2133, 18, -22749, -15871, 770, 20909, 14017, -24949, -38548, -33672, -6042, 20552, 33194, 32394, 16520, -383, -16554, 14908, 50462, 36707, 41786, 42081, 11078, -5987, -7594, 12164, 10611, 10635, 17885, 41029, 9170, -20587, 7981, 29699, 29678, 38623, 10262, -23809, -2462, 17576, -5622, -8262, -451, -15144, -50474, -51892, -45586, -27118, -21927, 5507, -18737, -36966, -19100, -1401, -22309, 11832, 17053, 8635, -11331, -18701, -23219, -17129, 4344, 34891, 48750, 46011, 38296, 1790, -9637, -24490, -24321, -5864, 33474, 35910, 2439, -20628, -14984, -31197, -17952, -39617, -42513, -7860, 2455, 7768, 19482, -11478, -48364, -41395, -47408, -36023, -21820, -18944, 416, 4537, 2589]
19159B589j860O053j3427K4495J5180K14J4977O100P03k272k6664j3598R102m595
19145A6997K4417l282j9442J5222K2151k4992j4351j3514M689j9132K234r609
19133a8612k601n631j2766K4292J0400k2033M570K3215J7855N750p613j1290K5464
19120C1000q097m799N354k1959j2883k4432Q015J2281N453n56J9865R043l4033
19107a5748J2589M429J9000J9749k6652O293N281Q381N51j1050j2702r550j0127
19094i556P328j4332j7577J6930j2240o041L9138J4471j0808O336J3108m648j5332
19081F777l0153k6946J9469N6975K9650j8905l5661J6358K6264j8985p447k9702
19069a2306M936J6686j2747m7356k65K1749J8484Q376j0299j7799L0484M2378
$$ y = [2589, 729, 6782, -6645, 17850, 33030, 33244, 48221, 54321, 55024, 52752, 26088, 12490, 21592, 16997, 41414, 38132, 18690, 33912, 56063, 31071, 16720, 3206, 7895, -11237, -9003, -18612, -21213, -26844, -39610, -15318, -4918, -26951, -22381, 834, 18689, 24439, 16826, 5536, 31000, 22903, 18104, 23458, 1499, -11384, -35816, -27801, -15520, -10067, -10623, 9242, 18285, -15748, -3159, 1270, 20270, 40019, 13367, 19660, 24941, 33322, 33873, 22823, 10121, 571, -9556, -2228, -16560, -34137, -17207, -29447, -35488, 3650, 18121, 7313, 13649, 26757, 22109, 6777, -23376, -50322, -30853, 26122, 55772, 36867, 1206, 17564, 43828, 24843, 17396, -12306, -7370, 9316, -3431, -50787, -51052, -29303, -10819, -2443, -12742, -30541, -57, 42321]
19057D2321K7328j8781k0058m2682Q962J3487m18j77k5010j1996K8282L8825j4608
19044B5475k2750L5903M113K8444M40k2502k0330l8277j0152O55K4167k2171j7746
19031c4731J2514J2746R100K8308R842J1627q806j4876n2299j3105K7668M3602
19019C1590k168o934j002l2380J9171Q46j4015J2142J5285j2590k3151j052J3102
19006a156J0868J6599M746k6202j2583J2007K6760N512P240J0955M533p744J64
18993E1699j5740k0770J9600L8015K3532j103K9251K19k9107j2167k8177k4522
18981C0730m535N219r844R845N384K1432r22m0224j473m751J614k023Q399R055
18967B7906J1792q6J5379J6035J1302L0195N8841N1543K0237K3363L53m8843l6560
$$ y = [42321, 69649, 50868, 30810, -11872, -2910, 10577, 10159, 9982, -15028, -27024, 1258, 40083, 25475, 2725, 38628, 42741, 71185, 71625, 49123, 28793, -9484, -19636, -18981, 5186, -16985, -34731, -22217, -9471, -371, 27937, 37779, 49406, 40600, 25724, -26575, -39680, -12012, 31590, 29422, 22488, 21486, -10894, 8277, 9123, -4892, 7250, 22535, 9945, -13206, -14258, -1156, 9712, 26311, 31057, 4855, -7728, 4279, 31039, 36551, 43791, 54746, 59279, 51535, 51699, 35959, 15189, 34789, 72804, 96336, 95233, 124484, 124703, 95596, 83429, 55252, 30730, 26195, 31414, 21570, 31415, 36799, 58231, 57309, 17085, 15612, 10861, 12475, 10452, 18851, 27906, 39698, 39612, 54991, 71026, 82328, 112523, 171364, 222907, 243144, 266507, 266860, 218017, 181457]
18954A81457n596l4758n0548m653j7019L8471Q1339K8131L8103k7226j3473j5871
18942A98357j3290j4K2633N5088J7568k3249N373k1796n2016n9788l3814m1305
18930E3747j4772J4082J8869l227k277L1188L4294J0961j0766j4662Q482J8665
18918A44584L2242R284j2192k456O794k664R603K8999L5446L2204L404J2174L7561
18905C34983Q656K6877O0472J8700J3265l6279o3154l0913l1598J6961L2584j8790
18893C31764k7943k6463Q283K268P661K7150P303n1390m5534j0463j7702l538
18881B01396p449j6300m851r260k4210J0203R934R13j3627l0430l0844j1689q764
18868F5022L4510M4985p411j4233l4819J7405J1356K578J5101K7419M4784j7603
$$ y = [181457, 175861, 141103, 90555, 85902, 68883, 107354, 188693, 216824, 254927, 227701, 214228, 198357, 185067, 185053, 207686, 262774, 280342, 257093, 262466, 240670, 188654, 128866, 95052, 53747, 38975, 53057, 71926, 68699, 66422, 97610, 131904, 142865, 132099, 117437, 125919, 144584, 176826, 186110, 173918, 171462, 178256, 175592, 185195, 214194, 249640, 281844, 285248, 297422, 334983, 343639, 370516, 430988, 449688, 462953, 426674, 363520, 332607, 301009, 317970, 350554, 331764, 303821, 277358, 285641, 287909, 295570, 322720, 330023, 278633, 233099, 222636, 204934, 201396, 193947, 177647, 172796, 163536, 139326, 149529, 159463, 160376, 146749, 116319, 85475, 73786, 65022, 99532, 144517, 137106, 122873, 88054, 105459, 116815, 119393, 134494, 161913, 206697, 189094]
18856A89094K5142P9623L4995J0457l2604l1812J1861K2332l355p397k6188k2460
18844B49688j9505l2841l0354k465l5756l4927p235m5245l4603j4692J3087k446
18832B706J8745R624J7419j2852l6900r79K0499M5273K0980l5564k8729Q126M6992
18819G5340M971O68n653k3534j260K2182J0303j2733j8236J1639j5211m5230K8393
18806C1639M231k1989p223J3224Q716L261J4309j0831k5825k2009L68K5813J2565
18793B6249K189M351J894J0929K6485J7057j1068j4075j0978j1405p749l20J8125
18780E1684j8255J949k828j3600j464K5523k721K2636K0305l841Q619N74m545
18767H4036J5236M1838N8358J36626O1931m6594j17694j01526l0124k3630R025
$$ y = [189094, 214236, 293859, 328854, 339311, 306707, 274895, 286756, 309088, 305733, 298336, 272148, 249688, 230183, 197342, 166988, 164523, 128767, 93840, 86605, 41360, 6757, -7935, 5152, 2706, 21451, 31075, 48494, 35642, -1258, -2237, 18262, 63535, 84515, 48951, 20222, 28348, 75340, 80311, 80979, 75326, 51792, 50532, 72714, 83017, 70284, 52048, 63687, 48476, 3246, 31639, 35870, 13881, 6658, 19882, 28598, 31859, 46168, 35337, 9512, -12497, -12129, 13684, 26249, 28438, 32789, 34683, 45612, 72097, 89154, 78086, 64011, 53033, 41628, 33879, 33559, 51684, 33429, 35378, 32550, 18950, 17486, 43009, 40288, 62924, 83229, 79388, 88007, 88581, 84036, 99272, 141110, 199468, 336094, 398025, 351431, 233737, 132211, 102087, 78457, 87482]
18756H7482J0670q347K513O930k5847m5208l932Q845N2004J5396J2170j2898n3718
18743D6060k9394K7656J2126J6705J4637P496j7589n390k4404l678j1050N668
18731C8843O022L3772M4218j4354j1080j7470k4757j1352K9655M8463o2j1824
18719A10074l0747J4178j0519j2541n898J7780j1851j6550J7266j829l550j9379
18707D6434k3437R369K341k986J2006P989K608P298M340k7831J343j8584j1201
18694I689n056j1378l50O850M3216M0805J4330k2748M358q782J8644k0733j402
18681F7443k018r491k6197n483Q325L3647j7385j4509Q773J531j4539K7986L500
18668F1583J5307O94j091j229k3546n933K319J3186o845O720l8001J634J8668
$$ y = [87482, 98152, 89805, 92318, 99248, 73401, 28193, 24261, 33106, 85110, 100506, 112676, 99778, 46060, 16666, 44322, 56448, 73153, 87790, 95286, 77697, 72307, 47903, 44225, 33175, 38843, 44865, 78637, 122855, 108501, 97421, 79951, 55194, 43842, 73497, 121960, 121898, 110074, 79327, 93505, 82986, 70445, 64547, 82327, 70476, 53926, 71192, 69363, 65813, 46434, 22997, 32366, 34707, 31721, 43727, 51716, 54324, 61622, 65962, 38131, 39474, 20890, 9689, 4633, -6745, -7095, -245, 42971, 83776, 98106, 75358, 79716, 70934, 89578, 68845, 67443, 65425, 55934, 29737, 24254, 32579, 66226, 48841, 34332, 43105, 44636, 30097, 58083, 61583, 76890, 77584, 76493, 75264, 51718, 45785, 48104, 61290, 54445, 61165, 23164, 24798, 43466]
18655D3466n630N199k016o98K1083J4440p307p86o311J310K7237N3740L6942L8376
18641B19045J1133J7829l893N090N373R584J0685m3389l8028J3372j6090k5485
18629A65226j1046j1839k8236J0055M420l8431J904k1087k4333J2911M2692r628
18617I2608K899J4678J2733q170j3212l789j6745r217k2795J77n767O417k16n623
18603D3978N31P387J4675l5756J2445J4203m261P576K2445K3753j1971q71q995
18590H5139j3561p172k5645k6788l1949r430j1094L2657L6927L0461K1119L2997
18578A13661M9684L1684K8179j9174L241j7151q74o50l0390m4587k5046k0024
18566F8553j5172K7009m495l771r8Nk3Q966K240q161l901L0134n354M571K4536
$$ y = [43466, 37836, 43035, 41019, 40321, 61404, 75844, 68537, 67751, 61440, 62750, 89987, 143727, 180669, 219045, 230178, 248007, 244114, 249204, 254577, 264161, 274846, 231457, 193429, 206801, 190711, 165226, 154180, 142341, 114105, 124160, 128580, 90149, 92053, 70966, 46633, 59544, 102236, 92608, 95507, 110185, 122918, 114748, 101536, 97747, 81002, 71785, 48990, 49167, 43400, 49817, 49601, 43978, 44509, 51896, 66571, 30815, 43260, 57463, 53202, 60778, 83223, 106976, 95005, 94134, 85139, 71578, 64406, 38761, 11973, -19976, -29406, -40500, -7843, 29084, 59545, 80664, 113661, 163345, 195029, 223208, 204034, 207275, 190124, 189250, 188600, 158210, 113623, 88577, 68553, 53381, 80390, 75895, 72124, 72026, 72031, 72008, 80974, 83214, 75053, 71152, 101286, 95932, 100503, 125039]
18551A25039J6175J9046l043O185L7837k213k9230J5129J6564P080j2857n419
18539A90293M567O519k3646l4920l2133m6909l6082j2087N550K1607J1482L507
18527E7748J7322m761j731k948K2480L9751L9746o861N058K7681j3146o339j4841
18514A59159O939j3049m7039J3457P326J0484L5918L89J7622L1524j9321J1235
18502B14644M7079L6830j2475k6351k6488L0681O582l827J2316K0677p406l8860
18490B53402j6429J8317L2276M5267M6578M4256L2546J5070j8454k1633j8714
18479D12482P87L9105K835L6325p675l6549k3835J3323M383K7969L4113K4508
18467E27771M5151R511k5668L3925N5575K3687J2197J9208r080m3866k5681J4369
$$ y = [125039, 141214, 160260, 157217, 163402, 201239, 199026, 169796, 184925, 201489, 208569, 195712, 190293, 194860, 201379, 177733, 142813, 110680, 63771, 27689, 15602, 21152, 42759, 54241, 57748, 75070, 70309, 68578, 65630, 88110, 127861, 167607, 160746, 165804, 193485, 180339, 174000, 159159, 166098, 153049, 106010, 119467, 126793, 137277, 173195, 173584, 191206, 222730, 203409, 214644, 261723, 298553, 286078, 259727, 233239, 263920, 270502, 266675, 278991, 299668, 292262, 253402, 236973, 255290, 287566, 332833, 379411, 423667, 456213, 471283, 452829, 431196, 412482, 413269, 452374, 455209, 491534, 483859, 447310, 423475, 436798, 441181, 469150, 503263, 527771, 572922, 582433, 556765, 590690, 646265, 669952, 682149, 701357, 692277, 648411, 622730, 637099]
18455F37099J4934L5985J18180Q7087P1602J23729K35868L70833N82988R87904
18445C266209J540745J582837O15504O0335o4007m47270r05827q24459J16431
18436D940498R92642M60526p54390j378093j133221n70982k49302q5268N317P5826
18426B303553J15296J75698K32432M31830P92758J055525Q96958J73079o34185
18417E542944r41637p54006m37016j36418M20L0349R4768K52099M95431Q63644
18407E010578J273099J043460L31668j34333q2465K25439L99004M72155M51949
18398H990554N36767Q92468J457838K214636L120988M119404N196491O389947
18390C2919093Q418964J3074494K3824179M5569208P1111999P0743000M4877070
$$ y = [637099, 652033, 688018, 806198, 893285, 964887, 1088616, 1324484, 1695317, 2278305, 3266209, 4806954, 6389791, 7005295, 7065630, 7001623, 6554353, 5648526, 4824067, 4940498, 5933140, 6393666, 5639276, 4261183, 3127962, 2556980, 2307678, 2222410, 2227727, 2303553, 2418849, 2594547, 2826979, 3258809, 4051567, 5107092, 6004050, 6177129, 5542944, 4601307, 3847301, 3410285, 3273867, 3274287, 3304636, 3399404, 3651503, 4146934, 5010578, 6283677, 7327137, 7658805, 7524472, 7442007, 7667446, 8066450, 8538605, 8990554, 9527321, 10419789, 11877627, 14092263, 17213251, 21332655, 26529146, 32919093, 41338057, 54412551, 78236730, 123805938, 194917937, 265660937, 310538007]
18383C10538007J3321881p53832n643014j3795708l1040691m9250504n6125935
18376A67250204n0068205l5833509k2795331j3726174q508940n302698l022267
18369B7993080j996641k587951l279414l287035k483100j744595j197471p84848
18361A0632025l37000K43222M79577J38087o79953j235989j261392r54787o77605
18352F346185n06516l48337j90808J4287J59781K80934M10102K70402j23836m12036
18342E900158o03454p03176o98646n04260l02341k09345j67509r6276J4455J47450
18332B777056M34084P83852J057956Q90719K60696k98717l82180O3043N47797
18323F134306N56028L58744Q2215l85590r84830j330752j119688p40048m37912
$$ y = [310538007, 323859888, 323106056, 317463042, 303667334, 272626643, 223376139, 167250204, 117181999, 81348490, 58553159, 44826985, 36318045, 31015347, 27993080, 25996439, 23408488, 20129074, 16842039, 14358939, 12614344, 11416873, 10632025, 10295025, 10538247, 11017824, 11155911, 10475958, 9239969, 7978577, 7023790, 6346185, 5839669, 5491332, 5300524, 5314811, 5474592, 5755526, 6165628, 6436030, 6312194, 5900158, 5296704, 4593528, 3894882, 3390622, 3088281, 2878936, 2711427, 2615151, 2629606, 2777056, 3211140, 3994992, 5052948, 5943667, 6204363, 5905646, 5523466, 5586509, 6134306, 6690334, 7049078, 7131293, 6745703, 5760873, 4430121, 3310433, 2570385, 2132473]
18314B132473l01439k01627j43175m2533j3873k1357o4313r4431q9300j03784
18304A056641j01389o5953o1445k7560K2321L928M9905L833n022L0057J45881
18293A051197K69736M53645M84788K58921l259k02757l41653l81529k75899j32583
18283A180607K8621P507k0911k6610N544R7642K18714L13829K92592K05356M2569
18272B345460j69848k85771l53857l13783k42948j55843j46300r8732k7591m7622
18262E03165l6529j1818k9594p940L4358N2760J9423O876l3900n0588n3266q3824
18250C09123k3954o385K424L2059O297q914k1341K3265r847J6554k036L422j8811
18237C01856j943M1986K6062K4474K5964M7447K3786J5439j7138j8519k5639q630
$$ y = [2132473, 1831034, 1629407, 1486232, 1443699, 1429826, 1408469, 1344156, 1249725, 1160425, 1056641, 955252, 889299, 827854, 800294, 822615, 826543, 876448, 880281, 875259, 905316, 1051197, 1320933, 1774578, 2259366, 2518287, 2515028, 2312271, 1970618, 1589089, 1313190, 1180607, 1209228, 1216735, 1195824, 1169214, 1174758, 1272400, 1491114, 1804943, 2097535, 2302891, 2345460, 2175612, 1889841, 1535984, 1222201, 979253, 823410, 677110, 578378, 550787, 503165, 466636, 454818, 425224, 417284, 451642, 504402, 523825, 530701, 496801, 446213, 392947, 309123, 285169, 278784, 281208, 313267, 319564, 310650, 289309, 312574, 302727, 319281, 317245, 320667, 301856, 299913, 341899, 367961, 392435, 418399, 465846, 489632, 505071, 487933, 469414, 443775, 435145]
18225D35145M232M7874N7914L7490O3461J28294K68491N08928J023352J499170
18215D074351Q84176l46774j177658j152777p56883l83609j42121n2956k5807
18206I19942p4938j00744j13820j05545o1511l3476k9350j5906m8231o0391j9579
18195B56451k3868m9682L857K9616j8911m5507m4052o290J5218R766N7185N1005
18183B34788O0508O3212O1277N7395K7858k9953m2170m8342n8910n3951m3946
18172B27766j4012R225l0030m650j8637k6465L495q854k5791L8680Q071J18Q06
18159A59722J3813L11k9920N31J5145l444J9749j0296m2832j1163O850L4305K8673
18146A81444J6424J9237L07k4046K1573Q305J4465J2950J25j459L3129k8402R6
$$ y = [435145, 439377, 487251, 545165, 582655, 646116, 774410, 1042901, 1551829, 2575181, 4074351, 4958527, 4611753, 3434095, 2281318, 1524435, 1140826, 998705, 945749, 919942, 845004, 744260, 630440, 524895, 463384, 429908, 400558, 384652, 336421, 276030, 256451, 232583, 182901, 186758, 216374, 197463, 151956, 107904, 101614, 116832, 126598, 183783, 234788, 295296, 358508, 419785, 477180, 505038, 475085, 432915, 384573, 325663, 271712, 227766, 213754, 222979, 192949, 188299, 169662, 143197, 146692, 137838, 112047, 150727, 158798, 158916, 159722, 173535, 173846, 143926, 144457, 159602, 156158, 175907, 165611, 122779, 111616, 118466, 152771, 181444, 197868, 217105, 217412, 193366, 214939, 223244, 237709, 250659, 250784, 249325, 282454, 254052, 254148]
18133B54148k1420R95M3007K4287J814K9759L0961J4939P4605N7854M4655L8830
18121E94434K5374J00706R6985R3701J33112J73198K40668L83296M82393O52423
18111B976290R93347J615569K789505N327586J1412415K2000522J7088786m593655
18103E9610365j8869538j8228006r016743m398343k505627j550596j020542p22255
18095C298715n10145m34674l32092k48614k06964j62924j11390j04673j08885
18086A078354q7271q7774p0751p3076j4359k9801p665p7183p8852o3739l514m6590
18074D37779p6505o2144o2219l5062n346J6678l4020k7366j059M488k7167l2595
18062I5462j892J0151J3664Q656J9260k0393k6546J4090K2724k8570k3946K9037
$$ y = [254148, 232728, 233723, 276730, 301017, 302831, 332590, 363551, 378490, 453095, 510949, 555604, 594434, 619808, 720514, 817499, 911200, 1044312, 1217510, 1458178, 1841474, 2323867, 2976290, 3969637, 5585206, 8374711, 13702297, 25114712, 47115234, 64204020, 59610365, 40740827, 22512821, 13496078, 9097735, 6592108, 5041512, 4020970, 3298715, 2788570, 2353896, 2021804, 1773190, 1566226, 1403302, 1291912, 1187239, 1078354, 991083, 903309, 832558, 759482, 745123, 715322, 707657, 630474, 551622, 487883, 484369, 437779, 361274, 299130, 236911, 201849, 196503, 213181, 179161, 151795, 150736, 155224, 128057, 95462, 93570, 103721, 117385, 126041, 145301, 124908, 98362, 112452, 135176, 106606, 82660, 111697]
18050A11697J1795k7777l8298K1356l0699P289p874k5441J325K7341L4280M395
18038H9389J0438L8698J5629K193j2609m4868m431J6285k0884l1307p762j5666
18026C5105j8411K9201K5544L799m234j1332R798m1417Q087J233k3700j3583K7432
18013B7522M3031j2551j7551l2501o474n415K0725k450J1008Q592J3907J0385
18001E8228m0288k6620J1555O248R647J1885K0061j4392l474K4128j0268m1609
17989E101PK745J9360J9281q686J672J3294k2072l1374k2614Q97K7210q628Q97
17975b910n163j4018J8467L8346j6790P777q10J6798K7595j6996j4690J8794j579
17962E4821j5933q907j067l488Q257Q346K7585k750l2424j0210J4791j378j8517
$$ y = [111697, 123492, 95715, 57417, 78773, 48074, 55363, 47489, 22048, 23373, 50714, 84994, 89389, 99827, 138525, 154154, 156347, 143738, 98870, 94439, 110724, 89840, 58533, 50771, 35105, 16694, 45895, 71439, 75238, 71004, 59672, 69470, 28053, 36140, 37373, 13673, 90, 27522, 70553, 58002, 40451, 7950, 1476, -3939, 16786, 14336, 25344, 33936, 47843, 58228, 17940, -8680, 2875, 9123, 18770, 30655, 50716, 36324, 32850, 56978, 46710, 5101, 5108, 7853, 27213, 46494, 37808, 39480, 52774, 30702, -672, -23286, -22389, 4821, -3807, -2910, -8073, -22091, -3624, 34722, 17932, 25709, 24899, 41697, 69292, 52296, 37606, 56400, 54821, 38888, 29981, 28914, 25426, 33683, 42029, 69614, 66864, 34440, 24230, 39021, 37643, 19126]
17949A9126j1677k4687N478j2477j1777K6013K2862o293M24K581k4267J7231K949
17936E486R696J4989r162j8306J1479N169N141N395j746j9606j0885j4614K97
17923a6667J4275J7522j0325j2309j4315R956j2420J5844n759j1780J8884R168
17911B074p963j7164m785K92K5695Q623M2482o054N1660K3622q570p596R330M4798
17897A56444L2403M4581K9176J3884K905R266N144K8469N3474L5671K5428o998
17885D29847m292o602j6881P93j7976J771k7712l8099k9966l0430P99M1488K2203
17872C24943L3640J5364K0477m2835q6033n6972k4991k3723k2549M720K4383m444
17860A61980r119r642m2538j3619K6877K3633K0112r525j3724l8265j4771j423
$$ y = [19126, 7449, -17238, -11760, -24237, -36014, -10001, 12861, 6568, 6992, 9573, -14694, 2537, 5486, 15182, 30171, 21009, 2703, 14182, 19351, 24492, 29887, 28141, 8535, -2350, -16964, -16667, -2392, 15130, 4805, -7504, -21819, -11863, -24283, -8439, -14198, -25978, -7094, 2074, -5889, -23053, -27838, -27546, -1851, 6772, 49254, 43200, 94860, 118482, 109912, 102316, 111646, 156444, 188847, 233428, 262604, 276488, 279393, 288659, 293803, 322272, 375746, 411417, 436845, 429847, 425555, 418953, 402072, 402865, 384889, 386660, 358948, 320849, 290883, 260453, 261252, 302740, 324943, 358583, 373947, 394424, 351589, 265556, 208584, 183593, 159870, 137321, 142041, 166424, 161980, 152861, 143219, 100681, 87062, 113939, 137572, 157684, 148159, 134435, 96170, 81399, 79976]
17848G9976O691M608K5458L4704J4296R817K5517K9771M033l949K8298M2904M9634
17835C51758K9523M1274j2953m8372k6056J5458J9950Q852k4587l4851o6897n9167
17823A93932l6439J712J3947j3469J3992M8471O3581L1338k7968o1181n2403j7684
17811A57829l3504m3032J279k2450l7983j6886K562J6799L2340J8065j0594L3341
17799I7766K150k2294Q82j5373k936L847j2766j957j1957r103l1539k3185J4860
17786a1605O671K9488j5568k5389j3567J8534J4336R199k0249j9472j0319r833
17774d7774K4088L7756j1963N508R812L1192j3776j1578j3793r144j9949J2054
17762g567J8907J871r1Q150J0262k6660j4277L1466q669l2987J0592j2250n098
$$ y = [79976, 86667, 91275, 116733, 151437, 165733, 175550, 201067, 230838, 234871, 230922, 259220, 302124, 351758, 381281, 422555, 409602, 361230, 335174, 350632, 370582, 379434, 354847, 319996, 253099, 193932, 157493, 159205, 173152, 159683, 173675, 222146, 285727, 317065, 289097, 227916, 175513, 157829, 124325, 81293, 82572, 60122, 22139, 5253, 7815, 24614, 56954, 75019, 64425, 97766, 99916, 77622, 78504, 63131, 60195, 64042, 51276, 49319, 37362, 28259, -3280, -26465, -11605, -4934, 24554, 8986, -16403, -29970, -11436, 2900, 12099, -8150, -27622, -37941, -47774, -23686, 14070, 2107, 7615, 17427, 48619, 34843, 23265, 9472, 328, -19621, -7567, 11340, 13211, 13120, 21270, 31532, 4872, -9405, 22061, 13392, -19595, -9003, -21253, -26351]
17749b6351q112J2180O891J8055K76N655k7240N902J6713J141L4609K8406Q544
17736G6669l820j814m1033k6051J3562Q729K642K4307j3488j5797K386L810K826
17723C2928J1281j0852q583j4900J3406J3467N480K264q642k3061j4749k5953
17711b7914L261J6653k039M451o8k5189j3973l369L4187P471j1440P346k6354
17698c6977J1710J4058K6864M021J8187q156j859n095J0384K3356j6506m4679
17686d692k924O853j4373L0304J7283r145k7869k700k4729Q065M7000J8066n449
17673C5690j2574m0737N977J2684J5586J5493K91J1239J2117M012j1202j8370
17661C0206k2506J3798J8486R437L4250j896l2153k0806Q495K1478K7714l9780
$$ y = [-26351, -34463, -22283, -15392, 2663, 2939, 8594, -18646, -12744, 3969, 5110, 39719, 68125, 76669, 72849, 71035, 30002, 3951, 17513, 26242, 28884, 53191, 39703, 23906, 26292, 30102, 32928, 44209, 33357, 24774, 9874, 23280, 36747, 42227, 44491, 35849, 12788, -1961, -27914, -24653, -8000, -10039, -5588, -5656, -30845, -44818, -48187, -14000, -6529, -17969, -10623, -36977, -25267, -11209, 15655, 19676, 37863, 29707, 27848, 22753, 33137, 56493, 39987, -4692, -7616, -763, -15136, 15168, 32451, 23306, -4563, -7263, -31992, -23927, 23073, 41139, 35690, 23116, -17621, -11644, 1040, 16626, 32119, 32410, 43649, 55766, 59778, 48576, 30206, 7700, 21498, 39984, 49421, 83671, 81775, 49622, 28816, 37311, 58789, 86503, 46723]
17649D6723m3325O920J9848k4225r662o791l048L1475m415j3757k3615j9555L5078
17636h349j8690l2458N256N894J2551K1153K0347J7905K2905N349J2337q389j2865
17623D2946O626q872N36R954M131j9599k7371k3458j5625j814R416O2110j0582
17610B8398q905j659J8478l7328k1138J5364m367N819J1328J0185q955l801J133
17597D552L26K3771O797O123m2229K639Q180J3129o805j1241p752K250j7711j1239
17583b9210K1870L734J2428J5738L946j7066m0975n788L4647M329R280n612n47
17570F774J624k509o027R970j3133j1254J1268L111k3090m056K4868K4479J006
17557B3031j9797j4815m140M0931K7830J790o251p473k5132j0711j6394J5588
$$ y = [46723, 3398, 10318, 30166, 5941, -3721, -10512, -13560, 17915, 13500, -257, -23872, -43427, -8349, -27039, -59497, -54241, -48347, -35796, -14643, 5704, 23609, 46514, 51863, 64200, 55811, 42946, 49572, 40700, 41236, 51190, 55321, 35722, 8351, -15107, -30732, -32546, -23130, 38980, 28398, 19493, 17834, 36312, -1016, -22154, -6790, -11157, -5338, 5990, 16175, 7220, 3419, 4552, 4878, 28649, 35446, 41569, -660, 1979, 10159, 23288, 16483, 5242, -2510, -260, -17971, -29210, -7340, -3606, 8822, 24560, 28506, 11440, -29535, -35323, -676, 3653, 12933, 7321, 6774, 8398, 5889, -138, 9832, -3301, -14555, -3287, -176, -23266, -27322, -2454, 22025, 23031, 3234, -11581, -15721, 25210, 53040, 54830, 48579, 41106, 15974, 5263, -11131, 4457]
17545D457l038j3665L0278K4458R193l5087K397j7995q886N4787K7964k0802l2769
17532B1292j2313p97J1282k507J425j550n686j074k0035j7489K636J7610N366
17519a840p97J4519J5914o09j190J560P207Q849j1590R894J558l292j6372l5685
17505a1874j8594K6604J6572k0465J0395L1521P473p323l3414j5513k072j1351
17493b8041M0376R985j5857j652p369M178l516J4329j6580l3569o423K3983K8665
17480H509M957J1729k9720l6699J9538K7426k5149n452m1615J6872R414k7521
17468f7711K7791L7730K2134j2345J4493K10j789J1914r512R63M670k559O064
17455C2053K0889j594o173p668j1279J8296K5007N655j1300l952K599j4106k3088
$$ y = [4457, 1419, -12246, 18032, 42490, 51683, 16596, 18993, 998, -7888, 46899, 74863, 54061, 21292, 8979, 8182, 19464, 16957, 18382, 16832, 11146, 10072, -9963, -27452, -24816, -7206, -1840, -2637, 11882, 27796, 27187, 25997, 27557, 34764, 43613, 32023, 41917, 43475, 40183, 23811, -11874, -30468, -3864, 12708, -7757, 2638, 34159, 41632, 34309, 895, -14618, -16690, -28041, 12335, 22320, 6463, 4811, -2558, 1620, -1896, 12433, -4147, -37716, -44139, -20156, 8509, 13466, 25195, -4525, -41224, -21686, 5740, -19409, -24861, -66476, -49604, -40190, -67711, -39920, -2190, 19944, 7599, 22092, 22302, 20513, 32427, 22915, 23878, 28548, 25989, 32053, 52942, 51348, 45175, 37507, 26228, 44524, 69531, 75186, 63886, 59934, 62533, 48427, 25339]
17442B5339n109O8245J17892J23352l966j09711j16535n7924m1123k6497J9192
17431f845L1957K769r215K792J880p081m404k0754N466k625j7365j6186k915N0587
17417H061J3702j2497K511l0136n238N175K08j1230j2796K9475K4885J1903L5096
17404E9119K9290o812N042l3070m2047K3124L3865k0699k3561l9706j8207P695
17392b5967J3388o685Q053J7558R617P636n128j822r41j1534o294m6847j5531
17379f4497k564P959L2663Q638k094l706J2303j9257j5999L1294K399k0532k6389
17366e9782K4593J0629l4704q708m241K2651L5124Q496l0182j2090n402J821K6693
17353b5102K0949j1195j2388K061j1504p548o862K0306q791K0648Q621L363j4912
$$ y = [25339, 20230, 88475, 206367, 329719, 325753, 216042, 99507, 41583, 460, -26037, -6845, 25112, 27881, 18666, 21458, 23338, 16257, 11853, -8901, -3435, -6060, -23425, -39611, -42526, 8061, 21763, 9266, 11777, -18359, -23597, -18422, -18214, -29444, -42240, -12765, 12120, 24023, 59119, 88409, 81597, 86639, 53569, 11522, 34646, 68511, 47812, 24251, -15455, -33662, -25967, -12579, -19264, -11211, 6347, 15964, 23600, 18472, 16650, 15709, 4175, -2119, -48966, -64497, -67061, -59102, -26439, -17801, -19895, -23601, -11298, -30555, -46554, -15260, -12861, -33393, -59782, -35189, -24560, -59264, -67972, -72213, -49562, -14438, -5942, -36124, -48214, -53616, -51795, -25102, -4153, -15348, -27736, -25675, -37179, -44727, -51589, -31283, -40074, -19426, -10805, -7442, -22354]
17340b2354J8874L520l4046J2594K8933R796J8493K109k0497n973N576j7531O41
17327A35J1022q7l195L725J9829l378m4535N46P073J2882J7712k0198M780o42
17313E669k4585j2721J4790K8650L1258J3882j7961j389n178n5486l3638J6318
17301d0391L4556k5671j5100K250R007L0549J0478J6635j1485j1421j3066L355
17289a0304p720K1612l423J3397J1666j8248k1337m019J5389l23k6733n2891L8065
17276d4869R595K8669N8875j1907j0967n281K1505J1404k8635l2321k809L584
17264c157o233R021j1440q84K1983P508k4113j1817L11K3639r438j767j9733j9206
17250d5326L2627p537j7849J8903J6922M23j2071p53J7912j925j0994L2505r478
$$ y = [-22354, -3480, 40, -34006, -21412, 7521, 17317, 35810, 37919, 17422, 11449, 17025, -506, 135, 11157, 11070, 7875, 11600, 31429, 28051, -16484, -15938, -8865, 4017, 21729, 1531, 6311, 5669, -18916, -31637, -16847, 11803, 43061, 56943, 38982, 37593, 32415, -23071, -56709, -40391, -5835, -31506, -46606, -44356, -35349, -4800, 5678, 22313, 10828, -593, -13659, -10304, -18024, 3588, 165, 13562, 25228, 6980, -14357, -18376, -2987, -3310, -30043, -82934, -44869, -35274, -6605, 52270, 40363, 29396, 24115, 45620, 57024, 28389, -3932, -6741, -3157, -9390, -369, -11809, -12693, 9290, 16798, -7315, -19132, -18821, 4818, -4620, -6387, -26120, -45326, -12699, -20236, -38085, -19182, -2260, -1837, -13908, -14661, 3251, 1326, -9668, 22837, 13359]
17237A3359J0491Q779k3576k203K4284N185r567o1337l4326J9885M1060j032j1417
17224b0415o847K0090Q098N254L0644k4636j6494J1546J4931k0994m2791K7959
17212a3655M2853O136l5579j0864J8393L4245m548l8384o116J2049K473r210l2494
17199c4701K1818L9226O431m356j2714o815j6773J4475k4159J5161J2010r518
17187H5J1433K1400J7490r785j0217j3345j1991n416k822j6483k3814J8974M9446
17174B4955q015j4756l1553K0835J4552L6856O054l2900o311J2938l724j223m019
17161A3689K1966R768k8516j8897J9020o310O753j2811J8296k0388q954j6969
17149b3353k8933K1495K7231m615J7172k1938j9392j3500J7678K4102j6700j3076
$$ y = [13359, 23850, 32629, 9053, 6850, 31134, 36319, 26752, -34585, -68911, -49026, -7966, -8998, -20415, -27262, -7172, 926, 6180, 36824, 12188, -4306, 7240, 22171, 1177, -41614, -13655, 29198, 35334, -245, -11109, 7284, 41529, 36981, -1403, -7519, 4530, 7003, -2207, -34701, -12883, 26343, 32774, 28418, 15704, 8889, -7884, 6591, -17568, -2407, 9603, 85, 11518, 32918, 50408, 40623, 30406, 17061, 5070, -346, -3168, -19651, -43465, -24491, 24955, 16940, 2184, -29369, -8534, 6018, 42874, 48928, 16028, 9717, 22655, 18931, 17708, 13689, 35655, 45423, 16907, -1990, 17030, 10720, 17473, 4662, 22958, 2570, -6384, -23353, -52286, -30791, -3560, -8175, 8997, -12941, -32333, -45833, -28155, -4053, -20753, -33829]
17137c3829K7155J2151n6176j2222M0629j3427j208Q420J8951J659j9860l527
17125c1284K1541M0848J7916R204r361j7686P35k0328k6290J9421q606J2429O820
17112A5359j4062k6251k2383Q086m988j1593R355L5996L0564O899l5015j3806
17100b1839k3267j3519K4674J6415j3282P267n91M2478K278l6575l5146J4622
17088c6485K4917k4228j210r526O547m574O818M6327K0300J059l3545j1320N095
17075i825P959q024N303J332r351j9056Q212M632k2275k2679L2971K7680j1981
17062a5102r697L226Q804L374K4530L251k809K1155l362J8625k928j7131l6369
17049d433j9647p310J8097l3702l560j6286k79K1696J1057P040Q566P970k0369
$$ y = [-33829, -6674, 5477, -50699, -62921, -22292, -35719, -36927, -28507, -9556, -7897, -27757, -31284, -9743, 31105, 49021, 58225, 48864, 31178, 31913, 11585, -14705, 4716, -3890, 8539, 15359, 1297, -24954, -47337, -39251, -44239, -55832, -46477, -10481, 20083, 26982, -8033, -21839, -45106, -58625, -33951, -17536, -30818, -23551, -24142, 18336, 20614, -15961, -51107, -36485, -11568, -35796, -37006, -46532, -39985, -44559, -37741, 8586, 28886, 29945, -3600, -14920, -9825, -1866, -9890, -4587, -3255, -12606, -31662, -23450, -18818, -41093, -63772, -30801, -3121, -15102, -24799, -21573, -12769, -9395, 15135, 18386, 15577, 36732, 33370, 51995, 49067, 31936, -4433, -24080, -31390, -13293, -46995, -50555, -66841, -67120, -45424, -34367, -27327, -18761, -10791, -31160]
17036c1160J0147p910P962K7306J633k969L079k5815K3163K274k3970J0189K0536
17023A4465L2266n302k7402n752R387l098j2849p511J3947j38l0659j9907l575
17010d6128K1742K3850l6143K167K349k910k2163J9322K5363M666J0567j8279
16998a5597k415J9574L3200L694j9396K5279K9792l2882j5893R314n698l0379
16986a407k8945J1881j672m3989N540J3430N1860K9347J6655j3197j3199l2842
16974f538O284n97k983m594J0932J280k165O956O925j0241R328K2399O254r729
16960C3511j2645q355O517O094j5751k4172N531p367j9354Q123P656J5026L3707
16947B8521k3165q374L1325K602K187m38j4248m692K0483O058m214j0812J0059
$$ y = [-31160, -21013, -28923, -20961, 6345, 7978, 5009, 8088, -17727, 5436, 7710, -16260, -6071, 14465, 46731, 41429, 14027, 8275, 17662, 14564, 1715, -5796, 8151, 8013, -22646, -42553, -46128, -24386, -536, -36679, -34512, -32163, -35073, -57236, -37914, -12551, -7885, 2682, -15597, -18012, 1562, 34762, 38456, 19060, 44339, 74131, 41249, 25356, 34670, 28972, -1407, -30352, -18471, -20143, -64132, -58592, -45162, 6698, 36045, 52700, 39503, 26304, -6538, -254, -851, -3834, -8428, 2504, 3784, 1619, 8575, 15500, 5259, 14587, 36986, 43240, 33511, 20866, 12511, 19028, 25122, 9371, -14801, -9270, -16637, -35991, -27868, -20212, -5186, 28521, 5356, -3018, 28307, 30909, 33096, 32658, 18410, 13718, 34201, 40259, 36045, 25233, 35292]
16934C5292j6966k3781l9074J4353K7320J6652n01o349J2429J523J2745Q70q027
16921B6486N14O14j1934l9619R448K1467K5859J6855o983L3862J6913m2880j9945
16908C0657l129q604J0910j0914k1456K4480J6441j84p086m59L308m4434j5587
16895b6057J0285M680L0135O161l522l8030Q73O795K3820j8140k2134N772j704
16882b1066k5126J6986r869k1575L2915K1119m012L64j8807l448M226J4761j9585
16869c3117M306j8943j2272K7074K3368K4320J1914J4351J2293l4901p964N714
16857A6143j9339l2829O058J4331J1548L6721R587k4378j8468K2520k2707j8826
16845a9639l240j0850k999n031n61O361K4082j4164o83P080Q069l2305M16O235
$$ y = [35292, 18326, -5455, -44529, -30176, -2856, 13796, 13295, 6946, 19375, 20898, 33643, 34513, 26486, 27000, 27614, 15680, -23939, -14491, 6976, 32835, 49690, 42707, 76569, 93482, 50602, 30657, 27528, 18924, 29834, 18920, -2536, 21944, 38385, 38201, 31115, 30656, 33964, -10470, -26057, -15772, -11092, 19043, 25204, 21682, -16348, -15475, -8680, 15140, -3000, -25134, -19362, -21066, -46192, -29206, -39075, -60650, -27735, -6616, -10628, -10264, -29071, -32519, -28293, -13532, -33117, -28811, -47754, -60026, -32952, -9584, 14736, 26650, 41001, 53294, 18393, 10429, 16143, -3196, -36025, -29967, -15636, -4088, 32633, 42220, 17842, -626, 21894, -813, -19639, -22879, -33729, -36728, -41759, -42320, -35959, -11877, -26041, -26724, -19644, -11575, -43880, -43464, -37229]
16831c7229p426p137L946j3567M429M597L882J0012J6533m911j1144K4522J7630
16818D137J0306J1537J6746j8370q82n164k3463m577O750J295j9246j52J0355
16805a0728K0076j3050j8002j9334L133L0760K591Q700K1267L1233O137j0872
16793E1911j8752J3478k3285r044O598k419j7304R294l486j4310M963R733k46
16780G131M57N3189r547j1020K473Q963j9452j7860j8571M5472L5337k935k7100
16767D6537j2595j6715l6759J0405j2888L002K6273L9637J920n2634k5634J5869
16755a3582K4076n027K043r083K74L1612j3341k8057J1214j7123j3459K5069q025
16742a3409j6225K7851j336k7909k638O788N1920L0438j4026k8025k0688j1551
$$ y = [-37229, -44655, -51792, -47846, -61413, -56984, -52387, -48505, -38493, -21960, -26871, -38015, -13493, 4137, 14443, 25980, 42726, 24356, 23474, 18310, -5153, -9730, -2980, -1685, -20931, -21083, -10728, 9348, -3702, -21704, -41038, -37905, -7145, -4554, 4146, 25413, 56646, 62783, 51911, 33159, 46637, 23352, 14308, 20906, 18487, 1183, 10477, 6991, -7319, -2356, 7377, 7131, 7588, 60777, 51230, 40210, 42683, 51646, 32194, 14334, -4237, 41235, 76572, 73637, 46537, 33942, 17227, -19532, -9127, -22015, -19013, 7260, 46897, 48817, -3817, -29451, -13582, 10494, 5467, 7510, -1573, -1299, 30313, 16972, -11085, 129, -16994, -30453, -5384, -13409, -29634, -1783, -3119, -31028, -33666, -26878, 25042, 55480, 41454, 13429, -7259, -18810]
16730a8810K3632k4106l5233K2680Q400J1035K1465j0721L70n857p822L702p138
16717a8403j8397k2611K7333K1565P509J5822k0498j7623K1756J6903K316k1493
16705e821j0978j0757o67J3122k3687n264k0036K0016N5659K0033j7504k2007
16693g891j7278O966l1661j4914p640j1217M122K6486J9904j694J2577K3079P395
16680H234j23j0032k3923J687J2597p375j4750Q623j980j2258L2028J3385j2152
16667f039K9j5816k8580j5995K8384N2817L6971L6850m1621l2727j8840J393k5128
16654b8302m595P608j4155J8659O078K4084J4708l215k6025k6301K8616m404j4818
16641b2062J5278L5509J1834k1438j7528l358K195m177k309l3441k727J8133n523
$$ y = [-18810, 4822, -19284, -54517, -31837, -23437, -12402, 9063, -1658, -1288, -7145, -14967, -11265, -18403, -36800, -59411, -32078, -10513, -3004, 12818, -7680, -25303, -3547, 13356, 15672, -5821, -16799, -27556, -28223, -15101, -38788, -44052, -64088, -44072, 11587, 31620, 14116, -7891, -25169, -18203, -49864, -64778, -72418, -83635, -79513, -53027, -33123, -34817, -22240, 839, 8234, 8111, -1921, -25844, -24157, -11560, -18935, -33685, -25062, -27042, -39300, -7272, 6113, -6039, -6010, -21826, -50406, -66401, -38017, 14800, 51771, 88621, 47000, 14273, -4567, -3174, -28302, -32897, -25289, -39444, -20785, -14707, 9377, 24085, 20870, -5155, -31456, -2840, -7244, -22062, -6784, 28725, 40559, 19121, 1593, -1765, 430, -3747, -6056, -39497, -42224, -24091, -29614]
16628b9614l1415n867J7348N8444J3580n1362q808O255j4578k1309K5567L3338
16616h421l393j9114R942j0730k0419K8851N5172J0552j4919k5350m3810j0351
16604e1990K6258K3572r705Q077K8654K910J3798j520m444o274L0856j6962j5765
16591B7465O102j325j594J0770k661p485k355J4142q047j5988l0520r782P72k1364
16577d1870m751L0241J5190j8606j4157L0772J9557k7839p923J4196P837K5893
16565B8540P833p919k3089Q85R425J3364j1581J1720J4076O005r688j6446j7039
16552F086K9496j3834m2745j364l46K1342J0850q683r279Q162K5208k6095R823
16539H621L3994N201j8046k2012j4976J1672j4940j0023O83L3531J7042j717Q94
$$ y = [-29614, -61029, -66896, -49548, 8896, 22476, -28886, -37694, -31439, -46017, -67326, -41759, -8421, -11814, -30928, -20986, -31716, -52135, -23284, 31888, 42440, 27521, 2171, -41639, -51990, -25732, -2160, -11865, -3788, 24866, 27776, 41574, 40054, 35610, 29336, 60192, 43230, 27465, 33567, 32242, 30648, 41418, 38757, 31272, 28917, 43059, 35012, 19024, -11496, -21278, -20506, -41870, -46621, -16380, -1190, -19796, -33953, -3181, 16376, -11463, -19386, -5190, 2647, 28540, 36373, 28454, 5365, 6250, 15675, 29039, 17458, 29178, 43254, 49259, 39571, 23125, 6086, 35582, 21748, -20997, -22361, -22707, -1365, 9485, 802, -8477, -315, 24893, -1202, 8621, 42615, 47816, 29770, 7758, -7218, 4454, -10486, -20509, -19826, 13705, 30747, 29030, 29924]
16526B9924Q109J4064k456r471J2032N106J8741j1207o1581n013K8606J5237j722
16513D0369k8942m5194j2401J55m822K6986J6580J6359J142n873R291P677j9914
16500A413Q460o837m679J4957l231r298J3873j4853k3627j1000j0784j793Q989
16487c8410j6038J1522m594K0927L2538J1868k0072N769l988N326J2605o448k3775
16474a2770K502J921P588J2095M975k1772o5108J4362J0151K1799M5817J8131
16462C9691k3848j7325j8737k6920p203O938K4022k586J5933K2083L705m0771
16450b5018l629l319l3794j7859m460K8379O961k640Q427K8758K720k4618n725
16437d5817K4153M772M6562l511m6242K929J0088r305K9642J1008m161M408R245
$$ y = [29924, 38033, 52097, 49641, 40170, 52202, 57308, 76049, 64842, 3261, -1752, 26854, 42091, 40369, 11427, -33767, -46168, -46013, -50835, -23849, -7269, 9090, 10232, 4359, 13650, 21327, 1413, 9873, 3036, -1643, 13314, 10083, 785, 14658, -195, -23822, -34822, -45606, -47399, -38410, -54448, -42926, -47520, -26593, 5945, 17813, -2259, 3510, -478, 4848, 17453, 11005, -12770, -10268, -8347, -759, 11336, 16311, -5461, -70569, -56207, -46056, -24257, 21560, 39691, 15843, -1482, -20219, -47139, -54342, -47404, -23382, -25968, -10035, 12048, 15753, -25018, -28647, -31966, -65760, -83619, -88079, -59700, -52739, -55379, -46952, -18194, -15474, -40092, -45817, -21664, -16892, 29670, 26159, -20083, -17154, -7066, -16371, 13271, 24279, 20118, 24526, 33771]
16424C3771O794N308k7741j1685O107K0426j1331l2340N193j3412M842q17m877
16411a9762m216O812J8252J4967J3970J1120l052j7936j3629k580k0915k9376
16399d6345o943L1328L1102J9360o631J5894K6695K5061m0524k8899J1826j0646
16387B1278k9248O523L161Q303M701K9850J2128J5009O131k6426j2896j1849J5417
16374D2082k1893j1133j2102P711j8j0102q16J3016l372j2351R826J6273o037
16361A1084j3639q516K0857J5064k4729r406N20Q60l2653j1311L4019J0806j5436
16348b2480j8994k482M250J1345J4116J7171J5412n903n838l7104j5081J7481
16336b8107J413M2662J4975j0290j8334j0951j1716j485Q222n077k952L437q574
$$ y = [33771, 40565, 45873, 18132, 6447, 12554, 32980, 21649, -10691, -5498, -18910, -14068, -14885, -19762, -23978, -17166, 1086, 16053, 30023, 41143, 38091, 20155, 6526, 3946, -16969, -46345, -53288, -21960, 9142, 28502, 21871, 37765, 64460, 89521, 48997, 20098, 31924, 21278, -7970, -1447, 1714, 10017, 14718, 44568, 56696, 71705, 77836, 51410, 38514, 26665, 42082, 20189, 9056, -3046, 4665, 4647, -5455, -6271, 6745, 3373, -8978, 848, 17121, 11084, -2555, -11071, 9786, 24850, 121, -9285, -8765, -7905, -40558, -51869, -17850, -7044, -22480, -41474, -43956, -39706, -28361, -14245, 2926, 18338, 12435, 6597, -30507, -45588, -28107, -26694, 15968, 30943, 20653, 2319, -8632, -20348, -21833, -13611, -18688, -21640, -18203, -26777]
16323b6777K9799K895k9839R203k355L956J1541j4016M242J2986j8422j0932K1034
16310f685L9854l8603l4449q899l786j4078K8508K3532K0803K6988r24j2339j7199
16297B723N56M4705O914j3397r113n9103n0401k399J2432L9862L9735K5359r995
16284B7878r799R375K8521j6504J894K442l9711j4224o855j0016J274n782M066
16271b7441J8229K6340J3490j018R152j2942J8452N58j1698l6088j8419k364K0701
16258c048n865k6967l944O675L74J8770R372k1906j6969K4228J0545J4832j3960
16245g863l6777q4L768m872O972J4240R335l295J3750J7255N668P713J6114j4406
16231B7518j4901L4300k4200k207j0385j2166j954n594J571J0193K4166k0359
$$ y = [-26777, 3022, 5917, -23922, -14719, -17074, -13118, -1577, -15593, -11351, 1635, -16787, -27719, -6685, 33169, -5434, -39883, -48782, -52568, -66646, -38138, -14606, 6197, 33185, 32261, 19922, 2723, 3279, 47984, 54898, 41501, 32388, -26715, -77116, -79515, -67083, -27221, 12514, 37873, 27878, 18079, 27454, 55975, 39471, 41365, 43807, 4096, -10128, -16983, -26999, -25725, -31507, -27441, -9212, 17128, 30618, 29600, 38752, 25810, 44262, 44820, 33122, -2966, -21385, -23749, -3048, -8913, -35880, -39824, -33149, -32775, -14005, -4633, -26539, -43508, -19280, -8735, 6097, -7863, -44640, -44724, -40956, -45828, -38856, -24616, -15281, -18576, -4826, 12429, 18097, 25810, 41924, 27518, 12617, 46917, 22717, 20510, 10125, -2041, -3995, -9589, -8018, 2175, 26341, 5982]
16219E982l7779j0482J0339J8378j2027L152K4895J584j4699k9564K236N0008
16207A2023n302k5778Q090K3639k441r235k3261J937k513J7322l4324j8559L1219
16194b7183k473J0751m843n336j674K2404P4L042J9365j8555k3599l282J6622
16181a4687j8231P40J0114N953J5492J080j1684J3171K6618J1143J083k9441k8721
16168a7370O441K007m106j6712j4713K3168O677K602m0389k5503K9946K1279J5022
16155a1651J1133K3551j3896Q102O33k303O951j4007k5555P877j3446j8766j2658
16142e4035q209L7134K3181K647r34l9463o3K4193k0468n099L2773K3744K5364
16129D0765j0620k2534j5485J5000J0560l2387r735J5430J8088k2216Q46K09k306
$$ y = [5982, -31797, -42279, -31940, -13562, -25589, -22437, 2458, 4042, -10657, -40221, -37985, 12023, 6721, -19057, -10967, 12672, 10231, 996, -22265, -20328, -22841, -5519, -39843, -58402, -27183, -29656, -18905, -23748, -29084, -30758, -8354, -8280, -5238, 14127, -4428, -28027, -31309, -14687, -32918, -32178, -22064, -16111, -619, 461, -11223, 1948, 28566, 39709, 40792, 11351, -17370, -10929, -8922, -13028, -29740, -44453, -21285, -14608, -12006, -52395, -77898, -47952, -26673, -11651, -518, 23033, 9137, 17239, 17872, 15569, 22520, 8513, -17042, -9165, -22611, -41377, -54035, -62244, -25110, -1929, 718, -216, -39679, -39742, -15549, -36017, -41116, -8343, 15401, 40765, 30145, 7611, -7874, 7126, 17686, -14701, -24436, -9006, 9082, -13134, -12288, -12079, -14385]
16116a4385O820j0166j8608p494m386M500L1775K887j1358r087L538R352j6470
16103c3082j263K003J1592J6568K2875L171Q157K6923O086k4935M572q906k5888
16090G873l697R197J346j4966J7348K0891l428n991l061j5764k1064j4624p137
16077c3077j712M0224N1051J3444l2330k0370P341J16k9567K883J2384J1020q015
16064A3392J4247J3812R978j6859p198J9804O639K3553P566j2494j1598j4126
16052D6716k3038j5048l886K1256j8076n750J5141K6179j3760r414l505j419J0850
16039B6246j8878n5372j8397K0028N1774M1287Q504k9545k520K0490k3597l7913
16027a7893K7837N2744j5908l7690j59L984m104j8327k3151j6755Q827L4684j2822
$$ y = [-14385, -7565, -17731, -36339, -43833, -48219, -43719, -11944, -9057, -20415, -29502, -25964, -16612, -33082, -34345, -32342, -20750, -4182, 18693, 21864, 30021, 56944, 63030, 38095, 42667, 33761, 7873, 4176, 13373, 14719, -247, 17101, 37992, 34564, 28573, 25512, 9748, -11316, -25940, -33077, -34789, 5435, 56486, 69930, 37600, 17230, 24571, 24687, -4880, -1997, 10387, 21407, 13392, 27639, 41451, 51429, 34570, 27372, 47176, 53815, 77368, 84934, 72440, 60842, 46716, 23678, 8630, 4744, 26000, 7924, 2174, 17315, 43494, 29734, 20320, 16815, 15396, 26246, 7368, -48004, -66401, -46373, 5401, 46688, 55192, 25647, 23127, 43617, 20020, -17893, 9944, 62688, 46780, 9090, 8931, 12915, 8811, -9516, -32667, -49422, -40595, -5911, -18733]
16014a8733J1723L1832L926n454K1994K9573j7246l0174k1409j7804K229J1877
16002B334L311n335k0729K4755K6552r918p901j8895J8280K1903k4350n33K2762
15989C2236j8109m8132J8489j4556J9463J6558m063r080K9782j5271O588L515
15977A7420j8822j2056K0489j1593J4366N241k1699k7299k925J3618J8298j30
15965e092J4706K6708j0413l191l8249k2997J9998J7172j264m941j9390K7847
15953H94L019l9080m520O512K2195J0884j0433O610p446Q840J4754m851J1194
15940A8572N784J8070j017j983J7919N152l4685l9961l8959j0218J4899J8884
15928b7543Q030O975K0287J6637k1755k941K9548o097j1558j9836J5141L7004
$$ y = [-18733, -7010, 24822, 28748, 23294, 45288, 74861, 57615, 27441, 6032, -11772, -9543, 2334, 5645, 310, -20419, 4336, 30888, 20970, 13069, -5826, 12454, 34357, 10007, 9474, 32236, 14127, -34005, -15516, -30072, -10609, 5949, 1886, -7194, 22588, 7317, 13905, 17420, -1402, -13458, 7031, -4562, 9804, 15045, -6654, -33953, -36878, -23260, -4962, -5092, 9614, 36322, 25909, 22718, -15531, -38528, -18530, -1358, -2622, -7563, -26953, 894, 3913, -35167, -39687, -33175, -10980, -96, -10529, -3919, -11365, -2525, 12229, 7378, 18572, 24356, 42426, 41409, 39426, 57345, 62497, 27812, -12149, -51108, -61326, -46427, -27543, -19513, -12538, 7749, 24386, 2631, -310, 29238, 23141, 11583, -8253, 6888, 43892]
15916D3892J2369j1470l214r721J6984J8041j0545q958J0731N881o296m7968k3046
15903a3320J369J8142K2492o796m954q210j3279l094p80k470K7863K8937K4069
15890F9969k4528l4016j4511m4067P054K3654R010k6431L650M277K3352k207o810
15877a1604o201J5797p317j1908J5732r095j0394j583k658j9134n22J5904J4788
15864a8195J2733J9633l0698j43J8973J3965j3145q050j3550L112j0558R858M8790
15851C2725k48k1656O467J5466n163k9956q912r970J4504o798m150L5896L2067
15838E0272j7415k9920l0001K7502Q60n244Q990J0607l7203m615j016K2691r250
15825a3742J2165j765j002O391Q325N333m310J1405j4436m813j4592J5480L5555
$$ y = [43892, 56261, 44791, 41577, 31856, 48840, 66881, 56336, 47378, 58109, 63990, 57694, 9726, -13320, -11951, 6191, 28683, 21887, 16933, 8723, -4556, -7650, -8430, -10900, 16963, 45900, 69969, 45441, 11425, -3086, -47153, -40099, -16445, -7435, -33866, -30216, -25939, -2587, -4794, -11604, -17805, -2008, -9325, -21233, -5501, -14596, -24990, -26573, -29231, -48365, -48887, -32983, -18195, -5462, 14171, -16527, -16670, 2303, 16268, 3123, -4927, -18477, -15365, -25923, -16065, 32725, 32477, 10821, 17288, 32754, 27591, -2365, -11277, -21247, -6743, -13541, -17691, 18205, 50272, 32857, 2937, -27064, 438, 1298, -3946, 5044, 15651, -21552, -26167, -27183, -4492, -13742, -1577, -3342, -4344, 2047, 10372, 15705, 11395, 22800, 8364, 3551, -11041, 4439, 39994]
15812C9994n642p228l2536n36J2939L5977j5939l8671J8316J849O085j220k902
15799A0486J4515j0972m1870k0713J236K9461K0122j3245j1236L5317Q293N56
15787B1950M34j3313l1302j18J3788Q927n331j2586K9283m703J0896j6413j0494
15774h982n780J3023M6171k0388l4088o382q428J1100O7301K220m4028n0255J9223
15761a9293P3354J302n2425p180K100J5355o027l3247J73N4549J5501n825j8653
15748A9684j3661J0544L692l2109k150J8114J0371k7042k241L4932O683j9313
15736G504m232n447j4374m262J534J5707K7547M2146N153n5833M811k4910l3901
15723c8557m229M8398K2439j7586J2937J5489L350j7703k3785K440m710j0986
$$ y = [39994, 34352, 27124, -5412, -5948, 6991, 42968, 27029, -11642, 6674, 8523, 14608, 13388, 10486, 25001, 14029, -27841, -48554, -47318, -17857, 2265, -10980, -22216, 13101, 21394, 21950, 22384, 9071, -22231, -22349, -8561, 366, -4965, -17551, 11732, 7029, 17925, 1512, -8982, -14762, -1739, 44432, 24044, -10044, -16426, -24854, -13754, 53547, 55767, 11739, -38516, -19293, 54061, 55363, 2938, -4242, -2142, 13213, 7186, -26061, -25888, 28661, 44162, 38337, 19684, 6023, 16567, 20259, -11850, -14000, 4114, 14485, -12557, -14798, 20134, 26817, 7504, 3272, -2175, -16549, -20811, -19277, -3570, 23977, 66123, 71276, 15443, 20254, -4656, -38557, -42786, 5612, 28051, 10465, 23402, 38891, 42241, 24538, 753, 3193, -1517, -12503]
15711a2503J0550L240R816L1947M7307J7741j077k1848q893j1426k2110l1005
15699A1739N522K3751k0610l9517K5765R752j4619J805j0940j4447l6329J9577
15687c8551K1405M557L5916L5604L505j1741j6218j7313j3785K5033l704l3454
15675h746P502m027n624K9388O360j3015m154L263O593L46J9105P51k4295K6590
15661D0037R234l1036P03r608q036p162j5306J2282L3483K6958k8869l6313R703
15648c930j2704n079P417j341r604M023K3930P162m052N116k5247o028j3463M197
15634b9603L8110J2902M704k4804l4247k548L068P498k7579J8954L6480K6980
15622B9915K279k0618l9060k5380K1875J8885K4195m72j6821J4030n3019J1087
$$ y = [-12503, -1953, 1287, 11103, 43050, 90357, 108098, 107021, 85173, 76280, 64854, 42744, 11739, 17261, 41012, 20402, -19115, 6650, 16402, 1783, 3588, -7352, -21799, -58128, -38551, -17146, -12589, 23327, 58931, 62436, 50695, 34477, 17164, 3379, 28412, 24708, -8746, -1244, -5271, -10895, 18493, 24853, 11838, 7684, 10947, 17540, 17886, 36991, 37742, 13447, 40037, 49271, 18235, 18938, 9330, 1294, -5868, -21174, -8892, 24591, 51549, 22680, -13633, -3930, -16634, -21713, -14296, -15637, -25241, -21218, 2712, 9874, 5822, 10938, -14309, -20337, -33800, -29603, 8507, 21409, 26113, 1309, -32938, -35486, -32418, -24920, -52499, -33545, 2935, 29915, 32194, 11576, -27484, -52864, -30989, -12104, 12091, 11619, -5202, 8828, -44191, -33104]
15610c3104L4584K715q36j0629M023q168n122j2052J6216J2383J098m2753n1087
15597i2732J0810M1192J5641p317K4354K5843J1360K1751L587j8421P254O116
15585D9438k0860j076j9115j5356q998k2396R937k4587j2685j8764R124J9945
15573e5393M8508L2345l504k4213K1116j4085o149K314L0076K5136l4456k0241
15561A454L334K9483R103j4801K847N821L0344m299m1639L806L5291j9362R32
15548D2314j1715l1727o582J1523J4848j5027q765M263o459J3202j2024M154J4709
15535A2714K996j6539O839j315k447M788L4913j981j3158k2523n991q301j6723
15522b6728l9688K7541n823k2625J1353K1643L3119J622k8086Q95k2096j5042
$$ y = [-33104, 1480, 4195, 3359, -7270, -3247, -11415, -16537, -28589, -12373, 10, 1108, -41645, -92732, -81922, -40730, -25089, -32406, -8052, 17791, 29151, 50902, 54489, 36068, 43322, 49438, 28578, 27502, 8387, -6969, -15967, -38363, -28426, -53013, -65698, -84462, -75338, -55393, -6885, 25460, 21956, -2257, 18859, 4774, -1375, 939, 31015, 56151, 21695, 1454, 4788, 34271, 43374, 28573, 31420, 37241, 67585, 63286, 21647, 25453, 60744, 41382, 42314, 30599, -1128, -7710, 3813, 18661, 3634, -5131, -868, -7327, 5875, -6149, -1995, 12714, 15710, -829, 6010, 4695, 2248, 7036, 41949, 39968, 26810, 4287, -1704, -10005, -26728, -66416, -38875, -44698, -67323, -55970, -34327, -1208, 414, -27672, -26777, -48873, -63915]
15510f3915M0666K6905r740K5264J2761P372n796q074R031j5140k0464p839N277
15497c692q68j6253K366J1191k093j3006K8628P538k2711q891k8113k5797O046
15484f5655K1611j7033k0584P030J471J5910Q625L9159L2206j9444K22K2474K105
15471B8097Q012K78N848J1762K0377O700l6423m1121J075M719K995k469K308j8425
15457f267o658J8258j718k1668J088L1826J9198m8751r454L3975K1290o638J9770
15444D4251P618j0143m2711l5219o084K1806K2179J1491j1365K4751L421q41J3221
15431D2375J1095j3004j6609n3811O848J488J1657R504J4774J0576K099M608N010
15418C6610k2230j5219P519r433j6401m153p259m578K3387P206J754l889K5195
$$ y = [-63915, -23249, 3656, -6084, 19180, 31941, 39313, 33517, 25443, 34474, 19334, -1130, -8969, -3692, -4560, -20813, -18447, -7256, -9349, -22355, 6273, 13811, -8900, -17791, -45904, -71701, -65655, -44044, -61077, -81661, -74631, -73160, -57250, -48625, -9466, 22740, 3296, 3518, 25992, 28097, 36109, 36387, 42235, 53997, 74374, 81074, 44651, 3530, 4605, 9324, 12319, 9850, 12158, -6267, -12925, 5333, 3615, -18053, -16965, 14861, 34059, -14692, -24146, 9829, 31119, 24481, 44251, 51869, 41726, -985, -36204, -42288, -20482, 1697, 13188, 1823, 26574, 29995, 29154, 42375, 53470, 40466, 23857, -29954, -23106, -21618, -9961, -457, 14317, 24893, 26992, 31600, 36610, 14380, -839, 6680, -2753, -19154, -23307, -30566, -35144, -11757, -4551, -2797, -6686, 18509]
15405A8509J9182J3942J329q084j2481l1556j6074K2459J0338o004k1388o939
15393a6767k079R044K508J1656k539j5617n511k0759k57m204J3739L8659l706
15380D167k3778n620J2114K210J8012q948M244K5171M991p559j9166K174l555
15367D457m159j3935j6239J7444j8350J3866M3281J3732m227r907n008n13m838
15354A5604l4930k3015K5728L5207m963l1023q890O01k2487j2285J5093K3713
15342b1647n488r37K479L948K757J5460j907j6632j1656J5824K3949R252l310
15329A2092j7736P480j5043o980K8379R42j4166k5857k5639J5402n916N427J5177
15316b6438K968K9552K8753k8230k2093L0373L2087k0400j2687J031K093J767
$$ y = [18509, 37691, 51633, 52962, 44878, 32397, 841, -15233, 7226, 17564, 11560, -9828, -16767, -18846, -9802, -7294, 4362, 1823, -13794, -19305, -40064, -40321, -44525, -30786, 7873, 4167, -19611, -25231, -13117, -10907, 7105, -1843, 2401, 27572, 32563, 25004, 5838, 8012, 4457, 298, -13637, -29876, -12432, -30782, -16916, 26365, 40097, 35870, 25963, 20955, 20442, 15604, -19326, -42341, -16613, 18594, 13631, -17392, -26282, -25681, -48168, -60453, -45360, -21647, -27135, -28072, -25593, -21645, -18888, -3428, -5335, -21967, -33623, -17799, 6150, 15402, 12092, -5644, 1836, -13207, -20187, 8192, 9134, -5032, -30889, -56528, -41126, -47042, -41615, -26438, -23470, 6082, 34835, 6605, -15488, 14885, 46972, 26572, 13885, 14916, 17009, 18776]
15304A8776M065j8445M867K5556o601q179n044m129J9047n414k4725J7106R201
15291B6081k8624N484J3372j5148k6725r247K3241R889r732O346J4523L3691k3054
15278B0097j7673j8562M915J7315K5292o895j7639K248K0205p506k9577J737Q411
15265B368k0082o015N160L2401l818k2720J7222p88J6482J8741j8070j6601L782
15252H062j4492M3262J4802q616l1616K612J2611j1466K3631K0716l1442k5257
15240B807k0211j0620P510J1360P179j0011n351l876K6205J4154O669R78n440
15227B1353r482k6882r95k552j665p01o591R60P702n508Q374J1745K2028N3o654
15212A1185J3013j0013l6423K539J1557k2505J2157q846p874M4411J3551k524
$$ y = [18776, 22841, 4396, 9263, 34819, 28218, 20039, 14995, 10866, 29913, 24499, -226, 16880, 26081, -2543, 2941, 16313, 1165, -25560, -34807, -11566, -1677, -11409, -5063, 9460, 43151, 20097, 2424, -16138, -11223, 6092, 31384, 24489, 6850, 9098, 29303, 21797, -7780, -6043, 2368, -17714, -23729, -18569, 13832, 10014, -12706, 4516, 3728, 20210, 38951, 20881, 4280, 8062, -6430, 36832, 51634, 43018, 11402, 14014, 26625, 15159, 38790, 59506, 28064, 2807, -17404, -28024, -20514, -9154, -1975, -11986, -17337, -21213, 4992, 19146, 25815, 26793, 21353, 11871, -15011, -16006, -18558, -20223, -20924, -27515, -26555, -18853, -24361, -15987, -4242, 17786, 17839, 11185, 24198, 14185, -22238, -19699, -8142, -30647, -18490, -27336, -35210, 9201, 22752, 20228]
15200B0228j8575j5789m256R926K3178k0259k4271l455k8374O816O081K6225L4795
15187A2270Q57L6831N599o565k9310J1127Q844L892k9725k6856O989r080k54j8048
15173c3429K0708K9294J3917J7322L919j8561m592l3457l6481R14J4970J7051
15161h425P212K6498J3230k8528l8916j1628n299J6049L4446P199k6729k6657
15149d1548j4929J4605L2007Q656j4165m045J8291O301k875K5385M0633R116k8224
15136D9208m5614M201J9224j8798R997J4529j2798j6170n470J5717O317J226j6888
15123D681K0347J9619j3451l0798M416K5844K7106l2408l4002K7277J2137q857
15111B1911r332j4560j9752M2614K1878j0418n832K3328L058m4564K266j3827
$$ y = [20228, 1653, -14136, -18392, -8466, 14712, -5547, -29818, -33273, -61647, -54831, -48750, -22525, 12270, 13127, 49958, 55557, 48992, 19682, 30809, 39653, 43545, 13820, -13036, -6047, -15127, -15381, -33429, -12721, 16573, 30490, 47812, 51731, 33170, 28578, -4879, -41360, -40446, -25476, -8425, -1213, 25285, 38515, 9987, -28929, -40557, -45856, -29807, 4639, 11838, -14891, -41548, -56477, -41872, -9865, -1209, -15374, -19419, -1128, 5173, 2298, 27683, 68316, 77432, 49208, 3594, 7795, 27019, 8221, 18218, 32747, 19949, 3779, -1691, 14026, 20343, 21569, 4681, 25028, 44647, 31196, 398, 4814, 30658, 57764, 25356, -8646, 18631, 30768, 21911, 12579, -1981, -21733, 20881, 42759, 32341, 26509, 49837, 52895, 8331, 10597, -3230]
15099c230K972K0382o786J969J0263k0161J992J6407M1829J7289L425l0012m7697
15086H642L076k007o4545n900L5326P031K4644K1399k6886l4230j5380M6393L3871
15073C1434j0953l616p907j1618P656k6620K365K3588o632m951r407n788Q951
15060a3498L847k857k0385k5021O083J5525K6275P900j6328o198J8733K1202J646
15047A6924J3859L2573r200o434k336j6843k8971k0569J2148l04k0293J3642N0885
15034C5081J0886r494L43j1650j504J131J2920J6083J692k5954o918M098k9532
15021b818L346j2652k2364p748R852J8781K9249N440J5308N627O46L2656J2626
15008H7949N5141J11373R9829J84231M21347O39293K05176l16494n71239m02883
$$ y = [-3230, -258, 20124, 13338, 15307, 25570, 5409, 7401, 23808, 65637, 82926, 86351, 56339, 8642, 11718, 9711, -54834, -60734, -25408, -18377, 6267, 27666, 780, -33450, -48830, -2437, 31434, 20481, 16865, 8958, -2660, 4996, -21624, -19259, 4329, -2303, -7254, -16661, -22449, -13498, -9651, -12508, -32893, -57914, -51831, -36306, -10031, -2131, -18459, -24657, -5924, 15278, 16924, 30783, 63356, 54156, 47722, 45386, 28543, -428, -20997, -8849, -9153, -29446, -15804, 35081, 45967, 36473, 36816, 25166, 23662, 24793, 37713, 53796, 55488, 29534, 22616, 26714, -2818, 528, -12124, -34488, -42236, -32384, -13603, 15646, 21086, 36394, 42021, 42667, 75323, 87949, 143090, 254463, 354292, 538523, 959870, 1599163, 1804339, 1487845, 916606, 513723]
14998E13723j83924j08591o7469l0748l2541r139J2186J6018R827l1226k4043
14987F4073j605P937R802l1696j5419j0039j75p230o945J1408k9005M608l757
14974h043j291K0504N216k3019j9728k352M524J0353L1247K340N356j7835R664
14961A6936Q904L581R958l538j1686M424j6355n1022l1114J6417N3806L4413J2293
14948D7017O557R436P74j0745j7377M27j1900J5815P731r311J3203m3615j2884
14935d872k4313j0156J0232L2549k3502k0852P081R310l3735k8330J7281M4502
14923b4805K8977m6N656N736j1473L607R942Q764m69J5098J8472L9552K3789m2507
14909H0293l5872p039l1038R706N784q193M244J9299J6744j2114k0881K2807M4762
$$ y = [513723, 329799, 221208, 153739, 122991, 90450, 81311, 93497, 109515, 119342, 88116, 64073, 62468, 70405, 80207, 48511, 33092, 23053, 22878, 15648, 8703, 20111, -8894, -4286, -8043, -9334, 11170, 16386, -6633, -26361, -28713, -24189, -13836, 17411, 19751, 25107, 7272, 16936, 25840, 29421, 39379, 35841, 24155, 28579, 12224, -38798, -69912, -53495, 311, 34724, 47017, 53574, 63010, 63784, 53039, 35662, 36089, 24189, 40004, 47735, 38424, 51627, 8012, -4872, -29185, -39341, -29109, 3440, -20062, -40914, -33833, -24523, -58258, -86588, -69307, -24805, 4172, 4126, 9782, 15518, 4045, 7652, 17594, 26358, 25889, 40987, 59459, 99011, 122800, 80293, 44421, 37382, 6344, 16050, 21834, 13641, 17885, 37184, 53928, 41814, 20933, 43740, 88502]
14896H8502R816n1832j6872L5835O15k7273O884n713L1391J6097j6508k0693p444
14883D2805j1688q776k3078J493k5184l803L597q753K84Q448K934N03j7547j8111
14869e6876J444M3232L4227J3694J9037l2400k2555k8796J8784K2759j7560M116
14857h94M5291M5886N95l0012l7662n2272j3515j4106K561M7195r645P2m881p949
14843b9336J7489J9880j796j1816j0981J0851R071K0122R732k1191m4851J0856
14831b1970K704J2884L8547L1246O38q306l3458j5398o92K9703J727R603j2569
14818C4659m6440l639K8607L8717p977r46j6712O766l6379M488K6917k275J6598
14805D2384J3369k0415k0201J0101J5069k4555l899K5917p77k2483J2645P272
$$ y = [88502, 98318, 46486, 29614, 65449, 66064, 38791, 45675, 39962, 71353, 87450, 70942, 50249, 42805, 31117, 22341, -737, 756, -24428, -28231, -24634, -33387, -33103, -24655, -21721, -21218, -38765, -56876, -55432, -12200, 22027, 35721, 54758, 22358, -197, -28993, -10209, 12550, -5010, -894, 44397, 90283, 90878, 60866, 23204, -29068, -42583, -56689, -54128, -6933, -16578, -16506, -21387, -29336, -11847, 8033, 6237, -5579, -16560, -5709, 3362, 23484, 33216, 12025, -32826, -21970, -19266, -6382, 32165, 63411, 64049, 55743, 22285, 6887, 6195, 35898, 37625, 47228, 34659, -11781, -15420, 13187, 51904, 43927, 42981, 26269, 33035, -3344, 1144, 28061, 25786, 42384, 55753, 35338, 15137, 25238, 40307, 15752, 11853, 37770, 36993, 14510, 27155, 34427]
14793C4427k9664j1798L084K3413J3279k5834n5803M590K3939J0049K7304q441
14781H545l5693J9778J3120j434Q007k305j9284n922j7434l395K2112K0122R867
14768A6084K4463L4954J0057n591l1875k9612k383J4030j3138L021p442Q171r837
14755A0902j4012o793M641M052J1585j4761j8299K6418P720m0166j6512L8427
14743f798M0287j9275J3018O801J740l936j8801P03j708M684J0263O020J6232
14730D9230N365j2341n146K2485L574L6162l463l731j5735J945J9560L1953O7478
14717A97336K6148N0949L7557M8401O5754J44945L01215L61893K20111p0235k94534
14706A089540l36953k39390j52512j04773p6019J1430j410k4632j3738k4j1585
$$ y = [34427, 4763, -7035, -3951, 19462, 32741, 6907, -48896, -44306, -20367, -10318, 16986, 8545, -27148, -7370, 5750, 4316, 12323, 10018, -9266, -15188, -32622, -36017, -13905, 6217, 16084, 40547, 75501, 85558, 79967, 48092, 18480, 16097, 30127, 16989, 20010, 12568, 20739, 10902, -3110, -9903, -5262, -1210, 10375, -4386, -22685, 3733, 11453, -28713, -45225, -6798, 33489, 14214, 27232, 34033, 35773, 31837, 13036, 13739, 12031, 16715, 26978, 32998, 49230, 54595, 42254, 37108, 59593, 63167, 99329, 95866, 92135, 76400, 78345, 97905, 129858, 197336, 223484, 274433, 311990, 360391, 426145, 571090, 872305, 1234198, 1454309, 1384074, 1089540, 752587, 513197, 360685, 255912, 179893, 191323, 189913, 165281, 151543, 151519, 139934]
14695A39934j1232J1168l0511j0601k6542K7405K5518l7550j8568n336j8861l2055
14683A2769j9369J6763K2584K0117j0438j5249j9280K6624J1397p763l9867k4912
14671b6624L4822n172r574J9588j0111j067J6001n055R059q82J2252m415m233
14658B4589M0532K5328o691j9459l7701o783K2003K8504j4267P66J7895N292N7727
14645A37735O958m5711l4064K8990Q218r590K4189L2503K2115L5818P1802O6689
14633C45652L4433K4197O313j8015l7805n9080o6019m2013j7606m545j5778l7384
14621A12350k4674P624m6927J1202o096k3740J457q213j5348p669J154Q974K0685
14608C0779j3413K121J9114L8373P661k7131K6394O315k1892m3006j7511K1652
$$ y = [139934, 128702, 139870, 109359, 98758, 72216, 99621, 125139, 87589, 69021, 63685, 44824, 12769, -6600, 10163, 32747, 52864, 42426, 27177, 7897, 34521, 45918, 38155, -1712, -26624, 8198, 3026, -6548, 13040, 2929, 1862, 17863, 12808, 21867, 20985, 33237, 28822, 24589, 65121, 90449, 83758, 64299, 26598, 19815, 41818, 70322, 56055, 56821, 74716, 80008, 137735, 144693, 98982, 64918, 93908, 102126, 92536, 116725, 149228, 171343, 207161, 278963, 345652, 380085, 404282, 410595, 392580, 354775, 295695, 229676, 187663, 170057, 165512, 149734, 112350, 87676, 95300, 48373, 59575, 53479, 29739, 31196, 22983, 7635, -34, 1120, 10094, 30779, 17366, 19487, 38601, 76974, 84635, 57504, 83898, 90213, 68321, 25315, 7804, 29456]
14596B9456l3934j0295p61J1820K7040K7596j2238j2962K430L6971k8248r467
14584B7408K2694k5353m1446j095q112J839J3688J4540K0350M827N066L536N923
14571D3865o93j6352j0834k432J1630K4473J7146O29L6282l699o919J142o694
14558H7544l0990k0976J6131Q088k879K1906m8103k8692j5954K2186R790k6696
14546h645K8593J6473j3950j3061K3346L304m570n821J0551M2844M4269L009n4085
14533G2257k0467j7581L163L1496j5962k8033l159M7305K1318K2396Q28j2076
14521A01485K5696K0960L324J1627j2407M0241J5524j7210k3102j5359k4517j8267
14509A07995o211l4056J4324K3831K5934p254j9667k4427k2798j3109R373J5149
$$ y = [29456, -4478, -14773, -15534, -3714, 23326, 50922, 38684, 25722, 28152, 65123, 36875, 27408, 50102, 24749, -16697, -17792, -25904, -24065, -10377, 4163, 24513, 29340, 34406, 37942, 43865, 43172, 26820, 15986, 13554, 25184, 49657, 66803, 67432, 103714, 100015, 93096, 94238, 87544, 56554, 35578, 51709, 59797, 56918, 78824, 30721, 2029, -13925, 8261, 18051, -8645, 19948, 36421, 22471, 9410, 32756, 36060, 31490, 25669, 36220, 79064, 123333, 126342, 72257, 51790, 34209, 37372, 68868, 52906, 24873, 21714, 69019, 90337, 112733, 113561, 101485, 127181, 148141, 151465, 163092, 150685, 190926, 206450, 189240, 166138, 150779, 126262, 107995, 101784, 67728, 82052, 105883, 131817, 124563, 104896, 80469, 57671, 44562, 53935, 69084]
14497F9084l3133m0509L023J9658j9096J1485K3260M1584L1139j4351k5479q782
14485E7883J1427j5748j1468j1975M029L3992L2207J2497J6311J9152p868L201
14473A43640k3695o390L0126l3861j1853K139L7465K1709J3529N9654J14357J13415
14461D60235K3266n3842r2201r1510o4520k3251R019J6539j602j453j6969m3458
14449A20253l2829j7129L0201k0552j6391m0060k793K4304P049P935M0743J4743
14437A15474k7634j4048k623j9220J0245j2729R649M825j0967J6949o471k3778
14425C9672L510K596P779J8290j8154o698K6096L674K5563n084n0261l3577r027
14412D379o991k463L479J4722M3922K5962Q764K0312J425k1783N757j5959J696
$$ y = [69084, 35951, -4558, -1535, 18123, -973, 10512, 33772, 75356, 106495, 92144, 66665, 57883, 69310, 53562, 42094, 30119, 34148, 68140, 100347, 112844, 129155, 148307, 140439, 143640, 119945, 113555, 143681, 109820, 97967, 100106, 137571, 159280, 172809, 232463, 346820, 460235, 483501, 429659, 337458, 245948, 181428, 158177, 167196, 183735, 182133, 180680, 163711, 120253, 87424, 70295, 100496, 79944, 63553, 23493, 20700, 45004, 52053, 59988, 100731, 115474, 87840, 73792, 71169, 51949, 62194, 49465, 59114, 63939, 52972, 69921, 63450, 39672, 43182, 45778, 53557, 71847, 53693, 46995, 73091, 76765, 102328, 97244, 46983, 13406, 4379, -2612, -5075, -1596, 13126, 57048, 83010, 91774, 112086, 113511, 91728, 97485, 81526, 83222]
14399H3222q477J2399L877l458O281Q35Q179K2064L0317o344k1780J7230L631
14386A47976J3497N6267P9450J04505R8975o383j03556j10343o4024j0842j3874
14375A91648r146j1010k0800J5288k2209j651M056J3549K4471J5158Q708N683
14363B13745K3417J8968K968N762k4046k4540j3020J1609J3593j4188k3067j3361
14351A77840K5179K4080L164J4246J9419J0705N470l506j1762p7538k5850J2955
14339A74402J8485l4847q108k2343N72J5960J9502L1238j762j4776j5280O8504
14327B31547O2111L2491O5444N6458J4128k1504K1868k9558l6261l2427j1688
14316C52609N7542J487k1370J6439L4703N269K6346O330L655K5678K757J5584
$$ y = [83222, 74745, 87144, 91021, 87563, 93844, 94679, 102858, 124922, 155239, 148895, 127115, 144345, 147976, 161473, 217740, 297190, 401695, 500670, 494287, 390731, 280388, 216364, 205522, 191648, 182502, 171492, 150692, 165980, 143771, 142120, 146176, 159725, 184196, 199354, 208062, 213745, 237162, 256130, 259098, 264860, 240814, 216274, 203254, 214863, 228456, 214268, 191201, 177840, 203019, 227099, 230263, 244509, 263928, 274633, 280103, 276597, 264835, 187297, 161447, 174402, 192887, 158040, 149932, 127589, 128161, 144121, 163623, 194861, 193099, 178323, 163043, 231547, 293658, 326149, 391593, 448051, 462179, 440675, 462543, 432985, 396724, 364297, 352609, 410151, 411638, 390268, 406707, 441410, 446679, 473025, 479355, 483010, 508688, 511445, 527029]
14304E27029Q321J4337L4039R1947R4752M5455J4515J121M604L8070O8670L7889
14292I80749K9887L4947N1393M7614J06920J63679J42272J61802K05884K50770
14282B175917L57653M70341O82070Q64353J016663J170978J113675O98544J70823
14273H721017q6349K58824Q93035J618143K491955L611716N412001Q660918J4917496
14264D6498756K7356294M8984358O6517216N7114198K3181432k3994623n7011966
14257A88645665o1856508m6258072k6784460j5175467r343719o166084m253401
14250A8807954k926458j964129j317889q45088n43852n21063o50941q68634j090078
14241H079822j160232j059899q41972o16561m40790l51494l15815k96083k71124
$$ y = [527029, 535350, 549687, 583726, 675673, 770425, 815880, 830395, 831516, 836120, 874190, 942860, 980749, 1010636, 1045583, 1096976, 1144590, 1251510, 1415189, 1557461, 1719263, 1925147, 2175917, 2533570, 3003911, 3685981, 4550334, 5566997, 6737975, 7851650, 8550194, 8721017, 8634668, 8893492, 9786527, 11404670, 13896625, 17508341, 22920342, 31581260, 46498756, 73855050, 122839408, 189356624, 246470822, 269652254, 245657631, 188645665, 126789157, 80531085, 53746625, 38571158, 29227439, 23061355, 18807954, 15881496, 13917367, 12599478, 11754390, 11210538, 10689475, 10038534, 9169900, 8079822, 6919590, 5859691, 5017719, 4401158, 3960368, 3608874, 3293059, 2996976, 2725852]
14232B725852k19903k09784k16178k01158k00144j70679j47636j45756j18678
14223A095936j34413r5429p0636p3823l2319j3348j8791j4815k9228n2251l3935
14212E26948j1381l8814l0741l1212j6722k7215j3444J5081K6629R540q13p722
14200D00134k8825o852m2909k3846k7402l2118K4338k0391k3420J0847M9518J9511
14188B98585q684m0895n630J3513l6032l7757J0818l229l8084k7790k3691l2251
14176F8873k4670J9795j9168R416K4919J3053m722k0572J3271M2913j2491m5811
14164F4806j6585q321j504J1425j7869j6343j8159k5232P406L4731K1758M9128
14152H5241K0849r620r653k0544k0258l622K2498K5700J1520j9769m2900k466
$$ y = [2725852, 2505949, 2296165, 2079987, 1878829, 1678685, 1508006, 1360370, 1214614, 1095936, 961523, 866094, 795458, 721635, 689316, 675968, 657177, 642362, 613134, 560883, 526948, 515567, 476753, 446012, 414800, 398078, 370863, 357419, 372500, 399129, 408669, 407856, 400134, 371309, 364457, 321548, 297702, 270300, 238182, 262520, 242129, 218709, 229556, 279074, 298585, 289901, 249006, 243376, 256889, 220857, 183100, 193918, 190689, 152605, 124815, 101124, 68873, 44203, 63998, 44830, 54246, 79165, 92218, 87496, 66924, 80195, 123108, 110617, 64806, 48221, 39900, 38396, 49821, 31952, 15609, -2550, -27782, -20376, 14355, 36113, 85241, 106090, 96470, 86817, 66273, 46015, 42393, 64891, 90591, 102111, 82342, 39442, 36976]
14140C6976m603R949K8169L0380L681M75L7118q320J8800K4456m9926l5215n316
14127H6624l3182n361L6080J9215k4316m1365j8685J2974l433L0564N407k9217
14115C5305Q93J6279J0041j400L7470M7271J1949p046o743l2591k2391j3377j6481
14102E9179k0866K7860N003n035J9860q173k8067m3881K7174J5760k20q346O569
14089D6817O094k5733k0012j6334J2658L1957J1453J4187k8969L49J3430j9976
14077B5921L985n242j3339n783k0247n573l284j3629j4481k8464j492K7029K8888
14064b5711L4885Q287q174n59J8418M0297L84j0295j2601k2001k1358k1955L3085
14051A2702j6033j0697J3356J9230J2084m567j2142l2217j3746J0351L7771L3931
$$ y = [36976, 32373, 42322, 70491, 100871, 104552, 105027, 142145, 133825, 152625, 177081, 127155, 91940, 86624, 53442, 48081, 84161, 103376, 79060, 37695, 19010, 31984, 28551, 59115, 64522, 35305, 36198, 52477, 62518, 61118, 98588, 145859, 157808, 150762, 144019, 111428, 89037, 75660, 59179, 38313, 66173, 71176, 66141, 86001, 77828, 49761, 5880, 33054, 48814, 48594, 40248, 46817, 52911, 27178, 7166, -9168, 3490, 35447, 46900, 61087, 32118, 32467, 45897, 25921, 29906, 24664, 11325, 5542, -14705, -20278, -23562, -37191, -51672, -80136, -81628, -54599, -25711, 9174, 17461, 9287, 8728, 27146, 67443, 67827, 57532, 44931, 22930, 1572, -20383, 12702, -3331, -14028, -672, 18558, 30642, 26075, 13933, -18284, -32030, -21679, 16092, 50023]
14039E0023K3551q37k5139j0226m529m521K3583K203j1825k923j3455k3336j1749
14026i180M953K4141K9268m1278K3164L8485J8943l801k5012n873k643m0043p668
14013C456N183j5523j485J4538L5435R735j0547o164j3865J1102J3927J251k2209
14000B4834k3562j3347Q278m654j8602K221k478N602J1535P49q464p34J5894K6636
13986B3908L0668Q252m3832k3803L0158Q328K542m364k111L1261J2230j8197L3169
13973H8209k3566j6391J7053l693j7103n2939p921K0132j3186m908L0671J851
13961A8209j8607m794l610k019P690J5740j1908K6126K4565J6676j9208J0107
13949E8967J0918j5696l4500k438j7858N095J1731k665j6048K3894J0468j8075
$$ y = [50023, 73574, 72737, 47598, 37372, 32843, 28322, 51905, 54108, 42283, 39360, 25905, 2569, -9180, -4227, 19914, 49182, 7904, 31068, 69553, 88496, 84695, 59683, 53810, 51167, 11124, 3456, 8639, -6884, -8369, 6169, 41604, 51339, 40792, 34628, 20763, 31865, 45792, 47043, 24834, 1272, -12075, -3797, -8451, -27053, -24832, -27310, -21708, -10173, -9424, -17888, -18622, -2728, 23908, 54576, 62828, 18996, -4807, 25351, 33679, 36221, 31857, 29746, 61007, 73237, 55040, 88209, 64643, 48252, 65305, 61612, 44509, -8430, -16351, 3781, -9405, -14313, 16358, 18209, -398, -5192, -8802, -10821, -3131, 12609, 701, 26827, 51392, 68068, 48860, 58967, 69885, 54189, 19689, 17251, -607, 4488, 16219, 13554, -2494, 21400, 31868, 13793]
13937A3793J4675L9858l52j2794n440j2975l8984m1343k3218m602L3350L5634
13925b398J0425n703j272k7283J7076J2663J9004K0594l7178j7194J0254j9777
13913b0789j4181K2236Q097K1683J9061k2192j1930M968K310J2311J0166J9435
13901E1175J0889j010k6414m1500o417J6245K5218M082m7503K3901K2508L710
13889C4884l6012j7172J64J1391R839K045p843M299l075j7642j5562J6164L2492
13876A3972J1148j199R553l5041q401k663j2983L1199J0544L258r791j2135j2251
13863a4790m749J5329K870q325P717j8876k6636K212L9758J1078N644N152N971
13850B2355K016j1748Q577K1301N5872M066o5774l8918l5971J193L2250j8944
$$ y = [13793, 28468, 68326, 67974, 55180, 49740, 36765, -2219, -43562, -66780, -71382, -38032, -2398, 8027, 2324, 1052, -26231, -9155, 3508, 22512, 43106, 5928, -11266, -1012, -20789, -34970, -12734, -4637, 17046, 36107, 13915, 1985, 6953, 9263, 21574, 31740, 51175, 62064, 61054, 34640, -6860, -13277, 2968, 28186, 32268, -15235, 8666, 31174, 34884, -1128, -18300, -18136, -6745, 3094, 5139, -2704, 1595, -1480, -19122, -34684, -18520, 13972, 25120, 23921, 33474, -1567, -9968, -12631, -25614, 5585, 16129, 19387, 9596, -2539, -14790, -19539, -4210, -1340, -9665, -1948, -20824, -47460, -45248, -5490, 5588, 11232, 16384, 22355, 24371, 12623, 21200, 42501, 98373, 102439, 36665, -2253, -38224, -37031, -4781, -23725]
13838b3725j491J2594K8903K6987L8268L7571K0968p979j528j3966K2224M585
13826A43411L3216O1386J54028K49043M60496O75561N51387M3484m91219o11850
13816A268943m47231k34353j33623j12452m6096M0546P0225J77811K38717K75710
13806A098197J98897P4281j04830k26806k67917k52219k01171q8003l4317l1638
13796A64474l5178k8570l2575L331o506J7407n35k0467l8750j5160M5032J4755
13784F7258O494j3589q610q402N756q907q000K1632m634j3814o444j1581K7328
13771D4487K8642k2823j5560L248m6639j1909M628P698r1j2650k5543j7392K2823
13758d1081J2849k4026p968Q177K5151M0204J0306j3351K5521m2926l0731L526
$$ y = [-23725, -25216, -12622, 16281, 43268, 81536, 119107, 140075, 132096, 130568, 116602, 138826, 143411, 176627, 238013, 392041, 641084, 1101580, 1777141, 2328528, 2372012, 1880793, 1268943, 821712, 587359, 453736, 341284, 295188, 335734, 405959, 583770, 822487, 1098197, 1297094, 1371375, 1266545, 1039739, 771822, 519603, 318432, 230429, 196112, 164474, 129296, 100726, 68151, 71482, 64976, 82383, 81848, 61381, 22631, 7471, 52503, 67258, 73752, 60163, 51553, 43151, 48907, 40000, 32000, 53632, 48998, 35184, 28740, 17159, 44487, 73129, 50306, 34746, 37994, -8645, -20554, -15926, -8228, -8319, -20969, -46512, -63904, -41081, -28232, -52258, -60226, -52049, -26898, 13306, 23612, 10261, 35782, -7144, -37875, -34349]
13746c4349M1601K7517J2581k0040j4937P069L9021j5034j9480l2560n456J2226
13734a841J439k0543J5263k729M414J6256o114J0612k0858l6186j028J2219J9715
13721i381O093p6615j3809L9990M3666O68j4342K6590K6154o403j635R748l905
13708B6819l905J815K3129j8170k6437p265M595k8713l789L6233R551n109k497
13695F257J263l674q626O221J0432J2670j6830l1063K2733K1807M84k6289j3278
13682a7893L321Q219J4078J988l2221K988J5152M8316j5421n058n008j0492j6029
13669h060n893p304J2543L1453P325p846j4697P723J3423K3120K981m7519l280
13656C969r969j1047P167J3070k6830j3003J5512N275j3170k439p866R190K5433
$$ y = [-34349, 7252, 34769, 47350, 27310, 12373, 19442, 58463, 43429, 23949, -8611, -14067, -1841, -402, -20945, -5682, -8411, -3997, 12259, 6145, 16757, -4101, -40287, -41315, -29096, -9381, -3288, -79903, -93712, -53722, -10056, -9388, -23730, 2860, 29014, 22611, 20976, 30724, 26819, 22914, 24729, 47858, 29688, 3251, -4014, 581, -28132, -31921, 4312, 13863, 8754, 6257, 7520, 3846, -4780, 1441, 11873, 24543, 7713, -23350, -617, 21190, 21674, -4615, -17893, -14572, -6353, 7725, 9713, -22508, -19520, -4368, 43948, 28527, 23469, 18461, 7969, -8060, -13953, -21257, -8714, 22739, 30064, 22218, 7521, 15244, 28667, 51787, 54768, 7249, 3969, -6000, -17047, -9880, 3190, -23640, -36643, -21131, -15856, -29026, -31465, -39331, -30141, -4708]
13643d708K2395q251l1k3261m465L1522K7481r558k6929J3413L0550J4401m3465
13630A9094l0847K9492j078J011L197Q287j3234m020R396M082K5520j0715n16
13617C9669Q643r731M3692O8788P808J021J5629J1426j879l6508j700n183m7771
13604I3904j2686m164k0933J5648K120j7573J0278r970j7313m632m6771j8332
13592c0424J8931k760j3299J5842q728J5856K3089J7557l2210l0473j795K2277
13580f137J7416J3385k8299q556L683K5018j1250J0665j3638r868M1959r153l0696
13567e471j4747L3280O652K154Q081j9975n207m97j1712K0565p745k7136K4700
13554B942n876j5680m638L9508K1586j9731k6873k5158M092l299j2861L61j1349
$$ y = [-4708, 17687, 9436, 9405, -13856, -18321, 13201, 40682, 31124, 4195, 17608, 48158, 62559, 19094, -11753, 17739, 16661, 17672, 20869, 29156, 15922, 11902, 21298, 25380, 50900, 40185, 39669, 48312, 38581, 82273, 151061, 158869, 159890, 175519, 186945, 185066, 148558, 146858, 141675, 93904, 81218, 77054, 56121, 71769, 73889, 56316, 66594, 56624, 39311, 34679, -12092, -30424, -11493, -14253, -27552, -11710, -20438, -4582, 18507, 36064, 3854, -26619, -28414, -6137, 11279, 24664, -3635, -12191, -8508, 16510, 5260, 15925, 2287, -7581, 34378, 25225, -5471, -20218, 13062, 19714, 21868, 29949, 9974, 4767, 4270, -7442, 13123, 5378, -21758, 2942, -2934, -18614, -23252, 16256, 37842, 18111, -8762, -33920, -29828, -33127, -45988, -45627, -56976]
13541e6976L6547K3324j4288J4255O770j3479L8056o088p829N24m2829P482K603
13528a1928K3351M5045j7432L409K8786p019m6868l3214M116J0047J9999p933
13516A0359J1964J0011j8398j1242k0577J3704M0273j5738O048J1790o7596j2727
13504d2129L0050L4584n038j5641M9590J1134j2780k5552k2051J4108J7530K8989
13492F2794k965J9210m0621m4223J2445K7450p308L994J5732j82j3465k2035k2157
13479a1331J8506L8439P128L1613p873K4661J8146o864Q131r040k0745J3050J5839
13466A19660P119N5680N6115Q6991J12696J77430L21325N11590O10055N05109
13456B563770L03363j9257l23722n45531n95504m57493k61837j74486j31482p0398
$$ y = [-56976, -20429, 2895, -11393, 2862, 9632, -3847, 34209, 28121, 20292, 20816, -22013, -14531, -11928, 11423, 56468, 39036, 42445, 71231, 64212, 17344, -15870, -11754, -1707, 18292, 10359, 22323, 32334, 13936, 2694, -17883, -4179, 36094, 20356, 26404, 38194, -29402, -42129, -12079, 22505, 17467, 1826, 51416, 62550, 49770, 24218, 2167, 16275, 33805, 62794, 59829, 79039, 38418, -5805, 6640, 34090, 26782, 30776, 46508, 46326, 32861, 10826, -11331, 7175, 45614, 52742, 84355, 76482, 101143, 119289, 112425, 120556, 111516, 90771, 103821, 119660, 126779, 182459, 238574, 325565, 438261, 615691, 937016, 1448606, 2058661, 2563770, 2867133, 2847876, 2524154, 1978623, 1383119, 925626, 663789, 489303, 357821, 287423]
13446B87423l4633l3796l0423j8776n3946m4639k6072M2762R875k2862l6426q562
13434B9925M935J2996j152l707j82q606K690k990j632j2893j8781l5609j0322
13421d5328K0271j0392N637J6888J2221j1279j4976R001O767J4356p13K7234j145
13408B8542j8608k7983o667J6671l465m0912j7396N3094J1575l682k4257k2639
13396e5727P039L1063k2196j3883j3403P026J6049L2224r023q120K5212L9275
13384C5536J510l7205m136k0440M374R533k61k211K7468J9876m31l1872n893K801
13370a351J1930P537J6446r316j1648r131k545N401k8120j5390P009K511J0452
13357a6215l443L702K7626k3058l288n494J3702M233K5488k5943k5728k4517l187
$$ y = [287423, 252790, 218994, 188571, 169795, 115849, 71210, 45138, 87900, 97775, 74913, 38487, 29925, 34860, 47856, 46704, 42997, 42815, 34209, 36899, 33909, 32277, 19384, 603, -35006, -45328, -25057, -35449, -29812, -12924, -703, -11982, -26958, -17957, -11190, 3166, 2453, 29687, 28542, 9934, -18049, -24716, -8045, -11510, -52422, -69818, -16724, -5149, -8831, -33088, -55727, -48688, -17625, -39821, -53704, -67107, -60081, -44032, -11808, -20831, -28951, -3739, 35536, 37046, -159, -4295, -24735, -20361, -10828, -11089, -13300, 14168, 34044, 33613, 1741, -4152, -1351, 10579, 18116, 34562, 25246, 13598, 4467, 1922, 7323, -20797, -36187, -29178, -26667, -16215, -19658, -15956, 11670, -11388, -14676, -20170, -6468, -2235, 23253, -2690, -28418, -52935, -56122]
13344e6122j7258k5693q64K6436N2943N4581l396o654K6546j784j5720l2688j3643
13331a3316M84j6801l653J1146j3454J3058N0082j3890l1005l0921j5264K6077
13319c7457L9050q991L761j820j1898j0719K6008J6037J3236N764J5836m95k7232
13306B1080k5925M674K88m303n640J834J8389r010j4231j1113j4809p195j1200
13293e7161N886K5969m014j1787r745P496K5888L3648k28J6518j964M416J8913
13280E3835O214l8832k163J3163p4J4805k534l3345j1442n94k1253J5499N2405
13267D5684M7126j7873k8113p6R863j0839j3365l7393O165j1210O417J5076n17
13254A0945J1121J3903L1034N9796M7090L0298O388m0541k7687k3579j2440j9807
$$ y = [-56122, -73380, -99073, -99937, -73501, -20558, 34023, 30627, 23973, 50519, 48735, 33015, 327, -13316, -12832, -29633, -33286, -22140, -35594, -22536, 27546, 13656, -17349, -48270, -63534, -37457, 1593, -7398, -3637, -5457, -17355, -28074, -2066, 13971, 27207, 32971, 48807, 48312, 21080, -4845, -171, 117, -4186, -9826, -7992, 10397, 1387, -12844, -23957, -38766, -45961, -57161, -51275, -25306, -29320, -41107, -50852, -43356, -17468, 16180, 15952, 32470, 30506, 34922, 53835, 60049, 21217, 19054, 32217, 32143, 46948, 44414, 11069, -373, -967, -22220, -6721, 45684, 92810, 74937, 46824, 46748, 56611, 45772, 32407, -4986, 1179, -10031, -3614, 11462, 10945, 22066, 35969, 67003, 126799, 173889, 204187, 210575, 170034, 142347, 118768, 106328, 86521]
13242H6521k3974m0265k2424J7727J1534r860j7365M384l14j4428j5790J3650
13230a0604M2170L426j2837q136k0882j2471Q710K9067j8201L772O776j9439O669
13217a980K0408j3809N870K077j9799j088O915l2104k5545K6802O7981J4854j8640
13204C1942l7009k0153o801R835n008K0911L6406J3154R332p102P400n327l6209
13191A1371l8085j1134j4897L3529K3389l1760J6822J5090p727k5587r868O345
13179c2512K6454J5692L1614J2576m5897k8751J8439J0451j4308j015j8437N796
13167a9898J767L322M8654L4442k7621j2979k2753j3611J4824k126j347J2093
13155A4767L1195N672r223L3834k3923l4579J3431L274k7580m1519J4863K083
$$ y = [86521, 62547, 22282, -142, 17585, 29119, 19259, 1894, 6278, 5964, -8464, -24254, -10604, 31566, 34992, 22155, 14019, -6863, -19334, -10624, 18443, 242, 4014, 10790, -8649, -1980, 18428, 4619, 10489, 12566, -7233, -8321, -1406, -33510, -59055, -32253, 35728, 50582, 31942, -5067, -25220, -32021, -22186, -27194, -6283, 30123, 43277, 52609, 45507, 52907, 47580, 11371, -26714, -37848, -52745, -19216, 4173, -27587, -10765, 4325, -3402, -28989, -38857, -32512, -6058, 9634, 41248, 53824, 7927, -20824, -2385, 8066, -6242, -7257, -25694, -19898, -18131, -14809, 33845, 68287, 40666, 27687, 4934, -8677, 6147, 4021, 2674, 14767, 45962, 51634, 42411, 76245, 52322, 17743, 31174, 34448, 6868, -34651, -19788, -17705]
13143a7705o365K5198K1415N208Q793j2947k2677K106M21J1801J818J2242M615
13130C3923M001k0272l4994p002K7658J4102k5437n144M725p802J1949R511j3582
13117h364j7991K2614o727k2331M241k0808J0414k738p351j0427k266O317J1254
13104d4163j1324K287J3856J9129Q02M303k242l493J6401r445K7338M115k4400
13091f836N241Q125L9099L3280j7162k0718L9673j9372k5449j5160j1926j3755
13079d960L750k3822j9291l9509o864N5848N4152K263j8521j455l90r597j4806
13066b3202J6221k44J1653J3685l581k2540j5807M488N0729O386K613Q673K0720
13053F9794k819K4706K5201K7040L6196L15j9735k3299k5538l4681j0650p173
$$ y = [-17705, -24070, 1128, 22543, 27751, 36544, 23597, 920, 3026, 3447, 15248, 17066, 29308, 33923, 37924, 17652, -17342, -24344, 3314, 17416, -8021, -13165, -8440, -16242, -4293, 5218, -8364, -26355, -3741, -10468, -32799, -28558, -49366, -38952, -41690, -49041, -59468, -61734, -55417, -44163, -55487, -53200, -39344, -20215, -19413, -15110, -17352, -20845, -4444, -13889, 13449, 17564, -6836, -1595, 6530, 45629, 78909, 61747, 41029, 80702, 61330, 35881, 20721, 8795, -4960, -1210, -25032, -44323, -83832, -90696, -34848, 19304, 21567, 3046, 1591, 1201, -8396, -23202, -6981, -7225, 4428, 18113, 14532, -8008, -23815, -19327, 31402, 37788, 40401, 49074, 69794, 66975, 91681, 116882, 143922, 180118, 180433, 160698, 137399, 111861, 77180, 66530, 59357]
13041E9357p473k0731j9277j0120J0965m99j4314R580L636K589j474J937r625
13028D551k2815R238r248L1417L4473K4235j1371j1826k5747P801N863R350m1024
13015D897l5737k103J7547Q065k4439M276J875J8735N1653J9437j4789q577K4889
13002F5729o633k3225J5921n273o308l1245k6228M427J1348K9059l1496m4205
12990d8129R974m786J5883R757O609m414r858J1669J6127J2252j2691k493J8405
12977A8305k177m058J5057N971N887j0014l598J859k1700l601Q413l475j7229
12964a0360l2640K0500k365M453J9103j7911L37K4352j304j3691j1416q50l117
12951b4909O09K8360J5641O088o317l0267j8832r032j1269M312M4914J7270J7848
$$ y = [59357, 51884, 31153, 11876, 1756, 12721, 12222, -2092, 7488, 11124, 13713, 12239, 14176, 4551, -18264, -9026, -18274, 13143, 47616, 71851, 60480, 48654, 22907, 30708, 36571, 45921, 4897, -30840, -32943, -15396, -7331, -31770, -27494, -25619, -6884, 44769, 64206, 49417, 40840, 65729, 59096, 35871, 51792, 46519, 40211, 8966, -17262, -12835, -1487, 27572, -3924, -48129, -38155, -42941, -27058, -17301, -10692, -15106, -24964, -13295, 2832, 15084, 2393, -100, 18305, 16128, 12070, 27127, 33098, 38985, 28971, 25373, 27232, 5532, 1931, 10344, 6869, -10360, -43000, -22500, -24865, -20412, -1309, -19220, -18883, 5469, 4165, -9526, -20942, -21792, -24909, -24300, 4060, 19701, 25789, 19472, -10795, -29627, -38659, -49928, -45616, -702, 16568, 34416]
12938C4416J0902L1168K0897k7212n5742j7565K3766K299m585l3266k3000j7551
12926e5473K6196M2271j0068K0103n606O124q021j1303K953L799P786n716J358
12913A4403k0078j7763K705J8732O665K250N513k6K6281k740j3622O538j1358
12900A7500k1482j6297L4022Q209J2729p898j4444J9158l3841J0906J8456m110
12888B2908j3952l802j9658J9468J6929l81j0143L1513p517k1621P544N853k3265
12875C876j8922o13J3297K1946k7226j4002K8650K2700j224j7049j4168j1066
12863a3801k7294k435j2761L034k1609K3512K6898J3842j4188O176J374l572j2377
12850c3201J4236L23j9739R183J0937m817p522m119L9911K5287L77J1274k1833
$$ y = [34416, 45318, 76486, 97383, 70171, 14429, -3136, 20630, 22929, 18344, -14922, -37922, -55473, -29277, 12994, 2926, 23029, 17423, 23547, 15526, 4223, 7176, 10975, 18761, 13045, 14403, -5675, -23438, -20733, -2001, 4664, 6914, 12427, 12401, 38682, 35942, 22320, 28858, 17500, -3982, -20279, 13743, 21952, 34681, 26783, 12339, 31497, -2344, 8562, 27018, 22908, 8956, 5154, -14504, 4964, 21893, 21512, 11369, 42882, 35365, 13744, 21288, 27141, 3876, -15046, -15659, -2362, 19584, -7642, -21644, 7006, 29706, 28482, 11433, -2735, -13801, -41095, -43530, -56291, -53257, -74866, -51354, -24456, -10614, -24802, -18626, -17252, -20824, -33201, -18965, -18642, -38381, -29198, -18261, -23078, -30600, -34719, 5192, 30479, 30856, 42130, 20297]
12837B0297j7892J2811M2658k4183l7716l5474J2883K1230L497k1127J6310Q160
12825A454k82K0778K1327K2218m009j2901k6285j7373j7420l3351j6K3690K3987
12812A817P350L546r573j4468L948K4637N604n430J1883O741k6080l0138l5157
12799e5320m395M6084L4038m080Q808K0754J5540j7774k0355j3142j8367P525
12787f84J0843J2426J2731l9962l6480j0213q726N5910L6266k4221k329k0626
12775a5065J7253k37M035j5573o859K1032J7887K9021k4903l3709N936K5614j4541
12762I891j8089O485r366L1585J2590r587j3162l0476j4190L0288N0868K7135
12750G3972n3494l5356K40P671k4081K4868k638K1587J1481k1461j2591p448J6873
$$ y = [20297, 2405, 15216, 57874, 33691, -4025, -39499, -26616, -5386, -1889, -23016, -6706, 1454, 1172, 21950, 43277, 65495, 61486, 48585, 22300, 4927, -12493, -45844, -45860, -22170, 1817, 9167, 12713, 3140, -11328, -7380, 17257, 22861, 17431, 29314, 36055, 9975, -20163, -55320, -59715, -13631, 20407, 16327, 25135, 45889, 61429, 43655, 23300, 10158, -8209, -684, 10159, 22585, 35316, -4646, -41126, -51339, -60065, -4155, 32111, 7890, 5561, -15065, 2188, 1951, 5986, -9587, -16446, 4586, 22473, 51494, 26591, -7118, -1182, 24432, 9891, -8198, -1713, -11079, 20506, 33096, 23509, 10347, -20129, -34319, -4031, 46837, 73972, 20478, -14878, -14638, -6967, -31048, -6180, -8818, 12769, 24250, 2789, -9802, -17250, -377]
12737c77K779j4448l432K5859J7193M914j8891K689k446K866R417J1213j6750
12724B0586j2579p811k887j9208K3280r767k4379J8191O093J9580K7743K2437
12712F1279N205j1784o127r271o989k8296J573l3409k9349k2611K3380N3074K4966
12699B1641J8402J5839j8231j6619o010N143J800m4125k3283K9559L3582k2023
12687d325k6944L372L8446K3868m2113j6428J5741M2309J3145k6469k0421L793
12675C974K1178l7229k7705j2869K5213M803J3462j2041L1683K4622r881k9227
12663d017K3245J3648j6391o300K3704j7542J140J1126l526k3425l8157L09J6986
12650a9200p090m239p308Q021L1692L3820J1888k1208r064n18l6957L2649P269
$$ y = [-377, 2402, -12046, -15478, 10381, 27574, 32488, 13597, 16286, 13840, 16706, 26123, 37336, 20586, 8007, 196, -2691, -21899, 1381, -8386, -32765, -14574, -8481, 11099, 38842, 61279, 66484, 54700, 48573, 39302, 32313, 4017, 5590, -27819, -57168, -79779, -56399, -3325, 21641, 40043, 55882, 37651, 21032, 15022, 20165, 21965, -22160, -45443, -15884, 17698, -4325, -31269, -27897, 10549, 34417, -7696, -24124, -8383, 33926, 47071, 20602, 181, 3974, 25152, -12077, -39782, -52651, -27438, -22635, -9173, -21214, 10469, 35091, 25210, -4017, 19228, 32876, 16485, 10185, 33889, 16347, 17487, 28613, 25087, 1662, -36495, -36186, -19200, -26290, -30529, -37837, -29816, 1876, 35696, 47584, 26376, 17312, 16794, -20163, 12486, 19755]
12637A9755l0736p510p140K5042N3825K8497l113o290r315L1866O4446N6527N7288
12624B73142O2408P4908J03740K02831L60584P01081J563163K486407Q95247j105307
12614E618204k231552j506511o94880l61745k26124j00269q2193q5992o7124j6410
12604B45404k9433j1584k4925l5417l7790m0672k9012j3617j2766j4325k4186
12593b8323j6342K4690K3806J2763L825J8773L597Q658K1843o931l1062O563j5118
12580B6742j4946o68J639j8422N047q929j5181J871l9057k1825L7789N1919K4363
12567C0342J3189P972l2179k8668p711K8239J2529K6184P522j8361j8308j434
12555A9316l4307j2660K1565K0371j0000j4219O387o887J3275J702j7770N910
$$ y = [19755, -10981, -18491, -25631, -589, 53236, 81733, 78620, 72330, 63015, 94881, 159327, 215854, 273142, 335550, 410458, 514198, 717029, 1077613, 1778694, 3341857, 5828264, 6723511, 5618204, 3386652, 1880141, 1185261, 823516, 597392, 497123, 414930, 328938, 261814, 245404, 215971, 204387, 179462, 144045, 106255, 65583, 36571, 22954, 10188, -4137, -28323, -44665, -19975, 3831, 16594, 20419, 39192, 42789, 51447, 73290, 66359, 35297, 41860, 26742, 11796, 11128, 12767, -5655, -608, -9537, -24718, -22847, -61904, -83729, -45940, 5979, 30342, 43531, 51503, 19324, -9344, -17055, 11184, 23713, 49897, 57419, 39058, 20750, 19316, -14991, -27651, -6086, 14285, 4285, -9934, -3547, -10434, 2841, 4543, -13227, -7317]
12543g317J2885K827j1182J435J6477k4371q084R081J0592m287j6494N134L868
12530i436M3222n935l248l34p594p563k1435j3022J4567K235K3938N7729j648
12517G1476k4494m994k3611j8294J5975J4591Q633K0486j8900j6237j8890j1040
12505e299j3676J8439L333l8202K623J6669M7796N869n5240j6383O183K2860Q134
12492C106o225l1596j1992q269K4179L4142o440o454r365Q997R992K9240P584
12479C6899k318k363j2265J8541J5959q500o107M975r293O311O634l3579l1736
12466a6842l9272L5518j259p87Q010L1609K1315K3088j0702k5043k686o22j6919
12453E408j1678J5554L112m278J1883r410j9843M85Q331P569j3642K919j2085
$$ y = [-7317, 5568, 8395, -2787, -1352, 15125, -9246, -17330, -8249, 2343, -1944, -18438, -13304, -9436, 33786, 27851, 24603, 24269, 16675, 9112, -12323, -25345, -10778, -8543, 15395, 73124, 71476, 46982, 41988, 18377, 83, 16058, 30649, 39282, 59768, 40868, 24631, 5741, -5299, -18975, -536, 2797, -35405, -32782, -16113, 31683, 37552, -17688, -34071, -27888, -5028, 3106, -3119, -34715, -46707, -54976, -30797, 3345, -3095, -9549, -18914, -9917, 75, 29315, 36899, 34581, 32218, 19953, 38494, 54453, 45953, 39846, 44821, 35528, 41839, 48473, 14894, -16842, -56114, -20596, -21855, -22642, -14632, 16977, 38292, 61380, 50678, 25635, 22949, 22327, 5408, -6270, 9284, 12396, 8118, 20001, 10591, -9252, -8767, -436, 7133, -6509, -3590, -15675]
12440a5675P70j7589K2563J5353Q361L641M955J5927j8912m208j5186O152O747
12427A2899N024q039N468P793k7234j1961K0612M3813L2070N3119O529k0016l700
$$ y = [-15675, -14905, -32494, -9931, 5422, 13783, 17424, 22379, 38306, 19394, 15186, 0, 6152, 12899, 17923, 9884, 15352, 23145, -4089, -16050, 4562, 48375, 80445, 133564, 140093, 120077, 116377]
$$ [...]
##END NTUPLES=NMR SPECTRUM
##END=
