##TITLE=Analysis number 314041
Compound Code mo 00937
Book Reference 444/16
Project Code adrs
Chemist Name howarde
##JCAMPDX= 6.0         $$ Bruker NMR JCAMP-DX V2.0
##DATA TYPE= NMR SPECTRUM
##DATA CLASS= NTUPLES
##ORIGIN= Bruker BioSpin GmbH
##OWNER= NMR
$$ XWIN-NMR		Version 3.5
$$ Tue Oct  4 09:09:00 2005 GMT Daylight Time (UT+1h)  MAYBRIDGE\NMR@NMR_250MHZ
##.OBSERVE FREQUENCY= 250.131544655141
##.OBSERVE NUCLEUS= ^1H
##.ACQUISITION MODE= SIMULTANEOUS (DQD)
##.ACQUISITION SCHEME= undefined
##.AVERAGES= 16
##.DIGITISER RES= 18
##SPECTROMETER/DATA SYSTEM= dpx250
##.PULSE SEQUENCE= zg30
##.SOLVENT NAME= CDCl3
##.SHIFT REFERENCE= (INTERNAL, CDCl3, 0, 16.522)
##AUDIT TRAIL= $$ (NUMBER, WHEN, WHO, WHERE, WHAT)
$$ ##TITLE= Audit trail, XWIN-NMR		Version 3.5
$$ ##JCAMPDX= 5.01
$$ ##ORIGIN= Bruker BioSpin GmbH
$$ ##OWNER= NMR
$$ C:\u/data/dgb/nmr/ADRS/10280/pdata/1/auditp.txt
$$ ##AUDIT TRAIL=  $$ (NUMBER, WHEN, WHO, WHERE, WHAT)
(   1,<2005-10-04 09:08:41.12 +100>,<MAYBRIDGE\NMR>,<NMR_250MHZ>,
      <created by zg, POWCHK disabled, PULCHK disabled
       configuration hash MD5:
       62 19 C7 07 E1 42 D1 B7 37 6C 3D D0 77 39 F9 E6
       data hash MD5: 64K
       C1 4E A7 99 85 2D 6F 04 3B 69 77 BF 9F 54 07 6E>)
(   2,<2005-10-04 09:08:53.71 +100>,<MAYBRIDGE\NMR>,<NMR_250MHZ>,
      <Start of raw data processing
       ef LB = 0.3 FT_mod = 6 PKNL = 1 SI = 32K 
       data hash MD5: 32K
       AA 79 15 79 1F 55 57 D5 20 9F EF 98 E4 53 D9 5A>)
(   3,<2005-10-04 09:08:55.45 +100>,<MAYBRIDGE\NMR>,<NMR_250MHZ>,
      <apk 
       data hash MD5: 32K
       C4 68 CC 2B 54 6A BD 0B 7F 30 70 6F 30 33 77 1F>)
(   4,<2005-10-04 09:08:56.18 +100>,<MAYBRIDGE\NMR>,<NMR_250MHZ>,
      <abs ABSG = 5 
       data hash MD5: 32K
       34 F6 F5 74 F4 B2 8F ED 00 64 1F EB 07 8D FD B0>)
$$ ##END=
$$ 
$$ hash MD5
$$ 81 3B E1 AC 8C 02 C6 DC 02 E7 29 E6 3A FF F4 60
##$RELAX= 
##$RELAX= 
##$RELAX= 
##$RELAX= 
##$RELAX= 
##$RELAX= 
##$RELAX= 
$$ Bruker specific parameters
$$ --------------------------
##$DU= <C:\u>
##$EXPNO= 10280
##$NAME= <ADRS>
##$PROCNO= 1
##$TYPE= <nmr>
##$USER= <dgb>
##$AMP= (0..31)
100 100 100 100 100 100 100 100 100 100 100 100 100 100 100 100 100 100 
100 100 100 100 100 100 100 100 100 100 100 100 100 100 
##$AQSEQ= 0
##$AQ_mod= 3
##$AUNM= <au_zg>
##$AUTOPOS= <4 >
##$BF1= 250.13
##$BF2= 250.13
##$BF3= 250.13
##$BF4= 250.13
##$BF5= 500.13
##$BF6= 500.13
##$BF7= 500.13
##$BF8= 500.13
##$BYTORDA= 1
##$CFDGTYP= 0
##$CFRGTYP= 5
##$CHEMSTR= <none>
##$CNST= (0..31)
1 1 145 1 1 1 1 1 1 1 1 1 1 1 1 1 1 1 1 1 1 1 1 1 1 1 1 1 1 1 1 1 
##$CPDPRG= <>
##$CPDPRG1= <>
##$CPDPRG2= <>
##$CPDPRG3= <>
##$CPDPRG4= <mlev>
##$CPDPRG5= <mlev>
##$CPDPRG6= <mlev>
##$CPDPRG7= <mlev>
##$CPDPRG8= <mlev>
##$CPDPRGB= <>
##$CPDPRGT= <>
##$D= (0..31)
0 1 0 0 0 0 0 0 0 0.06 0 0 0 0 0 0 0.0002 0 0 0 0 0 0 0 0 0 0 0 0 0 0 
0 
##$DATE= 1128413320
##$DBL= (0..7)
120 120 120 120 120 120 120 120 
##$DBP= (0..7)
150 150 150 150 150 150 150 150 
##$DBP07= 0
##$DBPNAM0= <>
##$DBPNAM1= <>
$$ [...]
##$SUBNAM7= <"">
##$SUBNAM8= <"">
##$SUBNAM9= <"">
##$SW= 20.6930455092707
##$SWIBOX= (0..15)
0 0 3 0 0 0 0 0 0 0 0 0 0 0 0 0 
##$SW_h= 5175.983436853
##$TD= 65536
##$TD0= 1
##$TE= 296.16
##$TE2= 300
##$TE3= 300
##$TEG= 300
##$TL= (0..7)
0 120 120 120 120 120 120 120 
##$TP= (0..7)
150 150 150 150 150 150 150 150 
##$TP07= 0
##$TPNAME0= <>
##$TPNAME1= <>
##$TPNAME2= <>
##$TPNAME3= <>
##$TPNAME4= <>
##$TPNAME5= <>
##$TPNAME6= <>
##$TPNAME7= <>
##$TPOAL= (0..7)
0.5 0.5 0.5 0.5 0.5 0.5 0.5 0.5 
##$TPOFFS= (0..7)
0 0 0 0 0 0 0 0 
##$TUNHIN= 0
##$TUNHOUT= 0
##$TUNXOUT= 0
##$USERA1= <user>
##$USERA2= <user>
##$USERA3= <user>
##$USERA4= <user>
##$USERA5= <user>
##$V9= 5
##$VALIST= <valist>
##$VCLIST= <CCCCCCCCCCCCCCC>
##$VD= 0
##$VDLIST= <DDDDDDDDDDDDDDD>
##$VPLIST= <PPPPPPPPPPPPPPP>
##$VTLIST= <TTTTTTTTTTTTTTT>
##$WBST= 1024
##$WBSW= 4
##$XGAIN= (0..3)
0 0 0 0 
##$XL= 0
##$YL= 0
##$YMAX_a= 326625
##$YMIN_a= -330512
##$ZGOPTNS= <>
##$ZL1= 120
##$ZL2= 120
##$ZL3= 120
##$ZL4= 120
##$ABSF1= 16.522
##$ABSF2= -4.171173
##$ABSG= 5
##$ABSL= 3
##$ALPHA= 0
##$AQORDER= 0
##$ASSFAC= 0
##$ASSFACI= 0
##$ASSFACX= 0
##$ASSWID= 0
##$AUNMP= <proc_1d>
##$AZFE= 0.1
##$AZFW= 0.1
##$BCFW= 0
##$BC_mod= 0
##$BYTORDP= 0
##$COROFFS= 0
##$CY= 12.5
##$DATMOD= 1
##$DC= 0
##$DFILT= <>
##$DTYPP= 0
##$F1P= 14.0000005364418
##$F2P= -0.99999901652339
##$FCOR= 0.5
##$FTSIZE= 32768
##$FT_mod= 6
##$GAMMA= 0
##$GB= 0
##$INTBC= 1
##$INTSCL= 1
##$ISEN= 128
##$LB= 0.3
##$LEV0= 0
##$LPBIN= 0
##$MAXI= 10000
##$MC2= 0
##$MEAN= 0
##$ME_mod= 0
##$MI= 0
##$NCOEF= 0
##$NC_proc= -4
##$NLEV= 6
##$NOISF1= 0
##$NOISF2= 0
##$NSP= 0
##$NTH_PI= 0
##$NZP= 0
##$OFFSET= 16.522
##$PC= 1
##$PHC0= -56.74388
##$PHC1= 6.798038
##$PH_mod= 1
##$PKNL= yes
##$PPARMOD= 0
##$PSCAL= 4
##$PSIGN= 0
##$REVERSE= no
##$SF= 250.13
##$SI= 32768
##$SIGF1= 0
##$SIGF2= 0
##$SINO= 400
##$SIOLD= 32768
##$SREGLST= <1H.CDCl3>
##$SSB= 0
##$STSI= 32768
##$STSR= 0
##$SW_p= 5175.98343685301
##$SYMM= 0
##$S_DEV= 0
##$TDeff= 65536
##$TDoff= 0
##$TI= <Analysis number 999999
Compound Code 99
Book Reference 9
Project Code 9>
##$TILT= no
##$TM1= 0
##$TM2= 0
##$TOPLEV= 0
##$USERP1= <user>
##$USERP2= <user>
##$USERP3= <user>
##$USERP4= <user>
##$USERP5= <user>
##$WDW= 1
##$XDIM= 32768
##$YMAX_p= 491362780
##$YMIN_p= -339886
$$ End of Bruker specific parameters
$$ ---------------------------------
##NTUPLES= NMR SPECTRUM
##VAR_NAME=  FREQUENCY,     SPECTRUM/REAL,   SPECTRUM/IMAG
##SYMBOL=    X,             R,               I
##VAR_TYPE=  INDEPENDENT,   DEPENDENT,       DEPENDENT
##VAR_FORM=  AFFN,          ASDF,            ASDF
##VAR_DIM=   32768,         32768,           32768
##UNITS=     HZ,            ARBITRARY UNITS, ARBITRARY UNITS
##FACTOR=    0.157963299565203, 1,           1
##FIRST=     4132.6476996994, 0,             0
##LAST=      -1043.33573715361, 0,           0
##MIN=       -1043.33573715361, -339886,     0
##MAX=       4132.6476996994, 491362780,     0
$$ Real data points
##PAGE= N=1
##DATA TABLE= (X++(R..R)), XYDATA
$$ [...]
$$ plain form
15990 -93867 -49016 -2444 61589 32529 33023 48145 119384 124560 96627 57959 42207 59879
15978 59879 97554 36934 27111 68405 44948 29783 22063 72520 61619 17667 48902 54764
15966 54764 31051 -43694 -93520 -47631 31594 103565 142577 83291 64659 88600 113511 100873
15954 100873 9446 63692 50332 8116 51822 55512 104252 28455 -31307 -68627 13054 145771
15942 145771 182627 130430 46277 38157 -15586 12680 115762 112259 20206 -63054 3264 29956
15930 29956 -16367 -52842 -39685 -32575 10549 30978 4956 -23447 -81295 -78016 -75598 11178
15918 11178 42399 66463 65988 36472 5255 15651 -98002 -207552 -176073 -87656 -46681 84966
15906 84966 72233 90966 110705 84747 61000 78355 13840 -73800 -109092 -117551 -51194 27400
$$ packed form
15990i3867M4851M6572O4033k9060M94J5122P1239N176k7933l8668j5752J7672
15978E9879L7675o0620r823M1294k3457j5165p720N0457j0901m3952L1235N862
15966E4764k3713p4745m9826M5889P9225P1971L9012n9286j8632K3941K4911j2638
15954A00873r1427N4246j3360m2216M3706L690M8740p5797n9762l7320Q1681J32717
15942A45771L6856n2197q4153q120n3743K8266J03082l503r2053q3260O6318K6692
15930B9956m6323l6475J3157P110M3124K0429k6022k8403n7848L279K418Q6776
15918A1178L1221K4064m75k9516l1217J0396j13653j09550L1479Q8417M0975J31647
15906H4966j2733J8733J9739k5958k3747J7355o4515q7640l5292q459O6357P8594
$$ plain form
15894 27400 -49692 -95990 -106016 -36119 -41462 -104176 -68857 -67105 -25236 -67939 -127309 -103990
15882 -103990 -13217 11250 -19626 11181 128206 171349 97239 -35888 -70686 -85014 -61521
15871 -61521 -34785 123445 172092 132002 71980 -1030 73911 144320 128569 34717 8333
15860 8333 21736 -59880 -86506 -7480 -36475 -8656 -28649 -57481 -43036 3815 -45034 -143787
15848 -143787 -161279 -133782 -129424 -136499 -158781 -16421 63467 55429 99443 118384 72209 2090
15836 2090 46119 94069 148876 101661 -11029 49953 139126 101261 84349 -9114 -18275 23026
15824 23026 40520 37397 107626 114280 108459 116081 130061 82069 67855 150804 165436 204834
15812 204834 159362 31920 5392 -37554 -12933 -11444 -40352 -18210 73800 79384 39431 26356
$$ packed form
15894B7400p7092m6298j0026O9897n343o2714L5319J752M1869m2703n9370K3319
15882a03990R0773K4467l0876L0807J17025M3143p4110j33127l4798j4328K3493
15871f1521K6736J58230M8647m0090o0022p3010P4941P0409j5751r3852k6384
15860H333J3403q1616k6626P9026k8995K7819j9993k8832J4445M6851m8849r8753
15848a43787j7492K7497M358p075k2282J42360P9888q038M4014J8941m6175p0119
15836B090M4029M7950N4807m7215j12690O0982Q9173l7865j6912r3463r161M1301
15824B3026J7494l123P0229O654n821P622J3980m7992j4214Q2949J4632L9398
15812B04834m5472j27442k6528m2946K4621J489k8908K2142R2010N584l9953j3075
$$ plain form
15800 26356 58311 -7198 -74940 -72535 -83402 -45749 -1293 -43227 -43000 -36893 5657 108024
15788 108024 162322 65978 -399 41127 37623 15962 85387 108142 114071 104162 84416 17977
15776 17977 -15578 13342 -24435 -13260 53071 50148 1220 -64185 -133291 -52393 28664 55489
15764 55489 -18966 -54873 35923 48345 92415 75695 108002 74735 89493 99128 76981 47466
15752 47466 135225 100951 -44914 12261 75118 35254 -41270 -100441 -84638 -6599 31965
15741 31965 34068 50689 -27825 -125314 -57321 59423 82293 60132 73322 85314 48484 -30724
15729 -30724 -68866 -26530 -13718 -103609 -62261 -69469 -89587 6586 27062 -25928 -72120 -65479
15717 -65479 -28540 -7804 74587 44383 -12262 -12651 -26914 15898 -71942 -34315 6499 -7185
$$ packed form
15800B6356L1955o5509o7742K405j0867L7653M4456m1934K27O107M2550J02367
15788A08024N4298r6344o6377M1526l504k1661O9425K2755N929r909j9746o6439
15776A7977l3555K8920l7777J1175O6331k923m8928o5405o9106Q0898Q1057K6825
15764E5489p4455l5907R0796J2422M4070j6720L2307l3267J4758R635k2147k9515
15752D7466Q7759l4274j45865N7175O2857l9864p6524n9171J5803P8039L8564
15741C1965K103J6621p8514r7489O7993J16744K2870k2161J3190J1992l6830p9208
15729c0724l8142M2336J2812q9891M1348p208k0118R6173K0476n2990m6192O641
15717f5479L6939K0736Q2391l0204n6645l89j4263M2812q7840L7627M0814j3684
$$ plain form
15705 -7185 -56229 -110755 -60234 -24962 -51865 11244 59488 26759 9775 48919 30458 -31386
15693 -31386 -11189 -61138 -58056 58262 76579 29384 -38739 -9734 36870 33761 -127 -72035
15681 -72035 -104937 -173477 -69309 -1871 -19547 -31711 -53140 20350 87178 111529 45684
15670 45684 15429 -35175 -85942 -117082 -145124 -107798 17894 58928 30795 27901 43516 -16994
15658 -16994 -25148 63207 81497 8359 -7422 72993 125596 53593 32553 -16046 -1900 57998
15646 57998 135093 68325 28238 -22763 -121269 -112432 82007 110000 17244 42824 2540 -46296
15634 -46296 -30335 39512 39930 15318 6901 21919 105690 135711 58362 -30040 -17139 31634
15622 31634 77257 137680 147602 134114 116000 128903 94187 15111 -48503 -142217 -195041 -224009
$$ packed form
15705g185m9044n4526N0521L5272k6903O3109M8244l2729j6984L9144j8461o1844
15693c1386K0197m9949L082J16318J8317m7195o8123K9005M6604l109l3888p1908
15681g2035l2902o8540J04168O7438j7676j2164k1429P3490O6828K4351o5845
15670D5684l0255n0604n0767l1140k8042L7326J25692M1034k8133k894J5615o0510
15658a6994q154Q8355J8290p3138j5781Q0415N2603p2003k1040m8599J4146N9898
15646E7998P7095o6768m0087n1001r8506Q837J94439K7993r2756K5580m0284m8836
15634d6296J5961O9847M18k4612q417J5018Q3771L0021p7349q8402J2901M8773
15622C1634M5623O0423R922j3488j8114J2903l4716p9076o3614r3714n2824k8968
$$ plain form
15610 -224009 -171981 -98236 -77590 -107523 -150772 -287827 -180967 -60330 -12746 62394 100135
15599 100135 91420 54349 4577 -27406 10631 -29777 -24499 30666 26391 53818 76908 11544
15587 11544 -24583 -39429 -121500 -154670 -134609 -101516 5545 91687 97362 23288 -85802
15576 -85802 -141266 -136805 -164181 -121952 -67225 32680 27998 -8937 16239 48721 56462 81238
15564 81238 113166 102355 122587 95654 101118 113622 105109 38044 -11876 59131 95808 17273
15552 17273 -44464 -24390 -59777 -99900 -80727 -30918 15319 -34836 -2786 30778 -8728 -13486
15540 -13486 -47354 -116572 -111166 -52091 88985 60325 -60482 -101688 -46627 45471 104928
15529 104928 -1396 -36792 1817 -36641 -37104 -7571 15273 88379 108813 51964 55027 26415
$$ packed form
15610b24009N2028P3745K0646k9933m3249j37055J06860J20637M7584P5140L7741
15599A00135q715l7071m9772l1983L8037m0408N278N5165m275K7427K3090o5364
15587A1544l6127j4846q2071l3170K0061L3093J07061Q6142N675p4074j09090
15576h5802n5464M461k7376M2229N4727R9905m682l6935K5176L2482P741K4776
15564H1238L1928j0811K0232k6933N464J2504q513o7065m9920P1007L6677p8535
15552A7273o1737K0074l5387m0123J9173M9809M6237n0155L2050L3564l9506m758
15540a3486l3868o9218N406N9075J41076k8660j20807m1206N5061R2098N9457
15529A04928j06324l5396L8609l8458m63K9533K2844P3106K0434n6849L063k8612
$$ plain form
15517 26415 -26313 -51738 -53597 31703 29580 -61340 -135978 -111307 -59112 -55233 -71786 -21681
15505 -21681 67976 77487 31751 64453 122565 62668 -6853 -13658 -9680 -36623 -1819 4248
15493 4248 -28701 30220 91853 92444 53622 -43589 -90186 -24177 4718 65949 63028 -53279
15481 -53279 -37504 -63335 9251 64016 -12703 -8271 19166 -14997 -18214 44291 -12151 -57742
15469 -57742 -50640 -47616 18727 58980 58594 -27531 -81225 -6303 84954 9209 -101834 -112042
15457 -112042 -80837 -145548 -128101 -93508 -147313 -160502 -136677 -93144 8104 16399 -18586
15446 -18586 -28658 -1160 79042 75665 -4438 -65140 -91180 -40279 -45692 -61366 40477 50474
15434 50474 -50154 -165645 -217126 -175547 -182531 -207064 -143346 -31385 13011 27205 -27553
$$ packed form
15517B6415n2728k5425j859Q5300k123r0920p4638K4671N2195L879j6553N0105
15505b1681Q9657R511m5736L2702N8112n9897o9521o805L978k6943L4804O067
15493D248l2949N8921O1633N91l8822r7211m6597O6009K8895O1231k921j16307
15481e3279J5775k5831P2586N4765p6719M432K7437l4163l217O2505n6442m5591
15469e7742P102L024O6343M0253l86q6125n3694P4922R1257p5745j11043j0208
15457a12042L1205o4711J7447L4593n3805j3189K3825M3533J01248Q295l4985
15446a8586j0072K7498Q0202l377q0103o0702k6040N0901n413j5674J01843R997
15434E0474j00628j15491n1481M1579o984k4533O3718J11961M4396J4194n4758
$$ plain form
15423 -27553 -40570 -78372 -86766 -15872 31316 58871 -18036 50288 143944 114077 130089 97739
15411 97739 165883 114667 42307 -10768 22601 57877 41822 80498 125352 11702 4156 114877
15399 114877 65988 -20047 -4704 73532 55226 1587 -37339 7936 -179 9584 -11414 -15832
15387 -15832 -18625 124100 116460 84294 96072 157562 97101 -2844 -18718 55542 114160 128919
15375 128919 50806 117131 145625 178144 109777 131011 100251 85783 150023 138690 34131
15364 34131 -557 -34225 -52075 -39391 -26092 -72699 -71537 -13699 -7181 28967 87890 97462
15352 97462 68206 52971 47351 -19197 -54437 -481 -49426 -33115 -93547 -154627 -151024 -123818
15340 -123818 -160355 -189027 -168414 -90946 -5916 13511 262 6801 -32564 45196 62361 44758
$$ packed form
15423b7553j3017l7802q394P0894M7188K7555p6907O8324R3656k9867J6012l2350
15411I7739O8144n1216p2360n3075L3369L5276j6055L8676M4854j13650p546J10721
15399A14877m8889q6035J5343P8236j8306n3639l8926M5275q115R763k0998m418
15387a5832k793J42725p640l2166J1778O1490o0461r9945j5874P4260N8618J4759
15375A28919p8113O6325K8494L2519o8367K1234l0760j4468O4240j1333j04559
15364C4131l4688l3668j7850J2684J3299m6607J162N7838O518L6148N8923R572
15352I7462k9256j5235n620o6548l5240N3956m8945J6311o0432o1080L603K7206
15340a23818l6537k8672K0613P7468Q5030J9427j3249O539l9365P7760J7165j7603
$$ plain form
15328 44758 14130 -26951 -108446 -176970 -238029 -194424 -91615 -17756 -14882 36382 63941 -11459
15316 -11459 -17606 -18417 -4515 53954 21441 69030 94528 54766 -20122 -17605 -19506 -44126 -67295
15303 -67295 -78218 -11569 114995 70202 39818 106448 115956 104699 136029 142083 99667 100966
15291 100966 136830 167779 53086 10993 -7608 7197 52163 42239 -49759 -134973 -27978
15280 -27978 107289 137229 120363 136469 192736 183119 110311 86631 13370 -29254 -567 69600
15268 69600 39315 15285 51885 67678 19251 -11073 -44642 12010 -2931 16647 50819 91085
15256 91085 97701 63137 82111 54405 64890 83489 40574 50557 22753 112816 196405 171450
15244 171450 102944 129728 183179 139634 42525 -2101 22105 23880 -20278 -42176 -182457
$$ packed form
15328D4758l0628m1081q1495o8524o1059M3605J02809P3859K874N1264K7559p5400
15316a1459o147q11J3902N8469l2513M7589K5498l9762p4888K517j901k4620k3169
15303f7295j0923O6649J26564m4793l0384O6630R508j1257L1330O054m2416J299
15291A00966L5864L0949j14693m2093j8601J4805M4966r924r1998q5214J06995
15280b7978J35267K9940j6866J6106N6267r617p2808k3680p3261m2624K8687P0167
15268F9600l0285k4030L6600J5793m8427l0324l3569N6652j4941J9578L4172M0266
15256I1085O616l4564J8974k7706J0485J8599m2915R983k7804R0063Q3589k4955
15244A71450o8506K6784N3451m3545r7109m4626K4206J775m4158k1898j40281
$$ plain form
15233 -182457 -192369 -112538 -30912 101335 58457 11872 -34957 18930 80431 4588 19779
15222 19779 129288 60767 35108 33726 61944 89575 114012 -747 1823 31854 4853 21693
15210 21693 6223 9170 43441 152 -91432 -125492 -45841 36327 -9972 -37689 -30333 50530
15198 50530 74733 66772 88151 128597 210806 226745 228982 134129 81779 20717 5421 815
15186 815 -40178 -86019 -88359 -47514 16674 9319 12654 -13995 41438 104608 67854 27628 38208
15173 38208 133815 150363 130715 45969 26327 25817 -82055 -81026 -44444 -108049 -207618 -180589
15161 -180589 -128610 11228 45709 4458 -4812 24467 44689 98543 3049 -55417 716
15150 716 97545 138248 174731 169453 82207 80849 117420 77416 77212 63224 -6367 11301 24954
$$ packed form
15233a82457r912P9831Q1626J32247m2878m6585m6829N3887O1501p5843J5191
15222A9779J09509o8521k5659j382K8218K7631K4437j14759K570L0031k7001J6840
15210B1693j5470K947L4271m3289r1584l4060P9651Q2168m6299k7717P356Q0863
15198E0530K4203p961K1379M0446Q2209J5939K237r4853n2350o1062j5296m606
15186H15m0993m5841k340M0845O4188p355L335k6649N5433O3170l6754m0226J0580
15173C8208R5607J6548j9648q4746j9642n10j07872J029L6582o3605r9569K7029
15161a80589N1979J39838L4481m1251r270K9279K0222N3854r5494n8466N6133
15150G16R6829M0703L6483n278q7246j358L6571m0004k04j3988o9591J7668J3653
$$ plain form
15137 24954 -6047 -3697 -47558 -28422 -10226 7015 -67467 -56887 9570 -6688 -30603 -43096
15125 -43096 -61629 -76955 -94212 -104574 -49132 72754 36763 -55786 -26501 -22429 -3948 67898
15113 67898 140342 190190 79508 -48177 -111989 -172991 -184939 -92569 1337 79291 117177
15102 117177 35328 44526 51486 46326 16730 57094 55422 76992 120638 5293 -123429 -135282
15090 -135282 -85896 27451 87947 41160 9704 69408 68975 57429 -11149 52652 71549 45243
15078 45243 51928 98727 -35367 -85779 -35242 8725 -34665 -44455 -86498 -114846 -50319 -44512
15066 -44512 -57237 -3365 40873 76727 97478 102553 120632 109556 65539 8266 39694 44776
15054 44776 -46854 38163 99398 86469 19880 -30202 35319 10229 -48975 66101 64480 -9872
$$ packed form
15137B4954l1001K350m3861J9136J8196J7241p4482J0580O6457j6258k3915j2493
15125d3096j8533j5326j7257j0362N5442J21886l5991r2549K9285M072J8481P1846
15113F7898P2444M9848j10682j27685o3812o1002j1948R2370R3906P7954L7886
15102A17177q1849R198O960n160k9596M0364j672K1570M3646j15345j28722j1853
15090a35282M9386J13347O0496m6787l1456N9704m33j1546o8578O3801J8897k6306
15078D5243O685M6799j34094n0412N0537M3967m3390r790m2043k8348O4527N807
15066d4512j2725N3872M4238L5854K0751N075J8079j1076m4017n7273L1428N082
15054D4776r1630Q5017O1235j2929o6589n0082O5521k5090n9204J15076j621p4352
$$ plain form
15042 -9872 -64553 -107577 -26354 81337 149144 183962 110123 136806 177266 115102 80547 99001
15030 99001 102538 49851 29444 99757 182998 120911 44115 172843 96467 39142 9123 -20990
15018 -20990 7401 108478 126051 117347 110127 62746 90384 92805 67158 46063 7377 -59516
15006 -59516 -64637 -48326 -17891 -49276 -149425 -214976 -137530 -61985 -17927 20237 20258 43864
14994 43864 94665 21434 -5559 54482 75032 -42506 -79561 -14573 -17731 18818 5377 -18245
14982 -18245 -35477 73618 90480 56699 -17616 -8080 26967 127356 154633 111577 124018
14971 124018 104998 53758 18584 63418 130161 22856 -122629 -104359 -59705 -96248 -22062
14960 -22062 53997 75656 14988 -39221 -97966 -83110 7186 26052 73342 66925 16765 -13457
$$ packed form
15042i872n4681m3024Q1223J07691O7807L4818p3839K6683M0460o2164l4555J8454
15030I9001L537n2687k0407P0313Q3241o2087p6796J28728p6376n7325l0019l0113
15018b0990K8391J01077J7573q704p220m7381K7638K421k5647k1095l8686o6893
15006e9516n121J6311L0435l1385j00149o5551P7446P5545M4058L8164K1K3606
14994D3864N0801p3231k6993O0041K0550j17538l7055O4988l158L6549j3441k3622
14982a8245j7232J09095J6862l3781p4315R536L5047J00389K7277m3056J2441
14971A24018j9020n1240l5174M4834O6743j07305j45485J8270M4654l6543P4186
14960b2062P6059K1659o0668n4209n8745J4856R0296J8866M7290o417n0160l0222
$$ plain form
14948 -13457 75931 117453 92975 68175 7991 -120494 -185097 -156512 -39830 15148 33308
14937 33308 69720 124794 30425 32118 2388 -32852 -61427 -40482 -81873 -169247 -98256 -24185
14925 -24185 -30755 -51111 937 24560 -642 24522 90658 121542 66131 18003 36690 108039
14913 108039 91057 122428 160127 87382 146686 290474 334484 310845 252467 206544 261629
14902 261629 271496 204437 185250 56620 5830 55519 147247 93757 -28375 42106 111849
14891 111849 98085 137953 160504 116336 31936 27018 26742 27476 97171 143400 17885 -81679
14879 -81679 -58983 -1194 109557 -3014 -101052 -13872 81903 67932 43710 82016 114893
14868 114893 35147 -21682 32415 52395 96599 43856 27723 -15834 -28919 -10291 -48735
$$ packed form
14948a3457Q9388M1522k4478k4800o0184j28485o4603K8585J16682N4978J8160
14937C3308L6412N5074r4369J693k9730l5240k8575K0945m1391q7374P0991P4071
14925b4185o570k0356N2048K3623k5202K5164O6136L0884n5411m8128J8687P1349
14913A08039j6982L1371L7699p2745N9304J43788M4010k3639n8378m5923N5085
14902B61629R867o7059j9187j28630n0790M9689R1728n3490j22132P0481O9743
14891A11849j3764L9868K2551m4168q4400m918k76P34O9695M6229j25515r9564
14879h1679K2696N7789J10751j12571r8038Q7180R5775j3971k4222L8306L2877
14868A14893p9746n6829N4097J9980M4204n2743j6133m3557j3085J8628l8444
$$ plain form
14857 -48735 -17224 68145 81796 45711 44085 86514 27936 -72359 -69394 -55045 -45242 26195
14845 26195 -50187 -121575 -103942 -42608 52355 179575 135247 29728 -53960 -43075 -64403
14834 -64403 -105824 -27624 52798 31319 60679 52754 -14928 -52752 -30353 26516 65130 74612
14822 74612 156169 117219 42006 50829 44672 93147 40285 45966 114357 7140 4026 21101
14810 21101 -41018 -40639 50397 42596 -957 -9338 -49035 -45486 -48867 -16022 56695 26738 34701
14797 34701 8203 47048 26665 26749 42060 11809 41360 70640 91975 86476 73090 112895
14785 112895 112953 54104 16397 -49111 -4928 35605 35832 50855 25199 23994 -30333 -111157 -128975
14772 -128975 -64547 -8182 15249 58793 82794 73194 -20952 -1102 6254 474 16490 78844
$$ packed form
14857d8735L1511Q5369J3651l6085j626M2429n8578j00295K965J4349R803P1437
14845B6195p6382p1388J7633O1334R4963J27220m4328j05519q3688J0885k1328
14834f4403m1421P8200Q0422k1479K9360p925o7682l7824K2399N6869L8614R482
14822G4612Q1557l8950p5213Q823o157M8475n2862N681O8391j07217l114J7075
14810B1101o2119L79R1036p801m3553q381l9697L549l381L2845P2717k9957P963
14797C4701k6498L8845k0383Q4J5311l0251K9551K9280K1335n499j3386L9805
14785A12895N8n8849l7707o5508M4183M0533K27J5023k5656j205n4327q0824j7818
14772a28975O4428N6365K3431M3544K4001r600r4146J9850P356n780J6016O2354
$$ plain form
14760 78844 90074 103498 58111 43647 64376 104696 70690 -22869 17794 -4315 25445 29095
14748 29095 -1856 7593 52312 113841 101853 72982 124935 112474 91330 151335 104190 89765
14736 89765 2419 -25100 -39223 20816 -31490 -32384 24026 62902 53889 133219 195660 182558
14724 182558 112488 91842 230505 337194 375456 495250 673706 883546 1073607 1328604
14714 1328604 1540319 1743762 1908631 2020015 1990420 1906200 1676833 1364164 1056253 794836
14704 794836 615955 400295 280538 190006 183552 191777 209395 188072 165389 132140 107218
14693 107218 118793 186118 210413 177799 128985 49196 43931 -677 34362 118027 95512 90057
14681 90057 115040 75020 64483 50282 14022 11804 -3947 28527 22499 -27734 35763 110806
$$ packed form
14760G8844J1230J3424m5387j4464K0729M0320l4006r3559M0663k2109K9760L650
14748B9095l0951R449M4719O1529j1988k8871N1953j2461k1144O0005m7145j4425
14736H9765q7346k7519j4123O0039n2306q94N6410L8876r013P9330O2441j3102
14724A82558p0070k0646J38663J06689L8262J19794J78456K09840J90061K54997
14714A328604K11715K03443J64869J11384k9595q4220k29367l12669l07911k61417
14704G94836j78881k15660j19757r0532o454Q225J7618k1323k2683l3249k4922
14693A07218J1575O7325K4295l2614m8814p9789n265m4608L5039Q3665k2515n455
14681I0057K4983m0020j0537j4201l6260k218j5751L2474o028n0233O3497P5043
$$ plain form
14669 110806 164256 154723 125998 128776 72078 28541 -3627 -7248 29678 110724 151688 40939
14657 40939 25919 42081 106597 75136 54902 176477 163124 98201 56837 139373 171262
14646 171262 133394 57296 42779 76224 18741 -485 56800 84721 131611 108252 81642
14635 81642 84582 116382 46189 -38011 -48849 -70686 -54912 -31427 21863 43729 87573 62277
14623 62277 120765 199014 174649 56664 -20155 -47472 29328 45505 -34053 9302 43127
14612 43127 106093 156021 178033 164358 181703 93198 53994 137829 139330 156798 116820 72688
14600 72688 81839 73216 76581 37965 -51127 -158435 -219565 -161528 -78831 53845 85771 40100
14588 40100 44648 110763 224753 196022 143802 79263 94413 160955 161849 204554 198086 126420
$$ packed form
14669A10806N3450r533k8725K778n6698m3537l2168l621L6926Q1046M0964j10749
14657D0939j5020J6162O4516l1461k0234J21575j3353o4923m1364Q2536L1889
14646A71262l7868p6098j4517L3445n7483j9226N7285K7921M6890k3359k6610
14635H1642K940L1800p0193q4200j0838k1837J5774K3485N3290K1866M3844k5296
14623F2277N8488P8249k4365j17985p6819k7317P6800J6177p9558M3355L3825
14612D3127O2966M9928K2012j3675J7345q8505l9204Q3835J501J7468l9978m4132
14600G2688R151q623L365l8616q9092j07308o1130N8037Q2697J32676L1926m5671
14588D0100M548O6115J13990k8731n2220o4539J5150O6542Q94M2705o468p1666
$$ plain form
14576 126420 91084 192567 217763 174474 178021 159254 52474 11073 19067 15975 33380 31251
14564 31251 -1820 35671 104339 184927 108329 103679 188983 183121 186454 185133 150700 112076
14552 112076 138991 73882 56155 2528 11179 -18719 77942 143303 186539 130454 119748 120549
14540 120549 167523 217268 148854 155995 202543 203626 156742 40737 70322 120124 175415 119854
14528 119854 67693 88980 164140 207054 269525 287460 285706 329262 366861 353869 380449 338021
14516 338021 324567 365606 431052 444254 428717 427766 344294 385262 366811 407600 438795 433322
14504 433322 369347 290275 330714 315207 372251 420113 340681 307242 296473 346785 408686
14493 408686 508195 585015 510402 445155 550845 663217 730196 704583 759371 877300 985151
$$ packed form
14576A26420l5336J01483K5196m3289L547j8767j06780m1401P994l092J7405k129
14564C1251l3071L7491O8668Q0588p6598m650Q5304n862L333j321l4433l8624
14552A12076K6915o5109j7727n3627Q651k9898R6661O5361M3236n6085j0706Q01
14540A20549M6974M9745o8414P141M6548J083m6884j16005K9585M9802N5291n5561
14528A19854n2161K1287P5160M2914O2471J7935j754M3556L7599j2992K6580m2428
14516C38021j3454M1039O5446J3202j5537r51q3472M0968j8451M0789L1195n473
14504D33322o3975p9072M0439j5507N7044M7862p9432l3439j0769N0312O1901
14493D08686R9509P6820p4613o5247J05690J12372O6979k5613N4788J17929J07851
$$ plain form
14482 985151 1069547 1245952 1428890 1663989 1883877 2077226 2284101 2493906 2778328 3171230
14472 3171230 3617249 4219401 4876667 5948752 7384715 9515221 12471376 16307707 20961524
14463 20961524 26204030 31577882 36269914 39471720 40743210 39894087 36990269 32499661
14455 32499661 27213845 21789779 16783440 12708301 9601136 7324250 5813560 4693713
14447 4693713 3905052 3329979 2982231 2617391 2344052 2144534 1943793 1678967 1448277
14438 1448277 1277226 1099464 984318 886724 761152 648652 622613 651024 639494 580959
14428 580959 520347 453153 374601 270453 147983 129774 215719 148625 144892 186127 303832
14417 303832 384334 351942 345246 419138 467059 421985 306194 313329 277334 265956 324607 471458
$$ packed form
14482I85151Q4396J76405J82938K35099K19888J93349K06875K09805K84422L92902
14472C171230M46019O02152O57266J072085J435963K130506K956155L836331M653817
14463B0961524N242506N373852M692032L201806J271490q49123k903818m490608
14455C2499661n285816n424066n006339m075139l107165k276886j510690j119847
14447D693713p88661n75073l47748l64840k73339j99518k00741k64826k30690
14438A448277j71051j77762j15146r7594j25572j12500k6039K8411j1530n8535
14428E80959o0612o7194p8552j04148j22470j8209Q5945o7094l733M1235J17705
14417C03832Q0502l2392o696P3892M7921m5074j15791P135l5995j1378N8651J46851
$$ plain form
14405 471458 448667 364526 356863 279895 319206 393918 494544 508535 502290 468556 395600 347999
14393 347999 413582 405124 423078 451298 379030 352362 334831 276403 270507 301145 338440 326851
14381 326851 314530 371865 411304 468867 513220 490969 456163 487641 418701 390982 363867
14370 363867 390294 431314 522124 533398 466808 465817 438213 317823 271496 290428 330560 319576
14358 319576 347009 354357 363657 363175 363039 314144 290383 357235 366875 382609 322213 338526 379453
14345 379453 401142 388070 400363 443322 455807 483993 601291 716631 761373 727217 669813
14334 669813 632049 774613 879405 815200 706288 705150 678510 675480 735423 713348 699788
14323 699788 755422 845715 926272 904832 944354 1032516 1073293 1031722 991985 982959 1054304 1106223
$$ packed form
14405D71458k2791q4141p663p6968L9311P4712J00626J3991o245l3734p2956m7601
14393C47999O5583q458J7954K8220p2268k6668j7531n8428n896L0638L7295j1589
14381C26851j2321N7335L9439N7563M4353k2251l4806L1478o8940k7719k7115
14370C63867K6427M1020R0810J1274o6590r91k7604j20390m6327J8932M0132j0984
14358C19576K7433P348R300m82j36m8895k3761O6852R640J5734o0396J6313M0927
14345C79453K1689j3072J2293M2959J2485K8186J17298J15340M4742l4156n7404
14334F69813l7764J42564J04792o4205j08912j138k6640l030N9943k2075j3560
14323F99788N5634R0293Q0557k1440L9522Q8162M0777m1571l9737r026P1345N1919
$$ plain form
14311 1106223 1144813 1133974 1194739 1191525 1259511 1423412 1548003 1724975 1879912 1991994
14301 1991994 2156698 2194750 2217295 2423672 2559659 2581749 2730671 2847238 3050196 3382671
14291 3382671 3781714 4055182 4432632 4967224 5617341 6388323 7344604 8643005 10050118
14282 10050118 11686818 13545070 15529500 17502346 19492659 21677998 24407163 28123244
14274 28123244 33530709 41752756 54213317 73123335 100624768 138028365 185139711
14267 185139711 239094104 293935925 342080887 375196267 387336800 376138967 343526243
14260 343526243 295641220 240277192 185687936 137586172 99129967 70932301 51471930
14253 51471930 38764226 30681790 25542494 22179587 19889412 18027961 16315803 14676233
$$ packed form
14311A106223L8590j0839O0765l214O7986J63901J24591J76972J54937J12082
14301A991994J64704L8052K2545K06377J35987K2090J48922J16567K02958L32475
14291C382671L99043K73468L77450N34592O50117P70982R56281J298401J407113
14282A0050118J636700J858252J984430J972846J990313K185339K729165L716081
14274B8123244N407465Q222047J2460561J8910018K7501433L7403597M7111346
14267A85139711N3954393N4841821M8144962L3115380J2140533j1197833l2612724
14260C43526243m7885023n5364028n4589256m8101764l8456205k8197666j9460371
14253E1471930j2707704q082436n139296l362907k290175j861451j712158j639570
$$ plain form
14245 14676233 13014725 11323908 9601354 8051170 6838520 5795209 4907508 4201524
14237 4201524 3766732 3414441 3179099 2925749 2751505 2534445 2259615 2050119 1820727
14228 1820727 1691596 1543012 1465604 1454785 1406205 1403789 1337203 1246693 1207508 1218288 1208929
14217 1208929 1253433 1327380 1333246 1306742 1228209 1281355 1401568 1482605 1642014 1966884 2307589
14206 2307589 2601985 2807495 2737228 2671616 2487008 2230591 1927605 1565638 1259000 1040443
14196 1040443 813324 725784 616148 535552 500455 474922 477180 374013 350768 395497 426949
14185 426949 379528 337642 303391 192133 121504 119546 147863 125967 224193 186965 154944
14174 154944 182277 284241 279431 213097 227594 254493 252936 242718 162687 128675 156972 123357
$$ packed form
14245A4676233j661508j690817j722554j550184j212650j043311q87701p05984
14237D201524m34792l52291k35342k53350j74244k17060k74830k09496k29392
14228A820727j29131j48584p7408j0819m8580k416o6586r0510l9185J0780r359
14217A208929M4504P3947N866k6504p8533N3146J20213Q1037J59409L24870L40705
14206B307589K94396K05510p0267o5612j84608k56417l02986l61967l06638k18557
14196A040443k27119q7540j09636q0596l5097k5533K258j03167k3245M4729L1452
14185D26949m7421m1886l4251j11258p0629j958K8317k1896R8226l7228l2021
14174A54944K7333J01964m810o6334J4497K6899j557j0218q0031l4012K8297l3615
$$ plain form
14162 123357 90573 123019 161613 168004 144340 128476 132563 130031 158874 138313 60879 103796
14150 103796 111439 144658 194159 194690 217377 197228 172340 126464 169921 227301 195768 226856
14138 226856 274551 330386 361831 373575 356075 248101 236797 209187 220231 107289 20386
14127 20386 63783 83487 81633 -9260 17042 24598 -28106 -65633 -19042 -15512 -89038 -63935
14115 -63935 4552 20694 27911 27941 -22960 -2512 141661 185681 168088 183660 205989 239062
14103 239062 278132 266157 221036 192467 231311 184414 125246 82156 18946 44148 53633 20268
14091 20268 9763 16797 -5607 -31102 -81283 -42954 -53677 8515 83026 116908 73630 7269
14079 7269 -161 16321 78843 52817 24069 30779 93190 129075 -33950 -126049 -93783 -56446
$$ packed form
14162A23357l2784L2446L8594O391k3664j5864M087k532K8843k0561p7434M2917
14150A03796P643L3219M9501N31K2687k0149k4888m5876M3457N7380l1533L1088
14138B26856M7695N5835L1445J1744j7500j07974j1304k7610J1044j12942q6903
14127B0386M3397J9704j854r0893K6302P556n2704l7527M6591L530p3526K5103
14115f3935O8487J6142P217L0n0901K0448J44173M4020j7593J5572K2329L3073
14103B39062L9070j1975m5121k8569L8844m6897n9168m3090o3210K5202R485l3365
14091B0268j0505P034k2404k5495n0181L8329j0723O2192P4511L3882m3278o6361
14079G269p430J6482O2522k6026k8748O710O2411L5885j63025r2099L2266L7337
$$ plain form
14067 -56446 -39040 67546 163736 146471 60447 -2701 14913 -11629 -24369 55465 78578
14056 78578 122318 71976 116569 180588 146275 51353 18135 17609 -62246 -50387 -76218 -79619
14044 -79619 -102493 -124078 -127487 -22173 61630 21963 -44801 -33384 46446 25710 33127 76750
14032 76750 76127 100532 32172 77643 68759 -6723 -28467 -52691 -62013 -17496 31318 162823
14020 162823 156895 101997 66189 135639 87590 591 -27302 24245 56744 83744 149187 108347
14008 108347 47633 180702 274980 212354 146658 270490 268278 235819 191252 145029 69593
13997 69593 71299 24966 -27332 23535 95973 87007 28730 -31573 37099 63118 39816 -119298
13985 -119298 -39434 29574 85751 131691 100203 42289 74493 27526 -8632 32956 120459
$$ packed form
14067e6446J7406J06586R6190j7265q6024o3148J7614k6542j2740P9834K3113
14056G8578M3740n0342M4593O4019l4313r4922l3218n26p9855J1859k5831l401
14044g9619k2874k1585l409J05314Q3803l9667o6764J1417P9830k0736P417M3623
14032G6750o23K4405o8360M5471q884p5482k1744k4224r322M4517M8814J31505
14020A62823n928n4898l5808O9450m8049q6999k7893N1547L2499K7000O5443m0840
14008A08347o0714J33069R4278o2626o5696J23832k212l2459m4567m6223p5436
13997F9593J706m6333n2298N0867P2438q966n8277o0303O8672K6019k3302j59114
13985a19298P9864O9008N6177M5940l1488n7914L2204m6967l6158M1588Q7503
$$ plain form
13974 120459 102737 162645 130179 151057 175414 237446 216398 159790 3823 -20632 18663
13963 18663 -1612 24697 -9760 -39173 -779 -6372 -66559 -79383 -77796 -618 52367 17913
13951 17913 2276 -22048 5276 11984 -9402 8297 -21922 68673 31990 2614 -26518 -53677
13939 -53677 -118305 -124599 -139789 -166182 -128371 -99137 -143350 -151585 -131571 -133556 -157064 -137089
13927 -137089 -80279 -44401 2419 -10431 -38359 -79181 -108421 -84456 -84519 -20571 -24400 43779
13915 43779 29525 18377 48324 163987 212840 127095 77467 29138 -103022 -87290 -7675
13904 -7675 32138 -10318 -10487 66 -30160 -100768 -155470 -138945 -161081 -141455 -81111 -42182
13892 -42182 23491 29462 -23117 -27552 81335 177246 175024 117912 86634 30997 -11862 20194
$$ packed form
13974A20459j7722N9908l2466K0878K4357O2032k1048n6608j55967k4455L9295
13963A8663k0275K6309l4457k9413L8394n593o0187j2824J587P7178N2985l4454
13951A7913j5637k4324K7324O708k1386J7699l0219R0595l6683k9376k9132k7159
13939e3677o4628o294j5190k6393L7811K9234m4213q235K0014j985k3508J9975
13927a37089N6810L5878M6820j2850k7928m0822k9240K3965o3O3948l829O8179
13915D3779j4254j1148K9947J15663M8853q5745m9628m8329j32160J5732P9615
13904g675L9813m2456j69J0553l0226p0608n4702J6525k2136J9626O0344L8929
13892d2182O5673N971n2579m435J08887R5911k222n7112l1278n5637m2859L2056
$$ plain form
13880 20194 27217 52211 68512 5656 -37676 -5126 105875 199350 191218 146260 96463 48735
13868 48735 -31307 -71134 42584 19524 3945 -39593 -18714 70388 22563 19811 73376 86871
13856 86871 85940 72319 85294 147231 241603 264808 384735 510047 627598 639376 706980
13845 706980 751564 675942 663325 597982 506272 346630 252326 294480 380035 321435 156130
13834 156130 76708 66389 76586 118199 126807 87864 43305 43359 114345 106348 138908 199405
13822 199405 193769 248264 237352 244548 313894 398539 485810 603475 882330 1246640 1603985
13811 1603985 1841436 1937434 1954721 1935576 1760412 1600347 1405002 1138793 851309 632979
13801 632979 414922 287384 189448 199157 194892 173257 105807 101633 41366 -11927 34281 19731
$$ packed form
13880B0194P023K4994J6301o2856m3332L2550J11001R3475q132m4958m9797m7728
13868D8735q0042l9827J13718k3060j5579m3538K0879Q9102m7825k752N3565J3495
13856H6871r31j3621J2975O1937R4372K3205J19927J25312J17551J1778O7604
13845G06980M4584p5622j2617o5343r1710j59642r4304M2154Q5555n8600j65305
13834A56130p9422j0319J0197M1613Q608l8943m4559N4P0986p997L2560O0497
13822A99405n636N4495j0912P196O9346Q4645Q7271J17665K78855L64310L57345
13811A603985K37451R5998J7287j9145j75164j60065j95345k66209k87484k18330
13801F32979k18057j27538r7936R709m265k1635o7450m174o0267n3293M6208j4550
$$ plain form
13789 19731 41893 120303 162653 201324 134592 96927 19257 19440 97891 94195 7022 -38196
13777 -38196 -72466 8167 14687 15681 77868 23800 -10427 7131 35519 116817 75146 55376
13765 55376 -134 11903 31717 -1398 -12451 5389 -7473 16056 -27138 -25522 4480 7487
13753 7487 1212 32838 -10914 -63123 -158475 -153232 -55042 52377 114748 95479 151600 69467
13741 69467 -50542 -39826 -31854 -95583 29954 28117 31343 71027 103091 -3047 -79853 -150642
13729 -150642 -225019 -125463 -69728 -58315 -63280 24030 100648 74786 74867 150437 192965 77417
13717 77417 58770 -38180 -26666 -19188 5719 56090 43890 -11594 730 -19369 -63371 -65771
13705 -65771 -86412 -98615 -19928 -32174 -76336 50178 65125 95646 66654 -3798 -12555 -11461
$$ packed form
13789A9731K2162P8410M2350L8671o6732l7665p7670J83P8451l696q7173m5218
13777c8196l4270Q0633O520R94O2187n4068l4227J7558K8388Q1298m1671j9770
13765E5376n5510J2037J9814l3115j1053J7840j2862K3529m3194J616L0002L007
13753G487o275L1626m3752n2209r5352N243R8190J07419O2371j9269N6121q2133
13741F9467j20009J0716P972o3729J25537j837L226L9684L2064j06138p6806p0789
13729a50642p4377R9556N5735J1413m965Q7310P6618k5862Q1P5570M2528j15548
13717G7417j8647r6950J1514P478K4907N0371j2200n5484J2324k0099m4002k400
13705f5771k0641j2203P8687j2246m4162J26514J4947L0521k8992p0452q757J094
$$ plain form
13693 -11461 27412 -38391 -44047 6275 -31930 -77353 48046 99619 10435 -68828 -85078 -29939
13681 -29939 5299 3486 49817 73733 707 42760 103721 -10348 42206 58425 120373 106747
13669 106747 -88332 -148512 -84174 -24630 -62858 -75691 -80297 -89181 -44684 -86801 -25511 64134
13657 64134 49047 74841 23959 -16527 -66113 -46155 -44937 -107772 -82344 -99901 -114164 -39030
13645 -39030 -53467 -17909 -22907 -36 -8615 44025 54221 25708 -76077 -177642 -148869 -85467
13633 -85467 -156790 -156598 -180825 -78470 -6542 -2020 -2800 16521 -3994 12491 45757 78117
13621 78117 54452 76583 67565 26974 40093 -7549 -106206 -108026 -95707 17142 70392 101749
13609 101749 76237 -25106 3580 -62052 -114533 -138329 -69657 -52222 -149279 -111356 -54338
$$ packed form
13693a1461L8873o5803n656N0322l8205m5423J25399N1573q9184p9263j6250N5139
13681b9939L5238j813M6331K3916p3026M2053O0961j14069N2554J6219O1948j3626
13669A06747j95079o0180O4338N9544l8228j2833m606q884M4497m2117O1290Q9645
13657F4134j5087K5794n0882m0486m9586J9958J218o2835K5428j7557j4263P5134
13645c9030j4437L5558m998K2871q579N2640J0196k8513j01785j01565K8773O3402
13633h5467p1323J92k4227J02355P1928M522p80J9321k0515J6485L3266L2360
13621G8117k3665K2131r018m0591J3119m7642r8657j820J2319J12849N3250L1357
13609A01749k5512j01343K8686o5632n2481k3796O8672J7435r7057L7923N7018
$$ plain form
13598 -54338 -80310 -59122 22973 87496 48154 20273 -19657 -23392 9416 -13062 -20756 56787
13586 56787 102475 48155 -21930 30835 78268 112018 141639 144387 138372 132907 138912 85399
13574 85399 -6421 3452 1909 21314 33102 51334 29438 11211 7930 58394 24489 -22754
13562 -22754 -56417 -43959 2069 27884 -30699 4189 94622 180767 133473 165865 144160 149896
13550 149896 204960 188003 94876 116046 61763 -11013 6487 60670 110552 101868 93781 -44107
13538 -44107 -91753 -130544 -84879 -66692 -75182 -103394 -132562 -110804 -137380 -108197 -159693 -158054
13526 -158054 -157994 -57804 11070 48838 -74 -35980 -106410 -108245 -57789 66269 155045 122715
13514 122715 16607 -54038 -88778 -76435 -51682 28715 21470 -1270 5045 3309 -30136 -60065
$$ packed form
13598e4338k5972K1188Q2095O4523l9342k7881l9930l735L2808k2478p694P7543
13586E6787M5688n4320p0085N2765M7433L3750K9621K748o015n465O005n3513
13574H5399r1820R873j543J9405J1788J8232k1896j8227l281N0464l3905m7243
13562b2754l3663J2458M6028K5815n8583L4888R0433Q6145m7294L2392k1705N736
13550A49896N5064j6957r3127K1170n4283p2776J7500N4183M9882q684q087j37888
13538d4107m7646l8791M5665J8187q490k8212k9168K1758k6576K9183n1496J639
13526a58054O0J00190O8874L7768m8912l5906p0430j835N0456J24058Q8776l2330
13514A22715j06108p0645l4740J2343K4753Q0397p245k2740O315j736l3445k9929
$$ plain form
13502 -60065 23194 -6498 -54457 15625 -28298 -71650 -21099 -4113 37738 82445 60890 -82819
13490 -82819 -125797 -11227 -3767 30227 -24489 -32595 27860 24623 16053 -21291 -57780 -66173
13478 -66173 -13895 37663 -36660 -105860 -96673 -86806 -18896 65181 64678 27765 21077 71265 81373
13465 81373 162675 121367 43610 66844 -12935 -52867 27144 36176 -5931 -89032 -92302 -37054
13453 -37054 23682 8451 36411 -19381 -12730 -54486 -46954 -80070 -50651 94432 152268 145798
13441 145798 108333 79880 67630 -127 -7782 -64937 -147454 -128585 -110197 -20299 9442 41416
13429 41416 64360 -956 -18428 -45771 -22137 -68454 -122298 -71779 -17459 -50522 -148429 -173782
13417 -173782 -134044 -138025 -163417 -84301 -62012 -78319 36754 79661 37825 17932 -44279
$$ packed form
13502f0065Q3259k9692m7959P0082m3923m3352N0551J6986M1851M4707k1555j43709
13490h2819m2978J14570P460L3994n4716q106O0455l237q570l7344l6489q393
13478f6173N2278N1558p4323o9200R187R867O7910Q4077n03l6913o688N0188J0108
13465H1373Q1302m1308p7757K3234p9779l9932Q0011R032m2107q3101l270N5248
13453c7054O0736j5231K7960n5792O651m1756P532l3116K9419J45083N7836o470
13441A45798l7465k8453j2250o7757p655n7155q2517J8869J8388Q9898K9741L1974
13429D1416K2944o5316j7472k7343K3634m6317n3844N0519N4320l3063r7907k5353
13417a73782L9738l981k5392P9116K2289j6307J15073M2907m1836j9893o2211
$$ plain form
13406 -44279 -53989 13835 71457 54191 24254 58129 58774 -1324 -37883 -65607 -103202 -46965
13394 -46965 -2548 -2800 -38407 -53767 -91248 -81858 -91640 -205324 -219058 -182109 -146029 -137383
13382 -137383 -196650 -186544 -208712 -145704 -36965 79270 58072 72537 86772 105310 169137
13371 169137 109964 107841 65595 101611 29156 -26220 -65468 -122938 -84425 -134534 -124827 -66280
13359 -66280 -38401 -48341 -30524 -43803 -81191 -77982 -50254 -18589 -123561 -146007 -102609 -100731
13347 -100731 -64921 -74006 -47079 -18173 -25650 3051 44039 -51639 -195203 -201405 -186981 -181002
13335 -181002 -64779 -44142 -104102 -96088 -84875 -61514 34719 139678 126907 93073 39012
13324 39012 -817 27001 8147 20234 46021 67936 58486 29206 45120 67821 123299 88648
$$ packed form
13406d4279r710O7824N7622j7266k9937L3875O45o0098l6559k7724l7595N6237
13394d6965M4417k52l5607j5360l7481R390r782j13684j3734L6949L6080Q646
13382a37383n9267J0106k2168O3008J08739J16235k1198J4465J4235J8538O3827
13371A69137n9173k123m2246L6016p2455n5376l9248n7470L8513n0109R707N8547
13359f6280K7879r940J7817j3279l7388L209K7728L1665j04972k2446M3398J878
13347a00731L5810r085K6927K8906p477K8701M0988r5678j43564o202J4424N979
13335a81002J16223K0637n9960Q014J1213K3361R6233J04959j2771l3834n4061
13324C9012l9829K7818j8854J2087K5787K1915r450k9280J5914K2701N5478l4651
$$ plain form
13312 88648 54741 23052 26388 11629 72321 51412 -60932 -29798 -76334 -19574 69415 70438
13300 70438 38360 19088 -11872 -19008 -18151 -114657 -98095 -108361 -117378 -72226 -29115 -23183 -5609
13287 -5609 -13797 -88671 -169501 -95312 58081 87796 41171 -40615 -130101 -161895 -121117 -61750
13275 -61750 -2131 23863 -26485 -149473 -187309 -186520 -122763 -71309 -36298 -91118 -111244 8227
13263 8227 604 -74207 -67928 -41479 -67282 29242 159450 294194 193506 159504 81714 122843
13251 122843 122694 60651 -1130 -40517 -14019 52276 97326 54269 -13467 23984 60997 15264
13239 15264 -78537 -69777 13745 30498 20154 60460 84787 106375 50582 64982 74775 74189
13227 74189 41407 45361 85488 94239 22066 -7931 843 15767 22592 -14810 -67511 -80808
$$ packed form
13312H8648l3907l1689L336j4759O0692k0909j12344L1134m6536N6760Q8989J023
13300G0438l2078j9272l0960p136Q57r6506J6562j0266r017M5152M3111N932J7574
13287e609q188p4874q0830P4189J53393K9715m6625q1786q9486l1794M0778N9367
13275f1750N9619K5994n0348j22988l7836P89O3757N1454L5011n4820k0126J19471
13263H227p623p4811O279K6449k5803R6524J30208J34744j00688l4002p7790M1129
13251A22843j49o2043o1781l9387K6498O6295M5050m3057o7736L7451L7013m5733
13239A5264r3801Q760Q3522J6753j0344M0306K4327K1588n5793J4400R793n86
13227G4189l2782L954M0127Q751p2173k9997Q774J4924O825l7402n2701j3297
$$ plain form
13215 -80808 -82504 -43505 11616 2121 19639 59880 38649 41449 96253 78716 74861 -51775
13203 -51775 -117543 -76169 -74377 -74416 -45305 -10490 82784 159042 87906 47012 -15876 -22294 -39964
13190 -39964 -20849 -35664 -76714 -103992 -82439 -72805 -70154 -66124 14802 73154 123669 18390
13178 18390 -13629 -46474 -68161 -43564 -42593 47462 105449 67129 26934 -24029 -59361 -67900
13166 -67900 -9276 -39466 -130864 -54402 66831 76931 28280 93878 110554 -11304 -90537
13155 -90537 -115058 -76966 -150645 -152932 -31539 24405 -92730 -146275 -156718 -136643 -152919
13144 -152919 -90054 -4845 34942 27498 18352 -62192 -54814 30114 89391 72972 98153 74663
13132 74663 90236 85487 68631 53935 -32819 -2555 761 -8184 -60594 12761 60691 -29989
$$ packed form
13215h0808j696L8999N5121r495J7518M0241k1231K800N4804j7537l855j26636
13203e1775o5768M1374J792l9K9111L4815R3274P6258p1136m0894o2888o418j7670
13190c9964J9115j4815m1050k7278K1553R634K651M030Q0926N8352N0515j05279
13178A8390l2019l2845k1687K4597R71R0055N7987l8320m0195n0963l5332q539
13166f7900N8624l0190r1398P6462J21233J0100m8651O5598J6676j21858p9233
13155i0537k4521L8092p3679k287J21393N5944j17135n3545j0443K0075j6276
13144a52919O2865Q5209L9787p444r146q0544P378Q4928N9277j6419K5181k3490
13132G4663J5573m749j6856j4696q6754L0264L316q945n2410P3355M7930r0680
$$ plain form
13120 -29989 -58360 -23635 13815 6680 -7388 -38987 -39187 3842 2137 4690 -31172 -12158 -29899
13107 -29899 -47760 -2699 4031 5248 29426 14109 14315 19722 35337 43283 -30586 -163441 -183648
13094 -183648 -174826 -238567 -248414 -216479 -188366 -117124 -66257 -11629 58941 113021 105770 57555
13082 57555 12626 109936 186641 170004 105963 -11897 -31897 77939 82521 110260 147697
13071 147697 180051 181664 149672 59311 -10553 37173 109067 122062 141038 208504 155278 168782
13059 168782 181402 128105 60906 -49658 42170 59937 27711 -17757 9667 3113 36467
13048 36467 110027 95273 70830 35017 56972 113084 95046 65960 70568 133071 212831 211286
13036 211286 132911 118176 123448 39914 -6279 -1796 33813 51969 39892 22209 -74125 -141027
$$ packed form
13120b9989k8371L4725L7450p135j4068l1599k00M3029j705K553l5862J9014j7741
13107b9899j7861M5061O730J217K4178j5317K06N407J5615P946p3869j32855k0207
13094a83648Q822o3741r847L1935K8113P1242N0867N4628P0570N4080p251m8215
13082E7555m4929R7310P6705j6637o4041j17860k0000J09836M582K7739L7437
13071A47697L2354J613l1992r0361o9864M7726P1894J2995J8976O7466n3226J3504
13059A68782J2620n3297o7199j10564R1828J7767l2226m5468K7424o554L3354
13048C6467P3560j4754k4443l5813K1955N6112j8038k9086M608O2503P9760j545
13036B11286p8375j4735N272q3534m6193M483L5609J8156j2077j7683r6334o6902
$$ plain form
13024 -141027 -116693 -82526 -59189 -59171 -64216 9232 1762 12062 28468 -38662 -9089 4709
13012 4709 11348 26709 30735 8982 -41130 -94390 -73713 20779 148485 70840 -12589 -49747
13000 -49747 -130918 -116441 -20125 47834 -34729 -109829 -58681 -44719 -142789 -147754 -94155 -46436
12988 -46436 -64843 -78399 -59582 -23237 -31701 68367 149404 68474 -55346 -137196 -93030
12977 -93030 -19389 55095 137440 49991 -15279 -54753 -59671 -3207 30517 1935 21482 -21840
12965 -21840 -108459 -47230 69851 43809 120144 175674 114344 -15917 -104638 -152715 -123893
12954 -123893 -90980 -44269 -41508 -104173 -88611 34815 229262 288724 207086 183146 198307
12943 198307 94328 19009 98273 125074 53094 -58780 -104163 -36297 102721 128530 64986
$$ packed form
13024a41027K4334L4167K3337J8n045P3448p470J0300J6406o7130K9573J3798
13012D709O639J5361M026k1753n0112n3260K0677R4492J27706p7645q3429l7158
13000d9747q1171J4477R6316O7959q2563p5100N1148J3962r8070m965N3599M7719
12988d6436j8407j3556J8817L6345q464J00068Q1037q0930j23820q1850M4166
12977i3030P3641P4484Q2345q7449o5270l9474m918N6464L3724k8582J9547m3322
12965b1840q6619O1229J17081k6042P6335N5530o1330j30261q8721m8077K8822
12954a23893L2913M6711K761o2665J5562J23426J94447N9462q1638k3940J5161
12943A98307j03979p5319P9264K6801p1980j11874m5383O7866J39018K5809o3544
$$ plain form
12932 64986 52631 -14778 -17803 27019 48281 5807 -42650 -90463 -87828 9589 72927 92006
12920 92006 107179 47312 75189 93345 60474 32980 -61041 -53202 -37731 -35279 -76866 -90954
12908 -90954 -50787 -20723 -42940 -22830 -77950 -148780 -135351 -168937 -99495 -138347 -142911 -56234
12896 -56234 -2776 -56515 -57290 -61642 -84462 -72552 -58183 -82067 -109947 -98745 -123519 -90955
12884 -90955 59694 114742 93801 47436 -15238 36228 25410 -47872 -28344 129985 127884
12873 127884 85224 51561 -17919 -38476 -19931 -8576 -8319 13845 70006 70181 74176 105758
12861 105758 15155 -97057 -118063 -269394 -255327 -155305 -47077 -26011 24059 31566 21795
12850 21795 -47724 42917 47252 15919 -45423 -85704 -100202 -149283 -210719 -127001 -42476 -46040
$$ packed form
12932F4986j2355o7409l025M4822K1262m2474m8457m7813K635R7417O3338J9079
12920I2006J5173n9867K7877J8156l2871k7494r4021P839J5471K452m1587j4088
12908i0954M0167L0064k2217K0110n5120p0830J3429l3586O9442l8852m564Q6677
12896e6234N3458n3739p75m352k2820J1910J4369k3884k7880J1202k4774L2564
12884i0955J50649N5048k0941m6365o2674N1466j0818p3282J9528J58329k101
12873A27884m2660l3663o9480k0557J8545J1355K57K2164N6161J75L995L1582
12861A05758r0603j12212k1006j51331J4067J00022J08228K1066N0070P507r771
12850B1795o9519R0641M335l1333o1342m0281j4498m9081o1436Q3718Q4525l564
$$ plain form
12838 -46040 -68044 -60685 33698 89662 172549 180485 196152 134253 46931 43274 123857 80689
12826 80689 10408 13948 28912 -23849 -79445 -18677 -87140 -180669 -131487 -109325 -120341 -94380
12814 -94380 -137649 -119182 -76559 -88495 3935 114253 126650 61702 -8389 -67566 -57100
12803 -57100 -31385 37627 80603 93429 84584 65311 13802 6101 27149 -50578 -81509 26748
12791 26748 139100 172274 131559 57620 9727 -41485 20097 51776 69125 -14777 -87302
12780 -87302 -62309 -95412 -93234 -40869 -45874 -37506 53525 59130 72479 39968 -6044 -59492
12768 -59492 -65775 -15744 -47802 -114738 -65061 -109528 -137436 -168007 -149058 -91553 -99739 -79595
12756 -79595 -79328 -50198 -52417 -99687 -135649 -66252 -12819 -53513 -101016 -95356 -78728 -60157
$$ packed form
12838d6040k2004P359R4383N5964Q2887P936J5667o1899q7322l657Q0583m3168
12826H0689p0281L540J4964n2761n5596O0768o8463r3529M9182K2162j1016K5961
12814i4380m3269J8467M2623j1936R2430J10318J2397o4948p0091n9177J0466
12803e7100K5715O9012M2976J2826q845j9273n1509p701K1048p7727l0931J08257
12791B6748J12352L3174m0715p3939m7893n1212O1582L1679J7349q3902p2525
12780h7302K4993l3103K178N2365n005Q368R1031N605J3349l2511m6012n3448
12768e9492o283N0031l2058o6936M9677m4467k7908l0571J8949N7505q186K0144
12756g9595K67K9130k219m7270l5962O9397N3433m0694m7503N660J6628J8571
$$ plain form
12744 -60157 -81949 -89390 -99558 -77684 -58950 -6685 -16983 -7185 66376 34341 -32288 -120974
12732 -120974 -148402 -4598 88671 46936 74354 142789 103222 88110 18256 -68546 -174529
12721 -174529 -120155 -37402 13920 -17488 -71940 -151277 -109677 -85272 39562 176348 193269
12710 193269 148295 103694 84988 24605 -36080 19428 -61162 -123824 -79561 -91831 -118875
12699 -118875 -88339 -23273 21406 41283 64074 116047 92057 38907 60213 31470 6812
12688 6812 -4899 61957 37441 -54973 -41492 -81984 -90739 -3753 -15752 -15676 37127 25037 -10556
12675 -10556 -21683 -38865 -51663 -26605 46216 113830 31100 -17772 -44756 -105099 -154322 -132716
12663 -132716 -147735 -114632 -102662 -154834 -161068 -79905 -8906 -83471 -103595 -131166 -106399 -37641
$$ packed form
12744f0157k1792p441j0168K1874J8734N2265j0298R798P3561l2035o6629q8686
12732a20974k7428J43804R3269m1735K7418O8435l9567j5112o9854q6802j05983
12721a74529N4374Q2753N1322l1408n4452p9337M1600K4405J24834J36786J6921
12710A93269m4974m4601j8706o0383o0685N5508q0590o2662M4263j2270k7044
12699a18875L0536O5066M4679J9877K2791N1973k3990n3150K1306k8743k4658
12688F812j1711O6856k4516r2414J3481m0492q755Q6986j1999P6N2803j2090l5593
12675a0556j1127j7182j2798K5058P2821O7614q2730m8872k6984o0343m9223K1606
12663a32716j5019L3103J1970n2172o234Q1163P0999p4565k0124k7571K4767O8758
$$ plain form
12651 -37641 -26646 -71148 -41653 -46657 34988 42136 -8059 16627 22535 24433 31086 83881 67949
12638 67949 -14434 -131873 -164287 -78669 -19292 15310 -74871 -70720 -31497 45229 45064 29298
12626 29298 26299 38628 31021 37984 -4266 26487 99459 -9494 -56119 -60064 -102823 -43254
12614 -43254 -37818 2239 52956 -3680 -100064 -190331 -267550 -154584 -10939 16632 51346
12603 51346 30541 -40318 17883 41940 -27924 13181 57585 68885 -23273 -80200 -32419 -17923
12591 -17923 -9555 -25491 -76799 -135270 -69647 -108826 -75702 -5274 -48437 28177 46836 -57567
12579 -57567 -94575 -66330 2135 36518 -43138 -50841 17951 73590 124178 77916 83436 113934
12567 113934 -3341 -43121 -38564 187 -34497 -20347 -25865 -39669 -98887 -147899 -141751 -154962
$$ packed form
12651c7641J0995m4502K9495n004Q1645P148n0195K4686N908J898O653N2795j5932
12638F7949q2383j17439l2414Q5618N9377L4602r0181M151L9223P6726j65j5766
12626B9298k999J2329p607O963m2250L0753P2972j08953m6625l945m2759N9569
12614d3254N436M0057N0717n6636r6384r0267p7219J12966J43645K7571L4714
12603E1346k0805p0859N8201K4057o9864M1105M4404J1300r2158n6927M7781J4496
12591a7923Q368j5936n1308n8471O5623l9179L3124P0428m3163P6614J8659j04403
12579e7567l7008K8245O8465L4383p9656p703O8792N5639N0588m6262N520L0498
12567A13934j17275l9780M557L8751l4684J4150n518j3804n9218m9012O148j3211
$$ plain form
12555 -154962 -121651 -13383 40469 -3735 -49047 -71457 -38542 10184 9606 -13 76952 37659
12543 37659 105205 32460 -1622 -20190 12664 135009 139036 27458 -68497 -49478 -12289
12532 -12289 -23905 -8330 71143 76781 50765 101535 86515 -55860 -110598 -72137 5672 61641
12520 61641 49263 49310 59938 46581 125812 84959 -33303 -61361 -30315 3110 -75829 -61261
12508 -61261 43406 49408 39281 31422 37372 -6661 -12922 63836 29817 -109400 -168475 -108326
12496 -108326 -52861 6373 -58743 -85824 -55660 -48381 -84489 -80598 -25231 -58018 -50409 -94648
12484 -94648 -97407 -83426 -61104 -76483 -63326 -33366 -116493 -160583 -127904 -109455 -97355 -110593
12472 -110593 -75501 -87812 -109257 -80630 7897 33570 -63882 -102052 -73458 -86371 -35804
$$ packed form
12555a54962L3311J08268N3852m4204m5312k2410L2915M8726n78r619P6965l9293
12543C7659O7546p2745l4082j8568L2854J22345M027j11578r5955J9019L7189
12532a2289j1616J5575P9473N638k6016N0770j5020j42375n4738L8461P7809N5969
12520F1641j2378M7J0628j3357P9231m0853j18262k8058L1046L3425p8939J4568
12508f1261J04667O002j0127p859N950m4033o261P6758l4019j39217n9075O0149
12496a08326N5465N9234o5116k7081L0164P279l6108L891N5367l2787P609m4239
12484i4648k759J3981K2322j5379J3157K9960q3127m4090L2679J8449J2100j3238
12472a10593L5092j2311k1445K8627Q8527K5673r7452l8170K8594j2913N0567
$$ plain form
12461 -35804 -4634 76562 177496 201212 120341 73615 30629 -39266 -83721 -62710 -15243
12450 -15243 15624 9891 -16466 -17553 -87745 -119744 -105588 -24604 15056 57826 42255 15724
12438 15724 -38353 18371 46854 117469 126401 42165 53200 23869 1930 35996 42545 98516
12426 98516 130791 126635 36452 -12891 26086 3853 -13645 -102120 -54593 24499 15752 -45049
12414 -45049 -100522 -63582 22847 1755 -25753 -41974 -16769 -92431 -151804 -111245 -92184 -112252
12402 -112252 -76525 -50493 -40548 -40202 -38086 1737 61936 129958 110936 116984 94738 55461
12390 55461 -49365 -36057 46565 92357 16356 76999 165914 99427 62616 5085 -38538
12379 -38538 -36001 16258 33593 -748 -45026 -62054 -79461 -37078 -6508 -51188 -6884 -22346
$$ packed form
12461c5804L1170Q1196J00934K3716q0871m6726m2986o9895m4455K1011M7467
12450a5243L0867n733k6357j087p0192l1999J4156Q0984L9660M2770j5571k6531
12438A5724n4077N6724K8483P0615Q932q4236J1035k9331k1939L4066O549N5971
12426I8516L2275m156r0183m9343L8977k2233j7498q8475M7527P9092q747o0801
12414d5049n5473L6940Q6429k1092k7508j6221K5205p5662n9373M0559J9061k0068
12402a12252L5727K6032R945L46K116L9823O0199O8022j9022O048k2246l9277
12390E5461j04826J3308Q2622M5792p6001O0643Q8915o6487l6811n7531m3623
12379c8538K537N2259J7335l4341m4278j7028j7407M2383L0570m4680M4304j5462
$$ plain form
12367 -22346 -29851 -39118 -106803 -94431 13510 42266 -43115 -114066 -146487 -91561 -41031 -42871
12355 -42871 -30663 -83288 -130541 -48453 -35481 64789 183075 115791 85893 140981 85843
12344 85843 39178 65365 27484 61903 124213 78649 -5969 -20706 28648 42834 -40043 -65551
12332 -65551 -63275 -43693 -49474 -35660 12284 -37617 -51641 9714 93475 82824 93365 69854
12320 69854 47414 27484 37006 33088 -4286 -4082 -1595 61725 73406 79240 65752 2860 -84002
12307 -84002 -197730 -164415 -121724 -136971 -72870 -37459 11431 34364 41809 -33102 -38021 -47916
12295 -47916 12301 119536 49908 19148 48119 -3542 -45544 -98447 -114050 -161991 -160825 -84821
12283 -84821 -2841 27496 8604 22320 46171 78660 35897 -49056 -38806 7557 -6432 30901
$$ packed form
12367b2346p505r267o7685J2372J07941K8756q5381p0951l2421N4926N0530j840
12355d2871J2208n2625m7253Q2088J2972J00270J18286o7284k9898N5088n5138
12344H5843m6665K6187l7881L4419O2310m5564q4618j4737M9354J4186q2877k5508
12332f5551K276J9582n781J3814M7944m9901j4024O1355Q3761j0651J0541k3511
12320F9854k2440j9930R522l918l7374K04K487O3320J1681N834j3488o2892q6862
12307h4002j13728L3315M2691j5247O4101L5411M8890K2933P445p4911m919r895
12295d7916O0217J07235o9628l0760K8971n1661m2002n2903j5603m7941J166P6004
12283h4821Q1980L0337j8892J3716K3851L2489m2763q4953J0250M6363j3989L7333
$$ plain form
12271 30901 61195 71949 118895 46761 108262 108063 76122 15144 1520 -15045 -48885 7212
12259 7212 56618 8161 -17824 -71217 -81049 -35486 19581 -18216 -11449 -29205 -71256 -68208
12247 -68208 23775 92405 71397 12484 9136 87116 57402 11661 -39685 -41531 -79897 -122170
12235 -122170 -56636 -22196 16761 31093 40945 28990 60388 109690 91468 50793 55896 100071
12223 100071 99240 51908 -30353 9716 2074 14293 35472 59316 114490 62656 19392 30410
12211 30410 142 -9802 -11292 -119886 -166373 -127754 554 52735 4315 16580 60542 55653
12199 55653 -7415 610 40999 112951 123522 81181 59228 23614 59477 28069 -57318 -51423
12187 -51423 1430 26194 73757 80336 25378 -57495 35943 111608 -7501 -135672 -215852
$$ packed form
12271C0901L0294J0754M6946p2134O1501j99l1941o0978j3624j6565l3840N6097
12259G212M9406m8457k5985n3393r832M5563N5067l7797O767j7756m2051L048
12247f8208R1983O8630k1008n8913l348P7980k9714m5741n1346j846l8366m2273
12235a22170O5534L4440L8957J4332R852j1955L1398M9302j8222m0675N103M4175
12223A00071q31m7332q2261M0069p642J2219K1179K3844N5174n1834m3264J1018
12211C0410l0268r944j490j08594m6487L8619J28308N2181m8420J2265M3962m889
12199E5653o3068Q025M0389P1952J0571m2341k1953l5614L5863l1408q5387N895
12187e1423N2853K4764M7563O579n4958q2873R3438P5665j19109j28171q0180
$$ plain form
12176 -215852 -173052 -113469 -46096 -8684 -67819 -69761 -83073 -120211 -62004 -39526 11662 28183
12164 28183 55866 97921 84855 65480 75081 58150 -11302 -98463 -58082 59737 61835 95325
12152 95325 113213 158630 179819 175861 89344 62332 26537 28457 65056 15832 -7207 45975
12140 45975 17104 53338 88345 40305 8385 -81707 -91392 156 87574 102303 106396 25860
12128 25860 -16499 -39637 -46119 -43573 -27302 29903 86185 150011 237250 168661 77462 52030
12116 52030 42586 20138 -23677 -27740 -65155 -27464 7474 -41265 -123483 -36824 322 31842
12104 31842 19048 -15203 -82645 -107880 -96295 -49957 6766 18875 -39227 -81900 -148454 -184889
12092 -184889 -174643 -155947 -100845 -26617 15340 25006 56496 86170 77856 14103 -34903 -31436
$$ packed form
12176b15852M2800N9583O7373L7412n9135j942j3312l7138N8207K2478N1188J6521
12164B8183K7683M2055j3066j9375R601j6931o9452q7161M0381J17819K098L3490
12152I5325J7888M5417K1189l958q6517k7012l5795J920L6599m9224k3039N3182
12140D5975k8871L6234L5007m8040l1920r0092r685R1548Q7418J4729M093q0536
12128B5860m2359k3138o482K546J6271N7205N6282O3826Q7239o8589r1199k5432
12116E2030r444k2448m3815m063l7415L7691L4938m8739q2218Q6659L7146L1520
12104C1842j2794l4251o7442k5235J1585M6338N6723J2109n8102m2673o6554l6435
12092a84889J0246J8696N5102P4228M1957R666L1490K9674q314o3753m9006L467
$$ plain form
12080 -31436 -12327 -24212 -30535 -38960 -1614 -29191 -100500 -142650 -112150 -57003 -11826 -25053
12068 -25053 4740 -5223 -66648 -134018 -55421 18805 4761 -85170 -125899 -117369 -86266 -36322
12056 -36322 -43052 -72602 -47605 -18766 25535 -6777 2268 36133 115835 255303 244488 125157
12044 125157 51763 56662 58034 77839 33708 -39719 47827 79889 -19606 -58217 -15948 -58335
12032 -58335 -135070 -114264 -136997 -145151 -84764 -51639 -21558 6086 52140 39826 102447 114432
12020 114432 89949 -32772 -53603 -44634 34698 59455 95212 111609 104400 78908 109252 90668
12008 90668 -5360 9663 112670 80906 77260 134065 99448 67864 127481 86427 98749 -17195
11996 -17195 -44667 -99552 -47902 31889 -33276 -103023 -96351 1294 71168 85843 71839 45960
$$ packed form
12080c1436J9109j1885o323q425L7346k7577p1309m2150L0500N5147M5177j3227
12068b5053K9793r963o1425o7370P8597P4226j4044q9931m0729Q530L1103M9944
12056c6322o730k9550K4997K8839M4301l2312R045L3865P9702J39468j0815j19331
12044A25157p3394M899J372J9805m4131p3427Q7546L2062r9495l8611M2269m2387
12032e8335p6735K0806k2733q154O0387L3125L0081K7644M6054j2314O2621J1985
12020A14432k4483j22721k0831Q969P9332K4757L5757J6397p209k5492L0344j8584
12008I0668r6028J5023J03007l1764l646N6805l4617l1584N9617m1054J2322j15944
11996a7195k7472n4885N1650P9791o5165o9747O672R7645O9874J4675j4004k5879
$$ plain form
11984 45960 140 -36772 -36319 -38127 -72152 -111232 -128636 -74910 -50670 -17850 -14534 19779
11972 19779 54368 65986 82117 1435 -81764 -105869 -64396 -64533 -103847 -103743 -187078 -163137
11960 -163137 -22596 117649 150553 106838 7362 -17056 30460 102286 90022 130672 121867
11949 121867 48922 -39473 -119529 -146714 -70771 -5578 -27063 -54827 -26268 -56434 -24109
11938 -24109 -30130 -52621 -74352 -52947 -105666 -71616 -66791 -121884 -67534 24198 28554 -52990
11926 -52990 -73658 -48244 -59878 -111972 -218041 -267870 -158736 -33802 36535 58585 56866
11915 56866 123857 50783 57119 50180 49446 -7155 -15799 75670 158961 176513 41617 -113781
11903 -113781 -94537 -47906 -9730 -18152 10115 -31728 -68639 -80670 -55942 -55830 -60502 -2443
$$ packed form
11984D5960m5820l6912M53j808l4025l9080j7404N3726K4240L2820L316L4313
11972A9779L4589J1618J6131q0682q3199k4105M1473j37l9314J04q3335K3941
11960a63137J40541J40245L2904m3715r9476k4418M7516P1826j2264M0650q805
11949A21867p2945q8395q0056k7185P5943O5193k1485k7764K8559l0166L2325
11938b4109o021k2491k1731K1405n2719L4050M825n5093N4350R1732M356q1544
11926e2990k0668K5414j1634n2094j06069m9829J09134J24934P0337K2050j719
11915E6866O6991p3074O336o939p34n6601q644R1469Q3291J7552j34896j55398
11903a13781J9244M6631L8176q422K8267m1843l6911j2031K4728J12m672N8059
$$ plain form
11891 -2443 27574 78395 114142 96839 76185 65250 11022 -21972 158097 225412 109438
11880 109438 13880 -45942 -94276 -57632 -66415 -84975 -54179 19999 89281 95824 89306 14724
11868 14724 -30193 18056 -57292 -55853 -14018 -36494 -113023 -69578 -13064 4009 9845 -26713
11856 -26713 -1509 -7426 9673 -20898 38949 95397 23575 -45075 -85756 -110753 -22344 22111
11844 22111 -37079 -68784 -97949 -95158 -28051 -48948 -113009 -98263 -74147 -47398 49467 133995
11832 133995 38180 -93989 -92184 18297 92590 59815 27906 94081 25029 -24899 -33978
11821 -33978 -29549 -37318 247 -10284 7527 50885 24733 -20265 -51296 -87530 -119412 -22738
11809 -22738 115067 68070 -4803 -118456 -156068 -117781 -14583 -8966 -27140 -4072 -18638
$$ packed form
11891b443L0017N0821L5747j7303k0654j0935n4228l2994J80069O7315j15974
11880A09438r5558n9822m8334L6644q783j8560L0796P4178O9282O543o518p4582
11868A4724m4917M8249p5348J439M1835k2476p6529M3445N6514J7073N836l6558
11856b6713K5204n917J7099l0571N9847N6448p1822o8650m0681k4997Q8409M4455
11844B2111n9190l1705k9165K791O7107k0897o4061J4746K4116K6749R6865Q4528
11832A33995r5815j32169J805J10481P4293l2775l1909O6175o9052m9928r079
11821c3978M429p769L7565j0531J7811M3358k6152m4998l1031l6234l1882R6674
11809b2738J37805m6997p2873j13653l7612L8287J03198N617j8174K3068j4566
$$ plain form
11798 -18638 -11413 9605 2715 47405 28570 10970 -79972 -119966 -54119 -117351 -167732 -123061
11786 -123061 5372 102112 80252 85885 84664 110026 94958 4487 -22503 -36233 55049 97387
11774 97387 124319 171072 155823 128138 151490 35877 -39160 -144355 -114521 -43115 7456
11763 7456 8735 11662 34418 12420 25346 -1028 -39614 -68612 31644 -37398 -10104 127852
11751 127852 101847 -58633 -86604 -11562 58622 64533 79437 72226 156283 67262 35763 61961
11739 61961 -41062 -98963 -110203 -54117 749 32512 32937 6826 -25564 -63302 -21108 25127
11727 25127 -486 48198 61588 7476 -3404 -58285 -107913 -110490 -108112 -140703 -132274 -131209
11715 -131209 -120117 -80010 -47700 -100796 -66787 -26654 11705 3239 36588 104203 54102 -10004
$$ packed form
11798a8638P225K1018o890M4690j8835j7600r0942l9994O5847o3232n0381M4671
11786a23061J28433R6740k1860N633j221K5362j5068r0471k6990j3730R1282M2338
11774I7387K6932M6753j5249k7685K3352j15613p5037j05195K9834P1406N0571
11763G456J279K927K2756k1998J2926k6374l8586k8998J00256o9042K7294J37956
11751A27852k6005j60480k7971P5042P0184N911J4904p211Q4057q9021l1499K6198
11739F1961j03023n7901j1240N6086N4866L1763M25k6111l2390l7738M2194M6235
11727B5127k5613M8684J3390n4112j0880n4881m9628k577K378l2591Q429J065
11715a31209J1092M0107L2310n3096L4009M0133L8359q466L3349O7615n0101o4106
$$ plain form
11703 -10004 37614 71004 89965 31316 41332 110557 114223 110175 89054 -101317 -178188 -126299
11691 -126299 -79780 -86973 -112842 -41504 83680 90137 49213 -1596 40978 83694 170826 219637
11679 219637 141898 152012 121828 46215 56449 80853 20188 27997 -85101 -184039 -163943
11668 -163943 -125722 -69532 -32860 -25897 -42335 -78335 -20852 -12001 -27243 31584 64196 -30673
11656 -30673 -50885 -11189 31480 128755 105956 -2544 -48909 -74822 -78587 52081 29098
11645 29098 25868 71174 47707 3423 64338 21290 11841 -14219 2214 -58161 -39614 -13503
11633 -13503 42536 18794 5911 -6301 -60150 -47043 36739 65069 80103 98432 40199 -4029
11621 -4029 55380 94852 71118 46482 20383 -402 20786 -97933 -55268 16480 53738 57294
$$ packed form
11703a0004M7618L3390J8961n8649J0016O9225L666m048k1121j90371p6871N1889
11691a26299M6519p193k5869P1338J25184O457m0924n0809M2574M2716Q7132M8811
11679B19637p7739J0114l0184p5613J0234K4404o0665P809j13098r8938K0096
11668a63943L8221N6190L6672O963j6438l6000N7483Q851j5242N8827L2612r4869
11656c0673k0212L9696M2669R7275k2799j08500m6365k5913l765J30668k2983
11645B9098l230M5306k3467m4284O0915m3048r449k6060J6433o0375J8547K6111
11633a3503N6039k3742j2883j2212n3849J3107Q3782K8330J5034J8329n8233m4228
11621d029N9409L9472k3734k4636k6099k0785K1188j18719M2665P1748L7258L556
$$ plain form
11609 57294 65823 105420 97059 68668 -38942 -16045 1918 -107110 -85664 12997 44196 48138
11597 48138 30013 84896 -11902 -17531 19359 12020 -38204 -58989 -41621 -29899 41181 75327
11585 75327 34515 -1520 26058 -38182 39684 91547 -75340 -122049 -37458 45274 5699
11574 5699 50183 97676 82698 50182 11575 -39224 -44504 -61221 -64422 36278 117701 74338
11562 74338 30280 27262 77464 29841 -15295 -44675 -154694 -155221 -46128 -4633 -14493 34625
11550 34625 63083 35294 -47204 -4770 20038 21823 -21669 -27728 -55319 -54649 -47570 -16838 -39682
11537 -39682 -10258 30067 36193 72123 73393 33885 68520 44537 15094 57328 52498 -37316
11525 -37316 -36379 73910 63579 -29042 -31645 -36044 41953 -10889 -84675 -129600 -54191 42934
$$ packed form
11609E7294Q529L9597q361k8391j07610K2897J7963j09028K1446R8661L1199L942
11597D8138j8125N4883r6798n629L6890p339n0224k0785J7368J1722P1080L4146
11585G5327m0812l6035K7578o4240P7866N1863j66887m6709Q4591Q2732l9575
11574E699M4484M7493j4978l2516l8607n0799n280j6717l201J00700Q1423m3363
11562G4338m4058l018N0202m7623m5136k9380j10019n27J09093M1495r860M9118
11550C4625K8458k7789q2498M2434K4808J785m3492o059k7591O70P079L0732k2844
11537c9682K9424M0325O126L5930J270l9508L4635k3983k9443M2234m830q9814
11525c7316R37J10289j0331r2621k603m399P7997n2842p3786m4925P5409R7125
$$ plain form
11513 42934 69376 -89389 -169616 -128948 -21192 73401 92855 156473 110020 120132 124410
11502 124410 94705 71669 -2143 -21370 -27221 -11280 -17034 -51637 -7674 2990 -75709 -32412
11490 -32412 -5090 -22473 -81993 -99716 -103913 -92112 -72988 -43960 -97441 -57379 -63549 -51896
11478 -51896 -21248 -61767 -16963 79471 154206 128400 34453 -49523 -68939 -43607 -20708 -36526
11466 -36526 -85995 -90432 -84855 -119739 -63953 -42688 -34072 -33154 -3360 11434 -4175 -70839 -54607
11453 -54607 5744 14730 35615 79450 -4466 -10794 -71963 -36569 10843 -29034 -42306 6317
11441 6317 15352 1608 -48771 -47211 -40148 11430 26581 19968 -2275 -99357 -82694 137942
11429 137942 154878 92527 92347 105882 82453 11947 -39134 -20328 11600 85727 101856 130881
$$ packed form
11513D2934K6442j58765q0227M0668J07756R4593J9454O3618m6453J0112M278
11502A24410k9705k3036p3812j9227n851J5941n754l4603M3963J0664p8699M3297
11490c2412K7322j7383n9520j7723m197J1801J9124K9028n3481M0062o170J1653
11478e1896L0648m0519M4804R6434P4735k5806r3947q3976j9416K5332K2899j5818
11466c6526m9469m437N577l4884N5786K1265Q616R18K9794J4794j5609o6664J6232
11453e4607O0351Q986K0885M3835q3916o328o1169L5394M7412l9877j3272M8623
11441F317R035j3744n0379J560P063N1578J5151o613k2243r7082J6663K20636
11429A37942J6936o2351j80J3535k3429p0506n1081J8806L1928P4127J6129K9025
$$ plain form
11417 130881 86342 44703 29028 11225 37830 104071 180507 249460 241399 140702 54026
11406 54026 9962 -35537 -80150 -31084 -36435 -14551 -81423 -107744 -48334 -49868 -69824 -32429
11394 -32429 17237 2489 14616 109965 163542 152854 45272 4107 126879 124593 32995
11383 32995 31083 1564 -27771 -43859 1521 18342 1697 -42220 -5608 87044 110041 84255
11371 84255 -45002 -54025 -2038 12974 11792 24105 15117 1272 -87919 -99368 -41997 -65341
11359 -65341 -133925 -136499 -80222 -74573 -88527 -63731 -52796 -39367 11101 41444 34069 3648
11347 3648 -89550 -103883 -40236 -49698 -43896 21662 -33809 -62644 -47804 -11234 26642 -18952
11335 -18952 -32826 21541 53751 59317 151489 206174 119046 -71108 -149870 -140878 -74744 -76355
$$ packed form
11417A30881m4539m1639j5675j7803K6605O6241P6436O8953q061j00697q6676
11406E4026m4064m5499m4613M9066n351K1884o6872k6321N9410j534j9956L7395
11394c2429M9666j4748J2127R5349N3577j0688j07582m1165J22772k286r1598
11383C2995j912k9519k9335j6088M5380J6821j6645m3917L6612R2652K2997k5786
11371H4255j29257r023N1987J5012j182J2313q988j3845q9191j1449N7371k3344
11359f5341o8584k574N6277N649j3954K4796J0935J3429N0468L0343p375l0421
11347C648r3198j4333O3647r462N802O5558n5471k8835J4840L6570L7876m5594
11335a8952j3874N4367L2210N566R2172N4685q7128j90154p8762Q992O6134j611
$$ plain form
11323 -76355 -103664 -35537 -30468 -35773 32577 -10846 -7991 22485 68944 125740 139500 162887
11311 162887 156644 68326 25941 -1042 999 -16490 9072 61515 47036 10967 -6003 -57606
11299 -57606 -56153 3371 18154 8670 74444 43011 -6732 -469 -4872 -72422 -137633 -98444
11287 -98444 1950 56358 -76407 -101804 -39836 21112 71119 59363 -23138 -86828 10985
11276 10985 39558 -14720 21318 79310 116251 127153 148995 136513 80631 140854 169386 151976
11264 151976 84020 -96910 -83616 -75945 -120994 -102493 -90324 -80988 -183131 -236567 -125870
11253 -125870 -48813 -50155 -12942 -10995 -881 31632 -50457 -114727 -88655 -98127 -105138 24691
11241 24691 74051 94104 41555 -8200 -15796 60251 43987 -15078 -58153 -15382 35725 30741
$$ packed form
11323g6355k7309O8127N069n305O8350m3423K855L0476M6459N6796J3760K3387
11311A62887o243q8318m2385k6983K041j7489K5562N2443j4479l6069j6970n1603
11299e7606J453N9524J4783r484O5774l1433m9743O263m403o7550o5211L9189
11287i8444J00394N4408j32765k5397O1968O0948N0007j1756q2501o3690R7813
11276A0985K8573n4278L6038N7992L6941J0902K1842j2482n5882O0223K8532j7410
11264A51976o7956j80930J3294P671m5049J8501J2169R336j02143n3436J10697
11253a25870P7057j342L7213J947J0114L2513q2089o4270K6072r472p011J29829
11241B4691M9360K0053n2549m9755p596P6047j6264n9065m3075M2771N1107m984
$$ plain form
11229 30741 48333 35086 -7976 -84437 -35820 24768 -1624 24207 88020 65639 86314 104637
11217 104637 133507 192135 195378 126281 63002 25903 -21972 -67535 -79823 -42315 -60369 -23962
11205 -23962 69374 46780 -48044 -102000 -64226 -27566 -30545 -12657 -31391 -4483 41453 56445
11193 56445 38287 10585 16363 27691 2317 26439 108060 77403 71632 100703 131535 101646
11181 101646 62256 14578 51861 18236 25124 77587 74108 69506 123495 172537 118344 166193
11169 166193 193449 118213 91537 130446 114144 16929 -1533 -4473 10988 47151 -31805 22085
11157 22085 79149 55859 52882 69122 53123 -7966 4738 -9886 16030 -13525 -61673 -34924
11145 -34924 -11485 -33062 -31397 -77779 -20606 69896 72442 103531 101984 153296 245916 234827
$$ packed form
11229C0741J7592j3247m3062p6461M8617O0588k6392K5831O3813k2381K0675J8323
11217A04637K8870N8628L243o9097o3279l7099m7875m5563j2288L7508j8054L6407
11205b3962R3336k2594r4824n3956L7774L6660k979J7888j8734K6908M5936J4992
11193E6445j8158k7702N778J1328k5374K4122Q1621l0657n771K9071L0832k9889
11181A01646l9390m7678L7283l3625O888N2463l479m602N3989M9042n4193M7849
11169A66193K7256p5236k6676L8909j6302r7215j8462k940J5461L6163p8956N3890
11157B2085N7064k3290k977J6240j5999o1089J2704j4624K5916k9555m8148K6749
11145c4924K3439k1577J665m6382N7173R0502K546L1089j547N1312R2620j1089
$$ plain form
11133 234827 196353 192382 120513 51486 -2950 20040 59347 68548 54889 -16983 -2407 41073
11121 41073 96780 109492 116575 104259 32846 -15292 -67663 -36863 -35962 -33085 33755 70920
11109 70920 171462 165323 128019 147672 94721 20963 11982 103568 150447 60335 27043 65482
11097 65482 81936 112386 157522 83968 35095 -13104 -14856 10293 -19328 10772 4328 47700
11085 47700 16956 31304 20621 12325 98618 133205 69264 6461 109674 136724 61363 40043
11073 40043 19088 -68794 -49959 20491 66468 163452 238551 201539 149509 36984 -23784
11062 -23784 -25939 -8899 10634 17337 41517 79725 79977 115285 37155 9762 -2669 -20059
11050 -20059 -10253 -55342 -751 89374 65885 64709 69259 80823 51593 -11497 14249 1564
$$ packed form
11133B34827l8474l971p1869o9027n4436K2990L9307R201j3659p1872J4576M3480
11121D1073N5707J2712P083j2316p1413m8138n2371L0800R01K877O6840L7165
11109G0920J00542o139l7304J9653n2951p3758q981R1586M6879r0112l3292L8439
11097F5482J6454L0450M5136p3554m8873m8199j752K5149k9621L0100o444M3372
11085D7700l0744J4348j0683q296Q6293L4587o3941o2803J03213K7050p5361k1320
11073D0043k0955q7882J8835P0450M5977R6984P5099l7012n2030j12525o0768
11062b3784k155J7040J9533O703K4180L8208K52L5308p8130k7393j2431j7390
11050b0059R806m5089N4591R0125k3489j176M550J1564k9230o3090K5746j2685
$$ plain form
11038 1564 174 39138 38719 -7029 -123967 -130326 -130645 -62374 -3763 36790 21900 45850 29146
11025 29146 39228 56732 67183 40058 -554 202 -5930 -12098 52215 64383 44213 96436
11013 96436 81273 15511 35438 95216 49757 7695 -2499 50458 132394 150647 221482 206070
11001 206070 187235 179927 154679 182599 164157 122633 100343 187795 248183 202677 163012 151999
10989 151999 153490 66526 97108 61606 48591 79039 40320 -81504 -83718 35567 45052 20008
10977 20008 -12039 36076 47987 98879 71223 -24473 -105645 -103104 -3083 63786 31478 143350
10965 143350 177414 110356 104795 20971 -54087 -44949 11558 11376 35258 54473 41244 -17943
10953 -17943 -7331 -8321 18339 1540 57401 66876 42395 -9280 -81993 -85762 -59597 1806
$$ packed form
11038A564j390L8964m19m5748j16938o359l19O8271N8611M0553j4890K3950j6704
11025B9146J0082J7504J0451k7125m0612P56o132o168O4313J2168k0170N2223
11013I6436j5163o5762J9927N9778m5459m2062j0194N2957Q1936J8253P0835j5412
11001B06070j8835p308k5248K7920j8442m1524k2290Q7452O0388m5506l9665j1013
10989A51999J491q6964L0582l5502j3015L0448l8719j21824k214J19285R485k5044
10977B0008l2047M8115J1911N0892k7656r5696q1172K541J00021O6869l2308J11872
10965A43350L4064o7058n561q3824p5058R138N6507j82K3882J9215j3229n9187
10953a7943J0612r90K6660j6799N5861R475k4481n1675p2713l769K6165O1403
$$ plain form
10941 1806 38646 143326 107274 92260 35339 21642 69767 -29097 -84442 -35802 63275 57676
10929 57676 58557 49004 -43170 -172528 -152199 -27414 4810 -59875 -58037 -9263 15057 64436
10917 64436 70465 47286 58694 73768 9256 -55451 98271 225813 165787 140709 162947
10906 162947 124372 76582 32625 49318 122107 130553 111307 58891 11822 17523 192967 210583
10894 210583 176849 17685 8099 69401 130340 23798 59456 122165 96354 105209 125583
10883 125583 45830 16625 84405 108964 105576 123001 174919 113076 -31940 -55859 5652
10872 5652 71708 186112 211930 189109 219372 115747 138659 133597 111408 105490 133688 99759
10860 99759 48969 -21920 -63375 32376 107453 154418 120012 91533 132287 125076 121778 67584
$$ packed form
10941A806L6840J04680l6052j5014n6921j3697M8125r8864n5345M8640R9077n599
10929E7676Q81r553r2174j29358K0329J24785L2224o4685J838M8774K4320M9379
10917F4436O029k3179J1408J5074o4512o4707J53722J27542o0026k5078K2238
10906A62947l8575m7790m3957J6693P2789Q446j9246n2416m7069N701J75444J7616
10894B10583l3734j59164r586O1302O0939j06542L5658O2709k5811Q855K0374
10883A25583p9753k9205O7780K4559l388J7425N1918o1843j45016k3919O1511
10872E652O6056J14404K5818k2821L0263j03625K2912n062k2189n918K8198l3929
10860I9759n0790p0889m1455R5751P5077M6965l4406k8479M0754p211l298n4194
$$ plain form
10848 67584 136995 171615 82508 23367 6307 38597 -16010 -74389 -14249 35151 55090 50149
10836 50149 132459 155189 172200 145828 118040 98773 82965 156369 116958 96660 137454 140832
10824 140832 98693 162152 232604 236710 185505 235015 331221 365018 305464 360697 439071 485962
10812 485962 600719 700962 785558 956067 1124382 1472393 1837778 2090504 2314779 2543386
10802 2543386 2784847 2812439 2616874 2421072 2229045 1962063 1668208 1314549 984255 672267
10792 672267 576544 550237 474868 445356 411159 332795 293486 304670 258951 216758 168529
10781 168529 296359 414490 453180 441083 393227 343055 296097 260791 188399 136838 119653
10770 119653 80923 67359 134325 179763 197167 166735 145503 197531 176253 68174 131198
$$ packed form
10848F7584O9411L4620q9107n9141j7060L2290n4607n8379O0140M9400J9939m941
10836E0149Q2310K2730J7011k6372k7788j9267j5808P3404l9411k0298M0794L378
10824A40832m2139O3459P0452M106n1205M9510R6206L3797n9554N5233P8374M6891
10812D85962J14757J00243Q4596J70509J68315L48011L65385K52726K24275K28607
10802B543386K41461K7592j95565j95802j92027k66982k93855l53659l30294l11988
10792F72267r5723k6307p5369k9512l4197p8364l9309J1184m5719m2193m8229
10781A68529J27830J18131L8690j2097m7856n0172m6958l5306p2392n1561j7185
10770A19653l8730j3564O6966M5438J7404l0432k1232N2028k1278j08079O3024
$$ plain form
10759 131198 193836 162770 190633 186264 96469 25420 32081 23341 79646 148425 210974 207429
10747 207429 208464 157122 115084 149738 88152 47093 45346 35958 43809 49071 131525 137638 76117
10734 76117 -40080 -74800 -53635 1985 52885 87517 89973 84273 138229 59128 18064 70150
10722 70150 97479 91628 17262 38427 115149 118961 54798 122970 124525 133530 73140 43297
10710 43297 70478 26182 -23357 -16964 29300 11890 15496 -7137 59866 86839 11104 19838
10698 19838 19562 -24859 -28186 89528 99376 -33364 -74729 -15625 15586 64534 5550 -43986
10686 -43986 -3860 63713 40049 -33572 -117272 -36654 45461 151416 200994 123459 136827
10675 136827 176867 212087 168542 98910 116558 81233 17161 38528 117116 165484 161719 169189
$$ packed form
10759A31198O2638l1066K7863m369q9795p1049O661q740N6305O8779O2549l545
10747B07429J035n1342m2038L4654o1586m1059j747r388P851N262Q2454O113o1521
10734G6117j16197l4720K1165N5620N0900L4632K456n700N3956p9101m1064N2086
10722G0150K7329n851p4366K1165P6722L812o4163O8172J555R005o0390k9843
10710D3297K7181m4296m9539O393M6264j7410L606k2633O7003K6973p5735Q734
10698A9838k76m4421l327J17714R848j32740m1365N9104L1211M8948n8984m9536
10686d3986M0126O7573k3664p3621q3700Q0618Q2115J05955M9578p7535J3368
10675A36827M0040L5220m3545o9632J7648l5325o4072K1367P8588M8368l765P470
$$ plain form
10663 169189 243923 331268 342085 341500 405771 561264 618975 597311 516661 520305 486946 460312
10651 460312 433029 370874 345858 330369 355767 349568 341723 339758 301002 267726 264575 230248
10639 230248 245133 217428 198773 236346 267678 253037 164010 164159 244590 271283 289560 264734
10627 264734 268250 187632 171160 195238 161388 81069 -5118 5437 88953 179641 110573 98465
10615 98465 87078 91757 76099 94663 127676 140650 195082 195539 206678 224136 179860 157511
10603 157511 203329 259933 305504 246968 219753 281254 283397 253433 247598 203816 134393 67955
10591 67955 76389 169515 149516 86464 62311 67665 88205 105810 18443 -544 68454 72277
10579 72277 64567 89678 23749 -32556 4951 36125 8798 -28516 10497 -1468 13109 -41586
$$ packed form
10663A69189P4734Q7345J0817n85O4271J55493N7711k1664q0650L644l3359k6634
10651D60312k7283o2155k5016j5489K5398o199p845j965l8756l3276l151l4327
10639B30248J4885k7705j8655L7573L1332j4641q9027J49Q0431K6693J8277k4826
10627B64734L516q0618j6472K4078l3850q0319q6187J0555Q3516R0688o9068j2108
10615I8465j1387M679j5658J8564L3013J2974N4432M57J1139J7458m4276k2349
10603A57511M5818N6604M5571n8536k7215O1501K143k9964n835m3782o9423o6438
10591F7955Q434R3126j9999o3052k4153N354K0540J7605q7367j8987O8998L823
10579G2277p710K5111o5929n6305L7507L1174k7327l7314L9013j1965J4577n4695
$$ plain form
10567 -41586 -72299 -130506 -93364 -101605 -112016 -92205 -58813 -79011 -84776 -28677 33922 46595
10555 46595 122381 291588 319278 284024 297975 290616 279298 273205 284633 256635 250136 292418
10543 292418 363768 337085 298468 407888 456422 432631 409374 399919 358283 256372 193980
10532 193980 169220 137823 181180 221383 159362 256284 293925 226518 244004 347002 477089
10521 477089 570203 553627 450653 417871 434225 479912 540605 528522 503433 565947 552313
10510 552313 507142 505497 521296 605243 641678 605861 604600 488674 525712 550075 571931 583841
10498 583841 509177 491298 486782 486873 406188 419187 461710 535978 660863 670199 728431 754692
10486 754692 741694 764486 788587 845147 871768 863581 886845 934604 924680 865067 770229 771110
$$ packed form
10567d1586l0713n8207L7142q241j0411J9811L3392k0198n765N6099O2599J2673
10555D6595P5786J69207K7690l5254J3951p359j1318o093J1428k7998o499M2282
10543B92418P1350k6683l8617J09420M8534k3791k3257r455m1636j01911o2392
10532A93980k4760l1397M3357M0203o2021R6922L7641o7407J7486J02998J30087
10521D77089R3114j6576j02974l2782J6354M5687O0693j2083k5089O2514j3634
10510E52313m5171j645J5799Q3947L6435l5817j261j15926L7038K4363K1856J1910
10498E83841p4664j7879m516R1q0685J2999M2523P4268J24885R336N8232K6261
10486G54692j2998K2792K4101N6560K6621q187K3264M7759r924n9613r4838Q81
$$ plain form
10474 771110 757436 740202 807473 889710 1071453 1112562 1157788 1129137 1101867 1195556 1129805
10463 1129805 1182283 1177263 1187242 1220537 1309211 1351381 1408066 1437234 1521937 1637883 1687478
10452 1687478 1819102 1880815 1987923 2139922 2224990 2355330 2561931 2777932 3038539 3307030
10442 3307030 3575274 4037552 4466528 4970272 5588342 6266271 6932177 7476783 7781457
10433 7781457 7891995 8073702 8264317 8507294 8940746 9619689 10510670 11688254 13120291
10424 13120291 14780767 16696985 18818407 21051627 23481964 26173507 29278562 33184305
10416 33184305 38498668 46102781 57383456 74188495 98720804 132803795 176621264
10409 176621264 228198426 284657728 341680633 395556570 441805623 475017851 491362780
$$ packed form
10474G71110j3674j7234O7271Q2237J81743M1109M5226k8651k7270R3689o5751
10463A129805N2478n020R979L3295Q8674M2170N6685K9168Q4703J15946M9595
10452A687478J31624O1713J07108J51999Q5068J30340K06601K16001K60607K68491
10442C307030K68244M62278M28976N03744O18070O77929O65906N44606L04674
10433G781457J10538J81707J90615K42977M33452O78943Q90981J177584J432037
10424A3120291J660476J916218K121422K233220K430337K691543L105055L905743
10416C3184305N314363P604113J1280675J6805039K4532309L4082991M3817469
10409A76621264N1577162N6459302N7022905N3875937M6249053L3212228J6344929
$$ plain form
10402 491362780 486720485 463614884 423892205 374221699 318038880 260780980 206084399
10395 206084399 157654832 118418617 88852066 68659032 55898292 48671974 45411088
10388 45411088 45088769 46943260 50151362 54151469 58273524 62022212 64810699 66298384
10380 66298384 65946851 63493430 59317719 53713017 47228391 40380709 33548306 27183372
10372 27183372 21642991 17061521 13497964 10872517 9058411 7790786 6878684 6172197
10364 6172197 5680282 5263237 4858497 4525143 4212915 3946788 3666640 3367930 3141244
10355 3141244 2885662 2727737 2557727 2422137 2325272 2204346 2162484 2023877 1879395 1817623
10345 1817623 1789426 1817704 1806307 1790303 1817124 1946097 2043434 2089657 2093482 2041939 1979290
$$ packed form
10402D91362780m642295k3105601l9722679m9670506n6182819n7257900n4696581
10395B06084399m8429567l9236215k9566551k0193034j2760740p226318l260886
10388D5411088l22319J854491L208102M000107M122055L748688K788487J487685
10380F6298384l51533k453421m175711n604702o484626o847682o832403o364934
10372B7183372n540381m581470l563557k625447j814106j267625r12102p06487
10364F172197m91915m17045m04740l33354l12228k66127k80148k98710k26686
10355C141244k55582j57925j70010j35590r6865j20926m1862j38607j44482o1772
10345A817623k8197K8278j1397j6004K6821J28973R7337M6223L825n1543o2649
$$ plain form
10334 1979290 1864546 1670288 1545983 1407374 1304811 1199841 1074563 1040230 951590 822228
10324 822228 744420 760988 826808 868888 838144 886026 861509 796722 771227 725970 665549
10313 665549 649038 619951 594449 550041 570030 570362 634773 656944 585353 494944 507351 486040
10301 486040 440410 388338 369816 377807 379963 330391 323428 215199 203941 264783 316140 315297
10289 315297 325380 304448 280528 325620 305942 251250 257315 311011 362018 433633 500523 489331
10277 489331 450938 399690 389721 371085 348885 344166 282734 275480 271347 205105 243413 354334
10265 354334 381115 303362 211193 240750 253524 249663 254522 231928 194286 73488 -49904
10254 -49904 -66737 44405 135263 233433 269881 311920 416553 428054 323293 286889 282089
$$ packed form
10334A979290j14744j94258j24305j38609j02563j04970j25278l4333q8640j29362
10324H22228p7808J6568O5820M2080l0744M7882k4517o4787k5495m5257o0421
10313F65549j6511k9087k5502m4408J9989L32O4411K2171p1591r0409J2407k1311
10301D86040m5630n2072j8522P991K156m9572o963j08229j1258O0842N1357q43
10289C15297J0083k0932k3920M5092j9678n4692O065N3696N1007P1615O6890j1192
10277D89331l8393n1248r969j8636k2200m719o1432p254m133o6242L8308J10921
10265C54334K6781p7753r2169K9557J2774l861M859k2594l7642j20798j23392
10254d9904j6833J11142R0858R8170L6448M2039J04633J1501j04761l6404m800
$$ plain form
10243 282089 287689 258478 276742 289087 374737 393213 365463 386263 355167 333982 241006 289128
10231 289128 306425 284426 225914 196926 257556 308422 287978 320054 389277 429906 340033
10220 340033 213361 181021 128827 127744 115101 197996 274191 265851 271862 302055 308309 277575
10208 277575 262083 218544 148519 53473 37882 143891 231897 314796 276742 179559 137616
10197 137616 61690 62902 27592 80138 128104 102856 132732 93706 95699 113769 45999 30522
10185 30522 -6256 -44410 -126158 -170302 -101237 -67490 -10593 15973 -4161 1831 -77662 -99904
10173 -99904 -98851 -65682 -92345 -36952 21023 -5663 -118828 -144240 -58471 -43332 -103274 -102133
10161 -102133 -54805 22139 34323 -1697 -5788 -30439 50047 102619 46662 49818 36207 19153
$$ packed form
10243B82089N600k9211J8264J2345Q5650J8476k7750K0800l1096k1185r2976M8122
10231B89128J7297k1999n8512k8988O0630N0866k0444L2076O9223M0629q9873
10220C40033j26672l2340n2194j083j2643Q2895P6195q340O011L0193O254l0734
10208B77575j5492m3539p0025r5046j5591J06009Q8006Q2899l8054r7183m1943
10197A37616p5926J212l5310N2546M7966k5248K9876l9026J993J8070o7770j5477
10185C0522l6778l8154q1748m4144O9065L3747N6897K6566k0134N992p9493k2242
10173i9904J053L3169k6663N5393N7975k6686j13165k5412Q5769J5139n9942J141
10161a02133M7328P6944J2184l6020m091k4651Q0486N2572n5957L156j3611j7054
$$ plain form
10149 19153 39131 85809 74883 79000 63538 74554 66100 -12762 -31665 -26519 -10886 44788
10137 44788 8411 -58688 36905 29925 -48164 19530 97626 103291 77475 91819 164682 155843
10125 155843 153897 109358 53751 52756 -5789 -62907 -52833 61420 82908 10600 -3260 27696
10113 27696 144585 156671 122801 51598 -5920 -12271 1794 20580 -42175 -49218 -36604 -104266
10101 -104266 -162527 -112004 -27365 71363 68652 65554 132285 154216 137502 79044 1213 -64199
10089 -64199 -52470 -5238 32821 53162 97357 108017 133116 100660 85140 62110 -32058 -90521
10077 -90521 -101219 -114457 -66988 -59270 -116293 -168543 -53645 -118568 -197521 -65269 -67147 -61262
10065 -61262 -154214 -187938 -42867 -81623 -98957 -4911 60874 29342 40259 -6482 -46707
$$ packed form
10149A9153J9978M6678j0926M117j5462J1016q454p8862j8903N146J5633N5674
10137D4788l6377o7099R5593o980p8089O7694P8096N665k5816J4344P2863q839
10125A55843j946m4539n5607r95n8545n7118J0074J14253K1488p2308j3860L0956
10113B7696J16889J2086l3870p1203n7518o351J4065J8786o2755p043J2614o7662
10101a04266n8261N0523Q4639R8728k711l098O6731K1931j6714n8458p7831o5412
10089f4199J1729M7232L8059K0341M4195J0660K5099l2456j5520k3030r4168n8463
10077i0521j0698j3238M7469P718n7023n2250J14898o4923p8953J32252j878N885
10065f1262r2952l3724J45071l8756j7334R4046O5785l1532J0917m6741m0225
$$ plain form
10054 -46707 -99361 -26425 33990 43790 22397 28241 41791 19429 77738 66358 2753 -96486
10042 -96486 -107262 -107111 -160308 -200408 -103681 -33377 -75876 -50945 48969 14367 -24786 16341
10030 16341 25885 56227 93124 57723 105725 189687 312348 363745 276949 241354 194353 94940
10018 94940 87961 154712 217898 213203 203380 111964 18804 104002 259409 431548 546745 633836
10006 633836 862031 1180780 1462785 1736322 2042749 2383096 2641063 2724091 2661338 2528054
9996 2528054 2307366 2043754 1775136 1420550 1121193 846438 575067 434098 335466 249343
9986 249343 213181 198657 204796 138492 97019 240564 384550 451177 384841 354042 295053
9975 295053 239856 268186 191567 229405 284772 302980 196960 167766 147998 86316 6115
$$ packed form
10054d6707n2654P2936O0415R800k1393N844J3550k2362N8309j1380o3605r9239
10042i6486j0776J51n3197m0100R6727P0304m2499K4931R9914l4602l9153M1127
10030A6341R544L0342L6897l5401M8002Q3962J22661N1397q6796l5595m7001r9413
10018I4940o979O6751O3186m695r823r1416r3160Q5198J55407J72139J15197Q7091
10006F33836K28195L18749K82005K73537L06427L40347K57967Q3028o2753j33284
9996B528054k20688k63612k68618l54586k99357k74755k71371j40969r8632q6123
9986B49343l6162j4524O139o6304m1473J43545J43986O6627o6336l0799n8989
9975B95053n5197K8330p6619L7838N5367J8208j06020k9194j9768o1682q0201
$$ plain form
9964 6115 -58023 -37650 -97627 -185446 -257335 -161310 -109020 -49396 -58725 -120353 -166236 -118749
9952 -118749 20506 -9926 45721 89125 120348 72725 59580 132731 187273 276647 302880
9941 302880 312566 266572 164400 136825 99775 -3027 14610 8714 -31915 -28953 -38246 -23028
9929 -23028 11796 4159 -22451 -107401 -61750 -29315 49970 54940 27342 10036 18765 -29388
9917 -29388 -46734 -44407 8935 -14210 -3464 -21449 25401 -33406 -47132 -65035 -65621 54228
9905 54228 107832 47076 -33016 -59951 28858 161933 170385 176940 227910 192135 121668 91891
9893 91891 38242 45390 62188 -24954 -81618 -117691 -141491 -177534 -127974 -114618 -158289 -245039
9881 -245039 -145145 -33671 23711 -10987 -11186 -20408 48876 118424 170613 99189 70847 95018
$$ packed form
9964F115o4138K0373n9977q7819p1889R6025N2290N9624r329o1628m5883M7487
9952a18749J39255l0432N5647M3404L1223m7623j3145P3151N4542Q9374K6233
9941C02880R686m5994j02172k7575l7050j02802J7637n896m0629K962r293J5218
9929b3028L4824p637k6610q4950M5651L2435P9285M970k7598j7306Q729m8153
9917b9388j7346K327N3342k3145J0746j7985M6850n8807j3726j7903n86J19849
9905E4228N3604o0756q0092k6935Q8809J33075Q452O555N0970l5775p0467k9777
9893I1891n3649P148J6798q7142n6664l6073k3800l6043M9560J3356m3671q6750
9881b45039R9894J11474N7382l4698j99r222O9284O9548N2189p1424k8342K4171
$$ plain form
9869 95018 39815 14557 -7474 -47361 -37875 -94186 -61653 -50847 -60798 26287 54563 1680
9857 1680 -67375 -84510 -89784 -126661 -136238 -63898 11211 16979 -13627 8283 96312 128744 78032
9844 78032 76323 118414 28954 -70068 -35107 26016 53854 26183 -40092 -81748 -112436 -57302
9832 -57302 7427 74024 155024 116688 60102 52304 35816 14042 -108053 -196456 -175931 -103188
9820 -103188 -40600 -16747 12116 70575 92611 -10783 -52500 -69799 -93199 -136904 -154115
9809 -154115 -52450 65564 77232 10222 118766 178328 161583 55001 49380 154517 130011
9798 130011 60557 68011 76931 96057 48576 65015 -1048 -3474 7687 -3233 -31 -1764 -26148
9785 -26148 8782 -41044 -36972 -38308 -73318 -125004 -202930 -150641 -87644 -67247 -52021 -17860
$$ packed form
9869I5018n5203k5258k2031l9887R486n6311L2533J0806r951Q7085K8276n2883
9857A680o9055j7135n274l6877r577P2340P5109N768l0606K1910Q8029L2432n0712
9844G8032j709M2091q9460r9022L4961O1123K7838k7671o6275m1656l0688N5134
9832e7302O4729O6597Q1000l8336n6586p798j6488k1774j22095q8403K0525P2743
9820a03188O2588K3853K8863N8459K2036j03394m1717j7299k3400m3705j7211
9809a54115J01665J18014J1668o7010J08544N9562j6745j06582n621J05137k4506
9798A30011o9454P454Q920J9126m7481J6439o6063k426J1161j0920L202j733k4384
9785b6148L4930m9826M072j336l5010n1686p7926N2289O2997K0397J5226L4161
$$ plain form
9773 -17860 49464 58977 44989 -104928 -260322 -238838 -173614 -196128 -165397 -145155 -60436 -20979
9761 -20979 34713 85403 74162 137957 122548 -7163 -43787 -6860 -66622 -145528 -117468 -62857
9749 -62857 -74132 -75216 -97677 -24990 -816 69531 110005 125092 57406 37078 -9465 -4721
9737 -4721 114767 170967 80769 37827 22431 -6767 31892 -22522 -4045 -27702 13165 73071
9725 73071 87696 202603 294464 292386 147285 12204 -14330 -61468 -91938 -148072 -151968 -60043
9713 -60043 -15067 -68446 -64776 48031 109361 93628 96143 136414 196570 162253 83324 53759
9701 53759 73416 39209 34054 100431 80638 29135 527 34951 32361 54509 70807 125075
9689 125075 48184 52158 19181 683 22044 -1850 84839 75512 16219 -110188 -112450 -14249
$$ packed form
9773a7860O7324R513j3988j49917j55394K1484O5224k2514L0731K0242Q4719L9457
9761b0979N5692N0690j1241O3795j5409j29711l6624L6927n9762p8906K8060N4611
9749f2857j1275j084k2461P2687K4174P0347M0474J5087o7686k0328m6543M744
9737d721J19488N6200r0198m2942j5396k9198L8659n4414J8477k3657M0867N9906
9725G3071J4625J14907R1861k078j45101j35081k6534m7138l0470n6134l896R1925
9713f0043M4976n3379L670J12807O1330j5733K515M0271O0156l4317p8929k9565
9701E3759J9657l4207n155O6377j9793n1503k8608L4424k590K2148J6298N4268
9689A25075p6891L974l2977j8498K1361k3894Q6689r327n9293j26407k262R8201
$$ plain form
9677 -14249 84972 191864 135391 46526 -30077 -95393 -72328 -86550 -81430 -142463 -85332 -94140
9665 -94140 -64740 -33784 -21582 -22401 -129178 -201822 -160951 -73712 -77672 -152552 -160325 -71219
9653 -71219 -54090 -98289 -104566 -32493 -47499 -68714 -149014 -181726 -218039 -163898 -146801 -115919
9641 -115919 -44032 22468 71134 81255 78818 34695 40464 91130 46052 34 -79201 -148722
9629 -148722 -193997 -148371 -66889 13257 -13887 -92237 -128754 -196859 -116358 -9123 60109
9618 60109 165867 219484 203637 188123 118993 29343 -8118 -91898 -167637 -177015 -72548 13128
9606 13128 -53386 -157270 -227487 -181955 -165847 -174779 -134063 -83174 -88005 -89532 -91649 -28420
9594 -28420 -28640 -86627 -91632 -124994 -136029 -31892 16315 29968 35245 96314 121084 85325
$$ packed form
9677a4249R9221J06892n6473q8865p6603o5316K3065j4222N120o1033N7131q808
9665i4140K9400L0956J2202q19j06777p2644M0871Q7239l960p4880p773Q9106
9653g1219J7129m4199o277P2073j5006k1215q0300l2712l6313N4141J7097L0882
9641a15919P1887O6500M8666J0121k437m4123N769N0666m5078m6018p9235o9521
9629a48722m5275M5626Q1482Q0146k7144p8350l6517o8105Q0501J07235O9232
9618F0109J05758N3617j5847j5514o9130q9650l7461q3780p5739r378J04467Q5676
9606A3128o6514j03884p0217M5532J6108q932M0716N0889m831j527k117O3229
9594b8420k20n7987n005l3362j1035J04137M8207J3653N277O1069K4770l5759
$$ plain form
9582 85325 74044 110014 116603 91190 82939 84293 16882 43055 34091 17822 -27563 -126242 -125655
9569 -125655 -161062 -131612 -126620 -68345 -56698 -34103 -40416 -39467 -35534 60561 -194 -25791 2427
9556 2427 -77091 -112671 -77493 -24138 25664 4718 -75628 -97721 -77294 -112573 -100211 -82055
9544 -82055 -83196 -79440 -60540 -37458 75887 114901 92793 81076 6903 -65696 -103170 -150132
9532 -150132 -130362 -64472 -24275 -129427 -180554 -144646 -86162 -62710 -17775 -17877 -93311 -130421
9520 -130421 -103286 -42396 12971 2015 -91241 -107747 -114648 -94562 -154948 -134252 -31787 -54817
9508 -54817 -164873 -165479 -136681 -135370 -118677 -104099 -58292 -76681 -94268 -110690 -134284 -36471
9496 -36471 9068 55426 -75985 -149326 -118909 -97685 -44206 -9604 6390 5915 -16428 -13262
$$ packed form
9582H5325j1281L5970O589k5413q251J354o7411K6173q964j6269m5385r8679N87
9569a25655l5407K9450M992N8275J1647K2595o313R49L933R6095o0755k5597K8218
9556B427p9518l5580L5178N3355M9802k0946q0346k2093K0427l5279J2362J8156
9544h2055j141L756J8900K3082J13345L9014k2108j1717p4173p2599l7474m6962
9532a50132J9770O5890M0197j05152n1127L5908N8484K3452M4935j02p5434l7110
9520a30421K7135O0890N5367j0956r3256j6506o901K0086o0386K0696J02465k3030
9508e4817j10056o06K8798J311J6693J4578M5807j8389j7587j6422k3594R7813
9496c6471M5539M6358j31411p3341L0417K1224N3479L4602J5994m75k2343L166
$$ plain form
9484 -13262 23765 96635 178558 157278 77965 15589 994 -60178 -87848 -151584 -157816 -102940
9472 -102940 -141496 -224937 -271548 -185936 -82359 49764 95123 94616 101214 86806 3167 -85120
9460 -85120 -163918 -183060 -189817 -185430 -211056 -227468 -144883 -34518 -26094 -30538 -59595 -103102
9448 -103102 -96942 -13755 32 4040 50393 55768 16080 -3829 22290 49719 44520 74003
9436 74003 99535 95286 190729 125841 50111 48070 4713 -25297 -22421 2639 84229 96438
9424 96438 101722 77241 56092 -6457 -101547 -114241 -106242 -124058 -47555 -25408 -26224 3132 -40847
9411 -40847 -11828 -3505 -37413 8296 44959 45687 31187 -24906 -41366 -110089 -81411 17454
9399 17454 -45551 -27572 -33372 -27484 -18636 -6267 838 -40171 -1598 66550 74335 82887 -12807
$$ packed form
9484a3262L7027P2870Q1923k1280p9313o2376j4595o1172k7670o3736o232N4876
9472a02940l8556q3441m6611Q5612J03577J32123M5359n07O598j4408q3639q8287
9460h5120p8798j9142o757M387k5626j6412Q2585J10365Q424m444k9057m3507
9448a03102O160Q3187J3787M008M6353N375l9688j9909K6119K7429n199K9483
9436G4003K5532m249R5443o4888p5730k041m3357l0010K876K5060Q1590J2209
9424I6438N284k4481k1149o2549r5090j2694P999j7816P6503K2147q16K9356m3979
9411d0847K9019Q323l3908M5709L6663P28j4500n6093j6460o8723K8678R8865
9399A7454o3005J7979n800N888Q848J2369P105m1009L8573O8148P785Q552r5694
$$ plain form
9386 -12807 14128 38031 -20990 -62072 -83883 -9671 55602 99283 88789 86265 52146 8506
9374 8506 -46798 -3594 16866 37692 -28633 -51325 70401 113130 32696 -59801 -68754 -95395
9362 -95395 -77376 -116305 -150167 -117616 10354 26987 36199 35292 17008 62263 175445 163089
9350 163089 177185 143588 80526 38422 -3058 29215 128330 89434 85209 81038 75572 42525
9338 42525 81990 150508 146747 130970 100311 38883 58071 -474 -53038 -18471 6658 15775
9326 15775 -42802 18667 61621 -40402 -47556 -24622 -71728 -12523 -4768 21871 -34819 -59262
9314 -59262 -65446 -151161 -73585 -1012 56122 90886 61792 982 -8489 -21758 -51990 -20567
9302 -20567 -36276 3035 96158 138223 17378 -29009 39000 80932 161272 167340 101240 41200
$$ packed form
9386a2807K6935K3903n9021m1082k1811P4212O5273M3681j0494k524l4119m3640
9374H506n5304M3204K0460K0826o6325k2692J21726M2729q0434r2497q953k6641
9362i5395J8019l8929l3862L2551J27970J6633R212r07j8284M5255J13182j2356
9350A63089J4096l3597o3062m2104m1480L2273R9115l8896m225m171n466l3047
9338D2525L9465O8518l761j5777l0659o1428J9188n8545n2564L4567K5129R117
9326A5775n8577O1469M2954j02023p154K2934m7106N9205P755K6639n6690k4443
9314e9262o184q5715P7576P2573N7134L4764k9094o0810r471j3269l0232L1423
9302b0567j5709L9311R3123M2065j20845m6387O8009M1932Q0340O068o6100o0040
$$ plain form
9290 41200 -74177 -80040 -9502 -70569 -126015 -72998 -7640 22886 -83271 -59264 -45526 -26594
9278 -26594 2015 -37646 -24467 62410 99367 51960 32241 39373 46838 -11860 9807 64504
9266 64504 -15609 -83206 -91701 -49618 -1321 44138 97790 79631 -18150 -86209 90917 131603
9254 131603 72769 15637 -33208 -1570 -3919 -59531 -51186 -55641 151 73440 140834 37466
9242 37466 -23024 -3094 16131 53217 53465 9688 23765 54732 -21031 -21439 -6826 21266 41010
9229 41010 99070 -21300 -83252 -19650 -19705 2963 39808 -64417 -101451 -74985 12327 366
9217 366 -12082 -47949 -68818 -19220 18216 80863 122159 49451 24254 81429 120544 16703
9205 16703 45602 183503 138360 68503 52638 61530 11139 38540 17821 -12606 -25241 -39805
$$ packed form
9290D1200j15377n863P0538o1067n5446N3017O5358L0526j06157K4007J3738J8932
9278b6594K8609l9661J3179Q6877L6957m7407j9719P132P465n8698K1667N4697
9266F4504q0113o7597q495M2083M8297M5459N3652j8159r7781o8059J77126M0686
9254A31603n8834n7132m8845L1638k349n5612Q345m455N5792P3289O7394j03368
9242C7466o0490J9930J9225L7086K48m3777J4077L0967p5763m08J4613K8092J9744
9229D1010N8060j20370o1952O3602n5K2668L6845j04225l7034K6466Q7312j1961
9217C66j2448l5867k0869M9598L7436O2647M1296p2708k5197N7175L9115j03841
9205A6703K8899J37901m5143o9857j5865Q892n0391K7401k0719l0427j2635j4564
$$ plain form
9193 -39805 -5985 56628 36211 10532 -2532 -329 26019 -18006 -9570 7426 -5446 96426
9181 96426 156877 134629 148371 83665 139442 111014 90333 70515 86424 41163 89685 125369
9169 125369 166896 190878 174363 178055 202648 128652 163847 219217 237381 141595 102342 70144
9157 70144 97012 87545 56308 43489 25310 -52153 -21785 92320 178664 221514 270435 261397
9145 261397 237519 265797 303409 278437 236508 221942 186076 147496 155380 170020 191472 187264
9133 187264 209601 210896 215147 278469 290496 217722 195622 219272 197180 207990 280300 258007
9121 258007 241981 310780 288091 233273 245213 253707 281635 315380 282902 291715 383574 447148
9109 447148 406945 370464 311399 299947 309662 372960 531261 662142 740487 765284 677529
$$ packed form
9193c9805L3820O2613k0417k5679j3064K203K6348m4025Q436J6996j2872J01872
9181I6426O0451k2248J3742o4706N5777k8428k0681j9818J5909m5261M8522L5684
9169A25369M1527K3982j6515L692K4593p3996L5195N5370J8164r5786l9253l2198
9157G0144K6868r467l1237j2819j8179p7463L0368J14105Q6344M2850M8921r038
9145B61397k3878K8278L7612k4972m1929j4566l5866l8580P884J4640K1452m208
9133A87264K2337J295M251O3322J2027p2774k2100K3650k2092J0810P2310k2293
9121B58007j6026O8799k2689n4818J1940Q494K7928L3745l2478Q813R1859O3574
9109D47148m0203l6481n9065j1452R715O3298J58301J30881P8345K4797q7755
$$ plain form
9098 677529 697059 806186 851027 816963 819053 934448 1009521 1080300 1074903 1103753 1160503 1269720
9086 1269720 1408693 1552996 1597933 1684731 1906048 2126563 2268086 2471544 2740862 3008154
9076 3008154 3328658 3706916 4180995 4819086 5527586 6127448 6855254 7747407 8818702
9067 8818702 10073304 11405971 12735759 14077894 15179402 16047421 16617944 16678869 16194102
9058 16194102 15217472 14023440 12746656 11395738 9941317 8670950 7578255 6707403
9050 6707403 6038523 5414806 4838108 4372767 3873269 3418614 3082925 2816917 2512965 2288431
9040 2288431 2113085 1943364 1867907 1787163 1688657 1512802 1369814 1223768 1105289 1015446
9030 1015446 909836 891866 857349 824870 781524 754191 771022 707933 593367 527692 555359
$$ packed form
9098F77529J9530J09127M4841l4064K090J15395P5073P0779n397K8850N6750J09217
9086A269720J38973J44303M4937Q6798K21317K20515J41523K03458K69318K67292
9076C008154L20504L78258M74079O38091P08500N99862P27806Q92153J071295
9067H818702J254602J332667J329788J342135J101508Q68019N70523O0925m84767
9058A6194102r76630j194032j276784j350918j454421j270367j092695q70852
9050F707403o68880o23717n76698m65341m99498m54655l35689k66008l03952k24534
9040B288431j75346j69721p5457q0744r8506j75855j42988j46046j18479q9843
9030A015446j05610j7970l4517l2479m3346k7333J6831o3089j14566o5675K7667
$$ plain form
9019 555359 556137 460675 451802 423021 291596 318284 398633 366705 307527 367614 307575 200747
9007 200747 273411 289705 243064 216700 253467 289500 285731 233512 290311 343149 226940 82828
8995 82828 38227 92397 132932 230434 285053 272554 311443 299013 290008 314090 288909 267522
8983 267522 293034 336075 268539 182889 202937 143297 16224 57471 93762 17395 -11373
8972 -11373 -14057 -35450 48314 167397 169482 138029 151661 72248 56821 84397 68696 65747
8960 65747 79781 103762 171786 97653 48175 100983 97106 45877 35154 -55571 -115435 -123121
8948 -123121 -37359 53865 74966 112598 114927 152126 93318 -9303 6847 -8126 -25897 19167
8936 19167 64010 119673 141566 57427 -56699 -37629 34608 113238 152141 149788 139235 104966
$$ packed form
9019E55359P78r5462q873k8781j31425K6688Q0349l1928n9178O0087o0039j06828
9007B00747P2664J6294m6641k6364L6767L6033l769n2219N6799N2838j16209j44112
8995H2828m4601N4170M0535R7502N4619j2499L8889j2430r005K4082k5181k1387
8983B67522K5512M3041o7536q5650K0048n9640j27073M1247L6291p6367k8768
8972a1373k684k1393Q3764J19083K085l1453J3632p9413j5427K7576j5701k949
8960F5747J4034K3981O8024p4133m9478N2808l877n1229j0723r0725n9864p686
8948a23121Q5762R1224K1101L7632K329L7199n8808j02621J6150j4973j7771M5064
8936A9167M4843N5663K1893q4139j14126J9070P2237P8630L8903k353j0553l4269
$$ plain form
8924 104966 180013 117769 23264 41654 31728 55327 90969 20507 28599 36162 -34477 2708
8912 2708 48524 56659 91577 81068 42259 16431 94178 193846 137149 105863 95744 128095
8900 128095 233765 148714 166557 231476 244940 137051 119300 147467 127640 118553 121879 14355
8888 14355 -2991 69717 107992 145286 144727 114341 134239 192258 248188 286343 266478 337990
8876 337990 409332 531362 661860 955446 1296434 1829164 2527323 2999244 2979368 2548845
8866 2548845 1970218 1488947 1076584 672593 489787 390119 315635 281640 189789 121261
8856 121261 129475 150946 114184 48090 67999 63851 76821 131186 101781 46472 81781 109784
8844 109784 147567 160052 128465 132010 167666 192717 132793 65817 33111 -8924 -76927 -11731
$$ packed form
8924A04966P5047o2244r4505J8390r926K3599L5642p0462Q092P563p0639L7185
8912B708M5816Q135L4918j0509l8809k5828P7747R9668n6697l1286j0119L2351
8900A28095J05670q5051J7843O4919J3464j07889j7751K8167j9827r087L326j07524
8888A4355j7346P2708L8275L7294n59l0386J9898N8019N5930L8155j9865P1512
8876C37990P1342J22030J30498K93586L40988N32730O98159M71921j9876m30523
8866B548845n78627m81271m12363m03991j82806r9668p4484l3995r1851o8528
8856A21261Q214K1471l6762o6094J9909m148J2970N4365k9405n5309L5309K8003
8844A09784L7783J2485l1587L545L5656K5051n9924o6976l2706m2035o8003O5196
$$ plain form
8832 -11731 -4546 53430 45474 -7817 -42115 31 18871 32729 28329 -18655 -76198 -70059 -27777
8819 -27777 22689 52703 27543 -29801 -31203 34479 -11883 -116449 -81604 -25278 -9609 75483
8807 75483 136362 89002 76341 -9790 -4276 -12770 -101951 -158760 -157992 -143355 -182252 -197476 -161629
8794 -161629 -13724 77035 98613 58626 102861 164758 152635 110490 92858 95667 52138 5403
8782 5403 73391 958 -43814 70284 119187 87883 24189 -12040 -8357 -72905 -118376 -92155
8770 -92155 -68414 -37609 -45922 -35208 -310 -36572 -55479 -77321 -88246 -60281 -64964 -192180
8758 -192180 -285125 -223818 -115984 -148464 -128710 -85215 -83608 -51793 97812 79260 81272 86005
8746 86005 -31601 -118921 -112336 -16463 64607 85182 39966 -1543 -28418 -39286 -63246 -76020
$$ packed form
8832a1731P185N7976p956n3291l4298M2146J8840J3858m400m6984n7543O139M2282
8819b7777N0466L0014k5160n7344j402O5682m6362j04566L4845N6326J5669Q5092
8807G5483O0879m7360j2661q6131N514q494q9181n6809P68J4637l8897j5224L5847
8794a61629J47905R0759K1578l9987M4235O1897j2123m2145j7632K809m3529m6735
8782E403O7988p2433m4772J14098M8903l1304o3694l6229L683o4548m5471K6221
8770i2155K3741L0805q313J0714L4898l6262j8907k1842j0925K7965m683j27216
8758a92180r2945O1307J07834l2480J9754M3495J607L1815J49605j8552K012M733
8746H6005j17606q7320O585R5873Q1070K0575m5216m1509k6875j0868k3960j2774
$$ plain form
8734 -76020 -97522 -81912 -51044 -85226 -180781 -173991 -171359 -121060 -78750 -40076 -21606 -11408
8722 -11408 31556 -20614 9360 66926 101315 81494 -8974 -137690 -140055 -106846 -100167 1539
8710 1539 121082 92412 -44985 -67022 7218 -7901 41472 75166 59697 12973 43806 6242
8698 6242 17440 -1719 -57611 -143888 -229599 -234089 -145829 -82825 -56939 -54444 -48132 -98379 -121057
8685 -121057 -101329 -134565 -37236 -17310 -33056 36770 132985 105012 104897 79766 27232 -18807
8673 -18807 64214 54292 -34853 -65018 -73237 -33305 17045 83883 90920 29127 56280 84486
8661 84486 52491 36875 62589 86394 131785 144420 -589 -11838 36387 19320 -6142 -26290
8649 -26290 -11453 14396 36106 42622 -8209 22481 56726 9201 -24095 39142 32600 -67392
$$ packed form
8734g6020k1502J5610L0868l4182r5555O790K632N0299M2310L8674J8470J0198
8722a1408M2964n2170K9974N7566L4389j9821r0468j28716k365L3209O679J01706
8710A539J19543k8670j37397k2037P4240j5119M9373L3694j5469m6724L0833l7564
8698F242J1198j9159n5892q6277q5711m490Q8260O3004K5886K495O312n0247k2678
8685a21057J9728l3236R7329J9926j5746O9826R6215k7973j15k5131n2534m6039
8673a8807Q3021r922q9145l0165q219L9932N0350O6838P037o1793K7153K8206
8661H4486l1995j5616K5714K3805M5391J2635j45009j1249M8225j7067k5462k0148
8649b6290J4837K5849K1710O516n0831L0690L4245m7525l3296O3237o542r9992
$$ plain form
8637 -67392 -91274 -83795 -88820 -45261 -78660 -36807 -2812 35823 128548 85413 29223 17825
8625 17825 -16895 -106858 -83173 -98284 -104593 -31815 26143 46867 74245 112367 84285 25167
8613 25167 19397 79706 40985 45425 72478 39176 30973 31471 2943 -26673 -25254 -15161 57573
8600 57573 109830 111692 93303 27116 -98346 -98906 69263 108066 29803 51719 67134 113860
8588 113860 130143 80954 77239 75472 61396 15888 44689 -6919 -56587 -52936 -32227 1835
8576 1835 41214 69830 -22099 -83786 -19209 -26658 -14722 -66256 -91175 -77502 -71192 -92890
8564 -92890 55005 121397 97538 110582 162505 43216 -17559 72883 122556 92636 93100 82327
8552 82327 28853 50961 62502 16023 81482 150982 36980 -23860 -102470 -129272 -8891
$$ packed form
8637f7392k3882P479n025M3559l3399M1853L3995L8635R2725m3135n6190j1398
8625A7825l4720q9963K3685j5111o309P2778N7958K0724K7378L8122k8082n9118
8613B5167n770O0309l8721M440K7053l3302q203M98k8528k9616J419J0093P2734
8600E7573N2257J862j8389o6187j25462n60J68169L8803p8263K1916J5415M6726
8588A13860J6283m9189l715j767j4076m5508K8801n1608m9668L651K0709L4062
8576A835L9379K8616r1929o1687O4577p449J1936n1534k4919J3673O310k1698
8564i2890J47895O6392k3859J3044N1923j19289o0775R0442M9673k9920M64j0773
8552H2327n3474K2108J1541m6479O5459O9500j14002o0840p8610k6802J20381
$$ plain form
8541 -8891 112776 148356 90356 103680 88701 60369 -19456 -17714 42201 -18562 -64183 -100220
8529 -100220 -87636 -33156 24748 68042 94930 65373 33477 28362 -85874 -41032 75097
8518 75097 67110 -18441 -53749 -16368 95429 74096 -12397 -59174 -123181 -166531 -167674 -216784
8506 -216784 -120577 -63255 -33029 -10378 20130 25234 -13245 -55648 -8540 -25419 -13158 -18468
8494 -18468 -50401 -81039 -74318 -4748 38744 -13760 -4463 16606 1528 -29209 -63910 -31404
8482 -31404 -40263 -33192 -4328 40479 29383 22425 24797 -17072 -67688 -111329 -96888 -45491 -12146
8469 -12146 46489 32095 56555 83810 144977 129970 72124 -15862 -4470 10421 7214 -22555
8457 -22555 -21455 -41399 -54116 96229 165436 53463 -79313 -51705 -29097 9126 48780
$$ packed form
8541h891J21667L5580n8000J3324j4979k8332p9825J742N9915o0763m5621l6037
8529a00220J2584N4480N7904M3294K6888k9557l1896n115j14236M4842J16129
8518G5097p987q5551l5308L7381J11797k1333q6493m6777o4007m3350j143m9110
8506b16784R6207N7322L0226K2651L0508N104l8479m2403M7108j6879J2261n310
8494a8468l1933l0638O721O9570M3492n2504R297K1069j5078l0737l4701L2506
8482c1404q859P071K8864M4807j1096o958K372m1869n0616m3641J4441N1397L3345
8469a2146N8635j4394K4460K7255O1167j5007n7846q7986J1392J4891l207k9769
8457b2555J100j9944j2717J50345O9207j11973j32776K7608K2608L8223L9654
$$ plain form
8446 48780 -14915 3905 39292 -2682 2064 7350 20353 -20918 -82736 -135239 -196379 -124111
8434 -124111 -10538 -23086 -69264 -73547 -20005 -11518 -105759 -178257 -157664 -128620 -70910 -98702
8422 -98702 -59921 14419 -35731 -113257 -132138 -139476 -56693 -41644 1998 -28607 -28295 22158
8410 22158 43344 -8964 -55931 -38487 42984 58631 19325 56300 40357 7834 72152 102416
8398 102416 90968 138135 175099 52308 5814 1825 -52104 2360 43138 29568 60853 88236
8386 88236 110263 112000 49890 -13009 -56895 -85043 -58697 3219 33935 11997 -20413 -40307
8374 -40307 -35928 -85519 -78263 -100032 -121627 -81943 -80839 -89618 -50595 -79383 -88994 -94333 -87018
8361 -87018 -96284 -79292 71080 141909 93358 -43657 -76161 -180877 -157150 -118587 -66094
$$ packed form
8446D8780o3695J8820L5387m1974M746N286J3003m1271o1818n2503o1140P2268
8434a24111J13573j2548m6178m283N3542Q487r4241p2498K0593K9044N7710k7792
8422i8702L8781P4340n0150p7526j8881p338Q2783J5049M3642l0605L12N0453
8410B2158K1186n2308m6967J7444Q1471J5647l9306L6975j5943l2523O4318L0264
8398A02416j1448M7167L6964j22791m6494l989n3929N4464M0778j3570L1285K7383
8386H8236K2027J737o2110o2899m3886k8148K6346O1916L0716k1938l2410j9894
8374d0307M379m9591P256k1769k1595L9684J104q779L9023k8788r611n339P315
8361h7018r266J6992J50372P0829m8551j37015l2504j04716K3727L8563N2493
$$ plain form
8350 -66094 -823 35045 104874 123829 34782 -50021 -20931 -69992 -67933 24586 -51604 -35425
8338 -35425 -39698 31602 14884 12859 -70692 -107150 -94147 -50038 11573 -15589 -31769 15999
8326 15999 11051 13903 68227 23168 -53946 -78020 -40330 21979 -40338 -59202 -9610 33527
8314 33527 4233 -12670 -75541 -132754 -93254 -83748 -131173 -108572 12719 -4382 -10280 -41968
8302 -41968 -27377 21105 25155 24091 43849 48759 18818 -22983 95 -14483 7135 -1018 3264
8289 3264 -32889 -72914 -114437 -37540 -57269 -27439 -5259 16264 -7786 -71600 -42164 -26685
8277 -26685 -7029 -3363 43803 35388 -17780 14157 -14014 -42719 -39430 -33846 22600 30167 34943
8264 34943 159579 158065 113187 107757 127689 66612 13632 -50269 -10286 -42832 -149942 -239448
$$ packed form
8350f6094O5271L5868O9829J8955q9047q4803K9090m9061K059R2519p6190J6179
8338c5425m273P1300j6718k025q3551l6458J3003M4109O1611k7162j6180M7768
8326A5999m948K852N4324m5059p7114k4074L7690O2309o2317j8864M9592M3137
8314C3527k9294j6903o2871n7213L9500R506m7425K2601J21291j7101n898l1688
8302d1968J4591M8482M050j064J9758M910k9941m1801K3078j4578K1618q153M282
8289C264l6153m0025m1523P6897j9729K9830K2180K1523k4050o3814K9436J5479
8277b6685J9656L666M7166q415n3168L1937k8171k8705L289N584N6446P567M776
8264C4943J24636j514m4878n430J9932o1077n2980o3901L9983l2546j07110q9506
$$ plain form
8252 -239448 -209096 -106327 59738 60907 -11088 13620 -22510 6672 51877 -84530 -235135
8241 -235135 -182858 -79374 81053 105843 58125 78884 99889 128445 48859 -36932 -82952
8230 -82952 -50747 -49766 35338 36627 -42097 -69584 -82335 -31124 -898 -49620 -73829 -8260
8218 -8260 49861 86330 69544 69206 142142 59581 -45080 -4832 28930 49157 7521 -7483
8206 -7483 -27554 15397 -30365 -37658 36933 -22105 -75886 -116191 -75282 -77825 56210 111083
8194 111083 122994 66947 119059 126618 68310 7036 389 119586 155286 134167 104705 47199
8182 47199 -6570 -19656 -14380 -13877 49856 40077 -23574 -61892 2106 -76574 -39610 28721 -802
8169 -802 35408 46328 -19493 -87614 -4601 25882 51372 19504 39010 -21819 -53142 -49164
$$ packed form
8252b39448L0352J02769J66065J169p1995K4708l6130K9182M5205j36407j50605
8241b35135N2277J03484J60427K4790m7718K0759K1005K8556p9586q5791m6020
8230h2952L2205R81Q5104J289p8724k7487j2751N1211L0226m8722k4209O5569
8218h260N8121L6469j6786l38P2936q2561j04661M0248L3762K0227m1636j5004
8206g483k0071M2951m5762p293P4591n9038n3781m0305M0909k543J34035N4873
8194A11083J1911n6047N2112P559n8308o1274o647J19197L5700k1119k9462n7506
8182D7199n3769j3086N276N03O3733r779o3651l8318O3998p8680L6964O8331k9523
8169h02L6210J0920o5821o8121Q3013L0483K5490l1868J9506o0829l1323L978
$$ plain form
8157 -49164 -52596 31194 12149 -7186 -932 -11027 -58731 -71380 -22415 -28384 -33658 17034 18964
8144 18964 37045 8223 -63296 -51316 -73581 -60096 57046 20900 -7295 -79213 -63348 -32698
8132 -32698 -48129 16401 4535 -108123 -43154 39871 64823 14734 -6479 -14112 -33944 -64059
8120 -64059 -32856 -35110 -34873 -105720 -116916 -92435 -94540 -112616 -112102 -92638 -71646 -58643 20639
8107 20639 63692 25786 45376 29934 -26187 -42761 -47117 -21952 27253 61904 -681 5923
8095 5923 29311 22652 88226 32176 -49864 -83075 -24834 -35254 -76215 -111955 -188412 -142875
8083 -142875 -13201 -26091 -95292 -72073 -72317 -39118 -100977 -71155 -73505 22048 34548 46172
8071 46172 69832 24337 47902 45811 6698 -45899 2264 18046 30739 5688 -13976 -4569
$$ packed form
8157d9164l432Q3790j9045j9335O254j0095m7704j2649M8965n969n274N0692J930
8144A8964J8081k8822p1519J1980k2265J3485J17142l6146k8195p1918J5865L0650
8132c2698j5431O4530j1866j12658O4969Q3025K4952n0089k1213p633j9832l0115
8120f4059L1203k254K37p0847j1196K4481k105j8076N14J9464K0992J3003P9282
8107B0639M3053l7906J9590j5442n6121j6574m356K5165M9205L4651o2585O604
8095E923K3388o659O5574n6050q2040l3211N8241j0420m0961l5740p6457M5537
8083a42875J29674j2890o9201K3219k44L3199o1859K9822k350R5553J2500J1624
8071D6172K3660m5495K3565k091l9113n2597M8163J5782J2693k5051j9664R407
$$ plain form
8059 -4569 -31480 11287 5002 84653 93701 66428 -501 8702 59033 77779 3096 23162 61001
8046 61001 132016 61926 -36146 -82521 -94622 -67207 -74784 10989 9784 12022 106366 131228
8034 131228 48826 47203 150235 139480 174289 188052 139803 118669 194074 203411 209019 239226
8022 239226 340688 545739 654092 615167 534345 464380 330194 291149 214419 99634 -35039
8011 -35039 -18676 -57399 -18628 95331 61117 -70588 -95263 -80028 -56567 -41705 -10361
8000 -10361 -26319 -41763 -13678 -71967 -69990 460 60222 8012 40450 61265 81126 49689
7988 49689 77596 146813 119638 47489 13594 34381 155874 202399 125969 88266 -1972 -16950
7976 -16950 -31940 93866 176588 127293 1751 -11782 19109 142366 174786 100932 72102
$$ packed form
8059d569k6911M2767o285P9651R048k7273o6929R203N0331J8746p4683K0066L7839
8046F1001P1015p0090r8072m6375j2101K7415p577Q5773j205K238R4344K4862
8034A31228q2402j623J03032j0755L4809J3763m8249k1134P5405R337N608L0207
8022B39226J01462K05051J08353l8925q0822o9965j34186l9045p6730j14785j34673
8011c5039J6363l8723L8771J13959l4214j31705k4675J5235K3461J4862L1344
8000a0361j5958j5444K8085n8289J977P0450N9762n2210L2438K0815J9861l1437
7988D9689K7907O9217k7175p2149l3895K0787J21493M6525p6430l7703r0238j4978
7976a6950j4990J25806Q2722m9295j25542j3533L0891J23257L2420p3854k8830
$$ plain form
7965 72102 62371 58424 152637 174651 109508 117716 140949 53894 45356 64449 34923 34353 53903
7952 53903 -1370 27411 61592 107457 65273 47828 22650 -237 22798 75428 124533 146108
7940 146108 161945 147632 64383 -17901 23375 49108 22703 2517 35098 85263 112828 80695
7928 80695 40152 47822 86377 49961 56179 82667 100857 161457 200878 108224 12245 29315
7916 29315 44177 51301 77999 137940 184490 133262 118439 67906 88157 102143 62506 27237
7904 27237 7538 10875 -44802 -52471 -44342 -17857 3890 154 72205 64288 26454 78653 128082
7891 128082 103262 403 -8723 38716 29433 13284 -31279 -714 -16088 -12685 15337 -15312
7879 -15312 -21632 -26000 -79106 -131354 -92959 -86711 -63242 -7966 35717 122943 181006 166472
$$ packed form
7965G2102r731l947R4213K2014o5143Q208K3233q7055q538J9093k9526n70J9550
7952E3903n5273K8781L4181M5865m2184j7445k5178k2887K3035N2630M9105K1575
7940A46108J5837j4313q3249q2284M1276K5733k6405k0186L2581N0165K7565l2133
7928H0695m0543P670L8555l6416O218K6488J8190O0600L9421r2654r5979J7070
7916B9315J4862P124K6698N9941M6550n1228j4823n0533K0251J3986l9637l5269
7904B7237j9699L337n5677p669Q129K6485K1747l736P2051p917l7834N2199M9429
7891A28082k4820j02859r126M7439r283j6149m4563L0565j5374L403K8022l0649
7879a5312o320m368n3106n2248L8395O248K3469N5276M3683Q7226N8063j4534
$$ plain form
7867 166472 92501 60922 114708 152167 130910 49987 15360 43481 76117 -9388 108166
7856 108166 123745 68112 30482 -78832 -74923 -54975 -3791 63145 132403 109701 79829 43974
7844 43974 15175 -16258 -30302 -17083 -53221 -35625 -57700 -130595 -102967 -53445 -37617 21757
7832 21757 51872 112627 78612 -23254 -52631 4249 -40324 -30308 -80129 -36691 -31110 -67987
7820 -67987 -98965 -103294 -89790 38048 -58810 -138012 -163992 -187412 -234905 -161186 -132039 -110649
7808 -110649 -171689 -165830 -103501 -177052 -165938 -105039 -127587 -140034 -92896 -113622 -165083 -112965
7796 -112965 -64655 -106904 -147410 -142488 -39601 20215 -62510 -45399 -8187 15049 -18584 -51721
7784 -51721 18857 52610 73485 92912 53553 25544 100452 63249 50042 57570 4956 67787
$$ packed form
7867A66472p3971l1579N3786L7459k1257q0923l4627K8121L2636q5505J17554
7856A08166J5579n5633l7630j09314L909J9948N1184O6936O9258k2702k9872l5855
7844D3974k8799l1433j4044J3219l6138J7596k2075p2895K7628M9522J5828N9374
7832B1757L0115O0755l4015j01866k9377N6880m4573J0016m9821M3438N581l6877
7820f7987l0978m329J3504J27838r6858p9202k5980k3420m7493P3719K9147K1390
7808a10649o1040N859O2329p3551J1114O0899k2548j2447M7138k0726n1461N2118
7796a12965M8310m2249m0506M922J02887N9816q2725J7111L7212K3236l3633l3137
7784e1721P0578L3753K0875J9427l9359k8009P4908l7203j3207P528n2614O2831
$$ plain form
7772 67787 91251 50542 4555 -32000 -25535 13712 -5155 -50513 -76474 -43672 -27475 -67174
7760 -67174 -126250 -146036 -116347 -138740 -76573 -51260 -38658 -42146 -52580 -29047 -79128 -100459
7748 -100459 -86269 -12129 2325 29624 62959 138914 179613 73006 -24408 50857 112031
7737 112031 51353 -41578 -10769 -38828 -84421 -46883 -46604 -62421 -22809 -40706 -60866 14941
7725 14941 -17858 57239 84773 72601 87295 34740 -47818 -26524 -13287 15871 59540 107184
7713 107184 41345 -35544 -52956 -70410 -83032 -138901 -126841 -82759 -39116 -90480 -152240 -196160
7701 -196160 -162508 -86558 -5002 101482 146775 130835 87514 151290 182318 185944 152003 135465
7689 135465 141326 101055 70378 66232 88718 142010 188219 187949 130549 109152 202780 116775
$$ packed form
7772F7787K3464m0709m5987l6555O465L9247j8867m5358k5961L2802J6197l9699
7760f7174n9076j9786K9689k2393O2167K5313J2602l488j0434K3533n0081k1331
7748a00459J4190P4140J4454K7299L3335P5955M0699j06607r7414P5265O1174
7737A12031o0678r2931L0809k8059m5593L7538K79j5817L9612j7897k0160P5807
7725A4941l2799P5097K7534j2172J4694n2555q2558K1294J3237K9158M3669M7644
7713A07184o5839p6889j7412j7454j2622n5869J2060M4082M3643n1364o1760m3920
7701a96160L3652P5950Q1556J06484M5293j5940m3321O3776L1028L626l3941j6538
7689A35465N861m0271l0677m146K2486N3292M6209k70n7400k1397R3628q6005
$$ plain form
7677 116775 -2113 -32688 33005 55400 24773 19304 69628 90525 4399 32933 106961 67700
7665 67700 54909 126703 162769 109739 49949 6586 10973 76614 105291 123797 74559 -13525
7653 -13525 -73263 -41838 28273 -25236 -28372 20898 62474 109709 46716 69335 73241 82639
7641 82639 30616 -11117 -59182 -29759 -40565 -100603 -145749 -102589 -12827 1893 25030 29299
7629 29299 -20683 -60236 -23737 18235 -19657 -76596 -57079 -85143 -72088 -40739 -42519 6277
7617 6277 -17845 -59998 -56502 48521 93627 50260 -36925 -30540 4863 30044 40971 56369
7605 56369 67428 72409 -6863 -135424 -94659 -57066 -12316 22907 -25397 -118463 -81205 12692
7593 12692 -25164 -16149 47355 67994 -30245 -106049 7769 113494 121792 49014 -13553 -48015
$$ packed form
7677A16775j18888l0575O5693K2395l0627n469N0324K0897q6126K8534P4028l9261
7665F7700j2791P1794L6066n3030n9790m3363M387O5641K8677J8506m9238q8084
7653a3525n9738L1425P0111n3509l136M9270M1576M7235o2993K2619L906R398
7641H2639n2023m1733m8065K9423j0806o0038m5146M3160Q9762J4720K3137M269
7629B9299m9982l9553L6499M1972l7892n6939J9517k8064J3055L1349j780M8796
7617F277k4122m2153L496J05023M5106m3367q7185O385L5403K5181J0927J5398
7605E6369J1059M981p9272j28561M0765L7593M4750L5223m8304r3066L7258R3897
7593A2692l7856R015O3504K0639r8239p5804J13818J05725Q298p2778o2567l4462
$$ plain form
7581 -48015 -95097 -42481 11970 14733 -38339 -69546 -95586 -43579 -52274 -68769 -78930 8259
7569 8259 100495 10679 -76250 -106393 -136767 -73928 2617 -15907 -45412 2205 92597 42479
7557 42479 32813 103020 102988 19540 -33354 -1957 49943 45059 109368 47198 69183 15995 -57970
7544 -57970 -203482 -212285 -162022 -120120 -142434 -103620 -158718 -157584 -55423 -23324 -29669 -86482
7532 -86482 -111135 -89202 -65106 11299 28640 40524 28720 -24360 -97550 -65114 -42571 -33901
7520 -33901 -84626 -76089 -45935 -38077 -11293 4911 60381 150230 152097 150338 34516 -77639
7508 -77639 -109307 -63734 20305 38481 94329 140989 215087 117842 89157 -34227 -67117 -117360
7496 -117360 -105771 -99308 -151534 -132148 -133422 -164342 -105567 -105352 -105925 -119272 -99995 -85310 -62074
$$ packed form
7581d8015m7082N2616N4451K763n3072l1207k6040N2007q695j6495j0161Q7189
7569H259R2236q9816q6929l0143l0374O2839P6545j8524k9505M7617R0392n0118
7557D2479r666P0207l2q3448n2894L1397N1900m884O4309o2170K1985n3188p3965
7544e7970j45512q803N0263M1902k2314L8814n5098J134J02161L2099o345n6813
7532h6482k4653K1933K4096P6405J7341J1884j1804n3080p3190L2436K2543Q670
7520c3901n0725Q537L0154P858K6784J6204N5470Q9849J867j759j15822j12155
7508g7639l1668M5573Q4039J8176N5848M6660P4098r7245k8685j23384l2890n0243
7496a17360J1589O463n2226J9386j274l0920N8775K15n73j3347J9277J4685K3236
$$ plain form
7483 -62074 -62579 32262 120340 149540 85239 63204 166271 200299 129499 46060 -9848 3267
7471 3267 15726 30268 130542 191250 130717 95125 45524 73718 144911 129479 87295 68773
7459 68773 26088 -6174 -41667 -49716 -49211 -88507 -59743 -36306 -71406 -126418 -121810 -11561
7447 -11561 -6547 -117356 -155975 -137639 -34861 -27477 -21623 20269 73868 96522 84173 -38769
7435 -38769 -135750 -112177 -21613 -30768 -45085 -74685 -32761 -27953 730 -1739 -38178 -62757
7423 -62757 244 6180 49131 26441 -34432 26578 108442 124614 51517 -77862 -96650 -29861
7411 -29861 62302 112210 94606 106083 123690 4891 33155 36041 63530 38214 28102 50464
7399 50464 93262 86393 37508 77953 143259 120841 216544 156083 33702 -4883 -48576 -169718
$$ packed form
7483f2074n05R4841Q8078K9200o4301k2035J03067L4028p0800q3439n5908J3115
7471C267J2459J4542J00274O0708o0533l5592m9601K8194P1193j5432m2184j8522
7459F8773m2685l2262l5493q049N05l9296K8764K3437l5100n5012M608J10249
7447a1561N014j10809l8619J8336J02778P384N854M1892N3599K2654j2349j22942
7435c8769r6981K3573R0564r155j4317k9600M1924M808K8683k469l6439k4579
7423f2757O3001N936M2951k2690o0873O1010Q1864J6172p3097j29379j8788O6789
7411b9861R2163M9908j7604J1477J7607j18799K8264K886K7489k5316j0112K2362
7399E0464M2798o869m8885M0445O5306k2418R5703o0461j22381l8585m3693j21142
$$ plain form
7387 -169718 -148521 -27704 153364 136785 103425 125719 153757 37215 29796 47602 -57565
7376 -57565 -168658 -124616 -64973 8568 -18882 -24910 58929 109155 40618 -45778 -67761 -86896
7364 -86896 25594 112028 120419 65963 35376 250 -20927 23551 3063 -12091 5618 16396
7352 16396 -8617 3639 -44227 -110612 -682 17967 28801 48336 28115 6667 73974 109213
7340 109213 146316 98162 57354 54759 106711 66041 79740 42285 35527 50405 -30313 -116796
7328 -116796 -135472 -126818 -154119 -117561 -62180 -1753 -35669 1294 -40544 -33683 -40016 -36804
7316 -36804 -89029 -118923 39825 122640 32124 34225 46777 22378 -17533 -21161 6065 22706
7304 22706 -8103 -37623 52886 138449 156632 103150 111914 97567 8952 -164822 -222420 -149439
$$ packed form
7387a69718K1197J20817J81068j6579l3360K2294K8038j16542p419J7806j05167
7376e7565j11093M4042N9643P3541k7450o028Q3839N0226o8537q6396k1983j9135
7364h6896J12490Q6434Q391n4456l0587l5126k1177M4478k0488j5154J7709J0778
7352A6396k5013J2256m7866o6385J09930J8649J0834J9535k0221k1448O7307L5239
7340A09213L7103m8154m0808k595N1952m0670J3699l7455o758J4878q0718q6483
7328a16796j8676Q654k7301L6558N5381O0427l3916L6963m1838O861o333L212
7316c6804n2225k9894J58748Q2815r0516K101J2552k4399l9911l628K7226J6641
7304B2706l0809k9520R0509Q5563J8183n3482Q764j4347q8615j73774n7598P2981
$$ plain form
7292 -149439 -82745 -99132 -79962 -97035 7513 65447 702 -57506 -76503 -101828 -10810
7281 -10810 40000 -10348 -6537 26490 94601 61940 -30500 -31899 33021 72755 17697 -25785
7269 -25785 -64584 -43829 93506 157188 87320 -1786 12089 70953 60476 -3105 -64304 -96820
7257 -96820 -82705 -30011 -12670 18866 -79356 -80583 -29229 55778 151294 165793 68083 78397
7245 78397 139609 66712 23118 112920 83212 -13327 -23650 70036 146225 125400 40846 8711
7233 8711 -60735 -72560 -32716 -77262 23539 141441 157535 84466 -11048 -116677 -111831 -133654
7221 -133654 -112409 -82581 -20483 -59842 -107534 -72280 -111543 -76414 -11 24516 122284 110299
7209 110299 30540 33015 59925 106768 48306 66117 74265 32686 -10730 -50906 -23606 -84895
$$ packed form
7292a49439O6694j6387J9170j7073J04548N7934o4745n8208j8997k5325R1018
7281a0810N0810n0348L811L3027O8111l2661r2440j399O4920L9734n5058m3482
7269b5785l8799K0755J37335O3682o9868q9106J3875N8864j0477o3581o1199l2516
7257i6820J4115N2694J7341L1536r8222j227N1354Q5007R5516J4499r7710J0314
7245G8397O1212p2897m3594Q9802k9708r6539j0323R3686P6189k0825q4554l2135
7233H711o9446j1825L9844m4546J00801J17902J6094p3069r5514j05629M846k1823
7221a33654K1245K9828O2098l9359m7692L5254l9263L5129P6403K4527R7768j1985
7209A10299p9759K475K6910M6843n8462J7811Q148m1579m3416m0176K7300o1289
$$ plain form
7197 -84895 -26552 -16405 3797 11615 40567 55082 62185 33942 6574 25670 56474 31715
7185 31715 -64255 -178643 -168539 -29716 5987 8096 -12003 -73 -59351 32074 72987 106794
7173 106794 117516 94523 89230 119313 171387 103087 67562 90418 83767 28270 17068 -53733
7161 -53733 27750 64648 89027 42329 -30254 -111910 -187812 -92870 18747 35252 -8991 -67347
7149 -67347 -62428 -49184 -14638 -53614 -102717 -119874 -128160 -141329 -79287 50410 67418 92641
7137 92641 74353 102063 86580 -11153 -9600 -14182 -16482 24592 11813 41797 18414 29915
7125 29915 -26086 -30730 -8070 19145 48452 68617 50216 9165 11294 -19911 -76183 -90741
7113 -90741 -131945 -144102 -93782 -75962 -84155 -21588 -2955 -42099 -35469 -24090 -75676 -91235
$$ packed form
7197h4895N8343J0147K0202P818K8952J4515P103k8243k7368J9096L0804k4759
7185C1715r5970j14388J0104J38823L5703K109k0099J1930n9278R1425M0913L3807
7173A06794J0722k2993n293L0083N2074o8300l5525K2856o651n5497j1202p0801
7161e3733Q1483L6898K4379m6698p2583q1656p5902R4942J11617J6505m4243n8356
7149f7347M919J3244L4546l8976m9103j7157q286j3169O2042J29697J7008K5223
7137I2641j8288K7710j5483r7733J553m582k300M1074j2779K9984k3383J1501
7125B9915n6001m644K2660K7215K9307K0165j8401m1051K129l1205n6272j4558
7113i0741m1204j2157N0320J7820q193O2567J8633l9144O630J1379n1586j5559
$$ plain form
7101 -91235 -45402 -6896 -70692 -150448 -109646 -89132 -106097 -57254 7471 46044 30172 31600
7089 31600 43727 -25729 -56917 -125071 -129342 -67973 -6620 45849 75374 57290 28091 20537
7077 20537 52330 82944 45057 -1419 7140 67649 112075 29970 67387 160813 108848 36334
7065 36334 65423 118462 52823 17314 64031 101126 39893 -15064 -48118 15098 25170 30081
7053 30081 -8281 -70948 -110021 -65172 -58702 -46627 -5219 56105 105169 74037 80884 30177
7041 30177 -19966 37421 112517 100083 55621 8458 -68930 -69992 -10268 -56133 -95039 -10066
7029 -10066 107515 126206 96879 17350 7498 19999 67672 -31647 -9045 27117 42240 31765
7017 31765 -104358 -159460 -161427 -133364 -59452 33362 -30943 -50809 -102931 -43976 -82384 -40316
$$ packed form
7101i1235M5833L8506o3796p9756M0802K0514j6965M8843O4725L8573j5872J428
7089C1600J2127o9456l1188o8154m271O1369O1353N2469K9525j8084k9199p554
7077B0537L1793L0614l7887m6476Q559O0509M4426q2105L7417R3426n1965p2514
7065C6334K9089N3039o5639l5509M6717L7095o1233n4957l3054O3216J0072M911
7053C0081l8362o2667l9073M4849O470J2075M1408O1324M9064l1132O847n0707
7041C0177n0143N7387P5096j2434m4462m7163p7388j062N9724m5865l8906Q4973
7029a0066J17581J8691k9327p9529r852J2501M7673r9319K2602L6162J5123j0475
7017C1765j36123n5102j967K8063P3912R2814o4305j9866n2122N8955l8408M2068
$$ plain form
7005 -40316 -18794 -40543 -10376 -45890 -77837 -153071 -121912 -47217 -44543 -23182 75962 93814
6993 93814 6668 -12804 -22255 71970 -6170 -49519 -2348 15671 13430 -55761 -126774 -111105
6981 -111105 -110282 -67550 -105006 -75850 11461 40886 104407 1808 44603 67775 -24241 -17891
6969 -17891 -50443 -116460 -96067 -69212 -57122 -17436 32379 67639 84448 10089 -55413 -48018
6957 -48018 25490 43853 -43467 -90000 -28119 32046 -6940 -23926 13423 7263 -22243 14741
6945 14741 127573 115412 19926 -8376 24266 18507 -25074 -70796 -68204 2349 2030 -17598
6933 -17598 -586 -21271 -1718 -9153 -49061 -113194 -71314 61741 46949 -66428 -75412 -75610
6921 -75610 -83971 -53502 -81010 -41977 -26645 -15681 28512 -5971 -112901 -135749 -59414 -17155
$$ packed form
7005d0316K1522k1749L0167l5514l1947p5234L1159P4695K674K1361R9144J7852
6993I3814q7146j9472r451R4225p8140m3349M7171J8019k241o9191p1013J5669
6981a11105Q23M2732l7456K9156Q7311K9425O3521j02599M2795K3172r2016O350
6969a7891l2552o6017K0393K6855J2090L9686M9815L5260J6809p4359o5502P395
6957d8018P3508J8363q7320m6533O1881O0165l8986j6986L7349o160k9506L6984
6945A4741J12832j2161r5486k8302L2642n759m3581m5722K592P0553l19j9628
6933a7598J7012k0685J9553p435l9908o4133M1880J33055j4792j13377q984j98
6921g5610q361L0469k7508L9033J5332J0964M4193l4483j06930k2848P6335M2259
$$ plain form
6909 -17155 -52330 -108730 -86078 -77697 -19779 81768 108436 11832 -43132 16626 4968 24747
6897 24747 35172 38878 58890 121375 102432 61348 51944 25051 -29671 -30570 -114609 -53385 -94327
6884 -94327 -129869 -111522 -97135 -127903 -88440 21051 36076 41882 78924 87332 45885 -10468
6872 -10468 14499 -47692 -20890 16088 63867 99220 115433 136980 100940 81031 2706 -62569
6860 -62569 -121103 -100883 -67683 -67127 -52059 -52300 -19542 -100217 -164588 -133182 -72126 -68391 -28597
6847 -28597 23736 45076 -10130 -62336 -18791 113582 102967 38837 -25491 -111325 -134195 -162064
6835 -162064 -163106 -95021 -104134 -153396 -55515 -442 2631 -67759 -128347 -52214 -20906 -21526 -60018
6822 -60018 -98877 -41835 -13139 -93438 -108185 -63928 16936 7985 -15466 3770 2593 7427
$$ packed form
6909a7155l5175n6400K2652Q381N7918J01547K6668r6604n4964N9758j1658J9779
6897B4747J0425L706K0012O2485j8943m1084r404k6893n4722q99q4039O1224m0942
6884i4327l5542J8347J4387l0768L9463J09491J5025N806L7042Q408m1447n6353
6872a0468K4967o2191K6802L6978M7779L5353J6213K1547l6040j9909p8325o5275
6860f2569n8534K0220L3200N56J5068k41L2758q0675o4371L1406O1056L735L9794
6847b8597N2333K1340n5206n2206M3545J32373j0615o4130o4328q5834k2870k7869
6835a62064j042O8085r113m9262R7881N5073L073p0390o0588P6133L1308o20l8492
6822f0018l8859N7042K8696q0299j4747M4257Q0864q951k3451J9236j177M834
$$ plain form
6810 7427 2822 14420 13470 -25124 -45273 -42932 -65628 -161317 -123518 -65706 -114977 -33823 -25831
6797 -25831 -60838 -41838 40353 56581 3811 19108 52521 69972 67052 22368 -82963 -106701
6785 -106701 27225 34842 -18925 -41186 9634 131121 95404 31909 30402 -2856 -25373 -30494
6773 -30494 -106004 -97752 30555 57611 -19803 -64210 -71744 -28975 -38191 -51773 -74354 -75982
6761 -75982 -97457 -122424 -152843 -144987 -176971 -126620 -102668 -68582 -96450 -39654 -9735 -95859
6749 -95859 -56104 53555 112888 83108 18600 -45184 -111611 -31179 69817 26787 26003 115760
6737 115760 90603 63640 90928 163782 154375 71524 -59669 -2263 20150 112549 130442 159979
6725 159979 108873 88276 186785 282179 270933 217445 79057 49131 58341 64846 43519 2512
$$ packed form
6810G427m605J1598r50l8594k0149K341k2696r5689L7799N7812m9271Q1154P992
6797b5831l5007J9000Q2191J6228n2770J5297L3413J7451k920m4684j05331k3738
6785a06701J33926P617n3767k2261N0820J21487l5717o3495j507l3258k2517n121
6773c0494p5510Q252J28307K7056p7414m4407p534M2769r216j3582k2581j628
6761g5982k1475k4967l0419P856l1984N0351K3952L4086k7868N6796K9919q6124
6749i5859L9755J09659N9333k9780o4508o3784o6427Q0432J00996m3030p84Q9757
6737A15760k5157k6963K7288P2854r407q2851j31193N7406K2413R2399J7893K9537
6725A59979n1106k0597R8509R5394j1246n3488j38388k9926R210O505k1327m1007
$$ plain form
6713 2512 -2936 14462 22240 -11404 -128295 -167664 -52546 10928 -36084 -36739 36466 91904
6701 91904 68226 31836 48245 33697 73399 58520 36599 -9920 -9821 -96920 -190069 -197408 -153306
6688 -153306 -71340 -252 -21911 -66177 -83855 -71887 -52697 9566 -102686 -172525 -107153
6677 -107153 -57689 7301 55371 -18203 -75335 -108245 -88626 -101427 -158539 -121026 -61567 -7976
6665 -7976 40646 58053 -46884 -137479 -95129 8737 81998 91522 55824 73539 45384 -28100
6653 -28100 62625 39993 -9961 -11320 10086 51915 62807 -20556 -56500 -63588 -33616 -72920
6641 -72920 -68521 -45183 -48571 -67363 8842 64426 6264 22426 63482 62834 38893 63976 95357
6628 95357 78888 44776 31894 20685 23442 -60856 -89784 -41552 12541 35883 42323 -4283
$$ packed form
6713B512n448J7398P778l3644j16891l9369J15118O3474m7012o55P3205N5438
6701I1904k3678l6390J6409j4548L9702j4879k1921m6519R9q7099r3149p339M4102
6688a53306Q1966P1088k1659m4266j7678J1968J9190O2263j12252o9839O5372
6677a07153M9464O4990M8070p3574n7132l2910J9619j2801n7112L7513N9459N3591
6665g976M8622J7407j04937r0595M2350J03866P3261R524l5698J7715k8155p3484
6653b8100R0725k2632m9954j359K1406M1829J0892q3363l5944p088K9972l9304
6641g2920M399K3338l388j8792P6205N5584n8162J6162M1056o48k3941K5083L1381
6628I5357j6469l4112j2882j1209K757q4298k8928M8232N4093K3342O440m6606
$$ plain form
6616 -4283 -2460 29895 9145 -29757 16871 37335 9909 -15878 -36519 -9169 45520 55507
6604 55507 49302 -42347 -100474 -34237 29573 45035 -72690 -158188 -134750 -8577 105067
6593 105067 135223 155070 86013 66124 47597 -67416 -13796 47968 43089 28547 -15193 -44118
6581 -44118 38783 64930 50967 59468 36853 -69084 -21754 58391 39620 6761 -4236 47513
6569 47513 66296 1153 -29582 -22407 59497 96316 64163 -16343 -57361 -50591 57217 -155
6557 -155 -45167 -93638 -7559 51816 52439 13546 10523 -19774 -28438 -5443 37195 39430 -11776
6544 -11776 -36476 10486 117385 179538 184195 72735 -10635 58175 114495 64691 126291 98287
6532 98287 90068 131490 117746 47109 37735 88379 88659 62496 88298 47405 -1360 40444 31669
$$ packed form
6616d283J823L2355k0750l8902M6628K0464k7426k5787k0641K7350N4689R987
6604E5507o205r1649n8127O6237O3810J5462j17725q5498K3438J26173J13644
6593A05067L0156J9847o9057j9889j8527j15013N3620O1764m879j4542m3740k8925
6581d4118Q2901K6147j3963Q501k2615j05937M7330Q0145j8771l2859j0997N1749
6569D7513J8783o5143l0735P175Q1904L6819l2153q0506m1018O770J07808n7372
6557a55m5012m8471Q6079N9375O23l8893l023l0297q664K2995M2638K235n1206
6544a1776k4700M6962J06899O2153M657j11460q3370O8810N6320m9804O1600k8004
6532I8287q219M1422j3744p0637r374N0644K80k6163K5802m0893m8765M1804q775
$$ plain form
6519 31669 79129 57038 20557 60764 95809 152155 3719 -54918 -64325 -109695 -164020 -102838
6507 -102838 -38662 100930 64008 -43606 -1849 -53439 -92813 -34546 67816 43916 66806
6496 66806 110319 104011 15756 -2913 34289 58700 -5905 -62998 -24403 -5514 16120 -9574
6484 -9574 -94427 -158256 -175046 -108801 -88287 -38093 -24939 -77767 -62691 31336 124825 138933
6472 138933 -8122 7301 51638 -16467 34317 23213 -39817 -61921 18804 3140 20338
6461 20338 51289 10513 -13924 -21649 -23546 32692 66430 55501 62527 56022 36366 -9661 -15805
6448 -15805 -1804 -222 -62852 -33736 41585 49771 -94535 -161677 -163522 -134988 -60194 -30721
6436 -30721 18260 8770 -3168 24357 66357 25094 -52967 -83204 -60893 -68493 -68630 -76238 -58558
$$ packed form
6519C1669M7460k2091l6481M0207L5045N6346j48436n8637r407m5370n4325O1182
6507a02838O4176J39592l6922j07614M1757n1590l9374N8267J02362k3900K2890
6496F6806M3513o308q8255j8669L7202K4411o4605n7093L8595J8889K1634k5694
6484i574q4853o3829j6790O6245K0514N0194J3154n2828J5076R4027R3489J4108
6472A38933j47055J5423M4337o8105N0784j1104o3030k2104Q0725j5664J7198
6461B0338L0951m0776k4437p725j897N6238L3738j0929P026o505j9656m6027o144
6448a5805J4001J582o2630K9116P5321Q186j44306o7142j845K8534P4794K9473
6436c0721M8981r490j1938K7525M2000m1263p8061l0237K2311p600j37p608J7680
$$ plain form
6423 -58558 63704 76313 -80525 -74689 -63630 -110212 -104096 -127367 -59912 3676 -12796 -9441
6411 -9441 60902 7100 -5268 -10765 -19788 -68186 -43332 4948 24365 -43024 -50171 -76701 37430
6398 37430 59842 7015 -45299 -28231 -25703 -5354 -44509 -20332 -112465 -125608 -83752 -61617
6386 -61617 114 11747 -42830 -9752 -30761 -17988 -28885 -73915 -41478 -111842 -96344 -36317
6374 -36317 28197 47813 46016 63206 76128 52015 114373 98988 57228 48624 38176 102159
6362 102159 111366 46629 88869 144022 151227 51990 -99654 -122280 -45087 34660 38725 -2283
6350 -2283 -17309 -38584 -83858 -53111 -42679 15804 12654 -20935 -133857 -126177 -36354 -115907
6338 -115907 -118275 -56962 23822 33393 43023 25848 -61258 -84731 -9699 162 7467 13047 21085
$$ packed form
6423e8558J22262J2609j56838N836J1059m6582O116k3271O7455O3588j6472L355
6411i441P0343n3802j2368n497r023m8398K4854M8280J9417o7389p147k6530J14131
6398C7430K2412n2827n2314J7068K528K0349l9155K4177r2133j3143M1856K2135
6386f1617O1731J1633n4577L3078k1009J2773j0897m5030L2437p0364J5498O0027
6374c6317O4514J9616j797J7190J2922k4113O2358j5385m1760q604j0448O3983
6362A02159R207o4737M2240N5153P205r9237j51644k2626P7193P9747M065m1008
6350b283j5026k1275m5274L0747J0432N8483l150l3589j12922P680Q9823p9553
6338a15907k368O1313Q0784R571R630j7175q7106k3473P5032R861P305N580Q038
$$ plain form
6325 21085 14274 -7965 32879 50552 50216 -10140 -140521 -191922 -64907 1018 14528 -30200
6313 -30200 2730 -59079 -117676 -109792 -90949 -42857 -17879 22162 30778 -36238 -74701 -63744
6301 -63744 -107639 -98639 -44579 -29790 -59952 -105480 -97956 11400 85772 73569 45395 -43288
6289 -43288 -55868 -5437 128322 123588 75541 18087 -30136 -24591 23490 -17214 -89349 -119816
6277 -119816 -122618 -104058 -125398 -64533 -40926 -18476 -24955 3550 44302 23297 57724 140446
6265 140446 120356 88283 5460 69317 97597 50900 -28123 -69931 -94822 -107323 -133348 -24356
6253 -24356 -878 -12093 -8684 -3442 -2191 19855 -7378 -40186 -27982 65705 30543 -14372
6241 -14372 -94000 -159716 -74461 -27261 -74859 -39360 -49310 -147888 -107200 -86280 -100062 -106389
$$ packed form
6325B1085o811k2239M0844J7673l36o0356j30381n1401J27015O5925J3510m4728
6313c0200L2930o1809n8597P884J8843M8092K4978M0041Q616o7016l8463J0957
6301f3744m3895R000N4060J4789l0162m5528P524J09356P4372j2203k8174q8683
6289d3288j2580N0431J33759m734m8047n7454m8223N545M8081m0704p2135l0467
6277a19816k802J8560k1340O0865K3607K2450o479K8505M0752k1005L4427Q2722
6265A40446k0090l2073q2823O3857K8280m6697p9023m1808k4891j2501k6025J08992
6253b4356K3478j1215L409N242J251K2046k7233l2808J2204R3687l5162m4915
6241a4372p9628o5716Q5255M7200m7598L5499r950r8578M0688K0920j3782o327
$$ plain form
6229 -106389 -63530 16612 119296 152929 166203 146641 141580 95372 -16414 -21781 45520 69065
6217 69065 91130 82722 126878 185111 167024 32829 -40070 -8109 -34322 -54946 -45485 31016
6205 31016 57399 15114 -147314 -155651 -135297 -76553 17947 56226 -13978 -89092 -55053 -70227
6193 -70227 -11164 -49213 -77905 10064 -16369 -65680 -134585 -41055 57662 27485 -57361 -21069
6181 -21069 -14461 -67237 -113114 -35837 56679 107807 56130 -12964 -14741 17479 52077 74121
6169 74121 162114 140613 114246 152604 52243 23582 -17672 36757 71056 42079 34128 148839
6157 148839 200232 116181 -7089 38300 69174 98580 60573 -36529 -134365 -129692 -125707 -143552
6145 -143552 -136124 -96337 -101620 -64783 -36313 -91975 -94833 -135756 -107236 -68327 -47637 -83993
$$ packed form
6229a06389M2859Q0142J02684L3633J3274j9562n061m6208j11786n367O7301K3545
6217F9065K2065q408M4156N8233j8087j34195p2899L1961k6213k0624R461P6501
6205C1016K6383m2285j62428q337K0354N8744R4500L8279p0204p5114L4039j5174
6193g0227N9063l8049k8692Q7969k6433m9311o8905R3530R8717l0177q4846L6292
6181b1069O608n2776m5877P7277R2516N1128n1677o9094j777L2220L4598K2044
6169G4121Q7993k1501k6367L8358j00361k8661m1254N4429L4299k8977p951J14711
6157A48839N1393q4051j23270M5389L0874K9406l8007r7102r7836M673L985j7845
6145a43552P428L9787n283L6837K8470n5662k858m0923K8520L8909K0690l6356
$$ plain form
6133 -83993 -142450 -55251 -65133 -41385 -71536 -140662 -144608 -136879 -131024 -84463 -62858 -36078 -74302
6120 -74302 -155235 -152482 -50592 46363 -1321 -77149 -60060 1159 102705 45011 1633 -32355
6108 -32355 -64827 -101819 -63408 -29217 -52864 34291 113999 88641 61035 88823 69445 56616
6096 56616 37129 17921 33669 -30963 -48139 36155 -13270 -42776 54286 58450 11567 31118
6084 31118 -31222 -11949 -5741 36387 22918 98207 60532 2804 -47100 -79939 -29651 -48465
6072 -48465 -72881 29524 14974 33116 36845 62119 104835 56651 -24227 -69021 -41077 -27405
6060 -27405 -73665 -107518 -134137 -110566 -115659 -155322 -147685 -36367 -9103 -114211 -97625 -85579
6048 -85579 -140910 -143127 -92182 -85082 -65317 -46943 -75289 -87729 4703 86585 89889 140213
$$ packed form
6133h3993n8457Q7199r882K3748l0151o9126l946P729N855M6561K1605K6780l8224
6120g4302q0933K753J01890R6955m7684p5828J7089O1219J01546n7694m3378l3988
6108c2355l2472l6992L8411L4191k3647Q7155P9708k5358k7606K7788j9378j2829
6096E6616j9487j9208J5748o4632j7176Q4294m9425k9506R7062M164m6883J9551
6084C1118o2340J9273O208M2128j3469P5289l7675n7728m9904l2839N0288j8814
6072d8465k4416J02405j4550J8142L729K5274M2716m8184q0878m4794K7944J3672
6060b7405m6260l3853k6619K3571n093l9663P637J11318K7264j05108J6586J2046
6048h5579n5331k217N0945P100J9765J8374k8346j2440R2432Q1882L304N0324
$$ plain form
6036 140213 120643 88345 131715 99670 75437 93941 53355 -29916 -73397 -73353 7717 20945
6024 20945 59314 68156 44494 -7944 42086 94319 105439 148552 66128 51943 39405 -9228
6012 -9228 -47884 -27139 2747 67897 68634 127956 189229 194087 70413 38646 165755 172055
6000 172055 100766 17699 -44733 -31490 43404 36760 -4920 -79899 -134627 -82721 999 17737
5988 17737 28596 -12527 -13985 -39793 -17222 15863 7879 -11806 -88453 -109802 -136707 -23697
5976 -23697 -31348 -5082 37762 -24102 -22046 -5439 -99017 -138488 -85498 -138748 -80021 -20439
5964 -20439 19265 120225 181242 156554 78747 -21975 -50221 -65419 -76155 57904 52001
5953 52001 29876 -1318 -2715 -44507 34174 49063 -21516 -33829 10609 -44367 -149461 -147923
$$ packed form
6036A40213j9570l2298M3370l2045k4233J8504m0586q3271m3481M4Q1070J3228
6024B0945L8369Q842k3662n2438N0030N2233J1120M3113q2424j4185j2538m8633
6012i228l8656K0745K9886O5150P37N9322O1273M858j23674l1767J27109O300
6000A72055p1289q3067o2432J3243P4894o644m1680p4979n4728N1906Q3720J6738
5988A7737J0859m1123j458k5808K2571L3085p984j9685p6647k1349k6905J13010
5976b3697p651K6266M2844o1864K056J6607r3578l9471N2990n3250N8727N9582
5964b0439L9704J00960O1017k4688p7807j00722k8246j5198j0736J34059n903
5953E2001k2125l1194j397m1792P8681J4889p0579j2313M4438n4976j05094J538
$$ plain form
5941 -147923 -160937 -202012 -166038 -147167 -119066 -194530 -158351 -118584 -45362 25924 58869 106624
5929 106624 123183 96921 119245 195014 234491 102374 94038 114061 109393 82867 34859 89136
5917 89136 42623 13192 -27301 -98578 -86663 -46676 50726 -46 29163 22549 95638 53207
5905 53207 8810 76937 25110 -50597 -10098 -8254 -34345 -16540 53440 57040 101847 139469
5893 139469 124553 17827 1925 5458 -2788 32476 95929 115804 48890 3184 2138 1430
5881 1430 54540 56676 22542 62209 29000 12537 -24708 -40557 28985 54101 33100 29918
5869 29918 44706 17924 87646 59706 -49217 -28823 -24597 -76608 -68442 -50106 -45218 -25676
5857 -25676 9452 -12220 38329 300 12894 -21747 -82714 -51146 -11913 -39695 -12246 98876
$$ packed form
5941a47923j3014m1075L5974J8871K8101p5464L6179L9767P3222P1286L2945M7755
5929A06624J6559k6262K2324P5769L9477j32117q336K0023m668k6526m8008N4277
5917H9136m6513k9431m0493p1277J1915L9987R7402n0772K9209o614P3089m2431
5905E3207m4397O8127n1827p5707M0499J844k6091J7805O9980L600M4807L7622
5893A39469j4916j06726j5902L533q246L5264O3453J9875o6914m5706j046p08
5881A430N3110K136l4134L9667l3209j6463l7245j5849O9542K5116k1001l182
5869B9918J4788k6782O9722k7940j08923K0394M226n2011Q166J8336M888J9542
5857b5676L5128k1672N0549l8029J2594l4641o0967L1568L9233k7782K7449J11122
$$ plain form
5845 98876 56922 41804 52596 -46684 -26162 2375 60024 77528 34134 37856 67234 76016
5833 76016 69702 -5719 -86742 12978 18661 -9321 711 -99291 -96110 -29645 -42947 -64324
5821 -64324 -83747 -114728 -95213 -57349 -41684 -71850 -20314 84013 131221 183133 211020 185071
5809 185071 108895 -8087 -78651 -56647 -27877 -84000 -135886 -70668 -3111 -17051 -5484
5798 -5484 -26144 -71957 -30064 -30220 4988 -9780 2939 30408 -29518 -73826 -80526 25554
5786 25554 92854 39159 15212 -131312 -187713 -158921 -84053 31220 19260 -91263 -102040
5775 -102040 -6229 15741 52099 4976 -34068 -69503 -77180 -79512 -42649 35523 63703 -7845
5763 -7845 -116131 -208151 -148115 -67432 -59975 -136616 -167798 -195874 -113523 -122558 -350 34001
$$ packed form
5845I8876m1954j5118J0792r9280K0522K8537N7649J7504m3394L722K9378Q782
5833G6016o314p5421q1023R9720N683k7982J0032j00002L181O6465j3302k1377
5821f4324j9423l0981J9515L7864J5665l0166N1536J04327M7208N1912K7887k5949
5809A85071p6176j16982p0564K2004K8770n6123n1886O5218O7557j3940J1567
5798e484k0660m5813M1893j56L5208j4768J2719K7469n9926m4308o700J06080
5786B5554O7300n3695k3947j46524n6401K8792P4868J15273j1960j10523j0777
5775a02040R5811K1970L6358m7123l9044l5435p677k332L6863P8172K8180p1548
5763g845j08286r2020O0036Q0683P457p6641l1182k8076Q2351r035J22208L4351
$$ plain form
5751 34001 30384 38749 37666 998 24348 96802 30801 -113432 -115408 -137978 -78313 -70984 -136704
5738 -136704 -70014 -8585 -51441 -54631 -27819 -8894 13483 -4764 21671 -42090 -95171 -49722
5726 -49722 -51825 -137306 -143272 -71316 17571 59205 43075 46442 137765 146276 52901 -64238
5714 -64238 -61603 15829 4549 31415 9734 -60023 -104765 -130376 -34705 13871 102878 69903
5702 69903 47266 107216 108316 45318 16356 -6331 -23547 -15105 -23594 -43345 1581 10110 -20233
5689 -20233 -112690 -149452 -116501 -32983 15482 39041 -19837 -70664 -12802 92441 141018 134691
5677 134691 117123 55892 44945 36949 -26758 -15326 -16334 -20044 -88181 -89811 -70732 -47937
5665 -47937 -9886 18605 13837 25817 18956 -38903 -80799 -83299 -106610 -158283 -158522 -159518 -175538
$$ packed form
5751C4001l617Q365j083l6668K3350P2454o6001j44233j976k2570N9665P329o5720
5738a36704O6690O1429m2856l190K6812J8925K2377j8247K6435o3761n3081M5449
5726d9722k103q5481n966P1956Q8887M1634j6130L367R1323Q511r3375j17139
5714f4238K635P7432j1280K6866k1681o9757m4742k5611R5671M8576Q9007l2975
5702F9903k2637N9950J100o2998k8962k2687j7216Q442q489j9751M4926Q529l0343
5689b0233r2457l6762L2951Q3518M8465K3559n8878n0827N7862J05243M8577o327
5677A34691j7568o1231j0947p996o3707J1432j008l710o8137j630J9079K2795
5665d7937L8051K8491m768J1980o861n7859m1896k500k3311n1673k39r96j6020
$$ plain form
5652 -175538 -173577 -124187 -120021 3249 113219 155690 94856 -22615 -7403 56654 154586
5641 154586 181815 92755 2277 -4752 6094 19441 40909 86290 112581 108660 152250 148413
5629 148413 80555 44011 6145 -46533 -89723 7423 13814 -32227 -84326 -57111 46179 60426
5617 60426 20439 -40786 -41906 -1093 -5972 -48919 -79728 -82014 -72881 -24515 -58993 -133455 -81809
5604 -81809 -61245 -17672 51729 110380 128154 175559 186202 203137 140356 23608 -44590 3471
5592 3471 4218 -102606 -144613 -95979 -63008 -20738 33321 80382 45339 57514 52517 -11020
5580 -11020 15529 109790 87364 107322 132663 168442 81439 -103030 -23925 1613 98781 267048
5568 267048 226024 170170 125054 15791 -7175 26782 3115 -9239 11654 -38549 -102963
$$ packed form
5652a75538J961M9390M166J23270J09970M2471o0834j17471J5212O4057R7932
5641A54586K7229q9060r0478p029J0846J3347K1468M5381K6291l921M3590l837
5629A48413o7858l6544l7866n2678m3190R7146O391m6041n2099K7215J03290J4247
5617F0426l9987o1225j120M0813m879m2947l0809k286R133M8366l4478p4462N1646
5604h1809K0564M3573O9401N8651J7774M7405J0643J6935o2781j16748o8198M8061
5592C471P47j06824m2007M8634L2971M2270N4059M7061l5043J2175m997o3537
5580a1020K6549R4261k2426J9958K5341L5779q7003j84469P9105K5538R7168J68267
5568B67048m1024n5854m5116j09263k2966L3957k3667j2354K0893n0203o4414
$$ plain form
5557 -102963 -141033 -86410 -35108 10345 120523 101077 62417 79201 76259 66595 38085 12568
5545 12568 -103131 -112760 -76895 -74499 -14042 -58058 -48835 80337 148064 121614 100188 58625
5533 58625 -61976 -201538 -229798 -156764 -82378 -1342 -10923 -32084 19047 -63993 -76623 -9513
5521 -9513 1332 44595 65949 130997 116643 17290 24417 67531 93700 117129 100947 70338
5509 70338 100493 109693 76802 16638 18219 82692 59883 -9477 -4365 -19459 -38974 -8130
5497 -8130 -14610 77272 90747 69549 102110 112713 69816 -3056 -61206 -110820 -132138 -51836
5485 -51836 28876 -46406 -66490 34559 70295 103465 76637 68660 75266 99963 28980 8342
5473 8342 58123 125387 38492 6467 20047 -15959 38747 43897 15200 7418 28268 41319
$$ packed form
5557a02963l8070N4623N1302M5453J10178j9446l8660J6784k942r664k8510k5517
5545A2568j15699r629L5865K396O0457m4016R223J29172O7727k6450k1426m1563
5533E8625j20601j39562k8260P3034P4386Q1036r581k1161N1131q3040j2630O7110
5521i513J0845M3263K1354O5048j4354r9353P127M3114K6169K3429j6182l0609
5509G0338L0155R200l2891o0164J581O4473k2809o9360N112j5094j9515L0844
5497h130o480R1882J3475k1198L2561J0603m2897p2872n8150m9614k1318Q0302
5485e1836Q0712p5282k0084J01049L5736L3170k6828p977O606K4697p0983k0638
5473H342M9781O7264q6895l2025J3580l6006N4706N150k8697p782K0850J3051
$$ plain form
5461 41319 73988 88981 16841 -107022 -80441 -60513 -96493 -50356 1883 -1119 31102 6571
5449 6571 -25967 -5586 -62950 -719 78842 109724 100423 129971 119132 52805 16385 -42456
5437 -42456 39550 135449 163800 198507 109586 -7138 -8754 4269 11217 -31521 -82971 -50870
5425 -50870 11405 -6475 50904 -363 -28696 -43636 -79148 -70754 46189 103575 139687 101629
5413 101629 57224 110380 52848 45254 48584 98648 104038 40729 -12993 20865 79052 45361
5401 45361 44897 86671 81904 79882 42425 24015 41704 61924 61949 714 48586 97874 13564
5388 13564 -18712 -31084 -74378 -100875 -51135 -43901 -55191 -141988 -155250 -119977 42204 112208
5376 112208 161876 199017 179167 152151 41882 2113 2463 -35168 -117435 -225269 -132489 -13402
$$ packed form
5461D1319L2669J4993p2140j23863K6581J9928l5980M6137N2239l002L2221k4531
5449F571l2538K0381n7364O2231P9561L0882r301K9548j0839o6327l6420n8841
5437d2456Q2006R5899K8351L4707q8921j16724j616J3023O948m2738n1450L2101
5425e0870O2275j7880N7379n1267k8333j4940l5512Q394J16943N7386L6112l8058
5413A01629m4405N3156n7532p594L330N0064N390o3309n3722L3858N8187l3691
5401D5361m64M1774m767k022l7457j8410J7689K0220K5o1235M7872M9288q4310
5388A3564l2276j2372m3294k6497M9740P234j1290q6797j3262L5273J62181P0004
5376A12208M9668L7141j9850k7016j10269l9769L50l7631q2267j07834R2780J19087
$$ plain form
5364 -13402 -51506 -118368 -157495 -66250 -105106 -92012 -94815 -128712 -133285 -122580 -78584 -54859
5352 -54859 28742 57264 3352 -34790 -22947 23167 -29217 -98179 -25426 -47702 -18492 31287
5340 31287 46473 19442 -84798 -21908 584 -82674 -105137 -120881 -67535 53042 51631 -45229
5328 -45229 -48767 -36544 77175 30630 -4389 42142 73423 31252 -75523 -64707 -2977 20951
5316 20951 -35629 -11474 57989 90218 80648 88327 68155 -32944 -69053 -29941 -59532 -129661
5304 -129661 -36140 60770 -33748 -51701 -46475 40106 36508 58749 68969 -29183 -121974 -84216
5292 -84216 -23897 -53123 -137846 -202566 -143901 -26053 -59921 -48083 55074 57423 -25069 5885
5280 5885 66922 -25848 -84512 -94694 249 26762 29325 5249 -3385 -3010 14104 -13497 38071
$$ packed form
5364a3402l8104o6862l9127R1245l8856J3094k803l3897m573J0705M3996K3725
5352e4859Q3601K8522n3912l8142J1843M6114n2384o8962P2753k2276K9210M9779
5340C1287J5186k7031j04240O2890K2492q3258k2463j5744N3346J20577j411r6860
5328d5229l538J2223J13719m6545l5019M6531L1281m2171j06775J0816O1730K3928
5316B0951n6580K4155O9463L2229r570P679k0172j01099l6109L9112k9591p0129
5304a29661R3521R6910r4518j7953N226Q6581l598K2241J0220r8152r2791L7758
5292h4216O0319k9226q4723o4720N8665J17848l3868J1838J03157K349q2492L0954
5280E885O1037r2770n8664j0182R4943K6513K563k4076q634L75J7114k7601N1568
$$ plain form
5267 38071 139130 65038 -4311 55951 73308 28740 -15677 13731 -10479 55825 105115 -24118
5255 -24118 -70698 -108082 -115895 -109316 -143144 -138047 -96160 -59075 -66571 -37259 38321 -18272 -106563
5242 -106563 -147361 -176185 -192570 -114873 -87014 1444 38572 23856 -13439 23346 -45075 -68901
5230 -68901 -61275 -75960 -147066 -37364 18327 12335 28577 17508 -92386 -221075 -210345 -163177
5218 -163177 -88639 -61361 -103722 -64640 63999 -4 49003 66790 56379 77982 66726
5207 66726 62348 29412 -22226 30279 126625 72855 3659 61154 89604 97285 93499 125433
5195 125433 151512 123730 73749 -13407 -40986 63 -84665 -68811 -18457 -18342 22352 -32269
5183 -32269 -89353 -60009 45628 86870 121947 73180 -69914 -137681 -146199 -89942 -79023 -68966
$$ packed form
5267C8071J01059p4092o9349O0262J7357m4568m4417K9408k4210O6304M9290j29233
5255b4118m6580l7384p813O579l3828N097M1887L7085p496K9312P5580n6593q8291
5242a06563m0798k8824j6385P7697K7859Q8458L7128j4716l7295L6785o8421k3826
5230f8901P626j4685p1106J09702N5691n992J6242j1069j09894j28689J0730M7168
5218a63177P4538K7278m2361L9082J28639o4003M9007J7787j0411K1603j1256
5207F6726m378l2936n1638N2505R6346n3770o9196N7495K8450P681l786L1934
5195A25433K6079k7782m9981q7156k7579M1049q4728J5854N0354J15M0694n4621
5183c2269n7084K9344J05637M1242L5077m8767j43094o7767q518N6257J0919J0057
$$ plain form
5171 -68966 -18815 -30793 -2127 1152 27674 76650 15171 -83507 -62896 8698 14609 45525
5159 45525 57036 85068 65694 47655 16284 -9669 -9937 -20550 -8208 663 27861 116644
5147 116644 71669 24856 -11114 5387 114924 134286 68595 35279 27439 -3952 -43878 -58962
5135 -58962 -92688 -143531 -142246 -78671 -114681 -70386 -32039 -83685 -111173 -108165 -22129 53259
5123 53259 21750 35936 69352 114851 115108 27744 -87565 -110848 -122900 1955 89905 53784
5111 53784 5921 -1463 -8231 -51919 -111660 -33154 65271 125825 37922 11427 21197 46000
5099 46000 77593 51844 -23575 -80420 -74407 -107454 -32796 -2450 -47064 -136634 -109471 -6696
5087 -6696 31090 2737 -1259 33478 -12825 -34882 -19426 50448 55135 13195 59626 69006 -462
$$ packed form
5171f8966N0151j1978K8666L279K6522M8976o1479r8678K0611P1594N911L0916
5159D5525J1511K8032j9374j8039l1371k5953k68j0613J2342Q871K7198Q8783
5147A16644m4975m6813l5970J6501J09537J9362o5691l3316p840l1391l9926j5084
5135e8962l3726n0843J285O3575l6010M4295L8347n1646k7488L008Q6036P5388
5123E3259l1509J4186L3416M5499K57q7364j15309k3283j2052J24855Q7950l6121
5111E3784m7863p384o768m3688n9741P8506R8425O0554q7903k6495R770K4803
5099D6000L1593k5749p5419n6845O013l3047P4658L0346m4614q9570K7163J02775
5087f696L7786k8353l996L4737m6303k2057J5456O9874M687m1940M6431R380o9468
$$ plain form
5074 -462 -41307 -29356 -34097 -128552 -176530 -57957 -22029 84836 6247 -43526 -61923 -61680
5062 -61680 15860 16755 -24822 -70758 -132807 -42253 24820 30813 -15149 -25020 -494 -20192 11305
5049 11305 -4084 -63768 -197116 -221947 -148983 -92596 -79621 -74391 -75491 -146973 -159627 -45010
5037 -45010 -39956 15269 93232 108039 50757 39823 47352 29209 45109 15123 9871 -34146
5025 -34146 -63418 -98109 -129191 -186517 -181656 -107412 -99273 -65741 -126325 -110989 -108374 -121460
5013 -121460 -60087 16416 16228 31085 50979 2014 -43869 -21384 -49097 -14562 -22553 -50271
5001 -50271 -63412 -86842 -87187 -100212 -18787 56509 35753 -16391 30522 16256 -10122 101333
4989 101333 173875 137977 69058 51797 88802 105045 -648 -78868 -97126 -81065 -42968
$$ packed form
5074d62m0845J1951m741r4455m7978J18573L5928J06865p8589m9773j8397K43
5062f1680P7540Q95m1577m5936o2049R0554O7073N993m5962r871K4526j9698L1497
5049A1305j5389n9684j33348k4831P2964N6387J2975N230j100p1482j2654J14617
5037d5010N054N5225P7963J4807n7282j0934P529j8143J5900k9986n252m4017
5025c4146k9272l4691l1082n7326M861P4244Q139L3532o0584J5336K615j3086
5013a21460O1373P6503j88J4857J9894m8965m5883K2485k7713L4535p991k7718
5001e0271j3141k3430l45j3025Q1425P5296k0756n2144M6913j4266k6378J11455
4989A01333P2542l5898o8919j7261L7005J6243j05693p8220j8258J6061L8097
$$ plain form
4978 -42968 -10825 -104283 -154239 -192897 -166601 -103724 -91845 -65279 -43515 -55419 -112191 -89236
4966 -89236 -19878 14523 -17893 -17372 32492 77555 16979 -148536 -213729 -225631 -110914 -64861
4954 -64861 -6696 35218 35273 101338 140325 131807 94799 86718 84707 -30091 -47586 -6098 -27158
4941 -27158 -88157 -99921 -43155 -47734 -54793 3309 -37628 -135244 -146954 -72197 -57318 -18081
4929 -18081 -53041 17809 -18554 -103857 -52430 -58192 -61435 -73504 -93023 6755 -28388 1744
4917 1744 39423 28583 59517 38862 54458 22366 -59961 -141966 -171137 -119656 -99930 -30546
4905 -30546 -14715 -38548 21454 32294 59378 58519 49005 88964 123694 -4750 -12548 -18915 -10876
4892 -10876 17749 84839 66758 -62619 -68604 -34498 -70709 -113825 -129568 -116199 -61644 -16790
$$ packed form
4978d2968L2143r3458m9956l8658K6296O2877J1879K6566K1764j1904n6772K2955
4966h9236O9358L4401l2416N21M9864M5063o0576j65515o5193j1902J14717M6053
4954f4861N8165M1914N5O6065L8987q518l7008q081k011j14798j7495M1488k1060
4941b7158o0999j1764N6766m579p059N8102m0937r7616j1710P4757J4879L9237
4929a8081l4960P0850l6363q5303N1427n762l243j2069j9519R9778l5143L0132
4917A744L7679j0840L0934k0655J5596l2092q2327q2005k9171N1481J9726O9384
4905c0546J5831k3833O0002J0840K7084q59r514L9959L4730j28444p798o367Q039
4892a0876K8625O7090j8081j29377n985L4106l6211m3116j5743J3369N4555M4854
$$ plain form
4880 -16790 66379 68647 11552 -71962 -73971 -80945 -88721 -34950 -58098 -161864 -158506 -94240 52394
4867 52394 180029 240822 155269 106626 14476 -75290 -97461 -123928 -77764 -92138 -12735 53574
4855 53574 68881 69882 100234 192848 177101 148215 238897 198904 159681 96747 3864 -27172
4843 -27172 18070 28117 37172 -9296 -35544 12246 19848 -11429 -64711 -98983 -155950 -66964
4831 -66964 -24665 11593 11459 42832 32654 39311 48762 48518 32113 55565 80024 112832 64180
4818 64180 -8692 5258 -13052 -12168 12233 99374 72219 71898 89818 41179 6164 65489 111781
4805 111781 60643 -14170 18937 71937 107608 78865 -25002 -22021 -29432 -15849 64957 89787
4793 89787 46298 -1110 -53251 -143839 -115114 -56362 -24866 -23043 -40867 15419 15231 -40340
$$ packed form
4880a6790Q3169K268n7095q3514k009o974p776N3771k3148j03766L358O4266J46634
4867E2394J27635O0793q5553m8643r2150q9766k2171k6467M6164j4374P9403O6309
4855E3574J5307J001L0352R2614j5747k8886R0682l9993l9223o2934r2883l1036
4843b7172M5242J0047R055m6468k6248M7790P602l1277n3282l4272n6967Q8986
4831f6964M2299L6258j34L1373j0178O657R451k44j6405K3452K4459L2808m8652
4818F4180p2872J3950j8310Q84K4401Q7141k7155l21J7920m8639l5015N9325M6292
4805A11781n1138p4813L3107N3000L5671k8743j03867K981p411J3583Q0806K4830
4793H9787m3489m7408n2141r0588K8725N8752L1496J823j7824N6286j88n5571
$$ plain form
4781 -40340 -11291 82797 46594 22088 6102 -9319 -15579 -25053 10507 29849 13075 -2240
4769 -2240 -17598 -32735 -87435 -99529 -101155 -46016 -20940 -33523 -68758 -24612 49062 93571
4757 93571 68409 33519 -77062 -106333 -150859 -232875 -207410 -99720 -11602 -17105 -18763 -39060
4745 -39060 24126 28024 4379 59320 25475 51961 20414 -15767 73744 120937 152908 55909
4733 55909 -52663 -43105 -83279 -90301 -63470 -40872 -64220 -109359 -35762 1656 1629 -2123 19300
4720 19300 -34296 -143798 -143419 -94109 -36504 -101779 -156423 -104623 34349 130083 192223 151583
4708 151583 122514 151966 129211 77995 55263 34803 5364 -39015 17660 57079 21904 -23641
4696 -23641 -40733 3693 12779 86 -5028 30901 42171 35628 10546 -11020 12954 30691
$$ packed form
4781d0340K9049R4088l6203k4506j5986j5421o260r474L5560J9342j6774j5315
4769b240j5358j5137n4700j2094j626N5139K5076j2583l5235M4146P3674M4509
4757I3571k5162l4890j10581k9271m4526q2016K5465J07690Q8118n503j658k0297
4745c9060O3186L898k3645N4941l3845K6486l1547l6181Q9511M7193L1971r6999
4733E5909j08572R558m0174p022K6831K2598k3348m5139P3597L7418k7l752K1423
4720A9300n3596j09502L79M9310N7605o5275n4644N1800J38972R5734O2140m0640
4708A51583k9069K9452k2755n1216k2732k0460k9439m4379N6675L9419l5175m5545
4696b3641j7092M4426R086j2693n114L5929J1270o543k5082k1566K3974J7737
$$ plain form
4684 30691 -57508 -84746 -5916 33710 -67286 -61340 -13092 42249 15134 36880 4836 -70534
4672 -70534 -77246 -52295 -7707 62782 36922 -32381 -69700 -56730 10782 10766 10807 -122 -26814
$$ packed form
4684C0691q8199k7238P8830L9626j00996N946M8248N5341k7115K1746l2044p5370
4672g0534o712K4951M4588P0489k5860o9303l7319J2970O7512j6M1j0929k6692
$$ [...]
##END NTUPLES=NMR SPECTRUM
##END=
