##TITLE=Analysis number 318097
Compound Code mo 00950
Project Code adrs
Chemist Name fudan
##JCAMPDX= 6.0         $$ Bruker NMR JCAMP-DX V2.0
##DATA TYPE= NMR SPECTRUM
##DATA CLASS= NTUPLES
##ORIGIN= Bruker BioSpin GmbH
##OWNER= nmr
$$ XWIN-NMR		Version 3.5
$$ Wed Mar 15 11:14:51 2006 GMT Standard Time (UT+0h)  MAYBRIDGE\nmr@NMR_250MHZ
##.OBSERVE FREQUENCY= 250.131544655141
##.OBSERVE NUCLEUS= ^1H
##.ACQUISITION MODE= SIMULTANEOUS (DQD)
##.ACQUISITION SCHEME= undefined
##.AVERAGES= 16
##.DIGITISER RES= 18
##SPECTROMETER/DATA SYSTEM= dpx250
##.PULSE SEQUENCE= zg30
##.SOLVENT NAME= CDCl3
##.SHIFT REFERENCE= (INTERNAL, CDCl3, 0, 16.522)
##AUDIT TRAIL= $$ (NUMBER, WHEN, WHO, WHERE, WHAT)
$$ ##TITLE= Audit trail, XWIN-NMR		Version 3.5
$$ ##JCAMPDX= 5.01
$$ ##ORIGIN= Bruker BioSpin GmbH
$$ ##OWNER= nmr
$$ C:\u/data/dgb/nmr/ADRS/720/pdata/1/auditp.txt
$$ ##AUDIT TRAIL=  $$ (NUMBER, WHEN, WHO, WHERE, WHAT)
(   1,<2006-03-15 11:14:29.32 +000>,<MAYBRIDGE\nmr>,<NMR_250MHZ>,
      <created by zg, POWCHK disabled, PULCHK disabled
       configuration hash MD5:
       84 BC 41 DB A1 6E 1D 46 DA 25 12 A5 C1 ED C5 3A
       data hash MD5: 64K
       2F 8C 30 78 77 83 C2 FF 49 4C EF D9 80 2A D2 E4>)
(   2,<2006-03-15 11:14:43.60 +000>,<MAYBRIDGE\nmr>,<NMR_250MHZ>,
      <Start of raw data processing
       ef LB = 0.3 FT_mod = 6 PKNL = 1 SI = 32K 
       data hash MD5: 32K
       A2 23 B6 28 20 9B CC BA 4A 0F AC CE 7F 08 13 C5>)
(   3,<2006-03-15 11:14:45.13 +000>,<MAYBRIDGE\nmr>,<NMR_250MHZ>,
      <apk 
       data hash MD5: 32K
       A3 BF B6 AA F4 8C 36 0A 6B 16 4A D4 1C 8F DE 6F>)
(   4,<2006-03-15 11:14:45.98 +000>,<MAYBRIDGE\nmr>,<NMR_250MHZ>,
      <abs ABSG = 5 
       data hash MD5: 32K
       AC B1 8D 10 9D 66 B0 1C F1 A3 19 A7 7B EF 09 A1>)
$$ ##END=
$$ 
$$ hash MD5
$$ 11 53 F7 09 C1 7D 61 23 CD AE 66 37 28 03 2B B6
##$RELAX= 
##$RELAX= 
##$RELAX= 
##$RELAX= 
##$RELAX= 
##$RELAX= 
##$RELAX= 
$$ Bruker specific parameters
$$ --------------------------
##$DU= <C:\u>
##$EXPNO= 720
##$NAME= <ADRS>
##$PROCNO= 1
##$TYPE= <nmr>
##$USER= <dgb>
##$AMP= (0..31)
100 100 100 100 100 100 100 100 100 100 100 100 100 100 100 100 100 100 
100 100 100 100 100 100 100 100 100 100 100 100 100 100 
##$AQSEQ= 0
##$AQ_mod= 3
##$AUNM= <au_zg>
##$AUTOPOS= <17 >
##$BF1= 250.13
##$BF2= 250.13
##$BF3= 250.13
##$BF4= 250.13
##$BF5= 500.13
##$BF6= 500.13
##$BF7= 500.13
##$BF8= 500.13
##$BYTORDA= 1
##$CFDGTYP= 0
##$CFRGTYP= 5
##$CHEMSTR= <none>
##$CNST= (0..31)
1 1 145 1 1 1 1 1 1 1 1 1 1 1 1 1 1 1 1 1 1 1 1 1 1 1 1 1 1 1 1 1 
##$CPDPRG= <>
##$CPDPRG1= <>
##$CPDPRG2= <>
##$CPDPRG3= <>
##$CPDPRG4= <mlev>
##$CPDPRG5= <mlev>
##$CPDPRG6= <mlev>
##$CPDPRG7= <mlev>
##$CPDPRG8= <mlev>
##$CPDPRGB= <>
##$CPDPRGT= <>
##$D= (0..31)
0 1 0 0 0 0 0 0 0 0.06 0 0 0 0 0 0 0.0002 0 0 0 0 0 0 0 0 0 0 0 0 0 0 
0 
##$DATE= 1142421268
##$DBL= (0..7)
120 120 120 120 120 120 120 120 
##$DBP= (0..7)
150 150 150 150 150 150 150 150 
##$DBP07= 0
##$DBPNAM0= <>
##$DBPNAM1= <>
##$DBPNAM2= <>
##$DBPNAM3= <>
$$ [...]
##$SUBNAM7= <"">
##$SUBNAM8= <"">
##$SUBNAM9= <"">
##$SW= 20.6930455092707
##$SWIBOX= (0..15)
0 0 3 0 0 0 0 0 0 0 0 0 0 0 0 0 
##$SW_h= 5175.983436853
##$TD= 65536
##$TD0= 1
##$TE= 294.16
##$TE2= 300
##$TE3= 300
##$TEG= 300
##$TL= (0..7)
0 120 120 120 120 120 120 120 
##$TP= (0..7)
150 150 150 150 150 150 150 150 
##$TP07= 0
##$TPNAME0= <>
##$TPNAME1= <>
##$TPNAME2= <>
##$TPNAME3= <>
##$TPNAME4= <>
##$TPNAME5= <>
##$TPNAME6= <>
##$TPNAME7= <>
##$TPOAL= (0..7)
0.5 0.5 0.5 0.5 0.5 0.5 0.5 0.5 
##$TPOFFS= (0..7)
0 0 0 0 0 0 0 0 
##$TUNHIN= 0
##$TUNHOUT= 0
##$TUNXOUT= 0
##$USERA1= <user>
##$USERA2= <user>
##$USERA3= <user>
##$USERA4= <user>
##$USERA5= <user>
##$V9= 5
##$VALIST= <valist>
##$VCLIST= <CCCCCCCCCCCCCCC>
##$VD= 0
##$VDLIST= <DDDDDDDDDDDDDDD>
##$VPLIST= <PPPPPPPPPPPPPPP>
##$VTLIST= <TTTTTTTTTTTTTTT>
##$WBST= 1024
##$WBSW= 4
##$XGAIN= (0..3)
0 0 0 0 
##$XL= 0
##$YL= 0
##$YMAX_a= 323456
##$YMIN_a= -458510
##$ZGOPTNS= <>
##$ZL1= 120
##$ZL2= 120
##$ZL3= 120
##$ZL4= 120
##$ABSF1= 16.522
##$ABSF2= -4.171173
##$ABSG= 5
##$ABSL= 3
##$ALPHA= 0
##$AQORDER= 0
##$ASSFAC= 0
##$ASSFACI= 0
##$ASSFACX= 0
##$ASSWID= 0
##$AUNMP= <proc_1d>
##$AZFE= 0.1
##$AZFW= 0.1
##$BCFW= 0
##$BC_mod= 0
##$BYTORDP= 0
##$COROFFS= 0
##$CY= 12.5
##$DATMOD= 1
##$DC= 0
##$DFILT= <>
##$DTYPP= 0
##$F1P= 14.0000005364418
##$F2P= -0.99999901652339
##$FCOR= 0.5
##$FTSIZE= 32768
##$FT_mod= 6
##$GAMMA= 0
##$GB= 0
##$INTBC= 1
##$INTSCL= 1
##$ISEN= 128
##$LB= 0.3
##$LEV0= 0
##$LPBIN= 0
##$MAXI= 10000
##$MC2= 0
##$MEAN= 0
##$ME_mod= 0
##$MI= 0
##$NCOEF= 0
##$NC_proc= -4
##$NLEV= 6
##$NOISF1= 0
##$NOISF2= 0
##$NSP= 0
##$NTH_PI= 0
##$NZP= 0
##$OFFSET= 16.522
##$PC= 1
##$PHC0= 170.9832
##$PHC1= 7.104483
##$PH_mod= 1
##$PKNL= yes
##$PPARMOD= 0
##$PSCAL= 4
##$PSIGN= 0
##$REVERSE= no
##$SF= 250.13
##$SI= 32768
##$SIGF1= 0
##$SIGF2= 0
##$SINO= 400
##$SIOLD= 32768
##$SREGLST= <1H.CDCl3>
##$SSB= 0
##$STSI= 32768
##$STSR= 0
##$SW_p= 5175.98343685301
##$SYMM= 0
##$S_DEV= 0
##$TDeff= 65536
##$TDoff= 0
##$TI= <Analysis number 999999
Compound Code 99
Book Reference 9
Project Code 9>
##$TILT= no
##$TM1= 0
##$TM2= 0
##$TOPLEV= 0
##$USERP1= <user>
##$USERP2= <user>
##$USERP3= <user>
##$USERP4= <user>
##$USERP5= <user>
##$WDW= 1
##$XDIM= 32768
##$YMAX_p= 470662360
##$YMIN_p= -319611
$$ End of Bruker specific parameters
$$ ---------------------------------
##NTUPLES= NMR SPECTRUM
##VAR_NAME=  FREQUENCY,     SPECTRUM/REAL,   SPECTRUM/IMAG
##SYMBOL=    X,             R,               I
##VAR_TYPE=  INDEPENDENT,   DEPENDENT,       DEPENDENT
##VAR_FORM=  AFFN,          ASDF,            ASDF
##VAR_DIM=   32768,         32768,           32768
##UNITS=     HZ,            ARBITRARY UNITS, ARBITRARY UNITS
##FACTOR=    0.157963299565203, 1,           1
##FIRST=     4132.6476996994, 0,             0
##LAST=      -1043.33573715361, 0,           0
##MIN=       -1043.33573715361, -319611,     0
##MAX=       4132.6476996994, 470662360,     0
$$ Real data points
##PAGE= N=1
##DATA TABLE= (X++(R..R)), XYDATA
$$ [...]
24299A0059l4026k2638k188K7311J8356O913O71P098K514K508j4546O025R902
24286A7959M965j5748j8977m694l51J2633M3076N871J2512P19L027k5283o3273
24273b7564l1081L0618J8580l482j2614J6203L8548L8584J9052l8148l7840k9064
24261a8208q604J9821L508K0463J0464J4910J5553J3530j9791o368K4816J3341
24249H3435k0732l1957n1212K3500J4544J7274M901k3047l5021j0572J3342j06
24237a5651K025O0457j1771j5914K2976R838j4096k0164j5539j842J1593k1815
24225i903l6107J1349L0780K0243l675l1504j5652M7211K9399j843O902k7452
24213A9748k5454q896L8544R941l4177j65j4263N089P116J691l689K1673J8410
$$ y = [10059, -23967, -46605, -48793, -21482, -3126, 3787, 4458, 11556, 14070, 16578, 2032, 8057, 17959, 22924, 7176, -11801, -16495, -16846, -4213, 38863, 44734, 57246, 57965, 60992, 35709, -27564, -58645, -28027, -9447, -12929, -25543, -9340, 29208, 67792, 86844, 48696, 10856, -18208, -26812, -6991, -3483, 16980, 27444, 42354, 57907, 71437, 51646, 45278, 70094, 83435, 62703, 30746, -20466, 3034, 17578, 34852, 39753, 16706, -18315, -28887, -15545, -15651, -13626, 46831, 35060, 19146, 42122, 51960, 37864, 17700, 2161, 319, 11912, -9903, -46010, -34661, -3881, 16362, 12687, -18817, -34469, 12742, 42141, 40298, 47200, 19748, -5706, -14602, 23942, 33883, -294, -459, -14722, -9633, -2517, -826, -4515, 17158, 35568]
24200C5568j0195j9424j6164j3342n651J0529M948Q240K2329j5979k7895k7890
24188e4926N875K501J176Q771L20m284q857J8136K4246K5195m488J4807J1831
24175D0303k0470m4952o663M7015K7062J0252Q55j4174j1762K462J121J6410r679
24162C7780j5984j2595j613P854j0564M680J2969P767j1877j9938M15N990l95
24149D489j082o386r630k4947K2511l362j3307J1384o519k4174r470K9394j439
24136c2538J5527M4698K6602k0517j2297j1563o449L3583r608o875j3908K4736
24124C1391L868O232r784k2654k7778m913K580K0531J2568k3407l8656l960J9014
24111c4968L50k060K9684K0974j6819J6223o407k8707k8996J7705L9850J3236
$$ y = [35568, 25373, 5949, -10215, -23557, -29208, -18679, -13731, -5491, 16838, 859, -27036, -54926, -49051, -46550, -45374, -36603, -36283, -40567, -49424, -31288, -7042, 18153, 13665, 28472, 40303, 19833, -25119, -31782, 15233, 42295, 52547, 53402, 39228, 27466, 29928, 31049, 47459, 37780, 21796, 9201, 7588, 15442, 4878, 9558, 22527, 30294, 18417, -1521, -1106, 4884, 4489, 3407, -2979, -12609, -37556, -15045, -18407, -31714, -20330, -26849, -51023, -60493, -31099, -32538, -17011, 27687, 54289, 33772, 21475, 9912, 3463, 37046, 27438, 20563, 6655, 31391, 35259, 41491, 31707, 9053, -18725, -23638, -21058, -527, 12041, -11366, -50022, -53982, -34968, -34618, -36678, -6994, 13980, -2839, 13384, 6977, -21730, -50726, -33021, 6829, 20065]
24099B0065j185J3630J2699p659j5088Q523J12p265j6473Q3p28k209j2509L387
24085d617j0033K705K4542K7272j3847l1453l6666N58J9945j9791k851K3379j864
24072b2721L527K2499N177q456m726L211O619k1487J2597l285k5651R407J0990
24059a2299o327J8583J071N180q049Q203M993K3125J2411p525m767q289J3723
24046D0033J3890K912q234j4341l9j2297K134J1396O654j4012j1340K0590L444
24033D0790l1987j6202K6911J9728R326J162J271n908k702J766l0737j1312N469
24020G575Q197J0817P024j1299R290J3960k6990k4293j1084P547k604J0829m385
24007e416J2162J7057j5526k3197O946Q242R685J900m060J121L029j466k8596
$$ y = [20065, 18880, 32510, 45209, 37550, 22462, 30985, 31097, 23832, 7359, 7442, 6714, 4505, -8004, -4617, -14650, -11945, 12597, 39869, 26022, -5431, -42097, -41539, -21594, -41385, -44236, -20857, -22721, -19194, 3305, 8482, 26, -4700, -1489, 5130, -16357, -3760, -7045, -32696, -23289, -12299, -18626, -43, 1028, 6208, -1841, 6362, 11355, 34480, 46891, 39366, 34599, 26310, 40033, 53923, 56835, 48601, 34260, 34221, 21924, 24058, 35454, 42108, 28096, 16756, 37346, 40790, 8803, -7399, 19512, 39240, 48566, 49728, 50999, 45091, 42389, 44155, 13418, 2106, 7575, 15772, 26589, 33613, 22314, 31604, 45564, 18574, -5719, -16803, -9256, -11860, -1031, -5416, 6746, 23803, 8277, -14920, -7974, 268, 9953, 11853, 7793, 8914, 11943, 10477, -18119]
23994a8119r378n364J3231j835j2195j9505J2918J6832J6940J3551k476L447j5186
23981g139l1208q743m965l724J1768K7121K5686J5460M187j7850k2332j0050m597
23968b6386L7263j714N007m636O778J8110j5891O032J0896j1207M216k8851l2734
23955c3117J8319O506K7775j774K867Q514p675N677L1900j537j0187k3113J0645
23942C4800M520m809P2j2460j6261K468J0275N795l6088r970l1354j5444J6724
23929e1732K1368K4962j6409M74J2980k3344k0266J7217M869O982Q879J1010l312
23916f322N039q204P233L6475o091j6613J9479J0094k2094j6226R233n764O944
23903A3183P146k0299j4776J4703O223o181j7078J4279P279j546J8309J0287J1768
$$ y = [-18119, -27497, -32861, -19630, -21465, -33660, -53165, -40247, -23415, -6475, 7076, 4600, 8047, -7139, -38347, -47090, -52055, -55779, -44011, -16890, 8796, 24256, 28443, 10593, -11739, -21789, -26386, 10877, 9163, 14170, 9534, 16312, 34422, 18531, 24563, 35459, 24252, 28468, -383, -33117, -14798, -8292, 19483, 17709, 20576, 29090, 21415, 27092, 58992, 57455, 47268, 24155, 34800, 39320, 34511, 34583, 22123, 5862, 8330, 18605, 24400, -11688, -21658, -53012, -68456, -51732, -30364, -5402, -21811, -21337, -8357, -31701, -51967, -34750, -29881, -22899, -14020, -3010, -6322, -1283, -9487, -2254, 34221, 28130, 11517, 30996, 41090, 18996, 2770, 12003, 6239, 13183, 20329, 30, -14746, -43, 6180, -1, -17079, -2800, 4479, 2933, 21242, 31529, 43297]
23890D3297J077k2384l7169J015j5635O372J7365K2328l753j3500L417K9358K837
23877C4625j5910M925K3004k6081j9627j3346L135k069j7260J3085K955J1967
23865e97L747j7582k760K9686J2165J9293p038l4920j7311j5813J1690l618j8220
23852d1278M3359K2466k0828j2233j7227L21J6721M097J9207J5873K6254j5929
23840D0803j6971J8146p558l466k2583Q072k5161O868J7579j6276j619L9301K1408
23827E8543K4535K735k8507n452r503J2784o328k956k082j2801k4711k161J5310
23814A9406K1846k3094j6141N415L3127p28k885j6128L400j6522l7965o261K3453
23801a3077m670k2637p595K4974J7115k2320Q878J5509k7064N440J4987L1391
$$ y = [43297, 44374, 21990, -15179, -14164, -29799, -23427, -6062, 16266, 12513, -987, 2430, 31788, 34625, 18715, 23640, 46644, 20563, 936, -12410, -9275, -11344, -28604, -15519, -12564, -597, 3150, -14432, -17192, 12494, 24659, 43952, 36914, 1994, -15317, -31130, -19440, -23058, -41278, 2081, 24547, 3719, -8514, -25741, -25420, -8699, -4602, 14605, 30478, 56732, 40803, 23832, 41978, 34420, 30954, 8371, 16443, -8718, -1850, 15729, -547, -2166, 37135, 58543, 83078, 85813, 57306, 51854, 42351, 55135, 48807, 45851, 43769, 30968, 6257, 4096, 19406, 41252, 18158, 2017, 7432, 40559, 39831, 36946, 20818, 24218, 7696, -30269, -36530, -13077, -17747, -40384, -47979, -23005, -5890, -28210, -19332, -3823, -30887, -25447, -10460, 20931]
23789B0931k8019p454Q672k1417J73K2503k164j7694p062Q517K4848N941j7297
23776i522J8331k902j3515J7077M586J7503k3855K2302L255k7253j7135K7131
23764A6003L3443N573k1928K030k0241l9792J3411n19J3032p157k1991j9540L958
23751d3718k709J0227K0875K1433K0634p96q293m110J5364K3515k4060m367l500
23738B0495k2855J1823j2711l8037n842K3990K2319J8262j6702k603K885J2675
23726A3699P934Q306o288j7282k8336k990K6204J7465K8685J7356k6509m8589
23714a0345j8908K90j680P218n83J0351j4425k0067M0632P815j6934k3309K144
23701c7801J9170L987J3833J0584M115J292o774l1448p487j7033J8252J8585j3179
$$ y = [20931, -7088, -14542, -5870, -27287, -27114, -4611, -6775, -24469, -31531, -23014, 1834, 7775, -9522, 8809, 5907, -7608, 9469, 14055, 31558, 7703, 30005, 33260, 6007, -11128, 16003, 49446, 55019, 33091, 35121, 14880, -24912, -11501, -12020, 1012, -6145, -28136, -47676, -43718, -46427, -36200, -15325, 6108, 26742, 25946, 17653, 13543, 28907, 52422, 28362, 23995, 20495, -2360, 9463, -3248, -41285, -47127, -23137, -818, 17444, 742, -1861, 1024, 13699, 21633, 29939, 23651, 6369, -21967, -24957, 1247, 18712, 47397, 64753, 38244, -10345, -29253, -28963, -30643, -23425, -24008, -13657, -28082, -48149, -7517, 298, -16636, -39945, -37801, -18631, -14644, -811, 9773, 13888, 15180, 8406, -23042, -30529, -47562, -29310, -10725, -23904]
23688b3904m868K8004J5431p393P55J2287r468j9013k0584P50J7818j5730k8280
23675e4195J720K1196L0101N880j0860K3638m400j6684P902Q370Q92k201O046
23662A7405J0977N428P766m426l8313l5820J672N2452J6151k9613q504J8054R674
23649B2903r267M892J2885J3234J7565j8718l7403J2568r469k3800k1991j988
23637c8589L663r852K1832N36J9510K3857j0490l3766p716J4527J2493j0263j5155
23624b9413K5187J6460k9271l727j688J4246J5417n417k969L7190j7512k5554
23612g051l281j3197j4749k207L0097J4253j2321K586J3137R915j7529o288K587
23599d048j2486J206L2447J1656J4686j1078j6109j7897q124l200k6715j5703
$$ y = [-23904, -28772, -768, 14663, 7270, 8025, 20312, 10844, -8169, -28753, -28003, -10185, -25915, -54195, -52475, -31279, -1178, 4702, -6158, 17480, 13080, -3604, 4298, 12668, 13560, 11359, 17405, 28382, 33810, 41576, 37150, -1163, -36983, -35311, 17141, 33292, 3679, -4825, 13229, 22903, 13636, 18528, 31413, 44647, 62212, 43494, 6091, 18659, 9190, -14610, -36601, -38589, -34926, -44778, -22946, -22410, -2900, 20957, 10467, -23299, -31015, -16488, -3995, -14258, -29413, -4226, 12234, -17037, -20764, -22452, -8206, 7211, 1794, -1175, 36015, 18503, -7051, -10332, -23529, -38278, -40485, -10388, 3865, -8456, -5870, 7267, 17182, -347, -6635, -4048, -16534, -15328, 17119, 28775, 43461, 32383, 16274, -1623, -9747, -12947, -39662, -55365]
23587e5365L3505K7521K4079K3750N076J806j9952j4102L922j1441m6067k0145
23575d7413J3028J0239P541K186K3667J6052k0028J3896k247m0140J037K7131
23563D949j8820J499J8500L742K5199q9J6085J9514r210R548o553m066j6235k9849
23549A4214k9014l610K4089Q682J1584J3949q036j2026N571l000j7763J489q317
23536b188j6018K0515K444l0803m3481J1925L1901J794K2026L927M256R822k8221
23523a2101k961p272q822q050k934K4387L0346J2836l3499j7358P822K579R267
23510e760R890l062j1661k2996p110J9838J6454J8744Q370j7047j0649J0866R646
23497A5523M750l1131r890M966J2516p840P282L3162J8109j3905J9859R174k1875
$$ y = [-55365, -21860, 5661, 29740, 53490, 58566, 60372, 40420, 26318, 30240, 18799, -27268, -47413, -34385, -24146, -16605, -14419, 9248, 25300, 5272, 19168, 16921, -23219, -22182, 4949, -13871, -12372, 6128, 9870, 35069, 34980, 51065, 70579, 61369, 70917, 64364, 60298, 44063, 14214, -14800, -18410, 5679, 14361, 25945, 39894, 31858, 19832, 25403, 22403, 4640, 6129, -2188, -18206, 2309, 4753, -26050, -69531, -57606, -25705, -23911, -1885, 2042, 6298, 16120, -12101, -15062, -22334, -31156, -39206, -42140, -17753, 12593, 25429, -8070, -25428, -17606, -15027, -5760, 4130, 1068, -10593, -33589, -40699, -20861, -4407, 14337, 22707, 5660, -4989, 5877, 15523, 20273, -10858, -20748, -15782, -3266, -11106, -3824, 29338, 47447, 33542, 53401, 62575, 40700]
23484D0700l1663j954K0977J5718r516k1083l0676p306K6303L2496K898k7662
23472I232j3240J1933J6436q275K005n684R30R962k8758m979P088n721k0145k2717
23458e1933P616n731j0573K3048j5020K2390M2380J7846P0j7960j5886J0208N068
23445A1523n160k260j202k4479K613n114n229j628P447o187J111K711K6568j6381
23431a5667o979m15L0685Q123L5263P060k3885l0810k1506K1049K5898J7346j6326
23418B9836l8064K06k2722q196L7953j262l5996N742j995Q931K6740L8679J9271
23405E9123k0663l0953K1263K4408l4025l2982k0867j7703j2452O93J8959K3461
23393b1738J7708n313l3609j9265M2401K9705o650j6460o662k804r634M2026J2803
$$ y = [40700, 9037, 7083, 28060, 43778, 34262, 13179, -17497, -24803, 1500, 33996, 36894, 9232, -4008, 7925, 24361, 16086, 18091, 12407, 13337, 23299, -5459, -10438, -3350, -9071, -29216, -51933, -44317, -50048, -60621, -37573, -52593, -30203, 12177, 30023, 30093, 12133, -3753, 6455, 11523, 6363, 4103, 2901, -21578, -18965, -24079, -29308, -30936, -23489, -29676, -28565, -25854, 714, -15667, -22646, -23061, 7624, 15747, 51010, 58070, 34185, 3375, -18131, 2918, 28816, 46162, 29836, -8228, -8022, -30744, -38940, -987, -2249, -38245, -32503, -34498, -25567, 1173, 39852, 59123, 38460, 7507, 28770, 53178, 19153, -13829, -34696, -52399, -64851, -64158, -45199, -21738, -4030, -9343, -42952, -62217, -19816, 9889, 3239, -13221, -19883, -22687, -32321, 9705, 22508]
23380B2508k8994k8713j5883M7703Q887l192r818j8474p431J5337L968K8336K6117
23367D0351j7796r863j9501J3988j1199q44M68L744o307O932j284P887K2455P376
23353C6407l6933j4056Q938J29n163k536k6020R166J2903J3331J5824k598M708
23340A4100L3969p217j7593j0415k5073O361O007o787k008l565j346m00R745o620
23326a0842n758M7888N95p626l4279m4256K351J3163J3038J4217J758K6782m048
23313A2983j6456R147M39k4232J8729L1521k7872l8572J0541J6451J1591N831
23301A0101k90R563j9997j8775k2360p99m951O730M2212J383K563Q117l491j0006
23287@l981M677Q165P725R408p136l9716K989L1070p666k1338O933L318r906o703
$$ y = [22508, -6486, -35199, -51082, -3379, 5508, 2316, -7502, -25976, -33407, -18070, -14102, 14234, 40351, 22555, 12692, -6809, 7179, -4020, -4864, -4396, -652, -6959, -27, -1311, 6576, 29031, 36407, -526, -14582, -5644, -5515, -10678, -13214, -39234, -30068, -17165, -3834, 11990, 9392, 14100, 48069, 40852, 23259, 12844, -12229, -5868, 139, -6648, -8656, -12221, -13567, -13967, -4222, -10842, -16600, 31288, 31883, 24257, -10022, -54278, -51927, -38764, -25726, -11509, -9751, 17031, 12983, -3473, 5674, 6113, -18119, 610, 32131, 4259, -34313, -23772, -7321, 4270, 10101, 9811, 19374, -623, -19398, -41758, -42557, -47508, -40778, 1434, 2817, 5380, 13497, 10006, 0, -3981, 696, 8861, 16586, 25994, 18858, -20858, -17869, 13201, 5535, -15803, -8870, -5552, -15458, -22161]
23272b2161L173J8245K3316K4294k1387P741L77J6988j6834M964j1645l827j444
23259B1800L56j3959k253J1433l1549J0604J9129k5005j1221m8K2654K0757M3837
23246F6535O266n3584k0753R566N1282j4492l9896J8410o587l85Q679R663m3646
23233h942o012R166r67j530m1806J1244K2820j5571K951K064j9423L0416K3943
23220H353J3652m381k640K3708l9167N834k7918k1315M257J9092K2405M0380O132
23207D8392m6752k4390L822K1875k611L39j849n69j6511N738N611j0939l4182
23194e2026k1344L0037L3998J1885l336J995m986K0802K1064O56K904j4645P498
23181C4502k400k0017j5445M898k1459j7956J2816K8998K2930k786L558j4950
$$ y = [-22161, -18988, -743, 22573, 46867, 25480, 33221, 33598, 50586, 33752, 38716, 27071, 23244, 21800, 22156, 8197, 5944, 17377, -14172, -3568, 15561, -9444, -20665, -20713, 1941, 22698, 66535, 72801, 19217, -1536, 8030, 59312, 44820, 4924, 23334, 16747, 16362, 25041, 34704, -8942, -14954, -5788, -6755, -8285, -50091, -38847, -16027, -31598, -28647, -26583, -46006, -15590, 8353, 22005, 17624, 14984, 38692, -475, 5359, -22559, -43874, -39617, -20525, 1880, 42260, 48392, 1640, -22750, -18928, 2947, 336, 675, -1174, -1743, -18254, -12516, -6905, -17844, -52026, -73370, -43333, -9335, 2550, -786, 1209, -3777, 17025, 38089, 38745, 41649, 27004, 34502, 32102, 12085, -3360, 1538, -19921, -37877, -25061, 3937, 26867, 24081, 27639, 12689]
23169A2689q550j4186P552L2068j2678j349K7143J2776j9653j1901J6407j9083
23157B1235l3669L732n795n132m141Q565K3264k096k8199J3700J6260j6392K2912
23144A4244L5309R78l2192k9247l215q042o679j2809j3337K3378J3485n873J024
23131b2976Q270M292J0879J402K3288J987m935k8074L113J2621L5590L584p795
23118D1246n785k141k9131j1109j3788q14q193j3439K5265q728q459j2246j1105
23105e8427J4090J6375N188L1543P97j2883n209m561q549J2960j7303j284O021
23092b1242L2781j7028r504r087j1275l67Q296J789k86j0896J044L979j23m421
23078c6340K3519M998q584L22j1866k3527P929K5046J3406p702n366j252J8691
$$ y = [12689, 4139, -10047, -2495, 29573, 16895, 15546, 42689, 55465, 35812, 23911, 40318, 21235, -12434, -8702, -14497, -19629, -23770, -15205, 8059, 5963, -22236, -8536, 7724, -8668, 14244, 49553, 50531, 18339, -10908, -14123, -22165, -28844, -41653, -54990, -31612, -18127, -24000, -22976, -14706, -10414, 465, 1867, 25155, 27142, 22207, -5867, -2754, 9867, 45457, 49041, 41246, 35461, 33320, 4189, -6920, -20708, -21522, -29715, -43154, -17889, -26617, -35076, -47322, -58427, -44337, -27962, -22774, 8769, 9566, -3317, -8526, -13087, -21636, -8676, -25979, -27263, -21242, 11539, -5489, -14993, -24080, -35355, -35722, -27426, -25637, -25923, -36819, -35775, -31796, -31919, -36340, -12821, -7823, -16407, -16085, -27951, -51478, -43549, -18503, -5097, -12799, -18165, -19417, -726]
23065g26j5996L736J2373K362j6058j8847J28K0954P107J2488J4123k75j0392
23052A0977M501k0688l5566P911J0124K7792M240m034j8704L200K737l853J8815
23039G452m799j8551R33m485J6857J3241m790j846r432k3109L0535J1191l2794
23026a9597k2513M48J9342J0995o129Q611L51J0400J5098j6703j3000j9232j0388
23013d2317K4426L1732j4360j0250p307K3537L0396j789K825j9033j1560K1899
23001B8199K2296k4424j2960n316j4031k3238O102L8192m30l8481j5368L582j8045
22988e3922j3312n030n661L4260L1065J9316k4907o788M950n559K1344L1046j2720
22975A4082N693P162J5348q260m571J7297l8717n8089k4569K6190L9767k3404
$$ y = [-726, -16722, -12986, -613, 1749, -14309, -33156, -33028, -12074, -4967, 7521, 21644, 21369, 10977, 15478, -5210, -40776, -32865, -22741, 5051, 9291, 5257, -13447, -10247, -7510, -11363, 7452, 2653, -15898, -14965, -19450, -2593, 10648, 5858, 4012, -5420, -28529, 2006, 13197, -19597, -42110, -41662, -22320, -11325, -17454, -8843, -8492, 1908, 17006, 303, -12697, -31929, -42317, -17891, 13841, -519, -10769, -18076, 5461, 35857, 34068, 36893, 17860, 6300, 28199, 50495, 26071, 13111, 7795, -6236, -29474, -23372, 14820, 14390, -24091, -39459, -35877, -53922, -67234, -72264, -77925, -43665, -12600, 6716, -18191, -24979, -20029, -25588, -4244, 26802, 14082, 19775, 26937, 42285, 34025, 29454, 46751, 8034, -50055, -74624, -48434, -8667, -32071]
22963c2071j8703L166p12J540K3511j632l558R773R550L565J9368k9899N09P771
22949g822m875Q756J8903m739j3087J0132K138J1849k1705j0777K8329R961l547
22936B3516J535K425k0133j4891P104P87J0480o222j3369M368J9592K0178j965
22923C3405L408k1046k6031j7014J0668k012qJ0435J3853j8880k4144K6187J9964
22910H785p912j3227j676M763j6706Q668J3851L3307j0486j3737p605j2666P905
22897f736k26j4439J315J3438L3593j2332j8746N569M806K952J6521j864k4707
22884h56J281R103l6868n4492J3939L8690j570J7180J8380p890N269J6023K2722
22871D0911j868r175K723j7221k3769m587j0476j0909O841J526O151J0962r041
$$ y = [-32071, -50774, -47608, -48320, -46780, -23269, -24901, -28459, -18686, -9136, -5571, 13797, -16102, -15593, -7822, -12697, -3941, 14962, 10223, -2864, 7268, 9406, 21255, -450, -11227, 17102, 27063, 23516, 25051, 27476, 7343, -7548, -444, 343, 10823, 4601, -8768, -4400, 15192, 35370, 33405, 36813, 15767, -10264, -27278, -16610, -18622, -18630, -8195, 5658, -13222, -37366, -11179, 8785, 873, -12354, -14030, -9267, -25973, -17305, -3454, 29853, 19367, 5630, -1975, -14641, -6736, -6962, -21401, -20086, -6648, 26945, 14613, -4133, 1436, 6242, 9194, 25715, 23851, -856, 425, 9528, -27340, -81832, -67893, -29203, -30773, -13593, 4787, -3103, 2166, 18189, 40911, 39043, 29868, 32591, 15370, -8399, -12986, -23462, -34371, -27530, -26004, -19853, -8891, -17932]
22858a7932k000p111L110j3092J4967J4792Q666N221j7027m005o294j2628J4353
22845a8980J3026L4594j656O909r50l1245q090m193o473J0074j2474J6647J5752
22832A2941j4847m714j2935o631P610J2850J7685L0432j5584p865k0503l2933
22820c4494n845J1731N649K3246J0598K7318q837k3847k9226j1398Q754J9774
22808f577J0917J6251k7508r800J8823L0143j0473k476M507M971L781m0321l0720
22795c8482R993N3678J2778o926J823M199j9669j9074L0M99l2274J7545M731r267
22781b0416K9502p699n090R687J408K0993J409j3859k2897j1240J8054J6284l772
22768A2364J6941J0582r976k2328j4K559R97R466n961l2372K6927K156l2491k1599
$$ y = [-17932, -19932, -27043, -23933, -37025, -22058, -7266, 1400, 6621, -10406, -14411, -20705, -33333, -18980, -5954, 28640, 26984, 33893, 32943, 1698, -6392, -10585, -17058, -6984, -19458, -2811, 12941, -1906, -6620, -19555, -26186, -18576, -5726, 11959, 42391, 26807, 18942, -1561, -34494, -40339, -28608, -22959, 287, 10885, 38203, 29366, 5519, -23707, -35105, -26351, -6577, 4340, 20591, -6917, -16717, 2106, 32249, 21776, 19300, 23807, 28778, 32559, -7762, -38482, -28489, 25189, 37967, 31041, 32864, 37063, 17394, -1680, -1650, -1151, -33425, -15880, -11149, -20416, 9086, 1387, -3703, 5984, 7392, 28385, 29794, 15935, -6962, -18202, -148, 16136, 12364, 29305, 39887, 29911, 7583, 7569, 10128, 11125, 20591, 14630, -17742, 9185, 11341, -21150, -42749]
22754d2749j0396K0422K9325K6739j3940j3686q634J2120l5082j7566M8214L9279
22742C4046r702k1602k3489k756k1857j1688K6921L0365L4438K6433k4979k9522
22730F608K0872Q768l8428n619j1271M3743k411l291j710K935n759r693m2379
22717c7635j2177K0462Q908J0648k5440k4197J7825L1670J1695l0616Q46O172
22705b1839J590K0452O427O170J9215k2022k1842j3733J6744J0735o567K872n723
22692g521N657J7498J2454j2280j984j5307K459q457J0369Q688K7367L932j833
22679D1042k8038k0608l5955M705L7923M0562O155k476k2819r090l1171j2168
22667c1938p340R552N83m082k6072J1664K1516L791J1529J9000K1295j1393j7182
$$ y = [-42749, -53145, -32723, -3398, 23341, 9401, -4285, -12919, -799, -35881, -53447, -5233, 34046, 24344, 2742, -20747, -23503, -45360, -57048, -30127, 238, 34676, 61109, 36130, 6608, 27480, 36248, -2180, -7799, -19070, 24673, 22262, 18971, 17261, 20196, 14437, 4744, -37635, -49812, -29350, -20442, -9794, -35234, -59431, -41606, -9936, 1759, -28857, -28011, -21839, -20249, 203, 6630, 12800, 32015, 9993, -11849, -25582, -8838, 1897, -4670, -1798, -7521, -1864, 15634, 28088, 15808, 13824, -1483, 976, -7481, 2888, 11576, 38943, 42875, 41042, 13004, -7604, -43559, -38854, -931, 39631, 45786, 43310, 20491, 11401, -19770, -31938, -39278, -29726, -29143, -33225, -59297, -47633, -26117, -22326, -10797, 8203, 29498, 18105, 923]
22654I23L663P160p730M729k0751j5822J6690J6537r313J5748m264j4644j2072
22641a9146l8530k533O8735M0487k6191m1005m494N820R280N249j3446K8971k7406
22628a4209k74k431j9753J9237J2632N29j243L3922L825j9730m776j0920J388
22615a803K4816p00q76J4773K04j5550j8005l4195j5976n004J5086P112J3021
22602a7097l985o917m276P787J4281N722J4278j9483j6835j2815L0659K2911j2475
22589A755l3512Q207J930r587l4855j4941M0475K1012J3895P800J1346k481n584
22576E460n081J9148K988j4917N510J1356K1362j578K198l7225L046R988o958
22563A5297k7403q351R057j0569J4697N760L216k6921j1779L9913K1134L096j3107
$$ y = [923, 4586, 11746, 4016, 8745, -12006, -27828, -11138, 5399, -3914, 11834, 7570, -7074, -19146, -57676, -60209, 8526, 49013, 22822, -18183, -22677, -16857, -7577, -2328, -15774, 13197, -14209, -14483, -16914, -36667, -17430, -4798, -4269, -5512, 28410, 32235, 12505, 7729, -3191, -1803, 23013, 22313, 21437, 36210, 36414, 20864, 2859, -31336, -47312, -52316, -37230, -30118, -17097, -21082, -27999, -32275, -24488, -10207, -4485, 9793, -9690, -26525, -39340, -8681, 14230, 1755, -31757, -23550, -21620, -31207, -66062, -81003, -40528, -19516, -5621, 2179, 13525, 11044, 5460, 379, 19527, 22515, 7598, 13108, 24464, 45826, 44248, 46446, 9221, 12267, 22255, 15297, -12106, -20457, -11400, -21969, -7272, -1512, 1704, -25217, -36996, 2917, 24051, 27147, 14040]
22550A4040k6669M053J3336m993R318r436J2258j7191m456j6744K969o404Q414
22537b1505L0081R500j2361k1470j3581L208o378K3966K5901J7152J5619j4956
22525C5176r144j0781j6263J7195R587J3469R413J7813J0729q558k7243k4093
22513A7300p645o616O990M120j5359j3391J0835K8468l052j6935j1569J6153j1137
22500a838m006K5644r580J32p555j6274j820L2544M942K593k4909r068j0334J0186
22486i343K0005l0927L4223K4335k0657J9106j8884k8195m626N514R850o657K651
22473c605L074J0533J1943k0190j3914l5371k3577R59J4309L6520K5375k6568
22461b0512k0164K0460J7212j8256m0886j0124J4180K8347j7009k9737J7191K1964
$$ y = [14040, -12629, -8576, 4760, -233, 9085, -351, 11907, -5284, -9740, -26484, -23515, -29919, -21505, 8576, 18076, 5715, -15755, -29336, -26128, -32506, -8540, 17361, 34513, 50132, 35176, 26032, 15251, -1012, 16183, 25770, 39239, 48652, 66465, 77194, 68636, 41393, 17300, 9655, 3039, 10029, 14149, -1210, -14601, -3766, 24702, 21650, 4715, -6854, 9299, -1838, -5844, 19800, 10220, 10352, 2797, -13477, -15297, 17247, 22189, 24782, -127, -9195, -19529, -9343, 10662, -20265, 13958, 38293, 17636, 36742, 17858, -10337, -14963, -9449, 401, -6256, -3605, -531, 10002, 21945, 1755, -12159, -47530, -71107, -70148, -55839, -19319, 6056, -20512, -40676, -20216, -3004, -21260, -62146, -72270, -58090, -29743, -46752, -76489, -59298, -37334]
22449c7334L2909K4098r661l8924k2518J5165k910R873n088J2536J3082Q067J2645
22436A1940o729J795j2701M825j9348k8660N27L0775J4568J0640j9816K0344o891
22423A269k9534R976J9989j5721Q63J2086o966K3902J2554j3047j6676J7039K5309
22410D1043k1872j2237j4562j9027J1442L7716P119j5482J134j7889q201j1122
22398b1938j2260n038r723P570o110j8782L394R260O490K997l584L1840M7613
22385C1729R784m564Q125l0686j1160j5074l556J1007N047j4051M731N559M216
22372A107j5641J207J0203R265R229n377j5648l487K503J4702j9188l9027L9141
22359a1011K0643p676l0450O288K5209M084m626K6939o425j7239N446r991O85
$$ y = [-37334, -4425, 19673, 10012, -28912, -51430, -36265, -39175, -29302, -34390, -21854, -8772, -705, 11940, 5211, 7006, -5695, -870, -20218, -48878, -48351, -17576, -3008, 7632, -12184, 8160, 1269, -28265, -18289, 1700, -14021, -13158, -1072, -8038, 15864, 28418, 15371, -1305, 15734, 41043, 19171, 6934, -7628, -26655, -15213, 22503, 29622, 14140, 15274, -2615, -10816, -21938, -34198, -39236, -48959, -41389, -47499, -66281, -62887, -53627, -47137, -44140, -47724, -15884, 31729, 41513, 36949, 45074, 14388, 3228, -11846, -15402, -4395, 652, -13399, -8668, -3109, 1107, -14534, -13327, -3124, 6141, 15370, 9993, -5655, -9142, -6639, 8063, -11125, -50152, -11011, 9632, 1956, -28494, -22206, 3003, 7087, 2461, 29400, 22975, 5736, 11182, 1191, 1876]
22346A876J3204J3266p641j9138J6584J147k4017j6849j3951P736j1069k2923
22334f1775J9365J0399R556K3721J0542q420k4144p159o35j2082K8950J7714j4960
22321h928k6631o659L2009J9350L536J3915L1033J4355j0089l3822m526K291K0945
22308D6779k529l5407l80j5651l639j7290N132K8680P12M530J6761q315l2220
22295a2837q161k884k6493m013J1397L2375L693J6949R196j6594Q316m781J0347
22282A6510K6613j5800j4917k1363M53M6101m308l2883j6209j2699r099J5198
22270b2403L753r065j6726J0146j374J5950n235k081J2258j356k527J2628J0617
22257D585r687j5803l477J9180J0267k8881J360M937j0130j2218J4933J4721K4095
$$ y = [1876, 15080, 28346, 20705, 1567, 18151, 19298, -4719, -21568, -35519, -27783, -38852, -61775, -42410, -32011, -22455, 1266, 11808, 3388, -20756, -27915, -28550, -40632, -11682, 6032, -8928, -35559, -42218, -10209, 9141, 12677, 26592, 57625, 71980, 61891, 28069, 23543, 25834, 46779, 44250, 8843, 8463, -7188, -10827, -28117, -22985, 5695, 6407, 10937, 27698, 19383, -12837, -20998, -23882, -50375, -54388, -42991, -10616, -6923, 10026, 19222, 2628, 10944, 6163, 16510, 43123, 27323, 12406, -8957, -8504, 37597, 33289, 406, -15803, -28502, -37601, -22403, -18650, -27715, -44441, -34295, -35669, -19719, -24954, -27035, -14777, -16133, -18660, -6032, 4585, -5102, -20905, -24382, -5202, 5065, -23816, -22456, -17519, -27649, -39867, -24934, -10213, 13882]
22244A3882p926j8837k3296P20J7039n710o949P354J3532L3586J6094j7992l5373
22231a3876m149P422k3800q621q308J9140J7409Q716J0526k2012o891K7801K678
22218F035J0872R115Q421Q475k871K381k0877l4011J335J4367R153k0908k1850
22205c0363J1293J2768J0995J4847n171K763m213j9326n893J6883J6592j3484
22193G691n383j8539k4321L7410K5445R80j0826n489L1400l621j7821P310l50
22180B3886l1612k0000J7197J5534K1722J098l2526L293l5146j2301O657J1275
22168c0923K8967m43j3658K9830j6097m740p922J2677N903j4900j6960K2716j2998
22155a8548k0361k1276L2211L2000M008J1877l4550m164j4455k3555J3434J9566
$$ y = [13882, 5956, -12881, -36177, -35457, -18418, -24128, -31077, -23723, -10191, 23395, 39489, 21497, -13876, -18025, -10603, -34403, -43024, -51332, -32192, -14783, -6067, 4459, -17553, -24444, 3357, 6035, 16907, 26022, 34443, 42918, 40047, 42428, 21551, -12460, -11125, 3242, 12395, -8513, -30363, -19070, -6302, 4693, 19540, 14369, 17132, 12919, -6407, -12300, 4583, 21175, 7691, 2308, -16231, -40552, -3142, 22303, 23283, 12457, 6968, 38368, 34747, 16926, 24236, 23886, -7726, -27726, -10529, 5005, 26727, 27825, -4701, -1408, -36554, -48855, -42198, -30923, -1956, -2399, -16057, 13773, -2324, -7064, -14986, -2309, 3594, -11306, -28266, -5550, -18548, -38909, -60185, -27974, 4026, 8034, 19911, -14639, -18803, -33258, -56813, -43379, -23813]
22143b3813L0366P962J3702j6373k5899J574j621R852m14K369K8340J8686m564
22130D0167k9359j4855n131j92k6816q566J1867J3370k120O045q689k0380o076
22117e0735N338K6304J6778K0598J178P034k007K3489k2463m547j3167K5952l488
22104C0264k4649j2792n52J5662J4778N17P887J0356m002k224k8395j0159R869
22091F560o358J4416m909o335o620p404J5748n777K901n596O550K7417j2102l3169
22077a4678O122P796O299k6111k6827j5877J8733j456J8697K0421J7932J570j0336
22064B285j3836R885J2520m695o157k0446J0342L4139P185k5992j5357j2654L797
22051a8984O627q470k3638Q884O899J5381K8665J2626k7013k8371K4586K5564
$$ y = [-23813, 6553, 14515, 28217, 11844, -14055, -12481, -14102, -4250, -4664, -2295, 26045, 44731, 40167, 10808, -4047, -9178, -9370, -36186, -44752, -32885, -19515, -21635, -15590, -24279, -44659, -50735, -45397, -19093, -2315, 18283, 19461, 26495, 24488, 47977, 25514, 20967, 7800, 33752, 30264, 5615, -7177, -7729, 7933, 22711, 23228, 31115, 41471, 37469, 35245, 6850, -3309, 6560, 202, 14618, 9709, 3374, -3246, -10650, 5098, -679, 2222, -3374, 3176, 30593, 18491, -14678, -8556, -760, 5539, -20572, -47399, -63276, -44543, -45999, -27302, -6881, 11051, 12621, 2285, -11551, -1666, 10854, 6159, 2, -20444, -10102, 24037, 31222, 5230, -10127, -22781, -18984, -12357, -20827, -44465, -35581, -28682, -13301, 15364, 27990, 977, -27394, -2808, 22756]
22039B2756j0661o675k4151k9110J9097n773r929J3602J8760J7117M354j6101
22027f714O877R133R151n239N344O502J713k1785L329N142j3491m3515j0709j3480
22013f7742L0614p26K8535O280M5396n92j5251p430L752o378J2309R487j682j4733
21999B1839l181J7288j1875k4273n095P010j5617n255p981M64O953k1448l692
21986d4863L9274L5701Q757j8314j2573j964M1490L214l882m0407l5481K1704
21974g344J0297L235J5097j3556J8498L74j0323k0340j6360j1905J7861k756K2971
21961E749l005n669J2728q012k1997M604k210j2860k129j6879J1285K4517K080
21948a1798r975J5742J8618K3818J7393l4607j549l2425m6658j0318j2486Q520
$$ y = [22756, 12095, 5420, -18731, -47841, -28744, -34517, -44446, -30844, -12084, 5033, 9387, -6714, 163, 9296, 18447, 13208, 18552, 25054, 26767, 4982, 8311, 13453, -38, -43553, -54262, -67742, -37128, -37854, -9319, -3039, 42357, 41765, 26514, 19084, 22836, 16458, 28767, 38254, 36572, 21839, 18658, 35946, 24071, -202, -5297, 1713, -13904, -19159, -27140, -26676, -19723, -41171, -44863, -5589, 30112, 38869, 20555, 7982, 6018, 47508, 50722, 46840, 6433, -29048, -7344, 2953, 6188, 21285, 7729, 26227, 26601, 16278, -4062, -20422, -32327, -14466, -17222, 5749, 2744, -2925, 9803, 1791, -20206, -15602, -17812, -30672, -32801, -49680, -38395, -13878, -11798, -21773, -6031, 12587, 36405, 53798, 19191, 17642, -14783, -61441, -71759, -84245, -75725]
21936g5725K9538j105Q679K920o044M588K4854J8017L40k1021q61k0547K979J9183
21922a4205J3978j6130j5781J7179K0693O407k3254K617p405L802J391j3659N758
21909a8609K146R491k1219J96J0826J456J1646J6641k5270k7914k383k6154J1743
21896e7404K6444M3094K7725j5295J2389P587k5788p610M030j9001N857P434n303
21883D159k0083j4626k1879J5099L7452K0713l002j2857n849k2118J457K4925
21871C391J7173j4960p789j0316J7498J6922o678j6689j167J9001N59J4598k3127
21858H416q028m552o407o965J351p312P826p162K3398r651l2656P039L4620R067
21844H984J03p489o475j4569M475j0192K272J7108l14q128K9398p77j0462O098
$$ y = [-75725, -46187, -47292, -38613, -35693, -41737, -37149, -12295, 5722, 6062, -14959, -15820, -36367, -33388, -14205, -227, -16357, -32138, -14959, 5734, 12141, -11113, -8496, -15901, -12099, -10708, -24367, -18609, -16463, -6972, -28191, -27995, -17169, -15713, -4067, 12574, -12696, -40610, -42993, -69147, -57404, -30960, 12134, 39859, 24564, 36953, 44540, 18752, 11142, 15172, -3829, 2028, 9462, 4159, -15924, -30550, -52429, -37330, 122, 20835, 17833, 4976, -873, -22991, -21534, 3391, 20564, 5604, -2185, -12501, 4997, 21919, 15241, -1448, -2615, 16386, 16945, 31543, 8416, 388, -4164, -10571, -17536, -16185, -23497, -15671, -22833, 565, -9086, -41742, -34703, -83, 8984, 9087, 1598, -4877, -19446, -14971, -25163, -22891, -5783, -6097, -14225, 15173, 14396, 3934, 10032]
21830A0032k1627n211P451K3105j3154k074N412j0921r805j5112k241O036J2700
21817a5409k3150k1774J1310L0696J7832n361Q932N442k2857m852K7304j579j9903
21804a3369J0147K914J2653P096L590r220R586J0335l47j5894k4054k5925Q751
21791b3737K2330O173o713K2465k09l9052j5196L4408J1247j5812n459J6899j3260
21778e916j0608O37j4862k1112l411M0370N5855N4191L7349K8639J3721j1841
21766A63012j3250J075l7447p3606o8559k4556K492j1232l033J4890K4496M0782
21754A5064K3105m421k7435k4621J2635K0823p881k5568k1862j8734j4092j9559
21742i2546K1956R301L354L486L1260J5816L387n75R010k7273j0349K6549j677
$$ y = [10032, -11595, -16806, -9355, 13750, 596, -1478, 3934, -6987, -16792, -31904, -34145, -28109, -15409, -38559, -60333, -49023, -18327, -495, -5856, 3076, 8518, -14339, -19191, 8113, 6534, -13369, -3222, -308, 12345, 19441, 23031, 13811, 23397, 33732, 33385, 17491, -6563, -32488, -23737, -1407, 4766, -1947, 20518, 20309, -18743, -33939, 469, 11716, -4096, -9555, 7344, -5916, -16524, -15887, -30749, -51861, -55272, -14902, 40953, 95144, 132493, 161132, 174853, 163012, 149762, 150837, 113390, 39784, -28775, -53331, -50839, -62071, -65104, -50214, -25718, 15064, 38169, 33748, 6313, -18308, -5673, 15150, 7269, -18299, -40161, -58895, -72987, -92546, -70590, -61289, -57935, -54449, -23189, -7373, -3986, -4561, 4449, -22824, -33173, -6624, -8301]
21729h301J1598j9975O43n356K4462M4208j8453k6424k2910k0401J2520Q712k5876
21716d5553K4527L1653J1685l8957J3414J067m0391l1769j5910Q691k6038R015
21704i8566L9461K7158J8575L023K076J0605k1845J2380J1898k130K9152K8582
21692F0369j3130l2448q516l852q637r924J697N421Q885K5073l54j1714n386r814
21678b330k8574o894L8762J1109m3190k3490L368q049j684J281m703K1186K6116
21665a7092K1158n222k7049j2491R111r29l991L928M1601J0971P451k6567J2036
21652A2915M353j5555j8872Q133J4498L1322j4874K4693K6819o408k5919j4161
21640B6944J2998k4835j5153j1725j3624o212J1669J1994O8j656j459m16J7811
$$ y = [-8301, 3297, -16678, -16035, -21391, 3071, 47279, 28826, 2402, -20508, -40909, -28389, -19677, -45553, -21026, 10627, 22312, -16645, -3231, -2164, -42555, -74324, -90234, -81543, -107581, -98566, -59105, -31947, -13372, -10349, -8273, 2332, -19513, -7133, 4765, 2635, 31787, 60369, 47239, 14791, 6275, 2423, -6214, -16138, -14441, -9020, -135, 24938, 24584, 12870, 7484, -2330, -30904, -37798, 964, 12073, -31117, -54607, -51239, -59288, -60972, -59691, -64394, -43208, -17092, 4066, -1156, -28205, -40696, -31585, -32514, -36505, -32577, 9024, 19995, 27446, 879, 12915, 17268, 1713, -17159, -9026, 5472, 36794, 21920, 46613, 73432, 67024, 41105, 26944, 39942, 15107, -46, -11771, -25395, -31607, -19938, -7944, -7876, -9532, -10991, -11407, 6404]
21627F404k5317k404K0152K2512o427j3961J4382p70k8061j8449k265k085J3047
21614b3242K459J146l871j5100k163R268K0730J0488K893L38l427K450k1413j8079
21600c7523r339J8859L2621K4025j3142l976o856k6349L666j4724L516J1639J9209
21587A626N845L3145J8409j5675j5406k9453j7547N08J5547j1993Q19L537J883
21574h755P534Q367j4588n680L1262J5465k1026N51J5623j0469r939L083J2336
21561B3764O145J2346j7674j163j4754J4981L316l1335J2194K6249L996n341P81
21548C3505j9563l0708K3261K2288R601k1528m665L677J1616L4003J4262j9866
21536E5883n5047l2690m965K7250j8286J906j7741j1724L7219J885l9216q971
$$ y = [6404, -18913, -21317, -1165, 21347, 14920, 959, 15341, 14571, -13490, -31939, -34204, -36289, -23242, -20783, -19637, -23508, -38608, -40771, -31503, -10773, -285, 2608, 2946, -481, 1969, -19444, -37523, -46862, -28003, 4618, 28643, 15501, 11525, 4669, -21680, -18014, -32738, -29222, -17583, 1626, 7471, 40616, 59025, 43350, 27944, -1509, -19056, -18548, -3001, -14994, -14175, -10638, -8755, -1221, 7146, -7442, -13122, 18140, 33605, 12579, 13130, 28753, 18284, 8345, 11428, 23764, 29909, 42255, 24581, 23418, 8664, 23645, 26961, -4374, 7820, 34069, 38065, 32724, 33505, 13942, -16766, 6495, 28783, 38384, 16856, 12191, 15868, 27484, 61487, 75749, 55883, 836, -31854, -36819, -9569, -27855, -25949, -43690, -55414, -18195, -16310, -55526, -64497]
21524f4497J1292K5684O278J4261M123Q041j5081j6823Q108n37J7304n247J151
21511e943L129O267q85l022L139J1723O357q389l2575J1981J7450o494Q87q964
21497e339J6972J8431J1107J8796j9296n171j2160n813P882k03j9828k4364l4624
21484e3610k0247J5737J5233Q851L7922Q034k8446J1821K0493J5447o026k0448
21472D761j0411j5113j446K7004K0412j4254j8438k0427J0590Q777O514K7108
21460B5077L7229j9295j7514k47p341l300Q492k2089r010o314P447j7654n830
21447c0349j0320L0159L5754m660j8170k297k5278j3187j7209J9785L2523J1021
21435G772l2283l280m903L260r148R592J014L1547M6282K9208j7673l9086k7911
$$ y = [-64497, -53205, -27521, -21243, -6982, -2859, 5182, -9899, -26722, -18614, -19151, -1847, -7094, -5943, -2814, 3453, 2568, -454, 2685, 14408, 20765, 12376, -20199, -8218, 9232, 2738, 3625, -5339, 11633, 30064, 41171, 59967, 40671, 35500, 23340, 17527, 25409, 25206, 5378, -18986, -53610, -73857, -58120, -42887, -34036, 3886, 11920, -16526, -4705, 15788, 31235, 25209, 4761, -5650, -20763, -22209, 4795, 25207, 10953, -7485, -27912, -17322, -8545, -2031, 25077, 62306, 43011, 25497, 25250, 17909, 14609, 23101, 1012, -7998, -14312, -6865, -24519, -30349, -40669, -10510, 25244, 20584, 2414, 117, -25161, -38348, -55557, -35772, -3249, 7772, -24511, -27791, -32694, -29434, -38582, -28990, -27976, 3571, 49853, 79061, 61388, 22302, -5609]
21422e609j0588K1055R706j4236j6870O876m920J555Q361l401l057q025K3006
21409C853P208J380q206k2477k861M991Q980J0089J0919K6083J6400K4439j6206
21396F4592l4894M483j2242q174Q166r925L243L184J6214J1561j8733k1644j1597
21383e766p265j5603j9336R194n058J2122K4757K8786K4854k3195l0953j9148
21371b6611K5085k7460j4591K4349j4186J7234R816o560k588J6055J9034k1321
21359a744k4672P043J3352k1705p400l738K822K1853K18k0224m878k070P215K0795
21345a3133n99k8998j0043L1045K4850j6720j4760J2922J3828m533k7924K2028
21333a2037J7781M038j6189J1684J5583j9290o285k0044M450k3682l7441j0298
$$ y = [-5609, -16197, 4858, 14564, 328, -16542, -9666, -14586, -13031, -4670, -8071, -11128, -19153, 3853, 11061, 12441, 4235, -18242, -21103, -16112, -7132, 2957, 13876, 39959, 56359, 80798, 64592, 29698, 34181, 21939, 13765, 21931, 12006, 15249, 18433, 34647, 46208, 27475, 5831, -5766, -13031, -28634, -47970, -38776, -43834, -31712, -6955, 21831, 46685, 23490, -7463, -26611, -1526, -28986, -43577, -19228, -33414, -16180, -6364, -12924, -15512, 543, 19577, -1744, -26416, -19373, -6021, -27726, -35126, -38864, -36042, -14189, -13971, -34195, -39073, -41143, -33928, -13133, -13732, -42730, -52773, -21728, 3122, -13598, -28358, -15436, -1608, -6141, -34065, -12037, 5744, 9782, -6407, 5277, 20860, 1570, -4715, -24759, -20309, -43991, -81432, -91730]
21321i1730K1762J9297K0133M5022K487Q126j9821l0282k2095l995K4935j065
21309b7226K4819K0749M441j5550j0811j5263j0037p610Q450k186L6706L476k0960
21296a1002k2662O354J0184K392l243N166j1045O608Q765j6388L910j2934J0197
21283b3698K1879q754K817K0565M671m924k7111l0386K0836J1929n730j5665Q693
21270b4878M387J6753J4064K4947J120j3714j9513j7134m1316j2711J4322J3658
21258d0015K7524K7278J6341k8824k2586n634N854N328n887m531J5894K6858O09
21245A8209j1356K6533k700q501p7q165j7877k9245o645j447J4738M0156R53o796
21231G780m07J9376Q198k899k6325l1101j224o979k1155J9132K6503J7062O483
$$ y = [-91730, -69968, -50671, -30538, 14484, 16971, 25097, 5276, -25006, -47101, -51096, -26161, -27226, -2407, 18342, 22783, 7233, -3578, -18841, -28878, -36488, -28038, -30224, 6482, 9958, -11002, -33664, -27310, -17126, -14734, -17977, -12811, -23856, -17248, -8483, -24871, -20961, -33895, -23698, -1819, -10573, -7756, 12809, 17480, 12556, -14555, -44941, -24105, -12176, -17906, -33571, -24878, -20491, -3738, 10326, 35273, 36393, 22679, 3166, -13968, -55284, -67995, -53673, -40015, -12491, 14787, 31128, 2304, -20282, -25916, -20062, -14734, -20621, -25152, -9258, 17600, 18209, 6853, 33386, 30686, 22185, 22108, 13943, -3934, -33179, -39824, -41271, -26533, 13623, 14576, 7780, 7373, 26749, 34947, 32048, 5723, -25378, -26602, -33581, -54736, -35604, -9101, 7961, 14444]
21218A4444r796n457K2058J1243K0981o294j2553j1988l887K362j9341j8536k4051
21205d0815l525J495K5653J9195P703J4350j3169j5027J9093J0835p109j2610
21193F069l744K2571j6908o875k1967k2350J3171j4035J0522J6376j6160k0857
21181e4187j282J0939J1134J6879J7789J0055k1683j6838j1766R036J1288O634
21169a2002J7539K707k176q010j1137j421K4442J3274K3998O243O163N13j5363
21156D4770J7578j2562j2854j8635K5522J4724j0611n357n899l591P34q71l0259
21143B689J6355K0695M311L342j8014j4622J8928n896j3439k0515O643l577j9301
21130b2401J168M766R369K7657j2785j2735j0723M3541L403r485J6847j9592J7327
$$ y = [14444, 4648, -809, 21249, 32492, 53473, 47179, 34626, 22638, 18751, 21113, 1772, -16764, -40815, -44340, -42845, -17192, 2003, 9706, 24056, 10887, -4140, 14953, 25788, 18679, 6069, 2325, 24896, 7988, 1113, -20854, -43204, -30033, -44068, -33546, -17170, -33330, -54187, -55469, -44530, -33396, -16517, 1272, 11327, -10356, -27194, -38960, -29924, -18636, -12002, 5537, 8244, 6068, -1942, -13079, -14500, 9942, 23216, 47214, 53457, 59620, 60133, 44770, 62348, 49786, 36932, 18297, 43819, 58543, 47932, 42575, 36676, 33085, 33819, 32948, 2689, 19044, 39739, 44050, 47392, 29378, 14756, 33684, 27788, 14349, -6166, 477, -3100, -22401, -21233, -16467, -7098, 20559, 7774, -4961, -15684, 27857, 31260, 21775, 38622, 19030, 36357]
21117C6357L4941k5772l1610m4737j2450L3828P930k7448N512L690k2509K1378
21105b0890J180J5099K0506j2624k3577k247p517J5230K8084J3689j4544J2923
21093B5312J7334j0002q469r193k0313K3856j0043k8039J6136l012l223J6721
21081G065K774p697M1966p878j2413q346j338l804l3588p709N557J2848m263q051
21067b4877L489K24P922N821J5997J2919j0383l1730K6877J7810j7954P290j7866
21054d461j759M752j1414j8728j6607J0325n815J373K4472L400R128q880J052
21041a3162K1607J974r880j9322n65K6561J0140m259k4288j6083R89J335j1445
21028c6398m75J3415J7381J9335j4707j3589o693K5588O086j0523p503Q494L9262
$$ y = [36357, 71298, 45526, 13916, -30821, -43271, -9443, -1513, -28961, -23449, -19759, -42268, -20890, -19710, -4611, 15895, 3271, -20306, -22553, -30070, -14840, 13244, 26933, 12389, 25312, 42646, 32644, 24175, 14982, -5331, 18525, 8482, -19557, -3421, -6433, -9656, 7065, 9839, 2142, 44108, 36230, 23817, 15471, 14133, 10329, -23259, -30968, -25411, -12563, -16826, -24877, -21388, -21164, -13242, -7421, 8576, 21495, 11112, -20618, 6259, 24069, 6115, 13405, -4461, -6220, -1468, -12882, -31610, -48217, -37892, -43707, -42334, -17862, -14462, -5334, -14214, -13162, 8445, 10419, 539, -18783, -19348, 7213, 17353, 13094, -11194, -27277, -26288, -24953, -36398, -36873, -23458, -6077, 13258, -1449, -15038, -21731, 3857, 9943, -580, -8083, 411, 39673]
21015C9673p741l6548m7078J3626K4643K1003r043r898n111j3077J4504J7454
21003B407P737o491L183j1595j1428o693P298L4735j655j8071J0440K2225j5951
20990A6141J056R844k3497n271l427J3689l138P710k0786k0860K7875p333m2311
20977e0308M092K1660L8432q716j0361L4777J2198k5598j516k9739j6207J2803
20965a8483K9534j3760n786J8432R831j9696J0782M746K677j4519k1843n487J5020
20952h552M025k5700M729M728j1434j8149k879L1431K1748k0614j2208j2835r76
20939d6686J8781O728L3978j74j5784k6310L592R831K32J8442K9379j9879j0785
20926A345q516j5216l6717l297M5873J0448O872j4442j088o20k3148j1191J8305
$$ y = [39673, 31932, -4616, -51694, -38068, -13425, 7578, -1465, -11363, -16474, -29551, -15047, 2407, 10144, 3653, 6836, -4759, -16187, -22880, -15582, 19153, 17498, -573, 9867, 32092, 16141, 17197, 27041, 3544, -1727, -5154, 8535, 5397, 13107, -7679, -28539, -664, -7997, -50308, -46216, -24556, 13876, 5160, -5201, 29576, 41774, 16176, 14660, -15079, -31286, -18483, 11051, -2709, -8495, 9937, 19768, 72, 10854, 15600, 18277, 3758, -18085, -23572, -8552, -4527, -30227, -25498, -20770, -32204, -50353, -53232, -21801, -53, -20667, -32875, -45710, -46686, -27905, -21177, 12801, 12627, -3157, -29467, -25875, -16044, -15812, 2630, 32009, 12130, 1345, -7171, -22387, -59104, -62401, -16528, -6080, 792, -13650, -14738, -15358, -38506, -49697, -31392]
20913c1392J1315O540r963M295N390r964J0140M249n212M094L2525L0444j1630
20900D0831k4729m8636L141K9021r774p122J975j6649J1239J2129m543M94Q957
20887c666J272J0847J2301K3302q838L630k046j5112J4898j9335j3490j2910J877
20874g270l847Q995k777j2528K0060K9453M299j6942M12m940l0685K0025N891
20861A0146q505n790j6986l3427p816p001K2610M5568J80J059K189o977K1471
20848A6721K1251j050Q640M951k7442l3308J051K6277K1942O627k6373R777j2658
20835A6406l1391J5402J9167j3770j6434K5780M92M349n914J4301J3258o308n249
20822C0089j685J2787j6156l3811j707J6027K3095J6119J460k4043k6887K8108
$$ y = [-31392, -20077, -13537, -23500, -19205, -13815, -23779, -13639, -9390, -14602, -10508, 22017, 52461, 40831, 16102, -32534, -29393, -372, -10146, -17268, -15293, -31942, -20703, -8574, -13117, -12623, -3666, -2394, 8453, 20754, 44056, 35218, 38848, 36802, 21690, 36588, 17253, 3763, -9147, -7270, -11117, -2122, -4899, -17427, 2633, 32086, 36385, 19443, 19855, 14915, -15770, 4255, 10146, 1641, -4149, -21135, -54562, -62378, -69379, -46769, -1201, -1021, 38, 2227, -4750, 16721, 37972, 36922, 45562, 50513, 23071, -10237, -9186, 17091, 39033, 45660, 19287, 29064, 16406, -14985, 417, 19584, 5814, -10620, 15160, 15652, 20001, 14087, 28388, 41646, 35338, 30089, 28404, 41191, 25035, -8776, -10483, 5544, 28639, 44758, 46218, 22175, -4712, 23396]
20810B3396K9840J003j6665r487l608n504k3111p830Q62q446q473J387J0265J2016
20796d355K1867j0475p432r447j6336k8227l627K0019K7628r397J3119O145j6845
20783a7363l1081q770N9560N8867J252p334k533n485l5369k3952J1449p90j8805
20770b0354j8554l9835J0923M5742K4006N364j9900k4390O422R478m0159M230
20758e7027M0665J6837r073r624K4812J5639l2790j7370p078l2200j5164j72N033
20745g7512L0964J1166m139J4656J5013J2559J4046Q216k5372k2952Q239j28r59
20732a6203J1463q517K4859J8291l1082k4056O025K2934M369j5983j1636j1741
20720c1277k0690j20j0938j9921J5403L5078J0165p324K1506J6136J6262p308
$$ y = [23396, 53236, 54239, 37574, 28087, 24479, 18975, -4136, -11966, -11104, -19550, -28023, -26636, -16371, -4355, 17512, 7037, -395, -9842, -26178, -54405, -58032, -38013, -10385, -19782, -6663, -518, -17363, -48444, -57214, 2346, 61213, 62465, 55131, 52598, 47113, 11744, -12208, -759, -1549, -20354, -38908, -78743, -67820, -22078, 1928, 7292, -12608, -36998, -30576, -21098, -61257, -57027, -16362, 475, -8598, -18222, 6590, 22229, -10561, -27931, -35009, -67209, -82373, -82545, -77512, -46548, -35382, -39521, -24865, -9852, 2707, 16753, 24969, -403, -23355, -15116, -15244, -16203, -4740, -13257, 11602, 29893, -1189, -25245, -19220, 3714, 8083, -7900, -19536, -31277, -51967, -52087, -63025, -82946, -67543, -32465, -22300, -29624, -8118, 8018, 24280, 16972]
20708A6972L932J0684L5033J4158l2891j7756j061Q084l8314l7575o685j727K0937
20695b6209J6228j8897j2924o121j6565K5647L1032m43J626J3423j5623Q412J1784
20682A1370j5666N642N313j1079k6902q049J3965J3246j528k3778r97q622j4261
20669f1346L7914M6709J2157k7948j4976K8021J6726l5875n175K6806K04j3010
20657A0207p826m100l861K418k0538L799P6j0972N951L2535J3156m3411J4277
20644h289M535j6461l7042J1009K393k0758M123M681J0767K8965p90J0625J1265
20631E023K636Q741m132l7725n747O558J6432O381p733K727n0152J5151K6208
20618a5632L15K292k542Q769m986J220m095k7686j6214j3429P619j0350L5660
$$ y = [16972, 20904, 31588, 66621, 80779, 47888, 30132, 29071, 37155, -1159, -38734, -45419, -47146, -26209, -9981, -28878, -41802, -47923, -64488, -38841, -7809, -8252, -6626, 6797, -8826, -414, 11370, -4296, 1346, 6659, -4420, -31322, -39371, -25406, -12160, -13688, -37466, -38463, -47085, -61346, -23432, 23277, 35434, 7486, -7490, 20531, 37257, 1382, -3793, 23013, 23217, 10207, 2381, -1719, -5580, -3162, -23700, -19901, -19825, -30797, -24846, 7689, 20845, -22566, -8289, -3754, -20215, -57257, -46248, -43855, -64613, -60490, -55809, -45042, -16077, -16867, -6242, 5023, 7659, 16400, 12268, -25457, -31204, -24646, -8214, -1833, -9566, -6839, -56991, -41840, -15632, -15317, -13025, -15567, -6798, -11784, -10564, -14659, -42345, -58559, -71988, -64369, -74719, -39059]
20605c9059L1319m47o237m624k7393r955J4642J2022J2106l4916q63q863J1860
20592e0408J1449q553q850J1163L2524K2883J987j2355J1454j6164n507R208O081
20579D912J2300J7737p015n5545l047J3479j6047k1840J7013K7062j037q284M0618
20566B0306N264k4429l1402J3530n221j3418J3362L928l82j6752J8585J8373m587
20553b843j4136N4J7059m653k6350j0658m71J527J1707R273K5457q449p344m57
20539a0284n700J041R883j5521K2086J0138j0275K1217J550l0008J7785n733j4826
20526h647K3760j3794k6938K657J7479K4102k3029J1030M013k1341K0352J2777
20514B2421j2854l4627j1426J1606J0423J2375l6608k2787M1363J0619J1892J5945
$$ y = [-39059, -7740, -8187, -14424, -19048, -46441, -56396, -41754, -29732, -17626, -52542, -53405, -62268, -50408, -38959, -47512, -56362, -45199, -12675, 10208, 12195, -160, 11294, -4870, -10377, -1169, 4912, 17212, 34949, 27934, -27611, -30658, -17179, -33226, -55066, -38053, -10991, -12028, -20312, 20306, 25570, 1141, -30261, -16731, -21952, -35370, -22008, -18080, -18462, -35214, -16629, 1744, -2843, -16979, -16925, 134, -4519, -30869, -41527, -41998, -40471, -28764, -19491, 5966, -2483, -9827, -10284, -15984, -14943, -5060, -20581, 1505, 11643, 1368, 22585, 24135, -5873, 11912, 6179, -8647, 15113, 1319, -25619, -22962, -5483, 18619, -4410, 6620, 10633, -10708, 9644, 22421, 9567, -25060, -36486, -24880, -14457, -2082, -38690, -61477, -20114, -9495, 2397, 18342]
20502A8342J0827k1231n407K164j2462K3776j466k9086k0665J3950q138j2510
20490d1906j8328l0282J6846K7367J0833L4801K7553k7530r892j7763J3590Q097
20478f614K361M949O938J9318m06N292O624J1484j9534o662k7917k4054N668l515
20464b6068O939Q902K3463K7780p67k8630Q637J3943m721n343j4344j5700k2426
20451b8335M160Q677L3501K905j3751j9067K952j9598k6154N161K1150J8909O103
20438c387L986K0915J2842o739k0073j6600k621M992P686J474j9725Q233O535
20425b482n876J201J5006J917j2832R628M452o149K343m258J0566j0103L026Q599
20411A5038K1907P864m357l7175k1856k7042Q033K7622Q693j6524K8367p818j7048
$$ y = [18342, 29169, 7938, 2531, 4695, -7767, 16009, 14543, -14543, -35208, -21258, -29396, -41906, -60234, -90516, -73670, -46303, -35470, -669, 26884, -646, -10538, -28301, -14711, -6614, -4253, 696, 7634, 26952, 26546, 31838, 38462, 49946, 30412, 23750, -4167, -28221, -22553, -26068, -19129, -10227, 13236, 41016, 40249, 11619, 20256, 34199, 29478, 24135, 9791, -5909, -28335, -24175, -15498, 18003, 20908, 7157, -11910, -8958, -28556, -54710, -49549, -28399, -9490, -3387, 599, 21514, 34356, 27617, 7544, -9056, -11677, -6685, 1001, 2475, -17250, -9017, -2482, -8358, -7157, 7849, 9766, -3066, 6562, 11014, 4865, 7208, 2950, 13516, 3413, 6439, 15038, 36945, 44809, 40452, 3277, -18579, -45621, -37588, -9966, -1273, -17797, 10570, 2752, -14296]
20398a4296j0558j4658j6665J6947J5820j4587p567K9646J0116M923J7404J3146
20386B9671J0691p115j0853m615p738O515p122J854K0089J851J3993j82j5376
20373C1663o463k6341J5401L2257q893k7289m221J801l3204j4176J7436p739r353
20360c9121L722J0840K8725Q792j0636M584J1102N372n496R394O229j3862J8898
20347C8543j1466k4503l903J6215k4389k7026q637N223K0146q627K6195N848m2082
20334c8463K6730K1359q786j7335N521l192j2299R966m318P214j835j3065J4849
20321a3654j988J0725k715P88q742o928J7162J8591k1894l397l819Q10O926L551
20307d584J1848J94L905j2590q391K9410J0909l2229m5840k269M033K2623N173
$$ y = [-14296, -24854, -39512, -56177, -39230, -23410, -37997, -45564, -15918, -5802, -879, 16525, 29671, 40362, 33247, 22394, 17779, 10041, 16556, 9434, 11288, 31377, 33228, 47221, 47039, 31663, 25200, -1141, 14260, 46517, 37624, 10335, 6114, 7915, -25289, -39465, -22029, -29768, -39121, -35399, -24559, 4166, 12958, 2322, 6906, 18008, 23380, 17884, 27278, 33507, 19645, 38543, 27077, 2574, -1329, 14886, -9503, -36529, -45166, -39943, -19797, -28424, -2229, 3619, -38463, -11733, 9626, 840, -16495, -10974, -14166, -26465, -16499, -20817, -13603, -15438, -28503, -13654, -15642, -4917, -7632, -6844, -15586, -22514, -5352, 13239, -8655, -12052, -15871, -15061, -8135, -4584, 7264, 7458, 11363, -1227, -9618, 19792, 30701, -1528, -47368, -49637, -45604, -22981, -17808]
20294a7808p161O728L0722O933N859N429k3146k0059l2585J2344K1130J9511J8353
20281B6250O839R107o990k9667j4071k9238N893l5269J6730K4906j2092o07J1256
20268b6953N722J1527Q754j1065m130J3668j62Q896o778m088l3743l3877J771
20255g0458K1945J3746J6533J1778l3477l8178L284J6621R668J0685J6380n815
20243b7288K2322Q686j5662k5525j1184r783K2780K1755j3223N570O065l113k1693
20230d0293j8409k061Q363M708J5560j7481N462N3457R565k3106l5250K8495L2806
20217B1816N76M041J5781l3266L076j1498Q717M6591M520q991j2595k1900q878
20204G990K6298M6805J597o2717l2207j9989j0362J7714L4211k2389l2935J9990
$$ y = [-17808, -24969, -18241, 12481, 19414, 25273, 30702, 7556, -12503, -45088, -32744, -11614, 7897, 26250, 33089, 42196, 35206, 5539, -8532, -37770, -31877, -67146, -50416, -25510, -37602, -38209, -26953, -21231, -9704, -950, -12015, -16145, -2477, -2639, 6257, -521, -4609, -38352, -72229, -70458, -48513, -34767, -18234, -6456, -39933, -78111, -74827, -58206, -48538, -37853, -21473, -27288, -4966, 3720, -11942, -37467, -48651, -58434, -35654, -13899, -27122, -21552, -15487, -18600, -40293, -58702, -60763, -52400, -47692, -32132, -49613, -44151, 9306, 18871, -4235, -39485, -10990, 21816, 22392, 26433, 42214, 8948, 12024, 526, 9243, 55834, 60354, 51363, 38768, 16868, 7990, 34288, 81093, 82690, 19973, -12234, -32223, -42585, -24871, 9340, -13049, -45984, -25994]
20192b5994Q782m073J0132R073K5390J2577N004o816j4953j8757J3450J1389k0
20179B5184k142l9415k2051K9009J3637k3191N456J3735j4050j5067r264k222
20167d0381K6758L572J6493P755j7733j3923J892j1342m637j0404k4706K3806
20155d2850L8575J2527J9152L979k2630n0968J7154K2991l9620j980K1919J1180
20143a0571j0656k33N495l385K2936j8006j1657O262k0668O76K2961K2036J239
20130F429j8968n592P426J7765n380m3316J487J4394L890k196J2591k07k0022
20117c1699L309L5324m455l4711m81M3295rp344K242j0941l5397K7113K8788J1416
20103B6450p951q367j0208J4519j1803M416O47R258r643R716k459P903M418J5818
$$ y = [-25994, -17212, -21285, -11153, -2080, 23310, 35887, 40891, 34075, 19122, 365, 13815, 25204, 25184, 23042, -16373, -38424, -9415, 4222, -18969, -13513, 222, -13828, -28895, -38159, -40381, -13623, -10051, 6442, 14197, -3536, -17459, -15567, -26909, -31546, -41950, -66656, -42850, -4275, 8252, 27404, 31383, 8753, -42215, -25061, -2070, -41690, -43670, -21751, -10571, -21227, -21460, -15965, -19350, 3586, -14420, -26077, -19815, -40483, -39807, -16846, 5190, 6429, -12539, -18131, -10705, 7060, 1680, -41636, -40149, -25755, -21865, -24061, -11470, -11677, -31699, -28390, 6934, 2479, -32232, -32713, 10582, 10573, 3229, 5471, -5470, -40867, -13754, 15034, 26450, 18499, 10132, -76, 14443, 2640, 7056, 7703, 16961, 7318, 17034, 14575, 22478, 26896, 42714]
20089D2714K1996k0605k0238k7571j8906Q931K1145k7962j7192J6525K5974k4650
20077a9839k337k1108J7997L4875K1807j4706j9808J5070m886l2103L918J2744
20065h376J2008P304m297j2134q238k006k4667n999K9827J8335M992P605n785
20052H569j0074O500M162k2038m172j3264J1302J1374J8655o137l312O175J1956
20039A9696m424j4608j3684k5950K269K3228K0905j7692r780K3199K0704j1531
20027A2332l6531j4030K2387L5233o496O532K6632j6707l7183j2845K477o024
20015b4223j0128J7662J3424Q981j2890k3668N661K6844J9099q488N669o082k3146
20002a1285p201j4576p56L7913l518k3662Q52J6046n099J0558j0304m5483l3573
$$ y = [42714, 64710, 44105, 23867, -3704, -22610, -13679, 7466, -20496, -37688, -21163, 4811, -19839, -22176, -43284, -25287, 9588, 31395, 16689, -3119, 11951, 7065, -25038, -21120, -8376, 3632, 10936, 6639, -5495, -13733, -15739, -40406, -46405, -16578, 1757, 6749, 14354, 8569, -1505, 4995, 9157, -12881, -17053, -30317, -19015, -7641, 11014, 4877, 1565, 7740, 19696, 15272, 664, -13020, -38970, -36701, -13473, 7432, -10260, -20040, 3159, 23863, 12332, -24199, -38229, -15842, 19391, 12895, 19427, 46059, 29352, -7831, -20676, -18199, -24223, -34351, -16689, -3265, 5716, -7174, -30842, -25181, 1663, 20762, 12274, 17943, 11861, -11285, -18486, -33062, -33818, 4095, 577, -23085, -22233, -6187, -11286, -728, -11032, -56515, -90088]
19989i0088J0779N6962R124j5621j7505p54J0839J609M431M63J8507J1688q221
19976g787j419m731P56O161r340k4564O14J2708K234J1812j7289r380m517J2847
19962c1895J3752N682q976J3260j1640l451K9100J5774J5645k3410j7606O54j2889
19949a6000Q840R483j463J687o157P242K6341O194j1974j7894j2638o073K1986
19936I574k3050j4854k0490k3693J104L4897j2045J370K8124o8r804p970K9103
19923g802J8411K2449j2475j2639j0437J2316p151p896p855L1759l339k3592k029
19910a0280M74J5489J1667n540j7347n094O468R116r515q791j6794j3482M529
19897c9100K7612J6892L829k288K0750J7830J488k4673k9594J1911J2811l1733
$$ y = [-90088, -79309, -22347, -13223, -28844, -46349, -47103, -36264, -34655, -30224, -29761, -11254, 434, -7787, -9206, -13937, -13181, -7020, -16360, -40924, -40310, -27602, -25368, -13556, -30845, -40225, -44742, -31895, -18143, -12461, -21437, -8177, -19817, -23268, 5832, 21606, 37251, 13841, -3765, -3111, -16000, -7160, 2323, 860, 2547, -3610, 3632, 29973, 36167, 24193, 6299, -6339, -12412, 9574, -13476, -28330, -48820, -72513, -71409, -36512, -48557, -47187, -19063, -19131, -28935, -36905, -7802, 10609, 33058, 20583, 7944, -2493, 9823, 2672, -5224, -13079, 18680, 15341, -8251, -10280, -9806, 5683, 17350, 11810, -5537, -10631, -4163, 4953, -4562, -13353, -30147, -43629, -39100, -11488, 5404, 9233, 6945, 27695, 45525, 47013, 22340, -7254, 4657, 17468, -14265]
19885a4265j6023L891J519j376J4676J8700k2348M489J3371J7071j5813L240K7182
19872C4314j785m4880L238J6775J6148j2034N849R708j3343J2209K0904l2796
19860A4307k6606M418j1774K7381j2652j8299J1649L737n671J9766N007l2403
19848b1140j4831M0033J1118k8411K5697K5560J9470j0938p99k5081k7564M390
19836b496M408O630o941K968P263K9210q699j4953K0740J155n556n893O383j4162
19822B0057k1999M803N097j6255L532J4472J1524J711r326J673j5380J7942q796
19809I055Q589P780k7822k886k3568J6145M1514j2478o2903k3725K0045L6399
19797a3855L0018J9226j1738k7451o812J9384j6317n084N469M808K191j0185K03
$$ y = [-14265, -30288, -26397, -24878, -26254, -11578, 7122, -15226, -10737, 2634, 19705, 3892, 7132, 34314, 32529, -12351, -9113, 7662, 23810, 11776, 17625, 27333, 13990, 26199, 47103, 14307, -12299, -7881, -19655, 7726, -4926, -23225, -11576, -7839, -13510, 6256, 11263, -21140, -35971, 4062, 15180, -13231, 12466, 38026, 57496, 46558, 45759, 20678, -6886, -2496, 1912, 8542, 1601, 4569, 11832, 41042, 32343, 17390, 38130, 39285, 33729, 27836, 34219, 20057, -1942, 2861, 7958, -8297, -4765, 9707, 21231, 22942, 13616, 15289, -91, 17851, 9055, 17644, 25424, -2398, -5284, -28852, -12707, 28807, 16329, -46574, -70299, -50254, -13855, 16163, 35389, 23651, -3800, -10612, 8772, -7545, -12629, -7160, -2352, -161, -10346, -10143]
19784a0143P722K096j62K1827j2181l4620k807q328J3376q82J0974r034o218J9073
19770i307L0486m720O835P891l769J2038N838k1835n5182j6101J3359K3765k5553
19757c6255Q956K2121L7623k4614j8909j0394k230k5138k8966K4530L5430K2268
19745D422M6166Q310m956j5265k4378j9093N887O1j4957k1707j2806n512J2329
19732d1499K5728J9571N267J588Q174m37j4923j2028N47Q975o390L894J3430j0391
19718A506q328K140O734J6610l7082j9567o927K4966L6095q97j9334r342J0638
19705b788j5388R414K0979j1772j9121j7120J7342L3798j5277j080K7021L6418
19693F2426k0130j8438J4249l2085p037L994P984k096k673j3144m372N721r625
$$ y = [-10143, -2421, -325, -487, 21340, 9159, -25461, -28268, -36596, -23220, -24102, -13128, -22162, -28380, -9307, 21179, 16459, 23294, 31185, 27416, 39454, 45292, 23457, -31725, -47826, -34467, -10702, -36255, -27299, -5178, 32445, 7831, -11078, -21472, -23702, -48840, -77806, -53276, -17846, 4422, 50588, 58898, 53942, 38677, 14299, -4794, 1093, 1154, -13803, -35510, -48316, -53828, -41499, -15771, 3800, 9067, 10655, 18829, 18392, 3469, -8559, -8012, 963, -5427, -1533, 11897, 1506, -6822, -4682, 2052, 18662, -18420, -37987, -44914, -19948, 16147, 15250, -4084, -13426, -2788, -18176, -8762, 12217, 445, -18676, -35796, -18454, 15344, 67, -1013, 26008, 62426, 42296, 23858, 38107, 6022, -1015, 2979, 10963, 8867, 6194, -6950, -11322, -5601, -15226]
19680a5226M727J0617o964j8352k5713k0811k993K8317J5822J1267J9417l501
19668c393m425J2040m74j7220j0036L61M0876J0862j3646J1848J469j2032k251
19655A3979R092J6054J1586k3949k2792l424K1211J5566J2742j9984j4091l70
19643A5620J0694O312k7134q557j3028k1059j1151K4947Q905j0315m766j2905
19631d2437j0086o804J4278L0753k4687K118L947J0178M957L996k2184j892p444
19618d5307J5719K4046j772J7990n229k8656j274J3675K005O493Q755j0748j4490
19605a8793J6313K441j4509O151J3690j1786j3275J8675j1738N707q623j663M455
19592a2955l353M0216J5027k613k6810j8713P046Q882k8361l459R922J5328p132
$$ y = [-15226, -10499, 118, -6846, -25198, -50911, -71722, -74715, -46398, -30576, -19309, 108, -3393, -7818, 4222, 3748, -13472, -23508, -23147, 17729, 28591, 14945, 26793, 28262, 16230, 13979, 23071, 39125, 50711, 26762, 3970, 546, 21757, 37323, 50065, 30081, 15990, 15620, 26314, 32626, 5492, -3065, -16093, -37152, -48303, -23356, -14451, -24766, -29532, -42437, -52523, -59327, -45049, -14296, -38983, -36865, -32918, -22740, -17783, -13787, -35971, -37863, -45307, -29588, -5542, -7314, 10676, 5447, -23209, -24483, -10808, -8803, -2310, 6445, -4303, -18793, -2480, -39, -14548, -8397, 5293, -6493, -19768, -1093, -12831, -7124, -15747, -17410, -12955, -16308, 23908, 38935, 36322, 9512, -9201, -2155, 6727, -21634, -25093, -15171, 157, -6975]
19579f975j5960N067M59J2341q523j865L572J5163J5154P787j7782k7286L048
19566a5800j3311l341K4772K9218O979k0187p242j9986J3J2851O243P866J6671
19553B4746n475l6196j0900J1153n954r121K8048j999M19L2162K2762k1340j6152
19540A2153N131k573n62L224p52R727K073j4618l1153O554K1425j2571j9011Q204
19526a2749j0771K6574o479k5772Q843N476R855l3144k2432J6051K6786L0659
19514A2897J4915j8305j6654l437o048l9141l3113L0027M3156L1076r587k1039
19502a5253j2114J4813J2939J4804l1057j3447M31l243j3923n609p62N830J294
19489d5297M1267J9600L027K4007J6327j1048j9919j7213l3032j3435m162l760
$$ y = [-6975, -22935, -17868, -17409, -5068, -13591, -15456, -11884, 3279, 18433, 26220, 8438, -18848, -15800, -29111, -32452, -7680, 21538, 28517, 8330, 1088, -18898, -18885, -6034, 209, 8075, 24746, 19271, -16925, -27825, -16672, -22626, -31747, -3699, -5698, -5279, 26883, 49645, 28305, 12153, 17284, 14711, 14149, 17373, 16621, 26348, 28421, 13803, -17350, -10796, 10629, -1942, -20953, -12749, -23520, 3054, -3425, -29197, -20354, -14878, -5023, -38167, -60599, -44548, -17762, 12897, 27812, 9507, -7147, -10584, -16632, -55773, -88886, -58859, -15703, 15373, 5786, -15253, -27367, -12554, 385, 15189, -15868, -29315, -28884, -32127, -46050, -51659, -52421, -46591, -45297, -4030, 15570, 18597, 42604, 58931, 47883, 27964, 10751, -22281, -35716, -39878, -43638]
19477d3638R181j6054L820m174J163J0242K8490M2117K5961j4218n7924j4338
19465b9372J7204O434k653k075r537j6333P602j0368r275O948K510R674M694r103
19451c3650Q06J7501J6783k2836l872J6078j7750m495j9780j8322J3622K3988
19439c1927K4758J101r147J3783P916J1212J6500q184j570j2654J1888l056r891
19426A0729j3478j5019k8856L724J266K7570N606Q735J5286l3183k2395J090K5139
19413a3786J6656K9988J8385j695m1611j0865l385j5079j2700J8244j9589P819
19401b7618n013J6753l0668l1617K7204J4491J3882N1414N44j0549N445l1425
19389g157K506J1945j4168O24J1248O438m353j1377j9621l8455j4158M8703K0360
$$ y = [-43638, -34457, -50511, -46691, -50865, -49702, -39460, -10970, 31147, 57108, 42890, -15034, -29372, -12168, -5734, -8387, -10462, -19999, -36332, -28730, -39098, -48373, -41425, -38915, -29241, -24547, -33650, -32844, -15343, 1440, -21396, -25268, -9190, -26940, -31435, -51215, -69537, -55915, -31927, -7169, -6068, -15215, -1432, 6484, 17696, 34196, 26012, 24442, 11788, 23676, 20620, 10729, -2749, -17768, -46624, -42900, -41634, -14064, -8458, 277, 15563, -17620, -40015, -38925, -13786, 2870, 32858, 51243, 49548, 7937, -2928, -6313, -21392, -34092, -15848, -35437, -27618, -32631, -15878, -46546, -78163, -50959, -36468, -22586, 28828, 29372, 18823, 24268, -7157, -4651, 7294, -6874, -6250, 4998, 11436, 7083, -4294, -23915, -62370, -76528, -27825, -7465]
19376g465M47j0129O852K94N930K7003k2164j1094P322J0370J6086j5496j3134
19363e178j0922q694M7l548J9450J1301j1338J2962K1905J1864o573l2932j4005
19350a5661K6500O146r046j3282J187m7021l0241J7563R165j1443K0084M1365
19338d684P642q371L3199J5886Q960J1316j0387l2774Q649O861o172l980j5867
19325A0278j2315J79M1J6655Q075l952k1332k0204j0140K0030Q822L0500m0385
19312a3748l0538J5841L3127N568j5143p545J094L131J4333J1758L0644K183j0693
19299D0012l7783j9729L238M680O183k1792j3448L0314L7913m245j3900j3700
19287b257m384p48J3142o52P352k5551j2684N611m419r10j1287n820K5940J6615
$$ y = [-7465, -7018, -17147, -10295, -10001, -4071, 22932, 768, -10326, -3004, 7366, 23452, 7956, -5178, -16100, -24794, -24747, -28295, -8845, 2456, -8882, 4080, 25985, 37849, 31276, -1656, -15661, 10839, 16985, 7939, -5343, -4156, -51177, -81418, -63855, -54690, -66133, -46049, -4684, 2958, -5413, 27786, 43672, 52632, 63948, 53561, 20787, 29436, 36297, 30125, 26145, 10278, -2037, -1858, -1817, 14838, 22913, 18961, -2371, -22575, -32715, -12685, -3863, 26637, -13748, -44286, -28445, 4682, 10250, -4893, -12438, -11344, -8213, 6120, 17878, 48522, 50705, 40012, 2229, -17500, -14262, -9582, -3399, -25191, -38639, -8325, 29588, 25343, 11443, -2257, -6641, -7389, 5753, 5101, 12453, -13098, -25782, -20171, -24590, -25500, -36787, -42607, -16667, -52]
19273e2j7579o289N274J5317j142o815K003m971k8367k506K7231J5166j3745j8162
19259c4637K0199J7337O660j8675J0496j913l683l9759j6816K40K4611K5414J0310
19246b16k6919q631J974n59P686J3877J0489j4842K1220Q462n011J7652k0694
19233D488j6382j8242q272L704L1016K3184Q28r750j2111J3525Q806K191P59o506
19219A7238Q048j5759K015j2171J1088K8678J5377l0471n053K178o663k139m512
19206G854L1845J6987k4967j4050k145N469j0547m0146j1664k4619R403M4869
19194a1711R986k1628k8638j236J9352K0277K1805J2901K49o872j0674j4287Q445
19181b031k283J9910L1246O202m773p21k6429l2174j1319R536m023J5635K5957
$$ y = [-52, -17631, -23920, -18646, -3329, -4471, -11286, -9283, -14254, -42621, -45127, -17896, -2730, -16475, -34637, -14438, 2899, 9559, -9116, 1380, -533, -4216, -43975, -60791, -60551, -35940, -10526, -216, -27135, -35766, -33792, -34351, -26665, -12788, -2299, -17141, 4079, 12541, 7530, 25182, 4488, -11894, -30136, -38408, -34704, -3688, 19496, 20324, 10574, -1537, 11988, 20794, 22985, 23744, 17238, 25286, 9527, 11542, -629, 10459, 39137, 54514, 24043, 18990, 21168, 14505, 12366, 7854, 39699, 56686, 31719, 17669, 15524, 20993, 10446, -29700, -41364, -65983, -56580, -11711, -1725, -23353, -51991, -53227, -33875, -13598, 8207, 21108, 21357, 14485, 3811, -10476, -2031, -4314, 15596, 46842, 53044, 48271, 47550, 21121, -11053, -22372, -12836, -16859, -1224, 24733]
19168B4733k9416n0655m185N7886M6003Q479m8664j6536L5103j7398j566K0074
19156B3858j6684R000K4571j3864l0534j0927J0505j6820m0113L6626K4559J2947
19144A3124j457O231J0962L461j0054m956k8063R611J4100K4686J3816k2851k094
19131B6516j0915k272J6555K4829q082j2918m5026p034k4677r758K1442K6564
19119d776n959l851p817O548j4763J4944l005k847k104P483J0223J2251k3803
19106a7476m541J0903l879k642K4667J9463Q050k0558J8479l3828j6187Q676J8541
19093I668j0422n447q724o696j3269k0966j1531L3624K5446M7196J1544k1548
19081B8875k9951j5940j4019K27J2518j9677o597M3039K143k9866R996J9961J1280
$$ y = [24733, -4683, -55338, -59523, -1637, 44366, 52845, 4181, -12355, 22748, 5350, 3784, 23858, 7174, 16174, 40745, 26881, -3653, -14580, -4075, -20895, -61008, -24382, 177, 13124, 11667, 17898, 28860, 32321, 22267, 17311, -10752, -1141, 12959, 37645, 51461, 28610, 26516, 15601, 13329, 29884, 54713, 46631, 33713, -11313, -18347, -43024, -52782, -31340, -4776, -10735, -14586, -22403, -15855, -30618, -15674, -18679, -21526, -23630, -16147, -5924, 6327, -17476, -22017, -11114, -14993, -17635, 7032, 26495, 34545, 13987, 32466, -1362, -17549, -8873, 9668, -754, -6201, -14925, -21621, -34890, -55856, -67387, -33763, -8317, 38879, 50423, 28875, -1076, -17016, -31035, -30808, -18290, -37967, -44564, -1525, 618, -29248, -19252, 709, 11989]
19068A1989J9272n943l1826J7666J2039j2469K0749J0063J116l3423o232J202
19056D203R309M778j5107J776J7120k976k7646P477k679k714R671P519O925R632
19042B7288m525J5911N181P581k2419k9048j5498m759q906j5769K7680N1810N085
19029C9612j4133J8936K4162K39j1504p785k148l0812m824k8446m739j1681J9490
19016a3633K4301J4724J5377k7089j2263J7931M603Q525l5013N033l343k3829
19004b4676O109L4097N222k3898k103P720o308m890j0416j9341j5421J8996R925
18991b4984j4498N913J6986L1309k635j6000m394j3327P016L2151Q716O438J9567
18978E2258p622j1055j3207j3612Q934K4355Q483j8219j8131r993q943K611J434
$$ y = [11989, 31261, 25318, -6508, 11158, 23197, 10728, 31477, 41540, 42656, 9233, 3001, 4203, 13512, 18290, 3183, 4959, 22079, 19103, -8543, -1066, -3745, -6459, 3212, 10731, 17656, 27288, 22763, 38674, 43855, 51436, 29017, -31, -15529, -20288, -29194, -44963, -17283, 34527, 39612, 25479, 44415, 68577, 68816, 57312, 49527, 47379, 16567, 11743, -16703, -21442, -33123, -13633, 10668, 25392, 40769, 13680, 1417, 19348, 23951, 32476, -2537, 2496, -847, -24676, -18567, 15530, 20752, -3146, -5249, 2471, -3837, -8727, -19143, -38484, -53905, -34909, -24984, -39482, -33569, -16583, 14726, 12091, -3909, -8303, -21630, -14614, 17537, 26253, 32691, 52258, 44636, 33581, 20374, 6762, 15696, 40051, 48534, 30315, 12184, 2191, -6752, -4141, -2707]
18965b707J0014J4595k063n61K721J3250Q039m028k4801j8548j9024O390K4267
18952G544J585L316j8563J6360J5461R057j162k1535l1404K0560N0275K544k1322
18939C2716M867J8473o351M846j1981k1937L516R193L299j0429k5942K2107K9355
18926E1732N587l5749k4298L562l90n656o835j1578L0056J9447J4976J4032q059
18913D6827j5154j9951j8385N911R284N803L307q536p879J0047J2593q619M33
18900A5681J5860K377k8879j4175j031J0980J7764L429L7745j5446j4020j738
18888B8547j3260j9833o020K1558J0564j970j056r584k1664J3197R002J4064J151
18875B4696j2714q274K6714J235j2637J410o454l780J2682J1621k9642o753L3830
$$ y = [-2707, 7307, 21902, 19839, 19278, 21999, 35249, 43288, 39260, 14459, -4089, -23113, -16723, 7544, 9129, 12445, -6118, 10242, 25703, 34760, 33598, 12063, -19341, 1219, 51494, 54038, 32716, 37583, 56056, 49705, 54551, 42570, 20633, 24149, 33342, 36641, 26212, 270, 22377, 51732, 57319, 21570, -2728, 834, 444, -5212, -12047, -23625, 6431, 25878, 40854, 54886, 46827, 31673, 11722, -6663, -752, 8532, 14335, 17642, 9106, 1227, 11274, 23867, 15248, 15681, 31541, 33918, 5039, -9136, -10167, 813, 18577, 22006, 59751, 44305, 30285, 28547, 15287, -4546, -10566, 10992, 21556, 19586, 18530, 8946, -12718, 479, 9481, 23545, 24696, 11982, 3708, 30422, 31657, 19020, 20430, 13976, 10196, 22878, 34499, 4857, -1896, 31934]
18862C1934N73k441j6770l46K728N377j001m951j1409J2916K0996K9140J4476
18849H1222j0473k5566j5067n97j6978k912J7591J6384j9762N693m726o234j1817
18836F758j5842O995J271J0676j7j7497J0812L0701L1361j2540L381J924k0017
18823C7966k1534J2114K5979L2500J6819N822K8067L9917J5716L2444j1061k6490
18811A88259J0622j411N134k3047J2700J5245j6462k3283Q712k1385j4880J9942
18799A60146J4595J3847j7423j7028K129j3097l8396J217Q423L985o929J6059
18787A27528K8265K1468L8604J8453J5000K7237J0343L0669L1788K1690K3039
18776C94084J8572J773Q453M0053O0674N1203M4670O7904O8161L4830N1216K8642
$$ y = [31934, 32507, 30066, 13296, 12950, 15678, 21055, 20054, 15103, 3694, 16610, 37606, 66746, 81222, 70749, 45183, 30116, 29519, 12541, 9629, 27220, 43604, 23842, 29535, 24809, 18575, 6758, -9084, -2089, -818, 9858, 9841, -7656, 3156, 33857, 65218, 52678, 56059, 57983, 37966, 16432, 28546, 54525, 87025, 103844, 109666, 137733, 177650, 193366, 225810, 214749, 188259, 198881, 197470, 202604, 179557, 192257, 207502, 191040, 167757, 176469, 155084, 140204, 160146, 174741, 188588, 171165, 154137, 156266, 143169, 104773, 105990, 114413, 118398, 111469, 127528, 155793, 177261, 215865, 234318, 249318, 276555, 286898, 317567, 349355, 371045, 394084, 412656, 414429, 422882, 462935, 523609, 574812, 619482, 687386, 755547, 790377, 841593, 870235]
18764H70235m8447m6495k9953n9178m5416m6442m6698n5529j9933k2576l0065
18753D19503o491L0365O1663K5674J1229J4524O067N259k8420m7360m8695n9677
18741C83641k6371m4504l357M978p41M080K6289J9598K6615k864K5438L4515k532
18728D44785J8471K556Q184K1757J5373N7076J2165j5040K2608J3452L176K1624
18716F26187M057j9754P751j3977j440k7498m4952l1086m9685p9736m2758l4975
18704B92134l8788n3473o911j9752k5175k0179L3624k671J1852K1986K9022o762
18692B14907j3609n013j985R618L820j9653j2507j1544l0409o704n833r983j2723
18679I8382k0321P938m545J774J8138o974J0180l713L207J6055N274l093L6400
$$ y = [870235, 821788, 775293, 745340, 686162, 640746, 594304, 547606, 492077, 472144, 449568, 419503, 413012, 443377, 505040, 530714, 541943, 556467, 562534, 567793, 539373, 492013, 443318, 383641, 357270, 312766, 309409, 314387, 313646, 317726, 344015, 363613, 390228, 387364, 412802, 447317, 444785, 463256, 465812, 473996, 495753, 511126, 568202, 580367, 565327, 587935, 601387, 604563, 626187, 630244, 610490, 618241, 604264, 602824, 575326, 530374, 499288, 449603, 369867, 327109, 292134, 253346, 199873, 192962, 173210, 148035, 127856, 161480, 158809, 170661, 192647, 221669, 214907, 201298, 196285, 194300, 203918, 207738, 188085, 175578, 164034, 133625, 126921, 121088, 111105, 98382, 78061, 85999, 81454, 83228, 101366, 94392, 104572, 100859, 104066, 120121, 125395, 122302, 158702]
18666A58702q879j2193L1707K1178k5712q80l0047m4181k0795j1213J0502L1443
18654I9632j8553j193K7713K6516j1244j6803l72j798j3249K850K8309j3764Q093
18641A16137J4644K997J0368k4248N313K368p590J2940j7232j9658Q976N016j9989
18628I0042K863l29j263j053j5216j2466l130l0922j0817N0851N5111K2297k1519
18615A24449k2756j5416K915M1888J6339m5397M172p246l5490K2583k8499k2806
18603C4736k6535J4747K7132m010q338J3643L82j3851l691Q519p960M73K899J5104
18589E3250L2049j6453p828q655j2851K6283m891O487j8219j3428J7987j5210
18577C8521r162L3345L8420J0198l8454L1107R429j4402Q375j2025l3307K329
$$ y = [158702, 149823, 137630, 169337, 190515, 164803, 163923, 133876, 89695, 68900, 57687, 68189, 99632, 81079, 79886, 107599, 134115, 122871, 106068, 105696, 103898, 90649, 93499, 121808, 108044, 116137, 130781, 133778, 144146, 119898, 125211, 127579, 119989, 132929, 115697, 96039, 105015, 110031, 90042, 92905, 92576, 91313, 90260, 75044, 62578, 59448, 28526, 17709, 68560, 123671, 145968, 124449, 101693, 86277, 89192, 131080, 147419, 102022, 106194, 98948, 63458, 86041, 57542, 34736, 8201, 22948, 50080, 46070, 37732, 51375, 51757, 37906, 34215, 42734, 34774, 35247, 38146, 53250, 85299, 68846, 61018, 52363, 39512, 65795, 60904, 67391, 49172, 35744, 53731, 38521, 29359, 62704, 101124, 111322, 72868, 103975, 113404, 99002, 107377, 95352, 62045, 64374]
18565F4374M482o248k5938k4812J1896K3447o71K8611J8795O638J0998P566j4974
18552A04164L053j0287K5936K457j9056l1251j6699m747O170L0085j904Q942J2868
18539A09731M804p802n675j9807L3192O823j1967j6364o22o241J5698L4493L2447
18526A68710l00j9535l2652j6071n329J9393J686j5884K5j8668q924K0195J6506
18513A09152r086j3820K9523K3444K0629L4944K488j6439N236K0279L0234M9744
18501B86328L709q284k6316N618j0140q188j2082k0373k5121k7294j931j5656
18489A40270Q973N4979J3832K123l8438m0560k0456r010J7013j7395N245K5315
18477A41891j1967j4728j4812k0627M409r404J761K0502j0307l0735P1J4091L6861
$$ y = [64374, 68856, 62608, 36670, 11858, 23754, 47201, 46530, 75141, 93936, 100574, 111572, 119138, 104164, 107217, 96930, 122866, 125323, 106267, 75016, 58317, 53570, 59740, 89825, 87921, 96863, 109731, 114535, 106733, 101058, 81251, 114443, 121266, 109299, 92935, 92313, 86072, 101770, 136263, 168710, 168410, 148875, 116223, 100152, 94823, 114216, 115902, 100018, 100043, 81375, 72451, 92646, 109152, 100066, 86246, 115769, 139213, 159842, 194786, 197274, 180835, 186071, 206350, 236584, 286328, 290037, 281753, 255437, 261055, 250915, 242727, 230645, 210272, 185151, 157857, 155926, 140270, 149243, 204222, 218054, 220177, 181739, 141179, 120723, 111713, 128726, 111331, 116576, 141891, 129924, 115196, 100384, 79757, 84166, 74762, 76523, 97025, 86718, 55983, 56054, 70145, 107006]
18464A07006J5832J0182L496j0242L1319R159J174j7910m4214j9196O13R796K8476
18451A25491J6175j0097l1254l2092k4787k1973j8773r796k3057j3820j4042k3337
18439h1362l0252j9155k557K9429P0893P1504R2559M1476N5813O1852Q741J8202
18427C17143J7182m0877k1975q022k2445r856j2615j3932l2756k1179j1679o307
18415A32682M358N314j4723k8077J5674j2948n176J1427N916k1188l6423Q492
18403F5328L8247m666J3657M8044L177k985L807J9204O950j052p09j1049k9413
18390A48540m074N319K9541J6485L0952O322r400J3953K8061O599l8385n7973
18378A75940j11727j06277j16393r7739j2338O4850R6044J25011J06456J17533
$$ y = [107006, 122838, 133020, 136516, 126274, 157593, 166752, 167926, 150016, 105802, 86606, 87219, 97015, 125491, 141666, 131569, 100315, 68223, 43436, 21463, 2690, -7106, -30163, -43983, -58025, -81362, -111614, -130769, -133326, -103897, -33004, 38500, 131059, 172535, 228348, 290200, 298941, 317143, 334325, 293448, 271473, 263451, 241006, 231150, 218535, 204603, 171847, 150668, 138989, 132682, 137040, 142354, 127631, 99554, 115228, 102280, 97104, 108531, 114447, 93259, 56836, 65328, 103575, 98909, 112566, 160610, 163787, 160802, 164609, 183813, 190763, 189711, 189002, 177953, 148540, 144466, 149785, 179326, 195811, 226763, 233085, 223685, 237638, 265699, 272298, 233913, 175940, 64213, -42064, -158457, -256196, -268534, -203684, -107640, 17371, 123827, 241360]
18368B41360R2521O8715O1568K5282q340k087k8309K5250J5845K5726M1993j8472
18356E41052j2929j1088J6736L6792M0915L8041O9906M3977j3785o311K5754N6580
18344H25640J4431M5359L7920N0321Q3267R2859Q4612Q6858J48400K74797L83742
18333B128206L87184K07270O9681j8283j4778Q3677J15929M8631L5133K8661J42294
18322C213605K52171J82073J5798j06551k39921k92234j90161m9283P7901J69609
18312C033007J82629J60071Q7279Q3726M6463M5382M9057K1642L2692K4481M3072
18301C809501J05746J70066K27537L48051M39855N08553N23680N43446O21345
18292G297780Q06673J209289J792496K441019K414140J714697J373661J448101
$$ y = [241360, 333881, 402596, 464164, 489446, 481106, 479019, 450710, 475960, 491805, 517531, 559524, 541052, 528123, 517035, 533771, 570563, 611478, 649519, 719425, 763402, 749617, 743306, 769060, 825640, 840071, 885430, 923350, 973671, 1056938, 1149797, 1234409, 1321267, 1469667, 1744464, 2128206, 2515390, 2722660, 2792341, 2774058, 2759280, 2842957, 2958886, 3007517, 3042650, 3071311, 3213605, 3465776, 3647849, 3663647, 3557096, 3317175, 3024941, 2834780, 2785497, 2863398, 3033007, 3215636, 3375707, 3462986, 3546712, 3593175, 3638557, 3687614, 3709256, 3741948, 3766429, 3809501, 3915247, 4085313, 4312850, 4660901, 5100756, 5609309, 6132989, 6676435, 7297780, 8104453, 9313742, 11106238, 13547257, 15961397, 17676094, 19049755, 20497856]
18284B0497856K152548L175794L435107L445127L539117L367377L259171L434822
18276D6306919L121752K670942L713463N580437P008852O769594L501941q39155
18268G7834745l706424m807235l996682k402928j735568j666145j270905M27755
18260E8676613L528733N324238M550339L974892K877675K613970M864801Q415698
18252I4826959J3587175K2199725L6403214N6321098P5965493Q1444996O3032189
18245D43780849K6881511j2404541m7162142o9245329p2691023o4144961n1037365
18238A53976999l6666980k3841083j4139290p549672l428417o04277J218767J169793
18230G0135840M75602R13806J513521J846813J919340L31070k642705n173595
$$ y = [20497856, 22650404, 25826198, 29261305, 32706432, 36245549, 39612926, 42872097, 46306919, 49428671, 52099613, 55813076, 61393513, 68402365, 75171959, 78673900, 77834745, 74128321, 69321086, 65324404, 62921476, 61185908, 59519763, 58248858, 58676613, 62205346, 67529584, 72079923, 76054815, 78932490, 81546460, 86411261, 94826959, 108414134, 130613859, 167017073, 223338171, 299303664, 380748660, 443780849, 470662360, 458257819, 411095677, 341850348, 269159325, 205014364, 153976999, 117310019, 93468936, 79329646, 71779974, 68351557, 67747280, 68966047, 70135840, 70611442, 71525248, 73038769, 74885582, 76804922, 77135992, 74493287, 69319692]
18222F9319692p147135p953638p103516n522514l898466k409452j302406l31653
18214C3650912Q75644K197647K783118J819483r0303j998420l484187m023494
18206C1730400l409945k186693r77669o5532M94870O97012J40174p11804j267216
18197B4443597j812481j906614j420542o94359J05166M66532P0472m87662r45734
18188A7818375j415260j557274j306404j080528q65202n35208j92737o4056j57302
18179A0644404k99303l78380k15007K19592R51015J615285J931502J660117Q09019
18170A6938244n8483p98348j253922j459383j369414r93739m98283o1457k9389
18161A0415826l36237p06936r87892j105606r92245o88312m21637k21983p6157
$$ y = [69319692, 62172557, 54218919, 47115403, 41592889, 37694423, 35284971, 33982565, 33650912, 34526556, 36724203, 39507321, 41326804, 41236501, 39238081, 35753894, 31730400, 28320455, 26133762, 25156093, 25090561, 25585431, 26282443, 26422617, 25710813, 24443597, 22631116, 20724502, 19303960, 18609601, 18714767, 19181299, 19251771, 18764109, 17818375, 16403115, 14845841, 13539437, 12458909, 11593707, 11058499, 10865762, 10801706, 10644404, 10345101, 9966721, 9751714, 9971306, 10922321, 12537606, 14469108, 16129225, 16938244, 16879761, 16081413, 14827491, 13368108, 11998694, 11004955, 10506672, 10445215, 10415826, 10079589, 9372653, 8384761, 7279155, 6286910, 5598598, 5176961, 4954978, 4878821]
18152D878821O4501K25424M10347M86033L27597P2889j26575k24710k27257j80119
18142E706951j92603j76767j39266n8103L9616L2049n7464j70445k77795k26722
18132D479451j83868k31861k71854k98977l20926k87564j94126m7142J60713L32027
18122C135873M99707N78983N30222M32528K22906J02845J80251M24956Q59147
18113F967418J762614L523002O791389J1386416J0873950J804260l058302p312932
18105C2737815j0342932q052618m704151k656537j612468j045858p25197n34007
18097C064047l95218k97230k42572k25105j95738j67963j22834r1981j08282p5341
18087A141783j9405j4377l0389m7417j8646n571j9085k8100k9164j7368l4272
$$ y = [4878821, 4943322, 5168746, 5579093, 6065126, 6392723, 6465612, 6339037, 6114327, 5887070, 5706951, 5514348, 5337581, 5198315, 5140212, 5179828, 5211877, 5154413, 4983968, 4706173, 4479451, 4295583, 4063722, 3791868, 3492891, 3171965, 2884401, 2690275, 2643133, 2803846, 3135873, 3635580, 4214563, 4744785, 5177313, 5400219, 5503064, 5683315, 6108271, 6967418, 8730032, 12253034, 19044423, 30430839, 41304789, 43109049, 40050747, 32737815, 22394883, 14342265, 9638114, 6981577, 5369109, 4323251, 3598054, 3064047, 2668829, 2371599, 2129027, 1903922, 1708184, 1540221, 1417387, 1325406, 1217124, 1141783, 1122378, 1108001, 1077612, 1030195, 1011549, 1005978, 986893, 958793, 929629, 912261, 877989]
18076H77989l7845l7765m9955l2601j2056l0979l3983o2913o4936q579k7391l1803
18064D47183m871l1099k8957J4941L4518j1339K3885P6100M3357J2297K4483N5572
18052F56070M0943N733l1321n6711j2736j1621j3095k8288m0663l6578l3474j1880
18040D26379l362L61k1287r670J6945N004k0845J1187J7200M268j9048k3464K8568
18027D12236N3473k108N95j4287J2697K1979L8690J7143J5505N450k1090l0210
18015E10073Q581L273l1617k4145j6252q655p097J7251J0141J291J1026p972r183
18002D56715j1932p672O88j9463m2851n0029L853K5193k6411l4786N715j7830
17990B81190k2298k4468R10L8340J1548l3466r950J3837O854M0080M2779J2178
$$ y = [877989, 840144, 802379, 752424, 719823, 707767, 676788, 642805, 579892, 514956, 506377, 478986, 447183, 442312, 411213, 382256, 397197, 431715, 420376, 444261, 520361, 563718, 576015, 600498, 656070, 697013, 702746, 671425, 614714, 601978, 590357, 577262, 548974, 508311, 471733, 438259, 426379, 423017, 423378, 402091, 392421, 409366, 414370, 393525, 404712, 421912, 426180, 407132, 383668, 412236, 465709, 463601, 464196, 449909, 462606, 484585, 523275, 540418, 555923, 561373, 540283, 510073, 518654, 521927, 490310, 466165, 449913, 441258, 434161, 451412, 461553, 462844, 473870, 465898, 456715, 444783, 437111, 437799, 418336, 375485, 325456, 329309, 354502, 328091, 293305, 299020, 281190, 258892, 234424, 235334, 273674, 285222, 251756, 241806, 255643, 262497, 302577, 345356, 357534]
17978C57534P685j3793l2510q106j6945j4533J330K1057k1994k6539j6249j8709
17966B18228M3535K7965p213m0988l0678L891N523J4646O203J5670K8726J9168
17954C04676k011J996r769j044O281K0481J7529P300j4066l4296j2388K4588n209
17941C04068n785j0115k2297Q982j684q006n438n054k5876j6008k5381k3214K6092
17928A90284l589n0644k8327j4394Q960k8593m0270J1355L7464L6172j2700J4002
17916A19720L4002k858k5176j4338j9062j4151k1900L356K1038j791J3403j9399
17904G2844M779K4173r118k1K5208J3753L839k6252j6647K728K0720J4564P868
17891A38438R306M615R108J9159j1742l8272l1986r23J5298K0994J7720p096j5280
$$ y = [357534, 365219, 351426, 318916, 310810, 293865, 279332, 280662, 301719, 279725, 253186, 236937, 218228, 261763, 289728, 282515, 241527, 210849, 214740, 220263, 234909, 241112, 256782, 285508, 304676, 302665, 304661, 294892, 293848, 300129, 320610, 338139, 345439, 331373, 297077, 284689, 309277, 304068, 298283, 288168, 265871, 274853, 273169, 265163, 259725, 254671, 228795, 212787, 187406, 164192, 190284, 186695, 136051, 107724, 93330, 102290, 73697, 33427, 44782, 82246, 118418, 105718, 119720, 153722, 150864, 125688, 111350, 92288, 78137, 56237, 59593, 80631, 78840, 92243, 72844, 77623, 101796, 92678, 92657, 117865, 131618, 135457, 109205, 92558, 95286, 116006, 130570, 138438, 147744, 152359, 161467, 180626, 168884, 130612, 98626, 97703, 113001, 133995, 151715, 144619, 129339]
17878A29339n836l973L0371J2853k7335k7330o818J0560L942m832q44o585L9200
17865A42712l448k8958l8J7391q404j5174J122J5626j349k232N023j3143j5963
17852I3165J6938K200j7007J420m339p768P279R416J3120k3372p529L3090L057
17839A19670P183r081j623R988j402k908n642N022j4369j4000K131J322l396k43
17825I2652q527K2608K389k2853J7256o366k7791L899Q452l4991K283J2331J3877
17812G5219j516M024J3193P598l081M059M688K0680J5303M8036M1241M9422K0366
17799B99232j5744k5582J183K1622M01K4432J7779p014n5478k1473j8528M185
17787B25015P189J1643J46L3482Q852J7847K1818R969L1045K5952K9713J3831
$$ y = [129339, 123503, 119530, 149901, 162754, 135419, 108089, 101271, 111831, 115773, 110941, 110097, 103512, 142712, 139264, 110306, 110268, 127659, 119255, 104081, 105203, 120829, 119480, 117248, 122271, 109128, 93165, 110103, 112303, 95296, 96716, 92377, 84609, 91888, 101304, 114424, 91052, 83523, 116613, 119670, 126853, 117772, 116149, 126137, 124735, 121827, 116185, 121207, 106838, 92838, 94969, 96291, 92895, 92652, 84125, 106733, 109122, 86269, 103525, 97159, 69368, 73267, 81719, 46728, 49011, 61342, 75219, 73703, 77727, 90920, 98518, 95437, 99496, 104184, 124864, 140167, 188203, 229444, 278866, 299232, 283488, 257906, 259089, 280711, 281112, 305544, 323323, 316309, 260831, 239358, 220830, 225015, 232204, 243847, 243993, 277475, 286327, 304174, 325992, 335961, 367006, 392958, 422671, 436502]
17775D36502L700J1160R345J4872L4855K2156N033K8378p418L1994K0212j2674
17763E98115l6487j9021K519J452k6901l8629l9979l9936k1259k1816r133L057
17751C51982N8566K5816J8660K9576K1469M769j956O365k2549j8085r833K549
17739D67329j3649l7597k815K7117L6077p796L9661J3199j3139j7025n9902n993
17727D25467j0812j3865n544M591J6400O778J0809M6476K7026l728m6059J2313
17715D69852J0654l011N266K851j5098j7228m4468n0056j5685l6579k6594m020
17703B75884j1080j2098j0551P871j2891l76N830J9351L1679J1639m028k8597
17691B72633J5520k9701m0212o2277n990K861j4891L2695q922m681O298k0757
$$ y = [436502, 440202, 451362, 460707, 475579, 510434, 532590, 537623, 566001, 558583, 590577, 610789, 598115, 561628, 542607, 545126, 546578, 519677, 481048, 441069, 401133, 379874, 358058, 348925, 351982, 410548, 436364, 455024, 484600, 506069, 510838, 508882, 515247, 492698, 474613, 464780, 467329, 453680, 416083, 413268, 440385, 476462, 468666, 508327, 521526, 508387, 491362, 431460, 425467, 414655, 400790, 395246, 399837, 416237, 423015, 433824, 480300, 507326, 503598, 457539, 469852, 480506, 477495, 482761, 485612, 470514, 453286, 408818, 358762, 343077, 306498, 279904, 275884, 264804, 252706, 242155, 250026, 237135, 236759, 242589, 261940, 293619, 305258, 301230, 272633, 288153, 258452, 218240, 155963, 149973, 152834, 137943, 170638, 161716, 157035, 163333, 142576]
17679A42576O626L1176J1472j4938k478P124j8234l4593n813J488l0871j7733
17667G5802M468R440L1482M4614k4453k6052L9025K1846k7355p185J1852o175
17655A47309j3890k8343k4419r019p690n100m945J3369K0226J1960k0175J687
17643H0970J0397N268K8863J0682l1362j2977P527j655m818m906j9895j5629R156
17630F1621k3086j2209j5085R05q530J5082L0826j932q995J0273M955l908R178
17617E9095M358J6060k887Q418R888r916j3684k4510j4214P386J4741k8481k3502
17604B752K5005j4514J1574J7602K4135N147j0008j2443k0842Q255n091R486J3330
17591E4388k4319k9590K5225K8142q624k4248k0499J0478j2718j5533j2275J7990
$$ y = [142576, 149202, 180378, 191850, 176912, 174434, 181558, 163324, 128731, 122918, 124406, 93535, 75802, 80270, 89710, 121192, 165806, 141353, 115301, 154326, 176172, 148817, 141632, 153484, 147309, 133419, 105076, 80657, 71638, 63948, 58848, 53903, 67272, 87498, 99458, 79283, 80970, 91367, 96635, 125498, 136180, 104818, 91841, 99368, 97713, 92895, 87989, 68094, 52465, 61621, 38535, 26326, 11241, 12146, 3616, 18698, 49524, 47592, 38597, 48870, 53825, 49917, 59095, 63453, 79513, 76626, 85044, 94932, 85016, 71332, 46822, 32608, 39994, 54735, 26254, 2752, 27757, 13243, 24817, 42419, 66554, 71701, 61693, 49250, 28408, 36663, 31572, 41058, 54388, 30069, 479, 25704, 53846, 45222, 20974, 475, 10953, -1765, -17298, -29573, -11583]
17579a1583J2515m338J4806L4843k98l3044k1211q680N457l959m226K0958k317
17566a077q546j3680J6094O310R203L2906K4472k8860k9762l0441o453J1058L61
17553a8415j1291K202Q416K7532P666j5632P326J2645q286o813j7371J3711o238
17540d548k371M3421L2984q330m0694k0112l953J5617R419k008N109J333o753
17527A9114P630j720p819j5577k5454k7548N278J731J077L7655P386J0817J9729
17514C2299j2980j4305k132P577J4934Q372Q778R69l335k117R689k3088m773l5927
17500a6039j6050J7403L3777L2795J7879m474m7167p927j2827k2443j1004Q99
17488c5178J4952K9763j6491j1786L0923Q052r354O322j0514l1040o607J803K330
$$ y = [-11583, 932, -3406, 11400, 46243, 45945, 12901, -8310, -16990, -11533, -15492, -19718, 1240, -1077, -9623, -23303, -7209, -899, 8304, 41210, 65682, 36822, 7060, -23381, -29834, -18776, -18415, -29706, -27504, -19088, 8444, 16110, 478, 7804, 20449, 12163, 5350, -12021, 1690, -4548, -6919, 36502, 69486, 61156, 20462, 350, -3603, 12014, 21433, 19425, 24534, 25867, 19114, 26744, 25024, 17205, 1628, -23826, -51374, -46096, -44365, -43288, -5633, 1753, 12570, 32299, 19319, 5014, 2882, 10459, 25393, 33765, 42543, 43512, 40177, 38060, 47749, 24661, 19888, -16039, -32089, -14686, 19091, 51886, 69765, 65291, 18124, 10197, -2630, -25073, -36077, -35178, -20226, 9537, -6954, -18740, 12183, 20235, 10881, 17203, 6689, -24351, -30958, -29155, -26825]
17475b6825K910p847K7676J8573K0249p603q12J848k314j2027J2651J418j4689
17462A3208j7919l0155p349L2195M3938J038j3786J09j5799n348M690J663L3584
17449D0069l479J5327K6436j633M6528N5497P7779L0377j5532p4555n6929j1491
17437A28394k5211N533k5140l3264N878j7025l2978j1001m354j1180k3945J2005
17425c2288K5981J9380K059j4862J1275J4518n285q690J7937k2815Q731K695j9478
17412h42j5186q491n320J3995J1678r856J0848j9182j7474M027J1255J3936k612
17399a3224n838J7940j4588j2906R890R59J1200P39Q88J3288K0026J4359j655
17386D1078n626l8211m629J5485j6695P42r7q700J9100K807j7920m034o602L2401
$$ y = [-26825, -23915, -31762, -4086, 14487, 34736, 27133, 26321, 28169, 25855, 13828, 26479, 27897, 13208, -4711, -34866, -42215, -10020, 33918, 34956, 21170, 21279, 5480, 132, 4822, 6485, 40069, 36590, 51917, 78353, 76720, 123248, 178745, 256524, 286901, 271369, 196814, 139885, 128394, 103183, 108716, 83576, 50312, 56190, 39165, 6187, -4814, -9168, -20348, -44293, -32288, -6307, 13073, 15132, 270, 11545, 26063, 20778, 12088, 30025, 7210, 15941, 18636, -842, -16028, -24519, -29839, -15844, -4166, -14022, -3174, -22356, -39830, -35803, -24548, -10612, -13224, -19062, -1122, -15710, -28616, -18726, -17767, -6567, -5828, -4940, 8348, 28374, 42733, 41078, 35452, -2759, -7388, 8097, -8598, -7856, -7953, -16653, 2447, 5254, -12666, -16700, -23302, 9099]
17372I099K2137l1769p611K0474o78j3031O247j521J3795o823k23O948l658k5171
17358a1785j7261Q999J0226j4360j4395p393r902n744K3263N1227J7819Q615r310
17345B9999j3830J4043J2617k9871k4096k7742j3242J7945L8463J0157k8286k3800
17333c7643J0508K8761P226o15j6418j2296k511P802k0714P372J4263o020K2445
17320B160J3072J3631o33q360J5983j7687o761j3809j0758L556M441n564k186
17307a2915j3816k1844J7297J1247J6067R773k8697J62N791N815j6893K1770o258
17294a2501q299k554j6915K2857J7258K1854K6957j0178k6693O561j5527J159
17282C979J4252J4275q297m480j8080K561q783J6050K5392k447k978j6156j977
$$ y = [9099, 31236, -533, -8144, 12330, 11652, -1379, 4868, 3347, 17142, 10319, 10096, 17044, 13386, -11785, -29046, -20047, -9821, -24181, -38576, -45969, -55871, -61615, -38352, 12875, 30694, 39309, 29999, 16169, 30212, 42829, 12958, -11138, -38880, -52122, -34177, 4286, 14443, -13843, -37643, -27135, 1626, 8852, 8237, -8181, -20477, -22988, -15186, -35900, -28528, -14265, -20285, 2160, 15232, 28863, 28230, 19870, 35853, 18166, 11405, -2404, -13162, -9606, -5165, -10729, -12915, -26731, -48575, -31278, -20031, -3964, 5809, -22888, -22726, -16935, -11120, -28013, -6243, -12501, -20800, -23354, -40269, -17412, -154, 21700, 48657, 38479, 11786, 18347, 2820, 3979, 18231, 32506, 24209, 19729, 1649, 4210, -4573, 11477, 36869, 34422, 31444, 15288, 13311]
17269A3311M075k401k4379K968K4587R109q681l740j8077R908j9642j0785J0447
17256a3300L4364O869m397j1422R668j163l783K0290j4826j5075l916K6673o309
17243B3673k1270r295N423J8245J1479K3802J065j7218p932j6778K8140q459j3209
17230A7666j005l3717j2999L311K0135L3514j391j1436j1071j0998N901m801J3731
17217F840R184K580J479j6267j036J6876P179m940J6039J541J3149K018j5527
17204C9115L568n551O165j4908j7300k4076N774j2247J744k9385j417J2957J8659
17191a6902L1681j8556m4539O651J5982k879m793K9306J4337R781P696O572o903
17178B7434l6049j3597K922J4772R004m456j3928j9845J6247J6738P148k1707
$$ y = [13311, 17386, 14985, -9394, -6426, 18161, 27270, 18589, 14849, -3228, 6680, -12962, -23747, -13300, 21064, 27933, 23536, 12114, 21782, 20619, 16836, 37126, 22300, 7225, 3309, 29982, 23673, 2403, -6892, -1469, 16776, 28255, 52057, 53122, 35904, 27972, 11194, 39334, 30875, 17666, 16661, -17056, -30055, -26744, -6609, 26905, 25514, 14078, 3007, -7991, -2090, -6891, 6840, 16024, 18604, 20083, 3816, 2780, 19656, 26835, 21895, 37934, 39475, 52624, 54642, 39115, 42683, 37132, 43297, 28389, 11089, -12987, -7213, -19460, -17716, -47101, -48518, -35561, -16902, 14779, -3777, -48316, -41665, -25683, -28562, -33355, -4049, 10288, 20069, 27765, 34337, 27434, -8615, -22212, -19290, -4518, 4486, 30, -13898, -33743, -17496, -758, 6390, -15317]
17166a5317p877R173P320J9946p906L7766J0557j2512j7177N98O144k1449j796
17153G470j3323M1861J9478k0649j4731k6421r381J1623k0423j326K3732J0044
17141G954n450j701o873j0237j4734o068K4834P842k278K4041J7034K07m0544
17128e973l3426J0965K5697j102J850P014m790p942K5841J5379N354J8569J37
17115E7573k6034m1440k3858K159o420J8289k285J0047M240L1203k117k2832J952
17102D77J3738j7123o125k371j5103J4832K675l4785j634L2209J0616P711J757
17089F874J2426p115O311k0887r138J0158L9352j6586o442p667j8010r898J3833
17076f789J7554j4660j9306K5758j5045j9486Q733L2509J4615m607j1568j895
$$ y = [-15317, -23194, -14021, -6701, 13245, 5339, 43105, 53662, 41150, 23973, 24571, 30715, 9266, 7470, -5853, 36008, 55486, 34837, 20106, -6315, -15696, -4073, -24496, -25822, -2090, 7954, 2504, 803, -6070, -16307, -31041, -37109, -12275, -4433, -6711, 17330, 34364, 34571, -5973, -39399, -28434, -2737, -3839, -1989, 5025, 235, -7707, 18134, 33513, 38867, 57436, 57573, 31539, -9901, -33759, -31600, -38020, -19731, -22016, -11969, -7729, 23474, 21357, -1475, 477, 14215, -2908, -9033, -11404, -26507, -11675, -9000, -43785, -45419, -13210, -2594, 5117, 6874, 19300, 12185, 18496, -2391, -11529, -1371, 37981, 21395, 14953, 7286, -10724, -20622, -6789, 10765, -3895, -23201, 2557, -12488, -31974, -23241, 9268, 23883, 19276, 7708, 5813]
17064E813k3329k5545p235J9179j3794K763L4240r533j7560J0462Q759J4312l109
17051d577q724K998j3352k5648O689K0931k1174J2384p520J0754P234k0332M924
17038c5413M320n990M619J7915j479Q466j4029j644J5755K4990m1491k0526L2595
17025a1912J4961k9371K060J9717L140L622n595j35j5196j3730j290L739k2013
17012e2003k280Q735J6443J0490J8779J3568j5217k0470j09O760o94k6102R606
16999c2494M6157P76j7356O62j9081k4274K2262m664p552L418J6840J5287J6188
16986A6169m8477l9842L6928J6206r895k82O543K5809L237J3469K4131J2948k9181
16973B7763J05k1639p856k0089K0494K499O701k1301k1883N216K3589J8270M4494
$$ y = [5813, -17516, -43061, -50296, -31117, -44911, -42148, -7908, -17441, -35001, -24539, -15780, -1468, -4577, -13301, -10303, -23655, -49303, -42614, -21683, -42857, -30473, -37993, -27239, -20005, -40337, -35413, -31093, -37083, -32464, -14549, -16028, -7562, -21591, -23235, -7480, 17510, -23981, -44507, -11912, 3049, -26322, -24262, -4545, -1405, 2217, -3378, -3513, -18709, -32439, -33729, -29990, -52003, -54283, -45548, -29105, -18615, 164, 13732, -1485, -21955, -22064, -15304, -15998, -42100, -32494, 13663, 14439, -2917, -2255, -21336, -45610, -23348, -28012, -35564, -32146, -15306, -19, 16169, -32308, -72150, -35222, -19016, -28911, -29193, -22650, 3159, 6396, 19865, 43996, 56944, 27763, 27868, 6229, -1627, -21716, -1222, 1277, 7978, -13323, -35206, -29990, -6401, 11869, 56363]
16960E6363j9313n8182K2818q008l5789p356K7973Q515j7852l824J42K384O265
16947b5864k9844Q337J9811j4627l111O78R139P651K1452L883k862p578n363J4339
16933c959j8931K6477J8922N03M630r416k2798j5574j0527j3539Q569M766j8193
16920d9070J8911J5186J1982O442Q6K6875M176l3965j5646j2591j068K3290R087
16907C695j7827j4738p936R062K5606J658q486p055j5877J401l344k467j2358
16894d8666o265p521O291l595l847K1229o400j7081J2710j9130q01K3028J8390
16881c1658J0630j2594m98J8140J1522P315J4784k4916j0955j3625O690K5232
16869F7J5160k3961k0781J3757J8995K745j2133R208N211l8235l5035n48J7972
$$ y = [56363, 37050, -21132, 1686, -6322, -42111, -49467, -21494, -12979, -30831, -34655, -34513, -32129, -25864, -55708, -47371, -27560, -42187, -45298, -44620, -35481, -27830, -6378, -2495, -5357, -12935, -18298, -3959, -22890, 3587, 22509, 23012, 27642, 18226, -4572, -20146, -30673, -44212, -35643, -30877, -49070, -30159, -14973, -2991, 3451, 3537, 30412, 34588, 623, -15023, -27614, -28682, -5392, 3695, -14132, -28870, -36806, -27744, -2138, -480, -8966, -16021, -31898, -30497, -33841, -36308, -48666, -54931, -62452, -56161, -59756, -63603, -42374, -48774, -65855, -53145, -72275, -73076, -50048, -31658, -21028, -33622, -34120, -15980, -4458, 2857, 17641, -7275, -18230, -31855, -25165, 67, 15227, -8734, -29515, -15758, 3237, 5982, -6151, 3057, 8268, -29967, -65002, -65550, -47578]
16856d7578J7220J4354n226L4583R156j2838k4159J0421J9481j6307j7550j1164
16844b9607J6221R819j7417N281N321J2185j368j5104J1409R6J5247J0033N572
16831B7688R365p300j6363K0612R173n267J3904J5726L37r208k0684M917k6275
16818A6625l1830k0267K0351O101p304J2188Q393k4793K6389l890k8573O299q96
16805b1207L5651j2468k2940K051L4139R914o534L569r632j4892J4812q066J3277
16792A7674q039r724m6176l071Q91J6242L1850P159k6315j1042J2299L9615J3114
16779C4477R541j0168r187J984j2113j5462j8931J0763j1303j1692M1669n874
16767C704j5153j1313l7762N179J0473M7910L9837N328j5766j2009p622J2078
$$ y = [-47578, -30358, -16004, -21230, 13353, 22509, 9671, -14488, -4067, 15414, -893, -18443, -29607, -13386, -3567, -20984, -15703, -10382, 1803, 435, -14669, -3260, -3164, 12083, 22116, 27688, 37053, 29753, 13390, 34002, 43175, 37908, 51812, 67538, 67875, 58667, 37983, 42900, 16625, -15205, -35472, -15121, -9020, -16324, -4136, 4257, -20536, 5853, 1963, -26610, -20311, -21207, 14444, 1976, -20964, -18913, 15226, 25140, 18606, 22175, 12543, -2349, 12463, 4397, 17674, 9635, -89, -46265, -49336, -48445, -32203, -353, 6806, -19509, -30551, -18252, 21363, 34477, 44018, 33850, 24663, 26647, 14534, -928, -19859, -9096, -20399, -32091, 9578, 3704, -11449, -22762, -60524, -55345, -44872, 3038, 42875, 48203, 32437, 20428, 12806, 24884]
16755B4884j8541k6387j3367L458J0472j7099j1166J8192K0393j0328J3139J0437
16743D087j7120m963K4179K0462J8339k1237n774M106o233j2024o570J6640j0450
16730C442m935j0181J1078j2133j6385j1635l599L3764M0812J4993N952j385k7786
16717B2002N752K1846K498j7409p15N445m896m362k7240O820K1856J6306M161
16704E2064j6334j2974q477n0750l4315N343M9608N6005k9972n765R913o705p904
16691b63Q334l2595J1469O234l275O379k55k262j2074O648J4400J1996o120l9592
16677c0976j4203J1398m080N455l803j6086J3580K9130R627J5486j9798K0260
16665A5990J9932k5965j8991j9124R262M5402r658j1766K2664k3794j2796p970
$$ y = [24884, 6343, -20044, -33411, -29953, -19481, -36580, -47746, -29554, -9161, -19489, -6350, 4087, -13033, -17996, 6183, 26645, 44984, 23747, 17973, 22079, 15846, 3822, -2748, 13892, 3442, -1493, -11674, -596, -12729, -29114, -40749, -44348, -10584, 30228, 45221, 51173, 49788, 22002, 27754, 49600, 52098, 34689, 33974, 39419, 34523, 30161, 2921, 9741, 31597, 47903, 52064, 35730, 22756, 14279, -36471, -70786, -65443, -15835, 40170, 10198, 4433, 14346, 7641, -263, 8071, -24524, -13055, -6821, -10096, -3717, -3972, -6234, -18308, -11660, 2740, 14736, 8616, -30976, -45179, -33781, -37861, -32406, -36209, -52295, -38715, -9585, 42, 15528, -4270, 15990, 35922, 9957, -9034, -28158, -18896, 26506, 16848, 5082, 27746, 3952, -8844, -16814]
16653a6814j1034M002K5092o498j8252J2830L3892r88k2901q702L190j139k193
16640i515J2159L3657K2795m69L892l2310k4534k6604j6804R937K616J1671p202
16627b0711K9048N399m2463j0943K7306N8141R091J0812l1041l5566k8071l628
16615c2626m650J2460J0128Q489J5326j699j2172o03J4022R556J2168J2176m964
16602C7611O609j321k0734m582r667M437K335J4038j5587r009K7895k0832r725
16589A468J0151j2654K5k050R141m198J1084k3789j9357J6146J8504o624J269
16576h84k884J8498J6647j1423p783k5363n469Q831j1291k6509K8392K4178R904
16563A4844K3426L871J936K316l3240l5964N156K7108P487J177k1719J1314J9392
$$ y = [-16814, -27848, -23846, 1246, -5252, -23504, -10674, 23218, 22230, -671, -9373, -6183, -7322, -9515, 2644, 36301, 59096, 58627, 62519, 30209, 5675, -20929, -37733, -27796, -25180, -13509, -20711, 8337, 13736, -28727, -39670, -12364, 45777, 54868, 65680, 34639, -927, -28998, -32626, -37276, -24816, -14688, -6199, 9127, 7428, -4744, -5347, 8675, 18231, 30399, 42575, 37611, 44220, 42899, 22165, 17583, 7916, 12353, 14688, 28726, 13139, 4130, 32025, 11193, 1468, 11619, -1035, -1010, -3060, 6081, 1883, 12967, -10822, -30179, -14033, 4471, -2153, -884, -3768, 14730, 31377, 19954, 12171, -13192, -18661, -9830, -21121, -47630, -19238, 4940, 14844, 38270, 42141, 44077, 46393, 13153, -22811, -17655, 9453, 16940, 18117, -3602, 7712, 27104]
16550B7104K144p105j7070j7967r999K16O623q515j9324K5534L6251J0295q866
16537A9321j4558J0578P806k4115p114j3311J5074O539j2017M273J2515m8j3275
16524h332J3916O944j8645K623J5556j190l1321j7715J5650r103J013j990j5037
16511d7631N008j2213m568L0067L2443q318j0429r779m804J6032N509J5941K7229
16498C4487l4429k0153p02m084j1944j2436J4367L0584j9214N335J9086p758j7055
16485b3916K1616l700o215J1316p07k675Q691Q858p887k0621l8414J6069J9596
16472a7989r183j1069o695j17j3531r55K7887J4872R850K4595k1386q784L2789
16459B0284k048k3383L650j3834k1180r613N555Q769O823K0803K5861m835m0758
$$ y = [27104, 29248, 22143, 5073, -12894, -22893, -22677, -16054, -24569, -43893, -18359, 17892, 28187, 19321, 4763, 15341, 23147, -968, -8082, -21393, -6319, 220, -11797, -7524, 4991, 4943, -8332, 5584, 12528, -6117, -3494, 12062, 10872, -20449, -38164, -22514, -31617, -30604, -32594, -47631, -42623, -54836, -59404, -29337, 3106, -5212, -15641, -25420, -30224, -14192, -8683, 7258, 34487, 58, -20095, -20797, -24881, -36825, -49261, -34894, -4310, -23524, -18189, 897, -6861, -23916, -2300, -6000, -12215, -899, -1606, -4281, 4410, 13268, 5381, -15240, -53654, -37585, -17989, -27172, -38241, -44936, -45053, -58584, -59539, -31652, -16780, -6930, 17665, -3721, -12505, 20284, 18236, -5147, -1497, -15331, -36511, -46124, -40569, -31800, -24977, -4174, 21687, 16852, -23906]
16446b3906j9956o70J9895L7415l886j2538J5837J5958j8849j251p483J3705K333
16433A6604L986n113P781k4563l018J7517p472q125k3200k9562J1854J6133J42
16420b7036k3284j24n25p973N924R87J2641K1106J8483p845k7968k7569K0915
16407d2268M3310L7312J3476m3505l8205R364j7540J326J1259J925K3790q169
16395g925K141j0050k6252K4215K4590j4616k0905k252q768k179k990K0062K0744
16382d185O543k543l8129L0100N7282n961k9345k8206k7118l0223N719M8382J9859
16369B175j0582l20J0245j7463k765K471K4147O626n250M309j892p585m125J8764
16355A8755k9532l721j5639J2471K4116K1741O487l1644l519J1454J2067J4788
$$ y = [-23906, -43862, -44532, -24637, 12778, 8892, -3646, 12191, 28149, 9300, 8049, 566, 14271, 16604, 20590, 15477, 23258, -1305, -4323, 13194, 5722, -2403, -25603, -55165, -43311, -27178, -27036, -50320, -50444, -50969, -58942, -53018, -52031, -39390, -18284, 199, -7646, -35614, -63183, -42268, 1042, 38354, 51830, 8325, -29880, -20516, -38056, -36730, -25471, -23546, 244, -7925, -5784, -15834, -42086, -17871, 6719, -7897, -28802, -31054, -39822, -42001, -44991, -24929, -4185, 2358, -185, -38314, -8214, 49068, 43107, 13762, -14444, -41562, -71785, -66066, -17684, 2175, -8407, -8727, 1518, -15945, -18710, -16239, 7908, 14534, 9284, 13593, 11701, 4116, -9, 18755, -10777, -14498, -30137, -17666, 6450, 28191, 34678, 3034, -485, 10969, 23036, 37824]
16343C7824k0492l4525M939J1463O383L177k657q141r75L975O438k1422k5834
16330c9847j2457k328J0039J1455J8510K576N408Q781J393K7119L4287j8896j8679
16317B7361l2015N830K1883j422j6764j5079k7693Q089L3320J0953J3236J792
16305B9491j3690L203k530m981j7732n964l491n209J1294K6657M639m578k6915
16292i806J7601K7887j059k3180j476L17q588k6709p152q942k1104J4298L1307
16279a6606L1509N627l0564k8409J222K4117o624j7601K0248o042R504M267j5435
16266b4787j1765j607J3309J9628J7026l118j1231R159j1370o756J2686J7887
16254A9061R758J803k873o186j7468q725j339j375q181j7248p681K7249k150R105
$$ y = [37824, 17332, -17193, -12254, -791, 5592, 8769, 6112, -2029, -3004, 971, 7409, -14013, -39847, -52304, -54632, -44593, -33138, -14628, -12052, -6644, 2137, 3530, 30649, 64936, 46040, 27361, -4654, 1176, 23059, 21637, 4873, -10206, -37899, -29810, 3510, 14463, 27699, 29491, 15801, 19004, 16474, 11493, -6239, -12203, -15694, -20903, -9609, 17048, 21687, 17109, -9806, 7795, 35682, 34623, 11443, 9967, 10284, 1696, -25013, -32165, -41107, -62211, -47913, -16606, 14903, 20530, -10034, -38443, -37221, -13104, -19728, -37329, -17081, -23123, -13619, -9352, -24787, -36552, -38159, -24850, -5222, 11804, 8686, -2545, 6614, -4756, -11512, 1174, 19061, 28819, 30622, 27749, 21563, 4095, -4630, -5969, -7344, -15525, -32773, -40454, -13205, -15355, -6250]
16240f250J242N149Q210K722n559j8420O629K142K2063K0356k7595k7578J0151
16227f738j3343j185L5406j3390j4430J4245K2889j2903J3192k574n414J3259
16215B9014j21j7623k4974O479J618K8121n643k1599r741L1170L32l319J4717
16202B8431k6599l2321k8145O629q477J5749J3664M865p8L0743J4210o369k1976
16189i674K215J2309k4512L611K3951N240k2238J1875Q068j2695n305p52J7360
16176I453K2963j0414k048K7892j1049k5877k044N778J374O213o171O447l3047
16163a0530n964r818j245J7077o559J4571j390j4703K0985N584K719j8012l881
16150a1166J0652K626q967p243J8071L3358q640r7K513j0963j5731l897k815M765
$$ y = [-6250, -5008, 141, 8351, 11073, 5514, -12906, -6277, -4135, 17928, 38284, 10689, -16889, -6738, -20081, -21266, 14140, 750, -13680, 565, 23454, 10551, 23743, 21169, 15755, 29014, 28893, 11270, -13704, -7225, -5607, 22514, 16871, -4728, -14469, 16701, 17033, 13714, 28431, 1832, -30489, -58634, -52005, -60482, -44733, -31069, -26204, -26282, 4461, 18671, 12302, -9674, -7459, 4850, -19662, -16051, 7900, 13140, -9098, 2777, 10845, -1850, -7155, -7907, 9453, 32416, 22002, 19954, 47846, 36797, 10920, 8876, 14654, 16028, 22241, 16070, 22517, -10530, -16494, -26312, -27557, -10480, -17039, -2468, -3858, -18561, 2424, 8008, 10727, -7285, -11166, -514, 2112, -6855, -14098, 3973, 37331, 28691, 28594, 31107, 20144, 4413, 516, -2299, 2466]
16136B466J0716j7489r441J4880k863k1126J9122J2810j712L151j1772j6989O832
16123a1415J6761L7032r343k2495l9379J8044K3973K5140k5140R04Q241j3791
16111H532R892J2243k4390j0801m686o810K13K5081K5226J0404p006p023l2614
16098a739j8315j4321N181J3958p123K4391L2722q393j4592L806k8604m546K1287
16085C712K3323J195j267j2969n710j0361k1772k5131J3741p44N058J0824m636
16072b4737O083J9844j191m497q363J7469K8000j0603p51q986M332M211J281Q65
16058B2957j6349r914J7250J3072j0673k6514J324K1284O700N359j5593m003L5076
16045C9976K0485J1356r732o804k3253k4364K5398K0116j5873l7159k739k5240
$$ y = [2466, 13182, -4307, -13748, 1132, -1731, -22857, -3735, 9075, 7363, 10514, -1258, -18247, -11415, 5346, 42378, 33035, 10540, -28839, -10795, 13178, 38318, 13178, 14082, 22323, 8532, 18424, 30667, 6277, -4524, -9210, -16020, -15807, 9274, 34500, 44904, 37898, 30875, -1739, -20054, -34375, -29194, -15236, -22359, 2032, 34754, 26361, 11769, 15575, -13029, -17575, 3712, 27035, 28230, 26963, 13994, 8284, -2077, -23849, -48980, -35239, -35983, -30925, -20101, -24737, -18654, 1190, -1, -4498, -12861, 4608, 32608, 22005, 21254, 12268, 16600, 20811, 22092, 22957, 6608, -3306, 13944, 27016, 16343, -10171, -8847, 12437, 19137, 24496, 8903, 4900, 39976, 60461, 71817, 62085, 55281, 32028, 7664, 33062, 53178, 37305, 146, -2593, -27833]
16033b7833j5621J2296M487m337P871n390j7655j1030J8903l7577p781K1543L851
16020e8273R489M616M061J6719J4602r90k4265K6792J2659j0760J1317j3148k9075
16007c6256j7691K5153J0923k651N067p592M661K7471K4721j120J182J0175j268
15994D2775K175r418k8339j7432j897J6710P750J1436k0876j1824R186k8402M592
15981b3564J8432J5017K3382J7411j5746j0002J0181P880J9830J0968l9184k1990
15969A2615r591l6407j6949K2709K6211j784k6993j7008R297j7512J9258L4335
15957a819j781l979K4050L271K2071J891k4476m323k7452j0387K3098j2253q903
15944b0992n87O076j4987J6870M0022J98q182n007L390n29L802P890M849j6450
$$ y = [-27833, -43454, -31158, -26671, -31008, -23137, -28527, -46182, -57212, -38309, -75886, -83667, -62124, -58273, -48784, -44168, -40107, -23388, -8786, -9776, -34041, -7249, 5410, -5350, 5967, -7181, -36256, -53947, -28794, -17871, -20522, -15455, -23047, -18386, 9085, 33806, 32686, 33868, 44043, 42775, 44950, 35532, 7193, -10239, -12136, 4574, 12324, 23760, 2884, -8940, 246, -28156, -23564, -5132, 9885, 33267, 50678, 34932, 24930, 35111, 42991, 62821, 73789, 34605, 12615, 3024, -33383, -50332, -27623, -1412, -3196, -30189, -47197, -37900, -55412, -36154, -1819, -3600, -7579, 16471, 19742, 41813, 43704, 19228, 14905, -12547, -22934, 164, -12089, -20992, -21579, -15503, -30490, -13620, 26402, 26600, 18418, 13411, 16801, 16272, 20074, 27964, 32813, 16363]
15930A6363l9881o113K780j858k846m794J1470M0130K1564m427j150k12k0557
15917A0469r32q596j0774q350L019M801j765J5849J5845k432n380l845j7580O97
15903h974M4365J1502n238j1947k0430l856N937j8536k8919J7300K4603J9771
15891B5578l1906m3125O464K1313O619N947n916J3577K928J0J4058j393p474J415
15877H095J450K8382N5816K773k5688l2826q98n833J4982J6347k8594p482P306
15864C3830M331M680J769Q815j0860k2821j6693J1480j0612j8580j2198J797j0179
15851c5241j4387q238L8161O008k3423K7524J1868K0946J845l7068M18J9644J2298
15838B0355k6697k0425K2011K6216j4115j7831j1600J464j2931K5739J9635p021
$$ y = [16363, -23518, -29631, -26851, -28709, -31555, -36349, -24879, 15251, 36815, 32388, 31238, 31026, 10469, 9537, 941, -9833, -18183, -15164, -10363, -12128, 3721, 19566, 17134, 11754, 7909, -9671, -8974, 35391, 46893, 41655, 29708, 9278, 5422, 11359, -7177, -36096, -18796, 5807, 25578, -6328, -49453, -42989, -21676, -15057, -9110, -15026, -1449, 1479, 1489, 15547, 14154, 6680, 8095, 9545, 37927, 93743, 96516, 70828, 38002, 37104, 31271, 46253, 62600, 34006, 26524, 33830, 38161, 42841, 44610, 53425, 42565, 19744, 3051, 14531, 3919, -14661, -26859, -25062, -35241, -49628, -57866, -19705, -13697, -37120, -9596, 2272, 23218, 25063, -12005, -11587, 8057, 20355, -6342, -26767, -4756, 21460, 7345, -10486, -22086, -20622, -33553, -7814, 11821, 4800]
15826D800k1862Q726p259p459k1038j2605K2350J7137Q737l8294m246M7528L3598
15813C0113r866j4973m441K896R839J3693m30j5194L3643o217k3000L98J8044
15800C4505L482o315J388r31r960k1140R811K7060k4135l2332o481K800K1213
15787a035J5878L0847J8099K5422j6729m2648m0321j1549K0179J1061N113k0385
15775f068J5479p731k3156j851n829R000k1375R23K4902P252N797N099J3335l9444
15761b3667k011K6198J7444N089j2975k9870N977K3721Q067r350k5920k1709J3381
15748b5625j9657R120L414K5592j8095k374L867j9002m846K0724J9906J519J2395
15735F938L227O385L683j5335q299n818r113J3406O016j2085R185k2034j0933
$$ y = [4800, -17062, -8336, -15595, -23054, -44092, -56697, -34347, -17210, -8473, -46767, -51013, -3485, 30113, 20247, 5274, 833, 3729, 13568, 27261, 26831, 11637, 45280, 39063, 16063, 16461, 34505, 37987, 31672, 33060, 32129, 22169, 1029, 10840, 37900, 13765, -18567, -25048, -22248, -1035, 14843, 45690, 63789, 89211, 72482, 29834, -10487, -22036, -1857, 9204, 14317, -6068, 9411, 1680, -21476, -23327, -29156, -20156, -41531, -40608, -15706, -8454, -2657, 2442, 15777, -23667, -25678, 520, 17964, 23053, 10078, -19792, -13815, 9906, 17973, 8623, -17297, -39006, -25625, -45282, -36162, -32748, -7156, -25251, -27625, -23758, -42760, -47606, -26882, -6976, -5457, 6938, 10165, 16550, 20233, 4898, -3401, -9219, -18332, -4926, 1090, -10995, -1810, -23844, -34777]
15722c4777N551J3182j3224j7841n107k73J3637K101J5718K6092R892K894j395
15709A6450j881j7294k1499l1809L757K4464L0511J5400J7511m87J421J197L281
15696D1022k6100j1015l5252k145k068j3297Q087J5550K7933J2502k2454j1752
15684a8989o744O26j8804K7534m129r362o455L2017j1140j3179r571q188K7416
15671a8968J578K279J473K782K194j557P724k252K7115N323K355j1991j026o980
15657A0049m449K9379J8425j9166l1333q632K8600O129k0446k4460P299j7319
15645b5924k0368J2115J1100L2868O999p461j273J5171k5899j398P185r169P942
15632A888J2523k6750j6771k176J1326J1251J6423j4527j9618j1680K5131L2537
$$ y = [-34777, -29226, -16044, -29268, -47109, -52216, -52489, -38852, -36751, -21033, 5059, 14951, 17845, 16450, 14569, -2725, -24224, -56033, -52276, -27812, 2699, 18099, 35610, 35123, 36544, 37741, 41022, 14922, 3907, -31345, -33490, -35558, -48855, -40768, -25218, 2715, 15217, -7237, -18989, -25733, -25107, -43911, -16377, -20506, -29868, -36323, -4306, -15446, -28625, -38196, -46384, -18968, -17390, -15111, -13638, -10856, -8662, -10219, -2495, -4747, 22368, 27691, 30046, 18055, 17029, 10049, 5600, 34979, 53404, 34238, 2905, -5727, 22873, 29002, 8556, -15904, -8605, -25924, -46292, -34177, -23077, 9791, 16790, 9329, 8056, 23227, -2672, -4070, 3115, -6054, 1888, 14411, -12339, -29110, -31286, -19960, -8709, 7714, -6813, -26431, -38111, -12980, 19557]
15620A9557j7760k0695n826J2084K7294j0138k6192j5687K0363L1244j8292m1966
15608d6014k2302O917M8186K2886P261j741k402j239M245N59j0046j2843n3718
15595f0251l972L1059J8711J4778J7460K1286j6317l2804p230K1531J7092k6935
15583e592j1134K3146J2503j5016k6134J096l772J3552L977J4924p163J660L1929
15570C3976l275l4373r114k124r1j0898J1256J2101L710J3698J8849r494j4572
15557I649r643P306p575J3957J8135K2715j6068j1260l0160p104K589q273j1213
15544b6945j2923N592K0395K5995l118L402l006j4759k7285J093q483J8703J7357
15531c982R177j0937l059K4161m678j1856O846O985n614q072k37J7731O17j9143
$$ y = [19557, 1797, -18898, -24724, -12640, 14654, 4516, -21676, -37363, -17000, 14244, -4048, -46014, -68316, -61399, -13213, 9673, 16934, 15193, 12791, 11552, 15797, 16356, 6310, -6533, -60251, -64223, -33164, -14453, 325, 17785, 39071, 22754, -10050, -17280, 4251, 21343, -5592, -16726, 6420, 18923, 3907, -22227, -21131, -24903, -11351, -7374, 7550, 387, 2047, 33976, 30701, -3672, -12786, -14910, -15001, -25899, -14643, -2542, 1168, 14866, 33715, 24221, 9649, 6, 7312, -263, 13694, 31829, 54544, 38476, 27216, -2944, -10048, -7459, -15732, -26945, -39868, -34276, -13881, 12114, 8996, 12398, 9392, -5367, -32652, -31559, -40042, -21339, -3982, 5195, -5742, -8801, 15360, 10682, -1174, 5672, 12657, 7043, -1029, -1266, 16465, 17082, -2061]
15517b061n381K2508l398j7527j289J3125j6889k4027m75Q893j4299Q571M610
15504b7639j7260j8197J8534J5322N737o932K7617K8709q760l0171k5470Q236
15492c0274L662j3849J2826P865k3021j4516J2791K9703J5583o367n280l778j8327
15479c2982J303O853j0211j231L409L5537L105k2238Q985j5940N332k142k3310
15466d3530p129K8387K0303J6542O883J3565j9607n110r727l4821k5358N8173
15454a429M7026j3319m727o745j7921k5083k2009L009K3890n672J1996P135r628
15441a3477k992Q913O342J1648j694m5799L548L7410k2524o446m243M943J1573
15428a2798N428J621o677K44j3353j5572l774k495N599R349K3504J9565k1411
$$ y = [-2061, -7442, 15066, 11668, -5859, -7148, 5977, -10912, -34939, -35414, -26521, -40820, -32249, -27639, -44899, -63096, -44562, -29240, -23503, -30435, -2818, 25891, 17131, -13040, -38510, -30274, -26612, -40461, -27635, -19770, -42791, -57307, -44516, -14813, 770, -5597, -10877, -14655, -32982, -31679, -24826, -35037, -36268, -32859, 2678, 5783, -16455, -7470, -23410, -18078, -20220, -43530, -50659, -22272, -1969, 14573, 21456, 35021, 15414, 10304, 577, -34244, -59602, -1429, 45597, 32278, 27551, 20806, 2885, -22198, -44207, -41198, -17308, -22980, -10984, -3849, -13477, -16469, -7556, -1214, 10434, 8740, -37059, -33511, 3899, -18625, -25071, -29314, -24371, -12798, -7370, -5749, -12426, -12182, -25535, -41107, -44881, -47376, -41777, -32428, -8924, 10641, -10770]
15415a0770J0648M876k6661l377K0569N4267p219j896R881m4572k0186l733J6489
15402a684J191j3561K2485M413j5774j6414L0362J0561j0587J678j4530J6021
15390A4161J7839J2906j2857j9417r121R00j13j854K4203l60l6877k3653Q964
15377b5279K7068J7885P174m0631m9488P31L8832J7333M0023K8243R444l0513
15365D0822k7128m223j3657k5904q626J7446K2325J4750K73l6943n123L7332K808
15352A4152k2165q214j1488j0589N821K0165R632R600j5765n001L1667J846q154
15339A1507n91k170j3863o340k0379j7696N954J5476J9009J4377k3541p972J6867
15326i362J0401m884J0263J5635k3453o572k601j3825M307J3379L171j3662N737
$$ y = [-10770, -122, 4754, -21907, -25284, -4715, 49552, 42333, 40437, 50318, 5746, -14440, -18173, -1684, -493, -14054, 8431, 12844, -2930, -19344, 11018, 21579, 10992, 12670, -1860, 14161, 32000, 44906, 32049, 12632, 3511, 4411, 4298, 2444, 26647, 26287, -10590, -34243, -25279, 1789, 19674, 26848, -13783, -63271, -62540, -23708, -6375, 33648, 61891, 71335, 40822, 13694, 9471, -4186, -30090, -38716, -21270, 1055, 15805, 16078, -20865, -25988, 11344, 14152, -8013, -16227, -27715, -38304, -32483, -12318, -2686, 6914, -8851, -13852, 17815, 19661, 11507, 10916, 8746, -5117, -11457, -31836, -49532, -43578, -28102, -9093, 5284, -18257, -26229, -9362, 1039, -3845, 6418, 22053, -1400, -7972, -10573, -24398, -20091, -6712, -3541, -17203, -11466]
15313a1466P222j629j4048k737J9410K1270p114l1904J2365M198j2719k9124o478
15300e2754p153M130j7681r032J2952K6495K7746J8917j371k274j1319k0878k575
15287c4797J0454J0215R524j4990j823O893k1971P868J6075J6926J4876K0573
15275C9823j825l4684j2828J8415K004O567l486R373J4419j5028k3821l2824M03
15262c3492K0160M243j0558j3421J6807R639K9567J5884j6583j5773J0162J528
15250A8163k8628k697J9005N981m727k0569K0406J9212o370k53p624r357o719
15237d177R308K5781M43l1040k4751O347L048P824r833k2042J2606K0761K556
15224c169J5928J2077q447r093L090Q741J3620K700K907o999k4634L118j6579
$$ y = [-11466, -4244, -5873, -19921, -22658, -3248, 18022, 10908, -20996, -8631, -4433, -17152, -46276, -52754, -59907, -55777, -73458, -82490, -69538, -43043, -15297, 3620, 2249, -25, -11344, -32222, -34797, -24343, -14128, -4604, -19594, -21417, -14524, -36495, -28627, -12552, 4374, 19250, 39823, 37998, 3314, -9514, 8901, 10905, 17472, 13986, 23359, 37778, 22750, -1071, -33895, -33492, -13332, -9089, -19647, -33068, -16261, -6622, 22945, 38829, 22246, 6473, 16635, 18163, -10465, -13162, 5843, 11824, 7097, -13472, 6934, 26146, 19776, 19523, 11899, 2542, -4177, 5131, 30912, 31355, 315, -24436, -18089, -15041, -7217, -17050, -39092, -26486, -5725, -3169, 12759, 24836, 16389, 7296, 10386, 19127, 32747, 35447, 38354, 31355, 6721, 9839, -6740]
15211f740J1247Q985K4764j7713R910N495j5140p07k913J7160J5915O488j0534
15198D6217K8138K8336L4380M2415O5575O3435P8379J30538J58539K19190K60352
15187A155494K78890J73234L2428q4675j70628k11088k23641k00240j76029j55967
15177D17778p1059o1553m0516j9034l2059l8643j8336P459P888P789n820k5513
15165A28381m9752O310j4653j029j8072j1537R22N106p653j5551R575Q844K6051
15152F6942J0982k681j3952j0195j9964k1408Q800j6718k4689j2887q01j3031
15140d9602O59J411R252K5071l319J8011R792j2307j9409K396L2967N845L276
15127B4043K720J0484K3928j1589j6218k9922O841M998L940n829N390K304K1504
$$ y = [-6740, 4507, 13492, 38256, 20543, 30453, 35948, 20808, 20101, 17188, 34348, 50263, 56751, 46217, 74355, 102691, 137071, 179486, 245061, 308496, 386875, 517413, 675952, 895142, 1155494, 1434384, 1607618, 1640046, 1555371, 1384743, 1173655, 950014, 749774, 573745, 417778, 346719, 285166, 244650, 225616, 193557, 154914, 136578, 144037, 151925, 159714, 153894, 128381, 78629, 84939, 70286, 69257, 51185, 39648, 40570, 45676, 38023, 22472, 32047, 40891, 66942, 77924, 75243, 61291, 51096, 31132, 9724, 18524, 1806, -22883, -35770, -36571, -49602, -48943, -47532, -38280, -13209, -16528, 1483, 11275, -1032, -20441, -18045, 14922, 20767, 24043, 26763, 37247, 61175, 49586, 33368, 3446, 10287, 15285, 19225, 13396, 18786, 21090, 42594]
15114D2594q188j7129j2632j8833n167K5667K1111L322j829q0n461k822J6591
15101C7144J7243K89j0255k8115j8402l1901p163N5732J6417Q344J3407m518k045
15088D6177n540r416j625K4115l331J2871q27L07J6088j7408k2777j5027j9853
15075C754j714J7634k0326k0341j648J8243o723r713J225J6722Q847l854J1350
15062A3456J556K51j48L143k262J518K6663o37RQ770J3349k7762l7303j5597J2171
15047b823l32J0494k1853q105K7872P210R153j4987k4956L973L067o128r428J4757
15033a2086K7690L2467k1530k3652m578J996L194k7082P884O204J801M3388Q916
15020D4612J7424M41o643k0533k0260m091J6396L7800J4628r044K9881n4629j5813
$$ y = [42594, 34406, 17277, 4645, -14188, -19355, 6312, 27423, 30745, 28916, 28836, 23375, 20553, 37144, 54387, 54676, 44421, 16306, -2096, -33997, -41160, 14572, 30989, 39333, 52740, 48222, 46177, 40637, 31221, 29596, 53711, 50380, 63251, 62424, 62731, 78819, 61411, 38634, 23607, 3754, 2040, 19674, -652, -20993, -22641, -4398, -11121, -20834, -19609, -2887, 5960, 2106, 13456, 15012, 15263, 15115, 18258, 15996, 17514, 44177, 43540, 43549, 52319, 65668, 37906, 603, -14994, -2823, -3155, 7339, -14514, -22619, 5253, 12463, 21616, 6629, -18327, -14354, -11287, -17415, -26843, -12086, 15604, 48071, 26541, 2889, -1689, 307, 3501, -23581, -15697, -9493, -7692, 35696, 44612, 62036, 62477, 55834, 35301, 15041, 10950, 27346, 65146, 79774, 70730, 100611, 45982, 30169]
15007C0169j270J1129K5303k2051j5824k1231r606K6355J9350M737r951k0210
14995A6900l379l250J5746j9870L3730k385k5583J4997K2816J5924J2409O292
14983H4347J9597L2802K8521J176K0651k420k3435k3657J1027j0472j2620k8050
14971I7467k4589L106j6604l146J1410j4023j3373k6973j5853Q283L223o467O520
14958H981p8M9870R682j3507n838j0380k5946k3780r820K3660J7283Q605K2526
14945E1258K4865j667M958L063j6382J1039K9021k6028j2587k7189k4231L1165
14933D7285k3324k1068J3785L7518j8497m0471k0328k5140j2870j6711n953p00
14921h6474n531j6416k2672k7543j547J1310j3238K3753j983K2461N7850O3137
$$ y = [30169, 28899, 40028, 65331, 43280, 27456, 6225, -3381, 22974, 42324, 47061, 37110, 16900, 13521, 10271, 26017, 6147, 39877, 37492, 11909, 26906, 49722, 65646, 78055, 84347, 103944, 136746, 165267, 166443, 187094, 184674, 161239, 137582, 148609, 138137, 125517, 97467, 72878, 75984, 59380, 56234, 67644, 53621, 40248, 13275, -2578, 5705, 8928, 2461, 8981, 8903, 58773, 68455, 54948, 49110, 38730, 12784, -10996, -20816, 2844, 20127, 28732, 51258, 76123, 74456, 79414, 82477, 66095, 77134, 106155, 80127, 67540, 40351, 16120, 47285, 23961, 2893, 16678, 54196, 35699, -4772, -25100, -50240, -63110, -79821, -85774, -86474, -92005, -108421, -131093, -158636, -160183, -148873, -162111, -138358, -140341, -117880, -60030, 3107]
14909C107L4249M6976K6097J1121J5388K2306J6450K100j4770j30J2663l3081
14897A42476m7144n973k8591l6339k1281P839J1898O962m412n853L6188Q184l0450
14884C3504k4417q970M4726L0886L1160K1424p256k4930J2856K728j9631k4204
14872F7876j2185j7577K618L16J1641J6284J1798J3025K0178K4842r247k3460
14860A06109k864J3234j2981n2438p2860j07546j12195o2534j5536L0548L2146
14849b56917M9533P0856N9738N9210Q8947R2133N4448j0922j4372j2982k485N888
14837A83075k6067j3969K2533R435m547n049L2303J5401m672K416K2491k7656
14825B05694j2866J4725J4640k4766R175K3139K9929J5265J7020K1306K6138J9280
$$ y = [3107, 37356, 84332, 110429, 121550, 136938, 159244, 175694, 177794, 163024, 162894, 175557, 142476, 95332, 89359, 60768, 24429, 3148, 10987, 22885, 29847, 25435, 19582, 55770, 63954, 33504, 9087, 117, 44843, 75729, 106889, 128313, 121057, 96127, 108983, 111711, 92080, 67876, 55691, 38114, 40732, 41048, 52689, 68973, 80771, 93796, 113974, 138816, 129569, 106109, 103245, 116479, 103498, 51060, -21800, -129346, -241541, -304075, -319611, -289063, -256917, -207384, -136528, -76790, -17580, 71367, 163500, 217948, 207026, 192654, 179672, 177187, 183075, 157008, 143039, 165572, 175007, 170460, 165411, 197714, 213115, 208443, 210859, 233350, 205694, 192828, 207553, 222193, 197427, 206602, 229741, 259670, 274935, 291955, 313261, 339399, 358679]
14813C58679P585N3134R3522Q4984N3900N5476J24444J87800L37539M83753N80264
14802B421080O04749M33351J30970j91360m33766n82871n73512m74246k95541
14793A038854j62805j02086o2033k7662k0594K2860L7815P400N012j2054M659
14782G29366J1099L1496L3356L4538L3323L7042k335j8219J9061O415L1878J3583
14770I60603J2834K1355j7741J239L0636M1010N4401O1464P5728R8379R3166R5189
14758A528263J01002J00531P0532N4384Q6970J28354K21407K06933K08621K53786
14748B960783L15472L72227M11084M47115M96646N79701P45774R83993J266413
14739H579208J569089J841933K109106K407320K706439L022179L466765M321921
$$ y = [358679, 366264, 419398, 512920, 597904, 651804, 707280, 831724, 1019524, 1357063, 1840816, 2421080, 3025829, 3459180, 3590150, 3398790, 2965024, 2382153, 1808641, 1334395, 1038854, 876049, 773963, 711930, 684268, 663674, 686534, 724349, 731749, 736761, 724707, 729366, 740465, 771961, 805317, 839855, 873178, 910220, 907885, 889666, 908727, 915142, 947020, 960603, 973437, 994792, 977051, 978290, 1008926, 1049936, 1104337, 1165801, 1241529, 1339908, 1433074, 1528263, 1629265, 1729796, 1800328, 1854712, 1941682, 2070036, 2291443, 2498376, 2706997, 2960783, 3276255, 3648482, 4059566, 4506681, 5003327, 5583028, 6328802, 7312795, 8579208, 10148297, 11990230, 14099336, 16506656, 19213095, 22235274, 25702039, 30023960]
14731C0023960N798430Q509476J3141216K0642125L1590554M4498533N3966652
14724B08170946N2687629L8149641J4171494j1552849l1303198m2748903m5577725
14717A81997035m1173808l3943603k6255220j8799365j2746829q541264n955295
14710C4581651m430463l532276l033247k685134k412658k192688j954872j702208
14702A2638105j447912j233810j054559q77376p20525o06099n02442m34263l53557
14693E407562l43685l18802k42507k54519k90504k48345k22253k16230j94426
14684C076291j80825j98622j62207j38462j16796j46359j21088j16531j02788
14675A792613q3479q8981q9816o0515n1778o2708p9786o5994o3554m5884m7054
$$ y = [30023960, 35822390, 44331866, 57473082, 78115207, 109705761, 154204294, 208170946, 260858575, 299008216, 313179710, 301626861, 270323663, 227574760, 181997035, 140823227, 106879624, 80624404, 61825039, 49078210, 40536946, 34581651, 30151188, 26618912, 23585665, 20900531, 18487873, 16295185, 14340313, 12638105, 11190193, 9956383, 8901824, 8024448, 7303923, 6697824, 6195382, 5761119, 5407562, 5063877, 4745075, 4502568, 4248049, 3957545, 3709200, 3486947, 3270717, 3076291, 2895466, 2696844, 2534637, 2396175, 2279379, 2133020, 2011932, 1895401, 1792613, 1709134, 1620153, 1530337, 1469822, 1418044, 1355336, 1275550, 1209556, 1146002, 1100118, 1053064]
14664A053064o3661n4961n3631k6971k5397p684l2405n3657l8308O411K4454k2295
14652G04959j542Q626k8096K166J3910K3285K2662J1063K1030m257l1408k3985
14640G18413l6809o6496o7429q2626o6262j7600k779k0940l4976R951K5686N749
14628C63882J2313o079K496N787J2361k4876j9031j820K989k9033l6111J741k7281
14615B57338q435K299n699k6588O712J6617J3825j1468o52K0077J1745j0035k9502
14602B36234k4355r66m6875J0275N4953J09477R0961P0251M7906J5737k5744l0792
14590E07062l9460m1641m5811p1134m0411k0514K5m8026m7950J1572L8777j2450
14578A90039K008J3568J3083k2087m3769j9720k9605q838J6781J7981K6263j5881
$$ y = [1053064, 989403, 934442, 880811, 853840, 828443, 820759, 788354, 734697, 696389, 702800, 727254, 704959, 703417, 712043, 683947, 686113, 700023, 723308, 745970, 757033, 778063, 773806, 742398, 718413, 681604, 615108, 547679, 465053, 398791, 381191, 378412, 357472, 322496, 332447, 358133, 363882, 376195, 370116, 372612, 378399, 390760, 365884, 346853, 345033, 348022, 318989, 282878, 284619, 257338, 248903, 251202, 245503, 218915, 225627, 242244, 256069, 244601, 243949, 264026, 275771, 265736, 236234, 211879, 210913, 164038, 174313, 229266, 338743, 429704, 499955, 547861, 563598, 537854, 507062, 467602, 425961, 380150, 309016, 268605, 248091, 248116, 200090, 152140, 163712, 202489, 190039, 192047, 205615, 218698, 196611, 152842, 133122, 103517, 94679, 111460, 129441, 155704, 139823]
14566A39823R092j1618r597j065j213j7500J8978M6931M115q278J177r2j2157
14553A58596j0836k0134l2347p475l9648o561j5041r326p681N822l3823j4172
14541c2626O739j2403R149J5718J9695L5545M7778L2403N3855K3813R621L9679
14529B48966L6986K0662Q460k7780l1667k0926P190j5383o221l1952l586j3564
14517A71185k5185j876j1534q942l657k1647k0667j6001l226O128N758J510O884
14504G8730o056k2750q418L3035L2312k7182k86K5061l272o805k8736j5603m083
14491D5947K810J5165r547K1983J9786k889j254k6074k1307K273m461n2L1894
14478G4274r034o717J6781Q157j0674J152L141K4475R635j7026n15J7487n3j6473
$$ y = [139823, 148915, 137297, 127700, 126635, 125422, 107922, 126900, 173831, 177946, 169668, 170845, 170753, 158596, 147760, 127626, 95279, 87804, 48156, 41595, 26554, 17228, 9547, 15369, -18454, -32626, -25887, -38290, -29141, -13423, 6272, 41817, 89595, 121998, 175853, 199666, 209287, 248966, 285952, 306614, 315074, 287294, 255627, 234701, 241891, 226508, 220287, 188335, 184749, 171185, 146000, 144124, 132590, 123648, 119991, 98344, 77677, 61676, 58450, 64578, 70336, 71846, 78730, 72674, 49924, 41506, 74541, 106853, 79671, 79385, 104446, 101174, 94369, 65633, 50030, 45947, 48757, 63922, 54375, 76358, 96144, 93255, 92001, 65927, 44620, 46893, 42432, 42380, 74274, 65240, 58523, 75304, 83461, 72787, 73939, 77080, 101555, 111190, 94164, 93649, 111136, 111083, 94610]
14464I4610k1832J1847J2294J1666l4310r095J6206k8046J6491l10p759J034k658
14451F0138L2172K2387l3679l8755r613j9364L714O127K833j7296K280K0087J1889
14438D2920o047k2060K3218L3512j2073k9796k8868j1940O230J535K3703M9938
14426G0272J516j9225k8282l257j1234J0944K4745o313p591k244k6369k2639K9418
14413I741R039K6511L440l2466k151L5406q572L571K2944m55N59n897M582J1852
14399G8104j0032l8825j4930j8451j6072J6888K3942l452M37J7826o88l1378j6874
14386a3505J349N0008o34p392j7058m452P757J3829K6632N55m4067l3873J5983
14373d868J5891K9799q504M270j9684M096k0337J038J6323k2747j3589N624J484
$$ y = [94610, 72778, 84625, 96919, 108585, 74275, 65180, 81386, 53340, 69831, 69521, 61762, 62796, 60138, 92310, 114697, 81018, 42263, 32650, 13286, 17000, 23127, 25960, 8664, 10944, 31031, 42920, 36873, 14813, 38031, 71543, 59470, 29674, 806, -11134, -4904, -3369, 20334, 70272, 71788, 52563, 24281, 21024, 9790, 20734, 45479, 39166, 31575, 29331, 2962, -19677, 9741, 18780, 45291, 48731, 16265, 14114, 49520, 40948, 44519, 67463, 67008, 67567, 61670, 66252, 78104, 68072, 29247, 14317, -4134, -20206, -3318, 20624, 17172, 17609, 35435, 34747, 3369, -13505, -12156, 37852, 37218, 29826, 12768, 8316, 16073, 29902, 56534, 57089, 13022, -20851, -4868, 11023, 40822, 32318, 36588, 16904, 21000, 663, 1701, 18024, -4723, -18312, -12688, -11204]
14360a1204J3434J0580O309K5320j7693N147K0061o802j0577J1903J0896J9238
14348G6612n134j3553o113q943r786j9092M626k2356j4744M038K1677R98J7050
14335B5280M94j5910M270K85r471L0260L2454J3127J5492j2404m1632p227J8055
14322E3073p117q223k1746j6084J5827K1619N758O220l6636Q506j3316J1299K2228
14309D1408j1958P74J0375k7204l7222j7138M4523K1992J4076J4006J3985K1925
14297H9542m40j3235k7556j5608l5204n523M939j1869P834J1260J1756j8004p013
14284i121P808J6788J5402j9319N332L581N920j9987j4439L271J1479J0882K5985
14271D3582K3079J1507J0340K0178J0006L3578K1495j6002j8194J3662K6986L5128
$$ y = [-11204, 2230, 12810, 19119, 44439, 26746, 31893, 51954, 45152, 34575, 46478, 57374, 76612, 71478, 57925, 51812, 42869, 33083, 13991, 18617, -3739, -18483, -14445, 7232, 8230, 25280, 25774, 9864, 14134, 14419, 4948, 35208, 67662, 80789, 96281, 83877, 42245, 35018, 53073, 45956, 37733, 15987, -97, 15730, 37349, 43107, 49327, 12691, 21197, 7881, 19180, 41408, 29450, 30224, 40599, 13395, -23827, -40965, 3558, 25550, 39626, 53632, 67617, 89542, 89102, 75867, 48311, 32703, -2501, -8024, -3085, -14954, -7120, 4140, 15896, -2108, -9121, -1313, 15475, 30877, 11558, 16890, 20471, 26391, 6404, -8035, -4764, 6715, 17597, 43582, 66661, 78168, 88508, 108686, 118692, 152270, 173765, 157763, 139569, 153231, 180217, 215345]
14259B15345N1855P9287J33320J52559K50498K97797K10237J06485M1069q7681
14249A450771j29381j80981j94127j83495j60611j07331p4485j13546p8405l7092
14239A91317N710j9754j5876n240j2326k9648j4431k4953q32J4181p863j4470
14227F5815L1440J0014o362n0325m9226j655L898K7697J9794k032k2198j1315
14215A5545q384r958J4543L726k2438l299Q211N858M083K2905J9052m7136m4250
14202d1542N832K4635M6908J4210o971m5731j4778Q288K8012m01K5929N284k370
14189D7305j3440k9077r045n53J9516Q014L896N287J8747k3564k1520L385J1114
14176B0065J198m269j4979K7734l42k5341j6428j044J8901J0340r959k936J48
$$ y = [215345, 267200, 346487, 479807, 632366, 882864, 1180661, 1390898, 1497383, 1538452, 1450771, 1321390, 1140409, 946282, 762787, 602176, 494845, 420360, 306814, 228409, 191317, 197027, 177273, 161397, 156157, 143831, 114183, 99752, 74799, 73967, 88148, 80285, 65815, 97255, 107269, 100907, 50582, 1356, -299, 3599, 31296, 51090, 49058, 26860, 15545, 7161, -2797, 11746, 15472, -6966, -10265, -2054, 3804, 7887, 30792, 49844, 2708, -41542, -35710, -11075, 35833, 50043, 43072, -2659, -17437, -9149, 18863, 18462, 44391, 49675, 47305, 33865, 4788, -4257, -4810, 14706, 22720, 26616, 31903, 50650, 27086, 5566, 8951, 20065, 21263, 16994, 2015, 29749, 29407, 4066, -12362, -13406, 5495, 15835, 5876, 2940, 3088]
14163C088K2497Q98k6549k7643m538J2633K4211L64j4054N994k1737n130J984
14150b7982o638l998K9385J9376J1015l250j3508O486N895J1733j3208l0993j539
14137a7226m739j1363J1975K9786J0280l3016Q848L4350m904J4448L525m6135
14125d171j0560K1789J8746m282k581r23k8811l4307J894J2651N727J185j1063
14112c4706j764K6789K6299J7960Q402j2517J4671J1981j6416m3113k5565J0184
14100a7795j694J22n600k3244j8771O145R283K9102J2023m239Q900J6471k0635
14087i932k6427l504n954K2614J7674k0880J2367J3133K5194J3362J8041J1862
14075F7550k1486m0171R012K5032j4590q861J3845j4767k2470r882j393q676L4469
$$ y = [3088, 25585, 26483, -66, -27709, -32247, -19614, 4597, 4961, -9093, -3099, -24836, -29966, -27982, -34620, -38618, -9233, 10143, 21158, 17908, 4400, 10886, 16781, 28514, 15306, -15687, -17226, -21965, -33328, -21353, 8433, 18713, -14303, -5455, 28895, 23991, 38439, 41964, -4171, -14731, 7058, 25804, 21522, 18941, 18018, -10793, -45100, -43206, -30555, -24828, -23643, -34706, -36470, -9681, 16618, 34578, 42980, 30463, 45134, 57115, 40699, -2414, -27979, -17795, -19489, -19367, -24967, -48211, -66982, -60837, -51554, -22452, -10429, -14668, -5768, 10703, -9932, -36359, -39863, -45817, -23203, -5529, -26409, -14042, -909, 24285, 37647, 55688, 67550, 46064, 5893, 14905, 39937, 25347, 16486, 30331, 15564, -6906, -16788, -18181, -26857, 7612]
14062G612K5098k3183r797M927K1238J143m518K1286Q238k2533O965n0656n5625
14049f9805J3211K7150N289K2387M0407K7845j4548M674J307k3243q502m381k1665
14036A26J1689K0710R123J7766J3102j3499p612J0426J5724q217J398l2635k8446
14023I655k4844p670K1509M1160j1268j0144R46k790o921j3178j305J0808m326
14010A632r69O612L8079J715n054j1320q308j3784L064K0028O918j731j0960j1843
13996A4079J1784k1488n487K8709K341o129O76L952j6244r260J414r393k448K0725
13982A3231M1259j4681l2094j5661j7583M442k16K7407l247k4480j4748M8702
13970A2331L0980m444j7285j6321l2757k1218L1422O120J9224M082N462O644j4039
$$ y = [7612, 32710, 9527, -270, 4657, 25895, 27038, 22520, 43806, 52044, 29511, 36476, -14180, -69805, -56594, -29444, -24155, -1768, 38639, 66484, 51936, 56610, 57917, 34674, 26172, 21791, 126, 11815, 32525, 41648, 59414, 72516, 59017, 51405, 61831, 77555, 69338, 70736, 38101, 9655, -15189, -22859, -1350, 39810, 28542, 18398, 19344, 16554, 9633, -3545, -4850, 5958, 1632, 663, 7275, 45354, 47069, 42015, 30695, 22387, 8603, 11667, 31695, 38613, 36882, 25922, 14079, 25863, 4375, -1112, 27597, 29938, 23809, 24485, 28437, 12193, 2933, 4347, -5046, -7494, 13231, 54490, 39809, 7715, -7946, -25529, -21087, -21303, 6104, 2857, -21623, -36371, 12331, 43311, 38867, 21582, 5261, -27496, -48714, -17292, -11172, 8052, 12134, 17596, 24240, 10201]
13957A0201o366m690Q620Q615K0219K654J3277N550J3854j7300o323l0785k3758
13944f232J0327j4823k3523J035K5525O662M248l734M016J1939Q753J190k6939
13931a556j9349Q097O558K217O792j2883L000J3585K7503p242J893J1440R032
13918D9087j2502k4757J0537k5050j8369L908K1974O372j1971L44L1614L5118
13906F6305j0910R513k6144j5544O25L3334K2952R832r191j535J7601Q040L2175
13893A37053K8387L5521Q1411J22593K36374L85412M49151M71892L68152P7985
13883B393931j89363l74997m30925m02479l15264k11649j40446o0261l5639l7220
13873A95688m6643l4391k3115p562n531N622K8940o720j2632k680p398k8946k1062
$$ y = [10201, 3835, -855, 7765, 16380, 36599, 39253, 52530, 58080, 71934, 54634, 48311, 17526, -6232, 4095, -10728, -34251, -33216, -7691, -1029, 3219, -515, 3501, 15440, 24193, 25383, -1556, -20905, -12808, -6250, -4033, 2759, -10124, -7124, 6461, 33964, 26722, 28615, 40055, 49087, 36585, 11828, 22365, -2685, -21054, -17146, 4828, 11200, -771, -427, 31187, 66305, 55395, 64908, 38764, 23220, 23845, 57179, 80131, 89963, 80772, 79237, 96838, 104878, 137053, 165440, 200961, 282372, 404965, 641339, 1026751, 1475902, 1947794, 2315946, 2393931, 2204568, 1829571, 1398646, 996167, 680903, 469254, 328808, 268547, 232908, 195688, 149045, 114654, 91539, 83977, 78446, 84068, 113008, 106288, 93656, 90976, 83578, 54632, 33570]
13860C3570J1185K1016q277r563j9563P011j5916Q210j0703j814o95R727j6891
13847G297k7290J1354J0418J2644M1335J4948K0140M8026L0786N0624K1626o183
13835B35725j1339r677o156n0565l4571l7855l2583q266k4349R247J4155M919
13823D8685J4968O392j3025J066J1081Q267K0317K5106k4626j5995P540K5790
13811A15566M02j7k6428l2973l885k4673k0894N213L2217J7818N933j921r641
13798E6717o966L670M167k2407k771l5597j065K0881P392o06j960n901j901K8750
13784D2403j3999l2975m248J5261K6911j4906k2681K4997j8738p346l195o624
13772a5140K6379J5920J7171j539k0986r628l992k1135j357o534p335L1745L7618
$$ y = [33570, 44755, 65771, 57494, 47931, 28368, 35379, 19463, 27673, 16970, 15156, 14461, 24188, 7297, -19993, -8639, 1779, 14423, 55758, 70706, 90846, 138872, 169658, 220282, 241908, 235725, 224386, 214709, 208553, 157988, 123417, 85562, 52979, 44713, 20364, 29611, 43766, 48685, 63653, 70045, 57020, 58086, 69167, 77434, 97751, 122857, 98231, 82236, 89776, 115566, 115968, 115951, 89523, 56550, 52665, 27992, 7098, 12311, 44528, 62346, 68279, 66358, 56717, 49751, 53421, 57588, 35181, 32410, -3187, -4252, 16629, 24021, 23415, 21455, 15554, 13653, 42403, 28404, -4571, -8819, 6442, 33353, 18447, -4234, 20763, 2025, -5321, -8516, -15140, 11239, 27159, 44330, 42791, 21805, 12177, 8185, -12950, -14307, -20841, -28176, 3569, 41187]
13759D1187L818j6550R94k1426M863L7637J545J1531j0637M776j1084l0368j3400
13746B886j7533K4343J7522l6455N327K4818K632j8622k0691m1158J876K8320
13734b6735J0073J0308J0J7645J8009j3522k5917j259q370J159N773j584K5076
13721A0666m705o689j057o659r869J0242J8415L694k0913k7043l6365R933K4254
13708c6096Q157k702j6218J0424J9178J4913j4231j220l169J4395O625J8762R350
13695B8168k9333J1872l656N650J4082K1028l1769n145m629j1277K7883K4626
13683D7500q156l0552j5891r78K3212J376n9454l382K5788J1760K449J7889J5887
13670B7448j5286k6089o741J4068K470L4866L1795j4241j0553l1635k9146j5421
$$ y = [41187, 45005, 28455, 29449, 8023, 12886, 50523, 52068, 63599, 52962, 57738, 46654, 16286, 2886, -14647, 9696, 27218, -9237, -3910, 20908, 23540, 4918, -15773, -56931, -55055, -26735, -16662, -6354, -6344, 11301, 29310, 15788, -10129, -11388, -19758, -18599, -12826, -14410, 10666, 5961, -728, -1785, -8444, -18313, -8071, 10344, 14038, -6875, -33918, -70283, -60350, -36096, -27939, -30641, -46859, -36435, -17257, -2344, -16575, -17795, -20964, -6569, 56, 18818, 28168, -1165, 10707, 7051, 12701, 26783, 47811, 16042, 10897, 6268, -5009, 22874, 47500, 39344, 8792, -7099, -8077, 15135, 16511, -42943, -46325, -20537, -8777, -6328, 11561, 27448, 12162, -13927, -20668, -6600, -4130, 30736, 62531, 48290, 37737, 6102, -23044, -38465]
13658c8465J0213P040o04J026K8446K8871l2515j0163J3502J7426k1978L909j8250
13645a1542k724K232j6231N13J2521J236j9486r03N982L98J5567J5988J8522q223
13631A3850j0626j5812R047j766J1020K0894l599j6264J7582K2023j7963k6868
13619A518J5459m030j2276J6054P233J9150L2114j6552l7522l2726r163N014J0092
13606e635k6421k6185N112K7933O468q33m959R818J4466o351k6212K308K5864
13593d627j2035j7890Q860J1436K6410o334q728k6704r393K2183M7481J987o137
13580B6509j5505k7161m5997J3391K6591J48j7907J2734N217j9885o514j3609
13568f1988r049J5930J5630L1204K4476r445J2891N976Q229K0758k1399l9031
$$ y = [-38465, -28252, -21212, -21816, -20790, 7656, 36527, 4012, -6151, 7351, 24777, 2799, 6708, -11542, -14266, -12034, -28265, -27752, -15231, -13995, -33481, -34384, -28402, -28004, -12437, 3551, 22073, 13850, 3224, -12588, -3541, -5307, 5713, 26607, 23008, 6744, 24326, 46349, 28386, 1518, 16977, 12947, 671, 16725, 23958, 43108, 75222, 58670, 21148, -11578, -20741, -15727, -5635, -32056, -58241, -53129, -25196, -18728, -19561, -24520, -14702, -236, -6587, -32799, -30491, -4627, -16662, -34552, -25692, -14256, 12154, 5820, -2908, -29612, -39005, -16822, 30659, 32646, 26509, 11004, -16157, -62154, -48763, -22172, -22024, -39931, -27197, -21980, -41865, -48379, -61988, -71037, -55107, -39477, -8273, 16203, 6758, 19649, 25625, 33854, 54612, 33213, -5818]
13556e818j3784J0691J418J1115J4243J521Q748Q377j2483j013j6398O810k6637
13543a3210j8406J2378M6299M3638k8695j8070j3983k0841k2107J1305J7790k338
13531f240j1561n322K5519J8558j9218M023N757l1581r452K5787J6109j3725M509
13518C163J1966k7280j445j9276r221Q115J5708k539j870n994K1699P95k7994
13505c4173l476O751J202L5595q877j3751L30P455K6709j1891m3344O737J0053
13492b0680J0950r665J2417M893q217k3346K3440k037j6151j6004Q155J6559n706
13479b5392m708K5424o508O906Q160j4128J4465j8j1330J541j933o338p929J8560
13465c228J3104j2122J0592l218k7635R104O030n38k168m395l01p462J9606K643
$$ y = [-5818, -19602, -8911, -7493, 3622, 17865, 19386, 28134, 36511, 24028, 23015, 6617, 13427, -13210, -31616, -19238, 27061, 70699, 42004, 23934, 9951, -10890, -32997, -21692, -3902, -6240, -17801, -23123, 2396, 20954, 1736, 5759, 11516, -20065, -29517, -3730, 12379, -1346, 3163, 15129, -12151, -13596, -32872, -42093, -33978, -18270, -20809, -22679, -28673, -6974, -6179, -34173, -37649, -30898, -29696, 5899, -2978, -16729, -16399, -8944, 17765, 5874, -37470, -30733, -20680, -9730, -19395, -6978, -2085, -10302, -33648, -10208, -12245, -28396, -44400, -36245, -19686, -25392, -30100, -4676, -11184, -4278, 3882, -10246, 4219, 4201, -7129, -5588, -7521, -13859, -21788, -3228, 9876, -2246, 8346, 5128, -22507, -13403, -7373, -7911, -10079, -14474, -14775, -22237, -2631, 12]
13451A2l975K428k099l1761m849J4740K6171P66J1712k5327k6851J9244J7202
13438b587K7076K2405J1424m5086P882Q308k4305j6504K4827l640l6538j3811
13426d0549j8618j142L7316K9742J8892L380j4593o882J371k928o669n225O985
13413A080j0686m284J1956L8081q443J362k2321k1482M693J6753J3466j8943l4051
13400c2819l77J4994J2046k222K0194J5289K76j9130j8868J7291o608l0877l567
13387c4378j2099L0256L2863q58K475J854j6890n187J2660N534q660q054K5491
13374B5007p666j3157j0101J7729N973J0415l5520j4360J1918r574p161j0235
13362c6732M939K6889n676L077J9522L4665p915j6838k5836N627M534J9292j9428
$$ y = [12, -3963, -1535, -3634, -35395, -40244, -25504, 667, 1433, 13145, -12182, -39033, -19789, -2587, 24489, 46894, 58318, 13232, 21114, 29422, 5117, -11387, 13440, 9800, -26738, -40549, -59167, -60309, -22993, 6749, 25641, 29021, 14428, 7546, 8917, 5989, -680, -5905, 1080, -9606, -13890, -1934, 36147, 27704, 29066, 6745, -14737, -10044, 6709, 20175, 1232, -32819, -33196, -18202, -6156, -8378, 11816, 27105, 27381, 8251, -10617, 6674, 66, -30811, -34378, -46477, -16221, 16642, 15784, 18259, 20113, 3223, -1964, 10696, 16230, 7570, -484, 25007, 17341, 4184, -5917, 11812, 17785, 28200, -7320, -21680, -9762, -19336, -26497, -36732, -31793, -4904, -10580, -7503, 12019, 46684, 38769, 21931, -3905, 1722, 6256, 25548, 6120]
13349F120l3248l1162J5310k2056Q742L6066r3o579j6270j0057K169J0931O10
13336c9517K8404l893n755J2007k833j9661K0789K3461O708j5461j2755q157K5207
13323H544J8074m923k3313p000p876L4230J5641J2064l1493q887O178Q50J6810
13310B8899P554l7535j4863p992j0264N228K6145K6279j2266l8989J0453J0345
13298g006J954j3423R535K0241j4323l2533k1219J7499K8848K5459l398l8674
13286b7040j6025N4541K3188k8491P582J3828k7748l4900n909Q265j0071q467
13274e1247J4667M175R242J9028J2649K9865j1356q076j4763q3J3067j5134p173
13261e139k5502j3109k2409r451Q386K8228L4004J0499l0626j1434K8869J1736
$$ y = [6120, -27128, -58290, -42980, -65036, -56294, -20228, -20321, -26900, -43170, -53227, -51058, -40127, -39517, -11113, -15006, -20761, -8754, -11587, -31248, -10459, 13002, 19710, 4249, -8506, -16663, 8544, 26618, 21695, -1618, -8618, -16494, 17736, 33377, 45441, 13948, 5061, 11239, 12089, 28899, 36453, -1082, -15945, -23937, -34201, -28973, -2828, 23451, 11185, -27804, -17351, -7006, -5052, -18475, -8940, 11301, -3022, -35555, -56774, -39275, -10427, 15032, 11634, -27040, -43065, 11476, 34664, 6173, 13755, 27583, -165, -35065, -40974, -32709, -42780, -51247, -36580, -32405, -23163, -4135, 8514, 38379, 27023, 18947, 4184, 4101, 17168, 2034, -5139, -30641, -43750, -66159, -75610, -67224, -38996, -4992, 5507, -25119, -36553, -7684, 4052]
13249D052L969O121M461j3220O608l400k1377j5591j1852Q184q816j2246R514
13236d3593m693L4816L016K20J8594J1426L2735j653j1747k0150j9551n264K7123
13223B1279J7335J1681k2891k9763l722l9352O915O0564J35j1135L202K1047j9112
13210A6183m43l084j055J9847P420n176k6816k2141k3167Q736J7069K6447K3951
13197C7771J7108K8360k0601m5979k1904K2810K6953K2906O474j9957k9918M2610
13185F6633J6686j2062j4163l0472k0178J9602J4127l1651k7233J6154M51k8257
13173c0363J3312L0192J2806j9000m068o020q033K3930L2484K768k2405J4205
13161C9808J1438L095K3944K3424L995N704p574J629P387K0224Q415O256j0432
$$ y = [4052, 8021, 14142, 18603, 5383, 11991, 8591, -12786, -28377, -40229, -32045, -40861, -53107, -43593, -48286, -13470, -10454, -10234, 8360, 19786, 52521, 50868, 39121, 18971, -580, -5844, 21279, 38614, 50295, 27404, -2359, -6081, -45433, -38518, 22046, 22181, 11046, 14248, 35295, 16183, 15740, 12656, 11601, 31448, 38868, 33692, 6876, -15265, -38432, -29696, -12627, 13820, 37771, 54879, 83239, 62638, 16659, -5245, 17565, 44518, 67424, 73898, 53941, 24023, 66633, 83319, 71257, 57094, 26622, 6444, 26046, 40173, 8522, -18711, -2557, -2106, -30363, -17051, 13141, 25947, 6947, 2879, -3141, -11174, 12756, 45240, 48008, 25603, 39808, 51246, 54341, 78285, 101709, 105704, 111408, 103834, 105463, 112850, 133074, 141489, 147745, 137313]
13148A37313K427J5535M1651M695n5579j6397k7224k3116l0390j7452j2895M581
13136B3149K8231l797k3481m113J9251J3658j6363m1002j4185K3240J7045O821
13124B8454J9756P997J4551L4770J1011m766m720K5016J6735J0227J3232m187
13112A68076l6250j6973L14j5250r46m598L86J8224k1465Q638P383J5386J496
13099A24421j6531J8656N4437k068L19j803p296k3327J275l548j2956j671jm5258
13085H4649n8606J1563J9741j6486L1970L1612l535j6296l4969p872K8447J3026
13073H3244M468k5219l0239N450J0921J9459j5280n907K1298p831m4090k406J2120
13060B5988J351O985m82J3741R920K1237K702p131p755J6393O77j6249R644M7326
$$ y = [137313, 139740, 155275, 196926, 201621, 146042, 129645, 102421, 79305, 48915, 31463, 18568, 23149, 51380, 47583, 24102, 19989, 39240, 52898, 36535, -4467, -18652, 4588, 21633, 28454, 48210, 56207, 70758, 105528, 116539, 111773, 107053, 132069, 148804, 159031, 172263, 168076, 131826, 114853, 115167, 99917, 98971, 94373, 94759, 112983, 91518, 100156, 107539, 122925, 124421, 107890, 126546, 180983, 178915, 179234, 177431, 170135, 146808, 148083, 144535, 131579, 129908, 129907, 84649, 26043, 37606, 57347, 40861, 72831, 104443, 100908, 84612, 49643, 41771, 70218, 83244, 87712, 62493, 32254, 37704, 48625, 68084, 52804, 46897, 68195, 60364, 16274, 13868, 25988, 27339, 34324, 33842, 47583, 57503, 78740, 81442, 74311, 66556, 82949, 83626, 67377, 77021, 124347]
13046A24347K4372j946J2350R956K61l1707k3130J3140L0214L3481L2901J3733
13034B37972R075k0699k7936k5803K9236o583k3519K8084j1934j7645J5094Q195
13022A93537l9053J5260j622M128R783m222K0559K2601k674J734L26J1004J1293
13009B42654j3609j4993j2179l8417L189J5584j372k1699l0098j7542J5594K1910
12997A49022R75l3616j3339J2007j5099J5155J9679q460k1524j3516J178N968
12985I8430R65j7638P631K5463N58M832r161J5529r8k3332j1248J3530J0117j1115
12971A04463k505j8303L789K565k3966j2534K7591J6725n189J920K2358J4675
12959A31589m1007j3861K2840O456j6240m426J1046j8162j4868L328J353N519
$$ y = [124347, 148719, 146773, 159123, 169079, 169340, 137633, 114503, 127643, 157857, 191338, 224239, 237972, 247047, 226348, 198412, 172609, 201845, 195262, 171743, 199827, 187893, 170248, 185342, 193537, 154484, 169744, 168122, 172250, 182033, 177811, 198370, 220971, 218297, 220031, 220357, 231361, 242654, 229045, 214052, 201873, 163456, 166645, 182229, 180857, 159158, 129060, 111518, 127112, 149022, 149997, 116381, 103042, 115049, 99950, 115105, 134784, 126324, 104800, 91284, 92462, 98430, 99395, 81757, 89388, 114851, 115409, 120241, 111080, 126609, 126511, 103179, 91931, 105461, 115578, 104463, 101958, 83655, 87444, 90009, 66043, 53509, 81100, 97825, 92636, 94556, 116914, 131589, 90582, 76721, 99561, 106017, 89777, 85351, 96397, 78235, 63367, 66695, 68048, 73567]
12947G3567J4231J1993o688k3590L546j1229J3413N441l0431r222K4149K2502
12935H7682K8057j931K587k644Q769r79j9902P439L4969J9564r041Q698K3762
12922A87030K3510k5012k9583J2143K7461q928J4903M9007L673l3437k1089J6381
12910B16059N025M743J852j5439j3252n461j0660j872r174j1058M936j0927J1913
12897A66685l312n518Q94L114J1419M445L6829K8307l4999J1766K6159P850J1328
12884B64967j6799l1858j6543J1523k0506k7443q883j0250n977j3202j9282m8487
12872E7260j5462J695J8373J4340O543j2750j437r649k7444K2214J0321j2457
12860E1547k5380K7639L5931k0809k0916k6526Q027J1691J9339K0266J478J28
$$ y = [73567, 87798, 99791, 93103, 69513, 73059, 61830, 75243, 80684, 50253, 41031, 65180, 87682, 115739, 113808, 116395, 113751, 122520, 121541, 101639, 109078, 144047, 163611, 154570, 163268, 187030, 210540, 185528, 155945, 168088, 195549, 186621, 201524, 250531, 254204, 220767, 199678, 216059, 221084, 225827, 227679, 212240, 198988, 193527, 182867, 180995, 171821, 160763, 165699, 154772, 166685, 163373, 157855, 158749, 161863, 173282, 177727, 214556, 242863, 207864, 219630, 245789, 253639, 264967, 248168, 216310, 199767, 211290, 190784, 163341, 154458, 144208, 138231, 125029, 105747, 57260, 41798, 43493, 61866, 76206, 82749, 69999, 68562, 58913, 31469, 53683, 64004, 51547, 26167, 53806, 89737, 68928, 48012, 21486, 29513, 41204, 60543, 80809, 82287, 82415]
12848H2415j6874Q476R085R222p088l711J7098J7435J6058N616L576j2647j6451
12835A12210k0474O102n966j6645P353K4388K9470q2K3058J9324m0072n4813R546
12822I3399J0184J0020j7022j7030q327L095K527R158J7342K6122J6814l7385
12810A08897k9950J6587j472J7J511J7580k849p304K6138J2359K1270J1129l2403
12797A41510l1256o845K8192R643k5634k2023j0181J1754k918j3116j5160j6553
12785D7413k2631J4785L3823K2720L3957M3014J6482K548r072l7223L809J2498
12773A62123j9350k9581K6411K9184J2281j4022L93K7034K622m424j043K0193
12761B11821p253N077K0740j5198M044J027p93K8386J301j4046r864J7243P859
$$ y = [82415, 65541, 74017, 83102, 92324, 85236, 81525, 98623, 116058, 132116, 137732, 141308, 128661, 112210, 91736, 97838, 91872, 75227, 82580, 106968, 136438, 136356, 159414, 178738, 138666, 83853, 93399, 103583, 113603, 96581, 79551, 71224, 74319, 76846, 86004, 103346, 129468, 146282, 108897, 78947, 95534, 94062, 94079, 95590, 113170, 110321, 103017, 129155, 141514, 162784, 173913, 141510, 110254, 103409, 131601, 141244, 115610, 93587, 83406, 95160, 92242, 79126, 63966, 47413, 24782, 39567, 73390, 96110, 130067, 173081, 189563, 192111, 183039, 145816, 149625, 162123, 142773, 113192, 139603, 168787, 181068, 167046, 167439, 194473, 197095, 192671, 191628, 211821, 204568, 209645, 230385, 215187, 219231, 220258, 219465, 247851, 249152, 235106, 225242, 242485, 250344]
12748B50344m46k64K4786J6689J0357J8458J0455l167k2247j7192J3238K2745
12736C23756j1867q614L8096L0327J6507O145j5317k6971K5438K5144J2110J0423
12724D25177J272N564R541J1460J6422j0053K1084P105R343L4253J8841J3427
12712E63436J0259J8117J8558L2019N0018L8508P5601N4827P3338Q5533Q9508
12701A109722J26156J27735J49298J97976K63633K77599L61152N29758P04778
12692C847807R53575J268098J489637J574015J463743J180698R87811J000653
12684A3766037J229248J456973J415168J096637M21064l72882q79362r69902p66048
12675A6396933l78071j92722l52823o45840q70955q40925m36045K43576J030915
$$ y = [250344, 249898, 249634, 274420, 291109, 301466, 319924, 330379, 327212, 304965, 287773, 301011, 323756, 311889, 303275, 341371, 371698, 388205, 394350, 379033, 352062, 377500, 402644, 414754, 425177, 426449, 432013, 441554, 453014, 469436, 459383, 480467, 487572, 496915, 531168, 550009, 563436, 573695, 591812, 610370, 642389, 692407, 730915, 806516, 861343, 934681, 1020214, 1109722, 1235878, 1363613, 1512911, 1710887, 1974520, 2252119, 2613271, 3143029, 3847807, 4801382, 6069480, 7559117, 9133132, 10596875, 11777573, 12765384, 13766037, 14995285, 16452258, 17867426, 18964063, 19385127, 19012245, 18132883, 17162981, 16396933, 16018862, 15826140, 15473317, 14827477, 13956522, 13115597, 12679552, 12923128, 13954043]
12666A3954043J562664J652784J485960J261899J224102J415198J704735J657482
12658B5918867J189399L63060o98261j492535j787049j576327j112958q30173
12650A9974023j021595j495818j998556k259614k218154j850734j418094j048694
12642F662764p23576n18862l91127k80434k12261j65336j21390j17739j13754
12633D018285p0970m0964j8068K7483J9429J3407K1883L6877O9799P6524R3378
12622D247063J20995J46443J48407J66758J99534K16863K72932L33312M00939
12613F253246M52125N40957O39762P82145R11810R60407J017950J081773J186590
12604A3826765J288036J386773J523801J596816J596127J532393J422939J322839
$$ y = [13954043, 15516707, 17169491, 18655451, 19917350, 21141452, 22556650, 24261385, 25918867, 27108266, 27471326, 26773065, 25280530, 23493481, 21917154, 20804196, 19974023, 18952428, 17456610, 15458054, 13198440, 10980286, 9129552, 7711458, 6662764, 5939188, 5420326, 5029199, 4748765, 4536504, 4371168, 4249778, 4132039, 4018285, 3947315, 3906351, 3888283, 3915766, 3935195, 3948602, 3970485, 4007362, 4077161, 4153685, 4247063, 4368058, 4514501, 4662908, 4829666, 5029200, 5246063, 5518995, 5852307, 6253246, 6705371, 7246328, 7886090, 8668235, 9580045, 10540452, 11558402, 12640175, 13826765, 15114801, 16501574, 18025375, 19622191, 21218318, 22750711, 24173650, 25496489]
12596B5496489J263824J251338J155874J016219R63531R11004Q75613R03621R64147
12587C4801660J000782R81743Q92040P53678O43568N38318M55724M10202K71278
12578D0748993N0765k59441o42199j003009j285945j430349j468998j556086j713789
12569C1439942j896126j992513k007300j924373j717701j497964j223928j041002
12561A8139035q56236p03423n96140m72944m05472l57046k78969j76317j53228
12552A4139260j52687j09893j14850p8607o8966m5721m0800j5188j4595n9268
12542A3438685m2170n3306n9460j4129K3141m1766k2401l2165m1503m9726l1398
12531A3073802k3411n5238r0318m5689k7368m4013o9714l2639m7296n6681q2313
$$ y = [25496489, 26760313, 28011651, 29167525, 30183744, 31147275, 32058279, 32933892, 33837513, 34801660, 35802442, 36784185, 37676225, 38429903, 39073471, 39611789, 40067513, 40477715, 40748993, 40799758, 40540317, 39898118, 38895109, 37609164, 36178815, 34709817, 33153731, 31439942, 29543816, 27551303, 25544003, 23619630, 21901929, 20403965, 19180037, 18139035, 17282799, 16579376, 15983236, 15510292, 15104820, 14747774, 14468805, 14292488, 14139260, 13986573, 13876680, 13761830, 13683223, 13614257, 13568536, 13527736, 13512548, 13497953, 13438685, 13396515, 13343209, 13283749, 13269620, 13292761, 13250995, 13228594, 13196429, 13154926, 13105200, 13073802, 13050391, 12995153, 12904835, 12859146, 12831778, 12787765, 12718051, 12685412, 12638116, 12581435, 12499122]
12520A2499122j00095r1387p9399p6279p6939j16920p9607q1696r2873j03224
12510A1600703r9168o6911q3954j01447j41915j46380p5090j01379j36154j24030
12500A0524275j20102q7526q4966j10316j45088j26566j35089j14457j16787j32529
12490I350849j41761j53865j47514j46575j33259j06571q7279j58514j59126j12019
12480H004366j56949j44272j41139j20871j38914j29905j28798j02499j14458
12471F826561j39261j52268j29399j32741j21790j25683j01088j20742q4187r7163
12461E622239r8730j05153r9438j41665q6428j32233j07105q5629j00136j00628
12451D565094r8048p2998q0105r1141n5221p3625q4109p2303o3037o5543o6718
$$ y = [12499122, 12399027, 12307640, 12228241, 12151962, 12075023, 11958103, 11878496, 11796800, 11703927, 11600703, 11501535, 11434624, 11350670, 11249223, 11107308, 10960928, 10885838, 10784459, 10648305, 10524275, 10404173, 10316647, 10231681, 10121365, 9976277, 9849711, 9714622, 9600165, 9483378, 9350849, 9209088, 9055223, 8907709, 8761134, 8627875, 8521304, 8434025, 8275511, 8116385, 8004366, 7847417, 7703145, 7562006, 7441135, 7302221, 7172316, 7043518, 6941019, 6826561, 6687300, 6535032, 6405633, 6272892, 6151102, 6025419, 5924331, 5803589, 5719402, 5622239, 5523509, 5418356, 5318918, 5177253, 5090825, 4958592, 4851487, 4765858, 4665722, 4565094, 4467046, 4394048, 4313943, 4222802, 4167581, 4093956, 4009847, 3937544, 3874507, 3808964, 3742246]
12440C742246o7483m5093o5119m2634k9087l4733n3352o4769m7130j8690l4551
12429C239605j4726k242R424l584J197j2116l9144k979K4399N9313J1285L3800
12417C304232J9084N6005N6190M1381L1996N0587Q8887J03668P7345Q0790R2903
$$ y = [3742246, 3674763, 3629670, 3564551, 3521917, 3492830, 3458097, 3404745, 3339976, 3292846, 3274156, 3239605, 3224879, 3222637, 3232061, 3228477, 3229674, 3217558, 3178414, 3175435, 3199834, 3259147, 3270432, 3304232, 3323316, 3379321, 3435511, 3476892, 3508888, 3559475, 3648362, 3752030, 3829375, 3910165, 4003068]
$$ [...]
##END NTUPLES=NMR SPECTRUM
##END=
