##TITLE=Analysis number 318706
Compound Code mo 00965
Project Code adrs
Chemist Name endeavour
##JCAMPDX= 6.0         $$ Bruker NMR JCAMP-DX V2.0
##DATA TYPE= NMR SPECTRUM
##DATA CLASS= NTUPLES
##ORIGIN= Bruker BioSpin GmbH
##OWNER= nmr
$$ XWIN-NMR		Version 3.5
$$ Tue Apr 11 08:18:48 2006 GMT Daylight Time (UT+1h)  MAYBRIDGE\nmr@NMR_250MHZ
##.OBSERVE FREQUENCY= 250.131544655141
##.OBSERVE NUCLEUS= ^1H
##.ACQUISITION MODE= SIMULTANEOUS (DQD)
##.ACQUISITION SCHEME= undefined
##.AVERAGES= 16
##.DIGITISER RES= 18
##SPECTROMETER/DATA SYSTEM= dpx250
##.PULSE SEQUENCE= zg30
##.SOLVENT NAME= CDCl3
##.SHIFT REFERENCE= (INTERNAL, CDCl3, 0, 16.4479)
##AUDIT TRAIL= $$ (NUMBER, WHEN, WHO, WHERE, WHAT)
$$ ##TITLE= Audit trail, XWIN-NMR		Version 3.5
$$ ##JCAMPDX= 5.01
$$ ##ORIGIN= Bruker BioSpin GmbH
$$ ##OWNER= nmr
$$ C:\u/data/dgb/nmr/ADRS/2510/pdata/1/auditp.txt
$$ ##AUDIT TRAIL=  $$ (NUMBER, WHEN, WHO, WHERE, WHAT)
(   1,<2006-04-11 08:18:23.93 +100>,<MAYBRIDGE\nmr>,<NMR_250MHZ>,
      <created by zg, POWCHK disabled, PULCHK disabled
       configuration hash MD5:
       84 BC 41 DB A1 6E 1D 46 DA 25 12 A5 C1 ED C5 3A
       data hash MD5: 64K
       69 66 B0 12 C7 60 54 6B CA D1 0C EE 4B DF 6E 05>)
(   2,<2006-04-11 08:18:37.04 +100>,<MAYBRIDGE\nmr>,<NMR_250MHZ>,
      <Start of raw data processing
       ef LB = 0.3 FT_mod = 6 PKNL = 1 SI = 32K 
       data hash MD5: 32K
       39 87 F9 34 01 E1 E6 42 55 42 F7 37 CB 0E B2 C7>)
(   3,<2006-04-11 08:18:38.60 +100>,<MAYBRIDGE\nmr>,<NMR_250MHZ>,
      <apk 
       data hash MD5: 32K
       E8 26 9C FE 5F B3 72 BC 80 7A 72 0E FA 9B 22 94>)
(   4,<2006-04-11 08:18:39.32 +100>,<MAYBRIDGE\nmr>,<NMR_250MHZ>,
      <abs ABSG = 5 
       data hash MD5: 32K
       D4 FA 51 BE 6F 83 3A 35 B4 BF C1 3A 54 FB B5 69>)
$$ ##END=
$$ 
$$ hash MD5
$$ 69 F2 7D 29 EE A6 DC 08 E8 A3 38 06 65 A7 44 1F
##$RELAX= 
##$RELAX= 
##$RELAX= 
##$RELAX= 
##$RELAX= 
##$RELAX= 
##$RELAX= 
$$ Bruker specific parameters
$$ --------------------------
##$DU= <C:\u>
##$EXPNO= 2510
##$NAME= <ADRS>
##$PROCNO= 1
##$TYPE= <nmr>
##$USER= <dgb>
##$AMP= (0..31)
100 100 100 100 100 100 100 100 100 100 100 100 100 100 100 100 100 100 
100 100 100 100 100 100 100 100 100 100 100 100 100 100 
##$AQSEQ= 0
##$AQ_mod= 3
##$AUNM= <au_zg>
##$AUTOPOS= <3 >
##$BF1= 250.13
##$BF2= 250.13
##$BF3= 250.13
##$BF4= 250.13
##$BF5= 500.13
##$BF6= 500.13
##$BF7= 500.13
##$BF8= 500.13
##$BYTORDA= 1
##$CFDGTYP= 0
##$CFRGTYP= 5
##$CHEMSTR= <none>
##$CNST= (0..31)
1 1 145 1 1 1 1 1 1 1 1 1 1 1 1 1 1 1 1 1 1 1 1 1 1 1 1 1 1 1 1 1 
##$CPDPRG= <>
##$CPDPRG1= <>
##$CPDPRG2= <>
##$CPDPRG3= <>
##$CPDPRG4= <mlev>
##$CPDPRG5= <mlev>
##$CPDPRG6= <mlev>
##$CPDPRG7= <mlev>
##$CPDPRG8= <mlev>
##$CPDPRGB= <>
##$CPDPRGT= <>
##$D= (0..31)
0 1 0 0 0 0 0 0 0 0.06 0 0 0 0 0 0 0.0002 0 0 0 0 0 0 0 0 0 0 0 0 0 0 
0 
##$DATE= 1144739902
##$DBL= (0..7)
120 120 120 120 120 120 120 120 
##$DBP= (0..7)
150 150 150 150 150 150 150 150 
##$DBP07= 0
##$DBPNAM0= <>
##$DBPNAM1= <>
##$DBPNAM2= <>
$$ [...]
##$SUBNAM7= <"">
##$SUBNAM8= <"">
##$SUBNAM9= <"">
##$SW= 20.6930455092707
##$SWIBOX= (0..15)
0 0 3 0 0 0 0 0 0 0 0 0 0 0 0 0 
##$SW_h= 5175.983436853
##$TD= 65536
##$TD0= 1
##$TE= 294.16
##$TE2= 300
##$TE3= 300
##$TEG= 300
##$TL= (0..7)
0 120 120 120 120 120 120 120 
##$TP= (0..7)
150 150 150 150 150 150 150 150 
##$TP07= 0
##$TPNAME0= <>
##$TPNAME1= <>
##$TPNAME2= <>
##$TPNAME3= <>
##$TPNAME4= <>
##$TPNAME5= <>
##$TPNAME6= <>
##$TPNAME7= <>
##$TPOAL= (0..7)
0.5 0.5 0.5 0.5 0.5 0.5 0.5 0.5 
##$TPOFFS= (0..7)
0 0 0 0 0 0 0 0 
##$TUNHIN= 0
##$TUNHOUT= 0
##$TUNXOUT= 0
##$USERA1= <user>
##$USERA2= <user>
##$USERA3= <user>
##$USERA4= <user>
##$USERA5= <user>
##$V9= 5
##$VALIST= <valist>
##$VCLIST= <CCCCCCCCCCCCCCC>
##$VD= 0
##$VDLIST= <DDDDDDDDDDDDDDD>
##$VPLIST= <PPPPPPPPPPPPPPP>
##$VTLIST= <TTTTTTTTTTTTTTT>
##$WBST= 1024
##$WBSW= 4
##$XGAIN= (0..3)
0 0 0 0 
##$XL= 0
##$YL= 0
##$YMAX_a= 461313
##$YMIN_a= -473917
##$ZGOPTNS= <>
##$ZL1= 120
##$ZL2= 120
##$ZL3= 120
##$ZL4= 120
##$ABSF1= 16.44788
##$ABSF2= -4.245293
##$ABSG= 5
##$ABSL= 3
##$ALPHA= 0
##$AQORDER= 0
##$ASSFAC= 0
##$ASSFACI= 0
##$ASSFACX= 0
##$ASSWID= 0
##$AUNMP= <proc_1d>
##$AZFE= 0.1
##$AZFW= 0.1
##$BCFW= 0
##$BC_mod= 0
##$BYTORDP= 0
##$COROFFS= 0
##$CY= 12.5
##$DATMOD= 1
##$DC= 0
##$DFILT= <>
##$DTYPP= 0
##$F1P= 14.0000005364418
##$F2P= -0.99999901652339
##$FCOR= 0.5
##$FTSIZE= 32768
##$FT_mod= 6
##$GAMMA= 0
##$GB= 0
##$INTBC= 1
##$INTSCL= 1
##$ISEN= 128
##$LB= 0.3
##$LEV0= 0
##$LPBIN= 0
##$MAXI= 10000
##$MC2= 0
##$MEAN= 0
##$ME_mod= 0
##$MI= 0
##$NCOEF= 0
##$NC_proc= -2
##$NLEV= 6
##$NOISF1= 0
##$NOISF2= 0
##$NSP= 0
##$NTH_PI= 0
##$NZP= 0
##$OFFSET= 16.44788
##$PC= 1
##$PHC0= 177.1203
##$PHC1= 4.850001
##$PH_mod= 1
##$PKNL= yes
##$PPARMOD= 0
##$PSCAL= 4
##$PSIGN= 0
##$REVERSE= no
##$SF= 250.130018538566
##$SI= 32768
##$SIGF1= 0
##$SIGF2= 0
##$SINO= 400
##$SIOLD= 32768
##$SREGLST= <1H.CDCl3>
##$SSB= 0
##$STSI= 32768
##$STSR= 0
##$SW_p= 5175.98343685301
##$SYMM= 0
##$S_DEV= 0
##$TDeff= 65536
##$TDoff= 0
##$TI= <Analysis number 999999
Compound Code 99
Book Reference 9
Project Code 9>
##$TILT= no
##$TM1= 0
##$TM2= 0
##$TOPLEV= 0
##$USERP1= <user>
##$USERP2= <user>
##$USERP3= <user>
##$USERP4= <user>
##$USERP5= <user>
##$WDW= 1
##$XDIM= 32768
##$YMAX_p= 287142563
##$YMIN_p= -83418
$$ End of Bruker specific parameters
$$ ---------------------------------
##NTUPLES= NMR SPECTRUM
##VAR_NAME=  FREQUENCY,     SPECTRUM/REAL,   SPECTRUM/IMAG
##SYMBOL=    X,             R,               I
##VAR_TYPE=  INDEPENDENT,   DEPENDENT,       DEPENDENT
##VAR_FORM=  AFFN,          ASDF,            ASDF
##VAR_DIM=   32768,         32768,           32768
##UNITS=     HZ,            ARBITRARY UNITS, ARBITRARY UNITS
##FACTOR=    0.157963299565203, 1,           1
##FIRST=     4114.10847710791, 0,            0
##LAST=      -1061.8749597451, 0,            0
##MIN=       -1061.8749597451, -83418,       0
##MAX=       4114.10847710791, 287142563,    0
$$ Real data points
##PAGE= N=1
##DATA TABLE= (X++(R..R)), XYDATA
$$ [...]
$$ plain form
18872 18586923 19808266 20854767 23188766 24885714 23922128 20698421 17831303 16744467
18864 16744467 15236691 11623289 8420242 6558723 5487891 4770144 4240075 3862616
18856 3862616 3587702 3375907 3203194 3074869 2960176 2862701 2796891 2742021 2664761 2558162
18846 2558162 2460658 2406561 2371318 2316008 2263518 2223333 2218798 2243145 2239765 2252369 2294583 2366820
18834 2366820 2403115 2404696 2434616 2521958 2641917 2731837 2865629 3145363 3600417 4332055
18824 4332055 5515821 7487075 10358696 13925692 18205371 23695425 28239056 29642684
18816 29642684 31428569 34867274 36731551 34741061 29842186 26049982 24612619 21797575
18808 21797575 16332714 12017523 9544177 8079652 7087848 6338966 5801360 5401407 5083009
$$ packed form
18872A8586923J221343J046501K333999J696948r63586l223707k867118j086836
18864A6744467j507776l613402l203047j861519j070832p17747n30069l77459
18856C862616k74914k11795j72713j28325j14693r7475o5810n4870p7260j06599
18846B558162r7504n4097l5243n5310n2490m0185m535K4347l380J2604M2214P2237
18834B366820L6295J581K9920Q7342J19959Q9920J33792K79734M55054P31638
18824D332055J183766J971254K871621L566996M279679N490054M543631J403628
18816B9642684J785885L438705J864277j990490m898875l792204j437363k815044
18808B1797575n464861m315191k473346j464525r91804p48882n37606l99953l18398
$$ plain form
18799 5083009 4811790 4584856 4392879 4199971 4034635 3892243 3739020 3600915 3462736
18790 3462736 3354650 3239732 3115241 3030115 2957235 2903820 2846446 2781969 2727136 2673939 2624990
18779 2624990 2555184 2464983 2408379 2382909 2323834 2262915 2214482 2155982 2112797 2078544 2050785
18768 2050785 2001501 1967636 1952239 1941283 1878947 1828932 1785808 1764489 1742916 1729372 1689048
18757 1689048 1605412 1541894 1492072 1425586 1378552 1354364 1344639 1324405 1321875 1294047 1285295 1291721
18745 1291721 1259089 1216662 1178688 1160782 1129760 1103744 1060294 1022267 1016392 1021294 999116 999100
18733 999100 994476 947618 917381 902750 885151 851413 822146 813406 793459 781760 766010 763077
18721 763077 742151 719959 731109 730758 714341 701154 725398 760651 791561 810265 799196 761169
$$ packed form
18799E083009k71219k26934j91977j92908j65336j42392j53223j38105j38179
18790C462736j08086j14918j24491q5126p2880n3415n7374o4477n4833n3197m8949
18779B624990o9806r0201n6604k5470n9075o0919m8433n8500m3185l4253k7759
18768B050785m9284l3865j5397j0956o2336n0015m3124k1319k1573j3544m0324
18757A689048q3636o3518m9822o6486m7034k4188r725k0234k530k7828q752O426
18745A291721l2632m2427l7974j7906l1022k6016m3450l8027n875M902k2178j6
18733I99100m624m6858l0237j4631j7599l3738k9267q740j9947j1699j5750k933
18721G63077k0926k2192J1150l51j6417j3187K4244L5253L0910J8704j1069l8027
$$ plain form
18709 761169 726296 696579 661468 658223 667491 676348 700589 711189 724327 739889 743430 723986
18697 723986 705621 699445 717742 716724 749136 769449 793414 799508 770520 752696 786805 846075
18685 846075 881992 924856 999217 1030535 1039039 1058394 1085305 1083379 1009048 957141 898636 857397
18673 857397 832442 791080 708603 644281 602112 566888 558869 555314 543258 513582 495256 488345
18661 488345 494824 528159 543212 567570 566002 556391 526343 479976 444179 433762 424645 421592
18649 421592 440960 465882 471393 492594 478832 457502 454997 460473 454031 468504 460681 450428
18637 450428 458930 481503 491872 532281 601510 650038 721873 763297 745872 706805 691250 704976
18625 704976 748137 782037 715285 627327 557369 528849 528646 548056 590238 621488 623490 605255
$$ packed form
18709G61169l4873k9717l5111l245R268Q857K4241J0600J3138J5562L541j9444
18697G23986j8365o176J8297j018L2412K0313K3965O094k8988j7824L4109N9270
18685H46075L5917M2864P4361L1318Q504J9355K6911j926p4331n1907n8505m1239
18673H57397k4955m1362q2477o4322m2169l5224q019l555j2056k9676j8326o911
18661D88345O479L3335J5053K4358j568r611l0048m6367l5797j0417r117l053
18649D21592J9368K4922N511K1201j3762k1330k505N476o442J4473p823j0253
18637D50428Q502K2573J0369M0409O9229M8528P1835M1424j7425l9067j5555J3726
18625G04976M3161L3900o6752q7958o9958k8520k03J9410M2182L1250K002j8235
$$ plain form
18613 605255 584193 558376 553450 559623 594452 635957 704036 768016 834754 925298 996751 1035460
18601 1035460 1054500 1067929 1071517 1136133 1285607 1475984 1732520 2086148 2566026 3287693
18591 3287693 4389582 6179089 9172804 13524587 18550859 23618673 28820119 30240773
18583 30240773 24180999 16633514 12155078 10159021 9669482 10464261 12678031 16362723
18575 16362723 20774726 25176972 29546976 30512427 24363554 16529735 11620210 8970028
18567 8970028 7458985 6504419 5817610 5319251 4953982 4634025 4340702 4056866 3822702
18558 3822702 3658546 3534243 3471800 3427243 3388776 3321998 3197955 3051237 2993001 2969973
18548 2969973 2920109 2858506 2796405 2766754 2773952 2797113 2867144 2960295 3080060 3244748 3546155
$$ packed form
18613F05255k1062k5817m926O173L4829M1505O8079O3980O6738R0544P1453L8709
18601A035460J9040J3429L588O4616J49474J90377K56536L53628M79878P21667
18591C287693J101889J789507K993715M351783N026272N067814N201446J420654
18583C0240773o059774p547485m478436j996057m89539P94779K213770L684692
18575A6362723M412003M402246M370004R65451o148873p833819m909525k650182
18567H970028j511043r54566o86809m98359l65269l19957k93323k83836k34164
18558C822702j64156j24303o2443m4557l8467o6778j24043j46718n8236k3028
18548B969973m9864o1603o2101k9651P198K3161P0031R3151J19765J64688L01407
$$ plain form
18537 3546155 4005895 4760560 6038464 8197461 11272335 14698054 18132502 21526852
18529 21526852 21646144 16845182 11881658 9154460 7965274 7756082 8422871 10114645
18521 10114645 12793230 15855656 18907241 21860425 21760230 16750698 11459478 8356128
18513 8356128 6682701 5729406 5113984 4680149 4337048 4033299 3776299 3531772 3347187
18504 3347187 3239306 3166471 3072945 3031292 2974592 2892906 2804621 2664931 2533379 2415085
18494 2415085 2310636 2232853 2173865 2132292 2103683 2077276 2057750 2049745 2015477 1925538 1849570
18483 1849570 1781357 1713978 1652070 1616646 1564163 1525168 1479906 1415160 1380775 1363247 1329785
18472 1329785 1303942 1281557 1280606 1257047 1228938 1220029 1216500 1200935 1215207 1224963 1221232 1230486 1214281
$$ packed form
18537C546155M59740P54665J277904K158997L074874L425719L434448L394350
18529B1526852J19292m800962m963524k727198j189186k09192O66789J691774
18521A0114645K678585L062426L051585K953184j00195n009532n291220l103350
18513H356128j673427r53295o15422m33835l43101l03749k57000k44527j84585
18504C347187j07881p2835r3526m1653n6700q1686q8285j39690j31552j18294
18494B415085j04449p7783n8988m1573k8609k6407j9526q005l4268q9939p5968
18483A849570o8213o7379o1908l5424n2483l8995m5262o4746l4385j7528l3462
18472A329785k5843k2385r51k3559k8109q909l529j5565J4272R756l731R254j6205
$$ plain form
18459 1214281 1163770 1118747 1122153 1125023 1104738 1075161 1051441 1045761 1034616 1029941 1014997 1002801
18447 1002801 980866 957228 953300 958553 931504 906409 892992 864205 829037 809059 786197 748952
18435 748952 726716 701987 692237 669247 683482 672842 656660 643875 620790 612823 599477 584959
18423 584959 582758 578328 585741 581797 561169 536001 524970 532415 517629 500877 507468 534826 520516
18410 520516 511127 523112 566517 563409 541472 514400 487694 452748 455295 466225 465852 454057
18398 454057 463876 459625 449275 474466 478713 451913 408893 415208 439673 443867 441789 449842 460874
18385 460874 466920 471319 479355 471339 455691 416821 372206 354857 377368 393571 407300 405254
18373 405254 412407 421018 423307 429493 395494 363884 350952 325046 326624 354311 348028 335471 317621
$$ packed form
18459A214281n0511m5023L406K870k0285k9577k3720n680j1145m675j4944j2196
18447A002801k1935k3638l928N253k7049k5095j3417k8787l5168j9978k2862l7245
18435G48952k2236k4729r750k2990J4235j0640j6182j2785k3085p967j3346j4518
18423E84959k201m430P413l944k0628k5168j1031P445j4786j6752O591K7358j4310
18410E20516r389J1985M3405l108k1937k7072k6706l4946K547J0930l73j1795
18398D54057R819m251j0350K5191M247k6800m3020O315K4465M194k078Q053J1032
18385D60874O046M399Q036q016j5648l8870m4615j7349K2511J6203J3729k046
18373D05254P153Q611K289O186l3999l1610j2932k5906J578K7687o283j2557j7850
$$ plain form
18360 317621 308053 308179 306024 289437 287237 287333 285496 284192 256870 250953 254451 253268 279796 267670
18346 267670 266584 299807 316502 334113 361429 361665 382775 425590 420618 411073 437486 454974
18334 454974 446597 435149 410074 382514 372657 367837 357727 321342 299111 283549 274496 256702
18322 256702 248696 257389 261611 263792 266868 290822 320524 327016 290979 270174 277647 288855 301356
18309 301356 270527 245800 270595 295831 309932 300364 293437 264112 244411 233157 255407 289035
18297 289035 277999 289773 302884 334301 363131 370626 391126 394137 389677 392175 385100 368312
18285 368312 368663 379062 401082 405843 413656 434293 420827 400953 372996 341883 316058 292076
18273 292076 273275 266110 269831 282729 298096 290473 293010 294749 317717 338705 339655 330356 299545
$$ packed form
18360C17621r568J26k155j6587k200R6j837j304k7322n917L498j183K6528j2126
18346B67670j086L3223J6695J7611K7316K36K1110M2815m972r545K6413J7488
18334D54974q377j1448k5075k7560r857m820j0110l6385k2231j5562r053j7794
18322B56702q006Q693M222K181L076K3954K9702O492l6037k0805P473J1208J2501
18309C01356l0829k4727K4795K5236J4101r568o927k9325j9701j1254K2250L3628
18297B89035j1036J1774J3111L1417K8830P495K0500L011m460K498p075j6788
18285C68312L51J0399K2020M761P813K0637j3466j9874k7957l1113k5825k3982
18273B92076j8801p165L721J2898J5367p623K537J739K2968K0988R50r299l0811
$$ plain form
18260 299545 280348 311187 315491 312837 304520 301718 327577 372904 408334 422438 407303 388714
18248 388714 358854 329775 313302 282351 259990 258860 229092 233909 268952 284321 298934 314631
18236 314631 347194 382803 400603 381114 362056 328674 299864 280536 277782 271474 261659 269141
18224 269141 283776 298442 292729 279275 303190 339347 403852 478133 523727 540295 479956 393399
18212 393399 337884 294839 261444 259023 264594 261106 243298 211123 198191 212345 193230 186818
18200 186818 185248 198908 202521 199449 207995 196582 178916 206225 208184 182257 171459 165797 151295
18187 151295 161541 183711 193884 185878 168613 162944 163072 144647 157393 166067 163495 157582 159499
18174 159499 154309 164572 207982 250606 299120 383309 472470 537996 597038 585266 541502 442696
$$ packed form
18260B99545j9197L0839M304k654q317k802K5859M5327L5430J4104j5135j8589
18248C88714k9860k9079j6473l0951k2361j130k9768M817L5043J5369J4613J5697
18236C14631L2563L5609J7800j9489j9058l3382k8810j9328k754o308r815P482
18224B69141J4635J4666n713j3454K3915L6157O4505P4281M5594J6568o0339q6557
18212C93399n5515m3045l3395k421N571l488j7808l2175j2932J4154j9115o412
18200A86818j570J3660L613l072Q546j1413j7666K7309J959k5927j0798n662j4502
18187A51295J0246K2170J0173q006j7265n669J28j8425J2746Q674k572n913J917
18174A59499n190J0263M3410M2624M8514Q4189Q9161O5526N9042j1772m3764r8806
$$ plain form
18162 442696 327266 257560 234549 217641 222626 206911 193756 204313 207127 193419 208431 227559
18150 227559 220203 199313 207012 210616 192593 177810 174417 183525 183980 180581 155395 154762 180667
18137 180667 220870 242863 225156 213266 217302 245828 271577 285162 307554 328409 352510 375486
18125 375486 413933 465332 524615 577673 647416 753932 892454 1084266 1353692 1704987
18115 1704987 2152222 2847864 4118114 6461166 10395541 15420814 20294619 25904189
18107 25904189 30782452 25072908 14928763 9219706 6517105 5058924 4168078 3593739
18099 3593739 3205670 2895696 2613503 2387174 2239096 2109231 1971035 1869851 1757440
18090 1757440 1677429 1598584 1518649 1458283 1395597 1355841 1298902 1229248 1174748 1130451 1100311
$$ packed form
18162D42696j15430o9706k3011j6908M985j5715j3155J0557K814j3708J5012J9128
18150B27559p356k0890P699L604j8023j4783l393R108M55l399k5186o33K5905
18137A80667M0203K1993j7707j1890M036K8526K5749J3585K2392K0855K4101K2976
18125C75486L8447N1399N9283N3058O9743J06516J38522J91812K69426L51295
18115A704987M47235O95642J270250K343052L934375N025273M873805N609570
18107B5904189M878263n709544j0144145n709057k702601j458181q90846n74339
18099C593739l88069l09974k82193k26329j48078j29865j38196j01184j12411
18090A757440q0011p8845p9935o0366o2686l9756n6939o9654n4500m4297l0140
$$ plain form
18079 1100311 1066809 1044630 1028257 1012443 1010878 990481 936685 882493 839194 815881 799691
18068 799691 789169 778413 765722 734976 679547 674279 659986 642427 638980 651227 640652 647076
18056 647076 653938 665963 677861 682467 673521 656892 607148 572768 565067 574613 553207 523698
18044 523698 495027 503270 525550 524698 531067 513953 484126 435811 418113 412862 392199 389513 385845
18031 385845 386699 388164 384704 376711 348839 339349 323138 323199 317562 329560 322627 314227 313283 297912
18017 297912 270450 256407 251646 269933 265100 259421 262091 258068 240269 221274 216760 221766 224736
18004 224736 233592 241025 245971 247151 297025 327962 309361 302329 286798 267666 230588 226919 230612
17991 230612 224449 239427 245537 275441 299286 340859 364405 376203 338689 267262 212616 200137
$$ packed form
18079A100311l3502k2179j6373j5814j565k0397n3796n4192m3299k3313j6190
18068G99691j0522j0756j2691l0746n5429n268j4293j7559l447J2247j0575O424
18056F47076O862J2025J1898M606q946j6629m9744l4380p701R546k1406k9509
18044E23698k8671Q243K2280q52O369j7114k9827m8315j7698n251k0663k686l668
18031C85845Q54J465l460p993k7872r490j6211O1n637J1998o933q400r44j5371
18017B97912k7462j4043m761J8287m833n679K670m023j7799j8995m514N006K970
18004B24736Q856P433M946J180M9874L0937j8601p032j5531j9132l7078l669L693
17991B30612o163J4978O110K9904K3845M1573K3546J1798l7514p1427n4646j2479
$$ plain form
17979 200137 226565 227213 198714 172017 176015 192212 200956 186156 157541 181838 199945 180408
17967 180408 160773 177912 170831 167334 146232 147043 129388 135277 142715 125394 103921 106623 102416
17954 102416 88346 94206 111854 98499 89386 98245 99602 93762 88527 103566 118416 128674 129080
17941 129080 100677 84218 82538 73031 73101 56625 49145 22831 35559 34563 47883 69519 84555
17928 84555 61745 69467 75286 99659 115101 126120 122733 122687 115891 98914 82736 96001 103322
17915 103322 89351 107961 114022 92399 77968 76852 82308 96926 91185 66395 48702 64208
17903 64208 81072 71465 64496 55333 66038 76053 57213 55013 29538 26161 22337 24391 26657
17890 26657 43040 57023 63056 63894 68020 59078 49205 37394 36736 38326 50313 70827 54749
$$ packed form
17979B00137K6428O48k8499k6697L998J6197Q744j4800k8615K4297J8107j9537
17967A80408j9635J7139p081l497k1102Q11j7655N889P438j7321k1473K702m207
17954A02416j4070N860J7648j3355r113Q859J357n840n235J5039J4850J0258M06
17941A29080k8403j6459j680r507P0j6476p480k6314J2728r96J3320K1636J5036
17928H4555k2810P722N819K4373J5442J1019l387m6o796j6977j6178J3265P321
17915A03322j3971J8610O061k1623j4431j116N456J4618n741k4790j7693J5506
17903F4208J6864r607o969r163J0705J0015j8840k200k5475l377l824K054K266
17890B6657J6383J3983O033Q38M126q942r873j1811o58J590J1987K0514j6078
$$ plain form
17877 54749 38045 22801 20459 29983 37290 36128 24709 35040 41086 30019 39249 32678 27267
17864 27267 35468 46837 52996 43547 34015 12808 30422 53163 34995 9258 2953 6161 15316
17851 15316 16997 21638 30229 42205 59791 56207 56846 62024 56114 74402 76902 58861 52944 48520
17837 48520 54627 54105 49567 17217 4982 8962 15426 14327 20726 17968 18988 15800 -561 2203
17823 2203 3813 21089 33847 31320 25167 34572 54662 46443 32621 30103 43634 40231 19764
17810 19764 9932 6748 14305 12758 56 4272 8945 390 9673 19587 24400 23634 20855 40930
17796 40930 32284 15228 643 12262 -3617 -16226 -5010 -29521 -27663 -22780 -3919 12600
17784 12600 21980 13887 -200 -2099 1722 -1201 -851 -1538 4015 4134 22919 31013 22312 26239 27859
$$ packed form
17877E4749j6704j5244k342R524P307j162j1419J0331O046j1067R230o571n411
17864B7267Q201J1369O159r449r532k1207J7614K2741j8168k5737o305L208R155
17851A5316J681M641Q591J1976J7586l584O39N178n910J8288K500j8041n917m424
17837D8520O107n22m538l2350j2235L980O464j099O399k758J020l188j6361K764
17823B203J610J7276J2758k527o153R405K0090q219j3822k518J3531l403k0467
17810A9764r832l184P557j547j2702M216M673q555R283R914M813p66k779K0075
17796D0930q646j7056j4585J1619j5879j2609J1216k4511J858M883J8861J6519
17784A2600R380q093j4087j899L821k923L50o87N553J19J8785Q094q701L927J620
$$ plain form
17769 27859 34420 36417 25736 29966 20127 13536 9097 35594 50094 48097 47961 49716 30920 20907
17755 20907 12830 34017 34022 33664 51678 66141 61016 60750 61487 48307 40867 39716 28946 27767 30082
17740 30082 22461 30736 49815 70543 64292 40201 22915 34671 44536 18203 16701 8177 27274
17727 27274 20991 2053 14956 20342 27967 17045 2147 -12422 -446 10636 4623 -3819 -18342
17714 -18342 -6281 -12908 -11202 -29139 -25882 -25419 -30567 -31112 -51737 -25956 13993 26224 16005
17701 16005 7119 25343 45249 49583 38171 43775 41520 17738 12807 37979 62215 49488 56424
17688 56424 72771 92715 89983 101853 87738 83882 106775 109726 95396 105946 117153 128023
17676 128023 138081 138585 125111 122043 127311 132118 116557 104171 92944 89567 86756 96979 83999
$$ packed form
17769B7859O561J997j0681M230r839o591m439K6497J4500j997j36J755j8796j0013
17755B0907q077K1187Nl58J8014J4463n125k66P37j3180p440j151j0770j179K315
17740C0082p621Q275J9079K0728o251k4091j7286J1756R865k6333j502q524J9097
17727B7274o283j8938J2903N386P625j0922j4898j4569J1976J1082o013q442j4523
17714a8342J2061o627J706j7937L257M63n148n45k0625K5781L9949J2231j0219
17701A6005q886J8224J9906M334j1412N604k255k3782m931K5172K4236j2727O936
17688E6424J6347J9944k732J1870j4115l856K2893K951j4330J0550J1207J0870
17676A28023J0058N04j3474l068N268M807j5561j2386j1227l377k811J0223j2980
$$ plain form
17663 83999 61545 46463 48897 49640 41924 31798 44381 44165 34774 49648 47884 27020 21275
17650 21275 23049 21409 24215 52691 74676 72921 53753 53624 32463 25118 35262 47956 61634
17637 61634 38762 44550 88183 109167 104235 100097 94820 98059 108497 123348 151550 183690 195969
17624 195969 226259 212714 210020 226246 239677 253778 262949 243027 219370 222157 214866 206499
17612 206499 209785 209274 189544 162953 152229 139837 137671 125985 138341 157069 159684 142019
17600 142019 116903 109444 114766 112902 104303 75650 50534 67441 87521 92161 78667 61052
17588 61052 81841 91615 68252 44711 46199 56610 89466 85305 43899 53653 67540 83496
17576 83496 83317 69032 93732 124820 127478 127036 132069 148075 157182 162964 171227 165926 167815 175362
$$ packed form
17663H3999k2454j5082K434P43p716j0126J2583k16r391J4874j764k0864n745
17650B1275J774j640K806K8476K1985j755j9168j29k1161p345J0144J2694J3678
17637F1634k2872N788M3633K0984m932m138n277L239J0438J4851K8202L2140J2279
17624A95969L0290j3545k694J6226J3431J4101R171j9922k3657K787p291q367
17612B06499L286n11j9730k6591j0724j2392k166j1686J2356J8728K615j7665
17600A42019k5116p459N322j864q599k8653k5116J6907K0080M640j3494j7615
17588F1052K0789R774k3363k3541J488J0411L2856m161m1406R754J3887J5956
17576H3496j79j4285K4700L1088K658m42N033J6006R107N782Q263n301J889P547
$$ plain form
17562 175362 177637 177044 158148 135617 120954 112629 121668 132112 126697 123829 126177 114693 104720
17549 104720 105464 127018 131712 123621 108767 96381 114814 107338 81747 71396 89886 97892 86080
17536 86080 73234 43786 47392 55742 48914 54406 49311 47646 59201 39688 31760 40666 56484
17523 56484 53550 52632 58125 58561 57331 36952 33057 47102 45300 49156 48420 60796 78323 65915
17509 65915 53737 34497 14975 44182 66467 59048 48114 34530 22552 17879 17378 23938 15857
17496 15857 6114 17994 414 -18575 -10255 2086 -2954 -15739 -11086 4317 6604 7899 19065
17483 19065 41536 35610 33171 26747 8589 4193 14338 19530 -4927 11359 9933 20043 26083
17470 26083 359 -15155 -4430 -9011 -6894 -3750 -1619 5486 10207 -5326 -15960 -9643 12441
$$ packed form
17562A75362K275n93j8896k2531j4663q325R039J0444n415k868K348j1484r973
17549A04720P44K1554M694q091j4854j2386J8433p476k5591j0351J8490Q006j1812
17536H6080j2846k9448L606Q350o828N492n095j665J1555j9513p928Q906J5818
17523E6484k934r18N493M36j230k0379l895J4045j802L856p36J2376J7527j2408
17509F5915j2178j9240j9522K9207K2285p419j0934j3584j1978m673n01O560q081
17496A5857r743J1880j7580j8989Q320J2341n040j2785M653J5403K287J295J1166
17483A9065K2471n926k439o424j8158m396J0145N192k4457J6286j426J0110O040
17470B6083k5724j5514J0725m581K117L144K131P105M721j5533j0634O317K2084
$$ plain form
17457 12441 -1914 -32280 -30490 -10085 385 -1436 9672 17129 1774 -23758 -21339 -7495
17445 -7495 23366 54317 65061 65772 100458 94926 66264 59323 42121 20748 14426 3317 5068
17432 5068 42355 45376 26843 12564 31105 42000 41555 22259 9021 -23018 -26470 -9148 -6754
17419 -6754 -25935 -20787 -9526 -14459 -6514 -12788 -14748 -10322 20459 21928 6686 1972 -4122 -11653
17405 -11653 -12814 920 -938 22669 37734 61365 63302 32799 -4546 -22559 -4308 8483
17393 8483 -3642 9566 14989 -4650 -5699 3742 2648 538 -2866 5307 11250 5037 10973 11148
17379 11148 908 -3806 -3114 -3771 -23886 -25898 -27058 -25969 -21931 -33600 -37163 -30294 -23033 -32025
17365 -32025 -26597 -13701 6289 34684 55402 45460 18072 -5841 -22726 -10412 -6891 4688
$$ packed form
17457A2441j4355l0366J790K0405J0470j821J1108P457j5355k5532K419J3844
17445g495L0861L0951J0744P11L4686n532k8662o941j7202k1373o322j1109J751
17432E068L7287L021j8533j4279J8541J0895m45j9296j3238l2039l452J7322K394
17419f754j9181N148J1261m933P945o274j960M426L0781J469j5242m714o094p531
17405a1653j161J3734j858K3607J5065K3631J937l0503l7345j8013J8251J2791
17393H483j2125J3208N423j9639j049R441j094k110l404Q173N943o213N936J75
17379A1148j0240m714O92o57k0115k012j160J089M038j1669l563O869P261q992
17365c2025N428J2896J9990K8395K0718r942k7388k3913j6885J2314L521J1579
$$ plain form
17353 4688 11058 -559 -20017 -46855 -33082 -32453 -32765 -9559 6755 627 -10843 -12265 -6973
17340 -6973 935 -9988 -1730 -6465 3236 13894 17943 20654 12528 -5071 -9211 -15179 -11252 -20800
17326 -20800 -25299 -23184 -24644 -26529 -60060 -57757 -24278 -10648 3418 -8567 -6427 -4510 -22947
17313 -22947 -1561 16790 13460 13444 8849 20099 31145 32409 12565 2705 1494 -2288 -7665 -7086
17299 -7086 5413 -27597 -41154 -32836 -19954 -12889 -22806 -25954 -6419 -12251 -15671 -7753 -11761
17286 -11761 -22266 -24342 -30399 -77152 -83418 -54569 -36819 -49931 -39805 -45764 -36041 -18584 -31432
17273 -31432 -43025 -51099 -36433 -12768 6217 15284 17740 9514 -29141 -52720 -37129 -33830 -15050
17260 -15050 2813 -16085 -19755 -19769 269 -7619 -14008 -21249 -31901 -12701 -6724 -4825 -8948 306
$$ packed form
17353D688O370j1617j9458k6838J3773O29l12K3206J6314o128j1470j422N292
17340f973P908j0923Q258m735R701J0658M049K711q126j7599m140n968L927r548
17326b0800m499K115j460j885l3531K303L3479J3630J4066j1985K140J917j8437
17313b2947K1386J8351l330j6m595J1250J1046J264j9844r860j211l782n377N79
17299g086J2499l3010j3557Q318J2882P065r917l148J9535n832l420P918m008
17286a1761j0505k076o057m6753o266K8849J7750j3112J0126n959R723J7457j2848
17273c1432j1593q074J4666K3665J8985R067K456q226l8655k3579J5591L299J8780
17260a5050J7863j8898l670j4K0038p888o389p241j0652J9200N977J899m123R254
$$ plain form
17246 306 2487 -15869 -18842 -6280 -9153 -23172 -34613 -50538 -33689 -6675 -4953 -17951 -22694
17233 -22694 -14740 -7279 -16030 -50466 -38592 -12239 1131 2057 -1 8276 -5695 -25775 -25290
17220 -25290 -39406 -18533 3748 22441 22347 -8891 -32586 -43598 -43061 -33953 -37648 -18463 -18099
17207 -18099 -7532 122 4873 -10257 -20127 -23180 2520 -8954 -24006 -26064 -19871 -28180 -36492
17194 -36492 -34775 -24129 -8056 3311 -1225 5392 15425 10731 7837 3870 -7688 -12033 -26373
17181 -26373 -10810 19478 21172 -5093 -8671 3462 7497 -5907 4528 18825 5808 5719 5765
17168 5765 2674 13149 11743 -2130 -4671 -3870 -8426 -5634 -11426 -13183 -26426 -34109 -6230 -7286
17154 -7286 -11709 -22658 -30934 -23127 -10835 -3959 -21691 -24245 -18877 -8752 -29823 -27281 13478
$$ packed form
17246C06K181j8356k973J2562k873j4019j1441j5925J6849K7014J722j2998m743
17233b2694P954P461q751l4436J1874K6353J3370R26k058Q277j3971k0080M85
17220b5290j4116K0873K2281J8693r4l1238k3695j1012N37R108l695J9185L64
17207a8099J0567P654M751j5130r870l053K5700j1474j5052k058O193q309q312
17194c6492J717J0646J6073J1367m536O617J0033m694k894l967j1558m345j4340
17181b6373J5563L0288J694k6265l578J2133M035j3404J0435J4297j3017q9M6
17168E765l091J0475j406j3873k541Q01m556K792n792j757j3243p683K7879j056
17154g286m423j0949q276P807J2292O876j7732k554N368J0125k1071K542M0759
$$ plain form
17141 13478 9117 -15465 -29292 -18362 -19025 -5396 22994 30118 11457 12981 36134 20959 22116
17128 22116 23126 1749 1785 3640 -1244 -15084 -37792 -36869 -28417 -41227 -18779 -15480 -23876 -13475
17114 -13475 -11177 13870 28866 25613 16835 5951 -10094 4815 33384 19363 -8114 -3512
17102 -3512 395 -6127 -17268 -26078 -21553 -20511 -96 13295 -364 -144 6213 -1838 -10620 -26191
17088 -26191 -21034 -26411 -41760 -45056 -52507 -34526 -20023 -25713 -29915 -24257 -16561 -17932 -8444 -2334
17074 -2334 10501 12149 -17813 -42613 -16380 -3492 -14922 -24326 -22286 8851 11466 994 8627
17061 8627 19163 28617 29985 22675 29092 25789 5903 -21757 -36568 -48225 -45390 -39880 -31626
17048 -31626 -22851 -9713 6875 8723 -949 -3923 -20007 -10938 20636 26691 5821 -350 -27565
$$ packed form
17141A3478m361k4582j3827J0930o63J3629K8390P124j8661J524K3153j5175J157
17128B2116J010k1377L6J855m884j3840k2708R23Q452j2810K2448L299q396J0401
17114a3475K298K5047J4996l253q778j0884j6045J4909K8569j4021k7477M602
17102c512L907o522j1141q810M525J042K0415J3391j3659K20O357q051q782j5571
17088b6191N157n377j5349l296p451J7981J4503n690m202N658P696j371R488O110
17074b334J2835J648k9962k4800K6233J2888j1430r404K040L1137K615j0472P633
17061H627J0536R454J368p310O417l303j9886k7660j4811j1657K835N510Q254
17048c1626Q775J3138J6588J848r672k974j6084R069L1574O055k0870o171k7215
$$ plain form
17035 -27565 -20962 -4916 -16305 -26007 4652 19204 31834 28467 33011 12620 -13369 -20720 -14463
17022 -14463 2139 -4052 -18889 -12462 9148 23575 20135 9077 23011 20135 1489 -5380 -46
17009 -46 -401 -4515 -15665 -28223 -26380 -25731 -30853 -15892 -5888 -13428 -16370 -16528 -9158 -14484 -28898
16994 -28898 -39956 -45117 -41942 -40612 -22811 -14734 -3899 11143 1436 7391 25136 42436 53933
16981 53933 53168 27763 15672 14348 -3555 -6727 -19534 -27916 -47976 -60389 -36959 -18376 -5960
16968 -5960 -12292 -15269 -17027 -11047 -25547 -31628 -30110 -24849 -11614 6375 18369 20080 28962 33367
16954 33367 12848 5685 19391 17656 19056 -9410 -20449 -23942 -2155 11049 17177 18907 -13049
16941 -13049 -14941 1459 23532 20050 -1466 -11650 0 -7165 -21547 -20247 -28360 -24295 -23939
$$ packed form
17035b7565O603J6046j1389r702L0659J4552J2630l367M544k0391k5989p351O257
17022a4463J6602o191j4837O427K1610J4427l440j1058J3934k876j8646o869N334
17009d6l55m114j1150j2558J843O49n122J4961J0004p540k942j58P370n326j4414
16994b8898j1058n161L175J330J7801Q077J0835J5042r707N955J7745J7300J1497
16981E3933p65k5405j2091j324j7903l172j2807q382k0060j2413K3430J8583J2416
16968e960o332k977j758N980j4500o081J518N261J3235J7989J1994J711Q882M405
16954C3367k0519p163J3706j735J400k8466j1039l493K1787J3204O128J730l1956
16941a3049j892J6400K2073l482k1516j0184J1650p165j4382J300q113M065L56
$$ plain form
16928 -23939 -21076 2137 5650 -5524 -16223 -18484 -19440 -5296 -7547 -140 2321 -11301 -25726
16915 -25726 -34702 -40666 -44170 -46323 -36683 -27481 -26401 -14110 -24408 -27745 -12995 -12816 -8702 -3224
16901 -3224 -7153 -17766 -18945 -24254 -36463 -29472 -9063 -21449 -19119 -13285 -23435 -18951 -16347
16888 -16347 -13605 -36624 -55015 -36064 -3786 20628 47942 59621 65161 62204 67564 68142 55258
16875 55258 34506 20182 13142 21934 36242 31009 8781 -10096 3256 -1043 -1316 4635 -15807
16862 -15807 -20375 -5742 -16647 -28732 -23678 -22538 -9531 -16892 -21619 -21618 -17971 -4425 -5551 -2209
16848 -2209 6959 573 21814 35835 19437 -15088 -18010 -19225 -21423 2880 13753 7382 3332
16835 3332 -1110 16603 17619 2860 -13707 -10209 9691 5041 711 5725 -666 -779 8768 3550
$$ packed form
16928b3939K863K3213L513j1174j0699k261r56J4144k251P407K461j3622j4425
16915b5726q976n964l504k153R640R202J080J2291j0298l337J4750J79M114N478
16901c224l929j0613j179n309j2209O991K0409j2386K330N834j0150M484K604
16888a6347K742k3019j8391J8951L2278K4414K7314J1679N540k957N360N78j2884
16875E5258k0752j4324p040Q792J4308n233k2228j8877J3352m299k73N951k0442
16862a5807m568J4633j0905j2085N054J140J3007p361m727JL647J3546j126L342
16848b209R168o386K1241J4021j6398l4525k922j215k198K4303J0873o371m050
16835C332m442J7713J016j4759j6567L498J9900m650m330N014o391j13R547n218
$$ plain form
16821 3550 5440 17542 24266 35100 21820 4550 5876 -12576 -20634 -15457 -32344 -35439 -34522
16808 -34522 -33180 -36906 -22049 -13366 -9747 -19399 -28417 -20347 -12468 -8783 -19121 -24223 -23054 -26617
16794 -26617 -23878 -25691 -27800 -12606 -5155 -22600 -25453 -6137 -17515 -14019 -16008 -30229 -19477
16781 -19477 -16252 -32457 -29604 -26526 -18601 -15109 -10130 -13874 3085 2187 4785 -22429 -51073 -44982
16767 -44982 -6537 6103 -1466 -31074 -29441 -15964 -20935 -17218 -22628 -12173 15988 19865 17607
16754 17607 2210 -5986 -20418 -17833 -6563 -15974 -31191 -12202 -6442 1245 8879 13653 -3503
16741 -3503 -13561 -26875 -36363 -46811 -57663 -51764 -23028 -41026 -36045 -14398 5891 14370 -13987
16728 -13987 -34223 -8593 -3385 -17862 -25130 -55560 -33645 5175 28743 13302 38777 58619
$$ packed form
16821C550J890J2102O724J0834j3280j7270J326j8452q058N177j6887l095R17
16808c4522J342l726J4857Q683L619r652r018Q070P879L685j0338n102J169l563
16794b6617K739j813k109J5194P451j7445k853J9316j1378L496j989j4221J0752
16781a9477L225j6205K853L078P925L492M979l744J6959q98K598k7214k8644O091
16767d4982L8445J2640p569k9608J633J3477m971L717n410J0455K8161L877k258
16754A7607j5397q196j4432K585J1270r411j5217J8989N760P687P634M774j7156
16741c503j0058j3314r488j0448j0852N899K8736j7998M981K1647K0289Q479k8357
16728a3987k0236K5630N208j4477p268l0430K1915L8820K3568j5441K5475J9842
$$ plain form
16716 58619 38185 18409 -8127 -17924 -20400 -37408 -30011 -33762 -21739 2611 208 -13145 -18834
16703 -18834 2343 6565 -3282 1457 -24466 -38562 -26484 -25348 -22331 -1119 -3504 -5817 1424
16690 1424 6704 6225 -9894 -26014 -30082 -3233 -8299 -11201 -5237 -18367 -26623 -35072 -33949 -17590
16676 -17590 -18203 -24402 -12734 -1309 6814 -4041 -3036 -1732 -14155 -18828 -12420 5087 9706
16663 9706 15499 21475 16706 33598 36066 5018 -24727 -28455 -12722 -25424 -28353 1 22107
16650 22107 16862 4437 9031 -6714 -24989 -32594 -35322 -29752 -6623 -198 675 12007 8111
16637 8111 14827 -6864 -23237 -16851 -30131 -31392 -32227 -25778 -20968 -34312 -26594 -21177 -10971 8446
16623 8446 22819 15234 5002 -5106 11941 21463 3312 -2731 -4727 -2198 29854 21665 2424
$$ packed form
16716E8619k0434j9776k6536r797k476j7008P397l751J2023K4350k403j3353n689
16703a8834K1177M222r847M739k5923j4096J2078J136L017K1212k385k313P241
16690A424N280m79j6119j6120m068K6849n066k902N964j3130q256q449J123J6359
16676a7590o13o199J1668J1425Q123j0855J005J304j2423m673O408J7507M619
16663I706N793N976m769J6892K468l1048k9745l728J5733j2702k929K8354K2106
16650B2107n245j2425M594j5745j8275p605k728N570K3129O425Q73J1332l896
16637H111O716k1691j6373O386j3280j261q35O449M810j3344P718N417J0206J9417
16623H446J4373p585j0232j0108J7047R522j8151o043j996K529L2052q189j9241
$$ plain form
16610 2424 -7468 -17620 -9849 5272 5158 -1526 16599 12082 6454 -27347 -39290 -4776 6892
16597 6892 -9873 -12054 -7614 -9934 -12246 -30247 -52775 -35935 -2484 12820 7430 10090 1306
16584 1306 -1621 -4021 -34659 -48054 -29472 -15742 6626 8298 7980 6760 -6907 -11088 -22240
16571 -22240 -34379 -41992 -30892 -18683 -10197 -12235 -9146 -8768 -26036 -19679 -14881 -33902 -34348 -25457
16557 -25457 7004 21914 21893 -305 -4320 -22696 -32157 -28327 -27051 -19723 -1007 1298 -12631
16544 -12631 -13380 5617 -6039 -14516 -10409 25172 29794 -15645 -30452 -37266 -61887 -56484 -41759
16531 -41759 -32251 -9672 -15913 -43398 -38472 -19266 -2320 7345 -11396 -10356 -2899 -7903 -20195
16518 -20195 -17593 -36961 -39717 -32569 -6982 -20055 -43171 -44505 -24595 -17481 -23127 -16581 -26107
$$ packed form
16610B424r892j0152P771J5121j14o684J8125m517n628l3801j1943L4514J1668
16597F892j6765k181M440k320k312j8001k2528J6840L3451J5304n390K660q784
16584A306k927k400l0638j3395J8582J3730K2368J672l18j220j3667m181j1152
16571b2240j2139p613J1100J2209Q486k038L089L78j7268O357M798j9021m46Q891
16557b5457L2461J4910k1k2198m015j8376r461L830J276P328J8716K305j3929
16544a2631p49J8997j1656q477M107L5581M622m5439j4807o814k4621N403J4725
16531d1759R508K2579o241k7485M926J9206J6946R665j8741J040P457n004j2292
16518b0195K602j9368k756P148K5587j3073k3116j334J9910P114n646O546r526
$$ plain form
16505 -26107 -38540 -26809 -750 -14710 -10621 11559 -3774 -28756 -16860 -2189 -6446 -14960
16493 -14960 -5973 1742 -789 3686 3167 -4301 6555 13109 22695 29748 6491 14677 12643 4186
16479 4186 9144 10972 -3834 -19476 -19494 -25454 -27826 -30485 -45588 -37659 -34313 -51709 -53469 -45379
16465 -45379 -34051 -20520 -24732 -32825 -11964 1074 10348 -7886 -38723 -22990 -3492 -910
16453 -910 -6832 -23249 -37432 -46566 -52045 -42998 -34319 -21324 -3165 730 9574 7060 -4880 -4883
16439 -4883 27917 44217 27067 15849 27721 20920 11839 2520 -6087 -4721 -7502 -15872 -6134
16426 -6134 15820 24835 7179 -7843 -3603 14234 25499 2480 -24359 -60381 -50418 -21769
16414 -21769 -17665 -29081 -15771 -11637 -18232 -32941 -16903 -3596 -20070 -26223 -18987 -11745 17735
$$ packed form
16505b6107j2433J1731K6059j3960M089K2180j5333k4982J1896J4671m257q514
16493a4960Q987P715k531M475n19p468J0856O554R586P053k3257Q186k034q457
16479D186M958J828j4806j5642j8n960k372k659j5103P929L346j7396j760Q090
16465d5379J1328J3531m212q093K0861J3038R274j8234l0837J5733J9498K582
16453i10n922j6417j4183r134n479R047Q679J2995J8159L895Q844k514j1940l
16439d883L2800J6300j7150j1218J1872o801r081r319q607J366k781q370R738
16426f134K1954R015j7656j5022M240J7837J1265k3019k6839l6022R963K8649
16414b1769M104j1416J3310M134o595j4709J6038J3307j6474o153P236P242K9480
$$ plain form
16401 17735 31129 38797 44689 36923 26426 12675 -6597 -32096 -45571 -37743 -33238 -26246 -20793
16388 -20793 -10279 -11160 -15002 -11810 6002 5005 -18803 -34750 -30760 5561 -1753 -19763 -41227
16375 -41227 -38391 -24650 -31241 -40890 -10652 23140 28530 27656 -5482 -22473 -17214 -9293 11972
16362 11972 14622 -8449 -5017 5094 -11047 -8195 -2426 21719 32172 10578 -12305 -15808 -38375
16349 -38375 -37349 -25821 -18717 -18512 -33771 -31226 -23632 -24620 -19660 -35214 -28197 -13966 -3662 -13984
16335 -13984 -32441 -33529 -30782 -34412 -27256 -21506 -4753 -38469 -59866 -32954 -267 -170 -15589
16322 -15589 -30703 -25389 -12234 -32332 -41141 -33805 -24899 -40361 -43123 -35986 -31599 -8000 -6924
16309 -6924 7912 1858 -15550 -15784 -22944 -1668 6338 -5609 9502 8391 -10557 -15926 -15779 -26410
$$ packed form
16401A7735J3394P668N892p766j0497j3751j9272k5499j3475P828M505O992N453
16388b0793J0514q81l842L192J7812r97k3808j5947L990L6321p314j8010k1464
16375d1227K836J3741o591r649L0238L3792N390q74l3138j6991N259P921K1265
16362A1972K650k3071L432J0111j6141K852N769K4145J0453k1594k2883l503k2567
16349c8375J026J1528P104K05j5259K545P594r88M960j5554P017J4231J0304j0322
16335a3984j8457j088K747l630P156N750J6753l3716k1397K6912L2687R7j5419
16322a5589j5114N314J3155k0098q809P336Q906j5462k762P137M387K3599J076
16309f924J4836o054j7408k34p160K1276Q006j1947J5111j111j8948n369J47j0631
$$ plain form
16295 -26410 -39922 -19322 -10531 2940 3576 2350 -2363 -6647 -15950 -20050 -28227 -23010 -29662 -15386
16281 -15386 -4622 -6089 683 -15103 -16103 -19112 -22211 -22673 -13188 -527 9131 4463 6651 -4708
16267 -4708 507 -12176 -8443 23660 24254 11659 9277 -18103 -37386 -49567 -30087 -33397 -44370
16254 -44370 -25193 -5290 -2094 3926 -5497 -22228 -13787 4290 12273 4266 -94 -10779 -19900
16241 -19900 -16974 -34007 -19754 -25103 -35448 -34237 -33414 -39387 -26950 -18979 -9691 -1326 28715
16228 28715 39022 12566 2399 8340 14412 37970 36799 16752 6176 -9727 1979 672
16216 672 -3692 -4637 -19605 1761 -333 -15674 -10915 -9612 -4989 -4842 6475 -3445 -17017 -15482
16202 -15482 -9622 -10238 -12590 11732 21533 24995 11201 6904 -5781 -36667 -41479 -29889 3693
$$ packed form
16295b6410j3512K0600Q791J3471O36j226m713m284r303m100q177N217o652J4276
16281a5386J0764j467O772j5786j000l009l099m62R485J2661R658m668K188j1359
16267d708N215j2683L733L2103N94j2595k382k7380j9283j2181J9480l310j0973
16254d4370J9177J9903L196O020r423j6731Q441J8077P983q007m360j0685r121
16241a9900K926j7033J4253n349j0345J211Q23n973J2437P971R288Q365L0041
16228B8715J0307k6456j0167N941O072K3558j171k0047j0576j5903J1706j307
16216F72m364r45j4968K1366k094j5341M759J303M623J47J1317r920j3572J535
16202a5482N860o16k352K4322R801L462j3794m297j2685l0886m812J1590L3582
$$ plain form
16189 3693 26786 11578 -6258 -544 5340 2795 -607 -9857 -32194 -28398 -25471 -33913 -33990 -24000
16175 -24000 -18917 -9870 -33727 -40102 -9560 3257 13709 6979 7196 11752 26794 18270 4383
16162 4383 4634 22060 13978 15017 24632 5162 -4080 -2604 5058 15018 33386 18274 5522 5377
16148 5377 17027 7947 -12838 -25000 -28639 -28595 6488 10242 9870 16322 16058 -1196 -5840 -23647
16134 -23647 -30274 -35704 -31319 -45447 -30569 14991 11619 -20195 -19089 -15175 -30353 -43980 -40965
16121 -40965 -32560 -28447 -22565 -31916 -48872 -55400 -26253 -5365 6762 15582 13244 -10133 -21387
16108 -21387 -3704 11534 -14489 -23404 -12707 5984 -10605 -13664 -14525 -13188 -15520 -39606 -43131
16095 -43131 -37286 -32080 -20926 11944 28805 -1737 -12484 10626 7750 17974 24097 7003
$$ packed form
16189C693K3093j5208j7836N714N884k545l402r250k2337L796K927q442p7R990
16175b4000N083R047k3857o375L0542J2817J0452o730K17M556J5042q524j3887
16162D383K51J7426q082J039R615j9470r242J476P662R960J8368j5112j2752j45
16148E377J1650r080k0785j2162l639M4L5083L754l72O452k64j7254m644j7807
16134b3647o627n430M385j4128J4878M5560l372l1814J106L914j5178j3627L015
16121d0965Q405M113N882r351j6956o528K9147K0888J2127Q820k338k3377j1254
16108b1387J7683J5238k6023q915J0697J8691j6589l059q61J337k332k4086l525
16095d3131N845N206J1154L2870J6861l0542j0747K3110k876J0224O123j7094
$$ plain form
16083 7003 -5420 7755 37967 58501 46011 19259 -9906 -28617 -37297 -35198 -17825 5813
16071 5813 -730 -18751 -5937 3333 -146 -17645 -32034 -34963 -27313 -24553 -20584 -14288 -9588 -312
16057 -312 14377 1094 -8181 -23484 -32228 -22820 -15967 -12114 -13836 -4451 -17333 -12515 -21440 -17275
16043 -17275 -8973 -21708 -22257 -17636 -32345 -29284 -5480 20467 23376 7268 -3970 330 11104
16030 11104 8821 -14213 1302 3389 11939 13517 -2703 987 -4702 -1715 -5349 -9922 -19974
16017 -19974 -30886 -15009 1763 11749 -4013 -12319 -8686 15070 11080 -5465 -22425 -21081 -36610
16004 -36610 -41648 -23510 -12178 -4705 13880 12313 6350 -3570 -10841 2468 2135 3693 -1554 8686
15990 8686 15997 20646 12718 -1180 -18347 -26148 -24734 -17630 -26991 -26213 -11257 7253 21760 14569
$$ packed form
16083G003j2423J3175L0212K0534j2490k6752k9165j8711q680K099J7373K3638
16071E813o543j8021J2814R270l479j7499j4389k929P650K760L969O296M700R276
16057c12J4689j3283r275j5303q744R408O853L853j722R385j2882M818q925M165
16043a7275Q302j2735n49M621j4709L061K3804K5947K909j6108j1238M300J0774
16030A1104k283k3034J5515K087Q550J578j6220L690n689K987l634m573j0052
16017a9974j0912J5877J6772R986j5762q306L633K3756l990j6545j6960J344j5529
16004c6610n038J8138J1332P473J8585j567n963r920p271J3309l33J558n247J0240
15990H686P311M649p928j3898j7167p801J414P104r361P78J4956J8510J4507p191
$$ plain form
15976 14569 -9490 -30409 -42923 -32071 -16628 -7365 991 2539 -6813 -34806 -31442 -29317 -35715
15963 -35715 -29701 -14925 -8326 -17242 -20532 -22348 -25585 -6375 13931 -7128 -31861 -20434 -16450
15950 -16450 -23144 -28278 -22868 -6244 -8467 -8186 -3874 3014 -10426 -34679 -39784 -22042 -24896 -26301
15936 -26301 -2902 2315 8388 3256 2316 21912 19500 -5458 -21042 -14113 -21376 -29353 -21041 -11208
15922 -11208 9287 14027 7990 -16902 -24656 -12927 -175 10966 14061 12120 7508 7891 678
15909 678 2598 17622 13135 -1047 -28201 -18759 -10139 -8266 -5128 -20476 -29349 -18914 -8356
15896 -8356 -11296 -34370 -53052 -49901 -31798 5404 27198 15155 29721 33896 9071 533 -4882
15883 -4882 -4591 -4237 -10154 -8707 3130 28739 45004 34853 11530 14277 15856 16092 31274 35199
$$ packed form
15976A4569k4059k0919j2514J0852J5443R263Q356J548r352k7993L364K125o398
15963c5715O014J4776O599q916l290j816l237J9210K0306k1059k4733J1427L984
15950a6450o694n134N410J6624k223K81M312O888j3440k4253n105J7742k854j405
15936b6301K3399N217O073n132r40J9596k412k4958j5584O929p263p977Q312R833
15922a1208K0495M740o037k4892p754J1729J2752J1141L095j941m612L83p213
15909F78J920J5024m487j4182k7154R442Q620J873L138j5348q873J0435J0558
15896h356k940k3074j8682L151J8103L7202K1794j2043J4566M175k4825q538n415
15883d882K91L54n917J447J1837K5609J6265j0151k3323K747J579K36J5182L925
$$ plain form
15869 35199 8309 -20769 -23383 -23589 -18098 -904 -7740 -19680 -51435 -49696 -28428 -6066 16794
15856 16794 43804 51253 53497 46338 11059 -15864 -25325 -11591 1583 7649 15276 -3641 -8780
15843 -8780 -30475 -51190 -30282 -11351 -12804 -12541 -23280 -24355 -31107 -18036 -12042 12959 16331
15830 16331 17335 1222 -8301 -2823 7382 2750 -8678 -8837 1165 11263 -13421 -22549 -19757
15817 -19757 -16102 -5276 6657 15775 15976 14705 -1536 -26956 -38100 -56483 -37416 -15001 -15021
15804 -15021 -11301 -21841 -17807 2544 20992 36693 53073 47556 36700 13170 654 18179
15792 18179 24410 11902 7859 5055 7029 -12053 -18844 -18353 -13758 -26681 -21808 -27989 -49068 -62833
15778 -62833 -52662 -44584 -22582 -10289 -7132 -16070 -28855 -9321 7132 18429 2039 -18278
$$ packed form
15869C5199k6890k9078k614k06N491J7194o836j1940l1755J739K1268K2362K2860
15856A6794K7010P449K244p159l5279k6923r461J3734J3174O066P627j8917n139
15843h780k1695k0715K0908J8931j453K63j0739j075o752J3071N994K5001L372
15830A6331J004j6113r523N478J0205m632j1428j59J0002J0098k4684r128K792
15817a9757L655J0826J1933R118K01j271j6241k5420j1144j8383J9067K2415k0
15804a5021L720j0540M034K0351J8448J5701J6380n517j0856k3530j2516J7525
15792A8179O231j2508m043k804J974j9082o791M91M595j2923M873o181k1079j3765
15778f2833J0171Q078K2002J2293L157q938j2785J9534J6453J1297j6390k0317
$$ plain form
15766 -18278 3627 -2353 -13382 7333 21091 -4201 -16144 -12802 5956 -2912 -16173 -26877
15754 -26877 -7687 15082 15311 3790 -9361 -17763 -6153 7468 2011 3881 19703 23697 14956
15741 14956 12445 -8834 -21057 -39646 -31187 -23512 -33239 -7246 21103 31117 5704 -19031
15729 -19031 -9795 18909 23392 -2771 -11570 -7472 -14575 -31715 -35793 -18798 -10311 -14068 -10216
15716 -10216 -9537 -15589 -3669 7430 -9031 -21280 -2573 16238 19471 41378 28360 10381
15704 10381 11930 9681 10277 3903 -24131 -34641 -21413 -28268 -17240 -3823 -6527 4247 -11555
15691 -11555 -26393 -11103 -7988 -22331 -32226 -60190 -72642 -52830 -13891 -27360 -32257 -8564
15679 -8564 -7529 -25546 -30616 -38694 -31583 -22311 -5413 -10309 -2906 -5226 -12595 9292 19392 11936
$$ packed form
15766a8278K1905n980j1029K0715J3758k5292j1943L342J8758q868j3261j0704
15754b6877J9190K2769K29j1521j3151q402J1610J3621n457J870J5822L994q741
15741A4956k511k1279j2223j8589Q459P675r727K5993K8349J0014k5413k4735
15729a9031R236K8704M483k6163q799M098p103j7140m078J6995Q487l757L852
15716a0216O79o052J1920J1099j6461j2249J8707J8811L233K1907j3018j7979
15704A0381J549k249N96o374k8034j0510J3228o855J1028J3417k704J0774j5802
15691a1555j4838J5290L115j4343r895k7964j2452J9812L8939j3469m897K3693
15679h564J035j8017n070q078P111R272J6898m896P403k320p369K1887J0100p456
$$ plain form
15665 11936 -14774 -42250 -27775 -16 1093 4216 9874 16390 18767 32603 20776 -16910 -28602
15652 -28602 -20470 3658 2984 12567 38305 50841 24862 9065 11190 -8376 4788 21499 955
15639 955 -23329 -18799 1702 6190 -15719 -23516 -16047 -15046 -5164 -10118 -24579 -18947 -8877 -6069
15625 -6069 4469 18485 22017 11330 -10363 -13126 -13970 -2329 2612 -9027 11413 22729 7899
15612 7899 12477 24372 3327 3565 -6488 12584 6029 9055 18584 -3051 -957 -8002 -3152 4619
15598 4619 5298 -1074 11236 21542 -4328 -14476 -32340 -47099 -53272 -64380 -49651 -35957 -42621
15585 -42621 -45577 -14809 -6751 -7526 2255 22865 27306 -762 -28444 -35338 -29634 -30669 -36350 -15638
15571 -15638 -11983 -18473 -25811 -26381 -26116 -32300 -22597 -31629 -47088 -43520 -35451 -29207 -23793 -20852 -19841
$$ packed form
15665A1936k6710k7476J4475K7759J109L123N658O516K377J3836j1827l7686j1692
15652b8602Q132K4128o74R583K5738J2536k5979j5797K125j9566J3164J6711k0544
15639I55k4284M530K0501M488k1909p797P469J001R882m954j4461N632J0070K808
15625f069J0538J4016L532j0687k1693k763q44J1641M941j1639K0440J1316j4830
15612G899M578J1895k1045K38j0053J9072o555L026R529k1635K094p045M850P771
15598D619O79o372J2310J0306k5870j0148j7864j4759o173j1108J4729J3694o664
15585d2621k956L0768Q058p75R781K0610M441k8068k7682o894N704j035n681K0712
15571a5638L655o490p338n70K65o184R703r032j5459L568Q069O244N414K941J011
$$ plain form
15556 -19841 -20981 -13986 -3878 -8634 -13873 -17005 2685 3418 3315 1160 -4545 244 13299 5189
15542 5189 3029 -20757 -50327 -37375 -12911 -7767 -10996 7426 20595 11439 -22138 -27982 -25165
15529 -25165 -22172 -22296 -19069 -13571 -25706 -30112 -12059 2305 -1284 9694 7031 -11800 -23340
15516 -23340 -9027 11599 -351 -8333 -10121 -21029 -35768 -10983 -13425 7798 8299 6157 -3977
15503 -3977 -10542 177 867 -20078 -15423 8913 33738 58400 60557 54808 46825 30395 -308
15490 -308 4069 12836 15106 10552 8639 328 -1823 -3234 -4328 -1892 -4628 -18172 -29564 -34429
15476 -34429 -11064 10622 -5123 -18280 -20909 -25605 -14187 -5468 -23577 -38716 -41562 -27135
15464 -27135 -30852 -29467 -13423 -18803 -35109 -47419 -43507 -33643 -23602 -11366 2680 13750 6336
$$ packed form
15556a9841j140O995J0108m756n239l132J9690P33j03k155n705M789J3055q110
15542E189k160k3786k9570J2952K4464N144l229J8422J3169r156l3577n844K817
15529b5165K993j24L227N498j2135m406J8053J4364l589J0978k663j8831j1540
15516b3340J4313K0626j1950p982j788j0908j4739K4785k442K1223N01k142j0134
15503c977o565J0719O90k0945M655K4336K4825K4662K157n749p983j6430l0703
15490c08M377Q767K270m554j913q311k151j411j094K436k736j3544j1392m865
15476c4429K3365K1686j5745j3157k629m696J1418Q719j8109j5139k846J4427
15464b7135l717J385J6044n380j6306j2310L912R864J0041J2236J4046J1070p414
$$ plain form
15451 6336 1512 -17729 -29950 -30056 -20373 -6466 -11523 1221 11876 1059 -4418 -15047 -20833
15438 -20833 -15515 -6690 -7304 -16007 -5260 3999 -591 -12542 -14414 -20634 -22173 -14888 -369 -229
15424 -229 14322 1373 -11820 -25757 -28482 -35557 -16899 3765 1592 7263 -6478 -34984 -33870
15411 -33870 -17198 -2156 -14248 -22014 -17147 -12270 1394 -9828 -24529 -46837 -49671 -32980
15399 -32980 -26135 -24421 -8464 1695 -31 -20562 -29538 -25187 -13136 -10368 -23463 -41873 -32338
15386 -32338 -23788 -24577 -28720 -23599 -9976 -12677 -6929 6178 -188 -21585 -25678 -9660 4697
15373 4697 11447 5928 -5674 -32620 -33296 -34662 -28285 -26455 -23372 -11765 -13633 -15922 -2969 10994
15359 10994 6722 10139 3280 -6912 -35082 -35496 -13975 -20786 -36539 -30417 -12741 -4123 -20374
$$ packed form
15451F336m824j9241j2221j06R683J3907n057J2744J0655j0817n477j0629n786
15438b0833N318Q825o14q703J0747R259m590j1951j872o220j539P285J4519J40
15424b29J4551j2949j3193j3937k725p075J8658K0664k173N671j3741k8506J114
15411c3870J6672J5042j2092p766M867M877J3664j1222j4701k2308k834J6691
15399c2980O845J714J5957J0159j726k0531q976M351J2051K768j3095j8410R535
15386c2338Q550p89m143N121J3623k701N748J3107o366k1397m093J6018J4357
15373D697O750n519j1602k6946o76j366O377J830L083J1607j868k289J2953J3963
15359A0994m272L417o859j0192k8170m14K1521o811j5753O122J7676Q618j6251
$$ plain form
15346 -20374 -11198 14226 34020 10173 -11832 -29726 -21295 -11024 -9343 -13253 -17003 -2142 7524
15333 7524 17053 15054 2775 2078 -6057 -11907 -9133 -6510 -33431 -35055 -21011 -3365 9359 -5916
15319 -5916 -20349 -35754 -47426 -51945 -42808 -21530 -11766 -16405 -15819 -29956 -28191 -12844 -17384
15306 -17384 -21770 -13604 -14693 -11060 -5386 -13384 -22359 -17014 -29092 -32586 -13703 -12347 -16439 -10720
15292 -10720 7319 -2149 -9822 -13940 -997 80 -28334 -50839 -29257 -11847 -17058 -21634 -24960
15279 -24960 -21145 -31663 -30420 -16984 8293 27660 11843 -299 -10636 5675 12616 -2363
15267 -2363 13792 1993 -13317 -14215 -5306 -4026 26027 26614 1949 -12798 -19757 -15047 -208
15254 -208 2013 -17051 -21140 -24188 -10247 6965 -7984 -17838 -23374 -24579 -13937 -10114 1952
$$ packed form
15346b0374R176K5424J9794k3847k2005j7894Q431J0271J681l910l750J4861R666
15333G524R529j999j2279o97q135n850K774K623k6921j624J4044J7646J2724j5275
15319e916j4433j5405j1672m519R137K1278R764m639N86j4137J765J5347m540
15306a7384m386Q166j089L633N674p998q975N345j2078l494J8883J356m092N719
15292a0720J8039r468p673m118J2943J077k8414k2505K1582J7410n211m576l326
15279b4960L815j0518J243J3436K5277J9367j5817j2142j0337J6311O941j4979
15267b363J6155j1799j5310q98Q909J280L0053N87k4665j4747o959M710J4839
15254b08K221j9064m089l048J3941J7212j4949r854n536j205J0642L823J2066
$$ plain form
15241 1952 -4891 18527 2113 -7234 -7105 -25514 -13125 810 22202 28484 14081 1261 -1315
15228 -1315 1449 -12670 -5303 921 4983 10759 998 -17312 -54881 -55121 -36822 -3181 21250
15215 21250 26496 12311 12212 -2543 -7070 -4423 92 -2818 6295 38404 37040 39352 39531 16332
15201 16332 9783 -16418 -19861 -7305 -3386 15029 22032 -960 -8745 2077 2922 -4673 -1692
15188 -1692 8171 -6524 822 22959 26381 17141 28991 12647 8632 21736 35789 42478 20871
15175 20871 1363 -1862 -6030 1970 -19398 -42556 -34834 -9494 7677 868 6940 -4537 -4502
15162 -4502 -28007 -14773 -4194 8653 -3821 -11179 299 -1293 -14202 -20535 -35662 -15500
15150 -15500 7215 768 -12173 -12076 -30935 -41679 -35058 -13213 -5894 -17485 969 -2713 3366
$$ packed form
15241A952o843K3418j6414r347J29j8409J2389J3935K1392O282j4403j2820k576
15228a315K764j4119P367O224M062N776r761j8310l7569k40J8299L3641K4431
15215B1250N246j4185r9j4755m527K647M515k910R113L2109j364K312J79k3199
15201A6332o549k6201l443J2556L919J8415P003k2992p785J0822Q45p595K981
15188a692R863j4695P346K2137L422r240J1850j6344m015J3104J4053O689k1607
15175B0871j9508l225m168Q000k1368k3158P722K5340J7171o809O072j1477L5
15162d502k3505J3234J0579J2847j2474p358J1478j592j2909o333j5127K0162
15150a5500K2715o447j2941R7j8859j0744O621K1845P319j1591J8454l682O079
$$ plain form
15137 3366 -12026 -25421 -7656 -3718 12049 7095 -20757 -15628 907 -8377 -38134 -24870 -30698
15124 -30698 -9572 -3825 -4234 -11374 -3982 -17299 -24147 -35337 -36794 -17913 -15932 -15091 -15357 -18712
15110 -18712 -25398 -14367 -9251 2538 15008 12605 9811 10717 8244 10444 -1628 -4491 -5292 222
15096 222 9833 23870 48986 60538 41780 -2031 -15118 -23606 -20837 9587 26889 25881 3251
15083 3251 -25488 -28501 -11789 -20382 -40313 -28935 -20515 -8751 -9100 7454 6038 5744 15789
15070 15789 -5848 -39128 -44852 -37423 -22231 -5035 -6497 -13721 -17836 -3206 28824 48373 29853
15057 29853 11208 -4494 -21941 -1512 20883 21806 32848 44368 29173 17268 11262 27945
15045 27945 26155 21074 41357 46767 40187 35851 27128 7671 2053 -12327 -11836 8983 13616 15836
$$ packed form
15137C366j5392j3395J7765L938J5767m954k7852N129J6535r284k9757J3264n828
15124c0698K1126N747m09p140P392j3317o848j1190j457J8881J981Q41k66l355
15110a8712o686J1031N116J1789J2470k403k794R06k473K200j2072k863q01N514
15096B22R611J4037K5116J1552j8758m3811j3087q488K769L0424J7302j008k2630
15083C251k8739l013J6712q593j9931J1378Q420J1764l49J6554j416k94J0045
15070A5789k1637l3280n724P429J5192J7196j462p224m115J4630L2030J9549j8520
15057B9853j8645j5702j7447K0429K2395R23J1042J1520j5195j1905o006J6683
15045B7945j790n081K0283N410o580m336q723j9457n618j4380M91K0819M633K220
$$ plain form
15031 15836 29487 3563 -3712 124 -11118 -3664 9071 -3926 19016 37615 27276 25657
15019 25657 22211 11562 31470 48775 23396 7620 6024 -10274 -4192 30753 81930 134628
15007 134628 171008 233199 357646 517460 672695 863907 1038436 828597 476005 288152
14997 288152 201888 165121 125308 103226 131902 126970 85869 58457 46731 49104 27052 16066
14985 16066 15678 18618 6511 11073 6538 26181 34422 37414 42030 57716 54442 39248 30387 37257
14971 37257 39027 43910 20538 2856 23687 39600 24146 27416 42237 47520 20168 -11941
14959 -11941 -8929 -11068 -16206 -23011 -17761 -19337 -24784 -16581 -2930 -45 20102 34662 43262 18391
14945 18391 6991 -1385 13551 32656 23894 24548 17308 15004 11421 8867 16531 15696 2753 9934
$$ packed form
15031A5836J3651k5924p275L836j1242P454J2735j2997K2942J8599j0339j619
15019B5657l446j0649J9908J7305k5379j5776j596j6298O082L4945N1177N2698
15007A34628L6380O2191J24447J59814J55235J91212J74529k09839l52592j87853
14997B88152q6264l6767l9813k2082K8676m932m1101k7412j1726K373k2052j0986
14985A6066l88K940j2107M562m535J9643Q241K992M616J5686l274j5194q861O870
14971C7257J770M883k3372j7682K0831J5913j5454L270J4821N283k7352l2109
14959a1941L012k139n138o805N250j576n447Q203J3651K885K0147J4560Q600k4871
14945A8391j1400q376J4936J9105q762O54p240k304l583k554P664q35j2943P181
$$ plain form
14931 9934 6822 22145 38801 29339 30179 35853 28964 12436 6033 19055 6465 12232 25509
14918 25509 24689 16908 3440 120 -13357 -11774 -5414 -9480 -1112 -5529 -16352 -21442 -16294 12365
14904 12365 25557 27216 1498 1712 -6204 -11642 902 -14574 -32058 -28969 3736 32538 29796
14891 29796 15693 3203 207 -3405 -11668 2003 2815 -7331 -2113 8786 23280 17367 12319
14878 12319 -8857 -25115 -23865 -3158 -1504 -22474 -35076 -17762 -22719 -18578 -13430 -24755 -17417
14865 -17417 18343 31178 30390 22085 19641 10448 -2742 -13244 -4978 -1122 -8267 8874 556
14852 556 1114 8840 11145 15378 28438 11416 35 -6087 27385 23845 -8968 -2454 2862 -23601
14838 -23601 -17481 6097 15263 2823 -3988 1170 10426 3529 -19331 -5503 -5997 5981 -7755
$$ packed form
14931I934l112J5323J6656r462Q40N674o889j6528o403J3022j2590N767J3277
14918B5509q20p781j3468l320j3477J583O360m066Q368m417j0823n090N148K8659
14904A2365J3192J659k5718K14p916n438J2544j5476j7484L089L2705K8802k742
14891B9796j4103j2490k996l612q263J3671Q12j0146N218J0899J4494n913n048
14878A2319k1176j6258J250K0707J654k0970j2602J7314m957M141N148j1325P338
14865a7417L5760J2835p88q305k444r193j3190j0502Q266L856p145J7141q318
14852E56N58P726K305M233J3060j7022j1381o122L3472l540l2813O514N316k6463
14838b3601O120K3578R166j2440o811N158R256o897k2860J3828m94J1978j3736
$$ plain form
14825 -7755 -14085 -12997 -4819 -4774 13728 -5315 -6929 -9085 -23087 -23609 -21060 -17431 -23542 -15503 -17614
14810 -17614 -36770 -35999 -26201 -29042 -21137 4396 16372 13322 16738 1313 -30487 -45234 -50098
14797 -50098 -44112 -29928 -27871 -16644 -10432 -6101 21914 42130 17381 14841 13859 -1930 -418
14784 -418 3478 4919 -3366 -30212 -26822 -16162 -24745 -33475 -18222 -422 356 14449 -10874 -10433
14770 -10433 -66 10932 25719 24032 803 -17049 13974 22324 -345 25665 48996 21790
14758 21790 11467 10818 6508 -2230 -13095 -3685 -1705 10830 16280 -4005 -11306 -284 367 -5215
14744 -5215 -11131 -4726 -27726 -14921 -5980 5767 21115 35272 1629 -9922 12119 25885
14732 25885 39656 20106 -1491 16688 33828 32505 41761 26100 1482 1409 -12924 4576 31555
$$ packed form
14825g755o330J088Q178M5J8502j9043j614k156j4002n22K549L629o111Q039k111
14810a7614j9156P71R798k841P905K5533J1976l050L416j5425l1800j4747m864
14797e0098N986J4184K057J1227O212M331K8015K0216k4749k540r82j5789J512
14784d18L896J441q285k6846L390J0660q583q730J5253J7800P78J4093k5323M41
14770a0433J0367J0998J4787j687k3229j7852L1023Q350k2669K6010K3331k7206
14758B1790j0323o49m310q738j0865R410J980J2535N450k0285p301J1022O51n582
14744e215n916O405k3000J2805Q941J1747J5348J4157l3643j1551K2041J3766
14732B5885J3771j9550k1597J8179J7140j323R256j5661k4618p3j4333J7500K6979
$$ plain form
14719 31555 29766 15755 12943 5525 -10979 -11427 -2261 13689 15428 -19415 -30085 -18035 -4659
14706 -4659 15629 -7984 -24998 -14169 10806 19400 17048 6926 2274 -26737 -22208 2730 20785
14693 20785 31449 27294 9520 -19062 -44559 -48522 -25384 -9862 -2138 2290 -1466 14334 18337
14680 18337 -5518 -15256 -11330 -12800 -9545 -11707 -11199 5974 10444 -8560 -17778 2039 24562
14667 24562 11246 2036 -12974 -37352 -41794 -38698 -29713 -32903 -33407 -40352 -39340 -20065 -21176 -37609
14653 -37609 -31389 5049 21517 24290 21980 14390 1335 -2754 10747 35063 38155 11390 11146
14640 11146 7986 12302 28101 14765 14877 23231 20957 12195 11136 6722 12017 -8831 -25702 -9137
14626 -9137 -13272 -8535 -15359 683 19592 11683 -10890 -16704 -20401 -17896 -21561 -39798 -46403 -25236
$$ packed form
14719C1555j789j4011k812p418j6504m48R166J5950J739l4843j0670J2050J3376
14706d659K0288k3613j7014J0829K4975Q594k352j0122m652k9011M529K4938J8055
14693B0785J0664m155j7774k8582k5497l963K3138J5522P724M428l756J5800M003
14680A8337k3855r738L926j470L255k162N08J7173M470j9004r218J9817K2523
14667B4562j3316r210j5010k4378m442L096Q985l190n04o945J012J9275j111j6433
14653c7609O220L6438J6468K773k310p590j3055m089J3501K4316L092k6765k44
14640A1146l160M316J5799j3336J12Q354k274q762j059m414N295k0848j6871J6565
14626i137m135M737o824J6042J8909p909k2573n814l697K505l665j8237o605K1167
$$ plain form
14612 -25236 10456 21640 5655 9197 -14162 -30971 -33407 -16243 -12781 -990 15407 -13205
14600 -13205 5226 -8096 -29883 -40326 -18467 -19820 -20604 -10216 -35791 -37297 -20840 -4104
14588 -4104 6750 21817 29629 34930 30212 18413 -2503 -20850 -9282 -2428 -2818 13473 11219
14575 11219 13068 3290 -8993 2430 20590 10368 -7852 -10997 -7425 541 2158 -4476 -6173
14562 -6173 9535 9622 -2642 -13493 -21136 -6341 11180 18349 -3390 -1747 3587 15679 10980
14549 10980 7064 -4643 6526 7816 -11066 -24005 1564 19015 37328 21379 -1695 10787
14537 10787 2722 -15608 -23823 -33073 -24433 -6549 2341 3208 -406 -11458 8302 34589 22875
14524 22875 10152 3952 -2115 -28425 -35050 -5706 14141 23087 19245 6114 3129 383 8904
$$ packed form
14612b5236L5692J1184j5985L542k3359j6809k436J7164L462J1791J6397k8612
14600a3205J8431j3322k1787j0443K1859j353p84J0388k5575j506J6457J6736
14588d104J0854J5067P812N301m718j1799k0916j8347J1568O854l90J6291k254
14575A1219J849r778j2283J1423J8160j0222j8220l145L572P966J617o634j697
14562f173J5708Q7j2264j0851p643J4795J7521P169k1739J643N334J2092m699
14549A0980l916j1707J1169J290j8882j2939K5569J7451J8313j5949k3074J2482
14537A0787q065j8330q215r250Q640J7884Q890Q67l614j1052J9760K6287j1714
14524B2875j2723o200o067k6310o625K9344J9847Q946l842j3131k985k746Q521
$$ plain form
14511 8904 5202 10373 8929 10484 12299 25760 21042 6122 -5248 7220 20349 26241 19908
14498 19908 1574 -13856 -11988 380 -17267 -21198 -13762 -11852 -2443 4595 7541 5251 -375
14485 -375 -6293 -33481 -41265 3058 32127 23456 -2215 -20719 -6885 -4829 10184 33953 22764
14472 22764 7229 -11853 -16997 -13949 -14076 -19676 -10248 -25655 -41711 -38293 -34445 -35715 -17775
14459 -17775 -5852 -2058 -8277 -3201 -8469 -6960 -4712 3124 3948 8016 38109 37211 29143 30210
14445 30210 9396 -14825 -11647 -10245 -11038 -447 17445 8527 13942 29020 38217 38788 24218
14432 24218 25307 24149 -10878 -29652 -4780 20959 14193 20929 14533 -981 16416 12015 4283
14419 4283 7121 6857 4880 11484 -14120 -7609 -5601 -29286 -23753 -9977 -29 21473 25395 33890
$$ packed form
14511H904l702N171j444J555J815J3461m718j4920j1370J2468J3129N892o333
14498A9908j8334j5430J868J2368j7647l931P436J910R409P038K946k290n626
14485c75n918k7188p784M4323K9069q671k5671j8504J3834K056J5013K3769j1189
14472B2764j5535j9082n144L048j27n600R428j5407j6056L418L848j270J7940
14459a7775J1923L794o219N076n268J509K248P836Q24M068L0093q98q068J067
14445C0210k0814k4221L178J402p93J0591J7892q918N415J5078R197N71j4570
14432B4218J089j158l5027j8774K4872K5739o766O736o396j5514J7397m401p732
14419D283K838k64j977O604k5604O511K008k3685N533J3776R948K1502L922Q495
$$ plain form
14405 33890 21011 -23637 -28702 -31202 -18768 -8277 -1230 -13041 -6811 1832 -3966 6612 13987
14392 13987 -4344 -5754 12056 16686 5736 17268 18606 -14161 -30488 -20458 -14128 -12784 -7001
14379 -7001 -22404 -21121 -7651 23989 29648 6715 -7731 -25943 -15507 -8025 -5375 -20021 -32039
14366 -32039 -34824 -20087 -12842 -14809 -30175 -32976 -25839 -5444 -23987 -14032 2293 -19417 -18809
14353 -18809 -3063 -2808 -6365 -33092 -16362 -3756 -13573 -35734 -21128 -13946 -553 6077 1098
14340 1098 -1790 -18591 -37099 -31829 -21946 -23385 -15294 -10371 -10452 -2977 4677 -1981 1465 16617
14326 16617 15891 12158 4980 -29672 -23421 -14051 -5403 10247 16875 1158 -26133 -21172 -13452 -30447
14312 -30447 -41490 -29763 -17817 -9735 -2644 12552 14099 8111 8269 8903 -628 -7997 4724 -19277
$$ packed form
14405C3890j2879m4648n065k500J2434J0491P047j1811O230Q643n798J0578P375
14392A3987j8331j410J7810M630j0950J1532J338l2767j6327J0030O330J344N783
14379g001j5403J283J3470L1640N659k2933j4446j8212J0436P482K650j4646j2018
14366c2039k785J4737P245j967j5366k801P137K0395j8543R955J6325k1710O08
14353a8809J5746K55l557k6727J6730J2606r817k2161J4606P182J3393O630m979
14340A098k888j6801j8508N270R883j439Q091M923q1P475P654o658L446J5152
14326A6617p26l733p178l4652O251R370Q648J5650O628j5717k7291M961P720j6995
14312c0447j1043J1727J1946Q082P091J5196J547n988J58O34r531p369J2721k4001
$$ plain form
14298 -19277 -10395 -221 -7335 4124 13449 9737 8873 3147 1464 1008 -15880 -27376 -11880 21759
14284 21759 23536 15798 17141 26136 19151 6757 -22012 -37824 -15788 16969 28174 9365 11393
14271 11393 9773 8497 17268 10954 -13837 1988 9713 20351 10888 8179 7085 12544 25906
14258 25906 31453 10098 -16573 -10582 11208 23486 745 21515 24607 871 -22406 -21504 -14441
14245 -14441 10690 12905 3627 6418 1442 8980 -4655 -2091 -1150 15770 41294 12568 8357
14232 8357 28903 16072 -22632 -17067 -8323 -5113 463 9063 5727 -16636 -19060 -4630 -2606
14219 -2606 11471 41764 21710 -5145 1932 15012 132 -3072 -7144 -5568 -21555 -31586 3061
14206 3061 13216 -9415 -20669 9438 13262 8876 18177 38297 24335 6035 -5052 5377
$$ packed form
14298a9277Q882J0174p114J1459R325l712q64n726j683m56j6888j1496J5496L3639
14284B1759J777p738J343Q995o985j2394k8769j5812K2036L2757J1205j8809K028
14271A1393j620j276Q771o314k4791J5825P725J0638r463k709j094N459J3362
14258B5906N547k1355k6671N991K1790J2278k2741K0770L092k3736k3277R02P063
14245a4441K5131K215r278K791m976P538j3635K564R41J6920K5524k8726m211
14232H357K0546j2831l8704N565Q744L210N576Q600l336k2363k424J4430K024
14219b606J4077L0293k0054k6855P077J3080j4880l204m072J576j5987j0031L4647
14206C061J0155k2631j1254L0107L824m386R301K0120j3962j8300j1087J0429
$$ plain form
14194 5377 -1695 -18412 -20565 -28281 -14189 1471 -5267 5142 2856 -12119 -25566 -23572 6389
14181 6389 1483 12997 16452 802 135 -7200 -2247 -6508 -17165 -27599 -24117 -9719 5128
14168 5128 -11088 -25463 -36959 -20374 -26751 -26405 -10671 -12317 -15355 -3932 -22193 -31608 -28151
14155 -28151 -18840 -11295 -13195 -14261 -90 3624 12636 6705 -22416 -27627 -27056 -12535 22209 29632
14141 29632 9327 -9812 8551 15196 11457 -2329 2259 4288 2074 2146 2239 1323 1927 14888 -1086
14126 -1086 -10622 -16694 -583 977 -12915 -24606 -31951 -29389 -39433 -46775 -24540 13365 9433
14113 9433 209 10033 7312 8739 10913 16400 2760 -10118 -7663 -3338 5264 14426 18632 46745
14099 46745 47816 47150 16616 16112 44392 54384 42711 23870 16879 17876 26903 31601 14073 -3870
$$ packed form
14194E377p072j6717k153p716J4092J5660o738J0409k286j4975j3447J994K9961
14181F389m906J1514L455j5650o67p335M953m261j0657j0434L482J4398J4847
14168E128j6216j4375j1496J6585o377L46J5734j646l038J1423j8261r415L457
14155b8151R311P545j900j066J4171L714R012n931k9121n211N71J4521L4744P423
14141B9632k0305j9139J8363O645l739j3786M588K029k214P2R3r16O04J2961j5974
14126a086r536o072J6111J560j3892j1691p345K562j0044p342K2235L7905l932
14113I433r224R824k721J427K174N487j3640j2878K455M325Q602R162M206K8113
14099D6745J071o66l0534n04K8280R992j1673j8841o991R97R027M698j7528j7943
$$ plain form
14085 -3870 -18083 -11794 -4154 9371 14377 17043 29206 15189 20732 7443 2619 1763 5307 5415
14071 5415 6779 19468 16202 -1543 16191 28319 30436 12529 635 -4674 -6964 8531 -944
14058 -944 -18097 -3523 11058 34363 62063 80967 105555 96764 84790 63042 58785 68880
14046 68880 61365 56542 64928 59904 19344 11461 4385 -2278 23762 47154 38919 30834 49536
14033 49536 28425 14973 20716 2603 -1729 -3586 22244 24868 -1259 -8550 -13945 7665 6915
14020 6915 -5473 -18319 -25537 -16206 10562 23929 19647 16934 10013 19554 44439 44069 16693
14007 16693 -18713 -21089 4735 17517 10606 7955 21161 33437 47143 38622 44272 50066 34227
13994 34227 30525 30661 3512 442 -6212 -7361 14649 7411 13628 21573 11739 8886 -3678 7733
$$ packed form
14085c870j4213O289P640J3525N006K666J2163j4017N543j3289m824q56L544J08
14071E415J364J2689l266j7745J7734J2128K117j7907j1894n309k290J5495r475
14058i44j7153J4574J4581K3305K7700J8904K4588q791j1974k1748m257J0095
14046F8880p515m823Q386n024m0560p883p076o663K6040K3392q235q085J8702
14033D9536k1111j3452N743j8113m332j857K5830K624k6127p291n395K1610p50
14020F915j2388j2846p218R331K6768J3367m282k713o921R541K4885l70k7376
14007A6693l5406k376K5824J2782o911k651J3206J2276J3706q521N650N794j5839
13994C4227l702J36k7149l070o654j149K2010p238O217P945r834k853j2564J1411
$$ plain form
13980 7733 30019 30178 8873 -16169 -9714 1705 -87 5391 3948 -7319 -30815 -23239 -7832
13967 -7832 -1065 -4927 -18132 -13241 -16636 -19476 -12334 -6529 17035 25068 10688 -2903 9550
13954 9550 22101 20848 2745 -12432 -25959 -37729 -53129 -48153 -35521 -11038 27117 31204
13942 31204 43847 35206 7224 -8005 8382 28775 27317 31833 7651 -7631 -27843 -48275
13930 -48275 -44156 -40713 -47618 -53475 -43373 -48532 -30746 -15990 -12759 -16009 5932 33288 25286
13917 25286 8305 3683 -1085 22566 23856 21127 21100 11267 -8645 -23417 -24240 -24357 -4822 12715
13903 12715 8682 854 -8595 -14707 -13305 6467 -3928 -28019 -18947 -16775 -28296 -14505 2740
13890 2740 16884 34673 21750 16180 5923 2847 20773 19307 20159 7325 -5240 -21958 -12408
$$ packed form
13980G733K2286J59k1305k5042O455J1419j792N478j443j1267k3496P576J5407
13967g832O767l862j3205M891l395k840P142N805K3564Q033j4380j3591J2453
13954I550J2551j253j8103j5177j3527j1770j5400M976J2632K4483L8155M087
13942C1204J2643q641k7982j5229J6387K0393j458M516k4182j5282k0212k0432
13930d8275M119L443o905n857J0102n159J7786J4756L231l250K1941K7356q002
13917B5286j6981m622m768K3651J290k729k7r833j9912j4772q23j17J9535J7537
13903A2715m033p828r449o112J402J9772j0395k4091R072K172j1521J3791J7245
13890B740J4144J7789j2923n570j0257l076J7926j466Q52j2834j2565j6718R550
$$ plain form
13877 -12408 3508 -12542 -17879 5879 13810 25871 39570 18452 2752 -7414 -3577 485
13865 485 27445 30215 -3041 -12374 -15603 -29277 -16303 -16097 -27628 -47252 -57644 -44779 -16216
13852 -16216 -17424 -27704 -16103 3290 13280 18237 10926 15145 16179 6374 4804 16231 30815
13839 30815 48282 50209 49663 13029 2555 22188 26423 21157 28859 22863 8322 -3439 12391
13826 12391 5843 -7817 3453 -5300 -16894 -21464 -9932 -2126 -4328 -2475 7854 26547 32436
13813 32436 41739 26554 6667 -14744 -7184 -14567 -11610 -5349 -18043 -12926 -11068 -3124 1288
13800 1288 33 7718 7532 25990 38225 21893 26938 30402 37850 35162 21348 13815 10188 -710
13786 -710 3130 21577 38670 32732 51476 49545 36300 15188 10218 15247 12890 -428 -3186
$$ packed form
13877a2408J5916j6050n337K3758P931J2061J3699k1118j5700j0166L837M062
13865D85K6960K770l3256r333l229j3674J2974K06j1531j9624j0392J2865K8563
13852a6216j208j0280J1601J9393R990M957p311M219J034r805j570J1427J4584
13839C0815J7467J927n46l6634j0474J9633M235n266P702n996j4541j1761J5830
13826A2391o548j3660J1270q753j1594m570J1532P806k202J853J0329J8693N889
13813C2436R303j5185j9887k1411P560p383K957O261j2694N117J858P944M412
13800A288j255P685j86J8458J2235j6332N045L464P448k688j3814p533l627j0898
13786g10L840J8447J7093n938J8744j931j3245k1112m970N029k357j3318k758
$$ plain form
13773 -3186 -33813 -43789 -38314 -33228 -33915 -26879 -11173 -1136 6430 2621 910 -791 -11010 -7632
13759 -7632 22975 36168 11372 18461 21188 27486 32081 10268 18078 36767 47075 47182 44102
13746 44102 43765 16424 869 7374 11897 19057 21851 9456 7232 28823 31188 44711 48363
13733 48363 33286 20617 18010 10922 19430 32561 22481 19472 17322 27973 42422 27233 1118
13720 1118 -7841 -16522 -22937 -10633 24720 50459 54788 41415 31914 28781 24406 19498 24062 17553
13706 17553 17642 2527 -9431 -2226 -3902 7154 41320 44879 21151 19479 20266 35180 23992
13693 23992 11583 -30772 -30892 -27050 -21781 -18840 2105 13266 -17887 2077 12930 2553 39115
13680 39115 51157 37921 30857 2172 -13033 -20582 -3290 -7206 -2558 19052 16590 17901 37187
$$ packed form
13773c186l0627r976N475N086o87P036J5706J0037P566l809j711j701j0219L378
13759g632L0607J3193k4796P089K727O298M595k1813P810J8689J0308J07l080
13746D4102l37k7341j5555O505M523P160K794j2395k224K1591K365J3523L652
13733D8363j5077j2669k607p088Q508J3131j0080l009k150J0651J4449j5189k6115
13720A118q959q681o415J2304L5353K5739M329j3373r501l133m375m908M564o509
13706A7553Q9j5115j1958P205j676J1056L4166L559k3728j672P87J4914j1188
13693B3992j2409m2355j20L842N269K941K0945J1161l1153J9964J0853j0377L6562
13680C9115J2042j3236p064k8685j5205p549J7292l916M648K1610k462J311J9286
$$ plain form
13667 37187 39623 28924 7318 -13227 -25117 -19275 -12622 23107 34047 40182 65877 53999
13655 53999 29973 36010 45952 46185 49192 45544 37731 21722 17294 32688 29941 14176 -11766
13642 -11766 -31424 -25867 -31910 -16125 -3733 -16297 -35659 -30664 -9776 -20649 -21754 -19509 12536
13629 12536 23498 -5231 -24956 -7558 6266 5721 18653 23777 39506 35333 37503 41686 24088
13616 24088 30194 43768 16112 9641 8087 1426 14183 9436 19922 15671 8552 11873 14466
13603 14466 8270 12572 8225 16474 25351 20792 13016 -1667 11009 44211 31753 33179 44846
13590 44846 31244 22920 22505 -8300 -28818 -9225 23694 35593 43185 55708 39600 22233
13578 22233 18014 14240 -3556 -276 -5014 7415 11485 24010 35134 55277 66137 60553 30604
$$ packed form
13667C7187K436j0699k1606k0545j1890N842O653L5729J0940O135K5695j1878
13655E3999k4026O037R942K33L007l648p813j6009m428J5394k747j5765k5942
13642a1766j9658N557o043J5785J2392j2564j9362M995K0888j0873j105K245L2045
13629A2536J0962k8729j9725J7398J3824n45J2932N124J5729m173K170M183j7598
13616B4088O106J3574k7656o471j554o661J2757m747J0486m251p119L321K593
13603A4466o196M302m347Q249Q877m559p776j4683J2676L3202j2458J426J1667
13590D4846j3602q324m15l0805k0518J9593L2919J1899P592J2523j6108j7367
13578B2233m219l774j7796L280m738J2429M070J2525J1124K0143J0860n584k9949
$$ plain form
13565 30604 18570 565 -10327 -15064 -23014 -22345 -16362 7219 39834 41347 37698 26126 -1120
13552 -1120 1125 8259 31998 28961 21652 -19781 -10533 -27346 -20061 -13072 4758 16771 12609
13539 12609 -3469 -24461 -22132 -9826 4854 7707 32309 46631 36059 39634 59987 52527
13527 52527 48712 23555 12266 33699 39101 28506 19674 15368 15515 29035 19464 7860 2021
13514 2021 22442 27029 38531 40724 38470 30511 36851 44834 14205 20867 22008 6691 13684 10757
13500 10757 27702 50634 53190 37553 55110 24780 6041 14992 23486 21447 11856 18227 30324
13487 30324 22197 9729 16224 15462 25772 25358 11956 7852 916 -401 3702 8848 11254 3687
13473 3687 14024 27499 23009 5254 -707 -1424 13639 53705 54672 41319 30315 24084 41143
$$ packed form
13565C0604j2034j8005j0892m737p950O69N983K3581L2615J513l649j1572k7246
13552a120K245P134K3739l037p309m1433R248j6813P285O989J7830J2013m162
13539A2609j6078k0992K329J2306J4680K853K4602J4322j0572L575K0353p460
13527E2527l815k5157j1289K1433N402j0595q832m306J47J3520r571j1604n839
13514B021K0421M587J1502K193k254p959O340P983l0629O662J141j5317O993k927
13500A0757J6945K2932K556j5637J7557l0330j8739Q951Q494k039r591O371J2097
13487C0324q127j2468O495p62J0310m14j3402m104o936j317M103N146K406p567
13473C687J0337J3475m490j7755n961p17J5063M0066R67j3353j1004o231J7059
$$ plain form
13460 41143 40574 37193 49484 46524 33930 33848 24142 45157 53471 52354 59524 49943 37019 35009
13446 35009 38232 25928 18087 9946 1141 13559 57487 77285 88146 62914 50598 52878 65325
13433 65325 70928 53792 50397 46042 51767 57586 66391 73309 67506 38924 31473 32104 44221 44341
13419 44341 49500 64875 42893 18558 20480 27013 29244 16155 23265 31280 29229 32878 18040
13406 18040 36285 40853 37656 31673 13749 4459 33254 39702 16447 8115 26476 26474 18366 8228
13392 8228 -13555 -14057 -3402 19780 24317 31164 34458 36321 38994 69856 81162 66238 50828
13379 50828 46417 31323 16283 8006 27147 54890 43198 28918 24324 41894 54678 37115
13367 37115 40540 49585 28909 7657 17172 38066 53221 45593 57393 81963 66871 46856
$$ packed form
13460D1143n69l381J2291k960j2594q2r706K1015Q314j117P170r581j2924k010
13446C5009L223j2304p841q141q805J2418M3928J9798J0861k5232j2316K280J2447
13433F5325N603j7136l395m355N725N819Q805O918n803k8582p451O31J2117J20
13419D4341N159J5375k1982k4335J922O533K231j3089P110Q015k051L649j4838
13406A8040J8245M568l197n983j7924r290K8795O448k3255q332J8361kq108j0138
13392H228k1783n02J0655K3182M537O847L294J863K673L0862J1306j4924j5410
13379E0828m411j5094j5040q277J9141K7743j1692j4280m594J7570J2784j7563
13367C7115L425R045k0676k1252R515K0894J5155p628J1800K4570j5092k0015
$$ plain form
13355 46856 64839 79600 83139 102948 113874 109121 114616 108412 105113 107698 127126 150622 156578
13342 156578 165923 183373 214626 268867 336316 430356 588618 799658 1041908 1302864 1512826
13331 1512826 1568187 1260576 884397 643458 506098 403978 330627 282963 255481 237170
13321 237170 225896 223028 204794 185135 174153 158177 123698 132089 141326 149056 147891 137889
13309 137889 141307 147639 145100 134928 143252 135884 114035 103104 92811 105388 108809 107070 96554
13296 96554 95089 95148 99423 81591 70916 76758 84261 82112 79197 83978 70439 63756 67502 63834
13282 63834 80987 100663 113306 116442 101657 84572 70619 77325 66727 57073 51519 48906 56323
13269 56323 56859 41465 53858 68043 76702 82750 85466 84867 98071 98308 90191 91143 95685 73506
$$ packed form
13355D6856J7983J4761L539J9809J0926m753N495o204l299K585J9428K3496N956
13342A56578R345J7450L1253N4241O7449R4040J58262K11040K42250K60956K09962
13331A512826N5361l07611l76179k40939j37360j02120p3351m7664k7482j8311
13321B37170j1274k868j8234j9659j0982j5976l4479Q391R237P730j165j0002
13309A37889L418O332k539j0172Q324p368k1849j0931j0293J2577L421j739j0516
13296I6554j465N9M275j7832j0675N842P503k149k915M781j3539o683L746l668
13282F3834J7153J9676J2643L136j4785j7085j3953O706j0598r654n554k613P417
13269E6323N36j5394J2393J4185Q659O048K716n99J3204K37q117R52M542k2179
$$ plain form
13255 73506 43477 27919 44382 56667 59269 48954 48526 45968 38242 53748 56160 47075 26968
13242 26968 12927 14041 26458 17651 33264 23941 12718 28780 48545 51321 43402 24331 37097
13229 37097 44016 38893 49130 54731 45490 70240 64076 63075 66418 80228 77186 70502 64468 53954
13215 53954 56823 54904 69151 75022 72004 78073 83789 79114 75830 59684 58033 66370 53450 54295
13201 54295 72071 69483 77781 78590 77831 75110 73484 87647 76746 57026 70415 75098 73235 69148
13187 69148 48029 52914 61242 67164 56244 93362 110214 122708 132654 127685 112585 86655 62317
13174 62317 47819 49914 56808 62531 80002 73072 48484 66242 74035 76381 71557 65983 58972
13161 58972 55874 86080 84147 75383 96047 116161 95019 70031 69871 63951 82050 99771 86782
$$ packed form
13255G3506l0029j5558J6463J2285K602j0315m28k558p726J5506K412r085k0107
13242B6968j4041J114J2417q807J5613r323j1223J6062J9765K776p919j9071J2766
13229C7097O919n123J0237N601r241K4750o164j001L343J3810l042o684o034j0514
13215E3954K869j919J4247N871l018O069N716m675l284j6146j651Q337j2920Q45
13201E4295J7776k588Q298Q09p59k721j626J4163j0901j9720J3389M683j863m087
13187F9148k1119M885Q328N922j0920L7118J6852J2494R946m969j5100k5930k4338
13174F2317j4498K095O894N723J7471o930k4588J7758P793K346m824n574p011
13161E8972l098L0206j933q764K0664K0114k1142k4988j60n920J8099J7721j2989
$$ plain form
13148 86782 83976 73690 65511 75697 84045 91467 81473 93911 83634 90316 115573 103756 86870
13135 86870 75887 62502 74146 108214 126295 119231 122170 139274 148149 160559 163566 175032
13123 175032 239659 287868 271718 228720 200935 200624 195011 175211 157986 145771 146229 131544
13111 131544 84582 77240 113590 108022 128995 147208 165381 168685 149199 143965 148823 124282
13099 124282 124011 141412 136227 138120 138065 124915 110820 105198 121502 145212 140594 122605 123972
13086 123972 126086 125347 110379 105055 105269 103973 89467 84982 109392 109108 90834 85066 87839 72499
13072 72499 69468 90862 127014 130144 116114 83352 55560 61210 67604 96377 123226 118198 110116
13059 110116 120318 129208 139998 149032 179553 192138 187998 183166 177589 144153 151759 155257 160477
$$ packed form
13148H6782k806j0286q179J0186Q348P422r994J2438j0277O682K5257j1817j6886
13135H6870j0983j3385J1644L4068J8081p064K939J7104Q875J2410L007J1466
13123A75032O4627M8209j6150m2998k7785l11n613j9800j7225j2215M58j4685
13111A31544m6962p342L6350n568K0973J8213J8173L304j9486n234M858k4541
13099A24282k71J7401n185J893n5j3150j4095n622J6304K3710m618j7989J367
13086A23972K114p39j4968n324K14j296j4506m485K4410k84j8274n768K773j5340
13072G2499l031K1394L6152L130j4030l2762k7792N650O394K8773K6849n028q082
13059A10116J0202Q890J0790R034L0521J2585m140m832n577l3436P606L498N220
$$ plain form
13046 160477 165438 158082 151541 157181 164524 172277 174660 175147 151272 149582 149480 149115 171474 187683
13032 187683 198592 222564 229673 259657 285828 304044 275314 226424 168190 93011 34978 33730
13020 33730 41815 65515 86011 95054 95614 106805 146974 162573 167271 171936 176713 207441 250595
13007 250595 275974 273444 284333 318314 354848 392528 447515 531837 692337 924972 1198797
12996 1198797 1497432 1715778 1646205 1416454 1232502 1049010 923201 866656 825053 798464
12986 798464 768724 725188 714566 705817 672086 640530 617665 602387 592620 590718 591441 592265 592433
12973 592433 598902 599097 601921 597460 589160 578633 590958 607219 607648 631102 643624 652560 629311
12960 629311 578964 549590 550908 559677 552324 535621 536089 515812 471881 470719 505151 516836 499751
$$ packed form
13046A60477M961p356o541N640P343P753K383M87k3875j690j02l65K2359J6209
13032A87683J0909K3972P109K9984K6171J8216k8730m8890n8234p5179n8033j248
13020C3730Q085K3700K0496R043N60J1191M0169J5599M698M665M777L0728M3154
13007B50595K5379k530J0889L3981L6534L7680N4987Q4322J60500K32635K73825
12996A198797K98635K18346o9573k29751j83952j83492j25809n6545m1603k6589
12986G98464k9740m3536j0622q749l3731l1556k2865j5278r767j902P23Q24J68
12973E92433O469J95K824m461q300j0527J2325J6261M29K3454J2522Q936k3249
12960F29311n0347k9374J318Q769p353j6703M68k0277m3931j162L4432J1685j7085
$$ plain form
12947 499751 481234 471110 484351 500003 488102 479103 520902 551205 559393 544296 560482 557558
12935 557558 534928 552432 586192 607745 596988 570599 552020 569055 617589 658085 688698
12924 688698 704980 701932 710710 721813 735879 791687 815237 834824 883558 931958 968860 1009647
12912 1009647 1046082 1076647 1099706 1121206 1146448 1196133 1267904 1355708 1397842 1409331 1397844
12901 1397844 1420901 1533742 1673909 1838059 2038692 2239240 2406423 2549814 2691188 2848339
12891 2848339 3079686 3384792 3801207 4328468 5050292 6028275 7285141 8739592 10324955
12882 10324955 11916620 12847339 13385401 14348834 15983479 18940431 23792969 31478565
12874 31478565 43843466 64373101 97575037 143051593 192024659 240070183 287142563
$$ packed form
12947D99751j8517j0124J3241J5652j1901q999M1799L0303Q188j5097J6186k924
12935E57558k2630J7504L3760K1553j0757k6389j8579J7035M8534M0496L0613
12924F88698J6282l048Q778J1103J4066N5808K3550J9587M8734M8400L6902M0787
12912A009647L6435L0565K3059K1500K5242M9685P1771Q7804M2134J1489j1487
12901A397844K3057J12841J40167J64150K00633K00548J67183J43391J41374J57151
12891B848339K31347L05106M16415N27261P21824R77983J256866J454451J585363
12882A0324955J591665R30719N38062R63433J634645K956952M852538P685596
12874C1478565J2364901K0529635L3201936M5476556M8973066M8045524M7072380
$$ plain form
12867 287142563 282819839 205580427 133499393 91869272 68782216 54961532 46137227
12860 46137227 40180285 35943112 32661210 29979694 27787856 26061658 24484112 22730961
12852 22730961 21116839 19872925 18863835 17945651 17118037 16365064 15663832 14972001 14310891
12843 14310891 13669371 13100798 12596219 12174631 11830782 11541864 11282571 11034248 10778998
12834 10778998 10504573 10186368 9807051 9451838 9190177 8941033 8691724 8421216 8154869
12825 8154869 7932614 7746108 7578432 7435287 7249276 7059450 6879072 6699001 6511811
12816 6511811 6360449 6228726 6092927 5962127 5832058 5689817 5561401 5456744 5357495 5242734
12806 5242734 5125129 4989410 4884131 4793601 4709376 4608925 4506630 4426094 4333911 4221703
$$ packed form
12867B87142563m322724p7239412p2081034m1630121k3087056j3820684q824305
12860D6137227n956942m237173l281902k681516k191838j726198j577546j753151
12852B2730961j614122j243914j009090r18184q27614p52973p01232o91831o61110
12843A4310891o41520n68573n04579m21588l43849k88918k59293k48323k55250
12834A0778998k74425l18205l79317l55213k61661k49144k49309k70508k66347
12825H154869k22255j86506j67676j43145j86011j89826j80378j80071j87190
12816F511811j51362j31723j35799j30800j30069j42241j28416j04657r9249j14761
12806E242734j17605j35719j05279r0530q4225j00451j02295q0536r2183j12208
$$ plain form
12796 4221703 4118093 4037343 3983732 3956698 3896923 3824618 3750953 3691601 3620210 3544749 3455162
12785 3455162 3350714 3256088 3173415 3098531 3037277 2974516 2889674 2812533 2753880 2727109 2678123
12774 2678123 2636718 2597034 2546739 2500146 2444559 2388561 2330888 2292096 2259762 2221163 2203857
12763 2203857 2183601 2153609 2123842 2093378 2078840 2030366 1999971 1952944 1892690 1867112 1869561
12752 1869561 1884500 1899981 1914173 1967945 2093099 2292726 2498003 2760298 2893068 2740282
12742 2740282 2479733 2349079 2452602 2508173 2336146 2179875 2079461 2009221 1972561 1913316
12732 1913316 1868710 1813030 1763311 1717942 1657265 1605317 1555269 1511556 1486924 1463558 1443788
12721 1443788 1437009 1463563 1478430 1470602 1442636 1415651 1404890 1374531 1326269 1269329 1169907 1086319
$$ packed form
12796D221703j03610q0750n3611k7034n9775p2305p3665n9352p1391p5461q9587
12785C455162j04448r4626q2673p4884o1254o2761q4842p7141n8653k6771m8986
12774B678123m1405l9684n0295m6593n5587n5998n7673l8792l2334l8599j7306
12763B203857k0256k9992k9767l0464j4538m8474l0395m7027o0254k5578K449
12752A869561J4939J5481J4192N3772J25154J99627K05277K62295J32770j52786
12742B740282k60549j30654J03523N5571j72027j56271j00414p0240l6660n9245
12732A913316m4606n5680m9719m5369o0677n1948n0048m3713k4632k3366j9770
12721A443788o779K6554J4867p828k7966k6985j0761l0359m8262n6940r9422q3588
$$ plain form
12709 1086319 1052347 1032365 1003961 972361 956393 967810 938498 927825 935161 925721 896252 883563
12697 883563 898906 883983 883390 874173 862523 831882 819860 797982 752811 711176 699998 690717
12685 690717 688711 705417 699317 677932 665282 673657 691306 688072 694598 699444 692239 686461 698264
12672 698264 690275 663836 666853 664444 675638 664566 675377 685398 717372 761134 780881 820524
12660 820524 882998 953910 983961 1028429 990512 870855 763962 701526 666874 637724 586430
12649 586430 571183 564528 549093 527048 516812 521659 527179 523171 530325 498446 471037 440427
12637 440427 435485 423342 407691 417377 416244 408214 390505 397595 410689 399131 396009 425438 423922
12624 423922 405122 403626 401123 410755 402565 395174 375401 363087 393553 393749 395668 382241 374308
$$ packed form
12709A086319l3972j9982k8404l1600j5968J1417k9312j0673P336r440k9469j2689
12697H83563J5343j4923n93r217j1650l0641j2022k1878m5171m1635j1178r281
12685F90717k006J6706o100k1385j2650Q375J7649l234O526M846p205n778J1803
12672F98264p989k6439L017k409J1194j1072J0811J0021L1974M3762J9747L9643
12660H20524O2474P0912L0051M4468l7917j19657j06893o2436l4652k9150n1294
12649E86430j5247o655j5435k2045j0236M847N520m008P154l1879k7409l0610
12637D40427m942j2143j5651R686j133q030j7709P090J3094j1558l122K9429j516
12624D23922j8800j496k503R632q190p391j9773j2314L0466J96J919j3427p933
$$ plain form
12611 374308 371001 370647 349307 339070 333196 333470 350202 356880 358561 357529 352578 337233 319172
12598 319172 313058 307719 319105 352034 396533 416111 408966 403560 424260 446538 502322 575327
12586 575327 674335 800133 908762 1024808 1193113 1282609 1262916 1179908 1174229 1248466 1281902
12575 1281902 1149739 955064 819854 717970 622264 561597 522811 478457 466430 459475 461405
12564 461405 486205 509286 526155 533464 512794 466112 438538 409050 404684 444410 461403 465162
12552 465162 482417 536658 574636 602058 622965 613783 577595 542206 483512 434829 421986 408365
12540 408365 408060 408359 397186 429922 429612 418932 423193 397324 358572 351589 356645 377729 425927
12527 425927 430463 422399 416135 380456 359180 353596 325368 302025 287288 289700 277125 260815
$$ packed form
12611C74308l307l54k1340j0237n874K74J6732O678J681j032m951j5345j8061
12598C19172o114n339J1386L2929M4499J9578p145n406K0700K2278N5784P3005
12586E75327R9008J25798J08629J16046J68305Q9496j9693q3008n679P4237L3436
12575A281902j32163j94675j35210j01884r5706o0667l8786m4354j2027o955J930
12564D61405K4800K3081J6869P309k0670m6682k7574k9488m366L9726J6993L759
12552D65162J7255N4241L7978K7422K0907r182l6188l5389n8694m8683j2843j3621
12540D08365l05K99j1173L2736l10j0680M261k5869l8752o983N056K1084M8198
12527D25927M536q064o264l5679k1276n584k8228k3343j4737K412j2575j6310
$$ plain form
12515 260815 267880 271624 273837 281423 260997 254187 288944 320882 351825 390027 421608 474243
12503 474243 517293 507909 448900 411222 408879 396425 378960 362377 335442 318541 291051 276739
12491 276739 265409 253547 271835 279843 265343 255783 257538 245501 231914 221886 218905 208286
12479 208286 178825 183687 193012 210477 217496 199597 191629 218121 248723 257013 269942 270833 260452
12466 260452 245746 218313 228360 236147 235897 229007 209673 194442 212871 218404 199955 190667 215483
12453 215483 239504 237355 251805 278889 331352 380325 445840 551329 664910 779713 828614
12442 828614 721702 569527 462066 401607 373008 371891 382829 413721 456996 500195 508064
12431 508064 519499 514324 523731 517402 510881 518241 538614 542433 526694 490547 446860 418842 386795
$$ packed form
12515B60815P065L744K213P586k0426o810L4757L1938L0943L8202L1581N2635
12503D74243M3050r384n9009l7678k343j2454j7465j6583k6935j6901k7490j4312
12491B76739j1330j1862J8288Q008j4500r560J755j2037j3587j0028k981j0619
12479B08286k9461M862R325J7465P019j7899p968K6492L0602Q290J2929Q91j0381
12466B60452j4706k7433J0047P787k50o890j9334j5231J8429N533j8449r288K4816
12453B15483K4021k149J4450K7084N2463M8973O5515J05489J13581J14803M8901
12442H28614j06912j52175j07461o0459k8599j117J0938L0892M3275M3199P869
12431E08064J1435n175R407o329o521P360K0373L819j5739l6147m3687k8018l2047
$$ plain form
12418 386795 367632 339448 337021 344693 357051 351631 332299 316372 330362 339942 359136 382350
12406 382350 416030 468196 514482 571867 649166 780006 1055829 1406347 1765121 2097423
12396 2097423 2272240 2001713 1465274 1041681 804568 659540 565589 495482 457898 421991
12386 421991 377496 324783 305881 296002 297999 288122 279968 267612 255097 273287 298588 286161
12374 286161 261500 257251 230872 222288 211117 205143 185749 155908 125194 137586 142320 132774
12362 132774 140936 149167 151937 165417 175422 179846 154853 123394 102121 93806 97516 116680 119517
12349 119517 122597 117300 111881 116328 152289 149150 150802 141866 142125 156358 152515 132961 152901
12336 152901 155534 135870 144948 157778 138096 132868 116489 104021 113189 114984 106563 105761 121368
$$ packed form
12418C86795j9163k8184k427P672J2358n420j9332j5927J3990R580J9194K3214
12406C82350L3680N2166M6286N7385P7299J30840K75823L50518L58774L32302
12396B097423J74817k70527n36439m23593k37113j45028r3951p0107l7584l5907
12386D21991m4495n2713j8902r879J997r877q154j2356j2515J8190K5301j2427
12374B86161k4661m249k6379q584j1171n974j9394k9841l0714J2392M734r546
12362A32774Q162Q231K770J3480J0005M424k4993l1459k1273q315L710J9164K837
12349A19517L080n297n419M447L5961l139J652q936K59J4233l843j9554J9940
12336A52901K633j9664R078J2830j9682n228j6379j2468R168J795q421q02J5607
$$ plain form
12323 121368 110708 87589 77971 108319 106439 103445 109030 106780 83826 73624 78647 83526 109178
12310 109178 115643 118070 119183 152948 196967 241400 296992 354162 415519 454338 417623 313735
12298 313735 236430 192034 164788 165078 155647 160305 168419 142103 117971 121407 116769 132844 150761
12285 150761 136962 102099 83726 74883 83354 97948 126579 132033 131093 152271 146347 125383 91592
12272 91592 127304 115410 94014 88204 92218 82626 80850 85417 102088 86207 63345 64372 78785
12259 78785 98121 89470 88755 88458 85749 67747 65734 62180 70756 60573 57599 58866 63049 70919
12245 70919 75686 77825 76556 37100 36294 51538 57994 51484 26486 39456 53374 31428 37046
12232 37046 65548 80259 62689 34053 37475 35926 33923 26395 25472 28743 34627 27421 25176 28320
$$ packed form
12323A21368j0660k3119r618L0348j880k994N585k250k2954j0202N023M879K5652
12310A09178O465K427J113L3765M4019M4433N5592N7170O1357L8819l6715j03888
12298C13735p7305m4396k7246K90r431M658Q114k6316k4132L436m638J6075J7917
12285A50761j3799l4863j8373q843Q471J4594K8631N454r40K1178n924k0964l3791
12272I1592L5712j1894k1396n810M014r592j776M567J6671j5881k2862J027J4413
12259G8785J9336q651p15k97k709j8002k013l554Q576j0183k974J267M183P870
12245G0919M767K139j269l9456q06J5244O456o510k4998J2970J3918k1946N618
12232C7046K8502J4711j7570k8636L422j549k003p528r23L271N884p206k245L144
$$ plain form
12218 28320 24420 24402 33380 48245 41644 29926 29578 -1211 -439 37705 37436 29910 49961 69195
12204 69195 51443 36790 21694 29502 22699 8033 26976 40219 61895 66507 58358 55557 64997
12191 64997 74392 62543 63565 38797 1991 7819 10890 11286 14516 17347 20997 18952 27053 26779
12177 26779 39061 39983 41736 30940 14985 14448 17236 20572 27961 35055 29283 7347 -15128 -8305
12163 -8305 17001 27985 6230 8792 30398 58105 66353 44632 43412 54310 75826 82193 88847
12150 88847 110200 112129 78536 55035 67940 56270 50935 69382 108998 122173 109647 117158
12138 117158 103701 91725 82227 68808 61033 21968 40751 38472 49819 58766 50099 41038 32139
12125 32139 32485 32675 31745 31727 34779 33598 21599 -10038 -12123 -12249 -3352 21495 27578 11264 18632
$$ packed form
12218B8320l900j8Q978J4865o601j1718l48l0789P72L8144k69p526K0051J9234
12204F9195j7752j4653j5096P808o803j4666J8943J3243K1676M612q149k801R440
12191F4997R395j1849J022k4768l6806N828L071L96L230K831L650k045Q101k74
12177B6779J2282R22J753j0796j5955n37K788L336P389P094n772k1936k2475O823
12163h305K5306J0984k1755K562K1606K7707Q248k1721j220J0898K1516O367O654
12150H8847K1353J929l3593k3501J2905j1670n335J8447L9616J3175j2526P511
12138A17158j3457j1976r498j3419p775l9065J8783k279J1347Q947q667r061q899
12125C2139L46J90r30j8L052j181j1999l1637k085j26Q897K4847O083j6314P368
$$ plain form
12110 18632 124 -696 15348 16437 11777 26597 39621 37220 25729 6117 -15285 -10591 12695
12097 12695 15760 -2534 -12103 5232 21561 3644 24 6510 18936 7720 13075 -4594 2969
12084 2969 -2873 -17719 -15244 -7771 4169 6045 -13121 -11746 8151 3099 8577 -16870 -32233
12071 -32233 -30328 -13331 -3912 10430 22348 22491 10035 9219 -8796 -11234 -8029 15228 30269
12058 30269 28687 20282 5800 21803 21493 8316 16001 32821 2102 -6451 -6112 -1751 20061
12045 20061 31305 -2166 5090 38404 42979 36095 34407 24205 18535 37417 37308 40441 47926
12032 47926 31409 42811 53376 52891 37435 29245 25766 19627 5981 2812 -450 -5647 -29062
12019 -29062 -32713 -4993 3243 -16789 -9488 -6326 -13846 -13347 -26797 -23172 5067 24276 42288
$$ packed form
12110A8632j8508q20J6044J089m660J4820J3024k401j1491j9612k1402M694K3286
12097A2695L065j8294r569J7335J6329j7917l620O486J2426j1216N355j7669P563
12084B969n842j4846K475P473J1940J876j9166J375J9897n052N478k5447j5363
12071c2233J905J6997R419J4342J1918J43j2456q16j8015k438L205K3257J5041
12058C0269j582q405j4482J6003l10j3177P685J6820l0719q553L39M361K1812
12045B0061J1244l3471P256L3314M575o884j688j0202n670J8882j09L133P485
12032D7926j6517J1402J0565m85j5456q190l479o139j3646l169l262n197k3415
12019b9062l651K7720Q236k0032P301L162p520M99j3450L625K8239J9209J8012
$$ plain form
12006 42288 62562 48803 34404 8778 9932 8137 2021 -3371 10939 28968 32769 38465 58243
11993 58243 53953 16838 13249 20956 19584 5591 -17179 -32848 -21461 -2546 -14678 -17153 -18442
11980 -18442 -16530 -17427 327 9013 5754 3271 9248 1295 -2504 11291 11711 8219 11288 5752
11966 5752 8644 22281 27210 1422 -15053 -8283 -1390 -388 11410 23991 26703 17786 7912
11953 7912 14623 712 7667 20200 15639 6683 13932 11513 27138 54883 51851 51500 33810 36848
11939 36848 41750 46401 36272 18769 40294 68511 93506 112901 126300 165316 242274 338248
11927 338248 423157 476276 450726 395367 323931 257667 206448 166318 96400 45501 23043
11916 23043 48487 66386 41137 32180 28488 55120 75375 68690 66166 53662 59113 58211 66738
$$ packed form
12006D2288K0274j3759j4399k5626J154j795o116n392J4310J8029L801N696J9778
11993E8243m290l7115l589P707j372j3993k2770j5669J1387J8915j2132k475j289
11980a8442J912q97J7754Q686l259k483N977p953l799J3795M20l492L069n536
11966E752K892J3637M929k5788j6475O770O893J002J1798J2581K712q917r874
11953G912O711j3911O955J2533m561q956P249k419J5625K7745l032l51j7690L038
11939C6848M902M651j0129j7503K1525K8217K4995J9395J3399L9016P6958R5974
11927C38248Q4909N3119k5550n5359p1436o6264n1219m0130o9918n0899k2458
11916B3043K5444J7899k5249q957l692K6632K0255o685k524j2504N451r02Q527
$$ plain form
11903 66738 100276 95422 75789 64649 56129 63445 61608 26593 21653 9448 15218 9271 598
11890 598 2908 19838 12702 26031 53692 55003 45275 61014 73642 59692 41118 28044 21875
11877 21875 25401 44033 42468 42290 31373 6054 8301 19688 22480 16988 26359 49894 73548
11864 73548 88766 81797 65869 43314 22343 -3499 -20236 -5409 23597 39604 35313 30700
11852 30700 17516 10722 20587 15631 5841 5948 29949 45996 34665 8240 -26145 -11265 26472
11839 26472 26829 18075 16275 1085 1294 -11750 -4739 16901 16744 21498 31115 43276 52070 46165
11825 46165 42801 48213 57977 40510 36388 32817 12968 -3070 -15607 -10884 15691 22713 22902
11812 22902 5620 3851 4230 7160 -3238 -18014 -12504 -11325 -21745 -33645 -23703 -24305 -4133
$$ packed form
11903F6738L3538m854j9633j1140q520P316j837l5015m940j2205N770n947q673
11890E98K310J6930p136J3329K7661J311r728J5739J2628j3950j8574j3074o169
11877B1875L526J8632j565j78j0917k5319K247J1387K792n492R371K3535K3654
11864G3548J5218o969j5928k2555k0971k5842j6737J4827K9006J6007m291m613
11852C0700j3184o794R865m956r790J07K4001J6047j1331k6425l4385J4880L7737
11839B6472L57q754j800j5190K09j3044P011K1640j57M754R617J2161Q794n905
11825D6165l364N412R764j7467m122l571j9849j6038j2537M723K6575P022J89
11812B2902j7282j769L79K930j0398j4776N510J179j0420j1900R942o02K0172
$$ plain form
11799 -4133 4985 -13843 -12479 7895 13520 427 11644 37190 31992 1859 2597 14350 32271
11786 32271 31422 5520 -223 24076 29663 31661 26312 14893 31407 25514 5515 1719 7532
11773 7532 10529 11724 3944 -5237 -10885 9367 6976 8428 -3949 3580 18224 35889 31773 16404
11759 16404 14915 16596 20679 13568 11949 28059 48006 36092 15253 16522 25202 16913 18808
11746 18808 19620 2143 -20219 -1752 13784 17163 11484 -3423 483 12176 7939 -26513 -12756
11733 -12756 -11053 1101 -4032 -22440 -13078 21069 27324 16404 18224 34445 30899 32199 45116
11720 45116 61678 46295 29781 11989 -6419 -17773 -19472 -7643 -9805 -8364 427 15012
11708 15012 2100 -4786 -15421 -20318 -17857 -32469 -31735 -7908 13524 -2080 -11260 10898 24435
$$ packed form
11799d133R118j8828J364K0374N625j3093J1217K5546n198l0133P38J1753J7921
11786C2271q49k5902n743K4299N587J998n349j1419J6514n893j9999l796N813
11773G532K997J195p780r181n648K0252k391J452j2377P529J4644J7665m116j5369
11759A6404j489J681M083p111j619J6110J9947j1914k0839J269Q680q289J895
11746A8808Q12j7477k2362J8467J5536L379n679j4907L906J1693m237l4452J3757
11733a2756J703J2154n133j8408R362L4147O255j0920J820J6221l546J300J2917
11720D5116J6562j5383j6514j7792j8408j1354j699J1829k162J441Q791J4585
11708A5012j2912o886j0635m897K461j4612P34K3827K1432j5604r180K2158J3537
$$ plain form
11695 24435 21188 13191 8703 22620 24560 12366 -259 -1819 -6427 -15097 9591 25255 14418
11682 14418 13801 -1374 8874 2203 -1571 21194 36043 27152 7413 3277 5553 -4172 -20882
11669 -20882 -28977 -12967 -7121 8243 25921 15894 4883 5087 13775 23137 17521 13042 11247
11656 11247 -8195 -9267 9632 -1209 -9967 2359 594 -14551 -16147 -4070 -189 12058 30882
11643 30882 27179 12104 -6980 2501 18415 22568 33327 41048 22129 18781 38021 51991 59784
11630 59784 96848 121243 132790 131095 109600 95504 86819 53676 55238 47796 63772 84058
11618 84058 107369 122462 118579 87699 61073 55344 58689 50915 57704 69836 82057 85070 86638
11605 86638 101459 124622 124496 125023 138052 111647 91532 85837 80172 36211 21704 28070 38970
$$ packed form
11695B4435l247p997m488J3917J940j2194j2625j560m608q670K4688J5664j0837
11682A4418o17j5175J0248o671l774K2765J4849q891j9739m136K276r725j6710
11669b0882q095J6010N846J5364J7678j0027j1011K04Q688R362n616m479j795
11656A1247j9442j072J8899j0841q758J2326j765j5145j596J2077L881J2247J8824
11643C0882l703j5075j9084R481J5914M153J0759P721j8919l348J9240J3970P793
11630E9784L7064K4395J1547j695k1495j4096q685l3143J562p442J5976K0286
11618H4058K3311J5093l883l0880k6626n729L345p774O789J2132J2221L013J568
11605H6638J4821K3163j26N27J3029k6405k0115n695n665m3961j4507O366J0900
$$ plain form
11592 38970 41892 44813 8781 -3948 22934 36362 39461 48861 37097 36375 50805 77557 99345
11579 99345 119154 143094 165192 183609 160901 163894 157364 116313 68717 60005 67233 63486 67900
11566 67900 57930 81042 89856 87329 101596 84732 77513 72014 41197 27295 31491 23724 31112
11553 31112 25181 27284 46043 37438 22444 24630 38983 55162 55304 34025 28781 25343 13481
11540 13481 12740 12739 21691 38196 55280 68988 72432 62947 47427 38829 28165 35154 41191 48456
11526 48456 51206 69009 78759 65529 56451 67984 60515 46168 47208 71963 82501 82358 61957
11513 61957 57349 52305 38991 51688 51024 19902 -784 8144 10915 34735 46383 52853 35318
11500 35318 12844 -10825 7415 -530 -21447 -29721 -15859 8388 7374 14411 34815 40160 62934
$$ packed form
11592C8970K922K921l6032j2729K6882J3428L099R400j1764p22J4430K6752K1788
11579I9345J9809K3940K2098J8417k2708K993o530m1051m7596q712P228l747M414
11566F7900r970K3112Q814k527J4267j6864p219n499l0817j3902M196p767P388
11553C1112n931K103J8759q605j4994K186J4353J6179J42k1279n244l438j1862
11540A3481p41jQ952J6505J7084J3708L444r485j5520q598j0664O989O037P265
11526D8456K750J7803R750j3230r078J1533p469j4347J040K4755J0538j43k0401
11513F1957m608n044j3314J2697o64l1122k0686Q928K771K3820J1648O470j7535
11500C5318k2474k3669J8240p945k0917q274J3862K4247j014P037K0404N345K2774
$$ plain form
11487 62934 81017 69676 53900 49323 55397 53905 67836 80609 80259 42269 23498 22676 23444
11474 23444 1258 464 10455 22287 36647 38665 42717 37017 8867 -3293 1964 -12145 -18744
11461 -18744 -18456 -29023 -25044 -12156 -441 -931 -22530 -19254 5869 10882 8702 28071 18492
11448 18492 5561 -15151 -5119 16280 23888 33946 41270 42651 34232 8238 -123 14882 31048
11435 31048 16474 24386 39615 21352 32123 23319 24264 8993 6323 7692 8230 12421 -2423
11422 -2423 -26916 -29527 -24889 -15174 -17852 -16159 -23631 -21899 -12501 -2132 8007 19650 19522 3771
11408 3771 -7705 -19816 1264 -1639 -5174 -3890 -6003 -5159 7724 10159 15200 14030 12665 3951
11394 3951 -7880 -3563 -11773 19077 26464 36277 38132 16223 -16282 -20812 -17574 -47746 -62558
$$ packed form
11487F2934J8083j1341j5776m577O074j492J3931J2773l50l7990j8771q22P68
11474B3444k2186p94R991J1832J4360K018M052n700k8150j2160N257j4109o599
11461a8744K88j0567L979J2888J1715m90k1599L276K5123N013k180J9369r579
11448A8492j2931k0712J0032K1399P608J0058P324J381q419k5994q361J5005J6166
11435C1048j4574P912J5229j8263J0771q804R45j5271k670J369N38M191j4844
11422b423k4493k611M638R715k678J693p472J732R398J0369J0139J1643j28j5751
11408C771j1476j2111K1080k903l535J284k113Q44J2883K435N041j170j365q714
11394C951j1831M317q210L0850P387R813J855k1909l2505m530L238l0172j4812
$$ plain form
11381 -62558 -36278 -33348 -19110 -8369 -15404 -4157 2562 7902 5456 -14544 -15065 -3312 -5125
11368 -5125 -13501 -25896 -29148 -27848 -7994 -7043 -10269 -17839 -10498 9440 -512 -13244 -12142 -4027
11354 -4027 14320 28508 -413 -19557 1708 26996 42207 58384 43971 20568 10445 33884
11342 33884 36785 37917 51394 44646 49292 51747 33393 18368 -8750 -30753 -7897 14562 28180
11329 28180 30603 26221 20153 13254 8682 -14549 -6964 -6369 6844 -15283 -33409 -11311 -10420 -13949
11315 -13949 -23111 -39139 -26056 -14746 -18578 -16193 4459 11997 1810 -3601 -2511 13287 -2665
11302 -2665 560 8764 17379 38569 51298 56546 52041 56062 67560 67074 39056 31254 34777 13743
11288 13743 -9614 -38648 -40794 -13319 17719 21867 22597 39796 44313 27691 -5158 -13316 3113
$$ packed form
11381f2558K6280K930J4238J0741p035J1247O719N340k446k0000n21J1753j813
11368e125q376j2395l252J300J9854R51l226p570P341J9938r952j2732J102Q115
11354d027J8347J4188k8921j9144K1265K5288J5211J6177j4413k3403j0123K3439
11342C3884K901J132J3477o748M646K455j8354j5025k7118k2003K2856K2459J3618
11329B8180K423m382o068o899m572k3231P585N95J3213k2127j8126K2098Q91l529
11315a3949r162j6028J3083J1310l832K385K0652P538j0187n411J090J5798j5952
11302b665L225Q204Q615K1190J2729N248m505M021J1498m86k8018p802L523k1034
11288A3743k3357k9034k146K7475L1038M148P30J7199M517j6622l2849q158J6429
$$ plain form
11275 3113 8912 14010 10595 27332 51333 26022 -15537 -16953 3281 -5082 6399 18207 28863
11262 28863 25984 30580 42347 50922 46117 64241 91648 101930 89845 76710 61925 58007 96199
11249 96199 96006 76608 61473 55773 41907 4235 -1969 271 7704 21587 10398 4185 -1645
11236 -1645 9853 27707 10548 -13791 -11589 7511 -1295 -7377 3082 16524 11705 2146 -6234
11223 -6234 -11297 -12985 -16042 2197 8225 5849 3788 29111 4282 18683 33315 37399 19163
11210 19163 15384 19203 11702 28466 54585 57912 52533 41537 56978 51049 46396 57272 34445
11197 34445 38714 30192 17544 24678 14354 -20380 -37436 -44623 -36861 -22545 -22421 -7022 6225
11184 6225 10734 -8968 -43147 -30173 -1627 14970 8124 2231 23847 24566 22593 36276 35759
$$ packed form
11275C113N799N098l415J6737K4001k5311m1559j416K0234q363J1481J1808J0656
11262B8863k879M596J1767Q575m805J8124K7407J0282j2085j3135j4785l918L8192
11249I6199j93j9398j5135n700j3866l7672o204K240P433J3883j1189o213n830
11236a645J1498J7854j7159k4339K202J9100q806o082J0459J3442m819r559q380
11223f234n063j688l057J8239O028k376k061K5323k4829J4401J4632M084j8236
11210A9163l779L819p501J6764K6119L327n379j0996J5441n929m653J0876k2827
11197C4445M269q522j2648P134j0324l4734j7056p187P762J4316J24J5399J3247
11184F225M509j9702l4179J2974K8546J6597o846n893K1616P19j973J3683n17
$$ plain form
11171 35759 31464 16892 -918 -6710 -17771 -13126 -5767 -4535 -3386 -13594 -11779 10095 18654
11158 18654 15439 35370 52851 39254 38417 45153 38390 15062 -5457 1102 11289 7629 19603
11145 19603 32153 20443 -6274 -22554 -13531 6381 15741 -2153 -28720 -37260 -48926 -43213
11133 -43213 -28995 -11947 -9277 -12391 882 13246 19092 16554 21124 17680 9505 26271 35498
11120 35498 42765 38335 19361 12251 15266 -22629 -45076 -35970 -27160 -27733 -894 8391 3581 -6412
11106 -6412 -6057 -26313 -42763 -34820 -28567 -9082 -2284 7357 28193 43811 60587 52502 23132
11093 23132 12186 -3155 -10743 -19985 -18586 -20125 -17458 -7786 -3500 -5892 5136 -11137 -12337
11080 -12337 2230 -509 4851 11564 186 -9843 -3997 -9600 -9449 -4434 -26941 -56715 -50678
$$ packed form
11171C5759m295j4572j7810n792j1061M645P359J232J149j0208J815K1874Q559
11158A8654l215J9931J7481j3597q37O736o763k3328k0519O559J0187l660J1974
11145A9603J2550j1710k6717j6280R023J9912R360j7894k6567q540j1666N713
11133d3213J4218J7048K670l114J3273J2364N846k538M570l444q175J6766R227
11120C5498P267m430j8974p110L015l7895k2447R106Q810n73K6839R285m810r993
11106f412L55k0256j6450P943O253J9485O798R641K0836J5618J6776q085k9370
11093B3132j0946j5341p588r242J399j539K667R672M286k392J1028j6273j200
11080a2337J4567k739N360O713j1378j0029N846n603J51N015k2507k9774O037
$$ plain form
11067 -50678 -30751 -27334 -16068 3080 -2090 -10869 -9645 -629 20071 18249 17424 434 -17440
11054 -17440 -18412 -16180 -6695 -14260 -51902 -41932 -31858 -38156 -26457 10338 16998 1683 3157
11041 3157 6018 -1530 -3473 6626 17272 15479 19931 30978 26454 19722 21274 19401 19858 28153
11027 28153 15459 -914 9380 1514 -23436 -35868 -15008 -25198 -11685 -2290 20201 24869
11015 24869 12472 3096 6788 1152 3259 10093 6608 22364 19800 13828 -1459 10742 25481
11002 25481 29588 30249 21041 3242 2826 59 17455 11761 13200 24506 34017 27645 16726 31713
10988 31713 36244 38084 21672 10072 -970 -8877 8247 28695 16751 16246 6092 -3614 -8614
10975 -8614 -5994 3001 11675 14160 6445 6289 8218 30805 89902 142476 161328 128237 82652
$$ packed form
11067e0678J9927L417J1266J9148n170q779J224R016K0700j822q25j6990j7874
11054a7440r72K232R485p565l7642R970J0074o298J1699L6795O660j5315J474
11041C157K861p548j943J0099J0646j793M452J1047m524o732J552j873M57Q295
11027B8153j2694j6373J0294p866k4950j2432K0860j0190J3513R395K2491M668
11015B4869j2397r376L692n636K107O834l485J5756k564n972j5287J2201J4739
11002B5481M107O61r208j7799m16k767J7396n694J439J1306R511o372j0919J4987
10988C1713M531J840j6412j1600j1042p907J7124K0448j1944n05j0154r706n000
10975h614K620Q995Q674K485p715j56J929K2587N9097N2574J8852l3091m5585
$$ plain form
10962 82652 40735 14460 14412 -2438 -14634 6644 17514 -1234 -27549 -25582 -26657 -24907 1079
10949 1079 7420 21923 27634 11499 7798 24353 35578 28327 13339 25006 47329 37195 17395
10936 17395 18971 15355 20125 19423 11558 -15256 -26281 -10378 -11441 -16906 -22227 -23099 -37459 -25036
10922 -25036 -6168 24320 19406 24527 33536 19898 1921 2906 16895 31766 12819 -7132 -19354
10909 -19354 -30575 -41777 -17411 19735 29840 26436 35208 50326 50680 28673 26709 8646 3205
10896 3205 -12018 -12366 14940 17546 8495 5436 19976 5325 2162 14173 20603 11035 -12498
10883 -12498 -15147 -21769 -17800 -10797 -9818 -21269 -10376 -8764 -14431 17488 24644 6149 -19532
10870 -19532 -33000 -17298 8163 31278 35412 27177 10690 9193 21611 28778 21705 12850 9301
$$ packed form
10962H2652m1917k6275m8j6850j2196K1278J0870j8748k6315J967j075J750K5986
10949A079O341J4503N711j6135l701J6555J1225p251j4988J1667K2323j0134j9800
10936A7395J576l616M770p02p865k6814j1025J5903j063n465n321q72j4360J2423
10922b5036J8868L0488m914N121R009j3638j7977R85J3989J4871j8947j9951j2222
10909a9354j1221j1202K4366L7146J0105l404Q772J5118L54k2007j964j8063n441
10896C205j5223l48K7306K606r051l059J4540j4651l163J2011O430r568k3533
10883a2498k649o622L969P003R79j1451J0893J612n667L1919P156j8495k5681
10870a9532j3468J5702K5461K3115M134q235j6487j497J2418P167p073q855l549
$$ plain form
10857 9301 8306 8087 17078 39989 22824 6710 -18536 -22994 -24711 -1686 9406 -18558 -11551
10844 -11551 -9570 -1255 -13076 -6666 15116 41255 42927 19359 20410 30271 24976 26002 34677
10831 34677 53295 55782 52309 56412 35058 31458 23526 24651 16198 13626 21318 21739 5416 4349
10817 4349 11004 -7885 -18428 9682 14105 -190 4573 21551 10642 -1420 -16086 -14879 -22182
10804 -22182 -12007 949 -2011 -9646 -1548 13418 14736 19804 22138 38403 60446 78869 63695
10791 63695 45741 61878 73982 103875 142931 144168 104038 61423 32468 37107 51278 23502
10779 23502 16732 28503 37300 29123 8687 8367 20289 38215 46832 49498 35455 17456 6756
10766 6756 -3186 1353 4438 9013 26344 59338 70911 53152 26054 3605 18928 35173 47711
$$ packed form
10857I301r95k19Q991K2911j7165j6114k5246m458j717K3025J1092k7964P007
10844a1551J981Q315j1821O410K1782K6139J672k3568J051R861n295J026Q675
10831C4677J8618K487l473M103k1354l600p932J125q453k572P692M21j6323j067
10817D349O655j8889j0543K8110M423j4295M763J6978j0909j2062j4666J207p303
10804b2182J0175J2956k960p635Q098J4966J318N068K334J6265K2043J8423j5174
10791F3695j7954J6137J2104K9893L9056J237m0130m2615k8955M639J4171k7776
10779B3502o770J1771Q797q177k0436l20J1922J7926Q617K666j4043j7999j0700
10766F756r942M539L085M575J7331L2994J1573j7759k7098k2449J5323J6245J2538
$$ plain form
10753 47711 82094 81933 80122 76656 38300 6586 12611 48074 42477 50224 50959 33533 16386
10740 16386 21466 2733 13548 20252 21949 -708 -10404 10377 29765 28603 32155 62434 65905
10727 65905 59138 35033 10079 -1975 319 9658 43172 47964 34938 27448 28931 34895 45695
10714 45695 34315 10730 10129 14034 -12497 -14923 -12775 2776 23650 -1442 -4502 -2596 5998
10701 5998 3950 1421 -5310 -2453 14176 15763 29579 32250 24307 9489 10409 -513 863 702
10687 702 8617 23823 -5284 -8593 832 2307 2594 -3117 -24930 -26632 -26310 -50863 -35018 -21802
10673 -21802 -12838 -13874 -13109 -11276 -3703 9326 19353 7238 -31208 -37779 -25525 -279 3283
10660 3283 -18700 -33409 -3364 17476 24912 689 7763 -5220 -6353 16594 22307 -6088 -7413
$$ packed form
10753D7711L4383j61j811l466l8356l1714O025L5463n597P747P35j7426j7147
10740A6386N080j8733J0815O704J697k2657r696K0781J9388j162L552L0279L471
10727F5905o767k4105k4954j2054K294R339L3514M792j3026p490J483N964J0800
10714D5695j1380k3585o01L905k6531k426K148J5551K0874k5092l060J906Q594
10701E998k048k529o731K857J6629J587J3816K671p943j4818R20j0922J376j61
10687G02P915J5206k9107l309R425J475K87n711k1813j702L22k4553J5845J3216
10673b1802Q964j036P65J833P573J3029J0027j2115l8446o571J2254K5246L562
10660C283k1983j4709L0045K0840P436k4223P074j2983j133K2947N713k8395j325
$$ plain form
10647 -7413 24228 22151 3462 5651 5902 5042 11737 5239 1961 -1219 -8623 18312 46649 59344
10633 59344 50465 22368 24288 35966 37839 39037 60484 68300 63920 63114 72462 103829 106206 60217
10619 60217 28955 20453 24984 25595 49586 56634 68174 73578 70208 82613 100492 150583 156171
10606 156171 134567 121406 90772 46231 23765 39820 33866 26288 27007 39926 41452 30676
10594 30676 19202 10680 12592 19624 25455 12708 9515 14508 -1915 -30871 -24923 -6561 18052
10581 18052 30676 33079 23964 17480 -1483 -894 11984 17027 15621 55109 63837 57074 69623
10568 69623 78220 71065 70039 68570 58447 74124 98421 93540 84656 80064 96108 87197 57355
10555 57355 34337 41141 53286 55183 55649 41049 53348 61572 47881 37982 25868 -711 -3042
$$ packed form
10647g413L1641k077j8689K189K51q60O695o498l278l180p404K6935K8337J2695
10633E9344q879k8097J920J1678J873J198K1447P816m380q06R348L1367K377m5989
10619F0217l1262q502M531O11K3991P048J1540N404l370J2405J7879N0091N588
10606A56171k1604j3161l0634m4541k2466J6055n954p578P19J2919J526j0776
10594C0676j1474q522J912P032N831j2747l193M993j6423k8956N948J8362K4613
10581A8052J2624K403r115o484j8963N89J2878N043j406L9488Q728o763J2549
10568F9623Q597p155j026j469j0123J5677K4297m881q884m592J6044q911k9842
10555E7355k3018O804J2145J897M66j4600J2299Q224j3691r899j2114k6579k331
$$ plain form
10542 -3042 1031 2998 31445 47014 51034 36147 69372 103533 139081 186030 225050 246943
10530 246943 238425 260187 267092 246471 237001 221372 205817 215454 257538 268429 211613 137910
10518 137910 104460 71166 44464 50159 66713 63596 80643 66559 68403 96468 98609 90785
10506 90785 120924 135061 104845 84147 89459 106123 105488 90916 54543 20467 20794 26204 10213
10493 10213 10340 8236 11107 44864 50300 36892 33707 18731 5265 -20515 -17441 7900 44841
10480 44841 48727 35764 36084 25149 26100 27656 38613 51812 54910 53387 52669 36860 33121 24768
10466 24768 30936 32272 40906 39817 27631 -1530 9162 18381 2114 15486 18825 27421 35218
10453 35218 44192 38214 42632 36335 19343 45098 59346 60485 54636 41382 44049 59246 49631
$$ packed form
10542c042M073J967K8447J5569M020j4887L3225L4161L5548M6949L9020K1893
10530B46943q518K1762O905k0621r470j5629j5555R637M2084J0891n6816p3703
10518A37910l3450l3294k6702N695J6554l117J7047j4084J844K8065K141p824
10506I0785L0139J4137l0216k0698N312J6664o35j4572l6373l4076L27N410j5991
10493A0213J27k104K871L3757N436j3408l185j4976j3466k5780L074K5341L6941
10480D4841L886j2963L20j0935R51J556J0957J3199L098j523p18j5809l739q353
10466B4768O168J336Q634j089j2186k9161J0692R219j6267J3372L339Q596P797
10453C5218Q974n978M418o297j6992K5755J4248J139n849j3254K667J5197r615
$$ plain form
10440 49631 19295 13081 27363 29818 28856 29934 26564 21183 31064 13400 6365 28452 34412 5069
10426 5069 1231 18838 35997 29907 22699 -1108 8175 4246 5132 40435 52005 57651 38542
10413 38542 31914 26412 13367 28730 35896 25999 38515 52719 62236 43672 28029 42038 49207
10400 49207 19612 -38706 -41544 -23168 -24151 -17268 -26023 -33443 -30610 -26554 -10360 1417 19066
10387 19066 15039 -11864 -9176 -82 22732 32027 29924 38720 24726 29101 37394 9919 -14973
10374 -14973 -16413 10482 24106 3654 -2325 43461 33669 10384 4028 -4219 1990 6984 17100
10361 17100 21400 28833 13382 8627 19688 7168 3208 -13222 -23086 -33462 -29071 -14159 2584
10348 2584 12903 -1469 -2567 13589 21287 40841 37012 18554 15145 19425 17451 2323 -12404
$$ packed form
10440D9631l0336o214J4282K455r62J078l370n381R881j7664p035K2087N960k9343
10426E069l838J7607J7159o090p208k3807R283l929Q86L5303J1570N646j9109
10413C8542o628n502j3045J5363P166r897J2516J4204R517j8564j5643J4009P169
10400D9207k9595n8318k838J8376r83O883q755p420K833M056J6194J1777J7649
10387A9066m027k6903K688R094K2814R295k103Q796j3994M375Q293k7475k4892
10374a4973j440K6895J3624k0452n979M5786r792k3285o356q247O209M994J0116
10361A7100M300P433j5451m755J1061j2520l960j6430r864j0376M391J4912J6743
10348B584J0319j4372j098J6156P698J9554l829j8458l409M280j974j5128j4727
$$ plain form
10335 -12404 -18996 -13578 -23858 -30342 -19456 -21816 -4944 6277 7356 10514 22467 14269 2848
10322 2848 -9130 6123 -19231 -33287 -19779 -26952 -40448 -33166 -22609 -13900 -10764 -20231 -15425
10309 -15425 -1583 17502 31127 33919 17785 1513 -26730 -44854 -24314 -8543 -30880 -37953
10297 -37953 -7417 14931 -2933 9604 20694 -3035 -20613 -28277 -7895 3566 -2554 -5254
10285 -5254 -23486 -35539 -19180 -868 652 -4576 1955 11384 -9463 -30339 -12605 1802 5626
10272 5626 7590 3416 15791 9294 7794 11354 27658 46533 40435 32110 20908 4810 499
10259 499 -6660 -24444 -10014 29486 19978 -5305 -4555 4549 13402 3666 -8424 -6204 -3425 20041
10245 20041 25963 33896 36858 43103 31864 35425 9308 -3297 -13369 -2481 -20976 -28686 -24126
$$ packed form
10335a2404o592N418j0280o484J0886k360J6872J1221J079L158J1953q198j1421
10322B848j1978J5253k5354j4056J3508p173j3496P282J0557Q709L136r467M806
10309a5425J3842J9085J3625K792j6134j6272k8243j8124K0540J5771k2337p073
10297c7953L0536K2348j7864J2537J1090k3729j7578p664K0382J1461o120k700
10285e254j8232j2053J6359J8312J520n228O531R429k0847k0876J7734J4407L824
10272E626J964m174J2375o497j500L560J6304J8875o098q325j1202j6098m311
10259D99p159j7784J4430L9500r508k5283P50R104Q853r736j2090K220K779K3466
10245B0041N922P933K962O245j1239L561k6117j2605j0072J0888j8495p710M560
$$ plain form
10232 -24126 -34733 -25860 -11225 2275 -2695 4718 14393 -7052 -269 9867 -3557 -14865 8034
10219 8034 8053 15065 22001 42483 34190 33122 19253 -2724 -15530 -8979 -22649 -41684 -36270 -9160
10205 -9160 12586 29448 27131 19716 31662 33967 24269 16095 9425 -4444 -11410 -499 39109
10192 39109 34052 36796 33775 39909 62039 48505 34673 10476 -26670 -24009 1340 25642 66632
10179 66632 69838 78932 81447 77932 70974 55720 37843 19935 1462 711 -4881 -3478 13830
10166 13830 32941 32849 26149 31389 46288 54654 47148 53672 52431 37242 16411 19560 46881 48035
10152 48035 24936 38149 47408 32137 28820 32444 32297 30225 46576 46552 36195 6332 -3070 -7243
10138 -7243 -10757 -4732 -10873 -17179 -21524 -3357 9877 7656 26570 61809 97209 122981 191099
$$ packed form
10232b4126j0607Q873J4635J3500m970P413R675k1445O783J0136j3424j1308K2899
10219H034J9P012O936K0482q293j068j3869k1977j2806O551j3670j9035N414K7110
10205i160K1746J6862k317p415J1946K305r698q174o670j3869o966J0911L9608
10192C9109n057K744l021O134K2130j3534j3832k4197l7146K661K5349K4302M0990
10179F6632L206R094K515l515o958j5254j7877j7908j8473p51n592J403J7308
10166A3830J9111r2o700N240J4899Q366p506O524j241j5189k0831L149K7321J154
10152D8035k3099J3213R259j5271l317L624j47k072J6351k4j0357k9863r402m173
10138g243l514O025o141o306m345J8167J3234k221J8914L5239L5400K5772O8118
$$ plain form
10125 191099 293603 398628 487276 583068 644269 540607 354269 223294 161416 148633
10115 148633 114894 84528 75141 59506 31244 28151 25333 52453 54322 39327 36796 23066
10103 23066 38851 58262 80675 94636 85861 90503 107907 110316 119762 158749 165395 139914 132628
10090 132628 114655 112720 124582 116085 109209 103204 93067 79524 74514 83330 70475 77088 88688
10077 88688 117023 130109 110824 122343 138276 147747 145405 149992 158354 185368 221539 226703 222966
10064 222966 212116 209544 218036 302583 399081 477186 578459 756642 1059414 1586061 2527387
10053 2527387 4078083 5966294 7748181 9919448 11519210 8724668 5113208 3279634
10045 3279634 2398979 1943635 1687687 1548600 1376517 1195474 1044340 928113 837497 783519
$$ packed form
10125A91099J02504J05025Q8648R5792O1201j03662j86338j30975o1878j2783
10115A48633l3739l0366r387j5635k8262l093k818K7120J869j4995k531j3730
10103B3066J5785J9411K2413J3961q775M642J7404K409R446L8987O646k5481p286
10090A32628j7973j935J1862q497o876o005j0137j3543n010Q816j2855O613J1600
10077H8688K8335J3086j9285J1519J5933R471k342M587Q362K7014L6171N164l737
10064B22966j0850k572Q492Q4547R6498P8105J01273J78183L02772N26647R41326
10053B527387J550696J888211J781887K171267J599762k794542l611460j833574
10045C279634q80655m55344k55948j39087j72083j81043j51134j16227r0616n3978
$$ plain form
10035 783519 740556 701483 669136 666401 632884 627055 605890 574087 535227 517911 497838 474143
10023 474143 447225 434725 430581 396415 366916 358277 353128 348052 337506 332916 325422 338705 343050
10010 343050 352255 379388 418664 425354 410310 393579 368003 313947 275470 250477 235881 246055
9998 246055 245616 236703 230689 233688 228827 209557 212360 217838 210507 195694 175269 159270 157662 169230
9984 169230 175893 169674 174548 170617 148355 125156 104145 130413 138874 129840 130769 131747 125816 106895
9970 106895 105800 96184 85972 107229 119310 107244 86317 81356 82230 94157 96833 98075 96273
9957 96273 76582 89341 120037 123254 88039 52950 56639 86352 89158 80586 71352 57675 61361
9944 61361 83998 98432 97209 98025 101219 100728 80134 70453 69870 59310 62437 49212 34852 36111
$$ packed form
10035G83519m2963l9073l2347k735l3517n829k1165l1803l8860j7316k0073k3695
10023D74143k6918j2500m144l4166k9499q639n149n076j0546m590p494J3283M345
10010C43050R205K7133L9276O690j5044j6731k5576n4056l8477k4993j4596J0174
9998B46055m39q913o014K999m861j9270K803N478p331j4813k0425j5999j608J1568
9984A69230O663o219M874l931k2262k3199k1011K6268Q461r034R29R78n931j8921
9970A06895j095r616j0212K1257J2081j2066k0927m961Q74J1927K676J242j802
9957I6273j9691J2759L0696L217l5215l5089L689K9713K806q572r234j3677L686
9944F1361K2637J4434j223Q16L194m91k0594r681n83j0560L127j3225j4360J259
$$ plain form
9930 36111 53309 70802 65010 76116 88146 93042 79698 57915 61529 72925 80026 81452 72600
9917 72600 57967 53572 32582 31804 42050 62518 49594 28804 30518 40458 39524 40613 51498
9904 51498 54984 37813 37521 59937 86871 88512 65724 57599 72918 85630 75991 44853 35604
9891 35604 20577 17127 27449 25455 9118 23873 34919 31488 37973 50837 36654 25343 41710
9878 41710 48160 52794 47721 58952 67547 66665 48554 47385 42707 17029 20370 43000 60810 29256
9864 29256 25561 40908 55710 72318 109188 112692 112496 90351 91714 93104 77026 43834 46726
9851 46726 30615 12340 18637 22034 28831 21083 22754 23693 24870 21609 15553 25518 37184 36466
9837 36466 39605 40572 41291 29549 31900 4275 -10157 -8159 -1559 685 2489 13285 1531 -577
$$ packed form
9930C6111J7198J7493n792J1106J2030M896j3344k1783L614J1396P101J426q852
9917G2600j4633m395k0990p78J0246K0468j2924k0790J714R940r34J089J0885
9904E1498L486j7171k92K2416K6934J641k2788q125J5319J2712r639l1138r249
9891C5604j5027l450J0322j994j6337J4755J1046l431O485J2864j4183j1311J6367
9878D1710O450M634n073J1231Q595q82j8111j169m678k5678L341K2630J7810l1554
9864B9256l695J5347J4802J6608L6870L504j96k2145J363J390j6078l3192K892
9851D6726j6111j8275O297L397O797p748J671R39J177l261o056R965J1666p18
9837C6466L139R67P19j1742K351k7625j4432J998O600K244J804J0796j1754k108
$$ plain form
9823 -577 24329 35846 7500 -428 -1673 -20843 -38163 -38012 -20624 -1876 11195 14012 -101
9810 -101 -26110 -49546 -44780 -21661 -12633 -9296 -137 23529 29805 15746 28303 38685 23017
9797 23017 17004 -4749 13600 13303 -30982 -23626 -37166 -20371 1444 10412 9626 19709 21078
9784 21078 7588 -2813 4216 -17989 -10984 5643 6423 -16626 -3378 13319 13920 19200 7933
9771 7933 9833 -4389 -14072 -12849 -5542 9703 -845 9348 11036 4087 3853 -15923 -30153 -9702
9757 -9702 -3298 -7248 -2690 -3497 -3160 -13742 -25714 -31370 -27115 -24620 -15230 3732 18396 2411
9743 2411 -10519 -11714 8109 7613 12370 17476 1744 -23303 -17159 -4067 -19340 -31564 -16978
9730 -16978 -1014 -5911 -19555 -18708 -25153 -12731 2431 8094 11916 -7513 -3868 15322 15134 11060
$$ packed form
9823e77K4906J1517k8346p928j245j9170j7320J51J7388J8748J3071K817j4113
9810a01k6009k3436M766K3119R028L337R159K3666O276j4059J2557J0382j5668
9797B3017o013k1753J8349k97m4285P356j3540J6795K1815Q968p86J0083J369
9784B1078j3490j0401P029k2205P005J6627P80k3049J3248J6697O01N280j1267
9771G933J900j4222r683J223P307J5245j0548J0193J688o949k34j9776j4230K0451
9757i702O404l950M558q07L37j0582j1972n656M255K495R390J8962J4664j5985
9743B411j2930j195J9823m96M757N106j5732k5047O144J3092j5273j2224J4586
9730a6978J5964m897j3644Q47o445J2422J5162N663L822j9429L645J9190j88m074
$$ plain form
9716 11060 488 9211 -1127 -19712 -20189 -23652 -23737 -3396 5021 -3862 -12346 -8458 6948 16198
9702 16198 -4723 -6963 1242 21080 11702 1072 -15861 -10655 -13375 -5024 3143 -16987 -12640
9689 -12640 -15047 -12144 -10381 2737 -3179 -22751 -13320 -3405 7265 -7342 -14654 -12533 -13578 -17707
9675 -17707 -1982 9485 8814 5875 3025 -10225 -12383 -10225 -3009 8889 33512 28305 3208
9662 3208 -3001 -14540 -25986 -17043 -14474 -13582 -12328 -35503 -19503 6019 9704 7346 -6774 4523
9648 4523 24198 48810 63933 49365 30693 38811 42386 14969 11115 25761 38889 34611 8742
9635 8742 -19186 -29777 -17193 -20454 -7759 10926 26637 9303 7646 9412 19855 33168 41214
9622 41214 24020 15542 3243 5211 30016 37529 18924 3564 851 28341 37577 16465 3035
$$ packed form
9716A1060j0572Q723j0338j8585m77l463q5K0341Q417q883q484L888J5406R250
9702A6198k0921k240Q205J9838r378j0630j6933N206k720Q351Q167k0130M347
9689a2640k407K903J763J3118n916j9572R431R915J0670j4607p312K121j045m129
9675a7707J5725J1467o71k939k850j3250k158K158P216J1898K4623n207k5097
9662C208o209j1539j1446Q943K569Q92J254k3175J6000K5522L685k358j4120J1297
9648D523J9675K4612J5123j4568j8672Q118L575k7417l854J4646J3128m278k5869
9635H742k7928j0591J2584l261J2695J8685J5711j7334j657J766J0443J3313Q046
9622D1214j7194q478j2299J968K4805P513j8605j5360k713K7490R236k1112j3430
$$ plain form
9609 3035 19379 10106 -2173 -568 9710 -3835 -32478 -21641 6363 34189 35704 12281 -1297
9596 -1297 -18222 110 -9411 10366 42517 54218 39456 22508 41315 56459 55684 45951 41325
9583 41325 -13466 -24922 -13170 10051 8579 -14251 -27287 -15055 -3083 16825 23272 27899
9571 27899 16458 -10113 -17503 -22644 -24487 -14040 -7275 -33693 -27754 -23594 -14377 -1706 -2822
9558 -2822 17234 15518 13229 5719 -5372 -1203 27234 21708 -1885 7588 1700 -14513 -3281
9545 -3281 -3634 -7795 -9764 -1206 22 16923 40128 31356 25901 11796 2465 -4196 2872 11066
9531 11066 -10086 3372 -5473 1608 3 3636 14029 21114 41217 48756 39341 16898 -1202
9518 -1202 4501 10889 31269 38253 37906 27824 15482 16989 29628 37384 20513 11433 4496 2661
$$ packed form
9609C035J6344r273j2279J605J0278j3545k8643J0837K8004K7826J515k3423j3578
9596a297j6925J8332r521J9777L2151J1701j4762j6948J8807J5144p75r733m626
9583D1325n4791j1456J1752K3221j472k2830j3036J2232J1972J9908O447M627
9571B7899j1441k6571p390n141j843J0447O765k6418N939M160R217J2671j116
9558b822K0056j716k289p510j1091M169K8437n526k3593R473n888j6213J1232
9545c281l53m161j969Q558J228J6901K3205q772n455j4105r331o661P068Q194
9531A1066k1152J3458q845P081j605L633J0393P085K0103P539r415k2443j8100
9518a202N703O388K0380O984l47j0082j2342J507J2639P756j6871r080o937j835
$$ plain form
9504 2661 -11302 -21685 -14004 541 -958 -334 -1561 -6535 -14533 -12162 -14120 -27032 -38761 -35144
9490 -35144 3387 19486 508 -22398 1139 2996 10441 6790 3152 8242 11345 12810 -5101
9477 -5101 18864 33447 25818 34785 18299 -11888 -29157 -26985 -14850 -640 -14605 -26758 -19690
9464 -19690 -8511 12984 26654 15284 -1871 -8700 -10861 -20281 -11657 -8786 -29183 -13720 3018
9451 3018 17588 11130 267 7392 4489 -732 5367 18666 10513 11191 18498 26526 -379 -1401
9437 -1401 17764 25566 24357 20476 15022 4407 23952 41445 47944 40171 40975 56000 42642 23111
9423 23111 31109 44987 56947 54751 34660 44453 55675 42774 22139 9470 30054 23679 28234
9410 28234 17421 27821 29605 26778 27136 41243 28965 28669 14871 13794 -3903 -947 6587 2479
$$ packed form
9504B661j3963j0383P681J4545j499O24j227m974p998K371j958j2912j1729L617
9490c5144L8531J6099j8978k2906K3537J857P445l651l638N090L103J465j7911
9477e101K3965J4583p629Q967j6486l0187j7269K172J2135J4210j3965j2153P068
9464a9690J1179K1495J3670j1370j7155o829k161r420Q624K871k0397J5463J6738
9451C018J4570o458j0863P125k903n221O099J3299q153O78P307Q028k6905j022
9437a401J9165P802j209l881n454j0615J9545J7493O499p773Q04J5025j3358j9531
9423B3111P998J3878J1960k196k0091R793J1222j2901k0635j2669K0584o375M555
9410B8234j0813J0400J784k827L58J4107j2278k96j3798j077j7697K956P534m108
$$ plain form
9396 2479 22806 23727 16291 14899 -9353 -14498 6605 18661 22337 26488 26887 19741 28436 50915
9382 50915 54484 38166 8364 4751 5202 2680 15131 10221 -2577 -16244 -32439 -16660 -1849
9369 -1849 -2582 9890 21906 28774 37229 31782 42307 39743 36588 37446 21792 10643 15205 23371
9355 23371 16298 10673 3586 158 7774 12477 17577 33080 43313 50662 62934 63723 52637 43516
9341 43516 53197 50181 28154 14272 10746 9197 6233 11665 21676 15140 13013 20617 20082 25963
9327 25963 26143 15010 2657 19769 45876 45490 52317 55538 42466 45243 58719 46967 38475
9314 38475 34516 26071 18584 23220 26590 25543 49811 40963 30265 26337 20807 14821 20823 2843
9300 2843 6780 10563 11199 18441 18046 7959 18103 20323 3749 11714 19152 28495 21050 9225
$$ packed form
9396B479K0327R21p436j392k4252n145K1103J2056L676M151L99p146Q695K2479
9382E0915L569j6318k9802l613M51k522J2451m910j2798j3667j6195J5779J4811
9369a849p33J2472J2016O868Q455n447J0525k564l155Q58j5654j1149M562Q166
9355B3371p073n625p087l428P616M703N100J5503J0233P349J2272P89j1086r121
9341D3516R681l016k2027j3882l526j549k964N432J0011o536k127P604n35N881
9327B5963J80j1133j2353J7112K6107l86O827L221j3072K777J3476j1752q492
9314C8475l959q445p487M636L370j047K4268q848j0698l928n530n986O002j7980
9300B843L937L783O36P242l95j0087J0144K220j6574P965P438R343p445j1825
$$ plain form
9286 9225 3075 8115 9621 8566 16634 30067 34474 49287 52909 64879 64442 68438 45802 46809
9272 46809 56132 48984 51346 42346 34142 20677 29081 22704 19262 20541 35327 18712 17265 19851
9258 19851 17987 49578 69277 52275 46205 45363 45135 39516 53621 63149 75780 74635 95674 94549
9244 94549 99788 83631 74541 75518 71328 68535 57382 49165 73310 79115 84325 57948 41150 39327
9230 39327 59534 60041 53409 60017 40760 47699 76432 57664 45810 59327 55942 67475 64539
9217 64539 44746 56688 57240 47474 34542 28594 21093 17045 36946 49670 52905 61412 74477
9204 74477 98145 108363 81609 60538 67437 91583 102521 106810 97171 69388 77253 91844 77166
9191 77166 80886 77505 92316 98109 86462 75161 58429 48745 58165 60071 56831 67196 59048
$$ packed form
9286I225o150N040J506j055Q068J3433M407J4813L622J1970m37L996k2636J007
9272D6809R323p148K362r000q204j3465Q404o377l442J279J4786j6615j447K586
9258A9851j864L1591J9699j7002o070q42k28n619J4105R528J2631j145K1039j125
9244I4549N239j6157r090R77m190k793j1153q217K4145N805N210k6377j6798j823
9230C9327K0207N07o632O608j9257O939K8733j8768j1854J3517l385J1533k936
9217F4539j9793J1942N52r766j2932n948p501m048J9901J2724L235Q507J3065
9204G4477K3668J0218k6754k1071O899K4146J0938M289r639k7783P865J4591j4678
9191G7166L720l381J4811N793j1647j1301j6732r684R420J906l240J0365q148
$$ plain form
9178 59048 79955 72021 61778 53712 76057 107169 114968 98147 102205 104289 88289 87694 76822
9165 76822 76959 89267 73087 77769 95500 90908 99571 102678 100122 101931 100048 95826 101468 103203
9151 103203 131006 150087 172819 174451 181683 193253 211565 207604 208882 224371 244826 244319 246910
9138 246910 268755 289385 299686 349949 400440 444860 479620 558608 674581 814560 988437
9127 988437 1218282 1543361 1981066 2628205 3571551 4840555 6320489 7836336 9184708
9118 9184708 9867267 9191620 7433627 5610879 4255851 3359855 2756745 2325506 1989669
9109 1989669 1763071 1575327 1436385 1320900 1248663 1151697 1053227 976774 919461 890015 844833
9098 844833 804713 784459 759525 729964 697285 663489 652337 639843 629215 602255 577432 555786
$$ packed form
9178E9048K0907p934j0243q066K2345L1112P799j6821M058K084j6000n95j0872
9165G6822J37J2308j6180M682J7731m592Q663L107k556J809j883m222N642J735
9151A03203K7803J9081K2732J632P232J1570J8312l961J278J5489K0455n07K591
9138B46910K1845K0630J0301N0263N0491M4420L4760P8988J15973J39979J73877
9127I88437K29845L25079M37705O47139R43346J269004J479934J515847J348372
9118I184708O82559o75647j757993j822748j355028q95996o03110m31239l35837
9109A989669k26598j87744j38942j15485p2237r6966r8470p6453n7313k9446m5182
9098H44833m0120k0254k4934k9561l2679l3796j1152j2494j0628k6960k4823k1646
$$ plain form
9086 555786 550816 542064 518287 503238 484709 475319 447688 431552 436663 456467 443977 402828
9074 402828 388418 373261 354354 335406 337787 321449 316559 321932 323535 319206 313267 313392 293588
9061 293588 274921 271415 272462 276374 258743 256294 264279 275726 264226 242558 230258 221979 218955
9048 218955 227203 209590 207568 211502 236139 245130 231646 217599 226674 250241 235526 218714 209267
9035 209267 218787 219159 212310 205003 171710 159045 155188 144874 145592 128421 120113 116752 115174 131474
9021 131474 121771 147119 147920 135283 133058 148747 157685 149209 155234 182511 174215 188355 218108
9008 218108 188466 158189 155684 134159 108443 117689 161841 164089 150891 142565 147716 160809 153559
8995 153559 165971 165988 163123 160672 150875 169630 174844 169486 171183 152141 144093 155919 164129 168091
$$ packed form
9086E55786m970q752k3777j5049j8529r390k7631j6136N111J9804j2490m1149
9074D02828j4410j5157j8907j8948K381j6338m890N373J603m329n939J25j9804
9061B93588j8667l506J047L912j7631k449P985J1447j1500k1668j2300q279l024
9048B18955Q248j7613k022L934K4637Q991j3484j4047R075K3567j4715j6812r447
9035B09267R520L72o849p307l3293j2665l857j0314P18j7171q308l361j578J6300
9021A31474r703K5348Q01j2637k225J5689Q938q476O025K7277q296J4140K9753
9008B18108k9642l0277k505k1525k5716R246M4152K248j3198q326N151J3093p250
8995A53559J2412J7k865k451r797J8755N214n358J697j9042q048J1826Q210L962
$$ plain form
8981 168091 143223 111616 116104 116453 141274 156129 141680 133236 116519 119461 134750 135503 119970
8968 119970 105433 101595 96648 109935 123775 142978 142658 136214 108276 73195 65225 70541 73420
8955 73420 100965 126219 122772 129495 157340 175084 183540 179922 147617 130919 134402 130839 132649
8942 132649 133746 139730 144600 151053 135402 140852 149122 124431 92458 85798 118718 122408 122095 132760
8928 132760 119977 104762 115918 138414 142055 136867 148436 153354 152461 138339 108737 92212 112019
8915 112019 124751 109389 86006 77968 114709 123095 135513 140371 147350 143978 149777 160154 158945
8902 158945 156956 164805 167583 172351 195059 207955 212002 213958 197139 157963 129640 123053 107668
8889 107668 104636 99011 91682 80143 58764 52073 53972 57660 57339 64589 74456 71071 60958 65031
$$ packed form
8981A68091k4868l1607M488L49K4821J4855j4449q444j6717K942J5289P53j5533
8968A19970j4537l838m947J3287J3840J9203l20o444k7938l5081p970N316K879
8955G3420K7545K5254l447O723K7845J7744Q456l618l2305j6698L483l563J810
8942A32649J097N984M870O453j5651N450Q270k4691l1973o660L2920L690l13J0665
8928A32760j2783j5215J1156K2496L641n188J1569M918q93j4122k9602j6525J9807
8915A12019J2732j5362k3383q038L6741Q386J2418M858O979l372N799J0377j209
8902A58945j989P849K778M768K2708J2896M047J956j6819l9176k8323o587j5385
8889A07668l032n625p329j1539k1379o691J899L688l21P250R867l385j0113M073
$$ plain form
8875 65031 70421 60793 89040 101059 91337 85153 81740 86454 102513 104317 104352 107885 89245 92798
8861 92798 104356 102882 99100 117622 132383 130500 137116 178723 257337 307501 331802 333483 325262
8848 325262 291709 264593 212624 155885 114347 95944 129070 138570 105101 92646 94953 79885
8836 79885 71832 70322 76730 105027 107487 82540 83269 76974 75350 64422 64885 68853 80399 101771
8822 101771 107239 127757 125446 110574 115694 108151 116115 108822 102324 78737 76830 91115 99162
8809 99162 76195 86604 122959 141669 194282 232583 243427 216296 192993 174061 140280 116168
8797 116168 100263 98598 108787 118189 127665 136427 122483 112461 103021 109241 150735 167557 154033
8784 154033 139557 124536 115750 124054 137562 107481 77100 86150 96369 93061 77406 87612
$$ packed form
8875F5031N390r628K8247J2019r722o184l413M714J6059J804L5L533j8640L553
8861I2798J1558j474l782J8522J4761j883O616M1607P8614N0164K4301J681q221
8848C25262l3553k7116n1969n6739m1538j8403L3126R500l3469j2455K307j5068
8836G9885q053j510O408K8297K460k4947P29o295j624j0928M63L968J1546K1372
8822A01771N468K0518k311j4872N120p543P964p293o498k3587j907J4285Q047
8809I9162k2967J0409L6355J8710N2613L8301J0844k7131k3303j8932l3781k4112
8797A16168j5905j665J0189R402R476Q762j3944j0022r440O220M1494J6822j3524
8784A54033j4476j5021q786Q304J3508l0081l0381R050J0219l308j5655J0206
$$ plain form
8772 87612 114828 123663 120413 115199 97541 83619 77490 85836 83893 53238 40855 63195 89666
8759 89666 94759 103063 102212 106989 105673 99806 105727 93758 108881 118355 121814 148638 158734 156346
8745 156346 153122 161358 135956 106802 118895 152179 144590 126726 118067 125775 110410 80483 62680
8732 62680 66809 64094 89099 104864 113536 125008 146922 157081 169642 176786 163802 166516 174131
8719 174131 183885 166412 186541 157625 103285 90241 98614 116287 134195 158076 173178 169676
8707 169676 170910 154704 145275 151160 153355 144077 132568 139197 151183 141411 139123 156054 149339
8694 149339 130911 152491 158511 171862 171069 178019 170867 164934 177132 175730 177272 201205 215082
8681 215082 202110 194878 194051 196017 196430 180280 173747 184977 188907 168980 168154 171784 153668 168656
$$ packed form
8772H7612K7216Q835l250n214j7658j3922o129Q346j943l0655j2383K2340K6471
8759H9666N093Q304q51M777j316n867N921j1969J5123R474L459K6824J0096k388
8745A56346l224Q236k5402k9154J2093L3284p589j7864q659P708j5365k9927j7803
8732F2680M129k715K5005J5765Q672J1472K1914J0159J2561P144j2984K714P615
8719A74131R754j7473K0129k8916n4340j3044Q373J7673J7908K3881J5102l502
8707A69676J234j6206r429N885K195r278j1509O629J1986r772k288J6931o715
8694A49339j8428K1580O020J3351p93O950p152n933J2198j402J542K3933J3877
8681B15082j2972p232q27J966M13j6150o533J1230L930j9927q26L630j8116J4988
$$ plain form
8667 168656 151145 150143 179071 199831 221879 242457 239329 251939 259648 251787 264613 275099
8655 275099 263429 256714 265521 271329 273788 283741 278707 277098 287441 285595 246794 223822 221125
8642 221125 223595 241790 242824 261592 277188 266775 255880 248155 245588 244915 273769 273800 261327
8629 261327 272477 285722 288581 293981 310886 310509 309927 302295 316433 330084 340410 362874 379138
8616 379138 410960 431174 423890 439073 447929 459650 476907 506361 530451 567077 589894 605033
8604 605033 644001 702498 752062 791366 822590 873275 941953 1001944 1046233 1108243 1186202 1231129
8592 1231129 1268039 1252943 1239190 1223551 1153533 1069274 983807 910618 845434 788156 740307
8581 740307 717034 675529 648930 639729 618465 570232 513405 475917 449239 452415 443921 418587
$$ packed form
8667A68656j7511j002K8928K0760K2048K0578l128J2610P709p861J2826J0486
8655B75099j1670o715Q807N808K459R953n034j609J0343j846l8801k2972k697
8642B21125K470J8195J034J8768J5596j0413j0895p725k567o73K8854L1j2473
8629B61327J1150J3245K859N400J6905l77n82p632J4138J3651J0326K2464J6264
8616C79138L1822K0214p284J5183Q856J1721J7257K9454K4090L6626K2817J5139
8604F05033L8968N8497M9564L9304L1224N0685O8678N9991M4289O2010P7959M4927
8592A231129L6910j5096j3753j5639p0018q4259q5467p3189o5184n7278m7849
8581G40307k3273m1505k6599r201k1264m8233n6827l7488k6678L176q494k5334
$$ plain form
8569 418587 416218 406334 404537 400495 392669 380856 365967 368539 394867 404096 406799 378168 350738
8556 350738 353302 357263 355643 336734 296012 304323 328046 323172 293667 272771 288268 290840 308004
8543 308004 328611 357396 356149 352981 358780 347925 327002 298531 274687 274696 287438 284939 271556
8530 271556 270373 269478 239122 218201 214338 211475 209249 225017 236713 238126 229047 217573 236946
8517 236946 231900 233535 228145 218088 195590 203677 215097 210347 211002 209661 193316 191477 184499 181668
8503 181668 182562 184629 171155 171059 167852 160355 162485 175270 197998 180966 167467 165605 163745 133590
8489 133590 126799 125398 167960 184040 167853 175201 176322 154517 157384 152753 136014 134661 152347
8476 152347 163114 147477 131498 132158 145088 159472 139664 139517 160497 153668 142725 140242 148004
$$ packed form
8569D18587k369r884j797m042p826j1813j4889K572K6328R229K703k8631k7430
8556C50738K564L961j620j8909m0722Q311K3723m874k9505k0896J5497K572J7164
8543C08004K0607K8785j247l168N799j0855k0923k8471k3844RJ2742k499j3383
8530B71556j183q95l0356k0921l863k863k226J5768J1696J413r079j1474J9373
8517B36946n046J635n390j0057k2498Q087J1420m750O55j341j6345j839o978k831
8503A81668Q94K067j3474r6l207p497K130J2785K2728j7032j3499j862j860l0155
8489A33590o791j401M2562J6080j6187P348J121k1805K867m631j6739j353J7686
8476A52347J0767j5637j5979O60J2930J4384j9808j47K0980o829j0943k483P762
$$ plain form
8463 148004 141525 146181 153140 146643 138253 137968 144041 132441 129642 115626 124123 131291 138587 132124
8449 132124 123680 125685 124511 112838 117853 130854 129204 101384 117005 132071 111628 93022 108693
8436 108693 125295 121319 131275 112907 83055 62151 74288 83121 80591 83651 103947 101856 81509
8423 81509 85404 108222 107461 105570 103342 111162 113442 104458 85812 78700 94426 82324 71323 78302
8409 78302 83736 84336 129963 152336 133264 112907 67977 53115 52547 62747 85371 89068 84764
8396 84764 79642 97746 89697 71766 60259 78201 88187 91724 106174 106771 88926 85661 62899
8383 62899 52777 62791 58542 50753 44638 36560 40232 74222 83926 74215 82247 93860 97434 98042
8369 98042 66648 66997 80099 79803 102299 115051 94655 100084 117726 112767 95638 70151 63528
$$ packed form
8463A48004o479M656O959o497q390k85O073j1600k799j4016Q497P168P296o463
8449A32124q444K005j174j1673N015J3001j650k7820J5621J5066k0443j8606J5671
8436A08693J6602l976R956j8368k9852k0904J2137Q833k530L060K0296k091k0347
8423H1509L895K2818p61j891k228P820K280q984j8646p112J5726j2102j1001O979
8409G8302N434O00M5627K2373j9072k0357m4930j4862n68J0200K2624L697m304
8396H4764n122J8104q049j7931j1507J7942R986L537J4450N97j7845l265k2762
8383F2899j0122J0014m249p789o115q078L672L3990R704r711Q032J1613L574O08
8369I8042l1394L49J3102k96K2496J2752k0396N429J7642m959j7129k5487o623
$$ plain form
8356 63528 69908 91297 96076 76094 74252 77536 72304 60005 65613 77239 83916 72595 57639
8343 57639 57517 73464 76546 67322 64189 56911 65694 62823 47138 56096 60190 64219 72259 113754
8329 113754 119792 103152 91318 87641 86846 93522 97077 94001 83616 74048 60374 64044 75714
8316 75714 97303 91228 83158 64541 56227 73283 81029 53244 29924 49583 45043 61607 66771
8303 66771 72523 70966 48663 47821 57920 33771 27788 55340 85909 82560 64232 49041 65113
8290 65113 71056 84988 71393 64313 79457 81110 70220 72610 68473 70293 70800 82788 87469 63109
8276 63109 28884 44185 72727 75726 83604 90147 87254 85355 82146 107096 96289 70660 75081
8263 75081 93879 97564 118096 114790 96060 70492 55507 60674 69236 61262 61325 77055 74612 77338
$$ packed form
8356F3528O380K1389M779j9982j842L284n232j2299N608J1626O677j1321j4956
8343E7639j22J5947L082r224l133p278Q783k871j5685Q958M094M029Q040M1495
8329A13754O038j6640j1834l677p95O676L555l076j0385r568j3674L670J1670
8316G5714K1589o075q070j8617q314J7056P746k7785k3320J9659m540J6564N164
8303F6771N752j557k2303q42J0099k4149n983K7552L0569l349j8328j5191J6072
8290F5113N943J3932j3595p080J5144J653j0890K390m137J820N07J1988M681k4360
8276F3109l4225J5301K8542K999P878O543k893j899l209K4950j0807k5629M421
8263G5081J8798L685K0532l306j8730k5568j4985N167Q562p974O3J5730k443K726
$$ plain form
8249 77338 62287 56645 31930 28756 18789 30792 63205 82320 65171 46052 18328 9620 48967
8236 48967 62735 51269 66203 66598 62317 49956 50311 48164 24130 17622 23743 17898 18171 258
8222 258 13371 41968 33657 12784 18578 31197 34745 31361 28889 53477 37832 41231 51744
8209 51744 32396 28716 25784 18860 26905 25798 43829 62116 55881 39465 22588 13523 23938
8196 23938 40272 27936 27978 23446 32195 33532 24828 34308 60953 68102 65855 55389 32235 43017
8182 43017 37069 13914 20836 40762 26707 29851 52975 46625 31525 35825 45098 57437 50751
8169 50751 45082 40326 33405 12617 4108 7772 13370 19754 30384 20281 25141 39560 34585 33215
8155 33215 36414 30505 18338 -5728 -8836 2814 18970 24318 30188 35934 38582 16065 26716
$$ packed form
8249G7338j5051n642k4715l174r967J2003L2413J9115j7149j9119k7724q708L9347
8236D8967J3768j1466J4934L95m281j2361L55k147k4034o508O121n845K73j7913
8222B58J3113K8597q311k0873N794J2619L548l384k472K4588j5645L399J0513
8209E1744j9348l680k932o924Q045j107J8031J8287o235j6416j6877r065J0415
8196B3938J6334j2336M2m532Q749J337q704R480K6645P149k247j0466k3154J0782
8182D3017n948k3155O922J9926j4055L144K3124o350j5100M300R273J2339o686
8169E0751n669m756o921k0788q509L664N598O384J0630j0103M860J4419m975j370
8155C3215L199n909j2167k4066l108J1650J6156N348N870N746K648k2517J0651
$$ plain form
8142 26716 42061 45994 72609 71089 58795 49714 37514 45085 43993 45431 54862 31783 9454
8129 9454 24959 54160 77142 97735 111638 88950 79481 76098 64331 74150 79858 80056 75765
8116 75765 73657 88598 74005 58330 45377 29942 39356 31349 33471 40531 53112 56068 38871
8103 38871 50480 59679 64103 60249 54381 53641 61916 80048 90932 104277 91988 90963 86249 102977
8089 102977 125413 113190 101014 100587 101977 91438 96894 85751 74841 74938 77996 85595 90786 98512
8075 98512 89478 73545 56960 46172 52187 69344 63162 67870 71262 81048 80770 122724 147747
8062 147747 116719 90271 78458 84089 97238 110959 102380 123462 132884 154900 174829 160710
8050 160710 129236 108457 127513 141459 136047 152112 134417 116615 118187 146532 159867 171037
$$ packed form
8142B6716J5345L933K6615j520j2294r081j2200P571j092J438R431k3079k2329
8129I454J5505K9201K2982K0593J3903k2688r469l383j1767R819N708J98m291
8116G5765k108J4941j4593j5675j2953j5435R414q007K122P060J2581K956j7197
8103C8871J1609R199M424l854n868p40Q275J8132J0884J3345j2289j025m714J6728
8089A02977K2436j2223j2176m27J390j0539N456j1143j0910R7L058P599N191P726
8075I8512r034j5933j6585j0788O015J7157o182M708L392R786k78M1954K5023
8062A47747l1028k6448j1813N631J3149J3721q579K1082R422K2016J9929j4119
8050A60710l1474k0779J9056J3946n412J6065j7695j7802J572K8345J3335J1170
$$ plain form
8038 171037 194877 205211 191030 180276 148423 155406 156133 152425 138253 149709 144157 135784 140295
8025 140295 136442 145767 129069 142054 151505 152742 156793 142044 148423 150447 151426 157458 169101 149715
8011 149715 133108 119102 134401 158599 171558 171679 199099 241752 266155 307090 334522 335125
7999 335125 330219 336251 320092 287078 253623 256217 247016 219294 201236 191014 202822 215644
7987 215644 207295 206523 199315 188325 186736 165953 155199 163447 180099 172639 185898 200739 210110
7974 210110 226525 230404 202386 192048 208861 236750 270173 286763 284368 294052 293352 311378 336653
7961 336653 370386 363871 382239 400297 374195 365286 363691 354799 350427 341297 348952 346806 324099
7948 324099 320543 299335 265229 265981 267434 238393 229401 236140 231436 233594 222199 202803 188420
$$ packed form
8038A71037K3840J0334j4181j0754l1853O983P27l708j4172J1456n552q373M511
8025A40295l853R325j6698J2985R451J237M051j4749O379K024R79O032J1643j9386
8011A49715j6607j4006J5299K4198J2959J21K7420M2653K4403M0935K7432O03
7999C35125m906O032j6159l3014l3455K594r201k7722j8058j0222J1808J2822
7987B15644q349p72p208j0990j589k0783j0754Q248J6652p460J3259J4841R371
7974B10110J6415L879k8018j0338J6813K7889L3423J6590k395R684p00J8026K5275
7961C36653L3733o515J8368J8058k6102q909j595q892m372r130P655k146k2707
7948C24099l556k1208l4106P52J453k9041q992O739m704K158j1395j9396j4383
$$ plain form
7935 188420 189982 181369 189702 198473 193927 200278 231841 227902 241363 260372 276265 252477 264412
7922 264412 283100 277647 253775 232807 231045 233168 206598 197468 202742 216816 222479 225982 212888
7909 212888 207810 199600 200607 191736 181964 175091 139629 138866 139030 120056 110368 132461 111325 105813
7895 105813 109482 125320 126079 125737 102535 81275 91759 91594 77401 59655 41509 44085 55584
7882 55584 73710 114225 125489 113413 119994 116369 83416 65976 67068 81567 68290 65304 81166
7869 81166 88115 69398 84008 73106 67267 69621 63559 64913 62010 59190 80628 68315 49400
7856 49400 48302 47061 41822 60834 63111 66028 38539 28569 45696 76902 76856 56790 61648 63945
7842 63945 74974 79128 43898 34249 39423 32698 28557 29400 33694 43185 53603 40226 38292 59641
$$ packed form
7935A88420J562q613Q333Q771m546O351L1563l939J3461J9009J5893k3788J1935
7922B64412J8688n453k3872k0968j762K123k6570r130N274J4074N663L503j3094
7909B12888n078q210J007q871r772o873l5462p63J64j8974r688K2093k1136n512
7895A05813L669J5838P59l42k3202k1260J0484j65j4193j7746j8146K576J1499
7882E5584J8126M0515J1264j2076O581l625l2953j7440J092J4499j3277k986J5862
7869H1166O949j8717J4610j0902n839K354o062J354k903k820K1438j2313j8915
7856D9400j098j241n239J9012K277K917k7489r970J7127L1206m6k0066M858K297
7842F3945J1029M154l5230r649N174o725m141Q43M294R491J0418j3377j934K1349
$$ plain form
7828 59641 49816 42092 44147 65780 62158 64163 59681 60162 59663 58309 48546 47152 32990 13419
7814 13419 -1836 10478 2271 5053 -2966 14688 32758 43887 39023 32625 1529 -7794 5928
7801 5928 35885 34106 10997 -3300 19527 28259 17001 6293 6529 -1158 6082 9088 8785 19884
7787 19884 13978 22478 29280 20498 3904 18258 30291 25227 28103 25410 27785 18877 24169 21256
7773 21256 21463 24680 6051 8031 6911 -12506 -24209 -23527 -13703 -3639 -11524 -217 9171 -98
7759 -98 295 11717 28436 31782 12330 -9062 -7218 -15514 -16451 -14096 -14908 -2094 -3789 16409 10477
7744 10477 9248 15152 2732 6788 -5403 -22305 -19425 7574 -3328 -23122 -993 -1179 -12355
7731 -12355 -28478 -32997 -20611 8314 23562 35257 51514 53721 58414 54114 34949 26401 33918
$$ packed form
7828E9641r825p724K055K1633l622K005m482M81m99j354r763j394j4162j9571
7814A3419j5255J2314q207K782q019J7654J8070J1129m864o398l1096r323J3722
7801E928K9957j779k3109j4297K2827Q732j1258j0708K36p687P240L006l03J1099
7787A9884n906Q500O802q782j6594J4354J2033n064K876k693K375q908N292k913
7773B1256K07L217j8629J980j120j9417j1703O82R824J0064p885J1307R388r269
7759i8L93J1422J6719L346j9452k1392J844q296r37K355q12J2814j695K0198n932
7744A0477j229N904j2420M056j2191j6902K880K6999j0902j9794K2129j86j1176
7731a2355j6123m519J2386K8925J5248J1695J6257K207M693m300j9165q548P517
$$ plain form
7718 33918 30293 44598 50508 29251 -6368 -29803 -18059 4755 5222 -3352 -860 -17028 -35374
7705 -35374 -30255 -11775 6245 21874 41654 62298 51094 10615 -23159 -11248 15118 22302
7693 22302 16556 16564 22464 2560 -22371 -30976 -15221 -5772 12272 23559 26531 19411 -6341 -8509
7679 -8509 -7643 -15945 -8846 4442 -6540 -37747 -43940 -26925 -9615 -14650 -15432 -6811 -15835 -30275
7665 -30275 -25710 -10895 -10668 -17780 -24726 -14942 -1800 -8903 -23171 -27356 -33036 -19133 202 6964
7651 6964 13799 37629 31709 18717 12726 2564 -1129 11802 4186 -8008 -6957 -21153 -13970
7638 -13970 -30066 -13550 20141 22323 2356 10809 27695 20308 17693 26944 23679 11263 -5835
7625 -5835 -10713 -20441 -16499 -3220 7146 18393 14046 17421 -3955 3196 32692 16476 -8084
$$ packed form
7718C3918l625J4305N910k1257l5619k3435J1744K2814M67q574K492j6168j8346
7705c5374N119J8480J8020J5629J9780K0644j1204m0479l3774J1911K6366P184
7693B2302n746QN900j9904k4931q605J5755R449J8044J1287K972p120k5752k168
7679h509Q66q302P099J3288j0982l1207o193J7015J7310n035p82Q621r024j4440
7665c0275M565J4815K27p112o946R784J3142p103j4268m185n680J3903J9335O762
7651F964O835K3830n920j2992n991j0162l693J2931p616j2194J051j4196P183
7638a3970j6096J6516L3691K182j9967Q453J6886p387k615R251l265j2416j7098
7625e835m878r728L942J3279J0366J1247m347L375k1376P151K9496j6216k4560
$$ plain form
7612 -8084 -10197 -17306 -28732 -32075 -11426 -16527 -41380 -23365 -26687 -7789 27470 44450 38734
7599 38734 32466 28514 15688 14621 27291 7969 -3627 -2843 7018 22239 14040 5627 7585 -1621
7585 -1621 -9024 -15596 -22135 -28329 -46019 -44537 -27173 -11482 -7556 -16522 -17952 -22089 -18400 -5634
7571 -5634 407 2621 -5878 -12349 -7884 -1865 -11003 -24115 -21799 1176 22627 19338 3055 17424
7557 17424 12840 -4715 -27 4375 -326 9774 11460 13471 582 -10528 -16601 -12689 -890
7544 -890 1503 -7334 -32245 -30129 -26006 -49368 -47448 -41832 -26758 -20600 -43647 -53262 -58972 -42264
7530 -42264 -16766 -10178 -15363 -12217 -10812 -27415 -33403 -14393 -1397 -6406 425 10186 12283 324
7516 324 8590 -6325 -26471 -23163 -7779 -6907 -18677 -26924 -22812 -31068 -9730 -19123 -19902 -26327
$$ packed form
7612h084k113p109j1426l343K0649n101k4853J8015l322J8898L5259J6980n716
7599C8734o268l952j2826j067J2670j9322j1596P84R861J5221q199q413J958r206
7585a621p403o572o539o194j7690J482J7364J5691L926q966j430m137L689J2766
7571e634O041K214q499o471M465O019r138j3112K316K2975K1451l289j6283J4369
7557A7424m584j7555M688M402m701J0100J686K011j2889j1110o073L912J1799
7544h90K393q837k4911K116M123k3362J920N616J5074O158k3047r615n710J6708
7530d2264K5498O588n185L146J405j6603n988J9010J2996n009O831R761K097j1959
7516C24Q266j4915k0146L308J5384Q72j1770q247M112q256K1338r393p79o425
$$ plain form
7502 -26327 -23247 -21939 -26908 -8739 9789 29580 27246 27110 5248 -3665 13627 6772 -6706
7489 -6706 -10716 1774 10239 5490 -2847 -3051 -13524 -33081 -16908 616 -2657 -6085 -13277 -39041
7475 -39041 -31918 -30205 -12473 -64 4436 9542 11766 -9157 -23265 -20433 -23177 -32101 -38905 -38194
7461 -38194 -5244 -1989 -3034 -21126 -42129 -55732 -49529 -19092 -14419 -12402 -15860 -12466 -15777
7448 -15777 -4665 5303 -10670 -20005 -21199 -29777 -37355 -28239 -561 14680 20401 3181 -28402
7435 -28402 -60904 -60759 -27854 -23087 -28752 -19470 7485 18837 1930 -24786 -30778 -34829 -34516 -11646
7421 -11646 -7746 -25326 -41324 -15012 11205 2660 -783 -17185 -7617 4737 15170 19101 1805
7408 1805 -9795 5843 7315 -206 -9133 -3669 -17836 -19542 -19963 -19149 -14571 -21185 -24880 -29062 -56877
$$ packed form
7502b6327L080J308m969J8169J8528J9791k334j36k1862q913J7292o855j3478
7489f706m010J2490Q465m749q337k04j0473j9557J6173J7524l273l428p192k5764
7475c9041P123J713J7732J2409M500N106K224k0923j4108K832k744q924o804P11
7461c8194L2950L255j045j8092k1003j3603O203L0437M673K017l458L394l311
7448a5777J1112R968j5973r335j194q578p578R116K7678J5241N721j7220l1583
7435b8402l2502J45L2905M767n665R282K6955J1352j6907k6716n992m051L13K2870
7421a1646L900j7580j5998K6312K6217q545l443j6402R568J2354J0433L931j7296
7408A805j1600J5638J472p521q927N464j4167j706m21Q14M578o614l695m182k7815
$$ plain form
7393 -56877 -58598 -32061 -12472 3533 5328 -41380 -53908 -47467 -27383 -20931 -30762 -24167 -24108 -26592
7379 -26592 -20918 -15912 -25200 -13298 -4354 -4311 7335 7363 -5396 -13530 -13106 -19589 -18091 13580 21623
7364 21623 25013 9559 8036 19154 10484 12706 20576 -6360 -20337 -32862 -28625 -17255 -14727
7351 -14727 -4989 1977 -12806 -26882 -32130 -33120 -33029 -20484 -17187 -27343 -30895 -33664 -30620 -18572
7337 -18572 -19604 -35827 -34236 -34257 -26126 -7553 -6532 -3753 -7033 -19975 -40638 -46229 -15293 -8288
7323 -8288 1873 9413 4594 -4615 -17888 -3880 -17617 -27487 -8075 5214 -1052 1167 -8072
7310 -8072 -32761 -32144 -23252 -22365 -38654 -20742 -146 -1820 -9888 -3139 2181 -1112 -109 18098
7296 18098 26512 -9975 -15955 -8339 -14436 -14235 -13981 -18340 -24914 -12424 -23487 -42193 -49157 -37744
$$ packed form
7393e6877j721K6537J9589J6005J795m6708j2528O441K0084O452r831O595N9k484
7379b6592N674N006r288J1902Q944M3J1646K8j2759q134M24o483J498L1671Q043
7364B1623L390j5454j523J1118q670K222P870k6936j3977j2525M237J1370K528
7351a4727R738O966j4783j4076n248r90R1J2545L297j0156l552k769L044J2048
7337a8572j032j6223J591k1Q131J8573J021K779l280j2942k0663n591L0936P005
7323h288J0161P540m819r209j3273J4008j3737r870J9412J3289o266K219r239
7310h072k4689O17Q892Q87j6289J7912K0596j674q068O749N320l293J003J8207
7296A8098Q414l6487n980P616o097K01K54m359o574J2490j1063j8706o964J1413
$$ plain form
7282 -37744 -17733 865 2928 -3529 5608 19360 8431 10602 23919 6751 6954 9157 2680
7269 2680 6947 -5568 -5175 -4933 -17236 -19141 -7651 -11257 -22802 -32470 -30240 -41632 -35276 -19634
7255 -19634 -18888 -23625 -40338 -35245 -31465 -22030 -24940 -20419 -7534 -9403 -14652 -13676 836 8758
7241 8758 5977 8114 2671 -8157 -15546 -4315 -7291 -10311 287 11576 19421 -11582 -5454 9679
7227 9679 21388 35024 29092 25960 34017 -5333 -41716 -28048 -19789 -11163 -12367 -14412 -8268 6184
7213 6184 24552 22353 2456 -9328 9681 25410 10157 -2838 -5052 -15913 -43481 -35051 -30470
7200 -30470 -24874 -19978 -3596 -5394 -24462 -22469 -17302 -11011 -6917 10051 3437 -31087 -50693
7187 -50693 -34097 -19957 3387 13943 2267 14259 12857 19871 40559 39805 20780 11557 1525
$$ packed form
7282c7744K0011J8598K063o457R137J3752j0929K171J3317j7168K03K203o477
7269B680M267j2515L93K42j2303j905J1490l606j1545r668K230j1392O356J5642
7255a9634P46m737j6713N093L780R435k910M521J2885j869n249R76J4512P922
7241H758k781K137n443j0828p389J1231k976l020J0598J1289P845l1003O128J5133
7227I679J1709J3636n932l132Q057l9350l6383J3668Q259Q626j204k045O144J4452
7213F184J8368k199j9897j1784J9009J5729j5253j2995k214j0861k7568Q430M581
7200c0470N596M896J6382j798j9068J993N167O291M094J6968o614l4524j9606
7187e0693J6596J4140K3344J0556j1676J1992j402P014K0688p54j9025r223j0032
$$ plain form
7174 1525 12693 -5501 -9302 -6605 11296 -1305 -10920 -10182 -7950 -14333 -14314 -2791 -4139 -14905
7160 -14905 -25532 -11840 -14522 -40525 -31804 -25265 -15499 -33275 -23481 17607 39054 32749 28576
7147 28576 15002 -4678 1042 -2369 -14736 -18996 -13790 -24042 -36078 -32527 -21644 -27444 -21026
7134 -21026 3121 14254 3621 -8976 -11867 -9999 -6991 -4751 -5808 -5679 -4927 4446 17626 15103
7120 15103 15600 1179 -15645 -11933 -19449 -19532 -27690 -13720 5629 -12202 -24846 -7621 13567
7107 13567 8273 -8191 -6267 5459 5936 -4904 -11503 -27940 -35535 -27881 -6566 -14632 -34986
7094 -34986 -35892 -20516 16949 17399 -7574 -4852 11740 3293 3007 3248 44 -30459 -40029 -35165
7080 -35165 -28628 -22459 7253 16402 34229 38207 15545 13104 9452 14678 25792 12293 8863
$$ packed form
7174A525J1168j8194l801K697J7901j2601r615P38K232o383J9J1523j348j0766
7160a4905j0627J3692k682k6003Q721O539R766j7776R794M1088K1447o305m173
7147B8576j3574j9680N720l411j2367m260N206j0252j2036L551J0883n800O418
7134b1026K4147J1133j0633j2597k891J868L008K240j057J29P52R373J3180k523
7120A5103M97j4421j6824L712p516q3q158J3970J9349j7831j2644J7225K1188
7107A3567n294j6464J924J1726M77j0840o599j6437p595P654K1315q066k0354
7094c4986r06J5376L7465M50k4973K722J6592q447k86K41l204l0503r570M864
7080c5165O537O169K9712R149J7827L978k2662k441l652N226J1114j3499l430
$$ plain form
7067 8863 12820 10323 -4420 -16254 -30066 -33720 -19538 -12933 -31247 -44520 -24070 -14985 -31235
7054 -31235 -33287 -30239 -21534 -30825 -19983 -13464 -13129 -230 -2470 1550 17700 29856 20266 -12838
7040 -12838 -5890 -17262 -24547 -40792 -55714 -50179 -42046 -48628 -48603 -44954 -36703 -35731 -25902 -17914 -23751
7025 -23751 -21147 -9323 -6910 -13460 -518 1926 -3529 4455 -2468 -11926 -8104 -13862 -29858 -11651
7011 -11651 2593 5826 7139 11682 -4203 -21926 -43974 -44638 -29127 -25057 -34314 -28492 -21511 -28406
6997 -28406 -19875 1172 2562 -10245 -2223 -760 440 -16766 -28295 -18731 -14963 -3018 -3341 6634
6983 6634 4428 -17665 -14401 9606 -5913 -16812 -3778 -10062 -8603 -28465 -32633 -3787 21107
6970 21107 17781 -5431 -7056 -1077 2858 11853 -8831 -22349 -43888 -48801 -52553 -49156 -45770 -31847
$$ packed form
7067H863L957k497j4743j1834j3812l654J4182O605j8314j3273K0450R085j6250
7054c1235k052L048Q705r291J0842O519L35J2899k240M020J6150J2156r590l3104
7040a2838O948j1372p285j6245j4922N535Q133o582K5L649Q251R72R829P988n837
7025b3751K604J1824K413o550J2942K444n455P984o923r458L822n758j5996J8207
7011a1651J4244L233J313M543j5885j7723k2048o64J5511M070r257N822O981o895
6997b8406Q531K1047J390j2807Q022J463J200j7206j1529R564L768J1945l23R975
6983F634k206k2093L264K4007j5519j0899J3034o284J459j9862m168K8846K4894
6970B1107l326k3212j625N979L935Q995k0684j3518k1539m913l752L397L386J3923
$$ plain form
6956 -31847 -35270 -50340 -62470 -41403 6287 5494 8638 17458 267 -11103 -14656 10094 21996
6943 21996 23522 1404 -14165 -21793 -31126 -23809 3779 -549 9223 16995 15113 17490 -8534 -27422
6929 -27422 -27550 -19762 -17446 -17028 -28909 -29765 -14395 -15413 -23668 -27486 -34430 -54311 -52646 -35727
6915 -35727 -19636 -8140 -9636 -12727 -14076 -11628 -22288 -31419 -30695 -35173 -35625 -34092 -32162 -24446
6901 -24446 -8827 -927 18622 12476 28676 19506 -1913 252 7913 16600 11235 -3651 -17171
6888 -17171 -28561 -22282 -15456 -1963 -6379 3792 5114 7253 5901 -2484 -3510 -16593 -14168 5613
6874 5613 101 -18897 -19957 -19762 -25098 -3812 10397 19122 12725 -1453 6115 831 -6795 -22513
6860 -22513 -43476 -44837 -17664 -14994 -41407 -34823 -13391 2517 -8282 -8319 735 8375 6160 14147
$$ packed form
6956c1847l423j5070j2130K1067M7690p93L144Q820j7191j1370l553K4750J1902
6943B1996J526k2118j5569p628r333P317K7588m328R772P772j882K377k6024j8888
6929b7422j28P788K316M18j1881q56J5370j018q255l818o944j9881J665J6919
6915c5727J6091J1496j496l091j349K448j0660r131P24m478m52J533J930P716
6901b4446J5619P900J9549o146J6200r170k1419K165P661Q687n365j4886j3520
6888a7171j1390O279O826J3493m416J0171J322K139j352q385j026j3083K425J9781
6874E613n512j8998j060J95n336K1286J4209Q725o397j4178P568n284p626j5718
6860b2513k0963j361K7173K670k6413O584K1432J5908j0799l7R054P640k215P987
$$ plain form
6846 14147 13269 11098 16954 12536 -9862 7524 4235 -19875 -30544 -20185 -27037 -34396 -9292
6833 -9292 -7345 -3335 -19497 -29368 -33047 -49262 -44393 -48801 -44611 -21584 -11653 -17901 -25208 -25818
6819 -25818 -17725 -7979 -10354 -268 2269 9728 5126 -11508 -3899 -34861 -33502 -24405 -2225 -2584
6805 -2584 16012 35613 23838 17579 -3914 -13252 -2033 -6430 -1527 -17083 -48334 -44639 -25941
6792 -25941 -15167 -21331 -27264 -20671 -26595 -36333 -15019 -8900 -26647 -8709 -18334 -18777 -6741 -903
6778 -903 360 4647 -10143 -35621 -38354 -29976 -17936 -19932 -11617 7178 7262 -3847 -40303 -56271
6764 -56271 -53062 -44086 -43243 -45968 -24269 -8712 790 -5081 -18339 -28611 9761 17302 -8910
6751 -8910 -1831 16120 35438 43897 38268 18629 -4555 -19437 -30778 -33879 -25860 -11487 -2309
$$ packed form
6846A4147q78k171N856m418k2398J7386l289k4110j0669J0359o852p359K5104
6833i292J947M010j6162r871l679j6215M869m408M190K3027R931o248p307o10
6819b5818Q093R746k375J0086K537P459m602j6634P609l0962J359R097K2180l59
6805b584J8596J9601j1775o259k1493r338J1219m397M903j5556l1251L695J8698
6792b5941J0774o164n933O593n924r738K1314O119j7747J7938r625m43J2036N838
6778i03J263M287j4790k5478k733Q378J2040j996Q315J8795Q4j1109l6456j5968
6764e6271L209Q976Q43k725K1699J5557R502n871j3258j0272L8372P541k6212
6751h910P079J7951J9318Q459n629j9639k3184j4882j1341l101Q019J4373R178
$$ plain form
6738 -2309 2205 -15327 -28575 -18157 -9047 -8429 -2977 -2931 5378 41270 68723 109698 135640 188771
$$ packed form
6738b309M514j7532j3248J0418R110O18N452M6Q309L5892K7453M0975K5942N3131
$$ [...]
##END NTUPLES=NMR SPECTRUM
##END=
