##TITLE=Analysis number 314128
Compound Code mo 01027
Project Code adrs
Chemist Name infarmatik
##JCAMPDX= 6.0         $$ Bruker NMR JCAMP-DX V2.0
##DATA TYPE= NMR SPECTRUM
##DATA CLASS= NTUPLES
##ORIGIN= Bruker BioSpin GmbH
##OWNER= NMR
$$ XWIN-NMR		Version 3.5
$$ Thu Oct  6 10:21:07 2005 GMT Daylight Time (UT+1h)  MAYBRIDGE\NMR@NMR_250MHZ
##.OBSERVE FREQUENCY= 250.131544655141
##.OBSERVE NUCLEUS= ^1H
##.ACQUISITION MODE= SIMULTANEOUS (DQD)
##.ACQUISITION SCHEME= undefined
##.AVERAGES= 16
##.DIGITISER RES= 18
##SPECTROMETER/DATA SYSTEM= dpx250
##.PULSE SEQUENCE= zg30
##.SOLVENT NAME= CDCl3
##.SHIFT REFERENCE= (INTERNAL, CDCl3, 0, 16.522)
##AUDIT TRAIL= $$ (NUMBER, WHEN, WHO, WHERE, WHAT)
$$ ##TITLE= Audit trail, XWIN-NMR		Version 3.5
$$ ##JCAMPDX= 5.01
$$ ##ORIGIN= Bruker BioSpin GmbH
$$ ##OWNER= NMR
$$ C:\u/data/dgb/nmr/ADRS/10550/pdata/1/auditp.txt
$$ ##AUDIT TRAIL=  $$ (NUMBER, WHEN, WHO, WHERE, WHAT)
(   1,<2005-10-06 10:20:47.46 +100>,<MAYBRIDGE\NMR>,<NMR_250MHZ>,
      <created by zg, POWCHK disabled, PULCHK disabled
       configuration hash MD5:
       62 19 C7 07 E1 42 D1 B7 37 6C 3D D0 77 39 F9 E6
       data hash MD5: 64K
       60 E0 92 8A 6D 56 56 70 AA 54 94 26 60 2F 37 68>)
(   2,<2005-10-06 10:21:00.74 +100>,<MAYBRIDGE\NMR>,<NMR_250MHZ>,
      <Start of raw data processing
       ef LB = 0.3 FT_mod = 6 PKNL = 1 SI = 32K 
       data hash MD5: 32K
       3B 7D DB A7 95 F7 15 0D 7A 4D C2 A0 CA AA 90 71>)
(   3,<2005-10-06 10:21:02.45 +100>,<MAYBRIDGE\NMR>,<NMR_250MHZ>,
      <apk 
       data hash MD5: 32K
       11 1A F1 08 B6 75 FC 60 3E C0 75 48 A4 C5 61 32>)
(   4,<2005-10-06 10:21:03.18 +100>,<MAYBRIDGE\NMR>,<NMR_250MHZ>,
      <abs ABSG = 5 
       data hash MD5: 32K
       68 43 4A FF 77 20 0A DD E4 B2 2D F5 5B 33 01 8D>)
$$ ##END=
$$ 
$$ hash MD5
$$ AD D8 EB 9D 44 73 D8 56 7C EB F1 17 0E F1 67 EE
##$RELAX= 
##$RELAX= 
##$RELAX= 
##$RELAX= 
##$RELAX= 
##$RELAX= 
##$RELAX= 
$$ Bruker specific parameters
$$ --------------------------
##$DU= <C:\u>
##$EXPNO= 10550
##$NAME= <ADRS>
##$PROCNO= 1
##$TYPE= <nmr>
##$USER= <dgb>
##$AMP= (0..31)
100 100 100 100 100 100 100 100 100 100 100 100 100 100 100 100 100 100 
100 100 100 100 100 100 100 100 100 100 100 100 100 100 
##$AQSEQ= 0
##$AQ_mod= 3
##$AUNM= <au_zg>
##$AUTOPOS= <11 >
##$BF1= 250.13
##$BF2= 250.13
##$BF3= 250.13
##$BF4= 250.13
##$BF5= 500.13
##$BF6= 500.13
##$BF7= 500.13
##$BF8= 500.13
##$BYTORDA= 1
##$CFDGTYP= 0
##$CFRGTYP= 5
##$CHEMSTR= <none>
##$CNST= (0..31)
1 1 145 1 1 1 1 1 1 1 1 1 1 1 1 1 1 1 1 1 1 1 1 1 1 1 1 1 1 1 1 1 
##$CPDPRG= <>
##$CPDPRG1= <>
##$CPDPRG2= <>
##$CPDPRG3= <>
##$CPDPRG4= <mlev>
##$CPDPRG5= <mlev>
##$CPDPRG6= <mlev>
##$CPDPRG7= <mlev>
##$CPDPRG8= <mlev>
##$CPDPRGB= <>
##$CPDPRGT= <>
##$D= (0..31)
0 1 0 0 0 0 0 0 0 0.06 0 0 0 0 0 0 0.0002 0 0 0 0 0 0 0 0 0 0 0 0 0 0 
0 
##$DATE= 1128590446
##$DBL= (0..7)
120 120 120 120 120 120 120 120 
##$DBP= (0..7)
150 150 150 150 150 150 150 150 
##$DBP07= 0
##$DBPNAM0= <>
##$DBPNAM1= <>
##$DBPNAM2= <>
$$ [...]
##$SUBNAM7= <"">
##$SUBNAM8= <"">
##$SUBNAM9= <"">
##$SW= 20.6930455092707
##$SWIBOX= (0..15)
0 0 3 0 0 0 0 0 0 0 0 0 0 0 0 0 
##$SW_h= 5175.983436853
##$TD= 65536
##$TD0= 1
##$TE= 295.16
##$TE2= 300
##$TE3= 300
##$TEG= 300
##$TL= (0..7)
0 120 120 120 120 120 120 120 
##$TP= (0..7)
150 150 150 150 150 150 150 150 
##$TP07= 0
##$TPNAME0= <>
##$TPNAME1= <>
##$TPNAME2= <>
##$TPNAME3= <>
##$TPNAME4= <>
##$TPNAME5= <>
##$TPNAME6= <>
##$TPNAME7= <>
##$TPOAL= (0..7)
0.5 0.5 0.5 0.5 0.5 0.5 0.5 0.5 
##$TPOFFS= (0..7)
0 0 0 0 0 0 0 0 
##$TUNHIN= 0
##$TUNHOUT= 0
##$TUNXOUT= 0
##$USERA1= <user>
##$USERA2= <user>
##$USERA3= <user>
##$USERA4= <user>
##$USERA5= <user>
##$V9= 5
##$VALIST= <valist>
##$VCLIST= <CCCCCCCCCCCCCCC>
##$VD= 0
##$VDLIST= <DDDDDDDDDDDDDDD>
##$VPLIST= <PPPPPPPPPPPPPPP>
##$VTLIST= <TTTTTTTTTTTTTTT>
##$WBST= 1024
##$WBSW= 4
##$XGAIN= (0..3)
0 0 0 0 
##$XL= 0
##$YL= 0
##$YMAX_a= 419506
##$YMIN_a= -519747
##$ZGOPTNS= <>
##$ZL1= 120
##$ZL2= 120
##$ZL3= 120
##$ZL4= 120
##$ABSF1= 16.522
##$ABSF2= -4.171173
##$ABSG= 5
##$ABSL= 3
##$ALPHA= 0
##$AQORDER= 0
##$ASSFAC= 0
##$ASSFACI= 0
##$ASSFACX= 0
##$ASSWID= 0
##$AUNMP= <proc_1d>
##$AZFE= 0.1
##$AZFW= 0.1
##$BCFW= 0
##$BC_mod= 0
##$BYTORDP= 0
##$COROFFS= 0
##$CY= 12.5
##$DATMOD= 1
##$DC= 0
##$DFILT= <>
##$DTYPP= 0
##$F1P= 14.0000005364418
##$F2P= -0.99999901652339
##$FCOR= 0.5
##$FTSIZE= 32768
##$FT_mod= 6
##$GAMMA= 0
##$GB= 0
##$INTBC= 1
##$INTSCL= 1
##$ISEN= 128
##$LB= 0.3
##$LEV0= 0
##$LPBIN= 0
##$MAXI= 10000
##$MC2= 0
##$MEAN= 0
##$ME_mod= 0
##$MI= 0
##$NCOEF= 0
##$NC_proc= -3
##$NLEV= 6
##$NOISF1= 0
##$NOISF2= 0
##$NSP= 0
##$NTH_PI= 0
##$NZP= 0
##$OFFSET= 16.522
##$PC= 1
##$PHC0= 147.8191
##$PHC1= 6.204865
##$PH_mod= 1
##$PKNL= yes
##$PPARMOD= 0
##$PSCAL= 4
##$PSIGN= 0
##$REVERSE= no
##$SF= 250.13
##$SI= 32768
##$SIGF1= 0
##$SIGF2= 0
##$SINO= 400
##$SIOLD= 32768
##$SREGLST= <1H.CDCl3>
##$SSB= 0
##$STSI= 32768
##$STSR= 0
##$SW_p= 5175.98343685301
##$SYMM= 0
##$S_DEV= 0
##$TDeff= 65536
##$TDoff= 0
##$TI= <Analysis number 999999
Compound Code 99
Book Reference 9
Project Code 9>
##$TILT= no
##$TM1= 0
##$TM2= 0
##$TOPLEV= 0
##$USERP1= <user>
##$USERP2= <user>
##$USERP3= <user>
##$USERP4= <user>
##$USERP5= <user>
##$WDW= 1
##$XDIM= 32768
##$YMAX_p= 394840820
##$YMIN_p= -31237
$$ End of Bruker specific parameters
$$ ---------------------------------
##NTUPLES= NMR SPECTRUM
##VAR_NAME=  FREQUENCY,     SPECTRUM/REAL,   SPECTRUM/IMAG
##SYMBOL=    X,             R,               I
##VAR_TYPE=  INDEPENDENT,   DEPENDENT,       DEPENDENT
##VAR_FORM=  AFFN,          ASDF,            ASDF
##VAR_DIM=   32768,         32768,           32768
##UNITS=     HZ,            ARBITRARY UNITS, ARBITRARY UNITS
##FACTOR=    0.157963299565203, 1,           1
##FIRST=     4132.6476996994, 0,             0
##LAST=      -1043.33573715361, 0,           0
##MIN=       -1043.33573715361, -31237,      0
##MAX=       4132.6476996994, 394840820,     0
$$ Real data points
##PAGE= N=1
##DATA TABLE= (X++(R..R)), XYDATA
$$ [...]
14968f205p97N966K383l540L63O63J57j74N69P96j841l712Q8Q72K328M20j374
14951c038l09M390L638J548l544k768J553K128Q17k398l651J205L381l54K484
14936E082j180j313j282J364k36n044k710K8K97R71J167K823q43M15k992n454
14920h907J029J677j24j006J766J386k313n77P94k2J817L249O77K339K008k372
14904A421J450Q8P18r15j119L28j413j742N352l972l291K920l633k06J523Q71
14888a620K704M74j432k381l019o04K666r34J562K358J636r06m034l582j651j613
14872a0376K754P144P31k67L291J810L579m277j095k760l961J216l218n268r87
14857a1684K441l51n993K535M396L922J01l990q26L645k868k984L552L545K769
$$ y = [-6205, -7002, -1036, 1347, -2193, -1830, -1167, -1010, -1184, -615, 181, -1660, -5372, -5284, -4412, -2084, -1664, -3038, -3347, 1043, 4681, 6229, 2685, -83, 1470, 3598, 4415, 2017, -1634, -429, 2952, 2598, 5082, 3902, 2589, 1307, 2671, 2435, -2609, -5319, -5291, -4994, -4023, -2856, -33, -876, -461, -3453, -8907, -7878, -6201, -6325, -7331, -5565, -4179, -6492, -7069, -6275, -6297, -4480, -1231, -554, 1785, 3793, 1421, 2871, 2959, 3677, 2762, 1643, 1971, 558, -1184, 4168, 196, -3095, -175, -3808, -4014, -2491, -1620, 1084, 1558, 126, -2255, -5274, -5878, -3212, -4146, -2584, -226, 1410, 504, -3530, -7112, -8763, -10376, -7622, -478, 253, -14, 3277, 5087, 8666, 4389, 3294, 534, -3427, -2211, -5429, -10697, -11684, -9243, -9594, -15587, -13052, -8656, -4734, -4633, -8623, -9449, -5804, -8672, -11656, -8104, -4559, -1790]
14842a790l16q09N80q88N9R08j492j887L404K008q06J096q64l646j392j081M368
14825b548K971m086o042n02L814k761K974N047O38k959k053J720K681J412l590
14810c284k488J005J22k201k848K264R19K615m726M85K085J168L364K800Q86j014
14794A152m127j047J993m588l500L336J919k027k082N31j728J005K584k601L801
14779e379L694j249j687Q31l51L874J396j712l043r31K839n64q44K274J130m5
14763B33L469l365m895k050l351j816P77L981K700j015n980k438N795J942m55
14748f468p89K137J251n13n502M028K195l083l87N85j530n500l128J883L822J271
14732i728N779J712P03o847l753K98Q27J602L846j260j263j051L09K144J651j105
$$ y = [-1790, -2106, -2915, -2335, -3223, -3164, -2256, -3748, -5635, -2231, -223, -1029, 67, -797, -4443, -5835, -6916, -2548, 423, -3663, -9705, -10207, -6393, -9154, -6180, -1133, -495, -3454, -5507, -3787, -1106, 306, -3284, -5772, -4767, -4645, -6846, -9694, -7430, -6511, -3896, -8622, -8137, -6052, -4884, -1520, 1280, 2166, 1152, -2975, -4022, -2029, -6617, -10117, -6781, -4862, -6889, -8971, -8440, -10168, -9163, -6579, -9180, -5379, -1685, -2934, -4621, -3790, -4141, -267, 1129, -583, -3626, -4557, -1718, -2282, -3126, -852, 278, 233, 3702, 337, -4558, -6608, -9959, -11775, -10998, -7017, -4317, -5332, -11312, -13750, -7955, -6013, -6468, -7257, -5120, -3869, -4382, -9884, -5856, -3661, -6744, -7131, -6546, -8076, -13576, -16704, -14821, -10999, -9728, -3949, -2237, -1534, -8381, -12134, -11836, -11009, -9407, -5561, -6821, -8084, -9135, -8826, -6682, -5031, -6136]
14716f136o591k589K895L672J664L697R46n44P10k78p33J465P22m247l477l555
14700a2379L733L871l51L579K639K405p8k130j735l95l551k774l45J806J662j293
14684e336j292m453l605L29K402L173K265J638m86q68N16n75M27J512j416k081
14668g850j259L269k98m465n8L03K800N173K654m91j348k093j285m414o13K621
14652g354k31J225J180m43m316R18j628l520J54J356J17o39K115j374n090L049
14636a4481K446N31k839J947M070l7J51P60J731L42N6L758J983n088J631K463
14620e76j387m061j104k549k681L213J248J588L720J784n813q69K776M34n630
14605i907K702L478k446m7P91p80k506M12J536Q54J882j039k69J398Q02j357Q77
$$ y = [-6136, -12727, -15316, -12421, -8749, -7085, -3388, -2442, -2986, -2276, -2554, -3287, -1822, -1100, -5347, -8824, -12379, -8646, -4775, -5126, -1547, 1092, 3497, 3419, 1289, -446, -841, -4392, -7166, -7511, -5705, -4043, -5336, -6628, -11081, -14686, -14357, -11955, -8782, -6517, -4879, -5365, -6233, -5717, -6292, -5865, -4353, -5769, -7850, -9109, -5840, -6138, -10603, -10661, -10358, -7558, -2385, 269, -222, -1570, -3663, -4948, -9362, -9975, -7354, -7585, -6360, -5180, -5623, -9939, -9021, -10649, -14169, -14015, -12659, -12542, -13181, -11066, -12440, -17530, -14481, -12035, -11504, -14343, -12396, -8326, -8363, -8212, -7452, -5721, -5379, -5323, -1565, 418, -4670, -3039, -576, -1963, -6024, -7128, -9677, -12358, -9145, -7897, -6309, -2589, -805, -6618, -7487, -4711, -4277, -9907, -7205, -3727, -6173, -6220, -5429, -6209, -8715, -8303, -6767, -5913, -4031, -5070, -5339, -3941, -3139, -4496, -3619]
14588c619K433L18p396l514N08N052J489p95J726o117k426O298P283j997m574
14573e331j919q23l10M107L666l306l955J194j036M301J138J272j445P67J611
14558f9P18M28l225l205j503m786O37J96L158J373n469k466M721J708j037N13
14542h308j632l57m482m60J827O647L392J140k99k601l527K824K752O2k781m00
14526f203K543K918l75Q17l313j42p02L883k408l251K78Q26o37j489m44K651M341
14509g07P96k376m217j447J438N098K253l118j244N68k196l089O59K628N92K277
14493b085P96l431K602K922k689j115J019j727J466N95L293j128j836o61k078
14478d057k013m665k499j234N85L45K201q79j16l87o74L75M269L108k258l059
$$ y = [-3619, -1186, -868, -8264, -11778, -11270, -6218, -4729, -5524, -3798, -9915, -12341, -6043, 1240, -757, -5331, -7250, -8073, -8383, -4276, -610, -3916, -7871, -6677, -7713, -3412, -2274, -1002, -2447, -1680, -69, 649, 1077, -2148, -5353, -6856, -11642, -11005, -10809, -7651, -6278, -11747, -14213, -9492, -7784, -8821, -8308, -9940, -10297, -14779, -15239, -13412, -6765, -3373, -2233, -2532, -5133, -8660, -5836, -3084, -3022, -5803, -6203, -3660, -742, -1117, -300, -3613, -3755, -4457, -574, -2982, -6233, -5955, -5129, -5766, -7255, -7699, -5048, -707, 89, -2287, -6504, -7951, -6513, -1415, 838, -2280, -3524, -2956, -5152, -8241, -7582, -4954, -4362, -2085, -1289, -4720, -2118, 804, -1885, -3000, -1981, -3708, -2242, -1647, 1646, 518, -1318, -1979, -4057, -6070, -10735, -13234, -14468, -13883, -13538, -11337, -12216, -12332, -12719, -13393, -13018, -8749, -5641, -7899, -10958]
14462a0958j299R40L416k628P89K81L514M358L000n13p55l283l213K43K267N16
14446c325j448j236j623k223q19J534K880K31J833P55n29P48k881m349J155K919
14430f378j317l129P82L754K869L826j000l682m30J678l293l512M153O500J343
14415B164M65K176L60l727n100l33J12N94Q61K05o59k686J584L555k85j132l736
14398e582j417P62J495j865j645j580r6R75L616p05p41j62k558R05K180J2j959
14381h365n689k360O99N388M955K597k915l439j951N275J2J716k501k569k411
14366a1558J535L397L289j770l351r67M08J110J98r18R81L194j080o115j797K180
14350a1264j924O88L624J302k114p57J272N97O21L893N887K388l580L83K428l522
$$ y = [-10958, -12257, -11317, -7901, -10529, -9740, -9459, -5945, -1587, 1413, 900, 145, -3138, -6351, -6108, -3841, -3325, -4773, -6009, -7632, -9855, -10674, -9140, -6260, -6029, -4196, -3441, -3970, -3222, -6103, -10452, -9297, -6378, -7695, -10824, -10042, -6288, -3419, 407, -593, -4275, -4705, -3027, -6320, -9832, -5679, 821, 2164, 2629, 4805, 5165, 1438, -3662, -3995, -3883, -3289, -2428, -2223, -2882, -5568, -3984, -429, -714, -1846, -5582, -6999, -6237, -4742, -6607, -8252, -9832, -9928, -8953, -5337, -6042, -6783, -6945, -9503, -8598, -6418, -6406, -8365, -14054, -16414, -15715, -10327, -5372, -2775, -5690, -9129, -11080, -5805, -5793, -4077, -6578, -9147, -11558, -10023, -6626, -3337, -5107, -8458, -9425, -9017, -7907, -7709, -8627, -7646, -4452, -5532, -11647, -13444, -11264, -13188, -12500, -8876, -7574, -9688, -10445, -9173, -8576, -7955, -4062, 1825, 4213, 633, 1016, 3444, -78]
14334g8n551o398K960J558O65O13l267l380r03L675N030O40m416J53K39J800J703
14317d957K0j309l478r83k496J377K821P218L573j610j657O90J329K005M7k436
14301A54m340p98M545R23l703k752m023m49K643K446K019o25N91n72m151M32n80
14284h240K659J083k458j200j560L434P98q41J3M126L398M064l158k197m73L243
14268B691r77K450J607J448J774K021l782R19J953L930K970J94P19k064l217l749
14252H887o440m316J410L298j352l567n283l020o79J494k468K598Q122r55j952
14237d223L357K35o31j452P99J220K325j178j938p44K266K392L054K040J074K979
14221A1575K236l457l838m6J266J891r22l372l353m271j810j067P62k122K638
$$ y = [-78, -5629, -12027, -9067, -7509, -6844, -6231, -9498, -12878, -13781, -10106, -5076, -4436, -8852, -8699, -8460, -6660, -4957, -4937, -6246, -9724, -10707, -13203, -11826, -9005, -1787, 1786, 176, -1481, -791, 538, 2543, 2590, 154, -4186, -4984, -439, 484, -3219, -5971, -9994, -10443, -7800, -5354, -3335, -3960, -3369, -3941, -8092, -7660, -8240, -5581, -4498, -6956, -8156, -9716, -6282, -5484, -6325, -6312, -2186, 1212, 5276, 2118, -79, -552, 2691, 1714, 4164, 5771, 7219, 8993, 11014, 7232, 8151, 10104, 14034, 17004, 17198, 17917, 15853, 12636, 8887, 2447, -1869, -459, 2839, 1487, -2080, -7363, -10383, -11062, -9568, -12036, -9438, -1316, -2271, -4223, -866, -631, -1262, -2714, -1915, -695, 1630, 452, -1486, -2230, 36, 2428, 5482, 7522, 8596, 11575, 13811, 10354, 6516, 6470, 7736, 9627, 8705, 5333, 1980, -2291, -4101, -5168, -4406, -6528, -3890]
14206c890P236L065p482m191L09j616J930M029p225J657J717j071M104K613j427
14191b42j796k374M96n23m463J019K354K12L176K763k659K570k214j722j108p23
14175e234M92K415L92n771J718m07j073P3k472j685n26J181K664J005L9N165K483
14158D59o35j701k565J599o87k226k901K38l21L92J242l279j763N998K159j025
14142e016q75n187j924l65j436J427J724J208M073j264P62k240m18M481M51k608
14126g207k421K721N130n292r83K795M670J078l435j550J954O287O541L075l927
14111I436l441R22J269m74k388n67L346Q76n550m044j636k890j023n219k580L242
14095a0721L179m9k045l375K389L962j095j777j475j69j555j958L934K389j840
$$ y = [-3890, 3346, 6411, -1071, -5262, -4953, -6569, -4639, -610, -7835, -6178, -4461, -5532, -1428, 1185, -242, -2038, -4412, -3916, -4439, -8902, -7883, -5529, -5317, -2141, 622, -2037, 533, -1681, -3403, -4511, -5234, -4742, -2327, -1935, -7706, -5988, -6395, -7468, -7395, -9867, -11552, -12078, -10897, -8233, -7228, -7189, -2024, 459, -176, -1877, -4442, -2843, -3530, -5756, -8657, -8419, -8740, -8348, -7106, -10385, -12148, -6150, -3991, -5016, -5891, -11078, -13002, -13367, -14803, -13376, -11652, -10444, -6371, -7635, -6873, -9113, -9531, -5050, -4599, -7207, -9628, -6907, -1777, -7069, -8052, -5257, -587, 491, -2944, -4494, -2540, 3747, 10288, 13363, 9436, 5995, 6917, 8186, 7712, 5324, 4757, 8103, 8979, 3429, -615, -2251, -5141, -6164, -11383, -13963, -10721, -7542, -7591, -9636, -13011, -10622, -6660, -7755, -9532, -11007, -11176, -12731, -14689, -10755, -8366, -10206]
14080a0206k606q73k284P25K368J0152K813m105j632J111L769l29l974l868j697
14065a0636j176P96p26m118o90L030L365M89j481k393L989k96O40M41J113l07
14049g960l395m47o67j617r44O594K894m512k07J37o138k337K685J112J20J25
14033a4557K77p69M05M239K057l776l174L38P653K656r89j984j159K619L202Q16
14017b146j431j806l371m593l770n85K149L735L75M84k30m122l210L307L169K595
14001i450N63k278K074L25l763L12l81j074J348K508N248j809m285L797R64m458
13985a0359j977L268J443k640o807k7L967k191q23L043N305m88p85k280k208M026
13969i533K443K878m47j73k483j847K677M086J434Q29K065j206j70J512L373K8
$$ y = [-10206, -12812, -13685, -15969, -15244, -12876, -2724, 89, -4016, -5648, -4537, -768, -1097, -5071, -8939, -10636, -11812, -11016, -11742, -15860, -16550, -13520, -10155, -9666, -11147, -13540, -9551, -9847, -9207, -8766, -7653, -7960, -11355, -11802, -12469, -14086, -15030, -8436, -5542, -10054, -10261, -10124, -16262, -18599, -15914, -14802, -14682, -14557, -14280, -15049, -14644, -10405, -8348, -12124, -15298, -14960, -7307, -4651, -5640, -7624, -8783, -6164, -2962, -2146, -3577, -5383, -8754, -13347, -17117, -17702, -15553, -11818, -11443, -10959, -11189, -15311, -18521, -15214, -12045, -9450, -8887, -11165, -9091, -8766, -12529, -12217, -12598, -13672, -12324, -9816, -4568, -6377, -10662, -6865, -5901, -10359, -12336, -9068, -7625, -10265, -17072, -17099, -13132, -15323, -16146, -13103, -7798, -8286, -9071, -11351, -13559, -9533, -7090, -4212, -4659, -4832, -7315, -9162, -6485, -2399, -965, -136, 1929, 723, 553, 2065, 5438, 5466]
13953E466r2r51l394m13K805K419N07L515L809k66K477Q53m30j833L661M054k08
13936B1979m471m050P48k743j967K694j7j810j985p502l262Q97K626R80P60j820
13920A057l892n094j255M64k902O16K212j465j586K800M683K3M7k66k245k433
13904i236l58L2j337M81L841j501k148J043n39J293J462j575j123k195l718P22
13888a4856J326R11k397p82N66j077j393j159J801O207J858k982j288K673J795
13873h797J486o03p36P90J675P49j434J814J790L527r67o374o83L842k53j914
13857f088q78K820k993o417l899L926K524P1L246J992L42j5j791p51j020k552
13841a1483l34P77j464j088J636L929J074J11j052k446j666k40J116O6j611K816
$$ y = [5466, 5374, 4423, 1029, 616, 3421, 5840, 6347, 9862, 13671, 13405, 15882, 16735, 16305, 14472, 18133, 22187, 21979, 17508, 13458, 14206, 11463, 9496, 12190, 12173, 10363, 8378, 876, -2386, -1489, 1137, 2117, 2877, 1057, -2835, -7929, -9184, -8720, -11622, -11006, -8794, -10259, -11845, -9045, -4362, -4339, -4292, -4558, -6803, -9236, -9594, -9562, -10899, -10418, -6577, -8078, -10226, -9183, -9722, -8429, -6967, -8542, -9665, -11860, -15578, -14856, -13530, -12619, -15016, -15798, -15232, -16309, -17702, -18861, -17060, -10853, -8995, -11977, -13265, -10592, -8797, -7311, -7914, -8650, -7860, -6185, -5436, -6870, -5056, -3266, 261, -706, -7080, -7763, -3921, -4174, -6088, -6966, -4146, -7139, -13556, -17455, -13529, -11005, -10934, -7688, -5696, -5354, -5369, -7160, -7911, -8931, -11483, -11817, -11040, -12504, -13592, -11956, -8027, -6953, -6842, -7894, -10340, -12006, -12246, -11130, -11064, -12675, -9859]
13825i859k74M32k414k053j5L003K776o30J347J092j550Q42k149k448j894n76
13809a4370Q00R19j153j480K667N66j102J510K968J329j966k341o21L78k498k025
13793a6419j595k152J334J973L156Q14K022j132q40Q55J792J094l070p6P46r3
13777a1591j427k612R57j868j184r75P93N643N43j141k796l438M53j694K296O500
13761a1541K908m071j941K139J872j644l064j471k44K436N528k91k898J60M21
13746a1701j724k681q23o49k306p02n32L644L104j438L588k472J576j463J9j73
13730a4733J563L101N4J077j872j531l126l179J398K582j164R47Q11k877j929
13715a8878l091K68M494L925k336m036K273K034q90K002o45L033K218J257l38
$$ y = [-9859, -10133, -9701, -12115, -14168, -14183, -11180, -8404, -9034, -7687, -6595, -8145, -7303, -9452, -11900, -13794, -14370, -13570, -12651, -13804, -15284, -12617, -12051, -13153, -11643, -8675, -7346, -9312, -11653, -12274, -11896, -14394, -16419, -18014, -20166, -18832, -16859, -13703, -12889, -10867, -11999, -12839, -11984, -10192, -9098, -12168, -12244, -11498, -11591, -13018, -15630, -14673, -16541, -17725, -18700, -17907, -12264, -11721, -12862, -15658, -19096, -18643, -20337, -18041, -11541, -8633, -12704, -14645, -12506, -10634, -12278, -15342, -16813, -17057, -14621, -9093, -9384, -12282, -12122, -11701, -13425, -16106, -16929, -17578, -19884, -20586, -21118, -17474, -14370, -15808, -12220, -14692, -13116, -14579, -14560, -14733, -13170, -10069, -10015, -8938, -10810, -12341, -15467, -18646, -17248, -14666, -15830, -14883, -14072, -16949, -18878, -21969, -21701, -17207, -13282, -15618, -19654, -17381, -15347, -16237, -14235, -14880, -11847, -9629, -8372, -8710]
13700h710j286k500o15K801K969m161n43P34k971M54N07l403j432l076j125r17
13684b3274j61K575K149L897M3J384k815j129J5J587R28L589j499q81p11j881
13668a6184K159j96J905n60j34K938J400j801k119k640O20M973J025p439m161
13653b0214K182K652j538l182j050L899P28o64K474N00k504l091P61J499J802
13638a5746j018m21m39K506J123q9j03q22L009P76j552n49K11K054p34J482m733
13621a5045k286J832n24J062J678l32K072J022K001K310l04J77k374j23k468m303
13605a5605k316J391L873J390k405k051R87l239p79N32K238J838L22J747J962
13590a0115K030p3J391J76k919J28L27j775k126o340k804R87J420L652N27J208
$$ y = [-8710, -9996, -12496, -13111, -10310, -7341, -11502, -12045, -11311, -14282, -13828, -13321, -16724, -18156, -21232, -22357, -23274, -23435, -20860, -18711, -14814, -14771, -13387, -16202, -17331, -17316, -15729, -14801, -11212, -12711, -13592, -14303, -16184, -14025, -14221, -12316, -12876, -13010, -10072, -8672, -10473, -12592, -15232, -14612, -9639, -8614, -16053, -20214, -18032, -15380, -16918, -20100, -21150, -17251, -16523, -17187, -14713, -14213, -16717, -19808, -19047, -17548, -15746, -16764, -17185, -17624, -15118, -13995, -14084, -14187, -15009, -12000, -11224, -12776, -13325, -13114, -11060, -11794, -10312, -15045, -17331, -15499, -16023, -14961, -13283, -13615, -11543, -10521, -8520, -6210, -6514, -6337, -8711, -8834, -11302, -15605, -17921, -16530, -12657, -11267, -13672, -15723, -14736, -17975, -18754, -18222, -15984, -14146, -13824, -12077, -10115, -8085, -8158, -6767, -6591, -9510, -9382, -9055, -10830, -12956, -19296, -22100, -21113, -19693, -16041, -15514, -14306]
13574a4306J622k097k576l089N164K466J312l98j262k01L033m017O38M73n27k638
13558a6403j486P772L873J178o99j303m79J034k799k434J70p15p02J944K630o18
13542i037l415m802K263L676J445r8J220m07k772m800J356O568K862n08R55m59
13526e953m820k684j87p14K04j685J423J895l13O47J191j875m394Q52r95L01j132
13509a8239k212j776k58N332P205Q31o462k118N659K349J388p76J247K263j893
13494g460l123p9k496j376l97n89m93k444L399L071K897m26j940J749N467l501
13478g741q786R50M454M227J814l080m70n06N65m01ok10j559k507o52J658r38
13461a3188m866J580j068j711K43r1M400P469J557J106K998M164K378m438o88
$$ y = [-14306, -12684, -14781, -17357, -20446, -15282, -12816, -11504, -11902, -13164, -13365, -10332, -14349, -13711, -13238, -13765, -16403, -17889, -10117, -6244, -5066, -5765, -7068, -7547, -6513, -9312, -11746, -11576, -12291, -12993, -11049, -8419, -9037, -12452, -17254, -14991, -11315, -9870, -9968, -8748, -9155, -11927, -16727, -15371, -8803, -5941, -6449, -5494, -5953, -10773, -13457, -13644, -14358, -14154, -15839, -14416, -12521, -12834, -12187, -10996, -12871, -17265, -16413, -17408, -17107, -18239, -20451, -22227, -22485, -17153, -9948, -9117, -15579, -17697, -12038, -9689, -8301, -9077, -7830, -5567, -7460, -10583, -10662, -13158, -14534, -14931, -15520, -16013, -18457, -15058, -11987, -9090, -9516, -11456, -9707, -4240, -7741, -16527, -15577, -11123, -6896, -5082, -8162, -8632, -9138, -8573, -8974, -8980, -9190, -10749, -13256, -13908, -12250, -13188, -18054, -16474, -17542, -19253, -19010, -19101, -14701, -7232, -5675, -4569, -1571, 2593, 4971, 533, -155]
13446a55O068L654K252j256Q78L51p25N278J2428J4550J7449J3952R222K310O33
13431H6889L983J13m77m26q845k1022j7072r151m136n610k652o55N701N970O177
13416C8787j06p799r139q519m174k481J626Q09j226m319L218L247K660L137K811
13401A8532K458L274J2346J4322J7268K1969L4295M5589M9504M2968K3748J1245
13389B97518N086P054q85j1451k3664l5095m3661m4408m0271l0036k2083j7551
13377D0553q295n491l704m399l309l017j4M87K458M717K770l9L346P838N565P829
13361D7295R474K0880K0337J4618O341J505q33L137J9145L4137M0040M8263L0905
13348B95244J0905L442j97j591l760j5863l1608m7430m8469l8561l3092k5994
$$ y = [-155, 5913, 9567, 11819, 10563, 11441, 11792, 11067, 16345, 28773, 43323, 60772, 74724, 83946, 86256, 86889, 90872, 90985, 90508, 90082, 81237, 60215, 43143, 33992, 29856, 24246, 21594, 20939, 26640, 32610, 38787, 38681, 30882, 21743, 13224, 9050, 6569, 8195, 9004, 7778, 3459, 6677, 9924, 12584, 15721, 18532, 20990, 24264, 36610, 50932, 68200, 90169, 124464, 170053, 219557, 262525, 286273, 297518, 302604, 309658, 308773, 297322, 273658, 238563, 194902, 150494, 110223, 80187, 58104, 40553, 32258, 26767, 23063, 18664, 15355, 12338, 12324, 12811, 15269, 19986, 22756, 22717, 26063, 33901, 39466, 47295, 56769, 77649, 97986, 112604, 118945, 120450, 119617, 122754, 141899, 176036, 216076, 264339, 295244, 306149, 309591, 309394, 307803, 304043, 288180, 256572, 209142, 160673, 122112, 89020, 63026]
13336F3026j8346q288l204n554n204j356m493n371l611J014L848L364Q05K62J45
13321A7037l508j748J252j409k731K885m50J32N700M876O193Q392J6370J9079
13307G2070K1610Q850N593L657M606M022N875K126k827j3939k3099j9896k0688
13294D7960j7249r306l821o704k497j703m862j704j398j394J584M512K236M90
13280F144l201j203J18J898J758K1l790%J317k178j355k48j621o18J61J174m804
13263f427N44N311L744q97j911l370j548J541M092M723m74L909K568k666j966
13248G173q55j398k469J530j749l79k414N242M340l043l94K974L059P29J987q41
13232A3492n190k677J157k960r42j435P3M566k111K70J736k498o02K256NL947
$$ y = [63026, 44680, 36392, 33188, 27634, 22430, 21074, 16581, 11210, 7599, 8613, 12461, 15825, 16630, 16892, 17037, 13529, 11781, 13033, 11624, 8893, 11778, 11328, 11460, 17160, 22036, 28229, 36621, 52991, 72070, 93680, 102530, 108123, 111780, 116386, 120408, 126283, 128409, 125582, 111643, 88544, 68648, 47960, 30711, 21405, 17584, 10880, 8383, 6680, 1818, 114, -1284, -2678, -1094, 3418, 5654, 6144, 2943, 1740, 1858, 3756, 5514, 5535, 1745, 1745, 3062, 884, -471, -719, -2340, -2958, -2797, -1623, -6427, -5883, -572, 3172, 2275, 364, -3006, -4554, -3013, 1079, 5802, 5328, 9237, 11805, 9139, 7173, 6318, 4920, 2451, 3981, 2232, 1853, -561, 4681, 9021, 5978, 5584, 8558, 11617, 12346, 14333, 13492, 8302, 5625, 6782, 3822, 2880, 1445, 1518, 6084, 3973, 4243, 5979, 3481, 2879, 5135, 5140, 9087]
13216I087J636O55K116j546L123K701n01q63J657J013N00o069m880N142N081l001
13200A5851m133m268o04N402L788k721k974j060J717K068l117J444L696j592m00
13185A3097K035P60J485M009O59m37K482J270j468L549k104l292L000K079ll10
13169B6811k49m544l439L291P36l870l242j001m360Q15J406l858k928j708k506
13154A354K412o58m81k778j664J897k05J000K246J561J725K449O6J553L491l2
13138A3936j55R18K39K159J78k967M68l873l068m9Q39K722J275k938L314L343
13122A6341k85M42j419k242J81J06j386l573m372l903n45m98l940l474J890k540
13106i217O692K338K762J571R74j873J667M293M694J628j00P72K380K339L101
$$ y = [9087, 10723, 11378, 13494, 11948, 15071, 17772, 17271, 16408, 18065, 19078, 19578, 13509, 8629, 13771, 18852, 15851, 11718, 7450, 6846, 12248, 16036, 13315, 10341, 9281, 10998, 13066, 9949, 11393, 15089, 13497, 13097, 15132, 15892, 17377, 21386, 22045, 21608, 24090, 25360, 23892, 27441, 25337, 22045, 25045, 27124, 27121, 26811, 26562, 22018, 18579, 21870, 22606, 18736, 15494, 14493, 10133, 10948, 12354, 8496, 5568, 3860, 1354, 3766, 3108, 2627, -151, -1815, 82, -123, 877, 3123, 4684, 6409, 8858, 8924, 10477, 13968, 13936, 13781, 14699, 14938, 17097, 17275, 14308, 14776, 10903, 7835, 7786, 8625, 11347, 12622, 9684, 12998, 16341, 16056, 16498, 15079, 12837, 13018, 13124, 11738, 8165, 3793, -110, -655, -1153, -5093, -8567, -6677, -9217, -2525, -187, 2575, 4146, 5120, 3247, 4914, 9207, 13901, 15529, 15429, 16201, 18581, 20920, 24021]
13091B4021j900K086k392m952j696k914L25R509N818L439K843J0087J0873M095
13077E9242L003N376Q11l50k491k833R70p09q035n820n932l511L688M327J797
13062D9533k586J468O483M374N228O935J1033J2526O142N676L679O674Q994Q183
13048A34342N874M073J037N874N635L540P330J3668J1922J3061J4432J4798J4121
13035B49707J6217J6709J6411K0540K3670K1540J9604K8436L4209M0034M9116
13024E36193N6480P1091Q6357Q9490J00669J23506J45248J74033K13166K66365
13014A862598L37201M32009N71941Q11455J217140J837039K543590K921101K729124
13005A5263198K000264J064116M26572J90630R2793k28581r92897j911286k619898
$$ y = [24021, 22121, 24207, 21815, 16863, 15167, 12253, 12578, 22087, 27905, 31344, 34187, 44274, 55147, 59242, 62245, 67621, 68432, 68082, 65591, 62758, 63728, 63019, 54984, 49164, 43232, 39721, 43409, 47736, 49533, 46947, 48415, 54898, 59272, 64500, 71435, 82468, 94994, 101136, 106812, 110491, 117165, 126159, 134342, 140216, 144289, 145326, 151200, 156835, 160375, 167705, 181373, 193295, 206356, 220788, 235586, 249707, 265924, 282633, 299044, 319584, 343254, 364794, 384398, 412834, 447043, 487077, 536193, 592673, 663764, 750121, 839611, 940280, 1063786, 1209034, 1383067, 1596233, 1862598, 2199799, 2631808, 3203749, 4015204, 5232344, 7069383, 9612973, 12534074, 15263198, 17263462, 18327578, 18754150, 18944780, 19037573, 18808992, 17816095, 15904809, 13284911]
12996A3284911k797245k454231j907408j352862q93202n84681l99031k79990j90479
12987B425782j23365p4708l0321R89M0093P9316J14729J52079J87556K21530K80772
12976C274452L58388M47469N54888O83063Q50209J095142J438310J983821K907495
12967A3593237M432004O594255Q570601Q971033P552151M750781K037435O20736
12959E7122233K88894l5126j497780m219902o949305q656849q498937p011693
12951B0541535n231817l563048k334818j578422j107810q09969o01500m50874
12943D863277l49445k64907j88652j20115o0581p279L7655P9701J40050K27315
12933D357019L25902M40645N68367P23972R33159J216389J650340K353513L535198
$$ y = [13284911, 10487666, 8033435, 6126027, 4773165, 3879963, 3295282, 2896251, 2616261, 2425782, 2302417, 2227709, 2197388, 2198377, 2238470, 2317786, 2432515, 2584594, 2772150, 2993680, 3274452, 3632840, 4080309, 4635197, 5318260, 6168469, 7263611, 8701921, 10685742, 13593237, 18025241, 24619496, 33190097, 42161130, 49713281, 54464062, 56501497, 57122233, 57411127, 57376001, 55878221, 51658319, 44709014, 36052165, 27553228, 20541535, 15309718, 11746670, 9411852, 7833430, 6725620, 5915651, 5314151, 4863277, 4513832, 4248925, 4060273, 3940158, 3879577, 3872298, 3909953, 3989654, 4129704, 4357019, 4682921, 5123566, 5691933, 6415905, 7349064, 8565453, 10215793, 12569306, 16104504]
12924A6104504N394152P680125R116151Q669474O511809L454920J188074L25119
12916E8444328J33785n75125k729942n636151q088222r026720q120884o382734
12908A8018335m566319l026079k010850j397971j011644p59073n81156m60631
12900D204612l78300l19956k66442k12901j70976j43334j17609q7364m5198M32
12890B462964N6723J08267J67039K38421L23274M34230O19372R28808J432185
12881F771283K150473K839606L035657K625232J710630P71880K35246P3188n9106
12872B0154089n45203j452445k382099k973285k943670k464139j862795j293425
12864D237028q60396n90126m20157l09003k41018j95809j63341j38649j23078
$$ y = [16104504, 21498656, 29178781, 38294932, 46964406, 53476215, 56931135, 58119209, 58444328, 58578113, 58002988, 55273046, 49636895, 41548673, 32521953, 24401069, 18018335, 13452016, 10425937, 8415087, 7017116, 6005472, 5246399, 4665243, 4204612, 3826312, 3506356, 3239914, 3027013, 2856037, 2712703, 2595094, 2507730, 2462532, 2462964, 2519687, 2627954, 2794993, 3033414, 3356688, 3790918, 4410290, 5339098, 6771283, 8921756, 11761362, 14797019, 17422251, 19132881, 19904761, 20140007, 20213195, 20154089, 19608886, 18156441, 15774342, 12801057, 9857387, 7393248, 5530453, 4237028, 3376632, 2786506, 2366349, 2057346, 1816328, 1620519, 1457178, 1318529, 1195451]
12855A195451j07094r2360q5074p8164p2348o7746n9004m4171m2113l7064k8105
12844D82208l0124l0110j7876j5190j3287j2581p377k602k333r082l877q465r172
12831C20132j2881j4613j0292p559o786n502o906n136m880k030p73J054R26j275
12817B43479n927o431m232m81k492m743n590q387j0197j1766q060q178q064o256
12803A52675p263p274o149O05J920M31L407M392o37k860M780R861M522K786K420
12788A63616j878o475o775j389m201o84k45m930k826m245L36M525N813K225M34
12773A43301m243r479l857Q16m149k986j399p46k036l607k479n868p817k07j553
12758I3691n340q310m358K144N144O581l081q112r61M085M094J036j79j059m139
$$ y = [1195451, 1088357, 995997, 910923, 832759, 760411, 692665, 633661, 589490, 547377, 510313, 482208, 452084, 421974, 404098, 388908, 375621, 363040, 355663, 353061, 350728, 341646, 337769, 329304, 320132, 307251, 292638, 282346, 274787, 268001, 262499, 255593, 250457, 245577, 243547, 242774, 243828, 244754, 243479, 237552, 231121, 226889, 226408, 223916, 219173, 213583, 205196, 194999, 183233, 175173, 166995, 158931, 152675, 145412, 138138, 131989, 132594, 134514, 134945, 138352, 142744, 142107, 139247, 144027, 153888, 158410, 161196, 163616, 161738, 155263, 148488, 147099, 142898, 142214, 141969, 137039, 134213, 129968, 130304, 134829, 140642, 142867, 143301, 139058, 129579, 125722, 126538, 122389, 119403, 118004, 117258, 115222, 111615, 109136, 103268, 95451, 95244, 93691, 88351, 80041, 75683, 77827, 82971, 89552, 86471, 78359, 77398, 81483, 85577, 86613, 86434, 85375, 81236]
12743H1236l733J684K60J993m280p951j328M875O802J0751J7289J8955J0356k199
12729A34710j2223j7777j3697m042o002n028j476k660j801j483k381l059J084
12716F4165p17k402j014J986J833j963q018k760l097m765J828J23j72l211n491
12701C6325j446M053k0J811k016K64L712m57l64N882O805R978J8986K6325J5058
12686A24896L770j0646j4049n351l598M181R263K0784K4232J3767l422j3856j2997
12673A36974j2614j1617q440l739q334o079j949k268j829l84k957l984k322o065
12659F4393j566j459q111k875M167J211n62O50j463L122L411M751P300J2103J4549
12644I9621K2082K4565J8818J2257J3415J4366O546P91k159n163o576r616j0472
$$ y = [81236, 77503, 79187, 79447, 81440, 77160, 69209, 67881, 72756, 79558, 90309, 107598, 126553, 136909, 134710, 122487, 104710, 91013, 86971, 80969, 75941, 74465, 71805, 70004, 68521, 66140, 63081, 64165, 63448, 61046, 60032, 62018, 63851, 61888, 53870, 51110, 48013, 43248, 45076, 45199, 45027, 41816, 36325, 34879, 38932, 38912, 40723, 38707, 38971, 42683, 42226, 41862, 47744, 54549, 64527, 83513, 109838, 124896, 128666, 118020, 103971, 98620, 95022, 99203, 108466, 129250, 153482, 167249, 163827, 149971, 136974, 124360, 112743, 104303, 100564, 92230, 86151, 84202, 81934, 80105, 79721, 76764, 72780, 70458, 64393, 62827, 61368, 53257, 50382, 54549, 55760, 55198, 55848, 54385, 57507, 60918, 65669, 72969, 85072, 99621, 121703, 146268, 165086, 177343, 190758, 205124, 211670, 212461, 210302, 205139, 198563, 188947, 178475]
12631A78475k094J0823L1426M3887M6650L7855K928k5895l6272l6117k6330j1700
12619B13636q12J2870J8672J5514l017k1897k3424k3808k3919r610m956j802J470
12606A48917K227p75n729j2285j0417n750N317J9509K7721K7005K1014K388o202
12593B12940o468L072J1920K5337M3494N2360N9183M3025K5197J3134j2377l8206
12581D32611m6305m0227k4365j5687r118Q104J9515K6803K4923O964o716k1010
12569C55492k4294j4289P788L3043O7984Q2170M7127k4547o9967q5817p4018o1685
12557B38987m1785k1023o272P276J6161J5981J2313P545M226L870J5147L4232
12545B86658M5007L9523J0390k6653l7998l4878k3693j6650j2333q215J702J2706
$$ y = [178475, 176381, 187204, 218630, 262517, 309167, 347022, 349950, 324055, 287783, 251666, 225336, 213636, 212824, 225694, 244366, 259880, 256863, 234966, 211542, 187734, 163815, 154205, 149249, 147447, 148917, 151144, 150369, 144640, 132355, 121938, 116188, 121505, 141014, 168735, 195740, 216754, 219142, 212940, 206472, 209544, 221464, 246801, 290295, 342655, 401838, 444863, 470060, 483194, 470817, 432611, 386306, 346079, 321714, 306027, 296909, 305013, 324528, 351331, 376254, 383218, 376502, 355492, 331198, 316909, 324697, 357740, 425724, 507894, 555021, 530474, 460507, 374690, 300672, 238987, 197202, 176179, 169907, 177183, 193344, 209325, 221638, 229183, 233409, 237279, 252426, 286658, 331665, 371188, 381578, 354925, 316927, 282049, 258356, 241706, 229373, 221158, 222860, 235566]
12533B35566L0891M6892M8213M3870L9799L6319K9143K9404L9440O5285R5332
12522G40154Q9929N1807J1788m3218j07860j28764j08082p6004l2442P526K6577
12511D31411L5503L0733L824k4094l0590k2388q055k358N992n462r978j5659j8900
12498C69979j1352p176j8213l0218k7084k5010j0336k423J1032K3483L3612N0381
12486C56675N4664M4979M0713L4426L4974N0956P0535O5701R713m7364q0455q1624
12474E53893m9658j0206K0250M0372M4877L0832K8637L5131L7502L2320M862k2122
12462G46690n2661n9936m1566k0083j6884k0852k5409k9333l7477l5213k9282
12451C77994k6198k4456j8510j1258o596m952l88O370P566O912L922p156j5151
$$ y = [235566, 266457, 313349, 361562, 405432, 445231, 481550, 510693, 540097, 579537, 644822, 740154, 830083, 881890, 893678, 850460, 742600, 613836, 505754, 429750, 397308, 404834, 431411, 466914, 497647, 501471, 477377, 446787, 424399, 416344, 413986, 419978, 414516, 404538, 388879, 369979, 358627, 351451, 333238, 303020, 275936, 250926, 240590, 238167, 249199, 272682, 306294, 356675, 411339, 456318, 497031, 531457, 566431, 617387, 687922, 753623, 763336, 715972, 635517, 553893, 504235, 494029, 514279, 554651, 599528, 630360, 658997, 694128, 731630, 763950, 768812, 746690, 694029, 634093, 592527, 572444, 555560, 534708, 509299, 479966, 442489, 407276, 377994, 351796, 327340, 308830, 297572, 290976, 286024, 285636, 292006, 299572, 306484, 310406, 303250, 288099]
12438B88099j1727l814J202K624J630J713P713J6135J4253J4869K2002K6295J6824
12425C97818P212n915j2200q673K711J0107J4893J6783R119m404j6498j8153j3088
12412C79712K008N507k142j3210k7707l7444l6811m0835l8082l1479k4456j9661
12400A15400j1204q821j0295m364J098K365n383k587N49j456L718L945q65m681
12386G7419k705k621K059P179O037P516J0723R909P703J2094J3481P223O045O475
12372A68537M259M460j743Q591K5088K4883K2593J7711J2183r34p215j3269j7096
12359B48048k0953k1648k1975j8185j1935p056o906n880Q44J0882J2679J9598
12347A77513K7474L8177M9735O3795P7968R9984J28316J73629K75436M92867Q69690
$$ y = [288099, 276372, 272558, 273760, 276384, 278014, 279727, 287440, 303575, 317828, 332697, 354699, 380994, 397818, 405030, 399115, 386915, 378242, 380953, 391060, 405953, 422736, 431855, 427451, 410953, 392800, 379712, 381720, 387227, 385085, 371875, 344168, 306724, 269913, 229078, 190996, 159517, 135061, 115400, 104196, 95375, 85080, 80716, 81814, 84179, 78796, 76209, 76758, 75302, 79020, 82965, 82100, 77419, 74714, 72093, 74152, 81331, 87368, 94884, 105607, 115516, 123219, 135313, 148794, 156017, 162062, 168537, 172796, 177256, 175513, 184104, 209192, 234075, 256668, 274379, 286562, 285628, 278413, 265144, 248048, 227095, 205447, 183472, 165287, 153352, 146296, 139390, 133510, 134354, 145236, 157915, 177513, 204987, 243164, 292899, 356694, 434662, 534646, 662962, 836591, 1112027, 1604894, 2474584]
12336B474584J252491R93129j7792p58464r57968q85410o07615l62497k22154
12327I08304j45120j03553p3243m4744k2420j3769k7926l9418m0938m0662k8640
12316C27871j0249P250J6452K4237K1825J0095j05k56M86J2631K5562L9402N2883
12303E28084O5766R2795J20919J56110K05518K63657L33195M45731O82130J163504
12293D057409K035243L305802L865340J655743j688257k994714l094940k475870
12285D665756j473589q32652m98618l23403k32547j79706j44456j16424q7792
12276G76569o7932n5864l7205l5579l5839l0284k8316k5067j1788j0017o566M797
12264D36909P481J2305K7327L5066M6090N8830P9714J03894J32876J75347K34222
$$ y = [2474584, 3727075, 4720204, 4702412, 3943948, 2985980, 2100570, 1492955, 1130458, 908304, 763184, 659631, 586388, 541644, 519224, 505455, 477529, 438111, 397173, 356511, 327871, 317622, 324872, 341324, 365561, 387386, 397481, 397376, 397120, 397606, 410237, 435799, 475201, 528084, 593850, 686645, 807564, 963674, 1169192, 1432849, 1766044, 2211775, 2893905, 4057409, 6092652, 9398454, 13263794, 14919537, 13231280, 10236566, 7141626, 4665756, 3192167, 2359515, 1860897, 1537494, 1304947, 1125241, 980785, 864361, 776569, 708637, 652773, 615568, 579989, 544150, 513866, 485550, 460483, 448695, 438678, 432112, 436909, 444390, 456695, 484022, 519088, 565178, 624008, 703722, 807616, 940492, 1115839, 1350061]
12253A350061L02876L88714N50231R05591J597773K743789L891467L031916l55094
12244A4407324k719754l164319k882712j908231j073942o41308m16791l03535
12236A296732k40957j89020j42463j07857q8575p0817m6215m0907l7178l0808
12226C01935k0853k1528j4339q448m694k206l014m660k052L787J0666J6385K1205
12213B72184L0370M4161N3465P2940R7070J18393J56570K43389M21018P57616
12203B267176J208752J235914L29255o74401j038415j041942p82641m69353k73616
12194G60729j71434j17662q8383o7758n0910l8526k5632k2075k0054j8610j4499
12183A25186j1036j0863j0623j1007r867m199Q36m957j525r44n798m751l098l178
$$ y = [1350061, 1652937, 2041651, 2591882, 3497473, 5095246, 7839035, 11730502, 14762418, 14407324, 11687570, 8523251, 5640539, 3732308, 2658366, 2017058, 1600267, 1296732, 1055775, 866755, 724292, 616435, 527860, 457043, 410828, 369921, 332743, 301935, 281082, 259554, 245215, 236767, 232073, 229867, 226853, 222193, 220141, 223928, 234594, 250979, 272184, 302554, 346715, 400180, 473120, 570190, 688583, 845153, 1088542, 1509560, 2267176, 3475928, 4711842, 5041097, 4366696, 3328281, 2286339, 1503698, 1034345, 760729, 589295, 471633, 383250, 315492, 264582, 226056, 200424, 178349, 158295, 139685, 125186, 114150, 103287, 92664, 81657, 71790, 67591, 68427, 63470, 61945, 61001, 55203, 50452, 47354, 44176]
12169D4176J044j399N85L439J455l941n080J896J224r23L56l200k854n084j066
12154C0628L181L82k93L0m156K246J636k232j218K978L448K256J247J07k18j774
12138C8248k415Q07O267K533P495J884j97j255j697o03j660l442N212J1832P196
12123G0205Q623J0307O797L949o89l560m023o509l380j427Q73O264M299L296M633
12108I9658K117j074j521l189o71l427K505R565J0495J0515J3166J5552Q902J2735
12094A75328K0129J9550J6506P767K937p28j860o778j1345r305j0823n451j903
12081A94024l268l621k535Q572Q091O067O715P119j28o370r276p342n107j173
12067A91768k605l758M317M5p02M928M576M161M660j246l20K940N342O772J2493
$$ y = [44176, 45220, 43821, 44406, 47845, 49300, 45359, 40279, 42175, 43399, 42476, 42832, 39632, 36778, 31694, 30628, 33809, 34191, 33898, 33928, 29772, 32018, 33654, 31422, 30204, 33182, 36630, 38886, 40133, 40240, 40022, 38248, 35833, 36640, 42907, 45440, 52935, 54819, 54622, 53367, 51670, 51067, 49407, 45965, 51177, 63009, 70205, 78828, 89135, 95932, 99881, 99192, 95632, 91609, 85100, 81720, 80293, 81166, 87430, 91729, 95025, 99658, 101775, 100701, 99180, 95991, 95320, 91893, 94398, 103963, 114458, 124973, 138139, 153691, 162593, 175328, 195457, 215007, 231513, 239280, 242217, 241489, 239629, 232851, 221506, 212201, 201378, 195927, 194024, 190756, 187135, 184600, 193172, 201263, 207330, 214045, 221164, 221036, 214666, 205390, 198048, 192941, 191768, 189163, 185405, 189722, 189767, 189065, 193993, 198569, 202730, 207390, 206144, 205824, 208764, 214106, 220878, 233371]
12052B33371J6844Q146O341R935J1670J7198K9449M5257M7771K5611j171k4841
12040D25581l8170m4535m7434l9186l3300k8195k4047j2607j4378r519m015k753
12028A27442L294N660M085N660n291p806j0064r216o334r28M63L605N851L667
12014A20088K950L331L996N587O487J2344K6686L5383M7783N4652M1759K5340
12002C86386P121j1886k1384k5755j4108n612L345N60q511k2801l6908m6187m3190
11989A61070l5423k6633k1981j3104r137n561p365p430l758n001m338J199K60
11976B2798L556m22N72j594k328j806J100l447k880J907K893P643M758J766N615
11961D0131J4679J7650K6010L1013L5990L8718L0052J0491n62j6518l3695l6505
$$ y = [233371, 250215, 258361, 264702, 274637, 286307, 303505, 332954, 378211, 425982, 451593, 450422, 425581, 387411, 342876, 295442, 256256, 222956, 194761, 170714, 158107, 143729, 134210, 130195, 127442, 130736, 136396, 140481, 146141, 140850, 133044, 122980, 113764, 107430, 106502, 106965, 110570, 116421, 120088, 123038, 126369, 130365, 135952, 142439, 154783, 181469, 216852, 264635, 319287, 361046, 386386, 393507, 381621, 360237, 334482, 320374, 314762, 318107, 318667, 310156, 287355, 250447, 204260, 161070, 125647, 99014, 77033, 63929, 54792, 49231, 41866, 34436, 30678, 25677, 21339, 22538, 22798, 26354, 25932, 26504, 24910, 22582, 20776, 21876, 18429, 15549, 17456, 20349, 27992, 32750, 34516, 40131, 54810, 72460, 98470, 129483, 165473, 204191, 234243, 244734, 244172, 227654, 193959, 157454]
11949A57454l8179l0736k0273j7130j2224r283m392j954l458n290m732o153m288
11936f38q15J717k5j055L193N494J67O35l515l794k63l588j941J231O328J099
11920D230L287L379k01o126k448l39k039k734j846J014l472k090K383L290K090
11905a622K609Q64n746j549k383o54J659J50P93N981J629l463k169K564M74N825
11889D962M408K528P588L058m473m709n925m834j585m035j159K01M378K007q99
11874A511J709J412J33m514J07M97l744k141K448J982O49j815K67J313L958M95
11858D267M491N762M182J1601J1842J6927L1676N5695Q1078M1553k9942n1776
11846A87356n4675m1137j3659M187N633p708j5497j2579j7278j0144m613n631
$$ y = [157454, 119275, 88539, 68266, 51136, 38912, 29629, 25237, 23283, 19825, 14535, 9803, 3650, -638, -1453, 264, 239, -816, 2377, 7871, 8038, 8673, 5158, 1364, 1101, -2487, -4428, -3197, 3131, 4230, 7517, 10896, 10695, 4569, 2121, 1782, -257, -2991, -4837, -3823, -7295, -9385, -7002, -3712, -1622, 987, 1851, -3895, -5444, -7827, -8481, -6822, -6672, -5879, 102, 1731, -1732, -3901, -1337, -863, 4962, 9370, 11898, 19486, 22544, 18071, 13362, 7437, 2603, 1018, -3017, -4176, -3975, 403, 2410, 1511, 3220, 4632, 4765, 251, 358, 855, -2889, -5030, -2582, -600, 49, -1766, -1499, -186, 3772, 4267, 8758, 14520, 18702, 30303, 42145, 59072, 90748, 146443, 227521, 269074, 239132, 187356, 132681, 91544, 77885, 82072, 87705, 79997, 64500, 51921, 34643, 24499, 19886, 14255]
11834A4255l604n480r53K960P08l453N80P63k903n171m883J70L058K217l219m369
11818i324l52K155k991L26L281J869j208Q23l265r51N382P51M29R87P010N561
11802A0483K249L495J1820J5623K0298J1790q750j6584j6768j7075j0640N46j752
11789D735p26P02l177o87j359N0N53k64J783J166m359o150m081L009K536m821
11773a1090k319N005M138m792l41J372o61J300j0l5J662q17K792K708l095k798
11757f981J504K534L642J0605P788l167l378l345k748n818j707l89l37p78L346
11742G71M927k636l488P7j354k150k906j058j47L154n28m586k46n81l991k132
11726a6874J365K925P294J188j295p004k401J605j56r32Q37m71J644K255K750
$$ y = [14255, 10651, 5171, 4218, 7178, 7886, 4433, 5013, 5776, 2873, -2298, -7181, -7011, -3953, -1736, -4955, -9324, -9676, -7521, -10512, -10186, -6905, -5036, -6244, -5421, -8686, -9637, -4255, -3504, -3075, -2088, 4922, 10483, 12732, 16227, 28047, 43670, 63968, 75758, 67008, 50424, 33656, 16581, 5941, 6487, 4735, 4009, 4711, 1534, 847, -512, -462, 91, -173, 1610, 2776, -1583, -7733, -11814, -8805, -6269, -11090, -13409, -8404, -4266, -9058, -9399, -8027, -8688, -7388, -7398, -7433, -5771, -6588, -3796, -1088, -4183, -6981, -5477, -2943, 699, 11304, 19092, 15925, 12547, 9202, 6454, 636, -1071, -1460, -1797, -2575, 771, 5698, 3062, -426, -349, -1703, -3853, -6759, -7817, -7964, -4810, -5338, -9924, -10170, -10751, -14742, -16874, -15509, -12584, -5290, -4102, -5397, -12401, -14802, -13197, -13353, -14285, -13448, -13919, -12275, -10020, -7270]
11711g270k21j654k393k832P98N56k298J402L240o55m55k598k777l195j038N761
11695a5629M283J427J936L739R66k470J799J33m107o126L803N1J715L26O49l448
11679a0953L017l26J94K825l593k895j286J83J898N94R00K312N86q5K119k11j067
11662e788m61Q46k112j775J367K548P19n954k390M120L163K425j957n682p98j34
11646a1863K919K961j855m848j831K178j373J783j131L833K581M62K139M68k344
11631e921j0k29M25O50l108j175q21p75O23K11N02P4J356j222m228K531j730M101
11613h746J1K027J064l800j595J178l52J70j886l795k348J309J940K248K714J872
11597g989J562R67j839M87j385n350n723L994N329L31j056k71M016K405j090J682
$$ y = [-7270, -7491, -9145, -11538, -14370, -13572, -13016, -15314, -13912, -10672, -11327, -11782, -14380, -17157, -20352, -21390, -15629, -11346, -9919, -7983, -4244, -3278, -5748, -3949, -3816, -7923, -14049, -10246, -10195, -8480, -8154, -7505, -10953, -7936, -8262, -8068, -5243, -8836, -11731, -13017, -12834, -10936, -10342, -9442, -7130, -6544, -6629, -4510, -4721, -5788, -6249, -5403, -7515, -9290, -7923, -5375, -4656, -10610, -13000, -8880, -5717, -3292, -5249, -10931, -11729, -11863, -8944, -5983, -7838, -12686, -14517, -12339, -13712, -11929, -13060, -9227, -6646, -6184, -4045, -3577, -5921, -5931, -6160, -5735, -5085, -8193, -9368, -10189, -10964, -10341, -10130, -9628, -9554, -8198, -9420, -13648, -11117, -12847, -8746, -8735, -6708, -5644, -9444, -11039, -9861, -10213, -10043, -11929, -15724, -18072, -16763, -14823, -12575, -9861, -7989, -6427, -5460, -7299, -6812, -8197, -13547, -19270, -15276, -9947, -9616, -10672, -10943, -6927, -4522, -5612, -3930]
11581c930N13j188k687K949R04j46j955l364J303L015l306k836L078k846l219
11566a3715l276O6K072N84L380O019J349l003j611m428k157K392N081Q41K14O94
11550e498j763k662L197L362j370o066m144N04P12J025J54j185p66O92O08J545
11534a1655L176o64o31j011r94J245p32r61K109l561K117n59m827N05L864J295
11518a1284M346P15k01n334K21J97K281J979j715r61K727k409j759K02K078K725
11502f192l42k030l56k451j168k835J072J857j607L210p91k034k064R48j493j952
11486a8228j417N841J644l788k179l6P528K880k764m29l254J229J443J211L308
11471g011J003k396l304m163J447M267j082j114K068L4p00l118L3m28J393Q10
$$ y = [-3930, -3417, -4605, -7292, -4343, -3439, -3585, -5540, -8904, -7601, -4586, -7892, -10728, -7650, -10496, -13715, -16991, -16925, -14853, -14269, -10889, -4870, -3521, -6524, -8135, -12563, -14720, -12328, -7247, -6406, -6192, -5498, -7261, -9923, -6726, -3364, -4734, -10800, -14944, -14440, -13728, -12703, -12549, -13734, -14500, -13808, -13200, -11655, -8479, -9143, -9774, -10785, -11779, -10534, -11266, -12227, -10118, -13679, -11562, -12121, -16948, -16443, -12579, -11284, -6938, -6223, -6424, -11758, -11537, -11340, -9059, -7080, -8795, -9756, -7029, -9438, -11197, -10995, -8917, -6192, -6534, -8564, -8920, -11371, -12539, -15374, -14302, -12445, -14052, -10842, -11633, -13667, -15731, -14783, -16276, -18228, -19645, -13804, -12160, -15948, -18127, -18163, -10635, -7755, -10519, -10948, -14202, -12973, -11530, -10319, -7011, -6008, -8404, -11708, -15871, -14424, -10157, -11239, -12353, -10285, -10251, -10951, -14069, -14036, -14464, -13071, -12261]
11455a2261n92K133O294n3j393k94k095l627r04p22M835K991j776j724K55K470
11439f463j409j348J184j45K097J254r34O13k922k533k569k20J994P19l539j056
11423a5277J938L593O705J235m733o024k221N020L031k092J132J089J663J03j142
11408e980L153P5k962o56R61M055O521N060K234M999P768J1997J4358J7875J6369
11393H5827R864n820j3671j2515j8020j6651j3143o267k608k196j636j587L764
11380E341L1j370N72J581N41J668K685J935K070K455L521J882N592R860J2461
11365E0825J5189J5714J6770Q913N283K917j082j55N844K1072M0803M9167M9063
11352B80323L8471K856l2007m9463m9779m7943m1457l0181j8133o520n446m995
$$ y = [-12261, -12853, -10720, -4426, -4479, -5872, -6166, -8261, -11888, -12792, -13514, -8679, -5688, -7464, -9188, -8933, -6463, -7872, -9220, -8036, -8181, -6084, -4830, -5764, -5151, -8073, -10606, -13175, -13395, -11401, -10682, -14221, -15277, -13339, -9746, -3041, -1806, -6539, -12563, -14784, -9764, -6733, -8825, -7693, -6604, -4941, -4838, -5980, -2827, -2752, -5714, -6370, -5409, -1354, 5167, 10227, 12461, 17460, 25228, 37225, 51583, 69458, 85827, 95691, 89871, 76200, 63685, 45665, 29014, 15871, 9604, 6996, 4800, 3164, 1577, 5341, 5372, 4002, 4574, 6155, 6696, 8364, 11049, 12984, 15054, 17509, 21030, 22912, 28504, 38364, 50825, 66014, 81728, 98498, 107411, 112694, 115611, 114529, 114374, 120218, 141290, 182093, 231260, 280323, 318794, 321650, 289643, 240180, 190401, 142458, 101001, 70820, 52687, 46167, 40721, 35726]
11340C5726m817m333p091l927k13N96K724L069R74K083Q553J1178J1578P204J7434
11325H0738K6580M5162N7133N3728M3792J7807r377k8587m3050k9973j0229J5203
11313B18927L7658M8510L9353J6440j6353m4077n8948o1591m9283l4618k5143
11302G0875j8248j1494l596j908l230l030M296L01j866k658M759L394J27K691
11288D0413O644L854N626J1945K1095L2819M4001N4904N3470L2923M67k7039m4473
11275B36649m4335l8782k7012l954O800M345O31J153j1496j9517j7680j9702j5667
11262E1433j1720o627l596o06n281o710j602k820lj805Q80M11L11p7J198l52k921
11245A0113M458L580O433O920J0606J9483J9168J7246N881p006j3860j7894j8827
$$ y = [35726, 30909, 26576, 19485, 15558, 15345, 15941, 18665, 21734, 22708, 24791, 33344, 44522, 56100, 63304, 80738, 107318, 152480, 209613, 263341, 307133, 324940, 315563, 286976, 243926, 213953, 203724, 218927, 256585, 305095, 344448, 360888, 344535, 300458, 241510, 179919, 130636, 96018, 70875, 52627, 41133, 37537, 35629, 32399, 29369, 33665, 33966, 32100, 29442, 34201, 37595, 37722, 40413, 47057, 50911, 56537, 68482, 89577, 122396, 166397, 221301, 274771, 307694, 308161, 281122, 236649, 192314, 153532, 126520, 122566, 129366, 133711, 134342, 135495, 123999, 104482, 86802, 67100, 51433, 39713, 33086, 29490, 28884, 23603, 16893, 15291, 12471, 12468, 10663, 11543, 11954, 12265, 12188, 13386, 13034, 10113, 14571, 18151, 24584, 31504, 42110, 61593, 80761, 98007, 103888, 96882, 83022, 65128, 46301]
11232D6301j8856r905o160m612j649m430l735M15J12O107R21R26K352j596o52
11217E539k217m494m761m642J294O46o37q63l585P11L101K48K551l536O19O039
11201c987L082l128k855N62J040K255l38j984L152j664n876l288L143N009j607
11186f484j155k22J24j137J311j584j631j141m19k369n08M882N63K018j268j931
11170a0951l616j286N41P04k044p14k297P04O977P748K401k448l818j842J297
11155h644k26l876j627J821M312Q11N39N180L275k365n519P05L340j388j598n984
11139a1244j884K922K01k317K698L125L104k296r82j01R44J160l733O40k919l758
11123a4440m08J047L845M950q30j42l114o82k245J827n01J561L307m4l151j409
$$ y = [46301, 27445, 17540, 11380, 6768, 5119, 689, -3046, -2631, -2519, 3588, 4509, 5435, 7787, 6191, 5539, 3322, -1172, -5933, -10575, -9281, -8635, -9272, -10135, -13720, -13009, -9908, -9660, -7109, -10645, -10026, -3987, -905, -4033, -6888, -6326, -5286, -3031, -3369, -5353, -2201, -3865, -9741, -13029, -9886, -4877, -6484, -7639, -7861, -7737, -8874, -7563, -9147, -10778, -11919, -12338, -14707, -15215, -10333, -9770, -7752, -9020, -10951, -14567, -15853, -15312, -14608, -16652, -17366, -19663, -18959, -11982, -4234, -1833, -4281, -8099, -9941, -8644, -8870, -12746, -14373, -12552, -8240, -7429, -6890, -1710, 1565, -800, -6319, -5614, -2274, -3662, -5260, -11244, -13128, -10206, -10005, -12322, -9624, -6499, -3395, -5691, -6673, -6774, -5830, -4670, -8403, -7763, -10682, -14440, -14848, -13801, -9956, -5006, -5836, -5978, -9092, -9774, -12019, -10192, -10693, -9132, -5825, -5869, -9020, -10429]
11107a0429j117J554j166j01K05k208N00N64j629j27L94j468r4M799R17K83m075
11090a3198k688J139M897J727k244K200M14L383J50p04m46k529k195J26K911J076
11074e981K244j887j400K509j147R38J191J935k243j370M254n50m546K681K636
11059g36m961j433L347l156l805J11P51O09j66J798L264L54j045K891p30l153
11043f060L9j16j254k002l238j168M25M400K560j206l344R79j761l145j463K94
11027a6060J361N949L015k412j49O87K044N75j079k175k136k773J781L757k003
11012i618p70n188J837M851j608k157J557K846K565l530m109L894J379O59P64
10997f628K497q82k447P51K59n890m269m43L649K242l89N994J340k206m857j790
$$ y = [-10429, -11546, -9992, -11158, -11259, -11054, -13262, -12762, -12198, -13827, -13954, -13560, -15028, -15122, -10323, -9406, -9123, -13198, -15886, -14747, -9850, -8123, -10367, -8167, -7753, -4370, -4220, -4924, -5370, -7899, -10094, -9968, -7057, -5981, -3737, -5624, -7024, -4515, -5662, -4724, -3533, -1598, -3841, -5211, -957, -1507, -6053, -3372, -736, -5697, -7130, -3783, -6939, -10744, -10633, -9882, -9273, -9439, -7641, -4377, -4023, -5068, -2177, -2907, -6060, -6021, -6137, -7391, -9393, -12631, -13799, -13374, -8974, -6414, -7620, -10964, -9985, -11746, -14891, -16354, -16060, -14699, -8750, -5735, -8147, -8296, -7609, -5565, -4990, -6069, -8244, -10380, -13153, -11372, -7615, -9618, -10388, -15576, -13739, -8888, -10496, -12653, -11096, -8250, -5685, -9215, -13324, -9430, -8051, -7392, -6628, -4131, -5013, -7460, -6709, -6450, -12340, -16609, -17052, -13403, -11161, -11550, -5556, -4216, -6422, -11279, -13069]
10981a3069L145J303k12L084r9k99l082J338K335k84l818O78K386R21o22j706
10965h001L886M776M996J350k79K961Q955J1665J5964K4667K3157J9043N512j0085
10951A08567k1720k4218j6424q726q728p316j611m304m601J123k327m377l899
10938A439l29K309L531n70m74r29j74j000J008L482N93J555M009Q626O354L547
10922C2977P622J0044P051J6807K3555L3537N3915P4990Q0192N9023J1209k9956
10910C80966n3488n4530m4459k8938j3344q702k0653k6522k8013k4960j7011q243
10898E2103q829p990p076n878k889l019M20m369m562K556j261N448Q901K423j676
10883B4302J667R964J4693J5583J3200J2896K5028L5809N7057P8295Q5472O9873
$$ y = [-13069, -9924, -8621, -8833, -5749, -5848, -6147, -9229, -7891, -5556, -5840, -9658, -8980, -6594, -5673, -6295, -8001, -4115, 661, 5657, 7007, 6728, 9689, 18644, 30309, 46273, 70940, 94097, 113140, 118652, 108567, 86847, 62629, 46205, 37479, 28751, 21435, 19824, 15520, 10919, 12042, 9715, 5338, 1439, 1110, 3419, 6950, 6380, 5906, 4977, 4803, 3803, 4811, 8293, 8886, 10441, 14450, 23076, 29430, 32977, 40599, 50643, 57694, 74501, 98056, 131593, 185508, 260498, 340690, 399713, 410922, 380966, 327478, 272948, 228489, 199551, 186207, 177505, 156852, 130330, 102317, 77357, 60346, 52103, 43274, 35284, 28208, 22330, 19441, 16422, 16842, 12473, 7911, 10467, 9206, 14654, 23555, 25978, 24302, 25969, 35933, 50626, 66209, 79409, 92305, 117333, 153142, 210199, 288494, 373966, 443839]
10871D43839K6670j6428l9413k7980J255K5442K1876m202m2793o9778p4803o4242
10859A79443m9608l0497j8626j6616j2666n910q468q400l201k092P32O62L68J350
10845B6471q71q35l58K477L296K154J229L408N952R701J8079K5692K8958K9960
10831A55313K9049J4808Q642R533K2059M6496O1475M7039R106l4761o0584o7261
10819B40914n4970l7166k8403k5263k4173k3066j4383p716K033k965o074p629
10807A1139Q72M920J725m321m850N94o78l358k773j961j617J52N632J204N671
10792A2351L436Q57P18L703J0339J3280J9574K3867K0482J5868O74q789j7513
10779I8847k6843k4728j8166p828l179l233m055l187p859N22J221m66k317k202
$$ y = [443839, 470509, 454081, 414668, 386688, 387943, 413385, 435261, 431059, 388266, 318488, 243685, 179443, 129835, 99338, 80712, 64096, 51430, 45520, 37052, 28652, 25451, 23359, 24091, 24753, 25121, 26471, 25600, 24765, 24407, 26884, 30180, 32334, 33563, 36971, 42923, 52624, 70703, 96395, 125353, 155313, 184362, 199170, 207812, 217345, 239404, 285900, 347375, 394414, 403520, 368759, 308175, 240914, 185944, 148778, 120375, 95112, 70939, 47873, 33490, 25774, 27807, 24842, 18768, 11139, 12011, 16931, 18656, 14335, 9485, 10079, 9401, 6043, 3270, 1309, -308, -156, 5476, 6680, 12351, 15787, 16644, 17362, 21065, 31404, 44684, 64258, 88125, 108607, 124475, 125149, 116360, 98847, 72004, 47276, 29110, 21282, 18103, 14870, 10815, 7628, -231, 291, 1512, 1046, -1271, -3473]
10765c473N53R13j382j670j897M719M938l396M9L912k55j573k640k116K643K157
10749A482j035l469m95M23o48K362J66K562J64m826m785l245K227K478J683J893
10733c063K649j267j407J754M742J437l217j215Q41j348K868L251L216J0j842
10718G409j187J276K879K021j209j85N87k112n3O262L294p092n927j224K275N721
10702A2735J360K401J706j234j623K137J847M002k337o595n306M66J897l48j60
10687A0948L825N118M014l865m415K279L984M076k716l631n128J938j197L38M630
10672B0198M963M177J467o20n210j540O01K466J309n190j110K053K061R16n548
10657B0993n393J114M92J305J132j212p94R00L58J38N57q2l112n613j891K822
$$ y = [-3473, -2920, -2007, -3389, -5059, -6956, -2237, 2701, -695, -646, 3266, 3011, 1438, -1202, -3318, -675, 1482, 447, -3022, -3517, -3094, -3742, -1380, -1214, 1348, 1512, -3314, -8099, -11344, -9117, -6639, -4956, -3063, -414, -1681, -3088, -1334, 3408, 4845, 1628, 413, 1254, -94, 2774, 6025, 9241, 9251, 7409, 6222, 7498, 10377, 12398, 11189, 11004, 11591, 9479, 9426, 15688, 18982, 11890, 5963, 4739, 7014, 12735, 14095, 16496, 18202, 16968, 15345, 17482, 19329, 23331, 20994, 14399, 9093, 9559, 11456, 11108, 10948, 14773, 19891, 23905, 20040, 15625, 17904, 21888, 25964, 23248, 19617, 14489, 16427, 15230, 15568, 20198, 25161, 29338, 30805, 30185, 24975, 23435, 24036, 26502, 27811, 22621, 21511, 23564, 25625, 26541, 20993, 15600, 16714, 17206, 18511, 19643, 18431, 17637, 18537, 18895, 19033, 19590, 19508, 16396, 10783, 8892, 11714]
10641A1714M550L163O817O672K029k713l666N26k230m551J173K474N16P067N037
10626C8578O439J773J839P097J5231P222q63j1181j1925j4622o176k54j718l83
10612C1057P10N000j149n265k325m914n162k777m52j31l714L954K699P51n85r18
10596A6779Q73q85J338j580N30L401j51q89K50j434L134M227N904Q929K988P822
10580E1236J3436J7974K8309L0499K1968j674j8774k8462k5367k1672j2613n249
10568D9611m599l072m228n330m552l636k257l212k08K710j498n488k701J873L157
10553A6570p34j572M6P661J99j397J987k044m528k704o91Q09M045Q44j432L661
10537B0720N799P621R853J5872K5897L0838K9561Q675j7764l0165k7698k1662
$$ y = [11714, 16264, 19427, 26244, 32916, 34945, 32232, 28566, 29092, 26862, 22311, 23484, 25958, 26474, 33541, 38578, 45017, 46790, 48629, 55726, 70957, 78179, 77316, 66135, 54210, 39588, 33412, 33158, 31440, 31057, 31767, 36767, 35618, 30353, 28028, 23114, 17952, 15175, 14723, 14592, 10878, 14832, 17531, 18282, 17697, 16779, 17652, 16767, 18105, 16525, 17055, 20456, 20305, 19416, 19666, 18232, 21366, 25593, 31497, 40426, 43414, 51236, 64672, 82646, 110955, 141454, 163422, 161748, 142974, 114512, 89145, 67473, 54860, 49611, 45012, 41940, 37712, 32382, 27830, 24194, 21937, 18725, 18517, 21227, 19729, 14241, 11540, 13413, 16570, 15836, 14264, 14310, 21971, 22170, 20773, 22760, 20716, 16188, 13484, 12793, 13602, 17647, 18491, 17059, 20720, 26519, 34140, 43993, 59865, 85762, 116600, 146161, 154836, 137072, 106907, 79209, 57547]
10525E7547j5500r409n677q621j198J016L74n189m655k843M559K237K535n850
10511I326j993K013j260J039Q73J231r50l028r56j925K539N655M181q34K564K514
10495B0989L36n418k147l58K578M418Q357Q029J0179J1357P244l653p823p412
10481D6676p015m144m789m305n130o889j163J065L190J008p72o64l286l003j262
10466I517J31J774J377L490N041M623j797j203l3j309K067R27K71l210l622K514
10450B0558M402m5K7K215L732L566L218K580J914K647J47M012N207O769J5153
10435G6102K0600J5878M269j96J099N501J1255J8186K4977K7318M1341O1662P6502
10422C84494R4613J24248J73287K70546M79629R25744J680012J859449K68003
$$ y = [57547, 42047, 32638, 26961, 18340, 17142, 18158, 18532, 13343, 8688, 5845, 10404, 12641, 15176, 9326, 7333, 9346, 8086, 9125, 9998, 11229, 10279, 7251, 6295, 4370, 6909, 12564, 16745, 15911, 18475, 20989, 21325, 15907, 13760, 13402, 15980, 20398, 28755, 36784, 46963, 58320, 65564, 61911, 54088, 46676, 39661, 35517, 30728, 26423, 21293, 14404, 13241, 14306, 17496, 18504, 17732, 17068, 13782, 10779, 9517, 9648, 11422, 12799, 16289, 21330, 25953, 24156, 22953, 22920, 21611, 23678, 24605, 24876, 21666, 18044, 20558, 24960, 24915, 24942, 27157, 30889, 34455, 37673, 40253, 42167, 44814, 44961, 48973, 54180, 60949, 76102, 96702, 112580, 116849, 116653, 117752, 123253, 134508, 152694, 177671, 204989, 246330, 307992, 384494, 479107, 603355, 776642, 1047188, 1526817, 2452561, 4132573, 5992022, 6260025]
10413F260025j076146j248024j287065j003188n58678l17361j97089j33439r0765
10404C48270o5777m8035l5578k8885k3532j4028j4531o842k575K64l281o357r885
10391H9228j3348r041r2O26p890p396o674n247o62k204m252m614k8K142L88K49
10375C1185q47n986k168n21K596M919K54j065j968K595M34j250j841k631k40J373
10359B4839J212K179J203j675L90o68K904M249k513Q0K44m946l150Q13J339J98
10343B6698j482k395k851l437J481L448k351k465L313K49j611N20j967j256m654
10328A1240j783J581L637k200J814J209m42m64K907P84k68K384r18m725o2M117
10312A8811j81n05q9J604l93M15p55j608L669J747m031j810q63J566L612R30o23
$$ y = [6260025, 5183879, 3935855, 2648790, 1645602, 1086924, 769563, 572474, 439035, 348270, 282493, 234458, 198880, 169995, 146463, 132435, 117904, 111062, 108487, 108751, 105470, 99113, 89228, 75880, 66839, 66747, 67373, 59483, 52087, 45413, 40166, 39504, 37300, 33048, 28434, 28406, 30548, 30936, 31185, 30338, 24352, 22184, 21663, 24259, 29178, 29432, 28367, 26399, 28994, 29428, 28178, 26337, 23706, 23466, 24839, 26051, 28230, 29433, 27758, 28148, 27480, 30384, 34633, 32120, 32200, 32444, 27498, 24348, 25161, 26500, 26698, 25216, 22821, 19970, 16533, 18014, 21462, 19111, 16646, 19959, 20208, 18597, 19117, 17150, 15894, 11240, 9457, 11038, 14675, 12475, 14289, 15498, 15056, 14592, 17499, 18283, 18015, 20399, 19481, 14756, 14694, 18811, 18630, 18125, 18036, 19640, 19247, 19662, 18907, 17299, 20968, 22715, 18684, 16874, 16011, 17577, 21189, 22119, 21496]
10295B1496J964K359K08l20k321k036L64m0j80N483L111J10K07k708L204Q73j981
10278B9793J388l153n807l765M791M884k075j6j77K744J655L204n615l092Q43
10263B5602m162o484r2K474J467J115n71k336j246K313N96O69K994J927J686R00
10247B6852J953J169k889m001r25L279N69k397n89j062J34p27k122L219M094K941
10231B9498k54N10K263N672N73l03m398m243Q78K716p18q89N995K650l575k473
10215C3902K542L093j853l430o822P79L91Q75R49j808J040J111j432P34L205K224
10199C5500m37l025P78M412j054m088K082J3490P382J506l631k699l697n476M038
10184D5081M86l825m717L94M71Q79j887J298j8l787l190k516k816k429K097L883
$$ y = [21496, 23460, 25819, 26027, 25707, 23386, 21350, 21714, 21674, 21494, 26977, 30088, 30198, 30405, 27697, 30901, 31774, 29793, 31181, 28028, 22221, 18456, 23247, 28131, 26056, 26040, 25863, 28607, 30262, 33466, 27851, 24759, 25602, 21440, 14956, 14864, 17338, 18805, 19920, 19349, 17013, 15767, 18080, 18676, 19345, 22339, 24266, 25952, 26852, 28805, 29974, 27085, 23084, 22159, 25438, 26007, 23610, 23021, 21959, 22093, 21366, 19244, 22463, 26557, 29498, 29244, 29754, 32017, 37689, 38262, 37959, 33561, 29318, 30196, 32912, 32194, 31305, 37300, 39950, 36375, 33902, 36444, 39537, 37684, 34254, 27432, 28211, 28602, 29477, 30426, 28618, 29658, 30769, 29337, 30071, 33276, 35500, 35063, 32038, 32816, 37228, 36174, 32086, 34168, 47658, 55040, 56546, 52915, 50216, 46519, 41043, 45081, 45567, 41742, 37025, 37419, 37890, 38769, 36882, 38180, 38162, 34375, 31185, 28669, 25853, 23424, 25521, 29404]
10168B9404J405l352k725L882L975K166n22j84K157M969l69n030k387k501J283
10153C2171p35P04j505L083m37m28k117J934K581q99r65R25k627j844J830M346
10137C6017K342J341P4Ml334J376K835N280J041m889J10M908J329p61k37K463
10121D9899L201j828J48M621L856K957N181P237J8488L0216N7865Q2497O5137
10108C29475K966m6962n5289o0217m8621l2071j4090n750p69m208q447m552k632
10095D8833J925L1m533l44J194j788l065P02J601L584K576m173k887k44K027L249
10079D8688N32n164j975l3P76K113j910O45J801j688P69M29k293M35n18K63N99
10062D3469K09j920N42J491K084p98J219Q34j245J419r59j951K442L777k054k334
$$ y = [29404, 30809, 27457, 24732, 28614, 32589, 34755, 34233, 34049, 36206, 41175, 40806, 35776, 33389, 30888, 32171, 31436, 32140, 30635, 33718, 33281, 32853, 30736, 32670, 35251, 34352, 33387, 34312, 31685, 29841, 31671, 36017, 38359, 39700, 39774, 39778, 36444, 37820, 40655, 45935, 46976, 42087, 42197, 47105, 48434, 47673, 47436, 49899, 53100, 51272, 51420, 56041, 59897, 62854, 68035, 75272, 93760, 123976, 181841, 264338, 329475, 332441, 285479, 230190, 169973, 121352, 89281, 75191, 69441, 68672, 64464, 56017, 51465, 48833, 50758, 50789, 46256, 45912, 47106, 45318, 42253, 42955, 44556, 48140, 50716, 46543, 43656, 43412, 45439, 48688, 49220, 44056, 42081, 42048, 42824, 44937, 43027, 43672, 45473, 43785, 44554, 44983, 42690, 43125, 42607, 42870, 43469, 43678, 41758, 42300, 43791, 45875, 45077, 46296, 47130, 45885, 47304, 46345, 44394, 46836, 50613, 48559, 46225]
10046D6225j782j303O37N70P76J460L638J305m386k250l502k300M83K299K324
10031D4194N529J38J035O50l978k393m879J558L787K850N203L769L654J31P65
10016F2013K09k879k876l251K103L278J007R76P378J0203O357m236p268m259o563
10001F2192o910n29l790j837O03M374K965j514k361j794L984K742L102K135j518
9986F1844k943j90O29j207J202o241J077M677K269m13k364j082l487j633K057
9971E4195M77M289JJ300M17k160L419J789p23n51j086k187q71J676K460K138K529
9954F7112L760l941L36O26R9J315J966J143J984M18k228k294j626J952K005J321
9938G3948L272k189n282n84K965p27j959q6K552l5J696L373j881l482o52N788
$$ y = [46225, 44443, 43140, 43777, 44347, 45123, 46583, 50221, 51526, 47140, 44890, 41388, 39088, 39571, 41870, 44194, 49723, 49861, 50896, 51546, 47568, 45175, 40296, 41854, 45641, 48491, 53694, 57463, 61117, 61248, 62013, 62222, 59343, 56467, 53216, 55319, 58597, 59604, 60580, 67958, 78161, 84518, 80282, 73014, 68755, 62192, 55282, 54753, 50963, 49126, 49729, 54103, 57068, 55554, 53193, 51399, 55383, 58125, 61227, 63362, 61844, 58901, 58711, 59340, 58133, 59335, 53094, 54171, 58848, 61117, 60704, 58340, 57258, 53771, 52138, 54195, 54672, 58961, 58962, 60262, 60679, 58519, 61938, 63727, 63004, 62453, 61367, 59180, 58309, 59985, 62445, 64583, 67112, 70872, 66931, 67267, 67893, 67992, 69307, 71273, 72416, 74400, 74818, 72590, 70296, 68670, 70622, 72627, 73948, 77220, 75031, 69749, 69165, 72130, 71403, 69444, 69358, 71910, 71875, 73571, 76944, 75063, 71581, 70929, 76717]
9922G6717L424J479O310N088K956N209R556N574M030m15p553k790m633q253j036
9907I5663K705k051l600j88K193M90l1K377M077P872Q338O923L883M541j483j680
9891A30029J290j432k37K875M291Q003N650N421L578L003p32m04o507j2807n541
9876A36480J537j759n02j164j191N210M857K047m45n69k105K65L160K728L442
9861A51991N161L691N288R381Q520N409K993L625O811L816K815J045K27L927L920
9846B18620P634R357J3497J5265Q953N132l43l211r160j3828j6366j6713p376
9833B11461j658k264n844J042M672K814o85l634j1431j5360j1873q024n653O32
9819A54195J082m27J801K37K590O427M456J986N401J75l819n213q19L602M352
$$ y = [76717, 80141, 81620, 87930, 93018, 95974, 101183, 110739, 116313, 120343, 119928, 112375, 109585, 104952, 96699, 95663, 98368, 96317, 92717, 92529, 94722, 95212, 95181, 97558, 101635, 109507, 117845, 124768, 128651, 133192, 131709, 130029, 131319, 129887, 129650, 132525, 136816, 144819, 150469, 155890, 159468, 162471, 161739, 161335, 154828, 142021, 136480, 138017, 136258, 135756, 134592, 133401, 138611, 143468, 145515, 145070, 144501, 142396, 142661, 145821, 148549, 151991, 157152, 160843, 166131, 175512, 184032, 189441, 192434, 196059, 202870, 206686, 209501, 210546, 210773, 214700, 218620, 226254, 235611, 249108, 264373, 273326, 278458, 278115, 274904, 265744, 251916, 235550, 218837, 211461, 209803, 207539, 201695, 202737, 207409, 210223, 209538, 205904, 194473, 179113, 167240, 159216, 153563, 154195, 155277, 154850, 156651, 156888, 159478, 165905, 170361, 172347, 177748, 177923, 174104, 168891, 168072, 171674, 176026]
9804A76026P988R949R607J3377N384J907N917o844j5192j3810r100p733o272l5
9790A71169N796J884M170L12l087n988o636m447j270o266m212q077l006r99k775
9775A36568l63l35j350l939K163J752L695k48k55J66Q84j581j717L584M088m376
9759A38736j101P98O54Q70R88k025K673K636L696M920M746J2481J3251N179K721
9744A91223m911r567o899l349q196j746k357m745k145K790q22j383k460L009L030
9729A51472p8K313J476K737K473J143j924n26K969j877k81o7k077N364r47p75
9713A61395J012n55L755J389k849j137N372r17j361O968J4m528J053Q47K576k395
9697A70639R55k769l457N64j87J577L381R44J651N192M94L136M937K073m354j920
$$ y = [176026, 184014, 193963, 203570, 216947, 222331, 224238, 230155, 223311, 208119, 194309, 185209, 177476, 171204, 171169, 176965, 178849, 183019, 183331, 180244, 174256, 167620, 163173, 161903, 155637, 151425, 143348, 140342, 139343, 136568, 136205, 135870, 134520, 130581, 132744, 134496, 138191, 137943, 137688, 137854, 138738, 137157, 135440, 139024, 143112, 138736, 137635, 138433, 139087, 139957, 140945, 138920, 141593, 144229, 147925, 152845, 157591, 170072, 183323, 188502, 191223, 186312, 176745, 169846, 166497, 158301, 156555, 154198, 149453, 147308, 150098, 149276, 147893, 145433, 148442, 151472, 151394, 153707, 155183, 157920, 160393, 161536, 159612, 159086, 162055, 160178, 159897, 159830, 157753, 163117, 162170, 161395, 162407, 161852, 165607, 166996, 164147, 163010, 168382, 167465, 166104, 173072, 173086, 168558, 169611, 170458, 173034, 170639, 171594, 168825, 165368, 165932, 165745, 167322, 170703, 171647, 173298, 178490, 178984, 182120, 187057, 189130, 184776, 182856]
9681A82856M387M822K411J56k91K645K005J40j174O044O308N564R512Q259Q027
9666B41671J902q90k516l09N157R549J3018R184L514p53o461j2886q094l070k087
9651B46929l943n866j630l943q22R91M28j038K028J195L317N294Q096Q454J0315
9636B69805M982J487J396k24J806M711P569J2639J9800J6994Q372l141r679j3796
9622C22721p672N55P113J0519J3499J9216J3938O310R281J6019N884l012j0209
9609D04162j5084j9121j9522j8938j6278r206m855m080k614L753M536P203P371
9596C17327J2136K1122K5254J4810Q527P607M088N331P331Q768L649l577R07J0570
9582D43850K1071L0380L0467J9606R423m672q075j6504k2698j7259n172K778M527
$$ y = [182856, 187243, 192065, 194476, 194632, 194341, 196986, 198991, 199131, 197957, 204001, 210309, 215873, 225385, 233644, 241671, 243573, 242683, 240167, 239858, 245015, 254564, 267582, 276766, 280280, 279527, 273066, 260180, 252086, 249016, 246929, 242986, 237120, 235490, 231547, 230725, 231716, 232144, 231106, 233134, 234329, 237646, 242940, 251036, 259490, 269805, 274787, 276274, 277670, 277446, 279252, 283963, 291532, 304171, 323971, 340965, 349337, 346196, 336517, 322721, 315049, 315604, 322717, 333236, 346735, 365951, 379889, 386199, 395480, 411499, 417383, 414371, 404162, 389078, 369957, 350435, 331497, 315219, 306013, 301158, 297078, 294464, 298217, 302753, 309956, 317327, 329463, 350585, 375839, 390649, 399176, 406783, 410871, 416202, 423533, 432301, 435950, 432373, 433280, 443850, 464921, 495301, 525768, 545374, 554797, 550125, 542050, 525546, 502848, 485589, 480417, 483195, 487722]
9569D87722J5253J7439J4316J1080j48j2912j8370j5725k0539j8501j1746p662
9557D40207N69R268O554J947K816K368O004J4956K9153M5822P4654J03857J01398
9544H39573N2668J3525K655J418R535L4767N2206K2283j0737k5496j8709p309
9532I66379N236K3349J4849L955M920J0773K2944L9901N1091M8186M1422K9061
9520A262066J9448L0254O8132J37343J97841K29078J97741O7454o4810j33974
9510B010573j93065j97410j31803l4167O5690J24927Q5172K359o7864j16243j34590
9499A413579j23348r3996n2990j5131J7625M6529P1013O7717M5392K7499N407
9488A409296j4645k5737l5337m3298m7024m3421k0184J3410N1800O3181O3136
$$ y = [487722, 502975, 520414, 534730, 545810, 545662, 532750, 514380, 498655, 478116, 459615, 447869, 440207, 440776, 450044, 456598, 458545, 461361, 463729, 469733, 484689, 513842, 559664, 634318, 738175, 839573, 892241, 905766, 908421, 909839, 919374, 954141, 1006347, 1028630, 1017893, 992397, 973688, 966379, 971615, 994964, 1009813, 1013768, 1018688, 1029461, 1052405, 1092306, 1143397, 1191583, 1233005, 1262066, 1281514, 1311768, 1379900, 1517243, 1715084, 1944162, 2141903, 2209357, 2144547, 2010573, 1817508, 1620098, 1488295, 1454128, 1519818, 1644745, 1729917, 1732276, 1664412, 1548169, 1413579, 1290231, 1196235, 1143245, 1128114, 1145739, 1192268, 1263281, 1330998, 1376390, 1403889, 1409296, 1394651, 1368914, 1333577, 1290279, 1243255, 1199834, 1179650, 1193060, 1244860, 1308041, 1371177]
9477A371177O7074P5440P8624Q8219J20687R7598J0808o6800j14903j40668j33041
9466A454215r4856m8562j6377n484q485j8394k1208r007J6958N5674R5298J10689
9454A510461J00431Q1980N3274J7478l1796q6318j13333j21060j03702q2342o3576
9443A161497m4035k1462j417K1724L1226J9681J1767O495m047j1873p000J0394
9431A172950M0469O7059N8123J9775p540p474Q708K6697K9978J4397n451k8963
9419A388728n9909p4732o9226o1129m2221k4038j0260N199J7720J8165J1667l156
9407A096808j0841j0440j1519j0679q999p67O468J8956K8609K9309K0952J6487
9395A164344J64j6857k6181k3392j1005r21R577J1189O187K924R918J9835L9144
$$ y = [1371177, 1438251, 1513691, 1592315, 1680534, 1801221, 1898819, 1909627, 1842827, 1727924, 1587256, 1454215, 1359359, 1310797, 1294420, 1288936, 1280451, 1262057, 1240849, 1231842, 1248800, 1304474, 1399772, 1510461, 1610892, 1692872, 1746146, 1763624, 1731828, 1645510, 1532177, 1411117, 1307415, 1225073, 1161497, 1117462, 1096000, 1094583, 1116307, 1147533, 1167214, 1178981, 1185476, 1181429, 1169556, 1162556, 1172950, 1213419, 1280478, 1338601, 1358376, 1350836, 1343362, 1352070, 1378767, 1408745, 1423142, 1417691, 1388728, 1328819, 1254087, 1184861, 1123732, 1081511, 1057473, 1047213, 1052412, 1070132, 1088297, 1099964, 1096808, 1085967, 1075527, 1064008, 1053329, 1044330, 1043563, 1050031, 1068987, 1097596, 1126905, 1147857, 1164344, 1164508, 1147651, 1121470, 1098078, 1087073, 1086152, 1095729, 1106918, 1113105, 1116029, 1125947, 1145782, 1184926]
9382A184926M5270K9106J97j2874j4702j0772k769L297J1244P621J821n421o395
9369A230549o026k077N047J1702J3295P933N229k786o283j840K78l44J891L918
9355A260486L181O197O897K020M745Q721J4889J4341N695O500Q725J0355J4896
9342A367648J3730J1718R865J1672R636J2398J3503J3752K0159K3697K1741K1931
9330A551450K0060K0554J5646L575L075L777M359J0681J1755J3544J2913J3351
9318A684740J5301J8166J8636J7264J4170J4623J2736J6139J9704K4857K1732
9307A878068K0346K3803K3275K0669J9128J9942K0172J9726K3280K3005K2074
9296B113488K2675K1902K1690K6975L1066K7570K4319K6908K9437K7438K6016
$$ y = [1184926, 1230196, 1259302, 1259499, 1246625, 1231923, 1221151, 1218382, 1221679, 1232923, 1240544, 1242365, 1236944, 1230549, 1224523, 1222446, 1227493, 1239195, 1252490, 1260423, 1265652, 1262866, 1256583, 1254743, 1255021, 1254677, 1256568, 1260486, 1263667, 1269864, 1276761, 1278781, 1283526, 1292247, 1307136, 1321477, 1327172, 1333672, 1342397, 1352752, 1367648, 1381378, 1393096, 1402961, 1414633, 1424269, 1436667, 1450170, 1463922, 1484081, 1507778, 1529519, 1551450, 1571510, 1592064, 1607710, 1611285, 1614360, 1618137, 1622496, 1633177, 1644932, 1658476, 1671389, 1684740, 1700041, 1718207, 1736843, 1754107, 1768277, 1782900, 1795636, 1811775, 1831479, 1856336, 1878068, 1898414, 1922217, 1945492, 1966161, 1985289, 2005231, 2025403, 2045129, 2068409, 2091414, 2113488, 2136163, 2158065, 2179755, 2206730, 2237796, 2265366, 2289685, 2316593, 2346030, 2373468, 2399484]
9285B399484K6872K4814L0265L2935L2369L1082L3205M0096M4120M2019M2302
9274B779563L9520L0148L1930L6595K9865K5721L1247L3774L7719M1440M4158
9263C161680N0119M4664M4131M6687M4619M4885M8493M4599M1300M4457M9886
9252C665520N6147N3911N7109N7559N7468N9701O0491O5952O7699O5136O8392
9241D335085O5440O8632P0559P4636P5488P6779P6005P2010P6449Q0618Q8598
9230E160299Q9569R2293R7363R7982J04665J01525J02798J06248J02513J05663
9220F160918J06927J07506J13793J20645J29475J34244J41750J41647J43245J50458
9210G450608J51930J52137J54875J55204J61834J65326J68188J72831J81492J80860
$$ y = [2399484, 2426356, 2451170, 2481435, 2514370, 2546739, 2577821, 2611026, 2651122, 2695242, 2737261, 2779563, 2819083, 2849231, 2881161, 2917756, 2947621, 2973342, 3004589, 3038363, 3076082, 3117522, 3161680, 3211799, 3256463, 3300594, 3347281, 3391900, 3436785, 3485278, 3529877, 3571177, 3615634, 3665520, 3721667, 3775578, 3832687, 3890246, 3947714, 4007415, 4067906, 4133858, 4201557, 4266693, 4335085, 4400525, 4469157, 4539716, 4614352, 4689840, 4766619, 4842624, 4914634, 4991083, 5071701, 5160299, 5249868, 5342161, 5439524, 5537506, 5642171, 5743696, 5846494, 5952742, 6055255, 6160918, 6267845, 6375351, 6489144, 6609789, 6739264, 6873508, 7015258, 7156905, 7300150, 7450608, 7602538, 7754675, 7909550, 8064754, 8226588, 8391914, 8560102, 8732933, 8914425, 9095285]
9200I095285J88386K01336K11450K12238K11207K14884K14640K15161K23751K32497
9190A1220835K43812K55479K70509K80877K95784L08592L13080L18410L22907
9181A3830285L33639L36959L48332L65654L73696L84380M02843M30432M49821
9172A7256041M66977M80540M93858N03303N08606N20814N42509N81534O51389
9163B2005571P58283R19198J102477J068098O82694L41171K37551K31050L14485
9154B7660578M47831N47269O01563O43462O77031O95614P11943P19422P18135
9145C3422848P12620P07374P00810O88347O85137O74572O54950O31020N99555
9136C9477233N72279N46764N21413M84081M46764M07628L58327L11700K73743
$$ y = [9095285, 9283671, 9485007, 9696457, 9908695, 10119902, 10334786, 10549426, 10764587, 10988338, 11220835, 11464647, 11720126, 11990635, 12271512, 12567296, 12875888, 13188968, 13507378, 13830285, 14163924, 14500883, 14849215, 15214869, 15588565, 15972945, 16375788, 16806220, 17256041, 17723018, 18203558, 18697416, 19200719, 19709325, 20230139, 20772648, 21354182, 22005571, 22763854, 23683052, 24785529, 25853627, 26536321, 26877492, 27115043, 27346093, 27660578, 28108409, 28655678, 29257241, 29900703, 30577734, 31273348, 31985291, 32704713, 33422848, 34135468, 34842842, 35543652, 36231999, 36917136, 37591708, 38246658, 38877678, 39477233, 40049512, 40596276, 41117689, 41601770, 42048534, 42456162, 42814489, 43126189, 43399932]
9127D3399932K30550J78594J27210Q0300M6728L1015L8894Q4929J88838K42037
9117D4649027q040m83116p78900q78899q97835q34573p51779p06147o92872o93031
9107C7923835o94398p06427p16848p14424p17759p20138p20444p23462p15454
9098C1494481p01295o93345o78458o73912o68617o58610o45984o38184o22081
9089B5513995o10727o14419o10748n99300n94346n78217n56794n35660n11441
9080B0302343m98852m91572m74769m64420m55446m34252m19539m13032l97458
9071A6253003l87006l72605l59022l52666l53766l44392l31651l22856l11224
9062A3117815l02096k89579k74630k64905k56959k46596k32374k19189k21969
$$ y = [43399932, 43630482, 43809076, 43936286, 44016586, 44063314, 44094329, 44133223, 44218152, 44406990, 44649027, 44640987, 44157871, 43378971, 42500072, 41602237, 40767664, 40015885, 39309738, 38616866, 37923835, 37229437, 36523010, 35806162, 35091738, 34373979, 33653841, 32933397, 32209935, 31494481, 30793186, 30099841, 29421383, 28747471, 28078854, 27420244, 26774260, 26136076, 25513995, 24903268, 24288849, 23678101, 23078801, 22484455, 21906238, 21349444, 20813784, 20302343, 19803491, 19311919, 18837150, 18372730, 17917284, 17483032, 17063493, 16650461, 16253003, 15865997, 15493392, 15134370, 14781704, 14427938, 14083546, 13751895, 13429039, 13117815, 12815719, 12526140, 12251510, 11986605, 11729646, 11483050, 11250676, 11031487, 10809518]
9053A0809518k20533k10487j99782j89052j73325j76233j88180j98688k05573
9044I047665j95904j84240j78841j68086j64428j59987j48489j44172j44666j38776
9034G420076j33349j28228j24550j25656j15487j13645j15644j13530j03995j10022
9024F235970j06213j05369j00711r7702q8916q6420p1091n9666o6421q1168q3346
9013E288947q5195p6463o3279o2938o4735n5275l4773l5906o5478q5346r7341
9002D562218r9258r4120p1324o9709o9366n9903n8766n7129m8380m1905m3772
8991C848586m4528l4731l1577k7065l4074m0757l2202k3181k1524j8880k1527
8980C518540k6227m3512n8962n2982m0720k7248k5427m0890n0351l7727l0595
$$ y = [10809518, 10588985, 10378498, 10178716, 9989664, 9816339, 9640106, 9451926, 9253238, 9047665, 8851761, 8667521, 8488680, 8320594, 8156166, 7996179, 7847690, 7703518, 7558852, 7420076, 7286727, 7158499, 7033949, 6908293, 6792806, 6679161, 6563517, 6449987, 6345992, 6235970, 6129757, 6024388, 5923677, 5825975, 5737059, 5650639, 5579548, 5519882, 5453461, 5372293, 5288947, 5203752, 5127289, 5064010, 5001072, 4936337, 4881062, 4846289, 4810383, 4744905, 4659559, 4562218, 4462960, 4368840, 4297516, 4227807, 4158441, 4098538, 4039772, 3982643, 3934263, 3892358, 3848586, 3804058, 3769327, 3737750, 3710685, 3676611, 3635854, 3603652, 3580471, 3558947, 3540067, 3518540, 3492313, 3448801, 3389839, 3336857, 3296137, 3268889, 3243462, 3202572, 3152221, 3114494, 3083899]
8969C083899l1629l8908m1825n4776n3630m0057l3876l9145l9449m0777m0676
8958B629151l5349k9629l4446k9667j7234j2052j9639n964l782k7227l9954j9204
8946B355004N954J5283Q59j7853l4041l5639k5254j2318o793j4288j7296k6925
8934B186693k5199j6990j5163k3523k6039k5835l0707k6543j1936q134p929j0379
8922A958316j2181q706l68J4743K1697M808j6108k2704n1250q4802r5585p6216
8910A631644m6193k0191M041L139j1761k0304j2081J201Q74p952j0219j137J9582
8897A530643L3204L9886M1232J6302j6977l7713l8670k3517k3540k3298k0991
8886A476561k3241k9676l7390j8614J8498L8547L3200J3152M640P369O192k64
$$ y = [3083899, 3052270, 3013362, 2971537, 2916761, 2863131, 2823074, 2789198, 2750053, 2710604, 2669827, 2629151, 2593802, 2564173, 2529727, 2500060, 2482826, 2470774, 2451135, 2445171, 2441389, 2414162, 2374208, 2355004, 2360958, 2376241, 2377100, 2359247, 2325206, 2289567, 2264313, 2251995, 2245202, 2230914, 2213618, 2186693, 2161494, 2144504, 2129341, 2105818, 2079779, 2053944, 2023237, 1996694, 1984758, 1976624, 1968695, 1958316, 1946135, 1937429, 1937061, 1951804, 1973501, 1978309, 1962201, 1939497, 1888247, 1803445, 1707860, 1631644, 1585451, 1565260, 1569301, 1572440, 1560679, 1540375, 1528294, 1529495, 1530369, 1522417, 1512198, 1511061, 1530643, 1563847, 1603733, 1644965, 1661267, 1644290, 1606577, 1567907, 1544390, 1520850, 1497552, 1476561, 1453320, 1423644, 1386254, 1367640, 1386138, 1424685, 1457885, 1471037, 1475677, 1483046, 1489238, 1488974]
8874A488974j0630j083N925K123M317J1842K3288K8418J1157j7886m8614o0008
8862A437823n0747l6136k9501m0269m2523k4392j0114R354L4184M3366L7818K8895
8850A357758p656l8812l1339m939m050j4355Q650K9223J4152n397L3575Q6422
8838A423232R8234O4099L4765J5181K440j2037k5330k4164r426r646M7M486l704
8825A558177j7306j1808L330J6446L6650O9762Q9879O9343K5791J0317N529K279
8813A858389Q047K7174M7543O5699P0007N6737N5154P6574Q7471R0851J11874
8802B555520J01472N5467L5080M7619M4510M2761Q8833J55128J95647J72909J43533
8791C638479J27266J29176J59633K07721K56474L35374M27166M92721N79213O59340
$$ y = [1488974, 1478344, 1477261, 1483186, 1485309, 1489626, 1501468, 1524756, 1553174, 1564331, 1546445, 1497831, 1437823, 1387076, 1350940, 1321439, 1281170, 1238647, 1214255, 1204141, 1213495, 1247679, 1291045, 1328863, 1357758, 1350102, 1311290, 1279951, 1275012, 1270962, 1256607, 1265257, 1294480, 1308632, 1303235, 1336810, 1423232, 1521466, 1585565, 1620330, 1635511, 1637951, 1625914, 1600584, 1576420, 1566994, 1557348, 1557395, 1561881, 1558177, 1540871, 1529063, 1532393, 1548839, 1585489, 1655251, 1745130, 1814473, 1840264, 1850581, 1856110, 1858389, 1866436, 1893610, 1941153, 2006852, 2076859, 2133596, 2188750, 2265324, 2352795, 2443646, 2555520, 2656992, 2712459, 2747539, 2795158, 2839668, 2882429, 2971262, 3126390, 3322037, 3494946, 3638479, 3765745, 3894921, 4054554, 4262275, 4518749, 4854123, 5281289, 5774010, 6353223, 7012563]
8781G012563P04756P89129R55237J246780J718902K183631K303608K277960K283599
8772B1476165K497505L279967M473981N890356P730850J0255658J4194350K1329391
8764I1128223L4412758N6501513Q5042847R0691940L7063539l0620871n8804405
8757C05415544o8381026o8844457n1746635l2890898k0704723j3529937r251380
8750D0066488o618135m828544l400823k161352j124273p71025j296918j719026
8742A8146392j705018j520697j086967n90675k22480J07133M72779R59830J507495
8733A6067792J822527J825931J805897J865880K320116L304416M581228O127723
8725C9721510Q138293J1006454J5874901K4914459M1179295O7014200R1900001
$$ y = [7012563, 7717319, 8506448, 9461685, 10708465, 12427367, 14610998, 16914606, 19192566, 21476165, 23973670, 27253637, 31727618, 37617974, 45348824, 55604482, 69798832, 91128223, 125540981, 182042494, 267085341, 357777281, 394840820, 364219949, 305415544, 237034518, 168190061, 116443426, 83552528, 62847805, 49317868, 40066488, 33448353, 28619809, 25218986, 23057634, 21933361, 21162336, 19865418, 18146392, 16441374, 14920677, 13833710, 13243035, 13020555, 13127688, 13600467, 14560297, 16067792, 17890319, 19716250, 21522147, 23388027, 25708143, 29012559, 33593787, 39721510, 47859803, 58866257, 74741158, 99655617, 140834912, 207849112, 299749113]
8718B99749113P4564005O366925m5411893o1643664o9038705o1856890m2329468
8711A00399423k6624226j7116709j1541740q139786n967559m364417l035623j880906
8703B1728457j075566j179725j866082k145050k105449j916811j511951j118452
8695H809371q44412o40252m74386l78025l59755l55956l49796l50795l21839k79985
8685D454170k33743j80176j52336j63272j72094j71304j67840j47100j19231j04372
8675B842702q1074p1784j02758j08501r5382r4618p3996l1211j8267k7313l8400
8664B099398l7022m0285l9190l5419l0900k3969k5669k2402j3369l1199n3165
8653A746809o2895n9048n3650m7342l7054k9016k3300l2838m4214l4893k3421
$$ y = [299749113, 374313118, 380680043, 335268150, 273624486, 204585781, 142728891, 100399423, 73775197, 56658488, 45116748, 36976962, 31009403, 26644986, 23609363, 21728457, 20652891, 19473166, 17607084, 15462034, 13356585, 11439774, 9927823, 8809371, 7964959, 7324707, 6850321, 6472296, 6112541, 5756585, 5406789, 5055994, 4734155, 4454170, 4220427, 4040251, 3887915, 3724643, 3552549, 3381245, 3213405, 3066305, 2947074, 2842702, 2761628, 2689844, 2587086, 2478585, 2383203, 2288585, 2214589, 2183378, 2165111, 2137798, 2099398, 2062376, 2022091, 1982901, 1947482, 1916582, 1892613, 1866944, 1844542, 1831173, 1799974, 1746809, 1683914, 1624866, 1571216, 1523874, 1486820, 1457804, 1434504, 1401666, 1357452, 1322559, 1299138]
8642A299138k4861k6117j5183J8041O1729N5541J7j4030K6117L665l8433r588
8630A336036K978m4335r2969o6323k7819j0236J4252K9693K6282R128j7536l5197
8618A123954k9144j6488J780O893m974j9976k6005k2123k2607l1595l6472k8703
8606H94540k9228l7935m0636k1900l125m717j0365k1827k5571m105N1727Q5998
8594H32856O8446L8738L6027L6964j3956k2533p115j6408n4549p3506o0540m2279
8582G22145j1321J6462K6302J8210L320m507j6871j8766p961Q339P294p936j0686
8569G24024L306K0895K3947Q625j4077k6787l6840l8020l0056o928l693j4061
8557F10335j3199j3719j9553j2516q667l526K879O928J356p745j0589n736n4o693
$$ y = [1299138, 1274277, 1248160, 1232977, 1251018, 1312747, 1368288, 1368305, 1354275, 1380392, 1384057, 1345624, 1336036, 1339014, 1294679, 1201710, 1135387, 1107568, 1097332, 1111584, 1141277, 1167559, 1176687, 1159151, 1123954, 1094810, 1078322, 1080102, 1086995, 1082021, 1062045, 1036040, 1013917, 991310, 959715, 923243, 894540, 865312, 827377, 786741, 764841, 761716, 756999, 746634, 724807, 699236, 695131, 746858, 832856, 901302, 940040, 976067, 1013031, 999075, 976542, 969427, 953019, 898470, 824964, 764424, 722145, 710824, 727286, 753588, 771798, 775118, 770611, 753740, 734974, 727013, 735352, 742646, 734710, 724024, 727330, 748225, 772172, 780797, 766720, 739933, 703093, 665073, 635017, 628089, 624396, 610335, 597136, 583417, 563864, 551348, 542681, 539155, 542034, 548962, 550318, 542573, 531984, 526248, 526194, 519501]
8543E19501j1799j9444k0054j4304j920Q297J2106O747l80q212j1410k885J5121
8530D71364M843p545j5213r452K196J9839K4789R891o052p92q12K824L559k094
8516D97345n166m827j398n03n458n134k942L562P709n216j5177k2811j4650j173
8502D24161n302q813P96k49l367j618R329L1246M3070L8471L5262J4071j6345
8489E60712l0237l2764k3762j7597j9470j8625n512M940K851L106R161P348L336
8476D43487K025l457k898K733k271J601M420N620J1177J7142J9945K0974J0947
8463E31445J4117K5723L4154M5322O9524P6513O7507P4031R1860J15395J62291
8452A307882K15122K92391M13428O01020R72831J756077L118387M287514K624853
$$ y = [519501, 507702, 488258, 468204, 453900, 451980, 460277, 472383, 479130, 478750, 470538, 459128, 456243, 471364, 476207, 468662, 453449, 443997, 446193, 466032, 490821, 500712, 494660, 493868, 493056, 495880, 499439, 497345, 492179, 487352, 485954, 485451, 479993, 474859, 471917, 475479, 483188, 477972, 462795, 439984, 425334, 424161, 418859, 410046, 410842, 410593, 407226, 405608, 414937, 446183, 489253, 527724, 562986, 577057, 560712, 530475, 497711, 473949, 456352, 436882, 418257, 412745, 417685, 420536, 423642, 432803, 440151, 443487, 445512, 442055, 439157, 441890, 439619, 441220, 445640, 451260, 462437, 479579, 499524, 520498, 531445, 545562, 571285, 605439, 650761, 720285, 796798, 864305, 938336, 1030196, 1145591, 1307882, 1523004, 1815395, 2228823, 2829843, 3802674, 5558751, 8677138, 12964652, 15589505]
8443A5589505j039391k748474l054674k851088j926956j112896o66535m30869
8435A758622k94558k01553j39053r4743o8417n1105m1064l4179m1228m2849l1032
8424G18841k0555l900J8154K2910K8237L8580M0038M7080O8292R4070J21620J29980
8412A303347J18522J38882J88647K65560L61205M64419O15168Q85908J448122
8403E789780K605214M872115Q178584P793222N64415m705351n852422o068102
8395A3177455m593836k708335j578143r81835o60541m63347l37706k36839j64595
8386A452278j10717p1697n4570q0490r3904q4543p1990n0206k7686j5616j3460
8375G77399R43Q518J1297K1627L4442N0824N6030O2101P0120J05845J43515J93376
$$ y = [15589505, 14550114, 11801640, 8746966, 5895878, 3968922, 2856026, 2189491, 1758622, 1464064, 1262511, 1123458, 1028715, 960298, 909193, 868129, 833950, 792722, 749873, 718841, 698286, 694386, 712540, 735450, 763687, 802267, 842305, 889385, 957677, 1051747, 1173367, 1303347, 1421869, 1560751, 1749398, 2014958, 2376163, 2840582, 3455750, 4341658, 5789780, 8394994, 13267109, 21445693, 29238915, 29803330, 25097979, 19245557, 13177455, 8583619, 5875284, 4297141, 3315306, 2654765, 2191418, 1853712, 1616873, 1452278, 1341561, 1269864, 1215294, 1134804, 1040900, 956357, 884367, 834161, 806475, 790859, 777399, 778342, 786860, 798157, 819784, 854226, 905050, 961080, 1023181, 1093301, 1199146, 1342661, 1536037]
8363A536037K49909L12442M27439O67317J147663K068409L599320M648676K456651
8354A7113863j426359l067384l358130l053197k032191j183177p08152m58249
8346A827024l16762k27923j72327j24141q6032n4632l5005l8149m4666n2475n0842
8335F24070m3450k8274j5547q661n011n2P637l613j1920j2546j1130J216J4985
8322E07704L0592K9607M3753N4218P7375J09572J90417L33948N06052N01743J29593
8311B514574k59408l98810m16326l57398k42695j47359r0003o0864m4239l3424
8301D64048l2595k6896k2586j5462j4999j4266j5799j4462o118q7K779L598K009
8288C09164l583p270j2156j0105p904n187o178r249r500k13O180N900M802k028
$$ y = [1536037, 1785946, 2098388, 2525827, 3193144, 4340807, 6409216, 10008536, 14657212, 17113863, 15687504, 12620120, 9261990, 6208793, 4176602, 2993425, 2285273, 1827024, 1510262, 1282339, 1110012, 985871, 899839, 845207, 810202, 772053, 727387, 674912, 624070, 580620, 552346, 536799, 528138, 523127, 523075, 530712, 527099, 515179, 502633, 491503, 492719, 507704, 538296, 567903, 611656, 665874, 743249, 852821, 1043238, 1377186, 1883238, 2384981, 2514574, 2255166, 1856356, 1440030, 1082632, 839937, 692578, 602575, 541711, 497472, 464048, 431453, 404557, 381971, 366509, 351510, 337244, 321445, 306983, 300865, 300778, 303557, 307155, 309164, 305581, 298311, 286155, 276050, 268146, 262959, 256781, 247532, 238032, 237819, 243999, 249899, 254701, 252673]
8274B52673J453K960J057l527j883L237k869m211j557Q508J1694J9246K8253L4683
8260C49717L6724K6765L267k6404l7135l8773k9682j7172r783j2561m972j559
8248B38432J313j792k161n705j739q43o073r034n069l21l916o676l348j081J782
8233A93769J685Q680K714L574L784J1309Q447L463O292J172J964K387M62Q183
8219B57885J7694K2212L5770N5290P9892O6529J4212j9457l0968l2409k7815r150
8207D29685L974J4310K3454L7186N3067P3033J17874J97134L44793N56521P39584
8196B590615N86608O4817l84225n59191n75926m79323l23902k05750j27194p4753
8186E11776n6531m3158k4221j5423j2783o958m642q007n194l131J083K777P147
$$ y = [252673, 254126, 257086, 258143, 254616, 252733, 255970, 253101, 248890, 247333, 255841, 267535, 286781, 315034, 349717, 386441, 413206, 416473, 390069, 352934, 314161, 284479, 267307, 257524, 244963, 239991, 238432, 239745, 237953, 235792, 230087, 228348, 227505, 221432, 212398, 207329, 207008, 203092, 196416, 193068, 191987, 193769, 195454, 204134, 206848, 210422, 214206, 225515, 233962, 237425, 243717, 244889, 246853, 249240, 249702, 257885, 275579, 297791, 333561, 388851, 468743, 535272, 549484, 530027, 499059, 466650, 438835, 429685, 433659, 447969, 471423, 508609, 561676, 634709, 752583, 949717, 1294510, 1851031, 2590615, 3177223, 3242040, 2857815, 2298624, 1722698, 1243375, 919473, 713723, 586529, 511776, 455245, 412087, 387866, 372443, 359660, 352702, 348060, 340053, 334859, 331728, 332811, 335588, 342735]
8173C42735J9374K8356L9625O3256O6969M5694K2771J0172M965J8672M9860Q7788
8161H00237J21519J77950K68975M36000P35436J169342J461033J124011J94640
8152F489143o58728j104047j183114j007452p24296m66644k96474j91691j30935
8143G25762q5364o0954m6854k3838k2052l0707l0844k9903k5228k1410j8029j0804
8131C19775l868J1212J9639J4928J0958J1352P081O301J5678K9506L6377N5065
8119E34004Q1901J17816J86205L06659N07747P26030P34344L69351j66130n24628
8109B873299o40484n96478m63559l09000j96782j21933p7121n4272l8181k6993
8099C48496j3265j2523o507o879j0184j6202j8045j8370j4932j3575j0761p864
$$ y = [342735, 362109, 390465, 430090, 493346, 560315, 606009, 628780, 638952, 643917, 662589, 712449, 800237, 921756, 1099706, 1368681, 1804681, 2540117, 3709459, 5170492, 6294503, 6489143, 5830415, 4726368, 3543254, 2535802, 1811506, 1344862, 1048388, 856697, 725762, 640398, 579444, 532590, 508752, 486700, 455993, 425149, 395246, 370018, 348608, 330579, 319775, 315907, 327119, 346758, 361686, 372644, 383996, 391077, 397378, 413056, 442562, 478939, 534004, 615905, 733721, 919926, 1226585, 1734332, 2460362, 3194706, 3564057, 3397927, 2873299, 2232815, 1636337, 1172778, 863778, 666996, 545063, 467942, 413670, 375489, 348496, 335231, 322708, 316201, 309322, 299138, 282936, 264891, 246521, 231589, 218014, 207253, 199389]
8087A99389q564n119n972m088j997o981m321n349n469J402K786j789j680J85k539
8072A49894p843j933K574L44j81L044j247l032j766n231o186L89L945O762M217
8057A43750k569R5J327M152O261M486O718P10J096R060J7219J8685O766p357j7221
8042A93178j6290j7467j0185p119p350l162j678j241k458o963m132J870P477J028
8028A25508r64p39J061Q95n933j329o37k406n10k161j321J011k070L858L641K982
8012A20886L71M487M087j947j312L681P354P596J2070K7730M4111M2302N823k6139
7998B51100l2907l0557k2647j7348j4240j0257l711l20k603J116j513K470O54
7985A19237k613j095J849P75n088l913k356K061n23n423J09p73j55N675N420K411
$$ y = [199389, 190825, 185706, 179734, 175646, 173649, 166668, 162347, 156998, 151529, 152931, 155717, 153928, 152248, 152433, 149894, 142051, 140118, 142692, 143036, 142855, 145899, 144652, 141620, 139854, 134623, 128437, 128826, 132771, 139533, 143750, 141181, 141276, 142603, 146755, 153016, 157502, 164220, 164930, 166026, 175086, 192305, 210990, 217756, 210399, 193178, 176888, 159421, 149236, 142117, 134767, 131605, 129927, 128686, 126228, 119265, 115133, 117003, 124480, 125508, 124544, 123805, 124866, 125761, 119828, 118499, 117862, 115456, 114946, 112785, 111464, 112475, 110405, 114263, 117904, 120886, 121257, 125744, 129831, 127884, 126572, 130253, 137607, 145203, 157273, 185003, 229114, 271416, 277239, 251100, 218193, 187636, 164989, 147641, 133401, 123144, 119433, 119113, 116510, 117626, 116113, 118583, 119237, 116624, 115529, 117378, 118153, 113065, 109152, 106796, 108857, 108334, 102911, 103020, 102247, 102092, 107767, 113187, 115598]
7969A15598m39k333J052r64o591k5mL426P906P264J0657J5365K0837J5608m065
7954A83292j8235j9256j7603p737n079o743p415k569J953K429n41J652l96j455
7940A02297l150m54K034j090j546p14k584k111J850J004o84J490J760J415K306
7925A01823J74l360m752k88q05j761p8q85L42L822m07m202m93j037J773J940K283
7908I4089M95o762k747L883k922q14L109L202n97L041L212j842l035l586k288
7893H6438L49l372N1J122m6k590k823L040R27K605M63k199j731l597j720K95J287
7876G8499L140k160n577j448Q95n3m98K069O983J337m739J147L548k784k333l27
7860G7699J455K002j273j716K768M594K323k403n559p46M538j265m245n834N84
$$ y = [115598, 115159, 112826, 113878, 112914, 106323, 106298, 106294, 109720, 117626, 124890, 135547, 150912, 171749, 187357, 183292, 165057, 145801, 128198, 120461, 115382, 108639, 101224, 98655, 100608, 103037, 102496, 104148, 103752, 102297, 99147, 98693, 100727, 99637, 98091, 97377, 94793, 92682, 94532, 95536, 94852, 96342, 98102, 99517, 101823, 101997, 98637, 93885, 93597, 92792, 91031, 90953, 90068, 90410, 94232, 93825, 89623, 89130, 88093, 89866, 91806, 94089, 94584, 87822, 85075, 88958, 86036, 85222, 88331, 91533, 90936, 93977, 97189, 95347, 92312, 88726, 86438, 86787, 83415, 83466, 84588, 84542, 81952, 79129, 82169, 83096, 85701, 86164, 83965, 82234, 78637, 76917, 77212, 78499, 81639, 79479, 73902, 72454, 73349, 73296, 72798, 74867, 81850, 83187, 78448, 79595, 83143, 80359, 78026, 77699, 79154, 81156, 79883, 78167, 80935, 85529, 87852, 85449, 79890, 79144, 83682, 82417, 78172, 72338, 72922]
7845G2922J619O448p09k824j433l92m36L149L039K427k535k700l203K25j514L212
7829G7295M098o05n012O9N86J52J673k358r30J386K589Q77j489p47k11J676l9
7812G9010l296k336j173J517j611J174R54j333M76J038k342K663P304K474k019
7797H2500M059M43p61n059j123l992l084k686K03L561J405l448k415j232j877
7782F6494j738K65O115J269m886J917K895N81k259j744J52k325L36J601l06j621
7766F6746m082k415n27J999Q90o26K725M046Q71M54K459O318O996N519K227o40
7750I2960n474m228o541l938k455K093p15k652K497j383l694l80j153Q89J41J684
7734F7651o51k899m099k279L658N92K0M350p51k373l012j381N35m57M115J294
$$ y = [72922, 74541, 80989, 80280, 77456, 76023, 75631, 75195, 78344, 81383, 83810, 81275, 78575, 75372, 75597, 74083, 77295, 81393, 80788, 75776, 75845, 76431, 76583, 78256, 75898, 74968, 76354, 78943, 79820, 78331, 77584, 77373, 79049, 79010, 75714, 73378, 72205, 73722, 72111, 73285, 74239, 72906, 73382, 74420, 72078, 74741, 82045, 84519, 82500, 86559, 87002, 86241, 81182, 80059, 76067, 72983, 70297, 70500, 74061, 75466, 72018, 69603, 68371, 66494, 64756, 65021, 71136, 72405, 67519, 69436, 72331, 72912, 70653, 68909, 69061, 66736, 67072, 68673, 68367, 66746, 62664, 60249, 59722, 61721, 62611, 61985, 64710, 68756, 69627, 70081, 72540, 78858, 85854, 91373, 93600, 92960, 87486, 83258, 76717, 72779, 70324, 72417, 71702, 69050, 71547, 70164, 66470, 66090, 64937, 65826, 65967, 67651, 67000, 64101, 60002, 57723, 61381, 61973, 61993, 66343, 65592, 63219, 60207, 58826, 59361, 58904, 63019, 64313]
7718F4313K479L721j90m795o38P221L913R08q98o349n34o007m844j244k80Q84
7702E7660j93j452L4K372M078O17k584R45j78k248j163j525j025K486j006p97
7686E6021j528K519l150l475L586K01p57j15n23j166K654L21k036j950M76L99
7670E1477k609J718M943M065j177j460r79j691K392o26J362r21o31k733K24j393
7654E1961o06k74L87K178J480l975K064K20n038n19L236n55K105K879k392l768
7638D9383K973N010J871k260k209L73N694O87M29j910k873j924J010J596l057
7623E4793l802K831J639j349q23K866k218m918Q9p50R70k94J567l184o08J929
7607D8738j586j106j982j168q8K258P81l91J268k15L495o12K67l708J434J902
$$ y = [64313, 66792, 70513, 70323, 65528, 64890, 72111, 76024, 76932, 76034, 69685, 69151, 63144, 58300, 57056, 56776, 57660, 57467, 56015, 56049, 58421, 62499, 63116, 60532, 61477, 61299, 59051, 57888, 56363, 55338, 57824, 56818, 56021, 54493, 57012, 53862, 50387, 53973, 54174, 53417, 53302, 52779, 51613, 54267, 54588, 52552, 50602, 51078, 51477, 48868, 50586, 55529, 59594, 58417, 56957, 55978, 54287, 56679, 56053, 57415, 56494, 55863, 53130, 53354, 51961, 51355, 51081, 51468, 53646, 55126, 51151, 53215, 53435, 48397, 47878, 51114, 50559, 52664, 55543, 53151, 49383, 52356, 57366, 59237, 56977, 54768, 55141, 60835, 61522, 61951, 60041, 57168, 55244, 56254, 57850, 54793, 50991, 53822, 55461, 54112, 53289, 56155, 53937, 49019, 49108, 48358, 49328, 49034, 50601, 47417, 46809, 48738, 47152, 46046, 44064, 42896, 42808, 45066, 45847, 45456, 46724, 46509, 50004, 49392, 49659, 45951, 47385, 49287]
7591D9287n608m477R28L682M368q57r2j75J539K378j930J339r9k436j555J250
7575D7542N17K282J12J459j802l413j259J385k370Q25l97K675j508J869J672L151
7559E2740J111k539n64n252p57K440L688j406j742j279K11j378q32Q97P49k781
7543D3306k709P09p85k213M234K538M050k351O12K747k310k621J520M106L38m473
7527D6698k886L179k818r48L347Q61l041q18k320q84j60L075M812K86J844J621
7511E1848k39J302n548m948L0J247N32k339k983j351K141L349j89O48L579M412
7495E1491k307j326Nk481j848m74L567J636n56R78m13j356m041j161J507O32j970
7478D1883j177L601R31k984O76j66k612l559n53J414J871L299P63O13k071r01
$$ y = [49287, 43679, 39202, 40130, 43812, 48180, 47323, 47231, 47056, 48595, 50973, 49043, 50382, 50283, 47847, 46292, 47542, 48059, 50341, 50453, 51912, 50110, 46697, 45438, 46823, 44453, 45278, 44881, 47556, 46048, 47917, 49589, 52740, 53851, 51312, 50748, 45496, 44739, 47179, 50867, 49461, 47719, 46440, 46651, 45273, 44441, 45338, 46087, 43306, 40597, 41306, 40521, 38308, 42542, 45080, 49130, 46779, 47391, 50138, 47828, 45207, 46727, 50833, 51171, 46698, 43812, 46991, 44173, 43225, 46572, 47433, 44392, 43574, 41254, 40370, 40210, 43285, 48097, 48383, 50227, 51848, 51609, 52911, 47363, 42415, 42445, 43692, 44224, 41885, 38902, 37551, 39692, 43041, 42852, 43500, 47079, 51491, 49184, 47858, 47863, 45382, 43534, 43060, 46627, 48263, 47707, 48685, 48272, 46916, 42875, 41714, 43221, 43853, 41883, 40706, 44307, 45238, 42254, 42930, 42764, 40152, 36593, 36040, 37454, 39325, 42624, 43387, 44000, 41929, 41028]
7462D1028J888j579J88J126P00M95l2L616K157j311O18J02j615l111P7P95q52
7445D4290n687l413J337j45k302p59N50K966n66n17K959L438M3r1N908K274j503
7428D8782J330P39l779l415l207O223J365l92k002J678l020m524k976j604R89
7413C6187K724l10P93L194J298M69l490J73K334J35k765R45j212J904J75M10q40
7396D2124k85L9K0k301q1L028j129k016k168j031j260q36P49K754K885j010j982
7379C7500m006N05L258N861L988K332l570q29K851P09r77m189p783J130M861N258
7363D6899O66j700r58l427P02j452M64j025j715p29l884j097M429J621J129J174
7347D1097j892m092m592J330K929N098p02L12K82k325L456m18l859m62L801l495
$$ y = [41028, 42916, 41337, 41525, 42651, 43351, 43846, 43814, 47430, 49587, 48276, 48894, 48996, 47381, 44270, 44347, 45142, 44290, 38603, 35190, 36527, 36382, 34080, 33321, 33871, 36837, 36271, 35754, 38713, 42151, 42194, 42103, 48011, 50285, 48782, 50112, 50851, 47072, 43657, 40450, 46673, 48038, 47646, 45644, 47322, 44302, 39778, 36802, 35198, 36187, 38911, 38601, 39394, 42588, 43886, 44355, 40865, 41038, 43372, 43507, 40742, 41687, 40475, 42379, 42554, 42964, 42124, 41839, 41878, 41898, 39597, 39516, 42544, 41415, 39399, 37231, 36200, 34940, 34104, 34853, 37607, 40492, 39482, 37500, 33494, 33999, 37257, 43118, 47106, 49438, 45868, 45039, 47890, 48599, 47622, 43433, 35650, 36780, 41641, 46899, 47565, 45865, 44907, 41480, 42182, 40730, 41194, 40169, 38454, 37725, 33841, 32744, 37173, 38794, 39923, 41097, 39205, 35113, 30521, 31851, 34780, 39878, 39176, 39488, 39770, 37445, 40901, 40483, 36624, 36162, 39963, 36468]
7331C6468n512j114M908O10j065Q49Q61J173J795k529p92K379J421J576k699J619
7315C9948L518J313l769l169m3j667m190j857R12J496J312J672L011o42o45J744
7299C8944j545O6L962J593m482l288n98j466j860k750J220O770L623k680l644
7284C3865j242k296K719j24q27L92L578K942K479j22J084k925k530j199K021L434
7268D1249l0L18J530N18k574l240j560j413k481l114j663J484M80j054L748Ql191
7251B9015q11o42J220p79j1N20K093L162M106K348j488k94l94q01k570j181o45
7234C2848K568j666m7l14l577l665j334K849K929j768p035m437O329M036K202
7219B9918O13j598M451p34m427J232j412J6J16K424q63l319m165k13n52L609L460
$$ y = [36468, 30956, 29842, 34750, 35360, 34295, 35144, 36005, 37178, 38973, 36444, 35652, 38031, 39452, 41028, 38329, 39948, 43466, 44779, 41010, 37841, 37798, 36131, 31941, 30084, 30996, 32492, 33804, 35476, 38487, 37845, 37200, 38944, 37399, 37465, 41427, 43020, 38538, 35250, 34652, 33186, 31326, 28576, 29796, 36566, 40189, 37509, 33865, 32623, 30327, 33046, 32922, 32095, 32487, 36065, 39007, 41486, 41364, 42448, 39523, 36993, 35794, 37815, 41249, 41219, 41537, 43067, 43585, 41011, 37771, 36211, 34798, 32317, 29203, 27540, 29024, 29504, 28450, 32198, 32206, 29015, 28204, 27562, 28782, 28003, 27992, 28512, 30605, 33767, 37873, 40221, 38733, 38439, 38045, 37244, 34674, 33493, 32848, 35416, 33750, 33703, 33389, 29812, 26147, 24813, 27662, 30591, 28823, 21788, 17351, 23680, 27716, 29918, 30531, 28933, 33384, 32650, 28223, 29455, 28043, 28059, 28175, 30599, 29736, 26417, 22252, 22039, 21487, 25096, 28556]
7202B8556P04k602J038L485J018o14J804j245l792J985o12R32m146j405k442j568
7186B1096j478L655K161M354j87O87l951O91j819q021j065M918J421K87K070M45
7170B5264k571Q43j298K226N650j280mL728j529K307J342l583j913l637o21J787
7154B6711L05P95M096m336q08m523m75K349L366q3j367l878o6O00N231L680p83
7137C0814N74l243K265R56l659j965k938l284j69J6L500K709j512k070r09K161
7121B3246R0J688K716K276o61K295R98Q59J203l743j757J215pL049k630m591k167
7104B4079L93J24J128j420M20L71q33K472L919J856j084k822j100K590j695R45
7088B9343J129j805r80O32j303J231m88M08M71j811j148n08k228O29K24K194M933
$$ y = [28556, 29260, 26658, 27696, 31181, 32199, 31585, 33389, 32144, 28352, 30337, 29725, 30657, 26511, 25106, 22664, 21096, 19618, 23273, 25434, 29788, 29601, 30288, 26337, 27028, 25209, 17188, 16123, 21041, 22462, 22749, 24819, 25264, 22693, 23536, 22238, 24464, 30114, 28834, 28830, 32558, 31029, 33336, 34678, 31095, 29182, 25545, 24924, 26711, 27016, 27811, 31907, 27571, 26763, 22240, 21765, 24114, 27480, 27397, 26030, 22152, 22086, 22686, 27917, 31597, 30814, 31388, 28145, 30410, 31366, 27707, 25742, 22804, 19520, 19351, 19367, 22867, 25576, 24064, 21994, 21085, 23246, 23336, 25024, 27740, 30016, 29355, 31650, 32648, 33507, 34710, 30967, 29210, 30425, 30418, 33467, 30837, 26246, 24079, 24472, 24596, 25724, 24304, 24724, 25095, 24262, 26734, 30653, 32509, 31425, 28603, 27503, 30093, 28398, 29343, 30472, 28667, 27687, 28319, 27016, 28247, 27759, 28167, 28638, 26827, 25679, 25171, 22943, 23572, 23796, 25990, 30923]
7071C0923J03k614k016j546J077L899J6j907q90l009k502k841r19K468K508J785
7055B4535q02p54J945k09Q75j561J254k528n03p17j504l212J687m86m768l005
7039A0247K808N212K079j820k937j69K709q88j766N23L986J392o04K199K647o472
7023A9146m464p58M186k48O4K15J103m11L41k316o8R96j939l406K099P195n75
7006B1160j287j705j554M76N577J183R66j506m512O56J855J377k083P38R48K370
6990B4659K715L45q18j444k916J230k807l695j468J650O329M136o968o233l155
6975A1560J845J322L669K88J744M305o66p98k558m667j028o52m58R21L641N969
6959B4437k414m33N786j078k316l5n98j185L745O27l682N60q35m457j491j265
$$ y = [30923, 31026, 28412, 26396, 24850, 25927, 29826, 29842, 27935, 27045, 24036, 21534, 18693, 17774, 20242, 22750, 24535, 23733, 22979, 24924, 24715, 25590, 24029, 25283, 22755, 22252, 21535, 20031, 16819, 18506, 18020, 13252, 10247, 13055, 18267, 20346, 18526, 15589, 15420, 18129, 17241, 15475, 15998, 19984, 21376, 20772, 22971, 25618, 19146, 14682, 13924, 18110, 17862, 17926, 18141, 19244, 18833, 19174, 16858, 16790, 17786, 15847, 12441, 14540, 21735, 21160, 19873, 18168, 16614, 17090, 22667, 23850, 24816, 23310, 18798, 19454, 21309, 22686, 20603, 21341, 22289, 24659, 27374, 27719, 26901, 25457, 22541, 23771, 20964, 17269, 15801, 17451, 23780, 27916, 20948, 14715, 11560, 13405, 14727, 18396, 18684, 20428, 24733, 24067, 23269, 20711, 16044, 15016, 14364, 13906, 14827, 18468, 24437, 22023, 21590, 27376, 26298, 23982, 23947, 23349, 22164, 25909, 26536, 22854, 23414, 22579, 18122, 16631, 15366]
6943A5366Q74k07L082K48l476K62K799M962m57J518m733l558J652k141j694P22
6927A5219j309q92J358J544J536J009m68J7j389J092l27k798L804J576J39j22
6911A9989J427J487j347N34k837j896r49J350P56J902K885Q53j068P54n27l86
6895B2927j347j3K741j759p42j974j32K488o10J251m210k097k047J86L28j111
6879A3879J671k309J397J90m70j366R48N380L138l039l027j105l646k665q38n
6863H133L853R25j669L613M18j084k506r68J779M66J692N001L663m918j567J837
6847A8668O421L52q101k444K310J95j3j34K474r90k232k236J489j697J283M835
6831B0180L334M73j296j467K899j220k619k070l782N70N379M373J563P17o845
$$ y = [15366, 16240, 16033, 19115, 19363, 15887, 16149, 18948, 23910, 23453, 24971, 20238, 16680, 18332, 16191, 14497, 15219, 13910, 13018, 14376, 15920, 17456, 18465, 17997, 18014, 16625, 17717, 17390, 14592, 18396, 19972, 20111, 19989, 21416, 22903, 21556, 22090, 19253, 17357, 16408, 17758, 18514, 20416, 23301, 24154, 23086, 23840, 23313, 22927, 21580, 21567, 24308, 22549, 21807, 19833, 19701, 22189, 21579, 22830, 18620, 16523, 14476, 14662, 14990, 13879, 15550, 13241, 14638, 14828, 14358, 12992, 13940, 19320, 22458, 19419, 16392, 15287, 11641, 8976, 8138, 8133, 11986, 12911, 11242, 14855, 15273, 14189, 11683, 10715, 12494, 12960, 14652, 19653, 23316, 18398, 16831, 18668, 25089, 25441, 17340, 14896, 17206, 17401, 17388, 17254, 19728, 18738, 16506, 14270, 15759, 14062, 15345, 20180, 23514, 23987, 22691, 21224, 24123, 22903, 20284, 18214, 14432, 15002, 20381, 24754, 26317, 27034, 20189]
6816B0189l639K690L071K24j562j006J673L166R99j79J382k699n845m902J45L30
6800A4037J080P43j813m908J704L850J713m191l916K417K226L139j069k471M373
6785A6914J461l194J610R45l972L55j391j789K207j28m097n25q7O154M243j946
6769A6760m568N1M118M80o64J041L408K416n85N70j567M80j405j855j618j711
6753A5351K566J647J843p6l911l881l61M861L388n112l297L096J420l143m543
6738I848r12j276K076L697o63J556Q04J72m627j871J273r50J208M815k760m275
6722H115K580J308K352M989K874l319k653L165j963m662k752l743j16q34L590
6707H931L545J737K292n661m088r9J9K708K282j442R89J903M82K694k70p94N94
$$ y = [20189, 16550, 19240, 22311, 22535, 20973, 19967, 21640, 24806, 25805, 25626, 27008, 24309, 18464, 13562, 13707, 14037, 15117, 15860, 14047, 9139, 10843, 14693, 16406, 12215, 8299, 10716, 12942, 16081, 15012, 12541, 16914, 18375, 15181, 16791, 17736, 13764, 14119, 12728, 10939, 13146, 13018, 8921, 8396, 8309, 14463, 18706, 16760, 12192, 12243, 16361, 16841, 16177, 17218, 20626, 23042, 22457, 23027, 21460, 21940, 20535, 18680, 17062, 15351, 17917, 19564, 21407, 21331, 17420, 13539, 13178, 18039, 21427, 16315, 13018, 16114, 17534, 14391, 9848, 8936, 7660, 9736, 13433, 12770, 14326, 15130, 15302, 10675, 8804, 10077, 9127, 10335, 15150, 12390, 8115, 10695, 12003, 14355, 19344, 22218, 18899, 16246, 19411, 17448, 12786, 10034, 6291, 6175, 5341, 8931, 12476, 14213, 16505, 10844, 6756, 6657, 6676, 9384, 11666, 10224, 11213, 13116, 13598, 16292, 16022, 15228, 15822]
6690A5822M054L047k981k202j068K88k373q61O70o16M028k85J171L39m656J321
6674A5698J9m841j650O65O44J642J282r97K267M197q79m021K137L006k739j451
6658A4979J554P05M55j508k915l721J130K196m48j46M6L022j592k490Q34K105
6642A4206K225M643J658J241M967K478r26l550p726m500K53j695l454L575L357
6627A6752k8l38k144k460J286J920k19l467l230L079M100K359K26j57m341n922
6611G416J782K978l2q15L951k893k088K894L198j193k035J679M78J004Q17J669
6595A8810l564j313q18j55j716Q29k377m174n52J631o61J429L979K359K601l87
6579A5921n121l616K764N09J596j025K139J699n78k769J857J095k312q56K442
$$ y = [15822, 19876, 22923, 19942, 17740, 16672, 16960, 14587, 13726, 14396, 13780, 17808, 17523, 18694, 19033, 14377, 15698, 15717, 10876, 9226, 9891, 10535, 12177, 13459, 12462, 14729, 18926, 18047, 14026, 16163, 19169, 16430, 14979, 16533, 17238, 17693, 16185, 13270, 9549, 10679, 12875, 12427, 12281, 12327, 15349, 13757, 11267, 12101, 14206, 16431, 21074, 22732, 23973, 28940, 31418, 30492, 26942, 19216, 14716, 14969, 13274, 9820, 13395, 16752, 16724, 16386, 14242, 11782, 13068, 14988, 14769, 11302, 8072, 11151, 15251, 17610, 17836, 17679, 13338, 7416, 9198, 12176, 12144, 11329, 15280, 12387, 10299, 13193, 16391, 15198, 13163, 14842, 15320, 16324, 17141, 18810, 15246, 13933, 13115, 12960, 11244, 12073, 9696, 5522, 4970, 6601, 5940, 7369, 11348, 13707, 16308, 15921, 10800, 7184, 9948, 10457, 12053, 11028, 13167, 14866, 14288, 11519, 13376, 14471, 12159, 11303, 13745]
6564A3745l614m403j193J027N55J747J862p3n6m89k865k780J405J261M032L046
6548A3207P05j907j531n40K563M649k87m582N27K936l828k784N09q97J227l22
6532I645k807M33M073K876j52j431j479k425K131L619J884j376n710k226J844
6517H899J547n32r99k16q31k962O40K676J995p65L236r53o83K708J692n282l02
6500I868K293o08L27J215j01J146P51L91j805n183j649R35L90J424K049j394j962
6483H087p6J915J450q13l99n58J018N16L59O86k89K751j407k860l720K50J592
6466H502j406K422J455l114Q79M162p49L1P4k187j811m417k18J361K991J114J775
6449A0864q16m125o12Q62J283J568Q06K854Q54N55P75J122k000K35J583p78j813
$$ y = [13745, 10131, 5728, 4535, 5562, 6117, 7864, 9726, 9653, 9597, 9108, 6243, 3463, 4868, 6129, 10161, 13207, 13912, 12005, 10474, 9934, 12497, 17146, 16859, 12277, 12804, 15740, 11912, 9128, 9637, 8740, 9967, 9645, 6838, 7271, 11344, 14220, 14068, 12637, 11158, 8733, 10864, 14483, 16367, 14991, 9281, 7055, 8899, 10446, 9914, 8915, 8699, 7868, 4906, 5546, 8222, 10217, 9452, 12688, 11735, 11052, 13760, 15452, 10170, 9868, 12161, 11553, 11880, 13095, 12994, 14140, 14891, 15282, 13477, 8294, 6645, 7580, 7970, 9394, 11443, 10049, 8087, 8011, 9926, 11376, 10563, 10164, 9606, 10624, 11140, 11499, 12185, 11896, 14647, 13240, 10380, 6660, 6910, 8502, 7096, 9518, 10973, 7859, 8738, 12900, 12151, 12182, 12256, 10069, 8258, 3841, 3623, 4984, 7975, 9089, 10864, 10048, 5923, 5311, 6173, 7456, 9024, 9830, 12684, 13538, 14093, 14868, 15990, 13990, 14225, 15808, 15030, 13217]
6432A3217m8l662m919l371L314M03J400O77J152o66j595n68K061J007K39K844
6416A1485K428k717J193J055l689j010J120j344j727J870j228l816j118M695n43
6401F654K507K048q59n224R34M160L8k044K78k164j895J136J637n13K100J048
6385I841l225k339N236L902J198j263j491l845m085K879L681L45K08J853Q1m356
6369H620n495M834K769L063m204l010P07l353k347J17M27P79N685O60N8J631p31
6352A0210j453P20J822O58j152K3j927j375m52R72l336O18L189J063L39k61J752
6335A1410p44O98J142K76o114k055k493L245K714k120j19k44L9J292K354m608
6319D673l263K988P082K691M18O48P07k324r04k602K296J488M57j051p81l130
$$ y = [13217, 13169, 9507, 4588, 1217, 4531, 4934, 6334, 7011, 8163, 7497, 5902, 5334, 7395, 8402, 8641, 11485, 13913, 11196, 12389, 13444, 9755, 8745, 9865, 8521, 6794, 8664, 7436, 3620, 2502, 7197, 6654, 9161, 11209, 10350, 5126, 6060, 10220, 10258, 8214, 8492, 6328, 4433, 5569, 7206, 6693, 8793, 9841, 6616, 4277, 9513, 13415, 14613, 13350, 11859, 8014, 3929, 6808, 10489, 10834, 11042, 12895, 12976, 8620, 3125, 7959, 10728, 13791, 9587, 6577, 7284, 3931, 1584, 1701, 2128, 2907, 8592, 9252, 9310, 10941, 10210, 8757, 9477, 11299, 11957, 10805, 10828, 8901, 7526, 7074, 8046, 4710, 5328, 8517, 9580, 9919, 9658, 11410, 10666, 11364, 12506, 12782, 6668, 4613, 2120, 5365, 8079, 5959, 5840, 5596, 5635, 6927, 9281, 4673, 1410, 4398, 11480, 14171, 14589, 15237, 15944, 13620, 12716, 10114, 12410, 13898, 14355, 13304, 12523, 9393]
6303I393O00K973k161l053l417j053K640m077l085L032N604R19m201p95o77P73
6287C415L988M74j321j050N25J796k672n37K255M413o73r35M026K429j723n006
6271I404k287J113k26k718K160p67o60j293m39K385j326k01P47J359M795n330
6255F716P61k24l29Q25n77J18K549j436K054K044o10k604l174j636K521L644L710
6238A4352j716j918q36Q57K850k025l937p67J635K356Q87O32J866j060j554J49
6222A1771n42K40n914m17M245K435J276k528J694J321k661l274l833j440k727
6207c54j220l30j013j454J291M378N681j807m714r82M188j588L40K475j831J413
6191D473M46K774J811m819K096l02j916N65L087j389n74n713p4P40J030M825J671
$$ y = [9393, 9993, 12966, 10805, 7752, 4335, 3282, 5922, 1845, -1240, 1792, 7396, 8315, 4114, 3319, 2642, 3415, 7403, 7877, 6556, 5506, 6031, 7827, 5155, 4618, 6873, 11286, 10613, 9678, 13704, 16133, 14410, 9404, 7117, 8230, 8004, 5286, 7446, 6679, 6019, 4726, 4287, 6672, 5346, 5145, 5892, 7251, 12046, 6716, 7477, 7253, 6924, 7749, 7172, 7290, 9839, 8403, 10457, 12501, 11891, 9287, 6113, 4477, 6998, 10642, 14352, 12636, 10718, 9882, 10739, 13589, 11564, 7627, 6860, 8495, 10851, 11738, 12370, 14236, 13176, 11622, 11771, 11229, 11469, 5555, 5138, 9383, 11818, 13094, 10566, 12260, 13581, 10920, 7646, 3813, 2373, -354, -1574, -1904, -2917, -4371, -3080, 1298, 6979, 5172, 458, -524, 3664, 2076, 2416, 4891, 3060, 4473, 4919, 7693, 9504, 4685, 6781, 6479, 4563, 5128, 8215, 6826, 6252, 539, 465, 1205, 2235, 7060, 8731]
6174H731m260L079J63J727O66p815l752J250k15J307M600J758l958J30J286L127
6158G824j718l650o16k384J478M621K696K566Rl521n750J556K470M174j613l708
6142D434k400K294L00n008j292M295L169m267J747R96K615J995j933k512L32M847
6126I612O75q95j230j443L291J016j651J144J197j304K58q13n704j312K820j304
6110D357k059L091K685j840R39j937r49L151J891k319J598O76M72k810q68r26
6094E152k757j880j556K126k38K462M256L180j518J020q39l044q7k987k256k81
6078G53M49J19J166j685k413K572J814J074J714K72M302j44k371j887k561j801
6062A373J220L400J289j903L205j82l103j681j901Q67q13R3K139J099J646r92
$$ y = [8731, 4471, 7550, 7713, 9440, 10106, 2291, -1461, -211, -426, 881, 5481, 7239, 3281, 3411, 4697, 7824, 6106, 2456, 1840, -544, 934, 5555, 8251, 10817, 10826, 7305, 1555, 3111, 5581, 9755, 8142, 4434, 2034, 4328, 4628, -380, -1672, 2623, 5792, 1525, 3272, 4268, 6883, 8878, 6945, 4433, 4765, 9612, 10287, 9392, 8162, 6719, 10010, 11026, 9375, 10519, 11716, 10412, 10670, 9857, 4153, 2841, 5661, 4357, 2298, 5389, 8074, 6234, 7173, 5236, 4287, 7438, 9329, 7010, 8608, 9284, 9756, 6946, 6078, 5152, 2395, 515, -1041, 1085, 847, 3309, 7565, 10745, 9227, 10247, 9408, 6364, 6277, 3290, 1034, 753, 1202, 1321, 2487, 802, -1611, 961, 2775, 3849, 5563, 5835, 10137, 9993, 7622, 5735, 3174, 1373, 2593, 5993, 7282, 5379, 8584, 8402, 5299, 3618, 1717, 2584, 1771, 1864, 4003, 5102, 6748, 5756]
6046E756L389k311k9J270J266L516j341o969k991L489K619J459j302m422K591
6031E990m524l895j016L797L711K44J485K324J6l098j561J264j969j910r12m037
6015d091L625K192J420L932j496j02J936J650j940J204J848j783j274j590n11
6000E020L182M013R29m760m602j256Q263L269m0k967l452P69J296j039m066P78
5984E337o85m234j050L433j298j663J86j500j489M225R13l637Q89L021L449K450
5968H347K179J964n572J651L528l132n605k272k463K667q65q53L230k727k091
5953b014J811j369k91J243R47n449l400p37K215N694N734J573q00R14K000j050
5937G021k256J72J097m24q54j248j26j994k416p43N99K030L654j561k154L445
$$ y = [5756, 9145, 6834, 6805, 8075, 9341, 12857, 11516, 4547, 1556, 5045, 7664, 9123, 7821, 3399, 5990, 1466, -2429, -3445, 352, 4063, 4307, 5792, 8116, 8132, 5034, 3473, 4737, 2768, 858, -54, -4091, -466, 1726, 3146, 7078, 5582, 5480, 7416, 9066, 7126, 8330, 10178, 8395, 7121, 5531, 5020, 8202, 12215, 13144, 8384, 3782, 2526, 10789, 14058, 14018, 11051, 7599, 8368, 9664, 8625, 4559, 5337, 4652, 418, -632, 2801, 1503, -160, 26, -1474, -2963, 1262, 2175, -1462, -573, 2448, 5897, 8347, 10526, 12490, 6918, 8569, 12097, 8965, 3360, 1088, -1375, 1292, 427, -426, 2804, 77, -2014, -203, -1572, -1863, -620, 327, -5122, -8522, -9259, -7044, -1350, 4384, 5957, 5157, 6071, 8071, 7021, 4765, 4937, 6034, 5610, 4756, 3508, 3382, 1388, -1028, -1771, -1172, 858, 4512, 2951, 797, 4242]
5921D242J071j179j735K440j716j014M785j301l505m76K361K2m348k08K914L648
5905F001l188k620J914L206J154P82O14n8j151k812J981j902k874J475o67r94
5889H61J959n05M67n57K866j103k202P26K200K102j815l961j525k383j048K951
5873i67L343j349p42j984l618N428L394J269J618k585j116K550j292o021K875
5858H03K240J111p49k438j39L46N35k761J432J618J702L477J702K071j885l09
5842H756k039m386j820J09J629L7K9J184K08l236K977J181J472L08m73N78l314
5825C200J370M28m498m634J395K426l555l350J756L450K401R21k196k390L907
5810F31J827j678q77J894m89M122N434j441n037J272L958n881k557L02k768k257
$$ y = [4242, 5313, 4134, 2399, 4839, 3123, 2109, 6894, 5593, 2088, 1612, 3973, 3995, -353, -561, 2353, 6001, 2813, 193, 2107, 5313, 6467, 7249, 7863, 7805, 6654, 3842, 5823, 3921, 1047, 2522, 1855, 861, 2820, 2315, 2782, 2225, 5091, 3988, 1786, 2512, 4712, 6814, 4999, 1038, -487, -2870, -3918, -967, 2376, 1027, 285, -1699, -5317, 111, 3505, 4774, 6392, 3807, 2691, 5241, 3949, -2072, 803, 3043, 4154, 3405, 967, 828, 1174, 1709, -1052, 380, 1998, 3700, 7177, 8879, 10950, 9065, 8756, 6717, 2331, 511, 620, 2249, 2286, 2315, 3499, 3707, 471, 3448, 4629, 6101, 6409, 5936, 6514, 3200, 4570, 4998, 500, -4134, -2739, -313, -3868, -7218, -5462, -2012, 389, 1310, -886, -3276, 631, 2458, 780, -97, 1797, 1308, 5430, 10864, 9423, 4386, 5658, 9616, 3735, 1178, 1480, -1288, -3545]
5794c545L78o95j939J104J180K191M547J337J070j319n528J328k913K136K369
5779A701L461J037l31k03k249O32K255m504j869l444k746q14K960O444j332j398
5763d00N652L12j247o53L23N08L505K084m488j461m480J887L442k916l119J542
5747D91j69j776j068P3N8J584j102k40o24k557o95J577k153O5J824K45K41L401
5729h25o21k972L077N911m013m109J567J765K272O80L11L285j239L88L23l108
5713B692j119K78M85M88k117j950J222m07J376J389J137K949j720j797r71l985
5697b050K226Q00l7m496k998j662J659J527j878K19J290J731l37q09K097K300
5681d18N21Q53M419K674l248k858K974K355k409m49J52K68Q03j613l417k105M197
$$ y = [-3545, -3167, -3862, -5801, -4697, -3517, -1326, 3221, 4558, 5628, 4309, -1219, 109, -2804, -668, 1701, 5162, 6199, 5868, 5665, 3416, 4048, 6303, 1799, -70, -3514, -6260, -7074, -4114, 2330, 998, -400, 5252, 5564, 4317, 3664, 3987, 4495, 8000, 10084, 5596, 4135, -345, 1542, 4984, 2068, -1051, 491, 322, -1454, -2522, -2449, -2391, -807, -1909, -2149, -2773, -5330, -6025, -4448, -6601, -6536, -4712, -4467, -4226, -825, -1446, -4418, -1341, 4570, 557, -3552, -1985, -220, 2052, 2732, 3043, 6328, 5089, 5477, 5800, 2692, 1573, 1851, 2336, 2824, 707, -1243, -21, -428, 948, 2337, 3474, 6423, 4703, 2906, 1935, -2050, 176, 976, 939, -3557, -6555, -8217, -6558, -5031, -6909, -6690, -5400, -3669, -4006, -4815, -2718, -418, 103, 956, 5375, 8049, 4801, 1943, 4917, 7272, 4863, 4414, 4566, 4834, 5637, 4024, 607, -1498, 2699]
5664B699p50l8j16m423K29J551K866K234L385k191n764l577k106J381p89n97J947
5647d059L876M25l136L310O54j427k040j155M006L40k856K633j513K339O53k230
5631a80K732K553k131M345l480k406l621j849L084L9Q29K340M63J977q88q42L189
5614F154L438L49n629j514J688j786k201q1j843m235K071J886J39n94j459L436
5598a81K129k610m640j968L542K540r90k413k76k067L712M124j348p96m181Q02
5582d621M003J748J380P47R24J281o92k303k178k150P96j995q60J793N801j349
5566B325j596L48j630N527R59m351l956K883J265L011J829L75k51m07q61l164
5550B306k791r57q09K774r25j533L189N705j671o225k085L219M74k932O123J182
$$ y = [2699, 1949, 1911, 1795, -2628, -2399, -848, 2018, 4252, 7637, 5446, -318, -3895, -6001, -4620, -5409, -6006, -4059, -183, 242, -2894, 416, 1070, -357, -2397, -3552, 454, 794, -2062, 571, -942, 1397, 2050, -180, 2552, 5105, 2974, 7319, 3839, 1433, -2188, -4037, -953, -914, -85, 2255, 2718, 4695, 3807, 2965, 6154, 9592, 9941, 4312, 2798, 4486, 2700, 499, 418, -1425, -5660, -3589, -1703, -1564, -2158, -3617, -181, 1948, -662, -5302, -7270, -3728, -1188, -2178, -4591, -4867, -6934, -3222, 902, -446, -1242, -5423, -4621, -618, 1130, 2510, 3257, 4181, 5462, 4770, 2467, 289, -1861, -1065, -3060, -3920, -2127, 3674, 2325, 729, 1077, -553, 4974, 5933, 1582, -2374, 509, 1774, 4785, 6614, 6989, 6738, 6331, 5470, 2306, -485, -1442, -2251, 523, -402, -1935, 1254, 6959, 5288, -937, -3022, 197, 671, -2261, 3862, 5044]
5534E044n73j313Q74p30K44j631K479K48r55l96l48J15j943k776k332N41L62K84
5516b806L080J743K08k345K004K698K003l848l18K552K590m697m413J398k590
5501b741R8J27j781n36K041M966M488K827k225j225l507j461op4k435k549j008
5484e001L370N586J614K221j502k023l092j776r6L649R47l993k70L983n15j953
5468A149j711j013Q45L19R3j568R7J375M21k093J598K212K13J346O48J98l661
5451D68R77n35K647K697l556k022K053l247j21N093J086l883k468k421n97K173
5435a656L983K110k928m21J437J888n77K088l208p23K260L24l084j891K847J200
5419C649J070J011m456k83mk01N92j75l106l96J028P07o76K453K161l180q02m27
$$ y = [5044, 4471, 3158, 4032, 3302, 3546, 1915, 4394, 4642, 3687, 3291, 2943, 3058, 1115, -1661, -3993, -3452, -3090, -2806, 274, 2017, 2225, -120, 1884, 4582, 6585, 2737, 2419, 4971, 7561, 2864, -1549, -151, -2741, -2643, -2516, -4297, -4833, -2792, 2174, 6662, 9489, 7264, 6039, 2532, 1071, 1065, 991, -1444, -3993, -5001, -1631, 3955, 5569, 7790, 6288, 4265, 1173, -603, -699, 2950, 3897, -96, -366, 3617, 3102, 1149, -562, -1575, -730, -411, -318, -1886, -1789, -414, 7, -2086, -488, 1724, 1937, 3283, 3931, 4129, 468, 1445, 910, 3557, 6254, 2698, 676, 2729, -518, -639, 4454, 5540, 1657, -811, -3232, -3829, -1656, 2327, 4437, 1509, 1088, 2525, 4413, 3836, 5924, 2716, 1993, 4253, 4577, 1493, -398, 2449, 3649, 4719, 5730, 1274, 991, 987, 786, 1378, 1203, -1903, -2299, -1271, -564, -1240, 1213, 3374, 194, -608, -1035]
5401a035L43J063r31m05Q48j258j325K997L207K174k019q04k959o67J510K627
5385C366R13k447k595J782k507j844K282J605N27m516j787K501P1K393L60k842
5369b738j748K533l505m705K777L04R73N62N465L228j700r13j927k301J174r6
5353b617j786J961L252P13o04q49j532L23N86J799o49R9o64q05m82L97J101j649
5335a406n03m03L326L283n048j828J527o50J226l52J072p84n812K319K754N04
5319g75N82q16o69J926K673K691L95j660j795k12J33r36M825l70k303k602j607
5302e20m6p05r10r72M41J594K986M84K507k561Q60j084L44J305N4j796q47r23
5284B11K93R51K083o985j064K000l08J416K182k619k014K317N29n693q46N26p12
$$ y = [-1035, -692, 371, -560, -965, -117, -1375, -2700, 297, 3504, 5678, 3659, 2855, -104, -771, 739, 3366, 4279, 1832, -763, 1019, -1488, -3332, -1050, 555, 1082, -3434, -5221, -2720, -2649, -256, 104, -2738, -4486, -1953, -5458, -10163, -7386, -7082, -6109, -5547, -82, 3146, 1446, 533, -1394, -3695, -2521, -2617, -4403, -2442, 810, 1523, 919, 70, -1462, -1139, -553, 1246, 597, 696, 32, -773, -1255, -858, 243, -1406, -1909, -2312, 1014, 4297, -751, -2579, -1052, -1702, -476, -828, 244, -540, -6352, -4033, -1279, -775, -193, -1009, -1678, 248, 2921, 5612, 6007, 4347, 2552, 2340, 2473, 1537, 6362, 5992, 3689, 1087, -520, -566, -1271, -2181, -3153, -2712, -1118, 1868, 2352, 4859, 2298, 3158, 2074, 2418, 3723, 3777, 1981, 1134, 211, 504, 1455, 3538, -3447, -4511, -2511, -2819, -1403, 779, -1840, -3854, -1537, -1008, -6701, -7547, -7021, -7733]
5267g733K526L954n50k6j376m990R03J9O66J445L49j316l161p4j01J478O79j479
5249h787J323K923L666J399J293J364R73p83r11k563k694J216K63J667J037K615
5233D001M033J54j65l328k300N1l02L56k053K757o74j927j347k867K591K863M174
5216F017j458j595K429j091k101p83l600j184k81K138j238K909J275J590O40L251
5200F918l906l045k054k24O33K420k398k623K695N437N186M90k40O52n507k030
5184B404R68j807J061j301Q52j634R67M38Q03J632k856q01j610j857J725P37l946
5167d225j023j407j22K155M452R02p08j003J23J108p81o32J047k44n50K675L68
5150B135K094J444k434k475R67P189O86o157n418l539K36J467L581q44L34r3l547
$$ y = [-7733, -5207, -1253, -1803, -1829, -3205, -8195, -7292, -7273, -6607, -5162, -4813, -6129, -9290, -9364, -9465, -7987, -7308, -8787, -7464, -4541, -875, 524, 1817, 3181, 4154, 3371, 2460, -103, -2797, -1581, -1318, 349, 1386, 4001, 8034, 8188, 8023, 4695, 2395, 2446, 2144, 2500, 447, 3204, 2530, 603, -744, -3611, -1020, 1843, 6017, 4559, 2964, 5393, 4302, 2201, 1418, -2182, -3366, -3647, -1509, -2747, 162, 1437, 3027, 3667, 6918, 3012, -33, -2087, -2311, -1678, 742, -1656, -4279, -1584, 3853, 9039, 9529, 9289, 9941, 4434, 2404, 3372, 1565, 2626, 1325, 2177, 543, 1510, 1948, 2751, 4383, 1527, 726, -884, -2741, -1016, -279, -4225, -5248, -6655, -6777, -4622, -170, 732, 24, -979, -856, 252, -529, -1161, -114, -358, -908, 1767, 2135, 4229, 5673, 3239, 764, 1731, 8920, 9606, 3449, -1969, -5508, -5272, -3805, -224, -1068, -734, -827, -4374]
5133d374k268J206j30k427k689m04k941J35J499L448N530L23k696J797q27O08
5117d210p4K349k186l469r62J946N337L731J28M362J142j713m795j177j90k2j329
5100a132p35K512q14j689L215K575K469J498o50n032j559l669k26L885O69l61
5084I56l58p69k223j84k804m196j86N254k517K905L295K543M790k492n242l951
5068e179K727L791J172j690K70P29m137j050K593K953L584j715k733k880l838
5053e403M235J232L366J90n327j207j50K314M651j499j66K561q96k894M37J768
5037C212j624K966k339q566j748K920J636K094k456k427J261L55R92J428j736
5022d032k990m39K681K147Pj068k96J642j321J665M18J620J452K90m467n650n9
$$ y = [-4374, -6642, -5436, -5566, -7993, -10682, -11086, -14027, -13892, -12393, -8945, -3415, -3092, -5788, -3991, -4818, -4210, -4284, -1935, -4121, -7590, -8552, -6606, -1269, 2462, 2590, 6952, 8094, 6381, 1586, 409, 219, 197, -1132, -1867, 645, -169, -1858, 1357, 3932, 6401, 7899, 7249, 2217, 658, -3011, -3237, 648, 1317, 956, 598, -171, -2394, -2578, -5382, -9578, -9764, -4510, -7027, -4122, -827, 1716, 6506, 4014, -1228, -5179, -2452, 1339, 2511, 821, 1091, 1820, -2317, -3367, -774, 2179, 5763, 4048, 1315, -1565, -5403, -1168, 64, 3430, 3620, -1707, -2914, -3064, -750, 3901, 2402, 2236, 4797, 3901, 1007, 1444, 3212, 1588, 4554, 2215, -6351, -8099, -5179, -3543, -1449, -3905, -6332, -5071, -4716, -3724, -2296, -4032, -7022, -7461, -4780, -2633, -2626, -3694, -3990, -2348, -3669, -2004, -1586, 34, 1486, 1776, -2691, -8341, -8400]
5005h400K472M033O70j106k04K276j369J485O21L48J511K464J548k161l119J91
4989A260j233j206k259j970K250K438oO27n621j976L929J522M419K842j165k39
4973C612Q86k751j614L14j39k359l74l57j704L508k410j349J665j667o95M244
4957a190K91l267j088O91n18l167rP558M402m289p15Q48L225l10k732J813M23
4940A966j805k887K05J000N67j91J924j546r8j284l542q6Q74l167Q52N771M92
4923i55k227J010J576p91r97j250K009K197j815k191J861J583j738l140j580K161
4907d287L702l518P39j052J262L00L311L315k107L99k161p08k29L048q68m381
4891c235k980q97l82M365K576L269J826n150l934L324k760j91L212L100l043l528
$$ y = [-8400, -5928, -1895, -1225, -2331, -2535, -259, -1628, -143, 478, 826, 2337, 4801, 6349, 4188, 1069, 1260, 27, -1179, -3438, -5408, -3158, -720, -726, -99, -5720, -7696, -3767, -2245, 2174, 5016, 3851, 3612, 4498, 1747, 133, 447, 308, -2051, -2425, -2782, -4486, -978, -3388, -4737, -3072, -4739, -5434, -1190, -899, -4166, -5254, -4563, -5081, -8248, -8257, -699, 3703, -586, -1301, -453, 2772, 2462, -270, 1543, 1966, 161, -2726, -2521, -1521, -954, -1145, 779, -767, -865, -2149, -5691, -5777, -4903, -8070, -7218, -1447, -955, -3182, -2172, -596, -1387, -2384, -3634, -1625, 572, -1243, -3434, -1573, 10, -1728, -4868, -6448, -4287, -585, -4103, -3364, -4416, -3154, -2854, 457, 3772, 1665, 2064, -97, -805, -1034, 2014, 1146, -3235, -6215, -7112, -7494, -3129, -553, 2716, 4542, -608, -4542, -1218, -3978, -4169, -957, 2143, -900, -4428]
4875d428k240L654M157j741L832o12P09j610q986l973K061Q347R63j948m182j336
4859g333J715L536J195K239Q54r91q34k142j425R16k85j956m654J4M062L791r51
4842b249K851J332m561k628J526J093l566j93J119O68m032J444L299j748k769
4827h414K271J383m242P41K175L994J285l385k976J75K583L209K351L311M24m707
4811A78n59k105j024L985K64l987L3j916J14J177M999J041N28n511j582J842J552
4794i71n08P91l93Q18q60P65M761Q76l040m581r19O20L85K011K016m384j727k239
4776f579m169R96M099R00j375R63R96J467L47p04r20j7J463M677o29K010K570
4759F095k127l400o112O14J767J852J628k498l042l066N51k44J337L613K409Q69
$$ y = [-4428, -6668, -3014, 1143, -598, 3234, 2622, 3331, 1721, -7265, -11238, -9177, -830, 133, -1815, -5997, -7333, -5618, -2082, -887, 1352, 2206, 1215, 381, -1761, -3186, -2270, -2555, -4511, -9165, -9151, -5089, -1298, -2249, 602, 1934, -2627, -5255, -3729, -2636, -6202, -6395, -5276, -4608, -8640, -7196, -3897, -5645, -8414, -6143, -4760, -9002, -8261, -6086, -2092, -807, -4192, -7168, -6993, -4410, -1201, 1150, 4461, 4885, 178, -381, -2486, -3510, 475, 739, -3248, -3215, -5131, -5017, -3840, 1159, 2200, 2728, -2783, -4365, -2523, -971, -1479, -688, -1081, -263, -1123, -358, 4403, 5279, 2239, -2342, -3261, -2641, -2256, -245, 1771, -2613, -4340, -6579, -10748, -9752, -5653, -4753, -6128, -5165, -4169, -2702, -2355, -3059, -3979, -3996, -2533, 2144, 1515, 3525, 6095, 3968, 568, -5544, -4930, -3163, -1311, 317, -2181, -5223, -8289, -7738, -7982, -6645, -3032, -623, 246]
4743B46p21l056j700J24l396n93K523J217k26j302l56L680M927L340k277K639
4727E069j903j823j343k399j72k291L461L227L115k217n369j080K91J064J924
4712d46j236l675k390J014K153M428K700J86l204l131j068n95j401L48M802K176
4696F61J81n67J844Q91l58J336m57n157r69L684l19J811J340r45m587L17K674
4679A380j548m590O9M82k112j509L932J325m754j661K766M010J285n68l181rk079
4662f762L514j313j324p24J186J930j295j431q50K03J179j092n67J425K06L4M924
4645g57K741k717m022j246J240n98L230K368o02l883l024L622N30Q13J433k861
4629c733J466J972m357J697N540K67l911J593K518k231K721p37N61m7j781j877
$$ y = [246, -475, -3531, -5231, -5107, -8503, -9096, -6573, -5356, -5582, -6884, -7240, -3560, 1367, 4707, 2430, 5069, 3166, 1343, 0, -2399, -2571, -4862, -1401, 1826, 4941, 2724, -2645, -3725, -3434, -2370, -446, -1682, -5357, -7747, -6733, -4580, -152, 2548, 2734, -470, -3601, -4669, -5264, -6665, -6317, -1515, 661, 842, 275, 2119, 3010, 2652, 3988, 3531, -1626, -2595, 1089, 770, 2581, 3921, 2976, -1611, -1294, 1380, -168, -4758, -4689, -4207, -6319, -7828, -3896, -2571, -7325, -8986, -6220, -2210, -925, -1493, -4674, -4683, -6762, -3248, -4561, -5885, -6609, -5423, -3493, -4788, -6219, -7069, -6866, -5687, -6779, -7346, -5921, -5715, -5681, -757, 1984, -733, -4755, -6001, -4761, -5359, -2129, 239, -363, -4246, -7270, -3648, -3118, -2305, -872, -3733, -2267, -295, -4652, -2955, 2585, 2852, -1059, 534, 3052, 821, 3542, 2805, 3366, 3319, 1538, -339]
4613c39q22M57o56l867o08j491N385M257K668K218j06l706l491J204K630q13K403
4596E323j796m194l900J816n62J507O40k943k735R2o2J147r54m791q75J866N57
4579i864M066J701j884k531K1J207J679J216K606k302j75J432K977M727K654n87
4563F943j767J64K791J705J169L525l962o722j387K969p56m926m727J382P52l400
4547f247k781j13K213m85p09n49L868N29K013j757K520J532j172J76k900P57K737
4530c68K409n606l884O26J15L145L99J659M956M556j073L72j698k249M84r34M23
4513C332j198l190m317m356j401J592K809K057J083R09j677j351o42j45P04M894
4497h97J518j657k581l465Q32M535k016l878k308K615N361K669k843j185L226
$$ y = [-339, -1161, -704, -1360, -5227, -5835, -7326, -1941, 2316, 4984, 7202, 7096, 3390, -101, 1103, 3733, 2920, 5323, 3527, -667, -4567, -2751, -3313, -1806, -1166, -4109, -6844, -6752, -6814, -5667, -6621, -11412, -12287, -10421, -9864, -5798, -4097, -5981, -8512, -8491, -7284, -5605, -4389, -1783, -4085, -4260, -2828, 149, 4876, 7530, 6943, 5176, 5340, 8131, 9836, 11005, 14530, 10568, 3846, 2459, 5428, 4672, -254, -4981, -3599, -2847, -6247, -9028, -9141, -6928, -7413, -8122, -8671, -4803, -4274, -2261, -4018, -1498, 34, -1138, -962, -3862, -3105, -368, 2041, -3565, -7449, -6823, -6708, -3563, -3164, -1505, 3451, 8007, 6934, 7306, 5608, 3359, 3843, 2909, 3332, 2134, -1056, -5373, -9729, -11130, -9538, -6729, -4672, -3589, -2680, -4357, -5708, -6350, -6495, -5791, -897, 621, -1036, -3617, -7082, -6250, -1715, -3731, -7609, -9917, -7302, -1941, 728, -2115, -3300, -74]
4482g4j000k312j118O96J936n74J307J303J306K47j871J249J318L247J38k920
4466B878k650k672J273K568m150l916j431R45M943J974M36m392p13P12L764K446
4450B015K239j505n584m248M214M405L169k850n75p62m778r02N825K08l825l817
4434f771K002J878Q39j907J94k306P71p55j057P31K197k31l478p76l446q9N454
4417f750K471J78r91j75O049q81n149j206K270N220J960M46m014N69O1M709J302
4400F069m670r33R7q80J130j128l989j809j48N727K729J170P12j343j611q81m009
4383c767J397p6l56J946J663J174m592j571L77M59j821n73n889N281M902K542
4367A096K111m261k432k146j615J247K771M195j026J97J378m282m437l817K46
$$ y = [-74, -1074, -3386, -4504, -3808, -1872, -2446, -1139, 164, 1470, 1717, -154, 1095, 2413, 5660, 5798, 2878, 228, -2444, -1171, 1397, -2753, -6669, -8100, -7155, -2212, -238, 198, -4194, -4907, -4195, -431, 2015, 4254, 2749, -2835, -7083, -2869, 1536, 4705, 1855, 1280, 518, -4260, -5162, 663, 871, -2954, -6771, -4769, -2891, -2052, -3959, -3765, -6071, -5300, -6055, -7112, -6381, -4184, -4415, -7893, -8669, -12115, -12204, -6750, -4279, -4101, -5092, -5267, 782, -99, -5248, -6454, -4184, 1036, 2996, 3442, -572, -3, 58, 4767, 6069, 1399, 466, 563, -317, 813, -315, -4304, -6113, -6261, -534, 2195, 3365, 4077, 2734, 1123, 242, -3767, -2370, -2446, -2802, -856, 807, 1981, -2611, -4182, -3805, -3346, -5167, -5740, -11629, -6348, -1446, 1096, 3207, -1054, -3486, -5632, -7247, -6000, -3229, 966, -60, 137, 1515, -2767, -7204, -11021, -10775]
4352a0775N033o98J666J172j100j413j156Q68Q87K620j905k853j171N539J937
4337a349k57J462N60J236m62k092J278K45n66q46R16L51K24k490L046k810j290
4320b844n98l290k684K131j498k405j361J20K805j787J09K273L8j827o44J952
4304i510j805J82J280J376J937O86J662L588m48m205o70p06J759K333j221L033
4288g29l415J340L96r96j642j268O22J091n61J049l87K124J977j30l228m575k163
4271a0495n3J958k889k477J925L771N980J441j728p39K241k51P62R81l229k263
4255e065k309k121k434K721L490K164K820R77k807j454j443N46k393j430M165
4240d573O18j969J357O14j22N70J879o6l358J277J609r30l978P16M301o88j126
$$ y = [-10775, -5742, -6440, -4774, -3602, -4702, -6115, -7271, -6403, -5516, -2896, -4801, -7654, -8825, -3286, -1349, -1606, -144, 416, 1652, 1190, -902, 376, 621, 55, -791, 125, 476, 700, -1790, 1256, -1554, -2844, -3442, -6732, -9416, -7285, -8783, -11188, -12549, -12429, -9624, -11411, -11302, -9029, -8991, -10818, -11462, -9510, -11315, -11133, -9853, -8477, -6540, -5854, -4192, -604, -1052, -5257, -5927, -6633, -4874, -2541, -3762, -729, -4144, -2804, -2408, -3404, -5046, -6314, -5692, -4601, -5162, -4113, -4500, -2376, -399, -529, -3757, -8332, -10495, -10548, -8590, -11479, -13956, -12031, -8260, -2280, -839, -2567, -3306, -1065, -1316, -554, 427, -2802, -5065, -7374, -9495, -11929, -9208, -5718, -3554, -734, 243, -2564, -4018, -5461, -4915, -7308, -8738, -4573, -3955, -5924, -4567, -3953, -4075, -3505, -1626, -1692, -5050, -3773, -2164, -3094, -7072, -6356, -2055, -2743, -3869]
4223c869k642m812K853R40K863Q77J141K437l464K97K148L079n16l993l880k114
4207h655K893J666J579l579k604J395N734k96j657r23Q16J14J946K170Q16K412
4191C827j486o992p079r71K376M404O34oJ132m479J956L521k852q63M280L98k010
4174d210j672j13J218k96m299J806N405m860j332O364J225k824j219j241J46q63
4158f765j011K316K979O9l068k66J826j843M422P63M50o0k757m10m215L645k6
4141c951J323l095n006j116M316J954M97P82l642Q16L029J456M8p59k67m351q52
4124h818k05N111J019j133j682l609P84M352K552J783J045j774m108J75J839m25
4108c094l640l050L689L098J593l130k358M12N99k516k857J512L574L324j91j497
$$ y = [-3869, -6511, -11323, -8470, -7530, -4667, -3790, -2649, -212, -3676, -3379, -1231, 1848, 1332, -2661, -6541, -8655, -5762, -4096, -2517, -6096, -8700, -7305, -1571, -1867, -3524, -4447, -3631, -3517, -1571, 599, 1415, 3827, 2341, -4651, -11730, -12701, -10325, -5921, -5287, -5293, -4161, -8640, -6684, -3163, -6015, -6878, -2598, -2200, -4210, -5882, -5995, -4777, -5073, -9372, -7566, -2161, -7021, -8353, -1989, -764, -3588, -4807, -6048, -5902, -6765, -7776, -5460, -2481, -2412, -5480, -5746, -3920, -5763, -1341, -578, -128, -188, -2945, -3355, -7570, -3925, -3951, -2628, -5723, -10729, -11845, -7529, -5575, -5078, -4296, -7938, -7122, -4093, -2637, -2589, -3348, -3615, -7966, -8818, -9023, -3912, -2893, -4026, -5708, -9317, -8533, -4181, -1629, 154, 1199, -575, -4683, -4508, -2669, -3094, -6734, -9784, -6095, -2997, -1404, -4534, -6892, -6480, -5881, -8397, -11254, -9742, -6168, -2844, -3035, -4532]
4092d532j877j344j88p14K571M163L822j794k991k838J403j069q45O45p1R43J337
4075c379j018J21J63K96J357J200K224N2k231o41o75R68K01j637j236j91j421
4058e847K514K021p143k430p38L335L787m970q40J555M286J033j039j622k219
4043h317L246R22K626M700j820o555m196J332l93k655M51L871N479L328k55L284
4027E048l200m852j126l08M65L10j775P89N84j436k377k89N156L144K385J08j504
4010A122P5l031k399k350J361j91K38k662m665P77R02J924K000K830M257L98j16
3993D70j45j8K353k132J527k773l172o63O54L2O5r60j540j868j875j555l41L125
3975h816L141J600J069J45L133J705k837k68M60o45K431k014j593L000m92Q57
$$ y = [-4532, -6409, -7753, -7941, -8655, -6084, -1921, 1901, 107, -2884, -5722, -4319, -5388, -6233, -5588, -5659, -4716, -3379, -4397, -4276, -4113, -3817, -2460, -1260, 964, 1016, -1215, -1856, -2531, -1563, -1362, -2999, -4235, -4426, -5847, -3333, -1312, -8455, -10885, -11623, -8288, -4501, -9471, -10311, -8756, -4470, -3437, -4476, -6098, -8317, -5071, -4149, -1523, 3177, 1357, -5198, -9394, -8062, -8455, -11110, -10659, -6788, -1309, 2019, 1764, 5048, 1848, -3004, -4130, -4438, -3973, -3663, -5438, -4649, -4065, -5501, -7878, -8167, -3011, 133, 2518, 2626, 1122, 1197, -1834, -4233, -6583, -5222, -5413, -5175, -7837, -12502, -11725, -10823, -8899, -6899, -4069, 188, 586, 470, 325, 307, 2660, 528, 2055, -718, -3890, -4553, -3899, -3867, -3802, -4762, -6302, -8170, -10045, -11600, -11941, -8816, -5675, -4075, -3006, -2861, 272, 1977, -860, -1128, -668, -1313, 1118, -896, -2489, 511, 19, 876]
3959H76j919j413m713j514P51L040j714j25p34M013j218r28Q73r26N24k544l538
3942a1209j674j713K145K839Q44J576l81K045K438Q16J177j19k717j529R40j072
3926e594j456j192k52J967K46l75k00j068O829J384J855j231n518j682M02J271
3910d614J051O34k059K136K607M34r37N89K21j154J000k121J102r31R28k797n30
3893d441J868N04j993k787J011K907K032k543j787P62QJ449j969o114k290l550
3877a6933J384N975K233J085Q90K689k883j202p86L057J339J383K537l92l008
3862b632R52r84l0N58N36K154J947n418M35l14J2Q13M534O38k80M83J646l794
3844A256k512k771k899J622L502J74q59k718K384m2k075m427L539J700M83K132
$$ y = [876, -1043, -2456, -7169, -8683, -7932, -4892, -6606, -6731, -7465, -3452, -4670, -5598, -4725, -5651, -5127, -7671, -11209, -12883, -14596, -12451, -9612, -8768, -7192, -7573, -5528, -3090, -2274, -1097, -1216, -3933, -5462, -4522, -5594, -7050, -8242, -8494, -6527, -6281, -6656, -6856, -7924, -1095, 289, 2144, 913, -4605, -6287, -5885, -4614, -3563, -2929, -4988, -2852, -245, 189, -748, -159, 62, -1092, -92, -2213, -1111, -2042, -1114, -3911, -4441, -2573, -2069, -4062, -6849, -5838, -2931, -899, -3442, -5229, -4467, -4459, -3010, -4979, -11093, -13383, -16933, -15549, -9574, -7341, -6256, -5366, -2677, -5560, -6762, -7548, -4491, -3152, -1769, 768, 376, -2632, -1680, -2664, -2694, -2136, -1600, 554, 2501, -2917, -2482, -2796, -2784, -1971, 2563, 3201, 2921, 3404, 5050, 1256, -1256, -4027, -6926, -5304, -1802, -1628, -2487, -5205, -2821, -2863, -4938, -9365, -5826, -4126, -3643, -1511]
3828a511J451J046J115J52p32m411l688K417M901k062L61r80m503r33M588J592
3812a197j728K22r14k223j418J004K842k366j160m83L053K192J462k429j495M25
3796d213l176J092j954K643L700j076L803n773k775J969J643N762R19m55k698
3781e89j664j164n44k706p50j478q12j205Q32j521L753M477P38p99R38J838j121
3764a777k246K490l85j221j676R6n015J257J703p13k224J460N225M108l00n36
3748B46L331J513p79J570J225p039l705j246P77m60j316n4K13J550J728R17O09
3731i20j012m169l33J120O96j324o13K749K0j467k238j06L3J870L35qN961K273
3713B867k017k405j872K588k853j101L54k337k482l497L462O687o99l847l715
$$ y = [-1511, -60, 986, 2101, 2253, 1521, -2890, -6578, -4161, 740, -1322, -961, -1941, -6444, -7377, -2789, -1197, -2925, -2703, -3617, -5840, -7258, -6254, -3412, -5778, -6938, -7421, -4368, -2176, -714, -3143, -4638, -4213, -7389, -6297, -8251, -5608, -1908, -2984, 819, -4954, -7729, -5760, -4117, 1645, 2564, 2109, -589, -2253, -3417, -3961, -6667, -7417, -8895, -9707, -10912, -10080, -11601, -7848, -3371, -2633, -3432, -2494, -656, -1777, -4023, -1533, -1918, -3139, -4815, -4719, -9734, -8477, -6774, -7487, -9711, -8251, -3026, 1082, 782, 246, 3577, 5090, 4311, 5881, 7106, 67, -3638, -4884, -4107, -4567, -5883, -5937, -5724, -4174, -2446, -1529, -920, -1932, -6101, -6434, -5314, -4618, -5942, -6555, -3806, -3786, -5253, -7491, -7597, -7564, -5694, -5359, -5367, 594, 2867, 850, -1555, -3427, -839, -3692, -4793, -4439, -6776, -9258, -12755, -9293, -2606, -3305, -7152, -10867]
3698a0867K364n32o95K754J494N447J100j174j947l700J680J784n27j533k245
3683f597m37j676J535N21k11p20L850r15J569J780L7R1n96j440k639O53J619l10
3665c886L40l337k646L276K538k944n758k147J440L411R15j455J634l93J093L565
3649d354j277j091J034j463L402N33j874L039L562o31J064k57m533k24k610j65
3633e845j776M683M433J465j47j882j067k614m29o72P850O00j737k151j32p82
3617b03j304r82k320K609L278L637J180l551m369J647M51k351q20o9J816K23K25
3600i03K202q12n755q99L826L186j486K94k229n709j828R02L989J499J836J544
3584c43r09L22J443j648l398p46M366K619k622L62K338k157Q2L046N40n989l298
$$ y = [-10867, -8503, -9035, -9730, -6976, -5482, -35, 1065, -109, -2056, -5756, -4076, -2292, -2819, -4352, -6597, -7034, -8710, -7175, -6654, -6865, -7585, -3735, -4650, -3081, -1301, -1264, -1173, -1769, -3209, -5848, -5195, -3576, -3886, -3546, -6883, -9529, -6253, -3715, -6659, -12417, -14564, -13124, -9713, -8798, -10253, -8619, -9012, -7919, -4354, -5631, -6722, -5688, -7151, -3749, -3216, -5090, -2051, 1511, 880, 1944, 1687, -2846, -3070, -5680, -5845, -7621, -2938, 1495, 2960, 2813, 931, -136, -2750, -3179, -3851, 3999, 4599, 2862, 711, 579, -203, -1507, -2489, -4809, -2200, 1078, 4715, 5895, 2344, -2025, -378, 73, -2278, -3098, -3167, -1351, -1128, -903, 1299, 487, -5268, -6167, -2341, 845, -641, -347, -2576, -8285, -10113, -9211, -5222, -3723, -1887, -343, -1252, -930, 513, -1135, -4533, -5279, -913, 1706, -916, -554, 1784, -373, -291, 2755, 3295, -2694, -5992]
3567e992j982N15L353K880J753Q06l39J127J765n643k666l441J187K076j84j005
3551e790m64j765m625J648K829L410J883k835q6N962M315k354k550m08j643J454
3535a019J922m87k986J003k14p71J636J806m75k627J881l796k82R93o68O03r8
3518c579M733K565lj177q01N92J224J107l132m913K180P70n401j927M804J741
3502a217J787q54n266r67J154K511J220J088j715l933R56L332J377O41N0k197
3486b033l863M960O692r77l359J303l079n280l163M671L155l977k353j597J237
3471g663P142l081m630Q15J139M911r82J686j782J53j591r24K561O80l490K015
3455c041L297l502K097J677j822K735L9p59K05j841m656p28K092K288J103k478
$$ y = [-5992, -7974, -7459, -4106, -1226, 527, 1333, 994, 2121, 3886, -1757, -4423, -7864, -6677, -4601, -4785, -5790, -6254, -8019, -12644, -10996, -8167, -4757, -2874, -5709, -5795, 167, 4482, 2128, -422, -830, -2473, -1019, 903, 416, -2570, -1567, -1781, -2552, -916, 890, 415, -2212, -331, -4127, -4409, -3416, -4084, -3481, -3579, 1154, 3719, 3716, 2539, 1738, 2330, 3554, 4661, 1529, -3384, -1204, -434, -5835, -7762, -2958, -1217, 570, -284, -5550, -6517, -5363, -2852, -1632, -544, -2259, -6192, -5236, -1904, -527, 114, 164, -2033, -5896, -936, 5756, 4779, 1420, 2723, -356, -5636, -8799, -4128, -973, -4950, -7303, -8900, -7663, -521, -3602, -8232, -7417, -6278, -1367, -2349, -663, -2445, -2292, -3883, -4807, -2246, -1566, -5056, -3041, 256, -3246, -1149, 528, -1294, 1441, 1480, 721, 926, -915, -5571, -6299, -4207, -1919, -816, -3294]
3439c294k058L090J166o6j629k411j966J618M005j059l726r63J333R45L307k713
3423d421O64j178K246K454k333K095K591P09J072J597m661k795r10M0J041k659
3407d448j920n76K281m61p81j10J447k19j471qL08L501j629k059J562l088j664
3390i335q47K303L359L485r68J03K644J654m201k772j573j868l98K426P64n090
3374a0314j649L105J976k57j106M448N583O77k134k078o447j035J397J234k281
3359h881Q07L455o11N141K606l29o252J114n86l281Q5L96n05p31k300J311j540
3342a0101Nk970K571M725L236J698K052J548P18l750m602m664J844N039l70r74
3326c995j802n013J303N278L00j281l121L678N15k586j313J953K490K556J06j726
$$ y = [-3294, -5352, -2262, -1096, -1162, -2791, -5202, -7168, -5550, -1545, -2604, -6330, -7293, -5960, -5015, -1708, -4421, -3757, -4935, -2689, -235, -2568, -473, 2118, 2827, 3899, 5496, 835, -1960, -2870, -2830, -1789, -4448, -6368, -6944, -4663, -5124, -5905, -6015, -4568, -4787, -6258, -6266, -5958, -2457, -4086, -6145, -4583, -7671, -9335, -10182, -7879, -4520, -1035, -2003, -1900, 744, 2398, -1803, -4575, -6148, -8016, -8414, -5988, -5224, -10314, -11963, -8858, -6882, -7139, -8245, -3797, 1786, 2463, 329, -1749, -8196, -9231, -7834, -6600, -8881, -8074, -4619, -5230, -89, 2517, 2188, -4064, -2950, -3536, -6817, -6732, -6336, -6841, -7572, -9872, -8561, -10101, -10096, -13066, -10495, -5770, -2534, -836, 1216, 2764, 3482, -268, -4870, -9534, -7690, -2651, -3021, -3995, -5797, -10810, -9507, -4229, -3929, -5210, -8331, -4653, -4138, -6724, -8037, -6084, -3594, -1038, -932, -2658]
3310b658k437j26L756J275J93Q84K278P74Q37l008l714m424L28L776N78k034J09
3293c613j821k385K784K077K675J239n73l499j448K982n79k28n94l126k747M3
3277h813m280n04M96n24L811P301j272l578N54q58L08L532O70m957L956L836P74
3260D52j997k558J609O33n154j426K780K039N417l750M63K271r68k696j013j296
3244e194r55J03J688l926p192j065M455N894Jk82q99J958L603K912J696j42O71
3227C326L76j715L1q403j144n22Q95J882O062K601l455q39J4j041K687J719l004
3210e30m320k777P40q72M78K71j141J001j910j017J503m08K871R62L25K09P81
3193c834K917k841l114m94K239J309O34j814J461J954k115J651J26m219K317O85
$$ y = [-2658, -5095, -5221, -1465, -190, 3, 887, 3165, 3939, 4776, 1768, -1946, -6370, -6042, -2266, -1688, -3722, -3613, -5434, -7819, -5035, -2958, -283, 956, 383, -3116, -4564, -1582, -2161, -2389, -2983, -6109, -8856, -8813, -13093, -13597, -13101, -13625, -9814, -2513, -3785, -7363, -6809, -7667, -7359, -3827, -3157, -8114, -4158, -322, 452, -1545, -4103, -2494, -1861, -7015, -8441, -5661, -3622, 1795, -1955, -1492, 779, -189, -2885, -3898, -5194, -6149, -6046, -4358, -8284, -15476, -16541, -12086, -6192, -6191, -6473, -7372, -5414, -1811, 1101, 2797, 2655, 3326, 3702, 1987, 2018, -6385, -7529, -8051, -7156, -5274, 788, 3389, -66, -905, -891, -1932, 755, 2474, -530, -4850, -7627, -6887, -7759, -7281, -7010, -8151, -7150, -9060, -10077, -8574, -8982, -6111, -5149, -4824, -4615, -3834, -917, -3758, -6872, -7366, -5127, -3818, -3184, -4998, -3537, -1583, -3698, -2047, -1921, -6140, -3823, -3138]
3177c138j159N32k16N05k473J499k595J054K117k769j339L021j609J740L448j139
3161b521j006k568J848K030k009o6J11N11M59k248q00M121J361k698R82l810l057
3144i360K712K065j753L077J788m60K0k456L62N00K005j611l14J476k765m284
3128h998j112K345m8j45j161J157J234M71L860j661k443j432j228k059M334J136
3112e750O06Q70k482j860k850K429M950L304K138J424J498k713j955j427o028
3097g846j707L923J422p50L140K955j209p81j121K316j595j193k474j704n01M415
3081b710L701j838p941j651M733J095j343K410R76k9j003k5j061k360m528J215
3065a0359L442O992K845n544J107J038L687k672k716k616J707k265j641M051K184
$$ y = [-3138, -4297, -3765, -3981, -3476, -5949, -4450, -7045, -5991, -3874, -6643, -7982, -4961, -6570, -4830, -1382, -2521, -3527, -6095, -4247, -2217, -4226, -4292, -4181, -3670, -3211, -5459, -6259, -2138, -777, -3475, -2493, -6303, -9360, -6648, -4583, -6336, -3259, -1471, -1931, -1911, -4367, -4005, -3505, -1500, -3111, -3425, -1949, -4714, -8998, -10110, -7765, -7813, -7958, -9119, -7962, -6728, -6257, -2397, -4058, -6501, -7933, -9161, -11220, -6886, -5750, -5144, -4274, -6756, -8616, -11466, -9037, -4087, -783, 1355, 2779, 4277, 1564, -391, -1818, -7846, -9553, -5630, -4208, -4958, -1818, 1137, -72, -853, -1974, 342, -1253, -2446, -4920, -6624, -7125, -2710, 991, -847, -8788, -10439, -5706, -4611, -5954, -3544, -2568, -2597, -3600, -3625, -4686, -7046, -11574, -10359, -6917, 75, 2920, -2624, -1517, -479, 3208, 536, -2180, -4796, -3089, -5354, -6995, -2944, -760]
3050g60l210k862j373M19J590N449L741O3n823l833O7J864N53J110R98M261k051
3033B03k516j397l32l537J095O023L98k68M843R82l302l592j92p9M975P66k817
3016A253m792j657J727k468J417O416J06K34L353k800k585Q61j993k485k904l256
3000i573K394N680j556l209j931O37J952k75J657n63j758k386j331K892o91j830
2984i891J59L865M013l19L16K147m085j748j84J583J906j223o862k014M581K699
2968e057J065k348m88N027r09k506m728J414K386l581j310J554K787K475M013
2953b06l3m524k109L622J349M89k401l250q57J504n99P27L325J561J127k15J228
2936G38L886k638l224k045L873M13r42O85k911o395J108K740p0K68L021O51M50
$$ y = [-760, -3970, -6832, -8205, -7786, -6196, -747, 2994, 3057, -2766, -6599, -6532, -4668, -4115, -3005, -2007, 2254, 203, -2313, -3710, -4042, -7579, -6484, -461, -63, -331, 4512, 5494, 2192, -1400, -1592, -1671, 3304, 4070, 1253, -3539, -5196, -3469, -5937, -4520, 1896, 2002, 2236, 5589, 2789, 204, 1065, -928, -3413, -6317, -9573, -7179, -1499, -3055, -6264, -8195, -7558, -5606, -5881, -4224, -4787, -6545, -8931, -10262, -7370, -8061, -9891, -9732, -5867, -1854, -2173, -1857, 290, -3795, -5543, -5727, -4144, -2238, -3461, -10323, -12337, -7756, -5057, -3992, -6340, -6828, -1801, -2710, -5216, -9944, -8530, -6144, -9725, -11035, -9481, -6694, -4219, -206, -239, -4763, -6872, -3250, -1901, -1412, -3813, -7063, -7920, -6416, -7015, -6288, -2963, -1402, -275, -490, 738, 4624, 1986, -1238, -3283, 590, 1003, 61, 746, -2165, -8560, -7452, -4712, -4782, -4514, -1493, -842, -392]
2919c92m58k428j87M630L808m818j262J917K52k506J221K800j042p73J377J740
2903C879M99j345l800j974l44J962J113L325R23k185LJ354j89j146J750K93n320
2886a202m110k00l293J131L536K433j156O62K166J042O123O56l225l501p1k91
2870G00K351p70m695l209M571O60j439J887R6l95k875n8L563O32O43L647n61O19
2852E367L078K395L55k386J241m10p234l728p42m69J5L064J034j464Q73K836P44
2835D569M13l007K10J418k972k345j219K090M169Q85m164k072j098K202J384p57
2819b94m633PP463K950j269l154j433k73N99k70p67K698J418m15J693J675Q48
2802F843n073M47L436r79m020j76l271o72O94O83O9q66p45J37P87M777K207J325
$$ y = [-392, -850, -3278, -3465, 1165, 4973, 155, -1107, 810, 1062, -1444, -223, 2577, 1535, 762, 2139, 3879, 4378, 3033, -767, -2741, -3085, -1123, -10, 3315, 4238, 2053, 2056, 3410, 3221, 2075, 3825, 4118, -1202, -5312, -5512, -8805, -7674, -4138, -1705, -2861, -2199, -33, 1009, 7132, 7788, 4563, 1062, 991, 700, 3051, 2281, -2414, -5623, -1052, -392, -1831, 56, 152, -243, -3118, -3176, 387, 1019, 1662, 5309, 4748, 5367, 8445, 10840, 11195, 8809, 10050, 9640, 2406, -1322, -2064, -2533, -2518, 546, 1580, 116, 989, 3825, 4569, 4982, 1975, 2185, 3603, 631, -1714, -2933, -843, 3326, 4211, 47, -2025, -3123, -921, 463, -294, -4927, -4920, 2543, 5493, 4224, 1070, -363, -636, -37, -307, -1074, 1624, 3042, 2627, 4320, 5995, 6843, 1770, 2217, 5653, 4674, 654, 478, -2793, -3465, -2771, -2088, -2019, -2885, -3630, -3493, -2706, 2071, 4278, 5603]
2784E603l186q26m16j424j513r40k96J557j55j949J904o35k509P47J671M74K349
2767D56J722L794n727l403J886j364L288J029k551k068k121m86l61K451N134Q52
2751B531k126j876l413L310J888o75j802k116k080K21M054L083J770j560k586
2736a377K799L982k136m466j255K292j150K834K464k788j327j524l867P75L178
2721a566K048p0O66k883m015j362L64J726K510J450l262M844j472k793m97J224
2705c088L24R59K297n20J579j441K42q19q92m50j086K498M5j417J30L423p3k427
2687g16j78l887K324L287M824R20j353l862l248k234l143M496j998l091K027O84
2671e148N61k367J263p19l590m35J992N55j491K814J274L48L526J198j113m53
$$ y = [5603, 2417, 1591, 1175, -249, -1762, -2702, -2998, -1441, -1596, -3545, -1641, -2276, -4785, -4038, -2367, -1893, 456, 2178, 5972, 245, -3158, -1272, -2636, 652, 1681, -870, -2938, -5059, -5545, -5906, -3455, 1679, 2531, 405, -1471, -4884, -1574, 314, -361, -2163, -4279, -6359, -6138, -2084, 999, 2769, 1209, -1377, 1422, 5404, 3268, -1198, -2453, -161, -1311, 1523, 3987, 1199, -128, -1652, -5519, -4744, -1566, 482, 412, 1078, -1805, -5820, -7182, -6818, -5092, -2582, -1132, -4394, 450, -1022, -3815, -4312, -3088, -2764, -1805, 492, -28, 1551, 110, 352, -467, -1359, -1809, -2895, -397, -352, -1769, -1639, 1784, 1711, -716, -894, -4781, -2457, 830, 5654, 6574, 5221, 1359, -1889, -4123, -7266, -2770, -4768, -7859, -5832, -5148, -4587, -6954, -5691, -6410, -10000, -10435, -8443, -7888, -9379, -6565, -5291, -4943, -1417, -219, -1332, -1785]
2655a785J854l874k573J547J358q07M79J072r35k143q0L319K774J484j179r09
2639c98n83n84j233j848J677q38J349p60L717k075K20j719M3k502r29J454L541
2622a468J268m21j214J679k35n295m921K309K920N053r42m93L863p77q24J00n904
2605e302k636L254K922L523M58J846j623n580j761K510n72j951J9L788J535O61
2589A091j717q61n85J326j069M08k302o89r60m131M97M345K521o76K256L824j664
2572A614k768Q53J459j315q45J992j332l219J642L169j721m731m322j39K390K005
2556e268L380L524J003n48L071K839K276m91j956k578j896j771l712r05L127J441
2540A536J949L202R0l520l717l341m221k113k115J555J422M391K999o79l25K748
$$ y = [-1785, 69, -3805, -6378, -4831, -3473, -4280, -3801, -2729, -3664, -5807, -5887, -2568, 206, 1690, 511, -398, -981, -1565, -2798, -4646, -2969, -3807, -2458, -3218, 499, -1576, -1356, -3075, -3032, -5534, -6463, -5009, -1468, -200, -621, -1835, -156, -391, -5686, -10607, -8298, -5378, -325, -1267, -1760, 2103, 1326, 502, 602, -5302, -7938, -4684, -1762, 1761, 2219, 4065, 2442, -3138, -4899, -2389, -2961, -4912, -4893, -1105, 430, 1091, -626, -1487, -2072, -746, -1815, -1407, -3709, -4398, -5358, -9489, -8992, -4647, -2126, -2802, -546, 3278, 1614, -1154, -301, 1158, -157, -1002, 990, -342, -3561, -1919, 1250, -471, -5202, -9524, -9663, -7273, -5268, -1888, 1636, 2639, 2091, 5162, 8001, 10277, 9786, 7830, 5252, 3356, 1585, -2127, -3032, 95, 1536, 3485, 6687, 6777, 3257, -460, -3801, -8022, -10135, -12250, -10695, -9273, -4882, -1883, -2562, -2887, -139]
2524a39j568q82K041k940l869J455K683N33J763J150j284k217J279k376k272j379
2508h022N43j020J449M287N22m1R51m34l92p9N24J82K8K11K407q13k193J187M918
2489D215L584q2n306k915N86K044j614r80K754J231j006o86K132k876j375J016
2473G22J183K863J553j038K187j251l569L170J206l208K35N38r32J482M7m735
2457D53n44J245k04J088K330J957k059K727j74K654r68m21l142n672k313J539
2441a504K051n1r19l1j703l40J654L367k36j623k185k834l73J972j115K97K476
2424a097L24L064k196J1L36k400j082J413k139m471L071L452J141k974J442K296
2408A91q74j971k408j537K860L247q93l290o68J422j205l552K304Q44l675L358
$$ y = [-139, -1707, -2589, -548, -3488, -7357, -5902, -3219, -2686, -923, 227, -1057, -3274, -1995, -4371, -6643, -8022, -7479, -8499, -7050, -2763, -2241, -2282, -1331, -1765, -2157, -2236, -1712, -1530, -1502, -1291, 1116, 303, -1890, -703, 4215, 7799, 7717, 2411, -504, 82, 2126, 512, -468, 2286, 3517, 2511, 1825, 3957, 1081, -294, 722, 1905, 4768, 6321, 5283, 7470, 6219, 2650, 5820, 7026, 3818, 4053, 4591, 3659, 5141, 5188, 453, -91, 1154, 950, 2038, 4368, 6325, 4266, 6993, 6819, 9473, 8505, 8084, 4942, -730, -3043, -1504, 547, 496, -423, -454, -2157, -2497, -843, 2524, 2288, 665, -1520, -4354, -4727, -2755, -3870, -3573, -1097, -773, 2291, 95, 106, 442, -1958, -3040, -1627, -3766, -8237, -5166, -1714, -573, -3547, -2105, 191, -683, -2654, -5062, -6599, -3739, -492, -1385, -4675, -5343, -3921, -5126, -8678, -6374, -5530, -9205, -5847]
2392e847O017R24L58J510j041j393K796J025l019l965P671M73n943k007K74m405
2376f572j659q39j702L90J748K144J352J656j983p06M00l321M580J432N74j223
2360c729r0l146K428j443j231J282M171J197K335O08P31Q64k167l213J31J781
2344E09o50L08K152J894J870o027l719J105j907J216L556P90k967l558L629M495
2328B696j582J840J00l687j955J923j895K057L264j123j476K530R35j470m137
2313a980o690k315K830J130l526l557J462K529K233Q21l74J06P0n21K363K206
2297c213K772L864j477m145k918r34l23K776M169K514q20j819k881k706k938M55
2281g624N418O168N02m930j192Q2k19J330J968J597j978j106j419L084M92K482
$$ y = [-5847, 170, 1094, 1452, 2962, 1921, 528, 3324, 4349, 1330, -2635, 5036, 5509, -434, -2441, -2167, -6572, -8231, -9070, -10772, -10382, -8634, -6490, -5138, -3482, -5465, -6171, -5771, -9092, -4512, -3080, -2506, -3729, -3819, -6965, -4537, -5980, -7211, -5929, -1758, -561, 1774, 2382, 3113, 3977, 1810, -1403, -1272, 509, -141, 167, 2319, 4213, 6083, 56, -3663, -2558, -4465, -3249, 307, 1097, -1870, -5428, -1799, 2696, 1114, 2954, 3054, -633, -2588, -665, -2560, -503, 2761, 1638, 162, 2692, 3627, 2157, -1980, -8670, -10985, -8155, -7025, -10551, -14108, -12646, -10117, -7884, -7063, -7437, -7331, -7261, -7782, -5419, -3213, -441, 3423, 1946, -2199, -5117, -6051, -6374, -3598, 571, 3085, 2265, 446, -2435, -5141, -8079, -7624, -2206, 3962, 4464, -466, -1658, -1576, -1795, -465, 1503, 3100, 1122, 16, -1403, 1681, 2173, 4655]
2265D655m054n545L99j879K61N575J538m466l30L340M432j37j777m743j287J212
2249b806O40K697J014L365m50k216m42r36Q15p14j039J455k141j635P98P02J213
2232C20Q99J934J497m286k894q78K439j710J922M293N46Q95j222l756P01J267
2216A967K438L601n24j076j100J757j421m857k82J082K254j642j980J185Q67j018
2200A251l284m212k280L165j109K030K667j551o31r21r31M548l167J383R56O9
2184b017j214J381L421J668k761J018N5k268O39L912j051l894M747L397k536o111
2168a614k654J703K982N53j473R52J83J834m09k550j577j203K02j182k018J093
2152e178L969k254K742M095J578l377l478j612P78J096Q60K094k206R30p21j992
$$ y = [4655, 601, -4944, -4545, -6424, -6163, -588, 950, -3516, -3846, -506, 3926, 3789, 2012, -2731, -4018, -2806, -2166, 531, 1545, 4910, 4460, 2244, 1802, 866, 1681, 967, -72, 1383, -758, -2393, -1595, -893, 320, 1219, 3153, 4650, 364, -2530, -3408, -969, -2679, -757, 3536, 4082, 4977, 3755, -1, 700, 1967, 4405, 8006, 7482, 6406, 5306, 7063, 5642, 785, 503, 1585, 3839, 2197, 217, 1402, 2269, 1251, -2033, -6245, -8525, -5360, -6469, -4439, -1772, -3323, -3954, -4875, -5806, -1258, -4425, -3042, -2086, -2017, -3231, -1850, 1571, 3239, 478, 1496, 1551, -717, -78, 3834, 2783, -1111, 3636, 7033, 4497, -1614, -4268, -2565, 417, 970, -503, 449, 632, 2466, 2057, -493, -2070, -3273, -3071, -4253, -6271, -5178, -1209, -3463, -721, 3374, 4952, 1575, -1903, -3515, -2737, -1641, -781, 1313, -893, 37, -684, -2676]
2136b676p65j158L54l512l513n23K987M159M500k884M806N364j77k846k410l272
2120a566j514J236j081j870K18J141J276j660L772K934R68j063k143J248m606
2105b710o387P25J866q42k42L662N846K059l350k749j647P17p45j413L197P165
2089E152k107k056J264l53l44j213P01j610k156J895j470N42M018K165k531J058
2073B955M17J291l977q69K775j307n215l245j536K340r15l893L029M825J777j526
2057c074K378J073o62m702k815J236J650J010o42J777K432j247m387r85n87k25
2041g770L020M063J599k633J605k412k64L861K20L357K208k013J250q04l77P93
2025E703l646j445R12j802j715K216M47L312j107l046k950P87J080k22Q05K911
$$ y = [-2676, -3441, -4599, -4245, -7757, -11270, -11793, -8806, -4647, -147, -3031, 1775, 7139, 6962, 4116, 1706, -1566, -3080, -1844, -2925, -4795, -4577, -3436, -2160, -3820, -48, 2886, 3854, 2791, 648, 1896, -2710, -9097, -8372, -6506, -7348, -7590, -3928, 1918, 3977, 627, -2122, -3769, -3052, -3797, -5210, -2013, 5152, 3045, 989, 2253, 1900, 1556, 343, 1044, -566, -2722, -827, -2297, -1755, 2263, 4428, 1897, 2955, 3372, 4663, 686, -183, 2592, 1285, -3930, -7175, -8711, -6371, -7286, -11179, -8150, -3325, -1548, -3074, -696, 377, -285, -4987, -7802, -6566, -4916, -3906, -4548, -2771, -339, -1586, -5973, -6958, -7545, -7770, -4750, -687, 912, -1721, -116, -2528, -2792, 1069, 1289, 4646, 6854, 4841, 6091, 5287, 4910, 5703, 2057, 612, 1524, -278, -1993, 223, 670, 3982, 2875, -171, -3121, -2334, -1254, -1476, -671, 2240]
2009B240J69K050K745J414k645j006L046K591O48k861l044j391m124k46k395k265
1993e074K137K435j7J043k407K166M647K73K91p25j875j1J393RM7l736K055K989
1975E640m06k685p02j590l207L547J572l150p44M241j456j598L172K882M43j698
1959D261k850j900L350O26j112k874m91k24j436j299J080N23k60m09K487K051
1943A523j568m62L524J325j231k257j049r48j992l514K287O139J643j509l269
1928a358r89K808j981k819L058N515K459N14l516j979k546j295m08J805K575O16
1912B459j348j590j789K292R971J299k725m673l575J017p1j630k484o94p16K218
1896b039J175l32j20K659K10q459k153L507M657M854n56j664j20Q16m856N4j657
$$ y = [2240, 2409, 4459, 7204, 8618, 5973, 4967, 8013, 10604, 11252, 8391, 5347, 3956, -168, -414, -2809, -5074, -2937, -502, -519, 524, -1883, 283, 4930, 5203, 5494, 4769, 2894, 2883, 4276, 4285, 4332, 596, 2651, 5640, 5234, 2549, 1847, 257, -2950, 597, 2169, -981, -1725, 2516, 1060, -538, 2634, 5516, 5959, 4261, 1411, -489, 2861, 3487, 2375, -499, -990, -1214, -2650, -3949, -2869, -2346, -2606, -3015, -528, 1523, -45, -507, 3017, 4342, 3111, 854, -195, -1143, -3135, -6649, -4362, 1777, 3420, 1911, -1358, -2347, 461, -1520, -4339, -1281, 4234, 6693, 7207, 3691, 1712, -834, -2129, -2537, -732, 1843, 2459, 1111, -479, -2268, 24, 9995, 11294, 8569, 3896, 321, 1338, 1267, -363, -2847, -3541, -4257, -2039, -864, -1196, -1316, 1343, 1553, -6906, -9059, -5552, -895, 3959, 3403, 1739, 1619, 2435, -2421, -2367, -4024]
1879d024M349L586k545j125L270l102m207J337j68J72J841j560N86N794K221k68
1863F157l19j74l612l437J485r49K202R80p1R77K968J177Q9l017l424l40p5l734
1845c117j666K916J271J251l400n35L697L033L71J52k943m73j020J038l203J912
1829g16L420k483m61l130l12k28j792o51J300J502J611k584m42O870L468r74L434
1812G832J599m544l716o23J60r87j943r70J462K707L01l060J366N899O216k336
1796I363o40o36q272m509l281K960J937K48N00k04Q58K452j683k540N31L685k613
1779a844o78K838P32P18p84k594M5J796K240J85J331j662k103k422P46p74%M287
$$ y = [-4024, 325, 3911, 1366, 241, 3511, 409, -3798, -2461, -2629, -2457, -616, -2176, -1590, 4204, 6425, 6157, 5838, 5664, 2052, -1385, 100, -849, 1353, 2333, 2262, 3239, 6207, 7384, 7473, 4456, 1032, 692, 617, -3117, -4783, -1867, -596, 655, -2745, -3280, 417, 3450, 3821, 3973, 1030, 557, -463, 575, -2628, -716, 2704, 221, -240, -3370, -3682, -3910, -5702, -6353, -5053, -3551, -1940, -4524, -4966, 1904, 5372, 4398, 7832, 9431, 4887, 1171, 548, 708, -279, -2222, -3192, -1730, 977, 1278, -1782, -416, 5483, 11699, 9363, 8723, 8087, -185, -4694, -7975, -5015, -3078, -2830, -2330, -2534, -1676, 776, -907, -3447, -2916, 769, -1844, -2522, 316, 1048, 1766, 982, -1612, -1567, 229, 2469, 2654, 3985, 2323, 220, -2202, -1456, -2230, -2230, 2057]
$$ [...]
##END NTUPLES=NMR SPECTRUM
##END=
