##TITLE=Analysis number 313829
Compound Code mo 01112
Book Reference 445/42/1
Project Code adrs
Chemist Name laurenf
##JCAMPDX= 6.0         $$ Bruker NMR JCAMP-DX V2.0
##DATA TYPE= NMR SPECTRUM
##DATA CLASS= NTUPLES
##ORIGIN= Bruker BioSpin GmbH
##OWNER= NMR
$$ XWIN-NMR		Version 3.5
$$ Fri Sep 23 09:30:42 2005 GMT Daylight Time (UT+1h)  MAYBRIDGE\NMR@NMR_250MHZ
##.OBSERVE FREQUENCY= 250.131544655141
##.OBSERVE NUCLEUS= ^1H
##.ACQUISITION MODE= SIMULTANEOUS (DQD)
##.ACQUISITION SCHEME= undefined
##.AVERAGES= 16
##.DIGITISER RES= 18
##SPECTROMETER/DATA SYSTEM= dpx250
##.PULSE SEQUENCE= zg30
##.SOLVENT NAME= DMSO
##.SHIFT REFERENCE= (INTERNAL, DMSO, 0, 16.522)
##AUDIT TRAIL= $$ (NUMBER, WHEN, WHO, WHERE, WHAT)
$$ ##TITLE= Audit trail, XWIN-NMR		Version 3.5
$$ ##JCAMPDX= 5.01
$$ ##ORIGIN= Bruker BioSpin GmbH
$$ ##OWNER= NMR
$$ C:\u/data/dgb/nmr/ADRS/9860/pdata/1/auditp.txt
$$ ##AUDIT TRAIL=  $$ (NUMBER, WHEN, WHO, WHERE, WHAT)
(   1,<2005-09-23 09:30:23.31 +100>,<MAYBRIDGE\NMR>,<NMR_250MHZ>,
      <created by zg, POWCHK disabled, PULCHK disabled
       configuration hash MD5:
       62 19 C7 07 E1 42 D1 B7 37 6C 3D D0 77 39 F9 E6
       data hash MD5: 64K
       74 7A 70 6F F9 37 81 2A 09 CA E6 4D 24 AD E4 FA>)
(   2,<2005-09-23 09:30:34.71 +100>,<MAYBRIDGE\NMR>,<NMR_250MHZ>,
      <Start of raw data processing
       ef LB = 0.3 FT_mod = 6 PKNL = 1 SI = 32K 
       data hash MD5: 32K
       E3 95 38 1F 84 57 C3 A0 35 9E 27 A9 5A D8 07 73>)
(   3,<2005-09-23 09:30:36.46 +100>,<MAYBRIDGE\NMR>,<NMR_250MHZ>,
      <apk 
       data hash MD5: 32K
       2D 72 6D 90 14 83 3D FC B8 78 D0 6D 6F 83 19 D4>)
(   4,<2005-09-23 09:30:37.22 +100>,<MAYBRIDGE\NMR>,<NMR_250MHZ>,
      <abs ABSG = 5 
       data hash MD5: 32K
       6F 43 54 E0 26 8A 2D 57 DC 89 C5 6A BB 1D 11 1E>)
$$ ##END=
$$ 
$$ hash MD5
$$ 47 5A DF 6C 18 D4 C5 7E EF 3D D5 22 2A E5 63 50
##$RELAX= 
##$RELAX= 
##$RELAX= 
##$RELAX= 
##$RELAX= 
##$RELAX= 
##$RELAX= 
$$ Bruker specific parameters
$$ --------------------------
##$DU= <C:\u>
##$EXPNO= 9860
##$NAME= <ADRS>
##$PROCNO= 1
##$TYPE= <nmr>
##$USER= <dgb>
##$AMP= (0..31)
100 100 100 100 100 100 100 100 100 100 100 100 100 100 100 100 100 100 
100 100 100 100 100 100 100 100 100 100 100 100 100 100 
##$AQSEQ= 0
##$AQ_mod= 3
##$AUNM= <au_zg>
##$AUTOPOS= <7 >
##$BF1= 250.13
##$BF2= 250.13
##$BF3= 250.13
##$BF4= 250.13
##$BF5= 500.13
##$BF6= 500.13
##$BF7= 500.13
##$BF8= 500.13
##$BYTORDA= 1
##$CFDGTYP= 0
##$CFRGTYP= 5
##$CHEMSTR= <none>
##$CNST= (0..31)
1 1 145 1 1 1 1 1 1 1 1 1 1 1 1 1 1 1 1 1 1 1 1 1 1 1 1 1 1 1 1 1 
##$CPDPRG= <>
##$CPDPRG1= <>
##$CPDPRG2= <>
##$CPDPRG3= <>
##$CPDPRG4= <mlev>
##$CPDPRG5= <mlev>
##$CPDPRG6= <mlev>
##$CPDPRG7= <mlev>
##$CPDPRG8= <mlev>
##$CPDPRGB= <>
##$CPDPRGT= <>
##$D= (0..31)
0 1 0 0 0 0 0 0 0 0.06 0 0 0 0 0 0 0.0002 0 0 0 0 0 0 0 0 0 0 0 0 0 0 
0 
##$DATE= 1127464222
##$DBL= (0..7)
120 120 120 120 120 120 120 120 
##$DBP= (0..7)
150 150 150 150 150 150 150 150 
##$DBP07= 0
##$DBPNAM0= <>
##$DBPNAM1= <>
$$ [...]
##$SUBNAM7= <"">
##$SUBNAM8= <"">
##$SUBNAM9= <"">
##$SW= 20.6930455092707
##$SWIBOX= (0..15)
0 0 3 0 0 0 0 0 0 0 0 0 0 0 0 0 
##$SW_h= 5175.983436853
##$TD= 65536
##$TD0= 1
##$TE= 295.16
##$TE2= 300
##$TE3= 300
##$TEG= 300
##$TL= (0..7)
0 120 120 120 120 120 120 120 
##$TP= (0..7)
150 150 150 150 150 150 150 150 
##$TP07= 0
##$TPNAME0= <>
##$TPNAME1= <>
##$TPNAME2= <>
##$TPNAME3= <>
##$TPNAME4= <>
##$TPNAME5= <>
##$TPNAME6= <>
##$TPNAME7= <>
##$TPOAL= (0..7)
0.5 0.5 0.5 0.5 0.5 0.5 0.5 0.5 
##$TPOFFS= (0..7)
0 0 0 0 0 0 0 0 
##$TUNHIN= 0
##$TUNHOUT= 0
##$TUNXOUT= 0
##$USERA1= <user>
##$USERA2= <user>
##$USERA3= <user>
##$USERA4= <user>
##$USERA5= <user>
##$V9= 5
##$VALIST= <valist>
##$VCLIST= <CCCCCCCCCCCCCCC>
##$VD= 0
##$VDLIST= <DDDDDDDDDDDDDDD>
##$VPLIST= <PPPPPPPPPPPPPPP>
##$VTLIST= <TTTTTTTTTTTTTTT>
##$WBST= 1024
##$WBSW= 4
##$XGAIN= (0..3)
0 0 0 0 
##$XL= 0
##$YL= 0
##$YMAX_a= 329836
##$YMIN_a= -247749
##$ZGOPTNS= <>
##$ZL1= 120
##$ZL2= 120
##$ZL3= 120
##$ZL4= 120
##$ABSF1= 16.522
##$ABSF2= -4.171173
##$ABSG= 5
##$ABSL= 3
##$ALPHA= 0
##$AQORDER= 0
##$ASSFAC= 0
##$ASSFACI= 0
##$ASSFACX= 0
##$ASSWID= 0
##$AUNMP= <proc_1d>
##$AZFE= 0.1
##$AZFW= 0.1
##$BCFW= 0
##$BC_mod= 0
##$BYTORDP= 0
##$COROFFS= 0
##$CY= 12.5
##$DATMOD= 1
##$DC= 0
##$DFILT= <>
##$DTYPP= 0
##$F1P= 14.0000005364418
##$F2P= -0.99999901652339
##$FCOR= 0.5
##$FTSIZE= 32768
##$FT_mod= 6
##$GAMMA= 0
##$GB= 0
##$INTBC= 1
##$INTSCL= 1
##$ISEN= 128
##$LB= 0.3
##$LEV0= 0
##$LPBIN= 0
##$MAXI= 10000
##$MC2= 0
##$MEAN= 0
##$ME_mod= 0
##$MI= 0
##$NCOEF= 0
##$NC_proc= -4
##$NLEV= 6
##$NOISF1= 0
##$NOISF2= 0
##$NSP= 0
##$NTH_PI= 0
##$NZP= 0
##$OFFSET= 16.522
##$PC= 1
##$PHC0= -84.80367
##$PHC1= 7.803927
##$PH_mod= 1
##$PKNL= yes
##$PPARMOD= 0
##$PSCAL= 4
##$PSIGN= 0
##$REVERSE= no
##$SF= 250.13
##$SI= 32768
##$SIGF1= 0
##$SIGF2= 0
##$SINO= 400
##$SIOLD= 32768
##$SREGLST= <1H.DMSO>
##$SSB= 0
##$STSI= 32768
##$STSR= 0
##$SW_p= 5175.98343685301
##$SYMM= 0
##$S_DEV= 0
##$TDeff= 65536
##$TDoff= 0
##$TI= <Analysis number 999999
Compound Code 99
Book Reference 9
Project Code 9>
##$TILT= no
##$TM1= 0
##$TM2= 0
##$TOPLEV= 0
##$USERP1= <user>
##$USERP2= <user>
##$USERP3= <user>
##$USERP4= <user>
##$USERP5= <user>
##$WDW= 1
##$XDIM= 32768
##$YMAX_p= 384378180
##$YMIN_p= -291778
$$ End of Bruker specific parameters
$$ ---------------------------------
##NTUPLES= NMR SPECTRUM
##VAR_NAME=  FREQUENCY,     SPECTRUM/REAL,   SPECTRUM/IMAG
##SYMBOL=    X,             R,               I
##VAR_TYPE=  INDEPENDENT,   DEPENDENT,       DEPENDENT
##VAR_FORM=  AFFN,          ASDF,            ASDF
##VAR_DIM=   32768,         32768,           32768
##UNITS=     HZ,            ARBITRARY UNITS, ARBITRARY UNITS
##FACTOR=    0.157963299565203, 1,           1
##FIRST=     4132.6476996994, 0,             0
##LAST=      -1043.33573715361, 0,           0
##MIN=       -1043.33573715361, -291778,     0
##MAX=       4132.6476996994, 384378180,     0
$$ Real data points
##PAGE= N=1
##DATA TABLE= (X++(R..R)), XYDATA
$$ [...]
25878d897m650K4725j3507l5061j0992l6463M7449J02352q2194n0319P9517K0188
25866C6148m4627L7341L5829j3990r122P816n9388q4050J0932l2867J9967M3792
25854e2219K8400p992q3625P295P9755k3494k7767M4851L5594P2733L1540q3640
25842B1431l4022l5228m3093j566O1068M0944p6592j22805J8431J4063Q4736N1026
25830b1607K5415l1712k4967l9467L3462Q0723N878K6336L2986n5706J6442j7786
25818B9997o9531Q06M9552K5242n6010k2036o5452q562K3295N8536L1925O7262
25806F5024q2723k0876M7032K3351l8960m2170L8100N2154l1758k8144J8174K039
25794A243K4351p266m9537K662j2730K7727K1139K1158n4336J0920k3661o3396
$$ y = [-4897, -9547, 15178, 1671, -33390, -44382, -80845, -33396, 68956, -13238, -63557, 15960, 36148, -8479, 28862, 64691, 50701, 41579, 49395, -9993, -94043, -83111, -115978, -96011, -52219, -23819, -31811, -115436, -108141, -28386, -51880, -79647, -34796, 798, 73531, 105071, 21431, -12591, -47819, -90912, -92478, -31410, 9534, -67058, -189863, -171432, -157369, -72633, -21607, 3808, -27904, -52871, -92338, -58876, 21847, 27725, 54061, 87047, 31341, 47783, 29997, -39534, -38728, 10824, 36066, -19944, -41980, -107432, -115994, -92699, -34163, -2238, 65024, -17699, -38575, 8457, 31808, -7152, -49322, -11222, 40932, 9174, -18970, -796, 1243, 25594, 18328, -31209, -28547, -41277, -13550, 7589, 28747, -25589, -14669, -38330, -101726]
25782a01726j9469M123k0328J801R6371N3354J2086L5462K5736J4447q6187j15995
25770a00325p9001n2708j7761J55664O9305K3166k2750m6383P34M1793K4484l5778
25758c9560J820K3335k2339j3156l4572q4311r5671K4105J21246M8267K0498P387
25746d2951P2265K6885l3870o4024o2050N5521J41688k6879K631N2055J5358q9796
25734D6833l5844J2523k74J3461J2890P0215M7921o7685p8999M3276l6766l1505
25722c954l4209j0573N0339p4469m8866L1699J2075J7003K1132N3424J5436k2302
25710F735j5164j6421J2913K695n7812m4310k6375M2987J7783J26658K8677n9886
25698A8480l0696j7212j2494Q3712L6662n3846M7283j3679P5435j9120j50135
$$ y = [-101726, -121195, -117072, -137400, -135599, -39228, 14126, 26212, 61674, 87410, 101857, 15670, -100325, -179326, -232034, -249795, -94131, -24826, -1660, -24410, -70793, -70059, -28266, -3782, -39560, -37740, -14405, -36744, -49900, -84472, -168783, -264454, -240349, -119103, -70836, -50338, -42951, 29314, 56199, 22329, -41695, -103745, -48224, 93464, 66585, 69216, 121271, 136629, 46833, 10989, 23512, 23238, 36699, 49589, 119804, 167725, 100040, 21041, 64317, 27551, -3954, -38163, -48736, 1603, -72866, -121732, -90033, -77958, -60955, -39823, 13601, 29037, 6735, -8429, -24850, -11937, -9242, -67054, -111364, -137739, -94752, -76969, 49689, 78366, 18480, -12216, -29428, -41922, 41790, 78452, 24606, 71889, 58210, 133645, 114525, -35610]
25687c5610j01400K8503J5102K3679j6754m566L4378L3748M1856L5362l314Q5721
25675A36705J8958q8779j06971j1953O8278o56l0019l7427K6261P6534j4184J7118
25663E3865l7284M9391l487j2253n6598n6241q1296R7533J13114r0830p1408n252
25651a00746L0459L6736J5860k230J5560O2461k7246L9646J5730p4752p4756q8759
25639a52037L2919k0583J2375K7148Q1652J1214Q844n9316o3877k1886o926M2290
25627a08183L7530O657P8765R3317j3601K5902m9203q3089N2954K6027n2478n6287
25615d1689M1536J4640K2424J0763j0507M7569j3654r0483q1640J15883K4238
25604C9080R431O5994P7732p3833o6623o3420r8700o211n743J7705O5135o278
$$ y = [-35610, -137010, -108507, -93405, -69726, -86480, -91046, -56668, -22920, 18936, 54298, 50984, 136705, 155663, 66884, -40087, -52040, 16238, 15582, -14437, -51864, -25603, 50931, 36747, 53865, 16581, 65972, 62485, 50232, -6366, -62607, -143903, -46370, 66744, -24086, -95494, -100746, -70287, -33551, -17691, -19921, -4361, 58100, 30854, 70500, 86230, 11478, -63278, -152037, -119118, -139701, -127326, -100178, -18526, -7312, 1532, -57784, -121661, -143547, -150473, -108183, -70653, -63996, 14769, 108086, 94485, 120387, 71184, -11905, 41049, 67076, 14598, -41689, -153, 14487, 36911, 47674, 37167, 84736, 71082, -19401, -101041, 14842, 39080, 48511, 114505, 192237, 118404, 51781, -11639, -110339, -116550, -122293, -104588, -39453, -45731]
25592d5731K6543K2688K6230N4427k2604O6572J8224o1499m6141l0069R8359O8973
25580A75972Q3118k846p2244M3873o9939r6687L6906N097N867o8314P1608R491
25568A21902j2821R635m4956k1682j3044l2757k9822M7044J2915J5297p5041j8373
25556d1703r5399L6193P0232K1823k325n6207q7990R771N4091L7805L5177J02544
25544H4012o9043m3675L9812N9917m59l5564K1388q8115j2769R92j5038J25671
25532F7129r402k6873l217J2156q3767P2751R1112j8466q4423j1608L87J1185
25520A6964m3041N783L076m3049l6772M141M2855Q6998K6728N7931m3657M3605
25508A21562K4595j04194j28257k6135M5632J0585j4103J7835L8138L7748M6052
$$ y = [-45731, -19188, 3500, 29730, 84157, 61553, 128125, 146349, 84850, 38709, 8640, 106999, 175972, 259090, 256244, 184000, 227873, 157934, 61247, 98153, 103250, 109117, 40803, 112411, 121902, 109081, 118716, 73760, 52078, 39034, 6277, -23545, 23499, 36414, 51711, -23330, -41703, -137102, -100909, -30677, -8854, -11179, -67386, -155376, -145605, -91514, -53709, -18532, 84012, 14969, -28706, 11106, 71023, 70564, 35000, 56388, -31727, -44496, -43504, -58542, 67129, 57727, 30854, 27637, 39793, -43974, 28777, 119889, 101423, 17000, 5392, 5779, 16964, -26077, -20294, -17218, -60267, -97039, -92898, -50043, 36955, 63683, 121614, 77957, 121562, 146157, 41963, -86294, -112429, -66797, -56212, -70315, -52480, -14342, 23406, 69458]
25497F9458J6654l2832o0196L3905O722j6191j7925P0072K5658m7397l4806K9085
25485D2207k4510M2069N4625o1818j7188O7990m1723p5640Q944j4380O2440k7250
25473A5766m1325k9077L4349j9474n4934J705L4454k139l2015j4251J70883Q6370
25461A50312k2807R70m4442m7695n3557p9553J6759J7939Q680j9541o002L3631
25449d5306M4231R2903J13367n1556j67741l9726p85m2156k3177N8437k0479M5190
25437c6798M7090L770m5697k3468k5712N8455J9468q7539M4868P9718J11849N1050
25425A97054o1043r9429J1092L3070n4744J5759J5301Q736p527J7197J9282L3145
25413A27893o7244j00707l239K2955o964J374P4642O4653k2173k0448m7612J0865
$$ y = [69458, 86112, 53280, -6916, 26989, 33711, 17520, -405, 69667, 95325, 47928, 13122, 42207, 17697, 59766, 114391, 52573, 35385, 103375, 61652, -13988, -5044, -19424, 43016, 15766, -25559, -54636, -20287, -39761, -94695, -92990, -58536, -60675, -92690, -106941, 63942, 150312, 127505, 128475, 84033, 36338, -17219, -96772, -80013, -62074, -53394, -72935, -78937, -45306, -1075, 91828, 205195, 153639, -14102, -53828, -54613, -96769, -119946, -61509, -81988, -36798, 10292, 14062, -31635, -55103, -80815, -22360, -2892, -90431, -45563, 34155, 146004, 197054, 136011, 36582, 47674, 80744, 26000, 41759, 57060, 65796, 58269, 75466, 94748, 127893, 60649, -40058, -43297, -20342, -27306, -25932, 48710, 113363, 91190, 70742, 23130, 33995]
25401C3995q0140q8163K3610J1686O60L5702K5471j1478m4539l9286L4590R2633
25389e259k060l1983N497K1124M5966q5504k8818n9033l8520k3068j3659Q645
25377b06672J671Q0473J00674Q215O4012j2868m5015J2827N7334K8934K2490j147
25365A10928J0274q702n0099n4054M4703O6220q4970p9233r5197l1239j7663L270
25353a85762K8657J8235r706L2223K5971k277P9898N2478N1155n760m0266n639
25341C9207o3120j3446M8774m7922O569j848m239n2699k6688K9224O3833M0179
25329A7824l5769J2854R924Q5941p0544m7518k2679L3975P2631M195p0589J3999
25317D244j3019l2095J8843J05559l5613m2357o5533k308R250M9807j4422n2346
$$ y = [33995, -46145, -134308, -110698, -99012, -98352, -62650, -37179, -48657, -93196, -132482, -97892, -5259, -7319, -39302, -33805, -12681, 33285, -52219, -81037, -140070, -178590, -201658, -215317, -206672, -205001, -124528, -23854, -15639, 48373, 35505, -9510, 3317, 60651, 89585, 112075, 110928, 121202, 112500, 62401, 8347, 53050, 119270, 34300, -44933, -140130, -171369, -189032, -185762, -157105, -138870, -148576, -116353, -90382, -92659, -12761, 39717, 90872, 85112, 44846, 39207, -23913, -37359, 11415, -36507, -29938, -31786, -36025, -88724, -115412, -86188, -22355, 17824, -17945, -5091, 4833, 90774, 20230, -27288, -49967, -15992, 56639, 60834, -9755, 4244, -8775, -40870, -22027, 83532, 47919, 5562, -59971, -62279, -53029, -3222, -17644, -69990]
25305f9990L0227N5994J2413L3749k1636J2049K6284l0056n4837M0860M0423k657
25293G2823l3965j8030j9772J2934Q893j7549j5377K2527N285J6739n9888j9178
25281d4558K5950L2066P2211L6916R2876o3551j09855K5124k8747o345m7262J0604
25269d571J07850j06361j6677J8752J617k1324j6327p501o1197K5156O4644K2475
25257F536m5457m8015n4017K06M3501L7153P9800K1268l3875P551j9517j9700
25245b4566k4928k6561K8453N4795P0349j0184j40509J9793L1557L8978k1474
25234d297l4909O7495o0123l8634m3566L186M9570l5040M8418O6435J0112l7671
25222i024q8882J1082R4056M7988J6626m462l0251O883O6729n2397j8101j4645
$$ y = [-69990, -39763, 16231, 28644, 62393, 40757, 52806, 79090, 49034, -5803, 35057, 75480, 72823, 38858, 20828, 1056, 13990, 22883, 5334, -10043, 12484, 17769, 34508, -25380, -44558, -18608, 13458, 85669, 122585, 215461, 151910, 42055, 67179, 38432, 32087, -15175, -4571, 103279, -3082, -19759, -1007, 610, -20714, -37041, -44542, -105739, -80583, -15939, 6536, -38921, -86936, -140953, -140747, -97246, -60093, 19707, 40975, 7100, 14651, -4866, -24566, -49494, -76055, -47602, 7193, 77542, 67358, -73151, -53358, -21801, 17177, -4297, -39206, 28289, -31834, -70468, -114034, -110848, -61278, -96318, -47900, 18535, 28647, -9024, -97906, -86824, 7232, 55220, 71846, 67384, 37133, 44016, 110745, 58348, 40247, 25602]
25210B5602m3079j215l0846L9048Q0790J5708l412N0801j1266l2983L383l5304
25198E7227L3742P719m2986k9673M4417O0449k4437m789K555l4915k4885P198
25186E1622m8343k8166p7139R694L4561K0914l2185l9991N3211o0754k9465N7130
25174h8911N7166M1827M2981J18q615M1561J4017K4066K5827n3960L0334N2705
25162A79116R187n1300q5592o200l4365m1214l0398l015j04219J3798M8271k2149
25150a28080j3675M1631M5134J1189L9632j0486q8990L0717j0978K3513l8532
25139i8925l2394J05619M9550K2323P3515O5480q0693j18004j7312M9021l5246
25128a7066L1812l6454m7375L7262j9289p424J5377O7566M8900K427j8200J9442
$$ y = [25602, -17477, -18692, -49538, -10490, 70300, 86008, 82596, 133397, 122131, 89148, 92531, 57227, 90969, 98688, 55702, 26029, 70446, 130895, 106458, 101669, 104224, 69309, 44424, 51622, 3279, -24887, -102026, -92332, -57771, -36857, -69042, -109033, -55822, -116576, -146041, -88911, -31745, 10082, 53063, 53181, 44566, 86127, 100144, 124210, 150037, 96077, 126411, 179116, 188303, 137003, 51411, 45211, 10846, -30368, -60766, -63781, -168000, -154202, -105931, -128080, -141755, -100124, -54990, -43801, -4169, -14655, -103645, -72928, -83906, -60393, -98925, -131319, -25700, 23850, 46173, 119688, 185168, 104475, -13529, -30841, 18180, -17066, 14746, -21708, -69083, -31821, -51110, -58534, -43157, 24409, 73309, 75736, 57536, 76978]
25116G6978k7923M8495P3211r4421j28749k5355k4710l6289L4104M7094k5278
25105h2843q218O0924J02345O1438O66Q541j22048m9965k86j0306N5210L7026
25093E2484p0616L4178N1099J3447L947j0217o9807p3037r849J5349N3004M2145
25081C2127l3054J830O9893J3168j0417q4882J5605O5448j3962r1256p6618m7135
25069a59253K2052O4756N0781K20m4301P8154K2571O076m8205l4216O2224Q293
25057B9152J9037K1126N7986k3579k3785m281O9765j0616m9034q7152j53155l9874
25045a94410P4780R8205J1818o06l4435l1421R0225Q765O6835N232j57572n303
25033f7887Q4445k0402m6798J8074j980J9985K36O9678q674p8348K8401j3817
$$ y = [76978, 49055, 97550, 170761, 76340, -52409, -77764, -102474, -138763, -104659, -57565, -82843, -91061, -30137, 72208, 133646, 134312, 142853, 20805, -29160, -29446, -39752, 15458, 52484, -18132, 16046, 67145, 80592, 84539, 74322, 4515, -68522, -78371, -63022, -10018, 32127, -927, 903, 70796, 83964, 73547, -11335, 4270, 69718, 55756, -35500, -112118, -159253, -137201, -72445, -21664, -21444, -65745, 12409, 34980, 41056, -7149, -41365, 20859, 29152, 48189, 69315, 127301, 103722, 79937, 75656, 145421, 134805, 85771, -1381, -154536, -194410, -119630, -21425, -9607, -10213, -44648, -76069, 14156, 22921, 89756, 94988, -62584, -67887, 16558, -3844, -50642, -32568, -34548, -14563, -14327, 55351, 46677, -31671, -3270, -17087]
25021a7087N878O8368N5106l6249q0973K731M0170L9703J0971l404L608j07636
25009a8814k7943O875p9385J2369J05579N3447j1672p10o4776m2158K6291M0495
24997d02j5126o6702j8842m3628l4960N739K7133L1103J9663J9298M5263K692
24985b8769j03643r0735n097O8279N1806M3913l9541J8028O1977J2413j5795K0158
24973g006J0880m8512N2365K3867K5487K1502p50k1592N7915k3287o6049j4831
24961I989N8911%n5139n9698l6426N8599L9978m4250p0052K9299O4486m8253l6178
24948h8734K4469O1098K7947N962l6795o0321K0829N3382N2591N0139k4183p357
24936G9027l1417q1045j9459K315o0588j524N6476J17921L5384N212k7256q6367
$$ y = [-17087, -11209, 57159, 112265, 76016, -4957, -2226, 37944, 77647, 88618, 85214, 88822, -18814, -46757, -39882, -119267, -106898, -1319, 52128, 40456, 39746, -25030, -67188, -40897, -402, -15528, -82230, -101072, -144700, -179660, -173921, -146788, -115685, -96022, -76724, -31461, -28769, -132412, -223147, -228244, -159965, -108159, -64246, -103787, -85759, -23782, -11369, -27164, -7006, 3874, -44638, 7727, 31594, 57081, 78583, 77833, 56241, 114156, 90869, 24820, 9989, 68900, 68900, 13761, -45937, -82363, -23764, 16214, -28036, -98088, -68789, -4303, -52556, -88734, -64265, -3167, 24780, 30742, -6053, -66374, -45545, 7837, 60428, 110567, 86384, 79027, 47610, -33435, -52894, -50579, -111167, -112691, -56215, 61706, 97090, 102302, 75046, -11321]
24924a1321j1309M883J9813M0273k9000M5804L536l4190R716M625r7226o2114
24912a16510j6948N4332j3534o1430N5546J01317k5349o260p3296j2399J08187
24901f344J8047m6260M9170n2926R245J0352l3493m7916K8148J4463P0956k010
24889A1432n9738k4839j6214m673j3055N9882J9119M4141P1268j1879L833K2719
24877A01996K0184Q3682j09397l035J0046L8608r582r3093n0257j9861o8751p772
24865a07232N8043j4422n3137m0N2711K2218J0296J7195N132o4396m2241N3310
24853f2563J8992O8812M3241L4074L9410p6001p7678o3734M4372Q6976J5950J4121
24841H5972J3396j00517J8887K732n4087k397N0093N4459k4060L180L0880R119
$$ y = [-11321, -22630, -17747, 2066, 42339, 13339, 59143, 62679, 28489, 38205, 42830, -54396, -116510, -133458, -79126, -92660, -154090, -98544, 2773, -22576, -28836, -102132, -114531, -6344, 11703, -34557, 14613, -38313, -29068, -18716, -52209, -100125, -71977, -57514, 13442, 11432, -48306, -73145, -89359, -94032, -107087, -47205, -28086, 16055, 87323, 75444, 79277, 101996, 122180, 205862, 96465, 93430, 103476, 142084, 132502, 39409, -10848, -30709, -99460, -107232, -49189, -63611, -116748, -116788, -64077, -41859, -31563, -14368, -9236, -73632, -115873, -62563, -43571, 25241, 68482, 102556, 141966, 65965, -11713, -75447, -31075, 55901, 71851, 85972, 99368, -1149, 17738, 20470, -33617, -36014, 14079, 68538, 44478, 47658, 78538, 87657]
24829H7657L5391o3516Q726M0836k8656j4003P1272o521o743m0985m4534m3033
24817d109o6316l7659k8154L9655O4339J2602l7324L9560P6282j1312j031N510
24805E2043K7520r4552k5620o0942N3226O9699L1282O2062k4537m0881n6978J8033
24793A0355j8464K439j6758j5513p015k8905O575l2118K3286P4318l446K2435
24781A7189k4774L325J9728o821J9519n4188l5593k1435L2736Q724m4309k8694
24769a14593M2231J04043j072J4677R056l2598p494J2028l3105R922J9487m1648
24757a9066J3829l8022Q404O2366l2037k7723j5979k0423J1739n519J6249O7028
24745B0846M5820J995j16446m3301M8109m3812J0266k231J32331J003N285j3963
$$ y = [87657, 123048, 59532, 68258, 109094, 80438, 66435, 137707, 131186, 124443, 83458, 38924, -4109, -70425, -108084, -136238, -96583, -32244, -19642, -56966, -17406, 58876, 47564, 46533, 52043, 79563, -14989, -40609, -101551, -48325, 21374, 52656, 114718, 90181, 49300, -7678, 10355, -8109, -5670, -22428, -37941, -44956, -73861, -67286, -99404, -76118, -1800, -5246, 17189, -7585, -4260, 15468, 8647, 28166, -26022, -61615, -83050, -50314, -41590, -85899, -114593, -72362, 31681, 30609, 45286, 54342, 21744, 14250, 26278, -6827, 3095, 22582, -19066, -5237, -43259, -34855, 27511, -4526, -32249, -48228, -68651, -56912, -62431, -46182, 20846, 66666, 68661, -47785, -91086, -42977, -86789, -76523, -78754, 53577, 54580, 59865, 45902]
24733D5902l2051Q7771k6334k6969J5180L4375m390p3048n4894N1792J3060m3168
24721a2774Q6115J3686j01791o660k0309j4801P2040k973j7590p1439j4906K8778
24709f2624J6007K7477K9636k2424n4407j2769q314k0677L4330L8830M6604m2733
24697c1064n0542n710J14333P0595j4342k2508o2928n409M5066j07038o176l9201
24685a14924m579K5561j7516Q4989l2703j5018o1550O0635L1250l9619N0229N9274
24673B6029k7468J9485m7261K6906N0451j09081l317k6753K0099m2335k6503L0192
24661a09556N9410K4987m7466m1873l2461K0383N6834O7922l7985k0892J973j294
24649f0018J7803N6837J57997L2230o8980r6743q5928p7218q612K3853L2647K374
$$ y = [45902, 13851, 101622, 75288, 48319, 63499, 97874, 93484, 20436, -34458, 17334, 30394, -12774, 73341, 87027, -14764, -21424, -41733, -56534, 15506, 12533, -5057, -76496, -91402, -62624, -46617, -19140, 10496, -11928, -66335, -79104, -87418, -108095, -73765, -34935, 11669, -31064, -81606, -87316, 27017, 97612, 83270, 60762, -2166, -7575, 37491, -69547, -75723, -114924, -119503, -93942, -111458, -26469, -59172, -74190, -135740, -75105, -43855, -83474, -33245, 26029, -1439, 18046, -29215, -2309, 48142, -60939, -64256, -91009, -70910, -113245, -139748, -109556, -50146, -25159, -72625, -114498, -146959, -126576, -69742, -1820, -39805, -60697, -58724, -60018, -42215, 14622, 172619, 204849, 135869, 39126, -46802, -124020, -132632, -108779, -76132, -73758]
24637g3758O2177R8094j3498p9430K0156M3019l3790l6210N2703N4258l2606k3403
24625C7712k4005M1570k7720m2740q5860l9188R7362j9756m76l2955n2603M4297
24613a04362O2203L1323k2605p6092K5484J8382j09099J4183R3597l3119p646
24602a07751M2823N5411N5453L3852j5320j7170m9880N970o8690L9042J29961
24591A03701J8885n3404p3019l439m3607J7098M0050m1760O2689N0562m4901p6338
24579d3483o048L5818M8024M4877j2011l5253j01739j0490p903L7271L3693j4762
24567c2006J0421J8358p3433j4073N4683M7777Q1623n109n0840l8421L4894m7429
24555a3555L6289N7368n4403J7313M0309o6855k9268O716P81q287J2336r030l7827
$$ y = [-73758, -11581, 86513, 73015, -6415, 13741, 56760, 22970, -13240, 39463, 93721, 61115, 37712, 13707, 55277, 27557, -15183, -101043, -140231, -42869, -62625, -63101, -96056, -148659, -104362, -42159, -10836, -33441, -109533, -84049, -65667, -174766, -160583, -66986, -100105, -107751, -64928, -9517, 45936, 79788, 64468, 47298, -2582, 3388, -65302, -26260, 103701, 122586, 69182, -3837, -7276, -50883, -33785, 6265, -35495, 27194, 77756, 32855, -43483, -49531, -13713, 34311, 79188, 67177, 31924, -69815, -80305, -88208, -50937, -17244, -32006, -21585, -3227, -76660, -90733, -36050, 11727, 93350, 88241, 37401, -1020, 33874, -13555, 22734, 80102, 25699, 43012, 83321, 16466, -12802, -6086, -5305, -13592, -1256, -10286, -48113]
24542d8113m1914r0200k7793L1913R4676j0666l179P3194O8618Q8136L5855n0695
24530A19832o9803j17228l6639J5919K6252N2413l9710o7974M2657N7298k2823
24519c9806J5941M4545k6184q795L1745J0258K5168r053r3730P4477R5078K2639
24507A42283p5908L219j9657M7429p7139m5740L2790M6735m7063K9940J08482
24496A45371M0015q3918o5127M0393l3019p8355k2362N9570j5021l0533j6863
24485e9849j00604k6938P5450P3728P5092L8920l0209j7341J01145q192m0767
24474H0435j1362K4509n8452n7165o5274k1969m842K3597J01434N8830o351r1397
24462b8007p999m8195N9814J2853m7612m0437L5615O0251J029l3843M8756o9996
$$ y = [-48113, -90027, -180227, -208020, -176107, -81431, -92097, -95276, -22082, 46536, 134672, 170527, 119832, 50029, -67199, -103838, -87919, -61667, -9254, -48964, -116938, -74281, -16983, -39806, -23865, 20680, -5504, -14299, 17446, 27704, 52872, 43819, -49911, 24566, 119644, 142283, 66375, 69594, 49937, 97366, 20227, -25513, 7277, 54012, 6949, 36889, 145371, 185386, 101468, 36341, 76734, 43715, -34640, -57002, 2568, -12453, -42986, -59849, -160453, -187391, -111941, -38213, 36879, 75799, 45590, 28249, 129394, 121202, 80435, 69073, 93582, 35130, -22035, -87309, -109278, -114120, -90523, 10911, 69741, 63390, -28007, -36006, -84201, -24387, -11534, -59146, -99583, -63968, -3717, -2688, -36531, 12225, -57771]
24450e7771L2498J09774L5190M2815p7271p7029K3826j3832p4680j8404O1602
24439a3282J7054l5428M6918M4842p6544o4833o6026K4925R9688j7082n410L7223
24427g955j1597J5777M0927m7426p9505M7175O8326K0313L8832o2999k7471N7415
24415E1812k9297o1666j7522o087o4341l9180N5315P3755K3196k5874l329R3669
24403E0451J4206k8925j332K0157Q091L468N3520L1328n3242j17674l3361N6179
24391B866l6380m4055J6385N8035N2091J8090o5806o1865P8466k9506k9474n7775
24379i8928l1159J5712M2163j4848l8731K1116J788L2142J8710k5948k0998J8469
24367h0512J4843J9619L545j612j2335L449n5638J9082J9814K7545j6080m8621
$$ y = [-57771, -25273, 84501, 119691, 162506, 85235, 8206, 32032, 18200, -56480, -74884, -13282, 3772, -31656, 15262, 60104, -16440, -81273, -147299, -122374, -22686, -39768, -45178, -7955, -19552, -3775, 37152, -10274, -89779, -42604, 25722, 46035, 84867, 21868, -5603, 51812, 22515, -39151, -56673, -62760, -127101, -166281, -110966, -37211, -14015, -39889, -43218, 50451, 64657, 35732, 34400, 54557, 62648, 66116, 119636, 150964, 97722, -19952, -53313, 2866, -33514, -77569, -61184, -3149, 48942, 67032, 1226, -60639, 17827, -11679, -41153, -98928, -130087, -114375, -72212, -87060, -125791, -104675, -102887, -70745, -52035, -77983, -98981, -80512, -65669, -46050, -42505, -44117, -56452, -53003, -108641, -89559, -69745, -42200, -58280, -106901]
24355a06901o8098k0901N1780L2029M7133K4876L4133R619n8940k739M1161K4920
24343H072m4619K4057M2888N155J051j791J419k7934k1129l1716m7371m7164O2766
24330g6316P655Q9022R6876Q2789j12600q0764k647k5824r2789m2234P5669L1300
24318d9863O0195N6346M9370l4018n2553r4395p3474j1969l6692N5951K1484K0135
24306h9483Q6292N0922r9721l7425m949Q6410K811n2883K5977P3042k4640l804
24294A2549M4319o383l6447J0599J0092l5073Q504M67n0276N0194J03185M9204
24282A60934J2911K3164m7135o1855j8349o1306k7273N6523m9720q8052O4576
24271c5582J7777L8617k95k121Q832l4283j3905N971j195M522j5087q1605n2115
$$ y = [-106901, -174999, -195900, -144120, -112091, -64958, -40082, -5949, 3670, -55270, -58009, -16848, 8072, -36547, -12490, 30398, 35553, 36604, 34813, 36232, 8298, -12831, -44547, -91918, -139082, -76316, -68661, 20361, 117237, 200026, 87426, 6662, 4015, -21809, -114598, -156832, -81163, -49863, 10332, 66678, 116048, 82030, 29477, -64918, -138392, -150361, -187053, -131102, -109618, -89483, -3191, 47731, -51990, -89415, -94364, -7954, -5143, -58026, -32049, 40993, 16353, 12549, 56868, 50485, 14038, 24637, 34729, -344, 8160, 8627, -41649, 8545, 111730, 160934, 173845, 197009, 149874, 88019, 69670, 8364, -18909, 37614, -12106, -100158, -35582, -17805, 20812, 20517, 18396, 27228, -7055, -20960, -14989, -16184, -11662, -26749, -108354, -160469]
24258a60469j7143R0697O3016L3763O941j07543L1038n621J8187J3475j46518
24247a80177n0189M6308O2535Q4003o3022j2962P469L5223K8648L8978Q686q1596
24235g6096R974k2418J1885l0787o0130j2585m3371M5610Q7436J422K739M807
24223h1514O1925M3382r126Q3133j0455l2625L5937J507R833k11r977q2528k6671
24210a7390J03656K4380p1118J3249N200j0700k9108l3445j9234J6303J5738K075
24198c94O385m614n9845j5830j1897R497P0309L7542l1565N6991J4408j6735l5139
24185A9113R602n9580q5313L0118N7037o247p500m2503k1613J03961N9922o501
24173E0496L7279k0541n8166p228O5873k4624M1592L6004M776j0438j8191o7329
$$ y = [-160469, -177612, -86915, -23899, 9864, 16805, -90738, -59700, -65321, -47134, -33659, -180177, -230366, -184058, -121523, -37520, -100542, -113504, -106035, -70812, -42164, -3186, 5500, -76096, -66122, -88540, -76655, -107442, -167572, -180157, -223528, -177918, -90482, -89060, -86321, -81514, -19589, 23793, 14667, 97800, 87345, 54720, 90657, 92164, 101997, 101786, 91809, 9281, -17390, 86266, 110646, 39528, 52777, 57977, 47277, 18169, -15276, -34510, -18207, -2469, -394, 5991, 1377, -58468, -74298, -86195, -76698, -6389, 31153, -412, 56579, 70987, 54252, 19113, 28715, -30865, -116178, -86060, -29023, -35270, -42770, -85273, -106886, -2925, 56997, 50496, 87775, 67234, 9068, 1840, 67713, 43089, 84681, 120685, 125461, 115023, 96832, 29503]
24161B9503l422m5960o2240k0137n154M5979M7895n242k6184L7584j6582q3582
24149a07542k1945l6795M6800J6278n1311P6055j2558J0886L9920j3825n2183
24138a06220J3622N7045J9682p7193k8814J859M4933m5681m4982J34746Q8151
24127E7148R225p7320k7273K7159k0808J2654j787k6452j9469L4287Q1773m01
24115D8736m7049J1185J5529k2652M1000P033j5832q8528K2322Q613O5607o6843
24103b0879p5153j4483Q994Q1275J7065k9150p7472O2643P3122K0152J7692o8644
24091d838J9352L4061m660m8954k7002m2346p5893Q1901R9818K660j7067l5682
24079a8650l0404r8976l012J8262J5071k2910L1748O3304L8280m751l5307p937
$$ y = [29503, 26081, -19879, -82119, -102256, -107410, -61431, -13536, -18778, -44962, -7378, -23960, -107542, -129487, -166282, -119482, -103204, -154515, -78460, -91018, -80132, -40212, -54037, -106220, -92598, -35553, -15871, -93064, -121878, -120019, -75086, -120767, -165749, -31003, 57148, 66373, -10947, -38220, -11061, -31869, -19215, -21002, -47454, -66923, -32636, 49137, 48736, 1687, 12872, 28401, 5749, 46749, 53782, 37950, -50578, -28256, -19643, 45964, -20879, -96032, -110515, -101521, -20246, -3181, -32331, -109803, -47160, 25962, 46114, 63806, -4838, 14514, 48575, 43915, -5039, -32041, -74387, -150280, -68379, 31439, 34099, 17032, -18650, -49054, -148030, -151042, -132780, -117709, -140619, -108871, -45567, -7287, -12038, -47345, -55282]
24067e5282l6088P911O7335R9741n2734k3104j5361J1907k7001n588j4373K4158
24055a8479J0354j2836q9456p241R6133K4639q5809j7101Q6391o3299M4706O5350
24043C3352q4306j12138k3214K0380L0523J1103P1614R545m4209l2845N8419Q4849
24031B3073O6482J3672k5258m6580o4170K1696q6466j13275Q0689N3584q9062
24020a65615J697P9754L7729N0925L0976k2557k1071k9436R3794m767p8871r808
24008c7250k7414k2964J9207J23257k1235J6104J5673k846k890J2079n0177J876
23996B3420L5721J8105k0316q9837N4669N1168k8743M4978J0222q9952n8943P1099
23984B1591J01630L6279n5263J5889Q5413k8399J5159j4211j12463o6605q5879
$$ y = [-55282, -91370, -83459, -16124, 83617, 30883, 7779, -7582, 4325, -22676, -28264, -42637, -18479, -8125, -20961, -110417, -117658, -21525, 3114, -82695, -99796, -13405, -76704, -31998, 33352, -50954, -163092, -186306, -165926, -135403, -124300, -52686, -43141, -87350, -120195, -61776, 23073, 89555, 103227, 77969, 31389, -32781, -11085, -97551, -210826, -130137, -76553, -165615, -163918, -84164, -46435, 4490, 35466, 12909, -8162, -37598, 56196, 51429, -27442, -37250, -64664, -87628, -68421, 54836, 33601, 49705, 65378, 62532, 59642, 71721, 21544, 23420, 59141, 77246, 56930, -32907, 21762, 72930, 44187, 89165, 99387, 9435, -49508, 21591, 123221, 159500, 104237, 120126, 205539, 177140, 192299, 178088, 65625, -980, -86859]
23973h6859j3170J21478K1579l4012j3287o976n4484q4620J5514k4567N2412J49332
23961D2340R7036j11646j58389q8400m033k190M7462l8369P6975P4159K6226N4468
23949A5639m258L0817J7436m9752l5701L7451n5426L312L5839l1598k2638L2091
23937b6788L7936J5823p030O4618K4727m7544l8699N326n0822l372J5737q30j4488
23924b5406l8865k4515n501p894n5M7047P898m1534N3804L8310l2174p3290J8581
23911h3594N6198N9998j4012m8773L387j0048k3119Q1808j2601j5805L0962o9058
23899d4657o901L013k0449J0936M7847M7357K1331K3879m7457n9671k1499L3826
23887a2445n0091j0655M3809k7455k4678J836j3696l8017L9818Q0563j6244n328
$$ y = [-86859, -100029, 21449, 43028, 9016, -4271, -11247, -65731, -150351, -134837, -159404, -106992, 42340, 139376, 27730, -130659, -219059, -223092, -225282, -177820, -216189, -139214, -65055, -38829, 15639, 11381, 42198, 59634, 9882, -25819, 11632, -43794, -40482, -4643, -36241, -58879, -26788, 11148, 26971, 19941, 84559, 109286, 61742, 23043, 28369, -22453, -25825, -10088, -10918, -25406, -64271, -88786, -94287, -102181, -102236, -55189, -47291, -88825, -35021, 3289, -28885, -102175, -83594, -27396, 32602, 18590, -30183, -26796, -36844, -59963, 21845, 9244, -6561, 24401, -44657, -51558, -48545, -68994, -58058, -10211, 37146, 58477, 82356, 34899, -24772, -46271, -12445, -62536, -73191, -29382, -56837, -81515, -79679, -93375, -131392, -91574, -11011, -27255, -32583]
23875c2583K0830N5630L7364l3763m2608L1600J2848m9597K3538R444o6690Q038
23863b5949k0486q7264M6582R9794P5614l4643n9211o7618L5386j9680N1811J44528
23851A38864N5323q8849j02862J5781j9103k7687j153K7102N2168l3560J0873
23840B6897n8817o0313M3710k0632O636M5524m3325k0719k5616k2283O714P763
23828a14461Q8281J7162K2845m7907p2394K2705L5770M896p045p953j5301p2716
23816a46118M8385R17L3790l1644m637M3093M7239P9258M5328K1778n2581L5546
23804A20354J2127o7442L175k3528p0835m3758l4374j4605Q8398K2990L6008P0522
23792I9032j9553l0100M8374L5678l7735q9206r3779j9940J19128J10445k2452
$$ y = [-32583, -11753, 43877, 81241, 47478, 4870, 36470, 49318, -279, 23259, 32703, -33987, -25949, -46435, -133699, -87117, 12677, 88291, 53648, -5563, -73181, -37795, -57475, -5664, 138864, 194187, 105338, 2476, 18257, -846, -28533, -29686, -2584, 49584, 16024, 26897, -31920, -92233, -48523, -69155, -62519, -16995, -60320, -81039, -106655, -128938, -122224, -114461, -26180, -9018, 13827, -34080, -106474, -83769, -47999, -43103, -50148, -58101, -73402, -146118, -97733, -96816, -63026, -94670, -99307, -56214, -8975, 70283, 115611, 137389, 84808, 120354, 132481, 65039, 68214, 44686, -26149, -69907, -104281, -118886, -30488, -7498, 28510, 99032, 79479, 49379, 97753, 133431, 95696, 6490, -87289, -107229, 11899, 122344, 99892]
23781I9892r9362q8252p0717J9199P5677J7132l9476J220K1705P2837J2684O1000
23769H3539L8006k8656M317j7735p9009p4332J1977n5339L7644Q1084P1436J1735
23757H4667m6291j11489J224J7050L9584j631m7554K207M2264l3761j3036O2025
23745d741M9520k2753P6411J3764l536l064o7192m6539j9731N6138O548m3304
23733h479Q310L1726o7871n85j7347o728L7393K6152O8130n2002j10356K2471
23721f9186L6326m7979Q51K8928j4638l3397K9498k6191l311N796J622M643P7476
23708i562R1334q4397m9533K8905o0585p2387N9777N3372l3338L5598j8174k1685
23696h0675l7442J702Q9182R745L0971m865k6473j7225J4866k5485M3633M3306
$$ y = [99892, 530, -87722, -158439, -139240, -63563, -46431, -85907, -84687, -62982, 9855, 22539, 83539, 121545, 92889, 97206, 79471, 462, -73870, -61893, -117232, -79588, 1496, 72932, 84667, 38376, -73113, -71889, -54839, -15255, -16886, -64440, -62233, -19969, -53730, -66766, -4741, 44779, 22026, 98437, 112201, 108665, 105601, 38409, -8130, -27861, 28277, 34825, -8479, -169, 31557, -36314, -36899, -54246, -60974, -23581, 2571, 70701, 18699, -91657, -69186, -32860, -80839, -79988, -51060, -65698, -99095, -69597, -95788, -99099, -93303, -91681, -87038, -9562, 81772, -2625, -52158, -23253, -83838, -156225, -96448, -43076, -76414, -40816, -58990, -80675, -118117, -116415, -27233, -17488, 13483, 8618, -17855, -35080, -20214, -45699, -2066, 41240]
23684D1240m9025N862M3263K5395p2525o406Q4593L2792k0079m7403Q4132j8603
23672A03236j25481j58289n148N6295M1586N9470Q3841R7476L1466o2982n4918
23661F6552J80J4715j1861j2622j7279J349Q939P3854L0506p8408l2400k6961
23649A6564j3730L0201K9597k5524L458j1120o3477K9517J2943J8668j1402m2722
23637b7027p8674r094M864j8926L9935Q384j4039J6046j9286K8662K8818p3550
23625a13887l1646N7120q2305J2041N0456P7768k1219l6197M3003l3828M561m4191
23613a18324l9896O9762N0782M6325M5548J5283k3369K7883o3418j34133j9423
23602a42980N5729N04Q233L8366J8854j1068l3208K3958K5910K920o959k3668
$$ y = [41240, -7785, -1923, 41340, 66735, -5790, -12196, 72397, 105189, 85110, 37707, 121839, 103236, -22245, -180534, -185682, -129387, -87801, -28331, 55510, 152986, 184452, 121470, 66552, 66732, 81447, 69586, 56964, 39685, 41034, 49973, 123827, 154333, 75925, 43525, 16564, 2834, 33035, 62632, 37108, 40566, 29446, -34031, -4514, 8429, 27097, 15695, -27027, -105701, -114795, -109931, -128857, -88922, -80538, -94577, -78531, -97817, -69155, -40337, -113887, -145533, -88413, -170718, -158677, -108221, -30453, -51672, -87869, -44866, -78694, -74133, -118324, -158220, -88458, -37676, 8649, 54197, 69480, 46111, 73994, 10576, -123557, -142980, -87251, -86747, -78514, -40148, -21294, -32362, -65570, -41612, -15702, -12782, -19741, -43409]
23590d3409k4816N7285J9306o0143j196M0359R4856m2308p3595j5885M9145M0708
23578D0307K0974l2673K88l1233q8395O3705J02646r859j14816K3300R8110K069
23566G4423q0351l9650j4388p7397p131J10032J17399K6193n6795l4853O1794
23555G9276L4584n5958K3708P6284L2624m1405j19403q2360o4343l4313J2780
23544a38526j6681K7764L5298N7442L9799j79o5066N6566k5069m2563J0567L6211
23532b4437O1486l423L241P9109k9802o7358m1932N590N2756l0162m2652L4537
23520c047P5546M9655J1040m669o0531p4036o5503j07781J7466Q7267K1613k4630
23508g7610Q9166k2820m9405l2318j7330p542J5244J02175L3731n8411m9283O7205
$$ y = [-43409, -68225, -10940, 8366, -51777, -52973, -12614, 82242, 39934, -33661, -49546, -401, 40307, 61281, 28608, 28896, -2337, -90732, -27027, 75619, 65760, -49056, -25756, 72354, 74423, -5928, -45578, -59966, -137363, -144494, -34462, 82937, 109130, 52335, 17482, 79276, 113860, 57902, 81610, 157894, 190518, 149113, 29710, -52650, -116993, -151306, -138526, -155207, -127443, -92145, -34703, 5096, 4917, -60149, -3583, -28652, -71215, -60648, -24437, 37049, 33626, 36867, 115976, 86174, 18816, -23116, -17526, 35230, 5068, -37584, -3047, 72499, 122154, 133194, 128525, 67994, -6042, -71545, -179326, -161860, -74593, -52980, -77610, 11556, -11264, -60669, -92987, -110317, -117859, -102615, -440, 33291, -25120, -74403, -7198]
23496g198m1619J4629J2280m4199r4228q162J00368M9221N802L4543O6223O779
23484I4439j04167j61907J0931O4510J9037j1489P4077Q2913j5998j9950r8884
23473f6488m4085k3010m2117K335L0577R6453J5106n1895j0786J0387k4864M5088
23461f3299n781m017p018j3192q303J5147K8970R768M1628K1637J1813j1820K0351
23448C5884n1595L3434M9688m6057n3412L5666L8326k3560j6119j1575n3256k6112
23436h8688J3042O228m0573O1032K6969m8382N2417j6642o7452M0753P1524j4539
23424d311k0997M1631N4172K9541k6377l9821n6611O7262n814l4967J21541P1749
23412A96998n9430o0420l9158q2407K5308l1669k6774J26584O9703P761m4651
$$ y = [-7198, -48817, -34188, -21908, -66107, -160335, -168497, -68129, -18908, -13106, 21437, 87660, 94439, -9728, -171635, -160704, -96194, -77157, -88646, -14569, 68344, 52346, 32396, -66488, -110573, -133583, -175700, -173365, -142788, -46335, -31229, -83124, -93910, -83523, -108387, -63299, -69080, -73097, -80115, -93307, -101610, -86463, -57493, -47725, -6097, 15540, 27353, 15533, 35884, -15711, 17723, 67411, 21354, -32058, 3608, 41934, 18374, 2255, -9320, -62576, -88688, -75646, -69418, -109991, -48959, -21990, -70372, -17955, -34597, -102049, -61296, 10228, -4311, -25308, 16323, 70495, 100036, 73659, 33838, -22773, 44489, 38675, 3708, 125249, 196998, 137568, 77148, 37990, -44417, -19109, -50778, -77552, 49032, 118735, 126496, 81845]
23401H1845J0123J12139R3811p9847j10981o4131J9331p682l1009k7792K6539
23390B2346J5594j4426r7872l4317N4729L710j6380K0277L2027j7573o2740K415
23378i2210M9949K3974l3170K1141m396k936L4572N8072m4665R84M6783k2341
23366C5757m0429N3982K4538k1893k8415o7638K6454j7692N6227m307l5282M5987
23354B7289M7030J4157o673l8214p0501k7909N5724k0093j8085M3568J7014k0975
23342B332J0659M3959O4583j2492o0762j0811Q7050o9931o8304N549K6556K5755
23330D4143K4664n1785P620L7004N2782k5886m986j888m4472n3388J02354N3062
23318A39224J8513M3934L6982j06653p2440j569n410L1918M5172l7983j05421
$$ y = [81845, 91968, 204107, 297918, 218071, 107090, 42959, 62290, 54608, 23599, -4193, 22346, 37940, 23514, -74358, -108675, -53946, -50236, -66616, -46339, -14312, -31885, -94625, -92210, -42261, -18287, -51457, -30316, -34712, -37648, -3076, 54996, 10331, 11315, 58098, 35757, -4672, 49310, 73848, 51955, 23540, -44098, -17644, -35336, 20891, 16584, -18698, 27289, 74319, 88476, 81803, 43589, -26912, -54821, 903, -19190, -37275, 6293, 23307, 2332, 12991, 56950, 121533, 109041, 48279, 37468, 124518, 54587, -13717, -8168, 18388, 44143, 68807, 17022, 24642, 61646, 114428, 88542, 83556, 81668, 37196, -16192, 86162, 139224, 157737, 201671, 238653, 132000, 59560, 57991, 52581, 84499, 129671, 91688, -13733]
23307a3733p1854J8404M4869l430k5976m1403j4057K7329L4816K7975k7757L2368
23295a2449l0852N945Q0546m1030L9965N1500O6640l8008o7245r657n6876q222
23283a9743m6421l9561K2663o493m2112O1218L6083M0555J473l429n520L8212
23271C6925L797l0237n475J9966L1104K9284j7023J2659J2918K5319n7489m2792
23259A8956q3817m1255M6862L0383m5813p6149N4147M9235o753P8139M4294k3529
23247D4700l4357p3667P519P1736R378m6265M5235M091o1801p437p3091j5096
23235a29055r855m784L3437R0857j0744N635J6096k9009J00879L557O808k9567
23223D4255j7007j0152O0722m9637q3278n1217k6780M6428k6134R25J0992r758
$$ y = [-13733, -85587, -67183, -22314, -25744, -51720, -93123, -107180, -79851, -45035, -17060, -44817, -12449, -43301, -37356, 43190, 2160, 42125, 93625, 160265, 122257, 55012, 45355, -11521, -19743, -66164, -105725, -83062, -89555, -131667, -70449, -34366, 6189, 7662, 4233, -1287, 36925, 40722, 10485, 5010, 24976, 56080, 85364, 68341, 81000, 93918, 119237, 61748, 18956, -64861, -106116, -59254, -28871, -74684, -150833, -96686, -47451, -54204, 23935, 68229, 44700, 10343, -63324, -55805, 15931, 25309, -20956, 24279, 28370, -33431, -40868, -113959, -129055, -138910, -143694, -110257, -19400, -30144, -24509, -8413, -37422, 63457, 67014, 73822, 44255, 27248, 17096, 77818, 28181, -55097, -106314, -133094, -86666, -112800, -111875, -100883, -110641]
23211a10641O5818Q220M1624N1771m9203l2081L2204n3261N064K7284m9142n0609
23199a12952o2290K2954Q6718L3092k4900J0145k3287N1625J8896J8859l9621
23188b0761P348N4027J5117j1915r9848l8397J8007K0353k8420k4319P9215J1921
23176a7672m8876L8347K3325K727O118J2614l5651j4372m0094J4765k6534K1088
23164f4215O5360J7480M502K7068l4113L5948k8832k6021J02192N596j07146n8018
23152f0199J7977P1369L7727N4768J2941l1449j0565K2531M6256k6313o1617p2766
23140F60k3107P163J9911p345L6156K6564l3779J9794j7747j3369L9369l1985
23128B2285K1380N2985j53624n5245j7405O1784N2387m052l3110J5050J7841q0285
$$ y = [-110641, -44823, -36603, 5021, 56792, 7589, -24492, 7712, -45549, -40485, -13201, -62343, -112952, -175242, -152288, -65570, -32478, -57378, -47233, -70520, -18895, 1, 18860, -20761, -13413, 40614, 55731, 43816, -56032, -94429, -76422, -56069, -84489, -108808, -29593, -17672, -66548, -28201, -4876, -2149, 3969, 16583, -19068, -33440, -73534, -58769, -85303, -64215, 1145, 18625, 23127, 50195, 16082, 52030, 23198, -2823, 99369, 104965, -2181, -60199, -42222, 29147, 66874, 121642, 134583, 103134, 92569, 115100, 161356, 135043, 73426, 660, -22447, -15284, 4627, -2718, 33438, 60002, 26223, 46017, 28270, 14901, 54270, 22285, 43665, 96650, -56974, -112219, -129624, -67840, -15453, -19505, -52615, -37565, -19724, -100009]
23116a00009N3637M9939J0281J1875p0141o8891n3640P5350N0819n8378K8302
23105g0856M1974k3824l5433K2779L6183M1065M9633J727m0297l7375k1578J8866
23093a7136q8077m3114J9129M724J3325K0120L337J8654P9347J7509m8668r1632
23081a12482J8765L4287O0813q211k8072o0727Q34K7448K2498J9745N1159k5597
23069D60p2639J7938L464j7252l2605L6134j9965M6295Q4674J934l6113L546j5641
23056B30p6633l4716o8133J02795R0674J7474j3536M4348p2031q8429L3013l6416
23044a01360J4360N8810P0108J7603P466N8456O0082k5183j59564j22407K0660
23033a00969Q0610K7176L1064N1537K7895m577p3700K8896K0564o883P9622K427
$$ y = [-100009, -46372, 3567, 13848, 25723, -44418, -113309, -166949, -91599, -40780, -99158, -70856, -28882, -52706, -88139, -65360, -29177, 11888, 61521, 63248, 22951, -14424, -36002, -17136, -105213, -148327, -129198, -124474, -111149, -91029, -87692, -69038, 10309, 27818, -20850, -112482, -93717, -59430, 1383, -6828, -34900, -95627, -94793, -67345, -44847, -25102, 26057, 460, -72179, -54241, -50777, -68029, -100634, -64500, -84465, -38170, 46504, 48438, 12325, 15871, 230, -76403, -111119, -179252, -76457, 14217, 31691, 18155, 62503, -9528, -97957, -64944, -101360, -87000, -28190, 41918, 59521, 66987, 125443, 185525, 160342, 778, -121629, -100969, -20359, 6817, 37881, 89418, 117313, 112736, 39036, 67932, 88496, 81613, 161235, 163662]
23021A63662p1382L62k0309p1798l8695M1267L8686l3432l5122L9358J0750m625
23009A8722Q5774O3368r8987m671r944l9342o6921n2815l9496Q5450Q1316n0260
22997b7806p2360M9003L9010L3542j7903n0479q58q196J0482J1042O6193k0073
22985A1597j930K8750M8814k9309p2089j0715J8021k8087p043r1474k5056K8136
22973a30385M0250J2643L0182M4661M8490K3610n2145l1703J7535j5813O5815
22962E3140j0985p4301k3564N0661J882M5736q3055o4704K2029n958j00167N0907
22950a38379O0375N3563p352M7162P0513J3348N350o5100k4678j6838m7621k2184
22938g1841l345J06949M7166P6883k5109r3473p5621N799J2363j0345J4212J7393
$$ y = [163662, 92280, 92642, 72333, 535, -38160, 3107, 41793, 8361, -26761, 12597, 23347, 18722, 104496, 167864, 68877, 64206, 54262, 14920, -52001, -104816, -144312, -58862, 22454, -27806, -100166, -51163, -12153, 21389, 3486, -46993, -47851, -56047, -45565, -34523, 31670, 11597, 9667, 38417, 87231, 57922, -14167, -24882, -6861, -34948, -41991, -133465, -158521, -130385, -90135, -77492, -47310, -2649, 45841, 69451, 17306, -14397, 3138, -12675, 53140, 42155, -32146, -55710, -5049, -3167, 42569, -40486, -105190, -83161, -89119, -189286, -138379, -78004, -24441, -31793, 15369, 85882, 99230, 104580, 39480, 14802, -2036, -49657, -71841, -75186, 31763, 78929, 155812, 130703, 37230, -38391, -32592, -20229, -30574, -16362, 1031]
22926A031N964M074j2753K2034j01654n0037M2535n4283k0408O1389Q6247M028
22914a1833q3524K6004k9043m9216k1638N0197k0159O5516Q4942N2365R2370j8293
22902A37688n7495o9503n908n953p8703p7604N2968m842K5942O7069J7467j5033
22890a3907j1114J3709n5730J0482k625Q755K730M2046L0024o9530n1655r77Q126
22877h9666J8138m3148l9469J1618J01220P8244K5147J9721j24783o2053Q2460
22866b2571M1095q3543j9038J1941r414O6813m846N0353N9658K0945j2427l5079
22854F3887l9393n5234O3674Q3338l2737q961J9180l7144m2159k5557J1440j7177
22842a6843M2458K9357j8874l3066j2162n7976M3588J0941K6248j2150k2388o0124
$$ y = [1031, 6995, 11069, -1684, 20350, -81304, -131341, -88806, -143089, -163497, -102108, -15861, -11833, -95357, -69353, -98396, -147612, -169250, -119053, -139212, -73696, 11246, 63611, 155981, 137688, 80193, 10690, 4782, -1171, -79874, -157478, -104510, -109352, -83410, -16341, 1126, -13907, -25021, -11312, -67042, -56560, -59185, -50430, -47700, -5654, 24370, -45160, -96815, -97792, -89666, -71528, -114676, -154145, -142527, -41307, 36937, 62084, 81805, -42978, -105031, -22571, 18524, -65019, -84057, -72116, -81530, -14717, -19563, 30790, 90448, 111393, 98966, 63887, 24494, -30740, 32934, 116272, 83535, 74574, 93754, 56610, 14451, -11106, 334, -16843, 25615, 54972, 36098, 3032, -9130, -67106, -23518, -12577, 13671, 1521, -20867, -80991]
22830h0991J6382L3122M4233L0886j20167m1472L4782O7502k3456l678L4186K667
22818f004O980j3559N0007K2266r3076K8149L6272K2909m2281o2077J5983K1100
22806a3331M0851P290m5958R258J9223P9013j8755p9862n460Q9776J737J5436
22794I9218o4052j01697L0043k2941n2245J887P9859m8041m1714N3724O7880p749
22782e828R578k1609J8321J5623K671k8084m7394o3295k7413O667J8215L1747
22770i0801M4831m4414o3003k4665M2037J25538K6774M6450k2164j9341o0045
22759c8803P374P1272j5950j16006O5417J27803M925j1784p271o1699o4276L6726
22747b272M5464l6908p8941L7507O7984K6881K9914n1573m1515p5755K1295J9200
$$ y = [-80991, -64609, -31487, 12746, 43632, -76535, -118007, -83225, -15723, -39179, -42857, -8671, -6004, 976, -12583, 37424, 59690, -33386, -5237, 31035, 53944, 11663, -50414, -34431, -13331, 27520, 34810, -11148, -1890, 17333, 96346, 77591, -2271, -7731, 82045, 83782, 99218, 35166, -66531, -36488, -59429, -111674, -109787, -29928, -77969, -119683, -65959, 1921, -5828, 3750, -17859, 462, 16085, 18756, -9328, -56722, -120017, -147430, -140763, -122548, -90801, -45970, -90384, -153387, -178052, -136015, -10477, 16297, 62747, 40583, 21242, -38803, -31429, 39843, 23893, -92113, -26696, 101107, 106032, 94248, 86977, 25278, -38998, -2272, 43192, 6284, -72657, -35150, 32834, 59715, 89629, 38056, -3459, -79214, -57919, -38719]
22735c8719L275o2852n027O0647K6919P1122m007o6536k1690m06q374k6771N738
22722f6681K762J2970k9228j7385J7527l3037M4875O7830L9769Q355o8936l4751
22710e5930J6765k2741l674M0091L4969l682Q0329M7761L8016l3968m5292J3577
22698A06221K1597o0895r2375p6389N6528L1614k2618j0747m0480P041J1353M6958
22686b2192L4768M104M4481j2346o1618k9295N6733R4124K2114k3727p266p1360
22674B8520k3129K4977j1345j2135n689O1j4774k7501n449k0894j9969p3214K0255
22661a40286M3498k9515k996K1843L5797K4442J6598o152n1569K4574P2172K6979
22649C5385m4560k2251J2110K2475j2518p2188K1580N0337n168n644j1021p5804
$$ y = [-38719, -35444, -98296, -103323, -42676, -15757, 55365, 51358, -15178, -36868, -37274, -45648, -72419, -66681, -63919, -50949, -80177, -97562, -80035, -113072, -68197, -367, 39402, 47757, -21179, -55930, -39165, -61906, -65580, -25489, 9480, 5798, 86127, 133888, 171904, 137936, 92644, 106221, 127818, 66923, -25452, -101841, -45313, -13699, -36317, -47064, -87544, -80503, -69150, -22192, 12576, 16680, 61161, 48815, -12803, -42098, 14635, 108759, 130873, 107146, 99880, 28520, 5391, 30368, 19023, 6888, 1199, 1260, -13514, -41015, -46464, -67358, -87327, -160541, -140286, -96788, -126303, -129299, -107456, -71659, -47217, -30619, -36771, -88340, -63766, 8406, 35385, -9175, -31426, -19316, 3159, -9359, -81547, -59967, -9630, -14798, -20442, -31463, -107267]
22637a07267R0151R279J5081O4104R5384k2779k8635R3422p9283p4727o6659J008
22625a0921p7957J3784o3139l8198O8991J08246O857n2918l4782l1559n6842j513
22613a69951O5359L4498L3083l0259o053L7437j1856n9139j3532o4913M3555R930
22601a31841L9947j2992P387O3039R2572J0501o4907m2518j5894M4749M5584L0778
22589F6405J3511j05831o3623m5749K9947M9246j0106n4880l955L9613P9363m0583
22577d6642j05118m6350O2067O2211n369N6331K6553k8338J8212n8037K6415M3730
22565E665p424k2549J7693M1754L3127o3529j89253J503O2578J13916O9461j264
22553F1678j05018p2331P0804L2656o945M8949Q5902p3609l5575m1787j11681
$$ y = [-107267, -17116, -7837, 7244, 71348, 166732, 143953, 115318, 208740, 129457, 54730, -11929, -10921, -88878, -75094, -138233, -176431, -107440, 806, 7663, -45255, -80037, -111596, -168438, -169951, -104592, -70094, -37011, -67270, -73323, -35886, -47742, -106881, -120413, -185326, -141771, -131841, -91894, -104886, -97499, -34460, 58112, 68613, 3706, -38812, -54706, -9957, 35627, 66405, 79916, -25915, -89538, -135287, -105340, -56094, -66200, -121080, -125035, -85422, -6059, -46642, -151760, -198110, -136043, -73832, -79201, -22870, 3683, -24655, -6443, -64480, -38065, 5665, -1759, -24308, -6615, 35139, 68266, 4737, -184516, -183013, -120435, -6519, 62942, 61678, -43340, -115671, -44867, -12211, -19156, 29793, 115695, 42086, 6511, -35276, -146957]
22542a46957K865J2682j5288O2742j6491j2928q7210L6887j1695L1317O7401J01096
22530B4421l3009j12986j1490K580n0743M5860q314L1262M0556J034L7240K993
22518c0596m6695n1455j7320R1343N6841J6801l0879l5149r1325n7626J15087
22507h0973R8484j5241N1841M8336k9255N8198m9374m7181L1184L718J0158M167
22495H4062l6918o0197O7273O5677J7832j15562j13558j2030j3860J0427J7236
22484h9618L9562n9990j311N8541L7392q986j9317N0427Q6846J9488N149k7095
22472I1088m2463q2844j9085p7474m9239J8029j0354M5582J26810P2643j878l0389
22460D0426o4684k1656K2969L7096j5024l5917m3498N0104k2830J422M6892K1119
$$ y = [-146957, -144092, -131410, -146698, -83956, -100447, -113375, -200585, -163698, -175393, -144076, -76675, 24421, -8588, -121574, -133064, -130484, -181227, -135367, -143681, -112419, -71863, -70829, -33589, -30596, -77291, -128746, -146066, -54723, 2118, 18919, -11960, -47109, -138434, -196060, -80973, 17511, 2270, 54111, 102447, 73192, 131390, 82016, 34835, 66019, 69737, 79895, 84062, 47144, -13053, 54220, 119897, 137729, 22167, -91391, -103421, -117281, -106854, -89618, -50056, -110046, -111357, -52816, -15424, -24410, -43727, 6700, 93546, 113034, 118183, 91088, 48625, -34219, -53304, -130778, -180017, -161988, -172342, -126760, 50, 72693, 70815, 40426, -24258, -45914, -22945, 14151, -873, -36790, -80288, -30184, -53014, -51592, -4700, 16419]
22448A6419p7280J7726K9058M3078j5656j3528l3965q2511k2126n6213N9241K0053
22436a15704j7178Q3768L4259L8191o7115r6069Q4463O9179m8962r29M2019N996
22424A1918j7160J8672L9346K5800l3428n3064R902O7418m8331o6213M8101n3
22412B908j148M8527r2900o1763n436O6766L5014o0641n0999K8160j4246k8887
22400a34645L1515N9304P350N4124r9875l5106J19160P3804j0026l8440J7849
22389D5014k6429K4345Q97M322m0554l8725P6145P2272r827n029l0455n1413J9277
22376C9840j3942m125L9076M8003l4976j27312p7775M9995R0991k7753o4456m5622
22364a28056K6087P7486K1668k735l163N709r3392p86L2229k635M2916j9275M8243
$$ y = [16419, -60861, -43135, -14077, 29001, 13345, -183, -34148, -116659, -138785, -194998, -135757, -115704, -132882, -49114, -14855, 23336, -43779, -139848, -55385, 13794, -35168, -36097, 5922, 11918, -5242, 13430, 52776, 78576, 45148, -7916, 1986, 69404, 21073, -45140, 2961, 2908, 1760, 50287, -42613, -104376, -109812, -43046, -8032, -68673, -119672, -91512, -105758, -134645, -103130, -43826, -36476, 17648, -82227, -117333, 1827, 75631, 65605, 27165, 45014, 18585, 42930, 43827, 48149, 7595, -31130, 45015, 117287, 107460, 102431, 71976, 20563, 39840, 25898, 21773, 60849, 108852, 73876, -53436, -131211, -81216, 9775, -17978, -82434, -128056, -101969, -24483, -2815, -5550, -8713, -3004, -96396, -97182, -64953, -67588, -24672, -43947, 4296]
22351D296L2860q3706k1447L0646M4506L2137k9384j9100p5607o182L9648J9790
22339c1543k026Q8781N9333p163j19985j672O7712o8018K5324J4256k8702j5469
22327a9172L1108J7619r4410q6169R227N0455R1636N3374N0727p5504m5245P5696
22315E9342j8098r251n0321k6959J2311q5860L543n608k1569N3739K7188L3421
22303b8122L3903N5821M4732R959n1495m9292o17m341p919N765n0885l034k0562
22290f6087o9628k5788M879M467J24464N6752m5686j00731j4936L4617L9244Q6025
22278B7592m329l7685J1414l338m5732j02536K0952N526K4559J03173L4388o6859
22266c2875K1151K8734k5715L100k672N7100K5370r4338l4246K3084J9287K8460
$$ y = [4296, 37156, -46550, -67997, -37351, 7155, 39292, 9908, -9192, -84799, -90981, -51333, -31543, -33569, 55212, 114545, 107382, -12603, -14275, 53437, -14581, 10743, 24999, -3703, -19172, 11936, 29555, -64855, -151024, -141797, -91342, 294, 53668, 104395, 28891, -16354, 59342, 41244, 31993, -18328, -45287, -32976, -118836, -115293, -120901, -142470, -88731, -61543, -28122, 5781, 61602, 106334, 116293, 64798, 15506, 14889, 10548, 2629, 8394, -42491, -45525, -66087, -135715, -161503, -156624, -152157, -27693, 29059, -16627, -117358, -132294, -97677, -58433, 27592, 23263, -14422, -3008, -6346, -52078, -154614, -133662, -128136, -103577, -404, 33984, -32875, -11724, 17010, -8705, -5605, -8277, 48823, 74193, -20145, -54391, -31307, -12020, 16440]
22254A6440j1158m4236k5277n9187p8384M5112K6980P292j4753Q0296N8154j9855
22242a8576r9965J4153j505J7921M2779J24R105m426M7802q7220n606m3562J3589
22229a15387M6789l9615o0079l3842M6126j0591j6222J599O6270N4401O3670m831
22217a712J9142J2409L3921l5674j02681l4978P2412J27540K482o8819J2360N9557
22205I5959m9849m4749l1857j1078L8570N0188P89p909L8710N155n4795j10898
22193h1764j08533k0291Q1965N5957j0478j1750p535K0129k1273j4001N4171Q844
22181e4559K9694J7508k1583l26R376l3878k326M4291J7046l4926q5112Q0470
22169c4325L8641J1074K496k3412K3265o7146m7559M2518K9176P291j1001o3802
$$ y = [16440, 5282, -38954, -64231, -123418, -201802, -156690, -129710, -122418, -137171, -56875, 1279, -18576, -118541, -104388, -105893, -87972, -45193, -45069, -35964, -40390, 7412, -79808, -85414, -128976, -115387, -68598, -108213, -168292, -202134, -156008, -166599, -182821, -181222, -114952, -60551, 3119, -1712, 17430, 29839, 63760, 28086, -74595, -109573, -37161, 90379, 92861, 24042, 36402, 95959, 46110, 1361, -30496, -41574, -3004, 47184, 47973, 40064, 78774, 83929, 29134, -81764, -190297, -210588, -128623, -72666, -83144, -94894, -102429, -82300, -103573, -117574, -63403, -54559, -24865, -7357, -28940, -29266, -19890, -53768, -56094, -11803, 5243, -29683, -114795, -34325, 4316, 15390, 17886, -5526, 17739, -49407, -96966, -54448, -25272, -17981, -28982, -92784]
22157i2784J8938m9j4907J5681L6699L3885m2144q2363l1110k8379K7324L7092
22145a22117R8532Q1154M8796m3973k8920p2568j0542K4666J4014Q733N6777o2460
22133g908j06930M9649N245n2195N6903L035k1792K0133j4017k3483q486J8423
22121h1423O9638l6829k0550o5643K7388k5547l0022J5795N4286J6931n321k0900
22109a02197m171P7091Q0209l3437J8882m8706k3726P578L7111j5006j804m0778
22097d8954N4163j6046N8595L4334P705n6673n8924k5819M6283l1795L3533L452
22085a46p1864k7645M6324K4992L3499M5062M6071J8629l4592p3005q9235J8811
22073f3099O1204N3686k7559j06814o3451J13795M1005l9770m2031M3910K8035
$$ y = [-92784, -73846, -73895, -88802, -73121, -36422, -2537, -44681, -127044, -158154, -186533, -159209, -122117, -23585, 57569, 106365, 62392, 33472, -39096, -49638, -24972, -10958, -2225, 54552, -7908, -114838, -65189, -59944, -112139, -55236, -52201, -73993, -53860, -67877, -91360, -99846, -81423, -11785, -48614, -69164, -134807, -107419, -132966, -162988, -147193, -92907, -75976, -81297, -102197, -106368, -29277, 50932, 17495, 36377, -12329, -36055, -28477, 8634, -6372, -8176, -48954, 5209, -10837, 47758, 82092, 89797, 33124, -25800, -51619, -5336, -37131, -3598, -146, -72010, -99655, -53331, -28339, 5160, 50222, 96293, 114922, 80330, 7325, -81910, -63099, -1895, 51791, 24232, -82582, -146033, -32238, 8767, -31003, -73034, -29124, -1089]
22062a089q0187m3854L9877L5933L9667Q5410j18717j19435L1064J6024M5023
22051g0284P7160O2637P221o3110k9680k3278L7294M5011r628l617r5974n128
22039g1376P8481K9721n1978j61933K7479L7924j7342O6534J487J3654K5812K5048
22027C511O1875n538k8710j5046L1286L7304Q2592l570M573m183j21051O3126
22015A06169L5320m3197r7599n323l792k35j9507O6101N105m9644p8712k1028
22003a06342o964l7988P916N2178k664J6035L0463K0152R7906K5955M297j3533
21991H7411r587q8421j40644R9722R7037K2455l9517q5540k0421M5505J0449m877
21979b6428N6783J4009j8579o318k7222m6636M8679k9482j7284l7940J4001N1575
$$ y = [-1089, -81276, -125130, -85253, -49320, -9653, 75757, -42960, -162395, -131331, -115307, -70284, 6876, 69513, 76734, 13624, -16056, -39334, -2040, 42971, 33343, 29726, -66248, -71376, 7105, 36826, -15152, -177085, -149606, -111682, -129024, -62490, -61003, -47349, -21537, 3511, 65386, 59848, 31138, 16092, 47378, 84682, 167274, 163704, 168277, 164094, 43043, 106169, 141489, 98292, 693, -4630, -8422, -8657, -28164, 37937, 43042, -6602, -85314, -106342, -113306, -151294, -143378, -91200, -93864, -77829, -47366, -27214, 70692, 96647, 100944, 87411, 77824, -10597, -151241, -51519, 45518, 67973, 28456, -57084, -77505, -32000, -21551, -26428, 30355, 44364, 25785, 19467, -7755, -54391, -5712, -35194, -52478, -90418, -76417, -24842]
21967b4842M5761M6693R157l9308m5254j943N8864J33n4483k1682j405K2229J6483
21954A0403Q659k5457r9830l547k4958O1410L8186L3886L5366l2220r8163M7029
21942d9236M3421o394J3870P591N648k6778Q173M908j2066l3264L9303m425k0915
21929c0164M5679Q949l7326o2495j141l5790j1629K2112R0928J4033k0462K5473
21917H167q804M2880M027K4399K3394r1374q1952P6233L2434J731N9302L6143
21905A26580o9119j20755m0837L4349O4284L7923m8284j8320L3289K5213q3875
21894e9552o2855N8783M2100k7576p301R3494n1164l7874N8816R8470O4492j26643
21882D3190n5565O7971J1833j00667m6876J5440N804N4622O712l4059q7888k0856
$$ y = [-24842, 20919, 67612, 76769, 37461, -7793, -9736, 49128, 49261, -5222, -26904, -28309, -6080, 10403, 19062, -6395, -106225, -109772, -134730, -73320, -35134, -1248, 34118, 1898, -96265, -49236, -5815, -12209, 1661, 9252, 14900, -11878, -3705, 1203, -10863, -44127, -4824, -9249, -30164, 15515, 24464, -12862, -75357, -76498, -112288, -123917, -101805, -10877, 3156, -17306, 8167, -637, 42243, 46270, 70669, 94063, 2689, -79263, -3030, 29404, 31135, 90437, 126580, 57461, -63294, -104131, -69782, -5498, 32425, -15859, -34179, -890, 24323, -59552, -122407, -63624, -21524, -49100, -56401, 37093, -14071, -51945, 6871, 105341, 169833, 43190, -12375, 55596, 67429, -33238, -80114, -64674, -58870, -4248, 2464, -31595, -119483, -140339]
21870a40339N303P1235J58563k8561n7462J5844M3703K4009O6595p4744r1185
21859g039K2402k7128k2060k1155N1049k8480l3991q2802M7743O4219j299L3944
21847d597j0391k1066n2981O7239J5843n7924N4898L1337M7962O2775l3488j21348
21835b1741m5605J2714L8449L3831n2516p189L9470o1986o7012L4622L8914N4921
21823c128L1374k1674j560L9062k6635o7733l1170P1486J42892M9267m5776q6293
21811E0112j09561K0486K7071O996M964J3148K6074L6464l4352p5163J16803O6948
21799A49990j51679j36075l6935R9037Q8034r249O102j7237J4001k5254l7549
21788e6814L6699O5039j2250L567k0243p491l6091N5546Q0423j05355j03005o889
$$ y = [-140339, -135036, -63801, 94762, 66201, 8739, 24583, 68286, 92295, 158890, 84146, -7039, 15363, -11765, -33825, -54980, -3931, -32411, -66402, -149204, -101461, -37242, -38541, -4597, -14988, -36054, -89035, -21796, -5953, -63877, -8979, 22358, 70320, 133095, 99607, -21741, -67346, -54632, -16183, 17648, -34868, -42057, -2587, -64573, -131585, -96963, -58049, -3128, 28246, 6572, 5012, 44074, 17439, -50294, -81464, -9978, 132914, 182181, 136405, 50112, -59449, -38963, -11892, -4896, 68, 13216, 39290, 75754, 41402, -33761, 83042, 149990, -1689, -137764, -174699, -75662, 12372, 3123, 9225, -8012, 5989, -19265, -56814, -20115, 44924, 32674, 36241, 15998, 8507, -27584, 27962, 108385, 3030, -99975, -106864]
21776a06864m1782o248L6011O4601R7311j0348r905n5445K7806L0138k1425o405
21764b555j5610J057k2638J2688Q5765O3765m0211N055P0876K2177l5999m2281
21752A02089K1571J6700m9844q2177r716L1950q391l3214n4065k0532O2839N2509
21740B9719j9694O647O9652J20583Q486n6269o1843k4058l9874m9772K9378R7490
21728A10445p9828j14503P0324l6302K9380m0392k5219J5861J0918l109P7607
21717A5182j1030m2860O2413M8624O2005k6074p2239k975q65m6961L3808N8378
21705G7406P873j0515k9377n6753J3066K6505M1642M0939M105j58190n2168P5178
21693b0289N5510K6930l1155l0928K8031p8622m0945k0002M2466J0910O7585j4651
$$ y = [-106864, -148646, -154894, -118883, -54282, 43029, 32681, 22776, -32669, -4863, 25275, 3850, -2555, -18165, -17108, -39746, -27058, 58707, 122472, 82261, 87316, 158192, 180369, 144370, 102089, 123660, 140360, 90516, 8339, -1377, 30573, 22182, -11032, -65097, -85629, -22790, 29719, 10025, 16672, 86324, 206907, 215393, 159124, 97281, 73223, 33349, -16423, 12955, 110445, 30617, -83886, -13562, -49864, -20484, -60876, -86095, -70234, -59316, -62425, 15182, 4152, -38708, 23705, 72329, 134334, 108260, 36021, 33046, 32181, -14780, 19028, 77406, 85279, 74764, 45387, -11366, 1700, 28205, 69847, 110786, 114891, -43299, -95467, -20289, 35221, 62151, 30996, 68, 28099, -50523, -91468, -111470, -69004, -58094, 9491, -5160]
21681e160r9190o8675M260p678P3808J02809j4786j7768o739l9415o313P8536
21669f311O1966m0674o4000L3536J9859M003M6139j37L863J6830N878m2360j0735
21656B7857n4394k9144L6520m3321j5911l6151m0892l1571J7748J00895N6717
21645a1647q4568m0670J6939K4166J2578J14316P0343k8958n8943j0199q8246
21634h4889l8215L4339M3526L092l1487k0792M2399o4074n138L9919J09156M1389
21622F9225m4768j43439j0875K2945L514N3038O9942k8707j373O7460l2977n8731
21610c4746k4303J00326j9956K0672l547m5179l0773k4749K231j233n0989l9513
21598a51759N2108M4355M9788L4945o3585k0156O3495k881p3274L507J15259o8710
$$ y = [-5160, -104350, -173025, -168765, -176443, -102635, 174, -14612, -32380, -39119, -78534, -84847, -6311, 55655, 14981, -49019, -15483, 4376, 8379, 54518, 54381, 58244, 75074, 80952, 38592, 27857, -26537, -55681, -19161, -62482, -78393, -114544, -155436, -187007, -169259, -68364, -11647, -96215, -136885, -119946, -95780, -83202, 31114, 101457, 72499, 13556, 3357, -84889, -123104, -88765, -45239, -42147, -73634, -94426, -52027, -116101, -121239, -81320, 27836, 69225, 24457, -118982, -129857, -106912, -103398, -50360, 19582, -9125, -10498, 56962, 23985, -34746, -59049, 41277, 21321, 41993, 38446, -6733, -37506, -62255, -60024, -61257, -112246, -151759, -99651, -55296, -5508, 29437, -34148, -54304, 9191, 6310, -66964, -63457, 51802, -16908]
21586a6908l2459Q36J7871j2715L6146p4236m2232M0429L5020o760L9389K517
21574a3102k890k2332j215m9193j2667M7666N6351o5004m2771m063l2070M7501
21562i3789R8383l2883m2721l9698j2370N9044L0879n6275p8598R191Q5201k3694
21550i7330m096Q2762j9104P48J07322M1882r8193j834j9159n0989o8127l5401
21538a61519P226m428N2736O7778J5016l7703j0520M9155k5710M1080O3815m3017
21526A3909r7231m6562O0770L6631J1652j2393L4279N6935J7631j29071J5167
21515c8283M9339j0067p0036N2458L3570j6488m379o812K5996N569j5040p2933
21503f7106o4197P2111R9734n9057l2668J8304q5986r4609q868Q4718O5087k4303
$$ y = [-16908, -49367, -48531, -30660, -43375, -7229, -81465, -123697, -83268, -48248, -55008, -15619, -13102, -15992, -38324, -39539, -88732, -101399, -53733, 2618, -62386, -105157, -109220, -141290, -93789, 4594, -28289, -71010, -110708, -123078, -64034, -33155, -89430, -168028, -158837, -73636, -97330, -101426, -18664, -37768, -37020, 70302, 112184, 13991, 12157, -7002, -57991, -126118, -161519, -154293, -158721, -105985, -38207, -23191, -60894, -71414, -22259, -47969, -6889, 56926, 13909, -83322, -129884, -69114, -32483, -20831, -33224, 1055, 57990, 75621, -53450, -38283, 11056, 989, -69047, -16589, 16981, 493, -3886, -10698, 15298, 20867, 5827, -67106, -131303, -59192, 40542, -18515, -51183, -32879, -118865, -213474, -222342, -137624, -72537, -96840]
21491i6840P8048J2166l1377o5301N159l2607N7443l049N306M6184J741M2978
21479A9851M5757n2187j259n0317r774O4675N0542j7132m5902m0169O863M136
21467b4916M0622J5404o5403K4923L9404m7510j3547k7115J7587J6906k3612O4734
21455A7477O2955l3761n9577l0900m1754L6579M6250L2690j1271j3882M4860j3361
21443C6305n0019j2254R1797m8249j7694j9503R476J7207O6217n3279m5431K6546
21431A119K9596M4786q2960J5866K6250q269k5055l4481l4449j7922K9513O3302
21419G296J3457K1652M3358O332R125n1850j5003N4702n8557m252N2819m6090
21407C2989j00802Q082J7347k1945J04487N1865k7172j8018n0003k1122k5716
$$ y = [-96840, -18792, -6626, -38003, -103304, -98145, -130752, -73309, -76358, -71052, -24868, -23127, 19851, 65608, 13421, 12162, -38155, -47929, 16746, 67288, 50156, 4254, -35915, -29052, -24916, 15706, 31110, -34293, -9370, 30034, -17476, -31023, -58138, -40551, -23645, -47257, 17477, 80432, 46671, -12906, -43806, -85560, -48981, -2731, 29959, 18688, 4806, 49666, 36305, -13714, -25968, 65829, 17580, -114, -19617, -10141, 7066, 73283, 20004, -25427, 1119, 30715, 75501, -7459, 8407, 34657, 26388, 1333, -33148, -67597, -85519, -56006, 7296, 20753, 42405, 85763, 92095, 101220, 49370, 34367, 89069, 30512, 26260, 79079, 32989, -67813, -59731, -42384, -64329, 40158, 92023, 64851, 46833, -3170, -24292, -50008]
21396e0008K1938J9652n780o7783N8771l3106J8560j1182O09m9813k3252Q368
21384a13026j8442M3350o9332L0174Q7156p5722Q729J06293q665j3034l499R267
21372a6751n227k6195j8780L7911k0326j6638N3271Q684P329r0742J5308j3539
21360h5695j161l180L9582M890n9699k8362J3963Q5612N1265J5618m7598N1533
21348C6768M9488k1788q0635J8262m4837Q8726j6140l2811K1911P922l1523j6347
21336b1004J4065k8801k9859l4548R205N66q435j6904L7146P3703J7788l37o8827
21323e6242q7591o6993M5840Q5049K3486Q8384Q8793M028q6894n365o243q013
21311A8239L3570o3108O5738P640o9150l2874M7207K6808m0530m2406L3815j2296
$$ y = [-50008, -28070, -8418, -14198, -81981, -23210, -56316, -37756, -48938, -48329, -98142, -121394, -113026, -131468, -88118, -157450, -127276, -40120, -115842, -107113, -820, -9485, -22519, -26018, -16751, -21978, -48173, -66953, -29042, -49368, -66006, -12735, -4051, 3278, -87464, -72156, -85695, -86856, -90036, -50454, -45564, -105263, -133625, -119662, -34050, 17215, 32833, -14765, 36768, 86256, 64468, -16167, 2095, -42742, 45984, 29844, -2967, 18944, 26866, -4657, -21004, -6939, -35740, -65599, -100147, -90942, -90376, -98811, -115715, -78569, -4866, 12922, 12585, -56242, -143833, -210826, -164986, -79937, -56451, 31933, 120726, 124754, 37860, 32495, 26252, 18239, 51809, -11299, 54439, 62079, -7071, -39945, 7262, 34070, -6460, -48866, -15051, -27347]
21299b7347K5970n3580O3748P5921l2706p070R898l6970K5457J9431K1844n1603
21287C2993m3661k0587L1554O179J9854P034M1872j9284k722m4232j5233J8477
21275A2244K5666j0077l2695m5669j600L7225L2870K0084p2794m505Q6952m57
21263D7244m485P3406j4709q7327m7133J7406q18j7378l1013o756p4297N1119
21251i4741j0832j5346P389m9280O9631N0303j24867l0564O3265J0895j1530j1514
21239a47191l1936L3734N3925K7041N7826O1838N1915L8030j713m2175r3611o9258
21227f1575j0097J350k2362P5553O3617M4117m9480n4243k7370l5994m4104k8508
21215a49096o3766j2589Q9678O0614n5997l2323K8276n2391J1617M0960M645O1865
$$ y = [-27347, -1377, -54957, 8791, 84712, 52006, 44936, 54834, 17864, 43321, 62752, 84596, 32993, -10668, -31255, 299, 6478, 26332, 33366, 75238, 55954, 53232, 9000, -6233, 12244, 37910, 27833, -4862, -50531, -52131, -14906, 17964, 38048, -34746, -39251, 47701, 47244, 42759, 116165, 101456, 14129, -33004, -15598, -16416, -33794, -64807, -71563, -145860, -94741, -105573, -120919, -113530, -162810, -93179, -42876, -167743, -198307, -135042, -124147, -135677, -147191, -179127, -145393, -91468, -64427, -6601, 55237, 107152, 145182, 143469, 101294, 7683, -61575, -71672, -70322, -92684, -17131, 46486, 90603, 41123, -13120, -40490, -76484, -120588, -149096, -212862, -225451, -135773, -75159, -131156, -163479, -135203, -187594, -175977, -135017, -130372, -68507]
21203f8507P881l4397j3489M4920M1185k7665m7020n7011J8299Q7187O3961q0803
21191f5459n4617M554M7315j1330n1864R901O2145O2806M5554n3100j50350k9010
21179a83455M3521j2013J3950L3743L0156K6927n2812j8796j2372L3883m5927
21168a43195L9761M009L2352L6593J5505n668j2274J9399k9698L8307N3006o986
21156D1111m9323o233l9377L7994l4693l0392L5116J27132K2061l0315m5501o753
21144B0827j02515j7212M0728k2012m1602N0297L0414J4927j9151m6719O8523
21133b3495J05698N1260o0922m2944l6689l3577l2253n3330P167O8257P0714K4691
21121D4577M47k5360j6148q4857q9418k9386K6415r302K4000P7646M9262m7685
$$ y = [-68507, -60626, -95023, -108512, -63592, -22407, -50072, -97092, -154103, -135804, -48617, 15344, -65459, -120076, -115522, -68207, -79537, -131401, -121500, -59355, 3451, 49005, -4095, -154445, -183455, -139934, -151947, -137997, -104254, -74098, -47171, -99983, -118779, -131151, -97268, -143195, -103434, -99425, -67073, -30480, -14975, -20643, -32917, -13518, -43216, -4909, 48097, 41111, -8212, -14445, -53822, -15828, -50521, -80913, -45797, 81335, 103396, 73081, 27580, 20827, -81688, -98900, -58172, -80184, -121786, -71489, -41075, -26148, -45299, -92018, -23495, 82203, 133463, 72541, 29597, -7092, -40669, -72922, -126252, -119085, -50828, 19886, 44577, 45024, 19664, 3516, -81341, -170759, -200145, -173730, -183032, -159032, -81386, -32124, -79809]
21109g9809j0132j0324M5986l5356m0933j7403l8921K3952N8271L3589k5935m2420
21097a39435P5082O2823n6172n9683K1184N6230N7278l686k9002n2805n5017o3577
21085a86780N6301Q8603k8049K422N6119N3667p3156l6506R141Q592M1815L1676
21073B3845l5229o09l6765j1569J0959o147k7268J5060p450p4976j5985m1023
21061b07157M4749M4580M4733O9457J4626J9982o519j14488M4612M0963p221M9975
21049C8292l4047l0816j0924l2175n0740K8006K6436L2955L9464n8361m6042j0358
21037a08310L1842Q996J1131K05J4863J00461J606j8474o3532m8281l8040k8675
21025a36208N20J15604J54184k2093j9588K5022l510m283J8839p7923k9209j0142
$$ y = [-79809, -89941, -100265, -54279, -89635, -130568, -147971, -186892, -162940, -104669, -71080, -97015, -139435, -64353, -1530, -57702, -117385, -96201, -39971, 17307, 13621, -15381, -68186, -123203, -186780, -130479, -41876, -69925, -67503, -11384, 42283, -30873, -67379, -58238, -49646, -7831, 23845, -11384, -11993, -48758, -60327, -49368, -55515, -82783, -67723, -75173, -150149, -166134, -207157, -162408, -117828, -73095, -3638, 10988, 30970, 24451, -90037, -45425, -4462, -11683, 38292, 4245, -26571, -37495, -69670, -120410, -92404, -65968, -33013, 6451, -51910, -97952, -108310, -76468, -67472, -56341, -56136, -41273, 59188, 60794, 42320, -21212, -69493, -107533, -136208, -135688, -20084, 134100, 112007, 92419, 117441, 113931, 109648, 128487, 50564, 21355, 11213]
21013A1213r499K469k5847o059J04761J25256l4449m6342m8923p4673j3596L0845
21001A5156j994Q3249k3426o3936n4088k5807L160K7865J2780q771P0488K9663
20989F4339p1202o95K4243Q051j0866M1746m0520j1798p744O7189N049l0850n4322
20976a7380M0181M7600N2331o7984j12683J2418N4497N2868L1185L9210K5294
20965A57537P606n3476n4207L374K2898J6863o7082o9325J9472l4045p6163J3545
20953a13003K2916P3165O4289l9380R313J412K3602j18469o6063P1810k0381L6689
20941e4100L1897j4307n8010N3518K1993J1277M7388j2556J2209K4081m8904Q564
20929B3050N8143N854m7401j5212J9450L69R072m4479r5053J0390J3913p286m7900
$$ y = [11213, 1714, 4183, -21664, -27723, 77038, 202294, 167845, 121503, 72580, -2093, -15689, 15156, 13162, 96411, 72985, 9049, -45039, -70846, -67686, -39821, -27041, -35812, 34676, 64339, -6863, -7558, 16685, 24736, 13870, 55616, 15096, 3298, -4446, 62743, 67792, 36942, -17380, 22801, 70401, 122732, 54748, -57935, -45517, 8980, 61848, 93033, 132243, 157537, 165143, 111667, 57460, 60834, 83732, 100595, 33513, -35812, -16340, -50385, -126548, -113003, -90087, -16922, 47367, 7987, 17300, 18712, 42314, -76155, -142218, -70408, -90789, -54100, -22203, -36510, -94520, -41002, -19009, -7732, 39656, 27100, 39309, 63390, 14486, 23050, 81193, 87047, 39646, 24434, 43884, 44253, 53325, 8846, -86207, -75817, -61904, -69190, -117090]
20916a17090l050j1273K6753L5958L2788L0511l6606M9246J8146P191J4898k9683
20904A7789J7161l5498r591P87l3863J1785j1619K607K320k9972M4334R9045j3414
20891F1871O6775O7474r2329j37096n0860o8603j4470k2m9074l5150J15657R2285
20879d3542l077m550M816l0717m9672n940M7481J1329P100r7099r3371K9943N1509
20866a75790J03834L1488M2816m2070r2654N3155N1878M947n1751k8417n6138
20855a58702K7725R7471J3321r109Q1545N56r6133j04538M3446L7219M5647p48
20843b2300O1098O6252J5731k0023r310n2082n4591L3455R4898j9681n6469J7943
20831E4921O0246O2944J267n3538r3018m4109q3671J4046O8799q225j1764m5264
$$ y = [-117090, -120140, -131413, -104660, -68702, -35914, -5403, -42009, 7237, 25383, 32574, 47472, 17789, 34950, -548, -10139, -9352, -43215, -31430, -43049, -40442, -38122, -68094, -23760, 75285, 61871, 128646, 196120, 103791, -33305, -84165, -152768, -167238, -167260, -216334, -251484, -135827, -43542, -46619, -51169, -46353, -77070, -126742, -132682, -85201, -73872, -66772, -163871, -257242, -227299, -175790, -71956, -40468, 2348, -39722, -132376, -79221, -27343, -22396, -74147, -102564, -158702, -130977, -33506, -20185, -29294, 52251, 52807, -43326, -147864, -104418, -67199, -21552, -22300, 38798, 105050, 120781, 100758, 91448, 39366, -15225, 18230, 113128, 93447, 36978, 54921, 115167, 178111, 179378, 125840, 32822, -11287, -94958, -80912, -12113, -20338, -32102, -77366]
20819g7366j831q228N2331P5900M7379p5380J22411J85295J07530J48903J51500
20808G28444J54112K08741K02859r089j64263j70119j92491k02670j14412k5581
20798D15531q2201o3712l7143p6895o5429o4826n5003J1346L6910l2l0602k9570
20786d1626K0926M4159O1731o12n6461o6125R741O1143j6632K6655l094m1222
20774a417N4941o8002o6275K335l4308j0604o857m8635M4739K3088M9453M8650
20762a2892J4080M7263j18657M4418K0548j1620p310J0940J9113M4066n1718j4848
20750a6617N912P979k2879m4776K7997l2679l7835L499r88K0267P4748L9625O966
20737C1219J0828j4844o5671L9621L3746l5185j6318m0701O045L1859J3473j8478
$$ y = [-77366, -79197, -87425, -35094, 40806, 88185, 12805, 135216, 320511, 428041, 576944, 728444, 882556, 1091297, 1294156, 1285067, 1120804, 950685, 758194, 555524, 441112, 415531, 333330, 269618, 232475, 155580, 90151, 25325, -29678, -18332, 18578, 18546, -12056, -41626, -20700, 23459, 85190, 84578, 28117, -38008, -28267, 32876, 16244, 42899, 39805, -1417, 53524, -14478, -80753, -78418, -112726, -123330, -130187, -178822, -134083, -110995, -61542, -12892, 1188, 48451, -70206, -25788, -5240, -16860, -24170, -13230, 5883, 49949, -1769, -16617, -10705, -2726, -25605, -70381, -42384, -75063, -112898, -109399, -110387, -90120, -15372, 24253, 31219, 42047, 27203, -38468, 1153, 34899, -286, -16604, -57305, -51260, -19401, -5928, -24406]
20725b4406m7809J4679M6216l775M2002o8553K7940M772K1324o988k7802k8098
20713e0498M1790L8790k1169r2928j24632j6204J4873J07703O1984O1120k6827
20702e998p898l9008N828K4872M5685o28o3515J1983m206O8878n3734j2793L8420
20689G886L3493m8206J0410O2570l1532R808q9053p123P8707O3413j2164j02686
20677b4477n2737L1349L0324L4277j2300o2853o7694j9708L0468M5543k2783k3019
20665a13610n3119K0269M8204K8070J1570Q2685Q8028j38995o2209j8590O782
20654a00915K3909P5707L3198j6560P483p3270N3804L9712J1655j3288R419L8055
20642H8909j4348n274j4612N742O3568o068o8208L0478K5124p0369o8674l0136
$$ y = [-24406, -72215, -57536, -11320, -15095, 26907, -41646, -13706, -8934, 12390, 5402, -22400, -50498, -8708, 30082, 8913, -84015, -208647, -224851, -209978, -102275, -40291, 20829, -5998, -13896, -52904, -47076, -22204, 23481, 22853, -40662, -28679, -32885, 35993, -17741, -30534, 7886, 41379, -6827, 3583, 66153, 34621, 44429, -44624, -51747, 26960, 90373, 78209, -24477, -77214, -45865, -15541, 18736, 6436, -56417, -124111, -143819, -113351, -67808, -90591, -113610, -166729, -146460, -98256, -70186, -58616, 24069, 112097, -26898, -89107, -107697, -100915, -77006, -1299, 31899, 15339, 22822, -50448, 3356, 43068, 54723, 41435, 50854, 88909, 74561, 69287, 54675, 60417, 123985, 117917, 49709, 80187, 105311, 34942, -33732, -63868]
20630f3868m135L9035J1698P0610J1174q2673j23119K0871l8666K5272J40372
20619F571O2819J1966L3452j281J2560k5103r2679n0843o5558L5918O3451M8868
20607D0141K2475j8040j09953j7023k0728L9372K2700K6426l7262L2905l0750
20596d9737M7622l4098J5668N7466J7358l1354O14o5880J3074P439L9009K6834
20584D4015J7881J4817M5965k1785k4489k8417k9632o5420R956P2049L0140j4277
20572E0803J2934n8140j46004l7115Q2925J2865J1343L2459Q56R331J23715M0234
20560A36206n0245K1841K3040m0076r0523r3577K4420L7623O3862j4784k0045
20549b258l2972K2935k0756n8933K794L223k6628L4104K2471o1840j8043r779
$$ y = [-63868, -68003, -28968, -17270, 53340, 64514, -18159, -141278, -120407, -159073, -133801, 6571, 69390, 81356, 114808, 113527, 126087, 100984, 8305, -42538, -108096, -72178, -8727, 40141, 62616, 44576, -65377, -82400, -103128, -63756, -41056, -14630, -51892, -18987, -49737, -2115, -36213, -20545, 36921, 54279, 22925, 23539, -42341, -29267, -21828, 17181, 44015, 61896, 76713, 122678, 100893, 76404, 47987, 18355, -47065, -37109, 34940, 65080, 50803, 63737, 5597, -140407, -177522, -94597, -81732, -70389, -37930, -37074, -27743, 95972, 136206, 85961, 107802, 130842, 90766, 243, -93334, -68914, -31291, 32571, 17787, -2258, -35230, -12295, -33051, -91984, -89190, -85967, -112595, -78491, -56020, -117860, -135903, -145682]
20537a45682j5998O6236M3887n0586P233l7048l0267N2830J60088J0576p3314
20526a2045k6127m7907M9644J36556k3245l4154K7349m1953q9526q5315j4292
20515a61015J8918L3082Q4199N0243k7772J1799L8767j103L2563q0098l5560j0045
20503d6022l1381l7517L8616J5936J6659l9986l7057k6514n1281n699k8572L709
20491b29109R1327L5372M4501K2761j1339J29641N3129r682l2325o7926l8377
20480a2027n0934K960O5830j279N5855n1552j3524L3373Q21n670K707k0229K0342
20467B6673k2495j0439R5214L5528k3o2118j5467k5175J0247r344K7807l9183
20455A1225p1747N8278N4704Q5195R653n8121q6544l6359J9432j082R0638N663
$$ y = [-145682, -161680, -95444, -51557, -102143, -94910, -131958, -162225, -109395, 50693, 61269, -12045, -38172, -86079, -36435, 100121, 76876, 42722, 70071, 28118, -61408, -146723, -161015, -142097, -109015, -24816, 25427, -2345, 9454, 48221, 47118, 79681, -417, -35977, -46022, -77403, -114920, -76304, -60368, -43709, -83695, -120752, -147266, -198547, -204246, -232818, -229109, -137782, -102410, -57909, -35148, -46487, 83154, 136283, 126601, 94276, 26350, -12027, -62961, -60001, 5829, 4550, 60405, 8853, -4671, 28702, 29523, 23853, 26560, 6331, 26673, 4178, -6261, 88953, 124481, 124458, 62340, 46873, 21698, 31945, 22601, 50408, 11225, -60522, -2244, 52460, 137655, 147308, 89187, 2643, -33716, -14284, -15366, 75272, 80935]
20443H0935j4361J7609l9178j0907J8847L9316N0648M129j9791j07501K753N6696
20431G9195l0148k0038j1447p238n258J5811K3224p7136Q895O2637n3159P4805
20419F0143J1218o4778l3729M2382k3825J17449J6552p4321l4012P8982p0358
20408B5703j5024J4799K94L966j9064q2998p523J2995j34768J2849N2768N9636
20396g6367P205m5416M3442J38121N9196m9062n8480k6125J8798q58L2706O6527
20384A09687J0890K2820n864p7812o272l9977o5276M3619l2578J6482L2613p769
20372E63j111l4520J1350M585P7851O4701J8696o3292M2797J4812m1826k3255
20360G1351m759m197K1700n654o0573k3682J4611L7195O2138J12891K8932q1631
$$ y = [80935, 66574, 84183, 45005, 34098, 52945, 92261, 142909, 147038, 127247, 19746, 22499, 79195, 49047, 29009, 17562, 10324, 5066, 20877, 44101, -33035, -24140, 38497, -14662, 60143, 71361, 6583, -27146, 15236, -8589, 108860, 125412, 51091, 17079, 96061, 25703, 10679, 25478, 25772, 29738, 10674, -72324, -79847, -66852, -201620, -188771, -136003, -76367, -69162, -114578, -71136, 66985, 126181, 77119, 18639, -7486, 11312, 10454, 43160, 109687, 120577, 143397, 137533, 59721, 53449, 13472, -51804, -8185, -40763, -24281, 8332, 563, -548, -35068, -23718, -19133, 58718, 123419, 142115, 78823, 121620, 136432, 94606, 71351, 66592, 62395, 84095, 78441, 17868, -5814, 8797, 45992, 108130, 221021, 249953, 168322]
20348A68322m7021j4682N214p708n3610o7028o966l0408L6612O1971L3324J4738
20336I2758K6467N6400p5710j55668j3378K9208p2226l5234J04160R0853L6714
20325H4344m242k8361L0907L0864m6069p3310q2849j1702J04503M6330n3056k5908
20313b8549k8698L657K4971r9242L9104m334J8739K5129O3552N036P4754K7558
20301A21677j0676L5057P3552r1601m5389n1000r208R9694Q0106k8221k6498j7798
20289A29695j266K416p9217J575M9886q745k6051N8316J1926L2571K9843o5823
20277A35126p203o3532l700J00221N2980m4212q4413k7522O3922L5202O9203L4958
20265B61030M6456j212j14284j9334L789J9675R2368K692j3912n029o3425l9083
$$ y = [168322, 121301, 106619, 111833, 104125, 50515, -16513, -23479, -53887, -17275, 44696, 78020, 92758, 119225, 175625, 99915, -55753, -69131, -39923, -112149, -147383, -43223, 47630, 84344, 80102, 51741, 82648, 113512, 67443, -5867, -88716, -100418, 4085, 50415, -2641, -28549, -57247, -53590, -28619, -127861, -88757, -93091, -74352, -49223, 14329, 19365, 94119, 121677, 111001, 146058, 219610, 128009, 82620, 31620, 22412, 122106, 202212, 173991, 147493, 129695, 128429, 130845, 51628, 53203, 103089, 94344, 68293, 126609, 138535, 171106, 200949, 135126, 127923, 64391, 60691, 160912, 213892, 169680, 85267, 57745, 121667, 156869, 226072, 261030, 307486, 306274, 191990, 172656, 176445, 196120, 288488, 291180, 277268, 272239, 208814, 169731]
20253A69731M8998L4485j1486N1223R4113N8858p2818J5715K3186M0941M4370
20242D97316k8102K8865L2317o230q811P2074L3119K4594Q9892N5777J1011J03365
20230I05187N9750j06558m806N1536O6219J60409J38121J46872J98516J78405
20220A793651K15077L17065N29986O90215N44025K71909j00551l11767k7044K57655
20210D180221M48383O92461J006224J373375J233525Q80890R04094J083932J743009
20201A3546114K773616M051616N983487R301784J5004462K5761169M8008532Q8132094
20193B12562874J13352239N8463067k2007802q0472036r8620778o9788074l9597317
20186G3892173k2849081j4297042r555036o477776m368317l046308k224261j581506
$$ y = [169731, 218729, 253214, 241728, 292951, 387064, 445922, 373104, 388819, 412005, 452946, 497316, 469214, 498079, 530396, 524166, 515355, 587429, 620548, 645142, 735034, 790811, 801822, 905187, 964937, 858379, 853573, 905109, 971328, 1131737, 1269858, 1416730, 1615246, 1793651, 2008728, 2325793, 2855779, 3545994, 4090019, 4361928, 4261377, 3949610, 3922566, 4180221, 4628604, 5321065, 6327289, 7700664, 8934189, 9815079, 10719173, 11803105, 13546114, 16319730, 20371346, 26354833, 35656617, 50661079, 76422248, 124430780, 212562874, 325915113, 384378180, 362370378, 281898342, 183277564, 113489490, 73892173, 51043092, 36746050, 27191014, 20713238, 16344921, 13298613, 11074352, 9492846]
20178I492846j060458n27495k80599m76089o54935q05231p58455m02294n1934
20169D475356J82567K27940j23963m87245o73210o92922m38587k34785j77724
20160B057427j55178j34912j45930r7040n1747p9964j41852n368j7408q3607m4533
20149A099888o7671j4643j1945j7182r9483j43359j8793L30N2175p5857m9843
20138F53617r6592o6091P6248J00137j0116o3891p293n1037o8032P4802j600m0583
20126D99569k8658p6635M8916K4298j07944q478p264M6611L0443p073l4450n4772
20114C24563N5220J00155o4587p0765m4801l337O2652l7002k038L6490j0743N8458
20102D04265j6839k5776o48o0707N816n367l3578n570r245q8133l0101R7847m7103
$$ y = [9492846, 8432388, 7904893, 7624294, 7148205, 6493270, 5688039, 4929584, 4527290, 4475356, 4657923, 4885863, 4761900, 4274655, 3601445, 2908523, 2469936, 2235151, 2057427, 1902249, 1767337, 1621407, 1524367, 1472620, 1392656, 1250804, 1245436, 1228028, 1144421, 1099888, 1032217, 1017574, 1005629, 988447, 888964, 745605, 726812, 727142, 779317, 703460, 653617, 557025, 490934, 567182, 667319, 657203, 593312, 586019, 534982, 466950, 541752, 540152, 499569, 470911, 394276, 443192, 467490, 359546, 351068, 343804, 390415, 420858, 413785, 379335, 324563, 379783, 479938, 415351, 344586, 299785, 296448, 359100, 322098, 320060, 356550, 345807, 404265, 387426, 361650, 361002, 300295, 306111, 300744, 267166, 261596, 252351, 164218, 134117, 231964, 184861]
20089A84861L469J4542L6760p0599L4386r6540O795k3761j8078J1558m9790R8483
20077A32086Q0726L488Q39k3418M10R5135l6136k2737k588M2476j853P1049L3436
20064C72913r55N4629j31806m2759r8365o4022n5724L3165l8279p2439j0778n657
20052f0077N1688J3595O4471l020N4816P5967p706N433j5545n1905O046j9828
20040A13935j5947K0326K2609n5063m5033j5957O2025k2520o1271k1720l3238
20029e1854P091O1262j433M2915O2844M1493k4086j48386K1509R3565J6189l1383
20017H9726L4390l2644k4573L9048Q720q6654l6410J6969J0838Q7487P3613O343
20005A86853L9971p7322q7740r6314J8073O7965O4062o1257n0863q3631n6244
$$ y = [184861, 188330, 202872, 239632, 169033, 203419, 106879, 113674, 89913, 71835, 83393, 33603, 132086, 212812, 216300, 217139, 193721, 194131, 289266, 253130, 230393, 227805, 270281, 268428, 339477, 372913, 371958, 426587, 294781, 252022, 153657, 89635, 33911, 67076, 28797, -43642, -54420, -60077, -8389, 5206, 69677, 66657, 121473, 197440, 189734, 195167, 179622, 127717, 133763, 113935, 97988, 118314, 140923, 85860, 40827, 24870, 86895, 64375, 3104, -18616, -51854, -44763, 16499, 15066, 57981, 120825, 162318, 138232, -10154, 11355, 104920, 121109, 89726, 124116, 91472, 66899, 105947, 114667, 28013, -8397, 8572, 19410, 106897, 180510, 186853, 226824, 149502, 61762, -34552, -16479, 51486, 115548, 54291, 3428, -80203, -136447]
19994a36447L6760l363J5526M8119R1730O0432l2701l3663j8271P916L0028o6936
19982h70Q9668j5760J2736l8874M06k4598O6836j6447m3352N2568j9447k3232
19970C9634l8340o2465O6347j2613j6704M8676J48300M3499j96409o529J18191
19959A31587p6790m6326L2621L2041o4205j19652Q11M375N0102O7743m0100R871
19947a7922J4695L6994j7509l2663L0589M5433k9813j3590n0689M6512j3185l7406
19935c8554L5216L321k8801o731Q695M4847N166n346N4289N3892N031K8276l4357
19922A24944k8352l0539L5586Q068p0224m3977O2457N0953j709n5557j1654M1834
19910H1830j0680m3902M9875o1976l1573P2386J13035n6023l960k7281N9436K2634
$$ y = [-136447, -99687, -103050, -87524, -39405, 52325, 112757, 80056, 46393, 28122, 36038, 66066, -870, 88798, 73038, 85774, 46900, 47306, 22708, 89544, 73097, 29745, 82313, 62866, 39634, 1294, -61171, 5176, -7437, -24141, 24535, 172835, 216334, 19925, 13396, 131587, 54797, 8471, 41092, 73133, 8928, -110724, -109913, -105538, -55436, 12307, -27793, -17922, -3227, 33767, 16258, -16405, 14184, 59617, 29804, 16214, -34475, 12037, -1148, -38554, -3338, -17, -28818, -35549, -26854, 17993, 23159, 17813, 72102, 125994, 131025, 159301, 124944, 96592, 66053, 101639, 109707, 39483, -4494, 57963, 108916, 107207, 51650, 39996, 81830, 71150, 27248, 77123, 15147, -16426, 55960, 168995, 112972, 109012, 81731, 141167, 163801]
19898A63801l4668j29100k6908o9968R348M8674L7751j1009l6807J573k8200k2601
19886i8114N9059P8891o450m8785J7882L9230k3185r09K1951K1891l0610L9566
19874G0417J39860n2391l2082j6162p2080q660J7228m8185M6459k6410N4673P4451
19862A47118M5528Q323j5042k1683n9915n5711K8312q9694k2913Q3122P2850l961
19850A16334P2204P8814j2671N4981M0561m5652j8179k459M9486N7100K532j5444
19838C77607R8338Q0898K4925Q7918J5779j569Q9615j4544p0016r7254j04506
19827D87191j66596r00N8479k9492O4220J0839j0947J8023q4580q5814K031o0992
19815B01462M17L9918n1523k1200M8311n5692n8216j3189j2431q85n5992M1105
$$ y = [163801, 129133, 33, -26875, -96843, -87495, -38821, -1070, -12079, -48886, -47313, -75513, -98114, -39055, 39836, 33386, -15399, 2483, 41713, 18528, 17619, 39570, 61461, 30851, 70417, 210277, 157886, 125804, 109642, 37562, 28902, 46130, -2055, 44404, 17994, 72667, 147118, 192646, 200969, 185927, 164244, 104329, 48618, 76930, -12764, -35677, 47445, 120295, 116334, 188538, 267352, 254681, 309662, 350223, 304571, 286392, 283933, 333419, 390519, 393051, 377607, 475945, 556843, 581768, 669686, 685465, 683896, 773511, 758967, 688951, 591697, 487191, 320595, 319695, 378174, 348682, 412902, 423741, 412794, 430817, 346237, 260423, 262454, 201462, 201879, 241797, 190274, 169074, 217385, 161693, 103477, 90288, 77857, 76972, 20980, 62085]
19803F2085N2787q8915m0674P8424J8294r073M7250p69q3749k7519O9090n1575
19791B5656j071k8913O636j811L9945M0543L7784j4134n1466r1742j05172p629
19779a51374R095J6038P7566J4327J9613M6996n5441J5776L4136R036n9642M4737
19767B0863L698M118o7642j3706M0577l7905k6704P9074L7957Q605l6511n237
19755G187j3824k3416N482L3068L3236J06798J19673k5708m2454k4132k3407n3868
19743I8635L0445M7850R1447J0055L8583Q721k9378K2062j24853k6492l2057m3521
19731I1497O5742P3259J2921O9248n5585q1750j03507m6418Q7522N2803Q845n4843
19719A19734o2815l4498r390L4468L4681k4866l1837L6186L2444J4649k0277k1347
$$ y = [62085, 114872, 25957, -14717, 63707, 82001, 72928, 120178, 119409, 35660, 8141, 77231, 25656, 24585, -4328, 2308, 497, 40442, 80985, 118769, 104635, 53169, -38573, -143745, -151374, -142279, -126241, -48675, -34348, -14735, 32261, -23180, -7404, 26732, 35768, -23874, 20863, 24561, 28679, -38963, -52669, -12092, -49997, -76701, 2373, 40330, 48935, 12424, 7187, -6637, -30053, -24571, 8497, 41733, 148531, 268204, 242496, 200042, 175910, 152503, 98635, 129080, 176930, 268377, 278432, 317015, 325736, 296358, 318420, 193567, 167075, 135018, 91497, 157239, 230498, 243419, 312667, 257082, 175332, 71825, 25407, 112929, 165732, 174577, 119734, 56919, 22421, 13031, 47499, 82180, 57314, 25477, 61663, 94107, 108756, 88479, 67132]
19707F7132L8455J3325r964R2174M5145R256r0364n3869J10119J00527k4750m1458
19695B55728P6168K044M4364L0882j1883n2616q699m1154m8890q1942L5477O2742
19683B62221K2841q1995J2237L3680l7181m2090k9220q086M8686L3867m0722r544
19671A64694J0980j3472k2652p5505m3355K9652k4960o075L633k7643Q6531K0528
19659A02356m8720k095l809O945Q1125J7216k5579m7137K2440N5047O13l9557
19647A18845m8497P1112L4840n3452R978n8857j6754o3752k2627J8613J29549
19636A18998N60k6458k2725j6253q8575m3391n5753j1301N7685P8089K5350j04456
19624h8230m565k9473N99J16958J14309L6062n7232j2559M5053l3131m2940k8706
$$ y = [67132, 105587, 118912, 108948, 201122, 246267, 255523, 165159, 111290, 221409, 321936, 297186, 255728, 331896, 333940, 378304, 409186, 397303, 344687, 335988, 294834, 245944, 164002, 199479, 262221, 285062, 203067, 215304, 248984, 211803, 169713, 140493, 132407, 181093, 214960, 174238, 164694, 175674, 162202, 139550, 64045, 20690, 50342, 25382, 19307, 22940, -4703, 81828, 102356, 53636, 51541, 47732, 54677, 135802, 153018, 127439, 80302, 102742, 157789, 158402, 118845, 70348, 141460, 176300, 122848, 132826, 73969, 57215, -6537, -29164, -10551, 118998, 119558, 93100, 70375, 54122, -34453, -77844, -133597, -144898, -87213, -9124, 16226, -88230, -92795, -122268, -121669, -4711, 109598, 145660, 88428, 75869, 120922, 87791, 44851, 16145]
19612A6145J022N5577L0209j4906n4399p4916K690O7706l5938L1523N6247j1799
19600F9161O6238j2343m1695l2582O6207K7151K0995m0480l5939M9254k6375l2887
19588G6705Q2007J4492L0347K0533q1572p9717k5801K3292Q3635O8388N5863M763
19576B72935P5185J75053L09749J69092K36953J38241P696l7904j47905k40169
19566I58926j94717j72494j31753j23997p3021k5025n2955o1016k9669K4143K0244
19555A38666j550m5838L8685j4990p9191O1860N6443n0278P452m2582l8075L7415
19543F8017N8443m7233l5455M7959Q0008M2105n1162l33O0819L0004P570M2114
19531C02856K47p5916q1556K937N4609K6344L3958K8555M015J5508J3446P013
$$ y = [16145, 17167, 72744, 102953, 88047, 33648, -41268, -38578, 29128, -6810, 24713, 80960, 69161, 135399, 123056, 81361, 48779, 114986, 142137, 163132, 122652, 86713, 135967, 109592, 76705, 158712, 173204, 203551, 224084, 142512, 62795, 36994, 60286, 143921, 212309, 268172, 272935, 348120, 523173, 832922, 1002014, 1238967, 1377208, 1384904, 1347000, 1199095, 958926, 764209, 591715, 459962, 335965, 262944, 237919, 184964, 123948, 94279, 118422, 138666, 137116, 91278, 129963, 114973, 35782, 97642, 154085, 103807, 111259, 68677, 30602, 68017, 126460, 79227, 43772, 91731, 171739, 213844, 162682, 162349, 223168, 253172, 260742, 302856, 303103, 227187, 145631, 148568, 203177, 229521, 263479, 292034, 296049, 311557, 325003, 332016]
19519C32016j06815k902O1279n262L5043K1052j11836n9837L4L852Q1198N927
19507B53749k520q0852L746K4570l6106q0331n1098J01165J18919K7715m5335
19496B33622q8398q4166K170p0632k2130M0910N7057O6282K7501j7933l4736l273
19484A06274N0475J5557l1915p9382R454M4385q370j15748k560N5494M7961N1194
19472A42819Q106k058J9783O4242o7134k2910l9455k8297m324l9392L1866M6362
19460A09608J0114n2127L0217M2956j03988o9811M9538Q1799M7723n9303l4385
19449E2341j4124L9695J16178N2684r8516j14413L045j238o092M1495N1304L7079
19437A59438o216K1122q540L4012l3065J5223J238q530K9238l140o3075j2378
$$ y = [332016, 225201, 222299, 283578, 278316, 313359, 334411, 222575, 162738, 162772, 166624, 247822, 253749, 251229, 170377, 174123, 198693, 162587, 82256, 31158, 132323, 251242, 278957, 233622, 145224, 61058, 63228, -7404, -29534, 11376, 68433, 134715, 162216, 144283, 109547, 106274, 156749, 172306, 140391, 61009, 70463, 114848, 106478, -9270, -11830, 43664, 91625, 142819, 150925, 148867, 168650, 232892, 165758, 142848, 103393, 75096, 70772, 31380, 63246, 109608, 119722, 67595, 97812, 140768, 36780, -33031, 16507, 98306, 146029, 86726, 52341, 38217, 77912, 194090, 246774, 148258, 33845, 36890, 35652, 29560, 71055, 122359, 159438, 153222, 174344, 165804, 199816, 166751, 181974, 183212, 174682, 203920, 200780, 137705, 125327]
19425A25327n9115M6020M1487M3405L3479M1786k9452l8350j32334j15312P0807
19414B7748J08172N57K0371k488L258P3341m8659p1073k3073J31062Q9834m4241
19402B64809j81008j12297M6457Q4443N6437r147M4053J2430m9262K5585K503
19391A85003J7989P3973n8031n0370Q3292R2754J7891M4851p6167j25711M8351
19380B53825L052O2389L1597K8660M9041J45386L0209n5939l2876k0804k5239
19369D69301j415P0999m6858q811j9834k8642J5105p464J4052j3025K5143O7084
19357E35635P0284m6548Q21J08676J03755K4284N2786P5269J45773N1162R041
19346A130938O5234R3261J34070J19166J68128J70313K47499L89346L16934J96765
$$ y = [125327, 66212, 112232, 153719, 197124, 230603, 272389, 242937, 204587, 72253, -43059, 27748, 135920, 136477, 156848, 154360, 157618, 230959, 182300, 111227, 88154, 219216, 309050, 264809, 83801, -28496, 17961, 102404, 158841, 149694, 193747, 206177, 156915, 182500, 185003, 202992, 276965, 218934, 168564, 251856, 344610, 362501, 407352, 331185, 205474, 253825, 256877, 319266, 350863, 379523, 428564, 573950, 604159, 548220, 515344, 494540, 469301, 467886, 538885, 492027, 483216, 463382, 434740, 449845, 442381, 456433, 443408, 468551, 535635, 605919, 559371, 560192, 668868, 772623, 796907, 849693, 924962, 1070735, 1121897, 1130938, 1196172, 1289433, 1423503, 1542669, 1710797, 1881110, 2128609, 2517955, 2834889, 3031654]
19336C031654K88682L19796M70802N39102O35540P63400R27994J271519J797164
19327A0045653K617466M190252O639632R444587R868714O286776K349435P09349
19319E2151864K570978N231108M051586J613876J786544P068221J6697121K0060271
19311A11231569J1982319L282939k737909n044565n306765r434707j4960549j5941096
19303G3071236j2726294n434575L874424J1171781R761470L430425q01125m102374
19295G8244968o891827r896435j2580470j2876873r973183o592387m249857k550281
19287A2633655j511710j084573r30022r57923r76008r03521p08685o24210l96052
19278D540951l65259m07753k98948k35615j43095j64100j75768r8300n2868J51112
$$ y = [3031654, 3320336, 3640132, 4110934, 4650036, 5285576, 6048976, 6976970, 8248489, 10045653, 12663119, 16853371, 23493003, 32937590, 42806304, 49093080, 51442515, 52151864, 54722842, 59953950, 64005536, 65619412, 67405956, 74474177, 91171298, 111231569, 123213888, 126496827, 123758918, 118714353, 113407588, 103972881, 89012332, 73071236, 60344942, 54910367, 58784791, 69956572, 79718042, 83148467, 82347342, 78244968, 71353141, 61456706, 48876236, 35999363, 26026180, 19433793, 15183936, 12633655, 11121945, 10037372, 9107350, 8149427, 7173419, 6269898, 5561213, 4937003, 4540951, 4175692, 3767939, 3468991, 3233376, 3090281, 2926181, 2750413, 2652113, 2599245, 2750357]
19268B750357J85506N4169r1660j87890k29227j65655j55807p5923k3817N1974
19258B112027Q1719O9909P2430J17700J28514M9066O7176R9198J77119J54127
19248C128985J35615J57582L14296K94858L37461M94987O69241Q06803J226646
19239G566474J720862K510561L991072O561841R750063J0194544N060706j530474
19231D5825649o440927p986942n795488k551048L42011L574837P819498J3540137
19223D8327727J7709150J3919022J619131r984807j6635723j5970203j0738256
19216B8246041o206852l393278j407258O91342L178595O526593Q620014N255527
19208D1510724r77377o055607q661186p012066m344850k534393j503801q63964
$$ y = [2750357, 2935863, 2990032, 2898372, 2710482, 2481255, 2315600, 2159793, 2083870, 2060053, 2112027, 2193746, 2263655, 2336085, 2453785, 2582299, 2631365, 2698541, 2797739, 2974858, 3128985, 3264600, 3422182, 3736478, 4031336, 4368797, 4863784, 5533025, 6339828, 7566474, 9287336, 11797897, 15788969, 22350810, 32100873, 42295417, 47356123, 45825649, 39384722, 31397780, 25602292, 23051244, 23393255, 26968092, 34787590, 48327727, 66036877, 79955899, 81575030, 71590223, 54954500, 38984297, 28246041, 22039189, 18645911, 17238653, 17929995, 21108590, 27635183, 36255197, 41510724, 40533347, 34477740, 25816554, 18804488, 14459638, 11925245, 10421444, 9557480]
19200I557480m07866O8971L85432O58898J139399J733896K561338M271507P135612
19191B7104667J0600479J0893757N175359j804791p001919q070970m817667m74301
19183C1604614M007842Q858923J2877695J2759537R791143L492314n773903j1531077
19175F6087088j3897748j2442355q274528m517769j462411J653127N242844Q340155
19167D0728403P000100P26118n425012r497312r392768o587161m208497k754077
19159A0589794j972354j353358r07087o00089m40734l60173j97423k76855l46188
19150D135533l34947l69018j97390O2388J23979J51516J5006k5563m1279j33045
19140C387180l12012l73610l72953k04926m2527m8442P9462L08025L12577L10222
$$ y = [9557480, 9149614, 9218585, 9604017, 10262915, 11402314, 13136210, 15697548, 19969055, 27104667, 37705146, 48598903, 53774262, 51969471, 44967552, 36896582, 32078915, 31604614, 35612456, 44471379, 57349074, 70108611, 79899754, 83392068, 77618165, 66087088, 52189340, 39746985, 31472457, 26954688, 25492277, 27145404, 32388248, 40728403, 47728503, 48454621, 43029609, 33532297, 24139529, 17552368, 13343871, 10589794, 8617440, 7264082, 6356995, 5756906, 5316172, 4955999, 4758576, 4481721, 4135533, 3800586, 3431568, 3234178, 3296566, 3420545, 3572061, 3587067, 3561504, 3520225, 3387180, 3075168, 2701558, 2328605, 2123679, 2081152, 2032710, 2112172, 2420197, 2732774, 3042996]
19130C042996K35358L15663M54891M39683M37621L24079J88964J29258p0286l63526
19120E134701n55294n83310n14117m36194m50232m07674k61842m5271j3748j1515
19110A855504j58615k78031j69763N9691J29840J73482O8044M2036j31886k21660
19100A368642k23433j72684r7767q1570K1787R7769j3631n4074j65331p9538o4383
19089E35787L0744O7693L8361J5904p1275r6861Q9116kr0337M35J752K2320J3160
19076E56797q9424j41230K322N3918K4435r936l5407J97J0806k8797J1178p309
19064C47550k4340k8613J7646J6264q0774J3j68k3439o6072N6279J08960Q087
19052C31393j3808P4666J19550J3803j06859j45227L6995m0036J7536j2071m6429
$$ y = [3042996, 3278354, 3594017, 4048908, 4488591, 4926212, 5250291, 5439255, 5568513, 5498227, 5134701, 4579407, 3996097, 3481980, 3045786, 2595554, 2187880, 1926038, 1880767, 1867019, 1855504, 1696889, 1418858, 1249095, 1308786, 1438626, 1612108, 1680152, 1722188, 1590302, 1368642, 1145209, 972525, 874758, 793188, 814975, 912744, 899113, 845039, 679708, 600170, 535787, 566531, 634224, 672585, 688489, 617214, 520353, 609469, 609467, 519130, 519565, 521317, 543637, 556797, 467373, 326143, 328465, 382383, 406818, 396882, 361475, 361672, 372478, 343681, 354859, 347550, 323210, 294597, 312243, 328507, 247733, 247746, 247578, 224139, 158067, 214346, 323306, 331393, 317585, 392251, 511801, 525604, 418745, 273518, 310513, 270477, 288013, 275942, 229513]
19041B29513L130l8967k3352m685M4017J4076r7648j092R7894n3009j8708J34017
19029B85186M9623J0816p3021o4598L7649l3769m1995M5514J0829K4704K4999
19018B75937p5541l7311O2648K5358n3912k4731K0357q735K1017p8395j01l7182
19006H9409K7485O427P3756Q5345l2396j9114m7283L1939m8559J01180K7509n7183
18994B38515p4580j1916M3341K6601N3076J769J263m0810q316p3699K6110Q7033
18982B68387J3369l5471j6069L4200k2098l3059Q377L7054j1511j0802k1291q1960
18970A29126p506J01708q4426k5674n4496J10588J00225q9957j20592m9230P6702
18959H6468M6800k8011J4727l706M4182J5762n5128j4392j6813l180M7184m809
$$ y = [229513, 232643, 193676, 170324, 165639, 209656, 223732, 126084, 124992, 222886, 169877, 151169, 285186, 334809, 345625, 272604, 208006, 245655, 211886, 169891, 215405, 226234, 250938, 275937, 200396, 163085, 225733, 251091, 197179, 172448, 192805, 184070, 205087, 126692, 126591, 89409, 116894, 123321, 197077, 282422, 250026, 230912, 183629, 215568, 167009, 268189, 295698, 238515, 163935, 152019, 195360, 221961, 275037, 276806, 278069, 237259, 228943, 155244, 181354, 268387, 281756, 246285, 230216, 264416, 242318, 209259, 217636, 254690, 243179, 232377, 211086, 129126, 121620, 223328, 138902, 113228, 58732, 169320, 269545, 179588, 58996, 9766, 86468, 133268, 105257, 119984, 116278, 160460, 176222, 121094, 106702, 89889, 86709, 133893, 129084]
18947A29084j0911n4489L0638O5531M1804k3476K5716j1945m5288p3565j0728
18936F2371m6344N6326R9109l0967m5309j9682k4226R8544J1595l6061M752J6027
18924A46135j8064j3581M0538K7561r1681o4106R901L9066M6422N8915n5134o0108
18912F5864R6340O9532J9803J5339j2707k1770N2525K694J0661j0403O5367K4901
18900C78146p6421n4269K3883l7981q4678M5524N2648N3223o2184P397Q660l167
18888B50781M5807k9931m0198k7993m5794J9729n8891r8817L6384J02835L6550
18877A90462L0594P091p5049J5492O4972j5143m9595N4434J85002J48007J33617
18866F89884J05829r5030r0080l0557K1519O1991O6989J30151J16611J5518r9208
$$ y = [129084, 118173, 63684, 94322, 159853, 201657, 178181, 203897, 191952, 146664, 73099, 62371, 16027, 72353, 171462, 140495, 95186, 75504, 51278, 149822, 161417, 125356, 130108, 146135, 128071, 114490, 155028, 182589, 90908, 26802, 36703, 75769, 122191, 181106, 125972, 65864, 162204, 231736, 251539, 266878, 254171, 232401, 284926, 287620, 298281, 287878, 353245, 378146, 301725, 247456, 271339, 233358, 148680, 194204, 246852, 300075, 237891, 245288, 253948, 250781, 296588, 266657, 226459, 198466, 152672, 172401, 113510, 14693, 51077, 153912, 190462, 221056, 228147, 153098, 168590, 233562, 218419, 168824, 223258, 408260, 556267, 689884, 795713, 700683, 610603, 580046, 601565, 663556, 730545, 860696, 977307, 992825, 893617]
18855H93617o5524Q903K9723m4681p1493O062m8480j30493J2216J15697J45867
18844H51414Q20j19921j88130j25994j31827j27560L6874R8962k2192j16006n5816
18833A00624N3603O6984l923O450o0925N1657J06823M4187j336m0658q6592j8117
18821B18777M7501R0229O7784P5756J59354J74362J20302j5287j45215r1393j01903
18810F00267m2632J49276J62296O2866k9711j0520l2706P6677K02295J9131r3273
18799A063966n3032p4773q9690j03014L5710J74186J7409n0883q7379r9397j02320
18788F30783p6976R2381R8000k4947P643M6991k6043l8670Q3452Q5883k9658K4658
18776H73497m1404p8637k1513J1679m2561p7436o5184n965Q2921o2773l5174j4870
$$ y = [893617, 828093, 836996, 866719, 822038, 750545, 756607, 708127, 577634, 589850, 705547, 851414, 852234, 732313, 544183, 418189, 286362, 158802, 195676, 294638, 272446, 156440, 100624, 154227, 221211, 217288, 223738, 162813, 214470, 321293, 365480, 364144, 323486, 236894, 218777, 266278, 356507, 424291, 500047, 659401, 833763, 954065, 938778, 793563, 702170, 600267, 557635, 706911, 869207, 932073, 902362, 891842, 859136, 935813, 1138108, 1157239, 1063966, 1010934, 936161, 846471, 743457, 779167, 953353, 970762, 919879, 832500, 733103, 630783, 553807, 646188, 744188, 719241, 726884, 773875, 747832, 709162, 792614, 878497, 848839, 873497, 832093, 753456, 731943, 743622, 701061, 623625, 558441, 552476, 635397, 572624, 537450, 522580]
18764E22580J6988k1085j7707p8291o6746K4417l7214q638N9377L6567L3802n2690
18752D11360p7335L534J79744L2701m7769k8588r487L5913R4669J180m5155l4466
18740E16301j0123L1851R8236L4744M5417m7710k8555J20363O6217L7916m343
18729H60314N5303J03326Q6019L0428J34783J13129J39600J78493J54707J78163
18719B034265J67055N20714Q46604J257334J905443K210211J357693j00193j211693
18710H987433j604917j021319l09418L46665J097137K223595M012287O253166
18702A9984629O572611K751647j923064n246533n932770m227994k441296j220969
18694H316261k72420M05962J316436K841941M555783M209661J056113j917693
$$ y = [522580, 539568, 518483, 500776, 422485, 355739, 380156, 342942, 334304, 393681, 430248, 464050, 411360, 334025, 337559, 517303, 550004, 502235, 473647, 464160, 500073, 594742, 595922, 550767, 516301, 506178, 538029, 636265, 671009, 716426, 668716, 640161, 760524, 826741, 864657, 860314, 915617, 1018943, 1104962, 1135390, 1270173, 1383302, 1522902, 1701395, 1856102, 2034265, 2201320, 2722034, 3568638, 4825972, 6731415, 8941626, 10299319, 10199126, 8987433, 7382516, 6361197, 6051779, 6398444, 7495581, 9719176, 13731463, 19984629, 26557240, 29308887, 27385823, 22139290, 16206520, 11978526, 9537230, 8316261, 8043841, 8449803, 9766239, 12608180, 17163963, 21373624, 22429737, 20512044]
18686B0512044m012839m034568k755410j595046r16350m74475j92639m512J41135
18677F667340K25540L36839N01239P00202Q45449J080966J349208J849668K523853
18668A6080304L297626M744258P336319J1660839J7657373K0132102J2032719
18661I2941540m44119j0318770j4256975j0339536m024823K164022Q925656J8103738
18653H2750733L1458645M5306400M5770771K7352977j288362k6138134l3397868
18646A71815162k4146101q966698k945437p674236j3432436j5253855r130331
18639I0266068J63788K479741m006699j1459478j6529944j5791314j1369516p364869
18631B6387777m720014l229644k223998j667438j272810q78525o10267n18307
$$ y = [20512044, 16499205, 12464637, 9709227, 8114181, 7197831, 6723356, 6530717, 6526205, 6667340, 6892880, 7229719, 7730958, 8431160, 9276609, 10357575, 11706783, 13556451, 16080304, 19377930, 24122188, 31458507, 43119346, 60776719, 80908821, 92941540, 92497421, 82178651, 67921676, 57582140, 53557317, 55721339, 64646995, 82750733, 114209378, 159515778, 205286549, 232639526, 231351164, 205213030, 171815162, 147669061, 138702363, 135756926, 128082690, 114650254, 99396399, 90266068, 90429856, 92909597, 88902898, 77443420, 60913476, 45122162, 33752646, 26387777, 21667763, 18438119, 16214121, 14546683, 13273873, 12395348, 11785081, 11266774]
18623A1266774l87419m04480m01282m73230m44464j05487J54662K91099N40581
18614A0036754Q38298J200888J737246K465491L853474O113704R756659J5020686
18606E1023200J8121045J4037123P767864M083825O35337m857586r921709j3684389
18598F7204710j4593765j1900555q835184o338794l753369k424064k377123k552046
18590A4429810k716612k355865j696188j121756p69686n99756m38450l10561k01469
18581D219467j91565j32219j57284R7P8145j8638N8963K96352M58498L20763P3717
18570E006296k25349m19597l34999l13375k00271N5260P7287J18692K76676L39053
18560D379673N84796J035572J710044K838488M591966N648211L921266J678568
$$ y = [11266774, 10879355, 10474875, 10073593, 9600363, 9155899, 9050412, 9205074, 9496173, 10036754, 10875052, 12075940, 13813186, 16278677, 20132151, 26245855, 36002514, 51023200, 69144245, 83181368, 90949232, 95033057, 95668394, 90810808, 80889099, 67204710, 52610945, 40710390, 31875206, 25536412, 21783043, 19358979, 16981856, 14429810, 11713198, 9357333, 7661145, 6539389, 5769703, 5169947, 4731497, 4420936, 4219467, 4027902, 3895683, 3738399, 3738496, 3816641, 3798003, 3856966, 4153318, 4611816, 4932579, 5006296, 4780947, 4361350, 4026351, 3712976, 3512705, 3567965, 3645252, 3763944, 4040620, 4379673, 4964469, 6000041, 7710085, 10548573, 15140539, 20788750, 24710016, 26388584]
18552B6388584O68363j66938j925296l576243m889166m890579l415021k115519
18544F078185j347038r22416o61520m06552k54050k38117k81119j90568q7813
18535A688992k7176j00750q0032m280n2596n9829j16109j4992J60923M7323J9251
18524A460725M4857J57066K29177J22424o7055j26780k03003k44634k84531j90956
18514H97290j49252l5387J1225N8135O4746j4348K2014o1202j34286k5062M6510
18503F80383L8798J6356k1826K1912O1213J1253m1059o0908o1695o2951q3040
18492D98436l8690P152L1742L6567m6905o8010q357Q118n2252N1736j846k5510
18480C92181r224l721m052k1817j5574Q253p799o527J9525l058j09780k5681Q876
$$ y = [26388584, 27056947, 26890009, 24964713, 21388470, 16499304, 11608725, 8193704, 6078185, 4731147, 3808731, 3147211, 2740659, 2486609, 2248492, 1967373, 1776805, 1688992, 1661816, 1561066, 1481034, 1476754, 1424158, 1364329, 1248220, 1233228, 1394151, 1441474, 1460725, 1505582, 1662648, 1891825, 2014249, 1947194, 1820414, 1617411, 1372777, 1088246, 897290, 748038, 712651, 723876, 782011, 846757, 832409, 854423, 793221, 658935, 633873, 680383, 719181, 735537, 713711, 735623, 796836, 808089, 767030, 706122, 644427, 581476, 498436, 459746, 466898, 498640, 535207, 488302, 420292, 411935, 420053, 367801, 419537, 417691, 392181, 382957, 379236, 375184, 353367, 337793, 346046, 338247, 331720, 351245, 348187, 238407, 212726, 221602]
18467B21602O0013N343K470K3974m33O4842m9799q1223k6472O541n4762o3291
18455A08805K2703N0527O9481K4149K4264J6321J181l2754p4223q6522m6903l625
18443G3404R3922n845q811P092O4758M7345j4799p047O3257l8597m8033j0442
18431B16204R8141K7338J0323k1620J9683o558l2854j3134M4993J3543q4098l0750
18419B41211K6583j4013L749L2483l3401p6702r775m1099j2393k9740n2546n9588
18407b5231L0397P1689M1533M4944N162L9617n614o6778l5993N1610J7313N536
18395A74185k592J3290L5767N7041k4446p5614J803N433o183N825k1321J9614
18383A82802L4280p8544m0044r1981J8476L8435R1153q717N2462J259n2779K5191
$$ y = [221602, 281615, 286958, 289428, 313402, 312969, 377811, 328012, 246789, 220317, 226858, 172096, 108805, 131508, 182035, 251516, 275665, 299929, 316250, 317431, 284677, 210454, 123932, 77029, 73404, 167326, 161481, 152670, 159762, 224520, 271865, 257066, 250019, 313276, 274679, 226646, 216204, 314345, 341683, 352006, 330386, 350069, 343511, 310657, 297523, 342516, 356059, 271961, 241211, 267794, 253781, 257530, 290013, 256612, 179910, 170135, 129036, 116643, 86903, 34357, -25231, 5166, 76855, 118388, 163332, 168494, 208111, 202497, 135719, 99726, 151336, 168649, 174185, 171593, 184883, 220650, 277691, 253245, 177631, 179434, 184867, 178684, 184509, 163188, 182802, 217082, 138538, 98494, 6513, 24989, 63424, 154577, 145860, 198322, 199581, 146802, 171993]
18371A71993J3510k2329L5270N3575K3986m7772j2961k621o6818K6938L0191L7067
18359B40029o3617n2700k0348M1972K7044N6178P4284K7525n2981q8779l8811
18348A49796O954N0700Q015l9939n0722M2908J5611o0561J0221m8278n0958P7493
18336A11240K8458L7007o7400o2718J2316K3422p6492J4861P4312l546n0588q828
18324C2044o6454r481O1794N6205L2987J1140l8543J3757K9916L029k2393K7306
18312A31307P58j1149l5721L1979n2711j01332p1757K673L0783P2735Q4954k7043
18300E5476l4543Q5502K505j5964j03966k3020J4194N3485R4105L5391l4385p5255
18288E3525j3422N4487N8169r232q875k0009J3342k9393p3182J9025k4302N5738
$$ y = [171993, 185503, 163174, 198444, 252019, 276005, 228233, 215272, 212651, 145833, 172771, 202962, 240029, 176412, 123712, 103364, 145336, 172380, 228558, 302842, 330367, 277386, 188607, 149796, 156750, 207450, 215465, 175526, 124804, 167712, 183323, 122762, 132983, 84705, 33747, 111240, 139698, 176705, 109305, 46587, 58903, 82325, 5833, 20694, 95006, 91460, 40872, 32044, -34410, -43891, 17903, 74108, 107095, 118235, 79692, 93449, 123365, 126394, 104001, 131307, 132065, 120916, 85195, 117174, 64463, -36869, -108626, -105953, -75170, -2435, 82519, 55476, 20933, 106435, 108940, 92976, -10990, -34010, -19816, 33669, 127774, 163165, 128780, 53525, 40103, 94590, 152759, 143527, 134652, 114643, 127985, 98592, 25410, 44435, 20133, 75871]
18276G5871J48704J0394m8001p6983m059j7361O4315Q4825k4144R008q9386j31291
18264A892k4149O7865j197N8530l3694J836N285n9493l4660N7407l445O488J2241
18251E4906m6417m8876M0006O5389m0326P377P1797o6330l7526L6421R5569M4850
18239A76840J9960j03823n1421k6864J823L7848K2700N4955l5424K3890L8768
18228A59252k0800m6582Q880q2155L4276N9765J2909K212j26422o1087N569L4607
18216a9576j7177K7397J01970N9017j9784j19118J9532K9652K4983l5798q7225
18205c6127k9087J741M7731Q0852k575J9467J0705k6130L39M5065J8081l7613
18193I2449k8134N9490J7974J04599P7940j3656m0814K1355q3122j10831j2914
$$ y = [75871, 224575, 234969, 186968, 109985, 105926, 88565, 152880, 237705, 213561, 222569, 133183, 1892, -22257, 45608, 44411, 102941, 69247, 71083, 76368, 16875, -17785, 39622, 36177, 42665, 54906, 8489, -40387, -381, 65008, 24682, 32059, 103856, 37526, 0, 36421, 131990, 176840, 196800, 92977, 41556, 14692, 16515, 54363, 77063, 132018, 96594, 120484, 159252, 138452, 91870, 100750, 18595, 52871, 112636, 125545, 127757, 1335, -59752, -54183, -19576, -36753, -9356, 92614, 151631, 131847, 12729, 32261, 61913, 86896, 51098, -36127, -65214, -63473, -15742, 65110, 62535, 82002, 92707, 66577, 66916, 111981, 130062, 92449, 64315, 123805, 141779, 246378, 324318, 310662, 269848, 291203, 208081, 97250, 84336]
18182H4336O7856R4457q883r5097K3263N8930l4501n3660q346J8274J848P2243
18170B20720l108n9836k0254L2934L9749o830k7764q325M2476L6667K9567M639
18158B80635L1293L8205L7330m0552L0876Q1417q6506j40338k155J7671M9186
18147B97062N6157O3497K0383L4246r4709k5162k0999k3785m343L5165J8177M4589
18135D00278J2237M8050J7917p0953q1362l021K2894L1387P1380q9860n1947q7340
18123B19660k9542m7966N3540O8179q876j9863p1397K0195J09735L4896p2723
18112B55838R574L287j01521M6636j2375L5144M5183k0279r3612L6538N5016K9056
18100B88485L8288n0438j2156N7919K1634P1336J7141p5838q70K3462l4599J23805
$$ y = [84336, 152192, 246649, 237766, 142669, 165932, 224862, 190361, 136701, 128355, 146629, 148477, 220720, 217612, 157776, 137522, 170456, 210205, 203375, 175611, 167286, 209762, 246429, 275996, 280635, 311928, 350133, 387463, 346911, 377787, 459204, 372698, 232360, 230205, 247876, 297062, 353219, 416716, 437099, 471345, 376636, 351474, 330475, 306690, 302347, 337512, 355689, 400278, 412515, 460565, 478482, 407529, 326167, 323146, 346040, 377427, 448807, 358947, 307000, 219660, 190118, 142152, 195692, 263871, 254995, 235132, 163735, 183930, 293665, 328561, 255838, 265412, 268699, 167178, 213814, 201439, 236583, 281766, 261487, 167875, 204413, 259429, 288485, 326773, 276335, 264179, 322098, 343732, 415068, 432209, 356371, 355501, 378963, 344364, 468169]
18088D68169L1142M9395R3369M553p276J4785o5538n3237o5457o1283p9104o1054
18076B68464K3749K2524o589m2289j56608o2676m7358J6505P5802M4889l3258
18065A03155K5522K0907J5960J4910j6038j2902l6793n0882O9210J8774M358J8720
18053A74901K447q3524n9818m5856k7671K7435L6014P1917K4296O6776R378l7376
18041A58919m3445N9042K0316j2867k7809O9043R8478K8394M8259q0800p5378
18030B42152J050n7413q9925k1598L374J8060n9246m503P8936P0049j2328k7044
18018A41564j2047q1658o8830K920J12411k772L1759n7096m5712l9038n216M7816
18006B4101K3052K3874k929J8743M3809M7190j5243o7606l5020L0150j7898k8617
$$ y = [468169, 499311, 548706, 642075, 646628, 639352, 654137, 588599, 535362, 469905, 408622, 329518, 268464, 292213, 314737, 308148, 265859, 109251, 46575, -783, 15722, 91524, 136413, 103155, 128677, 149584, 165544, 180454, 164416, 151514, 114721, 63839, 133049, 151823, 156181, 174901, 177348, 93824, 34006, -11850, -39521, -12086, 23928, 95845, 120141, 186917, 196295, 158919, 115474, 174516, 194832, 181965, 154156, 223199, 321677, 350071, 398330, 317530, 242152, 243202, 185789, 95864, 74266, 77640, 95700, 36454, 31951, 110887, 180936, 168608, 141564, 129517, 47859, -20971, -18051, 94360, 91588, 123347, 66251, 20539, -18499, -23715, 24101, 47153, 71027, 68098, 86841, 130650, 177840, 162597, 94991, 59971, 90121, 72223, 43606]
17994D3606m371L935K0177K6957r055j4887M4036K540n2145o5694j3368P5013
17982E6744k5840O573Q3651K562R220L7252q053m6620o9740Q964k0829j8377J897
17969A7404J5257J7335m7218m1261J2925L7357M9067M1068R150M6128q487l2525
17957A16200o7763K6655J02024m7787j5982K2946p6047l5441p9227P631O0345
17946A3554K5333p6475o2498k3909L1597Q3739J8687l8186P2129j3780j43407
17935a13216m9097N0943P8937P2641L5947j12074l9751k2194M3811O2298k5672
17924a7427J2040Q4651L7919j00393j3919K8847j0282L3054L6473K2714k9233
17913H4444o9399Q6680o9093q0628L520L0561J1711R5280K8202q4858m4848K3371
$$ y = [43606, 39235, 43170, 63347, 90304, 81249, 66362, 110398, 112938, 60793, -4901, -18269, 56744, 30904, 37477, 121128, 123690, 132910, 170162, 162109, 115489, 45749, 54713, 33884, 15507, 17404, 32661, 49996, 2778, -38483, -25558, 11799, 60866, 101934, 111084, 157212, 148725, 116200, 48437, 75092, 177116, 129329, 113347, 136293, 60246, 24805, -54422, -46791, 13554, 38887, -37588, -100086, -123995, -92398, -8659, 10028, -28158, 43971, 30191, -113216, -162313, -111370, -32433, 40208, 76155, -35919, -75670, -97864, -54053, 8245, -17427, -5387, 79264, 117183, 16790, 2871, 31718, 21436, 54490, 90963, 113677, 84444, 15045, 101725, 32632, -47996, -44476, -13915, -2204, 93076, 121278, 36420, -8428, 14943]
17901A4943K0750P3950K2709l7029o9767j000k2618k2519o4151o6589P9732N7863
17889a3726j5523J0966k4135R714M4151k5272N2544O0038j743l5770K7643L5331
17877A24218J5222r6349n1286Q4023M2892Q8840J46020P8226k4133p9845o4105
17866B63723j06540j26511k2758k7119o8306O0179K8420q7823k9585j4272j3962
17855a44554Q0399M4034j3076j0248O0430m2652j9934R8243M6426j38209m6659
17844h5800O322J20079L8858n6738R954J1511K4097l8592j06924k7115K31K4192
17832g9925M824j1375K5386O1345n8869N265N193j12419k2081N0484P8537J2116
17820d1519J21489O5036P632o1612k1053O871J7900p3445k5733o649j0123Q2757
$$ y = [14943, 35693, 109643, 132352, 95323, 25556, 24556, 1938, -20581, -84732, -151321, -71589, -13726, -29249, -18283, -42418, -32704, 11447, -13825, 38719, 98757, 97014, 61244, 88887, 124218, 139440, 43091, -8195, 75828, 118720, 207560, 353580, 431806, 407673, 327828, 263723, 157183, 30672, 7914, -19205, -87511, -27332, 1088, -86735, -116320, -130592, -144554, -64155, -20121, -33197, -43445, 16985, -25667, -45601, 52642, 99068, -39141, -85800, -79478, 40601, 79459, 22721, 32675, 44186, 68283, 29691, -77233, -104348, -104117, -79925, -75101, -86476, -61090, 255, -58614, -53349, -48156, -160575, -182656, -132172, -53635, -41519, 79970, 145006, 152638, 91026, 69973, 76844, 94744, 21299, -4434, -11083, -21206, 61551]
17808F1551J09q1023L3460l4636l2089l3323J2312R4114P3106L6719j6341j10963
17796B996r6182K3084J2874K0107J1119K4622N1650p6014k9772o9856j4470O1158
17784g8684Q1687L696O8519m5815p4646P0790L0772l3274J1829J4936N0991J00820
17772B01621l0313j52586j4556K9174l2469J4011L1723k9659m2121p957L139k559
17760c2552L9413M4887R84n9562k0028o010R468N1343L6377k4781p4695k0689
17748e5845m3491m0767K2692J1962J9807j5301L8084P3136Q708m8466K6697K9175
17736B6391O4352k9495k7373o3832r15M2895M5336M7535p8060p4799M9858k5434
17724b3541K1347O0787n134P533K189j5793J5726J1260k6272J4352k0970k3846
$$ y = [61551, 61660, -19363, 14097, -20539, -52628, -85951, -73639, 20475, 93581, 130300, 113959, 2996, -93186, -70102, -57228, -37121, -26002, -1380, 50270, -25744, -55516, -125372, -139842, -78684, 3003, 6699, 75218, 29403, -45243, 25547, 56319, 23045, 34874, 49810, 100801, 201621, 171308, 18722, 4166, 33340, 871, 14882, 46605, 16946, -25175, -33132, -29993, -32552, 6861, 51748, 52732, -6830, -26858, -32868, -23400, 27943, 64320, 39539, -35156, -55845, -99336, -140103, -117411, -105449, -85642, -100943, -62859, 10277, 18985, -29481, -2784, 26391, 90743, 61248, 33875, -29957, -30872, 12023, 57359, 104894, 26834, -47965, 1893, -23541, -2194, 58593, 53459, 60992, 63181, 47388, 63114, 74374, 48102, 62454, 41484, 17638]
17712A7638o3987M903k0226K1931l2655o49k3321N960k0476R8841R3550m891j07357
17699c0739n9235K6257j2725j7420J7049N3621M3322j4546j7978j4720L4758O3643
17687G1287l137p5260J5832L5242M3707K09l3689L4997L9634j08459j00585o656
17675h6878N9524l1129L9961j276K601k8166M4816o8454j00808J3163N2316o6836
17663a71166j217P4701R0097P6128j3623m222L7761N2444l1452j49222J141N3218
17651A4588J2108k3158n220P100M6713O5423m6783j2473j06703K1644j4251M7743
17639F731J0079J0446m5689l998m9223l2628P6374P023J8768N5715j23359k0472
17627i0233N2940p974Q1096P8812j4393l6885r333l6085l1171J1750K6213l1749
$$ y = [17638, -46349, -41446, -61672, -39741, -72396, -73045, -96366, -90406, -110882, -12041, 81509, 76618, -30739, -89974, -63717, -76442, -93862, -76813, -23192, 20130, 5584, -12394, -27114, 7644, 71287, 68150, -7110, 8722, 43964, 87671, 87880, 54191, 89188, 128822, 20363, -80222, -86878, -27354, -58483, -18522, -19798, -17197, -45363, -547, -69001, -169809, -156646, -104330, -171166, -172383, -97682, -7585, 68543, 54920, 50698, 88459, 140903, 109451, -39771, -38630, 14588, 26696, 3538, -1682, 5418, 52131, 117554, 70771, 58298, -48405, -26761, -41012, 6731, 16810, 27256, -18433, -22431, -71654, -104282, -27908, -20885, -2117, 53598, -69761, -90233, -37293, -45267, 35829, 114641, 100248, 63363, 54030, 17945, -13226, -1476, 24737, -7012]
17615g012r7723K9341N2984k335M5031J6863j0334L000m1884K705K3699N6358
17603G0693L0735K6059J2489k1776r7545k539l2820p8573p072L0386O2401R650
17591B088k1322j4212j8400R446N9608k0342M3405j5423j9626O6247P1058m411
17579A38116L6174l9327L0109O0020n1728m2161m5316J8832k321k4376j13657
17568c5635j5827O7113N2516L734M7547l9291n9824m2344J2830L2802K490l0642
17556d531j0577j1431P0312O1271l7579k2619l2296N5127L3126p8280n5589k3838
17544e6904M5387l5320n0864j2392k0852j5Q6029J5914N243r532m7601P559k9449
17531a02797l5957N0368L4814p533m045j6728r376O207l0314l6519N2600j240
$$ y = [-7012, -104735, -75394, -22410, -24745, 20286, 37149, 26815, 29815, -12069, -9364, 14335, 70693, 101428, 127487, 139976, 118200, 20655, 18116, -14704, -93277, -100349, -69963, -7562, 2088, -19234, -33446, -51846, -42400, 17208, -3134, 40271, 24848, 5222, 71469, 142527, 138116, 174290, 134963, 165072, 225092, 173364, 131203, 85887, 104719, 102398, 78022, -35635, -51462, 15651, 68167, 71901, 119448, 80157, 20333, -22011, -9181, 23621, 26111, -4531, -15108, -26539, 43773, 105044, 67465, 44846, 12550, 67677, 100803, 22523, -33066, -56904, -11517, -46837, -97701, -110093, -130945, -130960, -44931, -29017, -23774, -33306, -80907, -73348, -102797, -138754, -88386, -53572, -61105, -65150, -81878, -91254, -85047, -115361, -151880, -99280, -100520]
17519a00520j159l6667R1753L8558o133m074j31J7198L53m0722O3992j1015K6073
17506C7506k1604n5224n4149K9374K7978P4945o0744q6951Q376N3456K3021J8290
17494e726l5155J9028j9064r377L7811L3706J2971j3404J3277l8685O1083J3910
17482G0375M6981K4677o3624n7415L4078m004p6316L3358L5131M6806m1544k7436
17470B1067j5117J0103M4115j5388p039J1714q535M249l881r7944m97J8989p1559
17457a09723k4677q0414m5811J25156R0623Q8483L1408k5310l6866l336j1985
17446b452j3566j956J9003L2614N788J255k4387k7668n0236J9460j2981p1905
17434a27031J0247M8873J542K1313N0130m6456m0296K0368M2175P1156K2591j3475
$$ y = [-100520, -101679, -138346, -46593, -8035, -14168, -18242, -18373, -1175, -822, -41544, 22448, 11433, 37506, 15902, -39322, -93471, -64097, -36119, 38826, -21918, -108869, -100493, -47037, -24016, -5726, -40881, -21853, -40917, -50294, -12483, 21223, 34194, 20790, 34067, -4618, 56465, 70375, 117356, 142033, 78409, 20994, 55072, 51068, -25248, 8110, 43241, 90047, 48503, 21067, 5950, 16053, 60168, 44780, 37741, 49455, 40920, 45169, 41288, -56656, -57153, -38164, -109723, -134400, -214814, -260625, -135469, -44846, 43637, 75045, 49735, 12869, 9533, -2452, -16018, -17974, 1029, 33643, 39431, 40686, 16299, -11369, -61605, -42145, -55126, -127031, -116784, -67911, -66369, -45056, 5074, -41382, -81678, -61310, -19135, 52021, 74612, 61137]
17422F1137N465O0102O8596m9748m5805o5898L7542N9398K8228R451Q094j7604
17410A58958k8970K30p8405m4478j5158K714j2167o568K2755q7200n4108k7433
17398a69830K5294J37135N8120k1354Q799N1001m6222r8804l9180P2115r734k0331
17386e2991K2099O4214L2939n4122k9319M7902l0416J5542L2164r5090j5875m9423
17374a12376N4416O6177n5137l2203N2974K3262j5110p239N5259J8811l8133n7496
17362d6795l0057n4688Q9871O2295J09092K3978p4042L5031l1881K16m3958l8756
17350C06P3048k9269k6736p2372K2700J37482R8823Q03j20235p2576o4045n7348
17338a09419j4481O5070Q0046r5542j9973Q8947L1591P1361J760k3275J5836J4848
$$ y = [61137, 66602, 126704, 195300, 145552, 99747, 33849, 71391, 130789, 159017, 168468, 176562, 158958, 129988, 130218, 51813, 7335, -7823, -5109, -17276, -23844, -1089, -88289, -142397, -169830, -144536, -7401, 50719, 29365, 38164, 89165, 42943, -55861, -95041, -22926, -32660, -52991, -30892, 33322, 66261, 12139, -17180, 30722, 306, 15848, 48012, -47078, -62953, -112376, -57960, 8217, -46920, -79123, -26149, -2887, -17997, -25236, 30023, 48834, 10701, -46795, -76852, -131540, -41669, 20626, 129718, 153696, 79654, 114685, 82804, 83020, 39062, 306, 73354, 44085, 17349, -55023, -32323, 105159, 203982, 204785, 84550, 11974, -52071, -109419, -123900, -58830, 21216, -74326, -94299, -5352, 26239, 97600, 99360, 76085, 91921, 106769]
17326A06769j4785M941k4208p0168k5143N3887K6878n6201o4565n6491m61L2239
17314h7308M900j3461K4467N759j4331N5066N8092q27K2460P2589o5363l5511
17302B6532J6245o5573j970L2337J5427n6814j043k8857L6447P0q3291r552O3700
17289e6342N7402N1591k5074N773m3330m6358j6603Q506L5264Q974k8047J0706
17277c7538L5113J4864r899m9645N9530M1611k419j1995N7775l1594m5540j37
17265B0126j3069k8987r3833P0199P4660l5033r8678M2944K1551j8040n5691l7012
17253a50863N8642N7545N2545n959p8655j1769K4543J4692r1668J34085q1378
17242g8240j14765J00688M8861O576j3513K5354P1737k1668o9508p5233O4680
$$ y = [106769, 91984, 96925, 72717, 2549, -22594, 31293, 58171, 1970, -62595, -119086, -119547, -87308, -82408, -95869, -71402, -65643, -79974, -24908, 33184, 32357, 54817, 127406, 62043, 26532, 42777, -22796, -24766, 7571, 22998, -33816, -34859, -63716, -27269, -27199, -110490, -120042, -56342, 1060, 52651, 27577, 33350, -9980, -56338, -72941, -64435, -29171, -20197, -48244, -37538, -2425, 12439, 2540, -47105, 12425, 54036, 51617, 39622, 97397, 65803, 20263, 20126, 7057, -21930, -115763, -45564, 29096, -5937, -104615, -61671, -40120, -58160, -113851, -150863, -92221, -34676, 17869, 11910, -66745, -78514, -53971, -39279, -130947, 3138, -78240, -193005, -92317, -43456, -36880, -50393, -25039, 46698, 25030, -44478, -119711, -55031]
17231e5031J30780n2322j37811o180Q9979K0143n6954P0299R1348P0869J6038
17220A81158n4658n0749m103o7408m179K9864N9968N9792J8738o2071m4923k1728
17208C9701n2999J5791l9960L5739Q0108k0486l1850L8576M0125o6336r1759l3083
17196h6433J04923P4546k0082K3087j3650k3771m8197q331O122K4812n735l971
17184B3320j843N5176j4073j03534j7261K5928m1353k8128p2504N9747J03936
17173a0589j3126j06751L7614O8897j6269l2410L8760R8461P4231l8570m9976
17162E0272l5375L5602m5311j0871p264q094M1734K8733J9416J7780k4087p4897
17150a2362j4794P779O7133p5555J1069j0525o2429J3885L0544r767M8395J61642
$$ y = [-55031, 75749, 23427, -114384, -120564, -30585, -10442, -67396, 2903, 94251, 165120, 181158, 126500, 75751, 71648, 4240, 61, 29925, 89893, 149685, 168423, 106352, 61429, 39701, -13298, 2493, -37467, -1728, 78380, 57894, 26044, 64620, 104745, 38409, -53350, -86433, 18490, 93036, 72954, 96041, 82391, 58620, 10423, 2092, 8214, 33026, 27291, 23320, 21477, 76653, 62580, -40954, -58215, -32287, -73640, -101768, -174272, -114525, -10589, -23715, -130466, -92852, -23955, -40224, -72634, -33874, 64587, 138818, 100248, 50272, 14897, 50499, 5188, -5683, -12947, -21041, 20693, 49426, 68842, 86622, 62535, -12362, -27156, -19377, 47756, -27799, -16730, -27255, -89684, -75799, -45255, -55022, -6627, 155015]
17138A55015J6110k714k3642n4402n863M3969j1785j4136n3323J7324K3869j33053
17126d2631p0365J0652l225j0295R9236j0936p2580l6754P0733N9501n7264P417
17114e6511N1327M5439k9939l7141N6735K7976m8930j3808L3286j5456N4206J4046
17102H1230o7624n8406k0313j7501Q7614M3957n2021o8191o4825O6774K1234R041
17090c9031l3210N027K5668k4145k3258k2364L630m2308K2291n145J6606N5505
17078f0734n5975N4344N1463N4601p4697m5186L9989K6239L6499k6390L8181L1439
17066F9773j9483k8918l565Q8510J5313p8105M9954R950k9677j8980m1610n1879
17054c8717n581O0628M3784K4002m7163r0498n0000l6905P653k6386M1789K2182
$$ y = [155015, 171125, 168411, 144769, 90367, 84504, 128473, 116688, 102552, 49229, 66553, 90422, -42631, -112996, -102344, -105569, -115864, -16628, -27564, -100144, -136898, -66165, -6664, -63928, -56511, -5184, 40255, 10316, -26825, 29910, 57886, 8956, -4852, 28434, 12978, 67184, 81230, 13606, -44800, -65113, -82614, 5000, 48957, -3064, -71255, -136080, -69306, -48072, -39031, -72241, -67214, -41546, -65691, -88949, -111313, -107683, -149991, -127700, -132845, -116239, -60734, -116709, -62365, -10902, 43699, -30998, -76184, -36195, -9956, 26543, 153, 38334, 69773, 50290, 21372, 17807, 106317, 121630, 43525, 93479, 103429, 73752, 54772, 13162, -38717, -44298, 16330, 60114, 84116, 36953, -53545, -103545, -140450, -132797, -159183, -117394, -95212]
17042i5212J4852k0984j0903K8203L1850j6392m8405J6947m6422l3802P9373O7901
17030c2994p470P0677L4655l9040P920k1649j566l0954O862L3614j5974l2985
17018b8904j820m6353l4420M4150L7789k1021M0502J7709J0968K2111n1958P121
17006d126R945m4592j6450J39920L7947o6241p3845L997q22L2818l1040N942K4528
16993A7981L2957K8317K1631l5722o91M5557L502J4590k1959r9078n11M941n5689
16980d4174J7712M0502q3695j05971R8J25367J12149O1642J446j2621J6532n5
16968A28932p8259j8109q5594j055M8324n0048R817N5191J3923m118m9131K8211
16956a916K3164m8804N2747J9047q0568p6962J335Q1025M7477o8421Q479K6869
$$ y = [-95212, -80360, -101344, -112247, -84044, -52194, -68586, -116991, -100044, -146466, -180268, -100895, -32994, -40464, 30213, 64868, 25828, 33748, 12099, 10533, -20421, -13559, 20055, 4081, -28904, -30724, -77077, -111497, -67347, -29558, -50579, -10077, 7632, 18600, 40711, -11247, -4126, 5819, -38773, -55223, 84697, 122644, 56403, -17442, -13445, -14267, 18551, -12489, -6547, 17981, 50938, 79255, 100886, 65164, 64473, 110030, 113532, 128122, 106163, 7085, 6574, 11515, -44174, -26462, 14040, -69655, -175626, -175528, -50161, 61988, 123630, 125076, 112455, 128987, 128932, 50673, 32564, -53030, -54085, -5761, -55809, -45992, 9199, 23122, 19004, -30127, -1916, 21248, -27556, 25191, 44238, -36330, -113292, -111957, -30932, 16545, -51876, -43397, -16528]
16944a6528K9465p0894o1341M9722R9673j4794n9030K0732L3670Q592k647J8369
16932C4989l4659j2704L7850k3295l0404k703j8648J04157j085q3665N196J1093
16920a3878j2011j5434l5227J4898M1309M4855m6602p5393R5172R3970o9634o8846
16908d6821N8788P0137r063J5363o7690m2682l1607n4448M9539N9733m296J8628
16896A5581n8819j4811L1873p117q070k8372l6455L8911P046L7201O3174M0147
16884H0289r1455r590o5350K6560P4679M894l5522j624k6408L57l1733k53P7299
16871B143P1760j8409n1165o5451j1925j528J1330k0950l2527j6593O6531J03302
16859C6518J900k2091R5190M0778j03342j0769J4986m116L818o2225L9420O379
$$ y = [-16528, 12937, -57957, -119298, -69576, 30097, 15303, -43727, -22995, 10675, 19267, 16620, 34989, 330, -12374, 25476, 2181, -28223, -30926, -49574, 54583, 53498, -30167, -24971, -13878, -25889, -41323, -76550, -61652, -20343, 24512, -22090, -97483, -2311, 91659, 22025, -46821, 11967, 82104, 73041, 88404, 20714, -21968, -53575, -108023, -58484, 1249, -3047, 15581, -43238, -58049, -26176, -33293, -41363, -69735, -106190, -67279, -60233, -23032, 40142, 80289, -11166, -20756, -86106, -59546, 15133, 20027, -15495, -17119, -43527, -43170, -74903, -75156, 2143, 73903, 55494, 4329, -61122, -73047, -74575, -63245, -84195, -116722, -133315, -66784, 36518, 38418, 16327, 111517, 152295, 48953, 38184, 53170, 49054, 52872, -9353, 30067, 36446]
16847C6446O7660l362L3169l3703j15259p833N8295j6819p0267j0676Q3234l834
16835A7051j20032M1648k575k8496J9530Q8113r069j0327m3309m3669n8189J781
16823a47543L6710J9541j6827K5451J19659K9253k3571J0374J989k0785m7606
16812a3355J344L1993p2581Q0609R3000m5692j06733k4153J29134O139o7756l6076
16800b4127k8870M5438P1116l6696o4622l4452P9435P3190O0654n2715r1560L7751
16788C4542K3531j03988p6808R1066P7453J7251j2710m2168l5156p9247n760j2181
16776a24175k6101M6531Q5338Q4451K7030n9617o5604o9845l8428k9954N7844
16765a12530M2765J07892J6699K2774O4261N406n3654j4053q0227q1936n6690
$$ y = [36446, 104106, 100744, 133913, 100210, -15049, -22882, 35413, 18594, -51673, -62349, 20885, 17051, -102981, -61333, -63908, -92404, -72874, 15239, 6170, -4157, -47466, -91135, -149324, -147543, -110833, -91292, -108119, -82668, 36991, 66244, 42673, 53047, 55036, 34251, -13355, -12011, 19982, -52599, 28010, 121010, 75318, -31415, -55568, 73566, 79705, 11949, -24127, -52997, -7559, 63557, 26861, -37761, -72213, 7222, 80412, 141066, 88351, -3209, 34542, 58073, -45915, -122723, -31657, 45796, 63047, 50337, 8169, -26987, -106234, -111994, -124175, -150276, -103745, -18407, 66044, 93074, 33457, -32147, -101992, -140420, -170374, -112530, -69765, 38127, 54826, 77600, 141861, 147267, 93613, 79560, -667, -82603, -139293]
16754a39293K6097M968m6599L823P6814L8450l282n5367K4634J05012L418j1759
16742B6916J3871k924j33931O1627L6855j8910K6951q040K4083l5316K3252l2314
16730a7880n6586p1139l7173n4244j1137J36714M1633O8430k4036P934L0460K8233
16718D1209p1284j6848K7614L8962l3475n973K7900N104K7064K6672m6083k2913
16706b051j27616J5726R5459R602K5785L2806k2802N1088p322k5338q105K9378
16694F6610j5340o7517o8723M0158L9943j2867m7707k5971k4705N8359K9318n9825
16682h8267o6500k6750O4169R3870J10117R5217N0361r2436p5365J3979l2417
16671D5978m3644K0778r321m2430p5934K3190J9584k2798O1639n0584j625P268
$$ y = [-139293, -113196, -108228, -154827, -151004, -74190, -35740, -39022, -94389, -69755, 35257, 38675, 26916, 40787, 37863, -96068, -34441, 2414, -16496, 10455, 2415, 26498, -8818, 14434, -17880, -74466, -145605, -182778, -237022, -248159, -111445, -69812, -1382, -25418, -17484, 12976, 41209, -30075, -46923, -19309, 19653, -13822, -19795, 8105, 13209, 40273, 66945, 20862, -2051, -129667, -113941, -18482, -8880, 16905, 49711, 26909, 77997, 70675, 45337, 37232, 66610, 51270, -16247, -84970, -44812, -4869, -17736, -65443, -91414, -116119, -57760, -28442, -88267, -154767, -181517, -117348, -23478, 86639, 181856, 232217, 139781, 64416, 78395, 45978, 2334, 23112, 13791, -28639, -104573, -81383, -61799, -84597, -22958, -73542, -75167, -67899]
16659f7899o8527Q9596J33707l4374k9219M9547L3903J01221q75j09599p9079
16648A8402Q4354k0896l8604K0448o8560M495N193l5967j6338L4453k5111K845
16636c5286R8186o6701k4001R864L7736J10300O590p9581p0266J973j9874j1223
16624d2283J9132k9415p3629L2934M7397L6752j24826l3826L9882O3656j5502
16613g9728K9227Q5233R18k0670K7572j7403p3603K868m851L7522K7756l7937
16601b3096M9488k161o292K1236K9589O3494M2901k354j33608r6889l4586Q8658
16589c620J5701l273j0962o0378P4010k7484l5144k7589K7323M5077K6935l896
16577A6700K1559O9663k0006n2962k4055k5579P208K5173q0928Q092L9081L4211
$$ y = [-67899, -136426, -46830, 86877, 52503, 23284, 72831, 106734, 207955, 207080, 97481, 18402, 102756, 81860, 43256, 63704, -4856, -361, 4832, -31135, -47473, -13020, -38131, -35286, 62900, -3801, -27802, -17938, 19798, 130098, 136688, 57107, -13159, -11186, -31060, -42283, -23151, -52566, -126195, -93261, -45864, -9112, -133938, -167764, -127882, -64226, -79728, -50501, 34732, 35650, 14980, 42552, 25149, -48454, -45586, -50437, -12915, 14841, -23096, 26392, 24231, 17939, 39175, 68764, 132258, 175159, 172805, 39197, -57692, -92278, -3620, 12081, 8808, -2154, -62532, 11478, -16006, -51150, -78739, -51416, -6339, 20596, 16700, 38259, 107922, 87916, 34954, 10899, -14680, -7472, 17701, -63227, -55135, -16054, 18157]
16565A8157O7516m8079n7301r5037n7081Q1584O507J7541J03349N2227m6498k2153
16553B0732o345o4688k4201m2096p0979J9349K7096R6045K9039Q9677N6276K4252
16541A54157k7323p1173p1669j9669o6159R641P9867m8580K3820l035l3031O3393
16529i761m4285r3120k3979K3523M1684N649N7480j1958l4683L1816J11190o2366
16517h810k3071R0850L1047j1110m2018r666J7186p8178m3728L0034K7448P0785
16505E0769M5995L8105q8044k1199m8053k1414n3917M0740N6624O2442L2169m6983
16493D7234j3573o8122p9965j221O0490N4380P5218p4933o9035K6815J0107r0782
16481a23387o1082k4721J00048R7473K2653j3636j720J4098K6261k9060o9521
$$ y = [18157, 85673, 37594, -19707, -114744, -171825, -90241, -83734, -66193, 37156, 89383, 42885, 20732, 14387, -50301, -74502, -116598, -187577, -168228, -141132, -45087, -16048, 73629, 129905, 154157, 126834, 55661, -16008, -35677, -101836, -92195, -12328, -60908, -37088, -40123, -73154, -9761, -54046, -147166, -171145, -147622, -105938, -100289, -42809, -54767, -89450, -57634, 53556, -8810, -31881, 58969, 90016, 78906, 36888, 27222, 44408, -33770, -77498, -47464, -20016, 50769, 96764, 134869, 46825, 25626, -22427, -43841, -97758, -57018, -394, 62048, 94217, 47234, 33661, -34461, -114426, -115647, -55157, -777, 74441, -492, -69527, -42712, -32605, -123387, -184469, -209190, -109142, -11669, 10984, -2652, -4372, 9726, 35987, 6927, -62594]
16470f2594k7155K1303O5580j0864k5585M026L4882l0464R030M2248j6326n2674
16458d8593N0060N7291j7857L3429J1253K0671n778k1551o0670M387O1179M5713
16446A29534m6189p3505m1194n610k1839l8847L2335Q904K7141n6697k5041J9646
16434i1362O7203J10898J9262r2251J596k7889k8139J8990Q0137P1397q279M3320
16422A64883K501p8124j32002P6941p863j3113L5022p1118Q381l6156k1001J9289
16410e2360K5267j8975j1214n0789N8755M3919K5350O565m6193j26712n6624K8481
16398a74530l7106J3766O6297J07031K4883j9386o3106o2003q6890L0770P9512
16387a20762k6770N444K300J0575l6494j8241j1594m0254O5702M3636P7863R5323
$$ y = [-62594, -89749, -68446, -2866, -13730, -39315, -35289, -407, -30871, -21841, 20407, 4081, -48593, 1467, 58758, 40901, 74330, 85583, 106254, 100476, 78925, 18255, 22642, 83821, 129534, 83345, 9840, -31354, -36964, -58803, -97650, -65315, -56411, -29270, -85967, -111008, -91362, -24159, 86739, 106001, 13750, 15346, -12543, -40682, -21692, 58445, 129842, 121563, 164883, 167384, 89260, -42742, 34199, 26336, 13223, 48245, -22873, -14492, -50648, -71649, -52360, -27093, -46068, -57282, -108071, -49316, -5397, 19953, 26518, -19675, -146387, -203011, -174530, -211636, -197870, -131573, -24542, 341, -19045, -82151, -144154, -231044, -200274, -120762, -147532, -142088, -139788, -129213, -165707, -183948, -195542, -235796, -170094, -126458, -48595, 46728]
16375D6728l2728j14450m209P4501L0597J3323l4960j5730K8973k0189k4156J16528
16363F4228Q618k0012p6403J1089j1697j01160Q1241J92767m2118j24396p8269
16352i6112p1691k7573Q5285K2799M8019O8792k9972l3616q7017l9901J7976L4954
16340a08057O8498k4376j2513K7205l1714P7319p338j6967k167n1967j8576l6340
16328a36993O6099O9096M8931q3046o5114R9263j5684N703L1527P1057N3863j3831
16316A30871j6499q8013l824n763L1090R911m7508L7932M7641L6721m7768J0866
16304I5657Q755j2959j3096K4276n6528m9146L0256l2940R256m7585r7658q3473
16292b25185M6199O9888j4492K3890J20492N1658m4460q5776P0171L2370R646
$$ y = [46728, 14000, -100450, -104659, -30158, 439, 13762, -21198, -36928, -7955, -28144, -52300, 64228, 72846, 52834, -23569, -12480, -24177, -125337, -44096, 148671, 106553, -17843, -96112, -167803, -195376, -110091, -87292, -39273, 29519, -453, -34069, -121086, -160987, -143011, -108057, -39559, -63935, -76448, -49243, -80957, -3638, -10976, -27943, -30110, -82077, -100653, -136993, -70894, -1798, 47133, -35913, -101027, -1764, -17448, -11745, 19782, 90839, 144702, 130871, 114372, 26359, 22535, 16772, 47862, 57773, 10265, 48197, 95838, 132559, 84791, 95657, 104412, 91453, 78357, 102633, 46105, -3041, 27215, -5725, 3531, -44054, -141712, -225185, -178986, -109098, -123590, -99700, 20792, 72450, 27990, -57786, 12385, 44755, 54401]
16281E4401m6204N4814L8325n1926n4184P175J2752J0587M4650o5193n2830M9347
16269A714M5325j1401O5080l1676q7021r9873N5692J20893q4004q4144k8524J01054
16257c6885k9337n1450j5320q991N0561J8656L1932N3102K0112m6431L2216p5246
16245e7081n5906Q472O6307o9344K0971J2028L7873L9566K5571K1948n142k7482
16233A7781l7420M3959k9101m0785K0153p4130p6856K3401Q89O1057P7743J0625
16221b684o2235q3168L3304k7721L9144R3095J08963m5704p1899m2108j5971N3547
16209b3437K4479P887J0931N017k9677J1172M7591o964J7803m4136m1597k7699
16197d8630L1283N4742n7567n2665n852K1907P8792J8598K9380K1343l1601q657
$$ y = [54401, 8197, 63011, 101336, 49410, -4774, 2401, 15153, 25740, 70390, 5197, -47633, 1714, 47039, 35638, 100718, 69042, -17979, -117852, -62160, 58733, -25271, -109415, -137939, -36885, -66222, -117672, -132992, -141983, -91422, -72766, -40834, 12268, 32380, -14051, 18165, -57081, -112987, -104515, -38208, -107552, -86581, -74553, -36680, 2886, 28457, 50405, 45263, 17781, -19639, 24320, -4781, -45566, -25413, -99543, -176399, -152998, -152109, -91052, -13309, -2684, -64919, -148087, -114783, -142504, -103360, -10265, 98698, 52994, -18905, -61013, -76984, -23437, 1042, 8929, 19860, 24877, -4800, 6372, 53963, 46999, 64802, 20666, -20931, -48630, -17347, 37395, -20172, -72837, -78689, -56782, 22010, 40608, 69988, 91331, 59730, 51073]
16185E1073n8506o7820l2187L9213J460N5138L1053j3588L5264N5907P701O1393
16173A66101N2028j619p7614j12512j43736o8256O3232J20461J6029n5263n4980
16162i6129p5696K1898Q0178k2621K3162R1660o730M7987j0969k7201N2838k7849
16150E0528O5801k655n0130n7506J7373k7577m0227J03542L2977N0341n6147p2738
16138A3582l8492j1050j6139j8136l5273o015o6312O1166R5896R8065l3561O349
16126E0080o255q9667n3048j6668j1868K5526N8875P0878N7829J4971q1784q7125
16114f8256m354L7447M0042L3006L3054K0761q5924o6661J6179K9952l3199J933
16102d6020N5335L4722L6412K1531l9630m2450j13902O5884j2528m9405N5690
$$ y = [51073, -7433, -75253, -107440, -68227, -66767, -11629, 19424, 5836, 41100, 97007, 104708, 166101, 218129, 216510, 138896, 26384, -117352, -185608, -122376, -1915, 14114, -41149, -96129, -171825, -149927, -69749, -92370, -69208, 22452, 15722, 63709, 52740, 25539, 78377, 50528, 116329, 113674, 63544, 6038, 23411, -4166, -44393, 59149, 92126, 142467, 86320, 13582, -24910, -35960, -52099, -70235, -105508, -111523, -177835, -116669, -20773, 77292, 43731, 50080, 43825, -45842, -98890, -115558, -127426, -101900, -43025, 27853, 85682, 100653, 18869, -68256, -72610, -35163, 4879, 37885, 70939, 91700, 5776, -60885, -44706, -14754, -47953, -46020, 9315, 44037, 80449, 101980, 62350, 19900, -94002, -28118, -40646, -90051, -34361]
16091c4361m3869M0639M3999J2986P4731l8490n8372M1117Q957q041n4609m9425
16079f4738m8458r072L3950N6010k8500j6662L764j1274n2408P595N5452k6739
16067a01080Q433N9836Q3845L9438J8773j2629r7858L4516M0018p1684K173j1081
16055g300l6195k9676L511L4686J1446J4932M0668p0896N4451k9748j710n6153
16043g1984J040M255K5078j3683M7557J25741k9053j24183m0820J6231P7540P1146
16031H8865j5017j8091j284M0147j0654j21810m7683K0152L2907l5368m468N7607
16019a4697Q7073K2692m3873l7455m7622r521J0830K6066l5799o801K662j3291
16007e9736L8741j0385j5126K7605O4786p5157l5576K7096Q729J3502J0566N469
$$ y = [-34361, -78230, -37591, 6408, 19394, 94125, 55635, -2737, 38380, 47337, 39296, -15313, -64738, -113196, -122268, -88318, -32308, -60808, -77470, -73706, -84980, -137388, -129793, -74341, -101080, -92647, -32811, 51034, 90472, 109245, 96616, -1242, 33274, 73292, 1608, 3781, -7300, -43495, -73171, -69660, -34974, -23528, -8596, 32072, -38824, 15627, -14121, -15831, -71984, -70944, -66689, -41611, -55294, -7737, 118004, 88951, -35232, -76052, -59821, 17719, 88865, 73848, 55757, 54473, 94620, 83966, -37844, -85527, -65375, -32468, -67836, -72304, -14697, 72376, 95068, 51195, 13740, -33882, -43403, -32573, -6507, -42306, -49107, -46445, -59736, -20995, -31380, -46506, -18901, 45885, -29272, -64848, -37752, -29023, -15521, -4955, 514]
15995E14k8305n5362n4422P0992K6251N0025P680n0343P592m3496k8901P9307
15983a8468l1060m0939J02528Q758n9559l6656k7076j6813N1472K2449m9291o2816
15971a57471K9956L2198J4521R468L4960l5856J4095N2060P2567k3053m243K6258
15959F5460R041j2712m5707n0040j5757O3947k0946K9059N706j04300l5776R0190
15947b1835R1294p326p6590m7360o700J03150j6599L962m4615k4726m7320k5827
15935a20492N5933K6207q696O3546M4409o3983j3805K9050L9782L9438n1085k9710
15923A0594k0356l2350N9473K6678l5983J0721m9287q531k3802k2534K5475k814
15911f2716o1887l7690L9528K2524j1986l2706k5291K781J7601O693J14735Q9412
$$ y = [514, -27791, -83153, -137575, -66583, -40332, 9693, 17373, -32970, -25378, -68874, -97775, -18468, -49528, -90467, 12061, 20819, -38740, -75396, -102472, -119285, -67813, -45364, -94655, -157471, -127515, -95317, -80796, -71328, -36368, -72224, -58129, -6069, 66498, 43445, 39202, 65460, 74501, 61789, 16082, -33958, -49715, 14232, -6714, 22345, 28051, -76249, -112025, -21835, 69459, 62133, -14457, -61817, -68517, 34633, 18034, 21996, -22619, -47345, -94665, -120492, -64559, -38352, -47048, 16498, 60907, -3076, -16881, 12169, 51951, 91389, 40304, 10594, -9762, -42112, 17361, 44039, 8056, 18777, -30510, -39041, -62843, -85377, -59902, -62716, -124603, -162293, -122765, -100241, -112227, -144933, -170224, -167443, -149842, -143149, -28414, 60998]
15899F0998L2403l0170k6541k5710k4334o7242J6950Q7081K7949k6441L4094j0757
15887D8280j01014M9765K1504L8438N4719m9327m9672J05101N4210q7728m3642
15876D0634k1440l0601n4220Q922J15790L5150J07o1152p8709j1968m0525o8430
15864a66442L4814O6167Q6091N9754l8677l1974K8795k1885o7770l6495L148J1529
15852g2945L1616j4697L642J09056J7769J838n468m2372K07L0300k0151K9254
15840F8049K1730M9433l6719j066m2378j09615j2745n7411j342Q4031J03508J2979
15828G8454j9836n2858J0918k6136p5327l3672m3473L1305J01758O4967Q727n7906
15816a3079j01020K582Q6295K9922k6565K5974Pj5465m6585P5729N8334k0637
$$ y = [60998, 93401, 63231, 36690, 10980, -13354, -80596, -63646, 23435, 51384, 24943, 59037, 48280, -52734, -2969, 18535, 56973, 111692, 62365, 12693, 117794, 172004, 84276, 40634, 19194, -11407, -65627, -56705, 59085, 94235, 94342, 33190, -45519, -57487, -98012, -166442, -131628, -65461, 20630, 80384, 41707, 9733, 38528, 16643, -51127, -87622, -84474, -72945, -41329, -56026, -52384, 56672, 74441, 76279, 70811, 28439, 28646, 58946, 38795, 68049, 89779, 139212, 102493, 101427, 59049, -50566, -63311, -120722, -122064, -38033, 65475, 78454, 58618, 5760, 16678, -9458, -84785, -118457, -161930, -130625, -28867, 36100, 44827, -13079, -114099, -111517, -25222, 4700, -21865, 4109, 4116, -11349, -57934, 17795, 76129, 55492]
15804E5492r6731r370p166l5819l1656O2794r056J1781Q0446K7605M6991p7826
15792A7485l0306n4594M3132J5012p8627l7134o0995r494J26929n1644J1837M8899
15780e9500J22444K2170j44144l1100r849k4184k116P749K5376k1004Q0333l6773
15768g0598K8141P0318L4943K3241l101r2645p217Q4372M780k2852p4983l2491
15756e8092O8312N7992Q2948o0294l28l4638o7008q6855l8400M034j3331j8096
15744a63756Q7908N6747o1378M3654O8242k1290l2803j3849N22N595o4022J18943
15732B4513M2881k9278J8166j0232l1740L3140L6495m5735m8503p3582n5062L2943
15720a05994M5452P7083J5347M2719l7079K3890m9999j36528j28687l7982Q3070
$$ y = [55492, -41239, -50609, -57775, -93594, -125250, -62456, -71512, -59731, 20715, 48320, 95311, 17485, -12821, -67415, -24283, -9271, -87898, -125032, -186027, -195521, -68592, -120236, -108399, -59500, 62944, 85114, -59030, -90130, -99979, -124163, -126279, -118530, -93154, -114158, -33825, -70598, -42457, 27861, 62804, 86045, 82944, -9701, -16918, 67454, 72234, 49382, -25601, -58092, 10220, 68212, 151160, 90866, 90538, 55900, -11108, -97963, -136363, -132329, -145660, -163756, -75848, -19101, -80479, -36825, 31417, 10127, -22676, -36525, -36003, -30408, -94430, 24513, 67394, 38116, 56282, 46050, 14310, 47450, 83945, 38210, -10293, -83875, -138937, -105994, -60542, 16541, 31888, 74607, 37528, 61418, 11419, -125109, -253796, -291778, -208708]
15709b08708Q1576L9078N1142j5487K0391O716O6334P6296k3933M62P275J9540
15697A20682r6961l0387j3446n1071q028O2234L8422N7386r9263p5315j4932Q060
15685a02619m8978j1457M8300K0400m754R468K5386m3813l1563O7157K059M1897
15673b8517L0837J175q8591n6044o1915m5509Q6124J28792Q4451l0103l4040M0232
15661B6892L7120j5129k0005j6835p6927l8466M8069Q1473Q1303j1470N2175l9160
15649A09040k1261n9504j3286l5265j3474r7952l0521l668k7293J9584m770O010
15637a72360l2634L869O8433K2458L7679N5533N4068m4583J2989P6600l4247r942
15625C7863N230p2312M65J6576m6142J2599J4922J9270K7692N6579n4236p4365
$$ y = [-208708, -127132, -88054, -36912, -52399, -32008, -25292, 41042, 117338, 93405, 93867, 101142, 120682, 23721, -6666, -20112, -71183, -79211, -16977, 21445, 78831, -20432, -95747, -110679, -102619, -151597, -163054, -114754, -94354, -99108, -89640, -64254, -108067, -139630, -72473, -70414, -28517, 2320, 3495, -85096, -141140, -203055, -248564, -162440, -33648, 50803, 20700, -13340, 26892, 64012, 48883, 28878, 12043, -64884, -103350, -55281, 26192, 107495, 96025, 148200, 109040, 87779, 28275, 14989, -20276, -33750, -131702, -162223, -165891, -193184, -173600, -178370, -172360, -204994, -201125, -132692, -110234, -72555, -17022, 37046, -7537, 5452, 82052, 47805, 37863, 43093, -29219, -28754, -12178, -58320, -45721, -30799, -11529, 16163, 72742, 18506, -55859]
15613e5859M4878n1527k5653j1529R278P2754O7178l9692l1238K0079m6850l8199
15601h6380O7879j996n8431o6300n8215k5566Q1162R3075J2168M4673J1365J2802
15589B6236N0246p3133k4011l937l51j3052l9957p3384L2754j5681L180L5921
15577i5169K2647l3871m9538O2674J76214L7024l0125j07490p4202P746M6343
15566c7747j7938n4847L2140L2741L6068m2071N3410j4650J0017L6401m2343K9933
15554B1114j6536k6057m4013K0963J9751Q6749k32l7333k9438l0193j9227N5364
15542I12N1279o9398n2265L0714L9276J2787N318m4772J2631K3540l1048j3603
15530c4629q5595o0313M6822J9288K2221Q8607N6185k8662k4901O685n1935o5722
$$ y = [-55859, -10981, -62508, -88161, -99690, -90412, -17658, 49520, 9828, -21410, -1331, -48181, -86380, -18501, -20497, -78928, -145228, -203443, -229009, -147847, -54772, -42604, 2069, 13434, 26236, 76482, 3349, -20662, -24599, -24950, -38002, -77959, -151343, -118589, -134270, -131090, -95169, -72522, -106393, -155931, -93257, 82957, 119981, 89856, -17634, -91836, -84090, -37747, -55685, -110532, -78392, -45651, -9583, -51654, 1756, -12894, -2877, 33524, -8819, 21114, 4578, -21479, -65492, -44529, -24778, 61971, 61739, 24406, -5032, -35225, -54452, 912, 52191, -17207, -69472, -38758, 518, 13305, 18623, -26149, -13518, 10022, -21026, -34629, -120224, -180537, -133715, -114427, -92206, -3599, 52586, 23924, -977, 5708, -46227, -111949]
15518a11949p5157M27K8672J03377J03665j7483J8957M7850r6658l5685M647J2338
15506a6999J6843Q1911q4950k3770l8332O175M4161j8575M460L1033K2065o4870
15494d0848k5973K665K8394J8622k9555M4559J20758j7660j09469l1941n275m6901
15482i2624n0137j1700P5886J32815K3411j4226p4764j372q4923L5142Q367L5167
15470a8958P208o7069l371J00097n6604m3970q834l3705J2021R5539Q7424q271
15458F1507k9565l9081k1184n7648o6847m070L2390L1452O3118m4335L5909M2974
15446D620m6750K3144P8788K3988k8047q2942r7773m6244o66J01982J41279K8585
15434I9964R517k1538r3372o4861m421N168J9313j0449J14550J804j0866j8217
$$ y = [-111949, -187106, -186679, -158007, -54630, 49035, 31552, 50509, 98359, 1701, -33984, -29337, -16999, -156, 81755, -3195, -26965, -65297, -59122, -14961, -33536, -29076, 1957, 24022, -40848, -66821, -64156, -35762, -17140, -46695, -2136, 118622, 100962, -8507, -40448, -45723, -92624, -142761, -154461, -78575, 54240, 77651, 63425, -11339, -12711, -97634, -62492, -54125, -18958, -11750, -78819, -82190, 17907, -38697, -82667, -91501, -125206, -113185, -17646, 69778, 61507, 31942, -7139, -28323, -85971, -152818, -156888, -124498, -93046, -29928, -74263, -38354, 4620, -42130, -18986, 59802, 83790, 55743, -27199, -124972, -171216, -171882, -69900, 71379, 99964, 109481, 87943, -5429, -70290, -74711, -69543, -50230, -60679, 53871, 55675, 44809, 26592]
15422B6592m7663M6354J13829P1663j416o0372m2966j7335k6740p3674n2664l2583
15410i6975J13531L4222j0466M8580n3024m3475j7520M3905P1774L4686n8105
15399F7133m1144l0968l9226l9237P6044J9792J1034L9838m3396j3829p362K1179
15387A9858J611n3274K708m2833j2563J3586k6930M3506J0872P4024L254n5376
15375b1557p7832l8328J07925m3340l3221m464L8401k281p2034M3405M1091P0269
15363H034l5543j3230K4070k1346n214Q5598p7330j1886O9021O419K4109K6941
15351G9643m250m3600N4370M2169l6098p6459L870M7602K3753k7575j6101l4471
15339A2853j3847o4192J5808J7011L4330p421O3288J3659K7715K1816n0408p593
$$ y = [26592, -21071, 25283, 139112, 210775, 209359, 148987, 106021, 88686, 61946, -11728, -64392, -96975, 16556, 50778, 40312, 88892, 35868, -7607, -25127, 18778, 90552, 125238, 67133, 25989, -4979, -44205, -83442, -7398, 12394, 23428, 63266, 19870, 6041, -1321, 19858, 21469, -31805, -29097, -71930, -84493, -70907, -97837, -54331, -43459, 30565, 33819, -21557, -99389, -137717, -29792, -73132, -106353, -110817, -72416, -74697, -146731, -103326, -62235, 8034, -27509, -40739, -16669, -38015, -43229, 42369, -34961, -46847, 22174, 28593, 52702, 79643, 75393, 31793, 86163, 128332, 92234, 15775, 19645, 67247, 91000, 63425, 47324, 12853, -994, -65186, -49378, -32367, 1963, -5458, 57830, 71489, 99204, 121020, 70612, 63019]
15327F3019n8170N2600K1173J6977P839j2562n0632j00381j2236P6274K1471j906
15315B3466l18k001J6786o9522K2261O7248m8249r1436M1021R2892J6028l2834
15303C5342m7282M0062J4185n3396p7010J8193K9991K2643K8631l0235R611L6087
15291B6822j7275K7429P6711N639n7330m777m5072j6672l8281J3173M0507m1581
15279c0707j4222J3900L1574L4436N6845l2419j67913p8512M3007J33406Q7556
15268G6951j2581n4120J6963l6234p3440Q391N3415L72k5579p0923K2981L8790
15256e5014J2738r398M905L3728K1293l646R42p7974L7750k6662L0755K2403P6353
15243F8173J2671n1494J1979P7608j13516O0750M1273l9984k7133k7565p8554
$$ y = [63019, 4849, 57449, 78622, 95599, 103438, 90876, 40244, -60137, -72373, 3901, 25372, 23466, 23148, 21147, 37933, -31589, -9328, 57920, 9671, -81765, -40744, 52148, 68176, 35342, -11940, 28122, 42307, -11089, -88099, -69906, -39915, -17272, 11359, -18876, -9265, 26822, 9547, 36976, 113687, 119326, 61996, 57219, 12147, -4525, -42806, -29633, 10874, -30707, -44929, -31029, 545, 34981, 91826, 59407, -108506, -187018, -144011, -10605, 76951, 64370, 10250, 27213, -9021, -82461, -74070, -20655, -20283, -45862, -116785, -93804, -55014, -42276, -51674, -46769, -13041, 8252, 4606, 5548, -72426, -34676, -61338, -30583, -8180, 68173, 80844, 29350, 41329, 118937, 5421, 66171, 107444, 67460, 40327, 12762, -65792]
15232f5792K9580M424j2506p0116J864j2556O2084N5588K9967r353r3281L3036
15220d7061K0049O4643Q258p0575L2928J8480q1999m0037N1051o5119Q077n1142
15208a52447k7977k3034R9372K8220M5898K4911j8337K6304M2354j5059j6924
15197A3281M2279k1923l1773k1656n8964m1849m515N8093K3569J9162L557l4428
15185e5167J7071l4859n4868O7162p3469m7860M3352L2321O7466O0594j2566p946
15173A231L4010M3188q178M1543J559o7404o4167J0532O1791J3026K3239j00183
15161i813j8243O6806M8595J4565M608p8546n259M0256L5727q612k1585p7675
15149i176o3990O8313O6748p6830Q98Q4059L532k5854q0044q2436j138J9331r658
$$ y = [-65792, -36212, -31788, -44294, -114410, -112546, -125102, -63018, -7430, 22537, 13184, -80097, -47061, -27012, 37631, 45889, -24686, 8242, 26722, -55277, -95314, -44263, -109382, -101305, -152447, -180424, -203458, -104086, -75866, -29968, -5057, -23394, 2910, 45264, 30205, 13281, 55560, 33637, 1864, -19792, -78756, -120605, -125120, -67027, -43458, -24296, -20739, -55167, -38096, -72955, -127823, -60661, -134130, -181990, -138638, -106317, -38851, 21743, 9177, 1231, 35241, 78429, 70251, 111794, 113353, 45949, -18218, -7686, 54105, 67131, 90370, -9813, -28056, 38750, 87345, 101910, 106518, 27972, 22713, 62969, 98696, 90084, 68499, -9176, -73166, -4853, 61895, -14935, -14037, 70022, 73554, 47700, -32344, -114780, -115918, -96587, -106245]
15136a06245O8390J5730l9125n2007j5437J3152L3441Q4416Q5642J513n29o5550
15124B3391O947Q6098O4844K1831p5745m4109k4765p1454n2424k0850k4345J1519
15112i9062Q0916k3969m6012k931L0761L7207K0545L9827p8060l1054O0985O3883
15100E3036M7524o1149l6145N4217m7125J9040O381o2313O78j7922k9498K5371
15088d7905N1040R459N6624j2365q5318K0976M7661o2218l7244O1659J673L7209
15076D1251P920j6459J8429K9839m7246j3625k0592k9654j4051M5898n909K1159
15064A6960L3734K5213O9137L3882l6654j11065r1939o7179N5217P4043r657o7175
15052g5483N1898N887o6626J7699J5353n5634Q881P2160L6218O051n7077r7388
$$ y = [-106245, -37855, -22125, -61250, -113257, -128694, -115542, -82101, 2315, 87957, 89470, 88941, 23391, 30338, 116436, 181280, 203111, 127366, 83257, 58492, -12962, -65386, -86236, -110581, -99062, -18146, -42115, -88127, -91058, -60297, -23090, -2545, 37282, -40778, -71832, -10847, 53036, 100560, 39411, 3266, 57483, 10358, 29398, 35779, -26534, -25856, -43778, -73276, -47905, 3135, 12594, 69218, 56853, -28465, -7489, 40172, -22046, -59290, 2369, 4042, 41251, 49171, 32712, 51141, 80980, 33734, 20109, -483, -30137, -44188, 1710, -4199, 16960, 50694, 75907, 145044, 178926, 142272, 31207, -60732, -127911, -72694, 1349, -8308, -75483, -23585, -17698, -84324, -66625, -51272, -106906, -98025, -25865, 10353, 16404, -40673, -138061]
15040a38061P8943m271p9952j788J09328J2381K8845m9559n911J34534K3850L130
15028A11469J8355n4816j06128l8914k1466J3943K7495J6212O6946n712o803R50
15016B1531l5038O1863L0012P2364k0115j14002j0089M6110K7427J4689p802l8677
15004D8273j2636K1939m600l2593P2822M6804K5727q7469j09469q6866k2534l3084
14992a73686n9326J17068J03991n3817m7803K6975l71l2056M3184J8099l4375
14981i2117M8975N2928K083J8811L6214k1604O576o4647o4184p9617k8453N3327
14969a31708K7502m0148O2328P6662Q1217n2014N895j2261p1352o6795k199M9406
14957g3467L2174N0738m4044m5524l2149L2217o5211j4136j7775Q2006M1699K1170
$$ y = [-138061, -59118, -63389, -143341, -145129, -35801, -23420, 5425, -44134, -50045, 84489, 108339, 111469, 129824, 75008, -31120, -70034, -91500, -77557, -50062, -33850, 33096, 27384, 20581, 21531, -13507, 48356, 78368, 150732, 130617, 16615, 6526, 52636, 80063, 94752, 86950, 48273, 35637, 57576, 52976, 20383, 93205, 140009, 165736, 78267, -31202, -118068, -140602, -173686, -233012, -115944, -11953, -65770, -113573, -86598, -86969, -119025, -75841, -57742, -92117, -43142, 9786, 11869, 30680, 66894, 45290, 51866, -12781, -76965, -156582, -185035, -131708, -104206, -144354, -82026, -5364, 75853, 23839, 29734, 17473, -53879, -120674, -122873, -73467, -41293, 9445, -34599, -80123, -112272, -80055, -145266, -159402, -177177, -95171, -53472, -32302]
14945c2302N0598J5518l4211O476M3747k9496m7094J5133N6293k6997L2366l2967
14933A7064N823K8464j1845p9657k6429L1490L7351L9223l2583k8973J2654k9939
14921c7357K0316k3295j02605r1387O9944Q0943N2206K8775j7322o516L9901P304
14909B0907m8598O8979J2563K4134K0505l5926j34259n4015J08645J14564R1061
14898A88560o3623j6864J015O017j30996n1129k9419L104N7271K1940j3896j3243
14886d1263k0358K0837k326J8699K5532q283k5486J1086O5275K5454k7464k0977
14874B0726N6962p3586k4623L9491L2259j7311l4515m8985Q964J05577m6547l655
14862A4757J4510k6064J5775M7509K0937j0609P2370j16737J5311o7943J4344
$$ y = [-32302, 18296, 33814, -397, 6079, 49826, 20330, -26764, -11631, 44662, 17665, 50031, 17064, 22887, 51351, 39506, -40151, -66580, -35090, 2261, 41484, 8901, -20072, -7418, -37357, -17041, -40336, -142941, -234328, -164384, -83441, -31235, -2460, -19782, -26298, 13603, 20907, -27691, 41288, 53851, 77985, 98490, 62564, -71695, -125710, -17065, 97499, 188560, 124937, 108073, 109088, 115105, -15891, -67020, -96439, -93335, -36064, -14124, -28020, -41263, -61621, -40784, -43110, -24411, 1121, -7162, -32648, -21562, 43713, 69167, 41703, 20726, 77688, 4102, -20521, 18970, 51229, 33918, -597, -49582, -40618, 64959, 18412, 14757, 29267, 3203, 18978, 66487, 87424, 76815, 149185, 32448, 47759, -20184, -5840]
14851e840N9700P4554J219m4491n3223o1478j4007K4721o0826j1327M6647O8817
14839B4466m7849m5737k2937n0682k2391N6191N3593j1834j1318J08335O910k8962
14827G785L6164r0996N7281J01812Q5166j16173j43721J2741J8988Q2695J210
14816E2952n7794J9578l3952j04412J1822K7954Q6509Q64j17784L1434K7087O0612
14804D870l4673q676J3736J4389l1149l5138n5939M0634N7600n2166L42L8209
14792d7961J10319K867m7585K3355L0099j8955p3155n1982k2351L5552K2142L9122
14780A467o4306j9316m0150M9449J01340M6927p500r003j1076m2940m2285M1901
14768D508N3145O584j5108m777J3910N1825o1448n7260P1903J00752P636m2145
$$ y = [-5840, 53860, 128414, 129633, 85142, 31919, -29559, -43566, -18845, -79671, -90998, -44351, 24466, -23383, -69120, -92057, -142739, -165130, -108939, -55346, -67180, -78498, 29837, 36747, 7785, 43949, -47047, 10234, 112046, 197212, 81039, -62682, -49941, -30953, 51742, 52952, -4842, 14736, -19216, -123628, -111806, -83852, 2657, 3521, -114263, -82829, -55742, 4870, -29803, -38479, -24743, -10354, -41503, -76641, -132580, -91946, -34346, -86512, -86170, -47961, 62358, 65225, 17640, 40995, 71094, 52139, -21016, -72998, -95349, -59797, -37655, 1467, -62839, -82155, -122305, -72856, 28484, 75411, 67911, 58908, 47832, 4892, -37393, 4508, 57653, 64237, 49129, 44352, 58262, 110087, 48639, -8621, 63282, 164034, 171670, 129525]
14756A29525o5907j00969o4984R8876P6147N8848l5785l6722R290l1882l8239
14745a802p6579n5568k5906J7337P409Q2665q285K0120K0749O755o1971L9205
14733c5871P0694J1842M5791L0270o1841l6110J5165Q9304N4287o9621n6653o7962
14721a0705K4216j0726r8599l5283k7764k8180O1200O2499j4303N2921J39412
14710A14688J4j7453j03098j6266l4026k2030k2684M8663N2138M9174j16322m7960
$$ y = [129525, 63618, -37351, -102335, -3459, 72688, 131536, 95751, 59029, 68319, 36437, -1802, -78381, -133949, -159855, -142518, -135109, -52444, -60729, -40609, -19860, -13105, -75076, -35871, 34823, 46665, 92456, 122726, 60885, 24775, 39940, 129244, 183531, 113910, 57257, -10705, 13511, 2785, -95814, -131097, -158861, -187041, -125841, -63342, -77645, -24724, 114688, 114702, 97249, -5849, -22115, -56141, -78171, -100855, -52192, -54, 49120, -67202, -115162]
$$ [...]
##END NTUPLES=NMR SPECTRUM
##END=
