##TITLE=Analysis number 328776
Compound Code cc 64508
Book Reference 510/62
Project Code adrs
Chemist Name jimp
##JCAMPDX= 6.0         $$ Bruker NMR JCAMP-DX V2.0
##DATA TYPE= NMR SPECTRUM
##DATA CLASS= NTUPLES
##ORIGIN= Bruker BioSpin GmbH
##OWNER= nmr
$$ XWIN-NMR		Version 3.5
$$ Tue Jul  3 12:25:16 2007 GMT Daylight Time (UT+1h)  MAYBRIDGE\nmr@NMR_250MHZ
##.OBSERVE FREQUENCY= 250.131544655141
##.OBSERVE NUCLEUS= ^1H
##.ACQUISITION MODE= SIMULTANEOUS (DQD)
##.ACQUISITION SCHEME= undefined
##.AVERAGES= 16
##.DIGITISER RES= 18
##SPECTROMETER/DATA SYSTEM= dpx250
##.PULSE SEQUENCE= zg30
##.SOLVENT NAME= CDCl3
##.SHIFT REFERENCE= (INTERNAL, CDCl3, 0, 16.4439)
##AUDIT TRAIL= $$ (NUMBER, WHEN, WHO, WHERE, WHAT)
$$ ##TITLE= Audit trail, XWIN-NMR		Version 3.5
$$ ##JCAMPDX= 5.01
$$ ##ORIGIN= Bruker BioSpin GmbH
$$ ##OWNER= nmr
$$ C:\u/data/dgb/nmr/ADRS/230/pdata/1/auditp.txt
$$ ##AUDIT TRAIL=  $$ (NUMBER, WHEN, WHO, WHERE, WHAT)
(   1,<2007-07-03 12:24:53.90 +100>,<MAYBRIDGE\nmr>,<NMR_250MHZ>,
      <created by zg, POWCHK disabled, PULCHK disabled
       configuration hash MD5:
       76 6E 9A 78 1E 09 19 81 EC 84 63 8F B0 6A 59 2D
       data hash MD5: 64K
       35 A2 F9 99 7B DF 63 C2 BC 4A 16 FF 08 39 49 1D>)
(   2,<2007-07-03 12:25:06.59 +100>,<MAYBRIDGE\nmr>,<NMR_250MHZ>,
      <Start of raw data processing
       ef LB = 0.3 FT_mod = 6 PKNL = 1 SI = 32K 
       data hash MD5: 32K
       23 33 BC B7 4C 48 64 EC D5 A0 73 2C E1 70 BD 05>)
(   3,<2007-07-03 12:25:08.36 +100>,<MAYBRIDGE\nmr>,<NMR_250MHZ>,
      <apk 
       data hash MD5: 32K
       E5 41 E9 38 BE 3C 06 4C 97 10 75 CB 84 BE 16 FF>)
(   4,<2007-07-03 12:25:09.05 +100>,<MAYBRIDGE\nmr>,<NMR_250MHZ>,
      <abs ABSG = 5 
       data hash MD5: 32K
       EF EC 53 A4 BA CF FB FA D7 AA 3E E0 88 11 99 A8>)
$$ ##END=
$$ 
$$ hash MD5
$$ 2B 73 B4 6D 0E 06 2A B3 4C 90 EF 3E 4C D3 3D B3
##$RELAX= 
##$RELAX= 
##$RELAX= 
##$RELAX= 
##$RELAX= 
##$RELAX= 
##$RELAX= 
$$ Bruker specific parameters
$$ --------------------------
##$DU= <C:\u>
##$EXPNO= 230
##$NAME= <ADRS>
##$PROCNO= 1
##$TYPE= <nmr>
##$USER= <dgb>
##$AMP= (0..31)
100 100 100 100 100 100 100 100 100 100 100 100 100 100 100 100 100 100 
100 100 100 100 100 100 100 100 100 100 100 100 100 100 
##$AQSEQ= 0
##$AQ_mod= 3
##$AUNM= <au_zg>
##$AUTOPOS= <26 >
##$BF1= 250.13
##$BF2= 250.13
##$BF3= 250.13
##$BF4= 250.13
##$BF5= 500.13
##$BF6= 500.13
##$BF7= 500.13
##$BF8= 500.13
##$BYTORDA= 1
##$CFDGTYP= 0
##$CFRGTYP= 5
##$CHEMSTR= <none>
##$CNST= (0..31)
1 1 145 1 1 1 1 1 1 1 1 1 1 1 1 1 1 1 1 1 1 1 1 1 1 1 1 1 1 1 1 1 
##$CPDPRG= <>
##$CPDPRG1= <>
##$CPDPRG2= <>
##$CPDPRG3= <>
##$CPDPRG4= <mlev>
##$CPDPRG5= <mlev>
##$CPDPRG6= <mlev>
##$CPDPRG7= <mlev>
##$CPDPRG8= <mlev>
##$CPDPRGB= <>
##$CPDPRGT= <>
##$D= (0..31)
0 1 0 0 0 0 0 0 0 0.06 0 0 0 0 0 0 0.0002 0 0 0 0 0 0 0 0 0 0 0 0 0 0 
0 
##$DATE= 1183461892
##$DBL= (0..7)
120 120 120 120 120 120 120 120 
##$DBP= (0..7)
150 150 150 150 150 150 150 150 
##$DBP07= 0
##$DBPNAM0= <>
##$DBPNAM1= <>
$$ [...]
##$SUBNAM7= <"">
##$SUBNAM8= <"">
##$SUBNAM9= <"">
##$SW= 20.6930455092707
##$SWIBOX= (0..15)
0 0 3 0 0 0 0 0 0 0 0 0 0 0 0 0 
##$SW_h= 5175.983436853
##$TD= 65536
##$TD0= 1
##$TE= 296.16
##$TE2= 300
##$TE3= 300
##$TEG= 300
##$TL= (0..7)
0 120 120 120 120 120 120 120 
##$TP= (0..7)
150 150 150 150 150 150 150 150 
##$TP07= 0
##$TPNAME0= <>
##$TPNAME1= <>
##$TPNAME2= <>
##$TPNAME3= <>
##$TPNAME4= <>
##$TPNAME5= <>
##$TPNAME6= <>
##$TPNAME7= <>
##$TPOAL= (0..7)
0.5 0.5 0.5 0.5 0.5 0.5 0.5 0.5 
##$TPOFFS= (0..7)
0 0 0 0 0 0 0 0 
##$TUNHIN= 0
##$TUNHOUT= 0
##$TUNXOUT= 0
##$USERA1= <user>
##$USERA2= <user>
##$USERA3= <user>
##$USERA4= <user>
##$USERA5= <user>
##$V9= 5
##$VALIST= <valist>
##$VCLIST= <CCCCCCCCCCCCCCC>
##$VD= 0
##$VDLIST= <DDDDDDDDDDDDDDD>
##$VPLIST= <PPPPPPPPPPPPPPP>
##$VTLIST= <TTTTTTTTTTTTTTT>
##$WBST= 1024
##$WBSW= 4
##$XGAIN= (0..3)
0 0 0 0 
##$XL= 0
##$YL= 0
##$YMAX_a= 477734
##$YMIN_a= -324910
##$ZGOPTNS= <>
##$ZL1= 120
##$ZL2= 120
##$ZL3= 120
##$ZL4= 120
##$ABSF1= 16.44388
##$ABSF2= -4.249292
##$ABSG= 5
##$ABSL= 3
##$ALPHA= 0
##$AQORDER= 0
##$ASSFAC= 0
##$ASSFACI= 0
##$ASSFACX= 0
##$ASSWID= 0
##$AUNMP= <proc_1d>
##$AZFE= 0.1
##$AZFW= 0.1
##$BCFW= 0
##$BC_mod= 0
##$BYTORDP= 0
##$COROFFS= 0
##$CY= 12.5
##$DATMOD= 1
##$DC= 0
##$DFILT= <>
##$DTYPP= 0
##$F1P= 14.0000005364418
##$F2P= -0.99999901652339
##$FCOR= 0.5
##$FTSIZE= 32768
##$FT_mod= 6
##$GAMMA= 0
##$GB= 0
##$INTBC= 1
##$INTSCL= 1
##$ISEN= 128
##$LB= 0.3
##$LEV0= 0
##$LPBIN= 0
##$MAXI= 10000
##$MC2= 0
##$MEAN= 0
##$ME_mod= 0
##$MI= 0
##$NCOEF= 0
##$NC_proc= -3
##$NLEV= 6
##$NOISF1= 0
##$NOISF2= 0
##$NSP= 0
##$NTH_PI= 0
##$NZP= 0
##$OFFSET= 16.44388
##$PC= 1
##$PHC0= -52.28677
##$PHC1= 11.64158
##$PH_mod= 1
##$PKNL= yes
##$PPARMOD= 0
##$PSCAL= 4
##$PSIGN= 0
##$REVERSE= no
##$SF= 250.13001953969
##$SI= 32768
##$SIGF1= 0
##$SIGF2= 0
##$SINO= 400
##$SIOLD= 32768
##$SREGLST= <1H.CDCl3>
##$SSB= 0
##$STSI= 32768
##$STSR= 0
##$SW_p= 5175.98343685301
##$SYMM= 0
##$S_DEV= 0
##$TDeff= 65536
##$TDoff= 0
##$TI= <Analysis number 999999
Compound Code 99
Book Reference 9
Project Code 9>
##$TILT= no
##$TM1= 0
##$TM2= 0
##$TOPLEV= 0
##$USERP1= <user>
##$USERP2= <user>
##$USERP3= <user>
##$USERP4= <user>
##$USERP5= <user>
##$WDW= 1
##$XDIM= 32768
##$YMAX_p= 314881252
##$YMIN_p= -120884
$$ End of Bruker specific parameters
$$ ---------------------------------
##NTUPLES= NMR SPECTRUM
##VAR_NAME=  FREQUENCY,     SPECTRUM/REAL,   SPECTRUM/IMAG
##SYMBOL=    X,             R,               I
##VAR_TYPE=  INDEPENDENT,   DEPENDENT,       DEPENDENT
##VAR_FORM=  AFFN,          ASDF,            ASDF
##VAR_DIM=   32768,         32768,           32768
##UNITS=     HZ,            ARBITRARY UNITS, ARBITRARY UNITS
##FACTOR=    0.157963299565203, 1,           1
##FIRST=     4113.10804601306, 0,            0
##LAST=      -1062.87539083995, 0,           0
##MIN=       -1062.87539083995, -120884,     0
##MAX=       4113.10804601306, 314881252,    0
$$ Real data points
##PAGE= N=1
##DATA TABLE= (X++(R..R)), XYDATA
$$ [...]
24079 12620 -38775 -45378 -39891 -59487 -52542 -34332 -17448 -7713 -9349 -3003 -30474 -34068 -15373
24066 -15373 -3469 -16600 -5067 33889 36057 13740 -20447 6858 47947 56507 50614 17000
24054 17000 17138 -10374 -22021 8371 16774 19909 4350 -5912 -39037 -30896 -10308 5363 18786
24041 18786 -2344 -15190 -21839 -20281 -14467 -25479 -38083 -45658 -55300 -38507 -29046 -28695 -24246
24028 -24246 -23261 -23346 -26313 -18352 -25936 -34798 -43664 -33485 -14757 -22265 -44036 -64570 -61593 -38059
24014 -38059 -23236 -23603 -14849 -7567 7479 4676 -8715 9469 12184 4313 3672 23259 27
24001 27 -33553 -33095 -15301 -10195 14339 -22240 -22772 -10119 -23263 -55938 -55729 -41864 -41162 -22369
23987 -22369 -18782 2835 13014 18590 9141 535 -29468 -32993 -22019 -2905 15268 8658 27897
23974 27897 69380 51672 48039 17908 1842 13261 9683 18935 22683 4367 -23931 -34442
23962 -34442 -9905 2175 -10599 -13076 26469 41743 34558 13450 15330 3065 -11059 -16455
23950 -16455 -1743 -3163 29606 47812 21988 26058 -11227 -33516 -42884 -37965 -44638 -65287 -66273
23937 -66273 -51167 -48408 -33982 -12854 6071 -2367 -1305 23867 8242 -4287 -3571 575 -1574
23924 -1574 17056 -2128 -12671 -31420 -29255 -37636 -29226 -3317 -7412 1546 19682 23504 -6423
23911 -6423 -27130 -41519 -33385 -21158 -1732 -5628 -22488 -15330 3064 5725 29413 49250 42262
23898 42262 9991 10931 14048 15428 37609 18883 10570 -17113 -51469 -59746 -9350 -191 -14427
23885 -14427 -21179 -12847 -10073 -2976 9474 -4061 -25895 -27668 -45300 -70844 -70670 -65703 -39141
23872 -39141 -3034 9720 11228 -315 -29328 -53242 -62385 -52221 -25312 -9084 -12785 -17735
23860 -17735 -5408 28160 16752 15515 -3798 -24041 -31944 -36442 -37888 -7576 -12702 -18245 -36402
23847 -36402 -14489 -12606 -1013 -3415 18360 36910 8699 7550 37679 51694 47303 25323
23835 25323 18277 23200 11854 -2586 5494 26316 20914 5738 -19264 -8287 2953 49494
23823 49494 48200 45015 49482 29870 46431 43456 28084 9917 -5603 -1525 -6482 -17128 -3584
23810 -3584 11145 16471 14917 13556 -31148 -52693 -19172 -16218 -1425 18364 12841 15645 12138
23797 12138 -7201 -20154 -26917 7123 31816 31066 32170 23987 -2931 -38641 -18726 14425 8054
23784 8054 -3107 -3450 -25389 -29046 -22752 -15625 -2901 24667 18980 21895 -5296 -10376 -14060 -11135
23770 -11135 6013 3723 19987 40926 9941 3797 18609 -12379 -25560 -17086 -15635 -20227 -14848
23757 -14848 -6290 18828 35396 57424 28153 15603 7222 10134 20745 -6567 -29595 -20057
23745 -20057 80 -3182 11456 -22630 -50102 -13928 3959 -3225 -14839 -24786 -4819 1347
23733 1347 -1915 -6139 13612 13916 41645 31810 -2905 -9743 -34081 -51033 -51281 -16498 16631
23720 16631 4838 -17223 -9720 -12998 5010 22021 10208 5238 -15092 -29769 -17316 260
23708 260 16619 -5000 -12480 -1105 520 16942 32880 53242 32102 -24395 -40671 -44410 -33697
23695 -33697 -29345 -3801 11738 -507 -14235 -8219 9785 -6313 -13361 -4940 -8565 -19951 -35785
23682 -35785 -32211 3506 23394 -1576 -33158 -13848 7207 6860 -14296 -19540 -14468 -17876 -8055
23669 -8055 -35119 -30168 -11618 -19456 -6750 1540 -6643 -19839 -24554 -19249 4930 11908 6922
23656 6922 28713 30100 4440 -11962 -5809 -12187 -10639 -18385 -16183 -646 26694 29516 28343
23643 28343 -16331 -50229 -26027 -28756 -24342 -20815 -23469 -15900 -8328 16587 12799 8894 -16677
23630 -16677 -7613 18934 7771 -28651 -32062 -14231 -6137 -10367 -23464 -25109 -10799 -7779 4210
23617 4210 5535 24934 49677 52247 16338 -5303 12076 14508 4649 13078 17662 23556 26680
23604 26680 22090 -1844 -32915 -31658 -24691 -22449 -26926 -1586 -4806 -12195 -362 11090 21327
23591 21327 50040 81517 54128 8904 21401 21472 12354 7091 -17110 -13993 -17078 -12966 4630
23578 4630 -1061 -31777 -49279 -19236 14324 39447 49654 43393 39828 21468 10655 3056 2817
23565 2817 -18530 -26460 -7953 44238 27572 -5351 -19525 -13541 -11 40432 64652 65254 61652
23552 61652 50546 25542 34487 26341 23070 24946 15868 8123 -8097 -29002 -32400 -22845 -33355
23539 -33355 -54122 -58746 -59807 -30009 1661 31012 38236 7920 -13970 -15968 840 20995
23527 20995 -11392 -42093 -45404 -26714 16985 14225 -8260 3107 30967 8275 -16793 3169
23515 3169 -10274 -25214 -27769 -37045 -9553 -6983 7824 5466 2135 -12595 -16155 -20922 -300
23502 -300 19548 25249 19882 -5536 -34799 -16569 -28187 -24540 -35423 -19580 -22810 -34180 -14780
23489 -14780 -26595 -43558 -27452 -11203 1484 -8791 -11275 -19740 -35721 -30843 4345 15834
23477 15834 21494 -8684 -39908 -33470 -8990 -18635 -28133 -18833 16173 27268 27035 13999 15446
23464 15446 26255 7983 -35806 -50574 -22712 940 -7357 1146 5126 -14413 -20841 -8320
23452 -8320 4350 14485 -1462 -22421 -34401 -17665 31494 52535 39181 13779 18406 6140
23440 6140 -19543 -28515 -31517 -28632 -38374 -21717 -7541 -6444 -1036 -3015 -7700 -13382 -12801 -16287
23426 -16287 -20999 7999 729 -2402 8881 11614 -7356 -33730 -22049 -27097 -20678 -7931 -18655
23413 -18655 -12643 12489 38201 21021 -14504 -21267 -22200 -16260 -18913 -25277 -19497 -16531 -8957 4535
23399 4535 12050 33076 9195 6322 18643 23118 530 4881 20290 16815 15497 15413 23122 909
23385 909 -11064 4228 10205 26983 20360 -10587 -21393 -25615 -21949 -19519 8087 57128 54870
23372 54870 23404 11055 -12809 -31747 -38858 2104 15485 -3767 -14921 -3591 -1153 2384
23360 2384 14119 21904 33966 46730 27376 18674 4084 -17419 -4674 10350 11660 11294 21190
23347 21190 42425 36210 17754 30763 19403 6543 3172 -3070 -11947 10495 -9385 -12647 28576
23334 28576 29602 -2937 -21213 -14912 -26364 -56384 -60729 -75977 -79137 -74175 -59169 -33126 -15522
23321 -15522 -18635 -28759 -29522 -25057 -14418 -18284 -155 -5344 -19373 -5400 30442 20977 35144
23308 35144 57873 63126 65177 48386 27931 32356 38600 -309 -13949 6285 -9086 -20057
23296 -20057 -27296 -13677 -12728 -15905 -26507 -32374 -44162 -67262 -100626 -105720 -65696 -42832 -27647
23283 -27647 -22569 -8939 -1844 -7878 -36317 -38338 -39622 -15965 -1534 -3163 -4084 26592 27816
23270 27816 -2454 -18447 -27828 -22154 -7371 -40531 -28701 -18540 -22228 -2855 25554 29287
23258 29287 -18478 -43766 -14430 -2406 -2596 -4880 -25755 -21119 -14687 -2202 -11719 -33206 -61481
23245 -61481 -56449 -29954 -7654 5377 31326 12571 6931 -11858 -16485 -22186 -12304 -31221 -17443
23232 -17443 -1840 -23450 -18025 -7010 12249 21856 998 1565 28539 25482 7458 -8831 -18790
23219 -18790 -8508 695 -6955 -13829 -2015 -22071 -56162 -47289 -26636 -13165 -5763 20140 22382
23206 22382 1575 8882 21733 22512 22986 808 -27020 -29523 2875 20379 -8656 4134 19698
23193 19698 2133 -17975 -39512 -42627 -19426 7326 22233 9645 20988 8307 -16252 -29727
23181 -29727 -18979 -14812 -4108 -3327 -5466 -4452 6299 2462 -12760 -7374 28212 58193 37859
23168 37859 5014 -12359 -14083 11650 -14978 -45720 -42183 -12860 7239 1665 9928 -23220
23156 -23220 -37893 -36826 -17416 -8697 -18176 -26183 -20041 10300 9535 5645 -7729 2295 23206
23143 23206 45654 28921 17895 18886 11859 -5770 -29237 -32450 -17617 3241 6225 10490 7643
23130 7643 48221 60355 77411 70705 19133 -2880 -6369 -651 -7466 -13105 -31411 -4227 26709
23117 26709 26570 -8489 2100 39723 57919 54954 13351 -3425 7298 266 12072 2733 -6266
23104 -6266 -19735 -32683 -60059 -69709 -32765 -7649 14956 26742 45099 41844 39639 45254 58642
23091 58642 59639 25810 -7793 -31384 -50370 -68905 -70117 -32027 -954 3288 -27441 -21527 -4356
23078 -4356 20261 30387 7633 -3311 -38721 -23003 1684 22389 39429 24441 16358 19650
23066 19650 7612 8618 5408 7200 9938 25526 36246 2126 -22204 -14455 -22380 -29641 -26332
23053 -26332 -56646 -77805 -75246 -77626 -71404 -63779 -51877 -62375 -40884 -20192 -25973 -25666 -13831
23040 -13831 -4937 18954 5761 -17503 -25685 -44273 -46312 -56687 -49505 -29532 -15426 -8962 10613
23027 10613 -260 -8172 -17279 -31029 -61151 -54125 -39478 -45600 -38541 -50794 -69467 -52321 -13845
23014 -13845 13688 11605 9422 7827 -22222 -45943 -21022 328 -16842 -32990 -46386 -44090
23002 -44090 -19512 -2180 -8875 -22528 -1430 -1281 -14046 -27160 -12284 -7289 -8213 -2381 -3726
22989 -3726 -7115 -18122 -18115 -35885 -36873 -24429 -16287 7951 -1568 -2912 -6042 -6903 -4572 -5811 -2924
22974 -2924 83 11161 14665 1083 8289 13040 51389 47173 19494 1426 11938 25334 10096
22961 10096 6855 14020 34045 20207 28125 26759 36053 -4706 -3965 -25142 -24067 -37270 -33412
22948 -33412 -24857 -5794 30865 16523 -17863 -22257 -19209 -10631 1095 -13920 -5487 13027 11450
22935 11450 26437 19804 13876 16333 -8003 -11211 -12076 -27103 -23006 2823 4680 -27422 -10653
22922 -10653 -14627 -49169 -60577 -38514 -17247 -15843 -28341 -37634 -48844 -45839 -17569 -28626
22910 -28626 -36340 -16736 -11471 8612 22256 -4747 4916 15592 7956 6612 10415 35310 69591
22897 69591 63573 25072 23630 -4739 3261 38719 58064 56880 49951 45741 19162 21581 -4361
22884 -4361 -11757 12394 14343 17663 32373 36934 8505 1552 -8680 -6599 8338 29290 46031
22871 46031 36946 21227 8147 -31730 -35181 -22164 -22649 -12585 -28881 -41015 -27472 -39841
22859 -39841 -31814 -15904 1704 5160 14040 6637 5107 7549 18895 16339 24584 37007 45496
22846 45496 18436 6889 -15750 5771 35573 26320 19279 692 -2938 -1340 1147 -4608 -21543
22833 -21543 -37296 -49282 -48767 -42423 -53191 -31339 7539 29318 33318 -8142 -50645 -53618 -5111
22820 -5111 26016 26535 27374 22877 8797 7975 -18662 -22718 -36021 -43132 -10885 13623 19320 11559
22806 11559 8116 5284 -410 -21863 -23041 1226 13036 16897 32794 54109 54870 28113 7697
22793 7697 4988 24975 29767 13975 27488 24352 -10393 -2602 3788 3042 27232 -429 -26347
22780 -26347 -44533 -32802 -6367 21953 24700 -2833 1058 19089 17817 23222 13105 -17125
22768 -17125 -32847 -12726 -17476 -22479 -11943 8686 -7900 8347 9454 14446 12728 879 -12008
22755 -12008 -29651 -25188 -25222 -34760 -38744 -49200 -35917 -21525 -32333 -31025 -12217 -15147 -35168
22742 -35168 -34447 -29276 -13099 -8666 -25397 -40340 -44277 -40913 -39684 -41792 -39849 -27867 -8887
22729 -8887 3818 -1704 -5781 -23419 -13288 -34204 -38463 -23570 -45656 -47905 -41851 -50965 -9668
22716 -9668 1391 -11262 -24421 -8428 7753 -2137 -19217 -27308 -25089 -17583 13538 18031 16566
22703 16566 302 -10714 16685 26504 18010 6025 -18884 -31286 2297 -7991 -26375 -22556
22691 -22556 -16134 11033 5228 -7705 -6106 -27022 -39305 -26159 -38386 -45372 -47775 -56264 -35839
22678 -35839 -19050 -16884 1159 12488 24195 11198 9653 4188 29917 29350 26005 48742 53032
22665 53032 45778 19125 9709 25640 29884 17421 171 -4089 -2529 9772 -14275 -19329 -26734
22652 -26734 -33255 -40928 -40897 -23540 29257 22199 -18769 -11419 -4815 5195 -7983 -56570 -43305
22639 -43305 -35144 -29566 -6975 25890 30458 20476 24599 21889 -4961 7326 4452 6906 -8162
22626 -8162 -17095 -34822 -18582 -9202 -8262 8485 7346 10200 -11547 -25075 -41270 -33436 -2378
22613 -2378 2767 12311 18444 -22241 -35366 -8643 7348 4939 758 11192 24936 27976 -17877
22600 -17877 -34345 -50327 -67005 -67940 -71484 -46613 -32689 -19505 -17148 -22502 -16854 -27903 -41970
22587 -41970 -21025 15247 36240 45454 16257 803 554 -24701 -17609 -11968 -12524 -22364 5603
22574 5603 6417 -2187 12710 -5981 -37502 -58192 -53625 -35071 -25065 -18235 -26722 -41253 -36261
22561 -36261 -41242 -10328 22970 31849 35250 30286 37967 27197 28862 30354 23161 6196 110
22548 110 2014 5053 1097 11225 3197 1196 -6174 -32053 -561 29012 43304 21668 -2777
22535 -2777 -26914 -20906 -5399 -27186 -47374 -16156 11102 14696 3711 372 -28375 -42298
22523 -42298 -23735 -17518 -34674 -33311 -11744 1218 21188 2596 -12877 -17507 12427 3215
22511 3215 -15539 -24580 -8519 -13558 -7387 -3614 -12965 15453 51736 36389 31991 39771 24572
22498 24572 33561 2627 -45237 -77629 -55216 -37127 -10825 -288 -6841 -20287 -33118 -20094
22486 -20094 -31143 -15852 -20075 -32866 -25650 -11975 -24971 -16595 -7223 2856 -9066 -18755 -9790
22473 -9790 -892 -20080 -15352 3912 7316 -6325 -32171 -39763 -58987 -32708 -27083 -60965 -70992
22460 -70992 -49552 -21662 -12453 3435 418 -13756 -12734 -22169 -29841 -20570 3435 4405 -10008
22447 -10008 -42063 -74138 -47104 -21015 -40845 -34427 -749 -7888 -24993 -45234 -48322 -35562
22435 -35562 -36099 -35401 -22372 -19993 -1857 -11327 10590 23611 13915 20573 15285 -20817 -43377
22422 -43377 -68556 -49525 -11096 3917 -11806 -21604 -33310 -16438 22323 36416 32952 -3155
22410 -3155 -39560 -70099 -64314 -55634 -40992 -39791 -62767 -59663 -58281 -53150 -16385 -21657 -11494
22397 -11494 32867 24466 -237 5915 -1889 -3375 -17862 -3100 -14594 -17481 -1432 22427 29386
22384 29386 25789 39251 -7744 -48470 -51740 -47980 -20944 -9096 -11067 -19771 -7758 2831 33102
22371 33102 15050 -14788 -32567 -26653 -21827 -14177 -7961 -4083 -22472 -34810 -36517 -51959 -46947
22358 -46947 -21874 -32466 -57604 -74851 -58110 -53511 -55116 -47347 -27850 -29023 -31665 -34375 -15498
22345 -15498 7637 14037 12605 14370 -5175 1506 5296 -3633 -757 1884 4405 -9743 -20684
22332 -20684 -32895 -32227 -42109 -57436 -35087 -19449 -9338 -4445 4755 -611 -18932 -40748 -40958
22319 -40958 -34772 -18080 -1559 6936 -11858 -1679 16828 26311 7718 -742 -1330 30675 9226
22306 9226 -35634 -37592 -34253 -40083 -53570 -41885 -2366 7544 5326 -260 -16741 -8628 -13659
22293 -13659 -26526 -34504 -30890 -29237 -6194 18958 17303 11054 -17726 -1012 1609 -10130 2180
22280 2180 17951 39959 34024 20253 -13147 -55769 -60875 -26265 -8166 -14103 -10521 -23495 -15497
22267 -15497 -11364 -7228 2807 9214 -10723 462 4938 -282 4594 -17591 -36308 -29592 -19732
22254 -19732 -38898 -38488 -8685 -60365 -87041 -65558 -59280 -32442 -26399 10463 32567 49842
22242 49842 42276 1750 -2686 -17163 -43137 -22967 -3543 748 -23680 -13847 -4279 -6364 -10218
22229 -10218 1270 6834 5438 1992 5830 33483 39188 31728 -3857 -24035 -36431 -42852 -59328
22216 -59328 -60735 -65637 -85740 -89513 -84735 -72925 -64559 -21522 4161 -4635 -18260 -25404 -26902
22203 -26902 -35480 -28496 -25585 -17362 8780 28716 39016 16903 14656 8172 25426 44666 24791
22190 24791 -25760 -24038 -2809 -8384 1407 13392 10201 3896 10222 -5610 -14451 -8130 -2217
22177 -2217 13267 22898 20531 1187 -26523 -11798 4546 12397 -19685 -49241 -27367 -10198
22165 -10198 1113 -17786 -23119 -6062 1605 5283 -15021 -32126 -33789 -32116 -35780 -36686 -34704
22152 -34704 -61839 -56373 -61164 -75033 -77292 -70994 -43447 -6063 -38618 -44493 -37186 -5204 15509
22139 15509 -27304 -30405 -33274 -28833 1811 21361 8554 30564 66342 74941 33715 8254
22127 8254 23836 39067 16380 -35818 -54216 -18262 -14608 -24430 -23913 -1523 12296 34623 33415
22114 33415 610 -34103 -56633 -46478 -13976 -13200 -25826 -43951 -74104 -55884 -36270 -30938
22102 -30938 -23671 -19318 -20086 -19179 -19500 -21240 -363 -1298 -21518 -26212 -7719 17885 2690 -27433
22088 -27433 -5363 2723 -10398 14611 5875 -5027 -5326 -23640 -18244 -788 2595 17056 9345
22075 9345 -20117 -25549 -34374 -24381 11470 16003 -5048 -13379 -14304 -23994 -35286 -45756 -50695 -25266
22061 -25266 7861 27250 13469 25261 35391 7742 2703 5803 28877 30512 21594 -11033
22049 -11033 -43611 -71010 -68099 -62199 -46579 -21070 -6103 -2845 -225 12771 18156 5375 7670
22036 7670 -3202 -8118 -13388 -10193 -12697 2004 20591 5504 748 8011 10248 33955 44681
22023 44681 50655 12816 6764 35346 41694 30496 -1057 -44750 -31451 -12910 -12393 -30996 -72334
22010 -72334 -62695 -65179 -60332 -46443 -39295 -885 26475 16579 11235 -2244 3924 -4533 -10051
21997 -10051 4302 30141 39006 50938 25703 23307 9438 5950 19555 -17115 -43651 -24950
21985 -24950 257 -2050 -15246 -1405 1788 2829 2969 23239 -4157 -26306 -18091 -17918 -22432
21972 -22432 -32579 -48604 -40801 -34330 -7961 4428 -1226 3144 12644 2840 22007 19974 877
21959 877 -22368 -42575 -55177 -53342 -29436 3339 20885 15154 15735 15246 26223 19448 6919
21946 6919 11382 10657 -408 -13358 6004 27730 -6163 -55348 -67787 -39471 -18374 -16806 -1458
21933 -1458 27779 13465 -8314 -21181 -27913 -29803 -46608 -62640 -40335 -24894 -44080 -58453
21921 -58453 -40480 -13506 -13635 -14934 -7398 7203 18733 22776 8014 -24856 -29314 -10264 10544
21908 10544 19602 -2294 -19729 -12739 -6390 -35867 -58347 -16185 -6207 -8359 -110 18095 22608
21895 22608 35026 38953 24691 12276 -17509 -43319 -44522 -36560 -7004 33706 34234 34683 32762
21882 32762 21523 17503 622 -5359 -1657 -21668 -14503 -24767 -25147 -23514 -33221 -17374 3994
21869 3994 16193 26616 34994 19025 -2734 -9486 -25775 -28495 -6916 9096 8276 -21251 -33109
21856 -33109 -58555 -44972 1285 18260 -19079 -27063 -18519 -22162 -23918 -28027 -12763 22948 19895
21843 19895 3354 -17816 -32168 -30916 -21200 9845 19794 8447 13603 -19041 -83401 -63341
21831 -63341 -29352 2210 3247 7510 19779 9170 -1347 -2698 5222 11104 14577 34330 19192
21818 19192 35429 46909 23696 1264 -5439 -18426 -27554 -34188 -6183 -12834 -18939 -22624 -14976
21805 -14976 6464 5411 11424 17703 -5144 -26948 -40804 -18649 -8319 10673 28437 11498
21793 11498 32976 32496 -10235 -18308 11293 26055 32540 12721 10269 19492 36082 45035 -273
21780 -273 2408 2664 16703 6987 14878 6677 11425 -6064 -28195 -29713 -49125 -33882 -8820 -5481
21766 -5481 -13714 -1900 -2139 -2245 -4808 5927 -1743 -21705 -14342 20211 21751 24969 31718 27280
21752 27280 21082 3553 -14215 -8357 17637 17112 -7723 -39447 -26357 -7499 -4111 -800 -37772
21739 -37772 -23651 -15009 -43335 -24223 -14927 1085 22495 12737 -4028 -8937 -28473 -21022 -3584
21726 -3584 14490 28874 12391 -28158 -34729 -12522 18129 20375 21255 41666 -7777 -40464 -44902
21713 -44902 -32072 -5439 -4205 -17510 -24205 -17719 4440 -4308 -9112 -22144 -47797 -42584 -42037
21700 -42037 -34256 -26319 -25786 -35637 -16793 25932 3993 -28525 -33953 -26436 -40903 -39451 -9969
21687 -9969 804 -2940 -27188 -31794 -36703 -59749 -66518 -38931 -38446 -29662 -15176 6849 22424
21674 22424 26410 12701 -7464 3555 -5829 -18533 -12663 -6297 19725 -4069 -15378 -19371 -3981
21661 -3981 -4174 1523 -1958 14602 12303 -4602 -13806 9176 -2232 -31286 -37724 -43560 -32501
21648 -32501 -41748 -32994 13793 28367 7073 -19557 -31623 -48526 -44601 -36259 -24095 -41468
21636 -41468 -37468 -3749 1302 -6586 20917 28179 22961 19677 4206 3914 5356 -9155 -8441 4132
21622 4132 22759 20500 7794 7877 -13403 -24113 -23945 -42780 -22191 -4538 -4435 22549 35968
21609 35968 4249 -12815 -8978 -13822 -16776 -16939 -31267 -15550 4984 -9535 -5365 -2767 868
21596 868 -14383 -3990 18774 16667 8663 -9001 -24642 -27865 -5019 30517 32063 52871 47824
21583 47824 39378 37755 32096 1420 -37858 -49086 -40065 -20108 -14689 -11532 -2388 12983 12753
21570 12753 48747 58556 53038 34884 14287 13785 -27606 -49237 -36789 -49103 -45617 -34589 -18652
21557 -18652 -15220 -15636 -27489 -18814 3089 10246 5198 -10624 -44351 -34147 -26140 -15140 -32633
21544 -32633 -39286 -37644 -29537 -23369 -50528 -53221 -51241 -26837 -6068 -4726 5886 24913 39588
21531 39588 35578 6931 -2839 -7459 -21402 -19683 -19015 -14462 -9106 12129 -24122 -42187 -38957
21518 -38957 -21286 -32933 -11965 -14470 -16414 -21765 -36797 -22604 -12506 4202 11517 8876 13580
21505 13580 18319 15188 9394 -6424 -32690 -55803 -50233 -24918 -7045 4451 2067 -7748 1719
21492 1719 2472 15886 32722 25374 -11140 -14179 -59 -3699 -2255 11046 -3982 -24080 -55384
21479 -55384 -60682 -38396 -23380 -3175 6382 15273 3038 4695 14293 20277 15870 28855 33767
21466 33767 4713 -8025 14463 13555 -5562 -12936 -23374 -15109 6894 13932 -5825 1849 5244
21453 5244 10279 14227 29160 37532 17314 -7586 9607 14312 16267 -9463 -5206 -15414 -33278
21440 -33278 -18248 10235 4182 -11622 -681 11799 6257 -5545 -9281 -1791 -6904 5231 575
21427 575 -24956 -39994 -16614 -11312 -30285 -75647 -120884 -113773 -104222 -56300 -30078 -13557 -17862
21414 -17862 -14526 -8534 -16795 -15438 -28369 -40980 -9711 9425 15477 20367 21725 -7258 -15064
21401 -15064 -11822 -7610 -6844 -10515 5551 17281 6283 1818 -512 6601 31712 22533 5522
21388 5522 -1170 -10964 -10856 7110 19716 5734 2515 15198 38291 43013 40458 30555 37791 33750
21374 33750 11946 -887 -9843 -16058 -4677 -8363 -7320 -11738 18921 17239 5536 -9837 -18377
21361 -18377 -19510 3078 -11616 -25254 -2425 8713 5986 -5500 9728 16259 17531 10295 895
21348 895 19220 18875 24686 40767 40587 22636 -8642 -2297 25356 21883 -10770 -27894 -17017
21335 -17017 -11018 3138 -7481 1445 4255 10637 4762 17167 22928 26962 15046 12786 33459
21322 33459 22191 -1096 -22414 -37829 -36630 -13074 -9485 -19081 -30955 -4124 6578 1767
21310 1767 -35970 -35089 -37203 -21033 -16769 -18295 -17875 -23424 -42136 -43693 -37421 -26560 -19172 -26233
21296 -26233 -36855 -26071 -12882 -6648 5022 -7779 -32851 -44851 -65334 -78961 -58232 -39256
21284 -39256 -43611 -26324 -8632 -11025 5223 -4046 14999 29579 28001 24849 16067 9835 24247
21271 24247 26671 17409 -8776 -31546 -35439 -35243 -47038 -43953 -20124 -26642 -40947 -32145 -16672
21258 -16672 -31069 -56689 -37513 -12519 -6006 9459 -3991 -10336 -614 -4025 -20207 -3188
21246 -3188 27321 17012 -8456 -4040 534 -639 -6505 -1922 -9392 -26111 -26186 -3725 -5821 -44409
21232 -44409 -24770 3612 -4398 -3290 20399 1052 -28696 -38917 -11778 -6462 -27207 -31651
21220 -31651 -17514 -33626 -33155 -19103 -22577 -47588 -46815 -26555 -18349 -17815 -41282 -40938 -12062 -18148
21206 -18148 -14369 -15365 -17643 -4705 -40016 -46139 -50104 -36648 -20740 -17287 9400 13813 11501
21193 11501 3157 -3559 -7890 17439 36581 2223 171 -7224 3330 -2787 -10254 3970 14290
21180 14290 15509 25295 35293 34020 31949 26758 38256 10402 3695 16462 5987 8644 32217
21167 32217 30330 14063 10123 31374 49014 33781 44761 31415 26106 31066 2368 -4813 23369
21154 23369 7789 -18561 -25481 -761 6879 -16274 -624 -10442 -38061 -55534 -46071 -32764
21142 -32764 -37884 -49451 -34291 -41649 -29120 -17228 -8378 -9304 -11601 -33042 -51897 -37234 -24776
21129 -24776 -1621 819 -9249 4045 5918 345 15813 36830 37349 -3051 -17581 -28621 -20065
21116 -20065 -3616 19934 21341 1055 10790 43578 34127 19217 1423 -13507 12924 16836
21104 16836 6427 -8792 -5416 8013 17950 10939 17298 11620 -10177 8173 25607 28502 25883
21091 25883 25383 34529 17769 449 10684 -1384 -5072 -12123 -19222 -2575 -817 -302 -1684 3493
21077 3493 30418 43682 38091 45085 51170 52513 41454 3587 383 2327 10481 5856 6172 4356
21063 4356 -14983 -22916 19555 26293 -5293 115 -9251 -22214 -14120 -3137 23355 28097 426
21050 426 -256 -7991 15157 2 -8742 -9747 -17708 -3229 25792 24879 14587 -371 -7035 -15453
21036 -15453 -28081 -12211 25060 41450 31442 29217 36973 16518 14732 6282 -166 -10018 -19961
21023 -19961 -16019 -16161 -24334 -39572 -46536 -38464 -30381 -29503 -13674 -13607 -27278 -26630 -33750 -36707 -1906
21008 -1906 13571 -17359 -40514 -12247 41992 15474 -12631 -9241 -17213 -6086 -15186 -32600
20996 -32600 -39594 -22017 -16713 -26877 -12931 -4782 16934 6183 -6767 -34818 -34333 -24143 -17160
20983 -17160 -15141 -32404 -26584 -15028 13599 17536 -2250 -26356 210 13343 23181 18914 -24469
20970 -24469 -40343 -7064 7797 6759 -15828 -23286 -26869 -10473 16515 32031 23157 17396 8116
20957 8116 3826 -14845 -17101 -8688 9915 28141 16455 -1898 13660 40042 48452 45781 52578
20944 52578 33479 14797 -19116 -51410 -59198 -41989 -5296 12324 15198 -20161 -20356 -18791 -33160
20931 -33160 -49592 -41681 -6015 702 3649 -7592 -7770 8660 39428 44208 9945 -6557 9695
20918 9695 -4657 -16607 -7125 -15736 11040 26569 7489 -3115 18290 43032 15053 -28039
20906 -28039 -36176 -13325 1399 -8193 8525 36755 16610 6849 12574 17802 18649 23588 26715
20893 26715 11936 5333 25107 30307 29154 26822 10587 -7127 -28671 -38220 -37535 -23028 4169
20880 4169 30519 33832 34063 26818 49013 22576 6888 11213 13871 -8022 -19700 -4707 17615
20867 17615 33766 30097 7722 -4543 -592 -2931 -2136 -2953 -298 -10474 -9777 10680 16013 35139
20853 35139 29675 18012 16664 21352 15301 26299 19855 19208 45308 28402 1792 -4910 -3712
20840 -3712 -17895 6377 45826 35762 10285 10072 -295 -11113 -4162 19583 46404 30420
20828 30420 4252 5785 16412 12217 15991 9928 31500 28053 21193 4014 -24494 -20075 5169
20815 5169 26935 42107 29296 36689 55845 22376 -1994 1721 -4891 -20945 -32829 14938
20803 14938 52956 34038 37092 26953 11140 4053 9877 22179 39920 24512 -10899 -14480
20791 -14480 6550 19922 21304 -971 -16615 11658 28524 45184 29157 21170 -2316 8810
20779 8810 8428 -866 20375 8677 702 19943 14158 -9300 -5479 15572 25462 44587 41623
20766 41623 18108 12063 45211 61889 68371 71573 70425 53356 24089 -11354 -34482 -12549
20754 -12549 5298 12652 2676 -2947 -3086 -11906 -1697 7276 4819 -315 9342 4182 19757 4316
20740 4316 -13012 -10998 10579 18876 43857 53337 45087 49881 66055 57154 27063 16834 40123
20727 40123 29951 37057 52376 55012 53297 43667 30836 34468 56330 94452 95465 75650 64931
20714 64931 74475 88778 85538 57243 58411 62928 47151 51562 47691 60217 86298 92756 92322
20701 92322 74122 56894 68835 65506 42704 58874 73652 74979 72697 68128 76675 86513 68929
20688 68929 41309 20398 21015 59833 73079 67300 46467 34181 49706 43829 49878 60817 55005
20675 55005 33654 38113 45813 35909 5476 4451 6258 36203 47054 41278 61089 48784 31520
20662 31520 13464 14371 17271 12395 -12168 21045 27551 18288 1196 -17587 -8764 19660 41691
20649 41691 23617 10400 3783 -5210 -1905 30749 49421 63963 35737 28839 30729 28978 18451
20636 18451 8967 9012 -5158 -6159 542 18993 37494 48295 27441 10288 3002 6215 9571
20623 9571 3815 14560 21981 18245 33613 30848 3565 1369 -4852 -19093 -22831 -27793 -15741
20610 -15741 3845 17712 31523 31563 -6572 -18514 4375 110 7774 6407 14891 16465 33733
20597 33733 34072 20766 22756 9912 14061 14898 19543 20423 14905 16185 20897 23917 18143 14655 16718
20582 16718 8055 518 28874 28293 -18508 -26100 6132 5543 16024 -515 -38273 -29537 -5652
20569 -5652 9350 8142 26255 26846 52785 72318 35421 -18392 -21326 -40174 -51993 -15584 -6596
20556 -6596 -2932 -16205 -9390 -5937 -337 7251 23577 34606 -4943 -14422 9438 -103 3493
20543 3493 17179 3683 670 -1938 11977 5525 20580 40948 47703 37282 45283 33318 -3369
20530 -3369 3295 7119 -2754 -20649 -13008 12508 3898 1311 4444 15448 16738 6290 7759 4275
20516 4275 -13137 -15741 -11754 10309 20116 16379 43407 39971 51300 46600 41239 47398 36229
20503 36229 7488 23245 31512 4400 1938 17222 6661 -20818 -4233 17292 22263 11560
20491 11560 10613 32628 16956 -6508 -8340 -8092 6125 18373 18289 36471 29715 27487 4039 -12547
20477 -12547 13792 17127 24583 35367 19445 12440 12750 -4544 -2521 -1673 11420 -2485 -26598
20464 -26598 -36330 -46632 -13292 -19822 10482 29824 32351 39856 31842 41342 45665 37779 26975
20451 26975 7871 4121 29718 37484 21377 -6213 5130 17970 6446 1099 -8232 1161 27193
20438 27193 33710 42650 45366 46429 52436 30188 -17865 -18191 29610 44043 41698 26442 24164
20425 24164 10730 40062 36495 26817 21192 9090 -2435 -20783 -5770 1652 -21952 -16706 -18983
20412 -18983 -5023 19052 24008 11190 -20343 -29513 -35361 -33062 -20968 -25764 -13013 18176 30949
20399 30949 39286 54099 55816 40607 39826 36239 47678 56379 43619 30254 24846 35738 32899
20386 32899 9238 22239 35261 11974 -590 -12221 -16462 -12815 -6752 -22134 -36014 -15352
20374 -15352 -8858 2556 11109 -8413 -15629 4909 -11340 -19617 10847 17866 2101 -14414 -29926
20361 -29926 -47797 -19726 -16437 3081 20799 41705 76353 80444 50103 39568 21818 17655
20349 17655 14255 7968 15685 30221 38782 50917 58803 56603 41351 55646 29053 1232 14100
20336 14100 20213 5359 -6528 31590 56838 42533 12549 -674 41120 35913 -6511 -5461
20324 -5461 46778 34516 -12894 -30501 -7445 20147 8593 7392 18176 35894 40243 46400
20312 46400 -21 -28326 -2045 4987 -9917 3112 15316 35475 50645 58097 26852 20867
20300 20867 21790 20985 9610 23418 14463 15389 4844 7080 37609 15557 -6721 -19667 -11860
20287 -11860 -14794 -7857 7276 -3451 4734 13939 24576 2428 -2538 -4608 2372 8092 11228
20274 11228 58592 68207 40528 37185 33745 41829 34746 21215 25774 48353 43634 15344 27402
20261 27402 44366 17627 3055 16430 5482 7359 24024 48119 58892 49874 27753 28324
20249 28324 39968 52714 50396 61717 68669 75824 52692 49507 49620 42032 20276 15921 21887
20236 21887 32086 77434 81080 46185 32658 44131 48005 50170 38723 40159 55941 64481 81046
20223 81046 85807 84194 80147 94689 100853 130221 162859 196070 226291 301994 456025 720597
20211 720597 1131846 1508592 1578918 1698787 2069671 2614553 2594098 2124422 1774201 1671222
20201 1671222 1525818 1173586 790687 502073 357428 285622 239743 197597 182256 182387 169221
20190 169221 138301 79987 36246 29043 35368 42422 39159 40121 32053 22593 33617 59443 59304
20177 59304 56550 50215 18532 31715 36919 23053 -14292 -4902 20163 35498 16597 10023 -14072
20164 -14072 -33178 -46515 -49113 -21780 -184 12103 29016 4036 -7684 15221 10042 27347
20152 27347 37425 15952 8784 15766 36391 47311 25016 3121 -9166 -28162 -17106 -44134
20140 -44134 -25788 3597 -1626 13093 44591 56147 22113 13809 1328 11852 -12301 -1846
20128 -1846 41565 47196 28272 22649 6809 -7752 -19254 -1909 5509 38090 24447 -15637
20116 -15637 -22799 -3438 11691 27126 33855 16688 5687 -8887 -34421 -48970 -20228 3792
20104 3792 -8631 -55311 -50830 -27718 -14533 -12941 -15344 -4022 -19059 -2074 9844 30733
20092 30733 17323 29930 21336 5153 7457 13825 -6123 -14983 -15256 -1276 14380 19248 35919
20079 35919 14713 -7501 15944 20677 14552 37118 56466 80759 61603 56448 73985 74871 68130
20066 68130 79565 92470 83979 40408 20564 24849 42974 46094 39554 6587 1102 2290 -8696
20053 -8696 -25151 -10403 7829 6804 4710 17533 40549 60117 64120 68280 65025 62105 73211
20040 73211 58375 67982 67035 85742 55550 410 -8510 28987 47425 52392 70698 95087 65468
20027 65468 46510 44521 21533 17364 24448 18769 3964 -4508 -5640 -15010 -10254 2322 14764
20014 14764 -12259 -21661 -11307 16454 10222 1790 27739 37150 41956 14431 11358 25940 29977
20001 29977 53165 50468 12964 1125 9806 27114 26782 -4540 -21895 -1925 7224 36281 50964
19988 50964 36902 19422 10520 2660 6296 -155 -29660 -20778 2982 -4826 -5324 -3881 11444
19975 11444 -9756 -37436 -32313 -10081 -1535 13117 1274 -21573 -27963 -40501 -39126 -20130
19963 -20130 6403 24943 34011 37896 35519 12448 -10750 9350 48062 56625 53793 46920 26746
19950 26746 7059 11191 15730 1745 -589 24763 44426 45307 23560 27041 28027 45316 43612
19937 43612 44696 47724 60282 45295 40440 15664 3258 -691 11153 45593 55483 50651 53807
19924 53807 69061 73203 43406 50123 48980 35695 28640 26528 -699 8321 29736 52409 62467
19911 62467 40737 3357 3192 19545 25077 23420 7751 -9939 -8182 13632 35206 27184 19799
19898 19799 15925 -1689 7395 11864 14800 36049 41227 19174 3210 9656 3031 22804 25533
19885 25533 9906 19294 18287 738 3225 11506 35807 30647 11435 9602 28518 43360 25119
19872 25119 25757 22404 17531 21974 7494 -13513 -8173 -13105 -12154 5357 8560 29433 9774 -10010
19858 -10010 35167 49544 57817 52989 47129 51291 24677 12393 30876 24076 42607 69447 59498
19845 59498 43594 41913 38386 39902 49976 27917 2370 16290 14091 15879 35666 49991 60035
19832 60035 53226 53649 64592 76340 51239 29975 57077 45834 54558 30251 30609 32407 57409
19819 57409 50551 28050 20670 21410 60223 88007 87256 46272 30896 32870 41564 71930 78233
19806 78233 78648 73304 68989 92463 108009 96786 95785 117372 94071 74673 91768 84869 83173
19793 83173 66639 57533 42154 44263 67635 76426 62739 54035 38624 -2841 10358 48161
19781 48161 65254 55653 30205 26579 27353 29309 37161 42271 25850 17921 37488 53636 50203
19768 50203 42158 19937 -3345 -10169 -10527 -6607 13023 13493 28523 30143 35543 11581 15404 59601
19754 59601 56230 36418 32732 41997 48672 38058 21349 4756 -24902 -34365 -19854 -24505 14877
19741 14877 51832 59891 40083 36677 46311 53618 20268 27460 22489 -10141 -9425 -6502 22923
19728 22923 39455 39682 53483 70306 101932 93816 81278 67798 37720 36207 71025 83249
19716 83249 60692 54184 49272 51109 49528 63469 48309 35695 42590 48974 79447 76347 57946
19703 57946 25388 62621 88592 56379 48536 64114 96825 110929 127307 153838 170431 174747
19691 174747 160272 142273 131345 109478 109115 117151 110173 125183 136006 128372 136053 148350 185388
19678 185388 306270 465873 624194 668145 589475 496053 371170 347270 398728 497548 628257
19667 628257 761212 776508 651597 534304 489108 506325 483685 405519 344569 329059 342437
19656 342437 374394 363403 353888 338601 272041 221058 199631 194746 185363 190617 180117 194910
19644 194910 199461 177952 220558 249607 274373 252805 243721 248642 238752 221190 228117 249918
19632 249918 277480 356645 428164 515380 590474 683983 758563 772948 715500 614791 513755
19621 513755 433153 422606 435401 451862 477839 553882 708143 853853 813871 683053 558586
19610 558586 496243 485046 516254 561601 618998 717294 704475 573158 450355 351316 308803
19599 308803 262508 236025 254838 299106 403220 476363 479192 498729 570856 625775 548603
19588 548603 389853 300716 280682 261095 262639 260180 260765 248690 235769 235481 227405 229988 262461
19575 262461 321394 384783 447296 495580 514836 543618 543492 538890 555325 562800 571358 505981
19563 505981 386337 310816 294407 290123 297557 325411 339621 305553 270255 264495 274405 303706
19551 303706 353791 389993 370069 333947 299400 308751 350754 465182 587243 562227 457287
19540 457287 345397 283923 262510 260412 216644 173330 147143 155613 177511 136388 123323 129610
19528 129610 142285 150753 153361 153585 144915 128549 120619 133471 123291 120103 112514 85643 87422
19515 87422 114401 136707 118992 74251 78029 91201 98510 102785 111596 133027 112707 107210 114909
19502 114909 130710 157716 161919 162154 171833 199974 221645 219042 198211 188685 175806 169171 159093
19489 159093 173948 189631 223582 248754 281271 334673 360511 313377 241636 179954 145236
19478 145236 168121 194025 249468 312876 361307 350941 341133 349049 362442 394907 412587 386928
19466 386928 360958 313036 256877 223329 234105 272102 311566 340178 348881 341283 333457 343385
19454 343385 348259 353922 372242 376907 455742 562502 593090 597760 547585 446565 352523 302041
19442 302041 271806 240533 207153 207116 240627 249979 275530 330743 355305 362284 376260 384955 364309
19429 364309 293636 238999 230916 207792 198745 241082 283612 322456 317380 270636 226292 172528
19417 172528 157166 178519 189725 192308 182283 180817 189663 179836 193810 199210 187843 197414 210620
19404 210620 229114 247104 256564 273566 254054 188213 161007 143636 143061 177359 190797 191843
19392 191843 191469 193897 152287 117920 96709 117492 106501 90181 97331 118093 130695 121315
19380 121315 102599 109208 125047 143898 133929 137483 129895 129557 95257 73708 84697 103392 114390
19367 114390 120372 129214 154691 123854 77508 73296 88621 70615 76885 94756 83198 97034
19355 97034 117160 96517 83468 88498 100431 117234 130847 108623 72242 73505 114655 131755
19343 131755 129874 144585 137340 130997 115225 114434 132944 135626 109329 129704 133782 136588 144820
19330 144820 145747 141014 129137 135098 107633 103255 109199 120162 127356 111669 128594 127478 129032
19317 129032 123004 105084 122554 124095 129277 140047 137078 112410 79277 74149 81862 97303 109597
19304 109597 149932 160638 116696 99234 112636 83930 56486 62862 74981 96607 98725 107593
19292 107593 117534 131244 109343 100351 101259 111656 129753 152388 152725 133832 108037 78975 85298
19279 85298 86762 90531 106309 134205 142537 130632 108497 91304 68150 69133 82175 99140 109181
19266 109181 108529 110770 86853 70445 60993 48945 44204 57357 84066 88942 113338 107162 95974
19253 95974 81022 54636 58684 60545 82384 101814 101109 62806 61990 70095 97512 137232 138794
19240 138794 134717 106787 101140 128821 138203 131579 119688 113035 94341 77893 92585 116057
19228 116057 103529 99665 107151 117419 123928 112074 115545 85117 87304 129869 159195 164308 175674
19215 175674 151273 131310 111137 118874 114848 119625 122385 126853 133161 129448 110261 119808 134343
19202 134343 135283 134504 126250 140691 137248 120877 131861 153607 162941 160153 135967 124192 138225
19189 138225 151055 156306 148294 138432 112847 125226 137020 121997 134499 176401 151615 163262
19177 163262 189310 187359 160528 151438 122041 101704 108784 113192 105687 114214 123505 137579 138901
19164 138901 144542 153838 149550 131797 124762 130493 110671 107800 136883 169633 169306 133814 122111
19151 122111 95225 88226 87786 111482 112382 127973 141608 161562 157826 147596 120835 154399 163089
19138 163089 144464 174842 187911 178177 139912 138548 157951 179217 195396 203697 209335 241727
19126 241727 284160 296333 298420 271098 260463 276284 298724 306953 293707 279832 324199 422556
19114 422556 531400 627422 644752 597186 576096 612285 626839 638992 679783 715759 752045
19103 752045 722008 639269 586785 557420 523200 493898 482434 493108 529501 570375 507026
19092 507026 426696 384556 350860 350275 362975 368832 380373 391602 391143 367700 365687 374562 387429
19079 387429 419667 437362 457570 488675 524928 548591 533071 516624 492916 476459 458596
19068 458596 486498 537823 578238 647457 769651 885763 951655 1088433 1173314 1136660 1042638
19057 1042638 941681 849942 826406 795208 809657 891989 979102 994084 980641 954847 936852
19046 936852 887852 823438 791722 779963 740799 705314 741673 828774 884127 936890 997557
19035 997557 1053872 1116696 1119705 1109815 1107188 1127033 1213732 1389358 1645010 1966392 2363080
19024 2363080 2711123 2980431 3205871 3324985 3413337 3441925 3497150 3721089 4208392 5020777
19014 5020777 6226155 7348163 7667442 7560950 7388444 7012190 6399620 5621549 4959437
19005 4959437 4597441 4591020 4775732 5004943 5263660 5692512 6465446 7812166 9924408
18996 9924408 12224899 13208513 13698905 15118528 17152148 18088766 18764126 21499918 28366033
18987 28366033 40894956 55494971 58307845 48954948 38479492 31384553 26638823 24007589
18979 24007589 24284556 28078984 33305683 33874358 31044218 29511565 31220646 34995187
18971 34995187 36484542 34125030 31300809 31262082 35616174 44310259 54906576 60627200
18963 60627200 59564204 58895737 59973750 56130825 46328055 36630498 30624251 28888528
18955 28888528 31246339 37910097 47538847 52158548 46426344 36760745 28949625 24693891
18947 24693891 23610383 25241619 29070155 34648988 43828032 57377619 66591637 65208048
18939 65208048 59054036 50724439 43214311 39485218 40746943 43777821 40576611 33016813
18931 33016813 26606897 23465539 23650471 27279276 35430651 49424903 67534389 78303294
18923 78303294 69925600 53575613 40552738 33218133 27734390 21653479 16243583 12431180
18915 12431180 10149188 8931270 8459879 8598713 9176824 10366699 11991588 12519177 11226808
18906 11226808 9004493 7113856 5976536 5545549 5780626 6711332 8190096 9197034
18898 9197034 8570136 7114781 5912452 5453856 5745697 6053231 5447877 4502052 3884222
18889 3884222 3691632 3663000 3349429 2906992 2620328 2617038 2733292 2533418 2152764 1805785
18879 1805785 1570384 1378861 1183710 1022568 892615 814808 774179 736093 667603 610749
18869 610749 604159 629532 642267 626643 614091 576773 532760 507347 513293 541000 575015 566734
18857 566734 552521 509146 472598 427163 397644 389555 377668 379821 371262 358005 373983 351747
18845 351747 327254 296944 282356 296944 295549 306777 325151 335108 333784 317329 316289 320861
18833 320861 330775 275680 260062 261061 254577 261266 262235 242931 242735 244374 229316 224511 216166 207212
18819 207212 218481 192721 180054 217630 250979 251535 239563 243528 247225 252699 233861 231838 234754
18806 234754 236754 214927 203735 227768 258298 241836 243421 249706 262532 273158 242062 217032
18794 217032 224649 197404 169661 182317 192945 205611 221200 182458 186194 184883 189067 178290
18782 178290 188907 211795 200967 197866 215202 217733 217958 220538 226914 237647 240939 252452 259435
18769 259435 289980 340656 419013 511777 479093 375527 291091 253336 231497 192662 174059
18758 174059 193718 205941 190740 158422 134362 146211 156897 160012 168696 149109 129735 119125
18746 119125 151111 181270 171110 154502 161693 203893 231798 244933 252474 247502 251261 268789
18734 268789 294242 296341 287771 288008 271090 248120 266151 273356 285903 302213 294465 260299 247021
18721 247021 257980 269988 246905 263601 278449 275109 240643 233453 225377 246899 261751 229309
18709 229309 187403 220216 242783 248847 242148 245758 258686 293453 295794 258710 264342 288620
18697 288620 293849 282685 290465 290982 294059 322622 357944 381198 418127 443643 489252 557802
18685 557802 584211 613645 614497 671973 774571 852239 827560 754666 690491 638821 558319 474555
18673 474555 408093 370694 387863 403380 420323 397406 433744 469699 515243 547456 539193 512055
18661 512055 486763 495430 500201 481119 486113 495655 502942 530130 601395 703857 721846 677244
18649 677244 618520 571248 558302 588439 688808 788831 938439 1141057 1266298 1176938
18639 1176938 1002278 873617 772109 715285 749500 850606 970427 1096916 1219981 1319560
18629 1319560 1361347 1330370 1322109 1362868 1350652 1262106 1157502 1019505 874209 785386 763881
18618 763881 758895 801196 866090 868916 824726 776584 762755 760102 749341 771266 789961 801470
18606 801470 803655 821346 868235 911567 937355 1000892 1067923 1098970 1068643 1040210 1030289 990897
18594 990897 946889 931496 951884 1027876 1081527 1110838 1082272 1080535 1114092 1234295 1374979
18583 1374979 1477110 1582854 1679288 1731168 1720400 1660616 1612889 1577541 1594563 1611479 1616064
18572 1616064 1605147 1600475 1584523 1581673 1592974 1571769 1568100 1576105 1568101 1589355 1641755 1745378
18560 1745378 1923275 2234374 2650327 3041240 3242905 3325429 3418143 3522670 3553054 3476996
18550 3476996 3329352 3138354 2982159 2986835 3219245 3641251 3905002 4009287 4185349 4400764
18540 4400764 4526123 4411687 4197933 4086124 4003990 3814855 3676680 3641431 3714868 3806501
18530 3806501 3799928 3682854 3602666 3556516 3437604 3229887 3140604 3170969 3263217 3410133 3639064
18519 3639064 4034493 4646090 5264418 5591314 5569845 5592658 5867377 6157559 5992931 5677289
18509 5677289 5560138 5507950 5262010 4943621 4831621 4967844 5275289 5491332 5661402 5954284
18499 5954284 6308909 6370586 5611073 4621367 3869625 3443243 3246618 3207984 3212509 3162745
18489 3162745 3118274 3112005 3183069 3234947 3336648 3480857 3735047 4153268 4691183 5342444
18479 5342444 6237126 7337409 8162414 8743740 9761719 11500412 12992610 13524741 13546258
18470 13546258 12769687 11866566 11658617 12554359 14784109 18068397 21837105 26780544 30823272
18461 30823272 30373604 28834221 28722878 28526825 27907853 28747998 31080337 31856530 31518505
18452 31518505 33594485 40901804 55872687 79709725 104942127 118883268 117233631
18445 117233631 108005550 97431540 81891149 66257811 56892790 55589363 59092649
18438 59092649 59138603 54743775 51598823 53250229 59341522 63857632 63473373 63145463 65166509
18429 65166509 69152504 76293442 88236441 106749951 125090745 129473986 114644551
18422 114644551 94544898 81382427 77479245 76590104 72500210 69016179 69827548 70667653
18414 70667653 65226437 55192107 46271666 41670994 41907590 47708847 61680867 87823942
18406 87823942 125518698 144659380 121677748 86111428 58293066 42488420 35447827
18399 35447827 34313684 36969810 39264700 37233501 32258210 27385326 22156155 17318906
18391 17318906 13670879 11323497 9902463 9114988 8789765 8831633 9092571 9315517 9636906
18382 9636906 10715685 12606020 13380100 11775223 9333877 7255516 5857823 5017455
18374 5017455 4578380 4316548 3972593 3544704 3193379 3016095 2993576 3029383 3075371 3044152
18364 3044152 2747892 2376559 2055419 1792943 1638777 1554467 1567070 1575749 1527550 1461989
18354 1461989 1363547 1268126 1199946 1160065 1135624 1121091 1120847 1052962 951575 894825 906453
18343 906453 914843 911132 933817 963029 1005438 1039356 984296 860614 747917 689025 639659
18332 639659 608246 563563 524472 533869 560220 547120 546396 512958 512142 518989 529942 524389 539647
18319 539647 532822 497735 464208 431208 414766 399744 415029 440078 459393 451893 438432 411648
18307 411648 403127 394305 396233 401640 379989 377924 377143 380509 367632 369769 378140 383330 378415 349284
18293 349284 321324 293927 304598 296847 303716 303795 296749 290699 267424 246230 259719 248247 238252
18280 238252 269631 339887 365515 342838 286158 251669 229192 212400 207352 197370 203363 200942
18268 200942 202695 218554 228179 190768 158020 169232 184830 204854 208340 227544 227486 197179 199178
18255 199178 207072 182743 159549 143179 124076 121599 133433 138823 152400 171121 194387 213105
18243 213105 210729 189674 182427 162800 182192 186578 182988 175505 172576 182443 175778 158943 165798
18230 165798 146126 126986 121193 128973 129412 151499 155706 138673 145023 173258 179593 181657 193336
18217 193336 185826 160315 176223 172305 143908 157188 157863 149595 129708 108747 113836 119236 138715
18204 138715 134085 118160 126680 131811 131479 118419 148969 146927 125786 136971 143192 143133 155184
18191 155184 110629 89936 104207 130730 122096 121833 109886 90862 104954 98310 93991 49378
18179 49378 60081 99483 117291 109927 119505 129553 130875 133770 112543 108418 92133 76718 71412
18166 71412 115213 138620 141961 123083 121588 131727 162857 189901 224876 226346 216515 224805 240737
18153 240737 250568 246442 249447 252480 223270 207569 229515 243784 241573 269451 303388 284937
18141 284937 243456 278419 296274 270003 278603 294445 339220 360985 355411 367441 386828 415425
18129 415425 469126 504752 524731 581103 668193 772659 884056 988076 1071327 1229445 1461699
18118 1461699 1777526 2169212 2701429 3430770 4468478 6156357 9110234 14500270 24515029
18109 24515029 42256530 62816351 60568321 42583633 25891779 15565432 10111264
18102 10111264 7043150 5147742 3942009 3165893 2620336 2209396 1913659 1649780 1409800
18093 1409800 1169648 967887 822281 720554 647118 583384 489494 419757 381457 324936
18083 324936 313776 291719 263400 241862 239274 221728 186176 170381 173502 142852 132701 135741
18071 135741 126197 130089 128859 164269 177118 183589 193287 211379 176795 134609 115359 110926 118715
18058 118715 114664 100084 95127 98541 92045 99256 95100 83938 86786 105459 108366 104147 99016
18045 99016 76777 65047 84599 91433 69736 69496 64043 52801 61533 89692 76168 75597 79223
18032 79223 55435 23952 47653 89704 108659 75363 46321 39959 34562 48676 61377 51796
18020 51796 48988 61762 47061 14284 23199 15873 -2046 5654 28137 47018 62314 54796 38050
18007 38050 19236 26509 48597 77647 86117 103506 97805 89738 56858 54056 69197 64294 55265
17994 55265 61723 75017 67749 48468 41649 35867 43359 46900 63162 58246 47991 76926 99052
17981 99052 126044 118571 85802 75065 67907 87005 123259 138706 140160 159435 184299 214729
17969 214729 236071 236480 227707 239702 251506 277812 295284 275532 245148 208342 189815 209633
17957 209633 232588 249133 256394 234807 216735 203743 219027 219287 223607 217538 208132 205928 223829
17944 223829 273471 271623 234008 209680 206506 199283 153064 99382 103164 125293 124445 138162 142929
17931 142929 126465 122195 116930 117883 152761 183170 209733 241740 272791 288882 324599 343956
17919 343956 352751 384078 412143 410356 441320 461081 393588 352900 331342 332561 356346 362068
17907 362068 318207 270226 234455 237234 291307 335152 368544 392525 384667 349555 273986 203264
17895 203264 166699 154983 117154 117111 126001 154452 153386 167354 158327 109469 49953 47836 60569
17882 60569 76600 85782 117547 147165 162445 163671 143741 129261 132642 133608 115927 102378 120282
17869 120282 145939 149475 122017 108177 96606 88172 131554 193853 242609 277048 251348 215303
17857 215303 192386 158068 151123 129543 123406 92320 54280 17168 278 -12761 -1375 7750
17845 7750 -387 -11265 -12770 -19055 -22393 -27128 -37349 -48752 -46470 -7536 -11280 -16949 -32640
17832 -32640 -47041 -47419 -33637 -30408 -5636 25760 26942 32307 22463 19805 -14586 -47620 -56747
17819 -56747 -40831 -38948 -3980 2783 12632 -8481 -17527 -9545 7212 -2871 -6190 -21234 -20637
17806 -20637 -10665 3505 7086 13942 -2781 -3062 9940 -6532 8392 615 -15628 -18480 -29053
17793 -29053 -32168 -36277 -22461 -22911 -16171 -25529 -28468 -19084 13532 16616 18844 11363 3435 4345
17779 4345 342 -23315 -28629 -8566 -12859 -37191 -44603 -54188 -24626 -1770 8983 2378 4991
17766 4991 24400 26459 3374 9784 -11981 -47853 -44835 -33451 -29580 -31212 -20779 -4713 -10730
17753 -10730 1392 1251 -15449 -20181 -25488 -38577 -45227 -55194 -57708 -42731 -24691 -19766 -32309
17740 -32309 -57123 -68001 -75074 -69760 -56576 -56952 -58360 -49536 -27415 -22552 -19121 -26202 -18074 -29880
17726 -29880 -16546 -20343 -22381 -25628 -8539 -11118 -37190 -40553 -35518 -34925 -10396 13054 7579
17713 7579 4324 -3045 -26821 -38698 -24062 -7805 -4769 -14793 -43754 -51470 -46082 -47676 -32872
17700 -32872 -34702 -19474 202 7286 40481 84944 137604 195994 279963 392351 472445 547940
17688 547940 668636 793513 780253 681177 618313 525490 383679 261671 165981 115780 101731
17677 101731 95822 75998 66190 74201 54830 26659 5713 2120 -16578 -28732 -19287 -3831
17665 -3831 3297 7299 18143 21168 692 -12713 -8340 -9220 22552 28894 30647 17077 -9618
17652 -9618 7340 5434 -22797 -32053 -10459 26857 21912 8922 18897 -4715 -20976 -38175 -51643
17639 -51643 -44058 -38938 -38897 -38687 -28977 -3943 17046 9334 6502 6732 -20114 -55827 -82543 -88624
17625 -88624 -71686 -31949 13975 32659 12169 -23828 -54174 -54721 -39792 -23848 5091 36759
17613 36759 47194 42058 1433 -20536 -6094 -14425 -5805 15240 14114 -21308 -34967 -27437 -32045
17600 -32045 -8360 -15372 -29074 -2794 20033 34155 10720 -10737 -14414 -18348 -16164 -22049 -12214
17587 -12214 -30744 -30762 -27612 -35134 -72996 -89780 -68979 -40664 -12130 19525 7253 -3045 -18330
17574 -18330 -49984 -43067 -30054 -22645 -9585 8014 19864 8425 -9929 -34993 -40333 -39157
17562 -39157 -26201 -19649 -13402 -10485 -18164 -14665 -29207 -13492 -9381 -13280 -9893 -31444 -32885
17549 -32885 -23255 6228 17199 -1975 -2522 -10147 21756 38531 23365 -15876 -37823 -24525
17537 -24525 -31591 -28278 -35812 -39603 -56874 -62889 -48469 -55800 -42675 -4447 2203 618 -2059
17524 -2059 -13048 -18559 -30329 -8943 11694 -8558 -19771 7692 25144 23898 12300 8380
17512 8380 8186 -5363 -421 -4530 -8985 -12650 -12765 -11636 -10470 -32017 -35068 -43216 -70413 -77102
17498 -77102 -84234 -48669 -22268 -33218 -21897 -29991 -43642 -45367 -50862 -38749 638 2132 -18276
17485 -18276 -27434 -32666 -18279 -48486 -41358 -35320 -49353 -37647 -61653 -63550 -56681 -36244 -554
17472 -554 -12752 -18680 -6505 -16692 -1448 11694 7968 31341 48775 61330 60242 42054 24221
17459 24221 23480 29169 36221 26195 15951 19240 18133 5116 7298 1965 16113 28778 19662
17446 19662 59761 105325 136846 182861 287249 323600 243143 192926 114342 90077 85611 58106
17434 58106 42688 34162 11936 13820 19389 16614 14667 5683 -15716 -31291 -32997 -34307 -34584 -20204
17420 -20204 -21833 -23054 -35236 -19551 -594 -2371 -23351 -13101 22172 39110 43421 46885 74290
17407 74290 59776 33385 22428 9577 -2468 -3366 -20459 -18597 -30625 -31264 -30238 -49928 -21011
17394 -21011 -4732 3267 -9948 -8291 5209 -13972 13972 60531 49723 9363 -16579 -14859
17382 -14859 -15652 -912 10337 6390 -2344 -936 32382 45004 69091 90542 77680 66865 68731
17369 68731 81557 79173 41756 29635 42495 27741 12279 20360 5553 1708 -7821 -12989 5200
17356 5200 8934 -4209 -11348 -10981 -21733 -10469 -13045 -5769 2582 21643 19211 4105 -6501
17343 -6501 26499 44770 43057 34341 35131 34123 13911 -11466 5513 -1506 -15489 -34741 -36231
17330 -36231 -22377 -45032 -35065 -17694 -27960 -18695 -26970 5886 38735 4646 -558 2905 -15124
17317 -15124 -19485 -12838 -19803 -30084 -28172 -746 5592 -8042 1912 -10641 -40884 -50918 -42791
17304 -42791 -29492 -33260 -39179 -47189 -31823 -42065 -36198 -12610 -33141 -29367 -2560 -10886 -27871
17291 -27871 -790 14347 5046 18261 31470 18991 10612 60420 67745 57604 91142 82404
17279 82404 50175 41718 38898 34827 14250 -466 717 19785 15428 26214 36336 29531 20076
17266 20076 31366 41832 66012 72677 71569 55861 25640 38076 52834 81779 72318 58920
17254 58920 14387 40462 68589 58313 60573 56377 47875 28417 61168 75828 66410 58276 83574
17241 83574 77152 71572 82249 86958 92906 76595 63750 49619 51794 64685 53012 39957 47697
17228 47697 79138 73393 52015 51811 45680 49466 52091 69686 78357 69052 52773 33344 39491
17215 39491 23079 28300 60760 78639 72730 64014 58617 58208 31891 47494 67642 63732 62256
17202 62256 49381 22309 21334 72853 88546 109561 142813 162859 159163 161336 151972 139930 135466
17189 135466 128621 136709 115703 102128 120920 132018 122145 132882 153462 136156 134080 133918 152520
17176 152520 147672 154743 169204 193744 193591 221857 291960 316822 334647 350255 366926 386299
17164 386299 376382 386314 408688 439724 459197 481004 517155 574757 605507 637224 676702 715817
17152 715817 768070 810436 871669 981729 1117120 1273067 1402999 1563202 1802553 1964440
17142 1964440 1958038 1905961 1935286 1989002 2029691 2148568 2318285 2617148 3006806 3371647
17132 3371647 3777329 4348820 5008951 5596673 6327674 7431606 8997546 11182427 14645110
17123 14645110 20475150 30434839 47262337 72379377 94111515 105141469 122997947
17116 122997947 152567437 157138487 133828217 114256626 103386877 84132707 59619744
17109 59619744 39706996 26892715 19328667 14731172 11710151 9687179 8267882 7098238
17101 7098238 6148059 5502248 4915994 4276126 3711848 3274536 2834887 2404200 2095283
17092 2095283 1871059 1713519 1611747 1607150 1639065 1593367 1579240 1674346 1683202 1504214 1325269
17081 1325269 1221095 1060139 877119 733081 637171 588917 536463 516135 498786 469552
17071 469552 412607 369988 335557 292401 248813 249217 245549 216114 226275 252485 275248 306081
17059 306081 291730 287268 312681 319094 269647 245763 256384 268565 245520 234683 213964 175201
17047 175201 153784 162331 170597 160972 135071 126951 120148 109745 114057 122515 122570 145554 153134 138079
17033 138079 140249 131144 133000 138181 163408 163541 127509 119780 141666 133172 135921 161057 167910
17020 167910 157133 165232 144233 137361 130972 128179 129107 126048 106160 116144 127313 122450 105000
17007 105000 94383 90791 74418 51239 25531 6313 -2981 12404 28289 47270 58635 73834
16995 73834 48982 39873 49625 61399 78926 97803 97310 83221 86500 86060 95374 117643 124215
16982 124215 109945 34060 8698 20210 36173 35285 16892 -1771 13855 58330 61723 8851
16970 8851 -36695 -69035 -59748 -50745 -56620 -57725 -34462 5829 21544 4423 -9588 -5547 -12466
16957 -12466 -3066 14584 -7738 -18409 -13092 -29163 -1922 9417 4026 13158 19324 3352 -14568
16944 -14568 -15503 -14483 -8264 -20885 -1004 4420 -6690 799 -15477 -19488 -3446 -7878 15498
16931 15498 13210 1952 -2372 -6656 2146 3624 1257 5363 -10139 -31408 -13791 -13993 7512
16918 7512 24975 36134 46735 13131 -11974 -24222 -14735 17101 -200 -26210 -33456 -42562
16906 -42562 -43979 -29761 -47360 -36594 -48 38730 21301 4007 16483 28744 17534 -31169
16894 -31169 -14925 434 24277 -5868 -27502 -25204 -25226 -46249 -30045 -15091 4136 -6227
16882 -6227 -13880 -4981 -3772 -4821 -35865 -57838 -28202 -5064 7926 1284 -14298 -38748 -26475
16869 -26475 -13791 -7677 25057 34079 21870 -3265 -5227 -363 -14270 -10917 -12746 -11233 -2306
16856 -2306 -953 12920 14219 20439 6209 -3380 -12504 5294 -1342 -2424 -22480 -6271 -11668
16843 -11668 -24343 -37335 -53203 -66236 -59653 -57377 -26182 -6534 -22178 -56116 -68532 -49138
16831 -49138 -24886 -832 286 -4228 -30362 -53788 -35550 -1446 11377 1122 -22913 -33201
16819 -33201 -24474 -17929 -22065 -25078 -26384 -8701 7084 -7615 -13007 -14310 -9318 28266 39755
16806 39755 15243 -13468 -24394 -39330 -28457 -12676 -308 6119 14281 -10709 -49373 -31257
16794 -31257 2388 9117 11112 -17625 -6919 4864 -13374 -13249 -15936 -37582 -10145 15158 7838
16781 7838 -16189 -18214 -16514 -30084 -35804 -25471 -17763 -25551 -5806 -6745 -56145 -60781 -63972 -71497
16767 -71497 -70219 -57170 -29212 -5540 -24739 -39641 -38869 -49857 -52635 -51744 -67926 -80782 -56820
16754 -56820 -37767 12345 7446 -2096 -8504 -41158 -21904 -2692 3877 -27973 -37234 -21631 -32582
16741 -32582 -51748 -42194 -38208 -25265 -24075 -40604 -41320 -36339 -47788 -39434 -17135 -25789 -50268
16728 -50268 -65645 -45471 -21922 -29178 -44173 -49111 -80786 -73916 -80211 -80850 -46194 -35912 -28791
16715 -28791 -8863 6113 9614 1398 10245 1600 -21538 -16025 10875 21054 20400 36178 41637
16702 41637 13335 -23385 -44286 -56587 -46320 -58370 -84092 -67859 -39488 -16485 -23370 -28204
16690 -28204 -40281 -38109 -54037 -48750 -34974 -34415 -45012 -45696 -60350 -77866 -68607 -44766 -32838
16677 -32838 -31756 -39101 -53742 -64783 -40031 19651 28472 -6916 -31946 -30947 -57136 -40793 -24728
16664 -24728 -6879 -29874 -48519 -39694 -45131 -53788 -36710 -40884 -17641 -10993 -9069 3023 360
16651 360 -8618 -40965 -47787 -23144 6619 -12915 -25267 -21016 -5810 -419 4963 -2000 -21912
16638 -21912 -15872 -14237 -36172 -10860 -27247 -25494 -568 -14456 -45634 -50164 -63185 -57846 -59036
16625 -59036 -53467 -27090 16329 -1490 -9246 -20760 -7945 925 -6698 16622 -7433 -22630
16613 -22630 -36849 -44057 -28102 -20284 -45269 -36460 -26710 -32429 -30546 -30836 -21566 -23424 -21152 -53012
16599 -53012 -65471 -46777 -39370 -37697 -34739 -9376 -30770 -11931 -7571 -24787 -31711 -15331 -13673
16586 -13673 21710 34572 32991 42529 8453 -13908 7912 32638 24487 15602 26988 21646 38189
16573 38189 12804 -18214 -27827 -37518 -44670 -30704 -28235 -6680 23119 26629 3185 -485 17283
16560 17283 19893 -12166 2920 3667 -3288 -4974 -9370 13334 39807 48389 56597 38614 61398
16547 61398 97826 130418 151529 198902 294904 436428 525450 550341 639467 774022 771271
16536 771271 655146 567307 501638 422928 286695 190354 140352 90333 105943 84785 31105
16525 31105 29952 34132 37190 40589 19194 9960 26258 39426 29260 23202 11594 -10251 -11324
16512 -11324 1199 19682 28870 33011 14867 7842 2753 14450 18492 12574 16385 6004 -4987
16499 -4987 -21060 -24351 -6420 16157 23814 27932 23749 30819 17893 2332 -4207 -32653 -53130
16486 -53130 -49208 -43852 -34101 -28088 -13449 -3026 -8361 11237 15694 11869 -6238 2644 -67
16473 -67 -935 16229 30337 30689 19944 3796 24418 23341 11052 -2106 -16457 -37876 -37743 -25454
16459 -25454 -17962 -21274 -29791 -23273 -12639 -18257 -21551 -17631 -23605 -39553 -49944 -62512 -38252
16446 -38252 -30266 19823 7278 11345 12714 -15917 -34058 -26130 -19019 22909 22232 21556 8721
16433 8721 9568 39414 56243 37769 15312 21576 21745 -2159 -30884 -39567 -58411 -70996 -80596
16420 -80596 -55129 -46554 -19026 -1737 4598 29145 23746 3156 8212 14716 3783 -9108 5952
16407 5952 -9523 -7391 -20687 -15120 -1403 -6249 16781 14726 -18373 -20525 -26081 -742 404
16394 404 16663 19439 -2538 2486 31626 48767 49389 41146 32214 16848 4528 -1805 19611
16381 19611 38721 21996 39457 86836 77353 76569 37568 25608 30090 41067 47488 39651 62422
16368 62422 32184 28359 63296 66493 55547 23866 23200 38960 39273 36619 33137 15477 3965
16355 3965 30729 36751 24741 21158 5979 34448 38677 35046 27839 28322 33667 58488 67706 40206
16341 40206 30039 18052 27996 40398 47083 54766 58651 46111 31182 30641 30925 31769 19340 47000
16327 47000 52462 37951 22843 14384 36771 53507 67087 74113 57903 22529 16574 10675 30015
16314 30015 35635 57363 83171 73460 76663 75197 61101 99078 81899 59567 46764 40242 30002
16301 30002 34469 64912 111229 105972 73874 44840 52180 88233 95279 59292 22926 41667
16289 41667 39751 24110 17036 13878 7134 -911 4559 12108 25345 38263 51534 58361 63617
16276 63617 45081 71516 86347 90500 78908 74317 62554 60668 50973 60209 71251 54561 59718
16263 59718 68199 77264 60853 18537 17410 13621 16148 19354 24680 43804 32915 33021 7886
16250 7886 14911 31574 28736 14753 2275 3630 10945 14343 -3106 1550 34593 54290 49899
16237 49899 57007 67499 48162 20505 17626 37971 63168 59106 74623 66994 58935 62221 51290
16224 51290 49221 77250 72643 79733 78960 88206 71285 97455 107978 77848 52357 37642 8353
16211 8353 15157 12693 27908 38030 31644 25569 36804 44770 40935 54585 64360 51786 35774
16198 35774 31243 39954 34482 18943 24144 19361 26354 54885 77190 80151 49325 38442 32633
16185 32633 46808 67607 67657 51045 37548 32189 33902 19651 8170 13527 24050 23007 29168
16172 29168 39772 41737 28523 31935 34893 32056 34953 42170 38594 30383 41124 38511 34649 26195
16158 26195 35939 40951 34826 42034 48597 34500 41097 31803 64007 68169 48004 34929 29805
16145 29805 24744 19999 3235 15249 19313 23934 23934 12649 16040 31327 67350 85811 77443 46802
16131 46802 51266 54674 66579 84697 76090 60424 30835 24729 9216 1240 19347 6630 -1310
16118 -1310 11328 52202 59295 38860 18018 31416 31664 16588 5986 29099 24523 44258 37263
16105 37263 6707 -6604 26761 37626 42720 33012 23091 43900 31819 -15007 -33368 4243
16093 4243 49314 39971 31642 31585 27640 -4876 -6288 1625 4472 19347 7617 9609 15404 10084
16079 10084 13724 345 6929 20197 9095 -2521 -1778 -10601 -2306 3398 7477 45287 77549
16066 77549 90358 50321 49180 66848 46541 5060 -3983 5357 35020 52378 39745 33126
16054 33126 43321 42823 61436 70668 52959 48419 46458 27769 18830 9063 23657 23435 8701
16041 8701 15776 31545 14265 -3255 10590 64787 78920 59469 48124 30495 15623 3708
16029 3708 -15746 -4552 22589 18949 28015 47757 14218 21588 33653 15868 3454 17564
16017 17564 29890 43868 39459 17221 -1853 9398 17280 26773 31082 45556 38420 42173 21498
16004 21498 -13191 -22249 -1997 27372 6358 19183 39945 57530 55832 32271 35317 36614
15992 36614 41228 54271 40666 34867 32136 13379 9224 29005 25295 15302 12927 30104 19860
15979 19860 6456 23923 18658 18317 21878 15618 7476 30125 46559 32639 28740 52974 41596
15966 41596 25723 26559 38187 26634 30886 36892 41445 39239 33126 28591 -6497 -3675 39042
15953 39042 56999 52352 39275 30535 17788 -193 -11275 -16754 731 9198 -5367 -16421
15941 -16421 13145 27540 39408 38666 55201 53336 41631 45083 64152 57010 25199 8221 25516
15928 25516 16832 -4239 17018 24039 12433 14922 37939 40720 30181 38443 37154 25747 24261
15915 24261 33570 35029 43758 35410 20441 32382 45889 39028 18728 51 13589 14629 15834
15902 15834 26309 18307 15529 19949 7587 10614 19846 35672 28229 8833 22806 37730 17459
15889 17459 22596 32728 20756 14333 -1881 12138 34536 48625 32828 18440 5235 -5266
15877 -5266 -12455 -29875 -27942 -16560 -12984 3098 7001 32606 28524 32280 10355 16061 32392
15864 32392 33379 12049 14877 -5685 -482 -9278 -2543 22817 31468 51642 52095 59702 54701 46099
15850 46099 20662 30190 49439 30251 8071 -2608 4627 40693 16399 -15898 -27735 -28824
15838 -28824 -16928 32313 41290 24322 9436 28848 33283 17185 -2201 7210 -1402 6925 16979
15825 16979 40919 57208 52833 43411 38473 18026 24478 27699 -1627 -10935 15089 47471 25252
15812 25252 28535 41189 35346 23797 14027 23394 59486 60716 53945 46998 55811 37540 13337
15799 13337 15544 19488 27814 27460 32897 47399 67433 69587 61642 57695 65310 32809 1051 -2311
15785 -2311 4256 -10051 -13376 -15402 -11987 3652 10632 28411 21182 15894 20811 28585 1355 1825
15771 1825 52644 52048 48484 44971 55541 68147 57613 75065 79137 52632 49411 36903 45135
15758 45135 44624 32439 5357 -15655 -14327 -277 7337 -6166 728 24402 8347 -16088 -6149
15745 -6149 28561 34948 20307 1636 -10461 -23834 -3166 15216 38919 17757 6989 34601
15733 34601 35719 37239 45865 74224 58027 53054 66516 76452 70177 61021 62035 75782 90844
15720 90844 74033 69314 65850 52030 22222 5557 12588 -14486 -6179 7814 -3131 5302 2973
15707 2973 -18996 -15302 -12018 4820 34701 42704 42144 9007 -13697 4527 52751 53282 47743
15694 47743 35000 32770 43315 61273 81962 99570 85878 68180 36644 31949 48755 67413
15682 67413 68247 53035 34423 15652 7612 3990 30623 64857 87960 82319 92642 84020 77998
15669 77998 64481 57724 37508 38563 42655 47405 55878 40576 41148 44553 66687 51997 30935
15656 30935 40039 33389 16267 3756 -636 21632 43130 43042 46615 71426 100914 96473 61173
15643 61173 44674 17415 6164 577 10308 30582 39406 61277 71206 70067 83811 93482 68418
15630 68418 69887 74102 45866 50665 47911 41863 46355 49979 32184 21070 19950 9852 22103
15617 22103 19015 37262 64984 86320 85408 51720 23308 8271 1014 7548 28646 38269 37051
15604 37051 15340 25849 29273 21501 -15167 -21172 7492 51118 67848 47635 42421 47874 53724
15591 53724 25379 17229 740 -6313 34952 81134 81194 73264 62951 52935 61527 46363 36107
15578 36107 38973 54959 40955 26948 43882 49530 42988 54454 72004 56338 67210 70286
15566 70286 66579 43602 44927 65037 71473 69395 64234 34887 46076 53906 64810 74050 78779
15553 78779 69603 62599 45876 43062 48695 64196 61309 55787 33087 41218 48594 56752 70888
15540 70888 29573 9277 25051 26902 18097 22992 5535 5783 10751 39418 35838 3055 -25496
15527 -25496 -22551 -4060 11163 31208 24164 7146 837 -5693 20120 52450 59480 48930 26618
15514 26618 19393 41640 72432 61212 51805 67788 83923 73264 65155 40940 70698 92179
15502 92179 55901 52251 67072 95480 110298 110904 131524 111271 85175 61315 43757 47649
15490 47649 61770 59282 52861 51490 55614 35739 13557 31706 51651 65431 28694 -7231
15478 -7231 19188 16038 -23696 -12699 -17570 -6755 18880 14578 -266 -15136 -11872 1292 30500
15465 30500 37858 43876 30237 24893 38737 43532 41321 47757 31402 30298 28645 32676 30850 15915
15451 15915 -7530 -5016 24326 41852 36079 49289 55206 56012 33905 14867 5096 -8485 -14205
15438 -14205 -1847 8519 1934 4813 39658 30961 29723 37942 13373 23156 -8952 -9706 -12297
15425 -12297 -18133 -7072 7834 -6619 -22769 -24271 4384 15721 18101 750 5583 9384 -704
15412 -704 6204 17491 18823 4201 13001 18359 34228 16203 -18097 -10227 3028 -12569 -18257
15399 -18257 -27140 14197 49640 66279 41516 32953 5218 -14633 -14354 -15705 7306 47309 58014
15386 58014 34603 37708 50165 49321 24201 15956 31004 46267 25503 11560 25494 15941 23224
15373 23224 48092 54406 26579 25440 17977 26744 26041 9334 20835 46005 75317 84967 89907
15360 89907 53249 24093 28724 56557 59015 56345 33576 33749 58806 55973 53917 32612 29340
15347 29340 8116 35673 53148 45551 35072 39434 33918 4216 15939 19921 29136 46530 30815
15334 30815 21064 44213 66570 75116 50019 50590 40128 26002 22043 44765 11133 30 -9148
15321 -9148 -18536 -43564 -55220 -22374 9020 7022 15760 36900 33894 40162 45764 68834 50726
15308 50726 38448 37080 27622 2779 21678 34428 12633 15593 22707 25414 -960 -6384 1535
15295 1535 -13715 -31937 -50013 -62775 -52562 -35656 -24293 -5962 -2331 11975 32373 30272
15283 30272 24655 10274 10928 8563 -11681 -31498 -25134 -36260 -22010 -9024 -31385 -49525 -18936
15270 -18936 947 7297 -17348 -42944 -21025 -9686 3677 -984 -11497 -32556 -2619 37001
15258 37001 16752 -9836 10579 -12680 -31600 -7851 19085 37148 34604 12175 6362 -4795
15246 -4795 -16725 -20760 -35852 -24749 -38924 -40214 -35620 -11101 -69 23171 22939 17619 32891
15233 32891 29206 21796 18891 38929 33068 6975 10031 39150 54140 38566 10802 -5646 11602
15220 11602 39784 32176 27977 10144 -1275 -4132 -2594 -9840 5637 8338 -4046 -40533 -60694
15207 -60694 -52553 -32829 -23850 -22314 -33272 -45023 -59940 -54341 -17699 1163 11417 6489 440
15194 440 30660 31592 -2820 -1722 717 -23003 -32945 -41978 -32292 -20192 6401 9236 17903 -8922
15180 -8922 -23775 -14125 -14153 -9172 -13552 -13306 10958 33266 25324 15821 9620 465 13453 15327
15166 15327 17281 26493 34794 43412 31401 13013 -9132 -11180 -15577 -23156 -15597 -19684 -57295
15153 -57295 -43155 14052 35799 8950 -3694 -1447 -9455 -24106 -24764 -11948 -5171 7319 7225
15140 7225 -12356 -34762 -27227 -10754 -4244 -6088 -21432 -48460 -37002 -23848 -34952 -29708 -38203
15127 -38203 -47377 -33274 -28264 -5386 -7309 -29633 265 48579 42046 41862 48321 59833 66670
15114 66670 61014 80491 64322 39724 10062 1722 17873 -2441 -22577 -34355 -17520 -13582
15102 -13582 -13585 22531 32122 -5497 -24367 -2721 18958 16274 22875 12677 15552 26855 18063
15089 18063 18213 33818 37993 36052 48537 35917 25717 30147 54432 23722 139 -12599 -14771
15076 -14771 14685 31547 56757 41591 6296 -1077 -3815 -21407 -26895 -18018 -25991 -14740 -25577
15063 -25577 -34889 -8449 335 3997 -1073 5870 56055 64109 50107 14441 17431 42554 51077
15050 51077 49377 70136 84461 101930 50550 14943 16888 28442 25167 -335 -11859 -1046
15038 -1046 -1249 -28096 -42513 -13012 -7291 8379 12488 -1127 -19829 -7489 -4772 -16483 962
15025 962 33294 15299 -26880 -8388 -286 -33716 -35449 -35163 -15932 -9799 -1978 -123 6896 9794
15011 9794 25151 42013 21345 -353 5425 -4682 -19525 -20916 -21894 -9224 8930 -358 -5316
14998 -5316 -25426 -49475 -35799 -15030 -19401 -17401 -4113 -17686 -14442 -22549 -21404 -21711 -22035 -20877
14984 -20877 -20157 -36156 -43268 -45336 -20378 -42492 -63220 -50178 -11642 11077 5577 -15409 -13256
14971 -13256 -13843 -21297 -33491 -29957 1621 -10920 -27301 -20948 -15883 -13976 -13682 -41383 -41585 -31375
14957 -31375 -15894 -6426 -8906 -7490 -6016 -4244 -25914 -32769 -22719 -32980 -27291 -21584 -28583
14944 -28583 -25355 -30979 -6488 2480 -9040 -4743 -684 -30501 -17248 1078 4897 -11921 -3182
14931 -3182 23828 17391 -17419 -20298 -7447 3951 16600 25359 4685 -9509 -21169 -39049
14919 -39049 -42795 -54346 -51894 -35207 -13890 -3972 -4289 4884 21154 10646 2396 -23229 -33217
14906 -33217 -39891 -45419 -68768 -52338 -29033 -30431 -9737 22943 40248 33563 27283 44492 52060
14893 52060 30116 31498 42289 47619 32360 19126 16340 2417 -16558 -21602 -1221 -9083 -15023
14880 -15023 -37945 -33571 -1833 2783 -19617 -51968 -17618 -5623 44009 63928 26336 -6529
14868 -6529 12939 34344 33565 9433 9027 22746 34560 17422 20515 16016 21333 21122 -5122 -18916
14854 -18916 -1383 4678 -9968 -18883 -41773 -30461 -8280 5272 6160 78 1848 3579 -5752
14841 -5752 7150 12602 18676 18087 -4750 -34588 -30274 -22717 5157 6025 33326 43726 31966
14828 31966 32148 7120 -2013 -9332 -8659 -5017 -17223 -25870 -58261 -77592 -43367 -14371 19599
14815 19599 6876 -8912 -13028 -5843 14474 34817 28333 9289 -2533 -7972 -6075 7060 9108
14802 9108 12321 17914 14325 -1642 -19497 -28538 -13107 28097 27127 23364 8073 -5419 -14959
14789 -14959 -12700 -8274 -14641 -28525 -66877 -49041 -44234 -38726 -31947 -21192 -3856 -14236 -784
14776 -784 15072 -21558 -54556 -54419 -47815 -32210 -23643 -20610 -4212 7159 -11302 2180 21472
14763 21472 1359 14597 30911 11694 17590 3937 -17746 -38928 -55550 -46339 -14692 -31793
14751 -31793 -35854 -20313 -1679 -23227 -35511 -6892 8146 16155 8338 -16314 -44036 -35014
14739 -35014 -21694 -42209 -24345 -16454 242 11581 23878 12692 205 -15564 -4626 -5767
14727 -5767 -5433 -4052 23710 11148 8142 510 12563 8992 24046 30321 -13387 -13647 -8111 -2106
14713 -2106 21360 23490 11283 -4176 -22380 -44508 -69692 -84512 -84741 -59715 -44783 -37349 -23585
14700 -23585 -2889 -16571 -36107 -46512 -39988 -7934 -12027 12007 8175 19866 18834 2345
14688 2345 -6646 16604 2137 -9068 -4877 -11959 -499 -7709 -23175 -34389 -46961 -19848 2167
14675 2167 -28212 -44503 -56233 -35791 -4140 15325 -12524 -10271 -10196 -19553 -10744 -28567 -21175
14662 -21175 -51335 -63349 -25559 -22879 -35149 -19316 1215 11900 8247 8446 15184 9439 -496
14649 -496 -19348 -12241 -18496 -9944 -8149 9517 11231 4847 -16148 -25133 -35845 -40724 -41538 -43819
14635 -43819 -9983 -5392 -8755 14359 6675 -5813 -25855 -31946 -37846 -49691 -37912 1208 16104
14622 16104 9820 -14813 -13946 -1197 20476 9609 10120 7042 -17992 -32502 -18043 13626 908
14609 908 -1428 -25908 -44625 -59712 -58280 -37408 -16727 3537 -15810 -16524 -13772 2569 -17791
14596 -17791 -2610 1777 18267 -4165 -16125 -10401 29849 -183 -12011 6451 33685 45175
14584 45175 32347 4098 -12715 -27170 -15123 -22886 -45978 -39163 -26710 -12226 -2038 -30129
14572 -30129 -41095 -25076 -17223 -17997 -27923 -22082 -6720 -7192 -6567 -32648 -43112 -10894 -17259 -46125
14558 -46125 -74033 -89545 -91237 -58245 -16129 -10611 -333 2983 15109 -2859 -41070 -52285
14546 -52285 -51373 -44802 -45305 -39405 -12826 -11102 -26242 -14047 -28585 -17379 7741 13653 -9898
14533 -9898 -37272 -43168 -31495 -31528 -30178 -28969 -31663 -1878 2993 -30428 -41460 -18269 -8356 10082
14519 10082 -3238 -11074 -30671 -59862 -77892 -95157 -77761 -56604 -42984 -42999 -67703 -76589 -74611
14506 -74611 -55251 -53808 -47876 -29773 -35389 -23563 -24599 -43617 -46153 -40180 -40209 -22400 -11127
14493 -11127 -11586 -16337 -45269 -35820 -28432 -14408 -53654 -97694 -66338 -45002 -39454 -34766 -30460
14480 -30460 -36108 -41882 -71266 -76930 -67541 -47979 -60205 -40270 -18044 26408 64272 37595
14468 37595 299 2880 -3572 7331 21771 13936 -15871 -13126 12731 12353 -9230 -24377 -12665
14455 -12665 -27303 -20104 -5535 -3059 -43949 -51196 -51353 -53274 -52205 -53070 -56700 -57942 -58693 -14096
14441 -14096 1198 7775 6795 19501 12812 28242 28489 -25650 -52336 -32101 -14475 -34725 -14292
14428 -14292 -686 -17695 -44378 -62211 -74522 -76166 -78263 -74020 -68601 -39997 -21406 -26172 -45729
14415 -45729 -76834 -85474 -40332 -20595 -15183 -9868 -32860 -17148 -5024 29920 31224 29840 4690
14402 4690 -36637 -67340 -46441 -36936 -64050 -79670 -69923 -64323 -43079 -51120 -29661 -48054 -51467
14389 -51467 -32391 4461 11368 -6428 -5343 -25040 -30422 -18790 -12114 -21487 -42063 -9778 5615
14376 5615 22836 18564 13435 -23987 -27961 -7723 5629 12494 -4611 -13920 2541 7540 -1712
14363 -1712 13257 12942 19740 22449 12862 8142 -16990 -21319 -9452 -13837 -27442 -65667 -69584 -66138
14349 -66138 -50995 -33564 -11340 -30379 -39073 -23919 -22019 -34064 -35002 -21576 -8266 -8486 -9475
14336 -9475 -2075 -18822 -10598 -6895 -34948 -53076 -30016 -14474 -21200 -40808 -52713 -52294 -35809
14323 -35809 -34767 -12752 -13313 -3179 9811 15915 -7517 8441 6741 -20991 -10638 10629 -15922
14310 -15922 -42569 -18307 -11116 14892 35639 33097 -3568 -31961 -11617 -7889 -53388 -53647 -29916
14297 -29916 -19364 -14241 -23163 -10569 8472 7507 -7819 -29233 -16741 792 -10953 -16286 -11277
14284 -11277 2380 1665 16947 17297 10160 1368 -1276 3197 31205 54528 68191 51238 49346
14271 49346 88897 138213 192272 199268 188550 191300 186568 211201 226517 252300 228470 203611
14259 203611 184349 207930 225642 198266 163790 200680 309718 487477 743497 1142180 1481462
14248 1481462 1591397 1607350 1671095 1628057 1305917 927339 601256 404817 280966 218199
14238 218199 188232 158613 115682 70294 44078 -456 -24992 -6547 30222 25632 25209 38099
14226 38099 20795 -8080 -31756 -45089 -41765 -23759 -9784 -1351 -13601 -23972 -15968 -25544
14214 -25544 -45899 -55055 -32951 -17246 -29771 -10179 -2863 -3970 17805 21837 -13956 -10766 -11237
14201 -11237 -13619 -25907 -30475 -41742 -28163 10611 8565 -22523 -34529 -22736 -2493 3767
14189 3767 -6320 -7412 6662 5591 34581 51064 61496 53573 36663 41999 31936 38772 26214
14176 26214 8495 -4518 -7905 -24552 -21099 12200 34598 26516 24946 24985 33795 41341 6320
14163 6320 -22840 -21506 -9745 -3449 21913 19284 37627 49713 26519 -8855 -7061 -12231 -32759
14150 -32759 -13402 -8076 -14275 14838 11221 8773 7027 8054 17290 40883 41656 23885 31776 -454
14136 -454 4440 12193 7405 -16886 -6666 4678 7664 15247 19542 42459 84368 139802 204544
14123 204544 277925 305914 263377 202247 143534 82986 51198 45950 51756 42614 46028 67413
14111 67413 53741 53550 30190 9931 -18601 -12290 -1322 12467 13615 6247 4397 -14067 -3817
14098 -3817 392 17725 19823 15462 5206 15324 -17934 -16479 -5908 -2391 20091 -95 -4090
14085 -4090 39437 60658 52731 31550 7141 -11332 7141 12659 13981 -1769 6608 32476 55864
14072 55864 56996 27169 -19167 -31030 -37230 -43022 -41366 -55045 -76337 -78465 -54990 -42679 -10619
14059 -10619 25721 38151 28866 543 -24210 -21899 -12938 -10240 -5855 -26714 -47135 -46502 -54873
14046 -54873 -37674 -14276 2928 -14518 -9202 9494 1157 -4320 -5780 8934 28273 3030
14034 3030 -7192 -2538 1558 4900 8659 25219 43003 36751 13141 -4129 -9391 5026 -13684
14021 -13684 -28345 -9409 21045 55482 60821 106399 165048 189578 200641 203381 195892 187971
14009 187971 172455 116836 48707 19720 32666 55706 74245 76365 87537 77507 47659 53293
13997 53293 62609 51272 2247 6559 59583 84999 83698 78870 102611 92478 76716 62223
13985 62223 58952 51191 60335 50356 34333 28909 41926 19782 10350 37092 25995 35359 55061
13972 55061 14804 -23782 -34015 -42345 -49187 -82506 -80899 -63292 -33419 -37734 -48408 -56725 -60484
13959 -60484 -31476 -11046 -6662 3183 5856 26711 29632 27759 18707 7814 -10534 -7324 21285
13946 21285 53566 47689 50166 60097 58609 48782 27901 47170 31512 32437 41670 40534 35966 26940
13932 26940 40360 37346 10226 14951 24498 20695 33144 31818 46595 56422 34157 28598 15429
13919 15429 22313 6906 -18894 13183 30312 18455 -14551 6507 22180 62121 93098 88311
13907 88311 92700 93211 96269 89257 73666 64553 67725 55417 65441 39227 17849 1194 15716
13894 15716 38427 56572 79134 94128 101956 83663 94053 152260 150002 137329 149469 167161
13882 167161 189488 174802 127864 108861 110401 117164 118165 102801 108640 96720 66740 51140
13870 51140 46189 53784 59326 38265 26081 -4639 -11528 469 551 20743 34061 42695 61957
13857 61957 54437 87477 130310 122467 144762 164785 171749 165181 176905 159290 199742 234223
13845 234223 265361 318301 389421 446304 526938 683757 917074 1124312 1196785 1082857 891094
13834 891094 717033 602189 535091 443135 381234 369429 379608 352076 301590 287297 319604
13823 319604 334303 324765 301429 306832 339662 382008 410729 403484 421378 489059 558195 621958
13811 621958 708848 805999 876855 855488 820768 814551 793618 763723 747274 760039 809689 867676
13799 867676 921484 1001964 1058666 1116717 1180353 1263601 1355083 1430316 1515398 1614790 1722037
13788 1722037 1858247 1993807 2152004 2341300 2590674 2831545 3120319 3449892 3841708
13779 3841708 4353261 4992297 5745323 6703109 7933307 9168234 10458295 12167275 14476168
13770 14476168 17169666 20211147 24369592 30717436 40738428 57317975 86151410 136160654
13762 136160654 215330185 294097046 308934450 299322608 313037494 314881252 253945225
13755 253945225 175628159 114560100 77309135 55855808 42610912 33755512 27853582
13748 27853582 23812034 20552940 17857866 15525430 13483807 11832211 10481619 9045399
13740 9045399 7663822 6569186 5824925 5191785 4618236 4119834 3758174 3480165 3234974
13731 3234974 2980592 2741808 2549854 2386270 2216830 2053090 1917723 1774127 1673986
13722 1673986 1589031 1514214 1480830 1426016 1375785 1311063 1262515 1201075 1141912 1085932 977181
13711 977181 897831 873203 835989 835391 842774 821032 789346 791544 797386 815583 798427 771177
13699 771177 758292 738444 732399 720496 700070 656060 607593 569629 560039 581164 599053 575167
13687 575167 557499 566522 573013 589590 588093 551538 523574 507071 484487 484862 462643 426855
13675 426855 423521 446441 507204 548709 577717 656663 739130 864991 1040007 1197318 1254877
13664 1254877 1114423 925123 797522 700629 633478 615923 571747 532967 516147 501290 476933
13653 476933 473996 475341 470019 472620 500604 527547 523117 512149 513921 567022 637205 730448 825572
13640 825572 977653 1269793 1799707 2701173 4137399 5445480 5515721 5106861 5163405 5727139
13630 5727139 5524737 4275443 2955632 2026099 1453005 1112459 923011 815573 746414
13621 746414 678490 590696 524242 493380 459332 414632 369189 314524 278054 270784 282177 272031
13609 272031 227566 213739 240443 263125 288853 296923 281984 303594 296817 273026 266436 230827
13597 230827 216066 214298 169680 156729 141292 129624 130365 150836 200219 216274 180219 162347
13585 162347 170108 148773 137788 120102 110222 126021 146744 173131 144523 136475 147613 145630
13573 145630 139120 160405 171786 188934 198754 199709 187092 153580 152208 158675 156001 124614 106888
13560 106888 95168 101288 104181 140581 167305 179203 195388 205977 184943 137676 137676 127359 80725
13547 80725 51168 52980 50909 36957 35633 29866 43564 85267 89193 70433 57135 38820 59950
13534 59950 58317 48377 67115 80195 53278 48492 53912 51276 45922 24223 32041 27867 11723
13521 11723 1845 -1429 -2595 21270 11083 -28185 6207 14145 33776 48198 59071 80295
13509 80295 70671 55047 60330 67519 47727 56483 62379 52376 42227 43029 32213 38308 55156
13496 55156 57548 63289 84087 93626 89806 82867 77224 81099 77293 60020 53156 45328 27857 -4361
13482 -4361 -9532 -2635 5113 21836 39748 33733 32944 25548 -1868 -6165 11294 45406 56400
13469 56400 22203 6139 16596 -2582 -14279 -1813 34370 52362 58677 61803 56999 2724
13457 2724 8314 40810 101254 132075 105213 88592 72066 71248 69527 59453 45273 53820 60887
13444 60887 47588 39357 12637 -9924 3469 41503 49973 39355 34927 65728 61235 53958 43228
13431 43228 17369 17422 32258 52829 46669 61886 80725 48968 26149 14796 35536 52791
13419 52791 42895 21545 27362 32979 9499 -25793 -38502 -30260 -24526 12689 43018 68820 70661
13406 70661 68830 61367 57668 56992 64558 56319 34582 26657 26534 37418 44940 61624 55278 60180
13392 60180 53390 30609 33379 54063 57053 62988 86936 62626 27418 54699 50287 36121 34869
13379 34869 44601 2743 -106 18931 28628 20547 -21407 -7427 25912 36428 34453 5815 -21927
13366 -21927 -12877 11718 27021 7472 12863 38363 45115 31374 29301 35557 40600 17450 14122
13353 14122 27208 32837 20659 9368 18238 18119 24754 60313 45965 33993 5905 -15126 31230
13340 31230 54796 34908 -5517 -3729 5431 22974 31635 11654 14973 20264 7891 -2990 -6524
13327 -6524 11311 -12706 -3339 36988 62920 77117 57300 45784 84829 71641 22166 -20811
13315 -20811 -27902 -2992 -7395 -34204 -41881 -27580 -5446 16767 28762 24333 2824 -4936 6345
13302 6345 -6899 -16171 11784 28067 34542 62891 75427 74694 69973 74971 50834 30427 27794
13289 27794 36010 38009 16212 3141 -463 19932 35295 25599 38131 41034 47707 47719 58469
13276 58469 72177 51840 70915 105528 160932 245807 326544 490108 730032 1091087 1484127
13265 1484127 1616809 1591722 1656565 1666523 1387153 1025973 697535 480303 364661 292626
13255 292626 254870 223037 188158 154528 147778 120556 117008 74099 42521 23664 11734 43226
13243 43226 66806 69781 43086 12207 15826 37266 34805 14491 15618 22210 32819 45467 37194
13230 37194 29370 14030 8520 13776 22203 30030 59847 70637 74723 80996 62565 50697 36643
13217 36643 53337 59231 71607 71544 45109 25335 57056 50910 39803 58981 66595 138256 179694
13204 179694 156932 117243 96848 91742 65170 50614 43567 40304 54938 69739 58840 30968
13192 30968 11030 -2363 -1641 11994 16466 5735 32321 42118 34619 21592 50225 64197 48236
13179 48236 19648 4505 5584 21052 42532 35269 15825 32749 46813 66631 63773 67878
13167 67878 88864 85893 106837 155914 216682 312489 404276 501937 523680 444665 343718 247576
13155 247576 165731 102837 93170 88565 88070 57382 52000 65512 39871 31022 41544 36651 43428
13142 43428 71400 64003 55987 55112 35358 61933 69435 71416 57090 44891 55840 31575 7614
13129 7614 6357 44148 46243 38671 29120 78544 111156 112113 118126 160495 184422 220271 329100
13116 329100 466893 581416 578009 482148 361363 250390 149804 115679 84560 65212 76385
13105 76385 94308 81206 31209 16508 17827 29734 43941 12310 13505 27248 46409 46199
13093 46199 22323 14600 26914 29786 26705 32441 19266 9562 21082 15152 24214 33237 40647
13080 40647 34252 18632 9264 18364 29220 17253 4472 38488 91757 140040 175525 213699
13068 213699 199979 147594 88515 81627 76861 47600 30369 11812 23457 31250 34396 21379
13056 21379 11301 -2985 16853 20848 -3913 -10889 29571 26430 17457 25506 20539 10549 6527
13043 6527 128 -1740 -6723 -21194 7430 45677 24219 -28138 -50431 -38404 -23170 -28844 -37801
13030 -37801 -31011 -9164 857 -22259 -58058 -54410 -12489 21787 18652 5413 -8511 -27114
13018 -27114 -27256 -44395 -51182 -11773 11793 24630 34325 -3916 -35688 -27965 -24054 -38010 -8248
13005 -8248 1991 -12118 -19733 -19831 -22525 -21445 -28572 -17597 -8112 -33244 -38715 -34769 -34488 -58447
12991 -58447 -44409 -41145 -42684 -62335 -42184 -25492 -64288 -74135 -52542 -31451 -20142 -8764
12979 -8764 9579 -10851 -28395 -4278 5639 -20497 -50354 -56962 -46346 -60466 -55217 -58113 -39352
12966 -39352 -35570 -37068 -24581 -4032 4811 18120 26627 32007 36949 42508 9270 -3950 -8503
12953 -8503 17840 27153 36363 18390 1625 -681 -4577 -6344 10602 5455 -2494 -25316 -17733
12940 -17733 -25290 -15130 15174 15328 9880 46342 66757 46826 -4124 -27082 -46407 -11205
12928 -11205 3929 -9846 4499 12209 11236 12932 18727 30110 52271 50368 49290 40259 23467
12915 23467 8135 -23547 -8729 -362 -13503 9836 -4622 -13622 4281 27295 28290 25643 15196
12902 15196 27495 24609 56618 57936 24143 8042 -274 18184 23051 27068 46803 50892 42747
12889 42747 30842 -6052 -37137 -18906 10030 -1756 -30750 -13698 -875 -1484 12647 17718
12877 17718 22164 28407 20096 7095 8665 -5207 1110 -15272 -14052 1554 -14426 9770 53984
12864 53984 27134 -10211 4737 3701 -18898 -20008 20196 32036 10543 9965 14478 13212 14492
12851 14492 10724 18352 12306 12178 28191 16322 -1702 -6970 -18288 -43653 -28339 -34483 -14891
12838 -14891 6633 9262 -15280 -20327 -22144 -36258 -38280 -27761 -15996 -6968 -9533 -2882 2514
12825 2514 1960 53 1734 -23518 -24958 -27509 -44879 -42230 -13845 23380 9046 9180 29290 35461
12811 35461 13659 5495 -3487 -21403 -56109 -39924 -33637 -47990 -39587 -38881 503 -1293 -13753
12798 -13753 -6306 -19686 -30724 -39860 -28891 -638 15543 -2156 -30161 -28257 -3879 26239
12786 26239 53078 47434 29176 11958 -5643 -34687 -50445 -56781 -33711 -13187 18845 32583
12774 32583 32223 16667 3519 -7921 -9757 -16465 -33561 -24241 -21196 -6782 11842 9213 -3733
12761 -3733 -15743 -20428 -894 19201 7742 -38333 -50695 -73129 -60644 -7715 10508 8897
12749 8897 20440 15415 12599 10917 -25568 -23993 9720 40980 51231 40134 48514 36810 34503
12736 34503 42533 70527 76607 52640 23684 -18022 -49479 -34947 4695 15210 28260 26789
12724 26789 393 -9454 -10181 -5891 7223 9018 -7724 21049 41777 4924 -6694 -6733 -4009
12711 -4009 14620 29735 23290 7527 -1512 14791 10472 6408 26452 43531 46557 12074 4074
12698 4074 -12995 -31720 -28784 -23379 8958 16596 -1489 -20307 -12791 9169 30836 27585 9451
12685 9451 -3242 -26162 -14559 1259 -25590 -42530 -24532 -471 9034 8106 -1498 -4288 10083
12672 10083 15325 10302 -3502 -1570 -6662 -3994 -6183 -12775 -2057 -7762 -21958 1484 35820
12659 35820 19783 9930 -15289 -29563 -41963 -37979 -22533 -2927 6404 -10232 -17341 -4885
12647 -4885 18085 30050 391 -9276 -7404 -7272 -15759 -1713 -15755 -20340 -4061 -13599 -19313
12634 -19313 -31773 -34155 -6956 6749 -22993 -36393 3059 1818 -2942 7982 -2684 -15360
12622 -15360 -13960 -11916 -7384 23646 29744 14954 195 2709 4939 19268 23600 10404 -8791
12609 -8791 6408 22945 19430 -497 -8180 7282 24041 29376 15848 9531 -9767 -15075 -8650
12596 -8650 -1215 23716 9610 -17179 -17510 -20862 -31490 -50617 -39370 -18450 -26194 -44418 -41649
12583 -41649 -39459 -36741 -40684 -18287 -36174 -28998 38 11805 17390 17495 16160 -381 -13156
12570 -13156 -35816 -18145 -33612 -31275 -26909 -41743 -21332 -11800 -37780 -58310 -49963 -32148
12558 -32148 -16785 -1941 -13959 -13619 -23094 -19732 -7727 -23596 -21928 -15684 -26915 -55085 -39624
12545 -39624 -15813 3586 -5572 5370 33663 45408 52557 37844 12885 11398 8368 -17870
12533 -17870 -7561 -830 9902 27787 13711 9750 7110 6797 14384 -502 1445 -4371 -10600
12520 -10600 -11874 -1725 45093 66606 48360 25010 89 -8129 -1375 9701 1198 -3507 -1710
12507 -1710 21521 44925 36089 8300 -20175 -34985 -48662 -42932 10173 9677 -20609 -26188 -623
12494 -623 4773 5199 -22729 -29335 -5635 -729 -12242 -38790 -47615 -53088 -36415 -4596 -11405 -8426
12480 -8426 -18823 -17853 -19167 -16764 -33981 -7553 -14317 -1412 32287 23456 -2790 -26510 -14011
12467 -14011 -1875 9424 35039 30228 7840 10317 22430 13998 -3433 -13565 -9299 5022
12455 5022 4449 -10252 -5725 9499 -6024 -14446 10196 17478 2292 -10588 -39896 -39969 -65984
12442 -65984 -50179 -29675 -46618 -43354 -38833 -9790 -1366 -752 7471 12982 14357 -4727 -9743
12429 -9743 -16897 -21087 -14326 5524 10998 31601 46261 37702 45005 35925 10067 22929 -1639
12416 -1639 -13355 8491 -3063 -12244 -14272 -18342 -4352 5531 -19089 -45330 -43759 -38816 -12412
12403 -12412 -35090 -54904 -71947 -44994 -17107 11469 12735 -369 10435 27521 42331 3612
12391 3612 -49854 -67679 -89451 -91705 -66377 -43322 -23786 -4214 5524 3223 -5828 -27463 -16943
12378 -16943 4309 -14015 -48751 -39275 -37578 -15140 -6389 -11645 -9203 -2012 19450 19708 1498
12365 1498 -14111 -2744 -3617 -7256 -11988 -5959 921 11253 10498 22932 29476 40762 36154 29411
12351 29411 18768 7678 -15365 -25927 -32195 -33931 -54377 -40515 -19883 9861 9986 -2120
12339 -2120 7864 -7868 -23536 -21980 -54233 -61520 -30552 -9452 -11169 -3539 2572 -8083 -28051
12326 -28051 -68087 -49152 -12649 -13728 -27353 -25093 -22874 -22229 -19549 -8454 14741 9694 -6548
12313 -6548 -3248 -18049 -26309 -29162 -37771 -45534 -53262 -38554 -5784 8744 5170 21730 9014
12300 9014 11536 15155 10352 6387 -8495 -26158 -13609 -3244 -9628 -17692 -10728 -43408 -42719 -23376
12286 -23376 -13530 -17454 -26314 -27141 -56362 -29254 4713 8765 -4879 -5754 7165 -4640 -13254
12273 -13254 -29887 -48888 -25869 -31780 -10099 -8050 -34697 -20873 -39771 -52857 -53356 -60679 -47332
12260 -47332 -39771 -32958 -44599 -32357 -20942 -22712 6527 1365 -16815 -16716 3298 -13925 -21831
12247 -21831 -35288 -27743 -23971 -14752 -5347 18963 57761 37547 21445 9943 44 -35462 -13933
12234 -13933 6635 11835 14168 1101 -27844 -52836 -63272 -21070 -5769 -27561 -33105 -16633
12222 -16633 -19135 -25654 -16347 -34135 -55597 -42028 -28522 -17529 5502 34757 25471 -2905
12210 -2905 -4464 -3428 -23616 -52666 -43956 -29364 -42626 -50964 -37302 -45926 -43557 -20557 2158
12197 2158 -9034 -54103 -29262 -38169 -40731 -18599 -975 -19557 -27477 -38718 -43820 -11796 10875
12184 10875 21740 12488 -21665 -25642 -15247 -21613 -5977 -28954 -55859 -58621 -17687 -39353
12172 -39353 -71857 -37107 -7115 -21692 -23157 -26031 -25324 -2982 -2651 4695 -2812 -12853 -17348
12159 -17348 -51936 -57688 -49903 -38858 -24212 -8388 -2855 -24347 -6249 22385 12250 -13719
12147 -13719 -21983 -41881 -35675 -4081 10438 -13382 -43628 -49857 -44745 -23363 -2619 -4383 -49238
12134 -49238 -56456 -16475 -11772 -32246 -20348 -2078 9552 -15536 -12140 13772 12514 7445 6508
12121 6508 19644 9941 -7838 5232 12047 -3055 -14326 -7657 -28335 -32372 -26504 -24965 -10331
12108 -10331 -11304 -7833 -36732 -47571 -30930 -12301 -2241 12420 10134 -7599 -35857 -51157
12096 -51157 -34176 -14074 17966 -8744 -10190 -3328 -9778 -35291 -55565 -38936 -30564 -18626
12084 -18626 -18360 9271 31095 45823 27623 -2219 -1742 -10732 13038 19302 11474 6232 -15770
12071 -15770 -19109 -4723 -18866 -18428 -17099 -6669 23925 34325 39798 29657 16618 9660 8925
12058 8925 15825 26122 16620 6521 9473 11959 -6745 -17363 25664 14845 -42705 -49651 -48853
12045 -48853 -48719 -51313 -70313 -67621 -59926 -54468 -30461 -6750 16827 25886 23071 18383 7600
12032 7600 -9198 -28476 -31142 -9808 9126 27366 9461 -17203 -35192 -30414 -20912 -48850
12020 -48850 -28821 -19855 -17270 -35317 -28020 -8936 -4901 5502 25497 9008 19076 -919
12008 -919 -34997 -54342 -50280 -41122 -59587 -58167 -59939 -55146 -42690 -38394 -11313 -5898 -8862 -15855
11994 -15855 208 9089 -21602 -40406 -26447 -18649 -57303 -50830 -4036 8490 2875 22213
11982 22213 -10217 -16802 -4684 -10148 -1288 -16365 -25500 -11335 -2354 -6347 -11740 3270 -261
11969 -261 2493 8384 9768 8115 14717 32165 29187 8159 -9401 5124 35378 29016 10748
11956 10748 -7399 -732 19189 35326 18262 3538 -3761 -9603 -22165 -26267 -33051 -25544 -20258
11943 -20258 -10239 -8743 -32507 -51602 -52286 -47918 -29205 -8968 -59635 -83558 -72401 -44886
11931 -44886 5362 24846 10164 -4362 -11997 -22081 -27071 -15592 -41230 -40333 -11785 -14667 -22161
11918 -22161 -42581 -34212 -29583 -30822 -19120 -21073 -23507 -18391 731 -18722 -29643 14319 27968
11905 27968 5114 -14249 3820 -23666 -21393 -889 -10867 -5199 12817 -6675 -35359 -33408
11893 -33408 -24869 -26829 -8642 7527 11574 -21142 -38128 -29635 -54581 -27007 -5016 -20919
11881 -20919 -20203 -4199 -1652 -8142 -8659 -9830 -15861 -22410 -23340 -15088 -4560 12819 8174 12245
11867 12245 17949 1948 4184 10187 -21379 -36450 -34541 -40230 -42445 -29042 -13986 11555 2283
11854 2283 -23072 -40697 -24290 -374 -6622 -22780 -21177 -15784 -32608 -23008 -20867 -24491 -47861
11841 -47861 -71614 -67838 -49408 -25778 -13988 -2377 15723 21833 6445 16893 31470 29241
11829 29241 19661 5554 6952 6882 -12460 -4702 15827 26003 5352 -8590 7215 -2478 -9511
11816 -9511 -3637 -15744 -28364 -39929 -43905 -35550 -1989 2414 8424 20076 8721 -35946 -29934
11803 -29934 1220 2704 9908 12705 16474 -7761 -26112 -4507 12898 8125 -7763 -17363 -39965
11790 -39965 -74233 -43282 -18411 -3447 -12821 -6550 23532 27174 12400 -16352 -18447 -9995 11007
11777 11007 2698 -4616 -8789 -35083 -47338 -18446 6945 30265 25541 -3318 16006 10993 -2257
11764 -2257 10729 14527 18796 22698 31590 28003 18374 7990 31307 46662 26752 17424 17531 -7398
11750 -7398 -33188 -50518 -59132 -57672 -19154 8938 12868 -16637 3500 2513 9589 -22528 -30205
11737 -30205 -8889 -18876 -42968 -39551 -43305 -41393 -50627 -34554 -23979 -28252 -44250 -40464 -46583
11724 -46583 -44536 -41626 -20628 -3685 -33165 -46706 -40576 -23491 -10770 -19466 -9287 -7390 -4977
11711 -4977 1772 -20205 -36736 -71662 -64904 -56988 -58259 -37270 -17149 -24128 -40786 -49457 -33699
11698 -33699 -6405 -3338 11727 -20222 -62817 -54626 -51072 -63614 -78887 -74196 -66427 -57783 -46437
11685 -46437 -42958 -37859 -43457 -26116 -17476 -19315 -2848 -9201 -14287 -42192 -34500 -32532 -14667
11672 -14667 2797 10448 14195 -13223 -24397 -6226 -8022 -17584 -30167 -30917 -45192 -25422 -2996
11659 -2996 -8514 -444 -1791 -40664 -23458 -13971 -8008 -10305 -28143 -32444 -14752 -408 -4230
11646 -4230 -7511 17860 7699 11683 29329 -1457 -12285 -1484 9430 11875 -17337 -36263
11634 -36263 -40514 -52698 -45462 -22124 -26435 -31285 265 19330 11919 882 20555 1553 -3912
11621 -3912 -19908 -29733 -28364 -24198 -37546 -32007 -8441 11610 6562 15484 7034 -21601 -6362
11608 -6362 -5556 -26858 -49378 -27572 -38494 -26133 5046 -2259 18833 13986 -3056 -6552 -1472
11595 -1472 9746 -2739 -32654 -38339 -34446 -19601 -38465 -44777 -36897 -19540 -9390 -1134 20116
11582 20116 30687 25447 31887 47584 25439 8327 3721 9774 4308 -2443 -14782 -24511 -39641
11569 -39641 -19730 -24178 -6902 11223 5673 -31194 -33097 -9736 -3939 -14723 -2081 9521
11557 9521 6256 -19406 -29143 -4563 14011 11596 -14894 -43233 -37361 -30506 -30331 -18411 -5523
11544 -5523 -19451 -24270 -36883 -20282 -12681 12832 22075 -10242 -16030 11486 -8191 -24478 -10132
11531 -10132 -2613 16583 6232 -3163 14095 6468 -4233 -4699 -760 -2180 -10915 -23915 -5408
11518 -5408 3618 16689 20862 -11655 -11512 -10357 -14302 5579 -2112 -8220 -15844 -51360 -64421 -51578
11504 -51578 -69011 -89950 -79589 -66073 -54356 -29179 -1696 14073 7277 -2633 -8898 -8468 9404
11491 9404 4845 5383 -14165 -92 7678 -4113 -4766 -20145 6580 35290 27010 9358 3624
11478 3624 -910 -9824 -3675 5466 -6130 -21487 -40264 -44476 -6500 3754 -13921 -25229 -49007
11465 -49007 -49859 -51499 -47452 -34240 -29270 -18462 -8642 -18787 -3328 -18738 -20477 -38681 -40413
11452 -40413 -28709 -26240 -27801 -29298 -35304 2044 17032 25343 7944 -14034 -24960 -46668 -38981
11439 -38981 -12457 -5369 -19753 -24560 -40901 -44325 -25462 -16732 -25274 -24753 -45866 -55326 -45910
11426 -45910 -25644 -15262 9970 5987 -8119 -6771 2446 1407 -6060 7610 15368 43770 61824
11413 61824 65378 22069 5622 6222 10411 27831 17523 17041 28869 25790 -3748 -584 1819
11400 1819 -4416 9097 29467 38143 11198 -3245 -28843 -61689 -55866 -18026 11861 13053 -2822
11387 -2822 9136 -1662 -16433 -27144 -22057 -34471 -40789 -36449 -34572 -7436 2008 16993 55231
11374 55231 54653 39075 13916 -15927 -13069 -11684 -19835 -27513 -19382 -13469 -27223 -29534 -15018
11361 -15018 -5681 18707 20244 17117 -11232 -32771 -25878 -29464 -525 1022 -15267 -8229 -4614
11348 -4614 -16450 -19932 -25926 -42130 -46475 -24747 -14206 -8687 -34116 -19848 -16890 -25247 -27688
11335 -27688 -24323 -31180 -2421 16036 6867 19956 24076 8259 23150 40150 17351 24083 27689
11322 27689 21434 20433 16778 -1265 -31029 -30004 -16524 -7622 -2571 -11341 -4777 -9779 -5437 -14239
11308 -14239 -13493 -48540 -67083 -63768 -17962 -14440 -6715 19432 17056 -3472 -1201 1904 392
11295 392 -19432 -51371 -61655 -68660 -49651 -7289 -916 -10238 -20404 -18011 -36237 -38188 -53451
11282 -53451 -51477 -44772 -42339 -60147 -54492 -66027 -58572 -38909 -33412 -45859 -28922 -3799 1343
11269 1343 -31263 -38264 -42507 -34367 -12413 -24393 -34370 -15689 -7936 -9388 8018 396 -16543
11256 -16543 -25708 -23218 4864 -7025 -31241 -18705 -28956 -14692 -5437 -24658 -49751 -52533
11244 -52533 -39770 -33546 -31871 -33571 -49358 -67969 -66977 -57799 -28679 -21139 -20936 9508 -7076
11231 -7076 -64918 -67308 -44220 -9884 -14450 -14760 15737 18880 5497 -1389 -2650 -21541 -23759
11218 -23759 -37719 -42172 -47592 -31459 -961 9201 -11318 -38398 -28720 -11138 578 -6442
11206 -6442 -17772 -35138 -37193 -26008 -7159 2318 -514 -25498 -30462 3244 26215 3487 -15316
11193 -15316 -12166 642 15898 14818 8555 2667 986 -13639 -25602 -47086 -51832 -55023 -2785
11180 -2785 28727 20551 -2012 -18368 13607 23671 10794 -10862 -38298 -11055 23792 26699
11168 26699 17824 19598 14054 -1390 14752 11038 -433 -9881 -18355 -21947 -11600 4417 13771
11155 13771 36280 40168 20284 20973 5960 -22378 -52711 -56625 -36047 -16949 -12630 27471 18104
11142 18104 1524 -16664 -20390 -28470 -43591 -37999 -17867 -25571 -39479 -19484 9491 16532 15012
11129 15012 -11319 -36501 -26835 -32258 -35673 -9387 15806 25204 15784 18828 10447 13828 14904
11116 14904 3153 -5091 -1715 11981 -6397 -924 11801 20846 36276 18965 5573 6682 -12234
11103 -12234 -37079 -57312 -48653 -23754 -13952 -8397 9852 14722 7375 -2320 -12004 6859 22711
11090 22711 8914 -16371 -38305 -42270 -45024 -61833 -80233 -86870 -84452 -65841 -43783 -41040 -31759
11077 -31759 -12938 -31412 -48544 -32459 -23111 -19147 -20555 -16252 -24368 -37985 -14632 -1299 20709
11064 20709 45627 63772 50884 29936 26544 26707 19424 10259 17506 10003 562 12148 -5075
11051 -5075 -23477 -46925 -60003 -62540 -24579 -1946 -20078 -29632 -29926 -3090 -2705 -884 7377
11038 7377 14 -2237 25165 25062 4374 -11922 -15261 5390 -4400 -21467 -8334 -3704 -17820
11025 -17820 -1266 -6970 -12410 -11238 -27335 -27700 -4049 -18512 -21339 -1538 2544 4018 17577
11012 17577 21875 1842 -4313 -5914 8053 18022 -24277 -21793 4739 -9646 -13245 6488 12201
10999 12201 5354 -12766 -21002 -15611 -3535 -2751 13623 50463 51706 31932 11558 -16431 -33317
10986 -33317 -27717 -6071 -35074 -51418 -48375 -33418 -9663 -41041 -66726 -82437 -79383 -56150
10974 -56150 -42907 -30119 -21903 -36371 -46634 -57035 -34792 -150 -23601 -39788 -30450 -34154
10962 -34154 -42219 -64992 -75909 -57109 -54279 -48617 -31229 -12169 -19823 -25138 -11805 -6042 -4706
10949 -4706 4495 -2100 -36615 -42430 -8656 -11624 -10911 3845 16929 10230 -7726 -27295 -37720
10936 -37720 -21779 8629 2449 -5100 4802 -3581 -26438 -32051 -5611 23082 36762 26323 21291
10923 21291 13329 -22181 -61158 -54057 -58523 -67986 -90721 -51709 -36851 -63549 -64141 -52802 -34471
10910 -34471 5825 17404 -7214 -41958 -40589 -19329 2749 15235 -4050 -34489 -19072 3166
10898 3166 13339 -6979 -14332 8583 10614 10841 839 18201 25611 -2353 -11538 -9076 -5227
10885 -5227 -19507 -45027 -42473 -1021 20033 3294 -10843 -25145 -21099 -14533 -20004 -25944 -22689
10872 -22689 2320 -15760 -23543 -24101 -24493 -32617 -36082 -4814 11927 -10749 -45796 -56202 -14144
10859 -14144 6289 -21477 -14991 12230 9316 -3272 -6342 3438 -9083 -16305 -18487 -35119 -15593
10846 -15593 -21 -6884 -14534 -709 9059 7853 -13233 -6661 -17529 1186 18148 5614 -4447
10833 -4447 -2936 -11283 -31754 -42809 -54838 -70137 -69830 -30837 -30901 -10792 12601 21273 5001
10820 5001 -21159 -22965 -38559 -37105 -22214 -13088 -17407 2515 -4867 -10880 -22978 -17057 -19547
10807 -19547 -20204 -13485 3994 -5952 -13921 12320 36801 19204 -29772 -38694 -16490 6235 -2262
10794 -2262 -12312 -5053 -39398 -29254 -40884 -54413 -46402 -40050 -29599 -1777 -7241 -21791 -6072
10781 -6072 -6151 -25461 -24648 -10486 -1452 7465 39775 53915 36742 13244 9609 33231 22322
10768 22322 9356 -16252 -4982 15768 10851 2625 6938 3238 1609 575 26743 12530 -4348
10755 -4348 2972 16995 475 -25599 -14649 3478 -13520 -33046 -25216 -13233 -8589 36345
10743 36345 50760 40555 12301 -11431 -13518 10904 37674 48090 26199 10630 -2635 -23905
10731 -23905 -41108 -34313 -6667 9809 -4252 -40148 -48703 -23898 -4346 -10286 -19355 -48456
10719 -48456 -30723 -16348 2668 -24879 -38912 -24976 -17803 -19469 -12634 -32818 -46185 -42058
10707 -42058 -25214 -15347 -17419 -20888 -50295 -43936 -20490 -26950 -29810 4849 274 -14432 -4397
10694 -4397 -4671 2339 18718 32005 32211 22584 15090 30810 30913 8284 -6907 -17605 -5711 -2360
10680 -2360 -43174 -55150 -43000 -46633 -63438 -38487 -24156 -44578 -19380 -15651 -26709 -26724 -3271
10667 -3271 5254 -11196 -2228 14484 5631 -9352 -40909 -31425 -40205 -38725 -40113 -3367 -2953 -40724
10653 -40724 -29004 -13723 -19471 -27594 -9539 -4136 32194 34797 -236 -18130 -24353 -31900 -27749
10640 -27749 -12537 -20730 -15337 -10706 -14500 -12116 -18763 -18235 -7949 2544 7375 303 -14859 -34086
10626 -34086 -35583 -21431 1025 -12299 -7588 -5374 -19506 -12720 -15455 -9578 4735 4373 -25064
10613 -25064 -18433 -5270 -20320 -38705 -38191 -32043 -39723 -38904 -20463 -22007 -27529 -47150 -42978 -25993
10599 -25993 -9293 15897 49617 39605 31070 30378 -5986 -37064 -39338 -25027 5918 33522
10587 33522 14334 -2468 -44841 -60570 -26804 -941 2431 6613 16224 -4686 -14859 -30662
10575 -30662 -29392 -33452 -41152 -28224 -12864 -9646 -42149 -47677 -33929 -3644 26341 37938 14606
10562 14606 8745 7170 42755 33050 -3421 -7298 -3671 4420 5257 -23585 -20694 -18034 -17704 -9603
10548 -9603 2400 5804 3351 21908 33498 27378 30509 34046 40957 18087 -16872 -8164 10692
10535 10692 21181 42823 94457 125202 118773 76700 34792 18888 19035 21175 19728 21888 5980
10522 5980 16704 13037 6212 242 18833 13386 4505 14652 17694 -5560 -22286 -25824 -19669
10509 -19669 -18780 -10123 -8922 7366 -10846 -32206 -48006 -60715 -47359 -19460 -30181 -54430
10497 -54430 -53944 -41206 -33826 -27867 -47603 -45896 -30777 -8079 7383 9106 8039 179 14063
10484 14063 24980 24046 -848 -15562 -30191 -40588 -47387 -16179 5113 10434 15040 9597 -18123
10471 -18123 -34352 -41773 -3922 28094 6604 6147 26237 4546 6287 -9256 -25343 -35655
10459 -35655 -28039 -40529 -33347 -40435 -4726 3620 9472 43201 38621 13330 -10471 -23580 -24853
10446 -24853 -27795 -30710 -50747 -32447 -8748 30902 7024 -8276 20805 22373 -5184 -26583
10434 -26583 -24225 -8973 -9728 15572 1138 -26155 -16541 -19950 -26200 -19621 -39797 -30393 -5402
10421 -5402 -16605 -57676 -75245 -49688 -16609 -23366 -28500 -33045 -10150 7255 15444 14998 -1522
10408 -1522 -323 30747 31788 46277 69644 101166 94023 61785 49339 67334 63617 15120 -4544
10395 -4544 9838 23474 24128 7420 34219 38577 13367 10404 18133 32621 30621 39937 29971
10382 29971 20641 30950 37721 14085 -5151 -9684 -3071 3722 7156 -18697 -43219 -50668 -36884
10369 -36884 -22525 -4623 423 -16822 -11310 -1692 12444 22676 11777 7083 -1104 -21195 -6279
10356 -6279 19899 39910 27285 28452 40011 13376 8230 58238 69184 50797 39681 51204
10344 51204 75094 73966 46952 29511 45036 30463 33968 23275 -9112 3109 30179 13248
10332 13248 -6923 -18180 2970 -14832 -24172 -17556 -6077 -9628 -2838 -8913 -14138 -15083 2805
10319 2805 -5896 -24217 -10128 8073 10662 13799 28439 -17065 -16668 -20815 -17260 11507 34482
10306 34482 45727 34595 6713 -52440 -53696 -33932 -34766 -28037 -4813 17178 42822 36867 41112
10293 41112 49602 45233 37009 -12789 -40149 -44920 -61380 -55433 -51554 -23136 -13996 -24409 -18122
10280 -18122 -14371 -2356 -4741 5224 37007 14411 9922 24850 29734 43811 67083 59803 30017
10267 30017 20479 4676 22067 20009 -555 -7443 4010 13150 40905 19496 -36917 -56602
10255 -56602 -36803 -17426 2335 14479 -19038 -30718 15814 57675 42302 28147 36494 21773
10243 21773 -1846 3859 14202 24263 34188 7139 16747 16012 20659 48181 59721 28938 22485
10230 22485 34436 3616 10498 4461 -23309 -23024 -39391 -50582 -50206 -34342 -21391 9824 12089
10217 12089 -19307 -18489 -7386 -8739 -15297 -19227 -3529 33685 63187 62802 53658 27572 17128
10204 17128 12568 -359 11111 40817 17819 -10998 -15921 10414 -2204 9419 10146 14764 27740
10191 27740 31582 27975 17662 26900 32964 32022 41275 25305 18395 6473 25575 70758 65542
10178 65542 49483 23556 8597 -1780 -4426 -30039 -42109 -29799 -5491 17884 45112 31345
10166 31345 31982 -4249 -16993 -37917 -49699 -46909 -24859 -14255 -5355 2773 2383 10335 9378 1038
10152 1038 -2270 -13680 -15314 14517 47506 29919 25789 42433 48803 32974 28571 9751 -27645
10139 -27645 -7163 13571 19891 11698 15739 18249 6165 3505 793 -5812 -3644 13762 21079
10126 21079 10210 -1218 -35426 -26265 1895 4315 15264 22237 13028 -1953 -16120 -20549 -432
10113 -432 -3767 -14756 -9625 -20449 -31142 -7479 7704 8352 23651 29551 12892 -12574 -13487
10100 -13487 -34895 -31249 20681 66205 58135 58242 39756 21606 45417 39734 26441 18989 -860
10087 -860 311 8843 27546 45510 42245 20296 14618 39079 36105 12621 -18999 -12405 24436
10074 24436 39081 41405 35931 53962 69982 69396 72062 75210 43713 53462 82136 110776 119182
10061 119182 111588 107416 110657 118729 124086 160929 224697 321453 458438 690691 1125180 1956918
10049 1956918 3354900 4321494 3550208 2352956 1416507 886380 610068 447338 350113
10040 350113 275831 205460 177534 178403 165424 148208 143804 132100 92763 59161 44757 34287
10028 34287 38264 67234 57806 43250 17159 3426 23566 33574 29661 34370 46412 47047 77884
10015 77884 117158 139077 158251 134308 107932 97622 79173 69905 96471 86883 58647 31818
10003 31818 41389 33650 28214 29417 19180 26215 32624 45961 38734 25370 25815 21324 10398 655
9989 655 -5412 9908 23238 33091 33903 25838 22851 34051 55194 90731 72833 49187 43322 36287
9975 36287 41694 40002 58846 74020 69983 100438 99203 78112 53814 58231 74113 64490 41592
9962 41592 17509 18766 20875 3360 -5395 3428 20213 47670 39370 24959 18398 33276 32951
9949 32951 44595 60736 47736 41542 32956 27507 41567 68927 71934 71471 58075 59505 70435
9936 70435 63558 68607 58635 64746 72695 67671 59391 80618 76608 65627 89548 112576 102240
9923 102240 80338 58019 45725 49089 51753 61781 47475 47749 56901 48165 43684 63879 75405
9910 75405 84579 83052 56366 26444 10632 37039 50305 38148 28500 14633 14961 33398 36771
9897 36771 59137 78626 66547 72376 93014 83786 49960 24305 -397 15935 24698 9238
9885 9238 249 12642 10894 11441 22209 41505 24682 29181 69343 90398 102437 119962 130284
9872 130284 126899 118304 107036 66439 60168 62486 77700 93685 72519 70517 102448 116682 156462
9859 156462 200851 250067 304519 378644 522582 769472 1209168 1866737 2465611 2588038
9849 2588038 2140635 1475053 974895 674733 476527 384518 326533 232940 185427 174803
9839 174803 142551 120637 133171 171211 173439 135622 124126 126212 117931 107991 108492 129692 136454
9826 136454 112959 108221 96227 51353 34938 38672 71586 68619 102230 110270 91583 92480 96366
9813 96366 106980 112626 101674 95532 70689 57616 84639 88904 79516 94711 102318 82094 74033
9800 74033 110763 111795 104803 91594 91126 91105 106390 119243 125016 122760 88645 82563 112002 120550
9786 120550 121672 128440 133518 148424 144222 120637 132882 143279 164107 155902 164509 165547 136271
9773 136271 106770 102999 102883 82067 104981 110874 137356 146373 126751 90045 77823 86026 112244
9760 112244 113372 122672 121466 127782 106631 77754 90859 113916 101954 113916 112963 101993 97277
9747 97277 104398 117568 113594 103035 102190 138585 128459 125789 128225 127229 109617 101733 129536 169954
9733 169954 203885 183050 169158 136932 120033 135814 101579 80203 86032 98531 110255 117455
9721 117455 125270 118401 136455 140055 153029 129656 114462 129563 129925 132529 108467 103355 108240
9708 108240 101917 151099 149232 134960 138886 128819 109017 126354 161768 135729 128369 127586 128655
9695 128655 134298 135433 131102 156950 179909 200398 199626 199298 201542 179308 168426 183188 189835
9682 189835 196391 204459 205897 207792 194302 163457 158301 153971 123330 110371 150061 158845 158161
9669 158161 163056 178738 157037 138022 162340 169270 147916 165341 171826 194893 181886 162405
9657 162405 177120 162876 184460 203124 193654 200989 216973 198164 190462 209801 207556 238033
9645 238033 266408 280197 258260 218100 216349 204024 182111 163414 184628 200455 194881 190549
9633 190549 212942 201441 198472 229157 238158 241474 254586 258598 261207 243783 204352 194261 213696
9620 213696 226284 242537 264765 277784 297802 280300 272231 275304 276967 311316 297739 272512
9608 272512 264442 275545 264494 243781 271261 277519 276365 305377 326749 300265 280644 270142
9596 270142 291092 268789 255606 275802 283418 294086 288852 286589 317384 320152 313487 331019 342900
9583 342900 328273 283114 321598 362993 368585 378149 344926 334416 370400 353030 347994 364763
9571 364763 361759 374591 395412 395401 390896 406826 428343 460381 467549 444666 420309 399844 399718
9558 399718 416066 449952 457132 441261 444714 453511 462917 428116 427172 443087 473902 469314 460749
9545 460749 461573 433292 443050 467700 454668 466642 481169 468330 447361 449838 462161 491810
9533 491810 493274 514568 525623 510104 514923 526179 539301 555895 560054 545401 532921 530795
9521 530795 545932 560654 607321 596955 569655 541946 556730 585583 610143 619028 642794 639967
9509 639967 624220 596263 612570 629489 638916 645112 656830 703088 711002 714893 714371 690435 677530
9496 677530 677139 687333 683727 690443 717122 712623 685297 706534 734868 744863 746200 735403 726064
9483 726064 705626 717871 761149 775983 821475 813791 786095 790675 815495 825112 796898 773172
9471 773172 788381 816425 808219 817681 827014 834267 844440 818480 813890 817827 832226 864713 864837
9458 864837 836381 832649 855722 842347 834857 837818 844401 849222 838193 835910 873136 899043 912841
9445 912841 888789 890021 898086 883580 870098 895328 918790 909315 895932 876560 879156 874620 869649
9432 869649 879016 878350 899212 893227 881158 869581 869667 888834 895251 874097 851349 852230 860620 851064
9418 851064 857629 853608 843373 851469 845343 825858 837065 858614 846895 810360 833997 845096
9406 845096 834011 841951 829181 816916 800947 819148 858975 875948 841321 822223 792506 777236
9394 777236 759217 753294 795295 808643 781022 762968 756973 745461 738521 734207 726165 714484 714648
9381 714648 743743 775234 765434 752708 752812 733114 729379 725238 717483 684159 661768 661982 668379
9368 668379 670838 671882 678995 673682 652297 637576 630828 638359 655198 625927 593785 601589 592986
9355 592986 591434 599640 608714 593680 591382 578104 575636 565184 554054 533940 550251 565563 529637
9342 529637 536109 564747 554965 546822 550474 544669 537484 535689 527967 531183 533603 520979 526886 538352
9328 538352 530220 518928 490896 471116 482097 494400 480034 473230 468349 475881 477108 501083 482390
9315 482390 449371 450214 438699 426081 422864 426916 419908 380012 373551 401166 409034 415221 396507
9302 396507 380238 377430 380900 382873 377694 369856 382635 374731 371206 361307 359803 372050 395899
9289 395899 418387 410371 397676 392156 385831 374685 387916 365887 351962 373988 373980 360743 389880
9276 389880 405115 389489 380821 355339 344471 317407 283579 300689 293628 311103 288242 275656
9264 275656 267552 246786 267454 260909 267439 295861 319454 304068 301246 285901 296302 313742
9252 313742 308995 283780 283822 265204 255014 259580 261733 287435 303194 276620 232975 231458 244408
9239 244408 268661 267815 268233 246015 206535 206415 215269 210163 210670 234330 230338 221304 211621 204281
9225 204281 198901 209747 229141 239121 216444 218298 234607 242471 228283 220589 221246 249861 250761
9212 250761 239417 255436 238676 199377 184203 182200 208117 209449 217494 212276 205449 229411 231553
9199 231553 213688 200043 174274 172185 178140 185287 199229 189827 197442 198730 195835 194222 200513
9186 200513 194847 174301 162204 150950 147067 140176 133244 138185 158177 177371 197251 211460 211446
9173 211446 203465 211640 218247 211421 195601 196530 176523 163126 161142 170217 180338 182268 173745 172577
9159 172577 161015 119143 107767 134083 169842 170080 191916 184956 183317 201889 203131 184878 156762
9146 156762 159305 159439 147076 134863 157323 130667 124966 139412 165455 159597 151652 123206 105700
9133 105700 113663 125737 122037 125762 121169 92389 100693 113383 107982 122340 117458 128725 142137
9120 142137 122062 88034 109810 124582 152281 169945 160151 143882 150395 151159 144426 138027 125306
9107 125306 95287 93846 100549 111143 122417 115520 99370 103877 124708 114598 121876 120104 99928
9094 99928 98045 99356 130034 125882 122051 131432 127894 82336 74069 99732 119066 102657 82481
9081 82481 99451 94045 85468 65883 71962 114156 129269 111828 98737 85164 72604 62160
9069 62160 69558 65048 61970 77275 60077 46251 56669 71862 77303 96136 114382 129852 124904
9056 124904 110914 107061 104083 96687 78921 72565 57071 68652 77421 53070 68265 74901 78636
9043 78636 97219 74524 37434 46485 80986 76429 67272 79283 88949 64712 42480 30380 44171
9030 44171 64045 60919 62315 78800 78998 54910 68039 92572 94531 97948 88948 74036 67673
9017 67673 62097 48553 54866 46569 20539 22465 25343 40694 54658 56327 76072 98193 87219
9004 87219 91261 85795 112603 123417 94095 79370 87661 77480 49936 41693 63192 84747 72236
8991 72236 65574 48583 43206 53609 69588 102492 78027 62781 68626 56313 55175 69240 62097
8978 62097 45372 73876 82545 82112 70675 65987 75818 68834 68249 59105 58451 45914 56791 39553
8964 39553 37938 39875 48495 53163 29294 14784 5124 10937 19080 21089 26619 21026 36732 40194
8950 40194 45303 50441 34890 34521 37046 35793 44069 53871 79440 90328 86442 75191 63622 74945
8936 74945 46566 42328 54341 37279 60198 74020 41912 17167 25089 41516 58676 69819
8924 69819 70607 75451 72400 49159 41524 28182 6709 25147 23469 54276 69255 54378 45113
8911 45113 15672 2536 12639 23961 55828 71715 73678 54782 70847 74320 57282 51999
8899 51999 58091 40922 69576 71924 61431 58192 45063 22015 17809 20500 23048 21024 27119
8886 27119 15519 23360 72559 97384 129496 173782 181428 140425 93402 70607 61192 53952 53186
8873 53186 51972 40701 44705 52106 31570 19266 21067 16856 5486 15251 33301 47495 41199
8860 41199 40777 46202 42956 47228 33931 35401 44883 36686 37476 73681 83970 72238 60788 47935
8846 47935 49725 23653 36347 50431 65415 35757 45574 75155 85580 65086 66819 48406
8834 48406 28120 6697 3256 15050 32094 32258 34463 38097 19447 40568 44878 49342 49563 46542
8820 46542 70219 70000 36899 4023 20958 36748 25659 34836 32003 61982 97149 70542 34871
8807 34871 54042 67395 92872 118085 95953 58803 51479 41018 11654 23339 43179 48744
8795 48744 31167 20126 16026 17154 37227 54042 56451 57606 36997 26567 32636 37016 36284
8782 36284 40392 44560 73185 102102 112948 100510 96096 100871 119575 106734 112896 115836 88646
8769 88646 69510 41144 30364 50903 59642 70659 61717 48094 17958 31068 37021 45388 67063
8756 67063 39888 48159 74023 86330 73015 34580 33319 47796 57352 106048 115504 107034 72454
8743 72454 60891 69271 59635 63936 107072 134697 157160 151388 127908 105136 101056 116539 100400
8730 100400 91323 112201 115112 132221 101944 93801 71664 45590 53797 63447 77418 124408 137399
8717 137399 124855 118317 124457 130084 131997 128152 124277 113260 88979 70999 63126 62765 64934 63738
8703 63738 67332 84024 88319 114596 137335 126900 126376 131158 96114 68954 88558 112598 146634
8690 146634 152696 153858 157625 148841 140474 108506 100481 125944 153144 160226 170421 157078 161882
8677 161882 148362 151124 151903 151168 148232 121908 93873 121554 144420 169477 155773 141533 153691
8664 153691 155836 156709 197562 231582 253641 252618 250918 279326 318852 308170 321791 389442 491652
8651 491652 678394 846358 840677 681385 530533 442385 394536 361577 332949 312303 296165
8640 296165 283331 262264 263210 302462 295528 283172 329663 355197 359017 337323 307284 299982 324792
8627 324792 349286 366173 391186 384628 390240 425450 458527 469258 471062 488758 511321 518198
8615 518198 531391 553770 583045 595582 612879 655931 715963 836175 1066103 1474838 1979631
8604 1979631 2141962 1881824 1582218 1401096 1306238 1248073 1169436 1085505 991170 911761 846082
8593 846082 747631 649015 596335 550370 469646 426157 381363 342479 326672 320236 321209 302281
8581 302281 294780 298074 321433 303704 292000 260669 237631 212647 182074 156936 163053 185211
8569 185211 196373 193983 178715 180275 192895 195388 241709 337560 465104 658456 753483 674405
8557 674405 495638 339718 242535 190052 151251 141768 111524 98826 96998 88345 86352 85915
8545 85915 103020 97417 89309 72319 48684 55553 64161 78786 98494 108407 88669 90178 93001
8532 93001 96454 82482 76051 91092 69062 53534 39686 49315 57860 69086 74915 90608 86558
8519 86558 51698 52308 55094 40085 85938 66083 42418 40192 37234 28457 30637 51523 53143
8506 53143 48341 38012 28425 11455 20424 26660 33453 41057 36892 21703 40600 36613 38622 52678
8492 52678 52310 23951 -5723 14965 29876 30807 47534 63686 50879 32834 34937 31188 19052
8479 19052 16893 25732 30927 29136 20524 19679 39683 38225 35390 40525 36576 41653 44087 29453
8465 29453 -1458 5736 9664 5558 17715 19801 28240 27151 15713 -4789 6486 24150 9321
8452 9321 3635 18789 33624 43820 34463 11500 -20565 -25527 -18024 -22476 -18115 -724 31221
8439 31221 31037 50620 51277 42682 47756 48057 38439 38042 31017 17894 5839 -12565 10645 42606
8425 42606 42534 26147 28333 28573 47080 47815 27852 9733 27529 52960 36202 13864 4477 15988
8411 15988 36726 14811 -1713 2047 12783 27398 32967 23998 28118 36604 70850 67492 59122
8398 59122 48642 51539 64734 77120 85986 66648 62594 41725 29997 23811 34539 48917 41616
8385 41616 61899 74781 58578 56905 46184 33495 12730 23928 51602 62340 53712 71547
8373 71547 77964 52362 17616 -5946 -5502 -4911 -26720 -31539 -24243 9034 40344 37622 27174
8360 27174 -14627 -32835 -376 18859 23845 38326 31156 23286 22064 37294 45067 33342 45257
8347 45257 49251 32817 19404 34217 29243 39220 32921 27657 41915 37875 31747 -5949 23271
8334 23271 57116 36327 -3905 760 26716 14547 4952 10591 -3864 -23606 -16934 -2585 -5069
8321 -5069 -6978 -2275 -5284 -4988 -3358 17054 19602 23056 11446 14227 6729 -2671 17377 12306
8307 12306 -1196 -9955 -22654 -37253 -28412 -19440 -14009 -6427 18725 60645 26011 -9521 -5594
8294 -5594 -9180 8960 29461 24430 10992 -588 -14055 -25117 -21315 25941 42394 48481 73947
8281 73947 44308 13695 32903 46329 56805 61702 57955 37081 23069 -3157 11161 60142
8269 60142 59904 59193 80624 69293 51181 56898 78675 80106 27090 21857 9723 -8235 -9598
8256 -9598 -23971 -13754 -6006 -14674 -18885 8790 31102 33096 15850 1440 -8692 6180 42029
8243 42029 46802 30310 38602 40483 29960 10480 7234 12632 20893 34417 16930 30496 31958
8230 31958 5212 -16212 -16749 -47302 -20271 -24228 -20653 -7736 10375 11301 -864 -13487 -27306
8217 -27306 -12406 24951 42233 42086 34742 28726 12207 26610 45509 28883 15100 12483 36876
8204 36876 17395 13733 4630 6972 20567 9314 -8794 -9140 11860 34467 36513 38169 6802
8191 6802 -12574 -17146 8921 45767 38055 32745 24514 -4228 13792 29183 13496 7055 -13784
8178 -13784 -24562 -35595 -25043 -12191 -17912 -24426 -10186 202 12480 45882 52861 21429
8166 21429 -12318 -3576 24654 45574 37628 20092 19118 29358 31572 57315 66174 50470 59265
8153 59265 39034 26274 -4805 -12703 9431 18594 39743 29809 22250 25433 23649 38950 36302
8140 36302 27889 52310 45437 34386 15517 27185 32873 27728 -1535 -6450 28950 44915 29346
8127 29346 34030 32375 17929 -199 17690 27492 26066 6287 -6492 -22840 -30926 -31077 -31360 -2110
8113 -2110 13371 -3850 -11537 -10652 10712 8839 -5364 -4769 -25980 -32365 10005 19382 9850 45541
8099 45541 63222 41295 20107 29032 40472 33827 30578 13547 32002 20697 33340 34566 26468
8086 26468 10649 20706 7977 7773 25233 38163 5440 -7063 3184 29955 45020 23091
8074 23091 28670 43456 45314 61824 58798 74363 67131 51745 61208 54727 46818 31786 42118
8061 42118 19081 15639 -795 -32856 -12387 13102 25589 31896 40125 27669 21940 52662 77762
8048 77762 59339 51167 41225 44566 58618 77189 64989 58888 52986 64985 52813 72627 73210
8035 73210 68942 68690 69871 66834 62699 79094 110622 117449 119003 129825 110550 83650 66234
8022 66234 80147 94600 81107 89654 65585 39238 66226 71004 64173 74843 107016 115132 101603
8009 101603 108686 135544 152658 149698 139429 129324 112871 115605 113594 97221 87419 74787 86281
7996 86281 106553 128785 100824 78552 115904 113702 94152 91954 69819 54094 55616 59500 47157
7983 47157 35466 46465 57745 54919 8389 -819 30906 52330 41660 42045 55578 75830 88147
7970 88147 96981 98521 83066 83784 81661 111480 112832 114091 118906 113581 101480 94861 78354 59514
7956 59514 18536 27746 40306 14779 15664 50225 69807 50574 54556 39989 40072 48390 55130 53468
7942 53468 75243 64886 39077 27061 15416 7359 26672 24312 20238 33779 21819 44350
7930 44350 39305 5060 6902 24281 -2267 -20821 4994 10188 43195 78219 64667 71371 71189
7917 71189 51179 49499 60873 73031 81280 67597 17240 8686 -101 6274 -5405 3992 28685
7904 28685 43089 61396 71157 80858 77243 41637 31811 26125 35317 60646 50767 20192 21680
7891 21680 7322 17811 30501 27572 14534 12296 -3412 -16789 -36822 -39569 -34430 -13445 -339
7878 -339 -5624 19673 38559 15407 -4333 -23190 -36960 -37730 -34708 -21598 -29093 -18967 9837
7865 9837 -429 14584 32647 16533 7142 15878 21103 24944 16775 11390 9983 -16704 -12465 -8267
7851 -8267 15150 24251 6685 -9265 9921 5108 -27614 -33795 -25497 -1884 15204 27176 39886
7838 39886 49495 42174 27013 28113 40663 42853 16036 15149 18788 9042 -12750 9589 39260
7825 39260 24166 -15666 -15830 16024 16259 -7048 -14487 -23600 -36027 -31322 -19815 -36968 -23782
7812 -23782 -20740 -31991 -49372 -7556 20669 17552 -2318 1085 24759 20475 17831 19939 28538
7799 28538 34303 59040 42310 29116 5524 -3447 -9590 -6356 -1605 -19855 -6797 17947 31624
7786 31624 14033 16477 44516 17793 18393 46079 40509 40877 47213 37092 17737 8242 -4281
7773 -4281 7058 7187 -15487 -24198 -49421 -41872 -48570 -57605 -25619 15144 17104 31011 13705
7760 13705 6102 23369 23292 993 4273 6395 12666 -10515 -945 17010 901 -17361 -22637 -31627
7746 -31627 -25447 -8791 17460 -20351 -49806 -59618 -53240 -19157 -3576 24148 15583 -5158 7534
7733 7534 42405 36262 -3891 -9769 346 2526 16056 18165 15309 1365 -4070 -2967 -4154 -27766
7719 -27766 -38781 -26894 -21856 -38963 -32194 -21599 3076 -4121 -13035 -4718 -9394 7116 18254
7706 18254 16359 7250 11680 14804 -8920 -1483 28139 3488 13278 28367 -2926 -35503 -27671
7693 -27671 -29556 -21477 -5673 -3289 2045 -17809 -39775 -30695 -32718 -60141 -62132 -60930 -29978
7680 -29978 -10339 -4925 -38661 -50238 -37466 -35984 -14627 2729 -17455 -2073 -32761 -54668
7668 -54668 -48059 -44856 -40785 -32832 -37298 -23459 -16202 -33584 -35721 -42365 -35030 -13840 3937 17747
7654 17747 21972 -6485 8817 26117 29017 35127 52256 53197 62341 47524 45395 65226 38668
7641 38668 13308 -10605 -3959 -22345 -27218 -16808 -19769 -29480 -22677 -24114 -11753 11778 19246
7628 19246 26235 6194 -20056 -13387 16293 29600 25925 10318 -15454 -11425 -26487 -48177 -41731
7615 -41731 -33985 -24372 -27682 -22499 -20028 1251 22641 16134 -8577 -12685 -9887 10528 5709 -5153
7601 -5153 2420 4891 -14387 -12362 -28209 -29487 -14433 -22712 -8093 -17738 14660 24678 31578
7588 31578 5996 -10711 -10620 13810 25607 -3064 -43369 -31639 -12741 -8185 4445 10355 9927
7575 9927 19181 25450 25276 8607 14963 17635 -297 872 14467 -6654 -19057 -6674 11905
7562 11905 351 -3624 -13418 -20714 -12394 1552 -20670 -50580 -35771 5751 49480 50163 49210
7549 49210 42008 17872 5735 -8674 -5466 -11021 -26365 -20566 -12706 -26092 -38821 -37037 -37164
7536 -37164 -44686 -49116 -13636 5621 -4654 -13068 -21379 -23427 -3344 -5001 -12817 -18121 -27958 -33923
7522 -33923 -22884 -30292 -28882 -50176 -48487 -20184 -24752 -25057 -21074 -14429 -20527 -39410 -52348 -62472
7508 -62472 -40550 -33954 -33675 -33611 -34620 -30468 -33613 -18252 -35296 -54709 -46565 -30461 -33204 -34680
7494 -34680 -46815 -27686 24845 55410 58234 28689 16257 -17 3336 24672 19131 13337 15128
7481 15128 31397 26094 2401 6889 10036 11326 20116 22513 -2252 2811 -1673 -11824 -17146 1656
7467 1656 9962 10927 14809 1493 -13073 11980 15411 -5195 -19995 -11412 -6471 8407 5851 -17886
7453 -17886 -50925 -62120 -47851 -24739 -21919 -3443 18659 17717 786 17527 19048 12059 -18419
7440 -18419 -13023 -712 16213 19965 3808 1083 19093 27873 34462 32291 -5178 -9197 27918
7427 27918 38083 2029 -21763 -23636 3301 8099 17217 14170 31315 41394 23622 14675 2068
7414 2068 -18740 -25258 4194 25348 14261 5992 19346 4429 -15780 -17617 2031 13527 11109
7401 11109 1095 -11174 -2700 28672 40099 74640 87403 31982 -2555 21018 3932 -24704
7389 -24704 -21320 -7489 9225 35536 36851 16750 23299 30765 58754 46404 17546 8879 -5830
7376 -5830 -27837 -7734 26105 14114 4077 -7631 -12737 4346 -2487 -27285 -34264 -11268 -4783
7363 -4783 -30318 -48410 -22770 -1070 13325 4617 -4700 -3736 -18423 -4060 -19652 -34799 -35995
7350 -35995 -17887 4297 -5253 2530 3292 -23598 -21502 8373 6505 -8135 -28506 -17487 -18978
7337 -18978 -20041 -31332 -36769 1689 3154 -37877 -26517 2153 5433 -5897 -9644 -6787 -7988
7324 -7988 -17344 -14748 7731 25897 8918 -8086 -6238 22850 16751 -2729 -3871 -888 489
7311 489 6949 20872 27563 11154 3414 3930 -6204 -11550 -9738 8748 6830 -6103 25510 37453
7297 37453 15395 -7911 -20008 -36640 -35767 -51255 -27877 -2047 -13274 -26749 -33101 -40297 -41060
7284 -41060 -42108 -38112 -43020 -25630 -20909 -32472 -38292 -34389 -53000 -53839 -35442 -21258 -33988
7271 -33988 -49614 -42430 -50784 -31731 -5014 22645 18281 -17246 860 25399 24761 10249 -11795
7258 -11795 -15021 -2396 6510 692 2712 -24333 -26099 -10484 7819 13347 -3985 -1114 20925
7245 20925 17824 -506 -16632 -8134 -53264 -80036 -77237 -90064 -57149 -11942 8400 -15630
7233 -15630 -13925 -3330 22167 30172 38380 47352 52090 37020 58999 50510 55037 58534 44791
7220 44791 -2410 -31328 -12868 3093 16388 44323 29265 20734 -1018 -8752 -11016 -11848 -1965
7207 -1965 -3110 16234 19727 41057 31166 26271 22370 23561 5716 -6543 -2409 191 19549 17338
7193 17338 32822 43979 14840 6781 -19171 -26834 -7702 12146 16815 14518 5596 2937 -2223
7180 -2223 -9324 -23764 -29190 -6286 -11202 -2449 -21567 -60484 -55730 -22155 -23857 -9860 21936
7167 21936 25553 21112 4754 -3538 7152 20772 56640 68653 51066 46993 52553 40310 24724
7154 24724 6396 -25814 -48743 -52417 -19933 -4713 -4550 -6464 -5082 -30681 -26661 -18481 -30369
7141 -30369 -7253 40604 64453 30413 11206 -27283 -25297 -10183 -12251 -30327 -14405 -12306
7129 -12306 -37751 -33452 -9635 -3425 -681 2697 1409 -12688 -8933 -2220 -11480 -43121 -41291 -45014
7115 -45014 -73933 -61469 -55717 -31112 -21971 4238 8832 -7370 -16835 -9286 -40891 -51625 -41022
7102 -41022 -37119 -33161 -31544 -39668 -27858 -15181 -9492 6263 -5319 -24096 -11939 -6542 13859
7089 13859 14656 7857 -601 -3492 -5736 -17474 -15725 4639 25967 7531 31557 53327 60391
7076 60391 37561 44698 60341 33757 -11364 -18699 -15567 -52945 -88541 -89714 -67536 -56454 -23957
7063 -23957 -7415 7859 10348 -6712 -12750 -5936 -27124 -32001 -13813 -18024 -3641 10479 -6055
7050 -6055 8950 24940 11786 -15890 -25048 -15506 -10316 -12537 -9608 9159 16754 -14820 -26834
7037 -26834 -1731 13159 7105 31646 20407 3632 3357 -3009 4907 -16721 -43993 -53540 -30876
7024 -30876 -256 4129 -9411 -30863 -24219 -27777 -28730 -24166 2281 37937 22333 -4419 -19611
7011 -19611 -26622 -20666 -21789 -18132 -5019 -929 3652 -6082 -18817 -24904 -16435 5285 -11798 -27036
6997 -27036 -39361 -18480 18860 24996 1616 -12030 -1433 -10107 -25624 -31543 -41240 -40020 -29649
6984 -29649 -26236 -40680 -41869 -15166 15844 40380 16890 8085 -5454 -14486 -17293 -6526 8330
6971 8330 7279 -3208 -14677 -9958 -1470 53 5531 31289 51862 43114 17376 9107 10209 970
6957 970 -10606 -18264 -15178 3109 -19112 -11863 7803 -5360 -2736 -8642 13018 20806 10711
6944 10711 10318 -5722 -16255 19630 44414 21210 -3492 -6400 6653 10275 21366 33562 14168
6931 14168 24331 21248 14114 -230 -6762 1832 395 -20606 -30127 -18290 -9029 7253 -3525
6918 -3525 -5683 -7004 -10466 -32825 -39671 -27501 -18328 -31865 -40210 -22877 -8932 -13867 -2955
6905 -2955 9408 28278 25108 29493 27069 -1029 -25627 -30251 -22123 -21095 -35258 -21547 640
6892 640 10939 51205 55994 44022 29451 16359 18735 44888 17640 -18463 -28784 -9818 8039
6879 8039 -285 -9249 -39154 -40021 -9104 10432 8874 13367 -5421 -18381 -44466 -50773 -39253
6866 -39253 -34280 -46419 -65371 -56927 -48568 -36722 -30136 -21138 -26340 -22808 -1593 1510 -7922 1032
6852 1032 16566 41840 13658 5220 5633 1846 14241 -6113 -21097 -14707 -34407 -45600 -50805
6839 -50805 -64369 -56334 -17173 5003 -12802 -483 32287 30960 22420 16142 7722 18601 -7478
6826 -7478 -40757 -38865 -10578 11918 15496 3436 -7482 13708 26010 27790 -15807 -14818 -1116
6813 -1116 2498 3490 24286 42957 38387 24057 30497 33280 16777 5838 3191 -5184 -24952 -37414
6799 -37414 -27097 -32905 -683 3928 -35582 -47051 -40674 -43816 -14162 -714 9175 -535 5047
6786 5047 -13427 -7839 14039 46071 55713 42198 45823 62584 66594 57026 30356 7298 16314
6773 16314 11064 5238 30526 34639 52857 81015 96889 113354 112646 102147 73462 76465 77936
6760 77936 76373 46412 25489 53608 84277 105827 83409 68969 60266 38020 16600 3912
6748 3912 22621 26255 19480 24854 28457 19640 30852 46865 86524 107621 128293 123526 125193
6735 125193 159673 236954 351854 519164 801311 1159699 1375537 1267285 951371 640970
6725 640970 427792 286600 218062 152233 103001 95803 117338 103635 55625 36277 40306 56045
6713 56045 47530 54967 35512 23646 6898 28868 43506 22120 11928 42589 38649 35789 1208
6700 1208 -9633 1379 41103 64244 52301 30544 59092 56017 20953 10515 15301 21264 40600
6687 40600 36207 31325 23164 35678 28755 18893 31322 26141 31414 15405 10005 21968 8909
6674 8909 4327 23269 39066 32043 11227 7620 9467 7254 18165 33506 36757 22438 -20484
6661 -20484 -37758 -59798 -67564 -56920 -41603 -30299 -23634 -23788 -12424 8540 20164 9676 763
6648 763 -4417 2947 36489 30318 13588 19131 13140 -18068 -40876 -46983 -48475 -49180 -20985 -23056
6634 -23056 -39950 -36780 5436 36016 10645 -4551 17997 2521 1208 849 -41890 -52906 -38940
6621 -38940 -24301 -5083 5712 26547 42370 33754 1879 -8066 -2011 19134 8524 22613
6609 22613 35999 38439 38239 42302 38937 62890 43466 7887 -6090 6283 14523 9986 996
6596 996 -19139 -15729 -2881 -2017 -927 -5206 -1858 -8438 -8002 -4524 7657 7372 18132 20547 11233
6581 11233 6875 33669 13523 1288 -22884 -2201 7941 -13548 -6313 6510 -13959 -6421
6569 -6421 -6312 -4523 3461 34259 8786 7916 -7879 -28571 -31565 -31187 -43311 -41623 -24713 -8314
6555 -8314 -25525 -44857 -12424 -11371 -33262 -33775 -33420 -22020 -17088 31158 8992 -28106 -30155
6542 -30155 -8611 9694 1671 6977 6493 7575 -3230 -16372 -31016 -8185 11678 12568 8670
6529 8670 -17674 -48767 -39590 -29319 4527 33221 23808 4378 7479 12262 6024 -16072 -33373
6516 -33373 -25242 -7588 -17696 -12592 -30113 -30779 -36484 -46137 -35477 -16608 -3660 4715 -9684
6503 -9684 -10264 -7854 -21508 -21564 -11822 519 17540 30518 21296 -3274 -11451 -14646 -9293 -7352
6489 -7352 -15545 -43494 -36657 -3610 -10300 -13098 -24212 -29143 -33325 -46270 -40605 -32375 -18955 -9816
6475 -9816 1869 3605 4904 18033 16037 9204 10718 9213 2148 10946 -23952 -72964 -76033 -77478
6461 -77478 -56124 -36765 -24210 -23345 -11833 4437 14084 -227 -38903 -23006 -8368 -11887 -49940
6448 -49940 -66237 -43122 -41773 -48579 -31708 -10623 -2300 8453 26538 3195 -13291 -22138 -6471
6435 -6471 -31713 -23690 -13089 -48310 -50292 -29602 -7465 22266 22781 45223 38990 721 -27293
6422 -27293 -10449 18201 24779 25286 -6318 -2973 7476 21575 28789 15463 -3425 -24738 -41527
6409 -41527 -30724 -19635 -2279 3191 8803 6756 13048 -16937 -31583 -45377 -52831 -42282 -16733
6396 -16733 -27999 -16125 1344 17288 5583 1546 -28268 -16021 1052 26238 26026 35325 25340
6383 25340 -21224 -215 15982 17030 5884 6242 7429 6197 -5669 883 -3993 14277 22616
6370 22616 15260 6071 1395 26720 24928 23529 47426 16857 -20595 -17199 2121 -11496 -10569
6357 -10569 9001 -3080 -16722 -19956 -39492 -4884 3920 -2609 12299 -1668 -11133 -10432 -11261
6344 -11261 -7262 13927 -4638 -39553 -42018 -29123 -9467 -6489 -7284 2830 -4290 -35091 -37938
6331 -37938 -28429 -8960 -35012 -39207 -19511 -35253 -29315 -21981 -18398 -40534 -14415 23495 20565
6318 20565 6649 -12585 -27849 11579 1663 -28961 -25210 -16804 -5923 8983 17789 6871 3391
6305 3391 -4369 -14033 3722 11338 -28524 -47555 -33533 15303 41004 22959 9979 -12334 -231
6292 -231 -3784 -13526 3666 12125 27361 47796 63992 54949 38099 36375 19168 24677 41520
6279 41520 27239 40205 22785 2291 -1135 2307 26512 4421 -11196 -17752 -44377 -43557 -14225
6266 -14225 14188 22785 128 -37596 -39531 -16715 -28629 -52847 -47698 -44415 -23150 2944 -5239
6253 -5239 3926 24342 13388 -2289 -10902 -10297 -4298 2475 -13341 -41618 -35912 -17032 2518
6240 2518 -11743 -26633 -48952 -39074 -15370 -10679 -29010 -28905 -31511 -46555 -32281 -28031 -16252
6227 -16252 1640 6819 35760 41259 -433 -740 33656 17371 -14052 -18543 -35697 -71049 -60966
6214 -60966 -46679 -58078 -48184 -14437 -3587 4909 2426 3495 5002 4609 -3496 -8522 -25535 -6216
6200 -6216 -3073 6425 12164 17660 15645 18764 1277 1121 15653 7106 -15146 -2568 23655 34388
6186 34388 50985 34292 20909 36488 28487 11385 -5414 -15798 -26002 -34036 -59160 -68898
6174 -68898 -41125 -28628 13030 31461 42587 56436 51433 40046 18367 3869 4013 706 1414
6161 1414 -510 -9218 -23802 -29242 -35551 -42916 -29657 -5727 1849 5135 6614 17248 41870 46515
6147 46515 45359 42513 26779 18294 21661 21784 5176 -25378 1451 16081 1655 -11291 -12730
6134 -12730 16278 22917 31781 30859 48504 39659 50369 53851 37906 28793 9825 -19667 6451
6121 6451 30685 43162 28492 -4208 -6228 16055 28851 34442 -566 -32784 -48554 -35245
6109 -35245 -15684 -17528 -14633 -24490 -16258 -23180 -36460 -30072 -35621 -25302 -11558 -28452 -36834
6096 -36834 -15284 -3941 11715 18517 1813 -13765 5265 10949 6624 8159 10940 -1400 -29463
6083 -29463 -48539 -50410 -10190 4896 -25794 -24648 -15225 15826 40148 46887 49567 50440 52523
6070 52523 53127 38482 23256 -7793 -17077 -3749 1983 -28327 -22274 4354 1482 -36011 -29681
6057 -29681 5316 5722 -4047 -24645 -35379 -38165 -13202 16752 -4506 -56581 -54585 -49068 -36148
6044 -36148 -19502 -14103 -7241 -21636 -21527 -30710 -54318 -46711 -30397 -19327 -3387 -9234 -4981
6031 -4981 5653 22865 -2595 -17781 -17489 -28200 -8439 -21286 -30772 -10314 -15055 -18997 -22833
6018 -22833 -30187 -47199 -27366 -7824 -15474 -12283 -17882 -12013 18096 24840 28051 15310 -15793
6005 -15793 -20714 -25905 -19264 -8667 28090 6207 -4589 -29666 -37867 -30666 -52203 -55392 -68910
5992 -68910 -57669 -26226 1101 20769 21270 -12813 -27655 -32657 -44512 -22648 16539 23363 37225
5979 37225 35036 33087 13759 -12321 -12728 -1526 1046 -29856 -45642 -39968 -9679 -36102 -39638
5966 -39638 -36915 -51539 -41511 -16339 -38430 -48714 -49573 -40294 -7955 9164 22524 11436 4785
5953 4785 16981 24081 -10191 -28705 18898 64549 82960 56280 25536 20066 -19756 -45885
5941 -45885 -40135 -17325 -1279 16134 48346 31827 25078 3802 -29036 -19760 -7101 -10327 -14215
5928 -14215 -9772 1178 -20150 -45634 -58728 -36506 -17220 -20542 -5834 -6432 -9811 336 30922
5915 30922 35007 22918 39074 27260 32144 22475 13215 6309 -181 4011 7626 103 -15378 -1477
5901 -1477 -10080 -6208 5476 296 -29605 -53954 -91959 -89739 -75518 -35331 -21431 -31593 -25296
5888 -25296 -23546 -30312 -37480 -20330 13437 26193 6919 -8400 -14123 -34889 -19072 -8020 -10315
5875 -10315 1653 2701 -7944 1650 -16918 -31140 -30122 -20061 -8497 -32097 -46668 -37023 -39978
5862 -39978 -33666 -11067 -6929 -25447 -13115 23279 16882 -12616 -26078 -4406 18452 23324 40006
5849 40006 31053 10461 -1360 3374 3326 -8047 -13500 5329 30754 18241 -998 -30480 -56602
5836 -56602 -53586 -27615 -14193 -27501 -43007 -48058 -32199 -5423 14741 31646 28803 27151 39510
5823 39510 31648 24044 6726 -3914 -33701 -48077 -39051 -28684 -831 -24521 3727 11284 10762
5810 10762 13142 10518 -5862 -13967 7446 27942 9606 6671 11670 10700 1194 20153 -4021
5797 -4021 -15971 -7279 -4715 -3192 -31525 -49416 -40879 -4424 3398 -4978 -10571 -26991 -41655
5784 -41655 -15001 -7728 -37775 -64100 -38618 -5278 106 15400 -13647 -9115 -8643 -13220 -19704
5771 -19704 -38731 -24054 -37258 -55696 -54822 -36466 -17096 1057 -26055 -33324 -23259 -32168 -22723
5758 -22723 -33041 -53711 -51057 -59907 -48071 -44383 -52136 -43080 -24816 -16520 4976 27521 20967
5745 20967 -225 -27678 -31391 -24359 -34407 -34654 -40774 -46454 -34406 -9936 -26288 -32026 -19462
5732 -19462 -17895 -5816 -2844 -18011 5732 3056 -3497 11282 18330 -8386 -32788 -23539 -11232
5719 -11232 -9865 -19147 -36785 -31654 -40696 -32422 -45729 -57209 -35327 -5988 17852 13726 3084
5706 3084 20278 30449 -4176 -29934 -21585 -21668 -26728 -41090 -36647 -18626 2092 -9478 -20326
5693 -20326 -5470 17152 14704 2636 -12834 -18280 -12425 -12368 -9698 -21009 -16089 -20391 -19922 -9474
5679 -9474 -6809 21714 36200 4694 -8868 -4266 3633 19979 38410 46941 20983 3976 13086
5666 13086 19122 17882 -8691 4397 -3827 -39538 -54358 -27348 18649 30534 22350 44882 57472
5653 57472 53103 56880 47702 45589 16104 -12598 -38739 -21137 -7737 11668 -5711 -10497 -20079
5640 -20079 -6703 22172 36409 44726 -2678 -50919 -23131 8213 39391 40131 37758 27384 6327
5627 6327 -17071 -20927 -17482 -8549 -132 9555 2375 -13711 -25969 -31214 4921 17669 23780 4744
5613 4744 -6561 -14115 -30438 4950 27616 33428 44956 36961 -8140 -49452 -49355 -54552 -42194
5600 -42194 -19948 -11280 -22563 -10700 -23622 -25074 -21957 -5573 27590 33866 -21880 -33183 -33800
5587 -33800 -30545 -736 -24622 -65287 -45899 -24671 -5490 -8733 -28406 -32388 -2158 22270
5575 22270 26345 44711 38651 -3030 4532 -1552 -14549 -10327 -3204 12119 -17452 -33249 -25766
5562 -25766 -15185 56 15214 -6543 -15404 -16752 12311 24408 2884 -3334 12427 54509
5550 54509 65005 58776 37979 34322 30949 29903 25522 13588 -5668 -8244 27014 20469 15138
5537 15138 24919 4108 -6410 -13520 -13146 -3377 4694 8690 18083 9353 -20132 4686 7993 -18157
5523 -18157 -29302 -27769 -31167 -25559 -4450 3063 2499 -23745 -61997 -38213 -25914 -36019 -56388
5510 -56388 -65407 -23833 25512 32846 328 1201 10640 3221 21420 19790 3455 19074 9742
5497 9742 -13680 -44663 -28156 3080 8395 -5317 14591 17373 -15512 -12065 -25576 -10541 -16077
5484 -16077 -32431 -11538 -3710 -12483 16221 22058 16018 -7980 -2002 20093 30991 8885 12974
5471 12974 22024 23293 -25960 -48909 -32619 -14352 -8808 -17749 -20985 -19857 -18310 597 8515
5458 8515 10516 3310 -4709 -16361 -21170 -9253 -4781 -15139 -29324 -57685 -70443 -32818 7934
5445 7934 14042 -8061 -15364 11660 15317 -8658 799 5485 -10505 -8320 2528 11706 44303
5432 44303 59711 61190 51191 47276 10457 -3136 652 8390 -3592 -72 25963 43198 40546
5419 40546 43411 39410 37998 52683 55373 33875 11754 -3053 -12827 -11677 26357 48849 65571
5406 65571 46508 27597 15038 -5339 -37286 -32106 -35021 -15202 -8957 -18763 -18354 -6100 -36849
5393 -36849 -32292 -9446 -13292 -22920 -6732 5623 2470 -7899 -7559 1886 1084 -3601 -284 5523
5379 5523 2129 -18193 -19627 -21741 1596 35679 30369 28361 6793 -631 -26182 -11769 12479
5366 12479 14245 14635 9502 15441 24235 40891 33060 13395 -12667 -26283 -11553 7122 -21321
5353 -21321 -34945 2648 597 -18111 -18375 6008 -9982 -40186 -6408 27763 15614 10789 15045
5340 15045 -19705 -24768 -22842 -14248 -1710 5976 -4860 32079 56844 80340 50217 34541 39585
5327 39585 16048 18630 13222 927 -1527 -13852 -8814 11786 12441 22213 22414 24292 7298 11084
5313 11084 6477 8756 15362 18120 27413 49447 31143 11486 8606 6086 -12318 -21497 -17438 -24100
5299 -24100 -11464 -5487 -5160 20741 11489 -11588 -29020 2757 18341 4722 -20250 -16825 -26255
5286 -26255 -15819 2937 2956 -1885 -1043 -1839 22706 20196 1491 -14755 2413 -4136 -15083 -23099
5272 -23099 -31727 -7701 17412 21605 -17084 -25042 -3463 -1809 -7386 -11928 -13061 -25912 -13637
5259 -13637 -911 -14080 55 -2724 -15638 -21866 -5221 478 -12262 -28617 -1847 20703
5247 20703 35755 39466 19254 -14616 -31422 -30393 -27281 -24040 -35385 -41162 -62337 -28904 -14459
5234 -14459 -28583 -32522 -25015 -10396 -16306 2786 16660 18626 1931 -22972 -13134 17861 24966
5221 24966 16006 24453 40643 31789 49826 47066 15448 697 -11408 -23080 -12650 -5085 -7713
5208 -7713 19254 22239 -397 -9651 1844 -9568 -15766 -23103 -21708 10113 733 -11419 -9708
5195 -9708 3544 17649 14108 20244 14278 17884 13143 16163 19942 34103 37953 7602 21546 15760
5181 15760 16471 20314 16906 -9869 -18842 -45288 -63325 -71864 -79878 -48355 -15290 -2471 -1915 -9187
5167 -9187 -10548 18510 44684 3478 3714 43996 30715 -1071 -17904 -27406 -26943 -36133 -38263 -10975
5153 -10975 29407 38572 14147 18623 15049 -2995 -1243 -10027 -15410 -25022 -42765 -29831 -11212
5140 -11212 -19688 -43776 -34984 -34592 -39676 -33397 -23419 -18120 258 6466 -10494 -45199 -62394 -29450
5126 -29450 -18570 -24089 -29861 -29395 -32357 -48487 -38348 -16679 -8938 -20479 -34797 -43568 -54300
5113 -54300 -40915 -42956 -41688 -42173 -46357 -23558 -25263 -13411 -4955 -24880 -27037 -16281 -32466
5100 -32466 -7405 19315 2740 10456 11172 -13333 -35412 -32445 -40742 -38653 -19984 -21342 -37667
5087 -37667 -12848 -3003 8305 1478 28976 25670 25347 46867 22648 -8879 -1352 -20699 -15818
5074 -15818 -22595 -20278 -12983 -15614 15328 40407 11986 13512 14313 23985 29198 21665 12522 -3801
5060 -3801 11711 3458 835 19123 16668 11184 25624 12959 20666 3988 2703 17480 13151
5047 13151 23037 9792 -4306 -9087 -29261 -10717 -4422 -6799 -5150 -6895 -28036 -63701 -63633 -43578
5033 -43578 -32029 -12128 20379 20236 -15579 -43195 -34444 -22050 228 44280 57994 58080 46123
5020 46123 22569 20970 10528 -1958 16295 34819 15875 6594 -9392 -11372 -17740 -21987 -35187
5007 -35187 -6617 20383 1288 -19363 -2427 -16133 -16456 -12119 -8435 2267 15039 19101 22467
4994 22467 10741 -2380 2411 -4728 -10998 -8713 2019 -4337 -4844 -33517 -35269 -31882 -21144 -27810
4980 -27810 -34063 6316 16167 21424 15946 -5907 14337 28385 19940 -5741 -19067 10310 -16501
4967 -16501 -58514 -54371 -57781 -36426 -25509 -9102 31081 46075 22941 -3392 -24414 -14846
4955 -14846 5002 36404 19923 826 -27977 -35346 -47840 -60837 -45448 -41013 -20541 6824
4943 6824 -15253 -9767 11619 14968 32004 11657 11036 -1567 -15925 14937 8133 4094 -16035
4930 -16035 -19745 -34362 5266 29495 32799 13610 19719 28492 11370 12321 27018 25324 -10911
4917 -10911 -46007 -25204 -1614 10914 22636 9184 711 -4640 -26271 -32678 -11590 -21907
4905 -21907 -26479 -25981 -2828 7675 -6000 -445 -7230 -17733 -40546 -27355 7331 5420 -20107
4892 -20107 -5633 11320 -11413 -47132 -57797 -37000 -8931 13953 -3778 -1098 2309 -5374
4880 -5374 -17635 -23590 -24931 -29004 -17512 -10661 9589 25919 30784 36115 4855 -37324 -36437 -20777
4866 -20777 -32018 -30893 293 16024 5994 -27448 -24871 -6284 -3026 -8800 -12467 -17718 -28409
4853 -28409 -14441 -5496 -29596 -3740 7830 -25773 -43049 -35717 -36594 -43771 -17236 -15839 -24610
4840 -24610 -34689 -18122 6819 -12469 -30929 -34365 -42602 -45887 -13641 21383 21941 -19532 -27433
4827 -27433 -22755 -26136 -40032 -36753 -47933 -65125 -18879 -9294 -21550 -34877 -41463 -56326 -25246
4814 -25246 -20975 -1779 -2772 -25530 5056 32268 39038 13394 -36236 -20598 -5167 -12355 921
4801 921 12239 25315 -3177 -28862 -43138 -50904 -36241 -32431 -16209 -1933 2021 14532 10657
4788 10657 -12461 -33973 -18133 14280 37810 28259 -215 -29106 -27035 -9412 -4298 17811
4776 17811 43969 37083 15569 24326 22507 -13830 -21104 -33260 -45843 -40325 -35078 -27159 -47243
4763 -47243 -26496 -9513 -10663 -16466 -22942 -51593 -63654 -49000 -54157 -45099 -32385 -51074 -27179
4750 -27179 13856 16676 -362 -1638 24861 36640 21380 7162 16327 14845 12729 10126 -11647
4737 -11647 -23348 -17734 13508 23823 9065 -15137 -11114 -3999 1457 5165 13087 18261 8775
4724 8775 3279 -331 -15380 -4843 -7277 3454 29560 37169 41732 15830 1256 -7094 -10636
4711 -10636 6835 8658 -3041 -9483 -29299 -24118 -33822 -20017 615 2427 29857 51781 43328
4698 43328 13698 -12385 -6418 3298 6426 28378 19875 8484 -33 6479 -27029 -46351 -40356
4685 -40356 -21901 -24362 -7340 16873 16643 4553 -4218 6237 10368 -7276 -3124 13635 18132
4672 18132 19621 29099 21970 36781 29921 38733 37262 13576 9542 28593 38322 17671 -4436
4659 -4436 -25734 -44907 -49493 -31913 -15216 -5913 4916 25930 10692 -14760 -3364 14661
4647 14661 17032 8874 -8345 -35238 -21597 -1475 -32998 -67745 -85972 -56328 -27533 -17710
4635 -17710 -9365 14757 -10734 -31006 -26813 -13354 -15759 -23762 -15133 -8287 -3266 -8720 -27401
4622 -27401 -41828 7959 25924 26717 770 -27797 -33130 -34131 -33162 -5038 13077 -19220 -6065
4609 -6065 3587 37413 34092 13572 38031 48515 21307 -6929 14284 25224 -7512 -48335
4597 -48335 -39597 -15669 -34645 -32527 -35759 -28529 -38564 -20172 1441 -17410 -14509 -13456 -18501
4584 -18501 -10522 23073 17992 7738 -13876 -26325 -34436 -54305 -41346 -15754 -11058 10193 34759
4571 34759 1709 -37805 -39451 -27318 -9190 1802 12796 21056 25930 2326 -4740 2666 16382
4558 16382 18493 4755 -23939 -33518 -24127 -13692 11373 21171 25663 33284 27096 -17395 -22925
4545 -22925 9537 11512 -12015 -14525 -13190 -14142 -9824 -21751 -12769 -39395 -39259 -20636 -6788 -2459
4531 -2459 -6707 -30094 -4829 -13224 -10755 -12500 -22067 -30501 -42331 -49684 -33229 -12685 -24789
4518 -24789 6436 19409 7387 -32344 -13365 -13859 3841 18987 32921 12347 6102 13226 10152
4505 10152 12569 6091 -21318 -7807 -2391 -23322 -21646 8047 16448 -5807 -16063 -25468 -33819
4492 -33819 -31638 -49375 -32817 23739 24296 35783 49825 14988 32370 39805 4821 -10996 -11115
4479 -11115 -5876 -10523 -29031 -10792 2690 -20709 -44313 -44670 -33729 -29384 -26846 -26871 -21437 -17695
4465 -17695 -7050 4056 3205 -20305 -6965 7181 42368 45384 6693 -5760 8620 18670
4453 18670 36311 51864 40531 40923 29880 10098 -1590 -9123 586 -1524 14515 30142 -2143
4440 -2143 -22923 -23053 348 31729 49289 44035 34991 12852 11583 17840 14464 20851 -15605 -37316
4426 -37316 -36249 -27766 -44698 -51012 -29909 -4810 -16317 -19766 -4462 14426 -5400 -21736 -34811
4413 -34811 -34676 -17181 -10131 2068 1842 4525 21657 3931 -22395 17291 36568 13684 16963
4400 16963 22429 16777 22911 36876 32197 30385 17965 17793 20280 1298 -14170 -26915 -44171
4387 -44171 -30100 -17217 -38204 -31610 -11125 -37534 -32413 2667 27116 23520 4325 -9029
4375 -9029 -5338 -36301 -39913 -26504 -45765 -51813 -23868 -12462 -19213 -27191 -6478 2580 2878 -12875
4361 -12875 -13444 16796 20697 19648 9238 5575 6884 9470 32123 15847 -8321 -11813 6728
4348 6728 1978 8085 19355 6922 -399 -12453 -41702 -52716 -9367 15095 17211 8148 -13184
4335 -13184 -18899 -12111 -2324 2692 23826 27797 24356 8361 2806 11314 12550 21560 25852 -8853
4321 -8853 -5209 17187 35922 27240 25615 48468 35114 24064 24123 15670 5885 -25706 -29212 -18781
4307 -18781 11098 7387 3857 -9378 -19193 -24756 17493 45874 52664 38211 34945 41469 54948
4294 54948 49684 29005 36338 48384 47042 32995 17769 8587 1705 7423 10052 7564 30308
4281 30308 16204 18625 45703 43395 43707 48504 24713 17558 1692 -3806 -4833 -21346 -26202 -33517
4267 -33517 -24647 -26656 -14040 -20243 -23562 -24712 -11277 -11937 -36406 -49737 -62060 -73800 -34807
4254 -34807 -21443 -37820 -34828 -41479 -49945 -52175 -26764 -15465 -17566 -14205 -1278 3656 -23544
4241 -23544 -3512 45598 42504 33502 44186 44629 19352 4733 8329 2021 11258 21755 4013
4228 4013 4616 20531 36215 24239 14557 18197 21639 9384 -19818 -28123 -7223 6941 25280
4215 25280 3178 -10238 -30681 -66997 -64665 -40096 -41030 -39571 -47005 -58569 -40174 -30537 -16625
4202 -16625 -536 -953 -13697 -20764 -15354 -6403 -23394 -21731 2331 9800 -814 -99 342 -11250
4188 -11250 -14757 -9442 -28679 -33288 -10482 -287 38 -2912 -7473 2258 3706 -5707 29720 26351
4174 26351 30798 56397 44822 31486 24733 342 -2215 22639 39511 27339 25143 13042 -4354
4161 -4354 -10490 18278 21538 36199 16046 3407 -11110 -38861 -18803 7164 15347 1151 10604
4148 10604 44324 31272 -10706 -47419 -42519 3074 19474 -15928 -14072 782 -7320 16454
4136 16454 10191 -4371 3765 -4687 -4632 -35769 -24877 -453 -11071 -11811 -3974 -4256 -28538 -55133
4122 -55133 -40110 -30272 -48955 -66540 -46919 -14545 1710 -4829 21629 47150 17559 -2650
4110 -2650 25359 38926 3696 -2702 -3748 -17722 2505 15245 18359 10815 -3960 -4391 -2498
4097 -2498 26087 46555 49295 51989 39453 6280 -6846 4663 14405 39353 61800 57068 6668
4084 6668 -40053 -38226 -33584 -30550 -9925 -6090 -12017 6654 25170 3753 -16006 -10199 -5934
4071 -5934 -899 4178 22497 23782 11401 10737 -7048 -27898 581 9345 833 -1967 -12881 -10595
4057 -10595 24203 27515 45092 42244 -2507 -35083 -30039 -47152 -58674 -55373 -42638 -26490 3725
4044 3725 15630 41031 35727 -9547 -20428 -8966 -32214 -44744 -21311 1544 -16846 -37268
4032 -37268 -6308 -5355 -16071 -11581 -11794 1617 23074 25027 7164 23364 27447 -3836 -13569
4019 -13569 12643 37564 55229 60742 65535 15875 469 -3134 8086 32419 18482 8655 -4741
4006 -4741 -28980 -55571 -37686 4818 8412 -3648 -5 4613 8204 32800 -7850 -18619 394
3993 394 -31648 -32542 -34227 -16187 -30434 -21969 -5975 -25669 -8209 15286 18043 23099 31030 22093
3979 22093 10064 4011 17067 13297 53 -13307 -18878 -20932 -19170 1880 23296 9076 149
3966 149 5898 27315 26534 7026 9358 16887 13205 20013 3061 -9709 -2587 18465 4566 27863
3952 27863 29923 17550 10941 -11462 -15972 27170 14685 389 21800 26080 5072 2560 -20393
3939 -20393 -53215 -36261 -16182 8478 15992 47653 37240 5022 3043 21144 27417 9859
3927 9859 -8141 5319 13988 128 18710 35255 35533 4806 1180 18180 35272 44847 52417
3914 52417 56154 69294 77939 57638 50901 36685 36869 19703 10220 9490 -12820 -14386 -16436 -18458
3900 -18458 -27069 -32974 -53085 -31886 -17939 -8701 -14088 -2619 -18748 -34264 -14030 -34016 -54879
3887 -54879 -95624 -100749 -72922 -44863 -42970 -31078 -24542 -14051 -5601 -28212 -46073 -38374 -41016
3874 -41016 -28286 -40946 -14560 -9974 -43765 -46929 -32034 -23383 -47229 -34869 -26614 -33792 -43455
3861 -43455 -14531 16974 15344 -4150 -32587 -62971 -31432 -19478 10619 27673 23061 39037
3849 39037 54240 53684 47394 44083 16536 13744 26881 59024 40235 -2651 4225 30568 34355
3836 34355 37681 22591 11636 15379 3018 -4191 -4657 566 32831 37277 6381 -16980 -40082
3823 -40082 -16439 9343 26904 10777 3323 11088 16163 16864 10438 12278 4363 -10012 -31612
3810 -31612 -4347 17953 19358 12776 8819 -7436 -34342 -43967 -36368 -42791 -53195 -17221 8441
3797 8441 -20602 -22297 -25957 -10070 -19478 -28757 -24703 -31035 -14982 -10303 -6748 -15445 -37096 -42487
3783 -42487 -40294 -33959 -21541 -21133 17669 22733 8155 27198 31390 10432 28391 32901 24914
3770 24914 11747 26963 27154 29586 12960 10125 -3377 3020 17846 -5341 5113 21387 -1825
3757 -1825 -1764 -1765 -27463 -20454 7153 20494 40666 37652 53607 54232 36790 -8291 3380 37080
3743 37080 57120 69623 51949 14766 12495 617 -1498 4578 27332 44147 34147 39835 29519
3730 29519 -3425 -19468 -44555 -39962 -33117 -33316 -24886 -13656 -11078 7477 15201 14338 18663 4965
3716 4965 8972 19343 2720 -25804 -39782 -35654 -8538 -18322 -38369 -23678 -9319 -32896 -17217
3703 -17217 17454 19645 187 -16258 -17628 -24608 -32124 -19546 -20159 21511 24617 17137 -1970
3690 -1970 750 17155 26650 4126 -1340 1494 1389 -8045 -19238 -41930 -39512 -43517 -34296 -21586
3676 -21586 -18165 -9148 831 11220 26054 35368 26357 -1917 -25494 -18449 -12907 -5124 -24138
3663 -24138 -38574 -30082 -2856 18640 17426 -4832 -15732 -11446 -25270 -41851 -24251 2212
3651 2212 24249 10753 -603 -12624 -33236 -46621 -43361 -56934 -45919 -1827 -9934 -37826
3639 -37826 -41505 -37227 -11807 22203 41478 53808 52052 34233 34738 44156 33519 16285 -3124
3626 -3124 -8840 -22623 -27854 -11280 -7435 7758 9289 -3351 -35064 -42658 -39895 -25847 -29480
3613 -29480 -30484 -23717 -386 15705 -5029 -27714 -35242 -30392 -28293 -35784 -34523 -20281 -10857
3600 -10857 9025 43243 57474 24663 5408 18191 12706 49308 52701 27118 14953 14612 14283
3587 14283 6656 -8960 -11748 -4268 8670 10015 8219 -1399 9944 -2974 -12725 -12603 -20036 -6137
3573 -6137 23044 43497 6300 1164 3230 5969 -23657 -44469 -36524 -33724 8248 30289 39125
3560 39125 51811 43090 45699 56424 40262 25400 2505 -38374 -45633 -22099 3763 17772
3548 17772 4429 -11360 14349 19822 -5283 11649 -654 10983 -12518 -38130 -29991 -35912
3536 -35912 -49526 -44360 -35297 -26775 -5283 -9410 -1901 6699 -522 1225 6637 1741 -8193 -9329
3522 -9329 2218 10793 14578 17384 8316 22448 8036 3916 -14371 -11530 -12037 -5017 -4406 -7757
3508 -7757 -30065 -47788 -33855 -8133 4058 6504 5486 -2467 10336 9188 17485 23857 -25264
3495 -25264 -48311 -38638 -28770 -20416 -3590 11731 -6921 -23400 -15466 -20829 -11900 9465 7397
3482 7397 8989 13355 25877 6123 -563 -7396 -12866 -26630 3161 14242 8275 -24 -5030 20225
3468 20225 15593 12132 10147 21216 20669 -6729 -16819 -13297 1863 6695 25045 8904 -3074
3455 -3074 -9900 932 -2571 -22153 -31008 -36482 -32896 -15294 -16998 -26275 -29381 -1748 -5907 -15080
3441 -15080 7065 4866 -2578 -2646 25876 35773 46405 53566 17209 7821 8304 32996 36689 30645
3427 30645 31268 49428 58802 22735 1374 10159 1932 4429 36966 50616 24326 21594 -4536
3414 -4536 -20862 -4959 13974 -2922 21601 46635 19549 966 21954 45414 75814 72513
3402 72513 58704 52696 43654 28702 5323 -10434 -14388 5715 32289 35539 28722 22405 -3287
3389 -3287 -17934 4689 -10931 -14381 -12040 -3106 6011 -9061 -6812 22340 45689 28571 -5123
3376 -5123 -10490 -87 5359 3009 -8344 -28078 -52069 -59422 -35566 -20108 -15160 -10340 -4259
3363 -4259 13862 6018 8946 -17564 -7233 28549 40497 48709 43505 21781 17479 7942 -8167
3350 -8167 -15673 -6207 22239 22779 -4961 -9072 9026 14775 34496 40405 59186 64008 13123 -25592
3336 -25592 -12953 -3458 25413 47448 38733 27150 17454 38022 52678 43256 35715 5178 -23291
3323 -23291 -13406 -7602 3516 40239 50963 18386 -5841 -17116 -40857 2477 17599 -295
3311 -295 -2368 22458 30678 25596 10936 -23920 7727 -8442 -32854 -39223 -28897 -25981 -4117
3298 -4117 23335 24670 26050 6878 -7365 -14867 -16228 -21967 -25893 -5393 -21888 -53094 -57660
3285 -57660 -42960 -23013 -22070 -7476 15497 25184 13248 13754 17682 39243 59221 31408 -2691
3272 -2691 -12845 -8804 26442 28075 11468 16317 29141 5441 -6475 -5570 -31531 -39602 8968
3259 8968 58858 49972 2587 -22207 -33564 -29623 -25090 -5733 6710 12239 14267 164 -10120
3246 -10120 -20305 -9325 -14166 -16347 5834 5738 3546 -15449 -3239 -12700 -31225 -35967 -1568
3233 -1568 41498 46451 18760 -16370 -23752 -20417 5384 46868 40643 30325 55022 62902 61631
3220 61631 59625 59658 46560 17451 -14672 -9486 -14929 7557 13320 -6007 10227 10500 7744 -6872
3206 -6872 -13097 -15008 -4193 31342 43486 27502 3396 19624 28305 19399 -1263 -20672 -18420
3193 -18420 -12977 -1177 12528 38050 29118 38551 37532 14476 21864 40553 29840 -5613 18158
3180 18158 26066 -4476 -3616 -5881 -5479 1931 15132 70804 75057 41509 13218 -22110 -25362 -5726
3166 -5726 -24580 -1442 7354 4796 2127 12513 21744 35914 24232 9177 -19493 -15984 12149
3153 12149 37117 31197 33602 45063 60616 35303 -1544 630 5060 4696 -20426 -16764 -20354
3140 -20354 -50056 -49433 -46123 -40749 -25419 -11887 -26659 -18755 -13514 -2986 26092 35931 42664
3127 42664 38668 13749 17149 28390 43340 44265 28694 -10387 -17289 -27164 -18187 -25048 -16039 18375
3113 18375 33688 26762 20535 -3902 -18488 -18993 -9275 16 -1743 21753 4937 -13852 2316
3100 2316 -1251 917 598 -19524 -16147 933 57 18280 5387 -6372 -56550 -76818 -80351 -66744
3086 -66744 -58692 -69416 -51128 -28579 -15462 -19962 4358 -353 -14682 -18417 -16498 -10854 -14764
3073 -14764 -30162 -22821 -893 9959 26821 33361 34380 24467 45234 35077 16539 7216 -13716
$$ [...]
##END NTUPLES=NMR SPECTRUM
##END=
