##TITLE=Analysis number 328714
Compound Code cc 64509
Book Reference 510/57
Project Code adrs
Chemist Name jimp
##JCAMPDX= 6.0         $$ Bruker NMR JCAMP-DX V2.0
##DATA TYPE= NMR SPECTRUM
##DATA CLASS= NTUPLES
##ORIGIN= Bruker BioSpin GmbH
##OWNER= nmr
$$ XWIN-NMR		Version 3.5
$$ Wed Jun 27 13:15:50 2007 GMT Daylight Time (UT+1h)  MAYBRIDGE\nmr@NMR_250MHZ
##.OBSERVE FREQUENCY= 250.131544655141
##.OBSERVE NUCLEUS= ^1H
##.ACQUISITION MODE= SIMULTANEOUS (DQD)
##.ACQUISITION SCHEME= undefined
##.AVERAGES= 16
##.DIGITISER RES= 18
##SPECTROMETER/DATA SYSTEM= dpx250
##.PULSE SEQUENCE= zg30
##.SOLVENT NAME= CDCl3
##.SHIFT REFERENCE= (INTERNAL, CDCl3, 0, 16.522)
##AUDIT TRAIL= $$ (NUMBER, WHEN, WHO, WHERE, WHAT)
$$ ##TITLE= Audit trail, XWIN-NMR		Version 3.5
$$ ##JCAMPDX= 5.01
$$ ##ORIGIN= Bruker BioSpin GmbH
$$ ##OWNER= nmr
$$ C:\u/data/dgb/nmr/ADRS/2140/pdata/1/auditp.txt
$$ ##AUDIT TRAIL=  $$ (NUMBER, WHEN, WHO, WHERE, WHAT)
(   1,<2007-06-27 13:15:26.48 +100>,<MAYBRIDGE\nmr>,<NMR_250MHZ>,
      <created by zg, POWCHK disabled, PULCHK disabled
       configuration hash MD5:
       76 6E 9A 78 1E 09 19 81 EC 84 63 8F B0 6A 59 2D
       data hash MD5: 64K
       96 0C 45 1D 50 1B 16 37 45 DE F4 20 C3 E3 7F 56>)
(   2,<2007-06-27 13:15:40.26 +100>,<MAYBRIDGE\nmr>,<NMR_250MHZ>,
      <Start of raw data processing
       ef LB = 0.3 FT_mod = 6 PKNL = 1 SI = 32K 
       data hash MD5: 32K
       36 E2 1C 00 B5 CA FC F8 D4 76 B7 04 D9 EB BE A9>)
(   3,<2007-06-27 13:15:42.04 +100>,<MAYBRIDGE\nmr>,<NMR_250MHZ>,
      <apk 
       data hash MD5: 32K
       8E A6 B3 A2 6D 29 F7 9C 4C 1D 97 9D E5 DC 5C 70>)
(   4,<2007-06-27 13:15:43.01 +100>,<MAYBRIDGE\nmr>,<NMR_250MHZ>,
      <abs ABSG = 5 
       data hash MD5: 32K
       05 2C EF 7B AD F1 BD 76 C6 C3 2C 18 02 28 91 1B>)
$$ ##END=
$$ 
$$ hash MD5
$$ 76 5B 85 C5 F0 1E 63 F8 94 F4 9C 0D 6B E5 21 F1
##$RELAX= 
##$RELAX= 
##$RELAX= 
##$RELAX= 
##$RELAX= 
##$RELAX= 
##$RELAX= 
$$ Bruker specific parameters
$$ --------------------------
##$DU= <C:\u>
##$EXPNO= 2140
##$NAME= <ADRS>
##$PROCNO= 1
##$TYPE= <nmr>
##$USER= <dgb>
##$AMP= (0..31)
100 100 100 100 100 100 100 100 100 100 100 100 100 100 100 100 100 100 
100 100 100 100 100 100 100 100 100 100 100 100 100 100 
##$AQSEQ= 0
##$AQ_mod= 3
##$AUNM= <au_zg>
##$AUTOPOS= <30 >
##$BF1= 250.13
##$BF2= 250.13
##$BF3= 250.13
##$BF4= 250.13
##$BF5= 500.13
##$BF6= 500.13
##$BF7= 500.13
##$BF8= 500.13
##$BYTORDA= 1
##$CFDGTYP= 0
##$CFRGTYP= 5
##$CHEMSTR= <none>
##$CNST= (0..31)
1 1 145 1 1 1 1 1 1 1 1 1 1 1 1 1 1 1 1 1 1 1 1 1 1 1 1 1 1 1 1 1 
##$CPDPRG= <>
##$CPDPRG1= <>
##$CPDPRG2= <>
##$CPDPRG3= <>
##$CPDPRG4= <mlev>
##$CPDPRG5= <mlev>
##$CPDPRG6= <mlev>
##$CPDPRG7= <mlev>
##$CPDPRG8= <mlev>
##$CPDPRGB= <>
##$CPDPRGT= <>
##$D= (0..31)
0 1 0 0 0 0 0 0 0 0.06 0 0 0 0 0 0 0.0002 0 0 0 0 0 0 0 0 0 0 0 0 0 0 
0 
##$DATE= 1182946524
##$DBL= (0..7)
120 120 120 120 120 120 120 120 
##$DBP= (0..7)
150 150 150 150 150 150 150 150 
##$DBP07= 0
##$DBPNAM0= <>
##$DBPNAM1= <>
$$ [...]
##$SUBNAM7= <"">
##$SUBNAM8= <"">
##$SUBNAM9= <"">
##$SW= 20.6930455092707
##$SWIBOX= (0..15)
0 0 3 0 0 0 0 0 0 0 0 0 0 0 0 0 
##$SW_h= 5175.983436853
##$TD= 65536
##$TD0= 1
##$TE= 297.16
##$TE2= 300
##$TE3= 300
##$TEG= 300
##$TL= (0..7)
0 120 120 120 120 120 120 120 
##$TP= (0..7)
150 150 150 150 150 150 150 150 
##$TP07= 0
##$TPNAME0= <>
##$TPNAME1= <>
##$TPNAME2= <>
##$TPNAME3= <>
##$TPNAME4= <>
##$TPNAME5= <>
##$TPNAME6= <>
##$TPNAME7= <>
##$TPOAL= (0..7)
0.5 0.5 0.5 0.5 0.5 0.5 0.5 0.5 
##$TPOFFS= (0..7)
0 0 0 0 0 0 0 0 
##$TUNHIN= 0
##$TUNHOUT= 0
##$TUNXOUT= 0
##$USERA1= <user>
##$USERA2= <user>
##$USERA3= <user>
##$USERA4= <user>
##$USERA5= <user>
##$V9= 5
##$VALIST= <valist>
##$VCLIST= <CCCCCCCCCCCCCCC>
##$VD= 0
##$VDLIST= <DDDDDDDDDDDDDDD>
##$VPLIST= <PPPPPPPPPPPPPPP>
##$VTLIST= <TTTTTTTTTTTTTTT>
##$WBST= 1024
##$WBSW= 4
##$XGAIN= (0..3)
0 0 0 0 
##$XL= 0
##$YL= 0
##$YMAX_a= 276478
##$YMIN_a= -195404
##$ZGOPTNS= <>
##$ZL1= 120
##$ZL2= 120
##$ZL3= 120
##$ZL4= 120
##$ABSF1= 16.522
##$ABSF2= -4.171173
##$ABSG= 5
##$ABSL= 3
##$ALPHA= 0
##$AQORDER= 0
##$ASSFAC= 0
##$ASSFACI= 0
##$ASSFACX= 0
##$ASSWID= 0
##$AUNMP= <proc_1d>
##$AZFE= 0.1
##$AZFW= 0.1
##$BCFW= 0
##$BC_mod= 0
##$BYTORDP= 0
##$COROFFS= 0
##$CY= 12.5
##$DATMOD= 1
##$DC= 0
##$DFILT= <>
##$DTYPP= 0
##$F1P= 14.0000005364418
##$F2P= -0.99999901652339
##$FCOR= 0.5
##$FTSIZE= 32768
##$FT_mod= 6
##$GAMMA= 0
##$GB= 0
##$INTBC= 1
##$INTSCL= 1
##$ISEN= 128
##$LB= 0.3
##$LEV0= 0
##$LPBIN= 0
##$MAXI= 10000
##$MC2= 0
##$MEAN= 0
##$ME_mod= 0
##$MI= 0
##$NCOEF= 0
##$NC_proc= -5
##$NLEV= 6
##$NOISF1= 0
##$NOISF2= 0
##$NSP= 0
##$NTH_PI= 0
##$NZP= 0
##$OFFSET= 16.522
##$PC= 1
##$PHC0= -48.5973
##$PHC1= 8.592744
##$PH_mod= 1
##$PKNL= yes
##$PPARMOD= 0
##$PSCAL= 4
##$PSIGN= 0
##$REVERSE= no
##$SF= 250.13
##$SI= 32768
##$SIGF1= 0
##$SIGF2= 0
##$SINO= 400
##$SIOLD= 32768
##$SREGLST= <1H.CDCl3>
##$SSB= 0
##$STSI= 32768
##$STSR= 0
##$SW_p= 5175.98343685301
##$SYMM= 0
##$S_DEV= 0
##$TDeff= 65536
##$TDoff= 0
##$TI= <Analysis number 999999
Compound Code 99
Book Reference 9
Project Code 9>
##$TILT= no
##$TM1= 0
##$TM2= 0
##$TOPLEV= 0
##$USERP1= <user>
##$USERP2= <user>
##$USERP3= <user>
##$USERP4= <user>
##$USERP5= <user>
##$WDW= 1
##$XDIM= 32768
##$YMAX_p= 416154953
##$YMIN_p= -747016
$$ End of Bruker specific parameters
$$ ---------------------------------
##NTUPLES= NMR SPECTRUM
##VAR_NAME=  FREQUENCY,     SPECTRUM/REAL,   SPECTRUM/IMAG
##SYMBOL=    X,             R,               I
##VAR_TYPE=  INDEPENDENT,   DEPENDENT,       DEPENDENT
##VAR_FORM=  AFFN,          ASDF,            ASDF
##VAR_DIM=   32768,         32768,           32768
##UNITS=     HZ,            ARBITRARY UNITS, ARBITRARY UNITS
##FACTOR=    0.157963299565203, 1,           1
##FIRST=     4132.6476996994, 0,             0
##LAST=      -1043.33573715361, 0,           0
##MIN=       -1043.33573715361, -747016,     0
##MAX=       4132.6476996994, 416154953,     0
$$ Real data points
##PAGE= N=1
##DATA TABLE= (X++(R..R)), XYDATA
$$ [...]
23282c22126N7111K44635k9107k3144k15K89174P5009j05271p4174m988j2393
23271I4511o6188j20869P1257P5356R3376J63183m8012j54428J7570Q6756K99
23260B12811j13982l8313k6882n5369J81351N9282k15309j27047J32771R4864
23250A04177n9427k8986k44649K4641J48100o7242j78543P4908K56181K35234
23240B64394P474j64536p2487l1929j42932Q1844J27552J20967j27707j39621
23230g6981r1576L9357J67012M9442j23232N9454J24647o62j8749m9357J884p4230
23218G009l8630j16218J55492K3345L5930j04797o0127n5840n1747J0834o0915
23207b55664M1285J62990J06388j37791j88184o8007o2826J31418k5551P2922
$$ plain form
23282 -322126 -265015 -20380 -49487 -72631 -72846 216328 291337 186066 111892 106904 94511
23271 94511 28323 -92546 -21289 54067 147443 310626 262614 108186 125756 212512 212811
23260 212811 98829 60516 33634 -21735 159616 218898 3589 -123458 9313 104177
23250 104177 44750 15764 -228885 -204244 -56144 -123386 -301929 -227021 29160 264394
23240 264394 271868 107332 34845 2916 -140016 -58172 69380 190347 62640 -76981
23230 -76981 -168557 -129200 37812 87254 -35978 23476 148123 147461 128712 79355 81239 7009
23218 7009 -31621 -147839 7653 30998 66928 -37869 -97996 -153836 -205583 -194749 -255664
23207 -255664 -214379 -51389 54999 -82792 -270976 -338983 -401809 -270391 -295942 -223020
23197b23020Q9317R4999M9774r6948L6579J07226M7902K0191K5655Q1861P2879
23186C06415k15707j83504L6930j5589k9630M1195J33481Q2887k34009n571J54054
23175G0952M4181j06338J4561q5024L0905k4968r870J10036l4906j54744o1721
23164b06936N3757J28220o8112k01120q338J20581K44893J31457j42839j5941
23154C5622J34698K8217k48159n8092J1410Q4169J16718K0099K7839j61323K5319
23143A6517J32691j9532j8361j03451n5047P2632J63587j43015j37762J87636
23133I5895J3285k0492J06250j19041k35238k0353J321J8395J45650j5020o3803
23122i3151J32456P8557j95005q3259O0954J27616M3960j437J50558m4418l984
$$ plain form
23197 -223020 -133703 -38704 11070 -85878 -49299 57927 105829 126020 151675 233536 306415
23186 306415 90708 -92796 -55866 -71455 -101085 -59890 73591 156478 -77531 -83102 70952
23175 70952 115133 8795 23356 -61668 -30763 -55731 -65601 44435 9529 -145215 -206936
23164 -206936 -153179 -24959 -93071 -294191 -302529 -181948 62945 194402 51563 35622
23154 35622 170320 198537 -49622 -107714 -96304 -12135 104583 124682 152521 -8802 16517
23143 16517 149208 129676 111315 7864 -47183 25449 189036 46021 -91741 95895
23133 95895 109180 88688 194938 75897 -159341 -179694 -178373 -159978 -14328 -29348 -93151
23122 -93151 39305 117862 -77143 -160402 -99448 28168 72128 70691 221249 176831 172847
23111A72847l9742p1999J02165R1471j93866j29764n8562K09996J39304J26053
23101C47903q4787j38179k10003l5294O3J63326J8692O947L4935j3938k16584
23090a26919p3787j43368R3645R9461O5020r6168o5929J19679R1019J30258j22602
23079b9691J41503J40121N8147N739k9999j99637J18017R9306j14999k0530q1824
23068H6153k56541p842J52573P0052j07940j18243n9188j17773p514p9030j16546
23057e61839J07067J83837O8976L2686j5095j39296J8369k02271Q5085J09538
23047c12943j2799M9438P284Q2775J24270J70653J29051j04112j22497j10285
23037i9165J21819o5544m8561M6135j15915j6285Q4129K6395J7875K8336r417
$$ plain form
23111 172847 133105 61106 163271 254742 60876 -68888 -127450 82546 221850 347903
23101 347903 263116 124937 -85066 -120360 -120297 43029 61721 68668 103603 89665 -126919
23090 -126919 -200706 -344074 -250429 -150968 -85948 -182116 -248045 -128366 -37347 92911 -29691
23079 -29691 111812 251933 310080 315819 285820 86183 204200 303506 188507 167977 86153
23068 86153 -170388 -178230 -25657 44395 -63545 -181788 -240976 -358749 -366263 -445293 -561839
23057 -561839 -454772 -270935 -201959 -169273 -184368 -323664 -305295 -507566 -422481 -312943
23047 -312943 -325742 -276304 -269020 -186245 -61975 108678 237729 133617 11120 -99165
23037 -99165 22654 -42890 -91451 -45316 -161231 -177516 -93387 -66992 -49117 -20781 -30198
23026c0198j64529K0625J51037J34918m3564m0466j4357n7648J10641J48842l9287
23015A76014j28458j01126J10113Q8019k245j15551j19174n8703o9332j00873
23005c21316O4182L3735k1264J01333J83209K6227R0065L792j8049O4836M8105
22994B54855p7465j12739m8425J36778J46686j87409m8130l2423K7292k41754
22984a82734j08731R5161o2929R8522N4797q9422J05013P6451j57233m8773k8593
22973b48471j6402Q6270M6781j36768O1369J92988R1463r0479L12L1279q8899
22962g0557r1723M0314N044J03411l5444P2141m3004o864J10671q6701r5054j09470
22950b07236k5312j6978J59063N1392R2008J8368j18589j0418N9739l6011P3999
$$ plain form
23026 -30198 -194727 -174102 -23065 111853 68289 27823 13466 -44182 66459 215301 176014
23015 176014 47556 -53570 56543 144562 142317 26766 -92408 -151111 -220443 -321316
23005 -321316 -257134 -223399 -244663 -143330 39879 66106 156171 159963 141914 206750 254855
22994 254855 177390 64651 16226 153004 299690 112281 64151 31728 59020 -182734
22984 -182734 -291465 -196304 -259233 -160711 -105914 -195336 -90323 -13872 -171105 -219878 -248471
22973 -248471 -264873 -178603 -131822 -268590 -207221 -14233 77230 -13249 -12937 18342 -70557
22962 -70557 -162280 -121966 -116922 -13511 -48955 23186 -19818 -26682 83989 -2712 -97766 -207236
22950 -207236 -232548 -249526 -90463 -39071 52937 71305 -47284 -57702 2037 -33974 40025
22939D0025K20595J8574p4994k14324k9609m6891r9179M419L2175O6846J24309
22928D1946Q861q2785N2428O6676j00214q2960q9152j4286o1767K6621J56869
22917g7763R2314k3639R994N0172R2756l1500j18069K1050J9189m6843M585q9139
22905i6893o9996o222o1198j33521P0294N6979J92018J0609J27903J31666n2446
22894A69193j61331n1066p885O7479J5686R5828r2401l8142k02702j21680J48303
22883a78718J07417k0724m4241J47234m7465r9387n6498n0641J23435K4676L5588
22872e9324J53110J32047M4877P5537N6869k3500J12606m4634j40836k91093j88145
22861a72486o6702o3200q218m7438R8741J16690m4007q2512N2966J25973Q1389
$$ plain form
22939 40025 260620 279194 204200 -10124 -39733 -86624 -185803 -181384 -149209 -82363 41946
22928 41946 50807 -31978 20450 87126 -13088 -96048 -185200 -199486 -261253 -234632 -77763
22917 -77763 14551 -9088 906 51078 143834 112334 -5735 15315 34504 -12339 -7754 -96893
22905 -96893 -166889 -173111 -234309 -367830 -297536 -240557 -48539 -37930 89973 221639 169193
22894 169193 7862 -43204 -51089 16390 32076 127904 35503 -2639 -205341 -327021 -178718
22883 -178718 -71301 -92025 -136266 10968 -36497 -135884 -192382 -243023 -119588 -94912 -59324
22872 -59324 93786 225833 270710 346247 403116 379616 492222 447588 306752 15659 -172486
22861 -172486 -239188 -302388 -310606 -358044 -259303 -142613 -186620 -269132 -216166 -90193 -8804
22850h804J53413O0539J32602j6104q3547j16690n7734j25350P8722j11822p6050
22839a70825O1286M9686K10079N0445j34910J2965j57162j25935q2909P9415M8795
22828a59070l003N6944N5285k3067N1223O4043J02265J5967j22101j53982O0405
22817e5091J43116n4771o8406N502o9112L9233J2569J48970J2649m9078n4082
22806A1499m703j51910k12528n4405j7984J89792J0570N8252J10375J15322J84541
22795B38821J26860p2252p3044n0386q5241L9189N7699k6084j43981j31661O0515
22784e9565J9743o8851j32137q5575p1326n0440J08325K9988J59553J4126j4583
22773a50742P9505M4689j65458q9771m953J20636J25034j499K3680K3307K9195
$$ plain form
22850 -8804 144609 205148 337750 321646 238099 121409 63675 -61675 17047 -94775 -170825
22839 -170825 -109539 -59853 150226 200671 65761 78726 -78436 -204371 -287280 -207865 -159070
22828 -159070 -162073 -105129 -49844 -72911 -21688 42355 144620 160587 38486 -115496 -55091
22817 -55091 88025 33254 -35152 -29650 -98762 -59529 -46960 102010 114659 65581 11499
22806 11499 6796 -145114 -357642 -412047 -430031 -240239 -229669 -171417 -61042 54280 238821
22795 238821 365681 293429 220385 169999 84758 123947 181646 155562 11581 -120080 -59565
22784 -59565 -39822 -108673 -240810 -326385 -397711 -448151 -339826 -309838 -150285 -136159 -150742
22773 -150742 -71237 -26548 -192006 -281777 -286730 -166094 -41060 -42559 -18879 4428 33623
22762C3623o9101L7032p5996M8599K1427L5096K3327r4067q4513M6412N2272J6120
22750i769j38074K1192J58261Q4878m617j55678J0413K30444J14019r087n2068
22739B49914j57866o0269M217m9774J03618M3243p9985j87565j4712J89598K2811
22728F3230M1239n0378p1567p5821r2724j4968o6296R9054J82274k0613L8208
22717C1638j20374j32024j8472N7369N977J9866m4833p3614k6480o9523m2907
22706d13377L7329K26630K18063K4481r3799j51250M7571J86004N0451N0040K5210
22695B07353j35785q6406K83710Q6361q2927k2229p1354O570o6331j7225m7424
22684E4313m7619j84447j01347J35267O0296O9963O4862N0856N6385j05683k02537
$$ plain form
22762 33623 -35478 1554 -74442 -25843 -4416 30680 54007 -40060 -124573 -78161 -25889 -9769
22750 -9769 -147843 -126651 31610 116488 111871 -43807 -33394 197050 311069 301982 249914
22739 249914 92048 31779 35996 -13778 89840 133083 53098 -134467 -149179 40419 63230
22728 63230 104469 54091 -17476 -93297 -186021 -200989 -267285 -168231 14043 -6570 31638
22717 31638 -88736 -220760 -239232 -181863 -175886 -156020 -200853 -274467 -300947 -370470 -413377
22706 -413377 -376048 -149418 68645 93126 -673 -151923 -104352 81652 132103 182143 207353
22695 207353 71568 -14838 268872 355233 272306 250077 178723 185293 118962 101737 54313
22684 54313 6694 -177753 -279100 -143833 -83537 -13574 51288 102144 158529 52846 -149691
22673a49691P3297J30712M9102O3104o3832K3267J55336J85530R7291j13735j20019
22662C30362l7123j77115k14862J5425K52619o333j45943l3832j27738J14006
22652c0534J64263j08253j59630Q8118J46331m8644m7357M095j7069K5883M009
22641B1212m4009m3028q3794O0579q5224P0421L8341n7806j34395p6576N9940
22630b74339L31n2311J57097K51109O7764q0643j60535k13509l195J18497P7761
22619a11973J74242J67609j55497k16794J90731K60179r4116k16410n2868O4911
22609A0014j56082j45151j7756L7094K21921J99634j4918j36802k8470J828M5455
22598A6767J3551o9080l9296J19538J9790N2923m7859q6972O8108N599m6879p599
$$ plain form
22673 -149691 -76394 54318 103420 166524 102692 125959 281295 466825 564116 450381 330362
22662 330362 293239 116124 -98738 -83313 169306 162973 17030 -16802 -144540 -30534
22652 -30534 133729 25476 -134154 -46036 100295 51651 4294 8389 -8680 17203 21212
22641 21212 -22797 -65825 -149619 -89040 -174264 -103843 -65502 -123308 -257703 -334279 -274339
22630 -274339 -274008 -326319 -169222 81887 149651 69008 -91527 -305036 -308231 -189734 -111973
22619 -111973 62269 229878 74381 -142413 48318 308497 214381 -2029 -54897 10014
22609 10014 -146068 -291219 -308975 -271881 -49960 149674 134756 -2046 -30516 -28688 16767
22598 16767 30318 -38762 -78058 41480 61270 114193 66334 -20638 47470 53069 6190 -1409
22586a409M7663J09286j61483p7953J09658J06629J5060k0982j49146M0544J45784
22575A63651J12917m2409j03236j14037J4349P104j38987K693O14j3191O3642
22564d6890J10000o3182J27411J1792q6162j96466Q4086O110P0177O1675m4581
22553C3970m0709l2963r5921J3059N8749O6833r1138j48851K3900K89747J32796
22542B09472j01957n7224j56150p0289R6148P1894J00137o5119q766N3040J7371
22531H8557j27576N85J07755Q7193L8446o8915j46174q2825n5056M7562k1875
22520a32323r3703M1840r0731J12311J45206k5924j20113j3201N7822p928l07790
22509d34534j46100R3075K35741N6357m6899l7301J30264R4638l0198j1580J7950
$$ plain form
22586 -1409 46254 155540 -5943 -83896 25762 132391 147451 126469 -22677 17867 163651
22575 163651 276568 234159 130923 16886 31235 38339 -100648 -97955 -97341 -110532 -46890
22564 -46890 63110 -72 127339 139131 52969 -143497 -59411 -53301 16876 78551 33970
22553 33970 -6739 -39702 -135623 -122564 -63815 3018 -88120 -236971 -213071 76676 209472
22542 209472 107515 50291 -105859 -176148 -80000 -8106 92031 26912 18146 71186 88557
22531 88557 -39019 -38434 69321 156514 194960 126045 -20129 -102954 -158010 -110448 -132323
22520 -132323 -226026 -184186 -274917 -162606 -17400 -43324 -163437 -176638 -118816 -126744 -434534
22509 -434534 -580634 -487559 -251818 -195461 -242360 -279661 -149397 -54759 -84957 -96537 -78587
22498g8587l4148J70963J04593J854p9610m9884q3438k39401o5535N6791O2644
22487b33758j2594J28480O3250J28234Q2725j07143j29892n9062P1217M0818J24593
22476I6868p2483J7695m6563j20971N6105P3396P3611j19428o8143J53074J12233
22465A55394p0973k1807n6091K8264M6898J6207l03932r0893J80146J53805k4656
22454A2362j30024j02378r8593m8165O3462J32528o1941q9166J0360J20140q9265
22443b80680j72461P8460J4465J68954J93678o4403n1749P6617O5842o9452j9554
22432f0283K8158j25794K806J26309j34987p3237J6373r9118Q464m8963O3672
22421b96600J25031J44520j50036o3703o9037J10421J01021j4205j71809j04950
$$ plain form
22498 -78587 -112735 58228 162821 164675 85065 35181 -48257 -287658 -353193 -296402 -233758
22487 -233758 -246352 -117872 -54622 73612 156337 49194 -80698 -139760 -68543 -27725 96868
22476 96868 24385 42080 -4483 -125454 -69349 4047 77658 -41770 -109913 43161 155394
22465 155394 84421 62614 6523 34787 81685 97892 -206040 -296933 -116787 37018 12362
22454 12362 -117662 -220040 -318633 -366798 -303336 -170808 -232749 -321915 -311555 -191415 -280680
22443 -280680 -453141 -374681 -360216 -191262 2416 -61987 -113736 -37119 28723 -40729 -60283
22432 -60283 -32125 -157919 -155113 -28804 -163791 -237028 -220655 -319773 -311309 -360272 -296600
22421 -296600 -171569 -27049 -177085 -240788 -309825 -199404 -98383 -112588 -284397 -389347
22411c89347N7837M9217M9767L7997J72126J46984L6461o7581Q2245j59191r0507
22400g3992n1541n6807p8968o1674J40607J51375o1731O1590K06777O0384j30044
22389A05976l0869o2464j55879k0743R3421j8921J24029J12345P4351o6019j37468
22378A7759p2639J95737m7606j73065m6366L5012l5475Q8341J66827L4881j28937
22367C4469P0524l0351o0454j4892o8972o0546l3292q4194n1776J3073L7154K97000
22355D7743J50181o8237K9027j32428j19549P8523K40215j4746m3304j22464l33528
22344b88567j30514J08470O9518M7068P7853N4176j6845R1565O1452J24525j19417
22333G9284k80788L6452J68727N6102J46539k24583o8131J82821J28682j85319
$$ plain form
22411 -389347 -331510 -282293 -232526 -194529 -22403 124581 161042 93461 175706 16515 -73992
22400 -73992 -125533 -182340 -261308 -322982 -182375 -31000 -92731 -31141 175636 236020 105976
22389 105976 75107 12643 -143236 -163979 -70558 -89479 34550 146895 221246 155227 17759
22378 17759 -54880 140857 93251 -79814 -126180 -91168 -126643 -38302 128525 163406 34469
22367 34469 104993 74642 14188 -704 -69676 -130222 -163514 -247708 -299484 -286411 -249257 47743
22355 47743 197924 129687 158714 26286 -93263 -14740 225475 210729 167425 44961 -288567
22344 -288567 -419081 -310611 -241093 -194025 -116172 -61996 -78841 12724 74176 198701 79284
22333 79284 -201504 -165052 3675 59777 206316 -18267 -86398 96423 225105 39786
22323C9786n765N7158R3187j8212j18386J32284M1997J2758o9539p9807j14262
22312b8801m8785J08205m5613J1210k998j10278k4419J12776Q1545k6826r7181
22301g1165l1178p0506n5341p4682J03380J51289j6790N0191q2814O3461l1203
22290f5358n0838K8555N4961o0317R9243k10650L6906L9112J30440j07941J4859
22279i1028Q8438R6987k6996k4944K6834j51703N2519J44741N0546j11475k24713
22268a70794M3272J95654j3865o1803O887L9414J1585n1270k1153O8166J94651
22257B40744J00499r7395j05384r4043p3895j7222N9551R7002j2561n105O3416
22246A55607Q2748p4874o2794M0916P54R66q7314j70010K3803L4070Q5344M5384
$$ plain form
22323 39786 34021 91179 184366 166154 47768 180052 222049 234807 165268 85461 -28801
22312 -28801 -77586 30619 -14994 -3784 -6782 -117060 -141479 -28703 52842 26016 -71165
22301 -71165 -102343 -172849 -228190 -302872 -199492 -48203 -64993 -14802 -97616 -34155 -65358
22290 -65358 -116196 -87641 -32680 -92997 6246 -204404 -167498 -128386 2054 -105887 -91028
22279 -91028 -2590 94397 67401 42457 69291 -82412 -29893 114848 165394 53919 -170794
22268 -170794 -127522 68132 54267 -7536 -649 38765 50350 -920 -22073 46093 240744
22257 240744 341243 243848 138464 44421 -29474 -46696 12855 109857 97296 92191 155607
22246 155607 238355 163481 100687 141603 142357 143323 56009 -114001 -90198 -56128 29216 74600
22234G4600n3108j62770J01692P07o8230J54963J09301N0275n6698O194k5136
22223A31790M2320j24542k44043p2269P5698j6797p3730L0324J14978K549K01577
22212F7855P5341q9100j03541L361M445K53004k7377j33313j26522j24982J9053
22201a81776N6153l9392o5143K10173O7661m4717o381j62951L8237L6283r362
22190a01215N499M1295L8968m4040n368j14926j49298l849K80772J36433Q6636
22179A70907k3699n7550j2017j04135k10179K0317K0142J58114K5624N9137J25269
22168A71930o5006j16815j0596l6168Q1483j64327k7660K13881K1866P9055o2923
22157H4720m4225o969r9690p8190M5149O0576m1164p6877j17406R77Q1494L27340
$$ plain form
22234 74600 21492 -141278 -39586 -38879 -107109 47854 157155 207430 150732 156926 131790
22223 131790 174110 49568 -194475 -266744 -191046 -207843 -281573 -251249 -136271 -133722 67855
22212 67855 143196 54096 -49445 -46084 -41639 211365 183988 50675 -75847 -200829 -181776
22201 -181776 -125623 -165015 -230158 -19985 47676 2959 -3422 -166373 -128136 -91853 -101215
22190 -101215 -95716 -54421 -15453 -59493 -64861 -179787 -329085 -332934 -52162 84271 170907
22179 170907 147208 89658 77641 -26494 -236673 -216356 -196214 -38100 -12476 46661 171930
22168 171930 106924 -9891 -20487 -56655 24828 -139499 -167159 46722 68588 147643 84720
22157 84720 40495 33526 -66164 -144354 -99205 -38629 -79793 -156670 -274076 -273099 -191605 135735
22145A35735K5892k44475P9556K28756j56060q1416J87565Q1131o3534o8115o2694
22134F2341l15805R9124J72648N7865q0011j12497L0953N7825j44678k30879R5059
22123c08055R4233J21896K7889J9848k9144J0585j21332j095j5107N0483R0151
22112e9648K7579K6390J44201L0500r2564L3932k1581j2465P268J7238j02148
22101a298j21768M7845L684Q5590K3288l6028j84280m356K32148o1602j43932
22090a60709J06818q2259K02571J70534L878j01185q6490j36514J5647j43438
22080b11147l976J22788L6138J04189j72253q3128Q3817l813J4353M9990K7559
22069c5483r2433N6373R7089R9720m2636m7926M6923m1556k00994M6828j2589
$$ plain form
22145 135735 161627 -82848 -3292 225464 69404 -12012 175553 256684 193150 125035 62341
22134 62341 -253464 -154340 18308 76173 -3838 -116335 -85382 -27557 -172235 -403114 -308055
22123 -308055 -213822 -91926 -64037 -44189 -73333 -62748 -184080 -185175 -200282 -149799 -59648
22112 -59648 -32069 -5679 138522 169022 76458 110390 88809 76344 83612 100850 -1298
22101 -1298 -123066 -75221 -71537 14053 37341 1313 -182967 -187323 44825 -16777 -160709
22090 -160709 -53891 -136150 66421 236955 240833 139648 53158 -83356 -67709 -211147
22080 -211147 -215123 -92335 -56197 47992 -124261 -207389 -123572 -127385 -113032 -63042 -35483
22069 -35483 -127916 -71543 25546 125266 82630 34704 81627 40071 -160923 -114095 -126684
22058a26684J3771j0467o1728l8909N6579J45145O2963K3492l9483M458r1054
22047f1917j79888K1800J3836L8176Q3320N0023R7490Q624J0398O9602p4491O921
22035H3894J26423K1476r088q9206N7472k8541n1626M0990j34418K4356j62107
22024a20375j30699p4801J87272J79761n1431r5431j13887J59572K3878M0639
22014D498k2580j44801r8089K8206N308O3493J1663j60751J51005J89000O9465
22003I6417J0141l0812p1514J4214k916l5075j24850M7021K18178j4493j13559
21992g248j07812p6585J9496R4085m9988N4792N7618j40095k8129J36890J43020
21981I6044R6561K2216j7227o679q8558j19571j24669J05568L1760j2380N2389
$$ plain form
22058 -126684 -112913 -123380 -185108 -224017 -167438 -22293 40670 64162 24679 29137 -61917
22047 -61917 -241805 -220005 -206169 -167993 -84673 -34650 62840 71464 81862 151464 76973 83894
22035 83894 210317 231793 222705 133499 190971 162430 110804 151794 17376 41732 -120375
22024 -120375 -251074 -325875 -138603 41158 -10273 -105704 -219591 -60019 -36141 4498
22014 4498 -18082 -162883 -260972 -232766 -227458 -163965 -152302 -313053 -162048 26952 96417
22003 96417 106558 75746 4232 18446 15530 -19545 -144395 -97374 120804 106311 -7248
21992 -7248 -115060 -191645 -172149 -78064 -128052 -73260 -15642 -155737 -183866 -46976 96044
21981 96044 192605 214821 197594 190915 102357 -17214 -141883 -36315 -4555 -16935 35454
21970C5454N1201m9679j82309j68225J9913J4219m1443J10913N7349Q8443K9983
21959c4181k2364j27648L310m8973K27115K10933R4575r1635j25072p4143l6709
21948b4792L1969j7271L8063Q4642O5682j35638M6215O2878L2583Q9319n5906
21937B17744j31959p5481J453n7645N3745r547p8005l7928l9580J06447J31068
21926H0312r1115j23044M1899M7031J11648j3213j78646K0979Q6255L739k8716
21915d2871N7576m8134j56126r7754j42800o2187K07236J27195M1462n0840k25787
21904c93030l9524R9932P5229J49163R0107K9027j24115K0897N2773n2244j07400
21893a99185n0422J67536j12003q6478K15346J41727M9707p911j65203j31909
$$ plain form
21970 35454 86655 36976 -145333 -313558 -293645 -279426 -320869 -209956 -152607 -64164 -34181
21959 -34181 -56545 -184193 -180883 -229856 -2741 208192 302767 211132 86060 11917 -24792
21948 -24792 7177 -10094 27969 112611 178293 42655 88870 151748 184331 273650 217744
21937 217744 85785 10304 11757 -45888 7857 -1690 -79695 -117623 -157203 -50756 80312
21926 80312 -10803 -133847 -91948 -44917 66731 53518 -125128 -104149 -17894 -14155 -42871
21915 -42871 14705 -33429 -189555 -287309 -430109 -492296 -285060 -157865 -116403 -167243 -393030
21904 -393030 -432554 -332622 -257393 -108230 -18123 10904 -113211 -92314 -39541 -91785 -199185
21893 -199185 -249607 -82071 -194074 -280552 -65206 76521 126228 118317 -46886 -178795
21883a78795n7289K5722J5510j9694j41414J07993J94827p352O4549k0466j28205
21872a44614j3490J40906L0032j01983J5242J2003j14242k62560m7907J00355
21862c86258J57825k7031q3906J34482N8328Q4369P09j77512J791J06986O3735
21851f6482N3091J1846J01315j01777k16534N1301J93405J24640j18851k5036
21841F918j81478k10428N0062R1093J21166J676J32963k7992j07141j00773k7773
21830b51707J01991P8169r674j66569n6890J32540R5828M0218J8782r6220N1155
21819f2377R2607j35851m0069K0149r8979L675o7381J10129L0843K31698J48357
21808B32801j53431j66333J2587K42242Q5348k09932j24249K45383J25618j23322
$$ plain form
21883 -178795 -236084 -210362 -194852 -214546 -355960 -247967 -53140 -60492 4057 -16409 -144614
21872 -144614 -158104 -17198 12834 -89149 -73907 -61904 -176146 -438706 -486613 -386258
21862 -386258 -228433 -255464 -339370 -204888 -146560 -62191 -61482 -238994 -237203 -130217 -66482
21851 -66482 -13391 -1545 99770 -2007 -218541 -167240 26165 150805 31954 6918
21841 6918 -174560 -384988 -334926 -243833 -122667 -120991 11972 -16020 -123161 -223934 -251707
21830 -251707 -149716 -71547 -81221 -247790 -304680 -172140 -76312 -36094 -17312 -113532 -62377
21819 -62377 30230 -105621 -145690 -125541 -224520 -220845 -288226 -178097 -147254 84444 232801
21808 232801 79370 -86963 -74376 167866 253214 43282 -80967 164416 290034 166712
21798A66712k07608l2538m5556J5727N031K2393r3469K01439N2855j63618p7824
21787a56456j88152j07220J51335J02178O7979J66170K2440p2763j39042r978
21777a63509Q8932J33497l9613M5960m0880k10358q4367J24072L14357R9357j41944
21766A25504k14483j87000J02902K01489O2320j51695M4916J18431m0566m9239
21756A2579q3099m5275K08182R0359P2271l8630q6703p2393Q5431O732j28125
21745B1329J63303k8851m7713q4455k05576J05255o8761K351K55721J6284j91186
21734f2299m5696K33670N3763K7496j42984j31960Q7189L346j31513P0220q316
21723d7084Q1488M3446J43355j79013j3239j43596j16326L8782R4020l409J65172
$$ plain form
21798 166712 -40896 -73434 -118990 -103263 -98232 -75839 -169308 32131 84986 -78632 -156456
21787 -156456 -344608 -451828 -300493 -198315 -130336 35834 58274 -14489 -153531 -163509
21777 -163509 -74577 58920 19307 65267 24387 -185971 -270338 -146266 168091 267448 125504
21766 125504 -88979 -275979 -173077 28412 90732 -60963 -16047 102384 61818 12579
21756 12579 -70520 -115795 92387 182746 255017 216387 129684 57291 142722 149454 21329
21745 21329 184632 155781 108068 23613 -181963 -76708 -145469 -143118 112603 128887 -62299
21734 -62299 -107995 125675 179438 206934 63950 -68010 19179 22525 -108988 -38768 -47084
21723 -47084 34404 77850 221205 42192 28953 -114643 -230969 -192187 -98167 -101576 63596
21712F3596O3229j19989o3638r0083O7836O5206o8940Q940J84562P544m871j93632
21700h0240K7883J76069k9931p2312j01380J51878j08988R4921K14688J82815
21690D55403j80386j66765r8843k1779m0456O7527N8441n0685j73208r8785o4546
21679c14082R8426K8670J33447J45022k5743K3433O7604q0199o9866Q1513K46122
21668C34347r6899j35499r0018Q3334N6884n5786l5098r3377J21223J58317p9696
21657A67732o9830J49774J37675n9471j54389j80404n1715j81128L2298J47529
21647f1929O6795r461o6671k2976R3032Q9169k055j6502N3605M0091N0919m7186
21635A66831j36252O175J22035p3139m4937m1644J39049n5495j24732O4161k2331
$$ plain form
21712 63596 126825 6836 -56802 -146885 -79049 -13843 -82783 -73843 110719 118263 113392 -80240
21700 -80240 -52357 123712 93781 21469 -79911 71967 -37021 57900 272588 455403
21690 455403 275017 108252 9409 -12370 -52826 14701 73142 22457 -150751 -249536 -314082
21679 -314082 -215656 -186986 -53539 91483 65740 89173 156777 76578 6712 88225 334347
21668 334347 237448 101949 11931 95265 152149 96363 61265 -32112 89111 247428 167732
21657 167732 97902 247676 385351 325880 171491 -8913 -60628 -241756 -209458 -61929
21647 -61929 4866 -4595 -71266 -94242 -1210 87959 85904 69402 123007 163098 214017 166831
21635 166831 30579 36754 158789 85650 40713 -931 138118 82623 -42109 22052 -279
21624b79j05834K079P8944J198R8807R2408M6375M6130J25297j9857k91176j26156
21612e2064J99073j21786k02582K2450M8697k2310r9589k4470J22783J41766m0973
21601b9005j28430J66626j2395k7759q3932P8146m601K1885j17653L598J26327
21590g193K03538N3403N8488j91073m3336J45897P2737Q5008o0200j95657k67763
21579a46151P8202K69710o7299r6636J95887l4263n3644k3323o4521j17758j13346
21568a73142M9561J16780q2888j1692R9541M3869L0512j50695K9743k0134k5795
21557i4340j79858l5539Q3812M3034n2515j06786O0065J70721k9672j6169L8174
21546a19073j092r8252j03213J32351L987j30018N1860R2187R159N9529P7487
$$ plain form
21624 -279 -106113 -104034 -25090 -23892 74915 167323 213698 259828 385125 365268 74092 -52064
21612 -52064 147009 25223 -177359 -154909 -106212 -128522 -228111 -252581 -129798 11968 -29005
21601 -29005 -157435 9191 -3204 -30963 -114895 -36749 -41350 -19465 -137118 -133520 -7193
21590 -7193 196345 249748 308236 117163 73827 219724 292461 377469 317269 121612 -146151
21579 -146151 -67949 201761 134462 37826 233713 199450 145806 122483 57962 -59796 -173142
21568 -173142 -123581 -6801 -89689 -101381 -1840 42029 72541 -78154 -48411 -68545 -94340
21557 -94340 -274198 -309737 -225925 -182891 -235406 -342192 -282127 -111406 -141078 -157247 -119073
21546 -119073 -120165 -218417 -321630 -189279 -185292 -315310 -263450 -171263 -162104 -102575 -25088
21535b5088R5784N4568m471j0073o4052j28009K08130K66928j22643k01493j9980
21524D9601j22811r7425L4773j55570K6915J28782J95805O4483O853o5963L1528
21513I6971j91213l941J43730r3864j46902P5185M3886Q615M9657M4516r2009
21502f5369j35399O6265L346j33699j2102Q6531J29444j2856J31826j36578k5065
21491a03656q7193j97555l6691J17155Q0918j6364l1327L9364J78484J17296j7532
21480D2899j58345q1837Q6231R883M8635k4762k129N6234l5920L0891j08270j07209
21468b43699R6107O6785J77609j3076K1302j88459n9215J53924M7502O1559p4731
21457D5608j28568r7630L3682O2865Q8349j04355j65058L0007O8559R9965J10516
$$ plain form
21535 -25088 70696 125264 120793 110720 46668 -81341 126789 393717 271074 69581 49601
21524 49601 -73210 -170635 -135862 -291432 -264517 -135735 60070 124553 131406 65443 96971
21513 96971 -94242 -98183 45547 -48317 -195219 -120034 -76148 -67533 -17876 26640 -65369
21502 -65369 -200768 -134503 -131157 -264856 -276958 -190427 -60983 -73839 57987 -78591 -103656
21491 -103656 -190849 -388404 -425095 -307940 -227022 -243386 -274713 -235349 -56865 60431 42899
21480 42899 -115446 -197283 -111052 -101169 -52534 -77296 -79425 -23191 -59111 -28220 -136490 -243699
21468 -243699 -147592 -80807 96802 83726 105028 -83431 -142646 11278 58780 120339 45608
21457 45608 -82960 -180590 -146908 -84043 4306 -100049 -265107 -235100 -166541 -66576 43940
21446D3940K13409J29758l12700j15339N1963J47582M3319K2706m4137j30651
21436D9850Q865j28689P1814j2969l2985J234n7954m3316M5282J73403P6627K4790
21424A75952j4111n9067L704P5253L1633r0906l0487O5095K986k0267k78063k06768
21412c45046K37104J12672K8996P4024o6867p6295L1211M5137M704j8420j75874
21401a48654K1144n7934n117J27453j37695j06904J0152R5554o447J51319L8253
21390a8876r386J87183j1637k08989j59666j10307J89720J06234m9450J26751
21380D1577J70727j42442j52785m9154J22062N6599N412J63759k858R1218o2951
21369B41164j8314P204K5700k03154p6583m5777m5150j2795K582J25723P6686
$$ plain form
21446 43940 257349 387107 74407 -40932 11031 158613 201932 224638 180501 49850
21436 49850 58715 -69974 1840 -11129 -44114 -42880 -100834 -144150 -98868 74535 151162 175952
21424 175952 161841 102774 106478 181731 213364 122458 91971 157066 160052 139785 -138278 -345046
21412 -345046 -107942 4730 33726 107750 40883 -35412 -4201 40936 45640 27220 -148654
21401 -148654 -127510 -185444 -190561 -63108 -200803 -307707 -297555 -202001 -208448 -57129 -18876
21390 -18876 -28262 158921 147284 -61705 -221371 -331678 -141958 -35724 -85174 41577
21380 41577 212304 69862 -82923 -132077 -10015 46584 51996 215755 212897 304115 241164
21369 241164 222850 230054 255754 52600 -23983 -69760 -114910 -127705 -125123 600 77286
21358G7286j18591M8694P6763m8252K0572o5127L4977Q1188n2299k5034l6552
21347f375M3812j67577k4479O145j6242q0381j92478M1867J10934O3551J48194
21336g3029J24647r6186j33334M6268n5488q5633n7577q078O1763J47214M2852
21325h6581M6719J51493j70799N0521K3339j7828k388N579Q0630j73308P6634
21314a5989k0055j32212r1423J92617l9050j3799o7924q1422M4444n8896N4099
21303b29610J42058q5826k7079J72495L6637Q1061Q0755L4357m5347j03786k47061
21292a91346K3567J84175j6111j22566m4550P9432K29605L0728o6971l3624J6542
21281H8881l6879N2587k02565m2145J20315r4727k8986r8431p302L6419O7983
$$ plain form
21358 77286 -41305 7389 84152 35900 56472 -8655 26322 107510 55211 30177 -6375
21347 -6375 37437 -130140 -154619 -148474 -164716 -245097 -437575 -395708 -284774 -221223 -73029
21336 -73029 51618 -44568 -177902 -131634 -187122 -272755 -330332 -338410 -276647 -129433 -86581
21325 -86581 -39862 111631 -59168 -8647 14692 -3136 -5524 55 80685 -92623 -15989
21314 -15989 -36044 -168256 -259679 -67062 -106112 -119911 -187835 -269257 -224813 -283709 -229610
21303 -229610 -87552 -173378 -200457 -27962 8675 89736 170491 204848 159501 55715 -191346
21292 -191346 -167779 16396 285 -122281 -166831 -87399 142206 172934 105963 72339 88881
21281 88881 52002 104589 -97976 -140121 -19806 -114533 -143519 -241950 -249252 -212833 -144850
21270a44850R4012r6845j33971O7629L3203K6389k9467l5843N0187J03377P3625
21259G446r4814Q22N0870L40817K5730J07727n1734k62074j20285L3638J29016
21248A67159j33864k11822m6188J25224K9523l1250J22448J79518k8946k08623
21238c6821k10362J3921O3730J34360j46021o1093L06928L1098j62922N946L2809
21227b8427M7597J15667k03615n9758J01051o9544k39867k8920J70999Q0875J82213
21216F8271j69879n7693K75988J66371j84447j96171R8905q7771j23679Q5085
21206a25020L7231J3691j69983r2753M9936O2381J08029J32356Q8143L2903o7658
21195F9256j43085k149R8541J80082j70702K64J10302m7599j6026m7556j78704
$$ plain form
21270 -144850 -50838 -147683 -281654 -214025 -180822 -154433 -183900 -219743 -169556 -66179 7446
21259 7446 -87368 -86546 -35676 305141 330871 438598 386864 124790 4505 38143 167159
21248 167159 33295 -178527 -224715 -99491 -69968 -101218 21230 200748 171802 -36821
21238 -36821 -247183 -233262 -169532 -35172 -181193 -242286 64642 95740 -67182 -61236 -28427
21227 -28427 19170 134837 -68778 -128536 -27485 -97029 -336896 -365816 -194817 -113942 68271
21216 68271 -101608 -159301 116687 283058 98611 -97560 1345 -86426 -210105 -125020
21206 -125020 -87789 -74098 -244081 -336834 -286898 -224517 -116488 15868 104011 136914 69256
21195 69256 -73829 -75978 22563 202645 31943 32207 142509 94910 78884 31328 -147376
21184a47376k182J32048o7660j72539j44225o949J21782P7742l5152O3361J19419
21173f1731p6446K6322J17353o845j60198j41682J59675N2057k0769J08684M2899
21162C9319j73594K5620P3543Q7199P0765R4424l5845j19310k2759j42835j41367
21151b44840R7344J50807R6188q6161m2063o6927k8174r3508K2564M2224M1963
21140a10583J16742J1629P6780O1408j44511j32901o1347K01040J7938o0847j38832
21129a63484j81012l2350P9981Q0451M4098k7863O0695J84920J48050Q421j47764
21118E4143m5500J42718J11460j66655j52208j6793L5141L7356O657j0865j49837
21107a54383J03336J46398L561r5973j15287J83784K08933j55986J2292p3572
$$ plain form
21184 -147376 -149558 -17510 -85170 -257709 -401934 -408883 -287101 -209359 -244511 -181150 -61731
21173 -61731 -138177 -111855 5498 -1347 -161545 -303227 -143552 -91495 -112264 -3580 39319
21162 39319 -134275 -108655 -35112 52087 122852 217276 181431 62121 39362 -103473 -244840
21151 -244840 -147496 3311 99499 13338 -28725 -95652 -123826 -217334 -194770 -152546 -110583
21140 -110583 6159 17788 94568 155976 11465 -121436 -182783 18257 36195 -24652 -163484
21129 -163484 -344496 -376846 -296865 -216414 -172316 -200179 -139484 45436 193486 201907 54143
21118 54143 8643 151361 262821 96166 -56042 -72835 -37694 -338 6319 -4546 -154383
21107 -154383 -51047 95351 98912 2939 -112348 71436 280369 124383 136675 63103
21097F3103Q9643P8387j82187o0841j2991j14710r0760N1419j968P0531l3728
21086a44102n0316O0308l6138n5939n6562Q0813L7633j46574O5088J05314J19319
21075b1156r702Q1827K9718j56715N2168J6903j16100k6079J6556K4388J59373
21064E1181M7624O8872j25042j00865M5269l0382J0936J56474O3841k54757n2698
21053a19547P7552j93234o1864J69834J02337k51460K8658J09947J53837K1673
21043C7733n0768p2121j24833p652P2025J37081P253J82872N34j89478j4586k04847
21031b26787o1220L8608M9289O6536J04498p2330j01841l8679M1605L1893R1478
21020g6950K3075M937k72992p1398J55490J10287R4145L0167n3004r8675j08723
$$ plain form
21097 63103 152746 231133 48946 -11895 -24886 -139596 -230356 -178937 -180905 -110374 -144102
21086 -144102 -194418 -134110 -170248 -226187 -282749 -201936 -164303 -310877 -245789 -140475 -21156
21075 -21156 -30858 50969 80687 -76028 -23860 -6957 -123057 -149136 -132580 -108192 51181
21064 51181 98805 167677 42635 -58230 -12961 -43343 -32407 124067 187908 -66849 -119547
21053 -119547 -41995 -235229 -297093 -127259 -24922 -276382 -247724 -137777 16060 37733
21043 37733 -13035 -85156 -209989 -217641 -145616 -8535 -1282 181590 182124 -7354 -21940 -226787
21031 -226787 -288007 -249399 -200110 -133574 -29076 -101406 -203247 -241926 -200321 -168428 -76950
21020 -76950 -53875 -48938 -321930 -393328 -237838 -127551 -33406 -3239 -56243 -154918 -263641
21009b63641J02091M8602l7280j04420J44165m8353k10117n2142J10492J03158
20999b07445Q6977N6029J90852P1437k15101j81332j2256J43660L1500j36409
20989a72088j04594P7128K16497J85439j66663r2452p1131L8007J40429j07870
20979e7298o1644j37763J38696Q9581n1342J15189M1110P3982j58293p7207n60
20968h5549M0993J27160N2320k06760j80699O0228P4677k4486j07380R6088O2967
20957i0441l832k2857o0646P1223m1748J39960k960J07300L1639k8001l05159
20946b05522r8610J18469K0093j9180k38381p6611J60983K41529K2701R199J41230
20935G5900J1738j34070n5397p5245p296J59850O07o4284k5883L5123j52939j11211
$$ plain form
21009 -263641 -161550 -112948 -150228 -254648 -110483 -158836 -368953 -421095 -310603 -207445
20999 -207445 -120468 -64439 126413 197850 -17251 -198583 -210839 -67179 -35679 -172088
20989 -172088 -276682 -199554 16943 202382 35719 -56733 -127864 -89857 50572 -57298
20979 -57298 -118942 -256705 -118009 -28428 -79770 35419 76529 150511 -7782 -84989 -85549
20968 -85549 -44556 82604 134924 -71836 -252535 -192307 -117630 -142116 -249496 -153408 -90441
20957 -90441 -94273 -117130 -177776 -106553 -148301 -8341 -11301 95999 127638 99637 -205522
20946 -205522 -304132 -185663 -165570 -184750 -423131 -499742 -338759 -97230 -74529 -65330 75900
20935 75900 87638 -46432 -101829 -177074 -184370 -24520 -23913 -88197 -114080 -78957 -231896 -343107
20923c43107L6808N1679o0070K6310J04021r800J15563J55399N782j74595n8019
20912a50029Q6577Q9604j2941o2221K8793J10141J02185J19414l6517j61326J49320
20901B63000P790J96690m6671j33870m7639r6559l01125j30795J24225J25392
20891c9562O0191J34710L8832K3347j48732j48214q39M2998M8608R182J44799
20880A65320r1864J7730j20270n9301k1271K2676O8561P1136n7149l6189q3560
20869a24181L5231J09391J6786o7460K0567J65594J3146p4343L3107o9891o2298
20858d351Q6172j27975m3109J09493j6325j52196K0146J72578M053L7251m1694
20847D4043K9829K316L2155j8246J1011j2089O8548j34035L8116O3918K5319k9182
$$ plain form
20923 -343107 -306299 -254620 -314690 -288380 -184359 -194159 -78596 76803 82585 -92010 -150029
20912 -150029 -63452 26152 13211 -49010 -20217 89924 192109 311523 275006 113680 263000
20901 263000 270790 467480 420809 286939 239300 142741 -158384 -289179 -164954 -39562
20891 -39562 20629 155339 194171 217518 68786 -79428 -80267 -37269 11339 20521 165320
20880 165320 73456 91186 -29084 -88385 -109656 -86980 -18419 52717 -4432 -40621 -124181
20869 -124181 -88950 20441 37227 -30233 -9666 155928 169074 94731 127838 57947 -4351
20858 -4351 81821 -46154 -89263 20230 3905 -148291 -128145 44433 48486 85737 44043
20847 44043 73872 76188 108343 90097 101108 89019 157567 23532 61648 125566 150885 121703
20835A21703j2012N5012j05748j44286k2649J01353J36318j22756k67555j84828
20825d45448J57134J27867r5047j09050K0532j0466M8600O1587n5729k2470M1179
20814b81311O7076O1560M8938r4438L3535N7035M2393L0339J8182N4787O1211
20803I9307j72769r2904L9092N5836L1762p046r295J73850n9944o4005J12441
20792A06325m7736L6916o3787j80188J85537K56320J3489l5200k4652p7552K630
20781A72102m3118r045r0256Q9163k8158j35945m2870J55620J24077n0316l4847
20770A06407m6892l5976J34221N497J49517j6840n3769p4055j18377J17520N9573
20759B26826j54931n0451L2400J43897n5858j22054o5185p7745j15967M2814O6989
$$ plain form
20835 121703 109691 164703 58955 -85331 -107980 -6627 129691 6935 -260620 -445448
20825 -445448 -288314 -160447 -255494 -364544 -344012 -354478 -305878 -244291 -300020 -322490 -281311
20814 -281311 -214235 -152675 -103737 -198175 -164640 -107605 -65212 -34873 -16691 38096 99307
20803 99307 -73462 -166366 -127274 -71438 -39676 -46722 -56017 117833 57889 -6116 106325
20792 106325 58589 95505 31718 -148470 37067 293387 306876 271676 247024 169472 172102
20781 172102 128984 119939 29683 118846 90688 -45257 -88127 67493 191570 141254 106407
20770 106407 59515 23539 157760 163257 312774 295934 242165 168110 49733 167253 226826
20759 226826 71895 21444 53844 197741 141883 19829 -45356 -123101 -239068 -196254 -129265
20748a29265j8624q50J23930J00208J565J01517L482m6876j4192N1775p023n7214
20736A08433q9361k6705M8231j995j01046q7341m6595N7520M0013Q5676R7849
20725H4679J23609o9419o2565k0549P8902J4983j14347j18637j3865K103m2078
20714a37184M3728K1917q2050j12982n314J65514K10146J32601j0488j63351N9714
20703A22251j1541r8686p2261k9525J7185j36914j10916k4599K69952J17700k06560
20692a63914J01340P2205p8415M307p2473L2713Q642o7505J49354q0149P6548
20681a7347p2551j42008M2898R0132L3092J640q751Q077O4568j2136j74512m7507
20669b34405M1509K04678N2461K4956j11806o7955r6096j16570O204Q8392J16307
$$ plain form
20748 -129265 -147889 -148739 -24809 75399 76964 178481 181963 135087 120895 172670 165647 108433
20736 108433 19072 -7633 40598 38603 -62443 -149784 -196379 -138859 -98846 -13170 84679
20725 84679 208288 138869 76304 55755 134657 149640 35293 -83344 -97209 -95106 -137184
20714 -137184 -93456 -71539 -153589 -266571 -271885 -106371 103775 236376 225888 62537 122251
20703 122251 110710 12024 -60237 -89762 -72577 -209491 -320407 -345006 -75054 42646 -163914
20692 -163914 -62574 9631 -68784 -64477 -136950 -104237 -95595 -163100 -13746 -93895 -17347
20681 -17347 -89898 -231906 -189008 -98876 -65784 -64144 -72895 -64818 -250 -12386 -186898 -234405
20669 -234405 -192896 11782 64243 89199 -22607 -90562 -186658 -303228 -297024 -208632 -92325
20658i2325O4207n288j2948j8867M5041O6101L3440q5641j61944j28810M7555
20647b49479M9542o2273Q7196L6953k1523J47170k1379K10427J5579j1723L8104
20636B18594o2130j98857q343N3371N6051k5246j94129Q3755J30829m1398k9513
20625a7016p0505j13310K641N359J37503J61353q8134J06582K4282j3276J27791
20614B63270N5733q7951j11334k70017l4717k9929O9239N6114L8744q797J5141
20603d4504P5588r2535j23987m2592N4087J91981J930J12208R5927j71190o1548
20592d635J3225R0986K00929o3471l5526n092n0837j52288q8326j65883J5139
20581b45779m7438j78190K3473L54764J42897k7046L7300L4905M9069r1585P1417
$$ plain form
20658 -92325 -28118 -33406 -46354 -65221 -20180 45921 79361 -6280 -168224 -297034 -249479
20647 -249479 -199937 -262210 -175014 -138061 -159584 -12414 -33793 176634 192213 180490 218594
20636 218594 156464 -42393 -50736 2635 58686 33440 -160689 -76934 53895 12497 -17016
20625 -17016 -87521 -200831 -198190 -192831 -55328 106025 17891 124473 148755 135479 263270
20614 263270 319003 231052 119718 -150299 -185016 -214945 -145706 -89592 -50848 -59645 -44504
20603 -44504 31084 -61451 -185438 -228030 -173943 18038 19968 132176 228103 56913 -4635
20592 -4635 8590 99576 300505 237034 201508 196416 145579 -6709 -95035 -260918 -245779
20581 -245779 -293217 -471407 -447934 -93170 49727 22681 59981 94886 143955 52370 123787
20570A23787j865o4575j14619J7423N5282K871J3653J10590j26733j63077n3667
20559b00930P5339j35703q0660M1286Q5860J0150Q1642m3089J12139n9378l3472
20548a46816K7463m3635K7936Q429L0069J15853K8497N2426O6823j7666j30026
20537A9353K7683n1184p9747k566J29428p6810j82973l0269J19786R9181N4894
20526B6776J5728j26328k62P1076j18854j55455R2872N5213k15096j87044P2947
20515d68427J00482K52167k1019r437l6191M9831K3121j14709L1895J44658P5238
20504B7609j2011P2752j81871J68530J33656K6531j64832n3703N3551P9224O0665
20493B10101M3605j11748j00921j10725L2285L4516O2375o2257j55747P4010j01676
$$ plain form
20570 123787 121922 57347 -57272 -39849 15433 18304 31957 142547 15814 -147263 -200930
20559 -200930 -125591 -261294 -341954 -300668 -214808 -204658 -123016 -166105 -53966 -113344 -146816
20548 -146816 -119353 -162988 -135052 -126623 -96554 19299 47796 100222 167045 149379 19353
20537 19353 47036 -4148 -83895 -86461 42967 -33843 -216816 -247085 -127299 -28118 26776
20526 26776 42504 -83824 -84086 -13010 -131864 -287319 -194447 -139234 -354330 -541374 -468427
20515 -468427 -367945 -115778 -136797 -146234 -182425 -132594 -109473 -224182 -192287 -47629 27609
20504 27609 15598 88350 -93521 75009 208665 235196 70364 16661 70212 149436 210101
20493 210101 253706 141958 41037 -69688 -37403 -2887 59488 -2769 -158516 -84506 -186182
20482a86182R1926J99179m4352j34287n8503r1687P232n6275O1775q3065j8770
20471c13009J77099J21574m974m3547j73867L9107n9198n5906J25944J70943J8855
20460C021j49189o5769j07018l5183J31294J58704Q0360J6724K1970m7531j21894
20449a14511j43621p135J02226M2447n8674j8325R9663R0628K30521K37601k11674
20438B49146j16495l1307j12645l2874R9912j1406p199j81761j367M3914P0353
20427c1729J07959r7720M5389R7352m8526K13648j5919k07399j12190M8216J22290
20416A21371P7841j45040l7185K45759J79690O1158j32495k92619j23274j1959
20406e6753M2751K2152j01165Q3910O4402P1695J18076l4738m4976o3872l7290
$$ plain form
20482 -186182 -94256 104923 60571 -73716 -132219 -223906 -216674 -272949 -211174 -294239 -313009
20471 -313009 -135910 -14336 -19310 -62857 -236724 -197617 -256815 -312721 -186777 -15834 3021
20460 3021 -146168 -211937 -318955 -354138 -222844 -64140 16220 32944 54914 7383 -114511
20449 -114511 -258132 -265267 -163041 -120594 -179268 -197593 -97930 -7302 223219 460820 249146
20438 249146 132651 101344 -11301 -44175 55737 44331 37132 -144629 -145996 -102082 -31729
20427 -31729 76230 -21490 23899 121251 72725 286373 270454 63055 -49135 -919 121371
20416 121371 199212 54172 16987 262746 442436 503594 371099 78480 -44794 -56753
20406 -56753 -14002 8150 -93015 -9105 55297 126992 245068 210330 165354 101482 64192
20395F4192n9639j4622P7874j47595L500J59956j6760l440P7703m9571J46043
20384B37641N4293n8857j60345j01844M8216o9927Q2024r084j38537j16473Q9960
20373a42933J83967J17283j62147j66323K0921J02501K7643J6550m2956J42158
20363I6664K2946J77058l2093k04917q0339l9189P0643Q3595N0814o4433k34904
20352a54155m4562N1540j53519l736K41419P5749p965q7573j8669L7456p0220
20341a34235J19859j5780k057K46907k11963k13347j30041j8942J8610J55375
20331a85614J05747o9222j05892k6041J34539K2444J33625j53202J07807J15173
20321G9364R2773P835J09424P5710j00478k68512j16269J4045J06488J82355J10066
$$ plain form
20395 64192 4553 -10069 67805 -79790 -76290 83666 66906 63466 141169 91598 237641
20384 237641 291934 233077 72732 -29112 19104 -50823 31201 22117 -116420 -232893 -142933
20373 -142933 41034 158317 -3830 -170153 -149232 -46731 -19088 -2538 -45494 96664
20363 96664 119610 296668 264575 59658 -20681 -59870 10773 94368 145182 80749 -154155
20352 -154155 -198717 -147177 -300696 -304432 -63013 12736 4771 -82802 -101471 -64015 -134235
20341 -134235 -14376 -30156 -32213 214694 2731 -210616 -340657 -359599 -340989 -185614
20331 -185614 -79867 -149089 -254981 -281022 -146483 -124039 9586 -143616 -35809 79364
20321 79364 172137 179972 289396 365106 264628 -3884 -120153 -106108 380 182735 292801
20310B92801j46468j42949K7952l6365j03797m8301J85658K97878J20383j71704
20300B75088j87556n7826l3829J25086m0749m0298l8838J38465R9178O8241q917
20289B98045j68509k09552K6967P0841J27291L6063k1986J06242J77479j15439
20279C27442k29544l1935K3234O7139k7404m1806j61056o4136J03083N4299M14
20268A9730n1592j44447j19894Q1504J56752N2282M8103P757j5024p761k28248
20257b00838j04219j9698J35081n2520r5547N5575L47290N9155j53290M9286K5095
20246D5370n9445n9474p4843K86N8173J11381n221N8668N6273j28430P6905J13029
20234A92672j41990j14513J59341P2331j22610j43108J13232K14483J99839j47100
$$ plain form
20310 292801 146333 3384 31336 -5029 -108826 -157127 28531 326409 446792 275088
20300 275088 87532 29706 -4123 120963 80214 39916 1078 139543 238721 306962 298045
20289 298045 129536 -80016 -53049 17792 145083 181146 159160 265402 442881 327442
20279 327442 97898 65963 89197 156336 128932 87126 -73930 -138066 -34983 19316 19730
20268 19730 -31862 -176309 -296203 -214699 -57947 -5665 42438 50195 35171 27410 -200838
20257 -200838 -305057 -324755 -189674 -242194 -337741 -282166 65124 124279 -29011 20275 45370
20246 45370 -14075 -73549 -148392 -148106 -89933 21448 16227 74895 131168 2738 79643 192672
20234 192672 50682 -63831 95510 167841 45231 -97877 15355 229838 429677 282577
20224B82577J4360r1929p2678L8488m3621K7818j37289k6683J59875p8665n1836
20213B0417O0344L0248o6449J08440J63689j41814j28006o5306j00246K2915J91808
20202I6040P2886j64461Q6701q7930r7961J03447J35978P0851j01265j0726J9882
20191A23442k5428q5358L5073O1142Q8276n5825P3163o656j67067q605m4193J8267
20179F231O7662J12849o9000k09657J00420j25221j40412K10418J33406N1480
20169A38176l3467k07499o9768J10245J3954j03670l3354P2579R0634K7514j41307
20158a35963j0253K10878J13413k2147L623R9778k03489j93296m4172J50527K06751
20147A75650R1033k7511k8672o2179j7739J19380l7718k7887j16078j56033p2029
$$ plain form
20224 282577 296937 205008 132330 170818 127197 155015 17726 -8957 150918 72253 20417
20213 20417 80761 111009 44560 153000 316689 174875 46869 -18437 -118683 -95768 96040
20202 96040 168926 4465 91166 3236 -94725 8722 144700 215551 114286 103560 123442
20191 123442 98014 12656 47729 108871 197147 141322 214485 207829 40762 32157 -12036 6231
20179 6231 73893 186742 117742 -91915 8505 -116716 -257128 -46710 86696 138176
20169 138176 104709 -102790 -172558 -62313 -48359 -152029 -185383 -112804 -22170 5344 -135963
20158 -135963 -146216 64662 178075 155928 159551 259329 55840 -137456 -181628 -31101 175650
20147 175650 266683 239172 210500 148321 130582 249962 212244 184357 68279 -87754 -159783
20136a59783n7141n8343r8807K15285J24154l315R9433L769q6119O7805J06266
20125A53204q2858k63540j5070O7097J12881J1714j49669o6040L25841J55859
20115B49419O862q7569o0739J04022R5961j22118q3973J12547m4575m3656m8189
20104G7992r7912P4003J61820J21181j12326k64160j07785k9231j70383K06878
20094a39923K06801q4832k3468O9096k2066J02961N104q7467L2609k5211n5330
20083b1726J31945j1482J140J88449j511l1749j61330k577n1318j21860q2274
20072a64293j6752J66248J11858k1281O4626J73679Q0789j12131j15361L9105
20062B06487m5411j19549p9436Q8158N2855M6498M5202j44901J5390K0471J33914
$$ plain form
20136 -159783 -216924 -275267 -374074 -158789 -34635 -37950 61483 65252 -20867 46938 153204
20125 153204 70346 -193194 -208264 -141167 -28286 -16572 -166241 -232281 93560 249419
20115 249419 256281 168712 107973 211995 307956 185838 101865 214412 169837 126181 77992
20104 77992 -19920 54083 215903 337084 224758 -39402 -147187 -176418 -346801 -139923
20094 -139923 66878 -17954 -41422 27674 5608 108569 113673 26206 58815 33604 -21726
20083 -21726 110219 98737 99877 288326 286815 255066 93736 91159 39841 -82019 -164293
20072 -164293 -181045 -14797 97061 75780 140406 314085 394874 282743 167382 206487
20062 206487 161076 41527 -37909 50249 103104 149602 194804 49903 65293 85764 219678
20051B19678L4705j97214Q514J30354o4573J9741N1011n4222P7464J5165j41609
20040I9014m6931k8708L4236P4410J9749j35250j42962L871K36846J88556k23664
20029G9167j29086l0320N8868o0026k738R2249O9192j95135N2249J34520j47429
20018g8489K3380O0068j24101l9896J4029J1286L2942j81270P8793J44360J15285
20007E6387J20621L772m7622p3470L282j61383J6344R9603J23275M8518N6590
19996B45917j049j3933l8164j27694J21387J57273M3612j34781l9665q1924j32171
19985a192j39312m2837J906J56879K63251q8480j22518q5972j45210r1220p1788
19974c66493J47711O5553P8623L4095p4898m3505R3755J5975N1705J10022m3985
$$ plain form
20051 219678 254383 57169 65683 196037 131464 151205 202216 147994 225458 240623 99014
20040 99014 52083 23375 57611 132021 151770 16520 -126442 -122571 114275 302831 79167
20029 79167 -49919 -80239 -21371 -81397 -84135 8114 77306 -117829 -65580 68940 -78489
20018 -78489 -55109 4959 -119142 -159038 -145009 -133723 -100781 -282051 -203258 -58898 56387
20007 56387 177008 180780 133158 59688 62970 -98413 -82069 17534 140809 189327 245917
19996 245917 244868 230935 192771 65077 186464 343737 387349 252568 212903 130979 -1192
19985 -1192 -140504 -183341 -181435 -24556 238695 150215 27697 -58275 -203485 -294705 -366493
19974 -366493 -218782 -153229 -74606 -40511 -115409 -158914 -65159 -49184 2521 112543 68558
19963F8558m6902n0055K2618J05471J35488r2186o8359N007J9926O6509n6011
19952A10064k18499k47182l104K12856K04049O970j65001J020k262J09187J13859
19941A21957J84450j73837j21054J84428J92364K1920k69574j07153j37148k8052
19931a31699L7127O8665J9245j48690N4014Q7324R8010p3530k1070k7251n6889
19920i4744J05125j8526K8216J63140L2490K213j00072k9927M8598n4253q5542
19909c282j51792K7556L00062O3628j57468J40268k82866j07193L9394q325J80301
19898D0283Q9230J4537j76341q0668j0435N5237q7350m4803J97776j8872K3085
19887A679K860R6434N3603J1641m1726p142j7917R6099j33065j07879N1852K21376
$$ plain form
19963 68558 21656 -28399 -5781 99690 235178 142992 74633 79640 99566 166075 110064
19952 110064 -108435 -355617 -358721 -145865 58184 65154 -99847 -98827 -101089 8098 121957
19941 121957 306407 132570 11516 195944 388308 410228 140654 33501 -103647 -131699
19931 -131699 -94572 -25907 -6662 -155352 -101338 -14014 83996 10466 -10604 -37855 -94744
19920 -94744 10381 -8145 20071 183211 215701 217914 117842 87915 136513 82260 -3282
19909 -3282 -155074 -127518 172544 236172 78704 218972 -63894 -171087 -131693 -140018 40283
19898 40283 129513 144050 -32291 -112959 -123394 -68157 -155507 -200310 -2534 -21406 1679
19887 1679 4539 100973 154576 166217 124491 117349 99432 195531 62466 -45413 6439 227815
19875B27815j40721j44198j9236K56714J41529p8067R702p5312j02192j06248
19865c0214R445Q4554l9699j21553Q597J58896p9260p6615J12773o2281J71914
19854A36557K07158j00944n3710p0944K5716O9363J86152j17663j62930N8420
19844A77175j6667o2589k23671K3150J45275J25213K6914j67831K4417j07391
19834e6005m5122r893m1824N1597M8540P7781O7732k6423j4696L3722j0558k5789
19822D9062P602Q144j41050q3428J33900N3575r1609j07459l5248r409n5835Q9270
19810a82485J26670K43746k9705k42951J4353J64455j28919l5553O9520L112K3738
19799B5981P7937J84096J72814j17795j23778q7713j45009J35132J42813l1927
$$ plain form
19875 227815 87094 -57104 -76340 180374 321903 243836 253538 178226 76034 -30214
19865 -30214 -20769 63785 24086 -97467 -88870 70026 -9234 -85849 26924 -35357 136557
19854 136557 343715 242771 189061 118117 143833 213196 399348 281685 118755 177175
19844 177175 160508 97919 -125752 -102602 42673 167886 194800 26969 51386 -56005
19834 -56005 -101127 -111020 -152844 -101247 -52707 25074 92806 66383 51687 85409 74851 49062
19822 49062 56664 64808 -76242 -159670 -25770 27805 -63804 -171263 -206511 -215920 -271755 -182485
19810 -182485 -55815 187931 158226 -84725 -70372 94083 -34836 -70389 -869 2243 25981
19799 25981 103918 288014 460828 343033 219255 131542 -13467 121665 264478 232551
19789B32551l5643n7801j69411L5310K43827k2256k4402n0582j7813o5133O852
19778G5499P1121O1043o7416r2301J63519J0374j07420n1147M0168j05842j35694
19767a38096M6652j8476R5022J07641k5056R3809j471n9237m2589j12810j18250
19756a72861J0567n2427J53627m2756O0416l9675N0950J57259j65842r7861n1791
19745a90394m4757J4245n1488k9573K4654N3016O0599J55052M7401K6558O8392
19734A33705J4247O1450m7436O7749O973o326k306j38164k6018J37008J11178
19723C12060q1928j78645r8065O6354m4903j9405r977k3057l250M049j9551o5805
19711a62123J39430N5681N5175L1031k43968j66712J95191K75128k16j20565J40613
$$ plain form
19789 232551 196908 139107 -30304 5006 248833 226577 202175 151593 133780 68647 75499
19778 75499 146620 207663 140247 47946 211465 221839 114419 63272 103440 -2402 -138096
19767 -138096 -91444 -109920 -14898 92743 67687 161496 160025 100788 58199 -54611 -172861
19756 -172861 -162294 -214721 -61094 -103850 -43434 -83109 -32159 125100 -40742 -138603 -190394
19745 -190394 -235151 -220906 -272394 -301967 -277313 -224297 -163698 -8646 38755 65313 133705
19734 133705 147952 209402 161966 229715 236688 230362 228056 89892 63874 200882 312060
19723 312060 230132 51487 -46578 19776 -25127 -44532 -54509 -77566 -80816 -76767 -96318 -162123
19711 -162123 -22693 32988 88163 119194 -124774 -291486 -96295 178833 178617 58052 198665
19700A98665J46440j64387p2907k895n6777M5658L9840N5355n4102n7596j54740
19689g7446L8685k3380k7337L7370j37691j14673N8041J60042q7645j11955O1459
19678b24530J65724J57737J71171N0116J25364j14738k19642j87110r5362j28713
19668b99983l8691J07981k5879Q4828j12975n68K2525K8921J75350Q9501Q1726
19657A12736k6451n8634O897j09898J27672K15508j41874k1163j3324K3243K8478
19646A43190j49022j63028M4325J47115J31166q3076L405R730K0936J42005J18890
19635C65636r705J2843j67443j7647L6495m8755J47578j9293j61813j12892R5901
19624A20905P7642j23876j13381Q6980N1764m7847R3108P0232r6187j22697R8750
$$ plain form
19700 198665 345105 180718 107811 104916 48139 93797 133637 188992 134890 77294 -77446
19689 -77446 -38761 -62141 -89478 -52108 -189799 -304472 -246431 -86389 -174034 -285989 -224530
19678 -224530 -58806 98931 270102 320218 445582 330844 111202 -75908 -171270 -299983
19668 -299983 -338674 -230693 -256572 -171744 -284719 -285287 -262762 -233841 -58491 31010 112736
19657 112736 86285 27651 34548 -75350 52322 267830 125956 104793 91469 114712 143190
19646 143190 -5832 -168860 -124535 22580 153746 70670 74075 83805 104741 246746 365636
19635 365636 355931 368774 201331 183684 220179 171424 319002 299709 137896 25004 120905
19624 120905 198547 74671 -38710 48270 100034 52187 145295 215527 119340 -3357 95393
19613I5393J37243r5783k35266J8607P0898J56743K02627O1614j9248j13809q7820
19602A91199Q9074J21151o3164j01226p0246j37004j65080J38463Q3192m7895
19592C8464j42547K0673J42062J23395L1856J50385k1957j39826m1408j86675
19582b5578j28921n3053J17239L13030K3129j06159j33949j8777n9095q3137r745
19571a65016K76617Q8169n4307n9591j16986m2562j8638K3331p8678Q6184J52635
19560I1158R5884J49840q3572k72037p8874P6603J55876Q9521m7266K9504l6149
19549A70488k88525k0141o9412j09684m1378K4962K40450M5000O0709O0756O5359
19538A38584L1705j05700o4983j07890L2023J70637K4569m7937N7833J9660j82308
$$ plain form
19613 95393 232636 136853 -98413 -79806 -8908 147835 350462 412076 392828 279019 191199
19602 191199 280273 401424 338260 237034 166788 29784 -135296 3167 86359 38464
19592 38464 -104083 -83410 58652 182047 213903 364288 342331 202505 161097 -25578
19582 -25578 -154499 -207552 -90313 222717 245846 139687 5738 -13039 -72134 -155271 -165016
19571 -165016 111601 199770 145463 85872 -31114 -73676 -92314 -68983 -147661 -61477 91158
19560 91158 187042 336882 253310 -18727 -97601 -20998 134878 224399 177133 206637 170488
19549 170488 -118037 -138178 -207590 -317274 -358652 -333690 -93240 -48240 12469 73225 138584
19538 138584 170289 64589 -394 -108284 -76261 94376 118945 71008 128841 148501 -33807
19527c3807R6687K44136l0899j77174m090j38687m6333N8391m1574R926p644J15736
19515D4668J52316q4951j69925r888K85770J06706N2157J45483r6109K8034n3133
19504D01128j30974j07241Q0669p9226k44162K378K2010q9283M7685L55746K52867
19493E11597J35345o9851j38158n4203q9213o0015k7931J91377L26972J16275
19483H42195N4992p4403j41383l7056q7797J25208N2106r5191j07587j1645J65361
19472F84800N7685k67201l34264O7735K04718L2852l8177N7917R6459j31269K61651
19461F92906L15971n3261j61583j26191j63859j44300j63592o8262P563R5679
19451B31071L3573l9536J48695J33568N8344O4320l9686j8798K20959J27562L4121
$$ plain form
19527 -33807 62880 307016 276117 98943 94853 -43834 -90167 -31776 -73350 -63424 -71068 44668
19515 44668 196984 112033 -57892 -67780 217990 324696 376853 522336 426227 454261 401128
19504 401128 270154 162913 243582 164356 -79806 -77428 -55418 -144701 -97016 258730 511597
19493 511597 646942 577091 438933 384730 295517 235502 207571 398948 725920 842195
19483 842195 897187 822784 681401 644345 556548 681756 733862 638671 531084 519439 684800
19472 684800 742485 475284 141020 208755 413473 446325 408148 466065 562524 431255 692906
19461 692906 1008877 955616 794033 667842 503983 359683 196091 127829 135392 231071
19451 231071 264644 225108 373803 507371 565715 630035 590349 571551 792510 920072 954193
19440I54193k27439k44025j38389M3898o523O4882r2190L7885J94349K0488r1350
19429E15779J33j0805j8833j54771n8257k61235p461r537j05286P196J74580R8993
19417A70496P9141K0667l6941j21593o8392j3246J34963n4734j96999M2763Q7984
19406D4109J39802n7447l6295O0875j57425O127m0194o9027p3150J02481K05512
19395A25368K5316O1557J78422j13026k79261j66292P2622K44854L6641q6975
19385I9226m3496j4205O1141Q2306R104L2213N0094j94604J5751R4670j90812
19374A388j26895M3797q2305O1046J53467M3427J3554m6219n1628L2678j1121
19363C1189J21274J63571J3068q4137j56089k7609j43317j00945p1540Q5234K43298
$$ plain form
19440 954193 726754 482729 344340 388238 381715 446597 354407 392292 586641 607129 515779
19429 515779 515912 505107 486274 331503 273246 12011 4550 -4987 -110273 -103077 71503 170496
19417 170496 249637 270304 233363 111770 43378 30132 165095 110361 -86638 -43875 44109
19406 44109 183911 126464 90169 151044 -6381 -254 -40448 -109475 -182625 -80144 125368
19395 125368 150684 212241 390663 277637 -1624 -167916 -95294 149560 186201 99226
19385 99226 55730 41525 102666 184972 194076 226289 276383 81779 97530 192200 1388
19374 1388 -125507 -81710 -164015 -102969 50498 93925 107479 61260 9632 42310 31189
19363 31189 152463 316034 329102 244965 88876 61267 -82050 -182995 -254535 -169301 73997
19352G3997J24052n7380j64607M2237K4660R131K1618l4853N2292K6147l907K5210
19340A38597q4239j78718j7730n0672j14762J09009n2972m2710j4401J19870Q9040
19329i9688J4910l0282L7811k2655J9425J0467P2141m4720j3115J0906Q5385p4764
19317c4179K3061J54138L9917k13581K8265J05589N3515j05854L952K8336Q2453
19306A65612n7304k02713o3312j08845p7610K9027J18283L3161o5486o0756J02918
19295a87025P3335K3K7462J34246o2681j34595J20623P768j05465J26324O5295
19284F5310q8900O6809R2400o0575J05124o5561j51728l8682J22452J7518p6997
19273a2830j7963j14337j28642l0612O2148O9118K80169J45971J39334n992j95143
$$ plain form
19352 73997 198049 140669 -23938 18299 42959 52090 73708 38855 91147 117294 113387 138597
19340 138597 54358 -124360 -142090 -192762 -307524 -198515 -251487 -294197 -308598 -188728 -99688
19329 -99688 -84778 -115060 -77249 -99904 -80479 -70012 2129 -42591 -55706 -44800 40585 -34179
19317 -34179 -11118 143020 182937 -30644 -2379 103210 156725 50871 54823 83159 165612
19306 165612 108308 -94405 -157717 -266562 -344172 -315145 -196862 -163701 -229187 -289943 -187025
19295 -187025 -113690 -113667 -86205 48041 -14640 -149235 -28612 -20844 -126309 15 65310
19284 65310 -23590 43219 135619 75044 180168 114607 -37121 -75803 46649 64167 -12830
19273 -12830 -30793 -145130 -273772 -304384 -242236 -173118 107051 253022 392356 386364 191221
19262A91221j22372J96189K79366o1889l6123j03140r4896n6018M5193n5794j10932
19251G0805k22406J40608K31618N2928k417j19158l5856p6127M9910L5130j32250
19240g215j20331L2165J31782J69672Q2727J00088k02674l7362P8036m1733p0934
19229A14221J8008p6256R1639Q0114R5970J0177J5272J81137q0326q7539q363
19218C54054p235P3800o3731l048r0774j10922J86334J61665q2670j05071R4985
19207D07387j19426r4851J01680j66417P8410o1449P630l0521r5515L9418L7718
19196A04064J0395R3089J42349J62761m0520j48105j9823M2493j68032n7848j45667
19185b4844l7526J33282J30545k3028o7773l6838M226J43836l6553k1237J89500
$$ plain form
19262 191221 68849 265038 544404 482515 446392 343252 248356 192338 237531 181737 70805
19251 70805 -151601 -10993 220625 273553 271136 151978 116122 39995 89905 125035 -7215
19240 -7215 -127546 -95381 36401 206073 288800 388888 186214 148852 226888 185155 114221
19229 114221 132229 55973 147612 227726 323696 333873 349145 530282 449956 362417 354054
19218 354054 346819 420619 356888 353840 263066 152144 338478 500143 417473 312402 407387
19207 407387 287961 193110 294790 128373 206783 145334 152964 122443 26928 66346 104064
19196 104064 114459 207548 349897 512658 472138 324033 304210 346703 178671 120823 -24844
19185 -24844 -62370 70912 201457 178429 110656 73818 78044 221880 185327 164090 353590
19174C53590J04674k57760j86395K1209O4566Q2079n8339j64721L85R6434j71059
19163a15337p4274M2696J37858l7958j86570L5742R9964J66402J62358j06163
19153A24718j32615o265Q9814J61368O5899j29294J0459J0068q2606p6897k09054
19142a74405R1859J16018Q0887k5327j49301k401k8124j12963o1967P1669J40333
19131e3722K60776K8520J7244r6794o4498j01612J1379J0210k23163J41883J5940
19120e3837j6051J59588j7830j4354K4286P7091J63567L14885k14147j74178p5887
19109A73133O3638J54512p608m5014n6910j09389j23831L2948j16093L1615L26623
19098C23624J98185j51281J43984o262n3557j66318r6260N2299J05602K27910
$$ plain form
19174 353590 458264 200504 14109 35318 99884 181963 123624 -41097 -40712 55722 -115337
19163 -115337 -189611 -146915 -9057 -47015 -233585 -197843 -97879 68523 230881 124718
19153 124718 -7897 -14162 75652 237020 302919 173625 184084 194152 111546 34649 -174405
19142 -174405 -82546 33472 114359 89032 -60269 -62670 -90794 -203757 -265724 -194055 -53722
19131 -53722 207054 235574 252818 156024 91526 -10086 1293 11503 -211660 -69777 -53837
19120 -53837 -69888 89700 71870 57516 81802 158893 322460 637345 423198 249020 173133
19109 173133 236771 391283 383675 338661 281751 172362 48531 81479 -34614 -2999 323624
19098 323624 521809 370528 514512 508250 454693 288375 192115 244414 350016 577926
19088E77926J77187j72167j13611J66785R2977L9482n8722n4945P4216o1480k20493
19077D47155p883N3491K58582j53908j91091N0321K7948K564M0439l578n6228
19066D67812j36905N2880J55534R3745J19262J36520R5477N668m9373P681N9162
19055A007463j00539N688p003J02660J4974j69551m6025J17793K2192J35357J74561
19044A257570n9933L6971K52988K65276L55238N94532M14917N3960j06268Q0470
19034C145721J53192l202j20070J2988O3109N53915Q79879J670838K059215J676807
19024A0092392J18369j216582j485448p89366j01360P53350J396712J015625J4183
19015I797875q85118o68458J13136L95308M97231O86591J391065K333049M026610
$$ plain form
19088 577926 755113 582946 469335 636120 729097 768579 709857 654912 729128 667648 447155
19077 447155 439272 492763 751345 597437 406346 456667 484615 487179 527618 524040 467812
19066 467812 330907 383787 539321 633066 752328 888848 984325 989993 940620 948301 1007463
19055 1007463 906924 912612 905609 1008269 1023243 853692 807667 925460 947652 1083009 1257570
19044 1257570 1197637 1234608 1487596 1752872 2108110 2702642 3117559 3171519 3065251 3145721
19034 3145721 3298913 3295711 3175641 3188629 3251738 3805653 4685532 6356370 8415585 10092392
19024 10092392 10210761 8994179 7508731 6719365 6618005 7371355 8768067 9783692 9797875
19015 9797875 8912757 8244299 8357435 8752743 9249974 9936565 11327630 13660679 17687289
19006A7687289O609444R199023Q414103K767592k751988k628740L337638J2599026
18998E5233387K3911737K8460316J2608693j3365390k4600570j6455587o105300
18991E9687286j095581K263896M676628R42681o240347p762621j808893N339528
18983E6002577Q615507M606944l604361p977952n968222o52344O713004J7253032
18975G4988185K9704729L6707272K4530977n042030k9622221l2583626k0338079
18968G8345207n411127O780741J3840672R000171n786585j7534449j8092479j2198751
18960D8943400o343429j862147J594928L006417J864221J650841N939431J5141756
18952F9935418K7965188L7010549K4715337n865826k6352438k0887764n756509
$$ plain form
19006 17687289 24296733 33495756 41909859 44677451 41925463 39296723 42634361 55233387
18998 55233387 79145124 107605440 120214133 106848743 82248173 65792586 59687286
18991 59687286 58591705 60855601 65532229 66474910 60234563 52471942 50663049 56002577
18983 56002577 64618084 69225028 65620667 57642715 51674493 51022149 57735153 74988185
18975 74988185 104692914 141400186 165931163 160889133 131266912 98683286 78345207
18968 78345207 72934080 79714821 93555493 102555664 96769079 79234630 61142151 48943400
18960 48943400 42599971 40737824 42332752 45339169 47203390 48854231 54793662 69935418
18952 69935418 97900606 134911155 159626492 153760666 127408228 106520464 100763955
18945A00763955j458843j0485428j8724824j6024583q187356j408803M743249
18938D9217367J3642875K6449031L8483206L2294613L53366k9641678l3178691
18931I7620089k3605598j8350108j5426522j1041179o764440l852806j851321
18924A6728115o575J301638Q51560q74565k342238j936270p31658P26900J809476
18915A5526383J839559O15275J68743N19608J14419j849569l480886l046542j698246
18906H708744p36844o08167n14760o52385m0211P38912J094265O57834q85925
18897G761463j786081j623566j129684o63511l85619l29477l05170j89442N4764
18888A403677Q9640m5908j47636m5571r1282O4155j97379j21718K27700O6759
$$ plain form
18945 100763955 99305112 88819684 70094860 54070277 45882921 44474118 49217367
18938 49217367 62860242 89309273 127792479 160087092 160440458 130798780 97620089
18931 97620089 74014491 55664383 40237861 29196682 22432242 18579436 16728115
18924 16728115 16721540 18023178 18874738 18000173 15657935 13721665 12990007 13716907 15526383
18915 15526383 17365942 17981217 18149960 18669568 18783987 16934418 13453532 10406990 8708744
18906 8708744 7971900 7363733 6848973 6196588 6156377 6895289 7989554 8647388 7761463
18897 7761463 5975382 4351816 3222132 2558621 2173002 1843525 1538355 1348913 1403677
18888 1403677 1493317 1447409 1299773 1254202 1162920 1227075 1029696 907978 1135678 1202437
18878A202437k09422r5322R5245N8400O907j38349q3673J20404P0545O9996j93864
18867I03304r4921j11911p151J62520j8808j51966j59859M2177j40340j38033
18857B85012r494J20565J23827J79659n404p4304j62434j60142j5810k1564q383
18846B51528Q1019M4552O1642l4183r265k0629J36582N828l9011R9590n7305j16439
18834D03909l6798p5716j51886M4977O2532m077L6828j06029j2776R40R4560J37465
18822C93929q6219j71890k4258j5141K1358M8056J20078l961l9321M2988J36205
18811D21824k3580K23381J41201j12499p5693p4743j34758J4851p7835o1418l2565
18800B08166j34437l9982L1618J47866l6115P5297R620l1877J67323r0672n5550
$$ plain form
18878 1202437 993015 897693 992938 1051338 1058245 919896 836223 956627 1027172 1097168 903304
18867 903304 808383 696472 689321 851841 833033 681067 521208 563385 423045 285012
18857 285012 275518 396083 519910 699569 694165 619861 457427 297285 281475 259911 251528
18846 251528 332547 377099 438741 404558 395293 374664 511246 517074 478063 577653 520348 403909
18834 403909 367111 291395 139509 184486 247018 242941 279769 173740 160964 161904 256464 393929
18822 393929 307710 135820 111562 96421 117779 165835 285913 281952 242631 285619 421824
18811 421824 398244 621625 762826 650327 574634 499891 365133 379984 302149 240731 208166
18800 208166 73729 33747 65365 213231 177116 252413 262033 230156 397479 306807 251257
18789B51257n3700J00363J3943J37574j601R316P058P1262P2841J2117j13083
18778E07347j49692l5336Q6809j3586j02163j35139J16402J04540J35058K17421
18768G31661K13667N49854P35269J12944o78494l92033k97664k54433j13498J10322
18758G17595P487j48030k79216m862O0565n3033o5173M9051j21092J3376P8339
18747B55007R9341Q0367r9832j76251p7886J02844M9519m9082J02001K1735p0528
18736B37235j39046m3582j10693j35048J11900J30594L3943J51620P7378r1006
18726B23295k60877o1471j8784m473K47517l8704k73101N6379K6876R9570R1426
18715H7653J45060p8287q6581r622L9021J17586K7350K0981q4642m1733J0295
$$ plain form
18789 251257 197557 297920 311863 449437 447836 457152 464210 535472 608313 620430 507347
18778 507347 357655 322319 409128 395542 293379 158240 274642 379182 514240 731661
18768 731661 945328 1495182 2230451 2343395 1664901 1272868 975204 720771 607273 717595
18758 717595 725082 577052 297836 292974 353539 300506 235333 284384 163292 176668 255007
18747 255007 354348 434715 334883 158632 80746 183590 233109 184027 286028 307763 237235
18736 237235 98189 54607 -56086 -191134 -79234 51360 85303 236923 314301 223295
18726 223295 -37582 -99053 -117837 -122310 125207 86503 -186598 -130219 -103343 -3773 87653
18715 87653 232713 154426 67845 58223 97244 214830 242180 263161 178519 136786 147081
18704A47081j86193q3736J18778O7960L4188P568O2196k291R1087K06148m6066
18693D16720r9200j27932l8633P952Q0927k7463k9162N0544K0041R3972J48756
18682D96522r4986n497P238m3499P8525L412r7736o646J834p5603l2268L8016
18670B69312r093J13508j59651m2192J54681Q4898K01288J18034r8879k26540
18660D05366j41763P7172K04896m1282m4J38686j49909j40899r3543J03613M6881
18649D09174l5486j39369p4689K5619R9219J41334j60871j08750Q2796J34704
18639C73681J18857l2980r9756j2314o9117j2110M7122M0444L8356j22681n0081
18628B19421o4515L7381N5008n3278K06087K5841r6849p6161Q9169J0561p0614
$$ plain form
18704 147081 -39112 -122848 -4070 63890 98078 105646 167842 165551 256638 462786 416720
18693 416720 317520 189588 150955 158907 239834 212371 183209 233753 253794 347766 496522
18682 496522 401536 396039 403277 359778 438303 441715 343979 337333 339167 263564 231296 269312
18670 269312 260219 373727 214076 171884 326565 411463 612751 730785 631906 405366
18660 405366 263603 340775 545671 504389 504345 643031 493122 352223 258680 362293 409174
18649 409174 373688 234319 159630 185249 284468 425802 264931 156181 238977 373681
18639 373681 492538 459558 359802 347488 278371 266261 313383 353827 392183 269502 219421
18628 219421 154906 192287 247295 194017 400104 425945 329096 252935 342104 352665 282051
18617B82051j8188J39476P271m0195K8851k61874K424Q1027j65080j98540o9776
18606b12553J44919J90600J29896K4573n7497k89080j17421R4066J28791L10163
18596C46457Q8636j78337k12893O5924K56671N3114p2133q6506m53r3695j82505
18585a5720m3454K95187K79421q3945l1419J7439k60911j5715J59231k3373m8023
18574B28718n8665N1864K69827K35322j3495P7878j21653j55167k8810j8751J5783
18563D82851R8564J4163N2441J28942R2812n8415N9827Q9676L6735J62772o6820
18552A093548k12801j01658j38102J64337L3990J48753J04019l310l7386O5696
18542A117086K5407L227k2020r7117p0643o362O6417J5481K32130J56442J27246
$$ plain form
18617 282051 263863 403339 410610 370415 399266 137392 139816 220843 55763 -142777 -212553
18606 -212553 -67634 122966 252862 277435 219938 -69142 -186563 -92497 36294 346457
18596 346457 435093 256756 43863 109787 366458 419572 347439 260933 260480 166785 -15720
18585 -15720 -59174 236013 515434 431489 400070 417509 156598 140883 300114 276741 228718
18574 228718 170053 221917 491744 727066 713571 791449 669796 514629 485819 467068 482851
18563 482851 581415 595578 648019 776961 869773 811358 871185 960861 997596 1160368 1093548
18552 1093548 880747 779089 640987 805324 839314 988067 1092086 1088776 1051390 1117086
18542 1117086 1142493 1145720 1123700 1026583 955940 949578 1015995 1031476 1263606 1420048 1547294
18531A547294J21599J77428j23810k33934K6385R3247j3343n4095J13885L26967
18521A981623J91957R8478O7228j44563j36862j03490l9579O9972L17441L16363
18511B618568N94346Q77881R48556J145649J615146Q49631o70137j510654j283431
18502E185555n81853R6671O60653Q73018O11133J00310k82641l7212l4537m09871
18492F181226r13526q98759m07081k25852o8352J3477P7093P9954J90512L29699
18482D358391K22885K56594L61633N12323N76071P65206J291077K037305L005762
18473A3387247M262388M608856K700332m84340j844599n26291J646177K835081
18465B6584851M434197P756986R833869N203530k797072n075785j326386J335299
$$ plain form
18531 1547294 1668893 1846321 1722511 1488577 1514962 1608209 1594866 1540771 1654656 1981623
18521 1981623 2173580 2272058 2339286 2194723 2057861 1954371 1914792 1984764 2302205 2618568
18511 2618568 3212914 4090795 5039351 6185000 7800146 8649777 7979640 6468986 5185555
18502 5185555 4603702 4700373 5361026 6234044 6845177 6945487 6662846 6625634 6591097 6181226
18492 6181226 5267700 4368941 3961860 3736008 3667656 3681133 3758226 3838180 4028692 4358391
18482 4358391 4581276 4837870 5199503 5711826 6287897 7053103 8344180 10381485 13387247
18473 13387247 17649635 22258491 24958823 24474483 22629884 22103593 23749770 26584851
18465 26584851 31019048 38776034 48609903 53813433 51016361 45940576 44614190 45949489
18457D5949489J967543L1434l084469m275988j428425L582171O751292N697696
18449E5190743M385576Q825837K0915761L5959178M2675776L2862925J0558150
18442B11373946j3177362k5085018j7392161J231044R638732K456377r676943
18435A59368615j8549469k1484337j5443010k270157Q778533J0100461J484975
18428A21985611p546943j0815458r526441m752273K697830J1535821K5345255
18421A28923402M1281587M6831490L5908551J5586984m553796j9048763k6107310
18414B18822145k6928234k2527135j6275208j8150015k3774083k1143283j1326530
18407G8697657j220257Q514637J8818897K9670153M5589134O6302890N8325766
$$ plain form
18457 45949489 47917032 47948466 44863997 40588009 39159584 42741755 49493047 55190743
18449 55190743 59576319 68402156 89317917 125277095 167952871 200815796 211373946
18442 211373946 198196584 173111566 155719405 156950449 166589181 169045558 159368615
18435 159368615 140819146 119334809 103891799 101621642 110400175 120500636 121985611
18428 121985611 114438668 103623210 94096769 89344496 92042326 103578147 128923402
18421 128923402 170204989 217036479 252945030 268532014 263978218 244929455 218822145
18414 218822145 191893911 169366776 153091568 134941553 111167470 90024187 78697657
18407 78697657 77477400 85992037 104810934 134481087 180070221 246373111 304698877
18400C04698877k817832o2891110o7494961m3183400k7139058j7114263j1320543
18393G2737710j1224727j1103428p015269k007139j277275m337119o923617o136611
18385B2712525l900277k029426j242182n99993m8019J373304L269887M751158
18377B4286977M560088J235767l439106n537318m945130l674054k629195j508810
18369H349219r76205p73538p04927n31577o41229n89756l02608k29947j07652
18360C491780n7518L12062N22055L86168j57950q14159q20560m61470l04019j01298
18350A995091j93201M9791j14043k27790j07561J27410P0298j11661m710j93879
18340A289745j53109j40745m3332k6901Q4346n459N1471R9156j34186j32429j08160
$$ plain form
18400 304698877 301881045 238989935 171494974 128311574 101172516 84058253 72737710
18393 72737710 61512983 50409555 43394286 41387147 40109872 35772753 28849136 22712525
18385 22712525 18812248 16782822 15540640 14940647 14892628 16265932 19535819 24286977
18377 24286977 28847065 30082832 26643726 21106408 16161278 12487224 9858029 8349219
18369 8349219 7373014 6599476 5894549 5362972 4721743 4131987 3829379 3599432 3491780
18360 3491780 3434262 3746324 4268379 4654547 4496597 3682438 2861878 2400408 2096389 1995091
18350 1995091 1801890 1851681 1737638 1509848 1402287 1529697 1599995 1488334 1483624 1289745
18340 1289745 1136636 995891 952559 925658 1010004 1004545 1056016 1155172 1020986 888557 780397
18329G80397k7698j53423J75L12338N4198j9546j22042n0896J02112k09601k6756
18318F39258j52056o8538K2813N3732j65921p9271M2077J22977Q1843p3081j31961
18307B91872p8903m9895O2103M9318o9230m7987j0123o336K55300L5557j16522
18296C15154j41516j9021P0531j3916R8742R9755r2699L0021P256j18947l0091
18285B05269J26161j84602r7018J64357J68903j0579j59930J683R1076P4106N2704
18274D32130J1202m4473K1447q8550j15452L0621N2054n9667J00459k28799j00050
18263A0922K11097J23744J4220J87830m853j19878M923r5452q8012j17317k2479
18252A04745J83605k4940o9256J72118P2459N043L0349O4675L0233j50682j54953
$$ plain form
18329 780397 752699 599276 599451 911789 965987 946441 824399 773503 875615 666014 639258
18318 639258 487202 418664 441477 495209 329288 250017 292094 415071 496914 423833 291872
18307 291872 212969 163074 225177 274495 205265 157278 147155 140819 396119 431676 315154
18296 315154 173638 154617 225148 211232 309974 409729 317030 347051 354307 235360 205269
18285 205269 331430 146828 49810 214167 383070 372491 212561 214244 305320 379426 432130
18274 432130 443332 398859 420306 331756 216304 246925 298979 239312 339771 110972 10922
18263 10922 222019 345763 359983 547813 542960 423082 428005 332553 244541 127224 104745
18252 104745 288350 263410 194154 366272 438731 443774 474123 538798 569031 418349 263396
18241B63396r9697N0383R6910P1925r3761J07444j465n8353R4177K25294k985
18230F53268k14815r1901j26669M1814o5100l2476R6107J27086q8829j22149K2321
18219A98657O4253L9838j5763R7029J3196J2342N4835j21199j10463l2357L6249
18208B36617J05203k1227n4857l46523j67087j6631J57701J02753J58648J51515
18198C06112q97J52992J53246j24285L156q3981j20202J10482J06388j88988k24426
18187H9597q9852Q4429J61950Q8155n1179J16059j9567m0449M2563O2419L9681
18176D83806m6023m8461j53419L4893P8212k2475O9909J42216j16768L484l0433
18165C94941p6179j3219j45603P5628L39682Q8522o1477q3820L589j15711l182
$$ plain form
18241 263396 163699 214082 310992 382917 289156 396600 395135 336782 430959 656253 653268
18230 653268 438453 346552 219883 261697 196597 164121 260228 387314 298485 176336 198657
18219 198657 262910 302748 286985 384014 397210 409552 464387 343188 232725 200368 236617
18208 236617 341820 320593 265736 -80787 -247874 -264505 -106804 -4051 154597 306112
18198 306112 305215 458207 611453 487168 490324 406343 286141 396623 503011 314023 89597
18187 89597 -255 84174 246124 334279 283100 399159 379592 339143 381706 444125 483806
18176 483806 437783 389322 235903 270796 349008 326533 396442 538658 421890 425374 394941
18165 394941 318762 305543 159940 235568 575250 663772 602295 518475 522064 406353 403171
18154D03171J78662K17585L96379R4844j53216j32045n137l6068j54194N5484
18144H65465J69248n6929K4039L380J6718R4907J02348K6047P0878K33481M4977
18133A594559o731K03463L27811L26691K80500K74365K17586M40818M41379M16163
18123D516604N41097O46323O71281R79972J286695J718998K402836L436944M811787
18114B1012537P322379J1483523J9746053L6609097O9412139J16110001J19132885
18107D00828614J5326339j04296350j25105703p6744296m0874407k2910780j3615980
18100C2607437q517732n608693l859016k769049j992347j622061j326657j027111
18092E884771r36317o76887m50288n77287l97307l05016j54654m3801j47172k10157
$$ plain form
18154 403171 581833 799418 1195797 1290641 1137425 1005380 1000243 964175 809981 865465
18144 865465 1034713 977784 1001823 1005203 1021921 1116828 1219176 1245223 1316101 1549582 1594559
18133 1594559 1587828 1791291 2119102 2445793 2726293 3000658 3218244 3659062 4100441 4516604
18123 4516604 5057701 5704024 6375305 7355277 8641972 10360970 12763806 16200750 21012537
18114 21012537 28334916 39818439 59564492 96173589 165585728 281695729 400828614
18107 400828614 416154953 311858603 186752900 110008604 69134197 46223417 32607437
18100 32607437 24089705 18481012 14621996 11852947 9860600 8238539 6911882 5884771
18092 5884771 4948454 4271567 3821279 3243992 2846685 2541669 2387015 2343214 2196042 1985885
18082A985885k70436l38447k0344K13910J90764j42071k66796k69061o1091J26344
18072A148657J51958l0601P6921J8125k36937l39732k15065k51808K5429J05277
18062D52224j08764L4433K67589R7157n9195j69421j02586J21112n4036k03467
18052B75046J16771p785j58736M1656q1812j66770j0613J28091k5275L4738M2506
18041A87817o5517J29419j5013n6787j7615P2310P9181j06398p9159N8081j16586
18030F9733j8561K2542L8250k00802j47020J20883K09188K6104j69927j52248
18020b01858l0098l9016k7861j06139j9355m837K04714R3829R1658R7290R54J50170
18008B09451j49097R2192O3420p4457K08008J7396j73089p8829k57899n5476J62484
$$ plain form
18082 1985885 1715449 1377002 1356658 1570568 1761332 1619261 1352465 1083404 1022313 1148657
18072 1148657 1300615 1270014 1346935 1365060 1128123 788391 573326 321518 346947 452224
18062 452224 343460 377893 645482 742639 683444 514023 411437 532549 478513 275046
18052 275046 391817 384032 225296 266952 185140 18370 7757 135848 110573 145311 187817
18041 187817 122300 251719 236706 179919 162304 234614 313795 207397 128238 186319 69733
18030 69733 51172 73714 111964 -88838 -235858 -114975 94213 120317 -49610 -201858
18020 -201858 -231956 -270972 -298833 -404972 -424327 -429164 -224450 -130621 -38963 58327 59281 209451
18008 209451 60354 152546 215966 141509 349517 366913 193824 114995 -142904 -198380 -35896
17997c5896N8940j18581P4247J29747J0339L7746m5781q2408l8278J42993J46842
17986B79910j61502j62822m6707l5085K3802N0884j07483L1129K85412J1064J3645
17975A82247k00385j977J09009M7539l2909r1819J40916J2630J08420n2056k0182
17964B01433K17279N4197j09632P534j54817j61422K12087N3551N7194L8325J02269
17953E17998J28519L7111n0473O0416O6016K73654K29067j94509k74658k02345
17943E90796j62926j42154J34827k9591k92050j41014K34464J76240L8343n1386
17933C55549K00422J04408n3894o6286k19917p3217J22268o1542l5092L9653K05512
17922E17864J26737k3285l7279j24519N4633K03395L1406O4704N3111n6298l608
$$ plain form
17997 -35896 23044 -95537 -21290 108457 118796 156542 110761 28353 -9925 133068 279910
17986 279910 118408 -44414 -91121 -126206 -102404 -51520 -159003 -127874 157538 168602 182247
17975 182247 -18138 -20115 88894 136433 103524 11705 152621 165251 273671 221615 201433
17964 201433 418712 472909 363277 370811 215994 54572 266659 320210 377404 415729 517998
17953 517998 646517 683628 633155 693571 759587 1033241 1262308 1067799 793141 590796
17943 590796 427870 285716 420543 390952 98902 -42112 192352 368592 406935 355549
17933 355549 555971 660379 606485 540199 320282 247065 369333 307791 272699 312352 517864
17922 517864 644601 621316 584037 459518 514151 717546 748952 813656 866767 810469 806861
17911H06861k8115q1611j55843q2764M083L012p013p6902j06326K9084Q9993J56542
17899E51001J41511l864K427j32769n4119j2033P0317k3321k02573j22513J71156
17888C85220j19858r2526K0892J02999R2605J2900O6609j22042o0373P7718J4929
17877C79073j60563k8467p5015n6648J40347P1324r5329j12428l8928k3239J9506
17866A9633Q1766j216k3718J8289j1714J51117J56605O4257m7714k6824j53500
17855B26981k46502N8438K27747L8367o3048P542k3706K4603N0721j25257j20119
17844E5767J9155J0929M983J46939K5396j85158R618j10788k05037O6133K39426
17833G7363r0489j92872O8420j0164Q9768J27587L1095j4618O9591m200j17614
$$ plain form
17911 806861 778746 697135 541292 458528 462611 465623 458610 381708 275382 304466 394459 551001
17899 551001 692512 688648 691075 558306 504187 492154 562471 539150 336577 214064 385220
17888 385220 265362 172836 193728 296727 389332 402232 468841 346799 286426 364144 379073
17877 379073 218510 190043 115028 58380 198727 270051 174722 62294 23366 127 19633
17866 19633 101399 100183 76465 94754 83040 234157 390762 455019 407305 380481 226981
17855 226981 -19521 38917 266664 305031 241983 249525 225819 250422 301143 175886 55767
17844 55767 74922 85851 90834 237773 263169 78011 87629 -23159 -228196 -162063 77363
17833 77363 -13126 -205998 -137578 -147742 -57974 69613 100708 86090 155681 151481 33867
17822C3867j30051n0396M7663O368N6153j03156M8185K29550J06097j14673n9302
17811G0305k13746r2126P6190n4640p0493J39325J39644Q0971J2785N7311o1955
17800H3571m2628j9771k1880m740k7844P8005m1079k03334l5548J0725L6897J16355
17788g1271k1731q722M9887P2988l9308j73807j62211J47660J19828L9891P2680
17777B5884P80O5120j95459J21856o1212r3675Q1440q1649j23424O5393J25504
17766f9442J11379J1795J9752j85773j62710Q8346K7245J15035O4804N338p8119
17755e2350q4875J41637N692J18676L5305Q902j6815j9517M6782l8586j67165
17744b2314m2094R1171n7906j09195l5393j19421j23028J91161J47001n8932P4937
$$ plain form
17822 33867 -96184 -146580 -98917 -92549 -36396 -139552 -91367 138183 244280 129607 70305
17811 70305 -143441 -235567 -159377 -214017 -284510 -145185 -5541 75430 88215 145526 83571
17800 83571 40943 21172 -708 -5448 -33292 44713 3634 -199700 -235248 -224523 -187626 -71271
17788 -71271 -93002 -101724 -51837 21151 -18157 -191964 -354175 -206515 -86687 -46796 25884
17777 25884 26664 91784 -103675 18181 -43031 -136706 -55266 -136915 -260339 -194946 -69442
17766 -69442 41937 53732 73484 -112289 -274999 -186653 -159408 -44373 20431 25769 -52350
17755 -52350 -137225 4412 10104 128780 164085 172987 156172 136655 183437 144851 -22314
17744 -22314 -64408 26763 -31143 -140338 -175731 -295152 -418180 -227019 -80018 -138950 -64013
17733f4013j7804n3526j9326J52049P376k09113k39107l5444M2692K26393p254
17722b17077m1081l884m6220K8835J07435l3752l615k1294J31275J64177n6240
17711H559r2378Q6599j17461j87890J16151M0350K1393r0617j51964J85232R7226
17700h4800j17526j0066J10832J59412O6476j02612j18229J1599m4332L7956J54191
17689F2901L7012j00523j10484j08133L5924J04709K6581j6173j79953j05947
17679c54086J24464J3733o4650j26574J18453R7360L7800J9807r0319n2276j02196
17668c78484j2253J74844K25443K6653r4822L0181K4659K9119K47983n7524P2197
17657B87996j65308R5862N3394r1776K3617L7990j72602j24489k23139r6015J34989
$$ plain form
17733 -64013 -81817 -135343 -154669 -2620 4756 -204357 -443464 -478908 -436216 -209823 -217077
17722 -217077 -258158 -262042 -308262 -279427 -171992 -205744 -209359 -230653 -99378 64799 8559
17711 8559 -83819 2780 -114681 -302571 -186420 -146070 -124677 -215294 -367258 -182026 -84800
17700 -84800 -202326 -212392 -101560 57852 124328 21716 -96513 -84914 -129246 -91290 62901
17689 62901 99913 -610 -111094 -219227 -183303 -78594 -52013 -68186 -248139 -354086
17679 -354086 -229622 -215889 -280539 -407113 -288660 -191300 -153500 -133693 -224012 -276288 -378484
17668 -378484 -390737 -215893 9550 36203 -58619 -28438 -3779 25340 273323 215799 287996
17657 287996 122688 218550 271944 180168 203785 241775 69173 -55316 -278455 -374470 -239481
17646b39481J20405L6258R3040p2757P2917N4740j2710k03888j361J05054o7497
17635a15280J61211r7972P0577J22964l4559j12810K7922o2126K6386M7612q3126
17624d9201n9957j12948l4709Q2508Q1726J27784m2611l4881j17082Q2908M7445
17613b9018r2700M0202l019J44383R7053K9954l7162q265j45074N8222L26973
17602C81549M1889P0844q9120J21157K95608J87226K5319P2823M06486L33347
17592A847128k06451m93941k68572j64213J12033l7639k22809j49150o5824j28187
17582B22375n6672m9755j34632j33205K7558J76807J43052K0916k20521j40534
17572a44611r3696J47429p1100o6140J70721P1521R2409q539M0681L8572j43782
$$ plain form
17646 -239481 -119076 -82818 10222 -62535 10382 65122 52412 -151476 -152837 -47783 -115280
17635 -115280 45931 -52041 18536 141500 106941 -5869 22053 -40073 -13687 33925 -49201
17624 -49201 -109158 -222106 -256815 -174307 -92581 35203 -7408 -42289 -159371 -76463 -29018
17613 -29018 -121718 -81516 -84535 59848 156901 186855 149693 141428 -3646 54576 381549
17602 381549 423438 494282 405162 526319 821927 1009153 1034472 1107295 1513781 1847128
17592 1847128 1640677 1146736 878164 713951 825984 788345 565536 416386 350562 222375
17582 222375 165703 115948 -18684 -151889 -124331 52476 195528 216444 -4077 -144611
17572 -144611 -238307 -90878 -161978 -228118 -57397 14124 106533 97994 138675 177247 33465
17561C3465o7273K237J20459J70340p0326o6406m9567o7584j88244j22521L4918
17550b70502P3344R5123L5598r3297O6466K6681m2510j06219o5021K6397J98547
17539e5393J00413j45377j89437j30762m3139P8826j9077O5653o21K21644R6429
17528b0841q175O0593L7179n6820K7122j08034j5738j39219P378R7604J00988
17517a7963J2744m3273r4401M848M9196J3113M1469L0083r487m8968P1325N7739
17505F6425k3352l7844m5174l2142q1681r6099J442M4768k8863r6248J29413K28562
17493B9207O5664J7319R153p1433j9221q0928j10330j34020l4483P5835r6198
17482c49435P9698J36668M5580P0674K09681J8384L4780l1722j47068N0935l399
$$ plain form
17561 33465 -33808 -31571 88888 259228 188902 122496 72929 5345 -182899 -305420 -270502
17550 -270502 -197158 -102035 -66437 -159734 -93268 -66587 -109097 -215316 -280337 -253940 -55393
17539 -55393 45020 -100357 -289794 -420556 -463695 -384869 -403946 -338293 -338914 -117270 -20841
17528 -20841 -29016 31577 68756 11936 39058 -68976 -84714 -223933 -216555 -118951 -17963
17517 -17963 -5219 -48492 -142893 -138045 -88849 -75736 -34267 -4184 -13671 -62639 8686 66425
17505 66425 43073 5229 -39945 -72087 -153768 -249867 -248425 -203657 -232520 -328768 -199355 29207
17493 29207 94871 112190 121343 49910 30689 -50239 -160569 -294589 -329072 -253237 -349435
17482 -349435 -269737 -133069 -87489 -16815 192866 211250 246030 214308 67240 118175 114776
17471A14776j53997m6840P1728R73o5947N4793O156o104j35834n4776R5409K4445
17459i5218J56336J52018J27228l5269j40626p6551r0359k33560j92472J01308
17449c27165N8266J64175K70523M1377N2966K39256O23940O76865J07906n59564
17439A348545m59576m15110j86081J11288J11965r3216j72565j00512l4656q2572
17429B7510J43988o9393k07107m6103K42749Q3051j4310m0298j85452k16849J05651
17418a76563R6269R9988K6009J24326N4225j10357o4643p95J20579Q9552j14572
17407A44018k1935J300k01702j86995q7592M5127K26153J45598J0126j73507k37363
17396c36772M6875J01033N5775M90K0594J7191P5072J1416N1665r2374j26371
$$ plain form
17471 114776 -39221 -86061 -14333 -13360 -79307 -24514 -18358 -24462 -160296 -215072 -119663 -95218
17459 -95218 61118 213136 340364 305095 164469 87918 -2441 -236001 -428473 -327165
17449 -327165 -268899 -104724 165799 207176 260142 499398 1123338 1800203 1908109 1348545
17439 1348545 888969 473859 287778 399066 511031 417815 245250 144738 110082 27510
17429 27510 171498 102105 -105002 -151105 91644 174695 160385 120087 -65365 -282214 -176563
17418 -176563 -80294 19694 45703 170029 224254 113897 49254 48459 169038 258590 144018
17407 144018 122083 123383 -78319 -265314 -352906 -307779 -81626 63972 74098 -99409 -336772
17396 -336772 -289897 -188864 -133089 -132599 -112005 -94814 -19742 -8326 43339 -49035 -175406
17385a75406j8291l766L9242o7752o7062R3988Q8391M423J9050J04215p5489o8516
17373a26973Q9415n0882j75727j56357N033J55160J22767J05693O1542P1591m1210
17362F0052j2837q2203K477J55816M0951j48123j28897r0677p386O006J58791
17351d6030J16702Q8515K2725q5922j26832J18713J93854k00942m6916J63767
17341A97634M3569P7491j53467M997J7703m3435j30174o0137J5377p5621q8283
17330a94346M0910J60502J43553k5844j58706n3590k6690R066L090J29404Q8394
17319A15743j8632o2190j21443l1566R4179O8722J63676L6261o2789N5455J1240
17308B48656M1927l3732q6013o6357Q7353q432k08130J32280l9725O9228J59833
$$ plain form
17385 -175406 -193697 -197463 -158221 -225973 -293035 -199047 -110656 -106233 -87183 17032 -58457 -126973
17373 -126973 -37558 -88440 -264167 -420524 -415491 -260331 -137564 -31871 29671 101262 60052
17362 60052 47215 -34988 -32511 123305 164256 16133 -112764 -203441 -210827 -204821 -46030
17351 -46030 70672 159187 181912 95990 -30842 87871 281725 80783 33867 197634
17341 197634 241203 318694 165227 170224 187927 144492 14318 -45819 -30442 -106063 -194346
17330 -194346 -153436 7066 150619 124775 -33931 -87521 -114211 -105145 -102055 27349 115743
17319 115743 97111 34921 -86522 -118088 -23909 44813 208489 244750 181961 237416 248656
17308 248656 290583 256851 170838 104481 191834 183402 -24728 107552 67827 137055 296888
17297B96888j68071k02415j51243q1809j06314j6914J38610P9850J83637J78256
17287A50475m5331j74157M9666O1225J73072M6608j16263j00047n5094k09126
17277b18972k7402K43038J02156p5128p0989j00183J11684J61143K2764j6609
17267A31502q7631k5118k266M019j51792J09822J3958p2804j3087j01168L2760
17256a61805R8783J33052J1131p9622L8382j5483l2970M9804l6425j54291n7773
17245b07217J17344J01845R727O8866n5131j78362r9932N5867J12323p1797j54109
17234c00576l0472j46669Q2149J62460K08555J95305P1809R716O4472q7302k57340
17223b7893l4264j01745k3251P7651N5974L9279j05593j62483k05733J89801K60518
$$ plain form
17297 296888 128817 -73598 -224841 -306650 -412964 -429878 -291268 -211418 -27781 150475
17287 150475 105144 -69013 -19347 41878 214950 261558 145295 45248 -9846 -218972
17277 -218972 -246374 -3336 98820 23692 -47297 -147480 -35796 125347 148111 131502
17267 131502 43871 18753 16487 20506 -131286 -21464 -7506 -80310 -93397 -194565 -161805
17256 -161805 -63022 70030 81161 1539 39921 24438 -8532 41272 4847 -149444 -207217
17245 -207217 -89873 11972 21699 90565 35434 -142928 -242860 -186993 -74670 -146467 -300576
17234 -300576 -331048 -477717 -395568 -233108 -24553 170752 242561 252277 316749 229447 -27893
17223 -27893 -62157 -163902 -187153 -109502 -53528 -14249 -119842 -282325 -488058 -298257 -37739
17212c7739n0050J40259J65302j08290j98277j21554J7656j3784q7667n3005R3173
17201b53976O3979r6633o4184J47503J07653n12r1861q2298J3670j9161K04375
17190g1445K03328K36407j11306j04231p2514J00216K6402j23555j52051m8005
17180a16754q3778o3179J46738J32635J44798Q5827O8498k051m4757J9436J35949
17169D23362J62890j27694j67908k3935j66491j76267j08436J97582K12615n8578
17159A67140j4576J08242K6337j38974o2571o0303J19765p3371n1734o5638J67845
17148A22162J92056J82957J63662r0963j22191R662M9160o3075p7419j59119l06830
17137i9938N7393M4424k32238K4008K77617J84769K9478n416j87271j2919o1910
$$ plain form
17212 -37739 -87789 52470 217772 109482 -88795 -210349 -192693 -206477 -294144 -347149 -253976
17201 -253976 -189997 -286630 -350814 -203311 -95658 -96170 -188031 -270329 -256659 -275820 -71445
17190 -71445 131883 368290 256984 152753 80239 180455 206857 83302 -68749 -116754
17180 -116754 -200532 -263711 -116973 15662 160460 246287 314785 312734 267977 287413 423362
17169 423362 586252 458558 290650 266715 100224 -76043 -184479 13103 225718 167140
17159 167140 152564 260806 287143 148169 85598 25295 145060 71689 19955 -45683 122162
17148 122162 314218 497175 660837 569874 447683 457345 506505 443430 366011 206892 -99938
17137 -99938 -42545 1879 -230359 -206351 71266 256035 285513 280097 92826 79907 17997
17126A7997M1725o1784K9706K02295m9675q0878j14328M9489P8428M0545J3704
17115A67224o9987j36969J63651R7566m9550O433j23554m1965J74094K9843q1239
17104A35547J0578M1112j40042J00610Q7143O0270n5572Q2172m5469j47722j31036
17093b409l825L97792J16630Q436K1036m8615q3991J06587L3832j60721N4723
17082D39475N1759l133N5447J46213o4948m7965J89282K2761j8972j38406q9414
17071E42099M7467K9248m4641J36796M62291J32099j68706n3229j07621j5855
17061I59948J29625O4957J08716J41920J90549L60791J89567J27695K50736N31337
17051C055841N06429K12027N5308M4008J88325L34756M42428M62977K87170K95707
$$ plain form
17126 17997 59722 -2062 27644 229939 180264 99386 -14942 34547 112975 153520 167224
17115 167224 97237 -39732 123919 221485 171935 178368 54814 12849 186943 216786 135547
17104 135547 146125 187237 47195 147805 234948 295218 239646 321818 276349 128627 -2409
17093 -2409 -6234 391558 508188 516624 537660 489045 405054 511641 545473 384752 439475
17082 439475 491234 488101 543548 689761 624813 576848 766130 788891 769919 631513 542099
17071 542099 589566 618814 574173 710969 1173260 1305359 1136653 1083424 975803 959948
17061 959948 1089573 1154530 1263246 1405166 1595715 1956506 2146073 2273768 2524504 3055841
17051 3055841 3562270 3774297 3829605 3873613 4061938 4396694 4839122 5302099 5589269 5884976
17041E884976N40608R50322J289361J249099J274428J411323K525364M095906
17033A9221387O360604J0377129J7944650L0505711M2653657L4919517J0176869
17026A72159524J457617K7607085N8950124M0168701k2407178n9867763l7518246
17019A80549864m940372m113325k8468822m4007685l5238016k1282254j2390735
17012C0108655p587805m966328l370739k375512j571260j018401r68842j156413
17004G093355p85651o36398n11193m82869o00685m57053k06688O8406j27455k07693
16994C146076J30577J27925K2227q8992l04137l70321l58804r4386j96138j94309
16984A819718k87151j82918k46811k72906j45243J6012j36097n9219m4519o3612
$$ plain form
17041 5884976 6425584 7375906 8665267 9914366 11188794 12600117 15125481 19221387
17033 19221387 25581991 35959120 53903770 84409481 127063138 161982655 172159524
17026 172159524 173617141 201224226 260174350 300343051 277935873 218068110 180549864
17019 180549864 175609492 171496167 143027345 99019660 63781644 42499390 30108655
17012 30108655 22520850 17554522 14183783 11808271 10237011 9218610 8249768 7093355
17004 7093355 6307704 5671306 5160113 4677244 4076559 3619506 3412818 3481224 3353769 3146076
16994 3146076 3276653 3404578 3426805 3337813 3033676 2663355 2304551 2210165 2014027 1819718
16984 1819718 1532567 1349649 1102838 829932 684689 700701 564604 505385 460866 397254
16974C97254L1503o1388J03814J92399J4682j29384K3896k1887K3472j69885k17012
16963A87464j77840J01335J96913n9252k36153K23363J03939Q3254o8277j03296
16953B51450n7460J2246p9863L4706r771j45871J02147R5491n5920N8652o4783
16942A41024j2950M6473n0991m0393p2885J29473l3087j70470r3784N1704O8761
16931c7125j71600J6652J69567K58292q8218q5496l5311K5631P4927n5066p6204
16920c951K8436j2094K2366Q1987M9905M9630j95508J4972J91380j44035k36135
16909a53047l3224P5692j3789O4153J46257Q1154o9775J1451r3961j35789L3329
16898h7549l3737Q3243m8506j51202m0638L30802K11002m8240j61292m3622j42817
$$ plain form
16974 397254 428757 367369 471183 663582 678264 548880 572776 550889 574361 404476 187464
16963 187464 9624 110959 307872 248620 12467 235830 339769 423023 354746 251450
16953 251450 193990 206236 126373 161079 151308 5437 107584 203075 147155 205807 141024
16942 141024 128074 174547 123556 83163 10278 139751 106664 -63806 -157590 -105886 -37125
16931 -37125 -208725 -192073 -22506 235786 147568 62072 26761 52392 127319 72253 -3951
16920 -3951 24485 12391 34757 116744 166649 216279 20771 35743 227123 83088 -153047
16909 -153047 -186271 -110579 -124368 -60215 86042 167196 97421 108872 14911 -120878 -87549
16898 -87549 -121286 -38043 -86549 -237751 -278389 52413 263415 215175 53883 10261 -132556
16887a32556r7474J2825M2937o8947P3399L6998J11082K1846j37962k51811m1538
16876d31201Q0439O6394Q1199J23187J03536P5236k3759r2777P4206n9753j51231
16865a54524P0949K26953j402j43454r7357j9173J01215N4134R29k4335o2479
16854d8544N9677J36698j7673M9462N2884k11292r0028n7972L4011J58487P5519
16843A41229k3879n9063j81689K09772P5742M5637N7469J7341l5014o1119P7691
16832B64117j28335j18066p5831j15228J08615J06005j38370p2161q8974K2800
16822b35428J3231J47573r6867N5796P8296n0734J6748j59164j2637J53611j7166
16811a06741j42795j61759P8293L5780K01177L3349j2234J52220j28724k01400
$$ plain form
16887 -132556 -230030 -217205 -174268 -243215 -169816 -132818 -21736 110 -137852 -389663 -431201
16876 -431201 -350762 -284368 -203169 -79982 23554 98790 75031 -17746 56460 -3293 -154524
16865 -154524 -83575 143378 141976 -1478 -98835 -118008 -16793 37341 38270 13935 -48544
16854 -48544 11133 147831 130158 179620 232504 21212 -68816 -126788 -92777 65710 141229
16843 141229 117350 58287 -123402 86370 162112 207749 265218 282559 247545 186426 264117
16832 264117 135782 17716 -58115 -173343 -64728 41277 -97093 -169254 -258228 -235428
16822 -235428 -222197 -74624 -171491 -115695 -37399 -88133 -71385 -230549 -243186 -89575 -106741
16811 -106741 -249536 -411295 -333002 -297222 -96045 -62696 -74930 77290 -51434 -252834
16801b52834o8880M628J31798J78097M0747J06995j00559j12493Q4771J73055
16791A85325o8075k6347L8389j20999N9302j08393n8338l7497J38481K9404n252
16780B6000J02350P171j07552J32851L4870n0184j29012j48864M1106j406m5568
16769a38238J1458N5936R2238L3036L8464J13702m1354j24648j93995M871N3869
16758i4661Q4533n4620j40070p7243p8450J44141R5821J65937J02290j08956q1932
16747d3210n29m0901m9070k3674N4908R4956K15930k4291j79196j57661M2380
16736a10358P6487r7469l0719J925Q7601N1983j25888J11613R4200m443p2377
16725a7445M815p7483p0967l930O9501j96629O8380J04489N6776N1433k2455p5634
$$ plain form
16801 -252834 -321714 -317086 -185288 -7191 33556 140551 39992 -72501 12270 185325
16791 185325 117250 90903 129292 8293 67595 -40798 -99136 -136633 1848 31252 26000
16780 26000 128350 135521 27969 160820 195690 145506 16494 -132370 -91264 -92670 -138238
16769 -138238 -126780 -70844 21394 54430 92894 206596 165242 40594 -153401 -148530 -94661
16758 -94661 -10128 -64748 -204818 -282061 -360511 -216370 -120549 45388 147678 38722 -43210
16747 -43210 -43739 -84640 -133710 -157384 -102476 -7520 208410 184119 4923 -152738 -110358
16736 -110358 -33871 -131340 -162059 -160134 -72533 -20550 -146438 -34825 59375 54932 -17445
16725 -17445 -12630 -90113 -161080 -165010 -95509 -292138 -223758 -119269 -62493 -11060 -33515 -109149
16713a09149n4389L343Q2614O6845K3338Q1864M4417o8588j87117J7726K2033
16702g7063J73110J72264m2291k13543l12064M7151P7606k3161m6814R8963J02005
16691d3837J76998Q6413J5262j22475o8967j20690n488j38290j13720k656L5333
16680c02117J05496L6313r586J48523J03821o1973n9230J1987j2415j99316k13352
16669d51849l4185P3838K28732M4930L01068J24008j61897j33187l3586O7965
16659B5837n9180k1673J65671j82952l4864N5615K56840j04637j33496n1417k30224
16648c14480n1J07774N2734k6245n3826Q6416q556j6358O8432o4512p8600Q2345
16636a64927J07647K3195J17307N546M8054m6919j6661M6993J24169l0159r2139
$$ plain form
16713 -109149 -163538 -160195 -77581 -10736 12602 94466 138883 70295 -116822 -99096 -77063
16702 -77063 96047 268311 226020 12477 -299587 -252436 -174830 -197991 -244805 -145842 -43837
16691 -43837 133161 219574 234836 112361 43394 -77296 -82784 -221074 -334794 -337450 -302117
16680 -302117 -196621 -160308 -169894 -21371 82450 20477 -38753 -26766 -39181 -238497 -451849
16669 -451849 -486034 -412196 -183464 -138534 162534 286542 124645 -8542 -42128 25837
16659 25837 -33343 -55016 110655 -72297 -107161 -51546 205294 100657 -32839 -84256 -314480
16648 -314480 -314531 -206757 -154023 -180268 -234094 -147678 -156234 -172592 -104160 -168672 -247272 -164927
16636 -164927 -57280 -34085 83222 88768 136822 89903 73242 120235 244404 214245 122106
16625A22106k9743j06156J01080m3081K18634J02813j52865o8832o0221m7807
16615C5928m3298K9657m4761j86334j20168J75755J69213l1347n1593O049L8650
16604b2249l2771J09937j4521l7558p160j346j84446q0731J53860K5861o2924
16593a54048j4406j00449j53689k3571J37834J62002M4221j7088R814L2901P7659
16582A180N127N8371q8726j3724N4540r8695p2034J32407j69694M9471J37257
16571d520L0409k2742k35377j7694J83738J17254L9612R5385k2889j20813l1963
16560A0400j25040q348j5278j24466J29893P4052J18387M490q7149j41703N7891
16549a06871k3106p7891p8011J7880K06000l0266M1981K8417L1245J16632q162
$$ plain form
16625 122106 92363 -13793 87287 44206 262840 365653 212788 143956 83735 35928
16615 35928 -7370 22287 -22474 -208808 -328976 -153221 15992 -15355 -66948 -60899 -22249
16604 -22249 -55020 54917 40396 2838 -4322 -5668 -190114 -270845 -116985 -91124 -154048
16593 -154048 -168454 -268903 -422592 -446163 -308329 -146327 -102106 -119194 -109380 -76479 1180
16582 1180 6307 64678 -24048 -37772 16768 -81927 -153961 -21554 -191248 -141777 -4520
16571 -4520 25889 3147 -232230 -249924 -66186 51068 90680 186065 163176 42363 10400
16560 10400 -114640 -122988 -138266 -262732 -132839 -58787 59600 64090 -23059 -164762 -106871
16549 -106871 -129977 -207868 -285879 -267999 -61999 -92265 -50284 -21867 9378 126010 117848
16538A17848Q299R2591R7478M0752j51238j56474l0841r2098L1219J37984N8688
16527A54208K1483O4280o3069j53234k35432p2959J46945M6231K1906R3276j51031
16516a27396j04767k4277J08061M5530J13991j9201K4750N4240j1459m6903r1130
16505g8561J0868R5286O0559p1061P2351j12079J28306P9612N8870q6720j36025
16494B1406J6676M7048n7730j12785m8758N9899m2086P6449K05111K3713j86438
16483B505n3322o9476L354J47466P090K1625j6286K8365J9359Q4530Q5727j73740
16471H7197o5560O8606J06155q8819O9686k8334j9419J51300L4997j77290p5944
16460F2575p5288o1286O5079Q5476J57286R746R1444L79103K83386j15589J4403
$$ plain form
16538 117848 126147 218738 316216 356968 205730 49256 18415 -73683 -42464 95520 154208
16527 154208 175691 239971 176902 23668 -211764 -284723 -137778 -91547 -69641 23635 -127396
16516 -127396 -232163 -256440 -148379 -102849 11142 -8059 16691 70931 59472 12569 -78561
16505 -78561 -67693 27593 88152 17091 89442 -22637 105669 185281 244151 157431 21406
16494 21406 38082 85130 27400 -85385 -134143 -74244 -116330 -39881 165230 188943 2505
16483 2505 -50817 -120293 -116939 30527 37617 59242 42956 71321 90680 175210 260937 87197
16471 87197 21637 90243 196398 107579 177265 148931 129512 280812 315809 138519 62575
16460 62575 -12713 -73999 -8920 76556 233842 243588 335032 714135 997521 881932 896335
16449H96335N1706J32099L26484L2921k71021q4470m0828p7748j87539k79223
16439D98716j96375j49502p1107J7517J17409M3593q2241l6027j9221r9640l7660
16428a4538j05349K8972J02317n2292O4920J80026l2701j48383k1400j8238J08
16417a6558Q6861Q9476O8621N184M3923R87k22690k43417l478L380l4290R6698
16405a25303o0590l0589R6206R6460k7773J25730r2807J38960R9288O4972k7004
16394B57550J28581J63347k8675j82471n6108K6093j13801k80171J671K24724
16384A40740j36473j5680Q8975j49603J0566k2253j36105r2032O4183J70341K5461
16373e1880j44618J09432J62288p9129j57795j61372J16432J12155J8750j42466
$$ plain form
16449 896335 948041 1080140 1406624 1439545 1168524 1084054 1043226 965478 777939 498716
16439 498716 302341 152839 81732 99249 216658 260251 178010 141983 122762 23122 -14538
16428 -14538 -119887 -90915 11402 -40890 24030 204056 171355 22972 1572 -16666 -16558
16417 -16558 70303 159779 228400 233584 277507 278494 55804 -187613 -191091 -187711 -222001 -125303
16405 -125303 -185893 -216482 -120276 -23816 -51589 74141 -18666 120294 219582 284554 257550
16394 257550 386131 549478 520803 338332 282224 308317 194516 -85655 -83984 140740
16384 140740 4267 -11413 77562 -72041 -61475 -83728 -219833 -311865 -247682 -77341 -51880
16373 -51880 -196498 -87066 75222 -3907 -161702 -323074 -206642 -94487 -75737 -218203
16363b18203k9699J21535N8720p3288J3713O3387J36336J84785l7257m4032j39390
16352C6607j05118n7414m5497J8557q8031j90345J7482Q4809J95130j0865j18943
16341b63628M1810K89293J03559k05063j49770o4156M510M5062p2487P6836M0902
16330a53132M1197j18772l074o7602o2501R056J54583O7305q2482J48057K27564
16319A60199J7377j86533j53813j56166k3377J02619K08418J30014q6234q7063
16309g4559p2103P1986j14618J52257R3652q3893j01754n6017J59088O920l0579
16298d9620k97l7210n0903j64140q2849p7028J36537J56499K20516q0537p02Q0407
16286E0673j35309r3930O283M9318l9560O3996J38838l7868o8830o194j3264J35646
$$ plain form
16363 -218203 -247902 -126367 -67647 -140935 -127222 -63835 72501 257286 220029 175997 36607
16352 36607 -68511 -125925 -171422 -152865 -240896 -431241 -413759 -328950 -133820 -144685 -263628
16341 -263628 -221818 67475 171034 -34029 -183799 -247955 -243445 -198383 -270870 -194034 -153132
16330 -153132 -111935 -230707 -233781 -301383 -363884 -354828 -200245 -132940 -215422 -67365 160199
16319 160199 177576 -8957 -162770 -318936 -342313 -239694 -31276 98738 12504 -74559
16309 -74559 -146662 -74676 -189294 -37037 56615 -27278 -129032 -185049 -25961 -19041 -49620
16298 -49620 -49917 -87127 -138030 -302170 -385019 -462047 -325510 -169011 51505 -29032 -29734 50673
16286 50673 -84636 -178566 -172283 -122965 -162525 -98529 40309 2441 -66389 -72583 -85847 49799
16274D9799r699n9010j4925q8365L0855M5791k3373K4219O6342O260j70307J7654
16262a24759J45417J00131K1735j52222k81103J1001O5048O2780J93635J32294
16252A73957K1448J86787j45269r1166j46988j04439o0245P4603O0772O8898j53575
16241a15217m6697N7701J1733m0078M20M1664j20318j33438L7568j22331k0212
16230d49205q4355K9410K46923K33505p3857r9785L279n0577o6268p6545J58234
16219b29241J05867j7037J11142N4816M465k6865l5885n6866M8431L9662j5164
16208a6675n0680L5693J23927O9070m7090j23736K1129N3042j53348j92954J01329
16197a80293J81148J65797j17938k19783k8960J1680L1611P2576J9145n05j37227
$$ plain form
16274 49799 40100 -18910 -33835 -122200 -91345 -45554 -68927 -44708 21634 27894 -142413 -124759
16262 -124759 20658 120789 142524 -9698 -290801 -279800 -214752 -151972 41663 173957
16252 173957 195405 382192 236923 145757 -1231 -105670 -165915 -91312 -30540 38358 -115217
16241 -115217 -161914 -104213 -92480 -132558 -132138 -90474 -210792 -344230 -306662 -428993 -449205
16230 -449205 -533560 -504150 -257227 -23722 -97579 -197364 -194085 -244662 -310930 -387475 -229241
16219 -229241 -123374 -140411 -29269 25547 30012 3147 -32738 -89604 -41173 -1511 -16675
16208 -16675 -67355 -31662 92265 161335 114245 -9491 11638 64680 -88668 -281622 -180293
16197 -180293 855 166652 48714 -171069 -200029 -188349 -156738 -84162 -65017 -65522 -202749
16186b02749j16795J07301Q9189J2133L4972j26929q8437R2725J09082M1961J50049
16175A02502P356q5508j05753J04188p0017n3750q541j11936p0249J5837P1730
16164b04141n0827P2154K32690M7930j49092r4345L9883J64511J7886j99582k56718
16153c79651L4845K75385J7237l0330P3844N8180O4298p09j26072q4694j0604
16142a08271J65269K3488j42732k4251k0983J01241n305M6118L9223P7607M8258
16131A99662j61989j11128n6419p7165j5668K9221r8426N7965J45985K41070J03033
16120B56141j47551j39308P0277Q7932j10581n4458J8581R020M5190j904L9583
16109G2922m1481k1143j10716J49257K0800p255K6292q6252R9825j4586j16772
$$ plain form
16186 -202749 -319544 -212243 -123054 -110921 -75949 -202878 -291315 -198590 -89508 -47547 102502
16175 102502 109858 24350 -81403 22785 -47232 -100982 -109523 -221459 -291708 -275871 -204141
16164 -204141 -254968 -182814 49876 97806 -51286 -145631 -105748 58763 76649 -122933 -379651
16153 -379651 -344806 -69421 -52184 -82514 -8670 49510 113808 113099 -12973 -97667 -108271
16142 -108271 56998 80486 -62246 -86497 -107480 -6239 -11544 34574 73797 151404 199662
16131 199662 37673 -73455 -129874 -207039 -222707 -193486 -291912 -233947 -87962 153108 256141
16120 256141 108590 -30718 39559 127491 16910 -37548 -18967 -9947 35243 33339 72922
16109 72922 31441 10298 -100418 48839 69639 62384 88676 2424 102249 87663 -29109
16098b9109j65047o1j08212Q5529l2908j43927L3157K44568K15204n0138o2764
16087a3708j32049R6993J13693M3569r0826R8918q9763K5868J67483j8850j91076
16076A0252k02108j28025k3626J75917K09548Q8750M1497k05745q8833j76908
16066b99281q0831J25285N4855n8714O0536Q8611K0458M2478J57619K9481o7215
16055G3282L5529j54367j44181O0086n967L0475l543Q5062J00466l1844p4236
16044b9238j5926j14981k1646P3638J4818J459J28674M1654J14085j41387m1j05512
16032e4403j21431J5605q6223k8934L8140r2335j09337J29231N6820O00m999n2848
16020c10114J29389J00371j09846n9974j01621Q3422J64874K0018l6368j01160
$$ plain form
16098 -29109 -194156 -194217 -302429 -216900 -249808 -393735 -360578 -116010 99194 49056 -13708
16087 -13708 -145757 -48764 64929 108498 17672 116590 26827 52695 220178 201328 10252
16076 10252 -191856 -319881 -343507 -167590 41958 130708 172205 -33540 -122373 -299281
16066 -299281 -380112 -254827 -199972 -258686 -198150 -109539 -89081 -46603 111016 140497 73282
16055 73282 108811 -45556 -189737 -129651 -135618 -105143 -108686 -23624 76842 44998 -29238
16044 -29238 -45164 -160145 -181791 -108153 -93335 -91876 36798 78452 192537 51150 51109 -54403
16032 -54403 -175834 -160229 -246452 -275386 -237246 -329581 -438918 -309687 -252867 -252267 -257266 -310114
16020 -310114 -180725 -80354 -190200 -250174 -351795 -268373 -103499 -83481 -119849 -221009
16010b21009J0400M7677J71971M7952K4366k0689n0644J04595j10322R2971J12269
15999B09537m2727r0148Q351m049n6020M5733N3843k9551r4945j17683J82638
15988F4979P0912q991j5169o9651q0318J01174Q4183p8317J31j3818J93467q39
15976B47743r8161j8259o3283l5620L021L0818M4110Q6164K9452j93788k68904
15965b36707K6306L3775J08744K3181j3984M5136K40369m3588o2833K0059M8236
15954A88694j9618o1482j31797j34074m2170J83846J18323j25184r4205J57395
15944C9728K49815L7209j11237j61259j21489M0089n2362J18885J27720O8619
15934B35718k07706J3034j83895J35516O1017j13205n1950K4888p1298M7451K17884
$$ plain form
16010 -221009 -210609 -162932 9039 56991 81357 60668 10024 114619 4297 97268 209537
15999 209537 166810 76662 85013 80964 24944 70677 124520 94969 24 -117659 64979
15988 64979 135891 126900 111731 42080 -38238 62936 147119 68802 68933 55115 248582 247743
15976 247743 149582 131323 68040 32420 35441 66259 110369 196533 225985 32197 -236707
15965 -236707 -210401 -176626 -67882 -44701 -58685 -13549 226820 183232 120399 140458 188694
15954 188694 169076 107594 -24203 -158277 -200447 -16601 101722 -23462 -117667 39728
15944 39728 289543 326752 215515 54256 -67233 -27144 -79506 39379 167099 235718
15934 235718 28012 41046 -142849 -7333 53684 -59521 -111471 -86583 -157881 -110430 107454
15923A07454J81516n180m6094l00611j17294j01324R3382k579r2390j01091M6035
15912c38176J85215M2199j18973R3680K07367J26193R62q5192r4084k9515O6121
15901E5797J942p8012L5080K4345j442J44811M6072j14322m4178J14642q5786
15890I8949j75933K4534N5833N5159J9516Q9866j4776k6678l22332j51417Q1122
15879b66157J72907M8619J59199r9359p0630j12429j41496J02747J19414K1321
15869f5864l4918k3379J15255r630l1735k92993J34431O3511K8903R1815j93996
15858b18600j23857J18807Q8197O8238r7289J28546J25609l4968R3417l21N255
15847A53034k78243j14889J37923k7090j08528J16825R364j59594j14821K13174
$$ plain form
15923 107454 288970 283790 237696 -62915 -180209 -281533 -188151 -190730 -283120 -384211 -338176
15912 -338176 -152961 -110762 -229735 -136055 71312 197505 198467 113275 19191 -10324 55797
15901 55797 57739 -20273 14807 39152 37710 182521 228593 114271 70093 184735 98949
15890 98949 -76984 -52450 3383 58542 78058 167924 153148 126470 -195862 -347279 -266157
15879 -266157 -93250 -44631 114568 15209 -55421 -167850 -309346 -206599 -87185 -65864
15869 -65864 -100782 -124161 -8906 -18536 -50271 -343264 -208833 -145322 -116419 -24604 -218600
15858 -218600 -342457 -223650 -135453 -67215 -164504 -35958 89651 54683 148100 147779 153034
15847 153034 -125209 -240098 -102175 -129265 -237793 -120968 -111604 -271198 -386019 -172845
15837a72845K92736k25728j48653J02221J8263O4770n4867o0057J2264r141j10588
15826b91625k27647j5064J80682L86291N2505K3391r3356j41420k7635O8876K0805
15815f4197k5055j44798L2165P0074l8151N5701R3232R2122j5088k9716N4260
15804H0549K4511l9645j04508J68782P2525j45291n6704l9150L3547J42853p9841
15793E7628o678j67124j01915k7358R8593r0110J26755J76741j20632P5969J80068
15782B01937O4876m4688k0892M4093j5093j2877m1503j36588j89776l6380r7523
15771b84414K03625Q2057O3560m1685N3699j8844n176q038n2580O8178o9411m7499
15759e6528Q890L5312q0819j905N8419R0770Q4187Q0985k15092q6970J9796l3013
$$ plain form
15837 -172845 119891 -105837 -254490 -152269 -134006 -69236 -124103 -184160 -171896 -181037 -291625
15826 -291625 -519272 -534336 -353654 32637 85142 108533 15177 -126243 -153878 -85002 -64197
15815 -64197 -89252 -234050 -201885 -131811 -169962 -114261 -21029 71093 56005 26289 80549
15804 80549 105060 65415 -39093 129689 202214 56923 219 -38931 -5384 137469 57628
15793 57628 50950 -116174 -218089 -245447 -146854 -236964 -110209 66532 -54100 21869 201937
15782 201937 266813 222125 201233 245326 230233 217356 175853 39265 -150511 -186891 -284414
15771 -284414 -80789 1268 64828 23143 76842 57998 52822 44784 -7796 60382 -9029 -56528
15759 -56528 -47638 -12326 -93145 -95050 -36631 54139 138326 219311 4219 -82751 -62955 -95968
15747i5968J49671J61694n3590j41237j46822P9004J41490J79186r4422p6471
15737A02535q0411k4680J211o0336N5159J07699j9063K6137o186j47101l4020
15726g9056R3588r6572p1078j462J19443J58772k3830K6305j34137k28231n100
15715b41358j4451J70372L4725O0898j63897j48030m876J31398m5626k47742l0833
15704d99420J80911J94799L0461j05270j67904L80J65337J57114Q9569k84542
15694b38565j6034K25441J32587n123r0054P2442o5197j21995q9627p5545J61116
15683a10554P2554r9013R3406R9366M6342J54238j10223j39041P2342J66447R3544
15672C39408j00617r1069N0460M0952q4438m4878j53676j60035l3734J15095Q2467
$$ plain form
15747 -95968 53703 215397 161807 20570 -126252 -47248 94242 273428 179006 102535
15737 102535 22124 -2556 -1345 -61681 -6522 101177 82114 108251 102065 -45036 -79056
15726 -79056 14532 -82040 -153118 -154580 -35137 123635 99805 126110 -8027 -236258 -241358
15715 -241358 -255809 -85437 -50712 10186 -153711 -301741 -306617 -175219 -220845 -468587 -499420
15704 -499420 -318509 -123710 -93249 -198519 -366423 -366043 -200706 -43592 45977 -238565
15694 -238565 -254599 -29158 103429 98306 8252 80694 15497 -106498 -196125 -271670 -110554
15683 -110554 -38000 -137013 -43607 55759 102101 256339 146116 7075 79417 245864 339408
15672 339408 238791 147722 198182 239134 154696 109818 -43858 -203893 -237627 -122532 -40065
15661d0065q2446J16343Q9955K3565k0840k24280j30774R7684P3531r1346n705
15650a94378R3230R4486l1975o250J17120K09934j1096o7138m1893j18648L2810
15639G6202R7416J0568j28456L5101L6832m0340r0556k25003k7686K77298K10508
15628B31884J09375r63j17824l7192P3965l1826m6044J36162p5233k73095l13708
15617c44499L2266J33689R8276K7907m5790k4090L5147J2047j09814r5541j9274
15606b99676o0610R840J44611K6803l5768N3590K23413J96071J1709j01541L2819
15595B01261m1151j81205j3394J68838R6937l5966o9569r8029J02534q135n8108
15584F4013j70716o0338P5337J15859J62920r4654Q011L6899K5999p4620k1585
$$ plain form
15661 -40065 -122511 -6168 83787 107352 86512 -137768 -268542 -170858 -97327 -188673 -194378
15650 -194378 -101148 -6662 -38637 -44887 72233 282167 271071 203933 162040 43392 76202
15639 76202 173618 184186 55730 90831 127663 87323 -3233 -228236 -255922 21376 231884
15628 231884 341259 340296 222472 185280 259245 227419 181375 317537 242304 -30791 -344499
15617 -344499 -312233 -178544 -80268 -52361 -98151 -122241 -87094 -75047 -184861 -280402 -299676
15606 -299676 -360286 -350446 -205835 -179032 -214800 -161210 62203 258274 269983 168442 201261
15595 201261 160110 -21095 -34489 134349 231286 195320 125751 27722 130256 122121 64013
15584 64013 -106703 -167041 -91704 24155 187075 92421 100432 137331 163330 88710 67125
15573F7125L2520j21751q9310m474O101N7513M4425K8237R1680J5076j20169O609
15561A3582J21193k3493q6355R3234n116j03671q993K2555p4851m6695k2063P7025
15549d3648O8370M0811M0459k5672N1745L8106P6379Q7928m9987j66110o8253
15538E0128j09159O1002J09223j0256m5941L9563J2683q1256Q240l883m1510O9739
15526E8573k2065o3705K2047N0489J32052o5143J6209j60691r2114J7324J45367
15515C8343q4877m9223m9962o7722m6307L5387M1074J98451J18575N4478r2902
15504I5315j09340n9850Q0876K6830J52592q2291j79960j5798J83352J62582j62864
15493I1444n6762Q778j21133N2892N1146J0463J05385o1054m129J26465Q4430
$$ plain form
15573 67125 99645 -22106 -111416 -115890 -109789 -52276 -7851 20386 112066 127142 6973 13582
15561 13582 134775 111282 24927 118161 113045 9374 381 22936 -51915 -98610 -120673 -43648
15549 -43648 24722 65533 105992 80320 132065 170171 246550 334478 284491 118381 50128
15538 50128 -59031 1971 111194 100938 54997 94560 107243 25987 34227 30344 -11166 58573
15526 58573 36508 -27197 -5150 45339 177391 112248 128457 -32234 -124348 -107024 38343
15515 38343 -46534 -95757 -145719 -213441 -259748 -224361 -183287 15164 133739 188217 95315
15504 95315 -14025 -73875 7001 33831 186423 104132 -75828 -91626 91726 254308 91444
15493 91444 34682 43460 -77673 -24781 26365 36828 142213 81159 77030 203495 287925
15482B87925q8457q4251Q6351l2042p8519j2923J16516j49468Q3718O0901R6170
15471B85921p1534j52046k8486l788o0109L9248l764J05240J22375k7748j40357
15460F4952l3402R808K4086M8544M0352P5931J60342p8309j41801j22067q4102
15449c5666J32779n5210k1169q4599j39331m2913j05026M0113j06765J85475J61010
15438g1302J83275M2225j88274O0980J49615J459j89861j29339r0600O6653R3382
15427g1787K27138J46226k3321j18656k12773j4226K526M4365L04122O6622r4313
15416B55923m27912k74782L3321J36099p336K7103J38044J31883j4024p0268l6667
15405a08616J3932m5949q6720O0555j7472j32034p1022K18867Q4017q3555q1589
$$ plain form
15482 287925 199468 115217 201568 169526 91007 78084 194600 45132 128850 189751 285921
15471 285921 214387 62341 33855 30067 -30042 9206 5442 110682 233057 205309 64952
15460 64952 31550 41358 65444 113988 154340 230271 390613 312304 170503 48436 -35666
15449 -35666 97113 41903 20734 -63865 -203196 -246109 -351135 -311022 -417787 -232312 -71302
15438 -71302 111973 154198 -34076 26904 176519 177978 -11883 -141222 -231822 -165169 -71787
15427 -71787 155351 301577 278256 159600 -53173 -67399 -64873 -20508 283614 350236 255923
15416 255923 -171989 -446771 -413450 -277351 -284687 -257584 -119540 12343 -1681 -71949 -108616
15405 -108616 -94684 -140633 -227353 -166798 -184270 -316304 -387326 -168459 -84442 -167997 -249586
15394b49586O2715J26761J50312q7356K3810n7533n5434O7467J49790J71267J835
15383C04048j81916l1489J42599j25123j13932j1349J49390j3583k27653q6261
15373a95269P3581q8472J58672J70621M8618Q4424J12656j32015k59448o956J08345
15362G4757L850J71600M5213k15007Q643n9115k7534r5942k2806K06751L6209
15351A26619k10498R3178M5472J24701O5216j59536j38828M0432L1410L2639J03694
15340A54499R225j42576L5644j0729j20260r6416n520j2894J47475J89716O7600
15329B15764j99029j13083j09772L9140J80428J11502p6315j48525q4472j8348
15319b02710m3650J30821j959J28587Q0190r9318j89055r664J32589Q3833o6094
$$ plain form
15394 -249586 -186871 -60110 90202 2846 26656 -30877 -86311 -18844 130946 302213 304048
15383 304048 122132 90643 233242 108119 -5813 -17162 132228 118645 -109008 -195269
15373 -195269 -121688 -210160 -51488 119133 167751 252175 364831 232816 -26632 -33588 74757
15362 74757 78607 250207 295420 80413 89056 29941 2407 -93535 -116341 90410 126619
15351 126619 -83879 9299 54771 179472 244688 85152 -53676 -13244 18166 50805 154499
15340 154499 163724 21148 56792 46063 -74197 -170613 -176133 -189027 -41552 148164 215764
15329 215764 16735 -96348 -206120 -166980 13448 124950 48635 -99890 -184362 -202710
15319 -202710 -246360 -115539 -117498 11089 91279 -8039 -197094 -206758 -74169 9664 -56430
15308e6430J131M743K1993Q3897N9645j36012j32680r2305M0097J9561J10193
15297g6167J39945P3580L2763m3404l0184p7601p2618k8520o3471j2944K047M8042
15285a08532J38055K6944j54802K366O8692J5073N2341K6760o0639k824J04709
15274A08143J67940L9559q4302j33061o3807j58082J38178J86463j70700k31799
15264b01468M2285P4081Q1376j6891j63539P0227Q1686k7639j06629M9924J03468
15253a3119J3997O0206m9741m6098n6914k2186J10017N6660n6264j59294O348
15242a56388J08166m7625N0926K11270O6503R13j140k25943j66289p2352J5188
15231b16771R9202j788k365J2806k419Q5135P561P928n9802J59262O0168j1738
$$ plain form
15308 -56430 -55299 -50556 -28563 55334 114979 -21033 -153713 -246018 -205921 -186360 -76167
15297 -76167 63778 137358 170121 126717 96533 18932 -53686 -82206 -145677 -158621 -156574 -108532
15285 -108532 29523 56467 -98335 -95969 -27277 -12204 40137 66897 6258 3434 108143
15274 108143 276083 315642 231340 98279 34472 -123610 14568 201031 30331 -201468
15264 -201468 -159183 -85102 -3726 -20617 -184156 -113929 -32243 -59882 -166511 -116587 -13119
15253 -13119 878 61084 11343 -34755 -91669 -113855 -3838 52822 -3442 -162736 -156388
15242 -156388 -48222 -95847 -44921 166349 232852 233765 232625 6682 -159607 -231959 -216771
15231 -216771 -117569 -119357 -121722 -108916 -111335 -26200 -18639 -10711 -70513 88749 148917 137179
15219A37179r8004j11272J87057J034q0191n6623K4266O0803j73360R721J38904
15208C9514J15140n9692Q0139m4571r0148l9960j35131m7580K00093J12875k3191
15197A07488q7765j27771R2903K6781j832j26190o916P9161O4483K0157l8650
15186A849J863M1730p9260n1918o171K5831q5407q230j03048P6387n7849r6008
15174c40231J58841J3504N0653k2942L4251j34432J408J82594J12890k24332j47254
15163c15050Q044L958K45188J92728j71517J48963J90972L6846l3646j85j87360
15152A18941j48777Q2458J58185J87510j64593Q3501j0833j04651r1201O5007
15142A75547J68047j42172j31846L9689K43050k09219r9801K8762o5269q2901
$$ plain form
15219 137179 39175 -72097 114960 115994 35803 -20820 3446 64249 -109111 -99390 39514
15208 39514 154654 94962 175101 130530 40382 422 -134709 -182289 17804 130679 107488
15197 107488 19723 -108048 -15145 11636 9804 -116386 -123302 -44141 20342 40499 1849
15186 1849 3712 45442 -33818 -85736 -91907 -66076 -151483 -159713 -262761 -186374 -244223 -340231
15174 -340231 -181390 -167886 -117233 -140175 -105924 -240356 -238948 -56354 56536 -167796 -315050
15163 -315050 -307006 -303048 -57860 134868 -36649 112314 303286 340132 306486 306301 118941
15152 118941 -29836 52622 210807 398317 233724 317225 306392 201741 110540 175547
15142 175547 343594 201422 69576 109265 352315 143096 43295 72057 6788 -76113
15132g6113j297n7092j57014R7732K27087K7143K89130N6420p5041k76693k9451
15121B4811p6742Q2801N8943P8350N4705J17027J1465j64628k1547r3243n2864
15110A9078m1887j5016j24855j04579K8903N0715K19123l5387M0422j12113j66227
15099b41823K34844L1719K951R836J78631O2261p5988k0923j6293J8068m496j3356
15087A65431o1027N8368N9887q6951l683k2363j70997j4258n417r990P3794N9174
15075D1968L1023r9693N3702R7324M3769J15880L8773j50935n2885J26303N3557
15064B98786j20617j03214O396N5815o5340q390j60069j47918j0297J7861K66719
15053B9732N0068L5487l6523j00217k9468J41495l1047j48545J16349J52962P105
$$ plain form
15132 -76113 -77410 -134502 -291516 -193784 33303 60446 349576 405996 330955 54262 24811
15121 24811 -51931 30870 89813 168163 222868 339895 351360 186732 165185 71942 19078
15110 19078 -22809 -37825 -162680 -267259 -238356 -187641 31482 -3905 36517 -75596 -241823
15099 -241823 -6979 24740 27691 37527 216158 278419 202431 181508 165215 183283 178787 165431
15087 165431 104404 162772 222659 135708 132025 109662 -61335 -75593 -81010 -91000 -17206 41968
15075 41968 72991 -26702 27000 124324 168093 283973 322746 171811 118926 245229 298786
15064 298786 178169 74955 81351 137166 71826 63436 -96633 -244551 -254848 -236987 29732
15053 29732 79800 115287 78764 -21453 -50921 90574 59527 -89018 27331 180293 187398
15042A87398r9389p2686n7492k01241J27068m410K9220M6524J7561p6295m0952
15031a44694J43171K05303O2949J26583j03771j72062j61301m182q6569n8928
15021a93501L0535L5413j03693M9688J94440R0460Q390O6225j4728q8329K1838
15010I6738L3026j61791m8260K5431J7402p4265L7302Q8410J16980k78881p3002
14999b20910P5281l5505R2776J07618m9867Q3503Q9604m4954q4137o2071q5694
14988a34356J32461K50334N0227j4079j31750p8059r0673l0205J22159M7768j05677
14977A8150n1082J59834J3612j52321K5548J87496J22744k9415M870J73261n7190
14966D15507k28046j25660n6104j3771r9J18616l9716k00783o7353M2211J61425
$$ plain form
15042 187398 88009 15323 -42169 -243410 -116342 -120752 -91532 -45008 -27447 -103742 -144694
15031 -144694 -1523 203780 266729 393312 289541 117479 -43822 -48004 -134573 -193501
15021 -193501 -162966 -127553 -231246 -181558 12882 103342 111732 177957 163229 74900 96738
15010 96738 129764 -32027 -80287 -54856 -37454 -111719 -74417 13993 130973 -147908 -220910
14999 -220910 -145629 -181134 -88358 19260 -30607 52896 142500 97546 13409 -48662 -134356
14988 -134356 -1895 248439 298666 284587 152837 74778 -15895 -46100 76059 123827 18150
14977 18150 -32932 126902 140514 -11807 13741 201237 323981 294566 299436 472697 415507
14966 415507 187461 61801 5697 -8074 -8173 110443 70727 -130056 -197409 -155198 6227
14955F227L4176P2113j47235k5353K72340J81954o0727k76526k39087q9015J41723
14944a29410J5414Q373K076r2686q7770Q7412R6609j22027L3900L2053P7533J62327
14932H3804O1989r7445J19071Q1648j81226N6530J13311l0697j44544j82609j05598
14921b25766J46121K16753N6532r5774J80988J0424r2363j85399n0625O5789j94883
14910a68203j03994K33751J35178j673l8040j54498j2660M1413P4951o5510m7278
14899a06563j21785l8188N867K01133J33813q7382K7016L9894k4820j86823j71220
14888c29058R6647J79365J0578J687j41671k330J39568r822o2348p509Q2948m1232
14876h3177P8380o000j07143r0528J57176J64022M2018j44095J37341M6317q0499
$$ plain form
14955 6227 40403 112516 -34719 -60072 212268 394222 333495 56969 -182118 -271133 -129410
14944 -129410 -113996 -105623 -103547 -196233 -284003 -196591 -99982 -222009 -188109 -156056 -78523 83804
14932 83804 145793 48348 167419 249067 67841 124371 237682 206985 62441 -120168 -225766
14921 -225766 -79645 137108 193640 97866 278854 289278 196915 11516 -39109 26680 -168203
14910 -168203 -272197 -38446 96732 95059 57019 -97479 -110139 -68726 6225 -59285 -106563
14899 -106563 -228348 -266536 -260669 -59536 74277 -13105 13911 53805 28985 -157838 -329058
14888 -329058 -232411 -53046 -42468 -40781 -182452 -184782 -45214 -55036 -117384 -124893 -41945 -83177
14876 -83177 -4797 -10797 -117940 -208468 -51292 112730 154748 10653 147994 194311 113812
14865A13812m7320m3773P0098P3440p6530M2931K681l406j99719N1937P8826j61658
14853i8681j46359Q0967J13731k9131k5678j60955j52247J5427N3893m1608m2641
14842d33282P2080K85137J23048m9055o536j99698P3286m6812j33237K1200M1634
14831b52235p5226J8201J77058K17142J8015M7159j8461Q765Q2958j3481k97977
14820h8082L8312K07096r1017j25033J6170J60458N8169r2663j49260J3548Q0319
14809B8017r060m8928J29515K2022q0368M3207J00170j4004j39697L988O060L7826
14797G8748q4494J59903L6216o6881p662Q2168J1798R0357n5851j04253k8740
14786A11309R9992K09789L4021p3854j5872l24034k18764l1868k8920n302J33045
$$ plain form
14865 113812 66492 22719 92817 166257 89727 132658 135339 131933 -67786 -15849 62977 -98681
14853 -98681 -245040 -164073 -50342 -79473 -105151 -266106 -418353 -402926 -349033 -390641 -433282
14842 -433282 -361202 -76065 46983 -2072 -8608 -208306 -135020 -181832 -315069 -293869 -252235
14831 -252235 -327461 -309260 -132202 84940 102955 150114 131653 140418 223376 209895 -88082
14820 -88082 -49770 157326 66309 -58724 -42554 117904 176073 83410 -65850 -52302 28017
14809 28017 18957 -29971 99544 121566 41198 84405 184575 170571 30874 34862 40922 78748
14797 78748 -5746 154157 190373 123492 115830 197998 209796 300153 244302 140049 111309
14786 111309 211301 421090 455111 381257 365385 41351 -177413 -209281 -238201 -243503 -110458
14775a10458R8476J03352J20131j69555m6811p4149J48962J23771j83188j2517
14765a986K7093l7665N5976j15831Q0102L7694J10972j5819j33482k4834J4270
14754c510J31064J61380n7185Q3851J59304J74126Q5283P0148m4101L3283J29410
14743I23053J6196J00090q4136M1654r0062k80657r0712j78960p4546r1386J18561
14732C09095K2124J4751j0864p355O9550P297j92067n1214J61729p8463m6934
14721A97649j04462L4208P6641Q1883R4833m0354J5085J470J7509J19935J11837
14710F06234J23507R2691o6450L4028J63403J86561L6437N8058j31690j65233
14700I37546l6137q7862j74112k39529j64372r6028j34586p2115K28506L3560
$$ plain form
14775 -110458 -11982 91370 211501 41946 -4865 -79014 69948 193719 10531 -1986
14765 -1986 25107 -12558 43418 -72413 7689 45383 156355 140536 7054 -17780 -3510
14754 -3510 127554 288934 231749 315600 474904 649030 734313 804461 760360 793643 923053
14743 923053 939249 1039339 955203 996857 906795 626138 535426 356466 281920 190534 309095
14732 309095 331219 345970 335106 327751 397301 404598 212531 161317 323046 244583 197649
14721 197649 93187 127395 204036 285919 380752 340398 355483 356953 374462 494397 606234
14710 606234 729741 822432 755982 790010 953413 1139974 1176411 1234469 1102779 937546
14700 937546 901409 813547 639435 399906 235534 139506 4920 -67195 161311 194871
14690A94871l077q0716j15919l6263n9456j53779L2946k0354O9353J15709j5348
14679g2033K15407l8656K8075q2411m5764j7872j19679j09223J32797M994Q4481
14668a9884J8066P1300L3949j13462L7314J07996n2342j09157J4576P1253l3361
14657B6248r6766n3709K31564L6663L9579j2544j28308k54084p0844Q8492N2657
14646a41052J46380L1747L2249m7145N5266N4333k2919m2623m3484L6262q177
14635E0837j08166J24950P5021j84320k15879L3697N0779o2255O5187K10949P2504
14624A13304j06770R816N9111L1999j20286J55179J44476l6906p0134k2795O0097
14613B17091j3416o9626j45558n5393n9458O45o589J01209k0785M7903m981M1299
$$ plain form
14690 194871 191794 111078 -4841 -41104 -100560 -254339 -221393 -241747 -172394 -56685 -72033
14679 -72033 143374 104718 132793 50382 4618 -13254 -132933 -242156 -109359 -104365 -19884
14668 -19884 -1818 69482 103431 -10031 27283 135279 82937 -26220 -11644 59609 26248
14657 26248 -70518 -124227 107337 144000 183579 171035 42727 -211357 -282201 -193709 -141052
14646 -141052 5328 37075 69324 22179 77445 131778 108859 66236 22752 59014 50837
14635 50837 -57329 67621 142642 -41678 -257557 -223860 -173081 -235336 -170149 40800 113304
14624 113304 6534 16350 75461 107460 -12826 142353 286829 249923 179789 156994 217091
14613 217091 203675 134049 -11509 -66902 -126360 -125715 -132304 -31095 -51880 -3977 -8958 32341
14601C2341k3434q0240k0565N8810J06245J35929J16494J4787j78840k33616N8218
14590a3871J43174J07002o1860k56080j43705l6544J59423M7476K9619Q4667J21197
14579A80498j22802r1110n2411J39286J09014j04338J3611j33919j04612J46738
14569b0045J44388j69587j36628K5678m6995l1492K7035J10947J96614j02j03554
14558c741o5292M9647n7553L8407K1829R0996O2651J6797n6326O6930K6830J41132
14546C32307q121j41328j15101J32708q0066L3317p7365j00493R8790M8806j27288
14535c834j60351K7985l341q3427O9360j8319K1932K14536J96314j35936J7554
14524A42473R1719M3776k47622K8448J00806J3215j38190O2066J93409l914n0795
$$ plain form
14601 32341 8907 -71333 -91898 -33088 73157 209086 325580 340367 161527 -72089 -13871
14590 -13871 129303 236305 174445 -81635 -225340 -261884 -102461 -54985 -25366 59301 180498
14579 180498 57696 -33414 -85825 53461 162475 58137 71748 -62171 -166783 -20045
14569 -20045 124343 -45244 -181872 -156194 -203189 -234681 -207646 -96699 99915 99813 -3741
14558 -3741 -69033 -19386 -76939 -38532 -16703 74293 136944 153741 97415 164345 191175 332307
14546 332307 324186 182858 67757 200465 120399 153716 76351 -24142 74648 123454 -3834
14535 -3834 -164185 -136200 -139541 -222968 -153608 -171927 -149995 64541 260855 124919 142473
14524 142473 234192 277968 30346 58794 159600 172815 34625 96691 290100 286186 235391
14513B35391j10326p5756n3348o2523M7082J76345J85614l8733K9143l5429p4379
14502B23081l4574K2474K8241l858k08562o4455K5845J68849M9199m9361J04449
14491B61328p5550k56369j1910J62723M9503K7689r1988j46647L1838r493J7876
14480d1000j5943K476r6311J95458r6489k2790J24756O7532j20067j23717O8196
14469e7899j09793o1613K06772J84428o6729n9364K3153K0897l3903j49357j533
14458a04941m4737J53124M5437r6724m5911k8470L8312r8874K4804o6757M6434
14447a78303P2781O8067Q6531l5724Q8073J49528k9070k42181k15788R0649K21546
14436G6109J24252l9943o0988M6037n3450k95164q757K80643K23968M9588N4631
$$ plain form
14513 235391 125065 49309 -4039 -66562 -19480 156865 342479 303746 332889 297460 223081
14502 223081 188507 210981 239222 235364 26802 -37653 -11808 157041 206240 156879 261328
14491 261328 185778 -70591 -82501 80222 129725 157414 65426 -81221 -49383 -58876 -41000
14480 -41000 -56943 -54467 -150778 44680 -51809 -74599 50157 117689 -2378 -126095 -57899
14469 -57899 -167692 -229305 -22533 161895 95166 35802 58955 79852 45949 -103408 -104941
14458 -104941 -149678 3446 48883 -47841 -93752 -122222 -83910 -182784 -157980 -224737 -178303
14447 -178303 -105522 -37455 49076 13352 101425 250953 221883 -20298 -236086 -145437 76109
14436 76109 200361 160418 99430 145467 92017 -203147 -211904 68739 292707 342295 396926
14425C96926j56669r6491Q6892J08336o6217r5853L8862N9576J19477N1676k2110
14414D24405q5651R2226K32369P342O7208j1313N0348r7980j38103Q7539j10069
14403E18321k17205J25018J21819O0380J04785j08823R6678n6849j71608j08316
14393C64200j9741P448j02865P3425L4464M1037J07593n2520p0152N426j1139
14382C77176k32623p9178J38355J3535O898O6078J02558M1422J61184R9575o6529
14371F28451J72231K7267l4482j4012j79151k37754J1476J79163n216j91690j36971
14360B19312J6274N8017J7686M3772J85062K83111R5512q3326o1260j10464J25620
14349G89316m2936l6889J09956J0462n3268J1710O3653J53676j18580K8361J7532
$$ plain form
14425 396926 240257 143766 230658 338994 272777 176924 215786 275362 394839 446515 424405
14414 424405 338754 430980 663349 670691 737899 726586 776934 678954 540851 628390 518321
14403 518321 301116 426134 547953 608333 713118 604295 700973 644124 472516 364200
14393 364200 344459 351907 249042 322467 356931 397968 505561 453041 382889 388315 377176
14382 377176 144553 65375 203730 217265 224163 290241 392799 434221 595405 694980 628451
14371 628451 800682 827949 793467 779455 600304 362550 374026 553189 547973 356283 219312
14360 219312 235586 293603 311289 355061 540123 823234 918746 835420 774160 663696 789316
14349 789316 746380 709491 819447 829909 776641 788351 852004 1005680 887100 915461 932993
14338I32993P5616O2844m4485K9854Q5355J57432K34197J97853O3041j89554J11817
14327A716963J35170M7061R4787J25887K28848K39690J13114N4200J96886L55052
14317C307658K0020K06857K75316L94372N06817N64208O15144N73638P18649P78688
14307G961367J059550J138231J185005J441737J801471K026784K334095K900784
14299B1849024L643641M347633N579264P061386R074004J1253565J4080764J6754111
14291I3643392J8601470J8799037J7062401J3442036R168728N435394J611354
14284A77763812k480209p213433j1797840j4707347j5684786j4741540j2874139
14277I8264518j0774559r054110p442587n903300m669111l769882k969024k190939
$$ plain form
14338 932993 1008609 1071453 1026968 1056822 1142177 1299609 1533806 1731659 1794700 1605146 1716963
14327 1716963 1852133 1899194 1993981 2119868 2348716 2588406 2701520 2755720 2952606 3307658
14317 3307658 3327678 3534535 3809851 4204223 4711040 5275248 5890392 6464030 7182679 7961367
14307 7961367 9020917 10159148 11344153 12785890 14587361 16614145 18948240 21849024
14299 21849024 25492665 29840298 35419562 42480948 51554952 62808517 76889281 93643392
14291 93643392 112244862 131043899 148106300 161548336 170717064 176152458 177763812
14284 177763812 175283603 168070170 156272330 141564983 125880197 111138657 98264518
14277 98264518 87489959 78435849 70993262 65089962 60420851 56650969 53681945 51491006
14269E1491006j482592j180838p63841l16839J12231P27186J248895J669144K352207
14260E3856559L193482L841330M762733O014654P474160R468264J1606027J3622665
14252A13839874J5304516J6126084J5171988J1777698P092020K405305j755777
14245A79961708n670467r539896j3760525j7286886j9139296j8614152j6624733
14238G9325753j4065568j1420407r184289p198461n572041m497327l765931l191595
14230B0430134k697050k056367j786550j617185j407647j257063j015086p70009
14222G823177o46708p39197o24231m24480l79656k16748j64380k00514k93394
14213D133869l22725m23899k24625j80894j82733j94213m4488j27305m3224o3080
$$ plain form
14269 51491006 50008414 48827576 48063735 47746896 47859127 48586313 49835208 51504352 53856559
14260 53856559 57050041 60891371 65654104 71668758 79142918 88611182 100217209 113839874
14252 113839874 129144390 145270474 160442462 172220160 179312180 181717485 179961708
14245 179961708 174291241 164751345 150990820 133703934 114564638 95950486 79325753
14238 79325753 65260185 53839778 44655489 37457028 31884987 27387660 23621729 20430134
14230 20430134 17733084 15676717 13890167 12272982 10865335 9608272 8593186 7823177
14222 7823177 7176469 6437272 5813041 5388561 5008905 4792157 4627777 4427263 4133869
14213 4133869 3811144 3387245 3162620 2981726 2798993 2604780 2560292 2432987 2389763 2326683
14203B326683k25886k54280q8439q6375j62937J108N9569O3940N238J4211r5896
14192A556936k59911k7859R6400j14328k06811L89p3232J7977j5440J47872N8207
14181A180200l5923l8812j23673j95468o7700J66244o4680j01255M0670o9935
14171F89668p619n9806j2110r6569K3430Q2983L4934r8128o2588O4019r1549J947
14159D68612O4273j78764L6872K67339J9263j03943L0506j50833j57880K64659
14149E60104J15845N3304M9326j24029j27552J5764m3817r689p3451k1360j38355
14138B56090j23871R0338J07511J10414J47261J7867k8600J2966j4703o5885j44112
14127C65276j4318p7608k0372J95011j75299j3146k3330K119Q5903J68515J75379
$$ plain form
14203 2326683 2100797 1846517 1758078 1671703 1508766 1509874 1569443 1633383 1638621 1652832 1556936
14192 1556936 1297025 1269166 1365566 1251238 1044427 1044816 971584 989561 974121 1121993 1180200
14181 1180200 1144277 1105465 981792 786324 718624 884868 820188 718933 759603 689668
14171 689668 682049 622243 610133 513564 536994 619977 654911 556783 494195 558214 466665 468612
14159 468612 532885 354121 390993 658332 677595 573652 604158 453325 295445 560104
14149 560104 675949 729253 778579 654550 526998 542762 498945 489256 415805 394445 256090
14138 256090 132219 222557 330068 440482 587743 605610 577010 589976 575273 509388 365276
14127 365276 350958 273350 252978 447989 272690 259544 236214 238333 324236 492751 668130
14116F68130k2548j98621j29044m7685L3171O294J602O5359K4033j25370k4280
14105B51041Q8372O1328R2397O1234J94022k069k45589j20522L7305M1191L9059
14094D97769j19483r0791P5937q7077J15056M9317K09334k9100j83300j83666
14084B53996m9564O744k4908L9041K52712k3291r6111m4508j19746r0159J7979
14073A22185Q8481J25697P1811j62168k17041K7149l4836R7210j9394J91N3476
14062A52761M5000M8006J71146q219p2370p191J7467l4216L8837J57022K176k57856
14050B52563j08774N3647M8650j13202j17578p000j08228O1523J47502L3063j10608
14039C1558j36024n6928K7082J48769j89941J5382J82402J0623K5665M7304j31500
$$ plain form
14116 668130 645582 446961 317917 270232 303403 309697 311299 376658 400691 275321 251041
14105 251041 339413 400741 493138 554372 748394 746325 500736 380214 417519 458710 497769
14094 497769 378286 287495 363432 276355 391411 440728 650062 620962 437662 253996
14084 253996 204432 211176 186268 225309 478021 454730 358619 314111 194365 104206 122185
14073 122185 210666 336363 408174 246006 28965 56114 21278 118488 99094 99285 152761
14062 152761 197761 245767 416913 408694 336324 329133 346600 312384 351221 508243 510419 252563
14050 252563 143789 197436 246086 132884 15306 8306 -99922 -38399 109103 142166 31558
14039 31558 -104466 -161394 -134312 14457 -175484 -160102 22300 32923 58588 105892 -25608
14028b5608l9824L3251j0825J32295J3313J12877q0163K0585Q1729J1061q1964
14017A66727q0125o9886k4925o6267J10088K0870m7872l3644k24848N1731J47029
14006e1122q2675J35807P8163N0089J5066j30367k16941J49074Q5191j01872j84912
13995b54499r3792M11164J82446J0778k04734K9714R6323O8388k02178j88507
13985a44897K48550J55002m3144j14052Q7571N9373j88872r8705J97385K53577
13975D11788K3053n8164j47282n1748n9004j11057q4921J08939J14614N2081Q7507
13964B85806q5900q0546p0334q3980O0738J54046q9599M9599J02420L8562j790
13953B79022j2136j33406j13010M8013K4345k15642P4095N9096K5027k3414O0220
$$ plain form
14028 -25608 -65432 -32181 -43006 89289 102602 215479 135316 155901 237630 248691 166727
14017 166727 86602 16716 -8209 -74476 35612 56482 8610 -25034 -249882 -198151 -51122
14006 -51122 -133797 2010 80173 130262 145328 14961 -201980 -52906 32285 -69587 -254499
13995 -254499 -348291 62873 245319 256097 51363 81077 177400 245788 43610 -144897
13985 -144897 103653 258655 215511 101459 189030 248403 59531 -39174 158211 411788
13975 411788 434841 376677 229395 177647 118643 7586 -77335 31604 146218 198299 285806
13964 285806 199906 119360 49026 -34954 25784 179830 90231 139830 242250 280812 279022
13953 279022 266886 133480 20470 68483 92828 -122814 -48719 10377 35404 11990 72210
13942G2210j5930p8678R397n3026j08233o9358J94843J2086J8379J24928o2495
13931D4123k48139q9114P0846J70706j35765J15276K00382l2775j10332J06204
13921I1412R9271r2446J1491m1048q0431j0890j5851p646j15629j8736J4119J89196
13909B2812R9698j0359J85789p3282j05452q0757J8290p4945K4780O9314n5346
13898B0542k22352j33994R8360J35760J42081P5492K0582K4915K578o267j36649
13887B1048j30738J17466p8795l0159K22633J27594j61817j88344L0986J04428
13877C4302M9117J35289P6213L6561l4369l2171J10670J56168j0183k90907k55225
13866b4535r7849j32988J79566K36413Q0334k80895j17498o964L8562j660l2774
$$ plain form
13942 72210 56280 -22398 -13001 -66027 -174260 -243618 -48775 -36689 -18310 106618 44123
13931 44123 -204016 -293130 -222284 -51578 -187343 -72067 128315 95540 -14792 91412
13921 91412 190683 98237 109728 68680 -11751 -22641 -38492 -46138 -161767 -180503 -166384 22812
13909 22812 122510 112151 297940 224658 119206 38449 56739 -18206 6574 75888 20542
13898 20542 -201810 -335804 -237444 -101684 40397 115889 136471 161386 163964 157697 21048
13887 21048 -109690 7776 -71019 -101178 121455 249049 87232 -101112 -70126 34302
13877 34302 83419 218708 294921 331482 297113 264942 375612 531780 521597 230690 -24535
13866 -24535 -122384 -255372 -75806 160607 240941 -39954 -157452 -164416 -125854 -127514 -160288
13855a60288J2220J05833j3569M9465M0992j03829m5318j65503j12086J19937
13845b72146Q4831K8100q3736k02519J5049L22333J70444Q4682K7814J6095K4563
13834B15510J35425J30067M6817r378J28078L2328R604Q4799K66645q856k9832
13823A001207q2311k611J21750j923k63878Q1623j44691k01079j03217l7122R5493
13812D63241o5565r5356N7431j25207q4815K19412N0172p6938l9411n161j03847
13801A93956O6165K2148p7196N8529J21142K41510P1238p7927l5215J29781J52708
13790H66839n5866P535L397J39173K81858j8608o8027N5532j3549j50801J7674
13779A065157N6105q5357j53296k16389j77594K4558N416L3475j49121o0321Q0946
$$ plain form
13855 -160288 -148068 -42235 -55804 -6339 34653 -69176 -114494 -279997 -392083 -272146
13845 -272146 -187315 -159215 -242951 -445470 -430421 -108088 62356 147038 174852 190947 215510
13834 215510 350935 481002 527819 518441 646519 678847 688451 773250 1039895 1031039 1001207
13823 1001207 918896 916285 1038035 1036112 772234 853857 709166 508087 404870 367748 463241
13812 463241 397676 302320 359751 234544 149729 369141 419313 342375 302964 297803 193956
13801 193956 260121 282269 205073 263602 384744 626254 697492 619565 584350 714131 866839
13790 866839 810973 818508 821905 961078 1242936 1224328 1156301 1211833 1198284 1047483 1065157
13779 1065157 1121262 1035905 882609 666220 488626 513184 518600 552075 402954 342633 423579
13768D23579l5224j36757n0470k209J06171M9576l8141j05638k33511M5929J10059
13757A33364l9484Q4122O5761L3514P2373r5953p738j31370K336j2178m6024L2828
13745I1551j2092j8492M071r1229j2795n0916J82561J58620r9523P3216J496L9137
13733B65605j20247j96867j7129O5904J20609J9822p3271K810J86264r0073q9733
13722G3694N8401L7231Q8238n8044L7586r4332j07414j19306m0723Q5662J95200
13711A56193K8263k25483j93345R964J03782J03813m3716j06301k7164r9543p1294
13700c64831M2555J04481Q6032J39065M505m5600L0147Q5583O844Q600j34633
13689c7252J03936J46814J8851M4401l4718O8180j204j03268j46302q4906M7730
$$ plain form
13768 423579 388355 251598 201128 198919 305090 354666 316525 210887 -22624 23305 133364
13757 133364 93880 178002 243763 277277 349650 253697 245959 114589 116925 104747 58723 91551
13745 91551 79459 60967 65038 -26191 -38986 -89902 92659 251279 151756 224972 226468 265605
13733 265605 145358 -51509 -68638 -2734 117875 137697 64426 67236 253500 163427 73694
13722 73694 132095 169326 257564 199520 237106 142774 35360 -83946 -124669 -39007 156193
13711 156193 184456 -41027 -234372 -224408 -120626 -16813 -60529 -166830 -193994 -293537 -364831
13700 -364831 -322276 -217795 -131763 7302 11807 -33793 -3646 81937 88781 97381 -37252
13689 -37252 66684 213498 232349 276750 242032 310212 309008 205740 59438 -25468 22262
13678B2262K5921J79769O9399j28762J6909N1872J00949J54103m5937j97570K6663
13667B75578N3895k3701k46268j33827j19230J50166O703K4238K7891M0117R2209
13656A47771j39443q3360L4340O3686P7634k172J8135m896J36023L3669L2373
13645C13760j0477r5812o6732J39085M9359j82786J8506J34449r0033k06495r1241
13634h8417Q8702N778j55287j07385M5486J52587K34166J26865m6195o0591p5268
13623A20441k16601J4205Q6572n0478P9972j17369k3556N578N4939O3571m0678
13612b3404N08J23233L6685O9502K4432l625n5211j69354K6388J64137J52552
13601C45843K08284J40912j76213k71551j70568Q4538j9588k9750K45925K78803
$$ plain form
13678 22262 48183 227952 297351 168589 185498 237370 338319 492422 446485 248915 275578
13667 275578 329473 305772 59504 -74323 -193553 -43387 -36684 -12446 15445 55562 147771
13656 147771 8328 -75032 -40692 22994 100628 98456 116591 111695 247718 281387 313760
13645 313760 303283 207471 140739 279824 329183 146397 164903 299352 209319 2824 -88417
13634 -88417 285 6063 -149224 -256609 -211123 -58536 175630 302495 256300 195709 120441
13623 120441 -96160 -81955 4617 -45861 34111 -83258 -106814 -101236 -46297 17274 -23404
13612 -23404 -22896 100337 137022 206524 230956 227331 172120 2766 29154 193291 345843
13601 345843 554127 695039 518826 247275 76707 161245 141657 111907 357832 636635
13591F36635j67232l11583N5697J40941P4874K188k17690o8524j06558N340k1124
13580B2964M1331M3976L8696J8266J61786j79533M4719o9520J35790P7490o4632
13569B71333r8750n7738j86847k02627p1350Q0405P2023N5831J28590J89515J2801
13558A93186j8847L7080J38133R6576o1661j65580n3702j31915R9750L3988P0087
13547B37095r594k476P054j19867k11809J29653J58937K3132m5031j16056J930
13536E2968P8881j13027n7974N4975q05J27348j8087N5406j47814l5218M9236
13525D5889k6556K636j0520K4639J07708J01968k80687q4443J1498N5264N0632
13514a972J6415Q5581J6890q7955J16653P5458j30280l5875P2302j9553P9418
$$ plain form
13591 636635 469403 157820 213517 354458 429332 431520 213830 145306 38748 44088 22964
13580 22964 64295 108271 146967 165233 327019 147486 192205 122685 258475 335965 271333
13569 271333 172583 114845 -72002 -274629 -345979 -265574 -193551 -137720 -9130 180385 193186
13558 193186 174339 211419 349552 446128 384467 218887 165185 33270 133020 167008 237095
13547 237095 227501 225025 232079 112212 -99597 30056 188993 212125 167094 51038 52968
13536 52968 131849 18822 -39152 15823 15018 142366 124279 179685 31871 -3347 45889
13525 45889 19333 21969 11449 36088 143796 245764 -34923 -119366 -107868 -52604 -1972
13514 -1972 14443 100024 116914 28959 145612 221070 90790 54915 127217 107664 187082
13503A87082J0049j25143l62092r9019P4773J29904J82949P0879J0048j11274
13493c1844r4934J61561j1117j75454m8050j3157O5853j02536q6971J3419Q3913
13482b39317j04886m2432J9336J23633k0709Q3257J57886K30550O9964j52187
13472A25095j87350k8897j78966o6396q6586J01078J05942r4377K0894J6964J46471
13461a26128l0199k0374m1307P1705M3989K00980J61714P8591l9378j30957q9141
13450G9495o4926m7959o0048j25405n4151M1500O5519k080J23497J29408n5849
13439B9001o4810r6622j69121R7491J1665Q314R5104j14777l3052q0296J62357
13428a54746J62224K66325r6477j74690K5431K57802n1666k76345j14195K5981
$$ plain form
13503 187082 197131 71988 -290104 -389123 -314350 -184446 -1497 69382 79430 -31844
13493 -31844 -126778 34783 23666 -151788 -199838 -212995 -147142 -249678 -336649 -323230 -239317
13482 -239317 -344203 -386635 -367299 -243666 -264375 -181118 -23232 207318 277282 125095
13472 125095 -62255 -91152 -270118 -336514 -423100 -322022 -216080 -310457 -289563 -272599 -126128
13461 -126128 -156327 -176701 -218008 -146303 -102314 98666 260380 338971 299593 168636 79495
13450 79495 14569 -33390 -93438 -218843 -272994 -231494 -165975 -168055 -44558 84850 29001
13439 29001 -35809 -132431 -301552 -204061 -192396 -184082 -88978 -203755 -236807 -317103 -154746
13428 -154746 7478 273803 177326 2636 28067 285869 234203 -42142 -156337 -130356
13418a30356J57080J97878N7551j94957j55280l3904J21914p3531K3819n2961
13408h2747j13180O3475N532J07112O7175R04J0722j14229M2154J06451M8682
13397A42051K06318J58209n538l8887q6310j07316j47456k27813r7647N0923K09363
13386E5897r2519j2650K71578J64139j83339j98404l3474J54202J49014K0104
13376B94548N041j21667r1468p7453n1574L917j2718J08645J39310j41834r2888
13365c8141Q7103J0666m7820N4913q1759k8920J28222J50661o9767l2431m6577
13354H6150j84923L9841L4613o1714L9737Q8605o8462j833l3865J12554K61093
13343C11796P0233j44092j62844l8548K23344N6846k82636q8839J17351j8829
$$ plain form
13418 -130356 26724 224602 282153 87196 -68084 -101988 19926 -53605 -29786 -82747
13408 -82747 -195927 -132452 -126920 -19808 47367 48271 58993 -55236 -13082 93369 142051
13397 142051 348369 506578 501040 462153 375843 268527 121071 -106742 -204389 -153466 55897
13386 55897 -36622 -49272 222306 386445 203106 4702 -28772 125430 274444 294548
13376 294548 299589 177922 86454 9001 -42573 -38656 -51374 57271 196581 54747 -38141
13365 -38141 48962 59628 11808 66721 -15038 -43958 84264 234925 165158 132727 86150
13354 86150 -98773 -58932 -24319 -86033 -46296 42309 -26153 -27986 -61851 50703 311796
13343 311796 382029 237937 75093 36545 259889 316735 34099 -54740 62611 43782
13333D3782n8595J36690L8719K1019m0057j8679n3749n8147L8640N8062Q6449
13322A94134Q1488n2439Q7274R9606n2784p6525j86522p5394j32778O6915l6618
13311h3643O9023q5315J6351P193m6817M1800J21121j4689J40979R700r8674m772
13299G2257m1920q7273J51505N9436n9863q7271o0008M8843P9218K12255R8780
13288C85959o2792j44624L7712q4070j13870O7560k18145o4296J19640K57778
13278A80852n5763r3824n2365P7311J00194O7667o8403p5046k5374n6636q9264
13267i0651j42969k0117L6210j36360J12515J08015j30923J02977J69626J79352
13257A87675Q7273k40388k20319k6725O8699M6095J50005j8663K535J55313O0612
$$ plain form
13333 43782 -14813 121877 160596 181615 141558 122879 69130 10983 49623 107685 194134
13322 194134 275622 223183 310457 410063 357279 280754 94232 18838 -113940 -47025 -83643
13311 -83643 -14620 -99935 -83584 -76391 -123208 -81408 39713 25024 166003 175703 77029 72257
13299 72257 30337 -56936 94569 154005 94142 6871 -53137 -4294 74924 287179 385959
13288 385959 323167 178543 216255 132185 18315 85875 -132270 -196566 -76926 180852
13278 180852 125089 31265 -21100 56211 156405 224072 155669 80623 55249 -1387 -90651
13267 -90651 -233620 -253737 -217527 -353887 -241372 -133357 -264280 -161303 8323 187675
13257 187675 274948 34560 -185759 -212484 -143785 -97690 52315 33652 36187 191500 252112
13246B52112j46169K0204k42556j43870j40939J74219K53406J32021Q1087r4902
13236A44613o1776J021j52248R6195J08574P3726j664M8922J4588o2417m2535
13225A66999q2255q8276P081j50674Q1462l9939n977j11122l3889J35504J01484
13214a9602J5834J9684J32778L7098q0378k9232O5157L5553J25515J03773r0962
13203C15218K3476l07622j95454P827J803J06603M0463J00268L236j74966j8934
13192i8082M6433n0399J5460L9721J07445o4464l1134J4604O0405j34952N396
13181h9567K6176J5941l3660l8876K0520J66337K8588l0234j0823k6215L8932
13170F7119n1264p8423r9342j39716M3199Q5465J06220j07848p1299k7268L1560
$$ plain form
13246 252112 105943 126147 -116409 -260279 -401218 -226999 26407 158428 239515 144613
13236 144613 82837 83858 -68390 27805 136379 210105 208441 257363 271951 209534 166999
13225 166999 84744 -3532 3549 -147125 -65663 -105602 -111579 -222701 -256590 -121086 -19602
13214 -19602 -3768 15916 148694 185792 105414 76182 141339 176892 302407 406180 315218
13203 315218 338694 31072 -164382 -156555 -154752 -48149 -7686 92582 95818 -79148 -98082
13192 -98082 -51649 -102048 -86588 -46867 60578 -3886 -35020 -20416 39989 -94963 -89567
13181 -89567 -63391 -47450 -81110 -119986 -99466 66871 95459 65225 54402 28187 67119
13170 67119 15855 -62568 -161910 -301626 -258427 -172962 -66742 -174590 -245889 -273157 -241597
13159b41597O6031J52260N2257r6900K03200N9150J0734j63466j70477k0620J0317
13148a39111j22823J4351Q8553j91490m037K27190J34296J06877n9637j69624
13138a15455K9272K2661J0088K1167O4402n0340J49392J35257j87503j10204k12865
13127b44128P7753K36003L81L0432O9484j29919M9905p6146L7658o8246k6466
13116d3289K8041J53341J4787K8263p0712o0001k0328O8509M9207j5998J2295
13105A44115j12911j90308Q8450K88744O0736k43431k9874O6644r4426R6673J82307
13094B56719j10168O19J88354p6543l14802j48952n72J93747N5474j5489J32557
13083A60944J49532q1261j41160N9134Q4871j25640l7393J26427P8234q6029O0607
$$ plain form
13159 -241597 -175566 -23306 28951 -67949 135251 194401 205135 41669 -128808 -149428 -139111
13148 -139111 -261934 -247583 -159030 -350520 -354557 -127367 6929 113806 54169 -115455
13138 -115455 -86183 -63522 -53434 -32267 32135 -18205 131187 266444 78941 -31263 -244128
13127 -244128 -166375 69628 70009 100441 169925 40006 89911 13765 51423 -16823 -43289
13116 -43289 -15248 138093 152880 181143 110431 50430 30102 98611 147818 131820 144115
13105 144115 31204 -159104 -70654 218090 278826 35395 5521 72165 -22261 74412 256719
13094 256719 146551 147170 335524 258981 -55821 -204773 -205345 -11598 43876 28387 160944
13083 160944 310476 229215 88055 147189 232060 106420 69027 195454 273688 187659 248266
13072B48266p0128p679q2377r0754Q077j57612j10798J28577R9176M1421j90533
13061a84364l2785j4491J48610Q8227m8583K0056m2529O623K0426n2660j2849
13050a04319j11351q3350R5273o343J05424K18154J92635r3022k57261k4528M2773
13039b5915K1186M2239o6704p7446l4937J47643j2592L7394J89437j18700j00270
13028A335J561k0231j0303J10456M0972j65277j10400l6207j0961J17240J63819
13017H2004J07229J45863R6235o1680k96001N9001l5142k34036K9521Q4028R9040
13006G6062l5046k5389O9215L3853p2864k09460j19056J97098J16539K401J22390
12995A55743N8845j59687o6467M6858K51139K1591k02063M7229J14295N6635n8184
$$ plain form
13072 248266 178138 170459 88082 -2672 5405 -152207 -263005 -134428 -35252 6169 -184364
13061 -184364 -217149 -231640 -83030 5197 -43386 -23330 -65859 -59236 -38810 -91470 -104319
13050 -104319 -215670 -299020 -203747 -210090 -104666 113488 306123 213101 -44160 -68688 -25915
13039 -25915 -4729 37510 -29194 -106640 -141577 6066 -6526 30868 220305 101605 1335
13028 1335 2896 -17335 -27638 82818 123790 -41487 -151887 -188094 -199055 -81815 82004
13017 82004 189233 335096 431331 369651 73650 132651 97509 -136527 -107006 -22978 76062
13006 76062 41016 15627 84842 118695 45831 -163629 -282685 -85587 30952 33353 155743
12995 155743 214588 54901 -11566 35292 286431 308022 105959 153188 267483 324118 265934
12984B65934j9749k02001j81700O1894J55586K46540L5206j70685j81570k15539
12974b06084j8740M3877K27989n1630J00886M4701n5867K5661J34758p3023j21225
12963E1303k27743m3860m2576j30550J55282J56385R8673J89125j5527p5670O9236
12952A84078n4410r3425p4892j81801k8630J61687L0821m8350R9856j04820N0537
12941e9349J00002p01j16857j43707J91739P0459j92349n1213N5056M860j0388
12930a52448J27929j36195n2585R8609R8431J02925J4524j15866N6101k8049L2968
12919D6344N5603m5974l9590K1876k4787K8110m2749p3392n3708j69683J17190
12908a80760Q0266K01841O247Q2529J7834k53609l6145m5151j575O9567R136j57265
$$ plain form
12984 265934 246185 44184 -137516 -75622 79964 326504 361710 191025 9455 -206084
12974 -206084 -224824 -180947 47042 -4588 96298 140999 85132 110793 245551 172528 51303
12963 51303 -176440 -220300 -262876 -393426 -238144 -81759 16914 206039 190512 114842 184078
12952 184078 129668 36243 -38649 -220450 -249080 -87393 -56572 -104922 -5066 -109886 -59349
12941 -59349 40653 39952 -76905 -220612 -28873 41586 -150763 -201976 -146920 -142060 -152448
12930 -152448 -24519 -160714 -213299 -114690 -16259 86666 101190 -14676 41425 13376 46344
12919 46344 101947 55973 16383 38259 13472 41582 -1167 -74559 -128267 -297950 -180760
12908 -180760 -100494 101347 107594 190123 207957 -45652 -81797 -126948 -128523 -58956 -49820 -207085
12896b07085j87767J30610K44115J551j7358J04534l4086k8334Q9012l9551p1325
12885a5684j2173J2502k6056J31279J29783k22620l12646K32617K71520j2985
12875A75537j19141j00936O1171j88388n3160J60640r3977n487L26952J72097
$$ plain form
12896 -207085 -394852 -264242 -20127 -18576 -35934 68600 34514 6180 95192 55641 -15684
12885 -15684 -27857 -15355 -41411 89868 219651 -2969 -315615 -82998 188522 175537
12875 175537 56396 -44540 16631 -171757 -224917 -64277 -158254 -163741 163211 335308
$$ [...]
##END NTUPLES=NMR SPECTRUM
##END=
