##TITLE=Analysis number 328992
Compound Code cc 64513
Book Reference 510/72
Project Code adrs
Chemist Name jimp
##JCAMPDX= 6.0         $$ Bruker NMR JCAMP-DX V2.0
##DATA TYPE= NMR SPECTRUM
##DATA CLASS= NTUPLES
##ORIGIN= Bruker BioSpin GmbH
##OWNER= nmr
$$ XWIN-NMR		Version 3.5
$$ Mon Jul 23 14:47:10 2007 GMT Daylight Time (UT+1h)  MAYBRIDGE\nmr@NMR_250MHZ
##.OBSERVE FREQUENCY= 250.131544655141
##.OBSERVE NUCLEUS= ^1H
##.ACQUISITION MODE= SIMULTANEOUS (DQD)
##.ACQUISITION SCHEME= undefined
##.AVERAGES= 16
##.DIGITISER RES= 18
##SPECTROMETER/DATA SYSTEM= dpx250
##.PULSE SEQUENCE= zg30
##.SOLVENT NAME= CDCl3
##.SHIFT REFERENCE= (INTERNAL, CDCl3, 0, 16.4497)
##AUDIT TRAIL= $$ (NUMBER, WHEN, WHO, WHERE, WHAT)
$$ ##TITLE= Audit trail, XWIN-NMR		Version 3.5
$$ ##JCAMPDX= 5.01
$$ ##ORIGIN= Bruker BioSpin GmbH
$$ ##OWNER= nmr
$$ C:\u/data/dgb/nmr/ADRS/1340/pdata/1/auditp.txt
$$ ##AUDIT TRAIL=  $$ (NUMBER, WHEN, WHO, WHERE, WHAT)
(   1,<2007-07-23 14:46:45.84 +100>,<MAYBRIDGE\nmr>,<NMR_250MHZ>,
      <created by zg, POWCHK disabled, PULCHK disabled
       configuration hash MD5:
       76 6E 9A 78 1E 09 19 81 EC 84 63 8F B0 6A 59 2D
       data hash MD5: 64K
       F7 2D D5 09 4D BA 16 98 6F 7D 58 4D 73 BB 1D 6B>)
(   2,<2007-07-23 14:47:01.24 +100>,<MAYBRIDGE\nmr>,<NMR_250MHZ>,
      <Start of raw data processing
       ef LB = 0.3 FT_mod = 6 PKNL = 1 SI = 32K 
       data hash MD5: 32K
       01 41 9F 3C E8 D0 B0 44 B5 D6 49 1B 27 44 B8 D9>)
(   3,<2007-07-23 14:47:03.01 +100>,<MAYBRIDGE\nmr>,<NMR_250MHZ>,
      <apk 
       data hash MD5: 32K
       CD 35 85 89 CC 7D 59 79 08 01 15 6F 04 C8 21 BC>)
(   4,<2007-07-23 14:47:03.80 +100>,<MAYBRIDGE\nmr>,<NMR_250MHZ>,
      <abs ABSG = 5 
       data hash MD5: 32K
       F3 2D 0C 27 F5 CC C3 DF 67 47 D4 BA B6 F1 FA 47>)
$$ ##END=
$$ 
$$ hash MD5
$$ 39 51 60 5C A5 37 C4 6C 57 DF FE 82 6B B9 72 7E
##$RELAX= 
##$RELAX= 
##$RELAX= 
##$RELAX= 
##$RELAX= 
##$RELAX= 
##$RELAX= 
$$ Bruker specific parameters
$$ --------------------------
##$DU= <C:\u>
##$EXPNO= 1340
##$NAME= <ADRS>
##$PROCNO= 1
##$TYPE= <nmr>
##$USER= <dgb>
##$AMP= (0..31)
100 100 100 100 100 100 100 100 100 100 100 100 100 100 100 100 100 100 
100 100 100 100 100 100 100 100 100 100 100 100 100 100 
##$AQSEQ= 0
##$AQ_mod= 3
##$AUNM= <au_zg>
##$AUTOPOS= <33 >
##$BF1= 250.13
##$BF2= 250.13
##$BF3= 250.13
##$BF4= 250.13
##$BF5= 500.13
##$BF6= 500.13
##$BF7= 500.13
##$BF8= 500.13
##$BYTORDA= 1
##$CFDGTYP= 0
##$CFRGTYP= 5
##$CHEMSTR= <none>
##$CNST= (0..31)
1 1 145 1 1 1 1 1 1 1 1 1 1 1 1 1 1 1 1 1 1 1 1 1 1 1 1 1 1 1 1 1 
##$CPDPRG= <>
##$CPDPRG1= <>
##$CPDPRG2= <>
##$CPDPRG3= <>
##$CPDPRG4= <mlev>
##$CPDPRG5= <mlev>
##$CPDPRG6= <mlev>
##$CPDPRG7= <mlev>
##$CPDPRG8= <mlev>
##$CPDPRGB= <>
##$CPDPRGT= <>
##$D= (0..31)
0 1 0 0 0 0 0 0 0 0.06 0 0 0 0 0 0 0.0002 0 0 0 0 0 0 0 0 0 0 0 0 0 0 
0 
##$DATE= 1185198404
##$DBL= (0..7)
120 120 120 120 120 120 120 120 
##$DBP= (0..7)
150 150 150 150 150 150 150 150 
##$DBP07= 0
##$DBPNAM0= <>
##$DBPNAM1= <>
$$ [...]
##$SUBNAM7= <"">
##$SUBNAM8= <"">
##$SUBNAM9= <"">
##$SW= 20.6930455092707
##$SWIBOX= (0..15)
0 0 3 0 0 0 0 0 0 0 0 0 0 0 0 0 
##$SW_h= 5175.983436853
##$TD= 65536
##$TD0= 1
##$TE= 297.16
##$TE2= 300
##$TE3= 300
##$TEG= 300
##$TL= (0..7)
0 120 120 120 120 120 120 120 
##$TP= (0..7)
150 150 150 150 150 150 150 150 
##$TP07= 0
##$TPNAME0= <>
##$TPNAME1= <>
##$TPNAME2= <>
##$TPNAME3= <>
##$TPNAME4= <>
##$TPNAME5= <>
##$TPNAME6= <>
##$TPNAME7= <>
##$TPOAL= (0..7)
0.5 0.5 0.5 0.5 0.5 0.5 0.5 0.5 
##$TPOFFS= (0..7)
0 0 0 0 0 0 0 0 
##$TUNHIN= 0
##$TUNHOUT= 0
##$TUNXOUT= 0
##$USERA1= <user>
##$USERA2= <user>
##$USERA3= <user>
##$USERA4= <user>
##$USERA5= <user>
##$V9= 5
##$VALIST= <valist>
##$VCLIST= <CCCCCCCCCCCCCCC>
##$VD= 0
##$VDLIST= <DDDDDDDDDDDDDDD>
##$VPLIST= <PPPPPPPPPPPPPPP>
##$VTLIST= <TTTTTTTTTTTTTTT>
##$WBST= 1024
##$WBSW= 4
##$XGAIN= (0..3)
0 0 0 0 
##$XL= 0
##$YL= 0
##$YMAX_a= 339571
##$YMIN_a= -283106
##$ZGOPTNS= <>
##$ZL1= 120
##$ZL2= 120
##$ZL3= 120
##$ZL4= 120
##$ABSF1= 16.44971
##$ABSF2= -4.243462
##$ABSG= 5
##$ABSL= 3
##$ALPHA= 0
##$AQORDER= 0
##$ASSFAC= 0
##$ASSFACI= 0
##$ASSFACX= 0
##$ASSWID= 0
##$AUNMP= <proc_1d>
##$AZFE= 0.1
##$AZFW= 0.1
##$BCFW= 0
##$BC_mod= 0
##$BYTORDP= 0
##$COROFFS= 0
##$CY= 12.5
##$DATMOD= 1
##$DC= 0
##$DFILT= <>
##$DTYPP= 0
##$F1P= 14.0000005364418
##$F2P= -0.99999901652339
##$FCOR= 0.5
##$FTSIZE= 32768
##$FT_mod= 6
##$GAMMA= 0
##$GB= 0
##$INTBC= 1
##$INTSCL= 1
##$ISEN= 128
##$LB= 0.3
##$LEV0= 0
##$LPBIN= 0
##$MAXI= 10000
##$MC2= 0
##$MEAN= 0
##$ME_mod= 0
##$MI= 0
##$NCOEF= 0
##$NC_proc= -5
##$NLEV= 6
##$NOISF1= 0
##$NOISF2= 0
##$NSP= 0
##$NTH_PI= 0
##$NZP= 0
##$OFFSET= 16.44971
##$PC= 1
##$PHC0= -50.93033
##$PHC1= 9.474898
##$PH_mod= 1
##$PKNL= yes
##$PPARMOD= 0
##$PSCAL= 4
##$PSIGN= 0
##$REVERSE= no
##$SF= 250.130018080425
##$SI= 32768
##$SIGF1= 0
##$SIGF2= 0
##$SINO= 400
##$SIOLD= 32768
##$SREGLST= <1H.CDCl3>
##$SSB= 0
##$STSI= 32768
##$STSR= 0
##$SW_p= 5175.98343685301
##$SYMM= 0
##$S_DEV= 0
##$TDeff= 65536
##$TDoff= 0
##$TI= <Analysis number 999999
Compound Code 99
Book Reference 9
Project Code 9>
##$TILT= no
##$TM1= 0
##$TM2= 0
##$TOPLEV= 0
##$USERP1= <user>
##$USERP2= <user>
##$USERP3= <user>
##$USERP4= <user>
##$USERP5= <user>
##$WDW= 1
##$XDIM= 32768
##$YMAX_p= 474559080
##$YMIN_p= -439414
$$ End of Bruker specific parameters
$$ ---------------------------------
##NTUPLES= NMR SPECTRUM
##VAR_NAME=  FREQUENCY,     SPECTRUM/REAL,   SPECTRUM/IMAG
##SYMBOL=    X,             R,               I
##VAR_TYPE=  INDEPENDENT,   DEPENDENT,       DEPENDENT
##VAR_FORM=  AFFN,          ASDF,            ASDF
##VAR_DIM=   32768,         32768,           32768
##UNITS=     HZ,            ARBITRARY UNITS, ARBITRARY UNITS
##FACTOR=    0.157963299565203, 1,           1
##FIRST=     4114.56647131455, 0,            0
##LAST=      -1061.41696553846, 0,           0
##MIN=       -1061.41696553846, -439414,     0
##MAX=       4114.56647131455, 474559080,    0
$$ Real data points
##PAGE= N=1
##DATA TABLE= (X++(R..R)), XYDATA
$$ [...]
18289B678368o8668M525k6265j067n6197p2226o7508l0112j32339j02009l2345
$$ 2678368 2609700 2614225 2587960 2586893 2530696 2458470 2390962 2360850 2228511 2126502 2094157
18278B094157K002l0594o6775l258P7636L104K3358K2819O5882M9534j13509j28757
$$ 2094157 2096159 2065565 1998790 1995532 2073168 2076272 2099630 2122449 2188331 2237865 2124356 1995599
18266A995599q7769n0419M7674M8336j02124j32197k8086O3436K5986n0448n8900
$$ 1995599 1907830 1857411 1905085 1953421 1851297 1719100 1691014 1754450 1780436 1729988 1671088
18255A671088l1990K0358q0533K4214J34113l7342j79652m7176j0298J5691J84707
$$ 1671088 1639098 1659456 1578923 1603137 1737250 1699908 1520256 1473080 1462782 1478473 1663180
18244A663180J36972M7408j80560p6599k4584o4654K3089Q2539L817P6605j64948
$$ 1663180 1800152 1847560 1667000 1590401 1565817 1501163 1524252 1606791 1610608 1687213 1522265
18233A522265k60416q0344J60392j9660j83829o3770r5655j9388J66101J3015
$$ 1522265 1261849 1181505 1341897 1322237 1138408 1074638 978983 959595 1125696 1138711
18223A138711r6360j08173Q617J03906Q1369J45710J8023j19881r1572l7478q5090
$$ 1138711 1042351 934178 942795 1046701 1128070 1273780 1291803 1171922 1080350 1042872 957782
18212I57782L4733N6855k4022m3319J46509R8249M1691o8791k6593M9581j53848
$$ 957782 992515 1049370 1025348 982029 1128538 1226787 1268478 1199687 1173094 1222675 1068827
18201A068827j39533j6874J48952m2780o4123j8664j99748Q187L4748O147M3972
$$ 1068827 929294 912420 1061372 1018592 954469 935805 736057 744244 778992 785139 829111
18190H29111o7089n0573J49320J42809l038j15170n3885M1338M4755l7831j0199
$$ 829111 762022 711449 860769 1003578 1000540 885370 831485 872823 917578 879747 869548
18179H69548J4387Q5375M5194n0880p8039k0360q0236l5598Q4364k4451L0027
$$ 869548 883935 969310 1014504 963624 885585 865225 784989 749391 833755 809304 839331
18168H39331K8985Q6000J39067m3641r3229Q888Q9585l3345J9414k0377Q0871
$$ 839331 868316 954316 1093383 1049742 956513 965401 1054986 1021641 1041055 1020678 1101549
18157A101549J25421o5341j13059p8279J36292J11424J8542l1652k5240Q0252
$$ 1101549 1226970 1161629 1048570 970291 1106583 1218007 1236549 1204897 1179657 1259909
18147A259909m7683l293K3748q7506P0316P0337Q6915N8821j47766p4077N0391
$$ 1259909 1212226 1208933 1232681 1145175 1215491 1285828 1372743 1431564 1283798 1209721 1260112
18136A260112R5218J41801J90073L5414O8685J39770J52420J61301K14438J10908
$$ 1260112 1355330 1497131 1687204 1722618 1791303 1931073 2083493 2244794 2459232 2570140
18126B570140J75145M15107L20441M11272N07240O00495P15449R46262J014165
$$ 2570140 2745285 3160392 3480833 3892105 4399345 4999840 5715289 6661551 7675716
18117G675716J526292K368982L188250M418198O729349J0874322J8589352L2542526
$$ 7675716 9202008 11570990 14759240 19177438 25906787 36781109 55370461 87912987
18109H7912987N2989413N6768267N26912m7069022m7710283l5085587k2236486
$$ 87912987 140902400 197670667 198197579 151128557 103418274 68332687 46096201
18102D6096201j3637603q583418n550647l772754k601562k039120j537302j163101
$$ 46096201 32458598 23875180 18324533 14551779 11950217 9911097 8373795 7210694
18094G210694r96774p05082n46890m82939m04217l55057k90041k78904m12837
$$ 7210694 6213920 5508838 4961948 4479009 4074792 3719735 3429694 3150790 2737953
18085B737953k46923k25379j50102j63260r8075o3254j02709q4325p5859m1286
$$ 2737953 2491030 2265651 2115549 1952289 1854214 1790960 1688251 1603926 1528067 1486781
18075A486781j06613j85617o4792K1648o6548k5301o1166r9093j27273j13542
$$ 1486781 1380168 1194551 1129759 1151407 1084859 1059558 998392 899299 772026 658484
18065F58484L2888K5237n0544q6241Q7097J6610K1412O2556P8091L3853K6072
$$ 658484 691372 716609 666065 579824 666921 683531 704943 767499 845590 879443 905515
18054I05515n8802r5822r4347j48545k6935J31133R0217l2249P3129P2734l0650
$$ 905515 846713 750891 656544 507999 481064 612197 702414 670165 743294 816028 785378
18043G85378j45168m8631o3035r729L2294O305n1743O4747N8078l405j54352j18277
$$ 785378 640210 591579 528544 518815 551109 557414 505671 570418 628496 625091 470739 352462
18031C52462R718n921J03713O453N292N203P6079j0932K1249L9093m356j10928
$$ 352462 362180 356259 459972 466425 471717 476920 552999 542067 563316 602409 598053 487125
18019D87125l7676j58947M555J76470J05490r4322q9582j30225k3690O2119J9088
$$ 487125 449449 290502 295057 471527 577017 482695 393113 262888 239198 301317 320405
18008C20405j4439j725N6226l6649R5153J23289L501L1769Q562P1684Q7971n046
$$ 320405 305966 304241 360467 323818 418971 542260 545761 577530 586092 657776 745747 740701
17996G40701j76319k14330L8552M3585o4836P716L5658o0966K6901o6696J3058
$$ 740701 564382 350052 388604 432189 367353 375069 410727 349761 376662 309966 323024
17985C23024o047K809J21542k0699M689Q0210L6184o9865p9316m0429o523n5614
$$ 323024 316977 319786 441328 420629 425318 505528 541712 471847 392531 352102 345579 289965
17973B89965m9461p2523l9371K6557L4036o2511M0575L3758J19002N1835P6334
$$ 289965 240504 167981 128610 155167 189203 126692 167267 201025 320027 371862 448196
17962D48196m2491q4517J8611J64950P6337j060O3859o7804L2553K5513N1332
$$ 448196 405705 321188 339799 504749 581086 580026 643885 576081 608634 634147 685479
17951F85479p3542N6601P3517O0034k0811o3550n6885r4498m4636M9814L5272
$$ 685479 611937 668538 742055 802089 781278 717728 660843 566345 521709 571523 606795
17940F06795N3409r89K8318Q7274L3969O1237J60116J75600O5901j99658j73368
$$ 606795 660204 659215 687533 774807 808776 870013 1030129 1205729 1271630 1071972 898604
17929H98604M0651Q0043N6354q7064j15273j85446j1828n7817J67200J89547M610
$$ 898604 939255 1019298 1075652 988588 873315 687869 676041 618224 785424 974971 979581
17918I79581r1445j4905j48734k15677o255N5106n5655J40590N6944o4420p2062
$$ 979581 888136 873231 724497 508820 502565 557671 502016 642606 699550 635130 563068
17907E63068J40334J75665n427M9804L3746m7011N2430k2687K0745l1490r2495
$$ 563068 703402 879067 873640 923444 957190 910179 962609 939922 960667 929177 836682
17896H36682p0038l7423l5934k0134K6280j26131o832P3450J84041P2075M8456
$$ 836682 766644 729221 693287 673153 699433 573302 566470 639920 823961 896036 944492
17885I44492q9116j7762J05978J92986K25079P9638J3914o4952k17101j35322
$$ 944492 855376 837614 943592 1136578 1361657 1441295 1455209 1390257 1173156 1037834
17875A037834l8566j05239j8717p0053l6024O3380K01889Q8272O3771L0605j03725
$$ 1037834 999268 894029 875312 805259 769235 832615 1034504 1122776 1186547 1217152 1113427
17864A113427j06483n65j3140M1775M4151j21917j62433j15179j27932j51000
$$ 1113427 1006944 1006379 993239 1035014 1079165 957248 794815 679636 551704 400704
17854D00704l1188j27199L0207O2810p3444k7975J59377J03800J58778Q1687j8267
$$ 400704 369516 242317 272524 335334 261890 233915 393292 497092 655870 737557 719290
17843G19290j21372j90734m8362O844l9644o4766K6012O1961N7040L3444K8964
$$ 719290 597918 407184 358822 365666 326022 261256 287268 349229 406269 439713 468677
17832D68677O4497R0762m3831j48973j11691L0557n4659o2528L9620p7784J3744
$$ 468677 533174 623936 580105 431132 319441 349998 295339 232811 272431 194647 208391
17821B08391P7796l0218n4568R0629J9747k3592p1203j16929l0350O0534j3205
$$ 208391 286187 255969 201401 292030 311777 288185 216982 100053 69703 130237 117032
17810A17032J4841p901n0411q3258j6837J43116J02079m1024r5265L3284K5151
$$ 117032 131873 123972 73561 -9697 -26534 116582 218661 177637 82372 115656 140807
17799A40807m0854P2103k921m9246N5591P4395j1452q9614n160q412m0805N5356
$$ 140807 99953 172056 169135 119889 175480 249875 238423 148809 143649 135237 94432 149788
17787A49788q9155r9579j14335K5729P1364P4560J03389Q1603j2750r9330J8626
$$ 149788 60633 -38946 -153281 -127552 -56188 18372 121761 203364 190614 91284 109910
17776A09910k8295j17036P8318Q4211K4905J5154K9807j82883m4169O2862k8j2734
$$ 109910 81615 -35421 42897 127108 152013 167167 196974 14091 -30078 32784 32756 20022
17764B0022J23316P8932O3850L992j24607j3660p8113j01579l923N2306J74849
$$ 20022 143338 222270 286120 290112 165505 151845 73732 -27847 -31770 20536 195385
17753A95385l1819o7380N834O2223J35472n1310j24574n0732k9155L5201J0598
$$ 195385 163566 96186 102020 164243 299715 248405 123831 73099 43944 79145 89743
17742H9743k5877j05271j39800o0414J00965J60428M6115M420l3446L1543K4939
$$ 89743 63866 -41405 -181205 -241619 -140654 19774 65889 70309 36863 68406 93345
17731I3345N622m2528j3243j7317j36756R7708J25656l4842k0515O1547L4816
$$ 93345 98967 56439 43196 25879 -110877 -13169 112487 77645 57130 118677 153493
17720A53493l3730k619R088N7502q343n5305n1197K0696P7660j2425L5654o1705
$$ 153493 119763 117144 126232 183734 175391 120086 68889 89585 167245 154820 190474 128769
17708A28769j3733O9048M6330J4777M9488N875q4084k77327J4600k8117k5092
$$ 128769 115036 184084 230414 245191 294679 300554 216470 -60857 -46257 -74374 -99466
17697i9466m658p8669j982m7801J2189K5590R3428K3478Q0761k5394M7386q6562
$$ -99466 -104124 -182793 -184775 -232576 -220387 -194797 -101369 -77891 2870 -22524 24862 -61700
17685f1700n7892J21917J22551M9415j6631j08635k5046r811P3953M7242P8609
$$ -61700 -119592 2325 124876 174291 157660 49025 23979 14168 88121 135363 213972
17674B13972K1534q616j22253j71980k3874Q1859J3449k0813R1135J01136L8272
$$ 213972 235506 226890 104637 -67343 -91217 -9358 4091 -16722 74413 175549 213821
17663B13821k6528j18549o567J9750n3055K1161Q4859N6631o9072j40151j34994
$$ 213821 187293 68744 62177 81927 28872 50033 134892 191523 122451 -17700 -152694
17652a52694l9683M5332R2851j5909l0269Q65P1437J26010Q1985j8040q2868j02252
$$ -152694 -192377 -147045 -54194 -70103 -100372 -99507 -28070 97940 179925 161885 79017 -23235
17640b3235m565M637j42766k2454J8039m18J53228K6539k4584Q9734N99J3539
$$ -23235 -27800 -23163 -165929 -188383 -170344 -170762 -17534 9005 -15579 74155 74754 88293
17628H8293K5382k5799j38805L5266j4894K6610K5481J7783J37008O249j31624
$$ 88293 113675 87876 -50929 -15663 -30557 -3947 21534 39317 176325 182574 50950
17617E0950j17115N0553N6476j0472K9880M7909q6922K3660J23604N6600j35818
$$ 50950 -66165 -15612 40864 30392 60272 108181 21259 44919 168523 225123 89305
17606H9305r4775l5273o0929J52734J12693J20391m7714n4790n7919M6870q6549
$$ 89305 -5470 -40743 -101672 51062 163755 284146 236432 181642 123723 170593 84044
17595H4044j08649l5723j18555k6373J31637k5288J9464o568O8696M7983m2991
$$ 84044 -24605 -60328 -178883 -205256 -73619 -98907 -79443 -86011 -17315 30668 -12323
17584a2323J43118M6522q2506n215P9758L291l2353J3333k2506J4080J8160k7564
$$ -12323 130795 177317 94811 89596 169354 172645 140292 153625 131119 145199 163359 135795
17572A35795j0594L2350N2737k5999o8984n3974O612n9367o1009O1510O9604N172
$$ 135795 125201 157551 210288 184289 115305 61331 67943 8576 -52433 9077 78681 83853
17560H3853k2717j03956o3679L0072J08372P7221J07116L0015q9940m4860J7493
$$ 83853 61136 -42820 -106499 -76427 31945 109166 216282 246297 156357 111497 128990
17549A28990r5464l7610l4189O0012N5543r9290j71601n287J01878J39119J20101
$$ 128990 33526 -4084 -38273 21739 77282 -22008 -193609 -198896 -97018 42101 162202
17538A62202r4186l1105J6326O0088j5602k2085j26353K0295j842P2408P5192
$$ 162202 68016 36911 53237 113325 97723 75638 -50715 -30420 -32262 40146 115338
17527A15338O1749L6049o5853l3843J5015j12039r1770n7863M6634P3974r1595
$$ 115338 177087 213136 147283 113440 128455 16416 -75354 -133217 -86583 -12609 -104204
17516a04204j2383N1331k5845l997K4908Q2709M1583L7765O0997l0521K1879k6254
$$ -104204 -116587 -65256 -91101 -95098 -70190 12519 54102 91867 152864 122343 144222 117968
17504A17968q922K2009p5177J855J9194p4041M2472J14963k857r4128MN0175l0782
$$ 117968 109046 131055 55878 57733 76927 2886 45358 160321 157464 63336 63340 113515 82733
17491H2733J6815j1045m7843k7202K3730r7871O9288J73009N7632J7579j00305
$$ 82733 99548 88503 40660 13458 37188 -60683 8605 181614 239246 256825 156520
17480A56520j10631L4180K8139l0646n6286o3142k9778K5255J73077o137j1832
$$ 156520 45889 80069 108208 77562 21276 -41866 -71644 -46389 126688 120551 108719
17469A08719q7355p900j8113K8656J58603o8490k8410N0983Q3792K9942J5806
$$ 108719 21364 13464 -4649 24007 182610 114120 85710 136693 220485 250427 266233
17458B66233k8136q484k2267q2365k9321J21937J8758j19449k9483n4552n1022
$$ 266233 238097 229613 207346 124981 95660 217597 236355 116906 87423 32871 -18151
17447a8151J20407N6668O7686K96722K88098K76134P9928k46775l48476k59909
$$ -18151 102256 158924 226610 523332 811430 1087564 1167492 920717 572241 312332
17437C12332r6940M7415L4687j3476p0005l8397n0272r7953r9545J35511J37317
$$ 312332 215392 262807 297494 284018 214013 175616 125344 27391 -72154 63357 200674
17426B00674k7441j18356M3434N3110K7365L7708r5105j77757p421L1101L1817
$$ 200674 173233 54877 98311 151421 178786 216494 121389 -56368 -63789 -32688 -871
17415h71J26585n0053q7221l8793k2547M7474N2918J76360J24855J58230K70166
$$ -871 125714 75661 -11560 -50353 -72900 -25426 27492 203852 328707 486937 757103
17404G57103J75208J24546J60169J20060J37487J13318J14958p230k63178j23980
$$ 757103 932311 1056857 1217026 1337086 1474573 1587891 1702849 1695619 1432441 1308461
17394A308461n1990j10048j51741j98079k02297q7733j18374o8386q0665M1639
$$ 1308461 1256471 1146423 994682 796603 594306 506573 388199 319813 239148 280787
17384B80787l6628k7160q7059m0163N1024p554p9355l7966R2731R9586j30677
$$ 280787 244159 216999 129940 89777 140801 133247 53892 15926 108657 208243 77566
17373G7566q0558k0191L1172m7010n7563j2696N1710Q8945l4152N8315J21848
$$ 77566 -2992 -23183 7989 -39021 -96584 -109280 -57570 31375 -2777 55538 177386
17362A77386M321r6670m1316m2509L2093J48J3166l4053L8288J13767l0171K5003
$$ 177386 181707 85037 43721 1212 33305 33453 46619 12566 50854 164621 134450 159453
17350A59453J19292k8757k9657j11812n9694P0198J3065j28133K2502N8357K7284
$$ 159453 278745 249988 220331 108519 48825 119023 132088 3955 26457 84814 112098
17339A12098L7358p0147M4845j0231q1445m8360j4603o6853r5273j1453Q7082
$$ 112098 149456 79309 124154 113923 32478 -15882 -30485 -97338 -192611 -204064 -116982
17328a16982J25935R443N8866J21129O2948m5144p9266k4275n1616J8655J22874
$$ -116982 8953 18396 77262 198391 261339 216195 136929 112654 61038 79693 202567
17317B02567P8230o4698l8450o1086n0309R6602m2052j8724M7783m0747j2965
$$ 202567 280797 216099 177649 116563 66254 162856 120804 102080 149863 109116 96151
17306I6151J8394N7925K0803R2333M9928q0929m5801M8781J34596o0255j83821
$$ 96151 114545 172470 193273 285606 335534 254605 208804 257585 392181 331926 148105
17295A48105j34635p4486n7282L5622M2531R3810J06277J33479m2842j20985l4805
$$ 148105 13470 -61016 -118298 -82676 -40145 53665 159942 293421 250579 129594 94789
17284I4789n6289r2422J12573O8090j971J25336J636j27657j54403j1216q8397
$$ 94789 38500 -53922 58651 126741 124770 250106 251742 124085 -30318 -41534 -129931
17273a29931Q663L9737k4047N4580Q5230L0675J11000M6080n8848j4733j32612
$$ -129931 -121268 -81531 -105578 -50998 34232 64907 175907 221987 163139 148406 15794
17262A5794j57967j74144K5923P6199R9814K02833Q2164j894L098K3101j8738
$$ 15794 -142173 -316317 -290394 -214195 -114381 88452 170616 168722 171820 194921 176183
17251A76183q149J23490l8997j70643j2006o92n6735j420J15411J8219q3613j30088
$$ 176183 168034 291524 252527 81884 69878 69186 12451 11031 126442 144661 61048 -69040
17239f9040l2420J08152J02234J70604J06924L1665N7695J17847R982p0318m1253
$$ -69040 -101460 6692 108926 279530 386454 418119 475814 593661 603643 533325 492072
17228D92072j61325j48942o7223O423J32408n0576j80878k03702K6803R2469M9555
$$ 492072 330747 181805 114582 121005 253413 202837 21959 -181743 -154940 -62471 -12916
17217a2916l9070l5773O6356N7708O0799P4115Q544o5746l2300p6776J6720M1167
$$ -12916 -51986 -87759 -21403 36305 97104 171219 179763 114017 81717 4941 21661 62828
17205F2828m4097K8209J9236j45127j10848O9747J17355m3390q532P8674M6841
$$ 62828 18731 46940 66176 -78951 -189799 -120052 -2697 -46087 -54619 24055 70896
17194G0896q9608l1930R9375Q9522j4382J6237q5818O41k1984O8686L1547J53305
$$ 70896 -18712 -50642 48733 138255 123873 140110 54292 54933 32949 101635 133182 286487
17182B86487Q2495r4605m7691M6841J13303j6822o0025J3965p4451J618j49006
$$ 286487 368982 274377 226686 273527 386830 370008 309983 323948 249497 251115 102109
17171A02109r1479q531P4470m5939r1533o9526J04906J84054K7371J25712j2751
$$ 102109 10630 2099 76569 30630 -60903 -130429 -25523 158531 185902 311614 298863
17160B98863j25602J6834J037o3068j2409N6215J9790L4354R475j02750j14286
$$ 298863 173261 190095 191132 128064 115655 171870 191660 226014 235489 132739 18453
17149A8453j29006o6795L2966Q8161m352J1341L1576l0706J092K3790m2162r9375
$$ 18453 -110553 -177348 -144382 -56221 -60573 -49232 -17656 -48362 -47270 -23480 -65642 -165017
17137a65017l9511L027J37100J78710q1603j88472k3075J26448K09952P4414M3812
$$ -165017 -204528 -201501 -64401 114309 32706 -155766 -178841 -52393 157559 231973 275785
17126B75785j17645j97316J0188J20578P0424l0651r2290K7562l2081J42196R3022
$$ 275785 158140 -39176 -28988 91590 162014 131363 39073 66635 34554 176750 269772
17115B69772j16330j05809J8330r104j2293p4303o5031J43130R0794j76019N4925
$$ 269772 153442 47633 65963 56859 44566 -29737 -94768 48362 139156 -36863 18062
17104A8062K2833J14215N9892q8139L5684N7895m1873j1104J98625N9616r1298
$$ 18062 40895 155110 215002 126863 162547 220442 178569 167465 366090 425706 334408
17093C34408n4243j1867l8261J0418k8587k0071K2081J72493J41183r4600j51683
$$ 334408 280165 268298 230037 240455 211868 191797 213878 386371 527554 432954 281271
17082B81271Q56k9093j44152l7849L5620m8130M7264K3274L908M1151j6031q0478
$$ 281271 282127 253034 108882 71033 106653 58523 105787 129061 132969 174120 158089 77611
17070G7611q6185n7647O2377O2283N9125P8333J25088L374L7958L1777K953L643
$$ 77611 -8574 -66221 -3844 58439 117564 195897 320985 324359 362317 394094 397047 400690
17058D00690m6866l356m4114r6674J7550j387J07728L1113j33005j65620K3679
$$ 400690 353824 350468 306354 209680 227230 225843 333571 364684 231679 66059 89738
17047H9738m7617L7700J180k6690N2777K26249J20270J1602p8964l5039R048P6093
$$ 89738 42121 79821 81001 54311 107088 333337 453607 465209 386245 351206 360254 436347
17035D36347P4022m9877o8895o7139K2839J0534o2472j36609L3086Q864J37980
$$ 436347 510369 460492 391597 324458 347297 357831 295359 158750 191836 200700 338680
17024C38680P3041l2367r2991j89652j5271K4777Q7876O3378M0982O1242j4215
$$ 338680 411721 379354 286363 96711 81440 106217 194093 257471 298453 359695 345480
17013C45480Q8455O0386K689j18818j38037k2701N6165J70528J40933J00614K46347
$$ 345480 433935 494321 497010 378192 240155 217454 273619 444147 585080 685694 932041
17002I32041K71016J18790J05152J38447L69601L33196J32341k38017k68588j86187
$$ 932041 1203057 1321847 1426999 1565446 1935047 2268243 2400584 2162567 1893979 1707792
16992A707792j45926k37433j82209j99901j45459p9867R3208P7928r2055j03788
$$ 1707792 1561866 1324433 1142224 942323 796864 716997 810205 888133 796078 692290
16982F92290P8768J47966P7714r7891j26178j22978r407J4119L2655J027n2658
$$ 692290 771058 919024 996738 898847 772669 649691 640284 654403 687058 688085 635427
16971F35427j10145j13996q618k7559N8065k8429K4903J29403J16261L4645N4865
$$ 635427 525282 411286 402668 375109 433174 404745 429648 559051 675312 709957 764822
16960G64822J11438J64340R4234n7926j75295j06590P9745J73974j04536r1616
$$ 764822 876260 1040600 1134834 1076908 901613 795023 874768 1048742 944206 852590
16950H52590r7961o4211L3286O6183j17776r9922j1875K0914J8589r9063L0116
$$ 852590 754629 690418 723704 789887 672111 572189 560314 581228 599817 500754 530870
16939E30870k3222j29879l4072p5127K5913J5044J1753k3576O060l2838k1876
$$ 530870 507648 377769 343697 268570 294483 309527 321280 297704 303764 270926 249050
16928B49050J8339K03557M5099N8811J4115o4239M0157K6776o4268n0501J07433
$$ 249050 267389 470946 516045 574856 588971 524732 564889 591665 527397 476896 584329
16917E84329R5773L6848k8564l4528r5704j9359P3135j13319L9905O846J5181
$$ 584329 680102 716950 688386 653858 558154 538795 611930 498611 538516 545362 560543
16906E60543J20874l3806O9957O3653M9949J3365L4236q8252j42378q5671L8994
$$ 560543 681417 647611 717568 781221 831170 844535 878771 790519 648141 562470 601464
16895F01464Q8774J18079J74822Q2424l0477q0991q1840Q8698K01545J05710O3626
$$ 601464 690238 808317 983139 1065563 1035086 954095 872255 960953 1162498 1268208 1331834
16884A331834l2271j7928J35497J99055J10859K8496J30275J92764M3768j6914
$$ 1331834 1299563 1281635 1417132 1616187 1727046 1755542 1885817 2078581 2122349 2105435
16874B105435K07110K09742J40333J63550K72940J93113J55615K51830J73183
$$ 2105435 2312545 2522287 2662620 2826170 3099110 3292223 3447838 3699668 3872851
16865C872851K65400L96411L16761L48145M69377N35789J97214K35432L74769
$$ 3872851 4138251 4534662 4851423 5199568 5668945 6204734 6401948 6637380 7012149
16856G012149N38661N63381P37992P80843J048954J074727J306089J754820J980001
$$ 7012149 7550810 8114191 8852183 9633026 10681980 11756707 13062796 14817616 16797617
16847A6797617K525383L210261M119401N345573P462510J0416273J4626266K0856914
$$ 16797617 19323000 22533261 26652662 31998235 39460745 49877018 64503284 85360198
16839H5360198K7843021L1679475K8003630K0462543J9064741K5968883L1882507
$$ 85360198 113203219 144882694 172886324 193348867 212413608 238382491 270264998
16832B70264998K1420806n925708k5109988k6428863k0087681j8022873k4153324
$$ 270264998 291685804 285760096 260650108 234221245 214133564 196110691 171957367
16825A71957367l0436230l0382270k5371799j9206723j3985710j0175913p440437
$$ 171957367 141521137 111138867 85767068 66560345 52574635 42398722 34958285
16818C4958285n346860m033484l096081k514033k296905j983408j695288j366052
$$ 34958285 29611425 25577941 22481860 19967827 17670922 15687514 13992226 12626174
16810A2626174j122252j079284j034947p42369n00529m14512l46782j43493k42450
$$ 12626174 11503922 10424638 9389691 8647322 8146793 7732281 7385499 7242006 6999556
16801F999556l20992l86180m89537n49031m29002k34960k53683l66008l68538
$$ 6999556 6678564 6292384 5802847 5253816 4824814 4589854 4336171 3970163 3601625
16792C601625l10330k86022k42319j87308j89947m3423J9918k19777j47326j02423
$$ 3601625 3291295 3005273 2762954 2575646 2385699 2342276 2362194 2142417 1995091 1892668
16782A892668l4237L7631M9154O0233j77784j54191j1694J8761r9201j59652p6680
$$ 1892668 1858431 1896062 1945216 2005449 1827665 1673474 1661780 1680541 1581340 1421688 1345008
16771A345008R0716J91045K6360j55276p6002L2339O8349j39112j20903q3705
$$ 1345008 1435724 1626769 1653129 1497853 1421851 1454190 1522539 1383427 1262524 1178819
16761A178819r8605N1003K277k26347j01800J81064J3232n0310o5280p629l9544
$$ 1178819 1080214 1131217 1133494 907147 805347 986411 999643 949333 884053 876424 836880
16750H36880n6292R9348j07239k2982J8951k3521J22635n0134k23621j60035P55
$$ 836880 780588 879936 772697 749715 768666 745145 867780 817646 594025 433990 434745
16739D34745L4106J69511M0411m1508l861k4160M5521m2702m0711r331J0976J04933
$$ 434745 468851 638362 678773 637265 633404 609244 654765 612063 571352 562021 572997 677930
16727F77930r9274j28947M3755L3000J8032K8515l4546m0445Q4163p8957j34424
$$ 677930 578656 449709 493464 526464 544496 573011 538465 498020 582183 503226 368802
16716C68802k315L7762L5888L7234j7552P8457P4100O009J8953N4190p4591j7236
$$ 368802 366487 404249 440137 477371 459819 538276 612376 618385 637338 691528 616937 599701
16704E99701o1121k3827K1047O5269j26344r0173p2075l0967N3985J15804r205
$$ 599701 538580 514753 535800 601069 474725 384552 312477 281510 335495 451299 442094
16693D42094p3816P0216r4488q9027j6200J6780J69283p3025j95944R9264J53172
$$ 442094 368278 438494 344006 254979 238779 255559 424842 351817 155873 255137 408309
16682D08309j3789l395q6900J9156q158j0287l2140m3685N1122j1493l2538p9712
$$ 408309 394520 391125 304225 323381 315223 304936 272796 229111 280233 268740 236202 156490
16670A56490l522N0397P303q6648J21524Q8145q107k4934q6837j74002l1088J74282
$$ 156490 152968 203365 210668 124020 245544 333689 325582 300648 213811 39809 8721 183003
16658A83003M1870K6273L6852m8041J6642m2831j20087J5841l609L0650k3183
$$ 183003 224873 251146 287998 239957 256599 213768 93681 109522 105913 136563 113380
16647A13380o2411q7635k0519R603L5292L2360N2082p2074L8208N2045J35740
$$ 113380 50969 -36666 -57185 -47582 -12290 20070 72152 78 38286 90331 226071
16636B26071J11333O3102n379q0264p2204L4472j16494n180J08031p2075p3879
$$ 226071 337404 400506 395127 314863 242659 277131 160637 155457 263488 191413 117534
16625A17534J50386K3852j31369p0482k0754o3022J60044N2161j80655J0284Q9878
$$ 117534 267920 291772 160403 89921 69167 6145 166189 218350 37695 47979 137857
16614A37857J08603P3211r9330j27656j7255N9729L2818P40O8191J49450p798
$$ 137857 246460 319671 220341 92685 75430 135159 167977 168717 236908 386358 378560
16603C78560j76264k18770j4337J43488K7230n3976M97k001k8389l0K2379O0662
$$ 378560 202296 -16474 -30811 112677 139907 85931 86428 84427 56038 56008 78387 139049
16591A39049p3859j0227R3082M6014o6518j9101J25349M7155k9092K6893j5128
$$ 139049 65190 54963 148045 194059 127541 108440 233789 280944 251852 278745 263617
16580B63617q919J22097P4344j32452j60633J7412M7139K3622J23467M4413O7206
$$ 263617 254698 376795 451139 318687 158054 175466 222605 246227 369694 414107 481313
16569D81313j06992j25698o1798K9813L7916J0302n1600q0982q5228K053m390
$$ 481313 374321 248623 186825 216638 254554 264856 213256 132274 47046 49099 44709
16558D4709j22863o0371J71588L7984M3266N0592m7854j24877j7977r759J0581
$$ 44709 -78154 -138525 33063 71047 114313 164905 117051 -7826 -25803 -35562 -24981
16547b4981o0523N5276N3755j8646l9524O1216Q7087J7665J4763l4839l3380L3487
$$ -24981 -85504 -30228 23527 4881 -34643 26573 113660 131325 146088 111249 77869 111356
16535A11356J56320o4564m0320J1689k53p5973o1590k1872M2916o1302n1829q947
$$ 111356 267676 203112 162792 174481 174228 98255 36665 14793 57709 -3593 -55422 -64369
16523f4369J51168J31312j25184j59392K5287j8311l77K8015O7524Q3279Q7598
$$ -64369 86799 218111 92927 -66465 -41178 -59489 -59866 -31851 35673 118952 206550
16512B06550p7926m8678l1702O5117k5342q9561n0589k8980L659m8288m6416j10371
$$ 206550 128624 79946 48244 113361 88019 -1542 -52131 -81111 -77452 -125740 -172156 -282527
16500b82527M6467K25776J75073K4083m5473K9668P7713N2285q9959r812p1959
$$ -282527 -236060 -10284 164789 188872 143399 173067 250780 303065 213106 203294 131335
16489A31335J17091N1776j5816p9675j5195j35609o7623j3782M6798N8047l3170
$$ 131335 248426 300202 284386 204711 189516 53907 -13716 -27498 19300 77347 44177
16478D4177n0825j1789P4669P3263K1356j23513m7172k2407r3046L3870O4077
$$ 44177 -6648 -18437 56232 129495 150851 27338 -19834 -42241 -135287 -101417 -37340
16467c7340P9742j5561o7371M1749K1885K6270J5452M3500k6748P0172k1357q3948
$$ -37340 42402 26841 -40530 1219 23104 49374 64826 108326 81578 151750 130393 46445
16455D6445P3901k8303p5520k7863m0721o9851O7644J20318R893m2458m487j31292
$$ 46445 120346 92043 16523 -11340 -52061 -121912 -54268 66050 75943 33485 28998 -102294
16443a02294m1218O8302N0910L9777L0101q2826q4655P3747m216l5577Q041J2028
$$ -102294 -143512 -75210 -24300 15477 45578 -37248 -121903 -48156 -52372 -87949 -79908 -67880
16431f7880o1553J6112P4754R4931M5028M3998q9513k47432L6048J08228K3360
$$ -67880 -129433 -113321 -38567 56364 101392 145390 55877 -191555 -155507 -47279 -23919
16420b3919l4056k4240J184K5241R674l6583l9964O733J4968K4896J05101P4135
$$ -23919 -57975 -82215 -81031 -55790 -46116 -82699 -122663 -115930 -100962 -76066 29035 103170
16408A03170p3830j21957o7350L7417J3138n9798l6925J2068l0809m4014K6168
$$ 103170 29340 -92617 -159967 -122550 -109412 -169210 -206135 -194067 -224876 -268890 -242722
16397b42722L4657J87673J42625N759k03570l3538J00151K9167k8705j6185l4147
$$ -242722 -208065 -20392 122233 127992 -75578 -109116 -8965 20202 -8503 -24688 -58835
16386e8835n9611J30667K7872n4035o1978J37711N4993r8300l2988L8736O1671
$$ -58835 -118446 12221 40093 -13942 -75920 61791 116784 18484 -14504 24232 85903
16375H5903L8148j24781n3650Q1195K7293o1918J6497L1979P4470n929m3045k8512
$$ 85903 124051 -730 -54380 26815 54108 -7810 8687 40666 115136 109207 66162 37650
16363C7650M6763J50273O2675l1583j33149n8777l4345M7738Q4661o4524r4362
$$ 37650 84413 234686 297361 265778 132629 73852 39507 87245 171906 107382 13020
16352A3020r1273j40n188j11418k6316Q8271K0382j10409N5630R7698Q7328R6290
$$ 13020 -78253 -78393 -83581 -194999 -221315 -133044 -112662 -223071 -167441 -69743 17585 113875
16340A13875J04984L4244o7471O4578q7340l8330j2004k5985k5852j92261j1005
$$ 113875 218859 253103 185632 250210 162870 124540 112536 86551 60699 -131562 -142567
16329a42567J82883m5175K973L5783Q0532K9426k2646M6597K9457r9295j86974
$$ -142567 40316 -4859 -1886 33897 114429 143855 121209 167806 197263 97968 -89006
16318h9006k7043J24868n286K8230j3362l5539P5977J5518k6596m7727N4454O8365
$$ -89006 -116049 8819 3533 31763 18401 -17138 58839 74357 47761 34 54488 122853
16306A22853N3546M2128j38886p4531Q5818R3925p982K8231j16148n3961l2874
$$ 122853 176399 218527 79641 5110 90928 184853 176871 205102 88954 34993 2119
16295B119k7060Q5968o3978M5580M8095N4364K3728j19078q1240l6369Q3257R4204
$$ 2119 -24941 61027 -2951 42629 90724 145088 168816 49738 -31502 -67871 15386 109590
16283A09590o9622k6364k2103M4234J5632L356P2106L6496j6295L9962J4718J895
$$ 109590 39968 13604 -8499 35735 51367 54723 126829 163325 147030 186992 201710 203605
16271B03605M6968N1023k1641M6810J83208K31502K23864N4979J28753J06439
$$ 203605 250573 301596 279955 326765 509973 741475 965339 1020318 1149071 1255510
16261A255510L0135J21401J50985j5209j52154j86908q2885m7427j96365j66780
$$ 1255510 1285645 1407046 1558031 1542822 1390668 1203760 1120875 1073448 877083 710303
16251G10303j22470j53235p2807n6541k18046j69946M7598j3180P5995j5405o5022
$$ 710303 587833 434598 361791 305250 87204 -82742 -35144 -48324 27671 12266 -52756
16240e2756j20682J73668J51478O742L5186L2967j14980n6655l5092m7832L8840
$$ -52756 -173438 230 151708 158450 193636 226603 111623 54968 19876 -27956 10884
16229A0884O3358J8053p8388o7222R0648R7473J89116k4349n1288m7464p7230
$$ 10884 74242 92295 13907 -53315 37333 134806 323922 299573 248285 200821 123591
16218A23591k610K3953o1547r6541J35631N3437n0916J63611J18369J20542j02921
$$ 123591 120981 144934 83387 -13154 122477 175914 124998 288609 406978 527520 424599
16207D24599j70767k8288o0141o8839J22104K6930L7479K3727j29364j02930J6286
$$ 424599 253832 225544 165403 96564 218668 245598 283077 306804 177440 74510 90796
16196I0796L9976J9282O1755p995n5057m4200p2440m5805l6702N7743N3529K7573
$$ 90796 130772 150054 211809 203814 148757 104557 32117 -13688 -50390 7353 60882 88455
16184H8455p0320q5247O07L5031n9803p0038J20115l6368j39823R7235J38912
$$ 88455 18135 -67112 -66505 -31474 -91277 -161315 -41200 -77568 -217391 -120156 18756
16173A8756R4466p2398J4325K023k5232M732K0705l2491K1384L9037P0191J2812
$$ 18756 113222 40824 55149 57172 31940 36672 57377 24886 46270 85307 155498 168310
16161A68310k0143q0641j02875k7607M4539O0781k5484L0133L7423M618L5001
$$ 168310 148167 67526 -35349 -62956 -18417 42364 16880 47013 84436 89054 124055
16150A24055j9254K7213l4077q4337N0291K6839j997r5894o395N0174J02936L3239
$$ 124055 104801 132014 97937 13600 63891 90730 88733 -7161 -13556 36618 139554 172793
16138A72793m2039m0877l1015L3677K5272l5771J7513o1099P3441m8638j44058
$$ 172793 130754 89877 58862 92539 117811 82040 99553 38454 111895 63257 -80801
16127h0801K7432J26147l9689j47372k2156M3923J3912L1310K701N712n8279q0193
$$ -80801 -53369 72778 33089 -114283 -136439 -92516 -78604 -47294 -44593 -38881 -97160 -177353
16115a77353O6621Q1215Q4046n7226L714J29167r2324j52876K2399Q1994R0452
$$ -177353 -110732 -29517 54529 -2697 1017 130184 37860 -115016 -92617 -10623 79829
16104G9829Q0463r7624j71202N2095J07174m8208o4059K0901J9548q4126l5607
$$ 79829 160292 62668 -108534 -56439 50735 2527 -61532 -40631 -21083 -105209 -140816
16093a40816N5757L8424m7017L2200L5652J03999o9589o1996j4998J12776J31367
$$ -140816 -85059 -46635 -93652 -61452 -25800 78199 8610 -53386 -68384 44392 175759
16082A75759j9731r8405O093j07121p2082O7703N775K2003L8818m2116j2397M5663
$$ 175759 156028 57623 63716 -43405 -115487 -47784 -42009 -20006 18812 -23304 -35701 9962
16070I962l931P2336n0049n5459J26106n6512j10552m1318K154J02511l26o4750
$$ 9962 6031 78367 28318 -27141 98965 42453 -68099 -109417 -107263 -4752 -5078 -69828
16058f9828n6241n231J02417n3146l8639j19j9058k2521j2801L0466K0629K2156
$$ -69828 -126069 -131300 -28883 -82029 -120668 -120787 -139845 -162366 -175167 -144701 -124072 -101916
16046a01916J9176K8898J36479r3709q9906L1109o3962M9759Q2846o1829m3876
$$ -101916 -82740 -53842 82637 -11072 -100978 -69869 -133831 -84072 -1226 -63055 -106931
16035a06931M7106R4759n9430p1532k7530p5943m4205J34571R0169Q8318M5153
$$ -106931 -59825 34934 -24496 -96028 -123558 -199501 -243706 -109135 -18966 69352 114505
16024A14505j7802r1891m4070O2203M8206k7401n7062n6174R2846J2275k8930
$$ 114505 96703 4812 -39258 22945 71151 43750 -13312 -69486 23360 35635 6705
16013F705n264M7230L8001L556M6606r4049m0659L5484P2292r6443j2594n7258
$$ 6705 1441 48671 86672 90228 136834 42785 2126 37610 109902 13459 865 -56393
16001e6393j09717O9617k7256l7109L5470M8367n8642R8533J72123o2867p6838
$$ -56393 -166110 -96493 -123749 -160858 -125388 -77021 -135663 -37130 134993 72126 -4712
15990d712M9272R1281l1301n1794k3811m4306q0798Q96L6862q997R2536L1505
$$ -4712 44560 135841 104540 52746 28935 -15371 -96169 -95273 -58411 -67408 25128 56633
15978E6633M6006R7723j10886n4227O7857R225p0060j7921P4399J7623j18666
$$ 56633 102639 200362 89476 35249 103106 112331 42271 24350 98749 116372 -2294
15967b294j06243K00912R3628l0432J9631j21663n6026L262J4024P6123L2062
$$ -2294 -108537 92375 186003 155571 175202 53539 -2487 775 14799 90922 122984
15956A22984P1796m2746r7802j5278R5025N238n4259m5688r5700N515N0290P5930
$$ 122984 194780 152034 54232 38954 133979 139217 84958 39270 -56430 -50915 -625 75305
15944G5305P3832l6966N4324Q8200j49171j00692N1915Q085j13186r3232l4905
$$ 75305 149137 112171 166495 254695 105524 4832 56747 64832 -48354 -141586 -176491
15933a76491K7857j9164j809J56530R0770j8201j28142j5759Q2312l6832J0382
$$ -176491 -148634 -167798 -169607 -13077 77693 59492 -68650 -84409 -2097 -38929 -28547
15922b8547o5416o247J54586P9614N6080P6727K3984j08801o0987n0974r487J0318
$$ -28547 -93963 -100210 54376 133990 190070 266797 290781 181980 120993 70019 60532 70850
15910G0850k2657K8110J18212O1965j21504l123O6449j53762r5258j01346j7577
$$ 70850 48193 76303 194515 256480 134976 131853 198302 44540 -50718 -152064 -169641
15899a69641J8436P0026J22860J39475R5131j10192r9205o5069n2900K859J9558
$$ -169641 -151205 -81179 41681 181156 276287 166095 66890 1821 -51079 -48220 -28662
15888b8662M8428n5724q9690M930J4661M9841J00985J4602j78301Q4566P5509
$$ -28662 19766 -35958 -125648 -120718 -106057 -56216 44769 59371 -118930 -34364 41145
15877D1145J8488k1319m0289o8972n1208J2193M1194P8125r9033j4668O8621j3894
$$ 41145 59633 38314 -1975 -70947 -122155 -109962 -68768 9357 -89676 -104344 -35723 -49617
15865d9617R7577o029r7896J2567r3744O0964j3230M6436J0726p4465J58939O1875
$$ -49617 47960 41931 -55965 -43398 -137142 -76178 -89408 -42972 -32246 -106711 52228 114103
15853A14103k25047j26962k0209R5906O4121J08031M863q6207N9725J43584o931
$$ 114103 -110944 -237906 -258115 -162209 -98088 9943 14806 -71401 -11676 131908 124977
15842A24977K231j22185k34065j23256J54028Q0126K8375o9980R7470m6797L274
$$ 124977 127208 5023 -229042 -352298 -198270 -118144 -89769 -159749 -62279 -109076 -105802
15831a05802l036Q3361R3899M8683l8144l2940o4522k1764L8211Q4783k3375o8593
$$ -105802 -108838 -25477 68422 117105 78961 46021 -18501 -40265 -2054 82729 59354 -9239
15819i239m9444R0731L4304J2406P028j1455l1965K1519M2900p9384n6143J5298
$$ -9239 -58683 32048 66352 78758 85786 74331 42366 63885 106785 27401 -28742 -13444
15807a3444n053J91630j5200j59918n8211L5601m221L5543J11342M4166n5228
$$ -13444 -18497 173133 157933 -1985 -60196 -24595 -28816 6727 118069 162235 107007
15796A07007p5823k1796o5941R9099K9250l0943l5661r7261N6698O0298J40418
$$ 107007 31184 9388 -56553 42546 71796 40853 5192 -92069 -35371 24927 165345
15785A65345P133j01457l7125q5551L462L9833N934N6978N363K529K084l2656
$$ 165345 172478 71021 33896 -51655 -48193 -8360 -2426 54552 59915 62444 64528 31872
15773C1872m2030j08720O5210J21205q2507m6801L8037Q0143n7643r5236j0899
$$ 31872 -10158 -118878 -53668 67537 -14970 -61771 -23734 56409 -1234 -96470 -107369
15762a07369N1024L5000Q6954R043P8186O6041j33402j76650O5924J13740n9275
$$ -107369 -56345 -21345 65609 74652 152838 218879 85477 -91173 -25249 88491 29216
15751B9216j23168N6964M8844J3707N2621m6335m1562o6036M6744m4615j723Q6620
$$ 29216 -93952 -36988 11856 25563 78184 31849 -9713 -75749 -29005 -73620 -75343 11277
15739A1277m3956Q1856K5621k7594j05861J6525Q5564O0605j8609J2952m7858
$$ 11277 -32679 49177 74798 47204 -58657 -42132 43432 104037 85428 98380 50522
15728E0522O7003P9185j16070o5107j1487Q2614p2095L506j3751O139n8092r3834
$$ 50522 117525 196710 80640 15533 4046 86660 14565 18071 4320 10459 -47633 -141467
15716a41467L8338k597k7596k4255q844R0927k6129R8434O508j46342p5666n1800
$$ -141467 -103129 -105726 -133322 -157577 -166421 -75494 -101623 -3189 3319 -143023 -218689 -270489
15704b70489J4276P7072J46829J9310q6815L3459K0937L8555O3609M4207j983
$$ -270489 -256213 -179141 -32312 -13002 -99817 -66358 -45421 -6866 56743 100950 98967
15693I8967N9383M5849m8419o4059r9484o5741J64385O065N0642j5102M2725r5561
$$ 98967 158350 204199 155780 91721 -7763 -73504 90881 96946 147588 132486 175211 79650
15681G9650j30184Q3816J021M3816l2816j91554j24946J09428J40686L0665L8135
$$ 79650 -50534 33282 34303 78119 45303 -146251 -271197 -161769 -21083 9582 47717
15670D7717j961o9470r6525N4594J43457k1966L5741J30311o560l2686L2532j18734
$$ 47717 45756 -23714 -120239 -65645 77812 55846 91587 221898 215338 182652 215184 96450
15658I6450q1341L3372l3046J815O2104j4371j64303l5974R037m7871l3038p6966
$$ 96450 15109 48481 15435 17250 79354 64983 -99320 -135294 -126257 -174128 -207166 -284132
15646b84132J09113j9459R6733R6338J07548k4128K0377R0856j6741q7200j90198
$$ -284132 -175019 -194478 -97745 -1407 106141 82013 102390 193246 176505 89305 -100893
15635a00893l5922J47518R8168j24088q255q0867o0997N1973l8487J1022l458
$$ -100893 -136815 10703 108871 -15217 -23472 -104339 -165336 -113363 -151850 -140828 -144286
15624a44286K3808J12116l6438J3562m1274n1004k2756p8220o424N3108J1473
$$ -144286 -120478 -8362 -44800 -31238 -72512 -123516 -146272 -224492 -230916 -177808 -166335
15613a66335Q8077J85532q4117p4357m2853P2389K9352l8048L3142N893j230p7479
$$ -166335 -78258 107274 23157 -51200 -94053 -21664 7688 -30360 2782 8675 7445 -70034
15601g0034q4782m6790M0308R8823J02045q0756k11535m3798J12305Q1890M6986
$$ -70034 -154816 -201606 -161298 -62475 39570 -41186 -252721 -296519 -184214 -102324 -55338
15590e5338N1408q5671q4786r2234l0720R6742K1814l5359l2471j42945j9960
$$ -55338 -3930 -89601 -174387 -266621 -297341 -200599 -178785 -214144 -246615 -389560 -409520
15579d09520K29245R6996O2795m2409l613N5729L345l4192o0510L0933M4214k3722
$$ -409520 -180275 -83279 -20484 -62893 -66506 -10777 -7432 -41624 -102134 -71201 -26987 -50709
15567e0709j17879R0584M0607o0950m1628j9009l4043J13093L6600L4918J33958
$$ -50709 -168588 -78004 -37397 -98347 -139975 -158984 -193027 -79934 -43334 -8416 125542
15556A25542r7144j4579L3596J3547q8152Q4710K8974l8154L3596R500p6271K0495
$$ 125542 28398 13819 47415 60962 -27190 57520 86494 48340 81936 91436 15165 35660
15544C5660P0053q2159r1868j38035n9745N2608J24449n0609k6006J7562M1904
$$ 35660 105713 23554 -68314 -206349 -266094 -213486 -89037 -139646 -165652 -148090 -106186
15533a06186R8051M0037L4083O6984M2587l7619m6005l730L6213K9335j2585r3475
$$ -106186 -8135 31902 65985 132969 175556 137937 91932 88202 124415 153750 141165 47690
15521D7690n6431p77M9207L7189J8276r0449n7705l0705p3611L1753J13640O1254
$$ 47690 -8741 -9518 39689 76878 95154 4705 -53000 -83705 -157316 -125563 -11923 49331
15509D9331q9578j28726p5018P0135N2709R9199O8333N172N8492r064O8133o7727
$$ 49331 -40247 -168973 -243991 -173856 -121147 -21948 46385 51557 110049 100985 169118 101391
15497A01391J7937N3477L826m8198m5794j08765p7462M6230l6521J0253o2265
$$ 101391 119328 172805 176631 128433 82639 -26126 -103588 -57358 -93879 -83626 -145891
15486a45891R2775Q6891l7556k5717O1626n1319O6617l2483M7154k2323r488p9007
$$ -145891 -53116 33775 -3781 -29498 32128 -19191 47426 14943 62097 39774 30286 -48721
15474d8721Q3321N4881m9409n6825r0193P1245L7388j4163o6358J6321O2095J32889
$$ -48721 34600 89481 40072 -16753 -106946 -35701 1687 -12476 -78834 -62513 -418 132471
15462A32471J88769Q810j46730r0022j9290M6590j1049j1641J60442m1318j53293
$$ 132471 321240 330050 183320 93298 74008 120598 109549 97908 258350 217032 63739
15451F3739J2648p0628o7550l9970N8751J2627L6628N1488q206J11777J20857
$$ 63739 76387 5759 -61791 -101761 -43010 -30383 6245 57733 49527 161304 282161
15440B82161j19293r2135L419p5253j5832M733K8412M1618O0503R255m7047o6284
$$ 282161 162868 70733 74152 -1101 -16933 -12200 16212 57830 118333 127588 80541 14257
15428A4257M6694r507m2380J58591Q7753K324j00575p3593o663L5519k7502p1606
$$ 14257 60951 51444 9064 167655 255408 257732 157157 83564 76901 112420 84918 13312
15416A3312l9600L7502K1571J7192k6593m4595Q4682M5454m3755L2520M8396j2037
$$ 13312 -26288 11214 32785 49977 23384 -21211 63471 108925 65170 97690 146086 134049
15404A34049o6338O8793M0269J92042K34466L60434N02238L37490q4185n42527
$$ 134049 67711 136504 176773 368815 603281 963715 1465953 1803443 1719258 1176731
15394A176731l70141k24222j44507q4194n3151J7251J46242j35410j46846p1912
$$ 1176731 806590 582368 437861 353667 300516 317767 464009 328599 181753 109841
15384A09841M142j3237j2945n5799J3878j11744J2193n1501n614p6058m7545J34579
$$ 109841 113983 100746 87801 32002 45880 -65864 -53671 -105172 -110786 -186844 -234389 -99810
15372i9810J21257K6152k7159r6164p683N4440r1890N0400m4222n568O6282J1947
$$ -99810 21447 47599 20440 -75724 -83407 -28967 -120857 -70457 -114679 -120247 -53965 -42018
15360d2018Q1448j976l9371j45587j69937J49929R9297L2313j1104q1805l4923
$$ -42018 39430 37454 -1917 -147504 -317441 -167512 -68215 -35902 -47006 -128811 -163734
15349a63734p1957o969K7007R495L4819n3021p212O3997N1569K0887L6061K5652
$$ -163734 -235691 -242660 -215653 -206158 -171339 -224360 -231572 -167575 -116006 -95119 -59058 -33406
15337c3406m3222R111L990R045J4587j7323m1893J35119J22978k6488o2351j43551
$$ -33406 -76628 -67517 -63527 -54482 -39895 -57218 -99111 36008 158986 132498 70147 -73404
15325g3404k7746J3982j41748q5486J21275M1030J7025O3213Q9330Q458n7090
$$ -73404 -101150 -87168 -228916 -314402 -193127 -152097 -135072 -71859 17471 25929 -31161
15314c1161k7049K7114J30846m7920j20527J7417N1297k6430k8177r384J27968
$$ -31161 -58210 -31096 99750 51830 -68697 -51280 17 -26413 -54590 -63974 63994
15303F3994Q3707l7648j1214r5662j67280l8971J23495K6803k2023r3193K7655
$$ 63994 147701 110053 98839 3177 -164103 -203074 -79579 -52776 -74799 -167992 -140337
15292a40337R9510L9763M5636J6249m0379m5737j2628k8934j11174k51J40116
$$ -140337 -40827 -1064 44572 60821 20442 -25295 -37923 -66857 -178031 -178282 -38166
15281c8166o5396n8163J6051N6049O6006P6288K4558M118N281l0821p7839p9234
$$ -38166 -103562 -161725 -145674 -89625 -23619 52669 77227 81345 86626 55805 -22034 -101268
15269a01268N3638K0733Q220q5237J5320j4229O0584j16171j28268J22393J27256
$$ -101268 -47630 -26897 -18677 -103914 -88594 -102823 -42239 -158410 -286678 -164285 -37029
15258c7029m1768l8609o0466m2597J40699r143K8370j5624p5867J7212O3605J22758
$$ -37029 -78797 -117406 -177872 -220469 -79770 -88913 -60543 -76167 -152034 -134822 -71217 51541
15246E1541L8946j39820j32221j5506K6764N9284q754J3701j2110P2151p031r4934
$$ 51541 90487 -49333 -181554 -197060 -170296 -111012 -119766 -106065 -118175 -46024 -53055 -147989
15234a47989r2804J64447J28208l3675J664j8022L8752n4242k2677k1172L8261
$$ -147989 -240793 -76346 51862 18187 19851 1829 40581 -13661 -36338 -57510 -19249
15223a9249P5489M0497J3424m6409j45653o8050p1540o6797j22015J13668J83972
$$ -19249 56240 96737 110161 63752 -81901 -149951 -221491 -288288 -410303 -296635 -112663
15212a12663M3032n4337o6387N0589J28728J19077o0740j24121m6046J2749p8363
$$ -112663 -69631 -123968 -190355 -139766 -11038 108039 47299 -76822 -122868 -110119 -188482
15201a88482J1715J30558K03470P8556J14985q7743j42657j21856K6034q6593
$$ -188482 -176767 -46209 157261 235817 350802 263059 120402 -1454 24580 -62013
15191f2013J1221K1208m9734L2208J29716J5277q2383j1315o0877o8866K2438
$$ -62013 -50792 -29584 -79318 -47110 82606 97883 15500 4185 -56692 -125558 -103120
15180a03120K9713P470K0783K2357P8882J4741p3411j6665O9625m8745K5572K2249
$$ -103120 -73407 -65937 -45154 -22797 56085 70826 -2585 -19250 50375 1630 27202 49451
15168D9451L9138j1716j78092k9772j3852q8243M5164k0657k9562P3234J25952
$$ 49451 88589 76873 -101219 -130991 -144843 -233086 -187922 -208579 -238141 -164907 -38955
15157c8955J56266m3088p2260p6043N4486R0762n5875m5861Q0559m6805j3336
$$ -38955 117311 74223 1963 -74080 -19594 71168 15293 -30568 49991 3186 -10150
15146a0150M6611k8849n0194O7036l3658j51187o4771N5398K13898J85773O6286
$$ -10150 36461 7612 -42582 24454 -9204 -160391 -225162 -169764 44134 229907 296193
15135B96193m0044o8673p8210J7732J8490K2674J34386L858J08138Q6300J52516
$$ 296193 256149 187476 109266 126998 145488 168162 302548 306406 414544 500844 653360
15124F53360J14368N2883J7128o4325j10422J5446m4753q7664j42427q0628o39
$$ 653360 767728 820611 837739 773414 662992 678438 633685 546021 403594 322966 322327
15113C22327j47637j51622J7375M0624J8565k2324N5082q8592K8930J70634o6130
$$ 322327 174690 23068 40443 81067 99632 77308 132390 43798 72728 243362 177232
15102A77232j65114q5619Q233n4713q448N7193L152Q5152M9009j755o8075K1816
$$ 177232 12118 -73501 -65268 -119981 -128429 -71236 -68084 17068 66077 64322 -3753 18063
15090A8063J115N2963k0020K6865N1725J13995j4483p7042l5131k6586J3710N5028
$$ 18063 19178 72141 52121 78986 130711 244706 230223 153181 118050 91464 105174 160202
15078A60202Q0393R3607J64567m7532m0217j19381n1794K3785N6255O24p4137
$$ 160202 240595 334202 498769 451237 411020 291639 239845 263630 319885 320509 246372
15067B46372o5861N3450k7856r3330p8053p8526p4369L6306J04677K1274K7939
$$ 246372 180511 233961 206105 112775 34722 -43804 -118173 -81867 22810 44084 72023
15056G2023J5218q7667K2205R8162N7353j04749j27789P2775Q2690k533J2129
$$ 72023 87241 -426 21779 119941 177294 72545 -55244 17531 100221 97688 109817
15045A09817J48616K0526j73743l5630q8360j36786J30958J01118m8691j8674
$$ 109817 258433 278959 105216 69586 -18774 -155560 -24602 76516 27825 9151
15035I151J59240L4226k6089Q899l1758n6115m2934M7059P0828n104j45918l1417
$$ 9151 168391 202617 176528 185427 153669 97554 54620 101679 172507 167403 21485 -9932
15023i932O8553L4297m3711o1937k2353R9374J18776M928r9017j06070j47267
$$ -9932 58621 92918 49207 -12730 -35083 64291 183067 187995 88978 -17092 -164359
15012a64359p2211M7688r165J03241k8595o484J42679p062j14432j8569O3360
$$ -164359 -236570 -188882 -198047 -94806 -123401 -129885 12794 5732 -108700 -127269 -63909
15001f3909M1486J25251J02582O724r7794P7001J20467j92763j04012j02984q0947
$$ -63909 -22423 102828 205410 212134 114340 191341 311808 119045 15033 -87951 -168898
14990a68898r4706J16055J17959N1817j4996k3822R1096N2129J8684k355m3927
$$ -168898 -263604 -147549 -29590 22227 7231 -16591 74505 126634 145318 142963 99036
14979I9036K2579N069M0383m7522R476K3296j34628j80681K7338L2867n7086J4067
$$ 99036 121615 126684 167067 119545 129021 152317 17689 -162992 -135654 -102787 -159873 -145806
14967a45806M9331N7023N8447P0780J2798p4622j8352Q610O0514J1784n4787n7526
$$ -145806 -96475 -39452 18995 89775 102573 27951 9599 18209 78723 90507 35720 -21806
14955b1806K546n700m5135r1374P7020Q6314P0983N1472k1903M9726J55925j4230
$$ -21806 -19260 -24960 -70095 -161469 -84449 1865 72848 124320 102417 152143 308068 293838
14943B93838j01034M64l6103o5161n1261j02400K676J9386j9214M038l0965N738
$$ 293838 192804 193268 157165 92004 40743 -61657 -58981 -39595 -58809 -54771 -85736 -79998
14931g9998L6267j27649Q107P1165l5523m5420O9090J70814L3673q4109k8501
$$ -79998 -43731 -171380 -163273 -92108 -127631 -173051 -103961 66853 100526 16417 -12084
14920a2084J2926q3009L1705L1950J5180o2527k0024J36303k1807M474Q8413J32807
$$ -12084 842 -82167 -50462 -18512 -3332 -65859 -85883 50420 28613 33087 121500 254307
14908B54307J2341j04668q9397J0382M9699O0858O3209j42018j38675L393J20044
$$ 254307 266648 161980 72583 82965 132664 193522 256731 114713 -23962 -20569 99475
14897I9475M9445j35502p4194J05671m9802p5047O9717J01455k6445k7898K6610
$$ 99475 148920 13418 -60776 44895 -4907 -79954 -10237 91218 64773 36875 63485
14886F3485L9220j5887O8609K1106J25264J09301p4253k00877j4909J75355o670
$$ 63485 102705 86818 155427 176533 301797 411098 336845 135968 121059 296414 289744
14875B89744k36205j36418n3143L0981O688K5765l7246N5391J4728n2516o2931
$$ 289744 53539 -82879 -136022 -105041 -98353 -72588 -109834 -54443 -39715 -92231 -155162
14864a55162M1222Q7170R644P0508j8536m53p0126J5700m4768R1011L1886K0293
$$ -155162 -113940 -26770 -17126 53382 34846 34393 -35733 -20033 -64801 26210 58096 78389
14852G8389n6001P7001j7484K0310K9807Q4914K8814j6036j30754j24949J22718
$$ 78389 22388 99389 81905 102215 132022 216936 245750 229714 98960 -25989 96729
14841I6729M3523M7680M3956j09056o3195M2237J1033m8688m5937o8153M154K53456
$$ 96729 140252 187932 231888 122832 59637 101874 112907 64219 18282 -49871 -45717 207739
14829B07739j1348j30811L3925L195l9098j32741k7967n931j25201m0031M7405
$$ 207739 196391 65580 99505 102700 63602 -69139 -97106 -103037 -228238 -268269 -220864
14818b20864J15369K4712N9817J8673o317L167n0940Q7612O2436l3396j18967
$$ -220864 -105495 -80783 -20966 -2293 -8610 -5443 -56383 31229 93665 60269 -58698
14807e8698K5782J24956p5176m1903k1993N8219l3746K0920l6135l4399J0621
$$ -58698 -32916 92040 16864 -25039 -47032 11187 -22559 -1639 -37774 -72173 -61552
14796f1552j712N2108q5663o8372Q8293K0201j19507j11444K9035J06308J84961
$$ -61552 -63264 -11156 -96819 -165191 -76898 -56697 -176204 -287648 -258613 -152305 32656
14785C2656N5856M0527L5163M8253j73601j21195P0335R0179q8080m9377m5221
$$ 32656 88512 129039 164202 212455 38854 -82341 -12006 78173 -9907 -59284 -104505
14774a04505O5120r3355m7304P278L5952J31590N281J8134m4024j20937N3686
$$ -104505 -39385 -132740 -180044 -172766 -136814 -5224 57 18191 -25833 -146770 -93084
14763i3084J31884N9552j09675K4454P2p6698L4929N3965J17130K6280n5913j48079
$$ -93084 38800 98352 -11323 13131 13203 -63495 -28566 25399 142529 168809 112896 -35183
14751c5183n3894O2249P829j21662j21861n2723J04477K16504O9875j22650j26869
$$ -35183 -89077 -26828 -18999 -140661 -262522 -315245 -210768 5736 75611 -47039 -173908
14740a73908l7107J6149N0439k3813j6299O6745O9124M9135J36436j3610j79379
$$ -173908 -211015 -194866 -144427 -168240 -184539 -117794 -48670 465 136901 123291 -56088
14729e6088j29641M6126o8115l1324J34733o640j7548O3244P7587j5842j18468
$$ -56088 -185729 -139603 -207718 -239042 -104309 -110949 -128497 -65253 12334 -3508 -121976
14718a21976j92451Q3469K0336L7096Q869J00089P9104j15874q0251Q4433l9521
$$ -121976 -314427 -230958 -210622 -173526 -164657 -64568 14536 -101338 -181589 -97156 -136677
14707a36677K9582q728n5373m3411l644K30946R3987j34668n646N0331n975k5481
$$ -136677 -107095 -115823 -171196 -214607 -218251 12695 106682 -27986 -33632 16699 10724 -14757
14695a4757o7298j8121j9775k7791J32998J02894p4462J49748L0764j33835j9804
$$ -14757 -82055 -100176 -119951 -147742 -14744 88150 13688 163436 194200 60365 40561
14684D0561n9206n1406o8322Q821J22581M5615m2701O9624J06098j0754j46868
$$ 40561 -18645 -70051 -138373 -129552 -6971 38644 -4057 65567 171665 160911 14043
14673A4043q2064O6624J18127n9560o5112j4113j2400o4579l069m6961j6335M3258
$$ 14043 -68021 -1397 116730 57170 -7942 -22055 -34455 -99034 -102103 -149064 -165399 -122141
14661a22141L5000k1804p1891l1282R3435P577o672o3694l1764R6403J01266o7905
$$ -122141 -87141 -108945 -180836 -212118 -118683 -111106 -117778 -181472 -213236 -116833 -15567 -83472
14649h3472R321R9276M5330n3893K223j54730o7810M5354n0419O0093J12277n0570
$$ -83472 -74151 25125 70455 16562 18785 -135945 -203755 -158401 -208820 -148727 -36450 -87020
14637h7020o0447k0322J45583O5327m0826o6535K5379l0030M3240j18363k2131
$$ -87020 -147467 -167789 -22206 43121 2295 -64240 -38861 -68891 -25651 -144014 -166145
14626a66145N2283o106l1521L1227P6406l1530n0633L1346R853o4720J8832J2369
$$ -166145 -113862 -119968 -151489 -120262 -43856 -75386 -126019 -94673 -84820 -149540 -130708 -118339
14614a18339m2944M3373J30724J35412j33465r2633l0150o5924R9484Q8209q887
$$ -118339 -161283 -117910 12814 148226 14761 -77872 -108022 -173946 -74462 13747 4860
14603D860l0377r8747q1897m9786l3740P590J2458N8859R6148p7584K0414M1330
$$ 4860 -25517 -124264 -206161 -255947 -289687 -282097 -269639 -210780 -114632 -192216 -171802 -130472
14591a30472J6752P4605K3969J1771J79149R9126J75977K0961p9996o7436k8274
$$ -130472 -113720 -39115 -15146 -3375 175774 274900 450877 471838 391842 324406 296132
14580B96132l9534o7992N2357P7601O1262J66278M1495q4555n7453m4740o9323
$$ 296132 256598 188606 240963 318564 379826 546104 587599 503044 445591 400851 331528
14569C31528L5178o5625p1699l0326k3838L5891k847r7736q775m9032r6054q2884
$$ 331528 366706 301081 229382 199056 175218 211109 208262 110526 101751 52719 -43335 -126219
14557a26219L1350J29908J25611l0452j534J4705k6348j39127q5722R4904O5961
$$ -126219 -94869 35039 160650 130198 128664 143369 117021 -22106 -107828 -12924 53037
14546E3037N5865m7729p4708r4181N1561P2702N7977o381M3917j1074j29750j08830
$$ 53037 108902 61173 -13535 -107716 -56155 16547 74524 68143 112060 100986 -28764 -137594
14534a37594n4408O2947r3769q485J22086J3184q8903l7671L1809P157O4204J01068
$$ -137594 -192002 -129055 -222824 -231309 -109223 -96039 -184942 -222613 -190804 -183647 -119443 -18375
14522a8375k202M4047q0274j05441Q7034J27622k4257N0720l2648q5384J16039
$$ -18375 -20577 23470 -56804 -162245 -75211 52411 28154 78874 46226 -39158 76881
14511G6881Q3102r67J3140l4895N3361n2055o3170j05533m5107j10930j03759
$$ 76881 159983 159016 172156 137261 190622 138567 75397 -30136 -75243 -186173 -289932
14500b89932K9371P4630P1093P7382k3334n6217K7149P3593j9446k199R7691n993
$$ -289932 -260561 -185931 -114838 -37456 -60790 -117007 -89858 -16265 -35711 -37910 59781 53788
14488E3788J04441j74050j97290O9473J54675P0437j02191n7776o5720L1210j3569
$$ 53788 158229 -15821 -213111 -143638 11037 81474 -20717 -78493 -144213 -113003 -126572
14477a26572Q2224q91k1882J18836l685j16681M4660N2630P9031o8555q9207j03559
$$ -126572 -44348 -45239 -67121 51715 48030 -68651 -23991 28639 107670 39115 -50092 -153651
14465a53651N3396R1992O4585l3690m1255J6645J01232J1732p2138K0421q9480
$$ -153651 -100255 -8263 56322 22632 -18623 -1978 99254 110986 38848 59269 -30211
14454c0211o5447J6068j47917p4196N5676J38177k2193q8960J1607p4804R7418
$$ -30211 -95658 -79590 -227507 -301703 -246027 -107850 -130043 -219003 -207396 -282200 -184782
14443a84782Q3268J42952L520j16483K8471O379k6445L9422l311J7427J35676
$$ -184782 -101514 41438 44958 -71525 -43054 -36675 -63120 -23698 -27009 -9582 126094
14432A26094o615j57414p1314L2925m9382j58996L9488J08402J05951n2775p2146
$$ 126094 119479 -37935 -109249 -76324 -125706 -284702 -245214 -136812 -30861 -83636 -155782
14421a55782L7401K1682n7653N6440p836L6488J7086q0926l6522N4897O8927N862
$$ -155782 -118381 -96699 -154352 -97912 -105748 -69260 -52174 -133100 -169622 -114725 -45798 -39936
14409c9936j5118l0684K3811R5802j1873k8909M1104m5166K2916n1711R3722j0981
$$ -39936 -55054 -85738 -61927 33875 22002 -6907 34197 -10969 11947 -39764 53958 42977
14397D2977k4991k8929J4222J6836j34709K3993O2048J6853o0118m8226O0355
$$ 42977 17986 -10943 3279 20115 -114594 -90601 -28553 -11700 -71818 -120044 -59689
14386e9689R4802n3726r7531R3838Q902k0577L6500l5716j04164N5557Q9997n616
$$ -59689 35113 -18613 -116144 -22306 -13404 -33981 2519 -33197 -137361 -81804 8193 2577
14374B577n9390L8624k6346l4125j17982n7732k572J11442J77885R904P0878O8254
$$ 2577 -56813 -18189 -44535 -78660 -196642 -254374 -256946 -145504 32381 42285 113163 181417
14362A81417o6771n2853j9939j28806L4495R2714L9231j02281L9183N1144q3083
$$ 181417 114646 61793 41854 -86952 -52457 40257 79488 -22793 16390 67534 -15549
14351a5549m4373r682o6857q2958n2710J42261P3204N7893L2161p930k9901l3636
$$ -15549 -59922 -69604 -136461 -219419 -272129 -129868 -56664 1229 33390 25460 -4441 -38077
14339c8077L2484J09859M3672m5154o7509L776J23287n1027j00397l8417M5009
$$ -38077 -5593 104266 147938 102784 35275 39051 162338 111311 10914 -27503 17506
14328A7506O313L5107J5840M1187r319N3871R4726K9943p2364j13759q4714P6080
$$ 17506 23819 58926 74766 115953 106634 160505 255231 285174 212810 99051 14337 90417
14316I0417P7811P1049j35552j32245m7272p962k4865N1835P1492N1515j39687
$$ 90417 168228 239277 103725 -28520 -75792 -83754 -108619 -56784 14708 66223 -73464
14305g3464m9893J56284j8344n6610l3594R2165j970j3551j8113N9757n4343P2101
$$ -73464 -123357 32927 14583 -42027 -75621 16544 14574 1023 -17090 42667 -11676 60425
14293F0425k823n8425n8451j7140n3675Q9027J40514L9808K2994j67549k0023
$$ 60425 57602 -823 -59274 -76414 -130089 -41062 99452 139260 162254 -5295 -25318
14282b5318N4714o481m5106L6954M1235q5312n8460M7237K2367L4701m1855n4589
$$ -25318 29396 22915 -22191 14763 55998 -29314 -87774 -40537 -18170 16531 -25324 -79913
14270g9913k655k2659P2865J68790R8121L9338J00609J1179Q2516P7357K1653
$$ -79913 -82568 -105227 -32362 136428 234549 273887 374496 385675 468191 545548 567201
14259E67201p4114r4852k9604Q2928L9857q1254o7428j0525M1297j31729j02330
$$ 567201 493087 398235 368631 451559 491416 410162 342734 332209 373506 241777 139447
14248A39447R524m1960J7630J85639N0155N7111l030o8974Q2396M7660Q1541O4772
$$ 139447 148971 107011 124641 310280 360435 417546 414516 345542 427938 475598 557139 621911
14236F21911J20923K89715K89914L06594M45397O13171O00906K79630J7638J7907
$$ 621911 742834 1032549 1322463 1629057 2074454 2687625 3288531 3568161 3585799 3603706
14226C603706J48804L05601j04394o01158o55843m73035n10606l90470k49345
$$ 3603706 3752510 4058111 3953717 3352559 2696716 2223681 1713075 1322605 1073260
14217A073260k07381j91699o7452j08705k13368j16204L2400L7236j0521L0201
$$ 1073260 865879 674180 606728 498023 284655 168451 200851 238087 227566 257767
14207B57767L0129q4941p8397o9077q039j44021k1935Q3886M8514m6090l7841
$$ 257767 287896 202955 124558 55481 47442 -96579 -118514 -34628 13886 -32204 -70045
14196g0045N5783J1741l0065R1344J4759j05791l752J04631m3924l2236N9003
$$ -70045 -14262 -2521 -32586 58758 73517 -32274 -36026 68605 24681 -7555 51448
14185E1448J20048n7389j5106M8777p6323r6094J1009J03372k505p3393M921P1049
$$ 51448 171496 114107 99001 147778 71455 -24639 -13630 89742 87237 13844 18765 89814
14173H9814m7026l4197m0913l4132R0189Q26N6414l2366j03749q8294q8047M1554
$$ 89814 42788 8591 -32322 -66454 23735 24561 80975 48609 -55140 -143434 -231481 -189927
14161a89927J47289K14316J01720p4989k3551L3247j10546j31266K091K0532K1733
$$ -189927 -42638 171678 273398 198409 174858 208105 97559 -33707 -31616 -11084 10649
14150A0649j10129r8256K7178O0687K0473L3260m1471L3407p252L8152J11614
$$ 10649 -99480 -197736 -170558 -109871 -89398 -56138 -97609 -64202 -71454 -33302 78312
14139G8312j1605j22005J0411K755o1616J9158Q0626M1525O1989k0309j1590q8975
$$ 78312 66707 -55298 -44887 -42132 -103748 -84590 -3964 37561 99550 79241 67651 -21324
14127b1324n4320J51898l478p1797N3771L1272o4768j72970j41396j1443J88506
$$ -21324 -75644 76254 72776 979 54750 86022 21254 -151716 -293112 -304555 -116049
14116a16049J25373j2818k1361j00952r1527L1182O4577j21275n2319J58353P6644
$$ -116049 9324 -3494 -24855 -125807 -217334 -186152 -121575 -242850 -295169 -136816 -60172
14105f0172p364M3417o5659j4599R1912J24513j49570j19088R055j08248P9655
$$ -60172 -67536 -24119 -89778 -104377 -12465 112048 -37522 -156610 -147555 -255803 -176148
14094a76148P6037M9507Q0462L4598r5300r4949n2748n343J0442K3297J21928
$$ -176148 -100111 -50604 29858 64456 -30844 -125793 -178541 -183884 -173442 -150145 -28217
14083b8217L4376j3657k3854j5095m4037k5512J09493M7902j08339N1109J10923
$$ -28217 6159 -7498 -31352 -46447 -90484 -115996 -6503 41399 -66940 -15831 95092
14072I5092R6285m4154P3710r744R0649k2399M093l3721l9963o560k149k4717
$$ 95092 191377 147223 220933 211189 301838 279439 283532 249811 209848 203288 201139 176422
14060A76422p4603o4372l773J09544p2954l8348q7840J8274J51151O9556M2244
$$ 176422 101819 37447 33674 143218 70264 31916 -55924 -37650 113501 183057 225301
14049B25301l2788O4121j10047k20460n5434J28091R3760R327L068j7529j10548
$$ 225301 192513 256634 146587 -73873 -129307 -1216 92544 101871 104939 87410 -23138
14038b3138q7458O3353o6967J7713P1717j9711m4549m8676L4234J79734L8575
$$ -23138 -110596 -47243 -114210 -96497 -24780 -44491 -89040 -137716 -103482 76252 114827
14027A14827j26031P203J36934j2744m787J22522K3955n7379M7017O959k3137
$$ 114827 -11204 -4001 132933 120189 115402 237924 261879 204500 251517 258476 235339
14016B35339N6709m348j9187L7913J3484R8547l0082o3934q7527j21958l3590
$$ 235339 292048 287700 268513 306426 319910 418457 388375 324441 236914 114956 81366
14005H1366N7078R8230p9521j33728j20983Q2551n132k15990p5138l6174J7830
$$ 81366 138444 236674 157153 23425 -97558 -15007 -20139 -236129 -311267 -347441 -329611
13994c29611J99227J38594l7407m179J9938r1728k6855J05729k5645o8120l5150
$$ -329611 -130384 8210 -29197 -33376 -13438 -105166 -132021 -26292 -51937 -120057 -155207
13983a55207K780O1774L8029r025l8317o1006J24291J18035R400N5219L2359M5307
$$ -155207 -152427 -90653 -52624 -61649 -99966 -160972 -36681 81354 90754 145973 178332 223639
13971B23639R7319P3693J8735o665j27477j79653k6239Q498l1857o1221J41366
$$ 223639 320958 394651 413386 406721 279244 99591 73352 81850 49993 -11228 130138
13960A30138k5663j16507R1570J11124p5735j21380J19855J5476M1680P0628j2140
$$ 130138 104475 -12032 79538 190662 114927 -6453 113402 128878 170558 241186 229046
13949B29046k8677q6300M883R833J36249K0539o348r1747k6718K6753k7804K6119
$$ 229046 200369 114069 118952 128785 265034 285573 279225 187478 160760 187513 159709 185828
13937A85828N052q299L6361n5577O8228K9627p295J9292l7865o1968j2288Q7252
$$ 185828 190880 182581 218942 163365 231593 261220 253925 273217 235352 173384 161096 248348
13925B48348j5019m1521j10094j6211Q3587L6947N0424j20245j19328j2033n782
$$ 248348 233329 191808 81714 65503 149090 186037 236461 116216 -3112 -15145 -20927
13914b0927N1477J64541q3104Q5338J14348J11114J39799J19182j2964J4426j12790
$$ -20927 30550 195091 111987 197325 311673 422787 562586 681768 668804 683230 570440
13903E70440j41694o8838j40550l1171K9556o1866R982K4406J46552k8580r043
$$ 570440 428746 359908 219358 188187 217743 155877 165859 190265 336817 308237 299194
13892B99194j26799j42203J9818K7277p2456j74338k3916K1755M2305J623L2685
$$ 299194 172395 30192 50010 77287 4831 -169507 -193423 -171668 -129363 -127740 -95055
13881i5055J20314R1391k4202k1921Q6043j03701J6714k8538M7720L3315K7674
$$ -95055 25259 116650 92448 70527 156570 52869 69583 41045 88765 122080 149754
13870A49754j12272r0625l1939M0528J76620P569o9542p3811J12234J43379J0987
$$ 149754 37482 -53143 -85082 -44554 132066 139635 70093 -3718 108516 251895 262882
13859B62882Q9849O367j5082M7114J4300J48944O9324J3605j5097J03088o6392
$$ 262882 352731 359098 344016 391130 405430 554374 623698 637303 622206 725294 658902
13848F58902q1771j12600k3087K0691J63197J1118O1363J25072O3822J138k521
$$ 658902 577131 464531 441444 462135 625332 636450 697813 822885 886707 887845 885324
13837H85324r863j06996l1052q7988k0604k2572n1497k1537j13697k7958P055
$$ 885324 875461 768465 737413 649425 628821 606249 554752 533215 419518 391560 398615
13826C98615p5084o5568n9319o5690k044r3985o781o874R5340N2088k4763K0M0915
$$ 398615 323531 257963 198644 132954 130910 36925 30144 23270 118610 170698 145935 145955 186870
13813A86870L427p2852N8743P5602p4752j03978p9544r5159M2123N4076k1774
$$ 186870 190297 117445 176188 251790 177038 73060 -6484 -101643 -59520 -5444 -27218
13802b7218R463L7512L3289j17382o1274p4983K8426J22182K995l4174j22791
$$ -27218 -17755 19757 53046 -64336 -125610 -200593 -172167 -49985 -46990 -81164 -203955
13791b03955r4775L6900P2323L8106l4287R7838L6818j06117N223L1327m3443
$$ -203955 -298730 -261830 -189507 -151401 -185688 -87850 -51032 -157149 -151926 -120599 -164042
13780a64042k8032J28623L0357r7491L2227N4091L2434n7998O9482J17904J83
$$ -164042 -192074 -63451 -33094 -130585 -98358 -44267 -11833 -69831 -349 117555 117738
13769A17738r0936L4971M6158k252j9173q6564p3374j9415l9668J08499k4134
$$ 117738 26802 61773 107931 105679 86506 -58 -73432 -92847 -132515 -24016 -48150
13758d8150n0124J33272J66521J6775k1329k3569M012r4876j07146m50J65489
$$ -48150 -98274 34998 201519 218294 196965 173396 177408 82532 -24614 -25064 140425
13747A40425P9670l0389p0456q4927L7364R8847o9613k7534J0699q62Q9354k1805
$$ 140425 220095 189706 119250 34323 71687 170534 100921 73387 84086 83224 172578 150773
13735A50773j46908p2035R8795m3476n450P2994O8325M1144K6822k2820j19787
$$ 150773 3865 -68170 30625 -12851 -18301 54693 123018 164162 190984 168164 48377
13724D8377q0286r840K8790O4935L2512M1904J729j4023P8455J2653j45929m7879
$$ 48377 -31909 -41749 -12959 51976 84488 126392 128121 114098 192553 205206 59277 11398
13712A1398J15514J9626r3862l8526j42808j7488j25753r7J51393o089K9483J08447
$$ 11398 126912 146538 52676 14150 -128658 -146146 -271899 -271996 -120603 -126692 -97209 11238
13700A1238p2531l0715m7463J0060m6540K8286L8156J3158k2725M9448m9023j0091
$$ 11238 -61293 -92008 -139471 -129411 -175951 -147665 -109509 -96351 -119076 -69628 -118651 -128742
13688a28742R3005M5832M6354p6115n0742k9178J3118L6172q008k2376p0901M429
$$ -128742 -35737 10095 56449 -19666 -70408 -99586 -86468 -50296 -58304 -80680 -151581 -147152
13676a47152M5413l2088j36421K23338O0701j41637J4098J06167P274q5941j6757
$$ -147152 -101739 -133827 -270248 -46910 13791 -127846 -113748 -7581 -307 -86248 -103005
13665a03005L0688l3521P0297J14355q0736k0046Q833M2845K8156K213K7811p7961
$$ -103005 -72317 -105838 -35541 78814 -1922 -21968 -13135 29710 57866 60079 87890 9929
13653I929J1275n997k00221j8712M1859R5680J18448o2584j40608k2955K6871
$$ 9929 21204 15207 -185014 -203726 -161867 -66187 52261 -10323 -150931 -173886 -147015
13642a47015l1075J00946J9412J6097k7033q4905j8696k4250N6017Q938J15861
$$ -147015 -178090 -77144 -57732 -41635 -68668 -153573 -172269 -196519 -140502 -131564 -15703
13631a5703N3382R0797k8226j55546M277N1162O4072r8762o6874L6717J23187
$$ -15703 37679 128476 100250 -55296 -51019 143 64215 -34547 -101421 -64704 58483
13620E8483J56565L2183j21070m9811N2717j6943m8951P228q3011N7245O4015
$$ 58483 215048 247231 126161 76350 129067 112124 63173 70401 -12610 44635 108650
13609A08650O8359p5463j9724L7697Q634J06992K1290Q5953q4448k7670O2506
$$ 108650 177009 101546 81822 119519 128153 235145 256435 342388 257940 230270 292776
13598B92776O8156l6314j0o7217n4478K5945n0213J00019o6194k6046k0380O597
$$ 292776 360932 324618 324608 257391 202913 228858 178645 278664 212470 186424 166044 172641
13586A72641k0674j02957p1324L5163J16921L1869m768o1529j43793m4506L6025
$$ 172641 151967 49010 -22314 12849 129770 161639 156871 95342 -48451 -92957 -56932
13575e6932K6608l8505P3820O1543K9018j90639J06709J28766L800l8735p3292
$$ -56932 -30324 -68829 4991 66534 95552 -95087 11622 140388 144188 105453 32161
13564C2161l5178K1176J1880K7262k2981p4222J29807n2621j29578k8777O4781
$$ 32161 -3017 18159 30039 57301 34320 -39902 89905 37284 -92294 -121071 -56290
13553e6290m9467j08464K1661j6960J01886J84462K0305m2290p8229M4267O3714
$$ -56290 -105757 -214221 -192560 -209520 -107634 76828 97133 54843 -23386 20881 84595
13542H4595j11257o1238j04651p88O3927L7761N1486Q3870P6120j1124j12622
$$ 84595 -26662 -87900 -192551 -193339 -129412 -91651 -40165 43705 119825 108701 -3921
13531c921m8611m9903o5088r876j3725N1789Q4531Q596J196N1121j2493n6233
$$ -3921 -52532 -102435 -167523 -177399 -191124 -139335 -54804 -46208 -45012 6109 -6384 -62617
13519f2617m828J9667J0299J5331n457L845Q100J9294l3962M1349n5639j02247
$$ -62617 -67445 -47778 -37479 -22148 -27605 -23760 -15660 3634 -30328 11021 -44618 -146865
13507a46865p3398j11066j9707Q6741M2799J36988O6737j36176l2307P5155O5291
$$ -146865 -220263 -331329 -351036 -264295 -221496 -84508 -17771 -153947 -186254 -111099 -45808
13496d5808K8440M0950p7979K471J2282L2568n077j00749j08305K5321K9615M7083
$$ -45808 -17368 23582 -54397 -51926 -39644 -7076 -12153 -112902 -221207 -195886 -166271 -119188
13484a19188L7292R2728l8644m7220K92Q7392O5453J12239j00631j34368M9171
$$ -119188 -81896 10832 -27812 -75032 -74740 12652 78105 190344 89713 -44655 4516
13473D516R7741q0798j07719N1954R0234J23719p8528n3154K4622p9337o3650
$$ 4516 102257 21459 -86260 -34306 55928 179647 101119 47965 72587 -6750 -70400
13462g0400k1095j7899J6355L5123N9046n5560K3887J5302r070P0130j7039l2408
$$ -70400 -91495 -109394 -93039 -57916 1130 -54430 -30543 -15241 -24311 45819 28780 -3628
13450c628m6633K1262N9164r4227L6147J13652m9900p2372j8553J05782J2381
$$ -3628 -50261 -28999 30165 -64062 -27915 85737 35837 -36535 -55088 50694 63075
13439F3075K1639L3458K8885M7388k9223l6622L7283J73354R7890K05463J45205
$$ 63075 84714 118172 147057 194445 165222 128600 165883 339237 437127 642590 787795
13428G87795J22899Q6458L8519K15821K16985K57582K80071K96137J88886Q342
$$ 787795 910694 997152 1035671 1251492 1468477 1726059 2006130 2302267 2491153 2499495
13418B499495n3704l3405j67740k63133k81592k02424k39751j40772n2854j49266
$$ 2499495 2445791 2412386 2244646 1981513 1699921 1497497 1257746 1116974 1064120 914854
13408I14854k04466j49564n4566m3175l1645r0458O2585J18841m5909k3639j48397
$$ 914854 710388 560824 506258 463083 431438 340980 403565 522406 476497 452858 304461
13397C04461J0670l7927j36981o4442n760O9492P1653k6359j2538q4679M528Q7501
$$ 304461 315131 277204 140223 75781 70021 139513 211166 184807 172269 87590 92118 179619
13385A79619K826R4981J23770q4976j52323o1409o7261K048P7331m8616m3197
$$ 179619 182445 277426 401196 316220 163897 102488 35227 37275 114606 65990 22793
13374B2793l3419O4124P6996j64005j20511J8994k5366m1288N68p447M8314L1235
$$ 22793 -10626 53498 130494 -33511 -154022 -135028 -160394 -201682 -201114 -208561 -160247 -129012
13362a29012J44551Q0864k8755P9204J76309q9641j20528k6436P3416N0250k9832
$$ -129012 15539 96403 67648 146852 323161 233520 112992 86556 159972 210222 180390
13351A80390n1102J23138N3594q3249j0030m5101o1214n6090R3227p581q5313
$$ 180390 129288 252426 306020 222771 212741 167640 106426 50336 143563 135982 50669
13340E0669r790k8576r2832m7311M0471P6196j12095q103J2392J04838O7313L4041
$$ 50669 40879 12303 -80529 -127840 -87369 -11173 -123268 -131371 -118979 -14141 53172 87213
13328H7213L9652n4248l5545l8801k374K677N5147J20826K2175j46664j08696
$$ 87213 126865 72617 37072 -1729 -4103 -1426 53721 174547 196722 50058 -58638
13317e8638k2640K2939J03054L7487k7519q1973K1538P1249n8774q4789K3263
$$ -58638 -81278 -58339 44715 82202 54683 -27290 -5752 65497 6723 -78066 -54803
13306e4803j0360K818Q0159L1866j3279o2251j08840M2531m1773J3300L9177K3295
$$ -54803 -65163 -62345 17814 49680 36401 -25850 -134690 -92159 -133932 -120632 -81455 -58160
13294e8160L9237M8122R4605N3701p1205j27783J6363n6262K071J84820l2157
$$ -58160 -18923 29199 123804 177505 106300 -21483 -5120 -61382 -59311 125509 93352
13283I3352j83363p1548p967J18751P9068m2142j22370L2764k0426J18453M8666
$$ 93352 -90011 -161559 -169526 -50775 28293 -13849 -136219 -103455 -123881 -5428 43238
13272D3238n6976K5835Q0935m8459m6719l6612j2084R4683k4431K6847J55664
$$ 43238 -13738 12097 93032 44573 -2146 -38758 -50842 43841 19410 46257 201921
13261B01921K8376P7080J61278r1482j93833q9241o7633J997o8884K0684Q0076
$$ 201921 230297 307377 468655 377173 183340 94099 26466 28463 -40421 -19737 60339
13250F0339J2082o5189r1941k214n3157j5137J37127K08882J14649n1057N7347
$$ 60339 72421 7232 -84709 -86923 -140080 -155217 -18090 190792 305441 254384 311731
13239C11731J53786k8768m0002l3734R9691j7698j34876J6228p0110n5214r3700
$$ 311731 465517 436749 396747 363013 462704 445006 310130 326358 256248 201034 107334
13228A07334j7468J33011M899j26629k1069p949j31153j282j6430m2848m254P8461
$$ 107334 89866 222877 227776 101147 80078 72129 -59024 -60306 -76736 -119584 -123838 -45377
13216d5377K2045O3367r5993j5873j0991j25895M5467J71458Q36n3903J28144
$$ -45377 -23332 40035 -55958 -71831 -82822 -208717 -163250 8208 9044 -44859 83285
13205H3285J37333K0599J0950j35092r3636J0275J2317L2335R0799L6108m6030
$$ 83285 220618 241217 252167 117075 23439 33714 46031 78366 169165 205273 159243
13194A59243J5302J39168j2802m3096m2739N0014q776J1562L8812j5005r1036
$$ 159243 174545 313713 300911 257815 215076 265090 256314 267876 306688 291683 200647
13183B00647j37796M3697K803N7353L4899j03182J6929N4705M4092M4472N7300
$$ 200647 62851 106548 109351 166704 201603 98421 115350 170055 214147 258619 315919
13172C15919P0843j8400p8949J8431L4622k609P930J21769r7832j02026q5816
$$ 315919 386762 368362 289413 307844 342466 339857 347787 469556 371724 269698 183882
13161A83882R677J14672p0841n8242P4876K6292r3844M2451O5061J2979m1791
$$ 183882 193559 308231 237390 179148 254024 280316 186472 228923 293984 306963 265172
13150B65172l187J03384J27866M5125M2664J2268p1506l0321J31701k1932n8881
$$ 265172 261985 365369 493235 538360 581024 593292 521786 491465 623166 601234 542353
13139E42353L3757l3181k4155q3811j2685N4870j89812j69090K6296Q5257Q7724
$$ 542353 576110 542929 518774 434963 422278 477148 287336 118246 144542 229799 317523
13128C17523J5419Q1282L5862J09905J42243L6099l6336K4036o3849J73202R2106
$$ 317523 332942 414224 450086 559991 702234 738333 701997 726033 662184 835386 927492
13117I27492M3640L3023M8502O502J812J6381J26593M3432p3792q6639k11302
$$ 927492 971132 1004155 1052657 1059159 1060971 1077352 1203945 1247377 1173585 1086946 875644
13106H75644q5662J8642J09989k9479j72486p4685O9391P016m7204j39472P3560
$$ 875644 789982 808624 918613 889134 716648 641963 711354 718370 671166 531694 605254
13095F05254J5091K5537p0061p961P0970J36351J37919N3618Q858j05521l7482
$$ 605254 620345 645882 575821 567860 638830 775181 913100 966718 975576 870055 832573
13084H32573K2582p5410M8383J12004o7891m4215J25763J00020J15475Q9585m4504
$$ 832573 855155 779745 828128 940132 872241 828026 953789 1053809 1169284 1258869 1214365
13073A214365p6286o3487L9828O6233R6049P1782m4951O864P7157Q9669J43316
$$ 1214365 1138079 1074592 1114420 1180653 1276702 1348484 1303533 1310397 1387554 1477223 1620539
13062A620539J40158J73127m6413n6206N4385N7104p0584O5017K399O9125J15838
$$ 1620539 1760697 1933824 1887411 1831205 1885590 1942694 1872110 1937127 1939526 2008651 2124489
13051B124489J70146N5321J09548P7353N2507J10476K42715K89225J51089J87556
$$ 2124489 2294635 2349956 2459504 2536857 2589364 2699840 2942555 3231780 3382869 3570425
13041C570425Q2205o4740J38716K11054L03412L15718K23132K16659K68165M94390
$$ 3570425 3652630 3587890 3726606 3937660 4241072 4556790 4779922 4996581 5264746 5759136
13031E759136L57596L75614L84954L77909L73681M75551N17559N07263M61118
$$ 5759136 6116732 6492346 6877300 7255209 7628890 8104441 8622000 9129263 9590381
13022I590381L89699K87850M29319M26983N56574O83830O52947O89359R00106
$$ 9590381 9980080 10267930 10697249 11124232 11680806 12364636 13017583 13706942 14607048
13013A4607048J081287J274102J570305J811602J941665K217755K467060K865561
$$ 14607048 15688335 16962437 18532742 20344344 22286009 24503764 26970824 29836385
13005B9836385L188159L504020M237047N076369O105924P325216R042964J1114039
$$ 29836385 33024544 36528564 40765611 45841980 51947904 59273120 68316084 79430123
12997G9430123J3874723J7293971K2222541K8947110L7300560M6813632N5611157
$$ 79430123 93304846 110598817 132821358 161768468 199069028 245882660 301493817
12990C01493817N8977351N2169173L5411326J7397159O705506K404748l953158
$$ 301493817 360471168 412640341 448051667 465448826 472154332 474559080 470605922
12983D70605922j8730664l8226105n2310968n6424902n2468034m4690496l6033923
$$ 470605922 451875258 413649153 361338185 304913283 252445249 207754753 171720830
12976A71720830k8444529k2330963j7720147j4151080j1294602r320888p774172
$$ 171720830 143276301 120945338 103225191 89074111 77779509 68458621 60684449
12969F0684449o454205n407955m689810m015345l624473l271910k888132k594326
$$ 60684449 54230244 48822289 44132479 40117134 36492661 33220751 30332619 27738293
12961B7738293k281287j962633j845794j642455j475546j286515j220452j051639
$$ 27738293 25457006 23494373 21648579 20006124 18530578 17244063 16023611 14971972
12953A4971972q66680q50417q17056q07816o76827o54520o32817m00752l98600
$$ 14971972 14105292 13254875 12437819 11630003 10953176 10298656 9665839 9265087 8866487
12944H866487l60473m79000l81310l16260k89112j90992k27379k20553j92529
$$ 8866487 8506014 8027014 7645704 7329444 7040332 6849340 6621961 6401408 6208879
12935F208879j38830j40092k38387j91491j31743K328j00123j88557k28009k36905
$$ 6208879 6070049 5929957 5691570 5500079 5368336 5370664 5270541 5081984 4853975 4617070
12925D617070j75280n2857q8468j23234j29862m4654P3659j71402j33348o9767
$$ 4617070 4441790 4388933 4300465 4177231 4047369 4002715 4076374 3904972 3771624 3701857
12915C701857j32943q0946m4337k27380j46410j36793q9182J09098k3685J965
$$ 3701857 3568914 3487968 3443631 3216251 3069841 2933048 2843866 2952964 2929279 2931244
12905B931244q1848J6500j20824p5616P1013P8947K9306O7038R630j90775j82182
$$ 2931244 2849396 2865896 2745072 2669456 2740469 2819416 2848722 2915760 2925390 2734615 2552433
12894B552433j34108n9942n3565j16335j03153j86223o4613q9455j25640M738
$$ 2552433 2418325 2358383 2304818 2188483 2085330 1899107 1834494 1745039 1619399 1624137
12884A624137J99995J8144o5309j056n4880R3456M0789n0748j30606l6136o2937
$$ 1624137 1824132 1842276 1776967 1775911 1721031 1814487 1855276 1804528 1673922 1637786 1574849
12873A574849p0348R0062M6980J24428O4282J8090m8485o2506j05370k0298k2481
$$ 1574849 1504501 1594563 1641543 1765971 1830253 1848343 1799858 1737352 1631982 1611684 1589203
12862A589203P1317M5451p4810J384R0526L8686m4106J0348j5304j08467k36550
$$ 1589203 1660520 1705971 1631161 1632545 1723071 1761757 1717651 1727999 1712695 1604228 1367678
12851A367678L4915m5688J4911k9446m1007l0812p576l9213n3057M7761K23416
$$ 1367678 1402593 1356905 1371816 1342370 1301363 1270551 1262975 1223762 1170705 1218466 1441882
12840A441882J09975N2905q8356j94442k8631j08083J9031J38546J50711k653
$$ 1441882 1551857 1604762 1516406 1321964 1293333 1185250 1204281 1342827 1493538 1490885
12830A490885J7710o9513J5339l0508k5494k4559L2134J09268K73127J94958J36735
$$ 1490885 1508595 1439082 1454421 1423913 1398419 1373860 1405994 1515262 1788389 1983347 2120082
12819B120082J09247J37756L13652J96166J47064K47016L59020M33959L42777
$$ 2120082 2229329 2367085 2680737 2876903 3023967 3270983 3630003 4063962 4406739
12810D406739M71693M77945M80469K62204M2955O6256K3435m9991j82206k56376
$$ 4406739 4878432 5356377 5836846 6099050 6142005 6208261 6231696 6181705 5999499 5743123
12800E743123m17203l97386l31512m39650m28983m34573l19842j65575j55279
$$ 5743123 5325920 4928534 4597022 4157372 3728389 3293816 2973974 2808399 2653120
12791B653120k18273k62692j85327o0712j05397p9491j64787j15689o7729j11712
$$ 2653120 2434847 2172155 1986828 1926116 1820719 1741228 1576441 1460752 1393023 1281311
12781A281311j9317o5618r3441R985K1358L479r7205q4533Q4535N8563m5444q2735
$$ 1281311 1261994 1196376 1102935 1112920 1134278 1137757 1040552 956019 1040554 1099117 1053673 970938
12769I70938q675o2454k032j37859O9892R015k8896Q7610m1471m2876l0074K934
$$ 970938 962263 899809 897777 759918 829810 838825 809929 897539 856068 813192 783118 786052
12757G86052l9280J11893J30407m1226p4602j12457j9604k9744m8599Q5372N1809
$$ 786052 746772 858665 989072 947846 873244 760787 741183 711439 662840 748212 800021
12746H00021n8244o0831q063l4032m3925Q7489R7509m8016q9253j1602k5763r9657
$$ 800021 741777 680946 672883 638851 594926 682415 779924 731908 642655 631053 605290 505633
12734E05633K6680r6660n0254M6614J33668L9451j29282j6725J12473K9956p801
$$ 505633 532313 435653 385399 432013 565681 605132 475850 459125 571598 601554 593753
12723E93753l4631L6702J01182q0560j66131n3176K9932R7251M6247o2853r5941
$$ 593753 559122 595824 697006 616446 450315 397139 427071 524322 570569 507716 411775
12712D11775j7317O3747K0401q0266n4585L2830M2116k5341M2832J6590l1442
$$ 411775 394458 458205 478606 398340 343755 376585 418701 393360 436192 452782 421340
12701D21340m40R4301j7246m5293j02066J3358K3538M5154L4267R783K3755q8658
$$ 421340 420900 515201 497955 452662 350596 363954 387492 432646 466913 476696 500451 411793
12689D11793k23271j17847J21964N8257P1161k6240O6960M3965n2327M8280K3170
$$ 411793 188522 70675 192639 250896 322057 295817 362777 406742 354415 402695 425865
12678D25865j00570L5228N8621P16O5427M0258L5911N7501N3410N8505l4642J13349
$$ 425865 325295 360523 419144 419860 485287 525545 561456 618957 672367 730872 696230 809579
12666H09579n4963k48926j24395k6588M5386O1554k3393j32094j5154q516j2117
$$ 809579 754616 505690 381295 354707 400093 461647 438254 306160 291006 282490 270373
12655B70373n5286p7880K8546J96627K3081p1919j18615l3850p6584l0189J35952
$$ 270373 215087 137207 165753 362380 385461 313542 194927 161077 84493 54304 190256
12644A90256P683K0183J64830O9061J1193J19732P5139K1767K1893j9555Q86m8272
$$ 190256 197939 218122 382952 452013 463206 582938 658077 679844 701737 682182 683068 634796
12632F34796k19652j17649k3293K5118q4933J831k5959K3929J19302Q6922Q4409
$$ 634796 415144 297495 274202 299320 214387 216218 190259 214188 333490 420412 504821
12621E04821K0362n0291j6837q1722l3999J2050q9936r3708q491L4183j76425
$$ 504821 525183 474892 458055 376333 342334 354384 264448 170740 162249 196432 20007
12610B0007L9276J16136N7461N897M3446K9542O13j9257p6552N3989Q9718m2542
$$ 20007 59283 175419 232880 238777 282223 311765 312378 293121 216569 270558 360276 317734
12598C17734l1033j47601l2060O6999L7113L034l0120p1782K5318m6860N0949
$$ 317734 286701 139100 107040 174039 211152 214186 184066 112284 137602 90742 141691
12587A41691J06372N2579p0523j39906o2232L1919J47969K7641l9567O4174Q2787
$$ 141691 248063 300642 230119 90213 27981 59900 207869 235510 195943 260117 342904
12576C42904l6431r725j22365p5266J74088R4624M8971L3908R0318p3914o3513
$$ 342904 306473 296748 174383 99117 273205 367829 416800 450708 541026 467112 403599
12565D03599O9464r3771o7416J70983P6460J6121L172j8842K19141K36983K21752
$$ 403599 473063 379292 311876 482859 559319 575440 578612 559770 778911 1015894 1237646
12554A237646J67883J66019K64272L50989K15571Q0848K03916L8953J7968p2826
$$ 1237646 1405529 1571548 1835820 2186809 2402380 2483228 2687144 2726097 2744065 2671239
12544B671239j68638l5606j11305l84273l31558l12915k23479j14217j52391k858
$$ 2671239 2502601 2466995 2355690 1971417 1639859 1326944 1103465 989248 836857 833999
12534H33999K4970n5041r4050j83270j13144o831k5518N2922M9598K533n4896
$$ 833999 858969 803928 709878 526608 413464 406633 381115 434037 483635 486168 431272
12523D31272r5581l9601K0303M9926Q0268N0163n5083j5699J4585o4064r8728
$$ 431272 335691 296090 316393 366319 446587 496750 441667 425968 440553 376489 277761
12512B77761P2923M077j8634p3831r120K1838n6038j3126J7087K1808L7320M8906
$$ 277761 350684 354761 336127 262296 253176 275014 218976 205850 222937 244745 282065 330971
12500C30971L9422m9495m1055J11295Q7624L557j01023l3258o3251k7338L1649
$$ 330971 370393 320898 279843 391138 478762 482319 381296 348038 284787 257449 289098
12489B89098O1360j47690n2710n8414J05918K8315L3557j02484n3571p520K987
$$ 289098 350458 202768 150058 91644 197562 225877 259434 156950 103379 95859 98846
12478I8846Q5788o0012j61339J05283J78912O7880p3022j09258m2564k5806M4966
$$ 98846 184634 124622 -36717 68566 247478 315358 242336 133078 90514 64708 109674
12467A09674K1910r8566J2076K5736R3118J8007M4334Q6575m5721j18464p5141
$$ 109674 131584 33018 45094 70830 163948 181955 226289 312864 267143 148679 73538
12456G3538o3530L7730J9523Q5152j4895N3847Q09R506L1009k2624j195m4953
$$ 73538 10008 47738 67261 152413 137518 191365 192174 201680 232689 210065 208870 163917
12444A63917p7229J7183J18348M0700r8291K4707Q5940m0931q3387k3238n2031
$$ 163917 86688 103871 222219 262919 164628 189335 275275 234344 150957 127719 75688
12433G5688P2357M5963J0115K1225J9660p3930m4765N3264N309o8774K7504N9451
$$ 75688 148045 194008 204123 225348 245008 171078 126313 179577 184886 116112 143616 203067
12421B03067L6554Q6193o0647j46958r7413R1999N2939L5022p8822q113j7567
$$ 203067 239621 325814 265167 118209 20796 112795 165734 200756 121934 113821 96254
12410I6254J22225k6873j8117R195q4994j50844r4488L9709J38405J5696j47836
$$ 96254 218479 191606 173489 182684 97690 -53154 -147642 -107933 30472 46168 -101668
12399a01668Q6250P1540Q6807J16394M300J7460M0134p456J294j18651p773m0524
$$ -101668 -15418 56122 142929 259323 263623 281083 321217 313761 315055 196404 188631 148107
12387A48107O774k2162O8036j7014m4372K5684k4656l0621l0395K110O7066J02762
$$ 148107 154881 132719 200755 183741 139369 165053 140397 109776 79381 81491 148557 251319
12375B51319N2973Q809K0040o4827j63743o6921L5798O768Q4740M1380m5469j7702
$$ 251319 304292 313101 333141 268314 104571 37650 73448 80216 164956 206336 160867 143165
12363A43165K4789P3700p211o0158n801j34608l9993J08652M5657j0520k4178
$$ 143165 167954 241654 234443 174285 168484 33876 -6117 102535 148192 137672 113494
12352A13494N8774K0767r2729J03612P9693P5083n3546m5928J3430n096q2868
$$ 113494 172268 193035 100306 203918 283611 358694 305148 259220 272650 267554 184686
12341A84686o1495L7191K1740m7886J2266N9405Q062M0980n4840j2840k5537J8850
$$ 184686 123191 160382 182122 134236 146502 205907 213969 254949 200109 187269 161732 180582
12329A80582L664n6490l3530N2868l2493N8666J11518n3862j3499N2906q1640
$$ 180582 184246 127756 94226 147094 114601 173267 284785 230923 217424 270330 188690
12318A88690p6306j05118o7841J09448m8227L8638l7516L7578O0672n2039m05
$$ 188690 112384 7266 -60575 48873 646 39284 1768 39346 100018 47979 47574
12307D7574N5938L9554k7668K5110k8828k5756j52720j31100K0067N9752j59783
$$ 47574 103512 143066 115398 140508 111680 85924 -66796 -197896 -177829 -118077 -277860
12296b77860J48703J32667n5077K9000M3465L0007l5235j5661J28249q332j77375
$$ -277860 -129157 3510 -51567 -22567 20898 50905 15670 9 128258 119926 -57449
12285e7449j2069J68034j663j34558k2903P9882Q5764J4366q1576n8589J33534
$$ -57449 -69518 98516 96853 -37705 -60608 19274 105038 119404 37828 -20761 112773
12274A12773l2489o4200J5699q1771k844N810Q2392M6750q6509n7237k2861J25298
$$ 112773 80284 16084 31783 -49988 -52832 -47022 35370 82120 -4389 -61626 -84487 40811
12262D0811N772o2029P5769j6264p0938N1290L8961L9001k9436n480J5135q9793
$$ 40811 46583 -15446 60323 44059 -26879 24411 63372 102373 72937 67457 82592 -7201
12250g201l4409J15454K9124O118q9568j07585J0678J41435O1296n393l1116q8492
$$ -7201 -41610 73844 102968 109086 19518 -88067 -77389 64046 125342 119949 88833 341
12238C41r3286Q9368J32440n0547j18226r4292J1223L8324J14298L9568R644j5700
$$ 341 -92945 -3577 128863 78316 -39910 -134202 -122979 -84655 29643 69211 78855 63155
12226F3155N5391j44549l4577j3711O085R217N2281k074J1141q040l2021m81q3435
$$ 63155 118546 -26003 -60580 -74291 -68206 -58989 -6708 -8782 2359 -5681 -37702 -38183 -121618
12213a21618n8625J11015N9717J13805R8731r3871m3938q2068q0446J19589J40165
$$ -121618 -180243 -69228 -9511 104294 203025 109154 65216 -16852 -97298 22291 162456
12202A62456N1125j46605j63613q0268M835N7137R8195K2681O2852l8469k0859
$$ 162456 213581 66976 -96637 -176905 -172070 -114933 -16738 5943 68795 30326 9467
12191I467L5772p9625K5924K4064n941k6136K1635Q5032j38846m2711J0481M8825
$$ 9467 45239 -34386 -8462 15602 9661 -16475 5160 90192 -48654 -91365 -80884 -32059
12179c2059l5232M5377N1147m8354p7869J41929J55003M1693r6580k10236j24437
$$ -32059 -67291 -21914 29233 -19121 -96990 44939 199942 241635 145055 -65181 -189618
12168a89618J71053j0207N1691J13804n8503j27841k5631m287l0448Q184R0648
$$ -189618 -18565 -28772 22919 136723 78220 -49621 -75252 -79539 -109987 -101803 -11155
12157a1155R221l3144J33425J78379N2916j43158k22125r0207M2560p3439Q0963
$$ -11155 -1934 -35078 98347 276726 329642 186484 -35641 -125848 -83288 -156727 -75764
12146g5764K7397n4843M8950O7616K879o9123o9044J34214J9741l7548J05308
$$ -75764 -48367 -103210 -54260 13356 16235 -52888 -121932 12282 32023 -5525 99783
12135I9783l2267j161o057p9218j37775j5914O4580J40248L8297n3262k4130N3670
$$ 99783 67516 66355 60298 -18920 -156695 -172609 -108029 32219 70516 17254 -6876 46794
12123D6794j0841L1811O5959l8089j10062O526M7926L6329N7183l1314K8616j23723
$$ 46794 35953 67764 133723 95634 -14428 -7902 40024 76353 133536 102222 130838 7115
12111G115n1886M21j4173O814N0401L5553J07306R082n0322j33161o4176p836
$$ 7115 -44771 -44350 -58523 -51709 -1308 34245 141551 150633 100311 -32850 -97026 -104862
12099a04862m9704J13511J09302n0933q5412o5395O5471J3811O2885J74761K2121
$$ -104862 -154566 -41055 68247 17314 -68098 -133493 -68022 -54211 8674 183435 205556
12088B05556j22165j41780n3371P1287Q4472m7808n4478K5058O1004J8982p4737
$$ 205556 83391 -58389 -111760 -40473 43999 -3809 -58287 -33229 27775 46757 -27980
12077b7980o1086J8362P5329K2837l8320m7429j838j07958p3690J00521J27664
$$ -27980 -89066 -70704 4625 27462 -10858 -58287 -60125 -168083 -241773 -141252 -13588
12066a3588J5501l6893j33261l8616K19595P3703p5648j1100O5548N1117L4360
$$ -13588 1913 -34980 -168241 -206857 12738 86441 10793 -307 65241 116358 150718
12055A50718j4509j22034j39540j2074j0635l2620J46694K5071J1192k6555m6030
$$ 150718 136209 14175 -125365 -137439 -148074 -180694 -34000 -8929 2263 -24292 -70322
12044g0322n0016J30069r9612J8978J35064K0525j03950j38584P465J24835m2804
$$ -70322 -120338 9731 -89881 -70903 64161 84686 -19264 -157848 -150383 -25548 -68352
12033f8352L6607M0272P2639r3877q8873j1564J7186J70341J04153j72754p3569
$$ -68352 -31745 8527 81166 -12711 -101584 -113148 -95962 74379 178532 5778 -67791
12022f7791n1369o2520K0293P780N5918N0334O3585K4482j05647N4618J10256
$$ -67791 -119160 -181680 -161387 -153607 -97689 -47355 16230 40712 -64935 -10317 99939
12011I9939L0126p8550n2093K5163K5509n124N2246k6730L9625P4591N7465o2262
$$ 99939 130065 51515 -578 24585 50094 44970 97216 70486 110111 184702 242167 179905
11999A79905j81226O576o200K9654l0398p345K7807l2129K488M6460P5939l3823
$$ 179905 -1321 5255 -945 28709 -1689 -9034 18773 -13356 -10868 35592 111531 77708
11987G7708o0983j20014p5915M3540l6102l9597J33761P5346P9878L7514m3665
$$ 77708 16725 -103289 -179204 -135664 -171766 -211363 -77602 -2256 77622 115136 71471
11976G1471j2368j12411J2805L070k8911n8423o783o8817M1429J3425Q0516K0064
$$ 71471 59103 -53308 -40503 -37433 -66344 -124767 -131550 -200367 -158938 -145513 -64997 -44933
11964d4933K15113Q7561j72676q5095J34295P884r0564k6935R063K465M5092j19394
$$ -44933 170180 257741 85065 -30 134265 142149 51585 24650 33713 36178 81270 -38124
11952c8124j10247J899j875j56P7347q8172j24391J39358J83265j25239R1233
$$ -38124 -148371 -146472 -148347 -148503 -71156 -159328 -283719 -144361 38904 -86335 4898
11941D898K9672o5821J0067m6158J4478Q8644m1591o7682K0028q821M073k317
$$ 4898 34570 -31251 -21184 -67342 -52864 35780 -5811 -73493 -53465 -62286 -58213 -60530
11929f0530P2547j20233j6868O618l9637M1144J5532l2315J17685j251p0300k9202
$$ -60530 12017 -108216 -125084 -118466 -158103 -116959 -101427 -133742 -16057 -17308 -87608 -116810
11917a16810J6183J70235K4489j12407J1464M5381j7136J63420N7112l8317l2909
$$ -116810 -100627 69608 94097 -18310 -6846 38535 21399 184819 241931 203614 170705
11906A70705P5374j42332j53292j32061m2028J17610R8502J76453J4090r8335
$$ 170705 246079 103747 -49545 -181606 -223634 -106024 -7522 168931 183021 84686
11896H4686k7949j11592k2394J0211K4076J59250o7128J05M1589j52578p0762
$$ 84686 56737 -54855 -77249 -67038 -42962 116288 49160 49265 90854 -61724 -132486
11885a32486J50170o8788o3038K0580O1767R7975j5549n4741m8613P328J4779
$$ -132486 17684 -51104 -114142 -93562 -31795 66180 50631 -4110 -52723 -45395 -30616
11874c0616J05206j60211P351J25979j614N6919m8657l395P030n988o2555m017
$$ -30616 74590 -85621 -78270 47709 46095 103014 54357 50962 57992 52004 -10551 -14568
11862a4568j9619q3928j55249R278N8054k9930j17860m724J02594l7341J35216
$$ -14568 -34187 -118115 -273364 -264086 -206032 -235962 -353822 -358546 -255952 -293293 -158077
11851a58077M7821k1419k9380O0821L6046J01468q7433o9380j9365K835J03611
$$ -158077 -110256 -131675 -161055 -100234 -64188 37280 -50153 -119533 -138898 -136063 -32452
11840c2452K4518L5124k332n1116l9124P827J53623O819l112q7803j8789L9073
$$ -32452 -7934 27190 24858 -26258 -65382 -57555 96068 102887 99775 11972 -6817 32256
11828C2256o6172l2689Q7328N0278n1039k3052R4547M9391J699l3p3362m0552
$$ 32256 -33916 -66605 20723 71001 19962 -3090 91457 140848 142547 142514 69152 28600
11816B8600r0293k1159J0690O2812k6480O9665Q7574J579L5524n5709j2992m9062
$$ 28600 -61693 -82852 -72162 -9350 -35830 33835 121409 122988 158512 102803 89811 40749
11804D0749K3722M4082J7951j41990m3603J31696L9972j12115j10648j07827O940
$$ 40749 64471 108553 126504 -15486 -59089 72607 112579 464 -110184 -218011 -211071
11793b11071j5376J75901J00746J7519L1892o4041p2290J205P3680m7926K8065
$$ -211071 -226447 -50546 50200 67719 99611 35570 -36720 -35515 38165 -9761 18304
11782A8304Q0251J7536O555o0625j27701J6392L4696n115j2676N2162J1545l5774
$$ 18304 98555 116091 122646 62021 -65680 -49288 -14592 -19707 -32383 19779 31324 -4450
11770d450L7015m4266P9907Q8037p0819q9276N8030M8847j32466k2326j0366k762
$$ -4450 32565 -11701 68206 156243 85424 -3852 54178 103025 -29441 -51767 -62133 -64895
11758f4895k6738k6719N0581L5788R7324K3531l9748J2153p9296m4998Q4755M0686
$$ -64895 -91633 -118352 -67771 -31983 65341 88872 49124 61277 -18019 -63017 21738 62424
11746F2424M4581m6474j43259j53192Q1664J00401R0269k0793m6190M7120n2835
$$ 62424 107005 60531 -82728 -235920 -154256 -53855 36414 15621 -30569 16551 -36284
11735c6284k2157K6961M2331Q735K133K1155M1313k8120j00061R5683M1005j6115
$$ -36284 -58441 -31480 10851 19586 21719 42874 84187 56067 -43994 51689 92694 76579
11723G6579J789n0936o7112K1268K5105J59372J11069j01463p1499o7457O5245
$$ 76579 78368 27432 -39680 -18412 6693 166065 277134 175671 104172 36715 101960
11712A01960L4557l3391q5320Q0593Q2477n0535o0892O6511q6256n6388p0732
$$ 101960 136517 103126 17806 98399 180876 130341 69449 135960 49704 -6684 -77416
11701g7416L7913N8485l1906r8048P5439n0082m8552N9638P8500q9416n6272P3260
$$ -77416 -39503 18982 -12924 -110972 -35533 -85615 -134167 -74529 3971 -85445 -141717 -68457
11689f8457L7626Q61j9022q2168m1233m0611m1016o813J27900k5787P7657q249
$$ -68457 -30831 -29970 -48992 -131160 -172393 -213004 -254020 -260833 -132933 -158720 -81063 -89312
11677h9312j0311O5597O9591n3905m150J07468k1041O3171o104p4176q4638m6143
$$ -89312 -99623 -34026 35565 -18340 -22490 84978 63937 127108 121004 46828 -37810 -83953
11665h3953m0661j1809L1000k4211P2372J4929q0197M391r1244j9893O6355K4585
$$ -83953 -124614 -136423 -105423 -129634 -57262 -42333 -122530 -118139 -209383 -229276 -162921 -138336
11653a38336k8835j9859J13110r831l0549k1726j84951l0750J0578O0432N4115
$$ -138336 -167171 -187030 -73920 -83751 -114300 -136026 -320977 -351727 -341149 -280717 -226602
11642b26602K1842J09946J15081p5040n8352P2994P6945J5124o8184m2396N3408
$$ -226602 -204760 -94814 20267 -54773 -113125 -40131 36814 51938 -16246 -58642 -5234
11631e234l0700j6940j25955M0698J6173k57673l1980J47640K46265J1737p325
$$ -5234 -35934 -52874 -178829 -138131 -121958 -379631 -411611 -263971 -17706 -5969 -13294
11620a3294N1803j7055k6796o4875o9856N8667Q4898q0728r2386n6368J96852
$$ -13294 38509 21454 -5342 -70217 -140073 -81406 3492 -77236 -169622 -225990 -29138
11609b9138N2107n7143q9063q471p183m6716M4502L6106J23995n7164o118M3408
$$ -29138 22969 -34174 -123237 -131708 -138891 -185607 -141105 -104999 18996 -38168 -44286 -878
11597h78K8376L6280j16672j79199R8311J04498q999L9258p0380m3413p9356o9527
$$ -878 27498 63778 -52894 -232093 -133782 -29284 -38283 975 -69405 -112818 -192174 -261701
11585b61701K6719O4284O7526O4660K1800m5974k7025L775L398K1984p1606L3438
$$ -261701 -234982 -170698 -103172 -38512 -16712 -62686 -89711 -85936 -82538 -60554 -132160 -98722
11573i8722Q1324m0742J1319l9538p1502k6920M4026Q2342j8010L4263j32881
$$ -98722 -17398 -58140 -46821 -86359 -157861 -184781 -140755 -58413 -76423 -42160 -175041
11562a75041l9385P1922N3918L0302L971m1599J0987J4322k9967j2809k6107N9943
$$ -175041 -214426 -142504 -88586 -58284 -54313 -95912 -84925 -70603 -100570 -113379 -139486 -79543
11550g9543J26231K1359n095r3029r2076N7854o4296J9659N1333j0176k0707n9156
$$ -79543 46688 68047 62952 -30077 -122153 -64299 -128595 -108936 -57603 -67779 -88486 -147642
11538a47642J6752k4883p552J37811j00575l2714L016J9567j3658P9741r3045
$$ -147642 -130890 -155773 -163325 -25514 -126089 -158803 -155787 -136220 -149878 -70137 -163182
11527a63182j2485J45357M239l4733q9897K1382L9385r110j01168L8648Q1841
$$ -163182 -175667 -30310 -26071 -60804 -150701 -129319 -89934 -99044 -200212 -161564 -79723
11516g9723l4629j3170O1408k7280M3531J13706k4960l5198k4974L8378R4839
$$ -79723 -114352 -127522 -66114 -93394 -49863 63843 38883 3685 -21289 17089 111928
11505A11928r347r7872n4625k1223p65Q5149J8584J23304k8222m2081J4104P2385
$$ 111928 102581 4709 -49916 -71139 -71904 13245 31829 155133 126911 84830 98934 171319
11493A71319j30910n2696r4716k740Q954r0330k0990J18492k0542J158O5714j73622
$$ 171319 40409 -12287 -107003 -109743 -100789 -191119 -212109 -93617 -114159 -113001 -47287 -220909
11481b20909p371J61716L6834J00540l061J9216R5418K6257n4189j54844p0267
$$ -220909 -228280 -66564 -29730 70810 67749 86965 182383 208640 154451 -393 -70660
11470g0660R0P2206j1382l2173J9944L2746N8407M2702L483o1742p7636l0522
$$ -70660 -70570 1636 -9746 -41919 -21975 10771 69178 111880 115363 53621 -24015 -54537
11458e4537n1894M8198J2201j3413K163k0424K2478P026M176L7869N3521j36551
$$ -54537 -106431 -58233 -46032 -59445 -57282 -77706 -55228 -48202 -44026 -6157 47364 -89187
11446h9187q3797j9584N6097J65838n8333j89601k3967J06380m5214P6892O3696
$$ -89187 -172984 -192568 -136471 29367 -28966 -218567 -242534 -136154 -181368 -104476 -40780
11435d0780o4749q2597L444N7110P1052O0551n5895J7170O4409j30193j60686
$$ -40780 -105529 -188126 -184682 -127572 -56520 4031 -51864 -34694 29715 -100478 -261164
11424b61164N9713m483k873n7865k4246M5353K761l6000k2570j00949N249M6931
$$ -261164 -201451 -205934 -208807 -266672 -290918 -245565 -242804 -278804 -301374 -402323 -397074 -350143
11412c50143J03913N5516r5489j9632P5376J02905J2405L4706M3384n5509L8528
$$ -350143 -246230 -190714 -286203 -305835 -230459 -127554 -115149 -80443 -37059 -92568 -54040
11401e4040m2211j0736P088j2771j45734L2041J24897R0343l2574n7961L3197
$$ -54040 -96251 -106987 -99899 -112670 -258404 -226363 -101466 -11123 -43697 -101658 -68461
11390f8461J03341Q4782n7561l8016j32652l0301J38689J09000r7735n6301J8256
$$ -68461 34880 119662 62101 24085 -108567 -138868 -179 108821 11086 -45215 -26959
11379b6959j2020j7558L3310l4274J4769J05195k3782l9305j5510o455l3656p4884
$$ -26959 -38979 -56537 -23227 -57501 -42732 62463 38681 -624 -16134 -22589 -56245 -131129
11367a31129N542J20343K291j31991q3234J37356M8010j8258M2940L7881L2120
$$ -131129 -125587 -5244 -2953 -134944 -218178 -80822 -32812 -51070 -8130 29751 61871
11356F1871K0448l0627r9910P542J6115j0476l8335k8944l6900P4285J41658J00438
$$ 61871 82319 51692 -48218 -40676 -24561 -35037 -73372 -102316 -139216 -64931 76727 177165
11344A77165l618p1495j33710k6680j3345M27Q3542K9586l7397M4629n1764r7833
$$ 177165 173547 102052 -31658 -58338 -71683 -71256 12286 41872 4475 49104 -2660 -100493
11332a00493P2168p4415n2108N2835n1138K9868P7173M1343m7505n1769K091J0373
$$ -100493 -28325 -102740 -154848 -102013 -153151 -123283 -46110 -4767 -52272 -104041 -101950 -91577
11320i1577J1080O4339m2205j8935M1868n1953o528P8075m5399P667K9933p6842
$$ -91577 -80497 -16158 -58363 -77298 -35430 -87383 -93911 -15836 -61235 -53568 -23635 -100477
11308a00477j3091P2056k3147n5000N4801L4801k3597K5581o2386L246Q5038J31408
$$ -100477 -113568 -41512 -64659 -119659 -64858 -30057 -53654 -28073 -90459 -87213 -2175 129233
11296A29233k0744M0676O0945O327J65878K35177J56808P5135J37883K31094L65704
$$ 129233 108489 149165 210110 216437 382315 617492 774300 849435 987318 1218412 1584116
11285A584116O41225J115485J626323J788706J375032N77522J8687o35160j409317
$$ 1584116 2225341 3340826 4967149 6755855 8130887 8708409 8727096 8091936 6682619
11276F682619j672608j430426j070777o00610m65317l75934l09689j58384r8635
$$ 6682619 5010011 3579585 2508808 1908198 1442881 1066947 757258 598874 500239
11267E00239q7772n828n4757J5001j7818r7384j06619K257N5839L1883j14853
$$ 500239 412467 406639 351882 366883 349065 251681 145062 147319 203158 235041 120188
11256A20188j35092m0137N097J26491p2166j9147M9374Q5609N6070q8052k16359
$$ 120188 -14904 -55041 -49944 76547 4381 -14766 34608 120217 176287 88235 -128124
11245a28124P1798K00973N9125q9585l9820Q186j34382r4117K8117O954R9333
$$ -128124 -56326 144647 203772 114187 74367 82553 -51829 -145946 -117829 -110875 -11542
11234a1542J26381L8505j665K2749M476m5323N1986l63n9277j01997j36125n0943
$$ -11542 114839 153344 151679 174428 178904 133581 185567 185204 125927 23930 -112195 -163138
11222a63138N8910N3608m7875m9813K6603j36j10314J03605J63939M6879K7467
$$ -163138 -104228 -50620 -98495 -148308 -121705 -121841 -232155 -128550 35389 82268 109735
11211A09735m1456p4654Q9747O3651j04089m9915M5341k4876Q944m813l8769p5317
$$ 109735 68279 -6375 83372 147023 42934 -6981 38360 13484 22428 17615 -21154 -96471
11199i6471k8686M6058K10772J9930j06786k0388p2859k5900O7945M5313K6346
$$ -96471 -125157 -79099 131673 151603 44817 24429 -48430 -74330 -6385 38928 65274
11188F5274N5435j51650m9916K21792R0018j04069m770J29283J15008Q721M6534
$$ 65274 120709 -30941 -80857 140935 230953 126884 122114 251397 366405 375126 421660
11177D21660J74741L44348K39431K68598O51381J043427J464189J709517R68855
$$ 421660 596401 940749 1180180 1448778 2100159 3143586 4607775 6317292 7286147
11168G286147P6367K14965J40180m90863j271266j400311j289611r64113o44141
$$ 7286147 7362514 7577479 7717659 7226796 5955530 4555219 3265608 2301495 1657354
11159A657354m37996k77443j20737k09358n407j38079j10785l4037J2960k181
$$ 1657354 1219358 941915 821178 611820 606413 468334 357549 323512 336472 334291
11149C34291k0853j23927j12400k7990L601r7991M9863L8093q7201J8218J0459
$$ 334291 313438 189511 77111 49121 52722 -45269 4594 42687 -44514 -26296 -15837
11138a5837p406J0835p3531L957M2093r3326j01393r188J2591j8619K3449N0235
$$ -15837 -23243 -12408 -85939 -81982 -39889 -133215 -234608 -243796 -231205 -249824 -226375 -176140
11126a76140k4434O2533J2603p4285m118N1068l3200l1936K7906J4387j776K7555
$$ -176140 -200574 -138041 -125438 -199723 -203841 -152773 -185973 -217909 -190003 -175616 -177392 -149837
11114a49837N8089k0413p6489N2668M0171O9159o1196n0031N0827q955l4933j125
$$ -149837 -91748 -112161 -188650 -135982 -95811 -26652 -87848 -137879 -87052 -96007 -130940 -132065
11102a32065R2992q2512p037m388M7779K1520Q004j01299J06605L0673m4390n4613
$$ -132065 -39073 -121585 -128622 -133010 -85231 -63711 -55707 -157006 -50401 -19728 -64118 -118731
11090a18731l5260J1878m3515J35439P0578k08020O804L1897N7339N5698j38016
$$ -118731 -153991 -142113 -185628 -50189 20389 -187631 -180827 -148930 -91591 -35893 -173909
11079a73909j5761J8984J0150O0207Q599o3842K2467K2551Q1667M3971p2363Q1942
$$ -173909 -189670 -170686 -160536 -100329 -91730 -155572 -133105 -110554 -28887 15084 -57279 24663
11067B4663m1875j8168j28563m1100J16930M5225Q0509q2030r4317L8281J21697
$$ 24663 -17212 -35380 -163943 -205043 -88113 -42888 37621 -44409 -138726 -100445 21252
11056B1252n99p4953m6295O858R9242P294r6128q6527M5572P3064l1631M7564
$$ 21252 20653 -54300 -100595 -93737 5505 12799 -83329 -169856 -124284 -51220 -82851 -35287
11044c5287k7601K0224j04337J9788M1926J7480J4425K0768J20934Q598J1216
$$ -35287 -62888 -42664 -147001 -127213 -85287 -67807 -53382 -32614 88320 96918 108134
11033A08134m847p8993r7203m8917k6829O7972N9755k2892l2074O8862L9453P472
$$ 108134 103287 24294 -72909 -121826 -148655 -80683 -20928 -43820 -75894 -7032 32421 39893
11021C9893n23L8081j12437j26568o4014l4865J4600O8533J9628J721P5357j985
$$ 39893 39370 77451 -34986 -161554 -225568 -260433 -245833 -177300 -157672 -155951 -80594 -82579
11009h2579J2690k8716k821K4426N7775O5639L8953j15868j5091P0742J8261j8197
$$ -82579 -69889 -98605 -101426 -77000 -19225 46414 85367 -30501 -45592 25150 43411 25214
10997B5214l1854j76218o8465l2306Q8374Q2599J14677J29393k5458j07955j77008
$$ 25214 -6640 -182858 -251323 -283629 -195255 -112656 2021 131414 105956 -1999 -179007
10986a79007K6118r796N9183J32140l7628n3702P7092m8548n7384L2605J4290
$$ -179007 -152889 -162685 -103502 28638 -8990 -62692 14400 -34148 -91532 -58927 -44637
10975d4637p5780k1440m7182j4391m1731L0700P165L4475K0634M2122q2282L4599
$$ -44637 -120417 -141857 -189039 -203430 -245161 -214461 -207296 -172821 -152187 -110065 -192347 -157748
10963a57748k284k3078O1080P9654j526o2397o639p8225M0053M2087J8280P0727
$$ -157748 -160032 -183110 -122030 -42376 -43902 -106299 -112938 -191163 -151110 -109023 -90743 -20016
10951b0016o4738l7608P241m9890L6379p455J79071l7629k0601J548p2323Q4042
$$ -20016 -84754 -122362 -115121 -165011 -128632 -136087 42984 5355 -15246 -13698 -86021 -1979
10939a979J82241q4280r4153p1299J17931O9381o5019j51970j57865o147L7562
$$ -1979 180262 95982 1829 -69470 48461 117842 52823 -99147 -257012 -263159 -225597
10928b25597R4171L0843P0084r055j69293k1192P333l9844K2102K5741K8462R9809
$$ -225597 -131426 -100583 -30499 -39554 -208847 -230039 -222706 -262550 -240448 -214707 -186245 -86436
10916h6436P1663n2439j75255n461J91938L9349q3189P557J6625j21518Q4964
$$ -86436 -14773 -67212 -242467 -247928 -55990 -16641 -99830 -92273 -75648 -197166 -112202
10905a12202K8286p2585j5191O8273J6623P4760M1039k3172j34126J5813J47076
$$ -112202 -83916 -156501 -171692 -103419 -86796 -12036 29003 5831 -128295 -112482 34594
10894C4594L6127j52352J4084j6890o175K4881n6985l8866N5730k5913p8614O0246
$$ 34594 70721 -81631 -67547 -84437 -90612 -65731 -122716 -161582 -105852 -131765 -210379 -150133
10882a50133P0647K0321q7476Q1444K3461m6643R0748o4149l7652k3784K5650
$$ -150133 -79486 -59165 -146641 -65197 -41736 -88379 2369 -61780 -99432 -123216 -97566
10871i7566K7358J5688O4984m8520K8639j47174q507J35306N6242q150Q6442j59673
$$ -97566 -70208 -54520 10464 -38056 -9417 -156591 -165098 -29792 26450 18300 104742 -54931
10859e4931j56460Q7036o4680l512o0387j31775Q8164M0236k390K4117n9488P1357
$$ -54931 -211391 -124355 -189035 -192547 -252934 -384709 -296545 -256309 -258699 -234582 -294070 -222713
10847b22713J42408R5556L5053J4693L0968o6399J3602P9758Q6475O954o9540
$$ -222713 -80305 15251 50304 64997 95965 29566 43168 122926 209401 216355 146815
10836A46815o3992j02352L1591j16184q4201J38980J00042l8115J0446k0626j42765
$$ 146815 82823 -19529 12062 -104122 -188323 -49343 50699 12584 23030 2404 -140361
10825a40361J874p7263J25654J61151O081n680j72123m5183n8581l5453m1249
$$ -140361 -138487 -215750 -90096 71055 77136 71456 -100667 -145850 -204431 -239884 -281133
10814b81133O5225J4161M9174p5747O3531N8501N9816j15935j10525j2446n5996
$$ -281133 -215908 -201747 -152573 -228320 -164789 -106288 -46472 -162407 -272932 -285378 -341374
10803c41374K0581K8914m9425P254J08037n202J02391J20071Q3873j35305j64306
$$ -341374 -320793 -291879 -341304 -334050 -226013 -231215 -128824 -8753 75120 -60185 -224491
10792b24491J6155P0068J1676J20079K7847j00699p6577R7740J34197j07576p1773
$$ -224491 -208336 -138268 -126592 -6513 21334 -79365 -155942 -58202 75995 -31581 -103354
10781a03354L6591n7317r6545l1444J90718Q5744M68O4784k9639j10429n9564
$$ -103354 -66763 -124080 -220625 -252069 -61351 24393 24861 89645 60006 -50423 -109987
10770a09987r755P8645K5254M5566L5623o9532N9304n2713K0786n9705R2164O2564
$$ -109987 -119742 -41097 -15843 29723 65346 -4186 55118 2405 23191 -36514 55650 118214
10758A18214K8438N9950Q731K6020l3449o1007k4812q1233p0035k8899l5204Q7528
$$ 118214 146652 206602 215333 241353 207904 146897 122085 40852 -29183 -58082 -93286 -5758
10746e758Q8367L7403J53903J34970J64182J04804k6775j28754j19426n468P938
$$ -5758 82609 120012 273915 408885 573067 677871 651096 522342 402916 397448 405386
10735D05386K6564q1129j54756j27637Q2818P9433M0726k2422n6405l5412r5885
$$ 405386 431950 350821 196065 68428 151246 230679 271405 248983 192578 157166 61281
10724F1281n3558K6079P8099k0202r9402l2149q9674J1070Q0317K6156J10721
$$ 61281 7723 33802 111901 91699 -7703 -39852 -129526 -118456 -38139 -11983 98738
10713I8738l7367j54974j19193L0097J12230l9228K3345J14596o1454k2836J6867
$$ 98738 61371 -93603 -212796 -182699 -70469 -109697 -86352 28244 -33210 -56046 -39179
10702c9179J27171j10478j4863P8925q6187j43203m4377O3097P0636N889J0634
$$ -39179 87992 -22486 -37349 41576 -44611 -187814 -232191 -169094 -98458 -92569 -81935
10691h1935o7837o4012L6981J31825J30562P2663j07439j20151l2163N668J18777
$$ -81935 -149772 -213784 -176803 -44978 85584 158247 50808 -69343 -101506 -95838 22939
10680B2939q4931j0186L65P997J0745p9298N7829q077o4335p6685j14382M8669
$$ 22939 -61992 -72178 -71813 -63816 -53071 -132369 -74540 -82617 -146952 -223637 -338019 -289350
10668b89350o383N3683K1115J29899l7504J20649j1329n1012q6761R7254P6656
$$ -289350 -295733 -242050 -220935 -91036 -128540 -7891 -19220 -70232 -156993 -59739 16917
10657A6917m7342O3342O6046o1891o8008j38582j24883R8342J73198k1014N5404
$$ 16917 -30425 32917 98963 37072 -30936 -169518 -294401 -196059 -22861 -43875 11529
10646A1529L1404j02253P9807J03124n2716j78112j4537J02921P3984j41203j4589
$$ 11529 42933 -59320 20487 123611 70895 -107217 -121754 -18833 55151 -86052 -100641
10635a00641J44937R659j3227K0706Q2423l1862j44809k0556q9544k7004J2347
$$ -100641 44296 53955 40728 61434 143857 111995 -32814 -53370 -142914 -169918 -157571
10624a57571j864j20165l2997J28171Q1409J30763r5546j12641m7000N1434o445
$$ -157571 -159435 -279600 -312597 -184426 -103017 27746 -67800 -180441 -227441 -176007 -182452
10613a82452r5483j5182J00886N6555Q6251J2050j10978p9086l9170p327Q3766
$$ -182452 -277935 -293117 -192231 -135676 -49425 -37375 -148353 -227439 -266609 -273936 -190170
10602a90170J23655O4203N8418N8093j2356J8332m1503o9785l536Q243L1646J34881
$$ -190170 -66515 -2312 56106 114199 101843 120175 78672 8887 5351 13594 45240 180121
10590A80121p3815m0643N9532k8150O3513j0517j49659q010K8875n724l834n423
$$ 180121 106306 65663 125195 97045 160558 150041 382 -7628 21247 15523 11689 6266
10578F266N2035m7977p3463M5113R3134Q5393l9939o4581J7068L7920m2610l9617
$$ 6266 58301 10324 -63139 -18026 75108 160501 120562 55981 73049 110969 68359 28742
10566B8742J8151N6322j0737j12242j13722k37K0660J07855Q5691r8048m6093
$$ 28742 46893 103215 92478 -19764 -133486 -133723 -113063 -5208 80483 -17565 -63658
10555f3658q1246r6812j6002J26790M1077P071j40858j48781j9294q244R968J70909
$$ -63658 -144904 -241716 -257718 -130928 -89851 -82780 -223638 -372419 -391713 -399957 -389989 -219080
10543b19080M6733J5193K6035J1915m2571K0378R9877J11372J06165k1225l3469
$$ -219080 -172347 -157154 -131119 -119204 -161775 -141397 -41520 69852 176017 154792 121323
10532A21323J7805o3514q8202m3500m5805N2644p218n0252m4081O3246L7326r6749
$$ 121323 139128 75614 -12588 -56088 -101893 -49249 -56467 -106719 -150800 -87554 -50228 -146977
10520a46977j9915q031K1929O1629R5680L2346r3226q8516j8239O2985K4577l0132
$$ -146977 -166892 -174923 -152994 -91365 4315 36661 -56565 -145081 -163320 -100335 -75758 -105890
10508a05890k6807Q4123M658K6682O2073r588m8083n1759j06774K8125P1527o0831
$$ -105890 -132697 -48574 -43916 -17234 44839 35251 -12832 -64591 -171365 -143240 -71713 -132544
10496a32544L089N0956K6540M0279Q9994N0962n6448k6876r3087j47493j09163
$$ -132544 -129455 -78499 -51959 -11680 78314 129276 72828 45952 -47135 -194628 -303791
10485c03791J86653M2543k5929J49942L5444n9094k7961j11979M6641m0544J08008
$$ -303791 -117138 -74595 -100524 49418 84862 25768 -2193 -114172 -67531 -108075 -67
10474f7P0991m6329j7114j27752O9820J08310J2990k2607j4240J0381L9445J4775
$$ -67 70924 24595 7481 -120271 -50451 57859 70849 48242 34002 44383 83828 98603
10462I8603n867j5918j3188P7483j61140j61685J7154q5889q475M2295M9393j5447
$$ 98603 92736 76818 63630 141113 -20027 -181712 -164558 -250447 -258922 -216627 -167234 -182681
10450a82681L6482j3889p1334j6634J2477Q7722k5080q9406p9816Q0501m5329
$$ -182681 -146199 -160088 -231422 -248056 -235579 -147857 -172937 -262343 -342159 -261658 -306987
10439c06987n2608J158J51099L0692k0309N3970J57745O486J0221M2483j8749
$$ -306987 -359595 -358437 -207338 -176646 -196955 -142985 14760 21246 31467 73950 55201
10428E5201n1175l4915j95759q2115L0542Q6931P1524j2654j27414l8681O6920
$$ 55201 4026 -30889 -226648 -308763 -278221 -191290 -119766 -132420 -259834 -298515 -231595
10417b31595J15580q8702j26233L0671O7287L6338J0169K8101J44796J02199J3147
$$ -231595 -116015 -204717 -330950 -300279 -232992 -196654 -186485 -158384 -13588 88611 101758
10406A01758O6992J36561j05967j29313j17315j2871L50p2472l6169r7968m0909
$$ 101758 168750 305311 199344 70031 -47284 -60155 -59805 -132277 -168446 -266414 -307323
10395c07323P4451p724J59055j1165J2128N577Q843P1382l6215j38615o3127K09791
$$ -307323 -232872 -240596 -81541 -92706 -80578 -75001 -66158 5224 -30991 -169606 -232733 -22942
10383b2942K2105N5646n4026m8515N604l599k2225O0700j7382r7587p506J0054
$$ -22942 -837 54809 783 -47732 -42128 -45727 -67952 -7252 -24634 -122221 -129727 -119673
10371a19673R6914J1558k4073r0963k1095k215k8554m3442J26190R3712J772m0487
$$ -119673 -22759 -11201 -35274 -126237 -147332 -149547 -178101 -221543 -95353 -1641 131 -40356
10359d0356M472o5313l7744J22413Q6552j58457q8026J26619J38899J08736P1654
$$ -40356 -35884 -101197 -138941 -16528 70024 -88433 -176459 -49840 89059 197795 269449
10348B69449j17346r4472P8932l1653j04337j19490J05889L7099j5975J07544
$$ 269449 152103 57631 136563 104910 573 -118917 -13028 24071 8096 115640
10338A15640R1821p3112j17903j9654j9059K7091J31055Q9653k065j20439k0625
$$ 115640 207461 134349 16446 -3208 -22267 4824 135879 225532 223467 103028 82403
10327H2403M471j04649n6240q5896n0705k5780R419J9895Q2645o168M6090K9073
$$ 82403 86874 -17775 -74015 -159911 -210616 -236396 -226977 -207082 -124437 -130605 -84515 -55442
10315e5442p8193l3127l1339L364J63239L0997q3531L2014j18162j57642l2342
$$ -55442 -133635 -166762 -198101 -194737 -31498 -501 -84032 -52018 -170180 -327822 -360164
10304c60164Q3469Q6977M4091K7868M9178K0010p9226n6392L7512K4236R9122
$$ -360164 -276695 -189718 -145627 -117759 -68581 -48571 -127797 -184189 -146677 -122441 -23319
10293b3319p0383M677l0473m4746n247L9860L990r3900J12398J23351Q5536k3641
$$ -23319 -93702 -89025 -119498 -164244 -169491 -129631 -125641 -219541 -107143 16208 101744 78103
10281G8103j00470l3226q1018r6462J10701P3218k1521Q3794K4043K5008M0201
$$ 78103 -22367 -55593 -136611 -233073 -122372 -49154 -70675 13119 37162 62170 102371
10270A02371j99455o7432o262m3415J11812O5460l0447o5318r4845p3913j0163
$$ 102371 -97084 -164516 -170778 -214193 -102381 -36921 -67368 -132686 -227531 -301444 -311607
10259c11607n571J12173L0236p7417o1110j23808K7697K56322K81395M8884j3415
$$ -311607 -317178 -205005 -174769 -252186 -313296 -437104 -409407 -153085 128310 177194 163779
10248A63779M9371k2020r1988M006P2954q8420L8819r0240l5738j19896M2802
$$ 163779 213150 191130 99142 103148 176102 87682 126501 36261 523 -119373 -76571
10237g6571J2276j07196k0440j30287k1066J18935J22947L9757r7793j9426l1956
$$ -76571 -64295 -171491 -191931 -322218 -343284 -224349 -101402 -61645 -159438 -178864 -210820
10226b10820J16255N5146N0526K6868p7677j68638p2191K4355Q3532J33542j2636
$$ -210820 -94565 -39419 11107 37975 -39702 -208340 -280531 -256176 -172644 -39102 -51738
10215e1738m5801N2235j4196M7575K7736l1405N3518K2864j3394L2755J36160
$$ -51738 -97539 -45304 -59500 -11925 15811 -15594 37924 60788 47394 80149 216309
10204B16309l9197q8695l8232n1729R2971O5957O0277K7093q1822j29403o9453
$$ 216309 177112 88417 50185 -1544 91427 157384 217661 244754 162932 33529 -35924
10193c5924k124m5998Q2836N7209Q3909l2162l0362L868j1414n1098M9570J36807
$$ -35924 -38048 -84046 -1210 55999 139908 107746 77384 81252 69838 18740 68310 205117
10181B05117P384m2858p1253r4310k1073R5390J8021Q0480M7487n1272q6567n3733
$$ 205117 212501 169643 98390 4080 -16993 78397 96418 176898 224385 173113 86546 32813
10169C2813n9146m035J1021l5132n1211l5549n2420J01703O8543P9280Q5274M2580
$$ 32813 -26333 -30368 -19347 -54479 -105690 -141239 -193659 -91956 -23413 55867 141141 183721
10157A83721L8213o7447j24557J06610M3963p7583r3476q297L8938J8657n7176
$$ 183721 221934 154487 29930 136540 180503 102920 9444 1147 40085 58742 1566
10146A566n9013j11662k4352Q2194K24958l352j50765m5984M4590n8722J6887
$$ 1566 -57447 -169109 -193461 -111267 113691 110339 -40426 -86410 -41820 -100542 -83655
10135h3655O0637m424l7307q4654n4567P48O9418L2854k5807l2554J49372l4005
$$ -83655 -23018 -27442 -64749 -149403 -203970 -203222 -133804 -100950 -126757 -159311 -9939 -43944
10123d3944n0294J4424m9797Q2282N0135k1926N22j23573o8773j25980L0551J43198
$$ -43944 -94238 -79814 -129611 -47329 2806 -19120 -18598 -142171 -210944 -336924 -306373 -163175
10111a63175J3846J2574J28808R9014M178j27040m4607N5901N7559M1127k4752
$$ -163175 -149329 -136755 -7947 91067 95245 -31795 -76402 -20501 37058 78185 53433
10100E3433l9049r390p8070j1494K9373P800O1695o834o3907r6472P949J55967
$$ 53433 14384 4994 -73076 -84570 -55197 -47397 14298 7464 -56443 -152915 -144966 11001
10088A1001Q614n8048j13577K0561O6711l1711J53828O3694j48704J165K0776
$$ 11001 19615 -38433 -152010 -131449 -64738 -96449 57379 121073 -27631 -26466 -5690
10077e690j32696L9858J32713l160p7938N481j4619j2983m6245m4131K0632P6984
$$ -5690 -138386 -98528 34185 31025 -46913 -41432 -56051 -69034 -115279 -159410 -138778 -61794
10065f1794R0310j44454J9351o3883j14266L3973O6337J06855J6088M4509O4542
$$ -61794 28516 -115938 -96587 -160470 -274736 -240763 -174426 -67571 -51483 -6974 57568
10054E7568K6573J45030M8968j36456n1015l9894l9375J2804J86344J23164J39753
$$ 57568 84141 229171 278139 141683 90668 50774 11399 24203 210547 333711 473464
10043D73464M48308M60033J08378k72422l10612k79364k16503p0582r2088p3731
$$ 473464 921772 1381805 1490183 1217761 907149 627785 411282 340700 248612 174881
10033A74881N2575m7628l1813O576j8670l933m9853M7776j24825o0106J01064
$$ 174881 227456 179828 148015 154591 135921 131988 82135 129911 5086 -55020 46044
10022D6044Q3903L1086J18728N168J08384J00560j8203j46416j09511M8901P9264
$$ 46044 129947 161033 279761 284929 393313 493873 475670 329254 219743 268644 347908
10011C47908j087o2838J9924j2263O8722n5507N6081n3622l6579j19012l3715
$$ 347908 346821 283983 303907 291644 360366 304859 360940 307318 270739 151727 118012
10000A18012R5751O675J8109J331L0532M5134q384r8882L0981Q6793J92237J91608
$$ 118012 213763 220438 238547 239878 270410 315544 307160 208278 239259 326052 518289 709897
9988G09897J54629P6393M3625p6879J732Q6969R2379J87262K91167J18676J25970
$$ 709897 864526 940919 984544 907665 909397 996366 1088745 1276007 1567174 1685850 1811820
9977A811820J83763l977k55959l24705j57896j74227o7514l2126O3586r6821j49116
$$ 1811820 1995583 1991606 1735647 1410942 1253046 1078819 1011305 979179 1042765 945944 796828
9966G96828j89845j05084R711k4068o2736j19896j58844l2338n3568q0873Q1664
$$ 796828 606983 501899 511610 487542 424806 304910 146066 113728 60160 -20713 60951
9955F0951j1013m1769k2489k3729m5580K0731J48721J28329l4280L6867m0994
$$ 60951 49938 8169 -14320 -38049 -83629 -62898 85823 214152 179872 216739 175745
9944A75745j20821k445n9231J1808O5634L9264O086k9773k5292j35002J2549M2983
$$ 175745 54924 52479 -6752 5056 70690 109954 116040 86267 60975 -74027 -61478 -18495
9932a8495n9319m8859J11108J21164m0113l569J21797L2507N8800l5261j0842
$$ -18495 -77814 -126673 -15565 105599 65486 61917 183714 216221 275021 239760 228918
9921B28918k7857j4317M5201m0927n8596J03399L164j72721p8611k0189R7884
$$ 228918 201061 186744 231945 191018 132422 235821 238985 66264 -12347 -32536 65348
9910F5348J25403J52258J17594o960J5709l5750m2003p2252j03205p3687J274
$$ 65348 190751 343009 460603 453643 469352 433602 391599 319347 216142 142455 143729
9899A43729O9120m9689j28710N1749J74968P1142K19534J9731l3706M8323l0685
$$ 143729 212849 163160 34450 86199 261167 332309 551843 571574 537868 586191 555506
9888E55506r1804j06414j48555J6570n8515n8243K7336J5735j26823r534J95940
$$ 555506 463702 357288 208733 225303 166788 108545 135881 151616 24793 15259 211199
9877B11199J922r0712n8368J2400N747l6742N3860L1564N2660Q0120j1636k3611
$$ 211199 213121 122409 64041 76441 82188 45446 99306 130870 183530 263650 252014 228403
9865B28403j09885n8621J0270k2191L1165J79700m0506m2297M8236j7142q8849
$$ 228403 118518 59897 70167 47976 79141 258841 218335 176038 224274 207132 118283
9854A18283m6104K4136K27030J42702j1675r4413n4805L3870J2347j8262J44679
$$ 118283 72179 96315 323345 466047 454372 359959 305154 339024 351371 333109 477788
9843D77788L8686j81564j49407J9757Q4274k1373q7901L3905q5689O610N7014
$$ 477788 516474 334910 185503 205260 289534 268161 180260 214165 128476 135086 192100
9832A92100Q4534m905j47812P8940L0651P1291J38961J44792j17644j12987j23665
$$ 192100 276634 271729 123917 202857 233508 304799 443760 588552 470908 357921 234256
9821B34256p8878P3903Q0400m0698L86l852m8126m9112n1787N3987J39485J77995
$$ 234256 155378 229281 309681 268983 269369 265517 217391 168279 116492 170479 309964 487959
9809D87959J11263j19000r7326J09549M0227n196R7537N0027P6853n34k0344o2246
$$ 487959 599222 480222 382896 492445 532672 527476 625013 675040 751893 751359 731015 668769
9797F68769K2271Q5202q8345r3582m6547j68081o4544L8448P4316q717m1931J4938
$$ 668769 691040 776242 687897 594315 547768 379687 315143 353591 427907 419190 377259 392197
9785C92197k1966N5357Q3574J25943K78481M70435O82262R08692N81140l47693
$$ 392197 370231 425588 509162 635105 913586 1384021 2066283 2974975 3556115 3208422
9775C208422p93011o27940m36360l89450k50020r9457l4167p7910L6243N0940
$$ 3208422 2415411 1787471 1351111 961661 711641 612184 578017 500107 536350 587290
9765E87290N2604n3699K172N5797n2775J08751K6785K10098K11014K48237K37402
$$ 587290 639894 586195 588367 644164 591389 700140 726925 937023 1148037 1396274 1633676
9754A633676K62297J62034J34621K41535J67016J1906j90015k71058k57142j43963
$$ 1633676 1895973 2058007 2192628 2434163 2601179 2613085 2423070 2152012 1894870 1750907
9744A750907k86638k82590r6200j88909q7604j10962j34886j66376n5589j22135
$$ 1750907 1464269 1181679 1085479 896570 808966 698004 563118 396742 341153 219018
9734B19018M106J49004L3027n3491j52318L4519L440n0941m6147n5994M7550N6054
$$ 219018 223124 372128 405155 351664 199346 233865 237305 186364 140217 84223 131773 187827
9722A87827J684L9990l0062j84434l5372n286O746J2756N0328J92J6139J47484
$$ 187827 189511 229501 199439 15005 -20367 -25653 -18907 -6151 44177 44369 60508 207992
9710B07992K9228n8887M8361M025l9212n914o8937o4364r0706k0714L6633K5386
$$ 207992 237220 178333 226694 230719 191507 185593 116656 52292 -38414 -59128 -22495 2891
9698B891n3948l4566J39990Q0144p2246N9609O4463Q1350m0450J8515J35450q8442
$$ 2891 -51057 -85623 54367 134511 62265 121874 186337 267687 227237 245752 381202 292760
9686B92760r4551M4618j61614m4229p4016O7219J2431n9282m4026K0812O8701
$$ 292760 198209 242827 81213 36984 -37032 30187 42618 -16664 -60690 -39878 28823
9675B8823r456O9418J14330o7018p827P8210j8436L5718r0694q2428J0969Q2563
$$ 28823 19367 88785 203115 136097 128270 206480 188044 223762 133068 50640 61609 144172
9663A44172j8050M4930J13461l9918j10897n7325L3313J7190j16286J4096J20053
$$ 144172 126122 171052 284513 244595 133698 76373 109686 126876 10590 24686 144739
9652A44739R0766p1123j7266O8458M106m0400J2365L1351j2959k9263p9901j50057
$$ 144739 235505 164382 147116 215574 219680 179280 191645 222996 210037 180774 100873 -49184
9640d9184L6160J28166l522j0073j3249L8793J39703M5787m6202k01878J0885
$$ -49184 -13024 115142 111620 101547 88298 127091 266794 312581 266379 64501 75386
9629G5386M7802l4768Q2287J6427j42266n6316K0534P0640Q230J13309M0874O4967
$$ 75386 123188 88420 170707 187134 44868 -11448 9086 79726 87956 201265 242139 307106
9617C07106M3846l9927j24661n2308J69935J36494J4893K112l2315l9608l3723
$$ 307106 350952 311025 186364 134056 303991 440485 455378 457490 425175 385567 351844
9606C51844r415n3021m0621Q3301J21393N4601n475j44292j92103K4699N1857
$$ 351844 342429 289408 248787 332088 453481 508082 502607 358315 166212 190911 242768
9595B42768j20920K0276Q3450l7485k5496l8266L5998O3334j7881q2127L3628
$$ 242768 121848 142124 225574 188089 162593 124327 160325 223659 205778 123651 157279
9584A57279L5498K3104l8933N8225N0749N4449K5192l0430m0027j17777l7759
$$ 157279 192777 215881 176948 235173 285922 340371 365563 335133 295106 177329 139570
9573A39570m0476r0010k5924O1786P3108o953o1550J13917J28487J1116j21942
$$ 139570 99094 9084 -16840 44946 118054 111101 49551 163468 291955 303071 181129
9562A81129o5140k1527R6565r5158K1691j4517n6926j22495m158J80403J15314
$$ 181129 115989 94462 191027 95869 117560 103043 46117 -76378 -80536 99867 215181
9551B15181p4516j3309k0151m9402m1688N7947J7738j9848j37960n1402n7775
$$ 215181 140665 127356 107205 57803 16115 74062 91800 71952 -66008 -117410 -175185
9540a75185J62144Q9074L0569J26331N6745j15324p9021k4863j4331R3914K4267
$$ -175185 -13041 76033 106602 232933 289678 174354 95333 70470 56139 150053 174320
9529A74320l3022n4485K679J35512J25670J2309p7146J1093o2475M4202N3573
$$ 174320 141298 86813 89492 225004 350674 362983 285837 296930 234455 278657 332230
9518C32230p9033L0231k4977j41461J674N4955J09977N1182J154L5145M5128n4012
$$ 332230 253197 283428 258451 116990 118664 173619 283596 334778 335932 371077 416205 362193
9506C62193K3346p7102j03427J1954L4176o4973J144j3217j21549l3220J46765
$$ 362193 385539 308437 205010 216964 251140 186167 187311 174094 52545 19325 166090
9495A66090N2187K2151p0179R0313l7502j48093o8326L7353J487m3196Q1515O2630
$$ 166090 218277 240428 170249 260562 223060 74967 6641 43994 45481 2285 83800 146430
9483A46430j275J053K4036N489k8235L849J29565Q0335n8103j46055Q4989J80079
$$ 146430 145155 146208 170244 175733 147498 151347 280912 361247 303144 157089 242078 422157
9471D22157j0584o8569K5315R8355M6821n559J82160j8605j44130O8920J17314
$$ 422157 411573 343004 368319 466674 513495 507936 690096 671491 527361 596281 713595
9460G13595N3737m6682p2094p5323j47377q4585m9229L497m8631O419j02711p3877
$$ 713595 767332 720650 648556 573233 425856 341271 292042 295539 246908 253327 150616 76739
9448G6739l649M0656K9897K15224J31732J13367M7296M145k4504q5443j9877J0277
$$ 76739 73090 113746 143643 358867 490599 603966 651262 655407 630903 545460 525583 535860
9436E35860j1591k0553n9855j8357j00392J68430J50649k4486o7309L4272J5194
$$ 535860 524269 503716 443861 425504 325112 493542 644191 619705 552396 586668 601862
9425F01862l3202j58880r8662M4900N3857L1649j3031L5718J1977l3219o499p4234
$$ 601862 568660 409780 311118 356018 409875 441524 428493 464211 476188 442969 436470 362236
9413C62236n5331Q1226O2105j14748R0627m8928p2722N2815J10410M315j40079
$$ 362236 306905 388131 450236 335488 426115 377187 304465 357280 467690 472005 331926
9402C31926P4625J15658l3760r3627O085J13611J04203N9226J0126j25985l0118
$$ 331926 406551 522209 488449 394822 400907 514518 618721 677947 688073 562088 531970
9391E31970J88007J1524n1672M0513L7851O7591p8803j12867j1568j31225l2730
$$ 531970 719977 731501 679829 720342 758193 825784 746981 634114 622546 491321 458591
9380D58591l2338M0306M7385k7086P881M0238J81422Q0659Q8280m0874q3325Q815
$$ 458591 426253 466559 513944 486858 494739 534977 716399 797058 885338 844464 761139 769954
9368G69954m821l9656q0728J24361R9823N1369L8934j026j41981r2672J44469
$$ 769954 765133 725477 644749 769110 868933 920302 959236 958210 816229 723557 868026
9357H68026j3512M9497J23580j40874q7521m6053J021r242m5398Q3501P2080J09293
$$ 868026 854514 904011 1027591 886717 799196 753143 754164 744922 699524 783025 855105 964398
9345I64398L0739J4241l4154o326N2241O1138j0086l8831j45801k3772J03612
$$ 964398 995137 1009378 975224 968898 1021139 1082277 1072191 1033360 887559 863787 967399
9334I67399Q3163O3154R5507j11251l3151J46198j24839N1520K2864L1186M798
$$ 967399 1050562 1113716 1209223 1097972 1064821 1211019 1086180 1137700 1160564 1191750 1196548
9323A196548j0525L457R0630M670l883j6869m6517M4516K9345K3453K4660N4710
$$ 1196548 1186023 1189480 1280110 1284780 1280897 1264028 1217511 1262027 1291372 1314825 1339485 1394195
9311A394195n0762n2907J24395j932J9231N7249j79170j7593O5868L4784l275
$$ 1394195 1343433 1290526 1414921 1412989 1432220 1489469 1310299 1292706 1358574 1393358 1390083
9300A390083Q6449Q4459r18n3663r7944p327R7285O8095J5141K8213k2554P1780
$$ 1390083 1476532 1560991 1560073 1506410 1408466 1401139 1498424 1566519 1581660 1609873 1587319 1659099
9288A659099n841M0349K8715j3688j0902R715R0599n4594o4429j2040M6427L8316
$$ 1659099 1653258 1693607 1722322 1708634 1697732 1707447 1798046 1743452 1679023 1666983 1713410 1751726
9276A751726P6696J24452R8165N3263o8640m0056J00677J56581J2799p6405J4786
$$ 1751726 1828422 1952874 2051039 2104302 2035662 1995606 2096283 2252864 2265663 2189258 2204044
9265B204044J26760N0185j3235q2886m1854J56867J51145K8179J18946P8502n8010
$$ 2204044 2330804 2380989 2367754 2284868 2243014 2399881 2551026 2579205 2698151 2776653 2718643
9254B718643j4207j8289J47656J11665o379p8190j8835J21859J17449L2006O872
$$ 2718643 2704436 2686147 2833803 2945468 2939089 2860899 2842064 2963923 3081372 3113378 3120250
9243C120250n785J06125K03222l1543p5721R8838J39206J54161M6127M1609k826
$$ 3120250 3114465 3220590 3423812 3392269 3316548 3415386 3554592 3708753 3754880 3796489 3793663
9232C793663L7098K2520L5736k5663P6758J14193J91194n742M2270J06047K7026
$$ 3793663 3830761 3853281 3889017 3863354 3940112 4054305 4245499 4239757 4282027 4388074 4415100
9221D415100O791O77p579J24936K80531N8012p7041L8779J43814J33515O7674
$$ 4415100 4421891 4422568 4414989 4539925 4820456 4878468 4801427 4840206 4984020 5117535 5185209
9210E185209J02185P927J3139J73331J49532J86798O6303Q0749J19385K67070
$$ 5185209 5287394 5295321 5308460 5481791 5631323 5818121 5884424 5965173 6084558 6351628
9200F351628J39757J48810J17895Q5071K18197K32456J0339J83560K87726J61781
$$ 6351628 6491385 6640195 6758090 6843161 7061358 7293814 7304153 7487713 7775439 7937220
9190G937220K19923K09296J83221J74423K78561K99565K49550K58225K94758L63360
$$ 7937220 8157143 8366439 8549660 8724083 9002644 9302209 9551759 9809984 10104742 10468102
9180A0468102L68825K15125L12705J47996J52007L27779M81339L19246L16016
$$ 10468102 10836927 11052052 11364757 11512753 11664760 11992539 12473878 12793124 13109140
9171A3109140M27675K82634L20899M39343M79005M93566N58663N14018L71377
$$ 13109140 13536815 13819449 14140348 14579691 15058696 15552262 16110925 16624943 16996320
9162A6996320N40383N65679N85463O90686Q06622P81737O35898O86446R34732
$$ 16996320 17536703 18102382 18687845 19378531 20185153 20966890 21602788 22289234 23223966
9153B3223966Q40611R21594R91332J020113J198891J193324J149133J212758J277503
$$ 23223966 24064577 24986171 25977503 26997616 28196507 29389831 30538964 31751722 33029225
9144C3029225J360703J581875J701336J680721J834860K056176K050436K009797
$$ 33029225 34389928 35971803 37673139 39353860 41188720 43244896 45295332 47305129
9136D7305129K297806K474836K555612K731300L012482L180495L283022L423085
$$ 47305129 49602935 52077771 54633383 57364683 60377165 63557660 66840682 70263767
9128G0263767L642120L781088M088202M447955M672482M889071N019435N290201
$$ 70263767 73905887 77686975 81775177 86223132 90895614 95784685 100804120 106094321
9120A06094321N482813N427641N441878N641082N531756N404131N219038M864835
$$ 106094321 111577134 117004775 122446653 128087735 133619491 139023622 144242660 149107495
9112A49107495M452347M119380L503281K790454J922089J193454M95953m35666
$$ 149107495 153559842 157679222 161182503 163972957 165895046 167088500 167584453 167148787
9104A67148787j175659k133311k987215l628279m072629m339258m861058n166201
$$ 167148787 165973128 163839817 160852602 157224323 153151694 148812436 143951378 138785177
9096A38785177n252024n330728n410316n443067n315836n201770n093461m899039
$$ 138785177 133533153 128202425 122792109 117349042 112033206 106831436 101737975 96838936
9088I6838936m684897m468986m254337l979622l793585l632022l414324l160445
$$ 96838936 92154039 87685053 83430716 79451094 75657509 72025487 68611163 65450718
9080F5450718l030400k949126k708920k520938k418280k393793k261811j961401
$$ 65450718 62420318 59471192 56762272 54241334 51823054 49429261 47167450 45206049
9072D5206049j831115j830842j737250j591195j396251j290940j279826j248702
$$ 45206049 43374934 41544092 39806842 38215647 36819396 35528456 34248630 32999928
9064C2999928j314374j172502j165396j169147j015224r10943q72337q46184q76233
$$ 32999928 31685554 30513052 29347656 28178509 27163285 26252342 25380005 24533821 23657588
9055B3657588p57940o31104o75655o12323n65579p35780q35673n93124l98387
$$ 23657588 22899648 22268544 21592889 20980566 20414987 19679207 18843534 18250410 17852023
9046A7852023l96150m50957m11963m63552l92631l71135m86127l66537l01797
$$ 17852023 17455873 17004916 16592953 16129401 15736770 15365635 14879508 14512971 14211174
9037A4211174l04446l80814l94336m04223k82265k70374k87742k48335j91005
$$ 14211174 13906728 13525914 13131578 12727355 12445090 12174716 11886974 11638639 11447634
9028A1447634l70428k99048j77543k08132k55472k67225k67952k98605j33683
$$ 11447634 11077206 10778158 10600615 10392483 10137011 9869786 9601834 9303229 9169546
9019I169546j7397l3525j05751k18117k34242j78545j66489j33169j91794k42501
$$ 9169546 9152149 9118624 9012873 8794756 8560514 8381969 8215480 8082311 7890517 7648016
9009G648016O367J5742o1396j00382o1533q5819l16359k43719p9928j32668q3246
$$ 7648016 7654383 7670125 7608729 7508347 7446814 7360995 7044636 6800917 6720989 6588321 6505075
8998F505075j77178j24111j94561p3648j02675j30996l0333n2194j00740K979
$$ 6505075 6327897 6203786 6009225 5935577 5832902 5701906 5671573 5619379 5518639 5521618
8988E521618j25601n9214j226p1640j1503j07823j37755L027o4777k50965j05572
$$ 5521618 5396017 5336803 5335577 5263937 5252434 5144611 5006856 5009883 4945106 4694141 4588569
8977D588569p7967o1948n5551j03355j6535m163m2096o0733q7249j9390l3096
$$ 4588569 4510602 4448654 4393103 4289748 4273213 4269050 4226954 4166221 4078972 4059582 4026486
8966D026486l3149l0666j18539r1718j19165n4217j4626q6622n4030J3035m99
$$ 4026486 3993337 3962671 3844132 3752414 3633249 3579032 3564406 3477784 3423754 3436789 3436290
8955C436290p0202l7478r8831n2935M4217n5775j9724O3662l7057k1919k09491
$$ 3436290 3366088 3328610 3229779 3176844 3221061 3165286 3145562 3209224 3172167 3150248 2940757
8944B940757k5898o9462L0752K1498r9235r4134K3650n7877k7484r2476j47174
$$ 2940757 2914859 2845397 2876149 2897647 2798412 2704278 2727928 2670051 2642567 2550091 2402917
8933B402917L9498J07955R5087j18565r1293p3045m9466l4598M6255l6051L7922
$$ 2402917 2442415 2550370 2645457 2526892 2435599 2362554 2313088 2278490 2324745 2288694 2326616
8922B326616P5872k3956r7911N7973L4748L3328M3259L1473j15479p3617O7614
$$ 2326616 2402488 2378532 2280621 2338594 2373342 2406670 2449929 2481402 2365923 2292306 2359920
8911B359920m4760k24540j84742p1021P2366J3662k7540Q891J7180j9662l9374
$$ 2359920 2315160 2090620 1905878 1834857 1907223 1920885 1893345 1902236 1919416 1899754 1860380
8900A860380l7122n0914n8168Q280m8225J26800j7009l4789J7874N7127J38027
$$ 1860380 1823258 1772344 1714176 1722456 1674231 1801031 1784022 1749233 1767107 1824234 1962261
8889A962261M3722q1048j55034l8328r2920q4553Q611J18069J29270j3777l1366
$$ 1962261 2005983 1924935 1769901 1731573 1638653 1554100 1562711 1680780 1810050 1796273 1764907
8878A764907q1794l3968j3145L9571N5173m9178k3381q606o3849j1844J48507
$$ 1764907 1683113 1649145 1636000 1675571 1730744 1681566 1658185 1649579 1585730 1573886 1722393
8867A722393k7506m0793j11556m1900J00813L2812l2008J7381J6400j8408q7997
$$ 1722393 1694887 1654094 1542538 1500638 1601451 1634263 1602255 1619636 1636036 1617628 1529631
8856A529631p7847m5415L350M0539o638K6739R7086J17833l4433k0368k6672j01251
$$ 1529631 1451784 1406369 1409719 1450258 1443620 1470359 1567445 1685278 1650845 1630477 1603805 1502554
8844A502554j9175L6373j8048n6840L4397k1851j11536p1482J4689O4657l7919
$$ 1502554 1483379 1519752 1501704 1444864 1479261 1457410 1345874 1274392 1289081 1353738 1315819
8833A315819J2008r8116p2294j15011J15505j6393N4082K6412o4083o564j46113
$$ 1315819 1327827 1229711 1157417 1042406 1157911 1141518 1195600 1222012 1157929 1151365 1005252
8822A005252q8771m283n33J16672J86866P617j89795j45247O752P850M4564O8792
$$ 1005252 916481 912198 911665 1028337 1215203 1222820 1033025 887778 894530 902380 946944 1015736
8810A015736k9638K8119O1046J08130J0081m4895o5349q8755J7779K2030k7039
$$ 1015736 986098 1014217 1075263 1183393 1193474 1148579 1083230 994475 1012254 1034284 1007245
8799A007245n4765J3101N1395l788k6696r1279k8467M5376j3379n379m1373l008
$$ 1007245 952480 965581 1016976 1013188 986492 895213 866746 912122 898743 893364 851991 848983
8787H48983J11426r787k5715j19558Q5346J21014J27349l8553m5547l0532j11650
$$ 848983 960409 950622 924907 805349 890695 1011709 1139058 1100505 1054958 1024426 912776
8776I12776k7234J22615J1706o9723M5052L3832j9654r7221j8996k1902l1131
$$ 912776 885542 1008157 1019863 950140 995192 1029024 1009370 912149 893153 871251 840120
8765H40120M9390j2168j19307M635P1729M7882K1475N4845K8063Q123N6560K7229
$$ 840120 889510 877342 758035 762670 834399 882281 903756 958601 986664 994787 1051347 1078576
8753A078576j07691k5440K7689Q049q4204J7455J4875N7093m6512P4650k0010
$$ 1078576 970885 945445 973134 981183 896979 914434 929309 986402 939890 1014540 994530
8742I94530p4548J42002K8682q2117J6062J9615j2283Q1926J65734j45887j00250
$$ 994530 919982 1061984 1090666 1008549 1024611 1044226 1031943 1113869 1279603 1133716 1033466
8731A033466M8182K9257J4439m960L8499O2246j13269M64L0462n1851P994n328
$$ 1033466 1081648 1110905 1125344 1120384 1158883 1221129 1107860 1108324 1138786 1086935 1094929 1089601
8719A089601p8187M7061R0241J849K8016Q7616o6414K614L7769j8452j1404J11897
$$ 1089601 1011414 1058475 1148716 1150565 1178581 1266197 1199783 1202397 1240166 1221714 1210310 1322207
8707A322207q953n5834o3029M1884l6494J7223j00156J9075K24446k9942j45382
$$ 1322207 1313254 1257420 1194391 1236275 1199781 1217004 1116848 1135923 1360369 1330427 1185045
8696A185045l2288J455j3730M1139p2900k2037J4648J02710J37544j400r3137
$$ 1185045 1152757 1154212 1140482 1181621 1108721 1086684 1101332 1204042 1341586 1340186 1247049
8685A247049o5623L1453q9545j20789J02641M1900J32812M2785j31542M1426J62336
$$ 1247049 1181426 1212879 1123334 1002545 1105186 1147086 1279898 1322683 1191141 1232567 1394903
8674A394903p130j6376j3368M8903N7938N1194O4420J0002K7527J05937J4524
$$ 1394903 1387773 1371397 1358029 1406932 1464870 1516064 1580484 1590486 1618013 1723950 1738474
8663A738474J5602r8249q2074N0316L1921m3340L976K7049J29614Q1513n1389
$$ 1738474 1754076 1655827 1573753 1624069 1655990 1612650 1616626 1643675 1773289 1854802 1803413
8652A803413n9376L4080N2974l159j41697r4687J04036M9185j8911J06971J2050
$$ 1803413 1744037 1778117 1831091 1827932 1686235 1591548 1695584 1744769 1725858 1832829 1844879
8641A844879j1245Q1751r7236m3891J01418P6119J59402J60346j78284k83943
$$ 1844879 1833634 1915385 1818149 1774258 1875676 1951795 2111197 2271543 2093259 1809316
8631A809316K5781J76662R2614N1890M3314l2759m8470L8370J57396L0089L705
$$ 1809316 1835097 2011759 2104373 2156263 2199577 2166818 2118348 2156718 2314114 2344203 2347908
8620B347908l991p72J30160K08855J02797j0318j4329M8331K08804J82026J59082
$$ 2347908 2343917 2343145 2473305 2682160 2784957 2774639 2760310 2808641 3017445 3199471 3358553
8609C358553N3956N2943J83318L38174J40016M5146J32298L21503L51871J91364
$$ 3358553 3412509 3465452 3648770 3986944 4126960 4172106 4304404 4625907 4977778 5169142
8599E169142K99119L27010M49919L72958M50302M78013L76089Q1979n9127m13898
$$ 5169142 5468261 5795271 6245190 6618148 7068450 7546463 7922552 8004531 7945404 7531506
8589G531506o45487p23307o19481m80203m47136m69343l51183j63655l95497l49122
$$ 7531506 6886019 6162712 5543231 5063028 4615892 4146549 3795366 3631711 3236214 2887092
8579B887092j88798k44956j31625j32543j23204j05742j9734j74763k78303j29251
$$ 2887092 2698294 2453338 2321713 2189170 2065966 1960224 1940490 1765727 1487424 1358173
8569A358173n0438q485n2769l8137L8199J11421n3915p4296j3412n3544q3586
$$ 1358173 1307735 1299250 1246481 1208344 1246543 1357964 1304049 1229753 1216341 1162797 1079211
8558A079211j011O0930N1999m7959r3774j20756p0304m7829J04655J31707l0008
$$ 1079211 1078200 1139130 1191129 1143170 1049396 928640 858336 810507 915162 1046869 1016861
8547A016861P0303P7430m7932q2887o2424N564M3273L1503L9597O1302r2676N1555
$$ 1016861 1087164 1164594 1116662 1033775 971351 976915 1020188 1051691 1091288 1152590 1059914 1111469
8535A111469j24727j6916R6428r5915j00894q095P8958J6479o4121J8925O0392
$$ 1111469 986742 969826 1066254 970339 869445 861350 940308 956787 892666 911591 971983
8524I71983q2736j767j26169r1230K4623O5917J5095K0700m4632o4593k5847O7959
$$ 971983 889247 887480 761311 670081 694704 760621 775716 796416 751784 687191 661344 729303
8512G29303n0229r7662p7688r4598r961Q1084K8947J2851R1814K5458m3176K5066
$$ 729303 679074 581412 503724 409126 399165 480249 509196 522047 613861 639319 596143 621209
8500F21209m0762J04850N3424r5665j4569j0080j3787P2450P0154M7145o9596
$$ 621209 580447 685297 738721 643056 628487 618407 604620 677070 747224 794369 724773
8489G24773q6438m738J5154p1461q894j12062K4305P8515L1066n544r6389m3598
$$ 724773 638335 633597 648751 577290 568396 456334 480639 559154 590220 584676 488287 444689
8477D44689m1252k5749K9830Q2785L1697K1083l8951p6723O065l4328N9479J0773
$$ 444689 403437 377688 407518 490303 522000 543083 504132 427409 433474 399146 458625 469398
8465D69398P3305o94o9892o5428K4162L1432k5872l3258m2278r2529L6290N2938
$$ 469398 542703 542009 472117 406689 430851 462283 436411 403153 360875 268346 304636 357574
8453C57574O3711j2304o2583R308Q1527L1449r3762l6364k6822J18199j04597
$$ 357574 421285 408981 346398 355706 437233 468682 374920 338556 311734 429933 325336
8442C25336l7199J36771L9339N5720O4287l6880q0306O490n4936r1682n972P5320
$$ 325336 288137 424908 464247 519967 584254 547374 467068 473558 418622 326940 320968 396288
8430C96288l5901m0937L680O0552j6157p8253L1330k2943J062J44391O6545o4566
$$ 396288 360387 319450 323130 383682 367525 289272 320602 297659 298721 443112 509657 445091
8418D45091N8599m5766n1737L8109n2080l7708o8338m1356K6200O751O2587J041
$$ 445091 503690 457924 406187 444296 392216 354508 286170 244814 271014 277765 340352 341393
8406C41393k7031K121R202k8181O7786l9732l6971l0048l0397j2603P355k9808
$$ 341393 314362 316483 325685 297504 365290 325558 288587 258539 228142 215539 222894 193086
8394A93086J38725K2202J3233m6492k7143n004l4277O9440J2844o8264M6253J3259
$$ 193086 331811 354013 367246 320754 293611 288607 254330 323770 336614 268350 314603 327862
8382C27862R4483k3367J417Q6759j46265j97539J58135J85761N2811Q0617r574
$$ 327862 422345 398978 400395 487154 340889 143350 301485 487246 540057 620674 611100
8371F11100o7739q8272r8106M9444J1215r5863L0122O5720k8090J3462O6789P565
$$ 611100 543361 455089 356983 406427 417642 321779 351901 417621 389531 402993 469782 477347
8359D77347r0060P7592k7007p9877j5057J794j64698m6968O0889J20643Q0230
$$ 477347 387287 464879 437872 357995 342938 344732 180034 133066 193955 314598 394828
8348C94828o7689O3989J3983q0540L638R3814J03301O4633m9342M2307l1347Q331
$$ 394828 327139 391128 405111 324571 328209 422023 525324 589957 540615 582922 551575 559906
8336E59906m6517j16629O4908m0514j25728j0134j3282o1134o080O2512R5790
$$ 559906 513389 396760 461668 421154 295426 285292 272010 210876 204796 267308 363098
8325C63098N3928p4502r931n679n4519K4289p4128L1098Q8591r8570n9728O4794
$$ 363098 417026 342524 332593 326914 272395 296684 222556 253654 342245 243675 183947 248741
8313B48741P458O5205j16714J8268J44869N4573r8964j6571J9633m8357L6752
$$ 248741 256199 321404 204690 222958 367827 422400 323436 306865 326498 278141 314893
8302C14893K466L4922M2441j707K0566q2420n9843M583j16592j31268J10247R3999
$$ 314893 317359 352281 394722 393015 413581 331161 271318 275901 159309 28041 138288 232287
8290B32287J8708m9489m5136J2048J20804J7831L5522L2122j59378K6700p0551
$$ 232287 250995 201506 156370 168418 289222 307053 342575 374697 215319 242019 171468
8279A71468J6672n2166K583n4062R157J42391J78740L200m9090m6784L6566r6025
$$ 171468 188140 135974 138557 84495 93652 236043 414783 417983 368893 322109 358675 262650
8267B62650l1178k8538r6988p3885P7368k2045L7893J08165R8559N6633n1129
$$ 262650 231472 202934 105946 32061 109429 87384 125277 233442 332001 388634 337505
8256C37505q3637j6740J5406O9010O4752K6675o1129k2794N1467K7862k6210o5851
$$ 337505 253868 237128 252534 321544 386296 412971 351842 329048 380515 408377 382167 316316
8244C16316j58012j53582K8063m2297J7955N7848Q5251K8376Q230J23020l204
$$ 316316 158304 4722 32785 -9512 8443 66291 151542 179918 188148 311168 307964
8233C07964r3690n8475n2296j2379l7774K8845J57967M2892j7843p904l1796P939
$$ 307964 214274 155799 103503 91124 53350 82195 240162 283054 265211 257307 225511 233450
8221B33450K0114j4215Q0269j101Q6684k8604r2119N8053R2179J46479K7049j19093
$$ 233450 253564 239349 319618 318517 405201 376597 284478 342531 434710 581189 608238 489145
8209D89145j26775n4953L5665m5415r0020Q6049J83217k6704K5385j44493O377
$$ 489145 362370 307417 343082 297667 207647 293696 476913 450209 475594 331101 337478
8198C37478J09274m2001j90791o6929l0088N5404P5613M9711o6799n245Q4025
$$ 337478 446752 404751 213960 147031 116943 172347 247960 297671 230872 225627 309652
8187C09652L7715M5693j11006k0640j49781n2698l221L2850J73117o762M391n5590
$$ 309652 347367 393060 282054 261414 111633 58935 55714 88564 261681 254919 259310 203720
8175B03720O9313J4393o576j0887K5081l5623j5625Q1485K7125l5428k5545J2836
$$ 203720 273033 287426 280850 269963 295044 259421 243796 325281 352406 316978 291433 304269
8163C04269q8761n3510J49495J12832n41j4067k6144j27737m1621Q15N6202m0221
$$ 304269 215508 161998 311493 424325 423784 409717 383573 255836 214215 215030 271232 231011
8151B31011l6413Q062R6162J6000j10111j3014L3516j360M2764O4793L6250L5711
$$ 231011 194598 202660 298822 314822 204711 191697 225213 223853 266617 331410 367660 403371
8139D03371j27429j98768q773O5186O4732K9732k9177j0899P6666p1108l6821
$$ 403371 275942 77174 68401 133587 198319 228051 198874 187975 264641 193533 156712
8128A56712k8089j8650m0059k5883j35006J5938J25967j5706J4375J22858k6173
$$ 156712 128623 109973 69914 44031 -90975 -75037 50930 35224 49599 172457 146284
8117A46284M6592O0504k3699J6601P3253J32449J44903o34j61575j30433N4093
$$ 146284 192876 253380 229681 246282 319535 451984 596887 596253 434678 304245 358338
8106C58338q4822j18897N2232O8917M6457O8831r8035P4862K5120L3100p7555
$$ 358338 273516 154619 206851 275768 322225 391056 293021 367883 393003 426103 348548
8095C48548j35561m9821k2728r69K4712j24666L522K7260Q845Q350m4759k5181
$$ 348548 212987 163166 140438 139469 164181 39515 43037 70297 79142 87492 42733 17552
8083A7552R446Q0115k7960Q7478L5135L7031N2466J28235m9519M3014o04n7232
$$ 17552 26998 107113 79153 166631 201766 238797 291263 419498 369979 412993 412389 355157
8071C55157M5080J9297p5463N729N2084j6209m8815k1539K3157J23829N4143J6674
$$ 355157 400237 419534 344071 349800 401884 385675 336860 315321 338478 462307 516450 533124
8059E33124j53234j64072N7311N5666N2914J877p4055j24867M1821R1169J14027
$$ 533124 379890 215818 273129 328795 381709 383586 309531 184664 226485 317654 431681
8048D31681R2913j39116j32952M1578J86157J10480l5482j5631J6188k9275P175
$$ 431681 524594 385478 252526 294104 480261 590741 555259 539628 555816 526541 533716
8037E33716M2939r8488m0133R4804j0083k4572j6126m1794j5751j8987M5038O7633
$$ 533716 576655 478167 438034 532838 522755 498183 482057 440263 424512 405525 450563 518196
8025E18196M8380p9262k965P7776o4755L2245J46564L4219o4898l6764N6723O0790
$$ 518196 566576 487314 484349 562125 497370 529615 676179 710398 645500 608736 665459 726249
8013G26249L9929m9747O8526p275J8887o141N6712K2571J59040R9861K179m8432
$$ 726249 766178 716431 784957 777682 796569 790428 847140 869711 1028751 1128612 1130791 1082359
8001A082359J25785J31631m1278R3203L3664n8172j49532r5046m8005n4689r4285
$$ 1082359 1208144 1339775 1298497 1391700 1425364 1367192 1217660 1122614 1074609 1019920 925635
7990I25635j5652m7906p2465k05126m0294M9668M8863R1509P6589n6693L9195
$$ 925635 909983 862077 789612 584486 544192 593860 642723 734232 810821 754128 793323
7979G93323j36141m5309P4095l1535L6569j1533n6553J74787J19560R724J80275
$$ 793323 657182 611873 685968 654433 691002 679469 622916 797703 917263 926987 1107262
7968A107262M713m4945l5769R5283K377J42283M5855n8529j14085j0099j6275
$$ 1107262 1111975 1067030 1031261 1126544 1128921 1271204 1317059 1258530 1144445 1134346 1118071
7957A118071o489J45152K3165j5704n8064K9701m106k05132r633K133j46363m2566
$$ 1118071 1111582 1256734 1279899 1264195 1206131 1235832 1231726 1026594 1016961 1019094 872731 830165
7945H30165k5640m8039K1331l2938j59106L7567P0113O9573J09682J1851J1952
$$ 830165 804525 756486 777817 744879 585773 623340 693453 763026 872708 884559 896511
7934H96511j30214N2733J64847R0198N4834n6540j90799j01151O5911J00192k4418
$$ 896511 766297 819030 983877 1074075 1128909 1072369 881570 780419 846330 946522 922104
7923I22104N0817L1646Q282L6511J4655Q3223p7128j74432m4421J4734L4128l0619
$$ 922104 972921 1004567 1012849 1049360 1064015 1147238 1070110 895678 851257 865991 900119 869500
7911H69500j03682P1034O9943q5104K960K2252j97600l1958r573P9312L0991R7738
$$ 869500 765818 836852 906795 821691 824651 846903 649303 617345 607772 687084 718075 815813
7899H15813K15350n573j66146j05724r8595j11191J2173M2604Q4515p9111m7537
$$ 815813 1031163 1025590 859444 753720 655125 543934 556107 598711 683226 604115 556578
7888E56578o0514j40761j23923l1779K615k3947J66931J61000K2951j5721R177
$$ 556578 496064 355303 231380 199601 202216 178269 345200 506200 529151 513430 522607
7877E22607P2673m471m3139N6262L6186j178o1036n281l4772O9433r8013j56805
$$ 522607 595280 590809 547670 603932 640118 638940 577904 572623 537851 607284 509271 352466
7865C52466O8571N1770j31557o1931K883L0482O1711J1511j10273O5196k3869
$$ 352466 421037 472807 341250 279319 282202 312684 374395 385906 275633 340829 316960
7854C16960m5453o7268m9575J7456j1311N841j2765l2044K5161j9628m0495K83864
$$ 316960 271507 204239 154664 172120 160809 166650 153885 121841 147002 127374 86879 370743
7842C70743J27137p2558j03025j10599r7449n2000J48038P340R407J31774m6804
$$ 370743 497880 425322 322297 211698 114249 62249 210287 217627 227034 358808 312004
7831C12004j06273m5245n3556M7549l338N8817j50143q1269O3353K2649O9494
$$ 312004 205731 160486 106930 154479 151141 209958 59815 -21454 41899 64548 134042
7820A34042J19652L2366q4746r6441j25746j35796N5221N8439P8434k2293J04091
$$ 134042 253694 286060 201314 104873 -20873 -156669 -101448 -43009 35425 13132 117223
7809A17223J9853j22865n4493L5091J16894m1974o5012R5438K1468q6442k4873
$$ 117223 137076 14211 -40282 -5191 111703 69729 4717 100155 121623 35181 10308
7798A0308m2249L7078M0245K276K7564J683n1094p8517l8613J18492J8255j9742
$$ 10308 -31941 5137 45382 47658 75222 76905 25811 -52706 -91319 27173 45428 25686
7786B5686L2907k16700j66512N6404J18190J15457K1474m960m4176N5523N6575
$$ 25686 58593 -158107 -324619 -268215 -150025 -34568 -13094 -18054 -62230 -6707 49868
7775D9868j4329L2350N3093O8249j48937J7258J08900P5999j21009n7965K4306
$$ 49868 35539 67889 120982 189231 40294 57552 166452 242451 121442 63477 87783
7764H7783q0928j6442q7475p4819J20037P6961p714J5593q854j91448o7727J15240
$$ 87783 6855 -9587 -97062 -171881 -51844 25117 17403 32996 24142 -167306 -235033 -119793
7752a19793Q2078M4113j6347J940j7772J05582q539J56686O9083j47700j25332
$$ -119793 -37715 6398 -9949 -8009 -25781 79801 71262 227948 297031 149331 23999
7741B3999l8371L1368k0124j04912k6816m1776J4323m0089Q6755J64941m1249
$$ 23999 -14372 16996 -3128 -108040 -134856 -176632 -162309 -202398 -115643 49298 8049
7730H049l6159k3852P4862J0130p3330K0056J14582K4389j20807l1606O039n3704
$$ 8049 -28110 -51962 22900 33030 -40300 -20244 94338 118727 -2080 -33686 -27647 -81351
7718h1351J16082N2499r0397j33074o3309K0235J18668k1819o1994k7566j1486
$$ -81351 34731 87230 -3167 -136241 -199550 -179315 -60647 -82466 -144460 -172026 -183512
7707a83512J2418J41428Q7302Q8777j96973m5935P6159L4202m1308J7492K6055
$$ -183512 -171094 -29666 57636 146413 -50560 -96495 -20336 13866 -27442 -9950 16105
7696A6105p2575J906Q094q6492J3431N9394q96R8771L0050P4436j9854n8932q6129
$$ 16105 -56470 -54564 -46470 -132962 -119531 -60137 -61033 37738 67788 142224 122370 63438 -22691
7683b2691o8351L342N6386M6660O2513J9143j6635L7531J16808j4416K584j11348
$$ -22691 -91042 -87700 -31314 15346 77859 97002 80367 117898 234706 220290 222874 111526
7671A11526j70605M6836P9837J06451Q944o3789R879k879j72627m547M2399m3450
$$ 111526 -59079 -12243 67594 174045 182989 119200 129079 126200 -46427 -50974 -8575 -52025
7659e2025j02502r636J15859Q5068J06294l975j12422m0043O560P1072l92N7934
$$ -52025 -154527 -164163 -48304 36764 143058 139083 26661 -13382 -6822 64250 63858 121792
$$ [...]
##END NTUPLES=NMR SPECTRUM
##END=
