##TITLE=Analysis number 329505
Compound Code cc 66324
Book Reference 464/180/2
Project Code adrs
Chemist Name chrisr
##JCAMPDX= 6.0         $$ Bruker NMR JCAMP-DX V2.0
##DATA TYPE= NMR SPECTRUM
##DATA CLASS= NTUPLES
##ORIGIN= Bruker BioSpin GmbH
##OWNER= nmr
$$ XWIN-NMR		Version 3.5
$$ Fri Sep  7 13:18:19 2007 GMT Daylight Time (UT+1h)  MAYBRIDGE\nmr@NMR_250MHZ
##.OBSERVE FREQUENCY= 250.131544655141
##.OBSERVE NUCLEUS= ^1H
##.ACQUISITION MODE= SIMULTANEOUS (DQD)
##.ACQUISITION SCHEME= undefined
##.AVERAGES= 16
##.DIGITISER RES= 18
##SPECTROMETER/DATA SYSTEM= dpx250
##.PULSE SEQUENCE= zg30
##.SOLVENT NAME= CDCl3
##.SHIFT REFERENCE= (INTERNAL, CDCl3, 0, 16.4455)
##AUDIT TRAIL= $$ (NUMBER, WHEN, WHO, WHERE, WHAT)
$$ ##TITLE= Audit trail, XWIN-NMR		Version 3.5
$$ ##JCAMPDX= 5.01
$$ ##ORIGIN= Bruker BioSpin GmbH
$$ ##OWNER= nmr
$$ C:\u/data/dgb/nmr/ADRS/380/pdata/1/auditp.txt
$$ ##AUDIT TRAIL=  $$ (NUMBER, WHEN, WHO, WHERE, WHAT)
(   1,<2007-09-07 13:17:59.36 +100>,<MAYBRIDGE\nmr>,<NMR_250MHZ>,
      <created by zg, POWCHK disabled, PULCHK disabled
       configuration hash MD5:
       76 6E 9A 78 1E 09 19 81 EC 84 63 8F B0 6A 59 2D
       data hash MD5: 64K
       AD 17 60 6C E5 9D E3 CD 9A A8 3A 04 17 F4 CE EF>)
(   2,<2007-09-07 13:18:10.73 +100>,<MAYBRIDGE\nmr>,<NMR_250MHZ>,
      <Start of raw data processing
       ef LB = 0.3 FT_mod = 6 PKNL = 1 SI = 32K 
       data hash MD5: 32K
       D8 40 A3 DB 8C 4A 9B 7B 6C 38 3C 8E D0 C0 65 CD>)
(   3,<2007-09-07 13:18:12.31 +100>,<MAYBRIDGE\nmr>,<NMR_250MHZ>,
      <apk 
       data hash MD5: 32K
       D3 51 17 4F F4 E9 71 65 90 B8 C1 9F 0B 38 01 69>)
(   4,<2007-09-07 13:18:13.03 +100>,<MAYBRIDGE\nmr>,<NMR_250MHZ>,
      <abs ABSG = 5 
       data hash MD5: 32K
       0D 24 A8 3A 76 29 AB 0F A0 C5 0E A8 17 B4 25 D7>)
$$ ##END=
$$ 
$$ hash MD5
$$ DC 11 3E 1B BE C7 AE 26 98 A5 EA 66 79 D6 FC 51
##$RELAX= 
##$RELAX= 
##$RELAX= 
##$RELAX= 
##$RELAX= 
##$RELAX= 
##$RELAX= 
$$ Bruker specific parameters
$$ --------------------------
##$DU= <C:\u>
##$EXPNO= 380
##$NAME= <ADRS>
##$PROCNO= 1
##$TYPE= <nmr>
##$USER= <dgb>
##$AMP= (0..31)
100 100 100 100 100 100 100 100 100 100 100 100 100 100 100 100 100 100 
100 100 100 100 100 100 100 100 100 100 100 100 100 100 
##$AQSEQ= 0
##$AQ_mod= 3
##$AUNM= <au_zg>
##$AUTOPOS= <2 >
##$BF1= 250.13
##$BF2= 250.13
##$BF3= 250.13
##$BF4= 250.13
##$BF5= 500.13
##$BF6= 500.13
##$BF7= 500.13
##$BF8= 500.13
##$BYTORDA= 1
##$CFDGTYP= 0
##$CFRGTYP= 5
##$CHEMSTR= <none>
##$CNST= (0..31)
1 1 145 1 1 1 1 1 1 1 1 1 1 1 1 1 1 1 1 1 1 1 1 1 1 1 1 1 1 1 1 1 
##$CPDPRG= <>
##$CPDPRG1= <>
##$CPDPRG2= <>
##$CPDPRG3= <>
##$CPDPRG4= <mlev>
##$CPDPRG5= <mlev>
##$CPDPRG6= <mlev>
##$CPDPRG7= <mlev>
##$CPDPRG8= <mlev>
##$CPDPRGB= <>
##$CPDPRGT= <>
##$D= (0..31)
0 1 0 0 0 0 0 0 0 0.06 0 0 0 0 0 0 0.0002 0 0 0 0 0 0 0 0 0 0 0 0 0 0 
0 
##$DATE= 1189167478
##$DBL= (0..7)
120 120 120 120 120 120 120 120 
##$DBP= (0..7)
150 150 150 150 150 150 150 150 
##$DBP07= 0
##$DBPNAM0= <>
##$DBPNAM1= <>
$$ [...]
##$SUBNAM7= <"">
##$SUBNAM8= <"">
##$SUBNAM9= <"">
##$SW= 20.6930455092707
##$SWIBOX= (0..15)
0 0 3 0 0 0 0 0 0 0 0 0 0 0 0 0 
##$SW_h= 5175.983436853
##$TD= 65536
##$TD0= 1
##$TE= 298.16
##$TE2= 300
##$TE3= 300
##$TEG= 300
##$TL= (0..7)
0 120 120 120 120 120 120 120 
##$TP= (0..7)
150 150 150 150 150 150 150 150 
##$TP07= 0
##$TPNAME0= <>
##$TPNAME1= <>
##$TPNAME2= <>
##$TPNAME3= <>
##$TPNAME4= <>
##$TPNAME5= <>
##$TPNAME6= <>
##$TPNAME7= <>
##$TPOAL= (0..7)
0.5 0.5 0.5 0.5 0.5 0.5 0.5 0.5 
##$TPOFFS= (0..7)
0 0 0 0 0 0 0 0 
##$TUNHIN= 0
##$TUNHOUT= 0
##$TUNXOUT= 0
##$USERA1= <user>
##$USERA2= <user>
##$USERA3= <user>
##$USERA4= <user>
##$USERA5= <user>
##$V9= 5
##$VALIST= <valist>
##$VCLIST= <CCCCCCCCCCCCCCC>
##$VD= 0
##$VDLIST= <DDDDDDDDDDDDDDD>
##$VPLIST= <PPPPPPPPPPPPPPP>
##$VTLIST= <TTTTTTTTTTTTTTT>
##$WBST= 1024
##$WBSW= 4
##$XGAIN= (0..3)
0 0 0 0 
##$XL= 0
##$YL= 0
##$YMAX_a= 315075
##$YMIN_a= -245142
##$ZGOPTNS= <>
##$ZL1= 120
##$ZL2= 120
##$ZL3= 120
##$ZL4= 120
##$ABSF1= 16.44546
##$ABSF2= -4.247713
##$ABSG= 5
##$ABSL= 3
##$ALPHA= 0
##$AQORDER= 0
##$ASSFAC= 0
##$ASSFACI= 0
##$ASSFACX= 0
##$ASSWID= 0
##$AUNMP= <proc_1d>
##$AZFE= 0.1
##$AZFW= 0.1
##$BCFW= 0
##$BC_mod= 0
##$BYTORDP= 0
##$COROFFS= 0
##$CY= 12.5
##$DATMOD= 1
##$DC= 0
##$DFILT= <>
##$DTYPP= 0
##$F1P= 14.0000005364418
##$F2P= -0.99999901652339
##$FCOR= 0.5
##$FTSIZE= 32768
##$FT_mod= 6
##$GAMMA= 0
##$GB= 0
##$INTBC= 1
##$INTSCL= 1
##$ISEN= 128
##$LB= 0.3
##$LEV0= 0
##$LPBIN= 0
##$MAXI= 10000
##$MC2= 0
##$MEAN= 0
##$ME_mod= 0
##$MI= 0
##$NCOEF= 0
##$NC_proc= -4
##$NLEV= 6
##$NOISF1= 0
##$NOISF2= 0
##$NSP= 0
##$NTH_PI= 0
##$NZP= 0
##$OFFSET= 16.44546
##$PC= 1
##$PHC0= -63.09877
##$PHC1= 7.570004
##$PH_mod= 1
##$PKNL= yes
##$PPARMOD= 0
##$PSCAL= 4
##$PSIGN= 0
##$REVERSE= no
##$SF= 250.130019143251
##$SI= 32768
##$SIGF1= 0
##$SIGF2= 0
##$SINO= 400
##$SIOLD= 32768
##$SREGLST= <1H.CDCl3>
##$SSB= 0
##$STSI= 32768
##$STSR= 0
##$SW_p= 5175.98343685301
##$SYMM= 0
##$S_DEV= 0
##$TDeff= 65536
##$TDoff= 0
##$TI= <Analysis number 999999
Compound Code 99
Book Reference 9
Project Code 9>
##$TILT= no
##$TM1= 0
##$TM2= 0
##$TOPLEV= 0
##$USERP1= <user>
##$USERP2= <user>
##$USERP3= <user>
##$USERP4= <user>
##$USERP5= <user>
##$WDW= 1
##$XDIM= 32768
##$YMAX_p= 399785747
##$YMIN_p= -351219
$$ End of Bruker specific parameters
$$ ---------------------------------
##NTUPLES= NMR SPECTRUM
##VAR_NAME=  FREQUENCY,     SPECTRUM/REAL,   SPECTRUM/IMAG
##SYMBOL=    X,             R,               I
##VAR_TYPE=  INDEPENDENT,   DEPENDENT,       DEPENDENT
##VAR_FORM=  AFFN,          ASDF,            ASDF
##VAR_DIM=   32768,         32768,           32768
##UNITS=     HZ,            ARBITRARY UNITS, ARBITRARY UNITS
##FACTOR=    0.157963299565203, 1,           1
##FIRST=     4113.5030659983, 0,             0
##LAST=      -1062.48037085471, 0,           0
##MIN=       -1062.48037085471, -351219,     0
##MAX=       4113.5030659983, 399785747,     0
$$ Real data points
##PAGE= N=1
##DATA TABLE= (X++(R..R)), XYDATA
$$ [...]
19486C38619j9437j6424j08770l6244k4081P9461J0579L2367p5327o5264L5864
19475A51343J4813L2942K2937O884L1876m4420K5888m3088K0609P2930O6007P1650
19463D30371r9269j24955o8326l2103j3406P4113J56430P8660n6948m4238M5482
19452C45811o5345m9711O303l8648p5006N6195K9665p6829n7810J0256N5978q5617
19440E5242l3399O7091O4584N310o9959K4413n8656o9783N6586N3432j97l1499
19428F3165l792j8692k7335O6365M179k5510q7442m3011m588P4985R7967L7287
19416A33578o6931k6056K5484P3403p519j00816j5107O9625l9064l0754K0995
19405C6838j3798o8789N000P7295Q0656M48m3690o2951l0528P4284J8230l8313
$$ plain form
19486 338619 319182 302758 193988 157744 133663 213124 223703 256070 180743 115479 151343
19475 151343 166156 199098 222035 228919 260795 216375 242263 199175 219784 292714 358721 430371
19463 430371 331102 206147 137821 105718 92312 166425 322855 401515 344567 300329 345811
19452 345811 280466 230755 237058 198410 123404 179599 209264 132435 74625 84881 140859 55242
19440 55242 21843 88934 153518 158828 88869 113282 54626 -15157 41429 94861 94664 63165
19428 63165 59373 40681 13346 79711 83890 58380 -29062 -72073 -76661 -1676 96291 133578
19416 133578 66647 40591 66075 139478 131959 31143 16036 85661 46597 15843 36838
19405 36838 23040 -45749 -40749 36546 117202 117650 73960 11009 -19519 54765 72995 34682
19393C4682L0146O1507m5801n109j6320l4932r5609N3802Q5378R288j7414o9555
19381i937q2982j11039r888J65848J11911o5663q5136L6409K2942J160n9885r5541
19369a81801j171P9662P9541O3156J4098o042k3880N2291L8659q2510j1895O7934
19357H8042j8968n6658m7853m8218l0834N1936j3394k2052l5760P7985O912L7655
19345a1207R4627L5011r2640j44501l6832Q5634J3459J1332R4983J9905j05222
19334c5451n5583Q0463L8632k2102l0985j030P8935n363l3132L774l2040p3083
19322h6965o3459L4532q962K7712K1265m7396k8064P5556L3331k6133n4854L6662
19310h6775P244M2179N5965r0727k0091J05749L1098j6124r233O5758j7682q5571
$$ plain form
19393 34682 64828 126335 80534 75425 59105 24173 -71436 -17634 67744 77032 59618 -9937
19381 -9937 -92919 -203958 -213846 -47998 63913 -1750 -86886 -50477 -27535 -26375 -86260 -181801
19369 -181801 -182972 -103310 -23769 39387 53485 47443 23563 75854 114513 32003 20108 88042
19357 88042 69074 12416 -35437 -83655 -114489 -62553 -75947 -97999 -133759 -55774 -48862 -11207
19345 -11207 83420 118431 25791 -118710 -155542 -69908 -56449 -45117 49866 69771 -35451
19334 -35451 -91034 -10571 28061 5959 -25026 -26056 52879 47516 14384 18158 -13882 -86965
19322 -86965 -150424 -115892 -124854 -97142 -75877 -123273 -151337 -75781 -42450 -68583 -123437 -86775
19310 -86775 -79531 -37352 18613 -72114 -92205 13544 44642 28518 19285 85043 67361 -18210
19298a8210M0448J10775m2391k0008m7297j0299J4429j1002o6381q1570L4404
19287i7102O30j5775L552N881j6581m5251J38056J9924o7734N8536J3024k6095
19275b8935k6294k522L2121N4554k2372r9181K589r141l2305J7380P4411J43480
19263A03785L5621p2776r2508l7256k4819N4168K7826m0965O3759M8029K2986
19252H7850n0913n8511m2782n2250L6626K8l5553p810J02580M2917k6598N5762
19240E1346n9534m4264J6924R198k2574J2556O5596p4045m1701m5137l5873L4679
19228a32829J9446J5980O7416j906p4257P0676P1436l5217o7078J2704M1808J8262
19216F441K3845J5087R752k0927n0778l1720p060R4494O4357k1570j5791k1215
$$ plain form
19298 -18210 22238 133013 90622 70614 23317 13018 27447 16445 -49936 -131506 -97102
19287 -97102 -96472 -112247 -108695 -102814 -119395 -164646 -26590 -6666 -74400 -15864 -2840 -28935
19275 -28935 -55229 -57751 -25630 28924 6552 -92629 -90040 -99181 -131486 -114106 -39695 103785
19263 103785 139406 66630 -25878 -63134 -87953 -33785 -5959 -46924 16835 64864 87850
19252 87850 36937 -21574 -64356 -116606 -79980 -79952 -115505 -123315 -20735 22182 -4416 51346
19240 51346 -8188 -52452 -35528 -26330 -48904 -36348 29248 -44797 -86498 -131635 -167508 -132829
19228 -132829 -113383 -97403 -29987 -31893 -106150 -35474 35962 745 -66333 -53629 -11821 6441
19216 6441 30286 45373 55125 34198 -16580 -48300 -55360 39134 103491 81921 66130 44915
19204D4915m2020o2084J6406J57883m8655m5820j2905l4722n0656n9007O390J7171
19192a13104k2179K5917K5159R991N9800N4964L2127J6543J5778n8617q18N4280
19180I9841k3021R819k7711k7848K89j11127j8871m4427q5768N7706J05706J5417
19168d9995K7496p2943j3024K2854R3782j3977J6227p588k9841N3738L4080j3672
19156D7137k6334L9535m228j4905o1644O828K676P5636M5404K0465j0112p8458
19144D2000p9070K7219L3474o126N9626O687P16p9538o7406p9547r0483J7217
19132b15231Q4575Q8447l369j3517o1831Q606M7886r100K5557K932N8854O7486
19120H1295J213l8775J7047K6363j1949m9034n5161o0384k8537N3272K6655R1462
$$ plain form
19204 44915 2895 -59189 -42783 115100 66445 20625 7720 -27002 -77658 -136665 -130275 -113104
19192 -113104 -135283 -109366 -84207 -74216 -14416 40548 72675 89218 104996 46379 45561 99841
19180 99841 76820 86639 58928 31080 31369 -79758 -98629 -143056 -228824 -171118 -65412 -49995
19168 -49995 -22499 -95442 -108466 -85612 8170 -5807 10420 2832 -27009 26729 60809 47137
19156 47137 20803 60338 56110 41205 -20439 -13611 -10935 64701 110105 130570 120458 42000
19144 42000 -37070 -9851 23623 17497 77123 83810 84526 4988 -62418 -141965 -232448 -215231
19132 -215231 -130656 -42209 -45578 -59095 -120926 -112320 -64434 -73534 -47977 -45045 13809 81295
19120 81295 82508 43733 60780 87143 75194 26160 -29001 -89385 -117922 -64650 -37995 53467
19108E3467k9186K2444j5692n3783r077N145n482k9228P632P47k5034n1224N0487
19095g8784j8100k2846L1536j4764m6550l065p751N8383p473j2610R2270K0043
19083i711j1057j6353Q940R0464M5806k6976n3437j178L6915P0091j153j6571
19071A15780m2173N2763l9952k3007M423k0731q2230K3960N4714j6802O650K9482
19059F2877m4676R6760O6732N6622J01470n0718n9524M1078L785l2557p9397p3857
19047H8595o4378k9751N2905J26991O5254K653q1914n9510K068J17928J25829
19036C46670o3390q5238q3831k7592L2563N4662N393o8114J9231R7450J8737k1298
19024B25243O1256k0557m9088p0347j2310l5434j2601J2681L5981J28935R2671
$$ plain form
19108 53467 24281 46725 31033 -22750 -31827 -26682 -32164 -61392 -53760 -53013 -78047 -129271 -78784
19095 -78784 -96884 -119730 -88194 -102958 -149508 -152573 -160324 -101941 -109414 -122024 -29754 -9711
19083 -9711 -20768 -37121 -28181 62283 108089 81113 27676 26498 63413 133504 132351 115780
19071 115780 73607 126370 86418 63411 67834 47103 -35127 -11167 43547 26745 33395 62877
19059 62877 18201 114961 181693 238315 339785 289067 229543 270621 274406 241849 162452 88595
19047 88595 24217 -5534 47371 174362 239616 242269 160355 100845 102913 220841 346670
19036 346670 283280 198042 114211 86619 119182 173844 179237 111123 130354 227804 246541 225243
19024 225243 286499 265942 216854 146507 134197 98763 86162 98843 134824 263759 356430
19013C56430L8448k4730N164o4176k7686P8600M4307o828l2196k563l526O0512
19001D21756M9024L1747P5933N5812l3510j40760m6330m1080m8355j3005q0213
18990B31019n2434n3963q2054r5814q415O6292M8449K6024n3676L3789l7802K6476
18978D7891P1340R185k8787J06376j0104N0745Q1845O2404J3744o0056j67539
18967A77044n2319J7667Q204O7356K7771L4660J1217m1504k2848l1591K5852k2490
18955A99019L560l5890J7289J6166P4996m0998n3321M42J7602L6244M7961J471
18943B84541J7386m9471r7959o6759J9003R580m0216P0614m1232j18459n7705
18932g0677J9869K1728o444M6632k210J3431J704n5838J8237l7287K5634M9624
$$ plain form
19013 356430 394878 370148 375312 311136 283450 362050 406357 399529 367333 364770 361244 421756
19001 421756 470780 502527 578460 634272 600762 460002 413672 372592 324237 311232 231019
18990 231019 178585 124622 42568 -53246 -61661 4631 53080 79104 25428 59217 21415 47891
18978 47891 119231 128416 99629 206005 195901 246646 328491 390895 404639 344583 177044
18967 177044 124725 142392 150596 217952 245723 280383 291600 250096 227248 195657 221509 199019
18955 199019 202579 166689 183978 200144 275140 234142 180821 181263 198865 235109 283070 284541
18943 284541 301927 252456 154497 87738 106741 116321 76105 146719 105487 -12972 -70677
18932 -70677 -50808 -29080 -35524 11108 8898 22329 24033 -31805 -13568 -50855 -25221 24403
18920B4403o8262K6019L3073j3459K1873j7485M3179O2728k379l3911r7704l4828
18908e6753N2742k57K9473o6798j5284p466m8945J8669K2567Q745r319j8794k1440
18895a12860N2175L6508j6103J2531R014m7198L1213J7369M9624j3232L1366M0939
18883I1346O5651p9314l2592o1517j02791N3592K3593K1415J12740m1525k8713
18872B1885J7973n5068l8324J21882Q2678N2622m3691o8235l4015Q322L4092m8679
18860E1442j1841J0383J2240m2723K7269m0731r078M4836K925m6983j910J7238
18848A3067K8795n1209k2164l946Q598K4196K9789K5263l6653m5233n6998q467
18836i4962p4j472M7390p0213R641q076k9628K8964O1138L43j02118k5485Q2314
$$ plain form
18920 24403 -43859 -17840 15233 1774 23647 6162 49341 112069 109690 75779 -21925 -56753
18908 -56753 -4011 -4268 25205 -41593 -56877 -64343 -113288 -94619 -72052 -63307 -72626 -91420 -112860
18895 -112860 -60685 -24177 -40280 -27749 -18735 -65933 -34720 -17351 32273 19041 50407 91346
18883 91346 156997 77683 45091 -16426 -119217 -65625 -42032 -20617 92123 50598 21885
18872 21885 39858 -15210 -53534 68348 151026 203648 159957 91722 57707 66029 100121 51442
18860 51442 39601 49984 62224 19501 46770 6039 -3039 41797 44722 -2261 -4171 13067
18848 13067 41862 -9347 -31511 -35457 -26859 -2663 27126 52389 15736 -29497 -86495 -94962
18836 -94962 -95036 -96508 -49118 -119331 -109690 -117766 -147394 -118430 -57292 -56949 -159067 -184552 -102238
18823a02238J32241J0526q0510p1804L5943R5707J4710m8582n1945Q3143P0501
18812H7692L2326r015R538l8673r3986l7589N1942M4807L9265K408j5361n8441
18800A4913j2020l9139K8881N0441Q2978J3461K4302m3376p9441p039P6049J4591
18788A24601p664J7639J315l0875J381Q285K6702J26734j81p8628m6864m9966
18776I2479r8861P8478P5003J14122J74506J05809J24960J98223K30352K75273
18766A370344o6083m67161m16603r3552n2064m6546j1271M559l5316M9369J42920
18755C78596m5979q9316o9761O522J6357L896K5919Q3510M0335l7904l1262L1371
18743C12284j8650K4614n6500q4209q1258L0968L2609K1413j08992j22469j6386
$$ plain form
18823 -102238 30003 40529 -39981 -111785 -75842 19865 34575 -14007 -65952 17191 87692
18812 87692 120018 111003 120541 81868 -12118 -49707 2235 47042 86307 88715 73354 14913
18800 14913 2893 -36246 -7365 43076 126054 139515 163817 120441 41000 33961 110010 124601
18788 124601 116937 134576 135891 105016 106397 114682 141384 268118 267937 189309 142445 92479
18776 92479 -6382 72096 147099 261221 435727 541536 666496 864719 1095071 1370344
18766 1370344 1304261 837100 420497 326945 274881 228335 217064 221623 186307 235676 378596
18755 378596 332617 243301 173540 180062 196419 200315 226234 309744 350079 312175 280913 312284
18743 312284 293634 318248 261748 177539 96281 127249 159858 181271 72279 -50190 -66576
18732f6576J06999k8607j0462Q0056K9855K0146K4499o0167p8903m53J8863q691
18720B6559k1881J362K600J4825K1347Q0081R8345J9418p8465p5549n5216N9177
18708I2603J30952Q3682j0961r9388r2765m1169M630O6933P6494K9973N633L3947
18696B80564L3382n4397j17745M9172M2011l3439j43550J1136N1625m5376j0607
18685F2776O9130J7185j8144k0385O5677Q5823O44o4949r6425m9263K3153J22436
18673A97658M2520r2080K8863R5894l9545p7185l2603j1897r480o0397k6779K5126
18661D0095J09188j4174k7304j017N0301O9495N815J3835q0789o6120j058p3995
18649B4272M889M9168L7195L5305K3082Q430O2410k3469j7957n3511n1899n7752
$$ plain form
18732 -66576 40423 11816 1354 81410 111265 131411 155910 95743 16840 16387 35250 26559
18720 26559 4678 6040 8640 23465 44812 124893 223238 242656 164191 88642 33426 92603
18708 92603 223555 307237 296276 196888 104123 62954 67584 134517 211011 240984 246617 280564
18696 280564 313946 259549 141804 190976 232987 199548 55998 67134 118759 73383 62776
18685 62776 131906 149091 130947 110562 176239 262062 262706 197757 101332 52069 75222 197658
18673 197658 240178 148098 176961 272855 233310 156125 123522 111625 102145 41748 14969 40095
18661 40095 149283 135109 107805 106788 157089 226584 232399 246234 165445 99325 98267 24272
18649 24272 29161 78329 115524 150829 173911 182341 244751 221282 203325 149814 97915 40163
18637D0163J0210J12682P660o5979j8510J08293O4854q2299r8938j635J8595l7574
18625E7522O6386n281k0594k141m489l4298p3078r983N0663n176r05M2806P9167
18612A40599m5325k1383L7818M287M7729j7218K484l7186m1965P6594R7974J3112
18600B57520K500o9475j15702j8983l8604O8398M3114N1254N8649P9284J15969
18589D33924Q0647N9975J8281o1048J06846K91557K05130N9266j12970j58493
18579I23115k53875j35279K2385L4982J02525J30073p858r1628j23521j4919N6452
18568F42452l2333J6458J3279k9968r7087Q6353J17562j7974Q9645J69180K48629
18557A206196L88024L90931M40907K53813k2961k257K17157M97104O78648N29167
$$ plain form
18637 40163 50373 163055 170715 104736 86226 194519 259373 177074 78136 76501 95096 57522
18625 57522 123908 118627 98033 95892 91403 57105 -15973 -25956 24707 19531 18626 61432 140599
18612 140599 95274 73891 111709 115996 163725 146507 148991 111805 69840 146434 244408 257520
18600 257520 260020 190545 74843 55860 17256 85654 128768 180022 238671 317955 433924
18589 433924 514571 574546 592827 531779 638625 930182 1135312 1194578 1081608 923115
18579 923115 669240 533961 556346 591328 693853 823926 816068 724440 600919 586000 642452
18568 642452 610119 626577 639856 609888 512801 599154 716716 698742 788387 957567 1206196
18557 1206196 1594220 1985151 2426058 2679871 2656910 2654653 2871810 3368914 4047562 4576729
18547D576729Q9380J65437O94828J296869K056119L259718M494852L094048o13122
18538A9114858k977236k385332j741783j430335q39082k51662M97085J451379
18530A1437892K563051M318756P082107R351100R440069P225835K836177k441553
18522E1813434m577207r72568P780852J9588438L5225073M7937963L3948171j0147433
18514A80596723m4952863m2945869k4512809j0733517k297808M646695J1232450
18507G1033002J2759922M285989n600972m519541L704770O109819J620944L24611
18499H9718544R406971K3379875K9035692J2632366j5348019k7557988k0299514
18492A00967927j1945110p379799m615067j939076J185317K12772n281484o895039
$$ plain form
18547 4576729 4666109 4831546 5526374 6823243 8879362 12139080 16633932 19727980 19114858
18538 19114858 16137622 13752290 12010507 10580172 9741090 9489428 9986513 11437892
18530 11437892 14000943 18319699 25401806 34752906 44192975 51418810 54254987 51813434
18522 51813434 47236227 46263659 54044511 73632949 108858022 156795985 190744156 180596723
18514 180596723 135643860 92697991 68185182 57451665 55153857 59800552 71033002
18507 71033002 83792924 88078913 82477941 77958400 81663170 87772989 89393933 89718544
18499 89718544 99125515 122505390 151541082 164173448 148825429 121267441 100967927
18492 100967927 89022817 81643018 77027951 75088875 76274192 76486964 71205480 64310441
18484F4310441j403987L508582J075232m972126n218398K736871J3284169K2715743
18476I6036527K4786254J9891054J0356276q550130l0279034l4852811k3180919
18469E4207217j1532384m636288r54045r93986k853911k571099n20049m47172
18461B9698283j027570P47964K371621o05046m542093n060855l743116k878536
18453A4960652j728679n44718O43507J289553N66995j232016k220821k022732
18445I711741j157589m46998n07855r45845j030957q06041n74760n11407m81818
18436C248471m26638l08282j97800j55653j35317r8402Q7P1912m5182l2914l8901
18425A881381m7781J50945K51956K37685k1374n8672J17080r1945l44008k31734
$$ plain form
18484 64310441 62906454 66415036 67490268 62518142 57299744 60036615 73320784 96036527
18476 96036527 120822781 140713835 151070111 142519981 112240947 77388136 54207217
18469 54207217 42674833 38038545 37084500 36090514 33236603 30665504 30145455 29698283
18461 29698283 28670713 29418677 31790298 31185252 26643159 21582304 17839188 14960652
18453 14960652 13231973 12687255 13330762 14620315 15187310 13955294 11734473 9711741
18445 9711741 8554152 8107154 7599299 6653454 5622497 4816456 4241696 3730289 3248471
18436 3248471 2821833 2513551 2315751 2160098 2024781 1926379 1926466 1998378 1953196 1920282 1881381
18425 1881381 1833600 1984545 2236501 2474186 2452812 2394140 2511220 2419275 2075267 1843533
18415A843533p7742Q431O8892K05613L45679L04948j35061m82792m63615k39806
18405A378080k20730q0444j01824p5625p5491k3369O4765M7505o4454j35981P1450
18394G83882J08916K3729p3962n8786j02273j28069K3857n4244r8378k0335K9171
18383D33508K3932K5269N6563j1198m2780r7361N6154M3619k4025k7698M6415
18372D82398j4312p8914r246j0644o1114k873K5223R3884L9232O2405N2292r4329
18360D84002o9751l0533n0778k8332Q4008k5366j11697j8045L4317J46919J15129
18349E29873N3003r9701l2381j26148q8046P9060p4220k5531j0717o7405O5913
18338B03700J0067q4124l6651M8104n0080O5458M8204J0985n8146l3039P957k7970
$$ plain form
18415 1843533 1765791 1774222 1843114 2048727 2394406 2699354 2564293 2081501 1617886 1378080
18405 1378080 1157350 1076906 975082 899457 823966 800597 865362 912867 848413 712432 783882
18394 783882 892798 916527 842565 783779 681506 553437 577294 523050 424672 404337 433508
18383 433508 457440 482709 539272 528074 485294 387933 444087 487706 463681 435983 482398
18372 482398 468086 389172 379926 369282 308168 305295 330518 424402 463634 526039 578331 484002
18360 484002 414251 383718 332940 304608 388616 363250 251553 233508 267825 414744 529873
18349 529873 582876 483175 450794 324646 236600 315660 241440 215909 205192 137787 203700
18338 203700 213767 129643 92992 141096 91016 156474 204678 215663 157517 124478 132435 104465
18326A04465n161n9947m8887N4910j1526Q7104L3658l532j1812k1954k9808O194
18314I3704m893p4357j8258M1559q012q4005p2150n0300L7025J7125J03871J03558
18302H4867k4071n8331Q8236R0758k241J433K1175K8729n1732n2022k2601L899
18290A08099N5845J7331k3547j6070k8864P298k7949o4734n6938R4320J47809
18279B12600M4957L1334o3053r5350L99L1736J6180r9073k6404P8166J4061n6875
18267H8678k7593M6460l9483M2866M0169L1906M8869k7863j11105p7656J9332
18256C4580L6054N8284K1166O358j5507M5432O382k1534l1413l1912L2815j5132
18244A25573j3927N8034O2540O7944K2483j9324p2108j2912p51o3781j11997j4716
$$ plain form
18326 104465 99304 39357 -9530 45380 33854 120958 154616 151084 139272 117318 87510 93704
18314 93704 88811 14454 -3804 37755 29743 -54262 -126412 -176712 -139687 -122562 -18691 84867
18302 84867 60796 2465 90701 181459 179218 180651 201826 230555 178823 126801 104200 108099
18290 108099 163944 181275 157728 141658 112794 120092 92143 27409 -29529 64791 212600
18279 212600 257557 288891 225838 130488 130887 162623 178803 79730 53326 131492 145553 88678
18267 88678 61085 107545 68062 110928 151097 183003 231872 204009 92904 15248 34580
18256 34580 70634 128918 150084 156442 140935 186367 192749 171215 139802 107890 140705 125573
18244 125573 111646 169680 232220 300164 322647 303323 231215 218303 217552 153771 41774 27058
18232B7058l8329p2062n3468O5251R5700O7134J2161n9717J8207m25o0352J2694
18220A3852J15961k4374j4168k906m0686Q3724L9127j4486J1631m6726k7566L2041
18208A25424M7100n8108p5098M8389p5357r4168L2412J05461L5950m6912l7173
18197G920Q4097K8900m6794m1635k3595L5783Q8625R765l6028j8947j2346N5471
18185A31216j3456k5741P448n9444l5103M926K6788o8360L3491J15793P8232J1585
18173B07375J2709o9011p0822p929O5816O029J0308K9585Q1734P1947j5473r0058
18161B32210j18077m9778L213P321l1773l5901k9694L1482J31944N6773J0624
18150B08344k9862P0753K9196J07965L3399m0304j7299k4300j3313r851j0107
$$ plain form
18232 27058 -11271 -83333 -136801 -71550 24150 91284 103445 43728 61935 61510 1158 13852
18220 13852 129813 105439 91271 88365 47679 131403 170530 156044 167675 120949 93383 125424
18208 125424 172524 114416 39318 87707 12350 -81818 -49406 56055 92005 45093 7920
18197 7920 92017 120917 74123 32488 8893 44676 133301 143066 107038 88091 75745 131216
18185 131216 117760 92019 99467 40023 4920 9846 36634 -31726 1765 117558 195790 207375
18173 207375 220084 151073 80251 72322 138138 144167 154475 184060 265794 337741 322268 232210
18161 232210 114133 64355 67568 74889 43116 7215 -22479 9003 140947 197720 208344
18150 208344 178482 249235 278431 386396 419795 379491 362192 337892 324579 314728 304621
18139C04621j3801Q7618M2720K9387M1777J26461Q2835J15268J18072P8366J17643
18128A130967q172K2348J57501K28889J91588K22771M13105O10141O61100P64211
18118D394449J109981J484738K054946L198668N720497J0403591J8562829L3179080
18110H0108779N5037401N5327298j604271n9522530n6799907k8142172j3864512
18103C0540086q134225n611507m174901k905683j977203j393707r74455p00356
18095D668049n93537n02462n27246m29209k79971k25770k08882k77646j82474
18086A440852r8298N2343k9203j70863j31968l1625q8358q0299n3212n4430j16718
18075F38221j49711n2603l2627o9009J02048R3031p7312q4636k1147L7235P1236
$$ plain form
18139 304621 290820 378438 421158 450545 492322 618783 701618 816886 934958 1013324 1130967
18128 1130967 1122795 1145143 1302644 1531533 1723121 1945892 2358997 2969138 3630238 4394449
18118 4394449 5504430 6989168 9044114 12242782 17963279 28366870 46929699 80108779
18110 80108779 135146180 190473478 188869207 129346677 72546770 44404598 30540086
18103 30540086 22405861 16794354 12619453 9713770 7736567 6342860 5368405 4668049
18095 4668049 4074512 3572050 3044804 2615595 2335624 2109854 1900972 1623326 1440852
18086 1440852 1342554 1394897 1365694 1194831 1062863 1031238 942880 862581 809369 754939 638221
18075 638221 488510 435907 403280 334271 436319 529350 452038 367402 346255 383490 454726
18064D54726K1514p3922k1064N8611n8015k2748K0452n0145J3011J2062p0935
18053B83547k2749k693J9015M2131j8248P4886N9497P2295n6400o5356k4572K9762
18041C91115q211r8220K3925J49803O2041q725N3257n2986j4637k0531Q3263N2811
18029F12905r8265q6094m2348r749l8329l3701P6728L3389M0559K3740j5439p9552
18017C83844j07471k4471N8568P1713J06273J2623L3568l5324o4794j5572N9930
18006D78887J4703j40892q7502q48l808Q1869K8494N71N865r298m0229M8647M9759
17993D26218R7736M3444Q0270J40432J48386N026m4089j05742j4922J10833R8296
17982I85888q203j09366k15185j71131j43673j3250N3824o8715k2573o3740p7246
$$ plain form
18064 454726 476240 402318 381254 439865 381850 359102 379554 329409 342420 354482 283547
18053 283547 260798 258105 277120 319251 301003 375889 435386 507681 451281 385925 361353 391115
18041 391115 382904 284684 308609 458412 520453 511728 564985 511999 497362 476831 560094 612905
18029 612905 514640 428546 386198 376449 338120 304419 381147 414536 455095 478835 463396 383844
18017 383844 276373 251902 310470 382183 488456 501079 534647 499323 434529 418957 478887
18006 478887 493590 352698 265196 264348 260540 342409 370903 371474 377339 368041 327812 376459 426218
17993 426218 523954 567398 647668 788100 936486 941512 897423 791681 776759 887592 985888
17982 985888 977685 868319 653134 482003 338330 325080 378904 310189 287616 223876 146630
17971A46630L6301M6019J13928O5519J08846Q219m9423p1542p98p2867m0003l1262
17959B59567M373L3847k1495o9033k065P7260M4253j4718K8460n3637k2348L7397
17947C01861P0953j1267m4292J22937J09263p7297l0898m4746j22976o1334q771
17936B03433O254n9123j9762l5847n4251l0210Q3844O9388J32403P74j61578k228
17924A33097l6340j20152j0341M1845J956Q230l8932Q6280l2791j7313K9491K9943
17912G4973k9567K3974L8082K6612J092l7049n1862q0218J6685J10576J3854J9200
17900A26352J699l3054n1121j4290o873L7596N0571M3534m4604j9009R543N1266
17888A51610q9562j40335p0275J3555j5437O1295L4385L6331O1585L4113k1008
$$ plain form
17971 146630 182931 228950 342878 408397 517243 525462 476039 404497 403699 330832 290829 259567
17959 259567 263940 297787 276292 207259 205194 282454 326707 311989 340449 286812 264464 301861
17947 301861 372814 361547 317255 440192 549455 472158 441260 396514 273538 212204 203433
17936 203433 209687 150564 130802 94955 40704 10494 94338 163726 296129 296903 135325 133097
17924 133097 96757 -23395 -33736 8109 10065 18295 -20637 65643 32852 15539 45030 74973
17912 74973 45406 69380 107462 134074 135166 98117 46255 -33963 -17278 93298 107152 126352
17900 126352 128051 94997 43876 29586 22713 60309 110880 154414 109810 90801 100344 151610
17888 151610 62048 -78287 -148562 -135007 -150444 -89149 -54764 -18433 43152 77265 56257
17877E6257k2210P4839L1424j4120m4536n0124N8318j038j09267j01184R6388
17866b5253Q6581m2869J8399K6164j0805l459J8642k5l0765m9653p1612J834j9465
17853a02286K3327O2979M4961K049L7134R5763p1584r6095k2766n095N044N2911
17841B6342k9718p0267M1382M9966j5739M2470m9593p1683k9451m5515L55M8661
17829a02790Q045M1710L8714L1818M4855j2757j9411O3167n678M6481M2275m6418
17817A30011j12484o9510M5927n6138n2292K4321Q912m97R6832k3199m8192K2785
17805c3524j5564j0468M671k1945l133L2209j7580N366k862l6721j3690N1755
17793f1486L8764p9909K0637P1959J0438j9509o5296j3188j0153K2009N2927K605
$$ plain form
17877 56257 34047 108886 140310 126190 81654 31530 89848 88810 -20457 -121641 -25253
17866 -25253 61328 18459 36858 63022 52217 48758 67400 67375 36610 -13043 -84655 -82821 -102286
17853 -102286 -78959 -15980 28981 31030 68164 163927 92343 -3752 -26518 -31613 -26569 26342
17841 26342 -3376 -73643 -32261 17705 1966 44436 -5157 -76840 -106291 -151806 -151451 -102790
17829 -102790 -94745 -53035 -14321 17497 62352 49595 30184 93351 87673 134154 176429 130011
17817 130011 17527 -51983 -6056 -62194 -114486 -90165 -81253 -81750 15082 -8117 -56309 -33524
17805 -33524 -49088 -59556 -54885 -76830 -79963 -47754 -65334 -59968 -62830 -99551 -113241 -61486
17793 -61486 -22722 -102631 -81994 -10035 403 -19106 -84402 -97590 -107743 -85734 -32807 -30202
17781c0202k4781k8370J791M5630J298k5125o3269l2769l4122J1976Q7805Q2038
17769h100J1018L7452j8381K016j6846j6431L0124l1072o7402K6697P3360L6939
17757E9374m73m2032j31870m4090j6200P086K1290J8457M0512N3774p949M1285
17745h36N8331l777o8763o1305J01556L6620l6721k0482k8459l5809K276m2081
17733i9450N7939J06107K9106r2240r5411l4430K1808N4938r717j3954J8271M9571
17721g462M0022M104n2347L6135R9230N4559r3134o9608k4602O0447K4020l7587
17709C3777j4252N7713n6512j3443j4854k3502N6603n1508n1523L3372R8706n1901
17697B676j0507o2384l4422J47927N6471m6750J2245q809m3934k2392m3838L0801
$$ plain form
17781 -30202 -54983 -83353 -81562 -35932 -34634 -59759 -123028 -155797 -189919 -177943 -90138 -8100
17769 -8100 2918 40370 21989 24005 7159 -9272 20852 -10220 -77622 -50925 22435 59374
17757 59374 58901 16869 -115001 -159091 -175291 -168205 -146915 -128458 -87946 -34172 -42121 -836
17745 -836 57495 53718 -15045 -76350 25206 61826 25105 4623 -23836 -59645 -57369 -99450
17733 -99450 -41511 64596 93702 1462 -93949 -128379 -106571 -51633 -61350 -75304 -57033 -7462
17721 -7462 32560 36664 -15683 20452 119682 174241 81107 11499 -13103 47344 71364 33777
17709 33777 19525 77238 20726 7283 -7571 -31073 25530 -25978 -77501 -44129 54577 2676
17697 2676 -7831 -70215 -104637 43290 99761 53011 65256 56447 12513 -9879 -53717 -22916
17685b2916J7666M3910P2851K0095l6683o8253Q2330M5780l4241j17398p4147
17674g1006J5715J25804k9434k9874k318n5120K2546L1258M1451o2367l1210k1998
17662f6553j05671n2189J14372Q4255k4296L1867k7389j17521N6384J03749n9669
17651f2661q5067J7147J6435j549o916l3890o6888N2961M0260J40690J9661m209
17639B5974k4982l811J0518o1121n3135M0387P4170R3786l2463n2381n3624K3972
17627a2710j4647J2108K9174J0835N1929o2103K7487J1300M5682r97o6832m5473
17615a4247k3645n3793l990N9305J00328r8016q617l31J6076O122j5033K3103
17603a2738n3558n2675O0408k1654q1488M3870N8847O5421M6049o090k4622k3024
$$ plain form
17685 -22916 -5250 38660 111511 131606 94923 26670 109000 154780 120539 3141 -71006
17674 -71006 -55291 70513 41079 11205 8887 -46233 -23687 7571 49022 -13345 -44555 -66553
17662 -66553 -172224 -224413 -110041 -25786 -50082 -18215 -45604 -163125 -106741 -2992 -62661
17651 -62661 -147728 -130581 -114146 -115695 -122611 -156501 -223389 -170428 -130168 10522 30183 25974
17639 25974 992 -2819 7699 -53422 -106557 -66170 8000 101786 69323 16942 -36682 -12710
17627 -12710 -27357 -15249 13925 24760 76689 14586 42073 53373 99055 98058 31226 -14247
17615 -14247 -37892 -91685 -95675 -36370 63958 -34058 -42675 -43006 -26930 -20808 -35841 -12738
17603 -12738 -66296 -118971 -58563 -80217 -161705 -117835 -58988 6433 52482 46392 21770 -1254
17591a254n5884j1161L9583N2093J1585o9418o101l6786N4100O978n6114o8600
17579a40979N1706j3246K5889O2128n5399m2933J5708m1781m3146J8237J8937
17568a44879M4554P248O2144l1126J9790k6697M9671M1597P965n1434j4544k5239
17556f0950N497m1455P0558l5008o2439Q833M5414q4670r072N4142j22527n9511
17544b91188P6825J16514J11387R7277j16482j08088P6767K6294J2507L8353l5977
17533D189J12270L894m5313m9599n0045M4422j7270L3064O918m7271j45723L6275
17521a14189Q2625l044M9608R533q3418Q116n42r3401K3129J095j9518J14953
17509b5053P7829K1468o5488j10065J057P6773l3700r7789P1292K9675k2437j0060
$$ plain form
17591 -1254 -57138 -68299 -28716 23377 34962 -34456 -40557 -77343 -23243 -16265 -72379 -140979
17579 -140979 -89273 -102519 -76630 -14502 -69901 -112834 -97126 -138907 -182053 -163816 -144879
17568 -144879 -100325 -93077 -30933 -62059 -42269 -68966 -19295 22302 30267 -21167 -35711 -60950
17556 -60950 -55453 -96908 -26350 -61358 -123797 -114964 -69550 -154220 -163292 -109150 -231677 -291188
17544 -291188 -214363 -97849 13538 110815 -5667 -113755 -36988 -10694 1813 40166 4189
17533 4189 116459 120353 75040 25441 -24604 19818 2548 35612 42530 -4741 -150464 -114189
17521 -114189 -31564 -34608 15000 24533 -58885 -50769 -51311 -144712 -121583 -120488 -140006 -25053
17509 -25053 52776 74244 8756 -101309 -100252 -23479 -57179 -154968 -83676 -54001 -76438 -86498
17497h6498m2155M5281J24973k5184q6835M6092K863n2919J3975n682L8195k9178
17485e7072J3857L9468P9688O611k8762l5832P556l1911R8797L4667l9420k8576
17473E9071q8447j05246L2311P0408l0932N3250Q5088o6387l0773k4010M1156
17462d511K8448j6724r131j6035m5284K6318o3556J8941P9094Q4488N7929K6409
17450A66386J8134J4201o1715J3195M0289J44620L04882K94933O2224j50266l24761
17439E22122k19928k4808l1764j10435o8909k7829l3931k296J7427l7661L4042
17428A6030P9103o7806r0395j8724O2322o2588k2611N7291P4087l7404r456L834
17416a6317L2390M009o2473p945L5962J6380J0927O8527k5181J6427n3853m9562
$$ plain form
17497 -86498 -128653 -83372 41601 16417 -70418 -24326 -21463 -74382 -60407 -66089 -27894 -57072
17485 -57072 -43215 -3747 75941 82552 53790 17958 25514 -6397 92400 127067 87647 59071
17473 59071 -29376 -134622 -102311 -31903 -62835 -9585 75503 9116 -21657 -45667 -4511
17462 -4511 23937 7213 -1918 -17953 -63237 -36919 -100475 -81534 -2440 82048 139977 166386
17450 166386 184520 198721 137006 150201 190490 335110 639992 934925 997149 846883 522122
17439 522122 302194 277386 245622 135187 66278 38449 4518 2222 19649 -18012 16030
17428 16030 95133 27327 -63068 -81792 -19470 -82058 -104669 -47378 26709 -10695 -20151 -16317
17416 -16317 16073 20082 -42391 -50336 -14374 2006 12933 81460 56279 72706 18853 -30709
17404c0709Q799q0090r0906n1641J11798O7378l5901M2899M8899o239N263M1151
17392C0701L6524P3516m8797j16557J8960k0806J4618L3766M1349j174N714q0818
17380a3004m8050n8676J7880R9832l350p8508J0768J03262O1340n1556o8723o8659
17368i7444k1921M0114j4137q903O7384o9836O0430Q9947P435j5825O267L0921
17356G4432N1746K4284q2665M7462N319j1412l1317k7689o752L6518N0419r2949
17344C7396j42118q4449n454R9444L7179J4013M8350R484p638n9121K3410N3500
17332B3996J9012m1042j31577m7264Q6331k8847Q1390R7877N0080m7882j7784
17321D4290j11436J4802J9898K5598k39N723m5497o3831R119Q0266m0397m3185
$$ plain form
17404 -30709 -21910 -102000 -192906 -244547 -132749 -65371 -101272 -58373 -9474 -15713 -10450 30701
17392 30701 67225 140741 91944 -24613 -5653 -26459 -11841 21925 63274 62100 67814 -13004
17380 -13004 -61054 -119730 -101850 -2018 -5368 -83876 -73108 30154 91494 39938 -28785 -97444
17368 -97444 -119365 -79251 -93388 -102291 -34907 -104743 -44313 45634 53069 37244 43511 74432
17356 74432 126178 150462 67797 115259 120578 109166 77849 50160 43408 79926 130345 37396
17344 37396 -104722 -189171 -194625 -95181 -58002 -43989 4361 13845 6207 -52914 -29504 23996
17332 23996 43008 1966 -129611 -176875 -90544 -119391 -38001 59876 109956 62074 44290
17321 44290 -67146 -52344 -32446 -6848 -7087 -1364 -46861 -110692 -101573 -21307 -61704 -104889
17309a04889O268j5170N8627Q9874N010k2143l3522O8926N2732k414k5800m2067
17297C5432q63M0692K8039j77291l6807R1409Q3776o0191q6589o3207l2210K11
17285a77599K9857J12240O4560L3422K5997P027K3543J7818j8384R572o015m7405
17273G4633o8833O4287N8469j0860J135m1226m6499j00893m4622N7675p9636P752
17261a28618P9600K6923k0211K2418L8082j5293n7873j35212M5514R6383M0940
17250g347l766N3238R9108O2564m5992p1067p1361q5160j3401J5247J8676m7168
17238i6429K6871K0529j0107l0880j17322N5797n6795l0787J07680M9957J0423
17227g1063J3092L0591L804n5032l1847P6507J5949N2126L9789K1646q9647j36888
$$ plain form
17309 -104889 -98621 -113791 -55164 34710 39720 17577 -15945 52981 105713 103299 77499 35432
17297 35432 34569 75261 103300 -73991 -110798 -19389 64387 4196 -82393 -145600 -177810 -177599
17285 -177599 -147742 -35502 29058 62480 88477 95504 119047 136865 118481 128053 122038 74633
17273 74633 5800 70087 128556 117696 118831 77605 31106 -69787 -114409 -56734 -136370 -128618
17261 -128618 -49018 -22095 -42306 -19888 18194 2901 -54972 -190184 -144670 -48287 -7347
17250 -7347 -11113 42125 141233 203797 157805 86738 15377 -69783 -83184 -67937 -49261 -96429
17238 -96429 -69558 -49029 -59136 -90016 -207338 -151541 -208336 -239123 -131443 -81486 -71063
17227 -71063 -57971 -27380 -23576 -78608 -110455 -33948 -17999 34127 73916 95562 5915 -130973
17215a30973Q557M3643m4514l4569J6486J09488P0348l9608n6162O4589J28622
17204A35907Q5009j22695j43855l6009P1815Q1975r3459j982K272r618q9659K4426
17192i5873R6658N1041k1183l5599o7612j44440N4549P2310n164k1157R3257m0571
17180f3784p2905M2723L652j4147l106J27650O3284l4146l6297l21j7391O7550
17168F2762R65n0685L4701K2617n4535j05372O9454k509K2333P904l7288o5826
17156i5479j20257q00J05684N4181m1731p2994k5817O6304O7311Q3787L0451L019
17144E3659r0414m1041j3420J3113R3153Q579q588N0067j02823n4388K699j340
17132i0744N3945J02018P8180o3600n5121j2405o0870m5786L0462P3010L9796
$$ plain form
17215 -130973 -122416 -78773 -123287 -157856 -141370 -31882 38466 -1142 -57304 7285 135907
17204 135907 220916 98221 -45634 -81643 -9828 72147 -21312 -23294 -21022 -30640 -120299 -95873
17192 -95873 785 51826 30643 -4956 -72568 -217008 -162459 -90149 -95313 -116470 -23213 -63784
17180 -63784 -136689 -93966 -90314 -104461 -107567 20083 83367 49221 12924 12603 -4788 62762
17168 62762 63727 13042 47743 70360 15825 -89547 -20093 -22602 -269 7635 -29653 -95479
17156 -95479 -215736 -216536 -110852 -56671 -98402 -171396 -197213 -130909 -63598 20189 50640 53659
17144 53659 -36755 -77796 -91216 -78103 15050 23629 15041 65108 -37715 -92103 -89404 -90744
17132 -90744 -36799 65219 143399 79799 24678 12273 -48597 -94383 -63921 9089 48885
17121D8885n6901K4961Q2467j9905p8118n0174l1145K4401R5739l2535L5399n8985
17109a5911k7133K3203m9416j8024K0948l8105j199R9235J5503l9709k5151o7724
17097a23483K4930J10271l3659m869l9715n336R388P3083k3841j5426j0249M3472
17085D566K2425O0038n8246l0588L8974m4263l8733J5915j08648n0853l246Q0962
17073a11697M6441K1295O591j1554K0005n466l2630L709O7325L6k5923L4820N3177
17060F6129J7896q2334n6631p1345q1650N2005N6002L5232O1038q6854p4470L4273
17048a30709N3537l1677j8619k7904K0501M8482M4312k4686k9961O1648L7820
17037B744l0703K9592J4022L2291r0288r578K1683J2776j2939l4237O7747N2039
$$ plain form
17121 48885 -8016 16945 99412 79507 1389 -48785 -79930 -55529 40210 7675 43074 -15911
17109 -15911 -43044 -19841 -69257 -87281 -66333 -104438 -105637 -6402 9101 -30608 -55759 -123483
17097 -123483 -98553 11718 -21941 -26810 -66525 -71861 -62473 10610 -13231 -28657 -38906 4566
17085 4566 26991 87029 28783 -1805 37169 -7094 -45827 -29912 -138560 -189413 -192659 -111697
17073 -111697 -65256 -43961 -37370 -48924 -28919 -34385 -67015 -63306 4019 4055 -21868 12952 66129
17060 66129 84025 1691 -54940 -126285 -207935 -155930 -99928 -64696 -3658 -90512 -164982 -130709
17048 -130709 -77172 -108849 -127468 -155372 -134871 -86389 -42077 -66763 -96724 -35076 2744
17037 2744 -27959 1633 15655 47946 -42342 -51920 -30237 -17461 -30400 -64637 3110 55149
17025E5149O775l9530p9424K8978M5716K2933j067q680J6338m3655m2019M4521
17013F035m8566q8046n4185M2476N8763m5458l1046J08246K081j19227j6519J89400
17001C954P6375k4002m0564l6194J3295O75k9958j47908K7764K7477O1817J633
16989f5636K2236m4434r3288K1369l502R1436Q7036q3133j02619N6110O5831K3668
16977b4926m1010K1592J2940J8384Q3077N6087k216L9391K5373j1030j11823p729
16965E8110k658m1709L2427l4753M05M9177r7772l542N4630M8641o7899n0981
16953e5924Q780L7205j0430k1506l8083L724L25l2575P4971J11662P3828m7068
16941A04909j38437n7161N6435k8493j7406P3055J3668q3195k4465j1901j36M5407
$$ plain form
17025 55149 61924 22394 -57030 -28052 17664 40597 39530 30850 47188 3533 -38486 6035
17013 6035 -42531 -130577 -184762 -142286 -83523 -128981 -160027 -51781 -49700 -168927 -185446 3954
17001 3954 80329 56327 15763 -20431 -7136 -6461 -36419 -184327 -156563 -129086 -67269 -65636
16989 -65636 -43400 -87834 -181122 -159753 -163255 -71819 15217 -67916 -170535 -114425 -48594 -24926
16977 -24926 -65936 -44344 -31404 -13020 70057 126144 123928 163319 188692 177662 65839 58110
16965 58110 55452 13743 46170 11417 11822 60999 -36773 -40315 14315 62956 -4943 -55924
16953 -55924 -47144 -9939 -20369 -41875 -79958 -76234 -75909 -108484 -33513 78149 151977 104909
16941 104909 -33528 -90689 -34254 -62747 -80153 -7098 6570 -76625 -101090 -112991 -113127 -67720
16929f7720Q0840J10699j13986o9979K238l6204m0316P4057M7564N372l3400l7374
16917g8209L8017L2351K0151l3557n5674r496k5388j7565O2731n9288l3862k2154
16905a81943K506L8607K4431K696K6938N5507L4392l7120l9496j4324N0568K4469
16893a2769k2809L2406k6395o8991Q8079K4793r220m4248k424K7429m5923m4427
16881a04499K6773Q4610K1413n7834N8263J5357o7429n3195R691L839M5957J8339
16869A285L3444O4246l7583l3279m704l4983n8736J414J12553J8855m2902k7270
16857g660M1601O4389Q445l0449r7428m9017m101o271O23Q7189l151m9117K824
16844d2123M0579J9987J8041k1722m6265n6536k0366P1602L4970J6799m6351K2995
$$ plain form
16929 -67720 13120 123819 9833 -60146 -57908 -94112 -134428 -60371 -12807 -7435 -40835 -78209
16917 -78209 -40192 -7841 12310 -21247 -76921 -86417 -111805 -129370 -66639 -125927 -159789 -181943
16905 -181943 -179437 -140830 -116399 -113703 -86765 -31258 3134 -33986 -73482 -87806 -37238 -12769
16893 -12769 -35578 -3172 -29567 -98558 -10479 14314 5094 -39154 -41578 -14149 -60072 -104499
16881 -104499 -77726 6884 28297 -29537 28726 44083 -23346 -76541 -66850 -63011 -17054 1285
16869 1285 34729 98975 61392 28113 23409 -11574 -70310 -68896 43657 62512 19610 -7660
16857 -7660 33941 98330 106775 76326 -21102 -70119 -74220 -80491 -79868 7321 4170 -44947 -42123
16844 -42123 -1544 18443 36484 14762 -31503 -88039 -108405 -36803 -1833 14966 -31385 -8390
16832h390M5834K3757k4306k7950K5394n6041m3684R220L4060K0706j0392J9069
16820G277k1570m6232m9036j9492K0437K8584k8990Q3787M3068p0099p4657R7334
16808b9589N3665j15150j7113l8680k1898m8566O9637J24723L0655L3116l0592
16797A0208K5369N2503n85M4421l1468j04321L3477j2851p3211M4608N8839K3996
16785G0985m2095O3063N0985K3002o6289j11700m0048m3640l7618j2038N7934
16774h7459J4500M1601K9651j13675j40378K0338R7964N2027m3346j6035l9218
16763a84030J4510L479J0966L7724j056j3597Q601L9636P9710k2637n0481N856
16751g1319J6378l7674M0170L3228J6755n5841p6483j2416J35361K3732o561L5030
$$ plain form
16832 -8390 37444 61201 36895 8945 34339 -21702 -65386 -56166 -22106 -1400 -11792 7277
16820 7277 -14293 -60525 -109561 -129053 -108616 -80032 -109022 -25235 17833 -52266 -126923 -29589
16808 -29589 24076 -91074 -108187 -146867 -168765 -217331 -147694 -22971 7684 40800 10208
16797 10208 35577 88080 87495 131916 100448 -3873 29604 16753 -56458 -11850 46989 70985
16785 70985 28890 91953 142938 165940 99651 -12049 -52097 -95737 -133355 -145393 -87459
16774 -87459 -72959 -31358 -1707 -115382 -255760 -235422 -137458 -85431 -128777 -144812 -184030
16763 -184030 -169520 -166041 -155075 -117351 -118407 -132004 -123403 -83767 -4057 -26694 -77175 -71319
16751 -71319 -54941 -92615 -52445 -19217 -2462 -58303 -134786 -147202 -11841 11891 5330 40360
16739D0360k1011n1992n8428J935O9535J1975n6226m6574R4088O6096l2887q7455
16727g0584K0307P8845q0611o7773o3397Q2101L7429j3206O3964O9071o5541q4553
16715i3948j00131Q7211M2949L3602J5178K620o0999l7591K5083k9924o357O3955
16703e8352o424p1180j8956k8938l3910q0076K683J02767L1976k6530R871J31662
16691d5407n085l2037L2115M2019k7075L5980j6054k6700K1595j9749k8604l1601
16679a00603L4537N5183j6305m3774O3275L8882m5241j05911K1004J2452m7273
16668a33774P5732M1778L502L005M799o1227P7753P5036m2680n0093n926O1087
16656D8992O3864k9534n3627k431n3253l8874J7861l166K1403J07129J7726n4116
$$ plain form
16739 40360 19349 -32643 -91071 -89136 -19601 -7626 -63852 -110426 -16338 49758 16871 -70584
16727 -70584 -50277 28568 -52043 -119816 -183213 -101112 -63683 -76889 -12925 56146 -9395 -93948
16715 -93948 -194079 -106868 -63919 -30317 -15139 -12519 -73518 -111109 -86026 -115950 -122307 -58352
16703 -58352 -64776 -135956 -154912 -183850 -217760 -297836 -295153 -192386 -160410 -186940 -177069 -45407
16691 -45407 -50492 -82529 -50414 -8395 -35470 510 -15544 -42244 -20649 -40398 -69002 -100603
16679 -100603 -66066 -10883 -27188 -70962 -7687 31195 -14046 -119957 -98953 -86501 -133774
16668 -133774 -58042 -16264 -12762 -9757 -4958 -66185 11568 86604 43924 -6169 -12095 48992
16656 48992 112856 83322 29695 27264 -25989 -64863 -47002 -50168 -28765 78364 96090 41974
16644D1974J8311p4966l8324L1028J38008M227q0541j18396l337K9339J9088J06026
16632G2437N3752m9394q4964o3927n4450O3992N5305N6296n6159o1419p179M812
16620g0898L9979n427o7751O0344j853j5473k3047L7680J605k6723O6436M7049
16608D1921q1775m073q1729K1154l9586Q80j0368N3447O6223m3059N624P686K485
16595f1170n432J632J4678j3361p5487M9068N8494K533j149L853j5334k8036M8645
16582b1066p6933n6030L0319J20749K6558K958k7715l3492l8016r539M6780O7817
16570C2390J4538m073j00080j1258M60l0593M4899N6977M9065K8756l8403l5131
16558G547p4876J67J550L4387N0784m5263J04469K7514j08761l9531Q5862M4958
$$ plain form
16644 41974 60285 -14681 -53005 -21977 116031 120258 39717 -78679 -82016 -52677 -33589 72437
16632 72437 126189 76795 -8169 -72096 -126546 -62554 -7249 49047 -7112 -68531 -75710 -70898
16620 -70898 -30919 -36346 -104097 -43753 -45606 -61079 -84126 -46446 -44841 -71564 -5128 41921
16608 41921 -39854 -43927 -125656 -104502 -144088 -143208 -153576 -100129 -33906 -76965 -71341 -63655 -61170
16595 -61170 -66602 -64970 -50292 -63653 -139140 -90072 -31578 -29045 -30194 -26341 -41675 -69711 -21066
16582 -21066 -97999 -154029 -123710 -2961 23597 26555 -1160 -34652 -72668 -82207 -35427 32390
16570 32390 46928 42855 -57225 -68483 -68023 -98616 -53717 3260 52325 81081 42678 7547
16558 7547 -67329 -67162 -65612 -31225 19559 -25704 78765 106279 -2482 -42013 43849 88807
16546H8807k9748m1959j0874l4661L5236m6810o5795p232J9989Q2847l572M3296
16534B9524O4130L1766K7825j20328q0552k9650J3827Q644O4419l0554o3140J6743
16522f7346J0089p3451k5874J6095O4605q048Q0008K3695o1021j08194J7998O6125
16510f5319O458N4663K5536j6630r26l8848j18123J7267J13986m3486j8365L2439
16498e1348n2815p5800J1985J02800K4059Q5517R141j1656l0965p2390j4458J01314
16486B5384K9934l8137J1633o6366j5344n3369j0745K7424j2374J1598N1515M9195
16474A0348K1913o2547j12491K8855Q5671N755P4748n6644j54313j5863K7719
16463a46849L3187J1207k3859n8743n685J7838j5317k9735L2951R2091J3814o60
$$ plain form
16546 88807 59059 17100 6226 -28435 6801 -40009 -105804 -113036 -93047 -10200 -13772 29524
16534 29524 93654 125420 153245 32917 -47635 -77285 -63458 -54814 9605 -20949 -84089 -67346
16522 -67346 -57257 -130708 -156582 -140487 -75882 -83930 -3922 19773 -41248 -149442 -131444 -65319
16510 -65319 -58861 -4198 21338 4708 3782 -35066 -153189 -135922 -21936 -65422 -83787 -51348
16498 -51348 -104163 -179963 -167978 -65178 -41119 44398 53539 41883 10918 -61472 -75930 25384
16486 25384 55318 17181 28814 -37552 -52896 -106265 -117010 -89586 -101960 -90362 -38847 10348
16474 10348 32261 -30286 -142777 -113922 -28251 -22496 52252 -4392 -158705 -174568 -146849
16463 -146849 -113662 -102455 -126314 -185057 -190742 -172904 -188221 -217956 -185005 -92914 -79100 -79760
16451g9760L8980N294J9415m1361l0225j8040L822O1501M9606L8481m691q7332
16439d4310o3016m5426j0032n9349N9261M3762K3003M89r8626n3958o6880M9114
16427b65968N1445J8238q419K0685P0956O6586l4178j1821K718O1507j2625l0545
16415g1421m3333K535Q269L8048M1466O4880K6610j5397j6981O0937j1778j5203
16403F8632O9696m5021l2874K2733j1174l6164n2548n4261j00989k7005k7581
16392b26556J24986J27444L8002M3161J397k1385j14628o4093j0232j3995N9374
16381e6525O0109p1241J000J00598K7296q0300j5181O7424L6774m56J37390j1993
16369A94895r6611p6278j7580J9783r6397q2924K8284m196J782l5891l8639K3313
$$ plain form
16451 -79760 -40780 -35486 -16071 -57432 -87657 -105697 -101875 -40374 9232 47713 43022 -44310
16439 -44310 -107326 -152752 -162784 -222133 -162872 -119110 -96107 -95618 -194244 -248202 -315082 -265968
16427 -265968 -214523 -196285 -204704 -184019 -113063 -46477 -80655 -92476 -89758 -28251 -40876 -71421
16415 -71421 -114754 -112219 -103950 -65902 -24436 40444 67054 51657 34676 95613 83835 68632
16403 68632 138328 93307 60433 83166 71992 35828 -16720 -70981 -171970 -198975 -226556
16392 -226556 -101570 25874 63876 107037 108434 87049 -27579 -91672 -101904 -115899 -56525
16381 -56525 3584 -67657 -66657 33941 61237 -19063 -34244 33180 69954 69498 206888 194895
16369 194895 98284 22006 4426 24209 -72188 -155112 -126828 -131024 -129242 -165133 -203772 -180459
16357a80459R3451J0589p3j14354k3968N9046O2078M2932R600q362J306Q3964
16345C5750k9817q0194m014L364O1237Q550n626O5121O5424k9280j0957Q034j3974
16332G3618P436k2273p3521r3996p5331J45746N4605j19337n9073j7098K5800
16321a53424l0140k3502O7752P1767L2318J3185o2462N390P9064k1482n457r6976
16309a23967m7488k5309Q0084R1249O4057M3542P940K7009n8383j23095o8390
16298a32751O5125Q1835K2859n3391K0988K9680j05663l8523m460l6007L3426
16287a16882J03552N6539k2909P0329J0312K1167R762n2899N53r6523j7772J942
16275c2829J2705L9043k4474L4110o6205p58m7697K3988L1179m6341l7624j0402
$$ plain form
16357 -180459 -87008 -76419 -76492 -190846 -214814 -155768 -93690 -50758 -41158 -49520 -48214 35750
16345 35750 5933 -74261 -78275 -74911 -13674 -5124 -10750 54371 119795 90515 79558 87592 73618
16332 73618 81054 58781 -14740 -108736 -184067 -38321 16284 -103053 -162126 -179224 -153424
16321 -153424 -183564 -207066 -139314 -67547 -35229 -22044 -84506 -79116 -52 -21534 -26991 -123967
16309 -123967 -171455 -196764 -116680 -25431 38626 82168 90108 117117 58734 -64361 -132751
16298 -132751 -67626 14209 37068 -16323 4665 34345 -71318 -109841 -114301 -150308 -116882
16287 -116882 -13330 43209 20300 90629 100941 122108 131870 78971 79524 -16999 -34771 -32829
16275 -32829 -20124 18919 -5555 28555 -37650 -38408 -86105 -62117 -30938 -77279 -114903 -125305
16263a25305j9364m4642M3406J43785J183K8050O354m502p6427q5141N6749Q017
16251f7837n0253P9666L0262n9252o3846l7533k3946M451K9253R569J0901N9083
16239g9482R903P0786O0885O788l3782k9371M0000L3969j5029j3305M6722K7666
16227A25750p9703l9309L9472m7105L4875L569o4347Q354J02752J7967j342Mk0526
16214H0411l8388j25252m3492j1860M6786J05731J32843N1736j7013q7038p5226
16203A9238J2674J1795J3670K9248j0947k0517l7627k8016K0988M1973M617J9717
16191G6813M9192k7915j6761j4439k0782p7865o5463N1787K5737K9450J3445n2008
16179b8809n6062O678k4110M5547M2590K4881K6500j7515J4403l6218l054Q3216
$$ plain form
16263 -125305 -144669 -189311 -145905 -2120 -937 27113 33467 28965 -47462 -132603 -75854 -67837
16251 -67837 -118090 -38424 -8162 -67414 -131260 -168793 -192739 -188288 -159035 -149466 -138565 -79482
16239 -79482 -69579 1207 62092 68880 35098 5727 45727 79696 64667 51362 98084 125750
16227 125750 46047 6738 46210 -895 33980 37549 -26798 -18444 84308 102275 100933 100937 80411
16214 80411 42023 -83229 -126721 -138581 -91795 13936 146779 198515 181502 94464 19238
16203 19238 31912 43707 57377 86625 75678 55161 17534 -10482 10506 52479 57096 76813
16191 76813 126005 98090 81329 66890 46108 -31757 -97220 -45433 -19696 9754 23199 -28809
16179 -28809 -84871 -78193 -102303 -56756 -14166 10715 37215 19700 34103 -2115 -5169 78047
16167G8047p161q543j7351l7070j9340P4591l3988k2420m0999k5239K6982k5946
16155e8437J2670M2646m3937L924k5304l3232j6040m8400p321K9250q8627l7231
16143b70039J7076M227O7909J24922J4942j5696M7618K2877q6271J0442K1804
16132d0189j6867P8384k9351p761o4716J7173N7472P8500j3806P68j7697L8653
16120H0563Q0043n0300j13909q8280K1089P8062L0848Q015J5874O4j04118l5182
16108g7231L5775N2913O8213n041o4854J116n5014k3408j42399j1037Q7537N0188
16096h3242p186l5467n2168J07753M8646Q0080P4599m4421n7085r6230J0811J09383
16084E5473k2506p8342k9333M8648M8932L9371K6004j7572l0050O5009p9936p2729
$$ plain form
16167 78047 70886 62343 44992 7922 -11418 63173 29185 6765 -34234 -59473 -32491 -58437
16155 -58437 -45767 -3121 -47058 -43134 -68438 -101670 -117710 -166110 -173431 -144181 -232808 -270039
16143 -270039 -252963 -248736 -180827 -55905 -40963 -56659 -9041 13836 -72435 -61993 -40189
16132 -40189 -57056 21328 -8023 -15784 -80500 -63327 -5855 72645 58839 59607 41910 80563
16120 80563 160606 110306 -3603 -91883 -70794 7268 38116 46131 62005 62069 -42049 -77231
16108 -77231 -41456 11457 79670 74629 9775 10891 -44123 -67531 -209930 -220967 -133430 -83242
16096 -83242 -90428 -125895 -178063 -70310 -21664 58416 133015 88594 31509 -64721 -53910 55473
16084 55473 32967 -45375 -74708 -26060 22872 62243 88247 70675 40625 105634 25698 -47031
16072d7031N3450j2828k519k8954n5235P3319J21971L1831r9015K3374R1075M0640
16060A90078p1548m1844R451j08274p348L901k9207k6948k5573J17518N0835k2675
16048C8366l8731O101j9906o0601o4610J19057K1489k0243M3930l0761k3458J6261
16036a3106l2988o620R6191J0051p5043m3656N799K4888q0641m0510O901Q7727
16024f1007J24743O8779m4836P830K2812o1626q577p5035N1677P9878k377N5164
16012A57425N0436j7082j28987m9686o8401j6768K5447p5291j32739J7226P8786
16001a59634Q6769R3163P0168k0552l9428j2254p72n3162N5784O0524r016l1352
15989D0238q9738l6430M0626K0266o2085m6514J05412m1913j3974n3338l6952
$$ plain form
16072 -47031 6419 -6409 -8928 -37882 -93117 -19798 102173 134004 34989 58363 149438 190078
16060 190078 118530 76686 86137 -22137 -29485 -25584 -54791 -81739 -107312 10206 61041 38366
16048 38366 -365 5736 -14170 -74771 -139381 -20324 1165 -19078 24852 -5909 -29367 -13106
16036 -13106 -46094 -52714 43477 53528 -21515 -65171 -59372 -34484 -115125 -155635 -148734 -61007
16024 -61007 63736 132515 87679 95509 118321 56695 48118 -26917 24760 104638 102261 157425
16012 157425 207861 190779 61792 12106 -56295 -73063 -47616 -122907 -255646 -238420 -159634
16001 -159634 -72865 20298 90466 69914 30486 18232 17460 -35702 20082 80606 71590 40238
15989 40238 -49500 -85930 -45304 -25038 -87123 -133637 -28225 -70138 -84112 -137450 -174402
15978a74402R9550J50258j7368q5797k8496l4137k833K9477J6944L2589j933P1326
15966E5178q3468o2834K4901r0J46337J09798p1723j07331p2208N9366J0593M6328
15954E4847O8019k0010k1673n6975Q096p986q523m502l0506L9337j7300l1800
15942b8976j901O4303j2340J5158P3097K4664m268Q871n7984j26628J5572M8294
15930A7862j3202n5230L7523K8382p529n2896j8532J7178K1565P6326m2270l1755
15918b2578N7242L8234n6791q0724l4398n274k0634P6246n1216q2583L6045N0850
15906i5581m6928k8145J07888M7317q214o1201M526M5442Q879N3624R7965j1591
15894A13981o7572k8371N194m2216N077Q0797M759n429o0412r3964m155O0917
$$ plain form
15978 -174402 -74852 75406 58038 -27759 -56255 -90392 -93225 -63748 -46804 -14215 -16148 55178
15966 55178 -28290 -91124 -66223 -66313 80024 189822 118099 10768 -61440 -2074 8519 54847
15954 54847 122866 102856 81183 24208 32304 24318 15795 11293 -19213 20124 2824 -28976
15942 -28976 -30877 33426 21086 36244 109341 134005 129737 138608 80624 -46004 -30432 17862
15930 17862 4660 -50570 -13047 15335 7806 -45090 -63622 -46444 -24879 51447 9177 -22578
15918 -22578 34664 72898 16107 -64617 -99015 -104289 -124923 -48677 -99893 -182476 -146431 -95581
15906 -95581 -142509 -170654 -62766 -15449 -23663 -84864 -80338 -34896 -26017 27607 125572 113981
15894 113981 46409 18038 23232 -18984 -13907 66890 71649 66220 5808 -88156 -92311 -31394
15882c1394O2549l6779r198O2229l408L510K918m8773l6951k9504q1018r3506
15870b39325J1636J00581R69P7501r43r0609L7638N4688L4019k6155K5813M5777
15858C1590j0871k8963k4936l512k0803j8916R352L3519j2625q2189n0507j7718
15846a96579R1785R6433O8159r541j16063J8337P1228K8071m4200l5268L5011
15835G373J4828n201m4352m6281q2321j3079L442O3960q459p6172O3888P8659
15823d3715L3856m1410P1406M0129m8115k7054N0395L5498q8561o4848M4814K4982
15811a2623K2568q265K337M2930m2893q0523J2949N5391j14698L829O5818K8613
15799b4567K7651j9659P0705o183q4171n5150O1595L1928n5390p9948o4136P1383
$$ plain form
15882 -31394 31155 -5624 -14822 47407 43999 47509 50427 1654 -35297 -64801 -145819 -239325
15870 -239325 -227689 -127108 -126139 -48638 -49581 -140190 -102552 -47864 -13845 -40000 -14187 31590
15858 31590 20719 -8244 -33180 -36692 -57495 -76411 -67059 -33540 -46165 -128354 -178861 -196579
15846 -196579 -104794 -8361 59798 50257 -65806 -47469 23759 51830 7630 -27638 7373
15835 7373 22201 17000 -27352 -73633 -155954 -169033 -165591 -101631 -110090 -186262 -122374 -43715
15823 -43715 -9859 -51269 20137 60266 12151 -14903 35492 70990 -17571 -82419 -37605 -12623
15811 -12623 9945 1680 4017 46947 4054 -76469 -63520 -8129 -122827 -118998 -53180 -24567
15799 -24567 3084 -16575 54130 47947 -36224 -91374 -29779 2149 -53241 -133189 -197325 -125942
15787a25942O2224m1676j76Q8111L0132k4748J2898O6637j2369l3441r540K6484
15775C8594M977k8917J2914j6270j15648j0601N1263j3241j0239M5978O0180K7040
15763D6030j5596l6760l6430m456K5051K9313l0050k7137K5722J09894L6528o4745
15751E7364o2307k9893K9637N7497O43j02609r2242N5237j1120n1794J5922M0092
15739i3573M7311j2034L221L9480L9081n998m0798k023Q422l592Q7672l6033k5287
15726E849P8839P7340j8773o4647l4037o0506j8752J6187J24229n6095o8076m3895
15714f2337k090J9215Q4203P7858k7105K2408o3199j84112J0019o669n0492M4074
15702a38227R3539P7127l2179J918n7363P9K827J8854p3133P50K8499L3415L6139
$$ plain form
15787 -125942 -63718 -105394 -105570 -17459 12673 -12075 823 67460 55091 21650 12110 38594
15775 38594 43571 14654 27568 11298 -104350 -114951 -63688 -76929 -87168 -41190 18990 46030
15763 46030 30434 -6326 -42756 -47212 -22161 7152 -22898 -50035 -24313 85581 122109 57364
15751 57364 -4943 -34836 -5199 52298 52941 -49668 -141910 -86673 -97793 -149587 -133665 -93573
15739 -93573 -46262 -58296 -55075 -15595 23486 17488 -23310 -25333 -16911 -20503 67169 31136 5849
15726 5849 84688 162028 143255 78608 44571 -15935 -34687 -18500 105729 49634 -18442 -62337
15714 -62337 -64427 -45212 38991 116849 89744 112152 48953 -135159 -125140 -131809 -182301 -138227
15702 -138227 -44688 32439 260 2178 -55185 -55106 -52279 -33425 -106558 -105808 -77309 -43894 -7755
15689g755l9753P9314J13101j523o6651j4320r434K7595J9142M3397M0663k3799
15677A59977r6071o4595n205P3513O7420k4286j03640k2237N2719k0953k7358
15666a0716j5697q8068P1172M2532j9624J2692j0462N4045J1321l8460j57863
15655a49128k1771k7154J9167O9252l2310R8326J23672o5587j0667o940O9774
15644F6634k4613q3994n9388J6867k783L8977q564m2420q386L4811J29224O207
15632F2572j7172N0062q2847K2026P0647j7986o2471R686n626q4991J1790M1468
15620b842p3982k8080m8509R473M1648K5858M7278J9891M0719K2885k3010N4023
15608H5352M384l1872n8127l8265K2133k5459r524K3238O0107N5818L728l7437
$$ plain form
15689 -7755 -47508 31806 144907 143384 76733 62413 52979 80574 99716 143113 183776 159977
15677 159977 63906 -689 -5894 67619 135039 110753 7113 -15124 37595 16642 -10716
15666 -10716 -26413 -114481 -43309 -777 -20401 -7709 -18171 35874 47195 8735 -149128
15655 -149128 -170899 -198053 -178886 -109634 -141944 -43618 80054 14467 3800 -3140 66634
15644 66634 42021 -41973 -101361 -84494 -87277 -48300 -56864 -99284 -107670 -72859 56365 62572
15632 62572 45400 95462 12615 34641 105288 87302 24831 34517 28891 -56100 -44310 -2842
15620 -2842 -76824 -104904 -153413 -143940 -102292 -76434 -29156 -9265 31454 54339 31329 85352
15608 85352 89736 57864 -263 -38528 -16395 -41854 -51378 -28140 31967 87785 91513 54076
15596E4076p7089m8434n3440k4102R1172O3051K7801n904Q140M0620O2162J5235
15584A53288o6987n6524q0529j0357L3177K7577j7798j5371O6257K8706o5462
15573d023k0617M0715k5791O5283L1034l2878p6289N3638N5362M4442m3381n1965
15561C5530j4736l0071o7716M4692k8494l0580J28076K5746m6414K924J5277l6750
15549b516K9491l5791p7022j5460k8640J2178N7034P462L8924Q570m3036q0739
15537a29545J2208L4431N1041R077K5652o9403O6203L0939j8588k0682J238J0125
15525B696M6396K6839n7234j04441j5757k5698l2075N9111M1965P173K5429N0983
15513B5387K1261k0659k0411J5866j3432m079J17507j4780p2219l7875j1878j3999
$$ plain form
15596 54076 -23013 -71447 -124887 -148989 -57817 5234 33035 27131 35271 75891 138053 153288
15584 153288 86301 29777 -50752 -61109 -27932 -355 -18153 -33524 32733 61439 -4023
15573 -4023 -24640 16075 -9716 55567 86601 53723 -22566 31072 86434 130876 87495 35530
15561 35530 20794 -9277 -76993 -32301 -60795 -91375 36701 62447 16033 18957 34234 -2516
15549 -2516 26975 -8816 -85838 -101298 -129938 -117760 -60726 -53264 -14340 -5770 -48806 -129545
15537 -129545 -117337 -82906 -31865 -22788 2864 -66539 -336 30603 12015 -8667 -7429 2696
15525 2696 49092 75931 18697 -85744 -101501 -127199 -159274 -100163 -58198 -51025 -25596 25387
15513 25387 46648 25989 5578 21444 8012 3933 121440 106660 34441 -3434 -15312 -29311
15501b9311J3768M0608L5864k2430k9278N2021m4549l8620J4164L5354J0630n4455
15489a6234O1552K7161k6661p2829k9965j2682J5924J641k2966m3015K1794J6786
15477g9494P0646O0229N6909J04973K9340j43988o0155l0762n2850p8772O2491
15466f1433J36660J2758m1640P556J7655J3505J8007n638l7757p3227q4586J8077
15454h0063R1391M9592K0452j9895J8108N648l5529P2894n484k4111n1223q3923
15442d2143J4154P4707K4861n6026j21158J6810R2030R3386L5389p7566J3886
15431F8330N5283l7446j27832j01408m4376L5994O9193K4725o219j570L4251M6832
15419A5757N0397m4184N492K1041N9336R266n8275J7579N518K3842q0017L3757
$$ plain form
15501 -29311 -15543 25065 60929 38499 9221 61242 16693 -21927 -7763 27591 38221 -16234
15489 -16234 45318 72479 45818 -27011 -56976 -69658 -53734 -52093 -75059 -118074 -96280 -79494
15477 -79494 -8848 51381 108290 213263 242603 98615 38460 7698 -45152 -123924 -61433
15466 -61433 75227 87985 46345 53901 71556 85061 103068 97430 59673 -13554 -98140 -80063
15454 -80063 11328 60920 81372 61477 79585 85233 49704 122598 117114 93003 41780 -42143
15442 -42143 -27989 46718 71579 15553 -105605 -88795 3235 96621 132010 54444 68330
15431 68330 123613 86167 -41665 -143073 -187449 -151455 -82262 -57537 -63756 -65326 -31075 15757
15419 15757 66154 21970 27462 48503 107839 117105 58830 76409 81927 105769 25752 59509
15407E9509L9264p598J8063K9320L6115P402n9268K0663k50q291l3037m7727j6559
15394C7606L2805l1586k7754n8059J1820L9965M3889L8682J2140m2343O2416R6995
15382B16576o3630q8812j12665n4377J12375L8264Q419l3969q1196l1237K6206
15371f4046N0842L1407k4337L214R2347L0766p7530l3028P8908M5213q5332o8236
15359a9812j7247m2260n30k7577n99Q160n770l4803N0016M7873l6448m3036K1042
15346a00991L3367K3845k6857N4836M7386Q830l9331k0227p069j4772N7452O222
15334B2691n3542k3377k1940k6131M1112L1053K0410P1879O8451p0858Q379j66
15322F7961r180n3259L4907L2774r6146J8276R3066Q6194n3352m0956j984m7125
$$ plain form
15407 59509 98773 91175 109238 138558 174673 182075 122807 143470 143220 134929 101892 54165 37606
15394 37606 70411 38825 11071 -46988 -35168 4797 48686 87368 99508 57165 119581 216576
15382 216576 152946 64134 -48531 -102908 9467 47731 56150 22181 -59015 -90252 -64046
15371 -64046 -13204 18203 -6134 -2920 89427 120193 42663 9635 88543 133756 48424 -19812
15359 -19812 -37059 -79319 -79849 -107426 -108025 -99865 -105635 -140438 -90422 -42549 -78997 -122033 -100991
15346 -100991 -67624 -43779 -70636 -15800 31586 40416 1085 -19142 -26211 -40983 16469 22691
15334 22691 -30851 -54228 -76168 -102299 -61187 -30134 -9724 62155 130606 59748 68127 67961
15322 67961 58781 5522 40429 73203 -22943 -4667 88399 174593 121241 80285 78301 31176
15310C1176K7253N9097n5757q2937K072J7581l91o5912J3963L6919R993n346K7806
15297A5517M5169o4290j0949Q2494p0388m2123l6957P8463j8538o6617n0850O6407
15285g2662J6541l8160k7775l5633O6549R6509M8235q3500l787K6102L1940R446
15273C3805k1589m5112n5050P2635O4634m8691K08J6767L1741r942k0358j2550
15261F498k5508j6873k9984J2446M4270L2496q433m6030j8325J17122M8280j7742
15249I8217k0665J23092R223n4314j66087M6783k7954r4044P9674Q9957q903o5294
15237I685k5878k1888R823N581l5497l2409R325P1001M2356k122l9256m5181l5186
15224h9646k353m6248L9376N9447p616n6998N1917L133j1252J7105L4467P0810
$$ plain form
15310 31176 58429 117526 61769 -21168 -19096 -1515 -1906 -67818 -53855 -16936 -6943 -12289 15517
15297 15517 60686 -3604 -14553 67941 -2447 -44570 -81527 -3064 -21602 -88219 -139069 -72662
15285 -72662 -56121 -94281 -122056 -157689 -91140 5369 53604 -29896 -33683 -7581 24359 33805
15273 33805 12216 -32896 -87946 -15311 49323 632 840 17607 49348 39406 19048 6498
15261 6498 -19010 -35883 -65867 -53421 -9151 23345 14912 -31118 -49443 67679 115959 98217
15249 98217 77552 200644 209867 155553 -10534 36249 8295 -85749 -6075 83882 74979 9685
15237 9685 -16193 -38081 -28258 -22677 -58174 -90583 -81258 -10257 32099 29977 -9279 -54460 -89646
15224 -89646 -91999 -138247 -98871 -39424 -47040 -104038 -52121 -48988 -60240 -43135 -8668 62142
15212F2142q0501r2449K7085L7917k1318k600Q0787k3873N0545O5077l1695j00338
15200b9221j4522P644K3279m9872K5395j2597K6261L1459k4686l0251k5395L3931
15188c8575k3820l466J2468j2178P7667J12634N768n3222r2306K9914K8294l7766
15176E412M4241P6172j59215l548M4151J00005L8968j56124k3531K9601K8439
15165B4571O1817J8442q3774m1581q0473n394O673P7858L6608m7038j20q419J5609
15152b5221P872O3146K1084k9920l0959m2483N7451J6696m8041K7706L9799j0076
15140D7054J8O658l0882K2823M033o7317q378K3404M385m4264J4846p39J808k8672
15126e5223m9075K8750L4057P6320Q90M4145P309o7256J438R4722J6839n8649
$$ plain form
15212 62142 -18359 -110808 -83723 -45806 -67124 -69724 11063 -12810 37735 102812 71117 -29221
15200 -29221 -43743 -36099 -12820 -62692 -37297 -49894 -23633 7826 -16860 -47111 -72506 -38575
15188 -38575 -62395 -65861 -53393 -65571 12096 124730 130498 77276 -15030 14884 43178 5412
15176 5412 49653 125825 -33390 -36938 7213 107218 146186 -9938 -33469 -3868 24571
15165 24571 86388 104830 21056 -20525 -100998 -106392 -99719 -21861 14747 -32291 -32411 -40830 -25221
15152 -25221 -17349 45797 66881 36961 6002 -36481 20970 37666 -10375 17331 57130 47054
15140 47054 47072 53730 22848 45671 49704 -17613 -25991 -2587 1798 -42466 -27620 -28359 -26551 -55223
15126 -55223 -104298 -75548 -41491 34829 35719 79864 87173 19917 21355 116077 132916 74267
15114G4267m6876P1173M3667p0233q485L4156K2434l3955r1520k197K7009J2834
15102C2274M4129M2466l8213r694j4824k2634p243k3091m817M6308K1548L5144
15090A01353N581O954p8433o548O0080l858l3835k3616K6037L8336K2177o7411
15078D6817m9467P392m0419n2359k3235r763l5145q6185P5380K3295M7071O0521
15066c6097Q8715N3041l780p4920j6364J4446n4705l4157q2471K1360L2737o1806
15054a54001N3345N1065L6297J0449j614j765j8770p8780N7495J6345j32155L0827
15042a31262M0310O0913m6057l1636L4093N5083n0600j4688J0307K6993L61K3614
15030b2569O0964P540J9690j2338K3752l1595K2117q703M9058q1235j12257L4548
$$ plain form
15114 74267 27391 98564 142231 71998 63513 97669 120103 86148 -5372 -7569 19440 32274
15102 32274 76403 118869 80656 70962 56138 33504 26261 3170 -1647 44661 66209 101353
15090 101353 106934 113888 35455 28907 88987 85129 51294 27678 53715 92051 114228 46817
15078 46817 -2650 4742 -35677 -88036 -111271 -121034 -156179 -242364 -166984 -143689 -96618 -36097
15066 -36097 52618 105659 101879 26959 10595 25041 -29664 -63821 -146292 -124932 -92195 -154001
15054 -154001 -100656 -49591 -13294 -2845 -4459 -6224 -24994 -103774 -46279 -29934 -162089 -131262
15042 -131262 -90952 -30039 -76096 -107732 -73639 -18556 -69156 -83844 -73537 -46544 -46183 -22569
15030 -22569 38395 45935 65625 53287 77039 45444 67561 58858 107916 26681 -85576 -51028
15018e1028j5760K2403Q1265L884m8774m2311L3833j4476m3488N8071M5443r875
15006A9187j07678l7317M6841K2657K5750N9446O4749l6888n025n7274j8920N0434
14994B5962L148Q5266j2135m2481k3242o141K5781l3723r974j3233l5886L6822
14982A64J2493M1103L540o6284k7332N2781m4452r3046l9957N7358M0015P284
14970e6333p8323o4557J6500K2651K0878Q2549L5606j6690J5590k1309k421N6879
14958A1020K0943m0219L8490J2281R441r3684n9909R3294M1832m7198n4929n3635
14946a22273K8834K2409o5873O2163R6395L5336k2741l2628k0942q285p11j9392
14934d7708n3298P850R2394l9240j27330K9998P8719L5357N1559J5773N322l8136
$$ plain form
15018 -51028 -66788 -44385 36880 40764 -8010 -50321 -16488 -30964 -74452 -16381 29062 19187
15006 19187 -88491 -125808 -78967 -56310 -30560 28886 93635 56747 51722 -5552 -24472 25962
14994 25962 29110 114376 102241 59760 36518 30377 56158 22435 12461 -772 -36658 164
14982 164 12657 53760 57300 -8984 -36316 16465 -27987 -121033 -160990 -103632 -63617 -56333
14970 -56333 -134656 -199213 -182713 -160062 -139184 -56635 -21029 -37719 -22129 -43438 -45859 11020
14958 11020 31963 -8256 30234 42515 51956 -41728 -101637 -8343 33489 -13709 -68638 -122273
14946 -122273 -93439 -71030 -136903 -74740 21655 56991 34250 1622 -19320 -27605 -28316 -47708
14934 -47708 -101006 -93156 -762 -40002 -167332 -137334 -58615 -23258 28301 44074 49396 11260
14922A1260n8952N5379J9115m5081k9449J3453L5739j2138j3152j9413P2210K4
14910B8995n6555k7417j7606J6680Q1932n0332q8039j6959k3611K1439O5098l4674
14898a01049o5578J0802M3392O7502m4647m6103O0550N909L7570O2042o2452r2143
14886a24205m4298J9230Q5368O4555J6458o1487n3818Q330k9536J9646l5633N4345
14874h1045K7101n4919J1469r994J884J1381L5369j853P1893N2132K684K7527
14862I3629K257L0425o4303j05600P4703N8864r8719k3487q4237L4061M2322M1338
14850A253K3306p2268k377k8257L9284J1472L834L3324j23692L7288L4453n6480
14838i8860N674O2216Q7858l4576j06351j120Q6484l0064n6534L3209O270J06332
$$ plain form
14922 11260 -47692 7687 26802 -18279 -47728 -34275 1464 -10674 -23826 -43239 28971 28995
14910 28995 -27560 -54977 -72583 -55903 26029 -24303 -112342 -129301 -152912 -131473 -66375 -101049
14898 -101049 -166627 -155825 -112433 -44931 -89578 -135681 -75131 -69222 -31652 30390 -32062 -124205
14886 -124205 -168503 -149273 -63905 650 17108 -44379 -98197 -89867 -119403 -99757 -135390 -81045
14874 -81045 -53944 -108863 -97394 -107388 -105504 -94123 -58754 -60607 11286 63418 66102 93629
14862 93629 95886 126311 62008 -43592 31111 89975 -8744 -32231 -116468 -82407 -40085 1253
14850 1253 24559 -47709 -50086 -78343 -39059 -27587 -23753 9571 -114121 -76833 -42380 -98860
14838 -98860 -93186 -30970 56888 22312 -84039 -85159 1325 -28739 -85273 -52064 -45794 60538
14826F0538N1993m6655n8160k3244L7283P778m5450k0176M8271Q204j3562P0448
14814G7268m4615q916m4889j13955k5988J28605M9844o9482n312J22122j6640
14803D8042p0764n2902Q0833P1750n3510R834n9968M5195K2384R673r828l0162
14791A0577l5183o8456K9012K3433m470K2120P3670j4832o5381m8440L9331M7845
14779I226m6647j6339K6911P837O3743m8204j2816n0267M167J0973Q4935M9903
14767H3422l0392p5569p1767J0108O7453R9345M6490L5786k8219J1873j9772R263
14755A38021m4249o0728l2299N3550Q4392N113j48151j07642k5616L2364j5519
14744a20764O4703P2781j6660L9765R108l3157m8832L1123L9992o8527o6665j2865
$$ plain form
14826 60538 112531 65876 7716 -15528 21755 29533 -15917 -36093 12178 20382 6820 77268
14814 77268 32653 23737 -21152 -135107 -161095 -32490 17354 -52128 -57440 64682 48042
14803 48042 -22722 -75624 5209 76959 23449 33283 -26685 18510 40894 50567 40739 10577
14791 10577 -24606 -93062 -64050 -40617 -45087 -22967 50703 35871 -29510 -77950 -38619 9226
14779 9226 -37421 -53760 -26849 -19012 44731 -3473 -16289 -66556 -62389 -51416 33519 83422
14767 83422 53030 -22539 -94306 -84198 -16745 82600 129090 164876 136657 148530 128758 138021
14755 138021 93772 33044 745 54295 138687 143800 -4351 -111993 -137609 -105245 -120764
14744 -120764 -56061 16720 60 39825 48933 15776 -33056 -1933 38059 -30468 -97133 -109998
14732a09998P9597K2805l2507J9320l4443q8810M1907l9955Q9613O6243J2628
14721B6400J1771k3611n0457j01559j6228M9812M9286M4932m0169K4907M3484
14710A8568O4803J3441L9189j4636n9020q8194L1988k4091k3467J0100P7843P3339
14698A19863q6029n0149J3314l591M3924J2275j1432n6212o1892r903l3484k2073
14686a45389L1255K8251N8335m699M1701N3690M0659q6210K0829m3298p4460K8686
14674e0650Q398n3243N1387j043K8133N3859j0197j2967P9117J9216k1574j04171
14662a3735l7154j16186m9931j4010P600J10765k7429J6535M8963J8221K4790
14651c1571m664m863j2498j0444m9282m0774Q0362k741m7846K091J2559J4718
$$ plain form
14732 -109998 -30401 -7596 -40103 -20783 -55226 -144036 -102129 -142084 -52471 13772 26400
14721 26400 38171 14560 -35897 -137456 -153684 -103872 -54586 -9654 -49823 -24916 18568
14710 18568 83371 96812 136001 121365 62345 -25849 6139 -17952 -41419 -31319 46524 119863
14698 119863 33834 -16315 -3001 -6592 37332 49607 38175 -18037 -79929 -89832 -123316 -145389
14686 -145389 -114134 -85883 -27548 -32247 9454 63144 103803 17593 38422 -4876 -79336 -50650
14674 -50650 -42252 -95495 -44108 -45151 -17018 36841 26644 13677 92794 112010 90436 -13735
14662 -13735 -50889 -167075 -217006 -231016 -223416 -112651 -140080 -123545 -74582 -56361 -31571
14651 -31571 -36235 -41098 -53596 -64040 -113322 -154096 -73734 -76475 -124321 -122230 -109671 -94953
14639i4953M8216J06512n2543l3055p816k0155k5832M5486j897m3143l5042K6007
14627h8215M6641j0302K898M8462M8627Q6199k2998n1054k4202P794k1111k126
14615B0613O317J43720j4262m2001l3812K455M2792M512o5320p9096l205j380
14603a8667o2640J2027O5990R1535K1414l7047o9372K0241M2470m747l585L7900
14591I5519j6971L3277r148p2814m8411r923K9740M4903j1280l0205J942j4730
14579h101J04867q4949j04408j4151J5145K6309R0R6494J7643J5862M7914k1731
14567I0984l9986K655o6980n6265r4263l4200M9303j2195j2448l7243J12957P1197
14555b6484M0226Q377o459m4010N228M5968K4545M0952j1577K2017K9337n0900
$$ plain form
14639 -94953 -46737 59775 7232 -25823 -33639 -53794 -79626 -34140 -36037 -79180 -114222 -88215
14627 -88215 -41574 -51876 -48978 -516 48111 134310 111312 60258 36056 43850 22739 20613
14615 20613 26930 170650 156388 114387 80575 83030 125822 130334 65014 -14082 -17287 -18667
14603 -18667 -81307 -69280 -3290 88245 109659 72612 3240 23481 65951 61204 57619 95519
14591 95519 78548 111825 102677 29863 -18548 -28471 1269 46172 34892 4687 6629 -8101
14579 -8101 96766 11817 -92591 -106742 -91597 -65288 -65198 31296 48939 64801 112715 90984
14567 90984 50998 53653 -13327 -69592 -163855 -198055 -148752 -160947 -173395 -210638 -97681 -26484
14555 -26484 13742 22119 15660 -28350 -23122 22846 47391 88343 76766 98783 128120 77220
14543G7220J2596L1686j7029q2725o233M7008O0156k4064n6853J0978k3050J1840
14531D1530j8557m3276o4300N8392L0065L1291j6691M1269j0755J0208P7136m9958
14519H6354R19j22112n111K9736j611q9573Q4758m3381k3794R1449K9014K1569
14507E8217M1159n2481o3732O3119M0801n6672m4001k9797q4002O1448Q7034n7679
14495c6586p1794M3666J8862M9228Q281j17552j1470J7919J42259M1028n8142
14484B5699j6119L2313K8187k2880K1511p2387M544K1349K7695n6678j5560L6663
14472A4337L3708L0025p162R41p3620j1646R5299o752l0704p2658j00527J4301
14460a14458M4057j443M0803O3721J4926j0450P956k5203k3798j0918J5739m3996
$$ plain form
14543 77220 89816 121502 104473 21748 15515 62523 122679 98615 41762 52740 29690 41530
14531 41530 22973 -20303 -84603 -26211 3854 35145 18454 59723 48968 59176 136312 86354
14519 86354 87273 -34839 -39950 -10214 -11825 -101398 -16640 -60021 -83815 7634 36648 58217
14507 58217 99376 46895 -16837 46282 87083 30411 -13590 -43387 -127389 -65941 21093 -36586
14495 -36586 -108380 -64714 -45852 3376 11657 -105895 -117365 -99446 42813 83841 25699
14484 25699 9580 41893 70080 47200 68711 -3676 868 22217 49912 -6766 -22326 14337
14472 14337 48045 78070 70908 71849 -1771 -13417 81882 75130 44426 -28232 -128759 -114458
14460 -114458 -70401 -71844 -31041 32680 47606 37156 45112 19909 -3889 -14807 932 -43064
14448d3064j2897k6488J6780r249L4681L7593m0786K2813j8901l5125n3062Q4384
14436d3321J02630q5436k8194j0015K3437L4707j1535O6802K4096o3517K812N8328
14424G0794K1565J7711j3621j5395J8137q689K883k0478j5504K615R738J2432
14412H2188N9105J599j0760J255K8258J20530R3085K33668K80505K65600L06985
14401A462018K21557K13370J92350q4655k56125k89096k58253k90174l03032j81449
14391D26511o3026p2116j34006j0055k8196o9346o9664k4783M8213L3011L0049
14380F6592q91r392J0552K4066o0267l5265o066k6101k3994K7047M8404J15183
14368A29868R4008J7764n5603K3771q5792m2953J2601P7804m622j1889J307L6794
$$ plain form
14448 -43064 -55961 -82449 -65669 -74918 -40237 -2644 -43430 -20617 -39518 -74643 -127705 -43321
14436 -43321 59309 -26127 -54321 -64336 -40899 -6192 -17727 49075 73171 9654 12466 70794
14424 70794 92359 110070 96449 81054 99191 90502 93385 72907 57403 60018 69756 82188
14412 82188 141293 142892 132132 133387 161645 282175 375260 608928 889433 1155033 1462018
14401 1462018 1683575 1896945 2089295 2004640 1748515 1459419 1201166 910992 607960 426511
14391 426511 363485 291369 157363 147308 119112 49766 -19898 -44681 3532 36543 66592
14380 66592 65701 56309 66861 90927 30660 -4605 -10671 -36772 -60766 -33719 14685 129868
14368 129868 223876 241640 186037 209808 124016 81063 93664 171468 166846 154957 156264 193058
14356A93058r905o3765m7499n8961r040K9514l1466q5996k8934L6896N1351K6464
14344A717P504K7248k8909n2579M5310N5119p8390k2667k0684j2664P2678K7156
14332B0839K454k0351l3214o5134n5887N9156j3150l423l697K5074M6152Q1815
14320D0634r6023l2202j4454m5168N4182M9188L2286o55M4437o9725j00045N6239
14308h1306p908o4246N2804J27222N0713N1397n0424m7561q2453r5680l8235J675
14296a84002O8944m2474L9601O6913l3248k5k6961q875m4943l8251O7598R2776
14284d2947Q6884j6456k6350J202j6843k4588N8695J0830j10000j13042O7805
14273a24810M6377j07098j494N1928O0858K3040K447J1157J06732N5935K1572
$$ plain form
14356 193058 183153 119388 71889 12928 3888 33402 1936 -84060 -112994 -76098 -24747 1717
14344 1717 9221 36469 7560 -45019 291 55410 -22980 -45647 -66331 -78995 -6317 20839
14332 20839 23293 2942 -30272 -95406 -151293 -92137 -105287 -108710 -112407 -87333 -41181 40634
14320 40634 -55389 -87591 -102045 -147213 -93031 -43843 -11557 -12212 32225 -37500 -137545 -81306
14308 -81306 -89214 -153460 -100656 26566 77279 128676 78252 30691 -51762 -147442 -185677 -184002
14296 -184002 -115058 -157532 -117931 -51018 -84266 -84291 -111252 -120127 -165070 -203321 -135723 -42947
14284 -42947 43937 27481 1131 2333 -14510 -39098 19597 30427 -79573 -192615 -124810
14273 -124810 -78433 -185531 -187025 -135097 -74239 -51199 -48752 -37595 69137 125072 146644
14262A46644n1518M369J0946m0622k0714o6985J22577m4475m7204O7875k6810
14251E4083j1383N7238l8874l9921n6278K3162K5101J3413L7547P3197m2709n2637
14239D1939o4795k8493k0045n616n104o8632m7411M8194K0157N480o150K0279
14227a10197j348L6032K7285k0388N34R5906J9300L8255L5605j6092m8835p3772
14215a7715P919l126q4134m5694J06124O8984R4993p321m1615K5471j4304j8259
14203G1323M8762N7918K9896q4911m9084m382n4261k2944k3227L0096J21162N2291
14191A72639K7349m2092j06922k2606n2176j2672J2325N722m7357K8712O9934
14180C2856N2815J07455R5005N9359L5077n339l0882q4603m5148p6381n0979J2769
$$ plain form
14262 146644 95126 99495 110441 69819 49105 -17880 104697 60222 13018 80893 54083
14251 54083 42700 99938 61064 21143 -35135 -11973 13128 26541 64088 137285 94576 41939
14239 41939 -22856 -51349 -71394 -77010 -82114 -150746 -198157 -149963 -129806 -124326 -130476 -110197
14227 -110197 -111545 -75513 -48228 -68616 -68082 27824 47124 85379 120984 104892 56057 -17715
14215 -17715 -9796 -12922 -97056 -142750 -36626 32358 127351 120030 78415 103886 89582 71323
14203 71323 120085 178003 207899 122988 73904 69522 15261 -7683 -30910 -814 120348 172639
14191 172639 199988 157896 50974 28368 -23808 -36480 -24155 -18433 -65790 -37078 32856
14180 32856 85671 193126 288131 347490 382567 377228 346346 261743 216595 140214 89235 102004
14168A02004L0677j4831l1802j1208j7875q3167k2459K8714O4772M7926N2377
14157A45128l0505r7670l3213m4086k4446O4443j978J2479m8674j9229q423m7175
14145a33349O5289J3710P505k8944N6680M7484k1013k4747K655K2302J8246K1717
14133D7535O2195L2835k5065L0222K0979J3555r7462j08855P2623O8193O019p1241
14121E1533o7360N6686K6609o6310k2724p244K4316Q4545N5383m5275J2531O0118
14109A62808R0328j0663q1201K266j2375N955K0879j6563j065j4861P7711O5626
14097B88845j5242n134o1042q7839j5653k7823l8843j9108L907m7028m9772l330
14085g8062Q289r8061M4823P8211O897l7609R1852N7O5774L128j5256j5136K3070
$$ plain form
14168 102004 132681 117850 86048 74840 56965 -26202 -48661 -19947 44825 92751 145128
14157 145128 114623 16953 -16260 -60346 -84792 -20349 -22327 -9848 -58522 -77751 -86174 -133349
14145 -133349 -68060 -54350 -46845 -75789 -19109 28375 7362 -17385 -14730 7572 25818 47535
14133 47535 109730 142565 117500 147722 168701 182256 84794 -24061 48562 116755 122774 51533
14121 51533 -15827 40859 67468 1158 -21566 -28810 -4494 80051 135434 90159 102690 162808
14109 162808 253136 242473 161272 163538 151163 157118 177997 161434 160369 145508 223219 288845
14097 288845 273603 268469 207427 119588 103935 76112 37269 18161 22068 -24960 -74732 -78062
14085 -78062 -69773 -167834 -123011 -44800 -37903 -75512 16340 16397 82171 85299 70043 54907 77977
14072G7977N6851k4511M4370J4472j28924j29862K5066P8554K2268m1256n2335
14061e7330L7194L0746M4665r790q0767j8634J30833J0085r1276n0871J07805
14050E2660L87j9748N2205N4886o5813q7545p1179m1822R2797j7045l8709M1300
14038d7626N7585Q7567l3856o8483j4530l0150R5276L4010N1279M0256n5776m3923
14026G1629o2123n5660J0744M8733L1242N2500q881q936r288K7129J8604m3043
14014G2650k7889J27600M6645q6055o3295m1054r8115M518J07350l6969n7561
14003e2175n1568n6742L9153N9953M7839M6516J078m865N494k918P4421J3514
13991A19700j887j08089L6531J45750J0211n421R480J1667M1269k6067k1830l5600
$$ plain form
14072 77977 134828 110317 154687 169159 40235 -89627 -64561 13993 36261 -4995 -57330
14061 -57330 -20136 10610 55275 45485 -35282 -53916 76917 87002 -4274 -55145 52660
14050 52660 53047 33299 85504 140390 74577 -12968 -84147 -125969 -33172 -50217 -88926 -47626
14038 -47626 9959 97526 63670 -4813 -19343 -49493 45783 79793 131072 171328 115552 71629
14026 71629 9506 -46154 -35410 13323 44565 97065 88184 79248 69960 97089 115693 72650
14014 72650 44761 172361 219006 132951 69656 28602 -69513 -64995 42355 5386 -52175
14003 -52175 -103743 -160485 -121332 -61379 -13540 32976 34054 29189 34683 31765 106186 119700
13991 119700 117813 9724 46255 192005 202216 196795 206275 217942 259211 233144 211314 175714
13979A75714R9732J08485K2427o3088l7020k988k2855N6307j45052m2160Q6765
13968B36267N2205N1454P4560J64527J10865K3672J61185P0152K8417O1378R6453
13957A131135J8783l5225Q266J30805M7271Q7461J87518J07518J66458K44068
13947B094058L03824L93224M92632O79596R19712J153597J190642J102349J318364
13938I647998J595602J184026R05623J497711J905503K142278L172070N232760
13930B7283571Q494474J3964810K3501363L9441247N9957641O6909231N1556194
13923B91108531M4875019N0529801J3272396m2708265n2446000m3461903n7993111
13916B03176468o4448576m5771121k6908070j6294573j0510351p166845m900033
$$ plain form
13979 175714 275446 383931 406358 343270 306250 303262 280407 336714 191662 149502 236267
13968 236267 288472 339926 414486 579013 689878 713550 874735 944887 973304 1034682 1131135
13957 1131135 1149918 1114693 1122959 1253764 1301035 1388496 1576014 1683532 1849990 2094058
13947 2094058 2397882 2791106 3283738 3963334 4883046 6036643 7227285 8329634 9647998
13938 9647998 11243600 12427626 13333249 14830960 16736463 18878741 22050811 27283571
13930 27283571 35778045 49742855 73244218 112685465 172643106 239552337 291108531
13923 291108531 335983550 386513351 399785747 357077482 304631482 261169579 203176468
13916 203176468 138727892 92956771 66048701 49754128 39243777 32076932 27176899
13909B7176899l243248k113309j821935j701129j502076j744435j840467j765570
13901A1444730j602971j542040j178655q68065o78618m53551l38370k53690l55328
13892D173442k95039k34150l00283l36718j64737j59015k67570j48663j36319
13883B130948r4404r6533j38070m5334j6125q008N280m7866j35875j6056K7386
13872A565343m5539q9341j34562j03652l4385m3729k0431j9317j00469o8826p148
13861H97944K0370R211n667m2075k5854K9923j4915k5079m3599K5828r9224o9141
13849F57722M6493L7288o6169Q7261N8782j9369J0623n5004p3285k1418l5828
13838F27096o0662j8584m1902n7732o5887j280M097J5597L0982J8835Q4983M8523
$$ plain form
13909 27176899 23933651 21820342 19998407 18297278 16795202 15050767 13210300 11444730
13901 11444730 9841759 8299719 7121064 6252999 5574381 5120830 4782460 4528770 4173442
13892 4173442 3878403 3644253 3343970 3007252 2842515 2683500 2415930 2267267 2130948
13883 2130948 2036544 1940011 1801941 1756607 1740482 1732474 1737754 1689888 1554013 1537957 1565343
13872 1565343 1519804 1430463 1295901 1192249 1157864 1114135 1093704 1074387 973918 905092 897944
13861 897944 918314 927525 921858 879783 853929 883852 868937 843858 800259 826087 726863 657722
13849 657722 704215 741503 675334 762595 821377 802008 812631 757627 684342 662924 627096
13838 627096 566434 547850 505948 448216 382329 381049 385146 400743 431725 450560 535543 584066
13826E84066j8189q6388l4252L060J2050k8482r1189J214k0285l1223Q89K249
13814B93520r798O0011N709P2534L1434J09225L9615k8277L4003j9627n1065n5402
13802D81882j7104M330m6717j6806k5035o4050L673M1913m9010q9424K9945P3805
13790C27402j6294p0895O2914J20520m3112r3482l3827n6897o4902M5818k1675
13779A55570l4363M7779J24513Q3500o5201m1429k6168J9974j8743M2408K7939
13768C15779k7515k4268m8752K5376l1192l4478O2366J8288O202o4667K3229l084
13756B17284n6975l6595L117j0631n3593L3309k5929J1192q7842n508o9186p6094
13744a57451J1998J08950J07187k9638q1392m3394M9552J6730l6659l5256R1738
$$ plain form
13826 584066 565877 479489 445237 448297 460347 431865 340676 341890 321605 290382 291271 293520
13814 293520 283722 343733 349442 421976 453410 562635 602250 573973 607976 588349 537284 481882
13802 481882 464778 469108 422391 405585 380550 316500 320173 362086 313076 223652 253597 327402
13790 327402 311108 240213 303127 423647 380535 287053 253226 196329 131427 177245 155570
13779 155570 121207 168986 293499 376999 311798 270369 244201 264175 245432 287840 315779
13768 315779 288264 263996 215244 240620 209428 174950 237316 255604 261806 197139 220368 217284
13756 217284 160309 123714 126831 116200 62607 95916 69987 81179 -6663 -12171 -81357 -157451
13744 -157451 -145453 -36503 70684 41046 -40346 -83740 -34188 -17458 -54117 -89373 2365
13733B365J0951Q272L9695Q8281n3789k026k5953m7631J7356J4167J01040M1399
13721A94127k4322M9768m1265m8494p344o2968l8836j1239j1543K0537K8461P5580
13709A22462N5961K1303k5183K0402L9885n6252l3511j3154O1978N9831o3799
13698A89923p2600q4248l5733N7912P5407O02l9689n0696J4510m1488J3305O8961
13686I6166K038N935J2755k5396J3734j5501j209J3471N2954M6702O359K184M3402
13673B53594k4095r026q6570m2383k5884o7866N88L6078N5283K3316O940m2938
13661G7037K9345m4273q1188m6844M6225J47806K9841l0339l5398O610M2264l3500
13649A07586J959L0034p63j4500n3069P4219L633l2304j0889M6223O6248j5953
$$ plain form
13733 2365 13316 21588 61283 149564 95775 93749 67796 20165 37521 51688 152728 194127
13721 194127 169805 219573 178308 129814 122470 59502 20666 9427 -2116 18421 46882 122462
13709 122462 178423 199726 174543 194945 234830 178578 145067 131913 193891 253722 189923
13698 189923 117323 33075 -2658 55254 130661 131263 91574 40878 55388 13900 27205 96166
13686 96166 98204 104139 116894 91498 105232 89731 88522 101993 154947 201649 208008 210192 253594
13673 253594 229499 220473 133903 91520 65636 -2230 -1642 34436 89719 113035 119975 77037
13661 77037 106382 62109 -19079 -65923 -19698 128108 157949 127610 92212 98822 141086 107586
13649 107586 109545 139579 138816 124316 71247 145466 149099 116795 105906 152129 218377 202424
13637B02424r531P601m2294j1910L8719k8189J1967m13o3527L4734l6038q6627
13625A6916o5403N2287P0093Nk2348K1742N2286m1194o6702M0855J01263P5095
13613B34895q8624k7458q430P3219k1576l37l0600o293K0713m2165m6476j8697
13601C8171O2134N6245J0492N9949q787o4356j0617o0103o8807L851k602K9764
13589D5334l2442K0735J666J8299r187K4134M2418L982m1317r5062k7357Q6614
13577C7817n914m6971P7127j9422K0711L7872k9941j9446p9843n1861M2748k7570
13565f4693L186o6559J9661J02674J24304L7402j8149j05709j8716Q606N4584
13554G6591J3957q3330n6481N9021L2522l1541J00296O948j4076r3656P6871O3593
$$ plain form
13637 202424 192893 200494 158200 146290 185009 156820 168787 168374 104847 139581 103543 16916
13625 16916 -48487 3800 73893 73898 51550 73292 125578 84384 17682 58537 159800 234895
13613 234895 146271 118813 110383 183602 162026 161689 131089 124796 145509 103344 56868 38171
13601 38171 100305 156550 167042 226991 218204 153848 143231 83128 14321 18172 15570 45334
13589 45334 12892 33627 35293 53592 44405 68539 110957 114939 73622 -21440 -48797 37817
13577 37817 31903 -15068 62059 42637 63348 101220 71279 51833 -28010 -79871 -37123 -64693
13565 -64693 -61507 -128066 -108405 -5731 118573 155975 137826 32117 13401 22007 76591
13554 76591 90548 7218 -49263 9758 42280 10739 111035 117983 103907 10251 87122 150715
13542A50715J8198n7715N482k6964L9789J6542J768O8236l5301K9732q935r514
13530A92033l8407l5090J047q83K8023k7771k1490N7308L0999K6865p8373n2809
13518H1452j5132m9832O200L5040L5153n5307K8916L9878o3500j4750P433k9188
13506F363j8701K3099j05822m8919Q9453R5773O511m3975N1704K3934j5807J3934
13494G7547L1785l7542n3568O9954N8715j449j4259j00458J5509L3877r6043j3209
13482b9141O2611N8987k48J5790k1288l8833L9478l7253J025l3845J00524R5216
13470B13023l674r62K0699l0981m2432o3954r584l4771J0910O8449k6276o4212
13458C6235k1311L2108r04n089L4796Q925O0870M7997k4262m2225N8301J9380
$$ plain form
13542 150715 168913 111198 116680 89716 129505 146047 147815 216051 180750 210482 201547 192033
13530 192033 153626 118536 119583 118700 146723 118952 97462 154770 185769 212634 134261 81452
13518 81452 66320 16488 22688 57728 92881 37574 66490 106368 42868 28118 35551 6363
13506 6363 -12338 10761 -95061 -143980 -54527 41246 47757 3782 55486 79420 63613 77547
13494 77547 109332 71790 18222 88176 146891 145442 131183 30725 46234 80111 -15932 -29141
13482 -29141 33470 92457 92209 107999 86711 47878 87356 50103 51128 17283 117807 213023
13470 213023 209349 208387 229086 198105 155673 91719 82135 47364 58274 126723 100447 36235
13458 36235 14924 47032 46128 41039 75835 84760 145630 193627 169365 127140 185441 204821
13446B04821K8362M0300J2440J24351L70922L56663K27078K53204K67567K46154
13436B131862j06644k43040j33072k16727l15448l42858k38323r2057p2435j66865
13426B04393o5221n325l5919j4748N2440o6105j6809p459L4958M2467k70k8141
13414I4261J516K2420L3637J2697M2505k861m7449n3733J8720l047k9268K2350
13402A11748J12990p697k8445j2933l9830J320J9116j9816j25799k8071p689L0463
13390E357K0776q641q0280l2056N2476K772P9162N1897Q417K6765p1743l1627
13378B3275j7371k3207O494J39900L1311r1543K5884k7537M2221p4506j6904K1097
13366C9114r21M3053p5995K007Q9174k611o1688p7089j8993Q2458R311N179m7027
$$ plain form
13446 204821 233183 273483 285923 410274 781196 1137859 1364937 1618141 1885708 2131862
13436 2131862 2025218 1782178 1649106 1432379 1116931 774073 535750 443693 371258 204393
13426 204393 139172 133847 97928 83180 135620 69515 52706 45247 80205 122672 122402 94261
13414 94261 95777 118197 151834 164531 207036 204175 156726 102993 121713 118666 89398 111748
13402 111748 224738 217041 188596 175663 135833 137153 156269 136453 10654 -17417 -25106 5357
13390 5357 26133 17492 -62788 -94844 -42368 -39596 39566 91463 99880 126645 54902 23275
13378 23275 5904 -17303 -10809 129091 160402 68859 94743 67206 109427 34921 18017 39114
13366 39114 38193 81246 5251 7258 96432 93821 32133 -44956 -63949 18509 27820 32999 -14028
13353a4028r0757k5449O0855J01693M7183J8514l6084o1012m193L8891R811p549
13341C7875m3753o5426j5125P8325Q2686k1862j9179K9293L4326p8037o1429M7185
13329D879m6540m3964j437j7591L7188L5549J08159k313n6910M011l3148K6888
13317A4771O433n5441o0352j1129M4248P4971O4751L9343O988J5394J2277n4560
13305I7694N9627L4971n645n1172o2615M7440l4406K9996J595l2429o9529p1044
13293e5517R631P814k7122L2686L2216K2058j824N6690O557p8737N6519M1382
13281A02353p0235j17209r3141K4502K7357M0353L7420m0435M5455J4488l2566
13270f1658j7141l0700Q0302Q6262l5388n3276j22032l7940P0564L0867l1175
$$ plain form
13353 -14028 -104785 -130234 -69379 32314 79497 98011 61927 915 -3278 35613 45424 37875
13341 37875 -5878 -71304 -86429 -8104 74582 52720 33541 62834 97160 19123 -42306 4879
13329 4879 -41661 -85625 -87062 -104653 -67465 -31916 76243 73930 17020 21031 -12117 14771
13317 14771 21204 -34237 -94589 -105718 -61470 13501 78252 117595 124583 139977 152254 97694
13305 97694 157321 192292 186647 135475 72860 120300 85894 115890 117485 85056 15527 -55517
13293 -55517 -45886 -38072 -65194 -32508 -292 21766 19942 76632 83189 4452 60971 102353
13281 102353 32118 -85091 -178232 -153730 -126373 -86020 -48600 -89035 -43580 -29092 -61658
13270 -61658 -78799 -109499 -29197 57065 21677 -31599 -153631 -191571 -121007 -90140 -121315
13259a21315K3039N4965J7613l5609N8268P2615m935r1606o0577N0421K4874R122
13247c125L7503m0774p5479o5971J3123N3745N9446p222K5456J9774N0049n1958
13235A4567k3616N0435l6253Q504P3135R334r4972m1230O7508m4179o440n9397
13223h2604k8977N4882P1724M8042K5425J0557J1941P9919N4409m6781O30j2509
13211A86658m75n1985j24409n6584Q499K1394O1985L6051q7136j26828O1914J20396
13199D9480Q9985l2611j16155J8513O9589j9336k7548r9988q4383K3412N5774
13188g3268J7659r2267l2725R1378l35N8335J5314L7612n932L498O3442K0289
13176A03000l4572q6181j3814k5741k1345P7990M3295R218m0441r6807M805R4917
$$ plain form
13259 -121315 -98276 -43311 -25698 -61307 -3039 69576 64641 -26965 -87542 -37121 -12247 -3125
13247 -3125 34378 -6396 -81875 -147846 -134723 -80978 -21532 -28754 -3298 16476 66525 14567
13235 14567 -9049 41386 5133 13637 86772 96106 1134 -40096 27412 -16767 -23207 -82604
13223 -82604 -111581 -56699 15025 63067 88492 99049 110990 190909 245318 198537 199167 186658
13211 186658 186183 134198 9789 -46795 -38296 -16902 45083 81134 -6002 -132830 -70916 49480
13199 49480 139465 106854 -9301 9212 78801 59465 31917 -68071 -152454 -129042 -73268
13188 -73268 -55609 -147876 -180601 -89223 -89558 -31223 -15909 21703 15771 19269 82711 103000
13176 103000 68428 -17753 -31567 -57308 -78653 -663 42632 51850 11409 -85398 -80593 14324
13164A4324J17221J6467j9738l7579o809K6707R60Q5785l4440r2377k4099j6315
13152C0107o3739j5853N986J1734r8127N341O3230Q6033P1178P435q9852j7820
13140d347J358k1814j14430l1231J043N1449O3834N802K0800N872J9642J9167
13128A7145P876N276j614J8297K7169k6406n7029N5510j0872k8657M6068K9467
13116H2230p00m9897k2709l7790o7247J2377l6500J1668P8113L2836m3384K7085
13104a3918N5682m8101o7477j1944l4676K2035k7562O1374L3346J8725L9151m0970
13092a4335m4777P320N0848o2093j7587k5725k2690K66O5408L0633n354j2095
13080e0181n2844R9868P1046j3100l6593r0603m1814M2920R4471k7601n6322k8222
$$ plain form
13164 14324 131545 148012 128274 90695 83886 110593 111553 197338 162898 70521 46422 30107
13152 30107 -33632 -49485 -43499 -31765 -129892 -124551 -61321 24712 95890 103325 13473 -4347
13140 -4347 -2989 -24803 -139233 -170464 -169421 -117972 -54138 -48336 -27536 -21664 -2022 17145
13128 17145 25021 30297 28683 46980 74149 47743 -9286 46224 35352 6695 52763 82230
13116 82230 81530 31633 8924 -28866 -96113 -83736 -120236 -108568 -30455 2381 -41003 -13918
13104 -13918 41764 -6337 -73814 -85758 -120434 -98399 -125961 -64587 -31241 -12516 26635 -14335
13092 -14335 -59112 -51792 -944 -63037 -80624 -106349 -129039 -128773 -63365 -32732 -38086 -50181
13080 -50181 -103025 -3157 67889 54789 18196 -72407 -114221 -71301 23170 -4431 -60753 -88975
13068h8975r3371N0005j0448j2126N0230M2624Q2019m1090m765P2274N0843O356
13056A03576m0846M956K9992j5871k2384K9038K5079o6409l0616J5979m5828o319
13044a9653m3954r15J28490J3977j11264j9978o6969M0983K2748q9171J8017J13083
13032a4606K7842j7323r879j8560m2870n6461j37867m3895J26607J29442P114
13021e0456L7208P776R327L9283l1623k2632r476j31765l0659R3050P7642L8767
13009B6442o971N0788J9822m4501J0963J0177k0123r473K8244m9938o5120l477
12997e3167K1695O132P2089N6633k1515k6440q47J2071j2787j04371L6021J9522
12985E036q714m0692J6602N767m6699M6312J22305p130k0752P572K7389n2297
$$ plain form
13068 -88975 -182346 -132341 -142789 -154915 -104685 -62061 19958 -21132 -25897 46377 97220 103576
13056 103576 62730 67686 97678 81807 59423 88461 113540 47131 16515 32494 -13334 -19653
13044 -19653 -63607 -64522 63968 77945 -33319 -53297 -120266 -79283 -56535 -145706 -127689 -14606
13032 -14606 13236 -4087 -13966 -32526 -75396 -131857 -269724 -313619 -187012 -57570 -50456
13021 -50456 -13248 -5472 3855 43138 11515 -11117 -20593 -152358 -183017 -89967 -12325 26442
13009 26442 19471 70259 90081 45580 56543 66720 46597 37124 65368 15430 -49690 -53167
12997 -53167 -31472 -25340 46749 103382 81867 55427 54580 66651 53864 -50507 -14486 5036
12985 5036 -3678 -44370 -27768 -22001 -68700 -22388 99917 92787 72035 79607 106996 54699
12973E4699l5366P787o6722j9727M0151J9656J9874N059l5707N0626N672n8047
12961a2045Q63M6825M0593q674n4842l0334N2074P9078M4626j6218p3626o3892
12949D428M0520k4890L8224l9219m0598Q0074n8672j3925L0256n7150j5323L3856
12937b2419k6752q733K6664n2590n2756J064M0898J55394J1987p956M6935L2460
12925A44196j63k2940j00748j4922M4978k8607r577L4168k7450o5925p9146R2927
12913c3209J05892o8188l5568L2207Q2930p812j00652j9780L6854n5309k9262
12902i1897n8873k4886R2715P4242J9084K472n9211m0293L8973L5170L715o8332
12890g7121J2486O9365K6123m9193k9256J6112P2241J7780o9173o341l7380m2286
$$ plain form
12973 54699 19333 27120 -39602 -59329 -19178 478 20352 25411 -10296 40330 46002 -12045
12961 -12045 -11182 35643 76236 67562 12720 -17614 34460 113538 158164 141946 68320 4428
12949 4428 44948 20058 58282 19063 -21535 58539 -133 -14058 16198 -40952 -56275 -22419
12937 -22419 -49171 -57904 -31240 -83830 -136586 -135522 -94624 60770 72757 64801 111736 144196
12925 144196 144033 121093 20345 5423 50401 21794 12217 46385 18935 -46990 -126136 -33209
12913 -33209 72683 4495 -31073 1134 84064 76252 -24400 -44180 -7326 -62635 -91897
12902 -91897 -150770 -175656 -82941 -8699 10385 12857 -46354 -86647 -47674 -12504 -8789 -77121
12890 -77121 -64635 4730 30853 -18340 -47596 -31484 40757 58537 -10636 -16977 -54357 -96643
12878i6643j5138L2176J70813K2588m3791K2433l1824j00249K4918P136K5522
12867A7941K9764o029k9248l8341J4581Q4254n5360o7675o4444M7234k233j1407
12855h0963l3818K9688J48744j9434q5547O5487M6421l4624J3977l5061r0735
12844g5865R4597L0148K8006j8774k8185L6484j045k574l1789k9119m924K6519
12832B3479L6039Q3682L40m9523j28700n853m2563O358N9008L4069J0367O4201
12820I0904q6521n0381O5285M3048O3299K5243n2287l4924J2954j7124O1801j5271
12808A06026K8769j7365k5278N723n4625m4978q91K080o1389J7793R5158m6950
12796D073r8494J037k2354M2069J08050K2926l828j12905j10958N8023R2555M689
$$ plain form
12878 -96643 -111781 -79605 91208 113796 70005 92438 60614 -39635 -14717 -7581 17941
12867 17941 47705 41676 12428 -25913 -11332 72922 17562 -50113 -114557 -67323 -69556 -80963
12855 -80963 -114781 -85093 63651 44217 -41330 24157 70578 35954 49931 14870 -75865
12844 -75865 18732 48880 76886 58112 29927 66411 65366 62792 31003 1884 -3040 23479
12832 23479 59518 143200 143540 94017 -34683 -40536 -83099 -76741 -17733 16336 26703 90904
12820 90904 4383 -45998 19287 62335 125634 150877 98590 63666 76620 59496 121297 106026
12808 106026 134795 117430 92152 97875 43250 -1728 -2619 -539 -61928 -44135 51023 4073
12796 4073 -94421 -93384 -115738 -73669 34381 57307 53479 -59426 -170384 -112361 -19806 -15117
12784a5117O3992M0398k0393k9688m4166k5723n1012j478L0385J7862Q1817R9155
12772A46032o7116o3561l6774j0773J3104J8421k743n8914j8480l3154O886J04816
12760b256L6964l8407N1790Q5246K626l5513p2501j11343K4648j4994q0574N6952
12748i7362K1924N359k4676O3598p918o2479O3282L6356K0164K5499n1238Q659
12736A168M5112J6016o2978n6181j2600m2702J8780N8877Q7731p257p0777m3129
12724f7940M5672Q8449j3682L5189k6950j07881r555P2294R2812j8809p8996j02229
12712i1626P608Q7792Q4737q7403k5059o415L1144L1847l1075J5078l465l0134
12700a6971L3033N0181M5542m4936j27225o9213M5018j7357k7081r77l635J2549
$$ plain form
12784 -15117 48875 89273 68880 39192 -4974 -30697 -81709 -83187 -52802 -34940 46877 146032
12772 146032 78916 15355 -21419 -32192 -19088 -667 -3410 -62324 -80804 -113958 -107072 -2256
12760 -2256 34708 -3699 48091 133337 135963 100450 27949 -83394 -58746 -73740 -154314 -97362
12748 -97362 -75438 -70079 -94755 -31157 -39075 -101554 -38272 -1916 18248 43747 -7491 1168
12736 1168 46280 62296 -682 -56863 -69463 -112165 -93385 -34508 53223 45966 -24811 -67940
12724 -67940 -22268 66181 52499 87688 60738 -47143 -56698 15596 108408 89599 10603 -91626
12712 -91626 -84018 3774 88511 1108 -23951 -30366 778 32625 1550 16628 13163 -16971
12700 -16971 16062 66243 111785 66849 -60376 -129589 -84571 -101928 -129009 -129986 -133621 -121072
12688a21072L9988J0727j391M6408k0387k6853k7539j569O4393k7145N176N8865
12676c99r119L7578L646k2427j0270L2963j7544r442K428N217J8649M4633J5583
12663I1496j14490n2584J3437m2220J6237L6478L4439K3393L7211m1037k628j5685
12651a5953m7712K6994l4204M6499q296k7581n1931l3021M5586Q3758j5166n3390
12639h4417Q920J01500N4725J0838k5740n4721N1954q2530n3493J8978J9725p2863
12627a07124o281M5190l23K6446L6321J1877l0945K1265k919L4673K1542l3495
12615A6227l6344K042k8556n4948O524l4763N1154N8735J21402M8649n2455j7403
12603H0264k2201j8353M6088J1595R456L8429L5865j675k4807J9201j0598r2033
$$ plain form
12688 -121072 -81084 -70357 -71748 -25340 -45727 -72580 -100119 -101688 -37295 -64440 -59264 -399
12676 -399 -9518 28060 31706 9279 -991 31972 14428 4986 7414 12631 31280 75913 91496
12663 91496 -22994 -75578 -62141 -104361 -88124 -51646 -17207 6186 43397 2360 -268 -15953
12651 -15953 -63665 -36671 -70875 -24376 -32672 -60253 -112184 -145205 -99619 -15861 -31027 -84417
12639 -84417 -75497 26003 80728 91566 65826 11105 63059 -19471 -72964 -53986 -34261 -107124
12627 -107124 -113405 -68215 -68538 -42092 -5771 6106 -24839 -3574 -6493 28180 49722 16227
12615 16227 -20117 -18075 -46631 -101579 -95055 -129818 -78664 -19929 101473 150122 97667 80264
12603 80264 58063 39710 85798 97393 106849 145278 181143 179468 154661 173862 163264 71231
12591G1231l4281n2100l8524M9247K7370j1013p63R565o4828k2557O3360K496
12579g97l7105N1276J0479o2307J4916J0533n3138M5555P5375k838m7497m3871
12567c9419n5412O0152M0317j9897n9156j0942j3257O1703O9291n609m4755q384
12555b5368k121K8147l0282n4326k6462P1849N6675N1055J4315k1344j02038L8645
12543a255P0652M838k968k3040L4674O0010m0886j29036j2508M8427q061m327
12531c480J9723l7686k8346N5862K1186Q196N9743r7899K734k5764q9326K7099
12519h7958J32219L812K8545p4920K5271l9626n2833J0941M3815L3421L6592p6204
12507a6925j11047j5348O1575L5598K971k1093n1969L7072j6196N3002J0714k913
$$ plain form
12591 71231 36950 -15150 -53674 -4427 22943 11930 11167 20732 -44096 -66653 -3293 -797
12579 -797 -37902 13374 23853 -38454 -23538 -13005 -66143 -20588 54787 51949 4452 -39419
12567 -39419 -94831 -34679 5638 -14259 -73415 -84357 -97614 -35911 33380 27771 -16984 -25368
12555 -25368 -27489 658 -29624 -83950 -110412 -38563 18112 69167 83482 62138 -39900 -1255
12543 -1255 69397 74235 71267 48227 82901 142911 102025 -27011 -39519 8908 847 -3480
12531 -3480 16243 -21443 -49789 6073 27259 35455 95198 -2701 33 -25731 -115057 -87958
12519 -87958 44261 48073 76618 1698 26969 -12657 -65490 -54549 -10734 22687 59279 -16925
12507 -16925 -127972 -143320 -81745 -46147 -43176 -64269 -116238 -79166 -95362 -42360 -31646 -34559
12495c4559m2169p84N9949l7243P459M698J2766p09k6834l7279L2788P2559l3186
12482b2544L6285K8063Q068N3313N612q6231j2447N354j2919l0235l0964j4501
12470g3146L0598N1549J0275O6268l688Q625N9336l8611l9403p2211k118K042
12458d84r162j0232K5215L35o809K3913L3124K1918K4266k3146j177L5589j2014
12445A01336Q320m3985m1417l5054O5589M0455q098l8159l7441n6644l639O2010
12433A3273N8491L5227m9451J9357J4576o2618k400L0724r2166m0355k1132J9351
12421g7123Q4831L0707m9688n9766m4599N1092J11186O884k1603l1896n0728K824
12409d7879p086m3635L5463M6395M4573q2682m6060j0988P5650O4259O6999Q798
$$ plain form
12495 -34559 -76728 -77512 -17563 -54806 -47347 -42649 -29883 -30592 -57426 -94705 -61917 10642 -22544
12482 -22544 13741 41804 49872 103185 108797 22566 10119 15473 2554 -27681 -58645 -73146
12470 -73146 -42548 9001 19276 85544 81856 90481 149817 111206 71803 -408 -2526 -484
12458 -484 -9646 -19878 5337 5672 -1137 22776 55900 77818 102084 78938 77761 113350 101336
12445 101336 109656 65671 24254 -10800 54789 95244 87146 48987 11546 -45098 -48737 13273
12433 13273 71764 106991 57540 76897 91473 28855 26455 57179 -34987 -75342 -96474 -77123
12421 -77123 7708 38415 -11273 -71039 -115638 -64546 46640 53524 31921 25 -50703 -47879
12409 -47879 -54965 -98600 -63137 -16742 27831 -54851 -100911 -111899 -36249 28010 95009 103807
12397A03807J8738l4740j6666n8849m3273j3727l89J0583k0910m2600j2529N2890
12385e7665L5780J8153q791l6695O8551J03819r221r5644p2626N1719J2234N3742
12373F3356L624n8396K4116Q5838n9838n4695P4033L7605m1296r4886m4019Q063
12361e6495k5570j4201O2489j3234m6426k0755j9718n4329K1520J1561P3689o089
12349h7558n498K212L1721l3502k7049K0996K2435K5544N5680L7439J3757Q183
12337F4360o4653m9816R6293m2981m0461j1578J8181K5730o689j08826j5157o8938
12325b04535J1231M9972l62q110K6499L5043K3755Q1062J4687k9677L5261N7229
12313I2055l5290p3608J5854N0264m754k2367J9814R546k9164o8900J9527n8495
$$ plain form
12397 103807 122545 87805 71139 12290 -30983 -44710 -45099 -34516 -55426 -98026 -110555 -57665
12385 -57665 -21885 -3732 -12523 -49218 19333 123152 113931 18287 -54339 -2620 9614 63356
12373 63356 66980 8584 32700 118538 58700 4005 78038 115643 74347 -20539 -64558 -56495
12361 -56495 -82065 -96266 -33777 -47011 -93437 -114192 -133910 -188239 -166719 -155158 -81469 -87558
12349 -87558 -93056 -90844 -59123 -92625 -119674 -98678 -76243 -50699 4981 42420 56177 64360
12337 64360 -293 -50109 46184 3203 -37258 -48836 -30655 -4925 -11614 -120440 -135597 -204535
12325 -204535 -193304 -143332 -143694 -151804 -125305 -90262 -66507 14555 29242 -435 34826 92055
12313 92055 56765 -16843 -989 49275 44521 22154 41968 51514 22350 -46550 -27023 -85518
12301h5518P3046o997L3021R6711n2189r7252m5685n6375p6042j5179J19439M8546
12289f4474n922n4694K5536N7836K3928r4718L1901J13349o8377j46788L7134
12278a45289M0427K4080Q6506M3939p4674J2308J3616k0734N761R469N5927P6518
12266A27854O6252k8807o6353J044L9794j03584q9486k893k6160k2547J3344N6796
12254c4746K393P648K369J02676M9095m3922n4039M4855N401L0942j3833l2698
12242F6141p3830K2363Q7943q4208j28271O4786J32835j9685r0341k1448J8531
12231b5184J6670J0112j6293M1262j0895L0861p941K59n6977O7046K5903m6937
12219B7886r8403n0126m3131K4543k5674n373Q6318N7172M0611L1369k432J1319
$$ plain form
12301 -85518 -12472 -19469 13552 110263 58074 -39178 -84863 -141238 -217280 -232459 -113020 -64474
12289 -64474 -70396 -125090 -99554 -41718 -17790 -112508 -80607 32742 -35635 -182423 -145289
12278 -145289 -104862 -80782 5724 49663 -25011 -12703 913 -19821 -14060 -4591 51336 127854
12266 127854 194106 165299 98946 99990 139784 36200 -53286 -56179 -82339 -104886 -91542 -34746
12254 -34746 -32353 -24705 -22336 80340 129435 85513 31474 76329 81730 112672 98839 66141
12242 66141 -7689 14674 102617 18409 -109862 -45076 87759 68074 -22267 -43715 -25184
12231 -25184 -8514 1598 -14695 26567 15672 46533 38592 38851 -18126 48920 74823 27886
12219 27886 -70517 -120643 -163774 -139231 -164905 -170278 -83960 -26788 13823 45192 42760 54079
12207E4079N990N5507M4752l0509k5178l5678j10315o6217N3013k495p9391N852
12195a30590Q1617K0994q1003l1391j3935P4097P0591P8104J9137l7060n4222
12184c661j2491j2009k3054p7627P2865R1221l9126K5839J6558j2433K0288k2389
12172B3981o4187P49K8312p9275k6846P7244M9148l3238k1051K5878L4084j2410
12160B389N7447m5432n2840j4669k1578n4958N3125n1880o4089O0855R6425M819
12148c0386J7432l2854l3840K5788K5044M5668o9945o185J18210P407l4643m4738
12136a3042j62552r874R1656O7330M7068J1884R822m6863j3678m7813p4397j0037
12124a50496L6272Q5264m6556J7656N6872K9063Q614J425l0981n3955N414Q966
$$ plain form
12207 54079 60069 115576 160328 129819 104641 68963 -41352 -107569 -54556 -57051 -136442 -130590
12195 -130590 -48973 -27979 -108982 -140373 -154308 -80211 -9620 68484 87621 50561 -3661
12184 -3661 -16152 -28161 -51215 -128842 -55977 35244 -3882 21957 38515 26082 46370 23981
12172 23981 -40206 -39457 -11145 -90420 -117266 -40022 9126 -24112 -45163 -19285 14799 2389
12160 2389 59836 14404 -38436 -53105 -74683 -129641 -76516 -128396 -192485 -131630 -35205 -30386
12148 -30386 -12954 -45808 -79648 -53860 -28816 16852 -53093 -59278 58932 66339 31696 -13042
12136 -13042 -175594 -185468 -93812 -26482 20586 32470 42292 -4571 -18249 -66062 -140459 -150496
12124 -150496 -114224 -28960 -75516 -57860 -988 28075 36689 38114 7133 -46822 -41408 -32442
12112c2442Q249j1059K9769K3241p8551J9039J4286J659l5867k2622n394n6207
12100a45899j5425k5140R6702J43321L4743l8939l5513L7038m2513m8123j3777
12089e3525M792J6845Q4697J07746n1701m4910j9755K1966n755n9263k244O5261
12077F4154l0014N3854P7178k2500O015l9213J0535p3641p2132k9377p7833L1133
12065a01841P8339O2974q036J5023K7878K3839k0083J5500k4899o2653K4367J5952
12053D6360k2104m8180K0870O623p612j2276M2400l8348L3164l1456m4138P4094
12041A9397J00445Q820o544q8061p8427J8545K328O6871J8263K2751m0473j7728
12029B6187J7866m1598p0295M0923k5800k8731J8676K7801o9714K6655O9929k8250
$$ plain form
12112 -32442 -24193 -35252 -5483 17758 -60793 -41754 -27468 -25809 -61676 -84298 -89692 -145899
12100 -145899 -161324 -186464 -89762 53559 88302 49363 13850 50888 8375 -39748 -53525
12089 -53525 -48733 -31888 52809 160555 108854 63944 44189 66155 60400 1137 -1107 64154
12077 64154 34140 87994 165172 142672 148687 109474 120009 46368 -25764 -55141 -132974 -101841
12065 -101841 -23502 39472 31436 46459 74337 98176 78093 93593 68694 6041 30408 46360
12053 46360 24256 -23924 -3054 3569 -4043 -16319 26081 -12267 20897 -10559 -54697 19397
12041 19397 119842 128662 122118 34057 -44370 -25825 -23497 43374 61637 84388 43915 26187
12029 26187 44053 2455 -67840 -26917 -52717 -81448 -62772 -34971 -104685 -78030 -8101 -36351
12017c6351R3508J27316l8479n8745p7786l7437K034K3251K7318J250n1123O1588
12005C6344O092R542J34975Q757o4505l6349k2010R211K1800Q978k3280M1041
11993A30596J6014j9258q9135K308j4276m1439K3588K0461m2105J05628p035r7208
11981a1861q9342J19807K8579k0311m0281o8897n1257L4276K1488K9799m1435
11970h9435j4411N2109k7170J3007M0222k9166m5272m3104J36771L9842m1945
11959h552m7445o876O3794k3332l2007P0203j0683j22633k0068Q7293O3697J2373
11947B5764l1463k7096K437o1734K6330j99P3705R4302R942j4945j8336o3137
11935A5570j25044k2913J8618q2k963L1200K2431p216k1924O7939M1056m3419
$$ plain form
12017 -36351 57157 184473 145994 87249 9463 -27974 -25940 -2689 24629 25879 -25244 36344
12005 36344 42436 51978 186953 195710 131205 94856 72846 82057 103857 112835 89555 130596
11993 130596 146610 127352 38217 40525 26249 -15190 8398 28859 -13246 92382 85347 -11861
11981 -11861 -101203 18604 47183 26872 -13409 -82306 -133563 -99287 -77799 -48000 -89435
11970 -89435 -103846 -51737 -78907 -65900 -25678 -54844 -100116 -143220 -6449 33393 -8552
11959 -8552 -55997 -62873 921 -22411 -54418 15785 5102 -117531 -137599 -50306 13391 25764
11947 25764 -5699 -32795 -30358 -92092 -65762 -65961 7744 102046 111988 97043 78707 15570
11935 15570 -109474 -132387 -113769 -113851 -116814 -85614 -63183 -70399 -92323 -24384 16672 -26747
11923b6747j9303l1285K018O2829o989O6785J60045Q0464k8706q5818j25465l7642
11911A0186q8276R2603n715j42800K5740N0839o0697k3389N4451k0188l2528K9423
11899a10351N9560r9858j04427O1432J01610M0661L6927o1064l5794K2855J6004
11888g2445L9304M2948J5643j1804o919j7762k0831n9908l2292P9133O6418j8878
11876B607m1858k6963j653p551j1138M5092L3711k1218J5972M7253J2327l6761
11864I820k7682j2889m7999m697L993p999l0268L0094N0714j5963o231J2664l7526
11851h3969O0240J12955L4498j8837p32R3137j843m9844r554Q4252n5718N454
11839A70039p6795m519o4533o5028o2098n3633q0149M1754L6472J4031L4180J06186
$$ plain form
11923 -26747 -46050 -77335 -75317 -12488 -19477 47308 207353 287817 259111 173293 47828 10186
11911 10186 -78090 14513 8798 -134002 -108262 -57423 -118120 -141509 -87058 -107246 -139774 -110351
11899 -110351 -50791 -150649 -255076 -193644 -92034 -51373 -14446 -75510 -111304 -88449 -72445
11888 -72445 -33141 9807 25450 13646 6727 -11035 -31866 -91774 -124066 -44933 21485 2607
11876 2607 -39251 -66214 -67867 -75418 -86556 -41464 -7753 -28971 -12999 34254 46581 9820
11864 9820 -17862 -30751 -78750 -83447 -79454 -87453 -117721 -87627 -36913 -52876 -59107 -46443 -83969
11851 -83969 -23729 89226 123724 104887 104155 197292 195449 145605 136051 220303 164585 170039
11839 170039 93244 88725 24192 -40836 -102934 -156567 -236716 -194962 -158490 -144459 -110279 -4093
11827d093K5687K3309N5790n474m9450L6808m2673r7330K3330J02325L486K9239
11815A00954o012l3253j5096L6721J2812N010J5769m4531n4842P317n083J0033
11803B9799O4077K1765m1894n0778k8847j0341L6648L5473J01239K1443j01479
11792G7105n9321p1503L0636N9545N1956M0086j2033M3203j190o8849m4778m6894
11780b037o4064O5490P965p597M6767j8745j9453M3134K2300p1201l0430l2511
11768f0382K6791Q5632n5288m6640j4095m6163J01291N3045N2331L0200k4241
11757A02481j14766m7305p6153j9448N4217M1691M1156Q513m2656M638M758q6216
11745a29090l8133N8995Q6300l0187l7660R2604j2126K1491P1202o6378M8885
$$ plain form
11827 -4093 21594 44903 100693 95219 45769 82577 39904 -57426 -34096 68229 71715 100954
11815 100954 94942 61689 46593 83314 96126 101136 116905 72374 17532 24849 19766 29799
11803 29799 93876 115641 73747 22969 -5878 -16219 20429 55902 157141 178584 77105
11792 77105 17784 -53719 -23083 36462 88418 128504 116471 159674 158484 89635 44857 -2037
11780 -2037 -66101 -611 7354 -243 46524 27779 8326 51460 73760 2559 -27871 -60382
11768 -60382 -33591 52041 -3247 -49887 -63982 -110145 -8854 44191 96522 126722 102481
11757 102481 -12285 -59590 -135743 -155191 -100974 -59283 -18127 -9614 -52270 -47632 -42874 -129090
11745 -129090 -167223 -108228 -21928 -52115 -89775 2829 -9297 12194 83396 17018 65903
11734F5903k6106q8701q710L5148n6841n8932k3739P2182O5043r460J9276M1633
11722B6696L4376k8984M123n9661p0274M5108P7330O0577l5429p3736l7657j8145
11710g5676P965r0532m7600J03399m557r2665O2015J18553j7636l2154l2858M0928
11698f0818J19375J1301k3705N2379k8101j14005N631J9558l098K5376n5093P4085
11686B2885O2956L3370Q771p4076L7088J2123k4404j09361r3877K191K9836J4128
11674g8370m221o5047p355J7630r275N2494J6120j74L5344N5234k4228p9848M6595
11661d5101O9398J5146J4663k2608M29k2831r0940j1136L0854M4623n9459q5058
11649a62020K4743p632k3628K9977P0932Q06k9739k5274M837r8457M262J07245
$$ plain form
11734 65903 39797 -48904 -57614 -22466 -79307 -138239 -161978 -89796 -24753 -34213 -14937 26696
11722 26696 61072 32088 36211 -23450 -93724 -48616 28714 89291 53862 -19874 -57531 -75676
11710 -75676 -67711 -158243 -205843 -102444 -107001 -199666 -137651 -19098 -36734 -68888 -101746 -60818
11698 -60818 58557 69858 46153 98532 70431 -43574 -37943 -18385 -21483 3893 -51200 22885
11686 22885 85841 119211 127982 53906 90994 103117 78713 -30648 -124525 -122334 -92498 -78370
11674 -78370 -82591 -147638 -154993 -137363 -146638 -94144 -78024 -78198 -42854 12380 -11848 -91696 -45101
11661 -45101 24297 39443 54106 31498 31927 9096 -81844 -92980 -62126 -17503 -76962 -162020
11649 -162020 -137277 -144909 -168537 -138560 -67628 -66822 -96561 -121835 -116998 -215455 -211193 -103948
11637a03948n7190m4908J8937P1720R0669m083n0933n1131L7778K1547K0201M3091
11625h250k0317k1947j9062n302N8731R3901q5197l8117J4444J183l3611o3085
11613a26629l7253P3673L4810k0759J4333R4064N2842l9643j19170m4308p044
11602a25084L214N7203k7984k123n876m3593j9003L0775J21505J19609j01170
11591G473r5233Q2454N5750r5897J5834J8233l1487L9834P546k8389j4539j1692
11579e0113N1104j1639o704N4659J4084r0754K2979O34K9075Q3144P6988l9746
11567A33711n7837k9270m2849J0670l0338l2118Q1131J21234P343o5959o5089
11556C0629m3465o7750m0521P4329n1832N461L5963J804O0588N8585J8057j8536
$$ plain form
11637 -103948 -161138 -206046 -187109 -115389 -24720 -28803 -79736 -130867 -93089 -71542 -51341 -8250
11625 -8250 -28567 -50514 -69576 -74878 -16147 77754 -7443 -45560 -31116 -29933 -63544 -126629
11613 -126629 -163882 -90209 -55399 -76158 -61825 32239 85081 45438 -73732 -118040 -125084
11602 -125084 -121870 -64667 -92651 -94774 -100650 -144243 -163246 -132471 -10966 108643 7473
11591 7473 -87760 -5306 50444 -45453 -29619 -11386 -42873 -3039 4507 -23882 -38421 -50113
11579 -50113 991 -10648 -17352 37307 51391 -39363 -16384 -15750 13325 96469 173457 133711
11567 133711 75874 46604 3755 14425 -15913 -48031 33100 154334 161677 95718 30629
11556 30629 -12836 -80586 -121107 -46778 -98610 -93149 -57186 -55382 5206 63791 81848 63312
11544F3312o4165M5160O709p9756m5930K7532L88n560L0515q2711o9710M6373
11532a27843P5271M4197M0979J4965q507p2135Q182K9544n7104o7308K7798K3990
11520f7971O7999M3910o4649k4967J8743Q745k5760L2307K7894k5781J4044M443
11508H957K5643l4840j01842J4838M6025j0618k5094l5637K7054J9431n096N0170
11496b1009J15463L6949q1607n9554L7634o8826l2916j5668Q1787Q390L0189J6149
11484D6981o3125q3678j23524O0283O0056M9458k5120m3137j0190O4578O3192
11473d226j5309P436N4570L3175r785r304L0220l0261j01832K3277j8426Q2398
11461D1933l084p2299O480l3476o1561R9451J8694n9805j5286N8211N0009p5806
$$ plain form
11544 63312 -853 44307 51016 -28740 -74670 -47138 -46750 -52310 -21795 -104506 -174216 -127843
11532 -127843 -52572 -8375 32604 47569 39062 -33073 -24891 4653 -52451 -119759 -91961 -67971
11520 -67971 28 43938 -20711 -45678 -26935 -18190 -43950 -11643 16251 -9530 4514 8957
11508 8957 34600 -240 -102082 -87244 -41219 -51837 -76931 -112568 -85514 -66083 -71179 -21009
11496 -21009 94454 131403 49796 -9758 27876 -40950 -73866 -89534 -7747 643 30832 46981
11484 46981 -16144 -99822 -223346 -163063 -103007 -53549 -78669 -121806 -131996 -67418 -4226
11473 -4226 -19535 -12099 42471 75646 65861 56557 86777 56516 -45316 -22039 -40465 41933
11461 41933 38849 -33450 -26970 -60446 -122007 -22556 -3862 -63667 -78953 -20742 29267 -46539
11449d6539m5331n069L2695k62K6552p4932M390R0055J02702O2352L0837j07196
11437G0254r8065n4085k7357M7842o5042m2254O9757O9394K4423L0866L569o3737
11425c4435l4542l7425m7835k5851M9530Q7679O5465K3676j68325l9186R2802
11414f8447N8545P3918j9966o5297j23751p953O8064P9357J6273L3924Q0116l8790
11402H5993l1939n9049L6062k2000m2895n5991m0064N371J886l3124M4995O2146
11390d8609k5973N9019K4401J3101J4209k3656L4415k9055n8667N0271K3778r8218
11378f4984J0855K0109K6245J3616Q8989j8697l0134J2371O8244k0449k0589o3997
11366B1579l9009O573n2991L3216J34585k329j60771n5230L363L8143R706K3038
$$ plain form
11449 -46539 -91870 -96939 -64244 -64506 -37954 -112886 -108496 -18441 84261 146613 177450 70254
11437 70254 -27811 -81896 -109253 -61411 -126453 -168707 -98950 -29556 -5133 25733 29302 -34435
11425 -34435 -68977 -106402 -154237 -180088 -130558 -42879 22586 46262 -122063 -161249 -68447
11414 -68447 -9902 64016 44050 -21247 -144998 -152951 -84887 -5530 10743 44667 124783 85993
11402 85993 54054 -4995 31067 9067 -33828 -89819 -129883 -124512 -122626 -155750 -110755 -48609
11390 -48609 -74582 -15563 8838 21939 36148 12492 46907 17852 -40815 9456 33234 -64984
11378 -64984 -54129 -34020 -7775 5841 94830 76133 45999 58370 126614 106165 85576 21579
11366 21579 -17430 -10857 -63848 -30632 103953 101624 -59147 -114377 -111014 -72871 -63165 -40127
11354d0127L7272K6741L0040j5593K1434j0526M6992p6149j9745M8616M5788k909
11342I1834q1212j4413L4903r0238m7707l5082L7007Q4259K1915P402n745j6959
11330a4036N998j3335m4814m5582j6592L6378J8413L4514j6933O7166M8702r552
11318E0327l3416K4638j1041m9178L2850Q9018m4213j03326L595M7580o200l3921
11306c3287p8244j710k0724J0892P4210m3403M037k7012m781p4149l3466j4388
11294b42025N8358J1795M1704R3502m4468n2020m2002O848p3065n4869j8460J7932
11282b96770N5428R9221P1996P530k4540L5144k7094o362L8046k4418L4249n528
11270d3098m5633m076k0030J9509M3594l4362k8056k3347O3984L4464K7890k0019
$$ plain form
11354 -40127 -2855 23886 53926 38333 59767 49241 96233 20084 339 48955 94743 91834
11342 91834 10622 -3791 31112 -59126 -106833 -141915 -104908 -20649 1266 8668 2923 -14036
11330 -14036 -8038 -21373 -66187 -111769 -128361 -91983 -73570 -39056 -55989 11177 59879 50327
11318 50327 16911 41549 30508 -18670 14180 103198 58985 -44341 -40746 6834 634 -33287
11306 -33287 -111531 -113241 -133965 -123073 -48863 -92266 -88229 -115241 -120022 -194171 -227637 -242025
11294 -242025 -183667 -171872 -130168 -36666 -81134 -133154 -175156 -168308 -241373 -296242 -314702 -296770
11282 -296770 -241342 -142121 -70125 -62595 -87135 -51991 -79085 -85447 -47401 -71819 -37570 -43098
11270 -43098 -88731 -92807 -112837 -93328 -49734 -84096 -112152 -135499 -71515 -37051 -9161 -29180
11258b9180m9940m4950O4425M3785o3612m1225l695n4673J08423L3720M6009M1329
11246E0416L2792J0307O67n166p2127o7006J9863R8966j0390p8903N2571L0784
11234F2774J3951M6381k3785o4174K202N309k9142j4826j2525q2820K6557K312
11222f7786J9184K3212l4298j616N7390K7682K1616P055l9221k0435L4541M073
11210C1397n3867N0242N4651n1508r0792l3099J0449J17634P0502p9286j22435
11199i6112K4591L3270K9688M7793n889j4469N1891L0134k6385L5541j00232j35443
11187a25622j20424m2282L4964J29136P7543J196k0437m3529K9519M7699M0604
11176H367J6776l5900j02755O4015N2189J3328k9912l3304p430M3542J8285l1942
$$ plain form
11258 -29180 -79120 -124070 -59645 -15860 -79472 -120697 -124392 -179065 -70642 -36922 9087 50416
11246 50416 83208 93515 94182 89016 16889 -50117 -30254 68712 58322 -20581 31990 62774
11234 62774 76725 123106 99321 35147 37349 42658 13516 -1310 -13835 -96655 -70098 -67786
11222 -67786 -48602 -25390 -59688 -61304 -3914 23768 45384 52439 13218 -7217 27324 31397
11210 31397 -22470 27772 82423 30915 -59877 -92976 -82527 35107 105609 26323 -96112
11199 -96112 -71521 -38251 -8563 39230 33341 18872 70763 100897 74512 110053 9821 -125622
11187 -125622 -246046 -288328 -253364 -124228 -46685 -45489 -65926 -109455 -79936 -32237 8367
11176 8367 25143 -10757 -113512 -49497 2692 16020 -13892 -47196 -54626 -11084 7201 -24741
11164b4741N3233N2829n3244p3953K0945R72K1674j3111m7978j6351k4287j0618
11152a14630N5549Q2467L9481m0737n930k7544p4470m9279K4886n7763N8278R1576
11140a8116q3248j2986N6276R3423N480l7537n2635J5890J01322L4434m4205l3963
11128B4135l856j4876p5488Q556M8816M7932L8808N3391j21400m3746J3647J01876
11116G7795l3310l5291j8189M1949k5365n4958p1486L6055O4795J5506M861p4789
11104g2427k2328P8611n335J1087M5044j3003r8695p0048K1980k0789n0116K3149
11092a72870M7440K0792m5830L4696N2575M8212j5348N0976R4508J3272l3291
11081I5132P803j958J6724q9109j12406M4271K4492L9436q8587j01276m5377m117
$$ plain form
11164 -24741 28492 81321 28077 -45876 -24931 -23959 -2285 -15396 -63374 -79725 -104012 -114630
11152 -114630 -59081 23386 62867 22130 16200 -11344 -85814 -135093 -110207 -167970 -109692 -18116
11140 -18116 -101364 -114350 -58074 35349 40829 3292 -49343 -33453 67869 102303 58098 24135
11128 24135 20279 5403 -70085 -61529 -12713 35219 74027 127418 6018 -37728 -24081 77795
11116 77795 44485 9194 -8995 32954 7589 -47369 -118855 -82800 -18005 -2499 2362 -72427
11104 -72427 -94755 -16144 -21479 -10392 34652 21649 -77046 -147094 -125114 -145903 -196019 -172870
11092 -172870 -125430 -104638 -150468 -115772 -63197 -14985 -30333 20643 115151 128423 95132
11081 95132 102935 100977 117701 28592 -83814 -39543 -15051 24385 -64202 -165478 -210855 -214972
11069b14972N9839K7292J45250J24169k5143p3148m3026j8639j3508L2634J1343
11058A2091j8100l5212j0739j0400L1171K1690m6241p064m7311M0920O5106K278
11046a811n2938K8522P4253j04075N1894M1175N371J6761l5l9738l1226l4028
11034d5875k0808j5634K8509r1226L4496J14179O5050j0301J2962k3850J5685
11023F3187l4474o3458o8237N4893j8875Q396j7189n7552Q4618K5902q383j7660
11011d8832J2727l4478J5380L9886J2854O971p5210o5987M6922K3567j2898R2473
10999A3375l5411j1272J6305j6231N79Q2317O27j1785m4700q685L558o3605l5920
10986a10848J18460N6738K9291N1522j34865j10564J6468L8722O59k6205o8236
$$ plain form
11069 -214972 -155133 -127841 17409 141578 116435 43287 261 -18378 -31886 748 12091
11058 12091 -6009 -41221 -51960 -62360 -31189 -9499 -55740 -62804 -110115 -69195 -4089 -1811
11046 -1811 -54749 -26227 48026 -56049 -4155 37020 42391 59152 59117 19379 -11847 -45875
11034 -45875 -66683 -82317 -53808 -145034 -110538 3641 68691 58390 71352 47502 63187
11023 63187 28713 -34745 -102982 -48089 -66964 -58568 -75757 -133309 -48691 -22789 -31172 -48832
11011 -48832 -36105 -70583 -55203 -15317 -2463 4508 -70702 -136689 -89767 -66200 -79098 13375
10999 13375 -22036 -33308 -17003 -33234 -32655 49662 50289 38504 -6196 -14881 -11323 -74928 -110848
10986 -110848 7612 64350 93641 145163 10298 -100266 -83798 -45076 -44417 -70622 -138858
10975a38858L3526M8370M7106M7850m6382j8364K1546O7945k5898L358p091k4598
10963H510j0359K0909m6678m0224n019j2363L9804L4546L4546k5962K9754O4528
10951I1992o1194q8633L914l7590m9225K6924O0956J9658J6152n2520o2881m632
10939a37079P2743O1048o9927K254O7455j36359m2432J5534j7791L4866K9143
10928a20545K1275M562K6063K1250k6128j1730n33m0173Q8813p4576q8243r1077
10916b91042k544J00669K2468Q7631J8248r448K6236O6240j5459M0052l5284Q0808
10904H8575m999j1836k6282O175J857K844j4955o2668M6735n5751j05746L3531
10892a02520N2665k2611O5428K9128r047q755k6577p2257q1631R370K7216J9405
$$ plain form
10975 -138858 -105332 -56962 -9856 37994 -8388 -26752 -5206 62739 36841 40199 33108 8510
10963 8510 -1849 19060 -27618 -67842 -72861 -85224 -45420 -10874 23672 -2290 27464 91992
10951 91992 30798 -57835 -53921 -91511 -140736 -113812 -52856 -33198 -17046 -69566 -132447 -137079
10939 -137079 -64336 -3288 -73215 -70961 -3506 -139865 -182297 -166763 -184554 -149688 -120545
10928 -120545 -99270 -94708 -68645 -47395 -73523 -85253 -85786 -125959 -37146 -111722 -199965 -291042
10916 -291042 -293586 -192917 -170449 -82818 -64570 -74018 -47782 18458 2999 43051 7767 88575
10904 88575 83576 71740 45458 51633 53490 56334 41379 -21289 25446 -30305 -136051 -102520
10892 -102520 -49855 -72466 -7038 22090 13043 4288 -22289 -94546 -176177 -166807 -139591 -120186
10880a20186j814L9693r413J4124j02311m3589Q5263N8261L3779O8554l6056q9455
10868a03150J4733Q4710K8600M9029L8004o4735p8627r8211j1795P7419P6242
10857A2219P1188m110o1836o1239P915M8475K3123n6525J6562J8850K4867J2325
10845E1814j8555n7413L0654M8297J0354j0907Q965O3329L2642L3346K1856k6129
10833A88253J1151K9471m806m552j7342j7833o7209p9815p2530o6177p7460M354
10821a74495J86054O4600n5045k5235r740n8868M4304j6338r296k5126M6373J00006
10809F7194R8209L4091L4180J1546o727q3739q2234K0802j13090o1537j3708J8774
10797g6239L4483l5012n1868M1317Q9801J36660P7410L1119q9899n3515k7858
$$ plain form
10880 -120186 -122000 -82307 -91720 -77596 -179907 -223496 -138233 -79972 -46193 22361 -13695 -103150
10868 -103150 -88417 -3707 24893 73922 111926 47191 -31436 -129647 -141442 -64023 12219
10857 12219 83407 79297 17461 -43778 -35863 12612 35735 -20790 -4228 14622 39489 51814
10845 51814 33259 -24154 6500 54797 65151 54244 63209 126538 159180 192526 214382 188253
10833 188253 199404 228875 224069 219517 202175 184342 117133 37318 -35212 -101389 -178849 -174495
10821 -174495 11559 76159 21114 -4121 -13861 -72729 -28425 -44763 -54059 -79185 -32812 67194
10809 67194 165403 199494 233674 245220 238493 154754 72520 93322 -19768 -81305 -95013 -76239
10797 -76239 -41756 -76768 -128636 -87319 2482 139142 216552 247671 157772 104257 76399
10786G6399j5457J2516k7288l8264j0112Q81K386n7809L9971J9710j0695M595
10774c167n8130Q121m8847L4993K2513K8411K8173L3313m1705O383L7687l7866
10762I879q0353j3266J3840J1208J05253L8811M3576j4972m7686n4427m4225m6716
10750g9078p104M2927n6572L210M7595L628O5436p5498j34L2642P3481J04160
10738A54693L7021p1515j26703k1489K557l6523k6898K7525M9165K5501r6569
10727h3235n2964Q568R1818N0860N32N1864L795m3051k9619k541j9316k8260q2679
10714a34228n5626Q1972O1738K4218j2309q978n7001J9036P6440R002n5041L234
10702d7543K3410m0214L4118Q0746k3597m0146l4513Q330m9924O4755R0546N5974
$$ plain form
10786 76399 60942 73458 46170 7906 -2206 -1325 1061 -56748 -16777 2933 -7762 -3167
10774 -3167 -61297 -53176 -102023 -67030 -44517 -16106 12067 45380 3675 10058 47745 9879
10762 9879 -70474 -83740 -69900 -58692 46561 85372 128948 113976 66290 11863 -32362 -79078
10750 -79078 -86182 -43255 -99827 -96617 -49022 -45394 20042 -55456 -55590 -22948 50533 154693
10738 154693 191714 120199 -6504 -27993 -25436 -61959 -88857 -61332 -12167 13334 -83235
10727 -83235 -136199 -127631 -35813 15047 15579 67443 71238 28187 -1432 -3973 -23289 -51549 -134228
10714 -134228 -189854 -107882 -46144 -21926 -34235 -43213 -100214 -81178 -4738 4264 -50777 -47543
10702 -47543 -24133 -64347 -30229 50517 26920 -13226 -47739 -39409 -89333 -24578 65968 121942
10690A21942R8337M89r9723m3617J0239k7508m5966j2214m3223m1963O4959R501
10678h747M6142j5189n3109O2839N2757n1671l800M280K1883k8582m9543M5489
10666B2749M4567L8306l6991p9729k264M2115M2569M8554q8181j0063p1330L8266
10654a1432N5957R598m8712m0803K4942j2160M3527L8387Q5564j3062l4711k1082
10642G6013k8156N3669j2293q9914j7923m8301O4860Q9130j7506n2298j8100O6056
10630F5237M3095m6664N4429Q624j0259L6715k1834o8054j35646n5361K2314K3129
10618h4275m9586M6931Q7402L2409K7048O4034j1931l4969n0260j4015K1055m3493
10606i650l0347l5036N6684J556J4657n9736K2404O5326m9542l912J7936j1590
$$ plain form
10690 121942 220279 220768 121045 77428 87667 60159 14193 1979 -41244 -83207 -18248 -8747
10678 -8747 37395 22206 -30903 31936 84693 33022 29222 33502 55385 26803 -22740 22749
10666 22749 67316 105622 68631 -11098 -13362 28753 71322 119876 31695 21632 -49698 -11432
10654 -11432 44525 54123 5411 -35392 -10450 -22610 20917 59304 144868 131806 97095 76013
10642 76013 47857 101526 89233 -681 -18604 -66905 -2045 87085 69579 17281 -819 65237
10630 65237 108332 61668 116097 124721 114462 151177 129343 61289 -74357 -129718 -107404 -84275
10618 -84275 -133861 -86930 472 32881 59929 123963 112032 77063 26803 12788 33843 -9650
10606 -9650 -39997 -75033 -18349 -16793 -2136 -61872 -39468 25858 -23684 -27596 -9660 -21250
10594b1250l6478K4602O1788r490p8103r8795k7995Q3156N457M3578O8469N2352
10582F7291j7789l0928o0107J061R0597o9996l8916L694Q5668Q1842L3386p7997
10570F7806k6741j1668k68p3628k425O1143l9230l0133K7277j9687k816m1086
10558i1456j4506J36253J04456M537n6107j4275j7554o7573m1378K7665K8799
10547a139n8075r1025N1590M8699o406Q2795N4879n1920p2687l3364J0157L6624
10535b9872L8427l4449o789J09020L5409N0910J9625m1042j174r7348k7372J01694
10523A17039K5113N052j10250l8789M2388L1059J6340o0873j16007J7303M4500
10512b7125q9197l41P7560L2023P4322O9809q4913l054R6378M79n4163k354M0435
$$ plain form
10594 -21250 -57728 -33126 28662 19172 -58931 -157726 -185721 -102565 -97108 -53530 14939 67291
10582 67291 49502 18574 -41533 -40472 50125 -19871 -58787 -55093 30575 112417 145803 67806
10570 67806 41065 29397 29129 -44499 -46924 14219 -25011 -55144 -27867 -47554 -50370 -91456
10558 -91456 -105962 30291 134747 139284 83177 68902 51348 -16225 -57603 -29938 -1139
10547 -1139 -59214 -150239 -98649 -49950 -56356 26439 81318 29398 -43289 -76653 -66496 -29872
10535 -29872 8555 -25894 -32683 76337 111746 162656 182281 141239 140065 42717 15345 117039
10523 117039 142152 147204 36954 -1835 40553 71612 87952 27079 -88928 -71625 -27125
10512 -27125 -116322 -116663 -39103 -7080 67242 137051 52138 49084 145462 145941 91778 89424 129859
10499A29859J7768j2182M7437l4098j14760j01275j9130j4456l3453p2160N6180
10488a50270J6806J0689M5419K8747o5800m7078J19137O4700L7480o798k6736
10477B6296J2345L3405P77J1313o8147o1346M2096O7368j8579m9736K3796J0268
10465B9856m344q7561o716O1210p75m2572k7829r134J2903M1574M1611R1825M8088
10452A48136K8229K8975j9586j12938n9358R600K6687m360k2268P661J02304L6263
10440A69345K2795o3063o9102m1379J202j3141j4950J0663P5635k5163J1909K27
10428F4978j736L5127l1425j4077j7484n6672O866j7411L942L8272R991J3268
10416C3639j8641n4153N9441L7459k4480m6646o8532L1949O0653n4764j5712o241
$$ plain form
10499 129859 147627 135445 182882 148784 34024 -67251 -86381 -100837 -134290 -206450 -150270
10488 -150270 -133464 -122775 -77356 -48609 -114409 -161487 -42350 22350 59830 53032 26296
10477 26296 38641 72046 72823 84136 15989 -45357 -3261 64107 45528 -4208 19588 29856
10465 29856 25512 -62049 -68765 -7555 -8330 -50902 -78731 -87865 -74962 -33388 8223 100048 148136
10452 148136 176365 205340 185754 72816 13458 23058 49745 45385 23117 30778 133082 169345
10440 169345 192140 129077 59975 18596 19798 6657 -8293 2370 78005 52842 64751 64978
10428 64978 63242 98369 66944 52867 35383 -21289 -14423 -31834 -27892 10380 20371 33639
10416 33639 14998 -39155 20286 57745 33265 -13381 -81913 -49964 10689 -44075 -59787 -66028
10404f6028k6556J15067R2481K8490o3843k2177L4899L2571J9044M5330q6911
10393A02367q4679J4183J15685n5729m3270J2907N7423O6564L1311p9922j02009
10382C4831k8809Q1210P6316k4131o2905R18j8303j21888r6818L2139K067o3418
10370a88791Q6664K04768L0565j38826j41246L9132R8714o6267L8553M9486L1854
10359D4606o3083k5896L6607L7877k7716o378R299L8666l2307L6086Q9239M6757
10347A83757K535j2855l681Q4520J13638j9229J1600o0096r9031k5683l4455k2980
10335A18040m1995K6122R4342r3388k3134n9152M8670l6175l465Q8386p8078J932
10323D2105O3668p7500K629j1493J493N7160O9334K4297p3658r7743r1387m7319
$$ plain form
10404 -66028 -92584 22483 114964 143454 79611 57434 92333 124904 143948 189278 102367
10393 102367 17688 31871 147556 91827 48557 61464 118887 185451 216762 136840 34831
10382 34831 6022 87232 163548 139417 76512 77430 59127 -62761 -159579 -127440 -125373 -188791
10370 -188791 -102127 102641 133206 -5620 -146866 -107734 -9020 -75287 -36734 12752 44606
10359 44606 -18477 -44373 -7766 30111 2395 -3983 5316 43982 11675 47761 137000 183757
10347 183757 186292 173437 169756 254276 367914 348685 360285 300189 201158 175475 141020 118040
10335 118040 76045 102167 196509 103121 79987 20835 69505 33330 29865 118251 40173 42105
10323 42105 105773 28273 30902 19409 20902 78062 147396 171693 98035 292 -91095 -138414
10311a38414R3568J14999J9364J0591m9985R0696K9497p8360j8851K1223M2667
10300A36995M5974k507k134k2281n9312P8526J13472J7338p8480j03413o6132
10289E8046M2928L4454R862j11189M5735O67R5088O0129o967p8348p7469j7663
10277E5273M0410j30879N2585J25983L7085K4930j7235j02928j0104m6764l2663
10266d307K0018m8821o5635n6747K3521J28872J9892m0232N7361P4472L0066m843
10254A33617p0127N270O6094R363o398M0201l6354p2972J5442r994p2622o193
10242d673k6525n0752L6248K8666Q1380O2587n8989n8752j3184l0266M3896m2028
10230c2392k4851M9314M2480O5691K7349j8569j3247k1306l9995K9083p4310j05151
$$ plain form
10311 -138414 -44846 70153 89517 100108 50123 140819 170316 91956 73105 94328 136995
10300 136995 182969 180462 178328 156047 96735 175261 288733 306071 227591 124178 58046
10289 58046 100974 135428 145290 34101 79836 80503 175591 235720 228753 150405 72936 55273
10277 55273 95683 -35196 17389 143372 180457 205387 188152 85224 75120 28356 -4307
10266 -4307 15711 -33110 -98745 -155492 -131971 -3099 16793 -23439 33922 108394 138460 133617
10254 133617 63490 68760 134854 144217 137819 178020 141666 68694 84136 74142 1520 -4673
10242 -4673 -31198 -81950 -45702 -17036 64344 126931 67942 9190 -3994 -34260 9636 -32392
10230 -32392 -57243 -7929 34551 100242 127591 109022 95775 74469 34474 63557 -10753 -115904
10218a15904P3790N8650M3538N5527K8191n6102k3447k9649M0832M2224p711K6948
10206A36887p9309n9970J0119j2184O161L7562J2476R7354o7194l6510l9684J0817
10194A6525k0035N8343N4794P436m5038K3475o5447k9802O019n871L6987J0200
10182D7586J9148q1639r005O2640O020k1643L7225N339M852k3328m2736n6633
10170e2174M1351O1828J5429O1552k5940j32848k1201O1780k3328m5951M1591
10159a7911K1984p464O8840l0823k9828O5480M1294n0887j00102p2883k5275O9975
10147f7600M0462Q2115j4126k9106l6954K8574L9432L6338J6881m5423k789L4834
10135H2638l8309j6567J5634k6706n4367J00841O7063J9812j7247o7305J5358
$$ plain form
10218 -115904 -42114 16536 60074 115601 143792 87690 64243 34594 75426 117650 109939 136887
10206 136887 57578 -2392 7727 -4457 1704 39266 51742 149096 81902 45392 5708 16525
10194 16525 -3510 54833 109627 117063 72025 95500 30053 251 6270 399 37386 47586
10182 47586 66734 -14905 -23910 38730 44750 23107 60332 65671 70523 47195 4459 -52174
10170 -52174 -10823 51005 66434 127986 102046 -30802 -52003 9777 -13551 -59502 -17911
10159 -17911 4073 -3391 65449 34626 4798 70278 111572 60685 -39417 -112300 -137575 -67600
10147 -67600 -27138 54977 40851 11745 -25209 3365 42797 79135 96016 50593 47804 82638
10135 82638 44329 27762 43396 16690 -37677 63164 130227 150039 132792 65487 80845
10124H0845r0781m27M6595m6174q2610K1560Q5772k3225n0328p676L5167K1067
10112a0215N9123M7149j406K5148o6307n3237j6498K5931q3749K8032N2623m4458
10100c7864n0354j3753k9993N9380N4280N7499L721K762k04k8779L9290m9346
10088F639K382m2859r053J7302R146m638L0311l3607k5319j7451k0191J33338
10076D6000Q0255k7605k3514L6522k5609o3969m38J22493l519n1658r8822l0145
10064d0009K2131L7560N9854m8359r50Q257j1826j6985j2568L2711o8236M1436
10052C016O697k8033J1784J6994j0237l1713J7115m8156k6621O0607K101L4573
10040H127O2810k9806M6487J03527J9182j15275j78428N6987O655K906k5630L1961
$$ plain form
10124 80845 -9936 -10363 36232 -9942 -92552 -70992 14780 -8445 -58773 -66449 -31282 -10215
10112 -10215 48908 96057 94651 119799 53492 255 -16243 9688 -74061 -46029 6594 -37864
10100 -37864 -88218 -101971 -131964 -72584 -18304 39195 42916 45678 45474 16695 55985 6639
10088 6639 9021 -33838 -42891 -25589 -16443 -21081 9230 -24377 -49696 -67147 -87338 46000
10076 46000 126255 98650 75136 111658 86049 22080 21642 144135 140616 88958 -9864 -40009
10064 -40009 -17878 19682 79536 31177 30227 38484 26658 9673 -2895 29816 -38420 3016
10052 3016 9713 -18320 -6536 10458 221 -31492 -14377 -62533 -89154 -28547 -26446 8127
10040 8127 70937 41131 87618 191145 210327 95052 -83376 -26389 -19734 -16828 -42458 -10497
10028a0497l3348N6319k1497l6755o438N2191j6454J9983J4844r199R6430n754
10016I9825m5311l0493L1420j2388k3608j8054M0059k752p6497k1878l8090K5755
10004g2012L8000k1861K0704P112L9146j7413m5935P066n7917M5223J8793k2381
9992f1475O1121J7959J4857J7472J4999j3452o7107m273O065j8542L6308M6936
9980E0868K1767J64539J38571J5669k424q7435p5352j04932k9431k1508N6928
9969A27260Q983J4226n7702m0415n732O2525q030o1133n1064O5906K6441K7224
9957A08489j3346l5853N7919m3836n8910K2095l0897K9264K7920P6698k3130j08872
9945G541l2932l540L5214m3506m7023n6334N4166J3697O5364L6995n1554J2489
$$ plain form
10028 -10497 -43845 12474 -9023 -45778 -52216 -25 -16479 3504 18348 9149 105579 99825
10016 99825 54514 24021 55441 43053 19445 1391 41450 38698 -37799 -59677 -97767 -72012
10004 -72012 -34012 -55873 -35169 -28057 11089 -6324 -52259 -45193 -103110 -57887 -39094 -61475
9992 -61475 -354 17605 32462 49934 64933 51481 -15626 -19899 -13834 -32376 3932 50868
9980 50868 72635 237174 375745 391414 388990 301555 226203 121271 91840 70332 127260
9969 127260 136243 150469 92767 52352 46620 109145 101115 39982 -11082 54824 81265 108489
9957 108489 95143 59290 117209 73373 14463 36558 5661 34925 62845 139543 116413 7541
9945 7541 -25391 -28931 6283 -37223 -84246 -140580 -86414 -72717 -7353 29642 -21912 -9423
9933i423L4017J9755k1789N1143k7160m3433m1800M4327r417K918j855k0251J9120
9920c848j8151N9524q3758o208L5268L2590M2790M6244L4723N2315L0243N0071
9908B71803l7788o1109p6503q5128L5508N1118q6044N0582M7807r021J03881J02168
9896C07274q0844j41331j8341J00206M2349n0686l6165P4323K1207j6844j3633
9885A87515k8363l5335j21157n3422m705L3297K7502K9281P907l2263q47m2835
9873c3425O37O1820K8977R9783m0721m4109j31265Q100L8965o8754M2411O0727
9861B3146O3552j1024O3495r135j30384n2319j3799l2222R723J42786J0899J7284
9849H2002K2961o028L6351o603O3920M3312r7800j19743j6885J548L3681k9224
$$ plain form
9933 -9423 24594 44349 22560 73703 46543 3110 -38690 5637 -3780 -862 -2717 -22968 -3848
9920 -3848 -21999 37525 -46233 -52441 -17173 15417 58207 104451 139174 191489 221732 271803
9908 271803 234015 172906 96403 11275 46783 97901 11857 62439 110246 101225 205106 307274
9896 307274 226430 85099 66758 166964 209313 158627 122462 196785 217992 201148 187515
9885 187515 159152 123817 2660 -50762 -55467 -22170 5332 34613 42520 10257 9410 -33425
9873 -33425 -32788 29032 58009 157792 117071 72962 -58303 -50203 -11238 -79992 -37581 23146
9861 23146 86698 75674 139169 130034 -350 -52669 -66468 -98690 -88967 53819 64718 82002
9849 82002 104963 98935 135286 128683 192603 235915 138115 18372 1487 3035 36716 7492
9837G492R144K6521l8375o1474J0625J6590j0855l258Q4619R4932k0599o0561
9825E4801o6162q615J4630J9106L4203O8439j4957k049j9310k4024n0654m6262
9813d0854K2344R297p0308j790J15484N1590K8017l1739j674R1794j511m0921
9801A29729j26293p2371k8149J2148P7657L6695K2530O1983k4630o1145k3632
9790D522o6736p719Q6101M8589K4536m1734J0982K1507L0339p8895o0346M8969
9778B0115M6265P9250N2814n1478p6617j2649j3809n613k718J051K817L5125K141
9765G6694J854m2118L949Q966K362J7027k4890k8417M5671J5290N49k1338m9654
9752E945q8413Q2457Q7343K1343n7185j456N8499M5782r7948m8855p5513j3599
$$ plain form
9837 7492 16636 43157 4782 -56692 -46067 -29477 -40332 -43590 41029 135961 115362 54801
9825 54801 -11361 -19976 -5346 13760 47963 116402 101445 99396 80086 56062 5408 -40854
9813 -40854 -18510 -9213 -79521 -81311 34173 85763 113780 82041 80367 172161 170650 129729
9801 129729 3436 -68935 -97084 -84936 -7279 29416 51946 113929 89299 28154 4522
9790 4522 -62214 -69933 16168 64757 89293 47559 58541 80048 110387 31492 -28854 20115
9778 20115 66380 145630 198444 146966 70349 57700 43891 38278 35560 36611 39428 74553 76694
9765 76694 78548 36430 40379 49345 51707 68734 43844 15427 61098 76388 76937 55599 5945
9752 5945 -82468 -11 87332 108675 51490 50034 108533 154315 56367 7512 -68001 -81600
9740h1600J20243J04036n1228m8018J4283L0463P4524J2141j06462l2370k9730
9729F282m3131M460j5576N9987J0625j2080J1639K3076J7700K7560m1259n3904
9717d621K2999q1907p1266Q2794M8819O6040P6820ln7056r3511m561M4287N2941
9704H1775o9920j1034O1775L6599n3397o2721P6655J13074l7092j32428q8463
9693h5177O49M6952L9251J5728l981l1188N8432J6844J4622O4262M0021L92J4577
9680A91384o9317p1670K3372R274o6407k2033o0343Q346J4591j0628J1813q707
9668e0325L5573J2857o8063r1676k2705O2733L9926Q7840R8961M7435k2160j5759
9656A14637q7702m4896k6505K9773P9371O315n688o231p5181k4396M1827R3665
$$ plain form
9740 -81600 38643 142679 91451 43433 57716 88179 162703 174844 68382 36012 6282
9729 6282 -36849 -32389 -47965 12022 22647 10567 22206 45282 62982 90542 49283 -4621
9717 -4621 18378 -63529 -134795 -52001 -3182 62858 139678 139675 82619 -10892 -15453 28834 81775
9704 81775 11855 821 62596 99195 45798 -16923 59732 172806 135714 3286 -85177
9693 -85177 -84528 -37576 1675 17403 13422 -17766 40666 57510 72132 136394 176415 176807 191384
9680 191384 122067 50397 73769 83043 16636 -5397 -65740 -57394 -42803 -53431 -41618 -50325
9668 -50325 -14752 -1895 -69958 -161634 -184339 -121606 -81680 6160 105121 152556 130396 114637
9656 114637 26935 -17961 -44466 -14693 64678 70993 65305 59074 -16107 -40503 1324 94989
9644I4989P9677p1556p0682R7037j2987l5336K9920N6513m6521L4021j27775p6222
9632d8922N2531K6463M1742N4194K8776n638j03135m4816k1247j04915j898J03047
9620b3818N8369l7090J5025K9518J38598m1875r3764m057M0417J4846P9502m6393
9608A29278j8538j7335l6702M969Q0860J2508J4277j7568J1080l4337k6012p7260
9596B5220o8099K1092J07608p496o5892J5229Q446P201p2402l2931J22674N769
9584F6419k3009K3275K5219k601l3457J738j6799J9006P687M0213J398K4982L3040
9571A67111O9250K1487j02925j58942N274L8431M7919L6156k8567j8202O703q2369
9559A326P3231J00031N7654l716j74806j02360n341Q4822o96M815q466Q208j6134
$$ plain form
9644 94989 174666 103110 32428 129465 116478 81142 111062 167575 121054 155075 27300 -48922
9632 -48922 3609 30072 71814 126008 154784 149146 46011 1195 -20052 -124967 -126865 -23818
9620 -23818 34551 -2539 12486 42004 180602 138727 44963 40906 81323 96169 175671 129278
9608 129278 110740 93405 56703 61672 142532 155040 169317 151749 162829 128492 102480 25220
9596 25220 -42879 -21787 85821 78325 12433 27662 36108 43309 -29093 -62024 60650 66419
9584 66419 43410 66685 91904 89303 55846 57584 40785 59791 67478 107691 109089 134071 167111
9571 167111 236361 257848 154923 -4019 1255 39686 87605 123761 95194 76992 83695 1326
9559 1326 74557 174588 232242 228526 53720 -48640 -53981 30841 30145 34960 26494 34702 18568
9546A8568O9554l631j1900k1309P641J5114m0886j2617J9909q4629L9192O5937
9534F0943M3169o3684J6264O7654r2770n9249l348O9555L1517O674k7864l9436
9522I425L646k1808P286M8413M0865m9115N0655P4620K607K7142Q043K6833j2052
9509B16560m4145l8965k2800n3890Q375N4208j8307j05099k6496P653L9347O9450
9497H5891j490p765m9362j8570j6908M3942L3579k6220o0717l9620P567P6479
9485B6806K0313J8055M306N12k2419j0036J8921m6917o5599Q994Q046J0868L9794
9472A1644M343n0931J8665Q4072N8259n0282M33J3545p8250l1479N5288M3250
9460G8557N4189Q7402p9948O255l9055n2953M2152K6338o5760l8953N462q3954
$$ plain form
9546 18568 88122 84491 72591 51282 58923 74037 33151 20534 40443 -44186 -4994 60943
9534 60943 104112 40428 56692 124346 31576 -27673 -31021 38534 70051 76725 48861 9425
9522 9425 13071 -8737 -1451 46962 87827 38712 89367 163987 166594 193736 201779 228612 216560
9509 216560 172415 133450 110650 56760 65135 119343 101036 -4063 -30559 -22906 16441 85891
9497 85891 84401 76636 27274 8704 -8204 35738 69317 43097 -17620 -57240 -49673 26806
9485 26806 47119 65174 69480 69992 47573 37537 56458 9541 -56058 -47064 -39018 -28150 11644
9472 11644 15987 -34944 -16279 67793 126052 75770 76203 89748 11498 -19981 35307 78557
9460 78557 132746 220148 140200 146455 107400 54447 96599 122937 57177 18224 23686 -60268
9448f0268j2186J3568N2910O2910Q1921p9282j03187M1453O8331M958N3237N3248
9436A77613m0332k0575J3794J3190p1383L639k1194j3407L1721k4160q597k6691
9424A3618K8458L0678M9791k0046J3061k255P183n2863L2258M1181j4841J3205
9412A39428O13M2934M2062o42l4654M8310q263m0023o3693j0888J9979L5595M1631
9399B12389j6959q8803L574R8953k4625K2855l8924k6350J3278K1341J3637m4269
9387A46097k8890l3969m9322K4719L2379n7357K3535L0274p8687n3126Q8265k139
9375D1779k7482q4441J358N9199Q289m932K6998q935N6474k3483O676J6911K8320
9362I6731L9730o468R542J6112k2478o2668m3399L013J37P6106R1768n9554j57400
$$ plain form
9448 -60268 -72454 -58886 -5976 56934 138855 59573 -43614 -2161 66170 71128 124365 177613
9436 177613 137281 116706 130500 143690 72307 75946 54752 41345 73066 48906 40309 13618
9424 13618 42076 72754 122545 102499 115560 113305 120488 67625 99883 141064 126223 139428
9412 139428 140041 182975 225037 224395 189741 238051 229788 189765 126072 115184 135163 170758 212389
9399 212389 195430 106627 110201 209154 184529 207384 168460 142110 155388 176729 190366 146097
9387 146097 117207 83238 33916 58635 91014 33657 57192 87466 8779 -44347 43918 41779
9375 41779 14297 -70144 -68786 -9587 -1298 -6230 20768 11833 68307 44824 51500 68411 96731
9362 96731 136461 129993 139535 155647 133169 70501 27102 30115 30252 106358 198126 138572 -18828
9349a8828l0777J25618J51314p8887n0135O1575k0383K9648L3339L964k3350N0754
9337B33852P4355L7867j06314m9354k1630p5630J385N8066p725J1790m3594L4419
9325A47487O4689p954K1302n5840l3755J0994K6604k6147J1789M737P6198P8220
9313C18324R332l6028M575l7834q0644j3972k7229q39P2561P6751n2837r1335
9301A40825L3646J7989j0664r18L8632k6919l0400J0949J6720N3960J1542K8820
9289B84182j8077p551q4155p1543l5609J3505J13142j4115j5398P6974m3834j1128
9277A86393j5347N305N4084K074o7388m2934m4767K3643R1043K908m3631o6740
9265H4643l5825O6707K1468l7927K5493L0418L5465Q48J5439J917k0574L8521
$$ plain form
9349 -18828 -49605 76013 227327 148440 98305 159880 139497 169145 202484 206448 183098 233852
9337 233852 308207 346074 239760 190406 168776 93146 94531 152597 144872 156662 113068 147487
9325 147487 212176 204222 225524 169684 135929 146923 173527 147380 159169 163906 240104 318324
9313 318324 327656 291628 296203 258369 177725 163753 136524 135685 208246 284997 232160 140825
9301 140825 174471 192460 181796 180878 219510 192591 162191 173140 189860 243820 255362 284182
9289 284182 266105 258554 174399 102856 67247 80752 193894 179779 164381 241355 197521 186393
9277 186393 171046 176351 230435 232509 165121 122187 77420 101063 192106 195014 151383 84643
9265 84643 48818 115525 136993 99066 124559 154977 190442 191290 206729 208646 188072 226593
9253B26593J9653n115l2139j06013o2539P2803M3730L3360L0059K3220Q399l6226
9241B15785J3188M5841o5704r7533P3850J8703j8829j309N5994n0712l3955Q675
9229A63994M329L5989l5313n0604j1664M933Q1484j4498m5309o258j0362K8319
9217A45040J11416M1374l59n1674m8629M9591R5201P018l5946M7766K379p0977
9205B92200l9270M67K5253N1692p9316l7310O5859K2556L6797n2686L7989K9879
9193C54110q5528p7190k6630L4135J7403o5186L1933J240P1198N9306l2600n1282
9181B30909J665M4478P5651L022N7417l9084Q840N2402j1846O869o2538Q387J1148
9168C87320O18k5482J3614K963Q301k6042J3629K8888k7577l0335l3656L6864
$$ plain form
9253 226593 246246 241131 208992 102979 40440 113243 156973 190333 220392 243612 252011 215785
9241 215785 228973 274814 209110 111577 185427 204130 185301 183992 239986 189274 155319 163994
9229 163994 168323 204312 168999 118395 106731 111664 193148 178650 133341 127083 116721 145040
9217 145040 256456 297830 297471 245797 197168 246759 341960 348978 313032 360798 363177 292200
9205 292200 252930 253397 278650 330342 251026 213716 279575 302131 338928 286242 324231 354110
9193 354110 268582 191392 164762 198897 216300 151114 183047 184287 255485 314791 282191 230909
9181 230909 232574 277052 352703 355725 413142 374058 382898 435300 423454 430323 367785 376172 387320
9168 387320 387938 362456 376070 379033 387334 361292 374921 403809 376232 345897 312241 349105
9156C49105L278P8425O1254j5940o8474P3684P3745K352j1561N7690P620j280
9144F09898o0166L751M7983K179l3098R2912M9707J6217K430K0381J56622L6667
9132I45483J22492R1533J14662J16818O4814J6770J38977K48008L20717L73211
9122B553485L94027M83021N87768P81076J158589J596482K267107L526341N475576
9113A8823472Q531880J2737207J6806774J5500488L352153j2192067j7789755
9106D5770152j3863455q976695n784256l880352k855630k063648j488119j131329
9098E726668q35699o51671m88291l54825l41843l65786l13632k50226k17514j99655
9088A707526j68450n9024K1608k8215j15625n9411n2112j17302m7456J7970k2372
$$ plain form
9156 349105 352383 430808 492062 476122 407648 481332 555077 557429 545868 603558 611178 609898
9144 609898 549732 553483 601466 603645 570547 663459 713166 729383 731813 752194 908816 945483
9132 945483 1067975 1159508 1274170 1390988 1455802 1472572 1611549 1859557 2180274 2553485
9122 2553485 2947512 3430533 4018301 4799377 5957966 7554448 9821555 13347896 18823472
9113 18823472 27355352 40092559 56899333 72399821 75751974 63559907 45770152
9106 45770152 31906697 22930002 17145746 13265394 10409764 8346116 6857997 5726668
9098 5726668 4890969 4239298 3751007 3396182 3054339 2688553 2374921 2124695 1907181 1707526
9088 1707526 1539076 1480052 1501660 1473445 1357820 1298409 1246297 1128995 1081539 1099509 1077137
9077A077137m2990q1508l3048k9576o1486J5612L6029p945j278m6619l8130M1328
9065H27526J07990k2400o3966j15914n9912M5232p7177j9556j0425N8822p986
9054F62234j9561k0245o7901j7876Q7976M3482r1737J3084m243k1487j4239l5208
9042E14279J1943m0830n5774m5200j03159K5497P7090J9549q750n2366J23961
9031D66240Q4429M066l653j5222q1044l4985j1999N001l076K6703n0559P1054
9019D56955M8833J069l2418m2151o4034Q2256K2835j03296j09254k9433K8209
9008B59571L9341l8748j7744J5927k2297L782m1535O8615Q082o6067M5827J060
8996B55814J7276J5083M8667J4083m2225M9795L5909k3056P595j8879r0890k5472
$$ plain form
9077 1077137 1034147 952639 919591 890015 828529 844141 880170 872225 870947 824328 786198 827526
9065 827526 935516 913116 849150 733236 673324 718556 641379 621823 611398 670220 662234
9054 662234 642673 622428 554527 536651 624627 668109 576372 589456 585213 563726 549487 514279
9042 514279 526222 485392 429618 384418 281259 306756 383846 403395 394645 342279 466240
9031 466240 550669 554735 551082 535860 454816 419831 407832 412833 409757 436460 385901 456955
9019 456955 505788 506857 474439 432288 368254 450510 473345 370049 260795 231362 259571
9008 259571 298912 260164 242420 258347 236050 239832 198297 266912 274994 208927 254754 255814
8996 255814 273090 288173 336840 350923 308698 358493 394402 371346 378941 360062 269172 243700
8984B43700k6676o0692L7698J6241K3206j3760o2914r700O2788p373o5732M554
8972A41340K0137J5288p0679k1774j1016N1568L4041O8201k3950k2400n8551L4943
8960A57148J41364j5923m3818O8829L7264L3793J4191l7658q0507J5343k7251
8949B62775l6373q732l5247m8536R3747L2613M4636p9100n5278n5802o263K9099
8937A37539O0654q7255n8847Q555m4001j1879j3157K4378J9448l384k0156L6083
8925D7978O8621R3949K236p6265m4993k0488O7373k2782K4629O8294N0087m6248
8913B12391n9237p104N2149M6327n0950m1978k1032M4027K9303n2668n8574J470
8901I4124m4126m3303k902L1138L1563R519J9097N4917k3892m8970m6336n865
$$ plain form
8984 243700 217024 156332 194030 210271 233477 219717 156803 147103 209891 202518 136786 141340
8972 141340 161477 176765 106086 84312 73296 124864 158905 227106 203156 180756 122205 157148
8960 157148 298512 282589 238771 307600 344864 378657 392848 355190 274683 290026 262775
8949 262775 226402 217670 182423 133887 227634 260247 304883 225783 170505 114703 108440 137539
8937 137539 198193 110938 52091 60646 16645 4766 -8391 15987 35435 32051 11895 47978
8925 47978 116599 210548 212784 136519 91526 71038 138411 115629 140258 208552 258639 212391
8913 212391 153154 146050 198199 244526 193576 151598 130566 174593 203896 151228 92654 94124
8901 94124 49998 6695 3793 34931 66494 76013 95110 150027 126135 77165 30829 24964
8889B4964N794n2094M079P5025R390j7224j2757j4174p600J0198L6531K9265J4265
8876A05662K8216P478O2613J8867l4596o9371m6110m96K3307q4432m8300N3528
8864A6366J846L3548M7636J8967n2612j0524L8008k1195j4924J5073J6365O2258
8852A50812L0478J5173o3722l7481O7168O0687p2931M8565K371j15434M383L9009
8840A29078j2608P9253l3823p2221j4238n4130o9193Q467M9580L7679k1124L9462
8828F6182n9777l4214O14J3147L0469J4191J0852L7338k4239j36233k308J26277
8816D2299M926n1510j0281l5498m2980O2695Q8753K3089J5587j9576O7303q1439
8804F3368M601M4677L1581N0678P2961r4242m1566o3422k4214k4587K4144M2410
$$ plain form
8889 24964 30758 -21336 -17257 57768 67158 49934 37177 23003 15403 25601 62132 91397 105662
8876 105662 133878 141356 203969 222836 188240 118869 72759 72263 95570 11138 -37162 16366
8864 16366 18212 51760 99396 118363 65751 55227 93235 72040 57116 72189 88554 150812
8852 150812 181290 196463 132741 95260 162428 223115 150184 198749 201120 85686 90069 129078
8840 129078 116470 195723 161900 89679 75441 21311 -47882 -39415 10165 47844 26720 66182
8828 66182 6405 -27809 -27195 -14048 16421 30612 41464 78802 54563 -81670 -83978 42299
8816 42299 47225 -4285 -14566 -50064 -93044 -30349 58404 81493 97080 77504 144807 63368
8804 63368 67969 112646 144227 194905 267866 173624 132058 68636 44422 19835 43979 86389
8792H6389k4155O2897J6999K9237l4615m3555q8302L2457M1587L0394l3968L278
8780G8643m0296K6809o5141J8079k0949M9311r0183r9710O4710k3809K0774R5438
8768A3676N3833j6807l5913n9815l2323N4432l969l7002N7666j1706n4800l6995
8756a09723Q5775m0237q012J49963O9146m3803r3939L6923J05721K344K031J6536
8744A72725k4519Q718M7280K927n6312l5161m9520R2296K8721j802m919l7482
8732A42952l0128j6639L2925j05937r1639l9155M9749Q5950l0180P1855n845N471
8720F9379L3220j3771L4041M3157o2517l7723j5685k3601K7790L6007j765L0807
8708A19339R1900K0260m5129r207Q8086q127L1547j5706o0309j36681r5236R3105
$$ plain form
8792 86389 62234 125131 142130 171367 136752 93197 4895 37352 78939 109333 75365 78643
8780 78643 38347 65156 15 18094 -2855 46456 -43727 -143437 -78727 -102536 -81762 13676
8768 13676 67509 50702 14789 -45026 -77349 -22917 -26886 -63888 -6222 -17928 -72728 -109723
8756 -109723 -23948 -64185 -72197 77766 146912 103109 9170 46093 151814 154158 156189 172725
8744 172725 148206 156924 204204 207131 150819 115658 66138 158434 187155 185353 180434 142952
8732 142952 112824 96185 129110 23173 -68466 -107621 -57872 28078 -2102 69753 63908 69379
8720 69379 102599 88828 122869 166026 103509 65786 50101 26500 54290 90297 88532 119339
8708 119339 211239 231499 186370 177163 265249 257122 288669 272963 212654 75973 -19263 73842
8696G3842Q7954L2193M240o0240j680N10K6408L8326K9231n2284m4948j7328Q1737
8683A97961N2197N4694j094m4232n1630Q8819l1174k5551M8413m2052q2325O5870
8671B29896r8401l1553J4551K1204J0252j0278l7375j9730J5963J2171m7891R720
8659F8529N158M5453L6521k3780j7581l6941L7151L4656N9855J2052n4830o1733
8647A04510Q7718N0876J3861M55l1244m5540O5983N1578N2356m8950O263K2050
8635C29916M4550N0814n3305l770o369Q4253Q789n9044j1562N0606o7054k7760
8623C40064M0195r099K7698Q2247L2633p0476o3242K1818J7236j9360R731j708
8611D07737l6286k36l9783r7658K5817P5389J02865M8532j5836r5756J1667K946
$$ plain form
8696 73842 161796 193989 198229 137989 136309 136819 163227 201553 230784 178500 133552 116224 197961
8683 197961 250158 304852 303758 259526 207896 296715 265541 239990 288403 246351 164026 229896
8671 229896 131495 99942 114493 135697 145949 135671 98296 78566 94529 106700 58809 68529
8659 68529 73687 119140 155661 131881 114300 77359 114510 149166 209021 221073 166243 104510
8647 104510 192228 243104 256965 257420 226176 180636 246619 298197 350553 301603 307866 329916
8635 329916 374466 425280 371975 368205 361836 446089 454878 395834 384272 434878 367824 340064
8623 340064 380259 371160 398858 481105 513738 443262 380020 401838 419074 399714 409445 407737
8611 407737 371451 371215 331432 233774 259591 334980 437845 486377 470541 374785 386452 389398
8599C89398l3968r1066m4884k5150p9505l6480Q0694M7190P781m0119L040J9483
8587A96414L6554L5091n9759J7900R879j7079J9520K8096n1570j2012r5087p5027
8575C2920J0081j6554O7151N598m4824K6565J07201O735J5375l7964r697L4837
8563A97424l8337n7385p2966j546q4005K8320R6571K7648r977M4986J04148m5815
8551A89066M7025l7465l9291l9480O757O0360R8495p8284j26554q2638R101L1016
8539C8108m266R567o437L1107J18926l1003L5208L2560l039o7761j14279m1832
8527c141k5009k1138P3112N8650j3409m6055p038J04912n6775m5881J7815p9360
8515d3317j9200K2696M9060J1343J5545L5044l7858l0688L7123M372J0219k0690
$$ plain form
8599 389398 355430 264364 219480 194330 114825 78345 159039 206229 214010 173891 176931 196414
8587 196414 232968 268059 208300 226200 236079 219000 238520 266616 215046 203034 107947 32920
8575 32920 43001 26447 93598 99196 54372 80937 188138 194873 210248 172284 162587 197424
8563 197424 159087 101702 28736 27190 -56815 -28495 68076 95724 85747 130733 234881 189066
8551 189066 236091 198626 159335 119855 126612 186972 285467 207183 80629 -2009 7092 38108
8539 38108 33842 43409 36972 68079 187005 156002 191210 223770 220731 152970 38691 -3141
8527 -3141 -28150 -49288 23824 82474 69065 23010 15972 120884 64109 18228 36043 -43317
8515 -43317 -62517 -39821 9239 20582 36127 71171 33313 2625 39748 44120 54339 33649
8503C3649j8737j01731n0950J47382J9148j03015K501J52454M6568J6590j00389
8492D3470K176P752j0994j5084J4417J9814M1919m8615N7907O7473k9326r354
8480A41555N1318K3239M7066j320M584Q782n4254p6260l5254j00307j3082J2627
8468H694J1563O9781M334J2331N1800P5473k3160j46881p3509K5232O639K5356
8456D7653p3282o2272O9181Q1057l8316M3278N9164J5019j9828J663q2747O2466
8444A03036K6939j7436m1312K0050J4521J5282Q221N2204O1945l4362q9518l3508
8432H6062m0827J2866K6058L7380p094n5956K348j3638J5832k2937j05959Q354
8420e7511J33847K1214k0341K0438P9848M4999q2090Q289l7213N5470O317n9829
$$ plain form
8503 33649 14912 -86819 -137769 9613 28761 -74254 -71753 80701 127269 143859 43470
8492 43470 45646 53398 42404 27320 41737 61551 103470 54855 112762 180235 150909 141555
8480 141555 192873 216112 263178 261858 266442 275224 220970 144710 109456 9149 -3933 8694
8468 8694 20257 90038 94372 106703 158503 233976 210816 63935 -9574 15658 22297 47653
8456 47653 -25629 -87901 -18720 62337 24021 67299 126463 141482 121654 123317 40570 103036
8444 103036 129975 112539 71227 91277 105798 121080 129301 181505 243450 209088 119570 86062
8432 86062 45235 58101 84159 121539 114445 58489 60837 47199 63031 40094 -65865 -57511
8420 -57511 76336 97550 77209 97647 177495 222494 140404 148693 111480 166950 173267 113438
8408A13438K4224k1497o4627O8687M1074L2517L3519m573j3914p6171k6765K7653
8396A33565N4156m0755m6268n062K1409J4663k1098j8114r2998m7769p8279J5431
8384a11119J32556N1996N993j8028J0185P5351K6829n4928p1114q996N2538M6121
8372A37384j3295o5260r6134k6637R871K9743L0292K7614j2242R404j1095l2323
8360a2678m5001m5364L0645P475J25052O1500m4863o4459K8522Q4848J1388p085
8348A29980j00422j8270O5563j0381n2509l8236n522n8270r769N0487J04493n1189
8336E955j03909k5982k0808M6194P6042O177L595L6268n079o0364L18N3871L3819
8323D6097L3141N3398O2m2989L4742m2976m0535K3904N1777K3040m0631l1933
$$ plain form
8408 113438 137662 116165 51538 120225 161299 193816 227335 222762 208848 132677 105912 133565
8396 133565 187721 146966 100698 95636 117045 131708 110610 92496 -502 -48271 -126550 -111119
8384 -111119 21437 73433 79426 61398 71583 146934 173763 118835 47721 38725 91263 137384
8372 137384 124089 58829 -37305 -63942 -54071 -24328 5964 33578 21336 30740 19645 -12678
8360 -12678 -57679 -103043 -72398 -64923 60129 121629 76766 12307 40829 125677 137065 129980
8348 129980 29558 11288 76851 66470 13961 -24275 -29797 -88067 -97836 -47349 57144 5955
8336 5955 -97954 -123936 -144744 -98550 -22508 -16331 -12736 23532 18453 -41911 -41593 12278 46097
8323 46097 79238 132636 132698 89709 124451 81475 40940 64844 116621 139661 99030 67097
8311F7097l9050r109N057l5737q25J03955r619o3186n3988L0191M8893m984q6517
8298d7822O8309J8090k8775j8727K0408j5169M2868m0539k7304O0314P1124M6732
8286A49509K5321j4440l3853l4094p0025k8564p7454J9406J17638M2026o9689
8275B5781n2434l095M1661Q429m6462K0100M3388P1062R391k7772n7785l4458
8263b194m234J4202Q0567r12l3785Q371m3879J7364K7870R210M1903n874j3992
8250I4617l7404K9332l0846N96m3565n586J8127P4437J7501Q7995q6525j88045
$$ plain form
8311 67097 28047 18938 23995 -11742 -12567 91388 81769 18583 -35405 -5214 43679 38695 -47822
8298 -47822 20487 38577 9802 -8925 11483 -3686 39182 -1357 -28661 31653 102777 149509
8286 149509 174830 160390 126537 92443 22418 -6146 -83600 -64194 53444 95470 25781
8275 25781 -26653 -29748 11913 20342 -26120 -6020 37368 108430 117821 90049 32264 -2194
8263 -2194 -6428 7774 88341 87429 53644 62015 18136 35500 63370 72580 114483 108609 94617
8250 94617 57213 86545 55699 56295 12730 7144 25271 99708 117209 205204 118679 -69366
$$ [...]
##END NTUPLES=NMR SPECTRUM
##END=
