##TITLE=Analysis number 329200
Compound Code cc 66502
Book Reference 467/178
Project Code adrs
Chemist Name benw
##JCAMPDX= 6.0         $$ Bruker NMR JCAMP-DX V2.0
##DATA TYPE= NMR SPECTRUM
##DATA CLASS= NTUPLES
##ORIGIN= Bruker BioSpin GmbH
##OWNER= nmr
$$ XWIN-NMR		Version 3.5
$$ Thu Aug  9 14:16:37 2007 GMT Daylight Time (UT+1h)  MAYBRIDGE\nmr@NMR_250MHZ
##.OBSERVE FREQUENCY= 250.131544655141
##.OBSERVE NUCLEUS= ^1H
##.ACQUISITION MODE= SIMULTANEOUS (DQD)
##.ACQUISITION SCHEME= undefined
##.AVERAGES= 16
##.DIGITISER RES= 18
##SPECTROMETER/DATA SYSTEM= dpx250
##.PULSE SEQUENCE= zg30
##.SOLVENT NAME= CDCl3
##.SHIFT REFERENCE= (INTERNAL, CDCl3, 0, 16.522)
##AUDIT TRAIL= $$ (NUMBER, WHEN, WHO, WHERE, WHAT)
$$ ##TITLE= Audit trail, XWIN-NMR		Version 3.5
$$ ##JCAMPDX= 5.01
$$ ##ORIGIN= Bruker BioSpin GmbH
$$ ##OWNER= nmr
$$ C:\u/data/dgb/nmr/ADRS/330/pdata/1/auditp.txt
$$ ##AUDIT TRAIL=  $$ (NUMBER, WHEN, WHO, WHERE, WHAT)
(   1,<2007-08-09 14:16:11.47 +100>,<MAYBRIDGE\nmr>,<NMR_250MHZ>,
      <created by zg, POWCHK disabled, PULCHK disabled
       configuration hash MD5:
       76 6E 9A 78 1E 09 19 81 EC 84 63 8F B0 6A 59 2D
       data hash MD5: 64K
       3E BE 34 D5 59 96 39 7A B3 93 3A F4 02 D4 47 7A>)
(   2,<2007-08-09 14:16:26.54 +100>,<MAYBRIDGE\nmr>,<NMR_250MHZ>,
      <Start of raw data processing
       ef LB = 0.3 FT_mod = 6 PKNL = 1 SI = 32K 
       data hash MD5: 32K
       86 08 AB 49 A7 E8 CC BA C1 A3 9B 1F D2 6E D4 10>)
(   3,<2007-08-09 14:16:28.18 +100>,<MAYBRIDGE\nmr>,<NMR_250MHZ>,
      <apk 
       data hash MD5: 32K
       D5 BC 67 F7 DD DB 02 7F 11 2E E1 B6 3E 11 4A 84>)
(   4,<2007-08-09 14:16:29.01 +100>,<MAYBRIDGE\nmr>,<NMR_250MHZ>,
      <abs ABSG = 5 
       data hash MD5: 32K
       BA 26 D6 5A D6 D4 E9 C7 12 2E AA 81 5E 17 A9 49>)
$$ ##END=
$$ 
$$ hash MD5
$$ AF 7F F1 4D 81 0B 38 8E 0F C6 40 F1 94 DA DD D2
##$RELAX= 
##$RELAX= 
##$RELAX= 
##$RELAX= 
##$RELAX= 
##$RELAX= 
##$RELAX= 
$$ Bruker specific parameters
$$ --------------------------
##$DU= <C:\u>
##$EXPNO= 330
##$NAME= <ADRS>
##$PROCNO= 1
##$TYPE= <nmr>
##$USER= <dgb>
##$AMP= (0..31)
100 100 100 100 100 100 100 100 100 100 100 100 100 100 100 100 100 100 
100 100 100 100 100 100 100 100 100 100 100 100 100 100 
##$AQSEQ= 0
##$AQ_mod= 3
##$AUNM= <au_zg>
##$AUTOPOS= <2 >
##$BF1= 250.13
##$BF2= 250.13
##$BF3= 250.13
##$BF4= 250.13
##$BF5= 500.13
##$BF6= 500.13
##$BF7= 500.13
##$BF8= 500.13
##$BYTORDA= 1
##$CFDGTYP= 0
##$CFRGTYP= 5
##$CHEMSTR= <none>
##$CNST= (0..31)
1 1 145 1 1 1 1 1 1 1 1 1 1 1 1 1 1 1 1 1 1 1 1 1 1 1 1 1 1 1 1 1 
##$CPDPRG= <>
##$CPDPRG1= <>
##$CPDPRG2= <>
##$CPDPRG3= <>
##$CPDPRG4= <mlev>
##$CPDPRG5= <mlev>
##$CPDPRG6= <mlev>
##$CPDPRG7= <mlev>
##$CPDPRG8= <mlev>
##$CPDPRGB= <>
##$CPDPRGT= <>
##$D= (0..31)
0 1 0 0 0 0 0 0 0 0.06 0 0 0 0 0 0 0.0002 0 0 0 0 0 0 0 0 0 0 0 0 0 0 
0 
##$DATE= 1186665370
##$DBL= (0..7)
120 120 120 120 120 120 120 120 
##$DBP= (0..7)
150 150 150 150 150 150 150 150 
##$DBP07= 0
##$DBPNAM0= <>
##$DBPNAM1= <>
$$ [...]
##$SUBNAM7= <"">
##$SUBNAM8= <"">
##$SUBNAM9= <"">
##$SW= 20.6930455092707
##$SWIBOX= (0..15)
0 0 3 0 0 0 0 0 0 0 0 0 0 0 0 0 
##$SW_h= 5175.983436853
##$TD= 65536
##$TD0= 1
##$TE= 297.16
##$TE2= 300
##$TE3= 300
##$TEG= 300
##$TL= (0..7)
0 120 120 120 120 120 120 120 
##$TP= (0..7)
150 150 150 150 150 150 150 150 
##$TP07= 0
##$TPNAME0= <>
##$TPNAME1= <>
##$TPNAME2= <>
##$TPNAME3= <>
##$TPNAME4= <>
##$TPNAME5= <>
##$TPNAME6= <>
##$TPNAME7= <>
##$TPOAL= (0..7)
0.5 0.5 0.5 0.5 0.5 0.5 0.5 0.5 
##$TPOFFS= (0..7)
0 0 0 0 0 0 0 0 
##$TUNHIN= 0
##$TUNHOUT= 0
##$TUNXOUT= 0
##$USERA1= <user>
##$USERA2= <user>
##$USERA3= <user>
##$USERA4= <user>
##$USERA5= <user>
##$V9= 5
##$VALIST= <valist>
##$VCLIST= <CCCCCCCCCCCCCCC>
##$VD= 0
##$VDLIST= <DDDDDDDDDDDDDDD>
##$VPLIST= <PPPPPPPPPPPPPPP>
##$VTLIST= <TTTTTTTTTTTTTTT>
##$WBST= 1024
##$WBSW= 4
##$XGAIN= (0..3)
0 0 0 0 
##$XL= 0
##$YL= 0
##$YMAX_a= 188911
##$YMIN_a= -109984
##$ZGOPTNS= <>
##$ZL1= 120
##$ZL2= 120
##$ZL3= 120
##$ZL4= 120
##$ABSF1= 16.522
##$ABSF2= -4.171173
##$ABSG= 5
##$ABSL= 3
##$ALPHA= 0
##$AQORDER= 0
##$ASSFAC= 0
##$ASSFACI= 0
##$ASSFACX= 0
##$ASSWID= 0
##$AUNMP= <proc_1d>
##$AZFE= 0.1
##$AZFW= 0.1
##$BCFW= 0
##$BC_mod= 0
##$BYTORDP= 0
##$COROFFS= 0
##$CY= 12.5
##$DATMOD= 1
##$DC= 0
##$DFILT= <>
##$DTYPP= 0
##$F1P= 14.0000005364418
##$F2P= -0.99999901652339
##$FCOR= 0.5
##$FTSIZE= 32768
##$FT_mod= 6
##$GAMMA= 0
##$GB= 0
##$INTBC= 1
##$INTSCL= 1
##$ISEN= 128
##$LB= 0.3
##$LEV0= 0
##$LPBIN= 0
##$MAXI= 10000
##$MC2= 0
##$MEAN= 0
##$ME_mod= 0
##$MI= 0
##$NCOEF= 0
##$NC_proc= -4
##$NLEV= 6
##$NOISF1= 0
##$NOISF2= 0
##$NSP= 0
##$NTH_PI= 0
##$NZP= 0
##$OFFSET= 16.522
##$PC= 1
##$PHC0= -42.65442
##$PHC1= 10.46788
##$PH_mod= 1
##$PKNL= yes
##$PPARMOD= 0
##$PSCAL= 4
##$PSIGN= 0
##$REVERSE= no
##$SF= 250.13
##$SI= 32768
##$SIGF1= 0
##$SIGF2= 0
##$SINO= 400
##$SIOLD= 32768
##$SREGLST= <1H.CDCl3>
##$SSB= 0
##$STSI= 32768
##$STSR= 0
##$SW_p= 5175.98343685301
##$SYMM= 0
##$S_DEV= 0
##$TDeff= 65536
##$TDoff= 0
##$TI= <Analysis number 999999
Compound Code 99
Book Reference 9
Project Code 9>
##$TILT= no
##$TM1= 0
##$TM2= 0
##$TOPLEV= 0
##$USERP1= <user>
##$USERP2= <user>
##$USERP3= <user>
##$USERP4= <user>
##$USERP5= <user>
##$WDW= 1
##$XDIM= 32768
##$YMAX_p= 384719752
##$YMIN_p= -430377
$$ End of Bruker specific parameters
$$ ---------------------------------
##NTUPLES= NMR SPECTRUM
##VAR_NAME=  FREQUENCY,     SPECTRUM/REAL,   SPECTRUM/IMAG
##SYMBOL=    X,             R,               I
##VAR_TYPE=  INDEPENDENT,   DEPENDENT,       DEPENDENT
##VAR_FORM=  AFFN,          ASDF,            ASDF
##VAR_DIM=   32768,         32768,           32768
##UNITS=     HZ,            ARBITRARY UNITS, ARBITRARY UNITS
##FACTOR=    0.157963299565203, 1,           1
##FIRST=     4132.6476996994, 0,             0
##LAST=      -1043.33573715361, 0,           0
##MIN=       -1043.33573715361, -430377,     0
##MAX=       4132.6476996994, 384719752,     0
$$ Real data points
##PAGE= N=1
##DATA TABLE= (X++(R..R)), XYDATA
$$ [...]
##PAGE= N=2
##DATA TABLE= (X++(I..I)), XYDATA
26310F84720k07424r8805P7789Q9826j4423J12999M2754p9198j40672j8962J83264
$$ 684720 477296 378491 456280 546106 531683 644682 687436 608238 467566 448604 631868
26299F31868J07208M668k1082m8991j24163L965R7575J2589J4410p3706k05815
$$ 631868 739076 743744 722662 673671 549508 553473 651048 663637 678047 604341 398526
26288C98526m5209J50802K617J00547O5801Q4496P296m0834j129l4946j6732j1278
$$ 398526 353317 504119 506736 607283 673084 757580 764876 724042 722913 687967 671235 659957
26276F59957p463M596L7452k9688p1467o884j794J06731k3m8400J1114j0427M3553
$$ 659957 652494 657090 694542 664854 593387 586503 584709 691440 691417 643017 654131 643704 687257
26263F87257n3718j12330J04420J32039J00612L6122K7215q6895j63300L848l1052
$$ 687257 633539 521209 625629 757668 858280 894402 921617 834722 671422 675270 644218
26252F44218k4811L234J6950j4518M1485N3649j9366J7329J6051K727M2161q2846
$$ 644218 619407 622641 639591 625073 666558 720207 700841 718170 734221 736948 779109 696263
26240F96263l9371o8348N0184J6347M5785m742l5020J7912M5474j8317k15n3628
$$ 696263 656892 588544 638728 655075 700860 696118 661098 679010 724484 706167 705952 652324
26228F52324j10716O5233J51713J42704j21756p8288k8608n2374Q4993L7390J6035
$$ 652324 541608 606841 758554 901258 779502 701214 672606 620232 705225 742615 758650
26217G58650j3154Q90J3304l7297j9680n9323L1020L6007m5737J9103O5017N8576
$$ 758650 745496 746386 759690 722393 702713 643390 674410 710417 664680 683783 748800 807376
26205H07376m7282M569j08279Q359M3466r014q8608q3573Q0280K3361j70623k631
$$ 807376 760094 764663 656384 664743 708209 699195 610587 527014 607294 630655 460032 457401
26193D57401J40144O8790K1603K8857J8381P4464j07242j03297O5153j0264o1497
$$ 457401 597545 666335 687938 716795 735176 809640 702398 599101 664254 653990 592493
26182E92493J427K2438M262o7121n6319L0710p7997j9102K1300q25M4831n2876
$$ 592493 593920 616358 620620 553499 497180 527890 449893 430791 452091 451266 496097 443221
26170D43221N9381J21680L5839L0682K8569n4462p3023n5209J2175m1751j03810
$$ 443221 502602 624282 660121 690803 719372 664910 591887 536678 548853 507102 403292
26159D03292m096O8055J36733N4514q2488k4115P4083N6098M6414p1755j54708
$$ 403292 399196 467251 603984 658498 576010 551895 625978 682076 728490 656735 502027
26148E02027k5001L2477O6734P4093P8939k0854O7364n2051j11609N1445J30211
$$ 502027 477026 509503 576237 650330 729269 708415 775779 723728 612119 663564 793775
26137G93775M3811O0273J3132j61528j80307j15125L9708m9918q4970P5902J50136
$$ 793775 837586 897859 910991 749463 569156 454031 493739 443821 358851 434753 584889
26126E84889M4444Q2719K6636J25846l3134n7791O6321m4222o6967j70468L4115
$$ 584889 629333 712052 738688 864534 831400 773609 839930 795708 728741 558273 592388
26115E92388N3387K7528J00061j5902R4222L8900K5340o6138q9166N1059q7681
$$ 592388 645775 673303 773364 757462 851684 890584 915924 849786 760620 811679 723998
26104G23998n7015O916j61215n2149R3359J08883M0070n0433J2841l843l0820
$$ 723998 666983 673899 512684 460535 553894 662777 702847 652414 665255 661412 630592
26093F30592j01739m0231M7587M1895r2487R4298O8267P9228j3814J5900J58671
$$ 630592 528853 488622 536209 578104 485617 579915 648182 727410 713596 729496 888167
26082H88167N8504l9504j2974M0054q1813p9497m3349O6049j9900p8193Q0916
$$ 888167 946671 907167 894193 934247 852434 772937 729588 795637 775737 697544 778460
26071G78460O779l9014P7158j18180p4496o4869J1863M9268K2012N2089j17418
$$ 778460 785239 746225 823383 705203 630707 565838 577701 626969 648981 701070 583652
26060E83652k2317N0728r02P4440Q4445l3301K0566N3071l366j35677q3283p2145
$$ 583652 561335 612063 611161 685601 770046 736745 757311 810382 807016 671339 588056 515911
26048E15911J42269R7436O7214j08171q8705L9863r1169L3622J57902j38n486
$$ 515911 658180 755616 822830 714659 625954 665817 574648 608270 766172 766034 760548
26037G60548j32711o1696l5723J88249l0448R297m0607M539l3886K2966m7179
$$ 760548 627837 566141 530418 718667 688219 697516 656909 661448 627562 650528 603349
26026F03349M4677J28618j88822k23609l6945M6626n655J3831J03677Q6722L5953
$$ 603349 648026 776644 587822 364213 327268 373894 368239 382070 485747 572469 608422
26015F08422M2128Q4416j31946k48108o1474J37976l2027M1236Q3206J42095J03211
$$ 608422 650550 734966 603020 354912 293438 431414 399387 440623 523829 665924 769135
26004G69135O8939m3526j06930N3978R484n89p3816j426M7992Q3464l1701M0832
$$ 769135 838074 794548 687618 741596 751080 750491 676675 675249 723241 806705 775004 815836
25992H15836L6646j19499p5913K9160o6821K1793j3823L2968L8687J2504m0822
$$ 815836 852482 732983 657070 686230 619409 641202 627379 660347 699034 711538 670716
25981F70716q8739n0306j11873K5972K68427L7050r4832m6197n9679j1579j9433
$$ 670716 581977 531671 419798 445770 714197 751247 656415 610218 550539 538960 519527
25970E19527J6308O7408P8400J65183l0504n1327j77614R0798N6907q2984J1651
$$ 519527 535835 603243 681643 846826 816322 764995 587381 678179 735086 652102 663753
25959F63753O8902R4628m4316o4593j48738m1354J87211J80383o73o627l5621
$$ 663753 732655 827283 782967 718374 569636 528282 715493 895876 895203 888576 852955
25948H52955k5939n2916m9927L6198n5444J15838m1570j19912p353p6422J04182
$$ 852955 827016 774100 724173 760371 704927 820765 779195 659283 651930 575508 679690
25937F79690K7178M7366R6529j9269m449L2841j06551P1276O0056O0813m9061
$$ 679690 706868 754234 850763 831494 827045 859886 753335 824611 884667 945480 896419
25926H96419j2293M0572m9132j2260J2923m3753J9307P9165r6061o7789j4943
$$ 896419 884126 924698 875566 863306 876229 832476 851783 930948 834887 767098 752155
25915G52155r1090j1434k5963k4798M6225Q2724R2262j1700j08139m8882L0356
$$ 752155 661065 649631 623668 598870 645095 727819 820081 808381 700242 651360 681716
25904F81716q5225m5112Q1332M40n0754K3609P893J98162P4009n7667j39297n233
$$ 681716 596491 551379 632711 633151 582397 606006 613899 812061 886070 828403 689106 683873
25892F83873O2783j889r461n7005n2737R0542J00468n9215j13072o5996o835j51771
$$ 683873 746656 744767 735306 678301 625564 716106 816574 757359 644287 578291 571456 419685
25880D19685m2633O0119P4079m833K5613O0040J22985J01594P2850o8646o2958
$$ 419685 377052 437171 511250 506417 532030 592070 715055 816649 889499 820853 757895
25869G57895l2364m9032o0534O2443p5082l6271k7489k1911M6124J12184J24899
$$ 757895 725531 676499 615965 678408 603326 567055 539566 517655 563779 675963 800862
25858H00862l8200L9283M0618j74459j33176M5778N2638P2622N0929P974r55q228
$$ 800862 762662 801945 842563 668104 534928 580706 633344 705966 756895 764869 763914 755686
25846G55686j25474L4343N1890L3660j0926j7164k799j5699J8178P2799l3042
$$ 755686 630212 664555 716445 750105 739179 722015 719216 703517 721695 794494 761452
25835G61452p6343p597r1903L8720J45813P9688k2752j58793j15926M6088N1260
$$ 761452 685109 677512 585609 624329 770142 849830 827078 668285 552359 598447 649707
25824F49707Q5974K8286q5663n28P7123J08853n5518j97024o8030m7269R639J05971
$$ 649707 735681 763967 678304 677776 754899 863752 808234 611210 543180 495911 505550 611521
25812F11521j0912j8751K1298N3651L4582n2462Q2766k7055k1367J00352p2731
$$ 611521 600609 581858 603156 656807 691389 638927 721693 694638 673271 773623 700892
25801G00892q8436p5615J52899P1608k6489j8075p8139J0332L3870j2429P2438
$$ 700892 612456 536841 689740 761348 734859 716784 638645 648977 682847 670418 742856
25790G42856k8620n3901L1931K3640o8659q70K8679M5018m6208L37k0572j07440
$$ 742856 714236 660335 692266 715906 647247 646377 675056 720074 673866 674203 653631 546191
25778E46191P6436j3546L584J36188J44188P9469m994r0670q5638m6825j24149
$$ 546191 622627 609081 612665 748853 893041 972510 967516 876846 791208 744383 620234
25767F20234q2276l2136P4942P1617n8958N1624o3263k4906k2175j9529M0993
$$ 620234 537958 505822 580764 652381 593423 645047 581784 556878 534703 515174 556167
25756E56167M9511J7700p8053p818M170Q9346M1614K8284K7876j6220j27085k5101
$$ 556167 605678 623378 545325 537507 541677 631023 672637 700921 728797 712577 585492 560391
25744E60391J8902K7691o2868J034J0865m2653J00913J0239l2410P8224l0353
$$ 560391 579293 606984 544116 545150 556015 513362 614275 624514 592104 670328 639975
25733F39975p7275k0817Q1656J34258k069j28736m0091Q0526k3631K2892j17278
$$ 639975 562700 541883 623539 757797 755728 626992 586901 667427 643796 666688 549410
25722E49410J9299J36169K4668j68128j41601J0465J79304k4634O7447J059m0427
$$ 549410 568709 704878 729546 561418 419817 430282 609586 584952 652399 653458 613031
25711F13031L4924K8352J21635M260l2028k6806O3503L1186j37372r8405j18526
$$ 613031 647955 676307 797942 802202 770174 743368 806871 838057 700685 602280 483754
25700D83754n1004J10861J1719O3350R2218L0528l7677q2509k7208O254l4743
$$ 483754 432750 543611 555330 618680 710898 741426 703749 621240 594032 600286 565543
25689E65543o5732l429M0516R8983K513q7857j00691J5430J41333M4409J1808
$$ 565543 499811 496382 536898 635881 638394 550537 449846 465276 606609 651018 662826
25678F62826k9670r028n2196M6859q5778N4936J10490l1861j7367j28753k2736
$$ 662826 633156 624128 571932 618791 533013 587949 698439 666578 649211 520458 497722
25667D97722p866P5360J9297K2587m9268p4059k6758J70402J02276L44k0318o9812
$$ 497722 489856 565216 584513 607100 557832 483773 457015 627417 729693 730037 709719 639907
25655F39907j31755j3710N1287M5752O1281N0000O2675n5599o7266N3708J382
$$ 639907 508152 494442 545729 591481 652762 702762 765437 709838 642572 696280 697662
25644F97662o8954J07433M9489O1081r75n9042j9572J24839P6440q2730j67881
$$ 697662 628708 736141 785630 846711 845736 786694 767122 891961 968401 885671 717790
25633G17790j4774n1500J528L1552R489l2812q9392n0024P4448J4421M2752P2399
$$ 717790 703016 651516 653044 684596 694085 661273 571881 521857 596305 610726 653478 725877
25621G25877m5726j131M8906M729M0964k4956n5429q6543j470j8502j5241l765
$$ 725877 680151 679020 727926 732655 773619 748663 693234 606691 605221 586719 571478 567713
25609E67713N0061Q8712m2371J3243K0551p208L4995l82k3914N9031l9676j00361
$$ 567713 617774 706486 664115 677358 697909 690701 725696 725314 701400 760431 720755 620394
25597F20394L1353J11107j2489M5472J58789k8458j30984l0864M7428N8119o4990
$$ 620394 651747 762854 750365 795837 954626 926168 795184 764320 811748 869867 804877
25586H04877J9127m7004M8332J80754j09311l21273l2203M6261J30738K4316l6139
$$ 804877 824004 777000 825332 1006086 896775 575502 543299 589560 720298 744614 708475
25575G08475m6160O0519q4866O1660J04152J9993k8215j47400j19289Q1695J98275
$$ 708475 662315 722834 637968 699628 803780 823773 795558 648158 528869 610564 808839
25564H08839Q3209r3428o7196J5451m2683n0676M6158n0511j1744n760j3879j5111
$$ 808839 892048 798620 731424 746875 704192 653516 699674 649163 637419 631659 617780 602669
25552F02669J23617K4437l7105m9617q3463p1317L4059K3137O127k1175J14054
$$ 602669 726286 750723 713618 664001 580538 509221 543280 566417 572544 551369 665423
25541F65423L2007m2574M761k3587P0450M4375j76720P1747j2706J00126J8604
$$ 665423 697430 654856 659617 636030 706480 750855 574135 645882 633176 733302 751906
25530G51906j5714p4585k4523n5401J80753J40513j71546j11701K1243l0053O8771
$$ 751906 736192 661607 637084 581683 762436 902949 731403 619702 640945 610892 679663
25519F79663N0335m1721p8073N230Q963m2374P5747L963m2914k796P933k7716
$$ 679663 729998 688277 610204 615434 624397 582023 657770 661733 618819 616023 623956 596240
25507E96240o9975l0504N0469l141P2551R0839J19790N484N0502P0375j03269
$$ 596240 526265 495761 546230 543089 615640 706479 826269 831753 882255 952630 849361
25496H49361j01923o4254r6195Q7801J05874r2805M5548J69407n2078N7052l0326
$$ 849361 747438 683184 586989 674790 780664 687859 733407 902814 850736 907788 877462
25485H77462j56842j51055M3635k2327J64477J80106Q3916m6165j59965n4575
$$ 877462 720620 569565 613200 590873 755350 935456 1019372 973207 813242 758667
25475G58667j4375l421O9074M5698j18899l9854l0242K1098J07157j888o8377
$$ 758667 744292 740871 809945 855643 736744 696890 666648 687746 794903 793015 724638
25464G24638r4171R2087J3331n7817o3264k0910M1815L6083q9918k2853O9509
$$ 724638 630467 722554 735885 678068 614804 593894 635709 671792 581874 559021 628530
25453F28530K1657p1889M6571R563J082L7504q7134J8381P7970k2870l6630q3588
$$ 628530 650187 578298 624869 634432 635514 673018 585884 604265 682235 659365 622735 539147
25441E39147n4647K1754L2618K4548J56129P3332k7316q1950R154R2639p4946
$$ 539147 484500 506254 538872 563420 719549 792881 765565 683615 692769 785408 710462
25430G10462p3980N6687j31174o1986j3466R501O1188L9719m4794L2509J48470
$$ 710462 636482 693169 561995 500009 486543 496044 557232 596951 552157 584666 733136
25419G33136L7769k3987M4130K4796J22034L2999m4986j01270q5257n9959K3229
$$ 733136 770905 746918 791048 815844 937878 970877 925891 824621 739364 679405 702634
25408G02634L1173k5150j369k7219o1568O3607M1800k0763n155o4030k7239O6232
$$ 702634 733807 708657 707288 680069 618501 682108 723908 703145 697990 633960 606721 672953
25396F72953J09676p9688L6703N1986m6181M7968o3780M2888k4592J01455J9863
$$ 672953 782629 702941 739644 791630 745449 793417 729637 772525 747933 849388 869251
25385H69251J21287l2059q4693l9505l5059J7886p2788j7635P670L364L9787k8190
$$ 869251 990538 958479 873786 834281 799222 817108 744320 726685 734355 737719 777506 749316
25373G49316p2854R3821Q9943j6295p1097j29561j5020K0999J29899R5352n9955
$$ 749316 676462 770283 860226 843931 772834 643273 628253 649252 779151 874503 814548
25362H14548o0962L1355l5698m2472j05963M8648J55296J25300L6873r1170j72154
$$ 814548 753586 784941 749243 706771 600808 649456 804752 930052 966925 875755 703601
25351G03601m6142p8501k1081K17703J12562m6973n0169Q7079m8300j04691L4530
$$ 703601 657459 578958 557877 775580 888142 841169 791000 878079 829779 725088 759618
25340G59618j6322k3943J785J5703Q061R7871k1483r2126l9808j56462Q9704N1281
$$ 759618 743296 719353 721138 736841 744902 842773 821290 729164 689356 532894 622598 673879
25328F73879P0844J6901L6436R1114k6079N5099o0765r7014k373L7379j19142
$$ 673879 744723 761624 798060 889174 863095 918194 857429 760415 758042 795421 676279
25317F76279j37497K2831m6343L2660O5976Q54L445J607K3160Q5877O6078p7394
$$ 676279 538782 561613 515270 547930 613906 614760 618205 619812 642972 728849 794927 717533
25305G17533Q4507K141J05746r305r0368r2560L3406P7159p843m8283L4974J23835
$$ 717533 802040 804181 909927 900622 810254 717694 751100 828259 820416 772133 807107 930942
25293I30942R323q2875l3652l2957q1652j14845m3290N0976l4454O7624M8101
$$ 930942 940265 857390 823738 790781 709129 594284 550994 601970 567516 635140 683241
25282F83241q070q6725j3758R8632O2226O5152n8736l0918J4323L1831l7823k8646
$$ 683241 675171 588446 574688 673320 735546 800698 741962 711044 725367 757198 719375 690729
25270F90729M9163O9613l9643M8513n2449O4760Q1302r5143j85098p219p082J8350
$$ 690729 739892 809505 769862 818375 765926 830686 911988 816845 631747 624528 617446 635796
25258F35796J59859M9687j31487n9750l6422J3732J8689O3003J07261R9457j76395
$$ 635796 795655 845342 713855 654105 617683 631415 650104 713107 820368 919825 743430
25247G43430n0271P2388k8784r4700J41163q527j5810p0252M8647J19310L3291
$$ 743430 693159 765547 736763 642063 783226 774699 758889 688637 737284 856594 889885
25236H89885m5406j22981r2902O6200p385J988O978J3722Q2414j10166r129J00862
$$ 889885 844479 721498 628596 694796 687411 689399 696377 710099 792513 682347 673218 774080
25224G74080L238k09518j45385K0382O5883R4574J07308L194o31k9978J4525K40750
$$ 774080 777318 567800 422415 442797 508680 603254 710562 713756 713125 683147 697672 938422
25212I38422O7137j63362j52804N67K9024l0530N5633p7645r045R2915j30169
$$ 938422 1005559 842197 689393 689960 718984 688454 744087 666442 657397 750312 620143
25201F20143j26570J9955O6066J13090J09206R4587N1366O2867j40634j60527
$$ 620143 493573 513528 579594 692684 801890 896477 947843 1010710 870076 709549
25191G09549j9272k0035M888n9002j3173J76625N1400o5085K3692Q5162K6480
$$ 709549 690277 670242 675130 616128 602955 779580 830980 765895 789587 874749 901229
25180I01229j82049p7181Q5300p747q6314K2211M0199R7529N3751L4063j6617
$$ 901229 719180 641999 727299 719552 633238 655449 695648 793177 846928 880991 864374
25169H64374j6761R0163k1298m7677l6618n0959J068l5119J2490J68858J60299
$$ 864374 847613 937776 916478 868801 832183 781224 782292 747173 759663 928521 1088820
25158A088820j71310j30984O8587l6590L3689M3952n8323j51781J7805J44762
$$ 1088820 917510 786526 855113 818523 852212 896164 837841 686060 703865 848627
25148H48627J58486O7249j77259j61256J5156N246p8271j02033n5292O5852J61275
$$ 848627 1007113 1074362 897103 735847 751003 756249 677978 575945 520653 586505 747780
25137G47780J29476q0412n4666M1202j06601n6809k9422M0571o362q0150k5536
$$ 747780 877256 796844 742178 783380 676779 619970 590548 631119 624757 544607 519071
25126E19071j0381J899Q203R5797J08845j0339K2215N2228l3454l9501l0750j5655
$$ 519071 508690 510589 518792 614589 723434 713095 735310 787538 754084 714583 683833 668178
25114F68178M5811J35573O4490J6852j00163l1667j17415j54239O6385R7430O3135
$$ 668178 713989 849562 914052 930904 830741 799074 681659 527420 593805 691235 754370
25103G54370J33357J3684r2561q0876q486m9631l553k7044N0533j3753l9552j09863
$$ 754370 887727 901411 808850 727974 719488 669857 666304 639260 689793 676040 636488 526625
25091E26625N0855J4727M5260O8301k6935K753N0214L4320J3859k4823Q1581n597
$$ 526625 577480 592207 637467 705768 678833 681586 731800 766120 779979 755156 836737 831140
25079H31140J881L7608p0849l6946k5442R7862l9632j19128k2381o3465m5799
$$ 831140 833021 870629 799780 762834 737392 835254 795622 676494 654113 590648 544849
25068E44849J06056J18778p2372j2473Q7883L8036r586l2669Q6230J65216K49
$$ 544849 650905 769683 697311 684838 772721 810757 801171 768502 854732 1019948 1020197
25057A020197j43907n3826o0131Q850r4651L02k4771m0486J154J2933R3073N4226
$$ 1020197 876290 822464 762333 771183 676532 676834 652063 611577 612731 625664 718737 772963
25045G72963n343j6926R6703k0436q6694j20974M7314J62558Q8954p7874j05119
$$ 772963 767620 750694 847397 826961 740267 619293 666607 829165 918119 840245 735126
25034G35126o4026o794n4498j8649L0819M7345M583R0558J02631l2035o4647O584
$$ 735126 671100 664306 609808 591159 621978 669323 673906 764464 867095 835060 770413 776997
25022G76997J1631M1311k9836j34488j7397J03711J10916O7039j9081p4862m9529
$$ 776997 788628 829939 800103 665615 648218 751929 862845 929884 910803 835941 786412
25011G86412q875M740N0518n2239J0456p5961p56O5724n691q1470l289J09167
$$ 786412 777537 782277 832795 780556 791012 715051 714295 780019 774328 692858 689569 798736
24999G98736k804J7010l2208j1571J15737M8984J9152r4899k8225O4721o4853
$$ 798736 795932 812942 780734 769163 884900 933884 953036 858137 829912 894633 829780
24988H29780p8407J8529N0026j16070j0557K868P816P4451N7010n7632n4614J48523
$$ 829780 751373 769902 819928 703858 693301 696169 703985 778436 835446 777814 723200 871723
24976H71723M6231j47843J30238J631k3925o5190N0501o320o7972K7965P8877
$$ 871723 917954 770111 900349 901980 878055 812865 863366 857046 789074 817039 895916
24965H95916n8830n6859N3353Q8351k1005m0081m343o5630M1878j9999p0502R4045
$$ 895916 837086 780227 833580 921931 900926 860845 856502 790872 832750 812751 742249 836294
24953H36294P6059M7165j23061p6952m421q0215Q978J14350J0773r1614N0719
$$ 836294 912353 959518 836457 759505 755084 674869 683847 798197 808970 717356 768075
24942G68075L3490N642L4566j7418o856j52379P6151N769j2199j9748j21020L8249
$$ 768075 801565 807207 841773 824355 817499 665120 741271 747040 734841 715093 594073 632322
24930F32322J84406q824l6608p2069J10963O3334o5238m4682l1699K516R8033
$$ 632322 816728 807904 771296 699227 810190 873524 808286 763604 731905 734421 832454
24919H32454k326j09638p3533k9647l675J17758J12888r3289o9790L2504J19988
$$ 832454 830128 720490 646957 617310 613635 731393 844281 750992 681202 713706 833694
24908H33694J10271n3409j90193J268Q9826Q91K145R7830M5147m8419j40504j132
$$ 833694 943965 890556 700363 701631 791457 792348 794493 892323 937470 889051 748547 747415
24896G47415L6299Q655j33640M9767N3783p4870j23165P0890J44210n1450j13579
$$ 747415 783714 792369 658729 708496 762279 687409 564244 635134 779344 727894 614315
24885F14315j3170R7926M9470K5894j9876j8517l4305J08981N6430L8357j58399
$$ 614315 601145 699071 748541 774435 754559 736042 701737 810718 867148 905505 747106
24874G47106q3861k0234P2249Q6235L4633o9702j1291o5204M0260K07744n2787
$$ 747106 663245 643011 715260 801495 836128 766426 755135 689931 730191 937935 885148
24863H85148l4048l1156K2943N750l8275p7173j5150K1179Q7402N5508J24900
$$ 885148 851100 819944 842887 848637 810362 733189 718039 739218 826620 882128 1007028
24852A007028l9146n4370r3643M7637p8479n0488q3924R7169N4611K106n192K5257
$$ 1007028 967882 913512 819869 867506 789027 738539 654615 751784 806395 808501 803309 828566
24840H28566j34136j12342j34910J64444J56074L8520j6662M3338J12772O2412
$$ 828566 694430 582088 447178 611622 767696 806216 789554 832892 945664 1008076
24830A008076K9188j279p2221j33190j37020m6193L485J79477q5126L4446J7920
$$ 1008076 1037264 1035985 963764 830574 693554 647361 650846 830323 745197 779643 797563
24819G97563j34381N8625Q3204j12307k2513k8655O1019J07547N3203p377J5580
$$ 797563 663182 721807 805011 692704 670191 641536 702555 810102 863305 855928 871508
24808H71508p0061j0929P617O1664k4630j12565k6639O7757N6989o7369j51832
$$ 871508 801447 790518 798135 859799 835169 722604 695965 763722 820711 753342 601510
24797F01510L5428J3860J2213L4647p6314k7235Q2690P5770j311k549K5605N8885
$$ 601510 636938 650798 663011 697658 621344 594109 676799 752569 751258 748709 774314 833199
24785H33199l0418p7086n2936r4349P827N9496J07814J79352j833L8658o5130
$$ 833199 802781 725695 672759 578410 586237 645733 753547 932899 931066 969724 904594
24774I04594n2786p6250j01508q310R6428O5250N3505Q2829J47957j00669o658
$$ 904594 851808 775558 674050 665740 762168 827418 880923 963752 1111709 1011040 1004382
24763A004382l010j07479j56959m956L8851Q0089r412k7566m2337K6853R4460
$$ 1004382 1001372 893893 736934 731978 770829 850918 841506 813940 771603 798456 892916
24752H92916k6921O4043L3592n924K7082L3955o3621o5873p1380p1042q9051J71852
$$ 892916 865995 930038 963630 957706 984788 1018743 955122 889249 817869 746827 657776 829628
24740H29628Q2922L9914j42445p7812K8490M4092J2642l7697o5633m2464R5147
$$ 829628 912550 952464 810019 732207 760697 804789 817431 779734 714101 671637 766784
24729G66784J93016M2942o2624o0755j22103J6371K2561n7838l1950M9102K0363
$$ 766784 959800 1002742 940118 879363 757260 773631 796192 738354 706404 755506 775869
24718G75869l3323k7156m3160K3330Q0995q02l9512l1880J2263Q0699P4871J2779
$$ 775869 742546 715390 672230 695560 776555 775753 736241 704361 716624 797323 872194 884973
24706H84973o1671j20613l7967N2462P4946K1500j8025q2989j8301J49477J03108
$$ 884973 823302 702689 664722 717184 792130 813630 795605 712616 694315 843792 946900
24695I46900J4535n6248r3130q2972L3176J6078J03704L1423j0169J09908j8453
$$ 946900 961435 905187 812057 729085 762261 778339 882043 913466 903297 1013205 994752
24684I94752q7984r1638l8163j48398n683J38791Q8075r6340M1603J14228J38605
$$ 994752 906768 815130 776967 628569 622886 761677 849752 753412 795015 909243 1047848
24673A047848o0802j29808O6819P4309M0128j50101j61410l8409L7087K0427P3245
$$ 1047848 987046 857238 924057 998366 1038494 888393 726983 688574 725661 746088 819333
24662H19333J1328K0441m1877j997O5242L2923j2031j48682q0867J31025L687
$$ 819333 830661 851102 809225 807228 872470 905393 893362 744680 663813 794838 798525
24651G98525r1834O6140O6120J4749m4156N6170o4663k0690O8744k4496J3511
$$ 798525 706691 772831 838951 853700 809544 865714 801051 780361 849105 824609 838120
24640H38120o0015k6338J26430q4141R457M5100l2332j5486J27909j6541j51718
$$ 838120 778105 751767 878197 794056 803513 848613 816281 800795 928704 912163 760445
24629G60445p6642R8618J05621M6347N1996l9804N0911n343j06251l9276R6668
$$ 760445 683803 782421 888042 934389 986385 946581 997492 992149 885898 846622 943290
24618I43290J7097N356L0718P626j10696L210M234n6036M4052R6772k1712q6552
$$ 943290 960387 965743 996461 1004087 893391 896601 900835 844799 888851 985623 963911 877359
24606H77359O0477P707q2681K6665k144L8208n1159m7864Q6775P9203k6205n8930
$$ 877359 937836 945543 862862 889527 887383 925591 874432 826568 913343 992546 966341 907411
24594I07411n8027j40923l6445J32799J17929o4461K7590M7681j1089m7488m6078
$$ 907411 849384 708461 672016 804815 922744 858283 885873 933554 922465 874977 828899
24583H28899P4808R15q9624j9441O9041l4690N2707p518p6954m9987l825J68722
$$ 828899 903707 904622 814998 795557 864598 829908 882615 875097 798143 748156 744331 913053
24571I13053K1110m2433j53491j2484K1214j03721N3358J29727K1819l7344m3735
$$ 913053 934163 891730 738239 725755 746969 643248 696606 826333 848152 810808 767073
24560G67073N1614O137o0110M61J08633M160j15208p0393J18459L6719j7516O250
$$ 767073 818687 824824 764714 765175 873808 877968 762760 692367 810826 847545 830029 836279
24548H36279J8907K3555J2245q0943O1432J43506L8068k8835r6077m2314n8336
$$ 836279 855186 878741 890986 810043 871475 1014981 1053049 1024214 928137 885823 827487
24537H27487k3918N9278P9660q5434l6445J03433n6039N703j11779O628j5042
$$ 827487 803569 862847 942507 857073 820628 924061 868022 873725 761946 768574 753532
24526G53532L0282R3580l0456Q3224Q6590Q5077j08358j99528n8316K9422J13626
$$ 753532 783814 877394 846938 930162 1016752 1101829 993471 793943 735627 765049 878675
24515H78675Q3348J6674p1004L2784K409M7369K6176k9848n4074p6565j43197
$$ 878675 962023 978697 907693 940477 942886 990255 1016431 986583 932509 855944 712747
24504G12747r5334P9353L2590O6136J09722J1005q5200m1029K3141K0027O0810
$$ 712747 617413 696766 729356 795492 905214 916219 831019 789990 813131 833158 893968
24493H93968N2682j54774p7049q9592K811O5385J03233R0990J9864N6949L9076
$$ 893968 946650 791876 714827 625235 628046 693431 796664 887654 907518 964467 1003543
24482A003543N9735o2593j53317J5264J31147L2717j46787k4118j2506o8070p822
$$ 1003543 1063278 1000685 847368 862632 993779 1026496 879709 855591 843085 775015 767193
24471G67193k1243j10386N6206J28437K9705n9202l0090r631O6308O81k1733k7720
$$ 767193 745950 635564 691770 820207 849912 790710 760620 750989 817297 817978 796245 768525
24459G68525o0523J1224P2918j11110j46466Q9495J14646J1938m8019O3640J27048
$$ 768525 708002 719226 792144 681034 534568 624063 738709 750647 702628 766268 893316
24448H93316M3939O1560k6650q4395l967m6842r7271m3874k869k2731J57487l9242
$$ 893316 937255 998815 972165 887770 883803 836961 739690 695816 692947 670216 827703 788461
24436G88461j1448J05873K7861n2116P4009k3427o2798n542l9505r4576J36996
$$ 788461 777013 882886 910747 858631 932640 909213 846415 840873 801368 706792 843788
24425H43788L4801R6844N104k968q055r1852j07874K1364L9731K4933o5266j03357
$$ 843788 878589 975433 980537 977569 969514 877662 769788 791152 830883 855816 790550 687193
24413F87193l2358K1557O7903Q8800n3441J9130J5570N1522j0952m0565j25096
$$ 687193 654835 676392 744295 833095 779654 798784 814354 865876 854924 814359 689263
24402F89263q5658K9500K9615Q77p524J26687J50026M4827p2511j9117p1338M085
$$ 689263 603605 633105 662720 663597 656073 782760 932786 977613 905102 885985 814647 818732
24390H18732O4970j09328m1667Q4131m107j8675m7338N6019J77533k872K6423
$$ 818732 883702 774374 732707 816838 812731 794056 746718 802737 980270 977398 1003821
24379A003821j23575j69913N2350L4826J32430j9426K755r7947J7285R3490K6513
$$ 1003821 880246 710333 762683 797509 929939 910513 913268 815321 832606 926096 952609
24368I52609n3208o8453J7268j11431j5373N932P834Q9857k0614m4658J0516J47025
$$ 952609 899401 830948 848216 736785 721412 727344 735178 825035 804421 759763 770279 917304
24356I17304J54467m8246n907j89330k17508j98619L2020K21750Q9373O0762J9451
$$ 917304 1071771 1023525 1017618 828288 610780 412161 444181 665931 755304 816066 835517
24345H35517Q1194M3679M7992p3424j8859n965p437q1093R172N7783P452q4875
$$ 835517 916711 960390 1008382 934958 916099 910134 902697 821604 830776 888559 896011 811136
24333H11136j3264J11257j9096r8108j0889N4318j1769J8220J9114j20940J2204
$$ 811136 797872 909129 890033 791925 781036 835354 823585 841805 860919 739979 752183
24322G52183O5419K5683M7584J7857N203r6037R1908M0255n4716R4158k5475j60143
$$ 752183 817602 843285 890869 908726 913929 817892 909800 950055 895339 989497 964022 803879
24310H03879r0515r9741J25694P8424m4108p3292L1277O1925J356r13Q4159M5440
$$ 803879 713364 613623 739317 817741 773633 700341 731618 793543 794899 793986 878145 923585
24298I23585o99M4571r279q7206J5730j4771p1073N1161K3341j0632J06374J71742
$$ 923585 922886 967457 958178 870972 886702 871931 800858 852019 875360 864728 971102 1142844
24286A142844j34844j31358o1535q1906J02796K6965J6806m9087j1954l020n0442
$$ 1142844 1008000 876642 815107 733201 835997 862962 879768 830681 818727 815707 765265
24275G65265N8928K8139M9928K8674O6797j901J309N8367j26745j03734o9987
$$ 765265 824193 852332 902260 930934 997731 995830 997139 1055506 928761 825027 755040
24264G55040K0456Q2601J12666m4413n6691K4608J56231P9389j16289j47221j25735
$$ 755040 775496 858097 970763 926350 869659 894267 1050498 1129887 1013598 866377 740642
24253G40642p2334l82J41628L8292R013K4523M4423j8743n2791J11785K39082
$$ 740642 668308 667926 809554 847846 856859 881382 925805 907062 854271 966056 1205138
24242A205138K0726j32892k09281j54139M9995N4336O883K077n9617k701m2013
$$ 1205138 1225864 1092972 883691 729552 779547 833883 840766 842843 783226 780525 738512
24231G38512J9124J05993J3760N3570k0780k6923R8825R131M3379J4776r1384
$$ 738512 757636 863629 877389 930959 910179 883256 982081 991212 1034591 1049367 957983
24220I57983m7644l687J625J26708k9762k0702N0134r6822k9877m2060m779P4919
$$ 957983 910339 906652 908277 1034985 1005223 984521 1034655 937833 907956 865896 861117 936036
24208I36036q5581m5359Q9946J05211r1115m5894J388O9215Q3696K5302r3152
$$ 936036 850455 805096 895042 1000253 909138 863244 864632 933847 1017543 1042845 949693
24197I49693q2816r4778M490m033J8592O3593J13955O4314p1211j5671q6227l2716
$$ 949693 866877 772099 776589 772556 791148 854741 968696 1033010 961799 946128 859901 827185
24185H27185K3592J082j4362n022l0263J57306P5467K2688o7662o497m4462j33486
$$ 827185 850777 851859 837497 832475 802212 959518 1034985 1057673 990011 983514 939052 805566
24173H05566j50209j5270Q6159L2644L2659Q5413N704N5384J20901L0134P8937
$$ 805566 655357 640087 726246 758890 791549 876962 882666 938050 1058951 1089085 1168022
24162A168022o0918K9081q2732j42362r1582J1537p0775J7481J38390N5272N6470
$$ 1168022 1107104 1136185 1053453 911091 819509 831046 760271 777752 916142 971414 1027884
24151A027884j7805q1491n7691l7155J5784P1214k6511r7834J6254J54118l4909
$$ 1027884 1010079 928588 870897 833742 849526 920740 894229 796395 812649 966767 931858
24140I31858L802k3412k1838m0174r6883M2527P2091j1337L0282j4940j661l5290
$$ 931858 935660 912248 890410 850236 753353 795880 867971 856634 886916 871976 870315 835025
24128H35025j51109O4983J56056P7996o6964q3678O1509J11842p059p5918l7508
$$ 835025 683916 748899 904955 982951 915987 832309 893818 1005660 998601 922683 885175
24117H85175q3486Q638M5716Q0620m0999j20478k6412Q7052P8903M1102l2081
$$ 885175 801689 810327 856043 936663 895664 775186 748774 835826 914729 955831 923750
24106I23750o6171O4591J16696J73618R241q8358j02113j30456j46007n315Q7571
$$ 923750 857579 922170 1038866 1212484 1221725 1133367 1031254 900798 754791 749476 837047
24095H37047M8836J4801M8066R8271J54351k4464j38019j00412p9414K42590l8026
$$ 837047 885883 900684 948750 1047021 1201372 1176908 1038889 938477 859063 1101653 1063627
24084A063627j39350n0470K1185N4135J1949M6360o8803O403j3991J3257j5113
$$ 1063627 924277 873807 894992 949127 961076 1007436 938633 945036 931045 944302 929189
24073I29189M8456K7810j12293J2993J51174N0536l0561q6530m6317j7093o0214
$$ 929189 977645 1005455 893162 906155 1057329 1107865 1077304 990774 944457 927364 867150
24062H67150r7114J14598q277L0131N2863N2631r3199j05366J15849Q0201n6026
$$ 867150 770036 884634 876357 906488 959351 1011982 918783 813417 929266 1009467 953441
24051I53441p3992o0851O6509R6867O6521j18472j6486O6792Q2654o0149p5988
$$ 953441 879449 818598 885107 981974 1048495 930023 913537 980329 1062983 1002834 926846
24040I26846p8234j4287M4769J50953m9671n3306j1987m1741O8974k8555O7181
$$ 926846 848612 834325 879094 1030047 980376 927070 915083 873342 942316 913761 980942
24029I80942J59008j03900o1649n7557k780J2745J7587J8435j9435j3215M8619
$$ 980942 1139950 1036050 974401 916844 914064 926809 944396 962831 943396 930181 978800
24018I78800l2465k3483l031J05585P1922j8262j1914j40925r8233R9016k5802
$$ 978800 946335 922852 919821 1025406 1097328 1079066 1067152 926227 827994 927010 901208
24007I01208j27911K6934Q4188N5113O72M3781L9257K5886p2473j15552J4575
$$ 901208 773297 800231 884419 939532 940204 983985 1023242 1049128 976655 861103 875678
23996H75678M5360P3614j72433o0728J31646M190q3144K036n3635J3977Q1676
$$ 875678 921038 994652 822219 761491 893137 897327 814183 816219 762584 776561 858237
23985H58237o3264M9338R7072K3591R6223k7319p8836n5334K9543K6250k5826
$$ 858237 794973 844311 941383 964974 1061197 1033878 955042 899708 929251 955501 929675
23974I29675J46424k069k2043q4233M2697m8516m3521N6674J9622p8394n9015
$$ 929675 1076099 1074030 1051987 967754 1010451 961935 918414 975088 994710 916316 857301
23963H57301j49507k2089J40032J77552o5680m8120l8494L9989M4356j33384J733
$$ 857301 707794 685705 825737 1003289 937609 889489 850995 890984 935340 801956 803689
23952H03689J07205l8565K0144M8716J14214j1365M1846k3610O7709k0082j00627
$$ 803689 910894 872329 892473 941189 1055403 1044038 1085884 1062274 1129983 1109901 1009274
23941A009274j00774m18l5135l3221P7283J44501K2618J0484M9099j67971j93033
$$ 1009274 908500 908082 872947 839726 917009 1061510 1084128 1094612 1143711 975740 782707
23930G82707k659R5714p7641N2745N6769q4268L0521J74170k3001k2891q2533
$$ 782707 780048 875762 798121 850866 907635 823367 853888 1028058 1005057 982166 899633
23919H99633Q692J24470J66627Q481n9179r6505j41502q3419P2846M6298j1475
$$ 899633 908325 1032795 1199422 1207903 1148724 1052219 910717 827298 900144 946442 934967
23908I34967L3220J503P6012k7039o4569q6994j2043j5338P3221Q647K6327J14286
$$ 934967 968187 969690 1045702 1018663 954094 867100 855057 839719 912940 921587 947914 1062200
23896A062200p8161q4276o7469K3607L01K4225j2156l8132K2321L877n4249J02109
$$ 1062200 984039 899763 832294 855901 856202 880427 868271 830139 852460 856337 802088 904197
23884I04197N3216M6158O0820l9925l7270l0122l4516O299j9920n8622m2150k2566
$$ 904197 957413 1003571 1064391 1024466 987196 957074 922558 928857 908937 850315 808165 785599
23872G85599O1462Q0278k9686l7337p7667L0412P0580P3765n2081N8326L1240
$$ 785599 847061 927339 897653 860316 782649 813061 883641 957406 905325 963651 994891
23861I94891k3054m4679j10662r1804l6079j4587K7781J45334O1028Q5503P6656
$$ 994891 971837 927158 816496 724692 688613 674026 701807 847141 908169 993672 1070328
23850A070328p9265L6565j25121p1823O6191J26505n8651j96844q0267J45000
$$ 1070328 991063 1027628 902507 830684 896875 1023380 964729 767885 687618 832618
23840H32618R9927J4758n868O3072J4107n925Q0331J9263o1415J0923l3746j0355
$$ 832618 932545 947303 941435 1004507 1018614 1012689 1093020 1112283 1050868 1061791 1028045 1017690
23828A017690n6708j04459J06682P8957N4907O8689R0465L2834j14250j57311
$$ 1017690 960982 856523 963205 1042162 1097069 1165758 1256223 1289057 1174807 1017496
23818A017496p8529M9553R2648Q9446k5779l8512m9960m7802P3316o7973j28641
$$ 1017496 938967 988520 1081168 1170614 1144835 1106323 1056363 1008561 1081877 1013904 885263
23807H85263k9218K7036L5054k0057P0248k9047K6960O0074j33199l2704J56636
$$ 885263 856045 883081 918135 898078 968326 939279 966239 1026313 893114 860410 1017046
23796A017046J7052J42519q0839k18811K9567Q3307l8261r7719P9346J0434m5062
$$ 1017046 1034098 1176617 1095778 876967 906534 989841 951580 853861 933207 943641 898579
23785H98579O2492M0725n0811j6118j4275Q061L2420R2816O9030J27740M3449
$$ 898579 961071 1001796 950985 934867 920592 928653 961073 1053889 1122919 1250659 1294108
23774A294108k01100j55512j12723L0194N7626j4110r1411J6457n8486j01600
$$ 1294108 1093008 937496 824773 854967 912593 898483 807072 823529 765043 663443
23764F63443r383J24537J00261L8760n8651m4779q568j7740R1561N2553q3661
$$ 663443 654060 778597 878858 917618 858967 814188 805620 787880 879441 931994 848333
23753H48333k2340J65842Q4527r774M5260l9806j5319m6026j52413k3586M6909
$$ 848333 825993 991835 1076362 1066588 1111848 1072042 1056723 1010697 858284 834698 881607
23742H81607O3208K3084k366j19597p0948J02023J03544j25159j3810q6920q664
$$ 881607 944815 967899 965533 845936 774988 877011 980555 855396 841586 754666 746002
23731G46002P0777J71222J38011j09257j43740j2652O7793J36693J25771m4012
$$ 746002 816779 988001 1126012 1016755 873015 860363 928156 1064849 1190620 1146608
23721A146608j07150l5770m3728k6743K2839R6754j20167j100M0003P5411j11158
$$ 1146608 1039458 1003688 959960 933217 956056 1052810 932643 931543 971546 1046957 935799
23710I35799j27876J01892J24784n061r0872O2022K5540r6595q6820l8900J471
$$ 935799 807923 909815 1034599 1029538 938666 1000688 1026228 929633 842813 803913 805384
23699H05384N9675R4455r009p8070q7307j1072k7720k1929j1172J60646J74459
$$ 805384 865059 959514 950505 872435 785128 774056 746336 724407 713235 873881 1048340
23688A048340p4916J5868m2208o1430L4170j0144K6259J11927J29994J7534M9356
$$ 1048340 973424 989292 947084 885654 919824 909680 935939 1047866 1177860 1195394 1244750
23677A244750K0017j07419j37402o7599L7882J03477q172O136p7233r471J27963
$$ 1244750 1264767 1157348 1019946 952347 990229 1093706 1085534 1091670 1014437 1004966 1132929
23666A132929o583k9885o6039j25913O8746N6887L080M5512m4764R022N293p117
$$ 1132929 1126346 1096461 1030422 904509 973255 1030142 1033222 1078734 1033970 1042992 1048285 1041168
23654A041168l0236J40352J29570N5586q3326m9456l5121o9634m9005P4763o8315
$$ 1041168 1010932 1151284 1280854 1336440 1253114 1203658 1168537 1098903 1049898 1124661 1056346
23643A056346j06709j55027J48313R3929r891P7221o24l500O3785k6248q5969
$$ 1056346 949637 794610 942923 1036852 1026961 1104182 1103558 1100058 1163843 1137595 1051626
23632A051626J7494M5167n7092O585j601r5363k15803J19887J77948N2166n3065
$$ 1051626 1069120 1114287 1057195 1063780 1062179 966816 751013 870900 1048848 1101014 1047949
23621A047949K3208L069j6525J33815J12643P091n9198j26587M2659j3385K6568
$$ 1047949 1071157 1074226 1057701 1191516 1304159 1311250 1252052 1125465 1168124 1154739 1181307
23610A181307q8244n2604J08725m8476j08552p611O4165J02585m1125O2948L1681
$$ 1181307 1093063 1040459 1149184 1100708 992156 984545 1048710 1151295 1110170 1173118 1204799
23599A204799o3677j52106Q155j5802p5488p4097k8674o3617J53861L0429o7995
$$ 1204799 1141122 989016 997171 981369 905881 831784 803110 739493 893354 923783 855788
23588H55788J14229J74965Q4183j29696j20450L1420J09560J23404J9239j37381
$$ 855788 970017 1144982 1229165 1099469 979019 1010439 1119999 1243403 1262642 1125261
23578A125261k5046m4675j33046j03324L4779N5382J01942J08586r9280q1548
$$ 1125261 1100215 1055540 922494 819170 853949 909331 1011273 1119859 1020579 939031
23568I39031L6210L9837N8190J00902K7236q0414N8255J38032l5352q2684P103
$$ 939031 975241 1015078 1073268 1174170 1201406 1120992 1179247 1317279 1281927 1199243 1206346
23557A206346j82827l0296p8280r1613P7703K01172n478j16213p2638M6543Q9785
$$ 1206346 1023519 993223 914943 823330 901033 1102205 1096727 980514 907876 954419 1044204
23546A044204L0443J22208K1617j80864k11869n3158J12151R6307L3193j3630
$$ 1044204 1074647 1196855 1218472 1037608 825739 772581 884732 981039 1014232 1000602
23536A000602p3305k4771L6645M1582J20408k5844J4441P8898N6589q4253j77993
$$ 1000602 927297 902526 939171 980753 1101161 1075317 1089758 1168656 1225245 1140992 962999
23525I62999j28379K9361J38205J27055J3259N9190N719q1656q7586q2412M2525
$$ 962999 834620 863981 1002186 1129241 1142500 1201690 1207409 1125753 1038167 955755 998280
23514I98280O0061P0044m82n0443L1512J25617J45246R0175K8672j40361j48366
$$ 998280 1058341 1128385 1127903 1077460 1108972 1234589 1379835 1470010 1498682 1358321 1209955
23503A209955k10798J1150J24674k2043m8611m3197m197L6762M8311R3917K2026
$$ 1209955 999157 1010307 1134981 1112938 1064327 1021130 1016933 1053695 1102006 1195923 1217949
23492A217949j12678j40474k8307p871J01702J19702O2521N9912m5041l3414n386
$$ 1217949 1105271 964797 936490 928619 1030321 1150023 1212544 1272456 1227415 1194001 1188615
23481A188615p4893l764R1992l6033n7346R2342L3253n2743j9242k0917M6547
$$ 1188615 1113722 1109958 1201950 1165917 1108571 1200913 1234166 1181423 1162181 1141264 1187811
23470A187811R1210j28590j66415J2729n0900O9488K9568m0451J21711l6049m7293
$$ 1187811 1279021 1150431 984016 996745 945845 1015333 1044901 1004450 1126161 1090112 1042819
23459A042819R2477L1920n6646p92j2411o6482O475J6921p9567J03454J96031
$$ 1042819 1135296 1167216 1110570 1109778 1097367 1030885 1037360 1054281 974714 1078168 1274199
23448A274199L4133o0066j1099q9042O2399N8324j5366m834k4274j45137k2472
$$ 1274199 1308332 1248266 1237167 1148125 1210524 1268848 1253482 1248648 1224374 1079237 1056765
23437A056765N6645M1243N024O5n314M7850J1132q9452q5451q8571k4545Q9112
$$ 1056765 1113410 1154653 1159677 1159742 1154428 1202278 1213410 1123958 1038507 949936 925391 1014503
23425A014503K6962m7507p2336k9496l5502J53902J57933m8782R0338L594j66810
$$ 1014503 1041465 993958 921622 892126 856624 1010526 1168459 1119677 1210015 1213609 1046799
23414A046799j03799R3165P3497n1771n010q8888m3906M2142r0277k1569M5059
$$ 1046799 943000 1036165 1109662 1057891 1052881 963993 920087 962229 871952 850383 895442
23403H95442l7489Q3503J52649o7318n3110N9181k4267n6726n8963P5498J426
$$ 895442 857953 941456 1094105 1026787 973677 1032858 1008591 951865 892902 968400 969826
23392I69826J0861J12867P2723K9542L8093K4794j80690j06424J040J8211J45938
$$ 969826 980687 1093554 1166277 1195819 1233912 1258706 1078016 971592 972632 990843 1136781
23381A136781M6524K4583M5879k043M7275k04898n0706k1986l542K6098O2577
$$ 1136781 1183305 1207888 1253767 1251724 1298999 1094101 1043395 1021409 1017867 1043965 1106542
23370A106542k8771J8427J22258l2164J01825O9639j18166m812l2946j04793N123
$$ 1106542 1077771 1096198 1218456 1186292 1288117 1357756 1239590 1234778 1201832 1097039 1102162
23359A102162J32484j6604K4948K8742m7952j35159K2007M6342K1272k5156J0742
$$ 1102162 1234646 1218042 1242990 1271732 1223780 1088621 1110628 1156970 1178242 1153086 1163828
23348A163828L5148o1519r8178n4001O4240m2040N3112M7207j4819J3999M6966
$$ 1163828 1198976 1137457 1039279 985278 1049518 1007478 1060590 1107797 1092978 1106977 1153943
23337A153943l9108l9349J0964q8319l069J3095M6440p3686l0155J7409P4940
$$ 1153943 1114835 1075486 1086450 998131 995062 1008157 1054597 980911 950756 968165 1043105
23326A043105Q1437j4717K2534n6847K6068j9323q9848O7256N1167K9716P8187
$$ 1043105 1124542 1109825 1132359 1075512 1101580 1082257 992409 1059665 1110832 1140548 1218735
23315A218735O8898L5128l4352K0212r062m8948m699o6025o4268J2941j87000
$$ 1218735 1287633 1322761 1288409 1308621 1299559 1250611 1245912 1179887 1115619 1128560 941560
23304I41560O1172P9317N5423L8735R0182r6055K4683O4289m6865K7853J19285
$$ 941560 1002732 1082049 1137472 1176207 1266389 1170334 1195017 1259306 1212441 1240294 1359579
23293A359579M9307q4189m7980p5j15946q52j0093O219O1415m5034q1895R857
$$ 1359579 1408886 1324697 1276717 1276642 1160696 1159844 1149751 1155970 1217385 1172351 1090456 1100313
23281A100313J4494j26038J501M6249O3367L1230j7391K5360J14625M9161j44834
$$ 1100313 1114807 988769 990270 1036519 1099886 1131116 1113725 1139085 1253710 1302871 1158037
23270A158037p4025R5620J09656n4515q8213K1828p3191Q1939J25370j16848j05610
$$ 1158037 1084012 1179632 1289288 1234773 1146560 1168388 1095197 1177136 1302506 1185658 1080048
23259A080048M9109Q4967p6480m1636k6974K4985M9377O1836n6911j19334k2589
$$ 1080048 1129157 1214124 1137644 1096008 1069034 1094019 1143396 1205232 1148321 1028987 1006398
23248A006398J17913J41543Q9246K8981L2414j4j21219l5716o5835j00492L9504
$$ 1006398 1124311 1265854 1355100 1384081 1416495 1416481 1295262 1259546 1193711 1093219 1132723
23237A132723q466p9677o3726k39N4415m42j0481N1230l3714j8677K0435J6950
$$ 1132723 1124257 1044580 980854 980615 1035030 1034588 1024107 1075337 1041623 1022946 1043381 1060331
23225A060331N6823P3245j11786q8184N6120l557J44572J37050K6775o8386j7557
$$ 1060331 1117154 1190399 1078613 990429 1046549 1042992 1187564 1324614 1351389 1283003 1265446
23214A265446L85k6386l9461q1041j30321O6325K28997j6426l7846l313n9871
$$ 1265446 1265831 1239445 1199984 1118943 988622 1054947 1283944 1267518 1229672 1226359 1166488
23203A166488M2746n4930n7500J950Q9519j2519L7355n5425L4778J00540n0906
$$ 1166488 1209234 1154304 1096804 1098754 1188273 1175754 1213109 1157684 1192462 1293002 1242096
23192A242096j7420K9734p0818q1853J80190o9647j22956N9066k0793j00001o2412
$$ 1242096 1224676 1254410 1183592 1101739 1281929 1212282 1089326 1148392 1127599 1027598 965186
23181I65186K3382N4524Q9717J05990n2742q94k2072j3468n1241m4328j2384j30902
$$ 965186 988568 1043092 1132809 1238799 1186057 1185163 1163091 1149623 1098382 1054054 1041670 910768
23169I10768R2065J47870k3280r9162N1097R644P1892J9648M1652l121j2333O5360
$$ 910768 1002833 1150703 1127423 1028261 1079358 1089002 1160894 1180542 1222194 1219073 1206740 1272100
23157A272100m7376k2539J4691p7598m8169L6029M3935k44O2100m7257j08143
$$ 1272100 1224724 1202185 1216876 1139278 1091109 1127138 1171073 1170829 1232929 1185672 1077529
23146A077529K5236P6434j01051J8688O244k2724l4248k4234Q3605J43962Q4873
$$ 1077529 1102765 1179199 1078148 1096836 1103080 1080356 1046108 1021874 1105479 1249441 1334314
23135A334314m2393l2961N3235k4424j04312n9427l7204J11739L2970j5298l2695
$$ 1334314 1291921 1258960 1312195 1287771 1183459 1124032 1086828 1198567 1231537 1216239 1183544
23124A183544P0212j8593l0515n5867q4623o3543R0755J12398k4264r3179o7518
$$ 1183544 1253756 1235163 1204648 1148781 1064158 1000615 1091370 1203768 1179504 1086325 1018807
23113A018807J7903M1054k2011k613J3449M9902P0156N7592m4961M000l553k8302
$$ 1018807 1036710 1077764 1055753 1053140 1066589 1116491 1186647 1244239 1199278 1203278 1199725 1171423
23101A171423m4802L3678Q2511J37774J9199j68336J2466m0232j38468q0130Q8866
$$ 1171423 1126621 1160299 1242810 1380584 1399783 1231447 1243913 1203681 1065213 985083 1073949
23090A073949Q7105K8621J8318k5482m892L4562J7028l6627n7119L0188L7352
$$ 1073949 1161054 1189675 1207993 1182511 1177619 1212181 1229209 1192582 1135463 1165651 1203003
23079A203003j42964r9545J58021M7950j97270o6382K2532O9433J61397Q1896
$$ 1203003 1060039 960494 1118515 1166465 969195 902813 925345 994778 1156175 1238071
23069A238071m8206j28010N3358P2819J4106N3478l9386o3094R3189P3933m7418
$$ 1238071 1189865 1061855 1115213 1188032 1202138 1255616 1216230 1153136 1246325 1320258 1272840
23058A272840p3484K916J44358J8080m3423L768J4437k3397J4280K6537J6141
$$ 1272840 1199356 1202272 1346630 1364710 1321287 1325055 1339492 1316095 1330375 1356912 1373053
23047A373053r0507m7024J00973k4202j37314p4652n1568Q588J01499r846m1607
$$ 1373053 1282546 1235522 1336495 1312293 1174979 1100327 1048759 1057347 1158846 1149000 1107393
23036A107393N1727O5681m845J7436k588L5030L2302L6462j12658k13955p4419
$$ 1107393 1159120 1224801 1219956 1237392 1234804 1269834 1302136 1338598 1225940 1011985 937566
23025I37566P0445L3176Q508m1221N8219J21899J35J8413P37K576j9319J48170
$$ 937566 1008011 1041187 1049695 1008474 1066693 1188592 1188727 1207140 1207877 1210453 1191134 1339304
23013A339304M0140l7466J2489N8622R8186k1425m9333j41767p4570N7320P922
$$ 1339304 1379444 1341978 1354467 1413089 1511275 1489850 1440517 1298750 1224180 1281500 1289422
23002A289422j8108N308L5333o4801J7072r1135m2035o6613k496l006J42518J48004
$$ 1289422 1271314 1276622 1311955 1247154 1264226 1173091 1131056 1064443 1061947 1058941 1201459 1349463
22990A349463m2993L1085O9620l2779j23877J1648o7059k16699n5188J25301J00568
$$ 1349463 1306470 1337555 1407175 1374396 1250519 1262167 1195108 978409 923221 1048522 1149090
22979A149090M3729J16711J19023p9110j11389O4171R261q85r3039n5981j59682
$$ 1149090 1192819 1309530 1428553 1349443 1238054 1302225 1311486 1310601 1217562 1161581 1001899
22968A001899Q4126M7440R6771j3024m7661r0298Q272K1764Q9784O3520j34368
$$ 1001899 1086025 1133465 1230236 1217212 1169551 1079253 1087525 1109289 1199073 1262593 1128225
22957A128225m8246L5508M7416j6528j00726M0467L0850m7929Q8161n3560q4412
$$ 1128225 1079979 1115487 1162903 1146375 1045649 1086116 1116966 1069037 1157198 1103638 1019226
22946A019226l6607P6617N7257J13128P3410K5130j9850K5310o7852q6823P8629
$$ 1019226 982619 1059236 1116493 1229621 1303031 1328161 1308311 1333621 1265769 1178946 1257575
22935A257575j3467R0535O6109m5943J26589n6538p5119j08939P0001p549n2751
$$ 1257575 1244108 1334643 1400752 1354809 1481398 1424860 1349741 1240802 1310803 1303254 1250503
22924A250503N1283j7318n8377j6903M175J11140R972P6494J47062q60o6761p5204
$$ 1250503 1301786 1284468 1226091 1209188 1213363 1324503 1334475 1410969 1558031 1557171 1490410 1415206
22912A415206q729l6217M6350k0997j21439p9989k758Q6655m2106k6689l2663
$$ 1415206 1406477 1370260 1416610 1395613 1274174 1194185 1191427 1278082 1235976 1209287 1176624
22901A176624k2267o5557J35953K8446J535L27M0180p42r3079j45732Q510O4057
$$ 1176624 1154357 1088800 1224753 1253199 1254734 1255061 1295241 1294499 1201420 1055688 1064198 1128255
22889A128255R6889R225m8928L424N3239L5087P1768j017k5434o2185n3442J06110
$$ 1128255 1225144 1234369 1185441 1188865 1242104 1277191 1348959 1347942 1322508 1260323 1206881 1312991
22877A312991J19010J2131J0937m0452m8568o3064J4307J16986K4465j01732m1187
$$ 1312991 1432001 1444132 1455069 1414617 1366049 1302985 1317292 1434278 1458743 1357011 1315824
22866A315824k8650j4246J35890Q6679j0972j7592N610l8976n3616j1181j592
$$ 1315824 1287174 1272928 1408818 1495497 1484525 1466933 1472543 1433567 1379951 1368770 1367178
22855A367178m090j19005Q9670k2831o9145M5200J20479P6144m6555p3294N914
$$ 1367178 1363088 1244083 1333753 1310922 1241777 1286977 1407456 1483600 1437045 1363751 1369665
22844A369665N1481j7427o4254m9565K7750m9264j96284J3564J86573n4117R7275
$$ 1369665 1421146 1403719 1339465 1289900 1317650 1268386 1072102 1085666 1272239 1218122 1315397
22833A315397N3219Q3103p587j03701m0421M9323R7891k6509K6116p0301p2657
$$ 1315397 1368616 1451719 1444132 1340431 1300010 1349333 1447224 1420715 1446831 1376530 1303873
22822A303873r828P3807M6513p4316p0416O1017P2676p7023k3439K9742M7692
$$ 1303873 1294045 1367852 1414365 1340049 1269633 1330650 1403326 1326303 1302864 1332606 1380298
22811A380298M93M4625l3475q0358L9926l4675j04743N7717J12439j07322j24488
$$ 1380298 1380791 1425416 1391941 1311583 1351509 1316834 1212091 1269808 1382247 1274925 1150437
22800A150437N3365M8642k1161L2732Q1547L5782j8880j09069l3532O1777L1495
$$ 1150437 1203802 1252444 1231283 1264015 1345562 1381344 1362464 1253395 1219863 1281640 1313135
22789A313135L3366m666L187R372j30402K925L2283P2112O5938m0723p4713L0430
$$ 1313135 1346501 1341835 1345022 1354394 1223992 1226917 1259200 1331312 1397250 1356527 1281814 1312244
22777A312244p8662j7930J25757N9243J32659M5661M4938j42716k7838K2346l9383
$$ 1312244 1233582 1215652 1341409 1400652 1533311 1578972 1623910 1481194 1453356 1475702 1436319
22766A436319r1187j5633N5701Q0454q0989l3131N926Q134j8463J6405M175j14873
$$ 1436319 1345132 1329499 1385200 1465654 1384665 1351534 1357460 1365594 1347131 1363536 1367711 1252838
22754A252838q6586R2736P4514m609J9433N1989r9240j71631o0231M2468N3824
$$ 1252838 1166252 1258988 1333502 1328893 1348326 1400315 1301075 1129444 1069213 1111681 1165505
22743A165505l4723J3310N7612J7835m2217J2728L5444Q6986O6557J6635N5744
$$ 1165505 1130782 1144092 1201704 1219539 1177322 1190050 1225494 1312480 1379037 1395672 1451416
22732A451416M9872N1395j33078r0479K426Q8969P3533n1358l8962m2392k9865
$$ 1451416 1501288 1552683 1419605 1329126 1331552 1420521 1494054 1442696 1403734 1361342 1331477
22721A331477p546r795J50769J03292j22816J6052K9889J4276P1648j22679j39880
$$ 1331477 1323931 1314136 1464905 1568197 1445381 1461433 1491322 1505598 1577246 1454567 1314687
22710A314687K7751J4544K2877m7888k0542J33934P9328l1265J2701j09063j6554
$$ 1314687 1342438 1356982 1379859 1331971 1311429 1445363 1524691 1493426 1506127 1397064 1380510
22699A380510M3242j38783l4699L4468J08758M6471j48388j46268l3594J10156
$$ 1380510 1423752 1284969 1250270 1284738 1393496 1439967 1291579 1145311 1111717 1221873
22689A221873R7955L8387k5400M8334M8789r4742m4847L0739q7655J03953R0221
$$ 1221873 1319828 1358215 1332815 1381149 1429938 1335196 1290349 1321088 1233433 1337386 1427607
22678A427607j16995m0686k4343J02662k870k2070M5238l7438j8557r2382k1527
$$ 1427607 1310612 1269926 1245583 1348245 1345375 1323305 1368543 1331105 1312548 1220166 1198639
22667A198639j1371L119J9535Q4575J36125j3908K4538Q4690q3754j43503o5433
$$ 1198639 1187268 1190387 1209922 1294497 1430622 1416714 1441252 1525942 1442188 1298685 1233252
22656A233252J26321Q0276m2834L547M6293j28147M0881J9719L6234P7637M0511
$$ 1233252 1359573 1439849 1397015 1400562 1446855 1318708 1359589 1379308 1415542 1493179 1533690
22645A533690k0587n8615L1728N0421j7319m5586n5701J46579M9216m3536Q605
$$ 1533690 1513103 1454488 1486216 1536637 1519318 1473732 1418031 1564610 1613826 1570290 1578895
22634A578895j4680l0294j8280R754J2032m6566L4168L8131m0649K5636m7545
$$ 1578895 1564215 1533921 1515641 1525395 1537427 1490861 1525029 1563160 1522511 1548147 1500602
22623A500602j78133K6573K2288J8223Q7935k8331j59983J0987J75226Q4893k6942
$$ 1500602 1322469 1349042 1371330 1389553 1477488 1449157 1289174 1300161 1475387 1560280 1533338
22612A533338l2930m1203J4807l0837J8641n0383p5541j476J52479L2313j25090
$$ 1533338 1500408 1459205 1474012 1443175 1461816 1411433 1335892 1334416 1486895 1519208 1394118
22601A394118P6541J09727n306n2152j46219J4293N4907J4278J4178Q787J6944
$$ 1394118 1470659 1580386 1575080 1522928 1376709 1391002 1445909 1460187 1474365 1483152 1500096
22590A500096m1760r6378R9203J06078j0940o3496k940L0804m6949M2445J04435
$$ 1500096 1458336 1361958 1461161 1567239 1556299 1492803 1489863 1520667 1473718 1516163 1620598
22579A620598N8655n0787o9763l0486L0019j0977l5153Q0306Q787k0082r9612
$$ 1620598 1679253 1628466 1558703 1528217 1558236 1547259 1512106 1592412 1601199 1581117 1481505
22568A481505m1455m4416N2232l1223n8703J12775K9872l6210j1450L0162r3370
$$ 1481505 1440050 1395634 1447866 1416643 1357940 1470715 1500587 1464377 1452927 1483089 1389719
22557A389719N9047J04957J08966P3844O7573j23238j66176k5804l9513o4498
$$ 1389719 1448766 1553723 1662689 1736533 1804106 1680868 1514692 1488888 1449375 1384877
22547A384877j3762M4466j09779l7204J9224O9610R0047l7070K7634q972l1880
$$ 1384877 1371115 1415581 1305802 1268598 1287822 1357432 1447479 1410409 1438043 1429071 1397191
22536A397191M0852j764Q8985N86j09285j8765M0818N9274O2245q6152j1076q181
$$ 1397191 1438043 1436279 1525264 1525850 1416565 1397800 1438618 1497892 1560137 1473985 1462909 1454728
22524A454728L9191L0179K2860k13488j75599J2513l1135O7627J79333J94165
$$ 1454728 1493919 1524098 1546958 1333470 1157871 1170384 1139249 1206876 1386209 1580374
22514A580374m7832j07433q9655M6985O5270m1475m9156j3954J0871J09551J06664
$$ 1580374 1532542 1425109 1335454 1382439 1447709 1406234 1357078 1343124 1353995 1463546 1570210
22503A570210M2634K0041P1273j1585o0395p7259K7060j1009M1643j6920k378
$$ 1570210 1612844 1632885 1704158 1692573 1632178 1554919 1581979 1570970 1612613 1595693 1593315
22492A593315J7450L1739n7178Q731p7285M4792L6093j03195J14137J93589r207
$$ 1593315 1610765 1642504 1585326 1594057 1516772 1561564 1597657 1494462 1608599 1802188 1792981
22481A792981k44212q8185j9350M7031Q5051R8166K1476r0019o9942q3921Q0724
$$ 1792981 1548769 1460584 1441234 1488265 1573316 1671482 1692958 1602939 1532997 1449076 1529800
22470A529800J40318N4693p7679p261K2503N7264p5145p2501l3990P5002k8498
$$ 1529800 1670118 1724811 1647132 1639871 1662374 1719638 1644493 1571992 1538002 1613004 1584506
22459A584506K7954p8487K8969J36420O1386j45114p4582L035N2175Q2265k4395
$$ 1584506 1612460 1533973 1562942 1699362 1760748 1615634 1541052 1544087 1596262 1678527 1654132
22448A654132L051o4693j0479N1218P9518M9347M6169Q6846j40400l5944m1183
$$ 1654132 1657183 1592490 1582011 1633229 1712747 1762094 1808263 1895109 1754709 1718765 1677582
22437A677582k16513j46513K8288N8013o0096O5642J82262J35640p7383j22835
$$ 1677582 1461069 1314556 1342844 1400857 1340761 1406403 1588665 1724305 1646922 1524087
22427A524087O8807R223j07784n7902M5550R7825N7020J6462L4632j34618q8870
$$ 1524087 1592894 1602117 1494333 1436431 1481981 1579806 1636826 1653288 1687920 1553302 1464432
22416A464432K9922M7811N3275m2645p9634n5686N244M337P614N4036J2908J7531
$$ 1464432 1494354 1542165 1595440 1552795 1473161 1417475 1422719 1427056 1434670 1488706 1501614 1519145
22404A519145N5226r3943n0241K0141N8141J45299L1462J6866r09J5486k25470
$$ 1519145 1574371 1480428 1430187 1450328 1508469 1653768 1685230 1702096 1701187 1716673 1491203
22393A491203j44945K31890J75494P6432o498m7971m0093J0932q1935o1671J42566
$$ 1491203 1346258 1578148 1753642 1830074 1823576 1775605 1735512 1746444 1664509 1602838 1745404
22382A745404Q5496K2822k5137m7867L1715m194j45778j16868n481J53868M0827
$$ 1745404 1830900 1853722 1828585 1780718 1812433 1808239 1662461 1545593 1540112 1693980 1734807
22371A734807j05309j00225L2704M8822j0574L8872J14232j13850r0539L749J06619
$$ 1734807 1629498 1529273 1561977 1610799 1600225 1639097 1753329 1639479 1548940 1552689 1659308
22360A659308Q4322k1474Q9770Q7292o4699j06546j19048n9594Q3041J8170j8955
$$ 1659308 1743630 1722156 1811926 1899218 1834519 1727973 1608925 1549331 1632372 1650542 1631587
22349A631587J7231K1220n7756l0625Q2790L5544l8163j35499j7411J04992n2291
$$ 1631587 1648818 1670038 1612282 1581657 1664447 1699991 1661828 1526329 1508918 1613910 1561619
22338A561619l2728m0074O3401J44882R5239j5701M0503M8073J4681p8203q5002
$$ 1561619 1528891 1488817 1552218 1697100 1792339 1776638 1817141 1865214 1879895 1801692 1716690
22327A716690L5701K7308j64822o3191o2089O9L3773Q9545P1975J36540J28498
$$ 1716690 1752391 1779699 1614877 1551686 1489597 1489666 1523439 1612984 1684959 1821499 1949997
22316A949997Q7812p5112j13740r882J10183n1712j27552j56712J01187N7742
$$ 1949997 2037809 1962697 1848957 1839075 1949258 1897546 1769994 1613282 1714469 1772211
22306A772211k9408k9537P1409J73235N0398p5899j02747o4531n0141p9639l2700
$$ 1772211 1742803 1713266 1784675 1957910 2008308 1932409 1829662 1765131 1714990 1635351 1602651
22295A602651M4205J4141K990m1871J0242J27600P380K0666Q8279N381j17767
$$ 1602651 1646856 1660997 1663987 1622116 1632358 1759958 1767338 1788004 1876283 1881664 1763897
22284A763897L9114J8816J8998J2075n89m4545k6888M143O2411j06442j03988
$$ 1763897 1803011 1821827 1840825 1852900 1852311 1807766 1780878 1785021 1847432 1740990 1637002
22273A637002R031o089k0535K7716O6272K9742J3839R636L8922P1255k3458l9112
$$ 1637002 1646033 1639944 1619409 1647125 1713397 1743139 1756978 1766614 1805536 1876791 1853333 1814221
22261A814221l4740M439k8677j71o051L8485J6656k4149O9295k911N4486K9171
$$ 1814221 1779481 1783920 1755243 1755072 1749021 1787506 1804162 1780013 1849308 1846397 1900883 1930054
22249A930054O0872p0227m5938j240j4879j02879n6442m9697k2596M9830J17676
$$ 1930054 1990926 1920699 1874761 1873521 1858642 1755763 1699321 1649624 1627028 1676858 1794534
22238A794534J53244n0519K4709R5800K5646q721j52025m0910m2541k5622J22068
$$ 1794534 1947778 1897259 1921968 2017768 2043414 2034693 1882668 1841758 1799217 1773595 1895663
22227A895663Q8942j23964l6993l8265J5368K0456M1317P7469K0521J8603l0333
$$ 1895663 1984605 1860641 1823648 1785383 1800751 1821207 1862524 1939993 1960514 1979117 1948784
22216A948784r3015p4467L530O3815N9502k8804P9641l8995j04581J14684m8028
$$ 1948784 1855769 1781302 1784832 1848647 1908149 1879345 1958986 1919991 1815410 1930094 1882066
22205A882066n8425O200K0326J8991P8924m6592j13673j56820O6595K07149J16583
$$ 1882066 1823641 1829841 1850167 1869158 1948082 1901490 1787817 1630997 1697592 1904741 2021324
22194B021324j59696J839O2019o6396M1581r4960L5880J02294K2018L328j6468
$$ 2021324 1861628 1863467 1925486 1859090 1900671 1805711 1841591 1943885 1965903 1969231 1952763
22183A952763M2509j3449j6656l3456n6571o6737q8161L5006M8821P7135M1308
$$ 1952763 1995272 1981823 1965167 1931711 1875140 1808403 1720242 1755248 1804069 1881204 1922512
22172A922512k2792o4098j1891n4460Q5700j6776J8249j37254q1729M7230J29382
$$ 1922512 1899720 1835622 1823731 1769271 1854971 1838195 1856444 1719190 1637461 1684691 1814073
22161A814073J24859J52271r0993j99017o6017R8967J04064Q2214r1823P016Q4799
$$ 1814073 1938932 2091203 2000210 1801193 1735176 1834143 1938207 2020421 1928598 1935614 2020413
22150B020413K3096J1173j1515p3201q6440k7614l1089J27902K02628R3349l8535
$$ 2020413 2043509 2054682 2043167 1969966 1883526 1855912 1824823 1952725 2155353 2248702 2210167
22139B210167j26144j20559r3627j01737M8520J95046J05122O5234o8809q5030
$$ 2210167 2084023 1963464 1869837 1768100 1816620 2011666 2116788 2182022 2113213 2028183
22129B028183j05478k1690Q3971J26818L4809j71066L510n6981l3879R7026k8272
$$ 2028183 1922705 1901015 1984986 2111804 2146613 1975547 1979057 1922076 1888197 1985223 1956951
22118A956951M6515P9739l0635o8450l9451J2882K2423L588J34971O1695K8050
$$ 1956951 2003466 2083205 2052570 1984120 1944669 1957551 1979974 1983562 2118533 2180228 2208278
22107B208278j43410k09743l195R3671L3128O4031P1900m4727q0054R6269J9739
$$ 2208278 2064868 1855125 1851930 1945601 1978729 2042760 2114660 2069933 1989879 2086148 2105887
22096B105887L5743J2485k3908O8257r2930m5094q4557m4795l4294P7200J30240
$$ 2105887 2141630 2154115 2130207 2198464 2105534 2060440 1975883 1931088 1896794 1973994 2104234
22085B104234K08904l4146j81536j51689J42525J94506P6706m1911j74310M6239
$$ 2104234 2313138 2278992 2097456 1945767 2088292 2282798 2359504 2317593 2143283 2189522
22075B189522Q8230L1260N2766P8808n7758j93777r0991q7193K07402J02724O0231
$$ 2189522 2277752 2309012 2361778 2440586 2382828 2189051 2098060 2010867 2218269 2320993 2381224
22064B381224J24816N5073J92925P5361k4326M0806O1161r5632o3366j86923k54834
$$ 2381224 2506040 2561113 2754038 2829399 2805073 2845879 2907040 2811408 2748042 2561119 2306285
22053B306285k17779k83653j41431j12024o4889J29144J26965K0601J9335K77
$$ 2306285 2088506 1804853 1663422 1551398 1486509 1615653 1742618 1763219 1782554 1782831
22043A782831n3106j44249k9807J4001J63460o1090l6589K1747l3156N2671M5985
$$ 1782831 1729725 1585476 1555669 1569670 1733130 1672040 1635451 1657198 1624042 1676713 1722698
22032A722698l1398N3601j2929k0742M5822K2189O2354L3599N002J10273J17808
$$ 1722698 1691300 1744901 1731972 1711230 1757052 1779241 1841595 1875194 1880196 1990469 2108277
22021B108277p4531r9423Q4469Q1925l0557O8633k1948r705j9659j4150m0891
$$ 2108277 2033746 1934323 2018792 2100717 2070160 2138793 2116845 2107140 2087481 2073331 2032440
22010B032440n7473N0333K1972l5382k0205l8074J603M2451m1769n9418P0402
$$ 2032440 1974967 2025300 2047272 2011890 1991685 1953611 1955214 1997665 1955896 1896478 1966880
21999A966880K5059m8532Q2546J13742j11198O6779k2157j5648O6418p964O2634
$$ 1966880 1991939 1943407 2025953 2139695 2028497 2095276 2073119 2057471 2123889 2115925 2178559
21988B178559n3658K3730P0638J01510j10123k06029N258J17014n6227k8327O9431
$$ 2178559 2124901 2148631 2219269 2320779 2210656 2004627 2009885 2126899 2070672 2042345 2111776
21977B111776J14906r848n9812J2946J22205J41698j3360q8962j73287j0487K22397
$$ 2111776 2226682 2216834 2157022 2169968 2292173 2433871 2420511 2331549 2158262 2147775 2370172
21966B370172K4970j5870r6770j06917R110K7375N4068P8680j35940j32849Q5863
$$ 2370172 2395142 2379272 2282502 2175585 2184695 2212070 2266138 2344818 2208878 2076029 2161892
21955B161892J41403K742N3883M4249n4480j97248q0589O7371J30N0027R3112
$$ 2161892 2303295 2306037 2359920 2404169 2349689 2152441 2071852 2139223 2139353 2189380 2282492
21944B282492p9183q891o1566P5319L1934k7861k24Q049K4673l1273K3514K7154
$$ 2282492 2203309 2194418 2132852 2208171 2240105 2212244 2212020 2220069 2244742 2213469 2236983 2264137
21932B264137P5137n2590j1441K3427J17430N4435R9941N5026p7613k01319q7345
$$ 2264137 2339274 2286684 2275243 2298670 2416100 2470535 2570476 2625502 2547889 2346570 2259225
21921B259225P0593R5475l1772l8896J8529L3772k0618j26952j9595P1925R3856
$$ 2259225 2329818 2425293 2393521 2354625 2373154 2406926 2386308 2259356 2239761 2311686 2405542
21910B405542q3672J45989j0050N4083P2315J4272O937k2748J50437R4754l6051
$$ 2405542 2321870 2467859 2457809 2511892 2584207 2598479 2605416 2582668 2733105 2827859 2791808
21899B791808p6019L4722q3021l9644J7058R8207R8506l7390k5637K4456m6639
$$ 2791808 2715789 2750511 2667490 2627846 2644904 2743111 2841617 2804227 2778590 2803046 2756407
21888B756407N8393J45665J31284p534q1992j54563l90767l91602k74895Q0531
$$ 2756407 2814800 2960465 3091749 3084215 3002223 2847660 2456893 2065291 1790396 1870927
21878A870927J15862J62307J22626N7653j7825J13983R6152k2711K66134J49695
$$ 1870927 1986789 2149096 2271722 2329375 2311550 2425533 2521685 2498974 2765108 2914803
21868B914803j28743j71911K1475N8548m1560k24566k92734j76185r840O2682
$$ 2914803 2786060 2614149 2635624 2694172 2652612 2428046 2135312 1959127 1949287 2011969
21858B011969K9561K972Q2782O0010o7086J115j4305n89Q8471O3452n3061M2989
$$ 2011969 2041530 2044502 2127284 2187294 2120208 2121323 2107018 2106429 2194900 2258352 2205291 2248280
21846B248280J8531P857j0509J6796P7100l2737k4339k896L9110L400L5002p1167
$$ 2248280 2266811 2274668 2264159 2280955 2358055 2325318 2300979 2298083 2337193 2340593 2375595 2304428
21834B304428N6040O9452j1496J24903R0066l1828j72214K6671m1258L154O0702
$$ 2304428 2360468 2429920 2418424 2543327 2633393 2601565 2429351 2456022 2414764 2417918 2478620
21823B478620m5127M0077M3628J4364n2400P9521J23118p8770j19670k3512K2188
$$ 2478620 2433493 2473570 2517198 2531562 2479162 2558683 2681801 2603031 2483361 2459849 2482037
21812B482037k3480K0432Q2958m5049O745L3256l3646j5570n7859R5898P1276
$$ 2482037 2458557 2478989 2561947 2516898 2523643 2556899 2523253 2507683 2449824 2545722 2616998
21801B616998m4675k3750K1464J15362l0511j7107L1511R3564k9420l164r123
$$ 2616998 2572323 2548573 2570037 2685399 2654888 2637781 2669292 2762856 2733436 2730272 2721149
21790B721149M9953m6329j12572n201k7011O8468J17573L7195o5469k1307j065
$$ 2721149 2771102 2724773 2612201 2607000 2579989 2648457 2766030 2803225 2737756 2716449 2715384
21779B715384j35185n528J00815k1550j52514J41738J05315N417r5565J22902
$$ 2715384 2580199 2574671 2675486 2653936 2501422 2643160 2748475 2753892 2658327 2781229
21769B781229Q5879M8670j695l7133L7142k7276j26927q5592K8548M8771m423
$$ 2781229 2867108 2915778 2914083 2876950 2914092 2886816 2759889 2674297 2702845 2751616 2747193
21758B747193j51212l3326K07772J0148j4294l2069n1113p126J14645K71175N6993
$$ 2747193 2595981 2562655 2770427 2780575 2766281 2734212 2683099 2675973 2790618 3061793 3118786
21747C118786k2966k51991j15783n6327l9142J64308J39259P185j37468l6646
$$ 3118786 3095820 2843829 2728046 2671719 2632577 2796885 2936144 2943329 2805861 2769215
21737B769215N7922K9272j13656l7350O6753m7501l1004l839P7180j70R5050J05387
$$ 2769215 2827137 2856409 2742753 2705403 2772156 2724655 2693651 2689812 2766992 2766822 2861872 2967259
21725B967259k9483j3492J7879k2456J3655L2603J5872o4524J07125n2707n0110
$$ 2967259 2937776 2924284 2942163 2919707 2933362 2965965 2981837 2917313 3024438 2971731 2921621
21714B921621M5055J3918l611o6003J40049j4836r419n1015m254N4814K3891n199
$$ 2921621 2966676 2980594 2976983 2910980 3051029 3036193 3026774 2975759 2971505 3026319 3050210 3045011
21702C045011M415L9523L2904L1260n3689j2888R6890J6055l752r3455n9025O4323
$$ 3045011 3049426 3088949 3121853 3153113 3099424 3086536 3183426 3199481 3195729 3102274 3043249 3107572
21690C107572l6637m479J25802O2448R0332M4247k1137r5300j024P4635j4499
$$ 3107572 3070935 3066456 3192258 3254706 3345038 3389285 3368148 3272848 3271824 3346459 3331960
21679C331960j0384l5568j2010L2172j8243l7291l6472L0580l853k372N4624L6391
$$ 3331960 3321576 3286008 3273998 3306170 3287927 3250636 3214164 3244744 3240891 3238519 3293143 3329534
21667C329534l0906j9634K2745O9268k4733K9750L9364M56m128j08626n4014R0949
$$ 3329534 3298628 3278994 3301739 3371007 3346274 3376024 3415388 3415844 3411716 3303090 3249076 3340025
21655C340025N4517Q8709P2409m8244J07510J5288J6991O85j01260n0723k3448
$$ 3340025 3394542 3483251 3555660 3507416 3614926 3630214 3647205 3647890 3546630 3495907 3472459
21644C472459Q719P9974N1713Q7771l7175l6970j2273L4361p1442L1029n3189
$$ 3472459 3481178 3561152 3612865 3700636 3663461 3626491 3614218 3648579 3577137 3608166 3554977
21633C554977j8306n6151O3263K3595M0964P0451J06388J4265p4856m1846n4772
$$ 3554977 3536671 3480520 3543783 3567378 3608342 3678793 3785181 3799446 3724590 3682744 3627972
21622C627972R25k8603l18J21816Q6149p1631k5424N1123j1896j46065n8228J52976
$$ 3627972 3628897 3600294 3599976 3721792 3807941 3736310 3710886 3762009 3750113 3604048 3545820 3698796
21610C698796R3033j4365j37164O4799n7013n2777J90979J29597M2999l2316J6904
$$ 3698796 3791829 3777464 3640300 3705099 3648086 3595309 3786288 3915885 3958884 3926568 3943472
21599C943472p3372o1840J3739J20250J35865j4891r4678J5423J6778R9153n3701
$$ 3943472 3870100 3808260 3821999 3942249 4078114 4063223 3968545 3983968 4000746 4099899 4046198
21588D046198N0096O6165j63722j08483O8406J15212J14397k9895k3338m1552
$$ 4046198 4096294 4162459 3998737 3890254 3958660 4073872 4188269 4158374 4135036 4093484
21578D093484Q6058N8161M080J2997O0505L2511r9805j26317l4839k1948j30975
$$ 4093484 4179542 4237703 4241783 4254780 4315285 4347796 4247991 4121674 4086835 4064887 3933912
21567C933912J07075J99932j422j3980k1705P4458P2890N1728q6424n9455k6535
$$ 3933912 4040987 4240919 4239497 4225517 4203812 4278270 4351160 4402888 4316464 4257009 4230474
21556D230474R6276N3224L5817M6788M2859o2106P3845P878J4873K9565n0309
$$ 4230474 4326750 4379974 4415791 4462579 4505438 4443332 4517177 4525055 4539928 4569493 4519184
21545D519184P6089J72134J0717k7022O0437R833k9368M5148n0582j79099o9658
$$ 4519184 4595273 4767407 4778124 4751102 4811539 4821372 4792004 4837152 4786570 4607471 4537813
21534D537813j16252p9934o4651O7512P0709R1095k1572O5678R2875o9791K7143
$$ 4537813 4421561 4341627 4276976 4344488 4415197 4506292 4484720 4550398 4643273 4573482 4600625
21523D600625L5016R5033K50917Q8084J1068r2080j25122L0408q6499j1505p105
$$ 4600625 4635641 4730674 4981591 5069675 5080743 4988663 4863541 4893949 4807450 4795945 4788840
21512D788840J18194P3162k1209K8743J68185l8394j2259j330N2355n2575J1966
$$ 4788840 4907034 4980196 4958987 4987730 5155915 5117521 5105262 5103932 5156287 5103712 5115678
21501E115678m9083J01351Q2939M1998j7113n3394Q7788O2747j61961P8207J1981
$$ 5115678 5066595 5167946 5250885 5292883 5275770 5222376 5310164 5372911 5210950 5289157 5301138
21490E301138J04432J15137l7830N2078J06046q4694o4812J7770O719J58595J42338
$$ 5301138 5405570 5520707 5482877 5534955 5641001 5556307 5491495 5509265 5515984 5674579 5816917
21479E816917J02969r6381r4365J987M6092j01488m2652J16752J07513Q566J29336
$$ 5816917 5919886 5823505 5729140 5731127 5777219 5675731 5633079 5749831 5857344 5865910 5995246
21468E995246J272J6370N6932j04448p7604l923J31095M3616q3412R0196P3787
$$ 5995246 5996518 6012888 6069820 5965372 5887768 5883845 6014940 6058556 5975144 6065340 6139127
21457F139127N4685N9752m8315J13812J16232J38372R158M3417R2392q2247l1042
$$ 6139127 6193812 6253564 6205249 6319061 6435293 6573665 6582823 6626240 6718632 6636385 6605343
21446F605343P1967J31162L7805o5113N2872J03837m3243r8153P0549J29407J21520
$$ 6605343 6677310 6808472 6846277 6781164 6834036 6937873 6894630 6796477 6867026 6996433 7117953
21435G117953J22602l6523l4492J94143R5421k6208J12995o9547j69111J27860
$$ 7117953 7240555 7204032 7169540 7363683 7459104 7432896 7545891 7476344 7307233 7435093
21425G435093J41864N5185N7347n3995O3182J44395O4311R3056N3162J07454L7669
$$ 7435093 7576957 7632142 7689489 7635494 7698676 7843071 7907382 8000438 8053600 8161054 8198723
21414H198723j7204p424q6770j05722o0565p197J18737J41186N7621N4882q653
$$ 8198723 8181519 8174095 8087325 7981603 7921038 7913841 8032578 8173764 8231385 8286267 8277614
21403H277614m966K01531J28820L3913L9344J92284K12265L8909J32211L5332
$$ 8277614 8272648 8474179 8602999 8636912 8676256 8868540 9080805 9119714 9251925 9287257
21393I287257P169J77909J80423Q0406o471l1264J32838P0511J0859J00955J01332
$$ 9287257 9294426 9472335 9652758 9733164 9726693 9695429 9828267 9898778 9909637 10010592 10111924
21382A0111924N1466Q8684J78726J29333J05138J69973J15164J94736K13455J79619
$$ 10111924 10163390 10252074 10430800 10560133 10665271 10835244 10950408 11145144 11358599 11538218
21372A1538218J15829K7815J06239J49904J06997J98169Q8488n0646K7810K40710
$$ 11538218 11654047 11681862 11788101 11938005 12045002 12243171 12331659 12281013 12308823 12549533
21362A2549533L15223K26611O2472K7600P4503K28302K05558J41527K46719K48225
$$ 12549533 12864756 13091367 13153839 13181439 13255942 13484244 13689802 13831329 14078048 14326273
21352A4326273M1790P5901J99030L78474L59817J68293J67854K09130K52409K62924
$$ 14326273 14368063 14443964 14642994 15021468 15381285 15549578 15717432 15926562 16178971 16441895
21342A6441895L10630L40761L66134K80247J90187K76805K74166L52763N52652
$$ 16441895 16752525 17093286 17459420 17739667 17929854 18206659 18480825 18833588 19386240
21333A9386240M62989L96351M17268L91040K69536L20279M14934N42274P26588
$$ 19386240 19849229 20245580 20662848 21053888 21323424 21643703 22058637 22600911 23327499
21324B3327499O61951O08398O85651P87019P47044O35085K80563J5290J79530
$$ 23327499 23989450 24597848 25283499 26070518 26817562 27452647 27733210 27748500 27928030
21315B7928030P25992R56652J135687J221016J332532J240508J113706J056622
$$ 27928030 28654022 29610674 30746361 31967377 33299909 34540417 35654123 36710745
21307C6710745J347809J544688J565905J746292J878925K313004K458123K518434
$$ 36710745 38058554 39603242 41169147 42915439 44794364 47107368 49565491 52083925
21299E2083925K567510K835599L551802M629655N459103O230158P044222P898148
$$ 52083925 54651435 57487034 61038836 65668491 71127594 77357752 84401974 92300122
21291I2300122R301472J1559705J4909454J8990106K3232855K4232049J2065884
$$ 92300122 101601594 113161299 128070753 147060859 170293714 194525763 206591647
21284B06591647k9192740j03004740j55469981j09251089j7822091K0840951K5072620
$$ 206591647 177398907 74394167 -81075814 -190326903 -208148994 -187308043 -162235423
21277a62235423K1306542J7139082J3698821J0659843Q974240Q125601P019397
$$ -162235423 -140928881 -123789799 -110090978 -99431135 -90456895 -82331294 -75311897
21270g5311897O056114N227245M492825L964295L162378K387263K002443J940417
$$ -75311897 -69255783 -64028538 -59535713 -55571418 -52409040 -50021777 -48019334 -46078917
21262d6078917J926978J793739J813093J811081J837690J746064J535336J446530
$$ -46078917 -44151939 -42358200 -40545107 -38734026 -36896336 -35150272 -33614936 -32168406
21254c2168406J136673J075268J056747J130899J041980P70423M50909j5607J091
$$ -32168406 -31031733 -29956465 -28899718 -27768819 -26726839 -25956416 -25505507 -25521114 -25520023
21245b5520023L91578P04353Q43248Q17066P53827P01018P17442O28869L76527
$$ -25520023 -25128445 -24424092 -23580844 -22763778 -22009951 -21308933 -20591491 -19962622 -19586095
21236a9586095L49851L97050L36628L41592M87154M24849L04021L00781L24993
$$ -19586095 -19236244 -18839194 -18502566 -18160974 -17673820 -17248971 -16944950 -16644169 -16319176
21227a6319176K64379L48397L81573L20589K92108J99076J81272K75765K58459
$$ -16319176 -16054797 -15706400 -15324827 -15004238 -14712130 -14513054 -14331782 -14056017 -13797558
21218a3797558J17148J91991L82564K40401K66322K23926P0698K37362K56869
$$ -13797558 -13680410 -13488419 -13105855 -12865454 -12599132 -12375206 -12304508 -12067146 -11810277
21209a1810277R8220K69506K00688N8571J59027J24348J48934K21918J74285J03411
$$ -11810277 -11712057 -11442551 -11241863 -11183292 -11024265 -10899917 -10750983 -10529065 -10354780 -10251369
21199a0251369n0769J10759Q9248J66001J54972J77812J29224N4145J29997J65454
$$ -10251369 -10302138 -10191379 -10102131 -9936130 -9781158 -9603346 -9474122 -9419977 -9289980 -9124526
21189i124526J78054J29681J23243R0967k0J45552J28648J40564N6254M0125P4502
$$ -9124526 -8946472 -8816791 -8693548 -8602581 -8602601 -8457049 -8328401 -8187837 -8131583 -8091458 -8016956
21178h016956J27807Q9443K0923R6617J43696J14482Q1164k407O5080J25720J54987
$$ -8016956 -7889149 -7799706 -7778783 -7682166 -7538470 -7423988 -7342824 -7345231 -7280151 -7154431 -6999444
21167f999444J07118Q3497N0481l0557j9256J67944J9738J45980L6076j56043
$$ -6999444 -6892326 -6808829 -6758348 -6788905 -6808161 -6640217 -6620479 -6474499 -6438423 -6594466
21157f594466q7729N578K6478K9085K20242J27019Q0652J76062J02179N5890J08178
$$ -6594466 -6682195 -6676617 -6650139 -6621054 -6400812 -6273793 -6193141 -6017079 -5914900 -5859010 -5750832
21146e750832L5297J44779R3283j2368J05003q2747K0789R2274O3502p3448m1516
$$ -5750832 -5715535 -5570756 -5477473 -5489841 -5384838 -5467585 -5446796 -5354522 -5291020 -5364468 -5405984
21135e405984J37590J30077P873k4402M20k6711J45879J00982L2677P157k6394
$$ -5405984 -5268394 -5138317 -5130444 -5154846 -5154426 -5181137 -5035258 -4934276 -4901599 -4894442 -4920836
21124d920836k7495M6556J11270M9103L2393J26923j6876R5889O4466j8544k5728
$$ -4920836 -4948331 -4901775 -4790505 -4741402 -4709009 -4582086 -4598962 -4503073 -4438607 -4457151 -4482879
21113d482879M6634k1566K9660p646N9497o892N964J33557J61893N0075o6980
$$ -4482879 -4436245 -4457811 -4428151 -4435797 -4376300 -4383192 -4377228 -4243671 -4081778 -4031703 -4098683
21102d098683l6554l5487J3699K3398r327L5097M6330J82865P3452K6155j02369
$$ -4098683 -4135237 -4170724 -4157025 -4133627 -4142954 -4107857 -4061527 -3878662 -3805210 -3779055 -3881424
21091c881424P8469O1605L4671R8906M1413j85566l1038O3213K9985k425M8612
$$ -3881424 -3802955 -3741350 -3706679 -3607773 -3566360 -3751926 -3782964 -3719751 -3689766 -3692191 -3643579
21080c643579r473K7601K3439J58007p08R053O5659o4786m5265K0489J4847k0097
$$ -3643579 -3653052 -3625451 -3602012 -3444005 -3444713 -3435660 -3370001 -3434787 -3480052 -3459563 -3444716 -3464813
21068c464813k4570O5748J33273p0609q8558l1406J46051R7077J08556j9057n8739
$$ -3464813 -3489383 -3423635 -3290362 -3360971 -3449529 -3480935 -3334884 -3237807 -3129251 -3148308 -3207047
21057c207047J20108J42533J02862l0714O2304J5655j31296j8906L1813q2897
$$ -3207047 -3086939 -2944406 -2841544 -2872258 -2809954 -2794299 -2925595 -2944501 -2912688 -2995585
21047b995585J09094K3660Q5387L3897J7943Q0480m1684P4396r0083j17803l1009
$$ -2995585 -2886491 -2862831 -2777444 -2743547 -2725604 -2645124 -2686808 -2612412 -2702495 -2820298 -2851307
21036b851307J69146O4874J8195K0638j5455L9737N6756j85517j9969J50699O9192
$$ -2851307 -2682161 -2617287 -2599092 -2578454 -2593909 -2554172 -2497416 -2682933 -2702902 -2552203 -2483011
21025b483011M5509m6449R2056r3824j08141J43080N1227k7571j4889n4504j182
$$ -2483011 -2437502 -2483951 -2391895 -2485719 -2593860 -2450780 -2399553 -2427124 -2442013 -2496517 -2497699
21014b497699R2104K3652J05518l1352l1101n485N0628K9503J5568m8398J94589
$$ -2497699 -2405595 -2381943 -2276425 -2307777 -2338878 -2344363 -2293735 -2264232 -2248664 -2297062 -2102473
21003b102473J89349r009m1994J9541m5110o2342j75858O5993R9071O1284j7792
$$ -2102473 -1913124 -1922133 -1964127 -1944586 -1989696 -2052038 -2227896 -2161903 -2062832 -2001548 -2019340
20992b019340N6963j06633q5795p7797R1191j9887j6622J2005R4999P4418L1813
$$ -2019340 -1962377 -2069010 -2154805 -2232602 -2141411 -2161298 -2177920 -2165915 -2070916 -1996498 -1964685
20981a964685j0131r6636n0963M7984l921J74998J61745j0719l8794q2547m9999
$$ -1964685 -1974816 -2071452 -2122415 -2074431 -2078352 -1903354 -1741609 -1752328 -1791122 -1873669 -1923668
20970a923668Q030M7301K3567n2704n8735K4202J00891R2427j0803l7773N8473
$$ -1923668 -1915638 -1868337 -1844770 -1897474 -1956209 -1932007 -1831116 -1738689 -1749492 -1787265 -1728792
20959a728792M7773j9456l9325p035O8664p1477k9624J0486O7418J6541J31628
$$ -1728792 -1681019 -1700475 -1739800 -1746835 -1678171 -1749648 -1779272 -1768786 -1701368 -1684827 -1553199
20948a553199J01129M5495r4960O098K5581p594l218m2619n8787j42946J0268
$$ -1553199 -1452070 -1406575 -1501535 -1495437 -1469856 -1477450 -1480668 -1523287 -1582074 -1725020 -1714752
20937a714752O0232R9762M5537L1322L4158l3862j43853P7628R2035M5514Q2584
$$ -1714752 -1654520 -1554758 -1509221 -1477899 -1443741 -1477603 -1621456 -1543828 -1451793 -1406279 -1323695
20926a323695o2358j15950M4317K768o274O4275O3925k861p9658O2589N7565j9920
$$ -1323695 -1386053 -1502003 -1457686 -1454918 -1461192 -1396917 -1332992 -1335853 -1415511 -1352922 -1295357 -1315277
20914a315277L9557J5778M0424m2530n9150M2572N2134l7231k5467Q3950J04614
$$ -1315277 -1275720 -1259942 -1219518 -1262048 -1321198 -1278626 -1226492 -1263723 -1289190 -1205240 -1100626
20903a100626m6471k57972n4275J63802K67417J8334j12438m389m1000O6228J40466
$$ -1100626 -1147097 -1405069 -1459344 -1295542 -1028125 -1009791 -1122229 -1126618 -1167618 -1101390 -960924
20892i60924q0280j30685P0841K9281r0184m8079M4659J32803L6571r094o9885
$$ -960924 -1041204 -1171889 -1101048 -1071767 -1161951 -1210030 -1165371 -1032568 -995997 -1005091 -1074976
20881a074976j29986L6518J33934K0524L3300j07937j03071P2499O0404K1000
$$ -1074976 -1204962 -1168444 -1034510 -1013986 -980686 -1088623 -1191694 -1119195 -1058791 -1037791
20871a037791m0504k1584K9135Q9087K849R1039n779L7069l5023j24113N68r6577
$$ -1037791 -1078295 -1099879 -1070744 -981657 -978808 -887769 -893548 -856479 -891502 -1015615 -1015047 -1111624
20859a111624P6582Q6088j8722Q1081j32232j26484l8428O0116O8519K5184J26817
$$ -1111624 -1035042 -948954 -967676 -886595 -1018827 -1145311 -1183739 -1123623 -1055104 -1029920 -903103
20848i03103Q3939k5374j68673j2451J07226k296Q7224R3883L9601n1857j09407
$$ -903103 -819164 -844538 -1013211 -1025662 -918436 -920732 -833508 -739625 -700024 -751881 -861288
20837h61288n6753K5691J351r444K403O6596K9240M633m079k4950J13176k0431
$$ -861288 -918041 -892350 -890999 -900443 -898040 -831444 -802204 -797571 -801650 -826600 -713424 -733855
20825g33855j31581l9307p7587J0904J20218N5619r3483M1363j1615j38133N8933
$$ -733855 -865436 -904743 -982330 -971426 -851208 -795589 -889072 -847709 -859324 -997457 -938524
20814i38524J02715j9355j8760K743J52553K5362j57161j2368J6377M2759J68061
$$ -938524 -835809 -855164 -873924 -871181 -718628 -693266 -850427 -862795 -846418 -803659 -635598
20803f35598L5452q4321K767l0844N653n114l5925J4627R6548J54426J21362q4985
$$ -635598 -600146 -684467 -681700 -712544 -706891 -712005 -747930 -733303 -636755 -482329 -360967 -445952
20791d45952j46464O6183O1205q3760O045j71430j1083J35819O0180j911m227
$$ -445952 -592416 -526233 -465028 -548788 -542743 -714173 -725256 -589437 -529257 -531168 -535395
20780e35395M2258M1456m6665q8182P4239L454P7302K354r7395P4235K11190N7427
$$ -535395 -493137 -451681 -498346 -586528 -512289 -508835 -431533 -429179 -526574 -452339 -241149 -183722
20768a83722K5979n4514r6671l5398M7138l0283n8984l9757r8360n1540m2820
$$ -183722 -157743 -212257 -308928 -344326 -297188 -327471 -386455 -426212 -524572 -576112 -618932
20757f18932r143J44801R1984J356j16981K1536N1435o3402J43766R5976k0621
$$ -618932 -628075 -483274 -391290 -389934 -506915 -485379 -433944 -497346 -353580 -257604 -278225
20746b78225j1425j2109p1873O7217P3709l1481q6443n0038L1764P2517o8222
$$ -278225 -289650 -301759 -373632 -306415 -232706 -264187 -350630 -400668 -368904 -296387 -364609
20735c64609M4110k7165Q0440m0584L8319K9892k9330J4726q3525N550k4893q0620
$$ -364609 -320499 -347664 -267224 -307808 -269489 -239597 -268927 -254201 -337726 -332176 -357069 -437689
20723d37689r3994J04179N6229O4430N1360L6326L008N2147J12427k701r4990
$$ -437689 -531683 -427504 -371275 -306845 -255485 -219159 -216151 -164004 -51577 -54278 -149268
20712a49268j08473j06511J00088N2105o086P3811J36289R5733P4949K2560Q8379
$$ -149268 -257741 -364252 -264164 -212059 -218145 -144334 -8045 87688 162637 185197 273576
20701B73576O254K4960k1666j3500Q3809j7119l15481k90531j91437j91953M3702
$$ 273576 279830 304790 283124 269624 353433 336314 20833 -269698 -461135 -653088 -609386
20690f09386J83125J00089O7001J50530q0533j55185J101O6794J07759J18123
$$ -609386 -426261 -326172 -259171 -108641 -189174 -344359 -343258 -276464 -168705 -50582
20680e0582k8667k118N691m6301j03362j95340j78485m4103N2759J03193M2781
$$ -50582 -79249 -81367 -75676 -121977 -225339 -420679 -599164 -643267 -590508 -487315 -444534
20669d44534k8513k3148Q6720n2294m6422k4444l0165O9067J05246J21990j531
$$ -444534 -473047 -496195 -409475 -461769 -508191 -532635 -562800 -493733 -388487 -266497 -268028
20658b68028k5757n3250l8913j550J94614J11562p5369m1941j1953l9263j001
$$ -268028 -293785 -347035 -385948 -387498 -192884 -81322 -156691 -198632 -210585 -249848 -250849
20647b50849L404N2478l3168m2973J748R9900J41413L135q8241j7590j05172J1889
$$ -250849 -247445 -194967 -228135 -271108 -269360 -169460 -28047 -24912 -113153 -130743 -235915 -224026
20635b24026k6163p6674p547Q3910J07228K2651j4108o2469L2459J00937J853
$$ -224026 -250189 -326863 -334410 -250500 -143272 -120621 -134729 -197198 -164739 -63802 -61949
20624f1949n1465m7352o651J0859K05782L1960k01136m0494J62301M4565k7974
$$ -61949 -113414 -160766 -167417 -156558 49224 81184 -119952 -160446 1855 46420 18446
20613A8446j7800j6526K855j1001m2647j00137M0348K13143J06923r8470l3634
$$ 18446 646 -15880 -13025 -24026 -66673 -166810 -126462 86681 193604 95134 61500
20602F1500J00669o3763J6184l9851q5419q5333K8931R6609M061M6290L0588K8962
$$ 61500 162169 98406 114590 74739 -10680 -96013 -67082 29527 33588 79878 110466 139428
20590A39428n6173k7030J0742L9011M6931m3895j01349P605J40850k6479r6199
$$ 139428 83255 56225 66967 105978 152909 109014 7665 15270 156120 129641 33442
20579C3442L0485M6182M2880Q587Q8663N4606p718j68379p1594j8194M017k5667
$$ 33442 63927 110109 152989 161576 250239 304845 297127 128748 57154 38960 42977 17310
20567A7310q5489j7675Q120K2067L8916M3173K4290j9110j1029K22818R6595j16770
$$ 17310 -68179 -85854 -77734 -55667 -16751 26422 50712 31602 20573 243391 339986 223216
20555B23216j11801J28770P0584j1150K218k916n0099n4115K3452R1007m1881
$$ 223216 111415 240185 310769 299619 301837 298921 248822 194707 218159 309166 267285
20544B67285j0973n3830L3042l6908k2957l0418m1296r822L5876N29m0826Q1325
$$ 267285 256312 202482 235524 198616 175659 145241 103945 94123 129999 130528 89702 171027
20532A71027J3515j33781J5075j0966N2025R2473J8021K8322M8301n8991o9648
$$ 171027 184542 50761 65836 54870 106895 199368 217389 245711 294012 235021 165373
20521A65373k0294Q7862Q6171o6782n122Q887M5815L463k1910J03304N7034m7199
$$ 165373 145079 232941 319112 252330 247208 256095 301910 305373 283463 386767 443801 396602
20509C96602L1060j03563o9007P4875j02193j11326R379l4010J51124R1266o618
$$ 396602 427662 324099 255092 329967 227774 116448 125827 91817 242941 334207 327589
20498C27589l851o5698n8658M6613k5044p034J05300o8838K3917N5337j1949k9580
$$ 327589 323738 258040 199382 245995 220951 213917 319217 250379 274296 329633 317684 288104
20486B88104k913K1538r5415R3831L0565N021L136p3065L8224n8949j5266M0836
$$ 288104 285191 306729 211314 305145 335710 340731 343867 270802 309026 250077 234811 275647
20474B75647j63436q1226P8446P6474K1327J15679J1633j2598R562N8663J07305
$$ 275647 112211 30985 109431 185905 207232 322911 334544 321946 331508 390171 497476
20463D97476K5775j44069O5941J54287j23193j70557q5577k1853Q2103J44600
$$ 497476 523251 379182 445123 599410 476217 305660 220083 198230 280333 424933
20453D24933M3736m1906O7557L229n8333L4626M3097l5745n4132j3196n8445K8941
$$ 424933 468669 426763 494320 497549 439216 473842 516939 481194 427062 413866 355421 384362
20441C84362Q9947m8156j58376P3363J11743K9810P2013m0589r2437N2615N4883
$$ 384362 474309 426153 267777 341140 452883 482693 554706 514117 421680 474295 529178
20430E29178j00039k7413N9576o0623M5233J67752j552j11688L9509q1022N0635
$$ 529178 429139 401726 461302 400679 445912 613664 612112 500424 539933 458911 509546
20419E09546m9189m9413K5836k5400K9753R532N4920K1168k9880j2025j7792o0350
$$ 509546 460357 410944 436780 411380 441133 450665 505585 526753 496873 484848 467056 406706
20407D06706q63M6991J27666m3049J5712M3127o2914L6845J54672R9580q1065
$$ 406706 405843 452834 580500 537451 553163 596290 533376 570221 724893 824473 743408
20396G43408r2805M969Q5701J28722M8752j67379n9571l3020m6428M1328k4407
$$ 743408 650603 655572 741273 869995 918747 751368 691797 658777 612349 653677 629270
20385F29270J1141k8990P3710j8596n8341K4041K4338M4573L999J7938J9282M4426
$$ 629270 640411 611421 685131 666535 608194 632235 656573 701146 705145 723083 742365 786791
20373G86791m5649j19458J5984p515M3915J09995N915Q205L2479q0290n8978N2597
$$ 786791 741142 621684 637668 630153 674068 784063 789978 798183 830662 750372 691394 743991
20361G43991j11429L4286N4465l5034j66079n2603M4949N4190l8289o7023K7054
$$ 743991 632562 666848 721313 686279 520200 467597 512546 566736 528447 461424 488478
20350D88478P3910J03898j24448k21580k8469J04982K7495n1129j79888J1190
$$ 488478 562388 666286 541838 320258 291789 396771 424266 373137 193249 204439
20340B04439J1719K4420M1666l5008L2517R9866j179n1733L5355J04876J39574
$$ 204439 216158 240578 282244 247236 279753 379619 378440 326707 362062 466938 606512
20329F06512l6820n2524R3601m884o468o653n4137L8397k9484m6314q3571l4327
$$ 606512 569692 517168 610769 605885 599417 592764 538627 577024 547540 501226 417655 383328
20317C83328o3663M3041Q6837K3452O0274R8471J15662N643j86909j49090m8283
$$ 383328 319665 362706 449543 472995 533269 631740 747402 753045 566136 417046 368763
20306C68763j249R1013J11030K0593l6074k6411P2988J22494Q3797l7626n1820
$$ 368763 367514 458527 569557 590150 554076 527665 600653 723147 806944 769318 717498
20295G17498j3373j8147l0928j8082n3813N7855O3036M957r1851K9399J8998l7185
$$ 717498 704125 685978 655050 636968 583155 641010 704046 709003 617152 646551 665549 628364
20283F28364m653j3459n2679P6399k819J17906p2861q2761O7423N2193n5881p5571
$$ 628364 623711 610252 557573 633972 631153 749059 676198 593437 660860 713053 657172 581601
20271E81601P4064M6024q7567N679L8845o995m3574P1155O4770o8014l7493R0826
$$ 581601 655665 701689 614122 619801 658646 651651 608077 679232 744002 675988 638495 729321
20259G29321N6628m8538j16904O8946P2083J0433J79494K4264j20335p8961R6561
$$ 729321 785949 737411 620507 689453 761536 771969 951463 975727 855392 776431 872992
20248H72992O8091m625j40526j27760K6564J79479N2691K9987p0624j28790p6387
$$ 872992 941083 936458 795932 668172 694736 874215 926906 956893 886269 757479 681092
20237F81092K5518p2112N4460N6732l6282O2948K4861L3439Q5417O443n4245Q6029
$$ 681092 706610 634498 688958 745690 709408 772356 797217 830656 916073 922516 868271 954300
20225I54300N2475k0882L306o8437n0288Q0034J71836K2669J6718k28149J4447
$$ 954300 1006775 985893 989199 920762 870474 950508 1122344 1145013 1161731 933582 948029
20214I48029Q6533j75609m9069Q064J49154Q9808K1189p0958n7963j24316N6929
$$ 948029 1034562 858953 809884 817948 967102 1056910 1078099 1007141 949178 824862 881791
20203H81791N3920J5109K6148P2145l7628r8929m217M4269n7506P5436j315M1744
$$ 881791 935711 950820 976968 1049113 1011485 912556 908339 952608 895102 970538 969223 1010967
20191A010967n0545M0654J26115j12047o5929K8932O743K7455Q6906P2949m4732
$$ 1010967 960422 1001076 1127191 1015144 949215 978147 984890 1012345 1099251 1172200 1127468
20180A127468k2504j01053O9682R3970n7537r732N2780L5011L5409k6363L2951
$$ 1127468 1104964 1003911 1073593 1167563 1110026 1100294 1153074 1188085 1223494 1197131 1230082
20169A230082r6822L967M4845j4856N8612q1052j31080J60424P2550m1785K066
$$ 1230082 1133260 1137227 1182072 1167216 1225828 1144776 1013696 1174120 1246670 1204885 1206951
20158A206951N2732l5621J8595J11871J6977O2560k2249l9246k8370K3459k6207
$$ 1206951 1259683 1224062 1242657 1354528 1371505 1434065 1411816 1372570 1344200 1367659 1341452
20147A341452p8338m5443J3057L0816l4798j01495j45874R6044J20197k271r9117
$$ 1341452 1263114 1217671 1230728 1261544 1226746 1125251 979377 1075421 1195618 1193347 1094230
20136A094230r6064j05666M8198J53909J56546l8123m785j7894o6717O834m886
$$ 1094230 998166 892500 940698 1094607 1251153 1213030 1208245 1190351 1123634 1130468 1125582
20125A125582j04265j15130L2051R8474r9110m724J14449n5930j47393J644M2034
$$ 1125582 1021317 906187 938238 1036712 937602 932878 1047327 991397 844004 845648 887682
20114H87682J17184O255J60759O5126r5445j22852m5398p346m7038J5903J8222
$$ 887682 1004866 1011121 1171880 1237006 1141561 1018709 973311 965965 918927 934830 953052
20103I53052J23136J30860o9363j19828J6464R2873L6885O9408L4532q3497J14897
$$ 953052 1076188 1207048 1137685 1017857 1034321 1127194 1164079 1233487 1268019 1184522 1299419
20092A299419j5612m3931m7610K5861J76019O8088j17380j40895p7110J52356
$$ 1299419 1283807 1239876 1192266 1218127 1394146 1462234 1344854 1203959 1126849 1279205
20082A279205J19594J9582J38505o6954j23021K0696m0286j7282l9786j7921L9629
$$ 1279205 1398799 1418381 1556886 1489932 1366911 1387607 1347321 1330039 1290253 1272332 1311961
20071A311961k5663p3635P9052N85J32404q9927r0002M7627P2388L5002r0326
$$ 1311961 1286298 1212663 1291715 1292300 1424704 1334777 1244775 1292402 1364790 1399792 1309466
20060A309466l9368L8248J77648K1429j0265Q7833m3499k6076m1643K3963j25478
$$ 1309466 1270098 1308346 1485994 1507423 1497158 1584991 1541492 1515416 1473773 1497736 1372258
20049A372258k8049j1948M0922k1118l9946J34808n2217j51579P7398J01600l873
$$ 1372258 1344209 1332261 1373183 1352065 1312119 1446927 1394710 1243131 1320529 1422129 1418256
20038A418256J08883J29480k2326j47637p8764j4436L8506J10610O8673J1862
$$ 1418256 1527139 1656619 1634293 1486656 1407892 1393456 1431962 1542572 1611245 1623107
20028A623107p9274k5746K3022R829O1836j06569j15463J10424k0635n8847l1416
$$ 1623107 1543833 1518087 1541109 1550938 1612774 1506205 1390742 1501166 1480531 1421684 1390268
20017A390268N0441Q432n8478o22L9005o5278N5923l070L5065Q0322m8358o3674
$$ 1390268 1440709 1449141 1390663 1390041 1429046 1363768 1419691 1416621 1451686 1532008 1483650 1419976
20005A419976l9959L6149J16332n6098J9106J31512L6729M2923M9251p5500j0577
$$ 1419976 1380017 1416166 1532498 1476400 1495506 1627018 1663747 1706670 1755921 1680421 1669844
19994A669844Q8342j5619j08166J3580L3499m5273k2880L4695K0970L8280L5701
$$ 1669844 1758186 1742567 1634401 1647981 1681480 1636207 1613327 1648022 1668992 1707272 1742973
19983A742973L4052P6495J66601j46354r7457o8737K520Q0485q1843n5447q7177
$$ 1742973 1777025 1853520 2020121 1873767 1776310 1707573 1710093 1790578 1708735 1653288 1566111
19972A566111J27942J34909j106j9471l4942k1903n8654L3598Q77J16930j7490
$$ 1566111 1694053 1828962 1827856 1808385 1773443 1751540 1692886 1726484 1727361 1844291 1826801
19961A826801K9758q1107J9507M0797R1210j6293J42l7573j66603k4743R5494
$$ 1826801 1856559 1775452 1794959 1835756 1926966 1910673 1910815 1873242 1706639 1681896 1777390
19950A777390J72044P2241p4048o1166m1005n2760k5465M1991J39604R9753P9323
$$ 1777390 1949434 2021675 1947627 1886461 1845456 1792696 1767231 1809222 1948826 2048579 2127902
19939B127902j67469o2200N9530l3321n9048L9257q1855K1896j6276l6227R9745
$$ 2127902 1960433 1898233 1957763 1924442 1865394 1904651 1822796 1844692 1828416 1792189 1891934
19928A891934j4356k2897p2282M5229J31401j01984o9323J17279Q4123K4852J5529
$$ 1891934 1877578 1854681 1782399 1827628 1959029 1857045 1787722 1905001 1989124 2013976 2029505
19917B029505m8866N9501R1910P4578M620m1391j30688J05524J10527k5546L3518
$$ 2029505 1980639 2040140 2132050 2206628 2211248 2169857 2039169 2144693 2255220 2229674 2263192
19906B263192j40262N0880N5959O971Q9592J02523M7854l9324M7316o3859k31442
$$ 2263192 2122930 2173810 2229769 2236740 2326332 2428855 2476709 2437385 2484701 2420842 2189400
19895B189400P324J27356N2071j34037k0805J6748J1800o0609O2775P2627M746
$$ 2189400 2196724 2324080 2376151 2242114 2221309 2238057 2249857 2189248 2252023 2324650 2329396
19884B329396j09046n8404J31960J56237R5072n7476l0621k617m7717j29306L7114
$$ 2329396 2220350 2161946 2293906 2450143 2545215 2487739 2457118 2454501 2406784 2277478 2314592
19873B314592O2146p6533L6688K3490N2142Q0969l0164j86884M5006J86327J6601
$$ 2314592 2376738 2300205 2336893 2360383 2412525 2493494 2463330 2276446 2321452 2507779 2524380
19862B524380j7565J6088K0483j02310L6907j8433M2310P6593j4133M8460Q3179
$$ 2524380 2506815 2522903 2543386 2441076 2477983 2459550 2501860 2578453 2564320 2612780 2695959
19851B695959N1343J2328r3052O1458o872p0247j19699o3302M0059m1035R9746
$$ 2695959 2747302 2759630 2666578 2728036 2721164 2650917 2531218 2467916 2507975 2466940 2566686
19840B566686J84446k6824K3735N7097j3899L2577R7547r733m9585M0711j0833
$$ 2566686 2751132 2724308 2748043 2805140 2791241 2823818 2921365 2911632 2862047 2902758 2891925
19829B891925M1676l5073j1562M6963J4424L2786j9121R412o0635j31116Q9440
$$ 2891925 2933601 2898528 2886966 2933929 2948353 2981139 2962018 2971430 2910795 2779679 2869119
19818B869119J59562J50373k419O2351N8030n1223j0511J80806K4748k04417j01129
$$ 2869119 3028681 3179054 3176635 3238986 3297016 3245793 3235282 3416088 3440836 3236419 3135290
19807C135290Q9979J40490P5320m0577l5372o8788j0732M0517J24109J47328J07489
$$ 3135290 3225269 3365759 3441079 3400502 3365130 3296342 3285610 3326127 3450236 3597564 3705053
19796C705053L53n0149O929j04853k50364j23668J079P8530j23615o4150M5258
$$ 3705053 3705406 3655257 3662186 3557333 3306969 3183301 3184380 3262910 3139295 3075145 3120403
19785C120403n799P9347K3215K5780k2556m5126J36412J84577n71j32623k0831
$$ 3120403 3114604 3193951 3217166 3242946 3220390 3175264 3311676 3496253 3495682 3363059 3342228
19774C342228l322r4557R8375L6292j6691O2123m3572p1774N2642k092q4439l3639
$$ 3342228 3338906 3244349 3342724 3379016 3362325 3424448 3380876 3309102 3361744 3359652 3275213 3241574
19762C241574J1770l4573p6828p3336k8906L781J07905O3434l4959j05531m2117
$$ 3241574 3253344 3218771 3141943 3068607 3039701 3043482 3151387 3214821 3179862 3074331 3032214
19751C032214R6514J09573l7643O9264L6118J40425O6496k1206r7657O2618K13993
$$ 3032214 3128728 3238301 3200658 3269922 3306040 3446465 3512961 3491755 3394098 3456716 3670709
19740C670709N6749l7553N3888J12940m5166M5407J19542o8526p2248M3315J04668
$$ 3670709 3727458 3689905 3743793 3856733 3811567 3856974 3976516 3907990 3835742 3879057 3983725
19729C983725n9542M1834J72320J33684J24398P5303m9233m3522J04387m9021
$$ 3983725 3924183 3966017 4138337 4272021 4396419 4471722 4422489 4378967 4483354 4434333
19719D434333j81766p3829O0799J22127P5764P6979j3110q347J44490R2519N3924
$$ 4434333 4252567 4178738 4239537 4361664 4437428 4514407 4501297 4492950 4637440 4729959 4783883
19708D783883M3893J30813J55373R0968n955J0679j32285j4158J51944J38469
$$ 4783883 4827776 4958589 5113962 5204930 5198975 5209654 5077369 5063211 5215155 5353624
19698E353624P6952M0492M7425p4908Q3113P8420J5929Q0740N7481J72563R3650
$$ 5353624 5430576 5471068 5518493 5443585 5526698 5605118 5621047 5701787 5759268 5931831 6025481
19687F025481R5189q734J2282J2010J69646L6774O9562Q6776J08223Q8112K0222
$$ 6025481 6120670 6111936 6124218 6136228 6305874 6342648 6412210 6498986 6607209 6695321 6715543
19676F715543M8159J69330J59110J6579o3779J39207L8751J03499J00732J34949
$$ 6715543 6763702 6933032 7092142 7108721 7044942 7184149 7222900 7326399 7427131 7562080
19666G562080J93873Q8715K23288J36451M9286O671J05911J13378N6105J48511
$$ 7562080 7755953 7844668 8067956 8204407 8253693 8260364 8366275 8479653 8535758 8684269
19656H684269L09472L56665J67064K04497J12827K03112J69623Q2711J15710K18771
$$ 8684269 8993741 9350406 9517470 9721967 9834794 10037906 10207529 10290240 10405950 10624721
19646A0624721J52881J80123K37156K99705L49421L26008L11860J60279J24805
$$ 10624721 10777602 10957725 11194881 11494586 11844007 12170015 12481875 12642154 12766959
19637A2766959L74930N08732L97367L74493M89556O38304O95428N94568N95424
$$ 12766959 13141889 13650621 14047988 14422481 14912037 15550341 16245769 16840337 17435761
19628A7435761O70792N88118O83440R57540J182822J348494J353771J483071J714888
$$ 17435761 18106553 18694671 19378111 20335651 21518473 22866967 24220738 25703809 27418697
19619B7418697K080087K623222L465269M518573N334645M070024j897745j4139292
$$ 27418697 29498784 32122006 35587275 40105848 45440493 49510517 47612772 33473480
19611C3473480k2575810j2351523L183434Q046970Q355463N827164j935097j5518789
$$ 33473480 10897670 -1453853 1729581 9776551 18132014 23959178 22024081 6505292
19603F505292k3422295j1743483L024575O407437O009261N205405M410838L688039
$$ 6505292 -16917003 -28660486 -25635911 -19228474 -13219213 -8013808 -3602970 85069
19595H5069L459537L775480M538770N358247O179414N197713l85856j2508978
$$ 85069 3544606 7320086 11858856 17217103 23396517 28594230 28208374 15699396
19587A5699396k2696183j5033064J867637Q079952Q503363O228002p50835j3925223
$$ 15699396 -6996787 -22029851 -20162214 -12082262 -3578899 2649103 1898268 -12026955
19579a2026955k3660182j4675573J417373N745577N080922M114454L295632K666481
$$ -12026955 -35687137 -50362710 -48945337 -43199760 -38118838 -34004384 -30708752 -28042271
19571b8042271K128989J707964J443775J206684J171033J116090J104570R16918
$$ -28042271 -25913282 -24205318 -22761543 -21554859 -20383826 -19267736 -18163166 -17246248
19563a7246248Q48616N81275M07306N46025O81375N64673O34760O00557L99900
$$ -17246248 -16397632 -15816357 -15409051 -14863026 -14181651 -13616978 -12982218 -12381661 -11981761
19554a1981761L86363L30102K24701J94429K28500L91591L77541L83490L12974
$$ -11981761 -11595398 -11265296 -11040595 -10846166 -10617666 -10226075 -9848534 -9465044 -9152070
19545i152070J37205K05924J84372K10776J35099L6883J80434K73181J90252J00556
$$ -9152070 -9014865 -8808941 -8624569 -8413793 -8278694 -8241811 -8061377 -7788196 -7597944 -7497388
19535g497388K30699K18415O4370J32160J86013O6983J9923J04566J63181J38033
$$ -7497388 -7266689 -7048274 -6983904 -6851744 -6665731 -6598748 -6578825 -6474259 -6311078 -6173045
19525f173045K9858J14304J10927P3799J10319K43798J91275R3573l4997J22677
$$ -6173045 -6143187 -6028883 -5917956 -5844157 -5733838 -5490040 -5298765 -5205192 -5240189 -5117512
19515e117512M0959J15262J41085n3020R9305Q711J45587J89001O8335o5285J20809
$$ -5117512 -5076553 -4961291 -4820206 -4873226 -4773921 -4765210 -4619623 -4430622 -4362287 -4427572 -4306763
19504d306763P5074L6060K5527O3542M0854O5621P4305O1108M353r687R1540q639
$$ -4306763 -4231689 -4195629 -4170102 -4106560 -4065706 -4000085 -3925780 -3864672 -3860319 -3870006 -3778466 -3787105
19492c787105Q4310R4376l1094O9567K24750O6732Q3421l5168k3348K8448N7816
$$ -3787105 -3702795 -3608419 -3639513 -3569946 -3345196 -3278464 -3195043 -3230211 -3253559 -3225111 -3167295
19481c167295O3551k4806m9541J07309J09928J01183l0835R196O8353N9933o8012
$$ -3167295 -3103744 -3128550 -3178091 -3070782 -2960854 -2859671 -2890506 -2881310 -2812957 -2753024 -2821036
19470b821036m7860J04088R4777M1139k3850o2536L5786J60396k6391J30458J04984
$$ -2821036 -2868896 -2764808 -2670031 -2628892 -2652742 -2715278 -2679492 -2519096 -2545487 -2415029 -2310045
19459b310045o2413M825R1084j7682K0469N288j08187L1159R9083J02416Q8879
$$ -2310045 -2372458 -2367633 -2276549 -2294231 -2273762 -2268474 -2376661 -2345502 -2246419 -2144003 -2055124
19448b055124j00131j50052m2827m1527j07113J83225J88492K0409L3035J19738
$$ -2055124 -2155255 -2305307 -2348134 -2389661 -2496774 -2313549 -2125057 -2104648 -2071613 -1951875
19438a951875R720m6085M6729R5659L345J4266k139R9177M6112j19068l375l9494
$$ -1951875 -1942155 -1988240 -1941511 -1845852 -1842507 -1828241 -1830380 -1731203 -1685091 -1804159 -1807534 -1847028
19426a847028L0925K9595P630m21J0682K03161N5932O980k3574J7942P4580l645
$$ -1847028 -1816103 -1786508 -1778878 -1779299 -1768617 -1565456 -1509524 -1502544 -1526118 -1508176 -1433596 -1437241
19414a437241m1387J27066K6860R8320K9120n8661p2248N034Q223o2103q52N4622
$$ -1437241 -1478628 -1351562 -1324702 -1226382 -1197262 -1255923 -1328171 -1323137 -1314914 -1377017 -1377869 -1323247
19402a323247J09600R0151r368O1511O2077o3112N0662M6464J577R977M9267k3208
$$ -1323247 -1213647 -1123496 -1132864 -1071353 -1009276 -1072388 -1021726 -975262 -973685 -963708 -914441 -937649
19390i37649l0485M1990L5912p847K689R16J10799J69748r1485l3896J12398j39709
$$ -937649 -968134 -926144 -890232 -898079 -895390 -894474 -783675 -613927 -705412 -739308 -626910 -766619
19378g66619o3332l8901k8210Q2967M3568K1965K3776r6424j15434k9889m8596
$$ -766619 -829951 -868852 -897062 -814095 -770527 -748562 -724786 -821210 -936644 -966533 -1015129
19367a015129J21308R7981m8382j53542J2182K00214J33350N7580q5637j39229
$$ -1015129 -893821 -795840 -844222 -997764 -985582 -785368 -652018 -594438 -680075 -819304
19357h19304j2906P9925J13862P3511l2231J1342o663J0114O8372j7692j5k889
$$ -819304 -832210 -752285 -638423 -564912 -597143 -585801 -592464 -582350 -513978 -531670 -531685 -534574
19345e34574L0677n4164p4220k6254J69423J49621N2583j38847j59564q8772L6659
$$ -534574 -503897 -558061 -632281 -658535 -489112 -339491 -286908 -425755 -585319 -674091 -637432
19334f37432N5522O8544r603K199J24687M2190j59188j03624k7109k415J79699
$$ -637432 -581910 -513366 -522969 -520770 -396083 -353893 -513081 -616705 -643814 -646229 -466530
19323d66530Q5061m9841p4102n5543J2945N1075J29942N2934N932m9107k9790
$$ -466530 -381469 -431310 -505412 -560955 -548010 -496935 -366993 -314059 -308127 -357234 -387024
19312c87024j0163J24734j6136j4400P6838L7220k1330N4109J7627j8568O7307
$$ -387024 -397187 -272453 -288589 -302989 -226151 -188931 -210261 -156152 -138525 -157093 -89786
19301h9786O8965r8415o3159P2733J0600L5545P552O2946l4576j6877P787J2203
$$ -89786 -20821 -119236 -182395 -109662 -99062 -63517 -55965 6981 -27595 -44472 -36685 -24482
19289b4482K2327l6526n1291Q5064L4213O4846j51N0272q1858j21374q6980n2909
$$ -24482 -2155 -38681 -89972 -4908 29305 94151 94000 144272 62414 -58960 -145940 -198849
19277a98849J83894Q5870K6955o0162q4546L7795M1o0878O3209P6333R7100o5437
$$ -198849 -14955 70915 97870 37708 -46838 -9043 -9002 -69880 -6671 69662 166762 101325
19265A01325n2451k62017n8321J58656R4245J39328K8921j31130m0115J40022
$$ 101325 48874 -213143 -271464 -112808 -18563 120765 149686 18556 -21559 118463
19255A18463R822L9358O0295j0474J33687K7680J696l8406q4043J0212K777n7503
$$ 118463 128285 167643 227938 217464 351151 378831 380527 342121 258078 268290 271067 213564
19243B13564Q6063J05653l9457j43982K402P5205P6966K1547n9497j350K06298
$$ 213564 299627 405280 365823 221841 224243 299448 376414 397961 338464 337114 543412
19232E43412L5971m0464J3837k978r6668J31008J82991k75345k34941J14019J47258
$$ 543412 579383 538919 552756 549778 453110 584118 767109 491764 256823 370842 518100
19221E18100J9748o5330m8881l7344N2140O3368j366J17990J0013o9722M3505
$$ 518100 537848 472518 423637 386293 438433 501801 500435 618425 628438 558716 602221
19210F02221J9484l9412j06982j2738k6731Q7221Q3588K4390J14268J06333k1736
$$ 602221 621705 582293 475311 462573 435842 523063 606651 631041 745309 851642 829906
19199H29906m1558M9143m5030j27138q3305O7673K7705k2202m0017m8616O7635
$$ 829906 788348 837491 792461 665323 582018 649691 677396 655194 615177 566561 634196
19188F34196J20236r1675j36217L6456K3327l148R449J30610J50937J7031n1735
$$ 634196 754432 662757 526540 562996 586323 583175 592624 723234 874171 891202 839467
19177H39467j4518r2913k5555K1468L2460L9851J2440j13344r6130l4282J20608
$$ 839467 824949 732036 706481 727949 760409 800260 812700 699356 603226 568944 689552
19166F89552K4420M9016j0283R0691m3777p6469R1018J54894O0205j5325o7065
$$ 689552 713972 762988 752705 843396 799619 723150 814168 969062 1029267 1013942 946877
19155I46877k2383K6655N4761K4441J7198n4393K9877J14129P6913o2525l8899
$$ 946877 924494 951149 1005910 1030351 1047549 993156 1023033 1137162 1214075 1151550 1112651
19144A112651l595r2417n281j72268R088J36661j3972R3214N9371J4819n8253
$$ 1112651 1109056 1016639 1011358 839090 848178 984839 970867 1064081 1123452 1138271 1080018
19133A080018r9065J43110P7579k0310N0255R8549m0115j34338o3558J1530M3369
$$ 1080018 980953 1124063 1201642 1181332 1231587 1330136 1290021 1155683 1092125 1103655 1147024
19122A147024K4069Q4832J5405k112n6240K2540M5765O692m0281p0928L3467N3981
$$ 1147024 1171093 1255925 1271330 1269218 1212978 1235518 1281283 1287975 1247694 1176766 1210233 1264214
19110A264214m161P9283m8075J14793n2822k1433K5111J19189N1533J6202J8758
$$ 1264214 1260053 1339336 1291261 1406054 1353232 1331799 1356910 1476099 1527632 1543834 1562592
19099A562592o4879n9661P6707K0259P1119j07823m6206J60249K03869m7390j33766
$$ 1562592 1497713 1438052 1514759 1535018 1606137 1498314 1452108 1612357 1816226 1768836 1635070
19088A635070k5998K3574m0914J3982j02099R417J12314l6031m7287l4741l5101
$$ 1635070 1609072 1632646 1591732 1605714 1503615 1513032 1625346 1589315 1542028 1507287 1472186
19077A472186K5488M0873K838J18859R5450R0973P3602M6657k1881r4571j48190
$$ 1472186 1497674 1538547 1541385 1660244 1755694 1846667 1920269 1966926 1945045 1850474 1702284
19066A702284m153P1262n8143l2266l3848M0194J21346l8906j11989K1769R6241
$$ 1702284 1698131 1769393 1711250 1678984 1645136 1685330 1806676 1767770 1655781 1677550 1773791
19055A773791J50886L0251m6063L9912l1296M9943L4305k4789p8590P48M1456
$$ 1773791 1924677 1954928 1908865 1948777 1917481 1967424 2001729 1976940 1898350 1899098 1940554
19044A940554n2313j63694n3272n409J00186L2083N0956l77j03393q0491j8711
$$ 1940554 1888241 1724547 1671275 1665866 1766052 1798135 1849091 1848714 1745321 1664830 1646119
19033A646119J13502J27853L7330J8304j1607n666J7358N6025o0136O6666N7645
$$ 1646119 1759621 1887474 1924804 1943108 1931501 1925835 1943193 1999218 1939082 2005748 2063393
19022B063393P8199n3636m2734R9395K0012k8837n1844p2712K302J8328j9706
$$ 2063393 2141592 2087956 2045222 2144617 2164629 2135792 2083948 2011236 2013538 2031866 2012160
19011B012160j0527J3517J05063O2787K5180P1583k0456j41J29292j2964m0650
$$ 2012160 2001633 2015150 2120213 2183000 2208180 2279763 2259307 2259166 2388458 2375494 2334844
19000B334844j22134Q7258J35879P9311M589Q279J46452n5391n6494m1276j6486
$$ 2334844 2212710 2299968 2435847 2515158 2519747 2528026 2674478 2619087 2562593 2521317 2504831
18989B504831m578O1440l6780l1691J26925P6709J55304j1088k0372j0611P922
$$ 2504831 2500253 2561693 2524913 2493222 2620147 2696856 2852160 2841072 2820700 2810089 2818011
18978B818011Q0714O4839K0195J04585J9577k0990j2784J24144N8506l1428M0698
$$ 2818011 2898725 2963564 2983759 3088344 3107921 3086931 3074147 3198291 3256797 3225369 3266067
18967C266067l4075n9823J61615J43478J39743P6329L3208n430q0797j50733k44372
$$ 3266067 3231992 3172169 3333784 3477262 3617005 3693334 3726542 3721112 3640315 3489582 3245210
18956C245210n0229R1666R6767R1656l5990k61999k85160k09404j64566N7837
$$ 3245210 3194981 3286647 3383414 3475070 3439080 3177081 2891921 2682517 2517951 2575788
18946B575788J19783M7329M2658J30347O0607J4859R9097J05581Q2963J30784
$$ 2575788 2695571 2742900 2785558 2915905 2976512 2991371 3090468 3196049 3279012 3409796
18936C409796Q9352R5483J17235J26587l0710K2381J53444R0250l3771j64085
$$ 3409796 3499148 3594631 3711866 3838453 3807743 3830124 3983568 4073818 4040047 3875962
18926C875962k60363j43268r6095J21404P6790k2280j72377m17161j98132J301
$$ 3875962 3615599 3472331 3376236 3497640 3574430 3552150 3379773 2962612 2764480 2765781
18916B765781L7055J32530L7843O6592N9690K0530J04984K68480J80862m4702
$$ 2765781 2802836 2935366 2973209 3039801 3099491 3120021 3225005 3493485 3674347 3629645
18906C629645J10610P1370R8R7656O8729J72481R5066J06121r6522j70239J06877
$$ 3629645 3740255 3811625 3811723 3909379 3978108 4150589 4245655 4351776 4255254 4085015 4191892
18895D191892K1777j4760O1158J86786P1535K8516M8521p1939o7857R1526K75384
$$ 4191892 4213669 4198909 4260067 4446853 4518388 4546904 4595425 4523486 4455629 4547155 4822539
18884D822539K40228l0593n5022R817J58686P5024O7499O9911P996k0360O99j5513
$$ 4822539 5062767 5032174 4977152 4986969 5145655 5220679 5288178 5358089 5366085 5345725 5346424 5330911
18872E330911r6833P8083L3785O3435O3230M5789P227m5649P922R3415J24912
$$ 5330911 5234078 5312161 5345946 5409381 5472611 5518400 5525627 5479978 5487900 5581315 5706227
18861E706227J98899J36211M0837P1662K25247J48081M0794J34458L0933Q7567
$$ 5706227 5905126 6041337 6082174 6153836 6379083 6527164 6567958 6702416 6733349 6820916
18851F820916J65766J04922J08903P9660J5769J94175K42682J99266L9737r255
$$ 6820916 6986682 7091604 7200507 7280167 7295936 7490111 7732793 7932059 7971796 7962541
18841G962541J32461J16145J43292Q5572J85915J92122J69823L6548J48521K27055
$$ 7962541 8095002 8211147 8354439 8440011 8625926 8818048 8987871 9024419 9172940 9399995
18831I399995K72222J59087M6508J86252L26867K20577J82457K92068K72702K74931
$$ 9399995 9672217 9831304 9877812 10064064 10390931 10611508 10793965 11086033 11358735 11633666
18821A1633666L58712M21331M66573M81604N10598K96187M51726N44711N02460
$$ 11633666 11992378 12413709 12880282 13361886 13872484 14168671 14620397 15165108 15667568
18812A5667568N87429P01901P87300Q90607J024971J054755J059775J302125J709058
$$ 15667568 16254997 16956898 17744198 18634805 19659776 20714531 21774306 23076431 24785489
18803B4785489K081051K421451L076047L804529M692316M563003J160215q246579
$$ 24785489 26866540 29287991 32364038 36168567 40860883 45423886 46584101 38337522
18795C8337522j9795314j8589250k977946O120086P765430O770493K021820q532466
$$ 38337522 18542208 -47042 -3024988 3095098 10860528 17631021 19652841 11120375
18787A1120375k0221549j7930315k177783N041678N134508M230293L381263K903064
$$ 11120375 -9101174 -27031489 -29209272 -24167594 -19033086 -14802793 -11421530 -8518466
18779h518466K709193K575528K377388K095021J890828J956016K173675K574289
$$ -8518466 -5809273 -3233745 -856357 1238664 3129492 5085508 7259183 9833472
18771I833472L261980L565171M045288M704819N287212L890546k690817j5311053
$$ 9833472 13095452 16660623 20705911 25410730 30697942 34588488 31897671 16586618
18763A6586618k4000024j3702385K811295Q265062Q316569N569915k167145j5387563
$$ 16586618 -7413406 -21115791 -18304496 -10039434 -1722865 3847050 1679905 -13707658
18755a3707658k3414254j2565932K206689N622031M924902L854380L049509K420909
$$ -13707658 -37121912 -49687844 -47481155 -41859124 -36934222 -33079842 -30030333 -27609424
18747b7609424K244772J987297J653313J174687R90445R01630P80711R73973R18530
$$ -27609424 -25364652 -23377355 -21724042 -20549355 -19558910 -18657280 -17876569 -16902596 -15984066
18738a5984066P75869O63556M11990L40335L61312M42360N24733M94848M17993
$$ -15984066 -15208197 -14544641 -14132651 -13792316 -13431004 -12988644 -12463911 -11969063 -11551070
18729a1551070L14620L77866J81678J21057J66550K98014M02305L60826J66820
$$ -11551070 -11236450 -10858584 -10676906 -10555849 -10389299 -10091285 -9688980 -9328154 -9161334
18720i161334K51227K52872K86929K27637P1655N8708J02801J23477J72412J85961
$$ -9161334 -8910107 -8657235 -8370306 -8142669 -8071014 -8012306 -7909505 -7786028 -7613616 -7427655
18710g427655J54734J55556J97076K61378J97465J52317J85092J35305J30532
$$ -7427655 -7272921 -7117365 -6920289 -6658911 -6461446 -6309129 -6124037 -5988732 -5858200
18701e858200J51518J26011J20537j500k6225k7319k0866K24765J61435P5915
$$ -5858200 -5706682 -5580671 -5460134 -5461634 -5487859 -5515178 -5536044 -5311279 -5149844 -5073929
18691e073929Q963N9451K68679Q0280n81Q3109P2993L0244J7405J04594R254L4956
$$ -5073929 -5064966 -5005515 -4736836 -4656556 -4657137 -4574028 -4501035 -4470791 -4453386 -4348792 -4339538 -4304582
18679d304582J36535J05321J90861O3676M9576p5899j26888o5357k4253J62011
$$ -4304582 -4168047 -4062726 -3871865 -3808189 -3758613 -3834512 -3961400 -4026757 -4051010 -3888999
18669c888999J35855P8600Q3868J50253Q1742J15735l5864j48349K4759P9986
$$ -3888999 -3753144 -3674544 -3590676 -3440423 -3358681 -3242946 -3278810 -3427159 -3402400 -3322414
18659c322414J55768K22275P0295O4672j4098n9678q6836l1261M1062P2778N4314
$$ -3322414 -3166646 -2944371 -2874076 -2809404 -2823502 -2883180 -2970016 -3001277 -2960215 -2887437 -2833123
18648b833123M1624j5313K1271L5702L7274J47221J11361j3398O338J73246l133
$$ -2833123 -2791499 -2806812 -2785541 -2749839 -2712565 -2565344 -2453983 -2467381 -2461043 -2287797 -2290930
18637b290930k9730o6479Q352J41273M5075K5277Q6494O5621j00667R6908Q9065
$$ -2290930 -2320660 -2387139 -2378787 -2237514 -2192439 -2167162 -2080668 -2015047 -2115714 -2018806 -1929741
18626a929741l0691J3306Q5316L9830j3889j40772P0033n5748J00575J51760J50356
$$ -1929741 -1960432 -1947126 -1861810 -1821980 -1835869 -1976641 -1906608 -1962356 -1861781 -1710021 -1559665
18615a559665r2286k8122k0997k9620m3170Q4038K8089J74968R3145j6893M8458
$$ -1559665 -1651951 -1680073 -1701070 -1730690 -1773860 -1689822 -1661733 -1486765 -1393620 -1410513 -1362055
18604a362055Q9280K4105R741M243n4432j21960L7272J42878O2691P7987K6594
$$ -1362055 -1272775 -1248670 -1238929 -1234686 -1289118 -1411078 -1373806 -1230928 -1168237 -1090250 -1063656
18593a063656j2384r5007j59333j91445p3551Q9112J35288O4379k9602J22895
$$ -1063656 -1076040 -1171047 -1330380 -1521825 -1595376 -1506264 -1370976 -1306597 -1336199 -1213304
18583a213304j3307l0646r351j03604K9135M3387k7827j4231K7583J39472Q6569
$$ -1213304 -1226611 -1257257 -1266608 -1370212 -1341077 -1297690 -1325517 -1339748 -1312165 -1172693 -1086124
18572a086124P7775L0880J1767k1215J04l6551q3697n51J94681K21907k2318J3822
$$ -1086124 -1008349 -977469 -965702 -986917 -986813 -1023364 -1107061 -1107612 -912931 -691024 -713342 -699520
18560f99520j1388p8425o0270l0844p405L2813Q6265O0121Q7577P581o7105n9511
$$ -699520 -710908 -789333 -849603 -880447 -887852 -855039 -768774 -708653 -621076 -613495 -680600 -740111
18548g40111J83212Q0460k3234j45087l4640P0057q0331k0935J6509m8933K6626
$$ -740111 -556899 -476439 -499673 -644760 -679400 -609343 -689674 -710609 -694100 -743033 -716407
18537g16407J32480P0572M602o9340N892N3324j02376R6396J61722J8191j25299
$$ -716407 -583927 -513355 -508753 -578093 -572201 -518877 -621253 -524857 -363135 -344944 -470243
18526d70243P3858J66341J26669j06373O812r0634r0465J6286J62347O9283Q2654
$$ -470243 -396385 -230044 -103375 -209748 -202936 -293570 -384035 -367749 -205402 -136119 -53465
18515e3465m8071k4941P9586L3614j9308R992M0327K2655j16545j32183R5749
$$ -53465 -101536 -126477 -46891 -13277 -32585 -22593 17734 40389 -76156 -208339 -112590
18504a12590J45052J26652m8360n8730R783J18267Q9879L6430o9349o795N9382
$$ -112590 32462 159114 110754 52024 61807 180074 269953 306383 237034 230239 289621
18493B89621J51564J42777l6900j67942j38834j42165o9167L3637J80335J6920
$$ 289621 441185 583962 547062 379120 240286 98121 28954 62591 242926 259846
18483B59846P5129P4237q3788J00676n339j6566P9898L839L793O1095O455l0921
$$ 259846 334975 409212 325424 426100 420761 404195 484093 487932 491725 552820 559275 528354
18471E28354j6482j2983O4136j4L2629J41783j17876k4582M2245O7837N4798J28013
$$ 528354 511872 498889 563025 563011 595640 737423 619547 594965 637210 705047 759845 887858
18459H87858q4588p8505j49926o2841N6442J86661L5792j14973O3835j0705O4152
$$ 887858 803270 724765 574839 511998 568440 755101 790893 675920 739755 729050 793202
18448G93202o0766O9185Q2514M5316j3842p7941J1712q0164l3414O1914R2428
$$ 793202 732436 801621 884135 929451 915609 837668 849380 769216 735802 797716 890144
18437H90144N543j20106J27272J1633l2794r234J12485M1361M1952R0406Q1801
$$ 890144 895687 775581 902853 914486 881692 872458 984943 1026304 1068256 1158662 1240463
18426A240463M5298n8414P1455Q3311m7991r1145k2613K6727j322j08234m4508
$$ 1240463 1285761 1227347 1298802 1382113 1334122 1242977 1220364 1247091 1245769 1137535 1093027
18415A093027J85178l4587L5973n0849P6284p8552k3122J9992J01603J34950Q9427
$$ 1093027 1278205 1243618 1279591 1228742 1305026 1226474 1203352 1223344 1324947 1459897 1549324
18404A549324k0072p8792p1342j06447J46047J20243n0524q6180j5514J62226
$$ 1549324 1529252 1450460 1379118 1272671 1418718 1538961 1488437 1402257 1386743 1548969
18394A548969J02648j09474j01535O8211J24967l5420N0376P6878J8819j3061
$$ 1548969 1651617 1542143 1440608 1508819 1633786 1598366 1648742 1725620 1744439 1731378
18384A731378L2489r6371j7998J10061m9128K413j041m8707M4703J12844J00044
$$ 1731378 1763867 1667496 1649498 1759559 1710431 1712844 1711803 1663096 1707799 1820643 1920687
18373A920687J45810Q1271j13358k6130J43937Q0325K5792k3900j26865K7913
$$ 1920687 2066497 2147768 2034410 2008280 2152217 2232542 2258334 2234434 2107569 2135482
18363B135482J1772L3288P517q9702j55935n1454P9291O791K03005J36098J8593
$$ 2135482 2147254 2180542 2188059 2098357 1942422 1890968 1970259 1977050 2180055 2316153 2334746
18352B334746j01202O9060K3113j55785J05382J07446m3721k5477N5147K6904
$$ 2334746 2233544 2302604 2325717 2169932 2275314 2382760 2339039 2313562 2368709 2395613
18342B395613k441m4572k4476L5593R2124k028r0157k9614k1187j4744j8577R9120
$$ 2395613 2393172 2348600 2324124 2359717 2451841 2449813 2359656 2330042 2308855 2294111 2275534 2374654
18330B374654J07431J07248N6955Q4587l0710n2501O9231M7781J10445J46105
$$ 2374654 2482085 2589333 2646288 2730875 2700165 2647664 2716895 2764676 2875121 3021226
18320C021226o281K2478O3759j611o792M9274n3976P2070k1976r7003m5975m5192
$$ 3021226 3014945 3037423 3101182 3099571 3092779 3142053 3088077 3160147 3138171 3041168 2995193 2950001
18308B950001K9435J05508Q3461N8634J50758J44105p2539n7204N422K1290l8951
$$ 2950001 2979436 3084944 3168405 3227039 3377797 3521902 3449363 3392159 3397581 3418871 3379920
18297C379920P8771Q5267N3879L4680q5858j1573Q4110J80343q629n6605j72m3885
$$ 3379920 3458691 3543958 3597837 3632517 3546659 3535086 3619196 3799539 3790910 3734305 3734133 3690248
18285C690248n6365K7589J10041O1959N2153J6308K8727r1253L082J82748J89927
$$ 3690248 3633883 3661472 3771513 3833472 3885625 3901933 3930660 3839407 3842489 4025237 4215164
18274D215164J03544j1410p0741O686l0734P5505M1527l2100M2383J40802N3915
$$ 4215164 4318708 4307298 4236557 4243243 4212509 4288014 4329541 4297441 4339824 4480626 4534541
18263D534541J60655k0954j00849J7780j2659O2612M0685Q9824J88680J15503
$$ 4534541 4695196 4674242 4573393 4591173 4578514 4641126 4681811 4771635 4960315 5075818
18253E075818j24850Q3460O5391L6264M2053Q8856J643m4169n0117N4018J21374
$$ 5075818 4950968 5034428 5099819 5136083 5178136 5266992 5268635 5224466 5174349 5228367 5349741
18242E349741J3081N1416K38498K28752J306j26989k03009k10989m6536P8925
$$ 5349741 5362822 5414238 5652736 5881488 5882794 5755805 5552796 5341807 5295271 5374196
18232E374196K29760K28583J06241J29806j6218p9816p241K00874K80839R9004
$$ 5374196 5603956 5832539 5938780 6068586 6052368 5972552 5965311 6166185 6447024 6546028
18222F546028r739M1581J05870O3455L8603J40155K70489R9267R9740K3286J0722
$$ 6546028 6536289 6577870 6683740 6747195 6785798 6925953 7196442 7295709 7395449 7418735 7429457
18211G429457l9242J92707K38039R5195P1252N8436J7882J90263K29978K15003
$$ 7429457 7390215 7582922 7820961 7916156 7987408 8045844 8063726 8253989 8483967 8698970
18201H698970J71239M4734j89760l13704k45883q0307O8054N8854J40203J93370
$$ 8698970 8870209 8914943 8725183 8411479 8165596 8085289 8153343 8212197 8352400 8545770
18191H545770R9282J89826K30722K30917J86575J17985J21343J24267K14464L23445
$$ 8545770 8645052 8834878 9065600 9296517 9483092 9601077 9722420 9846687 10061151 10384596
18181A0384596K55046J33347K08035L51188J66264J69051p7716m33897j81079
$$ 10384596 10639642 10772989 10981024 11332212 11498476 11667527 11589811 11155914 10974835
18172A0974835J66808K95343K99442J49240R0465n6540n3577M8841J08341J11389
$$ 10974835 11141643 11436986 11736428 11885668 11976133 11919593 11866016 11914857 12023198 12134587
18162A2134587K38621M62535M42390L59757L30908L75642K96551K53618J97853
$$ 12134587 12373208 12835743 13278133 13637890 13968798 14344440 14640991 14894609 15092462
18153A5092462K97226L67063K84781L20144K92016M19600M64621M72397M63259
$$ 15092462 15389688 15756751 16041532 16361676 16653692 17073292 17537913 18010310 18473569
18144A8473569M99425L02623J96633L12433M69478N97827O56539Q06634Q13272
$$ 18473569 18972994 19275617 19472250 19784683 20254161 20851988 21508527 22315161 23128433
18135B3128433Q44879Q87261Q93656J105150R86651Q34894J068890J394036J472794
$$ 23128433 23973312 24860573 25754229 26859379 27846030 28680924 29749814 31143850 32616644
18126C2616644J467958J631367J911552K101766K435184K768761L198992L515271
$$ 32616644 34084602 35715969 37627521 39729287 42164471 44933232 48132224 51647495
18118E1647495M123178N192199O381067P979510J0118484J3068087J7109000K1519980
$$ 51647495 55770673 60962872 67343939 75323449 85441933 98510020 115619020 137139000
18110A37139000J9772172l131770o3004904j27254837r9973635o056311K4041511
$$ 137139000 156911172 153779402 90774498 -36480339 -136453974 -142510285 -118468774
18103a18468774K1618345J6580700J2784856R990001P930414O750260N634131
$$ -118468774 -96850429 -80269729 -67484873 -57494872 -49564458 -42814198 -37180067
18096c7180067M793429M414365L963421L604133L546447L493244L587926L866102
$$ -37180067 -32386638 -27972273 -24008852 -20404719 -16858272 -13365028 -9777102 -5911000
18088e911000L813408M166842M913914N836308N161926j17694j2402771k4837794
$$ -5911000 -2097592 2069250 6983164 12819472 17981398 17863704 5460933 -19376861
18080a9376861j9711358j838992M999623N246185M624766L832841L178475K943807
$$ -19376861 -39088219 -40927211 -35927588 -30681403 -26056637 -22223796 -19045321 -16101514
18072a6101514K658523K349673K176910K318080K389767K356978K684403L019315
$$ -16101514 -13442991 -11093318 -8916408 -6598328 -4208561 -1851583 832820 3852135
18064C852135L343789L873409M812357N492742N235437J153423r596157k1844467
$$ 3852135 7195924 11069333 15881690 21374432 26609869 27763292 18167135 -3677332
18056c677332j9061470j464260P586225Q534296N870678k124899j5566689k2042272
$$ -3677332 -22738802 -24203062 -16616837 -8082541 -2211863 -4336762 -19903451 -41945723
18048d1945723r822139L091020N475055M929122M143796L484908K859960K466356
$$ -41945723 -51767862 -48676842 -43201787 -38272665 -34128869 -30643961 -27784001 -25317645
18040b5317645K291654K069613J882479J907228J961868K105875K387661K507199
$$ -25317645 -23025991 -20956378 -19073899 -17166671 -15204803 -13098928 -10711267 -8204068
18032h204068K737172L100920L973218M331925K945699l296589j5589237k3870673
$$ -8204068 -5466896 -2365976 1607242 5939167 8884866 5588277 -10000960 -33871633
18024c3871633j3587504J042247M546969M121216L198542K520971K029864J783445
$$ -33871633 -47459137 -46416890 -41869921 -37748705 -34550163 -32029192 -29999328 -28215883
18016b8215883J607433J339597J021835J025402R10205Q10660P20959N63016N82331
$$ -28215883 -26608450 -25268853 -24247018 -23221616 -22311411 -21500751 -20779792 -20216776 -19634445
18007a9634445N42669L90082L45548M19491N10275N00025L68729J14032K76884
$$ -19634445 -19091776 -18701694 -18356146 -17936655 -17426380 -16926355 -16557626 -16443594 -16166710
17998a6166710L59815J77112O6867J39183K55924K57500J96023R0656M70382K47359
$$ -16166710 -15806895 -15629783 -15562916 -15423733 -15167809 -14910309 -14714286 -14623630 -14153248 -13905889
17988a3905889R4774J28778J28668O0504K16837J68391J68279R8243J32388J52423
$$ -13905889 -13811115 -13682337 -13553669 -13493165 -13276328 -13107937 -12939658 -12841415 -12709027 -12556604
17978a2556604J35833J93113J21467P8603J57454J54518N8308J37982J75547K10468
$$ -12556604 -12420771 -12227658 -12106191 -12027588 -11870134 -11715616 -11657308 -11519326 -11343779 -11133311
17968a1133311J18958O0661J8117K44807J52893J3192K01693M7616Q5590J81870
$$ -11133311 -11014353 -10953692 -10935575 -10690768 -10537875 -10524683 -10322990 -10275374 -10189784 -10007914
17958a0007914J05078Q6842Q991L7003L017Q1817K06294K05022J15151M3827p6003
$$ -10007914 -9902836 -9815994 -9807003 -9770000 -9766983 -9685166 -9478872 -9273850 -9158699 -9114872 -9190875
17947i190875K6492N5930L7486P0234J62846J02695J04049J40047M7774l7223
$$ -9190875 -9164383 -9108453 -9070967 -9000733 -8837887 -8735192 -8631143 -8491096 -8443322 -8480545
17937h480545O6591R4989q2877O1j9786j24058k7269K4651J73647L6436j5176
$$ -8480545 -8413954 -8318965 -8401842 -8401781 -8421567 -8545625 -8572894 -8548243 -8374596 -8338160 -8353336
17926h353336J46788J65683J40682Q4998m3685J00531Q9303K6586P076J2076K7416
$$ -8353336 -8206548 -8040865 -7900183 -7815185 -7858870 -7758339 -7669036 -7642450 -7635374 -7623298 -7595882
17915g595882J56733j1085J1685j0235N1721J15615K1594j28679r3224J41174
$$ -7595882 -7439149 -7450234 -7438549 -7448784 -7397063 -7281448 -7259854 -7388533 -7481757 -7340583
17905g340583K10916J480J30866J83700P0597J9512M3230K1440p2564J5354J19917
$$ -7340583 -7129667 -7128187 -6997321 -6813621 -6743024 -6723512 -6680282 -6658842 -6731406 -6716052 -6596135
17894f596135o4386j7911J08020K67830m6336q1496n4309o6672k3119M5160N6860
$$ -6596135 -6660521 -6678432 -6570412 -6302582 -6348918 -6430414 -6484723 -6551395 -6574514 -6529354 -6472494
17883f472494J8319P6795M3154J09890o9774n867n2752M3404J21106j6991J2419
$$ -6472494 -6454175 -6377380 -6334226 -6224336 -6294110 -6299977 -6352729 -6309325 -6188219 -6205210 -6192791
17872f192791J19363k2844L3946K7281K4359N599P5660J22969j6603j9873P506
$$ -6192791 -6073428 -6096272 -6062326 -6035045 -6010686 -6005087 -5929427 -5806458 -5823061 -5842934 -5835428
17861e835428N8866o595j18957p0951M907Q0720P9090Q7196J00620L9362p0043
$$ -5835428 -5776562 -5783157 -5902114 -5973065 -5968158 -5887438 -5808348 -5721152 -5620532 -5581170 -5651213
17850e651213M5354k259n4381L8343K86875K6220j42920k0420J6699J32609J71281
$$ -5651213 -5605859 -5608118 -5662499 -5624156 -5337281 -5311061 -5453981 -5474401 -5457702 -5325093 -5153812
17839e153812J3248Q1891N1074L0713n6070m3580n0933L4462R7453L2368m853
$$ -5153812 -5140564 -5058673 -5007599 -4976886 -5032956 -5076536 -5127469 -5093007 -4995554 -4963186 -4968039
17828d968039l3072M9687J18112J08324O0039o5684J7415j08133J4249k9588O5484
$$ -4968039 -5001111 -4951424 -4833312 -4724988 -4664949 -4730633 -4713218 -4821351 -4807102 -4836690 -4771206
17817d771206R8705J9990j08155o9186j2163L5751j30258j1355O4353Q6600N4199
$$ -4771206 -4672501 -4652511 -4760666 -4829852 -4842015 -4806264 -4936522 -4947877 -4883524 -4796924 -4742725
17806d742725o0417k5302M0860M8088Q9667J02923R1209o8472n9166k7307N3438
$$ -4742725 -4803142 -4828444 -4787584 -4739496 -4649829 -4546906 -4455697 -4524169 -4583335 -4610642 -4557204
17795d557204n8142p058O7139N2861K5896K3773n2962O7162J34157o0996p8426
$$ -4557204 -4615346 -4622404 -4555265 -4502404 -4476508 -4452735 -4505697 -4438535 -4304378 -4365374 -4443800
17784d443800M9400Q282P0187Q4226L6970j36776q5887P2063L0709l5471M0807
$$ -4443800 -4394400 -4386118 -4315931 -4231705 -4194735 -4331511 -4417398 -4345335 -4314626 -4350097 -4309290
17773d309290o4881o5512M4631P0169J86836L0136q5495J6048Q15j14540Q5542
$$ -4309290 -4374171 -4439683 -4395052 -4324883 -4138047 -4107911 -4193406 -4177358 -4176543 -4291083 -4205541
17762d205541J45657r013K6335q792P8615M1725r2909l1518J10315L6163p1022
$$ -4205541 -4059884 -4068897 -4042562 -4051354 -3972739 -3931014 -4023923 -4055441 -3945126 -3908963 -3979985
17751c979985j47200K173N0173J3413m0756o1552j2961O9588J80146Q7862O5614
$$ -3979985 -4127185 -4125012 -4074839 -4061426 -4102182 -4163734 -4176695 -4107107 -3926961 -3839099 -3773485
17740c773485k0476m2752l0198O6410J34235N5338r2314k7276L4377k0616p5531
$$ -3773485 -3793961 -3836713 -3866911 -3800501 -3666266 -3610928 -3703242 -3730518 -3696141 -3716757 -3792288
17729c792288o8978L789O6225j24382n0441J15183q929q946L2429Q0693J07355
$$ -3792288 -3861266 -3857477 -3791252 -3915634 -3966075 -3850892 -3859821 -3868767 -3836338 -3755645 -3648290
17718c648290R26M715Q7903p7222q9300K6237q271M6995M1399Q1803p1737l292
$$ -3648290 -3647364 -3642649 -3554746 -3631968 -3721268 -3695031 -3703302 -3656307 -3614908 -3533105 -3604842 -3608134
17706c608134m6180M160J20402N465N1182J6969l5904m4317O2393J27208m059
$$ -3608134 -3654314 -3650154 -3529752 -3524287 -3473105 -3456136 -3492040 -3536357 -3473964 -3346756 -3350815
17695c350815o9662L2302J04013j4610j11466m4568M0032R7921p1921L296J1020
$$ -3350815 -3420477 -3388175 -3284162 -3298772 -3410238 -3454806 -3414774 -3316853 -3388774 -3385478 -3374458
17684c374458n1232K8481l3123p024M0443J06690l9160n48J19790J420j14235
$$ -3374458 -3425690 -3397209 -3430332 -3437356 -3396913 -3290223 -3329383 -3329931 -3210141 -3208721 -3322956
17673c322956J10897J35372j4286j28152k30245L9828J02528Q1318n3491O032
$$ -3322956 -3212059 -3076687 -3090973 -3219125 -3449370 -3409542 -3307014 -3225696 -3279187 -3273155
17663c273155P5308o6570j0664j4043L2248J10779l060K0268m553M0175M8047
$$ -3273155 -3197847 -3264417 -3275081 -3289124 -3256876 -3146097 -3149157 -3128889 -3133442 -3093267 -3045220
17652c045220q3510J9434N517k5363m8204j41345Q9976R1014Q3919R0617n287
$$ -3045220 -3128730 -3109296 -3103779 -3129142 -3177346 -3318691 -3228715 -3137701 -3053782 -2963165 -2968452
17641b968452j70534j12389m1213j2176P0855N1508Q9350J8105j2702o1910j7364
$$ -2968452 -3138986 -3251375 -3292588 -3304764 -3233909 -3182401 -3093051 -3074946 -3087648 -3149558 -3166922
17630c166922P2712N7720R00J10542n6680j1534K6648J2902L050P7553l5830K1604
$$ -3166922 -3094210 -3036490 -3035590 -2925048 -2981728 -2993262 -2966614 -2953712 -2950662 -2873109 -2908939 -2887335
17618b887335J56099K1466r3675j05896j17818k1988j3676M996Q0966J96062o2403
$$ -2887335 -2731236 -2709770 -2803445 -2909341 -3027159 -3049147 -3062823 -3057827 -2976861 -2780799 -2843202
17607b843202p2744l6400L495j5636Q0347j9907J25823j6290j15377L1130J1715
$$ -2843202 -2915946 -2952346 -2948851 -2964487 -2884140 -2904047 -2778224 -2794514 -2909891 -2878761 -2867046
17596b867046K1773m4459m7133J31752Q9728q1314o6408J9415K4514M5198k7202
$$ -2867046 -2845273 -2889732 -2936865 -2805113 -2715385 -2796699 -2863107 -2843692 -2819178 -2773980 -2801182
17585b801182n6050K5998J04053Q4777O4674q14j63204k3803J4358J6740k3074
$$ -2801182 -2857232 -2831234 -2727181 -2642404 -2577730 -2578544 -2741748 -2765551 -2751193 -2734453 -2757527
17574b757527P073j8642q905o5641m403J62471r068r3557n9733J37330O9459L6889
$$ -2757527 -2750454 -2769096 -2778001 -2843642 -2848045 -2685574 -2694642 -2788199 -2847932 -2710602 -2641143 -2604254
17562b604254K4003L61o7051J53889J6008n2816j4835J02593K4200L3931l0787
$$ -2604254 -2580251 -2579890 -2646941 -2493052 -2477044 -2529860 -2544695 -2442102 -2417902 -2383971 -2414758
17551b414758n9800l7528J64043l716p4538K2440j3382L2077J81715J9763j99972
$$ -2414758 -2474558 -2512086 -2348043 -2351759 -2426297 -2403857 -2417239 -2385162 -2203447 -2183684 -2383656
17540b383656k17956r4866P2357N1173m2615n6035k4420J15849J35218j46597
$$ -2383656 -2601612 -2696478 -2624121 -2572948 -2615563 -2671598 -2696018 -2580169 -2444951 -2591548
17530b591548q2264n0132P5711Q6455J027k9131J7607J5542J04076K07635P7193
$$ -2591548 -2673812 -2723944 -2648233 -2561778 -2560751 -2589882 -2572275 -2556733 -2452657 -2245022 -2167829
17519b167829m237j8368r8535k21514q0768M0375K2517P2334P5022J7018j00010
$$ -2167829 -2172066 -2190434 -2288969 -2510483 -2591251 -2550876 -2528359 -2456025 -2381003 -2363985 -2463995
17508b463995q1340r0228R440o5073K2606K5103M7065M4529N38N2765k6826P6784
$$ -2463995 -2545335 -2635563 -2626123 -2691196 -2668590 -2643487 -2596422 -2551893 -2551355 -2498590 -2525416 -2448632
17496b448632n6173m3750P8800l1013N9296q0111r7524L3079J45043K2347n1529
$$ -2448632 -2504805 -2548555 -2469755 -2500768 -2441472 -2521583 -2619107 -2586028 -2440985 -2418638 -2470167
17485b470167q1058j3457o3054q3865R7832K02935R691K0732k0629j457M712l4654
$$ -2470167 -2551225 -2564682 -2627736 -2711601 -2613769 -2410834 -2401143 -2380411 -2401040 -2402497 -2397785 -2432439
17473b432439P0894p3194N606K676o0299n451J13392O9959M6378j14854p7795
$$ -2432439 -2361545 -2434739 -2429133 -2426457 -2486756 -2492207 -2378815 -2308856 -2262478 -2377332 -2455127
17462b455127Q124K4716Q5097J59600L0220j11909m8050K2865L9711J00786J30737
$$ -2455127 -2447003 -2422287 -2337190 -2177590 -2147370 -2259279 -2307329 -2284464 -2244753 -2143967 -2013230
17451b013230J10505N6578J9797l8057J1048O124Q5649R5300q9975j68956m93756
$$ -2013230 -1902725 -1846147 -1826350 -1864407 -1853359 -1847235 -1761586 -1666286 -1756261 -1925217 -2418973
17440b418973m72904j12021N7579J31505P0721Q6051M7100O7451Q0823J2257P2403
$$ -2418973 -2891877 -3003898 -2946319 -2814814 -2744093 -2658042 -2610942 -2543491 -2462668 -2450411 -2378008
17429b378008j7020o6142J08299k9009n4617O795p525o0409J01400q3657o8599
$$ -2378008 -2395028 -2461170 -2352871 -2381880 -2436497 -2429702 -2437227 -2497636 -2396236 -2479893 -2548492
17418b548492Q4879N0555J18611k2479O062K3749Q2686l3806j02437N6583k4172
$$ -2548492 -2463613 -2413058 -2294447 -2316926 -2310864 -2287115 -2204429 -2238235 -2340672 -2284089 -2308261
17407b308261p5600M0959N4964j17547K4594J6082O8661N6328r370p2965p1888
$$ -2308261 -2383861 -2342902 -2287938 -2405485 -2380891 -2364809 -2296148 -2239820 -2249190 -2322155 -2394043
17396b394043k2756K07139P4162M376j12546q0410p1328J15717N2023J3359M136
$$ -2394043 -2416799 -2209660 -2135498 -2131122 -2243668 -2324078 -2395406 -2279689 -2227666 -2214307 -2210171
17385b210171J5745J6493O9540j1972o1130L4540k1975j21274l4318J1063Q9520
$$ -2210171 -2194426 -2177933 -2108393 -2120365 -2181495 -2146955 -2168930 -2290204 -2324522 -2313459 -2223939
17374b223939j0447L3117L1776M4860J9864m4279n4176N624l1671r5014m0404
$$ -2223939 -2234386 -2201269 -2169493 -2124633 -2104769 -2149048 -2203224 -2197600 -2229271 -2324285 -2364689
17363b364689K6481k8835L9981O8321J84004N562K552J4657N1815L0121M0972
$$ -2364689 -2338208 -2367043 -2327062 -2258741 -2074737 -2069175 -2066623 -2051966 -2000151 -1970030 -1929058
17352a929058m6662l0148j3199k7478m4381J6704L104o5619o9738r222K6391p8300
$$ -1929058 -1975720 -2005868 -2019067 -2046545 -2090926 -2074222 -2071118 -2136737 -2206475 -2215697 -2189306 -2267606
17340b267606n2163R2900j2834n110n8282M8677K18757N8447j33445m3851J2511
$$ -2267606 -2319769 -2226869 -2239703 -2244813 -2303095 -2254418 -2035661 -1977214 -2110659 -2154510 -2141999
17329b141999J18927N8808J2766K3274m8804k7239n4846M0098M3688J19925m4331
$$ -2141999 -2023072 -1964264 -1951498 -1928224 -1977028 -2004267 -2059113 -2019015 -1975327 -1855402 -1899733
17318a899733k8066m4511m6340r8274L8906J51278j2j9510R5857K2992m3292j19831
$$ -1899733 -1927799 -1972310 -2018650 -2116924 -2078018 -1926740 -1926752 -1946262 -1850405 -1827413 -1870705 -1990536
17306a990536j6216J7205N2750j05307o8948N736l7693O4896Q3206p6474Q4059
$$ -1990536 -2006752 -1989547 -1936797 -2042104 -2111052 -2105316 -2143009 -2078113 -1994907 -2071381 -1987322
17295a987322M96N8476p2791n9291q7488M8358J07061L7787J09286k7007o5328
$$ -1987322 -1986826 -1928350 -2001141 -2060432 -2147920 -2099562 -1992501 -1954714 -1845428 -1872435 -1937763
17284a937763R464r383J15726J00816j19540o6816R1503J0422n8431r215m3035
$$ -1937763 -1928299 -1937682 -1821956 -1721140 -1840680 -1907496 -1815993 -1805571 -1864002 -1873217 -1916252
17273a916252M18Q925k1795k4816K6415L6203O721P2069J8033j35482k6983O7706
$$ -1916252 -1915834 -1906909 -1928704 -1953520 -1927105 -1890902 -1884181 -1812112 -1794079 -1929561 -1956544 -1888838
17261a888838j6628j7114n4082Q5225M3821K3301K5012o5499j02312J28964K3850
$$ -1888838 -1905466 -1922580 -1976662 -1891437 -1847616 -1824315 -1799303 -1864802 -1967114 -1838150 -1814300
17250a814300p7128j5620N0951J5904m5660j08103Q996N4432J1866m2567K5583
$$ -1814300 -1891428 -1907048 -1856097 -1840193 -1885853 -1993956 -1984960 -1930528 -1918662 -1961229 -1935646
17239a935646K0732r2400k7478J21945K54786R3570q6669o5101m3217M8851J8179
$$ -1935646 -1914914 -2007314 -2034792 -1912847 -1658061 -1564491 -1651160 -1716261 -1759478 -1710627 -1692448
17228a692448P4659O8382K390n2171p1061o5811m9239K7383l8123k9447J38989
$$ -1692448 -1617789 -1549407 -1547017 -1599188 -1670249 -1736060 -1785299 -1757916 -1796039 -1825486 -1686497
17217a686497R7257m2267j18445M3555L7277j13318J1689L132q8405j4748J01252
$$ -1686497 -1589240 -1631507 -1749952 -1706397 -1669120 -1782438 -1770749 -1767617 -1856022 -1870770 -1769518
17206a769518N4505Q3129p8241j56030m2607j0676N201M028P6800J56066K2674
$$ -1769518 -1715013 -1631884 -1710125 -1866155 -1908762 -1919438 -1914237 -1910209 -1833409 -1677343 -1654669
17195a654669r366N012l8572l7968k3323N1770n1086M5161M3528J21060j3330
$$ -1654669 -1664035 -1659023 -1697595 -1735563 -1758886 -1707116 -1758202 -1713041 -1669513 -1548453 -1561783
17184a561783p6946j39684J0763Q9605L2723l2304M3310M9588J20157r7141j66851
$$ -1561783 -1638729 -1778413 -1767650 -1678045 -1645322 -1677626 -1634316 -1584728 -1464571 -1561712 -1728563
17173a728563r952m7983M6305O676M9092Q4209j4706j31048j65500L2398M7153
$$ -1728563 -1738515 -1786498 -1740193 -1733517 -1684425 -1600216 -1614922 -1745970 -1911470 -1879072 -1831919
17162a831919j03142k4170j8598k0014P0800P5106O1135j2379l0737o4922J10678
$$ -1831919 -1935061 -1959231 -1977829 -1997843 -1927043 -1851937 -1790802 -1803181 -1833918 -1898840 -1788162
17151a788162o878j7835P910l3152k9745j8707M6740J4785M3100N8708l6613L5895
$$ -1788162 -1795040 -1812875 -1804965 -1838117 -1867862 -1886569 -1839829 -1825044 -1781944 -1723236 -1759849 -1723954
17139a723954m2411J4787J2443L6803j10798K9071L9186K0013M0672M8167N252
$$ -1723954 -1766365 -1751578 -1739135 -1702332 -1813130 -1784059 -1744873 -1724860 -1684188 -1636021 -1630769
17128a630769j0113N6159L2503J6041l7075j98271p3043K4382J26013J80263O296
$$ -1630769 -1640882 -1584723 -1552220 -1536179 -1573254 -1771525 -1844568 -1820186 -1694173 -1513910 -1507614
17117a507614o8729p2491J13415L2727o5059r8575n8769m3276N3040J06530P1560
$$ -1507614 -1576343 -1648834 -1535419 -1502692 -1567751 -1666326 -1725095 -1768371 -1715331 -1608801 -1537241
17106a537241M4199j27249r7435K3955J01396J9036m6658k4173L9095N3541n341
$$ -1537241 -1493042 -1620291 -1717726 -1693771 -1592375 -1573339 -1619997 -1644170 -1605075 -1551534 -1556875
17095a556875k389O4695J5914J8792m7386n0043L4738J2444l2542j36290j68248
$$ -1556875 -1559264 -1494569 -1478655 -1459863 -1507249 -1557292 -1522554 -1510110 -1542652 -1678942 -1847190
17084a847190l377M6827l6951J52486J72737J6008j32823j00730O2240Q9675M6603
$$ -1847190 -1850567 -1803740 -1840691 -1688205 -1515468 -1499460 -1632283 -1733013 -1670773 -1581098 -1534495
17073a534495m5465k4522n1258n5658n3903m1958j3936J56451O1699O6390N3238
$$ -1534495 -1579960 -1604482 -1655740 -1711398 -1765301 -1807259 -1821195 -1664744 -1603045 -1536655 -1483417
17062a483417O6268l6086q063k6158k0237O847L7523J7663j17305r3609l7588
$$ -1483417 -1417149 -1453235 -1461298 -1487456 -1507693 -1500846 -1463323 -1445660 -1562965 -1656574 -1694162
17051a694162P3806O2829l5694n1950O3689J7652m4103J363J28929J41227l3094
$$ -1694162 -1620356 -1557527 -1593221 -1645171 -1581482 -1563830 -1607933 -1606570 -1477641 -1336414 -1369508
17040a369508p4448j45370j01450J39818J9377j18180n8879J37630k0583J14613
$$ -1369508 -1443956 -1589326 -1690776 -1550958 -1531581 -1649761 -1708640 -1571010 -1591593 -1476980
17030a476980m6295j40342j05025Q1128M9412J59737K6861L0448k3415p0480q6088
$$ -1476980 -1523275 -1663617 -1768642 -1687514 -1638102 -1478365 -1451504 -1421056 -1444471 -1514951 -1601039
17019a601039M3261J7594J34561j5581j37463j63091j4667J15418M0034J49931
$$ -1601039 -1557778 -1540184 -1405623 -1421204 -1558667 -1721758 -1736425 -1621007 -1580973 -1431042
17009a431042r9528j39270L1594Q4028l5815J5188j3112j4140K8924Q1866n9953
$$ -1431042 -1530570 -1669840 -1638246 -1554218 -1590033 -1574845 -1587957 -1602097 -1573173 -1491307 -1551260
16998a551260L6890J26937n7226j62241o2029L8566J19990J47461Q8680J5307
$$ -1551260 -1514370 -1387433 -1444659 -1606900 -1668929 -1630363 -1510373 -1362912 -1274232 -1258925
16988a258925j49011j95855k0668L6918j4261O8066R4148j4518j29417J980J48001
$$ -1258925 -1407936 -1603791 -1624459 -1587541 -1601802 -1533736 -1439588 -1454106 -1583523 -1581543 -1433542
16977a433542M5262M2015k8608n9132n9324n1890M6815o9445m7607J00529J64704
$$ -1433542 -1388280 -1346265 -1374873 -1434005 -1493329 -1545219 -1498404 -1567849 -1615456 -1514927 -1350223
16966a350223J73017P729l4240q8977p6391K1550n1009j11794J4086J18747M5099
$$ -1350223 -1177206 -1169477 -1203717 -1292694 -1369085 -1347535 -1398544 -1510338 -1496252 -1377505 -1332406
16955a332406k03522j26463N6973J44443N023q4516q2266J3460J56413Q5427k4097
$$ -1332406 -1535928 -1662391 -1605418 -1460975 -1455952 -1540468 -1622734 -1609274 -1452861 -1367434 -1391531
16944a391531j5492j32535N12J42743Q9353k2793P0754m3345o9054j957K6445
$$ -1391531 -1407023 -1539558 -1539046 -1396303 -1306950 -1329743 -1258989 -1302334 -1371388 -1373345 -1346900
16933a346900j2228p023j12142L2138L6102M5579O958j23817K3844M4362J42150
$$ -1346900 -1359128 -1366151 -1478293 -1446155 -1410053 -1364474 -1357516 -1481333 -1457489 -1413127 -1270977
16922a270977N1477l2857m8592N288l0274p0118o3313l4863N9625J25591l085
$$ -1270977 -1219500 -1252357 -1300949 -1295661 -1325935 -1396053 -1459366 -1494229 -1434604 -1309013 -1312098
16911a312098j34079K4413o3876J8923j9888J6251M9344N5408k2965j00417P0931
$$ -1312098 -1446177 -1421764 -1485640 -1466717 -1486605 -1470354 -1421010 -1365602 -1388567 -1488984 -1418053
16900a418053J46021m2926q517j08755l3481J10773P6351m7939k1932J9860o4105
$$ -1418053 -1272032 -1314958 -1323475 -1432230 -1465711 -1354938 -1278587 -1326526 -1348458 -1328598 -1392703
16889a392703Q7799o3785m6811o9340k8923J41688J44208p4560J0362O4179l4604
$$ -1392703 -1304904 -1368689 -1415500 -1484840 -1513763 -1372075 -1227867 -1302427 -1292065 -1227886 -1262490
16878a262490k5560P2027k0931j43557o072l9669M0018P8533K6697P393j5958
$$ -1262490 -1288050 -1216023 -1236954 -1380511 -1386583 -1426252 -1386234 -1307701 -1281004 -1273611 -1289569
16867a289569J05404j19539k6859L4828R751N7886J9434j8738K2574N0072l9676
$$ -1289569 -1184165 -1303704 -1330563 -1295735 -1285984 -1228098 -1208664 -1227402 -1204828 -1154756 -1194432
16856a194432p274m3281K5413L5168P3566j45257p4179p9966M1217K9028j42091
$$ -1194432 -1201706 -1244987 -1219574 -1184406 -1110840 -1256097 -1330276 -1410242 -1369025 -1339997 -1482088
16845a482088l683J64078l2264k686L2920J41186K9118j24855J5875k3333r8450
$$ -1482088 -1485771 -1321693 -1353957 -1356643 -1323723 -1182537 -1153419 -1278274 -1262399 -1285732 -1384182
16834a384182k9701K3574P4427N7979p189l7280J35747K0239r015N1410k0474
$$ -1384182 -1413883 -1390309 -1315882 -1257903 -1265092 -1302372 -1166625 -1146386 -1155401 -1103991 -1124465
16823a124465r6416j34582P1702N3134L6908l6629j32650j0922O0341J8932R436
$$ -1124465 -1220881 -1355463 -1283761 -1230627 -1193719 -1230348 -1362998 -1373920 -1313579 -1294647 -1285211
16812a285211r6822j9796L1783J47531j1995j00834P8389n5058q298J32673K22569
$$ -1285211 -1382033 -1401829 -1370046 -1222515 -1234510 -1335344 -1256955 -1312013 -1320311 -1187638 -965069
16801i65069J0385k01493k09135q6552K4751K25752J77308k6257j11691k7097
$$ -965069 -954684 -1156177 -1365312 -1451864 -1427113 -1201361 -1024053 -1050310 -1162001 -1189098
16791a189098M8267j9346N343R5564J11683o8234j82480k4695M24k6721n8622
$$ -1189098 -1140831 -1160177 -1154834 -1059270 -947587 -1015821 -1198301 -1222996 -1222572 -1249293 -1307915
16780a307915j1644k9385m9755O7309J16756l150l7608o7402K8424m049r903k209
$$ -1307915 -1319559 -1348944 -1398699 -1331390 -1214634 -1217784 -1255392 -1322794 -1294370 -1298419 -1308322 -1310531
16768a310531q6405m3533j13073K9909J59262R8971N2578n5477k24K5828R4121
$$ -1310531 -1396936 -1440469 -1553542 -1523633 -1364371 -1265400 -1212822 -1268299 -1268523 -1242695 -1148574
16757a148574k285P340q0232l9855J30210J4302k6934o5132j18828J6778J07464
$$ -1148574 -1150859 -1143519 -1223751 -1263606 -1133396 -1119094 -1146028 -1211160 -1329988 -1313210 -1205746
16746a205746O7528l3386n4001K4985K6643L0459r941n8206n2969M4O0275J9165
$$ -1205746 -1138218 -1171604 -1225605 -1200620 -1173977 -1143518 -1153459 -1211665 -1264634 -1264590 -1204315 -1185150
16734a185150j0673n6964r8661J02463N8627n1131Q5347J7413j10844n5985LM876
$$ -1185150 -1195823 -1252787 -1351448 -1248985 -1190358 -1241489 -1156142 -1138729 -1249573 -1305558 -1305555 -1300679
16722a300679N0285J13022J13642o2815j47682k8635j7463N4775K453j19448q3427
$$ -1300679 -1250394 -1137372 -1023730 -1086545 -1234227 -1262862 -1280325 -1225550 -1223097 -1342545 -1425972
16711a425972J24933N9943q4420L6829J24209k1436l1981J32521O9449q8963p9061
$$ -1425972 -1301039 -1241096 -1325516 -1288687 -1164478 -1185914 -1217895 -1085374 -1015925 -1104888 -1183949
16700a183949j8180O8663J662m5953j06873j3285J1598p6701p0513J28227J29745
$$ -1183949 -1202129 -1133466 -1131804 -1177757 -1284630 -1297915 -1286317 -1363018 -1433531 -1305304 -1175559
16689a175559Q7943k9153j03790k7243o3110k1378k3281J57078J06923q625k8092
$$ -1175559 -1087616 -1116769 -1220559 -1247802 -1310912 -1332290 -1355571 -1198493 -1091570 -1100195 -1128287
16678a128287k4616n3012q9719m3500o1796K0864J27640K45229R1043m0149N7011
$$ -1128287 -1152903 -1205915 -1295634 -1339134 -1400930 -1380066 -1252426 -1007197 -916154 -956303 -899292
16667h99292P457j13892k20368n9981J17750p120J8231M0932M8557j5996J1578
$$ -899292 -891835 -1005727 -1226095 -1286076 -1168326 -1175446 -1157215 -1116283 -1067726 -1083722 -1072144
16656a072144m6139R104j6546r1011N9755R5340M6594J3462n9129k1137k4575
$$ -1072144 -1118283 -1109179 -1125725 -1216736 -1156981 -1061641 -1015047 -1001585 -1060714 -1081851 -1106426
16645a106426j33416l7500K1019P4845N2068O8590n8204j52204L3464J01499k7695
$$ -1106426 -1239842 -1277342 -1256323 -1181478 -1129410 -1060820 -1119024 -1271228 -1237764 -1136265 -1163960
16634a163960J4414n9123N1855O9244l9843r5534M7881J62720m8248o6719r9814
$$ -1163960 -1149546 -1208669 -1156814 -1087570 -1127413 -1222947 -1175066 -1012346 -1060594 -1127313 -1227127
16623a227127K8578J7734m7932L6371Q9816k23n7070J04581J27257j4782L4627
$$ -1227127 -1198549 -1180815 -1228747 -1192376 -1102560 -1102783 -1159853 -1055272 -928015 -942797 -908170
16612i08170q2778m3725P7294j16006o1428J28K4764nl939L077K8606j32461m6560
$$ -908170 -990948 -1034673 -957379 -1073385 -1134813 -1134685 -1109921 -1109926 -1113865 -1110788 -1082182 -1214643 -1261203
16599a261203p0354r7403L8470J35412K5730M8338O1210k5334L9116N07o2439
$$ -1261203 -1331557 -1428960 -1390490 -1255078 -1229348 -1181010 -1119800 -1145134 -1106018 -1105511 -1167950
16588a167950j08335J11233P6896m7110n7478J7758N2777K6231O1922j01108o5151
$$ -1167950 -1276285 -1165052 -1088156 -1135266 -1192744 -1174986 -1122209 -1095978 -1034056 -1135164 -1200315
16577a200315R5777P478m3624O8877O3434O1011m7055p69o8341o5602O5065M6087
$$ -1200315 -1104538 -1097060 -1140684 -1071807 -1008373 -947362 -994417 -995186 -1063527 -1129129 -1064064 -1017977
16565a017977N6867O888P6996J6272m2724L4680j8206k8089M5281n0604q5200
$$ -1017977 -961110 -954222 -877226 -860954 -903678 -868998 -887204 -915293 -870012 -920616 -1005816
16554a005816j02938j36349N5680J08689j9591q2025L0773J19545p7045m704M4517
$$ -1005816 -1108754 -1245103 -1189423 -1080734 -1100325 -1182350 -1151577 -1032032 -1109077 -1113781 -1069264
16543a069264K0103K3211l1827J1138J6432L0100j8061m219O6603l1094R164J1197
$$ -1069264 -1049161 -1025950 -1057777 -1046639 -1030207 -1000107 -1018168 -1022387 -955784 -986878 -977714 -966517
16531i66517p3474K3560M2973Q3430N5790k1114k20924o8632m6982m0698J03007
$$ -966517 -1039991 -1016431 -973458 -890028 -834238 -855352 -1076276 -1144908 -1191890 -1232588 -1129581
16520a129581Q6920M0896M8735p2284M589k2934o7211r4464k5742L1676M4151
$$ -1129581 -1042661 -1001765 -953030 -1025314 -1020725 -1043659 -1110870 -1205334 -1231076 -1199400 -1155249
16509a155249M9729J9681n8116M4540j03984P2947P9382k0468n3578M5859J35233
$$ -1155249 -1105520 -1085839 -1143955 -1099415 -1203399 -1130452 -1051070 -1071538 -1125116 -1079257 -944024
16498i44024M6321m3247k7530j30319q0923O1992P0773M4642m1197k7540Q8236
$$ -944024 -897703 -940950 -968480 -1098799 -1179722 -1117730 -1046957 -1002315 -1043512 -1071052 -982816
16487i82816J05498J34513m6670q9984k04861j35203Q0042N4074N1294k4914n4423
$$ -982816 -877318 -742805 -789475 -879459 -1084320 -1219523 -1139481 -1085407 -1034113 -1059027 -1113450
16476a113450J04769m2393M5L9225K24388O8633l2474j0111r9746m0430K9018
$$ -1113450 -1008681 -1051074 -1051029 -1011804 -787416 -718783 -751257 -761368 -861114 -901544 -872526
16465h72526p56m02M7253r793n2857j16507L731R673q7790j3537N9416N0047p2601
$$ -872526 -873282 -873684 -826431 -836224 -889081 -1005588 -1001857 -992184 -1079974 -1093511 -1034095 -984048 -1056649
16452a056649P9252M6758O154l8460k812q073J7861l5497J05220J37594l6769
$$ -1056649 -977397 -930639 -924485 -962945 -965757 -973830 -955969 -991466 -886246 -748652 -785421
16441g85421j36437J28316j37312j13801l9682R9510k5998j32303j24162R9372
$$ -785421 -921858 -793542 -930854 -1044655 -1084337 -984827 -1010825 -1143128 -1267290 -1167918
$$ [...]
##END NTUPLES=NMR SPECTRUM
##END=
