##TITLE=Analysis number 329432
Compound Code cc 66704
Book Reference 528/52
Project Code adrs
Chemist Name davee
##JCAMPDX= 6.0         $$ Bruker NMR JCAMP-DX V2.0
##DATA TYPE= NMR SPECTRUM
##DATA CLASS= NTUPLES
##ORIGIN= Bruker BioSpin GmbH
##OWNER= nmr
$$ XWIN-NMR		Version 3.5
$$ Fri Aug 31 10:17:18 2007 GMT Daylight Time (UT+1h)  MAYBRIDGE\nmr@NMR_250MHZ
##.OBSERVE FREQUENCY= 250.131544655141
##.OBSERVE NUCLEUS= ^1H
##.ACQUISITION MODE= SIMULTANEOUS (DQD)
##.ACQUISITION SCHEME= undefined
##.AVERAGES= 16
##.DIGITISER RES= 18
##SPECTROMETER/DATA SYSTEM= dpx250
##.PULSE SEQUENCE= zg30
##.SOLVENT NAME= CDCl3
##.SHIFT REFERENCE= (INTERNAL, CDCl3, 0, 16.522)
##AUDIT TRAIL= $$ (NUMBER, WHEN, WHO, WHERE, WHAT)
$$ ##TITLE= Audit trail, XWIN-NMR		Version 3.5
$$ ##JCAMPDX= 5.01
$$ ##ORIGIN= Bruker BioSpin GmbH
$$ ##OWNER= nmr
$$ C:\u/data/dgb/nmr/ADRS/1950/pdata/1/auditp.txt
$$ ##AUDIT TRAIL=  $$ (NUMBER, WHEN, WHO, WHERE, WHAT)
(   1,<2007-08-31 10:16:13.78 +100>,<MAYBRIDGE\nmr>,<NMR_250MHZ>,
      <created by zg, POWCHK disabled, PULCHK disabled
       configuration hash MD5:
       76 6E 9A 78 1E 09 19 81 EC 84 63 8F B0 6A 59 2D
       data hash MD5: 64K
       E0 40 1A 08 05 4A 30 FF 33 06 34 8A 07 8E 08 D6>)
(   2,<2007-08-31 10:16:41.83 +100>,<MAYBRIDGE\nmr>,<NMR_250MHZ>,
      <Start of raw data processing
       ef LB = 0.3 FT_mod = 6 PKNL = 1 SI = 32K 
       data hash MD5: 32K
       81 0F B0 28 5F 30 75 7F 48 6B 89 A5 13 DD D3 D7>)
(   3,<2007-08-31 10:16:47.44 +100>,<MAYBRIDGE\nmr>,<NMR_250MHZ>,
      <apk 
       data hash MD5: 32K
       4F DE 6E EE 4B 04 F6 75 8E 69 B3 37 9B C2 ED FE>)
(   4,<2007-08-31 10:16:52.50 +100>,<MAYBRIDGE\nmr>,<NMR_250MHZ>,
      <abs ABSG = 5 
       data hash MD5: 32K
       CB F4 08 F1 C9 A3 D7 BE 5F 16 9F 2C 3B 01 C6 DA>)
$$ ##END=
$$ 
$$ hash MD5
$$ 91 91 18 FA F5 D6 65 D6 B7 7C BC 0A FD 16 57 75
##$RELAX= 
##$RELAX= 
##$RELAX= 
##$RELAX= 
##$RELAX= 
##$RELAX= 
##$RELAX= 
$$ Bruker specific parameters
$$ --------------------------
##$DU= <C:\u>
##$EXPNO= 1950
##$NAME= <ADRS>
##$PROCNO= 1
##$TYPE= <nmr>
##$USER= <dgb>
##$AMP= (0..31)
100 100 100 100 100 100 100 100 100 100 100 100 100 100 100 100 100 100 
100 100 100 100 100 100 100 100 100 100 100 100 100 100 
##$AQSEQ= 0
##$AQ_mod= 3
##$AUNM= <au_zg>
##$AUTOPOS= <27 >
##$BF1= 250.13
##$BF2= 250.13
##$BF3= 250.13
##$BF4= 250.13
##$BF5= 500.13
##$BF6= 500.13
##$BF7= 500.13
##$BF8= 500.13
##$BYTORDA= 1
##$CFDGTYP= 0
##$CFRGTYP= 5
##$CHEMSTR= <none>
##$CNST= (0..31)
1 1 145 1 1 1 1 1 1 1 1 1 1 1 1 1 1 1 1 1 1 1 1 1 1 1 1 1 1 1 1 1 
##$CPDPRG= <>
##$CPDPRG1= <>
##$CPDPRG2= <>
##$CPDPRG3= <>
##$CPDPRG4= <mlev>
##$CPDPRG5= <mlev>
##$CPDPRG6= <mlev>
##$CPDPRG7= <mlev>
##$CPDPRG8= <mlev>
##$CPDPRGB= <>
##$CPDPRGT= <>
##$D= (0..31)
0 1 0 0 0 0 0 0 0 0.06 0 0 0 0 0 0 0.0002 0 0 0 0 0 0 0 0 0 0 0 0 0 0 
0 
##$DATE= 1188551770
##$DBL= (0..7)
120 120 120 120 120 120 120 120 
##$DBP= (0..7)
150 150 150 150 150 150 150 150 
##$DBP07= 0
##$DBPNAM0= <>
##$DBPNAM1= <>
$$ [...]
##$SUBNAM7= <"">
##$SUBNAM8= <"">
##$SUBNAM9= <"">
##$SW= 20.6930455092707
##$SWIBOX= (0..15)
0 0 3 0 0 0 0 0 0 0 0 0 0 0 0 0 
##$SW_h= 5175.983436853
##$TD= 65536
##$TD0= 1
##$TE= 296.16
##$TE2= 300
##$TE3= 300
##$TEG= 300
##$TL= (0..7)
0 120 120 120 120 120 120 120 
##$TP= (0..7)
150 150 150 150 150 150 150 150 
##$TP07= 0
##$TPNAME0= <>
##$TPNAME1= <>
##$TPNAME2= <>
##$TPNAME3= <>
##$TPNAME4= <>
##$TPNAME5= <>
##$TPNAME6= <>
##$TPNAME7= <>
##$TPOAL= (0..7)
0.5 0.5 0.5 0.5 0.5 0.5 0.5 0.5 
##$TPOFFS= (0..7)
0 0 0 0 0 0 0 0 
##$TUNHIN= 0
##$TUNHOUT= 0
##$TUNXOUT= 0
##$USERA1= <user>
##$USERA2= <user>
##$USERA3= <user>
##$USERA4= <user>
##$USERA5= <user>
##$V9= 5
##$VALIST= <valist>
##$VCLIST= <CCCCCCCCCCCCCCC>
##$VD= 0
##$VDLIST= <DDDDDDDDDDDDDDD>
##$VPLIST= <PPPPPPPPPPPPPPP>
##$VTLIST= <TTTTTTTTTTTTTTT>
##$WBST= 1024
##$WBSW= 4
##$XGAIN= (0..3)
0 0 0 0 
##$XL= 0
##$YL= 0
##$YMAX_a= 606335
##$YMIN_a= -556406
##$ZGOPTNS= <>
##$ZL1= 120
##$ZL2= 120
##$ZL3= 120
##$ZL4= 120
##$ABSF1= 16.522
##$ABSF2= -4.171173
##$ABSG= 5
##$ABSL= 3
##$ALPHA= 0
##$AQORDER= 0
##$ASSFAC= 0
##$ASSFACI= 0
##$ASSFACX= 0
##$ASSWID= 0
##$AUNMP= <proc_1d>
##$AZFE= 0.1
##$AZFW= 0.1
##$BCFW= 0
##$BC_mod= 0
##$BYTORDP= 0
##$COROFFS= 0
##$CY= 12.5
##$DATMOD= 1
##$DC= 0
##$DFILT= <>
##$DTYPP= 0
##$F1P= 14.0000005364418
##$F2P= -0.99999901652339
##$FCOR= 0.5
##$FTSIZE= 32768
##$FT_mod= 6
##$GAMMA= 0
##$GB= 0
##$INTBC= 1
##$INTSCL= 1
##$ISEN= 128
##$LB= 0.3
##$LEV0= 0
##$LPBIN= 0
##$MAXI= 10000
##$MC2= 0
##$MEAN= 0
##$ME_mod= 0
##$MI= 0
##$NCOEF= 0
##$NC_proc= -4
##$NLEV= 6
##$NOISF1= 0
##$NOISF2= 0
##$NSP= 0
##$NTH_PI= 0
##$NZP= 0
##$OFFSET= 16.522
##$PC= 1
##$PHC0= -42.5425
##$PHC1= 7.03033
##$PH_mod= 1
##$PKNL= yes
##$PPARMOD= 0
##$PSCAL= 4
##$PSIGN= 0
##$REVERSE= no
##$SF= 250.13
##$SI= 32768
##$SIGF1= 0
##$SIGF2= 0
##$SINO= 400
##$SIOLD= 32768
##$SREGLST= <1H.CDCl3>
##$SSB= 0
##$STSI= 32768
##$STSR= 0
##$SW_p= 5175.98343685301
##$SYMM= 0
##$S_DEV= 0
##$TDeff= 65536
##$TDoff= 0
##$TI= <Analysis number 999999
Compound Code 99
Book Reference 9
Project Code 9>
##$TILT= no
##$TM1= 0
##$TM2= 0
##$TOPLEV= 0
##$USERP1= <user>
##$USERP2= <user>
##$USERP3= <user>
##$USERP4= <user>
##$USERP5= <user>
##$WDW= 1
##$XDIM= 32768
##$YMAX_p= 445892107
##$YMIN_p= -485584
$$ End of Bruker specific parameters
$$ ---------------------------------
##NTUPLES= NMR SPECTRUM
##VAR_NAME=  FREQUENCY,     SPECTRUM/REAL,   SPECTRUM/IMAG
##SYMBOL=    X,             R,               I
##VAR_TYPE=  INDEPENDENT,   DEPENDENT,       DEPENDENT
##VAR_FORM=  AFFN,          ASDF,            ASDF
##VAR_DIM=   32768,         32768,           32768
##UNITS=     HZ,            ARBITRARY UNITS, ARBITRARY UNITS
##FACTOR=    0.157963299565203, 1,           1
##FIRST=     4132.6476996994, 0,             0
##LAST=      -1043.33573715361, 0,           0
##MIN=       -1043.33573715361, -485584,     0
##MAX=       4132.6476996994, 445892107,     0
$$ Real data points
##PAGE= N=1
##DATA TABLE= (X++(R..R)), XYDATA
$$ [...]
$$ plain form
18185 346351 378206 361125 341930 321379 333430 339357 346871 356311 334480 342898 345762 347888 355788
18172 355788 348066 345137 367559 411233 443307 439424 430300 460982 463382 481306 539404 585112
18160 585112 610033 594290 573299 564714 536196 547153 572258 618324 668118 726144 776415 774841
18148 774841 745092 729998 684023 651089 626912 606545 585500 590251 613433 635767 684920 760360
18136 760360 810098 876298 929785 973192 1057368 1174461 1264031 1328318 1366184 1401263 1458951
18125 1458951 1530219 1577469 1678097 1841593 2072032 2310761 2615727 2981468 3391042 3838047
18115 3838047 4408146 5301294 6762169 9270986 13624037 21056279 30976427 36866194
18107 36866194 33961700 28290044 23903380 19001121 13998555 10535658 8406190 7133432
$$ packed form
18185C46351L1855j7081j9195k0551J2051N927P514R440k1831Q418K864K126P900
18172C55788p722k929K2422M3674L2074l883r124L0682K400J7924N8098M5708
18160E85112K4921j5743k0991q585k8518J0957K5105M6066M9794N8026N0271j574
18148G74841k9749j5094m5975l2934k4177k0367k1045M751K3182K2334M9153P5440
18136G60360M9738O6200N3487M3407Q4176J17093Q9570O4287L7866L5079N7688
18125A458951P1268M7250J00628J63496K30439K38729L04966L65741M09574M47005
18115C838047N70099Q93148J460875K508817M353051P432242R920148N889767
18107C6866194k904494n671656m386664m902259n002566l462897k129468j272758
$$ plain form
18099 7133432 6381858 5946375 5654232 5385946 5073848 4783985 4498461 4271221 4232200 4262482
18089 4262482 4283251 4261937 4204231 4187439 4227986 4360231 4571204 4809127 5044434 5403992
18079 5403992 5914951 6610636 7567507 8863332 10575340 12681997 15560129 20126307 27561500
18070 27561500 39731232 58334130 79186026 89165619 84624502 76747035 71279578 67094075
18062 67094075 67754055 76923766 91405253 98719706 91496076 78467532 66583519 54404827
18054 54404827 42797075 34225647 28557533 24839653 22289097 20498436 19332573 18706609
18046 18706609 18655193 19142071 20060800 21453161 23466865 26609307 31831773 40568967 54961629
18037 54961629 76825627 100365346 109165053 101224819 91164801 84445424 78959957 79623630
$$ packed form
18099G133432p51574m35483k92143k68286l12098k89863k85524k27240l9021L0282
18089D262482K0769k1314n7706j6792M0547J32245K10973K37923K35307L59558
18079E403992N10959O95685R56871J295825J712008K106657K878132M566178P435193
18070B7561500J2169732J8602898K0851896R979593m541117p877467n467457m185503
18062F7094075O59980R169711J4481487P314453p223630j3028544j1884013j2178692
18054E4404827j1607752q571428n668114l717880k550556j790661j165863o25964
18046A8706609n1416M86878R18729J392361K013704L142442N222466Q737194J4392662
18037E4961629K1863998K3539719Q799707p940234j0060018o719377n485467O63673
$$ plain form
18029 79623630 90778729 107731247 114566942 104108641 88336877 74438278 59886809
18022 59886809 46285179 36447576 29858366 25271785 21944669 19463320 17492301 16015624
18014 16015624 15043047 14362972 13741729 13121818 12524921 12028188 11611919 11101830 10484451
18005 10484451 9849990 9231582 8613254 7999094 7400773 6813771 6294354 5847762 5449900
17996 5449900 5057542 4702216 4378465 4097883 3844814 3615103 3462950 3333091 3199939
17987 3199939 3086080 2955730 2872262 2828734 2771221 2666448 2569141 2479528 2363995 2278827
17977 2278827 2257903 2217160 2148487 2089519 2048292 2034473 1992391 1902704 1804501 1705004 1649541
17966 1649541 1628044 1582808 1509623 1483264 1460943 1382967 1342636 1287073 1250208 1222342 1194198
$$ packed form
18029G9623630J1155099J6952518O835695j0458301j5771764j3898599j4551469
18022E9886809j3601630r837603o589210m586581l327116k481349j971019j476677
18014A6015624r72577o80075o21243o19911n96897m96733m16269n10089o17379
18005A0484451o34461o18408o18328o14160n98321n87002n19417m46592l97862
17996E449900l92358l55326l23751k80582k53069k29711j52153j29859j33152
17987C199939j13859j30350q3468m3528n7513j04773r7307q9613j15533q5168
17977B278827k0924m0743o8673n8968m1227j3819m2082q9687r8203r9497n5463
17966A649541k1497m5236p3185k6359k2321p7976m0331n5563l6865k7866k8144
$$ plain form
17955 1194198 1193047 1212820 1216342 1184775 1170132 1160349 1123395 1113275 1111302 1043171 976644 938954
17943 938954 882385 845111 825534 821945 802259 768994 767775 771257 773751 767653 741950 745434 729978
17930 729978 724515 724179 706840 690537 675482 658833 669296 656815 637648 627617 605136 586323
17918 586323 590947 574236 560458 548604 564444 545202 515754 482602 487057 469707 447585 423223
17906 423223 435812 448927 428282 421616 422802 400645 427968 446283 452654 410982 386677 386356
17894 386356 416668 426824 421236 424353 419583 414594 401264 386853 363597 317192 270348 266198
17882 266198 283667 293803 281423 277459 296129 280411 278198 306064 316222 329255 318599 286618
17870 286618 289698 285234 266549 256456 266673 282373 277065 254823 256076 288201 325581 327918
$$ packed form
17955A194198j151J9773L522l1567j4643r783l6954j0120j973o8131o6527l7690
17943I38954n6569l7274j9577l589j9686l3265j219L482K494o098k5703L484j5456
17930G29978n463l36j7339j6303j5055j6649J0463j2481j9167j0031k2481j8813
17918E86323M624j6711j3778j1854J5840j9242k9448l3152M455j7350k2122k4362
17906D23223J2589J3115k0645o666J186k2157K7323J8315O371m1672k4305l21
17894C86356L0312J0156n588L117m770m989j3330j4411k3256m6405m6844m150
17882B66198J7469J0136j2380l964J8670j5718k213K7866J0158J3033j0656l1981
17870B86618L080m464j8685j0093J0217J5700n308k2242J253L2125L7380K337
$$ plain form
17858 327918 318507 307602 340186 368488 355681 367902 378759 358611 321106 305073 320644 297050
17846 297050 272370 265946 287161 307242 321004 321926 325564 356709 369478 391885 391748 390666 416004
17833 416004 435418 424213 384688 369952 415080 427876 415054 384526 365719 369979 394816 400105
17821 400105 382645 367517 363707 363936 365612 370103 360834 375095 380375 369538 342976 341511 323613
17808 323613 313025 333117 316202 319496 320927 292353 275196 227877 189548 168784 176882 178180
17796 178180 166849 175311 182895 207007 216864 185898 182198 202081 243901 250674 225408 210007
17784 210007 214416 229365 256094 292225 321822 314212 302844 295505 285521 303882 340833 347979
17772 347979 319344 323485 352183 365349 329239 319565 337320 339565 335042 346175 346282 339023 338846
$$ packed form
17858C27918r411j0905L2584K8302j2807J2221J0857k0148l7505j6033J5571k3594
17846B97050k4680o424K1215K0081J3762R22L638L1145J2769K2407j37j082K5338
17833D16004J9414j1205l9525j4736M5128J2796j2822l0528j8807M260K4837N289
17821D00105j7460j5128l810K29J676M491r269J4261N280j0837k6562j465j7898
17808C23613j0588K0092j6915L294J431k8574j7157m7319l8329k0764Q098J298
17796A78180j1331Q462P584K4112R857l0966l700J9883M1820O773k5266j5401
17784B10007M409J4949K6729L6131K9597p610j1368p339r984J8361L6951P146
17772C47979k8635M141K8698J3166l6110r674J7755K245m523J1133J07p259j77
$$ plain form
17759 338846 340791 317285 277609 306544 329587 335051 349077 371155 326868 340181 386179 399263
17747 399263 401596 402542 399264 390246 384955 384400 391062 384233 376788 379487 368771 328479 320044 333248
17733 333248 356719 364513 362692 369302 381109 412210 406422 424917 421320 402912 403971 415453 416533
17720 416533 414692 414918 405888 439873 459144 460486 488143 496504 495471 478504 469263 461877 447013
17707 447013 423915 409460 417138 429244 455015 482557 520809 528158 538692 530253 519311 538202
17695 538202 602598 631097 653577 717914 797680 849996 872476 863690 850768 852995 860200 840054
17683 840054 849737 882809 919000 924193 914779 909243 900446 901520 926608 955481 953802 974202 1016165
17670 1016165 1071192 1159196 1305107 1490947 1666478 1833669 2043759 2299224 2619271 2981582
$$ packed form
17759C38846J945k3506l9676K8935K3043N464J4026K2078m4287J3313M5998J3084
17747C99263K333R46l278r018n291n55O662o829p445K699j0716m0292q435J3204
17733C33248K3471P794j821O610J1807L1101n788J8495l597j8408J059J1482J080
17720D16533j841K26r030L3985J9271J342K7657Q361j033j6967r241p386j4864
17707D47013k3098j4455P678J2106K5771K7542L8252P349J0534q439j0942J8891
17695E38202O4396K8499K2480O4337P9766N2316K2480q786j2922K227P205k0146
17683H40054R683L3072L6191N193r414n536q797J074K5088K8873j679K0400M1963
17670A016165N5027Q8004J45911J85840J75531J67191K10090K55465L20047L62311
$$ plain form
17660 2981582 3366871 3799941 4166462 4444150 4665892 4860537 4991196 5005433 4894526 4653553
17650 4653553 4362457 4073026 3778016 3528617 3338350 3214519 3217491 3288423 3377292 3493188
17640 3493188 3658767 3851286 4045746 4207266 4388320 4580954 4882741 5356275 6057821
17631 6057821 7008703 8204630 9775161 12026022 15470913 21072810 30073076 43092759
17623 43092759 57848846 68359178 69609339 63441189 54582799 45308078 36373345 28948009
17615 28948009 23642459 20212754 18143345 17071379 16752467 16998455 17815448 19306137
17607 19306137 21754462 25648371 31974306 42378654 58712175 80893220 103271586
17600 103271586 115819631 113603177 102051479 87917184 73851873 61931996 54632867
$$ packed form
17660B981582L85289M33070L66521K77688K21742J94645J30659J4237j10907k40973
17650D653553k91096k89431k95010k49399j90267j23831K972P0932Q8869J15896
17640C493188J65579J92519J94460J61520J81054J92634L01787M73534P01546
17631F057821R50882J195927J570531K250861L444891N601897R000266J3019683
17623D3092759J4756087J0510332J250161o168150q858390r274721q934733p425336
17615B8948009n305550l429705k069409j071966l18912K45988Q16993J490689
17607A9306137K448325L893909O325935J0404348J6333521K2181045K2378366
17600A03271586J2548045k216454j1551698j4134295j4065311j1919877p299129
$$ plain form
17593 54632867 53317867 57801148 65191820 69908689 67827286 60769900 52511564 44309455
17585 44309455 36584493 30315651 25919854 23000241 21118198 20013419 19510529 19461745
17577 19461745 19932437 21053283 23112870 26648824 32586050 42533276 58223631 79573173
17569 79573173 100652909 111045748 106551334 93541605 78656933 63609033 49766537
17562 49766537 38954198 31438234 26389345 22966048 20534311 18755331 17439140 16432478
17554 16432478 15667475 15060316 14657460 14481028 14519839 14754434 15145812 15721979 16591542
17545 16591542 17873860 19892982 23059533 28050683 35220373 43407544 49879807 54479649
17537 54479649 60457247 70248698 82850813 93134914 97670867 100551057 103766306 105225982
$$ packed form
17593E4632867j315000M483281P390672M716869k081403p057386q258336q202109
17585D4309455p724962o268842m395797k919613j882043j104779n02890m8784
17577A9461745M70692J120846K059587L535954N937226R947226J5690355K1349542
17569G9573173K1079736J0392839m494414j3009729j4884672j5047900j3842496
17562D9766537j0812339p515964n048889l423297k431737j778980j316191j006662
17554A6432478p65003o07159m02856j76432L8811K34595L91378N76167Q69563
17545A6591542J282318K019122L166551M991150P169690Q187171O472263M599842
17537E4479649N977598R791451J2602115J0284101M535953K880190L215249J459676
$$ plain form
17529 105225982 105879471 107637281 110641079 111628946 105467071 95423869 87794813 83003054
17521 83003054 78939837 74591639 70352835 67045962 63588195 60192245 59208117 61795207
17513 61795207 66356852 68902903 68450004 67992870 67997749 67350386 66630046 66387333 66597222
17504 66597222 64988384 59628367 53332168 48743071 45150568 41399233 36759895 31821090
17496 31821090 27532980 23814727 20445207 17680918 15557711 13947698 12706196 11701857
17488 11701857 10813260 10037552 9357685 8707605 8131949 7635000 7203199 6809310 6493255
17479 6493255 6166613 5868560 5651980 5501299 5429488 5383841 5231397 4985298 4740945 4499342
17469 4499342 4239477 4032612 3895859 3795690 3682726 3517842 3354914 3186412 3014705
$$ packed form
17529A05225982O53489J757810L003798R87867o161875j0043202p629056m791759
17521H3003054m063217m348198m238804l306873l457767l395950r84128K587090
17513F1795207M561645K546051m52899m57134M879o47363p20340k42713K09889
17504F6597222j608838n360017o296199m589097l592503l751335m639338m938805
17496C1821090m288110l718253l369520k764289k123207j610013j241502j004339
17488A1701857q88597p75708o79867o50080n75656m96949m31801l93889l16055
17479F493255l26642k98053k16580j50681p1811m5647j52444k46099k44353k41603
17469D499342k59865k06865j36753j00169j12964j64884j62928j68502j71707
$$ plain form
17460 3014705 2860273 2714138 2585173 2461359 2395264 2337799 2261772 2186187 2131503 2059900
17450 2059900 2003344 1974754 1927150 1897536 1894726 1938396 1979586 2049263 2097625 2057817 1979265
17439 1979265 1855204 1747559 1675577 1652697 1662713 1630789 1577347 1487835 1419384 1376627 1308056
17428 1308056 1238202 1168211 1109871 1068563 1033021 992079 951375 923491 903013 868536 823337
17417 823337 796614 754713 724224 712932 697108 664688 648763 667190 671930 653593 642234 656210
17405 656210 663590 636911 611171 610047 608630 612097 625889 596286 572331 584746 585531 592593 569263
17392 569263 569452 566365 529254 509199 504757 487096 469093 462052 465085 474235 470361 439463 402925
17379 402925 390050 377220 406606 419798 401094 396910 396180 418041 435916 420875 389714 367370
$$ packed form
17460C014705j54432j46135j28965j23814o6095n7465p6027p5585n4684p1603
17450B059900n6556k8590m7604k9614k810M3670M1190O9677M8362l9808p8552
17439A979265j24061j07645p1982k2880J0016l1924n3442q9512o8451m2757o8571
17428A308056o9854o9991n8340m1308l5542m0942m0704k7884k0478l4477m5199
17417H23337k6723m1901l0489j1292j5824l2420j5925J8427M740j8337j1359J3976
17405F56210P380k6679k5740j124j417L467J3792k9603k3955J2415P85P062k3330
17392E69263J89l087l7111k0055m442j7661j8003p041L033R150l874l0898l6538
17379D02925j2875j2830K9386J3192j8704m184p30K1861J7875j5041l1161k2344
$$ plain form
17367 367370 355268 379172 404994 382407 390517 365277 341951 292201 300210 331167 316725 294247
17355 294247 295800 288543 289404 292657 271065 293737 283841 246779 216762 213583 196015 181915 193137
17342 193137 200263 198562 203365 197910 179404 159759 170603 180210 194552 216643 225141 253208 261838
17329 261838 225200 211899 218213 223973 216825 230288 240771 241370 233214 227522 208252 195272 196371
17316 196371 223831 252327 264814 220365 238271 273316 272669 261769 251173 260519 266084 241159
17304 241159 218938 216335 210090 197029 192242 206998 181328 172973 196848 233750 251251 230156
17292 230156 193873 173433 180034 198295 201674 190877 189799 219711 228377 220063 222230 222111 208851
17279 208851 231189 232697 240813 240181 210354 160962 150493 197448 224142 222668 236846 214639
$$ packed form
17367C67370j2102K3904K5822k2587Q110k5240k3326m9750Q009L0957j4442k2478
17355B94247J553p257Q61L253k1592K2672r896l7062l0017l179j7568j4100J1222
17342A93137P126j701M803n455j8506j9645J0844R607J4342K2091Q498K8067Q630
17329B61838l6638j3301O314N760p148J3463J0483N99q156n692j9270j2980J099
17316A96371K7460K8496J2487m4449J7906L5045o47j0900j0596R346N565k4925
17304B41159k2221k603o245j3061m787J4756k5670q355K3875L6902J7501k1095
17292B30156l6283k0440O601J8261L379j0797j078K9912Q666q314K167j19j3260
17279B08851K2338J508Q116o32k9827m9392j0469M6955K6694j474J4178k2207
$$ plain form
17267 214639 212972 222998 209327 196325 201957 230594 245586 198480 185310 189635 194764 191305
17255 191305 179844 186431 185015 174376 164426 160354 150679 144355 159934 157436 130752 99621 81171
17242 81171 92442 95720 82871 56664 63213 100339 126197 118270 81102 65534 98573 117773
17230 117773 135053 140612 100378 88707 92696 103353 116911 134774 116984 103153 119379 105410
17218 105410 77468 86421 83967 85928 73233 71132 62764 40134 47986 91709 94392 75949 60980
17205 60980 50342 48599 70242 79242 93029 116343 120257 89722 71039 87278 116494 90978
17193 90978 59155 40295 47748 85499 79575 74512 80094 69243 79816 109509 98734 68085
17181 68085 76164 79745 97090 112398 116698 103689 91737 104905 118187 86319 96083 104920 131865
$$ packed form
17267B14639j667J0026j3671j3002N632K8637J4992m7106j3170M325N129l459
17255A91305j1461O587j416j0639r950m072r675o324J5579k498k6684l1131j8450
17242H1171J1271L278j2849k6207O549L7126K5858p927l7168j5568L3039J9200
17230A17773J7280N559m0234j1671L989J0657J3558J7863j7790j3831J6226j3969
17218A05410k7942Q953k454J961j2695k101q368k2630P852M3723K683j8443j4969
17205F0980j0638j743K1643R000J3787K3314L914l0535j8683J6239K9216k5516
17193I0978l1823j8860P453L7751n924n063N582j0851J0573K9693j0775l0649
17181F8085Q079L581J7345J5308M300j3009j1952J3168J3282l1868R764Q837K6945
$$ plain form
17168 131865 146750 124088 130379 135495 128458 127621 109568 108173 97861 96807 70311 52826 88837
17155 88837 107506 100043 80347 55394 31813 34373 60492 85009 85087 81550 70093 64718 55164
17142 55164 59790 88367 101318 96337 95255 78861 69457 84236 92434 112841 98534 69211 61900
17129 61900 53477 52771 34339 46957 87363 112466 111089 89811 70517 72752 56072 34157 38036
17116 38036 39363 49720 56769 47291 41344 61712 61019 59376 57009 28257 8794 42290 75463
17103 75463 66813 27286 28721 72661 82605 94281 91501 93931 105488 113033 139651 206016 279648
17090 279648 363279 442101 486179 499507 454777 392723 315827 259133 202354 173256 147451
17079 147451 147814 149948 154997 171464 194668 179688 168259 197528 239460 278110 336505 408678
$$ packed form
17168A31865J4885k2662O291N116p037q37j8053j395j0312j054k6496j7485L6011
17155H8837J8669p463j9696k4953k3581K560K6119K4517P8l537j1457n375r554
17142E5164M626K8577J2951m981j082j6394r404J4779Q198K0407j4307k9323p311
17129F1900q423p06j8432J2618M0406K5103j377k1278j9294K235j6680k1915L879
17116C8036J327J0357P049r478n947K0368o93j643k367k8752j9463L3496L3173
17103G5463q650l9527J435M3940R944J1676k780K430J1557P545K6618O6365P3632
17090B79648Q3631P8822M4078J3328m4730o2054p6896n6694n6779k9098k5805
17079A47451L63K134N049J6467K3204j4980j1429K9269M1932L8650N8395P2173
$$ plain form
17067 408678 464864 485901 461979 408689 357388 318004 325516 321640 340127 422555 533282 565297
17055 565297 527656 454948 411623 343108 252051 172258 141323 143161 162932 132041 124801 116332
17043 116332 115118 131446 153299 143381 164194 212144 291873 362579 390832 417152 394504 351605
17031 351605 308993 239688 200564 175476 174409 177501 159630 125526 107834 110633 134983 120776
17019 120776 143388 151176 181051 215595 235479 284621 343506 372856 424536 450769 474464 468903
17007 468903 488244 506961 537430 563483 572260 571413 541046 454356 412202 382747 376523 390355
16995 390355 396804 403600 377963 328172 295393 346464 401201 419386 454089 482815 467336 443949
16983 443949 438173 449222 441839 422933 408860 384494 364096 333346 286558 272109 230785 197598
$$ packed form
17067D08678N6186K1037k3922n3290n1301l9384P512l876J8487Q2428J10727L2015
17055E65297l7641p2708m3325o8515r1057p9793l0935J838J9771l0891p240q469
17043A16332j214J6328K1853r918K0813M7950P9729P0706K8253K6320k2648m2899
17031C51605m2612o9305l9124k5088j067L092j7871l4104j7692K799K4350j4207
17019A20776K2612P788K9875L4544J9884M9142N8885K9350N1680K6233K3695n561
17007D68903J9341J8717L0469K6053Q777q47l0367q6690m2154k9455o224J3832
16995C90355O449O796k5637m9791l2779N1071N4737J8185L4703K8726j5479k3387
16983D43949n776J1049p383j8906j4073k4366k0398l0750m6788j4449m1324l3187
$$ plain form
16971 197598 190812 174656 148949 125679 111252 113554 98482 68963 64487 61935 48222 56891
16959 56891 83001 90117 55407 44988 8623 -22687 -20413 -19436 12973 32501 29322 4060 -3328
16946 -3328 12452 46342 89751 69767 46793 53890 23442 -18358 -10441 12167 26521 13505
16934 13505 -23712 -34146 -24729 -7466 4710 -38851 -66517 -70723 -62388 -48125 -17363 124
16922 124 -11000 -26774 -14557 -1186 3886 8922 7981 -23064 -70979 -84874 -57868 -35435 -11738
16909 -11738 1016 -2957 492 14011 25100 16789 -14387 -24366 -32106 -32061 -15107 6945 -5847
16896 -5847 -18518 -16380 -3157 -9999 -19478 -22270 2379 20556 41665 18887 -18246 -34887 -27282
16883 -27282 -46573 -38577 -42630 -39587 -46588 -54067 -18664 -11632 -17487 -26535 -34332 -18647 -17713 -16752
$$ packed form
16971A97598o786j6156k5707k3270j4427K302j5072k9519m476k552j3713Q669
16959E6891K6110P116l4710j0419l6365l1310K274R77L2409J9528l179k5262p388
16946c328J5780L3890M3409j9984k2974P097l0448m1800P917K2608J4354j3016
16934A3505l7217j0434R417J7263J2176m3561k7666m206Q335J4263L0762J7487
16922A24j1124j5774J2217J3371N072N036r41l1045m7915j3895K7006K2433K3697
16909a1738J2754l973L449J3519J1089q311l1176r979p740M5J6954K2052j2792
16896e847j2671K138J3223o842r479k792K4649J8177K1109k2778l7133j6641P605
16883b7282j9291P996m053L043p001p479L5403P032n855r048p797J5685R34R61
$$ plain form
16869 -16752 -14475 -22121 -9526 10420 -3995 -239 9946 -10904 -13086 -24265 -24037 -10885 12185
16856 12185 22419 19129 22007 29966 33207 31165 39483 34893 6994 12416 -4143 -13272 2039
16843 2039 14018 21304 17945 17070 26517 18324 -5640 -40329 -34202 -19814 -12964 -11796 2058 -6141
16829 -6141 -22541 -51517 -36252 -4449 29338 33740 18098 -12508 -3341 -1159 -39581 -26757
16817 -26757 -17619 2504 19218 10599 1074 -7807 -12826 -35371 -23089 -20401 -16576 -18601 -23221
16804 -23221 -21915 -37917 -42542 -38773 -18940 -13776 -29436 -45072 -54990 -58943 -37747 -16397 -34668
16791 -34668 -34135 -10933 -16506 -20292 -30338 -8796 -12932 -17788 -6408 -36700 -56530 -67399 -63865
16778 -63865 -27588 -9637 -23995 -43971 -69554 -58468 -26693 -29364 -20302 -17282 -10874 -30347
$$ packed form
16869a6752K277p646J2595J9946j4415L756J0185k0850k182j1179K28J3152K3070
16856A2185J0234l290K878P959L241k042Q318m590k7899N422j6559r129J5311
16843B039J1979P286l359q75R447q193k3964l4689O127J4388O850J168J3854q199
16829f141j6400k8976J5265L1803L3787M402j5642l0606R167K182l8422J2824
16817b6757R138K0123J6714q619r525q881n019k2545J2282K688L825k025m620
16804b3221J306j6002m625L769J9833N164j5660j5636r918l953K1196K1350j8271
16791c4668N33K3202n573l786j0046K1542m136m856J1380l0292j9830j0869L534
16778f3865L6277J7951j4358j9976k5583J1086L1775k671R062L020O408j9473
$$ plain form
16766 -30347 -46074 -40804 -11833 8856 17321 20307 -11784 27088 65173 58132 63117 56134 53924
16753 53924 43585 951 -22749 -30797 -17214 -6304 -10264 -30824 -27705 -11099 9376 480
16741 480 -4832 -27573 -25038 -33727 -13041 -1779 14337 32612 23650 -32503 -27588 7273 -14230
16728 -14230 -25644 -29336 -25480 -33873 -39630 -44550 -46771 -43505 -26189 -18085 3253 8379 -22248
16715 -22248 -27587 -8078 22479 23739 23335 3927 31587 29332 4798 36887 77866 47107 34651
16702 34651 13827 -23644 -21588 -10064 -11479 -19546 -21673 -2117 -5998 -4354 -1385 28699 -1156
16689 -1156 -41816 -47668 -41827 -23472 -25646 -30163 -13549 -6089 -16062 6798 14130 4353 -7775
16676 -7775 -27499 -21184 -11325 -4389 -19645 -22142 -1631 -273 -20533 -22450 15754 26834 488
$$ packed form
16766c0347j5727N270K8971K0689Q465K986l2091L8872L8085p041M985o983k210
16753E3924j0339m2634k3700q048J3583J0910l960k0560L119J6606K0475q896
16741D80n312k2741K535q689K0686J1262J6116J8275q962n6153M915L4861k1503
16728a4230j1414l692L856q393n757m920k221L266J7316Q104K1338N126l0627
16715b2248n339J9509L0557J260m04j9408K7660k255k4534L2089M0979l0759j2456
16702C4651k0824l7471K056J1524j415q067k127J9556l881J644K969L0084k9855
16689a156m0660n852N841J8355k174m517J6614P460r973K2860P332r777j2128
16676g775j9724O315R859O936j5256k497K0511J358k0260j917L8204J1080k6346
$$ plain form
16663 488 -32067 -48443 -21364 -11018 -25933 -22068 -21686 -30451 -7701 -837 -28586 -59786 -65258
16650 -65258 -61146 -27338 6884 -12441 -32999 -26215 -47522 -39636 -23215 -20381 -17749 -7792 9604
16637 9604 19336 38606 37432 -677 -14345 -1214 -24678 -4556 13265 33400 14325 -25122
16625 -25122 -9851 5511 -15083 -7428 16912 35421 19809 9400 24071 6185 4029 -4588
16613 -4588 -21323 -29992 9122 20651 -20906 -28455 -22994 -14870 -22136 -39422 -45818 -26556 4894
16600 4894 12176 17576 36548 43903 33266 49166 48921 34402 12735 -9855 -11391 7324 17196
16587 17196 -923 11956 29240 2448 18894 19697 18657 6096 -16590 -41144 -38316 -37760 -35053
16574 -35053 -46369 -51690 -40489 -24547 -41524 -47437 -17442 -11683 -12707 3896 205 -1852 -13923
$$ packed form
16663D88l2555j6376K7079J0346j4915L865L82q765K2750O864k7749l1200n472
16650f5258M112L3808L4222j9325k0558O784k1307P886J6421K834K632R957J7396
16637I604R732J9270j174l8109j3668J3131k3464K0122J7821K0135j9075l9447
16625b5122J5271J5362k0594P655K4340J8509j5612j0409J4671j7886k156q617
16613d588j6735q669L9114J1529m1557p549N461Q124p266j7286o396J9262L1450
16600D894P282N400J8972P355j0637J5900k45j4519k1667k2590j536J8715R872
16587A7196j8119J2879J7284k6792J6446Q03j040j2561k2686k4554K828N56K707
16574c5053j1316n321J1201J5942j6977n913K9995N759j024J6603l691k057j2071
$$ plain form
16561 -13923 -26442 -45687 -30723 -16519 -21223 -52307 -63981 -59201 -40463 -2152 14183 9834
16549 9834 56 -9017 -26717 -41468 -23982 641 -32565 -40280 -29692 -25930 -22839 -30792 -36391
16536 -36391 -42646 -24747 -28109 -28024 -21049 -25884 -17512 -25212 -25883 -32181 -38910 -47189 -39830 -42263 -49342
16521 -49342 -56789 -36117 -10324 -26070 -33942 -11902 2643 13974 -5245 -55005 -76916 -37436
16509 -37436 -19531 -15395 -13313 -13941 -4119 -12492 10058 22164 -13574 -32906 -9259 -4340 -18263
16496 -18263 -6061 3343 2245 13623 27892 139 -24697 -22660 -22780 -18644 -23989 -14316 -11837
16483 -11837 -33217 -57319 -77315 -67754 -61617 -51462 -35461 -31243 -9685 -11248 -16134 -30008 -19291
16470 -19291 24321 27630 -6993 -16524 -31136 -30244 -8297 4571 -1863 -33684 -66229 -50005 -44394
$$ packed form
16561a3923j2519j9245J4964J4204m704l1084j1674M780J8738L8311J6335m349
16549I834r778r073j7700j4751J7486K4623l3206p715J0588L762L091p953n599
16536c6391o255J7899l362Q5O975m835Q372p700o71o298o729q279P359k433p079
16521d9342p447K0672K5793j5746p872K2040J4545J1331j9219m9760k1911L9480
16509c7436J7905M136K082o28R822q373K2550J2106l5738j9332K3647M919j3923
16496a8263J2202R404j098J1378J4269k7753k4836K037j20M136n345R673K479
16483a1837k1380k4102j9996R561O137J0155J6001M218K1558j563m886j3874J0717
16470a9291M3612L309l4623r531j4612Q92K1947J2868o434l1821l2545J6224N611
$$ plain form
16457 -44394 -43836 -62322 -46617 -25195 3362 -4700 -6273 -444 1650 -12063 -12377 -9888 -22722
16444 -22722 -30693 -47451 -61676 -64474 -68758 -49845 -20607 -4880 4421 26030 17104 -4185 -13154
16431 -13154 -52909 -61230 -36822 -21441 18538 13091 -2464 -30730 -20853 -7375 -19356 -18759 -22112
16418 -22112 -20882 -22199 -24157 -7372 5076 -30034 -34002 -32747 -41742 -2376 13596 35893 47349
16405 47349 6216 -38745 -55691 -46444 -15872 -11946 -35320 -47995 -59443 -44184 -31740 -11281
16393 -11281 12880 21005 31294 47372 40394 31566 29958 16698 12310 9692 -1909 1094 18127
16380 18127 31142 15277 11044 9910 5875 -11369 -32424 -28630 -33059 -27370 -29966 18033 50946
16367 50946 9866 -2299 19645 46971 48370 34822 -4398 2228 4719 -10312 -28998 -21717
$$ packed form
16457d4394N58j8486J5705K1422K8557q062j573N829K094j3713l14K489j2834
16444b2722p971j6758j4225k798m284J8913K9238J5727R301K1609q926k1289q969
16431a3154l9755q321K4408J5381L9979n447j5555k8266R877J3478j1981N97l353
16418b2112J230j317j958J6785J2448l5110l968J255q995L9366J5972K2297J1456
16405D7349m1133m4961j6946R247L0572L926k3374j2675j1448J5259J2444K0459
16393a1281K4161Q125J0289J6078o978q828j608j3260m388k618j1601L003J7033
16380A8127J3015j5865m233j134m035j7244k1055L794m429N689k596M7999L2913
16367E0946m1080j2165K1944K7326J399j3548l9220O626K491j5031j8686P281
$$ plain form
16355 -21717 -20558 -28005 -37316 -20197 -68390 -93636 -85656 -63847 -26023 -25225 -27722 -56872 -75194
16342 -75194 -44384 -39704 -56165 -77419 -69198 -71761 -65216 -74452 -55926 -52268 -43845 -41927 -48762
16329 -48762 -57140 -69520 -50562 -57255 -51257 -27477 -16709 675 13423 -1854 -25975 -2981
16317 -2981 2698 -32884 -13402 5193 23553 14223 -6433 7774 2603 773 -1472 1047 -24254
16304 -24254 -25046 -12415 23020 42517 20011 -429 -3594 -762 -16734 -26653 -31634 -21178 -3223
16291 -3223 5498 329 5437 361 -10985 -29112 -35459 -34095 -27579 -28218 -24497 -32994 -52543 -40614
16277 -40614 5566 7552 -4241 8105 -29915 -10810 -15596 -24570 2200 14558 23262 13409 -29007
16264 -29007 -72960 -60020 -54870 -22935 16217 33082 10920 5463 -1238 -4793 10360 7963 3786
$$ packed form
16355b1717J159p447r311J7119m8193k5246P980K1809L7824P98k497k9150j8322
16342g5194L0810M680j6461k1254Q221k563O545r236J8526L658Q423J918o835
16329d8762q378j2380J8958o693N998K3780J0768J7384J2748j5277k4121K2994
16317b981N679l5582J9482J8595J8360r330k0656J4207n171j830k245K519k5301
16304b4254p92J2631L5435J9497k2506k0440l165K832j5972r919m981J0456J7955
16291c223Q721n169N108n076j1346j8127o347J364O516o39L721q497j9549J1929
16277d0614M6180J986j1793J2346l8020J9105m786q974K6770J2358Q704r853m2416
16264b9007m3953J2940N150L1935L9152J6865k2162n457o701l555J5153k397m177
$$ plain form
16251 3786 5172 2096 -23790 -47898 -50470 -33752 -22380 -7286 -30290 -20976 1702 9073 25514
16238 25514 2266 -23291 -42254 -71262 -63423 -34811 -2313 10543 1970 -28131 1559 2374
16226 2374 -1749 -10709 -15171 8986 24686 5129 -7625 -11528 5696 -6758 -18411 -7087 -21977
16213 -21977 -30728 -29406 -17651 -37490 -46956 -38627 -51834 -41268 -55238 -72323 -58206 -30313
16201 -30313 -17627 -23263 -41558 -67930 -89096 -79511 -72567 -53879 -31178 -19901 -11503 1350
16189 1350 10434 487 -1564 -12497 -19086 -45111 -61369 -49370 -50584 -64323 -81201 -81329 -45267
16176 -45267 -44112 -41986 -59983 -45854 -25096 -34451 -29650 -1508 -8215 -7744 -14760 1298 595 7611
16162 7611 19613 11029 -544 7205 -10529 -25884 -37531 -22332 -3927 2981 -12042 -36191
$$ packed form
16251C786J386l076k5886k4108k572J6718J1372J5094k3004R314K2678P371J6441
16238B5514k3248k5557j8963k9008P839K8612L2498J2856q573l0101K9690Q15
16226B374m123q960m462K4157J5700j9557j2754l903J7224j2454j1653J1324j4890
16213b1977q751J322J1755j9839r466Q329j3207J0566j3970j7085J4117K7893
16201c0313J2686n636j8295k6372k1166R585O944J8688K2701J1277Q398J2853
16189A350R084r947k051j0933o589k6025j6258J1999j214j3739j6878j28L6062
16176d5267J155K126j7997J4129K0758r355M801K8142o707M71p016J6058p03P016
16162G611J2002q584j1573P749j7734j5355j1647J5199J8405O908j5023k4149
$$ plain form
16150 -36191 -50444 -66186 -76414 -90815 -71220 -41515 -10204 5691 -8545 -17803 -26897 -52612
16138 -52612 -42003 -37292 -45417 -29489 -19419 11544 34251 29918 15689 2469 -6961 -2111 -26333
16125 -26333 -21728 -17202 -11661 -23460 -38550 -34730 -39232 -39542 -52230 -56564 -35332 -22282 -48347
16112 -48347 -51002 -39506 -42461 -53846 -44141 -36342 -23790 4140 2360 -13257 -17764 -37070 -39063
16099 -39063 -38014 -57299 -27410 -14387 -24365 -35666 -40002 -30991 -47777 -41709 -24068 -173 -22501
16086 -22501 -20219 -4288 -28045 -28436 -19884 -34924 -60283 -24660 1075 -8162 -5615 19565 24367
16073 24367 27957 19516 6094 -1603 17686 26814 17413 12747 7027 -2999 -13714 -42369 -42078
16060 -42078 -43345 -20510 -13096 -6849 -22345 -15831 -33404 -53969 -47437 -20446 -25710 -59139 -53005
$$ packed form
16150c6191j4253j5742j0228j4401J9595K9705L1311J5895j4236r258r094k5715
16138e2612J0609M711q125J5928J0070L0963K2707m333j4229j3220r430M850k4222
16125b6333M605M526N541j1799j5090L820m502l10j2688m334K1232J3050k6065
16112d8347k655J1496k955j1385R705P799J2552K7930j780j5617m507j9306j993
16099c9063J049j9285K9889J3023r978j1301m336R011j6786O068J7641K3895k2328
16086b2501K282J5931k3757l91Q552j5040k5359L5623K5735r237K547K5180M802
16073B4367L590q441j3422p697J9289R128r401m666n720j0026j0715k8655K91
16060d2078j267K2835P414O247j5496O514j7573k0565O532K6991n264l3429O134
$$ plain form
16047 -53005 -42543 -34399 -36877 -24373 -33570 -54556 -30081 -14646 -35376 -48987 -56388 -38714
16035 -38714 10735 47544 38536 3066 -26743 -20655 -2068 13400 16461 18430 45831 47709 29104
16022 29104 -28708 -58064 -48528 -39999 -39340 -32491 -11401 -7039 -41549 -71904 -70635 -71334 -42022
16009 -42022 -40988 -34450 -3323 8688 -9010 -13578 -12350 -15512 -15486 -33137 -24208 692 -12830
15996 -12830 -38814 -39372 -23724 -623 -7664 -42727 -57864 -36910 -42034 -47704 -22076 4210 -23082
15983 -23082 -8848 -7877 -8529 -35467 -44115 -57847 -61942 -53941 -26644 -18111 -38354 -22611 -18768
15970 -18768 -29966 -14323 6555 2328 -10580 -15447 -32615 -37660 -1368 24225 -1655 -28754
15958 -28754 -25056 -8863 -4296 -3038 2879 31395 28528 9890 -15353 -51623 -49569 -50198 -61527
$$ packed form
16047e3005J0462Q144k478J2504r197k0986K4475J5435k0730j3611p401J7674
16035c8714M9449L6809r008l5470k9809O088J8587J5468L061J969K7401J878j8605
16022B9104n7812k9356R536Q529O59O849K1090M362l4510l0355J269o99K9312
16009d2022J034O538L1127J2011j7698m568J228l162K6j7651Q929K4900j3522
15996a2830k5984n58J5648K3101p041l5063j5137K0954n124n670K5628K6286k7292
15983b3082J4234R71o52k6938q648j3732m095Q001K7297Q533k0243J5743L843
15970a8768j1198J5643K0878m227j2908m867j7168n045L6292K5593k5880k7099
15958b8754L698J6193M567J258N917K8516k867j8638k5243l6270K054o29j1329
$$ plain form
15945 -61527 -56402 -48143 -50132 -58421 -42532 -37769 -38291 -28979 -19767 -4105 2684 -3735 14090 25342
15931 25342 -3523 -23190 -16468 -34890 -53801 -45120 -33027 -5498 -22990 -48265 -65728 -73212
15919 -73212 -70025 -60992 -41156 -13467 86 -27647 -40068 -27249 -4423 -23069 -49303 -54471
15907 -54471 -61026 -47764 -48940 -48767 -46377 -37999 -56859 -81377 -58893 -48797 -46602 -38179 -63349
15894 -63349 -64053 -60053 -39825 -51354 -62777 -46073 -53354 -85760 -78383 -73295 -66793 -66982 -78673
15881 -78673 -67379 -54225 -48600 -39054 -32165 -28506 -21306 739 16632 -7937 -22556 -40896 -56214
15868 -56214 -67836 -76079 -52952 -50023 -24975 -7633 2226 -19449 -19420 -30558 -27176 -16084 4170
15855 4170 -23879 -16807 -6518 -19695 -42545 -49895 -44201 -33618 -38306 -22312 -3590 1645 -7351
$$ packed form
15945f1527N125Q259j989q289J5889M763n22R312R212J5662O789o419J7825J1252
15931B5342k8865j9667O722j8422j8911Q681J2093K7529j7492k5275j7463p484
15919g3212L187R033J9836K7689J3553k7733j2421J2819K2826j8646k6234n168
15907e4471o555J3262j176J73K390Q378j8860k4518K2484J0096K195Q423k5170
15894f3349p04M000K0228j1529j1423J6704p281l2406P377N088O502j89j1691
15881g8673J1294J3154N625R546O889L659P200K2045J5893k4569j4619j8340j5318
15868e6214j1622q243K3127K929K5048J7342R859k1675K9j1138L382J1092K0254
15855D170k8049P072J0289j3177k2850p350N694J0583m688J5994J8722N235q996
$$ plain form
15842 -7351 2100 20448 20057 -9676 -42785 -35551 -22706 -13186 -28926 -26783 -25714 -51219 -43148
15829 -43148 -53397 -53642 -55210 -38565 -55508 -43797 -9991 -13519 -51934 -59204 -48149 -27186 -6600
15816 -6600 -16160 -32729 -39950 -24225 -23167 -48356 -44004 -26542 -26860 -20767 -55451 -60390 -72219
15803 -72219 -50646 -41133 -47151 -12764 -16881 -29413 -6149 3707 15036 -11580 99 6196 -22338
15790 -22338 -18161 -23038 -26295 -31483 -25048 -24723 -37046 -27734 -9626 -19601 -31239 -32498 -29089 -6159
15776 -6159 1434 -1082 -8055 -4046 -613 11267 3340 -26133 -32249 -30139 -31669 -26513 -28134 -47364
15762 -47364 -53051 -54002 -59666 -79287 -79548 -67577 -54495 -11944 -3812 -35555 -26449 -2094 13319
15749 13319 -5461 -10534 -629 -20542 -26873 -16436 -12595 -19236 -31075 -50637 -46951 -33653 -43912
$$ packed form
15842g351R451J8348l91k9733l3109P234J2845R520j5740K143J069k5505Q071
15829d3148j0249k45j568J6645j6943J1711L3806l528l8415p270J1055K0963K0586
15816f600r560j6569p221J5725J058k5189M352J7462l18O093l4684m939j1829
15803g2219K1573R513o018L4387m117j2532K3264R856J1329k6616J1679O097k8534
15790b2338M177m877l257n188O435L25j2323R312J8108r975j1638j259L409K2930
15776f159P593k516o973M009L433J1880p927k9473o116K110j530N156j621j9230
15762d7364n687r51n664j9621k61J1971J3082M2551Q132l1743R106K4355J5413
15749A3319j8780n073R905j9913o331J0437L841o641j1839j9562L686J3298j0259
$$ plain form
15736 -43912 -51585 -48240 -49083 -26281 -39171 -60058 -51095 -18658 -3299 -4929 -1321 -29242 -36491
15723 -36491 -18399 -10905 -39944 -47435 -53164 -62301 -83287 -61991 -60644 -46765 -27541 -49757 -74346
15710 -74346 -70786 -68148 -32684 -9549 17680 12894 -25147 -32909 -14901 -10779 -32692 -53686 -52026
15697 -52026 -21154 -28077 -27408 -18883 -49297 -47827 -44055 -27793 -18858 -17589 -15954 -11053 -22771 -9461
15683 -9461 20222 38970 35972 37613 42305 6302 27522 22734 13792 -36594 -61297 -55115 -59981
15670 -59981 -39684 -33104 -53390 -32876 -27606 -35276 -51033 -55189 -38377 -46932 -38224 -51437 -56933
15657 -56933 -72625 -75451 -83776 -67709 -65599 -44263 -61387 -50414 -44581 -88029 -94364 -83097 -86825
15644 -86825 -49469 -28131 -63798 -65742 -47897 -67965 -79931 -70090 -47054 -47117 -63259 -77969 -55969
$$ packed form
15736d3912p673L345q43K2802j2890k0887Q963L2437J5359j630L608k7921p249
15723c6491J8092P494k9039p491n729r137k0986K1296J347J3879J9224k2216k4589
15710g4346L560K638L5464K3135K7229m786l8041p762J8008M122k1913k0994J660
15697e2026L0872o923O69Q525l0414J470L772J6262Q935J269J635M901j1718J3310
15683i461K9683J8748k998J641M692l6003K1220m788q942n0386k4703O182m866
15670e9981K0297O580k0286K0514N270p670j5757m156J6812q555Q708j3213n496
15657e6933j5692k826q325J6067K110K1336j7124J0973N833m3448o335J1267l728
15644h6825L7356K1338l5667j944J7845k0068j1966R841K3036o3j6142j4710K2000
$$ plain form
15631 -55969 -44340 -51924 -55985 -42896 -9476 15561 -3394 -32938 -4834 23956 7191 -11126
15619 -11126 -41730 -46586 -45306 -17029 2262 4114 -7616 -13182 -53132 -73039 -71814 -56150 -40557
15606 -40557 -47422 -66633 -67327 -44798 -13798 -31258 -57209 -67820 -36654 -22282 -49259 -70585
15594 -70585 -63124 -55308 -67249 -70333 -109456 -100651 -78064 -67073 -38354 -8909 6985 -772 7607
15581 7607 -5769 -3347 -36676 -68795 -73773 -50951 -29633 -40814 -55889 -35435 -34309 -43930 -33708
15568 -33708 -37075 -54721 -47329 -44476 -35601 -36770 -46876 -33448 -5795 21479 -2658 -56305 -61396
15555 -61396 -31108 -17183 -6322 -1577 -6331 -1643 -37450 -58935 -31294 -23503 -44298 -44568 -29735
15542 -29735 -25002 -2076 -3606 10623 12411 15976 3549 -30789 -8055 -17631 -32303 -21361 -15104
$$ packed form
15631e5969J1629p584m061J3089L3420K5037j8955k9544K8104K8790j6765j8317
15619a1126l0604m856J280K8277J9291J852j1730n566l9950j9907J225J5664J5593
15606d0557o865j9211o94K2529L1000j7460k5951j0611L1166J4372k6977k1326
15594g0585P461P816j1941l084l9123Q805K2587J0991K8719K9445J5894p757Q379
15581G607j3376K422l3329l2119m978K2822K1318j1181j5075K0454J126r621J0222
15568c3708l367j7646P392K853Q875j169j0106J3428K7653K7274k4137n3647n091
15555f1396L0288J3925J0861M745m754M688l5807k1485K7641P791k0795k70J4833
15542b9735M733K2926j530J4229J788L565j2427l4338K2734r576j4672J0942O257
$$ plain form
15529 -15104 -11739 -51479 -73394 -33827 -19372 -46950 -48309 -33599 -46815 -89612 -101667 -47333
15517 -47333 -23298 -36445 -50534 -93401 -93584 -90609 -57005 -32640 -48030 -49375 -57928 -63442 -9616
15504 -9616 1530 847 -16632 -43351 -41179 -26614 -13510 -20434 -30372 -49262 -64945 -85678 -88545
15491 -88545 -59922 -30783 -36576 -32215 -8689 -6459 -6523 -15813 -10048 29552 51887 60326 41189
15478 41189 -24102 -59617 -43234 -32603 -19123 -26204 -47758 -39926 -21002 -33533 -30420 -1299
15466 -1299 11898 7721 -17787 -53105 -18034 -24521 -34946 -50713 -57723 -61864 -85565 -81148 -63008
15453 -63008 -48780 -34911 -23606 -24232 -42173 -29017 -16539 -23435 -34528 -36322 -57822 -65426 -67809
15440 -67809 -57311 -49986 -36505 -34912 -39464 -23271 -15530 22278 38348 35816 22158 12582 -9673
$$ packed form
15529a5104L365l9740k1915L9567J4455k7578j359J4710j3216m2797j2055N4334
15517d7333K4035j3147j4089m2867j83K975L3604K4365j5390j345q553n514N3826
15504i616J1146o83j7479k6719K172J4565J3104o924r938j8890j5683k0733k867
15491h8545K8623K9139n793M361K3526K230o4r290N765L9600K2335Q439j9137
15478D1189o5291l5515J6383J0631J3480p081k1554P832J8924j2531L113K9121
15466a299J3197m177k5508l5318L5071o487j0425j5767p010m141k3701M417J8140
15453f3008J4228J3869J1305o26j7941J3156J2478o896j1093j794k1500p604k383
15440f7809J0498P325J3481J593m552J6193P741L7808J6070k532j3658r576k2255
$$ plain form
15427 -9673 -26308 -19914 -23903 -8101 -7959 -27057 -38152 -29108 -34265 -18069 -43439 -48957 -31620
15414 -31620 -22254 -22744 -44194 -35504 -39965 -39670 -56991 -56708 -28371 -38558 -44945 -45034 -37342 -37988 -32244
15399 -32244 -8597 -9448 -50570 -50899 -17571 -8115 8 34870 32568 -12478 128 17736 18305
15386 18305 9082 4824 -23165 -41643 -17487 -18472 -13604 -8604 -9651 5526 -10853 -22397 -29415
15373 -29415 -17963 -9111 -37130 -47647 -25216 -21204 -59121 -61400 -55909 -63587 -57212 -54566 -30027
15360 -30027 -32219 -6486 -5864 -5439 -6372 -19585 -3392 -11582 -5958 -2261 -20960 -22869 -49836 -64467
15346 -64467 -43268 -19983 -44888 -62419 -74097 -66854 -60893 -80959 -51202 -33677 -49371 -60569
15334 -60569 -85689 -90189 -104371 -100223 -87341 -46923 -46337 -31394 -24423 -11731 15401 15967 15724
$$ packed form
15427i673j6635O394l989J5802J42j9098j1095R044n157J6196k5370n518J7337
15414c1620R366m90k1450Q690m461K95j7321K83K8337j0187o387q9P692o46N744
15399c2244K3647q51m1122l29L3328R456Q123L4862k302m5046J2606J7608N69
15386A8305r223m258k7989j8478K4156r85M868N000j047J5177j6379j1544p018
15373b9415J1452Q852k8019j0517K2431M012l7917k279N491p678O375K646K4539
15360c0027k192K5733O22M25r33j3213J6193q190N624L697j8699j909k6967j4631
15346f4467K1199K3285k4905j7531j1678P243N961k0066K9757J7525j5694j1198
15334f0569k5120m500j4182M148J2882M0418N86J4943O971J2692K7132N66k43
$$ plain form
15321 15724 17775 3335 22333 19931 5397 -6277 -1709 -35246 -24770 8499 26702 26393 21983
15308 21983 13792 -1559 17410 29954 25925 36945 36955 43204 52318 43702 33530 23905 -19243
15295 -19243 -31275 -15327 -17740 -28891 -74222 -61677 -39385 -38825 -37858 -32674 -26396 -9185 -10892
15282 -10892 -12657 -6542 -25778 -43618 -7624 30153 10311 4710 24366 -7623 -49700 -32249
15270 -32249 -26291 -21724 -33937 -36066 -42396 -33610 -6330 14927 11562 -28161 -39679 -26121 -7653
15257 -7653 -8308 -6650 11111 -8227 -34997 -68875 -58581 -42100 -19184 -7659 -19165 -18548 -18876
15244 -18876 -25152 -475 -17157 -24018 -52909 -64251 -35978 12864 18005 -1754 -10314 -19004 -15066
15231 -15066 -10875 -25158 -30524 -37429 -37297 2907 41843 56894 43807 -10026 -34159 -9117 -15576
$$ packed form
15321A5724K051j4440J8998k402j4534j1674M568l3537J0476L3269J8203l09m410
15308B1983q191j5351J8969J2544m029J1020J0O249R114q616j0172r625m3148
15295a9243j2032J5948k413j1151m5331J2545K2292N60R67N184O278J7211j707
15282a0892j765O115j9236j7840L5994L7777j9842n601J9656l1989m2077J7451
15270c2249N958M567j2213k129o330Q786K7280K1257l365l9723j1518J3558J8468
15257g653o55J658J7761j9338k6770l3878J0294J6481K2916J1525j1506O17l28
15244a8876o276K4677j6682o861k8891j1342K8273M8842N141j9759q560q690L938
15231a5066M191j4283n366o905J32M0204L8936J5051j3087n3833k4133K5042o459
$$ plain form
15218 -15576 -18269 -40814 -47819 -40604 -18302 -23022 -4511 6923 -19830 -23518 -20945 -27408 -41010
15205 -41010 -36809 -38619 -17902 -22950 -14206 -13091 -29830 -38323 -39598 -20070 -6447 6582 28899
15192 28899 20774 -561 -5662 3059 16973 15316 2798 -570 -21558 -38953 -46397 -23280 19217
15179 19217 28934 34207 44423 61978 44663 27970 18442 20991 14428 10117 22805 38124 41910
15166 41910 60074 52778 38076 22361 21750 10018 20864 12521 8734 12900 11371 -1869 -25404
15153 -25404 -39968 -27559 -19800 -38683 -39437 -37313 -18148 -19650 -36498 -56491 -78035 -55715 -13363
15140 -13363 -14770 -9678 1670 -19681 -23795 -19150 -11107 7178 22469 14580 1304 -1648 -17628
15127 -17628 -33981 -15155 -8642 18103 20611 8735 2669 27710 56621 55318 32524 57691
$$ packed form
15218a5576k693k2545p005P215K2302m720J8511J1434k6753l688K573o463j3602
15205d1010M201j810K0717n048Q744J115j6739q493j275J9528J3623J3029K2317
15192B8899q125k1335n101Q721J3914j657j2518l368k0988j7395p444K3117M2497
15179A9217R717N273J0216J7555j7315j6693r528K549o563m311J2688J5319L786
15166D1910J8164p296j4702j5715o11j1732J0846q343l787M166j529j3240k3535
15153b5404j4564J2409P759j8883p54K124J9165j502j6848j9993k1544K2320M2352
15140a3363j407N092J1348k1351m114M645Q043J8285J5291p889j3276k952j5980
15127a7628j6353J8826O513K6745K508j1876o066K5041K8911j303k2794K5167
$$ plain form
15115 57691 89130 85934 98736 67800 52542 56705 62562 52212 81061 106523 130214 153181
15103 153181 189156 243208 275003 318793 397627 480829 559692 575868 588650 620679 604171
15092 604171 583732 577464 552608 496638 476735 435818 360448 314956 291331 254159 215110 177076
15080 177076 171635 166861 143633 108525 100744 114002 100363 80607 63606 51009 27298 25732
15068 25732 30044 6584 46 -5206 -7179 1176 31116 54410 53504 21336 25879 38364 39125 17137
15054 17137 20819 43638 52717 49854 25277 -11698 5916 2097 -16410 -10356 7677 17946 24221
15041 24221 38190 43772 64963 46399 38885 48597 8915 -18536 -8224 21573 51200 49375
15029 49375 37375 24198 -7774 -29658 -34434 -6887 22665 25899 22534 14493 606 23836
$$ packed form
15115E7691L1439l196J2802l0936j5258M163N857j0350K8849K5462K3691K2967
15103A53181L5975N4052L1795M3790P8834Q3202P8863J6176J2782L2029j6508
15092F04171k0439o268k4856n5970j9903m0917p5370m5492k3625l7172l9049l8034
15080A77076n441m774k3228l5108p781J3258j3639j9756j7001j2597k3711j566
15068B5732M312k3460o538n252j973Q355K9940K3294r06l2168M543J2485P61k1988
15054A7137L682K2819R079k863k4577l6975J7614l819j8507O054J8033J0269O275
15041B4221J3969N582K1191j8564p514R712l9682k7451J0312K9797K9627j825
15029D9375j2000j3177l1972k1884m776K7547K9552L234l365q041j3887K3230
$$ plain form
15017 23836 23230 5181 -5834 7647 14144 10578 16386 -118 -9153 -27976 -5681 -12351 -10711
15004 -10711 -7181 -8807 -35860 -66357 -49552 -4180 -8172 5859 19683 26378 24113 24890 48852
14991 48852 77595 60796 51551 45060 47625 21821 42989 51443 12633 16797 38450 47769 31035
14978 31035 9090 -3262 -19201 -42560 -16366 -25945 -35707 -24011 -10227 6065 14638 -10079
14966 -10079 7873 39843 67140 70873 59110 59491 54375 39005 14583 15216 -9811 -29831 -12249
14953 -12249 7912 14800 23126 29883 17719 12586 9861 267 -6283 -4713 6148 -16302 -34387
14940 -34387 -45519 -37089 -35242 -31871 -5124 25758 8804 17556 35976 23768 8085 19616
14928 19616 36776 43384 56049 72391 62642 82850 92822 100328 116891 138421 134238 140095 126327
$$ packed form
15017B3836o06j8049j1015J3481O497l566N808j6504r035j8823K2295o670J640
15004a0711L530j626k7053l0497J6805M5372l992J4031J3824O695k265P77K3962
14991D8852K8743j6799r245o491K565k5804K1168Q454l8810M164K1653R319j6734
14978C1035k1945j2352j5939k3359K6194r579r762J1696J3784J6292Q573k4717
14966a0079J7952L1970K7297L733j1763L81n116j5370k4422O33k5027k0020J7582
14953a2249K0161O888Q326O757j2164n133k725r594o550J570J0861k2450j8085
14940c4387j1132Q430J847L371K6747L0882j6954Q752J8420j2208j5683J1531
14928A9616J7160O608J2665J6342r749K0208R972P506J6563K1530m183N857j3768
$$ plain form
14915 126327 142931 143906 118219 88922 86695 72127 54820 35407 6314 -310 -17180 11422
14903 11422 41685 23217 22134 52673 58829 46301 37871 12142 12865 25099 7408 -19761 -28111
14890 -28111 -28500 -20869 7641 28026 10310 -17061 -32947 -36878 -21349 -25639 -37832 -38558 1787
14877 1787 40577 21327 -11510 -6574 -2876 -7551 -32519 -13105 7864 23941 8726 -240 -11537
14864 -11537 -40454 -34232 6896 22813 17901 15694 10719 -22193 -33379 -16490 -2213 17553
14852 17553 43784 82447 91879 95542 60892 14432 8820 640 39065 44929 9876 18308 23153
14839 23153 6754 28076 27137 4761 4550 13158 15500 44713 60765 87677 82604 51309 38858
14826 38858 47145 61138 73350 89413 119874 137961 185799 275200 384245 436275 441611 448231
$$ packed form
14915A26327J6604R75k5687k9297k227j4568j7307j9413k9093o624j6870K8602
14903A1422L0263j8468j083L0539O156j2528q430k5729P23J2234j7691k7169q350
14890b8111l89P631K8510K0385j7716k7371j5886l931J5529m290j2193p26M0345
14877A787L8790j9250l2837M936L698m675k4968J9414K0969J6077j5215q966j1297
14864a1537k8917O222M1128J5917m912k207m975l2912j1186J6889J4277J9766
14852A7553K6231L8663R432L663l4650m6460n612q180L8425N864l5053Q432M845
14839B3153j6399K1322r39k2376k11Q608K342K9213J6052K6912n073l1295j2451
14826C8858Q287J3993J2212J6063L0461J8087M7838Q9401J09045N2030N336O620
$$ plain form
14814 448231 418142 356026 318721 284145 267482 241092 241619 283583 342946 432109 546546 657715
14802 657715 770360 830555 828000 795453 748332 683318 598828 522496 457980 409044 338142
14791 338142 269174 230738 208870 176858 146216 130222 119554 116338 97589 103446 90102 104528
14779 104528 84639 69462 40359 53499 73322 71345 66027 58540 38802 29405 30487 19276
14767 19276 45502 25526 -16470 -18041 -7597 6915 35154 29458 20924 11359 14476 17647 34152
14754 34152 55834 67311 61415 51241 42838 41639 29979 23103 26779 33815 22208 25990 42464
14741 42464 26689 42581 39415 60481 88860 81532 79089 73702 63087 65192 65892 45515 14225
14728 14225 25368 21034 -6573 -8542 16866 18973 -8912 -7555 4830 7396 -10922 -184 -7732
$$ packed form
14814D48231l0089o2116l7305l4576j6663k6390N27M1964N9363Q9163J14437J11169
14802F57715J12645O0195k555l2547m7121o5014q4490p6332o4516m8936p0902
14791C38142o8968l8436k1868l2012l0642j5994j0668l216j8749N857j3344J4426
14779A04528j9889j5177k9103J3140J9823j977n318p487j9738r397J082j1211
14767A9276K6226j9976m1996j571J0444J4512K8239n696q534r565L117L171J6505
14754C4152K1682J1477n896j0174q403j199j1660o876L676P036j1607L782J6474
14741D2464j5775J5892l166K1066K8379p328k443n387j0615K105P00k0377l1290
14728A4225J1143m334k7607j969K5408K107k7885J357J2385K566j8318J0738p548
$$ plain form
14715 -7732 -8532 2695 -2019 -13115 -34480 -13763 10282 15355 24041 27732 18916 14000 30613
14702 30613 41427 60156 27402 19887 -14406 -31080 -26980 -24760 -11378 -14477 -8171 -14790 -4567
14689 -4567 38583 49548 10457 -6023 -9411 6785 16500 37213 19354 42662 50255 38121
14677 38121 70645 81087 93604 113820 107461 75849 92543 121783 112834 111686 137955 147636
14665 147636 130953 133276 130687 134557 113617 124888 118704 82906 58363 32720 55728 66004
14653 66004 81354 77882 57945 46347 32527 6782 -5164 24177 40119 43469 43712 48199 20236
14640 20236 -3165 -4625 -2228 29296 39997 24554 -574 1292 13107 42202 54315 61731
14628 61731 31340 5937 1115 -8505 -1259 18847 3403 -14766 -463 24364 41245 48384
$$ packed form
14715g732q00J1227m714j1096k1365K0717K4045N073Q686L691q816m916J6613
14702C0613J0814J8729l2754p515l4293j6674M100K220J3382l099O306o619J0223
14689d567M3150J0965l9091j6480l388J6196R715K0713j7859K3308P593j2134
14677C8121L2524J0442J2517K0216o359l1612J6694K9240q949j148K6269R681
14665A47636j6683K323k589L870k0940J1271o184l5798k4543k5643K3008J0276
14653F6004J5350l472j9937j1598j3820k5745j1946K9341J5942L350K43M487k7963
14640B0236k3401j460K397L1524J0701j5443k5128J866J1815K9095J2113P416
14628F1731l0391k5403m822r620P246K0106j5444j8169J4303K4827J6881P139
$$ plain form
14616 48384 33802 21483 13676 18955 38260 24851 36442 25470 8238 15386 27438 35631
14604 35631 19491 38540 66162 88884 96166 76939 55808 2550 -2550 13916 41471 38726
14592 38726 38475 17288 10629 19222 30982 36073 37280 37423 39459 28063 42674 35333 24508 24098
14578 24098 33315 27329 48596 54723 64864 93189 103238 90177 73215 64030 59052 81340 98113
14565 98113 107321 149226 185039 213115 246089 307341 406857 500856 631896 885266 1236119
14554 1236119 1645183 2079698 2405474 2536894 2485791 2232616 1895622 1510809 1188505 945619
14544 945619 752055 599755 516639 446005 373659 316706 287676 266356 250721 202655 136222
14533 136222 109401 125543 122839 82843 84212 106727 101986 105953 95500 77191 61149 63966
$$ packed form
14616D8384j4582j2319p807N279J9305j3409J1591j0972j7232P148J2052Q193
14604C5631j6140J9049K7622K2722P282j9227k1131n3258n100J6466K7555k745
14592C8726k51k1187o659Q593J1760N091J207J43K036j1396J4611p341j0825m10
14578B4098R217n986K1267O127J0141K8325J0049j3061j6962r185m978K2288J6773
14565I8113R208M1905L5813K8076L2974O1252R9516R3999J31040K53370L50853
14554A236119M09064M34515L25776J31420n1103k53175l36994l84813l22304k42886
14544I45619j93564j52300q3116p0634p2346n6953k9030k1320j5635m8066o6433
14533A36222k6821J6142k704l9996J369K2515m741L967j0453j8309j6042K817
$$ plain form
14521 63966 57429 30935 -4871 10494 10015 28273 28805 15806 34268 64242 59249 66029 57527
14508 57527 48180 33394 28165 30459 13218 -6917 -5777 -23123 22392 56981 58161 46697 35046
14495 35046 -10154 -20226 -7376 11493 11273 -22107 -2637 10532 -4874 10209 11069 -4488
14483 -4488 -45121 -45056 -25771 -27618 -20066 1539 5782 -8832 -739 -27197 -58141 -63544 -50485
14470 -50485 -50133 -51736 -8148 24754 1285 -4914 -8478 -1190 -56 3501 -3484 4232 11705 39142
14456 39142 24575 -23099 -53243 -45897 -29334 -36747 -16625 4806 19532 33740 30370 30492 12256
14443 12256 16345 2788 -15586 -35180 -24686 -30900 -4234 8267 5864 22805 45825 60519
14431 60519 36897 22085 32635 33225 19471 28618 84256 105114 122086 123168 135467 154199
$$ packed form
14521F3966o537k6494l5806J5365m79J8258N32j2999J8462K9974m993O780q502
14508E7527r347j4786n229K294j7241k0135J140j7346M5515L4589J180j1464j1651
14495C5046m5200j0072J2850J8869k20l3380J9470J3169j5406J5083Q60j5557
14483d488m0633O5J9285j847P552K1605M243j4614Q093k6458l0944n403J3059
14470e0485L52j603M3588L2902k3469o199l564P288J134L557o985P716P473K7437
14456C9142j4567m7674l0144P346J6563p413K0122K1431J4726J4208l370J22j8236
14443A2256M089j3557j8374j9594J0494o214K6666J2501k403J6941K3020J4694
14431F0519k3622j4812J0550N90j3754R147N5638K0858J6972J082J2299J8732
$$ plain form
14419 154199 188312 223697 213227 228048 231197 218598 219684 251021 278858 289657 291216 291155 315053
14406 315053 345796 366403 410781 493061 543308 580845 600652 627512 632734 614140 587190 509708
14394 509708 431735 368093 318741 302694 253230 172997 120865 84871 69926 70847 79841 65986
14382 65986 33084 22153 37542 60617 65708 63187 50644 28316 7350 24026 51305 54647
14370 54647 59934 49647 55730 60778 27330 6626 4769 5105 -9869 -10910 -9935 -46249 -41569 -1764
14356 -1764 4197 23238 38092 14929 -19114 -41366 -36222 29684 53227 58973 54418 36829 33193
14343 33193 33775 42859 71098 112231 179316 240553 274922 256511 255517 267188 289713 307067 289866
14330 289866 250020 220274 166679 110098 53519 30735 39296 48307 38941 45416 8306 -23687
$$ packed form
14419A54199L4113L5385j0470J4821L149j2599J086L1337K7837J0799J559o1K3898
14406C15053L0743K0607M4378Q2280N0247L7537J9807K6860N222j8594k6950p7482
14394E09708p7973o3642m9352j6047m9464q0233n2132l5994j4945R21Q994j3855
14382F5986l2902j0931J5389K3075N091k521j2543k2328k0966J6676K7279L342
14370E4647N287j0287O083N048l3448k0704j857L36j4974j041R75l6314M680L9805
14356a764N961J9041J4854k3163l4043k2252N144O5906K3543N746m555j7589l636
14343C3193N82R084K8239M1133O7085O1237L4369j8411r94J1671K2525J7354j7201
14330B89866l9846k9746n3595n6581n6579k2784Q561R011r366O475l7110l1993
$$ plain form
14318 -23687 -30695 -33228 -32486 -36015 -23731 -53699 -54338 -13939 -9432 -8134 15756 17744 9250 12493
14304 12493 5398 -7211 -15440 911 8888 25164 25748 -792 -7525 -2186 21066 23398 35934
14291 35934 10236 -2812 -20596 -25417 -20046 -24136 -34272 -22158 -6208 6209 7550 9502 6501
14278 6501 -9558 12924 24822 4299 -27525 -34631 -19084 3762 14466 13895 41449 59453
14266 59453 79823 96450 130578 185613 264968 348450 457203 549861 625542 673623 702431
14255 702431 730484 694843 633607 544481 457798 402261 347724 295870 258059 202678 162425
14244 162425 149028 144454 146207 139026 141793 116119 103495 96629 80818 96388 133116 151410
14232 151410 172199 177274 211570 269808 364242 498470 584085 676144 748146 804403 834374
$$ packed form
14318b3687p008k533P42l529J2284k9968o39M0399M507J298K3890J988q494L243
14304A2493p095j2609q229J6351P977J6276N84k6540o733N339K3252K332J2536
14291C5934k5698j3048j7784m821N371m090j0136J2114J5950J2417J341J952l001
14278F501j6059K2482J1898k0523l1824p106J5547K2846J0704n71K7554J8004
14266E9453K0370J6627L4128N5035P9355Q3482J08753R2658P5681M8081K8808
14255G02431K8053l5641o1236q9126q6683n5537n4537n1854l7811n5381m0253
14244A62425j3397m574J753p181K767k5674j2624o866j5811J5570L6728J8294
14232A51410K0789N075L4296N8238R4434J34228Q5615R2059P2002N6257K9971
$$ plain form
14221 834374 812404 763165 674206 569219 465757 386797 336217 274561 242217 207554 200314
14210 200314 182001 181956 209873 179045 168904 187349 211434 233450 282082 367512 441093 518633
14198 518633 612363 653094 661791 671882 668336 678015 630702 538249 471101 410328 328172 252411
14186 252411 220678 216706 208465 177809 152772 139941 119848 133588 139101 126265 124956 130371
14174 130371 98004 70439 51790 73906 71752 62636 58787 58886 72366 88853 61653 65251 54147
14161 54147 41268 36319 31995 24003 34424 74431 97864 73487 49372 28254 31671 26349 8253
14148 8253 -11352 9772 10161 -9445 -17311 1073 10367 32072 45865 57080 54098 50568 44680
14135 44680 70503 96041 109888 79168 36619 62904 78764 103885 88600 121007 114424 119470
$$ packed form
14221H34374k1970m9239q8959j04987j03462p8960n0580o1656l2344l4663p240
14210B00314j8313m5K7917l0828j0141J8445K4085K2016M8632Q5430P3581P7540
14198E18633R3730M0731Q697J0091l546R679m7313r2453o7148o0773q2156p5761
14186B52411l1733l972q241l0656k5037j2831k0093J3740N513j2836j309N415
14174A30371l2367k7565j8649K2116k154r116l849R9J3480J6487k7200L598j1104
14161E4147j2879m949m324p992J0421M0007K3433k4377k4115k1118L417n322j8096
14148H253j9605K1124L89j9606p866J8384R294K1705J3793J1215k982l530n888
14135D4680K5823K5538J3847l0720m2549K6285J5860K5121j5285L2407o583N046
$$ plain form
14123 119470 144191 157730 173253 170860 186287 212041 190038 162930 175664 171020 155273 123686
14111 123686 117436 143672 153553 146864 150343 133595 109498 97615 80883 88373 54550 58367 52825
14098 52825 43718 29904 20699 26966 34613 14679 -3396 -4224 -3763 4268 18634 2968 -16105
14085 -16105 -27855 -25651 -14352 -22999 -26810 -2372 5008 -2838 21277 37177 24777 13252 -11855
14072 -11855 -20693 -10676 -15742 -22039 -19564 16081 23127 33315 26233 24014 15740 22506 25898 34029
14058 34029 37547 60656 64020 43844 45722 37392 -5329 -40199 -27140 -3540 5380 7302 20849
14045 20849 -11030 -20285 -4928 7990 -8704 -3921 27597 33766 20726 2959 -11315 -14067
14033 -14067 5306 -19607 -42870 -69100 -57873 -17880 -6563 -4000 21485 15221 30600 41531
$$ packed form
14123A19470K4721J3539J5523k393J5427K5754k2003k7108J2734m644j5747l1587
14111A23686o250K6236R881o689L479j6748k4097j1883j6732P490l3823L817n542
14098E2825r107j3814r205O267P647j9934j8075q28M61Q031J4366j5666j9073
14085a6105j1750K204J1299q647l811K4438P380p846K4115J5900j2400j1525k5107
14072a1855q838J0017n066o297K475L5645P046J0188p082k219q274O766L392Q131
14058C4029L518K3109L364k0176J878q330m2721l4870J3059K3600Q920J922J3547
14045B0849l1879r255J5357J2918j6694M783L1518O169j3040j7767j4274k752
14033a4067J9373k4913k3263k6230J1227L9993J1317K563K5485o264J5379J0931
$$ plain form
14021 41531 20835 -23359 -14010 -3173 6093 36939 37121 11664 -1768 30281 38989 30199 35042
14008 35042 43125 70082 105253 150154 224055 288727 340544 345525 319935 278866 240257 189875
13996 189875 149584 100242 84116 68107 18016 2648 28183 50697 45684 34556 55077 84084
13984 84084 91409 87450 105683 92375 73721 39429 -4956 -17283 2903 19464 31012 29145
13972 29145 26278 30086 39669 60192 61815 41486 26131 46559 49393 8572 -34401 -21297 22696
13959 22696 41368 57590 52619 45662 37291 49563 89698 111259 101985 102413 93884 96477 92167
13946 92167 95905 92883 77013 50984 41300 45526 70668 95913 74489 43829 17754 -9768
13934 -9768 -7570 14436 45625 57834 88074 91573 106282 98971 106463 118406 140417 111268 127415
$$ packed form
14021D1531k0696m4194R349J0837R266L0846J82k5457j3432L2049Q708q790M843
14008C5042Q083K6957L5171M4901P3901O4672N1817M981k5590m1069l8609n0382
13996A89875m0291m9342j6126j6009n0091j5368K5535K2514n013j1128K0521K9007
13984H4084P325l959J8233j3308j8654l4292m4385j2327K0186J6561J1548j867
13972B9145k867L808R583K0523J623k0329j5355K0428K834m0821m2973J3104M3993
13959B2696J8672J6222m971o957q371J2272M0135K1561r274M28q529K593m310
13946I2167L738l022j5870k6029r684M226K5142K5245k1424l0660k6075k7522
13934i768K198K2006L1189J2209L0240L499J4709p311P492J1943K2011k9149J6147
$$ plain form
13921 127415 133350 161716 171810 168151 184440 224478 250173 284534 289085 322043 385014 504300
13909 504300 712015 986447 1296528 1584241 1729197 1730101 1542346 1287256 1053458 832927
13899 832927 619640 460847 374576 332698 308663 248228 185181 162319 164090 167808 169601 147740
13887 147740 139394 128282 119492 95081 90932 69864 48695 55065 57969 46594 17787 47422
13875 47422 53619 50982 29856 21844 14385 25558 54891 70368 74213 70600 55204 55207 37968 9058
13861 9058 -12899 -22909 -13823 -16974 -898 32496 13997 3664 21625 4349 -16920 -19910
13849 -19910 27589 53723 51690 46723 27168 35149 35632 4432 -12562 -30155 -21906 31432 56424
13836 56424 22464 -5071 -23573 -27882 -1326 32113 27764 12449 5240 -639 17844 32147
$$ packed form
13921A27415N935K8366J0094l659J6289M0038K5695L4361M551L2958O2971J19286
13909E04300K07715K74432L10081K87713J44956R04j87755k55090k33798k20531
13899H32927k13287j58793q6271m1878k4035o0435o3047k2862J771L718J793k1861
13887A47740q346j1112q790k4411m149k1068k1169O370K904j1375k8807K9635
13875D7422O197k637k1126q012p459J1173K9333J5477L845l613j5396Lj7239k8910
13861I058k1957j0010R086l151J6076L3394j8499j0333J7961j7276k1269k990
13849a9910M7499K6134k033m967j9555P981M83l1200j6994j7593Q249N3338K4992
13836E6424l3960k7535j8502m309K6556L3439m349j5315p209n879J8483J4303
$$ plain form
13824 32147 20793 21003 26040 19528 24173 16174 12429 38677 43365 56869 79763 84908 59174
13811 59174 40897 40739 67548 98027 101289 83525 64144 30904 18055 1986 -21451 -38165
13799 -38165 -37388 14632 31867 16841 -4350 -28736 -27052 -7036 -11914 -12103 -1275 19409 -1162
13786 -1162 13917 22399 28049 23552 -15848 -19646 -13663 10163 24803 25875 15042 -11909 4169
13773 4169 -2574 -23166 -17408 -14176 -28325 -23021 -5767 -3789 -30898 -23601 -37150 -44563 -30130
13760 -30130 -34175 -31699 -2018 -4701 -13707 2522 35620 29462 1579 -12769 4556 1057 33221
13747 33221 26349 2635 2818 -7201 -39243 -26141 -25020 -15552 -4671 658 7858 -11674 -36094
13734 -36094 -21810 -25748 -35439 -55032 -44815 -23144 -19870 -4044 9535 32324 56565 53267
$$ packed form
13824C2147j1354K10N037o512M645p999l745K6248M688J3504K2894N145k5734
13811E9174j8277j58K6809L0479L262j7764j9381l3240j2849j6069k3437j6714
13799c8165P77N2020J7235j5026k1191k4386J684K0016m878j89J0828K0684k0571
13786a162J5079Q482N650m497l9400l798N983K3826J4640J072j0833k6951J6078
13773D169o743k0592N758L232j4149N304J7254J978k7109P297j3549p413J4433
13760c0130m045K476K9681k683r006J6229L3098o158k7883j4348J7325l499L2164
13747C3221o872k3714J83j0019l2042J3102J121R468J0881N329P200j9532k4420
13734c6094J4284l938r691j9593J0217K1671L274J5826J3579K2789K4241l298
$$ plain form
13722 53267 44854 49969 39959 41424 53836 69383 64371 49421 21466 39298 56607 43454
13710 43454 39472 45651 66083 73958 85512 71732 77058 85763 59945 62821 82946 85921 73026
13697 73026 78607 74879 72171 70035 67277 75619 97977 77760 61631 46184 33059 49595 49890
13684 49890 49995 50790 37222 22945 17089 98 23892 37970 20442 -3320 -26066 23473 61251
13671 61251 50362 68576 77753 36471 24518 30727 35639 42360 55175 30835 8344 17173 47827
13658 47827 67295 72518 76160 84263 74292 104970 108310 103134 101257 124024 112980 107646 116591
13645 116591 110737 102029 126057 139051 145425 154260 178110 168713 190796 190470 215356 196292 214245
13632 214245 202649 172361 177840 186658 186999 186323 172025 183485 191330 199095 220154 243907 239915
$$ packed form
13722E3267q413N115j0010J465J2412J5547n012j4950k7955J7832J7309j3153
13710D3454l982O179K0432P875J1554j3780N326Q705k5818K876K0125K975j2895
13697G3026N581l728k708k136k758Q342K2358k0217j6129j5447j3125J6536K95
13684D9890J05P95j3568j4277n856j6991K3794J4078j7528k3762k2746M9539L7778
13671F1251j0889J8214R177m1282j1953O209M912O721J2815k4340k2491Q829L0654
13658D7827J9468N223L642Q103r971L0678L340n176j877K2767j1044n334Q945
13645A16591n854q708K4028J2994O374Q835K3850r397K2083l26K4886j9064J7953
13632B14245j1596l0288N479Q818L41o76j4298J1460P845P765K1059K3753l992
$$ plain form
13619 239915 246941 236947 227244 229063 269293 306870 288502 256886 226524 230336 242630 233017 208447
13606 208447 161593 105312 93071 75586 78126 74647 97592 88273 80035 92939 89158 73211
13594 73211 50285 37351 42972 35188 22305 13450 2248 19797 20751 2792 -4550 -24472 20101
13581 20101 22214 10508 25808 37056 7643 -26730 -27976 -33883 -28821 -21217 -12148 -2607 21447
13568 21447 18667 21942 37669 49206 19672 -1489 -12297 353 11865 3547 10862 44040
13556 44040 68749 47323 67641 101490 87532 74628 76307 85444 85077 89751 109533 111438 148489
13543 148489 190110 173266 167273 141961 150938 162643 141077 118451 114807 96839 88958 114240
13531 114240 92274 57415 31722 37551 22123 12909 25185 30048 27243 26496 5369 -15849 21344
$$ packed form
13619B39915P026r994r703J819M0230L7577j8368l1616l0362L812J2294r613k4570
13606B08447m6854n6281j2241j7485K540l479K2945r319q238J2904l781j5947
13594G3211k2926j2934N621p784j2883q855j1202J7549R54j7959p342j9922M4573
13581B0101K113j1706J5300J1248k9413l4373j246n907N062P604R069R541K4054
13568B1447k780L275J5727J1537k9534k1161j0808J2650J1512q318P315L3178
13556D4040K4709k1426K0318L3849j3958j2904J679R137l67M674J9782J905L7051
13543A48489M1621j6844n993k5312Q977J1705k1566k2626l644j7968p881K5282
13531A14240k1966l4859k5693N829j5428r214J2276M863k805p47k1127k1218L7193
$$ plain form
13518 21344 44297 46534 53091 32622 40073 44195 40793 -5467 -24302 -13101 -9451 16015 17160
13505 17160 25306 24051 33679 37314 47335 44011 26194 35505 10988 183 18165 8790 -2228
13492 -2228 12021 19613 16252 3046 -13614 -25818 -25281 -8409 2110 6389 3108 5138 -1628
13479 -1628 12250 35799 24070 -801 11262 9632 8252 2518 23727 42862 47488 26911 -15435
13466 -15435 -44747 -47507 -9111 7264 27292 35532 50415 40705 -5959 -30043 -35449 -26571 2210
13453 2210 24392 17921 7560 -16571 8525 4256 -12889 -9577 -8430 7191 25799 40561 49272
13440 49272 50326 64048 54379 14346 13463 15844 21404 22616 30813 67785 99338 109328 111284 92827
13426 92827 81645 126164 145752 133986 122022 100640 96021 83713 82795 124420 128971 112181
$$ packed form
13518B1344K2953K237O557k0469P451M122l402m6260j8835J1201L650K5466J145
13505A7160Q146j255R628L635J0021l324j7817R311k4517j0805J7982r375j1018
13492b228J4249P592l361j3206j6660j2204N37J6872J0519M279l281K030o766
13479a628J3878K3549j1729k4871J2063j630j380n734K1209J9135M626k0577m2346
13466a5435k9312k760L8396J6375K0028Q240J4883r710m6664k4084n406Q878K8781
13453B210K2182o471j0361k4131K5096m269j7145L312J147J5621J8608J4762Q711
13440D9272J054J3722r669m0033q83K381N560J212Q197L6972L1553R990J956j8457
13426I2827j1182M4519J9588j1766j1964k1382m619j2308r18M1625M551j6790
$$ plain form
13414 112181 96176 98827 117749 119063 107634 119788 116658 102372 109745 139485 102594 100184
13402 100184 135550 124639 98131 105029 95739 101583 116304 122782 119985 88740 110207 142283
13390 142283 127528 139351 136269 119288 100584 58889 81545 74802 54800 7244 -120 17148
13378 17148 12645 59738 58625 47812 32396 18989 10442 1263 6664 3070 6130 9661 -7494
13365 -7494 -23219 -18906 -2772 11080 7522 -2452 -11805 -8346 8788 -7734 -6750 -34547 -72704
13352 -72704 -67300 -63612 -61500 -41861 -13643 -18508 -18802 -42649 -64772 -33703 -25189 -22443 -22108 -32729
13338 -32729 -44200 -60685 -46077 -10570 -25709 -20273 -7824 -6990 -13041 -27656 -18609 -26248 -29544
13325 -29544 -8698 -413 -117 -12739 4574 -6450 -5287 10896 11951 -7192 3431 -22579 -28422
$$ packed form
13414A12181j6005K651J8922J314j1429J2154l130j4286P373K9740l6891k410
13402A00184L5366j0911k6508O898r290N844J4721O478k797l1245K1467L2076
13390A42283j4755J1823l082j6981j8704m1695K2656o743k0002m7556p364J7268
13378A7148m503M7093j113j0813j5416j3407q547r179N401l594L060L531j7155
13365g494j5725M313J6134J3852l558r974r353L459J7134j6522R84k7797l8157
13352g2704N404L688K112J9639K8218m865k94k3847k2123L1069Q514K746L35j0621
13338c2729j1471j6485J4608L5507j5139N436J2449Q34o051j4615R047p639l296
13325b9544K0846Q285K96j2622J7313j1024J163J6183J055j9143J0623k6010n843
$$ plain form
13312 -28422 -10349 6033 -2595 3264 7543 33150 58523 54764 20707 24409 18121 1472 -6343
13299 -6343 -7067 -10857 -9769 -9430 -15310 -18178 -45551 -47058 -58824 -71766 -101764 -90910 -35739 -8628
13285 -8628 -2614 -17761 -32213 -46376 -48667 -23933 -4239 7708 14360 23486 8286 -1644 1417
13272 1417 -23827 -20593 -27686 -42068 -35338 -61261 -54531 -28267 -26402 -19498 -16981 -23781 -34168
13259 -34168 -17514 -13347 -20855 -41832 -50441 -26782 -27909 -42753 -38250 13304 33430 42851 37340
13246 37340 13106 -8693 3759 19319 36502 15380 31958 16570 -18606 -19194 -9350 12981
13234 12981 27106 1834 -26654 -21091 -10606 11164 30257 23866 20856 7499 24353 37174
13222 37174 31526 24555 2923 -11093 -16880 -49883 -62772 -65756 -63696 -61229 -66102 -42608 -8480
$$ packed form
13312b8422J8073J6382q628N859M279K5607K5373l759l4057L702o288j6649p815
13299f343p24l790J088L39n880k868k7373j507j1766j2942k9998J0854N5171K7111
13285h628O014j5147j4452j4163k291K4734J9694J1947O652R126j5200r930L061
13272A417k5244L234p093j4382O730k5923O730K6264J865O904K517o800j0387
13259c4168J6654M167p508k0977q609K3659j127j4844M503N1554K0126R421n511
13246C7340k4234k1799J2452J5560J7183k1122J6578j5388l5176n88R844K2331
13234A2981J4125k5272k8488N563J0485K1770J9093o391l010j3357J6854J2821
13222C7174n648o971k1632j4016n787l3003j2889k984K060K467m873K3494L4128
$$ plain form
13209 -8480 -25847 -51727 -73509 -43430 -22539 -20110 -13718 -12190 671 -2223 -7080 -25702 -46220
13196 -46220 -6629 14622 4480 -2897 -26336 -38324 -32168 -22039 -43776 -54451 -26187 -20782
13184 -20782 -21042 -28733 -27926 -8459 1703 -7150 -9153 -10126 4208 31828 38116 44485 57877 56404
13170 56404 38980 51269 89121 90190 97222 97051 94783 91467 79794 73886 52440 63872 64219
13157 64219 55504 24787 36214 57878 45156 36482 15469 9684 2287 -11704 9197 7764 13289
13144 13289 14736 16644 53030 50771 -651 -39839 -52951 -19931 3515 15200 34275 43908
13132 43908 43677 51373 29048 775 3365 9187 -9862 2483 17198 26413 28416 71382 103326
13119 103326 119597 105929 82768 53006 44912 52061 61142 76563 56203 48746 52382 59656 65443
$$ packed form
13209h480j7367k5880k1782L0079K0891K429O392J528J2861k894m857j8622k0518
13196d6220L9591K1251j0142p377k3439j1988O156J0129k1737j0675K8264N405
13184b0782k60p691Q07J9467J0162q853k003r73J4334K7620O288O369J3392j473
13170E6404j7424J2289L7852J069P032j71k268l316j1673n908k1446J1432L47
13157F4219q715l0717J1427K1664j2722q674k1013n785p397j3991K0901j433N525
13144A3289J447J908L6386k259n1422l9188j3112L3020K3446J1685J9075R633
13132D3908k31P696k2325k8273K590N822j9049J2345J4715R215K003M2966L1944
13119A03326J6271j3668k3161k9762q094P149R081J5421k0360p457L636P274N787
$$ plain form
13106 65443 68603 71035 68322 93330 94475 89963 86340 73300 40258 27460 4161 -15198 -14722
13093 -14722 41 6832 30258 24783 4269 -12051 -23249 -29514 -32146 -12474 -2161 -16896
13081 -16896 -22064 3316 -20503 -32012 -29284 -419 14167 9556 20126 3655 -6151 1540 26035
13068 26035 24723 48123 -5401 -36532 -31532 1002 7647 -6466 -16486 1911 39697 27517
13056 27517 -871 5903 44901 49460 41031 41256 26635 6285 2086 6497 16075 55535 47338
13043 47338 6171 -19279 4970 37965 56505 25312 -25109 -32502 -5518 28151 75369 74713
13031 74713 50911 64146 101272 103884 95680 60628 43315 29390 22599 49562 77443 52426
13019 52426 46812 53004 61113 64683 51855 62171 97379 94138 63625 37716 29270 41708 59883
$$ packed form
13106F5443L160K432k713K5008J145m512l623j3040l3042j2798k3299j9359M76
13093a4722J4763O791K3426n475k0514j6320j1198o265k632J9672J0313j4735
13081a6896n168K5380k3819j1509K728K8865J4586m611J0570j6471r806P691K4495
13068B6035j312K3400n3524l1131N000L2534O645j4113j0020J8397L7786j2180
13056B7517k8388O774L8998M559q429K25j4621k0350m199M411R578L9460q197
13043D7338m1167k5450K4249L2995J8540l1193n0421p393K6984L3669M7218o56
13031G4713k3802J3235L7126K612q204l5052j7313j3925o791K6963K7881k5017
13019E2426n614O192Q109L570j2828J0316L5208l241l0513k5909q446J2438J8175
$$ plain form
13006 59883 62893 58706 55189 79539 111717 111011 85507 92315 130773 177592 190336 173796 147469
12993 147469 142045 134908 134355 121376 121146 149257 192593 190526 165438 144005 137228 134971 137113
12980 137113 119784 96652 89001 77311 84182 101744 107410 103541 112694 97521 85119 93406 89470
12967 89470 85698 90046 94296 113270 116986 147299 148336 150825 152426 157297 164852 170539 163417 131372
12953 131372 107820 108187 82253 65442 56793 54918 37405 32684 27716 61407 73574 54408 55557
12940 55557 75632 97878 139028 127935 100503 80239 92543 108300 125210 165105 208929 220612
12928 220612 217903 237309 279649 307310 400222 560642 700742 890383 1156914 1478015 1794549
12917 1794549 1996793 2130384 2210120 2250011 2292382 2261536 2057844 1795845 1523735 1262417
$$ packed form
13006E9883L010m187l517K4350L2178p06k5504O808L8458M6819J2744j6540k6327
12993A47469n424p137n53j2979k30K8111M3336k067k5088k1433o777k257K142
12980A37113j7329k3132p651j1690O871J7562N666l869R153j5173j2402Q287l936
12967H9470l772M348M250J8974L716L0313J037K489J601M871P555N687p122l2045
12953A31372k3552L67k5934j6811q649j875j7513m721m968L3691J2167j9166J149
12940E5557K0075K2246M1150j1093k7432k0264J2304J5757J6910L9895M3824J1683
12928B20612k709J9406M2340K7661R2912J60420J40100J89641K66531L21101L16534
12917A794549K02244J33591P9736L9891M2371l0846k03692k61999k72110k61318
$$ plain form
12907 1262417 1010202 819802 680796 591513 493652 429832 416016 384575 342170 311299 315199
12896 315199 294610 270173 222139 193003 180133 137187 107724 65641 80271 83572 96641 102402
12884 102402 110273 117732 120874 144017 161471 158116 107982 104199 102192 92107 68191 61617 75068
12871 75068 104602 119263 112465 81270 68054 64997 40317 35586 17090 -696 9924 -5815
12859 -5815 8401 39579 49285 46049 32688 37769 50500 42234 5684 -21738 -16099 -12387 3966
12846 3966 22136 2680 -5610 27849 31702 3028 -3456 12866 55364 52937 48359 67882 66533
12833 66533 65716 60936 63485 48084 44888 29438 24916 35566 53263 71579 78424 59248 18774
12820 18774 13239 12150 52871 81054 80108 100811 72898 76144 53782 53815 73645 65548 53607
$$ packed form
12907A262417k52215j90400j39006q9283r7861o3820j3816l1441m2405l0871L900
12896C15199k0589k4437m8034k9136j2870m2946k9463m2083J4630L301J3069N761
12884A02402P871P459L142K3143J7454l355n0134l783k007j0085k3916o574J3451
12871G5068K9534J4661o798l1195j3216l057k4680m731j8496j7786J0620j5739
12859e815J4216L1178R706l236j3361N081J2731q266l6550k7422N639L712J6353
12846C966J8170j9456q290L3459L853k8674o484J6322M2498k427m578J9523j349
12833F6533q17m780K549j5401l196j5450m522J0650J7697J8316O845j9176m0474
12820A8774n535j089M0721K8183r46K0703k7913L246k2362L3J9830q097j1941
$$ plain form
12807 53607 23548 26327 45305 89547 86490 57053 56538 66317 71386 78110 91874 122399 130214
12794 130214 121769 100504 97859 105814 83257 53889 19988 6079 23448 23550 14330 7905 5979
12781 5979 19038 35287 29177 22137 7049 -6734 7977 24914 25816 51949 92723 118181 139936
12768 139936 181286 228315 322546 464479 567063 660671 689358 693176 646727 565907 514236
12757 514236 447533 359408 293454 250383 222104 213846 234862 280269 287307 318872 324982 342994
12745 342994 393782 406628 377524 389231 366420 292255 234385 194692 152503 139006 116414
12734 116414 118348 108365 116554 110720 122660 137986 141789 124520 99712 88347 69350 58595
12722 58595 68562 60400 60556 85795 66774 25623 116 -17941 -7104 -2140 -14864 -26459 -47963
$$ packed form
12807E3607l0059K779J8978M4242l057k9437n15R779N069O724J3764L0525P815
12794A30214q445k1265k645P955k2557k9368l3901j3909J7369J02r220o425j926
12781E979J3059J6249o110p040j5088j3783J4711J6937R02K6133M0774K5458K1755
12768A39936M1350M7029R4231J41933J02584R3608K8687L818m6449q0820n1671
12757E14236o6703q8125o5954m3071k8279q258K1016M5407P038L1565O110J8012
12745C42994N0788J2846k9104J1707k2811p4165n7870l9693m2189j3497k2592
12734A16414J934r983Q189n834J1940J5326L803j7269k4808j1365j8997j0755
12722E8595R967q162J56K5239j9021m1151k5507j8057J0837M964j2724j1595k1504
$$ plain form
12709 -47963 -36633 -37482 -29299 -32217 -35051 -28617 -50197 -70328 -86131 -82293 -65965 -61169 -72241
12696 -72241 -74794 -85010 -63575 -44133 -4781 24433 31014 29196 20593 29559 54375 84303 88995
12683 88995 86179 157186 177342 194336 214986 242183 286340 311823 267158 265533 264315 279022
12671 279022 300940 297781 296041 297529 293877 270316 248616 217599 194243 170339 160704 182672
12659 182672 178311 147002 139200 168379 183187 221310 232092 224383 206512 222991 233575 236052
12647 236052 205093 231129 238258 202906 200201 229428 244266 262666 274782 260254 240588 256423
12635 256423 287587 306235 298631 263009 254079 268362 308995 308924 297459 292884 314717 349559 427298
12622 427298 503502 568554 617979 673899 716639 775153 814490 828444 811705 810419 783863 730094
$$ packed form
12709d7963J1330q49Q183k918k834O434k1580k0131j5803L838J6328M796j1072
12696g2241k553j0216K1435J9442L9352K9214O581j818q603Q966K4816K9928M692
12683H8995k816P1007K0156J6994K0650K7197M4157K5483m4665j625j218J4707
12671B79022K1918l159j740J488l652k3561k1700l1017k3356k3904r635K1968
12659A82672m361l1309p802K9179J4808L8123J0782p709j7871J6479J0584K477
12647B36052l0959K6036P129l5352k705K9227J4838J8400J2116j4528j9666J5835
12635B56423L1164J8648p604l5622q930J4283M0633p1j1465m575K1833L4842P7739
12622D27298P6204O5052M9425N5920M2740N8514L9337J3954j6739j286k6556n3769
$$ plain form
12610 730094 683105 664501 644526 615989 577102 543165 509654 486782 468605 458456 467014 468679
12598 468679 490662 523313 534429 518700 553954 579410 576513 573293 573481 583130 616858 644332
12586 644332 688370 693449 660801 648929 644628 643033 659740 657528 662853 654809 642552 649562 658516
12573 658516 692462 697418 675406 665798 681276 717537 728724 759061 772017 805695 809736 826131
12561 826131 842270 853615 856038 862327 892213 932435 980142 1008010 1034990 1064989 1083439 1123655
12549 1123655 1183675 1240894 1305024 1393466 1486795 1573766 1656773 1765173 1889630 2012894 2138019
12538 2138019 2291498 2428810 2589903 2722127 2854249 2998369 3159134 3318497 3461039
12529 3461039 3615456 3803530 4007952 4269337 4558460 4855470 5181809 5540397 5942913
$$ packed form
12610G30094m6989j8604j9975k8537l8887l3937l3511k2872j8177j0149Q558J665
12598D68679K1983L2651J1116j5729L5254K5456k897l220J88R649L3728K7474
12586F44332M4038N079l2648j1872m301j595J6707k212N325q044j2257P010Q954
12573F58516L3946M956k2012r608J5478L6261J1187L0337J2956L3678M041J6395
12561H26131J6139J1345K423O289K9886M0222M7707K7868K6980K9999J8450M0216
12549A123655O0020N7219O4130Q8442R3329Q6971Q3007J08400J24457J23264J25125
12538B138019J53479J37312J61093J32224J32122J44120J60765J59363J42542
12529C461039J54417J88074K04422K61385K89123K97010L26339L58588M02516
$$ plain form
12520 5942913 6441965 7046653 7696154 8383435 9146569 10075124 11224925 12659504 14480921
12511 14480921 16765553 19544668 22683688 25875597 29165308 32864647 37424528 43163621
12503 43163621 50303820 59444665 71982723 90439869 118635097 161553673 222583790
12496 222583790 294955559 357576806 392074251 403788718 414300716 432776234 445892107
12489 445892107 434299416 393823421 338348801 282181879 229657267 183061439 146414625
12482 146414625 120231952 101946761 88759471 78686276 70718685 64401971 59275233
12475 59275233 54687705 50227700 45847264 41699742 37913317 34496310 31363023 28601598
12467 28601598 26242799 24226780 22490996 20990347 19727206 18666412 17764090 16955785
$$ packed form
12520E942913M99052O04688O49501O87281P63134R28555J149801J434579J821417
12511A4480921K284632K779115L139020L191909L289711L699339M559881N739093
12503D3163621P140199R140845J2538058J8457146K8195228M2918576O1030117
12496B22583790P2371769O2621247L4497445J1714467J0511998J8475518J3115873
12489D45892107j1592691m0475995n5474620n6166922n2524612m6595828l6646814
12482A46414625k6182673j8285191j3187290j0073195p967591o316714n126738
12475E9275233m587528m460005m380436m147522l786425l417007l133287k761425
12467B8601598k358799k016019j735784j500649j263141j060794r02322q08305
$$ plain form
12459 16955785 16183716 15446435 14758586 14123429 13480697 12803063 12118807 11423051 10792175
12450 10792175 10232377 9717249 9286887 8896084 8582593 8343882 8157731 7948356 7724314
12441 7724314 7509825 7334109 7135472 6929260 6713953 6443936 6162735 5889346 5649929
12432 5649929 5433214 5175320 4942609 4751211 4584051 4443452 4330688 4209071 4095494
12423 4095494 3955301 3803988 3646753 3535070 3409629 3296088 3222959 3146534 3046799 2971514
12413 2971514 2887003 2792017 2728162 2683401 2620330 2572459 2545216 2452292 2380139 2333797 2285206
12402 2285206 2222690 2169492 2127698 2086457 2018738 1939679 1901151 1902883 1863744 1815813 1764607
12391 1764607 1720295 1702607 1675223 1690231 1734857 1771715 1783491 1790499 1773755 1717114 1663977
$$ packed form
12459A6955785p72069p37281o87849o35157o42732o77634o84256o95756o30876
12450A0792175n59798n15128m30362l90803l13491k38711j86151k09375k24042
12441G724314k14489j75716j98637k06212k15307k70017k81201k73389k39417
12432E649929k16715k57894k32711j91398j67160j40599j12764j21617j13577
12423D095494j40193j51313j57235j11683j25441j13541p3129p6425r9735p5285
12413B971514q4511r4986o3855m4761o3071m7871k7243r2924p2153m6342m8591
12402B285206o2516n3198m1794m1241o7719p9059l8528J732l9139m7931n1206
12391A764607m4312j7688k7384J5008M4626L6858J1776P008j6744n6641n3137
$$ plain form
12380 1663977 1623252 1590910 1532602 1471933 1365474 1264356 1200853 1143195 1100472 1053294 975588
12369 975588 940161 946081 977111 1006528 1001274 972688 939353 964047 1046138 1083793 1095656 1105622
12357 1105622 1124554 1130682 1130043 1121282 1105295 1066496 1029536 1001736 958793 898552 873002 831461
12345 831461 821397 804229 787002 803390 816281 830304 837218 840954 819518 819672 814204 808195 749678
12332 749678 714873 685697 631605 627815 640303 630441 602541 593610 587083 552960 524285 534407
12320 534407 544305 535542 493943 435739 398783 377399 311830 268084 218787 203470 223331 267976
12308 267976 297919 309287 319986 331394 349019 388966 436165 479444 526253 538535 581505
12297 581505 604669 596473 598916 595215 598824 578275 581784 584636 568602 535203 505584 479761 473607
$$ packed form
12380A663977m0725l2342n8308o0669j06459j01118o3503n7658m2723m7178p7706
12369I75588l5427N920L1030K9417n254k8586l3335K4694Q2091L7655J1863R966
12357A105622J8932O128o39q761j5987l8799l6960k7800m2943o0241k5550m1541
12345H31461j0064j7168j7227J6388J2891J4023O914L736k1436J54n468o009n8517
12332G49678l4805k9176n4092l790J2488r862k7900q931o527l4123k8675J0122
12320E34407R898q763m1599n8204l6956k1384o5569m3746m9297j5317J9861M4645
12308B67976K9943J1368J0699J1408J7625L9947M7199M3279M6809J2282M2970
12297E81505K3164q196K443l701L609k0549L509K852j6034l3399k9619k5823o154
$$ plain form
12284 473607 444600 434487 438834 428960 420212 392766 399098 403572 390446 387681 433332 444550 423981
12271 423981 400775 389438 403704 373778 353058 319417 298432 294006 302783 289544 260733 236751
12259 236751 243336 231951 204120 183391 184325 179941 191915 200654 188607 193653 228982 246873 237805
12246 237805 246177 220180 199668 184582 174185 180720 200575 208825 220158 219703 215407 223405 234415
12233 234415 207237 174023 168037 176960 160589 172413 213124 238268 210020 187403 166925 180682
12221 180682 184106 178294 188238 210806 192939 189388 173823 119656 110146 133394 148100 152266 165652
12208 165652 147596 167485 171043 162143 162883 176843 198343 202735 207003 214445 183379 188165 200742
12195 200742 203173 218440 252723 284921 316964 347757 406344 432030 452589 474117 481953 509963
$$ packed form
12284D73607k9007j0113M347r874q748k7446O332M474j3126k765M5651J1218k0569
12271D23981k3206j1337J4266k9926k0720l3641k0985m426Q777j3239k8811k3982
12259B36751O585j1385k7831k0729R34m384J1974Q739j2047N046L5329J7891r068
12246B37805Q372k5997k0512j5086j0397O535J9855Q250J1333m55m296P998J1010
12233B34415k7178l3214n986Q923j6371J1824M0711K5144k8248k2617k0478J3757
12221A80682L424n812R944K2568j7867l551j5565n4167r510K3248J4706M166J3386
12208A65652j8056J9889L558q900P40J3960K1500M392M268P442l1066M786J2577
12195B00742K431J5267L4283L2198L2043L0793N8587K5686K0559K1528P836K8010
$$ plain form
12183 509963 505097 484243 471440 428333 374719 347104 341376 308618 277248 266489 243730 220722
12171 220722 210858 197144 212697 236607 220823 204202 208270 232686 241177 232452 229004 234945 231883
12158 231883 233866 227382 205266 215091 226662 225933 241384 248425 250667 277781 288866 321635 358707
12145 358707 377783 450489 492311 527220 539175 522225 500806 457968 433010 398407 379884
12134 379884 368650 331582 293275 289652 295228 310356 301497 286717 260993 239905 201248 194225
12122 194225 195546 184433 204691 226810 226740 224785 204834 188270 195676 218375 250174 237387 192773
12109 192773 198252 203046 229445 288381 339486 383946 428809 448187 427090 414775 386966 381758
12097 381758 363599 323334 301469 283407 253667 232733 246961 254613 239520 227501 263417 276179
$$ packed form
12183E09963m866k0854j2803m3107n3614k7615n728l2758l1370j0759k2759k3008
12171B20722r864j3714J5553K3910j5784j6621M068K4416Q491q725l448N941l062
12158B31883J983o484k2116R825J1571p29J5451P041K242K7114J1085L2769L7072
12145C58707J9076P2706M1822L4909J1955j6950k1419m2838k4958l4603j8523
12134C79884j1234l7068l8307l623N576J5128q859j4780k5724k1088l8657p023
12122A94225J321j1113K0258K2119p0j955j9951j6564P406K2699L1799j2787m4614
12109A92773N479M794K6399N8936N1105M4460M4863J9378k1097j2315k7809n208
12097C81758j8159m0265k1865j8062k9740k0934J4228P652j5093j2019L5916J2762
$$ plain form
12085 276179 263112 269495 263213 259695 244649 276222 329659 363395 393002 393308 399645 431525 449045
12072 449045 466363 585300 750347 924805 1163892 1454139 1776811 2043144 2178161 2237223
12062 2237223 2302233 2390535 2425945 2310125 2101951 1831141 1559442 1333109 1145261 970480
12052 970480 870170 798321 733137 681020 643123 619445 582579 541698 507624 479251 460809
12041 460809 427999 394725 359295 357889 339764 336205 328162 310678 321975 300894 290488 302578
12029 302578 299284 272056 228022 228036 229067 205872 180098 181302 161923 167247 154543 144918 138299
12016 138299 137004 136505 136661 141701 105057 109234 105943 93390 98234 104205 109227 125415 130754 133501
12002 133501 139107 128405 99066 94229 103954 136478 128162 127072 95078 73728 62447 107005
$$ packed form
12085B76179j3067O383o282l518j5046L1573N3437L3736K9607L06O337L1880J7520
12072D49045J7318J18937J65047J74458K39087K90247L22672K66333J35017N9062
12062B237223O5010Q8302L5410j15820k08174k70810k71699k26333j87848j74781
12052I70480j00310p1849o5184n2117l7897k3678l6866m0881l4074k8373j8442
12041D60809l2810l3274l5430j406j8125l559q043j7484J1297k1081j0406J2090
12029C02578l294k7228m4034J4J031k3195k5774J204j9379N324j2704r625o619
12016A38299j295m99J56N040l6644M177l291j2553M844N971N022J6188N339K747
12002A33501N606j0702k9339m837R725L2524q316j090l1994k1350j1281M4558
$$ plain form
11990 107005 133775 131419 125665 128624 134067 123691 112796 141575 148877 140841 133681 158633 157354
11977 157354 103878 89644 121995 144129 162203 139895 142955 164277 178908 168668 172198 217603
11965 217603 261476 335548 437596 535097 626199 729881 806908 814192 785437 726787 627500
11954 627500 521630 427844 363610 332813 309349 286804 244357 183896 135079 104418 131596
11943 131596 164377 136196 111608 128560 97888 96363 141911 131662 136124 144473 149414 139933
11931 139933 146223 153043 174215 215737 229012 218028 264325 310876 366728 454023 556506 683622
11919 683622 815302 876548 862351 784220 696768 603369 527608 441965 394434 331763 278693
11908 278693 252724 226435 204629 159762 173467 159105 166530 164856 146281 145469 143563 137754 123727
$$ packed form
11990A07005K6770k356n754K959N443j0376j0895K8779P302q036p160K4952j279
11977A57354n3476j4234L2351K2134J8074k2308L060K1322J4631j0240L530M5405
11965B17603M3873P4072J02048R7501R1102J03682P7027P284k8755n8650r9287
11954F27500j05870r3786o4234l0797k3464k2545m2447o0461m8817l0661K7178
11943A31596L2781k8181k4588J6952l0672j525M5548j0249M462Q349M941r481
11931A39933O290O820K1172M1522J3275j0984M6297M6551N5852Q7295J02483J27116
11919F83622J31680O1246j4197p8131q7452r3399p5761q5643m7531o2671n3070
11908B78693k5969k6289k1806m4867J3705j4362P425j674j8575q12j906n809j4027
$$ plain form
11895 123727 127156 134301 167816 161280 139656 113612 107980 116084 127580 121174 123425 127038 88872
11882 88872 83715 103157 124020 103707 88077 103343 112224 97088 92290 106247 112719 105928 128051
11869 128051 131366 98002 97301 93869 93548 138705 141956 151960 145055 129017 136457 131051 116638
11856 116638 127419 141574 117031 116483 106083 88123 84622 85428 100738 126353 136727 159123
11844 159123 151300 140257 120107 114255 113137 132462 174930 186647 168626 158470 164033 192987
11832 192987 201843 205630 204728 198895 183424 176043 152743 139963 136202 145434 153343 149469 174612
11819 174612 194333 166157 151925 170254 212058 236534 206189 177312 171868 168690 177258 175976
11807 175976 162726 148625 141158 148821 124422 117297 126402 96538 95800 101780 108773 104027 116590
$$ packed form
11895A23727L429P145L3515o536k1624k6044n632Q104J1496o406K251L613l8166
11882H8872n157J9442K0863k0313j5630J5266Q881j5136m798J3957O472o791K2123
11869A28051L315l3364p01l432l21M5157L251J0004o905j6038P440n406j4413
11856A16638J0781J4155k4543n48j0400j7960l501Q06J5310K5615J0374K2396
11844A59123p823j1043k0150n852j118J9325M2468J1717j8021j0156N563K8954
11832A92987Q856L787r02n833j5471p381k3300j2780l761R232P909l874K5143
11819A74612J9721k8176j4232J8329M1804K4476l0345k8877n444l178Q568j282
11807A75976j3250j4101p467P663k4399p125R105k9864p38N980O993m746J2563
$$ plain form
11794 116590 136241 156969 144422 129887 132091 135937 142507 131391 101638 83358 106501 139322
11782 139322 164810 139140 96485 111708 122445 148422 165369 184773 188740 158066 142935 173987
11770 173987 185548 188512 187950 171179 149297 117401 135356 152614 129468 133652 119253 97316
11758 97316 88920 81409 110006 140552 176583 205629 222830 248636 266304 246004 218309 203934
11746 203934 203180 227213 240565 243401 227297 195063 165987 167568 175936 176835 162323 142106 156506
11733 156506 170967 155811 146713 141114 134804 162264 182079 182046 160907 137540 125199 125063 158749
11720 158749 188269 184720 177445 183237 171862 209443 197182 184833 171380 183409 194150 207684
11708 207684 199866 184346 203859 217887 208777 186686 155053 147703 140331 146783 152868 173748 192328
$$ packed form
11794A16590J9651K0728j2547j4535K204L846O570j1116k9753j8280K3143L2821
11782A39322K5488k5670m2655J5223J0737K5977J6947J9404L967l0674j5131L1052
11770A73987J1561K964n62j6771k1882l1896J7955J7258k3146M184j4399k1937
11758I7316q396p511K8597L0546L6031K9046J7201K5806J7668k0300k7695j4375
11746B03934p54K4033J3352K836j6104l2234k9076J581Q368Q99j4512k0217J4400
11733A56506J4461j5156r098n599o310K7460J9815l3k1139k3367j2341j36L3686
11720A58749K9520l549p275N792j1375L7581j2261j2349j3453J2029J0741J3534
11708B07684p818j5520J9513J4028r110k2091l1633p350p372O452O085K0880J8580
$$ plain form
11695 192328 187634 192981 216011 238725 258090 292518 280861 244876 220737 191533 206347 182293
11683 182293 159331 167601 147675 110325 150543 163523 179104 178102 191908 179885 152856 140008
11671 140008 152006 166497 145680 134786 165229 173961 178543 205899 215290 202093 215217 212917
11659 212917 199190 195537 220292 236379 255296 263819 262692 287264 308467 291615 284728 300375
11647 300375 306835 313119 303577 278015 266330 248348 253950 263893 242832 244227 217048 201894 226550
11634 226550 237222 257342 299889 339528 328544 319985 306726 313910 350398 375101 354948 323394
11622 323394 338181 341446 319235 333469 332582 293290 279954 294478 314394 314078 313075 308216 319539
11609 319539 359382 398235 437224 473440 498851 533225 555126 535055 521428 508887 502815 516080
$$ packed form
11695A92328m694N347K3030K2714J9365L4428j1657l5985k4139k9204J4814k4054
11683A82293k2962Q270j9926l7350M0218J2980J5581j002J3806j2023k7029j2848
11671A40008J1998J4491k0817j0894L0443Q732M582K7356R391j3197J3124k300
11659B12917j3727l653K4755J6087J8917Q523j127K4572K1203j6852o887J5647
11647C00375O460O284r542k5562j1685j7982N602R943k1061J395k7179j5154K4656
11634B26550J0672K0120M2547L9639j0984q559j3259P184L6488K4703k0153l1554
11622C23394J4787L265k2211J4234q87l9292j3336J4524J9916l16j003m859J1323
11609C19539L9843L8853L8989L6216K5411L4374K1901k0071j3627j2541o072J3265
$$ plain form
11597 516080 517753 511662 512165 509489 509513 507832 492379 446211 436942 430095 411438 397237 355476 338209
11583 338209 335756 323941 334920 388781 422943 408627 400708 394493 394170 358720 365031 378977 404562
11570 404562 393315 397104 382227 373994 358006 344404 354351 340388 370886 397649 381205 394049
11558 394049 365403 329150 339889 339116 341435 360321 370372 377601 368692 364416 400228 426880 438153
11545 438153 432910 441653 406780 378445 378712 382623 398623 410366 417984 419104 435972 477551 492191
11532 492191 512135 544527 549240 534384 535245 571601 599295 583687 550226 534298 552150 548840
11520 548840 513480 496244 476500 480223 483706 451022 447116 441889 418531 410467 375787 366745 362396
11507 362396 382980 381648 377577 378597 384958 398797 408676 395043 367260 334291 344530 315444
$$ packed form
11597E16080J673o091N03k676K4j681j5453m6168r269o847j8657j4201m1761j7267
11583C38209k453j1815J0979N3861L4162j4316p919o215l23l5450O311J3946K5585
11570D04562j1247L789j4877q233j5988j3602R947j3963L0498K6763j6444J2844
11558C94049k8646l6253J0739p73K319J8886J0051P229q909m276L5812K6652J1273
11545D38153n243Q743l4873k8335K67L911J6000J1743P618J120J6868M1579J4640
11532D92191J9944L2392M713j4856Q61L6356K7694j5608l3461j5928J7852l310
11520E48840l5360j7236j9744L723L483l2684l906n227k3358q064l4680r042m349
11507C62396K0584j332m071J020O361J3839R879j3633k7783l2969J0239k9086
$$ plain form
11495 315444 275630 281661 310720 303844 272647 254592 228850 203434 201901 192542 180744 169371
11483 169371 166244 175430 182341 178656 183262 188513 152752 128521 132299 163757 141878 130080 133746
11470 133746 131195 130899 147115 161965 165331 195551 217580 185092 177486 189361 201429 183303
11458 183303 176257 195502 204147 200228 199767 208905 163039 121556 134582 136879 138587 147317 160539
11445 160539 172539 188505 201684 220140 230115 223477 195624 191679 212330 186940 161950 160308
11433 160308 167924 190478 193807 214188 211414 191071 166924 191756 195791 193099 184583 170605 189058
11420 189058 190402 221658 216216 199440 192190 179601 187101 192647 194750 184085 187536 184218 185583
11407 185583 181971 180219 171675 210090 221753 193084 160644 175505 150768 130871 153307 163855
$$ packed form
11495C15444l9814O031K9059o876l1197j8055k5742k5416j533r359j1798j1373
11483A69371l127R186O911l685M606N251l5761k4231L778L1458k1879j1798L666
11470A33746k551k96J6216J4850L366L0220K2029l2488p606J1875J2068j8126
11458A83303p046J9245Q645l919m61R138m5866m1483J3026K297J708Q730J3222
11445A60539J2000J5966J3179J8456R975o638k7853l945K0651k5390k4990j642
11433A60308P616K2554L329K0381k774k0343k4147K4832M035k692q516j3978J8453
11420A89058J344L1256n442j6776p250j2589P500N546K103j0665L451l318J365
11407A85583l612j752q544L8415J1663k8669l2440J4861k4737j9897K2436J0548
$$ plain form
11395 163855 167876 178140 191116 197715 204543 175640 172991 195034 201489 228894 235975 243266 249900
11382 249900 250012 241912 248929 248845 220917 216804 234198 242480 248735 265608 264763 271641 302951 330327
11368 330327 333605 330095 355630 361493 337037 326137 364045 402132 400572 409720 448463 450339 440536
11355 440536 453386 510234 570817 603593 579716 594725 627862 658102 683373 715303 718298 724199
11343 724199 728045 723164 688106 688182 704871 739589 753010 772561 819705 826108 827329 847740 896234
11330 896234 922275 975308 1075513 1191780 1343588 1530404 1635738 1609819 1532379 1464500
11320 1464500 1402151 1383289 1367054 1353362 1343111 1295596 1279280 1285809 1302538 1304196 1273779 1268292
11308 1268292 1280902 1283780 1284633 1295641 1317178 1317554 1316496 1327943 1368977 1379463 1396008 1414191
$$ packed form
11395A63855M021J0264J2976O599O828k8903k649K2043O455K7405P081P291O634
11382B49900J12q100P017q4k7928m113J7394Q282O255J6873q45O878L1310K7376
11368C30327L278l510K5535N863k4456j0900L7908L8087j560R148L8743J876r803
11355D40536J2850N6848O0583L2776k3877J5009L3137L0240K5271L1930K995N901
11343G24199L846m881l5058P6J6689L4718J3421J9551M7144O403J221K0411M8494
11330H96234K6041N3033J00205J16267J51808J86816J05334k5919p7440o7879
11320A464500o2349j8862j6235j3692j0251m7515j6316O529J6729J658l0417n487
11308A268292J2610K878Q53J1008K1537L76j058J1447M1034J0486J6545J8183
$$ plain form
11296 1414191 1441474 1462547 1526945 1526859 1548609 1589217 1623822 1651736 1647276 1654578 1652655 1677349
11284 1677349 1691325 1698139 1692018 1700252 1681656 1659032 1696201 1738626 1738268 1745283 1708312 1699537 1723213
11271 1723213 1763631 1778939 1793283 1822584 1870394 1902201 1909590 1927687 1966729 1987067 1976211
11260 1976211 2002315 2011354 2000625 2022031 2012153 2015386 2038126 2048274 2072290 2091462 2126317 2173820
11248 2173820 2219398 2265016 2279119 2290365 2324232 2354797 2368479 2401781 2433724 2444952 2466861
11237 2466861 2507848 2560235 2600386 2630353 2681709 2738280 2803665 2856586 2898067 2983707 3101822
11226 3101822 3243918 3352099 3482846 3652230 3821043 3984540 4194898 4429823 4663011
11217 4663011 4922328 5173311 5518449 5899157 6351892 6843971 7418126 8116862 8927187
$$ packed form
11296A414191K7283K1073O4398q6K1750M0608L4605K7914m460P302j923K4694
11284A677349J3976O814o121Q234j8596k2624L7169M2425l58P015l6971q775K3676
11271A723213M0418J5308J4344K9301M7810L1807P389J8097L9042K0338j0856
11260A976211K6104R039j0729K1406r878L233K2740J0148K4016J9172L4855M7503
11248B173820M5578M5618J4103J1246L3867L0565J3682L3302L1943J1228K1909
11237B466861M0987N2387M0151K9967N1356N6571O5385N2921M1481Q5640J18115
11226C101822J42096J08181J30747J69384J68813J63497K10358K34925K33188
11217D663011K59317K50983L45138L80708M52735M92079N74155O98736Q10325
$$ plain form
11208 8927187 9853637 11017123 12443549 14120128 16119617 18385983 20951758 23709866
11200 23709866 26507456 29131400 31506824 33487049 35031186 36131953 36871942 37237550
11192 37237550 37239461 36890954 36209904 35215228 33971541 32640123 31346876 30276073 29604130
11183 29604130 29384222 29790171 30855096 32619005 35154954 38448705 42476134 47088583
11175 47088583 52117090 57300657 62295674 66707456 70161153 72450173 73464761 73262898
11167 73262898 72071964 70128222 67628621 64687940 61487448 58110390 54666706 51247423
11159 51247423 47982264 44992197 42418771 40298491 38756151 37780510 37387851 37558314
11151 37558314 38253496 39360197 40708467 42107689 43384979 44399961 45085544 45401390
$$ packed form
11208H927187R26450J163486J426426J676579J999489K266366K565775K758108
11200B3709866K797590K623944K375424J980225J544137J100767P39989L65608
11192C7237550J911l48507o81050r94676j243687j331418j293247j070803o71943
11183B9604130k19908M05949J064925J763909K535949L293751M027429M612449
11175D7088583N028507N183567M995017M411782L453697K289020J014588k01863
11167G3262898j190934j943742k499601k940681l200492l377058l443684l419283
11159E1247423l265159k990067k573426k120280j542340r75641l92659J70463
11151C7558314O95182J106701J348270J399222J277290J014982O85583L15846
$$ plain form
11143 45401390 45417084 45225779 44945790 44616282 44271616 43968664 43685409 43412825 43146203
11134 43146203 43016898 43028408 43181842 43489403 43944877 44380331 44823720 45292784 45772948
11125 45772948 46327117 46949918 47598017 48129484 48501176 48562151 48189197 47348020 46104372
11116 46104372 44583942 42985677 41492378 40304660 39567882 39374113 39772147 40841489
11108 40841489 42583551 45008358 47993577 51452859 55271687 59275077 63352919 67455600
11100 67455600 71546097 75522961 79176335 82234642 84331678 85153882 84457947 82262934
11092 82262934 78700133 74108255 68883403 63452792 58147343 53250668 48904636 45260369
11084 45260369 42373952 40263078 38949090 38369235 38473849 39166964 40246016 41574121
$$ packed form
11143D5401390J5694j91305k79989l29508l44666l02952k83255k72584k66622
11134D3146203j29305J1510J53434L07561M55474M35454M43389M69064M80164
11125D5772948N54169O22801O48099N31467L71692O0975l72954q41177j243648
11116D6104372j520430j598265j493299j187718p36778j93769L98034J069342
11108D0841489J742062K424807K985219L459282L818828M003390M077842M102681
11100F7455600M090497L976864L653374L058307K097036Q22204o95935k195013
11092H2262934l562801m591878n224852n430611n305449m896675m346032l644267
11084D5260369k886417k110874j313988n79855J04614O93115J079052J328105
$$ plain form
11076 41574121 42989853 44280770 45357535 46182787 46775899 47109708 47082408 46617681 45633260
11067 45633260 44018797 41819859 39075633 35955344 32698497 29511857 26480568 23708839
11059 23708839 21277268 19148993 17336788 15779643 14418900 13231657 12196292 11283087
11051 11283087 10459258 9747487 9103702 8544849 8013751 7549686 7125564 6759647 6430884
11042 6430884 6101985 5805749 5514542 5261447 5020699 4799566 4590530 4404732 4224192
11033 4224192 4034324 3848357 3709626 3581745 3464484 3345158 3235054 3129508 3031062 2950092
11023 2950092 2867017 2779915 2713622 2656789 2564087 2452250 2389587 2342349 2271186 2187593 2120387
11012 2120387 2104521 2059590 2006957 1945665 1885815 1800828 1749053 1703309 1664602 1672787 1655882
$$ packed form
11076D1574121J415732J290917J076765Q25252N93112L33809k7300m64727r84421
11067D5633260j614463k198938k744226l120289l256847l186640l031289k771729
11059B3708839k431571k128275j812205j557145j360743j187243j035365r13205
11051A1283087q23829p11771o43785n58853n31098m64065m24122l65917l28763
11042F430884l28899k96236k91207k53095k40748k21133k09036j85798j80540
11033D224192j89868j85967j38731j27881j17261j19326j10104j05546r8446q0970
11023B950092q3075q7102o6293n6833r2702j11837o2663m7238p1163q3593o7206
11012B120387j5866m4931n2633o1292n9850q4987n1775m5744l8707Q185j6905
$$ plain form
11001 1655882 1616799 1585230 1532602 1470462 1456251 1454290 1441403 1414125 1388206 1362366 1357129 1337369
10989 1337369 1317588 1296475 1266378 1254204 1193996 1149357 1145862 1132584 1125293 1122898 1079037 1090432
10977 1090432 1102123 1087170 1100320 1134699 1180332 1249579 1263487 1223283 1147469 1106360 1063904
10966 1063904 1001227 953064 943452 934793 958502 970554 948387 947497 964839 1007890 1020785 943186
10954 943186 892590 882778 830470 795414 783160 763667 757229 752143 758704 719816 702859 703730 754899
10941 754899 775850 767600 801209 817199 800349 777856 756594 715885 701030 706926 686875 658873
10929 658873 644520 612806 566963 547986 543089 555638 582148 598381 623652 626472 617880 575156
10917 575156 532952 529223 550913 520406 516055 522895 526525 523514 547398 538080 488426 495295 495344
$$ packed form
11001A655882l9083l1569n2628o2140j4211j961j2887k7278k5919k5840n237j9760
10989A337369j9781k1113l0097j2174o0208m4639l495j3278p291k395m3861J1395
10977A090432J1691j4953J3150L4379M5633O9247J3908m0204p5814m1109m2456
10966A063904o2677m8163r612q659K3709J2052k2167q90J7342M3051J2895p7599
10954I43186n0596r812n2308l5056j2254j9493o438n086O561l8888j6957Q71N1169
10941G54899K0951q250L3609J5990j6850k2493k1262m0709j4855N896k0051k8002
10929F58873j4353l1714m5843j8977m897J2549K6510J6233K5271K820q592m2724
10917E75156m2204l729K1690l0507m351O840L630l011K3884r318m9654O869M9
$$ plain form
10904 495344 511308 530202 526492 542068 588827 637960 679056 709565 743032 825203 929860
10893 929860 1010913 1041075 990915 929717 863486 797807 748255 714338 712940 714254 719934 725168
10881 725168 743635 769582 760801 715049 659570 628772 603666 575973 536676 505305 491243 482415
10869 482415 445724 419776 412841 419472 427829 427805 415512 413626 411202 429542 440432 472021 491951
10856 491951 505486 506954 522057 557938 588542 632817 696999 782249 865616 898974 870417 802456
10844 802456 738887 696040 651269 581793 512037 459311 431592 409485 389135 390443 401349 431417
10832 431417 403540 358898 328819 325195 307621 289918 313698 319418 313200 324782 351314 347804
10820 347804 319230 325357 334934 332178 322950 316128 322097 334562 347784 345412 360964 407154 418575
$$ packed form
10904D95344J5964J8894l710J5576M6759M9133M1096L0509L3467Q2171J04657
10893I29860Q1053L0162n0160o1198o6231o5679m9552l3917j398J314N680N234
10881G25168J8467K5947q781m5752n5479l0798k5106k7693l9297l1371j4062q828
10869D82415l6691k5948o935O631Q357k4j2293j886k424J8340J0890L1589J9930
10856D91951J3535J468J5103L5881L0604M4275O4182Q5250Q3367L3358k8557o7961
10844H02456o3569m2847m4771o9476o9756n2726k7719k2107k0350J308J0906L0068
10832D31417k7877m4642l0079l624j7574j7703K3780N720o218J1582K6532l510
10820C47804k8574O127R577k756r228o822N969J2465J3222k372J5552M6190J1421
$$ plain form
10807 418575 414720 425886 438724 442589 469500 502427 521997 524306 502589 454947 402890 361115
10795 361115 363382 364224 354288 350293 339467 321045 302023 310170 288029 269117 291368 296016 286128
10782 286128 272811 281323 279061 285341 304029 307832 319804 357372 385745 370848 340558 345815
10770 345815 350304 338021 325062 337336 331182 325523 343245 353016 344537 344237 350765 382907 407180
10757 407180 420325 446092 495209 512608 516115 506447 524142 562307 584847 637928 694386 759193
10745 759193 823989 946455 1131879 1443895 1907901 2680222 3968357 5713538 6835017
10736 6835017 6419339 5443953 4632232 3743604 2842767 2229071 1835879 1564944 1356627
10727 1356627 1225645 1137132 1071447 984244 887884 820801 769448 728361 736214 698460 658617
$$ packed form
10807D18575l855J1166J2838L865K6911L2927J9570K309k1717m7642n2057m1775
10795C61115K267Q42r936l995j0826j8422j9022Q147k2141j8912K2251M648r888
10782B86128j3317Q512k262O280J8688L803J1972L7568K8373j4897l0290N257
10770C45815M489j2283j2959J2274o154n659J7722R771q479l00O528L2142K4273
10757D07180J3145K5767M9117J7399L507r668J7695L8165K2540N3081N6458O4807
10745G59193O4796J22466J85424L12016M64006P72321J288135J745181J121479
10736F835017m15678r75386q11721q88628r00837o13696l93192k70935k08317
10727A356627j30982q8513o5685q7203r6360o7083n1353m1087P853l7754l9843
$$ plain form
10716 658617 641924 638114 630745 632001 614989 620551 630422 656475 658101 633114 622672 611915 625663
10703 625663 634447 635601 597190 547601 506706 489194 501188 503416 487338 495788 502494 513709
10691 513709 520845 504075 492131 490110 467090 447996 464099 463157 501748 544167 558674 542398
10679 542398 493271 459109 459930 466158 498126 522540 542841 561785 583157 620995 655114 693744
10667 693744 717548 761418 830760 879820 905713 912135 888101 849448 796870 739564 667451 601086
10655 601086 556138 537789 516257 507098 536440 540140 522058 514828 515241 512267 527619 520353 535049
10642 535049 545019 533678 526539 518876 502673 505623 511496 494720 485967 510124 524523 534054 540855
10629 540855 567432 559542 522856 524206 539819 549312 566993 622428 724835 849190 977466
$$ packed form
10716F58617j6693l810p369J256j7012N562R871K6053J626k4987j0442j0757J3748
10703F25663Q784J154l8411m9589m0895j7512J1994K228j6078Q450O706J1215
10691E13709P136j6770j1944k021k3020j9094J6103r42L8591M2419J4507j6276
10679E42398m9127l4162Q21O228L1968K4414K0301J8944K1372L7838L4119L8630
10667F93744K3804M3870O9342M9060K5893O422k4034l8653n2578n7306p2113o6365
10655F01086m4948j8349k1532r159K9342L700j8082p230M13k974J5352p266J4696
10642E35049R970j1341p139p663j6203K950N873j6776q753K4157J4399R531O801
10629E40855K6577p890l6686J350J5613R493J7681N5435J02407J24355J28276
$$ plain form
10618 977466 1045667 1087013 1032509 936039 842426 757010 669915 599507 569914 556158 533407
10607 533407 551754 553145 561988 568840 591461 636055 625936 623878 631119 627464 592721 547099 532471
10594 532471 552476 537137 528393 508922 469032 437044 428864 412446 389773 407759 406490 404337
10582 404337 393359 375810 374977 385096 411915 460421 487374 489256 536735 582552 600084 584099
10570 584099 586677 597769 598932 620862 640061 628163 632944 644094 653780 658856 664003 671143 694606
10557 694606 755027 809593 863602 912113 948677 944380 898778 870680 806228 748837 701680 677650
10545 677650 664888 632194 611804 606478 628177 650669 647067 663051 687304 701224 685353 668079
10533 668079 671854 671462 692346 690627 682333 707377 708584 695484 687057 686184 680031 671560 668875 665800
$$ packed form
10618I77466O8201M1346n4504r6470r3613q5416q7095p0408k9593j3756k2751
10607E33407J8347J391Q843O852K2621M4594j0119k058P241l655l4743m5622j4628
10594E32471K0005j5339q744j9471l9890l1988q180j6418k2673J7986j269k153
10582D04337j0978j7549q33J0119K6819M8506K6953J882M7479M5817J7532j5985
10570E84099K578J1092J163K1930J9199j1898M781J1150R686N076N147P140K3463
10557F94606O0421N4566N4009M8511L6564m297m5602k8098o4452n7391m7157k4030
10545F77650j2762l2694k0390n326K1699K2492l602J5984K4253J3920j5871j7274
10533F68079L775l92K0884j719q294K5044J207j3100q427q73o153q471k685l075
$$ plain form
10519 665800 656931 614960 636447 689121 736944 766789 784661 796204 826736 879148 939848 957981
10507 957981 965475 966306 952222 958525 1013070 1058054 1041298 1024215 1015958 1004193 996565 1005547 1003870
10494 1003870 1002908 1036342 1073820 1113944 1158066 1189258 1208879 1208613 1202768 1190317 1127106 1053374
10482 1053374 984864 931432 898860 876362 848494 844220 874567 920094 942043 914403 914786 933846
10470 933846 892911 856981 852478 831827 794297 814192 811517 853562 891982 870655 850481 824717
10458 824717 803086 779156 750067 704802 671693 663104 667720 692719 718658 720905 744027 791037
10446 791037 835805 885374 902304 904630 936408 927451 915190 889865 842336 843122 820031 786004
10434 786004 793512 773304 788506 842398 884736 883074 892719 913257 965115 991165 989898 973735
$$ packed form
10519F65800q869m1971K1487N2674M7823K9845J7872J1543L0532N2412O0700J8133
10507I57981P494Q31j4084O303N4545M4984j6756j7083q257j1765p628Q982j677
10494A003870r62L3434L7478M0124M4122L1192J9621k66n845j2451o3211p3732
10482A053374o8510n3432l2572k2498k7868m274L0347M5527K1949k7640L83J9060
10470I33846m0935l5930m503k0651l7530J9895k675M2045L8420k1327k0174k5764
10458H24717k1631k3930k9089m5265l3109q589M616K4999K5939K247K3122M7010
10446G91037M4768M9569J6930K326L1778q957j2261k5325m7529P86k3091l4027
10434G86004P508k0208J5202N3892M2338j662R645K0538N1858K6050j267j6163
$$ plain form
10422 973735 939088 905628 905837 885886 877815 849299 813026 756778 735977 733315 732970 760106 777956
10409 777956 792619 873037 951157 988312 999456 1020857 1033476 1007711 982281 945843 893286
10398 893286 843644 824845 815023 793946 740639 677960 628892 593505 578823 595139 608378 576780
10386 576780 525664 473879 459476 453065 451560 424351 406485 395947 394491 390355 395271 398667 382251
10373 382251 361529 346590 330630 332991 358681 338521 332695 374246 404658 405493 407454 383137
10361 383137 364929 379664 428299 481024 488126 520772 555188 580919 579375 600438 623196 631991
10349 631991 599689 573378 537429 517926 514725 519963 559545 587239 602663 594154 580397 602286
10337 602286 619049 640434 681969 656142 623971 607620 588079 601390 592106 569287 569105 602150
$$ packed form
10422I73735l4647l3460K09j9951q071k8516l6273n6248k0801k662l45K7136J7850
10409G77956J4663Q0418P8120L7155J1144K1401J2619k5765k5430l6438n2557
10398H93286m9642j8799r822k1077n3307o2679m9068l5387j4682J6316J3239l1598
10386E76780n1116n1785j4403o411j505k7209j7866j0538j456m136M916L396j6416
10373C82251k0722j4939j5960K361K5690k0160n826M1551L0412Q35J961k4317
10361C83137j8208J4735M8635N2725P102L2646L4416K5731j544K1063K2758Q795
10349F31991l2302k6311l5949j9503l201N238L9582K7694J5424q509j3757K1889
10337F02286J6763K1385M1535k5827l2171j6351j9541J3311r284k2819j82L3045
$$ plain form
10325 602150 577593 550892 556934 541852 543119 534497 550749 542064 498694 492161 502730 535967
10313 535967 545359 536065 561036 584853 597254 618668 629740 658139 700244 792256 934588 1166310
10301 1166310 1548010 2026500 2363143 2289346 1999957 1734706 1439690 1154649 968488 861040
10291 861040 774898 696105 658334 631473 616958 583795 552581 562177 585995 593059 628768 644045
10279 644045 606348 563460 562470 563529 554064 541190 524491 530747 546622 551927 602761 638690 648210
10266 648210 656529 666900 656266 660997 670048 699147 734260 767655 815006 868234 890886 909845
10254 909845 933092 966218 1001145 1077744 1140772 1254876 1349458 1470625 1626056 1813556 2027923
10243 2027923 2317987 2752857 3363475 4166962 5125874 6135268 7048766 7682882 7979203
$$ packed form
10325F02150k4557k6701O042j5082J267q622J6252q685m3370o533J0569L3237
10313E35967R392r294K4971K3817J2401K1414J1072K8399M2105R2012J42332K31722
10301A166310L81700M78490L36643p3797k89389k65251k95016k85041j86161j07448
10291H61040q6142p8793l7771k6861j4515l3163l1214R596K3818P064L5709J5277
10279F44045l7697m2888r90J059r465j2874j6699O256J5875N305N0834L5929R520
10266F48210Q319J0371j0634M731R051K9099L5113L3395M7351N3228K2652J8959
10254I09845K3247L3126L4927P6599O3028J14104R4582J21167J55431J87500K14367
10243B027923K90064M34870O10618Q03487R58912J009394R13498O34116K96321
$$ plain form
10234 7979203 8033544 7977164 7982548 8125863 8384257 8699288 8901123 8874810 8592107 8052422
10224 8052422 7383031 6759572 6217692 5797130 5537709 5450443 5569813 5896872 6432068 7276327
10214 7276327 8468282 10068502 12049401 14224328 16281048 17881011 18862469 19437230
10206 19437230 19900806 20491268 21247480 22307611 23616974 24574665 24421059 23202370 21472822
10197 21472822 19474930 17219490 14935200 12918769 11323399 10098098 9229198 8720234
10189 8720234 8501115 8565925 8931734 9585704 10529578 11625195 12679177 13452258 13864048
10180 13864048 13976788 13982773 14143042 14608525 15493556 16733581 18190284 19748326 21252082
10171 21252082 22661367 23855609 24462924 24290346 23661501 23014395 22665157 22683914 23086499
$$ packed form
10234G979203N4341n6380N384J43315K58394L15031K01835k6313k82703n39685
10224H052422o69391o23459n41880m20562k59421q7266J19370L27059N35196Q44259
10214G276327J191955J600220J980899K174927K056720J599963R81458N74761
10206A9437230M63576N90462P56212J060131J309363R57691j53606j218689j729548
10197B1472822j997892k255440k284290k016431j595370j225301q68900n08964
10189H720234k19119O4810L65809O53970R43874J095617J053982P73081M11790
10180A3864048J12740N985J60269M65483Q85031J240025J456703J558042J503756
10171B1252082J409285J194242O07315j72578o28845o47106l49238J8757M02585
$$ plain form
10162 23086499 23670254 23992339 23655657 22681161 21320048 19839416 18344410 16978395 15791470
10153 15791470 14868408 14352688 14265441 14591670 15468153 17082721 19603102 23144947 27609254
10144 27609254 32408923 36778659 39826678 41122850 40961475 40152219 39641302 40035385 41299369
10135 41299369 42792119 43609600 42977644 40694962 37128760 32945359 28738877 25017004
10127 25017004 21989082 19697375 18123062 17148381 16683097 16671896 17093276 17979124 19359276
10118 19359276 21265537 23481560 25628051 27276992 28156044 28267020 27997658 27864935 28163021
10109 28163021 28911969 29968676 30977681 31579224 31729775 31582465 31195343 30565577 29683213
10100 29683213 28749268 28040099 27841516 28388896 29715816 31713744 34223937 37034941 40139151
$$ packed form
10162B3086499N83755L22085l36682r74496j361113j480632j495006j366015j186925
10153A5791470r23062n15720q7247L26229Q76483J614568K520381L541845M464307
10144B7609254M799669M369736L048019J296172j61375q09256n10917L94083J263984
10135D1299369J492750Q17481o31956k282682l566202m183401m206482l721873
10127B5017004l027922k291707j574313r74681m65284j1201M21380Q85848J380152
10118A9359276J906261K216023K146491J648941Q79052J10976k69362j32723K98086
10109B8163021P48948J056707J009005O01543J50551j47310l87122o29766q82364
10100B9683213r33945p09169j98583N47380J326920J997928K510193K811004L104210
$$ plain form
10091 40139151 43654901 47632245 51822830 55640202 58359668 59393936 58677211 56593610
10083 56593610 53755683 50804031 48331945 46783876 46530241 47659573 50007048 53151814
10075 53151814 56610423 60029064 63439724 66992741 70796731 74628171 77912923 79847481
10067 79847481 79705363 77175777 72641145 66853263 60513484 54212260 48336194 43017458
10059 43017458 38348331 34427921 31227862 28705698 26800709 25466941 24640014 24297993
10051 24297993 24473458 24958515 25484196 25740029 25635127 25209061 24670725 24285649 24235931
10042 24235931 24465103 24847139 25104216 24968900 24383532 23462105 22515848 21774749 21366514
10033 21366514 21396876 21863039 22859179 24429609 26574808 29480064 33199112 37895713 43727726
$$ packed form
10091D0139151L515750L977344M190585L817372K719466J034268p16725k083601
10083E6593610k837927k951652k472086j548069k53635J129332K347475L144766
10075E3151814L458609L418641L410660L553017L803990L831440L284752J934558
10067G9847481j42118k529586m534632n787882o339779o301224n876066n318736
10059D3017458m669127l920410l200059k522164j904989j333768q26927l42021
10051B4297993J75465M85057N25681K55833j04902m26066n38336l85076m9718
10042B4235931K29172L82036K57077j35316n85368r21427r46257p41099m08235
10033B1366514L0362M66163R96140J570430K145199K905256L719048M696601N832013
$$ plain form
10024 43727726 50631092 58195001 65726979 72535206 78338426 83092947 86661521 88920375
10016 88920375 89904752 89769859 88453889 85898633 82383517 78564136 75081617 72551425
10008 72551425 71489642 72189966 74697828 78807397 83993131 89431712 94168040 97641937
10000 97641937 99653070 100151344 99098346 96577126 92799417 87857961 81770218 74771382
9992 74771382 67354825 60082513 53241884 47031566 41609330 36970351 33059834 29758359
9984 29758359 27000981 24660420 22653968 20940981 19491584 18275586 17257415 16411589
9976 16411589 15697067 15132185 14777240 14639342 14775737 15034063 15114586 14871458 14408722 13973042
9966 13973042 13600711 13300056 13236770 13412317 13835300 14527540 15514885 16847532 18529260
$$ packed form
10024D3727726O903366P563909P531978O808227N803220M754521L568574K258854
10016H8920375R84377j34893j315970k555256l515116l819381l482519k530192
10008G2551425j061783P00324K507862M109569N185734N438581M736328L473897
10000I7641937K011133M98274j052998k521220l777709m941456o087743o998836
9992G4771382p416557p272312o840629o210318n422236m638979l910517l301475
9984B9758359k757378k340561k006452j712987j449397j215998j018171q45826
9976A6411589p14522n64882l54945j37898J36395K58326Q0523k43128m62736m35680
9966A3973042l72331l00655o3286J75547M22983O92240R87345J332647J681728
$$ plain form
9957 18529260 20608866 23110856 25916455 28916629 32165573 35712515 39662941 43903003
9949 43903003 48008023 51428708 53594181 54079720 52940639 50553375 47393602 43944807
9941 43944807 40665527 37966720 36099580 35256080 35505966 36819212 39150784 42382898
9933 42382898 46442609 50985955 55407426 58868282 60600174 60171463 57634415 53527022
9925 53527022 48512261 43212408 38115630 33479547 29397630 25887556 22888872 20356780
9917 20356780 18212734 16371573 14785398 13426984 12226690 11176774 10261146 9514778
9909 9514778 8883243 8351382 7862679 7419732 7021220 6705348 6485378 6278282 6032994 5761141
9899 5761141 5512973 5285181 5065101 4852539 4677085 4506598 4357437 4190701 4061904 3964786
$$ packed form
9957A8529260K079606K501990K805599L000174L248944L546942L950426M240062
9949D3903003M105020L420685K165473M85539j139081k387264l159773l448795
9941D3944807l279280k698807j867140q43500K49886J313246K331572L232114
9933D2382898M059711M543346M421471L460856J731892m28711k537048m107393
9925E3527022n014761n299853n096778m636083m081917l510074k998684k532092
9917B0356780k144046j841161j586175j358414j200294j049916r15628p46368
9909I514778o31535n31861m88703m42947l98512l15872k19970k07096k45288k71853
9899E761141k48168k27792k20080k12562j75454j70487j49161j66736j28797r7118
$$ plain form
9889 3964786 3899501 3845543 3813130 3839947 3925087 4134014 4372423 4436392 4262044 4014531 3768590
9878 3768590 3532210 3316935 3165542 3045714 2928968 2870792 2829848 2774348 2745316 2760962
9868 2760962 2746083 2688941 2616385 2577723 2520036 2437036 2391692 2390620 2379927 2355671 2354406 2358000
9856 2358000 2397104 2419489 2425884 2409568 2371784 2358468 2376626 2377158 2360429 2342265 2378266 2463326
9844 2463326 2539884 2599248 2684387 2816686 2879253 2820205 2749164 2634110 2490229 2419592 2376461
9833 2376461 2374183 2351740 2323589 2363494 2380828 2414324 2456420 2464646 2462640 2469891 2530224 2543246
9821 2543246 2536989 2532461 2509036 2495041 2488680 2488128 2488246 2452213 2456098 2478626 2480916 2476376 2481925 2477482
9807 2477482 2484078 2497930 2518711 2528331 2531613 2575768 2587504 2599530 2613152 2628491 2648240 2632857
$$ packed form
9889C964786o5285n3958l2413K6817Q5140K08927K38409O3969j74348k47513k45941
9878C768590k36380k15275j51393j19828j16746n8176m0944n5500k9032J5646
9868B760962j4879n7142p2556l8662n7687q3000m5344j072j0693k4256j265L594
9856B358000L9104K2385O395j6316l7784j3316J8158N32j6729j8164L6001Q5060
9844B463326P6558N9364Q5139J32299O2567n9048p1041j15054j43881p0637m3131
9833B376461k278k2443k8151L9905J7334L3496M2096Q226k006P251O0333J3022
9821B543246o257m528k3425j3995o361n52J18l6033L885K2528K290m540N549m443
9807B477482O596J3852K0781R620L282M4155J1736J2026J3622J5339J9749j5383
$$ plain form
9795 2632857 2645419 2658413 2674543 2694050 2711767 2750713 2814273 2875272 2955709 3039303 3092597
9784 3092597 3127904 3160982 3142981 3115537 3105836 3121212 3133286 3173167 3205401 3218552 3235172 3278347
9772 3278347 3339824 3413183 3445196 3439230 3461720 3502432 3534416 3597794 3653550 3702583 3764113 3849379
9760 3849379 3900001 3939307 3988501 4061218 4160288 4256589 4339539 4436179 4545138 4640949 4728966
9749 4728966 4818379 4888085 4940788 4985752 5000845 5007738 5012818 5014056 5018625 5048293 5077102 5106484
9737 5106484 5157404 5203556 5239543 5275388 5265409 5287675 5328476 5394061 5442385 5476361 5515579 5526874
9725 5526874 5562275 5592797 5608348 5606680 5609978 5631501 5636119 5671986 5694820 5731679 5786083 5816058
9713 5816058 5809323 5782057 5744254 5712777 5688180 5692862 5734399 5756348 5782864 5843574 5905726 5976664
$$ packed form
9795B632857J2562J2994J6130J9507J7717L8946O3560O0999Q0437Q3594N3294
9784C092597L5307L3078j8001k7444r701J5376J2074L9881L2234J3151J6620M3175
9772C278347O1477P3359L2013n966K2490M0712L1984O3378N5756M9033O1530Q5266
9760C849379N0622L9306M9194P2717R9070R6301Q2950R6640J08959R5811Q8017
9749D728966Q9413O9706N2703M4964J5093O893N080J238M569K9668K8809K9382
9737E106484N0920M6152L5987L5845r979K2266M0801O5585M8324L3976L9218J1295
9725E526874L5401L0522J5551j668L298K1523M618L5867K2834L6859N4404K9975
9713E816058o735k7266l7803l1477k4597M682M1537K1949K6516O0710O2152P0938
$$ plain form
9701 5976664 6086721 6239320 6388965 6562132 6809962 7107884 7433759 7807689 8305840 8921666
9691 8921666 9727423 10738607 11964758 13316226 14613440 15813989 16862996 17711561 18464653
9682 18464653 19131068 19756104 20401512 21138789 21926655 22591139 22959706 22942302 22589786 22155999
9672 22155999 21824918 21775764 22171196 23018660 24188991 25570564 27000008 28464802 30125244
9663 30125244 32086136 34451605 37177728 39976067 42459166 44458981 45794143 46333599
9655 46333599 46127615 45399659 44447990 43468502 42593055 41908144 41279922 40462901 39342515
9646 39342515 38025664 36853231 36164306 36180956 36900982 38022173 39145047 40062339 40747327
9637 40747327 41296783 41743019 42203596 42889454 43718901 44541975 45197327 45500873 45232057
$$ packed form
9701E976664J10057J52599J49645J73167K47830K97922L25875L73930M98151O15826
9691H921666Q05757J011184J226151J351468J297214J200549J049007Q48565P53092
9682A8464653O66415O25036O45408P37277P87866O64484L68567j7404l52516m33787
9672B2155999l31081m9154L95432Q47464J170331J381573J429444J464794J660442
9663C0125244J960892K365469K726123K798339K483099J999815J335162N39456
9655D6333599k05984p27956r51669r79488q75447o84911o28222q17021j120386
9646C9342515j316851j172433o88925J6650P20026J121191J122874R17292O84988
9637D0747327N49456M46236M60577O85858Q29447Q23074O55352L03546k68816
$$ plain form
9628 45232057 44268848 42666627 40470685 38020040 35611068 33452919 31623549 30088128
9620 30088128 28744698 27576875 26590631 25901748 25603978 25724536 26159226 26800460 27488104
9611 27488104 28156435 28826069 29651224 30746722 32109904 33614495 35210154 36782773 38177685
9602 38177685 39096334 39515230 39768199 40090844 40435036 40708357 41001640 41407699 41974710
9593 41974710 42462358 42693289 42456929 41695947 40695275 39871288 39530268 39787498 40589608
9584 40589608 41790882 43331048 45354150 48018471 51518982 55820233 60535151 65208669
9576 65208669 69397365 72729173 74911252 75942449 76063735 75432474 74397312 73473866 72860506
9567 72860506 72503097 72191304 71500928 70065882 67872394 65283266 62879265 61166423 60453576
$$ packed form
9628D5232057r63209j602221k195942k450645k408972k158149j829370j535421
9620C0088128j343430j167823r86244o88883k97770J20558M34690O41234O87644
9611B7488104O68331O69634Q25155J095498J363182J504591J595659J572619J394912
9602C8177685R18649M18896K52969L22645L44192K73321K93283M06059N67011
9593D1974710M87648K30931k36360p60982j000672q23987l41020K57230Q02110
9584D0589608J201274J540166K023102K664321L500511M301251M714918M673518
9576F5208669M188696L331808K182079J031197J21286o31261j035162r23446o13360
9567G2860506l57409l11793o90376j435046k193488k589128k404001j712842p12847
$$ plain form
9558 60453576 60638244 61274131 62026549 62759632 63464210 64315204 65514443 67144645 69109277
9549 69109277 71213061 73056858 74203403 74104645 72407841 69298726 65393908 61238328
9541 61238328 57331103 53902590 50915096 48244547 45723164 43167693 40549447 38088526
9533 38088526 36091772 34790579 34190586 34054759 34031911 33736735 33070382 32163612 31091340
9524 31091340 30004937 29078993 28363441 27790953 27241378 26619042 25707917 24348392 22509615
9515 22509615 20409401 18281813 16257446 14444237 12903437 11620077 10563094 9694291
9507 9694291 8957749 8318694 7728792 7236000 6795141 6375797 6007618 5686785 5408917 5164379
9497 5164379 4959634 4738010 4546419 4381831 4208342 4055118 3926542 3819258 3730208 3635281
$$ packed form
9558F0453576J84668O35887P52418P33083P04578Q50994J199239J630202J964632
9549F9109277K103784J843797J146545r8758j696804l109115l904818m155580
9541F1238328l907225l428513k987494k670549k521383k555471k618246k460921
9533C8088526j996754j301193n99993j35827k2848k95176o66353r06770j072272
9524C1091340j086403r25944p15552n72488n49575o22336r11125j359525j838777
9515B2509615k100214k127588k024367j813209j540800j283360j056983q68803
9507I694291p36542o39055n89902m92792m40859m19344l68179l20833k77868k44538
9497E164379k04745k21624j91591j64588j73489j53224j28576j07284q9050r4927
$$ plain form
9487 3635281 3521336 3415582 3288636 3187155 3117242 3048759 2960228 2864492 2807736 2751846 2690894
9476 2690894 2671253 2640284 2597868 2578723 2551181 2543865 2526764 2485457 2428240 2418878 2425479 2431569
9464 2431569 2413225 2380935 2382556 2370920 2346383 2345906 2339016 2316006 2316205 2331455 2327681 2308417 2304016
9451 2304016 2311447 2329491 2347693 2375681 2397240 2419514 2460013 2499982 2518209 2577993 2663929 2712659
9439 2712659 2761950 2790563 2850661 2943956 3040769 3157669 3293270 3443593 3568199 3693432
9429 3693432 3838598 4004887 4193162 4391982 4622556 4939456 5379894 5961095 6684932 7602476
9419 7602476 8812236 10289556 12122772 14354183 17064528 20273616 24020139 28226853
9411 28226853 32679487 36833327 39960113 41511602 41288012 39584840 36866567 33622676
$$ packed form
9487C635281j13945j05754j26946j01481o9913o8483q8531r5736n6756n5890o0952
9476B690894j9641l0969m2416j9145k7542p316j7101m1307n7217r362O601O090
9464B431569j8344l2290J621j1636k4537m77o890k3010J99J5250l774j9264m401
9451B304016P431J8044J8202K7988K1559K2274M0499L9969J8227N9784Q5936M8730
9439B712659M9291K8613O0098R3295R6813J16900J35601J50323J24606J25233
9429C693432J45166J66289J88275J98820K30574L16900M40438N81201P23837R17544
9419G602476J209760J477320J833216K231411K710345L209088L746523M206714
9411B8226853M452634M153840L126786J551489k23590j703172k718273l243891
$$ plain form
9403 33622676 30238255 26996879 24128228 21726903 19830926 18404743 17447579 16931897
9395 16931897 16863495 17269265 18134711 19560793 21636898 24367183 27640946 31218985 34799866
9386 34799866 37966019 40218239 41136894 40612763 38927772 36525770 33816805 31003185
9378 31003185 28221199 25573751 23107306 20837619 18807188 17019483 15481169 14193173
9370 14193173 13128678 12261186 11566503 11027376 10634548 10394190 10262874 10217955 10235314 10320860
9360 10320860 10416954 10622035 10938952 11381025 12004036 12841136 13970801 15439987 17328657
9351 17328657 19729587 22755031 26449102 30860404 36045539 41940193 48327527 54771971
9343 54771971 60506018 64687925 66749793 66523042 64385351 60874396 56559231 51978682
$$ packed form
9403C3622676l384421l241376k868651k401325j895977j426183r57164n15682
9395A6931897o8402M05770Q65446J426082K076105K730285L273763L578039L580881
9386C4799866L166153K252220R18655n24131j684991k402002k708965k813620
9378C1003185k781986k647448k466445k269687k030431j787705j538314j287996
9370A4193173j064495q67492o94683n39127l92828k40358j31316m4919J7359Q5546
9360A0320860R6094K05081L16917M42073O23011Q37100J129665J469186J888670
9351A7328657K400930L025444L694071M411302N185135N894654O387334O444444
9343E4771971N734047M181907K061868k26751k137691l510955m315165m580549
$$ plain form
9335 51978682 47692927 44084137 41305444 39488074 38626913 38659921 39566483 41371435 44009715
9326 44009715 47417598 51435200 55901974 60619172 65443707 70189038 74405040 77514819
9318 77514819 78915832 78304766 75768120 71691340 66741605 61494710 56338708 51472905
9310 51472905 47098789 43321826 40209323 37834997 36189862 35187299 34715484 34596811
9302 34596811 34606934 34545659 34224995 33459638 32151262 30394331 28366562 26207941 24081655
9293 24081655 22128143 20414363 19006677 17870423 17009707 16419921 16107494 16070081 16307822
9284 16307822 16841000 17712071 18983846 20598279 22528216 24762743 27166731 29552293
9276 29552293 31582496 33039422 33837354 33971343 33500505 32597775 31512259 30468092 29637737
$$ packed form
9335E1978682m285755l608790k778693j817370q61161L3008R06562J804952K638280
9326D4009715L407883M017602M466774M717198M824535M745331M216002L109779
9318G7514819J401013o11066k536646m076780m949735n246895n156002m865803
9310E1472905m374116l776963l112503k374326j645135j002563m71815j18673
9302C4596811J0123o1275l20664p65357j308376j756931k027769k158621k126286
9293B4081655j953512j713780j407686j136254q60716n89786l12427l7413K37741
9284A6307822N33178Q71071J271775J614433J929937K234527K403988K385562
9276B9552293K030203J456926P97932J33989m70838r02730j085516j044167q30355
$$ plain form
9267 29637737 29279028 29514526 30347129 31732005 33673288 36225377 39330696 42930636 46772035
9258 46772035 50389086 53330741 55344697 56395744 56583483 56014072 54780775 52985290
9250 52985290 50625725 47799056 44709193 41573968 38567136 35890283 33662452 31989646
9242 31989646 30926415 30549259 30881107 31935564 33633310 35821362 38233644 40629547
9234 40629547 42553814 43492629 43086949 41301736 38463924 35043121 31405841 27843571
9226 27843571 24566850 21671240 19188191 17056217 15268277 13813398 12627597 11649668
9218 11649668 10826217 10114690 9539465 9061144 8610815 8183788 7828939 7509152 7247262
9209 7247262 7026797 6863454 6758286 6741026 6755839 6850041 7051055 7394483 7864749 8418212
$$ packed form
9267B9637737l58709K35498Q32603J384876J941283K552089L105319L599940L841399
9258D6772035L617051K941655K013956J051047J87739n69411j233297j795485
9250E2985290k359565k826669l089863l135225l006832k676853k227831j672806
9242C1989646j063231l77156L31848J054457J697746K188052K412282K395903
9234D0629547J924267R38815m05680j785213k837812l420803l637280l562270
9226B7843571l276721k895610k483049k131974j787940j454879j185801r77929
9218A1649668q23451p11527n75225m78321m50329m27027l54849l19787k61890
9209G247262k20465j63343j05168j7260J4813R4202K01014L43428M70266N53463
$$ plain form
9199 8418212 9069293 9864373 10794728 11850234 13029220 14341445 15747263 17128671 18250347
9190 18250347 18911799 18990363 18479052 17464104 16125629 14637653 13152205 11815149 10668710
9181 10668710 9776568 9107050 8656802 8412191 8364276 8503225 8847719 9380454 10154120 11169663
9171 11169663 12456555 13893542 15419925 16921815 18144262 18742555 18612302 17811939 16540108
9162 16540108 14989712 13405199 11862822 10454728 9197668 8137453 7258290 6560315
9154 6560315 5977517 5506136 5128139 4789090 4497358 4222089 4004708 3814022 3601347 3436886
9144 3436886 3285961 3159085 3037552 2905570 2790499 2704565 2652677 2576020 2528629 2469584
9134 2469584 2424207 2378837 2305336 2253041 2195483 2124624 2084394 2047106 2023091 2015760 1985851 1977907
$$ packed form
9199H418212O51081P95080R30355J055506J178986J312225J405818J381408J121676
9190A8250347O61452P8564n11311j014948j338475j487976j485448j337056j146439
9181A0668710q92142o69518m50248k44611m7915J38949L44494N32735P73666J015543
9171A1169663J286892J436987J526383J501890J222447N98293j30253q00363j271831
9162A6540108j550396j584513j542377j408094j257060j060215q79163o97975
9154F560315n82798m71381l77997l39049k91732k75269k17381j90686k12675j64461
9144C436886j50925j26876j21533j31982j15071q5934n1888p6657m7391n9045
9134B469584m5377m5370p3501n2295n7558p0859m0230l7288k4015p331k9909p944
$$ plain form
9122 1977907 1946701 1904568 1878722 1857202 1822438 1804004 1775936 1743384 1720528 1676725 1637941
9111 1637941 1616205 1563943 1535242 1517281 1509764 1514576 1514701 1484280 1421440 1421666 1425229 1379549 1343228
9098 1343228 1319538 1290517 1274784 1261757 1235588 1191860 1161155 1176940 1192523 1165817 1168428 1131872
9086 1131872 1115669 1119526 1095988 1103890 1077019 1091214 1104445 1071226 1035813 1055900 1070525 1093486
9074 1093486 1089041 1069444 1075992 1072612 1061413 1032406 1005518 1009250 1029319 1004095 1005726 1012052 1027125
9061 1027125 1025088 1004091 988885 1002394 1008937 973718 961095 996793 1025625 1006573 1007314 986675
9049 986675 974017 971571 966999 956616 913346 886282 875348 852330 848107 847092 870816 882978
9037 882978 848101 837763 815656 781896 820371 845510 845984 859151 872239 875447 869615 860035 880449
$$ packed form
9122A977907l1206m2133k5846k1520l4764j8434k8068l2552k2856m3803l8784
9111A637941k1736n2262k8701j7961p517M812J25l0421o2840K26L563m5680l6321
9098A343228k3690k9021j5733j3027k6169m3728l0705J5785J5583k6706K611l6556
9086A131872j6203L857k3538P902k6871J4195J3231l3219l5413K0087J4625K2961
9074A093486m445j9597O548l380j1199k9007k6888L732K0069k5224J631O326J5073
9061A027125k037k0997j5206J3509O543l5219j2623L5698K8832j9052P41k0639
9049I86675j2658k446m572j0383m3270k7064j0934k3018m223j015K3724J2162
9037H82978l4877j0338k2107l3760L8475K5139M74J3167J3088L208n832r580K0414
$$ plain form
9024 880449 857981 842578 842876 865526 876638 866253 876073 868584 851433 826761 806704 820031
9012 820031 843873 855447 842421 842520 830154 859625 872792 875573 898296 927337 923268 913403 939419
8999 939419 949278 959491 972214 961793 933270 951089 937850 914093 904949 868112 865789 877104
8987 877104 882263 872491 859241 865522 888007 911107 942342 1002182 1036865 1072977 1092421 1116638
8975 1116638 1125824 1082995 1042803 1006980 966920 928103 886655 867398 866210 850563 833116 847064
8963 847064 849631 837474 806373 785111 795555 811240 802998 779368 786152 796959 807533 788612
8951 788612 789570 801975 813020 811840 799505 801534 823345 850121 854420 873580 905008 918727 930256
8938 930256 968377 1011512 1054529 1089734 1142448 1176939 1195445 1181496 1178878 1130667 1086861 1063941
$$ packed form
9024H80449k2468j5403K98K2650J1112j0385R820p489j7151k4672k0057J3327
9012H20031K3842J1574j3026R9j2366K9471J3167K781K2723K9041m069r865K6016
8999I39419R859J0213J2723j0421k8523J7819j3239k3757r144l6837k323J1315
8987H77104N159r772j3250O281K2485K3100L1235N9840L4683L6112J9444K4217
8975A116638R186m2829m0192l5823m0060l8817m1448j9257j188j5647j7447J3948
8963H47064K567j2157l1101k1262J0444J5685q242k3630O784J0807J0574j8921
8951G88612R58J2405J1045j180j2335K029K1811K6776M299J9160L1428J3719J1529
8938I30256L8121M3135M3017L5205N2714L4491J8506j3949k618m8211m3806k2920
$$ plain form
8926 1063941 1040691 1046895 1027619 1045381 1097898 1106470 1116353 1133689 1183601 1235894 1271785 1290308
8914 1290308 1289295 1334681 1368896 1388480 1396899 1435940 1485995 1501903 1522283 1522822 1502461 1497591
8902 1497591 1503433 1504332 1518151 1575060 1614971 1649523 1730302 1817262 1881615 1946781 2003129 2125849
8890 2125849 2266559 2393879 2511770 2708011 2940792 3199121 3493578 3871548 4315404 4779657
8880 4779657 5272027 5890308 6788070 8054507 9911808 12683834 17009299 23680224 33195771
8871 33195771 43682425 49724371 48151026 42510341 36269212 29640823 23189699 18047494
8863 18047494 14395496 11871798 10132875 8909211 8041504 7401740 6875660 6424533 5989762
8854 5989762 5600174 5242848 4920313 4618217 4357821 4104615 3905765 3702239 3465836 3289512
$$ packed form
8926A063941k3250O204j9276J7762N2517Q572R883J7336M9912N2293L5891J8523
8914A290308j013M5386L4215J9584Q419L9041N0055J5908K0380N39k0361m870
8902A497591N842Q99J3819N6909L9911L4552Q0779Q6960O4353O5166N6348J22720
8890B125849J40710J27320J17891J96241K32781K58329K94457L77970M43856M64253
8880D779657M92370O18281Q97762J266437J857301K772026M325465O670925R515547
8871C3195771J0486654O041946j573345n640685o241129o628389o451124n142205
8863A8047494l651998k523698j738923j223664q67707o39764n26080m51127m34771
8854E989762l89588l57326l22535l02096k60396k53206j98850k03526k36403j76324
$$ plain form
8844 3289512 3125471 2977656 2844716 2733765 2665075 2622365 2611464 2607670 2622443 2677860 2746039
8833 2746039 2732539 2664070 2558010 2455257 2372738 2272758 2198821 2170324 2103739 2076542 2084459
8822 2084459 2068242 1994380 1909397 1866503 1813911 1736605 1683338 1608518 1578653 1560209 1549061
8811 1549061 1550055 1545140 1508211 1480695 1464484 1427530 1385527 1362567 1340362 1347628 1354809 1363192 1338688
8798 1338688 1314945 1285722 1269905 1242851 1200081 1168520 1151697 1144059 1103574 1100969 1123371 1102857
8786 1102857 1077905 1082157 1106430 1130880 1106508 1093511 1078590 1069044 1041771 1055125 1063220 1016687
8774 1016687 994258 992169 1009545 1009551 996720 968473 934736 949986 993981 998700 951344 906272 910491
8761 910491 901600 907651 927642 953089 977084 961871 936633 940709 956977 954887 919759 926555 965037
$$ packed form
8844C289512j64041j47815j32940j10951o8690m2710j0901l794J4773N5417O8179
8833B746039j3500o8469j06060j02753q2519r9980p3937k8497o6585k7197P917
8822B084459j6217p3862q4983m2894n2592p7306n3267p4820k9865j8444j1148
8811A549061R94m915l6929k7516j6211l6954m2003k2960k2205P266P181Q383k4504
8798A338688k3743k9223j5817k7054m2770l1561j6823p638m0485k605K2402k0514
8786A102857k4952M252K4273K4450k4372j2997j4921r546k7273J3354Q095m6533
8774A016687k2429k089J7376Oj2831k8247l3737J5250M3995M719m7356m5072M219
8761I10491q891O051J9991K5447K3995j5213k5238M076J6268k090l5128O796L8482
$$ plain form
8748 965037 954381 933249 910682 904235 934281 943539 912044 884356 892343 896960 883459 856839
8736 856839 849884 832278 785858 748697 766977 772303 758887 757224 742296 732108 740498 770722
8724 770722 798455 802269 799553 821473 827352 847352 853454 814666 798192 769454 751040 727592
8712 727592 707280 703463 705625 711827 700223 698894 692261 698497 685142 677272 690468 711867 743296
8699 743296 752749 727373 725193 717242 713124 719006 722461 714374 698680 701525 688495 675551 639276
8686 639276 615553 620205 639500 653923 638592 608343 613434 627648 638886 657596 683398 702182
8674 702182 725687 757913 757983 771367 776953 765419 756495 758633 731746 690792 690657 696471 691741 677050
8660 677050 699472 682426 661598 661488 668783 674791 650597 686167 709868 705961 705001 725692 705862
$$ packed form
8748I65037j0656k1132k2567o447L0046R258l1495k7688P987M617j3501k6620
8736H56839o955j7606m6420l7161J8280N326j3416j663j4928j0188Q390L0224
8724G70722K7733L814k716K1920N879K0000O102l8788j6474k8738j8414k3448
8712G27592k0312l817K162O202j1604j329o633O236j3355p870J3196K1399L1429
8699G43296R453k5376k180p951m118N882L455q087j5694K845j3030j2944l6275
8686F39276k3723M652J9295J4423j5331l0249N091J4214J1238J8710K5802J8784
8674G02182K3505L2226P0J3384N586j1534q924K138k6887m0954j35N814m730j4691
8660F77050K2422j7046k0828j10P295O008k4194L5570K3701l907r60K0691j9830
$$ plain form
8647 705862 672725 654310 648535 648858 644944 643974 661995 672083 671031 668453 672339 652030 622836
8634 622836 613823 604810 573605 585776 611891 652264 648845 647391 650355 651182 668557 671801 663741
8621 663741 652153 652659 658905 663220 668541 643117 618855 634493 665661 674177 681627 675307 688951
8608 688951 729291 766883 765371 789959 801512 839634 891628 951933 983366 1018932 1063455 1117337
8596 1117337 1197819 1288215 1400385 1432184 1455998 1470199 1433250 1382380 1347314 1323540 1318715
8585 1318715 1347806 1405008 1426117 1380144 1304898 1202248 1055894 936945 876407 833214 845278
8574 845278 848484 843605 849836 820901 795387 773340 733989 713068 665307 654069 596835 561720
8562 561720 547341 544530 553807 557782 548508 539919 511711 526805 558535 545339 520152 515382 519341
$$ packed form
8647G05862l3137j8415n775L23l914r70J8021J0088j052k578L886k0309k9194
8634F22836r013r013l1205J2171K6115M0373l419j454K964Q27J7375L244q060
8621F63741j1588N06O246M315N321k5424k4262J5638L1168Q516P450o320J3644
8608F88951M0340L7592j512K4588J1553L8122N1994O0305L1433L5566M4523N3882
8596A117337Q0482R0396J12170L1799K3814J4201l6949n0870l5066k3774m825
8585A318715K9091N7202K1109m5973p5246j02650j46354j18949o0538m3193J2064
8574H45278L206m879O231k8935k5514k2047l9351k0921m7761j1238n7234l5115
8562E61720j4379k811R277L975r274q589k8208J5094L1730j3196k5187m770L959
$$ plain form
8549 519341 553118 576509 555239 527540 504052 509365 520994 538086 549746 567881 613234 669218
8537 669218 706034 719151 733797 692976 634376 600060 552478 528977 503132 467120 452535 450255
8525 450255 452642 452042 439705 434081 419442 412530 401731 401077 426313 433128 409792 397112 393465
8512 393465 370147 366204 374631 370846 363250 375185 389866 387967 377760 384816 404128 428527 420134
8499 420134 434043 468326 495097 469248 470327 496958 503095 532753 563780 606065 645331 649536
8487 649536 609085 563514 560416 559651 516558 491957 498946 548866 578792 584751 561216 592536 646934
8474 646934 738544 817354 902525 1015166 1143394 1264113 1366697 1442185 1479637 1446659 1370923
8463 1370923 1261216 1151098 1069199 977195 904700 865943 855220 889754 889330 859040 820710
$$ packed form
8549E19341L3777K3391k1270k7699k3488N313J1629J7092J1660J8135M5353N5984
8537F69218L6816J3117J4646m0821n8600l4316m7582k3501k5845l6012j4585k280
8525D50255K387o00j2337n624j4639o912j0799o54K5236O815k3336j2680l647
8512C93465k3318l943Q427l785p596J1935J4681j899j0207P056J9312K4399q393
8499D20134J3909L4283K6771k5849J079K6631O137K9658L1027M2285L9266M205
8487F49536m0451m5571l098p65m3093k4601O989M9920K9926N959k3535L1320N4398
8474F46934R1610P8810Q5171J12641J28228J20719J02584P5488L7452l2978p5736
8463A370923j09707j10118q1899r2004p2495l8757j0723L4534m24l0290l8330
$$ plain form
8452 820710 795478 775305 759599 779868 805080 851159 906328 962980 980870 923358 876209 799529
8440 799529 740433 681970 652163 593179 554286 529930 548064 571637 577620 627969 683657 754179
8428 754179 823894 928177 1071505 1247240 1428219 1621890 1766464 1841060 1807110 1681477
8418 1681477 1537851 1396965 1261423 1147241 1087206 1066809 1102104 1122435 1063911 971242 915061
8407 915061 871183 845547 864297 924505 966774 983825 997755 1001925 1004914 931132 831131 772333
8395 772333 719479 654749 620839 544006 499200 448133 429538 425671 416723 417066 409894 421642 445536
8382 445536 470254 482876 543541 593970 677388 746575 815959 828169 790620 753707 750759 715017
8370 715017 657452 654577 642529 621662 633532 628923 595368 570514 555864 545296 537004 533253
$$ packed form
8452H20710k5232k0173j5706K0269K5212M6079N5169N6652J7890n7512m7149p6680
8440G99529n9096n8463k9807n8984l8893k4356J8134K3573N983N0349N5688P0522
8428G54179O9715J04283J43328J75735J80979J93671J44574P4596l3950j25633
8418A681477j43626j40886j35542j14182o0035k0397L5295K0331n8524r2669n6181
8407I15061m3878k5636J8750O0208M2269J7051J3930M170K989p3782j00001n8798
8395G72333n2854o4730l3910p6833m4806n1067j8595l867q948L43p172J1748K3894
8382D45536K4718J2622O0665N0429Q3418O9187O9384J2210l7549l6913k948l5742
8370G15017n7565k875j2048k0867J1870m609l3555k4854j4650j0568q292l751
$$ plain form
8358 533253 545290 556061 519273 531942 548245 512382 465483 427922 409708 409075 423589 376638
8346 376638 335124 322498 331730 336727 320515 299259 258941 255451 241128 233708 216912 207327 221036
8333 221036 215679 183630 206393 248339 265826 270618 266962 254225 231880 229149 255171 314682
8321 314682 355613 359618 373648 373834 324610 280929 246777 249005 228453 225055 236378 225796 204474
8308 204474 223504 239482 230136 204186 211231 200948 192235 204144 230909 260315 290859 295792
8296 295792 296445 292412 273892 250803 206394 195237 188602 191800 207895 210733 201096 193138 193027 184973
8282 184973 179999 170086 188286 174354 162112 176170 190062 199752 206754 218704 219548 242361 252748
8269 252748 237518 215962 230700 232753 241623 247248 236860 251595 243918 241979 219148 215998 195896
$$ packed form
8358E33253J2037J0771l6788J2669J6303l5863m6899l7561j8214o33J4514m6951
8346C76638m1514j2626R232M997j6212k1256m0318l490j4323p420j6796r585J3709
8333B21036n357l2049K2763M1946J7487M792l656j2737k2345k731K6022N9511
8321C14682M0931M005J4030J86m9224m3681l4152K228k0552l398J1323j0582k1322
8308B04474J9030J5978r346k5950P045j0283q713J1909K6765K9406L0544M933
8296B95792O53m033j8520k3089m4409j1157o635L198J6095K838r637p958j11q054
8282A84973m974r913J8200j3932j2242J4058J3892R690P002J1950Q44K2813J0387
8269B52748j5230k1556J4738K053Q870N625j0388J4735p677j939k2831l150k0102
$$ plain form
8256 195896 182325 202607 225172 258165 265651 264542 255965 250235 234407 214264 212582 195846 182868
8243 182868 197072 192241 194540 211167 187617 173380 180736 213863 222112 198668 213207 207381 200120
8230 200120 220998 234631 232535 252429 292844 319550 324475 355071 406003 444651 446162 428898
8218 428898 447046 460165 467337 486064 543330 606819 674087 743374 836327 886960 886923 839709
8206 839709 793526 749924 732252 709661 652596 595672 558975 538422 512393 520099 572891 658795
8194 658795 736473 758569 716484 633601 578764 546871 479398 427019 412839 395584 400068 410464
8182 410464 404904 389930 395685 406689 420728 437116 508521 554213 582601 638102 702049 785790
8170 785790 883225 962882 1047296 1201786 1355620 1484986 1574401 1604258 1567035 1498494 1396448
$$ packed form
8256A95896j3571K0282K2565L2993P486j109q577n730j5828k0143j682j6736j2978
8243A82868J4204m831K299J6627k3550j4237P356L3127Q249k3444J4539n826p261
8230B00120K0878J3633k096J9894M0415K6706M925L0596N0932L8648J511j7264
8218D28898J8148J3119P172J8727N7266O3489O7268O9287R2953N0633l7m7214
8206H39709m6183m3602j7672k2591n7065n6924l6697k0553k6029P706N2792Q5904
8194F58795P7678K2096m2085q2883n4837l1893o7473n2379j4180j7255M484J0396
8182D10464n560j4974N755J1004J4039J6388P1405M5692K8388N5501O3947Q3741
8170G85790R7435P9657Q4414J54490J53834J29366Q9415K9857l7223o8541j02046
$$ plain form
8159 1396448 1268497 1159547 1072698 979049 877828 838943 854270 862931 910229 994735 1107470
8148 1107470 1165850 1122648 1013873 889200 811779 750802 668109 578612 505430 475953 493104
8137 493104 477588 451078 432117 420816 440530 439112 424508 407811 411080 427575 480466 534054
8125 534054 587597 608478 656518 760286 825239 888954 935192 977700 993966 971918 963863 974772
8113 974772 980997 962835 897418 837733 785056 722156 659665 646514 635902 615319 630534 624845
8101 624845 598701 533485 469757 440629 407026 361257 324184 303790 274324 266359 262432 242466
8089 242466 236683 254898 246771 237775 243387 236772 230260 206320 219551 228135 234838 234986 258325 298153
8075 298153 355877 439987 507595 557566 629558 716475 831153 939527 968464 944573 857763
$$ packed form
8159A396448j27951j08950q6849r3649j01221l8885J5327Q661M7298Q4506J12735
8148A107470N8380m3202j08775j24673p7421o0977q2693q9497p3182k9477J7151
8137D93104j5516k6510j8961j1301J9714j418j4604j6697L269J6495N2891N3588
8125E34054N3543K0881M8040J03768O4953O3715M6238M2508J6266k2048q055J0909
8113I74772O225j8162o5417n9685n2677o2900o2491j3151j0612k0583J5215n689
8101F24845k6144o5216o3728k9128l3603m5769l7073k0394k9466p965l927j9966
8089B42466n783J8215q127q996N612o615o512k3940J3231Q584O703J48K3339L9828
8075B98153N7724Q4110O7608M9971P1992Q6917J14678J08374K8937k3891q6810
$$ plain form
8064 857763 785781 704133 612027 524468 474404 429502 386614 343277 330804 342183 338914 322873
8052 322873 318326 360825 364265 365104 377241 325737 275463 264057 257185 251538 238478 231459 254893
8039 254893 278462 284689 302913 299104 286661 253703 291234 332007 360598 372303 417783 490002
8027 490002 566529 652299 727776 768477 807394 786164 747507 681416 623760 555949 499782 430365
8015 430365 385572 368777 394839 406302 401976 399257 400133 381192 384848 384179 409283 402993 385406
8002 385406 385995 390991 393726 391664 367931 348917 348523 347255 321491 325960 332023 321654 330751 350064
7988 350064 353788 360157 352249 368440 343263 333513 327623 321087 343063 372837 356689 328449 303839
7975 303839 286267 277647 250880 225048 211541 230884 249461 230223 206899 227466 260750 262933
$$ packed form
8064H57763p1982q1648r2106q7559n0064m4902m2888m3337j2473J1379l269j6041
8052C22873m547M2499L440Q39J2137n1504n0274j1406o872n647j3060p019K3434
8039B54893K3569O227J8224l809j2443l2958L7531M0773K8591J1705M5480P2219
8027D90002P6527Q5770P5477M0701L8917k1230l8657o6091n7656o7811n6167o9417
8015D30365m4793j6795K6062J1463m326k719Q76j8941L656o69K5104o290j7587
8002C85406N89M996K735k062k3733j9014l94j268k5764M469O063j0369R097J9313
7988C50064L724O369p908J6191k5177r750n890o536K1976K9774j6148k8240k4610
7975C03839j7572q620k6767k5832j3507J9343J8577j9238k3324K0567L3284K183
$$ plain form
7963 262933 242756 242383 269580 294403 320433 328472 320720 305457 322909 354285 371892 344098
7951 344098 342288 355744 345461 319294 310276 314333 307286 297993 285311 271482 275810 264921 224896
7938 224896 188490 191901 202969 201984 187954 186603 183770 166835 172386 176450 168496 166471 186067
7925 186067 201722 231576 232342 214055 212464 215785 207689 199470 208025 231269 224124 198121 210528
7912 210528 217013 220139 226491 265905 255209 253547 270350 266931 266742 226744 210052 198939 183392
7899 183392 186481 176551 164735 181325 182984 161658 149441 142076 147343 142749 117168 121011 129136
7886 129136 136876 137661 125832 115052 113842 116709 124311 136165 161252 142178 142002 141194 131410 117915
7872 117915 128115 119621 96769 109008 114737 122255 148835 151214 150937 140824 130679 124074 101827
$$ packed form
7963B62933k0177l73K7197K4823K6030Q039p752j5263J7452L1376J7607k7794
7951C44098j810J3456j0283k6167r018M057p047r293j2682j3829M328j0889m0025
7938B24896l6406L411J1068r85j4030j351k833j6935N551M064p954k025J9596
7925A86067J5655K9854P66j8287j591L321q096q219Q555K3244p145k6003J2407
7912B10528O485L126O352L9414j0696j662J6803l419j89l9998j6692j1113j5547
7899A83392L089r930j1816J6590J659k1326j2217p365N267m594k5581L843Q125
7886A29136P740P85j1829j0780j210K867P602J1854K5087j9074j76q08r784j3495
7872A17915J0200q494k2852J2239N729P518K6580K379k77j0113j0145o605k2247
$$ plain form
7859 101827 99094 100634 90592 72954 67979 63738 78241 91137 87197 82385 53819 72633 83123
7846 83123 118201 111006 106575 89613 65238 61330 36504 37307 61967 56367 54163 85602 97481
7833 97481 113745 112594 110356 98316 116236 125227 86411 59771 58230 61488 73658 94401 82469
7820 82469 77317 80640 61981 15565 19720 67309 97696 82053 41457 42447 51146 52886 28467
7807 28467 34653 42969 41932 29793 4121 -6556 15434 26532 20464 23133 36762 73302 69977
7794 69977 54766 54398 37961 22337 22711 33445 25817 53910 55872 40708 51540 66743 53382
7781 53382 51379 20384 18400 16659 29949 50951 55702 48885 41649 35643 58387 54709 55034 76997
7767 76997 58901 41571 54357 71986 68192 64701 36813 63842 48372 47696 62137 34551 6352
$$ packed form
7859A01827k733J540j0042j7638m975m241J4503J2896l940m812k8566J8814J0490
7846H3123L5078p195m431j6962k4375l908k4826Q03K4660n600k204L1439J1879
7833I7481J6264j151k238j2040J7920Q991l8816k6640j541L258J2170K0743j1932
7820H2469n152L323j8659m6416M155M7589L0387j5643m0596R90Q699J740k4419
7807B8467O186Q316j037j2139k5672j0677K1990J1098o068K669J3629L6540l325
7794F9977j5211l68j6437j5624L74J0734p628K8093J962j5164J0832J5203j3361
7781E3382k003l0995j984j741J3290K1002M751o817p236o006K2744l678L25K1963
7767G6997j8096j7330J2786J7629l794l491k7888K7029j5470o76J4441k7586k8199
$$ plain form
7754 6352 26174 37090 44389 38198 73476 82117 64168 58488 48271 44634 51010 60886 56630 44030
7740 44030 20776 11311 24283 22914 39512 53917 40508 50342 45576 48847 64078 61465 72069
7727 72069 65018 46795 32765 32103 34622 62979 63061 38471 35271 26322 10839 6152 25417 48483
7713 48483 34172 48037 60135 94294 139936 135749 78746 39667 60916 62247 52047 26028
7701 26028 5487 733 -9719 -14274 12589 52850 39458 -16956 -11501 5857 40268 43276 24141
7688 24141 18763 25440 27977 29651 40111 29948 30263 12065 13477 44246 54323 10381 -3124
7675 -3124 20960 60344 73073 87982 85428 43877 25051 49441 68811 71255 86372 56298
7663 56298 54411 49362 47769 38027 57143 56392 48149 24664 -10800 -5693 -18733 -20838 7611 21710
$$ packed form
7754F352J9822J0916P299o191L5278Q641j7949n680j0217l637O376R876m256j2600
7740D4030k3254r465J2972j369J6598J4405j3409R834m766L271J5231k613J0604
7727G2069p051j8223j4030o62K519K8357Q2k4590l200q949j5483m687J9265K3066
7713D8483j4311J3865J2098L4159M5642m187n7003l9079K1249J331j0200k6019
7701B6028k0541m754j0452m555K6863M0261j3392n6414N455J7358L4411L008j9135
7688B4141n378O677K537J674J0460j0163L15j8198J412L0769J0077m3942j3505
7675c124K4084L9384J2729J4909k554m1551j8826K4390J9370K444J5117l0074
7663E6298j887n049j593r742J9116p51q243k3485l5464N107j3040k105K8449J4099
$$ plain form
7649 21710 51741 53295 52761 58495 69274 66890 42225 31036 27924 47956 30319 4755 -24356
7636 -24356 -16611 30738 53472 52762 42257 35317 42254 29034 38537 25033 12525 24344 22139
7623 22139 60058 75393 75222 63119 54397 30644 34801 49117 46834 24955 4808 21183 20768
7610 20768 25626 41323 53397 56929 30367 19477 22996 28636 9220 6972 18427 46207 62371
7597 62371 61549 44501 53663 68188 68768 85507 80630 65098 54001 37715 22168 22968 25085 12376
7583 12376 -5616 1010 4863 -6448 34526 59073 56160 57769 48830 27624 20187 37350 64329
7570 64329 54402 45753 41198 30787 22147 31501 34367 56827 60702 46430 57279 43269 3174
7557 3174 8814 26721 36437 32167 37260 21200 -7964 -17549 9897 22295 32157 -1369 27173
$$ packed form
7649B1710L0031J554n34N734J0779k384k4665j1189l112K0032j7637k5564k9111
7636b4356P745M7349K2734p10j0505o940O937j3220R503j3504j2508J1819k205
7623B2139L7919J5335j71j2103q722k3753M157J4316k283k1879k0147J6375m15
7610B0768M858J5697J2074L532k6562j0890L519N640j9416k248J1455K7780J6164
7597F2371q22j7048R162J4525N80J6739m877j5532j1097j6286j5547Q00K117j2709
7583A2376j7992O626L853j1311M0974K4547k913J609q939k1206p437J7163K6979
7570F4329r927q649m555j0411q640R354K866K2460L875j4272J0849j4010m0095
7557C174N640J7907R716m270N093j6060k9164r585K7446J2398R862l3526K8542
$$ plain form
7544 27173 46208 26487 -6283 -7693 4929 8526 -968 14451 41730 30797 -3175 -7507 -9680
7531 -9680 -1100 13122 19083 -4879 -13425 -1355 -7099 -15682 -13144 -11315 -2259 12019 -8771 -17029
7517 -17029 -28445 -27684 -22364 -9143 16204 45218 41549 20503 15127 21928 11147 13556 29299
7504 29299 40055 44299 54487 46161 31235 27543 32536 18056 14524 3949 -17283 -16300 -9770
7491 -9770 12055 15476 2743 -6005 -9659 -10730 -10481 6914 -5218 -17949 -9277 -1060 -12187 3319
7477 3319 14086 27053 56576 56139 35100 73221 76397 36422 -1211 -1998 7204 26449 36002
7464 36002 55482 38445 34607 48436 72578 70473 75268 93560 109984 106862 72787 67723 85459
7451 85459 62033 41491 44599 48123 42862 47337 43575 52541 54319 57195 59547 81788 73170 62988
$$ packed form
7544B7173J9035j9721l2770j410J2622L597r494J5419K7279j0933l3972m332k173
7531i680Q580J4222N961k3962q546J2070n744q583K538J829R056J4278k0790q258
7517a7029j1416P61N320J3221K5347K9014l669k1046n376O801j0781K409J5743
7504B9299J0756M244J0188q326j4926l692M993j4480l532j0575k1232R83O530
7491i770K1825L421j2733q748l654j071K49J7395j2132j2731Q672Q217j1127J5506
7477C319J0767J2967K9523m37k1039L8121L176l9975l7633p87R202J9245R553
7464C6002J9480j7037l838J3829K4142k105M795J8292J6424l122l4075n064J7736
7451H5459k3426k0542L108L524n261M475l762Q966J778K876K352K2241q618j0182
$$ plain form
7437 62988 47759 42809 11775 4850 36289 46495 68376 37380 12173 16744 34120 66510
7425 66510 48762 29125 -6526 -15071 7548 24925 64735 95269 88345 84018 83389 73412 43712
7412 43712 14999 17172 30070 13742 -12094 -17918 -7797 -117 7554 24901 40084 35174 30153
7399 30153 26006 17840 263 -36636 -46824 -4437 32941 48702 39654 33203 34264 37213 66537
7386 66537 53628 55601 56166 39814 29317 17399 30915 2627 -23669 -35582 -25975 -25977 -25984 16977
7372 16977 40270 20073 19692 16337 -188 -12801 -12738 9841 29388 21141 1918 19013 43519
7359 43519 43103 38767 48603 31718 6445 20999 37992 17090 21051 19618 29137 37295 18362
7346 18362 17324 17795 34619 50706 55807 46957 27712 40497 52404 31583 21395 38889 60505
$$ packed form
7437F2988j5229m950l1034o925L1439J0206K1881l0996k5207M571J7376L2390
7425F6510j7748j9637l5651q545K2619J7377L9810L0534o924m327o29r977k9700
7412D3712k8713K173J2898j6328k5836n824J0121P680P671J7347J5183m910n021
7399C0153m147q166j7577l6899j0188M2387L7378J5761r048o451J061K949K9324
7386F6537j2909J973N65j6352j0497j1918J3516k8288k6296j1913R607kpM2961
7372A6977K3293k0197l81l355j6525j2613O3K2579J9547q247j9223J7095K4506
7359D3519m16m336R836j6885k5273J4554J6993k0902L961j433R519Q158j8933
7346A8362j038M71J6824J6087N101q850j9245J2785J1907k0821j0188J7494K1616
$$ plain form
7333 60505 59842 79451 71324 40829 11396 5788 3043 9687 15797 18825 33997 25566 22401 -6239
7319 -6239 -19589 -24949 9699 33868 51780 46995 41048 47394 55287 30119 9213 16902 27378
7306 27378 39008 32232 33483 31220 23112 23747 26598 39739 58069 54229 57565 76530 65479 30867
7292 30867 26714 38862 45782 25832 6382 22530 49016 32762 16037 44767 45159 18118 -10234
7279 -10234 14788 19455 27884 6255 125 35514 52616 49253 26961 19556 21003 15770 5254
7266 5254 7644 12505 -4559 -942 -4616 17350 23087 3581 -6912 -6054 153 -11636 5879 -397
7252 -397 -886 5705 -2515 6778 17938 22703 5688 -20120 1189 6358 6598 -3586 -25255 -49249
7238 -49249 -36513 -17040 6735 18245 33565 51975 69610 62188 28085 30265 39921 25748
$$ packed form
7333F0505o63J9609q127l0495k9433n608k745O644O110L028J5172q431l165k8640
7319f239j3350n360L4648K4169J7912m785n947O346P893k5168k0906P689J0476
7306B7378J1630o776J251k263q108O35K851J3141J8330l840L336J8965j1051l4612
7292C0867m153J2148O920j9950j9450J6148K6486j6254j6725K8730L92k7041k8352
7279a0234K5022M667Q429k1629o130L5389J7102l363k2292p405J447n233j0516
7266E254K390M861j7064L617l674K1966N737j9506j0493Q58O207j1789J7515o276
7252c97m89O591q220R293J1160M765j7015k5808K1309N169K40j0184k1669k3994
7238d9249J2736J9473K3775J1510J5320J8410J7635p422l4103K180R656j4173
$$ plain form
7226 25748 34874 47865 14160 -19949 -35123 -35495 -29346 -375 29684 37366 16255 30675 46752
$$ packed form
7226B5748R126J2991l3705l4109j5174l72O149K8971L0059P682k1111J4420J6077
$$ [...]
##END NTUPLES=NMR SPECTRUM
##END=
