##TITLE=Analysis number 328518
Compound Code cc 66713
Book Reference 528/36
Project Code adrs
Chemist Name davee
##JCAMPDX= 6.0         $$ Bruker NMR JCAMP-DX V2.0
##DATA TYPE= NMR SPECTRUM
##DATA CLASS= NTUPLES
##ORIGIN= Bruker BioSpin GmbH
##OWNER= nmr
$$ XWIN-NMR		Version 3.5
$$ Tue Jun 12 11:39:23 2007 GMT Daylight Time (UT+1h)  MAYBRIDGE\nmr@NMR_250MHZ
##.OBSERVE FREQUENCY= 250.131544655141
##.OBSERVE NUCLEUS= ^1H
##.ACQUISITION MODE= SIMULTANEOUS (DQD)
##.ACQUISITION SCHEME= undefined
##.AVERAGES= 16
##.DIGITISER RES= 18
##SPECTROMETER/DATA SYSTEM= dpx250
##.PULSE SEQUENCE= zg30
##.SOLVENT NAME= CDCl3
##.SHIFT REFERENCE= (INTERNAL, CDCl3, 0, 16.522)
##AUDIT TRAIL= $$ (NUMBER, WHEN, WHO, WHERE, WHAT)
$$ ##TITLE= Audit trail, XWIN-NMR		Version 3.5
$$ ##JCAMPDX= 5.01
$$ ##ORIGIN= Bruker BioSpin GmbH
$$ ##OWNER= nmr
$$ C:\u/data/dgb/nmr/ADRS/740/pdata/1/auditp.txt
$$ ##AUDIT TRAIL=  $$ (NUMBER, WHEN, WHO, WHERE, WHAT)
(   1,<2007-06-12 11:38:47.98 +100>,<MAYBRIDGE\nmr>,<NMR_250MHZ>,
      <created by zg, POWCHK disabled, PULCHK disabled
       configuration hash MD5:
       76 6E 9A 78 1E 09 19 81 EC 84 63 8F B0 6A 59 2D
       data hash MD5: 64K
       15 CF 56 4A B6 27 ED 5E 6F 9A CB 7F 86 A8 15 40>)
(   2,<2007-06-12 11:39:05.31 +100>,<MAYBRIDGE\nmr>,<NMR_250MHZ>,
      <Start of raw data processing
       ef LB = 0.3 FT_mod = 6 PKNL = 1 SI = 32K 
       data hash MD5: 32K
       6F B6 76 1C 2E A6 B8 28 1C 33 CC 61 09 AB 1A 26>)
(   3,<2007-06-12 11:39:09.26 +100>,<MAYBRIDGE\nmr>,<NMR_250MHZ>,
      <apk 
       data hash MD5: 32K
       65 A3 68 09 C2 57 33 D8 64 D8 0F C7 E7 A5 3D FE>)
(   4,<2007-06-12 11:39:10.65 +100>,<MAYBRIDGE\nmr>,<NMR_250MHZ>,
      <abs ABSG = 5 
       data hash MD5: 32K
       BF 22 32 CA 57 57 E6 25 0C 9F 45 BB 5E BC 37 89>)
$$ ##END=
$$ 
$$ hash MD5
$$ A7 35 92 CC D2 D3 95 1B B0 79 01 61 44 A0 E2 8E
##$RELAX= 
##$RELAX= 
##$RELAX= 
##$RELAX= 
##$RELAX= 
##$RELAX= 
##$RELAX= 
$$ Bruker specific parameters
$$ --------------------------
##$DU= <C:\u>
##$EXPNO= 740
##$NAME= <ADRS>
##$PROCNO= 1
##$TYPE= <nmr>
##$USER= <dgb>
##$AMP= (0..31)
100 100 100 100 100 100 100 100 100 100 100 100 100 100 100 100 100 100 
100 100 100 100 100 100 100 100 100 100 100 100 100 100 
##$AQSEQ= 0
##$AQ_mod= 3
##$AUNM= <au_zg>
##$AUTOPOS= <11 >
##$BF1= 250.13
##$BF2= 250.13
##$BF3= 250.13
##$BF4= 250.13
##$BF5= 500.13
##$BF6= 500.13
##$BF7= 500.13
##$BF8= 500.13
##$BYTORDA= 1
##$CFDGTYP= 0
##$CFRGTYP= 5
##$CHEMSTR= <none>
##$CNST= (0..31)
1 1 145 1 1 1 1 1 1 1 1 1 1 1 1 1 1 1 1 1 1 1 1 1 1 1 1 1 1 1 1 1 
##$CPDPRG= <>
##$CPDPRG1= <>
##$CPDPRG2= <>
##$CPDPRG3= <>
##$CPDPRG4= <mlev>
##$CPDPRG5= <mlev>
##$CPDPRG6= <mlev>
##$CPDPRG7= <mlev>
##$CPDPRG8= <mlev>
##$CPDPRGB= <>
##$CPDPRGT= <>
##$D= (0..31)
0 1 0 0 0 0 0 0 0 0.06 0 0 0 0 0 0 0.0002 0 0 0 0 0 0 0 0 0 0 0 0 0 0 
0 
##$DATE= 1181644726
##$DBL= (0..7)
120 120 120 120 120 120 120 120 
##$DBP= (0..7)
150 150 150 150 150 150 150 150 
##$DBP07= 0
##$DBPNAM0= <>
##$DBPNAM1= <>
$$ [...]
##$SUBNAM7= <"">
##$SUBNAM8= <"">
##$SUBNAM9= <"">
##$SW= 20.6930455092707
##$SWIBOX= (0..15)
0 0 3 0 0 0 0 0 0 0 0 0 0 0 0 0 
##$SW_h= 5175.983436853
##$TD= 65536
##$TD0= 1
##$TE= 296.16
##$TE2= 300
##$TE3= 300
##$TEG= 300
##$TL= (0..7)
0 120 120 120 120 120 120 120 
##$TP= (0..7)
150 150 150 150 150 150 150 150 
##$TP07= 0
##$TPNAME0= <>
##$TPNAME1= <>
##$TPNAME2= <>
##$TPNAME3= <>
##$TPNAME4= <>
##$TPNAME5= <>
##$TPNAME6= <>
##$TPNAME7= <>
##$TPOAL= (0..7)
0.5 0.5 0.5 0.5 0.5 0.5 0.5 0.5 
##$TPOFFS= (0..7)
0 0 0 0 0 0 0 0 
##$TUNHIN= 0
##$TUNHOUT= 0
##$TUNXOUT= 0
##$USERA1= <user>
##$USERA2= <user>
##$USERA3= <user>
##$USERA4= <user>
##$USERA5= <user>
##$V9= 5
##$VALIST= <valist>
##$VCLIST= <CCCCCCCCCCCCCCC>
##$VD= 0
##$VDLIST= <DDDDDDDDDDDDDDD>
##$VPLIST= <PPPPPPPPPPPPPPP>
##$VTLIST= <TTTTTTTTTTTTTTT>
##$WBST= 1024
##$WBSW= 4
##$XGAIN= (0..3)
0 0 0 0 
##$XL= 0
##$YL= 0
##$YMAX_a= 285752
##$YMIN_a= -467833
##$ZGOPTNS= <>
##$ZL1= 120
##$ZL2= 120
##$ZL3= 120
##$ZL4= 120
##$ABSF1= 16.522
##$ABSF2= -4.171173
##$ABSG= 5
##$ABSL= 3
##$ALPHA= 0
##$AQORDER= 0
##$ASSFAC= 0
##$ASSFACI= 0
##$ASSFACX= 0
##$ASSWID= 0
##$AUNMP= <proc_1d>
##$AZFE= 0.1
##$AZFW= 0.1
##$BCFW= 0
##$BC_mod= 0
##$BYTORDP= 0
##$COROFFS= 0
##$CY= 12.5
##$DATMOD= 1
##$DC= 0
##$DFILT= <>
##$DTYPP= 0
##$F1P= 14.0000005364418
##$F2P= -0.99999901652339
##$FCOR= 0.5
##$FTSIZE= 32768
##$FT_mod= 6
##$GAMMA= 0
##$GB= 0
##$INTBC= 1
##$INTSCL= 1
##$ISEN= 128
##$LB= 0.3
##$LEV0= 0
##$LPBIN= 0
##$MAXI= 10000
##$MC2= 0
##$MEAN= 0
##$ME_mod= 0
##$MI= 0
##$NCOEF= 0
##$NC_proc= -4
##$NLEV= 6
##$NOISF1= 0
##$NOISF2= 0
##$NSP= 0
##$NTH_PI= 0
##$NZP= 0
##$OFFSET= 16.522
##$PC= 1
##$PHC0= -53.53786
##$PHC1= 4.341439
##$PH_mod= 1
##$PKNL= yes
##$PPARMOD= 0
##$PSCAL= 4
##$PSIGN= 0
##$REVERSE= no
##$SF= 250.13
##$SI= 32768
##$SIGF1= 0
##$SIGF2= 0
##$SINO= 400
##$SIOLD= 32768
##$SREGLST= <1H.CDCl3>
##$SSB= 0
##$STSI= 32768
##$STSR= 0
##$SW_p= 5175.98343685301
##$SYMM= 0
##$S_DEV= 0
##$TDeff= 65536
##$TDoff= 0
##$TI= <Analysis number 999999
Compound Code 99
Book Reference 9
Project Code 9>
##$TILT= no
##$TM1= 0
##$TM2= 0
##$TOPLEV= 0
##$USERP1= <user>
##$USERP2= <user>
##$USERP3= <user>
##$USERP4= <user>
##$USERP5= <user>
##$WDW= 1
##$XDIM= 32768
##$YMAX_p= 273673115
##$YMIN_p= -100679
$$ End of Bruker specific parameters
$$ ---------------------------------
##NTUPLES= NMR SPECTRUM
##VAR_NAME=  FREQUENCY,     SPECTRUM/REAL,   SPECTRUM/IMAG
##SYMBOL=    X,             R,               I
##VAR_TYPE=  INDEPENDENT,   DEPENDENT,       DEPENDENT
##VAR_FORM=  AFFN,          ASDF,            ASDF
##VAR_DIM=   32768,         32768,           32768
##UNITS=     HZ,            ARBITRARY UNITS, ARBITRARY UNITS
##FACTOR=    0.157963299565203, 1,           1
##FIRST=     4132.6476996994, 0,             0
##LAST=      -1043.33573715361, 0,           0
##MIN=       -1043.33573715361, -100679,     0
##MAX=       4132.6476996994, 273673115,     0
$$ Real data points
##PAGE= N=1
##DATA TABLE= (X++(R..R)), XYDATA
$$ [...]
18291E9713k1396M411K2707M172J079j5851j7500l655K5450K5135k4218o678J1954
18278F5323l947k8634j3534k0015k074J3603N3885J8276J0497m6902j6401K0381
18266E0458%l175K2861J7838R982J43j023k0788m2023j9576j833J1356l620Q375
18252B8975m684j1392J0654Q748K2234l379j2681m1951k0449L9120M1690j8516
18240C8369O551M3303M3589R566k8621j5841P491Q057O067n714n389j5067l8329
18227E4032P980r735K1804p579r712L0101K5233L781m465j4855k8565k2602L3775
18214G9193J776j7535l6711k0130J4251J0532N579j604n167L368J4996j2841K774
18201C8481K8359k141j0730M782j382n103r657L3686P241j1118J3919J8313k2481
$$ plain form
18291 59713 38317 42728 65435 69607 70686 54835 37335 33680 59130 84265 60047 53369 65323
18278 65323 61376 32742 19208 -807 -2881 10722 64607 82883 93380 46478 30077 50458
18266 50458 50458 47283 70144 87982 97964 98107 97084 76296 34273 14697 12864 24220 20600 28975
18252 28975 24291 12899 23553 32301 54535 51156 38475 -3476 -23925 15195 56885 38369
18240 38369 44920 88223 131812 141378 112757 96916 104407 112464 118531 112817 107428 92361 54032
18227 54032 62012 52277 74081 66502 56790 86891 112124 115905 111440 96585 68020 45418 79193
18214 79193 80969 63434 26723 6593 20844 31376 36955 35351 30184 33552 48548 35707 38481
18201 38481 66840 64699 53969 58751 57369 52266 42609 76295 83536 72418 86337 104650 82169
18188H2169m503J0212n559k1422j9942J9740K5092O348J3156j2527l4779J431
18176E9416J1263K7456J2553l564j1332L2169J6571l025j6591K250m752o160m805
18163A11449K4145K4612N398J0685j5878p394K618J5902m994n754K6092p228M109
18150A83762m707R273M1764M4526K2932R573M1344M7266J9751J0787j9070j5988
18138C91213j8443P717K8031K536J7720q855j678K4017J8177J4658M2040L3738
18126E50871O6190R2172R7296J22571R7450Q9180J69057K34918L23688M47498
18116B290891N93527R14123J487621K558453M548017P577640J1040613J5569253
18108D6580138J4674021l625709j4859077j5457334j0613814n951171l185763
$$ plain form
18188 82169 77666 87878 82319 60897 40955 60695 85787 92135 105291 92764 57985 59416
18176 59416 70679 98135 110688 107124 95792 127961 144532 141507 124916 127166 122414 116254 111449
18163 111449 135594 160206 165604 176289 160411 153017 155635 171537 166543 160789 186881 179653 183762
18150 183762 179055 188328 230092 274618 297550 307123 348467 395733 415484 426271 407201 391213
18138 391213 372770 380487 408518 411054 428774 419919 418241 442258 460435 475093 517133 550871
18126 550871 617061 709233 806529 929100 1026550 1115730 1284787 1519705 1843393 2290891
18116 2290891 2884418 3798541 5286162 7844615 12392632 19970272 31010885 46580138
18108 46580138 61254159 57628450 42769373 27312039 16698225 10747054 7561291
18101G561291j607465o57660l69660p00756q28047p30438n11764k85111j71700
18092A698690j46118p6870Q656O146o6921r9940p5653m0832N4332J47646K87077
18081A696213M26047M50291K71653j07713l80923l95669k28225j6884J70486L54198
18071B239474M61426N40145L07995k23713m33346l61926j34579j8374m25P0522
18061B447199K26529M28933O14784Q57649J137102J558561K466209M250456P046867
18052B1034289J0465424J4581006J4734682K167008r583966j2002146p563440
18045C3832857r51051N109866J0425214J2739055L549867r755028j4982141j3065631
18037B6903008q641373n086100k912209j696632j102572q33832n70041l25380
$$ plain form
18101 7561291 5953826 5296166 4926506 4225750 3397703 2667265 2155501 1870390 1698690
18092 1698690 1552572 1475702 1484358 1490504 1423583 1323643 1247990 1207158 1261490 1409136 1696213
18081 1696213 2122260 2572551 2844204 2736491 2355568 1959899 1731674 1714790 1885276 2239474
18071 2239474 2700900 3241045 3549040 3325327 2891981 2530055 2395476 2377102 2376677 2447199
18061 2447199 2673728 3102661 3717445 4575094 5712196 7270757 9736966 13987422 21034289
18052 21034289 31499713 46080719 60815401 62982409 53398443 41396297 33832857
18045 33832857 32881806 37991672 48416886 61155941 64705808 54950780 39968639 26903008
18037 26903008 18261635 13175535 10263326 8566694 7464122 6630290 6060249 5734869
18029E734869p0438K35171N21607Q36425J180375J738756K922004N236212Q729715
18020B7064696J2791975J7792646J5815810j600083j3417540j4002031p431905
18013C7013568M64156P181762J3218096J4605266P76145j3948044j7946031j4398440
18005B6966478r143984n337618l140998j987242j430817j079899p98275n62352
17997C485293l66361k16040j68755j63702k12339k28126k24372j49059r4179r7107
17987A565253j53054j68369j20277n2234o3437n708K4649k4511r2945j25499p9900
17976G03968n4449o5164m8748k8595j3730j2345k7583k767k1903J87J2634q481
17964D33024k46O992l5801r586j0910N11n868m4155k7904k2727K3773J584K1992
$$ plain form
18029 5734869 5664431 5899602 6421209 7257634 8438009 10176765 13098769 18334981 27064696
18020 27064696 39856671 57649317 73465127 71865044 58447504 44445473 37013568
18013 37013568 37477724 44659486 57877582 72482848 73258993 59310949 41364918 26966478
18005 26966478 17822494 12484876 9343878 7356636 5925819 4845920 4047645 3485293
17997 3485293 3118932 2902892 2734137 2570435 2358096 2129970 1905598 1756539 1662360 1565253
17987 1565253 1412199 1243830 1123553 1071319 1007882 1002174 1026823 1002312 909367 783868 703968
17976 703968 649519 584355 535607 507012 493282 480937 453354 450587 428684 428871 441505 433024
17964 433024 432778 439770 403969 394383 383473 383984 378116 333961 306057 283330 307103 308687 330679
17951C30679J621K60m8881n0576J356O976o188J1853j6646l7434k6635j6846n681
17938A43858J4621r438k914J0822O225p892j7497l5086j9683J9890K3176p082
17926A19000j347J939L595j6064K5711J4174J4506L586n49j834N355k0854j7056
17913A30162j8534k7300l142j3067N533K1114k613k2907j7352N709J8578P172
17901H3353k3785j4134L4765O271j2610j3271K7321L5357J3951l3336j0188j7315
17889G6379j9053Q377L5683K5483J6437j4189m0942j8322K0673j0899l1426l6528
17877A1673K8487J6008j5600K9908n534j3815Q970j1989p604N170L410J7230J8578
17864H4892J3793m594j7900O707K1421K6299k8779j9178J7143L016N84L422L0333
$$ plain form
17951 330679 332300 332560 283679 233103 234459 241435 235247 247100 230454 193020 166385 149539 143858
17938 143858 158479 149041 146127 156949 163174 155282 137785 102699 83016 102906 126082 119000
17926 119000 117653 119592 123187 107123 132834 147008 161514 165100 164551 162717 168072 147218 130162
17913 130162 111628 84328 81186 68119 73652 94766 92153 69246 51894 57603 76181 83353
17901 83353 59568 45434 80199 86470 73860 60589 87910 123267 137218 103882 93694 76379
17889 76379 57326 65703 101386 126869 143306 129117 88175 69853 90526 79627 48201 11673
17877 11673 40160 56168 40568 70476 64942 51127 60097 48108 40504 45674 49084 66314 84892
17864 84892 98685 94091 76191 82898 104319 130618 101839 82661 99804 102820 103404 106826 137159
17851A37159J5836K634j2584L510J2401m872n589N962p337r180j7835k0962O19
17838I9762L9216R365j3314J2119j9550l3846k1122k4717J3953P0J0216Q736j4091
17825F6797l1886j1707K3995L3100M077j1764j321N241K060j7121k5959K505M6899
17812H4916O837m0944k9698J5735j4210p772R426m728k0834J8810K3691J5248
17800E6477J107J8085K706j0878J6174P346K076K9867O659O603K4741L59j6857
17787A44465m7089k6716Q197m71J9274J9668P18J409O946K226K0578j1682k6215
17774A11308K2520n933O085n498k5568j7181j7863J6179J820K7325j1963J8115
17762A19346K0469j9863o391n902M290J1514l2370k976J3058k3203j0546m137
$$ plain form
17851 137159 152995 155629 143045 146555 158956 154084 148495 154457 147120 137940 120105 99143 99762
17838 99762 138978 148343 135029 147148 127598 93752 72630 47913 61866 61936 72152 80888 66797
17825 66797 34911 23204 47199 80299 84376 72612 71291 76532 78592 61471 35512 38017 84916
17812 84916 91753 50809 21111 36846 22636 14864 24290 19562 -1272 17538 41229 56477
17800 56477 57584 75669 78375 67497 83671 91017 93093 122960 129619 136222 160963 161322 144465
17787 144465 97376 70660 78857 78386 97660 117328 118046 119455 126401 128627 149205 137523 111308
17774 111308 133828 127895 133980 128482 102914 85733 67870 84049 85869 113194 101231 119346
17762 119346 139815 119952 113561 107659 111949 123463 91093 88117 101175 77972 67426 63289
17750F3289J2433K5430M0821J3413J0881J5187l863p765o501O82j387k9500O663
17737A39783K6276k6524l2108j467j1475J024k361l815n496K2939j2763O553L5676
17724A36242J1688p533J9170K8578l518j3428l0147k7335r109J8326K0602J2146
17712A55682r828K51N384o4J5992J0346p036L663R729K1622j1627l4604k6643
17699A32867m809n934k2320N556L6963R789J4101L3086O0485J8638K2786M8208
17687C49416M7605O3582M0152j400L1308N2869J5903K9344N1175N0149M9598K7055
17675H06756L176O4194J12901P5933l9867o7763J5302J24685J59389K02134K30815
17664A687655J69030J44709K38215L71661K74270K6631M385J80459K58521K34510
$$ plain form
17750 63289 75722 101152 141973 155386 166267 181454 177591 169826 163325 164007 162620 133120 139783
17737 139783 166059 139535 107427 105960 94485 95509 93148 89333 83837 106776 94013 100566 136242
17724 136242 147930 140397 159567 188145 184627 171199 141052 113717 104608 122934 143536 155682
17712 155682 145854 146105 151489 151425 167417 177763 170727 174390 184119 205741 194114 159510 132867
17699 132867 128058 122124 99804 105360 142323 152112 166213 199299 259784 278422 301208 349416
17687 349416 397021 460603 500755 499355 530663 583532 599435 628779 679954 730103 779701 806756
17675 806756 809932 874126 987027 1062960 1023093 955330 970632 1095317 1254706 1456840 1687655
17664 1687655 1856685 2001394 2239609 2611270 2885540 2912171 2916556 3097015 3355536 3590046
17654C590046K78987M77148Q43980R50787K09562p52297j062947q99592n48745
17645C086929m35303m50967l85448k86015j66818r4548m4230J162O1793K2571
17635A309126M8112P5292J20539K09575K61225K79361K77032K26683K04257L42947
17625C354149O00561R63945J438679K157596L178328M626970O747346R265993
17617C2333567J0320697O713884j864441q819162j0798382q815111n825119l474195
17609I771738k016795j164196o10627k60487M9402M02145P83365J313446K209327
17600A0477318L637538N824141Q970564J3151861J7012931J6574834P164676p184985
17592G5628878j6032185j6534536j1904843o319393j527448K392624N541030O641077
$$ plain form
17654 3590046 3869033 4346181 5190161 6140948 6350510 5598213 4535266 3635674 3086929
17645 3086929 2651626 2200659 1815211 1529196 1362378 1267830 1223600 1224762 1286555 1309126
17635 1309126 1357238 1432530 1553069 1762644 2023869 2303230 2580262 2806945 3011202 3354149
17625 3354149 3954710 4918655 6357334 8514930 11693258 16320228 23067574 32333567
17617 32333567 42654264 49368148 47503707 38684545 27886163 19071052 13245933 9771738
17609 9771738 7754943 6590747 5980120 5719633 5769035 6171180 6954545 8267991 10477318
17600 10477318 14114856 19938997 28909561 42061422 59074353 75649187 82813863 75628878
17592 75628878 59596693 43062157 31157314 24837921 23310473 25703097 31244127 37885204
17584C7885204L268470l544848q039593q384781o286195l981438k326950j320701
17576G269168p52073l71467r3512J20415L39523O16449J078856J945632L380169
17567A3533160N742687R202983J3449410J7027280J5622839M431356r953782j7318659
17559E1737274j6373938j1652802p231556m346832k678050j681362j057966o74936
17551F039832m80444k89611j56268J111J84707L79157O63284J052985J599816
17542H994569K456343L488544M750519N846530N069714L076848K955612N173255
17534D1811934Q737927Q955966L117698l62392l57213R6908O08468L43072J070533
17525F4022901J621448l588780q435598q307591m894543j534326j316614k510553
$$ plain form
17584 37885204 41153674 37608826 29569233 21184452 14898257 10916819 8589869 7269168
17576 7269168 6517095 6145628 6052116 6172531 6512054 7128503 8207359 10152991 13533160
17567 13533160 19275847 28478830 41928240 58955520 74578359 79009715 69055933 51737274
17559 51737274 35363336 23710534 16478978 12132146 9454096 7772734 6714768 6039832
17551 6039832 5559388 5269777 5113509 5114620 5299327 5678484 6341768 7394753 8994569
17542 8994569 11450912 14939456 19689975 25536505 30606219 33683067 36638679 41811934
17534 41811934 50549861 59505827 62623525 62261133 61903920 62000828 62609296 62952368 64022901
17525 64022901 65644349 62055569 53619971 45312380 40417837 38883511 37566897 35056344
17517C5056344k586297k409047j880494l29637K023771M353700L266779l69687
17509C7125432j559837j001070k52448J08876k86594Q9787l67478l297868m814965
17500B5743835m127414k329179j316780k143382l057006l049407k373538j578301
17492E768828j025767p44462n34344l83967k87612k39918j95734j88787k14358
17483A953879k03202j45412j02498o9880l3725r2711j13139q2081o9702k2815
17473A018714k3605m4721m2922n4556o1323n6632l8847k4457k0520k0749j5536
17462F14846O312L6516L2336O6387Q2228Q6697J5628r7315j18547r2991o9322
17451E62775k7838J8610M5421M8973k9383p7670l6815J3130M6794N7322R951p0433
$$ plain form
17517 35056344 32470047 30061000 28180506 27850869 29874640 34228340 37495119 37125432
17509 37125432 35565595 34564525 34312077 34420953 34134359 34224146 33856668 30558800 25743835
17500 25743835 21616421 19287242 17970462 15827080 12770074 9720667 7347129 5768828
17492 5768828 4743061 3998599 3464255 3080288 2792676 2552758 2357024 2168237 1953879
17483 1953879 1750677 1605265 1502767 1432887 1399162 1306451 1193312 1111231 1041529 1018714
17473 1018714 995109 950388 907466 852910 791587 734955 696108 671651 651131 630382 614846
17462 614846 621158 657674 690010 756397 838625 925322 940950 843635 725088 632097 562775
17451 562775 534937 553547 598968 647941 618558 540888 504073 517203 563997 621319 631270 560837
17439E60837p3428l6853q3655m2370k6680r68K0335P531l634J6960l714M9578
17427C83939O1030N8690N915p4782m9201l6611m2706k5750M8071L1932K4935l6107
17415C49355n4293m9034k5606Q382k4698m799J3889M192m089O091N378k3960l1051
17402A69757q235J4543k361J0377k5067k4650K2914j697k0293r718k1276L777
17390A08071j6389l403j5435j2571k0029J204J3314Q158L487K0656p46k468l413
17377H0436O225K2592K8381j2074j7099J6512J6278r084k4726j1782j6495j3521
17365F5643j7249n293M621j3809J069J7499O413J275k272P609L423J2898P722
17352H9549M978K4670K0455j1694m1874k6899J1253K1057j0338J0916K07l8525
$$ plain form
17439 560837 487409 450556 366901 324531 297851 296883 317218 324749 321115 338075 334361 383939
17427 383939 444969 503659 509574 434792 385591 348980 306274 280524 328595 360527 385462 349355
17415 349355 295062 246028 220422 228804 204106 199307 213196 217388 213299 219390 224768 200808 169757
17402 169757 161522 176065 173704 184081 159014 134364 157278 155581 135288 125570 104294 108071
17390 108071 91682 88279 72844 60273 40244 41448 54762 62920 66407 87063 86317 83849 80436
17377 80436 86661 109253 137634 125560 108461 124973 141251 132167 107441 95659 79164 65643
17365 65643 48394 43101 47722 33913 34982 52481 58894 60169 57897 65506 68929 81827 89549
17352 89549 94527 119197 139652 127958 86084 59185 70438 91495 81157 92073 92280 53755
17340E3755J6234j303L0467M99j8624M699P081L576j1143l6204n132j716j8242
17327B3947m750L504j1542k3196M4454K7772j9167k9870L631K8829K0663r172
17315E5103q598j7021j6378J2586p935N972K3801J8187n925j9767J8131M058j1178
17302E1036k0853O783n849k2470R452J3070j867O974j064J2089L42k2971k2807
17289A865l350M451L4144P031l9804J1344J8849j005j029q56Q10R503o235j468
17275C4250K4542m250j8071l865N717j8697j8838L8067J9789j7038j9083P540
17263C0063J8377j3401k7953J3481N933o167J1638m697k032J4042J4287J8364
17251G1935R686Q327J8596q221m5198l5891k1665k1953Q56K7765K2452j7462j262
$$ plain form
17340 53755 69989 68686 99153 99652 81028 85727 92808 96384 85241 49037 43905 42189 23947
17327 23947 19197 22701 11159 -12037 32417 60189 41022 11152 14783 43612 64275 55103
17315 55103 46505 29484 13106 25692 17757 23729 47530 65717 59792 40025 58156 62214 51036
17302 51036 30183 36966 31117 8647 18099 31169 29302 36276 35212 47301 47643 24672 1865
17289 1865 -1485 2966 37110 44141 4337 15681 34530 33525 32496 31640 32450 41953 35718 34250
17275 34250 58792 54542 36471 32606 38323 19626 788 38855 58644 41606 22523 30063
17263 30063 48440 35039 7086 20567 26500 20333 31971 27274 25242 39284 53571 71935
17251 71935 81621 89948 108544 100323 55125 19234 -2431 -24384 -23528 4237 26689 9227 7965
17238G965L4259K0757j4290J284l0610q982Q639L0168J5564J6827J4492j7748
17226G8325k4279k6028N108k5829N420k3773l594K9826J4565k6216P44K5301K8299
17213E7869M949j497l003j0863j0756j5645J68k1377Q928J6911k0975j2435K7173
17200A9447j6659j3115K63j3147k610M43J5906n357j2999J1968K1433J6480L461
17187B5514j8149J4872k968j4053k0120J8432J4246O701l998j0913J3712N497
17175B8773j5680k239N62K1185j0652L445L4624j1882j1677p660K7663J2652l7122
17162C1992k4486p547R219l087O404L0065J248k9989m1803j9316O174K5272K7981
17149A2127p666J0562M4525P702l8737j6080J6948q199k3464j1037J9931J3437
$$ plain form
17238 7965 42224 62981 48691 49975 19365 10383 19022 49190 64754 81581 96073 78325
17226 78325 54046 28018 33126 7297 12717 -11056 -14650 15176 29741 3525 4269 29570 57869
17213 57869 62818 61321 58318 47455 36699 21054 21222 -155 8773 25684 4709 -7726 19447
17200 19447 2788 -10327 -10064 -23211 -25821 -25378 -9472 -14829 -27828 -15860 5573 22053 25514
17187 25514 7365 22237 19269 5216 -14904 3528 17774 24475 20477 9564 23276 28773
17175 28773 13093 10854 11416 32601 21949 25394 60018 48136 36459 28799 56462 69114 31992
17162 31992 7506 -41 9178 6091 12495 42560 43808 13819 -27984 -47300 -41126 -15854 12127
17149 12127 4461 15023 59548 67250 28513 12433 29381 21182 -2282 -13319 6612 20049
17137B0049K3460j9357j8741q719J1969k4407j5625N0362K3476j1252q537j2749
17125I929K623O184N314J4212l56R644j3132L815l104j4875K7273K2241l3042
17112C6726k1451l962j4228J4422J8766q024K192p950J6947J3580j211q081q433
17099B9293j5412j717K411o499J4405m977n624M564J3236R078M215L5607M5936
17086A24516P5143N6882P1486J7270m0172o4259q7307k2177j9633l7795m2588
17075C1366k5640J6874L2323M733k1208k647L7043j395j2854K1329L2368N6971
17063A69263P4818N8373P850l3715m7343n837k4193k8571l163J3599N0920P2524
17051C04525M7803J3884o0595p1543q9302l9914m7479q770o087L3417r19p140
$$ plain form
17137 20049 43509 24152 5411 -3308 8661 -15746 -31371 18991 42467 31215 22678 9929
17125 9929 12552 18736 24050 38262 37906 47550 34418 38233 35129 20254 47527 69768 36726
17112 36726 15275 11313 -2915 11507 30273 22249 24441 16491 33438 47018 45807 37726 29293
17099 29293 13881 12164 14575 8076 22481 17504 11880 16444 29680 38758 42973 78580 124516
17086 124516 199659 256541 328027 345297 305125 240866 153559 131382 111749 73954 31366
17075 31366 5726 22600 54923 59656 38448 35801 72844 71449 58595 79924 112292 169263
17063 169263 244081 302454 310304 276589 229246 223409 199216 170645 167482 181081 232001 304525
17051 304525 352328 366212 305617 234074 144772 104858 57379 48609 42522 75939 75020 67880
17039F7880J0958j1242j7135k935K0665o3L8641K8639M5354L4514K7451l8757
17027B03970l7090m1588l7666l1198k9167L039K394J7672R497L438L183L5971
17015A02455L8516L2656O540M486k661N9228M3645J5973j896k890j1541J8247
17003C02758O334J086j7001k3937p821J7831l1672l1608J517j0452k6183l8331
16991A42521L748O355J1219P3690J0087p234q394J1437J2672J7595L437k5096
16979B52037k9970k1671j8700l7550k3845P149j4433n537J1641j6851m3644j1061
16967D7565k8106k09K313k0767K520O186N411P879j4281J3105k9478J6918K7612
16954C6668q654J2878M898k9939k9359k4430k7781P255J7354K9400J9934J0343
$$ plain form
17039 67880 78838 67596 50461 47526 68191 68128 106769 135408 180762 215276 242727 203970
17027 203970 166880 125292 87626 56428 27261 30300 32694 50366 59863 63301 66484 102455
17015 102455 140971 173627 180167 184653 181992 241220 284865 300838 298942 296052 284511 302758
17003 302758 309092 310178 293177 269240 261419 279250 247578 215970 217487 207035 180852 142521
16991 142521 146269 152624 163843 237533 247620 240386 231992 243429 256101 273696 277133 252037
16979 252037 222067 200396 181696 144146 120301 127450 113017 107480 119121 102270 58626 47565
16967 47565 19459 19250 21563 796 3316 9502 14913 22792 8511 21616 -7862 9056 36668
16954 36668 28014 40892 45790 15851 -13508 -37938 -65719 -58464 -41110 -11710 8224 18567
16942A8567j0043m0267k8050J0367M870K4949O966J3394K7779R711j4112k1292
16930B839k1648K98K0695P690j4819p321J3505l760L021k233P403O359k117L809
16916A3721j6857Q797J5307J2686N813j5839J1671R302k453j2902k8811j2374
16904a1939n858O487j9150p75l250J4281l186J0338J7221Q019j6138J0424L323
16891I797k0892n556j163J2292K1798m669j2874L274k056P585M227L0797j6016
16878B6544k602j4348l3687K943O178L690J6202k5933r587J3107L387J7194K0632
16865B3720j8678j8026k091J797l2093j2781L2875K0313j6855k1344n201L5812
16853a2552L8440J1033j9117P045j1822k0051J0498R891J8079N059n211l712l3369
$$ plain form
16942 18567 8524 -31743 -59793 -49426 -44556 -19607 -12641 753 28532 38243 24131 2839
16930 2839 -18809 -18511 2184 9874 -4945 -12266 1239 -2521 500 -1733 5670 12029 9912 13721
16916 13721 -3136 5661 20968 33654 39467 23628 35299 44601 42148 29246 435 -11939
16904 -11939 -17797 -11310 -30460 -31235 -34485 -20204 -23390 -13052 4169 12188 -3950 6474 9797
16891 9797 -11095 -16651 -17814 -5522 16276 11607 -1267 2007 -49 7536 11763 42560 26544
16878 26544 23942 9594 -24093 -21150 -14972 -11282 4920 -21013 -30600 -17493 -14106 3088 23720
16865 23720 5042 -12984 -15075 -13278 -45371 -58152 -25277 -4964 -21819 -43163 -48364 -12552
16853 -12552 25888 36921 17804 24849 13027 -7024 3474 13365 31444 36503 31292 27580 -5789
16840e789j4545N3645L7524n3216j8431m751j5260R46m816J975J0512p226j4J4140
16826e306J7627M488o244q695j354J5410L7570J0898k6350k7278l2396j4491J114
16813c5007O803r51l2515k3485J1456L7196L9258j16J0002P152O111K876k490
16800B6290k8793o028L806j0363M626k518K6271L315J769k934k242m432K4324
16787C3091p911R098K694L3956o089k6952j8315k2966j6111j9495J2587J0676
16775a5737j2817j5286K421K494R810K551J1568J0663P120k8428j9408p12k6812
16762g2573J1677J3244N6155n288L970K2821l3975k4804M245K4394P696k0378
16750a2816k469J4246q711o038K3782K8767k1685l7849N979J1646j190p379R744
$$ plain form
16840 -5789 -20334 33311 70835 17619 -812 -5563 -20823 -19877 -24693 -22718 -12206 -19432 -19446 -5306
16826 -5306 12321 16809 10565 1870 516 15926 53496 64394 38044 10766 -21630 -36121 -35007
16813 -35007 -28204 -29155 -61670 -85155 -73699 -36503 2755 2639 12641 19793 25904 28780 26290
16800 26290 -2503 -8531 -4725 -15088 -10462 -12980 13291 16606 18375 15441 13199 8767 33091
16787 33091 25180 34278 36972 70928 64839 37887 19572 -3394 -19505 -39000 -26413 -15737
16775 -15737 -28554 -43840 -41419 -38925 -29115 -26564 -14996 -4333 2787 -25641 -45049 -45761 -72573
16762 -72573 -60896 -47652 8503 3215 7185 30006 -3969 -28773 -24528 -134 7562 -12816
16750 -12816 -15285 -1039 -9750 -15788 7994 36761 15076 -22773 -16794 -5148 -6338 -13717 -3973
16737c973P244q942J6109J325J4572j4176k9375j2549J5672K8730j339j3420J4046
16724A3924j2453J0737k894N038J524O39K0485j7217l8318j9017Q722O588R068
16711a3174N624k5336M736K1466l5483k9177L0922L9962O505l917j7828N835j4137
16698b4002r989K6326O003o54k2304n591K7076J4485L96l718j887k4386J2289
16685e956J1788J371Q85L2583k7240k7836k6906J8680n65J490R075M1920J9101
16672D8390j9681m0761j7588N678p14p11J5463j9092k6002J9368M7960q202j6149
16659a2041J1416r315R130j750j0270q434k237L2813J4002K6975l3687l7932K3884
16646B554L0749J702j1887k2547k9278j5057K6160K8219j8947k594J2723J8796
$$ plain form
16737 -3973 3271 -5671 10438 11763 26335 12159 -17216 -29765 -14093 14637 13298 -122 13924
16724 13924 1471 12208 9314 14352 15876 16515 37000 19783 -18535 -37552 -28830 -22242 -13174
16711 -13174 -7550 -32886 -28150 -6684 -42167 -71344 -40422 -460 6045 2128 -15700 -9865 -24002
16698 -24002 -33991 -7665 -1662 -2316 -24620 -30211 -3135 11350 11746 8028 6141 -18245 -5956
16685 -5956 5832 7203 8088 40671 13431 -14405 -41311 -22631 -23196 -21706 -12631 29289 48390
16672 48390 28709 -12052 -29640 -23962 -24676 -25387 -9924 -29016 -55018 -35650 12310 4108 -12041
16659 -12041 -625 -9940 -810 -2560 -12830 -21264 -23501 9312 23314 50289 16602 -21330 2554
16646 2554 33303 35005 23118 571 -28707 -43764 -17604 10615 -8332 -10926 1797 20593
16634B0593m061j8992P190j0528Q118p089k0018L583K1453J1137P376j0211j7256
16621h705j1360K6786J2078k7727k2515j9167L5899L9025j1222k4602l120L7200
16609B2570O651k1827K098l6670k4124K754L6125Q107j0380J4987K0114k2571
16597b166j3918K945K7602L241k6319K624J8095N50K137p502r555J6884J9296
16584C3914K450m429k0454k1391j5690m330J2592m834N003q690j1263j358L1490
16571f990K1741L511l994l007J511J3355j3658j5008r177J8122J8994k0578m1656
16558c6834O279J4715L346j4195m961R929K9962R540j0279K0111K5461j1627j8734
16545B2713j2557m613j0004j455L653k5905L3325K5198l773j2453j2154j8764
$$ plain form
16634 20593 16532 -2460 4730 -5798 2320 -4769 -24787 -21204 249 11386 18762 8551 -8705
16621 -8705 -20065 6721 18799 -8928 -31443 -50610 -14711 24314 13092 -11510 -14630 22570
16609 22570 29221 7394 9492 -27178 -51302 -48548 -12423 -4316 -14696 291 20405 -2166
16597 -2166 -16084 -13139 14463 17704 -8615 -5991 12104 12654 14791 7289 -2266 14618 33914
16584 33914 36364 31935 11481 -9910 -25600 -29930 -17338 -22172 -17169 -25859 -37122 -38480 -6990
16571 -6990 14751 18262 14268 11261 12772 26127 12469 -2539 -11716 6406 25400 4822 -36834
16558 -36834 -30555 -15840 -12494 -26689 -31650 -21721 8241 17781 7502 27613 53074 41447 22713
16545 22713 10156 5543 -4461 -5916 -2263 -28168 5157 30355 26582 14129 1975 -16789
16533a6789j8600j8262J3839L9119J0346J0281L392k8452o451R681P167P855j261
16520A1865k3365J2403o671n339j8234R678l174l437L3488K9190K2303P508k1322
16507D4893j9997j4291J3117J2299J938k5397j1144r826K0135q431j978j7649
16495a6331J6858n20k6026j8867K7039J6878P380J3287j123L625J3647M264j1390
16482B8721m599m405j0076m285k6342k171J5318j2861k9119O565K6667P076J978
16469g533k0892L070k630j8364O900o894N442K0364J048j8858J1855M694R637
16456a2161N849j4109m483k3119J2889K1993o069J0288R861K284k8278p628K1976
16443a0707K1597J3566J218j3793k6025J3631M4643l778O419k0083o993j6746
$$ plain form
16533 -16789 -35389 -53651 -39812 -693 9653 19934 23326 -5126 -11577 -1896 5271 13126 11865
16520 11865 -11500 903 -5768 -11107 -29341 -19663 -22837 -26274 7214 36404 58707 66215 44893
16507 44893 24896 10605 23722 36021 37959 12562 1418 -8408 11727 3296 1318 -16331
16495 -16331 527 7 -26019 -44886 -17847 -969 6411 19698 18575 22200 35847 40111 28721
16482 28721 24122 19717 9641 5356 -20986 -23157 -7839 -20700 -49819 -43254 -16587 -9511 -7533
16469 -7533 -28425 -25355 -27985 -46349 -39449 -46343 -40901 -20537 -19489 -38347 -26492 -21798 -12161
16456 -12161 -6312 -20421 -24904 -48023 -35134 -13141 -19210 -8922 939 3223 -25055 -32683 -10707
16443 -10707 10890 24456 25674 11881 -14144 -513 44130 40352 46771 26688 19695 2949
16431B949j9107P121j793L1479r713O406l795q903j0848j3411K7215P497J1712
16418B6809q032J4422J0751j9084o188l4824k4190j0486J2217L2253m027L49q00
16405a0830j4303Q263K1288L705r925l6642N927K5146p631j5119q508K1362J4419
16392b848N088o891j715N251J9070k2440j0768r158J6430J3086k0640k5084N042
16379c5577o599K545R177K0799k262k4763J4967L2944q560M229k0372n008K5310
16366F830M906l6732l427K4542k0020p40M7851o216m2022M632K4900O989r492
16353B001k5120J664K6633K0462R059M203n361k726K810n3091k3008l100k8426
16340g4000n215J5150J6895J2402j5452J6162K2005j5442m0468m139J2012L8599
$$ plain form
16431 2949 -16158 -9037 -10830 20649 10936 17342 13547 4644 -6204 -19615 7600 15097 26809
16418 26809 18777 33199 43950 24866 18678 -16146 -40336 -50822 -38605 -6352 -10379 -10030 -10830
16405 -10830 -25133 -16870 4418 8123 -1802 -38444 -32517 -7371 -15002 -30121 -38629 -17267 -2848
16392 -2848 2240 -4651 -6366 -1115 17955 -4485 -15253 -24411 -7981 5105 -15535 -40619 -35577
16379 -35577 -42176 -39631 -30454 -9655 -11917 -36680 -21713 11231 2671 6900 -13472 -18480 6830
16366 6830 11736 -24996 -28423 -3881 -23901 -24641 23210 16994 -25028 -20396 4504 11493 2001
16353 2001 -23119 -21455 5178 25640 34699 38902 33541 30815 33625 -19466 -42474 -45574 -74000
16340 -74000 -79215 -64065 -47170 -34768 -50220 -34058 -12053 -27495 -67963 -72102 -60090 -21491
16328b1491o71K946K7964k8737k558O062k2763j0385M657J5772j3862k2917j6578
16315h2561L6994M8636M0056k130k8019k0027j875K7039J4702j5922j6662M521
16303D752j0004r316M487q873L5893P512j6221p594n57j0165j5910J2489m252
16290a7759Q338J3583J2077j0807j3136j0676J4659n662k2283J6987L8202K5299
16278D8822j2083k3768j3440k6034j4927k493k917J6925M946K0947J80R560j5501
16265i783o858j2309J6731j5365j1990J4187N952J0472Q291l933r825j1187j1049
16252c6666J7574J7834n756j3501j9367Q974J6951P819k249j7316J1026j9162
16240c3839j311k1245j6413L995J7548J152j9388l355K000Q783M487P554K6910
$$ plain form
16328 -21491 -22162 -19216 8748 -19989 -22547 -16485 -39248 -49633 -44976 -29204 -43066 -65983 -82561
16315 -82561 -45567 3069 43125 40995 12976 -7051 -8926 18113 32815 16893 231 4752
16303 4752 -5252 -14568 -10081 -18954 16939 24451 8230 636 79 -10086 -25996 -13507 -17759
16290 -17759 -9421 4162 16239 5432 -7704 -18380 -3721 -9383 -31666 -14679 23523 48822
16278 48822 36739 12971 -469 -26503 -41430 -43923 -46840 -29915 -24969 -4022 -3842 5718 -9783
16265 -9783 -16641 -28950 -12219 -27584 -39574 -25387 -19435 -8963 -672 -4605 -14430 -25617 -36666
16252 -36666 -19092 -1258 -7014 -20515 -39882 -30908 -13957 -6138 -8387 -25703 -14677 -33839
16240 -33839 -35150 -56395 -72808 -68813 -51265 -50113 -69501 -72856 -70856 -62073 -57586 -50032 -23122
16227b3122J8714O696k1764J043j4826k464J7540M240m410J9766J0313q962l354
16214e90j3476K1692O889n320J538j3038j9467k8842J594J6946P044Q001J6842
16201a87K7279J0814j120l604J542p722k1882M222l371L876L247l1923k96J8323
16187h02j9872p970k438n736J5977J7509O973L292l833j0941J0028j2154k624
16174a2591j2232j8711J9221J3564J171J0274K472J6920j8608j902j3035n885
16162a9342k41k2213p076K4496J2693j294j3813j5273J824J1167J352P263l1275
16149e1732j3039J9191K0706L2736O737j5176k6550n986k7059L916L060J0342
16137d2854J1798M359Q395J2620J1247k275l1995K0458K9506j7576n240O928j0028
$$ plain form
16227 -23122 -4408 2288 -19476 -18433 -33259 -35723 -18183 -13943 -18353 1413 11726 2764 -590
16214 -590 -14066 7626 14515 9195 10733 -2305 -21772 -50614 -49020 -32074 -25030 -17029 -187
16201 -187 27092 37906 36786 33182 34724 27002 5120 9342 5971 9847 13094 -18829 -19125 -802
16187 -802 -20674 -28644 -31082 -36818 -20841 -3332 3641 6933 3100 -7841 2187 -9967 -12591
16174 -12591 -24823 -43534 -24313 -10749 -9578 696 3168 20088 1480 -422 -13457 -19342
16162 -19342 -19583 -41796 -48872 -24376 -11683 -12977 -26790 -42063 -40239 -29072 -27720 -20457 -51732
16149 -51732 -64771 -45580 -24874 7862 14599 -577 -27127 -33113 -60172 -56256 -53196 -42854
16137 -42854 -31056 -26697 -18302 -5682 5565 3290 -28705 -8247 21259 3683 -1557 5371 -4657
16124d657m245n879k4184j9872K1243R251j1218j6286j7383K0652J7761J7m486
16111c9286J4128K3805K9160O246j8434k2783r18o668O651N059l0425k615L733
16098c2347j597J1124Q030J6341k1576J1278r452L529l90j624O388q741r547J2146
16084a6438K2205J9382J104j4967k0093J6262P16k993p182R454j3529Q508k328
16071A01j3090K1881j7337m6598j1135n842J8744L1514j8046q714K5743o57K0951
16058b485Q089K3291k0510l6617K6115J5275K4746o609k75j9802n867j058J3897
16045A8190j969j8775L6126m814k8443k2405J8583p503j8866j5123K9976P339
16033g684K7160R555k7220k0469r525J8071J3716K2022J2781j8933j1602l0119
$$ plain form
16124 -4657 -8902 -14781 -38965 -58837 -37594 -28343 -39561 -55847 -73230 -52578 -34817 -34800 -39286
16111 -39286 -25158 -1353 27807 34053 15619 -7164 -8082 -14750 -8099 -3040 -33465 -36080 -32347
16098 -32347 -33944 -22820 -14790 1551 -20025 -8747 -18199 -14670 -15060 -16684 -10296 -19037 -28584 -16438
16084 -16438 5767 25149 26253 11286 -8807 7455 8171 5178 -2004 7450 -6079 2429 101
16071 101 -12989 8892 -8445 -55043 -66178 -72020 -53276 -21762 -39808 -48522 -22779 -23436 -2485
16058 -2485 5604 28895 8385 -28232 -2117 13158 37904 31295 31020 11218 5351 4293 18190
16045 18190 16221 -2554 33572 28758 315 -22090 -3507 -11010 -29876 -44999 -15023 -7684
16033 -7684 19476 29031 1811 -18658 -28183 -10112 3604 25626 38407 19474 7872 -22247
16021b2247j7278P274J2532l075q299l70K5075K843N204Q193o632j0069K0154
16008A3305M558J6944k1053o740q812O945j0908k493k0989j3953j183K3206N885
15995a5288o689K5290o410j0278J1001j4986p976L957l152R205K2657k3411j9625
15982c5705J4413O773q661j2741R913L0175J0894r046k1330j4285k6502J409J8693
15969c6000q20R89J4017K4640K8727j7613l1895L271r159J0405J5095n334k1540
15956b5217k5184J3241K6564k053k1393J1762L2350j7154k2798L520M980N437
15944a5945L4944J2194M180j8973k1162j2296N98m013Q994K185K2659k25o215
15931F925l716k1553K484J1464J3066r641J6033J2239k4350j8818j3065o390L3087
$$ plain form
16021 -22247 -39525 -32251 -19719 -22794 -31093 -31463 -6388 -3545 1659 9852 3220 -6849 13305
16008 13305 17863 34807 13754 7014 -1798 5147 -5761 -8254 -29243 -43196 -44379 -21173 -15288
15995 -15288 -21977 3313 -3097 -13375 -2374 -17360 -25336 -21379 -24531 -15326 7331 -16080 -35705
15982 -35705 -21292 -14519 -23180 -35921 -26008 4167 15061 6015 -15315 -29600 -56102 -54693 -36000
15969 -36000 -36820 -35831 -21814 2826 31553 13940 -17955 -14684 -23843 -13438 1657 -3677 -25217
15956 -25217 -50401 -37160 -10596 -12649 -34042 -22280 10070 -7084 -29882 -26362 -21382 -15945
15944 -15945 18999 31193 35373 16400 -4762 -17058 -16460 -20473 -11479 -9294 13365 13140 6925
15931 6925 3209 -18344 -15860 -4396 8670 -971 15062 27301 2951 -15867 -28932 -35322 -2235
15918b235K7713q07p65m467j6821K980k1553O162j0809k9906K0141J9663j6661
15905b7365r28L1887o519j4828p445K3458Q586m480j1829P00K0471J5790l458
15892B4040K788q160n073J1543N52k444k5398j0995O702K3005j2681J8355Q416
15879C0650m3624k3795O502K6082R932r925J896k686j3589m1021J0179L7885J3016
15866A502j6514K101r289j8169j3095j1069K5794J3559K047r390P604j0447k0423
15853e5789J5011K0587Q806L050p742O675l868J1304K362O024k8763l4721j345
15840e8409P453K4753J0250J0734J4891j5434k4234j7523l459J6116L1428m578
15828h012L460L0786J1919q670l5808l7839P357J4059K428j3288r753Q73j816
$$ plain form
15918 -2235 25478 24671 23906 19439 2618 5598 -15955 -9793 -20602 -50508 -30367 -10704 -27365
15905 -27365 -28293 3594 -2925 -17753 -25198 -1740 6846 2366 -9463 -8763 11708 27498 24040
15892 24040 26828 18668 13595 25138 25690 23246 -2152 -13147 -6445 16560 3879 22234 30650
15879 30650 -12974 -36769 -30267 -4185 5747 -4178 -2282 -4968 -18557 -59578 -49399 -11514 1502
15866 1502 -15012 -12911 -22200 -40369 -53464 -64533 -38739 -25180 -23133 -32523 -24919 -35366 -55789
15853 -55789 -40778 -20191 -11385 -8335 -16077 -9402 -13270 -1966 396 6420 -22343 -57064 -58409
15840 -58409 -50956 -26203 -15953 -5219 9672 -5762 -29996 -47519 -50978 -34862 -3434 -8012
15828 -8012 -4552 26234 38153 29483 -6325 -44164 -36807 -22748 -20320 -33608 -43361 -42488 -44304
15815d4304K2069O744o302K176j6020k4777J9346L1106j6042J9726K1122o657
15803H187J1719j7660j3061j0846R266j2913J8393K865j2697K1102K8738P691
15791D0784j2437j4086l3454j6850J1280K6861j232j7238J3246j5491j806K693
15779a7730M631o392j6180o739K8867K3298n589J2883J2134p392p493K7388J2581
15766E4267J082q519l8321m5801O596O398k8500L862Q462N286R547J0411o882
15753b2112P162n66r716J9721J594j7133J2502J695k494k44R7J6970Q846R144
15739B5466n81M570R155J0310m344r610j0827p233j1637K779l2663l380k2345
15726e0340M034J4745j9652J187K294J3624K0202K2944N682j875j1100o63k977
$$ plain form
15815 -44304 -22235 -15491 -21793 -19617 -35637 -60414 -41068 -9962 -26004 -6278 14844 8187
15803 8187 19906 2246 -10815 -21661 -12395 -25308 -6915 -4050 -16747 4355 33093 40784
15791 40784 28347 14261 -19193 -36043 -24763 2098 866 -16372 -3126 -18617 -20423 -17730
15779 -17730 -13099 -19491 -35671 -42410 -13543 9755 4166 17049 29183 21791 14298 41686 54267
15766 54267 55349 46830 8509 -37292 -30696 -24298 -52798 -48936 -40474 -35188 -25641 -15230 -22112
15753 -22112 -14950 -15516 -25232 -5511 -3917 -21050 -8548 -6853 -9347 -9591 -9494 7476 16322 25466
15739 25466 24885 29455 38610 48920 44576 34966 24139 16906 5269 8048 -24615 -27995 -50340
15726 -50340 -46306 -31561 -51213 -50026 -47732 -34108 -13906 9038 14720 12845 1745 1082 -1895
15713a895K1053j150R813Q947k7879j3412O229l385J1347j4045j6650J8189J2149
15700I311N300J1313k7267j1231p95k989O935o404J3514j078j7257K2627J3397
15687A5376r784K073k3552k6838M495k748l239J9338r898j2052J0727K290J235
15674c2577J0454J1694J9086J4503q340k4000m656k1704l6235K8664o488l755
15662e3354J8506Q966j5827J1485l309j0180m691J6733n865R447K2473n346q528
15649a9490l416J59J0854j1431k1014M086N2150J7780n391k1708J844k1754m584
15636b1915K125l959J4320K3887o236k0778n101k693N127N471j0560k62o613k6853
15622e4040j5425L3784M1057J4113k3765m2183J5579J1839K5740J0997n016p32
$$ plain form
15713 -1895 19158 18008 27821 36768 8889 -4523 1706 -1679 9668 -4377 -21027 -2838 9311
15700 9311 14611 25924 -1343 -12574 -13369 -16358 -9423 -15827 -2313 -3391 -20648 1979 15376
15687 15376 5592 7665 -15887 -42725 -38230 -40978 -44217 -24879 -34777 -46829 -36102 -33812 -32577
15674 -32577 -22123 -10429 8657 23160 14820 -9180 -13836 -35540 -71775 -43111 -49599 -53354
15662 -53354 -34848 -25882 -41709 -30224 -33533 -43713 -48404 -31671 -37536 -28089 -5616 -10962 -19490
15649 -19490 -22906 -22747 -11893 -23324 -44338 -40252 11898 29678 24287 2579 4423 -17331 -21915
15636 -21915 -19790 -23749 -9429 14458 8222 -12556 -17657 -20350 -15223 -9752 -20312 -20574 -27187 -54040
15622 -54040 -69465 -35681 5376 19489 -4276 -46459 -30880 -19041 6699 17696 12680 11948
15610A1948k6907p053J0665L2224j7157k1799j2122Q581P250R37L9634O38l685
15597B3154p669m67j334k0690K2880J3755k8972j8291j8980j2502K8639K0004
15585d73l099J1472p397k5574J9859L7528L332j4347k3268j9032J3441K2520K4040
15572C9002j3125o281J6630j2805j1473k5055J849O219J4141l564j6076l965m413
15559a8916r211K6358J5475n292R276K2145K3486k6317m2789j7423M952J5046
15547c210l081k4822J7265J6181J6332l709j329q932OJ1449J0072L1922J3762
15534G1906P699J4178j1391j9185m5603p088J3059Q584r007k293j0582j6205q851
15521a4779N429P901k941l3881p324J8299R807K3054R819J3792J0842J5765j5525
$$ plain form
15610 11948 -14959 -22012 -11347 20877 3720 -18079 -30201 -21620 -14370 -13433 26201 26839 23154
15597 23154 15485 15018 13684 -7006 15874 29629 657 -17634 -36614 -49116 -20477 -473
15585 -473 -3572 7900 503 -25071 -5212 32316 35648 21301 -1967 -20999 -7558 14962 39002
15572 39002 25877 19596 36226 23421 11948 -13107 -11258 -5039 9102 5538 -10538 -14503 -18916
15559 -18916 -28127 -1769 13706 8414 17690 39835 63321 37004 -5785 -23208 -18256 -3210
15547 -3210 -6291 -31113 -13848 2333 18665 14956 13627 4695 4701 16150 26222 58144 71906
15534 71906 79605 93783 82392 63207 17604 10516 23575 32159 23152 20859 10277 -5928 -14779
15521 -14779 -9350 -1449 -4390 -38271 -45595 -27296 -17489 5565 15384 29176 40018 55783 40258
15508D0258j956j7327l2753k5324j6564K2241K8700M073J2474R259K6304P772
15496E7157J1959k4525k6915j7532j0452K8226R650P243M18J4100R347J1478p104
15483F3050M983j9576j467M1936j6164l9409l1224R504l496K2519k014n498M378
15470B7522J8526j1217L702L2347J7984j6537j8850M876p158k7423j1983j2544
15458g55M833p280O459Q356R519K0185R923L062K718P470l0191j3143J1349o591
15444B5914K274o683K7832o147K97n181R380K4078m164k7892l126J8470R260K3049
15430H7361j7219R322k1900N67l425k4741J425L751l321Q571M976M453J3208J4456
15416G7484J5401n107k5459r202K3126J2894L256o646k0818k0333Q73O482k2528
$$ plain form
15508 40258 38302 20975 -11778 -37102 -53666 -31425 -2725 1348 13822 23081 49385 57157
15496 57157 69116 44591 17676 144 -10308 17918 27568 34811 35229 49329 58676 70154 63050
15483 63050 68033 48457 46990 88926 72762 33353 2129 11633 8137 30656 28642 23144 27522
15470 27522 46048 34831 38533 70880 88864 72327 53477 58353 51195 23772 11789 -755
15458 -755 4078 -3202 3257 11613 21132 41317 51240 54302 57020 64490 34299 21156 32505 25914
15444 25914 28188 21505 49337 43190 43487 38306 47686 71764 67600 39708 36582 55052 64312 87361
15430 87361 70142 79464 57564 58131 54706 29965 31390 35141 31820 40391 45367 49820 63028 77484
15416 77484 92885 87778 62319 53117 76243 89137 92393 85747 64929 44596 45469 51951 29423
15403B9423k6617J6192J9936r705j8725K3465m812J3527R360j3266l0822J1707
15391A9663J6817L1995m0909j1898k772P853j3148M2171L2437j5793l966k9770
15379C2680j6242O331m201k555L784r23j9842k3619J8053L4298q640j1633j6003
15366h512N918J1034R088L592P347O944k4768l4592N263K3415J7279k572k0571
15353a135k1748L306O183r778j835r756N593k704m307K0698j9556p469K7780J0133
15339d595k854M270q139l069j7387K7834q731j7477J7794M916j37j7179k0717
15326d5471O038Q692J2788L0571j3393p531R962K5883J6435K0161l018k1400o875
15313C2842o050J0427l2531l1899J6414K963O615J5366J1046R897K3379J5505
$$ plain form
15403 29423 2806 18998 38934 29229 10504 33969 29157 42684 52044 38778 7956 19663
15391 19663 36480 68475 27566 15668 12896 20749 7601 49772 82209 66416 62450 32680
15379 32680 16438 22769 18568 16013 19797 18874 -968 -24587 -6534 27764 19124 7491 -8512
15366 -8512 -2594 8440 17528 21120 28467 35411 10643 -23949 -18686 4729 22008 19436 -1135
15353 -1135 -22883 -19577 -13394 -23172 -25007 -34763 -29170 -31874 -36181 -15483 -35039 -42508 -14728 -4595
15339 -4595 -7449 -3179 -11318 -14387 -31774 -3940 -12671 -30148 -12354 -7438 -7575 -24754 -45471
15326 -45471 -39433 -30741 -17953 12618 -775 -8306 1656 27539 43974 64135 61117 39717 32842
15313 32842 26792 37219 4688 -27211 -10797 -7834 -1219 14147 25193 35090 58469 73974
15301G3974m8601k0282k4270j8550J1153K3680O039K5601K795k1521p973m30o820
15288e205J9291o704K048Q699J6456j493O50Q992j7585l3470j0171K0393K9878
15275C1779J9561j8363P2j0977k3239m4870L28K7940K5300p190j3575J6324K2547
15262B5637j5203j4136J6560j1830m571j5372n894K8353k9480m353J7047J1497
15250a745j9495q197J5625L7504M844l6075n6187L2716L9528k8401j3435K75L0848
15237b195K7422L199L745n745j1733L8629J5787j4138p311K4218r302n1424j1626
15224d74Q088N34n432R634R003q669p768j7819J4465J3711J9842K2546P908N700
15210G1269j5751j5893j0158j8230K483K357J0517k8741j1556L4580L8973K741
$$ plain form
15301 73974 25373 5091 -19179 -37729 -26576 -2896 3143 28744 31539 10018 2045 1615 -5205
15288 -5205 14086 7382 9430 18129 34585 33092 33742 42734 25149 -8321 -18492 1901 31779
15275 31779 51340 32977 33049 22072 -1167 -46037 -45709 -17769 7531 341 -13234 3090 25637
15262 25637 10434 -3702 12858 1028 -3543 -18915 -24809 3544 -25936 -30289 -13242 -1745
15250 -1745 -21240 -29437 -13812 23692 28536 -7539 -63726 -31010 8518 -19883 -33318 -33043 -2195
15237 -2195 25227 28426 32171 26426 14693 53322 69109 54971 47660 71878 62576 11152 -474
15224 -474 7614 8148 2716 12350 21353 12684 4916 -12903 1562 15273 35115 57661 65569 71269
15210 71269 55518 39625 29467 11237 13720 16077 26594 -2147 -13703 20877 59850 62591
15198F2591K93j6259k2760j4435r246M003J2363Q598n754k6005o953k294L721
15185a2137n372n522n465q203J9433L9878o384j7229J4145k1603j36r535M047
15172a4083N004M27M8124J9965p473q888q563P250n934j3678k4269l6515L231
15159c5402l245M195j7915k2522J450K2758K0336L1891J7046J1577Q287n085k2474
15146A0897p540J3403r453P329J1138k6094j1548k526J6786O773k012K0621O496
15133C4270k5532k3048O117J693R264q521j2814j2794J465J5881O911j5388K1689
15120h07Q1l8497j0808K1189K7745k107N32J2370J3930j4033k8802j5502J4549
15107b0160K3555J9536L271J731J6964j5031j4523N252l1604l3237M422N139k450
$$ plain form
15198 62591 62884 46625 23865 9430 184 4187 16550 25148 19394 -6611 -13564 -15858 -12137
15185 -12137 -17509 -23031 -28496 -36699 -17266 22612 16228 -1001 13144 -8459 -8595 -18130 -14083
15172 -14083 -9079 -8652 39472 59437 51964 43076 34513 41763 35829 22151 -2118 -38633 -35402
15159 -35402 -38647 -34452 -52367 -74889 -73439 -50681 -30345 1546 18592 30169 38456 33371 10897
15146 10897 3357 16760 7307 14636 25774 -320 -11868 -14394 2392 9165 7153 27774 34270
15133 34270 8738 -14310 -8193 -6500 2764 -5757 -18571 -31365 -29900 -14019 -7108 -22496 -807
15120 -807 -726 -39223 -50031 -28842 -1097 -3204 -2672 9698 23628 9595 -19207 -34709 -20160
15107 -20160 3395 22931 26202 27933 44897 29866 15343 20595 -11009 -44246 -39824 -34685 -37135
15094c7135k864M399k7411k0665M5812K9527J4267J3836j4870m025j2096l190
15082a4415k9692j4128J0086K1634j6113l0432n037J8199r996J4766L4847J0965
15070i316J77o380K2053J9133j7460j7077o149L57j8218r252J4610K7703K5289
15057B5470k7067j9267j0371l45M8395O668p237k7033j7202m180p45n233Q295
15044b9852j3211J0707M4248o461R696j3293l4234J1133K2390o108j0866j122
15032a6973N807J2693m468N315l420j1939j894K656P956p141J8426Q801k2924
15019g105l1941J818L1917J7925o152q213j5198j869J5759J2320K644k0646J6624
15006G883R107P171L0081n88j3579k3917k6255k3313q88j6065j6011K1438P965
$$ plain form
15094 -37135 -39999 -35600 -63011 -83676 -37864 -8337 5930 19766 4896 871 -11225 -14415
15082 -14415 -44107 -58235 -48149 -26515 -42628 -73060 -78097 -59898 -69894 -55128 -20281 -9316
15070 -9316 -9139 -15519 6534 25667 8207 -8870 -15019 -14662 -32880 -42132 -27522 181 25470
15057 25470 -1597 -20864 -31235 -31580 16815 23483 16246 -10787 -27989 -32169 -32914 -38147 -29852
15044 -29852 -43063 -32356 11892 5431 15127 1834 -32400 -21267 1123 -4985 -15851 -16973
15032 -16973 -11166 1527 -2941 2374 -1046 -12985 -14879 -12223 -4267 -11408 7018 15819 -7105
15019 -7105 -39046 -37228 -5311 12614 6462 -1751 -16949 -18818 -3059 9261 11905 -8741 7883
15006 7883 16990 24161 54242 53654 40075 16158 -10097 -33410 -34298 -50363 -66374 -44936 -36971
14993c6971Q55N004J1745J971K9296J8879j440k6698L236k5854j6654L3864M694
14980A927k7033o210j0912j8803L6182L8994K6399j0628j1870J877L51j743q403
14967A0128k495J4430J846M490m429P105m614j0657k2601k4830l5759j0106q998
14954h6490j0866K5461L6080q587O207L3320j7369o082J0878j7004j7474n081
14942e7007L91J5165M3902K4646J4776J561j3431k7257j4088l843K8752J4247
14930B7814j723Q016P420j7370j8418J7618n068m3832J1217R729J2433n805j2883
14917a0852q774j4367Q874J8762R718L259K3202J0510l0593j6936J6329o338k3416
14904b0622m850J5946Q655L718l564J3253J2652J4241j0279j4274p608q11q383
$$ plain form
14993 -36971 -36116 -31112 -19367 -17396 11900 30779 29339 2641 5877 -19977 -36631 -2767 1927
14980 1927 -25106 -31316 -42228 -61031 -24849 14145 40544 29916 18046 19923 20274 18531 10128
14967 10128 7633 22063 23909 28399 23970 31075 26461 15804 -6797 -31627 -67386 -77492 -86490
14954 -86490 -97356 -71895 -35815 -44402 -38195 -4875 -22244 -28326 -17448 -34452 -51926 -57007
14942 -57007 -56616 -41451 2451 27097 41873 43434 30003 2746 -11342 -15185 13567 27814
14930 27814 26091 34107 41527 24157 5739 23357 18289 -25543 -14326 -4597 7836 2031 -10852
14917 -10852 -19626 -33993 -25119 -6357 3361 6620 29822 40332 9739 -7197 9132 2794 -20622
14904 -20622 -25472 -9526 -871 2847 -717 12536 25188 39429 29150 14876 7268 6457 -1926
14891a926k0591O707Q394J3902L2025P011k8560k6995J3173j4892l814L2268K030
14878A8732q025p052j422J0911j1873n20n142L457j727K2778p226j1684K290K2359
14864B5856Q733J1335L996J841J7703j4407k3962k8984k6547J0270J1524k7347
14852b9989j6273J2429J2513K3245J0655j1816k3566j5557o827O502J6105O250
14840a6329k1434J532K654K6758J6607L5414K0673j9400k9169k4125k8884P846
14828b7857J1019J7826L413K0697K2370k6821l9576m811J4872j5921n583J6447
14816a3925K5967j0004j1057k857J9807N54n600j0267J9039j3074k3730L09J6036
14803h802J7581l563j139J4016J5566j5169q793j273J8755j0053j4120j2208K026
$$ plain form
14891 -1926 -22517 -15810 -7416 6486 38511 45522 16962 -10033 3140 -11752 -15566 16702 18732
14878 18732 10707 3655 2233 13144 1271 751 -4391 -934 -2661 20117 12891 1207 3497 25856
14864 25856 34589 45924 49920 51761 69464 55057 31095 2111 -24436 -14166 -2642 -29989
14852 -29989 -46262 -33833 -21320 1925 12580 764 -22802 -38359 -45186 -38684 -22579 -16329
14840 -16329 -37763 -36231 -33577 -6819 9788 45202 65875 46475 17306 -6819 -35703 -27857
14828 -27857 -16838 988 4401 25098 47468 20647 -18929 -23740 -8868 -24789 -30372 -13925
14816 -13925 12042 2038 -9019 -11876 7931 8485 2885 -7382 11657 -1417 -25147 -24838 -8802
14803 -8802 8779 5216 4077 18093 33659 18490 9697 8424 27179 17126 3006 -9202 -7176
14790g176J2195q366k5753P607J2873J5605k6725N289L2377j32j3253p358K0751
14777A7934l548K0400l407j7947j5312J147L32j2002j3274n528J9401L5710j2192
14764A1714j6339O403J7088O463q256k4007j9418j0955J9280P434j6046J339l724
14751b9024j7989J9096m896j0685M2147K204J7470m738k0459r861r479p705J5891
14738a8028J6499j6110j6696J1838k7668J5332R737P75J4189k5165K0070L7371
14726B2144O691R342R371j6719l9087r520J3278k2685k5829j3524K3145K0570
14714b2823K087p96J4675M5226J3107n91k495q721J8155j3247R953j4977j4002
14701B5551r206j9265m738j8598P519K8970j8400r444j0754Q196J7582J0292j2972
$$ plain form
14790 -7176 5019 -3347 -29100 -21493 -8620 6985 -19740 -14451 17926 17794 4541 -2817 17934
14777 17934 14386 34786 31379 13432 -1880 -733 -401 -12403 -25677 -31205 -11804 23906 11714
14764 11714 -4625 1778 18866 25329 17073 -6934 -26352 -37307 -18027 -10593 -26639 -25300 -29024
14751 -29024 -47013 -27917 -32813 -43498 -1351 853 18323 13585 -6874 -16735 -26214 -33919 -18028
14738 -18028 -1529 -17639 -34335 -22497 -50165 -34833 -25096 -24321 -10132 -35297 -15227 22144
14726 22144 28835 38177 47548 30829 -8258 -17778 -4500 -27185 -53014 -66538 -43393 -22823
14714 -22823 -20736 -21532 -6857 38369 51476 50885 48390 39669 57824 44577 54530 39553 25551
14701 25551 16345 -2920 -7658 -26256 -18737 10233 -8167 -17611 -28365 -20169 -2587 7705 -5267
14688e267l4660K5669J324K2813M9859J6987n5358n967p376Q416J594Q855K8438
14675E5327o359K298Q796n075q608M886k3691j8507j5775r168K5571L1938L806
14662D5439Q50j9059m7241J6929J1826r151M019j8157k961k2831n29L6538O455
14649B127n545J5521m179p448J5213L267J4554k8070j318k130j4028r902l36M8790
14635B6516j8974k6066j6233p627k547J8368o280R036K8044K6682k8840l0579
14623b8500N82j4031J3412O768O026J4432O479k667j5707k7907L7156M3479q561
14610C0961j2773l696l220l903M836j665j1581o819j2793J1487K324J0595N081
14597H834n115q007j831L1335J6127p869j3508l472j7706O807K0345j1830p831
$$ plain form
14688 -5267 -39927 -14258 -12934 9879 59738 76725 21367 15400 8024 16440 18034 26889 55327
14675 55327 48968 51266 60062 54987 46379 51265 27574 9067 -6708 -15876 9695 41633 45439
14662 45439 46289 27230 -20011 -3082 8744 -407 3612 -14545 -17506 -40337 -40866 -4328 2127
14649 2127 -3418 12103 7924 476 15689 18956 33510 5440 4122 1992 -12036 -21938 -22274 26516
14635 26516 7542 -18524 -34757 -42384 -44931 -26563 -32843 -23807 4237 30919 2079 -28500
14623 -28500 -27918 -41949 -28537 -21769 -15743 -1311 5168 2501 -13206 -41113 -3957 39522 30961
14610 30961 18188 14492 11272 7369 12205 10540 -1041 -7860 -20653 -9166 -6842 3753 8834
14597 8834 3719 -4288 -6119 25216 41343 33474 19966 16494 -1212 5595 25940 14110 6279
14584F279q743o706K2687o467l0788K336K7704L1675M3817k6809m2184j7585J4607
14571I823J818M474j8573k2716K6824L4508J410l0788j3190n511M207Q177k963
14558b500k890N904O928K555P435K8719L709k4262j5491j9539j3011L4220L0730
14545D2507j5236j2502J8493Q790n939k6727J9232k130J5875R734j0390n127j954
14532C4626K0589J5015l366r233j4788o711j6860j0896q40q702l390j1185J24
14519a5617L584M790J1982J2889r860k4510K6158J4609k1207J1437J4801j6722
14507A2334p641P235l768j2179j6454p15J2423k7986K6259K7670K3777O29l5276
14494F308j2812j3793j3491J3120K0408K7083P855j3687n48K1158l066j0719k4912
$$ plain form
14584 6279 -2464 -9170 13517 7050 -23738 -21402 6302 37977 81794 54985 12801 -4784 9823
14571 9823 11641 16115 -2458 -25174 1650 36158 37568 6780 -6410 -11921 -7714 463 -2500
14558 -2500 -5390 514 7442 9997 17432 46151 49860 25598 10107 -9432 -22443 11777 42507
14545 42507 27271 14769 33262 42052 36113 9386 28618 26488 42363 52097 41707 36580 34626
14532 34626 55215 70230 66864 57631 42843 36132 19272 8376 7536 -1166 -4556 -15741 -15617
14519 -15617 -12033 -7243 4739 17628 7768 -16742 9416 24025 2818 14255 29056 12334
14507 12334 4693 11928 8160 -4019 -20473 -21188 -8765 -36751 -10492 17178 40955 41584 6308
14494 6308 -6504 -20297 -33788 -20668 -260 26823 34678 20991 20443 41601 38535 27816 2904
14481B904n443j0880r788R692K5094J4351n238J1554j0021j0146J4851K4786Q997
14468F0713l4714l6828j2568J693J2658K50o402o288p107R757j1927J085K8190
14455a488M185k145j72P686o123M030J5255p159J6308n882j6136l8370J681K2118
14441f212K3809r616L56J3575j6831J0141k7821k3771j0386K0832P838q988J515
14428b5559J2826K0637K5919J0258p370j626k0754r577J2700J7065P976Q408J6146
14415F7049k6615j1755r566M886p619j4025K0301l2020r342J8245o196m184m740
14402a5581J4287L91j0463k3802J4802o577J2781L2502Q056K2775o934j5488r080
14389A7669j2212Q88N125J1174Q131r811m4201j7329K448j5380J3943K0842J4286
$$ plain form
14481 2904 -2539 -13419 -23207 -13515 11579 25930 20692 32246 22225 12079 26930 51716 60713
14468 60713 25999 -10829 -23397 -21704 -9046 -8796 -15198 -21486 -28593 -18836 -30763 -29678 -1488
14455 -1488 2697 552 380 8066 1943 5973 21228 14069 30377 24495 8359 -30011 -28330 -6212
14441 -6212 17597 7981 8337 21912 5081 15222 -12599 -36370 -46756 -25924 -18086 -27074 -25559
14428 -25559 -12733 7904 33823 44081 36711 35085 14331 4754 17454 34519 42495 50903 67049
14415 67049 40434 28679 19113 23999 16380 2355 22656 -9364 -18706 -461 -6657 -10841 -15581
14402 -15581 -1294 -903 -11366 -35168 -20366 -26943 -14162 18340 26396 49171 42237 26749 17669
14389 17669 5457 6345 11470 22644 30775 20964 -23237 -40566 -38118 -53498 -39555 -18713 -4427
14376d427J1537Q042K215l2217n569K0829j157Q714L4685m895l6372j2577K7703
14363A6511J0575J0028L1233L5390O652k0568o134j1528o441k2409j2281j7605
14351A3423J0808j2656N796K1033j5640k8417j5893M528M466L805k3939j7280
14339d9966R662J232R963J3440K7124L164j9333m857M0665p781j8570l978K5234
14326B5999Q618q609l710N46J2296L491j7638q076p493j2576l156o087K6976K7435
14312C8016N138P045j3248k0170L6901K3904k2267j1044r076P071j1502k3991
14300F777m269o242K3184J0013n229R482k9402j4850N596P626L5980J7771l158
14287E3279J099k0466k6844J2250L226n665N532o186q129j0661k4899J5989J9284
$$ plain form
14376 -4427 7110 15152 17367 -14850 -20419 410 -747 7967 42652 37757 1385 -11192 16511
14363 16511 27086 37114 68347 103737 110389 89821 83687 72159 65718 43309 31028 13423
14351 13423 24231 11575 17371 38404 22764 -5653 -21546 -17018 -12552 -8747 -32686 -49966
14339 -49966 -40304 -39072 -29109 -15669 11455 14619 -4714 -9571 31094 23313 4743 765 25999
14326 25999 34617 26008 22298 22844 35140 38631 20993 12917 5424 -7152 -10308 -16395 10581 38016
14312 38016 43154 50199 36951 16781 53682 77586 55319 44275 35199 42270 30768 6777
14300 6777 2508 -3734 19450 29463 24234 33716 4314 -10536 -4940 2686 38666 56437 53279
14287 53279 54378 33912 7068 19318 22544 16879 22411 16225 8096 -2565 -27464 -11475 7809
14274G809P957j7393K1286L5296K513J4902L260j6166k6779K047j4582k3615J0373
14261F908P20r689J1246R920r350j4103Q867K4489L0764Q876j2852K430J3938
14248G2164K505J0514Q114o647J6174K9373J3008K3880K5080L126J1219M4632
14236B53142L1059M8622M4224L5688R9392J36402J56375K24748L61568N95889
14226A987109R54997J465620K019381K056358J010604j17028k85867K59332k715
14217I347791j091923j916148k001994j508695r46037n54338k98054k06086j47577
14208F76939n7623p5764o6221r1858q0120k9326j3750k2042m3982k7272k2898
14197A46083l6178k6633o431m312K5084J0390m1274j9355J895K7993K0837l946
$$ plain form
14274 7809 15766 -1627 19659 54955 57468 72370 75630 59464 32685 34732 20150 -3465 6908
14261 6908 7628 -2061 9185 19105 9755 -4348 4519 29008 59772 68648 55796 58226 72164
14248 72164 74669 85183 93297 86650 102824 132197 145205 169085 194165 197291 208510 253142
14236 253142 284201 332823 377047 412735 512127 648529 804904 1029652 1391220 1987109
14226 1987109 2942106 4407726 6427107 8483465 9494069 9377041 9091174 9350506 9347791
14217 9347791 8255868 6339720 4337726 2829031 1882994 1328656 1030602 824516 676939
14208 676939 619316 543552 477331 385473 305353 276027 262277 240235 196253 168981 146083
14197 146083 109905 83272 76841 72529 97613 108003 66729 47374 49269 77262 98099 94153
14185I4153j2143j0163j4138k4993l3742j459o649J9038J4642O864L3074j6914
14173D7570j069J7036K731O310K1497j7105k6500j1523k4766L452L7615L938q211
14160E0975k1284k4055j6371J7015j013j244j1368r904J7994J1678J7965N945
14148C6333k1061q002J2217P593k6459q409q728n760L247l97J3387J2593R677
14135A6231L35k8507R803K4816Q920j4074K858K2854K776k2696j5568M224k1168
14122i196l5830J6892M1355N283j0451O452J0317j8832j0198Q504r697j159j4548
14109b1108K0694P747j5460Q209J6129o9J9054r803k3082k7353R30L281j1885
14096c2716m11J5135Q241J9609k1850L352K2473m279Q784n299k3085o43j0528
$$ plain form
14185 94153 82010 71847 57709 32716 -1026 -2485 -9134 9904 24546 31410 64484 47570
14173 47570 46501 63537 66268 72578 94075 76970 50470 38947 14181 17633 55248 59186 50975
14160 50975 29691 5636 -10735 6280 5267 4023 -7345 -17249 745 12423 30388 36333
14148 36333 15272 7270 19487 27080 621 -7788 -16516 -22276 -19029 -19426 -6039 6554 16231
14135 16231 16566 -11941 -2138 22678 31598 17524 20382 43236 46012 23316 7748 11972 -9196
14122 -9196 -45026 -28134 13221 18504 8053 14505 24822 5990 -4208 4296 -5401 -6560 -21108
14109 -21108 -414 7333 -8127 82 16211 16142 35196 25393 2311 -25042 -24112 -20831 -32716
14096 -32716 -33127 -17992 -9751 9858 -11992 -8640 13833 9554 18338 13039 -10046 -10689 -21217
14083b1217k723j9814K1312K7067J1885n361k8932j1174K2511j1290j4035J1842
14071a9929K1300P881j5669j7660r717j6907n57J5971j9169K4806K4446K2857
14059A7653O001M008j0180m1594o269P144J0128k914k1331K6235Q209P263M060
14046H413K7031J2824j9628m907N053p93j5137j8559j648K3591K4187k786j1472
14033B6169q156m691Q766j3625L3311J4177j9838p844Q916k8874j4525k2445K8677
14020A8N5929J2025k4719k3448j6935j3959p603q143j2534r952l659R72J4413
14007c7595K9452R850j1765M588J6412n216J1437K4922p575j7063n223J50K385
13994A4759j02j9373N16k047j2143l899J6673j6490q288o856P508J1735L1150
$$ plain form
14083 -21217 -23940 -43754 -22442 4625 16510 11149 -17783 -28957 -6446 -17736 -31771 -19929
14071 -19929 1371 9252 -6417 -24077 -33794 -50701 -51258 -35287 -54456 -29650 -5204 17653
14059 17653 23654 27662 17482 -24112 -30381 -23237 -13109 -16023 -37354 -11119 -2910 4353 8413
14046 8413 35444 48268 28640 23733 28786 27993 12856 -5703 -7351 16240 40427 37641 26169
14033 26169 18013 13322 22088 8463 41774 55951 36113 28269 37185 8311 -6214 -28659 18
14020 18 55947 67972 43253 19805 2870 -11089 -18692 -26835 -39369 -49321 -52980 -52008 -37595
14007 -37595 -8143 1707 -10058 -5470 10942 5726 17163 42085 34510 17447 12224 12374 14759
13994 14759 14657 -4716 -4200 -6247 -18390 -22289 -5616 -22106 -30394 -37250 -29742 -18007 13143
13981A3143M542j6485p423l454r676n968N093K4889J602m554K6860J6963J5664
13968F1196j4738j6811N906j6917m322L3485J3521N213j5107j6923Q670R155j1014
13955D1314k0923m505M917k6691j4276O601M0564J1698j2296K0590n062j1136
13943C0795j938n616j6162j9112j2513j7444R448J35K315p640q595K6545M8072
13930B8290N516J401j1338J3811L201l7504l942J1829Q96J6658K2325N690P383
13917F4216l6227m7451M069J4657M214j2275l120J4569k314J4397L3394M45k0154
13904B8420L866l713o246P969L6640P232l6482j5940p278k3538k9596K1522J2476
13891d668J5530k8492j4330K1396L7849J4322j5066k054k840L740j6270l1053
$$ plain form
13981 13143 17685 1200 -6223 -9677 -19353 -25321 -20228 4661 6263 1709 28569 45532 61196
13968 61196 46458 29647 35553 18636 14314 47799 61320 66533 51426 34503 43173 52328 41314
13955 41314 20391 15886 20803 -5888 -20164 -13563 27001 38699 26403 46993 41931 30795
13943 30795 28857 23241 7079 -12033 -24546 -41990 -32542 -32407 -30092 -37732 -46327 -19782 28290
13930 28290 33806 35207 23869 37680 40881 3377 -565 11264 12160 28818 51143 56833 64216
13917 64216 27989 -19462 -15393 -736 3478 -8797 -11917 2652 338 14735 48129 48574 28420
13904 28420 32286 28573 22327 30296 66936 74168 37686 21746 14468 -9070 -38666 -17144 -4668
13891 -4668 10862 -17630 -31960 -10564 27285 41607 26541 24487 21647 25387 9117 -21936
13879b1936m268R469p98K3273J0754K430j2758k2630j7562k1454r50N0167O797
13866E34q777J0376J4846L0480j5640P223k1060j6894q536k0272k6333Q570J0361
13853c5122Q550J0875r696p948j2061K3173M3378q61j2244m937K4287K106K758
13840C2258l539k8584j9722m44P858K8459k2057k5709j7479K7085J6297J618j2868
13827a6827k9310Q886L4073R576j0153k8136p885J2079K1297N320j2801K2151
13815H270O035J0328q38p71j6838J4763k4502j5984p127J3887P804L445J119j115
13801a524J2968j0630n560j0471k900j6508J1781J6154J1093j982j4581N838J3176
13788F854P496j4022l4648j0492P402K4100J2487j7841j7349L115J2309K2200
$$ plain form
13879 -21936 -26204 -16735 -17533 5740 16494 18924 6166 -16464 -34026 -55480 -56430 -6263 534
13866 534 -8243 2133 16979 47459 31819 39042 17982 1088 -7448 -27720 -54053 -45483 -35122
13853 -35122 -26572 -15697 -25393 -33341 -45402 -22229 21149 20288 8044 3107 27394 29500 32258
13840 32258 28719 135 -19587 -20031 -12173 16286 -5771 -31480 -48959 -21874 -5577 -3959 -16827
13827 -16827 -46137 -37251 -3178 6398 -3755 -31891 -39776 -27697 -6400 -1080 -13881 8270
13815 8270 14305 24633 23795 23024 6186 20949 -3553 -19537 -26664 -12777 -4973 -1528 -409 -1524
13801 -1524 11444 814 -4746 -15217 -18117 -34625 -22844 -6690 4403 2421 -12160 -6322 6854
13788 6854 14350 328 -34320 -44812 -37410 -13310 -823 -18664 -36013 -32898 -20589 1611
13776A611M463K362N912j2419r355J0321j582l409j557O415m620J0996K5579Q169
13762D2886L20n322m911n829J4313J465k0304j8528l7596K5901J8646r490J7364
13749A8915J3715J4100J1319m0705l1681j9425Q387k1299K595M5027K5849q770
13737A8027K5067j7464l8625k2623P772M0747L1895R349l8398l6700J4865J6583
13725A0495r094N426L463L125o682J130J987k9577k3852R793J2044O71k472P833
13711a5710n640l3214J588J2227L1169J7958Q934o004K254J741m264n460o576
13698i97K2679j7725k8736j7753Q948K2408r191j7329M483k227K8274L224J9000
13685A5058K1501R561l7287j8357J5720J6225n019j6696N857K666l4262j3362
$$ plain form
13776 1611 6074 8436 14348 1929 -7426 2895 1313 -2096 -3653 2762 -1858 9138 34717 42886
13762 42886 43206 37884 32973 27144 41457 42922 22618 4090 -33506 -7605 11041 1551 18915
13749 18915 32630 46730 58049 17344 -14337 -33762 -25375 -46674 -44079 948 26797 18027
13737 18027 43094 25630 -12995 -35618 -27846 12901 44796 54145 15747 -20953 -6088 10495
13725 10495 1401 6827 10290 13415 6733 7863 9850 -19727 -43579 -33786 -21742 -21071 -23543 -15710
13711 -15710 -21350 -54564 -52976 -40749 -9580 8378 17312 11308 13562 15303 11039 5579 -997
13698 -997 21682 3957 -24779 -42532 -33584 -11176 -20367 -37696 -33213 -35440 -7166 -3942 15058
13685 15058 36559 46120 8833 -9524 6196 22421 17402 706 6563 9229 -25033 -38395
13673c8395Q689J7937k318J928R032J3380J6475l677j6321J8364L4004j5237o4238
13660b0377j330K3178K8501L2286j1713k6085l2554j3967K2333K5564j0595R365
13648B4606k472o535l0726j1833R270J8941K2285j9526K4549j14j1035N020j0349
13635A2081m3650m336J0292n761J6311L799J3899K9944k8265j324J4293o656k2099
13622a1472r595J6938j1018J1449l231j4079Q024q737J2556N861j7423j6292l203
13609d0222J0431O897N17m253p067M71Q983l102R651M4049Q605k3041r398q196
13595e675R827N972k137N420q17J1637j172n397J3655k000J1209j184K071r883
13581C1526o173N971j3229k0026J1840J1293J0260P992k722L0085N411l0533j5612
$$ plain form
13673 -38395 -29706 -11769 -14087 -12159 -3127 10253 26728 23051 6730 25094 59098 43861 -20377
13660 -20377 -21707 1471 29972 62258 50545 24460 -8094 -22061 272 25836 15241 24606
13648 24606 22134 15599 -15127 -26960 -17690 1251 23536 4010 28559 28445 17410 22430 12081
13635 12081 -31569 -35905 -25613 -31374 -15063 -11264 2635 32579 4314 2990 17283 10627 -11472
13622 -11472 -21067 -4129 -15147 -3698 -6929 -21008 -12984 -21721 -9165 -3304 -20727 -37019 -40222
13609 -40222 -29791 -22894 -22377 -26630 -33697 -33226 -24243 -27345 -17694 26355 34960 11919 2521 -5675
13595 -5675 4152 10124 7987 13407 12590 24227 23055 17658 31313 29313 40522 39338 41409 31526
13581 31526 25353 31324 18095 -1931 9909 21202 31462 39454 36732 66817 72228 41695 26083
13568B6083J0388j611K606M307m8776q328J7370j6237l0252J1431K0928L561r081
13555a7611J1869R54J4613K9341J6876r796k748j4301K941m246k9723q802J8396
13542G763L4599n494k8290j9243m270J8841M821K611J6076Q541J951k7207k816
13529G883r153j5763J2929J5083J4125k0548k2040k9598r278J5657J1941L1754
13517B992j1112M015J0743Q203l981K4245J4624P39R099K7858j9852l5558l480
13504B8535J1098j3549J6368Q546k0309J5058j5933j0297J1385m388k9747l3354
13492c6587j2534L4620L2077J0787q547K2662m146j009k509k1688k7552J5600
13480A174R367K3713l250j9149n446r104p370J3214R227j221L369K2914O654k55
$$ plain form
13568 26083 36471 34860 37466 41773 -7003 -15331 2039 -14198 -44450 -33019 -12091 -8530 -17611
13555 -17611 -5742 -4788 9825 39166 56042 46246 43498 29197 32138 27892 -1831 -10633 7763
13542 7763 42362 36868 8578 -10665 -14935 3906 8727 11338 27414 35955 37906 10699 7883
13529 7883 -1270 -17033 -4104 10979 25104 4556 -17484 -47082 -56360 -40703 -28762 2992
13517 2992 -8120 -4105 6638 14841 10860 35105 49729 50468 59567 87425 67573 32015 28535
13504 28535 39633 26084 42452 50998 30689 45747 29814 19517 30902 26514 -3233 -36587
13492 -36587 -49121 -14501 17576 28363 19816 42478 38332 37323 34814 13126 -14426 1174
13480 1174 10541 34254 31004 11855 6409 -2695 -10065 3149 12376 11155 14524 37438 44092 43837
13466D3837j1387j7133L5134n219n687j9908k2331K966m75M673K5357j2211k3129
13453e513M0514K1577j9557J4075N304k1604l6463N005K1178M460J0595Q458j4108
13440C3921k2070l629K03K1171K8085k20j6057l5309J0567R314P853k9862m999
13427a032K720p065J9490J3367q704l6601k134O900J715m144j2506m378K4000
13414h372l9038j8739M1946N6246m688j9117j1858J543k244P42J6683J1008j4395
13401I717k4989k0055J90n237Q873j2605J2778J2083L531Q946J7929o76J3611
13388B4096N01j8047k5195k1875J5763P066l216j9138K7144K3305l1538J8474
13376b660J9258K669k684J4873J0866j1468j2752l753j0009p049k3382M653J8845
$$ plain form
13466 43837 32450 15317 50451 45232 39545 19637 -2694 272 -203 4470 29827 17616 -5513
13453 -5513 35001 56578 37021 51096 56400 34796 -1667 3338 24516 28976 39571 48029 33921
13440 33921 11851 8222 8425 29596 57681 57461 41404 6095 16662 25976 33829 3967 -1032
13427 -1032 1688 -5377 14113 27480 18776 -17825 -19959 -13059 -11344 -15488 -27994 -32372 -8372
13414 -8372 -47410 -66149 -24203 32043 27355 8238 -3620 -2077 -4321 -3579 13104 24112 9717
13401 9717 -15272 -35327 -35137 -40374 -31501 -44106 -31328 -19245 -15714 -6768 11161 10485 24096
13388 24096 24597 6550 -18645 -40520 -24757 -17691 -20907 -40045 -12901 10404 -21134 -2660
13376 -2660 16598 19267 16583 31456 42322 30854 18102 14349 4340 -2709 -26091 -21438 -2593
13363b593L540k3978k213J9295J4369P949j7682L043k445L4298M712k9023l0026
13350b0754m969J6561r975k126L217J0788K2469j1860q111K8881M939m924j5510
13337H626o870J6585k4106r358R317J7229K4104q013k5838j3599l395k884L043
13324a5159K2483J157o423p759p603r652J3301K9349j1876k2158J6511J5637K4849
13311D2657l4880o51K8529r055l1901j7539l036J4998K510K4857P157k0399j0031
13298f784J6567j4150J0784J7370K348j4636k2985J6302k0734k951L826M859J9039
13285H855N676j4710k1546k825J1690j0329L1169j643Q38K9785k083j606m2278
13272i007o014J9658J2142J2412J3066P847l1847m960j3681m755r265O930L141
$$ plain form
13363 -2593 947 -23031 -25244 -5949 8420 16369 -1313 1730 -715 33583 38295 9272 -20754
13350 -20754 -25723 -9162 -19137 -21263 -18046 -7258 15211 3351 -4760 24121 29060 24136 8626
13337 8626 1756 18341 -5765 -15123 -5806 11423 35527 27514 1676 -11923 -15318 -18202 -15159
13324 -15159 7324 8481 2058 -5701 -13304 -22956 -9655 19694 7818 -14340 2171 17808 42657
13311 42657 7777 7126 35655 26600 -5301 -22840 -25876 -10878 -8368 16489 23646 3247 -6784
13298 -6784 9783 -4367 6417 23787 26135 11499 -11486 4816 -15918 -18869 -15043 -10184 8855
13285 8855 14531 -179 -21725 -24550 -12860 -23189 7980 6337 7175 36960 34877 33271 -9007
13272 -9007 -15021 4637 16779 29191 42257 50104 18257 13297 -384 -5139 -14404 -7474 -4333
13259d333m307R19n665K2042M21m635J3506k522Q58Q53P730j4329j1325P196l717
13244B692K536Q342R587J2627j4366l7342j3965J7873J0684j309J3227P956K0834
13231C9376k1545j4696K762K3256l533m415K4452N236q294k4395o449O777L0551
13218D9083O558j4934m3104p928l0348J626N696J1313J7321j6931j3647M8085
13206A2790M598j922j4894n172n70K6650M21O231k411J803j3523n987R791o534
13192A1271k4026r343k5343k0420N823L7039O569K09o366j7271K5978L4238o582
13179A1776j2560L420k1454m645J3868Q837l4262j60J8063J9113M406n855J539
13166B086q984K889P50r804K845R550j2474R63K518J965K481q103j9855R118J2118
$$ plain form
13259 -4333 -8640 -7721 -13386 8656 9077 4442 17948 15426 16284 17137 24867 10538 -787 6409 2692
13244 2692 5228 13570 23157 35784 21418 -15924 -29889 -12016 -1332 -2641 10586 18542 39376
13231 39376 17831 3135 5897 29153 25620 21205 45657 50893 42599 18204 11755 18532 49083
13218 49083 55641 40707 -2397 -10325 -40673 -39047 -33351 -22038 -4717 -21648 -35295 12790
13206 12790 17388 15466 572 -4600 -5170 21480 21901 28132 25721 27524 14001 8014 17805 11271
13192 11271 -12755 -22098 -47441 -67861 -62038 -24999 -18430 -18221 -24587 -41858 -15880 18358 11776
13179 11776 -784 2636 -18818 -23463 -9595 -758 -35020 -35180 -17117 1996 6402 547 2086
13166 2086 -6898 -4009 -3259 -13063 -10218 -668 -13142 -12179 -9661 -7696 -5215 -13318 -33173 -24055 -11937
13151a1937R772J7364j7023j2002l072K801K8070L3472m670j6654K789Q650O384
13138D3944q251k3528j2179J8876J5211P517M563R343J2969l6426j0881r362l6618
13125b4822o578K9893J6683J3622M756j8247l3176K0955k005R106m713k621N899
13112H752K090j7790j8277J8148K414K6952L2067q86j4270K2628J915l2780k7365
13099C598j5882k86K2427K4248o519N987K9994K818l408K2715k0131k0530J8980
13086F4011K826p98j493k6693k7108l0543J1744K1133o341j4967m943N398m447
13073a2221n645M298J7764J4561r112j7143J2302l580j3844J6001P439N765j4545
13060B040j2967j4391M5348K4094J0199o282J455K1166M660J4054k3616r124r940
$$ plain form
13151 -11937 -2165 15199 -1824 -13826 -16898 -14097 13973 47445 42775 26121 28910 37560 43944
13138 43944 35693 12165 -14 18862 34073 41590 46153 55496 68465 32039 21158 11796 -24822
13125 -24822 -31400 -1507 15176 28798 33554 15307 -17869 3086 1081 10187 5474 2853 8752
13112 8752 10842 -6948 -25225 -7077 -4663 22289 54356 53470 39200 61828 63743 30963 3598
13099 3598 -12284 -12570 9857 34105 27586 33573 63567 66385 62977 85692 65561 45031 64011
13086 64011 66837 66039 64546 37853 10745 -19798 -8054 13079 6738 -8229 -13172 -7774 -12221
13073 -12221 -17866 -13568 4196 18757 9645 -7498 4804 1224 -12620 3381 10820 16585 2040
13060 2040 -10927 -25318 20030 44124 54323 48041 49496 70662 75322 89376 65760 56636 46696
13047D6696k5426M640K1768L744M414N982j4178K6454K3063o961q349j1929m409
13034F5509M083m575k4483P938j3226m4914r987K5626J8287j294J3631O172k5009
13021A7758l2978o437j5372K494k726O343J2623J4553K0647P539j0249N767N0285
13008G0247Q64k9827M457N414O944K0420k3099l5178k922K1339L2634k2502k0911
12995B7880k2530K4656J4614j9502j0420N069J3048M351J752m387j3609j4996
12983E926J254n058J4046L161k1475J8783K1530P125j6652j1149k2846L525K5631
12970B3801M645j7536R9P711o229j3874R510l146Q984R066J0485J819M042K7663
12956F7040P837l714j0951J0951m850m2976O975R195j850R871k1412l009k7102
$$ plain form
13047 46696 21270 25910 47678 51422 55836 61818 47640 74094 97157 90196 81847 69918 65509
13034 65509 69592 65017 40534 48472 35246 -9668 -19655 5971 24258 22964 36595 42767 17758
13021 17758 -15220 -21657 -37029 -34535 -37261 -30918 -18295 -3742 16905 24444 14195 19962 70247
13008 70247 71111 41284 45741 51155 58099 78519 55420 20242 17320 38659 71293 48791 27880
12995 27880 5350 30006 44620 25118 14698 19767 32815 37166 38918 34531 20922 5926
12983 5926 7180 2122 16168 19329 -2146 16637 38167 45292 28640 17491 -5355 -1830 23801
12970 23801 28446 10910 11009 18720 12491 -1383 8127 4981 13965 23031 33516 35335 39377 67040
12956 67040 74877 71163 60212 71163 66313 23337 30312 39507 37657 47528 26116 23107 -3995
12943c995o775K8267L9320l5769j678M97q294J0885j5115L0195J7605Q139N074
12930F8356j2060J28J7782Q80J0068M2279m793k4647k4779j2183J981O338r0j75
12916F9085J7574K4862M3080K8652K1970L9095Q6243N2484J30423J69091K13642
12905H96201K45449J92531O6584k2468l3496J3407K4292j12677k22592k66306
12895G80925k15943j55408p1783q0749o0829k4840p219j754k2726j7980L243j1590
12883A13347m3337j3477j1347k3723j6276J819j371j4557L4720K5300l031J2493
12871F0560J9312j6103l1975k367P706p753j1184K678M987J3555Q837K5556l984
12858F9825l047l2886n051K0466j9497M477J7912n260l3305p462Q49K6817j0966
$$ plain form
12943 -3995 -10770 17497 56817 21048 19370 19867 11573 22458 7343 37538 55143 63282 68356
12930 68356 56296 56424 74206 75086 85154 127433 122640 97993 73214 61031 63012 69350 69260 69085
12916 69085 86659 111521 154601 183253 205223 244318 330561 383045 513468 682559 896201
12905 896201 1141650 1334181 1400765 1378297 1344801 1358208 1382500 1269823 1047231 780925
12895 780925 564982 409574 337791 257042 196213 171373 164154 162400 139674 121694 124937 113347
12883 113347 70010 56533 45186 21463 5187 7006 5635 -8922 25798 51098 48067 60560
12871 60560 79872 63769 31794 29427 37133 29380 18196 20874 25861 39416 48253 73809 69825
12858 69825 66778 33892 28841 49307 29810 34287 52199 46939 13634 6172 7021 33838 22872
12845B2872J0462J9260J2425o08k1471r371j2046k0198k9953J6605M8574K8947
12833F5498O010P387j4938k3948j5104o160K0037O770k2739k5055P64j4888K050
12820a4316j3296l097M5701K8384J3029j1037j539o162J9405M137j8133j7413
12808B5663r826j9331o08p076L7836K1749o791j9372K0213K9896p405j0056Q443
12795F3335j0967j200J309j4827j4389J8098N17j4282k4442j1521j0770j3410
12783c2549K3982L2280p636P102J9271J7344r595N117K1421J1372j4098K531J4249
12770I0791O465j228j0621j8035k5174R134J8700P084j6338j5124N994Q019K4850
12757H4517K8481j158m252J4818K224l3078j0962k4021j0220j274l4180K2790
$$ plain form
12845 22872 33334 52594 65019 64411 42940 33569 21523 1325 -28628 -12023 36551 65498
12833 65498 71508 78895 63957 40009 24905 18745 38782 45552 22813 -2242 -1478 -16366 -14316
12820 -14316 -27612 -30709 14992 43376 56405 45368 43829 37667 57072 61209 43076 25663
12808 25663 15837 -3494 -4102 -11178 26658 48407 41616 22244 42457 72353 64948 54892 63335
12795 63335 52368 51168 52477 37650 23261 41359 41876 27594 3152 -8369 -19139 -32549
12783 -32549 -8567 23713 16077 23179 42450 59794 50199 55316 76737 88109 74011 76542 90791
12770 90791 97256 96028 85407 67372 42198 51332 70032 77116 60778 45654 51648 59667 84517
12757 84517 112998 111840 107588 122406 124630 91552 80590 56569 46349 45075 10895 33685
12745C3685N0017K9159K493K901K2816j0667J0581L0016J8935M0483K8388K5465
12733B84272K7197r837M458J5825j5327n3421m7382j7956l0227l9510q252k969
12721A06871q522j0262P023J1073K1903p531Q757j1547J002K259k8213j094P690
12708I9409R44k1369j6223o091l602j1947o458J3531J2316P944K3880J2040J0863
12695A15237L914j9031j0289K8414L469j2983o717J3930n925L311j742p835O894
12682A10647N0771M821K0729J8103m897J6914K1399q289n5337j1970Q072k4737
12670A46226j7258m8786m6900P236Q145N682J9962o381q682N62j3119J4541R307
12657G0535N94L1140K4460l384k9924q112l80n825l566P098p210l463p814j6486
$$ plain form
12745 33685 83702 112861 115354 118255 141071 130404 140985 171001 189936 230419 258807 284272
12733 284272 311469 301632 306090 321915 306588 253167 205785 187829 157602 118092 109840 106871
12721 106871 98349 88087 95110 106183 128086 120555 129312 117765 118767 121026 92813 91719 99409
12708 99409 100353 78984 62761 56670 53068 41121 34663 48194 60510 68454 92334 104374 115237
12695 115237 119151 100120 89831 118245 121714 108731 102014 115944 110019 113330 111588 103753 110647
12682 110647 161418 166239 186968 205071 200174 217088 238487 230198 174861 162891 170963 146226
12670 146226 128968 80182 33282 40518 48663 54345 74307 67926 59244 59806 46687 61228 70535
12657 70535 71129 102269 126729 123345 93421 85309 84929 79104 75538 82636 75426 71963 64149 47663
12643D7663M216j3469j2963j4147j4190R582J5089J5996M1521L8041N3622K9855
12631B00816K4132J5308K4481m736n712K3329L502J547j0245l88r342J4466J6937
12618B94095k3265j5756N930J5829L9076L7194O0890M2912L369K3555L5857J9597
12606E39283L6430o276o2303j8754p857m6875p4181o2216l8742j1671K5723K439
12594B75000j4479K13j3168k163R854J6187m677M67n353J659j0854o4732p337
12581A80617N4068K1044p444j248j096L0360N994j6855l482K636J6063K1742P003
12568C09402k1737L391K7342k3784M176K1821J2444R282q215Q565J7730k4835
12556C35582J586K3254K6302J1068J8771J0640J4764J3056J1632M5887K7992o496
$$ plain form
12643 47663 51879 38410 25447 11300 -2890 6692 21781 37777 79298 117339 170961 200816
12631 200816 224948 240256 264737 260001 254289 277618 281120 282667 272422 272034 262692 277158 294095
12618 294095 270830 255074 261004 276833 315909 353103 413993 456905 460274 483829 519686 539283
12606 539283 575713 569437 507134 488380 480523 433648 359467 297251 258509 246838 272561 275000
12594 275000 260521 260734 247566 245403 255257 271444 266767 267234 261881 263540 252686 187954 180617
12581 180617 234685 255729 248285 247037 245941 276301 282295 265440 261958 264594 280657 302399 309402
12568 309402 287665 291056 318398 294614 298790 320611 333055 342337 334122 342687 360417 335582
12556 335582 337168 360422 386724 397792 416563 427203 441967 455023 466655 512542 540534 534038
12544E34038j8315Q220N2743J6882J2931J1760K9955R304J2714N0587L5225J5776
12532G71820K8860K5364L3755N1454M5056o653q09M8318R5048O7341P3520Q2432
12520A315506N6351O2996N8118J05769J18034J25567R6138J15458J33857J52295
12510B340089J75110J65060J69521K34303K84763K84743L55325M13375M89105
12501D911394O51276Q68580J099869J411770J688048J888078J865893J749571
12493A6134479J861781K376257L323886M480206O011953Q747109J3680334K1587086
12485G8203091L2468056M4910289N2855854M4870563K0365262l428030p919982
12478B62325103K588187O653312r369515l6404977n2134376m9423619l7120300
$$ plain form
12544 534038 515723 523943 576686 593568 606499 618259 648214 657518 670232 720819 756044 771820
12532 771820 800680 826044 859799 911253 956309 949656 948847 997165 1092213 1159554 1233074 1315506
12520 1315506 1371857 1434853 1492971 1598740 1716774 1842341 1938479 2053937 2187794 2340089
12510 2340089 2515199 2680259 2849780 3084083 3368846 3653589 4008914 4422289 4911394
12501 4911394 5562670 6431250 7531119 8942889 10630937 12519015 14384908 16134479
12493 16134479 17996260 20372517 23696403 28176609 34188562 42935671 56616005 78203091
12485 78203091 110671147 155581436 208437290 253307853 273673115 270245085 262325103
12478 262325103 264913290 271566602 262197087 225792110 173657734 124234115 87113815
12471H7113815k4348533j5157245r431013o122642m370511l425067k761380k149951
12463A9347473j737224j653806j825786k023438j922354j620040j248334r63956
12455F352535p52214o16379m86621l94744l35842l13630k59716j93942j67201
12446B832246j95293j89060j58596j14561j03254j36681j39997j17644p4123o9635
12436A533402p9198j4288j1741m0795n2683p0914m2532o7702o4921q0117m1068
12425I67443N490k645k0028k408m913k9022m0177l1732j0720k7541m7262m7145
12413G09340k2499J843K245j2235k8029m0636k5252M126m8107j1970K189J3684
12401E44699p027J2186o086o715J2776Q377k5532n09L057k6713l9525l0672j3217
$$ plain form
12471 87113815 62765282 47608037 38177024 32054382 27683871 24258804 21497424 19347473
12463 19347473 17610249 15956443 14130657 12107219 10184865 8564825 7316491 6352535
12455 6352535 5600321 4983942 4497321 4102577 3766735 3453105 3193389 2999447 2832246
12446 2832246 2636953 2447893 2289297 2174736 2071482 1934801 1794804 1677160 1603037 1533402
12436 1533402 1454204 1439916 1428175 1387380 1334697 1263783 1221251 1153549 1088628 1008511 967443
12425 967443 972933 970288 950260 947852 942939 913917 873740 842008 831288 803747 756485 709340
12413 709340 686841 688684 690929 678694 650665 610029 584777 588903 540796 528826 531015 544699
12401 544699 537672 549858 543772 537057 549833 558210 532678 532169 535226 508513 468988 438316 425099
12388D25099j9054n039J1275l3266j6045k8182L913O049L060j8214k0875K77j4880
12375B94118r578l8022j4794L1931k3911J080R655k6445j2670M5126p765q85j2662
12362B35178M1185K6703K4700P013J7451n284k8020k8187j50L7241k8432q1800
12350B17598l0080k8799j6240n343M847j8995j8981j1030j8851J8449J9972k1265
12338I1282k2517j3851J2249j2492l2793k6599j0430o495L295K5645K9430L2958
12326F9682M9958J2254R946K9392O6557L6830J5062K99K7321J2411M693k7431
12314C06974j1470j1304o260l174j4171l2502p415j4432k3036k9771k2365K2915
12302A53989j3211Q644j289j2676J3507R285k4838l1758K1311K9716O078l1236
$$ plain form
12388 425099 406045 401006 412281 379015 362970 334788 338701 344750 347810 329596 308721 308998 294118
12375 294118 284540 246518 231724 263655 239744 240824 250479 224034 211364 256490 248725 247840 235178
12362 235178 276363 303066 327766 334779 352230 346946 318926 290739 290589 327830 299398 217598
12350 217598 187518 158719 142479 137136 141983 122988 104007 92977 74126 92575 112547 91282
12338 91282 68765 54914 67163 54671 21878 -4721 -15151 -21646 -18351 7294 36724 69682
12326 69682 119640 131894 141840 171232 237789 274619 289681 289980 317301 329712 334405 306974
12314 306974 295504 284200 277940 274766 260595 228093 220678 206246 183210 153439 131074 153989
12302 153989 140778 149422 148133 135457 148964 158249 133411 101653 122964 152680 158758 127522
12290A27522k822Q72k9057m4071k9617p230j254j8551j0509j0616j6524J6484
12278b5373J2186R525L5590j2991k0704K3777L6830J5148m359k6602r811j0517
12266B2699J5709j7506k8121r607K5067J7608Q13k717j2239q648J290k6429o600
12253b8681M3908L4476j0782j7633J938K4614L0664Q290l5344l555J421j2139
12241C7177Q668J3060k673j4045m584j3829o822m978K4635M1974q639O008j2948
12228F3004j3354O244K4557l471m4659O191j2856k3566J4636k0133j7477N145
12216a5739J7440L1723K839j3169r069l5762J8247K2669L142K9485K84j1134j1936
12203B9020k6857J4003J6125Q63o068j9391o401K2030J3784j8467N104K3329K1582
$$ plain form
12290 127522 124700 125572 96515 52444 22827 15597 14343 -4208 -14717 -25333 -41857 -25373
12278 -25373 -13187 -3662 31928 18937 -1767 22010 58840 73988 69629 43027 33216 22699
12266 22699 38408 20902 -7219 -16826 8241 25849 26662 23945 11706 3058 4348 -22081 -28681
12253 -28681 15227 49703 38921 21288 23226 47840 78504 86794 51450 47895 49316 37177
12241 37177 45845 58905 56232 42187 37603 23774 16952 11974 36609 78583 69944 75952 63004
12228 63004 49650 55894 80451 76980 32321 38512 25656 2090 16726 -3407 -20884 -15739
12216 -15739 1701 33424 36263 23094 14025 -21737 -3490 19179 22321 51806 52090 40956 29020
12203 29020 2163 16166 32291 33154 27086 7695 1294 23324 37108 18641 23745 47074 68656
12190F8656J2997j0450k9205j1627M8393R973n878Q410J3784J0076J1972P006
12178A34107K4351M1467N6659O5872J5952K275m96M86l665k4351n2704m9866l5000
12165A75087k1202j0984l9737l945N688m623r215j1325p427m0199p778J5629L687
12152D3656M978j2910j7724j8993K2969M4318Q156O381Q681l1538j6069R081O988
12139E7974o600l90k6396j4352J4703K5676j395q083k448r04l1264j2500J5206
12126I227J5566K4087K2060q497j382j4369l0432J133M3881K6371j0534K712J8431
12113I8254L4254K4377O3282L5023j7949n299k5962m8554m7935m7175m6831j9396
12101c911J4465n277j5004M095J4498M0832J3865j0768q600J0701K223J8653J1697
$$ plain form
12190 68656 81653 71203 41998 30371 78764 88737 82859 91269 105053 115129 127101 134107
12178 134107 158458 199925 256584 322456 338408 340683 340187 340673 337008 312657 259953 210087 175087
12165 175087 153885 142901 103164 99219 104907 100284 91069 79744 72317 32118 24340 39969 43656
12152 43656 48634 35724 18000 -993 21976 66294 74450 80831 89512 57974 41905 50986 57974
12139 57974 51374 50984 24588 10236 24939 50615 49220 41137 38689 37785 6521 -5979 9227
12126 9227 24793 48880 70940 62443 61061 46692 16260 17393 61274 87645 77111 79823 98254
12113 98254 132508 156885 220167 255190 237241 231942 205980 157426 109491 62316 15485 -3911
12101 -3911 10554 5277 -9727 -5632 8866 49698 63563 52795 44195 54896 57119 75772 87469
12088H7469r622l0079k5217K723M6732k153j5581j6399l210J1347K1612K7209
12076I4831P289K8857J6032J2913O4126N755K2242K7679j6790j1246k4528l4891
12064A92269m939k0006J1331M0681L6994Q0198J00423Q1668J58661K49343K13893
12053A140516J83071O8974k6054k8056J6589m74p2197j61345k40286k13502j50785
12042E16451j47349n2916m7742m7901m0220k2184m486M242j4936l2352k6885j8573
12030F5149l584L727P507l348J3232j579j4553N525k8618k466n314K4283L8762
12017I8723n906r70k0933n505p426J0177J7677k9237j3627J0615L463j8306l630
12004C5115J0217j855n933O726k102J6232J211j3930j9752l00J9421m010k0216
$$ plain form
12088 87469 77847 47768 22551 25274 72006 69853 54272 37873 34663 46010 67622 94831
12076 94831 102120 130977 147009 159922 224048 229803 252045 279724 262934 251688 227160 192269
12064 192269 187330 167324 178655 219336 256330 336528 436951 518619 677280 926623 1140516
12053 1140516 1323587 1392561 1366507 1338451 1355040 1354566 1282369 1121024 880738 667236 516451
12042 516451 369102 316186 268444 220543 180323 158139 153653 157895 142959 110607 83722 65149
12030 65149 61565 65292 72799 69451 82683 81104 66551 72076 43458 40992 35678 59961 98723
12017 98723 92817 91847 70914 65409 57983 68160 85837 56600 42973 53588 57051 38745 35115
12004 35115 45332 43477 37544 44270 42168 58400 59611 45681 25929 25629 45050 41040 20824
11991B0824K7240M374k8051k654J2613j74J6254O846M080J5372j9166J101O30
11978E9289j8267R27m2209N514J6132L0210j1654j7633N329K701L880J9576k388
11965E1407l0265M65n489J0678J9657q785J4765j2077r728j2163K0004K3316N848
11952F7633N736j3339r239j7920n023l695k4366J0229L2165K06p969j5589N78
11939A9407J6114K0820k281n381q474J2793p388p762J287l244j1493J021l548
11926B1871J787J2995J1331o923M929l734j5431j994n119J8351j0095j1805j1115
11913E048K818K577K4371L3160N143O331k3659l2116j0450j2682J0018J3613K1990
11900D6162J380L308L021O35k0391k9166k9683J1916N2294K0278J6149k2234J41
$$ plain form
11991 20824 48064 52438 24387 21733 34346 34172 50426 57272 61352 76724 57558 58659 59289
11978 59289 41022 41949 -260 5254 21386 51596 39942 22309 27638 30339 34219 53795 51407
11965 51407 21142 21607 16118 26796 46453 37668 52433 40356 30628 18465 38469 61785 67633
11952 67633 73369 60030 50791 32871 27848 24153 -213 10016 42181 42387 34418 18829 19407
11939 19407 35521 56341 54060 48679 40205 52998 45610 37848 39135 35891 24398 25419 21871
11926 21871 23658 36653 47984 41061 45990 42256 26825 24831 19712 38063 27968 16163 5048
11913 5048 7866 10443 34814 67974 73117 79448 55789 23673 13223 541 10559 24172 46162
11900 46162 47542 50850 53871 54506 34115 4949 -24734 -12818 39476 59754 75903 53669 53810
11887E3810k0255k3312k1192M210j4128L3772K152J9387j730j5927q3O673Q864
11874C2241L2404J0608k5907J0817K2645O148l378j6246r68O020j2219k2163k3582
11861A6420k2581K5314n226L213K5778K3200k3306k6434J3844k0423q750J4700
11849A5749J820L472O158K2162K6220N230j1562j2015j3210J3408j4208r574p107
11836B6543j0983O44L443N753K5836l2034n292o311J6119J9696J2527J3518j8715
11823E0744k298k055r343J0281p211J7527j45j1972q419j5409j0874J0131j5705
11810E252k6354L3730L7470n601n0187p981L1636L9783J3482o402N356j7745k5928
11797B6511j515j044J213o810j3938J0902J024N51k364j866L5003J1718l0369
$$ plain form
11887 53810 33555 10243 -10949 -6739 -20867 12905 15057 34444 32714 16787 16704 23377 32241
11874 32241 64645 75253 49346 60163 82808 88956 85578 69332 68364 74384 62165 40002 16420
11861 16420 -6161 19153 13927 17140 42918 66118 42812 16378 30222 9799 1049 15749
11849 15749 17569 21041 27199 49361 75581 80811 69249 57234 44024 57432 43224 33650 26543
11836 26543 15560 16204 19647 25400 51236 19202 13910 7599 23718 43414 55941 69459 50744
11823 50744 48446 46391 37048 47329 40118 57645 57500 45528 37109 21700 10826 20957 5252
11810 5252 -21102 12628 50098 44497 -5690 -13671 17965 57748 71230 64828 70184 52439 26511
11797 26511 24996 23952 25165 18355 4417 15319 16343 16894 14530 12664 47667 59385 29016
11784B9016m483K743j6328J062M081L0103K1759j6084j8682N575j5368j8516K1202
11771B6080J7678R814n683J3133J4876k2342r393J8738L1731r43K9257J8489j4622
11758A26813j0912L2726j0848k6207O498J4946L1577J5409L64J146L1880l615
11746B09777m467L2241K1431k753l2138M731K6225K6584M498N623k5343m9411
11734B16998j386J1007J4K414q521k514M742j2612q626J0377k2225p467L5460
11721B17661J7000k2770j4330m723K046p47j1372q982J5459k1846j9768l442J8845
11708A63031l6674m1627J7665L2331j4226k397L2368O225j7480j3206k0528l684
11696A01798J8946j3744K4982j2258k8247J7921J8107j3034J4345N616k954J3383
$$ plain form
11784 29016 24533 27276 10948 12010 16091 46194 67953 51869 33187 38762 23394 4878 26080
11771 26080 43758 53572 47889 61022 75898 53556 44163 62901 94632 93689 122946 141435 126813
11758 126813 115901 148627 137779 111572 118070 133016 164593 180002 180366 181512 213392 209777
11746 209777 205310 237551 258982 256229 224091 228822 255047 281631 286129 291752 266409 216998
11734 216998 215612 226619 226633 229047 220526 218012 222754 210142 201516 211893 189668 182201 217661
11721 217661 234661 211891 197561 192838 194884 194137 182765 173783 189242 167396 147628 144186 163031
11708 163031 126357 84730 102395 134726 120500 118103 150471 156696 139216 126010 105482 101798
11696 101798 120744 107000 131982 119724 91477 109398 127505 114471 128816 134432 131478 144861
11684A44861O864J514Q180K0091K019r338R072J56M859J7872J8415J0799P025
11671B42389J439K0419M9335M434l5249j2785M899p873n821n082J1350K2882J7604
11658C07941Q401l4695l6792k386j766J1380j0544o154j1064r832P169L997j3748
11645B11907p736k6253k882j8972l1677j7956j0719L755J749j1035J474j2512
11633G9143l4157o576K9907K1451n763k8066j7615K959o515K615K6959K8020J69
11620I2531j0704l217P298R240j1505J4286j4346Q869m162K4333M2232J4747L6759
11607B06361L9710K3017o217j6j6262o3108m6796m011k2619j0269k526k4783j1882
11594F0599k326K4969J6068J7676k240k3335k3101k4844J7578j4778q806P876
$$ plain form
11684 144861 151725 153239 161419 181510 183529 174191 183263 183419 188278 206150 224565 235364 242389
11671 242389 243828 264247 313582 318016 282767 269982 274881 267008 261187 256105 267455 290337 307941
11658 307941 316342 281647 244855 242469 240703 252083 241539 235385 224321 214489 221658 225655 211907
11645 211907 204171 177918 175036 156064 124387 106431 95712 99467 101216 90181 91655 79143
11633 79143 44986 38410 68317 89768 84005 55939 38324 41283 34768 37383 64342 92362 92531
11620 92531 81827 78610 85908 95148 83643 97929 83583 92452 88290 112623 154855 169602 206361
11607 206361 246071 269088 262871 262855 246593 183485 136689 132678 110059 99790 97264 72481 60599
11594 60599 58273 83242 99310 116986 114746 91411 68310 43466 61044 46266 37460 45336
11582D5336K5947J9645m029K2575J5652K7411M758J6875J9838N1688L7528L9485
11570C22709N4683N9347M8149J2628N569J8090L68m8655p1881p6708p0206k4862
11558B29231m0527m3708N977j6863k1066K6601M1738l787l98K330k892r856l788
11545A62992j9575q746r721J038J8669L6428J2484r715j2721l2829j4501O2089
11533A85892K529R747K6827J8668L9367N7965J3157Q900J543l9630l9189o1138
11521B24638o011J941k3669L97n984j5139k7277J0534J3942o108k1903L1107o868
11508A69600p275P089k27N518J084k1603j2317j7665K5330Q012P817L6356K863
11495B04582j2539M884k2186q167l767Q24k976p809K8984M2085j0653j7948j4456
$$ plain form
11582 45336 71283 90928 86899 109474 125126 152537 157295 174170 194008 245696 283224 322709
11570 322709 377392 436739 484888 497516 503085 521175 521543 472888 401007 324299 254093 229231
11558 229231 188704 144996 150973 134110 113044 139645 181383 177596 177198 179528 176636 166780 162992
11545 162992 143417 134671 124950 125988 144657 181085 193569 183854 171133 138304 123803 185892
11533 185892 188421 198168 224995 243663 283030 340995 354152 363052 364595 324965 285776 224638
11521 224638 218627 220568 196899 197296 191312 176173 148896 159430 173372 167264 145361 176468 169600
11508 169600 162325 169414 169187 174705 175789 154186 141869 124204 149534 157546 165363 201719 204582
11495 204582 192043 196927 174741 166574 162807 163631 160655 152846 181830 223915 213262 195314 180858
11482A80858j6887n198O332L0017L672K9348j1302l8573k1612k8938p185K6540
11470A47072J9081J1454L09k7827M033J2864j1606j4572n686J0328L654O782k6015
11457A29871J4588K8463O22j6900J1812M158K1103P734K285K8522Q164J9752j3336
11444B46838L379Q268j1958J1688K64j6795j786O995J0993J9326J2095q515j2795
11431B67997J6794J1557j169k4259J6781o6k1301M13j4971j5105l962o032P42
11418B27419N818J4024J359j6883L0662J2165J7313P789k0259K4681M870j2563
11406B96395q725j437J6521n175J7453J4448R742j5226q699p303J75r22N707L0643
11392C43597m242r709J0454j111J5260Q244J6568L288j918K6716J3358J872M814
$$ plain form
11482 180858 163971 158773 165105 195122 198794 228142 216840 178267 156655 127717 120532 147072
11470 147072 166153 177607 177916 150089 154122 166986 155380 140808 135122 145450 149104 155886 129871
11457 129871 144459 172922 173544 156644 168456 172614 193717 201451 203736 232258 240422 260174 246838
11444 246838 250217 258485 246527 258215 258479 241684 239898 246893 257886 277212 289307 280792 267997
11431 267997 284791 296348 295179 270920 287701 287635 266334 266747 251776 236671 232709 226677 227419
11418 227419 233237 247261 248620 231737 262399 274564 291877 299666 279407 304088 308958 296395
11406 296395 287670 286233 302754 297579 315032 329480 339222 323996 315297 307994 308169 307247 312954 343597
11392 343597 339355 329646 340100 338989 354249 362493 379061 382349 380431 407147 420505 422377 427191
11379D27191K6365K7318L400L6237K4425J4332J7375K6928N1284K0510M2888K6687
11367G44940p215J0369J3568K7955N0202N5095J3205K3808M1818N5664N5796P1757
11355A156962Q6415Q9554Q2272P5435M9277N8581J18591J34939J37599J34613
11345B124238J33822J38563J53485J72944J98010K52506L56121M82731O45640
11336D658060Q75164J131189J470538J817450K150883K366792K341231K002359
11328A8813666J418438P09645N1358l43367l39498p1168L79421Q81639J147417
11319B2647551J053862O97745L08392K4761K6931K11157N12308Q33882J270531
11310B7587120J877419K493576L081881L502635L546709L092921K042788M95639
$$ plain form
11379 427191 453556 480874 484274 520511 544936 559268 576643 603571 654855 675365 718253 744940
11367 744940 737725 748094 761662 789617 839819 894914 908119 931927 973745 1029409 1085205 1156962
11355 1156962 1243377 1332931 1415203 1490638 1539915 1598496 1717087 1852026 1989625 2124238
11345 2124238 2258060 2396623 2550108 2723052 2921062 3173568 3529689 4012420 4658060
11336 4658060 5533224 6664413 8134951 9952401 12103284 14470076 16811307 18813666
11328 18813666 20232104 20941749 20993107 20649740 20310242 20239074 20618495 21500134 22647551
11319 22647551 23701413 24399158 24707550 24732311 24759242 24970399 25482707 26316589 27587120
11310 27587120 29464539 31958115 35039996 38542631 42089340 45182261 47225049 47720688
11302D7720688r38710j592783j457229q46849k28085J70775J53607k70952q50181
11293D1860281j431906j756187j837666j757189j596098j426983j323722j246534
11285B9483996j245863j287820j370297j570023j836861j967010j883032j699918
11277A6623172j358327j061211r18681r49376j003442r67802p89109n61626l36804
11268H676794q0476J33863L73823O46224R12667J093097J162429J023102Q66943
11259A4808466Q74294J054317J354028J631833J780676J781570J555391J237188
11251B6077763R71847Q46609R17898J014595J079295J134295J190869J355385
11243C4588556J655827J866731J846787J519909R15080L31553K39759P75955J681173
$$ plain form
11302 47720688 46781978 45189195 43731966 42885117 42657032 42827807 42981414 42710462 41860281
11293 41860281 40428375 38672188 36834522 35077333 33481235 32054252 30730530 29483996
11285 29483996 28238133 26950313 25580016 24009993 22173132 20206122 18323090 16623172
11277 16623172 15264845 14203634 13284953 12335577 11332135 10364333 9575224 9013598 8676794
11268 8676794 8596318 8730181 9104004 9750228 10662895 11755992 12918421 13941523 14808466
11259 14808466 15682760 16737077 18091105 19722938 21503614 23285184 24840575 26077763
11251 26077763 27049610 27896219 28814117 29828712 30908007 32042302 33233171 34588556
11243 34588556 36244383 38111114 39957901 41477810 42392890 42724443 42964202 43740157 45421330
11234D5421330K540198K922284K515563J426885n4341j537176k642190l218983
11226D7373570l340081l109159k642353k090799j642447j287487j060404j083195
11218C1117645j302494j563128j665990j579970j254166p60980l42320p5543j00151
11209B2472903n45890j138064j780749k210001k340332k242858j993034j682871
11201H539104j349178j045106q32397o56086n04844l89359k92433k17088k12156
11192C040457k06024j74315j66601j56810j17963j10955j23833p3686p4286p2304
11182A763680j08172j02121j05757r2893o7899p4014r9308l0194m5732l3624l5321
11171I68645k1847j7543j1053l2654j6885m6498l9069k6548k5921m1453l2578
$$ plain form
11234 45421330 47961528 50883812 53399375 54826260 54771919 53234743 50592553 47373570
11226 47373570 44033489 40924330 38281977 36191178 34548731 33261244 32200840 31117645
11218 31117645 29815151 28252023 26586033 25006063 23751897 22990917 22648597 22573054 22472903
11209 22472903 21927013 20788949 19008200 16798199 14457867 12215009 10221975 8539104
11201 8539104 7189926 6144820 5312423 4656337 4151493 3762134 3469701 3252613 3040457
11192 3040457 2834433 2660118 2493517 2336707 2218744 2107789 1983956 1910270 1835984 1763680
11182 1763680 1655508 1553387 1447630 1354737 1286838 1212824 1113516 1083322 1037590 1003966 968645
11171 968645 946798 929255 918202 885548 868663 822165 783096 756548 730627 689174 656596
11160F56596M718r857j1892l4301j9410m4949j8471j526o389l785j8819k2575
11148D69340J232O244K3553J5117k362k4072n4231m3104j6544l1547o048J581
11136C39159K5347J0543k0002p198m199k4652m911j7140k386J5262r384k6073
11124B74366j1120R954j408r778K8476P105j5136R309K1918P700J5267L6085n21
11111C72217o485K5293O8238N2290N2265M5159L5534M8312K370k5363m4824n8972
11099E66034n6473k4726j1520K4862J0077j0304n085k5309q213j7669k5421j6134
11087D00119j1396L599O153o560j6601R287J1881M7752K7757L2998L0332J9783
11075E55104J809J1426P427j6251O581M1706j205N328j0529p1750n8566n4026
$$ plain form
11160 656596 661314 651457 639565 605264 585854 540905 522434 520908 514519 510734 491915 469340
11148 469340 470572 476816 500369 515486 513124 489052 434821 391717 375173 343626 337578 339159
11136 339159 364506 375049 355047 347849 343650 318998 314087 296947 294561 309823 300439 274366
11124 274366 263246 273200 271792 262014 290490 297595 282459 291768 313686 321386 336653 372738 372217
11111 372217 365732 391025 459263 511553 563818 608977 644511 692823 695193 669830 625006 566034
11099 566034 509561 484835 473315 498177 508254 497950 492865 467556 459343 441674 416253 400119
11087 400119 388723 392322 398475 391915 375314 384601 396482 444234 471991 504989 535321 555104
11075 555104 556913 568339 575766 559515 566096 607802 606597 611925 601396 529646 471080 417054
11063D17054n9486m5258j1819o099m2738l4589q151k7366j9141J9797Q61j835
11051A81230j6490o048P859j8328j7127k8344o967j2986q065K8246Q764J1204
11039A22948J5832j4779m4001k316J8031K8393k4702l1757J5853N206r290k730
11027G6688L5138J3477r30J657k019k298l914O905j7767j4407l6654j1344K6953
11014G1485O746j7055K0839M2043J4160m398k2333M727O966j6260j2833J4412
11002A08499k7922O59k2436k6496N012J8646K8082M306m345j0400k0856Q042J6362
10989G7153L908L6805K7588m88O973P422k773j4211j4234L617p080K352j763l2377
10975I2892n304j1160j2034O937K8890n030J1910P623k7107J7420R256l1982k0240
$$ plain form
11063 417054 357568 312310 300491 294392 251654 217065 208914 181548 162407 182204 183065 181230
11051 181230 164740 158692 166551 148223 131096 102752 95785 82799 74734 102980 111744 122948
11039 122948 138780 124001 80000 77684 95715 124108 99406 67649 83502 88708 79418 76688
11027 76688 111826 125303 124373 126030 124011 121713 117799 124704 106937 92530 55876 44532 71485
11014 71485 78231 61176 82015 124058 138218 133820 111487 116214 123180 106920 94087 108499
11002 108499 80577 81236 58800 32304 37316 55962 84044 88350 84005 73605 52749 60791 77153
10989 77153 81061 117866 145454 144966 151939 159361 156588 142377 128143 131760 124680 127032 125269 92892
10975 92892 87588 76428 64394 71331 100221 95191 107101 114724 87617 105037 114293 82311 62071
10962F2071q467M033K2440Q229o494J0866r892K865J0758L12O249M673p28K921
10948A09836K3117L4736L1830K9969q866k1827j044R137J5159j4989J6716k816
10936B20958m8143N424J7751J9386J5484j2907l91j4633l3517J4959j3416k1155
10924A49800J722J0519K394J9753J5429J0497N309j1749J2518M8055R734n490
10912B68491l6916m636K4294m37j8656o665K7232R872J2153K454l3730j9424Q753
10899B32785K8893r481p036J3471j0297J8107M03j8003J060L954J2767O936J3933
10886B87492O307J4069K9087L65p729J8462m6831j1023Q318k8347O919K1391K0633
10873C19113P158J3155L7172L0208R038r605k2215K4665R549o934l2572q318J10
$$ plain form
10962 62071 53604 57637 80077 88306 81812 92678 82786 85651 96409 96721 102970 107643 106915 109836
10948 109836 132953 167689 199519 229488 220622 198795 197751 206888 222047 207058 223774 220958
10936 220958 172815 178239 195990 215376 230860 217953 217562 202929 169412 184371 170955 149800
10924 149800 151522 162041 164435 184188 199617 210114 215423 203674 216192 264247 273981 268491
10912 268491 231575 226939 251233 250796 232140 225475 252707 262579 274732 277186 243456 224032 232785
10899 232785 261678 252197 245161 258632 248335 266442 266845 248842 249902 253856 266623 273559 287492
10886 287492 293799 307868 336955 337320 329591 348053 301222 290199 298517 270170 277089 298480 319113
10873 319113 326271 339426 376598 406806 415844 406239 384024 408689 418238 411304 378732 370414 370524
10860C70524K1654k3478K2443r091j7013J4872J6739J651l5577l1969j2150j0576
10848C08029k47l2893j0226O10J963R964R239j477K6371K405j0547J7050M061
10835C24302L983j765J6838j0137j8230J0560J2104L5559K9060j410k540n480
10823C92844K2215L2100K4447K1604J968K3374K1181K1573K3843L2656K7162Q657
10811F53624J0362K2525R739k479J17J6872M494j8083K5376K2587K019Q594r306
10798G46441J330L2373M94J8070J8969j1587J1385R794K0672M415r318j9534J7007
10785H40511L2145J6053l691O01p632J1777Q917J581k0122l941n839l7981n5534
10772G76845m5105l205l622J2141J9210Q629j5302R375K1115O506k0540J6605
$$ plain form
10860 370524 392178 368700 391143 382052 365039 379911 396650 398301 362724 330755 318605 308029
10848 308029 307782 274889 264663 265273 267236 277200 286439 284962 311333 313738 303191 320241 324302
10835 324302 328285 326520 343358 333221 314991 325551 337655 373214 402274 400864 398324 392844
10823 392844 415059 447159 471606 493210 495178 518552 539733 561306 585149 617805 644967 653624
10811 653624 663986 686511 696250 693771 693888 710760 715254 697171 722547 745134 747153 755747 746441
10798 746441 747771 780144 780638 798708 817677 806090 817475 827269 847941 852356 843038 823504 840511
10785 840511 872656 888709 885018 885619 877987 889764 898681 900262 880140 876199 870360 832379 776845
10772 776845 731740 728535 724913 737054 756264 764893 749591 758966 780081 786587 766047 782652
10760G82652L4670M3096M4802K9912O8562O6165K5944N7940P7806P7080O5642
10749A374271L6065L5075L0882L1367L568j8943m167l6347k216j1134k2192K1529
10737A437758J5275j0422l3809j4294o901K7365J7920K1280J3714l082R400K2903
10725A497107L5835L6544M1767M0529K4839N2423P0180J04462R5253P0577J14774
10714B184290J31295J50384J42981J90494K35269K70143L07078L61688M09894
10705D383516N14631O50531P76666Q87326J016212J121561J361149J653301K113250
10696A4478143K837413L910020N502132P561503R913489J2226389J3644468J3321532
10688H3395089J0743583O062587M31675m349918p067578p564840o607081n136833
$$ plain form
10760 782652 817322 860418 905220 935132 1003694 1069859 1095803 1153743 1231549 1308629 1374271
10749 1374271 1410336 1445411 1476293 1507660 1511228 1492285 1488118 1451771 1449555 1438421 1416229 1437758
10737 1437758 1453033 1442611 1408802 1394508 1387607 1414972 1432892 1454172 1467886 1464804 1474204 1497107
10725 1497107 1532942 1569486 1611253 1651782 1676621 1729044 1799224 1903686 1998939 2069516 2184290
10714 2184290 2315585 2465969 2608950 2799444 3034713 3304856 3611934 3973622 4383516
10705 4383516 4898147 5548678 6325344 7212670 8228882 9350443 10711592 12364893 14478143
10696 14478143 17315556 21225576 26727708 34289211 44202700 56429089 70073557 83395089
10688 83395089 94138672 100201259 100632934 96283016 89215438 81650598 75043517 69906684
10680F9906684l865957k965305k423191k120264j951447j803426j654991j473507
10672E1648596j243182r79541p39862m73063j41982J97097O38913J072099J473405
10663E1452480J833927K098757K410285K728213L173291L759407M329585M846775
10655G6632720N156967N182167M683402L339832Q82099k729430o938126j0464636
10647G5744995j2417541j2365672j0824885q651580o501928m730555l365374k413481
10639A4473979j831437j462443j208924j137988j038225r28957q22819p16681
10631E326505n79889m74309l83107l35541l14488k40138k08917k00541j20753
10622B468822j12137j04702j04474o5733o6617j14175r6267l0964k8045k3696
$$ plain form
10680 69906684 66040727 63075422 60652231 58531967 56580520 54777094 53122103 51648596
10672 51648596 50405414 49425873 48686011 48212948 48070966 48268063 48906976 49979075 51452480
10663 51452480 53286407 55385164 57795449 60523662 63696953 67456360 71785945 76632720
10655 76632720 81789687 86971854 91655256 94995088 95877187 93147757 86209631 75744995
10647 75744995 63327454 50961782 40136897 31485317 24983389 20252834 16887460 14473979
10639 14473979 12642542 11180099 9971175 8833187 7794962 6866005 6043186 5326505
10631 5326505 4746616 4272307 3889200 3553659 3239171 2999033 2790116 2589575 2468822
10622 2468822 2356685 2251983 2147509 2081776 2015159 1900984 1804717 1773753 1745708 1722012
10612A722012k4630k4277k2385l9966k952J7120Q811k3229l621O54k2611l831
10600A581095M490J5394J5249L3679J5887j4290K348K6180j7987j6936k9431o2408
10588A553270p9729r2558o3464n8607n8300r1891o0112m2879p1165k5192j9850
10577H89523l8807l6904j4287o933m612m1866l1901M984q94k1838r096K8911M3592
10564G59872J3294K8139K9290J5337k1374k9228k8054l6539J033l2913k116o44
10552F96097m0390n1839J4631L1927O139k3833n1982k0724j9594j3627l4354l3629
10540D58822J0112N054q099J213n531J0045j8355m0450j5101R798L3792J5458
10528D56758J1085k810M417l8136k8013k3194j3070l660J6381j0259m6530j5183
$$ plain form
10612 1722012 1697382 1673105 1650720 1610754 1607802 1624922 1633733 1610504 1606883 1607537 1584926 1581095
10600 1581095 1585585 1600979 1616228 1649907 1665794 1651504 1653852 1680032 1662045 1645109 1615678 1553270
10588 1553270 1473541 1380983 1317519 1258912 1200612 1108721 1048609 1005730 934565 909373 889523
10577 889523 850716 813812 799525 792592 787980 746114 714213 719197 718303 696465 687369 716280 759872
10564 759872 773166 801305 830595 845932 824558 795330 767276 730737 731770 698857 696741 696097
10552 696097 655707 603868 618499 650426 656565 632732 580750 560026 540432 526805 492451 458822
10540 458822 468934 473988 465889 467102 461571 471616 453261 412811 397710 407508 441300 456758
10528 456758 467843 465033 469450 431314 403301 380107 367037 363377 379758 369499 322969 307786
10516C07786k4679J6788L6615M464k4956k4540r546o57K6416K101n28j5150K7957
10503C22071L6906M7297L9913j3420K936k5728n2796k4800j2328m3233n0595k269
10491B23954K3698L404P564j6998k9355j881N792q194R176K1544k4744j0350l8193
10478A65417m0891j0999J6493J3016k467Q309k2666j6609K4083J4600K2747K0628
10466A91661k0405J643K1935J6669J5593K7690L8852N873Kk5821l4922l0498j97
10453B08075j3425l7489k2862P414l6809k2929J7114J1658j066p477j3737J67
10441H8634M44K6237K6158j0426r159L6784K4100R681J1037L5907L9782L0930
10429C10109P6722J37886J95147K09554Q5287j15803k14210j84605j18802q4593
$$ plain form
10516 307786 283107 299895 336510 340974 316018 291478 281932 281275 307691 309792 309264 294114 322071
10503 322071 358977 406274 446187 432767 435703 409975 357179 332379 320051 276818 226223 223954
10491 223954 247652 251056 258620 241622 212267 210386 216178 207984 217160 238704 213960 203610 165417
10478 165417 124526 113527 130020 143036 140569 148878 126212 109603 133686 148286 171033 191661
10466 191661 171256 172899 194834 211503 227096 254786 293638 299511 299513 273692 238770 208272 208075
10453 208075 194650 157161 134299 141713 104904 81975 99089 110747 109681 102204 88467 88634
10441 88634 89078 115315 141473 131047 121888 158672 182772 192453 203490 239397 279179 310109
10429 310109 386831 524717 719864 929418 1014705 898902 684692 500087 381285 296692
10419B96692n5447n9982l2615m10r461K2669J0872l137k9290o616K1248k1951
10407A32572j2966J0194j0589O554K5119l8321p934J2585J3468M247j2099j4916
10395A07914N761k907j8512q464j7595P301N553K3788J3295q966p759l292Q348
10382A04465l6275N779K9132q787J3828J8257p546R741K1350o269l2682j7642
10370I3351J9495L7278n397k3213k3688k4546j0070n48K1289K4061O734j854j2673
10357A00219j9177M3O606j5752r550R377j5556m305J5626L2043N3551J0873j5548
10344A48450k5042j5321K5043O156L978M664j6151j3676m974l710J4743p550l6718
10331G9892N323O506k912K869J1584l141J0307P230j0066j1194j882l403K4950
$$ plain form
10419 296692 241245 181263 148648 148238 138777 161446 172318 169181 139891 133275 154523 132572
10407 132572 119606 129800 119211 125765 150884 112563 104629 117214 130682 134929 122830 107914
10395 107914 113675 110768 92256 83792 66197 73498 79051 102839 116134 107168 99409 96117 104465
10382 104465 68190 73969 103101 94314 108142 126399 118853 128594 149944 143675 110993 93351
10370 93351 112846 150124 144727 121514 97826 73280 63210 62662 83951 108012 114746 112892 100219
10357 100219 81042 81085 87691 71939 62389 71766 56210 51905 67531 99574 153125 163998 148450
10344 148450 123408 108087 133130 139286 143264 147928 131777 118101 113127 109417 124160 116610 79892
10331 79892 85215 91721 88809 91678 103262 100121 110428 117658 107592 96398 94516 91113 116063
10318A16063L3493o514j6337K3940k254k0860K6793J6963j1162o227L826n478
10306A52246l4301k8143L290Q44L0673M404j9375R758J943j6798k8692P345L0014
10293A13208M8654M290j578j8591j6609j7214k4996J586K3138j1366j9689K6321
10281A07154K1293K428k1020J6534J850J5410J8975l417L002j840J9481M3868
10269B23718K9197O5438Q7035O3610O3419P0530L4292K306k6502k5059m9858m9319
10257D88807m1802n0872k4726J3485k8983p175J9317o183k5367n737L14K740M599
10244C38417J2127K6839K1795k1027P549k3705k1109K7346J3695P504R722M8071
10232D47224L7910J5413L5672N1706L5809O566N779M194O92m8675r7618p0910
$$ plain form
10318 116063 149556 143042 126705 150645 148391 127531 154324 171287 160125 153898 157724 152246
10306 152246 117945 89802 93092 93936 124609 129013 109638 119396 121339 104541 75849 83194 113208
10293 113208 161862 166152 164574 145983 129374 112160 87164 88750 111888 100522 80833 107154
10281 107154 128447 130875 109855 126389 128239 143649 162624 159207 162209 160369 179850 223718
10269 223718 252915 318353 405388 468998 532417 602947 637239 639545 613043 587984 538126 488807
10257 488807 447005 396133 371407 384892 355909 348734 368051 361868 336501 330764 331078 333818 338417
10244 338417 350544 377383 399178 378151 385700 361995 340886 368232 381927 389431 399153 447224
10232 447224 485134 500547 536219 587925 623734 630300 636079 640273 640965 592290 494672 423762
10220D23762k1613k4600r638q125j4872k2313j3021k4934K658K4929J4396O602
10208C33231j5261J921L4458M6065P2813J35839J81053J87629J51171J42953J33684
10197A405556J60426L4848j28969j73782j26392j14760j79440j91231j43991j22048
10187D20217o1439r753m0335o1141m8176j8400J6048J6223J7949L289l9030k9373
10175A66079P69P396l1261j1044M2178K9980J762N615j54J7958m517M708j7564
10162B11905P391N318n103J6245K5453j77l203K6759J3566J1587K7292L141J6314
10149C56488M2832L161j3773j1966j2384j5393j4499q474k1328J094q763l029
10137B93966J8275O040l4206J39R074j8108o759j1031k2719j4877o862o894J1337
$$ plain form
10220 423762 402149 377549 367911 359786 344914 322601 309580 284646 287304 312233 326629 333231
10208 333231 317970 319891 354349 400414 473227 609066 790119 977748 1128919 1271872 1405556
10197 1405556 1565982 1600830 1471861 1298079 1171687 1056927 877487 686256 542265 420217
10187 420217 358778 349025 308690 247549 199373 180973 197021 213244 231193 234482 195452 166079
10175 166079 166848 174244 142983 131939 174117 204097 205859 211474 211320 229278 224761 229469 211905
10162 211905 219296 224614 219511 235756 261209 261032 257829 284588 298154 309741 337033 340174 356488
10149 356488 399320 402481 388708 376742 364358 348965 334466 325992 304664 305758 296995 293966
10137 293966 312241 318281 284075 284214 293288 275180 268421 257390 234671 219794 212932 206038 217375
10124B17375k5656J4537K5007J2668j5890q397l6291J5297l315m337k4043k7508
10112A39447P95J2074L2666P141k7698O201l899j0274j2804J2464K0867k3406
10100A53574q487K0560M927j135J354J0055J2532J490j798J996j7074Q939K5282
10087B12215j100J2921J1166K3786j3934M704J8522J2142j3566k7460J6929L3503
10075B89828k062l155n67k2052m4067K7288K3311o936K493N353j0579o8j2377
10062B46410l0266k068K433J2921J523K1142m1383k2633j4590j2573o026Q448
10050A63338j0120J6987L0495J6816p155l6127m5643N967K2968L926M611p250
10038A58813l465l1283J5727J6785j9610m985Q718o273p259r600n840k729K76
$$ plain form
10124 217375 191719 206256 231263 243931 228041 219644 183353 198650 195335 190998 166955 139447
10112 139447 140242 152316 184982 192123 164425 170626 166727 156453 143649 156113 176980 153574
10100 153574 145087 165647 170574 169439 170793 180848 193380 194870 193072 195068 177994 186933 212215
10087 212215 211115 224036 235202 258988 245054 249758 268280 280422 266856 239396 256325 289828
10075 289828 287766 284611 284044 261992 217925 245213 268524 261588 264081 269434 258855 258787 246410
10062 246410 216144 214076 216509 229430 230953 252095 210712 188079 173489 160916 154890 163338
10050 163338 153218 170205 200700 217516 210361 174234 128591 134558 157526 161452 166063 158813
10038 158813 155348 124065 139792 156577 136967 131982 140700 134427 127168 117568 111728 108999 109275
10025A09275J0782L5396l981N543j0558k4021J2252K7592K7408k1590r449P588
10013A66237k7074k297L8063M2880n564k5592J7050N057j6303m23R265L960j8673
10000A86586n155P148J1330L2985R772o502q701P313K205j5022l1154j1678J7653
9987A96780J0136J358j7653j6641m021J504j5695k2773n758L1267R928l698l727
9974A61007J5560J8928k948m351J0858M960N590Q118j983M402K1234l106m8O107
9960B44328r8j5719q61j4693n076J4436p257K464M9805M5957m315l6477j3995
9947B58499N722J589j8311L4919l143j7849q052k1959k607k7831J4583L1457N998
9934B53015j0504k0440J0289K79J6276K6341L163J3522J4550l409J1099K343L679
$$ plain form
10025 109275 120057 155453 151472 157015 146457 122436 134688 162280 189688 168098 158649 166237
10013 166237 139163 136866 174929 217809 212245 186653 203703 208760 192457 192034 201299 205259 186586
10000 186586 181431 188579 199909 232894 242666 236164 227463 234776 236981 221959 190805 179127 196780
9987 196780 206916 208274 190621 173980 169959 171463 155768 132995 127237 158504 168432 164734 161007
9974 161007 176567 195495 192547 188196 199054 204014 209604 217722 215739 220141 241375 238269 238221 244328
9960 244328 244230 228511 227650 212957 207881 222317 215060 217524 267329 313286 308971 272494 258499
9947 258499 264221 265810 247499 282418 279275 261426 253374 231415 228808 200977 215560 247017 253015
9934 253015 242511 222071 232360 232639 248915 275256 278419 291941 306491 303082 314181 316524 320203
9921C20203J0643J7751n378N270L7879j8473j1146j3111r286J3910o913m651N705
9908C42403J0564L0304j977J6753j2131r508J5827J4390N879L9078K5082k096
9896D74568J6058p969Q542J8772l667j3160L3160J0O229K3833J3858J7820K4969
9883F13023J5720P1227M0271k172J4839J1413j0963J3422K3164L8103K5681M7135
9871I00863N7742N3515K7529K7796J5787K6613L3208j9002j4046N5735O7784O3465
9859A296989P7222P0475O3806N8145R7653O1626N6777Q2442Q7509R0154P5259
9848B118057Q1497J18785J00885J03841J35794J18270J15336J21982J67134K13856
9838C395437L12583L30277L02333L44661M27697M70924N49039O33354P80504Q55198
$$ plain form
9921 320203 330846 348597 343219 348489 386368 367895 356749 343638 334352 348262 341349 336698 342403
9908 342403 352967 383271 381294 398047 385916 376408 392235 406625 412504 451582 476664 474568
9896 474568 490626 482657 491199 509971 506304 493144 526304 526314 532543 556376 570234 588054 613023
9883 613023 628743 699970 740241 738069 752908 764321 753358 766780 789944 828047 853728 900863
9871 900863 958605 1012120 1039649 1067445 1083232 1109845 1143053 1124051 1110005 1165740 1233524 1296989
9859 1296989 1374211 1444686 1508492 1566637 1664290 1725916 1782693 1865135 1952644 2042798 2118057
9848 2118057 2199554 2318339 2419224 2523065 2658859 2777129 2892465 3014447 3181581 3395437
9838 3395437 3708020 4038297 4340630 4685291 5112988 5583912 6132951 6766305 7546809 8402007
9828H402007R87095J159425J255528J375945J471076J545374J590412J438349
9820A9225211J132589P62269M08153J06669j17535l19644m32866m50340m13898
9811A9900608k96967j31589j55K4066l8409j12381j67890l46040n13676o12202
9801A7705365n80582l88318j50370O4634Q2772j22330m39640p41010q99719r19133
9791A3611669p84112o46460m90049k67960j25134Q413P4044O0299J5049m4967
9781A1410792k6860N031j2077Q307Q8458J53706J71264J62513K63720L41034M11244
9770A2977132N05607O04024O92592P44070P96337Q56492R78921J128008J290994
9761B0574177J510941J750509J985673K119555K101211J960166J728956J468162
$$ plain form
9828 8402007 9389102 10548527 11804055 13180000 14651076 16196450 17786862 19225211
9820 19225211 20357800 21120069 21528222 21634891 21517356 21197712 20764846 20314506 19900608
9811 19900608 19603641 19472052 19471897 19495963 19457554 19345173 19177283 18831243 18317567 17705365
9801 17705365 17124783 16736465 16586095 16650729 16733501 16611171 16171531 15430521 14530802 13611669
9791 13611669 12827557 12181097 11691048 11423088 11297954 11306367 11380411 11440710 11455759 11410792
9781 11410792 11383932 11388963 11376886 11385193 11473651 11627357 11798621 11961134 12224854 12565888 12977132
9770 12977132 13482739 14086763 14779355 15523425 16319762 17176254 18155175 19283183 20574177
9761 20574177 22085118 23835627 25821300 27940855 30042066 32002232 33731188 35199350
9753C5199350J202229J049704R72824R80292J023878R55219P26801M90592K05782
9744D2806671j68816n60020q05648q50598q16415q21832p29009n43750l30201
9735C7180382k89136m55185n79552o75419q60084j106651j308357j429051j554600
9726B8922347j542478j380417j105682q69823p57614p71816q26815q26637q81393
9717A9959672r80048j061423r83843p57995n52031l38414j37725j7686o471k3936
9707A5100100n2640j55824k58175l09533l14234l08243k30251q4089j519Q4080
9697A3469672J57701J93722K11224K21524K12802K74746L55503M33180N67366
9688A6097440O93556Q40595R36382R49604R45834P84250M89734K21859O0324L9274
$$ plain form
9753 35199350 36401579 37451283 38424107 39404399 40428277 41383496 42110297 42600889 42806671
9744 42806671 42637855 42077835 41272187 40421589 39605174 38783342 38054333 37510583 37180382
9735 37180382 36891246 36436061 35856509 35181090 34321006 33214355 31905998 30476947 28922347
9726 28922347 27379869 25999452 24893770 24023947 23266333 22494517 21667702 20841065 19959672
9717 19959672 18979624 17918201 16934358 16176363 15624332 15285918 15148193 15130507 15124036 15100100
9707 15100100 15047460 14891636 14633461 14323928 14009694 13701451 13471200 13387111 13385592 13469672
9697 13469672 13627373 13821095 14032319 14253843 14466645 14741391 15096894 15530074 16097440
9688 16097440 16790996 17631591 18567973 19517577 20463411 21247661 21737395 21959254 22019578 22058852
9678B2058852L5354K0160o9877j44313k16558k03415j24232r1893j50136k52713
9668B0861229k90960j82973j03225l2595l2983m8231j76723m15023o98972r29340
9658A7950204j125311j311478j390350j351295j281168j180849j022945q20935
9650H465873p17871o20804n32915m64661m77370m74138m03463k91929k42457k01090
9640D039175j49767j08731j25457j41694j26224j15482j43053j06420o0802r6796
9630B864749q8021m6076n7276p3275p6844q6437j08291j03587j00385r4985j11717
9619A917855q7507o7142q294K072j3630j947J835m654l4192n7906o4543q3130
9607A498817o3520n8175q1152p8457p1559o1642o2322o2433l8387o129J039k7979
$$ plain form
9678 22058852 22094206 22114366 22044489 21900176 21683618 21480203 21355971 21264078 21113942 20861229
9668 20861229 20570269 20387296 20284071 20251476 20218493 20170262 19993539 19578516 18879544 17950204
9658 17950204 16824893 15513415 14123065 12771770 11490602 10309753 9286808 8465873
9650 8465873 7748002 7127198 6594283 6129622 5652252 5178114 4774651 4482722 4240265 4039175
9640 4039175 3889408 3780677 3655220 3513526 3387302 3271820 3128767 3022347 2961545 2864749
9630 2864749 2776728 2730652 2673376 2600101 2523257 2436820 2328529 2224942 2124557 2029572 1917855
9619 1917855 1830348 1763206 1754912 1756984 1743354 1741407 1743242 1738588 1704396 1646490 1581947 1498817
9607 1498817 1435297 1377122 1295970 1217513 1145954 1084312 1021990 959557 921170 915041 916080 888101
9595H88101m1531j0707k417Q669K2704K1852J0634l3888j1750M108M101l1194
9583H28682l2006m2515j4771m4309n5085l4479l138K6831q945m6458k9209k171
9571E42427k0179n2726k4936J5129n498R929J796j4413r272j0900j7506m3826
9559C70025m8249P049K7196K5275K4760R56k7754n761J2015K7728Q325k8941N17
9546C93141J94j796r920K569K730j1797j0765m953L8207j4580j3757k3285k2792
9533C23196K1979Q749k5651N894L869Q082K2891L570l490K5276o520j2038j7964
9520C57843j5331m034O57Q267J1610k0354k254J8491j0888l8139O637J0602M034
9507C27141j988J3347r148p563K1843M7718J3436j7877m5076l2186j3512L942
$$ plain form
9595 888101 846570 835863 833446 842115 864819 886671 897305 863417 851667 855775 859876 828682
9583 828682 796676 754161 739390 695081 639996 605517 602379 629210 620265 573807 544598 542427
9571 542427 522248 469522 444586 459715 454217 464146 465942 451529 442257 431357 413851 370025
9559 370025 321776 328825 356021 381296 406056 407012 379258 373497 385512 413240 421565 392624 393141
9546 393141 393335 391539 381619 384188 386918 375121 364356 359403 397610 383030 369273 345988 323196
9533 323196 345175 353924 328273 334167 338036 346118 369009 372579 369089 394365 387845 375807 357843
9520 357843 342512 338478 339135 347402 359012 338658 336404 354895 344007 305868 312505 323107 327141
9507 327141 325153 338500 329352 321789 343632 391350 404786 386909 341833 309647 296135 300077
9495C00077K045q341J6862P367j915j077q14J5890J2930k1008J2961K0507j2230
9482C43254J9176J5469l9799j5464J9489L3486L051j6014l727J0516o16r008j0671
9469C49142j9560j1540M9401L7022M289J3556j5949k3442J2869O0611K4245L0632
9457E11276K8877M3213J865K2721M4809K2451j1208o09M0603K3734k3052j4689
9445F89991K683J39K8149J1166J8182K5058K7743L3169J5339K5785p109m65r746
9432H60084o149J9871K4629M3220K2120L0024P1140R2886O0220M9910M3360O1929
9420A373244J04057J03539J08459J04976R7825P3080L2232K7683M8207P007L069
9409B083378p513k4204j8796m1556j6363l0169n843L489L9630M3801O0603L8319
$$ plain form
9495 300077 302122 293781 310643 318010 316095 315018 314204 330094 343024 322016 334977 355484 343254
9482 343254 362430 377899 338100 322636 342125 375611 378662 362648 358921 369437 368821 359813 349142
9469 349142 329582 318042 367443 404465 408754 422310 406361 382919 395788 456399 480644 511276
9457 511276 540153 583366 585231 607952 652761 675212 664004 663395 703998 727732 704680 689991
9445 689991 692674 692813 720962 732128 750310 775368 803111 836280 851619 877404 870295 869830 860084
9432 860084 853935 873806 898435 941655 963775 993799 1064939 1157825 1218045 1267955 1311315 1373244
9420 1373244 1477301 1580840 1689299 1794275 1892100 1965180 1997412 2025095 2073302 2080309 2083378
9409 2083378 2075865 2051661 2032865 1991309 1974946 1944777 1938934 1942423 1982053 2025854 2086457 2124776
9397B124776K5894L9708J8670N6720N9954L9708J00636J21509J34132J03974N8809
9386B884490L6093K8953q877m6398k1976n251M0967M5922Q2374J45496K05688
9375C387481J81389J08351R0670J24122J01755J18397J31914J32449J06348J39758
9365D622634J95504K61370L36275M64547N39046N65327N60545N64425N95361O56374
9355I361408O91035P32882P72698Q02632Q05874P78474P55319O45269N94469N85732
9345A6525792O49595P47156Q32587Q65484Q07213P02371N91242N06935N00159
9336B2728534N17798N67982N95272N97940N77724O12847O68403P70860R78251
9327B8615611J253858J532006J776720J806861J575607J152284O44346O4631n21906
$$ plain form
9397 2124776 2150670 2190378 2209048 2265768 2325722 2365430 2466066 2587575 2721707 2825681 2884490
9386 2884490 2920583 2949536 2940659 2894261 2872285 2867034 2908001 2953923 3036297 3181793 3387481
9375 3387481 3568870 3677221 3767891 3892013 3993768 4112165 4244079 4376528 4482876 4622634
9365 4622634 4818138 5079508 5415783 5880330 6419376 6984703 7545248 8109673 8705034 9361408
9355 9361408 10052443 10785325 11558023 12360655 13166529 13945003 14700322 15345591 15940060 16525792
9345 16525792 17175387 17922543 18755130 19620614 20427827 21130198 21721440 22228375 22728534
9336 22728534 23246332 23814314 24409586 25007526 25585250 26198097 26866500 27637360 28615611
9327 28615611 29869469 31401475 33178195 34985056 36560663 37712947 38357293 38421924 37900018
9318C7900018j055761j469582j696623j661038j371300j015917o30469l31948
9310B8667380j19301O4514K50386L39640K84772J76555M3814k2594j53828l37411
9300B9193927n49443p48550q18227p76027o42302l59204J5549M11377P27751Q51135
9290B7305986P45059N11808K01037L655m9445p0476n5523l3654K212J27298K00375
9279B8888332K08337J88146J68420J45768K26136L51744N03134N77717N97218
9270C1854952N84086O68327Q64329J102559J204661J063212O23514O6089m68178
9261C7563551q45650j011416j066545j053480j034170r17330o85911n50552n31696
9252B9866801n85805o84365p58027p66150p31596p46486q50971j054008j231050
$$ plain form
9318 37900018 36844257 35374675 33678052 32017014 30645714 29629797 28999328 28667380
9310 28667380 28548079 28612593 28862979 29202619 29487391 29663946 29707760 29685166 29531338 29193927
9300 29193927 28644484 27895934 27077707 26301680 25659378 25300174 25315723 25727100 26454851 27305986
9290 27305986 28051045 28562853 28763890 28767545 28718100 28647624 28592101 28558447 28560659 28687957 28888332
9279 28888332 29096669 29284815 29453235 29599003 29825139 30176883 30680017 31257734 31854952
9270 31854952 32439038 33107365 33971694 35074253 36278914 37342126 37965640 38031729 37563551
9261 37563551 36717901 35706485 34639940 33586460 32552290 31634960 30949049 30398497 29866801
9252 29866801 29280996 28596631 27838604 27072454 26340858 25594372 24743401 23689393 22458343
9243B2458343j290138j201258r64874o14830l33305j42445k2483o2317k24142
9234A7602551l49390m87683o29169o91874p35547p73311q12742p96322q30095
9225A1496418q20342p68836p10589o04603m95126m34667l47139l29652l27339
9216F658125k96722k94925k66839k11456j71565j78434j28582j15140j00269j15801
9206D778392q4102q4055o9128o7472o0708l1032l9536k351K781k4116l4421k2176
9194D262076j3200m8297p5995j27622j34546j30009j50409j35315j45988r7786
9184C202909o3459l2986m7773m5861o2208p0787o9233j09995j51712j63990j66340
9173B218565j64181j19321q6078n8895o5957n8277j5678p065j0053J17k0719p952
$$ plain form
9243 22458343 21168205 19966947 19002073 18387243 18053938 17911493 17889010 17826693 17602551
9234 17602551 17253161 16765478 16136309 15444435 14708888 13935577 13122835 12326513 11496418
9225 11496418 10676076 9907240 9196651 8592048 8096922 7662255 7315116 6985464 6658125
9216 6658125 6361403 6066478 5799639 5588183 5416618 5238184 5109602 4994462 4894193 4778392
9206 4778392 4694290 4610235 4541107 4473635 4412927 4381895 4342359 4340008 4342789 4318673 4284252 4262076
9194 4262076 4248876 4200579 4124584 3996962 3862416 3732407 3581998 3446683 3300695 3202909
9184 3202909 3139450 3106464 3058691 3012830 2950622 2879835 2810602 2700607 2548895 2384905 2218565
9173 2218565 2054384 1935063 1848985 1790090 1724133 1665856 1650178 1643113 1633060 1633177 1612458 1604506
9161A604506l0738k0891k4498m5043m3849l0408q1663p7610m3003q5090l6376
9150A085337l4151l8447j2602m1189n5464m6668k2475j5004m4457m7904k4108
9139G02868O504j3918k8705r170J0557j3585k4876k999r158j5727j4483J2628
9127E99936L1437l210R41J7330l2049l4443k4040K0720J6308j147r068k9151k8997
9114E24567k5920P204K40j3641K1179J8094k0002j8424K8408k6582j4841o52J047
9101D80677J7515R209K1192p843n0533o033M0525j723j8342J4380r523l2211J0164
9088D67454K2572j1540l363j4520r677q29K0886L681j650k1693J1501m476O738
9075D65084P557p412n824j7341j6670j4455l521K0611M3208K699j2865q360k4377
$$ plain form
9161 1604506 1573768 1552877 1528379 1483336 1439487 1409079 1327416 1249806 1206803 1121713 1085337
9150 1085337 1051186 1012739 1000137 958948 903484 856816 834341 819337 774880 726976 702868
9139 702868 709372 695454 666749 657579 668136 654551 629675 626676 617518 601791 587308 599936
9127 599936 631373 628163 629104 646434 614385 579942 555902 576622 592930 591783 582715 553564 524567
9114 524567 498647 505851 506091 492450 513629 531723 511721 493297 521705 495123 480282 479630 480677
9101 480677 498192 507401 528593 520750 470217 464184 504709 502986 484644 499024 489501 457290 467454
9088 467454 490026 478486 475123 460603 450926 450097 470983 474664 473014 451321 462822 458346 465084
9075 465084 472641 465229 459405 442064 425394 410939 407418 428029 471237 473936 461071 452711 428334
9062D28334N466M97j5393j788K5292j084l547j1228N172j2538L7136K1756l5035
9049D43040k3372J175r926J1301N1435J0882R114k1979J9619L1319J4925J8693
9037E56226l606n844n242j4698O206K0752l390O539m357k2368r226j0488n738
9024E04766o157J1053P232k5184j9557P889J3760L2766M792k936J1606j5871J1749
9011E35908M747k443J2022N496L1106O441j5803q478k292J0652K365m629r069
8998E66023O131R138j0574k1444p944K7056K5821K0589k5617j7076p0l9119q182
8985E24732P252K3670N861k0938j4276j0212J2964K3198J2092j8222p978o273
8973E31870K1750J772N821J687M4816J4291j0726J2539J2805R644K0909j1487
$$ plain form
9062 428334 433800 434297 418904 417116 442408 441324 437777 426549 431721 419183 456319 478075 443040
9049 443040 419668 420843 410917 422218 473653 484535 493649 471670 491289 522608 537533 556226
9037 556226 552620 546776 541534 526836 533042 553794 550404 556943 552586 530218 520992 510504 504766
9024 504766 498609 509662 516894 491710 472153 480042 493802 526568 531360 528424 540030 524159 535908
9011 535908 540655 538212 550234 555730 586836 593277 577474 568996 566704 577356 579721 575092 566023
8998 566023 572154 581292 570718 549274 541330 568386 594207 614796 589179 572103 572033 532914 524732
8985 524732 531984 555654 561515 540577 526301 516089 529053 552251 564343 546121 538143 531870
8973 531870 553620 555392 561213 562900 607716 622007 611281 623820 636625 646269 667178 655691
8961F55691O263P083J653Q388q904k91K5488N0068K2345Q241K394K7663J4556
8948H20638K3582J2160j4876j5382k5621o637j219O530L2636j3024m9443N254
8936G74598l381R826j8209K2954O1293R159M470K3160r256l2574j6173K442j5459
8923H12850p763N534J816K156j3405K875Q423K308O384J08k5140m2912J588j91
8909G54631k1243m4701j8643J2407o512m19Q587J5426L1107q659J3363J2651j1005
8896G36990J8573O212J8966Q084K1534K1685J9920K0107J4955j4730Q5Q035L8691
8883I19107L0654M4194Q0645P7126P1390P7963J14688J19099J22953J57347K44980
8872B060146L89998O28004J013418J568745K183109K672564K161087j73463k198604
$$ plain form
8961 655691 661954 669037 670690 679078 670174 669883 695371 745439 767784 776025 778419 806082 820638
8948 820638 844220 856380 841504 826122 800501 793864 792645 799175 831811 818787 769344 774598
8936 774598 771217 781043 762834 785788 847081 856240 860710 883870 874614 842040 825867 828309 812850
8923 812850 805087 810621 812437 814593 801188 804063 812486 814794 821178 821286 796146 753234 754822 754631
8909 754631 733388 688687 670044 682451 675939 675520 684107 699533 730640 721981 735344 747995 736990
8896 736990 755563 761775 780741 788825 810359 832044 851964 872071 887026 872296 872381 880416 919107
8883 919107 949761 993955 1074600 1151726 1223116 1301079 1415767 1534866 1657819 1815166 2060146
8872 2060146 2450144 3078148 4091566 5660311 7843420 10515984 12677071 12503608 10305004
8863A0305004k701352k229634j484342q94410n73575l43107k43517j17894n5659
8854A661514l4549l5853n3956o1523n7416m6095n7282n4347l6524n0568p7283
8843A096118k7878l6853l3425j2077J2110L263r386L6175L2446J2862j0368l5542
8831A027445q404k5076k2071k4886k297j9833m6810l3174R756K4526M3043O104
8819I28323j7870j9030Q902j1658j7607k6532j3808j8217R826O676P792L417J6553
8806H56767Q795j1895j5308R485l380L0313Q017K424O019l0263j3890K8643k263
8793H73464j1661M9251K4025k4488p164L0487J4669J0335N1652J5810M4995L2960
8781A104335L6877L7505N1693M7621J23184J42284J74459J86124J79393J74160
$$ plain form
8863 10305004 7603652 5374018 3889676 2995266 2421691 2078584 1835067 1717173 1661514
8854 1661514 1626965 1591112 1537156 1475633 1418217 1372122 1314840 1260493 1223969 1173401 1096118
8843 1096118 1068240 1031387 997962 985885 997995 1001258 991872 1028047 1060493 1073355 1062987 1027445
8831 1027445 1019041 993965 971894 947008 944711 924878 878068 844894 854650 879176 922219 928323
8819 928323 910453 891423 900325 888667 871060 844528 830720 812503 822329 829005 836797 840214 856767
8806 856767 865562 853667 838359 847844 844464 874777 882794 885218 891237 860974 847084 875727 873464
8793 873464 861803 911054 935079 910591 903427 933914 948583 958918 1010570 1026380 1071375 1104335
8781 1104335 1141212 1178717 1230410 1278031 1401215 1543499 1717958 1904082 2083475 2257635
8771B257635O1804o2907j05772j16384j50038j31755p1009n2128m2961o992K1429
8760A600922O4954P3083M6787L4824N0253O0649O4957O4479K8334j1759k9978
8749B047505o9552l9704q281L220L0038R0846R7435J05511J79914J87137K25956
8738B850025K84855L19341L33660L10596K79608J37066O9j28437j67424j19642
8728D099717r8554j05440q6106q6583o2104o6157o8759J508K7864R3715J39821
8717C788922J32432J46037J43978Q9049P6013J06440J17150J26198J59779J92913
8707E078911K88967L04207L57916L84924L79123L44973K30824J05914K7566l4156
8697G469169N3153J27498K03606L03541L52781L54730L25743K42342J46127N6998
$$ plain form
8771 2257635 2319439 2256532 2150760 2034376 1884338 1752583 1681574 1629446 1586485 1579493 1600922
8760 1600922 1665876 1738959 1785746 1820570 1870823 1931472 1996429 2060908 2089242 2077483 2047505
8749 2047505 1977953 1938249 1929968 1933188 1963226 2054072 2151507 2257018 2436932 2624069 2850025
8738 2850025 3134880 3454221 3787881 4098477 4378085 4515151 4515220 4386783 4219359 4099717
8728 4099717 4001163 3895723 3809617 3723034 3660930 3594773 3526014 3527522 3555386 3649101 3788922
8717 3788922 3921354 4067391 4211369 4300418 4376431 4482871 4600021 4726219 4885998 5078911
8707 5078911 5367878 5672085 6030001 6414925 6794048 7139021 7369845 7475759 7503325 7469169
8697 7469169 7522322 7649820 7853426 8156967 8509748 8864478 9190221 9432563 9578690 9635688
8687I635688J2552K6787P0735J19662J73528K30873K74385K69497K53574K09368
8677A1276649K00546J87815J87513K26109K30391K37334K93407L50724M91372
8668A3681860O61100P95335R08742R24362P61991N26081K70917J19985R2064J94497
8658A8936934M02935O39131Q92427J222209J629513J882664J960094J791425J340574
8649C0697906Q29052L60932l3964m11764p03067p64860o53853m24033j77668N3314
8639B8771995K76214N46976R48327J403035J672030J782468J653849J176348N67738
8630C8798980K9621k43576k96459k47995k44368l85643o70731p99333p20020m47846
8620C4772630O637N21641R98687J368037J551976J644922J710125J779251J863913
$$ plain form
8687 9635688 9648240 9675027 9745762 9865424 10038952 10269825 10544210 10813707 11067281 11276649
8677 11276649 11477195 11665010 11852523 12078632 12309023 12546357 12839764 13190488 13681860
8668 13681860 14342960 15138295 16047037 16971399 17733390 18259471 18530388 18650373 18742437 18936934
8658 18936934 19339869 19979000 20871427 22093636 23723149 25605813 27565907 29357332 30697906
8649 30697906 31526958 31887890 31853926 31442162 30739095 29974235 29320382 28896349 28718681 28771995
8639 28771995 29048209 29595185 30543512 31946547 33618577 35401045 37054894 38231242 38798980
8630 38798980 38828601 38585025 38288566 38040571 37796203 37410560 36739829 35940496 35220476 34772630
8620 34772630 34779267 35300908 36299595 37667632 39219608 40864530 42574655 44353906 46217819
8611D6217819J921812J844699J588953J244288Q11573M42263L43611N25687Q54568
8602E5795273R95147P86238M23200J39412K5723J21460M20130Q13776J052875
8593F0573234J026503R15410P45176P12657P13579O27587N42724M61208L15274
8584F6633352L2553m62145j081103j741737k253159k618295k885218l004562l038260
8575D9581426l085068k999595k736223k378136k089011j922794j828447j748837
8567C0793315j752462j736690j638101j490466j305731j048641p69507n51857
8559B0499860m53804m90770n58141o53173o49790m86043k86725r8506N0480J31320
8549A7004708J82351K73029L65093M38722M81441M96802N12523N14415N84439
$$ plain form
8611 46217819 48139631 49984330 51573283 52817571 53629144 54071407 54415018 54940705 55795273
8602 55795273 56790420 57576658 57999858 58139270 58164993 58286453 58706583 59520359 60573234
8593 60573234 61599737 62515147 63260323 63972980 64686559 65314146 65856870 66318078 66633352
8584 66633352 66665905 66203760 65122657 63380920 61127761 58509466 55624248 52619686 49581426
8575 49581426 46496358 43496763 40760540 38382404 36293393 34370599 32542152 30793315
8567 30793315 29040853 27304163 25666062 24175596 22869865 21821224 21051717 20499860
8559 20499860 20046056 19555286 18997145 18343972 17694182 17208139 16921414 16822908 16873388 17004708
8549 17004708 17187059 17460088 17825181 18263903 18745344 19242146 19754669 20269084 20853523
8540B0853523N98114N34183L87599J46876p7154k86544n73814r18099j202577
8531A9462107j342204j284980j043563p82524n37247k18040P0402K72846M73304
8522A5070101O10068O71823O66362P00580P68262Q55959Q63324P11487M09085
8513B1327051k1319n72513j047182j311026j433456j381182j226700j069725q70937
8504A2393011o80584n07107l86680k93866k27243k08500j92088j64491r0966o9453
8494I572033r5380o5954j11574j73928j93577j86651j63988j17652l3746M9971
8484H479554O4085P2548Q6742L9790k4016Q325L9871L4016J2845j1298J9320L2552
8472H854334O8913M3565J4877Q79J9826M3747Q8280J36893J81320K23815K19601
$$ plain form
8540 20853523 21451637 21985820 22373419 22520295 22443141 22156597 21582783 20664684 19462107
8531 19462107 18119903 16834923 15791360 15008836 14471589 14253549 14323951 14596797 15070101
8522 15070101 15680169 16351992 17018354 17718934 18487196 19343155 20206479 20917966 21327051
8513 21327051 21305732 20733219 19686037 18375011 16941555 15560373 14333673 13263948 12393011
8504 12393011 11712427 11205320 10818640 10524774 10297531 10089031 9896943 9732452 9641486 9572033
8494 9572033 9476653 9410699 9299125 9125197 8931620 8744969 8580981 8463329 8429583 8479554
8484 8479554 8543639 8616187 8702929 8742719 8718703 8727028 8766899 8800915 8813760 8802462 8821782 8854334
8472 8854334 8923247 8966812 8981689 8982568 9002394 9046141 9134421 9271314 9452634 9676449 9896050
8461I896050J77229J00221L0847k2681j7797L5102N3129M4186j353k5824o8421
8450A0200688j00545p7993j4773K0914M4806R6081J86710K26633K64596L14367
8440A1161484L01791J96530N9180l4440j26705j79536j48988j46243j57495j63559
8430A0762019j53791j36440j15062p8313l6886J3273L7058M4051M6819P3003J05135
8419A0560866Q8042O9693J01174J18531J04624J28836J05295J25664J25045J07303
8409A1635073J29548J40835J40460R2208J17920J47551J27907J15879J26891J47251
8399A2921523J30055J56812J33169J40467J69408J36117J04509J11518J38017
8390A4141595J55034J24188J40282J19571J31687J15467R7204J17055J54154J41723
$$ plain form
8461 9896050 10073279 10173500 10204347 10181666 10163869 10198971 10252100 10296286 10294933 10269109 10200688
8450 10200688 10100143 10022150 10007377 10028291 10073097 10169178 10355888 10582521 10847117 11161484
8440 11161484 11463275 11659805 11718985 11684545 11557840 11378304 11229316 11083073 10925578 10762019
8430 10762019 10608228 10471788 10356726 10278413 10241527 10254800 10291858 10335909 10382728 10455731 10560866
8419 10560866 10648908 10718601 10819775 10938306 11042930 11171766 11277061 11402725 11527770 11635073
8409 11635073 11764621 11905456 12045916 12138124 12256044 12403595 12531502 12647381 12774272 12921523
8399 12921523 13051578 13208390 13341559 13482026 13651434 13787551 13892060 14003578 14141595
8390 14141595 14296629 14420817 14561099 14680670 14812357 14927824 15025028 15142083 15296237 15437960
8380A5437960J26511J18645J14829O8497R7785R3623J25848J00075J02981R7984
8370A6484738O7012O8468R7056J07687P5209O5280N9094K7201K9543N5488Q0373
8359A7217149M6564Q889m324q560L7244L2288l748K4177J4229k4971l1331q847
8347A7298759k1371n6149k3519l1299o6185o5956o4574k2328l8483j08820j04725
8336A6695350p4946q9280r0260q5267p1907p4077j16271j16258r6044j08143j35424
8325A5637473j10107j06964j70076j56230j22717j07756j23415j38677j30770
8316A4470761j49291j54901j48141j31394j21909j46847j49014r9282j23074j50611
8306A3096297j51184j31342j09544j40847j40846j18190j35237j45224j49691
$$ plain form
8380 15437960 15564471 15683116 15797945 15866442 15964227 16057850 16183698 16283773 16386754 16484738
8370 16484738 16551750 16620218 16717274 16824961 16900170 16965450 17024544 17051745 17081288 17136776 17217149
8359 17217149 17263713 17272602 17268278 17259718 17296962 17329250 17325502 17349679 17363908 17338937 17307606 17298759
8347 17298759 17277388 17221239 17197720 17166421 17100236 17034280 16969706 16947378 16908895 16800075 16695350
8336 16695350 16620404 16531124 16440864 16355597 16283690 16209613 16093342 15977084 15881040 15772897 15637473
8325 15637473 15527366 15420402 15250326 15094096 14971379 14863623 14740208 14601531 14470761
8316 14470761 14321470 14166569 14018428 13887034 13765125 13618278 13469264 13369982 13246908 13096297
8306 13096297 12945113 12813771 12704227 12563380 12422534 12304344 12169107 12023883 11874192
8297A1874192j53144j26429j32448j74944j23143r7778j22009j24112j49091j39859
8287A0531235j08135j48715j23193j46846j05726r5913r0356j18856j31056j31828
8277I330611j04372r0558j23723j06679q4215j21581j41024j18626r8567o5975
8267H275291q4093q3842o0699l1912o3157j50438j49680r8390j21324j33735j35135
8256G162886j18281q2965m9579o7332r3938j05949q0871n5329q7335p9794p5043
8245F266470n9415r7713p0979p3767p5036p8165n5348n6582p3409p6388r0039
8234E459629l5119l6368o4872n6595n0520j1426k1673J054n454j5456r083m1276
8222E112841q1938q3618j07023o9251o6270o7900o3209n2936m5187m1739m4207
$$ plain form
8297 11874192 11721048 11594619 11462171 11287227 11164084 11066306 10944297 10820185 10671094 10531235
8287 10531235 10423100 10274385 10151192 10004346 9898620 9802707 9712351 9593495 9462439 9330611
8277 9330611 9226239 9135681 9011958 8905279 8821064 8699483 8558459 8439833 8341266 8275291
8267 8275291 8191198 8107356 8046657 8014745 7951588 7801150 7651470 7553080 7431756 7298021 7162886
8256 7162886 7044605 6961640 6912061 6844729 6750791 6644842 6563971 6508642 6421307 6341513 6266470
8245 6266470 6207055 6109342 6038363 5964596 5889560 5811395 5756047 5699465 5626056 5549668 5459629
8234 5459629 5424510 5388142 5323270 5266675 5216155 5204729 5183056 5184110 5178656 5163200 5154117 5112841
8222 5112841 5030903 4947285 4840262 4771011 4704741 4636841 4573632 4520696 4475509 4433770 4389563
8211D389563o8446p1529o7773m3719k4959l9657l7646l3219m7219m2999m9077
8200C863320l8842l0914l5567l8571k4541k6747n8157l7787j9201o4881o6434
8189C421678l4970k6561l7090k2449k6578l7006o7960l2870j4783n4102n6724
8178C010585k7430k9775k0475j2947R227m815l9624m0222l5579n2746l8173l895
8166B714131j0177j3738l8404L871K1201m6386p6506n734j4509m837k1686K318
8154B509544l0765l4843p191j4509j3752j5624k8692p243k5466j6042O267J167
8142B322851l1066k4971r254k338k5308k6639m6873m1381M594O63k8149j3493
8130B078636pk9622k6459l2467k3913J7535J3647J4915l5485m9627k7751n136
$$ plain form
8211 4389563 4321117 4249588 4181815 4138096 4113137 4073480 4035834 4002615 3955396 3912397 3863320
8200 3863320 3824478 3793564 3757997 3719426 3694885 3668138 3609981 3572194 3552993 3488112 3421678
8189 3421678 3386708 3360147 3323057 3300608 3274030 3237024 3169064 3136194 3121411 3067309 3010585
8178 3010585 2983155 2953380 2932905 2919958 2929185 2924370 2884746 2844524 2808945 2756199 2718026 2714131
8166 2714131 2703954 2690216 2651812 2655683 2676884 2630498 2553992 2548258 2533749 2528912 2507226 2509544
8154 2509544 2478779 2443936 2436745 2422236 2408484 2392860 2364168 2356925 2331459 2315417 2321684 2322851
8142 2322851 2291785 2266814 2257560 2255222 2229914 2203275 2156402 2115021 2119615 2120278 2092129 2078636
8130 2078636 2078629 2049007 2022548 1990081 1966168 1983703 1997350 2012265 1976780 1927153 1899402 1894266
8118A894266l7840n3880M750j3584l7886l8453k8907j9063j8935J1283k3916k9521
8106A608314J6971J7769q264l0775j9511r266j2950n428k0612n2961j8381L896
8094A468802j8334K040k851j5797j0635j562j6930k03l0472l6615j767M77P771
8081A343924J9908P042J245m2147m6669K1674K195r069J922k6955k2066k5725
8069A225279P86n655O765n737m562N573k2825r863k7499k0418j0504k8178K5458
8056A128620K875R552j8353k029m043p700N856r510j4189m779p352k0666j1745
8043A046537j3428j7564k0880p476j9667K462k357P709j244k0654l955j4904J0642
8030I45221J0875J3828k5124k7347k0532N011J637K2045p531j9068m469Q578m244
$$ plain form
8118 1894266 1856426 1802546 1807296 1793712 1755826 1717373 1688466 1669403 1650468 1661751 1637835 1608314
8106 1608314 1625285 1643054 1634790 1604015 1584504 1575238 1562288 1556860 1536248 1483287 1464906 1468802
8094 1468802 1450468 1452508 1449657 1433860 1423225 1421663 1404733 1404530 1374058 1337443 1335676 1336153 1343924
8081 1343924 1363832 1370874 1372119 1329972 1283303 1304977 1307172 1298103 1300025 1273070 1251004 1225279
8069 1225279 1226065 1220410 1227175 1221438 1216876 1222449 1199624 1189761 1162262 1141844 1131340 1103162 1128620
8056 1128620 1131495 1141047 1122694 1120665 1116622 1108922 1114778 1105268 1091079 1086300 1078948 1058282 1046537
8043 1046537 1033109 1015545 994665 987189 967522 969984 967627 975336 974092 953438 949483 934579 945221
8030 945221 956096 969924 944800 917453 896921 901932 903569 925614 918083 899015 894546 903124 898880
8017H98880j8585j530K3368J1908k8769j3751j4376J659n226J0907p017j2164
8005H45304j450p416j0532J4945k2816l1182J9942K0390q741j2395l7711k0681
7993G47657N410K51P320j2299l59K4898M530j6187k4290N301K2519m823l0481
7980G29447k3155J553J3952O771m3787L181j5461j3530j7546J2449L6658N120
7968F95652J4109K891M805l939j7654j6613j0278k8286q601O383J1521J1775j0822
7955F50943L473K3021j8671j7576r369J3372n806j3860J64J9412p688K66J989
7942F39670Q196j5026q893j9003j8580K0697N080l4489q370J4026M73l5378j9822
7929E28581M1367k995k2404j5892k076p735M437K0207r082p672j7829m041J03
$$ plain form
8017 898880 880295 878765 902133 914041 885272 871521 857145 858804 853578 864485 857468 845304
8005 845304 843854 836438 825906 840851 818035 786853 806795 827185 818444 806049 768338 747657
7993 747657 753067 753318 760638 748339 747980 772878 777408 761221 736931 742232 764751 759928 729447
7980 729447 706292 707845 721797 728568 684781 687962 672501 658971 641425 653874 690532 695652
7968 695652 709761 712652 717457 713518 695864 679251 668973 640687 632086 638469 649990 661765 650943
7955 650943 654416 677437 658766 641190 631821 645193 639387 625527 625691 645103 637415 637681 639670
7942 639670 647866 632840 623947 604944 586364 607061 612141 577652 569282 583308 583781 548403 528581
7929 528581 569948 566953 544549 528657 526581 518846 523283 543490 534408 526736 508907 504866 504969
7916E04969O360L5205J5482m6810j4523K4523k177M165J712n93p516m5403M826
7903D80220J3552k147r890k0734J523r803q549J4794L2272j7253N529J603j9870
7890D61247k9623O573Q069j0782j1066L493J0640j0602N874J451j7532k497J518
7877D16763M509K7797r270r056j7955J4718J7532L932j7667j997L482N105j6865
7864D21028J918o645j1197m471O70k6984J4003J2261J0252j1104k8006r146P29
7851C63308j2682j8893J2988L4L150O13K0194J5145j456j7111n359j5846j2334
7838C31751n235Q9j2727J2146J2931L3330k965k943k2164K98M661k163j0789j3554
7824C22666o42J2176N940m236j0180k915j1259j7019K5326N472R125P868p049
$$ plain form
7916 504969 511329 546534 562016 515206 500683 525206 523029 527194 528906 528313 520797 475394 480220
7903 480220 493772 491625 481735 461001 462524 452721 444172 458966 491238 473985 479514 481117 461247
7890 461247 431624 438197 446266 435484 424418 427911 438551 427949 433823 435274 417742 415245 416763
7877 416763 421272 449069 439799 430743 412788 427506 445038 448970 431303 429306 432788 437893 421028
7864 421028 422946 416301 405104 400633 401303 374319 388322 400583 410835 399731 371725 362579 363308
7851 363308 350626 331733 344721 344755 347905 348518 368712 383857 382401 365290 359931 344085 331751
7838 331751 326516 326605 313878 326024 338955 372285 369320 366377 344213 344511 349172 347009 336220 322666
7824 322666 322024 334200 340140 335904 325724 322809 311550 294531 319857 325329 334454 342322 335273
7811C35273k5369p5J1155k367m662J4214P955l7010J431J8626j5484m001N994
7798C05680R167J293K062j980M995O971o956r830k1118j1885n394N341k71p63
7784B77312Q642l1548l0487J1797J7567K8161L8534j4969j2789l3150p106J2602
7772B64566q139o21J9918K011p907J1667N336l1495k8570l980K0124j6984k1532
7759B04394J4469J3189K3692J7980q884q610j5656J0882R609j5501J1041L3079
7747B89684j4529o419m896L271j3535j6578J7419J5393k5036k4173k435p716q942
7734B01508l284J1645K4741O371j6017j7545n279J3j1696L954P250P940J520n596
7720B05525r419j0485R621m74P556j1718k2005J4131J7616j5396M955K4495K8693
$$ plain form
7811 335273 309904 309829 320984 318617 313955 328169 336124 299114 300545 319171 303687 299686 305680
7798 305680 314847 316140 318202 316222 321217 328188 321232 311402 290284 278399 273005 278346 278075 277312
7784 277312 285954 254406 223919 235716 253283 281444 319978 305009 292220 259070 251964 264566
7772 264566 256427 255806 275724 277735 269828 281495 286831 255336 226766 222786 242910 225926 204394
7759 204394 218863 232052 255744 273724 264840 256230 240574 251456 261065 245564 256605 289684
7747 289684 275155 268736 263840 267111 253576 236998 254417 269810 244774 220601 218166 210450 201508
7734 201508 198224 209869 234610 240981 224964 207419 202140 202153 190457 194411 201661 209601 211121 205525
7720 205525 196106 185621 195242 194768 202324 190606 168601 182732 200348 184952 189907 214402 243095
7707B43095j2853k4133j903L1630L4499k0647n2465K044J4208m917K0326O337
7695B35221j4579k0899j6051k7085J4055J4552K502j1312j063J6222L046m317
7683A90292j6082j1062J5420J6437J9146J0464j8819l042J9688j8323k6890l2549
7671A44680J2444K8011j4532l1061J374N466M333L1091J7671j9280m527J0186
7659A85856J5158j8783k2760p929K9069K3943M0249k5776l8904l1136j8913j7312
7647A12762K3235J4705k7519J4956K8628j086Q665Q34q847Q726j0772m6386o814
7634A11087K0797N536P302N670j594J1670p95r516r161o414M64l884k4676J4142
7620A20628n675l0548Q339J7103J7762J3399J6506K0041j7845P322j9425l0575
$$ plain form
7707 243095 230242 206109 204206 235836 270335 249688 197223 199267 213475 208558 228884 235221
7695 235221 220642 199743 183692 156607 170662 185214 187716 176404 175341 191563 194609 190292
7683 190292 174210 163148 178568 195005 214151 224615 205796 202754 222442 204119 177229 144680
7671 144680 157124 185135 170603 139542 140916 146382 150715 181806 199477 180197 175670 185856
7659 185856 201014 182231 159471 151542 180611 204554 244803 219027 180123 148987 130074 112762
7647 112762 135997 150702 123183 138139 166767 165681 174346 175180 166333 175059 164287 117901 111087
7634 111087 131884 137420 144722 150392 148798 160468 159673 150157 140996 134582 135046 131162 106486 120628
7620 120628 114953 84405 92744 109847 127609 141008 157514 177555 159710 167032 147607 117032
7608A17032J913K3740J2261J7349j9277j5660j0581q840k0558j4810J5193K2790
7596A20552L7763J4836m760q503j7614k457n777M079o839j2497K0316q191J4145
7583A45053J4123P270l2370q056L7033j436o383M967k0273k2376J0353N156p618
7570A25443r45P108K2588l010j814k971q752j3409j8897K965K4291K7977J479
7557A62053n2427O726J0178o300k517K4628k1947l4089J304N176q377J512L995
7544H9915Q26J6373L1524J6100Q847o172j4923l3263k5808J6928M2406J7655j4010
7531A46398J897j9099J4713J699p446j4257j3673p147j3535J872k1058k4848L1851
7518G7367J2432K2932M487l8072P671q26k606J2651K4345j204m180L855j6881
$$ plain form
7608 117032 118945 142685 154946 172295 153018 137358 126777 117937 97379 82569 97762 120552
7596 120552 158315 173151 168391 159888 142274 139817 134040 138119 131280 118783 139099 130908 145053
7583 145053 159176 166446 134076 126020 163053 161617 155234 160201 139928 117552 127905 133061 125443
7570 125443 124498 131606 154194 151184 149370 146399 137647 124238 105341 108306 132597 160574 162053
7557 162053 109626 116352 126530 120230 117713 142341 120394 86305 87609 92785 84408 85920 89915
7544 89915 90741 107114 138638 154738 163585 157413 142490 109227 83419 100347 142753 160408 146398
7531 146398 148295 129196 143909 145608 138162 123905 110232 103085 89550 91422 70364 45516 77367
7518 77367 89799 112731 117218 79146 86817 85991 83385 96036 120381 119177 114997 118852 101971
7505A01971j8769P513n085J8759j613k1444k3802j8066J0122J2362o7K1432K0751
7492A04064R884k391k1274m591Q943l3750k2051K5932M4803j7045J2607K1644
7480A26775N74o898k2827Q875r406m0346J8283L5259J5190k246k2179N06J4560
7467A16120M382l0117m0699N069L7484J7895j4926j5449k001n932L621J8265N751
7454I9463J5757j1022n843J2850O035j5911p495J3324k211j7942M193J8994n193
7441A04999k688q155j3890j9011L471p013k863L3256J1266m016j4929j2335j349
7428F6743M7854O098k7740j8608m273k6217J6415N057O600j8323J0110L631K980
7415G0327j5863j6143J3876K0982J4124j1771j5385j1114j2858q830L3182L1045
$$ plain form
7505 101971 83202 90715 85630 104389 102776 81332 57530 39464 49586 61948 61881 83313 104064
7492 104064 113948 111557 90283 85692 94635 60885 38834 64766 109569 92524 105131 126775
7480 126775 127349 120451 97624 106499 97093 56747 75030 110289 125479 123233 101054 101560 116120
7467 116120 120502 90385 49686 54755 92239 110134 95208 79759 77758 71826 75447 93712 99463
7454 99463 115220 104198 98355 111205 117240 101329 93834 107158 104947 87005 91198 110192 104999
7441 104999 102311 94156 80266 61255 64726 57713 54850 88106 99372 95356 80427 68092 66743
7428 66743 114597 120695 92955 74347 70074 43857 60272 65329 71929 53606 63716 67347 70327
7415 70327 54464 38321 52197 73179 87303 75532 60147 49033 36175 27345 60527 91572
7403I1572j3970j752N712J3847k425n697J7464J1765J8800J1706k7947l0839k927
7390H5309o404k9689j1414J0876j7134k4959q961K2899J780M91L5111K0817R64
7377G9686J1786j5856O248J3752O085l121R22j5218m707M218J7768J5549L101
7364A20213k3719j3676J3517r5j2607k2698k9147Q706K2710K1480N361l9622K753
7351E3176J5929j7629j5722J4492n640L1857K1267j5404j3599K196K2446k0459
7339G2910k6341j5647J5408J7922l51K4690M115j6628j8924k441J6603R805J9061
7326A00182n0746j1082m059J9482l263J1847l779o119J6665R980j3325j9829R15
7313D6869K228O423J0309k1948O4R360q912j201j6642l741l2017l748J9040J1850
$$ plain form
7403 91572 77602 75850 81562 95409 92984 87287 104751 116516 135316 147022 119075 88236 85309
7390 85309 78905 49216 37802 48678 31544 6585 -2376 20523 22303 22794 57905 78722 79686
7377 79686 91472 75616 81864 95616 101701 98580 99502 84284 79577 83795 101563 117112 120213
7364 120213 96494 82818 96335 96240 83633 60935 31788 40494 63204 84684 90045 50423 53176
7351 53176 69105 51476 35754 50246 44606 76463 97730 82326 68727 70923 93369 72910
7339 72910 46569 30922 46330 64252 63901 88591 92706 76078 57154 54713 71316 81121 100182
7326 100182 49436 38354 34295 53777 50514 62361 58582 52463 69128 79108 65783 45954 46869
7313 46869 49097 55520 65829 43881 43945 53305 44393 43192 26550 22809 -9208 -12956 6084 17934
7299A7934K4520K1851l2189j3873J9655J9384j1621M529j1845p245J4928J1853
7287E7881K7553J010j7277k0534j0158J4790j6763j6480J5914k249K4374K0747
7275G8808m423k333J0363M522p866k0766r506m598J1108J2312J8505r916j7455
7262E8755o548k0616l030K1861K4620k0920q384j3213j1411q877o656K0446L019
7249B9046P215L350O827N727J9162p90o926k1222j2095m701L4L3277J3016l4128
7235C7792q725J2951K8946L9209q320m7044k5274j538l853l801K0539k7445n781
7222G656L1183J0733k5801P220K2396r137n192p308R163J5823N254l5665Q721
7209C5046o554n912j2914L8376N066j4660r640l2229J1042P176J549j725P010
$$ plain form
7299 17934 42454 64305 32116 18243 37898 57282 45661 50190 38345 31100 46028 57881
7287 57881 85434 86444 69167 48633 38475 53265 36502 20022 35936 33687 58061 78808
7275 78808 74385 72052 82415 86937 79071 58305 48799 44201 55309 67621 86126 76210 58755
7262 58755 52207 31591 28561 50422 75042 54122 45738 32525 21114 12237 5581 26027 29046
7249 29046 36261 39611 46438 52165 71327 70537 63611 42389 30294 25593 25627 58904 71920 37792
7235 37792 29067 42018 70964 110173 101853 54809 29535 27997 24144 20343 40882 13437 7656
7222 7656 38839 49572 23771 30991 53387 44250 39058 31750 40913 56736 61990 26325 35046
7209 35046 28492 22580 9666 48042 53108 38448 28808 -3421 7621 14797 16346 14621 21631
7196B1631J5304K9739P767l1304m4823j9188J8530r223j1367M5769K8486K0202
7184G1523q781k034J4789M791k1876m1099k6415K8016J8855p253k3451o844M829
7171E050J1690J1908J3185N547P560K7472j6111j3844q269J2431J5059J0541R640
7158I1859j736Q334l2116m883L592o819m688k7938K881J8071j9296J6878k090
7145D2049n787j3096K038J2750k4273l368J1087L5532K7465j1344j8784j3204
7133D1065k0893J7570l053J1256J6048J499m2603j0737L760L136m3773J951R256
7120a5518J0673j8414k986P382M670M2076J9060j0949N174l810L013j6597j1630
7107A2144J1961l739p092J5228r608j9104M134J0769J6926K0878k7131J6206L2910
$$ plain form
7196 21631 36935 66674 74441 43137 -1686 -20874 -2344 -11567 -22934 22835 51321 71523
7184 71523 62742 60708 75497 80288 58412 17313 -9102 18914 37769 30516 7065 221 5050
7171 5050 16740 28648 41833 47380 54940 82412 66301 52457 44188 56619 71678 82219 91859
7158 91859 90123 98457 66341 61458 65050 58231 53543 25605 28486 46557 27261 44139 42049
7145 42049 36262 23166 25204 37954 13681 10313 21400 56932 84397 73053 54269 41065
7133 41065 20172 37742 34689 45945 61993 63492 20889 10152 13912 17048 -26725 -24774 -15518
7120 -15518 -4845 -23259 -26245 -18863 -14193 27883 46943 35994 41168 37358 40371 23774 12144
7107 12144 24105 20366 13274 28502 18894 -210 3924 14693 31619 52497 25366 41572 74482
7094G4482O276n722k0524j9941K040J5782l686k355m0216k3761L0516J6254j9256
7081I889J2775J0005j4656J854L6600O836P040o506k7818J05P09j1691J0345J6580
7067E2067p696j4241k219n83J049J4525r860k1337O289O054K1065p389J544j6448
7053B2820j4491j3647j6337Q836J2688j78J271O376Q856L2138J3602N460j2366
7040E5028l6278o792k613l969N89m215L910K755q445J5464R696j849K0405p22
7026D2964q779q4J732N533L443j7514P177j5406j827N728L4427m597J0053l5022
7012B7828j8270L019L1800o797l3221N48R427j7878K669J6200J8902L522j733
$$ plain form
7094 74482 80758 75036 54512 34571 36611 52393 48707 46352 6136 -17625 12891 29145 9889
7081 9889 22664 32669 18013 19867 56467 63303 70343 63837 36019 36124 36833 25142 35487 52067
7067 52067 44371 30130 27911 27328 28377 42902 33042 11705 17994 24048 45113 37724 39268 22820
7053 22820 8329 -5318 -21655 -12819 -131 -309 962 7338 16194 48332 61934 67394 55028
7040 55028 18750 11958 9345 5376 5965 1750 5660 8415 -30 15434 25130 23281 43686 42964
7026 42964 34185 34101 35833 41366 44809 27295 34472 19066 17239 22967 57394 52797 62850 27828
7012 27828 9558 12577 44377 37580 4359 4907 14334 -3544 -875 15325 34227 37749 36016
$$ [...]
##END NTUPLES=NMR SPECTRUM
##END=
