##TITLE=Analysis number 329438
Compound Code cc 66726
Book Reference 528/44
Project Code adrs
Chemist Name davee
##JCAMPDX= 6.0         $$ Bruker NMR JCAMP-DX V2.0
##DATA TYPE= NMR SPECTRUM
##DATA CLASS= NTUPLES
##ORIGIN= Bruker BioSpin GmbH
##OWNER= nmr
$$ XWIN-NMR		Version 3.5
$$ Fri Aug 31 12:17:44 2007 GMT Daylight Time (UT+1h)  MAYBRIDGE\nmr@NMR_250MHZ
##.OBSERVE FREQUENCY= 250.131544655141
##.OBSERVE NUCLEUS= ^1H
##.ACQUISITION MODE= SIMULTANEOUS (DQD)
##.ACQUISITION SCHEME= undefined
##.AVERAGES= 16
##.DIGITISER RES= 18
##SPECTROMETER/DATA SYSTEM= dpx250
##.PULSE SEQUENCE= zg30
##.SOLVENT NAME= CDCl3
##.SHIFT REFERENCE= (INTERNAL, CDCl3, 0, 16.4464)
##AUDIT TRAIL= $$ (NUMBER, WHEN, WHO, WHERE, WHAT)
$$ ##TITLE= Audit trail, XWIN-NMR		Version 3.5
$$ ##JCAMPDX= 5.01
$$ ##ORIGIN= Bruker BioSpin GmbH
$$ ##OWNER= nmr
$$ C:\u/data/dgb/nmr/ADRS/1970/pdata/1/auditp.txt
$$ ##AUDIT TRAIL=  $$ (NUMBER, WHEN, WHO, WHERE, WHAT)
(   1,<2007-08-31 12:16:21.56 +100>,<MAYBRIDGE\nmr>,<NMR_250MHZ>,
      <created by zg, POWCHK disabled, PULCHK disabled
       configuration hash MD5:
       76 6E 9A 78 1E 09 19 81 EC 84 63 8F B0 6A 59 2D
       data hash MD5: 64K
       CF 0C E1 6C D7 9F CB 8B FF 04 4F D1 5B 54 47 4D>)
(   2,<2007-08-31 12:17:00.66 +100>,<MAYBRIDGE\nmr>,<NMR_250MHZ>,
      <Start of raw data processing
       ef LB = 0.3 FT_mod = 6 PKNL = 1 SI = 32K 
       data hash MD5: 32K
       9F 38 07 B7 7F 0B 1A C1 E7 70 9B DB ED A3 10 FD>)
(   3,<2007-08-31 12:17:05.69 +100>,<MAYBRIDGE\nmr>,<NMR_250MHZ>,
      <apk 
       data hash MD5: 32K
       D9 C2 C0 61 D5 94 1B 78 88 2C 18 E8 45 DF 5D C8>)
(   4,<2007-08-31 12:17:11.25 +100>,<MAYBRIDGE\nmr>,<NMR_250MHZ>,
      <abs ABSG = 5 
       data hash MD5: 32K
       50 AD 31 14 3C A9 02 13 49 F1 31 85 06 AE A4 92>)
$$ ##END=
$$ 
$$ hash MD5
$$ E2 82 D1 62 0A 9F E5 7F BD 42 3C 2C 12 08 0E 91
##$RELAX= 
##$RELAX= 
##$RELAX= 
##$RELAX= 
##$RELAX= 
##$RELAX= 
##$RELAX= 
$$ Bruker specific parameters
$$ --------------------------
##$DU= <C:\u>
##$EXPNO= 1970
##$NAME= <ADRS>
##$PROCNO= 1
##$TYPE= <nmr>
##$USER= <dgb>
##$AMP= (0..31)
100 100 100 100 100 100 100 100 100 100 100 100 100 100 100 100 100 100 
100 100 100 100 100 100 100 100 100 100 100 100 100 100 
##$AQSEQ= 0
##$AQ_mod= 3
##$AUNM= <au_zg>
##$AUTOPOS= <37 >
##$BF1= 250.13
##$BF2= 250.13
##$BF3= 250.13
##$BF4= 250.13
##$BF5= 500.13
##$BF6= 500.13
##$BF7= 500.13
##$BF8= 500.13
##$BYTORDA= 1
##$CFDGTYP= 0
##$CFRGTYP= 5
##$CHEMSTR= <none>
##$CNST= (0..31)
1 1 145 1 1 1 1 1 1 1 1 1 1 1 1 1 1 1 1 1 1 1 1 1 1 1 1 1 1 1 1 1 
##$CPDPRG= <>
##$CPDPRG1= <>
##$CPDPRG2= <>
##$CPDPRG3= <>
##$CPDPRG4= <mlev>
##$CPDPRG5= <mlev>
##$CPDPRG6= <mlev>
##$CPDPRG7= <mlev>
##$CPDPRG8= <mlev>
##$CPDPRGB= <>
##$CPDPRGT= <>
##$D= (0..31)
0 1 0 0 0 0 0 0 0 0.06 0 0 0 0 0 0 0.0002 0 0 0 0 0 0 0 0 0 0 0 0 0 0 
0 
##$DATE= 1188558979
##$DBL= (0..7)
120 120 120 120 120 120 120 120 
##$DBP= (0..7)
150 150 150 150 150 150 150 150 
##$DBP07= 0
##$DBPNAM0= <>
##$DBPNAM1= <>
$$ [...]
##$SUBNAM7= <"">
##$SUBNAM8= <"">
##$SUBNAM9= <"">
##$SW= 20.6930455092707
##$SWIBOX= (0..15)
0 0 3 0 0 0 0 0 0 0 0 0 0 0 0 0 
##$SW_h= 5175.983436853
##$TD= 65536
##$TD0= 1
##$TE= 296.16
##$TE2= 300
##$TE3= 300
##$TEG= 300
##$TL= (0..7)
0 120 120 120 120 120 120 120 
##$TP= (0..7)
150 150 150 150 150 150 150 150 
##$TP07= 0
##$TPNAME0= <>
##$TPNAME1= <>
##$TPNAME2= <>
##$TPNAME3= <>
##$TPNAME4= <>
##$TPNAME5= <>
##$TPNAME6= <>
##$TPNAME7= <>
##$TPOAL= (0..7)
0.5 0.5 0.5 0.5 0.5 0.5 0.5 0.5 
##$TPOFFS= (0..7)
0 0 0 0 0 0 0 0 
##$TUNHIN= 0
##$TUNHOUT= 0
##$TUNXOUT= 0
##$USERA1= <user>
##$USERA2= <user>
##$USERA3= <user>
##$USERA4= <user>
##$USERA5= <user>
##$V9= 5
##$VALIST= <valist>
##$VCLIST= <CCCCCCCCCCCCCCC>
##$VD= 0
##$VDLIST= <DDDDDDDDDDDDDDD>
##$VPLIST= <PPPPPPPPPPPPPPP>
##$VTLIST= <TTTTTTTTTTTTTTT>
##$WBST= 1024
##$WBSW= 4
##$XGAIN= (0..3)
0 0 0 0 
##$XL= 0
##$YL= 0
##$YMAX_a= 375903
##$YMIN_a= -343015
##$ZGOPTNS= <>
##$ZL1= 120
##$ZL2= 120
##$ZL3= 120
##$ZL4= 120
##$ABSF1= 16.44635
##$ABSF2= -4.246822
##$ABSG= 5
##$ABSL= 3
##$ALPHA= 0
##$AQORDER= 0
##$ASSFAC= 0
##$ASSFACI= 0
##$ASSFACX= 0
##$ASSWID= 0
##$AUNMP= <proc_1d>
##$AZFE= 0.1
##$AZFW= 0.1
##$BCFW= 0
##$BC_mod= 0
##$BYTORDP= 0
##$COROFFS= 0
##$CY= 12.5
##$DATMOD= 1
##$DC= 0
##$DFILT= <>
##$DTYPP= 0
##$F1P= 14.0000005364418
##$F2P= -0.99999901652339
##$FCOR= 0.5
##$FTSIZE= 32768
##$FT_mod= 6
##$GAMMA= 0
##$GB= 0
##$INTBC= 1
##$INTSCL= 1
##$ISEN= 128
##$LB= 0.3
##$LEV0= 0
##$LPBIN= 0
##$MAXI= 10000
##$MC2= 0
##$MEAN= 0
##$ME_mod= 0
##$MI= 0
##$NCOEF= 0
##$NC_proc= -4
##$NLEV= 6
##$NOISF1= 0
##$NOISF2= 0
##$NSP= 0
##$NTH_PI= 0
##$NZP= 0
##$OFFSET= 16.44635
##$PC= 1
##$PHC0= -40.042
##$PHC1= 4.907583
##$PH_mod= 1
##$PKNL= yes
##$PPARMOD= 0
##$PSCAL= 4
##$PSIGN= 0
##$REVERSE= no
##$SF= 250.130018919888
##$SI= 32768
##$SIGF1= 0
##$SIGF2= 0
##$SINO= 400
##$SIOLD= 32768
##$SREGLST= <1H.CDCl3>
##$SSB= 0
##$STSI= 32768
##$STSR= 0
##$SW_p= 5175.98343685301
##$SYMM= 0
##$S_DEV= 0
##$TDeff= 65536
##$TDoff= 0
##$TI= <Analysis number 999999
Compound Code 99
Book Reference 9
Project Code 9>
##$TILT= no
##$TM1= 0
##$TM2= 0
##$TOPLEV= 0
##$USERP1= <user>
##$USERP2= <user>
##$USERP3= <user>
##$USERP4= <user>
##$USERP5= <user>
##$WDW= 1
##$XDIM= 32768
##$YMAX_p= 287505022
##$YMIN_p= -236105
$$ End of Bruker specific parameters
$$ ---------------------------------
##NTUPLES= NMR SPECTRUM
##VAR_NAME=  FREQUENCY,     SPECTRUM/REAL,   SPECTRUM/IMAG
##SYMBOL=    X,             R,               I
##VAR_TYPE=  INDEPENDENT,   DEPENDENT,       DEPENDENT
##VAR_FORM=  AFFN,          ASDF,            ASDF
##VAR_DIM=   32768,         32768,           32768
##UNITS=     HZ,            ARBITRARY UNITS, ARBITRARY UNITS
##FACTOR=    0.157963299565203, 1,           1
##FIRST=     4113.72586108986, 0,            0
##LAST=      -1062.25757576315, 0,           0
##MIN=       -1062.25757576315, -236105,     0
##MAX=       4113.72586108986, 287505022,    0
$$ Real data points
##PAGE= N=1
##DATA TABLE= (X++(R..R)), XYDATA
$$ [...]
18179A84767j0107K8117J4531j409M7133J00704P0398p1191l7624M4269M6084
$$ 184767 174660 202777 217308 215899 263032 363736 434134 362943 325319 369588 415672
18168D15672j5594m3415n8420o6424J7278M0043j4302O7924N7962K4584J2774
$$ 415672 400078 356663 298243 231819 249097 289140 274838 342762 400724 425308 438082
18157D38082K1271J2124J1714k7384o916M1694Q97K293J5280N7785O2082M1855
$$ 438082 459353 471477 483191 455807 448891 490585 491482 493775 509055 566840 628922 670777
18145F70777R1929J89828J34707L1098m5199k1018j33951q4730N7040R2715O3453
$$ 670777 762706 952534 1087241 1118339 1073140 1052122 918171 833441 890481 983196 1046649
18134A046649K7300O8358O7645R8715J39455J83131J58330J32922J58632K07763
$$ 1046649 1073949 1142307 1209952 1308667 1448122 1631253 1789583 1922505 2081137 2288900
18124B288900M08492M48767M26205M74441M80462N93351R12998J249220J671659
$$ 2288900 2697392 3146159 3572364 4046805 4527267 5120618 6033616 7282836 8954495
18115H954495K338313L319773M633256O811681J0508443J6289750K3569199K6355365
$$ 8954495 11292808 14612581 19245837 26057518 36565961 52855711 76424910 102780275
18107A02780275J0254778j5635830k5647439j8005579n897072L252964R836476
$$ 102780275 113035053 97399223 71751784 53746205 47849133 51102097 60938573
18100F0938573J1066978K639737r017921j2943453q877336k475099L275754Q304293
$$ 60938573 72005551 74645288 65627367 52683914 43806578 41331479 44607233 52911526
18092E2911526J0906846O007268n973788j4645961j4715867j0129070o085676
$$ 52911526 63818372 69825640 63851852 49205891 34490024 24360954 18275278
18085A8275278l656996k277795j603623j114196p10622l07427J85042O50645J022427
$$ 18275278 14618282 12340487 10736864 9622668 8912046 8604619 8789661 9440306 10462733
18076A0462733J493781K030155K769774L785953N777680Q943511J3282461J7158942
$$ 10462733 11956514 13986669 16756443 20542396 26320076 35263587 48546048 65704990
18068F5704990J3447501j112098j3452482j4045909p024937L77083O594872J1824085
$$ 65704990 79152491 78040393 64587911 50542002 43517065 43894148 50489020 62313105
18060F2313105J2556689K680681j2109979j8673232j5557160r676101n712361
$$ 62313105 74869794 77550475 65440496 46767264 31210104 21534003 15821642
18053A5821642l485283k348708j815584j339562j019974o54546l95401l14266
$$ 15821642 12336359 9987651 8172067 6832505 5812531 5157985 4762584 4448318
18045D448318k28649j58956j41018l17006l49726l45447j55696j36926j06385
$$ 4448318 4219669 4060713 3919695 3602689 3252963 2907516 2751820 2614894 2508509
18036B508509j22634j62351j50044p4382j63454j41274q1290r9756j40488j78872
$$ 2508509 2385875 2223524 2073480 1999098 1835644 1694370 1613080 1513324 1372836 1193964
18026A193964o3117j1155m5448q7685j8253j257m4665L8095N0531j2194j16815
$$ 1193964 1130847 1119692 1074244 986559 968306 967049 922384 960479 1011010 998816 882001
18015H82001j04224o0613o3259r9147K781P923m9304J6523n5300m5874l4644j3451
$$ 882001 777777 717164 653905 554758 557539 565462 516158 532681 477381 431507 396863 383412
18003C83412j5170o3478p877K3264l4104p361L3524O8636l3174m6571J5268m8053
$$ 383412 368242 304764 296887 320151 286047 278686 312210 380846 347672 301101 316369 268316
17991B68316k4690N0445P0165J4258n1521q6701K8219K2558J1225l5586k7252
$$ 268316 243626 294071 364236 378494 326973 240272 268491 291049 302274 266688 239436
17980B39436o8095l094N1897J8354n5299p690L9195J753l5503k6523J0047k3627
$$ 239436 171341 168247 220144 238498 183199 175509 214704 216457 180954 154431 164478 140851
17968A40851j7026L7322M7893L1671o2180l3841P2850m9832k9965K5101j6743
$$ 140851 123825 161147 209040 240711 178531 144690 217540 167708 137743 162844 146101
17957A46101k9038P1535r7792j6276N4132O2173M82l7764L3431j6424q8695K1163
$$ 146101 117063 188598 90806 74530 128662 190835 191317 153553 186984 170560 81865 103028
17945A03028K3017N7141J570k7209r755L5135j9055m9923m8346L9336N6985L4007
$$ 103028 126045 183186 184756 157547 147792 182927 163872 113949 65603 104939 161924 195931
17933A95931m9003j9898K8507n776Q1881L4093p0094k2973L7480l5070j8848K4816
$$ 195931 146928 127030 155537 149761 231642 265735 195641 172668 210148 175078 156230 181046
17921A81046k7662n8785k4795M1638O8704O7435k8880r2363o760L9458m0754k3189
$$ 181046 153384 94599 69804 111442 180146 247581 218701 126338 119578 159036 118282 95093
17909I5093L9873K0822m6121k2155M0112n0141N992N4225L6101M6017k5561k4500
$$ 95093 134966 155788 109667 87512 127624 77483 83475 137700 173801 219818 194257 169757
17897A69757q0332m6844q938L3635N6658n181L3146J6195k1293j5580j036K9314
$$ 169757 89425 42581 33643 67278 123936 118755 151901 168096 146803 131223 130187 159501
17885A59501J4559J1445K2685J2093K3956n4121L9761M6023j4176r6316k1174
$$ 159501 174060 185505 208190 220283 244239 190118 229879 275902 261726 165410 144236
17874A44236j1077l7801l0419R361J9574J1720L4605J3934l0735n671K1662J4158
$$ 144236 133159 95358 64939 74300 93874 105594 140199 154133 123398 117727 139389 153547
17862A53547L242m4106m5799m7691l9310R5428O0979o5681L1107P14l0066L1537
$$ 153547 156789 112683 66884 19193 -20117 75311 136290 70609 101716 102430 72364 103901
17850A03901O1114K0489n8092m6737K352N3061M8953L4044R252r1334K4202L0721
$$ 103901 165015 185504 127412 80675 83027 136088 185041 219085 228337 137003 161205 191926
17838A91926p8835k4561J9101j8500K5563n6515k7127M4337K2080q717M9970l181
$$ 191926 113091 88530 107631 89131 114694 58179 31052 75389 97469 88752 138722 135541
17826A35541j4508k0381m0647M9818M1233j6578K2491M2326j6754l8635k1523
$$ 135541 121033 100652 60005 109823 151056 134478 156969 199295 182541 143906 122383
17815A22383P990K0697m2052K7171N1376n5544P671L6351K9114K2159m1285J3200
$$ 122383 130373 151070 109018 136189 187565 132021 139692 176043 205157 227316 186031 199231
17803A99231n490n1722j0224L4078N0302K2807o344p4909m7364q462J03241J873
$$ 199231 193741 142019 131795 165873 216175 238982 232638 157729 110365 101903 205144 207017
17791B07017q1154p5473J567N0199K9010m4794j8031O2670j8301j4009r447l0535
$$ 207017 125863 50390 51957 102156 131166 86372 68341 131011 112710 98701 89254 58719
17779E8719N0176J9778m0495J8932K1658K0405K1229K4106K8552n4746r563K2361
$$ 58719 108895 128673 88178 107110 128768 149173 170402 194508 223060 168314 158751 181112
17767A81112M026k801n1246J1148N2990k635m6542Q933K007J5413K2511p540j119
$$ 181112 185138 182337 131091 142239 195229 192594 146052 154985 156992 172405 194916 187376 186257
17754A86257J1608K2461N1653J8038k1268q4179o3260m7331M3390l5532J823n7820
$$ 186257 197865 220326 271979 290017 268749 184570 121310 73979 117369 81837 83660 25840
17742B5840j1875K4403j1844K9551P2713K7148L558m1335J7064P2589K2859l8710
$$ 25840 13965 38368 26524 56075 128788 155936 159494 118159 135223 207812 230671 191961
17730A91961Q037k1468j0399m801l6607K5795m4129n661R928N0599M1716Q5256
$$ 191961 199998 178530 168131 163330 126723 152518 108389 102728 112656 163255 204971 290227
17718B90227K7072l656l3615l1783m650o4323K8638J9549n801L5034J6054p4114
$$ 290227 317299 313643 280028 248245 243595 179272 207910 227459 221658 256692 272746 198632
17706A98632l6599N4010L8299j6720n384J1434L2586K7417J0735p688k7208l3
$$ 198632 162033 216043 254342 237622 232238 243672 276258 303675 314410 306722 279514 279481
17694B79481n2294k8009J5870J6754K4480O0537L8757N7748K338m861J1949j06
$$ 279481 227187 199178 215048 231802 256282 316819 355576 413324 415662 410801 422750 422644
17682D22644q149J24349J08915M6616N2229L2484N1384P659L6511J6746m9389
$$ 422644 414495 538844 647759 694375 746604 779088 830472 838131 874642 891388 841999
17671H41999Q881R589L5214J02554J55638J04534K2228J27816J71207J39674J89348
$$ 841999 850880 860469 895683 998237 1153875 1258409 1280637 1408453 1579660 1719334 1908682
17660A908682J95258L35436N66835P36419R15032J147459J481746K156219L103070
$$ 1908682 2103940 2439376 3006211 3742630 4657662 5805121 7286867 9443086 12546156
17651A2546156M526604O575489Q995027R848049O378766j523976q588270j0511899
$$ 12546156 17072760 23648249 32643276 42491325 48870091 47346115 38757845 28245946
17643B8245946q435015n399453l158042j860912r91897m95256j8750M58280R23242
$$ 28245946 19810931 14411478 11253436 9392524 8400627 7905371 7886621 8344901 9268143
17634I268143J374375K117192K996947M269979O232662R118797J3057359J6710328
$$ 9268143 10642518 12759710 15756657 20026636 26259298 35378095 48435454 65145782
17626F5145782J6421517P794209o451593j6525416j7322869j2182265o432615
$$ 65145782 81567299 89361508 82909915 66384499 49061630 36879365 30446750
17619C0446750j889164J736928M483330N020947J608403m337329q068380p678801
$$ 30446750 28557586 30294514 34777844 39798791 41407194 37069865 29001485 21322684
17611B1322684n239963l179091j848462j087679n77125j49906K95926N59884R00844
$$ 21322684 16082721 12903630 11055168 9967489 9390364 9240458 9536384 10096268 10997112
17602A0997112J425442K181049L176879M564522O813627J0087566J4144340J7329350
$$ 10997112 12422554 14603603 17780482 22345004 29158631 39246197 53390537 70719887
17594G0719887J4842350K796549j2228477j9348405j6996325j1222815o576851
$$ 70719887 85562237 88358786 76130309 56781904 39785579 28562764 21985913
17587B1985913l635888j875204o37265L99575J488618K700311M072917N424247
$$ 21985913 18350025 16474821 15837556 16237131 17725749 20426060 24498977 29923224
17579B9923224N890320N038780L944352M529471O832890Q575515O377516J677256
$$ 29923224 35813544 40852324 44796676 49326147 56159037 64734552 71112068 72789324
17571G2789324o49824J8443P96590M22856K38514P98691j55057m401999q334121
$$ 72789324 72139500 72157943 72954533 73377389 73615903 74414594 74259537 69857538 61523417
17562F1523417q193624n085528k675235k426257k952112k863964k262153j259090
$$ 61523417 53329793 48244265 45569030 43142773 40190661 37326697 35064544 33805454
17554C3805454M28813K287526L042167J272238j098760j802433q97920k60766
$$ 33805454 34234267 36521793 39563960 40836198 39737438 37935005 37037085 36776319
17546C6776319m63008o36217n68813j316631l131213m258291l709995k418231
$$ 36776319 36313311 35677094 35108281 33791650 30660437 26402146 22692151 20273920
17538B0273920j942351k404137k831412k707419k071713j455583r77715p48541
$$ 20273920 18331569 15927432 13096020 10388601 8316888 6861305 5883590 5135049
17530E135049n44084l56869l40216l57992k40600k90745l44365j57445j52431
$$ 5135049 4590965 4234096 3893880 3535888 3295288 3004543 2660178 2502733 2350302
17521B350302j51868j79912j52642p4369r9612j15636n5269l3761K485j26649
$$ 2350302 2198434 2018522 1865880 1791511 1691899 1576263 1520994 1487233 1489718 1363069
17511A363069r5716j268K8556K9431M8746J38729M2495r5669j72828j79089o6476
$$ 1363069 1267353 1266085 1294641 1324072 1372818 1511547 1554042 1458373 1285545 1106456 1039980
17500A039980k0681p3540n8343J7556L0522N709j11221r1603o0648o0294l2089
$$ 1039980 1019299 945759 887416 904972 935494 941203 829982 738379 677731 617437 585348
17489E85348k2606j9852L2920J7536j341k5812n4546J2877j8382K4717P4583R119
$$ 585348 562742 542890 575810 593346 592005 566193 511647 524524 506142 530859 605442 614561
17477F14561k2684R6929O8127j2584p4998p6371k3370J6102n1389L7552M8551
$$ 614561 591877 688806 756933 744349 669351 592980 569610 585712 534323 571875 620426
17466F20426J196j5552r8095n154l0887j03110n8530k234N4641p364n0356m2227
$$ 620426 621622 606070 507975 502821 471934 368824 310294 308060 362701 355337 304981 262754
17454B62754l3857L0494M9187J0108j5070k6276m8980K6477O8307J16745K4235
$$ 262754 228897 259391 308578 318686 303616 277340 228360 254837 323144 439889 464124
17443D64124N8951J04305R6967l5628j61500j52280q7778L579M7754j6537l6576
$$ 464124 523075 627380 724347 688719 527219 374939 287161 290740 338494 321957 285381
17432B85381J3315o5514J1701K8938l9504k5236Q7279N710l8766j6860l1522L5631
$$ 285381 298696 233182 244883 273821 234317 209081 296360 302070 263304 246444 214922 250553
17420B50553N2731n5211l9387n016k0164m2323l3264L4392J00928N5581p4417
$$ 250553 303284 248073 208686 203670 183506 141183 107919 142311 243239 298820 224403
17409B24403o8778j04135o6316K4166l4965j2301R1952J04293M3166j964j03737
$$ 224403 155625 51490 -14826 9340 -25625 -37926 54026 158319 201485 199521 95784
17398I5784m0998J2232k985r417l518P309L3476N2153J8361L6823n1335p722k7635
$$ 95784 54786 67018 64033 54616 51098 58407 91883 144036 162397 199220 147885 140163 112528
17385A12528L1634K2807j0291m8874m6459j3105P7868r893j7693l4300m743L961
$$ 112528 144162 166969 156678 107804 61345 48240 126108 116215 98522 64222 59479 63440
17373F3440j4545n145j0437j2660J1232R4728M912m8786k4278r467J1503J7489
$$ 63440 48895 43750 33313 20653 31885 126613 131525 82739 58461 48994 60497 77986
17361G7986o4777p758J2108N1346Q28p0127Q734L1424n5134o3857K2763K6707
$$ 77986 13209 5451 17559 68905 69733 -394 8340 39764 -15370 -79227 -56464 -29757
17349b9757J5351q007K1801M0158K788K6543j5133n0576o8482J7981M6774O1385
$$ -29757 -14406 -22413 -612 39546 42334 68877 53744 3168 -65314 -47333 -559 60826
17337F0826K3080m774j9707j3418J6297k2378k3738L895k0701O6231J6077l3886
$$ 60826 83906 79132 59425 46007 62304 39926 16188 20083 -618 65613 81690 47804
17325D7804L5267K5810j29378r4204M6682J16739J6356p8447l4370K6534M0399
$$ 47804 83071 108881 -20497 -114701 -68019 48720 65076 -13371 -47741 -21207 19192
17314A9192M3412M035o612J11k480p0960L6084k5584k7095Q93k0933j8219J7819
$$ 19192 62604 66639 60027 60138 57658 -13302 22782 -2802 -29897 -29004 -49937 -68156 -50337
17301e0337j1768N562J0836L774Q9354N167M328m7238j2022r646m3119O9540M5603
$$ -50337 -62105 -56543 -45707 -41933 47421 52588 56916 9678 -2344 -11990 -55109 14431 60034
17288F0034j7225k373J7360K444l5630o5063j8106L6119N130K1622L4088Q192
$$ 60034 42809 40436 57796 60240 24610 -40453 -58559 -22440 -17310 4312 38400 46592
17276D6592n621K4442j0063j0126m93J3968r347j8523k5927l0545M5051K7058
$$ 46592 40971 65413 55350 45224 44731 58699 49352 30829 4902 -25643 19408 46466
17264D6466K1179p022o464j1196l5502j3494K3812k0917r788N8617m8458l0335
$$ 46466 67645 60623 54159 42963 7461 -6033 17779 -3138 -12926 45691 -2767 -33102
17252c3102M859P5824K9298r109n9265k7124K5945L5082J0323m6529j7825N383
$$ -33102 -28243 47581 76879 67770 8505 -18619 7326 42408 52731 6202 -11623 -6240
17240f240K0332j878J3292J9412O9339o041l4228n0183J876J0696N7483l0816
$$ -6240 14092 12214 25506 44918 114257 108216 73988 23805 25681 36377 93860 63044
17228F3044k7583J7397L76m0501Q0623P0429J275o9003O408k7546q1346k3296
$$ 63044 35461 52858 53234 12733 93356 163785 165060 96057 102465 74919 -6427 -29723
17216b9723J4404P6668K9951R65k9392J3732j5050o1420K2661P130m2247j8940
$$ -29723 -15319 61349 91300 92265 62873 76605 61555 135 22796 29926 -12321 -31261
17204c1261p028J3763M0257M5654Q145J1255J7040r1070n0599L028N6551P8170
$$ -31261 -38289 -24526 15731 61385 69530 80785 97825 6755 -43844 -40816 15735 93905
17192I3905k8062o5587M862P3965N4927k620l9133J4669m7984j9546k1453l350
$$ 93905 65843 256 5118 79083 134010 131390 92257 106926 58942 39396 17943 14593
17180A4593O7250M1589m7342Q341m2628j6138L8929p180n474P4014p197n0567
$$ 14593 81843 123432 76090 84431 41803 25665 64594 57414 51940 125954 118757 68190
17168F8190m0047l7104k9995l1062M4039L7742L9540k0687o309M239L8637l6681
$$ 68190 28143 -8961 -38956 -70018 -25979 11763 51303 30616 24307 28546 67183 30502
17156C0502k9319o2425l0203O2168p597k5662J816L6543L9824O9452K8343l4687
$$ 30502 1183 -61242 -91445 -29277 -36874 -62536 -60720 -24177 15647 85099 113442 78755
17144G8755k3972P156N188k8631n540J6823n502J3335J7972O2808k4254q5097
$$ 78755 54783 61939 67127 38496 32956 49779 44277 57612 75584 138392 114138 29041
17132B9041k2435J1080J9345M6494r044k8848K2728j8815k384O029M2849J7773
$$ 29041 6606 17686 37031 83525 74481 45633 68361 49546 47162 53191 96040 113813
17120A13813J2063P683P1095J4616J6278M4149N2492l4461j6815n7179k6093m5708
$$ 113813 125876 133559 204654 219270 235548 279697 332189 297728 280913 223734 197641 151933
17108A51933m1287j9416j6353k1340J4733N0724p18m4561k5562O28k7421N3171
$$ 151933 110646 91230 74877 53537 68270 118994 118276 73715 48153 48781 21360 74531
17096G4531J8407M6058K5370J00651R1971K4726p791n1106j42374o8713P4366
$$ 74531 92938 138996 164366 265017 356988 381714 373923 322817 180443 111730 186096
17085A86096M2832k759j6179P5539O9351l3881n6975n4608o2760j6300j0270j1782
$$ 186096 228928 226169 209990 285529 354880 320999 264024 209416 146656 130356 120086 108304
17073A08304j5770r2808k0130M6557J4271l2849K544J5432L315P9271Q2479M5988
$$ 108304 92534 -274 -20404 26153 40424 7575 10119 25551 28866 108137 190616 236604
17061B36604O4314L8097k0780n5859l4343M6717m5754K1161J1765k9087Q2471
$$ 236604 300918 339015 318235 262376 228033 274750 228996 250157 261922 232835 315306
17050C15306J2739r182j4625m8587J8821k3632q691N1210M6771K8279o3486r9531
$$ 315306 328045 318863 304238 255651 274472 250840 242149 293359 340130 368409 304923 205392
17038B05392q7756j5655L7171R5872K5436l0693o0362P952N6913N0582L3462K0764
$$ 205392 117636 101981 139152 235024 260460 229767 169405 177357 234270 284852 318314 339078
17026C39078l1350n4982n1817o918K2015M8510O913j2091r602N279q7980l9272
$$ 339078 307728 252746 200929 194011 216026 264536 271449 259358 249756 255035 167055 127783
17014A27783K2732J215m8964o1723n2957o979N900M3040K9418Q161j2721J2336
$$ 127783 150515 151730 102766 41043 -11914 -18893 -12993 30047 59465 67626 54905 67241
17002F7241j8009O304K8014m4115M778K1522R752l0398o4108J4562k2648N1545
$$ 67241 49232 55536 83550 39435 44213 65735 75487 45089 -19019 -4457 -27105 24440
16990B4440k3305k5378M5813M9126n1305j8264P3337L9203p0044j9033L2379M1015
$$ 24440 1135 -24243 21570 70696 19391 1127 74464 113667 43623 24590 56969 97984
16978I7984o106l9958n988K7694o459n6005j3160K657M0648J6581k4100n7312
$$ 97984 91878 51920 45932 73626 67167 11162 -1998 659 41307 57888 33788 -23524
16966b3524J8369j4325l2892J1510N2527j1832J921k4365n5495j7819J3677L4623
$$ -23524 -5155 -19480 -52372 -40862 11665 -167 1754 -22611 -78106 -95925 -82248 -47625
16954d7625J4699j486j4591r022j8079P6035J08810j5181p3151J3769N8079J8690
$$ -47625 -32926 -34412 -49003 -58025 -76104 -69 108741 93560 20409 34178 92257 110947
16942A10947n4168r5615o0838k4950K49O8784O5165k6112p143j0774k4489J9211
$$ 110947 56779 -38836 -99674 -124624 -124375 -55591 9574 -16538 -23681 -34455 -58944 -39733
16930c9733p2585O028N7294l9731J8289j0433J1838O0716K0196o1343j2893O5116
$$ -39733 -112318 -106290 -48996 -88727 -70438 -80871 -69033 -8317 11879 -49464 -62357 2759
16918B759J9068j4912q633l3107j8525O9943j9528L8683K4123N950n6735r2983
$$ 2759 21827 6915 -1718 -34825 -53350 16593 -2935 35748 59871 65821 9086 -83897
16906h3897K4139K7974j6630L3392O2328K9926k5674j9914r8083m8035J0126O9787
$$ -83897 -59758 -31784 -48414 -15022 47306 77232 51558 31644 -66439 -114474 -104348 -34561
16894c4561m4645l7260L5393L2702N9022J3520k7835j5073M4232L6744k0147j8044
$$ -34561 -79206 -116466 -81073 -48371 10651 24171 -3664 -18737 25495 62239 42092 24048
16882B4048r588K9451q054Q500m30j5305J1774j269o909J6423J8763k6213q510
$$ 24048 14460 43911 35857 44357 43927 28622 40396 39127 32218 48641 67404 41191 32681
16869C2681j0732k1096M1220m9801j111j390n149k3318N4729l567l9357R890N356
$$ 32681 21949 853 42073 -7728 -8839 -10229 -15378 -38696 16033 12466 -26891 -17001 -11645
16856a1645k9335P298l3191m9440N1041K0722O8571k160l0919R43j0685l8333
$$ -11645 -40980 -33682 -66873 -116313 -65272 -44550 24021 21861 -9058 -8115 -18800 -57133
16844e7133k7172K6555N8303k1956k6749Q2203K8280n3866m8306o8980j9235O120
$$ -57133 -84305 -57750 553 -21403 -48152 34051 62331 8465 -39841 -108821 -128056 -121936
16832a21936L9748M4729n712j9186K4784M4555P630k2896l2427n0519O3228r817
$$ -121936 -82188 -37459 -43171 -62357 -37573 6982 14612 -8284 -40711 -91230 -28002 -37819
16820c7819K3492K1037P2945L553m1469j9201k0902n7708j9252J0862M5877M3062
$$ -37819 -14327 6710 79655 83208 41739 22538 1636 -56072 -75324 -64462 -18585 24477
16808B4477j72n9569j2289O0461L415J4654l0334M3421K4967p629q9649j562M0637
$$ 24477 24305 -35264 -47553 12908 16323 30977 643 44064 69031 61402 -28247 -29809 10828
16795A0828J5548q662k0762m0117J991M2964N3863k0158K3320P790j0673k8227
$$ 10828 26376 17714 -3048 -43165 -41174 1790 55653 35495 58815 66605 55932 27705
16783B7705K5296l2936j8478l8176m1913J3150J9806O130L4358l8166o9395j6491
$$ 27705 53001 20065 1587 -36589 -78502 -65352 -45546 -39416 -5058 -43224 -112619 -129110
16771a29110L2106L9582K0812K1654k3641l310j240N3201K1540O0281K2151q8545
$$ -129110 -97004 -57422 -36610 -14956 -38597 -41907 -43147 10054 31594 91875 114026 25481
16759B5481n4999k9204m8185l9967J9805P3448M0830J5228l2180M2566k8530J7130
$$ 25481 -29518 -58722 -106907 -146874 -127069 -53621 -12791 2437 -29743 12823 -15707 1423
16747A423o455L5141M311L868o4027n5137Q048L9615M8877O7720l2602l6519N2222
$$ 1423 -5032 30109 34420 38288 -25739 -80876 -72828 -33213 15664 83384 50782 14263 66485
16734F6485k7636m4819N3239l8586m1522k8462k174m7377J3395P4664p522K0767
$$ 66485 38849 -5970 47269 8683 -32839 -61301 -63475 -110852 -97457 -22793 -30315 -9548
16722i548L2382Q789l4823p658O014J8066k0258n166j4569K6419N5170R287p9523
$$ -9548 22834 31623 -3200 -10858 -4844 13222 -7036 -12202 -26771 -352 54818 64105 -15418
16709a5418k1710k2254q3338R3028K8317k7520L1240l2858k6117q663L3480Q2265
$$ -15418 -37128 -59382 -142720 -49692 -21375 -48895 -17655 -50513 -76630 -85293 -51813 30452
16697C0452M8864k6890n2244j3257K7512J9782J9765L6633k0813J7012n711o7052
$$ 30452 79316 52426 182 -13075 14437 34219 53984 90617 69804 86816 81105 14053
16685A4053n1357m9294k8441O9745M6065K4433k1648K6938j8621j390P1801p923
$$ 14053 -37304 -86598 -115039 -45294 771 25204 3556 30494 11873 10483 82284 74361
16673G4361k9197k5198M0643o6982o7118K6759L6495P49K4680j7892O706O388
$$ 74361 45164 19966 60609 -6373 -73491 -46732 -10237 -9488 15192 -2700 4006 10394
16661A0394k0204m6511j3085j1094L1967N688j4290O086O345M1575k7513r3707
$$ 10394 -9810 -56321 -69406 -80500 -48533 -42845 -57135 -51049 -44704 -3129 -30642 -124349
16649a24349K2041O2862o597n662M2814K3681L2014k0505k7968L5967J4292j9094
$$ -124349 -102308 -39446 -46043 -51705 -8891 14790 46804 26299 -1669 34298 48590 29496
16637B9496n6010l9035K3164P2888j3907l3646Q933L8476L2681n4132j03331m3649
$$ 29496 -26514 -65549 -42385 30503 16596 -17050 -8117 30359 63040 8908 -94423 -138072
16625a38072k6983P9834O2804J9766N9973r31k5799j7113l9896q352K1072q700
$$ -138072 -165055 -85221 -22417 -2651 57322 56391 30592 13479 -26417 -34769 -13697 -22397
16613b2397n456K2658Q2661J0076m8475m6685n5307n2180J9750L6336O4907j4656
$$ -22397 -27853 -5195 77466 87542 39067 -7618 -62925 -115105 -95355 -59019 5888 -8768
16601h768l7381J5179L652j5132N020K4283P423O0263M2440p5224k7794j8105
$$ -8768 -46149 -30970 -27318 -42450 -37430 -13147 -5724 54539 96979 21755 -6039 -24144
16589b4144k8177L3848k4495j5576M5j5223k6881K80N8014M162j728R1011J6264
$$ -24144 -52321 -18473 -42968 -58544 -58499 -73722 -100603 -100323 -42309 -38147 -39875 51136 67400
16576F7400n1189M029L1326P031J761L4883M3939q2116m6762p4210j0272Q9981
$$ 67400 16211 20240 51566 58597 60358 95241 139180 57064 10302 -63908 -74180 15801
16564A5801j0217q164q5424o1047M7837O4754L5989j2265j7363j1913o549m9k9819
$$ 15801 5584 -2580 -88004 -149051 -101214 -36460 -471 -12736 -30099 -42012 -48561 -48610 -78429
16551g8429K4499L69m3036L019K3817K8862M8880K7787o2775l5459K2344L6122
$$ -78429 -53930 -53561 -96597 -93578 -69761 -40899 7981 35768 -27007 -62466 -40122 -4000
16539d000L5075K6569l3805j3299j352k950k6579l133N6732q964l1687k1467k775
$$ -4000 31075 57644 23839 10540 9188 6238 -20341 -23474 33258 24294 -7393 -28860 -31635
16526c1635J2420K649K0021j384O6267L037L157J0446k4942K1752J3356K7830
$$ -31635 -19215 -16566 3455 2071 68338 71375 74532 84978 60036 81788 95144 122974
16514A22974o6931j00834P134J4004j0426M5100J4450o1299p3943j6355J3784
$$ 122974 56043 -44791 -37657 -23653 -34079 11021 25471 -35828 -109771 -126126 -112342
16503a12342Q6783O6144J6470j5829j4876j2184L3757l5286m7310K8175M2128
$$ -112342 -25559 40585 57055 41226 26350 14166 47923 12637 -34673 -6498 35630
16492C5630N1849p2672o0710m919J3971l6215l7346J6336N9114L5477j2736m6754
$$ 35630 87479 14807 -45903 -50822 -36851 -73066 -110412 -94076 -34962 515 -12221 -58975
16480e8975j702J2387L7625M0880n3131j8930L885l528P213L8055m2447m0195
$$ -58975 -60677 -48290 -10665 30215 -22916 -41846 -37961 -41489 -34276 3779 -38668 -78863
16468g8863L4400N6979K6659r1089K8564J2277l0631J5021Q166k5028M1830l659
$$ -78863 -44463 12516 39175 -51914 -23350 -11073 -41704 -26683 -18517 -43545 -1715 -5374
16456e374n6950K350K2591R929L0615K6061m080J2217J4412k7637o0901l4307
$$ -5374 -62324 -59974 -37383 -27454 3161 29222 25142 37359 51771 24134 -36767 -71074
16444g1074k1468L1982N2732j1782l2232j1358J2191R1485K5899k8488j7140n8635
$$ -71074 -92542 -60560 -7828 -19610 -51842 -63200 -51009 40476 66375 37887 20747 -37888
16432c7888r221n0281K3486K6850R21m2019K2677M9837k1971q466L0190k1191
$$ -37888 -47109 -97390 -73904 -47054 -46133 -88152 -65475 -15638 -37609 -46075 -15885 -37076
16420c7076M280L2382L7795L6939P63j3438l5132K0658k3304J7911O3559j2188
$$ -37076 -32796 -414 37381 74320 75083 61645 26513 47171 23867 41778 105337 93149
16408I3149k2438j5988m2155n6648k136J5042P6247R990o6498m8269R8054J4103
$$ 93149 70711 54723 12568 -44080 -46216 -31174 45073 55063 -11435 -59704 38350 52453
16396E2453l6635j3508L5158m3737n0320j1597O6025n2736J983Q1677M1365p218
$$ 52453 15818 2310 37468 -6269 -56589 -68186 -2161 -54897 -52914 28763 70128 62910
16384F2910o848m7000j1548o027m4330l7579J2932K6456k2650L7487L5275k8490
$$ 62910 56062 9062 -2486 -8513 -52843 -90422 -77490 -51034 -73684 -36197 -922 -29412
16372b9412k6656Q54L3153m278m6185L7912J7841j039M0805m6337l3258K9812
$$ -29412 -56068 -55214 -22061 -26339 -72524 -34612 -16771 -17810 22995 -23342 -56600 -26788
16360b6788N0232P795K8565N1940m3235l9425J5565J995j72j2698j7216J7916
$$ -26788 23444 31239 59804 111744 68509 29084 44649 46644 46472 33774 16558 34474
16348C4474L2456o5622j1776M8919M689l1736o8001p786O6018l6820K6324K6164
$$ 34474 66930 1308 -10468 38451 43140 11404 -56597 -64383 1635 -35185 -8861 17303
16336A7303L018o0469o267k760J4181J0352l9757k0367j1976J5048n261Q1737
$$ 17303 20321 -40148 -46415 -49175 -34994 -24642 -64399 -84766 -96742 -81694 -86955 -5218
16324e218p2l2425J1350l108m696K8498K5036M1458k0778q1204j2837R149L3884
$$ -5218 -5290 -37715 -26365 -29473 -34169 -5671 19365 60823 40045 -41159 -53996 -44847 -10963
16311a0963J5649J9386O025j6270K0447o3080o7932n66L0494m882l1177o1696
$$ -10963 4686 24072 30097 13827 34274 -28806 -96738 -97304 -66810 -71692 -102869 -164565
16299a64565n6784Q6608P6462K7593K0719N7629l8081k5829q113P1040K358k4527
$$ -164565 -221349 -134741 -58279 -30686 -9967 47662 9581 -16248 -24361 46679 49037 24510
16287B4510p8147m7070j1257N5328L9522K0742n206k3445k0492K3128L4723j2425
$$ 24510 -53637 -100707 -111964 -56636 -17114 3628 -1578 -25023 -45515 -22387 12336 -89
16275h9O224l1686L9135J9306j597l6192L4165o6391j1388J1693L6673O628j3339
$$ -89 6135 -25551 13584 32890 31293 -4899 29266 -37125 -48513 -36820 -147 6481 -6858
16262f858K9105l0510j4120n764J3631j5708K2758O3557j144J7565k2369j1756
$$ -6858 22247 -8263 -22383 -28147 -14516 -30224 -7466 56091 54947 72512 50143 38387
16250C8387j2253p111o25L2363N961j2846j7793n5936N514j9194j897l3291K1979
$$ 38387 26134 19023 18398 50761 56722 43876 26083 -29853 -24339 -43533 -45430 -78721 -56742
16237e6742j6373m7698J3675K5334l1091Q578o1055N2664P8265M3051r080J5901
$$ -56742 -73115 -120813 -107138 -81804 -112895 -104317 -165372 -112708 -34443 8608 -472 15429
16225A5429mQ804r559p072K4954J8585r36k6609m2045j9599N5986L4114m6789
$$ 15429 15425 24229 14670 7598 32552 51137 50201 23592 -18453 -38052 17934 52048 5259
16212E259o4778M728L4769j7189J7471J7233j6857K2477J06135L1022L040k602
$$ 5259 -59519 -54791 -20022 -37211 -19740 -2507 -19364 3113 109248 140270 143310 140708
16200A40708m3789r1551q9055k3486Q782M061L9684o8204p5670J3678Q2124M2622
$$ 140708 96919 5368 -83687 -107173 -98391 -94330 -54646 -122850 -198520 -184842 -102718 -60096
16188f0096M3927L9654J8747k4330m5052K6415l1947j8797l253O9920L5422P598
$$ -60096 -16169 23485 42232 17902 -27150 -735 -32682 -51479 -54732 15188 50610 58208
16176E8208n2912Q47q3036m3821M5471J0060J8476l497J7289J3943j126j008j3674
$$ 58208 5296 6143 -76893 -120714 -75243 -65183 -46707 -50204 -32915 -18972 -20098 -21106 -34780
16163c4780k2026K4676N3760P540k0506L7590n0602j669L6995J6367L4980o8256
$$ -34780 -56806 -32130 21630 29170 8664 46254 -4348 -6017 30978 47345 82325 14069
16151A4069l142R077m6113m4264r221M2812m4250M6142Q741j1852K1630n2200
$$ 14069 10927 20004 -26109 -70373 -79594 -36782 -81032 -34890 -26149 -38001 -16371 -68571
16139f8571k2852J09222P5508L9172J9180q8911j07597k5701N5422M0771j7797
$$ -68571 -91423 17799 93307 132479 151659 62748 -44849 -70550 -15128 25643 7846
16128G846k3267k6413N3008M7078L293L3703M745j3313k6562K9914k8080j4685
$$ 7846 -15421 -41834 11174 58252 61545 95248 99993 86680 60118 90032 61952 47267
16116D7267k1381l5850n2918J0627M5225j2040k5301L6537L8668q591j6016M3637
$$ 47267 25886 -9964 -62882 -52255 -7030 -19070 -44371 -7834 30834 22243 6227 49864
16104D9864J8814l2978j8833L5320j8047R180M2352r1019m3614M6173j2676j9897
$$ 49864 68678 35700 16867 52187 34140 43320 85672 -5347 -48961 -2788 -15464 -35361
16092c5361l8580M8345o354l6221J9161L7100l421j1208j0977Q016l7069l1554
$$ -35361 -73941 -25596 -31950 -68171 -49010 -11910 -15331 -26539 -37516 -29500 -66569 -98123
16080i8123k634L3400L8941O5231O4754Q188p5394l9489l2872J2039k0330K6859
$$ -98123 -100757 -67357 -28416 36815 101569 109757 34363 -5126 -37998 -25959 -46289 -19430
16068a9430L9212l0786k9277K0126N3169K5636L2494m7860m9796n1297o158N961
$$ -19430 19782 -11004 -40281 -20155 33014 58650 91144 43284 -6512 -57809 -63967 -58006
16056e8006L1235K3046n898o446O2710O5274Q078J6183j11401n6889L8002N3129
$$ -58006 -26771 -3725 -9623 -16069 46641 111915 119993 136176 24775 -32114 5888 59017
16044E9017k7505j7945q349K9508m9202j1151N0968K3669k7369k3775M4227J1855
$$ 59017 31512 13567 5218 34726 -14476 -25627 25341 49010 21641 -2134 42093 53948
16032E3948Q67R425k8000K7432K7774R589J876o910J0704m5640r5829Q502K2231
$$ 53948 54815 64240 36240 63672 91446 101035 102911 96001 106705 61065 -34764 -26262 -4031
16019d031J2269k3133o749N7992N955p3879q48j959M2387j7216l3865p687K5591
$$ -4031 8238 -14895 -21644 36348 42303 -31576 -32424 -34383 8004 -9212 -43077 -50764 -25173
16006b5173q245m7927L5706m879j589R940J6885j0286J2542M6889j247J5459J6504
$$ -25173 -33418 -81345 -45639 -50518 -52107 -42167 -25282 -35568 -23026 23863 22616 38075 54579
15993E4579n872n4678j8430j5007k3045R353P2897r49k5363l0833M1537R151N067
$$ 54579 48707 -5971 -24401 -39408 -62453 -53100 19797 18848 -6515 -37348 4189 13340 18407
15980A8407k3767N7187K1570o9404K7410k1670r2387J6167k3713J1806l1968M8116
$$ 18407 -5360 51827 73397 3993 31403 9733 -82654 -66487 -90200 -78394 -110362 -62246
15968f2246l4241j594l238k856K9750P0633J9819j0771j2123J4312p445K4259
$$ -62246 -96487 -98081 -101319 -104175 -74425 -3792 16027 5256 -6867 7445 0 24259
15956B4259N0299m5326n9445J1105Q0164N181J5531m753o4149m5237l0740j1642
$$ 24259 74558 29232 -30213 -19108 61056 66237 81768 77015 12866 -32371 -63111 -74753
15944g4753M9112m071k3815j3146K5247k7624j2671N391l9043k5561M4336O0607
$$ -74753 -25641 -29712 -53527 -66673 -41426 -69050 -81721 -76330 -115373 -140934 -96598 -35991
15932c5991L737m0410n7815N3341M5016O0867J6392q2571m1592O5487M4466J0323
$$ -35991 -32254 -72664 -130479 -77138 -32122 28745 45137 -37434 -79026 -13539 30927 41250
15920D1250k450J290M4927l756l5155k3183M9573q920o0815m3520l4902K2039
$$ 41250 38800 40090 85017 81261 46106 22923 72496 63576 2761 -40759 -75661 -53622
15908e3622M8454J4865n8440O970r976J0659M005k089M3042O0328k5697K0944
$$ -53622 -5168 9697 -48743 -41773 -51749 -41090 -37085 -39174 3868 64196 38499 59443
15896E9443n3284j9533m5966k2942M1191n1759K3491O3188k7698K9555r795o2028
$$ 59443 6159 -13374 -59340 -82282 -41091 -92850 -69359 -6171 -33869 -4314 -14109 -76137
15884g6137j5703k4444K2184N0398K7407J1647L6642k7207j6204p954l1385o270
$$ -76137 -91840 -116284 -94100 -43702 -16295 -4648 31994 4787 -11417 -19371 -50756 -57026
15872e7026p869L4272J7851L9570J5959k0799j4151m0409k5267j6311N7727K5829
$$ -57026 -64895 -30623 -12772 26798 42757 21958 7807 -32602 -57869 -74180 -16453 9376
15860I376K0501j8834p3073l1641J3416L8336J1111K9426l1394o4024j1547O2273
$$ 9376 29877 11043 -62030 -93671 -80255 -41919 -30808 -1382 -32776 -96800 -108347 -46074
15848d6074J8891J7880j0767l4857j586N6989L6849j9598Q381K6637o135k1233
$$ -46074 -27183 -9303 -20070 -54927 -56513 476 37325 17727 26108 52745 46610 25377
15836B5377o1263o3937q072O2351K1925O9972L7188n8225l2984k131K2025O10
$$ 25377 -35886 -99823 -107895 -45544 -23619 46353 83541 25316 -7668 -9799 12226 12836
15824A2836p408N9340N7725P009J0734p8560l2065K6092J4564j7402M208L1193
$$ 12836 5428 64768 122493 129502 140236 61676 29611 55703 70267 52865 57073 88266
15812H8266l1184l5982J3721K3463r179j7191M8221p107p217J2634l7460n1465
$$ 88266 57082 21100 34821 58284 49105 31914 80135 73028 65811 78445 40985 -10480
15800a0480m1492O960p636M588K3940M2246n9318m8288J8552M422L974L2850K4558
$$ -10480 -51972 -45012 -52648 -48060 -24120 18126 -41192 -89480 -70928 -66506 -62532 -29682 -5124
15787e124J06n995J5785L5208j9556k1757n198L5907l719m3934J2208N7417l7725
$$ -5124 -5018 -11013 4772 39980 20424 -1333 -6531 29376 25657 -18277 -6069 51348 13623
15774A3623l6493o4925M657r183K8379J5394M9291M964L0235l8299J4700M5830
$$ 13623 -22870 -87795 -83138 -92321 -63942 -48548 743 5707 35942 -2357 12343 58173
15762E8173j797K6322R828K8557l9955j790r4848o7494J1850R658l2605N977O006
$$ 58173 56376 82698 92526 121083 81128 79338 -15510 -83004 -71154 -61496 -94101 -88124 -82118
15749h2118M2258M7584l220l7657m2605Q0087R0057J355r2816K63K807M882q37
$$ -82118 -39860 7724 4504 -33153 -75758 4329 94386 95741 2925 3188 5995 10877 10040
15736A0040L6856K3127J2101K8692J5544o4969l5393M633K3081j7987Q0494L5072
$$ 10040 46896 70023 82124 110816 126360 61391 25998 30631 53712 35725 116219 151291
15724A51291l2412p0398o3837n8405r374M4087R4347K1591p9982j1631P0526n6341
$$ 151291 118879 48481 -15356 -73761 -83135 -39048 55299 76890 -3092 -14723 55803 -538
15712e38q8035k7780J9630q461O148L3033L1973j7791k7002L1347M3388l1900
$$ -538 -88573 -116353 -96723 -105184 -99036 -66003 -34030 -51821 -78823 -47476 -4088 -35988
15700c5988n7383J3528P2296k4645n794L8729J8445p6717m8599L4179n718K1144
$$ -35988 -93371 -79843 -7547 -32192 -37986 743 19188 -57529 -106128 -71949 -77667 -56523
15688e6523N6814N793j7534m2463N5034N5340j8332m0226j3648Q304J8831J6571
$$ -56523 291 6084 -11450 -53913 1121 56461 38129 -2097 -15745 -7441 11390 27961
15676B7961l2402q642l7044K0964k5876n2555l9652N5952K5921j5329m612K8958
$$ 27961 -4441 -13083 -50127 -29163 -55039 -107594 -147246 -91294 -65373 -80702 -85314 -56356
15664e6356L9808L4363J5319n7291k4603Q4997k7456n8487J1689M2040J2244j08
$$ -56356 -16548 17815 33134 -24157 -48760 36237 8781 -49706 -38017 4023 16267 16159
15652A6159j3998k5109L6895P634J2596j1816n7520l1193j5817K8358J07021M8313
$$ 16159 2161 -22948 13947 21581 34177 22361 -35159 -66352 -82169 -53811 53210 101523
15640A01523O827j3374k5666m8547n3865M984K7591K0647J9442j2672M4075o5795
$$ 101523 108350 94976 69310 20763 -33102 -28118 -527 20120 39562 26890 70965 5170
15628E170p1381l280K5247k0833L305J4607j5328J0359k559M2826K1767L9366
$$ 5170 -66211 -69491 -44244 -65077 -61772 -47165 -62493 -52134 -54693 -11867 9900 49266
15616D9266K6213q842k3379j7434O944l8714k3279L6672k0889l5662J7034l164
$$ 49266 75479 66637 43258 25824 32768 -5946 -29225 7447 -13442 -49104 -32070 -35234
15604c5234N2862K4422o847k6929j3056P9777K8324m0768j00181k7802O1910K4005
$$ -35234 17628 42050 35203 8274 -4782 74995 103319 62551 -37630 -65432 -3522 20483
15592B0483q638l4222M1372J7075K891l8860l9010k802l9476j1050O0755K8950
$$ 20483 11845 -22377 18995 36070 38961 101 -38909 -41711 -81187 -92237 -31482 -2532
15580b532L0042m2795n9196J8923n399q689K0129M3428J0387N2640m6686j5572
$$ -2532 27510 -15285 -74481 -55558 -60957 -69646 -49517 -6089 4298 56938 10252 -5320
15568e320k734j4619M3251N0191J258K5180m555o425j3151o2053o3418K6774j4072
$$ -5320 -8054 -22673 20578 70769 72027 97207 92652 86227 73076 11023 -52395 -25621 -39693
15555c9693L6332K7916p0237r066K2489K2471K359M6739J3445m6183l3728k975
$$ -39693 -3361 24555 -45682 -54748 -32259 -9788 -7429 39310 52755 6572 -27156 -30131
15543c0131j5586P224Q7979j2534q9854n9253j9420M3329Q3954O9432l9666l632
$$ -30131 -45717 -38493 49486 36952 -52902 -112155 -131575 -88246 -4292 65140 25474 21842
15531B1842j3117k8670M9026J3920n6569n7724j3570O0969R3717M3261m6920n3740
$$ 21842 8725 -19945 29081 43001 -13568 -71292 -84862 -23893 69824 113085 66165 12425
15519A2425m0599l1092K1129J4040O3835l123L1686R036k9139K4828k8697m6146
$$ 12425 -28174 -59266 -38137 -24097 39738 36615 68301 77337 48198 73026 44329 -1817
15507a817O811o9938K6672M4516O856J7044q11m4466l3164K2403Q4636O5970m3472
$$ -1817 4994 -64944 -38272 6244 13100 30144 29333 -15133 -48297 -25894 58742 124712 81240
15494H1240l3477L366n755j3668p019k5157j9371N1700J7396n4824n9313j0466
$$ 81240 47763 51129 45374 31706 24687 -470 -19841 31859 49255 -5569 -64882 -75348
15482g5348Q7804R3832n3669l6321N658k3865l8818K879O6911J8749l5001j1774
$$ -75348 12456 106288 52619 16298 21956 -1909 -40727 -37848 29063 47812 12811 1037
15470A037j2265n801K1904L6756K2239m7460m1063j3380l1738P404L4109M9075
$$ 1037 -11228 -17029 4875 41631 63870 16410 -24653 -38033 -69771 -62367 -28258 20817
15458B0817K2624J7018Q027m883J6101l8588q8698j1756K2824R4315L3397n2106
$$ 20817 43441 60459 68486 63603 79704 41116 -47582 -59338 -36514 57801 91198 39092
15446C9092N641L6270J3774k8583L5305J4081o7824p0448R816n827N182L7481
$$ 39092 44733 81003 94777 66194 101499 115580 47756 -22692 -12876 -18703 -13521 23960
15434B3960m0002k3564K9459L5665j9514L8188L438j6942j8950o986r80M7269
$$ 23960 -16042 -39606 -10147 25518 6004 44192 47630 30688 11738 4752 3772 51041
15422E1041k6004m2687n2938J570P9988M86Q823N991L1723r839l9746k4498r46
$$ 51041 25037 -17650 -70588 -69018 10970 11456 20279 26270 57993 48154 8408 -16090 -17036
15409a7036j3774m1342N784j7551k0973M0909Q201m8246k3731O509M5425M7980
$$ -17036 -30810 -72152 -66368 -83919 -104892 -63983 -55782 -104028 -127759 -121250 -75825 -27845
15397b7845M3256M2798J7759K6714m5769r9279N474J8644r552J5095L4907k6263
$$ -27845 15411 58209 75968 102682 56913 -42366 -36892 -18248 -27800 -12705 22202 -4061
15385d061j2838l1562o413J3684K0374p41J8757K4821K4581j4091k7663J4941
$$ -4061 -16899 -48461 -54874 -41190 -20816 -21557 -2800 22021 46602 32511 4848 19789
15373A9789L7254o436j0295O20l3414k2056m1721k3379K8072j2745M4135j6141
$$ 19789 57043 50607 40312 40932 7518 -14538 -56259 -79638 -51566 -64311 -20176 -36317
15361c6317j03978l7965K3600K6335P2691J13790M0320m6836k6944j0615K985
$$ -36317 -140295 -178260 -154660 -128325 -55634 58156 98476 51640 24696 14081 17066
15350A7066O2901j1829n342j4511m7937n2342m1608N9572K0302j6477p4140Q637
$$ 17066 79967 68138 62796 48285 348 -51994 -93602 -34030 -13728 -30205 -104345 -95708
15338i5708n359J5103R4446M2406j5194J2835M8505l4606r609k4783j7282k4818
$$ -95708 -101067 -85964 8482 50888 35694 48529 97034 62428 52819 28036 10754 -14064
15326a4064J2208k6491Q373M1761L1149j4287k3010j2509K0901q6931J7387M5471
$$ -14064 -1856 -28347 -19974 21787 52936 38649 15639 3130 24031 -62900 -45513 -42
15314d2m2456l523p381L772L0267j6144q0949J4709j7326K2827J06266Q6117l9599
$$ -42 -42498 -46021 -53402 -49630 -19363 -35507 -116456 -101747 -119073 -96246 10020 96137 56538
15301E6538n1888J0175o7649l2889o638n3899J655P7805M7587l8523J4618m477
$$ 56538 4650 14825 -52824 -85713 -92351 -146250 -144595 -66790 -19203 -57726 -43108 -47585
15289d7585J5665M8062J2943m7564k9205j5464L2347L92k7043J0323L4114K8225
$$ -47585 -31920 16142 29085 -18479 -47684 -63148 -30801 -30409 -57452 -47129 -13015 15210
15277A5210J1426o7483j7O2791L3581n6455k1700M8406J9238l2559j9629r004
$$ 15210 26636 -40847 -40864 21927 55508 -947 -22647 25759 44997 12438 -7191 -16195
15265a6195N6110j4777j2810o659J5770N0555k8879J7552j8231k1079M4808j0508
$$ -16195 39915 25138 12328 5669 21439 71994 43115 60667 42436 21357 66165 55657
15253E5657j16646k830L0312N9898j146K7744j471r93n3520p9288L2441O9154
$$ 55657 -60989 -63819 -33507 26391 25245 52989 51518 50525 -2995 -82283 -49842 19312
15241A9312J3390J681k1860j7434o975M3258L581m4139j3723K9903k2096k2039
$$ 19312 32702 34383 12523 -4911 -11886 31372 34953 -9186 -22909 6994 -15102 -37141
15229c7141r873j5310M7511R7281p8610l9979k2378K2444L696L3069J5459K6385
$$ -37141 -47014 -62324 -14813 82468 3858 -36121 -58499 -36055 -32359 710 16169 42554
15217D2554o2069k5493k6861l4555k7026j064M0726P0181O4411l66k3577o114
$$ 42554 -19515 -45008 -71869 -106424 -133450 -134514 -93788 -23607 40804 40438 16861 10747
15205A0747P509j9681k9606O50J6826J659K6048N49k5795N7601M7308M1405p1101
$$ 10747 18256 -1425 -31031 -30381 -13555 -11896 14152 14701 -11094 46507 93815 135220 64119
15192F4119k0721k3417l2361M2905P9284k1702n0071q2116o739M5110K2670Q621
$$ 64119 43398 19981 -12380 30525 109809 88107 38036 -44080 -50819 -5709 16961 25582
15180B5582k4034m9540J6252k8725M5435k397o285p213k6640J5677L6984L384
$$ 25582 1548 -47992 -31740 -60465 -15030 -17427 -23712 -30925 -57565 -41888 -4904 -1520
15168a520n020j747M0550l056J8314P7762m729J8289Q979p9393p0436J4258J2170
$$ -1520 -6540 -8287 32263 29207 47521 125283 120554 138843 147822 68429 -2007 12251 24421
15155B4421j7221m0965k472K5253k5649r409K472l835o4703L3593M4140K4206
$$ 24421 7200 -33765 -36237 -10984 -36633 -46042 -43570 -47405 -112108 -78515 -34375 -10169
15143a0169j1550j1222j2165J4548L3305m2998j3225J7155K8836K5260J7273J9851
$$ -10169 -21719 -32941 -45106 -30558 2747 -40251 -53476 -36321 -7485 17775 35048 54899
15131E4899M145J4908m2350n3784r4496P159K4249j9454M644R364K4261K7116
$$ 54899 59044 73952 31602 -22182 -116678 -109519 -85270 -104724 -100080 -90716 -66455 -39339
15119c9339M0659q551P410k3899n769j1108p2699m7878J02206J33109m2702q0789
$$ -39339 1320 -7231 179 -23720 -29489 -40597 -113296 -161174 -58968 74141 31439 -49350
15107d9350k5397J0973P0391K9291m3988n9403K4114N8033M7486p575n9379J7718
$$ -49350 -74747 -63774 6617 35908 -8080 -67483 -43369 14664 62150 54575 -4804 12914
15095A2914n6481o0163m1370M9689L4489Q243l8816J0655K0629n254K565k2415
$$ 12914 -43567 -103730 -145100 -95411 -60922 -52679 -91495 -80840 -60211 -65465 -62900 -85315
15083h5315O78L9636n863J6551k2267k8450n312r04L3412J8911j427J9696M3464
$$ -85315 -84637 -45001 -50864 -34313 -56580 -85030 -90342 -91246 -57834 -38923 -40350 -20654 22810
15070B2810l620k2003N586o0094O937L8640K2296n3120o1018o0790J8588O9477
$$ 22810 19190 -2813 2773 -57321 -50384 -11744 10552 -42568 -103586 -164376 -145788 -76311
15058g6311L2666N199j5158p236L8156O2454M0066o7203p1418O539O3990K7174
$$ -76311 -43645 -38446 -53604 -60840 -22684 39770 79836 12633 -58785 -52246 11744 38918
15046C8918J1357k7365l5148l3376J7423J5666m4547R299O1929J1386l282J5966
$$ 38918 50275 22910 -12238 -45614 -28191 -12525 -57072 -47773 14156 25542 22260 38226
15034C8226p2815k5263M8612L5507K9973j6008m0648K7451j0770j9438N6L9512
$$ 38226 -34589 -59852 -11240 24267 54240 38232 -2416 25035 14265 -5173 -5117 34395
15022C4395J5801j3995m6920J8360O879J0681r814J7079K3533N4196j4006q5880
$$ 34395 50196 36201 -10719 7641 14520 25201 15387 32466 55999 110195 96189 10309
15010A0309j9841k1834n322J4400J6151j7691L4264L430M7367p665R242o001j7226
$$ 10309 -9532 -31366 -36688 -22288 -6137 -23828 10436 13866 61233 53568 62810 56809 39583
14997C9583J6447k8995n563J5618K236M2033L2855m7385l2499L7826j9704l320
$$ 39583 56030 27035 21472 37090 39326 81359 114214 66829 34330 72156 52452 49132
14985D9132L3714K4308j661o4657o0809J7112K3794J0913j4862M2460K6986j3437
$$ 49132 82846 107154 105493 40836 -19973 -2861 20933 31846 16984 59444 86430 72993
14973G2993m1107j2963L2809N0633J3004l7014o3659j7035M7130O96m3351M791
$$ 72993 31886 18923 51732 102365 115369 78355 14696 -2339 44791 45487 2136 6927
14961F927K1973k3093j6015q0515N1693J9705K574J6804k716O3536J1215j2859
$$ 6927 28900 5807 -10208 -90723 -39030 -19325 -16751 53 -2663 60873 72088 59229
14949E9229J7793q815J3078j9324o0185N039M1009o4221j0997j8876R721K2199
$$ 59229 77022 68207 81285 61961 1776 6815 47824 -16397 -27394 -46270 -36549 -14350
14937a4350j1178K6229M441j4643k5065j2738l3995n561L9663j826K7582R30q2775
$$ -14350 -25528 701 5142 -9501 -34566 -47304 -81299 -86860 -47197 -49023 -21441 -20511 -103286
14924a03286R388J7523j3816k4249J9035M5880O2342M2752j2794k9547l214k9711
$$ -103286 -93898 -76375 -90191 -114440 -95405 -49525 12817 55569 42775 13228 10014 -19697
14912a9697p7941K2411L7079P5618K2429l4346k3003O8116M4877L2658p5293m8982
$$ -19697 -97638 -75227 -38148 37470 59899 25553 2550 70666 115543 148201 72908 23926
14900B3926j9452j4438n7535N8187J3214l9625J8508j9664M8443K7949r6130M0878
$$ 23926 4474 -9964 -67499 -9312 3902 -35723 -17215 -36879 11564 39513 -56617 -15739
14888a5739K2086L0827K7467J0305l2121j4084j2476r6726q659L1781M8109M4895
$$ -15739 6347 37174 64641 74946 42825 28741 16265 -80461 -89120 -57339 -9230 35665
14876C5665L8583l125m5425J4966J2833n709M2198O8469Q620N627k7982n9154
$$ 35665 74248 71123 25698 40664 53497 47788 89986 158455 167075 172702 144720 85566
14864H5566l7693m002p5031o413R2533k2687k6095J1957n208m0549J0101M3795
$$ 85566 47873 43871 -31160 -37573 54960 32273 6178 18135 12927 -27622 -17521 26274
14852B6274L2799k4640l4716o2176k5400L1970L7637n088n005j6822J0469K5580
$$ 26274 59073 34433 -283 -62459 -87859 -55889 -18252 -23340 -28345 -45167 -34698 -9118
14840i118m4597Q256J2180l841k1146n3192J4798O7431N4189k2419l4753M289
$$ -9118 -53715 -45459 -33279 -37120 -58266 -111458 -96660 -29229 24960 2541 -32212 -27923
14828b7923J9440n2144Q436L0263N1861j4317k4150K213k0856l2136L1182j2095
$$ -27923 -8483 -60627 -52191 -21928 29933 15616 -8534 -6321 -27177 -59313 -28131 -40226
14816d0226m9572n416J5237L0895N7990J0842j1491n7142o2605L0174J3854J6684
$$ -40226 -89798 -95214 -79977 -49082 8908 19750 8259 -48883 -111488 -81314 -67460 -50776
14804e0776J7960j5640m5273m4759K486l5011n2152M3047k7873R5688N0161K3380
$$ -50776 -32816 -48456 -93729 -138488 -136002 -171013 -223165 -180118 -207991 -112303 -62142 -38762
14792c8762Q4184M0137Q276n4500m0344N4380j586J155p8l052M6612n854l1260
$$ -38762 45422 85559 93835 39335 -1009 53371 51785 52940 52862 49810 96422 90568 59308
14779E9308j7026K1272N067n0747k7150l0677K0062M7449o042j9266j1585r040
$$ 59308 42282 63554 68621 17874 -9276 -39953 -19891 27558 21516 2250 -9335 -18375
14767a8375M3946k0338j5464P038j6941j6741l2758P2543O1705M6554q056m6874
$$ -18375 25571 5233 -10231 -3193 -20134 -36875 -69633 2910 64615 111169 103113 56239
14755E6239m4104o131K8757o729L5587L8716J4m2496q7412k6500L6914M3523n9964
$$ 56239 12135 6004 34761 28032 63619 102335 102349 59853 -27559 -54059 -17145 26378 -33586
14742c3586j1420L7214L9028k1424K9011J161n3673K4365J6097J0181k5143k2455
$$ -33586 -45006 -7792 31236 9812 38823 39984 -13689 10676 26773 36954 11811 -10644
14730a0644J7662K1031L8348m9353j29532l1781L5400O7997N9434M6115L0907
$$ -10644 7018 28049 66397 17044 -112488 -144269 -108869 -40872 18562 64677 95584
14719I5584l1493n2036m4217j6894N2507L7039m3510K5996k761P679K8265j5601
$$ 95584 64091 12055 -32162 -49056 3451 40490 -3020 22976 20215 27894 56159 40558
14707D0558J2820l3688r967l2027K042o091M4716N8408m0774N0257N670p2528
$$ 40558 53378 19690 9723 -22304 -20262 -26353 18363 76771 35997 86254 91924 19396
14695A9396k7919L581J9186K621m0991L0074M160J6294O1079K0569J1915n5834
$$ 19396 -8523 -4942 14244 16865 -24126 5948 10108 26402 87481 108050 119965 64131
14683F4131k1300K422K4722M277j3282r508R592n6218o0009q19M2504K9799J4476
$$ 64131 42831 45253 69975 74252 60970 51462 61054 4836 -55173 -55992 -13488 16311 30787
14670C0787j1986K1568j8767p385l1088m2070r794K2873j3399J8674L3215N368
$$ 30787 18801 40369 21602 14217 -16871 -58941 -68735 -45862 -59261 -40587 -7372 -2004
14658b004l1610m304R2952j136r051l698J5505l8279m0759n1277L6773q883m9025
$$ -2004 -33614 -37918 55034 53898 44847 41149 56654 18375 -22384 -73661 -36888 -45771 -94796
14645i4796N6095R82l69l2942k6342L4328L0961r943M4524m7431k5995j9705k3250
$$ -94796 -38701 -37719 -38088 -71030 -97372 -63044 -32083 -42026 2498 -44933 -70928 -90633 -113883
14632a13883L8074n0102J0384L8183K1599L1612L2070m4551m1702m7636L9177
$$ -113883 -75809 -125911 -115527 -77344 -55745 -24133 7937 -36614 -78316 -125952 -86775
14621h6775j2381K6572K3058l456j750j1171M213j7229P1064l2028j5006L3438
$$ -86775 -99156 -72584 -49526 -52982 -54732 -65903 -61690 -78919 -7855 -39883 -54889 -21451
14609b1451K74j1942K5885L7600M2530J9224j9549l3312k2208O728N11k2213k2752
$$ -21451 -21177 -33119 -7234 30366 72896 92120 72571 39259 17051 23779 24290 2077 -20675
14596b0675K594M4560J4417J4182M312J6362l5553m2631N191M445J03882N8882
$$ -20675 -18081 26479 40896 55078 59390 75752 40199 -2432 2759 7204 111086 169968
14584A69968q8969p6248R758K1375l2447L3383K9675K334Q752j4914j4516L5040
$$ 169968 80999 4751 14509 35884 3437 36820 66495 68829 77581 62667 48151 83191
14572H3191L237j1677L720m435J8090j2745k215l9995m1798m6509k5300L2504
$$ 83191 86428 74751 78471 74036 92126 79381 77166 37171 -4627 -51136 -76436 -43932
14560d3932n709j4474l5427L3375K7973J8517R8114J0531q6662o968R536j2894
$$ -43932 -49641 -64115 -99542 -66167 -38194 -19677 78437 88968 2306 -4662 4874 -8020
14548h020M3854Q694k3861p931N2714L5434j6566k9894l1549J8896K3027m672
$$ -8020 35834 44528 20667 12736 65450 100884 84318 54424 22875 41771 64798 60126
14536F0126q4072J9499K8927j3802l2310J663M3905P6219l938m1780j6651j7148
$$ 60126 -23946 -4447 24480 10678 -21632 -19969 23936 100155 96217 54437 37786 20638
14524B0638R401K7608J352j4392o454L4378k1741n6033L8616P7584J8901J2169
$$ 20638 30039 57647 58999 44607 38153 72531 50790 -5243 33373 110957 129858 142027
14512A42027n6929J257l7148m3039l764k7828p649Q9149P0987Q440m6943l8888
$$ 142027 85098 86355 49207 6168 2404 -25424 -33073 56076 127063 135503 88560 49672
14500D9672K6526K1606K3669k578m6656m4525N9203j2145K7893J9009j6476k2631
$$ 49672 76198 97804 121473 118895 72239 27714 86917 74772 102665 121674 105198 82567
14488H2567M2040L3908k8395k0754m4621N350R4932J885L0405J749k8126K35j4899
$$ 82567 124607 158515 130120 109366 64745 70095 165027 166912 197317 199066 170940 171175 156276
14475A56276l7581n389J6502K0189k5416m9782N1033M7498J3646k259n4213r0412
$$ 156276 118695 113306 129808 149997 124581 74799 125832 173330 186976 184717 130504 40092
14463D0092l8852l5004J433N9613M767L0579N3777J1003P611O288O2286p2330
$$ 40092 1240 -33764 -32331 27282 32049 62628 116405 127408 135019 141307 203593 131263
14451A31263n9754J2210J2167M1022j1344o656P2852K9619m8496j6948k5869j1660
$$ 131263 71509 83719 95886 136908 125564 118908 191760 221379 172883 155935 130066 118406
14439A18406k139l8204L6783L0062j0049L548k1425p909P5254n904K0805o922
$$ 118406 116267 78063 114846 144908 134859 138407 116982 109073 184327 178423 199228 192306
14427A92306m2250j9911M7539p562N2923J5640m9063k9559Q896o3179m6046K4598
$$ 192306 150056 130145 177684 170122 223045 238685 189622 160063 168959 105780 59734 84332
14415H4332L6390J3849L3546m3103K3602J8539n4123m6679L7814j0465N0916n0637
$$ 84332 120722 134571 168117 125014 148616 167155 113032 66353 104167 93702 144618 93981
14403I3981j6611n921J8830M9039N3317J1752j527k9103o5919R980L2233N115
$$ 93981 77370 71449 90279 139318 192635 204387 202860 173757 107838 117818 150051 155166
14391A55166p3352j9235N668l7072j5292j264K9522k375j1037p972l6731l5967
$$ 155166 81814 62579 68247 31175 15883 14619 44141 41766 30729 22757 -13974 -49941
14379d9941J5819J4894M4675M2230O7463j6842j5861j2086n453j2250M518j8947
$$ -49941 -34122 -19228 25447 67677 135140 118298 102437 90351 84898 72648 77166 58219
14367E8219l9443J4796M3507L7522m0573l2758j728N741j4466L6842l1466k2263
$$ 58219 18776 33572 77079 114601 74028 41270 39542 45283 30817 67659 36193 13930
14355A3930r249K6160k1197N095N7233O411r7791j659o302L9313L9377l6002K3342
$$ 13930 4681 30841 9644 14739 71972 78383 -19408 -21067 -27369 11944 51321 15319 38661
14342C8661N6357r460J1973J9890m4743Q347L2086j4735J150l8453j584P896j5168
$$ 38661 95018 85558 97531 117421 72678 81025 113111 98376 99526 61073 59489 67385 52217
14329E2217j4390p315m5866j8479r309M4388K0026r639n2218o121J0857O5392
$$ 52217 37827 30512 -15354 -33833 -43142 1246 21272 11633 -40585 -46706 -35849 29543
14317B9543O1876K4099k6795K7863n3251m3404J9344K6544L2105r30j2770k5742
$$ 29543 91419 115518 88723 116586 63335 19931 39275 65819 97924 96994 84224 58482
14305E8482l2321o8041r0079P9150N4919N914j4760O1223J0413m3260j8517N1929
$$ 58482 26161 -41880 -131959 -52809 2110 8024 -6736 54487 64900 21640 3123 55052
14293E5052j3570l1745k7260n0533j3076R7340N6194K47p5438l0118N4M3354K1886
$$ 55052 41482 9737 -17523 -68056 -81132 16208 72402 72649 -2789 -32907 -32853 10501 32387
14280C2387J4415K5167M3387j8005j9305J3655K3432K0003m6302o1075Q572n9805
$$ 32387 46802 71969 115356 97351 78046 91701 115133 135136 88834 27759 36331 -23474
14268b3474j6774J9053m0951K1346l1522J3025K7014K2711j275k6158j3436L9007
$$ -23474 -40248 -21195 -62146 -40800 -72322 -59297 -32283 -9572 -10847 -37005 -50441 -11434
14256a1434P561j6085K6493O1549j6686o4540o291o102m027J2512M830J1513K3887
$$ -11434 -3873 -19958 6535 68084 51398 -13142 -19433 -25535 -29562 -17050 -12220 -707 23180
14243B3180K8675Q979k1033m707K3215K5240j3844n5723L6611L2402j1230O42
$$ 23180 51855 60834 39801 35094 58309 83549 69705 13982 50593 82995 71765 72407
14231G2407N2691m8609n0712J7143O2410l4095m3655J1706K3396M2593j4903p5872
$$ 72407 125098 76489 25777 42920 105330 71235 27580 39286 62682 105275 90372 14500
14219A4500k4342l1203J1804J6971j8907Q1262L7750p4621k2755j3567O3312L7810
$$ 14500 -9842 -41045 -29241 -12270 -31177 50085 87835 13214 -9541 -23108 40204 78014
14207G8014l4687l1117j9099K7998K3935J4697J4130n9443L788M3184q887q679
$$ 78014 43327 12210 -6889 21109 45044 59741 73871 14428 18216 61400 52513 43834
14195D3834k7811l6287n424J6000P591M9506N6643l9424q1485K3277P5021l879
$$ 43834 16023 -20264 -25688 -9688 -2097 47409 104052 64628 -16857 6420 81441 77562
14183G7562L54j7913l1006l3152K0015l3567j3618N4193k6990k0443L8638K4229
$$ 77562 77916 60003 28997 -4155 15860 -17707 -31325 22868 -4122 -24565 14073 38302
14171C8302k6901L2831p7288l5073J3793M5773J1099l09j682M3603J2822l006
$$ 38302 11401 44232 -33056 -68129 -54336 -8563 2536 2227 545 44148 56970 53964
14159E3964j2213m4649m7069O08M9358M5415q8498l2436N046j3016J03621N8390
$$ 53964 41751 -2898 -49967 -49359 -1 45414 -43084 -75520 -70474 -83490 20131 78521
14147G8521m9120m9642r625l4669J643J2799m7871L4163N3890L5834m6088J095
$$ 78521 29401 -20241 -29866 -64535 -62892 -50093 -97964 -63801 -9911 25923 -20165 -19070
14135a9070n794k6184l9455J5485L7911k5324l3243N9608L5910M9487K8548l779
$$ -19070 -24864 -51048 -90503 -75018 -37107 -62431 -95674 -36066 -156 49331 77879 74100
14123G4100M8492q3233q4162M6503N7805L3111m7581p6687m552k663k6852k5757
$$ 74100 122592 39359 -44803 1700 59505 92616 45035 -31652 -36204 -38867 -65719 -91476
14111i1476k2238K9754L6095N6774L6702o1871l1660J9614q835P455N5039M8139
$$ -91476 -113714 -83960 -47865 8909 45611 -16260 -47920 -28306 -37141 -29686 25353 73492
14099G3492J3712n6197k3571k8158k4139L820m9278o112J0494K2037J7712M2221
$$ 73492 87204 31007 7436 -20722 -44861 -41041 -90319 -96431 -85937 -63900 -46188 -3967
14087c967L5709l4099j5595J2116L89M338K5746O3297l9722m9670k4748K7967
$$ -3967 31742 -2357 -17952 -5836 -5447 -1109 24637 87934 48212 -1458 -26206 1761
14075A761m5854m8848j0020O6592L6878k95M668k5351j6755J6659O737K5457R033
$$ 1761 -44093 -92941 -102961 -36369 509 214 4882 -20469 -37224 -20565 -13828 11629 20662
14062B0662j9679J0602k4459j7440J5127O3094M6224p1785j5636M1434M960l9230
$$ 20662 983 11585 -12874 -30314 -15187 47907 94131 22346 6710 48144 53104 13874
14050A3874r466m5775q7192M3495J7263j570N8109L3776K997J4639L950j1321
$$ 13874 4408 -41367 -128559 -85064 -67801 -69371 -11262 22514 25511 40150 44100 32779
14038C2779j218J5075o8281j4735j1033m543n3052r528J11463K9669Q536l8997
$$ 32779 31561 46636 -21645 -36380 -47413 -51956 -105008 -114536 -3073 26596 35132 -3865
14026c865k6242o960R791L9932j6273J013J3683o999K529Q411M6237q289r049
$$ -3865 -30107 -37067 -27276 12656 -3617 -2604 11079 4080 6609 15020 61257 52968 43919
14013D3919J1785J8465n5401l4578k2656m4941m7547n72P5924J04984j025Q239
$$ 43919 55704 74169 18768 -15810 -38466 -83407 -130954 -131526 -55602 49382 48357 56596
14001E6596k8328k2848n7719M961R8266K2686l3695Q848J7359l8466j6587K0836
$$ 56596 28268 5420 -52299 -47338 50928 73614 39919 48767 66126 27660 11073 31909
13989C1909L7509J5447m0110l9251J2137l6712l3314M396M4957O6632N842K4420
$$ 31909 69418 84865 44755 5504 17641 -19071 -52385 -47989 -3032 63600 69442 93862
13977I3862m0954P14j2853m727l5268K3170O558J4538m3322q891K6624j397J2257
$$ 93862 52908 53622 40769 36042 774 23944 30502 45040 1718 -7173 19451 18054 30311
13964C0311k6698k1830j3633J6873m503n3605l2810Q808K2795K4584M6544N2346
$$ 30311 3613 -18217 -31850 -14977 -19480 -73085 -105895 -97087 -74292 -49708 -3164 49182
13952D9182k0397n377O696j4924k591k9293o127k9060m3722O9025K1283k0323
$$ 49182 28785 23408 30104 15180 12589 -16704 -22831 -51891 -95613 -26588 -5305 -25628
13940b5628q145K4471L3745m581l0367l1627K270R554k2800j0116p398r668n274
$$ -25628 -33773 -9302 24443 19862 -10505 -42132 -39862 -30308 -53108 -63224 -70622 -80290 -85564
13927h5564j1624L5325N5140l640k6670J8319N4768Q8510l6315O778n0497m7375
$$ -85564 -97188 -61863 -6723 -10363 -37033 -18714 36054 124564 88249 95027 44530 -2845
13915b845K5274Q021k9564l2641O739N9402o65m7260m0191L6358L9354M8196J4278
$$ -2845 22429 30450 886 -31755 -25016 34386 33721 -13539 -53730 -17372 21982 70178 84456
13902H4456l5566m4862O7586P1737l4479K1902k5042j04337m43L7901n3937o1785
$$ 84456 48890 4028 71614 143351 108872 130774 105732 1395 952 38853 -15084 -76869
13890g6869j6870K4725Q7526j5024l5383n4540K673K0155J5716M217L3096J1073
$$ -76869 -93739 -69014 18512 3488 -31895 -86435 -83762 -63607 -47891 -43674 -10578 495
13878D95J6105N442l318M4851m6950l2056M4870K212M2058J1542m9182o3523n3260
$$ 495 16600 22042 18724 63575 16625 -15431 29439 31651 73709 85251 36069 -27454 -80714
13865h0714j9835J9027L2817k2429m8608Q081O1507J6070o0807n3929P6615P8898
$$ -80714 -100549 -81522 -48705 -71134 -119742 -111661 -50154 -34084 -94891 -148820 -72205 6693
13853F693L0687K5589l6933m9167k6933K0864K6018K8300j7505k309J5214M1329
$$ 6693 37380 62969 26036 -23131 -50064 -29200 -3182 25118 7613 5304 20518 61847
13841F1847k1980j15141m5945P9573K7546r0097l0088J7445l300p719K7570Q9746
$$ 61847 39867 -75274 -121219 -41646 -14100 -104197 -134285 -116840 -120140 -127859 -100289 -10543
13829a0543k4289J3588J2886p414Q4718M6262n3340J1086J4176k8330o1932k2601
$$ -10543 -34832 -21244 -8358 -15772 68946 115208 61868 72954 87130 58800 -3132 -25733
13817b5733L9158N1551M7775N104n8280n5697j2011L5234k0537n900p9581k4823
$$ -25733 13425 64976 112751 117855 59575 3878 -8133 27101 6564 664 -78917 -103740
13805a03740L7878O4245J2992j2103J6936k0278K29m954j3420q8724l5722k3706
$$ -103740 -65862 -1617 11375 -728 16208 -4070 -3841 -8795 -22215 -110939 -146661 -170367
13793a70367N7695O7729K4484L2788k182j2597p689p259K6870r856j0040l8490
$$ -170367 -112672 -44943 -20459 12329 10147 -2450 -10139 -17398 9472 -384 -10424 -48914
13781d8914M0639j9291k061J4124J724p271l5247k340K5193m3921l2798J6363
$$ -48914 -8275 -27566 -29627 -15503 -13779 -21050 -56297 -58637 -33444 -77365 -110163 -93800
13769i3800J5022L6743O387L5473m6763m5486P114L3768K5531J932J8809M356
$$ -93800 -78778 -42035 -35648 -175 -46938 -92424 -85310 -51542 -26011 -24079 -5270 -914
13757i14k9422k7731j3240k767P64j4414L5120O6386k9988L2K227n6478l5598
$$ -914 -30336 -58067 -71307 -74074 -73310 -87724 -52604 13782 -16206 -16174 -13947 -70425 -106023
13744a06023L2851K6570J6078l2467j7463O263M3362l8861k8536O0110J5308k2769
$$ -106023 -73172 -46602 -30524 -62991 -80454 -74191 -30829 -69690 -98226 -38116 -22808 -45577
13732d5577m4214J3412L9306k6849L1009R643o4979n2705O5868J3916l3668o3377
$$ -45577 -89791 -76379 -37073 -63922 -32913 -23270 -88249 -140954 -75086 -61170 -94838 -158215
13720a58215O2930P4473Q157J8219m825m3151m3739m6487m266N3417L7468N882
$$ -158215 -95285 -20812 -12655 5564 739 -42412 -86151 -132638 -136904 -83487 -46019 -40137
13708d0137L0480N4932J0122k8820p362K2158q0915m9606M9863k3419J901J542
$$ -40137 -9657 45275 55397 26577 19215 41373 -39542 -89148 -39285 -62704 -60803 -59261
13696e9261Q6273L8995m5039k9614K9603J5115k9738l8980L692L0278L4714J200
$$ -59261 27012 66007 20968 -8646 20957 36072 6334 -32646 -28954 1324 36038 37238
13684C7238j2063j5126n4230N1456M141k4785J5016L7051j1020r6274n5466K8190
$$ 37238 25175 10049 -44181 7275 11416 -13369 1647 38698 27678 -68596 -124062 -95872
13672i5872N1934L0344N6562j4488L3408M8226o3126n2061L572j8966J7925M0778
$$ -95872 -43938 -13594 42968 28480 61888 110114 46988 -5073 -1501 -20467 -2542 38236
13660C8236o5090m9385K4708j0674R807J3617K8846K3227m9876J2925P312P3581
$$ 38236 -26854 -76239 -51531 -62205 -52398 -38781 -9935 13292 -36584 -23659 -16347 57234
13648E7234K3726o799J337m2368k9166L0430n44o1543n9884L9709M9379k7183
$$ 57234 80960 74161 75498 33130 3964 34394 33850 -27693 -87577 -47868 1511 -25672
13636b5672j0354K0006J9879J2350J983J3683j9389N946O577j1384P5909J4753
$$ -25672 -36026 -16020 3859 16209 18192 31875 12486 18432 25009 13625 89534 104287
13624A04287m2718R919m5606j59924J0898R2009N4968P7282o711m7731k5774L5503
$$ 104287 61569 71488 25882 -134042 -123144 -31135 23833 101115 94404 46673 20899 56402
13612E6402Q356J1101L1815n3333r0161L8413P0390j0747j900o904o0504m5304
$$ 56402 64758 75859 107674 54341 -35820 2593 72983 62236 60336 53432 -7072 -52376
13600e2376l903O158L8829l1700L1985j653j2969k2154L8919k3942k7628q003
$$ -52376 -56279 -50121 -11292 -42992 -11007 -12660 -25629 -47783 -8864 -32806 -60434 -68437
13588f8437O9925n1529r198K1259M3083j9780m3531Q894O9687O5952L6505k994
$$ -68437 1488 -50041 -59239 -37980 5103 -14677 -58208 -49314 20373 86325 122830 119836
13576A19836j3327n5221l2364P0017j244m1265j5466N865Q55l8646m938P3825
$$ 119836 106509 51288 18924 88941 87697 46432 30966 36831 37686 -960 -5898 67927
13564F7927L9416L377n1958j3242L1206O882j2988k5121N215J1417j7388k6231
$$ 67927 107343 110720 58762 45520 76726 83608 70620 45499 50714 62131 44743 18512
13552A8512k3759m663Q837O7596J4863m7168K3025l60J3752N3910K0980l4319
$$ 18512 -5247 -9910 -1073 66523 81386 34218 57243 56883 70635 124545 145525 111206
13540A11206o6337n3472K1084K5339m7871j11669N809L5642N3726L1148j6212
$$ 111206 44869 -8603 12481 37820 -10051 -121720 -115911 -80269 -26543 4605 -11607
13529a1607k977J397k673K5171o1190N7472N8796m9557K7601k436p7580o7106
$$ -11607 -14584 -13187 -15860 9311 -51879 5593 64389 14832 42433 39997 -37583 -104689
13517a04689m0214J0020N2359L0709N6507N2630j9867k4n9745j8696P8667M8609
$$ -104689 -144903 -134883 -82524 -51815 4692 57322 37455 37431 -22314 -41010 37657 86266
13505H6266p236n3127k5762K717J4414p611k7954n1305K3956m703J0574N6585
$$ 86266 79030 25903 141 2858 17272 9661 -18293 -69598 -45642 -50345 -39771 16814
13493A6814K8608k8371j2141k5871k5957J3855Q2542j7281N9997O0882O12l3477
$$ 16814 45422 17051 4910 -20961 -46918 -33063 49479 32198 92195 153077 153689 120212
13481A20212k954n8168n3122k2863j8869p546M0407K6129J7680J0120L2155J8331
$$ 120212 117258 59090 5968 -16895 -35764 -43310 -2903 23226 40906 51026 83181 101512
13469A01512k0768l2829m0622K1820J6105K23L6141k0033m1106J0351M3770n2593
$$ 101512 80744 47915 7293 29113 45218 45441 81582 61549 20443 30794 74564 21971
13457B1971j2404K9305J3224l3366n6782j2017l472K3966L7740j4595J5522J8813
$$ 21971 9567 38872 52096 18730 -38052 -50069 -53541 -29575 8165 -6430 9092 27905
13445B7905j1752J3959J283k3407K998j153K1965K9235Q644p3294l6773M8481
$$ 27905 16153 30112 31395 7988 10986 9833 31798 61033 69677 -3617 -40390 8091
13433H091K6918m3336m0884m2210M1708J8574J6035n7091j4308L0103K6935K2961
$$ 8091 35009 -8327 -49211 -91421 -49713 -31139 -15104 -72195 -86503 -56400 -29465 -6504
13421f504L1375P002n3278p0136l3658J9018p199J4573M6848M9286M2190J2243
$$ -6504 24871 31873 -21405 -91541 -125199 -106181 -113380 -98807 -51959 -2673 39517 51760
13409E1760o3975k3080k42l6038n2476n6886Q4839P9783K0777j2273K2603q316
$$ 51760 -12215 -35295 -35537 -71575 -124051 -180937 -96098 -16315 4462 -7811 14792 6476
13397F476k8916K7827j012l580O4866N306q1728l5712k0086J4259K9376L4896
$$ 6476 -22440 5387 4375 795 65661 70967 -10761 -46473 -66559 -52300 -22924 11972
13385A1972K3186L2181m8385p0435K5191O5351M537q5794l7607r723J4872Q7470
$$ 11972 35158 67339 18954 -51481 -26290 39061 43598 -42196 -79803 -89526 -74654 12816
13373A2816j3157M6101M2533r9595n0231j11107O653O1377O88O8584L3474j6215
$$ 12816 -341 45760 88293 -11302 -61533 -172640 -165987 -104610 -103922 -35338 -1864 -18079
13361a8079k7537K464M4023K5991N122l985J2960j4236l3361L1569K649n6174
$$ -18079 -45616 -43152 871 26862 31984 27999 40959 26723 -6638 24931 27580 -28594
13349b8594n547L4353o277l2887m498J0521M5386K3250k4723j3783J3450K3655
$$ -28594 -34141 212 -6065 -38952 -43450 -32929 12457 35707 10984 -2799 10651 34306
13337C4306O352J9142R239k2228n3426n3732k9254K2201r965P869J3854J0464
$$ 34306 40658 59800 69039 46811 -6615 -60347 -89601 -67400 -77365 -69496 -55642 -45178
13325d5178L1154j9828l8743K3820M4390l8567J0237M6432M2928J3391n0944M0993
$$ -45178 -14024 -33852 -72595 -48775 -4385 -42952 -32715 13717 56645 70036 19092 60085
13313F0085P7292r736o9516l9100p7908j8616Q0837M6511J7741L810m88j3171
$$ 60085 137377 127641 58125 19025 -58883 -77499 3338 49849 67590 71400 70912 57741
13301E7741K0151n2328l0127K112L4782o279J6043K3972m7317J8845K5583O2903
$$ 57741 77892 25564 -4563 -2451 32331 26052 42095 66067 18750 37595 63178 126081
13289A26081r005k993k3580p5915m727M9484L8793J5672J5551R686j7368j1611
$$ 126081 117076 114083 90503 14588 9861 59345 98138 113810 129361 139047 121679 110068
13277A10068m7541O5503L545l7461j241n0026o4784R1848M7370n3711n3491K6377
$$ 110068 62527 128030 131575 94114 92873 42847 -21937 69911 117281 63570 10079 36456
13265C6456N4723l6983l9023L4988K493R396L4880K8115l7215k8718j4664o385
$$ 36456 91179 54196 15173 50161 52654 62050 96930 125045 87830 59112 44448 38063
13253C8063J7340O6N828k3027K221k3207L098l7697Q573K1171l3126k4201k6965
$$ 38063 55403 55469 61297 38270 40491 17284 20382 -17315 -8742 12429 -20697 -44898 -71863
13240g1863M1504O9493M7122l5206l9666k9735J7545J1122j91j992K2102n73J7262
$$ -71863 -30359 39134 86256 51050 11384 -18351 -806 10316 10125 8133 30235 29662 46924
13227D6924k7012j189Q351J630j0769N9001L2342k1146n9977j1949J2431M3237
$$ 46924 19912 18723 27074 28704 17935 76936 109278 88132 28155 16206 28637 71874
13215G1874M1633p410m8475k9946L1844j4505K8542K8115j0406l7738l3307m8939
$$ 71874 113507 106097 57622 27676 59520 45015 73557 101672 91266 53528 20221 -28718
13203b8718l9050R122j3101J8513L6056K4148m4008q0553M1394P5811N0824J0437
$$ -28718 -67768 -58646 -71747 -53234 -17178 6970 -37038 -117591 -76197 -386 50438 60875
13191F0875r043n97l7535n3330J5040J0161N3930O2791k5454l0930N2897k393
$$ 60875 51832 51235 13700 -39630 -24590 -14429 39501 102292 76838 45908 98805 96412
13179I6412m7101n6258j6003K6061q033k9431M1503L6225m0605j9761K9827J8503
$$ 96412 49311 -6947 -22950 3111 -4922 -34353 7150 43375 2770 -16991 12836 31339
13167C1339K7486j0736K2009k467k2012j8667Q020k8221J8616K7064M9368k3384
$$ 31339 58825 48089 70098 67631 45619 26952 34972 6751 25367 52431 101799 78415
13155G8415n8771n2975q194L2494K5514J2473K1321K3519n0856l0850L4205l2416
$$ 78415 19644 -33331 -41525 -9031 16483 28956 50277 73796 22940 -7910 26295 -6121
13143f121n7239k0784L3408l763J2380m3588k231P0833R527p792k1834j5979K8082
$$ -6121 -63360 -84144 -50736 -54499 -42119 -85707 -87938 -17105 -7578 -15370 -37204 -53183 -25101
13130b5101K5449Q4656M7909J8021j9999m7151q1495K6472J9981K186k1644m8538
$$ -25101 348 85004 132913 150934 130935 83784 2289 28761 48742 50928 29284 -19254
13118a9254r3492k3321R645n83L5216l9572K2310N1959L3608P1178j7671K2779
$$ -19254 -112746 -136067 -126422 -127005 -91789 -131361 -109051 -57092 -23484 47694 30023 52802
13106E2802J3278k4788K7251q012l4286M1240K048o0674o8151J7309L6285N9113
$$ 52802 66080 41292 68543 60531 26245 67485 69533 8859 -59292 -41983 -5698 53415
13094E3415J8127l4255l2189l8006j1358N8935j0442l7502m760n195k9658K2600
$$ 53415 71542 37287 5098 -32908 -44266 14669 4227 -33275 -38035 -43230 -72888 -50288
13082e0288N9538q008o240k7861M0357M4836m2187j3305K3238J6003R8959K3990
$$ -50288 9250 1242 -4998 -32859 7498 52334 10147 -3158 20080 36083 135042 159032
13070A59032m9116j910m7508q9316k5357q715j0124m625N2701R6352j0894m4154
$$ 159032 109916 108006 60498 -28818 -54175 -62890 -73014 -77639 -24938 71414 60520 16366
13058A6366L8042M394m2411M1910L3940k0082M6070L6551p720p7942m3672k3478
$$ 16366 54408 58802 16391 58301 92241 72159 118229 154780 147060 69118 25446 1968
13046A968j4874j2185j8977L2689m948L4608N7280K8676J526n1545n9936l923
$$ 1968 -12906 -25091 -44068 -11379 -16327 18281 75561 104237 105763 54218 -5718 -9641
13034i641j1548P202m5038q0591k7758O8070R4604J1575K0232K2649Q9211L4419
$$ -9641 -21189 -13987 -59025 -139616 -167374 -99304 -4700 6875 27107 49756 138967 173386
13022A73386j3088q6469r0064N8078j9518m9101N4074p102L6273o212o300m6663
$$ 173386 160298 73829 -16235 41843 22325 -26776 27298 20196 56469 50257 43957 -2706
13010b706L2105M3182L7203M6185K9959m1119n1986M629K0744M3187L8086m7523
$$ -2706 29399 72581 109784 155969 185928 144809 92823 97452 118196 161383 199469 151946
12998A51946l6021m7977p250k5599K6810L0491L2049J6193J9648m2767k9065K2018
$$ 151946 115925 67948 60698 35099 61909 92400 124449 140642 160290 117523 88458 110476
12986A10476p755J2553L1746J3346k958k7433j379n718L5432M784N4022J19696
$$ 110476 102721 115274 147020 160366 157408 129975 128596 122878 158310 163094 217116 336812
12974C36812M6691Q3956Q4005J20223J82717J86804J90388J29807J0180K0319
$$ 336812 383503 467459 551464 671687 854404 1041208 1231596 1361403 1371583 1391902
12964A391902k5242m2290o0472j49639j97082j94535j34584r1938l9143q8229
$$ 1391902 1366660 1324370 1263898 1114259 917177 722642 588058 496120 456977 368748
12954C68748o2412p1482n3591j4553j6310k324j7047P3448L3715o7704l6599m9593
$$ 368748 306336 234854 181263 166710 150400 148076 131029 204477 238192 170488 133889 84296
12942H4296q1014k2004l267L4763k3441p399J5189L3538o0064k8294K0438j3283
$$ 84296 3282 -18722 -21989 12774 -10667 -18066 -2877 30661 -29403 -57697 -37259 -50542
12930e0542L141K4613K8186Q470R08J4576J1467M5110Q021j9571l538j252N9564
$$ -50542 -47401 -22788 5398 13868 14776 29352 40819 85929 93950 74379 70841 69589 129153
12917A29153K5745p9715l3035n1585n1934O1351M2241o3870J3287J5044K7072
$$ 129153 154898 75183 42148 -9437 -61371 -20 42221 -21649 -8362 6682 33754
12906C3754n1869l4879N407N4630J9987l2572k9980M5490N2288K5044J2787k1583
$$ 33754 -18115 -52994 -47587 7043 27030 -5542 -35522 9968 62256 87300 100087 78504
12894G8504j2256j3848l5388J9951N7345N3212L3288l7965k9745q6701L4622N4401
$$ 78504 66248 52400 17012 36963 94308 147520 180808 142843 113098 26397 61019 115420
12882A15420l1737j9481n7163l071O5637N6426K3496n09M2347j1928l9800l7955
$$ 115420 83683 64202 7039 3968 69605 126031 149527 149018 191365 179437 139637 101682
12870A01682O041L0603j3048k5840n8355l1520K8454P1377N0379J3452m1281p486
$$ 101682 107723 138326 125278 99438 41083 9563 38017 109394 159773 173225 131944 124458
12858A24458n699p9365N1786O452l5553m545J7323R420n2616O024R0539K4466
$$ 124458 118759 39394 91180 97632 62079 57534 74857 84277 31661 37685 128224 152690
12846A52690n000m9521N537N8280k635p638n1480q4364n9648J5828M8687k9690
$$ 152690 147690 98169 103706 161986 159351 151713 100233 15869 -43779 -27951 20736 -8954
12834h954K4335K2740K403k9496J3685J5464n0524N7655j9453j0526J8156l1997
$$ -8954 15381 38121 40524 11028 24713 40177 -10347 47308 27855 17329 35485 3488
12822C488l114R5583M3863J5799m5579o225K9716J8063M5959n0055o5587m8802
$$ 3488 374 95957 139820 155619 110040 103815 133531 151594 197553 147498 81911 33109
12810C3109J6307O3397K4517K6069L6947j1511M3198L9060K6123L5070l0692o763
$$ 33109 49416 112813 137330 163399 200346 188835 232033 271093 297216 332286 301594 294831
12798B94831l5958m1836M9515j274m2352q508m5454l010J7990J7044n5130j07199
$$ 294831 258873 217037 266552 265278 222926 214418 168964 165954 183944 200988 145858 38659
12786C8659q226K6518j4689m1116j7959N343n023K3471P4767j3618j8242J1400
$$ 38659 30433 56951 42262 1146 -16813 -11470 -16493 6978 81745 68127 49885 61285
12774F1285l4414p8385m3049M1047P191J5973K1733P970K0130K4610M3351K2518
$$ 61285 26871 -51514 -94563 -53516 -46325 -30352 -8619 -649 19481 44091 87442 109960
12762A09960k5734K0979Q943k8299M6525Q8469k0660n3706l9904k0576m326m0132
$$ 109960 84226 105205 114148 85849 132374 220843 200183 146477 106573 85997 81671 41539
12750D1539K1821M5665K5141l1285K3415k694o9747m5118J8269J139j594R1J0202
$$ 41539 63360 109025 134166 102881 126296 123602 53855 8737 27006 28145 26551 26642 36844
12737C6844r232N2741J8213K1506n8925j3258K9276O4449L2198l4983k1356N177
$$ 36844 27612 80353 98566 120072 61147 47889 77165 141614 173812 138829 117473 122650
12725A22650j4993J7916L3670k7469l7755J6468K3578m4118j5870p367N372P45
$$ 122650 107657 125573 159243 131774 94019 110487 134065 89947 74077 66710 72082 72827
12713G2827o616k58k5613J9374M583p931J7589P198K3596r603J7610P9923k2967
$$ 72827 66211 65953 40340 59714 64297 56366 73955 81153 104749 95146 112756 192679 169712
12700A69712q86Q9038J1271J4254l3453J5585l2368M2507q271P725L5031k3203
$$ 169712 168826 257864 269135 283389 249936 265521 233153 275660 267389 275114 310145 286942
12688B86942m0819J0898J7973K9932Q17k2500n5524l7674o319j6054J2244Q7299
$$ 286942 246123 257021 274994 304926 305743 283243 227719 190045 183726 167672 179916 267215
12676B67215O9751O6121P1652n335J1393O5549J5690K0180J43K9895L364p540
$$ 267215 336966 403087 474739 469404 480797 546346 562036 582216 582359 612254 615618 608078
12664F08078l6207m8282m6348j3239r993q3694n7081o1998m0812J9210M0730K5260
$$ 608078 571871 523589 477241 464002 454009 370315 313234 251236 210424 229634 270364 295624
12652B95624K5271J9621R577n008M2590M2995n8705j9718k4990m7951l5085j4499
$$ 295624 320895 340516 350093 345085 387675 430670 371965 352247 327257 279306 244221 229722
12640B29722J5121M4975R3246K0240l5749n6672k5414Q589j9630m39O2899J8103
$$ 229722 244843 289818 383064 403304 367555 310883 285469 294058 274428 273989 336888 354991
12628C54991l648k6291J8900l5527P476J7857R347L7798P1508M4025M644J9032
$$ 354991 351343 325052 343952 308425 315901 333758 343105 380903 452411 496436 501080 520112
12616E20112L4229m2743l5411J5575L3419M5260N1336N297N2207N0520j1262r512
$$ 520112 554341 511598 476187 491762 525181 570441 621777 627074 679281 729801 718539 709027
12604G09027M973o578J5624Q1060K7422P5559M1763M4576Q5116P7956M9098K8645
$$ 709027 714000 707422 723046 804106 831528 907087 948850 993426 1078542 1156498 1205596 1234241
12592A234241K7274R637J705O5826N3968J41092J16800J9668N9820L3334J9598
$$ 1234241 1261515 1271152 1272857 1338683 1392651 1533743 1650543 1670211 1730031 1763365 1782963
12581A782963J30883J75532J59738J42176J47445J68789K16921K24271K58978
$$ 1782963 1913846 2089378 2249116 2391292 2538737 2707526 2924447 3148718 3407696
12572C407696K12308L52030L77319M11244M71602N43423O56547P31460Q32632
$$ 3407696 3620004 3972034 4349353 4760597 5232199 5775622 6432169 7163629 7996261
12563G996261J030550J312315J704273J996594K265423K452607K738211L121420
$$ 7996261 9026811 10339126 12043399 14039993 16305416 18758023 21496234 24617654
12555B4617654L845673M920335O331896Q133780J0840922J4685125K0382403K8084762
$$ 24617654 28463327 33383662 39715558 47849338 58690260 73375385 93757788 121842550
12547A21842550L7256109M4626686M3942656L0318254R518767m331486m484573
$$ 121842550 159098659 203725345 247668001 277986255 287505022 283173536 278688963
12540B78688963j38740n758937k3934009m2215512m7854725m0916548k9607755
$$ 278688963 278550223 272791286 248857277 206641765 158787040 117870492 88262737
12533H8262737j9964335j3411165r279772o662663m993635l956974l169183k570568
$$ 88262737 68298402 54887237 45607465 38944802 33951167 29994193 26825010 24254442
12525B4254442k149649k096066k157793k042764j751815j434251j140989r91933
$$ 24254442 22104793 20008727 17850934 15808170 14056355 12622104 11481115 10489182
12517A0489182q95522q27254o27202m67320m72328n28612n52649n76493m61109
$$ 10489182 9593660 8766406 8139204 7671884 7199556 6670944 6118295 5541802 5080693
12508E080693m21133l02854k17794k89335k41705j45860j99210k30134j65567
$$ 5080693 4659560 4356706 4138912 3849577 3607872 3462012 3262802 3032668 2867101
12499B867101j44395j26215j12793q2362j19265j65770p8131j05858q9106p5919
$$ 2867101 2722706 2596491 2483698 2401336 2282071 2116301 2038170 1932312 1843206 1767287
12489A767287q2499j33271p6549j7664m9633m8520o8088J068M729l3619m5956
$$ 1767287 1684788 1551517 1474968 1457304 1407671 1359151 1291063 1292131 1296860 1263241 1217285
12478A217285l2823k5749J0013k4338n3427k2992J0788k7112r9096l0551j61m725
$$ 1217285 1184462 1158713 1168726 1144388 1090961 1067969 1078757 1051645 952549 921998 921837 917112
12466I17112J0800k79m2523j2078K908k3821L521p1006l5601q1509m4838J6408
$$ 917112 927912 927633 885110 873032 875940 852119 855640 784634 749033 667524 622686 639094
12454F39094L0491m4419o4885J742R508j7716l2435l5249n0583O387M0848j4633
$$ 639094 669585 625166 560281 562023 571531 553815 521380 486131 435548 441935 482783 468150
12442D68150K229K3392l871K1789M0391o6907j00774m9849N941L467L9783j8231
$$ 468150 470379 493771 489900 511689 552080 485173 384399 334550 340491 343958 383741 365510
12430C65510R593N2846k4955J3608j5921P274l6902M649K1672M3288L5587J0481
$$ 365510 375103 427949 402994 416602 400681 407955 371053 375702 397374 440662 476249 486730
12418D86730j1976m9475K7099R835l1026K0762n0280p1201j3231K855L7351j6190
$$ 486730 474754 425279 452378 462213 431187 451949 401669 330468 317237 320092 357443 341253
12406C41253m1247j4422l5151J8239N1212p8264o1240J4675o4093K3347k2340
$$ 341253 300006 285584 250433 268672 319884 241620 180380 195055 130962 154309 131969
12395A31969m174R7743l7375m8622O3426O6325j4066l9598n8223J1848M2602K0231
$$ 131969 127795 225538 188163 139541 202967 269292 255226 215628 157405 169253 211855 232086
12383B32086j8398m1446R115K2961O6713K4919m5461o4187K9673Q4568K5320l5733
$$ 232086 213688 172242 181357 204318 271031 295950 250489 186302 215975 300543 325863 290130
12371B90130p4786K8016Q832l0441k5632l2633M7396m1763K2237p2030L5321L5292
$$ 290130 215344 243360 252192 221751 196119 163486 210882 169119 191356 119326 154647 189939
12359A89939n4126j2457k1754N446l2668l6913L9390o176M2601K2175K2093N52
$$ 189939 135813 123356 101602 107048 74380 37467 76857 70681 113282 135457 157550 158102
12347A58102l218J6210p85M8950K4912n3866l0004m9479J6777M9679j5475l1281
$$ 158102 154884 171094 170309 219259 244171 190305 160301 110822 127599 177278 161803 130522
12335A30522j2934l7601j7753O9121J1397k988k0275m0420L1731J8637l6821m9346
$$ 130522 117588 79987 62234 131355 142752 139764 119489 79069 110800 129437 92616 43270
12323D3270r548M2459p20k1339O492M7350L5765m8j0842O823J7144k663R388l1083
$$ 43270 33722 76181 75461 54122 60614 107964 143729 143681 132839 139662 156806 154143 163531 132448
12309A32448Q3200L0257r0831k1701L6499L5450J3824Q189K675l1544J5429M1455
$$ 132448 215648 245905 155074 133373 169872 205322 219146 227335 230010 198466 213895 255350
12297B55350m2811n5478j184R23k1880J5101k1198L453K9635L1703l7003m5639
$$ 255350 212539 157061 155877 156800 134920 150021 128823 132276 161911 193614 156611 110972
12285A10972p2734l0621L9451l0791j2346J09386L3817n0873k769j5263n2227
$$ 110972 38238 7617 47068 16277 3931 113317 147134 96261 93492 78229 26002
12274B6002r907k7992m1708j9320P7981J12422L1872L4297K0574k705l1379l5821
$$ 26002 16095 -11897 -53605 -72925 5056 117478 149350 183647 204221 201516 170137 134316
12262A34316l2997m9348k1656j2102j3308K4793J809M8304j9574n8066J9785r901
$$ 134316 101319 51971 30315 18213 4905 29698 31507 79811 60237 2171 21956 12055
12250A2055P1009P5201j8077j044k9523P0575K4079J1921p61L3968M2783L2979
$$ 12055 83064 158265 140188 139144 109621 180196 204275 216196 215435 249403 292186 325165
12238C25165J5677j872Q8683j8894j6519r3231p2775n3014j3640k4462m565K1051
$$ 325165 340842 338970 427653 408759 392240 299009 226234 173220 159580 135118 130553 151604
12226A51604k4960o3376m8869M9579N2291J336J3090J8768K9082l7593k2690K1255
$$ 151604 126644 63268 14399 63978 116269 117605 130695 149463 178545 140952 118262 139517
12214A39517k6184k9750K4159k6915K9074J2829L0161q5915j05019L029N2399
$$ 139517 113333 83583 107742 80827 109901 122730 152891 66976 -38043 -35014 17385
12203A7385k3615k2248O7363L4132j6150K8857L5980j5346o3033J039O6857j5275
$$ 17385 -6230 -28478 38885 73017 56867 85724 121704 106358 43325 44364 111221 95946
12191I5946k4500K1420L7547K4682j3445m5999Q275l6074k5938K2877j0484k5616
$$ 95946 71446 92866 130413 155095 141650 95651 103926 67852 41914 64791 54307 28691
12179B8691j277K9846M7083J2145K1437l3384k8205m1234l6281k2313k6148R81
$$ 28691 27414 57260 104343 116488 137925 104541 76336 35102 -1179 -23492 -49640 -48659
12167d8659K6250P1283j6977j3837N6502K9122J6274o287J8883k4479r557K3644
$$ -48659 -22409 48874 31897 18060 74562 103684 119958 113671 132554 108075 98518 122162
12155A22162P8054R754p4828m4095l6133m0149M0655O4340j2816p8394K8462j2234
$$ 122162 200216 209970 135142 91047 54914 14765 55420 119760 106944 28550 57012 44778
12143D4778j5682j2495l579J8721K5779J4716j097l3365J1092O894k6152j9185
$$ 44778 29096 16601 13022 31743 57522 72238 71141 37776 48868 55762 29610 10425
12131A0425L9422K5266J5070K1223l4814n9394M6891R3163Q2143N5720P1484J13685
$$ 10425 49847 75113 90183 111406 76592 17198 64089 157252 239395 295115 366599 480284
12119D80284J47384J17393J58473J96624K21669J14500J4837o3818l6509J0322
$$ 480284 627668 745061 903534 1100158 1321827 1436327 1451164 1387346 1350837 1361159
12109A361159r6988j36708j54258j88678j80895j05491l3637j18987j37434j1328
$$ 1361159 1264171 1127463 973205 784527 603632 498141 464504 345517 208083 196755
12099A96755N0235m4471o003l8012j7191L2033J813j8224r0946k3269L4538l2820
$$ 196755 246990 202519 196516 158504 141313 173346 175159 156935 65989 42720 77258 44438
12087D4438o9989N48L9730j6724j6803J6301M6275l142L0340N7140n2217j0568
$$ 44438 -25551 -25003 14727 -1997 -18800 -2499 43776 40634 70974 128114 75897 65329
12075F5329j5762J1871M5407Q859m4154o0192L2362O678J5610M7710P666n3913
$$ 65329 49567 61438 106845 115704 71550 11358 43720 50398 66008 113718 121384 67471
12063F7471J8751L0843n6005J4947L0539M0291l0954r787k2656J677L9882J3568
$$ 67471 86222 117065 61060 76007 106546 146837 115883 106096 83440 85117 124999 138567
12051A38567k462k2529n295m3898L557J755j9398k5798J2601L6309k9725l9441
$$ 138567 136105 113576 108281 64383 67940 69695 50297 24499 37100 73409 43684 4243
12039D243k8543K5058L8242p159m653m722k8691j8947Q2623M9645n207l4036k6148
$$ 4243 -24300 758 39000 31841 27188 22466 -6225 -25172 57451 107096 101889 67853 41705
12026D1705l0614L9410Q1236K4769k1036o4444j8157K6051N9901K5114p3034p5566
$$ 41705 11091 50501 131737 156506 135470 71026 52869 78920 138821 163935 90901 15335
12014A5335l1949m180J3859l1071M2979N6140J6266L642K1389K278O960j1919
$$ 15335 -16614 -20794 -6935 -38006 4973 61113 77379 81021 102410 104688 111648 99729
12002I9729o7396m6035j096K7413j0200n883M5527N4007m5033O164j3857j438
$$ 99729 32333 -13702 -14798 12615 2415 -3468 42059 96066 51033 57197 43340 41902
11990D1902O0308L1028l1625o8351m0997K3009R687L1071J4089l915k8769k6091
$$ 41902 102210 133238 101613 33262 -7735 15274 24961 56032 70121 66206 37437 11346
11978A1346K7647j5380K0793L1132l9433n0989l4146O3220M0690K782k2607M8290
$$ 11346 38993 23613 44406 75538 36105 -14884 -49030 14190 54880 57662 35055 83345
11966H3345j7506k6007o8309J4748J09060N1863r093m1069r723m0649J9602L9341
$$ 83345 65839 39832 -28477 -13729 95331 147194 138101 97032 87309 46660 66262 105603
11954A05603J8198l1827j8526j2153J028L8517m5332l5083M1264L0148n803n459
$$ 105603 123801 91974 73448 61295 62323 100840 55508 20425 61689 91837 86034 80575
11942H0575l9431k8178p6544p448M0421K9570P6135k0837l2014j2090Q946O0704
$$ 80575 41144 12966 -63578 -71026 -30605 -1035 75100 54263 22249 10159 19105 79809
11930G9809R078l9328j7864J0870N990J6888K4998p28M3051m671l9205m2673L447
$$ 79809 88887 49559 31695 42565 48555 65443 90441 89713 132764 128093 88888 46215 49662
11917D9662K2272J0452l9642n4478Q8713l125m6452L8348o338J5415J7799j5971
$$ 49662 71934 82386 42744 -11734 76979 73854 27402 65750 59412 74827 92626 76655
11905G6655k3428m0162j4395M0291N8523l3720M6465n2421J5206M341k3675m169
$$ 76655 53227 13065 -1330 38961 97484 63764 110229 57808 73014 77355 53680 49511
11893D9511L8075J7518o896K0150J3286J3125J9222M698m0043K0312L1967J8088
$$ 49511 87586 105104 98208 118358 131644 144769 163991 168689 128646 148958 180925 199013
11881A99013P31J0337M8774N245j5350k5872p2177l3523j4903k479J1181n1594
$$ 199013 199744 210081 258855 264100 248750 222878 150701 117178 102275 99796 110977 59383
11869E9383M995M2548M2040l7862k9048l8357Q819M4720o6709l0400J9964j5820
$$ 59383 64378 106926 148966 111104 82056 43699 52518 97238 30529 129 20093 4273
11857D273N308l111O2573O3879k481j0783j2931K9404p303l0892L4013O711j8746
$$ 4273 9581 6470 69043 132922 130441 119658 106727 136131 128828 97936 131949 138660 119914
11844A19914k7748L616N2453N5959Q8952N8016q8797n7330j9382k2261J3331K1319
$$ 119914 92166 95782 148235 204194 293146 351162 262365 205035 185653 163392 176723 198042
11832A98042N8257L9436M209J7154K200J5987J7585k3044l4719O8999J15213J18705
$$ 198042 256299 295735 299944 317098 319298 335285 352870 329826 295107 364106 479319 598024
11820E98024R2832R0746J30973N3533O7746R6590q261p3935k01119j15758j00876
$$ 598024 690856 781602 912575 966108 1033854 1130444 1122183 1048248 847129 731371 630495
11809F30495p3682k3028j17036r2607r436O31K0532K4439N067J2730r097j5696
$$ 630495 556813 533785 416749 324142 314706 315337 335869 360308 365375 378105 369008 353312
11797C53312J4767K3057P0667O8664K4806N3294K095n0922K9280Q7713O2613Q2808
$$ 353312 368079 391136 461803 530467 555273 608567 610662 559740 589020 676733 739346 822154
11785H22154R9420K2900O8989R8251O8273O4745L6226O6685k5577J3606k9464
$$ 822154 921574 944474 1013463 1111714 1179987 1244732 1280958 1347643 1322066 1335672 1306208
11774A306208l9543q0338p8068l225p5931r3289l9690q9389p5100j16570n2532
$$ 1306208 1266665 1186327 1108259 1105034 1029103 935814 896124 806735 731635 615065 562533
11763E62533j8729J6830Q978l6257l3783q521k2717P938L0237K5703j2739K5770
$$ 562533 543804 560634 569612 533355 499572 491051 468334 476272 506509 532212 519473 545243
11751E45243L5735K5461P242j3568O5607L8864P3682R7504R1089P5526P9097J63076
$$ 545243 580978 606439 613681 600113 665720 704584 778266 875770 966859 1042385 1121482 1284558
11739A284558J40022M4658N028j27226k18733j13959o3621j31641r8949p1451
$$ 1284558 1424580 1469238 1474266 1347040 1128307 1014348 950727 819086 720137 648686
11729F48686o0330n8441J0495L5151K6159k0343o8952j2714j7021k3141p614M9828
$$ 648686 588356 529915 540410 575561 601720 581377 512425 499711 482690 459549 451935 501763
11717E01763K0058l5095K7025L3358l4250M8080L3469l1927L9725J03936K0458
$$ 501763 521821 486726 513751 547109 512859 560939 594408 562481 602206 706142 726600
11706G26600J0214J5579M3940M7384Q2173L3986j7560l9688r1375k3091m1277
$$ 726600 736814 752393 796333 843717 925890 959876 942316 902628 811253 788162 746885
11695G46885o9121n5113o5582o9109m6611j1791K2678O7660J7270m9491p8967
$$ 746885 677764 622651 557069 487960 441349 429558 452236 519896 537166 487675 408708
11684D08708J2337R265L1672L7655N1239J929N8216K4943j5015k8357N45J08155
$$ 408708 421045 430310 461982 499637 550876 552805 611021 635964 620949 592592 593137 701292
11672G01292R7351Q2338Q5134K1433p6214J0541O262m3802k0224K0012J5225j3423
$$ 701292 798643 880981 966115 987548 911334 921875 928137 884335 864111 884123 899348 885925
11660H85925j1543q458j7077j2878O5414J8068l2182p4024q79J110m5411o3414
$$ 885925 874382 865924 848847 835969 901383 919451 887269 813245 812366 813476 768065 704651
11648G04651p2513o5601k7630o6082k2828L582K9847J4526k6088j2406k4667P602
$$ 704651 632138 566537 538907 472825 449997 453579 483426 497952 471864 459458 434791 442393
11636D42393O48n535l0503m0157j7304q982P7380P5797P7025m684r541L2321M77
$$ 442393 443041 437506 407003 366846 349542 340560 417940 493737 570762 566078 556537 588858 589335
11623E89335K4972M0705J737J1014j1002l6502n8870r744m6093n9619k5190J4706
$$ 589335 614307 655012 656749 667763 656761 620259 561389 551645 505552 445933 420743 435449
11611D35449l5467m3757n1264R266O615M2342k7724j9937J1138J4002j4280P708
$$ 435449 399982 356225 304961 314227 320842 363184 335460 315523 326661 340663 326383 334091
11599C34091p8365l6244j5053Q796j0417K4279O83J4839K82k104m5536m1806P5364
$$ 334091 255726 219482 204429 213225 202808 227087 227770 242609 242891 240787 195251 153445 228809
11586B28809l603j5075M9129K9682M9710k885o1572p140L1791O7211m5525k5647
$$ 228809 225206 210131 259260 288942 338652 335767 274195 267055 298846 366057 320532 294885
11574B94885N3356J5813p8073n9137L109m6259k0073K9557K2447m0244k1462N4964
$$ 294885 348241 364054 285981 226844 229953 183694 163621 193178 215625 175381 153919 208883
11562B08883j2126m6139j012l1933j4332M9759K7034j0290k1706J8108J4675j9460
$$ 208883 196757 150618 149606 117673 103341 153100 180134 169844 148138 166246 180921 161461
11550A61461k7888l1114P3225P6222k4815K3241m5989p0108l5642l2471l2398
$$ 161461 133573 102459 175684 251906 227091 250332 204343 134235 98593 66122 33724
11539C3724P5273P9194K7835J3207K0232P660p8007O767j1032k534m207L5443
$$ 33724 108997 188191 216026 229233 249465 257125 179118 185885 174853 172319 168112 203555
11527B03555L1013k0328l2791r6061N036K5363M4817O6425M533l810m852k0272
$$ 203555 234568 214240 181449 85388 90424 115787 160604 227029 231562 227752 222900 202628
11515B02628K3247O864O610j88k9978L5187k5616j9137n2106j3807P4848J8813
$$ 202628 225875 232739 239349 239161 209183 244370 218754 199617 147511 133704 208552 227365
11503B27365j2297k8316J948j8917q70m859K0318K4120j4064m5442j2401n6464
$$ 227365 215068 186752 188700 169783 168913 164054 184372 208492 194428 148986 136585 80121
11491H0121j5458K7652N8604J6667O405K6007j9565R35L4679N1829J87K6190r2451
$$ 80121 64663 92315 150919 167586 173991 199998 180433 181368 216047 267876 268063 294253 201802
11478B01802l3612J4665R204K6264l1672J3961J2625K7692J5324k076J8093P099
$$ 201802 168190 182855 192059 218323 186651 200612 213237 240929 256253 254177 272270 279369
11466B79369L1913L554M0448P791k5293m2593L203N2707N124o7867k8024N5034
$$ 279369 311282 314836 355284 363075 337782 295189 298392 351099 356223 288356 260332 315366
11454C15366r282k2370J5625R415J4766L8945O0105K7178K7629L1540k0278k2286
$$ 315366 306084 283714 299339 308754 323520 362465 422570 449748 477377 508917 488639 466353
11442D66353o8569l9248J4610k448L5182K4619M6829J9099N8046O654j7611j3555
$$ 466353 397784 358536 373146 370698 405880 430499 477328 496427 554473 561127 543516 529961
11430E29961k9561l9337j6359k9789m0957L8805M6221L2411K2394o6124J2011
$$ 529961 500400 461063 444704 414915 373958 412763 458984 491395 513789 447665 459676
11419D59676J5479j20604n3034N3794O1228O6588O0380k1210j2596N5732k9383
$$ 459676 475155 354551 301517 355311 416539 483127 543507 522297 509701 565433 536050
11408E36050m8728j5505K4468K2487k199P1190O5954j6901k6062Q734K9681J0238
$$ 536050 487322 471817 496285 518772 516573 587763 653717 636816 610754 619488 649169 659407
11396F59407L1259K7332R0771K4272n9395J310J0560K9547O7723r454L0970N1896
$$ 659407 690666 717998 808769 833041 773646 774956 785516 815063 882786 873332 904302 956198
11384I56198j0154q858M0718L3132R092M1197J2980M0592K3882M8505J06579R7837
$$ 956198 946044 937186 977904 1011036 1020128 1061325 1074305 1114897 1138779 1187284 1293863 1391700
11372A391700j7286l455P3045M5227Q1629Q2930R6291R0747R5918J03486J14739
$$ 1391700 1374414 1370959 1444004 1489231 1570860 1653790 1750081 1840828 1936746 2040232 2154971
11361B154971J3760R9030K23844J76387J22318J74092K50970K42529L11673L52878
$$ 2154971 2168731 2267761 2491605 2667992 2790310 2964402 3215372 3457901 3769574 4122452
11351D122452M37444M75428M54106N36280O45373P68289R47544J060517J149436
$$ 4122452 4559896 5035324 5489430 6025710 6671083 7439372 8386916 9447433 10596869
11342A0596869J315993J415113J526568J536019J465463J369837J138209Q97622
$$ 10596869 11912862 13327975 14854543 16390562 17856025 19225862 20364071 21261693
11334B1261693O61276N36538L56129J00175n9915j93856k92996m29608n27406
$$ 21261693 21922969 22459507 22815636 22915811 22855896 22662040 22369044 21939436 21412030
11325B1412030m68497l26019o2653J84580N88598J077342J469275J873297K315170
$$ 21412030 20943533 20617514 20554861 20739441 21328039 22405381 23874656 25747953 28063123
11316B8063123K730649K931190K964483K897027K599361K029156J394680N63790
$$ 28063123 30793772 33724962 36689445 39586472 42185833 44214989 45609669 46173459
11308D6173459k31528p85478j235985j541149j734953j938780j966333k087625
$$ 46173459 45941931 45156453 43920468 42379319 40644366 38705586 36739253 34651628
11300C4651628k043601j862582j712073j473842j166680q01930m26763j09127
$$ 34651628 32608027 30745445 29033372 27559530 26392850 25590920 25164157 25055030
11292B5055030J58676M29129N28176O16485O62137M67136K11185n8330k22517
$$ 25055030 25213706 25642835 26171011 26787496 27449633 27916769 28127954 28069624 27847107
11283B7847107l83023m76043m88262m73614m46357m25091m61638m74514m64287
$$ 27847107 27464084 26988041 26499779 26026165 25579808 25154717 24693079 24218565 23754278
11274B3754278l85665k20664l7786J86309M15589N70379O41020O19029N45727
$$ 23754278 23368613 23147949 23110163 23296472 23712061 24282440 24923460 25542489 26088216
11265B6088216N69382N06514M73141N41736N61000M74978M12435K35410p7926
$$ 26088216 26657598 27164112 27637253 28178989 28739989 29214967 29627402 29862812 29784886
11256B9784886l11480n95928p56041o82596n86503l48730M889L61739P86444J162360
$$ 29784886 29473406 28877478 28121437 27438841 26852338 26503608 26508497 26870236 27656680 28819040
11246B8819040J607528K061116K282339K409784K485604K398232K261571K141737
$$ 28819040 30426568 32487684 34770023 37179807 39665411 42063643 44325214 46466951
11238D6466951J984840J812743J569831R53220J61116q11158j806760k717370
$$ 46466951 48451791 50264534 51834365 52787585 52948701 52137543 50330783 47613413
11230D7613413l198181l400427l428990l213438k712299k306042j820182j271102
$$ 47613413 44415232 41014805 37585815 34372377 31660078 29354036 27533854 26262752
11222B6262752q19762l73788m8415K62427N07533N07958N03065L96519K23062
$$ 26262752 25442990 25069202 25020787 25283214 25790747 26298705 26801770 27198289 27421351
11213B7421351J27200p8854j82968l55432o71266r56059j220743j540149j792270
$$ 27421351 27548551 27469697 27286729 26931297 26260031 25303972 24083229 22543080 20750810
11204B0750810j926323j930355j822669j688466j535585j340425j094513r43158
$$ 20750810 18824487 16894132 15071463 13382997 11847412 10506987 9412474 8469316
11196H469316p85846o73590n88767n55103n06444m80879l77740l06593k09009
$$ 8469316 7683470 7009880 6421113 5866010 5359566 4878687 4500947 4194354 3985345
11187C985345j74671k32179l11460k55193j60832m0515j05057j77707j47563j33339
$$ 3985345 3810674 3578495 3267035 3011842 2851010 2810495 2705438 2527731 2380168 2246829
11177B246829o1475m9290m7263j29811j86292p6940n2178j2477o1400o7140o4221
$$ 2246829 2185354 2136064 2088801 1958990 1772698 1695758 1643580 1631103 1569703 1502563 1438342
11166A438342o9482n9185p8805k645J7326l2731j7701k4997p4896j7983k6637
$$ 1438342 1368860 1309675 1230870 1228225 1245551 1212820 1195119 1170122 1095226 1077243 1050606
11155A050606r5350r814K2560k9026k9980p719m0915j1013R288k7589j460K4381
$$ 1050606 955256 945442 968002 938976 908996 901277 860362 849349 858637 831048 829588 853969
11143H53969k3777K0402K1833m7647l2919j0383K2136l8961p6283m0309j9927
$$ 853969 830192 850594 872427 824780 791861 781478 803614 764653 688370 648061 628134
11132F28134p4178Q212K9059k6750l1123n635P624n3208m4577M7858J5485n1593
$$ 628134 553956 562168 591227 564477 533354 527719 535343 482135 437558 485416 500901 449308
11120D49308k5134l5276J450M1645L5465j4980L8481N3416J9222k6634l7848k2659
$$ 449308 424174 388898 390348 431993 467458 452478 490959 544375 563597 536963 499115 476456
11108D76456n6860N2236M9952j9379k7098n5550k2829K1079O4236J3118n249J6833
$$ 476456 419596 471832 521784 502405 475307 419757 396928 418007 482243 495361 490112 506945
11096E06945k7818o6035j2371p491O483k3686k4489m641k4205j146L6688l762
$$ 506945 479127 413092 400721 393230 399713 376027 351538 346897 322692 321546 358234 354472
11084C54472L4915P709K7068j6498m8092m4850L1977l1515k7707O8375K6454j4763
$$ 354472 389387 397096 424164 407666 359574 314724 346701 315186 287479 355854 382308 367545
11072C67545m6326M5380J3107L742J8841M1451k6912q7452o8457j7092O2986l6891
$$ 367545 321219 366599 379706 383448 402289 443740 416828 329376 260919 243827 306813 269922
11060B69922K2281Q3263l7236p7387J9837K5517M7514L6263m8459K3540j6917
$$ 269922 292203 375466 338230 260843 280680 306197 353711 389974 341515 365055 348138
11049C48138j9300l5061p307M2580j3216j2972R1444N457o2741j834K6575J4040
$$ 348138 328838 293777 286470 329050 315834 302862 394306 399763 337022 335188 361763 375803
11037C75803M7700Q403k7637m9001j5036J9619O131r4238n4613O0125j1513Q906
$$ 375803 423503 431906 404269 355268 340232 359851 365982 271744 217131 277256 265743 274649
11025B74649J8468j1500K13K4674m7111O1583k9675m0740M4815K730J2588K2895
$$ 274649 293117 281617 281830 306504 259393 320976 291301 250561 295376 298106 310694 333589
11013C33589K5616O087m3549q12Q3221Q4130k3062k9529M9966O3616J0774l131
$$ 333589 359205 365292 321743 320931 404152 488282 465220 435691 485657 549273 560047 556916
11001E56916Q31O158L2294J8492L1552J02762p405L3188m176N6207J42437J32717
$$ 556916 557747 563905 596199 614691 646243 749005 741600 774788 770612 826819 969256 1101973
10989A101973J35053R7014J53827K42339K87510K81665L77252N23818O56122O60984
$$ 1101973 1237026 1334040 1487867 1730206 2017716 2299381 2676633 3200451 3856573 4517557
10979D517557P73651Q53736Q12652O11401L26430n6996m53472p31650q01177o97230
$$ 4517557 5291208 6144944 6957596 7568997 7895427 7838431 7384959 6653309 5852132 5154902
10969E154902o60432n40096l87714k29767q2320q8328o6410O1225J20560K09343
$$ 5154902 4494470 3954374 3566660 3336893 3254573 3166245 3099835 3161060 3281620 3490963
10959C490963K59658L59574N10649O55710Q35189R97461J357269J627999J794532
$$ 3490963 3750621 4110195 4620844 5276554 6111743 7109204 8466473 10094472 11889004
10950A1889004J813137J535621J046325J94386o61642j362450j806477j796409
$$ 11889004 13702141 15237762 16284087 16478473 15816831 14454381 12647904 10851495
10942A0851495j646806j436189j162501q22365o67678m05425k52002j86140j39563
$$ 10851495 9204689 7768500 6605999 5783634 5115956 4710531 4458529 4272389 4132826
10933D132826j7402o8670P9616K72316K11847K96207M15245N83647P56875R05598
$$ 4132826 4115424 4046754 4126370 4398686 4610533 4906740 5321985 5905632 6662507 7568105
10923G568105J005381J084451J162346R43065N89397K48562k3151l3790J85694
$$ 7568105 8573486 9657937 10820283 11763348 12352745 12601307 12578156 12544366 12730060
10914A2730060M81550Q98759J304584J590031J568096J196566M24304o89180j598989
$$ 12730060 13211610 14110369 15414953 17004984 18573080 19769646 20193950 19504770 17905781
10905A7905781k122273k084361j843929j534733j266213r21308o59468m02141
$$ 17905781 15783508 13699147 11855218 10320485 9054272 8132964 7473496 7071355
10897G071355j49958L3554K48293L26449M08625O03253R18747J254500J690214
$$ 7071355 6921397 6954951 7203244 7529693 7938318 8541571 9460318 10714818 12405032
10888A2405032K118352K654631L333038L890588M277824M098588L221490J488077
$$ 12405032 14523384 17178015 20511053 24401641 28679465 32778053 35999543 37487620
10880C7487620o09677k604010m013916m515631m337788l666727k891997k212153
$$ 37487620 36877943 34273933 30260017 25744386 21406598 17739871 14847874 12635721
10872A2635721j643704j209614r47989o33745l73269k55238q5493O8068K54071
$$ 12635721 10992017 9782403 8834414 8200669 7827400 7572162 7486669 7554737 7808808
10863G808808L80383N06520P46856R84012J277388J588220J836482J972126J879231
$$ 7808808 8189191 8695711 9442567 10426579 11703967 13292187 15128669 17100795 18980026
10854A8980026J461621P21254k20671j082485j546922j647037j513920j063950
$$ 18980026 20441647 21162901 20942230 19859745 18312823 16665786 15151866 14087916
10846A4087916m39889K2411M25837N28615L79034j69860q19325j321299j489616
$$ 14087916 13648027 13670438 14096275 14624890 15003924 14834064 14014739 12693440 11203824
10837A1203824j584949j414331j132710q69705n68449l69402k31405p8010Q4226
$$ 11203824 9618875 8204544 7071834 6202129 5633680 5264278 5032873 4954863 5039089
10828E039089P9144J00542K90789M24577N46290P03827R30863J215459J546390
$$ 5039089 5118233 5218775 5509564 5934141 6480431 7184258 8115121 9330580 10876970
10819A0876970J974445K326191K507346K344309J610171M73043q40480j948204
$$ 10876970 12851415 15177606 17684952 20029261 21639432 22112475 21271995 19323791
10811A9323791k600073k687664k490768k036039j499811j153565q67452o34320
$$ 19323791 16723718 14036054 11545286 9509247 8009436 6855871 5988419 5354099
10803E354099m49937l30601j50130r3638p5250k1387Q5328J99197L99170N11959
$$ 5354099 4904162 4573561 4423431 4329793 4254543 4233156 4318484 4517681 4916851 5428810
10793E428810O40799Q01441R73340J066184J064234R07877N37159p9374p16412
$$ 5428810 6069609 6871050 7844390 8910574 9974808 10882685 11419844 11340470 10624058
10784A0624058j123904j312401j315127j150721r75713q31752n67221m16775l85989
$$ 10624058 9500154 8187753 6872626 5721905 4746192 3914440 3347219 2930444 2544455
10775B544455l35940k52228j74926j25857j49359j66776j03565q3638j08256m4596
$$ 2544455 2208515 1956287 1781361 1655504 1506145 1339369 1235804 1152166 1043910 999314
10765I99314k0832o2619m9877m0189m4358q6399o2925K603M908l5114k600l7798
$$ 999314 978482 915863 865986 825797 781439 695040 632115 634718 639626 604512 601912 564114
10753E64114k3062P5152M8197j12160l8354j103K6272l3495o0084Q814q865n2842
$$ 564114 541052 616204 664401 552241 513887 512784 539056 505561 445477 454291 445426 392584
10741C92584l0125O7923J5114j2267M7186K3812k1657j4233j8954k6710j3833
$$ 392584 362459 430382 445496 433229 480415 504227 482570 468337 449383 422673 408840
10730D08840P6010k7730J1816n6659m0670K6561M7202K3353L6023Q0855N7645
$$ 408840 484850 457120 468936 412277 371607 398168 445370 468723 504746 585601 643246
10719F43246M5545L713O2949J22964Q3321N7916Q2908K4542l0089n3976q6380
$$ 643246 688791 692504 755453 878417 961738 1019654 1102562 1127104 1097015 1043039 956659
10708I56659j03921r2878j42563q4861j5095k8790n6685m5783m8430M3503K1340
$$ 956659 852738 759860 617297 532436 517341 488551 431866 386083 337653 381156 402496
10697D02496k1257K0525j3397o8062K8447N028J4786L7523O361N47M1121j916
$$ 402496 381239 401764 388367 320305 348752 353780 368566 406089 412450 412997 454118 452202
10685D52202O2107M7916L6075O0276K4686M1396P5233J18387J29401J89278K23133
$$ 452202 514309 562225 598300 658576 683262 724658 799891 918278 1047679 1236957 1460090
10674A460090K34437J58193J14183J6973j61214j84533j78998j79409j94491j12823
$$ 1460090 1694527 1852720 1966903 1983876 1822662 1638129 1459131 1279722 1085231 972408
10664I72408j15347j28859n4459j3821l1519n0044O466n7982k2367o703m2056
$$ 972408 857061 728202 673743 659922 628403 578359 584825 526843 504476 497773 455717
10653D55717L1005J9170l4022K6229K276p4098q5145M6085q94M7376M0603J724
$$ 455717 486722 505892 471870 498099 500375 426277 341132 387217 386323 433699 474302 476026
10641D76026L2588j1990N5900N5993R4746O6421N9509P2507Q1408R8312O4270
$$ 476026 508614 496624 552524 608517 703263 769684 829193 901700 983108 1081420 1145690
10630A145690l9782M897m227j76065j51151j87082j37808J0339l423o0612m5513
$$ 1145690 1105908 1110805 1106578 930513 779362 592280 454472 464811 461388 400776 355263
10619C55263k5357P94j1309O018K6431M342j2545k0951J2696l2806J4574O6732
$$ 355263 329906 330700 319391 325409 351840 356182 343637 322686 335382 302576 317150 383882
10607C83882M1628l8474q5714J436P614Q355J4080n621L51K8915l509o2804r4252
$$ 383882 425510 387036 301322 302758 310372 318727 332807 327186 327537 356452 352943 290139 195887
10594A95887j7931r97P3828k7532k790K228M1255L575l378r6990l2083K2455P8499
$$ 195887 177956 176959 250787 223255 220465 222693 263948 267523 264145 167155 135072 157527 236026
10581B36026L8582l150r221L196L3383j1757m6688J6172J7060J9328K5875L3298
$$ 236026 274608 271458 262237 265433 298816 287059 240371 256543 273603 292931 318806 352104
10569C52104j1787P679L6308P076o5380K6182R2621O4362L3081j9752m5645K8433
$$ 352104 340317 347996 384304 391380 326000 352182 444803 509165 542246 522494 476849 505282
10557E05282q0197o4450k2896M4169M4949J4243O4192p8928k3614k0935k1888
$$ 505282 425085 360635 337739 381908 426857 441100 505292 426364 402750 381815 359927
10546C59927M5851M9575K0182O8162L8079l5843M0480p079q192P034j3362K3154
$$ 359927 405778 455353 475535 543697 581776 545933 586413 579334 571142 578176 564814 587968
10534E87968j5035j01261l2078R117l6593j5647j194k2045k4398k643j9422N8100
$$ 587968 572933 471672 439594 448711 412118 396471 395277 373232 348834 346191 326769 384869
10522C84869J1859l5903M52K2466k8983J8514K9651m2758j8340j8363M2365O2578
$$ 384869 396728 360825 361277 383743 354760 373274 402925 360167 341827 323464 365829 428407
10510D28407K593Q194L7199n124K4935p323m4569k7685m185N5693P4930J8073
$$ 428407 431000 439194 476393 471269 496204 488881 444312 416627 412442 468135 543065 561138
10498E61138M1360M3230R056J6983j8049l8906N7104L1701L8876m4638m8280Q331
$$ 561138 602498 645728 654784 671767 653718 614812 671916 703617 742493 697855 649575 657906
10486F57906J4738j3320m3162q2779k7969M5777O3142k5278R230Q5409N4336L4398
$$ 657906 672644 659324 616162 533383 505414 551191 614333 589055 598285 683694 738030 772428
10474G72428M0087J2670j9425k6976N0853k8955k468m1621l9578K2628M2973l9495
$$ 772428 812515 825185 805760 778784 829637 800682 798214 756593 717015 739643 782616 743121
10462G43121p5145n2395m5777L6600J7353n4257p3222p8518K5668R1719k0529
$$ 743121 667976 615581 569804 606404 623757 569500 496278 417760 443428 535147 514618
10451E14618J1374j5597J3841p916L8642l2817o221L3838L2701j2008j7528n666
$$ 514618 525992 510395 524236 516320 554962 522145 515924 549762 582463 570455 552927 547261
10439E47261l9096k6251K2083N7577N1709L0957n5748l8519p725L6281R529m0956
$$ 547261 508165 481914 503997 561574 613283 644240 588492 549973 542248 578529 588058 547102
10427E47102l2398K0873J7317J3557N8455J8565L3209K6886R309o8809r9432M710
$$ 547102 514704 535577 552894 566451 624906 643471 676680 703566 712875 644066 544634 549344
10415E49344N1367K3280K23M1276J4555L6628O2053l3414l2278k2320J0196L0658
$$ 549344 600711 623991 624214 665490 680045 716673 778726 745312 713034 690714 700910 731568
10403G31568M5025O437l2624j7860K9077N4919k5382j6027M6227L7698M6581L4438
$$ 731568 776593 783030 750406 732546 761623 816542 791160 775133 821360 859058 905639 940077
10391I40077k238k2066m103k9819r0932m3544O6612O3526P1445L0659N4153J42023
$$ 940077 937839 915773 911670 881851 790919 747375 813987 877513 948958 979617 1033770 1175793
10379A175793P8761J38864J30743P5304J14641J92027K90138K63770M00722O26318
$$ 1175793 1254554 1393418 1524161 1599465 1714106 1906133 2196271 2460041 2860763 3487081
10369C487081Q21125J095317J533367K011920K392792K367342J403877l16192
$$ 3487081 4308206 5403523 6936890 8948810 11341602 13708944 15112821 14796629
10361A4796629j936205k673399k433284j859078j288614r44228o04563m64718
$$ 14796629 12860424 10187025 7753741 5894663 4606049 3661821 3057258 2592540
10353B592540l61976k26189j67175j52423j38816l2084k7119m6228j09238j03100
$$ 2592540 2230564 2004375 1837200 1684777 1545961 1513877 1486758 1440530 1331292 1228192
10343A228192l4028j443m5894m3103m212l8446m5337m7313m4093K1829J5309K4459
$$ 1228192 1194164 1192721 1146827 1103724 1099512 1061066 1015729 968416 924323 946152 961461 985920
10331I85920N5685P9150m2593r3926o4665L2248l053m1688m2110j2625N452N973
$$ 985920 1041605 1120755 1078162 984236 919571 951819 948766 907078 864968 852343 857795 863768
10319H63768j1118K1148L2836J3684m2706j4431Q619M5224M5880q480M2369N0340
$$ 863768 852650 873798 906634 920318 877612 863181 871800 917024 962904 954424 996793 1047133
10307A047133M3642J4537l0898J5030P3474K0680O7694J4552J2191k8803l1793
$$ 1047133 1090775 1105312 1074414 1089444 1162918 1183598 1251292 1265844 1278035 1249232 1217439
10296A217439p5553m1298K0985N4913P6494K3432P0596j1189k3165K6584N0454
$$ 1217439 1141886 1100588 1121573 1176486 1252980 1276412 1347008 1335819 1312654 1339238 1389692
10285A389692m0101J1301O5107o7836j14709m0176N9342R4267m788m8834m7551
$$ 1389692 1349591 1360892 1425999 1358163 1243454 1203278 1262620 1356887 1352099 1303265 1255714
10274A255714Q28M0693o3504J2215J5796n1783m7570O7743M5479m2772o5047J2081
$$ 1255714 1256542 1297235 1233731 1245946 1261742 1209959 1162389 1230132 1275611 1232839 1167792 1179873
10262A179873N4575K0885J9368K8859M640K3661J9217K3975j5343M718Q372Q7821
$$ 1179873 1234448 1255333 1274701 1303560 1308200 1331861 1351078 1375053 1359710 1364428 1372800 1460621
10250A460621J17546J21246N0941r2502r5216K3975k9644k5911j8101J9930j9513
$$ 1460621 1578167 1699413 1750354 1657852 1562636 1586611 1556967 1531056 1512955 1532885 1513372
10239A513372p7391N8037M4003n1133q2452m5178j1222O090J1113L0100J7105
$$ 1513372 1435981 1494018 1538021 1486888 1404436 1359258 1348036 1354126 1365239 1395339 1412444
10228A412444M0592K0386O808J6323L6896P204q3124l988Q3257J5324n7026M4384
$$ 1412444 1453036 1473422 1480230 1496553 1533449 1540653 1457529 1453541 1536798 1552122 1495096 1539480
10216A539480J2877O9856K4447k9200m539J03839Q0371K1202j2359j0599J4843
$$ 1539480 1552357 1622213 1646660 1617460 1612921 1716760 1797131 1818333 1805974 1795375 1810218
10205A810218K6297K009m418k0038Q9000M8869M2268R4904Q227J2847o094J3251
$$ 1810218 1836515 1838524 1834106 1814068 1903068 1951937 1994205 2089109 2097336 2110183 2104089 2117340
10193B117340R1918N3475K3305L5411M5612J00206J41410J26911J5715J1475O7742
$$ 2117340 2209258 2262733 2286038 2321449 2367061 2467267 2608677 2735588 2751303 2762778 2830520
10182B830520J33533K11415J81899J48597J75410L21283L75244L48018K66641
$$ 2830520 2964053 3175468 3357367 3505964 3681374 4002657 4377901 4725919 4992560
10173D992560L37789M42344N16768O35648Q00770R28397J184914J338562J432134
$$ 4992560 5330349 5772693 6289461 6925109 7725879 8654276 9839190 11177752 12609886
10164A2609886J478327J589453J724195J927126K070837K053720J849965J351877
$$ 12609886 14088213 15677666 17401861 19328987 21399824 23453544 25303509 26655386
10156B6655386O33273r8665p48094j187360j362854j351803j165434q35947m16912
$$ 26655386 27288659 27189994 26441900 25254540 23891686 22539883 21374449 20538502 20121590
10147B0121590j5897L87833Q54083J249910J512727J714300J706911J542495J119209
$$ 20121590 20105693 20493526 21347609 22597519 24110246 25824546 27531457 29073952 30193161
10138C0193161M11973l89948j009764j519579j892271k056770k016645j868419
$$ 30193161 30605134 30215186 29205422 27685843 25793572 23736802 21720157 19851738
10130A9851738j801310j705561j524485j366815j146218r68748q52808p08210
$$ 19851738 18050428 16344867 14820382 13453567 12307349 11338601 10485793 9777583
10122I777583n91126m94880l84535k69902j82560r1795m7891j6103O722J10033
$$ 9777583 9186457 8691577 8307042 8037140 7854580 7762785 7714894 7698791 7705513 7815546
10112G815546K24724K84476K66167K36348L38370M35504N14227N81781P00316
$$ 7815546 8040270 8324746 8590913 8827261 9165631 9601135 10115362 10697143 11397459
10103A1397459Q53479R53906J194785J412999J534400J902109K273377K673132
$$ 11397459 12250938 13204844 14399629 15812628 17347028 19249137 21522514 24195646
10095B4195646L118806L457243L740753L987707L871739L449206K866917K111593
$$ 24195646 27314452 30771695 34512448 38500155 42371894 45821100 48688017 50799610
10087E0799610J397016O74793M3962n56198r60405j288704j553697j472904j112024
$$ 50799610 52196626 52871419 52915381 52359183 51398778 50110074 48556377 47083473 45971449
10078D5971449n53120K74405J110538J879636K584980K913297K920571K503112
$$ 45971449 45418329 45692734 46803272 48682908 51267888 54181185 57101756 59604868
10070E9604868J664426N07026o23575j692880k546446l214681l742973m071105
$$ 59604868 61269294 61776320 61152745 59459865 56913419 53698738 49955765 45884660
10062D5884660m241786m246712m087701l630344l286001k849780k462491k086470
$$ 45884660 41642874 37396162 33308461 29678117 26392116 23542336 21079845 18993375
10054A8993375j707490j413145j262553j040342r01592o69613n39234m65703l84570
$$ 18993375 17285885 15872740 14610187 13569845 12668253 11998640 11459406 10993703 10609133
10045A0609133l08026l01853k01013k13947j83835j48614o0233j28372m5335K2394
$$ 10609133 10301107 9999254 9798241 9584294 9400459 9251845 9191612 9063240 9017905 9040299
10035I040299N3242J54747L84621M23790M85396N89356P92535R31198J132636
$$ 9040299 9093541 9248288 9632909 10056699 10542095 11131451 11923986 12855184 13987820
10026A3987820J251785J422762J569170J751065J878832J959771K093585K201634
$$ 13987820 15239605 16662367 18231537 19982602 21861434 23821205 25914790 28116424
10018B8116424K157024K064849J778717J180503L94078m80580j155163j584541
$$ 28116424 30273448 32338297 34117014 35297517 35691595 35211015 34055852 32471311
10010C2471311j583186j374028j027484m72852J07520P04081J256776J664515
$$ 32471311 30888125 29514097 28486613 28013761 28121281 28825362 30082138 31746653
10002C1746653J961807K145123K118875J793917J049358K1612j071809k221852
$$ 31746653 33708460 35853583 37972458 39766375 40815733 40837345 39765536 37543684
9994C7543684l017376l404564l379149l051088k718765k275105j867602j499225
$$ 37543684 34526308 31121744 27742595 24691507 21972742 19697637 17830035 16330810
9986A6330810j162528r80042q02582n54781l31168j26560K652K5289L8353N7057
$$ 16330810 15168282 14188240 13385658 12830877 12499709 12373149 12375801 12401090 12439443 12496500
9976A2496500L8055O1960R7298J31816J35158O7590L6468m7959j81416k69077
$$ 12496500 12534555 12596515 12693813 12825629 12960787 13028377 13064845 13016886 12835470 12566393
9966A2566393j97268j72731k1311J96306M09925O68359Q10544R03119R11621R46782
$$ 12566393 12369125 12196394 12175083 12371389 12781314 13449673 14260217 15163336 16074957 17021739
9956A7021739J063951J192536J196763J157743J040515P38702M02011Q7922k81590
$$ 17021739 18085690 19278226 20474989 21632732 22673247 23411949 23813960 23901882 23620292
9947B3620292m63999n30706n21726m64902m28219m07107m39763n22008n99790
$$ 23620292 23156293 22625587 22103861 21638959 21210740 20803633 20363870 19841862 19242072
9938A9242072l67289j05639J90134N36962O94051P09609O75373N19225M37641
$$ 19242072 18874783 18769144 18959278 19496240 20190291 20899900 21575273 22094498 22532139
9929B2532139M12840L54216L41098L58702L19607J29800k06975n05369q29664
$$ 22532139 22944979 23299195 23640293 23998995 24318602 24448402 24241427 23736058 22906394
9920B2906394j159229j325498j310303j234575j036823p76203o71976n80074m60748
$$ 22906394 21747165 20421667 19111364 17876789 16839966 16063763 15391787 14811713 14350965
9911A4350965k88064j35582J92997M32683N42017O22594N90536N91627O27463
$$ 14350965 14062901 13927319 14120316 14552999 15095016 15717610 16308146 16899773 17527236
9902A7527236P51517Q79033J042367J404164J654892J683092J553048J154141
$$ 17527236 18278753 19157786 20200153 21604317 23259209 24942301 26495349 27649490
9894B7649490P15878L86268K90802M61585N00858M99428N07523L98208K32606
$$ 27649490 28365368 28751636 29042438 29504023 30004881 30504309 31011832 31410040 31642646
9885C1642646j54228n97650q55408q60773n45738L5418N76224J116403J518985
$$ 31642646 31488418 30890768 30035360 29174587 28628849 28664267 29240491 30356894 31875879
9876C1875879J814688K096750K518256K998737L394547L616493L484468K930145
$$ 31875879 33690567 35787317 38305573 41304310 44698857 48315350 51799818 54729963
9868E4729963K060077R60762l5904o46687q27070q59061q33121p67400q43397
$$ 54729963 56790040 57750802 57714898 57068211 56241141 55382080 54548959 53781559 52938162
9859E2938162j029810j374626j678011j805828j745523j383315q23719j76314
$$ 52938162 51908352 50533726 48855715 47049887 45304364 43921049 43097330 42921016
9851D2921016M20364P43232P42284O15715O17531P64768J053877J275800J391326
$$ 42921016 43341380 44084612 44826896 45442611 46060142 46824910 47878787 49154587 50545913
9842E0545913J216580O96110p0020q95838j754864k318082k467193k315257j958765
$$ 50545913 51762493 52458603 52388583 51492745 49737881 47419799 44952606 42637349 40678584
9833D0678584j546324j215932r26199o27191l29897K7107P07443J530689K269691
$$ 40678584 39132260 37916328 36990129 36362938 36033041 36060148 36767591 38298280 40567971
9824D0567971K909224L217953L021630K264870Q38346p36273k118170l219697
$$ 40567971 43477195 46695148 49716778 51981648 52819994 52083721 49965551 46745854
9816D6745854l642287l681563l377503l012920k653505k379341k095372j902593
$$ 46745854 43103567 39422004 36044501 33031581 30378076 27998735 25903363 24000770
9808B4000770j538534r47879m52416J83585P85399J324348J816057K157764K413495
$$ 24000770 22462236 21514357 21061941 21245526 22030925 23355273 25171330 27329094 29742589
9799B9742589K253234J762437R58371k37140j408105k274046k729826k872587
$$ 29742589 31995823 33758260 34716631 34479491 33071386 30797340 28067514 25194927
9791B5194927k717436k642676k393679k035733j778286j574667j304906r68183
$$ 25194927 22477491 19834815 17441136 15405403 13627117 12052450 10747544 9779361
9783I779361p40388o02906m26582k58394k67884j73029j83888j00253o3289L1066
$$ 9779361 9038973 8436067 8009485 7751091 7483207 7310178 7126290 7026037 6962748 6993814
9773F993814O0263J12701J67347K70842M06765O23306P50816R69873J198266J548602
$$ 6993814 7054077 7166778 7334125 7604967 8011732 8635038 9385854 10355727 11553993 13102595
9763A3102595J900911K283476K675692L121141L661960M015412M180958M157649
$$ 13102595 15003506 17286982 19962674 23083815 26745775 30761187 34942145 39099794
9755C9099794L686979K742353J328486m43972j859188k845890l279592l255896
$$ 39099794 42786773 45529126 46857612 46413640 44554452 41708562 38428970 35173074
9747C5173074k979266k630932k020166j277221m98416J21108Q18058J427416K031305
$$ 35173074 32193808 29562876 27542710 26265489 25767073 25888181 26706239 28133655 30164960
9738C0164960K550240K971689L167668L262291L318391L000047K557806J784629
$$ 30164960 32715200 35686889 38854557 42116848 45435239 48435286 50993092 52777721
9730E2777721M63713j352881k935351m046246m388214m292300l948384l483355
$$ 52777721 53241434 51888553 48953202 44906956 40518742 36226442 32278058 28794703
9722B8794703l085292k504207j980179j357711r07732n93225l44179k09364j90520
$$ 28794703 25709411 23205204 21225025 19867314 18959582 18366357 18022178 17812814 17622294
9713A7622294l31531n65984r35813j095349j098982j139191j029298q52101q04903
$$ 17622294 17290763 16724779 15788966 14693617 13594635 12455444 11426146 10574045 9769142
9704I769142o42753n64905l75342j44508j8748M9360R0278K78951M45954O64238
$$ 9769142 9126389 8561484 8186142 8041634 8022886 8072246 8162524 8441475 8887429 9551667
9694I551667Q53286J003570J158070J265893J421812J444993J404373J278267
$$ 9551667 10404953 11408523 12566593 13832486 15254298 16699291 18103664 19381931
9686A9381931R19977M05072j48527m80348p13978p93673o95205m24371p5070L04041
$$ 19381931 20301908 20706980 20558453 20078105 19364127 18570454 17875249 17450878 17375808 17679849
9676A7679849P08466J098728J441135J639310J876188K080071J827051J338812
$$ 17679849 18388315 19487043 20928178 22567488 24443676 26523747 28350798 29689610
9668B9689610P18683K18571q3553j90821l50347n57088r29651j429810j879300
$$ 29689610 30408293 30626864 30543311 30352490 30002143 29445055 28515404 27085594 25206294
9659B5206294k075557j911230j636054j217304q39198n21487k9802L29199N38609
$$ 25206294 23130737 21219507 19583453 18366149 17526951 17005464 16975662 17304861 17843470
9650A7843470Q02208R96093R05361Q02234L81504l83394j122658j757026k068723
$$ 17843470 18645678 19641771 20547132 21349366 21730870 21347476 20224818 18467792 16399069
9641A6399069k071384j838811j628041j397984j224926r56211q10532p22517n62763
$$ 16399069 14327685 12488874 10860833 9462849 8237923 7281712 6471180 5748663 5185900
9632E185900m47005l69836l27433k35365k07050j27992k31958j68414j41696m4471
$$ 5185900 4738895 4369059 4041626 3806261 3599211 3471219 3239261 3070847 2929151 2884680
9622B884680n7449q1141L1301N394J2035J0650L5259P8494J62917K96305L00845
$$ 2884680 2827231 2746090 2777391 2782785 2794820 2805470 2840729 2919223 3082140 3378445 3679290
9611C679290L56146M02953N02095N33971N26656O01521P34284P45697O54369M74565
$$ 3679290 4035436 4438389 4940484 5474455 6001111 6602632 7336916 8082613 8736982 9211547
9601I211547P6316l28187n26605p28908p92121p60190o82538n45165n10904l11745
$$ 9211547 9287863 8959676 8433071 7704163 6912042 6151852 5469314 4924149 4413245 4101500
9591D101500q2968L654Q7189J24907J79951L42271M29346N82591O77555O62157
$$ 4101500 4018532 4022186 4109375 4234282 4414233 4756504 5185850 5768441 6445996 7108153
9581G108153P00372O41133M23405J58382k16223n99045q46149r24816q93622p65967
$$ 7108153 7808525 8449658 8873063 9031445 8815222 8216177 7370028 6445212 5551590 4785623
9571D785623o59110n36797m70572l81145l21499k23399k00946j55869j09747r7816
$$ 4785623 4126513 3589716 3119144 2737999 2416500 2193101 1992155 1836286 1726539 1628723
9561A628723j15799j62716j10403m2610n0455r9596k7433m3434j2795j5339p0253
$$ 1628723 1512924 1350208 1239805 1197195 1146740 1047144 1019711 976277 963482 948143 877890
9550H77890M943L4804l954j2613l0470J7051o7363m4715m8909o7288m6374l2182
$$ 877890 882833 917637 913683 901070 870600 887651 820288 775573 726664 659376 613002 580820
9538E80820M1709j9857j9623J2138L9226j308L0300k7670J5283L6674j9258J7014
$$ 580820 622529 602672 583049 595187 634413 633105 663405 635735 651018 687692 668434 685448
9526F85448J9950m2362j8787M3437L8615l4250m6027N9803J10242m4619N4437
$$ 685448 705398 663036 644249 687686 726301 692051 646024 705827 816069 771450 825887
9515H25887M0926j1250R505O507r334J3072J1948o133l789k1028o1340q0272q897
$$ 825887 866813 855563 865068 871575 862241 875313 887261 881128 877339 856311 794971 714699 705802
9502G05802M2198m175N147j2359j4817k4531O9198k1358o4587j6189O1831J777
$$ 705802 748000 743825 748972 736613 721796 697265 766463 745105 680518 664329 726160 727937
9490G27937k32l5772N654L841m7397k6365k567L3540l396K9506R69L0525l3849
$$ 727937 727705 691933 697587 701428 654031 627666 625099 658639 655243 684749 685718 716243 682394
9477F82394o5592j0564l8799P943K9527j6074K2072j9248n5760P532N5661K7410
$$ 682394 616802 606238 567439 575382 604909 588835 610907 591659 535899 543431 599092 626502
9465F26502L6190L9445j08719j6563N5081N1476L5797N0904K0913n1087L0720
$$ 626502 662692 702137 593418 576855 631936 683412 719209 770113 791026 739939 770659
9454G70659l3758k1586M8238L8896P5087j74l0846j6963J3299L6218o1681k3741
$$ 770659 736901 715315 763553 802449 877536 877362 846516 829553 842852 879070 817389 793648
9442G93648J3690K9183N9113M9530J3354P199O9275J3580j5352M4419n8584r7171
$$ 793648 807338 836521 895634 945164 958518 965717 1034992 1048572 1033220 1077639 1019055 921884
9430I21884k6584k5078j8278J2189O6467J4588M018l4477Q298P479m7870m5248
$$ 921884 895300 870222 851944 864133 930600 945188 949206 914729 923027 930506 882636 837388
9418H37388n24j0856m3364o614R744J3831k3215j1090P6708j847K5215O8734O5871
$$ 837388 836864 826008 782644 776030 785774 799605 776390 765300 842008 840161 865376 934110 999981
9405I99981P632O742n1576p954M5304l080M3572P9065P0934M8706l2499q2804
$$ 999981 1007613 1014355 962779 954825 1000129 997049 1040621 1119686 1190620 1239326 1206827 1124023
9393A124023j26012o3692o6540n4894m0561k2613q2291k2108j2121k9463p5680
$$ 1124023 998011 934319 867779 812885 772324 749711 667420 645312 633191 603728 528048
9382E28048L0050Q3089k2209j6409k0333m4256j2326k0357P157L7410M0443M4363
$$ 528048 558098 641187 618978 602569 582236 537980 525654 505297 512454 549864 590307 634670
9370F34670L0513m310L049J7349Q5013L2110L1740J03565J35280O6709K6255M8968
$$ 634670 665183 660873 663922 681271 766284 798394 830134 933699 1068979 1135688 1161943 1210911
9358A210911M3125K792K7057l3493j08434L299j9007r5192o2870l6566m8402n5058
$$ 1210911 1254036 1256828 1283885 1250392 1141958 1145257 1126250 1031058 968188 931622 883220 828162
9346H28162o1631j8905j12210J2616M316K0132K9931J7957m1185o6558K7266J3618
$$ 828162 766531 747626 635416 648032 652348 672480 702411 720368 679183 612625 639891 653509
9334F53509L2987j2423j8311m4452J168j7797n1320M3040Q9176O3553N9512P0535
$$ 653509 686496 674073 655762 611310 612478 594681 543361 586401 675577 739130 798642 869177
9322H69177P8943Q1675L6310P2711O284q0794n1380j8504l890j24512r0917r9129
$$ 869177 948120 1029795 1066105 1138816 1145100 1064306 1012926 994422 990532 866020 775103 675974
9310F75974o2856j1211L046r675q5251o1460j3105m5491j10926N8350P3079k2524
$$ 675974 613118 601907 604953 595278 510027 448567 435462 389971 279045 337395 410474 387950
9298C87950k8920j9874k4162m1397n0632K4689J0897p8153K656P9156L2998O3085
$$ 387950 359030 339156 314994 273597 222965 247654 258551 180398 183054 262210 295208 358293
9286C58293Q986k7686j3868M1716k0972j5131n7714K1119K4410j4431J1101R5539
$$ 358293 367279 339593 325725 367441 346469 331338 273624 294743 319153 304722 315823 411362
9274D11362P9890l5942j9606k5319j1332j9731J3974l9099n7684m9811q917J2328
$$ 411362 491252 455310 435704 410385 399053 379322 393296 354197 296513 246702 237785 250113
9262B50113o969j8043M3470N2621K5868k1513L3171k2q8078l7983J5511M1122
$$ 250113 243144 225101 268571 321192 347060 325547 358718 358696 270618 232635 248146 289268
9250B89268L9162L271l8283l1332N6538K5667J1587m9027j8327k9672l1820L6063
$$ 289268 328430 331701 293418 262086 318624 344291 355878 306851 288524 258852 227032 263095
9238B63095l850o0829o476K3408P0290k2850k1106l956O4P265k4786n116K7275
$$ 263095 259245 198416 191940 215348 285638 262788 241682 237726 237790 245055 220269 215153 242428
9225B42428j4709r534J4897m4567m5165L309m3178n762K5489j5507l6461N3921
$$ 242428 227719 218185 233082 188515 143350 146659 103481 97719 123208 107701 71240 125161
9213A25161O9197r656k0177j6803J9058j4536L5367M1705o6705J7664P625m5909
$$ 125161 194358 184702 164525 147722 166780 152244 187611 229316 162611 180275 187900 141991
9201A41991k4541N823j2234l1287J8445N7225N845k6083l8324M7320K0848P840
$$ 141991 117450 123273 111039 79752 98197 155422 161267 135184 96860 144180 165028 172868
9189A72868j9241k6967p6385n2402M3467K3805N3478L9172m2805j7107P390m2804
$$ 172868 153627 126660 50275 -2127 41340 65145 118623 157795 114990 97883 105273 62469
9177F2469J8429M2132m0239J2882M2914k4082J4841N1676q878m2253o530n4236
$$ 62469 80898 123030 82791 95673 138587 114505 129346 181022 172144 129891 123361 69125
9165F9125L8008K7354J154o278m5507K4055L1750j4291m083m8708j5276j7805
$$ 69125 107133 134487 135641 129363 83856 107911 139661 125370 121287 72579 57303 39498
9153C9498K2994j1251r777O0108r758L6145N0033n5164j0894j346m127j8316J5981
$$ 39498 62492 51241 41464 101572 91814 127959 177992 122828 111934 110588 106461 88145 104126
9140A04126R939o4686o1109K0179P2365J4958J7045j2190R621k3179n6862k7086
$$ 104126 114065 49379 -11730 8449 80814 95772 112817 100627 110248 87069 30207 3121
9128C121l0934l6086J8930J1952l8564L55P3113O4196L3531l9244o3217N3687
$$ 3121 -27813 -63899 -44969 -33017 -71581 -71226 1887 66083 99614 60370 -2847 50840
9116E0840k561j3605m298M2247O5297r270o557L8966K2p6951l9360Q681L821R021
$$ 50840 48279 34674 30376 72623 137920 128650 122093 161059 161081 84130 44770 53451 57272 66293
9102F6293J6846l6511k7620k6867J5320M3695M2017L6946J7066j7887k7357m8781
$$ 66293 83139 46628 19008 -7859 7461 51156 93173 130119 147185 129298 101941 53160
9090E3160K7378o844j9500k8395m017O262o2103k4J05297L5553k3192Q460Q283
$$ 53160 80538 73694 54194 25799 21782 28044 -34059 -34083 71214 106767 83575 92035 100318
9077A00318q039Q505K1162n3695K2523L4321j2770k7441N692K527k8122l713K1408
$$ 100318 92279 100784 121946 68251 90774 125095 112325 84884 90576 93103 64981 61268 82676
9064H2676K694j0150l3746J2470M3647m2781m5072M2152k6718N2074K0531m516
$$ 82676 85370 75220 41474 53944 97591 54810 9738 51890 25172 77246 97777 93261
9052I3261J0163O7850K62K9771j4243p8492k0014M3603j3660J2513o1922j5604
$$ 93261 103424 171274 171536 201307 187064 108572 88558 132161 118501 131014 69092 53488
9040E3488O0790L0131n4708j0188l1763L1260J9382k1233m3565R380N0106N6047
$$ 53488 114278 144409 89701 79513 47750 79010 98392 77159 33594 42974 93080 149127
9028A49127K3421L361l7496k6590j1395m8001k3064n410j5119k1345k4318N3042
$$ 149127 172548 175909 138413 111823 100428 52427 29363 23953 8834 -12511 -36829 16213
9016A6213M2529j1106K7507K680l8758m7894j3919L2736L5569M7692k9234l6462
$$ 16213 58742 47636 75143 77823 39065 -8829 -22748 9988 45557 93249 64015 27553
9004B7553M5481P1308p085p1142J5739L659m7091k8939j0399N0590L6112l9014
$$ 27553 73034 144342 137257 66115 81854 85513 38422 9483 -916 49674 85786 46772
8992D6772J9140p263K3244q10N651L2726M6856m6315j11282n7231J4062Q5908
$$ 46772 65912 58649 81893 81083 86734 119460 166316 120001 8719 -48512 -34450 51458
8980E1458J6734l073k1577m5000k3474p379L0575L7870P7761L4888K732L7302
$$ 51458 68192 65119 43542 -1458 -24932 -32311 -1736 36134 113895 148783 151515 188817
8968A88817l1649m9376J1804K6311n6020m2940O1805J0625m7844k3837p3400K1771
$$ 188817 157168 107792 119596 145907 89887 46947 108752 119377 71533 47696 -25704 -3933
8956c933M6586Q391L366j5745j8807l4770l2164K5592R6597Q3478j6451J021K5789
$$ -3933 42653 51044 54410 38665 19858 -14912 -47076 -21484 75113 158591 142140 143161 168950
8943A68950j4486L8961l2367K951k9137j2484J8632m4567o8552p8677J3534P9385
$$ 168950 154464 193425 161058 164009 134872 122388 141020 96453 27901 -50776 -37242 42143
8931D2143M0792K2J7279j7729j5736l9638L1632M367o585K6748L1167L2709K5936
$$ 42143 82935 82957 100236 82507 66771 27133 58765 63132 56547 83295 114462 147171 173107
8918A73107p1423o245O461k7116j6724Q904J7546k5578k0419L1351J3316n4102
$$ 173107 101684 95439 101900 74784 58060 66964 84510 58932 38513 69864 83180 29078
8906B9078n5331N5884l1443J1619L7439J5799O3166J2841J244l5971j2808O7035
$$ 29078 -26253 29631 -1812 9807 47246 63045 126211 139052 140296 104325 91517 158552
8894A58552M3960o4279j565J17512l2151l9213k6631K8213R2089j4357J6870J06990
$$ 158552 202512 138233 136668 254180 222029 182816 156185 184398 276487 262130 279000 385990
8882C85990J17506J65000J54559J52153L06393L65095M38919O81974R70833J292397
$$ 385990 503496 668496 823055 975208 1281601 1646696 2085615 2767589 3738422 5030819
8872E030819J298196P19935m89832j369761j457165j080247p52463n08662k78851
$$ 5030819 6329015 7048950 6559118 5189357 3732192 2651945 1899482 1390820 1111969
8863A111969j90218j18615j13541q7448q8148m3346p8830l8281J563m9571k6596
$$ 1111969 921751 803136 689595 602147 513999 470653 391823 353542 355105 305534 278938
8852B78938j4094l1727k9042p2398K0561N4767l4743J1173p946m1777M0258M9455
$$ 278938 264844 233117 204075 131677 152238 207005 172262 183435 175489 133712 173970 223425
8840B23425p3030j0163J3892l2830m975k9529J9231L2012k4421j17234m5560K4262
$$ 223425 150395 140232 154124 121294 116319 86790 106021 138033 113612 -3622 -49182 -24920
8828b4920J5761N0321j5315M769k9950m7630j5287O2689M9042k9959o617O5897
$$ -24920 -9159 41162 25847 30616 666 -46964 -62251 438 49480 19521 12904 78801
8816G8801K9164m4621o0315k3975J347J066R216M58L3014L8066N2449L9250J3123
$$ 78801 107965 63344 3029 -20946 -19599 -18533 -9317 -8859 24155 62221 114670 153920 167043
8803A67043j9125M67o1791K1382j4461m9662J8435N9524K5733l5076k6093j5855
$$ 167043 147918 148385 86594 107976 93515 43853 62288 121812 147545 112469 86376 70521
8791G0521O2671J9547k9176j0734j854q2368K190L9302K0091j8783m7441k6478
$$ 70521 133192 152739 123563 112829 110975 28607 30797 70099 90190 71407 23966 -2512
8779b512J7255m316j4687n684J238L8115o840J2558m3519J1696K7369o2577j4585
$$ -2512 14743 10427 -4260 -9944 -8706 29409 22569 35127 -8392 3304 30673 -31904 -46489
8766d6489K201j6317r677M9753N6817N1097j2717m0878J914O4230p796l5148R063
$$ -46489 -44288 -60605 -70282 -20529 36288 87385 74668 33790 35704 99934 92138 56990 66053
8753F6053L8321n4963l2605J4886J1871Q010n2130N568j1672k5407o2162N3055
$$ 66053 104374 49411 16806 31692 43563 51573 -557 5011 -6661 -32068 -94230 -41175
8741d1175M1710L0057P9004J8783l3477r8227l5036k8234M6902N3611J2204K7017
$$ -41175 535 30592 109596 128379 94902 -3325 -38361 -66595 -19693 33918 46122 73139
8729G3139n202N394k821N2922L8093q4755m4193K9942l9116k3643N3921l5217
$$ 73139 67937 73331 70510 123432 161525 76770 32577 62519 23403 -240 53681 18464
8717A8464K9528k0498L2943K8913L1822p841J7418k320j3848M1322O6603k3146
$$ 18464 47992 27494 60437 89350 121172 113331 130749 128429 114581 155903 222506 199360
8705A99360k0232q6094o2791L287N7683r219m2800k1860J8152k5415n1378o5902
$$ 199360 179128 93034 30243 33530 91213 81994 39194 17334 35486 10071 -41307 -107209
8693a07209O1100J06407O0393j5862n4700k4510k329n5196m57m0676l7262K5172
$$ -107209 -46109 60298 120691 104829 50129 25619 23290 -31906 -32363 -73039 -110301 -85129
8681h5129R1444M5011j5959o2083K2036M7936p049m8892M32r775O221p546q084
$$ -85129 6315 51326 35367 -26716 -4680 43256 36207 -12685 -12253 -22028 -15807 -23353 -31437
8668c1437O0751L0238J5501m6473j6250J8863J5132J428K4810J5367o2817k4457
$$ -31437 29314 59552 75053 28580 12330 31193 46325 47753 72563 87930 25113 656
8656F56P035Q729j0857K9546L5352r802J0329M9407m3287k3959M9057J5427R694
$$ 656 7691 16420 5563 35109 70461 60659 70988 120395 77108 53149 102206 117633 127327
8643A27327P132k9697q3160l3320P1508K1078O2242l901N375K3944k618n8364
$$ 127327 134459 104762 21602 -11718 59790 80868 143110 139209 144584 168528 165910 107546
8631A07546p5242J918j6131O0532P1741M8932r581n7621l4077n2578O857K9093
$$ 107546 32304 34222 18091 78623 150364 199296 189715 132094 98017 45439 52296 81389
8619H1389N5418j8703j236l9399J5717k6661M795N3878N684K8037L2512L8009
$$ 81389 136807 118104 116868 77469 93186 66525 71320 125198 130882 158919 191431 229440
8607B29440j5912m5803k8629L9735L0758k6253l2204n540J2361J8423J6939m8129
$$ 229440 213528 167725 139096 178831 209589 183336 151132 145592 157953 176376 193315 145186
8595A45186J2950K4889j2652p7413k3352K8798J5329m73J0736J5759m1736o3493
$$ 145186 158136 183025 170373 92960 69608 98406 113735 113262 123998 139757 98021 34528
8583C4528K4883j2823l8909Q537J04647M5001k9418n0457k9921K3287m061K0581
$$ 34528 59411 46588 7679 16216 120863 165864 136446 85989 56068 79355 75294 95875
8571I5875K9446N203O023l8843m7594l2323l4674O6982L1009k245l6225J8981
$$ 95875 125321 130524 136547 97704 50110 17787 -16887 50095 81104 78859 42634 61615
8559F1615O1181N4455p338l2210J3439M0751J683L8352N8256L6159k1454o7151
$$ 61615 122796 177251 169913 137703 151142 191893 193576 231928 290184 326343 304889 237738
8547B37738o6799o2983K0533j5440n192O415P377K4368l0519n1455l4963N75N1780
$$ 237738 170939 107956 128489 113049 107857 114272 121649 146017 115498 64043 29080 29655 81435
8534H1435K1377m3118M856Q056K359L5907L2470l2495j02587n0254K1311J9188
$$ 81435 102812 59694 64550 72606 74965 110872 143342 110847 8260 -41994 -20683 -1495
8522a495J5789j6532J4205r312l218k8411J1427K8033P2090J0309R456L792r22
$$ -1495 14294 -2238 11967 2655 -563 -28974 -17547 10486 82576 92885 102341 106133 105211
8509A05211R253p1204K1624N3056J34226J15261J9047P015k4267m0391o8857p3988
$$ 105211 114464 43260 64884 117940 252166 367427 386474 393489 369222 328831 259974 185986
8497A85986O5978P328r599p4446o3076j7698l727N3606N9550k3803q6674J6897
$$ 185986 251964 259292 249693 175247 112171 94473 90746 144352 203902 180099 93425 110322
8485A10322J2199L5634R981L1239J5220o9463m0251J1902M9625L339m324R302
$$ 110322 122521 158155 168136 199375 214595 145132 104881 116783 166408 169747 165423 174725
8473A74725R661k2777N9658l879k8680j6909M8966K0615M2727N4493j0485Q3940
$$ 174725 184386 161609 221267 217388 188708 171799 220765 241380 284107 338600 328115 412055
8461D12055J50284J82920K28423L16410M70882N53127L51384K4980l31163n76337
$$ 412055 562339 745259 973682 1290092 1760974 2314101 2665485 2690465 2359302 1782965
8451A782965n52363l52268j80981j10209j20832q9242o2155l0962k6227J2815
$$ 1782965 1230602 878334 697353 587144 466312 377070 314915 283953 257726 270541
8441B70541J3001j3184L6860j3878n3503n7272k0102K7553K4149J6k0069m8900
$$ 270541 283542 270358 307218 293340 239837 182565 162463 190016 214165 214181 194112 145212
8429A45212l2230J7741O3288M5243j3595l0661j5533O8182M2937N9500J18122
$$ 145212 112982 130723 194011 239254 225659 194998 179465 247647 290584 350084 468206
8418D68206P4894R2992J12399K08999K67905M47864O00296Q49391R45402P07096
$$ 468206 543100 636092 748491 957490 1225395 1673259 2273555 3122946 4068348 4775444
8408D775444o4083q12549j141143q72102n41157m05237k47676j72319p7692l2173
$$ 4775444 4711361 3898812 2757669 1885567 1344410 939173 691497 519178 441486 409313
8398D09313n0522q455n3941o3695k4010J4702K5908K406m1136Q396n6950j477
$$ 409313 358791 350336 296395 232700 208690 223392 249300 251706 210570 218966 162016 160539
8386A60539k4815o4146J5040p110l7369J1398O2957O2109M5828j8267j9340j5752
$$ 160539 135724 71578 86618 79508 42139 53537 116494 178603 224431 206164 186824 171072
8374A71072N3212r831M1035J09800N3875J06718J26657J92862K99839L56747L61536
$$ 171072 224284 214453 255488 365288 419163 525881 652538 845400 1145239 1501986 1863522
8363A863522K17531n3930l71136m50596l31203k49468k10319j22035m1185l6437
$$ 1863522 2081053 2027123 1655987 1205391 874188 624720 414401 292366 251181 214744
8353B14744K7863K5998n6949q9716K497O5807J8027l8311p6937j416J0629J6660
$$ 214744 242607 268605 211656 121940 124437 190244 208271 169960 93023 91607 102236 118896
8341A18896P2423P1O716l0609o7555o6578R886P9965L1458l7745r402O0143k1964
$$ 118896 191319 191390 198106 167497 99942 33364 43250 123215 154673 116928 107526 167669 145705
8328A45705q1586n9903L1414l149p1116K1717M5566j4631O3230j105J7297P9122
$$ 145705 64119 4216 35630 32481 -38635 -16918 28648 14017 77247 76142 93439 172561
8316A72561n0578l0945J7048q694m3802N987J176l7550k3956J2063J1423o4839
$$ 172561 121983 91038 108086 99392 55590 61577 62753 25203 1247 13310 24733 -40106
8304d0106l4654O0144J22270r469n1125k2799K7765J4666j1711r218L8440J8970
$$ -40106 -74760 -14616 107654 98185 47060 24261 52026 66692 54981 45763 84203 103173
8292A03173K4992k8383r4778k0749o019J1069K6636j4193q40M8452J4576k0389
$$ 103173 128165 99782 5004 -15745 -21764 -10695 15941 1748 908 49360 63936 43547
8280D3547J1317r725n4830n9896Q518n0221l5592M654M2099K2618l977J910K5191
$$ 43547 54864 45139 -9691 -69587 -61069 -111290 -146882 -142228 -100129 -77511 -81488 -79578 -54387
8267e4387k384j043K4699L000Q538R046K8776Q7103O68j13937m9457L7621J23088
$$ -54387 -56771 -57814 -33115 -30115 -21577 -12531 16245 103348 104016 -9921 -59378 -21757 101331
8254A01331J8339q051n8190l0633K3347l0698K0300k2425j5069K6581j462P134
$$ 101331 119670 111619 53429 22796 46143 15445 35745 13320 -1749 24832 23370 30504
8242C0504J2783j3661Q1277J4881P93j3388J2234J0276o0351j6203l9483J711
$$ 30504 43287 29626 110903 125784 126577 113189 125423 135699 75348 59145 19662 21373
8230B1373N2379K3834m0394m1320J7894O3752J3556l0331m7916J6155j3940p0855
$$ 21373 73752 97586 57192 15872 33766 97518 111074 80743 32827 48982 35042 -35813
8218c5813m1896R48N3624k6574P342O3348M1036j6816m4384p5185m1610k6798
$$ -35813 -77709 -76761 -23137 -49711 -42369 20979 62015 45199 815 -74370 -115980 -142778
8206a42778J1926J3637l0564K6912L6063N1746o30J8182M3327L3320L7375J5721
$$ -142778 -130852 -117215 -147779 -120867 -84804 -33058 -33688 -15506 27821 61141 98516 114237
8194A14237k2359m4041j5228K1642l7243k1499J7027O649L3915L2484p2670j8582
$$ 114237 91878 47837 32609 54251 17008 -4491 12536 19185 53100 85584 12914 -5668
8182e668M7074O005l5872L1189l589M691K286J3300M942K6356n550l9973j250
$$ -5668 41406 47411 11539 42728 39139 43830 46116 59416 64358 90714 85164 45191 43941
8169D3941k838m1617p2465k055M1470J1021L5378l5689o657q342k4830j3218j0124
$$ 43941 41103 -514 -72979 -75034 -33564 -22543 12835 -22854 -29511 -37853 -62683 -75901 -86025
8156h6025p322M98K8058O985m4534Q4858M8919n0818k1492P3155L9053j1888K1715
$$ -86025 -93347 -92849 -64791 -57806 -102340 -17482 31437 -19381 -40873 32282 71335 59447 81162
8143H1162K6029k7131k4041J5698k4982m9828L7394O6059k8158j4685L2075l748
$$ 81162 107191 80060 56019 71717 46735 -3093 34301 100360 72202 57517 89592 85844
8131H5844L073m6318p258r211K9901L9170O0474j7723k4563k2026k2323m3494
$$ 85844 88917 42599 35341 26130 56031 95201 155675 137952 113389 91363 69040 25546
8119B5546j4684n717m0032R997L9923R063J48J4916j1977m2459m9674K1643k17
$$ 25546 10862 5145 -34887 -24890 15033 24096 24244 39160 27183 -15276 -64950 -43307 -43524
8106d3524L2547J6134L834j963J3380J0012j0849M5066n7440o8669O6345J01447
$$ -43524 -10977 5157 8991 7028 20408 30420 19571 64637 7197 -61472 4873 106320
8094A06320m3272o1231J6436J7223j6319j8412K8014j5903p8400n4494M4633P1663
$$ 106320 63048 1817 18253 35476 19157 745 28759 12856 -65544 -120038 -75405 -3742
8082c742k9609m7482P733J8013K8915J8889k1993k2190O7895K5272M5536J5860
$$ -3742 -33351 -80833 -73100 -55087 -26172 -7283 -29276 -51466 16429 41701 87237 103097
8070A03097o0534Q573k5192j0362N4966m023l3575L8111J9249m5093p1142M3748
$$ 103097 42563 51136 25944 15582 70548 66525 32950 71061 90310 45217 -25925 17823
8058A7823P429l6731K9026n12j9000K0459j720l037m0877n5527K0794l63L5633
$$ 17823 25252 -11479 17547 17035 -1965 18494 16774 13737 -27140 -82667 -61873 -62236 -26603
8045b6603j2943l1832K2565L1338J9457l4703m02M3098L6492p860p025M5986k461
$$ -26603 -39546 -71378 -48813 -17475 1982 -32721 -33123 9975 46467 38607 31582 77568 75107
8032G5107l4289J1676P5929K904r1171m1433K7788q971n912L9693k125L152k347
$$ 75107 40818 52494 128423 131327 40156 -1277 26511 17540 11628 51321 49196 52348 50001
8019E0001J2313m0373m5633N1300L5739K9478L6385J3161r7905L2508K5137k9188
$$ 50001 62314 21941 -23692 27608 63347 92825 129210 142371 44466 76974 102111 72923
8007G2923n4456L0296L7858L332j5623j9612K878L1369J1336j4535K287m6399
$$ 72923 18467 48763 86621 89953 74330 54718 57596 88965 100301 85766 88053 41654
7995D1654l6706j1579J6719K5233O0573J8517j2642R667o1495k8297M5481N9764
$$ 41654 4948 -6631 10088 35321 95894 114411 101769 111436 49941 21644 67125 126889
7983A26889L3858j526l7204l6140q2685J26J8681l7064l9570Q5396K9948m6743
$$ 126889 160747 159221 122017 85877 3192 3318 21999 -15065 -54635 30761 60709 13966
7971A3966k4219m164M1505J920l962J4350K4539o771M2460l0798p4804k4937K6933
$$ 13966 -10253 -14417 27088 29008 25046 39396 63935 57164 99624 68826 -5978 -30915 -3982
7958c982L863l3566m0686L330J8659j3169K0370P6827Q2497K5824k1341o185k8490
$$ -3982 -119 -33685 -74371 -71041 -52382 -65551 -45181 31646 114143 139967 118626 112441 83951
7945H3951j2568J450P3061K8182m3726o58k7735k5619Q3563k3973p6960l0780
$$ 83951 71383 72833 145894 174076 130350 129692 101957 76338 159901 135928 58968 28188
7933B8188L2976O0997J1532J0150j0989q4945l8902N6286J2402o8848o0850P462
$$ 28188 61164 122161 133693 143843 132854 47909 9007 65293 77695 8847 -52003 -44541
7921d4541j5847L7080M6717P738o5861O619m641l6499N473M8558N9784r759K1762
$$ -44541 -60388 -23308 23409 31147 -34714 -28095 -32736 -69235 -63762 -15204 44580 34821 56583
7908E6583l981L9715j5794l5388K5451K612m6499K715M0289L5007k6749L893N2745
$$ 56583 52602 92317 76523 41135 66586 69198 22699 25414 65703 100710 73961 77854 130599
7895A30599K3942o9489J6079L3846n4623j05494K1898K0448L8692M3007l5307
$$ 130599 154541 85052 101131 134977 80354 -25140 -3242 17206 55898 98905 63598
7884F3598l30M7717J4016k9117K3996n7623j23401k0868P0947K1869j3009J0098
$$ 63598 63268 110985 125001 95884 119880 62257 -61144 -82012 -11065 10804 -2205 7893
7872G893K5085O1866r64r681l6042n5521J5613N8292j9703n4128N334M0895K9394
$$ 7893 32978 94844 93880 84199 48157 -7364 8249 66541 46838 -7290 -1956 38939 68333
7859F8333Q908o0866l3603O9138J9290q85m9990k7200k1741J6671M8526K9304
$$ 68333 77241 16375 -17228 51910 71200 70315 20325 -6875 -28616 -11945 36581 65885
7847F5885k3793M86J8090M4586l1100J0286K4764q725q2856l9599r666l2053l4454
$$ 65885 42092 42578 60668 105254 74154 84440 109204 100479 17623 -21976 -31642 -63695 -98149
7834i8149L5541M0174o676L9233M3607j6170l201j6680M606n6748n3213P7993
$$ -98149 -62608 -22434 -29110 10123 53730 37560 34359 17679 22285 -34463 -87676 -9683
7822i683L1047n519j2292M4783O715n9266k7103L4062R856K2633j1022j4129j2147
$$ -9683 21364 15845 3553 48336 55051 -4215 -31318 2744 12600 35233 24211 10082 -2065
7809b065m893N4863O9676j7825m7813l5233j5728m3576m0674k676K5718L6127
$$ -2065 -6958 47905 117581 99756 51943 16710 982 -42594 -83268 -85944 -60226 -24099
7797b4099L8687L8213K6861J4626k4229P170m8499o1505L2308O4085k9585l8593
$$ -24099 14588 52801 79662 94288 70059 77229 28730 -32775 -467 63618 34033 -4560
7785d560J8277k6343M3519M8415n4730j5051o0298j3156K6850N1504N9090L9055
$$ -4560 13717 -12626 30893 79308 24578 9527 -50771 -63927 -37077 14427 73517 112572
7773A12572m2976k8610j1881O2062K8924J5351M8279j89n2677q3298o2885m7086
$$ 112572 69596 40986 29105 91167 120091 135442 183721 183532 130855 47557 -15328 -62414
7761f2414k0883J7706P450M3063K993M0929l6717m6175m5942j0806M6480M7870
$$ -62414 -83297 -65591 -58141 -15078 -12085 28844 -7873 -54048 -99990 -110796 -64316 -16446
7749a6446K4359K9157L077j1215m152n2431j4330N9972L6354j7300K5375Q2946
$$ -16446 7913 37070 40147 28932 24780 -27651 -41981 17991 54345 37045 62420 145366
7737A45366M2460j8664J6468o2574q6769L2054L6981l1128o5001j5509j2169p344
$$ 145366 187826 169162 185630 123056 36287 68341 105322 74194 9193 -6316 -18485 -25829
7725b5829q263M4273M5572M0412j0357K2537m2809p5081j8332j3473k2357l1997
$$ -25829 -34092 10181 55753 96165 85808 108345 65536 -9545 -27877 -41350 -63707 -95704
7713i5704P4091R06n7084j3738K8819J0560j9507j0569N8200J216N790r146k4390
$$ -95704 -21613 -20707 -77791 -91529 -62710 -52150 -71657 -82226 -24026 -22810 -17020 -26166 -50556
7700e0556n0754N8815J9139r403R702o4389r291M2413L5029J7966l5666m7343
$$ -50556 -101310 -42495 -23356 -32759 -23057 -87446 -96737 -54324 -19295 -1329 -36995 -84338
7688h4338q749L3729L9451M4887N2976j1573m4718n6825j9711k312q23l1562l1957
$$ -84338 -93087 -59358 -19907 24980 77956 66383 21665 -35160 -54871 -57183 -58006 -89568 -121525
7675a21525N2812l6685J4778k1800J2563L0860O0846M6923L5877M340m4276k1046
$$ -121525 -68713 -105398 -90620 -112420 -99857 -68997 -8151 38772 74649 78989 34713 13667
7663A3667m5637K7603L2171p4917n5792N2328L0689o2527p501m282k4770M080
$$ 13667 -31970 -4367 27804 -47113 -102905 -50577 -19888 -82415 -89916 -94198 -118968 -114888
7651a14888O9705N9852P9733m9731l9106k9717J0141n8575J7120M6588l6820J214
$$ -114888 -45183 14669 94402 44671 5565 -24152 -14011 -72586 -55466 -8878 -45698 -44484
7639d4484J3124j0482K4821k249n0604M780K6516N3089L5121j9135Q353K0385
$$ -44484 -31360 -41842 -17021 -19270 -69874 -65094 -38578 14511 49632 30497 38850 59235
7627E9235m1623j8417l416K2863j3225m9595l9727m2127M0110M9621L2326j7858
$$ 59235 17612 -805 -4221 18642 5417 -44178 -83905 -126032 -85922 -36301 -3975 -21833
7615b1833m3190K3351P635m5876n654k264N0679N4196L3910m7367o971K6654L1078
$$ -21833 -65023 -41672 -34037 -79913 -85567 -87831 -37152 17044 50954 3587 -3384 23270 54348
7602E4348N6764m296l9462o6714K2263k7271k8074k1557O0409K0046l0541j70
$$ 54348 111112 106816 67354 640 22903 -4368 -32442 -53999 6410 26456 -4085 -4255
7590d255N3463M874M741m4J4980n6411l1469J5611K8385K8803q9460j0520n267
$$ -4255 49208 54082 58823 58779 73759 17348 -14121 1490 29875 58678 -30782 -41302 -46569
7577d6569j2378K9646K7117j7287l6644J3491O7437l4007J0845J63L370J9391
$$ -46569 -58947 -29301 -2184 -19471 -56115 -42624 24813 -9194 1651 1814 5184 24575
7565B4575P1800n0658q1387k1087M2495J9424p4106k41J8128O59J4613j8053J661
$$ 24575 96375 45717 -35670 -56757 -14262 5162 -68944 -69185 -51057 -50398 -35785 -53838 -52177
7552e2177M1838N9543k6938L0067n1853j5701m2908K1329M0694n8734j81M9465
$$ -52177 -10339 49204 22266 52333 480 -15221 -58129 -36800 3894 -54840 -55021 -5556
7540e556K5917o1443J1604P9193L4336r5914k7675j04l0065l5467K201P7662P705
$$ -5556 20361 -41082 -29478 49715 84051 -11863 -39538 -39642 -69707 -105174 -102973 -25311 -17606
7527a7606j3550O4762L1536o918p8245Q090L0013oN5074k1133m4803q2965J5903
$$ -17606 -31156 33606 65142 58224 -20021 -11931 18082 18076 73150 52017 7214 -75751 -59848
7514e9848K5714K0462R506m0611m8908N3286N4884J9279l0882n7854l5725N788
$$ -59848 -34134 -13672 -4166 -44777 -93685 -40399 14485 33764 2882 -54972 -90697 -84909
7502h4909K2129L7530O337O4830o4706o3666L3374L7027O933K5929k3263l1690
$$ -84909 -62780 -25250 -18913 45917 -18789 -82455 -49081 -12054 -5121 20808 -2455 -34145
7490c4145p425n2542q972J8476K0279N7368O2525q277l0452l6109J4831L4354
$$ -34145 -41570 -94112 -103084 -84608 -64329 -6961 55564 47287 16835 -19274 -4443 29911
7478B9911k5178o3625m6360j7889k3935j1205M2804J05474O4078N5909J4394o2588
$$ 29911 4733 -58892 -105252 -123141 -147076 -158281 -115477 -10003 54075 109984 124378 61790
7466F1790n2667k9666K4279l9366O4152j1858l9158J2171J9593Q293o757K6142
$$ 61790 9123 -20543 3736 -35630 28522 16664 -22494 -10323 9270 17563 10806 36948
7454C6948P790j9543N8437k4312r447k0592J5073l6394j9777N57l6161l4381Q0614
$$ 36948 44738 25195 83632 59320 49873 29281 44354 7960 -11817 -11260 -47421 -81802 -1188
7441a188J4036j3214m6161K0924j2557J944R4441n3715j1018N3097M974j4177
$$ -1188 12848 -366 -46527 -25603 -38160 -36216 58225 4510 -6508 46589 51563 37386
7429C7386j1324m7185p0006j4154M8560K306j8554J7454J5457Q1985q391k6787
$$ 37386 26062 -21123 -91129 -105283 -56723 -54417 -72971 -55517 -40060 41925 33534 6747
7417F747J2654j1122K5563K752j9953m2434K5477L1380K8009m927o3815R28K3712
$$ 6747 19401 8279 33842 36594 16641 -25793 -316 31064 59073 54146 -9669 -8741 14971
7404A4971j0822j6866o9328L9655M4700R95O725J1726j8165k5120k2640J3812
$$ 14971 4149 -12717 -82045 -42390 2310 3305 10030 21756 3591 -21529 -44169 -30357
7392c0357j99M2859n7069K2734K107J4249L5935J4373J3169N1969l0418q2947
$$ -30357 -30556 12303 -44766 -22032 -19925 -5676 30259 44632 57801 109770 79352 -3595
7380c595o4946j1225N7313L6441q347n8764j7384n470P9912j5856J3771m6131
$$ -3595 -68541 -79766 -22453 13988 5641 -53123 -70507 -75977 3935 -11921 1850 -44281
7368d4281m5645j8211K4045J3556M4536r191K2323R781m5295J8614M7286j9696
$$ -44281 -89926 -108137 -84092 -70536 -26000 -35191 -12868 -3087 -48382 -29768 17518 -2178
7356b178o2276m1295N9933L7331N9230L1127K0439l3951o6317k078j2530J4064
$$ -2178 -64454 -105749 -45816 -8485 50745 81872 102311 68360 2043 -35 -12565 1499
7344A499O641R0369K6074q3437n2809m4111K5391Q9778l31o0275j2358j5043p334
$$ 1499 8140 98509 124583 41146 -11663 -55774 -30383 59395 59064 -1211 -13569 -28612 -35946
7331c5946m7650j5283L0181O7400M136l6140K221K4036J8330K1955n734O36m0916
$$ -35946 -83596 -98879 -68698 -1298 2838 -33302 -31081 -7045 11285 33240 27506 28142 -12774
7318a2774k6571O1671K4264r1059n4395N8770J4672Q36Q299k7319k7746m283L0883
$$ -12774 -39345 22326 46590 -44469 -98864 -40094 -25422 -24586 -16287 -43606 -71352 -75635 -44752
7305d4752M1507M6767k7892o8864J0601Q957j9879M0756l2225l094P9890Q352
$$ -44752 -3245 43522 15630 -53234 -42633 -33676 -53555 -12799 -45024 -48118 31772 40124
7293D0124J4089l9738j8230j785l330j1578M619J7041R092k6065n7124Q1866m889
$$ 40124 54213 14475 -3755 -5540 -8870 -20448 -15829 1212 10304 -15761 -72885 8981 4092
7280D092K6929L0351m5858l677K8077R592k2977q3154l4488N1893L5847K0284
$$ 4092 31021 61372 15514 11837 39914 49506 26529 -56625 -91113 -39220 -3373 16911
7268A6911k852J6976M384K6091K6213L6109L7845j5123l2077k0060k31r014n1649
$$ 16911 14059 31035 35419 61510 87723 123832 161677 146554 114477 94417 94186 85172 33523
7255C3523j5591j0049k8482J3184j2945l3165L6641o763J4762K6051Q0828k691
$$ 33523 17932 7883 -20599 -7415 -20360 -53525 -16884 -23647 -8885 17166 97994 95303
7243I5303j3327l9700q548J462Q987l1153M702j2208k1952l276J3744o3121j9769
$$ 95303 81976 42276 33728 35190 44177 13024 17726 5518 -16434 -19710 -5966 -69087 -88856
7230h8856M6396O5316O374R259k5833J360l958R251M6996Q460J2630p825j4286
$$ -88856 -42460 22856 29230 38489 12656 14016 10058 19309 66305 74765 87395 79570 65284
7217F5284o8671l7959j1762L8937R0311J9478o2500J0980J3052j0146k2151P691
$$ 65284 -3387 -41346 -53108 -14171 76140 95618 33118 44098 57150 47004 24853 32544
7205C2544q386J1060k2161p8090j7656l0576J7329M7833l6056l800j8335K9713
$$ 32544 24158 35218 13057 -65033 -82689 -113265 -95936 -48103 -84159 -87959 -106294 -76581
7193g6581J5946r211o1466M2745L5527J2084P887k3900J1341j1841l3973r840
$$ -76581 -60635 -69846 -131312 -88567 -53040 -40956 -33069 -56969 -45628 -57469 -91442 -101282
$$ [...]
##END NTUPLES=NMR SPECTRUM
##END=
