##TITLE=Analysis number 328763
Compound Code cc 66751
Book Reference 528/42
Project Code adrs
Chemist Name davee
##JCAMPDX= 6.0         $$ Bruker NMR JCAMP-DX V2.0
##DATA TYPE= NMR SPECTRUM
##DATA CLASS= NTUPLES
##ORIGIN= Bruker BioSpin GmbH
##OWNER= nmr
$$ XWIN-NMR		Version 3.5
$$ Mon Jul  2 13:02:32 2007 GMT Daylight Time (UT+1h)  MAYBRIDGE\nmr@NMR_250MHZ
##.OBSERVE FREQUENCY= 250.131544655141
##.OBSERVE NUCLEUS= ^1H
##.ACQUISITION MODE= SIMULTANEOUS (DQD)
##.ACQUISITION SCHEME= undefined
##.AVERAGES= 16
##.DIGITISER RES= 18
##SPECTROMETER/DATA SYSTEM= dpx250
##.PULSE SEQUENCE= zg30
##.SOLVENT NAME= DMSO
##.SHIFT REFERENCE= (INTERNAL, DMSO, 0, 16.522)
##AUDIT TRAIL= $$ (NUMBER, WHEN, WHO, WHERE, WHAT)
$$ ##TITLE= Audit trail, XWIN-NMR		Version 3.5
$$ ##JCAMPDX= 5.01
$$ ##ORIGIN= Bruker BioSpin GmbH
$$ ##OWNER= nmr
$$ C:\u/data/dgb/nmr/ADRS/150/pdata/1/auditp.txt
$$ ##AUDIT TRAIL=  $$ (NUMBER, WHEN, WHO, WHERE, WHAT)
(   1,<2007-07-02 13:02:07.15 +100>,<MAYBRIDGE\nmr>,<NMR_250MHZ>,
      <created by zg, POWCHK disabled, PULCHK disabled
       configuration hash MD5:
       76 6E 9A 78 1E 09 19 81 EC 84 63 8F B0 6A 59 2D
       data hash MD5: 64K
       29 19 27 15 7A FF 1D 8F D1 3B 93 C9 D4 EF 94 01>)
(   2,<2007-07-02 13:02:21.73 +100>,<MAYBRIDGE\nmr>,<NMR_250MHZ>,
      <Start of raw data processing
       ef LB = 0.3 FT_mod = 6 PKNL = 1 SI = 32K 
       data hash MD5: 32K
       5F 33 71 3C 15 F8 4A 67 89 B4 C4 19 F4 39 1B 0D>)
(   3,<2007-07-02 13:02:23.54 +100>,<MAYBRIDGE\nmr>,<NMR_250MHZ>,
      <apk 
       data hash MD5: 32K
       8A 44 6B F0 FD 09 9F 60 07 FB 83 0E 4B 07 7A 6C>)
(   4,<2007-07-02 13:02:24.27 +100>,<MAYBRIDGE\nmr>,<NMR_250MHZ>,
      <abs ABSG = 5 
       data hash MD5: 32K
       CF 12 42 15 B7 E5 73 98 80 2F AA FE 99 52 A0 22>)
$$ ##END=
$$ 
$$ hash MD5
$$ 60 AD 32 5B 3B CC 87 5E 07 3F 1E F8 06 50 99 FD
##$RELAX= 
##$RELAX= 
##$RELAX= 
##$RELAX= 
##$RELAX= 
##$RELAX= 
##$RELAX= 
$$ Bruker specific parameters
$$ --------------------------
##$DU= <C:\u>
##$EXPNO= 150
##$NAME= <ADRS>
##$PROCNO= 1
##$TYPE= <nmr>
##$USER= <dgb>
##$AMP= (0..31)
100 100 100 100 100 100 100 100 100 100 100 100 100 100 100 100 100 100 
100 100 100 100 100 100 100 100 100 100 100 100 100 100 
##$AQSEQ= 0
##$AQ_mod= 3
##$AUNM= <au_zg>
##$AUTOPOS= <25 >
##$BF1= 250.13
##$BF2= 250.13
##$BF3= 250.13
##$BF4= 250.13
##$BF5= 500.13
##$BF6= 500.13
##$BF7= 500.13
##$BF8= 500.13
##$BYTORDA= 1
##$CFDGTYP= 0
##$CFRGTYP= 5
##$CHEMSTR= <none>
##$CNST= (0..31)
1 1 145 1 1 1 1 1 1 1 1 1 1 1 1 1 1 1 1 1 1 1 1 1 1 1 1 1 1 1 1 1 
##$CPDPRG= <>
##$CPDPRG1= <>
##$CPDPRG2= <>
##$CPDPRG3= <>
##$CPDPRG4= <mlev>
##$CPDPRG5= <mlev>
##$CPDPRG6= <mlev>
##$CPDPRG7= <mlev>
##$CPDPRG8= <mlev>
##$CPDPRGB= <>
##$CPDPRGT= <>
##$D= (0..31)
0 1 0 0 0 0 0 0 0 0.06 0 0 0 0 0 0 0.0002 0 0 0 0 0 0 0 0 0 0 0 0 0 0 
0 
##$DATE= 1183377725
##$DBL= (0..7)
120 120 120 120 120 120 120 120 
##$DBP= (0..7)
150 150 150 150 150 150 150 150 
##$DBP07= 0
##$DBPNAM0= <>
##$DBPNAM1= <>
$$ [...]
##$SUBNAM7= <"">
##$SUBNAM8= <"">
##$SUBNAM9= <"">
##$SW= 20.6930455092707
##$SWIBOX= (0..15)
0 0 3 0 0 0 0 0 0 0 0 0 0 0 0 0 
##$SW_h= 5175.983436853
##$TD= 65536
##$TD0= 1
##$TE= 296.16
##$TE2= 300
##$TE3= 300
##$TEG= 300
##$TL= (0..7)
0 120 120 120 120 120 120 120 
##$TP= (0..7)
150 150 150 150 150 150 150 150 
##$TP07= 0
##$TPNAME0= <>
##$TPNAME1= <>
##$TPNAME2= <>
##$TPNAME3= <>
##$TPNAME4= <>
##$TPNAME5= <>
##$TPNAME6= <>
##$TPNAME7= <>
##$TPOAL= (0..7)
0.5 0.5 0.5 0.5 0.5 0.5 0.5 0.5 
##$TPOFFS= (0..7)
0 0 0 0 0 0 0 0 
##$TUNHIN= 0
##$TUNHOUT= 0
##$TUNXOUT= 0
##$USERA1= <user>
##$USERA2= <user>
##$USERA3= <user>
##$USERA4= <user>
##$USERA5= <user>
##$V9= 5
##$VALIST= <valist>
##$VCLIST= <CCCCCCCCCCCCCCC>
##$VD= 0
##$VDLIST= <DDDDDDDDDDDDDDD>
##$VPLIST= <PPPPPPPPPPPPPPP>
##$VTLIST= <TTTTTTTTTTTTTTT>
##$WBST= 1024
##$WBSW= 4
##$XGAIN= (0..3)
0 0 0 0 
##$XL= 0
##$YL= 0
##$YMAX_a= 254166
##$YMIN_a= -342452
##$ZGOPTNS= <>
##$ZL1= 120
##$ZL2= 120
##$ZL3= 120
##$ZL4= 120
##$ABSF1= 16.522
##$ABSF2= -4.171173
##$ABSG= 5
##$ABSL= 3
##$ALPHA= 0
##$AQORDER= 0
##$ASSFAC= 0
##$ASSFACI= 0
##$ASSFACX= 0
##$ASSWID= 0
##$AUNMP= <proc_1d>
##$AZFE= 0.1
##$AZFW= 0.1
##$BCFW= 0
##$BC_mod= 0
##$BYTORDP= 0
##$COROFFS= 0
##$CY= 12.5
##$DATMOD= 1
##$DC= 0
##$DFILT= <>
##$DTYPP= 0
##$F1P= 14.0000005364418
##$F2P= -0.99999901652339
##$FCOR= 0.5
##$FTSIZE= 32768
##$FT_mod= 6
##$GAMMA= 0
##$GB= 0
##$INTBC= 1
##$INTSCL= 1
##$ISEN= 128
##$LB= 0.3
##$LEV0= 0
##$LPBIN= 0
##$MAXI= 10000
##$MC2= 0
##$MEAN= 0
##$ME_mod= 0
##$MI= 0
##$NCOEF= 0
##$NC_proc= -6
##$NLEV= 6
##$NOISF1= 0
##$NOISF2= 0
##$NSP= 0
##$NTH_PI= 0
##$NZP= 0
##$OFFSET= 16.522
##$PC= 1
##$PHC0= -64.16254
##$PHC1= 6.625384
##$PH_mod= 1
##$PKNL= yes
##$PPARMOD= 0
##$PSCAL= 4
##$PSIGN= 0
##$REVERSE= no
##$SF= 250.13
##$SI= 32768
##$SIGF1= 0
##$SIGF2= 0
##$SINO= 400
##$SIOLD= 32768
##$SREGLST= <1H.DMSO>
##$SSB= 0
##$STSI= 32768
##$STSR= 0
##$SW_p= 5175.98343685301
##$SYMM= 0
##$S_DEV= 0
##$TDeff= 65536
##$TDoff= 0
##$TI= <Analysis number 999999
Compound Code 99
Book Reference 9
Project Code 9>
##$TILT= no
##$TM1= 0
##$TM2= 0
##$TOPLEV= 0
##$USERP1= <user>
##$USERP2= <user>
##$USERP3= <user>
##$USERP4= <user>
##$USERP5= <user>
##$WDW= 1
##$XDIM= 32768
##$YMAX_p= 396711435
##$YMIN_p= -774287
$$ End of Bruker specific parameters
$$ ---------------------------------
##NTUPLES= NMR SPECTRUM
##VAR_NAME=  FREQUENCY,     SPECTRUM/REAL,   SPECTRUM/IMAG
##SYMBOL=    X,             R,               I
##VAR_TYPE=  INDEPENDENT,   DEPENDENT,       DEPENDENT
##VAR_FORM=  AFFN,          ASDF,            ASDF
##VAR_DIM=   32768,         32768,           32768
##UNITS=     HZ,            ARBITRARY UNITS, ARBITRARY UNITS
##FACTOR=    0.157963299565203, 1,           1
##FIRST=     4132.6476996994, 0,             0
##LAST=      -1043.33573715361, 0,           0
##MIN=       -1043.33573715361, -774287,     0
##MAX=       4132.6476996994, 396711435,     0
$$ Real data points
##PAGE= N=1
##DATA TABLE= (X++(R..R)), XYDATA
$$ [...]
16940c6723K44850J7482j88211k32444L9139L3237m4981o531m353P9726q663K1
$$ -36723 208127 225609 37398 -195046 -155907 -122670 -167651 -174182 -178535 -98809 -107472 -107451
16928a07451P1501O7534l03628j77289L00281J14600r1501J00245j87471M9008
$$ -107451 -35950 31584 -272044 -449333 -149052 -34452 -125953 -25708 -213179 -164171
16918a64171K67102k69627m0248P6969m6257J19539K00045L81075k55598k33863
$$ -164171 102931 -166696 -206944 -129975 -176232 -56693 143352 524427 268829 34966
16908C4966j5511p2868j44077N9477O3009K76865J54465k0494k17694n1558j62301
$$ 34966 19455 -53413 -197490 -138013 -75004 201861 356326 335832 118138 66580 -95721
16897i5721n2821n3282o3936J54818L5972L5728k53049l3153n5864R2644J35098
$$ -95721 -148542 -201824 -265760 -110942 -74970 -39242 -292291 -325444 -381308 -288664 -153566
16886a53566K05714K37295j1100o2089p3015j16983J2578P1622O9240N8448j87904
$$ -153566 52148 289443 278343 216254 143239 26256 38834 110456 179696 238144 50240
16875E0240k46179j60988K1070N386J52850R5850J8006J35959k69111J21845P4341
$$ 50240 -195939 -356927 -335857 -330471 -177621 -81771 -63765 72194 -196917 -75072 -731
16864g31O8935n4156N381Q3011N024o1280j05466j3209j9228J79528R6888p7374
$$ -731 68204 14048 19429 102440 107464 46184 -59282 -72491 -91719 87809 184697 107323
16852A07323M8856q4682j13284r6416r817J12936j28453M5568j45955P0326J68023
$$ 107323 156179 71497 -41787 -138203 -148020 -35084 -163537 -117969 -263924 -193598 -25575
16841b5575K9210M2429k1091j6833R6761l14282k22211K65039J24639j67193l08697
$$ -25575 3635 46064 24973 8140 104901 -209381 -431592 -166553 -41914 -209107 -517804
16830e17804m7889Q5758J33018J15387j23550j84552J81706J07191p127j2439
$$ -517804 -565693 -479935 -346917 -231530 -355080 -539632 -357926 -250735 -257862 -270301
16820b70301n29r6506Q1334K19195k3192j37096j28817j9495O9781K16921J65945
$$ -270301 -270830 -367336 -286002 -66807 -89999 -227095 -355912 -375407 -305626 -88705 77240
16809G7240k9224m9328O4751J44457n123k25440j12836j13338J66643L3310Q6960
$$ 77240 48016 -1312 63439 207896 202773 -22667 -135503 -248841 -82198 -48888 38072
16798C8072J53519k81668M8030k8656m7654Q2881j02449k4767m0704R3357M0396
$$ 38072 191591 -90077 -42047 -70703 -118357 -35476 -137925 -162692 -203396 -110039 -69643
16787f9643k9239K7969R4500L35329Q210J93504j29608l97877j05155L46503O905
$$ -69643 -98882 -70913 23587 358916 367126 560630 431022 33145 -72010 274493 281398
16776B81398k02200j01954J57965o0125Q2516k04454j27325K6707j41315O1701
$$ 281398 79198 -22756 135209 75084 157600 -46854 -174179 -147472 -288787 -227086
16766b27086j36272n6869R9437J71997N4716J43397p4325n6267R347p185j82177
$$ -227086 -363358 -420227 -320790 -148793 -94077 49320 -25005 -81272 -71925 -79110 -261287
16755b61287j21670j06514N5727l6914K34216J51878k9106j78133J73278K12821
$$ -261287 -382957 -489471 -433744 -470658 -236442 -84564 -113670 -291803 -118525 94296
16745I4296j50006j47365k06981r9793P8523P2884j38334J55472K97645J32938
$$ 94296 -55710 -203075 -410056 -509849 -431326 -358442 -496776 -341304 -43659 89279
16735H9279J75101p338l07700o8862o348L8077J03670k84744n9536N4032j72625
$$ 89279 264380 257042 -50658 -119520 -125868 -87791 15879 -268865 -328401 -274369 -446994
16724d46994J8133N7905K9963j28347K44753j6082O4633K55511k0533L6781R8264
$$ -446994 -428861 -370956 -340993 -469340 -224587 -240669 -176036 79475 58942 95723 193987
16713A93987o8364k76029o5680J5308R5602m4025L3623J36110j26536r3096l8993
$$ 193987 125623 -150406 -216086 -200778 -105176 -149201 -115578 20532 -106004 -199100 -238093
16702b38093J13576K52186j99283q5180J61049P1415N9713K2078L1439j18573
$$ -238093 -124517 127669 -71614 -156794 4255 75670 135383 157461 188900 70327
16692G0327q1629J27145j94660j94705K3037Q5969J7744l8058k40530l9145Q4684
$$ 70327 -11302 115843 -78817 -273522 -250485 -164516 -146772 -184830 -425360 -464505 -379821
16681c79821m7828Q9086M7617n6941R0567P7201j67249K2644R6497O4151J38700
$$ -379821 -427649 -338563 -290946 -347887 -257320 -180119 -347368 -324724 -228227 -164076 -25376
16670b5376K23309o8746K9982k38888l00577L1175R8851L35251P3018j65724J09022
$$ -25376 197933 129187 159169 -79719 -380296 -349121 -250270 84981 157999 -7725 101297
16659A01297K26371l2845k45595k6245N5532k28967m5613j0067N0317o786k4833
$$ 101297 327668 294823 49228 22983 78515 -150452 -196065 -206132 -155815 -162601 -187434
16648a87434L0280J02177J12266o6661j74571j93564J27479J29299L3383n8238
$$ -187434 -157154 -54977 57289 -9372 -183943 -377507 -250028 -120729 -87346 -145584
16638a45584N7702j21908n9761R6220P3403J77609j62831j10651J74134K56005
$$ -145584 -87882 -209790 -269551 -173331 -99928 77681 -85150 -195801 -21667 234338
16628B34338j35559p8451j46229j21833K04175P3477j32788j10983j3068K024
$$ 234338 98779 20328 -125901 -247734 -43559 29918 -102870 -213853 -226921 -224897
16618b24897J45629J24040Q8805q533r573j05812k26257k03149J79793R6324j31472
$$ -224897 -79268 44772 133577 125044 115471 9659 -216598 -419747 -239954 -143630 -275102
16607b75102J27895K40830J1987k25596j41859J14994l198N1520P8231J49555
$$ -275102 -147207 93623 105610 -119986 -261845 -146851 -150049 -98529 -20298 129257
16597A29257j55771m877q7551O6487J31341n3652J08814k2781k3648q0148k27058
$$ 129257 -26514 -31391 -118942 -52455 78886 25234 134048 111267 87619 7471 -219587
16586b19587j21187K62191J69097J08048K8697k2928j05864j81700k23495j76033
$$ -219587 -340774 -78583 90514 198562 227259 204331 98467 -83233 -306728 -482761
16576d82761K32051J593n399M3140J888L9485J93770M705m1099j46300P4479Q805
$$ -482761 -250710 -249117 -254516 -211376 -209488 -170003 23767 28472 -12627 -158927 -84448 -75643
16564g5643q0848l7905M4778J20003K6112j02440j12731J40813j38979L370J6943
$$ -75643 -156491 -194396 -149618 -29615 -3503 -105943 -218674 -77861 -216840 -213470 -196527
16553a96527j49907o508L26948J19356p2443J592J03045J26454o9946J4232R4913
$$ -196527 -346434 -352942 -25994 93362 20919 22511 125556 252010 182064 196296 291209
16542B91209j86268j98700k6166L6356j76319j37682O5016L10745O9218r9306
$$ 291209 104941 -93759 -119925 -83569 -259888 -397570 -332554 -21809 47409 -51897
16532e1897l209m9340j37495p09R9669J94130J54822k78860r2942r4980K21886
$$ -51897 -55106 -104446 -241941 -242650 -142981 51149 205971 -72889 -165831 -260811 -38925
16521c8925J86544o5605j40815l3018p0989p6987j4914j62208J41731Q5269j01473
$$ -38925 147619 82014 -58801 -91819 -162808 -239795 -254709 -416917 -275186 -189917 -291390
16510b91390P3092J42661K9661l32875J11522L59296J4593n7214J65010j38681
$$ -291390 -218298 -75637 -45976 -378851 -267329 91967 106560 49346 214356 75675
16500G5675k96352K3858j14368k1728J54064R4848K04927J24868M5044k5158j87947
$$ 75675 -220677 -196819 -311187 -332915 -178851 -84003 120924 245792 290836 265678 77731
16489G7731l4430k10930j0303K29497Q7836j74093J79689J54264j41660o7963
$$ 77731 43301 -167629 -177932 51565 139401 -34692 144997 299261 157601 89638
16479H9638j3485J4488J55497M2186k83862j13103J38668R546M1134j46396l8782
$$ 89638 76153 90641 246138 288324 4462 -108641 30027 39573 80707 -65689 -104471
16468a04471K9185j36416j59261j21875K11129L1386j6801q618O5564J04163j40316
$$ -104471 -75286 -211702 -370963 -492838 -281709 -250323 -267124 -275742 -210178 -106015 -246331
16457b46331J09341M0864K8676J15577j1316l1677L5158J11812k5428n7166k18863
$$ -246331 -136990 -96126 -67450 48127 36811 5134 40292 152104 126676 69510 -149353
16446a49353L1501k37984q4677J17446M4669O423j26124P0975K57455O01j98607
$$ -149353 -117852 -355836 -440513 -323067 -278398 -271975 -398099 -327124 -69669 -69068 -267675
16435b67675n0158K67183j7231j01415j30623J65405O350M8480r4293J9979J31155
$$ -267675 -317833 -50650 -67881 -169296 -299919 -134514 -128164 -79684 -173977 -153998 -22843
16424b2843k9026O6170K04659J48154j20355j79532j24173j88766q7900j12665
$$ -22843 -51869 14301 218960 367114 246759 67227 -56946 -245712 -333612 -446277
16414d46277Q2242O8695o6381K7819R3724N7934r5722Q7388k1370j69000R9245
$$ -446277 -364035 -295340 -361721 -333902 -240178 -182244 -277966 -190578 -211948 -380948 -281703
16403b81703L1518J11130L2159j16142J5236Q6992r219Q1937n5578L8176J38995
$$ -281703 -250185 -139055 -106896 -223038 -207802 -120810 -130029 -48092 -103670 -65494 73501
16392G3501J6006o7674j40778j46114j89459j40370K9429J07468j40256M5734
$$ 73501 89507 21833 -118945 -265059 -454518 -594888 -565459 -457991 -598247 -552513
16382e52513J06396M0569J00839P7928R8817o6644q9636J12323J21901n3383j2620
$$ -552513 -446117 -405548 -304709 -226781 -127964 -194608 -284244 -171921 -50020 -103403 -116023
16371a16023J19138K82518q9213k23044K8010k2019j20710q2314r603j5833o4272
$$ -116023 3115 285633 196420 -26624 1386 -20633 -141343 -223657 -233260 -249093 -313365
16360c13365N4962Q1573J17505l3176j47175R2638K16412K1478l961j53282j80105
$$ -313365 -258403 -176830 -59325 -92501 -239676 -147038 69374 90852 86891 -66391 -246496
16349b46496n3364O7368j0229n7595k6441J91853k4407K5662K8340k7738K7244
$$ -246496 -299860 -232492 -242721 -300316 -326757 -134904 -159311 -133649 -105309 -133047 -105803
16338a05803k0175j29148m0959J72647K8970M3669j28585j2978K99220q4826o4581
$$ -105803 -125978 -255126 -296085 -123438 -94468 -50799 -179384 -192362 106858 22032 -42549
16327d2549P052k2967J9027k9069l8938J18056J10578j42354j82651l0212J49354
$$ -42549 -35497 -58464 -39437 -68506 -107444 10612 121190 -21164 -203815 -234027 -84673
16316h4673N5326p6659j44322J64938J59478L5768Q7923K0239M0442L3072j0404
$$ -84673 -29347 -106006 -250328 -85390 74088 109856 197779 218018 258460 291532 281128
16305B81128m5737j15012j35717m65882j96822N8239J04754K12237j72582k22226
$$ 281128 235391 120379 -15338 -481220 -678042 -619803 -515049 -302812 -475394 -697620
16295f97620J22630K03128J50179J59156j48363O9613l4604n1632M4116j6923
$$ -697620 -574990 -371862 -221683 -62527 -210890 -141277 -175881 -227513 -183397 -200320
16285b00320J45565J04714K52754m0721k17063q8198k8240j56586j53252J32462
$$ -200320 -54755 49959 302713 261992 44929 -43269 -71509 -228095 -381347 -248885
16275b48885Q2164n4806K16555K8715j51851j8629p4934p9501J113k9102J36352
$$ -248885 -166721 -221527 -4972 23743 -128108 -146737 -221671 -301172 -300059 -329161 -192809
16264a92809J30149K53286K22050k1217k03198J66594J26689j27979q7302o3187
$$ -192809 -62660 190626 412676 391459 188261 354855 481544 353565 266263 203076
16254B03076n7969j27536j12786O7430K16288k1792r0740m360L2412K04365p410
$$ 203076 145107 17571 -95215 -27785 188503 166711 75971 71611 104023 308388 300978
16243C00978j74885j89408n093J02225j24657j66849Q4097j7141l06K22828j39925
$$ 300978 126093 -63315 -68408 33817 -90840 -257689 -173592 -190733 -191039 31789 -108136
16232a08136p6874J3570J94077j4673l2497o5894k58128J12906J83997k13514
$$ -108136 -185010 -171440 22637 7964 -24533 -90427 -348555 -235649 -51652 -265166
16222b65166r0199R2638O7315L1457O7234Q9800o1489r8639j14069O5265j19815
$$ -265166 -355365 -262727 -195412 -163955 -96721 -6921 -68410 -167049 -281118 -215853 -335668
16211c35668O6567j4480j24883m2789L37437J82166p0956J41995Q8220j26841
$$ -335668 -269101 -283581 -408464 -451253 -113816 68350 -2606 139389 227609 100768
16201A00768j00848j38556p0423K23983J11917P086L5670p0767n6540p5889j54862
$$ 100768 -80 -138636 -209059 14924 126841 133927 169597 98830 42290 -33599 -188461
16190a88461R1641o7737Q9582J11882p9001j10087J92589o6972r4938r856j44605
$$ -188461 -96820 -164557 -74975 36907 -42094 -152181 40408 -26564 -121502 -131358 -275963
16179b75963M6675J13180K07241j19009j74846K8918q5855L1236l2631P0957M1551
$$ -275963 -229288 -116108 91133 -27876 -202722 -173804 -259659 -228423 -261054 -190097 -148546
16168a48546K0890l330R9548O0204j41549j21991j1133j206J13135J01108J41773
$$ -148546 -127656 -130986 -31438 28766 -112783 -234774 -245907 -247113 -133978 -32870 108903
16157A08903L15980o9139l20715l49706r9161J5350O6721K10075k64756q6320
$$ 108903 424883 355744 35029 -314677 -413838 -398488 -331767 -121692 -386448 -472768
16147d72768R3617n4033J73479J68627o9187j1506m894N8799k24577r9729J36967
$$ -472768 -379151 -433184 -259705 -91078 -160265 -171771 -176665 -117866 -342443 -442172 -305205
16136c05205J26252J28291j56168o0316J37404j12357K487L6460K32162N013k70593
$$ -305205 -178953 -50662 -206830 -267146 -129742 -242099 -239612 -203152 29010 34023 -236570
16125b36570L9275O3592r8364p9692o5139P5696K3108m1728J80914O890k0190
$$ -236570 -197295 -133703 -232067 -311759 -376898 -301202 -278094 -319822 -138908 -132018 -152208
16114a52208m5630P9757K1510j809O6810k4921q8456j03104J78131J70749j8565
$$ -152208 -197838 -118081 -96571 -98380 -31570 -56491 -144947 -248051 -69920 100829 82264
16103H2264m737j36369O4827K1264q7283j7163L5380n7931n6748M887k7422l4320
$$ 82264 77527 -58842 5985 27249 -60034 -77197 -41817 -99748 -156496 -151609 -179031 -213351
16091b13351n3030p7524O5740K07237J89988n9493q7611l2738n2778j33880R0153
$$ -213351 -266381 -343905 -278165 -70928 119060 59567 -28044 -60782 -113560 -247440 -157287
16080a57287J48470L5770R0556J01923J89251o6218j10701k45750j64655o205
$$ -157287 -8817 26953 117509 219432 408683 342465 231764 -13986 -178641 -184846
16070a84846p9724q6807k03076J01911L18964K4697j59868P2862K17436P3596
$$ -184846 -264570 -351377 -554453 -452542 -133578 -108881 -268749 -195887 21549 95145
16060I5145k4422R9444j97136M1762N9510n6186J47371k24840N7659j82243J6792
$$ 95145 70723 170167 -26969 14793 74303 18117 165488 -59352 -1693 -183936 -167144
16049a67144P8946p2414R0829K5222P271r8636j3075k04461J63980K68666J62539
$$ -167144 -88198 -160612 -69783 -44561 -37290 -135926 -149001 -353462 -189482 79184 241723
16038B41723k3848p0768J59578j81480j14774Q5650k73200j30430J27780J52541
$$ 241723 217875 147107 306685 125205 10431 96081 -177119 -307549 -179769 -27228
16028b7228R3339N1851j20254l7893O057j08260q0992k6384j41546L23232J94394
$$ -27228 66111 117962 -2292 -40185 -34128 -142388 -223380 -249764 -391310 -68078 126316
16017A26316j53145j48472P5546l1509J42750L1715p5755k50630L7467R0640Q3850
$$ 126316 -26829 -175301 -99755 -131264 11486 43201 -32554 -283184 -245717 -155077 -71227
16006g1227K53900L3358j26631j86020n6986J95319n613q4701K5036J53348q7570
$$ -71227 182673 216031 89400 -96620 -153606 41713 36100 -48601 -23565 129783 42213
15995D2213r2832J3222K90853k8081j58326J19431j0878R7816k32657j50648j19936
$$ 42213 -50619 -37397 253456 225375 67049 186480 175602 273418 40761 -109887 -229823
15984b29823K21220R885l02072q5159J31536M7864r9890M7777J23225J36122l386
$$ -229823 -8603 1282 -300790 -385949 -254413 -206549 -306439 -258662 -135437 685 -2701
15973b701j7953J65501M8073m8119l56568l28995K37784K54341j8154j4550j8419
$$ -2701 -20654 144847 192920 144801 -211767 -540762 -302978 -48637 -66791 -81341 -99760
15962i9760l5431K17563J31922L8705O135K7546m1230k33663J07847K4506j36393
$$ -99760 -135191 82372 214294 252999 259134 286680 245450 11787 119634 144140 7747
15951G747J04918o9176k17555Q2175K19601R3246j05104J04524p3271q7615L8152
$$ 7747 112665 43489 -174066 -91891 127710 220956 115852 220376 147105 59490 97642
15940I7642R4016n1756m2064j76171k59588l0729J43704N1286J41435q9609m6482
$$ 97642 191658 139902 97838 -78333 -337921 -368650 -224946 -173660 -32225 -121834 -168316
15929a68316J06318j46990k59919o5739J91689J39955K6452R2914j2117k4437
$$ -168316 -61998 -208988 -468907 -534646 -342957 -203002 -176550 -83636 -95753 -120190
15919a20190J49142q0628J24449j1901m4578j55082P0513L7383N2965k1490j66355
$$ -120190 28952 -51676 72773 60872 16294 -138788 -68275 -30892 22073 583 -165772
15908a65772L5155J89735j10411j04854J26794O2781Q6648R7447n7831J07607
$$ -165772 -130617 59118 -51293 -156147 -29353 33428 120076 217523 159692 267299
15898B67299J75609n5216o9619j12409r9764J15721O4710j60429k15651j85596
$$ 267299 442908 387692 318073 205664 105900 221621 286331 125902 -89749 -275345
15888b75345q5215K12419P8018J22893J90196N1347R4164j27795k11830M3546
$$ -275345 -360560 -148141 -70123 52770 242966 294313 388477 260682 48852 92398
15878I2398J33453j41769k80748J70639r503m7588j55724J06669m3012K52545
$$ 92398 225851 84082 -196666 -26027 -35530 -83118 -238842 -132173 -175185 77360
15868G7360K44847L31j06168j25797q0666J42663p8963L9279r791j81252j41128
$$ 77360 322207 322538 216370 90573 9907 152570 73607 112886 103095 -78157 -219285
15857b19285o7438K38297J64701l13753j77030j6142R8569J89911K069Q0489N6881
$$ -219285 -286723 -48426 116275 -197478 -374508 -390650 -292081 -102170 -100101 -19612 37269
15846C7269J90643o6111K2356m7906L7766j47687j69084J36721R6121J61666Q0606
$$ 37269 227912 161801 184157 136251 174017 26330 -142754 -6033 90088 251754 332360
15835C32360j46543j11290j42168j9088K9285L2246K82519j04138q3443N4703
$$ 332360 185817 74527 -67641 -86729 -57444 -25198 257321 153183 69740 124443
15825A24443J14944k68218j39147J01677J45078l7328K8484K4165j0546o8104
$$ 124443 239387 -28831 -167978 -66301 78777 41449 69933 94098 83552 15448
15815A5448p7515p6955M7662N4326j44118M6262O9322j6253q7897J78781Q2696
$$ 15448 -62067 -139022 -91360 -37034 -181152 -134890 -65568 -81821 -169718 9063 91759
15804I1759m9443j55002r2109O7024L373J18591J27886j99135J7064r0543q0120
$$ 91759 42316 -112686 -204795 -137771 -134398 -15807 112079 -87056 -69992 -160535 -240655
15793b40655J35297J0269j7250j87394n696J7322N9367L2260Q6954J31963K9973
$$ -240655 -105358 -95089 -112339 -299733 -305429 -288107 -228740 -196480 -109526 22437 52410
15782E2410l2181J2060p9874j43456m084J11917q0372j05896q289K55166J82005
$$ 52410 20229 32289 -47585 -191041 -195125 -83208 -163580 -269476 -277765 -22599 159406
15771A59406j39915k43340k7999K03795J68496r294j51416l9252o5758r0291Q2140
$$ 159406 19491 -223849 -251848 -48053 120443 111149 -40267 -79519 -145277 -235568 -153428
15760a53428J01544R4609J75382k9914m4485j50449K81002N2705j45708p7694
$$ -153428 -51884 42725 218107 188193 143708 -6741 274261 326966 181258 103564
15750A03564j62314j4346j7457J74530n8204o5893k72850q7715P7339J32410p8452
$$ 103564 -58750 -73096 -90553 83977 25773 -40120 -312970 -400685 -323346 -190936 -269388
15739b69388K3770Q0323J03356J26890O8322j26801j89976k02515K39011K17344
$$ -269388 -245618 -165295 -61939 64951 133273 6472 -183504 -386019 -147008 70336
15729G0336Q4772p0146j40926j50430j6931J5049l5804j54957J19259J59816L7916
$$ 70336 155108 84962 -55964 -206394 -223325 -208276 -244080 -399037 -279778 -119962 -82046
15718h2046r3973l3758O4937N2698M3912q0799L1842N410J93567J07678j34079
$$ -82046 -176019 -209777 -144840 -92142 -48230 -129029 -97187 -91777 101790 209468 75389
15707G5389q3425K02070j31619P674J33260J32961r2475k42368q7108J43039L2896
$$ 75389 -8036 194034 62415 70089 203349 336310 243835 1467 -85641 57398 90294
15696I0294P2726K47680p9707m45363j08195O5280m6509q5449O2351J20233J44721
$$ 90294 163020 410700 330993 -114370 -222565 -157285 -203794 -289243 -226892 -106659 38062
15685C8062J20374m5740N0563O5616j25552n9028M980j99740k2843J6028k7659
$$ 38062 158436 112696 163259 228875 103323 44295 49275 -150465 -173308 -157280 -184939
15674a84939Q032J95450J60591r0367j39130k0432P7298j68184r9298j26138j69039
$$ -184939 -176907 18543 179134 88767 -50363 -70795 6503 -161681 -260979 -387117 -556156
15663e56156J31857J3880K21790N5314M4359n6572J30822j6881r5558n2268j15597
$$ -556156 -424299 -410419 -188629 -133315 -88956 -145528 -14706 -31587 -127145 -179413 -295010
15652b95010K1099J89855o1899k5040o8842k9649R5819J37649p92O3517O6556
$$ -295010 -273911 -84056 -145955 -170995 -239837 -269486 -173667 -36018 -36810 26707 93263
15641I3263p6532m9183L2457j29430J02115k0292m6060L8113o5244l3545M3369
$$ 93263 16731 -32452 5 -129425 -27310 -47602 -93662 -55549 -120793 -154338 -110969
15630a10969J10501j58555Q059J59565m8309J9359R0385J22331o4462j60348n5466
$$ -110969 -468 -159023 -150964 8601 -39708 -20349 70036 192367 127905 -32443 -87909
15619h7909J30844o3291j31954L9189L0436J5827M1127J08246j04232p5039q158
$$ -87909 42935 -20356 -152310 -113121 -82685 -66858 -25731 82515 -21717 -96756 -104914
15608a04914J81814J71722P8417j77602J9869N1492J6815k8739j65866k22249
$$ -104914 76900 248622 327039 149437 169306 220798 237613 208874 43008 -179241
15598a79241o2464l5853j62195r398J43461o6169p4535J47234O7984k48051J59266
$$ -179241 -241705 -277558 -439753 -449151 -305690 -371859 -446394 -299160 -231176 -479227 -319961
15587c19961L1003J3553J17034J20213k2113J69529n7266N3970J15111l0604N4263
$$ -319961 -288958 -275405 -158371 -38158 -60271 109258 51992 105962 221073 190469 244732
15576B44732j93441l39651K4600J98889R5675j87447j16724j53654n3090J24205
$$ 244732 51291 -288360 -263760 -64871 30804 -156643 -273367 -427021 -480111 -355906
15566c55906J80131O9255j49566n4255K21696j80987R592M5651o1623j20893K03071
$$ -355906 -175775 -106520 -256086 -310341 -88645 -269632 -260040 -214389 -276012 -396905 -193834
15555a93834K3392j5867k3633K12702l3623Q7965P5375j57214L2995J97404J07921
$$ -193834 -170442 -186309 -209942 2760 -30863 57102 132477 -24737 8258 205662 313583
15544C13583p8455o1833j86512j17237O9717J03845j52620l05820J14642J10507
$$ 313583 235128 173295 -13217 -130454 -60737 43108 -109512 -415332 -300690 -190183
15534a90183N8078q2202k99635M4584K72311O8423r575L8462m9507Q0124J96654
$$ -190183 -132105 -214307 -513942 -469358 -197047 -128624 -138199 -99737 -149244 -69120 127534
15523A27534R0738j71571k63635k11837P6162J93653J3977Q8759K05841p2978
$$ 127534 218272 46701 -216934 -428771 -352609 -158956 -144979 -56220 149621 76643
15513G6643j43071k5063j14713m1882O9464O5561j07247K5411J18579P0337o2678
$$ 76643 -66428 -91491 -206204 -248086 -178622 -113061 -220308 -194897 -76318 -5981 -68659
15502f8659O9690p0505O6342q7569k93819J65557K58072M9798k73535q3176P7897
$$ -68659 1031 -69474 -3132 -90701 -384520 -218963 39109 88907 -184628 -267804 -189907
15491a89907n9751R8353M2772P7060J93877l5832r9499k9548j02123q5475J27444
$$ -189907 -249658 -151305 -108533 -31473 162404 126572 27073 -2475 -104598 -190073 -62629
15480f2629J22104K7247n1143O0728Q463K4888J47223j53664N2289k14235m54
$$ -62629 59475 86722 35579 96307 104770 129658 276881 123217 175506 -38729 -39183
15469c9183N4725j10190J01644J14226m3530J25910j77996k25602j53411Q0106
$$ -39183 15542 -94648 6996 121222 77692 203602 25606 -199996 -353407 -273301
15459b73301L02931o4297j35459j12549R2083J83721J46656J21306q0281k01747
$$ -273301 29630 -34667 -170126 -282675 -190592 -6871 139785 261091 180810 -20937
15449b0937N450m082j66512K1800R1895Q8064o8107j60165k19934K40864K40072
$$ -20937 -15487 -19569 -186081 -164281 -72386 15678 -52429 -212594 -432528 -191664 48408
15438D8408j160j22900k23079Q8508K11443Q4720J72506j05306j43176M9438j23704
$$ 48408 47248 -75652 -298731 -210223 1220 85940 258446 153140 9964 59402 -64302
15427f4302k12781n4254O7929k392L069j99515J02685P1851L25059L8630r0745
$$ -64302 -277083 -331337 -263408 -265800 -262731 -462246 -359561 -287710 37349 75979 -14766
15416a4766k02477p8398j2753M5470J72627Q6425M3482L21292j23164p6451l1554
$$ -14766 -217243 -295641 -308394 -262924 -90297 -3872 39610 360902 237738 161287 129733
15405A29733j26339k02341K3740M2878L1485p2984L130J49992j31479L6702J48127
$$ 129733 3394 -198947 -175207 -132329 -100844 -173828 -170698 -20706 -152185 -115483 32644
15394C2644N760O8885J2375k55576j25097k55693R0293n215M0098J03873n947
$$ 32644 38404 107289 119664 -135912 -261009 -516702 -426409 -431624 -391526 -287653 -293600
15383b93600j45N7854Q4685J16614j28188K1006P6229M4923n4967j35288j8463
$$ -293600 -293745 -235891 -151206 -34592 -162780 -141774 -65545 -20622 -75589 -210877 -229340
15372b29340O1833J75629j3364n2878J27665J31371J08986j82318m07205l2761
$$ -229340 -167507 8122 -5242 -58120 69545 200916 309902 127584 -279621 -312382
15362c12382P7448l880j37485J64898J15976o3835r4969k3893j04713J59625P2737
$$ -312382 -234934 -238814 -376299 -211401 -95425 -159260 -254229 -278122 -382835 -223210 -150473
15351a50473M4704Q5408j7285J08j86190q0639J350N6538l9336n9244O4676K26836
$$ -150473 -105769 -20361 -37646 -37538 -223728 -304367 -303017 -246479 -285815 -345059 -280383 -53547
15339e3547L6282o5254J03367p8175j07565M36j4051K01360K67799n3642l74822
$$ -53547 -17265 -82519 20848 -57327 -164892 -164456 -178507 22853 290652 237010 -137812
15328a37812K73606K2502k26488N5761P4830J32204k7475l15177j44964k6194
$$ -137812 135794 158296 -68192 -12431 62399 194603 167128 -148049 -293013 -319207
15318c19207J77287J49707J07070J97754K7595j55766k34210n7388J01690j05965
$$ -319207 -141920 7787 114857 312611 340206 184440 -49770 -107158 -5468 -111433
15308a11433L8178J54468O7119L1490j19543j6679j9735j11311J41204J87172
$$ -111433 -73255 81213 148332 179822 60279 43600 23865 -87446 53758 240930
15298B40930p6904j14246R6558K9793N9131k04504o4358L15448J48803j31346
$$ 240930 164026 49780 146338 176131 235262 30758 -33600 281848 430651 299305
15288B99305j97416m9421O5033r6041j6409j1601o1586K46904J54099j8760j53328
$$ 299305 101889 52468 117501 21460 5051 -6550 -68136 178768 332867 314107 160779
15277A60779L6978L471p4533l7518j37414N6574K3300J1827J25995J4382J98840
$$ 160779 197757 201228 126695 89177 -48237 8337 31637 43464 169459 183841 382681
15266C82681J23576j488k25614j52363n480O1535m6104q5838j55931O6844q2986
$$ 382681 506257 504769 279155 126792 121312 182847 136743 50905 -105026 -38182 -121168
15255a21168j96608J62749o5548J97776P461P969k4139j47966p9529J88432J19949
$$ -121168 -317776 -155027 -220575 -22799 -15338 -7369 -31508 -179474 -259003 -70571 49378
15244D9378j9409j63063J6911J05142K7129j7860k0495J25670l6348K0001J66836
$$ 49378 29969 -133094 -116183 -11041 16088 -1772 -22267 103403 67055 87056 253892
15233B53892K92677J27121l65678k40167o3467P616j61632q4500j09100J281L12449
$$ 253892 546569 673690 308012 67845 4378 11994 -149638 -234138 -343238 -341957 -29508
15222b9508J01352J1208k45030k47032J07909J70128L5868K7935K16934K1403
$$ -29508 71844 83052 -161978 -409010 -301101 -130973 -95105 -67170 149764 171167
15212A71167L2162N9105N2178K6911j29057j90660k12969j56036R7874K20295
$$ 171167 203329 262434 314612 341523 212466 21806 -191163 -347199 -249325 -29030
15202b9030l63j91865r758R7480J72126r2213l659L195m4080q3544o473j16976
$$ -29030 -29393 -221258 -231016 -133536 38590 -53623 -57282 -54087 -98167 -181711 -188184 -305160
15190c05160Q0048L65341J80169M4319j71154j19228J44926J64727j70677j81299
$$ -305160 -225112 140229 320398 364717 193563 74335 219261 383988 213311 32012
15180C2012j43054k68592k8811J20191J45018K23999J25476j5123j94257j4330
$$ 32012 -111042 -379634 -408445 -288254 -143236 80763 206239 191116 -3141 -17471
15170a7471L9035K60248j12511l41768K556J90447J19896N3714j08337j48741
$$ -17471 21564 281812 169301 -172467 -169911 20536 140432 194146 85809 -62932
15160f2932J00887l5027N9240J05637J23231r3867p3142j05595J5692Q0634n4826
$$ -62932 37955 2928 62168 167805 291036 197169 124027 18432 34124 114758 59932
15149E9932J36458K50071k0495p0422j78212k27447j46438j19709j00271O7986
$$ 59932 196390 446461 425966 355544 177332 -50115 -196553 -316262 -416533 -348547
15139c48547K77214J30366l69341J33820K09971o1370l8551M0850M2174O5916
$$ -348547 -71333 59033 -310308 -176488 33483 -27887 -66438 -25588 16586 82502
15129H2502n1393Q1688K4735K7694P6707q3552l9052M2969j8772n6956n7238n5174
$$ 82502 31109 112797 137532 165226 241933 158381 119329 162298 143526 86570 29332 -25842
15117b5842j06608j4798J2941j59769k5091j23465L7761J60862N9174P5225j37031
$$ -25842 -132450 -147248 -134307 -294076 -319167 -442632 -404871 -244009 -184835 -109610 -246641
15106b46641l1883M3751Q4306N6163J36715J64828k9662j54482o7963K04823J06551
$$ -246641 -278524 -234773 -150467 -94304 42411 207239 177577 23095 -44868 159955 266506
15095B66506j32883l6275j3472m2996l2583o3440P0020j49326l3984L0963l1827
$$ 266506 133623 97348 83876 40880 8297 -55143 14877 -134449 -168433 -137470 -169297
15084a69297j29664k4534Q4068J32595j8582J04409K7068k9600P09K6601J12751
$$ -169297 -298961 -323495 -239427 -106832 -125414 -21005 6063 -23537 -22828 3773 116524
15073A16524k3341J21041q3307R2057l6571r2753m0206n3433J26857p6833j39100
$$ 116524 93183 214224 130917 222974 186403 93650 53444 11 126868 50035 -89065
15062h9065J36469K60622n1019j72852j85997N5948J98748J69651j08799l36901
$$ -89065 47404 308026 257007 84155 -101842 -45894 152854 322505 213706 -123195
15052a23195j22336L08013K20687j06075k7357J78102k86862j96123J23590J99734
$$ -123195 -245531 62482 283169 177094 149737 327839 40977 -155146 -31556 168178
15042A68178r9699j80954J39675O8301j48562P6151m325k65620J16284K49053
$$ 168178 68479 -112475 27200 95501 -53061 23090 18765 -246855 -130571 118482
15032A18482m9059j97260R1389K1487j00800M3312j84055o6904J77081K58260
$$ 118482 69423 -127837 -36448 -14961 -115761 -72449 -256504 -323408 -146327 111933
15022A11933m501k17086J5433K96359p8769k82240r0498O5769N8391m0146r680
$$ 111933 107432 -109654 -94221 202138 123369 -158871 -249369 -183600 -125209 -165355 -175035
15011a75035n8998k20152L0912j82644L2121K76922N4382L5086o2706M7516J01656
$$ -175035 -234033 -454185 -423273 -605917 -573796 -296874 -242492 -207406 -270112 -222596 -120940
15000a20940k9998j829J85982O0172k40813k16785o9868M12904K66384M8158p0702
$$ -120940 -150938 -152767 33215 93387 -147426 -364211 -434079 -21175 245209 293367 222665
14989B22665j60308j95048j31282L9298l3757K8315j42377J21787J88529k7168
$$ 222665 62357 -132691 -263973 -224675 -258432 -230117 -372494 -250707 -62178 -89346
14979h9346J7098R6287J99976j8767l83119j21714K16464M1754r1627K12935J36485
$$ -89346 -72248 24039 224015 205248 -177871 -299585 -83121 -41367 -132994 79941 216426
14968B16426j14486j08503M9924J67667o7343k89574j77431P9148J14965N4786
$$ 216426 101940 -6563 43361 211028 143685 -145889 -323320 -244172 -129207 -74421
14958g4421K45558O6066P9916j61400j67719j54343L7929J61296M5208j53221
$$ -74421 171137 237203 317119 155719 -12000 -166343 -128414 32882 78090 -75131
14948g5131j53785l9849L7239L63691M913j7729J735j03261r4917J33716k34505
$$ -75131 -228916 -268765 -231526 132165 137078 119349 121084 17823 -77094 56622 -177883
14937a77883j30268M1170J59310K424P2854J73044j89878k81741N9784L4610J38964
$$ -177883 -308151 -266981 -107671 -105247 -32393 140651 -49227 -330968 -271184 -236574 -97610
14926i7610J55010m8042q3114k3201k9944K58490J66269j62026j16975j35604
$$ -97610 57400 9358 -73756 -96957 -126901 131589 297858 135832 18857 -116747
14916a16747M6175K28349j1481J33831J49430o3653k91384m1338Q8228n1740O312
$$ -116747 -70572 157777 146296 280127 429557 365904 74520 33182 121410 69670 75982
14905G5982r152m7671R487l8386J21381J73404M0128j25905K7301L5138J43293
$$ 75982 66830 19159 28646 -9740 111641 285045 325173 199268 226569 261707 405000
14894D05000K8980O2920m24354j8047j71526j80417J05617J80188J04366J95100
$$ 405000 433980 496900 72546 54499 -117027 -297444 -191827 -11639 92727 287827
14884B87827r4521o1081O6108q8522M9019J7030n565j4689j17331k3192j56989
$$ 287827 193306 132225 198333 109811 158830 175860 170295 155606 38275 15083 -141906
14873a41906p5149Q7204K82108J77695J96231j60360j69129N8832L4115j22289
$$ -141906 -217055 -129851 152257 329952 526183 365823 196694 255526 289641 167352
14863A67352j83618N447K88719N3869k5874P7273k465j38917j83786o0424p8440
$$ 167352 -16266 -10819 277900 331769 305895 383168 380703 241786 58000 -2424 -80864
14852h0864N5466L7471q5802P0979O0529q3888K9141Q4479L28094M0231j78406
$$ -80864 -25398 12073 -73729 -2750 57779 -26109 3032 87511 415605 455836 277430
14841B77430k50545k35012K46604K93677j95222P5864R8152r0290q1892j79071
$$ 277430 26885 -208127 38477 332154 136932 212796 310948 220658 138766 -40305
14831d0305l0730j99437J28863K71597p8730j20501j15989j83989M8765L27503
$$ -40305 -71035 -270472 -141609 129988 51258 -69243 -185232 -369221 -320456 7047
14821G047K75309l9588j93403o3534J64619j6090L2143J25630o406j56750r5691
$$ 7047 282356 242768 49365 -14169 150450 134360 166503 292133 285727 128977 33286
14810C3286o2853L8950J51161J38529L6359o5851j22045K7147K97k6868r626j05574
$$ 33286 -29567 9383 160544 299073 335432 269581 147536 174683 174980 148112 138486 32912
14798C2912j8874q7323j33634J23549J94163o6685p9548j15110L0627R695J4555
$$ 32912 14038 -73285 -206919 -83370 110793 44108 -35440 -150550 -119923 -110228 -95673
14787i5673J86600l9970Q786k23396j43198N1212J24901J96609o259L9790m9001
$$ -95673 90927 50957 59743 -163653 -306851 -255639 -130738 65871 59612 99402 50401
14776E0401n4464N2493j88285J0428N5887K116n132J647O9027k7878J9676J580
$$ 50401 -4063 48430 -139855 -129427 -73540 -71424 -76556 -74909 -5882 -33760 -14084 -12504
14764a2504n3501j67569J51808K33357r3423j48731j27052J16653K28476K86387
$$ -12504 -66005 -233574 -81766 151591 58168 -90563 -217615 -100962 127514 413901
14754D13901j3270k00234j48581k6541n1276J93944J80528j64525j43309j21772
$$ 413901 400631 200397 51816 25275 -26001 167943 348471 183946 40637 -81135
14744h1135M4656j86755K0667J07706J31166L0879l6654n1718r9869q7094J21662
$$ -81135 -36479 -223234 -202567 -94861 36305 67184 30530 -21188 -121057 -208151 -86489
14733h6489k6628k02550P1965L03049j19487O5459J96390k3266l39175Q6936J3739
$$ -86489 -113117 -315667 -243702 59347 -60140 5319 201709 178443 -160732 -73796 -60057
14722f0057P6092J75697O5342j1938r3492J21002J04649n2822j94059r9674J10049
$$ -60057 16035 191732 257074 245136 151644 272646 377295 324473 130414 30740 140789
14711A40789m816P0508k5234j77666J38319J71196K7792K2231R7962j85935k00819
$$ 140789 135973 206481 181247 3581 141900 313096 340888 363119 461081 275146 74327
14700G4327j14204J13696k22045j31777J32584N5171N4494j8570j12864M1039
$$ 74327 -39877 73819 -148226 -280003 -147419 -92248 -37754 -56324 -169188 -128149
14690a28149N2341K28314K24315n788o3283k53226R4885J0131M9448j8219L0612
$$ -128149 -75808 152506 376821 371033 307750 54524 149409 159540 208988 190769 221381
14679B21381N4301k13609j5373m8309j6266J21188K11227r5854j00930Q9656n6803
$$ 221381 275682 62073 46700 -1609 -17875 103313 314540 218686 117756 207412 150609
14668A50609J17403n8404l5351p3967j36327p0944Q6912J19670J1424N169J75567
$$ 150609 268012 209608 174257 100290 -36037 -106981 -20069 99601 111025 116194 291761
14657B91761P3016k53679j50210N9493M4084o4038J10904J59743J90071k05113
$$ 291761 364777 111098 -39112 20381 64465 427 111331 271074 461145 256032
14647B56032l19040k18671K17351N1515K21939J89291n2784K3873j51426K8241
$$ 256032 -63008 -281679 -64328 -12813 209126 398417 345633 369506 218080 246321
14637B46321r384l7675N7121R1629J8400k90805J2654J65446j77903j75336M9309
$$ 246321 236937 199262 256383 348012 366412 75607 88261 253707 75804 -99532 -50223
14626e0223N5733j13766M2354K2910P6445K3243J55235J78700j8810J6332j22377
$$ -50223 5510 -108256 -65902 -42992 33453 56696 211931 390631 371821 388153 265776
14615B65776r5088J0194J2854J16964J19068p8042j35877J1519P0045k70057o3149
$$ 265776 170688 180882 193736 310700 429768 351726 215849 227368 297413 27356 -35793
14604c5793R2114M8188l9519J36579l0859L2298N399K1366k10242k2088q4450
$$ -35793 56321 104509 64990 201569 170710 203008 208407 229773 19531 -2557 -87007
14593h7007J60658N9588M2600o8297P137p9724J35915N642O9666j4500J84193
$$ -87007 73651 133239 175839 107542 114679 34955 170870 176512 246178 231678 415871
14582D15871J45743R2203r2967m25798q8238j67639j04360M0860Q5877j8694m5176
$$ 415871 561614 653817 560850 135052 46814 -120825 -225185 -184325 -98448 -117142 -162318
14571a62318K31101l2871K21562r4555j93441j50700J05295K37062K69694N3045
$$ -162318 68783 35912 257474 162919 -30522 -181222 -75927 161135 430829 483874
14561D83874j14197L5244p863m35r6931k23215Q69J5790Q3683j13962R2536m6305
$$ 483874 369677 404921 397058 396623 299692 76477 77346 93136 176819 62857 155393 109088
14549A09088r2054r0936j0289J27448q1446L5143J17113k00711k21189J68129
$$ 109088 17034 -73902 -84191 43257 -38189 -3046 114067 -86644 -307833 -139704
14539a39704J52530J26328k9025j57936j04954j68131M82475K41160j41200j13554
$$ -139704 12826 139154 110129 -47807 -152761 -320892 161583 402743 261543 147989
14529A47989n0670Q5025J54167j29221k07707K5870n1283l8733Q8511R3554k8982
$$ 147989 97319 182344 336511 207290 -417 25453 -25830 -64563 23948 117502 88520
14518H8520k2206P089M37090P8444j58897k04841p0097j33637J89897K34114k14000
$$ 88520 66314 73403 510493 588937 430040 225199 155102 21465 211362 445476 231476
14507B31476o595J36877k61252o3370J6424Q4449J22915k8054k24646K26093j44083
$$ 231476 224881 361758 100506 37136 53560 138009 260924 232870 8224 234317 90234
14496I0234k38236q6563J8257n5162N7319M5626m8923j2531K32159K00522l7127
$$ 90234 -148002 -234565 -216308 -271470 -214151 -168525 -217448 -229979 2180 202702 165575
14485A65575L1565j19355m3070j27446K16664O2644n4887J3723J37581L7200O3408
$$ 165575 197140 77785 34715 -92731 123933 186577 131690 145413 282994 320194 383602
14474C83602p2045j43957k00918k45119J66048J79909J74017n1420m7998L1960
$$ 383602 311557 167600 -33318 -278437 -112389 67520 241537 190117 142119 174079
14464A74079J5656j52922k8375J32031R0401k7476J22453J49992J2347j0490n4169
$$ 174079 189735 36813 8438 140469 230870 203394 325847 475839 488186 477696 423527
14453D23527J2273j21141k64360j68672J16083j41173j71445k14892L7253L9575
$$ 423527 435800 314659 50299 -118373 -2290 -143463 -314908 -529800 -492547 -452972
14443d52972J33360P5911Q5476K7039J53324O3774j17944j6676J20764L06780
$$ -452972 -319612 -243701 -158225 -131186 22138 85912 -32032 -48708 72056 378836
14433C78836m5352j45200j47842J28038J64980Q6102j29529j05025J77718o2408
$$ 378836 333484 188284 40442 168480 333460 419562 290033 185008 362726 300318
14423C00318j52171j8613p7790J1346m7194j44545k1407J5260L95426L07996J42923
$$ 300318 148147 129534 51744 63090 15896 -128649 -150056 -134796 260630 568626 711549
14412G11549j74540q8994r9924j83859N7360J07113k6621Q5803L4882j15852k23090
$$ 711549 537009 448015 348091 164232 221592 328705 302084 387887 422769 306917 83827
14401H3827l64241j2416K29007P863P9500j0965J48584m3033j84083j56087J72456
$$ 83827 -280414 -292830 -63823 -55960 23540 12575 161159 118126 -65957 -222044 -49588
14390d9588K39904o8696j4786J92182L03066r9536l32147N6000J78207M0824K8436
$$ -49588 190316 121620 106834 299016 602082 502546 170399 226399 404606 445430 473866
14379D73866k25452k61928j52237j45563j5803Q4814J47473J41502n0792N1813
$$ 473866 248414 -13514 -165751 -311314 -327117 -242303 -94830 46672 -4120 47693
14369D7693j34558L5313L5025m1428j51493N4373L12347J31561j02171k37766
$$ 47693 -86865 -51552 -16527 -57955 -209448 -155075 157272 288833 186662 -51104
14359e1104j1329P5114O5322K2513M5637o5830r7122J17880J4222p9440n7843
$$ -51104 -62433 12681 78003 100516 146153 80323 -16799 101081 115303 35863 -21980
14348b1980M5446L9804J04692O5370n0400n8615P2002r4049j03313j08104Q9718
$$ -21980 23466 63270 167962 233332 182932 124317 196319 102270 -1043 -109147 -19429
14337a9429J93694K16685K54873m6253k70751l07426J92233K70517R135j11551
$$ -19429 174265 390950 645823 599570 328819 21393 213626 484143 493278 381727
14327C81727K1572n3205k48771j46535K11614L5018j38798k1955J64359p505j5411
$$ 381727 403299 350094 101323 -45212 166402 201420 62622 40667 205026 197521 182110
14316A82110O0224J56259n836J33663k82543l49956M9451J4221J49540N1613L3199
$$ 182110 242334 398593 392757 526420 243877 -106079 -56628 -42407 107133 158746 191945
14305A91945K1407J7294J61753J35190o1924j58266j0848P5903q7483l7275j81015
$$ 191945 213352 230646 392399 527589 465665 307399 296551 372454 284971 247696 66681
14294F6681k4585k6397M0261J97120k2519K899m3825j44224p8095K25609p7788
$$ 66681 42096 15699 55960 253080 230561 233460 189635 45411 -32684 192925 115137
14283A15137j31232N3824m9571J21781J39764J53011N1332N5267j09825q446o6981
$$ 115137 -16095 37729 -11842 109939 249703 402714 454046 509313 399488 391042 324061
14272C24061j03532O1592j38103j5233J33448j92874r5047K37543K59829K81369
$$ 324061 220529 282121 144018 128785 262233 69359 -25688 211855 471684 753053
14262G53053o0102M8770k33035l69803j85002L43948Q938j06466m5181J80702
$$ 753053 692951 741721 508686 138883 -46119 297829 306767 200301 155120 335822
14252C35822k00835j41931K08171p1795P8427M2374O5254o0299N8165k6672J20665
$$ 335822 134987 -6944 201227 129432 207859 250233 315487 255188 313353 286681 407346
14241D07346M9236R3820P8631L4330n153j29803k03203M2708K5684M9444M0313
$$ 407346 456582 550402 629033 663363 658210 528407 325204 367912 393596 443040 483353
14230D83353J79356J53448o9826l06506k47235m9356K69936K29620j38787q0754
$$ 483353 662709 816157 746331 439825 192590 143234 413170 642790 504003 423249
14220D23249k06937L7219k170R6961J84482n9343j889J11859J58700N1405r235
$$ 423249 216312 253531 251361 348322 532804 473461 471572 583431 742131 793536 784301
14209G84301j97291k98637L02619J53490J36934j32321j50956N3828l352p7809
$$ 784301 587010 288373 590992 744482 881416 749095 598139 651967 648615 570806
14199E70806n5644J63561N433L495M0890Q9576J26460P4679p2041Q8244j18962
$$ 570806 515162 678723 684156 687651 728541 818117 944577 1019256 947215 1035459 916497
14188I16497k42997q8382M0661L27252J83249j13487j76316L692k08638K14566
$$ 916497 673500 585118 625779 953031 1136280 1022793 846477 850169 641531 856097
14178H56097r6797j65072o0779l0702r0341L20546K00479j43882j08107K63410
$$ 856097 759300 594228 533449 502747 412406 732952 933431 789549 681442 944852
14168I44852N50O2834J52852l8451j62389j47912l5176m0433j5463l6585j6971
$$ 944852 945402 1008236 1161088 1122637 960248 812336 777160 736727 721264 684679 667708
14157F67708j03493O8099J17489N6038r5519k9873R3832N9379N1282j88030l36287
$$ 667708 564215 632314 749803 805841 710322 680449 774281 833660 884942 696912 360625
14146C60625k2361J78086J73097j7140k37151R0592p1092j57064J92779J53798
$$ 360625 338264 516350 689447 672307 435156 525748 454656 297592 490371 644169
14136F44169k41J90661j10145Q7940O7715k36251R4922K8527j11270l009K66592
$$ 644169 643928 834589 724444 812384 880099 643848 738770 767297 656027 653018 919610
14125I19610k57837k53167J64140k6384J1806r24O2248l7722j18902J2087k17548
$$ 919610 661773 408606 572746 546362 558168 557244 619492 581770 462868 474955 257407
14114B57407j20856n5590j46944R6231J11860K07338J624j46398K74778K53461
$$ 257407 136551 80961 -65983 30248 142108 349446 351070 204672 479450 732911
14104G32911j27541r6259J47158o1725k08707j58434N2790N434Q980j49194k22299
$$ 732911 605370 509111 656269 594544 385837 227403 280193 285627 294607 145413 -76886
14093g6886k57049O649K95777K22094L57255J7946k00788L0750p387j0832P268
$$ -76886 -333935 -327286 -31509 190585 547840 565786 364998 395748 388361 377529 384797
14082C84797N3030l2905k47678k6313P3285l2619R3744J27617J97926K582K31054
$$ 384797 437827 404922 157244 130931 204216 171597 265341 392958 590884 593466 824520
14071H24520L463k21573l5062k33808j45407J34163K96656k0289j27767p4816
$$ 824520 827983 606410 571348 337540 192133 326296 622952 602663 474896 400080
14061D00080J34303q5499k7455n0723M7871n1234J19167J8314J97636M6524l22646
$$ 400080 534383 448884 421429 370706 418577 367343 486510 504824 702460 748984 426338
14050D26338k90182q3233L28845K14941j6239o1727J12171M988j97486k55413
$$ 426338 136156 52923 381768 596709 580470 518743 630914 635902 438416 183003
14040A83003J45652K49463R9238q5066j93274p9054J75837K11805O2070J67741
$$ 183003 328655 578118 677356 592290 399016 319962 495799 707604 769674 937415
14030I37415p5752Q195j91093M6177j27170q9130J62292J60212N9445J587J73750
$$ 937415 861663 869858 678765 724942 597772 508642 670934 831146 890591 892178 1065928
14019A065928L4018j37552k74812j24715j10163K31174J56139L7896n1834o4647
$$ 1065928 1099946 962394 687582 562867 452704 683878 840017 877913 826079 761432
14009G61432k45334K11982m8506Q3130K50188j004p1665p5111J87562J61777k12032
$$ 761432 516098 728080 679574 762704 1012892 1011888 940223 865112 1052674 1214451 1002419
13998A002419k66952p8617K08952n2872j07332O0140K7805J46511J1400k52072
$$ 1002419 735467 656850 865802 812930 705598 765738 793543 940054 951454 699382
13988F99382j39744J68589K46006j29228o0284j06330O2996J7970p0250q1787
$$ 699382 559638 728227 974233 845005 784721 678391 741387 759357 689107 607320
13978F07320J17965J42283M0055J95658J02521r9629l8478Q5423O8887J18881
$$ 607320 725285 867568 907623 1103281 1205802 1106173 1067695 1153118 1222005 1340886
13968A340886k39945j41081r2584R2842J36006j00019K00918m466k34885p0005
$$ 1340886 1100941 959860 867276 960118 1096124 996105 1197023 1192557 957672 887667
13958H87667J40095P495O4419J14586J01610N3301M623K91427L10851J86044R3094
$$ 887667 1027762 1035257 1099676 1214262 1315872 1369173 1373796 1665223 1976074 2162118 2255212
13947B255212K50028L75794j07350k3784j69198k84208j15348j69230j89629j61195
$$ 2255212 2505240 2881034 2773684 2749900 2580702 2296494 2181146 2011916 1822287 1661092
13937A661092p9337p4450k810p9282P1800Q2283r1594K5748j1760O133J57249
$$ 1661092 1581755 1507305 1504495 1425213 1497013 1579296 1487702 1513450 1501690 1507823 1665072
13926A665072r604J067P1373j06003N389o4746J9556K12690J08077j67076j6795
$$ 1665072 1655468 1656535 1727908 1621905 1627294 1562548 1582104 1794794 1902871 1735795 1719000
13915A719000J52794P9165M2031R8877n1494n6846J8490j06380l6338k18538k2390
$$ 1719000 1871794 1950959 1992990 2091867 2040373 1983527 2002017 1895637 1859299 1640761 1618371
13904A618371Q9527J66294J54711J18477j09172p6281J55916K54565K26659o1226
$$ 1618371 1707898 1874192 2028903 2147380 2038208 1961927 2117843 2372408 2599067 2537841
13894B537841j80008N8105J39045o278P4985J54377K43371J82416J65542o4889
$$ 2537841 2357833 2415938 2554983 2548705 2623690 2778067 3021438 3203854 3369396 3304507
13884C304507j23776j27951m6360L88937L97047J86053j9480J68357J14213r2495
$$ 3304507 3180731 3052780 3006420 3395357 3792404 3978457 3958977 4127334 4241547 4149052
13874D149052J88391M24004O7518L6677L21473L92290J14539J32546K26091M45840
$$ 4149052 4337443 4761447 4828965 4865642 5187115 5579405 5693944 5826490 6052581 6498421
13864F498421N39068K85559L50806L04735K94500J28286M00917M91256N79875
$$ 6498421 7037489 7323048 7673854 7978589 8273089 8401375 8802292 9293548 9873423
13855I873423O02119N26908N22701N68042Q23285N92315K56325O22917O50947
$$ 9873423 10475542 11002450 11525151 12093193 12916478 13508793 13765118 14388035 15038982
13846A5038982O15382P25208Q17993R18766O44369P46102O38051R43949Q54665
$$ 15038982 15654364 16379572 17197565 18116331 18760700 19506802 20144853 21088802 21943467
13837B1943467O13477Q00632P11334N56439N13013M43185L66675K73783K54315
$$ 21943467 22556944 23357576 24068910 24625349 25138362 25581547 25948222 26222005 26476320
13828B6476320M41502K23485K22259K07181K8834J70759K35260j37299K06897
$$ 26476320 26917822 27141307 27363566 27570747 27599581 27770340 28005600 27868301 28075198
13819B8075198M31081L05650n3265Q1552L17358L30278N22529K52357L75029L39077
$$ 28075198 28506279 28811929 28758664 28840216 29157574 29487852 30010381 30262738 30637767 30976844
13809C0976844J94014K58562O29640M53317L65092L92842N61963M10722O0409
$$ 30976844 31170858 31429420 32059060 32512377 32877469 33270311 33832274 34242996 34303405
13800C4303405J33376k5026J31989J94417o625q6961o9509J34321k21950l19231
$$ 34303405 34436781 34411755 34543744 34738161 34731536 34644575 34575066 34709387 34487437 34168206
13790C4168206k53098l40558j66154Q9906J67010o5516j41903K7237P9258K81242
$$ 34168206 33915108 33574550 33408396 33498302 33665312 33599796 33457893 33485130 33564388 33845630
13780C3845630K11735K32857L68280J90068O78374Q77996Q35822R70039R66480
$$ 33845630 34057365 34290222 34658502 34848570 35526944 36404940 37240762 38210801 39177281
13771C9177281Q58042R78476J408463J615594J470153J513680J714858J983174
$$ 39177281 40035323 41013799 42422262 44037856 45508009 47021689 48736547 50719721
13763E0719721K390831K470912K478749K625695K691540K739076L264488L422956
$$ 50719721 53110552 55581464 58060213 60685908 63377448 66116524 69381012 72803968
13755G2803968L376046L414194L485859L513418L351501L555429L543552L642544
$$ 72803968 76180014 79594208 83080067 86593485 89944986 93500415 97043967 100686511
13747A00686511L417173L155409L044568K882174K628855K415990K189453K031742
$$ 100686511 104103684 107259093 110303661 113185835 115814690 118230680 120420133 122451875
13739A22451875J896283J673290J636696J601297J258860J021577J173589J143295
$$ 122451875 124348158 126021448 127658144 129259441 130518301 131539878 132713467 133856762
13731A33856762J465160J412276R27228J140692J012862Q22223P32502O01578
$$ 133856762 135321922 136734198 137661426 138802118 139814980 140637203 141369705 141971283
13723A41971283K28634m67533j025990j421249j801925k386290k792401l458035
$$ 141971283 142199917 141732384 140706394 139285145 137483220 135096930 132304529 128846494
13715A28846494m012352m445978m983640n197634n084848n483747n426159n135564
$$ 128846494 124834142 120388164 115404524 110206890 105122042 99638295 94212136 89076572
13707H9076572n296826n258226n092902m545200m351336m342723m101475l710458
$$ 89076572 83779746 78521520 73428618 68883418 64532082 60189359 56087884 52377426
13699E2377426l401681l281522l104744k603688k438462k483569k287254j985154
$$ 52377426 48975745 45694223 42589479 39985791 37547329 35063760 32776506 30791352
13691C0791352j584239j613315j558530j606645j228391j186735j480173j330983
$$ 30791352 29207113 27593798 26035268 24428623 23200232 22013497 20533324 19202341
13683A9202341q41295o40288j094417j055832o51742o51182n25295o88334p94141
$$ 19202341 18361046 17720758 16626341 15570509 14918767 14267585 13742290 13053956 12259815
13674A2259815n20572l33736o20709l53308k34971l97646n58421m34713k92413
$$ 12259815 11739243 11405507 10784798 10431490 10196519 9798873 9240452 8805739 8513326
13665H513326l83185k82784l37238j72286j1721l37648n70660k62337k92391o5030
$$ 8513326 8130141 7847357 7510119 7337833 7326112 6988464 6417804 6155467 5863076 5798046
13655E798046j52251K9066j26999l05103j80567j09715q992n9693j05649p1390
$$ 5798046 5645795 5674861 5547862 5242759 5062192 4952477 4943485 4883792 4778143 4706753
13645D706753j19314j67132j42587j83598j61249k90035n4607J07103j24593M7895
$$ 4706753 4587439 4420307 4277720 4094122 3932873 3642838 3588231 3695334 3570741 3618636
13635C618636n0262j06769l53033j85317J582J8887J86217o0744k46441J15124
$$ 3618636 3568374 3461605 3108572 2923255 2924837 2943724 3129941 3069197 2822756 2937880
13625B937880J4812j7137n4696j93796Q5427q5607k95123M0908J47379q9643j78111
$$ 2937880 2952692 2935555 2880859 2687063 2772490 2686883 2391760 2432668 2580047 2490404 2312293
13614B312293j70696k68392k9196J29679J50164P5909o702j5280k0514L97J17230
$$ 2312293 2141597 1873205 1844009 1973688 2123852 2199761 2193059 2177779 2157265 2157662 2274892
13603B274892j00880j52853j5205J22036r2523l58488j06540j51175R2817J28640
$$ 2274892 2174012 2021159 2005954 2127990 2035467 1676979 1570439 1419264 1512081 1640721
13593A640721J36384n0885j01245m5484N6121M5323l6573k034N3629m7225j61019
$$ 1640721 1777105 1726220 1624975 1579491 1635612 1680935 1644362 1642328 1695957 1648732 1487713
13582A487713m3858Q6984J53933j27427l46423r75J43614l8575j87305N9371Q2052
$$ 1487713 1443855 1530839 1684772 1557345 1210922 1209947 1353561 1314986 1127681 1187052 1269104
13571A269104J33565J31070K0270j2765k35838l51551p1068J4096K50506K90435
$$ 1269104 1402669 1533739 1554009 1541244 1305406 953855 882787 896883 1147389 1437824
13561A437824J41173k96868m04732o4849M23364J24360p0938j08880j62917M2386
$$ 1437824 1578997 1282129 877397 812548 1235912 1360272 1289334 1180454 1017537 1059923
13551A059923K01521K03315q308o7105k30686j67590R7243p4040O8271O9451j58037
$$ 1059923 1261444 1464759 1456451 1389346 1158660 991070 1088313 1014273 1082544 1151995 993958
13540I93958j01587n29j24324j32619J00794M8496k1203J91763J42898j8634o4049
$$ 993958 892371 891842 767518 634899 735693 784189 762986 954749 1097647 1079013 1014964
13529A014964j29348J23889K2388k21982o8731L0240j05942o1345J09710R0480
$$ 1014964 885616 1009505 1031893 809911 741180 771420 665478 604133 713843 804323
13519H04323o4904o9986M6969j50274l6451M078J24976j44922q0081N2304N2864
$$ 804323 739419 669433 716402 566128 529677 533755 658731 513809 433728 486032 538896
13508E38896k2833k0267L8853J09628K54563J1341n8338J56974j52355j87100
$$ 538896 516063 495796 534649 644277 898840 910181 851843 1008817 856462 669362
13498F69362j16749Q5498j99122R4706J61066J91452J78108m9353j34079j08418
$$ 669362 552613 638111 438989 533695 694761 886213 1064321 1014968 880889 772471
13488G72471O5616m1864k3101j64690p8569P6937p0440O5637L3629j62321n42
$$ 772471 838087 796223 773122 608432 529863 606800 536360 601997 635626 473305 472763
13477D72763l0785Q71j92478Q2062J74002k00079o138R0030l0299j71282K3881
$$ 472763 441978 442849 250371 332433 506435 306356 300218 390248 359949 188667 212548
13466B12548q247J07624J24886J64491J4245j34327P9291k04452j14930Q0101
$$ 212548 204301 311925 436811 601302 615547 481220 560511 356059 241129 321230
13456C21230n1546J23786r045M7372k9816N0860M5067k3740j82449L969N9767
$$ 321230 269684 393470 384425 431797 401981 452841 497908 474168 291719 295688 355455
13445C55455m9454P4898J51179k14332j14604K40653K8345j18939N4604J35917
$$ 355455 306001 380899 532078 317746 203142 443795 472140 353201 407805 543722
13435E43722Q0283R6614r3963j97846p5817P8624q0753J46707J14336J45295j68286
$$ 543722 624005 720619 626656 428810 352993 431617 350864 497571 611907 757202 588916
13424E88916o9141l35396J32504J12518J14352j0720J9835j09j27237n31L4907
$$ 588916 519775 184379 316883 429401 543753 533033 552868 552759 425522 424991 459898
13413D59898p2645K678J20679O2534k26602J7976J43315K1642J53467n179j324
$$ 459898 387253 389931 510610 573144 346542 364518 507833 529475 682942 677763 676439
13402F76439J73978j03503j61782J69494J12114l90185j61036K87355J10532N5470
$$ 676439 850417 746914 585132 754626 866740 476555 315519 602874 713406 768876
13392G68876j48747r3495N4175M2019j76434L0018K9168l2784O3525Q9881m1149
$$ 768876 620129 526634 580809 622828 446394 476412 505580 472796 536321 626202 585053
13381E85053Q9030K38728J16156j12123k33483j12687J90309k1681j40941j8012
$$ 585053 674083 912811 1028967 916844 683361 570674 760983 739302 598361 580349
13371E80349l6556R4433j35313P8859k0751J252r3158j57900J96321j2418K05604
$$ 580349 543793 638226 502913 581772 561021 562273 469115 311215 507536 495118 700722
13360G00722J82699j36597k61909j46104R6525q0854l2715J63235j71017j22491
$$ 700722 883421 746824 484915 338811 435336 354482 321767 485002 313985 191494
13350A91494l1305M4807K76059K33390q92k14379k79869J46223K83149r9552j15585
$$ 191494 160189 204996 481055 714445 713553 499174 219305 365528 648677 549125 433540
13339D33540O2438k8438j20243J81291K65370J31545N7594j70173J22634K2323
$$ 433540 495978 467540 347297 528588 793958 925503 983097 812924 935558 957881
13329I57881n3958k0833j15222j34922k0429o8963k02935o430J9578J47082K06341
$$ 957881 903923 883090 767868 632946 612517 543554 340619 334189 353767 500849 707190
13318G07190q6227r3163Q2910k00995j31402K5359J07709N7809J25549p6968j9450
$$ 707190 620963 527800 610710 409715 278313 303672 411381 469190 594739 517771 498321
13307D98321R0733R2332p2290j39114K00431K23983r6667j80844M8658J57272
$$ 498321 589054 681386 609096 469982 670413 894396 797729 616885 665543 822815
13297H22815K00183j37741m53138m6761L28512J69329k8271J6860o7261K74765
$$ 822815 1022998 885257 432119 385358 713870 883199 854928 871788 804527 1079292
13287A079292M7698j46934N0097p2401p8553J5132J99512q8034o8271n3824j1755
$$ 1079292 1126990 980056 1030153 957752 879199 894331 1093843 1005809 937538 883714 871959
13276H71959N255K7831q318J85595J04467J15197q0159M533M0254Q0550L525j52759
$$ 871959 877214 905045 896727 1082322 1186789 1301986 1221827 1226360 1266614 1347164 1350689 1197930
13264A197930o8427n0086r9652p7991J10845p2305J0975K44936M2850o0379j24774
$$ 1197930 1129503 1079417 979765 901774 1012619 940314 951289 1196225 1239075 1178696 1053922
13253A053922J2977j1807n5400j38521J0202R900N7232j32934p9183J34647N3247
$$ 1053922 1066899 1055092 999692 861171 871373 881273 938505 805571 726388 861035 914282
13242I14282j19735K1104l2149J6809O4599m3118q7241p2137j7442j12140k158
$$ 914282 794547 815651 783502 800311 864910 821792 734551 662414 644972 532832 530674
13231E30674J23318L5552n1406j15859k76068J79871J1735r5400J72432j35616
$$ 530674 653992 689544 638138 522279 246211 426082 437817 342417 514849 379233
13221C79233j09077n9342K34380N0476k74972j47194L4926j9027j27427r5357
$$ 379233 270156 210814 445194 495670 220698 73504 108430 89403 -38024 -133381
13211a33381R3303K22626J36188o5815r3530q1489l0526M0102K17911K67243j3389
$$ -133381 -40078 182548 318736 252921 159391 77902 47376 87478 305389 572632 559243
13200E59243l26047j37199K09689Q765M8629K41799Q8588j24398q5081k7314J9370
$$ 559243 233196 95997 305686 314451 363080 604879 693467 569069 483988 456674 476044
13189D76044j06640j15654R6190J83743j01492J14452p2222j19462q7221p9802
$$ 476044 369404 253750 349940 533683 432191 546643 474421 354959 267738 187936
13179A87936L7843M3068j9369m6193j47354j87592J25588l3938j10428M2326K14068
$$ 187936 225779 268847 249478 203285 55931 -131661 -6073 -40011 -150439 -108113 105955
13168A05955L14174m5952k36559j65727M4681J37091M9265o5362j31209j3625
$$ 105955 420129 374177 137618 -28109 16572 153663 202928 137566 6357 -7268
13158g268j23254O9482O4894J98756Q7430j55259q2273K53388J73596O1370o1694
$$ -7268 -130522 -61040 3854 202610 290040 134781 52508 305896 479492 540862 479168
13147D79168j21947j99615j70915J23493K51873O8783J4613q2808r7025j20885
$$ 479168 357221 157606 -13309 110184 362057 430840 445453 362645 265620 144735
13137A44735J91423m4219q0012J01865K6751n8387o6655j4003m8412j3759J47362
$$ 144735 336158 291939 211927 313792 340543 282156 215501 201498 153086 139327 286689
13126B86689L61225N8147k80570n5906M4339m8461l25194l1874K87295L4142j73426
$$ 286689 647914 706061 425491 369585 413924 365463 40269 8395 295690 329832 156406
13115A56406k6139j46608M1602j70535R1133K04161J73064k75911k27699K7987
$$ 156406 130267 -16341 25261 -145274 -54141 150020 323084 47173 -180526 -152539
13105a52539R8423J791J42041J62666L25074o0809m608P3894j30914j65815n9742
$$ -152539 -54116 -52325 89716 252382 577456 516647 512039 585933 455019 289204 229462
13094B29462J69357r299k55554l27855j16283J86688J11014R359n61n3404Q5677
$$ 229462 398819 389520 133966 -193889 -310172 -123484 -12470 -3111 -3672 -57076 28601
13083B8601J87108M5049j43090k2759n4443j06436L7567O6502K23953M9806O0037
$$ 28601 215709 260758 117668 94909 40466 -65970 -28403 38099 262052 311858 371895
13072C71895O2603P9825P3478j89756p4893k767n6620P709n766k72782n785L8995
$$ 371895 434498 514323 587801 398045 323152 320385 263765 271474 265708 -7074 -12859 26136
13060B6136J77616P5847k1215j20453j95055m8622N8452J32003J19528N8678q915
$$ 26136 203752 279599 258384 137931 -57124 -105746 -47294 84709 204237 262915 254000
13049B54000J9512o8224J16831J45734O0416r6891j14076k04461J08691J61411
$$ 254000 273512 205288 322119 467853 528269 431378 317302 112841 221532 382943
13039C82943j3281j09728j40854j14314K1157J97012k4142m0837l7844J16305
$$ 382943 369662 259934 119080 4766 25923 222935 198793 157956 120112 236417
13029B36417m7305q3136j19730J19708J11522J3978J00656K56976J8539j26737
$$ 236417 189112 105976 -13754 105954 217476 231454 332110 589086 607625 480888
13019D80888M3176j14491k41260q5592M0334k6294J3375R1030K33691r5405k40334
$$ 480888 524064 409573 168313 82721 123055 96761 110136 201166 434857 339452 99118
13008I9118k13203o356Q9979J35844R4612k77220m6843K13301j7409j27216j60406
$$ 99118 -114085 -120441 -30462 105382 199994 -77226 -124069 89232 71823 -55393 -215799
12997b15799m7609J46389J08754J23643J13346l0296j01434J27333J89943N8741
$$ -215799 -263408 -117019 -8265 115378 228724 198428 96994 224327 414270 473011
12987D73011j54380j56246j5977q1632K9581o4691l283J01729j2476r728J67650
$$ 473011 318631 162385 146408 64776 94357 29666 26383 128112 115636 105908 273558
12976B73558o3134j12649j39975J48256P6839N2644J0542L1289n2411p669J72209
$$ 273558 210424 97775 -42200 106056 182895 235539 246081 277370 224959 217290 389499
12965C89499j92351j73050P6099p521j70886J83795J38171J09425P1299J276j23121
$$ 389499 197148 24098 100197 92676 -78210 105585 243756 353181 424480 425756 302635
12954C02635p7270J37650q9746n6409k51634o9368J07585p9732j12896J58196
$$ 302635 225365 363015 273269 216860 -34774 -104142 3443 -76289 -189185 -30989
12944c0989K01383j16639L2497K32402J0684j33824j48802q0416J73801M9911
$$ -30989 170394 53755 86252 318654 329338 195514 46712 -33704 140097 190008
12934A90008j3866n5305L2474K33034k10463j71534P3808K03983K85239n348M6998
$$ 190008 176142 120837 153311 386345 175882 4348 78156 282139 567378 562030 609028
12923F09028M0970p2018p4203k7713j40477K1199K4363k73175j39557m3623J61096
$$ 609028 649998 577980 503777 476064 335587 356786 381149 107974 -31583 -75206 85890
12912H5890J70468J03955n5799k05658m5028J37032P3423j67890P0867M6087P5036
$$ 85890 256358 360313 304514 98856 53828 190860 264283 96393 167260 213347 288383
12901B88383J6232j09173J36922J9381p3554J48400j12336p2711N9221j59255
$$ 288383 304615 195442 332364 351745 278191 426591 314255 241544 300765 141510
12891A41510l6797J76486K57987R9580j56535j80824L9095N1309j03816j67906
$$ 141510 104713 281199 539186 638766 482231 301407 340502 391811 287995 120089
12881A20089l5697R8172J66031J38602p2373j5070J78697o9927p0249n7735n8918
$$ 120089 84392 182564 348595 487197 414824 399754 578451 508524 438275 380540 321622
12870C21622k42094j40492R2666J92217j70242J52694R3504n4036o2206j0103
$$ 321622 79528 -60964 31702 223919 53677 206371 299875 245839 183633 173530
12860A73530J00317K69998J68523j09089k72671n3154Q0760O716k46719k5595
$$ 173530 273847 543845 712368 603279 330608 277454 358214 364930 118211 92616
12850I2616O630p4814J59614L1156j8752J15221K3599P8167q6333l3243L0839
$$ 92616 99246 24432 184046 215202 196450 311671 335270 413437 327104 293861 324700
12839C24700j24546P1814m6956K18786l19n7440j63901Q5296P8756J22169j5889
$$ 324700 200154 271968 225012 443798 443479 386039 222138 307434 386190 508359 492470
12828D92470P9152Q599j56369j72766m3026J27321j84973p8601K88072L3492m2806
$$ 492470 571622 580221 423852 251086 208060 335381 150408 71807 359879 393371 350565
12817C50565J49897L0256J8934K39467P36l17470j89949K11514j12219k2875q0217
$$ 350565 500462 530718 549652 789119 789855 472385 282436 493950 381731 358856 278639
12806B78639P3889n6833J39980p650l2694J64253r3621l7583k56446J53625K10290
$$ 278639 352528 295695 435675 428025 395331 559584 465963 428380 171934 325559 535849
12795E35849J84662j65528n5479O5095P0942j48081O8040J13603j75259k03706
$$ 535849 720511 554983 499504 564599 635541 487460 555500 669103 493844 290138
12785B90138k7524o2767P1578n4514q5001K19043K61202q1620j44191l22114k35631
$$ 290138 262614 199847 271425 216911 131910 350953 612155 530535 386344 64230 -171401
12774a71401m8483J45818K00619M2040J04467N431j01523j02687R2434N026O1325
$$ -171401 -219884 -74066 126553 168593 273060 278491 176968 74281 166715 171741 233066
12763B33066P8826k10023k6875M9544K39192L29811J55516j86947R8129k3070
$$ 233066 311892 101869 74994 124538 363730 693541 849057 662110 760239 737169
12753G37169k97993j15195J36310p2769q9531J17513L02830r2778r2371R9959
$$ 737169 439176 323981 460291 387522 297991 415504 718334 625556 533185 633144
12743F33144J46723M2622j51290j61339j82261k2757J41529j2194J88057M4710
$$ 633144 779867 822489 671199 509860 327599 304842 446371 434177 622234 666944
12733F66944j4150N9676K3471J9015j62156l03677j59033J88644O4740J32181
$$ 666944 652794 712470 735941 754956 592800 289123 130090 318734 383474 515655
12723E15655K19858j6371q3611j76527j78244J59674K02505J1204k1562j48433
$$ 515655 735513 719142 635531 459004 280760 440434 642939 654143 632581 484148
12713D84148L9421J34793P1408N9946j11359m6161j01373J03793L7477k2783J25947
$$ 484148 523569 658362 729770 789716 678357 632196 530823 634616 672093 649310 775257
12702G75257L5539j87432k7320M1045k03064j11270J98859j43585r4960m6970
$$ 775257 810796 623364 596044 637089 434025 322755 521614 378029 283069 236099
12692B36099n8601K5471l8555k4101J9923M4007J10707p4382M4197O1042R9480
$$ 236099 177498 202969 164414 140313 160236 204243 314950 240568 284765 345807 445287
12681D45287j64975R4788K40780J06974l3982J4258j24894N1204Q0621r7303p2439
$$ 445287 280312 375100 615880 722854 688872 703130 578236 629440 710061 612758 540319
12670E40319L6827j38287k19556M5234Q0163k7324N0434J13323Q6065K11535j69256
$$ 540319 577146 438859 219303 264537 344700 317376 367810 481133 567198 778733 609477
12659F09477m6232J3432j85922j10730L06489J116l49999m8959J37882J53140
$$ 609477 563245 576677 390755 280025 586514 587630 237631 188672 326554 479694
12649D79694J57754M0288k32627j20908J61846j8346j0678j41140P4594J07998
$$ 479694 637448 677736 445109 324201 486047 467701 457023 315883 390477 498475
12639D98475R133m4918j45957P5338N519o6422Q2369j86315K484L17248K31995
$$ 498475 507608 462690 316733 392071 397590 331168 413537 227222 229706 546954 778949
12628G78949J13474j92460j06439K7130j14812m8757K7141k4014k44330l1952
$$ 778949 892423 699963 593524 620654 505842 457085 484226 460212 215882 183930
12618A83930K07131J48393j49558M7674p4471M4515Q7479k31400r922J70862r7393
$$ 183930 391061 539454 389896 437570 363099 407614 495093 263693 253771 424633 327240
12607C27240k11353j200J84848L4606J711J03785J0441J02238j9569q5151P8585
$$ 327240 115887 114687 299535 334141 335852 439637 450078 552316 532747 447596 526181
12596E26181J35086J24712k2892Q777K5659k2826j43650j65367k34218n2172K41091
$$ 526181 661267 785979 763087 771864 797523 774697 631047 465680 231462 179290 420381
12585D20381j7896j13094j12832P896K18876M5427o7431J25744K60672J10502
$$ 420381 402485 289391 176559 184455 403331 448758 381327 507071 767743 878245
12575H78245j72196R1226k5342j81207q7661l6448n3909J35670R2802J46950J68987
$$ 878245 706049 797275 771933 590726 503065 466617 412708 548378 641180 788130 957117
12564I57117o1878j59050J48244K19293j70235j00357R5408j76016j49398j35000
$$ 957117 895239 736189 884433 1103726 933491 833134 928542 752526 603128 468128
12554D68128k25015J07231K6704n4661J13470k0597p1219k09m1527J70710J40408
$$ 468128 243113 350344 377048 322387 435857 415260 344041 343832 302305 473015 613423
12543F13423n4145M6922K1736Q4291j67680j68823m2585p8024K00700Q7351J9331
$$ 613423 559278 606200 627936 712227 544547 375724 333139 255115 455815 543166 562497
12532E62497k6201P4693r8075J30J1845J45005k42130K2429Q6164J78371Q7880
$$ 562497 536296 610989 512914 513044 524889 669894 427764 450193 536357 714728 802608
12521H02608J25011k3348o7247J91925k10609m42599j91927N4833K09890L91571
$$ 802608 927619 904271 837024 1028949 818340 375741 183814 238647 448537 840108
12511H40108J09452j4729n4711j96523n2875J55178j24053o6727J50933J4303
$$ 840108 949560 934831 880120 683597 630722 785900 661847 595120 746053 760356
12501G60356R2442R7362M0998k22554j90663J40719l1405j43642J35862R0078
$$ 760356 852798 950160 991158 768604 577941 718660 687255 543613 679475 769553
12491G69553n4369p8655j145J00225q0857j53038j28986j39007J17672J88589
$$ 769553 715184 636529 635384 735609 654752 501714 372728 233721 351393 539982
12481E39982O2766Q2099j6324K3473J00534j1323j51155J04521k6351j24502J12638
$$ 539982 602748 684847 668523 691996 792530 781207 630052 734573 708222 583720 696358
12470F96358K19269j71781K4840l644r3515o6082p2650J08825K1207L7486P9406
$$ 696358 915627 743846 768686 765042 671527 605445 532795 641620 662827 700313 779719
12459G79719J06869K03089J37180M9670j99439k4700j81416J83919J90231l9735
$$ 779719 886588 1089677 1226857 1276527 1077088 1052388 870972 1054891 1245122 1205387
12449A205387p1473n5672Q0766l6903l8938n5017m3152j9239n2909J04891K47991
$$ 1205387 1133914 1078242 1159008 1122105 1083167 1028150 984998 965759 912850 1017741 1265732
12438A265732p925l11958J976l2731o1617L7871J69417K16782M9607k69148j09511
$$ 1265732 1257807 945849 947825 915094 853477 891348 1060765 1277547 1327154 1058006 948495
12427I48495J29680J17454n3447j78943j3712k502m340O3996J3852K474p240P5261
$$ 948495 1078175 1195629 1142182 963239 949527 947025 942685 1006681 1020533 1023007 1015767 1091028
12415A091028K2333k00241k00777q361J55368m5785k0608J74666L38126J49711
$$ 1091028 1113361 913120 712343 703982 859350 813565 792957 967623 1305749 1455460
12405A455460Q1645P8925j34563p6720j11737j91782j9679J20704j21361r696
$$ 1455460 1537105 1616030 1481467 1404747 1293010 1101228 1081549 1202253 1080892 1071196
12395A071196J84857N5982M5889J98055j30779q4750l7800j52419P5005k24944
$$ 1071196 1256053 1312035 1357924 1555979 1425200 1340450 1302650 1150231 1225236 1000292
12385A000292j85251L17175L6922j70477Q8910J3708J22022K19135m2957j89333
$$ 1000292 815041 1132216 1169138 998661 1087571 1101279 1223301 1442436 1399479 1210146
12375A210146j56693L6572L7579L9674n014m9370N9939M8614K18671M97p5126
$$ 1210146 1053453 1090025 1127604 1167278 1162264 1112894 1172833 1221447 1440118 1440615 1365489
12364A365489O0459j08754m606J00652P0373j60053l69854l2960K62899J89345
$$ 1365489 1425948 1317194 1312588 1413240 1483613 1323560 953706 920746 1183645 1372990
12354A372990M8763o1227K34954r9180l15128k51405O0389J62660j5991O672K571
$$ 1372990 1421753 1360526 1595480 1496300 1181172 929767 990156 1152816 1136825 1143497 1146068
12343A146068l40224J6604J97689J21997k9635K00812p3153j92667q1164J86110
$$ 1146068 805844 822448 1020137 1142134 1112499 1313311 1240158 1047491 966327 1152437
12333A152437K28905o8924p4922M7208O810O179P4003J16986p2208J43969Q3430
$$ 1152437 1381342 1312418 1237496 1284704 1291514 1297693 1371696 1488682 1416474 1560443 1643873
12322A643873j62701p6924j86196q8185O4888p238K2948J77253m4039r8533M1822
$$ 1643873 1481172 1404248 1218052 1129867 1194755 1187517 1210465 1387718 1343679 1245146 1286968
12311A286968j6834J0204m4435k80177j72473K16368J85800J87298N9097O9701
$$ 1286968 1270134 1280338 1235903 955726 783253 999621 1185421 1372719 1431816 1501517
12301A501517K0445q6419k8008q1671k14593K05998J8018J686K7657N8885o8176
$$ 1501517 1521962 1435543 1407535 1325864 1111271 1317269 1335287 1336973 1364630 1423515 1355339
12290A355339r8746N8776J55446L12975Q986k0004l0538n1757k84561q5681N6635
$$ 1355339 1256593 1315369 1470815 1783790 1792776 1772772 1742234 1690477 1405916 1320235 1376870
12279A376870J11596J02502l6703q3783j22522K26528j5971j58206j36462N9516
$$ 1376870 1488466 1590968 1554265 1470482 1347960 1574488 1558517 1400311 1263849 1323365
12269A323365K76617J29683j02402k068j59636K2108J15216j34835k37560k9566
$$ 1323365 1599982 1729665 1627263 1625195 1465559 1487667 1602883 1468048 1230488 1200922
12259A200922N5164N1778r9783L4723R6199K58080K65810R1027k50197o4281J40188
$$ 1200922 1256086 1307864 1208081 1242804 1339003 1597083 1862893 1953920 1703723 1639442 1779630
12248A779630M9315K7592J48534R0321k9296m1498j0461j68944k57287J00843
$$ 1779630 1828945 1856537 2005071 2095392 2066096 2024598 2014137 1845193 1587906 1688749
12238A688749J05761j85248P3879N9387N5035J41327O6844J13796Q3795R794k56714
$$ 1688749 1794510 1609262 1683141 1742528 1797563 1938890 2005734 2119530 2203325 2213119 1956405
12227A956405m3938L46838K90936L4284j13201k14183j40948k4307J50954k743
$$ 1956405 1912467 2259305 2550241 2584525 2471324 2257141 2116193 2091886 2242840 2240097
12217B240097J49015j69983p6766O1121L9673O8622l5242K4217J14431n0196Q8158
$$ 2240097 2389112 2219129 2142363 2203484 2243157 2311779 2276537 2300754 2415185 2364989 2453147
12206B453147R3722j37180p5178P8038O7736K40593R0839Q716r2546Q7855J46504
$$ 2453147 2546869 2409689 2334511 2412549 2480285 2720878 2811717 2820433 2727887 2815742 2962246
12195B962246M9148O8427K5733j10140K9928O5368o7124j23704o8372j55510N2504
$$ 2962246 3011394 3079821 3105554 2995414 3025342 3090710 3023586 2899882 2831510 2676000 2728504
12184B728504K79929K65181j17642k44636J3916j32382m728J23004K6588m4485
$$ 2728504 3008433 3273614 3155972 2911336 2925252 2792870 2788142 2911146 2937734 2893249
12174B893249J38436Q2140n8829q1046j63388j45793K52039J17086j5876m5165
$$ 2893249 3031685 3113825 3054996 2973950 2810562 2664769 2916808 3033894 3018018 2972853
12164B972853O2058J7567L649L20762Q2931n2785J29491j08060j55343k0951K40710
$$ 2972853 3034911 3052478 3056127 3376889 3459820 3407035 3536526 3428466 3273123 3252172 3492882
12153C492882L3880p7547l20903Q448Q2808J25197K28048K24747K8308o874O2133
$$ 3492882 3526762 3449215 3128312 3136760 3219568 3344765 3572813 3797560 3825868 3818994 3881127
12142C881127N6293J29269O7575J23480N7239m9239M9436M7762m597j99514j01153
$$ 3881127 3937420 4066689 4134264 4257744 4314983 4265744 4315180 4362942 4358345 4158831 4057678
12131D057678J16586J75939J92576k41914K14317J56750p9171R4170j4014L1996
$$ 4057678 4174264 4350203 4542779 4300865 4515182 4671932 4592761 4686931 4672917 4704913
12121D704913M5475R3784J8365j28557M0378K89239J06013j43962L4085r1688
$$ 4704913 4750388 4844172 4862537 4733980 4774358 5063597 5169610 5025648 5059733 4968045
12111D968045O8083K55308K42984R412K1044k30J11317Q2312J32882J10919L5706
$$ 4968045 5036128 5291436 5534420 5543832 5564876 5564646 5675963 5758275 5891157 6002076 6037782
12100F037782J82319J89022P8193P754J30072j13533N6125K23097J67133j7554
$$ 6037782 6220101 6409123 6487316 6495070 6625142 6511609 6567734 6790831 6957964 6940410
12090F940410O9841m3007j0763M8002J79070J41117J21137J74188k266K00381
$$ 6940410 7010251 6967244 6956481 7004483 7183553 7324670 7445807 7619995 7617729 7818110
12080G818110J42167j42622Q6707K68164M08967Q9188k2070R7620K81358L19084
$$ 7818110 7960277 7817655 7904362 8172526 8581493 8670681 8648611 8746231 9027589 9346673
12070I346673J18971J25056K67291L48560L09018P8502Q1200N04559L11436K5632
$$ 9346673 9465644 9590700 9857991 10206551 10515569 10594071 10675271 11179830 11491266 11516898
12060A1516898J31790J71308K84028J62826M55607L85253L38294N13106L38094
$$ 11516898 11648688 11819996 12104024 12266850 12722457 13107710 13446004 13959110 14297204
12051A4297204K65758K91266K88513K67425K79629M11626M91735K33582M78187
$$ 14297204 14562962 14854228 15142741 15410166 15689795 16101421 16593156 16826738 17304925
12042A7304925L90550M91886N62606P25676O04917N55998O72402P53275P25499
$$ 17304925 17695475 18187361 18749967 19475643 20080560 20636558 21308960 22062235 22787734
12033B2787734P29408Q99239J084056J070566Q96747O41989J110272J371063J366049
$$ 22787734 23517142 24416381 25500437 26571003 27467750 28109739 29220011 30591074 31957123
12024C1957123J494269J470608J332755J483577J453454J628417J624073J380850
$$ 31957123 33451392 34922000 36254755 37738332 39191786 40820203 42444276 43825126
12016D3825126J847695J874101J914673J996090J918405J985301J614547J691067
$$ 43825126 45672821 47546922 49461595 51457685 53376090 55361391 56975938 58667005
12008E8667005J834504K075947K132346K047463J908972J961423J838796J816846
$$ 58667005 60501509 62577456 64709802 66757265 68666237 70627660 72466456 74283302
12000G4283302J925150K119551K011220J949591J902457K126688J900229J678572
$$ 74283302 76208452 78328003 80339223 82288814 84191271 86317959 88218188 89896760
11992H9896760J590969J845655J551741J601742J752377J651821J093254J291462
$$ 89896760 91487729 93333384 94885125 96486867 98239244 99891065 100984319 102275781
11984A02275781J424397J199167J006262J280071J512275J553043J148307J396884
$$ 102275781 103700178 104899345 105905607 107185678 108697953 110250996 111399303 112796187
11976A12796187J565097J816859J826183K037428K075963K337868K512277K731914
$$ 112796187 114361284 116178143 118004326 120041754 122117717 124455585 126967862 129699776
11968A29699776K884674L071160L603164L647084L966396M217258M626889N178010
$$ 129699776 132584450 135655610 139258774 142905858 146872254 151089512 155716401 160894411
11960A60894411N607060O252007O577935P040676P584786Q250321Q945898R520730
$$ 160894411 166501471 172753478 179331413 186372089 193956875 202207196 211153094 220673824
11952B20673824J0158087J0948923J1674734J1859721J2326538J2668641J2799127
$$ 220673824 230831911 241780834 253455568 265315289 277641827 290310468 303109595
11945C03109595J2701148J3021548J2707115J1726897J0823803R684105Q373850
$$ 303109595 315810743 328832291 341539406 353266303 364090106 373774211 382148061
11938C82148061O384525M800305K911472M67072j409613l453707m939106o618700
$$ 382148061 388532586 393332891 396244363 396711435 395301822 391848115 386909009 380290309
11930C80290309q080418r164251r989760j0724629j0882380j1001386j1232175
$$ 380290309 372209891 363045640 353055880 342331251 331448871 320447485 309215310
11923C09215310j1323576j0735098j0196557j0158817r754905r049101q663595
$$ 309215310 297891734 287156636 276960079 266801262 257046357 247997256 239333661
11916B39333661q144977p925929p572910p169270o728468o636606o470620o178406
$$ 239333661 231188684 223262755 215689845 208520575 201792107 195155501 188684881 182506475
11908A82506475o019038n623896n363334n656823n260563n075563m836300m522342
$$ 182506475 176487437 170863541 165500207 159843384 154582821 149507258 144670958 140148616
11900A40148616m541884m381933m356513m281060m079792m014356l857865l833404
$$ 140148616 135606732 131224799 126868286 122587226 118507434 114493078 110635213 106801809
11892A06801809l919160l710390l514126l383417l272367l199768l217665l185506
$$ 106801809 102882649 99172259 95658133 92274716 89002349 85802581 82584916 79399410
11884G9399410l013550k931679k836445k842402k714861k349912k425185k304163
$$ 79399410 76385860 73454181 70617736 67775334 65060473 62710561 60285376 57981213
11876E7981213k282194k366929k436431k144570j757271j506538j678582j433430
$$ 57981213 55699019 53332090 50895659 48751089 46993818 45487280 43808698 42375268
11868D2375268j422597j397030j321587j344705j213202j203396r31145j023086
$$ 42375268 40952671 39555641 38234054 36889349 35676147 34472751 33541606 32518520
11860C2518520r67171o74085n88307p96704n57720o77611o53885o13440m57226
$$ 32518520 31551349 30877264 30288957 29492253 28934533 28256922 27603037 26989597 26532371
11851B6532371l91839n32789m89690m83439m39851m73106j25128j97910k77812
$$ 26532371 26140532 25607743 25118053 24634614 24194763 23721657 23596529 23398619 23120807
11842B3120807m38893l36907j72732k11422j64249k01001j07347q6294K5716l44986
$$ 23120807 22681914 22345007 22172275 21960853 21796604 21595603 21488256 21401962 21427678 21082692
11832B1082692k59360j34542j13952j96629J3045P0716L9934O8629j09499J5600
$$ 21082692 20823332 20688790 20574838 20378209 20391254 20461970 20501904 20570533 20461034 20476634
11822B0476634j02636P5202P4772J71376J32646n3929j43761j72308Q6416J00078
$$ 20476634 20373998 20449200 20523972 20695348 20827994 20774065 20630304 20457996 20544412 20644490
11812B0644490J0208J62310O4388j07414j10329j3787k0405Q6114K93165R0994
$$ 20644490 20654698 20817008 20881396 20773982 20663653 20649866 20629461 20715575 21008740 21099734
11802B1099734K0046r2223j93258N500j06092p6642m6935j56668q6328j03944
$$ 21099734 21119780 21027557 20834299 20839799 20733707 20657065 20610130 20453462 20367134 20263190
11792B0263190k38511l70559M1052k0555j37578J01611j18073j77196k76257j23411
$$ 20263190 20024679 19654120 19695172 19674617 19537039 19638650 19520577 19343381 19067124 18943713
11782A8943713k5242j0861j76548j92680n2506p8465k72076j10357J57224J16406
$$ 18943713 18918471 18907610 18731062 18538382 18485876 18407411 18135335 18024978 18182202 18298608
11772A8298608O1809n6604m9448l02275j22766K06809m7493j75741j39338Q7924
$$ 18298608 18360417 18303813 18254365 17952090 17829324 18036133 17988640 17812899 17673561 17761485
11762A7761485J1279M099Q8950K19803J05590m9258P7206O3767k23972k78042
$$ 17761485 17772764 17776863 17865813 18085616 18191206 18141948 18219154 18282921 18058949 17780907
11752A7780907Q0499J14201J94184P7217J56019J08098J92771O3052J5476r0515
$$ 17780907 17861406 17975607 18169791 18247008 18403027 18511125 18703896 18766948 18782424 18691909
11742A8691909k01643P6822K74244O7936R4846K05194J56296L01942m0997J3892
$$ 18691909 18490266 18567088 18841332 18909268 19004114 19209308 19365604 19667546 19626549 19640441
11732A9640441M29605K18080M6045J81840k60465j38194R6894k67748m8564M0501
$$ 19640441 20070046 20288126 20334171 20516011 20255546 20117352 20214246 19946498 19897934 19938435
11722A9938435j13747m9283Q4923K4199K01933j21368j57666l18248k05554k58119
$$ 19938435 19824688 19775405 19860328 19884527 20086460 19965092 19807426 19489178 19283624 19025505
11712A9025505j37901j50758m1810k43530m59284l29933o8997l25299m11580k69715
$$ 19025505 18887604 18736846 18695036 18451506 17992222 17662289 17593292 17267993 16856413 16586698
11702A6586698j85938l20845k01373J32897k26627m11449m12945j58519k01202
$$ 16586698 16400760 16079915 15878542 16011439 15784812 15373363 14960418 14801899 14600697
11693A4600697l19041k39883m64720l05652l63981j52009l28990m05392r8983
$$ 14600697 14281656 14041773 13577053 13271401 12907420 12755411 12426421 12021029 11922046
11684A1922046j56843l48279n58649l36564k13486j96011j48425j80703k66145
$$ 11922046 11765203 11416924 10858275 10521711 10308225 10112214 9963789 9783086 9516941
11675I516941k74323j77269r814j91349l68724m97132l29319o7876j72931j25751
$$ 9516941 9242618 9065349 9055535 8864186 8495462 7998330 7669011 7601135 7428204 7302453
11665G302453k55968j04708O2190k1393l12377q7478j45747j83592j72933j53051
$$ 7302453 7046485 6941777 7003967 6982574 6670197 6582719 6436972 6253380 6080447 5927396
11655E927396J3147n5637j20810k69180j03482r655L7571p8910r9330l47842k3487
$$ 5927396 5940543 5884906 5764096 5494916 5391434 5381779 5419350 5340440 5241110 4893268 4869781
11644D869781J09756Q530q0534j54347j67932k7391l1224r6929p2105Q8213j17453
$$ 4869781 4979537 4988067 4907533 4753186 4585254 4557863 4526639 4429710 4357605 4445818 4328365
11633D328365k39390R0094J92024j39964n7283J889m9604j80906j07288m0276
$$ 4328365 4088975 4179069 4371093 4231129 4173846 4175735 4126131 3945225 3837937 3797661
11623C797661l2093p2503L7080j36570j98259O8097J16693q4713P830q0485j24931
$$ 3797661 3765568 3693065 3730145 3593575 3395316 3463413 3580106 3495393 3503223 3422738 3297807
11612C297807J06473J3590k07476l44633j27138M9193M08019P9084m5913m4871
$$ 3297807 3404280 3417870 3210394 2865761 2738623 2787816 3195835 3274919 3229006 3184135
11602C184135k57383k07208J00114P4867j18850k13660r839P3590o18n0060K52033
$$ 3184135 2926752 2719544 2819658 2894525 2775675 2562015 2552176 2625766 2625148 2575088 2827121
11591B827121o7495L3781n7814k16103Q4321J14874M5724k236k0182J91005k30976
$$ 2827121 2759626 2793407 2735593 2519490 2603811 2718685 2764409 2762173 2741991 2932996 2702020
11580B702020l16065M2645R0528K66501O3545j83697R1749O2087p4355K02109
$$ 2702020 2385955 2428600 2519128 2785629 2849174 2665477 2757226 2819313 2744958 2947067
11570B947067p5704j55035j9350P5044j59329j50189L3592J13509R7759j64415
$$ 2947067 2871363 2716328 2696978 2772022 2612693 2462504 2496096 2609605 2707364 2542949
11560B542949j07270Q4428m921L1574j07097j09335N3145J26984J31000k9820
$$ 2542949 2435679 2520107 2515186 2546760 2439663 2330328 2383473 2510457 2641457 2611637
11550B611637k51795K7227L0379J14149l3935J54801J32372k23485j07202j45885
$$ 2611637 2359842 2387069 2417448 2531597 2497662 2652463 2784835 2561350 2454148 2308263
11540B308263j1628K14797r1346j08786K78779K22914j30207l203j23903M6606
$$ 2308263 2296635 2511432 2420086 2311300 2590079 2812993 2682786 2679583 2555680 2602286
11530B602286j28722R4608K77912j30683k78148k28055p5586K58603L69431p9673
$$ 2602286 2473564 2568172 2846084 2715401 2437253 2209198 2133612 2392215 2761646 2681973
11520B681973O2804m4719j68288o7126q9811m0080J34501J98568p8044j98453
$$ 2681973 2744777 2700058 2531770 2464644 2374833 2334753 2469254 2667822 2589778 2391325
11510B391325k5829J04009n6875r2204R6850K19000R9449j81311j13612j1839
$$ 2391325 2365496 2469505 2412630 2320426 2417276 2636276 2735725 2554414 2440802 2428963
11500B428963j71398p7547J66573J58968j41742r1401p869J19592J78196j24068
$$ 2428963 2257565 2180018 2346591 2505559 2363817 2272416 2264547 2384139 2562335 2438267
11490B438267K0106M3546j28842j9537j05087J26506p8555M368K03907p1394L13
$$ 2438267 2458373 2501919 2373077 2353540 2248453 2374959 2296404 2300772 2504679 2433285 2433598
11479B433598P5687k3378r9452j28195J06392Q2893J45368O05L5135j00288l675
$$ 2433598 2509285 2485907 2386455 2258260 2364652 2447545 2592913 2593518 2628653 2528365 2524690
11468B524690j00096j34747Q7842J2189Q1530Q9995q4376J0180N4j19610j77767
$$ 2524690 2424594 2289847 2377689 2389878 2471408 2561403 2477027 2487207 2487261 2367651 2189884
11457B189884p2472N7439K38075K85420r8229p2445J41682J17779m9619M4260
$$ 2189884 2117412 2174851 2412926 2698346 2600117 2527672 2669354 2787133 2737514 2781774
11447B781774P0890j96456j73059R7438L32300J79645j11665k97601n7168R1563
$$ 2781774 2852664 2656208 2483149 2580587 2912887 3092532 2980867 2683266 2626098 2717661
11437B717661K17506R398p8792P1787l8189m1998J16443J74227l1505l4750O4826
$$ 2717661 2935167 2944565 2865773 2937560 2899371 2857373 2973816 3148043 3116538 3081788 3146614
11426C146614K2398k59116p9618J14810Q1115P3543O1286j2826k32492k7735O8115
$$ 3146614 3169012 2909896 2830278 2945088 3026203 3099746 3161032 3148206 2915714 2887979 2956094
11415B956094o1560P3445J14293r95J9256J5142R0141J06456J194q9435J11325
$$ 2956094 2894534 2967979 3082272 3081277 3100533 3115675 3205816 3312272 3313466 3224031 3335356
11404C335356M05603K2223M6264N9907o6725J99388N6069p817k16364r8481J59518
$$ 3335356 3740959 3763182 3809446 3869353 3802628 4002016 4058085 4050268 3833904 3735423 3894941
11393C894941K56158K58162p0415l2752k75499k3850l2138K22956J96992J18392
$$ 3894941 4151099 4409261 4338846 4306094 4030595 4006745 3974607 4197563 4394555 4512947
11383D512947J38555J11556J68764J28556K68712L6213l9138Q8771j46619l4256
$$ 4512947 4651502 4763058 4931822 5060378 5329090 5365303 5326165 5414936 5268317 5234061
11373E234061J17692K87040M14987K01518J22939J37359K58044O7349L12144P7028
$$ 5234061 5351753 5638793 6053780 6255298 6378237 6515596 6773640 6840989 7153133 7230161
11363G230161P295J77082Q2140L19526K07849K93215N61639M98783K58174K16785
$$ 7230161 7237456 7414538 7496678 7816204 8024053 8317268 8878907 9377690 9635864 9852649
11353I852649M88404L62473J80339L67803M63546J60641K90403O10472L56712
$$ 9852649 10341053 10703526 10883865 11251668 11715214 11875855 12166258 12776730 13133442
11344A3133442L70540N39356O47633K16808M08352O61485O70929O27823O54750
$$ 13133442 13503982 14043338 14690971 14907779 15316131 15977616 16648545 17276368 17931118
11335A7931118M66094K82284M37114M77302N15394O54221L89267M49034O56247
$$ 17931118 18397212 18679496 19116610 19593912 20109306 20763527 21152794 21601828 22258075
11326B2258075M15594N23116N45631K58829M01893N38826N93192M39974N15453
$$ 22258075 22673669 23196785 23742416 24001245 24403138 24941964 25535156 25975130 26490583
11317B6490583L95071M66078J20263J4793J75966M68122N04161K28705K46089
$$ 26490583 26885654 27351732 27471995 27486788 27662754 28130876 28635037 28863742 29109831
11308B9109831K56467K50374J71451J20975L06898L22825K40995K70159L79544
$$ 29109831 29366298 29616672 29788123 29909098 30215996 30538821 30779816 31049975 31429519
11299C1429519K09772n1081L0111J84823J31605J3122K85152K00193J69414R9690
$$ 31429519 31639291 31588210 31618321 31803144 31934749 31947871 32233023 32433216 32602630 32702320
11289C2702320L07179M88842K94841J84036N82492M80240O39667N15072N16059
$$ 32702320 33009499 33498341 33793182 33977218 34559710 35039950 35679617 36194689 36710748
11280C6710748N06855N02816P46155M49309O85141P73284N94616O84600O78392
$$ 36710748 37217603 37720419 38466574 38915883 39601024 40374308 40968924 41653524 42331916
11271D2331916P42343O68862O54217O59869O12331P74141R28535M41601N52751
$$ 42331916 43074259 43743121 44397338 45057207 45669538 46443679 47372214 47813815 48366566
11262D8366566Q80325Q28483O29821N87032N57818P02984Q67788R28069O26029
$$ 48366566 49246891 50075374 50705195 51292227 51850045 52553029 53420817 54348886 54974915
11253E4974915O47824M59259L89806L26339K75457K51529K18324j8601K01340
$$ 54974915 55622739 56081998 56471804 56798143 57073600 57325129 57543453 57524852 57726192
11244E7726192J92259n3301o6896k06p1328o1262m58657k35873k35837r8062k11813
$$ 57726192 57918451 57865150 57798254 57798048 57726720 57665458 57206801 56970928 56735091 56637029 56425216
11233E6425216j64588k3778n2615n47399n76472k91088k74294l32773j73776l19725
$$ 56425216 56260628 56236850 56184235 55636836 55060364 54769276 54494982 54162209 53988433 53668708
11223E3668708l63374j71615k20714j49200l44517n00422l65377m45290j88514
$$ 53668708 53305334 53133719 52913005 52763805 52419288 51918866 51553489 51108199 50919685
11214E0919685j87747k94999n0551K948K35576P367k3047J0267l9166j88751J79674
$$ 50919685 50731938 50436939 50386388 50389336 50624912 50632279 50609232 50619499 50580333 50391582 50571256
11203E0571256M66799L26991L22060L70083K74237M62441P36765M00152J71919
$$ 50571256 51038055 51365046 51687106 52057189 52331426 52793867 53530632 53930784 54102703
11194E4102703K06081K92874N29965M29091M30368K68845k3289K1656j22516j1909
$$ 54102703 54308784 54601658 55131623 55560714 55991082 56259927 56236638 56258294 56135778 56123869
11184E6123869K5631L63234J30928j97306k61958j96731q0466n2998j93877k34598
$$ 56123869 56149500 56512734 56643662 56446356 56184398 55987667 55907201 55854203 55660326 55425728
11174E5425728j43066k03968k02761m20099l80838l64492l84042l89418p83094
$$ 55425728 55282662 55078694 54875933 54455834 54074996 53710504 53326462 52937044 52153950
11165E2153950j176129j033651q98191n89704o90380j014606p62129q63516q45575
$$ 52153950 50977821 49944170 49045979 48456275 47765895 46751289 45989160 45125644 44280069
11156D4280069q93842j055142j061675j040108r82719q09463p59875q49050q62257
$$ 44280069 43386227 42331085 41269410 40229302 39246583 38437120 37677245 36828195 35965938
11147C5965938o71098o66559p46591q27281o01124l96315n38329o51838p59641
$$ 35965938 35294840 34628281 33881690 33054409 32453285 32056970 31518641 30866803 30107162
11138C0107162m56441m50869m51503l10350k34927m58962n80394l81221k09543
$$ 30107162 29650721 29199852 28748349 28437999 28203072 27744110 27163716 26782495 26572952
11129B6572952j10606m58566l32970l15274j91447N712p5687R7509K3810J40449
$$ 26572952 26462346 26003780 25670810 25355536 25164089 25169801 25094114 25191623 25215433 25355882
11119B5355882J10702J9947o0581Q294J2989m0714j82188k50730J09625j05288
$$ 25355882 25466584 25486531 25425950 25434244 25447233 25406519 25224331 24973601 25083226 24977938
11109B4977938l55240k17678p7810m0611j28416j98051k31938k31312l79905j74587
$$ 24977938 24622698 24405020 24327210 24286599 24158183 23960132 23728194 23496882 23116977 22942390
11099B2942390k78665n51374l92196j24053k92181n64795n00090l35087r5385
$$ 22942390 22663725 22112351 21720155 21596102 21303921 20739126 20239036 19903949 19808564
11090A9808564k26735o91939m19086m47539m10586k41615m27224n72085o84254
$$ 19808564 19581829 18889890 18470804 18023265 17612679 17371064 16943840 16371755 15687501
11081A5687501n10900m55901n04226l38068m94752m74088m74653j69542k51394
$$ 15687501 15176601 14720700 14216474 13878406 13383654 12909566 12434913 12265371 12013977
11072A2013977k75705m00894k34249q8504l67564m48290n273j91941k71218k14749
$$ 12013977 11738272 11337378 11103129 11014625 10647061 10198771 10193498 10001557 9730339 9515590
11062I515590r0609k87749R5605J3732j11279o8118J35094j6035j41032j12789
$$ 9515590 9424981 9137232 9232837 9246569 9135290 9067172 9202266 9186231 9045199 8932410
11052H932410K6677K0729J7395m8293R9502K97541J11139K80071K08729J51984
$$ 8932410 8959087 8979816 8997211 8948918 9048420 9345961 9457100 9737171 9945900 10097884
11042A0097884j24682P2886L7965N51566K58316R5186N6193J58997L56673O00136
$$ 10097884 9973202 10046088 10084053 10635619 10893935 10989121 11045314 11204311 11560984 12161120
11032A2161120L75934n5631l86499j78265J08146J50494J41039J89376J4108O8301
$$ 12161120 12537054 12481423 12094924 11916659 12024805 12175299 12316338 12505714 12519822 12588123
11022A2588123K76561M73295L18617j08166k41338j67262j03849p3456N8756R9563
$$ 12588123 12864684 13337979 13656596 13548430 13307092 13139830 13035981 12962525 13021281 13120844
11012A3120844L09245L34865L06338K47998K4634l9638O2923R9001l361k3970
$$ 13120844 13430089 13764954 14071292 14319290 14343924 14304286 14367209 14466210 14462849 14438879
11002A4438879j28147r5758j28245q4565j64150k11441j01546L6784l06606l44584
$$ 14438879 14310732 14214974 14086729 14002164 13838014 13626573 13525027 13561811 13255205 12910621
10992A2910621n8255n6615j28343k80115j19640l17179k42442L4681N0924p8878
$$ 12910621 12852366 12795751 12667408 12387293 12267653 11950474 11708032 11742713 11793637 11714759
10982A1714759j72833j1268j44891q7977l20100N1089R1998n7387j42046m307
$$ 11714759 11541926 11530658 11385767 11297790 10977690 11028779 11120777 11063390 10921344 10917037
10972A0917037J71846m020N7459l38356m88759j75832j52539m02611l22623j42016
$$ 10917037 11088883 11084863 11142322 10803966 10315207 10139375 9986836 9584225 9261602 9119586
10962I119586j10238j87302l72193k28254k96263k00973j59175k91332p0696j82320
$$ 9119586 9009348 8822046 8449853 8221599 7925336 7724363 7565188 7273856 7203160 7020840
10952G020840k16522Q5957j41844l27593k43152j28162k75987j83454k9496p0283
$$ 7020840 6804318 6890275 6748431 6420838 6177686 6049524 5773537 5590083 5560587 5490304
10942E490304P2461P7237r2907l22207m59967m6949j39185k78668j43344n9545
$$ 5490304 5562765 5640002 5547095 5224888 4764921 4717972 4578787 4300119 4156775 4097230
10932D097230L1757j7150j23197k90642k88268j32235j11617O014J18473l0802
$$ 4097230 4128987 4111837 3988640 3697998 3409730 3277495 3165878 3171892 3290365 3259563
10922C259563k36890m05330J2477m4106n7509o1278o8988J15252m5728j50002
$$ 3259563 3022673 2617343 2629820 2585714 2528205 2466927 2397939 2513191 2467463 2317461
10912B317461q6948l576J19908J16385k29375k51688j89490k9647q8543j3481
$$ 2317461 2230513 2226937 2346845 2463230 2233855 1982167 1792677 1763030 1674487 1661006
10902A661006Q8144J00613J57364J87375O0721j05198j74411r5014K42622P1759
$$ 1661006 1749150 1849763 2007127 2194502 2255223 2150025 1975614 1880600 2123222 2194981
10892B194981j74744k09121n4484m0186j9342m3802J25216J12595R2568n3741
$$ 2194981 2020237 1811116 1756632 1716446 1697104 1653302 1778518 1891113 1983681 1929940
10882A929940j25602q6316l231J40131J38874j7316p0187k51712m0368K3158J2304
$$ 1929940 1804338 1718022 1714791 1854922 1993796 1976480 1906293 1654581 1614213 1637371 1649675
10871A649675p3069J9047J47656K09734l7999l10427j20598j04029P4550R2735
$$ 1649675 1576606 1595653 1743309 1953043 1915044 1604617 1484019 1379990 1454540 1547275
10861A547275j67941k35341J66649L8201J19953L22062O2566j51363q7286Q1688
$$ 1547275 1379334 1143993 1310642 1348843 1468796 1790858 1853424 1702061 1614775 1696463
10851A696463k61552k59326L7690K0512j34666J53892L47514J1392l1555o4862
$$ 1696463 1434911 1175585 1213275 1233787 1099121 1253013 1600527 1611919 1580364 1515502
10841A515502N166m9014Q9879J5801k4830m2770j4452j29525L2343K27090K47584
$$ 1515502 1520668 1471654 1561533 1577334 1552504 1509734 1495282 1365757 1398100 1625190 1872774
10830A872774Q9506k11794k14875j16825o3087j71371L751K5008L1691o7261j05278
$$ 1872774 1962280 1750486 1535611 1418786 1355699 1184328 1188079 1213087 1244778 1177517 1072239
10819A072239J20730J54527j7296j23856j67211J2778j2005L29369L03539K4194
$$ 1072239 1192969 1347496 1330200 1206344 1039133 1051911 1039906 1369275 1672814 1697008
10809A697008J3964p8747J24973k0763k11695j32786j46807j07343K313J21905
$$ 1697008 1710972 1632225 1757198 1736435 1524740 1391954 1245147 1137804 1140117 1262022
10799A262022J38383Q2644p3246p1655j13932J26930J99260j02430m4700m6048
$$ 1262022 1400405 1483049 1409803 1338148 1224216 1351146 1550406 1447976 1403276 1357228
10789A357228N8735J81079j00311j97240j19253J84506j04377J9735J64682K03296
$$ 1357228 1415963 1597042 1496731 1299491 1180238 1364744 1260367 1280102 1444784 1648080
10779A648080L9129j40938j60379j58744K80174R5328k0181l7703K0640o2369
$$ 1648080 1687209 1546271 1385892 1227148 1507322 1602650 1582469 1544766 1565406 1503037
10769A503037J2062Q3740n4318j71746Q048K3392p7256j843N6388m3461j41606
$$ 1503037 1515099 1598839 1544521 1372775 1380823 1404215 1326959 1325116 1381504 1338043 1196437
10758A196437m1925K3759J74489Q4553J2410k65578q246J10470N7286j07190Q2512
$$ 1196437 1154512 1178271 1352760 1437313 1449723 1184145 1175899 1286369 1343655 1236465 1318977
10747A318977j77127j48558K4646K9501Q5045J64757R8760J53153P0690k51831
$$ 1318977 1141850 993292 1017938 1047439 1132484 1297241 1396001 1549154 1619844 1368013
10737A368013j54291K25533q9400j35256j39494J15810J44480k0295j5366K92960
$$ 1368013 1213722 1439255 1349855 1214599 1075105 1190915 1335395 1315100 1299734 1592694
10727A592694N04268P7962m3656o1692j81107k44201j31515R1365R8805J7516
$$ 1592694 2096962 2174924 2131268 2069576 1888469 1644268 1512753 1604118 1702923 1720439
10717A720439J35613M6503n3028L1925p5831j16753M0468k2742J23150L52377
$$ 1720439 1856052 1902555 1849527 1881452 1805621 1688868 1729336 1706594 1829744 2182121
10707B182121J5211j56857o0938j7091j0883J26902J49065K31964r7766j44394
$$ 2182121 2197332 2040475 1979537 1962446 1951563 2078465 2227530 2459494 2361728 2217334
10697B217334j62028j54135J7468J5727O9843J50547k14590k84014n9713P9474
$$ 2217334 2055306 1901171 1918639 1934366 2004209 2154756 1940166 1656152 1596439 1675913
10687A675913L30101K38627n7836L8989P2065L6420l4299m3137o307n1873J64774
$$ 1675913 2006014 2244641 2186805 2225794 2297859 2334279 2299980 2256843 2250536 2198663 2363437
10676B363437O8328k1340n9282l230K47313J10563j10180o6845J09756J41800
$$ 2363437 2431765 2410425 2351143 2347913 2595226 2705789 2595609 2528764 2638520 2780320
10666B780320K2539K39257K16127K53147M03079K11442J05430J26905K96257J59733
$$ 2780320 2802859 3042116 3258243 3511390 3914469 4125911 4231341 4358246 4654503 4814236
10656D814236P8834J58641K99192L96332L75708N18056M51624L45206M17616N19285
$$ 4814236 4893070 5051711 5350903 5747235 6122943 6640999 7092623 7437829 7855445 8374730
10646H374730L90071M96604N20218M48749M61626N61903N91723M62951L06529
$$ 8374730 8764801 9261405 9781623 10230372 10691998 11253901 11845624 12308575 12615104
10637A2615104K03910M29365M93978M25522M58330L34748P75404R88992Q86525
$$ 12615104 12819014 13248379 13742357 14167879 14626209 14960957 15736361 16725353 17611878
10628A7611878J022690J138636J006515J397439J931071K440618L549561M138496
$$ 17611878 18634568 19773204 20779719 22177158 24108229 26548847 30098408 34236904
10620C4236904N633077P650272R855169J2518684J5252132J5892505J2690115
$$ 34236904 39869981 47520253 57375422 69894106 85146238 101038743 113728858
10613A13728858N930062j255185n783779n771523k549617K090319Q131210J5185410
$$ 113728858 119658920 118403735 112619956 106848433 104298816 106389135 114520345 129705755
10605A29705755K2402603K8980422L0587920K2753860N169085j3212016k1933779
$$ 129705755 152108358 181088780 211676700 234430560 239599645 226387629 204453850
10598B04453850j9880662j2038641j860899Q776979J9730373L0534577L8307836
$$ 204453850 184573188 172534547 170673648 179450627 199181000 229715577 268023413
10591B68023413L7422559K2554506m490759l0464902m1745773l7260756k6032512
$$ 268023413 305445972 328000478 323509719 293044817 251299044 214038288 188005776
10584A88005776j4058818l077876O543288J5051538K0525684J8663475P364751
$$ 188005776 173946958 170869082 177412370 192463908 212989592 231653067 239017818
10577B39017818j1188360k7268175l2511215k7652187j9178882j1010937m488358
$$ 239017818 227829458 200561283 168050068 140397881 121218999 110208062 105719704
10570A05719704N40293M461752O565957M853513k07996p618854j3650304j5630844
$$ 105719704 106259997 110721749 117287706 122141219 121933223 114314369 100664065 85033221
10562H5033221j3740884j0553583p825815n679554m395898l566616k461906j603130
$$ 85033221 71292337 60738754 52912939 47233385 42837487 39270871 36808965 35205835
10554C5205835j278756j206066j006335n30759o5875Q4226M26901P30477J205666
$$ 35205835 33927079 32721013 31714678 31183919 31118044 31202270 31629171 32359648 33565314
10545C3565314J127801J169762J410191J167200J070013P55105M39515J50169
$$ 33565314 34693115 35862877 37273068 38440268 39510281 40265386 40704901 40855070
10537D0855070n0094m79234q53984j258263j458976j550929j305246j485513j190005
$$ 40855070 40804976 40325742 39471758 38213495 36754519 35203590 33898344 32412831 31222826
10528C1222826j196433j367019q68055n26006m89618o20367m44497r3523J9311
$$ 31222826 30026393 28659374 27791319 27265313 26775695 26155328 25710831 25617308 25636619
10519B5636619m9271J49219K7850o8272j37192j95404k13139m70190m25151o41632
$$ 25636619 25587348 25736567 25764417 25696145 25558953 25363549 25150410 24680220 24255069 23613437
10509B3613437p20585r93346j093970q60287o27666p60947j015059p82967o14335
$$ 23613437 22892852 21899506 20805536 19945249 19317583 18556636 17541577 16758610 16144275
10500A6144275l93800k90264m08495J71739J09113J31327m4088K9852L17509M93510
$$ 16144275 15750475 15460211 15051716 15223455 15332568 15463895 15419807 15449659 15767168 16260678
10490A6260678N00214L88181L58637J36080K65977J60733o4666j25216r9647k96265
$$ 16260678 16760892 17149073 17507710 17643790 17909767 18070500 18005834 17880618 17780971 17484706
10480A7484706l58909l09591k7365k06334q8152k9057J38036K79725M71304O24725
$$ 17484706 17125797 16816206 16788841 16582507 16494355 16465298 16603334 16883059 17354363 17979088
10470A7979088N70019O19450N01715O89006P51638P22892N84107M79761N76332
$$ 17979088 18549107 19168557 19670272 20359278 21110916 21833808 22417915 22897676 23474008
10461B3474008K49834q7339l82921p21224r12544r40824p34845p83515q09680
$$ 23474008 23723842 23636503 23253582 22532358 21619814 20678990 19944145 19160630 18350950
10452A8350950r88805p93584n78589n71273o41514m5035j54754m45427k14000
$$ 18350950 17362145 16568561 15989972 15418699 14777185 14732150 14577396 14131969 13917969
10443A3917969l7022P1250j19146L1492j18371j57118k53321l59821n56676l06408
$$ 13917969 13880947 13952197 13833051 13864543 13746172 13589054 13335733 12975912 12419236 12112828
10433A2112828l78728p54843p09964m57811m42874l28709n08277n58460o09031
$$ 12112828 11734100 10979257 10269293 9811482 9368608 9039899 8531622 7973162 7364131
10424G364131n57618m34585n02546m65628l32204k94510l97381k34185l45926
$$ 7364131 6806513 6371928 5869382 5403754 5071550 4777040 4379659 4145474 3799548
10415C799548l41019j30690j53602k91521j94491o0851M0447k35538m0624K5853
$$ 3799548 3458529 3327839 3174237 2882716 2688225 2627374 2667821 2432283 2391659 2417512
10405B417512k50546r4776j58514j50899j97908m0880J2446j51769j05738J01438
$$ 2417512 2166966 2072190 1913676 1762777 1564869 1523989 1536435 1384666 1278928 1380366
10395A380366k2168j23601m412J05446j2479j40531J60501k7005p392R0194m1361
$$ 1380366 1358198 1234597 1230185 1335631 1323152 1182621 1343122 1316117 1308725 1398919 1357558
10384A357558K104j15255j11663p1425q9120j4405j5541k05882k44425J8925m8169
$$ 1357558 1359662 1244407 1132744 1061319 972199 957794 942253 736371 491946 510871 462702
10373D62702J32945K23956R3557r69j02696O3211r5279j09818M2524k3930o04
$$ 462702 595647 819603 913160 912191 809495 872706 777427 667609 710133 686203 685599
10362F85599j43750q1685J18996M3816L31729K39014P1923k5198p9534k6313J6884
$$ 685599 541849 460164 579160 622976 954705 1193719 1265642 1240444 1160910 1134597 1151481
10351A151481K4542j33807J75317J6726J5853r212r6150p8829l2198l9042K3297
$$ 1151481 1176023 1042216 1217533 1234259 1250112 1240900 1144750 1065921 1033723 994681 1017978
10340A017978j64717m65261m9680L51119Q3868j99916J9806K07025K65283L1093
$$ 1017978 853261 388000 338320 689439 773307 573391 593197 800222 1065505 1096598
10330A096598r1426l6456J04490J04354j48214Q4509M3675j8670J04749Q8802
$$ 1096598 1005172 968716 1073206 1177560 1029346 1113855 1157530 1138860 1243609 1332411
10320A332411j77973O6612M5782j61655J8348p1803j20448O1144J33061J3758
$$ 1332411 1154438 1221050 1266832 1105177 1123525 1051722 931274 992418 1125479 1139237
10310A139237J89689p459L7135j16146k31426P106L6M4687j07038q3702m4074
$$ 1139237 1328926 1321467 1358602 1242456 1011030 1018136 1018172 1062859 955821 872119 828045
10299H28045J1531P713J44388L4676j59905j00876j3168K016j58796J88535l9853
$$ 828045 839576 847289 991677 1026353 866448 765572 752404 754420 595624 784159 744306
10288G44306J3065k31850k43198P8964M64753K88865k2360j84836q609n6587k9079
$$ 744306 757371 525521 282323 361287 826040 1114905 1092545 907709 899100 842513 813434
10277H13434Q6053M9137o2349j87093L0802R5142J22243Q1635j75119q877m8044
$$ 813434 899487 948624 886275 699182 729984 825126 947369 1029004 853885 845008 796964
10266G96964L3075K5680J40780j74460k08040L1142K56898k7878N137m3690P9924
$$ 796964 830039 855719 996499 822039 613999 645141 902039 874161 879298 835608 915532
10255I15532j71581j86432O5218J69203K35062J69264J02992j9853q8807j95656
$$ 915532 743951 557519 622737 791940 1027002 1196266 1299258 1279405 1190598 994942
10245I94942k29791O3652J26926N9719O3258J06922N6744r1796j94361r210J92069
$$ 994942 765151 828803 955729 1015448 1078706 1185628 1242372 1150576 956215 947005 1139074
10234A139074o0879j37976J8635J22624O1364l3297N3433j87837l1037N7469L9997
$$ 1139074 1078195 940219 958854 1081478 1142842 1109545 1162978 975141 944104 1001573 1041570
10223A041570N0718k8535j54113J9372J73948J04110m4093O1898k18785j78366
$$ 1041570 1092288 1063753 909640 929012 1102960 1207070 1162977 1224875 1006090 827724
10213H27724K9959J68659q0672J6205J52097J27708P4567k40976k47365K6k2552
$$ 827724 857683 1026342 945670 961875 1113972 1241680 1316247 1075271 827906 827932 805380
10202H05380q3974l9853o843O1090k5590l9288O8377j07767n5095J98456q9654
$$ 805380 721406 681553 674710 735800 710210 670922 739299 631532 576437 774893 685239
10191F85239J5559J10079P9955k64517O5912J67799l1052R4293k06294j69115
$$ 685239 700798 810877 890832 626315 692227 860026 828974 923267 716973 547858
10181E47858K83138K89116n192J64492n7577K64676J81257k33741j27612j93924
$$ 547858 830996 1120112 1114920 1279412 1221835 1486511 1667768 1434027 1306415 1112491
10171A112491J73671K11505N8554L9403K71215J01282l76j22474k8502r753J03284
$$ 1112491 1286162 1497667 1556221 1595624 1866839 1968121 1967745 1845271 1816769 1807016 1910300
10160A910300j47393j18154K75370L32144K91617K97097j00878J24334j39297
$$ 1910300 1762907 1644753 1920123 2252267 2543884 2840981 2740103 2864437 2725140
10151B725140j69198l99960l31614j21525J61793q6905N5813K375Q8598J16577
$$ 2725140 2555942 2155982 1824368 1702843 1864636 1777731 1833544 1835919 1924517 2041094
10141B041094K91046M9479j33379j60568m2727l63284o3404K71536J23741j59411
$$ 2041094 2332140 2381619 2248240 2087672 2044945 1681661 1618257 1889793 2013534 1854123
10131A854123j99938n4565k99357j24316j50666k3765J53508J41309J04949r6761
$$ 1854123 1654185 1599620 1300263 1175947 1025281 1001516 1155024 1296333 1401282 1304521
10121A304521N0247j4502q2609J47620J08435j97310k08811J57493j68668o287
$$ 1304521 1354768 1340266 1257657 1405277 1513712 1316402 1107591 1265084 1096416 1090129
10111A090129P2724l2165p0899J83968J72140M7638k5422P0446m5969R6303L492
$$ 1090129 1162853 1130688 1059789 1243757 1415897 1463535 1438113 1508559 1462590 1558893 1562385
10100A562385o3680p9776J4026J02475r7529j27778j25542J84233K34718q0607
$$ 1562385 1498705 1418929 1432955 1535430 1437901 1310123 1184581 1368814 1603532 1522925
10090A522925j68404m2401Q6055P1244M1627o2608j41192j79160Q764J70461J28898
$$ 1522925 1354521 1312120 1398175 1469419 1511046 1448438 1307246 1128086 1136850 1307311 1436209
10079A436209K65374Q755J33520J38951O4055j58432n123m2261j19482k8971K25189
$$ 1436209 1701583 1710338 1843858 1982809 2046864 1888432 1883309 1841048 1721566 1692595 1917784
10068A917784L955q0581j05093J4542L11654j04780k43734L0035K05104J90950
$$ 1917784 1921739 1841158 1736065 1750607 2062261 1957481 1713747 1743782 1948886 2139836
10058B139836J24134N4220l3302k08506J60707J03010j2361k3829M7936J04736
$$ 2139836 2263970 2318190 2284888 2076382 2237089 2340099 2327738 2303909 2351845 2456581
10048B456581K04277K24565J47212m7026n1971m3585O9073K56118r0881j13417
$$ 2456581 2660858 2885423 3032635 2985609 2933638 2890053 2959126 3215244 3124363 3010946
10038C010946K56085L72073m4188N7385N3222j18419J08973K01248J30416J36616
$$ 3010946 3267031 3639104 3594916 3652301 3705523 3587104 3696077 3897325 4027741 4164357
10028D164357J68832j6170M1276J42407R0594J01462p7406n9318K12171K78467
$$ 4164357 4333189 4317019 4358295 4500702 4591296 4692758 4615352 4556034 4768205 5046672
10018E046672K05680J45647j01035p3655M7284O4845J89825K80791k8789r8568
$$ 5046672 5252352 5397999 5296964 5223309 5270593 5335438 5525263 5806054 5777265 5678697
10008E678697k14950N9547J22974J87839N6914o4031J46707M6066r2170p0652
$$ 5678697 5463747 5523294 5646268 5834107 5891021 5826990 5973697 6019763 5927593 5856941
9998E856941N5457K01462K48140L9385j57431J64365J88589O4796j71020O5335
$$ 5856941 5912398 6113860 6362000 6401385 6243954 6408319 6596908 6661704 6490684 6556019
9988F556019J72583K29417K66411J09532J70523O5725J19559q5209J66459J70713
$$ 6556019 6728602 6958019 7224430 7333962 7504485 7570210 7689769 7604560 7771019 7941732
9978G941732R8114R9699o0816m4845p0121n3805L20185K55963K88292M38423K37930
$$ 7941732 8039846 8139545 8078729 8033884 7963763 7909958 8230143 8486106 8774398 9212821 9450751
9967I450751R7956L01009J24835J62005L96597L39826M26440L28222L43569K56001
$$ 9450751 9548707 9849716 9974551 10136556 10533153 10872979 11299419 11627641 11971210 12227211
9957A2227211L86243N70250L91284M99107O16916O76885M08300P76658Q78505
$$ 12227211 12613454 13183704 13574988 14074095 14691011 15367896 15776196 16552854 17431359
9948A7431359Q79751O69447P18591Q26031J009737J005215P42020J127635J299006
$$ 17431359 18311110 18980557 19699148 20525179 21534916 22540131 23282151 24409786 25708792
9939B5708792J518539J152520J519572J693695J581873J498785J741691J796159
$$ 25708792 27227331 28379851 29899423 31593118 33174991 34673776 36415467 38211626
9931C8211626J670124J870471K040359J906077J540684J143658J610557J733715
$$ 38211626 39881750 41752221 43792580 45698657 47239341 48382999 49993556 51727271
9923E1727271J758050J836168J654277J645395J553962J516471J815834J716923
$$ 51727271 53485321 55321489 56975766 58621161 60175123 61691594 63507428 65224351
9915F5224351J683697J618691J439585J574335J435662J484239J697229J346735
$$ 65224351 66908048 68526739 69966324 71540659 72976321 74460560 76157789 77504524
9907G7504524J095049J012484J069325J109192J017906M67487J52080J91928L72543
$$ 77504524 78599573 79612057 80681382 81790574 82808480 83275967 83428047 83619975 83992518
9898H3992518L51402L9223P3925L8310l59605n41651k13j55358n15350l63922
$$ 83992518 84343920 84383143 84457068 84495378 84135773 83594122 83593909 83438551 82923201 82559279
9888H2559279k87962m83609q97462j022015r48517q42139q33647j041526j103856
$$ 82559279 82271317 81787708 80890246 79868231 78919714 78077575 77243928 76202402 75098546
9879G5098546j082770j129316j211780j135580r77205j369502j272988j146968
$$ 75098546 74015776 72886460 71674680 70539100 69561895 68192393 66919405 65772437
9871F5772437j068101j123450j216639j068091r97479r63250r76100o27306n67604
$$ 65772437 64704336 63580886 62364247 61296156 60298677 59335427 58359327 57732021 57164417
9862E7164417o13532o32907n08907l15043q4726o7719O0081R1454P463J94316
$$ 57164417 56550885 55917978 55409071 55094028 55009302 54941583 55001664 55093118 55100581 55294897
9852E5294897P51084Q04749O62484Q22860J215529J284680J460384J439220J560165
$$ 55294897 56045981 56850730 57513214 58336074 59551603 60836283 62296667 63735887 65296052
9843F5296052J559234J670444J989973J835583J675740J690112J554543J735947
$$ 65296052 66855286 68525730 70515703 72351286 74027026 75717138 77271681 79007628
9835G9007628J767376J669170J527722J591671J345238J206236J425193J517102
$$ 79007628 80775004 82444174 83971896 85563567 86908805 88115041 89540234 91057336
9827I1057336J124534J156093J199915J059700R70379R18336Q80841Q79728N97261
$$ 91057336 92181870 93337963 94537878 95597578 96567957 97486293 98367134 99246862 99844123
9818I9844123L61143L86274L75861J80340j64858k61480k35252n80170m42342
$$ 99844123 100205266 100591540 100967401 101147741 100982883 100721403 100486151 99905981 99463639
9809I9463639p37110j220864j046692q57629j197352j304864j128696j485712
$$ 99463639 98726529 97505665 96458973 95601344 94403992 93099128 91970432 90484720
9801I0484720j736458j451688j523566j730706j759692j611760k015200k328420
$$ 90484720 88748262 87296574 85773008 84042302 82282610 80670850 78655650 76327230
9793G6327230k453250k357055k013840j992501k203555k443557k198037j939880
$$ 76327230 73873980 71516925 69503085 67510584 65307029 62863472 60665435 58725555
9785E8725555k564535k395175k170620k163090k230632k210200j858854j583813
$$ 58725555 56161020 53765845 51595225 49432135 47201503 44991303 43132449 41548636
9777D1548636j751570j824720j768477j569340j616935j434764j489656j056698
$$ 41548636 39797066 37972346 36203869 34634529 33017594 31582830 30093174 29036476
9769B9036476j286432j475950j373941j166322j004400p96188r92319p21017o84010
$$ 29036476 27750044 26274094 24900153 23733831 22729431 21933243 20940924 20219907 19535897
9760A9535897j066397p93680m16460m35162m32648l44575l30564n26583m43083
$$ 19535897 18469500 17675820 17259360 16824198 16391550 16046975 15716411 15189828 14746745
9751A4746745l43203l46217q1732j65500r5523K1571j52878k04038J09501J79501
$$ 14746745 14403542 14057325 13975593 13810093 13714570 13736141 13583263 13379225 13488726 13668227
9741A3668227N6979o9431j99175k2637N8527o5044J20029R143K02331L79745J32267
$$ 13668227 13725206 13655775 13456600 13433963 13492490 13427446 13547475 13556618 13758949 14138694 14270961
9730A4270961M16089L44818O7440L30037M77356N04354M45981O21567J001412
$$ 14270961 14687050 15031868 15099308 15429345 15906701 16411055 16857036 17478603 18480015
9721A8480015R55584J072391R39132Q83637P74091R56648R66792N97360O95080
$$ 18480015 19435599 20507990 21447122 22330759 23104850 24061498 25028290 25625650 26320730
9712B6320730O33377P99724Q63269M66448J99965Q4197K00894N3839j62078l8850
$$ 26320730 26954107 27753831 28617100 29083548 29283513 29367710 29568604 29622443 29460365 29421515
9702B9421515k8545j04739p4553j57428m9288o9012J12589J90193K24722K49052
$$ 29421515 29392970 29288231 29213678 29056250 29006962 28937950 29050539 29240732 29465454 29714506
9692B9714506K06336L90504O82682M27744j7114K27630K11439N7462j65086l51777
$$ 29714506 29920842 30311346 30994028 31421772 31404658 31632288 31843727 31901189 31736103 31384326
9682C1384326m64994o12657p47810q45993j168800r65164q77721q96232r72303
$$ 31384326 30919332 30306675 29558865 28712872 27544072 26578908 25701187 24804955 23832652
9673B3832652p07691q44057p94923p80175p87954o15166l48350m18870m79298
$$ 23832652 23124961 22280904 21485981 20705806 19917852 19302686 18954336 18535466 18056168
9664A8056168m27400q3610l9885j16734R6702J46083J04169J14221M28681N25292
$$ 18056168 17628768 17545158 17505273 17388539 17485241 17631324 17735493 17849714 18278395 18803687
9654A8803687L79836L48880O17195R69500P47774O88390P39455N56301Q67425
$$ 18803687 19183523 19532403 20149598 21119098 21866872 22555262 23294717 23851018 24718443
9645B4718443J071413J516602J292283J323553J487161J672902J940803J948705
$$ 24718443 25789856 27306458 28598741 29922294 31409455 33082357 35023160 36971865
9637C6971865J612229J505126J762966J879533J570971J518725J640046J397914
$$ 36971865 38584094 40089220 41852186 43731719 45302690 46821415 48461461 49859375
9629D9859375J431830R28272O25944N29698L10432O22494M41577L86654J82035
$$ 49859375 51291205 52219477 52845421 53375119 53685551 54308045 54749622 55136276 55318311
9620E5318311p5721j4831K6364J9039J80291K53032L33908K97986J53083P1664
$$ 55318311 55242590 55227759 55254123 55273162 55453453 55706485 56040393 56338379 56491462 56563126
9610E6563126K77771Q0814j20716k33750k7806p2123o17988o99219p43796p94663
$$ 56563126 56840897 56921711 56800995 56567245 56539439 56467316 55849328 55150109 54406313 53611650
9600E3611650q04467j372822j797991j676594j406740j679971j770893j774644
$$ 53611650 52807183 51434361 49636370 47959776 46553036 44873065 43102172 41327528
9592D1327528j785399j784437j791208j806415j476199j514936j329206j229783
$$ 41327528 39542129 37757692 35966484 34160069 32683870 31168934 29839728 28609945
9584B8609945j397153j248334j085424j072505o42507o01539n93951n02966n12052
$$ 28609945 27212792 25964458 24879034 23806529 23164022 22562483 21968532 21465566 20953514
9575B0953514m14103l27695k34771q4987R6732K81403L83030J51891K29959J91295
$$ 20953514 20539411 20211716 19976945 19891958 19988690 20270093 20653123 20805014 21034973 21226268
9565B1226268M73734M37686O02204N42001O86603Q32667R27305J072428R38489
$$ 21226268 21700002 22137688 22739892 23281893 23968496 24801163 25728468 26800896 27739385
9556B7739385J075733J226417J312284J247611R99504J252916J218442J000045
$$ 27739385 28815118 30041535 31353819 32601430 33600934 34853850 36072292 37072337
9548C7072337R78699R05573P71367P60014P03146O73387N67986L780L45616N17299
$$ 37072337 38051036 38956609 39727976 40487990 41191136 41864523 42432509 42436289 42781905 43299204
9538D3299204M27108j54833l71194j38912N2612j77713l51159K2377j08318K5541
$$ 43299204 43726312 43571479 43200285 43061373 43113985 42936272 42585113 42607490 42499172 42524713
9528D2524713Q7483l57574k58202l7492l61887j85832r6486o90174r25003m37673
$$ 42524713 42612196 42254622 41996420 41958928 41597041 41411209 41314723 40624549 39699546 39261873
9518C9261873n96281q04232r40353r35689j061254j085692j152278j296260j332722
$$ 39261873 38665592 37861360 36921007 35985318 34924064 33838372 32686094 31389834 30057112
9509C0057112j391900j558480j551090j286097j229446j217128j100862j070643
$$ 30057112 28665212 27106732 25555642 24269545 23040099 21822971 20722109 19651466
9501A9651466j088255j028167q88742r38192q66126p75998p20436n33081n38549
$$ 19651466 18563211 17535044 16646302 15708110 14841984 14065986 13345550 12812469 12273920
9492A2273920n27526n51382l65992j32319k19481k77956l40033j54545K2035j29425
$$ 12273920 11746394 11195012 10829020 10696701 10477220 10199264 9859231 9704686 9726721 9597296
9482I597296J68992k8074l3596p2918M7749j46091m3122K51809L49413R4937L18360
$$ 9597296 9766288 9738214 9704618 9631700 9679449 9533358 9490236 9742045 10091458 10186395 10504755
9471A0504755L71919Q2990K42565O03455M60576L50899L77521M00292K31774K00354
$$ 10504755 10876674 10959664 11202229 11805684 12266260 12617159 12994680 13394972 13626746 13827100
9461A3827100J94481M03111J68981j31792k12744k85263l17845k73282p8300J12389
$$ 13827100 14021581 14424692 14593673 14461881 14249137 13963874 13646029 13372747 13294447 13406836
9451A3406836k60971k19121k81117j79251p2824k21994j15890j67039M1639m4899
$$ 13406836 13145865 12926744 12645627 12466376 12393552 12171558 12055668 11888629 11930268 11885369
9441A1885369j29707r678R2840j10633r2646P845J38282L8769l63352m92846k78561
$$ 11885369 11755662 11745984 11838824 11728191 11635545 11643390 11781672 11820441 11457089 10964243 10685682
9430A0685682k88297o01356n49966l25619l82253l45772n49052m91341n13234
$$ 10685682 10397385 9796029 9246063 8920444 8538191 8192419 7643367 7152026 6638792
9421F638792m93670m72138j37958o3738k90601k42743j92224l07212o2796j04696
$$ 6638792 6145122 5672984 5535026 5471288 5180687 4937944 4745720 4438508 4375712 4271016
9411D271016l54862k10568k33103K5670J04003q3942l80005k42234k9261L0581
$$ 4271016 3916154 3705586 3472483 3498153 3602156 3518214 3138209 2895975 2866714 2897295
9401B897295j67956m7406j05464o7752l0474k3365P8611l5210J65149j09194m15419
$$ 2897295 2729339 2681933 2576469 2508717 2478243 2454878 2533489 2498279 2663428 2554234 2138815
9390B138815j63929j40733J91561M2176J65051O5247j5371j43832k88310j70558
$$ 2138815 1974886 1834153 2025714 2067890 2232941 2298188 2282817 2138985 1850675 1680117
9380A680117m332P1117Q7689p240o2936l2364J79839j91483j11747j99323p0038
$$ 1680117 1675785 1746902 1834591 1827351 1764415 1732051 1911890 1720407 1608660 1409337 1339299
9369A339299J17825j41263k90630r6285k3974N2596K14506J05248l3812n139r6274
$$ 1339299 1457124 1315861 1025231 928946 904972 957568 1172074 1277322 1243510 1238371 1142097
9358A142097k11816r2166p8169r303J90997J91208L5210j29172R9841j40938r4163
$$ 1142097 930281 838115 759946 750643 941640 1132848 1168058 1038886 1138727 997789 903626
9347I03626K32909J04852L8392K7771n8208j14954l15414n8982L08535M7709k51721
$$ 903626 1136535 1241387 1279779 1307550 1249342 1134388 818974 759992 1068527 1116236 864515
9336H64515j45462l16835k7162K23512O3408L65K01610O8545o7107k0839k80016
$$ 864515 719053 402218 375056 598568 661976 662341 863951 932496 865389 844550 564534
9325E64534k61630R7388R2583L82627J26378j51362o4697J57856q120j43566J6024
$$ 564534 302904 400292 492875 875502 1001880 850518 785821 943677 935557 791991 808015
9314H08015k1262r6971n3211n6424j18673k4631J20509Q3794m6280l1084k04678
$$ 808015 786753 689782 636571 580147 461474 436843 557352 641146 594866 563782 359104
9303C59104r0623p4635J07243j32583J39294J14419J05296j94021J1325Q3849
$$ 359104 268481 193846 301089 168506 307800 422219 527515 333494 344819 428668
9293D28668J12223j52031j44525k11055j66103p1554M33019q1510j24435P2956
$$ 428668 540891 388860 244335 33280 -132823 -204377 228642 147132 22697 95653
9283I5653K44219J59365J1233j75680N5324K61592J71527o7327j54975j71068
$$ 95653 339872 499237 510470 334790 390114 651706 823233 755906 600931 429863
9273D29863Q1898K5525N1612Q2341p8360k2601J1274p2491P2724m5382j69416
$$ 429863 511761 537286 588898 671239 592879 570278 581552 509061 581785 536403 366987
9262C66987p6244k7047n7164K29130J55728M5541P0592J25299j41957k27089j35322
$$ 366987 290743 263696 206532 435662 591390 636931 707523 832822 690865 463776 328454
9251C28454K34486P5561k23060m2625J59764k39J27050K27215O8070j68877k97923
$$ 328454 562940 638501 415441 372816 532580 532341 659391 886606 954676 785799 487876
9240D87876n1784j32241m8742K36557J37543k13142r4652J52218N3679j36911
$$ 487876 436092 303851 255109 491666 629209 416067 321415 473633 527312 390401
9230C90401j63115P6482J89600j17942j46754P1038K71714R300l4223r5901j60035
$$ 390401 227286 303768 493368 375426 228672 299710 571424 580724 546501 450600 290565
9219B90565j92393J29502j74902M7439J57005N6534N1428J45086j4996j28655
$$ 290565 98172 227674 52772 100211 257216 313750 365178 510264 495268 366613
9209C66613q4165J7836j19471m188K99950N3910J34565P9511L3484M8845j54437
$$ 366613 282448 300284 180813 176625 476575 530485 665050 744561 778045 826890 672453
9198F72453j7161r4151j43452o0199M7122J31921J04728M5690M0334m4581k29181
$$ 672453 655292 561141 417689 357490 404612 536533 641261 686951 727285 682704 453523
9187D53523n3107K84557J70463p4694j82428k12785Q7305L512K8784O0038m2062
$$ 453523 400416 684973 855436 780742 598314 385529 472834 476346 505130 565168 523106
9176E23106N1925N4778k26770j35122P0490p001L1950J76834j06842j36095j48188
$$ 523106 575031 629809 403039 267917 338407 331406 363356 540190 433348 297253 149065
9165A49065p9697q4240p8793K77592K20234q8478j48197P2252Q5065J14717k05389
$$ 149065 69368 -14872 -93665 183927 404161 315683 167486 239738 324803 439520 234131
9154B34131N8327P3544J6299J67769N1439k0678j40158j99925q4531P7212J18320
$$ 234131 292458 366002 382301 550070 601509 580831 440673 240748 156217 233429 351749
9143C51749m6468R2168N2704l2021L9149q6778M6900r0029j53922k4655P1692
$$ 351749 305281 397449 450153 418132 457281 370503 417403 327374 173452 148797 220489
9132B20489O9386J73813j00310O5775K16810j03142l0339m1365K2107n9598Q615
$$ 220489 289875 463688 363378 429153 645963 542821 512482 471117 493224 433626 442241
9121D42241j49768J87911J03223p013j41561p6579J03170J2258M0161K63470J9300
$$ 442241 292473 480384 583607 576594 435033 358454 461624 473882 514043 777513 796813
9110G96813k18800r089j63009k21467j44995J88109J95750j79867r9950K76024
$$ 796813 578013 568924 405915 184448 39453 227562 423312 243445 143495 419519
9100D19519J06116J98384J24097m15361k63534O8525L1157j43010J45163J94213
$$ 419519 525635 724019 848116 432755 169221 237746 268903 125893 271056 465269
9090D65269j4373L6445j55466k72069k7913P7216K2577J55514K48611r6779o7989
$$ 465269 450896 487341 331875 59806 31893 109109 131686 287200 535811 439032 371043
9079C71043J5578j84296q3130P4564M0258R248l10564k43876J34114L3673M7363
$$ 371043 386621 202325 119195 193759 234017 243265 -67299 -311175 -177061 -143388 -96025
9068i6025J54117l1748P3657j8228R8691P0300Q6296m5595l9142J13501k00121
$$ -96025 58092 26344 100001 81773 180464 250764 337060 291465 252323 365824 165703
9057A65703j81489j19569p6988K00709j9749J5174J99769n0117k67932J53956
$$ 165703 -15786 -135355 -212343 -11634 -31383 -16209 183560 133443 -134489 19467
9047A9467o5012Q0132l1323J81763p6369J35862J43567j28057P8966j29140J23842
$$ 19467 -45545 34587 3264 185027 108658 244520 388087 260030 338996 209856 333698
9036C33698J65159j39966j58047J05015l1665N2135K0653m1321R7315J16968j72992
$$ 333698 498857 358891 200844 305859 274194 326329 346982 305661 402976 519944 346952
9025C46952j97839J6357r3650J34482l676m8930P2706J27762J6949n410j29045
$$ 346952 149113 165470 71820 206302 202626 153696 226402 354164 371113 365703 236658
9014B36658j66441o8956p3761p1004j2785O5191K34262j51852j38439N7652Q2384
$$ 236658 70217 1261 -72500 -143504 -156289 -91098 143164 -8688 -147127 -89475 -7091
9003g091n3144l1309j5061J16586J75219J40209j9235k59286j85793Q4100J07772
$$ -7091 -60235 -91544 -106605 9981 185200 325409 306174 46888 -138905 -54805 52967
8992E2967K05032J01922n449m9222J12233j33523j89017L5499l4916Q6208Q6761
$$ 52967 257999 359921 354472 305250 417483 283960 94943 130442 95526 181734 268495
8981B68495j50420k46140j8669J41715K64956P7930J5342O4985l05523k73872
$$ 268495 118075 -128065 -146734 -5019 259937 337867 353209 418194 112671 -161201
8971a61201Q7793J4156j2575J95992P9108M6082R8066k7035m6378j7196Q575p0334
$$ -161201 -73408 -59252 -71827 124165 203273 249355 347421 320386 274008 256812 265387 195053
8959A95053k98145J27995K01876M3579J81355P142j88428k7431n0812r1879J5412
$$ 195053 -103092 24903 226779 270358 451713 458855 270427 242996 192184 100305 115717
8948A15717R3862J63824M3410O388p9267J12364k28452m190J61756j9473k47533
$$ 115717 209579 373403 416813 423201 343934 456298 227846 223656 385412 365939 118406
8937A18406j03659J50401J01397J9167M3002m3217p7955p6826Q107k02522K2790
$$ 118406 14747 165148 266545 285712 328714 285497 207542 130716 138823 -63699 -40909
8926d0909J98431J6549j32381O649K916p2877m9599J20152J78301j39729N7349
$$ -40909 157522 174071 41690 48339 51255 -21622 -71221 48931 227232 87503 144852
8915A44852K71357K9948j39527j62463j7849p9625O0209J24638q0450j044J1282
$$ 144852 416209 446157 306630 144167 126318 46693 106902 231540 151090 150046 161328
8904A61328n5157J10615J28648j42159r22J48687k61732n6517L1076J30301P9352
$$ 161328 106171 216786 345434 203275 202353 351040 89308 32791 63867 194168 273520
8893B73520N2698o8995P5252J05544j45193j7748p5548P2338J3938j51008k17654
$$ 273520 326218 257223 332475 438019 292826 275078 199530 271868 285806 134798 -82856
8882h2856K74444R5459j57661j77236J61110L38629J73927N2074k22740m0656
$$ -82856 191588 287047 129386 -47850 113260 451889 625816 677890 455150 414494
8872D14494q8302Q9138J99465J47504J50435J31115M58917N17517M96246M60017
$$ 414494 326192 415330 614795 762299 912734 1043849 1502766 2020283 2516529 2976546
8862B976546M51018J69511P828k81596n55862m56497k56167l62233l92099j26831
$$ 2976546 3427564 3597075 3604903 3323307 2767445 2310948 2054781 1692548 1300449 1173618
8852A173618P6982K4415k2738j71042k31438m261j6676l08579l89376k61851n2633
$$ 1173618 1250600 1275015 1252277 1081235 849797 845536 828860 520281 130905 -130946 -183579
8841a83579J46364Q1839K17910R0021p2409o1841O6350J61236q9244L2120r7019
$$ -183579 -37215 44624 262534 352555 280146 218305 284655 445891 356647 388767 291748
8830B91748k4140J04848K8826O9737l4232J58288j4827K7466k22893k03366J75764
$$ 291748 267608 372456 401282 471019 436787 595075 580248 607714 384821 181455 357219
8819C57219K01971j24542j55105R3707J07645j78345j16132K4833l0080J09379
$$ 357219 559190 434648 279543 373250 480895 302550 186418 211251 181171 290550
8809B90550J65762q9398k9779J35475j0236k72572L5967O9324o5835j30197J08726
$$ 290550 456312 366914 337135 472610 462374 189802 225769 295093 229258 99061 207787
8798B07787J08982M793m08101k5240M4907J0978q6421R7552P9129n9847K1513
$$ 207787 316769 321562 -86539 -111779 -66872 -55894 -142315 -44763 34366 -25481 -3968
8787c968K70779K74886m6398k33942Q8632J74879K3873j42734o0150l2585Q5061
$$ -3968 266811 541697 495299 261357 349989 524868 548741 406007 345857 313272 398333
8776C98333j61124p6993k7813o6191j5354n7076K7160r5902K61328K20526j46467
$$ 398333 237209 160216 132403 66212 50858 -6218 20942 -74960 186368 406894 260427
8765B60427j05088j17938J78279J05398N197J44258M7571L4526k62580k46708
$$ 260427 155339 37401 215680 321078 326275 470533 518104 552630 290050 43342
8755D3342n1805K1354j51192j180J30482K33920P0269J50526k8583j8142r9525
$$ 43342 -8463 12891 -138301 -139481 -8999 224921 295190 445716 417133 398991 299466
8744B99466n3157j62302p5876J46762K4630m642l9489O556Q6963R740o0099J4768
$$ 299466 246309 84007 8131 154893 179523 174881 135392 141948 228911 238651 178552 193320
8732A93320o8177J79213K19142K0459Q2903q4143m60598k93360o7413J04152J39743
$$ 193320 125143 304356 523498 543957 626860 542717 82119 -211241 -278654 -174502 -34759
8721c4759L8534J73586K81124K04758Q7834j43326j51052j78985J84172r9913
$$ -34759 3775 177361 458485 663243 751077 607751 456699 277714 461886 361973
8711C61973j27320p8028p6100J94236Q4473j03910J65284J51448j21725m04388
$$ 361973 234653 156625 80525 274761 359234 255324 420608 572056 450331 45943
8701D5943J69906J61061j02770k51926P8855o6188l1250j43884J73203J25496
$$ 45943 215849 376910 274140 22214 101069 34881 3631 -140253 32950 158446
8691A58446m3483J60428J38283o1750j66820J50210O5467k27684N5886j9748j48086
$$ 158446 114963 275391 413674 351924 185104 335314 400781 173097 228983 209235 61149
8680F1149j57962K28083j35747q2195J68131L41127N5793q4537j28077n8942J7907
$$ 61149 -96813 131270 -4477 -86672 81459 422586 478379 393842 265765 206823 224730
8669B24730k4519j7220m9923K05010k52226n7597l7693j921K22396m5880o8523
$$ 224730 200211 182991 133068 338078 85852 28255 -9438 -11359 211037 165157 96634
8658I6634J61629n4024l9034j07538J3203N2721K9231j1284p5874j01634q3518
$$ 96634 258263 204239 165205 57667 70870 123591 152822 141538 65664 -35970 -119488
8647a19488j37858J5600L18422R3365q234J9804J55622p6058r161j0672j00079
$$ -119488 -257346 -241746 76676 170041 161807 181611 337233 261175 252014 241342 141263
8636A41263J69943K37397k4114n3237j61166j5092N6279J84465o8143j57849r5639
$$ 141263 311206 548603 524489 471252 310086 294994 351273 535738 467595 309746 214107
8625B14107j25100k1100L00000J16142J6778P7186P1537P3043j28423k02844j74374
$$ 214107 89007 67907 367907 484049 500827 578013 649550 722593 594170 391326 216952
8614B16952k63740j10866l8456J2957J39698J04820j54312k09264J58626J68483
$$ 216952 -46788 -157654 -196110 -183153 -43455 61365 -92947 -302211 -143585 24898
8604B4898j9234O0736Q1174j055N3697K8791J26984K47863K94159k8773j02891
$$ 24898 5664 66400 147574 146519 200216 229007 355991 603854 898013 869240 766349
8593G66349K4356k27620j52984j04690N8443J95232K98479J42961J06028K36426
$$ 766349 790705 563085 410101 305411 363854 559086 857565 1000526 1106554 1342980
8583A342980l7564M0627Q4985l5667k6366Q407n8484k83819m0974M5199k14870
$$ 1342980 1305416 1346043 1431028 1395361 1368995 1377402 1318918 1035099 994125 1039324 824454
8572H24454q1635r5816k79141k03492N9375K16330K0970N3219J10180R5027q4595
$$ 824454 742819 647003 367862 164370 223745 440075 461045 514264 624444 719471 634876
8561F34876j50418o5887J18774j097k41942L179J65409j97768m8320o5917k2472
$$ 634876 484458 418571 537345 536248 294306 297485 462894 265126 216806 150889 128417
8550A28417K5894L725j44781K6872P4266j6660K67631j1351J3141Q5385n1703
$$ 128417 154311 158036 13255 40127 114393 97733 365364 354013 367154 452539 400836
8539D00836r1047j64043k41878r5504K12923J51934J92933k24566k83171Q7167
$$ 400836 309789 145746 -96132 -191636 21287 173221 366154 141588 -141583 -54416
8529e4416K35646m5602j51493M5714j4566Q8671J53171j70757q6383p5934k13145
$$ -54416 181230 135628 -15865 29849 15283 103954 257125 86368 -15 -75949 -289094
8518b89094R9900K61436J68456N0780J7433m3986m6151p8871Q6135j0961R3626
$$ -289094 -189194 72242 240698 291478 308911 264925 218774 139903 226038 215077 308703
8507C08703o5309k57683n5045L43281R8657l0837n632Q5199p0846l80563k61323
$$ 308703 243394 -14289 -69334 273947 372604 341767 336135 421334 350488 -30075 -291398
8496b91398K48080J81572j94833J39004J80204q5602M891k02775R0291J23740
$$ -291398 -43318 138254 -56579 82425 262629 177027 181918 -20857 69434 193174
8486A93174l5908j54516j24676J69838K98882j4218J26188J99578L43361J76220
$$ 193174 157266 2750 -121926 47912 346794 332576 458764 658342 1001703 1177923
8476A177923M0568J53625n3002l3667K0137k03953j71604m5445k68429l21562
$$ 1177923 1218491 1372116 1319114 1285447 1305584 1101631 930027 884582 616153 294591
8466B94591k53229L9385p401M1234Q7685n1937q903p2589K9958j21822n6807R2059
$$ 294591 41362 80747 73346 114580 202265 150328 141425 68836 98794 -23028 -79835 12224
8454A2224R945J9722Q1567J57574j53396k98169N3030J50849J23866k04648j76315
$$ 12224 22169 41891 123458 281032 127636 -170533 -117503 33346 157212 -47436 -223751
8443b23751K8285P0254j51991J26585K13452J17022J5310K4564K28402l2095k75335
$$ -223751 -195466 -125212 -277203 -150618 62834 179856 195166 219730 448132 416037 140702
8432A40702j84997o9552n5843K68174J16200o573j76198M8499L4133J29218J59925
$$ 140702 -44295 -113847 -169690 98484 214684 208111 31913 80412 114545 243763 403688
8421D03688l38648N8417K55594r0224o9229L1098j79232k8261k8391j20562J15853
$$ 403688 65040 123457 379051 288827 219598 250696 71464 43203 14812 -105750 10103
8410A0103M0683m498J4836M904j34479k4583m5627j2679K62718j7046P5895K55802
$$ 10103 50786 46288 61124 66028 -68451 -93034 -138661 -151340 111378 94332 170227 426029
8398D26029k18648j98579N8212p2882j24998J98166R4698J5503j6559O96m9782
$$ 426029 207381 8802 67014 -5868 -130866 67300 161998 177501 160942 161638 111856
8387A11856j74010l7403L28k91830J04700L16619J26620M0843O1396j31219k63025
$$ 111856 -62154 -99557 -99229 -391059 -286359 30260 156880 197723 259119 127900 -135125
8376a35125n4827J05006K39483N5595Q7586l25366r2162Q3389J7563L2466r7688
$$ -135125 -189952 -84946 154537 210132 297718 -27648 -119810 -36421 -18858 13608 -84080
8365h4080k3618j13412P9298m741J66716J01383O0948J69515p6550j50994j29218
$$ -84080 -107698 -221110 -141812 -146553 20163 121546 182494 352009 275459 124465 -4753
8354d753N7752O7462k41691k62543q4672J88753K52390J58355j49183K6302J29115
$$ -4753 52999 120461 -121230 -383773 -468445 -279692 -27302 131053 -18130 8172 137287
8343A37287k3543P9380M1643j22190N6386q5516j5151N8410R5580r5247j10534
$$ 137287 113744 193124 234767 112577 168963 83447 68296 126706 222286 127039 16505
8332A6505n2681R0339J12327M660k9412q7857J04079P7181L3223o4167o1257j99049
$$ 16505 -36176 54163 166490 171150 141738 53881 157960 235141 268364 204197 142940 -56109
8320e6109o1417J28001M901N6058m312k39525o2734J3221m3048J968K21437P3005
$$ -56109 -117526 10475 15376 71434 67122 -172403 -235137 -221916 -264964 -262996 -41559 31446
8308C1446M8251K4977j6293O4869k32592j29587R6406M5867R4895M1366J45721
$$ 31446 79697 104674 88381 153250 -79342 -208929 -112523 -66656 28239 69605 215326
8297B15326J84744R5035J0809j03339j71432l6716Q1512J32639P704R8848J41103
$$ 215326 400070 495105 505914 402575 231143 194427 275939 408578 416282 515130 656233
8286F56233J98052L7452m17921k56621p4740l2000r641N2491J4981l4095J73454
$$ 656233 854285 891737 473816 217195 142455 110455 100814 153305 168286 134191 307645
8275C07645Q339q1837n9038l9784j74483l1966m1903P4257o3453j62062j31558
$$ 307645 315984 234147 175109 135325 -39158 -71124 -113027 -38770 -102223 -264285 -395843
8264c95843L8846K34142K02738k5518K18902O8837j05763J276J5883J98136O7872
$$ -395843 -356997 -122855 79883 54365 273267 342104 236341 237617 253500 451636 519508
8253E19508r2280j8440Q4985J48616j38749o5501L0294P1470j76436j97958j20457
$$ 519508 427228 408788 493773 642389 503640 438139 468433 539903 363467 165509 45052
8242D5052n5403l10721P1910J08451O6665K51596J91135k22300j62293N4898J01098
$$ 45052 -10351 -321072 -249162 -140711 -74046 177550 368685 146385 -15908 38990 140088
8231A40088J45622j54404Q9625N5202n9805j31304l4162M4809K23183J7950j52670
$$ 140088 285710 131306 220931 276133 216328 85024 50862 95671 318854 336804 184134
8220A84134J27376N5840O3066j06274l07782r5912m8706j16016J7466r8740M7583
$$ 184134 311510 367350 430416 324142 16360 -79552 -128258 -244274 -226808 -325548 -277965
8209b77965J57603l4808Q4741Q9341o6548k357m5543j21747Q8405J5940J9331
$$ -277965 -120362 -155170 -70429 18912 -47636 -49993 -95536 -217283 -128878 -112938 -93607
8198i3607L2381k58686p4626L16572J3982k01348l7552O0830J30477N7227j06973
$$ -93607 -61226 -319912 -394538 -77966 -63984 -265332 -302884 -242054 -111577 -54350 -161323
8187a61323j73295p7490k3035J77598P4588o2259O0298R3312q7861n608K33701
$$ -161323 -334618 -412108 -435143 -257545 -182957 -245216 -184918 -91606 -179467 -185075 48626
8176D8626J5522R433P5705M8392K35867J52968k06626j89481j04787o7668l714
$$ 48626 64148 73581 149286 197678 433545 586513 379887 190406 85619 17951 14237
8165A4237r4199j09704q4920J89470N32Q8467J40005q1492k71565J37385J55227
$$ 14237 -79962 -189666 -274586 -85116 -84584 3883 143888 62396 -209169 -71784 83443
8154H3443j31880k20719j59964p4565J00854o6728O7805J66284L14741J92055
$$ 83443 -48437 -269156 -429120 -503685 -402831 -469559 -401754 -235470 79271 271326
8144B71326r0763O7294j78686j11513l199j68067j77401J05938n810R3480m294
$$ 271326 180563 247857 69171 -42342 -45541 -213608 -391009 -285071 -290881 -197401 -201695
8133b01695m5272j02291m0339Q9983L97268r57k04827k3l4815J22256J21700J11439
$$ -201695 -246967 -349258 -389597 -299614 97654 96697 -108130 -108153 -142968 -20712 100988 212427
8121B12427P38q6813P1627n4032n7955N4487l0285J3651J04066j35671k12803
$$ 212427 213165 126352 197979 143947 85992 140479 110194 123845 227911 92240 -120563
8110a20563l2443N3798l5334l9354O6374J7763l0877o3403K7662J05610J114N2285
$$ -120563 -153006 -99208 -134542 -173896 -107522 -89759 -120636 -184039 -156377 -50767 -49653 2632
8098B632J91742J28518n0681q1887N745K6155P9158J24660j20686j46448j4074
$$ 2632 194374 322892 272211 190324 196069 222224 301382 426042 305356 158908 144834
8087A44834M5655K20343k2886j05874o9184l43258j09586j09175J92976J81887
$$ 144834 190489 410832 387946 282072 212888 -130370 -239956 -349131 -156155 25732
8077B5732J70590j93944j98041m5828J71205J29466K23516P3945j7117k52034
$$ 25732 196322 2378 -195663 -241491 -70286 59180 282696 356641 339524 87490
8067H7490L001K9872J35120N5135o2033j85505j69323K2560Q6901K49373J11135
$$ 87490 90491 120363 255483 310618 248585 63080 -106243 -83683 3218 252591 363726
8056C63726J09199k12424p5512n7499L7539o0677n9065O8842J62889R2684n4811
$$ 363726 472925 260501 184989 127490 165029 104352 45287 114129 277018 369702 314891
8045C14891r9067K4793m1238j96567j15884J43367q376j65115K23348L08013o0042
$$ 314891 215824 240617 199379 2812 -113072 30295 21919 -143196 80152 388165 328123
8034C28123k27322m735P623L05396k6864l92630j18967J24283m4129R3813J12012
$$ 328123 100801 96066 103689 409085 382221 -10409 -129376 -5093 -49222 44591 156603
8023A56603R0654j34728n9756k0085q2631J48652J62388N6208j72724j67143P0133
$$ 156603 247257 112529 52773 32688 -49943 98709 261097 317305 144581 -22562 47571
8012D7571m0297p4387j38895J20982J06337P4141k9087O0339O3530J00182Q5383
$$ 47571 7274 -67113 -206008 -85026 21311 95452 66365 126704 190234 290416 375799
8001C75799M6528Q3935l93554k32260K9128M6991k70684j15018K44216K33242
$$ 375799 422327 506262 112708 -119552 -90424 -43433 -314117 -429135 -184919 48323
7991D8323N8020l09734j48472O703K36088J13550m474j12946j7101q9577J22103
$$ 48323 106343 -203391 -351863 -345160 -109072 4478 4 -112942 -130043 -219620 -97517
7980i7517m6241o855J3400l1276J36586O1875n6157N1014k8610o7269L4405J13585
$$ -97517 -143758 -150613 -137213 -168489 -31903 29972 -26185 24829 -3781 -71050 -36645 76940
7968G6940P630J27422J07115L8348K33171j14756j59538j99293j26538j20342
$$ 76940 84570 211992 319107 357455 590626 475870 316332 117039 -9499 -129841
7958a29841j7066N9406j40809j24037K24337R2546l0465k09956k4098J13796P7023
$$ -129841 -146907 -87501 -228310 -352347 -128010 -35464 -65929 -275885 -299983 -186187 -109164
7947a09164O6931p5868j20892K7733O5129m8806L3537Q1461o9611o7646M7683
$$ -109164 -42233 -118101 -238993 -211260 -146131 -194937 -161400 -79939 -149550 -217196 -169513
7936a69513J30773J68733R9145Q2667j43162O1647R2664j10113k8211j13743k38
$$ -169513 -38740 129993 229138 311805 168643 230290 322954 212841 184630 70887 70649
7925G0649O1582o379k27016k13777M190M1849M4793j03386J11686R5838K41963
$$ 70649 132231 125852 -101164 -314941 -310751 -268902 -224109 -327495 -215809 -119971 121992
7914A21992R1321j1549N8785r5j49576P7210k2655j31237j0480p0415r3572P3806
$$ 121992 213313 201764 260549 260454 110878 188088 165433 34196 23716 -46699 -140271 -66465
7902f6465j73172n7901K31881J30466O0374o5409J05465L3747J16774j19025l05181
$$ -66465 -239637 -297538 -65657 64809 125183 59774 165239 198986 315760 196735 -108446
7891a08446j78065N4188J33797J37935L7533J8964o8194O931j03469m5023P9281
$$ -108446 -286511 -232323 -98526 39409 76942 95906 27712 34643 -68826 -113849 -34568
7880c4568K09344n6141j88850m4287p575j3928O2076N6492K57683p5854k55229
$$ -34568 174776 118635 -70215 -114502 -122077 -136005 -73929 -17437 240246 164392 -90837
7869i0837k7822J00064K82720l962p4062k32120J34162j64912j7270J25309L9403
$$ -90837 -118659 -18595 264125 260163 186101 -46019 88143 -76769 -94039 31270 70673
7858G0673j42628j0108K7382J08165r7237n7055J94630Q7320j07315L2766j04596
$$ 70673 -71955 -82063 -54681 53484 -43753 -100808 93822 181142 73827 106593 1997
7847A997j39628l6618Q4683J58909J3011M1779M2472k36275n541J28454j126r6860
$$ 1997 -137631 -174249 -89566 69343 82354 124133 166605 -69670 -75211 53243 52117 -44743
7835d4743P7964k13013j06499K65172R8827l63067k01954J08626J67734K17287
$$ -44743 33221 -179792 -286291 -21119 77708 -285359 -487313 -378687 -210953 6334
7825F334N6628J54694M9024l3139l20275j61965J62105J7508n0249J12459J83930
$$ 6334 62962 217656 266680 233541 -86734 -248699 -86594 -69086 -119335 -6876 177054
7814A77054R0656l8420j51848j03537j44073n2661R4797n4650J27109R8028J4955
$$ 177054 267710 229290 77442 -26095 -170168 -222829 -128032 -182682 -55573 42455 57410
7803E7410l2804J65410J03991j42273l9383N7111J09887j4773l34300j06852K17288
$$ 57410 24606 190016 294007 151734 112351 169462 279349 264576 -69724 -176576 40712
7792D0712J15736J40257j4007R7109k8182j68216N6954l0335r0089N0032J14954
$$ 40712 156448 296705 282698 379807 351625 183409 240363 210028 119939 169971 284925
7781B84925q0028k05336P6135J0184o254m0913K03266M2751j62431j62525M0812
$$ 284925 204897 -439 75696 85880 79626 38713 241979 284730 122299 -40226 586
7770E86J75319j940k80693j93616J89710J29555K66544J06548k27045j38440m572
$$ 586 175905 173965 -106728 -300344 -110634 18921 285465 392013 164968 26528 21956
7759B1956J66782L186j19099J9133K3822q9399J1996J39329r6511j13156N0479
$$ 21956 188738 191924 72825 91958 115780 26381 38377 177706 81195 -31961 18518
7748A8518J42416q3540j22403j12186l8397J20040K6876k43142K38526J8069M846
$$ 18518 160934 77394 -45009 -157195 -195592 -75552 -48676 -291818 -53292 -35223 -30377
7737c0377J691p0190n0827R7725J63723J0087j92128N3199J3400M8249O6880O7555
$$ -30377 -28686 -98876 -149703 -51978 111745 121832 -70296 -17097 -3697 44552 111432 178987
7725A78987K6493J00603j13699j88783j11704M7174J55177J97210L4628R3862
$$ 178987 205480 306083 192384 3601 -108103 -60929 94248 291458 326086 419948
7715D19948N1570j15063j2776j94120j58090o7520O483j46774L12323J05667l3720
$$ 419948 471518 356455 343679 149559 -8531 -76051 -69568 -216342 95981 201648 167928
7704A67928M9271p1437Q3742l8311j699J3327j25235m301N3015k03004k14404
$$ 167928 217199 145762 229504 191193 189494 202821 77586 73285 126300 -76704 -291108
7693b91108J93104Q8803m45j14298O9825J18037N8634k24204j89386k2524J44508
$$ -291108 -98004 -9201 -9646 -123944 -54119 63918 122552 -101652 -291038 -313562 -169054
7682a69054M4392M7387P4301j02441j77819n4254m7043r660K16592J50619j35499
$$ -169054 -124662 -77275 -2974 -105415 -283234 -337488 -384531 -394191 -177599 -26980 -162479
7671a62479j44617Q8694J85133J03704o9049q0225j27813K4812n0996j8028J20308
$$ -162479 -307096 -218402 -33269 70435 1386 -78839 -206652 -181840 -232836 -250864 -130556
7660a30556k0763R6754L83661l20021r8032J126j35034p844j39786j84873N8867
$$ -130556 -151319 -54565 329096 9075 -88957 -87831 -222865 -230709 -370495 -555368 -496501
7649d96501L13539P9004Q205j4758p9940k50051m3740p8423J83438K59248R8575
$$ -496501 -182962 -103958 -95753 -110511 -190451 -440502 -484242 -562665 -379227 -119979 -21404
7638b1404J39505q5826l1232k20779k49675o8207J90105P9711K6350l2711j28079
$$ -21404 118101 32275 1043 -219736 -469411 -537618 -347513 -267802 -241452 -274163 -402242
7627d02242K9606j6718O0609M6440P7571j04334J16659K14965J42522p765L7674
$$ -402242 -372636 -389354 -328745 -282305 -204734 -309068 -192409 22556 165078 157313 194987
7616A94987j18518j27502k29163l01263L890K05045j07446q8511J90115L87990
$$ 194987 76469 -51033 -280196 -581459 -577569 -372524 -479970 -568481 -378366 9624
7606I624L5567J02893J39027j15594p0491O3938l03850r2935R4034N8413j09198
$$ 9624 45191 148084 287111 171517 101026 164964 -138886 -231821 -137787 -79374 -188572
7595a88572o7259r560r2323J72190J9353J36408O0013J00457O8472k77421J99648
$$ -188572 -255831 -265391 -357714 -185524 -166171 -29763 30250 130707 199179 -78242 121406
7584A21406p7922n4673O6985o3321j8743l20992k66015J16346L36379Q0674J01705
$$ 121406 43484 -11189 55796 -7525 -26268 -347260 -613275 -496929 -160550 -79876 21829
7573B1829K186L3795m491O7364K34275l1996j39043j34772j29980r9567Q8827
$$ 21829 24015 57810 53319 120683 354958 322962 183919 49147 -80833 -180400 -91573
7562i1573J12703j6719K9311p5754j54403m3212j20542Q8290R8041m1102j4086
$$ -91573 21130 4411 33722 -42032 -196435 -239647 -360189 -271899 -173858 -214960 -229046
7551b29046J66936R0879j03498m2955k83220j89401J17464J36396L5908R922q631
$$ -229046 -62110 28769 -74729 -117684 -400904 -590305 -472841 -336445 -300537 -290615 -299246
7540b99246Q6348K66194N9738n8457r5403J16822K2396o4564j07488j27312j04015
$$ -299246 -212898 53296 113034 54577 -40826 75996 98392 33828 -73660 -200972 -304987
7529c04987R9097J47519L7343r1182o3608O751j9163j13380K11324K17159k26592
$$ -304987 -205890 -58371 -21028 -112210 -175818 -169067 -188230 -301610 -90286 126873 -99719
7518i9719m70702K35543J75825J27731O7428J66477l7636M2701J0002J70800j7732
$$ -99719 -570421 -334878 -159053 -31322 36106 202583 164947 207648 217650 388450 370718
7507C70718j64668k2039p9775q5827j91122k586R2016M2809q3146K520k4603n296
$$ 370718 206050 184011 104236 18409 -172713 -175299 -83283 -40474 -123620 -121100 -145703 -150999
7495a50999J39920J88214p0324j44787K1002R7517n9353l0574J73747j9297o7652
$$ -150999 -11079 177135 106811 -37976 -16974 80543 21190 -9384 164363 145066 77414
7484G7414j69366K6466L6017n9028k30521K5592J10713M6960J82960K4735j42590
$$ 77414 -91952 -65486 -29469 -88497 -319018 -293426 -182713 -135753 47207 71942 -70648
7473g0648n7050q2346J65630K6933J5415j73903O5619Q7931J42879l26087K21989
$$ -70648 -127698 -210044 -44414 -17481 -2066 -175969 -110350 -22419 120460 -205627 16362
7462A6362K26682m5431j93461k17231j09481Q9812K8632K67801R1408j04732R5024
$$ 16362 243044 197613 4152 -213079 -322560 -232748 -204116 63685 155093 50361 145385
7451A45385J04597r1168j81290j02900J08284O4882k45869K6120K50762J51674
$$ 145385 249982 158814 -22476 -125376 -17092 47790 -198079 -171959 78803 230477
7441B30477j0795j01854o8118J44015l3378j62849m7053R3889J1221k66875j19
$$ 230477 219682 117828 49710 193725 160347 -2502 -49555 44334 55555 -211320 -211439
7430b11439J40521M2419j183Q8747j58395J27063L0853j15105K54669J29686j92494
$$ -211439 -70918 -28499 -29682 59065 -99330 27733 58586 -56519 198150 327836 135342
7419A35342k67995p1517K60718j31045p6663O9610Q5559k3540j58319J24344M5458
$$ 135342 -132653 -204170 56548 -74497 -151160 -81550 4009 -19531 -177850 -53506 -8048
7408h048m039O3154k48055K5219K02957j61526j89547l0l8786m7055K27088k0012
$$ -8048 -12087 51067 -196988 -171769 31188 -130338 -319885 -319915 -358701 -405756 -178668 -198680
7396a98680p4329m6396k7913R0066J8477J26166J8302n1187j28088O2756J34253
$$ -198680 -273009 -319405 -347318 -257252 -238775 -112609 -94307 -145494 -273582 -210826 -76573
7385g6573K57368o8875k74345q3368K07044J12705K3761N7930j37437o553L4587
$$ -76573 180795 111920 -162425 -245793 -38749 73956 97717 155647 18210 11657 46244
7374D6244Q5899J52653p1842k90932k6815k4058O2760R242J60693k43031J3679
$$ 46244 132143 284796 212954 -77978 -104793 -128851 -66091 -56849 103844 -139187 -125508
7363a25508Q4229j62698j25807o0716L17415q3931p7342L6364K4276K5464j27922
$$ -125508 -41279 -203977 -329784 -390500 -73085 -157016 -234358 -197994 -173718 -148254 -276176
7352b76176k7120k8206P7015j1946J11719k048N8353P8517n7483O4650o5330j27610
$$ -276176 -303296 -331502 -254487 -266433 -154714 -156762 -98409 -19892 -77375 -12725 -78055 -205665
7340b05665o8747o5467J8601J45000J78681N7851P1356J6849j04423Q9138j27939
$$ -205665 -274412 -339879 -321278 -176278 2403 60254 131610 148459 44036 133174 5235
7329E235k41583j14677l0388J46522N1713Q920n7405r435r3474J69746L06023
$$ 5235 -236348 -351025 -381413 -234891 -183178 -174258 -231663 -241098 -334572 -164826 141197
7318A41197n1861j57993n9208j87387J61269L14783j29384k07561j66914M4572
$$ 141197 89336 -68657 -127865 -315252 -153983 160800 31416 -176145 -343059 -298487
7308b98487J57093k46606o063j2207Q8708j04262J9890Q2354l6363n4722n9393
$$ -298487 -141394 -388000 -394063 -406270 -317562 -421824 -401934 -319580 -355943 -410665 -470058
7297d70058J62570J06386J64199q6647k04348j37547K66969L60802j4153j54605
$$ -470058 -307488 -201102 -36903 -123550 -327898 -465445 -198476 162326 148173 -6432
7287f432m2551J07254R4359j12919p5415j7759J49870J9782k13910P4278K0176
$$ -6432 -48983 58271 152630 39711 -35704 -53463 96407 116189 -97721 -23443 -3267
7276c267j05123o5060J8687O2044K5657L2061L8609p0411K266q1712j27777m2374
$$ -3267 -108390 -173450 -154763 -92719 -67062 -35001 3608 -66803 -64537 -146249 -274026 -316400
7264c16400Q6793J40089o3348L3644Q2268m8265n3728K089J34720J60422r7124
$$ -316400 -229607 -89518 -152866 -119222 -36954 -85219 -138947 -136858 -2138 158284 61160
7253F1160j09823M4341O7909N6065o7243P2544j18929l0700N0945k3058q2697
$$ 61160 -48663 -4322 63587 119652 52409 124953 6024 -24676 26269 3211 -79486
7242g9486j76728o4999M454J93680j15931J06820K01670L329o0864m4191o044
$$ -79486 -256214 -321213 -316759 -123079 -239010 -132190 69480 72809 11945 -32246 -38290
7231c8290L26490q7979j57044L3401j3894j71194Q325j05230O6002J10233L6558
$$ -38290 288200 200221 43177 76578 62684 -108510 -100185 -205415 -139413 -29180 7378
7220G378m4195j82242O2144K95653j2441k21116j22473K19301K06499M9957R0241
$$ 7378 -36817 -219059 -156915 138738 126297 -94819 -217292 2009 208508 258465 348706
7209C48706P4771j98090j47309O8085K2344j51110j0266n3841O3074J34135r2346
$$ 348706 423477 225387 78078 146163 168507 17397 7131 -46710 16364 150499 58153
7198E8153p4990j7109n0668J26291j18050J17612K1278p181r091j18261l0410
$$ 58153 -16837 -33946 -84614 41677 -76373 41239 62517 55336 46245 -72016 -102426
7187a02426j7057K8378K26450n0852k8002O697P4309q655K8672j40136L7470m1455
$$ -102426 -119483 -91105 135345 84493 56491 63188 137497 128842 157514 17378 54848 13393
7175A3393Q899R7130J40768n5069r8608j83586j19286Q7688M9342K2937J01809
$$ 13393 22292 119422 260190 205121 106513 -77073 -196359 -108671 -59329 -36392 65417
7164F5417m2698Q9107j13582J96932j44551k14129j25979j71798M8531p6401k378
$$ 65417 22719 111826 -1756 195176 50625 -163504 -289483 -461281 -412750 -489151 -491529
7153d91529K63510L48894o5748k98249j51945P6364K88412J86719k2423j04693
$$ -491529 -228019 120875 55127 -243122 -395067 -318703 -30291 156428 134005 29312
7143B9312j40312l3123k16560k4688l463J00388J74213J56186n0912J3708n9786
$$ 29312 -111000 -144123 -360683 -385371 -388834 -288446 -114233 41953 -8959 4749 -55037
7132e5037J07163j34102J04155K919q7790K5145j72985j8651R0292M960M0027
$$ -55037 52126 -81976 22179 25098 -62692 -37547 -210532 -229183 -138891 -133931 -93904
7121i3904J16189k0407j60063r7918K01254J06012k5184k99044K1447M4705k0181
$$ -93904 22285 1878 -158185 -256103 -54849 51163 25979 -273065 -251618 -206913 -227094
7110b27094l7166J29307K4327M8699j33455L598J8167O9747M0910O8413J6961
$$ -227094 -264260 -134953 -110626 -61927 -195382 -191784 -173617 -103870 -62960 5453 22414
7099B2414j48878N6415j43965j09177N0690J36451J7815P274j34558j41776O696
$$ 22414 -126464 -70049 -214014 -323191 -272501 -136050 -118235 -110961 -245519 -387295 -380599
7088c80599L04125M6332k3851R070Q9983n1353m3431J08462J95702j45065m0002
$$ -380599 -76474 -30142 -53993 -44923 45060 -6293 -49724 58738 254440 109375 69373
7077F9373l7094N5106m7482j22249l13269j802J66373R6303N3328r3740K26189
$$ 69373 32279 87385 39903 -82346 -395615 -397417 -231044 -134741 -81413 -175153 51036
7066E1036Q7270l6908j67678j43498r6040K6626j16274J49178J11647J30403P0449
$$ 51036 138306 101398 -66280 -209778 -305818 -279192 -395466 -246288 -134641 -4238 66211
$$ [...]
##END NTUPLES=NMR SPECTRUM
##END=
