##TITLE=Analysis number 329679
Compound Code cc 67113
Book Reference 513/131/38
Project Code adrs
Chemist Name ronp
##JCAMPDX= 6.0         $$ Bruker NMR JCAMP-DX V2.0
##DATA TYPE= NMR SPECTRUM
##DATA CLASS= NTUPLES
##ORIGIN= Bruker BioSpin GmbH
##OWNER= nmr
$$ XWIN-NMR		Version 3.5
$$ Mon Sep 24 09:38:13 2007 GMT Daylight Time (UT+1h)  MAYBRIDGE\nmr@NMR_250MHZ
##.OBSERVE FREQUENCY= 250.131544655141
##.OBSERVE NUCLEUS= ^1H
##.ACQUISITION MODE= SIMULTANEOUS (DQD)
##.ACQUISITION SCHEME= undefined
##.AVERAGES= 16
##.DIGITISER RES= 18
##SPECTROMETER/DATA SYSTEM= dpx250
##.PULSE SEQUENCE= zg30
##.SOLVENT NAME= CDCl3
##.SHIFT REFERENCE= (INTERNAL, CDCl3, 0, 16.522)
##AUDIT TRAIL= $$ (NUMBER, WHEN, WHO, WHERE, WHAT)
$$ ##TITLE= Audit trail, XWIN-NMR		Version 3.5
$$ ##JCAMPDX= 5.01
$$ ##ORIGIN= Bruker BioSpin GmbH
$$ ##OWNER= nmr
$$ C:\u/data/dgb/nmr/ADRS/2170/pdata/1/auditp.txt
$$ ##AUDIT TRAIL=  $$ (NUMBER, WHEN, WHO, WHERE, WHAT)
(   1,<2007-09-24 09:37:36.80 +100>,<MAYBRIDGE\nmr>,<NMR_250MHZ>,
      <created by zg, POWCHK disabled, PULCHK disabled
       configuration hash MD5:
       76 6E 9A 78 1E 09 19 81 EC 84 63 8F B0 6A 59 2D
       data hash MD5: 64K
       8F 85 33 05 52 7E E1 32 40 AA 70 04 22 27 3F F6>)
(   2,<2007-09-24 09:37:57.49 +100>,<MAYBRIDGE\nmr>,<NMR_250MHZ>,
      <Start of raw data processing
       ef LB = 0.3 FT_mod = 6 PKNL = 1 SI = 32K 
       data hash MD5: 32K
       1B D6 A3 5F 84 D1 DD 65 76 44 86 66 D7 CC 9D 01>)
(   3,<2007-09-24 09:37:59.22 +100>,<MAYBRIDGE\nmr>,<NMR_250MHZ>,
      <apk 
       data hash MD5: 32K
       2F 47 83 F9 E6 FF 46 F9 98 4F FB 18 9B 00 F6 62>)
(   4,<2007-09-24 09:37:59.96 +100>,<MAYBRIDGE\nmr>,<NMR_250MHZ>,
      <abs ABSG = 5 
       data hash MD5: 32K
       51 E8 E2 96 E0 91 53 F9 4A 78 E2 6F B9 3A BF D5>)
$$ ##END=
$$ 
$$ hash MD5
$$ FF B1 97 FC 73 4F CA 50 75 6D 64 16 B6 67 9E 43
##$RELAX= 
##$RELAX= 
##$RELAX= 
##$RELAX= 
##$RELAX= 
##$RELAX= 
##$RELAX= 
$$ Bruker specific parameters
$$ --------------------------
##$DU= <C:\u>
##$EXPNO= 2170
##$NAME= <ADRS>
##$PROCNO= 1
##$TYPE= <nmr>
##$USER= <dgb>
##$AMP= (0..31)
100 100 100 100 100 100 100 100 100 100 100 100 100 100 100 100 100 100 
100 100 100 100 100 100 100 100 100 100 100 100 100 100 
##$AQSEQ= 0
##$AQ_mod= 3
##$AUNM= <au_zg>
##$AUTOPOS= <4 >
##$BF1= 250.13
##$BF2= 250.13
##$BF3= 250.13
##$BF4= 250.13
##$BF5= 500.13
##$BF6= 500.13
##$BF7= 500.13
##$BF8= 500.13
##$BYTORDA= 1
##$CFDGTYP= 0
##$CFRGTYP= 5
##$CHEMSTR= <none>
##$CNST= (0..31)
1 1 145 1 1 1 1 1 1 1 1 1 1 1 1 1 1 1 1 1 1 1 1 1 1 1 1 1 1 1 1 1 
##$CPDPRG= <>
##$CPDPRG1= <>
##$CPDPRG2= <>
##$CPDPRG3= <>
##$CPDPRG4= <mlev>
##$CPDPRG5= <mlev>
##$CPDPRG6= <mlev>
##$CPDPRG7= <mlev>
##$CPDPRG8= <mlev>
##$CPDPRGB= <>
##$CPDPRGT= <>
##$D= (0..31)
0 1 0 0 0 0 0 0 0 0.06 0 0 0 0 0 0 0.0002 0 0 0 0 0 0 0 0 0 0 0 0 0 0 
0 
##$DATE= 1190623054
##$DBL= (0..7)
120 120 120 120 120 120 120 120 
##$DBP= (0..7)
150 150 150 150 150 150 150 150 
##$DBP07= 0
##$DBPNAM0= <>
##$DBPNAM1= <>
$$ [...]
##$SUBNAM7= <"">
##$SUBNAM8= <"">
##$SUBNAM9= <"">
##$SW= 20.6930455092707
##$SWIBOX= (0..15)
0 0 3 0 0 0 0 0 0 0 0 0 0 0 0 0 
##$SW_h= 5175.983436853
##$TD= 65536
##$TD0= 1
##$TE= 296.16
##$TE2= 300
##$TE3= 300
##$TEG= 300
##$TL= (0..7)
0 120 120 120 120 120 120 120 
##$TP= (0..7)
150 150 150 150 150 150 150 150 
##$TP07= 0
##$TPNAME0= <>
##$TPNAME1= <>
##$TPNAME2= <>
##$TPNAME3= <>
##$TPNAME4= <>
##$TPNAME5= <>
##$TPNAME6= <>
##$TPNAME7= <>
##$TPOAL= (0..7)
0.5 0.5 0.5 0.5 0.5 0.5 0.5 0.5 
##$TPOFFS= (0..7)
0 0 0 0 0 0 0 0 
##$TUNHIN= 0
##$TUNHOUT= 0
##$TUNXOUT= 0
##$USERA1= <user>
##$USERA2= <user>
##$USERA3= <user>
##$USERA4= <user>
##$USERA5= <user>
##$V9= 5
##$VALIST= <valist>
##$VCLIST= <CCCCCCCCCCCCCCC>
##$VD= 0
##$VDLIST= <DDDDDDDDDDDDDDD>
##$VPLIST= <PPPPPPPPPPPPPPP>
##$VTLIST= <TTTTTTTTTTTTTTT>
##$WBST= 1024
##$WBSW= 4
##$XGAIN= (0..3)
0 0 0 0 
##$XL= 0
##$YL= 0
##$YMAX_a= 405816
##$YMIN_a= -560498
##$ZGOPTNS= <>
##$ZL1= 120
##$ZL2= 120
##$ZL3= 120
##$ZL4= 120
##$ABSF1= 16.522
##$ABSF2= -4.171173
##$ABSG= 5
##$ABSL= 3
##$ALPHA= 0
##$AQORDER= 0
##$ASSFAC= 0
##$ASSFACI= 0
##$ASSFACX= 0
##$ASSWID= 0
##$AUNMP= <proc_1d>
##$AZFE= 0.1
##$AZFW= 0.1
##$BCFW= 0
##$BC_mod= 0
##$BYTORDP= 0
##$COROFFS= 0
##$CY= 12.5
##$DATMOD= 1
##$DC= 0
##$DFILT= <>
##$DTYPP= 0
##$F1P= 14.0000005364418
##$F2P= -0.99999901652339
##$FCOR= 0.5
##$FTSIZE= 32768
##$FT_mod= 6
##$GAMMA= 0
##$GB= 0
##$INTBC= 1
##$INTSCL= 1
##$ISEN= 128
##$LB= 0.3
##$LEV0= 0
##$LPBIN= 0
##$MAXI= 10000
##$MC2= 0
##$MEAN= 0
##$ME_mod= 0
##$MI= 0
##$NCOEF= 0
##$NC_proc= -3
##$NLEV= 6
##$NOISF1= 0
##$NOISF2= 0
##$NSP= 0
##$NTH_PI= 0
##$NZP= 0
##$OFFSET= 16.522
##$PC= 1
##$PHC0= 152.9135
##$PHC1= 9.570618
##$PH_mod= 1
##$PKNL= yes
##$PPARMOD= 0
##$PSCAL= 4
##$PSIGN= 0
##$REVERSE= no
##$SF= 250.13
##$SI= 32768
##$SIGF1= 0
##$SIGF2= 0
##$SINO= 400
##$SIOLD= 32768
##$SREGLST= <1H.CDCl3>
##$SSB= 0
##$STSI= 32768
##$STSR= 0
##$SW_p= 5175.98343685301
##$SYMM= 0
##$S_DEV= 0
##$TDeff= 65536
##$TDoff= 0
##$TI= <Analysis number 999999
Compound Code 99
Book Reference 9
Project Code 9>
##$TILT= no
##$TM1= 0
##$TM2= 0
##$TOPLEV= 0
##$USERP1= <user>
##$USERP2= <user>
##$USERP3= <user>
##$USERP4= <user>
##$USERP5= <user>
##$WDW= 1
##$XDIM= 32768
##$YMAX_p= 367162025
##$YMIN_p= -103545
$$ End of Bruker specific parameters
$$ ---------------------------------
##NTUPLES= NMR SPECTRUM
##VAR_NAME=  FREQUENCY,     SPECTRUM/REAL,   SPECTRUM/IMAG
##SYMBOL=    X,             R,               I
##VAR_TYPE=  INDEPENDENT,   DEPENDENT,       DEPENDENT
##VAR_FORM=  AFFN,          ASDF,            ASDF
##VAR_DIM=   32768,         32768,           32768
##UNITS=     HZ,            ARBITRARY UNITS, ARBITRARY UNITS
##FACTOR=    0.157963299565203, 1,           1
##FIRST=     4132.6476996994, 0,             0
##LAST=      -1043.33573715361, 0,           0
##MIN=       -1043.33573715361, -103545,     0
##MAX=       4132.6476996994, 367162025,     0
$$ Real data points
##PAGE= N=1
##DATA TABLE= (X++(R..R)), XYDATA
$$ [...]
18803D7277K6810J6698J0001J0850L5190M5364L0313M5871K0213k396k2269l8310
18791B25612k0178K1466N667p044K0138M5067M3032M2775J5327K1146m550Q538
18779D16996K3385j1812p4109n3305j7829L411N368P931n005K2886P8636J07063
18767E03616k1733r1724o5380o1198m1738l9942m6022n0531k4289j8437j6878
18756B5744j7407J225K1250L802R200m214k435k242k0077k1150j5943r296j0255
18743d1798K6414K4501L795j5029n834Q464m263j433J0841j1381K151P989m254
18730A63q120N364o194j5860o878J4755M655J4069J7303L641K673l411n103J2577
18716B9634J8926l191Q312Q278j1977o388o96J9491o959J2793J1328j7464j5396
$$ y = [47277, 74087, 90785, 100786, 111636, 146826, 192190, 222503, 268374, 288587, 286191, 263922, 225612, 205434, 226900, 232567, 225523, 245661, 290728, 333760, 376535, 391862, 413008, 408458, 416996, 440381, 428569, 354460, 301155, 283326, 286737, 292105, 300036, 295031, 317917, 396553, 503616, 481883, 390159, 324779, 263581, 221843, 181901, 135879, 85348, 61059, 42622, 25744, 8337, 9562, 30812, 34614, 43814, 39600, 37165, 34923, 14846, -6304, -22247, -31543, -41798, -15384, 9117, 12912, -2117, -7951, 513, -3750, -5183, 5658, -5723, -3572, 4417, 163, -7957, -2593, -8787, -24647, -31525, -16770, -12115, 1954, 19257, 22898, 25571, 22160, 17057, 29634, 48560, 45369, 53681, 61959, 49982, 43594, 42898, 62389, 55430, 68223, 79551, 62087, 46691]
18703D6691N831J4564J9m944l749K395R112J6422P456k4929j0914Q234J4809J0058
18689I1055q004k589P716j051M24n46L9490N5941J2222J0775J0654j1093l0242
18676A74752l6239m2581j3589j0210j6563j0716j6052r811O287k1203j4529o861
18664a7315L662J8405p093M040k485J0333N771n947r689O797j4972J4206M610
18651A0323j5832j8835j3978J887k615j2445O189K0413L0622K5656l83L631j5760
18638A8873k0057l902j7461k1785l368L584j3762O665J2679j36M983K5890J3766
18625E969n835J0998m21k9696P97K9586O787j4437l607j41L0945q928k3454j6474
18611a7911q937Q369J3551O544j944J0175K732J285j9120k5636j8477J9788l717
$$ y = [46691, 52522, 67086, 67105, 62161, 58412, 60807, 69919, 86341, 93797, 68868, 57954, 66188, 80997, 91055, 83051, 80462, 88178, 87127, 87551, 87005, 126495, 182436, 194658, 205433, 216087, 204994, 174752, 138513, 95932, 82343, 72133, 55570, 44854, 28802, 18991, 25278, 4075, -10454, -17315, -13653, 4752, -2341, 1699, -786, 9547, 15318, 9371, -318, 6479, -8493, 5713, 10323, -5509, -24344, -38322, -36435, -39050, -51495, -45306, -24893, 5729, 31385, 31002, 34633, 18873, -1184, -5086, -22547, -44332, -47700, -44116, -57878, -51213, -38534, -38670, -33687, -7797, 5969, 134, 11132, 10711, -18985, -18188, 11398, 18185, 3748, 141, 0, 30945, 22017, -1437, -17911, -26848, -18479, -4928, 1616, -328, 9847, 12579, 13864, -5256, -30892, -49369, -29581, -33298]
18598c3298j3513J8793L2562j769j1062k539j5312j0846j974L315K6982k59l541
18585a2461K220J741K467q921k6539J4348L5669R25k3818J890K1816R275l293
18572A5319j7542R982J3835O457p166R79k1237k1064o288j7173l785J2233J4098
18559b1352K499K2183j7409k0392R057K7184K2841j6229m045J8271j7817k3602
18547a8811J4057J3988j1555L838n963m4J9634J1050j8684p86j3379k050P002
18534a703k0562j8523K6572n991K0111J3178R874n815J9712J3716N806R905M960
18521G1240K367J0158J2492Q734L7517N7122L2610J9963M1660P0106K0553j2405
18509C72117l4480l4020l697Q374J8798K5989M1669M3372L4077N5360N3283L7249
$$ y = [-33298, -46811, -28018, 4544, 2775, -8287, -10826, -26138, -36984, -38958, -35643, -8661, -8920, -12461, -10241, -8500, -6033, -14954, -41493, -27145, 8524, 9449, -14369, -12479, 9337, 18612, 15319, -2223, 7759, 21594, 28051, 20885, 21864, 627, -20437, -26725, -43898, -47683, -35450, -21352, -18853, 3330, -14079, -34471, -25414, 1770, 24611, 8382, 4337, 22608, 4791, -18811, -4754, 9234, -2321, 1517, -4446, -4490, 15144, 26194, 7510, 6724, -6655, -8705, -1703, -22265, -40788, -14216, -20207, -96, 13082, 22956, 17141, 36853, 50569, 56375, 66280, 71240, 73607, 83765, 96257, 104991, 142508, 199630, 232240, 252203, 293863, 363969, 384522, 372117, 337637, 303617, 299920, 308294, 327092, 353081, 394750, 438122, 472199, 527559, 580842, 618091]
18497F18091O955l3320n4625m0835l2603k5994j9033j4825k5012m3698r361J7122
18485C42862J7107k2329l2044p2379l5044J989k7544o5632m3610j8535k292R976
18473E2525j7120m72j0159j7J371J5518j7230j3196o288p448O790K744N240O843
18459A9101L720J2560r209J1996k720j543J7725K5003K906j7591m222j9309k3618
18446A4799K5901J3459o365p298J951J987n947m523j713k5085l44k236k370q222
18432f006l2018k229L2438J4143j8907m344j3178J095N510J3645J5971P573m221
18419I472j0064l3080j8040L47K2498J4177K293j3217R354k046J3056k9796j4750
18406d9796j1754K0296J5354J081j3540J3258L2867J0415k5061k0297J5317J7090
$$ y = [618091, 625046, 591726, 537101, 496266, 463663, 437669, 418636, 403811, 378799, 335101, 325740, 342862, 359969, 337640, 305596, 233217, 198173, 200162, 172618, 106986, 63376, 44841, 42549, 52525, 35405, 34933, 24774, 24757, 26128, 41646, 24416, 11220, 4932, -2516, 4274, 7018, 12258, 19101, 22821, 35381, 26172, 38168, 35448, 33905, 51630, 76633, 79539, 61948, 57726, 38417, 14799, 40700, 54159, 47794, 40496, 42447, 44434, 38487, 33964, 32251, 7166, 6822, 4586, 2216, -6006, -38024, -40253, -7815, 6328, -12579, -16923, -30101, -29006, -23496, -9851, 6120, 13693, 9472, -592, -33672, -51712, -51365, -28867, -14690, -12397, -25614, -16260, -18306, -5250, -35046, -49796, -61550, -41254, -25900, -24819, -38359, -25101, 7766, 18181, -6880, -27177, -11860, 5230]
18394E230L9200J3640j3094j4866M422J265j1889k2180m651J850j1548j7817n135
18381c5573J7501K6724N657j6226p925j6204p316n600J4964J3396J8099k0078
18369a2581k9289J9758J5692P529K90L0640R656o934N230N288k7861j112m837
18356A1469J2671J1237o95q557r469m345j521l882k5252N50K2876J1133J4186
18343C0401K1934m5700j7324J1805R08n911J7353P747N913p689j6826N469l900
18330D180Q79q867j7066K282m804j001J8905k782L575n19j3103P778n991q384
18316b4918q925K3404O315p129M78j8269n31K1562j800k1722O312K1094M802o181
18302e508J1556J3084j487n99k882L69j9633l290n427j5984j1765J5302R705l239
$$ y = [5230, 44430, 58070, 44976, 30110, 34532, 35797, 23908, 1728, -2923, -1073, -12621, -30438, -35573, -18072, 8652, 14309, -1917, -9842, -26046, -33362, -38962, -23998, -10602, 7497, -12581, -41870, -22112, -6420, 1109, 1399, 32039, 41695, 34761, 39991, 45279, 17418, 16306, 11469, 24140, 35377, 34682, 26125, 16656, 12311, 10790, 6908, -18344, -17794, 5082, 16215, 30401, 52335, 6635, -10689, 1116, 2024, -3887, 13466, 21213, 27126, 19437, 2611, 8080, 4180, 5059, -3808, -20874, -18592, -23396, -24397, -5492, -8274, -4699, -5218, -18321, -10543, -16534, -24918, -33843, -10439, -4124, -11253, -10775, -29044, -29575, -8013, -9813, -31535, -25223, -4129, 673, -5508, 6048, 19132, 17645, 17046, 14164, 14533, -5100, -8390, -13817, -29801, -41566, -26264, -16559, -19798]
18288a9798J0398J4485J1700l787J83n959n693M036J7521K1059L3098N43l8368
18275C9418n514j9434q394o729j5179r64m802r782m806J6209J2982j6721J431
18262b2285j129M940J3900P604R273k118O016l383m464r806J0334k6810k1860
18249c9788m299L0623N637r923M012K1194j390k6460j100j6068N080K5482q192
18236a5192j6345J0286M661J2719k138j0497m035Q112J5820J5726j0952o993j775
18223f03J3L748r213M878r441K7069J6385r265l5416n319N571J3746J1175j8503
18209e175p583m463j924Q331M909L19K6346M445j2270j7740J2159K1560j3352
18196A5562k1013k3416k5134K0846O180O525M3125R745K4142M309k3015R282K3274
$$ y = [-19798, -9400, 5085, 16785, 12998, 13181, 7222, 1529, 5565, 23086, 44145, 77243, 77786, 39418, 33904, 14470, 6076, -653, -15832, -16796, -21598, -31380, -36186, -19977, -6995, -23716, -22285, -23414, -18474, -4574, 3030, 12303, 10185, 16201, 12818, 8354, -1452, 8882, -17928, -39788, -44087, -13464, -7827, -17750, -13738, 7456, 6066, -20394, -21494, -37562, -32482, -7000, -15192, -31537, -21251, -16590, -3871, -6009, -16506, -20541, -12429, 3391, 19117, 8165, 1172, -603, -590, 3158, -6055, -1177, -10618, 16451, 32836, 23571, -11845, -17164, -11593, 2153, 13328, -5175, -12758, -17221, -19145, -10814, -5905, -5586, 20760, 25205, 12935, -4805, 7354, 28914, 15562, -5451, -28867, -54001, -33155, -26975, -20450, 22675, 32420, 56562, 60871, 37856, 47138, 70412]
18183G0412n25k4633K926J4612m069j320n284j9292r440J5936K3458k2703k1669
18170A8409k4634q935J0397J82l139K1834J5464N314M7568r35k0695Q211j3526
18157E5515k3713O717K7073K9048l612k8861k3816J6611K8816L0170J1258l756
18145A21450m937Q590J2042Q112j1754J0491K7113L1673O237l44J7298L1255N3617
18132C10843M3260L5093P2557R5730N1446O9530J45391J57092J92044K53535L26951
18121A753472K94912K61740K83077M13372N57718P46415J080794J592539K553975
18112I538014M598435Q826543J4794135R275498q348739j1872832j0593396o427168
18104I790490l303870j811219j110772p78710n36093m15572l48078k70290j89693
$$ y = [70412, 69887, 45254, 48180, 62792, 58723, 57403, 52119, 32827, 23387, 39323, 62781, 40078, 18409, -6225, -15160, -4763, -4581, -7720, 14114, 29578, 34892, 82460, 81525, 60830, 69041, 55515, 31802, 38519, 65592, 94640, 91028, 62167, 38351, 54962, 83778, 113948, 125206, 121450, 116513, 125103, 137145, 145257, 133503, 143994, 171107, 202780, 209017, 208673, 225971, 257226, 310843, 354103, 389196, 461753, 557483, 608929, 678459, 823850, 980942, 1172986, 1426521, 1753472, 2048384, 2310124, 2593201, 3006573, 3564291, 4310706, 5391500, 6984039, 9538014, 14136449, 22962992, 37757127, 47032625, 38683886, 26811054, 16217658, 9790490, 6486620, 4675401, 3564629, 2785919, 2249826, 1834254, 1486176, 1215886, 1026193]
18095A026193j11320o2302q1850p0697q0003q5295p4283n0844m2747k1443l1938
18084C13471j7626l0610j3414k4196j4319K339l861k5824k1389l6213k0001K9621
18072A37978p7m562k5749m4884j1852N233k045j6190j3792J2144O362j677j068
18059C9821O88p036l013j2679R294J5517K8774k808q52O300L787l531R933k240
18045H1955r091l5570K4335R694n295p131k182k8511j4745J1835J1167k9455M632
18032A1638j714p644j1607M051J0933K0615j568o501j900n948R561j0034j0607
18019g25K8790K6604k912k1771n563o010K2488O863r531k1569j0655m737J6347
18006A7619J5639q023n556j2259J665Q371J784R362m064j559P290m538K42K709
$$ y = [1026193, 914873, 852571, 770721, 700024, 620021, 534726, 460443, 409599, 366852, 345409, 313471, 295845, 265235, 251821, 227625, 213306, 215645, 211784, 185960, 164571, 128358, 108357, 137978, 137901, 133339, 107590, 62706, 50854, 56087, 54042, 37852, 24060, 36204, 42566, 40889, 39821, 40509, 33473, 30460, 17781, 27075, 42592, 71366, 68558, 67706, 74006, 77793, 74262, 84195, 81955, 72864, 37294, 61629, 71323, 66028, 58897, 56715, 28204, 13459, 25294, 36461, 7006, 11638, 9924, 2280, -9327, -5276, 5657, 26272, 24704, 18203, 16303, 10355, 19916, 9882, -725, 28065, 54669, 51757, 29986, 24423, 18413, 40901, 47764, 38233, 16664, 6009, 1272, 17619, 33258, 25235, 19679, 7420, 9085, 17456, 19240, 28602, 24538, 22979, 30269, 25731, 25973, 28682]
17992B8682k3602j5598O84k9850P195J9001K6029J4255K3286J8850K1082j5421
17980G4593l8380j2869j2156j9319k4448p445K3629J5164L873j6555j7700J1064
17968b0549O892L7059J9647m703k020J5389q911q287l759J1813k3191k9089k309
17955a2018J9544L6844J2827m0079k3106j8239K6863q875j2390n844J3907j0940
17943b1506q94P518J4415K591R34m975K33j73k4156M496K5742K711m1832j967
17929c6863m23l92J857L740K1936L2987K375R73o083Q689j1936K491J1896L0844
17915F2091J4159n572K3296J2798l1758j6371j0915j3172j2264j1964m738R56
17903F546Q693L650Q770K4398M358m7944R328J2699j7761j0585O517k0076K4543
$$ y = [28682, 5080, -10518, -9834, -39684, -32489, -13488, 12541, 26796, 50082, 68932, 90014, 74593, 36213, 23344, 11188, -8131, -32579, -40024, -16395, -1231, 2642, -13913, -31613, -20549, -13657, 23402, 43049, 38346, 36326, 51715, 42804, 34517, 30758, 42571, 19380, -9709, -12018, 7526, 44370, 57197, 17118, -5988, -24227, 2636, -6239, -18629, -24473, -10566, -21506, -22400, -14882, -467, 2124, 3058, -1917, -1684, -1857, -26013, -21517, 4225, 6936, -34896, -36863, -37286, -37678, -35821, -32081, -10145, 22842, 25217, 26190, 20107, 28796, 16860, 19351, 31247, 62091, 76250, 70678, 93974, 106772, 75014, 58643, 47728, 34556, 22292, 10328, 5590, 6546, 15239, 18889, 27659, 52057, 56415, 8471, 17799, 30498, 12737, 2152, 8669, -11407, 13136]
17890A3136J8892M417K2986O602o46Q445j6548j7009j3943Q910q564m671j0088
17877A1919r776J0096J9524j6730l4111r171K1183K7832K826j25k1870J3675K03
17864A5475j7689q904J3022P160j5116l67J9773j3975j0460O580K2884J559j2194
17851G748o884P848P617j0352K537p171M550K798m141R634j122J0067n364P70
17837A8535L647K374J0270J6145J7337j6762l9955j3613N838o967k351R498O423
17824A0419k7863o685R404K1719J4458O281J1729N225j4654k2454k29J4112l195
17811A8267j3911J086N679M800K602J0093k2172j5834M394J9523R040O593L5537
17798F5697J7443j8879k7293k7783l640K7526p540j5366O990J3525r40m78J9353
$$ y = [13136, 32028, 36445, 59431, 66033, 65387, 73832, 57284, 40275, 26332, 35242, 26678, 22007, 11919, 2143, 12239, 31763, 15033, -19078, -28249, -7066, 20766, 23592, 23467, 1597, 15272, 15475, -2214, -11118, 1904, 9064, -6052, -6419, 13354, -621, -11081, -4501, 18383, 19942, 7748, 864, 8712, 16329, 5977, 8514, 1343, 5893, 8691, 4550, 14184, 13062, 23129, 17765, 18535, 22182, 24556, 34826, 50971, 68308, 51546, 11591, -2022, 3816, -3151, -5502, 3996, 10419, -17444, -24129, -14725, 6994, 21452, 27733, 39462, 44687, 30033, 7579, 7350, 21462, 18267, 4356, 5442, 11121, 15921, 18523, 28616, 6444, -9390, -4996, 14527, 23567, 30160, 65697, 83140, 64261, 36968, 9185, 5545, 33071, 25531, 10165, 17155, 30680, 29740, 29262, 48615]
17785D8615J56n214J0940j054q526j518m388J147R461j2826L810n358Q319m35
17771D3129k12Q944K1598l911q154j516K26N50M359j4203m329R629q818J7088
17757F4380J2230l700l3588r427J1524K67R637K3990q441j8912o903J9790m445
17744E6402l0608L6922J6669K062p510P023m078r736J8901J681m845j0919O204
17731G8168o454o648p837P303N789J8467k1284l6782j9822Q161K595J9066J5279
17718E6001o520j6141j8861L753J0806o417k243Q035j9503j875J5208L256j1464
17705A4035K539J0314J1482K493m511j8792n669K6207K4991P787j8545j0421J3196
17692E5106p775r265Q152p251j2143L096j175j3631J1579k869l169k0437j934
$$ y = [48615, 48771, 43557, 54497, 53443, 44917, 43399, 39011, 40158, 49619, 36793, 40603, 35245, 43564, 43129, 42917, 51861, 73459, 69548, 61394, 59878, 60104, 60654, 65013, 50810, 46481, 56110, 47292, 64380, 76610, 72910, 39322, 29895, 41419, 41686, 51323, 75313, 66872, 47960, 41057, 60847, 56402, 25794, 62716, 79385, 81447, 73937, 80960, 76882, 67146, 86047, 87728, 82883, 71964, 78168, 71714, 65066, 57229, 64532, 70321, 88788, 67504, 30722, 10900, 19061, 21656, 40722, 56001, 49481, 33340, 14479, 18232, 29038, 22621, 20378, 28413, 8910, 7035, 22243, 25499, 14035, 16574, 26888, 38370, 40863, 36352, 17560, 11891, 38098, 63089, 70876, 52331, 41910, 55106, 47331, 38066, 46218, 38967, 26824, 29920, 28745, 15114, 26693, 23824, 20655, 218, -1716]
17679a716M151J13M219J72o985J3572J2263k999J168o949j1971o412K282N98J5556
17664A7062l811l627N01J3079k264m770K9945o072l432n959O256n223q341r136
17650A4208M42n178J2631J4739l0243j5989L239J8444J8680k1777j7716k02J4639
17637E917J7908P624K2764Q422j2523J7088O443K1992R739P092j267k963J2282
17624A20518k1271k1070l615k5765k2656n963n793L476Q802J432k186J5665l49
17611D1225l6461k0562K683P194J0066J2534L881J447J4657j0363j2932j3469
17599a00J2868j87K982J1592k3739l725N495k7359M480L3785J1090j6864l315
17586G003n042r833J0868K3527J3325o386j0993q86j2053n340l108j109j6678
$$ y = [-1716, 2435, 2548, 6767, 6939, -46, 13526, 25789, 22790, 23958, 17009, 5038, -1374, 908, 1506, 17062, 13251, 9624, 10125, 23204, 20940, 16170, 46115, 40043, 36611, 30652, 36908, 31685, 23344, 14208, 14650, 9472, 22103, 36842, 6599, -9390, -6151, 12293, 30973, 9196, -8520, -8722, 5917, 23825, 31449, 54213, 62635, 50112, 67200, 73643, 95635, 105374, 112466, 111199, 108236, 120518, 99247, 78177, 74562, 48797, 26141, 20178, 14385, 17861, 26663, 28095, 25909, 41574, 41225, 4764, -15798, -13115, -5921, 4145, 16679, 20560, 22007, 36664, 26301, 13369, -100, 12768, 12581, 15563, 27155, 3416, -309, 5186, -22173, -17693, 16092, 27182, 10318, 7003, 1961, -7872, 2996, 26523, 39848, 33462, 22469, 21583, 9530, 4190, 1082, -27, -16705]
17573a6705j6091j4503K7786J7163k753J123m959p348K1094J9777K3213j2038
17561C5759j7247q22N476k7243m05L641Q57K439j137k1762K3351L6853l803k4961
17547A0996k2458j9919j3516K899j696K0795K844j1648K647o624n420J2269J9526
17534i305J2381J2909K988l742l5637j8714K4939K5409o148j4465Q874N350J9894
17521B4733o434j6860p162J3431J1525L315m674j4164k1946j5028K5798J2454
17509D988p287m877j3509k4410q252J11L1436M576K470L571O724k0458k5835K2027
17495b8725J6916N429J3263K763J3738q387j7174R0J1067J3341j809r746k8471
17482a7705N533p01n918K848K7267P724j0090k3729j4341J223M341K5969K9391
$$ y = [-16705, -32796, -47299, -19513, -2350, -5103, -3980, -8939, -16287, 4807, 24584, 47797, 35759, 18512, 17690, 23166, -4077, -4482, -841, 16, 2455, 1318, -20444, 2907, 39760, 35957, 10996, -11462, -31381, -44897, -41998, -43694, -22899, -20055, -31703, -29056, -35680, -41100, -28831, -9305, 3076, 15985, 18973, 15231, -20406, -39120, -14181, 11228, 5080, -9385, -511, 4839, 24733, 18299, 1439, -5723, 7708, 19233, 22548, 17874, 3710, -18236, -33264, -7466, 4988, -2299, -7176, -20685, -45095, -53347, -53236, -21800, -17224, -14754, -11183, -4459, -24917, -50752, -28725, -11809, -6380, 6883, 9646, 23384, 14997, -2177, -2087, 8980, 22321, 20512, 10766, -17705, -12172, -12873, -18791, -15943, 11324, 19048, 8958, -14771, -29112, -27889, -23548, 2421, 31812]
17469C1812q922l7549k1070J2720P647j111j6525k4257o450O256J5260J9531K0037
17456b621J1563j3443N343m804m142N736J3937J033L019L2469j549o574M2805
17443H2772R6154O0483n5497p5211l7954l1221j3239O25k3573j9380O614q695
17431a8122K1660j1911k4154J9250N047M287l749j4020j0052K2269J2446l352
17419d01N530k0761j7954K4354R467r247n444j2953J5965K0063J2k8217J762J0821
17405g003k204m283k0725o03J6200j707j7455J1084R941Q481j6796P174P852r461
17391a9505k1012j3328J061K1111K7624m334l3411q395k783m434P959K402N993
17378d1052P782k2323N534K6466K867R920L555j5145j3249P395J7344j7850K1524
$$ y = [31812, 22890, -14659, -35729, -23009, -15362, -16473, -32998, -57255, -63705, -57449, -42189, -22658, -2621, 8942, -4501, 842, -3962, -8104, -2368, 11569, 12602, 15621, 48090, 46541, 39967, 82772, 178926, 239409, 183912, 108701, 70747, 39526, 26287, 26912, 3339, -16041, -9427, -18122, 3538, -8373, -32527, -13277, -8230, -3943, -7692, -21712, -31764, -9495, 2951, -401, 5129, -15632, -33586, -9232, 235, -9012, -14456, -27409, -11444, 8619, 8631, -19586, -17824, -7003, -9207, -13490, -34215, -34818, -18618, -20325, -37780, -26696, -16755, -8274, -25070, -17896, -10044, -19505, -40517, -53845, -52784, -31673, -4049, -8383, -41794, -50189, -52972, -57406, -49447, -47045, -41052, -33270, -55593, -50059, -23593, -20726, -10806, -7251, -22396, -35645, -28250, -10906, -28756, -7232]
17365g232K3872j3055n283o05m861p511j2098j2822j9426J0516L7308P383n828
17352i642J553r979j5842J1917n405j9924J7771J4045P208K801O096P737J1711
17339B0047j4948j6855O745J936M30J8997n18j7784k3058j6085K2267J4435O745
17326B354k695p623o522k1511P355K5011p573j1178k7325j8842M648K0064Q980
17313c4857K4650j6330o546k752K3281n988J4722J674J0928O32P779J2704k298
17300B7599K5264L002k1613j6148k4652j3209l167J9345J0886j6008j0264l570
17288b2535m174l784l405k800L457p267l824Q565J1806L2901J4053J715j2769
17275A1939R80n970j0642K020k071j1864j8357P646J5416J5502j8480k832j5434
$$ y = [-7232, 16640, 3585, -1698, -2303, -7164, -14675, -26773, -39595, -59021, -48505, -11197, -3814, -9642, -8089, -18068, -33910, -21993, -27398, -47322, -29551, -15506, -8298, -5497, 599, 8336, 20047, 5099, -11756, -5011, -3075, -2645, 16352, 15834, -1950, -25008, -41093, -18826, -4391, 2354, -341, -7964, -14486, -35997, -28642, -3631, -11204, -22382, -49707, -68549, -63901, -43837, -34857, -10207, -26537, -33083, -35835, -12554, -18542, -3820, -2146, 8782, 9414, 17193, 29897, 27599, 52863, 55865, 34252, 18104, -6548, -19757, -22924, -3579, 7307, -8701, -18965, -22535, -26709, -30493, -33898, -36698, -33241, -40508, -44332, -35767, -23961, 8940, 22993, 24708, 11939, 12919, 6949, -3693, -1673, -3744, -15608, -33965, -26319, -10903, 4599, -13881, -16713, -32147]
17262c2147M475p530j1186K7323m46k053N0249J2468J1569J993k6695l778L986
17249B8228M777p183j3985J621O03J097N795J3574l896j5370j7401o878l200r138
17235b1356L75K7014K1349M928R213J4531j4814j6723L433J0895K1206K3500p516
17222G6035j4909j0976k1505l1886K5165K9861J5786O209j2759j0747j3973j6819
17210A9482k214j1748o770M375k709O701j0415p264K136j047N0J2571K3893j0048
17196A6993j1061j9462j6829J2387N817j618m752J1598L877j3377j2532J0339
17184a8620P832P120k1318j1499J2474n953O018O161j2788J102M2435J4057o323
17171B0698j5394J6811J939J692K318l303L727K0539m946m82j8122j2243N076
$$ y = [-32147, -27672, -35202, -46388, -19065, -19511, -21564, 28685, 41153, 52722, 54715, 28020, 24242, 28228, 33005, 25822, 11837, 13458, 14061, 15158, 20953, 34527, 30631, 15261, -2140, -9018, -12218, -21356, -20981, 6033, 27382, 32310, 41523, 56054, 41240, 24517, 27950, 38845, 60051, 83551, 76035, 61126, 50150, 28645, -3241, 21924, 51785, 67571, 73780, 61021, 50274, 36301, 19482, 17268, 5520, -1250, 3125, 416, 7117, -3298, -10562, -8426, -9473, -9423, 3148, 27041, 16993, 5932, -13530, -30359, -17972, -12155, -13773, -18525, -6927, -3050, -16427, -28959, -18620, -10788, -3668, -24986, -36485, -24011, -29964, -23946, -17785, -30573, -29471, 12964, 27021, 20698, 5304, 22115, 24054, 25746, 28064, 24761, 28488, 49027, 44081, 43599, 25477, 13234, 18310]
17158A8310J2063j2551j2712k963j2854j9418m416J567Q414J5400J1597o756J354
17145b965K636j3495Q866j9835P433R935m320k474K35O232J531l5377m646j0400
17131e6644Q666m884O688L494R675J9375l7973o551J9930L9397J7969p865j7238
17118e961j4087k0410l369J8405J2334l2157l2979j1892L1455K2316N582j44K3986
17105f921R915k5689m918l066q119J9187J0888k1214j1689r08j421R289J1544
17092b3122k2480J2864K7125K1164J171l1404k1122j2348O416K6340o866K491
17080a9771K6010J8980N857j0776q905J0014L758J031N987k3330j1522j1348J5369
17067A354N534Q114l136p596k3552M868j3961N151K3501q672j6698j2259J860
$$ y = [18310, 30373, 17822, 5110, 2147, -10707, -30125, -34541, -32974, -24560, -9160, 2437, -4319, -2965, -329, -13824, -4958, -24793, -17360, -7425, -11745, -14219, -13984, -7752, -6221, -41598, -46244, -56644, -47978, -52862, -46174, -42680, -33005, -13630, -51603, -58154, -38224, 1173, 19142, 11277, -5961, -20048, -40458, -43827, -25422, -13088, -45245, -78224, -90116, -58661, -36345, -30763, -30907, -6921, 2994, -22695, -27613, -30679, -38798, -19611, -8723, -29937, -41626, -42534, -43955, -34666, -23122, -45602, -32738, -5613, 15551, 16722, -14682, -35804, -48152, -41736, -15396, -22262, -19771, 6239, 25219, 31076, 20300, 11395, 21409, 25167, 26198, 32185, 8855, -2667, -14015, 1354, 6888, 15002, 11866, 4270, -19282, -14414, -28375, -23224, 277, -8395, -25093, -37352, -35492]
17054c5492J6499J7055N366p160M995Q617r110j8218k3282m033K3863J2345j1560
17041b0115J008Q782J0192k7198m175q350J9304m212R25M455l125j5449j2014
17028d9972r869k3694J1586J3521K8231J3178l855K2581j6726k5218N456Q786
17016b5995k785L475K2130N765l339l160k0073j5536J0708R549m986K703J4029
17003g515J6290j6355k6956j6354R038K727j2642m488K0257J0277J9618K5800
16991A9697l647j5266k621m94q107m631q184o452J058K6274J6052n770l1884j7298
16977d1273N337K8470O672J217k0390j6627m599l743L0611q714k0619K7629j2394
16964b8423k642J4605r675j9794J6177K0530J0013J9951j1999k4218j4927l575
$$ y = [-35492, -18993, -1938, 3428, -3732, 1263, 9880, 770, -17448, -40730, -44763, -20900, -8555, -20115, -19107, -10325, -133, -27331, -31506, -39856, -20552, -24764, -23839, -19384, -22509, -37958, -49972, -59841, -83535, -71949, -58428, -30197, -17019, -20874, 1707, -15019, -40237, -34781, -25995, -28780, -25305, -3175, 2590, -749, -3909, -23982, -39518, -28810, -19261, -24247, -21544, -7515, 8775, -7580, -34536, -50890, -41852, -39125, -51767, -56255, -35998, -25721, -6103, 19697, 16050, 784, -1837, -2331, -10438, -15069, -23253, -29705, -28647, -2373, 13679, 7909, -23975, -41273, -35936, -7466, -794, 423, -19967, -36594, -41193, -44936, -14325, -23039, -43658, -16029, -28423, -31065, -16460, -26135, -45929, -29752, -9222, 791, 20742, 8743, -15475, -30402, -33977]
16952c3977r378J7346J6025N971j8625p902n918k707J0792k924J6436M145q251
16939a8967l1089m240L128K141K961J3318p89J7763n382l563m410J6637K6967
16926A4475P287L330k1687N261j4398r723R557J731N818K7555j1059k8205n838
16913a5896j5496K1230L7638m795l43q916M366j0586m70P516M310j8035j8677
16900a8154j9765J373K7288J4807j0690q317J4607O355K3443J709n131p169N93
16887B0949j4374m152p275k1988O515P25K8829J4948k2856j7995n721n214J452
16874b6157n937J5587J9362O977K1119j1367j2217K565j1164N626l925j4721p363
16861b1615N053p143q210L437P09o313j589l154k2293L524J9646K1268R309K736
$$ y = [-33977, -43355, -26009, -9984, -4013, -22638, -30540, -36458, -39165, -28373, -31297, -14861, -10716, -18967, -50056, -54296, -51168, -49027, -46066, -32748, -33537, -15774, -21156, -24719, -29129, -12492, 14475, 21762, 25092, 3405, 8666, -5732, -15455, -5898, -4167, 1651, 29206, 18147, -10058, -15896, -31392, -10162, 27476, 22681, 22338, 13422, 17788, 7202, 6732, 14248, 18558, 523, -18154, -37919, -36546, -9258, 5549, -5141, -13458, 1149, 7504, 30947, 32656, 27525, 20356, 20949, 6575, 2423, -4852, -26840, -20325, -19600, 9229, 24177, 1321, -16674, -22395, -27609, -26157, -32094, -16507, 2855, 9832, 30951, 19584, 7367, 9932, -1232, 4394, 469, -14252, -21615, -16562, -23705, -31915, -28478, -27769, -34082, -35671, -38825, -61118, -57594, -37948, -16680, -7371, -4635]
16847d635l4381k2262J3378K8598K9304K4672K1022k6881k8293j0998j6041J1252
16835a5265K2959p517k6602n874K7227m234j3366J0510K1991m160j4991O418K4123
16822B1219j2103j7549n271m803M38J3703j7686j1756K1416J4867j3304j8114
16810b8943M73p215o11n044J7516J1190J342J2206J9211q775L953J1717k3030
16797C990j2327j262j4119K3855R207j9299j4562J392J3948L3963m287k2159l9928
16784d1588q979R96J6644J9004K1300L0506j4658k1677J0635J9095j4784j4095
16772B399J7J821m827K5787K2465j9022j7870l5518J6446Q255L200P633j4000
16759c214o446j3635P250M427m023J0990j3994j2640j3689J1614O009k430P538
$$ y = [-4635, -39016, -61278, -47900, -19302, 10002, 34674, 55696, 28815, 522, -10476, -26517, -15265, 7694, 177, -26425, -32299, -5072, -9306, -22672, -12162, 9829, 5669, -9322, -2904, 21219, 9116, -8433, -13704, -18507, -18069, -4366, -22052, -33808, -12392, 2475, -10829, -28943, -28470, -35685, -36296, -41340, -23824, -12634, -11292, 914, 20125, 11350, 15303, 27020, 3990, -8337, -9599, -23718, 137, 9344, -9955, -24517, -23125, -9177, 24786, 20499, -1660, -41588, -50567, -49571, -32927, -13923, 7377, 37883, 23225, 1548, 12183, 31278, 16494, 2399, 2416, 4237, -590, 25197, 47662, 28640, 10770, -24748, -8302, -47, 3153, 10786, -3214, -9660, -23295, -16045, -11618, -15641, -4651, -18645, -31285, -44974, -33360, -27351, -29781, -22243]
16746b2243j0645J4576R949k251k423K624L968J9138J8312p104K2782k9821m0391
16733b3529j2404J1084k01J4447J9342j1110j0182M841K728M698M382j1175k9514
16720c6593j7408K978P145J5190J7342K2987J2704k9920l828N413K2968k4918
16708e940k0366n118J2697j0123j2755k0961K2251K0743P035J6290J8608k8290
16696e929j9052o786n823o988J2433K3559J3643p131k1715k4864K1629K4512J6637
16683A4125j8549j0914r989j709Q569l75k0880j6087P533l43J4028M048j1780
16670d2323j9935Q550J5648K4006J2638k0625p016r426j9074k4573o875K4972
16658f4033J4411m994j3535J461R462J6586J0758K6323J0188j4821k3224k529
$$ y = [-22243, -32888, -18312, -8363, -10614, -13037, -10413, -6445, 12693, 31005, 23901, 46683, 16862, -23529, -35933, -24849, -25050, -10603, 8739, -2371, -12553, -7712, -4984, -286, 4096, -7079, -36593, -54001, -51023, -43878, -28688, -11346, 11641, 24345, -5575, -9403, -3990, 18978, -5940, -26306, -31424, -18727, -28850, -41605, -62566, -40315, -19572, -12537, 3753, 22361, -5929, -24981, -31767, -37590, -44578, -32145, -8586, 5057, -2074, -23789, -48653, -27024, -2512, 14125, -4424, -15338, -25327, -27036, -18467, -18842, -39722, -55809, -48276, -48619, -34591, -30543, -42323, -62258, -53708, -38060, -14054, -1416, -22041, -29057, -38483, -57557, -82130, -89005, -64033, -49622, -54616, -68151, -66690, -57228, -40642, -29884, -3561, 6627, -8194, -31418, -33947]
16646c3947q465p93M124j6772K4331K1252j7152r135J4638N809j0308L718k6241
16633d8941J1475L6183N375p593L770j9761j0059Q447J360J0261n314k5033j8958
16620e8788N793K3971N52r47j2061J5567K8302O370k7562j1486K6035O303N317
16607G366n399j1457N395n083q684K9106K5854k2049k0313n072j11K562j8751
16594b6636l375K7383j116j2757O843P945L298o435j4894N624R700M956R490j2707
16580b681j2722J4632J7993j0893k8916j6589J8340J0989r202k450L161m434q718
16567c1490j3464j814K444M885J8633k550R098j8049k613L5951O309r971J391
16554a240j8130o965L09N463l925j7097L227J155O567J0028L181j2638k382M206
$$ y = [-33947, -42412, -43205, -39081, -55853, -31522, -10270, -27422, -36557, -21919, -16110, -26418, -22700, -48941, -37466, -1283, 4092, -3501, 269, -19492, -29551, -21104, -19744, -9483, -14797, -39830, -58788, -52995, -29024, -28472, -29419, -41480, -25913, 2389, 8759, -18803, -30289, -4254, 2049, 7366, 1967, -9490, -4095, -9178, -17862, 11244, 37098, 15049, -5264, -10336, -10447, -7885, -26636, -30011, -2628, -3744, -16501, -9658, -1713, 1585, -4850, -19744, -14120, -4420, 536, 10026, -2681, -15403, -771, 17222, 6329, -22587, -39176, -20836, -9847, -19049, -21499, -18338, -22772, -31490, -44954, -46768, -44324, -39439, -20806, -23356, -14258, -32307, -34920, 1031, 7340, -2631, -1240, -19370, -26335, -26026, -20563, -24488, -41585, -38358, -37203, -30636, -20608, -17427, -30065, -32447, -28241]
16540b8241J753L348j4251O737O867R021j8409N339L8580k140j7236J4280j1412
16527e764j9192p492L826j0415r668N639K2530K142p308r807j3213J3346J0523
16514b4853K9570q2j7214m1250J6872L1398O558r085j5902r648j2999N470K5913
16501a5252K5582l262j8144l4818J4634n432k4016O472L0107J4355r353j4219
16489c3346J3941J5729L613p297j6861p045m586j6099n945P283k135J687K3588
16476b7473k26Q936P00p42J1086p977j2742K860N027j3184j5304j4392K0409K7078
16462a5944j4134o369k371J7506J4959J0218l2443j1243N794P457m447k10M198
16449b7029j3192Q569M772j7690j3861K1940r881j3433j8577J2978L2945K0154
$$ y = [-28241, -26488, -23140, -37391, -30654, -23787, -14766, -33175, -27836, 10744, 8604, -8632, 5648, -5764, -24956, -32448, -28622, -39037, -48705, -43066, -20536, -18394, -25702, -35509, -48722, -35376, -24853, 4717, 4635, -12579, -53829, -36957, -5559, 999, -8086, -23988, -33636, -46635, -41165, -15252, 10330, 7068, -11076, -45894, -31260, -36692, -60708, -54236, -24129, -9774, -19127, -33346, -19405, -3676, -63, -7360, -24221, -31266, -35852, -51951, -57896, -50613, -52748, -51061, -27473, -27699, -18763, -18063, -18805, -7719, -15696, -28438, -25578, -20551, -33735, -49039, -63431, -43022, -15944, -30078, -36447, -38818, -21312, -6353, 3865, -28578, -39821, -34027, -26570, -31017, -31227, -27029, -40221, -31652, -26880, -44570, -58431, -36491, -46372, -59805, -78382, -65404, -32459, -12305]
16437a2305j2453q045K1571J2032q354k102J9567k3077n359K532n45Q95k465K1305
16423C197j5871p366K094J7856J6691O494J4466j447q476n506M388j7847k7070
16410a8397j0383j291P416j8965R924L0444j6116k6549O651L0819P899j4768k3111
16397c6427k3212K591P470k710N673J9745l318K6330K0795p084k3960q377k92
16384b2776l146J2781q761r311J7116N319K1597l682j5541n441o838r453l1415
16371e9551j4139K9425K3088r198O140N51K3815j7859k8972l085N656L3956J1459
16358A286Q502R861R990o600k733P340J0800q847k3722j5759J5397R933j1730
16345C718k1697m995j5854j0587J6698J3215m729k406q002R946K4065q759j4271
$$ y = [-12305, -24758, -32803, -11232, 800, -7554, -9656, 9911, -13166, -18525, -15993, -16538, -15643, -18108, 3197, -12674, -20040, -17946, -90, 16601, 23095, 37561, 36114, 27638, 22132, 26520, 8673, -18397, -28780, -30071, -22655, -41620, -31696, -1252, -17368, -43917, -37266, -6447, 1452, -13316, -36427, -59639, -57048, -49578, -52288, -46615, -26870, -30188, -3858, 16937, 9853, -14107, -22484, -22776, -25922, -13141, -21902, -31213, -14097, -8778, 12819, 9137, -6404, -11845, -18683, -28136, -59551, -73690, -44265, -21177, -30375, -24235, -23684, 131, -17728, -46700, -49785, -44129, -10173, 1286, 9788, 19649, 29639, 23039, 20306, 27646, 38446, 29599, 5877, -9882, 5515, 15448, 3718, -17979, -22974, -38828, -49415, -32717, -19502, -24231, -26637, -34639, -24693, -628, -9387, -23658]
16332b3658K3654r754q550K674K3530Q907l0603r136j8063j1144K8432J6332N897
16319a482L829K519j0459r439j2524J2744J7491m746p150J3848r824l128J733
16306f588j8107K077N291O047P827m246k0426k7742n793K0840J682l575K4812
16293a7901J6591J134o846j9873k190M675N640j0639q871J6720L1906l467J280
16280H159k829p845O784J4889M293k4544m806j7492n64P525J1319j898k2583q868
16266c8460J4087q924k667J1489R185j5107L997k4698K079K2270R106m001k281
16253b3925n531J0972O097p120j6334n325n079l71J1635N462L92J4175J8866o902
16239b988J912J0652k5105M177k106q028J127J9832j0300J774m607k802j5921
$$ y = [-23658, -4, -9758, -18308, -15634, 7896, 16803, -13800, -22936, -40999, -52143, -23711, -7379, -1482, 2347, 4866, -5593, -15032, -27556, -14812, 2679, -2067, -9217, 4631, -5193, -8321, -6588, -24695, -22618, -17327, -11280, -3453, -7699, -28125, -55867, -61660, -40820, -39138, -42713, -17901, -1310, -176, -7022, -26895, -29085, -24410, -18770, -29409, -38280, -21560, 10346, 6879, 8159, 5330, -2515, 4269, 19158, 23451, -1093, -5899, -23391, -23955, -16430, -5111, -7009, -29592, -38460, -24373, -33297, -35964, -24475, -15290, -30397, -26400, -51098, -49019, -26749, -17643, -21644, -23925, -29456, -18484, -12387, -19507, -35841, -41166, -46245, -46616, -34981, -29519, -29127, -14952, 3914, -2988, -1076, 9576, -15529, -11352, -13458, -21486, -20359, -527, -10827, -9053, -13660, -16462, -32383]
16226c2383o738P857J1025M791J9089l4017l1865J7614K8696K2679J0411p943
16214I216p574p28q82j4551m298p866k731L997o401O000J1472N761j3575p802
16200b9962Q984K0708K7642J8145R326k6004k4908q423k2188m771N346J8170L0051
16187B2116R687k5756j5610M160J0305q76r446j202j3075R995o938r180m613J620
16173b8813J3305Q519J7317p110r835l546N30J0802j7220k362L411J3880o85N013
16159C206j7636r31L1889j0175j9914O18j9549k510o354N377j2470J0698N177
16146c2574J7471J9945o320k0172k0316J1340Kq109k916K9482K9528J952j9331
16133a8j1447L612J240j5134J0318Q75j4085O881O956K5668K0306l577k1974l0001
$$ y = [-32383, -39121, -31264, -20239, -15448, 3641, -30376, -62241, -44627, -15931, 6748, 17159, 9216, 1642, 914, 32, -14519, -18817, -26683, -29414, -25417, -31818, -25818, -14346, -8585, -22160, -29962, -20978, -270, 27372, 45517, 54843, 28839, 3931, -4492, -26680, -31451, -26105, -7935, 22116, 31803, 6047, -9563, -5403, 4902, 4026, -5420, -6622, -19697, -9702, -16640, -25820, -30433, -28813, -15508, -6989, 10328, 3218, -6617, -10163, -9633, 1169, -16051, -18413, -15002, -1122, -1807, 3206, -14430, -15361, 16528, 6353, -13561, -12943, -32492, -35002, -41356, -35979, -48449, -37751, -32574, -15103, 4842, -1478, -21650, -41966, -30626, -30624, -38733, -41649, -12167, 17361, 19313, -18, -11465, -7853, -6613, -21747, -11429, -10554, -24639, -17758, -10802, 14866, 35172, 31595, 9621, -20380]
16119b0380r919M908K9554j87k7115k0867J7854K0287j9019j8784J032Q535J2130
16106b1971l256M348J315j9467j0785k959l579K2265J7893Q734j1242j7151N830
16093c0025O765j3990j2607R407P196J983J5074J1191P4P018j7088K636K9805
16080A7439p165j5577l5371m21L2887J1456J8786k5190k8526k1684J6914K511
16068c3941M428K0241r249j2093J3289Q674J805p654k1406j165L959n347j2702
16055e1161L0174L9691N371l0064L368j3706m853J7519r279l6700L134J3023L282
16042c0201q951m0454j1887K5590J5408J2546J4950j1795O83N909J1967k2070
16030c8305q872K0743P230p71p777j719k1983j1741L101K6643M985L3499J5685
$$ y = [-20380, -30299, -25391, 4163, 3976, -23139, -44006, -26152, -5865, -24884, -43668, -42636, -34101, -21971, -25227, -20879, -19564, -39031, -49816, -52775, -56354, -34089, -16196, -7462, -18704, -35855, -30025, -23260, -37250, -49857, -40450, -33254, -31271, -16197, -5006, -4932, 2086, -15002, -12366, 17439, 10274, -5303, -40674, -41095, -8208, 3248, 22034, -3156, -31682, -53366, -36452, -33941, -29513, -9272, -18521, -30614, -17325, -8651, -6846, -14500, -35906, -37071, -33112, -38459, -51161, -20987, 18704, 24075, -5989, -2621, -16327, -21180, -3661, -12940, -49640, -46506, -33483, -30201, -39152, -79606, -91493, -65903, -50495, -37949, -22999, -34794, -34111, -28202, -16235, -38305, -47177, -26434, -19204, -19975, -27752, -29471, -51454, -63195, -60094, -33451, -28466, 5033, 20718]
16017B0718j9527j2837J6919m085j1777j2292j6396O563K0116J2826R164K974
16005A2366j0727J4734k056l0294k7666N672j2816K679K8946J785Q568j3352n735
15992b7896j5331K2615L116j3507j9766O607L787O126J230Q795j0631j1679K0752
15979b5782J5775J4615l865M982p862q351j2961l782L020l31l131j0654q724L790
15965d3261p262q503K2630L2829K0471j4035q856K1257J5773k5505j1661J0982
15953D859r769k336l580p340L367J0551K1453R283Q304M79j9427j6702m972j3983
15939a9813r32J6074J1537m305P925o10j6469j1482P024K2772k6128k8422r166
15926e1995p003J8877J1313O926K158J656o253j0484j272l706N823j4885Q720
$$ y = [20718, 1191, -11646, 5273, 1188, -10589, -22881, -39277, -32714, -12598, 228, 9392, 12366, 1639, 16373, 14317, -15977, -43643, -37971, -50787, -48108, -19162, -17377, -8809, -22161, -27896, -43227, -20612, -17496, -31003, -50769, -44162, -40375, -34249, -33019, -24224, -34855, -46534, -25782, -10007, 4608, 743, 5725, -2137, -10488, -23449, -27231, -24211, -24542, -27673, -38327, -47051, -43261, -50523, -59026, -36396, -3567, 16904, 2869, -5987, 15270, 31043, 5538, -6123, 4859, -4910, -7246, -10826, -18166, -14799, -4248, 17205, 26488, 34792, 35271, 15844, -858, -5830, -19813, -20745, -4671, 6866, 2561, 10486, 9876, -6593, -18075, -11051, 11721, -14407, -42829, -51995, -58998, -40121, -28808, -21882, -19724, -18068, -24321, -34805, -36077, -39783, -33960, -48845, -40125]
15913d0125p685k7085n720K5706L6734N414j1626k5031l649J7306L1948j7158
15901b0971n239q321m896J1624K2857J7966J2110J2619k9084l5605m66J4728J1862
15888h16k431K6038o857k2591l1184K2407J5187j7455k4993Q117N842K0861J9853
15875A1978r725j652J724k3352j1134J2902J7713J7248j2136j3836p680M1837
15863B3887Q914k9273J2384O094K2363J8383J9002l294k3755m0325r941K2368
15851B6807M423P76k274r158L641o144j284K4145J756M596J68J8069N289j456
15837F9354p233K186n123q362J0601P667K934k2345j0180j0308K770J7338j841
15824D7458j4267N117R800R73j3377L088n029j5869n969j3400J568J0736j8995
$$ y = [-40125, -47810, -74895, -80615, -54909, -18175, -12761, -24387, -49418, -53067, -35761, -3813, -20971, -26210, -34531, -39427, -27803, -4946, 13020, 25130, 37749, 8665, -26940, -27406, -12678, -816, -3247, 22791, 15934, -6657, -37841, -15434, -247, -17702, -42695, -34578, -28736, -7875, 11978, 2253, 601, 2325, -21027, -32161, -19259, -1546, 15702, 3566, -10270, -17950, 23887, 32801, 3528, 15912, 22006, 44369, 62752, 81754, 78460, 54705, 14380, 4439, 26807, 31230, 32006, 29732, 20574, 24215, 18071, 16787, 40932, 42688, 47284, 47452, 65521, 70810, 69354, 62121, 64307, 59184, 50822, 61423, 69090, 72024, 49679, 39499, 29191, 31961, 49299, 47458, 33191, 38308, 48108, 49081, 35704, 38792, 33763, 17894, 11925, -1475, 93, 10829, -8166]
15811h166p797J7339P705J5696K720j2257j5830j6942o976J9815j2084k8258J0406
15798c4629M3926K2925R037j4410k3658J6970j7994k6211R312k282p249m001L207
15785b5057J9144N353j6096q570k7789J563J7203o034q179N069J9100Q290m780
15772b0783J3311J4811o559k8275q805K7427l664r52J4281j9961j8431J3192K0563
15759c845N363L3299p18m421j7238j4131l595j4855q255J2153K431J12k4664j2604
15745e0968r88j984R072N709j1485K624J5397o035O710R524K677k4002L52J7775
15731b5622L686M650J927j2030m387P04J5307R301J5885k3803k3157J5676K6142
15718D279k153j6811k3956o010K787R174r376O544K0482J698j5082k7909J418
$$ y = [-8166, -15963, 1376, 9081, 24777, 27497, 15240, -590, -17532, -24508, -4693, -16777, -45035, -34629, 9297, 32222, 41259, 26849, 3191, 20161, 2167, -24044, -14732, -17014, -24263, -28264, -25057, -5913, -560, -16656, -25226, -53015, -51452, -34249, -40283, -48462, -43393, -24293, -16003, -20783, -7472, 7339, 780, -27495, -36300, -8873, -12537, -13489, 792, -19169, -37600, -24408, -3845, 1518, 34817, 34099, 29678, 12440, -1691, -5286, -20141, -28396, -16243, -13812, -13700, -38364, -50968, -51956, -53940, -44868, -39159, -50644, -48020, -32623, -38658, -31948, -22424, -19747, -43749, -43397, -25622, -21936, -17286, -15359, -27389, -31776, -31072, -15765, -6464, 9421, -14382, -37539, -21863, 4279, 2126, -14685, -38641, -44651, -41864, -32690, -42066, -35522, -15040, -13342, -28424, -56333, -54915]
15705e4915J9499Q638J374j6683M38Q226J7087M109J5678o808l830m724k3202
15692c5113j6587J611J0300K2854j2458j267L6574K7185j4447k1597r953q475
15680b1373J1203J0043R506J05p421k0977N757J6201k5290k0147L4469J1036p614
15667d502m783K2370J7471r527l565k0928r350J4281L130K3668j0026l931j3081
15654A227J171j6833j3756N559J8331L074K0303N403k4260J5345o554m2646j0446
15641d4082J9583J9394R835j2399N884M886J5275L357j1854j0825n417J554O405
15628A596j6645J2415J4732l196r453l285o042j3634p60O535p744j1703M71O190
15614c0523J7382K2501j224o403j5948j5732k6849j4309J2185P337Q713O474J4414
$$ y = [-54915, -35416, -26778, -25404, -42087, -41649, -33423, -16336, -12227, 3451, -3357, -7187, -11911, -35113, -51700, -50089, -39789, -16935, -29393, -30660, 5914, 33099, 18652, -2945, -12898, -21373, -10170, -127, 9379, 9484, 2063, -18914, -13157, 3044, -22246, -42393, -7924, 3112, -4502, -9285, 13085, 30556, 21029, 17464, -3464, -12814, 1467, 4597, 28265, 18239, 14308, 1227, 2398, -14435, -28191, -22632, -4301, -1227, 19076, 24479, 219, 15564, 9010, -33636, -44082, -24499, -5105, 4730, -7669, -1785, 3101, 18376, 21733, 9879, -946, -6363, -4809, 1596, -15049, -2634, 12098, 8902, -551, -3836, -9878, -23512, -24272, -17737, -25481, -37184, -36713, -30523, -13141, 9360, 8136, 1733, -14215, -29947, -56796, -71105, -58920, -51583, -42870, -36396, -21982]
15601b1982J0547p362n599P139p204J5297q475J0150l638K340K901R340L744j8715
15587a1517k0896k6154o364l262K8695J0892m966j0631M5177j314k1801j1479
15575c3620L462K5019K105O767k4776O442J8225K508p995o684J2107L55q822J9491
15561A4584J7867k742j3835l550j1836k1402j560Q642r796m455Q180L3235K4407
15548C7739k027N874l7881j5605o751J6164N224j7210K164P897K0156O351n777
15535A6318m559j0344K685P084J4830J2893k5551k1030k4704j6545Q535K2619
15523a7769J5524n375j21j4793Q024j0644k2145j5567J0496L1519J7767J570q378
15510i892k391p574j3443J2828Q227n374k9185q766K7880M4922k515j2949j427
$$ y = [-21982, -11435, -18797, -24396, -17257, -24461, -9164, -17639, -7489, -11127, -8787, -5886, 3454, 7198, -11517, -32413, -58567, -64931, -68193, -39498, -28606, -33572, -44203, 974, -340, -22141, -33620, -30158, -5139, -3034, 3733, -21043, -14601, 3624, 6132, -1863, -8547, 3560, 3915, -4907, 14584, 32451, 29709, 15874, 12324, 488, -20914, -22474, -13832, -23628, -28083, -19903, 13332, 37739, 35712, 41586, 3705, -11900, -18651, -2487, 2737, -14473, -12309, -4412, 15744, 22095, 16318, 11759, 1415, 4100, 11184, 26014, 38907, 13356, -7674, -32378, -48923, -40388, -17769, -2245, -7620, -7741, -22534, -14510, -25154, -47299, -62866, -52370, -20851, -3084, -1514, -9892, -12283, -19857, -33300, -20472, -12245, -17619, -46804, -55570, -27690, 17232, 14717, 1768, 341]
15497C41J1749M062l7129J4225J9096k2573k0479j2322n75J3900K9057k515p949
15484a1112N33j7202J2505K2729N060k0568J6852j770o123j7798q195M454K792
15471a7843j2086l966K382L6319%l948k450K704J0277l427j8372k6251Q4j0013
15457d6590J2921K5380j919L954K4038j1963m188q224j0320J1560M285Q118k1481
15444a4429k9123j4862Q596l3606K799R085J9324K7252N761J7543J0432j474K3911
15431C1209k0891j4046n458k0246j5014k429j1539R120J3124K7509P980n228O186
15418B77j2219j3948p242J4472M4673j9088k2456n3r515L589l4484J262K237O321
15404d6174r558q989K1547O769q413J2132J6231L327q508l712j0180m292O132
$$ y = [341, 12090, 16152, -20977, -6752, 12344, -10229, -30708, -43030, -43605, -29705, -648, -3163, -11112, -10579, -27781, -15276, 7453, 12513, -8055, 8797, 7027, 904, -16894, -25089, -20635, -17843, -29929, -33895, -31513, 4806, 4806, 858, -1592, 1112, 11389, 7962, -10410, -36661, -36577, -46590, -33669, -8289, -10208, -6254, 17784, 5821, 1633, -6591, -16911, -5351, -1066, 7052, -14429, -43552, -58414, -49818, -83424, -80625, -71540, -52216, -24964, -19203, -1660, 8772, 7298, 31209, 10318, -3728, -9186, -29432, -44446, -46875, -58414, -49294, -36170, -8661, -681, -5909, 277, -11942, -25890, -33132, -18660, 26013, 6925, -15531, -15584, -25099, -21510, -55994, -54732, -52495, -46174, -55732, -64721, -43174, -36405, -44818, -32686, -16455, -13128, -21636, -25348, -35528, -39820, -33688]
15391c3688L964J3444l715M261j2481o521K1898j2768m521Q87J8129n016J4658
15378a469l7k6446j3524l392r53K5430K9562Q83p445k213j3388k1571J497K4291
15364h775M368q63j9629O034N116j3655q347r94N718J6283J2735k1984j6952Q79
15350d0066O926k752p413j6153M318J8823M0082J8935O716k2944k7155k5293J182
15337d4794m388J6512J6613o362J858J7800P400k4831J323O387p608k36J8127
15324b199K871j4198L428M86m979j5523m330J8349Q182J0434L125n516j6724j1587
15310b8181j160K7413j2290j6535J7193J7939L485k0165r366J5331J1021k952
15298A733P58j1182p610J6302L444J0319j2585m364j5211J433K1676L0487j9065
$$ y = [-33688, -29724, -16280, -19995, -15734, -28215, -34736, -12838, -25606, -30127, -29240, -11111, -16127, -1469, -1506, -27952, -41476, -44868, -45821, -20391, 9171, 10054, 2609, 396, -12992, -34563, -33066, -8775, -4407, -5270, -24899, -18865, -13749, -27404, -35751, -36745, -31027, -14744, -2009, -23993, -40945, -40066, -33140, -35892, -43305, -59458, -55140, -36317, 3765, 22700, 29416, 6472, -20683, -45976, -44794, -49182, -32670, -16057, -22419, -20561, -2761, 4639, -20192, -18869, -12482, -20090, -20326, -2199, 672, -13526, -10098, -9612, -14591, -30114, -34444, -16095, -7913, 2521, 5646, 130, -16594, -28181, -29341, -1928, -14218, -30753, -13560, 4379, 7864, -12301, -21667, -6336, 4685, 1733, 2491, -8691, -16301, 1, 3445, 13764, 1179, -3185, -18396, -16963, 4713, 35200, 16135]
15285A6135k0729l391Q677l5408j9316R704O01L620K9127J472K3269L948k3303
15272e594k7100L091O438J7270R961J1145r410j7137P334P616j1394k636K748
15259g668n760k161j470R958p000Q667n54J0285K0401o897j9301j111J204j5207
15245a6614j6860k6766k102j6323J2278P254J2556M1125L4923M329k2368j6655
15233e223j4886K0566R49M271j5224l3259j4119L6291J7337R57o502r646J2560
15220e928K2328J7424P849j1886j8412j0029M764m771j4543j782K4363P689k359
15207A4707j2068N218l270j2686j0775Q45j2458J764J143K5322K1974P257k4141
15194B832q668R909J063J29J2751j9157K169K6426j665j5142J269n950j9477l917
$$ y = [16135, -4594, -7985, 692, -34716, -54032, -44328, -43727, -40107, -10980, -9508, 13761, 17709, -5594, -32694, -29603, -23165, -5895, 4066, 15211, 5801, -11336, -4002, 3614, -7780, -10416, -7668, -13428, -15589, -17059, -7101, -14101, -5434, -5988, 4297, 24698, 17801, -1500, -2611, -1407, -16614, -33474, -60240, -62342, -78665, -66387, -59133, -46577, -5452, 29471, 33800, 11432, -5223, -20109, 457, 1406, 5677, -9547, -42806, -56925, -20634, -3297, -2340, -8842, -18488, -5928, 16400, 33824, 41673, 29787, 11375, 1346, 6110, 1339, -13204, -14986, 9377, 17066, 14707, 2639, 7857, 4587, -8099, -18874, -18029, -30487, -28723, -27580, -2258, 19716, 26973, 2832, -5836, 4073, 5136, 5265, 18016, -1141, 1028, 27454, 25789, 10647, 11916, 5966, -13511, -17428]
15180a7428Q398O509k7090j365p039k254L3000K7899j4902j9812J1513K3171l869
15167A6731j4157K612J3598J4640j0753L038K185j8304q279k820J6922J5152j8821
15154A1744m3492r326L1518o193k1644RR38k2027j3849K8291L6724K0024m051
15141H666k4386j785J2662R016K1954K662q833J4004L554n279j742o711k4259
15128d77j6210r386J4734L7082j2842k0546l2199p412K5360J0306r042n716j395
15115b7743R284N523j2406K3504k518j2606P761L4899J3073j8078j1397J5793
15103B5089R929j3681j4999J3866l458O432J8429l1848k3727M426q964j7583l494
15090c9583k427L88k515j5513M942J4098J6337J821N742N510K6619L769j1754
$$ y = [-17428, -9030, -2521, -29611, -30976, -38015, -40269, -7269, 20630, 5728, -14084, -2571, 20600, 16731, 2574, 5186, 18784, 33424, 22671, 25709, 27894, 9590, 1311, -1509, 15413, 30565, 11744, -31748, -41074, -9556, -15749, -37393, -37384, -36446, -58473, -72322, -44031, -7307, 12717, 8666, -15720, -17505, -4843, 4173, 26127, 28789, 19956, 33960, 37514, 32235, 30493, 23782, -477, -16687, -26073, -11339, 25743, 12901, -7645, -39844, -47256, -21896, -11590, -20632, -26348, -27743, -18459, -12936, -25342, -1838, -4356, -16962, -9201, 25698, 38771, 20693, 9296, 25089, 35018, 21337, 6338, 20204, 16746, 23178, 41607, 9759, -13968, -9542, -18506, -36089, -39583, -42010, -41622, -44137, -59650, -54708, -40610, -24273, -22452, -16710, -11200, 15419, 19188, 7434]
15077G434n455n173K450N711k756J3683l1642j8230K171J7497n444q706o507j8575
15063e3542n902l857J2690R628n146r499Q448J8080J9356J3750j2811r36k8304
15050c8045p970n087j8424K5952K8660j4373M508K1697J1754k1172k9960k0046
15038f2506K7929J586Q480O736j3461j0436J536J5203q182R732K4403Q826k0677
15025a0831j3438k866K4852K1863k4604j976r475l1416m855J0538O956J6818L754
15012a4680j5063J2299n37O387Q798J8951j0023o136R357j4676k3291j2622J1676
14999b9560J497J2831k689J6338m715j4175l720R116l807p598K355K1840J979
14986c08j3585J5291j1428L686O884k1771J531J7087j5526k3026K3778R144K193
$$ y = [7434, 1979, -3194, -744, 4967, 2211, 15894, -15748, -33978, -31807, -14310, -19754, -28460, -34967, -53542, -59444, -63301, -50611, -40983, -46129, -55628, -47180, -29100, -9744, 4006, -8805, -9741, -38045, -46015, -51102, -69526, -43574, -14914, -29287, -24779, -3082, 8672, -12500, -42460, -62506, -34577, -32991, -24511, -17775, -31236, -41672, -40136, -24933, -33115, -23383, 1020, 9846, -10831, -24269, -27135, -2283, 19580, -5024, -7000, -16475, -47891, -52746, -42208, -35252, -18434, -14680, -29743, -17444, -17981, -11594, -2796, 16155, 6132, -4, 9353, -5323, -28614, -41236, -29560, -28063, -15232, -17921, -1583, -6298, -20473, -24193, -15077, -18884, -26482, -24127, -2287, -308, -13893, 1398, -10030, -6344, 540, -21231, -19700, -2613, -18139, -41165, -17387, -8243, -6050]
14973f050R19p099Q909J8096Q936L808l391j3586k0170J0120L040k0616j9154
14960c6238R795K2952j8677n166K3549K6355J70j7327O600P521k8535j8091J7449
14947i643R765m771O395r675k1876J6850L9923j525k0275m6504J0375J3995j0541
14934b7507K498J4498m033k1709J2279J1222L392J4351O686j0585k2655M416L5482
14921A8335j4635J001P799j9164k0918k431J8635K0981k1749l198L5398o73j6923
14908B458r688k8461K174k641J970M150J9569p221M826L345J362j8149J82M672
14894b1452j0154j7467K0608J5663K903k939j7275k0012J0053M5416K9712J0334
14882D5390m174l0275k7419o469j0502M194R900J4499K5631j7840q091j1369l354
$$ y = [-6050, -5131, -12230, -3321, 14775, 23711, 27519, 24128, 10542, -9628, 492, 3532, -17084, -36238, -26443, -3491, -22168, -27334, -3785, 22570, 22740, 5413, 12013, 19534, -9001, -27092, -9643, 122, -4649, 1746, -7929, -29805, -12955, 26968, 25443, 5168, -41336, -30961, -16966, -27507, -25009, -10511, -14544, -36253, -23974, -12752, -9360, 4991, 11677, 1092, -21563, -17147, 18335, 3700, 4701, 12500, -6664, -27582, -30013, -11378, 9603, -12146, -15344, 20054, 19381, 2458, -7230, -35691, -33517, -36158, -34188, -30038, -10469, -17690, -12864, -9519, -8157, -26306, -26124, -21452, -31606, -49073, -28465, -12802, -9899, -12838, -30113, -50125, -40072, 5344, 35056, 45390, 41216, 10941, -16478, -22947, -33449, -29255, -19355, -4856, 20775, 2935, -5156, -16525, -19879]
14869a9879o150k6247J3110Q380l42J959J7198K2791Q928j1736P722K0719L30
14856C6783j8139k1380N59K0298L0564j1999k5811M800J1742k9513j7250n406
14844b4752J6986j1428j1873O451J2017J4806j505j2709j9736j3781K1610Q258
14832a5656K7980O813J3793k0770n112n348L176P858Q605J1918L182k2993j5467
14819b021R800j555J016M979j1597M569j3926M191p062K885J1527p703j4430n46
14805a9873J6799L140j219q269j4138k749M258J1930p242l834J6356J3721k909
14792E971j9763p313J0450m679q40J0174J942Q268R250j7974j2885L650O508j2634
14778a9875M762K1674R386j2611k397L572j0772k60l894j1469k800j217j3784
$$ y = [-19879, -26029, -52276, -39166, -30786, -31128, -29169, -11971, 10820, 19748, 8012, 15734, 36453, 36783, 18644, -2736, -2177, 18121, 48685, 36686, 10875, 15675, 27417, -2096, -19346, -24752, -7766, -19194, -31067, -24616, -12599, 2207, 702, -12007, -31743, -45524, -23914, -15656, 12324, 19137, 32930, 12160, 7048, 1700, 4876, 12734, 21339, 33257, 36439, 13446, -2021, 7779, 6224, 7240, 12219, 622, 5191, -8735, -4544, -11606, -8721, 2806, -4897, -19327, -19873, -3074, 66, -1153, -9422, -23560, -26309, -22051, -10121, -17363, -21197, -4841, 8880, 5971, -13792, -21105, -10655, -15334, -16174, -6000, -4058, 4210, 13460, -4514, -17399, -13749, -7241, -19875, -15113, 6561, 15947, 3336, 939, 4511, -6261, -6521, -10415, -21884, -24684, -25901, -39685]
14765c9685J7586L3037K285j8588L26j3306K70P564M701K133R22k7142Q204K1048
14751f45j6073m211m50j1876m002J3949J5371j685p407M850R227j2698j2494L371
14737b4773P584k253j949p704k6644K6017K4382k2426j938M844J662n458L312
14724b5344K30J5821O837o339j0485q458m880Q920K0076O658M172r002q779j6059
14710b6632K3753M3708J4634m205o421j6275l3376k2224j8271J1500L7003J642
14698D836m980J6135P50R489k9466N233L831M761N498k0135r757M48l184J1275
14684e266K636k911k2560J1901J5603J0523O859J4631j140j3187k589J5921k5710
14671D711k1964R581q442L205J6525M0221N662l7450n5424O293P050K7829p975
$$ y = [-39685, -22099, 10938, 13223, -5365, -5039, -18345, -18075, -10511, -5810, -3677, -2755, -29897, -21693, -645, -16718, -20929, -21379, -33255, -37257, -23308, -7937, -9622, -17029, -12179, -2952, -15650, -28144, -24773, -17189, -19442, -21391, -29095, -55739, -29722, -5340, -27766, -29704, -24860, -23198, -28656, -25344, -25114, -9293, -2456, -8795, -19280, -27738, -32618, -23698, -3622, 3036, 7208, -1794, -10573, -26632, -2879, 40829, 55463, 51258, 44837, 28562, -4814, -27038, -45309, -33809, 3194, 4836, -144, 15991, 16741, 26230, -3236, 1997, 5828, 10589, 16087, -4048, -13805, -13357, -16541, -5266, -2630, -5541, -28101, -16200, -597, 9926, 16785, 31416, 30276, 17089, 14500, 30421, 4711, -17253, -7672, -16114, -12909, 3616, 43837, 49499, 12049, -43375, -37082, -30032, -2203, -10178]
14658a0178L280J7873n07k4760q806l124k333k286j9647J5459J8317J2510R826
14645E624j3654R52Q36k344K4621P223k510j4779k7336l2544J5461M1417k226
14632G41j5211k3800m462J8630l693M306M237l786L900J4298J904l254K557K5726
14618B2093K1194k3239k0919R74k994R348J3125R245j5330j2576j7776k125M9814
14605C0834j3947k5396J9957K5358j1789r650Q432J5280J3104j6092k7238k3823
14593a4970J5416J0404q348K673P857O211J7337J8438j8334k3931O028J0469J5639
14580D4889k934K130R356M99l974j513r435R509q77j0856p216j7752M102j993
14566A3935k5689Q866P990m809j0437N37k833p870K3552R796k7384l1450N550
$$ y = [-10178, -6898, 10975, 10468, -14292, -23098, -26222, -28555, -30841, -50488, -35029, -16712, -4202, 5624, -8030, -7078, -6242, -8586, 16035, 23258, 20748, 5969, -21367, -53911, -38450, 2967, 741, -14470, -38270, -42732, -24102, -27795, -23489, -19252, -23038, -19138, -4840, -2936, -6190, -3633, 22093, 43287, 20048, -871, 103, -2891, 6457, 19582, 28827, 13497, 921, -16855, -18980, 30834, 16887, -8509, 11448, 36806, 25017, 15367, 23799, 39079, 52183, 36091, 8853, -14970, 446, 10850, 2502, 5175, 13032, 19243, 36580, 55018, 36684, 12753, 18781, 29250, 44889, 41955, 44085, 53441, 53940, 49966, 48453, 39018, 48527, 47650, 36794, 29578, 11826, 15928, 13935, -11754, -2888, 5102, 293, -10144, -9607, -12440, -20310, 3242, 13038, -14346, -45796, -40246]
14553d0246J0404J3065K1149j2893j1525K3628K2630l498p099l408O563O298n535
14540A9533j6928J1226o69j312n810j469j468K3020N174J6528J3050k6643m6043
14527a1811j9865M906J5268J2852K1699J5526k001n115R257J327q304L516M441
14514D1696j057j3621n800J8412r571j5713K8676K899l362j3297L329M316P730
14501D4637J1696j2376Q965J2784J0079r641n258n039q463L462N484O5l071L657
14487E6981J1j4879J7533J9299j4587n169R360o03O43j7359j0285j2910K5221
14474E3256J0216K6560R333j4087l1542j9554Q794J6673m44k0483l5933j0884
14462h095P927J7663K6732K3606q234k0878K5088n360j5278n332j4761M115j0580
$$ y = [-40246, -29842, -16777, 4372, -8521, -20046, 3582, 26212, 22714, 15615, 12207, 18770, 25068, 19533, 2605, 13831, 13162, 11850, 6040, 4571, 3103, 26123, 31297, 47825, 60875, 34232, -11811, -31676, -26770, -11502, 1350, 23049, 38575, 36574, 31459, 40716, 42043, 33739, 37255, 41696, 40639, 27018, 21218, 39630, 30059, 14346, 43022, 45921, 42559, 29262, 32591, 36907, 44637, 56333, 43957, 52922, 65706, 75785, 66144, 60886, 55847, 47384, 50846, 56330, 56395, 53324, 56981, 56992, 42113, 59646, 78945, 64358, 59189, 68549, 67946, 68589, 51230, 40945, 28035, 53256, 63472, 90032, 99365, 85278, 53736, 34182, 42976, 59649, 59205, 38722, 2789, -8095, -168, 17495, 44227, 67833, 59599, 38721, 63809, 58449, 43171, 37839, 23078, 27193, 16613]
14449A6613k2786L9048R600l101J4604J4401j9993l2494k4395L2602O277j0871
14437A9505J4994O708l449o534J8867k023j5680J4541j0668j9586K427O861M75
14424B6438o293J2661O682M331q498J0254J9285J4106j1550o326L258J979n380
14411F0947q767j1267O280l810N005K868K739O129P823N20J4414J1092j0168m039
14397G9766MP313j629j7037j4216l3292J1679N087R032k1927j6096J0715J2385
14384C1784O678L439N450Q454O338L3451j5022l2741K6107R658j3662J5806k7554
14371E8186j8062J7068R074J4482j6404r64J5805m742J3359J797r348n297K3223
14358I8177K4610q47j7322j6140M930k54L157J9372m124J9596k8583j7720P640
$$ y = [16613, -6173, 32875, 42475, 39374, 53978, 68379, 48386, 15892, -8503, 24099, 30376, 19505, 34499, 41207, 37758, 31224, 50091, 48068, 32388, 46929, 36261, 16675, 19102, 25963, 26438, 20145, 32806, 39488, 43819, 35321, 45575, 64860, 78966, 67416, 61090, 64348, 66327, 60947, 52180, 40913, 47193, 43383, 48388, 51256, 53995, 60124, 67947, 68467, 82881, 93973, 83805, 79766, 79770, 87083, 85454, 68417, 54201, 20909, 32588, 37675, 46707, 24780, 8684, 19399, 31784, 38462, 41901, 47351, 55805, 62143, 95594, 80572, 47831, 73938, 83596, 69934, 85740, 58186, 40124, 57192, 66266, 80748, 64344, 63380, 79185, 74443, 87802, 89599, 80251, 74954, 98177, 122787, 121940, 104618, 88478, 93408, 93154, 96311, 115683, 111559, 131155, 102572, 84852, 92492]
14345I2492J9613k0057k2490O199O56k7175J241L6552J7932j6345k0993j3315
14333E4310q08j573R448M0684K5867k4638l587K930j4240J3995K5884R451j1217
14320A26506Q612Jj4350j650L020J8922J8538K6394K8054m948m328k861R406j9457
14306A91859j6867m1756l8971M042L9405j7041p956K027J209P410j1037j1466
14294A00858K421N585J1063J2430J7698J4294j872j8094j5067J586N435q946l197
14281A24194J8680P859L02J44k022J4443l9191j4455m762p220J9933N288Q601
14268A31794o69J3570k711o292K6715J5357m20r678k5329k4229N255J3102J0701
14255A47166J5991j7380n649L592l541l297M528M933k5915o729l5784M628J1189
$$ y = [92492, 112105, 92048, 69558, 75757, 76413, 49238, 50479, 87031, 104963, 88618, 67625, 54310, 53502, 51929, 61377, 102061, 127928, 103290, 99703, 102633, 88393, 102388, 128272, 137723, 126506, 135118, 135119, 120769, 119119, 122139, 141061, 159599, 185993, 214047, 209099, 204771, 201910, 211316, 191859, 174992, 133236, 94265, 98307, 137712, 120671, 112715, 114742, 115951, 123361, 112324, 100858, 103279, 108864, 119927, 132357, 150055, 164349, 162477, 144383, 129316, 130902, 136337, 127391, 124194, 142874, 150733, 151035, 151179, 149157, 163600, 124409, 109954, 105192, 97972, 117905, 123193, 131794, 131125, 144695, 141984, 135692, 162407, 177764, 177344, 167666, 142337, 118108, 123363, 136465, 147166, 163157, 145777, 140128, 143720, 140179, 136882, 141410, 146343, 120428, 113699, 77915, 82543, 93732]
14242I3732M453K9321J8566J218L049j846o685k765J9474J2620j5952j7817n575
14229A31793r632N197r818K3267N085n687J6246N740j7029j2908l6011k2841Q102
14216H1504J4442K102Q063Q214L4890R698l5468q071k5093J2023R108J688O136
14203A19236J476K756m970q440q199k9133k2041K157L6192L5317p721k2012k7119
14190F7499m635K7038L0146L203j0507k2752J4812M878k4023k926Q790j5749J9729
14177I5503j588q391L94J051J0261K4724K9808O344K3687l270n296k4175k7474
14164A21578j9091j6656J1927j4967o078j2414p68J4607p333L791M557o742N945
14151G8356J5307j7861j2048J0825J3577K0122j8462j683j9343r036J4248J408
$$ y = [93732, 98185, 127506, 146072, 147290, 150339, 148493, 141808, 139043, 158517, 171137, 155185, 137368, 131793, 122161, 127358, 117540, 140807, 145892, 140205, 156451, 162191, 145162, 132254, 96243, 73402, 81504, 95946, 98048, 106111, 114325, 149215, 158913, 123445, 115374, 90281, 102304, 111412, 113100, 119236, 120712, 123468, 118498, 110058, 101859, 72726, 50685, 52842, 89034, 124351, 116630, 94618, 67499, 62864, 89902, 120048, 123251, 112744, 89992, 104804, 109682, 85659, 82733, 91523, 75774, 95503, 93915, 85524, 85918, 86969, 97230, 121954, 151762, 158106, 181793, 178523, 173227, 149052, 121578, 102487, 85831, 97758, 82791, 76713, 64299, 63531, 78138, 70805, 74596, 79153, 72411, 78356, 93663, 75802, 63754, 74579, 88156, 108278, 89816, 88133, 68790, 59754, 74002, 75410]
14139G5410P449l550J5945K0456j1411o507m106K0229J4730l469n014k0286K195
14126A02071N55j7492P252K1923R089J6169j3339j1480k3942m580k655j3245M445
14113G4771j4336k042O92n92p751J3182J1938K4705q581m8425K544J3927j1043
14100D8989m06K464J0150J3267Q433O566j7968k1738R566j51j8105o916J2671
14087D6822J2061K8100L43L760M130j8369J1037J596j1936j3710j0835J596Q226
14074F2821R684M533K3819K54j747k3457j6265k217R93K528J1102k2923j8230
14061C0895K7152j4017L6153J3783K131J8506K4916N205J9507K6142M6830L7515
14049B74718L7157M1576O8538J20042J73412K23200J75673J22628K08405L27729
$$ y = [75410, 82859, 79309, 95254, 115710, 104299, 97792, 93686, 113915, 128645, 125176, 120162, 99876, 102071, 102626, 85134, 92386, 114309, 123398, 139567, 126228, 114748, 90806, 86226, 83571, 70326, 74771, 60435, 58393, 59085, 58493, 50742, 63924, 75862, 100567, 91986, 43561, 46105, 60032, 48989, 48583, 51047, 61197, 74464, 82897, 89463, 71495, 49757, 59323, 59172, 41067, 34151, 46822, 58883, 86983, 87326, 91086, 95216, 76847, 87884, 89480, 77544, 63834, 52999, 54595, 62821, 72505, 77038, 100857, 101111, 99364, 75907, 59642, 57425, 58418, 60946, 72048, 49125, 30895, 58047, 44030, 80183, 93966, 96097, 114603, 139519, 144724, 164231, 190373, 237203, 274718, 311875, 353451, 421989, 542031, 715443, 938643, 1114316, 1236944, 1445349, 1773078]
14039A773078K46807m819p2392L4252O3041j56261l03701k67741j87296j74588
14029I50380k06707k04351j12565p8423n3943l8167l0952k6104l9083k4083j0971
14018A25031L801j4603l4555m737l1452j2952Q377j2946n742n408O100J8728K9243
14005F8885N769r846j5814j664n292n319K632K4525L961P078R909j7372j3377
13992E4075O063o128J8785j3349m0321j4069J0685p488J4549P511j8843p742J994
13979E722P614J1326J8715J902K543j2393J3058Q954j8681m5158R191n658j0130
13966a2995k78N703q288J0968J3183j2322p519k5243j4601J9455J2795Q375j1117
13953b1884j53J0725K0122J8298O579J3311k0733j0123R355k6765J833J169j6309
$$ y = [1773078, 2019885, 2015066, 1942674, 1976926, 2039967, 1883706, 1580005, 1312264, 1124968, 950380, 743673, 539322, 426757, 348334, 294391, 256224, 225272, 199168, 160085, 136002, 125031, 128832, 114229, 79674, 74937, 43485, 30533, 38910, 25964, 20222, 14814, 20914, 39642, 68885, 74654, 64808, 48994, 47330, 42038, 36719, 39351, 63876, 67837, 74915, 84824, 67452, 54075, 60138, 54010, 72795, 59446, 19125, 5056, 15741, 8253, 22802, 30313, 11470, 3728, 5722, 13336, 24662, 43377, 45279, 47822, 35429, 48487, 57441, 38760, -6398, 2793, -2865, -12995, -13273, -7570, -15858, -4890, 8293, -4029, -11548, -36791, -51392, -31937, -19142, -10767, -21884, -22037, -11312, 8810, 27108, 33687, 46998, 26265, 16142, 25497, -1268, 565, 1734, -14575]
13940a4575J1357p069J1987q897N130L2154J3490J574j8053l8522j6818j8263
13928d6505R080K7488M565j3154p11L1929L4366n996J0851J268k0558j8507j1459
13915B657l2513k220j2668P028J5491N636P983K7703K1159r349k7081j0535M230
13902b479N290k0362J5577j2322R721P351j5488q836j457O091J0480M0J950j2814
13888a7258O229J2137l115J1185L553j5256j8999j793O229J8388J5154l735k038
13875A0681J376k3091N631j1521p91j0932n928K0257J2229j2166N219J5643M553
13862A1160P768n477j3430o606p57P36O016J0859o575j1856J2103q087m550j4100
13848b2796l5642J5041K0984K3335J29j1631l367J0677J1298j8976k3352R139
$$ y = [-14575, -3218, -10287, 1700, -7197, -2067, 30087, 43577, 45151, 27098, -11424, -28242, -46505, -37425, -9937, -5372, -18526, -19237, 12692, 47058, 41062, 51913, 53181, 32623, 14116, 2657, -29856, -32076, -44744, -37716, -22225, -16589, -8606, 19097, 40256, 30907, 3826, -6709, -2479, 2811, -17551, -1974, -14296, -4575, 2776, -12712, -21548, -23005, -16914, -6434, -6394, -4444, -17258, -11029, 1108, -2007, 9178, 12731, -2525, -21524, -23317, -17088, 1300, 16454, 12719, 10681, 12057, -11034, -5403, -16924, -17715, -28647, -34575, -14318, -2089, -14255, -9036, 6607, 11160, 18928, 13451, 21, -6585, -7342, -6606, -590, 10269, 3694, -8162, 3941, -4146, -8696, -22796, -58438, -43397, -22413, 922, 1051, -10580, -13947, -3270, 8028, -10948, -34300, -25161]
13836b5161j2865K9615N741P034J412j1250q822j011N990J2786J6966k3302j9352
13823b2219K0097R635n691k3484Q306k4761l438J609M8469K1006J4743j7390j0725
13810A6157l874k0429Q344J0551J2375K3740p429k7391j7881k3987l875P194K03
13797b6302J4831J0080j4369j9289p576K2567K2383k9289J133K0786o345K731
13785h659p689j025r042j0851Q143J4591J0133J4758R427q935p313l990j483j5891
13771a7826l461Q144O28J3100k959j0840J7929L295k7430J5577Q275p826J1557
13758H163J7224o984j82j6854k4013J0734K6507J9501j2049p020p796j2357k1752
13745b6878j9592L273J3001K8454J1658J2452j153P727n75R90j8999l104L653
$$ y = [-25161, -38026, -8411, -2670, 4364, 5776, -5474, -14296, -15307, -9317, 3469, 20435, -2867, -22219, -2122, 7513, 1822, -21662, -13356, -38117, -41555, -39946, 8523, 29529, 44272, 26882, 16157, 12283, -8146, 198, 10749, 23124, 46864, 39435, 12044, -5837, -29824, -33699, -26505, -26302, -11471, -1391, -15760, -35049, -42625, -20058, 2325, -26964, -25831, -5045, -11390, -8659, -16348, -17373, -26415, -37266, -29123, -14532, -4399, 10359, 19786, 10851, 3538, -452, -1935, -17826, -21287, -13143, -12515, 585, -2374, -13214, 4715, 8010, -19420, -3843, 4432, -3394, 8163, 25387, 18403, 18221, 1367, -22646, -11912, 14595, 34096, 22047, 15027, 7231, -5126, -26878, -46470, -43197, -30196, -1742, 9916, 22368, 21215, 28942, 28367, 29357, 10358, 7254, 10907]
13732A0907J4165j450J2516M5341Q925j5948K4172M3353K6365O813K9305L8748
13720B43212J0492Q39j3943q217L243l2231l2433k2053l4081k0606j7684j1068
13708F5470l4877j5476K0327M220k042R079J9387k093n96j4338p710K852K713
13695D6916j2411P674J5612n123j5052N875J3735M0710L0973J2020L0337J7931
13683A89197N35J991K0120K2500j7178j5740p325l9169k3232r695l8755k6170
13671E7079J2070j7390j4267k4681K1451K774m066p719k8180l5170J1849L1433
13659E183j808k820J6450J4384K7369M721k3588M520k141j2157N916j2187r904
13646A3938j6176m954Q443k2116N67q301p350k3005p566L8239M2796J1924k4338
$$ y = [10907, 25072, 23622, 36138, 81479, 90404, 74456, 98628, 141981, 168346, 175159, 204464, 243212, 253704, 254543, 240600, 232383, 235626, 203395, 170962, 148909, 114828, 94222, 76538, 65470, 30593, 15117, 35444, 39664, 37622, 46701, 66088, 63995, 63399, 49061, 41351, 44203, 46916, 34505, 42179, 57791, 52668, 37616, 43491, 57226, 97936, 128909, 140929, 171266, 189197, 189732, 191723, 211843, 234343, 217165, 201425, 194100, 154931, 131699, 122004, 83249, 57079, 69149, 51759, 37492, 12811, 34262, 37036, 32970, 25251, -2929, -38099, -26250, 5183, 3375, 555, 17005, 31389, 58758, 63479, 39891, 44411, 42270, 30113, 36029, 23842, 13938, -2238, -7192, 1251, -20865, -20298, -28599, -35949, -58954, -66520, -28281, 14515, 26439, 2101]
13633B101Q079n087q799O539K3289j5724j4474J2171J8931l181o418j3374j4356
13620a0303p758K5048q429k2615J1624q908J0472J7072r390j1367j0833J4782
13608a0605J7955o384k0931J441K0075L5547J2272l5963j7111k2199k1978K1262
13596b6619J5255l080o215l242N314l260m620J0969R34J6227k6652j0036l575
13583c8600K588J3681L3735L285r789j6197J4723r18L846q882r164j2719P051
13570a7360Q569M149P98j5497j3929L2746o507k2116Q625P65j0406m455p963j497
13556d4078J9988j926k1206J2291L3545L509j0381J1877p604J2622j3436j8648
13544b3447M42J217J6496R765k0127k2689N680N901j4592L0558P077j7384r908
$$ y = [2101, 10180, 5093, -3706, 2833, 26122, 10398, -4076, 8095, 27026, 23845, 17427, 4053, -10303, -18061, 6987, -1442, -24057, -12433, -21341, -10869, 6203, -3187, -14554, -25387, -10605, 7350, 966, -19965, -18524, 1551, 37098, 49370, 13407, -3704, -25903, -47881, -26619, -11364, -14444, -20659, -23901, -18587, -21847, -26467, -15498, -14564, 1663, -24989, -35025, -38600, -36012, -22331, 11404, 14689, 4900, -11297, 3426, 2508, 6354, -2528, -11692, -24411, -17360, -8791, -4642, -3844, -19341, -33270, -524, -7031, -29147, -20522, -19757, -30163, -34618, -42581, -44078, -24090, -26016, -47222, -34931, -1386, 2123, -8258, 3619, -3985, 8637, -4799, -23447, -23005, -21788, -5292, 4473, -15654, -38343, -32663, -26762, -41354, -10796, -3719, -21103, -31011]
13531c1011l164K43J1904p011r410J5629K4605r955j4517n946j7964P813K9036
13518i748J1817q314M214N881Q240J1986m666j1328N819l909p511m308J2248J4286
13504B4707l2054k6985P765j3262P212j199J0801J4259q99m874j718r11K4159
13491G001O590j9145j0936K0940p07r708j8150K712p357k582j8655j1738L8954
13478b2781K0130L7968J5632k5459j9289j0124O54P51m877K546q323q86j4746
13465b8804k5729j3253J0957K4963L945m11r953P973J0648j658Q995L451l287
13452a2163P044M705q32N111Q98j185j0796r437R286j2589o90J9254j0470j2567
13438b4431j4788j0848K8863L8081k9544j0817K6537J7883J215k2655j8872j4545
$$ y = [-31011, -34175, -33932, -22028, -29039, -38449, -22820, 1785, -8170, -22687, -28633, -46597, -38784, -9748, 2069, -6245, -2031, 3850, 12090, 24076, 19410, 8082, 13901, 9992, 2481, -1827, 10421, 24707, -7347, -34332, -26567, -39829, -32617, -33816, -23015, -8756, -9655, -14529, -16247, -17158, 7001, 13591, -5554, -16490, 4450, 3743, -5965, -24115, -21403, -28760, -31342, -49997, -61735, -22781, -2651, 35317, 50949, 25490, 6201, -3923, -3269, -2518, -7395, -4849, -13172, -14058, -28804, -54533, -67786, -56829, -31866, -27921, -28332, -38285, -30312, -19664, -21322, -12327, -8876, -12163, -5119, -414, -1246, 3865, 4763, 3578, -7218, -16655, -7369, -19958, -20648, -1394, -11864, -24431, -39219, -50067, -21204, 16877, -12667, -23484, 3053, 20936, 22151, -504, -19376, -33921]
13426c3921k963K8699K2751L801o142j8466j3270O068P147R202L628n055n659
13413d180k6297o872L4616J4809o995N186j1208M408n509m635j6962J1045j0202
13400b2796j7749L989r434j0891N652K8904K7097q287r779K0555J5162j0183L822
13387A6062j1050k7741j1429J4286L818j231o15K9525K1357P359q963j6530M248
13374A9096J2782j0133N655j147j3996r2O784j1759L272j1379j2237L27J0032
13361b795K450N657L667R533q177j3804N042J8825j0763j8253k1830j6926L790
13348d3584K8029J0725o779L071j1213q708L237j2104j023L3643J6702l2378r556
13335b9938J1619M1491J7352j5204k9222k1688k135J1087O236R717j4271k3170
$$ y = [-33921, -36884, -8185, 14566, 18367, 12225, -6241, -19511, -13443, -6296, 2906, 6534, 1479, -4180, -30477, -37349, -2733, 12076, 5081, 10267, -941, 3467, -2042, -6677, -23639, -12594, -22796, -40545, -36556, -45990, -56881, -51229, -22325, 4772, -3515, -13294, 7261, 22423, 12240, 16062, 5012, -22729, -34158, -19872, -16054, -17285, -17900, 11625, 32982, 40341, 31378, 14848, 19096, 31878, 21745, 27400, 26253, 12257, 12165, 18949, 7190, 10462, -917, -13154, -12827, -2795, -345, 5312, 8979, 18512, 10335, -3469, 1573, 20398, 9635, -8618, -30448, -47374, -43584, -15555, -4830, -11609, -8538, -19751, -28459, -25222, -37326, -38349, -4706, 11996, -20382, -29938, -18319, 23172, 40524, 25320, -3902, -25590, -27725, -16638, -10402, -685, -14956, -38126]
13323c8126p444Q721K7189J4037L31j1612r59O898L835j0702N730O500k6563k68
13309b2433J5634J2676j0566M432L131J0740k7053o622m30r028j0013q798L282
13296d5048J4236J2428J365n780j4523n79N168m115m598N98O091j6674k671K0968
13282c3134J3236Q222j7362k646Q30N396q986J8006P554J6019K4370P609K3413
13269F2527j7524k7074K368r973j1496o423J5081q247j7876m334J2353k112j1096
13256b3826k264q710N247J0538J9181P212q787r404k921m891k4046j5273J747
13243e6197J4027J6547R650m853m765m641P654K2895j962j419m57j6915k5165
13230d5601r619K4027K2941K3603R53j2551o236K3251J395n066r286j4264q94
$$ y = [-38126, -45570, -36849, -9660, 4377, 4708, -6904, -7863, -965, 2870, -7832, -2102, 4398, -22165, -22433, -6799, 5877, -4689, -257, 2874, 13614, -13439, -20061, -20491, -29519, -39532, -48330, -45048, -30812, -18384, -17019, -22799, -37322, -37901, -32733, -36848, -41446, -40848, -34757, -51431, -54102, -33134, -19898, -11676, -29038, -31684, -30854, -25458, -34444, -16438, -8884, 7135, 31505, 39114, 62527, 45003, 17929, 20297, 10324, -1172, -7595, 7486, -761, -18637, -22971, -10618, -12730, -23826, -26090, -34800, -29553, -19015, 166, 7378, -1409, -10813, -13734, -18625, -42671, -57944, -56197, -42170, -25623, -15973, -20826, -25591, -30232, -22578, 317, -1645, -3064, -3521, -20436, -45601, -55220, -31193, -8252, 15351, 16304, 3753, -2483, 20768, 22163, 17097, 7811, -6453, -7347]
13217g347l237P45P607K1692J5023o749J8257L0131K0180J7098K8533K5015L1146
13204A98094K9093M3944Q1967J45882J47379J98371J81468J47175K32359K90017
13194A695749J74074k1490l9472M6474n3745j93800k30809k12048j90104j89952
13184G84877j80005j42984j15850n8289m8572n6495l9684l8494P05p776r023k1377
13172F7033k06j4781j5269K41m286j1687j3535K117J2683j051K1193K7347N705
13159G5504j2963k1752m527L6895L1566J5617k0959j8314j6772j4682P612r582
13147D7643j1463j1153j4402n288N135M819K7536P489J2509k3774j5454q175n639
13134I783R554K685j6838j4282J2229M139J4569J0200J949K193L378n167n734
$$ y = [-7347, -10584, -9839, -2232, 19460, 34483, 27734, 45991, 76122, 96302, 113400, 141933, 166948, 198094, 227187, 271131, 353098, 498980, 646359, 844730, 1026198, 1173373, 1405732, 1695749, 1869823, 1848333, 1808861, 1855335, 1801590, 1607790, 1376981, 1164933, 974829, 784877, 604872, 461888, 346038, 287749, 239177, 182682, 142998, 104504, 105209, 97433, 88410, 67033, 66827, 52046, 36777, 37018, 32732, 21045, 7510, 9627, 22310, 21259, 42452, 69799, 75504, 62541, 40789, 36262, 73157, 104723, 120340, 99381, 81067, 64295, 49613, 57225, 47643, 36180, 25027, 10625, 5337, 10472, 15291, 42827, 50316, 62825, 39051, 23597, 15422, 9783, 19337, 22022, 5184, -9098, 3131, 7270, 21839, 32039, 33988, 36181, 39559, 34392, 28658]
13121B8658m530j4416k0498J4184R126r839J4295K5563k7217o187q110J1134K0294
13108C2457J0255J2570m962j6227j039m3717k5613L0475K2784j054O552J7837
13096D0318K1037n720L871j5301r382P774j3185k3119J4482L2485K2444k6546
13084D9158K8286K9558k2699l6704k2700o612M477k4509j312J8552K593J1807
13072B9895J9447j7498k2635R62K8132j060q410o699l363p32j2341L146m208L408
13058H044M207L175K0520N308r301j2906P020o271l0316o109L1524J6377j2370
13045A8902k4849j1185l546K9356J4591m010j891j8060j6104q919K2871M2507
13033C9663P434j2242J00K493K3865O027K3750M6066L763J0587K8482M9163J5716
$$ y = [28658, 24128, 9712, -10786, 3398, 12524, 2685, 16980, 42543, 15326, 9139, 1029, 12163, 32457, 42712, 55282, 50320, 34093, 33054, -10663, -36276, -5801, 16983, 15929, 22481, 40318, 61355, 55635, 59506, 44205, 34823, 42597, 29412, 6293, 20775, 53260, 75704, 49158, 77444, 107002, 84303, 47599, 24899, 18287, 22764, -1745, -3057, 15495, 18088, 29895, 49342, 31844, 9209, 10171, 38303, 37243, 28833, 22134, 18771, 18039, 5698, 8844, 4636, 8044, 12251, 15426, 35946, 41254, 31953, 19047, 26067, 19796, -10520, -16629, 14895, 31272, 18902, -5947, -17132, -20678, 8678, 23269, 19259, 17368, -692, -16796, -25715, -2844, 39663, 47097, 34855, 34955, 37448, 61313, 67340, 91090, 137156, 140919, 151506, 179988, 229151, 244867]
13020B44867J2377P968J9260l0266k1286j6680r583k1843k5670l3166n9572l9881
13008B6525M568J1522j859Q142J681k197l894m826J7543K794K884j4406O790J0736
12994F6003j1046l2632N839O749j4103j089K072K405R084M035K8484P938P623
12981H1362p156o261Q87O353n814k7264k5020K1820K3142l322j1402k191j2390
12968C2744L442j753j466J2977j131k3581k2390k3560j1847m166J7279J7828J2524
12955F900O681M6793J5131L899j620J612N238L9256R817j2163P578J4158J5417
12942A58697j5984P823j7299o476P663j2038R920k4424j9347j3560M543J2521
12930I2039P591o849k3406j8396j6773j3872O160K538K2606K8858L763n054J307
$$ y = [244867, 257244, 265212, 284472, 254206, 232920, 216240, 206657, 184814, 159144, 125978, 66406, 26525, 31093, 42615, 40756, 48898, 50579, 48382, 44488, 39662, 57205, 59999, 62883, 48477, 55267, 66003, 54957, 22325, 28164, 34913, 20810, 19721, 21793, 24198, 33282, 37317, 65801, 73739, 81362, 74206, 67945, 68832, 75185, 69371, 42107, 17087, 38907, 62049, 58727, 47325, 45134, 32744, 36186, 34433, 32967, 45944, 44813, 21232, -1158, -24718, -36565, -40731, -23452, -5624, 6900, 13581, 60374, 75505, 79404, 77784, 79396, 84634, 123890, 133707, 121544, 129122, 143280, 158697, 142713, 150536, 133237, 126761, 134424, 122386, 132306, 107882, 88535, 74975, 79518, 92039, 99630, 92781, 69375, 50979, 34206, 20334, 26494, 29032, 51638, 80496, 84259, 79205, 80512]
12917H0512J2406K9431J7819p128r492N143J3593k283r063N778M66M090K6140
12904A67412K3615k43J1083N4635L5172R107j0595j4255j6547l9620j9792M245
12892B04217j1656j7638l2523j5288J5349K0193l256k880J9278J7831L796j4603
12880A82820M036J7634j8106j4626K4682J9871Q370Q37J8172J6301J2872Q822
12868B81685l0532q791L7427J6882M055J4719K0866K6157l314j1877j8737R160
12856C37700Q358O440J7289J0066K1940M177J1793j0508J3150L8028L4356J4053
12844E06842J8067K8664M245j3508L9597M4802M4485J0137j0567J7843J9196J5858
12832G25661N612J0837O48P476L0853j0568J7346K6727O7254L0405L1794K5101
$$ y = [80512, 92918, 122349, 140168, 133040, 123548, 128691, 142284, 140001, 130938, 136716, 137182, 141272, 167412, 191027, 190784, 201867, 256502, 291674, 300781, 290186, 275931, 259384, 219764, 199972, 204217, 192561, 174923, 142400, 127112, 142461, 162654, 159398, 156518, 175796, 193627, 197423, 182820, 186856, 204490, 186384, 171758, 196440, 216311, 224681, 225518, 243690, 259991, 272863, 281685, 251153, 242362, 279789, 296671, 300726, 315445, 336311, 362468, 359154, 347277, 328540, 337700, 346058, 352498, 369787, 379853, 401793, 405970, 417763, 407255, 420405, 458433, 492789, 506842, 524909, 553573, 557818, 544310, 583907, 628709, 673194, 683331, 672764, 690607, 709803, 725661, 731273, 742110, 742758, 750234, 781087, 770519, 787865, 814592, 881846, 912251, 944045, 969146]
12820I69146K0008K7038M3336O8034P7141P0645Q8834Q2457N6030J04762J09162
12809A716593J02659J13089J17829J31270J26066J27310J71820J93629J91074
12800B991339K30496K69891K89335L24993L69823M30669N11829N83803O89663
12791F691841Q10477J019668J311114J659777K035307K374434K664964L160450
12783B1728032L757684M069810M239248M649741N570271O824498Q465099J1398786
12775G0703169J6780421K5671008L6451534L8293445K9900879L6051743N0808172
12768C04660371M6153239J4893132m853652L798065K510870k5788838m8460297
12761B92912890m6419106l4851784l6385385l9125459l4241729k5755611j6979897
$$ y = [969146, 989154, 1016192, 1059528, 1127562, 1204703, 1275348, 1364182, 1446639, 1502669, 1607431, 1716593, 1819252, 1932341, 2050170, 2181440, 2307506, 2434816, 2606636, 2800265, 2991339, 3221835, 3491726, 3781061, 4106054, 4475877, 4906546, 5418375, 6002178, 6691841, 7502318, 8521986, 9833100, 11492877, 13528184, 15902618, 18567582, 21728032, 25485716, 29555526, 33794774, 38444515, 44014786, 50839284, 59304383, 70703169, 87483590, 113154598, 149606132, 187899577, 217800456, 253852199, 304660371, 350813610, 365706742, 360853090, 364651155, 367162025, 341373187, 292912890, 246493784, 211642000, 175256615, 136131156, 101889427, 76133816, 59153919]
12754E9153919j0975688p666932n815158m420613l417780l009145k886115k609184
12746A8353304k202222j886951j691247j525296j287827j039363q44665p10063
12738G165670n88955m97339m23064m00387l97681l29449k86867k53407k45258
12729C743263k16333k14284j59129j28235j11872j39037j26446j13302p3618q3711
12719B377296j10164q2712m7092o5813p9201p0610P553l8524q4856q1119p6545
12708A648213p5282l0698n9703q5256k3116l665k6987l6037n8162n8471o3396
12697A127440m6196j8274j0893j6755j3253l852j5724l1780k1958k0867P566O095
12685I41549k5107m0697k3201k3777l2962J0709P539l721P502K129j1338k7380
$$ y = [59153919, 48178231, 40511299, 34696141, 30275528, 26857748, 23848603, 20962488, 18353304, 16151082, 14264131, 12572884, 11047588, 9759761, 8720398, 7875733, 7165670, 6576715, 6079376, 5656312, 5255925, 4858244, 4528795, 4241928, 3988521, 3743263, 3526930, 3312646, 3153517, 3025282, 2913410, 2774373, 2647927, 2534625, 2461007, 2377296, 2267132, 2184420, 2137328, 2071515, 1992314, 1921704, 1929257, 1890733, 1805877, 1724758, 1648213, 1572931, 1542233, 1482530, 1397274, 1374158, 1370493, 1343506, 1307469, 1249307, 1190836, 1127440, 1081244, 1062970, 1052077, 1035322, 1022069, 1018217, 1002493, 970713, 948755, 927888, 935454, 941549, 916442, 875745, 852544, 828767, 795805, 806514, 814053, 810332, 817834, 819963, 808625, 781245]
12673G81245o56L011j7576l5239j8169P275K772p869q637MJ6872L976l6922k358
12659F87729j7404j4337K398P142M297k5713l7458J8931K4889k0129j6036j708
12647F12601K0367J865k4915m731K892j3953k881l370o533o317k3858k8583o70
12634E21914k5058j9614j2941m608L397p019K395k283p301p603J895o117k3039
12621D14018N828J2927j333m312j3195j9783K1299N1564J1619k5481n877N275
12609D52549k7686j7377M338r629J6038k1575k7389k3379j9421j375J5393j9583
12597C20904n866j400N8m522l829k393l9110l7784j6805N793L904j1883P684J4767
12583B29518l479J6771O822m968J1526j122J4509K3118J5002P214R752j4609J0957
$$ y = [781245, 780589, 783600, 766024, 730785, 712616, 719891, 722663, 714794, 706157, 706161, 723033, 727009, 690087, 687729, 670325, 655988, 658386, 665528, 669825, 644112, 606654, 625585, 650474, 630345, 614309, 612601, 632968, 634833, 609918, 605187, 608079, 594126, 591245, 587875, 581342, 575025, 551167, 522584, 521914, 496856, 477242, 464301, 459693, 463090, 456071, 458466, 456183, 448882, 441279, 443174, 437057, 414018, 419846, 432773, 431440, 427128, 413933, 394150, 415449, 467013, 478632, 453151, 447274, 452549, 424863, 407486, 411824, 402195, 418233, 396658, 369269, 345890, 326469, 325094, 340487, 320904, 315038, 313638, 313696, 309174, 305345, 302952, 263842, 226058, 209253, 215046, 218950, 207067, 214751, 229518, 226039, 242810, 249632, 244664, 256190, 255068, 269577, 292695, 307697, 314911, 324663, 310054, 321011]
12570C21011l776k4729j901R098l276m704k8308r646M29m112J921j6325j820L3444
12556B67306K7662J2070l213N347j365q857k2353k5083p093k1j157j0273R17K014
12542B35901Q704J4973p399J475j4639m726j9197K610l48m976L716l379j0390
12529B02325j93j69j2518J366K7073o157r435J5571J4789J044K422j367j3299
12516B21452J8221L2429k761J970j8329p208r011p690R003k115p155q625q686
12503B11495n064j7321p076R08N3J661l6579j4028J4694K3914O532l4125N169
12490A50233o603K0075Q59J9060r756k692J2992J5788P535N993j3163k0586K765
12477A82500j2566k790K3183K5434Q570J4943J3384K0894L1143K7004K2504O4651
$$ y = [321011, 317235, 292506, 290605, 299703, 296427, 291723, 263415, 253769, 254198, 250086, 252007, 235682, 233862, 267306, 294968, 307038, 303825, 309172, 307807, 298950, 276597, 251514, 244421, 244400, 243243, 232970, 233887, 235901, 244605, 259578, 252179, 253654, 239015, 234289, 215092, 217702, 217354, 212378, 216094, 212715, 202325, 202132, 201963, 189445, 190811, 217884, 211727, 202292, 217863, 232652, 233696, 236118, 234751, 221452, 239673, 272102, 269341, 271311, 252982, 245774, 236763, 229073, 238076, 235961, 228806, 220181, 211495, 206431, 189110, 182034, 182942, 182995, 184656, 148077, 134049, 148743, 172657, 179189, 145064, 150233, 143630, 163705, 164564, 183624, 173868, 171176, 184168, 199956, 207491, 213484, 200321, 179735, 182500, 169934, 167144, 190327, 215761, 224331, 239274, 252658, 273552, 304695, 331699, 354203, 418854]
12465D18854o688q7558m0574m3665o3911k8035J2557K3903q8l785R478j1797l6379
12452A42312k1683n573j3220O937j979K1219J419k0603k0206j389J4288M367J5639
12439A21528J4515J1224l382L1593P220m0058n434K6090q107p756r968J2470J3786
12426A63721K9673K3234k0748l2400j0486J2051r842k1144q918k930J1524K0970
12414A54705j5956j8605O552n157L059O391q449l651l046j798K2748P16p935O397
12400A35971O221K708J2962J1016J8412l4342m8469k0704O00k952J258O749j1404
12387G8026k1229Q49O317J1710J7247L5765n924M448k4514j8119K060J4904J4196
12374A15736J3279m57p997O805J3387J4232r569j9294l8702N953K2363j095n206
$$ y = [418854, 412166, 324608, 284034, 240369, 176458, 148423, 160980, 184883, 184795, 181010, 190488, 178691, 142312, 120629, 115056, 101836, 108773, 106794, 128013, 129432, 108829, 88623, 87234, 101522, 105889, 121528, 136043, 147267, 143885, 175478, 182698, 142640, 137206, 163296, 155189, 147433, 137465, 149935, 163721, 193394, 216628, 195880, 163480, 152994, 165045, 155203, 134059, 125141, 122211, 133735, 154705, 138749, 120144, 126696, 121539, 124598, 130989, 122540, 118889, 115843, 114045, 136793, 137509, 129574, 135971, 142192, 144900, 157862, 168878, 187290, 152948, 104479, 83775, 84375, 81423, 82681, 89430, 78026, 56797, 57646, 63963, 75673, 92920, 128685, 122761, 127209, 102695, 84576, 86636, 101540, 115736, 129015, 128558, 120561, 127366, 140753, 154985, 145416, 126122, 87420, 93373, 115736, 114641, 109435]
12361A09435J2370k27j6471R16J4785L1492k259k8678J5810J8909N799M6935J9308
12348B28124K0769K7079K9634K4434Q1648P3095R3650J43006J94680J85950J45325
12337A247394J79667K46296K06843M4549n462L7361Q809j55581k51570k19029
12327A339277j89148j81040j97873j57807j19738p4636p6366o9685k8203j7330
12317B27451j5317j6487M489r611k7362Q958j8204L717K1342j3243k4121k6621
12305A14991j0497P554J1501K1393o827q918j9018J1322L14j7368j7198j8842
12293F8407r609L929J0568n98J323N336K0753Q184K014J795O48q153k6730n753
12279G2114q377k449J55J5426J4441l2421j3517N860P616J1548P397p505j367
$$ y = [109435, 121805, 121578, 105107, 106023, 120808, 152300, 150041, 121363, 137173, 156082, 161881, 208816, 228124, 248893, 275972, 305606, 330040, 411688, 484783, 578433, 721439, 916119, 1102069, 1247394, 1427061, 1673357, 1880200, 1924749, 1919287, 1956648, 1965457, 1809876, 1558306, 1339277, 1150129, 969089, 771216, 613409, 493671, 419035, 342669, 272984, 244781, 227451, 212134, 195647, 200136, 190525, 163163, 172121, 153917, 157634, 178976, 165733, 141612, 114991, 104494, 112048, 123549, 144942, 138115, 129197, 110179, 121501, 121815, 104447, 87249, 68407, 58798, 62727, 73295, 72697, 74020, 79356, 100109, 108293, 110307, 112102, 112750, 104597, 77867, 72114, 63737, 61288, 61443, 76869, 91310, 58889, 45372, 51232, 58848, 70396, 77793, 70288, 68921]
12266F8921l922p713K6179K4868N397K3140K1889l4307j8055Q563n948k1783j7213
12253G0016j2291J1833j5174j1498J8161k7286m417J0027J8449J6306J822K167
12241G8115j2566P50J7269K717j987k0923l0001N028P647J2284M146r705J3582
12228F6356Q155N829m490J5338R938k3402k3942j1095Q663m646j0470Q837O547
12215E1618j8290K323n629k3227L7695P443j0482J9778r268l968j0918l1785J0515
12202A5805M834R485J3223J776J6753O102m190K473J1996N538p90J7153N917J146
12188A07221j313K0284k6948l0727k0680O209O222J5261J197J4317l818k4320
12176F2905M26R825m645p767O239R006N185j568k1130j5972J3007K4028n564k2043
$$ y = [68921, 64999, 57286, 83465, 108333, 113730, 136870, 158759, 124452, 106397, 114960, 109012, 87229, 70016, 57725, 69558, 54384, 42886, 61047, 33761, 29344, 39371, 57820, 74126, 75948, 78115, 65549, 66299, 83568, 86285, 84298, 63375, 33374, 38402, 46049, 58333, 62479, 52774, 66356, 74511, 80340, 75850, 91188, 101126, 77724, 53782, 42687, 51350, 46704, 36234, 45071, 51618, 33328, 35651, 30022, 6795, 44490, 51933, 41451, 61229, 51961, 47993, 37075, 5290, 15805, 20639, 30124, 43347, 45123, 61876, 67978, 63788, 66261, 78257, 83795, 83005, 100158, 106075, 107221, 105908, 126192, 99244, 68517, 47837, 54046, 60268, 75529, 76726, 91043, 87225, 62905, 63331, 73156, 68511, 60744, 66983, 75989, 81174, 79606, 58476, 42504, 55511, 79539, 73975, 51932]
12162E1932k6185k4094K1456R595n843J0518J3335l668K9042K7031k585q053j7815
12149G4666k0078r086L461K818J8530Q905N563j0794l5518j2112p504n212J6167
12136B9806o30O220R207J5364O39K588k7743m978K2111K4067j4591j860j2220
12123D7980K378K0462PJ0037K0421K733r442j0452L280r987j8753r807j845j8859
12109B8153l5692J0017J8776J8418J9988J760l9946j4584N771K9281K5264O344
12097G3550j5320m507j2778K90O924l895R447L858J0243q018J809Q689j0389M895
12083F4798L0932R130q565k9823j08L1750J043k1215M09j54k3642j4419J8054
12070E8190K0438K3453P884Q890K6275r180l4310L81K720j9162q1j712j6223Q827
$$ y = [51932, 25747, 1653, 23109, 32704, 26861, 37379, 50714, 47046, 76088, 103119, 100534, 92481, 74666, 54588, 45502, 48963, 51781, 70311, 79216, 84779, 73985, 38467, 26355, 18851, 13639, 29806, 29176, 35396, 44603, 59967, 60606, 63194, 35451, 30473, 52584, 76651, 62060, 60200, 47980, 50358, 70820, 70827, 80864, 101285, 104018, 94576, 84124, 87404, 77417, 58664, 48857, 47012, 28153, -7539, 2478, 21254, 39672, 59660, 61420, 21474, 6890, 12661, 41942, 67206, 73550, 58230, 53723, 40945, 41235, 48159, 44264, 53711, 57569, 67812, 59794, 61603, 70292, 59903, 64798, 95730, 104860, 96295, 66472, 66364, 98114, 99157, 77942, 78351, 78197, 54555, 40136, 58190, 78628, 102081, 109965, 118855, 145130, 135950, 101640, 102021, 104741, 85579, 85498, 83786, 67563, 76390]
12056G6390j8767k4028k4386K2939L7520L666j2419j570j0032o003J440r026j0212
12043B5512l391Q224K3460j6556o758j20R505M124M982J0604k397j1137J2389
12030E8441k3665j7227r526J0960j2377K108k706N635j5155J098J8436K1467o111
12017C1378P103J3548j8430J3210J4963j6666r657n912O249J7586K974j2640p063
12004C6643m533l729J0148L809J3280N332J7167L882l053j8223N984L744k7683
11991D2768k1526n114K9748J0372m457j0470k081J4072M0393K3473J0771j6332
11979A11617M255j429l441q613K3876K0504k495m350j5745q651k5480k2100j4401
11966E3547M849j776Q118j723j9119k2150j9761j2917L182K4930l711M337J6045
$$ y = [76390, 57623, 33595, 9209, 32148, 69668, 73334, 60915, 59345, 49313, 43310, 44750, 35724, 25512, 22121, 30345, 53805, 37249, 30491, 30371, 39876, 44000, 48982, 59586, 57189, 46052, 58441, 34776, 17549, 8023, 18983, 6606, 8714, 6008, 11643, -3512, -2414, 16022, 37489, 31378, 38481, 52029, 33599, 46809, 61772, 45106, 35449, 29537, 35786, 53372, 56346, 43706, 36643, 32110, 28381, 38529, 42338, 55618, 60950, 78117, 81999, 78946, 60723, 66707, 70451, 42768, 21242, 16128, 45876, 56248, 51791, 41321, 39240, 53312, 93705, 117178, 127949, 111617, 115872, 114443, 111002, 102389, 126265, 146769, 144274, 139924, 124179, 115528, 90048, 67948, 53547, 58396, 56620, 64738, 63015, 43896, 21746, 1985, -10932, -7750, 17180, 13469, 17806, 33851]
11953C3851o403Q719m163j4908k6401J1397j144j136L773j7195j6294L6219K9710
11940C6025J2951k289q827j4078r956k1439j3015N322J3587K2530J178K0241r843
11927C2387l95q332J0188n98K3404j1338J5800J935q004j2276P625j2010o128
11914C2258J8029J121k4742o158Q263L4028l853k9560N714j1575l631j2686K4124
11901C1332k4723P323K0494j5343j7441M010L829P993k29j168J7044J4141l3979
11888A3283k426Q264j824J7287q385j3867l965k2280j3928M39K4681N022m440
11875b139J0221L2662K7644K0814K2028K2267K8247J9936l4977m4876l4784j3376
11863E3667J0452L857m856J1586j0639j3554J0570M626j4851j0780K5220M6835
$$ y = [33851, 27448, 36167, 32004, 17096, -9305, 2092, 948, -188, 3585, -13610, -29904, 6315, 36025, 48976, 46687, 37860, 23782, 13826, -7613, -20628, -15306, -1719, 20811, 21989, 42230, 32387, 31992, 23660, 33848, 33250, 56654, 45316, 61116, 63051, 55047, 42771, 50396, 38386, 32258, 50287, 51408, 26666, 20508, 28771, 62799, 58946, 29386, 35100, 23525, 19894, 7208, 31332, 6609, 13932, 34426, 19083, 1642, 5652, 9481, 17474, 17245, 16077, 33121, 47262, 13283, 10857, 19121, 17297, 34584, 26199, 12332, 8367, -13913, -27841, -27402, -2721, 2301, -2139, 8082, 40744, 68388, 89202, 111230, 133497, 161744, 181680, 146703, 101827, 67043, 53667, 64119, 67976, 63120, 74706, 64067, 50513, 61083, 65709, 50858, 40078, 65298, 112133]
11851A12133P5337P6785Q5231K5736n9857r4665p8657m3051j0191q375k6751l7578
11839A6097m466P806J2409J6974N037O313j4998j3197J0359L333K311j5253k4434
11826H291M474Q321J1841n373l0012j4375J3214J2395K5185P379j2500M732K669
11813C6241q559j224k1197Q092K2527r853O749L131j5977j9852J6291k1480k7099
11800c2210J0372Q471o836J8822J7892m456N391J2472k4276r18j1288J553P249
11787B238K884L336J0648P640J2103P898j2224k4827k5796J0970J8193O188n074
11774A4177q029R674o821j504K849j5072j5800k179K068K6793O46M396L172j2769
11760A601j2977r585L1433J7336m218r989j1567l162J0221J2845p65j5702O247
$$ y = [112133, 187470, 264255, 349486, 375222, 315365, 220700, 142043, 98992, 88801, 80426, 53675, 16097, 11631, 19437, 31846, 48820, 53857, 60170, 45172, 31975, 42334, 45667, 47978, 32725, 8291, 12765, 21086, 32927, 27554, -2458, -16833, -3619, 8776, 33961, 41340, 28840, 33572, 36241, 27682, 26458, 5261, 13353, 35880, 26027, 32776, 35907, 19930, 78, 16369, -5111, -32210, -21838, -13367, -20203, -1381, 16511, 12055, 17446, 29918, 5642, 4724, -6564, -5011, 2238, 5122, 8458, 19106, 26746, 38849, 46747, 34523, 9696, -16100, -5130, 13063, 19251, 14177, 6148, 15822, 9001, 7497, 10346, -4726, -20526, -22705, -20637, 6156, 6802, 11198, 14370, 1601, -11376, -20961, 10472, 27808, 23590, 13601, 2034, -1128, 9093, 21938, 21173, 5471, 11718]
11747A1718K9415P152l303p20k6088l951K8763P854j0707q460m166j4628j9695
11734f816J71J962r12K4634M142r806j0572P11L727M59K9187j261k7272l618O121
11719A0857k0035M51K1442J3825j4044k984j9228P83M825l653N573j2660JJ4297
11705e50J8071J6772j8616l0501K2854J9873j9183j5706m495K6635j2185j8770
11693a5801J3940J9700J4951j0358k4549l244OK0214J7384m656O556J3533k6130
11680B1546m320m561j0647j8409j6208P946K5613R682J3860J3515l978r927O876
11667C0988j5294r552k4465j1562K6880n026K376J0094J1026j85Q106o256k3246
11654f116j1731j4663K4108J2221N396J0101l240R477L2953K5126J279O491p885
$$ y = [11718, 41133, 48285, 44982, 44262, 18174, 14223, 42986, 50840, 40133, 31673, 27507, 12879, -6816, -6645, -4683, -5595, 19039, 23181, 13375, 2803, 3514, 7241, 7700, 36887, 35626, 8354, 4736, 10857, -9178, -8727, 12715, 26540, 12496, 9512, -9716, -8933, -4108, -7761, -2188, -14848, -14847, -550, 17521, 34293, 15677, -14824, 8030, 27903, 8720, -6986, -11481, 15154, 2969, -15801, -1861, 17839, 32790, 22432, -2117, -5361, -5355, 14859, 32243, 27587, 34143, 47676, 21546, 17226, 12665, 2018, -16391, -32599, -24653, 960, 10642, 24502, 38017, 34039, 24112, 30988, 15694, 6142, -18323, -29885, -3005, -8031, -5655, 4439, 15465, 15280, 23386, 17130, -6116, -17847, -32510, -8402, 3819, 9215, 19316, 16076, 25553, 58506, 83632, 84911, 91402, 83517]
11641H3517l4059l2363j0186j5417j0008j4591J0701N5n414N371m672O313J5783
11628d970l532L0538l860j9324k175k803j2028R337j731j0445pK0023K6293K6020
11614E1336k4477k0499j4628L695p854p307J2343O942l4419j5911J2117K4725
11602a3937q813q169K751O376r510J666J2701J2050j0266L501j7239l0396k944
11589f2229J2084L3445j1073q406J4998J2568K031j468n289K1880Q457M6Q376
11576B5420r326L116J786n808j566k0533p979K615J7449K6766k4704k209J7724
11563B2751j1814o560J5210J4727n194N682n612p587Q741j6100j5852Q666j575
11550E483o025J9856J1987o475l7575o43K1554J7021n016k2360j5221o38K6072
$$ y = [83517, 49458, 17095, 6909, -8508, -18516, -33107, -22406, -22351, -27765, -22394, -27066, -20753, -4970, -8502, 22036, 18176, -1148, -3323, -6126, -18154, -8817, -10548, -20993, -21000, -977, 25316, 51336, 26859, 6360, -8268, -4573, -12427, -19734, -7391, -449, -34868, -50779, -38662, -13937, -22750, -30919, -28168, -21792, -31302, -29636, -16935, -4885, -15151, -11650, -28889, -59285, -62229, -50145, -16700, -27773, -36179, -21181, -8613, -6582, -8050, -13339, 8541, 16998, 17044, 25420, 16094, 19210, 20996, 15188, 13622, -6911, -14890, -12275, 5174, 31940, 7236, 5027, 22751, 10937, 4377, 19587, 34314, 29120, 34802, 29190, 21603, 30344, 14244, -1608, 7058, 5483, -542, 19314, 31301, 24826, -12749, -13392, 8162, 25183, 20167, -2193, -17414, -18052, 8020]
11537H020j3557p569r03J9897K8929J098M771R26j5565j4075j8896q813J9039
11524C302J7946k6128j0053k0077M259k225P044K2649M234j8098k0436P129o072
11511c6526Q931J5341J3740k2710J3392J8456J5864k0354k2813m460P972J6584
11499C417K4417K3837J1881l1275r918J0027k3065j3254R404O074N733j5418j90
11486A670J0807N86J9472Q864K305p581j5555j7424k8210k1662n348O094J9096
11473b6886K201k2070J9153K6640L2136J42k1680j2315M253j945k4528o750O274
11460b5375Q339m472k0893K0631J3314j0785J4205k521Q974Q107j152O371J6378
11447C1121o439r549m581p474N084K6846k652p200j8067n040q421r498M208J791
$$ y = [8020, -5537, -13106, -14009, 5888, 34817, 35915, 40686, 41612, 26047, 11972, -6924, -15737, 3302, 21248, -4880, -14933, -35010, -30751, -32976, -25932, -3283, 951, -17147, -37583, -30454, -36526, -27595, -12254, 1486, -21224, -7832, 10624, 26488, 6134, -16679, -21139, -13167, 3417, 27834, 51671, 63552, 32277, 22359, 32386, 9321, -3933, 5471, 11545, 17278, 1860, 1670, 12477, 13063, 32535, 41399, 43704, 36123, 20568, 3144, -25066, -46728, -52076, -45982, -26886, -24685, -46755, -27602, -962, 31174, 31316, 9636, -2679, 1574, -371, -24899, -31649, -25375, -17036, -21508, -42401, -21770, -8456, -19241, -5036, -7557, 1417, 9524, 8372, 14743, 31121, 24682, 15133, 10552, 3078, 8162, 35008, 32356, 25156, 7089, 2049, -6372, -15870, -11662, -9871]
11433i871J8482J0505J3031q978l2445j080L668j9506R218P122j6318o302K8362
11420d112Q907J0202j0463L4722K6959k2541j5340r451k6579j112K2817r478k2537
11407a8006J3027O647l302K470R911j4355j448j2139n014q452M701M041M688L3224
11393A5993j04n950R174r1j6859q477l529l243J8142K8611j8046o382L796k2965
11379i930j3548L569L031J5746r5p184Q349n896q993R203j279R842j8060j0077
11365b5322m242j7195K5170L0836k294r886O165j4872j7041P55L4506j0116j4781
11352a8317M658j4550L066K9978J3988J3522L3039j3231K379q395k0076r94M055
11339B9122j2130p030j2539J7828J3838j2213j6776q808Q738J4380R92j2795q643
$$ y = [-9871, 8611, 19116, 32147, 23169, -9276, -10356, -6688, -26194, -16976, -9854, -26172, -32474, -4112, 4795, 14997, 4534, 39256, 66215, 43674, 28334, 18883, -7696, -8808, 14009, 4531, -18006, -4979, 1668, -1634, 836, 10747, -3608, -5056, -17195, -22209, -30661, -25960, -21919, -17231, 15993, 15889, 9939, 19113, 19022, 2163, -6314, -9843, -13086, 5056, 33667, 15621, 9239, 13035, -9930, -23478, -19909, -16878, -1132, -1227, -8411, -62, -5958, -14951, -5748, -7027, 2815, -15245, -25322, -29564, -46759, -21589, 9247, 6953, -2933, 3232, -11640, -28681, -27926, 6580, -3536, -18317, -13659, -28209, -25143, 4835, 18823, 32345, 65384, 52153, 54532, 46137, 26061, 25067, 29122, 16992, 9962, -2577, 15251, 29089, 16876, 100, -8708, 30, 14410, 15402, 2607, -6036]
11326f036J2614M044n330L873J802P77M078o298j542n356p442K0466K5800k1242
11312B0208r398j3372N231k944P607O995o008J0895j5464m088J5347J949m980
11299A1978k273j5480L548J2073J5609J2411j1662r84k995j9732Q045K883K0354
11286C3775J0589J5020O194j7857j6847R768K6563k1352n474P361L402Q256L157
11273F2555J24j254Q76J9215K7376L3428L3077J6395K8159J0743L6598N3897N4352
11260C75541J18700J83052L08088M54505M34809K43112O9346m9999l11547m73753
11250A351854m60794l09195j86242j18406o3844l1960m1782j6480p748J0180k43
11239A25340k9322k3845J723k4185o200j5232j0514r978k0694J5862l963L987
$$ y = [-6036, 6578, 10622, 5292, 9165, 10967, 11744, 15822, 9524, 7982, 2626, -4816, 15650, 41450, 20208, 10810, -2562, 2669, -275, 7332, 14327, 8319, 19214, 3750, -338, 15009, 16958, 11978, 9705, -5775, -2227, 9846, 25455, 37866, 26204, 25220, 22225, 2493, 10538, 13421, 33775, 44364, 59384, 65578, 47721, 30874, 40642, 67205, 45853, 40379, 47740, 51142, 59398, 62555, 62679, 61425, 62301, 81516, 108892, 142320, 175397, 191792, 219951, 230694, 267292, 321189, 375541, 494241, 677293, 985381, 1439886, 1874695, 2117807, 2187153, 2137154, 1825607, 1351854, 891060, 581865, 395623, 277217, 213373, 181413, 139631, 123151, 115403, 125583, 125340, 96018, 72173, 73896, 49711, 43511, 28279, 17765, 7787, -12907, 2955, -1008, 2979]
11227B979L207J2154J0199k1000J1778j6706n1013o288J8278K7001J5207R863
11215A5659n322J1934J6715P91k6990K802J7827j809J879L694r455j1628J4377
11202C0474j7883k0503J3768j3554k0972p891K9357J7122L435p581j2385K0438
11190A3825j571N017M799m279j2214j8860O616J3340R581J9987l721l1501k9020
11177b8001R737J0219P791J4490j4619q617J5958J527L937J930L141K1367j4456
11164B4404M798K8164j6980k4586r643K3688J3855n650M498Q988J5349j8558R349
11151E7676J0115J739K217J2994J9146L6909L2965M6889K5750O4454J15272J55765
11139E81891K97458M66117L84403N6283l5369N1221O7229k06416l92722l88084
$$ y = [2979, 6186, 18340, 28539, 7539, 19317, 2611, -48402, -54690, -36412, -9411, 5796, 15659, 10337, 22271, 38986, 39777, 12787, 15589, 33416, 31607, 33486, 37180, 27725, 16097, 30474, 12591, -7912, 5856, -7698, -28670, -36561, -7204, 9918, 13353, 5772, -6613, 13825, 12254, 17271, 22070, 17791, 5577, -13283, -6667, 6673, 16254, 36241, 32520, 1019, -28001, -18264, -8045, -254, 14236, -383, -9000, 6958, 8485, 12422, 14352, 17493, 38860, 24404, 29202, 57366, 40386, 15800, 6157, 29845, 43700, 38050, 42548, 51536, 66885, 48327, 57676, 67791, 69530, 71747, 84741, 103887, 140796, 173761, 220650, 246400, 310854, 426126, 581891, 879349, 1345466, 1729869, 1786152, 1750783, 1802004, 1869233, 1662817, 1270095, 882011]
11129H82011k95615j75184j10346p6150n3231j6970J6408j9542m6212j0759j3151
11118H1259l6068j1131M273j1574j9072k339K6092J0505q549j0147M191K462M927
11105C4829J6100M4765K234r418l3176j6363k8220k7491Q604K9336K7969l431
11093D5738j7052k3048k2633J3367J7905N484j2495p112K1324j943p154j9556
11081g175O014o088K7605j2444K288J1530J580R800m848l2342o642l660j8094
11068c2476O297K5240J5176N306l8756Q448K7762k794R1J5174k526j1214O008
11055B1736J9861P905j2409l165J0203o990k1950r577K847j2090J3202j3788l530
11042g745Q911j3444j9034L481m368P694K3403N273k543J5862p88k0408j0635
$$ y = [882011, 586396, 411212, 300866, 224716, 171485, 154515, 170923, 151381, 105169, 94410, 81259, 45191, 34060, 38333, 26759, 7687, 5348, 31440, 41945, 33396, 23249, 27440, 29902, 34829, 50929, 95694, 97928, 88510, 55334, 38971, 10751, -16740, -8136, 21200, 49169, 45738, 28686, 5638, -16995, -3628, 14277, 19761, 7266, 154, 21478, 19535, 12381, -7175, -1161, -7249, 20356, 7912, 10200, 21730, 23310, 33110, 28262, -4080, -10722, -14382, -32476, -26179, -939, 14237, 19543, -19213, -10765, 16997, 14203, 14294, 29468, 26942, 15728, 21736, 41597, 49502, 37093, 33928, 44131, 37141, 15191, 5614, 8461, -3629, 9573, -4215, -7745, 1166, -12278, -31312, -27831, -32199, -24505, -1102, 4171, 1628, 17490, 16702, -3706, -14341]
11029a4341k578K1165P329j8482o7N013l859R319J3958P48j6716n960J5536j4042
11015b977r337J0807o855J825J8926J1457l839J923j2844n843J4358L781q680
11002A2702R290J4563j1698K44J892k7670j9696l2281J3383J6656Q612j3259M727
10989b2535N071j2186K114J3657O868L777m140r20l5395j6803Q979J6895K89J1596
10975b2733J3837J1809J0705j2305Q248K6303M303K82r840j4940K2324m317k5939
10962G737j0176p830l019J1573k792j2653J2015K1316L2209j2804j4837r087r624
10949B028K5257j5574k6617L205L6305L1713r396k5426J4981k584j1264k0030
10937B598J8305J5307q851j69l5646j7146J750q264J4881J8161K9937J2955p000
$$ y = [-14341, -16919, 4246, 11575, -6907, -6974, -1961, -5820, 3499, 17457, 18205, 1489, -4471, 11065, -2977, -12314, -1507, -8362, -6537, 12389, 23846, 20007, 21930, 9086, 3243, 17601, 21382, 12702, 21992, 36555, 24857, 25101, 26993, -677, -20373, -52654, -39271, -22615, -14003, -27262, -22535, -17464, -29650, -27536, -13879, -7011, -3234, -7374, -8294, -43689, -60492, -51513, -34618, -34329, -22733, -8896, 2913, 13618, 1313, 9561, 35864, 40167, 40449, 30609, 15669, 37993, 33676, 7737, -2439, -10269, -13288, -1715, -4507, -17160, -5145, 16171, 48380, 35576, 20739, 11652, 2028, 27285, 11711, -14906, -11701, 24604, 56317, 46921, 21495, 36476, 33892, 22628, 2598, 20903, 36210, 27359, 27190, -8456, -25602, -23852, -32116, -17235, 926, 30863, 43818, 36818]
10924C6818k984Q21R011j5555q564o782j2398p545J0310l423Q606O353J0150j3380
10910A1438l6476o957J0904L664r541L862J6392J8124K2725P783n789r716N620
10897C2033n835k7787m78J5231J7039j402j1687k1273q272M8442K7920o712j8672
10884C8547j0993l507n918l020l5217r815K7180J2036J7856N114k1120p425K2323
10871B6041J1660N951k0022r149J1067M875J134p643J1328J507L898J4508k8748
10858B6407r846O74n607k0823r174L931K7546r750O570J495j4858J8014L982k1910
10844c349K890M638K2757K5073n204L067m0916m008j0151m543k5226J0414K2328
10831b230M421K4736L479j8021o82K2401O960j1169j102J687L403R16l2709J4767
$$ y = [36818, 33834, 34655, 43666, 28111, 19547, 12765, 367, -7178, 3132, -291, 8315, 14668, 24818, 11438, -25038, -31995, -21091, -17427, -26968, -23106, -6714, 11410, 34135, 41918, 36129, 26413, 32033, 26198, -1589, -2067, 13164, 30203, 28801, 17114, -4159, -12431, 36011, 63931, 57219, 38547, 27554, 24047, 18129, 15109, -20108, -29923, -2743, 9293, 27149, 32263, 11143, 3718, 26041, 37701, 43652, 23630, 14481, 25548, 30423, 31557, 23914, 35242, 36749, 40647, 55155, 26407, 16561, 17235, 11628, -9195, -18369, -14438, 13108, 3358, 9928, 11423, -3435, 14579, 18561, -3349, -459, 4179, 26936, 52009, 46805, 49872, 8956, 4948, -5203, -9746, -34972, -24558, -2230, 2191, 26927, 30406, 12385, 11703, 34104, 41064, 29895, 28793, 30480, 33883, 34799, 2090, 16857]
10817A6857K1687K4711Q094k3349P45j9821j4832P938j283r319O269k2j8191J7429
10803A6913J7649J0944L936j7345j9469j1734J3617N645K6018O387j483l404j3931
10790C3743K601J0665j160Q410j204k1484j0114j5008l0906j5279L6490M2269
10778C9023r802m394J3629Q253k0377p531K733k248j2149L309M130p929k4089
10765a7442j6378J1178K7363K8016L028r552j9439L060n395Q150P975j3920K63
10752F907J8202N260q432N105j2062r428J6757K2947m562j731P151l566j8940
10739B3608j8377M202R169J6268J7095J2316q757k8998N609J7213J6792k138k6074
10726C7928R740j6397j9143j685J7066j1624N307n41J189K1078J0599R554o772
$$ y = [16857, 38544, 63255, 71349, 48000, 48745, 28924, 14092, 22030, 20747, 11428, 17697, 17675, -516, 16913, 34562, 45506, 49442, 32097, 12628, 894, 14511, 20156, 46174, 52561, 51078, 47674, 33743, 36344, 47009, 45849, 54259, 53055, 31571, 21457, 6449, -24457, -39736, -3246, 39023, 29221, 24827, 38456, 46709, 26332, 18801, 21534, 19286, 7137, 10446, 14576, 6647, -17442, -33820, -22642, 4721, 32737, 35765, 26213, 6774, 9834, 4439, 12589, 20564, 6644, 6907, 25109, 30369, 21937, 27042, 14980, 5552, 22309, 45256, 40694, 38963, 46114, 42548, 23608, 5231, 9433, 18602, 34870, 51965, 64281, 55524, 26526, 32135, 49348, 66140, 64002, 37928, 47668, 31271, 12128, 10443, 27509, 15885, 21192, 20651, 21840, 42918, 53517, 63071, 56299]
10713E6299l1613k7023p883p35M570K229N981J2995R877P163P60k649K3679r862
10699D3788J646J4543j4937j5609K5403L450o306l341p295K367l928R098q96l5081
10685A2902k1597P926J5863P126j3962K464J6884R030N896L594o100k5787k034
10672A2205P751r593J994j014r776J330K817L295J6905J483l869M063r51r085
10658A7555R527J2712p773k4980j3263j3358K4656J5792l372K917J5731k869q447
10645B4828j0454k6507j0468K1551O441J087o721r38J3934J1418J8589J8988k7085
10632C4663m065k1690Q000J4045q468r596K2132P335K990r320j5909j5186k942
10619A989K1992J0998j9898l0158J131J4323j2799O983R688j5313j4913R784J1763
$$ y = [56299, 24686, -2337, -10220, -10955, -6385, -4156, 1825, 14820, 24697, 31860, 32620, 29971, 53650, 43788, 45434, 59977, 45040, 29431, 54834, 58284, 51978, 48637, 41342, 43709, 39781, 48879, 47983, 12902, -8695, -769, 15094, 22220, 8258, 10722, 27606, 36636, 42532, 46126, 40026, 14239, 12205, 19956, 10363, 12357, 11343, 1567, 2897, 5714, 9009, 25914, 27397, 23528, 27591, 26640, 17555, 27082, 39794, 32021, 7041, -6222, -19580, 5076, 20868, 17496, 20413, 36144, 33275, 24828, 14374, -12133, -22601, -1050, 5391, 6478, -243, -1181, 12753, 24171, 42760, 61748, 34663, 30598, 8908, 16908, 30953, 22485, 12889, 35021, 42356, 45346, 36026, 20117, 4931, 1989, 23981, 34979, 15081, -15077, -13946, 377, -12422, -5439, 4249, -11064, -25977, -16193, -4430]
10606d430M1388L4999J8767k0412j2594l0589j2054j0171R830P708l105o069M793
10593A8061J3149J0747R795k242j4796J7299R816M347j9169o690j070j1116O803
10580C4934l412j2442m157J4274l451k51l568r586j4534M486N527K5369J3053
10567D6242M679j1070M927o287j6703J2817J1929j81j5007k97q945j0428q9O253
10553A7840J2525o171J1980j1454K0948J6153O01L298j1889J1577j5943j0503
10541C8962R032j3503J767R034n318J1301L222J1385J5701r948R167n376j7527
10528E7899k6870j0448J0359K2515q39j5143q425M4R864J853o737L053J8300j1165
10514D4260j5235p840J2723L4691q951l90r668r694k4238M947L8785j2157n593
$$ y = [-4430, 36958, 71957, 90724, 70312, 57718, 27129, 15075, 4904, 14734, 22442, 19337, 13268, 18061, 31210, 41957, 51752, 49510, 34714, 52013, 61829, 66176, 47007, 40317, 39247, 28131, 34934, 31522, 19080, 14923, 29197, 25746, 25495, 21927, 12341, -2193, 2293, 7820, 33189, 46242, 50921, 39851, 44778, 38491, 21788, 34605, 46534, 46353, 31346, 31049, 22104, 11676, 11587, 17840, 30365, 24194, 36174, 24720, 45668, 61821, 62422, 65720, 53831, 65408, 49465, 38962, 47994, 34491, 36258, 45292, 39974, 51275, 54497, 65882, 81583, 71635, 80802, 75426, 57899, 31029, 20581, 30940, 53455, 52616, 37473, 29048, 29092, 38956, 40809, 34072, 37125, 55425, 44260, 29025, 21185, 33908, 68599, 59648, 59258, 49590, 39896, 15658, 20605, 59390, 47233, 41640]
10501D1640q068K4141J9666j259k2739N234m783j3737Q914K4969P470k2879p809
10488E0760j079N665K729J1820q896o156j0823L517K0787K1497L6026J5159R868
10475A50874j4138p854J2417j6413k9261k0384L52r712q533J3250J4121j6347
10463F8372k9058K3119K7313p020j6530n241j8488J6360p913k9767K2584J028
10451D4759m127j041J2065J3883j6449m15K671Q318p491J1486K0928r754j8169
10438E6664Q582J9904K0271j3530l077j5515k0570K0336J4695n720J4451J8914
10426A15405L8827M0519J316m8239j9796k3347k7259p819j3412Q398J4776j724
10414G7645r805k447J7851O079K2357q969r155Q802K0321k398M568j1043Q007
$$ y = [41640, 33572, 57713, 77379, 76120, 53381, 58615, 53832, 40095, 49009, 73978, 81448, 58569, 50760, 49681, 55346, 58075, 69895, 60999, 54843, 44020, 47537, 68324, 89821, 125847, 141006, 150874, 136736, 128882, 141299, 124886, 95625, 75241, 75593, 65881, 57348, 70598, 84719, 68372, 39314, 62433, 89746, 82726, 66196, 60955, 42467, 58827, 50914, 21147, 43731, 44759, 40632, 39591, 51656, 65539, 49090, 48675, 51346, 59664, 52173, 63659, 84587, 74833, 56664, 65246, 85150, 105421, 91891, 88814, 73299, 52729, 73065, 87760, 82040, 96491, 115405, 154232, 194751, 196067, 147828, 128032, 104685, 77426, 69607, 56195, 64593, 79369, 77645, 67840, 65393, 83244, 89323, 111680, 102711, 93556, 102358, 122679, 120281, 124849, 113806, 121813]
10401A21813Q83k3193J1524j4275l3652P278J2687N278q249k1475j2677k2553
10389B3389J3565J8267K035P177k3103k612K385J389M2039J6268m36P075k40k093
10375A05105K2329o265j5302O855O772p897o408j4353p999J3017K974m8N102n731
10361I8151p150j5524k6166L338K351Q079l529R575j8478J783J2129j165J8336
10348H1730J9526n54J2547J1664n284k3789k5048J8449J4801l935k262o87j1803
10335H5355J8159J1884J0051n480q866l0540k1128K6584K7141n373J906N292L7315
10322A52300K6121j3544j4946J0656j8585k9488n217L062j4221j0096Q125l71
10310I3796L827j1059J0528L865K0634P825J4828O152k875k2218k7269K2220K5253
$$ y = [121813, 122696, 99503, 111027, 96752, 63100, 70378, 83065, 88343, 80094, 58619, 45942, 23389, 36954, 55221, 57256, 64433, 41330, 38718, 41103, 42492, 84531, 100799, 100363, 107438, 107198, 105105, 127434, 121169, 105867, 112722, 119494, 111597, 105189, 90836, 82837, 95854, 98828, 98780, 103882, 98151, 91001, 75477, 49311, 52649, 55000, 63079, 59550, 69125, 50647, 52430, 64559, 63394, 81730, 101256, 100702, 113249, 124913, 119629, 95840, 70792, 89241, 104042, 100107, 97845, 97158, 85355, 103514, 115398, 125449, 119969, 111103, 80563, 59435, 86019, 113160, 107787, 109693, 114985, 152300, 178421, 164877, 149931, 160587, 142002, 112514, 107297, 110359, 96138, 86042, 94167, 93796, 97623, 86564, 97092, 100957, 121591, 129416, 144244, 150396, 147521, 125303, 98034, 120254, 145507]
10297A45507J3838k596J166K3414J3926J5637K9786M9046J4672K1257M8105L1765
10285D05523L9825L9128J3512m338k1247k7119l7582m1382m8430k7566l35R085
10273B99074J7351l2911P497N9669P5058R587l2922K2999K7760l3618n5289l2385
10261C31870k9509j7687l5325n6908n1026k0469k1458q519j9082k1322J7946K2150
10249I0661k4004j8704O904q10J58R679O105K0831J4163j2659k0217J2674J4934
10236I9715M460n254l992J438j0838o068J935O823k5226O615k330k0287j5647
10223C1344j9623L917L4054K0856q815j4054j1271n209J9900J8119k727K5164
10211I1655J1479L493j0386n135j0305N697J8227P174L58j0013j0993L569o505
$$ y = [145507, 159345, 156749, 157915, 181329, 195255, 210892, 240678, 289724, 304396, 325653, 373758, 405523, 445348, 484476, 497988, 493650, 472403, 445284, 407702, 366320, 317890, 290324, 289989, 299074, 316425, 283514, 291011, 350680, 425738, 435325, 402403, 425402, 453162, 419544, 364255, 331870, 302361, 284674, 249349, 192441, 141415, 120946, 99488, 90969, 71887, 50565, 68511, 90661, 66657, 47953, 54857, 54047, 54205, 63884, 69989, 90820, 104983, 92324, 72107, 84781, 99715, 104175, 98921, 94929, 96367, 85529, 79461, 81396, 88219, 62993, 69608, 67278, 46991, 31344, 11721, 15638, 49692, 70548, 61733, 47679, 36408, 31199, 51099, 69218, 66491, 91655, 103134, 106627, 96241, 91106, 80801, 86498, 104725, 111899, 112257, 102244, 91251, 94820, 88315]
10198H8315K2929K875j4276j1049J6738R414j2191J4886M469o837j8805K007M125
10185A02600m374j9767R623K5081J2619j9515j9248P566j356K9802L7227J8817
10173A79075J9858J7164J137L9612m122j4984k5972o399n567q561j9278k9232
10161A42731j3360n135j9489J9610Q731k021j2559k9206L919L0618O867j3402
10149A17304J276J0310M953J1461J9949j9068Q549J7763M0638N0183O0819R5431
10137D19568J64897J79403P0604p3127j39571j44662j14664j04190n5471j0343
10127A92444j1032k3163j3869J2961k670l3610q692J4743m872q540j4125J385
10115A00960J6603j5584j1339n022o821J0222n812J2059K0404P816J3118R911
$$ y = [88315, 111244, 114119, 99843, 88794, 105532, 114946, 102755, 117641, 122110, 115273, 96468, 98475, 102600, 98226, 78459, 88082, 113163, 125782, 106267, 87019, 94585, 93229, 123031, 160258, 179075, 198933, 216097, 217234, 256846, 252724, 237740, 211768, 205369, 199802, 191241, 171963, 142731, 129371, 124236, 104747, 124357, 133088, 131067, 118508, 89302, 93221, 123839, 130706, 117304, 118580, 128890, 133843, 145304, 165253, 146185, 154734, 172497, 213135, 263318, 324137, 419568, 584465, 763868, 834472, 761345, 621774, 477112, 362448, 258258, 202787, 192444, 181412, 158249, 144380, 157341, 154671, 121061, 112369, 127112, 122240, 113700, 99575, 100960, 117563, 101979, 90640, 85618, 78797, 89019, 83207, 95266, 115670, 123486, 136604, 146515]
10103A46515R663J4156m859K3406m476r458j8541l0853j189k2832r476r922K0349
10090A02483K2329j1336L855P622j3983p321Q721K0264k0026k9209n390J1534
10078H9543L862Q880n00j3634p859j340L705J1162j1418j5474P349m076R405M358
10064H3963j3859p486j501J815o696L7244M0945J3706J8168L6313M836l206l857
10051B00385m834j8413N597O954m970L382j2428j1435l712m483L2521P8276O8109
10038C34949O7255K4363K5984O0942Q4954k3109q4630m1369J555k1486p9449p4042
10026B75917n8202l0755K553K38j4023n530j8967p686j4631j2958J5200L9402
10014A70558J8107j4820l0274n134j1769R383K699o818l277J271O786k9837J4914
$$ y = [146515, 156178, 170334, 165475, 188881, 184405, 174947, 156406, 125553, 124364, 101532, 92056, 82134, 102483, 124812, 113476, 117331, 124953, 110970, 103649, 112370, 132634, 112608, 83399, 78009, 89543, 93405, 102285, 101785, 88151, 80292, 78952, 82657, 93819, 82401, 66927, 74276, 70200, 79605, 83963, 70104, 62618, 61117, 62932, 56236, 93480, 134425, 148131, 166299, 202612, 207448, 204242, 200385, 195551, 177138, 182735, 189689, 184719, 188101, 175673, 164238, 160526, 156043, 188564, 266840, 334949, 402204, 426567, 452551, 513493, 598447, 575338, 490708, 449339, 450894, 429408, 349959, 275917, 217715, 186960, 189513, 189751, 175728, 170198, 151231, 143545, 128914, 115956, 131156, 170558, 188665, 173845, 143571, 138437, 126668, 136051, 138750, 131932, 128655, 129926, 136712, 106875, 121789]
10001A21789o40k156J0010N252k6525l4472o442K6380J1625j224Q498J9247J3511
9988A44853L2090L4812J7934J7102j2498k9596l8619l5343j3986N087J3887n534
9976A30189r44k434o42n576L189J289K1266J4936o521j0106k8973l4173n336j398
9962G4766j144J9823J247Q88o759J1612J358n049r241n805J7199k7644q101K0371
9948H3521J5726J2430J5576k1292j5202K4712J1699q602J8118J0708k0186j6707
9936A10501j1301K3721n511k9673Q281J3297o434k108P928k1937j114N0294J7055
9923A52999j838m3j3250Q152L254l2631k5250k0467P967R556J0072K9309J9894
9910A47724j9487m6158J6301L7089j479o395R358m872r468R551J0918n950k848
$$ y = [121789, 121149, 118993, 129003, 134255, 107730, 73258, 66816, 93196, 104821, 103597, 112095, 131342, 144853, 176943, 211755, 229689, 246791, 234293, 204697, 166078, 130735, 116749, 121836, 135723, 130189, 129245, 126811, 126169, 120593, 123782, 125071, 146337, 161273, 154752, 144646, 115673, 81500, 76164, 74766, 73622, 93445, 94692, 95580, 88821, 100433, 101791, 96742, 87501, 81696, 98895, 71251, 63150, 83521, 99247, 111677, 127253, 105961, 90759, 115471, 127170, 118568, 136686, 147394, 127208, 110501, 99200, 122921, 117410, 87737, 96018, 109315, 102881, 100773, 108701, 86764, 85650, 135944, 152999, 151161, 151118, 137868, 146020, 149274, 116643, 91393, 70926, 78893, 88449, 98521, 127830, 147724, 128237, 82079, 98380, 135469, 133990, 127595, 136953, 132081, 122613, 132164, 143082, 137132, 134284]
9897A34284R815l471R03j5636l657J6249j0827m812p553N844j5644M092N439r749
9883A05277q702J4334J7371P259m137l703K185j4507J2513J2518j13l6119M988
9870A09164O542n648m481J955j3111j4743p24R351K3174N185J8430K0968o722
9857A49340j2206j4315L026k9295j438M850p615P310J2585N900l807J7070K4289
9844A55694K011K712m858l3705l4175J2220K1474K5619J1661J398m943J0432j5218
9831A50322n311j0297j4769r217J1940J2286L0753K1780k3490P55L6844K9277
9819B30873K6256L7648M8570M1372L5536m3360p2257o2353j3253M234k1853p263
9807B04150j4911k6447q519j0190J3805J8835j3665r421k3440K617J6691J6489
$$ y = [134284, 144099, 140628, 141531, 125895, 122238, 138487, 127660, 122848, 115295, 121139, 105495, 109587, 115026, 105277, 96575, 110909, 128280, 135539, 131402, 127699, 129884, 115377, 127890, 140408, 140295, 104176, 109164, 115706, 110058, 105577, 107532, 94421, 79678, 78954, 88305, 111479, 116664, 135094, 156062, 149340, 137134, 122819, 125845, 96550, 95112, 99962, 92347, 99657, 112242, 118142, 114335, 131405, 155694, 157705, 160417, 155559, 121854, 87679, 99899, 121373, 146992, 158653, 160051, 155108, 165540, 150322, 145011, 134714, 119945, 110728, 122668, 134954, 165707, 187487, 163997, 164752, 201596, 230873, 257129, 294777, 343347, 384719, 420255, 376895, 304638, 242285, 229032, 233266, 211413, 204150, 189239, 162792, 154273, 144083, 157888, 176723, 163058, 153637, 130197, 132814, 149505, 165994]
9795A65994k0341J0873O038j0205m232M33j0186j3552j5170j327J4265L2999J7158
9782A72747k8950K0491J9004k3971l0157l885o020q171K8944N5695N360j138J8515
9769B18464P66j7932J5162j75j2151j1609j8922m0j379J5597p406k0573l003J1809
9755A68608L287P695o625J1258j845n751J7215l797k309j608J657J1182j3426
9742A85541j6811q736p74Q746J3768n061j473Q50l216j8482q45P317J5009J1713
9728A87546q05M245j3625L2k9004p221J9879J9400P265K4238n466l8234J0397
9715A78647J1739J6762L936j543l277N87J5787N356M653j3278M051J613J872J3193
9701B40098J7839K0966N0435L5534O475L5091N2330P4571R9933J23305J38584
$$ y = [165994, 145653, 156526, 162564, 152359, 148127, 148560, 138374, 124822, 109652, 108325, 122590, 155589, 172747, 143797, 164288, 183292, 159321, 129164, 125279, 119259, 111088, 140032, 195727, 201087, 199949, 218464, 219230, 201298, 216460, 216285, 204134, 192525, 173603, 173563, 172184, 187781, 180375, 159802, 156799, 168608, 171895, 179590, 172965, 184223, 182378, 176627, 193842, 190045, 187736, 186128, 187785, 198967, 185541, 168730, 159994, 159220, 167966, 181734, 176673, 175200, 176050, 172834, 154352, 153507, 160824, 175833, 187546, 186741, 190986, 177361, 177393, 148389, 141168, 161047, 180447, 187712, 211950, 206484, 168250, 178647, 190386, 207148, 211084, 209541, 206264, 206851, 222638, 227994, 232647, 219369, 223420, 225033, 226905, 240098, 257937, 278903, 329338, 364872, 371347, 406438, 458768, 533339, 633272, 756577, 895161]
9690H95161O2383K0560M2631P2306J60069K82891M60414P75466J446221K243753
9680F461855J839887P3290j705921k042300j611291j018850n57735l16933k13740
9671I08262j44425j22790o2751l4793l8768k5219l6765m3929k7949j8673m148
9660C48052M1979l2267j9674l7478j3487n225K1165Q096L581l0948J2006O869
9648C02669J8965M616R68K123k671J7392K7763K5233O254j621P829L3629k5282
9635D17867j6344N4622N1326N4443N5686M1590L2474Q7533R0992O9700J22890
9624A062779J32227J83361K49660M03937O57211R90195J251640J406061J062075
9615G399146L93789m34499j153170j377586j314557r74718o85859m23166k43054
$$ y = [895161, 957544, 978104, 1020735, 1093041, 1253110, 1536001, 1996415, 2771881, 4218102, 6461855, 8301742, 8375032, 6669111, 4626811, 3015520, 1996670, 1438935, 1122002, 908262, 763837, 641047, 578296, 543503, 504735, 479516, 442751, 398822, 370873, 352200, 348052, 390031, 357764, 338090, 300612, 287125, 281900, 303065, 311161, 314742, 283794, 295800, 302669, 321634, 326250, 327218, 329341, 326670, 344062, 371825, 397058, 403312, 401691, 409520, 443149, 417867, 401523, 456145, 507471, 561914, 617600, 659190, 691664, 779197, 870189, 939889, 1062779, 1195006, 1378367, 1628027, 2031964, 2689175, 3679370, 4931010, 6337071, 7399146, 7792935, 7358436, 6205266, 4827680, 3513123, 2538405, 1852546, 1429380, 1186326]
9606A186326j74496j31254j05006n8809o0038o7424m7912l8729j6946k4079j6024
9595D45609j3444q467j2218k3485J7459K7982r96k8138k1912l2597j2024Q721
9583C46490j4140j349J1644R365n795r773P818l625J3961p389m252p71M483q426
9569C38241m108n225Q590n828M454L5270J8753p03j4573m054q002p653l141M33
9555C52454M449L4083l141l0384j7495k5176j0321p495Q971K5632K8949m63j2436
9542C47627r280J5783O82j2928K0411k4512q982q182K9744R247m6717k3204J639
9529B91328K6291L8925K4495j7520P513K2330J2858l2416j0018J2195j2219k014
9517C61748J0440j0272J801j3400p879L409M961K7361K2206o727m455j1198j5349
$$ y = [1186326, 1011830, 880576, 775570, 716761, 656723, 589299, 541387, 502658, 485712, 461633, 445609, 432165, 423698, 411480, 387995, 405454, 433436, 432440, 404302, 382390, 349793, 337769, 346490, 332350, 331001, 342645, 352010, 346215, 336442, 344260, 340635, 354596, 347207, 342955, 342184, 346667, 338241, 334133, 328908, 337498, 331670, 336124, 371394, 390147, 389444, 374871, 370817, 362815, 355162, 352021, 352454, 356903, 390986, 387845, 357461, 339966, 314790, 304469, 296974, 305945, 331577, 360526, 360063, 347627, 338347, 354130, 354812, 341884, 362295, 337783, 328801, 320619, 350363, 359610, 312893, 289689, 291328, 317619, 356544, 381039, 363519, 371032, 393362, 406220, 373804, 363786, 375981, 363762, 361748, 372188, 361916, 363717, 350317, 342438, 345847, 350808, 378169, 400375, 393648, 389193, 377995, 362646]
9504C62646J7788J1104r530p427n608j0979J1424N65K2011j4374m647J1865J5663
9491D00501L8378L8114n402k5637R21j3541M649K620K135j6223k2994k2938k594
9478C77989J6479O216J2815j4230k2879J393k534J1207K8904J5023J3550l0230
9466D13703Q223R990J7738K368j8269q357p756j743J0559J1072n447j3968J8757
9453D36870L0788R666J7355J7165J4099P900J6607M4154R0905J13728Q5236R4095
9441I78568M3854o001n9805o3678q2346q6629n7443n8817m1021q63j1377l0532
9429E23910k2753k303R450M926j3128m480K132r334p967J9660K1926O055r017
9416E19077K7778O840j6970n714k67J1264L855k147n699N827m936P647L8161K4102
$$ y = [362646, 380434, 391538, 382008, 374581, 368973, 357994, 369418, 369983, 391994, 377620, 372973, 384838, 400501, 438879, 476993, 471591, 445954, 446875, 433334, 437983, 440603, 442738, 426515, 403521, 380583, 377989, 394468, 400684, 413499, 399269, 376390, 377783, 375249, 386456, 415360, 430383, 443933, 413703, 421926, 431916, 449654, 452022, 433753, 425396, 417640, 415897, 426456, 437528, 432081, 418113, 436870, 467658, 477324, 494679, 511844, 525943, 533843, 550450, 594604, 685509, 799237, 884473, 978568, 1022422, 1016421, 956616, 892938, 810592, 723963, 666520, 607703, 566682, 565819, 554442, 523910, 501157, 498854, 508304, 513230, 500102, 495622, 497754, 488420, 480453, 500113, 522039, 528094, 519077, 546855, 553695, 536725, 531011, 530744, 542008, 545863, 543716, 538017, 543844, 538908, 546555, 584716, 608818]
9402F08818J1953J513q175P686M555O806J2834L1479J0978J848O371L4920J1193
9389G42779Q833M0982N5140Q0593L7616Q8182J09630R8871J35631J77436K07129
9378A782822L59021O02073R53901J299925J503737J368819N63629k21541j204239
9369G008147j480475j439655j090379o99599m39548k89665j99645j35353j02536
9360A131292q6812l3601k6535k3486k6776j200K359N953J3057k6966P612L2310
9348I67207M3643M2261K6637P11n9482m9314m8965p7087m8799r435K1146K5502
9336H34025K7165P212k2243j2290j8604k374l239J1436J6905J4513k9077J5801
9324H39230R277n661J9456P089k1211J4946p799k0797l714j1886L636l92L697
$$ y = [608818, 620771, 622284, 614109, 621795, 626350, 633156, 645990, 677469, 688447, 690295, 696666, 731586, 742779, 751612, 792594, 847734, 928327, 965943, 1054125, 1163755, 1262626, 1398257, 1575693, 1782822, 2141843, 2743916, 3697817, 4997742, 6501479, 7870298, 8433927, 8212386, 7008147, 5527672, 4088017, 2997638, 2298039, 1858491, 1568826, 1369181, 1233828, 1131292, 1044480, 1010879, 984344, 960858, 934082, 932882, 935241, 941194, 954251, 927285, 934897, 967207, 1010850, 1053111, 1079748, 1080459, 1020977, 971663, 922698, 845611, 796812, 787377, 808523, 834025, 861190, 868402, 846159, 833869, 815265, 812891, 809652, 821088, 837993, 852506, 823429, 839230, 848507, 842846, 862302, 869391, 848180, 863126, 855327, 834530, 830816, 818930, 822566, 822174, 825871]
9311H25871q734J1061K3215N910N0781J7904j9354j4648k4680n249L227J9720
9299H85024J2198J8065J3113k1808r23K9499n710j0046p812R24K2407L5574J440
9286I71945l0137j818R612L1205K9773Q067j0747n168O073L306j148J3380K5300
9273A049643K8058r017r242K7920L2661J6933j3482R78j6381j2367q680J3577
9261A100601K3806P134r028K1864K9545J8673q75j698J544J8j2708L169r088J5842
9247A188799K2316L4891J6015n415j3724N669J4352J826J7983J2793j4928O789
9235A287366J3713J5065L0492J2186r422q268p486K2703K9476K1723j0011K7064
9223A424601L185j8053j508P707M1218L5079j6714N878K2223K6207N791J6314
$$ y = [825871, 817137, 828198, 851413, 857323, 908104, 926008, 906654, 892006, 867326, 862077, 865304, 885024, 897222, 915287, 928400, 906592, 905669, 935168, 929458, 919412, 911600, 912524, 934931, 970505, 971945, 941808, 939990, 949602, 980807, 1010580, 1018647, 1007900, 1002732, 1008805, 1012111, 1010963, 1024343, 1049643, 1077701, 1068684, 1059442, 1087362, 1120023, 1136956, 1123474, 1124452, 1108071, 1095704, 1087024, 1100601, 1124407, 1131541, 1122513, 1144377, 1173922, 1192595, 1191720, 1190022, 1191566, 1191584, 1178876, 1182045, 1172957, 1188799, 1211115, 1246006, 1262021, 1256606, 1242882, 1248551, 1262903, 1264729, 1282712, 1295505, 1280577, 1287366, 1301079, 1316144, 1346636, 1358822, 1349400, 1341132, 1333646, 1356349, 1385825, 1407548, 1397537, 1424601, 1427786, 1409733, 1408225, 1415932, 1457150, 1492229, 1475515, 1481393, 1503616, 1529823, 1535614, 1551928]
9211A551928K42J498K0956M781K8729M844j042Q505N553J0656K3476R482O609
9198A676217K2872J7686P738m620K605J1591K626M885L4906L2422J9238m541Q519
9185A832144L8750K1575L54l182J4570J4281L0111L3789k1607N021K9127J6455
9173B011388J3623N168r364L1102N0131K9549M3311J5821K237J4728P936j2013
9161B203617J3760N2415J7387J5599J385J6890M6479J3079K024K980L7258L4244
9149B457117L6906P183j266L2410N7925L3294K3599K5924K3570J6200L0821K9514
9137B773197O045j7298L4707M8921L2607p050L2028M2765M2544K5806L0020M7182
9125C091474M6296L0412L1313K6993L1590J9771L5629J7641L3034K6616L451J6921
$$ y = [1551928, 1552170, 1553668, 1574624, 1579405, 1608134, 1612978, 1611936, 1620441, 1625994, 1636650, 1660126, 1669608, 1676217, 1699089, 1716775, 1724513, 1719893, 1722498, 1734089, 1736715, 1741600, 1776506, 1808928, 1828166, 1823625, 1832144, 1870894, 1892469, 1892823, 1889641, 1904211, 1918492, 1948603, 1982392, 1960785, 1965806, 1994933, 2011388, 2025011, 2030179, 2020815, 2051917, 2102048, 2131597, 2174908, 2190729, 2192966, 2207694, 2215630, 2203617, 2217377, 2269792, 2287179, 2302778, 2304163, 2321053, 2367532, 2380611, 2382635, 2385615, 2422873, 2457117, 2494023, 2501206, 2499940, 2532350, 2590275, 2623569, 2647168, 2673092, 2696662, 2712862, 2743683, 2773197, 2779242, 2761944, 2796651, 2845572, 2878179, 2871129, 2903157, 2945922, 2988466, 3014272, 3044292, 3091474, 3137770, 3168182, 3199495, 3226488, 3258078, 3277849, 3313478, 3331119, 3364153, 3390769, 3394220, 3411141]
9113C411141O0123N9963M8793N8518M1688K4381L8692M1034N2586L1834L4524
9102C903277N1541N7080M9164K2140L7104L6311N6880L7240K6511N5482N4014
9091D386744M7533M7913O8354N8869M5972O8946O5923O1694L1263P1495P2765
9080E027471O6464N2279P9164N6933O6189P6252O0833O9698O6299Q5650Q4144
9069E791376M5968O4831P8043P4621O4577Q6309Q7274P1987Q8695J08949Q6656
9058F649286P4672Q2253J11395J04810R9785R6446R5500J17022J18569J00539
9048G650277R4114J16610J25420J22176J17172R5024J13214J27684J29084J17790
9038H808565J25180J42709J50801J49965J40463J31515J22835J51207J79513J72712
$$ y = [3411141, 3471264, 3531227, 3580020, 3638538, 3680226, 3704607, 3743299, 3784333, 3836919, 3868753, 3903277, 3954818, 4011898, 4061062, 4083202, 4120306, 4156617, 4213497, 4250737, 4277248, 4332730, 4386744, 4434277, 4482190, 4550544, 4609413, 4655385, 4724331, 4790254, 4851948, 4883211, 4954706, 5027471, 5093935, 5146214, 5225378, 5282311, 5348500, 5424752, 5485585, 5555283, 5621582, 5707232, 5791376, 5837344, 5902175, 5980218, 6054839, 6119416, 6205725, 6292999, 6364986, 6453681, 6562630, 6649286, 6723958, 6806211, 6917606, 7022416, 7122201, 7218647, 7314147, 7431169, 7549738, 7650277, 7744391, 7861001, 7986421, 8108597, 8225769, 8320793, 8434007, 8561691, 8690775, 8808565, 8933745, 9076454, 9227255, 9377220, 9517683, 9649198, 9772033, 9923240, 10102753, 10275465]
9028A0275465J54451K09005J86620J66404J64980J70541J81771J89626K01888
9019A1900751J85751K04824K23235K16810K13695J97333K08584K23601K56970
9010A3831554K57621K39003K46492K59205K41097K55786K60832K74652K69423
9001A6135665K61959K95829L23730K85191K90982K94744L12866L19944L31250
8992A8852160L23577L18337L49089L73391L95591L68553L28305L31778L62183
8983B2002964L81735M00363L93640L65628L71925M08437L92998M04689M12095
8974B5534474L92043L92530M09870M19474M23645L92933L87218L84918L96076
8965B9133181L73537L76763L69984L56325L59921L55889L36818L25651L15465
$$ y = [10275465, 10429916, 10638921, 10825541, 10991945, 11156925, 11327466, 11509237, 11698863, 11900751, 12086502, 12291326, 12514561, 12731371, 12945066, 13142399, 13350983, 13574584, 13831554, 14089175, 14328178, 14574670, 14833875, 15074972, 15330758, 15591590, 15866242, 16135665, 16397624, 16693453, 17017183, 17302374, 17593356, 17888100, 18200966, 18520910, 18852160, 19175737, 19494074, 19843163, 20216554, 20612145, 20980698, 21309003, 21640781, 22002964, 22384699, 22785062, 23178702, 23544330, 23916255, 24324692, 24717690, 25122379, 25534474, 25926517, 26319047, 26728917, 27148391, 27572036, 27964969, 28352187, 28737105, 29133181, 29506718, 29883481, 30253465, 30609790, 30969711, 31325600, 31662418, 31988069, 32303534]
8956C2303534K92637K77634K84130K80401K61873K45281K22222K06018J73729
8947C4547459J62237J58964J70577J20640P8581L1312O2416K7291L2568q693m7137
8936C5336215o9616o0939j01930j40082j55895j56596j57424k38796k42800k14596
8926C3797541k09025k27448k76910k99181k97904l07643l45593l65559l69283
8917C1098995l42094l54953l58995l74830l66820l80224m13790l94200l64668
8908B7748421l97856m20817l91506m00231l93185l86556l71704l78268m16992
8899B4191306l80140l85929l83603l79498l98218l86242l47319l39881l61152
8890B0829324l41790l30529l35931l36511l40199l36043l36069l06792l05067
$$ y = [32303534, 32596171, 32873805, 33157935, 33438336, 33700209, 33945490, 34167712, 34373730, 34547459, 34709696, 34868660, 35039237, 35159877, 35238458, 35269770, 35332186, 35359477, 35392045, 35383352, 35336215, 35266599, 35205660, 35103730, 34963648, 34807753, 34651157, 34493733, 34254937, 34012137, 33797541, 33588516, 33361068, 33084158, 32784977, 32487073, 32179430, 31833837, 31468278, 31098995, 30756901, 30401948, 30042953, 29668123, 29301303, 28921079, 28507289, 28113089, 27748421, 27350565, 26929748, 26538242, 26138011, 25744826, 25358270, 24986566, 24608298, 24191306, 23811166, 23425237, 23041634, 22662136, 22263918, 21877676, 21530357, 21190476, 20829324, 20487534, 20157005, 19821074, 19484563, 19144364, 18808321, 18472252, 18165460, 17860393]
8881A7860393k95103l12666l04996k79982k95409k93524k86257k68992k62594
8872A5260870k52797k20322k41785k42811k26810k34957k16035k10268k18320
8863A3196765k42399k10961k14077k24357j80975j70969k17878j95656j68282
8854A1371211j53416j55492j67873j65540j56461j45550j40276j17023j25240
8845A0044340j04905q0432m2150K0169J21591J97322r890l13555m06360l71320
8835I054810k91039k32245k07916j42962j36604j27374j24253j34021j06968q6689
8825G464739j30178j20358r2916q9480j00557r4683q7632p3292q5291j04056j01968
8814F384328o7212j14349r7123n7859p2054r4572p1405p3235q5465p1958m6119
$$ y = [17860393, 17565290, 17252624, 16947628, 16667646, 16372237, 16078713, 15792456, 15523464, 15260870, 15008073, 14787751, 14545966, 14303155, 14076345, 13841388, 13625353, 13415085, 13196765, 12954366, 12743405, 12529328, 12304971, 12123996, 11953027, 11735149, 11539493, 11371211, 11217795, 11062303, 10894430, 10728890, 10572429, 10426879, 10286603, 10169580, 10044340, 9939435, 9859003, 9816853, 9837022, 9958613, 10155935, 10146045, 9832490, 9426130, 9054810, 8763771, 8531526, 8323610, 8180648, 8044044, 7916670, 7792417, 7658396, 7551428, 7464739, 7334561, 7214203, 7121287, 7031807, 6931250, 6836567, 6748935, 6675643, 6590352, 6486296, 6384328, 6317116, 6202767, 6105644, 6047785, 5975731, 5881159, 5809754, 5736519, 5651054, 5579096, 5532977]
8803E532977p9718q7228l3136l2786q1943r2509o1463o9485p4048n1945m9604
8792D819112m7609m3410n7187l6684m7878m6453n3913m6271n3961p5357n3315
8781D257074n8817n8600o1175k6301m7600j9538l5998p7258l5841p222j8990l3730
8769C776004k7473k1144n0842l8769l1580n4229k0751l0944k7060m0698l5296
8758C397218n5051l5659p405k6515n1653m6236k1682k4684l5434l2056k7732k7229
8746C005882l3496l2917l5571k0397j4401j0245j1413m6297k4276k9946m2569
8735B704354k2080k5158m3822k1907k6995k4083L210J0027j8489k6697P361j0731
8723B504990m7215k3123l0648j3666J3866K9732Q941Q817N5612M4648O0358O3391
$$ y = [5532977, 5453259, 5366031, 5332895, 5300109, 5218166, 5125657, 5064194, 4994709, 4920661, 4868716, 4819112, 4771503, 4728093, 4670906, 4634222, 4586344, 4539891, 4485978, 4439707, 4385746, 4310389, 4257074, 4198257, 4139657, 4078482, 4052181, 4004581, 3985043, 3949045, 3871787, 3835946, 3828724, 3809734, 3776004, 3748531, 3727387, 3676545, 3637776, 3606196, 3551967, 3531216, 3500272, 3473212, 3432514, 3397218, 3342167, 3306508, 3299103, 3272588, 3220935, 3174699, 3153017, 3128333, 3092899, 3060843, 3033111, 3005882, 2972386, 2939469, 2903898, 2883501, 2869100, 2858855, 2847442, 2801145, 2776869, 2746923, 2704354, 2682274, 2657116, 2613294, 2591387, 2564392, 2540309, 2543519, 2553546, 2535057, 2508360, 2515721, 2504990, 2457775, 2434652, 2404004, 2390338, 2404204, 2433936, 2442877, 2451694, 2507306, 2551954, 2612312, 2675703]
8711B675703k3436p9449j11889j02882q9066n2426k7979q354j2328m0394l4012
8700B093488j5828J192K074l3294m2552j2037j7346k2423q527o818k5041m5712
8688A867176l4167j8082J8173M999l4174l9331k1738j7368j3123k3904K1624n254
8676A704831r857m854Q631j792n526K93q563k6061k5476r476r475j9078M734Q224
8662A606555l4656j2507n979q902j5852r628O902j3097j1492j8695j8540j6802
8650A447307l1070k1574k752J1691N25j930k770k9286J3972j2435j9022j6328
8638A336328j8992j6535j7817k1039K6064L820j1541j8126Q706n007k9323N662
8626A242200L0425l697j2763J4644l700j6343q743j8787R618L7696K0324j1712
$$ y = [2675703, 2652267, 2572818, 2460929, 2358047, 2268981, 2216555, 2188576, 2180222, 2167894, 2127500, 2093488, 2077660, 2078852, 2080926, 2047632, 2005080, 1993043, 1975697, 1953274, 1944747, 1937929, 1912888, 1867176, 1833009, 1814927, 1833100, 1838099, 1803925, 1764594, 1742856, 1725488, 1712365, 1688461, 1710085, 1704831, 1694974, 1690120, 1698751, 1696959, 1691433, 1691726, 1683163, 1657102, 1631626, 1622150, 1612675, 1593597, 1598331, 1606555, 1571899, 1559392, 1553413, 1544511, 1528659, 1519031, 1525933, 1512836, 1501344, 1482649, 1464109, 1447307, 1416237, 1394663, 1391911, 1403602, 1404127, 1402197, 1399427, 1370141, 1384113, 1371678, 1352656, 1336328, 1317336, 1300801, 1282984, 1261945, 1288009, 1291829, 1280288, 1262162, 1270868, 1265861, 1236538, 1242200, 1272625, 1268928, 1256165, 1270809, 1267109, 1250766, 1242023, 1223236, 1232854, 1270550, 1290874, 1279162]
8614A279162l3513k8786j9766l2339k2584l383j284k5607k864J8463q098N529
8602A124930J405l641j4567K952L658j3540j0856j4289k7145M920J905j9858j7336
8589A018538L417K0767j7369K04K2567J8623Q21O303j459J1767N0228M9789j586
8576A182610l7921l4769l246l4576n270L3393M5045k148k6135n770j7918K0541
8564A113836L2713K8987L9500L5769J5395J9700R57J7745o476j4244J010P204
8552A292096M2565J21329K01724K62930K56429Q3429j31401k82959l09473k20994
8542A315675j32826q9747m4617j0415L4139K9471L3256K5475J6742J9010N467
8531A201630o6560q2918r7188q5381n4716k854O019J2624j138k3688k3871o138
$$ y = [1279162, 1245649, 1216863, 1197097, 1164758, 1142174, 1138791, 1137507, 1111900, 1109036, 1127499, 1119401, 1124930, 1126335, 1122694, 1108127, 1111079, 1114737, 1101197, 1090341, 1076052, 1048907, 1053827, 1055732, 1035874, 1018538, 1021955, 1042722, 1025353, 1025557, 1048124, 1066747, 1067568, 1073871, 1072412, 1084179, 1134407, 1184196, 1182610, 1144689, 1109920, 1106674, 1072098, 1066828, 1100221, 1145266, 1143118, 1116983, 1111213, 1093295, 1113836, 1146549, 1175536, 1215036, 1250805, 1266200, 1285900, 1286857, 1304602, 1298126, 1283882, 1284892, 1292096, 1334661, 1455990, 1657714, 1920644, 2177073, 2260502, 2129101, 1846142, 1536669, 1315675, 1182849, 1093102, 1048485, 1038070, 1072209, 1101680, 1134936, 1160411, 1177153, 1196163, 1201630, 1135070, 1052152, 954964, 869583, 814867, 812013, 818032, 830656, 829518, 805830, 781959, 775821]
8519G75821j1274K0816l666j3320J6732P132l39k8189m5885J9431K2662J7252
8507G77173J5676k3553k6925j8607K2714K1624k701R120L2075M5838R653j0469
8495H51618j0851j2361l6431k6747j7711K201K8251K2703j4820m2848l3947k0596
8483F88461j1101n02Q996j6471k656M439p050K768n885J140J5152k4021l0290
8470F22980n306J6337J4974K8324M1231K5891L6025N8835J0562k6518m4107o0670
8458G18558k4357J3889J5423k196L4536L7035k4863l6289m4342k8105j4234k1551
8446F23504j8726J6734M244j164l332j0050j1306L672P87M876l7610j4432p552
8433E49645L3683J4912p108j1447J1417M5616K6081P881N1498M8002L1840O490
$$ y = [775821, 764547, 785363, 781697, 768377, 785109, 792241, 791902, 763713, 717828, 737259, 759921, 777173, 792849, 769296, 742371, 723764, 746478, 768102, 765401, 774521, 806596, 852434, 862087, 851618, 840767, 828406, 791975, 765228, 747517, 749718, 777969, 800672, 785852, 743004, 709057, 688461, 677360, 676858, 685854, 669383, 666727, 671166, 664116, 666884, 660999, 662139, 677291, 653270, 622980, 617674, 634011, 648985, 677309, 718540, 744431, 780456, 839291, 849853, 823335, 779228, 718558, 694201, 708090, 723513, 721317, 755853, 792888, 768025, 731736, 687394, 659289, 645055, 623504, 604778, 621512, 625756, 624592, 621260, 611210, 599904, 603576, 604363, 609239, 571629, 557197, 549645, 583328, 598240, 591132, 579685, 591102, 636718, 662799, 670680, 722178, 770180, 802020, 808510]
8421H08510j1027k6132l3539m1181l3528l4581n1890k5689l128J1365J3010K1191
8409E93381m270l998l243Q72M5433M4201k183j0398j2788m3287j3453L866p551
8396E86582Q825k6313l3023k8785j7457k579j1237M71J9687N848j1811l6303L231
8383D57136r200k9442M238q042m901K5146J7942o18k950N046l330R33R779K750
8369D64487M440L3073K933Q353K8607L6484K152l4434m6729k3532m9973l1391
8357C94470J3223J9064l53j2703j3855l772Q294J0033j5505j9996j3478j9493
8345C45929m846J1751K0482l20l4909k3907j2583R527m084R447L5175M003P99
8332C56464J0016J2024N073j5046j8461J0270n766K2747p841N358J4915K988J1604
$$ y = [808510, 797483, 771351, 737812, 696631, 663103, 628522, 576632, 550943, 547815, 559180, 572190, 593381, 589111, 585113, 581870, 582742, 628175, 672376, 670193, 659795, 647007, 603720, 590267, 594133, 586582, 595407, 569094, 536071, 507286, 489829, 487250, 476013, 476484, 496171, 502019, 490208, 453905, 457136, 447936, 418494, 422732, 414690, 409789, 434935, 452877, 452259, 449309, 454355, 451025, 451958, 461737, 464487, 468927, 502000, 504933, 513286, 541893, 578377, 580529, 546095, 499366, 475834, 425861, 394470, 407693, 426757, 426404, 413701, 399846, 396074, 404368, 414401, 398896, 378900, 365422, 345929, 341083, 352834, 373316, 372996, 338087, 314180, 301597, 311124, 307040, 316487, 351662, 355665, 356464, 366480, 378504, 383577, 368531, 350070, 360340, 354574, 377321, 369480, 374838, 389753, 392741, 404345]
8319D04345o928k657J9163q38k6234j1590O786q80j4163R91L6510K8980J7183
8306D50668k3635l8310r766N679j1134k5765p379q185j8808j022J5893k291l044
8293C22901J4594j22O811J6958K951r225j2308r224Q00m6056l851j432J2603J7855
8279C13255O874k00j5022N762O341k614j4842J1390J3242j0692l785J0389J2776
8266C32874j3287r421M583J8089L8572N1790N8322J4565l4288m1511l4664l336
8254C82288m4529m2656k5130r534M0418J9909k0810j5411O096j0939j423J3594
8242B91873n827j7418r35j858J7422J585j6712k3608J0608J88n232J4336M849
8229B69271R916K3886J1787M619j4860j1340P699r635J2268k900j9429k7242j509
$$ y = [404345, 397417, 394760, 413923, 413085, 386851, 375261, 382047, 381167, 367004, 367995, 404505, 433485, 450668, 427033, 388723, 378957, 384636, 373502, 347737, 340358, 332173, 313365, 312343, 328236, 325945, 322901, 337495, 337373, 344184, 361142, 364093, 354868, 342560, 333336, 334136, 288080, 284229, 282797, 295400, 313255, 320129, 319929, 304907, 310669, 317010, 314396, 299554, 310944, 324186, 313494, 309709, 320098, 332874, 319587, 310166, 314749, 332838, 371410, 423200, 481522, 496087, 461799, 420288, 385624, 382288, 337759, 295103, 269973, 260439, 300857, 320766, 299956, 284545, 290641, 279702, 278279, 291873, 286046, 268628, 267693, 265835, 283257, 284842, 268130, 244522, 255130, 255318, 250086, 264422, 269271, 279187, 303073, 314860, 319479, 304619, 293279, 300978, 291343, 303611, 300711, 281282, 254040, 252531]
8216B52531K1568K3170N4118J2251J1340j0139j3599l7412k0150p229j1540L170
8204B78079j3518k7962k315R345K3866R968k3485k0588k500m954j6431K862J6676
8191B29043Q899J76K91J2155j6114m46K654M11Q149p679K668J2064J7480o039
8177B63712k2335j9813J1547K535M119M106l1394R882Q93k0833r529N304k916
8164A95278j890R974P182J2378J2022j1016k1378Q225n622j0819M537L2p021k0878
8150A71004J409K3907J9856O760L648K3573N856m239k438p832k7725k5511j2577
8137A75691K362J8846M8989k1154k0819n626j0516J9058P524R9j2262j988Q31
8124B01035p185K429N489q891P127J208J6885K063j04j0029n91O267Q462l733
$$ y = [252531, 274099, 297269, 351387, 363638, 374978, 364839, 351240, 313828, 293678, 286449, 274909, 278079, 264561, 236599, 234284, 243629, 267495, 277463, 253978, 233390, 230890, 225936, 209505, 212367, 229043, 237942, 238118, 238409, 250564, 234450, 234004, 236658, 237069, 245218, 237539, 240207, 252271, 269751, 263712, 241377, 221564, 233111, 235646, 239765, 243871, 212477, 222359, 223252, 202419, 192890, 198194, 195278, 193388, 203362, 210544, 222922, 234944, 223928, 202550, 210775, 205153, 194334, 198871, 198903, 191882, 171004, 172413, 196320, 216176, 222936, 226584, 250157, 256013, 251774, 249336, 241504, 213779, 188268, 175691, 178053, 196899, 245888, 224734, 203915, 198289, 187773, 206831, 214355, 214454, 202192, 200204, 201035, 193850, 196279, 201768, 192877, 200004, 201212, 218097, 220160, 220056, 210027, 209436, 215703, 224165, 220432]
8110B20432k450j0061o3l5157k7571J4736J4794R699L579J0667R203J1150N275
8097B24233j5202m3066l338K8481j5632J3339K781p438J8382J5260n691k4509
8085A87600R660K714J0083J7412n145p024k9822k8656q424L0535J6307l245J4958
8072B06953L9596J7855R44J999q433k7277j1065j0467l13k1886K889K6908n846
8059B11857l2866j6230O970o99R106K3365m30j5151K6862K3611q695j0438j899
8046B15363R381r091k1477k9739Q857K7891j3564J4539J6789k0268j8263l795
8034A76623p3n566k1589J9122J9887q226L048J253N246L2861J6370Q256L7172
8021B84384J5073k1856j1621l2143j8589J1958j0812Q145J7310j2634k3755p708
$$ y = [220432, 217982, 207921, 207858, 172701, 145130, 159866, 174660, 184359, 187938, 198605, 207808, 218958, 224233, 209031, 165965, 162627, 191108, 175476, 188815, 191596, 184158, 202540, 217800, 212109, 187600, 197260, 199974, 210057, 227469, 222324, 215300, 185478, 156822, 148398, 178933, 195240, 191995, 206953, 246549, 264404, 265348, 267347, 258914, 231637, 220572, 210105, 209792, 187906, 190795, 217703, 211857, 178991, 162761, 169731, 169032, 178138, 201503, 201073, 185922, 212784, 236395, 227700, 217262, 215363, 224744, 215653, 194176, 164437, 173294, 201185, 187621, 202160, 218949, 198681, 180418, 176623, 176550, 170984, 149395, 168517, 188404, 180178, 183226, 184479, 189725, 222586, 238956, 247212, 284384, 299457, 277601, 265980, 233837, 215248, 227206, 216394, 224539, 241849, 229215, 205460, 197752]
8009A97752l0039K715J7973l34j0011J1818k675m482M879O74r356m329j423R736
7995A82898j1870j185j1050r716J9085J1449j1877j956J0633J0670R690n732r252
7982A81787N329J6051J4213K1288j7448l343j893q392K0186P868l4123j881M5667
7969B45309L7185j9225l1363j5722j0493J4082l401j589K629k1466l288m964j2795
7956A74899N269J939J0753K4663N304l5749j2644k28j3552Q368J9051k442j0173
7943A75458l5942Q796K1266J4226J3805R665K6590l808J7206m634j7724J9841
7931B44745K0846p095l1703J838R714J7981J8657L3152J7448K669J370K4415j7425
7918C36612j9091P75o874j460j4536j7982r462j1941k692j2254l893k4573j3594
$$ y = [197752, 167713, 170428, 188401, 188067, 178056, 189874, 187199, 182717, 187596, 188270, 178914, 174585, 173162, 182898, 171028, 169843, 158793, 149077, 168162, 179611, 167734, 165778, 176411, 187081, 196771, 191039, 181787, 187116, 203167, 217380, 238668, 221220, 217877, 215984, 207592, 227778, 235646, 201523, 199642, 245309, 282494, 263269, 231906, 216184, 205691, 219773, 216372, 214783, 217412, 195946, 192658, 187694, 174899, 180168, 182107, 192860, 217523, 222827, 187078, 174434, 174206, 160654, 169022, 188073, 185631, 175458, 139516, 148312, 169578, 183804, 197609, 207274, 233864, 230056, 247262, 242628, 224904, 244745, 265591, 258496, 226793, 228631, 238345, 256326, 274983, 308135, 325583, 328252, 329622, 354037, 336612, 317521, 318296, 311422, 309962, 295426, 277444, 267982, 256041, 253349, 241095, 237202, 212629, 199035]
7905A99035p073K3490J8496R098J653k0781k2389R303J8425l3596J4417K2649
7893B32727o840K1248J2761k4404J201J2330J7686L934M07J5464J8663p129m774
7880B93274l4871k9623p428j0045j5137M508m086O161J0933K357r356n52k2251
7867A83884j7568K7525M28J091K946k8664r350J6201J4696M836k0284j1801J1581
7854A75521j5437N940K4674M41j6773j0324j4334r476K341J110M093J413M434
7841A53623L0776M6205k3032n3919l4286o459K114J9810J0524k9396k2078J2385
7829A06267J7515j3242k849L8982L4472j1559k0379k4603j633N156p417m112j4745
7816A01853Q647K7771J183R51j5933n699J1400q594j6442n444J7559K8947N697
$$ y = [199035, 191962, 215452, 233948, 243046, 244699, 223918, 201529, 210832, 229257, 195661, 210078, 232727, 225887, 247135, 259896, 235492, 236693, 249023, 266709, 270643, 271050, 286514, 305177, 298048, 293274, 258403, 228780, 221352, 211307, 196170, 200678, 196592, 202753, 213686, 216043, 206687, 206135, 183884, 166316, 193841, 194269, 195360, 198306, 169642, 160292, 176493, 191189, 196025, 175741, 163940, 175521, 160084, 166024, 190698, 191139, 174366, 164042, 149708, 140232, 142573, 143683, 147776, 149189, 153623, 184399, 230604, 207572, 153653, 119367, 112908, 115022, 134832, 145356, 115960, 93882, 106267, 123782, 110540, 107691, 146673, 181145, 169586, 149207, 124604, 122971, 128127, 120710, 116598, 101853, 110500, 138271, 139454, 140405, 124472, 118773, 130173, 121579, 105137, 99693, 117252, 146199, 151896]
7803A51896r793J3759j3988l5717j2590n738l214k598K2106j6734j5882J172N472
7790G8151q22n896j3060M120N276K3758q616k0396m014J6502K8904J9824N353
7777A29084j3490m615J490j4387j2086N401O491p390j343J9414l443o125Q048
7764A07049l192j1032j2407l108J1395J3111K479k5791J549j4008J9913K1704
7752A07662o772k7206Q120K0302j9726m056L740l16p63O497Q341j8094m6238n925
7738B5566L1860J2907N724r4K794l73k4907L883J2766K0669q308j666j3263j1269
7724E6289J8365J9058l7550j9825P861Q964Q475N522M173J7855k2253k5149j1931
7711B9854K952K7679K1420k4013r275O375Q173N93j1945J599P22k317j4182j1338
$$ y = [151896, 142103, 155862, 141874, 106157, 93567, 87829, 84615, 82017, 104123, 87389, 71507, 72679, 78151, 77329, 71433, 58373, 62493, 67769, 91527, 82911, 62515, 58501, 75003, 103907, 123731, 129084, 115594, 110979, 112469, 98082, 85996, 91397, 97888, 90498, 89155, 108569, 105126, 99001, 107049, 103857, 92825, 80418, 77310, 88705, 101816, 104295, 78504, 80053, 66045, 85958, 107662, 100890, 73684, 81804, 102106, 82380, 78324, 82064, 81748, 80985, 87482, 95823, 77729, 31491, 25566, 57426, 70333, 76057, 75963, 78757, 78384, 53477, 57360, 70126, 90795, 82487, 80821, 67558, 56289, 74654, 93712, 56162, 36337, 44198, 53162, 61637, 67159, 71332, 89187, 66934, 41785, 29854, 32806, 60485, 81905, 57892, 48617, 54992, 63165, 63758, 51813, 53412, 54134, 51817, 37635, 26297]
7697B6297j258J2505J8022K3401L919j2022j4375K342J0466j2149R5k4285j0186
7684B2772K0790J1769J8328j6576o645Q822J3656l818J836l2619q612l0301m137
7671d735K3825K1964K8387J032o943M314p030K0878r116r859j7017k0304j5823
7658I573L4863J8121j0230l0287n653J7309P424K9708o815j9690o476j805r25
7645C5117j500K121M668J6080J5859k2332j9432k0375l717J3689L973J9473p256
7632C6368j865o394j6806N822K9488L3306k3881j9950J8746J1345j6678l452K657
7619D8706P109p266kJ7085R217p666j9730K950L397K920j3929P641K1947J5049
7605H7428N083j7195j3383R721j5791j8521K4329J4525j204j0858j6912J5767
$$ y = [26297, 25039, 37544, 55566, 78967, 82886, 70864, 56489, 58831, 69297, 57148, 57243, 32958, 22772, 43562, 55331, 73659, 57083, 50438, 59260, 72916, 69098, 70934, 38315, 29703, -598, -4735, 19090, 41054, 69441, 70473, 63530, 67844, 60814, 81692, 72576, 62717, 45700, 25396, 9573, 44436, 62557, 52327, 22040, 16387, 33696, 41120, 70828, 64013, 44323, 37847, 36042, 35117, 33617, 35738, 40406, 56486, 72345, 50013, 30581, 10206, 6489, 20178, 24151, 43624, 36368, 34503, 28109, 11303, 17125, 46613, 79919, 56038, 36088, 54834, 66179, 49501, 46049, 48706, 55815, 48549, 48547, 65632, 74849, 67183, 47453, 50403, 53800, 56720, 42791, 50432, 72379, 87428, 92511, 75316, 61933, 71654, 55863, 37342, 61671, 76196, 74992, 64134, 47222, 62989]
7593F2989J4204k1437k6756q9P594q485k427J2815n644J3672J4579K5750n571
7580H1194j6775J542r609n174J7937J1212k6436j66p991J061L235j4989j7134
7567A7907N929K0844J2709O978p504l358K18J7687j061R561n433j6189N759j381
7553F2666k1705J1805n113k0838o889J9464J0396J1782o780j5888n820M126j56
7540C7050r523j780R68O87K4453K0544k260M838Q237m575J046J446j3114Q901
7526G6918J3477k230m6194j1447p030n465k366j7226J7374L3162J578m0836k4026
7513a4311K1186L3243j3222n97j0042j5281M929K5436L971j2675j3159n800J0154
7500A3832K6747R280R742j0659q256K975K3378O818k1132j7246K0597J1703k7243
$$ y = [62989, 77193, 55756, 29000, 28911, 36505, 28020, 25593, 38408, 32764, 46436, 61015, 86765, 81194, 64419, 65961, 56352, 51178, 69115, 80327, 53891, 53725, 45734, 46795, 50030, 35041, 17907, 23836, 44680, 57389, 64367, 56863, 53505, 53723, 71410, 70349, 79910, 74477, 58288, 64047, 62666, 40961, 52766, 47653, 26815, 19926, 39390, 49786, 61568, 54788, 38900, 33080, 37206, 37050, 27527, 25747, 26715, 27402, 51855, 72399, 70139, 74977, 83214, 78639, 79685, 81131, 68017, 76918, 90395, 88165, 41971, 30524, 23494, 18029, 15663, -1563, 15811, 48973, 50551, 9715, -14311, 6875, 40118, 26896, 26299, 16257, 976, 5905, 31341, 35312, 22637, 9478, 3678, 13832, 40579, 49859, 59601, 48942, 40686, 43661, 67039, 73857, 52725, 35479, 56076, 67779, 40536]
7487D0536r257q867R689K7074J6900N544n704P190k239k2984l7459J0512K5155
7474E6090q753o058K2285j592j3654j4317J6030k662k8203j597J875k789K2330
7461C8985J2121M647K0132j2504j4417p641J8167p19j0058l905j8705r082M336
7448B1357J0770K3227J4139r422k7330k2943j6397r943J0882J7134L7293J5724
7436F4491o439L46q880j5047Q95K888P456K1584o498j1309M758L638j517N384
7422F1750J4277j2651j2798R10j7139k8418j0733M959R972l857M386O016M335
7409B1009J7290L693r762l873Q67K2442k30n47r595N548j2361l3607J5532K2635
7395C9041k7992k6753K971j0808j2897Q061K0953L5932K3798J2307J727j8845
$$ y = [40536, 31279, 22412, 32101, 59175, 76075, 81619, 75915, 83105, 80866, 57882, 20423, 30935, 56090, 47337, 41279, 63564, 61972, 48318, 34001, 50031, 47369, 19166, 17569, 19444, 16655, 38985, 51106, 55753, 75885, 63381, 48964, 41323, 59490, 58771, 48713, 44808, 26103, 17021, 21357, 32127, 55354, 69493, 60071, 32741, 9798, -6599, -16542, -5660, 11474, 48767, 64491, 58052, 58398, 49518, 34471, 35366, 38254, 45710, 67294, 60796, 49487, 54245, 57883, 56366, 61750, 76027, 63376, 50578, 51488, 34349, 5931, -4802, 157, 10129, 6272, 10658, 16674, 21009, 38299, 41992, 32230, 28357, 29224, 51666, 51436, 50889, 41294, 46842, 34481, 874, 16406, 39041, 11049, -15704, -12733, -23541, -36438, -28377, -7424, 28508, 52306, 64613, 66340, 47495]
7383D7495j0634L739J7973j9423j6416M835J908K4212J3460k770o463k4395K7696
7370F1217J7207j6674l6359j3864n442q60q310K9621K0330j9355j1502J4682J5042
7357D5733o883l2609M267j7463j254K9941K7204J1730o123k5058K3424J6652k6848
7344D2713k215J4285m818j6234m184r020n692Q402Q129j4678k6152J449J6568
7331H553o355l241K8128J7672j955j7148k6081l223J4071J0811J3649j3456j5270
7318F155K3538J8940R793q775Q161l3272j9057P831K8393O102j1708m124L611
7305C5588J924K08Q830R35P676j0636j3423n423R456m088j7945m274J386J4204
7291B4418P850m616m778J0074J2738R310q134k0156J0163J8678j3079k8921k7424
$$ y = [47495, 36861, 40600, 58573, 39150, 22734, 27569, 29477, 53689, 67149, 64379, 57916, 33521, 61217, 78424, 61750, 25391, 11527, 6085, 5225, -3085, 26536, 46866, 27511, 16009, 30691, 45733, 38850, 6241, 10508, -6955, -8209, 21732, 48936, 60666, 54543, 29485, 52909, 69561, 42713, 40498, 54783, 49965, 33731, 29547, 20527, 14835, 23237, 31366, 16688, -9464, -8015, 8553, 2198, -1043, 27085, 44757, 42802, 25654, -427, -3650, 10421, 21232, 34881, 21425, 6155, 29693, 48633, 58426, 49651, 57812, 24540, 5483, 13314, 41707, 47809, 36101, 31977, 35588, 37512, 37720, 46550, 47485, 55161, 44525, 31102, 25679, 35135, 31047, 13102, 8828, 10214, 24418, 32268, 27652, 22874, 32948, 45686, 54996, 46862, 26706, 36869, 55547, 42468, 13547, -13877]
7278a3877k075K6290J8312M39j6320j5395L086k4246l464K6016J2236R657q120
7265A2539j2046q534J2794R059J3463J3754j9655L910m534r237R571P390J7022
7252D5496L0541N619k1316n435k1761j2396K624o049M569J4403k3249k1973R921
7239I94n651L887J5932K0288M286j6913j451m04J0230J3718k993j7495j4530j0179
7225b81N176R869L48J6094k1633J3881j2789q533j3965l87p585K8511J4220j1872
7211A1054M854M30p03Q897P068j1536n92p670K2653K1358j4640N367j4361n644
7197B6535Q331j5651j5465k676O993J4428K0726N414r927P828l889j2039J3913
7184D4521j2077k960L677l0835j5981Q879M783J8900J3451M244j134P48j8543
$$ y = [-13877, -15952, 10338, 28650, 29089, 12769, -2626, 460, -23786, -27250, -1234, 11002, 20659, 12539, 493, -8041, 4753, 13812, 27275, 41029, 21374, 25284, 20750, 11513, 21084, 28474, 45496, 76037, 81656, 60340, 54905, 33144, 20748, 23372, 17323, 21892, 36295, 13046, -8927, 994, -4657, -770, 15162, 35450, 39736, 22823, 21372, 20968, 31198, 44916, 41923, 24428, 9898, -281, 4895, 14764, 15112, 31206, 9573, 23454, 10665, 2132, -11833, -12220, -19805, 8706, 22926, 11054, 15908, 16338, 15635, 24532, 31600, 20064, 19472, 11802, 34455, 55813, 41173, 46540, 32179, 26535, 34866, 19215, 3750, 1074, 8067, 22495, 43221, 48635, 38708, 46536, 42647, 30608, 44521, 32444, 29484, 33161, 2326, -13655, -4776, 7, 18907, 32358, 36602, 35468, 36216, 17673]
7171A7673o401p116j181J7280J5744Q089j3621n43j5764n298K3898p04K231K871
7157C7158J2980R557j4882l7750j8822M1241K4350P480p130l1999l4116Q481J4285
7144A0833Q70P578J2318K728n609j0470m86j8664k0690L260L024J6742R774O171
7130A7379K0258J3572j3533k1227k8325O064M311R522K5213K3828j2862j4823
7118B9377j1389o377K166j7479k4577P175K1080j8215L499J8193M122k0647K02
7105a2870J1655m082J7133J4086J800J4177j551n159L211J0709j5887k4238J0050
7092A9034q233n713J2527j8903Q958L5035N112j1525O709k0752j611k3188j5577
7079a8127j0346J1941J8752J6494p534R151J2406l482j9243l611O021J0436j1583
$$ y = [17673, 11272, 4156, 2975, 20255, 35999, 44088, 30467, 29924, 14160, 8862, 32760, 32056, 34287, 37158, 50138, 59695, 44813, 7063, -11759, 29482, 53832, 61312, 54182, 22183, -11933, -3452, 10833, 11703, 19281, 31599, 34327, 28718, 18248, 17762, -902, -21592, -18332, -15308, 1434, 11208, 17379, 37637, 51209, 37676, 16449, -11876, -5812, -1501, 8021, 33234, 57062, 44200, 29377, 17988, 11611, 13777, -3702, -28279, -21104, -24, -18239, -14740, 3453, 7575, -13072, -12870, -1215, -5297, 11836, 25922, 27722, 41899, 40348, 35189, 38400, 49109, 33222, 8984, 19034, 10801, 5088, 17615, -1288, 7670, 42705, 47817, 36292, 43001, 22249, 20638, -2550, -18127, -28473, -16532, 2220, 18714, 11180, 20331, 32737, 29255, 10012, 6401, 12422, 22858, 11275]
7066A1275q712p223M494P610m596j4394L619J6378k0148M281J7673J306M038k9226
7052a3625L1K266K4793O688k209j6673r656J1217J712O429J3638p617j5559r116
7038g681J3793J5285j5903R395Q010p34j3323J834j1052q42P987m030j457L2271
7024C3553J1986j7901m036R586J2642N547k4340p434P801K6288j1785j2882m270
7011B4755j1469K803j0012M172n142l296l187J5456J1492J977Q50n610j66N294
6997B7917k5000j889K4958m321Q085k801j9860n455J02J4395R961k352L559O02
6983B7901o207n511j8795N059L340j698l471j7631k262L1504M622k8652j3026
6970b4827l515K3799J8551j3840j4800m280J1430m366j751m884m258J4902K0649
$$ y = [11275, 2563, -4660, -166, 7444, 2848, -11546, -7927, 8451, -11697, -7416, 10257, 11563, 15601, -13625, -13594, -11328, 13465, 20153, 17944, 1271, -8385, 2832, 4544, 10973, 24611, 16994, 1435, -7681, 6112, 21397, 5494, 14889, 22899, 22165, 8842, 10676, -376, -1218, 6769, 2739, 1282, 33553, 45539, 27638, 23602, 33188, 45830, 51377, 27037, 19603, 27404, 53692, 41907, 29025, 24755, 13286, 16089, 6077, 10249, 5107, 1811, -1376, 14080, 25572, 27549, 28399, 22789, 22623, 27917, 2917, 1028, 25986, 21665, 29750, 26949, 7089, 1634, 1736, 16131, 26092, 23740, 27299, 27901, 21694, 16183, -2612, 2447, 5787, 4089, 618, -17013, -19275, 12229, 16851, -11801, -24827, -28342, -4543, 14008, 168, -14632, -18912, -7482, -11848, -13599, -18483, -22741, -7839, 12810]
6957A2810l178k1597j5509L963J6722K5698j4144N140M512m947j9305M724J2170
6944G059k1404k67Q060K7049J1661j3879j4300L023R992l923K8424o932l2641
6931A922j3509j4264o161K0850K9424J6540j4686j1578J1839l498k560J8237k5979
6918F577K963j514m436J9020Q553o678j4844k9599J1213R769O766J2038J1717
6905C1545n979j6499j9349N016K1246M242L875N911k1627J496J7971r794n428
6892A2626R475J4807Q33L516J2466j0954l505l890j3954m164J2488J519q133j8964
$$ y = [12810, 9632, -11965, -27474, -23511, -6789, 18909, 4765, 9905, 14417, 9470, -9835, -5111, 7059, -14345, -14612, -6552, 20497, 32158, 18279, 3979, 7002, 16994, 13071, 41495, 34563, 1922, -11587, -25851, -32012, -11162, 18262, 34802, 20116, 8538, 20377, 16879, 14319, 32556, 6577, 9540, 8026, 3590, 22610, 31163, 24485, 9641, -19958, -8745, 1024, 7790, 19828, 31545, 25566, 9067, -10282, -5266, 15980, 20222, 24097, 30008, 8381, 9877, 27848, 18054, 12626, 22101, 36908, 37741, 41257, 53723, 42769, 39264, 35374, 21420, 17256, 29744, 31263, 23130, 4166]
$$ [...]
##END NTUPLES=NMR SPECTRUM
##END=
