##TITLE=Analysis number 329367
Compound Code cc 67174
Book Reference 513/124/5
Project Code adrs
Chemist Name ronp
##JCAMPDX= 6.0         $$ Bruker NMR JCAMP-DX V2.0
##DATA TYPE= NMR SPECTRUM
##DATA CLASS= NTUPLES
##ORIGIN= Bruker BioSpin GmbH
##OWNER= nmr
$$ XWIN-NMR		Version 3.5
$$ Thu Aug 23 12:01:05 2007 GMT Daylight Time (UT+1h)  MAYBRIDGE\nmr@NMR_250MHZ
##.OBSERVE FREQUENCY= 250.131544655141
##.OBSERVE NUCLEUS= ^1H
##.ACQUISITION MODE= SIMULTANEOUS (DQD)
##.ACQUISITION SCHEME= undefined
##.AVERAGES= 16
##.DIGITISER RES= 18
##SPECTROMETER/DATA SYSTEM= dpx250
##.PULSE SEQUENCE= zg30
##.SOLVENT NAME= CDCl3
##.SHIFT REFERENCE= (INTERNAL, CDCl3, 0, 16.522)
##AUDIT TRAIL= $$ (NUMBER, WHEN, WHO, WHERE, WHAT)
$$ ##TITLE= Audit trail, XWIN-NMR		Version 3.5
$$ ##JCAMPDX= 5.01
$$ ##ORIGIN= Bruker BioSpin GmbH
$$ ##OWNER= nmr
$$ C:\u/data/dgb/nmr/ADRS/1050/pdata/1/auditp.txt
$$ ##AUDIT TRAIL=  $$ (NUMBER, WHEN, WHO, WHERE, WHAT)
(   1,<2007-08-23 11:59:37.22 +100>,<MAYBRIDGE\nmr>,<NMR_250MHZ>,
      <created by zg, POWCHK disabled, PULCHK disabled
       configuration hash MD5:
       76 6E 9A 78 1E 09 19 81 EC 84 63 8F B0 6A 59 2D
       data hash MD5: 64K
       B7 4C B8 7D B5 B6 39 64 31 CD 4E B3 B1 80 95 28>)
(   2,<2007-08-23 12:00:07.89 +100>,<MAYBRIDGE\nmr>,<NMR_250MHZ>,
      <Start of raw data processing
       ef LB = 0.3 FT_mod = 6 PKNL = 1 SI = 32K 
       data hash MD5: 32K
       EB A3 68 27 2E 79 E6 0F D5 03 5A 2F A0 50 A1 82>)
(   3,<2007-08-23 12:00:13.36 +100>,<MAYBRIDGE\nmr>,<NMR_250MHZ>,
      <apk 
       data hash MD5: 32K
       DF 97 FE 74 D1 E0 02 F1 1C E4 04 49 12 5A F8 DB>)
(   4,<2007-08-23 12:00:18.47 +100>,<MAYBRIDGE\nmr>,<NMR_250MHZ>,
      <abs ABSG = 5 
       data hash MD5: 32K
       FD 55 98 B3 2B 67 24 28 AA CD 77 EC C2 C1 3B 8D>)
$$ ##END=
$$ 
$$ hash MD5
$$ 98 C2 ED 5D D6 B4 7B 6F 1C F0 25 5F 6C 5B BD C9
##$RELAX= 
##$RELAX= 
##$RELAX= 
##$RELAX= 
##$RELAX= 
##$RELAX= 
##$RELAX= 
$$ Bruker specific parameters
$$ --------------------------
##$DU= <C:\u>
##$EXPNO= 1050
##$NAME= <ADRS>
##$PROCNO= 1
##$TYPE= <nmr>
##$USER= <dgb>
##$AMP= (0..31)
100 100 100 100 100 100 100 100 100 100 100 100 100 100 100 100 100 100 
100 100 100 100 100 100 100 100 100 100 100 100 100 100 
##$AQSEQ= 0
##$AQ_mod= 3
##$AUNM= <au_zg>
##$AUTOPOS= <5 >
##$BF1= 250.13
##$BF2= 250.13
##$BF3= 250.13
##$BF4= 250.13
##$BF5= 500.13
##$BF6= 500.13
##$BF7= 500.13
##$BF8= 500.13
##$BYTORDA= 1
##$CFDGTYP= 0
##$CFRGTYP= 5
##$CHEMSTR= <none>
##$CNST= (0..31)
1 1 145 1 1 1 1 1 1 1 1 1 1 1 1 1 1 1 1 1 1 1 1 1 1 1 1 1 1 1 1 1 
##$CPDPRG= <>
##$CPDPRG1= <>
##$CPDPRG2= <>
##$CPDPRG3= <>
##$CPDPRG4= <mlev>
##$CPDPRG5= <mlev>
##$CPDPRG6= <mlev>
##$CPDPRG7= <mlev>
##$CPDPRG8= <mlev>
##$CPDPRGB= <>
##$CPDPRGT= <>
##$D= (0..31)
0 1 0 0 0 0 0 0 0 0.06 0 0 0 0 0 0 0.0002 0 0 0 0 0 0 0 0 0 0 0 0 0 0 
0 
##$DATE= 1187866774
##$DBL= (0..7)
120 120 120 120 120 120 120 120 
##$DBP= (0..7)
150 150 150 150 150 150 150 150 
##$DBP07= 0
##$DBPNAM0= <>
##$DBPNAM1= <>
$$ [...]
##$SUBNAM7= <"">
##$SUBNAM8= <"">
##$SUBNAM9= <"">
##$SW= 20.6930455092707
##$SWIBOX= (0..15)
0 0 3 0 0 0 0 0 0 0 0 0 0 0 0 0 
##$SW_h= 5175.983436853
##$TD= 65536
##$TD0= 1
##$TE= 296.16
##$TE2= 300
##$TE3= 300
##$TEG= 300
##$TL= (0..7)
0 120 120 120 120 120 120 120 
##$TP= (0..7)
150 150 150 150 150 150 150 150 
##$TP07= 0
##$TPNAME0= <>
##$TPNAME1= <>
##$TPNAME2= <>
##$TPNAME3= <>
##$TPNAME4= <>
##$TPNAME5= <>
##$TPNAME6= <>
##$TPNAME7= <>
##$TPOAL= (0..7)
0.5 0.5 0.5 0.5 0.5 0.5 0.5 0.5 
##$TPOFFS= (0..7)
0 0 0 0 0 0 0 0 
##$TUNHIN= 0
##$TUNHOUT= 0
##$TUNXOUT= 0
##$USERA1= <user>
##$USERA2= <user>
##$USERA3= <user>
##$USERA4= <user>
##$USERA5= <user>
##$V9= 5
##$VALIST= <valist>
##$VCLIST= <CCCCCCCCCCCCCCC>
##$VD= 0
##$VDLIST= <DDDDDDDDDDDDDDD>
##$VPLIST= <PPPPPPPPPPPPPPP>
##$VTLIST= <TTTTTTTTTTTTTTT>
##$WBST= 1024
##$WBSW= 4
##$XGAIN= (0..3)
0 0 0 0 
##$XL= 0
##$YL= 0
##$YMAX_a= 226511
##$YMIN_a= -107851
##$ZGOPTNS= <>
##$ZL1= 120
##$ZL2= 120
##$ZL3= 120
##$ZL4= 120
##$ABSF1= 16.522
##$ABSF2= -4.171173
##$ABSG= 5
##$ABSL= 3
##$ALPHA= 0
##$AQORDER= 0
##$ASSFAC= 0
##$ASSFACI= 0
##$ASSFACX= 0
##$ASSWID= 0
##$AUNMP= <proc_1d>
##$AZFE= 0.1
##$AZFW= 0.1
##$BCFW= 0
##$BC_mod= 0
##$BYTORDP= 0
##$COROFFS= 0
##$CY= 12.5
##$DATMOD= 1
##$DC= 0
##$DFILT= <>
##$DTYPP= 0
##$F1P= 14.0000005364418
##$F2P= -0.99999901652339
##$FCOR= 0.5
##$FTSIZE= 32768
##$FT_mod= 6
##$GAMMA= 0
##$GB= 0
##$INTBC= 1
##$INTSCL= 1
##$ISEN= 128
##$LB= 0.3
##$LEV0= 0
##$LPBIN= 0
##$MAXI= 10000
##$MC2= 0
##$MEAN= 0
##$ME_mod= 0
##$MI= 0
##$NCOEF= 0
##$NC_proc= -4
##$NLEV= 6
##$NOISF1= 0
##$NOISF2= 0
##$NSP= 0
##$NTH_PI= 0
##$NZP= 0
##$OFFSET= 16.522
##$PC= 1
##$PHC0= -35.04174
##$PHC1= 1.333064
##$PH_mod= 1
##$PKNL= yes
##$PPARMOD= 0
##$PSCAL= 4
##$PSIGN= 0
##$REVERSE= no
##$SF= 250.13
##$SI= 32768
##$SIGF1= 0
##$SIGF2= 0
##$SINO= 400
##$SIOLD= 32768
##$SREGLST= <1H.CDCl3>
##$SSB= 0
##$STSI= 32768
##$STSR= 0
##$SW_p= 5175.98343685301
##$SYMM= 0
##$S_DEV= 0
##$TDeff= 65536
##$TDoff= 0
##$TI= <Analysis number 999999
Compound Code 99
Book Reference 9
Project Code 9>
##$TILT= no
##$TM1= 0
##$TM2= 0
##$TOPLEV= 0
##$USERP1= <user>
##$USERP2= <user>
##$USERP3= <user>
##$USERP4= <user>
##$USERP5= <user>
##$WDW= 1
##$XDIM= 32768
##$YMAX_p= 357180221
##$YMIN_p= -545135
$$ End of Bruker specific parameters
$$ ---------------------------------
##NTUPLES= NMR SPECTRUM
##VAR_NAME=  FREQUENCY,     SPECTRUM/REAL,   SPECTRUM/IMAG
##SYMBOL=    X,             R,               I
##VAR_TYPE=  INDEPENDENT,   DEPENDENT,       DEPENDENT
##VAR_FORM=  AFFN,          ASDF,            ASDF
##VAR_DIM=   32768,         32768,           32768
##UNITS=     HZ,            ARBITRARY UNITS, ARBITRARY UNITS
##FACTOR=    0.157963299565203, 1,           1
##FIRST=     4132.6476996994, 0,             0
##LAST=      -1043.33573715361, 0,           0
##MIN=       -1043.33573715361, -545135,     0
##MAX=       4132.6476996994, 357180221,     0
$$ Real data points
##PAGE= N=1
##DATA TABLE= (X++(R..R)), XYDATA
$$ [...]
23341a15500o07M2319j00344j2810P8102K76207N2308j52491j98329m1358k5637
23330a98140J30560J59543k8045j25135r9142n0513L700M5409K82733P3522o0806
23319A33686j03455p2708L056M6514k9631j70996L3182P7995k6618N4823k2689
23308g6841l6372j33401k0082Q687K06574K88623O3521o7834j2313j48727k4875
23297D6960l6384L3717Q967k6644j39798K2168l0845n6400J8354l0111j29817
23286c19833L1426Q7338J23828P4995M4382L6976l5055J7634k3183q6467m4731
23275i2690N4714O1752L2369N1892L7662Q180l6591o0239m6882m9407K813j0674
23263d7101M71Q7339q4728r4297R2443Q6852J38931O2963o2012q7726j9792N6302
$$ y = [-115500, -116107, -73788, -174132, -186942, -108840, 167367, 219675, 67184, -131145, -172503, -198140, -67580, 91963, 63918, -61217, -160359, -210872, -207172, -161763, 120970, 194492, 133686, 30231, -42477, -39421, 7093, -22538, -193534, -160352, -82357, -108975, -54152, -76841, -113213, -246614, -266696, -258009, -51435, 237188, 300709, 232875, 220562, 71835, 46960, 10576, 44293, 53260, 26616, -113182, -91014, -121859, -178259, -159905, -190016, -319833, -288407, -201069, -77241, -2246, 42136, 79112, 44057, 61691, 38508, -47959, -92690, -37976, 23776, 56145, 108037, 145699, 153879, 117288, 57049, 10167, -39240, -36427, -47101, -46630, 40709, -44019, -138316, -45873, 40979, 179910, 242873, 180861, 93135, 73343, 129645]
23251A29645O3660K4064k8417q0016m8947P2689N3537q7811j52408j85450l5125
23240b74579J38323J15489M6692o6706J3559K06471j7231k8268K05705Q5349j37761
23229B87043j73063p7144Q2601J21015R391j4954j48286l9205J29211l8917k7336
23218A10356m0043n562K7001q0131l3311J36974Q5168j08171M949k6173J03609
23207A74666m1253k3594r0673j35997P7597J81620K5267P0039j2835l5676j47905
23196D1256q7593J08891M4500K8926j7380j02177k05936q7423J10814R1223k8252
23185a03151l1475J91316K6209r8826O0059J6515N1974P8067J0589n1127k6001
23174A24149o0585j48859r6634L1309m1056j9392N1420M5090Q623l1305j33920
$$ y = [129645, 193305, 217369, 188952, 108936, 59989, 132678, 186215, 98404, -54004, -239454, -274579, -136256, -20767, 25925, -40781, -27222, 179249, 162018, 133750, 339455, 424804, 287043, 113980, 36836, 119437, 240452, 249843, 234889, 86603, 47398, 176609, 137692, 110356, 70313, 64751, 91752, 11621, -21690, 115284, 200452, 92281, 97230, 71057, 174666, 133413, 109819, 19146, -116851, -39254, 142366, 167633, 237672, 224837, 189161, 41256, -46337, 62554, 107054, 135980, 118600, 16423, -189513, -276936, -166122, -74899, -103151, -134626, 56690, 82899, -15927, 44132, 60647, 112621, 190688, 201277, 150150, 124149, 63564, -85295, -181929, -150620, -191676, -211068, -159648, -114558, -105935, -137240, -271160]
23163b71160m4547j22239L0797J30558J13716K6124n1818J52815K11811q7156
23153H8901j22574K0119j4078J2345O2802n2889P5944J02607q3082o6308r156
23142A4631n1163J9443j5465N858k4418R8534L7128j35331M8716O6133r1641m2396
23130f9971l3716J12820m3897j15316R485m2116K323J0395J13963p4479O1270
23119f9239l3360j50207j0497P5948J7365N0830M6615p372K5092N2420j06403
23108a08808J18699N6016l3859r9146m2871k693k6475l0815L2657K0450j3806
23097a30651m2886K2441P4375m4279Q4679N5334k4513k5230J43973j25017j13324
23086a25098j16452N6130m1663J4544p3931q0144m1160R2588Q4201K18692L7814
$$ y = [-271160, -315707, -437946, -407149, -276591, -162875, -136751, -188569, -35754, 176057, 88901, -33673, -13554, -27632, -15287, 47515, -5374, 70570, 173177, 90095, 23787, 14631, -36532, -17089, -32554, -26696, -51114, 47420, 84548, -50783, -2067, 64066, -27575, -69971, -103687, 9133, -34764, -150080, -140595, -182711, -180388, -169993, -56030, -130509, -69239, -102599, -252806, -263303, -187355, -169990, -119160, -72545, -79917, -54825, -2405, -108808, 9891, 65907, 32048, -67098, -109969, -112662, -139137, -169952, -137295, -116845, -130651, -173537, -151096, -76721, -121000, -36321, 19013, -5500, -30730, 113243, -11774, -125098, -241550, -185420, -227083, -212539, -286470, -366614, -407774, -315186, -230985, -12293, 25521]
23075B5521J723K8694j00521l5899J71688L2468L5302m9342j62776p5025j8827
23064a46994P4927n3282N9454M2147O2035j5233j83367j80639j27264P5356J25968
23053b66892Q2356K0118M7542r0299r6724L1850N526J30864L08642j8027j49215
23042E741m9570J2085p9928k1192m3432j03403O6552J20653P2035J3143m6458
23031e3774K4665l3342O7219J19608L5400j14500m9595R8796J08152n6045j06099
23020D0485q9711R723P9634J06259m3915k03462j38591K8456Q0717O1757J21749
23009E3101j27633q1904J22780N585j56896p0971Q4720M1875k3706R4632J52587
22998I4170m6106j27488n8328m8879L0391J5496p0906R1031j6193q6824N160k2283
$$ y = [25521, 27244, 55938, -44583, -80482, 91206, 123674, 158976, 109634, -53142, -128167, -146994, -72067, -125349, -65895, -23748, 38287, 23054, -160313, -340952, -468216, -392860, -266892, -184536, -164418, -116876, -207175, -303899, -272049, -266523, -135659, 172983, 154956, 5741, -43829, -31744, -111672, -132864, -176296, -279699, -213147, -92494, -20459, -7316, -53774, -29109, -62451, 4768, 124376, 159776, 45276, -4319, 94477, 202629, 146584, 40485, -49226, -39503, 40131, 146390, 102475, -100987, -239578, -211122, -130405, -68648, 53101, -74532, -156436, -33656, -28071, -184967, -255938, -171218, -129343, -153049, -58417, 94170, 48064, -79424, -137752, -186631, -156240, -140744, -211650, -120619, -136812, -223636, -218476, -240759]
22986b40759O8356m9099j64733m2548P8385J17436K05647J1578j03593j0431M3558
22975h6203N0765N3217r3845n9516j9574o1989O9768J9086J75816J13658n2007
22964A09176O0177j7257j16215k07255N5249P0149r8507K793J44054J3241j10493
22953i4888P902J17361q3897J9406K8259J19252O7226J9295M7027k1534j00625
22942A24784k07604J3765Q0765K5465J19090k57j41715j74394j4061O4837j3639
22931a22964j26008J11609J85333P8908p7495j31219R31K383O3176P4739l1457
22920B7936o1712k0612R0470r1080p4282K3440J2355K2148o3544k7073M9023J15133
22908B202M04K391J54096J01074k9814j55762p5076p9521n5362R7825P255j7791
$$ y = [-240759, -172403, -221502, -386235, -428783, -350398, -232962, -27315, -15737, -119330, -129761, -86203, -35438, 17779, -76066, -135582, -155156, -217145, -147377, -128291, 47525, 161183, 109176, 169353, 152096, 35881, -171374, -116125, -45976, -144483, -141690, 2364, 15605, -94888, -86986, 30375, -53522, -34116, -5857, 113395, 180621, 199916, 246943, 225409, 124784, -82820, -69055, 11710, 37175, 156265, 156008, 14293, -160101, -174162, -109325, -122964, -248972, -137363, 47970, 126878, 49383, -81836, -80905, -78522, -15346, 59393, 27936, -33776, -54388, 36082, -54998, -129280, -105840, -93485, -71337, -134881, -161954, -112931, 2202, 2606, 4997, 159093, 260167, 230353, 74591, -485, -80006, -135368, -37543, -30288, -48079]
22896d8079J02840K3507r4038L9045K3727M4833M6239j0610j51559m2827r7138
22885a64060o1633n2558m0896J8799J13601J84378n9501J196M5659n6341j39820
22874b11176q8791m4622l0421J81989J22961M8515L3233P6064l1333o7387K3984
22863A3016p1004j24583j6967k2029M2582J00024M4410o054j9942n4235k7637
22852a42419k1659R6102J02027J1180j11884j69449l219K01388P7355L8169Q540
22841H6131l3999L0693q9779p5082P6805K8122r8889p7318K0858J60508r7479
22830f9429R5256R834k0718r2067m0863M1245P9957P232p0156O2797Q4104j20673
22818c3481j37525J7021k7855o4491L032n0722M4995J38428Q5717q8114p8506
$$ y = [-48079, 54761, 78268, -15770, 23275, 47002, 91835, 138074, 127464, -24095, -66922, -164060, -225693, -278251, -319147, -300348, -186747, -2369, -61870, -60674, -15015, -71356, -211176, -299967, -344589, -375010, -193021, -70060, -21545, 11688, 87752, 56419, -10968, 13016, -57988, -182571, -199538, -221567, -178985, -78961, -34551, -40605, -60547, -114782, -142419, -164078, -67976, 34051, 45231, -66653, -236102, -239321, -37933, 39422, 77591, 86131, 52132, 82825, -6954, -82036, -5231, 22891, -75998, -153316, -132458, 28050, -69429, 25827, 35661, 14943, -77124, -117987, -76742, 3215, 10447, -59709, 3088, 87192, -33481, -171006, -153985, -181840, -246331, -243299, -294021, -249026, -110598, -24881, -112995, -191501]
22807a91501Q1883Q115R6826L205l3015M8086L5098K6737j1597R7197k186k0921
22795A37927J35363k0783N805k25404j07407P587J82222J18474k1914r5056j37384
22784b0570Q9114N8532j14040L2018k1759M8590N6500r8723K95o8500P2470R9278
22772A33205k7166j3723K6463j24452l7489l4070o1757J61993J12592L3946j88642
22761a9100j42535n2707J19155Q0867J2951q1738J07685l3516j69629N1668J68903
22750D2004o9789j9779M1086J23528m9258o6629j97476m7498J33302J09222j20384
22739a21671K6710J12644L0140M3682J50378j29648J7631M8967o5284k1926N2428
22728A44051m4394p274L721k3883q9242j1222p5723o1319N5975J09980n6720j44297
$$ y = [-191501, -109618, -101503, -4677, -1472, -34487, 13599, 48697, 75434, 63837, 161034, 158848, 137927, 273290, 252507, 258312, 32908, -74499, -66912, 115310, 233784, 211870, 116814, -20570, 68544, 127076, 13036, 45054, 23295, 71885, 128385, 29662, 29957, -38543, 33927, 133205, 106039, 92316, 118779, -5673, -43162, -77232, -138989, 23004, 135596, 169542, -19100, -161635, -214342, -95187, -14320, -1369, -83107, 24578, -8938, -178567, -126899, 42004, -27785, -47564, -6478, 117050, 67792, 1163, -196313, -243811, -110509, -1287, -121671, -94961, 17683, 47823, 91505, 241883, 112235, 129866, 178833, 113549, 91623, 144051, 99657, 92383, 96104, 72221, -17021, -28243, -103966, -165285, -109310, 670, -56050, -200347]
22716b00347K2652R1708J65569J05732J76489n1311j91147p4542r4448j14764
22706a64409k385n0541j4248J09890P4419K1887J7056r68l8918j78690J39305
22695h7602J8072q1640j8344N6694J24909J48366P7855j07396j86561r7965K744
22684a50868J77039Q2164q5296j8922J04216l9530Q070r3725r1684k4227R3028
22673c9735j2952o7771o8021j47474R8894R2355j3667j41617Q4109M8106M530
22662a63243m829j0094M2128Q1925Q5506J46252m4211p3304k17911L3643N2239
22651g1899J0188o1599p5637j7399j1705R5941Q1908J02395n4634o0515P3976
22640A1020O9686o1342o2406L724Q6978M6024k16054j77083Q9518L1974O6282
$$ y = [-200347, -177695, -85987, 79582, 185314, 361803, 310492, 119345, 44803, -49645, -164409, -166794, -217335, -231583, -121693, -47274, -25387, -8331, -9299, -48217, -226907, -87602, -69530, -151170, -169514, -112820, 12089, 160455, 238310, 130914, -55647, -153612, -150868, 26171, 108335, 23039, 4117, 108333, 68803, 76873, -16852, -108536, -132763, -39735, -52687, -120458, -188479, -335953, -237059, -144704, -158371, -299988, -215879, -167773, -163243, -168072, -178166, -136038, -54113, 31393, 177645, 133434, 60130, -157781, -124138, -71899, -61711, -123310, -198947, -216346, -228051, -132110, -50202, 52193, -2441, -62956, 11020, 80706, 19364, -43042, -39318, 47660, 93684, -122370, -299453, -209935, -177961, -111679]
22629a11679m6973R6664J19250J05772m0641J305q9934o7068j23752n843J73666
22618A0767K0203o1095O6338K0462J29024L2087N1663l6224m7302l7603n1742
22607I6578j64175Q2629R8580j35140p3969J35273N9077j39157p0028J45324k2379
22596A2613J7269k443l4215J31810J4743j33234J42651K0012o880j7021j84924
22585c9619j21734k1791p7774o6855o3846k77J70475J56141J91221J7083J4345
22574A57369j67276j41861L4308L4276q6954n1937L0659L5104M0076M1248M7598
22563b7390R3704k9361O6358L2697j69994j12052M4015r0412M1658O4409j1222
22552i7590j4912m1876K15363Q3390p642K5405q7474j55443K059N6544Q5657J1821
$$ y = [-111679, -158652, -61988, 57262, 163034, 122393, 123698, 33764, -33304, -157056, -162899, 10767, 30970, -30125, 36213, 56675, 185699, 217786, 269449, 233225, 185923, 148320, 96578, -67597, 15032, 113612, -21528, -95497, 39776, 98853, -40304, -110332, 34992, 12613, 29882, 27439, -6776, 125034, 139777, 6543, 149194, 169206, 162326, 145305, -39619, -161353, -183144, -260918, -327773, -391619, -391896, -221421, -65280, 125941, 143024, 157369, -9907, -151768, -117460, -83184, -170138, -222075, -191416, -156312, -116236, -74988, -27390, 66314, 36953, 103311, 136008, -33986, -146038, -102023, -192435, -150777, -86368, -97590, -112502, -154378, 60985, 144375, 136733, 162138, 74664, -80779, -78720, -22176, 63481, 75302]
22540G5302P7794j4187k3098J04086J62411l2133p2776l19j39687l2179J09974
22529B15188r3202m6125L7402Q3411N8429q0836p7376k3523j31836j40425L0483
22518a68410J5454M2926Q1014m0313J07116j0348n8273M3507L1676K8850K179
22507G5378O3537j62788j22416p985J54248k4667J3655n1448N0289O7994K9326
22496H5123N8048J5790l2887o8789m8709L1231J24394j02935j42886l4165m1538
22485a57323J8255J16100n975L275l2103k5935R7995q4002p5558m8774o7694j36730
22473c98469k4307J11621R3723P6897L4689q2040N2512L1792J02405M7892R5286
22462A42001L6001r9082m8758K0114J9258m5184j19970J7316O7550M0972j278
$$ y = [75302, 153096, 138909, 115811, 219897, 382308, 350175, 277399, 277080, 137393, 105214, 215188, 121986, 75861, 113263, 196674, 255103, 174267, 96891, 73368, -58468, -198893, -168410, -152956, -110030, -29016, -69329, 37787, 27439, -30834, 12673, 44349, 73199, 75378, 138915, -23873, -146289, -154274, -26, -24693, -11038, -62486, -12197, 55797, 85123, 143171, 158961, 126074, 57285, 8576, 39807, 164201, 61266, -81620, -115785, -157323, -139068, -22968, -28943, -25668, -57771, -83706, 14289, -69713, -145271, -194045, -261739, -398469, -422776, -311155, -217432, -140535, -105846, -187886, -135374, -103582, -1177, 46715, 142001, 178002, 78920, 30162, 50276, 69534, 24350, -95620, -78304, -10754, 30218, 28940]
22451B8940M3326R8322j06839n3192j42046J21865Q5939M9994j21488j34231L2373
22440i7037P3011q207N4724M2440o1354j42355n5708J26029K14468O404j46047
22429F368j33254o0659j58727L6809J27726R8111O4844J29577L5703j87512L747
22418c7267P6493o0196n9264j6636k1703j40390N2723J10383k5898J88564J14373
22407A81182j7120o2406J13945j09162j03776N6154J21284n0908o5388Q2291P1257
22396B17353q6101j20664K0055j61520M1158J49333j5924p340N3434N0612j28510
22385A1886j37241o2351l7592K72712K17857j2582j10946m6150m7701j9106J468
22374C0254j23387m1817Q0371q1268o2441O6331k2358J91813K2094j36246K4121
$$ y = [28940, 72266, 170588, 63749, 10557, -131489, -9624, 76315, 126309, 4821, -129410, -97037, -24026, -32233, 22491, 64931, 3577, -138778, -194486, -68457, 146011, 152415, 6368, -126886, -187545, -346272, -309463, -181737, -83626, -18782, 110795, 146498, -41014, -37267, 39226, -20970, -80234, -96870, -118573, -258963, -206240, -95857, -121755, 66809, 181182, 164062, 101656, 215601, 106439, 2663, 58817, 180101, 129193, 63805, 146096, 217353, 131252, 10588, 30643, -130877, -89719, 59614, 43690, 36350, 89784, 140396, 11886, -125355, -187706, -225298, 47414, 265271, 252689, 141743, 95593, 47892, 28786, 30254, -93133, -134950, -54579, -135847, -198288, -131957, -154315, 37498, 59592, -76654, -52533]
22363e2533r595K2441o6913n445R0335J6366l8555q0754J09715r991j4192L0895
22351h226P1885M2149J33336k3164m4717j06488o0558j24440N1586J1444j1439
22340f8632K931j6512J3165J2441o848L1268P1813m2864K5595J03524L6901K9970
22328A92752o4591j7687j44444m9528j4202J47439P0009j50270m9644J11515J26738
22317A58087j62736m4464J65086R8595r7921j10944j0002J63549J44412q5178
22307B18484k12231m2840J0972Q1025n706j6702j40588O2108J01650j46452j3753
22296a04033J22305Q4740p0237n5245K9430o0177J0815q396k4044M0020j40351
22285a75173o4100r2942m1721M6730K05153J34255r6608o1165J5658k6645Q3030
$$ y = [-52533, -62128, -39687, -106600, -112045, -21710, -5344, -43899, -124653, -14938, -24929, -39121, -8226, 63659, 105808, 239144, 215980, 171263, 64775, 4217, -120223, -68637, -57193, -68632, -65701, -82213, -69048, -56607, -63455, -32187, 39626, -3238, 22357, 125881, 162782, 192752, 128161, 110474, -33970, -83498, -97700, 49739, 119748, -30522, -80166, 31349, 158087, -4649, -49113, 115973, 214568, 116647, 5703, -4299, 159250, 303662, 218484, 6253, -36587, -25615, 55410, 49704, 33002, -107586, -45478, 56172, -90280, -104033, 18272, 103012, 32775, -22470, 6960, -53217, -42402, -50798, -74842, -34822, -175173, -239273, -332215, -373936, -327206, -122053, 12202, -84406, -145571, -129913, -156558, -73528]
22274g3528J41752R9391R188n0875N252j02617l3538J5949n3923r5473o7247K0906
22262a84763R9414Q905m441O7503p2022p5115J5260m866J33839M2538r5983l3535
22250a03266o298q3949j12169K077K88185K58027K0517j4166k30143o6147O6605
22239A9273J06656n3491k30787Q810J34169J17925j45310j6708j66206p5110J58812
22228a41967P9982J0007m4512P866j1958n5808r9597n8341O3732J01802J08579
22217d0215p960P912J48757l5747k45008q8314j45826M4215J17163J9392J17334
22206a08297R7985p51m0784m1575R8994K8820j6886J1026k15615j19666r4167
22195d00916P0727J79990P0874M7640Q8083N2643J5053K1609J84544N5110j84833
$$ y = [-73528, 68224, 167615, 176803, 125928, 131180, 28563, -4975, 10974, -42949, -138422, -205669, -184763, -85349, -76444, -80885, -13382, -85404, -160519, -145259, -150125, -16286, 26252, -69731, -103266, -109564, -193513, -305682, -303605, -15420, 242607, 263124, 248958, 18815, -47332, 19273, 125929, 72438, -158349, -149539, -15370, 102555, -42755, -59463, -225669, -300779, -141967, -61985, -51978, -96490, -88624, -100582, -156390, -255987, -314328, -250596, -148794, -40215, -48175, -40263, 108494, 72747, -172261, -260575, -406401, -362186, -245023, -225631, -108297, -10312, -11063, -51847, -93422, 5572, 34392, 17506, 28532, -187083, -306749, -400916, -330189, -150199, -79325, -31685, 56398, 109041, 124094, 145703, 330247, 385357, 200524]
22184B00524p1193o0664j7401p7000O3424k7000r457l2384r1016J26346j11859
22173a07680j5318K527q5541q791n3677N911k2142R1700l1390R1314N4777l3349
22161a11659J51909O5725j11860j38020q2443J37996L7153j02202q7559J12605
22151a28355J62632J6622O3596J38740j03808j43221l8690J9089j57014J2304
22141a58105J16402l9767J11180q463k9158j066J24734L998r6118Q0148Q7785
22130A91570n9343j93332j44744L616M7729Q7533K3467J13652L4898L9824Q9240
22119B34110J0258j39547n1638M8396M1246m414N5227k2311o1283m7311j07242
22108d4509K6483N9673n8809J73500j08725p2407o6245p0291l027p3390J56937
$$ y = [200524, 129331, 68667, 51266, -25734, 37690, 10690, 1233, -31151, -122167, 4179, -107680, -122998, -120471, -206012, -214803, -268480, -262569, -284711, -193011, -224401, -133087, -78310, -111659, 40250, 105975, -5885, -143905, -226348, -88352, -51199, -153401, -240960, -128355, 34277, 50899, 114495, 253235, 149427, 6206, -32484, -13395, -170409, -158105, -41703, -81470, 29710, 21247, -7911, -8977, 115757, 119755, 23637, 103785, 191570, 132227, -61105, -205849, -202233, -154504, -66971, -43504, 70148, 105046, 144870, 234110, 244368, 104821, 53183, 101579, 142825, 138411, 193638, 171327, 110044, 62733, -44509, -18026, 41647, -17162, 156338, 47613, -24794, -91039, -161330, -164357, -237747, -80810]
22097h0810J36448j01048Q2252P4233o6219l0405M8800J14747O7706j4833r5148
22086A35723l9461o6847r7408j33944k0879R0876m2371J96319K00208N3110k07824
22075F7502o999j0376o7280J02986p2174k4076J9827j42040J2907P7609l3102
22064g5216o1767O039K48977K48575r8790j84818L5495k7724K5069J64692j3132
22053B67400j66665l6608N8339O3345r3237l9011O4738n2180k9433K2125l2221
22042B6592l4245K648K7675L1002q0508k00635J16781J32458k7744k4059j6015
22031d6050l1013R263J77454N2101j63989q9914P9669R9696Q8066j06478j25736
22020e6931j8358M1627L5432p5414m0543l069r6044P7695O7897o2786l4316L9808
$$ y = [-80810, 55638, -45410, 36842, 111075, 44856, 14451, 63251, 177998, 245704, 230871, 135723, 96262, 29415, -67993, -201937, -222816, -131940, -174311, 22008, 222216, 275326, 67502, 60503, 50127, -17153, 85833, 13659, -10417, 9410, -132630, -119723, -42114, -75216, -136983, -130944, 118033, 366608, 267818, 83000, 118495, 90771, 115840, 280532, 267400, 100735, 64127, 122466, 185811, 92574, 53563, 118301, 66121, 36688, 58813, 26592, -7653, -5005, 22670, 53672, -26836, -227471, -110690, 21768, -5976, -30035, -46050, -77063, -67800, 109654, 161755, -2234, -92148, -12479, 87217, 175283, 68805, -56931, -75289, -33662, 1770, -73644, -114187, -117256, -213300, -135605, -67708, -130494, -164810, -125002]
22008a25002J85383O5819j5181o6474j05988N4219r067p7469R8192J39247N6371
21997B00050o7623m5996j8095n0032j98940P530K73158l1110L0546j15474p8869
21986i4855R6328J11680m1499L134O0704j88684k62429J9902K80446P3767M3566
21975A02060J13524k2242j84158j06846m0341j2260o2108J8165J17159R3213l9017
21964b2851l2814O3783p201P6952k4558M0857O4068m2286O6608J9573m9177m0643
21952A12311r7704r4217k3759J02181R5921q0087j72563Q0672N9032j03618j23309
21941b45140R8581J26465j40940o8974J29402K12662k7903k9889n063J46234p3461
21930A21974l1852O9945J4614l3284q9157K4754J5840M7022j6132p6940R1520
$$ y = [-125002, 60381, 126200, 111019, 44545, -61443, -7224, -16291, -93760, 4432, 143679, 200050, 132427, 86431, 68336, 18304, -180636, -173106, 100052, 68942, 99488, -15986, -94855, 1473, 113153, 71654, 74788, 135492, -53192, -315621, -295719, -15273, 58494, 102060, 215584, 193342, 9184, -97662, -138003, -150263, -212371, -194206, -77047, 16166, -22851, -55665, 8118, 917, 77869, 53311, 94168, 158236, 115950, 182558, 202131, 152954, 112311, 14607, -79610, -103369, -1188, 94733, 14646, -157917, -77245, -18213, -121831, -245140, -146559, -20094, -161034, -230008, -100606, 112056, 84153, 54264, 49201, 195435, 121974, 90122, 160067, 174681, 141397, 52240, 76994, 92834, 139856, 123724, 46784, 138304]
21919A38304j728M4897J4307o5662j41001j99090n1160l8170L9428J23122J45980
21908I227O8414K639M403J1045o3608K461n0776Q27J11102l767k00879r5089N1109
21895a52892J50716M3450J11572K7968k1673l0703r0064j10545J8638Q3524r4062
21884f4071J67425j4615k04566k7150J93427J09585q7989m1578P2879K06042L2817
21873C42206j52772j01581N0341n7944J27167J17241k2018o5823j42722R3794
21863A87889n6843k49106M8273P1074m8597L8070j0299O0748J06161L7611M2531
21852B27512k03464j56635m275J21096K3475k0385l9228n0269R9440N0886k6078
21841B2075J69894q5342o5156l200k427k1856o8705j17526j34691j7926K12857
$$ y = [138304, 136576, 181473, 195780, 130118, -10883, -209973, -261133, -299303, -259875, -136753, 9227, 77641, 80280, 84683, 95728, 32120, 34581, -16195, -15368, 95734, 91967, -108912, -204001, -152892, -2176, 41274, 152846, 180814, 159141, 128438, 38374, -72171, -53533, 29991, -64071, 103354, 88739, -115827, -142977, 50450, 160035, 72046, 30468, 103347, 309389, 342206, 189434, 87853, 138194, 80250, 207417, 324658, 302640, 236817, 94095, 187889, 131046, -118060, -69787, 1287, -47310, -9240, -19539, 41209, 147370, 184981, 227512, 24048, -132587, -136862, -15766, 7709, -12676, -51904, -102173, -2733, 48153, 22075, 191969, 106627, 41471, 38271, 35844, 13988, -54717, -172243, -306934, -324860, -112003]
21830a12003J27015k7134k8809K1878Q6542J03175J028p3318m5530j7652P3317
21819A08509r4698M9557n1638M3004J26869j4719j24193o3393K5414m1301M6205
21808I616j23267j23960m4190N3279J38481K2962M3806Q2148k3503N2222j5417
21797G2177p7255N937J13092J19951r134p7315R650j3623n1195p9748K9360L1592
21785G3489o4566J21579P0411j07567r558o3702m7294O8320j7045M4125l8468
21774B9724j35709j4974J66954J56507j014j89104l4585J17580n0949n291Q9336
21763A28475j06902P7156O9858p418O5135R4761r2433j28211q8917P7894j9893
21752F9505O5935k1641j48354j16968j15138L912N1861J71352L3089m7481K3477
$$ y = [-112003, 15012, -12122, -40931, -19053, 67489, 170664, 171692, 98374, 52844, 35192, 108509, 13811, 63368, 11730, 54734, 181603, 166884, 42691, -20702, 4712, -36589, 9616, -113651, -237611, -281801, -228522, -90041, -67079, -23273, 58875, 35372, 87594, 72177, -5078, 859, 113951, 233902, 224768, 147453, 157103, 143480, 92285, 12537, 41897, 73489, 8923, 130502, 200913, 93346, 83788, 20086, -27208, 41112, 24067, 68192, 29724, -105985, -120959, 45995, 202502, 201488, 12384, -22201, 95379, 44430, 39139, 128475, 21573, 98729, 168587, 161169, 226304, 321065, 228632, 100421, 11504, 89398, 69505, 135440, 113799, -34555, -151523, -266661, -262749, -210888, -39536, -6447, -53928, -30451]
21741c0451J00967m9309j64413O2898K00700q6455j37291L0719K831Q9428P7283
21730I6907j28523p5947k032j4470O7780O4570p1161j27565m0150n860o953J30047
21718a13357p8614J1967K95224P2517N6321j04875j84072p4333J18810J46687
21708A46275k9211j7939j5196j59316j16645J1688J18552Q843p1806m4877K0131
21697a49501J06497J49126o3642j51755l4780p4097Q8888j03462M5983J37563
21687d9180q3093l7012J00194m2700J2427Q0742L7076j00753M9176N5395M8420
21676G0692J05073j514K6166m0172q2371l6744M3947p1082k5268q5155L2436P1279
21664G287q022l2195j50692J855Q0213J38417J53071n0277j10423o0678m6829
$$ y = [-30451, 70516, 21207, -143206, -80308, 120392, 33937, -103354, -72635, -69804, 19624, 96907, -31616, -107563, -109595, -124065, -56285, 8285, -62876, -190441, -230591, -236451, -243404, -113357, -191971, -180004, 115220, 187737, 244058, 139183, -44889, -119222, -412, 146275, 117064, 99125, 83929, -75387, -192032, -180344, -61792, -52949, -124755, -169632, -149501, -43004, 106122, 42480, -109275, -144055, -218152, -129264, -232726, -186743, -49180, -132273, -169285, -69091, -111791, -99364, -18622, 18454, -82299, -33123, 22272, 70692, 175765, 174251, 200417, 160245, 77874, 41130, 85077, 13995, -11273, -96428, -63992, 7287, -735, -32930, -183622, -181767, -101554, 36863, 189934, 139657, 29234, -31444, -78273]
21653g8273R3879M8113m7981j79887k1706P4941Q0270l5621N9017K8251P21N7453
21641G9177J9817Q3965J44444j15396j65284n8091O0461Q6663P5021j42437j9693
21630D8647L8186j66540j06622k8042O3298J07637O6933j03078m1880O1259L3887
21619b6315l6428j3308J9241J01833N8410L5646K0480N2421k6892p6934q498m9866
21607D9790n518K4100j0208k9305j57914k6262J45750l0455L7227J65960M642
21596A67807J12665J25422j04938j73263l3295P8302k432j6598l193j58391n5139
21585f3053j9787L5734O5517m3529O1680M9551p634j63398n7830J04258J50158
21574A11667J82619k5077q4885j67520J2908J7429O1501J80994j30337k57215
$$ y = [-78273, 15606, 63719, 15738, -164149, -185855, -110914, -30644, -66265, -7248, 21003, 21724, 79177, 98994, 182959, 327403, 212007, 46723, -11368, 49093, 135756, 210777, 68340, 48647, 86833, -79707, -186329, -214371, -151073, -43436, 23497, -79581, -121461, -60202, -26315, -62743, -76051, -56810, 45023, 103433, 139079, 159559, 211980, 185088, 108154, 99656, 49790, 44272, 68372, 58164, 28859, -129055, -155317, -9567, -40022, -2795, 163165, 167807, 280472, 405894, 300956, 127693, 94398, 172700, 170268, 153670, 150477, -7914, -63053, -82840, -47106, 18411, -25118, 36562, 86113, 78479, -84919, -142749, -38491, 111667, 294286, 269209, 184324, 16804, 29712, 47141, 108642, 289636, 159299, -97916]
21564i7916m6630J59234J16108k3183N739L4560N1568J00046M6135o0764p3527
21553B11370q0203n5073l5934j5985j2978p454k2287j37663O5720J74959M9838
21542A34310k19146J1223J96112K0834p1511j15973k8662J26429K8588k2186k2587
21531C7431o665o8217p4115J50753N7866m1329Q2677J57558N6982j43174N7546
21520B67313j52437q6875J4950J5568j62403n6953J41335K91639l6949j12874
21510A22314o2589L9612N2211r0474J9903p1903n0947K03611J52406j02664k25547
21499a4067K7588J10264O2936Q496R193J2070L2230J53916M1405k07354j67718
21488F8959j25093j2594J59649r402q3977l6059Q7321o4900P3116J09366N9102
$$ y = [-97916, -144546, 14688, 130796, 107613, 113352, 147912, 199480, 299526, 345661, 284897, 211370, 131167, 76094, 40160, 24175, 11197, 3743, -18544, -156207, -90487, 84472, 134310, -84836, -73613, 122499, 143333, 71822, -44151, -72813, 53616, 82204, 60018, 37431, 30766, -37451, -111566, 39187, 97053, 55724, 138401, 295959, 352941, 209767, 267313, 114876, 28001, 42951, 58519, -103884, -160837, -19502, 272137, 235188, 122314, 59725, 99337, 151548, 61074, 80977, 9074, -41873, 161738, 314144, 211480, -14067, 13521, 123785, 186721, 195217, 204410, 216480, 248710, 402626, 444031, 236677, 68959, -56134, -68728, 90921, 81519, -2458, -38517, 48804, -16096, 57020, 166386, 225488]
21477B25488l5439j32456r2432m8756N6620K0183M3160j21960k2739J72688R8705
21466A63062O0754m7591j31958m6115N6439o1488N3920J99703L8017k2140j11066
21455A51537k00146m3108J54313J34819k6636n7126J09699K4067q3419m1928N2219
21444A74291o9168J3199l7137j5493n0599J29175R1749J25432j15833j14338J15191
21433B46469P722j2839o6114j33798j64463j7559L3391Q5677O7781n5039N2889
21422D4117p2166j55810P3890J76488K2720p1157r9258j602M2774L749J70077
21411A33822M9504m3166r169r9056J05004j36875j27151J6141M4859R9812J24338
21400A58063k1215j89396Q600J19616j42789m5536N7673j4773M510R0937N4854
$$ y = [225488, 190049, 57593, -34839, -83595, -26975, -6792, 36368, -85592, -108331, 64357, 163062, 223816, 176225, 44267, -1848, 54591, -6897, 47023, 246726, 284743, 262603, 151537, -48609, -91717, 62596, 197415, 170779, 113653, 223352, 247419, 164000, 122072, 174291, 105123, 118322, 81185, 65692, 15093, 144268, 236017, 361449, 245616, 131278, 246469, 254191, 241352, 175238, 41440, -123023, -140582, -107191, -21514, 46267, -8772, 44117, -28049, -183859, -109969, 66519, 89239, 18082, -81176, -82778, -40004, -36255, 133822, 183326, 140160, 130991, 31935, 136939, 64, -127087, -110946, -66087, 33725, 158063, 136848, -52548, -43948, 75668, -67121, -112657, -54984, -69757, -65247, 25690, 80544]
21389H0544l6398j02433j14603K2858J19599K3857M5566P0044k9776l3215r8200
21378e2157r5943p247J2911J60286J05492O533k04060m6534Q751N1193J13100
21367E2325j09718j43864R2591L8465P5721J67265j0648j38905o3913P7730j4387
21356B2662j9833j10650P1590Q255o2358N5736m3397n4578N5382L4547Q2857j9126
21344B1087o2150j6302J20318J15835J0296o1347p1936j73144m4957K67167K43698
21333C48565J75090o5980q3641q6654m7051Q8788N7722r4443j26835j21538J59738
21322B03761J4847L3251P743n1796o8748p9993Q3069n210n4891r8966m8861O7165
21310A371r037j28725O5308m532J77450Q2152o2790j00832P5955Q1828O345m2768
$$ y = [80544, 44146, -58287, -172890, -150032, -30433, -6576, 38990, 109034, 79258, 46043, -52157, -148100, -155347, -142436, 17850, 123342, 129875, -74185, -120719, -111968, -60775, 52325, -57393, -201257, -108666, -70201, 5520, 172785, 162137, 23232, -40681, 37049, 22662, 2829, -107821, -36231, -27976, -90334, -34598, -77995, -132573, -77191, -42644, 40213, 21087, -41063, -57365, 62953, 178788, 189084, 127737, 55801, -117343, -162300, 104867, 348565, 523655, 457675, 374034, 287380, 240329, 329117, 386839, 292396, 165561, 44023, 203761, 218608, 251859, 259602, 207806, 139058, 59065, 142134, 136924, 82033, -16933, -65794, 1371, -7666, -136391, -71083, -75615, 101835, 183987, 121197, 20365, 96320, 178148, 184493, 141725]
21298A41725m3123q0880P7188M4937M370n5301j2083j03229j4793l683p6612n6526
21286a78010P064N851N0834k9710K08176J17146L1435r3951j248R9518j26663
21275I0442q7678J77378J8280j30484p1785m8229M5777m8197J05862K29329n1609
21264B29086k8343P9197j8214j35172J15852K0794J13631k0878j51958j41595
21254F2400q2304q9432l4327K13488L9246K7459j8368j46847j1493P4388J79188
21243B13398J97663q3765k36004r1281J743j32602J0979J11120j5867J579J39358
21232A16321O8033j26799n3132o3325j08406o7895r6759J51504J48300o1745N6835
21221c7068J6508Q8259L976p0029m4206J30596J45304J14033m8126K9913n4508
$$ y = [141725, 98602, 17722, 94910, 139847, 144217, 88916, 76833, -26396, -41189, -44872, -121484, -178010, -170946, -165095, -114261, -143971, 64205, 181351, 212786, 118835, 117587, 217105, 90442, 2764, 180142, 198422, 67938, -3847, -52076, -6299, -54496, 51366, 280695, 229086, 200743, 279940, 261726, 126554, 242406, 263200, 376831, 355953, 203995, 62400, -19904, -109336, -143663, 69825, 109071, 136530, 118162, -28685, -40178, 34210, 213398, 411061, 327296, 91292, 11, 1754, -130848, -119869, -8749, -24616, -23037, 116321, 184354, 57555, 4423, -58902, -167308, -235203, -331962, -180458, -32158, -93903, -37068, -20560, 67699, 71675, 1646, -42560, 88036, 233340, 347373, 299247, 329160, 274652]
21210B74652p3567l6103n4432k543J34143r8824l3657j33714n5614P8028j13150
21199a14781k4220N1052O8748J45126J30483k2180j20555K6569K2512m7065O1818
21188A77507r4630j07584l4748J5089J02826K4170Q9523n2290O5060K9423M8055
21177B62401J44661J0111p5618m5234M6784N7389k6277j41219o130O4384J39733
21166D30985j2976R6545J8600P132K4528j39507o7312o7347j41815n2304L2892
21155A29421j19554l5217M2271J25540r408j89510o1990q1878r3042r316K0663
21144b82020n8944J94953L72209J1114j00678j7900j5400m487J18926k0500O8434
21133B65707J06913j12403m3735L3107o0105j4920J0326j0861R2298p3378j16547
$$ y = [274652, 201085, 164982, 110550, 108007, 242150, 143326, 109669, -24045, -79659, -1631, -114781, -139001, -87949, -19201, 125925, 256408, 234228, 113673, 140242, 162754, 115689, 177507, 82877, -24707, -59455, -44366, 58460, 82630, 172153, 119863, 184923, 214346, 262401, 407062, 417173, 341555, 296321, 343105, 400494, 374217, 232998, 226868, 291252, 430985, 418009, 514554, 533154, 540286, 564814, 425307, 357995, 290648, 148833, 96529, 129421, 9867, -25350, 16921, 142461, 133053, -56457, -118447, -200325, -293367, -302683, -282020, -340964, -146011, 226198, 237312, 136634, 118734, 103334, 98847, 217773, 197273, 265707, 372620, 260217, 216482, 249589, 189484, 174564, 184890, 174029, 266327, 192949, 76402]
21122G6402l2990R1404n1917l5478M9720J37230O1165l7566j43763m5812o9425
21111a030J7312M6025j9348l6443J17019R9538p0789N5371m0656k29909j73751
21100b36661L5866J13047N2697M873q8202J4775J55597J03660k8757Q4057M7392
21089B58344o9730p9623o62L799j06765j09571o5629J69780K04679l7579j4314
21078A52729k3265O8486M6291k3369j4292n4346K9554j27027j16310K8667L8092
21067E210m3580K95081n657r7276r5899j14382j66714m3281N8407J05970O3948
21056c8173O3082K41714N4524j38547p0274J7635J06682o0549r5195l7244n2686
21045i031O5327m199n0396M7938j2613r7945J21868J43760j27359n6080J5152
$$ y = [76402, 43412, 134816, 82899, 47421, 97141, 234371, 295536, 257970, 114207, 68395, -1030, 16282, 62307, 42959, 6516, 123535, 223073, 152284, 207655, 166999, -62910, -236661, -200795, -87748, -35051, -30178, -118380, -103605, 51992, 155652, 126895, 210952, 258344, 188614, 108991, 108329, 112128, 5363, -104208, -169837, -57, 204622, 167043, 152729, 129464, 197950, 244241, 220872, 206580, 152234, 181788, 54761, -61549, -32882, 5210, -38370, 256711, 251054, 153778, 57879, -56503, -223217, -266498, -208091, -102121, -38173, 24909, 266623, 321147, 182600, 112326, 129961, 236643, 176094, 80899, 43655, -9031, 56296, 52097, 1701, 49639, 37026, -60919, 60949, 204709, 77350, 21270, 36422]
21034C6422J73452P8330K894j16830q435M6927j69910L2575p6264O8624J08622
21023A76407J8070Q1040J1530n8522j5880P8364q250j404O6457q4751l8609M7601
21011B72053n584l251J8656J39363J152P7506Q2158l091J9400L5554m3415R857
20999F00358N6700j28008o5106M3540k1285j54152j36110J931J62778J06612r9782
20988C67476j9776K1692n5339j05838m0031O3074Q8621k3460Q674p9550o0272
20977A65271k5597J35610P8345o827J29137K1535r5575j65472r2618J09182J5017
20966B68008m3803L236j6099N8657j00328k3385L664k6254N3994N1336Q1648q8685
20954B21989J43973M6897o7492n298l2556M4197K927j02210r6301m7504m8683
$$ y = [36422, 209874, 288204, 291098, 174268, 165833, 212760, 42850, 75425, -839, 67785, 176407, 194477, 275517, 287047, 228525, 212645, 291009, 282759, 281355, 347812, 263061, 224452, 272053, 266469, 263218, 281874, 421237, 422389, 499895, 582053, 578962, 598362, 633916, 590501, 600358, 657058, 529050, 463944, 507484, 486199, 332047, 195937, 197868, 360646, 467258, 367476, 347700, 369392, 314053, 208215, 168184, 231258, 319879, 296419, 305093, 225543, 165271, 139674, 275284, 353629, 346802, 475939, 497474, 401899, 236427, 143809, 252991, 268008, 224205, 227441, 211342, 269999, 169671, 146286, 149950, 123696, 177690, 229026, 310674, 221989, 365962, 412859, 345367, 340069, 307513, 351710, 354637, 252427, 156126, 108622, 59939]
20943E9939O2163k3364J2841M0583O9789j5131J39179k0990j02349k12224n2872
20932d2436L4570J73239J27907r3934m0968Q3307J30338j8416m6136l589L5480
20921C39362L5148r4197p4793J15416j04253j08660q322J90796N1179j3595j01784
20910B26297P9887J45410J1616p259m8852j09396O4656j28947o5701P6530K0687
20899B64928M1365q2117j34206o9677n0656N1222M7004L9834p462K813J13428
20888B16476J49382K5677k5703L450n9277j24082j6799j33224j10250J0677K31862
20877A68189m484p7361j8110J03358J27314J41740Q4539P8508l8753j06998j7815
20866D40127k6871n8668M6740M3696l2399r6969q8125j11519N5753J33976R9425
$$ y = [59939, 122102, 98738, 111579, 152162, 221951, 206820, 345999, 325009, 222660, 10436, -42436, -7866, 165373, 293280, 199346, 158378, 241685, 372023, 353607, 307471, 303882, 339362, 374510, 280313, 205520, 320936, 216683, 108023, 99701, 290497, 341676, 328081, 226297, 306184, 451594, 463210, 455951, 407099, 297703, 362359, 233412, 167711, 244241, 264928, 306293, 224176, 89970, 20293, -30363, 20859, 67863, 107697, 100235, 103048, 216476, 365858, 391535, 365832, 369282, 310005, 185923, 169124, 35900, -74350, -63673, 168189, 163705, 86344, 68234, 171592, 298906, 440646, 525185, 603693, 564940, 457942, 440127, 413256, 354588, 401328, 445024, 412625, 315656, 227531, 116012, 171765, 305741, 405166]
20855D05166J03957L0260o4548j36539j20396l5917J28028Q3173j0819Q3875M6206
20844E12446O62j2612m4400Q8875K5084j88134o6353O6309J9180O5804N8672K5100
20832E50633m7086p436J1838J9181j50176q0329o4636P2666N7442J62839l4515
20821D90421p4543k3548J7045k0066L5087J18568j5907l7118P8748l5033L4610
20810E68264Q9718R4447m6422j39829q6373N2100N9403O1390J3099j25109n751
20799E34937Q3305N4294J46727L8555q026j42673r4980O5405K0279K14920J35902
20788A048645j10110R9566j6119j07615K3425O7317J935Q2790K04297k9751j29254
20777A135126m3955J36932J61912J27519L1563o4605k431O6415J93652J85888
$$ y = [405166, 509123, 539383, 474835, 338296, 217900, 181983, 310011, 393184, 382365, 466240, 512446, 513108, 500496, 456096, 544971, 570055, 381921, 315568, 381877, 401057, 466861, 525533, 550633, 503547, 496111, 507949, 527130, 376954, 296625, 231989, 304655, 362097, 524936, 490421, 415878, 392330, 409375, 389309, 424396, 542964, 527057, 489939, 568687, 533654, 568264, 657982, 752429, 706007, 566178, 479805, 531905, 591308, 652698, 665797, 540688, 534937, 618242, 672536, 819263, 857818, 849792, 707119, 612139, 677544, 697823, 912743, 1048645, 938535, 1038101, 1021982, 914367, 937792, 1005109, 1007044, 1089834, 1294131, 1264380, 1135126, 1091171, 1228103, 1390015, 1517534, 1549097, 1484492, 1482061, 1548476, 1742128, 1928016]
20767A928016J55005J90829K19493J28266J51681J72857L57807K16946K79493
20758C800393M00391N71425N30307M86688M05998N46730O55055J037432J163494
20749I597913J224487J440363J851443K369322K785907L215004L535724L843010
20741B9863173M260773L753803L063952K031351J273412M69440j91950m66776
20733D4057178m04786k8854L31256O00971P29359L67020l81252j353607k250491
20724D1666794k896039l630474l943487m033302l730090l207204k897268k459773
20716A4869157k045514j675346j442125j159126p91345p16676n45573n42050o28661
20707E322741n13607m57707m31741l10488j52400j06524r4169j31036j31462j10877
$$ y = [1928016, 2083021, 2273850, 2493343, 2621609, 2773290, 2946147, 3303954, 3520900, 3800393, 4200784, 4772209, 5302516, 5789204, 6195202, 6741932, 7396987, 8434419, 9597913, 10822400, 12262763, 14114206, 16483528, 19269435, 22484439, 26020163, 29863173, 34123946, 37877749, 40941701, 42973052, 44246464, 44715904, 44523954, 44057178, 43652392, 43623538, 43954794, 44555765, 45285124, 45652144, 45270892, 43917285, 41666794, 38770755, 35140281, 31196794, 27163492, 23433402, 20226198, 17328930, 14869157, 12823643, 11148297, 9706172, 8547046, 7755701, 7039025, 6493452, 5951402, 5322741, 4809134, 4351427, 3919686, 3609198, 3456798, 3350274, 3256105, 3125069, 2993607, 2882730]
20697B882730l40965k09524j61192k02718j46642j31382n3840q7592r5677j0874
20687A442324J93537R803q8504k52195p3165J14857J34009j05705k22467n5999
20677A096495K113r0895j74543M7708N3697Q6745J41498J2549j05075k25860K4302
20666H68734o9252k05693M9093n1308Q2873J37947M1630M4396J546n8210j40423
20655G01333j26355K8505N2098M9303L5637N6794o720m3732j38313p5250Q7355
20644F20655NJ5529p3696p2855J46541J99114L3266k3529l0840j18687j02521
20633E92982K1458j5263j07952M025p545M6730J25424J9798P9358J55727j3107
20622I01635q7677O8549M6398j90020r251J26140K5518N159j29727j6266K2114
$$ y = [2882730, 2541765, 2332241, 2171049, 1968331, 1821689, 1690307, 1636467, 1548875, 1453198, 1442324, 1635861, 1645664, 1557160, 1304965, 1231800, 1346657, 1480666, 1374961, 1152494, 1096495, 1098608, 1007713, 833170, 880878, 934575, 1021320, 1162818, 1175367, 1070292, 844432, 868734, 799482, 593789, 642882, 591574, 674447, 812394, 854024, 898420, 899966, 841756, 701333, 574978, 603483, 655581, 704884, 740521, 797315, 790595, 746863, 608550, 533300, 620655, 620660, 636189, 562493, 489638, 636179, 835293, 868559, 845030, 814190, 695503, 592982, 614440, 599177, 491225, 495250, 487705, 534435, 659859, 679657, 759015, 914742, 901635, 813958, 882507, 928905, 738885, 729634, 855774, 881292, 886451, 756724, 740458, 762572]
20611G62572Q0317q100L7454J04640J22046K9641l5484N9665L6135m684p3426
20600A110776k7647l7296O8316K49437J17494L2867J94235K36386J1807k928J57477
20589B110924J58574J75495J43746O7138J5520O0719K03439L41104L16216N00903
20579D093778M55316K64702M61723O48549P17897J074644J232437J594283J901884
20570A2445213K705665L731401M844289O001068O862895P177945O257461L798090
20562E3824027R15087k055219l888695m614498l928855k210887k01513J906667
20554C9746114L586536M813787M876875L591617Q68017k542453n456339p127055
20546D2357099p507034o842205n699973m489303l393863k506402j743525j332049
$$ y = [762572, 842889, 834789, 872243, 976883, 1098929, 1128570, 1093086, 1152751, 1188886, 1184202, 1110776, 1083129, 1045833, 1114149, 1363586, 1481080, 1513947, 1708182, 1944568, 1956375, 1953447, 2110924, 2269498, 2444993, 2588739, 2655877, 2671397, 2732116, 2935555, 3276659, 3592875, 4093778, 4549094, 4813796, 5275519, 5924068, 6641965, 7716609, 8949046, 10543329, 12445213, 15150878, 18882279, 23726568, 29727636, 36590531, 43768476, 50025937, 53824027, 54739114, 52683895, 48795200, 44180702, 40251847, 38040960, 37839447, 39746114, 43332650, 48146437, 53023312, 56614929, 57482946, 54940493, 49484154, 42357099, 34850065, 28007860, 22307887, 17818584, 14424721, 11918319, 10174794, 8842745]
20538H842745j271822r37613p91672o78995n08384m88991m16364k43197l77313
20529C128394k40469j08783j90138k70183l06253J5836r7831q5229j83404j44069
20519A517871r8332J4522r4791j34413N3722r0310r1802j85038N3716J97195P2970
20508A215310O8424n7798j71809j5094q4218L0092K9235o2575j68835o8674J1693
20497G25751Q0811J8541k6920j03276j64369J31313J23039J88153J91472o9092
20487A095423o5189j25582k2377l3489k7691n4567j31297m4448J38404M0576m3560
20476G26203M3194J25971N345k0361Q6753j14787k9575Q376j54927j79139j17015
20465C80038j7485M7234R9607k9735N1876K0176m27J5808J1079o7255P9249J4011
$$ y = [8842745, 7570923, 6633310, 5841638, 5162643, 4654259, 4165268, 3748904, 3505707, 3128394, 2887925, 2779142, 2589004, 2318821, 2012568, 2028404, 1930573, 1845344, 1661940, 1517871, 1419539, 1434061, 1339270, 1204857, 1258579, 1168269, 1076467, 891429, 945145, 1142340, 1215310, 1283734, 1225936, 1054127, 1039033, 954815, 984907, 1014142, 951567, 782732, 714058, 725751, 806562, 825103, 798183, 694907, 530538, 661851, 784890, 973043, 1164515, 1095423, 1030234, 904652, 882275, 848786, 821095, 766528, 635231, 590783, 729187, 769763, 726203, 769397, 895368, 900713, 880352, 967105, 852318, 822743, 831119, 676192, 497053, 380038, 362553, 409787, 509394, 479659, 531535, 551711, 551284, 567092, 578171, 510916, 590165, 604176]
20453F04176M5922O3672K9254q4660n5311j0500J1131j15780o8186l1783J6445
20442D04380J9887m3353N9722J43353R4334K5035r8206o4586m5083j17875O7936
20431D45544J11238L5781n9866R1832P0413l6355q5624J1259j5986n0822p8134
20420D39280J2955n1196J15981N9586Q9923j3289p8462j2338R4955l4272L9177
20409F62300J15901M0527p0945j38902o9413J20635J17372n273j2480j29078j42427
20398D88217p7807l0197l8902J1463N2513J09798L9242j23894m3220n3605J38989
20387D72597M2179n5863k5211O1976N3138m0542K4504O0213J3929N3263N9023
20376G19206K6685j65129m3730n2579Q0736n3240p2342j1011J43598R4100p120
$$ y = [604176, 650098, 713770, 743024, 658364, 603053, 592553, 603684, 487904, 419718, 387935, 404380, 424267, 380914, 440636, 583989, 678323, 703358, 605152, 540566, 495483, 377608, 445544, 556782, 592563, 532697, 624529, 694942, 658587, 572963, 584222, 568236, 517414, 439280, 452235, 401039, 517020, 576606, 666529, 653240, 574778, 562440, 657395, 623123, 662300, 778201, 818728, 747783, 608881, 539468, 660103, 777475, 772202, 759722, 630644, 488217, 410410, 380213, 341311, 352774, 405287, 515085, 554327, 430433, 387213, 333608, 472597, 514776, 458913, 433702, 495678, 548816, 508274, 532778, 592991, 606920, 660183, 719206, 745891, 580762, 537032, 484453, 565189, 511949, 439607, 428596, 572194, 666294, 659174]
20365F59174j3430n4232j3836R737o0344j00866J21647Q120m3055n5205O3195
20354E20905O9362R3268J42478O7087Q1506k7175m2421j22418q6666k554L248
20343F96620J41821N7569N6954N3522J3905n4736P0391j8492o6369j24982j03107
20332G23096J67823M3146q5669q807O7975j57560j68274J3390r656N969J15301
20321G06734P6348j68376r0992K4654R3257k3009J8774K6918p2157J20031j172
20310G11010p1702q4471L1839K7077L1112J85578K9013j25906j37059m9151r3829
20299D53511J3271M8794J03398Q9688L5591q74j16850J4559m1415P8541K0659
20288F98873j43078O359M8262K815o8687J0566J18197p2215o5720P1574J18369
$$ y = [659174, 645744, 591512, 577676, 587413, 527069, 426203, 547850, 555970, 512915, 457710, 520905, 590267, 683535, 826013, 893100, 974606, 947431, 905010, 782592, 695926, 693372, 696620, 838441, 896010, 952964, 1006486, 1020391, 965655, 1036046, 1017554, 951185, 826203, 723096, 890919, 934065, 848396, 839589, 907564, 750004, 581730, 595120, 585464, 591433, 706734, 783082, 614706, 523714, 548368, 641625, 618616, 637390, 664308, 592151, 712182, 711010, 639308, 554837, 586676, 613753, 644865, 830443, 859456, 733550, 596491, 547340, 453511, 466782, 515576, 618974, 708662, 744253, 743379, 626529, 641088, 599673, 678214, 698873, 555795, 562154, 610416, 613231, 544544, 555110, 673307, 601092, 535372, 606946, 725315]
20277G25315j7841p4725N6625n3772j14433l8325J284M0589J661L4205p0843l3733
20265D56007J4323k2646k0041Q3812Q9960j70322R5060Q5399J22853k6047q8968
20254F19390k04170N014J78125P8426M2167l679j47983j07812q5449M5443j1328
20243D08144n2567N2286Q7903l3108q6980M1257P3126j66985l2461J02072R1288
20232D83975O7466p61J17795k7954k2005n0595j77902M5084K0883l4266j00874
20221C20846k8910O7929N3788J60976j8238j1515Q14j58727j28881q514J53387
20210D02955P5408o0265N3903K8663j22976l6002J67733J34560L6709L5612j31175
20199E85125j27759l8352j8572M8990J8123Q72m6627P0647K1609J04727M9497
$$ y = [725315, 707474, 632749, 689374, 635602, 521169, 482844, 484128, 524717, 526378, 560583, 489740, 456007, 470330, 447684, 427643, 511455, 601415, 431093, 526153, 611552, 734405, 708358, 619390, 415220, 420234, 598359, 676785, 718952, 715273, 567290, 459478, 374029, 419472, 408144, 355577, 407863, 495766, 462658, 375678, 416935, 490061, 323076, 290615, 392687, 483975, 551441, 550680, 668475, 640521, 618516, 567921, 390019, 435103, 455986, 421720, 320846, 291936, 359865, 413653, 574629, 556391, 544876, 545690, 386963, 258082, 249568, 402955, 478363, 418098, 472001, 500664, 377688, 341686, 509419, 643979, 680688, 716300, 585125, 457366, 419014, 400442, 449432, 467555, 468427, 421800, 492447, 514056, 618783, 668280]
20188F68280P4103M1040J18971Q1157j96942j05054L8237N4892l9918o2159J06134
20177G78741J72291O128k28129j54937K7616J36702O9179n6832n8040j19803P818
20166E80734K0730N1961R6466N3728j7146o4797M9978m5742k2316Q0888J2607
20155G97091O758J65452n4742j4129j25557m731K24726N8850j89920r2784j00735
20144F70279n6301J44924K04757l46o5891j10232M2196o1764J39659k232M161
20133I09210n8030r8278Q7540J05595o0970K5239J43575M6757j13o1032l8723
20122A000770Q8633o2273n8300J25119j8185j44941p7575J39524N5403m1530n6561
20111I50084p1937j47477j8279Q9895l4618J07197J47376r3367J11028K04419
$$ y = [668280, 742383, 783423, 902394, 983551, 786609, 681555, 719792, 774684, 734766, 672607, 778741, 951032, 957160, 729031, 574094, 601710, 738412, 807591, 750759, 692719, 572916, 580734, 601464, 653425, 749891, 803619, 786473, 721676, 771654, 725912, 703596, 784484, 797091, 803849, 969301, 914559, 900430, 774873, 770142, 994868, 1053718, 863798, 771014, 670279, 613978, 758902, 963659, 963313, 897422, 787190, 829386, 767622, 907281, 905049, 909210, 851180, 752902, 840442, 946037, 885067, 910306, 1053881, 1100638, 1100525, 1039493, 1000770, 1089403, 1027130, 968830, 1093949, 1075764, 930823, 853248, 992772, 1048175, 1006645, 950084, 878147, 730670, 712391, 802286, 767668, 874865, 1022241, 928874, 1039902, 1244321]
20101A244321k4409p7261k0521q5981M155P7286J24401J15975K8103N0243j24761
20090A311551n1025j3753J694P4416N6788M2437M8222K07158K44120N8230R2294
20079B072132J20652q907K81652K53415K17377K16975J76286R8416L91920M97979
20069D317897N62792P10276O54290R63974J407216J704685K324464K734899L029614
20060A8410107L181254L345128L123730K690123J784235J226953P63576P00374
20052C5225480J118851J832488K496989K980492L202624L019348K249480R62015
20044E3087767n82831k262414k927146l204716l200972k807423k253849j360400
20036C4488016q60740q32833j077732j702545k271604k780527l140713l085190
$$ y = [1244321, 1219912, 1142651, 1122130, 1036149, 1040304, 1117590, 1241991, 1357966, 1386069, 1436312, 1311551, 1260526, 1246773, 1248467, 1322883, 1379671, 1422108, 1470330, 1677488, 1921608, 1979838, 2072132, 2192784, 2183877, 2465529, 2718944, 2936321, 3153296, 3329582, 3427998, 3819918, 4317897, 4880689, 5590965, 6245255, 7209229, 8616445, 10321130, 12645594, 15380493, 18410107, 21591361, 24936489, 28060219, 30750342, 32534577, 33761530, 34525106, 35225480, 36344331, 38176819, 40673808, 43654300, 46856924, 49876272, 52125752, 53087767, 52504936, 50242522, 47315376, 44110660, 40909688, 38102265, 35848416, 34488016, 33627276, 32794443, 31716711, 30014166, 27742562, 24962035, 21821322, 18736132]
20028A8736132l065711k672342k194049j751077j297736j110553q27520o85308
20020E131836n67278m89474l41462k14189j83584k87071r4218Q2521p8903l38974
20010B619204k78673L1558N8500j02127q7050n8693j32747o6763p1319j09998
20000A801892j2297j56698M4247q5259o3094j9506P6205R4362n6344j49941o1376
19989A412191N993J723K7336L4546n9896j46469j56955j07372J04763N4440k2053
19978A148247k6930j186k39101r6174J75303J96381J53010m2101o1384N2101M3004
19967A301170J02145j64677j64547P8020J91433M2582n5701j42449j36058m3395
19957A008523K9968K37769Q2249J1383r1570r1754r6798J8535m9661O6549J95234
$$ y = [18736132, 15670421, 12998079, 10804030, 9052953, 7755217, 6644664, 5817144, 5131836, 4564558, 4075084, 3733622, 3519433, 3335849, 3048778, 2954560, 3037081, 2958178, 2619204, 2340531, 2372089, 2430589, 2328462, 2241412, 2182719, 2049972, 1983209, 1911890, 1801892, 1789595, 1632897, 1677144, 1591885, 1528791, 1509285, 1585490, 1679852, 1623508, 1473567, 1412191, 1418184, 1419907, 1447243, 1481789, 1421893, 1275424, 1118469, 1011097, 1115860, 1170300, 1148247, 1121317, 1120131, 881030, 784856, 960159, 1156540, 1309550, 1267449, 1206065, 1258166, 1301170, 1403315, 1238638, 1074091, 1152111, 1343544, 1386126, 1330425, 1187976, 1051918, 1008523, 1038491, 1276260, 1358509, 1369892, 1278322, 1186568, 1089770, 1108305, 1058644, 1125193, 1320427]
19946A320427N5077K12071M7835j14075j83183K6317M2972j4385N8610J05736
19936A557402q5562k13615R6620K40866n3596j05760Q9137K765k42580j22908
19926A162769J9714K4884p418N3329o1630j6417o8406p2336Q6279N6672j3527
19915A163913l2567Q0690N2212L9473K7724o1420J0799L3281k467l5679q4470
19904A191489j37990J05292O7035j6289Q4331P3981Q2861N1602r4577L0843j22537
19893A316041M7263q825j04219M925J36764J02845N4630n4885r2221K5923J27292
19882A555533j51586j55210r0104L4802J05017p5930Q0826R6173m0207J29229
19872A488543N8361p4340j60627m6368K5688j16649m6900J32749J55016Q2387
$$ y = [1320427, 1375504, 1587575, 1635410, 1521335, 1338152, 1364469, 1407441, 1393056, 1451666, 1557402, 1471840, 1258225, 1354845, 1595711, 1542115, 1436355, 1525492, 1528257, 1285677, 1162769, 1182483, 1207367, 1199949, 1253278, 1191648, 1175231, 1106825, 1034489, 1120768, 1177440, 1163913, 1131346, 1212036, 1264248, 1303721, 1331445, 1270025, 1280824, 1314105, 1311638, 1275959, 1191489, 1053499, 1158791, 1225826, 1209537, 1293868, 1367849, 1450710, 1502312, 1407735, 1438578, 1316041, 1363304, 1354479, 1250260, 1255185, 1391949, 1494794, 1549424, 1494539, 1402318, 1428241, 1555533, 1403947, 1248737, 1158633, 1193435, 1298452, 1222522, 1303348, 1399521, 1359314, 1488543, 1546904, 1472564, 1311937, 1265569, 1291257, 1174608, 1127708, 1260457, 1415473, 1497860]
19862A497860P516N2145o9120j24612J6072K4897j05705l471N7272j9845O4938
19851A397947Q1130r9277r8755M5513J192m829K2813L3618j0938J6307L4450N981
19839A425152J1671j46515l5715J12146J31832N6105j60424J7682l4274j87261
19829A190399N8858J09825K32n1943J8217J20442M7036j9311m7314J11054K2441
19818A559936j04441j07863J19880R6546J3206p6024n1621N4229K1888m1874M4640
19807A528502m2591j26974j48189Q3099N2910R1443P707n8179J31669K9788j6160
19796A533025j04442J2466J4878r3982j15744L3941J97240K5250j45618o8696
19786A288318k4717M5595J36199K3293J34993O6914q9111Q475J54615r991j34500
$$ y = [1497860, 1505376, 1557521, 1488401, 1363789, 1379861, 1404758, 1299053, 1295582, 1352854, 1333009, 1397947, 1479077, 1379800, 1281045, 1326558, 1327750, 1322921, 1345734, 1379352, 1368414, 1384721, 1419171, 1425152, 1436823, 1290308, 1254593, 1366739, 1498571, 1554676, 1394252, 1411934, 1377660, 1190399, 1249257, 1359082, 1359314, 1307371, 1325588, 1446030, 1493066, 1473755, 1426441, 1537495, 1559936, 1455495, 1347632, 1467512, 1564058, 1577264, 1501240, 1449619, 1503848, 1525736, 1483862, 1528502, 1485911, 1358937, 1210748, 1293847, 1346757, 1438200, 1445907, 1387728, 1519397, 1549185, 1533025, 1428583, 1441049, 1455927, 1361945, 1246201, 1280142, 1477382, 1502632, 1357014, 1288318, 1263601, 1309196, 1445395, 1468688, 1603681, 1670595, 1581484, 1589959, 1744574, 1734583, 1600083]
19775A600083N33Q5334o5330O2727r691j68394j01498J12277J05939J6475R1520
19764A729975k1481n6235N8068j6538J26058O9150k10504n7081q419q074O0757
19753A665676j18105j5701J18764J45908P625m4087m8333l5133k3078j6388O4361
19742A701509q5361J6105M6318R8553J31654Q7205j07005l0276m1182q1451r2399
19731A643670J12841J67014j5966k6819o7687j26180q4295P703M4824J37227L2924
19720A825256o0938o9264J55717m0039r7431N8183k9517O987J14409R1654K6108
19709A981125q9115n5260O93j30277J31792J21774M19M4304p788K2884j00821
19698A919730j07944m4266L4486K8577M007n1360p3952O1704k7192o120j6152
$$ y = [1600083, 1600616, 1685950, 1620620, 1683347, 1673656, 1505262, 1403764, 1516041, 1621980, 1638455, 1729975, 1708494, 1652259, 1710327, 1693789, 1819847, 1888997, 1678493, 1621412, 1612993, 1604919, 1665676, 1547571, 1531870, 1650634, 1796542, 1804167, 1760080, 1711747, 1676614, 1653536, 1637148, 1701509, 1616148, 1632253, 1678571, 1777124, 1908778, 1995983, 1888978, 1858702, 1817520, 1736069, 1643670, 1756511, 1923525, 1907559, 1880740, 1813053, 1686873, 1602578, 1610281, 1655105, 1792332, 1825256, 1764318, 1695054, 1850771, 1810732, 1713301, 1771484, 1741967, 1748954, 1863363, 1955017, 1981125, 1892010, 1836750, 1837443, 1707166, 1838958, 1960732, 1961151, 2005455, 1997667, 2020551, 1919730, 1811786, 1767520, 1802006, 1830583, 1834590, 1783230, 1709278, 1770982, 1743790, 1737670, 1721518]
19687A721518R2289N9402j03103K3703J21077J15461K7380j09845O434K5933N5131
19676B035380l5124o3024l1082J01735m054J1975N5471K388l9730j24563k1003
19665A888369m4504K2178J36198N8454q7399j86829R3467O9159O67M8664m0886
19654A957538J20670m831q5741J52824J0606l0550n6598p7072J21214L2755k6516
19643B114299n33j42232K9906M4795j58203j31234j55767J66376K47420N1966
19633B066793O7181N9985O9564L6087m5624p4880r643q4431r6667j7248n6219
19622A914898r885J12575O2926l2559L7894J08089j4885L9414K0574j0101l3882
19611B195058j04959P4752L8188N4102M5739j17392o4255Q0186L056p989P5497
$$ y = [1721518, 1813807, 1873209, 1770106, 1793809, 1914886, 2030347, 2057727, 1947882, 1954316, 1980249, 2035380, 2000256, 1937232, 1906150, 2007885, 2003831, 2015806, 2071277, 2073665, 2033935, 1909372, 1888369, 1843865, 1866043, 2002241, 2060695, 1973296, 1786467, 1879934, 1949093, 1949760, 1998424, 1957538, 2078208, 2073377, 1987636, 2140460, 2151066, 2120516, 2063918, 1986846, 2108060, 2140815, 2114299, 2113766, 1971534, 2001440, 2046235, 1888032, 1756798, 1601031, 1767407, 2014827, 2066793, 2133974, 2193959, 2263523, 2299610, 2253986, 2179106, 2169463, 2085032, 1988365, 1971117, 1914898, 1905013, 2017588, 2080514, 2047955, 2085849, 2193938, 2179053, 2218467, 2239041, 2228940, 2195058, 2090099, 2164851, 2203039, 2257141, 2302880, 2185488, 2121233, 2201419, 2204475, 2196486, 2271983]
19600B271983j02701p2289p0643J01876J6814O0552M5430k5987P8526P7069j17811
19589B262819j11566k2021L8240j8614K5646j1962Q2917J11412j06544r0935p8332
19578B081060m8353l0310J56438J21042j21620j5504n8653p589L1374L7050m4758
19567B100177N7350J12902R2289J42172j37616j27485p6129k3869P7869J38565
19557B356225J12124K783J02680j1408J3849m2882n4015j7592q1215j3387r1228
19546B275934j70338J61243K40312M0879o3307l7282k3930q43r1554J1655M5957
19535B388726J48744j0302o3677m9721k91255r0220L899M8550K07907J46648k1111
19524B418188j19186n1779r8306R7023J22705J97696P0783n2269L2877Q2754J53048
$$ y = [2271983, 2169282, 2096993, 2026350, 2128226, 2145040, 2205592, 2251022, 2225035, 2303561, 2380630, 2262819, 2151253, 2129232, 2167472, 2148858, 2174504, 2162542, 2245459, 2356871, 2250327, 2159392, 2081060, 2032707, 2002397, 2158835, 2279877, 2158257, 2142753, 2084100, 2076511, 2107885, 2144935, 2100177, 2157527, 2270429, 2362718, 2504890, 2367274, 2239789, 2163660, 2139791, 2217660, 2356225, 2468349, 2471132, 2573812, 2562404, 2576253, 2533371, 2479356, 2461764, 2380549, 2367162, 2275934, 2105596, 2266839, 2507151, 2548030, 2484723, 2447441, 2423511, 2422668, 2331114, 2342769, 2388726, 2537470, 2527168, 2463491, 2413770, 2122515, 2032295, 2036194, 2084744, 2292651, 2439299, 2418188, 2299002, 2247223, 2148917, 2245940, 2368645, 2566341, 2637124, 2584855, 2617732, 2700486, 2853534]
19513B853534n6331j51307N7383q3854j12662N3971J91167P0964L8971M084j1113
19502B854807K3071j38479m7119L1492p1342q838P3454m0000p0128k7907q1617
19491B497394Q9793J06548L02K7563q5784j23945p5811N102n5706o3746R5950
19480B417660R2488j51367k3151J07042O1457O872K6255L6094o0082n0335j1669
19469B451264J048o148R9263m6934j08187L9083m8983o7265J08193q182l6907
19458B376245o3085J5347O1980J84454P6758n9892N9877o7140k68102p6842J46440
19447B386040J48669M5910J01561k02667j23986m1760J47863K6271M31j00944
19437B387388p7994J23918J46931M514r7739m741J571m3561j16679j7403M9062
$$ y = [2853534, 2797203, 2645896, 2703279, 2619425, 2506763, 2560734, 2751901, 2822865, 2861836, 2865920, 2854807, 2877878, 2739399, 2692280, 2723772, 2652430, 2643592, 2717046, 2677046, 2606918, 2579011, 2497394, 2587187, 2693735, 2694037, 2721600, 2635816, 2511871, 2436060, 2441162, 2385456, 2321710, 2417660, 2510148, 2358781, 2335630, 2442672, 2504129, 2511001, 2537256, 2573350, 2513268, 2462933, 2451264, 2452312, 2446164, 2545427, 2498493, 2390306, 2429389, 2380406, 2313141, 2421334, 2413152, 2376245, 2313160, 2328507, 2390487, 2574941, 2651699, 2591807, 2651684, 2584544, 2316442, 2239600, 2386040, 2534709, 2580619, 2682180, 2479513, 2355527, 2313767, 2461630, 2487901, 2488332, 2387388, 2309394, 2433312, 2580243, 2584757, 2487018, 2482277, 2483848, 2440287, 2323608, 2306205, 2355267]
19426B355267J7099K035k2108k4310M9771P7797K3130N630J1613j10238k9090
19415B356596j6733J8313j56616j57220J27404J95237R4045j5822j23589J0413
19405B332028R5650Q0822m528k4668j13995o9805l6140l4450j06242j4436K40176
19394B344412R0103l4166n2434R9314k2779r2019M5174r9373j09997N371P6899
19383B250505L7023J33569J7701n1349j67601L0172J11439J20387m5697k7717
19373B408432j47190n7624L5692M6546k7731R0713K2685j46571j4183K4889K3618
19362B259276l4923j14973J02413L0663o6703L6387n6673J31856K9133n1216J9871
19351B285111P6218p1059L4643N0802q4299q6539R7924J17885J1469j33278p1253
$$ y = [2355267, 2372366, 2374401, 2352293, 2327983, 2377754, 2455551, 2478681, 2484311, 2495924, 2385686, 2356596, 2339863, 2358176, 2201560, 2044340, 2171744, 2366981, 2461026, 2445204, 2321615, 2332028, 2427678, 2508500, 2503972, 2479304, 2365309, 2295504, 2259364, 2224914, 2118672, 2104236, 2344412, 2434515, 2400349, 2347915, 2447229, 2424450, 2332431, 2377605, 2278232, 2168235, 2173606, 2250505, 2287528, 2421097, 2438798, 2387449, 2219848, 2250020, 2361459, 2481846, 2436149, 2408432, 2261242, 2203618, 2239310, 2285856, 2258125, 2348838, 2371523, 2224952, 2210769, 2235658, 2259276, 2224353, 2109380, 2211793, 2242456, 2175753, 2212140, 2155467, 2287323, 2316456, 2265240, 2285111, 2361329, 2290270, 2324913, 2375715, 2291416, 2204877, 2302801, 2420686, 2432155, 2298877, 2227624]
19340B227624j8695O5555N7215J26659j78799j68914J26518N9716j07106p1232
19330B118541O7276o0008j98775L583J09808R2332K9549R6805J3194k648j13411
19319B156246K8632o8895n8538n7282R3210K1702r928o8243P4828Q7962J29257
19308B328951o709j06138o1962L1852j28900j55396N1636k293J38576L0755q5404
19297B034968M1193J16721P4219p632j21376k29829r4297L0577J61370k8864l8745
19286A938305q989k57j4805N4673N8370m7798l8628q2263j24785L6913m2817M9816
19274A777735N3265q0094J8429n6205J21854Q3502m3968j17743j13334P3071K8431
19263A744943M0794O5317M9761J07373j1370j07245j50023m7988R9968M6386n3416
$$ y = [2227624, 2208929, 2274484, 2331699, 2458358, 2279559, 2110645, 2237163, 2296879, 2189773, 2118541, 2185817, 2125809, 1927034, 1930617, 2040425, 2132757, 2162306, 2259111, 2272305, 2269657, 2156246, 2184878, 2115983, 2057445, 2000163, 2093373, 2115075, 2105147, 2036904, 2111732, 2199694, 2328951, 2322242, 2216104, 2154142, 2185994, 2057094, 1901698, 1953334, 1951041, 2089617, 2120372, 2034968, 2076161, 2192882, 2267101, 2259469, 2138093, 1908264, 1813967, 1844544, 2005914, 1977050, 1938305, 1929316, 1929059, 1914254, 1968927, 2027297, 1979499, 1940871, 1858608, 1733823, 1770736, 1727919, 1777735, 1831000, 1750906, 1769335, 1713130, 1834984, 1918486, 1874518, 1756775, 1643441, 1716512, 1744943, 1785737, 1851054, 1900815, 2008188, 1996818, 1889573, 1739550, 1691562, 1791530, 1837916, 1784500]
19252A784500j6163N9076J41247K0364p2512o6052q7149J3209J008l3061j76852
19241A567615M9316J28884Q6179L0162l7038K2206O1524M236p5896Q141R2114
19230A937443K6156l021p6706J9880Q4927M764k9500r4293j18812k3828M7131
19219A774141M7173J3739k6745p4665L07j3422O1454j6423J3159j9724q1325M9083
19207A726752Q7149j60059q5455J24116R2430j03009n9951r6876J32749j4746
19197A643100q0845j15773m9943J31186N7583j3295P4642L2828N4472M3737l4550
19186A743142o0220L726N1982j18127k3963J5195o9387m6259p4241j02676J340
19175A320512N150J32450N9251Q5736K947k0117m6171L8802j13252j13979m8224
$$ y = [1784500, 1768337, 1827413, 1968660, 1989024, 1916512, 1850460, 1763311, 1776520, 1777528, 1744467, 1567615, 1616931, 1745815, 1831994, 1862156, 1825118, 1847324, 1908848, 1913084, 1837188, 1845329, 1937443, 1963599, 1960578, 1883872, 1903752, 1988679, 1993443, 1963943, 1869650, 1750838, 1727010, 1774141, 1821314, 1835053, 1808308, 1733643, 1733950, 1720528, 1781982, 1765559, 1778718, 1758994, 1677669, 1726752, 1813901, 1653842, 1568387, 1692503, 1784933, 1681924, 1621973, 1525097, 1657846, 1643100, 1562255, 1446482, 1396539, 1527725, 1585308, 1572013, 1646655, 1679483, 1733955, 1777692, 1743142, 1682922, 1686648, 1738630, 1620503, 1596540, 1611735, 1542348, 1496089, 1421848, 1319172, 1320512, 1325662, 1458112, 1517363, 1603099, 1606046, 1585929, 1539758, 1578560, 1465308, 1351329, 1303105]
19164A303105J40951J88139q805q5807J9613N0260n0345J00259P5272l8846j63429
19153A530367l6792j0562k9031k2298q9175Q2734m4814N085J24797l1487J6127
19142A494951J04101M7831k3784k3078k1566L9841Q4103n5187p506M8968K855
19131A691529j37500K327J51780m7781q7496M1352Q7195m9174j9299M8727l1326
19120A650334R5506K2034k8604p1536o6270j18020P0000L9144r1673J08849J03767
19109A713531j19864j13735o5741L8968j63482O967p1407q1117J00678L5672P4455
19098A354925J01618k9744r2389Q9748M6459O2368k0437M1246l0439n8987r9769
19087A364599j02725J8454P9909p7762j11514J5669l800K3500J59296j25867j39148
$$ y = [1303105, 1444056, 1632195, 1623390, 1537583, 1557196, 1607456, 1557111, 1657370, 1732642, 1693796, 1530367, 1493575, 1483013, 1453982, 1431684, 1342509, 1425243, 1380429, 1385514, 1510311, 1478824, 1494951, 1599052, 1646883, 1623099, 1600021, 1578455, 1618296, 1702399, 1647212, 1639706, 1688674, 1691529, 1554029, 1556356, 1708136, 1660355, 1572859, 1614211, 1701406, 1652232, 1632933, 1681660, 1650334, 1745840, 1767874, 1739270, 1667734, 1601464, 1483444, 1553444, 1592588, 1500915, 1609764, 1713531, 1593667, 1479932, 1414191, 1453159, 1289677, 1296644, 1225237, 1144120, 1244798, 1280470, 1354925, 1456543, 1426799, 1334410, 1424158, 1470617, 1532985, 1512548, 1553794, 1523355, 1464368, 1364599, 1261874, 1280328, 1360237, 1282475, 1170961, 1186630, 1182830, 1206330, 1365626, 1239759, 1100611]
19076A100611J4617N7776j5520L8264J15233j08l8728j92751L095K8624J831o7634
19064A045310P9635Q9665Q4462q9631j7908n9383j32802N4970O5625J3028K6400
19053A159371R2780P8712q0364n9978p9549j9063k6884j08529L1262M7602N1890
19042A087250R4258J6342j00264o1976K5016J9241l739J7078L4956M4154m4786
19031A127530r2099n311O258o9368m3547O0095J42707M0156r8492N689K4220m5246
19019A052592k7002n5088m475j9570J47757R6894K7507o1054k4059M1103o7205
19008A107400j78677l4852J26601N6386O690P3797L9216j0180j3065j01815k7266
18997A044235J47807j0942j29066k37235l2944K08015o8620q9968p7951J30492
$$ y = [1100611, 1115228, 1173004, 1157484, 1195748, 1310981, 1310873, 1272145, 1079394, 1082489, 1111113, 1112944, 1045310, 1124945, 1214610, 1299072, 1209441, 1191533, 1132150, 999348, 1054318, 1119943, 1132971, 1159371, 1252151, 1330863, 1250499, 1190521, 1110972, 1091909, 1065025, 956496, 987758, 1035360, 1087250, 1181508, 1197850, 1097586, 1035610, 1060626, 1079867, 1076128, 1093206, 1128162, 1172316, 1127530, 1035431, 1030120, 1036378, 967010, 923463, 983558, 1126265, 1166421, 1067929, 1073618, 1097838, 1052592, 1025590, 970502, 966027, 946457, 1094214, 1191108, 1218615, 1157561, 1133502, 1174605, 1107400, 928723, 893871, 1020472, 1076858, 1083548, 1157345, 1196561, 1186381, 1173316, 1071501, 1044235, 1192042, 1181100, 1052034, 814799, 781855, 989870, 921250, 831282, 753331, 883823]
18987H83823J56200O5315j46284o8993r3590J02724J23602q4469n8364J84850
18977A064814L6792j0990j3978O396R6633j0065j53971k5619K824o9493j9452
18966I03891J22171R914J0490O1848j09604q3321L7758J6273Q9785n890o8352
18955I84963m6464n8111J63269J2785j30049j9820J4605k52r2137p3841K0534
18944G75482M0097J09474K8072j42545j9254J1272j5945o483n2376j5759J4525
18933G26560R366R9539n3209P9927K8963p7739k6742J48587Q3860j1360K0360
18922A028112O790j82936j82053Q0453j9623r868m9123o7934J24735m0395q6980
18911F01178q734J69172R1571L374l7948L518J06857Q9830j62008j91167O2711
$$ y = [883823, 1040023, 1105338, 959054, 890061, 796471, 899195, 1022797, 938328, 879964, 1064814, 1101606, 1090616, 1076638, 1083034, 1179667, 1169602, 1015631, 990012, 992836, 923343, 903891, 1026062, 1035976, 1046466, 1108314, 998710, 915389, 953147, 969420, 1059205, 1053315, 984963, 938499, 880388, 1043657, 1056442, 926393, 906573, 921178, 920926, 828789, 754948, 775482, 815579, 925053, 953125, 810580, 791326, 802598, 786653, 780170, 727794, 712035, 726560, 735926, 835465, 782256, 862183, 891146, 813407, 786665, 935252, 1019112, 1007752, 1028112, 1034902, 851966, 669913, 750366, 730743, 720875, 671752, 603818, 728553, 688158, 601178, 592444, 761616, 853187, 856561, 818613, 822131, 928988, 1018818, 856810, 665643, 728354]
18900G28354O1294J6684N3728O999j5768J8480j8326J39363N7645j14867j46220
18889G87366j08314O0949M0900j01109o7729P5556j7229J9572O133o4218J5927
18878F47804Q9706K8130J509k1035J0221m8918J5392J03604k1671J3855J32083
18867I50680j38457k9023M7971j69215j03650O0088R7882R5905J68131p2481k76200
18856F31631j3868Q179o7923R8119K5949n6976J00097R7647j98218l4398J02147
18845F92386Q9018p747j26319q4644K2804J9759p044L1330m5987M5845m5773p2084
18833E11544j2381K4166k2650N4043J00279k1735j312L871m2626j11578R450J56522
18821F47593J9241K5109O7101j30431K7508J43338j6846j37443Q634j2446K2987
$$ y = [728354, 789648, 806332, 860060, 867059, 851291, 869771, 851445, 990808, 1048453, 933586, 787366, 679052, 740001, 780901, 679792, 612063, 687619, 670390, 689962, 696095, 631877, 647804, 737510, 765640, 767149, 746114, 756335, 707417, 722809, 826413, 804742, 818597, 950680, 812223, 783200, 831171, 661956, 558306, 618394, 716276, 812181, 980312, 907831, 631631, 617763, 625942, 558019, 656138, 682087, 625111, 725208, 822855, 624637, 590239, 692386, 781404, 773657, 647338, 562694, 585498, 605257, 598213, 629543, 583556, 629401, 583628, 511544, 499163, 523329, 500679, 554722, 655001, 633266, 631954, 635825, 593199, 481621, 491071, 647593, 666834, 691943, 759044, 628613, 656121, 799459, 782613, 645170, 653804, 641358, 664345]
18810F64345K41257P2070R093j69132j36535q6348j0861l2209j27859k7204M9877
18799D46494L5533J5397R5152m907j71168l4735P971j9080K911R6806R3267J23169
18787F86810L0344k6136o8712L522k4764J1977Q0176J9502q0489j0988l2535o2679
18775E26028K7349M1791L5412L4858P5038O4310J08086L39583O21424M62255l66946
18764A969188n72401l72907r5726j28574o5132m8045r1933Q8950P1271o1958j36456
18753E56277l8066P3583l6695j08676J7251J98386n1520j85672L2083J02233P7639
18742F36823l3412K4921J54493J23591Q646j28424l2658O7946j42633Q1353l334
18731G57312q2625K4621j10582p0218j33299j30242k0064J66283j12770J29648
$$ y = [664345, 905602, 977672, 986765, 817633, 681098, 594750, 583889, 551680, 423821, 396617, 446494, 482027, 497424, 592576, 587669, 416501, 381766, 389737, 370657, 373568, 470374, 563641, 686810, 717154, 691018, 622306, 625828, 601064, 613041, 693217, 712719, 632230, 621242, 588707, 526028, 553377, 595168, 630580, 665438, 740476, 804786, 912872, 1252455, 1873879, 2336134, 1969188, 1396787, 1023880, 928154, 799580, 734448, 686403, 594470, 683420, 754691, 692733, 556277, 518211, 591794, 555099, 446423, 463674, 662060, 610540, 424868, 456951, 559184, 636823, 603411, 628332, 782825, 906416, 915062, 786638, 753980, 821926, 679293, 760646, 757312, 674687, 699308, 588726, 518508, 385209, 254967, 234903, 401186, 288416, 418064]
18721D18064K22471O7842j14470p1541m0177O1492M2169r842P0648J07858r8084
18710F56430j33967J3490k7959o3768N7473J46196n486j07345n2154k5512J2965
18699D70363j0214K3971m0709M4762J57784m7829k39171P8604J11797k6474J4108
18688E36992l5603l1661j87342p6741O2314O7238J50701j8359j33092k665L4701
18677C66483j4404J0284N047K281J09585J02684J77297K5703k36091r5568R5777
18666E49078m7092j52859P0321k8672k6810P3383J12193j60746j13060J35402
18656D11138M3621q303J57406n4223q5578k9376j2032p6508K815o943J56538q8989
18644D09566m5730J5888O2242n3615k3624J82541J13258l0699j17388q1929J0983
$$ y = [418064, 640535, 708377, 593907, 522366, 482189, 543681, 585850, 576008, 646656, 754514, 656430, 522463, 535953, 507994, 444226, 501699, 647895, 642409, 535064, 482910, 457398, 470363, 460149, 484120, 443411, 488173, 645957, 598128, 358957, 437561, 549358, 522884, 536992, 501389, 469728, 282386, 205645, 267959, 335197, 485898, 467539, 334447, 331782, 366483, 352079, 362363, 367410, 369691, 479276, 581960, 759257, 784960, 548869, 453301, 549078, 501986, 349127, 419448, 390776, 363966, 437349, 549542, 388796, 275736, 411138, 454759, 446456, 603862, 549639, 464061, 434685, 422653, 346145, 348960, 342017, 498555, 409566, 363836, 379724, 441966, 388351, 364727, 547268, 660526, 629827, 512439, 430510, 441493]
18633D41493O7214j02872L8248j1094N6033r1186o9552M2466K7290j6454k6740
18622C54846o2629n8862J1183P0058O3319J2087q2176R3787p8895j5097M2792
18611C50413L2848N8259O9795q3855J0588r9490r0552N3898J77004J34875r9301
18600E14482q2260O4702P8709p6080m3335q7284k2457J16834j25106m5016N2144
18589C45333M4066m0535j03906l9007j30573o5922J50315M1956l76J00966l3579
18578B68738k4002J35883J5402L203J64545O5936k6542j81143o1039q6121p4884
18567A99976L9061J55059Q0109M436N9969j29424j16571k2732m0635q1455J11578
18556B59371J9420L9907r5984L3375o6041J9892k6965l4874J7924K6083J41617
$$ y = [441493, 508707, 405835, 444083, 432989, 489022, 397836, 328284, 370750, 398040, 381586, 354846, 292217, 233355, 244538, 314596, 377915, 390002, 307826, 401613, 322718, 307621, 350413, 383261, 441520, 511315, 427460, 438048, 338558, 248006, 301904, 478908, 613783, 514482, 432222, 496924, 575633, 499553, 456218, 368934, 346477, 463311, 338205, 293189, 345333, 389399, 348864, 244958, 205951, 75378, 9456, 159771, 201727, 201351, 302317, 268738, 244736, 380619, 396021, 399224, 563769, 629705, 603163, 422020, 360981, 274860, 199976, 239037, 394096, 474205, 478641, 538610, 409186, 292615, 269883, 229248, 147793, 259371, 278791, 318698, 222714, 256089, 190048, 209940, 182975, 148101, 166025, 192108, 333725]
18545C33725k5556q0251j18440k3112L1742N5357Q0268R2963J07850P24o2239
18534C93031l9165N008P6610J34410j41043j56679l5703l9170N6238o0626J6552
18523B09463J51190R2333o6881k07644j4707J36379l934k5702M4242R5092n163
18512D04668j36047j15945J41221J08680o905k5113j413K7423l4395n2548q063
18501C01563J1624J00542q921N8366L0813M1575P0703l4481q9730r7513J7880
18490D02421r768j07696R9085O4792N467R881j02377o1934J6555K084L9867j14314
18478B44063n8955P4250O8116J7712P3310n2109j10300p2618J28803J14124o5657
18467C60739j22511p1524j28574K4924J22107J26444R0972K2954m3550J9453j11418
$$ y = [333725, 308169, 227918, 109478, 86366, 118108, 173465, 253733, 346696, 454546, 455270, 393031, 353866, 358874, 435484, 569894, 428851, 272172, 236469, 197299, 253537, 192911, 209463, 360653, 452986, 386105, 178461, 163754, 300133, 296199, 270497, 314739, 409831, 404668, 268621, 152676, 293897, 402577, 395672, 370559, 369146, 396569, 362174, 309626, 301563, 313187, 413729, 404808, 463174, 493987, 535562, 606265, 571784, 482054, 384541, 402421, 392653, 284957, 384042, 448834, 454301, 464182, 361805, 299871, 316426, 318510, 358377, 244063, 185108, 259358, 327474, 345186, 418496, 366387, 256087, 183469, 312272, 426396, 360739, 238228, 166704, 38130, 63054, 185161, 311605, 402577, 425531, 381981, 401434, 290016]
18456B90016o2829M3577J15088J20896M034l7001j27287L854L5435J7153p1423
18445C31513j12971J2633k2891l7395L7065K9724j18J79193m2617l1088r9976
18434B43072J1550l014M1008q335J8208J05093j38917k6662K5814l4369K6292
18423B59740J19345m8083o1069j06666l5404R4111K6243J38441Q5328k7020j08952
18412C36014q5296j05187j05289O0952K12352M3870L9359R0108j98980K4422q0078
18401B32247j11461R0158L2775j7584M5919j20167j50883n944J13456Q1104P7550
18390B67170N1501O222N2111L9193q7503R4643J82892j2976j30586n3709p5752
18379C33206j38194K9840j03574J4734J53505J59522J3444j98661j67285J710
$$ y = [290016, 227187, 270764, 385852, 506748, 510782, 473781, 346494, 350348, 385783, 402936, 331513, 218542, 231175, 208284, 170889, 207954, 237678, 237560, 416753, 374136, 343048, 243072, 254622, 251608, 292616, 284281, 302489, 407582, 268665, 242003, 267817, 233448, 259740, 379085, 331002, 269933, 163267, 127863, 221974, 248217, 386658, 471986, 444966, 336014, 250718, 145531, 40242, 101194, 313546, 357416, 396775, 486883, 287903, 312325, 232247, 120786, 210944, 243719, 226135, 272054, 151887, 1004, -4940, 108516, 189620, 267170, 318671, 324893, 377004, 416197, 328694, 423337, 606229, 593253, 462667, 408958, 333206, 195012, 224852, 121278, 136012, 289517, 449039, 462483, 263822, 96537, 98247]
18369I8247R4003J1683m7998J22465J4848J3475J19625R8050p1915o871j04702
18358C40910l4777N8162k7602K8106K2301o0615k8740q4942k6728o5369j03554
18347A7152L1529M0315K10047N6098n036j56921o5769R4300o412M6059j5401o987
18335B38974O115k9548O0044J3526p0049n1935k9190J20328J38810J65166o4040
18324D98201p4105l3980l1974M3622j75159r3827K2165K18720L4695k39519j57142
18313A1697J78003O1782j49675J915P6093K3091K563k2305M3432O250j4209J3093
18301B31730j3963K23166J32525k32084j71084J2348P1401j04693q6183l0084
18291C3079k5561J9385M7242R1171Q0472P9979l8773j17582K5940J85304P7049
$$ y = [98247, 192250, 203933, 155935, 278400, 293248, 306723, 426348, 524398, 452483, 445612, 340910, 306133, 364295, 336693, 364799, 387100, 326485, 297745, 212803, 186075, 120706, 17152, 48681, 88996, 299043, 355141, 350105, 193184, 127415, 221715, 215303, 261362, 245961, 238974, 245089, 215541, 275585, 289111, 219062, 167127, 137937, 258265, 397075, 562241, 498201, 424096, 390116, 358142, 401764, 226605, 132778, 154943, 373663, 408358, 168839, 11697, 189700, 251482, 101807, 103722, 179815, 202906, 205469, 183164, 226596, 232846, 218637, 231730, 217767, 440933, 573458, 341374, 170290, 182638, 254039, 149346, 63163, 33079, 7518, 26903, 74145, 165316, 245788, 325767, 286994, 169412, 195352, 380656, 457705]
18280D57705k02254o4886o2458j97946P8741m662J16088j10947j8383J09K99j0555
18268a9149k6635J224p9003N3310J20792R0088l8630K3301l767J0058l914L8553
18256A66228O2287K1146j62953o2904n0372l2435L2911J15246M6845J49710P7244
18245C62953K4510L7870M6861j32714j51616N9383M6458M4838M2521j3383N4184
18234D21865O2580N4009K944r7417j16428J72333J49029q306p1923j00169q093
18223D60424q8087p4774n9656j3621m3467n8873M2210R0773j6742R7538K03558
18212E39283J29237j73811j69982L9542L2128o4045p4210J15850q5507K630M1997
18201C33112m7765j16690p1000N1830R5857r612J6396M9498L8112P8261M8902
$$ y = [457705, 255451, 190565, 128107, -69839, 8902, 4240, 120328, 9381, -9002, -8893, -8594, -19149, -45784, -44560, -123563, -70253, 50539, 140627, 101997, 125298, 121531, 131589, 127675, 166228, 228515, 249661, 86708, 23804, -26568, -59003, -26092, 89154, 135999, 285709, 362953, 387463, 425333, 472194, 339480, 187864, 247247, 293705, 338543, 381064, 367681, 421865, 484445, 538454, 541398, 443981, 327553, 499886, 648915, 640609, 568686, 468517, 460424, 372337, 297563, 237907, 224286, 180819, 121946, 164156, 254929, 238187, 335725, 539283, 668520, 494709, 324727, 364269, 396397, 332352, 258142, 373992, 288485, 291115, 333112, 285347, 168657, 97657, 149487, 245344, 235732, 252128, 301626, 339738, 417999, 466901]
18190D66901m3104P7465J854n0165N2604l8384j09518l4188j929Q7235J18736
18179E27507k4646l9501q481j61251J8792p2477p453o8337Q7108O529o899L0237
18167B81128R7378P4548R4868J29309j0902Q1283L3204j49018j54882j567J5261
18156D90610j28058O850l4647l9677L2878M4489J65722J73486Q7097J4268J20523
18145I33541N916o976N8711N8479k7141J494O7568Q8269J70531J65991J12843
18134A629226m1911J3652K17574K15815K28716K39949J99207N6143J00687K85148
18124C144206L24630O49592O04648O26170P68309J211516J775922K158605K814341
18115A4077939M124529O019933R544582J6831173L2575996O4583824J13152704
$$ y = [466901, 423797, 501262, 503116, 452951, 505555, 467171, 357653, 323465, 321536, 408771, 527507, 502861, 463360, 454879, 293628, 312420, 239943, 232490, 164153, 251261, 257790, 250891, 281128, 378506, 453054, 547922, 677231, 666329, 747612, 780816, 631798, 476916, 475349, 490610, 362552, 369402, 334755, 295078, 327956, 372445, 538167, 711653, 798750, 813018, 933541, 939457, 932481, 991192, 1049671, 1022530, 1024024, 1091592, 1179861, 1350392, 1516383, 1629226, 1587315, 1600967, 1818541, 2034356, 2263072, 2503021, 2702228, 2758371, 2859058, 3144206, 3468836, 4118428, 4723076, 5349246, 6117555, 7329071, 9104993, 11263598, 14077939, 18202468, 24222401, 33766983, 50598156, 83174152, 147757976, 260910680]
18108B60910680R6269541l5673505j08592292r3409948m8283826k4677714j3941190
18101C2601746q766090n572936l826414k731778j826201j554371j287848j016840
18093F019268o96525p11998n19780n93922n09136m06092m45185k35888o2390p7281
18083A761071O546j0371r8297j28345j48359p6579j47231q6309L931k7832j53360
18072H94865k13260q9824K7827K9638R2464m8561j0375J66009J47861m2402j18531
18061H35711p6606m1381r152m5153k80413j09389J16086j32000j1260O9134n0162
18050B65415o5246m0116N3362N8395m5658k6678M8556J7757k661n2052Q6145M7302
18038C44521M9409j8848j45816q0687m9689n726P5488l2855k2233J05508M3038
$$ y = [260910680, 357180221, 321506716, 212914424, 119504476, 71220650, 46542936, 32601746, 23835656, 18262720, 14436306, 11704528, 9878327, 8323956, 7036108, 6019268, 5322743, 4610745, 4090965, 3497043, 2987907, 2581815, 2136630, 1900742, 1838352, 1761071, 1767617, 1757246, 1658949, 1530604, 1382245, 1305666, 1158435, 1072126, 1076057, 1048225, 894865, 681605, 591781, 619608, 649246, 741710, 693149, 682774, 848783, 996644, 954242, 835711, 759105, 717724, 708572, 663419, 383006, 273617, 389703, 257703, 246443, 315577, 265415, 200169, 160053, 213415, 271810, 226152, 199474, 248030, 265787, 263126, 211074, 297219, 344521, 393930, 375082, 229266, 148579, 98890, 93164, 168652, 135797, 113564, 219072, 262110]
18027B62110R2806k5292M4452J19877n6923j92454j18845k5745O1328J12255M2597
18016C16166J33575j26235j37856o3502O2293J17296j72726j36287m8948J19770
18006F3546J77555J04653m2029j20816J3169K4943j09160m8978J35929P8429J7582
17995B94823P6868j04399k5918l114N418o0426j12168n0543K0566Q4856r019J51164
17983B68108K7085r7613J11764J28477j73884j84618l0365Q1277J55473P7580
17973C63284o4602m6029j4336j09708p8971N6463M0038Q6228R8106n1248k20009
17962E9216O851k4374j7386m6748N9335J53196j2259m4466k0931J39864J09888
17951C62186m6726P2706r0086j0289o1136J6187j4868j29662Q257j9420K4602
$$ y = [262110, 354916, 329624, 374076, 493953, 437030, 244576, 125731, 99986, 161314, 273569, 316166, 449741, 323506, 185650, 122148, 184441, 301737, 129011, -7276, -56224, 63546, 241101, 345754, 303725, 182909, 196078, 221021, 111861, 62883, 198812, 277241, 294823, 371691, 267292, 241374, 238260, 243678, 183252, 71084, 20541, 41107, 125963, 116944, 268108, 295193, 197580, 309344, 437821, 263937, 79319, 48954, 130231, 285704, 363284, 298682, 252653, 238317, 128609, 49638, 106101, 146139, 232367, 330473, 279225, 59216, 66067, 41693, 24307, -22441, 36894, 190090, 177831, 133365, 112434, 252298, 362186, 315460, 388166, 298080, 287791, 226655, 242842, 227974, 98312, 106569, 87149, 111751]
17940A11751r4503M5724J2012R8697p6996R374k8530q2966n7689M0397J18316
17929I5587J75422L8608J78473j01709p4910j08502o4772J23516n51m2756j1744
17918B06662j82574j81019J00774M4099M1649M4092J0340R473l1965k3108N2935
17907I1358J01125L0270j94365J17506l5358L6920J00822r811K2781n3237l6218
17896A71793o6926o6021j2651k302o1706l2274O5123l3701J17004J43573M4278
17885B66190J4930j15814j23347j62034j47182k0385J00928J54966J36451L8601
17875A43304P525j76639p7919R0253P9347j20075m8531J09200O5672j43353j40870
17864b12086P4575O1583J34663J29022J03674j26044J8308J7695j83862m9110
$$ y = [111751, 17248, 62972, 74984, 173681, 96685, 106059, 77529, -5437, -63126, -22729, 95587, 271009, 309617, 488090, 386381, 311471, 202969, 138197, 261713, 261162, 218406, 206662, 24088, -156931, -56157, -12058, 29591, 73683, 84023, 93496, 61531, 38423, 91358, 192483, 222753, 28388, 145894, 110536, 147456, 248278, 238467, 261248, 208011, 171793, 104867, 38846, 26195, 23893, -37813, -70087, -4964, -38665, 78339, 221912, 266190, 281120, 165306, 41959, -120075, -267257, -287642, -186714, -31748, 104703, 143304, 150829, -25810, -103729, -13476, 65871, -54204, -102735, 6465, 72137, -71216, -212086, -137511, -75928, 58735, 187757, 291431, 165387, 183695, 201390, 17528, -31582]
17854c1582Q0592r967N8215J8771K7300J3155K558J30303K1681m5472J03494j09316
17842B59732p5996l3651K6861J94722q0102j1198M7576j15272j13286K4396R7244
17831B21026R0210j24758j62598j36826M0161K19546Q9785j4062l8662j26881
17821E6941j83843K0868Q2888O1670O6171O8888M828K245l1548j15208J74915
17810B08815l9808j3996j5687L3223J27172M894n1573J14933P9707j91236j06080
17799A50364j12175j02797l450J14316L0079N9186j26864r2037j01154p5874K41966
17788a8440J98232M2877q9810l8579m1955P8528J81046q2749j03203o4081Q1298
17777A43164K2660N4261l7712r0464n8843o4395R7527Q2919L0066K141j37283
$$ y = [-31582, 49010, 39043, 97258, 116029, 143329, 156484, 159042, 289345, 311026, 265554, 369048, 259732, 183736, 150085, 176946, 371668, 291566, 280368, 327944, 212672, 99386, 123782, 221026, 311236, 186478, 23880, -112946, -72785, 146761, 236546, 222484, 183822, 56941, -126902, -106034, -23146, 38524, 104695, 173583, 178411, 180656, 149108, 33900, 208815, 169007, 155011, 139324, 172547, 299719, 304613, 253040, 367973, 447680, 256444, 150364, 38189, -64608, -68058, 46258, 76337, 135523, 8659, -83378, -184532, -260406, -18440, 179792, 222669, 132859, 94280, 52325, 130853, 311899, 229150, 125947, 61866, 143164, 165824, 220085, 182373, 91909, 33066, -31329, 66198, 149117, 179183, 181324, 44041]
17766D4041j41430M0202L8134J59911J50471m6229j13913k19155n7677K35177
17756H9532J48174J9826J5317l4571o2434j19506q8473p9304m8099l7543J31645
17745f5436J19530J43309k9874l030j1013J646n9777n529m4135m8512O4335j25710
17733f4196j00946O0125L9521J23233l3903j7485j0053r6124N6009K01884L9242
17722A97307r6836n7222j09881m0471J6075j08807J4081J51828J44070o5933n6785
17711a2574J10743m9116K2273j39611j64852J07387N8004r6235m700J38229k6177
17700e6629m7909N2726O8399O2012j15528j68115P5116J04343K6862J07329j60759
17689e2153n358R9680r5382K5524J1942M6217k2796l3478q6936Q3182K1723j29584
$$ y = [44041, -97389, -57187, -19053, 140858, 291329, 245100, 131187, -87968, -145645, 89532, 237706, 257532, 272849, 238278, 175844, 56338, -32135, -111439, -159538, -197081, -65436, 54094, 197403, 167529, 164499, 153486, 155132, 95355, 89826, 45691, -2821, 61514, -64196, -165142, -105017, -65496, 57737, 23834, 6349, -3704, -99828, -43819, 158065, 197307, 100471, 43249, -66632, -107103, -91028, -199835, -185754, -33926, 110144, 44211, -12574, 98169, 49053, 71326, -68285, -233137, -125750, -67746, -163981, -168681, -30452, -56629, -104538, -51812, 16587, 78599, -36929, -205044, -129928, -25585, 1277, 108606, -52153, -57511, 42169, -53213, -27689, -15747, 30470, 7674, -25804, -112740, -29558, -7835, -137419]
17677a37419q5740j3229M5795l7706N6350O8605J03407M1754K9846P7424K2471
17666A71558r2600P932k21945J9151N7966J5665j163q3203r755j1380k9776O9510
17654a08040J48552K2689J7110q9455j7893O235O9340K02259m9255l4804j40973
17643B5765q4704l0926r114N5699J14747k1829m7156j34275o557l4269k5203J20763
17631g7059J46648m5116j49235K3065M8039J2739M5350P8599p9640P5969J607
17620H0966Q5092k1660J2373K8624n2489O4510J6850j22726k6392M0817j44375
17609c8410k7788R3466O8562q772r2784q442J1515n8993p35Q1585K3891m3583
17597d88O0075j09263j54550q9078Q1007J60722R4862r0744j26662j7450q017
$$ y = [-137419, -223159, -236388, -190593, -228299, -171949, -103344, 63, 41817, 71663, 149087, 171558, 78958, 86890, -135055, -115904, -57938, -42273, -43436, -126639, -136394, -147774, -177550, -108040, 40512, 63201, 80311, -9144, -27037, -20802, 48538, 250797, 201542, 166738, 25765, -58939, -89865, -98979, -43280, 71467, 49638, 2482, -131793, -138350, -172619, -197822, -77059, 69589, 24473, -124762, -101697, -53658, -40919, 4431, 83030, 3390, 79359, 80966, 166058, 144398, 156771, 185395, 132906, 197416, 214266, 91540, 65148, 105965, -38410, -66198, 27268, 95830, 87058, -5726, -14168, -2653, -61646, -62381, 19204, 43095, -488, 59587, -49676, -204226, -293304, -212297, -51575, 43287, -47457, -174119, -191569, -199586]
17586a99586N4751j8398K08268J7568J865j10787l813N1052L6422p4551j21629
17575a58838M6447L323J2148q631k0901N4145J21881q5558l4669q3529J23093
17564c1089p2182r242o0561P6456J18790q0990p9446J26891J21122j2682o553
17553I0514n8009j70383q2420j09819P0400N4401j841O7631J60738k356r7530
17542g8674r860j31223j6919K1237Q9448O7812N573O7120l6738P9924J13193Q4811
17530B55704j28870q3946l4299j08301K2989J20280L9265N6090N2422p571o0666
17519A23097j27318j35825N4221k7307n0846R1039O6844l9088N2002L2080M8013
17508H6912r000r1489o6499J13983J06022K5780r4408L7395R0792q7005k6121
$$ y = [-199586, -144835, -163233, 45035, 62603, 64468, -46319, -50132, 920, 37342, -37209, -158838, -112391, -109068, -96920, -105551, -126452, -72307, 49574, -35984, -70653, -154182, -31089, -103271, -112513, -173074, -96618, 22172, -58818, -138264, -11373, 109749, 97067, 90514, 32505, -137878, -220298, -330117, -259717, -205316, -207157, -139526, 21212, 18856, -78674, -88534, -219757, -236676, -215439, -125991, -58179, -52606, 14514, -22224, 57700, 170893, 255704, 126834, 42888, 8589, -99712, -76723, 43557, 82822, 138912, 191334, 183763, 123097, -4221, -140046, -85825, -113132, -163978, -72939, -6095, -45183, 6819, 38899, 86912, 77912, -13577, -80076, 33907, 139929, 165709, 71301, 108696, 199488, 112483, 86362]
17497H6362Q4049L7188m0218q5410l7217R3503j9262o3699P8272N1542o6998n3339
17485F4773j54225L8975j22685j304P7203K17536R440o9015q5350O1291j9836
17474A6803l7345o9073k8177Q3393J56702J0711o0886j32070K7141J88205R1509
17463B46913r5283n498J49465L8357j19003j91596j03481M4429J09125j08974
17453c5546n3809Q2550k6942J1039L2458Q4394J04956n713O2316L66649N66508
17442A188860O41520J60869n17990n92747k99308j23745q8239k54562j83142q0229
17432a48713P352K0814J51673J61115q9813m4307L9405m7967r9133k0469J83624
17421A13581L0725l6258j90097j7646J46334j06450q2673k2880R8041J01100K06432
$$ y = [86362, 170411, 207599, 167381, 81971, 44754, 138257, 118995, 55296, 133568, 185110, 118112, 64773, -89452, -50477, -173162, -174466, -97263, 120273, 129713, 60698, -24652, 36639, 16803, -20542, -89615, -117792, -34399, 122303, 133014, 72128, -59942, -32801, 155404, 246913, 151630, 146132, 295597, 333954, 214951, 23355, -80126, -35697, 73428, -35546, -89355, -6805, -33747, -22708, 9750, 94144, 199100, 193387, 255703, 622352, 1188860, 1830380, 1991249, 1473259, 880512, 581204, 457459, 369220, 114658, -68484, -148713, -141361, -120547, 31126, 192241, 102428, 58121, 97526, 49559, -49574, -70043, 113581, 144306, 108048, -82049, -99695, 46639, -59811, -142484, -165364, -67323, 33777, 240209]
17410B40209j34874j41005n0791J41451O1336P8749J6842r1059j6501j21126J7859
17399A090L7126L9402o5686p4920J11677K9039N354j19781r9273k7546j6949J15171
17387f5296j0765Q1566J01742m5147l2106K5311n1269l1599J49383J06714J35302
17376C63836j08864k10988j63579J4644j7401O7310j0988n773Q0508K9380K5260
17365F3345Q5896J46857p4780l6272m7669q1112L6903N771j11497N8907J04377
17354A50726k9157o1919m5727J02807j19095j38536k0843J62160J05953m867k1770
17343G9732n5546J13358m26j72468j5227J23977m8086m3264P4937K4470L5760
17332A17217j4649L3447J03260k7741j64530j4661o422M0642j0823N6240Q0950
$$ y = [240209, 105335, -35670, -86461, 54990, 116326, 195075, 211917, 120858, 104357, -16769, 1090, 38216, 77618, 11932, -62988, 48689, 77728, 83082, -36699, -135972, -163518, -180467, -65296, -76061, 5505, 107247, 62100, 29994, 55305, 4036, -27563, 121820, 228534, 363836, 254972, 43984, -119595, -104951, -122352, -55042, -66030, -71803, 8705, 38085, 63345, 149241, 296098, 221318, 185046, 137377, 56265, 93168, 98939, -12558, 46349, 150726, 121569, 59650, 13923, 116730, -2365, -140901, -161744, 416, 106369, 101502, 79732, 24186, 137544, 137118, -35350, -50577, 73400, 25314, -17950, 56987, 81457, 117217, 102568, 136015, 239275, 211534, 47004, 32343, 25921, 66563, 55740, 111980, 192930]
17321A92930N3447j44148k1819n23q3577l3478l5616l186j04613p7599J3920J7613
17309b26649N759J54916K35818P7406j2345j55805n0493p0173j8181O234j45591
17298a99104O5137R9940j11112j14617J75408Q2080q6578R445q346l7221O9474
17287e5494N0289p7939m3160R9037Q7561Q468L4717o7459r0531j759K1821M3444
17275H995R1875L8575j09893m5593j4293N2986R2716O7070k6923j25182K3824
17264E4157P8148q1782R192L4015O855j20991k5992K4224M4365M1100p9417m6923
17252f3049n537L8929r6487p3082j5413J88789Q6757M2257j1631j3330o8459j60845
17240a51101m1437m8003k4876j4233N7389R263k1518O7451O6448M8362J5468m0039
$$ y = [192930, 246377, 102229, 80410, 79887, -3690, -37168, -72784, -75970, -180583, -258182, -244262, -226649, -220890, -65974, 169844, 247250, 234905, 79100, 28607, -41566, -59747, -53513, -199104, -133967, -34027, -145139, -259756, -84348, -2268, -88846, -79401, -87747, -124968, -55494, -5205, -83144, -126304, -27267, 60294, 68762, 103479, 36020, -54511, -56270, -34449, 8995, 100870, 139445, 29552, -16041, -30334, 22652, 115368, 182438, 155515, 30333, 54157, 132305, 50523, 59715, 93730, 100585, -20406, -46398, -22174, 22191, 63291, -16126, -63049, -68586, -29657, -126144, -199226, -214639, -25850, 60907, 103164, 91533, 78203, 9744, -151101, -192538, -240541, -265417, -279650, -222261, -212998, -234516, -167065, -100617, -52255, -36787, -76826]
17228g6826m5471L5121M3412L7413j19948P1815J65514m2367m0043n7953R8601
17217F9268N7094J21798j8360j44811l7090j58211o6498J02667K0042J05087K5020
17206G6006p6799j6825l7291n7712P7802P966m1646l40j33919O6915K4477Q2854
17194b8512m7043m7618n5773K0019J09503L9278N9491J6827m6209j15129J15312
17183B0146q2907j36725O3332P8903J7588M7268J07499N4685m3511m5827j24604
17172d4153n2493J3197R558Q6322L7909P3323l8117j38139m549J22462R029J6792
17160I1141l5491p0130R8495k4016J46429N2895q0260o5578q738K137n1523L7552
17148I2913K5796k1419j58978j18576J09762O3677l0308M1474J14540J6274j44504
$$ y = [-76826, -122297, -87176, -43764, -6351, -126299, -54484, 111030, 68663, 28620, -29333, 69268, 126362, 248160, 229800, 84989, 47899, -110312, -176810, -74143, -54101, 50986, 76006, -793, -17618, -54909, -112621, -34819, -26853, -68499, -68839, -202758, -135843, -111366, -28512, -75555, -123173, -178946, -158927, -49424, -10146, 49345, 66172, 19963, -95166, 20146, -62761, -199486, -136154, -57251, -39663, 7605, 115104, 169789, 126278, 80451, -44153, -96646, -83449, -73891, 12431, 50340, 123663, 85546, -52593, -57142, 65320, 74349, 91141, 55650, -14480, 84015, 59999, 206428, 259323, 179063, 113485, 104747, 106884, 55361, 92913, 118709, 97290, -61688, -180264, -70502, -6825, -37133, 4341, 118881, 135155, -9349]
17137i349o7238N2809j04629R9603K8095k0791P7152L315M4266L6150j8642j19913
17125H28j4495L1296N4710N098P9810J88287Q669j00649k2500j01796K9180K2144
17113A80582L706n208M7296l4017o1687J13665q1880o0601J6066j39338n720j2520
17101c9656K7019J08635N2670p5068M4502J05403m0009P558J3291M8009j58645
17090I3709j19868J34606k9237o233R0598P5284r909J2683r8779k5244r8613Q2128
17078A01125j8537l08987j06990K19117K65600J02331j14601j65146k7821k572
17068e6481j2222J861q711P7586M2639j01523r4284J17166J53575R701j01068
17057B8239L5746J26344J091k80158j27867O2234L239r0105R5361K95624J82387
$$ y = [-9349, -76587, -23778, -128407, -28804, -709, -21500, 55652, 58967, 103233, 139383, 120741, 828, -13667, 17629, 72339, 77437, 157247, 345534, 354203, 253554, 231054, 129258, 158438, 180582, 184288, 179080, 226376, 192359, 130672, 244337, 162457, 101856, 117922, -21416, -27136, -39656, -12637, 95998, 148668, 73600, 118102, 223505, 183496, 191054, 204345, 252354, 93709, -26159, 108447, 79210, 72977, 163575, 238859, 228950, 241633, 142854, 117610, 18997, 101125, 82588, -226399, -333389, -114272, 151328, 253659, 139058, -26088, -53909, -56481, -68703, -66842, -75553, 2033, 44672, -56851, -151135, -33969, 119606, 129307, 28239, 63985, 190329, 191420, -88738, -216605, -154371, -151132, -241237, -145876, 149748, 332135]
17046C32135q2795k10193R5238N461O6532O7804J07900l6583k45209p9371j7111
17035C808J28686j3038k4471j97267k382O1805l5339M4197J78758L6724o8140
17024A13341J9735L7693o9083j62212L9688Q6092o6423j67904l3396J02261r4745
17013a94953N9233Q3043l1029O7314L2322o6823J021p1426R657m730M9410J1954
17001e5007K3884L6796m8224k3854p0193r7431N3092N1741J14863J83054m7474
16990A21247j6000J01802L5082k7003J4405Q5933n8967j15057j62513o724J0199
16979a7596j53459k8768J13930K14937J19338j4075j3238j00669J5349j55631
16969a9882K1087J8495j16111q5830K6956J1758N6384K2692m6765J3933m0867
$$ y = [332135, 249340, 39147, 134385, 139846, 206378, 274182, 382082, 345499, 100290, 20919, 3808, 132494, 119456, 94985, -102282, -104664, -42859, -78198, -34001, 144757, 181481, 113341, 133076, 170769, 101686, -60526, -20838, 65254, -1169, -169073, -202469, -100208, -194953, -135720, -52677, -83706, -16392, 15930, -50893, -49872, -121298, -111641, -116371, -66961, -55007, -31123, 5673, -42551, -66405, -136598, -234029, -180937, -129196, -14333, 168721, 121247, 105247, 207049, 242131, 215128, 229533, 315466, 256499, 141442, -21071, -27795, -17596, -171055, -199823, -85893, 129044, 248382, 234307, 221069, 120400, 135749, -19882, 1205, 19700, -96411, -182241, -155285, -143527, -87143, -64451, -111216, -97283, -138150]
16958a38150K0228J36163J20205q8407j0104R8693O8807q0397j17287j6899r450
16947a6598l2188N2579O8577J7814o4647k7451R6660j8217L7033l3415j1553m8460
16935B0134M3301k530r4655M6091M1836q6094j8052J09991r1571j6315J1990j54919
16923a90793N034J12520k7401j8594q340Q0072J76628P9740j64707J4086J29142
16912A87387L8436m4532o2914J300Q3623J3360j94541o2960O5634r133O048J370
16900B3078n5291r586K0817L4255J69552o1141j04889L8582M9171k903Q9304L7069
16888B28018k24176l7558k6835J1544q1816m0847j8502j0351L1928l2839J54133
16877d7301J46308r139o6256J8187K9653K0293l098p9869k0883j8794R6382K6923
$$ y = [-138150, -117922, 18241, 138446, 50039, 39935, 138628, 207435, 127038, 9751, -7148, -16598, -48786, 3793, 72370, 90184, 25537, -1914, 94746, 76529, 113562, 80147, 68594, 20134, 63435, 60905, -33750, 12341, 54177, -31917, -49969, 60022, -31549, -47864, -35874, -190793, -185759, -73239, -100640, -119234, -127574, -47502, 129126, 208866, 44159, 58245, 187387, 225823, 181291, 118377, 119677, 203300, 216660, 22119, -40841, 24793, 15660, 21708, 23078, -32213, -41799, -20982, 13273, 182825, 121684, 16795, 55377, 104548, 101645, 190949, 228018, 3842, -33716, -60551, -49007, -130823, -171670, -190172, -200523, -168595, -201434, -47301, 99007, 89868, 23612, 41799, 71452, 91745, 88647, 8778, -12105, -30899, 65483, 92406]
16865I2406L3009q3340p838j48451J4320Q5230Q3332P3857M7721j44740m2794
16854B712Q8842K5282M3574p0685j54097M353P7866R3307L6519j15790p2862p2324
16842a13303o0187M7954J14394J00447j62977j50161L4718R2085j2723j4479K2305
16831a01927M574J08133L3022R7257r2383p6536J08201Q7133J00801j5086j14683
16820A38506j1803k8111K4775J31218j04672j80658m7570p9576l8911K653Q4698
16809a09451J4569j2654j02052K8057J39628o4027l1557J84321O453L3450L0337
16798A17074K6978l4421j03501l1886j23602l8596R576R0844J03007J47125j08434
16787E4164j80527l9228M7992N2439J3973L3068L694j27967O4775J48965K07841
$$ y = [92406, 125415, 42075, 34237, -114214, -99894, -14664, 68668, 142525, 190246, 45506, 2712, 91554, 116836, 160410, 89725, -64372, -60019, 17847, 111154, 147673, 31883, -40979, -113303, -173490, -125536, -11142, 89305, -73672, -223833, -189115, -97030, -109753, -124232, -101927, -97353, 10780, 43802, 141059, 48676, -27860, 80341, 167474, 268275, 253189, 138506, 126703, 98592, 123367, 254585, 149913, -30745, -78315, -157891, -196802, -194149, -109451, -94882, -107536, -209588, -181531, -41903, -105930, -137487, 46834, 53287, 86737, 117074, 144052, 109631, 6130, -25756, -149358, -187954, -178378, -87534, 15473, 162598, 54164, -126363, -165591, -117599, -65160, -51187, -18119, -14425, -142392, -77617, 71348, 279189]
16776B79189q9455j73884j16298M2599J43722J47765n4241N8370R9185J6015k7764
16765C25203l06279j79649N5384j7462j7512K9210n0957J00971J26609J09273
16755A74791j13025J9185j5413o6113L0611m4688p094J7672K5718K3908j69159
16744a23607L0454K36422P3628l3659j62913q7476Q8841p1446q5348j9772o9188
16733b24064j11448L7738N8183J63227J4120k06905k2497J45459J14515M0087
16723H415J52513o3866k33301j1814l5714n4242m40M0202O627k5173R0574P5580
16711e0639J14551j8585l5826j49256o4766R839J11138N1824J7303n9889p1751
16700a46057L2705N4845n8176K5105j6296J4967L8141n5032P2862j20992j17511
$$ y = [279189, 189734, 15850, -100448, -57849, 85873, 233638, 179397, 237767, 336952, 352967, 325203, 18924, -160725, -105341, -122803, -140315, -111105, -162062, -61091, 65518, 174791, 61766, 80951, 65538, -575, 30036, -14652, -21746, -4074, 21644, 45552, -123607, -93153, 143269, 216897, 183238, 20325, -67151, 21690, -49756, -135104, -154876, -224064, -335512, -297774, -239591, -76364, -62244, -269149, -291646, -146187, -31672, 8415, 160928, 97062, -136239, -148053, -183767, -238009, -238449, -198247, -191620, -216793, -126219, -50639, 63912, 45327, 9501, -139755, -204521, -194682, -83544, -31720, -14417, -74306, -146057, -113352, -58507, -116683, -91578, -107874, -92907, -54766, -109798, -36936, -157928, -275439]
16689b75439M9694R9290J35665N870K0017k4077Q5008j8625o9436k12153o0201
16678b64387J30621K51881M1641q4614j70554J22885L3286k06602q8833L5376
16668a99300J65619M546j49615P6513J10393P418P0969K8553l4005j61532q4026
16657a64467j7583J9778Q6218J9551K06274O703o6405N4293j2079M7914k2224
16646A57973j40828L0521J1175l1981r6150L3648N9243P0957N5889k9847J621
16635A22221p007L3362K5715o6537p6258m1523m5189J1270N5853q2810j26449
16624a97352R8979j51635p1027J71249J35949J63712n1666j1958L4745p5321L2156
16613G7831M5395q2478j24088M5176J34212L1209j14273j76253p3166J16518k0594
$$ y = [-275439, -225745, -126455, 9210, 15080, 35097, 11020, 96028, 77403, 7967, -204186, -264387, -133766, 118115, 159756, 75142, -95412, 27473, 60759, -145843, -234676, -199300, -33681, -29135, -178750, -102237, 8156, 15574, 86543, 115096, 81091, -80441, -164467, -182050, -162272, -76054, -56503, 149771, 156474, 90069, 144362, 132283, 180197, 157973, 17145, 47666, 58841, 26860, -69290, -35642, 23601, 94558, 150447, 120600, 122221, 115214, 148576, 174291, 107754, 31496, -10027, -55216, -43946, 11907, -70903, -197352, -98373, -250008, -321035, -149786, -13837, 149875, 98209, 86251, 120996, 45675, 77831, 123226, 40748, -83340, -38164, 96048, 127257, 12984, -163269, -236435, -119917, -140511]
16602a40511L6327O4895n7367k9729l0430k9754R8855K1050K072l4431j04540
16591b03563L7684J05274J6239r9588j1986L4426n8415J10503O2400N338k00288
16580b01976O6787M0073J21227M5697J0277j25617l8196J12504o2860j24978J8016
16569a39046P3008O727L8192j42322J05000n3310l2794J00051k0320M5590l9088
16558e8312L1220O0836p3037N1183M9959P772j48399j0107J51521R579j51159
16547g8944p461N6598R1264L1787r9350M7314l4418R6752K0500j0426Q2778J53033
16535C49427q1256j91537j32441J00760m2472k3903R3973l4528q1410L5865K5860
16524A8338O6625o3563k4115M3319O5965J50362p5438q2425j30105N4258j24982
$$ y = [-140511, -104184, -39289, -96656, -126385, -156815, -186569, -87714, -66664, -64592, -99023, -203563, -165879, -60605, -44366, -143954, -155940, -121514, -179929, -69426, -7026, -1688, -201976, -135189, -95116, 26111, 71808, 82085, -43532, -81728, 30776, -32084, -157062, -139046, -66038, -59311, -21119, -163441, -58441, -111751, -144545, -44494, -64814, -19224, -58312, -27092, 33744, -39293, 11890, 61849, 69621, -78778, -88885, 62636, 72215, -78944, -86405, -29807, 61457, 93244, -6106, 41208, 6790, 103542, 124042, 113616, 196394, 349427, 268171, 76634, -55807, 44953, 2481, -21422, 72551, 38023, -43387, -7522, 18338, 84963, 21400, -2715, 40604, 106569, 256931, 181493, 99068, -31037, 23221, -101761]
16513a01761j90150q8071J30896J55240J43368k3028p3244J9041J7018M0333J22971
16502A52613P1372j18057j15195r8643o9816O5490j03429m2682J45190J99601
16492H6444m8235m7647N4756Q1081J31341k4478R8814k0842r3062j3177n1630
16481A53365o3221m4259N3262j7751n7811N5292Q5599k8958n6829r3910j693p256
16469b4170l2931J5153j32621p2939J67316R2881l4055o4555o362O573p2239J06192
16457e1757P5322l5954j11354J19526J21869P4518k01670J7002l1504P9430o248
16446D9180J30746J2842j3119o3799j71990N9444J05317m7597k16231j244j151
16435a57602q2550M8242P3881L3264j04453j46907M5947k7844L0735K16273R5724
$$ y = [-101761, -291911, -379982, -249086, -93846, 49522, 26494, -46750, -27709, -10691, 29642, 152613, 223985, 105928, -9267, -107910, -177726, -112236, -215665, -258347, -113157, 86444, 38209, -9438, 45318, 126399, 257740, 233262, 332076, 311234, 218172, 204995, 153365, 90144, 45885, 99147, 81396, 23585, 78877, 164476, 135518, 78689, -15221, -16914, -24170, -57101, -41948, -174569, -247508, -80192, 12689, -21366, -85921, -92283, -85710, -157949, -51757, 23565, -12389, -123743, -4217, 117652, 192170, -9500, 7502, -24002, 55428, 49180, 179926, 192768, 179649, 115850, -56140, 3304, 108621, 61024, -155207, -156451, -157602, -240152, -191910, -118029, -84765, -189218, -336125, -290178, -318022, -287287, -71014, 24710]
16424B4710N8304j18212N4866j0016j31152j09479J27458K4705J77627J0687J2257
16413A21755K9997o2998m967N289m4769p3896p70L3008J27941J08411l1950j32115
16401G4936r7169J33006K6587r4687J1842k9966l4321j13731J56091j7713Q690
16390B3565Q0990n8041j14298j40553j11756J57857J8040K022n5471K30117N0284
16379H2756P447j76025K8120J57014j77244k64907J16250J30598J9559j7860P5812
16368a8480J13067J53960j56010k8182k0347q2870P2759K3565r0354j5211J3607
16357c4496Q751p6641R2171N3993n2695m1516o2652L6236M9298K7935L0580Q3860
16345A14824n948J7931O2724j30129J5481J758j11580j12694N1045L1457L7432
$$ y = [24710, 83014, -35198, 19668, 9652, -121500, -230979, -103521, -78816, 98811, 109498, 121755, 151752, 88754, 83787, 89076, 44307, -29589, -30359, 2649, 130590, 239001, 207051, 74936, -22233, 110773, 137360, 42673, 54515, 24549, -9772, -123503, 32588, 14875, 23565, 104555, 46514, -67784, -208337, -320093, -162236, -144196, -142174, -197645, 32472, 82756, 90203, -85822, -57702, 99312, -77932, -342839, -226589, -95991, -76432, -94292, -18480, 94587, 248547, 92537, 64355, 44008, -38862, 33897, 57462, -32892, -48103, -34496, -25745, -102386, -10215, 43778, -8917, -50433, -113085, -76849, -27551, 384, 30964, 114824, 108876, 126807, 189531, 59402, 74883, 76641, -34939, -147633, -96588, -65131, -27699]
16334b7699J32445Q3449K0750J13723j04383j16623j41924N5561K08498J47523
16324C71320j77356r7161j02958j4726p503j31471Q4243O1403m4993m600p3930
16313a37732l5995J16388P797o0894K8385N9858m8904j7460l4938K0423k5897
16302a28969o590m0870j2719J36059K25433j50118j15420O9791k5675j03968L5622
16291a17424Q2346k6813J0204k786p6598J2551j0816m3856N0407r8756j4498J30192
16279a05847Q4262q1033j14882o3319q4405M4991N3631N1209R1419J26636Q6711
16268H9373k4783K6400o2348p2589M9864K4976J28456J07285j46925j94792J20850
16257D5767K13940j83299j22566k5334N397j429Q360o456K5255J4442J79264O6163
$$ y = [-27699, 104746, 188195, 208945, 322668, 218285, 101662, -40262, 15299, 223797, 371320, 193964, 96803, -6155, -20881, -28384, -159855, -75612, -14209, -59202, -63802, -137732, -173727, -57339, -49542, -110436, -82051, -22193, -71097, -88557, -123495, -103072, -128969, -135559, -176429, -189148, -53089, 172344, 22226, -93194, -23403, -49078, -153046, -117424, -35078, -61891, -51687, -54473, -131071, -118520, -129336, -173192, -122785, -221541, -236039, -105847, -21585, -102618, -217500, -280819, -365224, -320233, -266602, -215393, -123974, 2662, 89373, 64590, 90990, 28642, -43947, 5917, 30893, 159349, 266634, 119709, -75083, 45767, 259707, 76408, -46158, -71492, -66095, -67524, -59164, -65620, -40365, -25923, 153341, 219504]
16245B19504p4762j89706j32930M2575l2835m4711K4673J97708O9036j75803l5748
16234a32999K3647o9054j13900R2039L4548R9623J19416P8340N7135M0470m7370
16223A81895j8451k4063j3384j56734m7039j40310k4184L6649L2786m2642J68853
16212d6624J2469l816m0395J32037J08922N1516o6146O5305j6617k27731r5772
16201a26852J32768J26642q1143j02097J21812n9563N2n1121r4303n8648L49J03031
16189h9073L8198l8015J05856P1128j04726n7394Q1547L836r0796j26347j08726
16178c14512K45778O6519L8468J25330j8711r5961l1995N8590j10608n7423J0369
16167h4156J33588l4413k31279m8059K61277J95823O9151k7610m2596j18430j16281
$$ y = [219504, 144742, -44964, -177894, -135319, -168154, -212865, -188192, 9516, 78552, -97251, -132999, -109352, -178406, -292306, -200267, -165719, -66096, 53320, 131660, 188795, 229265, 181895, 163444, 139381, 125997, -30737, -77776, -218086, -242270, -205621, -172835, -215477, -46624, -34155, -37971, -78366, 53671, 162593, 214109, 147963, 213268, 196651, -31080, -126852, 5916, 132558, 51415, -50682, 71130, 11567, 11619, -39502, -133805, -192453, -192104, -89073, -50875, -88890, 16966, 88094, -16632, -74026, 7521, 11357, -79439, -205786, -314512, -68734, -2215, 36253, 161583, 142872, 46911, 14916, 73506, -37102, -94525, -84156, 49432, 15019, -216260, -264319, -3042, 192781, 261932, 234322, 191726, 73296, -42985]
16156d2985M8555J689j00934j35253J52446Q4701k2867P5966O1435m7680O9438
16145A44511O0343l3620r2555k9170k7661o0752M7597M0577j68723K8448k382
16134i3387m1695J5531J34773K8441L3845M0139l5362j8032n6770j3698j64874
16123a71089O4058J87431l8655P7819M9640l522j50042j33221P8457J18178N1991
16112A31045o522j09538o9614o2746K44248J3127o8389m3406M9935J04808J24870
16101C07818j10004n122p0213o8701K4467N0724n5630j10089l4678Q4385L6446
16090D9403N4894k7118j5077l533J29718N4634p5762p2135j14922J467J9062J3940
16078A4571o0100m4486L0277J3988o3214o5790L1454N053j42724j36216J2898
$$ y = [-42985, 5570, 7259, -93675, -228928, -76482, 8219, -14648, 61318, 122753, 75073, 144511, 204854, 171234, 78679, 49509, 21848, -38904, 8693, 49270, -119453, -91005, -93387, -135082, -119551, 15222, 43663, 77508, 117647, 82285, 64253, 7483, -6215, -171089, -107031, 80400, 41745, 119564, 169204, 165682, 15640, -117581, -39124, 79054, 131045, 124523, 14985, -54629, -117375, 126873, 140000, 71611, 28205, 78140, 182948, 307818, 197814, 192692, 122479, 53778, 78245, 128969, 73339, -36750, -71428, 12957, 49403, 104297, 77179, 62102, 58569, 188287, 242921, 167159, 95024, -19898, -18431, 631, 14571, -45529, -90015, -59738, -45750, -108964, -174754, -143300, -138247, -280971, -417187, -404289]
16067d04289J86108J59268O676r0804o4778k0781n5950Q2310J00860J41747N3784
16056I4151Q5885K5259K2066j27433j08544J5056L9938j31550p0557J45273O0617
16045E0161m8170O6122J06161M5278N3700j05454o4380m6713k8425r8924K6817
16034d3827R7544N6898R9827n3465p5143j56227R6813J18768P1279L6410m1224
16023B07653j29418n1208l0110L3399J26838o0572m2390P3737P7054R0722J39983
16012D35688j85049k87934p0703J5079J67838o6385p7525J05220O7427j04658
16002a002l4769m8131J09911P8368j39643L6352J57679r1115k2289q880n5852
15991a9371j4817K536J0009P2312j9513p4419j8828M393Q5344P310j62670J864
$$ y = [-404289, -218181, -58913, -52237, -143041, -207819, -228600, -284550, -202240, -101380, 40367, 94151, 180036, 205295, 227361, 99928, -8616, 6440, 46378, -85172, -155729, -10456, 50161, 1991, 68113, 174274, 219552, 273252, 167798, 103418, 56705, 28280, -70644, -43827, 53717, 110615, 210442, 156977, 81834, -74393, 22420, 141188, 212467, 248877, 207653, 78235, 27027, -3083, 30316, 157154, 96582, 54192, 127929, 204983, 295705, 435688, 250639, -37295, -107998, -92919, 74919, 8534, -68991, 36229, 103656, -1002, -35771, -83902, 26009, 104377, -35266, 1086, 158765, 67650, 45361, 36481, -19371, -34188, -31652, -21643, 50669, 31156, -43263, -62091, -57698, 27646, 34956, -127714, -125850]
15979a25850J04789r9648m7395K25436L9519j06879j51754q5207J30555N0795
15969f5639K1569n000j2620n782R958J3939j076p5661J5644J20438Q4786j36627
15957c6071J9152J53862k6712j66388q9841J11075J12824P7241J21536q731m0775
15946B27172j29895j98880j9280k989j20871N8056R6711M3505J32450k2435j28280
15935f4736K104J54633J48909k8638M1459n7923j80821j31180o3839N7139O7247
15924e5646M5675L8690p0385j81908j59817P4010J92111q6032j09049J31167J32305
15913d8879J02006l4641j29670j35110J15406Q7251j1026J30447J26172p6j057
15902B00823r2537j55243o7020N315O632J56193J25393J59022l7572l6873m2881
$$ y = [-125850, -21061, -120709, -168104, 57332, 96851, -10028, -161782, -246989, -116434, -65639, -44070, -49070, -61690, -67472, -57514, -43575, -44651, -120312, -104668, 15770, 100556, -36071, -16919, 136943, 110231, -56157, -145998, -34923, 77901, 155142, 276678, 267947, 227172, 97277, -101603, -120883, -123872, -244743, -186687, -89976, -46471, 85979, 63544, -64736, -62632, 92001, 240910, 212272, 253731, 195808, 14987, -116193, -180032, -122893, -55646, -9971, 28719, -41666, -223574, -383391, -309381, -117270, -203302, -312351, -181184, -48879, 53127, 18486, -111184, -246294, -130888, -43637, -54663, 75784, 201956, 201880, 200823, 108286, -46957, -113977, -108662, -102030, 54163, 179556, 338578, 301006, 264133, 221252]
15891B21252j52438q7952m7808O1744l3958q189p1722j19795k8743J39580J45944
15880A7915J8607j23326J03968J42966j07354n8531j0589j43624k25544K52735
15870a32777J97955N3786r0302J05202J01545p7452k22884j72949M123N5673q0603
15859b58683O9918J89432j9111j2815r6695J5194P7978J6928j34728p1175M1143
15848a82614M4237O3156J00009q723L76m5500J7629J50572J73381p0060j68392
15837G4071j90376K4780M5627J45134O3030m2369r3304L9699j20130k0990J43346
15826F8518P1812O7134P6973j28757j64621r0030o7008J559J58209K2596P0813
15815H7198j00992j19937k9526l4055j2142J74529P8355o0160P707j22812q483
$$ y = [221252, 68814, -19138, -66946, -5202, -39160, -47349, -119071, -238866, -267609, -128029, 17915, 36522, -86804, 17164, 160130, 52776, -5755, -16344, -159968, -385512, -132777, 65178, 118964, 28662, 133864, 235409, 157957, -64927, -237876, -233753, -178080, -258683, -188765, 667, -18444, -31259, -127954, -112760, -34782, -17854, -152582, -223757, -182614, -138377, -75221, 24788, 16065, 16441, -29059, -11430, 139142, 312523, 242463, 74071, -116305, -91525, -45898, 99236, 162266, 119897, 26593, 66292, -53838, -74828, 68518, 140330, 207464, 284437, 155680, -8941, -98971, -165979, -164420, -6211, 16385, 87198, -13794, -133731, -163257, -197312, -209454, -34925, 43430, -16730, -9023, -131835, -140318]
15804a40318j21788K5074N7758J03092N3192J38740J1667j24552j59909l3576
15794a90620L7590Q9812K0978P1864q0846j40349q0603L1292R6416O682k9058
15783a66842m6459L3930m3556J36520K2357r376j3201l0895M5840j4902J5734
15772g0850P0820n1299k8232J08858j6380R000o9911m5322J31843m9729j06960
15761a18162k8957j15036M6942J26573J10505P6370M6755j37292N6613J23424
15751A87735k2978k1530N466K4094j20882p9095P0306k5108j12896q867j918M7701
15739e7972M2812J4610q2069o3754l3283L2894J22677R4813o8157n3346J2130
15728c8645J2552K9139P336J03168K1146K7960j08347m9340P0558P7204k12453
$$ y = [-140318, -262106, -237032, -179274, -76182, -22990, 115750, 127417, 2865, -157044, -190620, -153030, -63218, -42240, 29624, -51222, -191571, -272174, -240882, -144466, -137784, -166842, -213301, -179371, -222927, -86407, -64050, -73426, -86627, -117522, -71682, -86584, -70850, -30, -51329, -79561, 29297, 12917, 21917, -47994, -93316, 38527, -11202, -118162, -147119, -262155, -215213, -88640, 21865, 98235, 144990, 7698, 64311, 187735, 164757, 143227, 148693, 172787, 51905, -27190, 43116, 18008, -94888, -103755, -105673, -57972, -15160, -550, -82619, -146373, -179656, -146762, -24085, 70728, 2571, -50775, -38645, -26093, 3046, 10382, 113550, 134696, 162656, 54309, 4969, 75527, 152731, -59722]
15717e9722p9961R2718o8211k8793q8323L095P6796M9335j1964M3592P0599J10793
15705A09954o4303j23721R9180M0127q2417J6885J2302k0301J7064n1606j26043
15694a72879J18938K4549P4983K46281R1717j770K5432j26535j39670M3200l2950
15683A51296q1634j9488K1843M2259k8849j33991j60218J06845J50881p076l1916
15672I952L7306R5669p9342j63717j21295R1272R5632r6196R5L6753o0164J6487
15660a37548P0453O9469j78864k1410R5565J00930O7174J76126O199L6966o534
15649B78526j33853j24082j40915Q193J61536J2141O8918j18893n2675N9066j41373
15638a23411k506J62765J46208j43047j16565L6282p635J6374J97676J32344k8979
$$ y = [-59722, -139683, -46965, -115176, -143969, -232292, -229197, -152401, -103066, -115030, -71438, -839, 109954, 45651, -78070, 21110, 61237, -21180, -4295, 8007, -12294, 4770, -46836, -172879, -53941, -29392, 45591, 291872, 383589, 381819, 407251, 280716, 141046, 184246, 151296, 69662, 50174, 72017, 114276, 85427, -48564, -208782, -101937, 48944, 41868, 9952, 47258, 142927, 63585, -100132, -221427, -130155, -34523, -130719, -130624, -93871, -154035, -137548, -67095, 2374, -176490, -197900, -102335, -1405, 65769, 241895, 248094, 285060, 278526, 144673, 20591, -120324, -112131, 49405, 61546, 130464, 11571, -41104, 17962, -123411, -125917, 36848, 183056, 40009, -76556, -40274, -47909, -31535, 166141, 298485, 269506]
15627B69506r1915p9541J2816J14042j22682j91200L2266J39176J6175J8448k8809
15616H8282j07661o6878p6812l2141L3514M808j07196N5757J75147L9412m2570
15605c6338J3270O817j07117N4149M5931j5382M9873L8418n3625p7951j94813
15594b76768J3921J80088J13628n9561j11880O7152R1545p0005P4656J18805K6030
15583A67611o0847j98722j5728j1302j14768J14076J86621j3531N2128M073L364
15572A12975n7022j7409j15449m7275L7003j34213k2988P8388N1658O3972J54153
15561A03793K3337m809j01074o1434L7487j5449p970q1903O0123m0366j9730q0346
15549a88341q4395J27774J73606J8046N7179R5578l4423J9157j12870j59486k5602
$$ y = [269506, 177591, 98050, 110866, 224908, 102226, -88974, -56708, 82468, 98643, 117091, 88282, -19379, -86257, -163069, -195210, -161696, -156888, -264084, -208327, -33180, 6232, -36338, -23068, -16251, -123368, -69219, -23288, -38670, 11203, 49621, -4004, -81955, -276768, -262847, -82759, 30869, -28692, -140572, -73420, 18125, -51880, 22776, 141581, 167611, 106764, -91958, -107686, -118988, -233756, -119680, 66941, 53410, 105538, 109611, 112975, 55953, 38544, -76905, -124180, -87177, -221390, -244378, -165990, -114332, -50360, 103793, 127130, 122321, 21247, -40187, -2700, -18149, -26119, -108022, -47899, -88265, -107995, -188341, -272736, -144962, 28644, 46690, 103869, 199447, 165024, 184181, 71311, -88175, -113777]
15538a13777P8202l7537J2502q2711m2046j6063J26999L1393l4805K2293J34837
15527G9287q5670j3473J37702r217j74072k7582N0638l6171p765K5034K7301l5444
15515f9432P7759R892k6031L545O0443j7678p0858r1819J03448O7802j17685k04658
15503b75272k0159R8673R8604o6907N065J55287J74032p2253j16422J7293M0055
15492C7996K9809P6175q3054j56036m1642M6119J9328O6375N6918P3131Q5775
15481B10894K2369j79963o2193J2712M92k4744P7728M1670j83006k9710J320J13437
15469A006l3723q5962p5186m3576k1090J08995O5197k2111J10916J07262l8320
15458G3408o3328N4042K76j13295q8804L825M6553q3174j65307J56402K39241
$$ y = [-113777, -35575, -73112, -60610, -143321, -185367, -201430, -74431, -43038, -77843, -55550, 79287, -6383, -19856, 117846, 108629, -65443, -93025, -42387, -78558, -86323, -61289, -33988, -69432, 8327, 18219, -7812, -4267, 56176, 38498, -32360, -124179, -20731, 47071, -70614, -275272, -295431, -196758, -98154, -165061, -159996, -4709, 169323, 97070, -19352, -2059, 37996, 67805, 143980, 60926, -95110, -136752, -90633, -71305, -4930, 51988, 125119, 210894, 233263, 53300, -8893, 3819, 4311, -20433, 57295, 98965, -84041, -113751, -112431, 1006, -32717, -118679, -193865, -237441, -258531, -149536, -84339, -106450, 4466, 111728, 73408, 10080, 64122, 64398, -48897, -137701, -133876, -87323, -170497, -335804, -179402, 59839]
15447E9839p331J00853j9432j16238l5690n5196M8926P4727P6790n983j64082
15436d2817o6694j56561J1056J44732Q9219m1560j04902O8374N3354K7515k3661
15425d1945L2762j67192m6656L6523J48326J35304p7415j07238K2509K07065L1462
15414A73505m4680q4320k1377K6132J47289r564P9380m5380k05694k07546n2242
15403b44497N1000J54331M007j30321L4190p3096k9045O7955J98027J15955j26377
15392B2129j8066m0207j58787j90426p490J14020N594n1305K6130J81678J15435
15381a295K9192j12226k6458J9290N3690J5700r1286j57553K1056O5557J49722
15370c4611K08067O2753Q8110r8546l9611N7634j39753j93135J5019j2818j43509
$$ y = [59839, 52508, 153361, 133929, 17691, -17999, -73195, -24269, 50458, 127248, 121265, -42817, -109511, -266072, -255016, -110284, -21065, -62625, -167527, -99153, -45799, -18284, -41945, -9183, -176375, -223031, -186508, -38182, 97122, 19707, -87531, -65022, 142043, 173505, 128825, 44505, 23128, 49260, 196549, 186985, 266365, 220985, 15291, -192255, -244497, -193497, -39166, -35159, -165480, -131290, -204386, -233431, -165476, 32551, 148506, 22129, 4063, -36144, -194931, -385357, -392847, -278827, -273233, -324538, -298408, -116730, -1295, 27897, -84329, -110787, -91497, -37807, -22107, -113393, -270946, -249890, -184333, -34611, 173456, 236209, 324319, 225773, 186162, 243796, 104043, -89092, -74073, -86891, -230400]
15359b30400J13233J14965j2572o6395j06534j16614R7414J15645O9949m8554
15349f9863p3465O8011N2432O6087J41606Q7721J0822j2618l9189p3040K4516
15338A83020N115r5194p942O943m0295p4118k0567R9813L9551k1204n2378m9094
15326b6350R9268r3058j15219O1793J10749l3310M4481J25865J6969o3425J28951
15315B56714j5432j98666o0220k2668O2884P2863N6206N3095j34975r5641R459
15304a6381k4695l9879J28373K4461n4709p586M9837n9890j27502j5997R6403
15293d7565J36094O9484J03004q8777j20246o3593R8562p2947j3473K2316N7592
15282H0451j8699N8J545o169M3172M9454k4413j15786J09154k8163K5452J5817
$$ y = [-230400, -117167, -2202, -14774, -81169, -187703, -304317, -206903, -91258, -21309, -69863, -143328, -75317, -22885, 43202, 184808, 272529, 283351, 270733, 231544, 158504, 183020, 188135, 92941, 84999, 91942, 51647, -22471, -43038, 56775, 96326, 75122, 22744, -26350, 72918, -20140, -135359, -73566, 37183, 3873, 48354, 174219, 191188, 127763, 256714, 241282, 42616, -17604, -40272, 22612, 95475, 151681, 204776, 69801, -25840, -16381, -41076, -80955, 47418, 71879, 17170, 9584, 59421, -469, -127971, -143968, -47565, 88529, 158013, 261017, 172240, 51994, -11599, 86963, 14016, 543, 22859, 80451, 61752, 61810, 63355, 57186, 100358, 149812, 125399, 9613, 118767, 90604, 116056, 131873]
15270A31873r6586j9135j54408M2697p2304L8512J06552l9307q9035p1594l2718
15259b55453P4993J49071m8945j00812k6134J3587q7992K19091K45369j3319n3030
15248A16426q9696j0528k3876J8833j4615J9733j7443l1089j3365Q9075j31712
15237h8257K6563N1187M0782J37526M5714m0739M776o8391k28188j29486J1360
15226b37153J22017R6103l4204j7441n1179Q439k5750L041k4523m7642J36737
15215g1555R7248O6890p7347j20825j12009l6823O0779M0002M7732j14409J5524
15204b04793n82R5636J5686q1939M994P3286P9840o2666o061k0797p9704J4559
15192a72541O8052r4682j55107O4694J32959o512J40932J89479q998q4110k3978
$$ y = [131873, 35287, 16152, -138256, -95559, -167863, -129351, -22799, -62106, -151141, -222735, -255453, -180460, -31389, -80334, -181146, -207280, -193693, -281685, -62594, 182775, 169456, 116426, 26730, 16202, -7674, 11159, -3456, 16277, -1166, -32255, -45620, 43455, -88257, -61694, -10507, 30275, 167801, 213515, 172776, 177552, 109161, -119027, -248513, -237153, -115136, -19033, -53237, -70678, -121857, -113418, -139168, -136127, -160650, -208292, -71555, 25693, 92583, 15236, -105589, -217598, -254421, -193642, -153640, -105908, -220317, -204793, -205375, -109739, -94053, -175992, -170998, -97712, -17872, -80538, -86599, -107396, -187100, -172541, -104489, -199171, -354278, -289584, -156625, -163137, -22205, 167274, 158276, 74166, 50188]
15181E0188K4061q2970P3146J87310n7953k15819L8619Q0342M9837L0168r5587
15170H1342m1719O2977j1772q2541j40546r6063k0304Q3951Q5278J24660L3292
15159G8555J90409p2201k00451n2674K0285O2529Q3632J2931r7733P3832K9132
15148A28246K7054o9268j14255p808K5163n1003j53620k0827K3929P1332J30304
15137a0753J9570k7888Q3402j26197k1313J9818n3994J41362L6663o7921P862
15126F11J08571L2523r3619N1923J9417p632J2463j08593k1224P4752j15538J01056
15114E4710J36013o8557r6526J5056m3811l4349m3120O0412K0740N3736j58860
15103a04556N1625J76522L9977L6679K5443L2149n1849o4064m7347m6873m4099
$$ y = [50188, 74249, -8721, 64425, 251735, 193782, -22037, 16582, 96924, 146761, 176929, 81342, 39623, 102600, 90828, 8287, -132259, -228322, -248626, -164675, -79397, 45263, 78555, 268964, 196763, -3688, -56362, -36077, 26452, 110084, 123015, 25282, 99114, 128246, 155300, 86032, -28223, -36031, -10868, -61871, -215491, -236318, -212389, -141057, -10753, 8817, -19071, 64331, -61866, -83179, -63361, -117355, 24007, 60670, -7251, 611, 109182, 141705, 48086, 100009, 119426, 111794, 124257, 15664, -5560, 69192, -46346, 54710, 190723, 122166, 25640, 40696, -3115, -37464, -80584, -20172, 568, 54304, -104556, -52931, 123591, 163568, 200247, 225690, 257839, 205990, 141926, 94579, 47706, 3607]
15092C607L0314j30870K2944J26071K3150r7012R8008R463j67281j8754j866l8186
15080a40412J27129J4734Q0447J30817J5279q7739L1383j9191k1462j02390k8980
15069c85J96337L2810j09929k34648p0885M5710j2259L4813r0917l6887P8974
15058a67266J54792J9883M636J29795p748k82519j06928J06897k2460L9548n324
15047a36694n2674j9247O4867R9886j0344J12795p4889j28P1415q875j13019j8287
15035h5194M9907O3850r2327k42n3178K897N8450J21441J09525j55334j15844
15024i6049J82936K4773n9665k9675N7303r359p2559n9300J04091P9255j09716
15013A2035k22866n4435P6648J97959J05061P2071J04968L1355p2648J46525K88550
$$ y = [3607, 33921, -96949, -74005, 52066, 75216, -21796, 76212, 85675, -81606, -100360, -102226, -140412, -13283, 1451, 81898, 212715, 227994, 140255, 171638, 152447, 130985, 28595, -385, 195952, 228762, 118833, -115815, -186700, -140990, -153249, -118436, -209353, -246240, -167266, -12474, 7409, 12045, 141840, 134092, -148427, -255355, -148458, -170918, -131370, -136694, -189368, -208615, -143748, -43862, -54206, 58589, -16300, -16428, 54987, 46112, -66907, -85194, -35287, 28563, -63764, -64006, -117184, -114287, -55837, 65604, 175129, 19795, -96049, 86887, 111660, 51995, 22320, 79623, 70264, -2295, -61595, 42496, 121751, 12035, -210831, -265266, -188618, 9341, 114402, 186473, 291441, 322796, 250148, 396673, 685223]
15002F85223K13104L57462P7969m10328m41765k30160k32088M8368J59493R1915
14992C19193L2260K603n6681j28590r7674N0023j21399N1578L3219o8726n2434
14981c6628j8455M0509L0248J63442J00170j72150r6521K8779k0696Q512P6633
14970A03843o1635j41380r9965K0016k9597J04141K1776p2282n135O5280K56766
14959A61828K5002j26537J14698L645j39203j65814o4078M2515M7227p8003l2148
14948b10868J0394M0913L4521Q4373P8434O0553L9692k5586J9605O0010l2880
14937A59161L6961k977J79Q4602j23008q6103N7631P5073j6471Q8900n2813m2654
14925A78481J964J3881Q5287j2233r3965n3499J1386j01697j36774j3813J17278
$$ y = [685223, 898327, 1255789, 1333758, 923430, 481665, 251505, 19417, 67785, 227278, 319193, 351453, 354056, 297375, 168785, 71111, 121134, -265, 51313, 84532, 15806, -36628, -55083, -14574, 15674, 179116, 279286, 107136, 10615, 39394, 18698, 27210, 103843, 42208, -99172, -199137, -179121, -208718, -104577, -82801, -155083, -160218, -94938, 161828, 186830, 60293, 174991, 178636, 39433, -126381, -190459, -147944, -100717, -178720, -210868, -200474, -159561, -125040, -40667, 37767, 98320, 138012, 112426, 132031, 192041, 159161, 196122, 193145, 193324, 277926, 154918, 68815, 126446, 201519, 185048, 273948, 221135, 178481, 180445, 194326, 279613, 267380, 173415, 119916, 131302, 29605, -107169, -120982, -3704]
14914c704n4199K2919M6482L4565l9003l1188L237j5463r4292n4887j1600N7130
14902a40003J87781K09854J8211p7338j60799j85895J00791J988K47658P4348
14892B76596k03464k2335o8902q0184o6474p803p6345J1138R5048J28795O3413
14881D9483k527M2087o8152j26398q408N922L9655J86954q452R943n3746L7032
14869A03393r3693k0223O8438O0782n3524p9686J00488j1939j07886k6836K4209
14858c6477J10377L1923N8796n488l7705P2282j00867p3267j51231O2371K08906
14847A39620N8570K760l2850n210L6833l7241j12662n5286j42747q870O3252M8967
14835d4864j01006J28780J6956j7274N5293l2126J6406J883M2962K8066n7402
$$ y = [-3704, -57903, -34984, 11498, 46063, 7060, -24128, -20891, -36354, -130646, -185533, -197133, -140003, 47778, 257632, 275843, 198505, 37706, -148189, -47398, -45410, 202248, 276596, 73132, 50797, -18105, -98289, -164763, -172566, -248911, -237773, -142725, -13930, 49483, 46956, 89043, 20891, -105507, -113915, -107993, -68338, 118616, 110164, 120107, 66361, 103393, 9700, -10523, 57915, 118697, 65173, -14513, 85975, 74036, -33850, -60686, -36477, 73900, 105823, 164619, 159131, 121426, 193708, 92841, 19574, -131657, -69286, 139620, 198190, 200950, 168100, 162890, 199723, 162482, 49820, -5466, -148213, -157083, -93831, -44864, -145870, -17090, -134, -17408, 37885, 5759, 22165, 24048, 67010, 95076, 37674]
14824C7674k9691j13958L0319j61123N6029Q2788J09327J65926p8329q7915j8162
14813g115j99688N731J29669q3636R8836J29988n0137r7561R2057J0267J2377
14802D0788J5723R8647n9376M6413N1969j27342k1530J11495q8295j8501J2016
14791F2007M7646J3211j29062q9880l7057k1198Q7315J57134J14140m4256r2131
14780F7869J03687k7735J0253p0232p530j7907j38666o3279R6018J28402J65528
14769B46408m6484K722j61593j55090K4117J67229R101J2913j1369J4056J4759
14758A16769P0736K4938r2718P7424M6040O6472p7495j20701p2388N5973q4680
14747A0370n8499K7454M418m702J027j7334R7385P7534k0402M8864k0730j51992
$$ y = [37674, 7983, -105975, -75656, -236779, -180750, -97962, 11365, 177291, 98962, 11047, -7115, -206803, -201072, -71403, -155039, -56203, 73785, 23648, -73913, 18144, 28411, 40788, 56511, 155158, 95782, 142195, 194164, 66822, 45292, 156787, 68492, 49991, 62007, 109653, 122864, -6198, -96078, -133135, -154333, -67018, 90116, 204256, 160000, 67869, 171556, 143821, 154074, 83842, 76312, 58405, -80261, -143540, -47522, 80880, 246408, 199924, 202646, 41053, -114037, -89920, 77309, 86410, 99323, 87954, 102010, 116769, 187505, 212443, 119725, 197149, 243189, 309661, 232166, 111465, 39077, 95050, 10370, -48129, -20675, -16257, -20959, -19932, -37266, 60119, 137653, 117251, 166115, 145385, -6607]
14735f607r4814m5686o0844J71383K02472K8520o1237l845K964l4008m2647N9454
14723A15105j07105L8652L7335N8716L9025p2667j22724m7875P3912m4853N6969
14712B4490J6595l8785J80735L1635p9767j5310m6045j9084J42422L6565j64633
14701F8818j66480Q3467J47711l8637n5934N4963n2915N8229J24615l537q5251
14690A35049j06020P9550J14731j62799j71885M1925Q8859l8748k1370J15563
14680G4855K38779n8865k6339O7641o838n7649o7266q0283r2821K3403J19675
14669A34292J17732J39690p6837j11055j98013n7765O5854J52998J23082p0160
14659B19818J0131k4884Q5729M0539j02007j3773J0574l1974O5663o4610j60439
$$ y = [-6607, -101421, -147107, -207951, -36568, 165904, 194424, 133187, 129342, 132306, 98298, 55651, 115105, 8000, 46652, 83987, 142703, 181728, 109061, -13663, -61538, 12374, -32479, 24490, 41085, 2300, 183035, 214670, 134903, 119593, 73548, 54464, 196886, 233451, 68818, -97662, -14195, 133516, 94879, 38945, 93908, 40993, 99222, 223837, 220300, 135049, 29029, 108579, 223310, 60511, -111374, -69449, 19410, -19338, -40708, 74855, 313634, 254769, 228430, 296071, 289233, 231584, 164318, 84035, -8786, 14617, 134292, 252024, 391714, 314877, 203822, 5809, -51956, 13898, 166896, 289978, 219818, 229949, 205065, 290794, 331333, 229326, 215553, 226127, 194153, 259816, 195206, 34767]
14648C4767n7179N0018J33027l3793o7510J16401L4952L1327O8121R7053n9582
14637C47602m7813r4367J55952J29511o9855L3821J73910N6712J35118M1238J25980
14626I87809R4167o2421q1813j53424j35173j97070J41434N8018n9769m0237j09814
14615D41707j6134P770j8879j28059m7434K711n9410j0822M1008j38247j17766
14604d3555L8078P2938O9378j63219n4914R6990R8187M9411n3723j00698k7019
14593a8146L9582L9635r5716q1884n888M1767j7145O1869J2568j3108N1331N4605
14581F9470L4455j8595O2441J6356l7317L0812L5843p4553P9916P9350j14060
14570A64118j11215p6289K5993j23073J5624M8341k6769K35714J27464l6346q2626
$$ y = [34767, -22412, 27606, 160633, 126840, 59330, 175731, 210683, 242010, 310131, 407184, 347602, 299789, 205422, 361374, 490885, 421030, 454851, 628761, 685473, 820591, 861829, 987809, 1081976, 1019555, 937742, 784318, 649145, 452075, 593509, 651527, 591758, 551521, 441707, 425573, 433343, 414464, 286405, 238971, 241682, 182272, 171450, 212458, 74211, -43555, -5477, 67461, 136839, -26380, -81294, 15696, 113883, 163294, 109571, 8873, -18146, 21436, 61071, -34645, -116529, -122417, -80650, -97795, -35926, -23358, -36466, 14865, 69470, 103925, 85330, 147771, 164127, 126810, 157622, 193465, 118912, 198828, 278178, 164118, 52903, -23386, 2607, -120466, -104842, -56501, -83270, 152444, 279908, 243562, 160936]
14559A60936o9792O3092r7589r5229O7605j07033K2617L1067L7640K09m0554o0300
14547h7331m6867J74841M1952n7318k8585k9390K6629n8198J25782r1847j8252
14536d8584J58500m4287j60105m9396q3930j10922M7576J21446K02773J17156
14526A50227O1873l4767k7578p9252m5721p4019j11576j32628R8995J78332Q0100
14515F3986R1075p7711O277q1594q2723o2187P7871K05038k9735m7769o2212M8677
14503D8993P4268J22367N8222Q814j5858P175j24341j99077k3645R9005L7392
14492I3315N0351K2146j59559n0805J11778n8057j70053M5447J43019o9082j2802
14481e4302J14220R2795J4677L1052K3215K1244l149J67261Q2349o2524j12360
$$ y = [160936, 91144, 154236, 56647, -38582, 29023, -78010, -55393, -24326, 13314, 13523, -27031, -87331, -134198, 40643, 82595, 25277, -3308, -32698, -6069, -64267, 61515, -30332, -48584, 109916, 65629, -94476, -143872, -227802, -338724, -291148, -169702, 33071, 150227, 212100, 177333, 149755, 70503, 24782, -49237, -160813, -293441, -194446, -16114, 63986, 155061, 77350, 83627, 2033, -80690, -142877, -65006, 140032, 110297, 62528, 316, 48993, 123261, 245628, 303850, 312664, 296806, 303981, 179640, -19437, -43082, 55923, 93315, 143666, 165812, 6253, -44552, 67226, 9169, -160884, -115437, 27582, -41500, -54302, 59918, 152713, 167390, 198442, 221657, 242901, 239752, 407013, 489362, 426838, 314478]
14470C14478j07815j9462Q2897p2993R2174L05190J27788j52609J4943J37873
14460G22464K15487N1938m6223J08580N8054P0754l3412j86589l5859k33905k64557
14449D26732M4986j4392q8734j01342K377L017r2403J2606j85094n2367O5563
14438B0949J43693j1496K5256P9505j13031j05546J17614N2292J6329k5339m7011
14427A53215m7703j19907L1698M2753J0699j0734k0086r3750m2243J71066O3671
14416A38679j11753O5960J16252O9880O7539n4741n7874j34803K8518J54172Q5649
14405C67478R606q4511q926Q7519P9165j18049j48974q9066M3491M0390r5137
14394H2986j0360k4043O2603M7172m5645Q5383P7133o4364k3159Q0256j29010
$$ y = [314478, 206663, 187201, 270098, 197105, 289279, 594469, 722257, 569648, 584591, 722464, 937951, 989889, 943666, 1052246, 1110300, 1181054, 1147642, 961053, 925194, 691289, 426732, 471718, 457326, 368592, 267250, 269627, 272644, 180241, 192847, 7753, -44614, 20949, 164642, 153146, 178402, 257907, 144876, 39330, 156944, 209236, 225565, 200226, 153215, 105512, -14395, 17303, 60056, 70755, 60021, 39935, -53815, -96058, 75008, 138679, 26926, 92886, 209138, 279018, 346557, 291816, 233942, 99139, 127657, 281829, 367478, 377084, 292573, 283647, 371166, 450331, 332282, 183308, 94242, 137733, 178123, 82986, 72626, 48583, 111186, 158358, 112713, 198096, 275229, 210865, 187706, 267962, 138952]
14383A38952j84722M3674J63229J7911m9806l9139q2801o1385O3471Q9942O5938
14372A65264j48487q8586N9269q7037l0418P8440n1900J10310m1911m5681L8845
14361d1892j7705P1350l4967q4156P539K05246r0699r3563J59110p266L6402k1973
14349H7426j01507o643K4808J23381J15448q6813j48713O0908P7176R7032O7772
14338C10275j06877j3052K6287j3537O1355P4671k39631j06651M2323l9844l1006
14327c5687P2294k0745j021j194j7806l1417J43370m5760K1215m7050O075J03433
14315A45707J31816N0258j41583p7766m6802n3525k7256O1824K1731J20277k160
14304A82521J605j5771j31634o4462K456J37866P4676N555J2921J12020r5082
$$ y = [138952, -45770, -2096, 161133, 179044, 129238, 90099, 7298, -54087, 9384, 99326, 165264, 16777, -71809, -12540, -99577, -129995, -51555, -103455, 6855, -35056, -80737, -41892, -59597, 11753, -23214, -107370, -99831, 105415, 14716, -78847, 80263, 72997, 109399, 87426, -14081, -20724, 4084, 127465, 242913, 156100, 7387, 68295, 145471, 242503, 310275, 203398, 190346, 216633, 203096, 264451, 339122, 99491, -7160, 35163, -4681, -35687, 36607, 15862, 14841, 13647, -4159, -35576, 107794, 62034, 83249, 36199, 42274, 145707, 277523, 327781, 186198, 108432, 61630, 8105, -19151, 42673, 64404, 184681, 182521, 184126, 168355, 36721, -27741, -25285, 112581, 187257, 192812, 205733, 317753, 222671]
14293B22671p9192r4082m7538J7352M3621J2253J09391q4256q7983J03566J69819
14282B85622Q3411n6992J2280P7582j26120n3359m5384o0101J28615J84064J81844
14271F11462m5854j22653j0834N5645K9997k7046M636j65252p8284Q867o8127
14260A92557M0525M301q353M5163L5446k2006N9404j0231k3357n5116j3082O7200
14248C12451m3790k9654l9487N1827J32247O3295M0733l8966n9548m225l2944
14237C51939O9986M5747J4333N6437L1606l8879J36619M6406N8552n633J0113
14226G77226m828j53926k7236R0510J69689L0933j54555j7362O7564m7122L5919
14215G66812j18002J5380J7564M5598K907J42621J00350l3260N3340j11106o2482
$$ y = [222671, 143479, 49397, 1859, 19211, 62832, 75085, 184476, 100220, 12237, 115803, 285622, 369033, 312041, 324321, 401903, 275783, 222424, 177040, 116939, 245554, 429618, 611462, 565608, 442955, 432121, 487766, 517763, 490717, 495353, 330101, 251817, 260684, 192557, 233082, 237383, 229030, 274193, 309639, 287633, 347037, 336806, 313449, 258333, 245251, 312451, 268661, 239007, 199520, 251347, 383594, 446889, 487622, 448656, 389108, 384883, 351939, 421925, 467672, 482005, 538442, 570048, 531169, 667788, 714194, 772746, 767113, 777226, 772398, 618472, 591236, 681746, 851435, 882368, 727813, 710451, 778015, 730893, 766812, 648810, 664190, 681754, 727352, 730259, 872880, 973230, 939970, 993310, 882204, 819722]
14204H19722n2045N294J58344J16302p7196m0112Q7473k2187P2773K22741J60694
14193A451803M2718n3246L7914J13283j136N8615K9936J03232J30568L1489N2130
14182A997306K05437K29307R3566Q8708J39183O2644K85077K72597K99408L18134
14172C991367L32244L78870L64706K48038M69853O11263O38006P62201R21672
14163H718220J039192J116686J277188J538637J751544K104879K366718L041417
14155B2954481L703744M991910O701615Q804300J2039840J5515269J9004278K1612559
14147A15327996K2012233J9882033J5269625P890425m77041q455826j5459482
14140A55989963k0220365k2096826k1319854j8694466j5249796j1873606q831817
$$ y = [819722, 767677, 772971, 931315, 1047617, 970421, 930309, 1017782, 995595, 1068368, 1291109, 1451803, 1494521, 1441275, 1479189, 1592472, 1591336, 1649951, 1679887, 1783119, 1913687, 1945176, 1997306, 2202743, 2432050, 2525616, 2614324, 2753507, 2816151, 3101228, 3373825, 3673233, 3991367, 4323611, 4702481, 5067187, 5315225, 5785078, 6396341, 7034347, 7796548, 8718220, 9757412, 10874098, 12151286, 13689923, 15441467, 17546346, 19913064, 22954481, 26658225, 31650135, 38351750, 47156050, 59195890, 74711159, 93715437, 115327996, 137340229, 157222262, 172491887, 180382312, 179905271, 171449445, 155989963, 135769598, 113672772, 92352918, 73658452, 58408656, 46535050, 37703233]
14133C7703233o606674n052616l897422k891395k341503k082625j681946j427728
14125A1721324j530140j332333r92364q90327q42920p24674o08313m18427l78650
14116D003176l62545k73322k34397k25366j45571l36449k20398k6136j14234j09298
14106A955460r1246k80166j40539q8346L9497N9210j41335j42307k4897J5265
14096A160596L9628j07442m9418K1076k6241k21310N5963P153n6570o4991o2077
14085F96367k20666j16912P6998J9410k4379j02426O5947J34318j2068J7023m8691
14074D84921n8688j78602j19389R3044P1691J89045M1602j33712j49242j51890
14064H8780j0151L1183J94939J04827n9198k7842M6487j40117r0830j5565L1540
$$ y = [37703233, 31096559, 26043943, 22146521, 19255126, 16913623, 14830998, 13149052, 11721324, 10191184, 8858851, 7866487, 6976160, 6133240, 5408566, 4800253, 4381826, 4003176, 3640631, 3367309, 3132912, 2907546, 2761975, 2425526, 2205128, 2178992, 2064758, 1955460, 1864214, 1584048, 1443509, 1355163, 1394660, 1453870, 1312535, 1170228, 1145331, 1160596, 1200224, 1092782, 1043364, 1064440, 1038199, 816889, 872852, 880005, 823435, 758444, 696367, 475701, 358789, 435787, 455197, 430818, 328392, 394339, 528657, 516589, 533612, 484921, 426233, 247631, 128242, 221286, 292977, 482022, 523624, 389912, 240670, 88780, 78629, 109812, 304751, 409578, 350380, 322538, 369025, 228908, 138078, 122513, 154053]
14053A54053k154n4177j736N9368m7934l5973m9762J0787j2036L0446M7639K4661
14041A23182L1957Q0329q133j53178q0759P1138J38894K0068l1948L2851j25458
14030I8943J9308m1140q824o2770p8425K14021M7929p6946J06468N8511J09137
14019C86212O0659j36483j08578j70420J575J85339k2275j11293J10884m1097
14009A54523q2023M5491M9881J34737j49214p4987L4425K3726j06470o060k1345
13998B684O1599J28611J0768j44079P0292K388q1468j41867p316J19433K00357
13987B21402L7416m970Q6280O6334j58678j08701j01898N1578J43472k4356j60548
13976D7331l3268J26042j4049l1598n1313j13328j10021O3761Q0541J12733R9122
$$ y = [154053, 151899, 97722, 95986, 155354, 107420, 71447, 21685, 32472, 20436, 50882, 98521, 123182, 155139, 235468, 227335, 74157, -6602, 64536, 203430, 223498, 191550, 224401, 98943, 118251, 77111, 68287, 5517, -72908, 141113, 189042, 112096, 218564, 277075, 386212, 446871, 310388, 201810, 31390, 32965, 218304, 196029, 84736, 195620, 154523, 72500, 117991, 167872, 302609, 153395, 78408, 112833, 136559, 30089, 24029, 2684, 64283, 192894, 203662, 59583, 129875, 132263, 50795, -91072, -98388, 21045, 221402, 258818, 253848, 340128, 406462, 247784, 139083, 37185, 88763, 232235, 207879, 47331, 14063, 140105, 126056, 94458, 43145, -70183, -180204, -116443, -35902, 76831, 175953]
13965A75953l5250l9206M77J74346O5167m759r055j23101j39263J8928p862P1856
13953A48231J4616n4251j34636j36952O507K3295J06755K8974L0570p9531k4942
13942g1364J9372m1720j3191J82493J35025m8074j72258k9125O7151m1894J1009
13931b576J07164M952p6911j46198M469J33204J09818N3284l3509j07395n2355
13920f053N1128j06193n4571J07006m9268q6649J01196J20845o3033k19381N6954
13909a48019J13083k6510l8872P0442J24845N2549Q4624o4212j08691j04743k0218
13898f5722R2173r3974L4326n8858L2583O1522J3702N0139l6766k8981L5834K0956
13886E6934J5640L3057n8118q9324K13308O7570m3309j49829j79712K6405N2910
$$ y = [175953, 140703, 101497, 101974, 276320, 341487, 336728, 327673, 204572, 65309, 84237, 76375, 148231, 162847, 108596, -26040, -162992, -156485, -133190, -26435, 2539, 33109, -46422, -71364, -51992, -93712, -106903, 75590, 210615, 162541, -9717, -38842, 28309, -13585, -2576, 104588, 109540, 32629, -113569, -109100, 24104, 133922, 187206, 153697, 46302, -6053, 45075, -61118, -115689, -8683, -57951, -144600, -43404, 77441, 14408, -204973, -148019, -34936, -61446, -100318, -29876, 94969, 147518, 232142, 167930, 59239, -45504, -65722, 26451, -67523, -33197, -92055, -59472, 2050, 15752, 65891, 29125, 144, 35978, 56934, 72574, 105631, 47513, -41811, 171497, 239067, 195758, 45929, -133783, -107378, -54468]
13875e4468O8139Q6601q6184j30739j31181p27J84054J58332l6978q0208j8243
13864d1602j3394j7848J6554L7937K7110l070j2489J91065j01768m1921q2117
13853d1543o0440Q8102l0495p129J32513k9326j08182K6715Q5525p235m9968m5345
13841d6808R1094j45742o5813r114J6821k0719j01768p4060O6006N0722J50017
13830h9364J32164j0284p2307J74921R7183j23974K3377m8709q121J74413M5290
13819B94589j34066m9646j33501j42177o4273J12920L8580k6391R8669K4802O4828
13808H4334Q4855k2501n8474L2166j38942j14841J5789K8001p210m6410j03324
13797b46557P8212J66852O9442m8915o1582j04743k3828l4731n0967O0128O7232
$$ y = [-54468, 13671, 100272, 14088, -116651, -247832, -248559, -64505, 93827, 56849, -23359, -41602, -54996, -72844, -56290, -18353, 8757, 5687, -6802, 184263, 82495, 40574, -41543, -101983, -13881, -44376, -51505, 81008, 51682, -56500, -29785, 55740, 48505, -1463, -46808, 44286, -101456, -167269, -176383, -159562, -180281, -282049, -356109, -290103, -239381, -89364, 42800, 32516, -39791, 135130, 232313, 108339, 131716, 83007, 74886, 249299, 294589, 160523, 110877, -22624, -164801, -229074, -116154, -77574, -103965, -5296, 19506, 84334, 169189, 146688, 88214, 120380, -18562, -133403, -117614, -89613, -96823, -143233, -246557, -168345, -1493, 67949, 19034, -42548, -147291, -171119, -205850, -256817, -196689, -129457]
13786a29457J4032j7J8064J56588k1245j03311j54941j1856R2464J20725M2531
13775B3577J1183J05031j00754m5607m7919J98177m774j3326r4248j0408K07846
13764B28778L161p0775j02526O9676J5381l4640j80024m2197m3931L6793J06413
13753a3891m5456k2792l4252o4638P0978k2112M322J12857p966k7244R8212L972
13741E1990L5477n2505J46244k2170j51751K7868k3011m0377O3062o3694p4246
13730a03113p3251J58656R179K6747n1826j52688K1346K357M7778O6440j52184
13719b00559l5001J15231R7457J09860O6515K34028K5172j46659k8247O007j45213
13708I8591m3930l0546n3176J7257R9178J96210L2611k52151o1485m606j02278
$$ y = [-129457, -115425, -115442, -97378, 59210, 37965, -65346, -220287, -232143, -139679, -18954, 23577, 34760, 139791, 39037, -6570, -54489, 143688, 138914, 125588, 31340, 20932, 228778, 231939, 161164, 58638, 128314, 143695, 109055, -70969, -113166, -157097, -120304, -13891, -59347, -82139, -116391, -181029, -110051, -132163, -127841, -14984, -22950, -50194, 48018, 51990, 87467, 34962, 181206, 159036, 7285, 35153, 12142, -28235, 34827, -28867, -103113, -176364, -17708, -8529, 18218, -33608, -186296, -164950, -162593, -114815, -48375, -200559, -235560, -120329, -22872, 86988, 153503, 387531, 412703, 266044, 237797, 243804, 98591, 54661, 24115, -29061, -11804, 87374, 283584, 316195, 64044, 2559, -2047, -104325]
13697a04325l4200J23962L2949q7369j8476R0513j9324k19861j16377J66450J27700
13686e8358O4134m6362J79480J48690Q0051j01801n8859j54254m2481o8788q5000
13675a43548L9322j8710Q62K5774M3356J12536M1054q7049r341Q2646j2237L9301
13663A13966j9691n7290J26097J15908J71773K01076K58837q349j58115p5708
13653F68504k4711l3455n2304q1771L632j5872r6143j9144j19271q5629k6530
13642A17306j48848j47968M8286L4582M43N2526q7283m1619J37241l7279l452
13631g6065n92j29392J33698K01174M1104q1144j91473j30402q101J45259O7708
13620b8226j28489r7392J5302P495j863J0043R7965O4106Q6833j68543k7727N0057
$$ y = [-104325, -138525, -14563, 18386, -68983, -87459, 3054, -16270, -236131, -352508, -186058, -58358, 5776, -40586, 138894, 287584, 367635, 265834, 206975, 52721, 10240, -58548, -143548, -104226, -122936, -122074, -96300, -52944, 59592, 100646, 13597, 4256, 86902, 74665, 113966, 94275, 36985, 163082, 278990, 450763, 651839, 910676, 902327, 744212, 668504, 643793, 610338, 558034, 476263, 479895, 464023, 367880, 348736, 229465, 143836, 117306, -31542, -179510, -131224, -96642, -96199, -43673, -130956, -172575, -35334, -72613, -76065, -76657, -206049, -72351, 128823, 169927, 88783, -102690, -233092, -241193, -95934, -28226, -156715, -254107, -238805, -231310, -233173, -223130, -125165, -61059, 25774, -142769, -170496, -120439]
13608a20439n934k1806J52367M7629Q2083p138j13074p043Q009j62407J9848L6538
13596i1367r977N4838O6396p3636o4210J8742j70307p9899Q8831L9461O3891J37851
13584a9386k4655L1717O4608k4646O7315Q8499J51232k07m7196p9967J7103l6892
13572A87525j73636j38789O5595R4543O8729J3192l0063O8592J33767j54194l3849
13561A01412J173j23638r9570L8707l1961o2840O6343O2383L4635j6614j6349
13550d6319Q2384k0627j02576m1260j21734Q6640L0969J30639K4647j3048R6520
13539A06235j10573o0381q69M2587j89889j06765J05241N8070O038J5617N0775
13528h3914J45183Q7021q3846p5546m3999k0Q0488k4163q7233K7206J47021l5072
$$ y = [-120439, -126373, -148179, 4188, 51817, 133900, 126762, 13688, 6645, 14654, -147753, -127905, -91367, -101344, -46506, 19890, -53746, -117956, -99214, -269521, -349420, -260589, -221128, -157237, -19386, -44041, -12324, 52284, 27638, 94953, 183452, 334684, 334477, 287281, 207314, 224417, 187525, 13889, -124900, -59305, 35238, 103967, 117159, 87096, 155688, 289455, 135261, 101412, 102585, -21053, -120623, -81916, -113877, -176717, -110374, -47991, -13356, -29970, -46319, 36065, 15438, -87138, -128398, -250132, -163492, -132523, -1884, 22763, 9715, 106235, -4338, -64719, -65588, -23001, -212890, -319655, -214414, -156344, -150306, -134689, -83914, 61269, 148290, 64444, -11102, -55101, -55121, 25367, 1204, -86029, -58823, 88198, 53126]
13516E3126j03759m7041n854J72101M5324j12468k4937l7235O6011J31200q1789
13505E4679n9417j02473r8974l2945P5663J15041J22782J23276k15404j29050
13495a46822Q9052k7328j7707p6376P1677k282J2180N4910q6284R2079k850j38926
13483a78677L1283L7712J27871n716p1251j40145P9405O3963r9610M5784P8895
13472c0486l1099p6740N673N1042M60L6034j06792p05J57772J91544n7199j39982
13460d78M6080l5594o2307J25069P3239J1608j14661j68082K8427Q0939k8630
13449d4390J58574J26215m6841j44798P6733M9386p3847r3599k9028l9566R81
13438f0180m8279j50952j12181J05146K08010n6690P9969L6350n0325p7398j15388
$$ y = [53126, -50633, -97674, -103528, 68573, 113897, 1429, -23508, -60743, 5268, 136468, 54679, -4738, -107211, -206185, -239130, -163467, -48426, 74356, 197632, -17772, -146822, -57770, -85098, -102805, -179181, -107504, -109786, -97606, -42696, -128980, -36901, -39751, -178677, -147394, -109682, 18189, 12473, -58778, -198923, -119518, -55555, -155165, -109381, -30486, -61585, -138325, -132652, -81610, -81150, -45116, -151908, -152613, 5159, 196703, 139504, -478, 45602, 10008, -52299, 72770, 146009, 157617, 42956, -125126, -96699, -15760, -44390, 114184, 240399, 193558, 48760, 125493, 174879, 101032, 7433, -21595, -61161, -60180, -108459, -259411, -371592, -266446, -58436, -115126, -35157, 1193, -49132, -126530, -241918]
13427b41918M2076K04577J34605J04001n7224j01922o5331q2542M9894k7113n3790
13416i4687J19394O9903j46317q9788j3525J36759m382j12123o5284L03J9019
13405a80728O2658L9384J17990r4998l6597j1253L1925J21789j5354r376p0295
13394d4855J11961M0494k23846M5118j08992m5777J5343O5195J00276J7315J53055
13383A25287J02423j30685j78627M7413k4210r9831m2708O2314M291K17769P9863
13372A63299n0229l557l1426J4303o0265p1272k4063O5157j7620J6164J12717
13361A13208N4939O0218M4677L227K1999j46087r4064j19283j9691R8066j64483
13350a47274j06984L3996M3067K35811O0874J5279k5672n0258p2200J8146j18414
$$ y = [-241918, -199842, 4735, 139340, 243341, 186117, 84195, 18864, -63678, -13784, -40897, -94687, 24707, 94610, -51707, -141495, -155020, -18261, -22643, -134766, -200050, -199747, -180728, -118070, -78686, 39304, -55694, -92291, -103544, -71619, 50170, 34816, 25440, -44855, 67106, 107600, -116246, -71128, -180120, -225897, -210554, -145359, -45083, -27768, 125287, 227710, 97025, -81602, -34189, -58399, -158230, -200938, -138624, -134333, 83436, 163299, 113070, 109513, 78087, 92390, 32125, -39147, -63210, 1947, -15673, 491, 113208, 168147, 228365, 273042, 276269, 298268, 152181, 58117, -61166, -80857, 17209, -147274, -254258, -220262, -177195, 58616, 119490, 134769, 109097, 58839, -13361, 4785, -113629]
13339a13629j6272Q2916k2404j4989k1278M9756J35692o0280L3933J33892o1517
13328A25820k7160r7017j69593m8066m6097J41280J14640J93498L4164j55603
13318F5866j49396q8954l4954J42274J87300K9665n1944j69611o5802M1063R3467
13307a026Q9658k8313r1571L689J9406Q6729R4033q8735j79021K4596P2948K1441
13295B3834q2216P9624J47334J05387j08875j74960j1796O8015k1073j45500O0603
13284e9623J06117m6268o0529K24110R4037q0592p9053J01521k2880M8359q1478
13273A43721j22678m4435k2997q7580Q2134O3448k9282r1544o3211o8150M1084
13262a99490o9446J655J29024K17442Q7800j07800j40089k693n8577m04k1852
$$ y = [-113629, -129901, -46985, -69389, -84378, -105656, -55900, 79792, 19512, 53445, 187337, 125820, 98660, 1643, -167950, -216016, -262113, -120833, -6193, 187305, 221469, 65866, -83530, -172484, -207438, -65164, 122136, 151801, 99857, -69754, -135556, -94493, -1026, 88632, 60319, -31252, -27563, -8157, 78572, 172605, 83870, -95151, -70555, 2393, 23834, -58382, 21242, 168576, 273963, 165088, -9872, -21668, 46347, 25274, -120226, -59623, 46494, 226, -60303, 163807, 257844, 177252, 98199, 199720, 176840, 225199, 143721, 21043, -23392, -46389, -133969, -51835, 11613, -17669, -109213, -172424, -240574, -199490, -268936, -267281, -138257, 79185, 166985, 59185, -80904, -83597, -142174, -142578, -164430]
13251a64430J5506l5418R426M7746J36305q755m1819q6198O3172K444J4430K4800
13239b2791o1569J2965P9016K742j05887k4368p37M2092l836R9930R0723L7646
13227A45926l3994N9938J02717q2475m0338O8379k3774r9649K9928J90232m8303
13216B68587K0139j39839k44520o4036K06271n581L1463l5526M2233k5815j37064
13205h3688j19534J37594K8745J6106K7520p9810o2569K1509K1435J24001J2093
13194D3402q0511o6554J19436q9306q2916n607P4085j4851J12878J13328k1528
13183A01856k27404j25118P1250P7591J05977J44626j00172m3996j908J0638l8486
13172b5146p6456k1907J01134K5980L4566O7645O7792j28853o2005k0073M1861
$$ y = [-164430, -148924, -184342, -174916, -127170, 9135, 380, -41439, -127637, -64465, -62021, -47591, -22791, -84360, -71395, 7621, 10363, -95524, -119892, -120629, -78537, -82373, 17557, 108280, 145926, 111932, 171870, 274587, 192112, 151774, 220153, 196379, 96730, 126658, 316890, 268587, 288726, 148887, -95633, -159669, 46602, 41021, 72484, 36958, 79191, 53376, -83688, -203222, -65628, -36883, -20777, 6743, -73067, -135636, -114127, -92692, 31309, 43402, -37109, -103663, 15773, -73533, -156449, -162056, -87971, -102822, 10056, 123384, 101856, -125548, -250666, -179416, -101825, 4152, 148778, 48606, 4610, 2702, 13340, -25146, -101602, -123509, -22375, 3605, 38171, 105816, 173608, 44755, -17250, -37323, 4538]
13161D538O2398P196M7649k5160p2366L8400n1839q9748m5551m6316r3259j1955
13149b76013J21787K5937j1908l1810M1359J62794J13837j9294l5646K1011m395
13138A07659J0273R4738q853j29275k6671j9444q0742J00832J80302N7932j06429
13127A80322Q6661R152j40760L2025R5952n1751j75470j46893j14726l5509J37745
13116a23252Q1664K6162Q5016j28188m1614n3440m7053L8829n1549N1549R1773
13105g0103l3369o0860q9232j6796J4268M6283Q7834K882q4776k2020J36410m0880
13093a30359o4641L2459J85256j22408p5771J07831j4838l6793R7835M1092j50010
13082a30347n6268O612K51183P6373o526l7391k30689r4345O389j2132L2008J91560
$$ y = [4538, 66936, 74132, 121781, 96621, 24255, 62655, 10816, -78932, -124483, -170799, -264058, -276013, -154226, -128289, -140197, -172007, -130648, 32146, 145983, 126689, 91043, 112054, 107659, 117932, 212670, 203817, 74542, 47871, 28427, -52315, 48517, 228819, 286751, 180322, 266983, 276135, 135375, 167400, 263352, 211601, 36131, -110762, -225488, -260997, -123252, -41588, -15426, 69590, -58598, -100212, -153652, -200705, -161876, -213425, -161876, -70103, -103472, -164332, -253564, -270360, -256092, -209809, -121975, -119093, -203869, -225889, -89479, -130359, -195000, -162541, 22715, -99693, -175464, -67633, -82471, -119264, -21429, 19663, -130347, -186615, -180003, 71180, 147553, 141027, 103636, -127053, -221398, -215009, -227141, -195133, -3573]
13070c573o5489j3811N1403J03014k8343j24172K5419P7894j09241o8138m5626
13059b00663J7278P9524O4541K3336j6666p8353l7434K7808J0604j1056j34338
13048b55419L3007J22854J41463Q9476J22707j21192k3555K8531r5588j79684
13038a37400q1476k6626J02023l0402Q3649N206N3578j7951j84321j08756J00635
13027b41841N171M7578P9815L1365L0614J21013K3872j83498M7023N9341Q0901
13016A01354j31117l0065O8838k0260j40020m0640M143J33633L7729m8916k3897
13005h9218j1588j00876l8233L4551M7099P4134P3431N1534j8869k2768j62423
12994a63226J8424n3242J9753q8090o5993o627R7775N4212J09653J75963j8852
$$ y = [-3573, -69062, -82873, -31470, 71544, 43201, -80971, -55552, 22342, -86899, -155037, -200663, -183385, -103861, -39320, -15984, -32650, -111003, -148437, -120629, -110025, -121081, -255419, -222412, -99558, 41905, 131381, 254088, 132896, 109341, 137872, 42284, -137400, -218876, -245502, -143479, -173881, -90232, -85026, -31448, -49399, -233720, -342476, -241841, -236670, -189092, -109277, -77912, -47298, 73715, 97587, -85911, -38888, 20453, 101354, -29763, -59828, 9010, -11250, -151270, -191910, -187767, -54134, -16405, -65321, -89218, -100806, -201682, -239915, -205364, -158265, -84131, -10700, 40834, 21965, -803, -163226, -144802, -198044, -178291, -266381, -332374, -339001, -241226, -187014, -77361, 98602, 79750]
12983G9750j37138n9253O9912P2660m1551j63221K9039R8805l0740L0848M596
12972d6293l0485K28157L6309j55038o4994j7144P0236j11809l4631J51058j54760
12961a29394p1756j3776J52499J19996n0075j18725j9108J0627r0814K109J07418
12950a00999M7950R2816R5217J02503L7911q2271r2181P746j30394k8703K7698
12939b2707M9818l983o2483r3056L303L9448m9853q3317P7150J02198Q8785j1240
12927C4063j29419K9081K8561P0039R4578K8145r1123j28282J4176R9092k2388
12916B6523J27393l4373m6822Q1820p1535L7260r92j25487m6644r9562J41677
12905a0742o360J0724L5763P6221m5177j01597r4269j00978k3307K5040J09137
$$ y = [79750, -57388, -116641, -46729, 25931, -15620, -178841, -149802, -50997, -81737, -50889, -46293, -76778, 151379, 187688, 32650, -32344, -49488, 20748, -91061, -125692, 25366, -129394, -201150, -214926, -62427, 57569, 7494, -111231, -130339, -119712, -210526, -208417, -100999, -53049, 39767, 134984, 237487, 275398, 193127, 100946, 108692, -21702, -50405, -22707, 27111, 23128, -39355, -132411, -129108, -89660, -139513, -222830, -145680, -43482, 45303, 34063, -95356, -66275, -37714, 32325, 126903, 155048, 63925, -64357, -50181, 48911, 26523, 153916, 119543, 72721, 154541, 83006, 120266, 119274, -6213, -52857, -152419, -10742, -17102, -6378, 29385, 105606, 60429, -41168, -135437, -236415, -259722, -234682, -125545]
12894a25545K57279R7243n919Q3238N0162j51926k26074p9245K5886N4357Q2438
12883F1894K6581N8068j70505m018O0202K7701j3930o0592j4885M6898p7303k2413
12871h2302R4227l8719j51608j08248J8378m9814r393P937l4708J55474J93021
12860e755j9145m1468r1128Q699J48931J30596J39243j27102j10425j77359n4961
12849a99874n570M1603J81762p8346R2817M1350P7211m3695j76758l5562N8660
12838d6402k4134M3083Q2891J62081K5389q4249k21533j30214P754J474L4181
12827a49679L1428Q4357j5247j42808J04380P9559N259J338p3798j3024J99257
12816A11022Q27k17746n313j4124k2180m8872j33116p8910L9495J32156M7293
$$ y = [-125545, 131734, 228977, 223058, 306296, 356458, 204532, -21542, -100787, -74901, -20544, 61894, 88475, 146543, -23962, -27980, 32222, 59923, 45993, -14599, -29484, 17414, -59889, -82302, 11925, -26794, -178402, -286650, -268272, -318086, -327479, -319542, -354250, -198776, -5755, -24900, -66368, -157496, -148797, 134, 130730, 269973, 142871, 32446, -144913, -199874, -205444, -163841, 17921, -60425, 32392, 73742, 150953, 107258, -69500, -105062, -46402, -70536, -27453, 55438, 217519, 242908, 158659, -62874, -193088, -185334, -183860, -149679, -118251, -33894, -49141, -191949, -87569, -8010, -2751, -1413, -75211, -88235, 111022, 111849, -105897, -111210, -125334, -147514, -196386, -329502, -408412, -368917, -236761, -189468]
12805a89468M0347Q241L4041K6745N1740J18946j12568n5610N7324r0837j18241
12794b29340L506J03797R6099l4709l731Q8129J13694K08712j3374j53031l2518
$$ y = [-189468, -149121, -140880, -106839, -80094, -28354, 90592, -21976, -77586, -20262, -111099, -229340, -225834, -122037, -25938, -60647, -64378, 23751, 137445, 346157, 332783, 179752, 147234]
$$ [...]
##END NTUPLES=NMR SPECTRUM
##END=
