##TITLE=Analysis number 329089
Compound Code cc 67401
Book Reference 511/172
Project Code adrs
Chemist Name stevem
##JCAMPDX= 6.0         $$ Bruker NMR JCAMP-DX V2.0
##DATA TYPE= NMR SPECTRUM
##DATA CLASS= NTUPLES
##ORIGIN= Bruker BioSpin GmbH
##OWNER= nmr
$$ XWIN-NMR		Version 3.5
$$ Tue Jul 31 09:46:56 2007 GMT Daylight Time (UT+1h)  MAYBRIDGE\nmr@NMR_250MHZ
##.OBSERVE FREQUENCY= 250.131544655141
##.OBSERVE NUCLEUS= ^1H
##.ACQUISITION MODE= SIMULTANEOUS (DQD)
##.ACQUISITION SCHEME= undefined
##.AVERAGES= 16
##.DIGITISER RES= 18
##SPECTROMETER/DATA SYSTEM= dpx250
##.PULSE SEQUENCE= zg30
##.SOLVENT NAME= CDCl3
##.SHIFT REFERENCE= (INTERNAL, CDCl3, 0, 16.522)
##AUDIT TRAIL= $$ (NUMBER, WHEN, WHO, WHERE, WHAT)
$$ ##TITLE= Audit trail, XWIN-NMR		Version 3.5
$$ ##JCAMPDX= 5.01
$$ ##ORIGIN= Bruker BioSpin GmbH
$$ ##OWNER= nmr
$$ C:\u/data/dgb/nmr/ADRS/1770/pdata/1/auditp.txt
$$ ##AUDIT TRAIL=  $$ (NUMBER, WHEN, WHO, WHERE, WHAT)
(   1,<2007-07-31 09:46:27.73 +100>,<MAYBRIDGE\nmr>,<NMR_250MHZ>,
      <created by zg, POWCHK disabled, PULCHK disabled
       configuration hash MD5:
       76 6E 9A 78 1E 09 19 81 EC 84 63 8F B0 6A 59 2D
       data hash MD5: 64K
       41 AE AF 7E C6 0A 2C 92 3E D2 51 C0 5F A3 05 A7>)
(   2,<2007-07-31 09:46:45.61 +100>,<MAYBRIDGE\nmr>,<NMR_250MHZ>,
      <Start of raw data processing
       ef LB = 0.3 FT_mod = 6 PKNL = 1 SI = 32K 
       data hash MD5: 32K
       3A 04 B4 C7 D0 C9 A6 60 13 FE 6E 24 8B 35 8A 1B>)
(   3,<2007-07-31 09:46:47.15 +100>,<MAYBRIDGE\nmr>,<NMR_250MHZ>,
      <apk 
       data hash MD5: 32K
       A4 1D 34 EF 51 22 61 F8 3A 70 58 4C 1C 82 99 4C>)
(   4,<2007-07-31 09:46:47.95 +100>,<MAYBRIDGE\nmr>,<NMR_250MHZ>,
      <abs ABSG = 5 
       data hash MD5: 32K
       B1 2F 50 75 89 BE B0 AC DE 47 02 A6 D5 2D CC 68>)
$$ ##END=
$$ 
$$ hash MD5
$$ 7A 7D EB 1E 66 78 8C E4 28 E1 69 5F AB 24 C8 0C
##$RELAX= 
##$RELAX= 
##$RELAX= 
##$RELAX= 
##$RELAX= 
##$RELAX= 
##$RELAX= 
$$ Bruker specific parameters
$$ --------------------------
##$DU= <C:\u>
##$EXPNO= 1770
##$NAME= <ADRS>
##$PROCNO= 1
##$TYPE= <nmr>
##$USER= <dgb>
##$AMP= (0..31)
100 100 100 100 100 100 100 100 100 100 100 100 100 100 100 100 100 100 
100 100 100 100 100 100 100 100 100 100 100 100 100 100 
##$AQSEQ= 0
##$AQ_mod= 3
##$AUNM= <au_zg>
##$AUTOPOS= <12 >
##$BF1= 250.13
##$BF2= 250.13
##$BF3= 250.13
##$BF4= 250.13
##$BF5= 500.13
##$BF6= 500.13
##$BF7= 500.13
##$BF8= 500.13
##$BYTORDA= 1
##$CFDGTYP= 0
##$CFRGTYP= 5
##$CHEMSTR= <none>
##$CNST= (0..31)
1 1 145 1 1 1 1 1 1 1 1 1 1 1 1 1 1 1 1 1 1 1 1 1 1 1 1 1 1 1 1 1 
##$CPDPRG= <>
##$CPDPRG1= <>
##$CPDPRG2= <>
##$CPDPRG3= <>
##$CPDPRG4= <mlev>
##$CPDPRG5= <mlev>
##$CPDPRG6= <mlev>
##$CPDPRG7= <mlev>
##$CPDPRG8= <mlev>
##$CPDPRGB= <>
##$CPDPRGT= <>
##$D= (0..31)
0 1 0 0 0 0 0 0 0 0.06 0 0 0 0 0 0 0.0002 0 0 0 0 0 0 0 0 0 0 0 0 0 0 
0 
##$DATE= 1185871586
##$DBL= (0..7)
120 120 120 120 120 120 120 120 
##$DBP= (0..7)
150 150 150 150 150 150 150 150 
##$DBP07= 0
##$DBPNAM0= <>
##$DBPNAM1= <>
$$ [...]
##$SUBNAM7= <"">
##$SUBNAM8= <"">
##$SUBNAM9= <"">
##$SW= 20.6930455092707
##$SWIBOX= (0..15)
0 0 3 0 0 0 0 0 0 0 0 0 0 0 0 0 
##$SW_h= 5175.983436853
##$TD= 65536
##$TD0= 1
##$TE= 297.16
##$TE2= 300
##$TE3= 300
##$TEG= 300
##$TL= (0..7)
0 120 120 120 120 120 120 120 
##$TP= (0..7)
150 150 150 150 150 150 150 150 
##$TP07= 0
##$TPNAME0= <>
##$TPNAME1= <>
##$TPNAME2= <>
##$TPNAME3= <>
##$TPNAME4= <>
##$TPNAME5= <>
##$TPNAME6= <>
##$TPNAME7= <>
##$TPOAL= (0..7)
0.5 0.5 0.5 0.5 0.5 0.5 0.5 0.5 
##$TPOFFS= (0..7)
0 0 0 0 0 0 0 0 
##$TUNHIN= 0
##$TUNHOUT= 0
##$TUNXOUT= 0
##$USERA1= <user>
##$USERA2= <user>
##$USERA3= <user>
##$USERA4= <user>
##$USERA5= <user>
##$V9= 5
##$VALIST= <valist>
##$VCLIST= <CCCCCCCCCCCCCCC>
##$VD= 0
##$VDLIST= <DDDDDDDDDDDDDDD>
##$VPLIST= <PPPPPPPPPPPPPPP>
##$VTLIST= <TTTTTTTTTTTTTTT>
##$WBST= 1024
##$WBSW= 4
##$XGAIN= (0..3)
0 0 0 0 
##$XL= 0
##$YL= 0
##$YMAX_a= 245192
##$YMIN_a= -331839
##$ZGOPTNS= <>
##$ZL1= 120
##$ZL2= 120
##$ZL3= 120
##$ZL4= 120
##$ABSF1= 16.522
##$ABSF2= -4.171173
##$ABSG= 5
##$ABSL= 3
##$ALPHA= 0
##$AQORDER= 0
##$ASSFAC= 0
##$ASSFACI= 0
##$ASSFACX= 0
##$ASSWID= 0
##$AUNMP= <proc_1d>
##$AZFE= 0.1
##$AZFW= 0.1
##$BCFW= 0
##$BC_mod= 0
##$BYTORDP= 0
##$COROFFS= 0
##$CY= 12.5
##$DATMOD= 1
##$DC= 0
##$DFILT= <>
##$DTYPP= 0
##$F1P= 14.0000005364418
##$F2P= -0.99999901652339
##$FCOR= 0.5
##$FTSIZE= 32768
##$FT_mod= 6
##$GAMMA= 0
##$GB= 0
##$INTBC= 1
##$INTSCL= 1
##$ISEN= 128
##$LB= 0.3
##$LEV0= 0
##$LPBIN= 0
##$MAXI= 10000
##$MC2= 0
##$MEAN= 0
##$ME_mod= 0
##$MI= 0
##$NCOEF= 0
##$NC_proc= -5
##$NLEV= 6
##$NOISF1= 0
##$NOISF2= 0
##$NSP= 0
##$NTH_PI= 0
##$NZP= 0
##$OFFSET= 16.522
##$PC= 1
##$PHC0= -41.23131
##$PHC1= -1.203693
##$PH_mod= 1
##$PKNL= yes
##$PPARMOD= 0
##$PSCAL= 4
##$PSIGN= 0
##$REVERSE= no
##$SF= 250.13
##$SI= 32768
##$SIGF1= 0
##$SIGF2= 0
##$SINO= 400
##$SIOLD= 32768
##$SREGLST= <1H.CDCl3>
##$SSB= 0
##$STSI= 32768
##$STSR= 0
##$SW_p= 5175.98343685301
##$SYMM= 0
##$S_DEV= 0
##$TDeff= 65536
##$TDoff= 0
##$TI= <Analysis number 999999
Compound Code 99
Book Reference 9
Project Code 9>
##$TILT= no
##$TM1= 0
##$TM2= 0
##$TOPLEV= 0
##$USERP1= <user>
##$USERP2= <user>
##$USERP3= <user>
##$USERP4= <user>
##$USERP5= <user>
##$WDW= 1
##$XDIM= 32768
##$YMAX_p= 407028855
##$YMIN_p= -231398
$$ End of Bruker specific parameters
$$ ---------------------------------
##NTUPLES= NMR SPECTRUM
##VAR_NAME=  FREQUENCY,     SPECTRUM/REAL,   SPECTRUM/IMAG
##SYMBOL=    X,             R,               I
##VAR_TYPE=  INDEPENDENT,   DEPENDENT,       DEPENDENT
##VAR_FORM=  AFFN,          ASDF,            ASDF
##VAR_DIM=   32768,         32768,           32768
##UNITS=     HZ,            ARBITRARY UNITS, ARBITRARY UNITS
##FACTOR=    0.157963299565203, 1,           1
##FIRST=     4132.6476996994, 0,             0
##LAST=      -1043.33573715361, 0,           0
##MIN=       -1043.33573715361, -231398,     0
##MAX=       4132.6476996994, 407028855,     0
$$ Real data points
##PAGE= N=1
##DATA TABLE= (X++(R..R)), XYDATA
$$ [...]
15691d4886l8663K5308J5245L4461k3720p0102J2728L2749L3366P6088J8326j2286
15679E8614L2735J8794l091j1641l7057m4820p795k7230l886j6751M4588K4989
15667B7449m8575L776J868N5039P390p991o0152N5184N821j9037r196j4462l5949
15654c8835o1198P8835N541L4805M3636Q703Q096l3022P911k4623J6105J2852
15642E8806k5900l0999J9094K9483m2879m6283k5555J7512K9201K6973L5815M1160
15630H6428K8365l2155q5353j4410J5092k3958k6286q051L0802R846L5111m8128
15618c2697k9800Q010M1965m3l455k5201k4487L6931j0839J5704k0239l4390m0529
15605a19070J9564J9083K1790l4880k715L7959M6383l764p033j6569n3810k3494
$$ plain form
15691 -44886 -83549 -58241 -42996 -8535 -32255 -102357 -89629 -56880 -23514 52574 70900 58614
15679 58614 91349 110143 107052 95411 58354 13534 5739 -21491 -25377 -42128 2460 27449
15667 27449 -21126 -17350 -15482 39557 46947 38956 -21196 33988 39809 20772 11576 -2886 -38835
15654 -38835 -100033 -21198 -15657 19148 62784 71487 79583 46561 54472 29849 45954 58806
15642 58806 32906 1907 21001 50484 7605 -38678 -64233 -46721 -17520 9453 45268 86428
15630 86428 114793 82638 -2715 -17125 -2033 -25991 -52277 -60328 -29526 -19680 15431 -32697
15618 -32697 -62497 -54487 -12522 -12565 -16020 -41221 -65708 -28777 -39616 -23912 -44151 -78541 -119070
15605 -119070 -99506 -80423 -58633 -93513 -96228 -58269 -11886 -15650 -22683 -39252 -93062 -116556
15593a16556K9460O5861L4887J2345K6502o746l3318m3819L6200L0530o649j3787
15581A4910l5149l6277j857J3362K8291m1132k3755K6847K9078l4976J2496K4518
15569b3644m8598L7267L8347J0994P997n614m1419L0258J3277k2037K0202K8935
15557D5965L3655l6286o0361k403M2942O4294M4101n0275k7324k6202M3594o272
15545F5428N270k9445p151p257K4071M9146M0585l8348q0350m5381O4404L1779
15533G2751J7494M1310k6194m323k9988l6309q731J775L5919l9750o4855k0611
15521f1512n3632j6057L9581M4116P7921M1704k4900n4495m5249j4162J0293O5745
15509I353r834p830L0260J588k9475k2843n5577m5020L0147L8135P0518J6971
$$ plain form
15593 -116556 -87096 -21235 13652 25997 52499 45753 12435 -31384 4816 35346 28697 14910
15581 14910 -20239 -56516 -58373 -45011 -16720 -57852 -81607 -54760 -25682 -60658 -48162 -23644
15569 -23644 -72242 -34975 3372 14366 22363 16749 -24670 5588 18865 -3172 17030 45965
15557 45965 79620 43334 -17027 -19430 23512 87806 131907 81632 54308 28106 71700 65428
15545 65428 70698 41253 34102 26845 50916 100062 140647 102299 21949 -23432 40972 72751
15533 72751 90245 131555 105361 101038 71050 34741 26010 27785 63704 23954 -40901 -61512
15521 -61512 -115144 -131201 -91620 -47504 30417 72121 47221 -7274 -52523 -66685 -56392 9353
15509 9353 -481 -8311 21949 23537 -5938 -28781 -84358 -129378 -99231 -61096 9422 26393
15497B6393p897K3241o037j6450k0569R88p247j655J7952l1502j9833L2134O803
15484c679O977m6393j1943k0401n7938j2373O8885Q2909M2782q7460k4964L0785
15472c2813M8759L418p3860l3780K0120r408M5944N6457p0853J6335J9198k5469
15460c5952m5152r547M5524P9974k060p5513m6485L6110k3601k0387J6594J0553
15448f9942l5959K3288L4708J884k6715j7013K7607K9444j9788j9112J2144m0285
15436i9739Q452J8559P378P945k7417j1399J3425L9400J6320n549m5242r650M8544
15423c8973J6445L3222J5481L944l4055j7834J8167o2149q7316j3173O3724R310
15411i3207N7858K6573o9133m2327L1577p53m0720K642K6441L2856O820K9784
$$ plain form
15497 26393 18496 41737 35700 19250 -1319 -331 -7578 -9233 8719 -22783 -42616 -10482 -3679
15484 -3679 3298 -43095 -55038 -75439 -133377 -145750 -76865 6044 48826 -38634 -63598 -32813
15472 -32813 15946 19364 -54496 -88276 -68156 -77564 -31620 24837 -46016 -29681 -10483 -35952
15460 -35952 -81104 -90651 -45127 34847 32787 -42726 -89211 -53101 -76702 -97089 -80495 -69942
15448 -69942 -105901 -82613 -47905 -46021 -72736 -89749 -62142 -32698 -52486 -71598 -59454 -99739
15436 -99739 -91287 -72728 -65350 -57405 -84822 -96221 -82796 -43396 -27076 -32625 -77867 -87517 -38973
15423 -38973 -22528 10694 26175 30119 -3936 -21770 -3603 -65752 -153068 -166241 -102517 -93207
15411 -93207 -35349 -8776 -77909 -120236 -88659 -89412 -130132 -127490 -101049 -68193 -61373 -31589
15399c1589m649P472m3722m3115L9661K3111P9978k94k1745R485J1916l6070m5420
15386e4981M4773L4567l2822K1386k3412l737J0139k292l1844M4319j401J2766
15374A7461J2109l3597l3265l0208l77M7997R092j7032J9719L5458j3160m5532
15362c1335K4525K5519l1192J2557l9255k7012j1144j5762j4576l7741M3155O5309
15350c6952M8572j21465p3964N237M6494j6051j5548K8604P1055q151J0221R954
15338e1994L4638O2192n5632k9434L0394K441M63O3748k6511o2865o5284N846
15326i1998M2079P4178R55O555M390o4437j840K3269K8988M6392j242m9118K088
15313B0259L5625M0385m6958q1540r888L3867p060K6261j883j8720k64J3968O044
$$ plain form
15399 -31589 -36238 -28766 -72488 -115603 -75942 -52831 27147 26853 5108 14593 26509 -9561 -54981
15386 -54981 -10208 24359 -8463 12923 -10489 -14226 -4087 -6379 -38223 6096 4695 17461
15374 17461 29570 -4027 -37292 -67500 -67877 -19880 -10788 -27820 -8101 27357 14197 -31335
15362 -31335 -6810 18709 -12483 74 -39181 -66193 -77337 -93099 -107675 -145416 -102261 -36952
15350 -36952 11620 -109845 -183809 -178572 -132078 -148129 -163677 -135073 -64018 -72169 -61948 -51994
15338 -51994 -17356 44836 -10796 -40230 -9836 -7395 -6932 56816 30305 -32560 -97844 -91998
15326 -91998 -49919 24259 25214 31769 36159 -28278 -30118 -6849 22139 68531 67289 18171 20259
15313 20259 55884 96269 49311 -32229 -42117 -8250 -15310 10951 9068 -9652 -9916 4052 10096
15300A0096M871J4701m4124k0938K8770N4652P722n1570o233k9307L0115j4770
15288a6015M6422j2745p7425l6583K0288J4429P709P064K3867L2475K5191k5187
15276I490M225J4321j66k0752L4885K1140M052k9970l7614M071l1296p5597n1855
15263a55066j6457L5373L1308M4804K7202l2424k793j2974K7071j8489k7619n2063
15251a52127j3139O9169J4238j7751K0314K1249M3407M0818j479k8432N0455L6591
15239H3313l199j9686l0860P2380J4411n8015q090r84j2176m4609p518k5045K6659
15226a3419K010m5736m9999N1111M1459k8533n300L7879K488k4945k7122j8280
15214g8387J5459N5785R21j5601N895P5308M6007K6454K0854r9644o4717J5005
$$ plain form
15300 10096 14967 29668 -14456 -35394 -6624 48028 55750 4180 -2053 -31360 -1245 -16015
15288 -16015 30407 17662 -59763 -96346 -76058 -61629 -53920 -46856 -22989 9486 34677 9490
15276 9490 13715 28036 27870 7118 42003 63143 67195 37225 -389 3682 -27614 -103211 -155066
15263 -155066 -171523 -136150 -104842 -60038 -32836 -65260 -68053 -81027 -53956 -72445 -100064 -152127
15251 -152127 -165266 -96097 -81859 -99610 -79296 -58047 -14640 26178 24699 -3733 46722 83313
15239 83313 80114 60428 29568 101948 116359 58344 50254 49270 37094 -7515 -15033 -40078 -13419
15226 -13419 -11409 -57145 -107144 -56033 -14574 -43107 -48407 -10528 -8040 -32985 -60107 -78387
15214 -78387 -62928 -7143 -6222 -21823 -15928 59380 105387 131841 152695 53051 -11666 3339
15202C339j0392m3032j0934k8016k1311l1182j8029K9590L5663j3617K1068N8702
15190b8151k7366k7954j0604K759J6427J0232M4380J4449n2986n67O224j6504
15178f9661j6910N7641j1402m513J5527j7082j2036j6414J1764o894J6026N6923
15166B969k679j2832L750L3842K8551q0556j5223k374J651Q958M7460J5975M7677
15153G7169L1762m0222l3908p0273J4863L8135K8716l3804n8240p8530l9297M7297
15141a16332K992K0107R490j2779J118j4828K1776L3025K1438j4632k1536O0274
15129i887M316p8257J116L9915J4815k9142j3617M0012j2144k1916K5435R736
15117b9618o3934l6928L5175m3130M0556N2622L7008M0248l5478o8023K3009j837
$$ plain form
15202 3339 -7053 -50085 -61019 -89035 -110346 -141528 -159557 -129967 -94304 -107921 -86853 -28151
15190 -28151 -55517 -83471 -94075 -91316 -74889 -64657 -20277 -5828 -58814 -59381 -53157 -69661
15178 -69661 -86571 -28930 -40332 -44845 -29318 -46400 -58436 -74850 -63086 -69980 -53954 2969
15166 2969 290 -12542 -8792 25050 53601 -26955 -42178 -44552 -42901 -33943 13517 29492 77169
15153 77169 108931 68709 34801 -35472 -20609 17526 46242 12438 -45802 -124332 -163629 -116332
15141 -116332 -113340 -93233 -83743 -96522 -95404 -110232 -88456 -55431 -33993 -48625 -70161 -9887
15129 -9887 -5571 -83828 -82712 -42797 -27982 -57124 -70741 -30729 -42873 -64789 -39354 -29618
15117 -29618 -93552 -130480 -95305 -138435 -97879 -45257 -8249 31999 -3479 -71502 -48493 -50330
15105e0330L3722j2056k1394j1764M1934j431j4001J8402n165o7863n351O7477
15093b7820k625K4676k6284n7768J3601M8434N243M9148J3503k2067m0842n9069
15081h1870O9967L2584j2281P37l1607K4951J6644j1639m1317J2875O5286K2211
15069F6541o7103K743N859l7299j6913j5353J0492M275O2324o542n1797P972o224
15056d1025k3092J7819O350J4204J9860K8467L5738K9496m1792q2829o9486j5298
15044a21588O6625L1029J7164K8727l8448l1704n548O173k3002L6220M542J0861
15032a8949k2995j7419J4566j4981j0750j4771L1117k0428q833j6409l0869o9424
15020b00145L1697O5428L8140j1811k3296m9686k8151J7229J11665L3673K5538
$$ plain form
15105 -50330 -16608 -28664 -50058 -61822 -19888 -21319 -35320 -16918 -22083 -89946 -95297 -27820
15093 -27820 -30445 -5769 -32053 -89821 -76220 -27786 -22543 26605 40108 18041 -22801 -81870
15081 -81870 -11903 20681 8400 9137 -22470 2481 19125 7486 -33831 -20956 44330 66541
15069 66541 -562 2181 8040 -29259 -46172 -61525 -51033 -46758 15566 9024 -42773 -34801 -41025
15056 -41025 -64117 -46298 -39948 -25744 -5884 22583 58321 87817 46025 -36804 -106290 -121588
15044 -121588 -54963 -23934 -6770 21957 -16491 -48195 -53743 -47570 -70572 -34352 -29810 -18949
15032 -18949 -41944 -59363 -44797 -59778 -70528 -85299 -54182 -74610 -83443 -99852 -130721 -200145
15020 -200145 -168448 -103020 -64880 -76691 -99987 -149673 -177824 -160595 -48930 -15257 10281
15009A0281M583L2237q866p7034k9184O682L4811N863L598k2811k9152P9810J08799
14996A19617N0922N6193j6870k3526j14456p2378j2290m8870O4501L3582o7907
14985c1482m1828L8497N0580M135o6419j6631M2535J9116Q459j7187M477k3923
14973b9671n7831k2699J7727K5623J3626m007J805J28J694O6757k93P154O896
14960B6909M1662k9538l6749m3187L0857J6485o7785k9208j5752N0448R490q245
14948e4613N5875N449k540Q337o9125k3679l2835O8762P3533L1835J231r604m2720
14935I906k4236K0j9659l2139l751J3054M2577L568n1059j4982P126k5857L8579
14922e6853j7371k5605J6716L4112n886k248J2454M5492Q224l5093J3246N5584
$$ plain form
15009 10281 14864 47101 38235 -38799 -67983 -61301 -26490 -20627 -17029 -39840 -68992 10818 119617
14996 119617 170539 226732 209862 186336 71880 -498 -12788 -61658 2843 36425 -31482
14985 -31482 -73310 -34813 15767 19902 -46517 -63148 -20613 -1497 6962 -10225 -5748 -29671
14973 -29671 -87502 -110201 -92474 -66851 -53225 -57232 -55427 -55299 -53605 13152 12859 20013 26909
14960 26909 68571 39033 2284 -40903 -10046 6439 -61346 -90554 -106306 -55858 -46368 -54613
14948 -54613 1262 6711 4171 12508 -56617 -80296 -113131 -44369 29164 60999 62230 52626 9906
14935 9906 -14330 -14310 -33969 -66108 -69859 -56805 -14228 -10660 -61719 -76701 -69575 -95432 -56853
14922 -56853 -74224 -99829 -83113 -49001 -54887 -57135 -44681 811 9035 -26058 -12812 42772
14910D2772k3586j5330O586K5641k975m1725L4483m9626m265J0277P5026R327
14898F6605l4614K246j4902k3018m4608J881K2738n603k1611K6250K9019k6893
14886b2510J981M5681M5566J6475p3248j2363j9150j01360n6153J8683J3156M2990
14874a00252M6598m617K2676J4225m7096j832n766j2830K2748J5236n8244J8809
14862i0345M3214l0519Q421J1591j1991l906Q8989J2414r237k2108m4170M8953
14850A306j3245m8566P999k391N8160K0459k1713k2454J3632L8551m0139l5967
14838d4368L7075J1697M2763k0331p9795l7168N5124j5526o647l7360r34o771
14826a02241j5866P061Q8324O045K6535K7428n4339q402K5928k5883r725J7175
$$ plain form
14910 42772 19186 3856 10442 36083 33108 -8617 25866 -23760 -28025 -17748 57278 66605
14898 66605 31991 34237 19335 -3683 -48291 -46410 -23672 -29275 -50886 -24636 4383 -22510
14886 -22510 -20529 25152 70718 87193 13945 1582 -17568 -118928 -175081 -156398 -143242 -100252
14874 -100252 -53654 -58271 -35595 -21370 -68466 -70298 -76064 -88894 -66146 -50910 -109154 -90345
14862 -90345 -47131 -77650 -69229 -57638 -69629 -73535 15454 27868 18631 -3477 -47647 1306
14850 1306 -11939 -60505 -52506 -54897 3263 23722 2009 -20445 -6813 31738 -8401 -44368
14838 -44368 -7293 4404 47167 26836 -52959 -90127 -35003 -50529 -57176 -94536 -95470 -102241
14826 -102241 -118107 -111046 -22722 -16677 9858 37286 -17053 -25455 473 -25410 -35135 -17960
14814a7960k666j1568J8228l576J6484j1616j6908O0814K1943J7558k640j824
14802F6269j7011n3804j3429j4710J2005k6373l1341L4221J7158j4554n2980j2947
14790a07496O3000J407L180J3885J8201k0157L0589K5707o000k8644m4304K8622
14778b2010O331n3443Q114k1106m5847L4417Q0964J9651M5572K892K1897q23n5196
14765B1413R932O643n6387p530r030n075j6262j8893L91Q291P292j8028l9586
14752a16829j8011N2287Q3898l2286M09J3375O6525M511o0934M1184N162p055
14740C2236m2593m5890M6743M9842n1130r94k2141o1221M400J9852J6679j6818
14728g1035R120l2813r332Q9135L3865j2358L2108m6811j2485k8290q559o3115
$$ plain form
14814 -17960 -20626 -32194 -13966 -17542 -1058 -12674 -29582 31232 53175 70733 68093 66269
14802 66269 49258 -4546 -17975 -32685 -20680 -47053 -78394 -44173 -27015 -41569 -94549 -107496
14790 -107496 -44496 -43089 -39909 -26024 -7823 -27980 2609 28316 22316 -6328 -50632 -22010
14778 -22010 -15679 -69122 -61008 -82114 -127961 -93544 -12580 7071 52643 55535 77432 76609 21413
14765 21413 31345 37988 -18399 -25929 -34959 -40034 -56296 -75189 -74798 -66507 -59215 -77243 -116829
14752 -116829 -134840 -82553 1345 -30941 -30532 -17157 49368 53879 -7055 34129 39291 32236
14740 32236 -10357 -56247 -9504 40338 -10792 -11786 -33927 -95148 -90748 -70896 -54217 -71035
14728 -71035 -61915 -94728 -104060 -14925 18940 6582 38690 -8121 -20606 -48896 -57455 -120570
14716a20570o2672j8632Q5797P0811N7695j5016k0190L589M8746J4516k2528p0288
14704d8742m137K335J9606j2950L6390M1117k0619k2084R682M7967N471p4266
14692b0230o2859j5721m5638k2238M3781M4676M3714K3980L3171Q203n1930K4875
14680C784P2501l8472j15784n1207P2901N8111l0001J070N0545O074j1103k591
14668A5828k9104l9524L0140M3209r9076o0378M6252L5334M3457l8367l7834k5262
14656a15325j5589L806M6284K0027m4873J4894N1800r260j9247L92j3314l1242
14644a11647L9873M4963P662p6176j7769P1728M0365k0534o8667k7132L8410P097
14632g1827J9246K7310K1054J7943L8705j0597k900k1095J2942k2631o1027M0517
$$ plain form
14716 -120570 -183242 -201874 -116077 -45266 12429 -2587 -22777 -19188 29558 44074 21546 -48742
14704 -48742 -52879 -50544 -30938 -43888 -7498 33619 13000 -9084 598 48565 54036 -20230
14692 -20230 -83089 -98810 -144448 -166686 -122905 -78229 -34515 -10535 22636 30839 -21091 3784
14680 3784 76285 37813 -77971 -129178 -56277 1834 -28167 -27097 23448 29522 18419 15828
14668 15828 -13276 -52800 -22660 20549 -78527 -138905 -92653 -57319 -13862 -52229 -90063 -115325
14656 -115325 -130914 -127108 -80824 -60797 -105670 -90776 -38976 -48236 -67483 -67091 -80405 -111647
14644 -111647 -71774 -26811 -19149 -95325 -113094 -41366 -1001 -21535 -90202 -117334 -78924 -71827
14632 -71827 -52581 -25271 -4217 13726 52431 41834 38934 17839 30781 8150 -52877 -12360
14620a2360N0132j221j9741n4164m9289j2891K0401M1055j2020j9130j0382r241
14608h8851K2321j7113J4724k122m3290L889K8922O0342P9847J0760k691k8771
14596C7967p4316o4297l6911j959P4442O4001K5209Q367l4321o163M337m7995
14584e1639o85O8570Q491k4885K6m3945j4494K5844J4001k3425K4224j6282q8727
14571a22926J2054L3481K8414j2336n46M3650o258j072L3496j6355j5240J3691
14559i947k4220M6770J3022J1841m0325m4934n544k920L490j8463q572J1412K2669
14546d5721k7389l9453K3062p704J8361O01L3721J6845k273J437K6019L8932M6733
14533H3171n4784l4817K0475l466k7112o907l3839j6383r958o1490m9178N0327
$$ plain form
14620 -12360 37772 36551 16810 -37354 -86643 -99534 -79133 -38078 -50098 -69228 -79610 -88851
14608 -88851 -66530 -83643 -68919 -71041 -114331 -110442 -81520 -21178 58669 69429 66738 37967
14596 37967 -36349 -100646 -137557 -139516 -65074 -1073 24136 32503 -1818 -7981 -3644 -51639
14584 -51639 -52324 16246 24737 -148 -122 -44067 -58561 -32717 -18716 -42141 -17917 -34199 -122926
14571 -122926 -110872 -77391 -48977 -61313 -61859 -18209 -24467 -25539 7957 -8398 -23638 -9947
14559 -9947 -34167 12603 25625 37466 -2859 -47793 -53337 -56257 -52767 -71230 -79802 -68390 -45721
14546 -45721 -73110 -112563 -89501 -97205 -78844 -78243 -44522 -27677 -29950 -28513 -2494 36438 83171
14533 83171 28387 -6430 14045 10579 -16533 -23440 -57279 -73662 -83620 -145110 -194288 -143961
14521a43961L4800k8984L0534K0510J563K271K6935l1018J3615K2295j7862l4152
14509a03454m627J5576L3843J5073N1794l7587p6045P4130K0269j8856J5151q627
14497b3360n7103k5918K9433m4043P6795P2592k4859l2545j6010N086j3669j8025
14485g1626q392J3826P8897M2209j3176k5977o2212j8544Q1411L514k6058k0189
14473b6317o9734k9431J4374P5564L1769j0629m257n845O4690K5856j2123l2373
14461B1544q746J7991j07462j6352J1637M1164k9667J552N8669J4630Q031J6657
14449B9648M0326o3609n9726j9213J2884J4700P02K3381J431j9865L6239O200
14437C098n8494m7126R508K5250K4853Q3125k4008r5762q0997n451l44M8546M8077
$$ plain form
14521 -143961 -109161 -138145 -107611 -87101 -85538 -83267 -56332 -87350 -73735 -51440 -69302 -103454
14509 -103454 -108081 -92505 -58662 -43589 8205 -29382 -105427 -31297 -11028 -29884 -14733 -23360
14497 -23360 -80463 -106381 -76948 -120991 -44196 28396 3537 -29008 -45018 -39932 -53601 -71626
14485 -71626 -80018 -66192 12705 54914 41738 15761 -46451 -64995 16416 19930 -6128 -26317
14473 -26317 -96051 -125482 -111108 -35544 -3775 -14404 -18661 -24506 40184 66040 53917 21544
14461 21544 12798 30789 -76673 -93025 -81388 -40224 -69891 -68339 -9670 4960 12991 29648
14449 29648 69974 6365 -53361 -72574 -59690 -44990 -44288 -20907 -19476 -39341 -3102 3098
14437 3098 -55396 -102522 -93014 -67764 -42911 40214 16206 -79556 -160553 -166004 -166348 -117802 -69725
14424f9725j2114K4568O3712j1599o6070l2443J5875K0073N2572N8084K2198r202
14412E5929r1269l8742Q2210m3579k6380J6515M2586N6849L7584p5833m9539K8033
14400e636l4444j5903J168j503m327m6760k145M1725j5443k6798m1389K4392O3435
14387f3628L2692l3039L3139k966m964L5385o7637k5897n584J6965L7351N3816
14375E633N0258M769l0883l121j5015M610L1036j5138l7214m2047k2257L2513
14363c6856n681n186J1596J576k4265j6018O7915L6186o2316k9353L6419L6656
14351A0673r36N8159j6855l2151L93K8462L359l9489o4234j8478L6997J3096J4603
14338f401q180J7518q407l8703o5293K0712M0605n072L0351N5474m3894q0356
$$ plain form
14424 -69725 -81839 -57271 6441 -5158 -71228 -103671 -87796 -67723 -15151 42933 65131 55929
14412 55929 -35340 -74082 8128 -35451 -61831 -45316 -2730 54119 91703 15870 -33669 -5636
14400 -5636 -40080 -55983 -54815 -56318 -60645 -107405 -109550 -67825 -83268 -110066 -151455 -127063 -63628
14387 -63628 -30936 -63975 -30836 -33802 -38766 -3381 -71018 -96915 -102499 -85534 -48183 5633
14375 5633 55891 60660 29777 26656 11641 16251 47287 32149 -5065 -47112 -69369 -36856
14363 -36856 -42537 -47723 -36127 -34551 -58816 -74834 -6919 29267 -33049 -62402 -25983 10673
14351 10673 9737 67896 51041 18890 19283 47745 51104 11615 -52619 -71097 -34100 -21004 -6401
14338 -6401 -14581 2937 -5470 -44173 -109466 -88754 -48149 -53221 -22870 32604 -11290 -91646
14326i1646j3066P7324K6834p454M2007k8246j4714m626n8155j897L0450l8707
14314h1896J8988J4506k4555k2017L8555M3825j9065M4945p795p19K3827l823
14302B4776n8266j528p119l9710N541K7387R8886L2887m8129p7949l316N9704
14290A3164O031n0511m837L584n5829r820j0782k0012L2343N4216J5913m2299
14278f8839J0084K412j7182M6617K2797l2535k0605j5426n058L49M115O8741J4659
14265A0129J126p3836k3042K7463j091J8071P342L5142k8165k5082j5915l3965
14253a01823k419L2257j9661l2929L317K7120L306j860M4894N9895K4573n3975
14241a7305L261p0185L0467L4838l88l8111l5513K4139N3180n2812p197q132M0271
$$ plain form
14326 -91646 -104712 -27388 -554 -8008 33999 5753 -8961 -13587 -71742 -73639 -43189 -81896
14314 -81896 -62908 -48402 -72957 -94974 -56419 -12594 -31659 13286 5491 4772 28599 24776
14302 24776 -33490 -35018 -42137 -81847 -76306 -48919 49967 82854 34725 -43224 -46540 13164
14290 13164 19195 -31316 -36153 -32569 -88398 -98218 -109000 -129012 -96669 -42453 -26540 -68839
14278 -68839 -58755 -56343 -73525 -26908 -4111 -36646 -57251 -72677 -77735 -77386 -73271 -4530 10129
14265 10129 11255 -62581 -85623 -58160 -59251 -41180 -33838 1304 -26861 -51943 -67858 -101823
14253 -101823 -104242 -71985 -91646 -124575 -121258 -94138 -90832 -92692 -47798 12097 36670 -17305
14241 -17305 -14044 -84229 -53762 -18924 -19312 -57423 -92936 -68797 -15617 -68429 -75626 -83758 -43487
14228d3487J9730j8155m674K25p887k9746k2599O2290Q4160n4958j1887M1672
14216A4684l9954l6923k1606j0743j5639M6846O0843l6236j082K2004L016m1320
14204e6110L250k477k0516J1588M4872L4362k0680l164j7262M4151K292l5192
14192a4886L645m9794q619K7972M1623l8559M813M1115J1381K5350q2470l5371
14180g3800J8467M0733k4992j2035K4080K3141J6252J1088M5096K0005j0674l2049
14168D5312K478P638m5037j0133k0324j5847J0918l8421P787m0714k906r382l7220
14155a45851M3903Q296l854O6438M3482l1164K69M4641l7228q5013J9690L0830
14143d5561R387L1570j5111m4583L2412J1274q192m9544K0625l421M4358L4516
$$ plain form
14228 -43487 -23757 -41912 -46586 -46361 -54248 -83994 -106593 -44303 39857 -15101 -26988 14684
14216 14684 -25270 -62193 -83799 -94542 -110181 -63335 -2492 -38728 -39810 -17806 -14790 -56110
14204 -56110 -52860 -55337 -75853 -64265 -19393 14969 -5711 -8875 -26137 18014 20306 -14886
14192 -14886 -11241 -61035 -69654 -41682 -59 -38618 -33805 7310 18691 44041 -38429 -73800
14180 -73800 -55333 -14600 -39592 -51627 -27547 -4406 11846 22934 68030 88035 77361 45312
14168 45312 47790 55428 10391 258 -20066 -35913 -24995 -63416 -55629 -96343 -99249 -108631 -145851
14155 -145851 -101948 -93652 -97506 -31068 12414 -18750 -18481 26160 -11068 -96081 -76391 -45561
14143 -45561 -36174 -4604 -19715 -64298 -31886 -20612 -28804 -78348 -57723 -61144 -16786 17730
14131A7730o045k5506p7038n0488O3361J06103o549L30L4895K9582J8531k6759
14119G8147r978l1854j5325R304J3369J9190l5673r996k3301m506O525l856L4932
14106B6978O143o6726q316N0639l929l2939m2660o613Q9974l3756n8369P831J2717
14093e9026M4002J3980J6312j9253M2806K35l8487n5132j8653K6674L5835Q9402
14081G8695j622o7011k5377L0394k9342m0304J739j4447n3092j9596J3461K6526
14069i9976N2994N5756P646j1517m8858k6760n730L3954r831L5319L268n184j0246
14056b9165K81R508N2818m8880N443N248m1928l9789N1690J9370k8409j0129J1729
14043d2213k7722k600j3415k682k293J3201J7735K4023j9635o9248l315M5905
$$ plain form
14131 17730 11685 -13821 -90859 -141347 -77986 28117 21568 21898 56793 86375 104906 78147
14119 78147 68169 36315 20990 30294 43663 62853 27180 17184 -6117 -10623 -4098 -7954 26978
14106 26978 33121 -33605 -41921 8718 4789 -28150 -70810 -77423 12551 -21205 -79574 -71743 -59026
14093 -59026 -15024 -1044 15268 -3985 38821 39056 569 -54563 -73216 -46542 -10707 78695
14081 78695 77073 10062 -15315 15079 -14263 -54567 -52828 -67275 -120367 -139963 -126502 -99976
14069 -99976 -46982 8774 16420 4903 -43955 -70715 -76445 -42491 -52322 -17003 -13735 -18919 -29165
14056 -29165 -28884 -19376 33442 -15438 -9995 -4747 -46675 -86464 -34774 -15404 -43813 -53942 -42213
14043 -42213 -69935 -72535 -85950 -88632 -90925 -77724 -59989 -35966 -55601 -124849 -128164 -82259
14031h2259j4566J2716m752Q264M8876K6611M3271M1142j2742J3426M243L172
14019H7402m7814J2364l2583l3606N9714J171J892p2808l4348n6172M0558L0350
14007d3880q285k4271M4478k773k2956J8414O242l1653L8141j7338p7010k1099
13995a41990J0021J5322M7098j5091J4931N923N639K5248r043k2500M2445O347
13983a5650o7118j8033M1322L8524O0955n4885K8681K4409k7846J9767j1978J8113
13971C6261l1632q007j4273M2676L0003k7431q1988m421k295N478M7664J4316
13959F351m6164j6857J0556k6043j0911k2412K4778J5038J5760J5638J7729L1868
13947A5331j1637K9866l9740L192l9212k8896m175J2296R757J4820m936J2367
$$ plain form
14031 -82259 -96825 -84109 -88861 -80597 -31721 -5110 38161 79303 66561 79987 84230 87402
14019 87402 39588 51952 19369 -14237 45477 46648 48540 -24268 -58616 -114788 -74230 -43880
14007 -43880 -52165 -76436 -31958 -34731 -57687 -39273 -33031 -64684 -26543 -43881 -120891 -141990
13995 -141990 -131969 -116647 -69549 -84640 -69709 -63786 -58147 -32899 -41942 -64442 -21997 -15650
13983 -15650 -82768 -100801 -59479 -20955 40000 -14885 13796 38205 10359 30126 18148 36261
13971 36261 4629 -3378 -17651 25025 55028 27597 -54391 -58812 -61107 -55629 -7965 6351
13959 6351 -39813 -56670 -46114 -72157 -83068 -105480 -80702 -65664 -49904 -34266 -16537 15331
13947 15331 3694 33560 -6180 -2988 -42200 -71096 -75271 -62975 -53218 -38398 -43334 -30967
13935c0967l4675J2274j3171k1782q741j6435k3218j6276N9992K3808k9492n469
13923a04152j7279J5698K9064M405J4811r860o0081l4441J5254J3714J8079m802
13911a19590k914k0364J02748M4149k9349l0133J9993K8516l6673n739j3963N966
13899e7353Q302P690K8686n3497Q309J6292L7170K0758J0828M158k5175n4305
13887d8137J1597l7929K9059K7674m5221l8301m410O149J5607K4985M3466k5473
13875d0934m1836K6603n959K6370K200k024K2532K5812N6534K9483l6000K869
13863F5650L9747p6091n8793K0572K2047k6011p5792q914J9711k7238J9363J5545
13851g0204J3401J5182N0291j4092l5775O2980m7279m5085L1087L0286M492j3486
$$ plain form
13935 -30967 -65642 -53368 -66539 -88321 -97062 -113497 -136715 -152991 -92999 -69191 -98683 -104152
13923 -104152 -121431 -105733 -76669 -72264 -57453 -67313 -127394 -161835 -146581 -132867 -114788 -119590
13911 -119590 -122504 -142868 -40120 4029 -25320 -55453 -35460 -6944 -43617 -49356 -63319 -57353
13899 -57353 -49051 -41361 -12675 -66172 -57863 -41571 -4401 16357 27185 31343 6168 -48137
13887 -48137 -36540 -74469 -45410 -17736 -62957 -101258 -105668 -99519 -83912 -58927 -15461 -40934
13875 -40934 -82770 -56167 -62126 -35756 -33556 -35580 -13048 12764 69298 98781 62781 65650
13863 65650 105397 29306 -29487 -8915 13132 -12879 -88671 -97585 -77874 -105112 -85749 -70204
13851 -70204 -56803 -41621 8670 -5422 -41197 21783 -25496 -70581 -39494 -9208 -4716 -18202
13839a8202m7419n204P5196j368k2517L204j9264k188M100O160j4318j4414l0832
13826h7066j2521L3021N1752m202o8797R631L8615J5200L0094r846m0278K3759
13814b0638l9927j8778P082K1045j0673m1366l9140L5574K4861m80J0924q941
13802h0457m255R791N8636L1442M61j3068j23416n2100J7157K682K0212N788m4580
13789a71707k2240N6757N5664l5572l9212q273J2553K7123O7466N2673k880k8494
13777c6142k1076j8814K888N9358r141L3851m7599l8904p076j1714k906n2251
13765a49526L3960L1214r236J2289J8176J7272N9099J8007k5362J0240p526m1205
13753c2598m7018O308M0137J8496R471J1186K348Q603l8286n4756j2480P2298
$$ plain form
13839 -18202 -65621 -70825 4371 3003 -19514 -16310 -35574 -37762 -33662 -27502 -41820 -56234 -87066
13826 -87066 -99587 -66566 -14814 -19016 -87813 -78182 -39567 -24367 5727 -4119 -44397 -20638
13814 -20638 -60565 -79343 -72261 -51216 -61889 -103255 -142395 -106821 -81960 -82440 -71516 -80457
13802 -80457 -84712 -74921 -16285 15157 15618 2550 -120866 -172966 -155809 -153127 -132915 -127127 -171707
13789 -171707 -193947 -137190 -81526 -117098 -156310 -164583 -152030 -124907 -57441 -4768 -7648 -36142
13777 -36142 -57218 -76032 -73144 -13786 -22927 10924 -36675 -75579 -82655 -94369 -97275 -149526
13765 -149526 -115566 -84352 -93588 -81299 -63123 -45851 13248 31255 5893 16133 8607 -32598
13753 -32598 -79616 -73308 -33171 -14675 -5204 5982 8330 16933 -21353 -76109 -88589 -16291
13741a6291M3878K4877m0756n2150l8630l591K4615j6760N3672Q558n1134R835
13729e3877J1121J4514K3341K0359K4489r452j1496k1802l2371j4776j4517L1941
13717c2526J3710M622J2893K0228J9096j8491J475l0115J4137J4686k3712n2107
13705e6104k5561K1630p28m653k693L1238l3115J7777l407k8688Q722J3415J5151
13692d7016n3564j3255m259p707N1548M6001q57r079j4858l6010q941N8757K8808
13679a0432l7383n0649J6486j4099Q559P4554Q276m7224m3360N5907P7231l9417
13667a551n9200n64n8078l3281L8693l0820k0669N0956J3086l1735J3947M3113
13655g6103n55j145P861k4862l4657n0654K7424O4364j6354l3978O8826M2682
$$ plain form
13741 -16291 27587 52464 11708 -40442 -79072 -82663 -58048 -74808 -21136 -12578 -63712 -53877
13729 -53877 -42756 -28242 -4901 15458 39947 30495 18999 -2803 -35174 -49950 -64467 -32526
13717 -32526 -18816 -14194 -1301 18927 38023 19532 21007 -9108 5029 19715 -3997 -56104
13705 -56104 -81665 -60035 -60763 -65416 -68109 -36871 -69986 -52209 -55616 -84304 -75582 -62167 -47016
13692 -47016 -100580 -113835 -118094 -125801 -74253 -28252 -29109 -38188 -53046 -89056 -97997 -39240 -10432
13679 -10432 -47815 -98464 -81978 -96077 -87518 -12964 -4688 -51912 -95272 -39365 37866 -1551
13667 -1551 -60751 -61315 -119393 -152674 -113981 -144801 -165470 -114514 -101428 -133163 -119216 -76103
13655 -76103 -76658 -77803 -69942 -94804 -129461 -180115 -152691 -88327 -104681 -138659 -69833 -27151
13643b7151K2034n9985J5135k7144n2502j5844M4601P5579N5354K6178j0345m1458
13631D452n8468j9637j9285J3773K2641K2340M0957j0472n7501k0075K822Q580
13619f9873j5798m011K4519l2845o220O9193p024p2387N43J05168J8961Q500O296
13606B5022m3438j11901j1568L9774o08J436k0454m373l2670j5051L097j2028
13594a82762K4882J5120Q2490P4414J9078m9426o2054n4270J9575L7474O288O5656
13582c535R319l5705L7933q266k992m8211p068L2049M0794q1395k0743o1804O116
13569a43508P1881O6641K9355K2937k3166q810N3580J9830k9670j6606K8742l0253
13557D0953j8036n4730m1018j4987n508p479P2428P6209k6353m1816J1006l2534
$$ plain form
13643 -27151 -5117 -65102 -49967 -77111 -129613 -145457 -100856 -25277 30077 56255 45910 4452
13631 4452 -54016 -73653 -92938 -79165 -56524 -34184 6773 -3699 -61200 -81275 -78453 -69873
13619 -69873 -85671 -89682 -65163 -98008 -104228 -35035 -42059 -114446 -113903 -8735 10226 18726 25022
13606 25022 -18416 -130317 -141885 -102111 -102719 -101283 -121737 -126110 -158780 -173831 -170734 -182762
13594 -182762 -157880 -142760 -60270 14144 33222 -16204 -78258 -132528 -112953 -75479 -69191 -3535
13582 -3535 5784 -29921 8012 -254 -3246 -51457 -58525 -26476 14318 -67077 -87820 -149624 -143508
13569 -143508 -71627 -4986 24369 47306 24140 15330 68910 88740 59070 42464 71206 40953
13557 40953 22917 -31813 -72831 -87818 -93326 -100805 -28377 47832 21479 -20337 -9331 -41865
13545d1865L3067m1350m1442k9849N737K6636K7964l2289k2109K8777P1825J548
13533a3350m9149j3670P822l0564K4636j705P657K160K1536j0668J6813J1704
13521b6778J2910L8206L489l5587J6454n456L247m4627j1979m0037n4734j1648
13509a56540K8832J195J6478J1573J2963j3969P734J3792R761K4126p1104l2639
13497a47798K3187J0190j018K167J8366j6506k3997J4816J8598M4973J3092J5222
13485b8708L0581J1921k3094n2268J5111L2653r416k4073j7801J8020j9283k6910
13473i3267j891J8300L1334J7583q226j2915k0793K9749J6463n294k7068n0427
13461a06452k5987L3647L3013J9469l9954l3522L6306N6041L963m3982m3967m5358
$$ plain form
13545 -41865 -8798 -50148 -91590 -121439 -115702 -89066 -61102 -93391 -115500 -86723 -14898 -13350
13533 -13350 -62499 -76169 -68347 -98911 -74275 -75980 -68323 -66163 -44627 -55295 -38482 -26778
13521 -26778 -13868 24338 27827 -7760 8694 3238 6485 -38142 -50121 -90158 -144892 -156540
13509 -156540 -127708 -126513 -110035 -98462 -85499 -99468 -91734 -77942 -68181 -44055 -115159 -147798
13497 -147798 -124611 -114421 -115439 -113272 -94906 -111412 -135409 -120593 -101995 -57022 -43930 -28708
13485 -28708 1873 13794 -9300 -61568 -46457 -13804 -23220 -47293 -65094 -47074 -66357 -93267
13473 -93267 -95158 -76858 -45524 -27941 -36167 -49082 -69875 -40126 -23663 -28957 -56025 -106452
13461 -106452 -132439 -98792 -65779 -46310 -86264 -119786 -83480 -27439 -23476 -67458 -111425 -156783
13449a56783j0521j0131K1969P7412l2236k8977J2187J0964Q829K02J6108j5532
13437a06509K0318k0032p511K6116l189m9063n055K6975N9682N9510L7329k9613
13425H958l8201J3637L7446J2528o0418p602M7340M9432l7940Q413p519L1428
13413E7502l4031K6420M9686L8585K5452L2157N981P8850L268M6975Q746l3621
13401C05970n0435J3294Q0207M1671J8196p772p8072j8845j8002J3000O5359j470
13389C63101q0576p0253J2554N193J951l1513K1653L1166n0376J3927N2312K4635
13377B93774N7103l695q502L6662j9261k6958J6476Q5158k8544n6127k9245j2520
13365C04321J4812l6907j2712l8622j4782K5153k3157o5914m1027J2713n2632
$$ plain form
13449 -156783 -167304 -177435 -155466 -78054 -110290 -139267 -127080 -116116 -107287 -107085 -90977 -106509
13437 -106509 -86191 -106223 -113734 -87618 -90807 -139870 -144925 -117950 -58268 1242 38571 8958
13425 8958 -29243 -15606 21840 34368 -26050 -33652 13688 63120 25180 33593 26074 57502
13413 57502 23471 49891 99577 138162 163614 195771 201752 280602 283870 330845 339591 305970
13401 305970 255535 268829 349036 390707 408903 401131 323059 304214 286212 299212 364571 363101
13389 363101 282525 212272 224826 230019 231970 200457 222110 253276 202900 216827 269139 293774
13377 293774 350877 347182 338680 375342 356081 329123 345599 430757 402213 346086 316841 304321
13365 304321 319133 282226 269514 230892 216110 241263 218106 152192 111165 123878 71246
13354G1246o1279K2637p805N360J3316K6442K1677l9155l4769m8101K6588O3598
13342E9755j1532k8871Q684K7769M0109N2598N8036N7485J4151j1896R097K8313
13330C03698M7971o746k0399L6342K9847K126J1177K02l9497j1714j9681K9528
13318C62854k6832j9397j5584K051l8571r656K2528k8027J7953K4788L1030O113
13306C29250L9919J28303K4265n4697m7748m3361r590O8303M1058m9140J5232
13295D41794p7037o4082O8465r294l8662k1952j5992k9382K5523o784o0155m6696
13283A65746l5812m4133n3483j3301l6543R766m0338j6036R3399L0563l4935o1960
13271c7067m090L4984K1198j5989K0527o711m0887K76J2037j7143o0962n1835
$$ plain form
13354 71246 9967 32604 24799 30159 43475 69917 91594 52439 17670 -30431 -3843 59755
13342 59755 48223 19352 28036 55805 95914 148512 206548 264033 278184 266288 275385 303698
13330 303698 351669 344923 324524 360866 390713 392839 404016 404218 364721 353007 333326 362854
13318 362854 336022 316625 301041 303092 264521 254865 277393 249366 267319 292107 323137 329250
13306 329250 369169 497472 521737 467040 419292 375931 366341 434644 475702 426562 441794
13295 441794 364757 300675 369140 359846 321184 299232 283240 253858 279381 272597 212442 165746
13283 165746 129934 85801 32318 19017 -17526 -7760 -48098 -64134 29265 59828 24893 -37067
13271 -37067 -41157 -6173 15025 -964 19563 12852 -28035 -27759 -15722 -32865 -93827 -145662
13259a45662M2486J0857O044Q949K7952k3280l1241O6760L5813n9124l3899j6657
13247a11002K6780M0392R037o5074K3672l4186q252l232k7761m4136n127L7304
13235a61585M9275L8670k9274N027k6951n0053L3622K3934L1280j1501j8093j2499
13223a28148K3619q854L2940N6133k0966l4808N0301L1009J3669M5921M2988r7551
13211F253k1684J9986N1720n4967k4169K0568K3756m5988n0939m862P715L2386
13199d0225J0629M1761L3991K9030O117L395j8374n545k4321J4620l8845J5632
13187B7865M001m4024M1253j2048j6647K0246q309O1813J6279m1904K0662K2645
13175I1832k4632J6900J4568J4529L8215l3733l0165l6268k9916l2665j2991m8051
$$ plain form
13259 -145662 -103176 -92319 -86275 -77326 -49374 -72654 -103895 -37135 -1322 -60446 -94345 -111002
13247 -111002 -84222 -43830 -34793 -99867 -76195 -110381 -118633 -121865 -149626 -193762 -198889 -161585
13235 -161585 -112310 -73640 -102914 -97887 -124838 -174891 -141269 -117335 -86055 -97556 -115649 -128148
13223 -128148 -104529 -113383 -80443 -24310 -45276 -80084 -29783 1226 14895 60816 103804 6253
13211 6253 -15431 4555 56275 1308 -22861 -2293 21463 -24525 -75464 -80326 -72611 -40225
13199 -40225 -29596 12165 46156 75186 81303 84698 66324 60779 36458 51078 12233 27865
13187 27865 31866 -12158 29095 17047 400 20646 12337 74150 90429 48525 69187 91832
13175 91832 67200 84100 98668 113197 151412 117679 87514 51246 21330 -11335 -24326 -72377
13163g2377r90M885K114K4680L359l5190J1866K8083N1165J7131j7782k9601K4274
13150A1617L1690l2965o85j597O804m0356l3229N159N047j9670k1385K863J00119
13137A3412P3712R796j7504o5750k9698k7416j88k513O2465j7267m4822j5979
13125f1752K9803J0909P362K3362L893k4474J3535k0591K761K6190j2990O400
13113D408K9802k8497k2279J230J0699K7289K8981P185j5395k6085l3558k0103
13101c6323J020L0073N3068j461J0060L2021q052k8637n5744k427O0402J6868
13089G0868O370J1437K452j7485J6663j7462k3292M4389L5291R497j1731l2196
13077I4801K795l0375n6366L780K5047k4569l2904L4566M4578k4348r897K4766
$$ plain form
13163 -72377 -73367 -68482 -66368 -41688 -38329 -73519 -61653 -33570 17595 34726 16944 -12657 11617
13150 11617 43307 10342 9657 8060 14864 -25492 -58721 -53562 -48515 -68185 -89570 -86707 13412
13137 13412 87124 96920 79416 13666 -16032 -43448 -43636 -46149 16316 -951 -45773 -61752
13125 -61752 -31949 -21040 -13678 9684 13577 -10897 2638 -17953 -15192 10998 -1992 4408
13113 4408 34210 5713 -16566 -15336 -4637 22652 51633 58818 43423 17338 -16220 -36323
13101 -36323 -35303 -5230 47838 46377 56437 88458 80406 51769 -3975 -6402 54000 70868
13089 70868 77238 88675 91127 73642 90305 72843 49551 93940 129231 138728 126997 94801
13077 94801 97596 67221 10855 14635 39682 15113 -17791 16775 61353 37005 27108 51874
13065E1874L4919l2081k7443j7281j3556j7431n2061m2107J095M7997M624J1286
13053e0165k7691P502L1120M9777N5172n560o7639l1406K3621K1429q2j0375k3646
13040b7943M543O086k4628K8N948m67j3857j621O7237N180r3675K424M7565L8867
13026A5687M5250o98J9051M1139P9459P8339N8905J01l4884p416j9672l1889N798
13013B49170L183K616j8085p072k6270j6108P844L8608k6089L6156k5331m3265
13001A75357L765J4825J6927J6989J6516M0752L8630O0555L8734m217J8429M489
12989D41751j5268O171J7209O1048Q9879R8743J17464J07915J31040J42143R114
12978A207209J09232K13760K57317K39234J81592J46461J64132K70863K32749
$$ plain form
13065 51874 86793 54712 27269 9988 -3568 -20999 -73060 -115167 -114072 -66075 -61451 -50165
13053 -50165 -77856 -70354 -39234 10543 65715 60155 -7484 -38890 -15269 6160 6078 -4297 -27943
13040 -27943 -23400 -17314 -41942 -41914 -35966 -36433 -50290 -51911 15326 20506 -73169 -70745 -23180 15687
13026 15687 60937 60239 79290 120429 199888 278227 337132 337233 302349 294933 275261 243372 249170
13013 249170 252353 254969 236884 229812 203542 187434 195278 233886 207797 243953 218622 175357
13001 175357 179122 193947 210874 227863 244379 285131 323761 384316 423050 418833 437262 441751
12989 441751 426483 432654 449863 510911 600790 699533 816997 924912 1055952 1198095 1207209
12978 1207209 1316441 1530201 1787518 2026752 2208344 2354805 2518937 2789800 3022549
12969C022549K42620J97605J93057L17163M22389M67535M99236O29158Q86181
12960F877493J131945J510451J957563K580049L465725M642954O003686P062374
12952C5232240P323490O728327N636972M467873L584027K949534K420129J867411
12944G0210003J476625J275363J008730M74416j89750m19562l678Q82096J557000
12935G6271243J265749n5727j842393l334038l949737l934175l665886k991304
12927E7763732j933482j05032K085885L869447M602717M175524K953430J725793
12919G5138014R47251N94032M71946M93196M96720N24944O00753L68161k54059
12910G9380958q44391q25079l77456j05986q23212k399382m150927n358055n873384
$$ plain form
12969 3022549 3265169 3462774 3655831 3972994 4395383 4862918 5362154 5991312 6877493
12960 6877493 8009438 9519889 11477452 14057501 17523226 22166180 28169866 35232240
12952 35232240 42555730 49284057 54921029 59388902 62972929 65922463 68342592 70210003
12944 70210003 71686628 72961991 73970721 74445137 74255387 73835825 73832147 74714243 76271243
12935 76271243 77536992 77481265 75638872 72304834 68355097 64420922 60755036 57763732
12927 57763732 55830250 55725218 57811103 61680550 66283267 70458791 73412221 75138014
12919 75138014 76085265 76679297 77151243 77644439 78141159 78666103 79266856 79635017 79380958
12910 79380958 78536567 77711488 77334032 77228046 76404834 74005452 69854525 64496470 58623086
12901E8623086n921537n895502n900277n725936n258333m324509l269498k366630
12893A9960864j592060r76334o06831k66193N9554L55381P78045J296860K118718
12884B1128004L145412M311143N304728O039258O632897P260967P779221P793071
12876F9394701O827913N040621L024175J637312J072346R81046J178089J273506
12868I0429709P76314J14518m13699o05594m69053j4356L54351K78652n41944
12859H9908898j997392l770048m965748n001509l972650k265012k69942J503070
12851F9169667K976712M203921M984131N103001L961158K088141L55385n24351
12843I2317765l50053K97300M83034L21225o6486m80609p98259j184025j522623
$$ plain form
12901 58623086 52701549 46806047 40905770 35179834 29921501 25596992 22327494 19960864
12893 19960864 18368804 17392470 16785639 16519446 16579000 16934381 17712426 19009286 21128004
12884 21128004 24273416 28584559 33889287 39928545 46561442 53822409 61601630 69394701
12876 69394701 76222614 81263235 84287410 85924722 86997068 87978114 89156203 90429709
12868 90429709 91206023 91320541 90906842 90301248 89832195 89817839 90172190 90450842 89908898
12859 89908898 87911506 84141458 79175710 74174201 70201551 67936539 67666597 69169667
12851 69169667 72146379 76350300 81334431 86437432 90398590 92486731 92842116 92317765
12843 92317765 91967712 92265012 92748046 93069271 93002785 92522176 91723917 90539892 89017269
12834H9017269j789476j918734k398457l455200n040631o686518p851256q338600
12826E1538397q046800p220937o100478m899761l892611l032162k328608j823973
12818A4193067j492696j169118r78345q49495p03733p39138o48048n34245m63633
12809F614616l95185k81302l20065l21149l20793k74499k14704k89597k63296
12800C934026k37027j33220j46570k14468j54543n3457o9139o5956o8310j35094
12790B656242j06109q9342q2222o5296n7774j8442p9138N840n1748j25577j17342
12779A869092m4075k4903k0554p9380l8231m0057l5265j3208p5421m9857K4315
12768A472456n1627J0715p1116m6673j310j7655K3744L4530J9281k6326p3526
$$ plain form
12834 89017269 87227793 85309059 82910602 79455402 74414771 67728253 59876997 51538397
12826 51538397 43491597 36270660 30170182 25270421 21377810 18345648 16017040 14193067
12818 14193067 12700371 11531253 10552908 9703413 8999680 8260542 7612494 7078249 6614616
12809 6614616 6219431 5938129 5618064 5296915 4976122 4701623 4486919 4197322 3934026
12800 3934026 3696999 3563779 3417209 3202741 3048198 2994741 2925602 2859646 2791336 2656242
12790 2656242 2550133 2460791 2378569 2313273 2255499 2237057 2157919 2163759 2112011 1986434 1869092
12779 1869092 1825017 1800114 1779560 1700180 1661949 1621892 1586627 1573419 1497998 1448141 1472456
12768 1472456 1420829 1431544 1360428 1313755 1312445 1294790 1318534 1353064 1372345 1346019 1272493
12757A272493q6066l7421J3217J256o183J8670j6238J7106r884K0136O769m4197
12745A149658k5186m3332l5763j3239j7861n0284l1743L0038M8163K2519l7637
12734I95333m1156k5428J2161j0459j1331l4852n7530l5510J8096l9431j3058
12723G56835K6671N9614J3980j0340l0592m2627R798k8570l5657j5551J9902J3777
12711G37240m1085j4215k7363n5820o608J9751J8118L3578k7709l4833k609m6432
12699E52013j6818k460m34K1245j6733j8937k7819j8833m831k2722R316J3145
12687D66132j0960N4089N7357M6373m0417j0520m612r620k4231l7442K7739K2592
12675E36480j9004o7812q3413K5360J0283j0566j1499N0948m0855j4400o9697
$$ plain form
12757 1272493 1186427 1149006 1162223 1163479 1157296 1175966 1159728 1176834 1166950 1187086 1193855 1149658
12745 1149658 1124472 1081140 1045377 1032138 1014277 963993 932250 962288 1010451 1032970 995333
12734 995333 954177 928749 940910 930451 919120 884268 826738 791228 809324 769893 756835
12723 756835 783506 843120 857100 846760 816168 773541 783339 754769 719112 703561 723463 737240
12711 737240 696155 681940 654577 598757 592149 611900 630018 663596 635887 601054 598445 552013
12699 552013 535195 532735 532301 553546 536813 517876 490057 471224 466393 443671 452987 466132
12687 466132 455172 509261 566618 612991 572574 562054 557442 547822 523591 486149 513888 536480
12675 536480 517476 449664 366251 391611 401894 391328 379829 430777 389922 375522 305825
12664C05825K0851j1759j7770j8749j2907o883P313L1966l4063k020P0941R3081
12652D25826P0795P2245L5050k9004J0703n497m5459Q54k8441n1729q7713l4378
12640C33252J4991J8702R030j6623m7606j4213K8979J2514m6024n7727n586P5967
12628C05656M4283P1579K0846L2980L0141k1825O161n276N526k8320J5942J3647
12616D91340r735L6488m9248n8410K3523K4980O510j1897O259j5066k2436k3825
12604C98483P262P782o8383r921k342k7580j026P0037J2003p7049r598L0209L7833
12591C67710L3139N1074r822k5401n7579k2121J861K0759L795J1942l5355j6164
12579C23838O3731N8603j2721k2315J9696l922k6472M7090j7590k10j0365r5675
$$ plain form
12664 305825 326676 314917 297147 278398 265491 258608 265921 297887 263824 261804 332745 425826
12652 425826 496621 568866 603916 574912 585615 580118 534659 535513 507072 455343 367630 333252
12640 333252 348243 366945 375975 359352 311746 297533 326512 339026 293002 235275 229689 305656
12628 305656 349939 421518 442364 475344 505485 483660 489821 484545 490071 461751 477693 491340
12616 491340 481605 518093 468845 410435 433958 458938 465448 453551 459810 444744 422308 398483
12604 398483 405745 413527 345144 335223 332881 305301 304275 374312 386315 309266 299668 329877 367710
12591 367710 400849 451923 442101 416700 359121 337000 338861 359620 363415 375357 340002 323838
12579 323838 387569 446172 433451 411136 430832 426910 400438 447528 429938 429728 419363 323688
12567C23688m0286K0221N8788L6073J3057L0506K0834R1281P2209R6908J04477
12556H27756M4063J43144J42052J80486J38730M3629k3022n2045m1499j8294k824
12545A382176K2351R8515J44352J42766J10917P4448N0524O6151R5580J26116
12535B313896M6043l1253L7311m6222j25936j67926j35661j12741n7955l5069
12525A684487j990N7410O2333Q4448P3817P6451N5913p0579r6837j23856j42333
12514A659264j70006j17002l3047k5355m8612J7062O448N5232N7540R9357J50833
12503A651714J51663J77029K63923K99160K36817O0552q7350k04432k35741j71123
12493B142212j51778j27996o7560p5640r6859R840k234N4689J35148J70741J59134
$$ plain form
12567 323688 283402 303623 362411 398484 411541 442047 462881 554162 626371 723279 827756
12556 827756 871819 1014963 1157015 1337501 1476231 1519860 1496838 1444793 1403294 1385000 1382176
12545 1382176 1404527 1503042 1647394 1790160 1901077 1975525 2026049 2092200 2187780 2313896
12535 2313896 2359939 2328686 2365997 2319775 2193839 2025913 1890252 1777511 1719556 1684487
12525 1684487 1682497 1739907 1802240 1886688 1960505 2036956 2092869 2022290 1925453 1801597 1659264
12514 1659264 1489258 1372256 1339209 1313854 1265242 1282304 1288752 1343984 1401524 1500881 1651714
12503 1651714 1803377 1980406 2244329 2543489 2780306 2840858 2753508 2549076 2313335 2142212
12493 2142212 1990434 1862438 1794878 1719238 1622379 1632219 1629985 1684674 1819822 1990563 2149697
12482B149697J63643J64093J27640J82904O7751j15762k79255k26930j70256k09207
12472A854318j53674j83938j36001j33870o4395m081j4668m9777L9353N0594L4022
12461A237883P8057R8631Q8031Q7750J7043n1898o8907j5892p1725l9014k4165
12450A335794n800L6038J3460P2144K6441O3296N7935J3935j7443q0497j12206
12439A403097j13458j11197j47781q3558m0361o6369l576L0398l9692o8208r8294
12428F61001o8571n1884j5611K970l9234n5543m6408J9692O2254J02367L7636
12417F08669J1937j8991N0793O0664M4558j1727n656l2890r283M5733M7756m4976
12405G46587j3272M4527j3852o9889k2893M2085o550J3377K3221j3071l4984J875
$$ plain form
12482 2149697 2313340 2477433 2605073 2787977 2855728 2739966 2460711 2233781 2063525 1854318
12472 1854318 1700644 1516706 1380705 1246835 1182440 1178359 1163691 1113914 1153267 1203861 1237883
12461 1237883 1315940 1414571 1502602 1590352 1607395 1555497 1486590 1470698 1398973 1359959 1335794
12450 1335794 1329994 1366032 1379492 1451636 1478077 1541373 1599308 1613243 1595800 1515303 1403097
12439 1403097 1289639 1178442 1030661 947103 906742 840373 836797 867195 827503 759295 661001
12428 661001 592430 540546 524935 527905 488671 433128 386720 406412 468666 571033 608669
12417 608669 620606 601615 652408 713072 757630 745903 740247 707357 698074 743807 791563 746587
12405 746587 733315 777842 763990 694101 671208 713293 706743 720120 743341 730270 695286 697161
12393F97161o508k1426n404j9745J5820Q6434L7138P0620Q5166K7974N3445j1242
12381A009433k8074O044Q998k4483l1406m1168K0129M6410L1308N7349N8755M677
12369A117972k7090j3882j06916j10341n9088j05517j7972N22n0647m9052k5940
12358E52049q7624k5899Q797l5905n6579j6062J1597j8465p8253R870Q3568K982
12346C50076o8790l4791O505J3586j2504j1229N351o079J3570l8743l7293K0195
12334A99854k720j1786L8682j4611K8100M3455p682l2659j5618m5409j16708j3170
12322D9728r584J4141O2694O6721L0107J7485j0425j7188o8479q652K4843o2957
12310H8434J9537M7799j1720J4725J4671l7657N318R4986J1447l3422l5454M4879
$$ plain form
12393 697161 690653 669227 663823 644078 659898 746332 783470 854090 939256 967230 1020675 1009433
12381 1009433 981359 987403 996401 971918 940512 899344 919473 965883 997191 1054540 1113295 1117972
12369 1117972 1090882 1077000 970084 859743 800655 695138 677166 677688 627041 577989 552049
12358 552049 464425 438526 447323 411418 354839 338777 350374 331909 253656 263526 347094 350076
12346 350076 281286 246495 253000 266586 254082 242853 248204 242125 255695 216952 179659 199854
12334 199854 197134 185348 224030 209419 237519 280974 273292 240633 225015 179606 62898 49728
12322 49728 40144 54285 116979 183700 213807 231292 220867 203679 135200 126548 151391 88434
12310 88434 107971 155770 144050 158775 173446 135789 141107 236093 247540 214118 178664 223543
12298B23543o2612p309M6280m1976n8027J3468P553k2872M4533L2097n4855m1992
12286G7831O7123q571l6383L319J6079j1970K4925O621O100K3859N8037N7989
12274B84959n4095p2101j6041J2380O521N4974K7070n9309m6964K868J6169k8108
12262A28323K1649M3590L865m4239O1557J0564o6799j2364J1773k2788J5600K0435
12250A71166J9879k2165m7309l537m6251K5625K848l5324m3050L1582J2518j266
12238F4716k0226k8094L5202P0259J1140K006q149k609Q3745j637j3244k6440
12226A66669m2837l9064N04K1714p819K519K036M5142M9571m0985J0905P4644
12214B42999j0393l4474l8828j1377K5497k8119p4886L0737L0404p8384K4L5157
$$ plain form
12298 223543 160931 153622 199902 157926 99899 113367 120920 98048 142581 174678 119823 77831
12286 77831 144954 136383 100000 103319 119398 107428 132353 138974 145074 168933 226970 284959
12274 284959 230864 158763 142722 155102 161623 216597 243667 184358 137394 140262 156431 128323
12262 128323 149972 193562 197427 153188 214745 225309 158510 146146 157919 135131 150731 171166
12250 171166 191045 168880 121571 118034 71783 97408 100256 64932 21882 53464 65982 64716
12238 64716 44490 16396 51598 121857 132997 135003 126854 124245 207990 206353 193109 166669
12226 166669 123832 84768 85272 106986 99167 101686 103722 148864 198435 157450 168355 242999
12214 242999 232606 198132 159304 147927 173424 145305 70419 101156 131560 53176 53200 88357
12202H8357j287r426r560R9810O4254qP808k9515m4504m6392j2000M575L3723
12189A45835M9427p099m9648p602N3434J8605k9405k8236L6421P9220L0121N2711
12177C43784K0822P8639J07641J32637N2125N6451k0685o3870q8414o6239o7725
12166D85166m6899m6715M531J06424p757n9194n133q600k8320M6752O0524j7731
12154D83048k2478m776L5142M7788O0780L9243n074p514P1945J9504L5177K0069
12142G72854J3124k4446M4120M9415J8467P5465J27043Q0695R6482K44904K83196
12131A781319L60592M35831L66958K00055j1428j89711k36891j89713j52550N1111
12121B415573M2274Q3671K11043K51588K90866L98150N36208N83369O56806Q25193
$$ plain form
12202 88357 87070 77644 68084 167894 232148 232140 239948 210433 165929 119537 107537 112112 145835
12189 145835 195262 188163 138515 130913 184347 202952 173547 145311 181732 260952 291073 343784
12177 343784 364606 443245 550886 683523 735648 792099 771414 707544 619130 552891 485166
12166 485166 438267 391552 396083 502507 494750 435556 430423 421823 393503 440255 500779 483048
12154 483048 460570 455794 490936 538724 599504 638747 633673 626159 698104 717608 752785 772854
12142 772854 785978 761532 805652 855067 873534 948999 1076042 1156737 1253219 1498123 1781319
12131 1781319 2141911 2577742 2944700 3144755 3133327 2943616 2706725 2517012 2364462 2415573
12121 2415573 2457847 2541518 2752561 3004149 3295015 3693165 4229373 4812742 5469548 6294741
12111F294741J077825J354971J625763J909323K087877K501356L236905M447141
12103B4535902O362308Q724843J1369982J3444034J3504776J0264449M413577
12096I2619871j502921n368558o675953o297074n031685l153253p90055J869155
12088F5669527M461701O848696Q570193Q964386O687973J179868n662114j0843527
12080H5876703j2905533j2398754j0631339q582110o811391n324188m266711l481587
12072B1475090k882611k408219j988079j560687j281851j015996q02942p01903
12064H832802n44032m78205m18327m10415l87456l04473k30436j61428r1720n4096
12054E752214n8566o0836j9351L9987K2087Q4738J00887J45822L17768M76297
$$ plain form
12111 6294741 7372566 8727537 10353300 12262623 14350500 16851856 20088761 24535902
12103 24535902 30898210 39623053 50993035 64437069 77941845 88206294 92619871
12096 92619871 91116950 85748392 79072439 72775365 67743680 64590427 63800372 65669527
12088 65669527 70131228 76979924 85550117 94514503 101202476 102382344 96720230 85876703
12080 85876703 72971170 60572416 49941077 41358967 34547576 29223388 24956677 21475090
12072 21475090 18592479 16184260 14196181 12635494 11353643 10337647 9534705 8832802
12064 8832802 8288770 7810565 7392238 6981823 6594367 6289894 6059458 5898030 5806310 5752214
12054 5752214 5693648 5632812 5613461 5653448 5675535 5760273 5861160 6006982 6324750 6801047
12044F801047O35672P63977Q32857R73892J013495J081784J357689J702860K139319
12035A7302592K755789L455210L973062M732476N957798P793944J0356696J3630428
12027F9957995J6958034J9742271K1114016J9683708J4882561P509985o44687
12020A69203883p190885j0728956j1201048r179923n500741q67276L911034P871450
12012A36317538J0352035J1032090R426319N178265j248179q728212j5386542
12005A46943314j9400748k0169321j8386615j5478386j2408478r708533p624030
11998D3767203o193185n134739m337902l695390l081919k542956k049779j710438
11990A5020895j406432j127037r94063q58515p16349o76371n31311m86844m25809
$$ plain form
12044 6801047 7436719 8200696 9033553 10007445 11020940 12102724 13460413 15163273 17302592
12035 17302592 20058381 23513591 27486653 32219129 38176927 45970871 56327567 69957995
12027 69957995 86916029 106658300 127772316 147456024 162338585 169848570 169203883
12020 169203883 162012998 151284042 140082994 130903071 125402330 124535054 128446088 136317538
12012 136317538 146669573 157701663 167127982 172306247 171058068 162329856 146943314
12005 146943314 127542566 107373245 88986630 73508244 61099766 51391233 43767203
11998 43767203 37574018 32439279 28101377 24405987 21324068 18781112 16731333 15020895
11990 15020895 13614463 12487426 11493363 10634848 9918499 9242128 8710817 8223973 7798164
11981G798164l33370k62501k12479j79419j21844j05115n8055q7754p1934N4378
11971F420071J77825J66394J28373J66166K83935L22905L26546M63726N78172
11962I034113P68342J068981J308274J664400J999744K400336L088358M078115
11954B5410663N479571P347038R529576J1546951J2154522J0367771O083167N11007
11946H8430266m418570p119116p433993o180189l997024j516482Q72552K922829
11938F1560273M487261N693279O129176N045167K078865k432475p305396j0799089
11930F4457061j1557900j0314778q192495o041301m467803l415847k710914k163812
11922A5592211j880179j686766j452211j233616j002218q72839p99668o64490
$$ plain form
11981 7798164 7464794 7202293 6989814 6810395 6688551 6583436 6525381 6437627 6365693 6420071
11971 6420071 6597896 6764290 6892663 7058829 7342764 7665669 7992215 8455941 9034113
11962 9034113 9802455 10871436 12179710 13844110 15843854 18244190 21332548 25410663
11954 25410663 30890234 38237272 47766848 59313799 71468321 81836092 87919259 88430266
11946 88430266 84011696 76892580 69458587 63278398 59281374 57764892 58637444 61560273
11938 61560273 66047534 71740813 77869989 82915156 84994021 82561546 75256150 64457061
11930 64457061 52899161 42584383 34391888 28350587 23882784 20466937 17756023 15592211
11922 15592211 13712032 12025266 10573055 9339439 8337221 7464382 6664714 6000224
11914F000224n05760l86247l46812l64193k72192j92621j81629j73760j57958
11905C419052j76361j55784p8105m9668j02020j54137j23575p1301o0541j17461
11895B330099j01556m2891l3410p2330l5954n9984j12401r9878p6243l5721m8101
11884A611630k5969J681r8033j9752k494j7009q2737o2116n1358m5669k3861k3217
11872A161096l8325n3740q6846M0713k086j3431K0362J7700q542J7315j0830r4025
11860I49361n7893R030r093k8543p0132k5388K0244k417K0060j9596L1691K1042
11848H38366m917M3386J208r503k6679l3978Q458M075n9797j4261L0264l3189
11836G43433k5217q915N6012L9192p045m7520k1994Q392M5821p232l6922k0690
$$ plain form
11914 6000224 5494464 5108217 4761405 4397212 4125020 3932399 3750770 3577010 3419052
11905 3419052 3242691 3086907 3008802 2959134 2857114 2702977 2579402 2508101 2447560 2330099
11895 2330099 2228543 2185652 2152242 2079912 2043958 1983974 1871573 1771695 1695452 1659731 1611630
11884 1611630 1585661 1587342 1489309 1469557 1467063 1450054 1367317 1305201 1253843 1208174 1184313 1161096
11872 1161096 1122771 1069031 982185 1022898 1020812 1007381 1027743 1045443 1036901 1054216 1043386 949361
11860 949361 891468 900498 891405 862862 792730 767342 787586 785169 805229 785633 817324 838366
11848 838366 833449 876835 878043 868540 841861 807883 816341 820416 760619 746358 776622 743433
11836 743433 718216 709301 765313 804505 797460 749940 727946 736338 782159 774927 738005 717315
11824G17315J0232N6244n839l4168l8306l0501o7716J8975L8599q876n3025o5517
11812E37417j8747l4950J4901L943R5675M4268o047m8890j2962r1215l7055j1217
11800D35121k6175j9774N6260l2315j5533l5998p620k6527O4703J5772O324j0048
11788D04190l8894J2915L7615p792m6632p134k8429k3039m4825K0522K4134j8712
11776B83919M2552P724K3519L6515j3212o06p941K0423n3987n6325L335L5081
11764C20997n840l7987j3813k7271K0028J1721j0768L085N4796K8484n7250m5941
11752B40241P421k4766K4944J5596k32M627J2832m7853k0703m820K9519K801l6562
11739B03045K3890J0638n3909M4401L0436j0373L2248K7563p491p988l8125M4195
$$ plain form
11824 717315 727547 783791 777952 743784 705478 674977 607261 626236 664835 655959 602934 537417
11812 537417 518670 483720 498621 502564 598239 642507 636460 587570 574608 483393 446338 435121
11800 435121 408946 389172 445432 413117 397584 361586 353966 327439 392142 407914 414238 404190
11788 404190 365296 378211 415826 408034 361402 354268 325839 302800 257975 278497 302631 283919
11776 283919 326471 334195 357714 394229 381017 380411 372470 392893 338906 282581 285916 320997
11764 320997 315157 277170 263357 236086 256114 267835 257067 260152 314948 343432 286182 240241
11752 240241 247662 222896 247840 263436 263204 267831 280663 232810 212107 207287 236806 239607 203045
11739 203045 226935 237573 183664 228065 258501 248128 280376 307939 300448 292460 254335 298530
11727B98530K495l6080J6371r795r241p035J2875l575l8751J27L0445M010j7297
11714B43079k1472j0717K2365K6175j09j4453J4843j8535q23j2457J298J9120
11702B48314J8272J3005n5661l6660N1955Q128m1265j0509L9111O7285O000k6674
11690B81301l0188j4386M0358O9466N102n2951n4244k4008l6119K5389K8177J1145
11678B49042J8060k4992J3578J10026j0597l5993k8621n6274j04373Q270J04876
11667B43002M6812J680n179J8472j2586K9833J5749M0528O8563P822P1716N9655
11655E86067J7338Q0635N4835k4743q0104o8300J0891K0074M884k5736n906l059
11643E66876M5704P6389L4779L7274r378q9149o3016n2710j13015n4762Q593j7892
$$ plain form
11727 298530 301025 264945 281316 271521 262280 255245 268120 264545 225794 225921 256366 260376 243079
11714 243079 221607 210890 233255 259430 259321 244868 259711 241176 240353 227896 229194 248314
11702 248314 266586 279591 223930 187270 239225 247353 206088 195579 234690 301975 307975 281301
11690 281301 251113 236727 277085 346551 351653 298702 244458 220450 184331 209720 237897 249042
11678 249042 267102 242110 255688 365714 355117 319124 290503 234229 129856 138126 243002
11667 243002 289814 291494 286315 304787 292201 322034 337783 378311 446874 454696 526412 586067
11655 586067 603405 684040 738875 714132 634028 565728 576619 596693 601577 575841 569935 566876
11643 566876 612580 688969 723748 761022 751644 662495 599479 546769 433754 378992 387585 369693
11631C69693k7567k1832m8507k6452o358N6390j0248k9589O710l8614j4188k9754
11619A79684J1084N4800j1298l0571m1595j480M6705N5676K6999m7828j4061m6707
11607A81408K0062N3149M3084O733n0501m5886l0025K5007M936k502l1569K8768
11595B02664n674J2114r061R192N3229K4011P2677J01304M3904J4468Q2490J02928
11583G04246J16009J42068K6860N462J8554J1412l9331m4859p4024l0402Q810
11572H44805L5359N1194P3634O8624N6687l3598n4448q580p8305o5369n4159j40822
11560F95022j19461j06315r081k4662p4676m5827r63K160k044J9455l0145j3442
11548B90021m2330m3353K1932j0192j4696O6654p259o1148M0517K5195j0968j8030
$$ plain form
11631 369693 342126 320294 271787 245335 238977 295367 285119 255530 262240 223626 209438 179684
11619 179684 190768 245568 234270 203699 162104 160624 207329 263005 290004 242176 228115 181408
11607 181408 201470 254619 297703 304436 253935 208049 178024 203031 207967 205465 173896 202664
11595 202664 196990 209104 200043 209235 262464 286475 359152 460456 504360 518828 601318 704246
11583 704246 820255 962323 989183 994645 1013199 1024611 985280 940421 866397 835995 844805
11572 844805 880164 931358 1004992 1073616 1130303 1096705 1042257 1033677 955372 890003 835844 695022
11560 695022 575561 469246 460165 435503 360827 315000 314037 316197 314153 333608 303463 290021
11548 290021 247691 204338 226270 216078 201382 268036 260777 199629 240146 265341 254373 236343
11536B36343k9196L8864K7808K67M831j8289m8839p821P196j9117L9432l9990
11524A91489l1059M7913L9741K4184o8566q584r462o1604J2264Q1876N9014K5239
11512C02445L5668k3741K6462R3716O6306M2550N0508J6994l7222n4150k6729
11501D92807n0770p1181K0284P210J8317O8289L5803N0032K4941J182k1686l4987
11489E40241n1159o3637m5626K453l4290p0734o9494k1217J2596m2447p536n7831
11477I1319o6992N2012P8353L8481L8021O862l3204l6468o391L0931K0066J6956
11465B29946j5972J9710O477l8839k4422Q251k9709j3640M6836L1656J2915K5892
11453B59101j050Q864J4061m2431L3300j37k2185l4900k0869J10268O8503p8964
$$ plain form
11536 236343 207147 246011 273819 274086 278917 260628 211789 203968 211164 192047 231479 191489
11524 191489 160430 208343 248084 272268 203702 195118 185656 124052 136316 218192 277206 302445
11512 302445 338113 314372 340834 434550 500856 543406 593914 610908 573686 519536 492807
11501 492807 442037 370856 391140 398350 416667 484956 520759 570791 595732 596914 575228 540241
11489 540241 489082 425445 379819 382272 347982 277248 207754 186537 199133 156686 149150 91319
11477 91319 24327 76339 154692 193173 231194 238056 204852 168384 161993 192924 212990 229946
11465 229946 213974 233684 240161 201322 176900 185151 155442 141802 188638 220294 233209 259101
11453 259101 258051 266915 280976 238545 271845 271708 249523 214623 193754 304022 372525 293561
11441B93561n450M1548K814r546k5221j0128o1870m2497p7671N5981N3682K3603
11429B38806k7600M815O4982j08n748l6202k5784m5840k0845K9918m8450o6453
11417F1491N2824L1476L0834J0045l5138Q604J1637n5260m388J4976L2586j6422
11405A43265p836k2648l9485J5807L7924q216J1361L9198l0201k1909k0594K2316
11393A18982K5338r732L4703L0305K0725j1749l1142k6227j9558o132m1656l6539
11381D7318M8804n921P202L371J5281N9379j3580n1373P22Q004K6249J4664k5074
11368A35046K533l3068k2472K3513l526j9062l2801J3839Q442q79O9406K277j1922
11355A31326m1360m533n457J3074N521j7021K2507K7790j2991k2761M9949n4928
$$ plain form
11441 293561 288111 329659 332473 322927 297706 287578 225708 183211 105540 161521 215203 238806
11429 238806 211206 216021 281003 280895 275147 238945 213161 167321 146476 176394 127944 61491
11417 61491 114315 145791 176625 186670 151532 160136 171773 116513 112125 127101 159687 143265
11405 143265 135429 112781 73296 89103 127027 118811 130172 169370 139169 117260 96666 118982
11393 118982 144320 134588 169291 199596 220321 208572 177430 151203 131645 125513 83857 47318
11381 47318 96122 90201 97403 100774 116055 175434 161854 110481 111203 119207 145456 160120 135046
11368 135046 137579 104511 82039 105552 102026 82964 50163 64002 72444 71565 140971 143248 131326
11355 131326 89966 85433 79976 93050 98571 81550 104057 131847 118856 96095 146044 91116
11343I1116L413N3367L4586p2600m8151l0739l5700O7029O187J0047J2431L6647
11331A27633N6946k0374q599J2700l1064J5830J1604k1420p4272p2137k5678O5900
11319C7069O7468N9615L5282l4585o5886m73K310J5944L7199k4237k5821k6056
11307G7829p540L7826P034k3719K1859J877m0748k4420l696n50J632K1503K4043
11294I2930K5647j3248O0358N385m8401J0761L1176j3835k8078q6411k2312K0524
11282C4496K026k2512j8092P695J5572M5828P3916L1812k0879n7174J3807q417
11270I8078R531l5429M023M364k8148Q505L7796K816m3890k3662L0498M7443M321
11257A16246n246k2091O12M8989K2368M8250j4750m5072k9537l696m0954M3829
$$ plain form
11343 91116 94529 147896 182482 109882 61731 30992 -4708 62321 68508 78555 90986 127633
11331 127633 184579 164205 155606 168306 137242 153072 164676 143256 68984 -3153 -28831 37069
11319 37069 104537 164152 199434 164849 98963 98490 100800 116744 153943 129706 103885 77829
11307 77829 70289 108115 115149 91430 113289 115166 74418 49998 46302 45752 47384 68887 92930
11294 92930 118577 105329 165687 171072 122671 133432 164608 150773 122695 36284 13972 34496
11282 34496 36522 14010 -4082 3613 19185 65013 138929 170741 149862 92688 106495 98078
11270 98078 107609 72180 76203 80567 52419 60924 98720 101536 57646 33984 64482 111925 116246
11257 116246 111000 88909 89521 138510 160878 209128 194378 149306 119769 116073 75119 118948
11245A18948K9878j9942j9290L7582P3060r689p558n2095k7702K8800l5532k782
11233A13678j237l2898o5732j1113K2042M0066O927k3623p534Q066K4155m2930
11221B9867K2466M2823J2760n0890j5655L1570J0047N8449o313k1045m9322k4508
11209D0249k1932O507L8855j0746J9906J7251k3843J9798l3939j6170L0738k7171
11197C9503r884j578M4652Q4419J3447r2180o9663l3040n641J5565K6692L2231
11185D4523K1087K3636l4632j9341j700J2184M4984J0575n2462j9753N4739M7421
11173A31261M010N468O4550l7250o5132k052k6730l8502L9108N2833K0435Q431
11161A56430l7708l3978J3836l1404j9996K4250n45o9418k1236O0348K9258L2492
$$ plain form
11245 118948 148826 128884 109594 147176 220236 210547 202989 150894 123192 151992 116460 113678
11233 113678 112441 79543 13811 2698 24740 64806 71733 48110 40576 48642 72797 29867
11221 29867 52333 95156 107916 57026 41371 72941 82988 141437 135124 114079 64757 40249
11209 40249 18317 24824 63679 52933 72839 90090 66247 86045 52106 35936 66674 39503
11197 39503 29619 28041 72693 157112 170559 78379 8716 -24324 -29965 -14400 12292 44523
11185 44523 65610 89246 54614 35273 33573 45757 90741 101316 48854 29101 83840 131261
11173 131261 135271 140739 205289 168039 102907 100855 74125 35623 74731 127564 147999 156430
11161 156430 118722 84744 98580 67176 47180 71430 70885 1467 -19769 40579 69837 102329
11149A02329k3041K2426l1298n6462l249l9569N5331M5750j1435n6020O909J3419
11137B5090m629K1984K6338O478J6021K2652j9451j6892L9358O554L1037O4204
11125B18744o4449k426n9371k4015K0235M3366M794M6429M2940o3777l8042M278
11113A28706M791k263p945k5149k1945q007J4286J6226M8559M7081O0338L1188
11101B85866m6282n1689L0788k8189l7524J952K3334r1890n2403N914j1577J7778
11089D6078L3780L377J7303m2315L804K3285P983O024K191K036M3962k9628p2103
11076D5777o8003N2881Q8981J615k2402k0602J0792J2400K9748J1722l0089l1958
11064H0862L178Q1426K9514n6806j0769K0653n265q648n0754k4596L6963j157
$$ plain form
11149 102329 79288 101714 70416 13954 10705 -28864 26467 72217 60782 4762 11671 25090
11137 25090 20461 42445 68783 75261 91282 113934 94483 77591 116949 123503 154540 218744
11125 218744 154295 151869 92498 68483 88718 132084 136878 183307 226247 162470 124428 128706
11113 128706 133497 131234 123289 98140 76195 68188 82474 98700 147259 194340 254678 285866
11101 285866 239584 187895 218683 190494 152970 154922 178256 86366 33963 39877 28300 46078
11089 46078 79858 83235 100538 58223 62027 85312 93295 99319 101510 103546 147508 117880 45777
11076 45777 -22226 30655 119636 121251 98849 78247 89039 101439 131187 142909 112820 80862
11064 80862 84040 165466 194980 138174 127405 148058 142793 134145 83391 58795 95758 94601
11052I4601m693k4628L4423M5355M8581q449o1331p5111r190j318j5197l56K0301
11039D2988n4064M645N8503K3310K5341j4204j5714K181J7359M4053n278j8676
11027A10444m9042J304k5768j5140M9997K8906j2061m1906k5663L191M1950N3025
11015A19237P7039N1245k3674n8565m7248j1968N6914k8682n0431K8754K296k7362
11003H7555n976k9548J7985M847J5639J8369M1107J4995q441m5919p2320k9019
10991I274j7395m1871n504M4618Q9710J5407M4456o708p1265O174o690J3037O2792
10978A36035K8158N6930J5551o6889l4272R818K7594m0567m8149p7956K1957j2176
10966A6034j57L6083o249N6712l600j4423j3820l6054K6401L5087O2878j119l7939
$$ plain form
11052 94601 89908 65280 99703 145058 193639 185190 123859 48748 39558 38240 23043 22687 42988
11039 42988 -11076 -6431 52072 75382 100723 86519 70805 72986 90345 134398 129120 110444
11027 110444 61402 62706 36938 21798 71795 100701 88640 46734 21071 24262 66212 119237
11015 119237 196276 247521 223847 165282 118034 106066 162980 134298 83867 112621 114917 87555
11003 87555 81579 52031 70016 74863 90502 108871 149978 164973 156532 110613 38293 9274
10991 9274 -8121 -49992 -55496 -10878 78832 94239 138695 131987 60722 66896 60206 73243 136035
10978 136035 164193 221123 236674 169785 135513 145331 172925 132358 84209 6253 28210 16034
10966 16034 15877 51960 45711 102423 98823 84400 70580 34526 60927 96014 158892 157773 119834
10953A19834m5711J7212j7671p1596j7571k896M2548P0817m548j0025l1041m0008
10941I344K3228K6095O310n938L950j5836p4327l6984J7036J2666n4418j6594
10929a05468L4286n158O3613Q3661j9035K868J8159K8306J818n8035K5653K8865
10917I9533l1991k8955m7634L041K2141M4440n0900p1119J5546N7131K0064k6061
10905E236L6267L4619K1177m6636l0953j6585k8792N419J9845L0038J3545L0058
10893G3238K6739l202l435k0760k3980J9714Q3221J294J2291k7159N91l0009l2010
10880G6533J7975J5962j1711P080l487K0720L142R632j6991m1804l3952J9517
10868F2616K5186M2371L5533o4838k4847k2500J7621p932m8546J9071M7071J2005
$$ plain form
10953 119834 74123 91335 73664 2068 -15503 -18399 24149 94966 90418 80393 49352 9344
10941 9344 32572 58667 64977 59039 62989 47153 -27174 -64158 -47122 -34456 -88874 -105468
10929 -105468 -71182 -76340 -12727 70934 51899 54767 72926 101232 103050 45015 70668 99533
10917 99533 67542 38587 -9047 -6006 16135 60575 9675 -61444 -45898 11233 31297 5236
10905 5236 41503 76122 97299 50663 19710 3125 -25667 -20248 -403 29635 43180 73238
10893 73238 99977 96775 93340 72580 48600 68314 151535 152829 165120 137961 138552 108543 76533
10880 76533 94508 110470 98759 105839 102352 123072 126214 135846 118855 77051 43099 62616
10868 62616 87802 130173 165706 100868 76021 53521 71142 63210 14664 33735 80806 92811
10856I2811j8377k4560N000M8939K1296J1867L07k6960l5844j4604K3051K8219
10844A11145L4495j6756J0121k8012l2086k3140Q077K4372N5820K774m9930n992
10832I0888Q40n5357J5795J6927M4895p158Q5j7646m2118l5753L5542P0028K259
10819A19227n5786K0374K6400o0910k9151q368n042n4460J8973m6612K0718M2092
10807a2545J3741N817N7295j836o2629M7138O5768m341r043K7952L0204m6494
10795A11027L98J8701M4420n5315o0138K7118L91l0924K5529Q6832j9419n7811
10783I0809J0697J1602p919l0059L4837J804K8911k0240l2321o161k2326K5151
10771H4785N79n6797l0291N7490K9843O6625k6696o6621o0153r89M8271J5420
$$ plain form
10856 92811 74434 49874 54874 103813 125109 136976 137283 110323 74479 59875 82926 111145
10844 111145 145640 128884 139005 110993 78907 55767 63844 88216 144036 146810 96880 90888
10832 90888 91728 36371 52166 69093 113988 106830 106915 89269 47151 11398 46940 116968 119227
10819 119227 63441 83815 110215 49305 20154 11786 6744 -47716 -28743 -75355 -54637 -12545
10807 -12545 1196 7013 64308 62472 -157 46981 112749 108408 99365 127317 157521 111027
10795 111027 111425 130126 174546 119231 59093 86211 86602 55678 81207 168039 148620 90809
10783 90809 101506 113108 105189 75130 109967 111771 140682 120442 88121 81960 59634 84785
10771 84785 85364 28567 -1724 55766 85609 152234 125538 58917 -1236 -2225 46046 61466
10759F1466P799j6875m7576o3099L9574N0429K9893J0754J243m7118j3313K3577
10747C6754J0646K1553K8407m6294K2746m0574K877m1948M5885K6349k9083j1409
10735B5909M8356M8520m8206p869O6041J8731j0948J1154n6844J6804M6051m2138
10723A15561l4170j0215J9187J5095q422l4735r506j5955O038P911N4624k6659
10711G8754R193J7896K4196L2100j080K4499k4237l9876L7791m4446l5797K2411
10699A01404j0538L2796K3146L2126NJ2804r517L4001Q548Q290L4472O4416R1220
10686D23173k773L0054P2322Q2413R0329J52712J67399K02155K88960N98120P78918
10675B883782R31398J028847Q13838J98091m41210p95836q17141o87597m63051
$$ plain form
10759 61466 69265 52390 4814 -58285 -18711 31718 61611 72365 73608 26490 13177 36754
10747 36754 47400 68953 97360 51066 73812 33238 36115 -5833 40052 66401 37318 25909
10735 25909 74265 122785 74579 66710 132751 151482 140534 151688 94844 111648 157699 115561
10723 115561 81391 71176 90363 105458 97036 62301 52795 36840 42878 50789 105413 78754
10711 78754 87947 105843 130039 162139 161059 185558 161321 121445 159236 114790 78993 101404
10699 101404 90866 123662 146808 178934 178939 191743 182226 216227 224775 233065 267537 331953 423173
10686 423173 420400 450454 522776 605189 695518 848230 1015629 1217784 1506744 2104864 2883782
10675 2883782 3815180 4844027 5657865 5855956 5414746 4618910 3801769 3114172 2651121
10666B651121j73821N9006J9972l4661j464j31235k13695k00415k80136k91006
10656A403666j83976k16904k07287o9463q4643r2690m6722m5267k7255o532R777
10645D32704k9596l3756j9375m0629Q621j2857l8016j0259J1445L7077l8062q2396
10633A84901P814M6835M6133L0149k0578K8374Q3018R2321J02938O8590J06511
10622G77006J87937K61508K64666K58441J51669O6933k0223j98306k38808k32836
10612A277987k28558k44418j29927r5567p1665j02912j06305j4460K8447q268
10602C04354J1473l8243m7047o4378O9763K2999j1994M011K3494j3019j3512K090
10590B49991m9242k4532l5496Q900J3643k1791J9022n695j3746N166K0380N1706
$$ plain form
10666 2651121 2477300 2536306 2556278 2521617 2520153 2388918 2175223 1974808 1694672 1403666
10656 1403666 1219690 1002786 795499 726036 641393 548703 501981 456714 429459 422927 432704
10645 432704 403108 369352 349977 309348 317969 305112 267096 256837 268282 305359 267297 184901
10633 184901 192715 239550 285683 315832 295254 323628 406646 498967 601905 670495 777006
10622 777006 964943 1226451 1491117 1749558 1901227 1968160 1947937 1749631 1510823 1277987
10612 1277987 1049429 805011 675084 579517 507852 404940 298635 284175 312622 304354
10602 304354 315827 277584 230537 166159 235922 258921 246927 250938 274432 261413 247901 249991
10590 249991 200749 176217 140721 149621 163264 141473 160495 154800 141054 146220 166600 218306
10578B18306l0980m3415l9481J6139o042P7513L3515J7942o4365j2973n11K030
10566A67678j0739j9072l7880j6073M6058J1826j8098j684k4976K0816M0905J788
10554A60549Q244O811j8334J0043m946M546n4253l4378n42K1738J5436N742k3214
10541I7442L1673L9189j12K6941O2152m4632l3996J3522L6515l9463k2683J0357
10529A76905k2890J0799K5638M6716M3093M6425L8138k4029l2184j059m6716J9950
10517B80786M2493N2301P105l8973k420N452l6376k8449k029k9048o2770k7491
10505A60581M0988L5227L7077k4733q3483J5764j9230l5139L1102Q614l1287J7851
10493A53332L3155M3573j3121l3168m7569l3863N5253L7725K1139Q2219o644k1889
$$ plain form
10578 218306 187326 143911 104430 120569 114527 192040 225555 243497 179132 166159 165648 167678
10566 167678 156939 137867 99987 83914 129972 141798 123700 122016 97040 117856 158761 160549
10554 160549 168793 175604 157270 167313 162367 166913 112660 78282 77740 99478 114914 120656 97442
10541 97442 129115 168304 168192 195133 257285 212653 178657 192179 228694 189231 166548 176905
10529 176905 154015 164814 190452 237168 280261 326686 364824 340795 308611 307552 260836 280786
10517 280786 323279 375580 382685 343712 341292 346744 310368 281919 279890 250842 188072 160581
10505 160581 201569 236796 273873 249140 165657 181421 162191 127052 158154 166768 135481 153332
10493 153332 186487 230060 216939 183771 136202 102339 157592 195317 216456 298675 292031 270142
10481B70142R8588K3703j0452k6783j2922q799k0873j8031J3613j5076m758K809
10469B91161J7427L3650m1568j410N6261L7500m7395n182j0133m0804k8350j9739
10457B41418l467J78k1714j716K1339q795N7847Q03k2745o626L1108o0268j4333
10444B13029J3877j3697j4007M0638o633k5450J1588r710k9823L6431R679M6263
10432B72185k2841p2799l1462O91N7313k4024K7503J6960M141M5222L9370j6531
10420B95728L0407L9771O2810o2745j03543j6904M060n3275l4615P107m7219N438
10408A27020J4030M3613Q0361N6607n289K438M8174L5192N5902J9280K9309N7359
10396E63996J966l4261k7611k2839J6077n5867m1482n8282l7045J4322r699j739
$$ plain form
10481 270142 368730 392433 381981 355198 342276 333477 312604 294573 308186 293110 288352 291161
10469 291161 308588 342238 300670 299260 355521 393021 345626 340444 330311 289507 261157 241418
10457 241418 237951 238129 216415 214699 236038 227243 285090 285893 263148 256522 287630 227362 213029
10444 213029 226906 213209 199202 239840 233207 207757 219345 209635 179812 216243 225922 272185
10432 272185 249344 176545 145083 145774 203087 179063 206566 223526 227667 272889 312259 295728
10420 295728 326135 365906 428716 365971 262428 245524 249584 196309 161694 168801 121582 127020
10408 127020 141050 184663 265024 321631 316342 318780 366954 402146 458048 477328 506637 563996
10396 563996 565962 531701 504090 481251 497328 441461 399979 341697 304652 318974 309275 307536
10384C07536m9441k0684m9497k7065K492k4184M2247M5756P1543o475o0947l6787
10372A94494J9751N4352Q289K2045K2058l3056L8110L4883N5833K6269J0295o1999
10360C91324o1202K3500L9451L7619M6089K4866M8670N1913O8927P567J7849K7566
10348G24139l4134r2198l8280l3454n3718n5306J6500O8939J6571K1899J7246
10337E58204j3899N093m8748R3247l273l5926J5827Q337J6862k1371m8735M0103
10325E65721N9128J09801k5098o0074O9157J09543N887N9013K3500M0823L1471
10314I88872L4158L4139J16890P2208P466P7399Q5295L4153O248P286Q6566R4363
10302A645043J02450N5074R7139R6305P2202J87145J41766K06156L29456K40553
$$ plain form
10384 307536 258095 237411 187914 160849 163341 139157 181404 227160 298703 292228 231281 194494
10372 194494 214245 268597 276886 298931 320989 287933 326043 360926 416759 443028 453323 391324
10360 391324 330122 353622 393073 430692 476781 501647 550317 602230 671157 678724 696573 724139
10348 724139 690005 597807 559527 526073 472355 417049 433549 502488 519059 540958 558204
10337 558204 544305 549398 500650 593897 590624 554698 570525 578862 595724 574353 525618 565721
10325 565721 624849 734650 709552 649478 718635 828178 834065 893078 916578 957401 988872
10314 988872 1023030 1057169 1174059 1246267 1253733 1331132 1416427 1450580 1456828 1464114 1550680 1645043
10302 1645043 1747493 1802567 1899706 1996011 2068213 2255358 2397124 2603280 2932736 3173289
10292C173289J68578L03649K78498M19133M01024M64862O17647P13218Q66188
10283G406086Q86728R92175J045610J083222J300939J470461J777525K269284
10275A8232030K550439K901915L196821L732176M748744O478933R272346J3609975
10267F4723379J9878154K8475281L8597599M7257162M9698425M1983536K4349273
10260C14962809J663751j9721062l5030387m2369338m2432438l7305907l0086684
10253A09680744k2780499j6644852j2095858q770664o474950m859756l803680
10246C4250485l104566k508448k005256j565869j040415n70022j90629J12383
10238B3377663L04617M59007O08896P61980R48292J349710J755651K116164K484853
$$ plain form
10292 3173289 3341867 3645516 3924014 4343147 4744171 5209033 5826680 6539898 7406086
10283 7406086 8292814 9284989 10330599 11413821 12714760 14185221 15962746 18232030
10275 18232030 20782469 23684384 26881205 30613381 35362125 41841058 51113404 64723379
10267 64723379 84601533 113076814 151674413 198931575 248630000 290613536 314962809
10260 314962809 316626560 296905498 261875111 219505773 177073335 139767428 109680744
10253 109680744 86900245 70255393 58159535 49388871 42913921 38054165 34250485
10246 34250485 31145919 28637471 26632215 25066346 24025931 23455909 23265280 23377663
10238 23377663 23682280 24141287 24750183 25512163 26460455 27810165 29565816 31681980 34166833
10229C4166833K850834L343257M270222N926149Q560182J2431222J8240939K6639021
10221A16428659L7851691N0780931O1353966O3280655N1327940K6005013o015888
10214D01012967l4901975n3314632n9070581n4676227m4938789l4212423k4979463
10207I4918877j8052176j3163465r703767p303113n788799m699629l995410l552958
10199B8659560l010388k481577k054955j673557j448693j213097j091202j202316
10191A4483775j206827j173861j112393r85301p62621o48999n46936m52110m01901
10182G192826l36428m40966l03940j85623j88653k32336k13804k83915k58920
10173D748241j73488j88004j96645j66281j35902q6838j24066j77961j19504j11718
$$ plain form
10229 34166833 37017667 40360924 44631146 50557295 59117477 71548699 89789638 116428659
10221 116428659 154280350 205061281 266415247 329695902 381023842 407028855 401012967
10214 401012967 366110992 312796360 253725779 199049552 154110763 119898340 94918877
10207 94918877 76866701 63703236 53999469 46696356 40907557 36207928 32212518 28659560
10199 28659560 25649172 23167595 21112640 19439083 17990390 16777293 15686091 14483775
10191 14483775 13276948 12103087 10990694 10005393 9242772 8593773 8046837 7594727 7192826
10182 7192826 6856398 6415432 6111492 5925869 5737216 5504880 5291076 5007161 4748241
10173 4748241 4574753 4386749 4190104 4023823 3887921 3801083 3677017 3499056 3379552 3267834
10163C267834q7841p2611p8893n6445n7958m6744Q622l3255j67814j09413j5332
10152B550150J6915R9682J9191r1107m5689k4858j950J3196O0597M6449L1207
10141B673783n95k0761n7692j4538Q6231O3860p9817q2286o15N0108L5059J20855
10129B773592R3093p5833j43211k93325k24774j45516j15529j20773n7007q7990
10119A602727r755q894k8662p0144o0724n0134l5027l1391j8489p916m6624m0374
10107A194593J6577J0184l7235l9550l0770L151R106M5724K9965P1042J6932l7962
10095A251757n1451K0705N7923M6196J9196o73q1951o9412m0986m0979n2094o9350
10083I88881o3698p9165k127n424m2198l0729L3481L4223l5958J9681N4203p256
$$ plain form
10163 3267834 3179993 3107382 3028489 2972044 2914086 2867342 2875964 2842709 2674895 2565482 2550150
10152 2550150 2567065 2666747 2685938 2594831 2549142 2524284 2522334 2535530 2596127 2642576 2673783
10141 2673783 2673188 2652427 2594735 2580197 2666428 2730288 2650471 2568185 2567570 2617678 2652737 2773592
10129 2773592 2866685 2790852 2647641 2354316 2129542 1984026 1868497 1747724 1690717 1602727
10119 1602727 1592972 1584078 1555416 1485272 1424548 1374414 1339387 1307996 1289507 1281591 1234967 1194593
10107 1194593 1211170 1221354 1184119 1144569 1113799 1116950 1126056 1171780 1201745 1272787 1289719 1251757
10095 1251757 1200306 1221011 1278934 1325130 1344326 1343653 1261702 1192290 1151304 1110325 1058231 988881
10083 988881 925183 846018 843891 838467 796269 765540 799021 833244 797286 816967 871170 863914
10071H63914j0162j5167n9688m6184j2185Q648P187l2564p4830P480N2119o004
10059F82564L1915O6592Q956q792K42J2173l2648J7154k452j9710p455n2017J210
10046F97732J8540k0240l0645n6727k6416j5903k5926l581l701L6206L3639l5262
10034E67716j0689L1528k9020l3001L1709K3661J7329J5122j5944k772K529P78
10022E98946q6186k2131P1244K5589l828j6184J152m9742o283N155J5870j8639
10010E14963j9062p230N9263j5780M2632K1533J1436N1315q860p4950k8200j7417
9998E29643n8165q405O5122K8299l6491n1758N170L0426K7262k737J0529J9554
9986E58449K8936O6818n9192m9234M1265R8906M7637k781k8425j9745K7937m6741
$$ plain form
10071 863914 853752 838585 778897 732713 720528 729176 736363 703799 628969 636449 688568 682564
10059 682564 714479 781071 790027 781235 781477 793650 761002 778156 775704 755994 748539 696522 697732
10046 697732 716272 696032 665387 608660 582244 566341 540415 536834 533133 569339 602978 567716
10034 567716 557027 588555 559535 526534 558243 581904 599233 614355 598411 595639 598168 598946
10022 598946 512760 490629 561873 587462 583634 567450 568602 518860 512577 517732 533602 514963
10010 514963 495901 488671 547934 532154 574786 596319 607755 659070 650210 575260 547060 529643
9998 529643 471478 463073 528195 556494 520003 468245 473415 503841 531103 528366 538895 558449
9986 558449 587385 654203 595011 545777 587042 685948 733585 730804 702379 682634 710571 663830
9974F63830M4016K2540L2912P7890J38954J41662J05747J04928R9223J15913K52800
9963A800415L33660M95389N74418N77968O60269O61892N54882K81523n1750k92783
9953E595883m69403n78526n66929m96025l83453k34988j26120o0079o1620O9341
9943B688081J98945K74429K67354M24665N14218P85686J068059J269915J394195
9934H885547J323359J076258O27237K694n85237j088965j205529j116393r72764
9925F946207p50935m64781j77359m1063j9239J40808L80557N48010P49032P89385
9915H100622P00042O87809O63949O62640O57524O08923M61921J43856l25550p49355
9905A1612381j034215j049238r90309q42652n39328l26892m6726K22827M88162
$$ plain form
9974 663830 707846 730386 763298 841188 980142 1121804 1227551 1332479 1431702 1547615 1800415
9963 1800415 2134075 2629464 3203882 3781850 4442119 5104011 5658893 5940416 5888666 5595883
9953 5595883 5126480 4547954 3981025 3485000 3101547 2866559 2740439 2680360 2618740 2688081
9943 2688081 2887026 3161455 3428809 3853474 4367692 5153378 6221437 7491352 8885547
9934 8885547 10208906 11285164 11912401 11915095 11329858 10240893 9035364 7918971 6946207
9925 6946207 6195272 5730491 5553132 5512069 5492830 5633638 6014195 6562205 7311237 8100622
9915 8100622 8800664 9488473 10152422 10815062 11472586 12081509 12543430 12687286 12361736 11612381
9905 11612381 10578166 9528928 8538619 7695967 7156639 6829747 6783021 7005848 7494010
9896G494010P42542J086681J457645J753022J857771J819530J700217J483131
9888A9394549J322376J319914J141541Q44981K82402m84409j322057j981715k332160
9879A8185422k259193j923329j460345j009049o48337k92830M2092L86238Q07211
9870A1827880J233820J522780J738406J812551J957842K003988K090308K389898
9862B6577473K535555K224179J482331K28760j128578k392310l029893l164577
9854B3332940k878561k381556j780940j140089m37308J09753O68023J144592J605653
9845A8242507K199144K550028K461595K102140J648814J245530R02176N43233
9837C1895167J97942j83087o93996j463261k122935k452652k318891k086009j702514
$$ plain form
9896 7494010 8236552 9323233 10780878 12533900 14391671 16211201 17911418 19394549
9888 19394549 20716925 22036839 23178380 24023361 24305763 23821354 22499297 20517582 18185422
9879 18185422 15926229 14002900 12542555 11533506 10885169 10592339 10634431 11020669 11827880
9870 11827880 13061700 14584480 16322886 18135437 20093279 22097267 24187575 26577473
9862 26577473 29113028 31337207 32819538 33048298 31919720 29527410 26497517 23332940
9854 23332940 20454379 18072823 16291883 15151794 14714486 14824239 15492262 16636854 18242507
9845 18242507 20441651 22991679 25453274 27555414 29204228 30449758 31351934 31895167
9837 31895167 32093109 31910022 31216026 29752765 27629830 25177178 22858287 20772278 19069764
9828A9069764j259283q09296l57343K04092R52855J657579K330668L154060L901439
9819B8844535M195837L953513L137164K022681R09581l5310p59459j503556k320526
9810C8444460k995924l560208l741597l440085k989729k467865j838947j157108
9802A6252997n51605r5658L27358Q81215J487426K149364K675752K816668K666545
9793B8610062K244134J685936J141123O72994K31780k00804o76109j408587k191944
9784C0108585k779052k982321k775375k377193j879818j366562q00727j51741
9776A4995796M44398J067386J677855K256863K546744K494330K070924J252806
9768B8807102L39912m27859q82571j149123j254802j385074j559476j733458j855498
$$ plain form
9828 19069764 17810481 17001185 16643842 16847934 17800789 19458368 21789036 24943096 28844535
9819 28844535 33040372 36993885 40131049 42153730 43063311 43028001 42268542 40764986 38444460
9810 38444460 35448536 31888328 28146731 24706646 21716917 19249052 17410105 16252997
9802 16252997 15701392 15605734 15933092 16814307 18301733 20451097 23126849 25943517 28610062
9793 28610062 30854196 32540132 33681255 34354249 34586029 34385225 33709116 32300529 30108585
9784 30108585 27329533 24347212 21571837 19194644 17314826 15948264 15147537 14995796
9776 14995796 15440194 16507580 18185435 20442298 22989042 25483372 27554296 28807102
9768 28807102 29147014 28719155 27836584 26687461 25432659 24047585 22488109 20754651 18899153
9759A8899153j912856j760538j398572j014838o96337l63911M5248L96957Q92291
9750A3086597J405627K010695K439546K717470K802331K442743J709046P86059
9742B9400114k26023j025188j708068k175785k415048k602027k516941k291606
9734A4439428j865067j473612j157882q76229n63751k43009j6263K11941N22727
9725H978283Q70681J118404J432681J586900J450530J047132N35338M6433m88200
9716A6578182r23499j194260j302483j347953j316755j228138j094313q80308
9708G290473o63696l88083k17800l2654K02071L71600N59524Q75886J089416J135112
9698A0221849Q65542M90595r3053o12484j056373j276927j197050j091807q56789
$$ plain form
9759 18899153 16986297 15225759 13827187 12812349 12116012 11752101 11797349 12194306 13086597
9750 13086597 14492224 16502919 18942465 21659935 24462266 26905009 28614055 29400114
9742 29400114 29174091 28148903 26440835 24265050 21850002 19247975 16731034 14439428
9734 14439428 12574361 11100749 9942867 9066638 8502887 8259878 8243615 8455556 8978283
9725 8978283 9848964 10967368 12400049 13986949 15437479 16484611 17019949 17066382 16578182
9716 16578182 15654683 14460423 13157940 11809987 10493232 9265094 8170781 7290473
9708 7290473 6626777 6238694 6020894 5988240 6190311 6561911 7121435 7997321 9086737 10221849
9698 10221849 11087391 11577986 11484933 10872449 9816076 8539149 7342099 6250292 5393503
9689E393503o91234n23477l90946k82731j69603p1111n6434l5816l4619J51106
9679C288638K12880L38738M87427O05031O86225N53010L21690L3572k97334n72923
9669E656954p11985p04251o05961m51925m14652l25982k13097j83062j66014j10613
9659A769412q295p061n9561j34617o3034l9030J9704n1774n8848k6226l2891L8242
9647A346021N6505M6241K6050O4233p058n6569k1262n6030o7022l742M9057o1111
9635A315313j2628j901O137N2123l1121j3500P806k5134p9947j8349j4476K187
9623A186510J3990N8612K9888J0422m6684p8333j11252j04885n9103j7934K9389
9612I10620L5768k6268m0872k6758K0726L1673M4550j6821j0758l5586n2882q7495
$$ plain form
9689 5393503 4702269 4178792 3787846 3505115 3335512 3264401 3207967 3172151 3137532 3288638
9679 3288638 3501518 3840256 4327683 4932714 5618939 6171949 6493639 6527211 6229877 5656954
9669 5656954 4944969 4240718 3634757 3182832 2768180 2442198 2229101 2046039 1880025 1769412
9659 1769412 1761117 1754056 1694495 1559878 1496844 1457814 1477518 1425744 1366896 1340670 1307779 1346021
9647 1346021 1402526 1448767 1474817 1539050 1531992 1475423 1454161 1398131 1331109 1327367 1376424 1315313
9635 1315313 1302685 1300784 1306921 1359044 1327923 1314423 1322229 1297095 1217148 1198799 1184323 1186510
9623 1186510 1200500 1259112 1289000 1299422 1252738 1174405 1063153 958268 899165 881231 910620
9612 910620 946388 920120 879248 852490 873216 904889 949439 932618 921860 886274 833392 745897
9600G45897j01799j28176l2585P1578P4363L5653J2475k443P610N2223N0592o285
9588G79103k2312P8567N7121k2224k699M458Q735J5652L41O7587N7179j1567j5561
9575I94380l1105l7601k380M2718J0478M9621M2435N7302R9372N8606P4133N4027
9563A411986O0680j9218j070j5439n3345j8777n411r312m3368l7827o4929p6285
9551A127685L1949P5649m915K0807k0985k9026o6580r8698q2589l3840J1797k6522
9539I04732m8451n8388k0057J6437k6821n4809j4179L3859j1972n2876m7814n5436
9527E64225k0391l8779j0624l1352J0314q229p88K6172J74l3719K790J8506l9524
9514D38775K9887K5890o97m3470O765N1776K3787N9290j2584n2624k8286n0012
$$ plain form
9600 745897 644098 515922 483337 554915 629278 664931 677406 674963 682573 734796 785388 779103
9588 779103 756791 835358 892479 870255 867556 872014 880749 896401 896742 964329 1021508 1009941 994380
9575 994380 963275 925674 923294 966012 976490 1026111 1068546 1125848 1225220 1283826 1357959 1411986
9563 1411986 1472666 1453448 1452378 1436939 1383594 1364817 1359406 1350094 1306726 1268899 1203970 1127685
9551 1127685 1159634 1235283 1230368 1251175 1230190 1201164 1134584 1035886 953297 919457 931254 904732
9539 904732 856281 797893 777836 794273 767452 712643 698464 732323 720351 667475 619661 564225
9527 564225 543834 505055 494431 463079 473393 465164 464376 490548 490722 457003 459793 478299 438775
9514 438775 468662 494552 493855 450385 457150 508926 532713 592003 579419 526795 498509 448497
9502D48497l8875P3607O628l4385n4809j6085j9323N3064O2007L3345J0721m6172
9490D78220j105p9m1309k2463K6921N5629Q862j5655j41l5310K7008P7103O6039
9477F23720K5789m4377k4823J7571L384L2559l2683l6332N4329P8836J7232O4766
9465G79971O5690K0950j5653J45183Q5982O5847R3293L2999m5898p5872j14965
9454A037527j7907o7324j34318p9211k8164k5656K9939K6429o8175l8064L3270
9443F68346n393j7759q533M8073P118l3080m686K1717l426J2728O5660N3297n240
9430G98822n805j1209L3878J1929j4604l5962O2871R4556P8273L9549o466Q1635
9418A127467K7780J9708j8116q191O7577j1279L9310j6539m556m8589l0158l4176
$$ plain form
9502 448497 409622 483229 489857 455472 400663 384578 365255 418319 480326 513671 524392 478220
9490 478220 477115 477036 435727 413264 440185 495814 504676 489021 488880 453570 480578 557681 623720
9477 623720 649509 605132 580309 597880 601264 633823 601140 564808 619137 697973 715205 779971
9465 779971 845661 866611 850958 996141 1082123 1147970 1241263 1274262 1228364 1152492 1037527
9454 1037527 1019620 952296 817978 738767 710603 684947 714886 741315 673140 635076 668346
9443 668346 662953 645194 636661 684734 691852 658772 654086 675803 672377 685105 750765 804062 798822
9430 798822 793017 781808 815686 827615 813011 777049 839920 934476 1012749 1052298 1045832 1127467
9418 1127467 1155247 1174955 1156839 1148648 1216225 1204946 1244256 1227717 1223161 1174572 1144414 1110238
9406A110238K4156J01011R5223K2236m0654m6242m5291l7361n1264M604j3719
9395A122937k5589L7132j840m6663j5350P872l6293j8810j1585J9927M8741N3290
9383A133769Q6972L0505j0915O7302k038j7631N8463J27016O0918M2105M5548
9372A622014J00249O7485N0400R1486J18208J21268J13945J5655N9624R8896M0724
9361B499954N1392J21505J22563L9867Q0205J76164K16111L28836M61802N67662
9351D666061O73807P85327R62321J126516J419199J557376J660947J703923J719166
9342A6274643J637621J652419J552801J409807J499692J680610K042886K747964
9334C0498443L529809M301357M777415M803028M423682L632850K611127J669495
$$ plain form
9406 1110238 1134394 1235405 1330628 1352864 1312210 1265968 1220677 1183316 1132052 1136656 1122937
9395 1122937 1097348 1134480 1132640 1085977 1070627 1078499 1042206 1023396 1011811 1031738 1080479 1133769
9383 1133769 1220741 1251246 1240331 1307633 1305595 1287964 1346427 1473443 1534361 1576466 1622014
9372 1622014 1722263 1789748 1840148 1931634 2049842 2171110 2285055 2300710 2360334 2459230 2499954
9361 2499954 2551346 2672851 2795414 2835281 2915486 3091650 3307761 3636597 4098399 4666061
9351 4666061 5339868 6125195 7087516 8214032 9633231 11190607 12851554 14555477 16274643
9342 16274643 17912264 19564683 21117484 22527291 24026983 25707593 27750479 30498443
9334 30498443 34028252 38329609 43107024 47910052 52333734 55966584 58577711 60247206
9326F0247206R15378M01473J79832J34296K30538P40207J581621K547316L267447
9317G0245314L299718K656558J433692o4506j365621k263722k352342j713171
9309F9875920p13330L40939J007151J403033J404156J123597N06673k33266r24703
9300G3790170j638864k303381k883757l006470k440631j285777k64864L01819
9292F0268245N2170p43653j854336k922955l832033m327514m429750m137600l615095
9283C4457479k910306k253308j649069j079956p61371p58573q79330j112841j262855
9274B1789870j437893j489561j498259j321875j018326o33446k02588K85292Q24080
9265A5297294J366413J972024K476676K580870K496709K233065J888353J361350
$$ plain form
9326 60247206 61162584 61564057 61743889 61878185 62108723 62848930 64430551 66977867 70245314
9317 70245314 73545032 76201590 77635282 77570776 76205155 73941433 71589091 69875920
9309 69875920 69162590 69503529 70510680 71913713 73317869 74441466 74948139 74714873 73790170
9300 73790170 72151306 69847925 66964168 63957698 61517067 60231290 59966426 60268245
9292 60268245 60320415 59576762 57722426 54799471 50967438 46639924 42210174 38072574 34457479
9283 34457479 31547173 29293865 27644796 26564840 25803469 25044896 24165566 23052725 21789870
9274 21789870 20351977 18862416 17364157 16042282 15023956 14390510 14187922 14473214 15297294
9265 15297294 16663707 18635731 21112407 23693277 26189986 28423051 30311404 31672754
9257C1672754R74536Q83014J238117J883621K739942L787543N033129O236383
9249E4449039P124490P351864O657056N389740L594486J660691J07495p38735
9241H5596126n53892P20350K435529L610937M107339M024595L612105K981592
9233A06534681J912785O56754p20393k031222l015093l294607k669880j247155
9225I6125870N98095K050986K816296K848916J838908q9600k262990m050400m698912
9216I5177169m074616k923529j696669r52813p86902q81946j086323j236304j574512
9207G9963555k226303l258898m437593n507509o136062n975297n247454m332829
9199D2841610l260915k446302k026776j916032k093302k317115k424487k409129
$$ plain form
9257 31672754 32647290 33530304 34768421 36652042 39391984 43179527 48212656 54449039
9249 54449039 61573529 68925393 75582449 80972189 84566675 86227366 86334861 85596126
9241 85596126 85042234 85762584 88198113 91809050 95916389 99940984 103553089 106534681
9233 106534681 108447466 109104220 108383827 106352605 103337512 100042905 97373025 96125870
9225 96125870 96723965 98774951 101591247 104440163 106279071 106189471 103926481 99876081 95177169
9216 95177169 91102553 88179024 86482355 85529542 84742640 83860694 82774371 81538067 79963555
9207 79963555 77737252 74478354 70040761 64533252 58397190 52421893 47174439 42841610
9199 42841610 39580695 37134393 35107617 33191585 31098283 28781168 26356681 23947552
9191B3947552k390755k301065k075030j921088j791560j545490j396617j216417
9183I309530r85229p52820o54508o06886n38353m13746l10629l10693k35936k08737
9173D291993k63135k11768j56847j56617j78783j38694j06051j38159j04003j16127
9163B721809j01840j07728p6127q9245p8629j02350n9233p797k0846k4126J6160
9152B070048j6611k4296L3202n3430m8267k1654p1241n9720j8206n9156k3401
9141A707268j9560O3254j8328q5978n3842p1295j19982o1023l6555o397j4066
9130A283496k5494m4386K5284K7784j0641l5483J8645K3358Q2352P3304M2245
9119A460464j5223o576n5309K5239O697K400M3178J7532k5302l6209j9915j00598
$$ plain form
9191 23947552 21556797 19255732 17180702 15259614 13468054 11922564 10525947 9309530
9183 9309530 8324301 7571481 6916973 6310087 5771734 5357988 5047359 4736666 4500730 4291993
9173 4291993 4028858 3817090 3660243 3503626 3324843 3186149 3080098 2941939 2837936 2721809
9163 2721809 2619969 2512241 2436114 2346869 2268240 2165890 2106657 2098860 2078014 2053888 2070048
9152 2070048 2053437 2029141 2062343 2008913 1960646 1938992 1867751 1808031 1789825 1730669 1707268
9141 1707268 1687708 1750962 1732634 1646656 1592814 1521519 1401537 1340514 1303959 1297562 1283496
9130 1283496 1258002 1213616 1238900 1266684 1256043 1220560 1239205 1262563 1344915 1418219 1460464
9119 1460464 1445241 1438665 1383356 1408595 1415292 1417692 1460870 1478402 1453100 1416891 1396976 1296378
9107A296378j25643o5924p808k1313J436J3260L4672o020j11271o8892L3779L277
9095I75931R0042j7233o0409j2189k9995m5154l6111N1285J1015j6870L1360P747
9083I49419o0692j06981J5259J3134M5144m330j7069k1405m4853p9532j1519J8597
9071F95172J9971R53j0531j5964R015J7373m236j2537k105o866n7796q523j3701
9058F10225m206o618J9454M798J6280M461J9482o3182o6154L9649O137J1864J2702
9045F04892N499j0512M5423L8347j4282o4740J3799J10522J3017q7283n2498k4736
9033E77448L1672N17L943m2441j4141k1735p305j7596J2955m5586K4m6549k045
9020D29161k4332k780L2120M262L9289J8381o7295l85J3944l2478L0491M6261
$$ plain form
9107 1296378 1170735 1104811 1097003 1075690 1077126 1090386 1125058 1119038 1007767 938875 972654 975931
9095 975931 1065973 1048740 988331 976142 946147 900993 864882 916167 927182 910312 941672 949419
9083 949419 888727 781746 797005 810139 855283 850953 833884 812479 767626 688094 676575 695172
9071 695172 715143 716096 705565 689601 698616 715989 711753 699216 697111 690245 632449 623926 610225
9058 610225 606019 599401 618855 623653 639933 644394 663876 600694 534540 574189 580326 592190 604892
9045 604892 610391 599879 645302 683649 669367 604627 618426 728948 741965 654682 602184 577448
9033 577448 609120 609637 613580 571139 556998 535263 527958 510362 523317 477731 477755 431206 429161
9020 429161 404829 402049 434169 438431 477720 496101 428806 428421 442365 409887 440378 486639
9008D86639L8007K427k6203p277M959l3122n5854L2816J7142L2136J073k1984
8996D70759l622m9913j2865k5450l4354k4662P5062L3509K5018j0916J4540M5438
8984E02544L7768N683l7059J4929K7929M1073m320l4012O354P2426M8368l6970
8972F44713r4010j014L3681J5938L619k8261j9286K0224j7615n1738j6973O6744
8960E56022K8189J2758O6239N645p1676R501L3518J1595M7742o323l6161M9361
8948G06410R340k1666k015M5642K6446n6707M2339J05132N8537M2675j7936M0275
8936I78472P5205P0291O0117N8019R3390R0032Q2429J30545J90986J62156J56858
8925B148500J74268J64922K11140K71818K79535L07766L37684L54316L89685L98611
$$ plain form
9008 486639 524646 527073 500870 493593 498552 465430 409576 442392 459534 491670 492743 470759
8996 470759 467137 417224 404359 378909 344555 319893 394955 428464 453482 442566 457106 502544
8984 502544 540312 545995 508936 523865 551794 592867 588547 554535 560889 633315 681683 644713
8972 644713 550703 549689 583370 599308 602927 574666 555380 575604 557989 506251 489278 556022
8960 556022 584211 596969 663208 668853 597177 606678 640196 651791 699533 693210 657049 706410
8948 706410 715750 694084 692069 737711 764157 707450 749789 854921 913458 956133 938197 978472
8936 978472 1053677 1123968 1184085 1242104 1335494 1425526 1507955 1638500 1829486 1991642 2148500
8925 2148500 2322768 2487690 2698830 2970648 3250183 3557949 3895633 4249949 4639634 5038245
8915E038245N55639Q25632J032955J288473J692515K206007K734251L332372L953906
8906B2659995M546523N028747M925999L929394K160441J90960j452475k447797
8898C9541787l086797l318704l369133l111915k703380k408406k108298j859779
8890A7575375j477821j167040p48772l36288o4281K93466N90598R36594J365734
8881A6967565J947655K592678L246396L770432M117390M170199L724602K532101
8873D3069018P36486j229405k695166l346835l358749l057504k628640k398041
8865B5091164k252187k263405k163487k048338j952916j613544j332932r59811
8857A0504544p59450n73293m02004l37853l20463k84819j24290j7872J07108K54299
$$ plain form
8915 5038245 5593884 6419516 7452471 8740944 10433459 12639466 15373717 18706089 22659995
8906 22659995 27206518 32235265 37161264 41090658 43251099 43442059 41989584 39541787
8898 39541787 36454990 33136286 29767153 26655238 23951858 21543452 19435154 17575375
8890 17575375 16097554 14930514 14181742 13845454 13781173 14074639 14665237 15601831 16967565
8881 16967565 18915220 21507898 24754294 28524726 32642116 36812315 40536917 43069018
8873 43069018 43805504 42576099 39880933 36534098 33175349 30117845 27489205 25091164
8865 25091164 22838977 20575572 18412085 16363747 14410831 12797287 11464355 10504544
8857 10504544 9745094 9171801 8769797 8431944 8111481 7826662 7702372 7684500 7791608 8045907
8847H045907M03308M98837N48598O59830P47173Q53818J042739J347128J805008
8838A5952346K336069L034556L915350M742295N603151O587043P515926Q056271
8830E7743007P986934P302657N958410M018226J534265j084869l141201m017394
8822G6300035l800084k836881j585302p47480n71480j219810k427027l698573
8814E9413398m523126m577257m059501l266263k217886j071201K10902J613635
8806D1522701L097168M575420N989906O859159P123838O681153N689845M362976
8798H5902166K589032L57481k058022m043912n080052n068624m389867l484893
8790F4723309k866502k583837l004018l907739m723124n141573n077153m514708
$$ plain form
8847 8045907 8449215 8948052 9496650 10156480 10903653 11757471 12800210 14147338 15952346
8838 15952346 18288415 21322971 25238321 29980616 35583767 42170810 49686736 57743007
8830 57743007 65729941 73032598 78991008 83009234 84543499 83458630 80317429 76300035
8822 76300035 72499951 69663070 68077768 67330288 66758808 65538998 63111971 59413398
8814 59413398 54890272 50313015 46253514 42987251 40769365 39698164 39909066 41522701
8806 41522701 44619869 49195289 55185195 62044354 69168192 75849345 81539190 85902166
8798 85902166 88491198 88848679 86790657 82746745 77666693 72598069 68208202 64723309
8790 64723309 61856807 59272970 56268952 52361213 47638089 42496516 37419363 32904655
8782C2904655l848663l335448k813323k413301k049430j792898j470330j165345
8774A4015917r10598o54879l78222k47404j82448o3176J14410K69755M26987O92881
8764A3083223J006468J359750J781036K129762K498888K914140L468018M281307
8756C2522592M974459N407392N165919M051552K497273J111617K85278L42746
8748E6358828J061218K130181L022664L200584K717647J393608k32340j814442
8740F7837948l289298m460595n086755n130450m875701m175080l171051k159627
8732C5489391r39191L33642J427314K582253L634914M352608M803368M477979
8724E6162278L195066J382917k80644j256933j198928m01919Q89483J961646K328595
$$ plain form
8782 32904655 29055992 25720544 22907221 20493920 18444490 16651592 15181262 14015917
8774 14015917 13105319 12450440 12072218 11824814 11642366 11579190 11693600 11963355 12390342 13083223
8764 13083223 14089691 15449441 17230477 19360239 21859127 24773267 28241285 32522592
8756 32522592 37497051 42904443 48070362 52121914 54619187 55730804 56016082 56358828
8748 56358828 57420046 59550227 62572891 65773475 68491122 69884730 69652390 67837948
8740 67837948 64548650 60088055 55001300 49870850 44995149 40820069 37649018 35489391
8732 35489391 34550200 34883842 36311156 38893409 42528323 46880931 51684299 56162278
8724 56162278 59357344 60740261 60459617 59202684 58003756 57601837 58491320 60452966 62781561
8715F2781561J750162M55275j169804k806530m213554n278442n888239n941909
8707C9688520n468113m931321m235293l541282k869249k330977j946698j608833
8699A2756754j346748j155934r02449p16885o01465n55515m50309l83045k63715
8690F380689j79703j76379m529R8570P3332J35021J31049J35434K91457M60914
8680G345855O63320R11389J185148J341209J435184J510788J512997J509023J600015
8671A9014928J938913K274506K368663K054331J029118n04630j812452k630877
8663B3732500k914370k773254k340466j852606j403761r71940p18427n06727m74322
8654I776627m90552l15799l8234K12033M65398Q28532J128139J339982J540120
$$ plain form
8715 62781561 64531723 64986998 63817194 61010664 56797110 51518668 45630429 39688520
8707 39688520 34220407 29289086 25053793 21512511 18643262 16312285 14365587 12756754
8699 12756754 11410006 10254072 9351623 8634738 8033273 7477758 7027449 6644404 6380689
8690 6380689 6200986 6024607 6020078 6118648 6191980 6327001 6458050 6593484 6884941 7345855
8680 7345855 8009175 8920564 10105712 11446921 12882105 14392893 15905890 17414913 19014928
8671 19014928 20953841 23228347 25597010 27651341 28680459 28175829 26363377 23732500
8663 23732500 20818130 18044876 15704410 13851804 12448043 11476103 10757676 10250949 9776627
8654 9776627 9286075 8970276 8932042 9144075 9609473 10438005 11566144 12906126 14446246
8645A4446246J719888J924977K139264K126135K120955J827847J112569o1918
8637B7355963j571678k735560l172408l121818k780544k355187k004503j559939
8629H054326j196561r76206p28795n40047m48319l23467k73285k43677j66066
8620C157903j89495j56530q0795n9452n8351m7039m0352l2712r1348j13410j26442
8609B161977j89088k10188j33996o6649n9340j18839o8204j0517j0317J5439K6569
8598A336847j2439O454m3747m1847m6347o3551j6125J68j0070J0856Q281L2145
8586A160625R9810P5324L4797O9356J10008J89063K94981L30602M11065K48034
8576C023665j523k08678l51463k99320k31193j06512j48582j81625j21309o6194
$$ plain form
8645 14446246 16166134 18091111 20230375 22356510 24477465 26305312 27417881 27355963
8637 27355963 25784285 23048725 19876317 16754499 13973955 11618768 9614265 8054326
8629 8054326 6857765 5881559 5152764 4612717 4164398 3840931 3567646 3323969 3157903
8620 3157903 2968408 2811878 2731083 2671631 2613280 2566241 2525889 2493177 2401829 2288419 2161977
8609 2161977 1972889 1762701 1628705 1562056 1502716 1383877 1315673 1305156 1294839 1310278 1336847
8598 1336847 1324408 1330862 1287115 1245268 1198921 1135370 1119245 1119413 1109343 1120199 1128480 1160625
8586 1160625 1260435 1335759 1370556 1439912 1549920 1738983 2033964 2364566 2775631 3023665
8576 3023665 3022142 2813464 2462001 2162681 1931488 1824976 1676394 1494769 1373460 1307266
8566A307266q1141l4707J5729m1909j0976N8482R5592J74067J54464J55792K53721
8555B046380K70391K38476K06653J95539J53458k93n5562m1840o5137r5289j51792
8544B700984k37285j18611j2233O3475K17893L57756N44722P26241Q83708J089233
8534F215883J079454N90309k06875p70448j065828j051344q90218o68723m89776
8525B742434l85405l80313k98003j73340j28549j59306j12776m3665o0411m9076
8515I51590o7700n7053O5749O6067L3464P873J5656q117p15n0901m4240K5808
8503I37481L1967L7229L8962P6826O260N3596J74739K7954o769J28013L03081
8492A809339L70977L56174L55245K19165M765k66617m64639m88247l30827k34319
$$ plain form
8566 1307266 1226125 1191418 1207147 1165238 1154262 1212744 1308336 1482403 1636867 1792659 2046380
8555 2046380 2316771 2555247 2761900 2957439 3110897 3110604 3055042 3013202 2948065 2852776 2700984
8544 2700984 2463699 2345088 2332855 2396330 2614223 2971979 3516701 4242942 5126650 6215883
8534 6215883 7295337 7885646 7678771 6908323 5842495 4791151 3900933 3232210 2742434
8525 2742434 2357029 1976716 1678713 1505373 1376824 1217518 1104742 1061077 1000666 951590
8515 951590 883890 826837 892586 958653 992117 999990 1015646 1007529 1006814 955913 911673 937481
8503 937481 969448 1006677 1045639 1122465 1128725 1182321 1357060 1385014 1378245 1506258 1809339
8492 1809339 2180316 2536490 2891735 3110900 3115665 2849048 2384409 1896162 1565335 1331016
8482A331016k66958j34663j3326q0498q2850m4443K1918O948j8582L559O5022
8471G87143J6741j0850J8127k2982L491K0518j4522k454N4281M5089P148K178
8459I03908k8811o1172J681m4134m2500k776J7934L7751m2126M7523l7787O550
8447G56041l9863p4258j42929r9309K7106J4405m6462k7529j7354k4299K6185
8436C51734J9471K4818M6290q37j8550M8973K9124O1565O0730N0839R8564J10188
8424H82909R0627K2165J277j9332l8111K068K9090M023k0535m418L7072K3875
8412A010710o6815o4419o9373m6056m6753p5136J8597l1900o5820m7506q643L5085
8400E41971j0205o78N6263J19841R4989J8644m048J1454n4560m4208R828o9786
$$ plain form
8482 1331016 1064058 929395 916069 835571 752721 708278 730196 737144 718562 722121 787143
8471 787143 803884 793034 811161 788179 791670 812188 797666 795212 849493 894582 901730 903908
8459 903908 875097 813925 815606 771472 728972 726196 744130 781881 739755 787278 749491 756041
8447 756041 716178 641920 498991 399682 426788 441193 394731 367202 349848 325549 351734
8436 351734 371205 396023 442313 441476 422926 471899 501023 562588 623318 674157 772721 882909
8424 882909 973536 995701 996978 977646 939535 941603 970693 974716 954181 949763 986835 1010710
8412 1010710 943895 879476 810103 764047 717294 642158 660755 628855 563035 515529 506886 541971
8400 541971 531766 531088 587351 707192 802181 820825 816777 828231 773671 729463 739291 669505
8388F69505k7468P8437L9133N4842m999m0101o1225k8179m5758q9406q3000o5070
8376C96711j0738M7210j049q6525j01166q027O2213k1302n5228J3152L7577o2396
8364B10432m1791M3254M1175K8403n2255K7688N5102m9415j6324L6687L0134P2970
8352C86060L4374m1745R5695J05071l1217k0791N029P1902L5760o206N6041J29114
8340H19087O3862N387P1089Q4441R7749K4309m8318j05795r9559j66009j29041
8329F17202o7943k9585m0448k7946J0869R561j6212k444n256q775K6113K6759
8317D91895l3382J6503L7821j9498L1407Q6281K4260J9993p0285q1496n9425l8209
8305D05865p7415l702K0018r401L798K0798j3307n4049P244n917l599N932M0343
$$ plain form
8388 669505 642037 720474 759607 814449 809450 769349 708124 679945 634187 544781 461781 396711
8376 396711 385973 433183 432134 345609 244443 236416 298629 277327 222099 235251 272828 210432
8364 210432 168641 211895 253070 281473 229218 256906 312008 262593 246269 282956 313090 386060
8352 386060 420434 378689 474384 579455 548238 527447 532476 604378 640138 633932 689973 819087
8340 819087 882949 888336 959425 1043866 1141615 1165924 1117606 1011811 912252 746243 617202
8329 617202 549259 519674 479226 451280 462149 471710 455498 453054 447798 439023 465136 491895
8317 491895 458513 475016 512837 493339 524746 611027 635287 655280 584995 503499 444074 405865
8305 405865 328450 324748 344766 335365 339163 359961 346654 292605 299849 293932 290333 296265 336608
8292C36608M953l3341J2658M1765l588j0647J6480J3662j7622k5297o3186J5957
8280B88402K7084k6863n6364l6582j2333J2427K5204k8620M623N9907j5851l3877
8268B07157M64N5087J5695K2423K2821j7225Q926n320j2173o2066m657J3933n2855
8255A92210n476m458L0898K9124J1398o3762o2384n7524P5688l7758K3622k6806
8243A04772k8769K2361K5463L2917R3308M7137K1319p0286p190L8824k6540n5273
8231A98043K4337P776m1231k1258o12l581p120j7835K6937N0724l2726r5138l6986
8218E1330L1590Q2081K4525Q721K0910P889n1375l8807L2740l414o315n1578k793
8205A05504K2512L9181j5575M0832j8655k5396k5878J1199R150k2717J6080L2966
$$ plain form
8292 336608 341561 308220 320878 362643 359055 348408 364888 378550 360928 335631 272445 288402
8280 288402 315486 288623 232259 195677 183344 195771 220975 192355 196978 256885 241034 207157
8268 207157 207621 262708 278403 300826 323647 306422 315348 310028 297855 235789 231132 245065 192210
8255 192210 186734 182276 213174 242298 253696 189934 127550 70026 145714 107956 131578 104772
8243 104772 76003 98364 123827 156744 250052 297189 318508 248222 241032 279856 253316 198043
8231 198043 222380 230156 188925 167667 167055 163474 156354 138519 165456 216180 183454 88316 51330
8218 51330 82920 165001 189526 198247 219157 227046 175671 136864 169604 166190 159875 108297 105504
8205 105504 128016 167197 151622 192454 173799 148403 122525 133724 142874 120157 136237 169203
8193A69203R289k5700j7592m8783J371J574o038J7143P9460Q6110k0731l4940
8181B10366j2618k5169p9230J2572J7681l3712o1625k1860N1926J6211k4468K5176
8169G5250m5129n6056j033O680L7265J9873l5605n5K8358m5465o415J375J8043
8156b914J6092J1480R6132O4518q953p873J2466N7812j4563r2884l6582K0859
8144A15590j3751m4285K4305P6392O9936M1027n6829j0961J2292j7092j0961L0237
8132B15900m1174n4027l0467Q893l9585L5773L5801m4321J6279J9368l1201k7841
8120F3398K4655K8009k140o7030k3434K4037J0799L43L3894P856q876j7925K9397
8107A02983n3819p7564O3499K519Q559Q0860j1411o5250J4674K684J968J1740
$$ plain form
8193 169203 178492 152792 135200 86417 87788 89362 83324 100467 179927 266037 245306 210366
8181 210366 197748 172579 93349 105921 123602 89890 28265 6405 58331 74542 50074 75250
8169 75250 30121 -25935 -26968 -20288 16977 36850 1245 1190 29548 -15917 -22332 -20957 -2914
8156 -2914 13178 24658 120790 185308 176355 168482 180948 238760 224197 131313 94731 115590
8144 115590 101839 57554 81859 158251 228187 269214 212385 201424 213716 196624 185663 215900
8132 215900 174726 120699 90232 99125 59540 95313 131114 86793 103072 122440 91239 63398
8120 63398 88053 116062 113922 46892 23458 47495 58294 58637 92531 100387 91511 73586 102983
8107 102983 49164 -28400 35099 37618 46177 127037 115626 50376 65050 67734 69702 81442
8095H1442N745J3860j2987j3735O5250J3674J3472j7069n8518j1397K7871j2397
8083I5211m4203k2961J3845K9581K1865k5317j7932j1984K5384J0579m9218M1864
8071F6714k2871j8642J2999N2001M3905n721K3026l5342P771n204N9147O4535
8059B42318J34k991q8473o8149N287J7m8294J6356N4570J6902R444P508l4328
8046A10301p1701m0958M5277K1621j777K4120P974l6029l0233L4440O183k9916
8034C9302j6403l5696k2605L4575k7185K6181L7643j6423K3634J566L5205N0926
8022A30720j088k2353k2152L5618N7l1476L8141k1667l1847J361j7245J1847J445
8009G1361o4978r235R719M3815l4649r2048P211J4221O8308K2131K0630j0206
$$ plain form
8095 81442 87187 101047 88060 74325 139575 153249 166721 149652 91134 79737 107608 95211
8083 95211 51008 28047 41892 71473 93338 68021 50089 38105 63489 74068 24850 66714
8071 66714 43843 25201 38200 90201 134106 128385 151411 116069 123840 118636 177783 242318
8059 242318 242452 239461 150988 82839 88126 88143 39849 56205 110775 127677 137121 144629 110301
8046 110301 38600 -2358 42919 64540 62763 86883 94857 58828 28595 63035 69218 39302
8034 39302 22899 -12797 -35402 -827 -28012 -1831 35812 19389 43023 44589 79794 130720
8022 130720 129632 107279 85127 120745 120802 89326 127467 105800 73953 75314 58069 69916 71361
8009 71361 6383 -2852 6867 50682 16033 -76015 -68804 -54583 13725 35856 56486 46280
7997D6280k077l124O1366M9682J6327k2666l6036M0766j5312k0693K7186R521
7985A51220k5347k9473m1179K9109L9332M8628J9611j01658k4194j3890m1457
7974A0702k3414L9092K3090k4961J2394L6331L3969o2366l0565q963M9682M1518
7962I6509p08l0790L415M6363K106q2094L8672M7794n5261m8194K9689K9292L5089
7949A11882j6220l0360n7355L6004K1334n5918J1194O7009O3385n1634l9216j1102
7937D9003R6367J9721n5266n4883J1505j0241o202K9940K2213q146j487M4517
7925A37041J8373o0984q0098j7572N1503J6036j8252Q3094N6481k3227j5244k4695
7913A22456l5351J0192k079M884o602L0311J7266k296k2239K5450k7702K5335
$$ plain form
7997 46280 44203 41079 102445 152127 168454 145788 109752 150518 135206 114513 141699 151220
7985 151220 125873 96400 55221 84330 123662 172290 191901 90243 66049 52159 10702
7974 10702 -12712 26380 49470 24509 36903 73234 107203 44837 14272 5309 54991 96509
7962 96509 95801 65011 68426 114789 116895 34801 73473 121267 66006 17812 47501 76793 111882
7949 111882 95662 65302 7947 43951 65285 9367 20561 87570 150955 99321 60105 49003
7937 49003 145370 165091 109825 54942 66447 56206 50004 79944 102157 94011 92524 137041
7925 137041 155414 94430 14332 -3240 48263 64299 46047 129141 185622 162395 147151 122456
7913 122456 87105 97297 95218 100102 93500 123811 141077 138781 116542 141992 114290 139625
7901A39625j5066o0188q5863m962K2137k7982K3346J1365L927O0880M4003l5985
7889G5237k2703p994L2954K9725r139n114k3264j5043M3609J6687k5212k2844
7877F6899r175J08760O1531r692J0405o0983q4742J3451N2345J003o3430j1247
7865G5125M947r564r676L7372l322J8500L0616J196k3486J0263k3356k2460j5695
7852G0460k9784J2584m8032l2232k2554K4527M0249J2765l2176J6464M5070L5574
7840I2915j4482k2725K6203k9136m7024K8104n3951o607R1987M0199N29Q1719
7828A87731j996p1688L04K4562q693M472k3266r112k5013L732N3891O7215m661
7815A97478o4815q2613n0051K267L3511L7060l2391K2723N2709k9161m2215l0493
$$ plain form
7901 139625 124559 64371 -21492 -26454 -4317 -32299 -8953 2412 6339 67219 111222 75237
7889 75237 52534 44540 77494 107219 98080 92966 69702 54659 98268 114955 89743 66899
7877 66899 57724 166484 228015 218323 228728 167745 83003 96454 148799 149802 86372 75125
7865 75125 80072 70508 60832 98204 94882 113382 143998 145194 121708 131971 108615 86155 70460
7852 70460 40676 53260 5228 -27004 -49558 -25031 15218 27983 -4193 12271 57341 92915
7840 92915 78433 55708 81911 52775 5751 33855 -20096 -26703 65284 105483 106012 187731
7828 187731 185735 114047 114351 138913 130220 134692 111426 102314 77301 81033 134924 202139 197478
7815 197478 132663 50050 -1 2266 35777 72837 40446 63169 115878 86717 44502 14009
7803A4009l4674n1852J3931K8408P208q695M4389K241n0027l1276P7674K2135
7791C3471k7029k1946j4954L3830J346K6412J6140Q089K0813L4222p158n9486
7779D3750k1768O3729J0714l7713L2687j00012r68k097m7892J5966N3521Q858
7767A8775J4746J2841n878Q63l0306m5409L1333N9071j0045J6583J0879m1293
7755C2160J8927N0911M7896k0114J7696J8607o7774j914k421o85k5746j3903L5817
7742H9457j7495o7922K612P8690K5291m0802q0560l527K7160m251k6625K9016
7730A1044M1844l9107J894p421n0501K9321K2089J0564k6413k5900Q402K203o7339
7717h9320J2853l4911m2196J4941M8899L2780p593K692O4937K1890j4393j2190
$$ plain form
7803 14009 -20665 -72517 -58586 -30178 -22970 -31665 12724 14965 -35062 -66338 11336 33471
7791 33471 6442 -15504 -30458 3372 4718 31130 47270 55359 76172 110394 103236 43750
7779 43750 21982 85711 96425 58712 91399 -8613 -9581 -11678 -59570 -43604 9917 18775
7767 18775 33521 46362 40484 41347 11041 -34368 -3035 56036 45991 62574 73453 32160
7755 32160 51087 101998 149894 129780 147476 166083 98309 96395 93974 93289 67543 53640 89457
7742 89457 71962 4040 6652 85342 110633 69831 -10729 -14256 12904 8653 -17972 11044
7730 11044 52888 13781 15675 8254 -42247 -12926 9163 19727 -6686 -32586 -24184 -21981 -89320
7717 -89320 -76467 -111378 -153574 -138633 -89734 -56954 -64547 -61855 3082 24972 10579 -1611
7705a611l2691k8692J4721j1946J6114K5231K5181n329j9647L5589j8182l9029
7693d0291N1216O8270K4324l9428j0422j5810k247q694Q024N2330K5519J6689
7681A29480k5565n5800J3195n778n5382o618O4469K6106L9858q769j8877K1428
7669A17747K2993q5889o9475j9156J3299M1040K1506k8643K0162N807R885K6220
7657G5496L2475M7710n359m7482r6056J2991k4041O069k6975J2936n676m3923
7645f1835j3417k2947L8142M3345J6343k0258J3960l6793M4837R748j6788P440
7633A777k8574L1063L0093l6524j5706j4705o087p748K6538j7243j5009o173K2278
7620c6020L7470K9717L7927o2288M1176J4149l2632J6208M7054n183l5203o1952
$$ plain form
7705 -1611 -34302 -62994 -48273 -60219 -44105 -18874 6307 978 -18669 16920 -1262 -40291
7693 -40291 10925 79195 103519 64091 53669 37859 35612 26918 34942 87272 112791 129480
7681 129480 103915 48115 61310 55532 150 -6468 58001 84107 123965 115196 96319 117747
7669 117747 140740 54851 -14624 -33780 -20481 20559 42065 13422 33584 39391 49276 75496
7657 75496 107971 155681 150322 102840 6784 19775 -4266 1803 -25172 -12236 -17912 -61835
7645 -61835 -75252 -98199 -60057 -16712 -369 -20627 -6667 -43460 1377 11125 -5663 1777
7633 1777 -26797 4266 34359 -2165 -17871 -32576 -38663 -46411 -19873 -37116 -52125 -58298 -36020
7620 -36020 1450 31167 69094 6806 47982 62131 29499 45707 92761 87578 52375 -9577
7608i577k746K1606K7204N2642m8462k804j6088m055L8082L7775M660n6379q0608
7595c8750o221j187K3427L7465l2181J3857K5726j9316j1092j1285K4324j1116
7583f349L1349k1633l3811p2743K737M2152J6534L0780M466J2583K7811M5675
7571G9551k2383j4937K0224L8872j8312q2818o123P269q64J4422L0824n4377L3369
7558B4717Q3107J2143O67n4697R342L5278k9251J8517K3394J0810l1491p0725
7546C1811J2468J6613k3613J1527J6444m1201l3561j3022j1582l163l5663m444
7534g7386j2508N7808M5471M6223l9535k9929p179m2584n020K8884M5553L4479
7522D4277m553n2850m75N4591N668L801L0674j4427J1716p0585r3545j3274P2671
$$ plain form
7608 -9577 -12323 9283 36487 89129 40667 37863 21775 17720 55802 93577 98237 41858 -38750
7595 -38750 -44971 -46158 -22731 14734 -17447 -3590 22136 2820 -8272 -19557 4767 -6349
7583 -6349 25000 3367 -30444 -103187 -100450 -58298 -41764 -10984 -6518 6065 33876 79551
7571 79551 57168 42231 62455 101327 83015 197 -5926 1343 479 14901 45725 -8652 24717
7558 24717 107824 119967 120634 65937 75279 110557 81306 99823 123217 134027 102536 31811
7546 31811 44279 60892 37279 48806 65250 24049 -9512 -22534 -34116 -37279 -72942 -77386
7534 -77386 -89894 -32086 13385 59608 20073 -9856 -17035 -59619 -64639 -35755 9798 44277
7522 44277 39724 -13126 -13601 40990 46658 50459 81133 66706 78422 7837 -85708 -98982 -26311
7509b6311L8634Q828K9444J0643j1797l2202k5258K0975K4653L5902j2045r353
7497E2113M4823O0285p407l6558m9148n9693k4755J4629j5801M5255J5356K6829
7485F5928J4784j0674R437L5415k6812K2085j7534j3817m3764J9272j9016o8568
7473c3264k7123J2246K9793O527J1606l1914K1794j9978n6592k3670N6811N4631
7461H67O397L6856j434n3708O385J3945O7410M0847l9797m7551K3148N3602n327
7448A01640j3703o361J9933n3305l1513m173R1922N2947j3528k8707q6045p733
7436B1374L4588M2109n0800m7697j714J5779k6544k192L8938J5367P728k7242
7424A9694K7275m6220m6907M1875J1833m6323j509K8664J0725J2903P610K5741
$$ plain form
7509 -26311 12323 21151 50595 61238 49441 17239 -8019 12956 37609 73511 61466 52113
7497 52113 96936 157221 149814 113256 64108 4415 -20340 -5711 -21512 23743 39099 65928
7485 65928 80712 70038 79475 114890 88078 110163 92629 78812 35048 54320 35304 -33264
7473 -33264 -60387 -48141 -18348 -11821 -215 -32129 -10335 -30313 -86905 -110575 -53764 867
7461 867 7264 44120 42686 -11022 -4637 9308 76718 117565 77768 30217 53365 106967 101640
7448 101640 87937 81576 101509 48204 16691 12518 104440 157387 143859 115152 29107 21374
7436 21374 55962 98071 47271 -426 -2140 13639 -12905 -15097 23841 39208 46936 19694
7424 19694 46969 749 -46158 -4283 7550 -38773 -40282 -11618 -893 12010 19620 45361
7412D5361j7394p9274m663O4910L3379j2555K4287J7988R802l0584m1000j1938
7400a681M9750L1252n850o9652m0413k7541K9872m459j8463L0701k598M5696l2541
7387a5927l2094l7901O1969L4640m0472n8362k0888J3480O5180J11450l8358n0325
7375g608j9173L7139k1837J384Q5602J0352k5906K7220K984J9171L1038J84j6840
7362A23710j785l4853j3443l6728L435j3811m8813K1147k6301n255J0297M4567
7350B2167l687n9186j2593M3617L1386l5794L803k8566J8827J3448n8602j350
7338f6530O1003J1236J9680R6579k9497n8380j4324k9845J8235J6619N284N329
7326C5389N0111L3740k4836m531Q846o592M0381m8342m2052k5858j2816m7547
$$ plain form
7412 45361 27967 -51307 -55970 8940 42319 29764 54051 72039 81841 51257 10257 -1681
7400 -1681 48069 79321 73471 3819 -36594 -64135 -34263 -38722 -57185 -26484 -29082 16614 -15927
7387 -15927 -48021 -85922 -23953 10687 -29785 -88147 -109035 -95555 -30375 81075 42717 -7608
7375 -7608 -26781 10358 -11479 -10095 75507 85859 59953 87173 90157 109328 140366 140550 123710
7362 123710 121925 87072 73629 36901 40336 26525 -22288 -1141 -27442 -32697 -22400 22167
7350 22167 18480 -40706 -53299 -9682 21704 -14090 -10287 -38853 -20026 -6578 -65180 -66530
7338 -66530 -5527 5709 25389 121968 92471 34091 19767 -10078 8157 24776 30060 35389
7326 35389 85500 119240 94404 89873 98719 92127 132508 84166 42114 16256 3440 -44107
7314d4107m5832O9176O9586L1102k6311m1720k1948o0801L284L9835K0877J2555
7302E696l0460K5911O2162k0304o1730M148l1186J53M4022j6266K7423k1130j7827
7289b9388J5381m9064L6332N2075M4652J3519n259K3805j3388q3234k3491J5723
7277b337l4547R207K4590P3620K9567l0106m9958k3634M5773O7557J9451P077
7265A36260l6473q2901l6074J1035j4727k118j4228q548J9524K0533M0606n913
7253B6976J8380O4211J0834m6442Q416L5882k2922J9689J0459m5722k509m8555
7241B8697k2933R331O3298J8523j1997r939L4642l3110l7649p14l6129k0284j2752
7228c1016o277j9777j2009P1698L097K2877m414J5558n3212j2859O697J0700n277
$$ plain form
7314 -44107 -89939 -20763 48823 79925 53614 11894 -10054 -70855 -67571 -27736 -6859 5696
7302 5696 -24764 1147 63309 43005 -18725 -14577 -45763 -45610 -1588 -17854 9569 -11561 -29388
7289 -29388 -14007 -63071 -26739 25336 69988 83507 78248 102053 88665 5431 -18060 -2337
7277 -2337 -36884 -27677 -3087 70533 100100 69994 20036 -3598 42175 109732 129183 136260
7265 136260 99787 16886 -19188 -8153 -22880 -24998 -39226 -47774 -28250 -7717 32889 26976
7253 26976 45356 109567 120401 73959 82375 118257 95335 115024 125483 79761 77252 28697
7241 28697 5764 15095 78393 96916 84919 74980 109622 76512 38863 38149 2020 -18264 -31016
7228 -31016 -37293 -57070 -69079 2619 5716 28593 24179 39737 -13475 -26334 -19637 -8937 -14214
7215a4214Q890L1918N0473n0258l6999k3827l2120k3437r605N0789K5019O3215
7203C9844J0397j8806L8605j1952n605K4155j1296j4888j2550J1846J8331j0862
7191E7219K7874J0833n2559m9366K3277j2238L2758o09o7575j3618o73L7602L9947
7178C2872l372j7539j8060k0822o890L7453J8214n6032N383M76Q282o9929l277
7165i3241P0075J4432j2763J4632k7300o279k8444p57J996P6086P4840K951m8781
7152C7447j7234N6174K8484o3348m1069j2231K8306K3155p530L771j1802o5277
7140d1154k0901J2905N8218J8192j148j8947j9086j1930n9743j2938K8536j7930
7128h5926K3083m097K5648J9262k6403j75n5047m478Q5014L0157p1101j5964K2310
$$ plain form
7215 -14214 -5324 26594 77067 26809 -10190 -34017 -66137 -89574 -99179 -48390 -23371 39844
7203 39844 50241 31435 70040 58088 52483 76638 65342 50454 37904 49750 68081 57219
7191 57219 85093 95926 43367 -5999 17278 5040 37798 37189 -30386 -44004 -44677 -7075 32872
7178 32872 29500 11961 -6099 -26921 -33811 3642 21856 -34176 -28793 -28317 -20035 -89964 -93241
7165 -93241 -23166 -8734 -21497 -6865 -34165 -40444 -68888 -69645 -67649 8437 83277 86228 37447
7152 37447 20213 76387 104871 41523 454 -11777 16529 39684 32154 35925 24123 -41154
7140 -41154 -62055 -49150 9068 27260 26112 7165 -11921 -23851 -83594 -96532 -67996 -85926
7128 -85926 -62843 -66940 -41292 -22030 -48433 -48608 -103655 -108133 -23119 7038 -64063 -80027 -57717
7115e7717J368K528O9507J1804o3605L348P023L9358k9214j6782K231P517K0927
7102a707N8131j5305Q08k0802K614K1105N4633k6621l7970J6659K200j0180M1556
7089H5121L6967o1495n1737N080j766q361L156J1253K878P077K2475J7193k3505
7076D4336j762l8048l0479n6502n6818Q7461J3137L4788O1697j4181m6447K3463
7064B0645L1891j4853j0551L4063O7229M1846l4331n5330o4938M75J931L9702
7052E7779L550m162l2453l7601j9200m042n825N0445J8566M2574o506k8699j3575
7039B0851O198Q170N153n1948K4907L3355M8519j07903q0082j7024J081J841J1688
7026i5194L0555O8408L4832j2544o76L291K1849J6543j110j4370m2921J93p588
$$ plain form
7115 -57717 -56349 -53821 15686 27490 -36115 -32767 -25744 13614 -15600 -32382 -30151 -22634 -1707
7102 -1707 56424 41119 41927 21125 23739 44844 99477 72856 34886 51545 53745 43565 85121
7089 85121 122088 60593 8856 13936 12170 3809 6965 18218 21096 28173 50648 67841 44336
7076 44336 42574 4526 -25953 -82455 -139273 -51812 -38675 -3887 57810 43629 -2818 20645
7064 20645 52536 37683 27132 61195 128424 170270 135939 80609 15671 16146 18077 57779
7052 57779 61329 57167 24714 -12887 -32087 -36129 -41954 8491 27057 69631 63125 34426 20851
7039 20851 27049 35219 40372 -11576 13331 46686 95205 -12698 -92780 -109804 -108723 -106882 -95194
7026 -95194 -64639 3769 38601 26057 25381 28672 50521 67064 65954 51584 8663 8856 1268
7013A268j5974O9393q467o6214n390K4932j1505M7884M9485L8110k6139n2539
7001D4844R423m429j4506j9782l7360j1296O5752J8004J3389k7349m2206r068
6989a4584K675O6279L0641o8612O912J1950J0796Q858p367J753n954l6315K7613
6976C4645l517L0828m744k4040N6369p52m7993k4647j2433K032J2776O6147K1391
6963A06062J7646o2103K3217m2473o8515K6222L4032k3859j2843p8503M920P0564
6951e633M77o1049K9215P8188N4110o758m6161p216k175p122m6779J4903K9188
6938B3188o1332K171M1600K074p4722k1423L0032M5700L9295L6140J8205k3544
6926E7384j2494K0349M0149K8520M5244n9945o7769J8798l5001l6539j8650K2170
$$ plain form
7013 1268 -14706 54687 46220 -19994 -25384 -452 -11957 35927 85412 123522 97383 44844
7001 44844 54267 49838 35332 15550 -21810 -33106 32646 50650 64039 36690 -5516 -14584
6989 -14584 -11909 54370 85011 16399 23311 35261 46057 54915 47548 49301 43347 7032 34645
6976 34645 31128 61956 57212 33172 89541 88789 40796 16149 3716 5748 18524 84671 106062
6963 106062 123708 61605 84822 42349 -26166 56 34088 10229 -2614 -81117 -76197 -5633
6951 -5633 -5156 -66205 -36990 41198 95308 88550 42389 35173 32998 25876 -20903 -6000 23188
6938 23188 -38144 -35973 5627 7701 -67021 -88444 -58412 -12712 26583 62723 80928 57384
6926 57384 44890 65239 105388 133908 179152 119207 51438 70236 35235 -1304 -19954 2216
6914B216j0257j9647j9905J5496k4275O966K3826m8420Q981J8120j6312J9506
6902d3705k1217k2596n563N9356O7978K6056K4078Q897K710m400k967L5K2370
6889A11032J287o8737k2605J2130L1326j5888j0319l7891m8788l5042k3817l0829
6877a38141Q1477N1946m5887k3623J4093L1860K116N309l2470l6738j5779L3301
6865g2536N489L0777L4489j7839l2390q963N8357K3608l187m1605k7413l0515
6853h1728l9674K8866L8440L653R7751K7909Q624o8196l3936K7859N5014J0486
6841G5068k569J2991j5342P605L0092j6421m1902j0241p2228J910K2812m9226
6829e7451p798K393J4877O517Q018L1842n54K8098m4719r150K4202l4171p3093
$$ plain form
6914 2216 -8041 -27688 -47593 -32097 -56372 -49406 -25580 -74000 -65019 -46899 -63211 -43705
6902 -43705 -64922 -87518 -93081 -33725 34253 60309 84387 93284 95994 91594 88627 88662 111032
6889 111032 112319 43582 20977 33107 64433 48545 38226 335 -48453 -83495 -107312 -138141
6877 -138141 -56664 -4718 -50605 -74228 -60135 -28275 -26159 -20850 -53320 -90058 -105837 -72536
6865 -72536 -67047 -36270 -1781 -19620 -52010 -60973 -2616 20992 17805 -23800 -51213 -81728
6853 -81728 -121402 -92536 -54096 -50443 47308 75217 83841 15645 -18291 9568 64582 75068
6841 75068 72499 85490 70148 77753 107845 91424 49522 39281 -32947 -31037 -8225 -57451
6829 -57451 -65249 -62856 -47979 -41462 -33444 -1602 -2156 25942 -18777 -27927 -3725 -37896 -110989
6816a10989p032K3179N0462J6473m529R645J5645Q657J4514J065l989J4671n515
6803B2257o842j2272j0213m498L270J5653N3484r0207L1033L0244k3338K9095
6791C7666j5094J872J8593j862m4667M4966k5457l8272J3106L7946o251j5043
6779G503o5033p016k6243K5237O6616r485L298J8244j2768o668L6419L8303J2192
6766H0599L912m8050J469L6416m3681m5164q586L3511N9441J5837q3448q7222
6754h4966M1387O3132k421l1047j4573L762K7976l0031n4502O1962R5963K7937
6742A04579k1469o6604p4756M093M3284J9991J2684K1058N528j1925K5381M362
6730F6206n2287O5738M9767P448o4163m8553j981L9563J9794J5911J8834n4885
$$ plain form
6816 -110989 -118021 -94842 -44380 -27907 -32436 -22791 -7146 1511 16025 17090 13101 27772 22257
6803 22257 15415 3143 -7070 -11568 -8298 7355 60839 -29368 1665 31909 8571 37666
6791 37666 22572 24444 43037 41175 -3492 41474 16017 -22255 -9149 28797 22546 7503
6779 7503 -57530 -64546 -90789 -65552 1064 -8421 -5123 13121 353 -6315 30104 68407 80599
6766 80599 84511 36461 37930 74346 30665 -14499 -23085 10426 69867 85704 2256 -84966
6754 -84966 -43579 19553 17132 -13915 -28488 -24726 3250 -26781 -81283 -19321 76642 104579
6742 104579 83110 16506 -58250 -54157 -10873 9118 21802 42860 48388 36463 61844 66206
6730 66206 13919 79657 129424 136872 72709 24156 22175 61738 81532 97443 116277 61392
6718F1392j7534P2735n743p1813k7956L4244K9120O5713Q0002J32841J35132K7286
6706E15419j08560q4476j02227q4281l0491k2278K3787k7631k9501n727N0024
6695I4058P449n0955o6847j768j1992k3081K4931k6860L5979L7066J2931k394
6683B8517j2401J2224J6200l3925J4218k9642m8580L4834M8446L0613m0213o4703
6671d4412k7606J405j2454O358L0174k1638k2286m6069J5768P3521L7780J5112
6659E653l128k5194M2329P6012r413j3230J5014j965k1254q8298l1816n2983M4915
6646f3358P5716K001R092L471k923L5433k6197k6017N7218J2980p0014m9577J3424
6633b8751j2330J5863Q922k8634k5386J7840M1635q827P8955j1954k2617o7211
$$ plain form
6718 61392 43858 116593 110850 39037 11081 45325 74445 140158 220160 353001 488133 515419
6706 515419 406859 322383 220156 135875 105384 83106 106893 79262 49761 44034 94058
6695 94058 101507 50552 -16295 -18063 -30055 -53136 -28205 -55065 -19086 17980 30911 28517
6683 28517 16116 28340 44540 10615 24833 -4809 -53389 -18555 29891 60504 20291 -44412
6671 -44412 -72018 -70613 -83067 -76709 -46535 -68173 -90459 -136528 -120760 -47239 -9459 5653
6659 5653 2525 -22669 19660 95672 86259 73029 88043 86078 64824 -23474 -55290 -108273 -63358
6646 -63358 12358 14359 23451 26922 23999 59432 33235 7218 64436 77416 7402 -42175 -28751
6633 -28751 -41081 -25218 -16296 -44930 -70316 -52476 -10841 -19668 59287 47333 24716 -42495
6621d2495k4452Q8257L997L8112K3564M098k7417j9419j706j2129J7518k7011
6609B0917k4413n0840m9117l4884j0141O6254R1537J5545K1519N3300l0652J131
6597G0156n304k9300k5777l5787L929M506M1483J5808j8289K6555r296M7545N5889
6584A42118L13k3957n5291q1498l2348m666n2741P9184N5142J4936p629k5669
6572G894k6209J4840J2182J4381K9314L3927j7604o1327J5567J1698r067L3917
6560E9513m3554n120O845j6009k5580l9171n4794j5463r877N6791k359K3895K7167
6547c7716l520k9741K1251K2542m960N599K0391m1753J2273J2320J8335n0105
6535e5084L8464Q247l5856o017l42N0826M2153l4303m3915k1408n167j7092K0186
$$ plain form
6621 -42495 -66947 21310 25307 63419 86983 91081 63664 44245 42539 30410 47928 20917
6609 20917 -3496 -54336 -103453 -138337 -148478 -82224 9313 24858 46377 99677 69025 70156
6597 70156 64852 35552 9775 -26012 -22083 -17577 23906 39714 21425 47980 38684 86229 142118
6584 142118 142431 118474 63183 -18315 -50663 -55329 -108070 -28886 26256 41192 33563 7894
6572 7894 -18315 -3475 8707 23088 52402 86329 68725 7398 22965 34663 25596 59513
6560 59513 15959 10839 17684 1675 -23905 -63076 -117870 -133333 -143210 -86419 -88778 -64883 -37716
6547 -37716 -41236 -70977 -49726 -27184 -32144 -26545 -6154 -47907 -35634 -23314 -4979 -55084
6535 -55084 -16620 -8373 -44229 -50246 -50588 238 42391 8088 -35827 -57235 -62402 -79494 -59308
6522e9308K204Q2503O9103k1971j1062n3651R043M6842l363o8471r056O803L0101
6509A9717j6240L6544J9851j8222l4442n1657k8174K9630J8996K7140k4640r493
6497c0990m9988k606K0221M6673L3337m4451l3720K7837O472M9575L7693j0586
6485D9467K884m194J5757l9717J9961K4723n2179M3277k5523L2489M5610m3010
6473F9545m8186K0832l5486r394j3202J3579Q5210j3820n9246j7570j0618O062
6461a2294N6569J3470o1209N476K201J2944l3730j5846J7582k044J4933L4880
6449C2932K91j6911M357m4468m7813K6583N866l2112J8947K8173J763M4947R843
6436C2398j4653J8859K2379j7079n6178P66N9884l1392p4780K716L4024K8569
$$ plain form
6522 -59308 -57104 25399 94502 72531 61469 7818 16861 63703 60340 -8131 -17187 -10384 19717
6509 19717 3477 40021 59872 41650 7208 -44449 -72623 -42993 -23997 3143 -21497 -30990
6497 -30990 -80978 -83584 -63363 -16690 16647 -27804 -61524 -33687 -27215 22360 60053 49467
6485 49467 52351 48157 63914 24197 44158 68881 16702 59979 34456 66945 112555 69545
6473 69545 21359 42191 6705 -2689 -15891 -2312 82898 69078 9832 -7738 -18356 -12294
6461 -12294 44275 57745 -3464 2012 4213 17157 -16573 -32419 -14837 -16881 -1948 32932
6449 32932 33223 16312 20669 -23799 -71612 -45029 -39163 -71275 -52328 -24155 -22392 22555 32398
6436 32398 17745 36604 58983 41904 -14274 -13508 46376 14984 -59796 -57080 -23056 5513
6424E513K3228j2422r219n3050k6059J4194K357K5226L505l5925j6619j3695K8816
6411f4150L4049M158k963q681q77p772K0823P1225j644o3559K3556N0610N483
6398F0258j4607J4090Q510l752l4381q455K8709l1416j6072L4764j5508n4425
6386c2285o3848L74J1019J224K7543J5032K5245l5765k5340M9684l9516K3047
6374d3586K1521L9969N7526M4445m3263q403j6107J9581p0385p10k5270m6768
6362g1450n1228j3525J2595P0062J18402L6954m9461l3316k3102j7878J7936l3719
6350c7730k6102l0776M8080P3645L7278R113j3088n5082J2731m4436L2028M37
6338F098o6777R943M294m775O8426N7139k2672K2639J3100l0095m3797j1395L1595
$$ plain form
6424 5513 28741 16319 7100 -45950 -72009 -57815 -55458 -30232 -26727 -62652 -79271 -92966 -64150
6411 -64150 -30101 -25943 -28906 -37587 -38464 -46236 -25413 45812 44168 -19391 4165 54775 60258
6398 60258 45651 59741 68251 64499 30118 21663 50372 18956 2884 37648 22140 -32285
6386 -32285 -96133 -95759 -84740 -83516 -55973 -40941 -15696 -51461 -76801 -27117 -66633 -43586
6374 -43586 -22065 17904 75430 119875 76612 68209 52102 71683 1298 588 -24682 -71450
6362 -71450 -122678 -136203 -123608 -53546 64856 101810 52349 19033 -4069 -21947 -4011 -37730
6350 -37730 -63832 -94608 -46528 27117 64395 73508 60420 5338 18069 -26367 5661 6098
6338 6098 -60679 -50736 -46442 -51217 17209 74348 51676 74315 87415 57320 13523 2128 33723
6325C3723M5280o3168k7227K4658J3484R134j5688O800N6401K4619n4925p7115
6313b4024L170j9803L488L0570O908m9595K4399K8982p7542Q59j4441M2958K1342
6300b2729L0275j1582J178M5952j700J139J7484l6699m3190J7922M4531K2320
6288F4901j0109K3479K0818j9598k159j9083m6868J8473k4686n2026j0830N0138
6276g550K0096k2239J5288L6170K48K3456K9208k6344r757j6577J7532K5888o4155
6263B1264j2895j5666k1855j1309L322L5812l1893k3197l0868o3562Q1866P5347
6251F366n498n1367m1194O18P3208K0601O5040j6217j7695N188j685L544l0216
6238A0693l4331L8334O4138k3048m3038j1700j3488k238p636L5769n167k5309
$$ plain form
6325 33723 79003 15835 -11392 13266 26750 35884 20196 26996 83397 108016 53091 -24024
6313 -24024 -20854 -40657 -37169 -6599 309 -49286 -24887 4095 -73447 -72588 -87029 -44071 -22729
6300 -22729 7546 -4036 -2858 43094 41394 42533 60017 23318 -19872 -1950 42581 64901
6288 64901 54792 78271 99089 79491 77332 58249 11381 29854 5168 -46858 -57688 -7550
6276 -7550 12546 -9693 5595 41765 42013 65469 94677 68333 58576 41999 59531 85419 21264
6263 21264 8369 -7297 -29152 -40461 -37139 -1327 -33220 -56417 -87285 -150847 -68981 6366
6251 6366 868 -50499 -91693 -91075 -17867 2734 67774 51557 33862 39050 37365 40909 10693
6238 10693 -23638 14696 78834 55786 12748 1048 -12440 -14678 -22314 13455 8288 -17021
6226a7021n998J5478M9040J9267o589k7983o0288O181L6887K2820l6001K0537
6214A6330K3665o722k3012o2260m826k747M742M2598k2481L1654J3935N874P65
6201A7515k3531j6173q348J9394J2187j3122j4772K4587l3219N6589M3880k8507
6189C6480k274p569O259m804r054L6559J12106j0035j7968n9830k2125J7494k7367
6176D7872l3899j7114j5102L8264l6155j6210r807j1268N6178j5337o381n0847
6164f9806L4952J1462R625m0421k0700K8298K0938M2642n264L1226k0013K1901
6152D4840M454L5078O890k1644m8397m1391k7247K7769L7685k4803j5240R166
6140a2840P370l9589n761L0702K9188M1244l6469N78J2623L637m568J7315j9258
$$ plain form
6226 -17021 -23019 -7541 41499 60766 54177 26194 -34094 -27913 8974 31794 -4207 16330
6214 16330 39995 33273 10261 -51999 -56825 -59572 -54830 -12232 -34713 -3059 10876 16750 17515
6201 17515 -6016 -22189 -30537 -11143 1044 -12078 -26850 -2263 -35482 21107 64987 36480
6189 36480 34206 26637 32896 28092 19038 55597 167703 157668 139700 79870 57745 75239 47872
6176 47872 13973 -3141 -18243 20021 -16134 -32344 -42151 -53419 2759 -12578 -18959 -69806
6164 -69806 -34854 -23392 -13767 -54188 -74888 -46590 -25652 16990 11726 42952 22939 44840
6152 44840 49294 84372 91262 69618 21221 -20170 -47417 -19648 18037 -6766 -22006 -12840
6140 -12840 -5470 -45059 -50820 -20118 9070 50314 13845 14423 27046 30683 26115 43430 24172
6127B4172o283j3418j728m3695O736M0848J0408J7954K0574J3490M723k6351k4422
6114B3008R386r701l0632l3928N212n127l6774j0975M0627L2376M4381m7871L128
6101a6890J6560L5092L2952L657r09l6590m0671k76L5244K8162l9455k0892J1870
6088G854J0705K58k7461l5163k2699K6845M4972M4889M4699n5442m2374j2744
6076a5661n2108k551N3889O4893l0451o6666J7225P626K4687l8739j3180j2106
6064f3142L8302N2487l1470l2179k6947K6K8863J4583m2500L8808K7015m3752
6052c9906J1433K9154J6923j822N389O0337J1473k3878n5662o1608K4577J7740
6040e850J7974L5885J820n9552j9868Q2541k4655j9962J9756L8968M4455m129
$$ plain form
6127 24172 17889 4471 2743 -40952 -34216 6632 17040 34994 55568 69058 73781 47430 23008
6114 23008 32394 22693 -7939 -41867 -36655 -41782 -78556 -89531 -48904 -16528 27853 -20018 -16890
6101 -16890 -330 34762 67714 71371 70462 33872 -6799 -7075 28169 56331 16876 -4016 7854
6088 7854 18559 18817 -8644 -43807 -66506 -39661 5311 50200 94899 39457 -2917 -15661
6076 -15661 -67769 -70320 -16431 48462 18011 -48655 -31430 -23804 883 -37856 -51036 -63142
6064 -63142 -24840 27647 -3823 -36002 -62949 -62923 -34060 -19477 -61977 -23169 3846 -39906
6052 -39906 -28473 681 17604 15782 21171 81508 92981 69103 13441 -48167 -23590 -5850
6040 -5850 12124 48009 49829 -9723 -29591 52950 28295 8333 28089 67057 111512 107383
6028A07383j5624o5963k4615K494J7797Q272N3329j181j3918J9295o1197J927
6016B7999L2315n3521r564l4806L5021M964k657O267k7376p387K5486L5607l8603
6003f255M3412K8623m6852m1250P396L8356J9203L7090N2139Q304k3892l3009
5991H3265n5212j7183k3927o3786n3071J931Q7145O0036K8568n724m7506r359
5979a4823L9385N155n059N1802L8135p7765m1108R704K7037j6119k5059N9114
5967E0399j276j2917m7903M3857M2268j1485L2609k3827o1485k8186J0140O957
5955h49K1269l3037M871K830j0002O570L2012K2834q986n7340k1926k0903k1201
5942h3858L5610n610K7469K9467j4358j0403K1616l044j7690k0439M697j3167
$$ plain form
6028 107383 91759 25796 1181 3675 21472 29744 83073 81892 67974 87269 26072 27999
6016 27999 60314 6793 -2771 -37577 -2556 2408 -249 6018 -21358 -28745 -3259 32348 -6255
6003 -6255 37157 65780 18928 -22322 -14926 23430 42633 79723 131862 140166 116274 83265
5991 83265 28053 10870 -13057 -76843 -129914 -127983 -40838 19198 47766 42042 -5464 -14823
5979 -14823 24562 29717 24658 76460 114595 36830 -4278 5426 32463 16344 -8715 50399
5967 50399 49123 36206 -11697 32160 74428 62943 95552 71725 10240 -17946 -7806 -849
5955 -849 20420 -12617 -7746 -4916 -14918 -8348 23664 46498 37512 -19828 -41754 -62657 -83858
5942 -83858 -48248 -53858 -26389 3078 -11280 -21683 -67 -3111 -20801 -41240 -36543 -49710
5930d9710P599p92J2185j8362j5319N8292N4237m8417m409N3747J3780m1485L2072
5917E3418K7152L3852l1945n0352k9698l1553K473J4309M8434Q1547l2946n3116
5905C1575n1494p2492M1418M3034P942k1293m5860r998p399p680o225j3397P728
5892a04141K412J6073K91K5066K7843J362K1768m7284k8919M1432L5265k5800
5880c4632p0258n8906P5934P2977k6708m4251N2219L1373p1258k2800L130p87
5868i3967m356L1744k3674k2845K8499K6794K8077q813K3430N1846J0301k5970
5856B1066l6432j5869K9977M34k9255k1358k1416m1022J1508J05686L2728j1579
5844B4468q775K1702J4089Q911l0345l673l1640l8455o181L3991o868n0086J0094
$$ plain form
5930 -49710 -42111 -42903 -30718 -49080 -64399 -6107 48130 -287 -4696 49051 62831 21346 53418
5917 53418 80570 114422 82477 32125 2427 -29126 -26653 -12344 36090 117637 84691 31575
5905 31575 -19919 -92411 -50993 -7959 -17 -21310 -67170 -77168 -84567 -92247 -98472 -111869 -104141
5892 -104141 -101729 -85656 -85365 -60299 -32456 -31094 -9326 -56610 -85529 -44097 -8832 -34632
5880 -34632 -104890 -163796 -87862 -14885 -41593 -85844 -33625 -2252 -73510 -96310 -93180 -93967
5868 -93967 -98323 -66579 -90253 -113098 -84599 -57805 -29728 -38541 -15111 36735 47036 21066
5856 21066 -15366 -31235 -1258 -824 -30079 -51437 -72853 -113875 -102367 3319 36047 24468
5844 24468 15693 37395 51484 60395 30050 26377 -5263 -43718 -49899 -15908 -22776 -72862 -62768
5831f2768K7918M5914l5932p160P5786j2492l1439N400n2373j932K8918N4525
5819C4365k8719j0559J7634k714L951L8899K3007M194o4046q765K0943K0913L0695
5806G9798p8135p5713k7875J2779N2389M0597J225k6098M552P3298L1945Q4081
5794A72843J6618m6443L795o1931n2046l557o683K6380n057j016K1910L5377P812
5781A08002p5272q5261m4606M8031O4027J711l0569m441j1915L3595k1313q431
5769b6442J7122p383O117m024l8547J5209L1335L7011Q234m7316k043L8658p782
5756B0149r655L662n9112K2652P0279j1610j3380M695k1987j2257k4630J7673
5744a3521k054j498J8706n544n4404Q246l575o3781K7216N0460K1887m5034N120
$$ plain form
5831 -62768 -34850 11064 -24868 -32028 43758 31266 -173 5227 -47146 -49078 -20160 34365
5819 34365 5646 -4913 12721 10007 13958 52857 75864 80058 16012 7247 28190 49103 79798
5806 79798 1663 -74050 -101925 -89146 -36757 3840 5065 -21033 -16481 56817 88762 172843
5794 172843 189461 143018 146813 84882 32836 29279 22596 48976 43919 42903 64813 100190 108002
5781 108002 32730 -52531 -97137 -49106 14921 16632 -13937 -18378 -30293 3302 -18011 -26442
5769 -26442 -9320 -16703 -10586 -14610 -53157 -37948 -6613 30398 38632 -8684 -10727 27931 20149
5756 20149 10494 14156 -44956 -22304 47975 36365 22985 27680 5693 -6564 -31194 -13521
5744 -13521 -15575 -17073 1633 -3911 -58315 -50069 -53644 -117425 -90209 -39749 -17862 -62896 -57776
5731e7776L6860N9225j4679m3245p1322r1920J3314O4598J0722K2768K9879K0275
5719b1301J0037K9032J3646l9809J6082m1535q012J8709J2967L0294l1479J5571
5707D202j0840n3630j6311L6508l889j7817j4845M1421M7432N3962O4744o5264
5695F5673p3338K7739P2387j9030l0326L3352l9617k8063M5382J3229k795j17164
5683e2571n6984m1122J3333N1002O6140j7020J4716K0759m1770j8257J6780J7873
5671b7121M9297J5391j745L097l7132J5247l2462J6987o009K5956L3864m6805
5659H565j0074J4703j0379K2070n0670m4416L708M8649J9121K5777K1235P712
5647E6001J9921o089l3038p012m0761p377j9290l202Q5409N7812j9153r742J7491
$$ plain form
5731 -57776 -20916 38309 23630 -19615 -90937 -182857 -169543 -104945 -94223 -71455 -41576 -21301
5719 -21301 -11264 17768 31414 -8395 7687 -33848 -41860 -23151 -10184 20110 -11369 4202
5707 4202 -6638 -60268 -76579 -40071 -43960 -61777 -76622 -35201 12231 66193 130937 65673
5695 65673 -7665 20074 92461 73431 43105 76457 36840 8777 54159 67388 64593 -52571
5683 -52571 -109555 -150677 -137344 -86342 -20202 -37222 -22506 -1747 -43517 -61774 -44994 -27121
5671 -27121 22176 37567 35822 38919 1787 17034 -15428 1559 -4450 21506 55370 8565
5659 8565 -1509 13194 2815 24885 -25785 -70201 -66493 -17844 1277 27054 48289 56001
5647 56001 75922 69833 36795 29783 -10978 -18355 -37645 -40847 44562 102374 83221 73479 90970
5634I0970m6142r153J5742n9092M7413M2597p8983o809J6448J3301R58j471k6958
5621a179l0620K5188K0097p203k612q408Q2899L1126k3828o2873l2663m196m0741
5608e5013k6949L5543O2880J68r591j966k1547L4087M2421k6590j4999l4560L4747
5595A8631K3849J4449n2483j01117m3217L7031N826j868k7681M0004N8793q599
5583c6382l6683O1138O4472J1627k8361n5865k2150m670l7996K4358K8579L771
5571b8162J8466p398O342q197M101p672q939K4027k3859m0896J8858O0977K6016
5558C3664k6883l0248j3476l3299j3963j4183J3932N3951k917m9894M7410J2239
5546b3667L381Q0313K0359n702m9955m5860J2630j7596L939j9033l9142K771J9057
$$ plain form
5634 90970 44828 35675 51417 -7675 39738 82335 3352 -3457 12991 26292 27250 25779 -1179
5621 -1179 -31799 -6611 13486 6283 3671 -4737 78162 109288 85460 22587 -10076 -14272 -55013
5608 -55013 -81962 -46419 16461 16629 7038 5072 -16475 17612 60033 33443 18444 -16116 18631
5595 18631 42480 56929 4446 -96671 -139888 -102857 -97031 -98899 -126580 -86576 -27783 -36382
5583 -36382 -73065 -11927 52545 64172 35811 -20054 -42204 -46874 -84870 -60512 -31933 -28162
5571 -28162 -9696 -17094 -10752 -18949 -14848 -22520 -31459 -7432 -31291 -72187 -53329 7648 33664
5558 33664 6781 -23467 -36943 -70242 -84205 -98388 -84456 -30505 -33422 -83316 -35906 -23667
5546 -23667 -20286 60027 80386 74684 24729 -21131 -8501 -26097 -22158 -41191 -80333 -77562 -58505
5533e8505r860R920J5086k1110k4611J0027K5600N0805k7390j4764r606j3222
5521f7630q7429k3627M8815P7289Q515K786J5590N0098k1309K7543M9164k4639
5509E5166k5407o120m1775P529l15J2892j7007L97k1668N6203k5876l4394M7836
5496G461J0471j4240m8365n5993K8586j0643L055K5889K0339l542j5351k2070
5484g4403L7812R196M3691M9018m8373j2534l4417r961j8153j5508k1436p068
5472a02136j2133L4721M1326Q843K3687j2489L3053r577r348L2623k6797k7321
5460b5548L4641M1961j5878k0561J5335n7088m9550M7842M9469k0188n3663o9880
5448a23108k586K8303K7018O0047M2822J1903P14O0034r205m9908l2387K2356
$$ plain form
5533 -58505 -68365 -58445 -43359 -64469 -89080 -79053 -53453 -2648 -30038 -44802 -54408 -67630
5521 -67630 -155059 -178686 -129871 -52582 -44067 -41281 -25691 24407 3098 30641 79805 55166
5509 55166 29759 23639 -18136 -10607 -10922 1970 -15037 -14640 -36308 19895 -5981 -40375 7461
5496 7461 17932 3692 -44673 -100666 -72080 -82723 -79668 -53779 -33440 -36982 -52333 -74403
5484 -74403 -36591 -27395 16296 65314 16941 4407 -30010 -39971 -58124 -73632 -95068 -102136
5472 -102136 -114269 -79548 -38222 -29379 -5692 -18181 14872 5295 -4053 28570 1773 -25548
5460 -25548 9093 51054 35176 14615 29950 -27138 -76688 -28846 20623 435 -53228 -123108
5448 -123108 -125694 -97391 -70373 -10326 32496 44399 45113 105147 95942 46034 13647 36003
5436C6003J5700l7297k1138M035l583O69k0515O078L9793N5536l4871m2137m5971
5423d7698n3779p173n7786j3672l824M8451J4775K7135J6675j0087K6489J7266
5411d3228j5611J1847J7361j9028k1443K6061K5711K1338K829o1038n0389m9134
5399a54724L1390K8228O4155M7939k4175J8110n8638m0313l7124K0496M3973K4511
5387c6172j3770l6520N231L9616J6066r417l3414j0047L560K1670M6442N2973
5375D6218m002j8049n4948o017j9692J6520J0932j4047L0399M2104l3998J9903
5363A5323R789k4927J7654O825J2845K199l36m2817J281K5107p679o260m699K0089
5349B4394J4911l2703O557j2133j0338J7495J1801k7495j8403j983q922p9182
$$ plain form
5436 36003 51703 14406 -6732 -2697 -6280 -5611 -26126 -20048 19745 75281 40410 -1727 -47698
5423 -47698 -101477 -108650 -166436 -180108 -183932 -135481 -120706 -93571 -76896 -86983 -60494 -43228
5411 -43228 -58839 -46992 -29631 -48659 -70102 -44041 -18330 3008 5837 -55201 -105590 -154724
5399 -154724 -123334 -95106 -30951 16988 -7187 10923 -47715 -88028 -125152 -104656 -60683 -36172
5387 -36172 -49942 -86462 -81231 -41615 -25549 -34966 -68380 -78427 -74867 -53197 -6755 46218
5375 46218 42216 24167 -30781 -36798 -56490 -39970 -29038 -43085 -12686 29418 -4580 15323
5363 15323 25112 185 17839 24664 37509 39708 39372 -3445 -2164 22943 15264 9004 4305 24394
5349 24394 39305 6602 13159 1026 -9312 8183 19984 -7511 -25914 -27897 -36819 -116001
5337a16001j0262j3597k7857k5696N3790R6381J7863O286O4912J4848k8322n3834
5325b1489M3398Q104k9590K703J2188K7751j12012q6552K1822Q9420K1005j9927
5313d3179K6167J6491J803J0298J4619l1777J4641M5628j500l0404o160K3332
5301C9959L5072j2809j6549m2989j1765K3535L2871k9071J0169j3853j7839n6299
5289e9568J5636K5990J366M6922O4452K6931k926p235j1771m6650K5513J1076
5277H9736j9479o5701n5967m142N8005k3531j6959J9246l50j8015j5014n19P219
5264d5471N299o746J9753N6068l15j070J1481m38l5573k4850n1588L1314Q1799
5251C9663r481m228M5553m0048m5477l840J3253p7747o966N8295k2405J7855L0248
$$ plain form
5337 -116001 -126263 -139860 -167717 -193413 -139623 -43242 -25379 -19093 45819 60667 32345 -21489
5325 -21489 21909 30013 423 3126 15314 43065 -68947 -155499 -133677 -44257 -23252 -43179
5313 -43179 -17012 -521 1282 11580 26199 -5578 9063 54691 53191 22787 16627 39959
5301 39959 75031 62222 45673 2684 -9081 14454 47325 18254 28423 14570 -3269 -59568
5289 -59568 -43932 -17942 -16576 30346 94798 121729 118803 111568 99797 53147 78660 89736
5277 89736 70257 4556 -51411 -55553 2452 -21079 -38038 -18792 -19142 -37157 -52171 -52690 -45471
5264 -45471 -40172 -46918 -27165 28903 28588 27518 38999 38561 2988 -21862 -73450 -42136 39663
5251 39663 30182 25954 71507 31459 -14018 -17858 -4605 -82352 -89318 -31023 -53428 -35573 -5325
5238e325j0945j504j5825n5054k0657L2705J2185k4360n40K5565N9371L1963N5132
5225H2711m158m7794q6242o099r878K2210M2454P936m210n7870J208N2242P2418
5212F4928j7794m6237p545l1864J1742J6870j818j6151j2663j5963k4862r915
5200i1272R050M1420k881K6173o268O0265O0076m308p0971o9500k5472L1851j9617
5187f1454l5459j342K8857M6438K1033J8104M6016j1855j9768l8659j0582j9737
5175c8408m0203K8933K1473M9735J0523k4832j6763P856J5381K4082k9147p445
5163A185l3560j0348j0542J8305j00237Q224M8911M1038o224M2078O4457Q772
5151G2059l3170m7565n9438o4652J3815Q631k118r445J0971j7380K2766r929J16442
$$ plain form
5238 -5325 -16270 -17774 -33599 -88653 -109310 -76605 -64420 -88780 -89320 -63755 -4384 27579 82711
5225 82711 78553 30759 -55483 -61582 -71460 -49250 -6796 1140 -3070 -60940 -59732 -7490 64928
5212 64928 47134 897 -6648 -38512 -26770 -9900 -11718 -27869 -40532 -56495 -81357 -91272
5200 -91272 -82222 -40802 -43683 -17510 -23778 36487 96563 92255 21284 -48216 -73688 -41837 -61454
5187 -61454 -96913 -98255 -69398 -22960 -1927 16177 62193 50338 30570 -8089 -18671 -38408
5175 -38408 -78611 -49678 -28205 21530 32053 7221 -9542 -1686 13695 37777 8630 1185
5163 1185 -32375 -42723 -53265 -34960 -135197 -126973 -78062 -37024 -43248 -1170 63287 72059
5151 72059 38889 -8676 -68114 -132766 -118951 -110320 -112438 -121883 -110912 -128292 -105526 -115455 987
5138I87M1862j8333Q267l4690o8183R824L4637k0275L5562k4560k9190r046J3975
5125e9163N5959J3287k1672j1599j754J9123P002K1794j6900k3136J847J5297
5113H5J4490k711j4273n6220n0894l664K0649j880J9475j0343Q463K512j927n022
5099h1260M2060N9093O781K376L3794L0720j5908k3449K4043o7600o2068m9359
5087a00777J6996L6084L7437J025K6143J7211j1029j4529m8735J9509L1099k4376
5075a3942K8948K0866n0470q880k7803r600Q027O156j193j8734p87N5149l4894
5062d7157j5846L5190J18683p803q0334j5411N5134n524n8870l6708M1936M8020
5050C1310k0510k4448P4226J2480j1311k9152m834J5000M0873J4856k739r9971
$$ plain form
5138 987 42849 24516 32783 -1907 -70090 -60266 -25629 -45904 -10342 -34902 -64092 -73138 -59163
5125 -59163 -3204 10083 -11589 -23188 -24942 -5819 1183 22977 6077 -17059 -15212 85
5113 85 14575 11864 -2409 -58629 -109523 -113187 -92538 -94418 -74943 -85286 -76823 -74311 -76238 -81260
5099 -81260 -39200 19893 26674 29050 62844 93564 77656 54207 78250 10650 -51418 -100777
5087 -100777 -83781 -47697 -10260 -9235 16908 34119 23090 8561 -40174 -20665 10434 -13942
5075 -13942 15006 35872 -14598 -23478 -51281 -60881 -52854 -46698 -47891 -66625 -67412 -12263 -47157
5062 -47157 -63003 -27813 90870 83067 2733 -12678 42456 36932 -21938 -58646 -16710 31310
5050 31310 10800 -13648 60578 73058 61747 32595 27761 42761 83634 98490 95751 -4220
5038d220n6783j0661K4008L2861l7443n3945r74M4484L4678J2098l659K2452M033
5025F929q024L5990k7961P644J9046j4956M3371l8571l1928J4912L804K3859l2750
5012A365j5748L4863l5345o2323l402J1892J8622J6335J2482J5618j9686M2711
5000A7384J3145o4214M7388M7631l0787p215k1661p1524J2782k4158K252N3429
4988b5548J9533J2104O418r446j5572k9814N9311Q05j3594n231m0163J6156K6242
4975A201k7864l6123m2186J8623J4780j9269N006L9787P678J5679k2414k6791
4963g1893K5760L252K3595j3448K5856K0827j0816o4349n1790J6041K5404N555
4951f6006J250p046M074l220J1673l123K377J04874K5944l1892m3086m6779o129
$$ plain form
5038 -4220 -61003 -71664 -47656 -14795 -52238 -106183 -107157 -62673 -27995 -15897 -19556 2896 6929
5025 6929 -1095 34895 6934 14578 33624 18668 62039 23468 -8460 6452 10256 34115 1365
5012 1365 -14383 20480 -14865 -77188 -80590 -68698 -50076 -33741 -21259 -5641 -25327 17384
5000 17384 30529 -33685 13703 61334 30547 23332 1671 -69853 -57071 -81229 -78977 -25548
4988 -25548 -6015 6089 12507 3061 -12511 -42325 16986 17791 4197 -1034 -41197 -25041 1201
4975 1201 -26663 -62786 -104972 -86349 -71569 -90838 -85832 -46045 -38367 -22688 -45102 -71893
4963 -71893 -46133 -42881 -19286 -32734 -6878 13949 3133 -61216 -113006 -96965 -71561 -66006
4951 -66006 -64756 -71802 -67728 -70948 -59275 -62398 -60021 44853 70797 38905 -4181 -50960 -57089
4938e7089L3409p147k449l270l210P0533l319k3168O017m0932K8771k0956N533
4925a7277k6426o5173N3050p090l7586L6012M4963J1002l845L9730L0157j7538
4913C9979l0677J567K2861m7728q6959o2882L7510K4006l9127L8783J5972k1302
4901a07997J3896n539l8241R605n823M9856M8056K282M9588R252k5363n652K6156
4888B0076j1693l3504J267K5121k5731k4070J8296o3387k5638J03079K2243O231
4876A2290R118k3129J0460N5217M710j18615o0439R729j6427O8909L7709n923
4864a6391j187J538N7788J8676m1363L031n097m2087l7111J5160K4403j1161M5908
4851A2107j3651j7573K6705n6159r06K8154k4255l157M8046J2194o0113o1251
$$ plain form
4938 -57089 -23680 -30827 -33276 -36546 -39756 30777 27458 4290 10307 -30625 -1854 -22810 -17277
4925 -17277 -43703 -108876 -55826 -62916 -100502 -64490 -19527 -8525 -12370 27360 57517 39979
4913 39979 9302 10869 33730 -13998 -100957 -163839 -126329 -102323 -141450 -102667 -86695 -107997
4901 -107997 -94101 -99640 -137881 -128276 -134099 -84243 -36187 -33905 15683 24935 -428 -6080 20076
4888 20076 8383 -25121 -23854 1267 -24464 -48534 -30238 -93625 -119263 -16184 6059 12290
4876 12290 21408 -1721 8739 63956 68666 -49949 -110388 -100659 -117086 -48177 -10468 -16391
4864 -16391 -17578 -16040 41748 60424 19061 22092 16995 -25092 -62203 -47043 -22640 -33801 12107
4851 12107 -1544 -19117 7588 -48571 -49477 -21323 -45578 -48735 -689 11505 -48608 -109859
4839a09859j4627M1274J7298M955O6614p494K244j9342K2060K0842j0779m6169
4827c2983n7512M1721J8565N7256J2703J1999l1433m1576J3646Q993l9533m3300
4815h1454m7076j8529L1030L7818K1533L8401n850l3008l0751K1581n099K4457
4803d6947M255L1174k4976j6777k2997L8255r869o8794K0913P5347P8403J8502
4791G6489L1104o2313r2721J3911p61l5825L3470l992p7714p0857R683J5016M1047
4778a23463M0354K5068J6690L997O803J9200n9785l5510O6307N0536L53J206l1523
$$ plain form
4839 -109859 -124486 -83212 -65914 -60959 5655 -1839 405 -18937 3123 23965 13186 -32983
4827 -32983 -90495 -48774 -30209 27047 39750 51749 20316 -21260 -7614 1379 -38154 -81454
4815 -81454 -128530 -147059 -116029 -78211 -56678 -18277 -24127 -57135 -87886 -66305 -71404 -46947
4803 -46947 -42692 -11518 -36494 -53271 -76268 -38013 -47882 -116676 -95763 -20416 57987 76489
4791 76489 107593 45280 -47441 -33530 -34291 -70116 -36646 -40638 -118352 -189209 -179526 -164510 -123463
4778 -123463 -83109 -58041 -41351 -37354 -30551 -11351 -71136 -106646 -40339 10197 10550 11756 -19767
$$ [...]
##END NTUPLES=NMR SPECTRUM
##END=
