##TITLE=Analysis number 329657
Compound Code cc 68208
Book Reference 546/36
Project Code adrs
Chemist Name craigr
##JCAMPDX= 6.0         $$ Bruker NMR JCAMP-DX V2.0
##DATA TYPE= NMR SPECTRUM
##DATA CLASS= NTUPLES
##ORIGIN= Bruker BioSpin GmbH
##OWNER= nmr
$$ XWIN-NMR		Version 3.5
$$ Fri Sep 21 09:59:43 2007 GMT Daylight Time (UT+1h)  MAYBRIDGE\nmr@NMR_250MHZ
##.OBSERVE FREQUENCY= 250.131544655141
##.OBSERVE NUCLEUS= ^1H
##.ACQUISITION MODE= SIMULTANEOUS (DQD)
##.ACQUISITION SCHEME= undefined
##.AVERAGES= 16
##.DIGITISER RES= 18
##SPECTROMETER/DATA SYSTEM= dpx250
##.PULSE SEQUENCE= zg30
##.SOLVENT NAME= CDCl3
##.SHIFT REFERENCE= (INTERNAL, CDCl3, 0, 16.4486)
##AUDIT TRAIL= $$ (NUMBER, WHEN, WHO, WHERE, WHAT)
$$ ##TITLE= Audit trail, XWIN-NMR		Version 3.5
$$ ##JCAMPDX= 5.01
$$ ##ORIGIN= Bruker BioSpin GmbH
$$ ##OWNER= nmr
$$ C:\u/data/dgb/nmr/ADRS/2110/pdata/1/auditp.txt
$$ ##AUDIT TRAIL=  $$ (NUMBER, WHEN, WHO, WHERE, WHAT)
(   1,<2007-09-21 09:59:19.82 +100>,<MAYBRIDGE\nmr>,<NMR_250MHZ>,
      <created by zg, POWCHK disabled, PULCHK disabled
       configuration hash MD5:
       76 6E 9A 78 1E 09 19 81 EC 84 63 8F B0 6A 59 2D
       data hash MD5: 64K
       6B EE 2D 68 83 43 6E D7 79 98 E1 17 76 83 72 33>)
(   2,<2007-09-21 09:59:34.21 +100>,<MAYBRIDGE\nmr>,<NMR_250MHZ>,
      <Start of raw data processing
       ef LB = 0.3 FT_mod = 6 PKNL = 1 SI = 32K 
       data hash MD5: 32K
       A5 DA 20 48 95 B3 17 F1 C2 F3 49 68 C9 9B 56 6C>)
(   3,<2007-09-21 09:59:35.82 +100>,<MAYBRIDGE\nmr>,<NMR_250MHZ>,
      <apk 
       data hash MD5: 32K
       7F 2A 4E 88 CE CA 9B 18 92 E1 56 02 8E 7E E5 DF>)
(   4,<2007-09-21 09:59:36.58 +100>,<MAYBRIDGE\nmr>,<NMR_250MHZ>,
      <abs ABSG = 5 
       data hash MD5: 32K
       EF 25 4C D1 9E 7D D4 EE F9 5F 60 8E 67 13 C6 16>)
$$ ##END=
$$ 
$$ hash MD5
$$ 03 DF FB B6 38 FD 94 E8 D1 03 44 14 14 F7 7B 64
##$RELAX= 
##$RELAX= 
##$RELAX= 
##$RELAX= 
##$RELAX= 
##$RELAX= 
##$RELAX= 
$$ Bruker specific parameters
$$ --------------------------
##$DU= <C:\u>
##$EXPNO= 2110
##$NAME= <ADRS>
##$PROCNO= 1
##$TYPE= <nmr>
##$USER= <dgb>
##$AMP= (0..31)
100 100 100 100 100 100 100 100 100 100 100 100 100 100 100 100 100 100 
100 100 100 100 100 100 100 100 100 100 100 100 100 100 
##$AQSEQ= 0
##$AQ_mod= 3
##$AUNM= <au_zg>
##$AUTOPOS= <2 >
##$BF1= 250.13
##$BF2= 250.13
##$BF3= 250.13
##$BF4= 250.13
##$BF5= 500.13
##$BF6= 500.13
##$BF7= 500.13
##$BF8= 500.13
##$BYTORDA= 1
##$CFDGTYP= 0
##$CFRGTYP= 5
##$CHEMSTR= <none>
##$CNST= (0..31)
1 1 145 1 1 1 1 1 1 1 1 1 1 1 1 1 1 1 1 1 1 1 1 1 1 1 1 1 1 1 1 1 
##$CPDPRG= <>
##$CPDPRG1= <>
##$CPDPRG2= <>
##$CPDPRG3= <>
##$CPDPRG4= <mlev>
##$CPDPRG5= <mlev>
##$CPDPRG6= <mlev>
##$CPDPRG7= <mlev>
##$CPDPRG8= <mlev>
##$CPDPRGB= <>
##$CPDPRGT= <>
##$D= (0..31)
0 1 0 0 0 0 0 0 0 0.06 0 0 0 0 0 0 0.0002 0 0 0 0 0 0 0 0 0 0 0 0 0 0 
0 
##$DATE= 1190365158
##$DBL= (0..7)
120 120 120 120 120 120 120 120 
##$DBP= (0..7)
150 150 150 150 150 150 150 150 
##$DBP07= 0
##$DBPNAM0= <>
##$DBPNAM1= <>
$$ [...]
##$SUBNAM7= <"">
##$SUBNAM8= <"">
##$SUBNAM9= <"">
##$SW= 20.6930455092707
##$SWIBOX= (0..15)
0 0 3 0 0 0 0 0 0 0 0 0 0 0 0 0 
##$SW_h= 5175.983436853
##$TD= 65536
##$TD0= 1
##$TE= 297.16
##$TE2= 300
##$TE3= 300
##$TEG= 300
##$TL= (0..7)
0 120 120 120 120 120 120 120 
##$TP= (0..7)
150 150 150 150 150 150 150 150 
##$TP07= 0
##$TPNAME0= <>
##$TPNAME1= <>
##$TPNAME2= <>
##$TPNAME3= <>
##$TPNAME4= <>
##$TPNAME5= <>
##$TPNAME6= <>
##$TPNAME7= <>
##$TPOAL= (0..7)
0.5 0.5 0.5 0.5 0.5 0.5 0.5 0.5 
##$TPOFFS= (0..7)
0 0 0 0 0 0 0 0 
##$TUNHIN= 0
##$TUNHOUT= 0
##$TUNXOUT= 0
##$USERA1= <user>
##$USERA2= <user>
##$USERA3= <user>
##$USERA4= <user>
##$USERA5= <user>
##$V9= 5
##$VALIST= <valist>
##$VCLIST= <CCCCCCCCCCCCCCC>
##$VD= 0
##$VDLIST= <DDDDDDDDDDDDDDD>
##$VPLIST= <PPPPPPPPPPPPPPP>
##$VTLIST= <TTTTTTTTTTTTTTT>
##$WBST= 1024
##$WBSW= 4
##$XGAIN= (0..3)
0 0 0 0 
##$XL= 0
##$YL= 0
##$YMAX_a= 382304
##$YMIN_a= -456986
##$ZGOPTNS= <>
##$ZL1= 120
##$ZL2= 120
##$ZL3= 120
##$ZL4= 120
##$ABSF1= 16.44859
##$ABSF2= -4.244583
##$ABSG= 5
##$ABSL= 3
##$ALPHA= 0
##$AQORDER= 0
##$ASSFAC= 0
##$ASSFACI= 0
##$ASSFACX= 0
##$ASSWID= 0
##$AUNMP= <proc_1d>
##$AZFE= 0.1
##$AZFW= 0.1
##$BCFW= 0
##$BC_mod= 0
##$BYTORDP= 0
##$COROFFS= 0
##$CY= 12.5
##$DATMOD= 1
##$DC= 0
##$DFILT= <>
##$DTYPP= 0
##$F1P= 14.0000005364418
##$F2P= -0.99999901652339
##$FCOR= 0.5
##$FTSIZE= 32768
##$FT_mod= 6
##$GAMMA= 0
##$GB= 0
##$INTBC= 1
##$INTSCL= 1
##$ISEN= 128
##$LB= 0.3
##$LEV0= 0
##$LPBIN= 0
##$MAXI= 10000
##$MC2= 0
##$MEAN= 0
##$ME_mod= 0
##$MI= 0
##$NCOEF= 0
##$NC_proc= -3
##$NLEV= 6
##$NOISF1= 0
##$NOISF2= 0
##$NSP= 0
##$NTH_PI= 0
##$NZP= 0
##$OFFSET= 16.44859
##$PC= 1
##$PHC0= 157.7883
##$PHC1= 5.163763
##$PH_mod= 1
##$PKNL= yes
##$PPARMOD= 0
##$PSCAL= 4
##$PSIGN= 0
##$REVERSE= no
##$SF= 250.130018361788
##$SI= 32768
##$SIGF1= 0
##$SIGF2= 0
##$SINO= 400
##$SIOLD= 32768
##$SREGLST= <1H.CDCl3>
##$SSB= 0
##$STSI= 32768
##$STSR= 0
##$SW_p= 5175.98343685301
##$SYMM= 0
##$S_DEV= 0
##$TDeff= 65536
##$TDoff= 0
##$TI= <Analysis number 999999
Compound Code 99
Book Reference 9
Project Code 9>
##$TILT= no
##$TM1= 0
##$TM2= 0
##$TOPLEV= 0
##$USERP1= <user>
##$USERP2= <user>
##$USERP3= <user>
##$USERP4= <user>
##$USERP5= <user>
##$WDW= 1
##$XDIM= 32768
##$YMAX_p= 342788459
##$YMIN_p= -232823
$$ End of Bruker specific parameters
$$ ---------------------------------
##NTUPLES= NMR SPECTRUM
##VAR_NAME=  FREQUENCY,     SPECTRUM/REAL,   SPECTRUM/IMAG
##SYMBOL=    X,             R,               I
##VAR_TYPE=  INDEPENDENT,   DEPENDENT,       DEPENDENT
##VAR_FORM=  AFFN,          ASDF,            ASDF
##VAR_DIM=   32768,         32768,           32768
##UNITS=     HZ,            ARBITRARY UNITS, ARBITRARY UNITS
##FACTOR=    0.157963299565203, 1,           1
##FIRST=     4114.28594987555, 0,            0
##LAST=      -1061.69748697746, 0,           0
##MIN=       -1061.69748697746, -232823,     0
##MAX=       4114.28594987555, 342788459,    0
$$ Real data points
##PAGE= N=1
##DATA TABLE= (X++(R..R)), XYDATA
$$ [...]
15964A719m7857j5763k3909L9140L6690M0008j3958k2050P012R579j4875M5422
$$ 1719 -46138 -61901 -85810 -46670 -9980 30028 16070 -5980 1032 10611 -4264 41158
15952D1158j0583n7638p5418O8953L0928k6890n323o1522L3653N2185K8552M8487
$$ 41158 30575 -27063 -102481 -33528 -2600 -29490 -34813 -96335 -62682 -10497 18055 66542
15940F6542n2506L04L9882K9198m217j1151l3747p7466j5303n654n6368J8779
$$ 66542 14036 14340 54222 83420 79203 68052 34305 -43161 -58464 -64118 -120486 -101707
15928a01707O6229L59n4261l1754k1705N2744R3592O3368k5888p2255l3312J6410
$$ -101707 -35478 -35119 -89380 -121134 -142839 -90095 3497 66865 40977 -31278 -64590 -48180
15916d8180O0093Q790k2575l0310J1780K1029M708j6602p7513L5690N934k3404
$$ -48180 11913 20703 -1872 -32182 -20402 627 5335 -11267 -88780 -53090 -47156 -70560
15904g0560M837N5768J8930k1444l68O320K2072q807L1717p338p740q7346n5606
$$ -70560 -65723 -9955 8975 -12469 -12837 -6517 15555 6748 38465 31127 23387 -63959 -119565
15891a19565j1132L4789N3630k634l3854j9986o2808L5216P5217L9547J8937J2253
$$ -119565 -130697 -95908 -42278 -44912 -78766 -98752 -161560 -126344 -51127 -11580 7357 19610
15879A9610n5193l7796J4947K8488L105O0504k7435m7977N7985j6332m163m6199
$$ 19610 -35583 -73379 -58432 -29944 -26839 33665 6230 -41747 16238 -94 -4257 -50456
15867e0456m979k0892J386J0256l3565N8643M4389n974K0835m8991m8564K3064
$$ -50456 -55435 -76327 -74941 -64685 -98250 -39607 4782 -1192 19643 -29348 -77912 -54848
15855e4848M9288m732m7580m1721k526L7513L2130n6719k6804M082R058L9162
$$ -54848 -5560 -10292 -57872 -99593 -102119 -64606 -32476 -89195 -115999 -111917 -102859 -63697
15843f3697P2108P308n2807l734J6968N8393r473J271l2574K178J6976j01771
$$ -63697 8411 15719 -37088 -40822 -23854 34539 25066 26337 -6237 -4059 12917 -88854
15831h8854p9714L3699M0280O6436J6778K8946j3714o4212j533N6032o7838k3626
$$ -88854 -168568 -134869 -94589 -28153 -11375 17571 3857 -60355 -61888 -5856 -73694 -97320
15819i7320Q462O1755K9066n3967k2002O1806P854J5349j7989O4110O5826p4888
$$ -97320 -88858 -27103 1963 -52004 -74006 -12200 -4346 11003 -6986 57124 122950 48062
15807D8062k0766m6972j134N2974O6285L746j01516p3750J0685J8246M6646j0068
$$ 48062 27296 -19676 -20810 32164 98449 102195 679 -73071 -62386 -44140 2506 -7562
15795g562j7175j9145j060k956m330j5562K8020m168q1241m1245Q1722J29456
$$ -7562 -24737 -43882 -44942 -47898 -52228 -67790 -39770 -43938 -125179 -166424 -84702 44754
15783D4754m386k1427m4782K4605K9163J9741k0925K3073k7683l3819m2041l3636
$$ 44754 40368 18941 -25841 -1236 27927 47668 26743 49816 22133 -11686 -53727 -87363
15771h7363J4749O3821K3418m5817k6435J954L6214N0107L6251n1903n3971l1718
$$ -87363 -72614 -8793 14625 -31192 -57627 -55673 -19459 30648 66899 14996 -38975 -70693
15759g0693L7070q352p3430L2443q18L5638P5569J9530m8890n0071j2673r3814
$$ -70693 -33623 -41975 -115405 -82962 -83780 -48142 27427 46957 -1933 -52004 -64677 -158491
15747a58491J0352P277J1860K3326Q1515Q7297M7731k3533L428J3363j00679p615
$$ -158491 -148139 -140862 -129002 -105676 -24161 63136 110867 87334 90762 104125 3446 -4169
15735d169J3241l1494Q235O0735K078k4346P993o4728M0749l51l0726N5115J6872
$$ -4169 9072 -22422 -14187 46548 48626 24280 32273 -32455 8294 7943 -22783 32332 49204
15722D9204l9478K3125j9002j5387J3825l6396o728l5466N3293K7075p8643J0039
$$ 49204 9726 32851 13849 -1538 12287 -24109 -30837 -66303 -13010 14065 -64578 -54539
15710e4539L5539R46l4683k5137j7057J5730L208N006L0185J6943R164k522k0745
$$ -54539 -19000 -18054 -52737 -77874 -94931 -79201 -75993 -70987 -40802 -23859 -14695 -17217 -37962
15697c7962L1295p2507l2706N3358M6687o126J1049O2228J9467J4699l2817l8320
$$ -37962 -6667 -79174 -111880 -58522 -11835 -17961 -6912 55316 74783 89482 56665 18345
15685A8345P081j7084l6736N636N7294L5286o1442k6519n0318M8296K4672l9410
$$ 18345 25426 8342 -28394 -22758 34536 69822 8380 -18139 -68457 -20161 4511 -34899
15673c4899j0595L0643K6678L7637k1661q523Q546N1046j0809r1512n9214R497
$$ -34899 -45494 -14851 11827 49464 27803 19280 27826 78872 68063 -23449 -82663 -73166
15661g3166K6531j7836j9622O4619J00014j6597m4852l5456l5653O5819L7681
$$ -73166 -46635 -64471 -84093 -19474 80540 63943 19091 -16365 -52018 13801 51482
15650E1482r2702j4972M3989r575j3046p934Q035L3002J6844K1319p2198m0858
$$ 51482 -41220 -56192 -12203 -21778 -34824 -42758 -34723 -1721 15123 36442 -35756 -76614
15638g6614O953j1580N7606N1491O3082L4291o5020k1069O3365M0451k926k9033
$$ -76614 -69661 -81241 -23635 27856 90938 125229 60209 39140 102505 142956 140030 110997
15626A10997q4376o1016J2300K9005K2612p289K926o064m121m961l1603n7446
$$ 110997 26621 -34395 -22095 6910 29522 22233 25159 19095 14974 10013 -21590 -79036
15614g9036n8915M9891R4720N5608m4214o5349q430L6064L2647l1038K7651J3495
$$ -79036 -137951 -88060 6660 62268 18054 -47295 -55725 -19661 12986 -18052 9599 23094
15602B3094k1793J9485L0637m7454l4803K8636L5037m7789j7365N8006O3843j5761
$$ 23094 1301 20786 51423 3969 -30834 -2198 32839 -14950 -32315 25691 89534 73773
15590G3773n7807k1909J0268J4284n541j899l6039Q638l5160N2902M0740P060
$$ 73773 15966 -5943 4325 18609 13068 11169 -24870 -16232 -51392 1510 42250 49310
15578D9310r942j3387J491Q379J7842m714m8504L7775O2681J04575O1494l1883
$$ 49310 39368 25981 27472 35851 53693 48979 475 38250 100931 205506 267000 235117
15566B35117m3814K3409M9755k8257j2335O4777N7884J7713p6188r0354n14p516
$$ 235117 191303 214712 264467 236210 223875 288652 346536 364249 288061 197707 197193 189677
15554A89677q0318o2837M6370o536M3918J4942n9601o446l7538o5462k9456J9327
$$ 189677 109359 46522 92892 86356 130274 145216 85615 79169 41631 -23831 -53287 -33960
15542c3960l129O3009J9153J9005r492j7199l5002l514k3846n7045M5188k1605
$$ -33960 -37089 25920 45073 64078 54586 37387 2385 -1129 -24975 -82020 -36832 -58437
15530e8437O409j9221J324j6273n389q309L9999O228q291j863j1099O6656N9226
$$ -58437 -52028 -71249 -69925 -86198 -91587 -99896 -59897 -53669 -61960 -63823 -74922 -8266 50960
15517E0960M1640j6898l8565j9053k2395j0077K8690J9340J8953l9203k1492N7155
$$ 50960 92600 75702 37137 18084 -4311 -14388 14302 33642 52595 13392 -8100 49055
15505D9055j6k6159K9847M9934J8642j7149k7980o5859l659M8294P1583j2047
$$ 49055 49039 22880 52727 102661 121303 104154 76174 10315 6656 54950 126533 114486
15493A14486n8654j2680k3681n908p941m4355j5044J341K9455j2005k1077M6814
$$ 114486 55832 43152 19471 13563 5622 -38733 -53777 -52436 -22981 -34986 -56063 -9249
15481i249j449o681j32J9522n2307n366P952N1726K2298l2759K6348l7803J0609
$$ -9249 -10698 -17379 -17511 2011 -50296 -55662 -47710 4016 26314 -6445 19903 -17900 -7291
15468g291k1456k1262l2419j5354M0669L4552P0903N8037K9468n9905p4947M0814
$$ -7291 -28747 -50009 -82428 -97782 -57113 -22561 48342 106379 135847 75942 995 41809
15456D1809j3768m8683K9318Q3620l8838m1678q514k0033k2348N1625K4558j8866
$$ 41809 28041 -20642 8676 92296 53458 11780 3266 -16767 -39115 12510 37068 18202
15444A8202p4381o4331M0223j1313j6045K7855M3400N530j9350N3902O0499o4008
$$ 18202 -56179 -120510 -80287 -91600 -107645 -79790 -36390 -30860 -50210 3692 64191 183
15432A83l0200K7271J3982K873o498P414N824L7191J130l3489r494N7957L5731
$$ 183 -30017 -2746 11236 14109 7611 15025 20849 58040 59170 25681 16187 74144 109875
15419A09875Q604n0242k2026o9007o3244J0553J5154R102K924J4977o873L6357
$$ 109875 118479 68237 46211 -22796 -86040 -75487 -60333 -51231 -48307 -33330 -40203 -3846
15407c846Q851p3202j9634K5272P512K1392K3861M1549K368k3207k9911m128M310
$$ -3846 5005 -68197 -87831 -62559 -55047 -33655 -9794 31755 34123 10916 -18995 -23123 -18813
15394a8813L4675l0976J154M1809J1048K5255K2964L5785m5170o7954k5580P052
$$ -18813 15862 -15114 -13960 27849 38897 64152 87116 122901 77731 9777 -15803 -8751
15382h751l63N4489J716Q873J1532m5305m3845k2357L8199O2960n2778o1508J1930
$$ -8751 -9114 45375 47091 55964 67496 22191 -21654 -44011 -5812 57148 4370 -57138 -45208
15369d5208L0117L0370n175j286l0512N8832K683k9024j8830n036J2322J3422
$$ -45208 -15091 15279 10104 8818 -21694 37138 39821 10797 -8033 -13069 -747 12675
15357A2675M8154j2890j1466K4386l858p0921r812M0734L5123o3931k3773j1931
$$ 12675 60829 47939 36473 60859 57001 -13920 -23732 17002 52125 -11806 -35579 -47510
15345d7510J5672M337L1775M2448L4465l666l1048O096J7781k0084n9705n7545
$$ -47510 -31838 -27501 4274 46722 81187 77521 46473 52569 70350 50266 -9439 -66984
15333f6984l1920K0920K2152m1906j1225N3482q911K5060J01102q452q0147m506
$$ -66984 -98904 -77984 -55832 -97738 -108963 -55481 -64392 -39332 61770 53318 -26829 -31335
15321c1335R121p37M1472j8784J3754O8599J0474l1582N970l2497k6701l1263
$$ -31335 -22214 -22951 18521 -263 13491 82090 92564 60982 66952 34455 7754 -23509
15309b3509k3747r8747m5325P3511K5898K9270J4000K764J861J559k1136m5390
$$ -23509 -47256 -146003 -191328 -117817 -91919 -62649 -48649 -45885 -44024 -42465 -63601 -108991
15297a08991q073P7667N9985J4255J4733l3898j3067K870Q309k3434R7390M0694
$$ -108991 -117064 -39397 20588 34843 49576 15678 2611 5481 13790 -9644 87746 128440
15285A28440k8540o5915l5959l6346P1822P3496n1111j12293j1697J3853K2404
$$ 128440 99900 33985 -1974 -38320 33502 106998 55887 -56406 -68103 -54250 -31846
15274c1846J0816R601K8164k5424J0153M5306m5010l848j5965n4037j4802L6292
$$ -31846 -21030 -11429 16735 -8689 1464 46770 1760 -2088 -18053 -72090 -86892 -50600
15262e0600O0864J8811J761q952k089k5840K3918l6271j5221P363j2203n1191
$$ -50600 10264 29075 30836 21884 19795 -6045 17873 -18398 -33619 -26256 -38459 -89650
15250h9650K2183O8974j5317l4019q936J3803O9794Q9562j04439m9896M1602N5953
$$ -89650 -67467 1507 -13810 -47829 -56765 -42962 26832 116394 11955 -37941 3661 59614
15238E9614N7335p2029j4688L2401M6202P078l1734r2880j7311k7664l193K489
$$ 59614 116949 44920 30232 62633 108835 115913 84179 -8701 -26012 -53676 -56869 -54380
15226e4380k6326n222O0529M6233L2220L4982n502k8395l4614j6154L1002m1223
$$ -54380 -80706 -85928 -25399 20834 53054 88036 82534 54139 19525 3371 34373 -6850
15214f850l1533L7297J8453l1727Q630N9224R5451j1033l6038L950m2148J8264
$$ -6850 -38383 -1086 17367 -14360 -5730 53494 148945 137912 101874 105824 63676 81940
15202H1940M3903J4971j4438l2471j3785r460k3209J8192J3155K2812J4049j6445
$$ 81940 125843 140814 126376 93905 80120 70660 47451 65643 78798 101610 115659 99214
15190I9214K4179j7139J2180L5134o455o3808k9472K981j811j0738m7282Q665
$$ 99214 123393 106254 118434 153568 147113 83305 53833 56814 55003 44265 -3017 5648
15178E648m8611J8264l526K982j0475K4969k476N1811N7871m738j2456k8287m8830
$$ 5648 -42963 -24699 -28225 -25243 -35718 -10749 -13225 38586 96457 91719 79263 50976 2146
15165B146j9275K2205m165L3180l528k6800k695n0165J3146J12924M3237Q61o2847
$$ 2146 -17129 5076 911 34091 30563 3763 1068 -49097 -35951 76973 120210 121071 58224
15152E8224l6161n2015r406M6158L0756l136k5375k6891l6356l4604K0424p559
$$ 58224 22063 -29952 -39358 6800 37556 34420 9045 -17846 -54202 -88806 -68382 -75941
15140g5941K2191p085J1641L2307M5558J4486M0242m8125m1461J9532N3919L9516
$$ -75941 -53750 -60835 -49194 -16887 28671 43157 83399 35274 -6187 13345 67264 106780
15128A06780k7785o7719k3476l1455L9375M4844K9094l4743r7553o1931Q3618
$$ 106780 78995 11276 -12200 -43655 -4280 40564 69658 34915 -62638 -124569 -40951
15117d0951P2869n495m9861P157N3858J8818J6603J667k6205l4006k3008J8761
$$ -40951 31918 26423 -23438 -16281 37577 56395 72998 74665 48460 14454 -8554 10207
15105A0207m4183k6098K646M5893J8629q069n9611m2958o4504k0080N6122J16522
$$ 10207 -33976 -60074 -57428 -11535 7094 -975 -60586 -103544 -168048 -188128 -132006 -15484
15093a5484M3626j8171k5979j3240m6840O6078Q0363R541k9775m3616l6140p7907
$$ -15484 28142 9971 -16008 -29248 -76088 -10010 70353 79894 50119 6503 -29637 -107544
15081a07544M6465K9208R314k8907J5743J948P91J227N939P735O8910m4761j24691
$$ -107544 -61079 -31871 -22557 -51464 -35721 -33773 -32982 -31755 -25816 -18081 50829 6068 -118623
15068a18623K5776P0979R2757k4369m9466k1608m0852k8303O4950L3308q902Q1
$$ -118623 -92847 -21868 70889 46520 -2946 -24554 -65406 -93709 -28759 4549 -4353 -4272
15056d272m1772L5821P271j9054J7092k3040m2812L7227P33m2336N578N3444k004
$$ -4272 -46044 -10223 -2952 -22006 -4914 -27954 -70766 -33539 -32806 -75142 -69564 -16120 -18124
15043a8124R4660O9185M6064N373m7911J0130j6134n6672q3747l5868N453P1482
$$ -18124 76536 145721 191785 197158 149247 159377 143243 86571 2824 -33044 -27591 43891
15031D3891O4481p3M1850l2680r4088K0584O137k5654J5260L927k7999M7149K4195
$$ 43891 108372 108299 150149 117469 23381 43965 50102 24448 39708 43635 15636 62785 86980
15018H6980J7915j8240n0268k1928m688J5338j1733p436l3672j8283J3634k7193
$$ 86980 104895 86655 36387 14459 9771 25109 13376 5940 -27732 -46015 -32381 -59574
15006e9574K1129m272j0671M5001m4715J5932L9323r135l8875L4524n797l488
$$ -59574 -38445 -42717 -53388 -8387 -53102 -37170 2153 -6982 -45857 -11333 -17130 -20618
14994b0618m151O144M5174J6816k0773K3800j5177m2166K065o940k931k0442j8958
$$ -20618 -24769 -18625 26549 43365 22592 46392 31215 -10951 -8886 -15826 -18757 -39199 -58157
14981e8157J0847j9545o399M5180M9662k3280O2144N807k2495N818k4385l7724
$$ -58157 -47310 -66855 -73254 -28074 21588 -1692 60452 66259 43764 49582 25197 -12527
14969a2527n818M1477j775l6092N8746K8443r212n5482o492N7289K1084j6242
$$ -12527 -18345 23132 21357 -14735 44011 72454 63242 7760 1268 58557 79641 63399
14957F3399j392j6855q138J8851L5500l9522l6240l7561j5624J3784l587J251
$$ 63399 62007 45152 37014 55865 91365 51843 15603 -21958 -37582 -23798 -27385 -26134
14945b6134J6183M565L234L2939l9416n3174n9401N2531O9452J8169k5705J118
$$ -26134 -9951 -5386 -2152 30787 -8629 -61803 -121204 -68673 779 18948 -6757 -5639
14933e639R385l380K0136N0668j5058j990l1103p6133K4156K8348M061k3238m2028
$$ -5639 3746 366 20502 71170 56112 54122 23019 -53114 -28958 -610 3451 -19787 -61815
14920f1815m5053M8260M3465k8953P276J1392J1234l599K4734j9851p3987L0127
$$ -61815 -106868 -58608 -15143 -44096 -36820 -25428 -14194 -17793 6941 -12910 -86897 -56770
14908e6770N0554N9780N0782k7221j9227j4432n87O898j9086k4785K3014K4249
$$ -56770 -6216 53564 104346 77125 57898 43466 42879 49777 30691 5906 28920 53169
14896E3169m3538J5465L0657P148j9190J986J2977k4819j7968o2639O860K2032
$$ 53169 9631 25096 55753 62901 43711 45697 58674 33855 15887 -46752 -39892 -17860
14884a7860J9332k8543l4271K0510K8073Q019P92q6594k9509N3959R4195M6126
$$ -17860 1472 -27071 -61342 -40832 -12759 -4740 -3948 -90542 -120051 -66092 28103 74229
14872G4229M820k7514n9742Q178J575j8252k0523J7529J2237J829P122j8730J6446
$$ 74229 79049 51535 -8207 -29 1546 -16706 -37229 -19700 -7463 -5634 1488 -17242 -796
14859g96q828O690J8759n8703k3904O0006M5569l0541J7985M708k7825K3982J1863
$$ -796 -9624 -2934 15825 -42878 -66782 -6776 38793 8252 26237 30945 3120 27102 38965
14846C8965p0667k8931J0702R465m3596K2656m3711p45N8497Q6139j1087K0556
$$ 38965 -31702 -60633 -49931 -40466 -84062 -61406 -105117 -105862 -47365 38774 27687 48243
14834D8243j7340L3137k5751k3395j4434j9706K2821J6016L8886m6829l7956m920
$$ 48243 30903 64040 38289 14894 460 -19246 3575 19591 58477 11648 -26308 -31228
14822c1228K472p212n0789n586Q3853J4342P1729R8071L1405l6144p3721n5775
$$ -31228 -28756 -35968 -86757 -92343 -8490 5852 77581 175652 207057 170913 97192 41417
14810D1417r740j0322K6401k6625n6659P888J3736K08k8268M6956L2278J5352
$$ 41417 31677 21355 47756 21131 -35528 -27640 -13904 -13696 -41964 4992 37270 52622
14798E2622J7298p2839K677l941m0876K5135L9374J5354J2971n149n289k099M2198
$$ 52622 69920 -2919 -242 -4183 -45059 -19924 19450 34804 47775 42626 37337 35238 77436
14785G7436k0975P340J7675p9409o5764R885k4665j4326Q2239J2793k5504k0426
$$ 77436 56461 63801 81476 2067 -63697 -53812 -78477 -92803 -10564 2229 -23275 -43701
14773d3701o178L2513M8463j4382o447l9724n949J9279J7505j2633K770j6494
$$ -43701 -49879 -17366 31097 16715 10268 -29456 -35405 -16126 1379 -11254 -8484 -24978
14761b4978R4619L5465r243N6887N9102l3916k9737q543L1002j3768l6794r1527
$$ -24978 69641 105106 95863 152750 211852 177936 148199 139656 170658 156890 120096 28569
14749B8569k2322K943O675k225M1604r16l9297j8039m6912J3673P4996k618Q844
$$ 28569 6247 9190 15865 13640 55244 54328 15031 -3008 -49920 -36247 38749 36131 44975
14736D4975J9988l0110n6077k5428m5028j6160K6103K8884j4572M0090k0421J6218
$$ 44975 64963 34853 -21224 -46652 -91680 -107840 -81737 -52853 -67425 -27335 -47756 -31538
14724c1538N5269m9021l5514l8784J4829P2453J8529k8730l0109M8577p104m4110
$$ -31538 23731 -25290 -60804 -99588 -84759 -12306 6223 -22507 -52616 -4039 -11143 -55253
14712e5253L6294J9801k607r747L1997K6093k1914N2853N765j2884l4211j8744
$$ -55253 -18959 842 -1765 -11512 20485 46578 24664 77517 83282 70398 36187 17443
14700A7443m2312j166k2844j7195l7503M5056j5205J900K1288J0241J7695L3344
$$ 17443 -24869 -26035 -48879 -66074 -103577 -58521 -73726 -71826 -50538 -40297 -22602 10742
14688A0742k5132R430K7890J6061l0076J2673j9031l5313k6886l6260l0069j2181
$$ 10742 -14390 -4960 22930 38991 8915 21588 2557 -32756 -59642 -95902 -125971 -138152
14676a38152J1492R503L2698K7489n9259k3427Q897M9827j005M5177Q0219J8971
$$ -138152 -126660 -117157 -84459 -56970 -116229 -139656 -130759 -80932 -81937 -36760 43459 62430
14664F2430n7324M7171J1444m1020m2744J6564m2483N514P5579M6364j0440m001
$$ 62430 5106 52277 63721 22701 -20043 -3479 -45962 -40448 35131 81495 71055 67054
14652F7054j4139L8450P1205j04273m1723Q7951K1172j0934L9621j730j03493
$$ 67054 52915 91365 162570 58297 16574 104525 125697 114763 154384 152654 49161
14641D9161o7456o6722J4308M6033R829J0662L2294J0283m0085P3422K3155J8203
$$ 49161 -18295 -85017 -70709 -24676 -14847 -4185 28109 38392 -1693 71729 94884 113087
14629A13087j7724n8860m1642O4510J7452m4725l3457n683l9630J824K2570K8373
$$ 113087 95363 36503 -5139 59371 76823 32098 -1359 -7042 -46672 -44848 -22278 6095
14617F095J7277J7444j1245l3027j8811M3440K5319J3730O615l1782k5926R400
$$ 6095 23372 40816 29571 -3456 -22267 21173 46492 60222 66837 35055 9129 18529
14605A8529K4335m3893j1460L5461K9184l661N579N309m6771k1647N3276L3130
$$ 18529 42864 -1029 -12489 22972 52156 48495 54074 59383 12612 -9035 44241 77371
14593G7371j2023m2510l516N2560O1612k5351l5283L2061l5359k1605j3037j6925
$$ 77371 65348 22838 19322 71882 133494 108143 72860 104921 69562 47957 34920 17995
14581A7995k924L8248n0480J7818J5192J0006K2736K3191L9711J5614l6431l4718
$$ 17995 15071 53319 2839 20657 35849 45855 68591 91782 131493 147107 110676 75958
14569G5958q802l7196K347q587q232M6745l3243m9868J1229n0881j0506L2958
$$ 75958 67156 29960 32307 23720 15488 62233 28990 -20878 -9649 -60530 -71036 -38078
14557c8078Q781M1644L0861K8379l0958j9825M9709J7595j7497m7389J0382J9595
$$ -38078 -29297 12347 43208 71587 40629 20804 70513 88108 70611 23222 33604 53199
14545E3199o6313K3961P548J4481O089p417K5443N1557o8039r372l8829l3689
$$ 53199 -13114 10847 18395 32876 38965 31548 56991 108548 40509 31137 -7692 -41381
14533d1381O291L5703K9910J2742m312m7739p3729k3339M2648M3686M1804J0810
$$ -41381 -35090 613 30523 43265 38953 -8786 -82515 -105854 -63206 -19520 22284 33094
14521C3094m4375l8698Q2737k7991l3716K3469j4152N0503K1057K5274o692n9521
$$ 33094 -11281 -49979 32758 4767 -28949 -5480 -19632 30871 51928 77202 70510 10989
14509A0989k5268j1798k1012m9896M9539O2386K309l1228L0933P150k4125M4820
$$ 10989 -14279 -26077 -47089 -96985 -47446 14940 17249 -13979 16954 24104 -21 44799
14497D4799M5031n1391k0760K2551k1465K101j7787j9471j4737K3259J9649M7798
$$ 44799 89830 38439 17679 40230 18765 20866 3079 -16392 -31129 -7870 11779 59577
14485E9577P4843R477j49j7466p6329K2717M5472q3098j9023L3466l6333q0530
$$ 59577 134420 143897 143748 126282 49953 72670 118142 35044 16021 49487 13154 -67376
14473f7376q394J8701R8208M2711k0951m0293Q337J0434k9070K0841P332M6847
$$ -67376 -75770 -57069 41139 83850 62899 22606 30943 41377 12307 33148 40480 87327
14461H7327k3065l1254K1105J5538l1079l6063m4664N1538k7309m4289N305j1175
$$ 87327 64262 33008 54113 69651 38572 2509 -42155 9383 -17926 -62215 -56910 -68085
14449f8085L2602j7854q277K1032K5080N2750K2305m6695l2629N3928j5524k8078
$$ -68085 -35483 -53337 -61614 -40582 -15502 37248 59553 12858 -19771 34157 18633 -9445
14437i445K3124L9108K3596k0085l597J1134l5108r468N2674o10K5147N0460Q3705
$$ -9445 13679 52787 76383 56298 52701 63835 28727 19259 71933 71323 96470 146930 230635
14424B30635O717o196q7139q8434j8482k0151j7968L3236M9228L8060J308m7938
$$ 230635 237352 231156 144017 55583 37101 16950 -1018 32218 81446 119506 120814 72876
14412G2876j6587p3126o001M9312j659L5623j0193l2311J0668J7343j9027J9351
$$ 72876 56289 -16837 -22838 26474 24815 60438 50245 17934 28602 45945 26918 46269
14400D6269k0313n9683P0470L2987L0776k889n7404m3652m5814l1784P0137N7251
$$ 46269 25956 -33727 36743 69730 100506 97617 40213 -3439 -49253 -81037 -10900 46351
14388D6351K9906J3725k7113j5404L9571m1521n7114K03K5335m862L3177j599
$$ 46351 76257 89982 62869 47465 87036 45515 -11599 -11396 13939 9077 42254 40655
14376D0655k8754L7180L0188j6065p8080J0231l3842n5288K8112O3178Q048l5465
$$ 40655 11901 49081 79269 63204 -14876 -4645 -38487 -93775 -65663 -2485 5563 -29902
14364b9902n342K6745O8272O400m2098J4685M7614K2316K6610m7040J6623J9475
$$ -29902 -35244 -8499 59773 66173 24075 38760 86374 108690 135300 88260 104883 124358
14352A24358l6068o4706l3678J5787l3223o633J4416j1773M089J7748K6934j3567
$$ 124358 88290 23584 -10094 5693 -27530 -34163 -19747 -31520 -27431 -9683 17251 3684
14340C684l0969l3712m7036P879K6540M2733k1536N0468M4125k3801K9985l406
$$ 3684 -27285 -60997 -108033 -100154 -73614 -30881 -52417 -1949 42176 18375 48360 44954
14328D4954l2152j4093l65m9433j1667m363M5199P490k2386J7135N1661J7831
$$ 44954 12802 -1291 -1656 -51089 -62756 -67119 -21920 -14430 -36816 -19681 31980 49811
14316D9811N922P130J6702N07N2795k9952o2881M980K3888r282j426N4029n6139
$$ 49811 55733 62863 79565 80072 132867 102915 40034 45014 68902 59620 58194 112223 56084
14303E6084n3461l1487L7143N2575M6856j6579j2525q256q777k3731M5975L3891
$$ 56084 2623 -28864 8279 60854 107710 91131 78606 70350 61573 37842 83817 117708
14291A17708q2323p4567O220N8642n577O66J7863o3750N579R3098K3942m1382
$$ 117708 35385 -39182 -32962 25680 20103 20769 38632 -25118 -19539 73559 97501 56119
14279E6119J1677r530m5005O064K5465L6665N4429P403R9696J55179J71782J92785
$$ 56119 67796 58266 13261 19325 44790 81455 135884 143287 242983 398162 569944 762729
14267G62729J98658R8757N5120q1034j54203j83174k40603k02517p2348o867J1403
$$ 762729 961387 1060144 1115264 1034230 880027 696853 456250 253733 181385 174518 185921
14256A85921K4382J3024n3955m5159q0877m4015L7961P7588J4137m5464l6833
$$ 185921 210303 223327 169372 124213 43336 -679 37282 114870 129007 83543 46710
14245D6710J7137j4674j017P840k3849m657l173k0978Q472O8987N1444L1661n1743
$$ 46710 63847 49173 48156 55996 32147 27490 24317 3339 11811 80798 132242 163903 112160
14232A12160k269k2211j9404k2908R527m879J1897M0584j3576j1239j4041l2847
$$ 112160 109891 87680 68276 45368 54895 50016 61913 102497 88921 77682 63641 30794
14220C0794n8343J146J5460p2108k4994Q2711K9652L4670k4185m9343L561M2918
$$ 30794 -27549 -26403 -10943 -83051 -108045 -25334 4318 38988 14803 -34540 -30979 11939
14208A1939J2170l4920k7648K9213N1377K6249K5262J1499l2483l7877k5883l8426
$$ 11939 24109 -10811 -38459 -9246 42131 68380 93642 105141 72658 34781 8898 -29528
14196b9528R400J4553P63l059M7432O435L1245k0339m4977n3520M0646j9060J4011
$$ -29528 -20128 -5575 -4812 -7871 39561 45996 77241 56902 11925 -41595 -949 -20009 -5998
14183e998K6420j3448p531k5398M0601M0519j3667l2124L4075M2832p861k3222
$$ -5998 20422 6974 -557 -25955 14646 55165 41498 9374 43449 86281 78420 55198
14171E5198J4506M4611l6762k2657n4978n4288m620M3721k48N1446N2579J0727
$$ 55198 69704 114315 77553 54896 -82 -54370 -58990 -15269 -15517 35929 88508 99235
14159I9235l9324j8275M072P226L2678m2004k2011L1609J3449J657l9239j33M0665
$$ 99235 59911 41636 45708 52934 85612 43608 21597 53206 66655 68312 29073 28940 69605
14146F9605J9927M7932J153k6327m7835n0671l8141k1037K4136O4530j37j2365
$$ 69605 89532 137464 138617 112290 64455 13784 -24357 -45394 -21258 43272 43135 30770
14134C0770o047L079o583K225m4330l3631J0622K1528Q3746J3497k6938k7645
$$ 30770 24723 27802 21219 23444 -20886 -54517 -43895 -22367 61379 74876 47938 20293
14122B0293m6165Q1O3772p632l7417K3219N106k637l1928n127M1485j8801l4589
$$ 20293 -25872 -25791 37981 30349 -7068 16151 21257 18620 -13308 -18435 23050 4249 -30340
14109c0340L3858M6735K5964J1657J0887n3894j9095o661k962J9817O9495K9181
$$ -30340 3518 50253 76217 87874 98761 44867 25772 19111 16149 35966 105461 134642
14097A34642L437K6520k6028p1500l526N6972L7801j6385j9390Q875k7892l7785
$$ 134642 138079 164599 138571 67071 63545 120517 158318 141933 122543 131418 103526 65741
14085F5741K1731j5917k2101P8744J9940n0051J4748l7120R252j1231l3077j4676
$$ 65741 87472 71555 49454 128198 148138 98087 112835 75715 84967 73736 40659 25983
14073B5983o8145m0610O2306J04499L516p7504j0703L4830p119k899J7943J198
$$ 25983 -42162 -82772 -20466 84033 87549 10045 -658 34172 27053 24154 42097 43295
14061D3295R790m358L0934J3604L4936M7336J9021p748p884r604k2246k1956k0196
$$ 43295 53085 48727 79661 93265 128201 175537 194558 186810 178926 169322 147076 125120 104924
14048A04924j4297Q251L8397j2153L5557K5179M3547j4677k3629J7596L7757k5167
$$ 104924 90627 98878 137275 125122 160679 185858 229405 214728 191099 208695 246452 221285
14036B21285m9570n8297J4420m792q0685p9316j9895J1660K9528P4825M5411k9834
$$ 221285 171715 113418 127838 123046 42361 -36955 -56850 -45190 -15662 59163 104574 74740
14024G4740n7509O43J8022j2805l996M7471M546J6442r526j645j4857n6938l7260
$$ 74740 17231 17874 35896 23091 19095 66566 71112 87554 78028 76383 61526 4588 -32672
14011c2672M3720R7954L6947O418k3678n6737m9376K9072j2486M5602M383j2393
$$ -32672 11048 109002 145949 152367 128689 71952 22576 51648 39162 84764 89147 76754
13999G6754K4260N6276q4358n7570L3485L2997j3804j5653J3150m2129l8628L0940
$$ 76754 101014 157290 72932 15362 48847 81844 68040 52387 65537 23408 -15220 15720
13987A5720N4806L0850R646n1484J1542k920n1350p792J5479O109K6034k9280
$$ 15720 70526 101376 111022 59538 71080 68160 16810 9018 24497 30606 56640 27360
13975B7360l3921M3992J7811M1472J2487P5979J6955l6439O0358K8402o4314l6932
$$ 27360 -6561 37431 55242 96714 109201 185180 202135 165696 226054 254456 190142 153210
13963A53210k237M2406j3713j02499k9301o1524K316L2060n995N961K8152l0099
$$ 153210 150973 193379 179666 77167 47866 -13658 -11342 20718 14723 20684 48836 18737
13951A8737l7154K3616Q1722N1608L6876l2359j6851P55J5887J2828N4694K8341
$$ 18737 -18417 5199 86921 138529 175405 143046 126195 126950 142837 155665 210359 238700
13939B38700M4448j493o4648r4014k3365p919L0986o644j0755L4671j5490M8878
$$ 238700 283148 281655 217007 122993 99628 91709 122695 116051 105296 139967 124477 173355
13927A73355L3080J9691j2741m3033k6284K1046L4144J1604l0340o1806l7466
$$ 173355 206435 226126 213385 170352 144068 165114 199258 210862 180522 118716 81250
13916H1250Q894j7085j3201k3772J7124j0639L282j1623j9560P1210n3133p8954
$$ 81250 90144 73059 59858 36086 53210 42571 45853 34230 14670 85880 32747 -46207
13904d6207R876J0961M1810K4560j6334K3930M6367J0596k5197j717K0541M2324
$$ -46207 -36331 -25370 16440 41000 24666 48596 94963 105559 80362 78645 99186 141510
13892A41510M5122l8607m3560n0438J9680L6039K5525K8687k2567j0677J0756
$$ 141510 186632 148025 104465 54027 73707 109746 135271 163958 141391 130714 141470
13881A41470K7382O7327j7479k531N7964O3751j0457l0741r178m0293l2838l521
$$ 141470 168852 236179 218700 216169 274133 337884 327427 296686 287508 247215 214377 210856
13869B10856l3819L6902j8431q145L1826j4286j4461K9404K5799N7269J1840j6713
$$ 210856 177037 213939 195508 187363 219189 204903 190442 219846 245645 302914 314754 298041
13857B98041J8017j9001k9889K8102M3532R203j5505L9783K9958J3508p739L8422
$$ 298041 316058 297057 267168 295270 338802 348005 332500 372283 402241 415749 408010 446432
13845D46432K1566j0621K3602M5556J4406M8771K1877L5282L37K8497l2280j7136
$$ 446432 467998 457377 480979 526535 540941 589712 611589 646871 647208 675705 643425 626289
13833F26289j9136k1917K4422M6487P2915L1791J8255N4213j1022P9094N7912
$$ 626289 607153 585236 609658 656145 729060 760851 779106 833319 822297 901391 959303
13822I59303K0925R2372J40753P9105M6064O6887O6081J6608N1570N9016P9401
$$ 959303 980228 1072600 1213353 1292458 1338522 1405409 1471490 1488098 1539668 1598684 1678085
13811A678085K06800J97897K06451K84873L20939M59206O12160P59448P53132
$$ 1678085 1884885 2082782 2289233 2574106 2895045 3354251 3966411 4725859 5478991
13802E478991O38422N60689M88200O42491P38601Q68744J247512J838286K636918
$$ 5478991 6117413 6678102 7166302 7808793 8547394 9416138 10663650 12501936 15138854
13793A5138854L857744O208694J0590945J8476543L0156664M0985001M4949187
$$ 15138854 18996598 25205292 35796237 54272780 84429444 125414445 170363632
13786A70363632L6529118J7352103o532341k7327721m0554123m1823191l4151201
$$ 170363632 206892750 224244853 217712512 190384791 149830668 108007477 73856276
13779G3856276k3358358j4568631r055590n750235l791098k683667j981867j502760
$$ 73856276 50497918 35929287 26873697 21123462 17332364 14648697 12666830 11164070
13771A1164070j225780j015384r30836q44442q32557r32699q99153p39761o09012
$$ 11164070 9938290 8922906 7992070 7147628 6315071 5382372 4483219 3743458 3134446
13762C134446m34955m01099l37268k34308j12579j18260j03938j62708j73786
$$ 3134446 2699491 2298392 1961124 1726816 1614237 1495977 1392039 1229331 1055545
13753A055545j92591p6960l7315j18026J1090j3294p5497k683j5852Q889r4777
$$ 1055545 862954 785994 748679 630653 641743 628449 552952 550269 534417 543306 448529
13742D48529J5886J2010J327l6011J4172J8064k2651k7754o4210R910k2424j24968
$$ 448529 464415 476425 477752 441741 455913 473977 451326 423572 359362 369272 346848 221880
13730B21880o9512l288O2052M6505N7055K344O897M362j1447l7872j04604k8626
$$ 221880 152368 149080 211132 257637 314692 317036 323933 328295 316848 278976 174372 145746
13718A45746o2535o2134r830K6498K2509l4735m7838L2008J6365n5046o439P650
$$ 145746 83211 21077 11247 37745 60254 25519 -22319 9689 26054 -28992 -35431 -27781
13706b7781L9595O0895M306n1658M2247n562L833J1016o766k8103L791M7315l6856
$$ -27781 11814 72709 77015 25357 67604 62042 65875 76891 70125 42022 45813 93128 56272
13693E6272k8522K0129J8789M8513l7273j6954m6113o0056m4587l5577L9045O9867
$$ 56272 27750 47879 66668 115181 77908 60954 14841 -45215 -89802 -125379 -86334 -16467
13681a6467K9252l9041J9339L2940j5508r111R6467J4850M314k1484j6784l7675
$$ -16467 12785 -26256 -6917 26023 10515 1404 97871 112721 117035 95551 78767 41092
13669D1092l2113N9062J7415l2565k4561R6898q560p7449n708M1632J7427N3345
$$ 41092 8979 68041 85456 52891 28330 125228 116668 39219 33511 75143 92570 145915
13657A45915J0568n6077n7597l7716r260M699m2391K3264L2854j5672l7672K5361
$$ 145915 156483 100406 42809 5093 -4167 532 -41859 -18595 14259 -1413 -39085 -13724
13645a3724K991m9960L2602Q8801L9671j2766p068o249J3178k7956o1669o8011
$$ -13724 -10733 -60693 -28091 60710 100381 87615 80547 74298 87476 59520 -2149 -70160
13633g0160K3777L3402N4753J04279j1049q7127k2703K9436k3076o0848k8179
$$ -70160 -46383 -12981 41772 146051 135002 47875 25172 54608 31532 -29316 -57495
13622e7495L6650k7693J1183j8365P134j9532n0143K8287O318L4008Q0065J2613
$$ -57495 -20845 -48538 -37355 -55720 -48586 -68118 -118261 -89974 -83656 -49648 30417 43030
13610D3030l5930j41k051J4286o4674j0130k9543l0230Q6151j7786k6786l0024
$$ 43030 7100 6959 4908 19194 -45480 -55610 -85153 -115383 -29232 -47018 -73804 -103828
13598a03828m3263L7666P8212K8439L2271P7517j4495n3170M1176j2314J1050
$$ -103828 -147091 -109425 -31213 -2774 29497 107014 92519 39349 80525 68211 79261
13587G9261k0090n0824k4600K1504Q044J82q251n473k7864N630Q52k4193k207
$$ 79261 59171 8347 -16253 5251 13295 13477 5226 -247 -28111 -22481 -21629 -45822 -48029
13574d8029k3206J9102l2134k3163J06017P2921L570m5085j6285m187l5465L1659
$$ -48029 -71235 -52133 -84267 -107430 -1413 71508 75078 29993 13708 9521 -25944 5715
13562E715P0050k1033j8754n8246P10m3997R112k2846K7843l4476O0222N949j0309
$$ 5715 75765 54732 35978 -22268 -21558 -65555 -56443 -79289 -51446 -85922 -25700 -19751 -30060
13549c0060M888J1188j1113J1370j8855n7695r296L2389L5432j6592l235L525
$$ -30060 -25172 -13984 -25097 -13727 -32582 -90277 -99573 -67184 -31752 -48344 -51579 -48054
13537d8054n2076K7590N1909M1937Q343o103P770l7568P759j1958Q059K9492m4605
$$ -48054 -100130 -72540 -20631 21306 29649 23546 31316 -6252 1507 -10451 -2392 27100 -17505
13524a7505j0094j3061k6281K0797K5534j2267P496j9341K436J7221m068j8450
$$ -17505 -27599 -40660 -66941 -46144 -20610 -32877 -25381 -44722 -42286 -25065 -29133 -47583
13512d7583M1727O513l2364R680j2652J1306J4573Q970N1425M8477j8151q6191
$$ -47583 -5856 657 -31707 -22027 -34679 -23373 -8800 170 51595 100072 81921 -4270
13500d270m7111k1127N7799j8333o1682O661O6258k038o3334p6001P2154O8928
$$ -4270 -51381 -72508 -14709 -33042 -94724 -88063 -21805 -23843 -87177 -163178 -91024 -22096
13488b2096O3524Q0709M0858m2047r1926j7696k3067k6484K1120j8433q836N3476
$$ -22096 41428 122137 162995 120948 29022 11326 -11741 -38225 -17105 -35538 -44374 9102
13476I102J7620L8819l4029J3940k9746l5588K3447M5886l2838l2516j1917o812
$$ 9102 26722 65541 31512 45452 15706 -19882 3565 49451 16613 -15903 -27820 -34632
13464c4632k3515m765J3470r603k7325K0497N5391j0284k1286k9509K4736O4155
$$ -34632 -58147 -62912 -49442 -59045 -86370 -65873 -10482 -20766 -42052 -71561 -46825 17330
13452A7330M2220j2276J5070O830O215R559o6002l6499n983J3967K1393N644L662
$$ 17330 59550 47274 62344 69174 75389 84948 18946 -17553 -23536 -9569 11824 17468 21130
13439B1130n988j3735m668k3357m0880k4739J6517N073K5751P0909O392o8364
$$ 21130 15142 1407 -3261 -26618 -67498 -92237 -75720 -70647 -44896 26013 32405 -35959
13427c5959q697K9774L4229n0925K6862Q4846M4098o6775l5457j2767l5132k387
$$ -35959 -44656 -14882 19347 -31578 -4716 80130 124228 57453 21996 9229 -25903 -28290
13415b8290J3336P091J6358k183J5938J2203J005l1130L664l2680n650k115l9618
$$ -28290 -14954 -7863 8495 6312 22250 34453 35458 4328 7992 -24688 -30338 -32453 -72071
13402g2071K0126Q5642K3089p3490p035k6804l9426J6209r77K6812K2883J9522
$$ -72071 -51945 33697 56786 -16704 -23739 -50543 -89969 -73760 -74737 -47925 -25042 -5520
13390e520J3767n8596K2508K3459m3207j6900J2323P575J6064K4924M8152r835
$$ -5520 8247 -50349 -27841 -4382 -47589 -64489 -52166 -44591 -28527 -3603 44549 34714
13378C4714j3722M83M8569j5855n3520k0959n8688k4543M6733M5758k4793j1841
$$ 34714 20992 21475 70044 54189 669 -20290 -78978 -103521 -56788 -11030 -35823 -47664
13366d7664L9116K5002N5181m1140k7478p0681K3199n131j1597k1820L716P3024
$$ -47664 -8548 16454 71635 30495 3017 -67664 -44465 -49596 -61193 -83013 -79297 -6273
13354f273L4527O503P796j4429k4960R097L5065l3364j5571j507P3494n70o3907
$$ -6273 28254 34757 42553 28124 3164 12261 47326 13962 -1609 -3116 70378 69808 5901
13341E901o042K4718N542K3135o2053m687M1109m2286L5009k1363j1923M7485
$$ 5901 -141 24577 30119 53254 -8799 -13486 27623 -14663 20346 -1017 -12940 34545
13329C4545l0900L965m40j0316J4240J4001M9552p551K3549M7794p01j9298P6422
$$ 34545 3645 7610 7170 -3146 11094 25095 74647 67096 90645 138439 137738 118440 194862
13316A94862k4674o2540m0134M101l7306j43L3768M1270M0438K45j3468n248P2705
$$ 194862 170188 107648 67514 71615 34309 34166 67934 109204 149642 149887 136419 131171 203876
13303B03876Q8969O8744J41137K01153K39228K53873M1055j02632j47024k25841
$$ 203876 292845 361589 502726 703879 943107 1196980 1238035 1135403 988379 762538
13293G62538k15266j74029j11615m4069n0157r0949j4787j4293K5540K935J3474
$$ 762538 547272 373243 261628 217559 167402 76453 61666 47373 72913 75848 89322
13282H9322P884O746n5326q6819l5332P2731M0591j8181k6045n2570M251p548
$$ 89322 97206 103952 48626 -38193 -73525 -794 39797 21616 -4429 -56999 -52748 -60296
13270f0296q967M2686q241p1423J3130K0089k1183K1657L7685K5692K2202l8153
$$ -60296 -69263 -26577 -34818 -106241 -93111 -73022 -94205 -72548 -34863 -9171 13031 -25122
13258b5122m2314k9510L015J7719Q1883l4762k7023n21l2050O1686M4204m49r409
$$ -25122 -67436 -96946 -93931 -76212 5671 -29091 -56114 -56635 -88685 -26999 17205 16756 7347
13245G347J5089j0921m8295J3721Q92l3622j2297M9480j0664k1935l7821K4466
$$ 7347 22436 11515 -36780 -23059 -22167 -55789 -68086 -18606 -29270 -51205 -89026 -64560
13233f4560Q540o678O8641P8083j972P268q90M32r046k5289m282l8281J6861m8257
$$ -64560 -56020 -62698 5943 84026 82054 89322 88432 88864 79818 54529 50247 11966 28827 -19430
13219a9430q145k5483l0358R7360M0981J2556J7852J459m7922m8874j5389L0614
$$ -19430 -27575 -53058 -83416 13944 54925 67481 85333 86792 38870 -10004 -25393 5221
13207E221J4806N7542K6394r11k8949J3225K2507m0601k0215L4370k1417J9387
$$ 5221 20027 77569 103963 103052 74103 87328 109835 69234 49019 83389 61972 81359
13195H1359L5719J7394k4491m1822o2732q651O2341Q22m7760k6081m472r312k3195
$$ 81359 117078 134472 109981 68159 5427 -3224 59117 59939 12179 -13902 -18374 -27686 -50881
13182e0881n095R427n7179j92L7997J3366j6404j6805O7135L7064q823M4914L9579
$$ -50881 -55976 -46549 -103728 -103920 -65923 -52557 -68961 -85766 -18631 18433 9610 54524 94103
13169I4103q222K483o7320K8125K2136J05830Q8473J20459J46347k7035r4443
$$ 94103 85881 88364 21044 49169 71305 177135 265608 386067 532414 505379 410936
13158D10936p6079q6578j04047q9728j3597j3886q448K2184J6830N3960k2359
$$ 410936 334857 248279 144232 54504 40907 27021 18573 40757 57587 111547 89188
13147H9188J8339R888n4253n4890m1676k8075j7843L1891l1910K6970M0956K867
$$ 89188 107527 117415 63162 8272 -33404 -61479 -79322 -47431 -79341 -52371 -11415 -8548
13135h548lM9587K4025l680n0408K8502L4168k4728M2230Q137q0494m7395N5552
$$ -8548 -8551 41036 65061 61381 10973 39475 73643 48915 91145 99282 18788 -28607 26945
13122B6945O0738j497n2694J2902Q2456J16055J33980Q2839k9679j09311j09175
$$ 26945 87683 86186 33492 46394 128850 244905 378885 461724 432045 322734 213559
13111B13559q5043j00583n4954K8648J9165J1774O7499o3874j04652l1250L246
$$ 213559 128516 27933 -27021 1627 20792 32566 100065 36191 -68461 -99711 -96465
13100i6465L6508j4640J2965K2645k9230J9779k2362Q3553Q0302l0117j2043J7443
$$ -96465 -59957 -74597 -61632 -38987 -68217 -48438 -70800 12753 93055 62938 50895 68338
13088F8338k9943p1263J6598J0844j3692k2449k9201N6416O6519m2495k8241L0902
$$ 68338 38395 -32868 -16270 -5426 -19118 -41567 -70768 -14352 52167 9672 -18569 12333
13076A2333n442l0886p347J5332O9530Q4569K1761M0881l4106j02968p8151N5692
$$ 12333 6891 -23995 -31342 -16010 53520 138089 159850 200731 166625 63657 -14494 41198
13064D1198L4158J165j9148M3248o2809k3954r0293k0024K9432N2483O164K4642
$$ 41198 75356 76521 57373 100621 37812 13858 -76435 -96459 -67027 -14544 -8380 16262
13052A6262K6476N774l577m1315K078l582P2411K2071l9425P547j3356k4352m0118
$$ 16262 42738 48512 44935 3620 5698 2116 74527 96598 57173 64720 51364 27012 -13106
13039a3106J4024K3398k3592j6751K1129J3916J977K0793k476m08r224l4567m5146
$$ -13106 918 24316 724 -16027 5102 19018 20995 41788 39312 38904 29680 -4887 -50033
13026e0033o0471o7751L8238K1673K5209P0934J0521L0816l185j2566O127j0158
$$ -50033 -110504 -178255 -140017 -118344 -93135 -22201 -11680 19136 15951 3385 9512 -646
13014f46Q095k2599L0959L1099k3631l9262r66M575J5871J7990M1373j8626m1877
$$ -646 7449 -15150 15809 46908 23277 -15985 -16951 -12376 3495 21485 62858 44232 2355
13001B355n8541R69k7276K5539P9616L5106k3977k5421J6951J4182M6228K9595
$$ 2355 -56186 -55217 -82493 -56954 22662 57768 33791 8370 25321 39503 85731 115326
12989A15326l0705m6743L3989K7810o1136j4106j0554k5024o2386M8704L9799
$$ 115326 84621 37878 71867 99677 38541 24435 13881 -11143 -73529 -24825 14974
12978A4974j4305k9624L0010L658O1205q8066p0666q313J6199M1150Q8748J0771
$$ 14974 669 -28955 1055 4713 65918 -22148 -92814 -101127 -84928 -43778 44970 55741
12966E5741n253o6021q493O0660M4270K4929o5420o4945J27k6534L0580K5911
$$ 55741 50488 -15533 -24026 36634 80904 105833 40413 -24532 -24405 -50939 -20359 5552
12954E552m9113n1288J8738M2483L6103M3495l0279k3816K9197n394k5837k8170
$$ 5552 -43561 -94849 -76111 -33628 2475 45970 15691 -8125 21072 15678 -10159 -38329
12942c8329K4328J788j6329K9853L083m3748m9911J1433k5441J6943j4252L4173
$$ -38329 -14001 -12213 -28542 1311 4394 -39354 -89265 -77832 -103273 -86330 -100582 -66409
12930f6409k9826K7818M6550l2901K0419J1089p378p260K0423O521K2264k527
$$ -66409 -96235 -68417 -21867 -54768 -34349 -23260 -30638 -37898 -17475 -10954 11310 8783
12918H783M3887M578j1516K8813l6868o00o9450R334j3355O1654j0845p264N1434
$$ 8783 52670 57248 45732 74545 37677 37077 -32373 -23039 -36394 25260 14415 7151 58585
12905E8585j6307q7904j00741J5352K9247l5503j9292L8966k814M153K5656M9996
$$ 58585 42278 -45626 -146367 -131015 -101768 -137271 -156563 -117597 -120411 -116258 -90602 -40606
12893d0606J3833l9712o5934K7381P9463R8218L679m0345P7312o7275m3188j1988
$$ -40606 -26773 -66485 -132419 -105038 -25575 72643 76322 35977 113289 46014 2826 -9162
12881i162L3938L0822q465K3113J5555q3887m4963J7287k7249J4525k4541j7197
$$ -9162 24776 55598 47133 70246 85801 1914 -43049 -25762 -53011 -38486 -63027 -80224
12869h0224L6131M9344k3412N0042L4115J6802o2634j8239m8902j1427M6931n994
$$ -80224 -44093 5251 -18161 31881 65996 82798 20164 1925 -46977 -58404 -11473 -17467
12857a7467m3751L0399L2176M5985j6313J3182L9870j85k9768k4887J7361p0464
$$ -17467 -61218 -30819 1357 47342 31029 44211 84081 83896 54128 29241 46602 -23862
12845b3862p344P4594m7234p2041m0734O626M6026N2438o1249o0660L7054J2595
$$ -23862 -31206 43388 -3846 -75887 -116621 -109995 -63969 -11531 -72780 -133440 -96386 -83791
12833h3791N6103K4916k7647l8861L3593j9455n2702M0546K735J4927N6353M9134
$$ -83791 -27688 -2772 -30419 -69280 -35687 -55142 -107844 -67298 -64563 -49636 6717 55851
12821E5851M8431k0919m581L6500J1692p431m1776l3273l08o1791l1915Q878K7200
$$ 55851 104282 83363 78782 115282 126974 119543 77767 44494 44186 -17605 -49520 -40642 -13442
12808a3442Q4405K7445n5216n3132K2181O893p8485m8272R946M5061k5097j7436
$$ -13442 70963 98408 43192 -9940 12241 19134 -59351 -107623 -97677 -52616 -77713 -95149
12796i5149L5009J717j4329O1130Q2211m2436p4347l0006O1303K4754J2073K3575
$$ -95149 -60140 -58423 -72752 -11622 70589 28153 -46194 -76200 -14897 9857 21930 45505
12784D5505l3029n473K5814k4633m1727n4989J8131R5277n91j9264M9281j8464
$$ 45505 12476 7003 32817 8184 -33543 -88532 -70401 24876 24285 5021 54302 35838
12772C5838J2598q44k0006n4989l2455R961N2717K4628L946k2575J3039j5675
$$ 35838 48436 47592 27586 -27403 -59858 -49897 2820 27448 31394 8819 21858 6183
12760F183j5752o6403j2879P284j1075J3145J8614O8742L542j990k8388P759P186
$$ 6183 -9569 -75972 -88851 -81567 -92642 -79497 -60883 7859 11401 9411 -18977 -11218 -4032
12747d032k8665j6862L9374p141k0018K0672m0960j766K8205P5615l9762l1781
$$ -4032 -32697 -49559 -10185 -17326 -37344 -16672 -57632 -59398 -31193 44422 4660 -27121
12735b7121k0147P374m130J3145J5409J5801J2253J8962L6808N587l2212q3560
$$ -27121 -47268 -39894 -44024 -30879 -15470 331 12584 31546 68354 73941 41729 -41831
12723d1831J8086M3618K3274k1617n4605k5995q169M8894Q2735J3813m9368k4779
$$ -41831 -23745 19873 43147 21530 -33075 -59070 -67239 -18345 64390 78203 28835 4056
12711D056K9843J5745K2640k5078l7594n9603l958K4373O460K499k9853l0585
$$ 4056 33899 49644 72284 47206 9612 -49991 -53949 -29576 -23116 -20617 -50470 -81055
12699h1055k941L1399J6286O5852K9910k8526J0120k0086k7491L3250K0195p9347
$$ -81055 -83996 -52597 -36311 29541 59451 30925 41045 20959 -6532 26718 46913 -32434
12687c2434o1826J606K5321L0378N9312J9307m9606l4503Q823N2157L315j9320
$$ -32434 -94260 -92654 -67333 -36955 22357 41664 -7942 -42445 -33622 18535 21850 2530
12675B530m717q6402M176q66o3682l70O7184N4725O1810O0833M603m5357l7562
$$ 2530 -2187 -88589 -84413 -85279 -148961 -149331 -82147 -27422 34388 95221 99824 54467 16905
12662A6905m7943K9577M8014K6870K0088q584l569m7224q354m1694k7092R775
$$ 16905 -31038 -1461 46553 73423 93511 84927 81358 34134 25780 -15914 -43006 -33231
12650c3231J98l7491j1438N3533L8144j7806J943l5415l8325N0563j8135P920
$$ -33231 -33033 -70524 -81962 -28429 9715 -8091 -6148 -41563 -79888 -29325 -47460 -39540
12638c9540k8315J1133K8149K3842P97j7789j9554r586r345p316L8698J9015J1967
$$ -39540 -67855 -56722 -28573 -4731 -3934 -21723 -41277 -50863 -60208 -67524 -28826 -9811 2156
12625B156l008r069j2601J1476l7683k5459k4064K8215L7370j5425l4427L2688
$$ 2156 -852 -9921 -22522 -11046 -48729 -74188 -98252 -70037 -32667 -48092 -82519 -49831
12613d9831M4656l172K565Q427l7083o4589J2364N6743O535l5400l5710l470p078
$$ -49831 -5175 -8347 -5782 2645 -34438 -99027 -86663 -29920 -23385 -58785 -94495 -97965 -105043
12600a05043k2542k4309K2755N301J3567K9734J8754K3733j2269J8292L3131q608
$$ -105043 -127585 -151894 -129139 -123838 -110271 -80537 -61783 -38050 -50319 -32027 1104 -7504
12588g504J9406l0416j2549k9705m0084k8075K1196M1330J4259O7142l2830l8256
$$ -7504 11902 -18514 -31063 -60768 -100852 -128927 -107731 -66401 -52142 15000 -17830 -56086
12576e6086k576k3004M1527O0109J2092N8391K6354k2870l6673p4195m1851j7476
$$ -56086 -58662 -81666 -40139 19970 32062 90453 116807 93937 57264 -16931 -58782 -76258
12564g6258L5990K5503Q932J8176p779J3325J8135l3690n5445K7459L6577L7680
$$ -76258 -40268 -14765 -5833 12343 4564 17889 36024 2334 -53111 -25652 10925 48605
12552D8605l4903n3932N781n2824j8958O0147N7560K2496k094m7902m593R842
$$ 48605 13702 -40230 -34449 -87273 -106231 -46084 11476 33972 31878 -16024 -20617 -10775
12540a0775L7790p668l8924K5002j6646m1273J624K4750K3732k0280J0490K0093
$$ -10775 27015 19347 -19577 5425 -11221 -52494 -50870 -26120 -2388 -22668 -12178 7915
12528G915k2288j2161k694J5108J1674L0155R452l0106m0623K0339K7834K4162
$$ 7915 -14373 -26534 -29228 -14120 -2446 27709 37161 7055 -33568 -13229 14605 38767
12516C8767k718j8688L9946L7696R959j4221m2914k0222n1417o3152m9817j2784
$$ 38767 36049 17361 57307 95003 104962 90741 47827 27605 -23812 -86964 -136781 -149565
12504a49565N8767K6371K4084l3035n712L9997R910L4291n0813K0839J4398j045
$$ -149565 -90798 -64427 -40343 -73378 -79090 -39093 -29183 5108 -45705 -24866 -10468 -11513
12492a1513j2895j9598j2202J6181K2968N0451M5238m7594J1273p06Q187J5266
$$ -11513 -24408 -44006 -56208 -40027 -17059 33392 78630 31036 42309 41603 49790 65056
12480F5056o6241k9466j7484K9498J9713J0772N8006o974q318J0743m8657m5703
$$ 65056 -1185 -30651 -48135 -18637 1076 11848 69854 62880 54562 65305 16648 -29055
12468b9055l466l8890j3376J3626J2666o683O883O5321j9041N1484K6907j6992
$$ -29055 -32521 -71411 -84787 -71161 -58495 -65178 -58295 7026 -12015 39469 66376 49384
12456D9384k5745k9586k249k414M1558n4763k1169M3815L797j8733L0001l8542
$$ 49384 23639 -5947 -8196 -10610 30948 -23815 -44984 -1169 2628 -16105 13896 -24646
12444b4646M4447j648n826j6962p972j4860K8339K608l786K2031m2852j9383M9126
$$ -24646 19801 18153 12327 -4635 -12607 -27467 872 3480 -306 21725 -21127 -40510 8616
12431H616K5954k1491p3770o598J3079j472j6211L5916n1832Q544J8139O662O6151
$$ 8616 34570 13079 -60691 -67289 -54210 -55682 -71893 -35977 -87809 -79265 -61126 -54464 11687
12418A1687j8936m2272j4771q203j3322p654K1818O4803k1404J4165k4419o44
$$ 11687 -7249 -49521 -64292 -72495 -85817 -93471 -71653 -6850 -28254 -14089 -38508 -39152
12406c9152K8918q200K9187M0661k3545l0665O802k470L4486j1502m6473J6974
$$ -39152 -10234 -18434 10753 51414 27869 -2796 4006 1536 36022 24520 -21953 -4979
12394d979Q7997Q079p4520l9242K8497M9459J4121M111j5484M853l6686R75L1496
$$ -4979 83018 91097 16577 -22665 5832 55291 69412 73523 58039 62892 26206 27181 58677
12381E8677M4836l5296m6285j1286J949j0254l0044j9987j1060K1388M8106j6220
$$ 58677 103513 68217 21932 10646 12595 2341 -27703 -47690 -58750 -37362 10744 -5476
12369e476J7552M1139L7904k1986l1483L5635P6474m1314k6785M714o239k3354
$$ -5476 12076 53215 91119 69133 37650 73285 149759 108445 81660 86374 80135 56781
12357E6781m1302n0737L8903j9925J2065K2384n8201N805K548j5451j731j7416
$$ 56781 15479 -35258 3645 -16280 -4215 18169 -40032 -34227 -31679 -47130 -48861 -66277
12345f6277L0439J2053Q491m214K6470L5957N364k4182O6693o0585p8643J4148
$$ -66277 -35838 -23785 -15294 -19508 6962 42919 48283 24101 90794 30209 -48434 -34286
12333c4286J4249J0102J4408K66j9942L7233L5504m0056Q500m741n2948N7816
$$ -34286 -20037 -9935 4473 4739 -15203 22030 57534 17478 25978 21237 -31711 26105
12321B6105N3025P25O544l1848o4909j03430k5459K5398K4084K7493k299N6465
$$ 26105 79130 79855 86399 54551 -10358 -113788 -139247 -113849 -89765 -62272 -64571 -8106
12309h106L6220M7651j4439l5270j9937l6469R026J7814J8640J1656l6389O2307
$$ -8106 28114 75765 61326 26056 6119 -30350 -21324 -3510 15130 26786 -9603 52704
12297E2704n5237l1132J8420R40J2662P0186K6479K6374o2902p3395K6319n460
$$ 52704 -2533 -33665 -15245 -14305 -1643 68543 95022 121396 58494 -14901 11418 5958
12285E958j3957k5032M5806O0438l346R173k4805j4052j4949m6428K2743L0029
$$ 5958 -7999 -33031 12775 73213 69867 79040 54235 40183 25234 -21194 1549 31578
12273C1578k4005q3397k5327j3912K5227L1362K8061J3525l3279M132j9480O7535
$$ 31578 7573 -75824 -101151 -115063 -89836 -58474 -30413 -16888 -50167 -46035 -65515 2020
12261B020N4593k611k6194j12774n1695R4380L7626o702j3166M207Q646j0048
$$ 2020 56613 54002 27808 -84966 -136661 -42281 -4655 -11357 -24523 -20316 -11670 -21718
12249b1718j0213P175L6794K6141l5725n3240k8486L4570N6195J4380l3303k5467
$$ -21718 -31931 -24756 12038 38179 2454 -50786 -79272 -44702 11493 25873 -7430 -32897
12237c2897O266P0285q285K0207k5035q788K2599k166r7502K6449K8605J3618
$$ -32897 -26631 43654 35369 55576 30541 21753 44352 42186 -55316 -28867 -262 13356
12225A3356L5770r828o2504p58m301L417P0642M6556p0934l3304O6694M0795m905
$$ 13356 49126 39298 -23206 -23964 -28265 -24848 45794 92350 21416 -11888 54806 95601 90696
12212I0696p042m3256K3053K155k629l2797N6947J7610n4049m3503k3599O3171
$$ 90696 83654 40398 63451 65606 62977 30180 87127 104737 50688 7185 -16414 46757
12200D6757q508l9183n0342j9437N3166R528j3481n4814m4136k6654O4277m61
$$ 46757 38249 -934 -51276 -70713 -17547 -8019 -21500 -76314 -120450 -147104 -82827 -83288
12188h3288J8278m223k9630M8124P7402l9500J6888O829m7624j6723N1350J0478
$$ -83288 -65010 -69233 -98863 -50739 26663 -12837 4051 10880 -36744 -53467 -2117 8361
12176H361K1224K7373m3319n9425n2065J8103O1119N2746k852l5261l5830L8594
$$ 8361 29585 56958 13639 -45786 -97851 -79748 -18629 34117 31265 -3996 -39826 -1232
12164a232m64K7673R16m334M6277R875m4939o8581k1992M6031J1648J3917J0906
$$ -1232 -1696 25977 26893 22559 68836 78711 33772 -34809 -56801 -10770 878 14795 25701
12151B5701k9443j3374k343M6970j5666l6174j1005L7648K4802k4327j0936J1249
$$ 25701 -3742 -17116 -19459 27511 11845 -24329 -35334 2314 27116 2789 -8147 3102
12139C102K1146O702J4538o973K1204L9765j0224l5758j6687J8927j7283p7664
$$ 3102 24248 30950 45488 38515 59719 99484 89260 53502 36815 55742 38459 -39205
12127c9205j7060q203r621L6358L8760L2527k205o6386m0508L1976K1947K5390
$$ -39205 -56265 -64468 -74089 -37731 1029 33556 31351 -35035 -75543 -43567 -21620 3770
12115C770O904P144L4148N615P745Q478k7144l5410j4355N1386L3722J446L8828
$$ 3770 10674 17818 51966 57581 65326 73804 46660 11250 -3105 48281 82003 83449 122277
12102A22277M909j01490n2648J1040J5933k4138k7110K8963l9998n0812M6045
$$ 122277 127186 25696 -26952 -15912 21 -24117 -51227 -22264 -62262 -113074 -67029
12091f7029P5000l3274J9665r492m2560O3143J2260k4567k5523J0026L3006M1517
$$ -67029 7971 -25303 -5638 -15130 -57690 5453 17713 -6854 -32377 -22351 10655 52172
12079E2172m9023r5067j838L0473M2367K4093n2185K4848M4968l611M811J7164
$$ 52172 3149 -91918 -93756 -63283 -20916 3177 -49008 -24160 20808 17197 22008 39172
12067C9172J3343J6598K7787n6285k5010l5697M8682J0731p0906j1050N826O197
$$ 39172 52515 69113 96900 40615 15605 -20092 28590 39321 -31585 -42635 -36809 -30612
12055c0612J09780M1329m9813m3000K6751L7370L4723n469n2713K8723l5165j4039
$$ -30612 79168 120497 70684 27684 54435 91805 126528 121059 68346 97069 61904 47865
12043D7865o513K3912l5739J1432K6694J452k2482k4788L637m6352k1634L0310
$$ 47865 41352 65264 29525 40957 67651 69103 46621 21833 25470 -20882 -42516 -12206
12031a2206n40p849p432P883M6083K5741m006O957m1475l5882r6953O015O2402
$$ -12206 -12746 -20595 -28027 -20144 25939 51680 47674 54631 13156 -22726 -119679 -113664 -51262
12018e1262J4646J4149k2525m5547j4118K2286L7296j229K7187m5415j0100Q9490
$$ -51262 -36616 -22467 -44992 -90539 -104657 -82371 -45075 -46304 -19117 -64532 -74632 14858
12006A4858N878j1169k2268r178n2236K9720R1472O0594l4938q1867o8724m5341
$$ 14858 20736 9567 -12701 -21879 -74115 -44395 47077 107671 72733 -9134 -77858 -123199
11994a23199Q14P9646N0736Q54O6886j9187j0650P54K5588k9696o8034l253L1865
$$ -123199 -122385 -42739 7997 8851 75737 56550 45900 46654 72242 42546 -25488 -28741 3124
11981C124k1628Q4395J6836n9427l6925k6980M7755M8553K5093J5430m2194j08072
$$ 3124 -18504 65891 82727 23300 -13625 -40605 7150 55703 80796 96226 54032 -54040
11969e4040n5728L9411J2816m982J1903M447M3006Q268K6681J7667j9239n3112
$$ -54040 -109768 -70357 -57541 -62523 -50620 -46173 -3167 5101 31782 49449 30210 -22902
11957b2902o2136L1890M2970J7406k4286K510L808O7621j8149o349l7026q1911
$$ -22902 -85038 -53148 -10178 7228 -17058 -14548 -10740 56881 38732 32383 -4643 -86554
11945h6554m9488P2031N0406K2932J2740j7850m3029n3811K6756M152K360P8657
$$ -86554 -136042 -64011 -13605 9327 22067 4217 -38812 -92623 -65867 -61715 -59355 19302
11933A9302Q4334k8874n4005p2502K1549K2451k8891l6761M162N4399j0835J0925
$$ 19302 103636 74762 20757 -51745 -30196 -7745 -36636 -73397 -69235 -14836 -25671 -14746
11921a4746J9528j8068K7777K2361r413J1199m1672o0831j5299J3750M5904J3602
$$ -14746 4782 -13286 14491 36852 27439 38638 -3034 -63865 -79164 -65414 -19510 -5908
11909e908o8778N0453L5769K8774K7228J0996R3l9093r124k1929M5399j7242j3476
$$ -5908 -74686 -24233 11536 40310 67538 78534 78627 39534 30410 8481 53880 36638 23162
11896B3162k9555k0628O530L7804n7279k7130N3660M7864k0572l2212k6952L6137
$$ 23162 -6393 -27021 -20491 17313 -39966 -67096 -13436 34428 13856 -18356 -45308 -9171
11884i171K1456k4742k0408j1928K8219o227m0100M6436J7536O8551j9124o3712
$$ -9171 12285 -12457 -32865 -44793 -16574 -22801 -62901 -16465 1071 69622 50498 -13214
11872a3214o9537l4001n230L8253O2794O8353q42J0314j2056l8418J4913J1746
$$ -13214 -82751 -116752 -121982 -83729 -20935 47418 46576 56890 44834 6416 21329 33075
11860C3075J920m0223J8720j9134m1617j8755J8553L3095L0149l7971J7628J5542
$$ 33075 34995 -5228 13492 -5642 -47259 -66014 -47461 -14366 15783 -22188 -4560 10982
11848A0982R885n7387O8199j1420p6519L8826L1410l1491k0526J3253O0730o0614
$$ 10982 20867 -36520 31679 20259 -56260 -17434 13976 -17515 -38041 -24788 35942 -24672
11836b4672k3384L7591J3816m273q010l3945j9318J5747J1893K4030Q662N380
$$ -24672 -48056 -10465 3351 -922 -8932 -42877 -62195 -46448 -34555 -10525 -1863 3517
11824C517M573J4007J102j2406K013J6193p198r629l7201n8700M2420J4363m5912
$$ 3517 8090 22097 23199 10793 12806 28999 21801 12172 -25029 -83729 -41309 -26946 -72858
11811g2858l9173O7758Q5350l3073J9266J4725k141j4436l0689j8509O971L0302
$$ -72858 -112031 -44273 41077 8004 27270 41995 39854 25418 -5271 -23780 -16809 13493
11799A3493N3137K2399N311j4366o7428N0388K039o2742j9719j316o090K9890
$$ 13493 66630 89029 94340 79974 12546 62934 64973 2231 -17488 -18804 -24894 4996
11787D996q920O684o917k8768K5501k8714o289K2490l993j4520L1432k2323K7049
$$ 4996 -3924 2760 -4157 -32925 -7424 -36138 -42427 -19937 -23930 -38450 -7018 -29341 -2292
11774b292L8251o128J806L013Q382J0052K2131n5675l6884L0711n285k7108K4757
$$ -2292 35959 29831 31637 34650 43032 53084 75215 19540 -17344 13367 8082 -19026 5731
11761E731K5231J878N03K5160M9610J3527j8356n0170K5598J0196m5063k7416
$$ 5731 30962 32840 33343 58503 108113 121640 103284 53114 78712 88908 43845 16429
11749A6429l0414k3317j7050o308J5233k3421j2695J1211M8877N2613M9986j7921
$$ 16429 -13985 -37302 -54352 -60660 -45427 -68848 -81543 -70332 -21455 31158 81144 63223
11737F3223l6300k1152K592J6285L2586M3149q303l1597j4502l2208j8460l3451
$$ 63223 26923 5771 8363 24648 57234 100383 92080 60483 45981 13773 -4687 -38138
11725c8138N6559O2179n112n379K7556q372p9355m1804m4859J69o697O9580L8794
$$ -38138 18421 80600 75488 70109 97665 89293 9938 -31866 -76725 -76556 -83253 -13673 25121
11712B5121p418n875l370K1694K7337J3214O7676K3723m3669o2380J8434k3731
$$ 25121 17703 11828 8458 30152 57489 70703 138379 162102 118433 56053 74487 50756
11700E0756j2856k8445j2985k1428n5367l9757L4227J6769J0580K7261J2009j1951
$$ 50756 37900 9455 -3530 -24958 -80325 -120082 -85855 -69086 -58506 -31245 -19236 -31187
11688c1187n343P3368l97K938k6489m3253k1097L6204N0197L1787o0504O020n278
$$ -31187 -36530 36838 36441 39379 12890 -30363 -51460 -15256 34941 66728 6224 12244 6966
11675F966J2256J7332J3139J8333k5618O051P61o2081j1918L6194M7100p327J018
$$ 6966 19222 36554 49693 68026 42408 48459 49220 -12861 -24779 11415 58515 51188 52206
11662E2206J9027n945k8406L5198k9162n1017l2381L2322O3879l658K2974L2999
$$ 52206 71233 65288 36882 72080 42918 -8099 -40480 -8158 55721 52063 75037 108036
11650A08036K7235J2306o3324k4426L1617L3084n3743n6756J5233K0741k0044
$$ 108036 135271 147577 84253 59827 91444 124528 70785 14029 29262 50003 29959
11639B9959J1293O227L629Q653p2346o7956K5039j1995N2403O266r939M4403J9657
$$ 29959 41252 47479 51108 59761 -12585 -80541 -55502 -67497 -15094 -8828 -18767 25636 45293
11626D5293k4214j051J9620L1951n5682m5495q339J0398K2934k0446m0112P3688
$$ 45293 21079 20028 39648 71599 15917 -29578 -37917 -27519 -4585 -25031 -65143 8545
11614H545K2093K8364j7723J575M219l0128P993N015L5168j0435m2173o6609N1803
$$ 8545 30638 59002 41279 42854 47073 16945 24938 29953 65121 54686 12513 -54096 -2293
11601b293k0291P291j0164L6668M6552K5454J9591M147L596K5000l5629j7050
$$ -2293 -22584 -15293 -25457 11211 57763 83217 102808 106955 110551 135551 99922 82872
11589H2872k9549l0733l5979L2859j9367j0659k5075M2132K3670J4976L2342L6544
$$ 82872 53323 22590 -13389 19470 103 -10556 -35631 6501 30171 45147 77489 114033
11577A14033l6600k4820n2234j8369l7362j4717M0129K0153M0904k9178K5071
$$ 114033 77433 52613 379 -17990 -55352 -70069 -29940 -9787 31117 1939 27010
11566B7010M1613M596m5129P885J7627n949l8173k0587j9793L7483l839j9788
$$ 27010 68623 73219 28090 35975 53602 47653 9480 -11107 -30900 6583 2744 -17044
11554a7044K0195k5480M4000L1292j5667k1971L7802K0460J3694O6738j8203j02946
$$ -17044 3151 -22329 21671 52963 37296 15325 53127 73587 87281 154019 135816 32870
11542C2870m5752N033j9547N8411q98l0097k7979M9600L0162n226K8586K8030
$$ 32870 -12882 -7849 -27396 31015 30117 20 -27959 21641 51803 46577 75163 103193
11530A03193k6271n1729M9240K4024J7439m4229j16918m6772P1518N1490m9569
$$ 103193 76922 25193 74433 98457 115896 71667 -45251 -92023 -20505 30985 -18584
11519a8584l3735N4238L1193o5863j7977K1784J5051J4164J8636j5181j7197m655
$$ -18584 -52319 1919 33112 -32751 -50728 -28944 -13893 271 18907 3726 -13471 -18126
11507a8126m3672J9293L9847n2315P149P7550K960o023q065q825M015o925L9591
$$ -18126 -61798 -42505 -2658 -54973 -47824 29726 32686 26663 18598 9773 13788 6863 46454
11494D6454k0519j9984k5919Q810O3305k8758k6017j2684L4277n9838O967L5170
$$ 46454 25935 5951 -19968 -11158 52147 23389 -2628 -15312 18965 -40873 -33906 1264
11482A264j1721m3746L0376K8084J0337m0645k9519J2186M391k3878N202k3361
$$ 1264 -10457 -54203 -23827 4257 14594 -26051 -55570 -43384 -38993 -62871 -57669 -81030
11470h1030J5010K4257P936l0928o694K111n5131L0067L9066N9258O276J3970
$$ -81030 -66020 -41763 -33827 -64755 -71449 -69338 -124469 -94402 -55336 3922 10198 24168
11458B4168J0968q9294J8196O1180N5486M3374l8734j2902K6109l2560J0906j666
$$ 24168 35136 -54158 -35962 25218 80704 124078 85344 72442 98551 65991 76897 75231
11446G5231o1192K3643M9605m1944l4005l4471k2195J00770Q3547l8365q7591
$$ 75231 14039 37682 87287 45343 11338 -23133 -45328 55442 138989 100624 13033
11435A3033k8024K003m2826J4850M0416J3118J6061k1757M730K6967k776j2155
$$ 13033 -14991 -12988 -55814 -40964 -548 12570 28631 6874 11604 38571 35795 23640
11423B3640l4176j9482K2718P0432O2008K9340m9754m8495l2753k5552j355J5101
$$ 23640 -10536 -30018 -7300 63132 125140 154480 104726 56231 23478 -2074 -3429 11672
11411A1672J9366N5754l308k5621k3054j6796k6842q1766J355j2402O4178P4404
$$ 11672 31038 86792 83484 57863 34809 18013 -8829 -90595 -89240 -101642 -37464 36940
11399C6940k7709o818p884l597K308J344l4036L551L8812L0559K0245K5074J4875
$$ 36940 9231 2413 -5471 -9068 -6760 -5416 -39452 -35901 2911 33470 53715 78789 93664
11386I3664k6975m8523k1887O3958l9584o0888n1289O599j9212l9153L8245J00550
$$ 93664 66689 18166 -3721 60237 20653 -40235 -91524 -84925 -104137 -143290 -105045 -4495
11374d495L4428L6835P3108L8450n3933o9347l9267n2257l1725M775M4974N6134
$$ -4495 29933 66768 139876 178326 124393 55046 15779 -36478 -68203 -63428 -18454 37680
11362C7680L8335J85o0103k8099M158n991J579l1031K3768K2135K0777M8101M033
$$ 37680 76015 76200 16097 -12002 -7844 -13835 -12256 -43287 -19519 2616 23393 71494 75527
11349G5527p5220k6814k86J4059K1587L6077Q039k2494l2972K4913J3249q434
$$ 75527 307 -26507 -26793 -12734 8853 44930 52969 30475 -2497 22416 35665 27231
11337B7231L0753K3358Q030j0473j3776q1560j6441P0222L4802k9127l6470j1397
$$ 27231 57984 81342 89372 78899 65123 -16437 -32878 37344 72146 43019 6549 -4848
11325d848K461L3150L4665m5318m3838K3570l0467M2279N2284N7862r204p0120
$$ -4848 -2387 30763 65428 20110 -23728 -158 -30625 11654 63938 121800 112596 42476
11313D2476m6225J7633j4470m3906J6807L3629j8p3979l4015M9250M4857J5371
$$ 42476 -3749 13884 -586 -44492 -27685 5944 5926 -68053 -102068 -52818 -7961 7410
11301G410J9129O263K4934o167J7855J2705l0789k0933R888o828p654k127l3074
$$ 7410 26539 32802 57736 51569 69424 82129 51340 30407 40295 33467 25813 23686 -9388
11288i388m0148K1808K5884J7141j7460l9855K6649J568L241L5014N0907L1434
$$ -9388 -49536 -27728 -1844 15297 -2163 -42018 -15369 -13801 -10560 24454 75361 106795
11276A06795L797Q389k4681r408Q037p846l3532L075Q186J2802L3158m2996n5416
$$ 106795 110592 118981 94300 84892 92929 85083 51551 54626 62812 75614 108772 65776 10360
11263A0360n332Q663L8223M6617m9611o5091j5007k4227j711k8700K8721L6049
$$ 10360 5028 13691 51914 98531 48920 -16171 -31178 -55405 -57116 -85816 -57095 -21046
11251b1046M5286K7746J7089K8206L3181k5653k4577l3033n2659n8338L4675M9718
$$ -21046 24240 51986 69075 97281 130462 104809 80232 47199 -5460 -63798 -29123 20595
11239B0595j6820j154N9473j6467j2059K0255l9183K2273K5232m5253r7999K6887
$$ 20595 3775 2621 62094 45627 33568 53823 14640 36913 62145 16892 -81107 -54220
11227e4220R3361N6682J902l6466m2854l621Q223M0090J04094l3057j02724p7273
$$ -54220 39141 95823 97725 61259 18405 14784 23007 63097 167191 134134 31410 -45863
11215d5863K3294P4084k9351J1124L7449n4424L5224L492l2690o214j3511q38
$$ -45863 -22569 51515 22164 33288 70737 16313 51537 55029 22339 16125 2614 1776
11203A776L1926L0209m3683J2519N3869l2492m4481l1399J8079J4553J5671r384
$$ 1776 33702 63911 20228 32747 86616 54124 9643 -21756 -3677 10876 26547 17163
11191A7163N742L0534N6069n571o6554m7804j7076L4459M453j3036Q979j7857
$$ 17163 22905 53439 109508 103937 37383 -10421 -27497 6962 11415 -1621 7358 -10499
11179a0499j8590l023k3077k1278k353J9537N6531k8668K4237J3146m3519O2811
$$ -10499 -29089 -32112 -55189 -76467 -78820 -59283 -2752 -31420 -7183 5963 -37556 25255
11167B5255K0980o854l5620j06234K3746M7579K155L7393L1943M346k8999j653
$$ 25255 46235 39381 3761 -102473 -78727 -31148 -28993 8400 40343 44689 15690 14037
11155A4037M2414r44K3509j3988l3601l303n600j6295M0867L0716k573p4865m2954
$$ 14037 56451 55507 79016 65028 31427 28124 22524 6229 47096 77812 75239 374 -42580
11142d2580N1248K7544j9010k1737n949L0224j5639J5868J84n295L5910J6642
$$ -42580 8668 36212 17202 -4535 -10484 19740 4101 19969 20153 14858 50768 67410
11130F7410j4036l5711k0972j1455N9704R7252M030q0273n3718m8674K3400O1161
$$ 67410 53374 17663 -3309 -14764 44940 142192 146222 65949 12231 -36443 -13043 48118
11118D8118P272k0794j395j5927q763N4084l3309j0455l2279p164J5965p3082
$$ 48118 55390 34596 33201 17274 8511 62595 29286 18831 -13448 -20612 -4647 -77729
11106g7729N4071Q2584Q1016j3980k1986N733m3196p9972N9404N4768o660n9253
$$ -77729 -23658 58926 139942 125962 103976 109709 66513 -13459 45945 100713 94053 34800
11094C4800n2880K7952M7202n6883o947J6580L5650j3625k1837l7386Q129l780
$$ 34800 -18080 9872 57074 191 -6756 9824 45474 31849 10012 -27374 -19245 -23025
11082b3025M5432J8231N3802L8831l4763n1511L7931N8975J7335n4259m0166k5097
$$ -23025 22407 40638 94440 133271 98508 46997 84928 143903 161238 106979 66813 41716
11070D1716J9369K1416m1077J2837M0329j8487n306o2821n8348k5717J4554L3367
$$ 41716 61085 82501 41424 54261 94590 76103 70797 7976 -50372 -76089 -61535 -28168
11058b8168M8494K4642K4028m7769n213L6672L3616j1934l9469o8377N0615N4156
$$ -28168 20326 44968 68996 21227 16014 52686 86302 74368 34899 -33478 17137 71293
11046G1293j8602l81l8312L7745M9036j7068r22K2938k375l1967j3018Q302K5406
$$ 71293 52691 52310 13998 51743 100779 83711 82789 105727 103352 71385 58367 66669 92075
11033I2075j3167n4986o0059L6536O7732j6902j7940N202k0259p207m6052J6138
$$ 92075 78908 23922 -36137 399 68131 51229 33289 38491 18232 11025 -35027 -18889
11021a8889M7797P5880j6338p6809k1805r37R461n033O67k7070j3477P0431J09226
$$ -18889 28908 104788 88450 11641 -10164 -11101 -1640 -6673 -6006 -33076 -46553 23878 133104
11008A33104r96l4407k2770m0970J2280l2163m8936M6483k1514J2086O0088M5434
$$ 133104 132108 97701 74931 33961 46241 14078 -34858 11625 -9889 2197 62285 107719
10996A07719j2073o5298j22102Q658P5525J19679l1652r5399J9320L9111O8507
$$ 107719 95646 30348 -91754 -83096 -7571 112108 80456 -14943 4377 43488 111995
10985A11995K7519l7640k5451o0728m8083J2575L8279K0770J8179J3139R802J939
$$ 111995 139514 101874 76423 15695 -32388 -19813 18466 39236 57415 70554 80356 82295
10973H2295m7923o338K5728J7392j5699P0579N4549J4999p2824o5278k8117m8676
$$ 82295 34372 28034 53762 71154 55455 126034 180583 195582 122758 57480 29363 -19313
10961a9313l3521J7461L5880J6952O0682l8739n5327m6841K7832R3713M8398M1871
$$ -19313 -52834 -35373 507 17459 78141 39402 -15925 -62766 -34934 58779 107177 149048
10949A49048J1228j3711l5262J8312r592l2456K8159n221j6541l1235K5474K8306
$$ 149048 160276 146565 111303 129615 120023 87567 115726 110505 93964 62729 88203 116509
10937A16509N434j8947q484K8205j2336j9022j9786j4606K4145P350K2125l1620
$$ 116509 121943 102996 94512 122717 110381 91359 71573 56967 81112 88462 110587 78967
10925G8967k0039k203L5734M3953j2496k1461j678l6846R459m364k9364N609O4404
$$ 78967 58928 56725 92459 136412 123916 102455 100777 63931 73390 69026 39662 45271 109675
10912A09675N0832n40o2240k8361O035j5356J37j5247m0534J6719O8362L8941
$$ 109675 160507 159967 97727 69366 75401 60045 60182 44935 4401 21120 89482 128423
10900A28423L7787k1555m3163n9310o0027j6506N1438J6217R502l0883K8708L0338
$$ 128423 166210 144655 101492 42182 -17845 -34351 17087 33304 42806 11923 40631 70969
10888G0969K5018k0240n8557O638l8078j872O0837j8089p2295l401L3665N2469
$$ 70969 95987 75747 17190 23828 -14250 -16122 44715 26626 -45669 -49070 -15405 37064
10876C7064j4246Q9843K0990m1793J038K3997j2774m8447q1545L0967N9138P7483
$$ 37064 22818 112661 133651 91858 92896 116893 104119 55672 -25873 5094 64232 141715
10864A41715k6850r37L8599K4574o2544M739j6673j8122K6415J7899k6818l5878
$$ 141715 114865 113928 152527 177101 114557 119296 102623 84501 110916 128815 101997 66119
10852F6119L5460K0685j5267n4423m0218L0509J0152Q255K6010J8453N277n533
$$ 66119 101579 122264 106997 52574 12356 42865 53017 61272 87282 105735 111012 105479
10840A05479L4841j8614L8365K7882j4005r0653J7736L8435J3189j4773M0610
$$ 105479 140320 121706 160071 187953 173948 83295 101031 139466 152655 137882 178492
10829A78492M9763N128J0149l4437n3527n0993J1785M1881M9158k950j2722o1548
$$ 178492 228255 233383 243532 209095 155568 104575 116360 158241 207399 204449 191727 130179
10817A30179l7964j5612r3028k3603O4133L1798K770M778J3114k3691J829O925
$$ 130179 92215 76603 -16425 -40028 24105 55903 58673 63451 76565 52874 54703 61628
10805F1628K7333L5218J8798M077n3125n9592j6485N0892Q7016k7174q997L447
$$ 61628 88961 124179 142977 147054 93929 34337 17852 68744 155760 128586 119589 123036
10793A23036N305j368j4276r34M462l273J8165L9373m5404l9676k9163j8862r308
$$ 123036 128341 126973 112697 111763 116225 112952 131117 170490 125086 85410 56247 37385 28077
10780B8077K2782k1216N8425P3655M1193K7175j7997m5370J6815j8311o3630k5183
$$ 28077 50859 29643 88068 161723 202916 230091 212094 166724 183539 165228 101598 76415
10768G6415Q518M2519L9627k5634J2617k3029k8232J5050l1385q894k5001j7425
$$ 76415 84933 127452 167079 141445 154062 131033 102801 117851 86466 77572 52571 35146
10756C5146K7202K4621l085L297k3977l9375K2174j6541J8755M604K1435l1914
$$ 35146 62348 86969 83884 87181 63204 23829 46003 29462 48217 52821 74256 42342
10744D2342k7035J6411K6907K2067O1463j0746J8309K2930n762N951k1771k5623
$$ 42342 15307 31718 58625 80692 142155 131409 149718 172648 166886 172837 151066 125443
10732A25443k7702K3105P5683J14166O506p3505o6437m0156k4256R8154k7410
$$ 125443 97741 120846 196529 310695 317201 243696 177259 137103 112847 211001 183591
10721A83591k996Q293k7204m6363K3095l2400o1092P3421O5533J0909j3561j7971
$$ 183591 180595 188888 161684 115321 138416 106016 44924 118345 183878 194787 181226 163255
10709A63255M0599J8779J2216M8268L9398J01876J95633L25263K92706K22922
$$ 163255 203854 222633 234849 283117 322515 424391 620024 945287 1237993 1460915
10699A460915Q472j04742K7067P8925j04904k22793k50389k15316k11344q9208
$$ 1460915 1469387 1364645 1391712 1470637 1365733 1142940 892551 677235 465891 376683
10689C76683K9047o6052m1048l2467j8030k6798q645m647K3128n495m3023J03
$$ 376683 405730 339678 298630 266163 248133 221335 212690 208043 231171 225676 182653 182756
10677A82756l2088o3177n0337J0599R9984M1194j2913n743j8484k5346j7023L6149
$$ 182756 150668 87491 37154 47753 147737 188931 176018 170275 151791 126445 109422 145571
10665A45571J4908l0461K7277l2574J9422q301K3126L0278k9071M2883k2r059
$$ 145571 160479 130018 157295 124721 144143 135842 158968 189246 160175 203058 203036 193977
10653A93977j8137L0645R1120N8467j0830j1465P8334J56726J98260K00286K83314
$$ 193977 175840 206485 297605 356072 345242 333777 412111 568837 767097 967383 1250697
10642A250697L53630J95061P2241r2360k65767m32470l07679k42338j61848n2471
$$ 1250697 1604327 1799388 1871629 1779269 1513502 1081032 773353 531015 369167 316696
10632C16696M8567M481k9419j13024l6123L3683k8580m6495M8231j7905k0949
$$ 316696 365263 369744 340325 227301 191178 224861 196281 149786 198017 180112 159163
10621A59163J3040P6022J6737l5948q8400m0113N2217N9542J9619J3176j6919
$$ 159163 172203 248225 264962 229014 140614 100501 152718 212260 231879 245055 228136
10610B28136l5610l5421J131j0797n9522M8678Q0311l4576m7498k784o6023j3628
$$ 228136 192526 157105 158236 147439 87917 136595 216906 182330 134832 132048 66025 52397
10598E2397Q7113L0494j3067l6678K7347N6041O480Q976m398k1392J0020J8756
$$ 52397 139510 170004 156937 120259 147606 203647 210127 219103 214705 193313 203333 222089
10586B22089K3842O83j7452N6441K3541k7086j7102k070k4570K974o807K8675
$$ 222089 245931 246614 229162 285603 309144 282058 264956 262886 238316 241290 234483 263158
10574B63158J7312n7297o2089m3749J6514O4110N4337k2921N445n392j8319r3549
$$ 263158 280470 223173 161084 117335 133849 197959 252296 229375 234820 229428 211109 117560
10562A17560o5337J07356J3510K9543J8040J3482M8176J0687j3368k5604M1117
$$ 117560 52223 159579 173089 202632 220672 234154 282330 293017 279649 254045 295162
10551B95162Q461M9651J7564M697p8494o9450J708J0537J4127L9275L7950l0454
$$ 295162 303623 353274 370838 375535 297041 227591 229299 239836 253963 293238 331188 300734
10539C00734l1270M7298k0612m8690l1016k1130M725l1364K4353M7585K5603Q796
$$ 300734 269464 316762 296150 247460 216444 195314 200039 168675 193028 240613 266216 275012
10527B75012l0258m6080j7077M2571N2802q04o1335R425K4967L7611K2909o6491
$$ 275012 244754 198674 181597 224168 276970 276166 214831 224256 249223 286834 309743 243252
10515B43252K31r321j8817o3717J8920N1286j580k4044K2485R582k0894j4012
$$ 243252 243483 234162 215345 151628 170548 221834 220254 196210 218695 228277 207383 193371
10503A93371L9190L0339R130J5665L3494K1624L284M1387R312L26k5990P3348
$$ 193371 232561 262900 272030 287695 321189 342813 346097 387484 396796 397122 371132 444480
10491D44480k5549m5475q0686p1280q0620K3240N0860K2772Q2984K5916P1591
$$ 444480 418931 373456 292770 221490 140870 164110 214970 237742 320726 346642 418233
10480D18233L595l9649m708m339q554j0608l3485r419J10n1630j5203K5037L0416
$$ 418233 421828 382179 377471 373132 364578 353970 320485 311066 311176 259546 244343 269380 299796
10467B99796n547l881n7451q916Q7778k2415n9621j242n3984j86O0136P0275O4609
$$ 299796 294249 290368 232917 224001 311779 289364 229743 228501 174517 174331 234467 304742 369351
10454C69351r273m8368j4674M8121o9743n7915L7293N4629J7020p253J8043O6531
$$ 369351 360078 311710 297036 345157 275414 217499 254792 309421 326441 319188 337231 403762
10442D03762o6797M430j3132K7270K428O4047m9144l0538j0833R480J2050M8559
$$ 403762 336965 341395 328263 355533 357961 422008 372864 342326 331493 340973 353023 401582
10430D01582k975M8820M5400l2466o0942m7712K0686j5268m0156J1391j9242K7239
$$ 401582 398607 447427 492827 460361 399419 351707 372393 357125 316969 328360 309118 336357
10418C36357L053j3364k1483j7415M5290P6511L1138k2641L7351P305L5513M3969
$$ 336357 339410 326046 304563 287148 332438 408949 440087 417446 454797 462102 497615 541584
10406E41584Q5423J22740J02532Q3398m5722m0610P5394R3226J5181n056j00656
$$ 541584 627007 749747 852279 935677 889955 849345 924739 1017965 1033146 1028090 927434
10395I27434j73924p6546o2533M310K8293k2309l3259k0974o0503M360m069j1226
$$ 927434 753510 676964 614431 618741 647034 624725 591466 570492 509989 514349 510280 499054
10383D99054O325K0426L6557L7865k1027N9537m8779M6908k012K022m0655k5614
$$ 499054 505379 525805 562362 600227 579200 638737 589958 636866 634854 636876 596221 570607
10371E70607N7821K891K1145l385K0445L103P765P3545M0718K1962l5764L5216
$$ 570607 628428 631319 652464 649079 669524 672627 680392 753937 794655 816617 780853 816069
10359H16069M2814J532J6820L330J5928L410M184k413P672O2512J01014L121N3363
$$ 816069 858883 860415 877235 880565 896493 899903 904087 901674 909346 971858 1072872 1075993 1129356
10346A129356K9518J1954j8608O0525Q2887K3489j2536L3528Q7948P1769M5408
$$ 1129356 1158874 1170828 1152220 1212745 1295632 1319121 1306585 1340113 1428061 1499830 1545238
10335A545238J9180P8055P3901R8187J23408P8059Q7107J12693J21878M3107O1869
$$ 1545238 1564418 1642473 1716374 1814561 1937969 2016028 2103135 2215828 2337706 2380813 2442682
10324B442682P2900J69005J88749K73069K49591L03543L81100N75523O45110N15200
$$ 2442682 2515582 2684587 2873336 3146405 3395996 3699539 4080639 4656162 5301272 5816472
10314E816472L59656L24517N21946O42124P33971P16972Q52347J086552J505712
$$ 5816472 6176128 6500645 7022591 7664715 8398686 9115658 9968005 11054557 12560269
10305A2560269K057558K776251L783730N447847Q562445J4589276K5272548M1418129
$$ 12560269 14617827 17394078 21177808 26625655 35188100 49777376 75049924 116468053
10297A16468053N7372152N4861294K5342615o379512r001909J0012837J2181621
$$ 116468053 173840205 228701499 254044114 247664602 238662693 248675530 260857151
10290B60857151j6353233m9422229n7211984m4374610k8521769j7429951j1109866
$$ 260857151 244503918 195081689 137869705 93495095 64973326 47543375 36433509
10283C6433509p474044n280211l789164k835413k235871j873962j528960j060866
$$ 36433509 28959465 23679254 19890090 17054677 14818806 12944844 11415884 10355018
10275A0355018p23740n25823o10921o22732m25596k09567j32076k50329m18358
$$ 10355018 9631278 9105455 8494534 7871802 7446206 7236639 7104563 6854234 6435876
10266F435876l38107n2846K05594L89888M66692M31653K66495K45630J89589K21743
$$ 6435876 6097769 6044923 6250517 6640405 7107097 7538750 7805245 8050875 8240464 8462207
10256H462207M41005P91944J256819J801180K299056K963478L814273N038911
$$ 8462207 8903212 9695156 10951975 12753155 15052211 18015689 21829962 26868873
10248B6868873P209973J1477453J9631143L4046759N4908169P2378196O7308121
$$ 26868873 34078846 45556299 65187442 99234201 154142370 226520566 293828687
10241B93828687M0288962Q670810k3657457n5768291p1560285o1804431m2227600
$$ 293828687 334117649 342788459 319131002 263362711 191802426 129997995 87770395
10234H7770395k5996384j5818130j0068332o810715m959089l846868l214777k844825
$$ 87770395 61774011 45955881 35887549 29076834 24117745 20270877 17056100 14211275
10226A4211275k369767j889787j419394j060761o84450l91510j99630k99992m39074
$$ 14211275 11841508 9951721 8532327 7471566 6787116 6395606 6195976 5895984 5456910
10217E456910n13174o08826o32269n24696l41433l07079l12852l13967j71012
$$ 5456910 4943736 4334910 3702641 3177945 2836512 2529433 2216581 1902614 1731602
10208A731602j43027j82389j32879q2143p1027r0808r4779J0992k6680q3361q1425
$$ 1731602 1588575 1406186 1273307 1191164 1120137 1029329 934550 945542 918862 835501 754076
10197G54076j12815m4645P3661L641n1544n1405r6830p0803J22J195J1508K5151
$$ 754076 641261 596616 670277 673918 622374 570969 474139 403336 403458 404653 416161 441312
10185D41312n031l7114m8578m6233q246m302k3001n2212P14J3939o985j9579m575
$$ 441312 436281 399167 350589 304356 296110 291808 268807 216595 217309 231248 224263 204684 200109
10172B00109O2289j584N945m3759K6343K9788K5565N0033l7945j3980N470p1877
$$ 200109 262398 260814 266759 223000 249343 279131 304696 354729 316784 302804 308274 236397
10160B36397j4619k3113o109m2960J5885N7089l100k5163q779o40K5655J257r1157
$$ 236397 221778 198665 192556 149596 165481 222570 219470 194307 185528 184888 210543 211800 120643
10147A20643j09933j2870P61k8939k0029p2636M991N1938K8583k1100P760p943
$$ 120643 10710 -2160 -1399 -30338 -50367 -123003 -118012 -66074 -37491 -58591 -50831 -58774
10135e8774L3240N1042M563l7395J3781O8013j607m9680q2593k6639L9127Q852
$$ -58774 -25534 25508 30071 -7324 6457 74470 72863 23183 -59410 -86049 -46922 -38070
10123c8070N0225J17201k1764k4047m280L46R8232P4611J82m1484K8679K24n1129
$$ -38070 12155 129356 107592 83545 79265 79611 177843 252454 252636 211152 239831 240055 188926
10110A88926r0985k1302l6575j3017K7556j3794k5288q7556q3181Q4951Q6963
$$ 188926 97941 76639 40064 27047 54603 40809 15521 -72035 -155216 -70265 16698
10099A6698k544K1388j9401l2342k7945j3902k4687R6191R1689Q347n9594n9556
$$ 16698 14154 35542 16141 -16201 -44146 -58048 -82735 13456 105145 113492 53898 -5658
10087e658m8953n2429J6483L422M7620P7479n1583r907n7952n1973O8651M2408
$$ -5658 -54611 -107040 -90557 -87135 -39515 37964 -13619 -23526 -81478 -133451 -64800 -22392
10075b2392P803J9064J7485J4527j1086n4133l551K0576J6185p664k5479N5800
$$ -22392 -14589 4475 21960 36487 25401 -28732 -32283 -11707 4478 -3186 -28665 27135
10063B7135m5434O768k9695o3165o4404j5646K6423N430K5438J1822j81m0909
$$ 27135 -18299 -11531 -41226 -104391 -168795 -184441 -158018 -152588 -127150 -115328 -115509 -156418
10051a56418k179J1726L0251K9140O5689M5078N5004M6427J4497j02549l6634
$$ -156418 -158597 -146871 -116620 -87480 -21791 23287 78291 124718 139215 36666 32
10040C2K0502J4268j5770p7666o3641o1568k1216L8244k2923l182K0093K278L6618
$$ 32 20534 34802 19032 -58634 -122275 -183843 -205059 -166815 -189738 -192920 -172827 -170549 -133931
10027a33931M701l4065N1163M4422l3638k8077J9917N9427K0549k2078l7208q0598
$$ -133931 -129230 -163295 -112132 -67710 -101348 -129425 -109508 -50081 -29532 -51610 -88818 -169416
10015a69416m7757j5127L5133K4006Q9031K0637m3216J7841N1832j346q4871j8363
$$ -169416 -217173 -232300 -197167 -173161 -84130 -63493 -106709 -88868 -37036 -38382 -123253 -141616
10003a41616K3785k4276j8581J1510R3252N3575j3106l8823o6550K3311L7218
$$ -141616 -117831 -142107 -160688 -149178 -55926 -2351 -15457 -54280 -120830 -97519 -60301
9992f0301K7936O1480k257j3775l2737N870j1795K0662J1724k9310k090q198n4507
$$ -60301 -32365 29115 26858 13083 -19654 -13784 -25579 -4917 6807 -22503 -24593 -32791 -87298
9979h7298M2728J6015M5721P4119R7689J28460Q6240r4453j70712q1750n2508
$$ -87298 -44570 -28555 17166 91285 188974 317434 403674 309221 138509 56759 4251
9968D251J0661m5375k6985k8211k8784L9790N3305j1874p246j9482q032o875J0502
$$ 4251 14912 -30463 -57448 -85659 -114443 -74653 -21348 -33222 -40468 -59950 -67982 -74857 -64355
9955f4355r933L982P992O824j3321k6021L0296K5608n859M4315O71k4557l2321
$$ -64355 -74288 -70306 -62314 -55490 -68811 -94832 -64536 -38928 -44787 -472 199 -24358 -56679
9942e6679j4619R842J8405K897l5574o342O6153J8937j5387N4106L0831n9568
$$ -56679 -71298 -61456 -43051 -40154 -75728 -82070 -15917 3020 -12367 41739 72570 13002
9930A3002Q497M7283O825j8362p4929k2886O1729K1826J1921L9914o255k7367
$$ 13002 21499 68782 75607 57245 -17684 -40570 21159 42985 54906 94820 88565 61198
9918F1198o503L93o933k2057m7813o8672J0359R430K4345J5677K9047j7668n0312
$$ 61198 54695 55088 48155 26098 -21715 -90387 -80028 -70598 -46253 -30576 -1529 -19197 -69509
9905f9509k0596j5937K9783O0159N9733Q1390L665n9156j5257L3042N6112k5042
$$ -69509 -90105 -106042 -76259 -16100 43633 125023 128688 69532 54275 87317 143429 118387
9893A18387j6184L3951l022M827Q0215K16085L13181L03927J89322K3961m9047
$$ 118387 102203 136154 133132 137959 218174 434259 747440 1051367 1240689 1264650 1215603
9882A215603m8568J16075K5979j88591k91584k28870k11074j03821m8807n2834
$$ 1215603 1167035 1283110 1309089 1120498 828914 600044 388970 285149 236342 183508
9872A83508k724j9675j8846j2825n504j4502p9089j2593K3904O8434L0497k4250
$$ 183508 180784 161109 142263 129438 123934 109432 30343 17750 41654 110088 140585 116335
9860A16335L0129P4575J45l3135L0319P1097K40337M05256O19641O82705K78124
$$ 116335 146464 221039 221184 188049 218368 289465 529802 935058 1554699 2237404 2515528
9849B515528l52521p39740n60212k60233r1037j05318p0382j2625P665J50211
$$ 2515528 2163007 1423267 863055 602822 511785 406467 336085 323460 331125 481336
9839D81336K17586L72400M03462K57507Q9901j4314j72956l61967l28869k88926
$$ 481336 698922 1071322 1474784 1732291 1822192 1807878 1634922 1272955 944086 655160
9829F55160k74239j30720m1931m0777l4188K237r1K7174o9677k7214M0027K3467
$$ 655160 380921 250201 208270 167493 133305 135542 135451 162625 92948 65734 105761 129228
9817A29228n4505q2389N688J055k0784M945M2861j2941q419n4706l9744J7745
$$ 129228 74723 -7666 -1978 -923 -21707 -16762 26099 13158 4739 -49967 -89711 -71966
9805g1966J5228N3152k2194O990m234k761J3092K954M609r981n0388k3130N0978
$$ -71966 -56738 -3586 -25780 -18790 -23024 -25785 -12693 -9739 -5130 -15111 -65499 -88629 -37651
9792c7651K0733j9211K0635N9322k8250m4661q7589K9669P975K0634N0764K5021
$$ -37651 -16918 -36129 -15494 43828 15578 -29083 -116672 -87003 -79028 -58394 -7630 17391
9780A7391l5668j1319j4598o770k8059j3952K3396j5866m1494k4960K9047P0260
$$ 17391 -18277 -29596 -44194 -50964 -79023 -92975 -69579 -85445 -126939 -151899 -122852 -52592
9768e2592N4984j9564K8903j4864r972j1943J0305J1620J5101q011m7378l0664
$$ -52592 2392 -17172 11731 -3133 -13105 -25048 -14743 -3123 11978 3967 -43411 -74075
9756g4075l0096J8010n358J0764K4038M0809J23769q436o4915m7695j9878K114
$$ -74075 -104171 -86161 -91519 -80755 -56717 -15908 107861 99425 34510 -13185 -33063 -30949
9744c0949K2749K3533m5506m354n977n2322K6864M0639M3785l1792K950k7874
$$ -30949 -8200 15333 -30173 -34527 -40504 -92826 -65962 -25323 18462 -13330 -10380 -38254
9732c8254M743j80k2223j5121k4728M64J0015L7091m401J2760q868L6660P152
$$ -38254 -33511 -33691 -55914 -71035 -95763 -95299 -85284 -48193 -52594 -39834 -48702 -12042 -4890
9719d890J5955K3877O462k3161l7718o9754n1878L1120K8562K7959k207l9533
$$ -4890 11065 34942 41404 18243 -19475 -89229 -141107 -109987 -81425 -53466 -55673 -95206
9707i5206K5967p318j148J5257R974J2536j0755n8922m720q079J01575P169o5457
$$ -95206 -69239 -76557 -77705 -62448 -52474 -39938 -50693 -109615 -114335 -122414 -20839 -13670 -79127
9694g9127j4821j0893J3302J2516j6852m297K0217L8052M5821o4139j0201L3124
$$ -79127 -93948 -104841 -91539 -79023 -95875 -100172 -79955 -41903 3918 -60221 -70422 -37298
9682c7298L0348J9682j4742p3782k1336R9399q92N122K896J8193k8045l5561O789
$$ -37298 -6950 12732 -2010 -75792 -97128 2271 1379 6501 9397 27590 -455 -36016 -29227
9669b9227J3686J2308L3568k3942m6323Q029K9481Q4649N4923l0951p1263o4069
$$ -29227 -15541 -3233 30335 6393 -39930 -31901 -2420 82229 137152 106201 34938 -29131
9657b9131j6871M6622O52J282M8558J5229J5266p324J5981j5361j4141M6151r244
$$ -29131 -46002 620 1272 2554 51112 66341 81607 74283 90264 74903 60762 106913 97669
9644I7669q4927j1040J7464P303L6436J3040k6977j7188L3800j7322k0810N587
$$ 97669 12742 1702 19166 26469 62905 75945 48968 31780 65580 48258 27448 33035
9632C3035n9427l1770N1731n29j6115J5705Q593J810N6963n2179l9792Q1042M1036
$$ 33035 -26392 -58162 -6431 -6960 -23075 -7370 1223 3033 59996 7817 -31975 49067 90103
9619I0103J5638j4922L4345J2012o1423n6919j8246L38m6930o0029k0903L7406
$$ 90103 105741 90819 125164 137176 75753 18834 588 926 -46004 -106033 -126936 -89530
9607h9530L0970N2736K4177Q9212L2194q2423o0273J2103l897R16J8423m0044
$$ -89530 -58560 -5824 18353 107565 139759 57336 -2937 9166 5269 6185 24608 -15436
9595a5436L095N0487L3372j5317n9262j1370N842k0876L3484P008k854J271l1459
$$ -15436 -12341 38146 71518 56201 -3061 -14431 -8589 -29465 4019 11027 8173 9444 -22015
9582b2015l275J1218K8334J4040M9751N1522l7013K3470k1528O96o9761m0148
$$ -22015 -25290 -14072 14262 28302 78053 129575 92562 116032 94504 95200 25439 -14709
9570a4709p213R665N6797M3312p9524o2791J4554O274J1047K8180K4810J6601
$$ -14709 -21922 -12257 44540 87852 8328 -54463 -39909 -33635 -22588 5592 30402 47003
9558D7003J4171k7390l6558l6257J8734J1155M296J5375j7582J3491L5360l1859
$$ 47003 61174 33784 -2774 -39031 -20297 -9142 -4846 10529 -7053 6438 41798 9939
9546I939r982N4437J5115K610n6353k815M7016J4310r7563n3470l9114j5558k2851
$$ 9939 -43 54394 69509 72119 15766 12951 59967 74277 -23286 -76756 -115870 -131428 -154279
9533a54279N3039M9553Q5220N1249J3485K971j023j2726p489k7907l705K0875
$$ -154279 -101240 -51687 33533 84782 98267 101238 100215 87489 80000 52093 48388 69263
9521F9263m8215J6465p046k6303j1385n499L2772P4643j7394m0947K23N1383J5664
$$ 69263 21048 37513 30467 4164 -7221 -12720 20052 94695 77301 36354 36577 87960 103624
9508A03624k8329k2308K2389J7767r0000r3591M2295p477K4878J11330K6763l6526
$$ 103624 75295 52987 75376 93143 3143 -90448 -48153 -55630 -30752 80578 107341 70815
9496G0815o8935M565N3742Q741O804p5679l6358K6149N8367l0162p4836k8427
$$ 70815 1880 6445 60187 68928 75732 53 -36305 -10156 48211 18049 -56787 -85214
9484h5214L1792K8927L0143L2686q1241k4297K8064R2857p825o8527M8008k7760
$$ -85214 -53422 -24495 5648 38334 -42907 -67204 -39140 53717 45892 -22635 25373 -2387
9472b387j9442K2882N063m0779J7220j3426o738K2383m612L507l8189k9070L2437
$$ -2387 -21829 1053 6116 -34663 -17443 -30869 -37607 -15224 -19836 -16329 -54518 -83588 -51151
9459e1151K5202m2761O043k4788Q9546K6898P0132l675L5946r427m053m0193n8525
$$ -51151 -25949 -68710 -62667 -87455 2091 28989 99121 95446 131392 121965 117912 77719 19194
9446A9194l5400M2554K9443r643K053j2814l9821Q103j6280m929q437J3696J1850
$$ 19194 -16206 26348 55791 46148 48201 35387 -4434 3669 -12611 -17540 -25977 -12281 -431
9433d31K566K4083Q765m316N7224N7384k273j07909k5739N1652J202j7452K6164
$$ -431 2135 26218 34983 30667 87891 145275 143002 35093 9354 61006 62208 44756 70920
9420G0920n803N174J3081m1765o1403M7259K9187O1265J075o4211k7838M863J7158
$$ 70920 65117 70291 83372 41607 -19796 27463 56650 117915 118990 54779 26941 31804 48962
9407D8962J2235q391L1344J3360m1K4351l6946r2844K0536O703L2825K2224M7824
$$ 48962 61197 52806 84150 97510 97469 121820 84874 -7970 12566 19269 52094 74318 122142
9394A22142n643k6270m5332k6108K7366r511l5952M4339k8970j1455K6161j2033
$$ 122142 116499 90229 44897 18789 46155 36644 692 45031 16061 4606 30767 18734
9382A8734K5686K8146K0179k309J1767N7910j8466j2742j7273m8403k4490j4539
$$ 18734 44420 72566 92745 90436 102203 160113 141647 128905 111632 63229 38739 24200
9370B4200J2521k3053L2740M9603j7194k3935O0485K4597n375R508j7311n3270
$$ 24200 36721 13668 46408 96011 78817 54882 115367 139964 134589 144097 126786 73516
9358G3516q3080N26N2306M1634p168n9798n0505J2469q523J0961N0912O7098j0155
$$ 73516 -9564 -9038 43268 84902 77734 17936 -32569 -20100 -28623 -17662 33250 100348 90193
9345I0193p530p385m4143M6444k8362L323O3453M8375P483k3565j7657p2600J7038
$$ 90193 82663 75278 31135 77579 49217 52540 115993 164368 171851 148286 130629 58029 75067
9332G5067N6562K6799k0825m9763k9530k8565l7188K4813P5618M440l2962N2593
$$ 75067 131629 158428 137603 87840 58310 29745 -7443 17370 92988 97428 64466 117059
9320A17059J5696n5709j9231J3420k4656O236J5003J1357P236j264m9714p6222
$$ 117059 132755 77046 57815 71235 46579 52815 67818 79175 86411 85147 35433 -40789
9308d0789J0452K3122j0894M7292Q6927l8741l7346J2259J5182J7448L0937K231
$$ -40789 -30337 -7215 -18109 29183 116110 77369 40023 52282 67464 84912 115849 118080
9296A18080L9k2654l857M2536m0076n1347R048j7171M98L9967M6118m6689J936
$$ 118080 118119 95465 91608 134144 94068 42721 51769 34598 35096 75063 121181 74492 76428
9283G6428N1429K1384K0151O5073J8298j29290j6453j4032K9317n058J233k1676
$$ 76428 127857 149241 169392 234465 252763 123473 107020 92988 122305 117247 118480 96804
9271I6804r851L5863L7045K4830k801k4503l8134K1109k12k5537L367J7755Q969
$$ 96804 86953 122816 159861 184691 181890 157387 119253 140362 140150 114613 117980 135735 144704
9258A44704R189K2201J957L7294N691m39K7894O135j6824j253j0194K4089m5361
$$ 144704 153893 176094 178051 215345 221036 220597 248491 254626 237802 236549 226355 250444 205083
9245B05083k4127O7364N1996m3698J6558k4471J636O565k9158m13K1472k6996
$$ 205083 180956 248320 300316 256618 273176 248705 250341 256906 227748 227335 248807 221811
9233B21811L1643P3685j8997k8963j2500k6519l9065L4649j5629M1763L4238n1949
$$ 221811 253454 327139 308142 279179 266679 240160 201095 235744 220115 261878 296116 244167
9221B44167l7944n924R2613r614o6959Q680N9011N4154K0184K4508k6263j4308
$$ 244167 206223 200299 292912 283298 216339 225019 284030 338184 358368 382876 356613 342305
9209C42305L3746l1423Q044P1683N4841n913o705M6030L3728L5487l552L5320
$$ 342305 376051 344628 352672 424355 479196 473283 466578 512608 546336 581823 578271 613591
9197F13591k395l4780J6071m6934L2010o100K1704O3979O1958J4546J3285m4787
$$ 613591 611196 576416 592487 545553 577563 571463 593167 657146 719104 733650 746935 702148
9185G02148N7079J00595M4868R8121Q4063M911K5903O8369J20428J71187J55185
$$ 702148 759227 859822 904690 1002811 1086874 1091785 1117688 1186057 1306485 1477672 1632857
9174A632857J20065J28793J45888J68281J45986K18461K74933K93521L91431L85691
$$ 1632857 1752922 1881715 2027603 2195884 2341870 2560331 2835264 3128785 3520216 3905907
9164C905907L95777N39504O13981P75805Q90561R29580J038278J065502R99561
$$ 3905907 4301684 4841188 5455169 6230974 7121535 8051115 9089393 10154895 11154456
9155A1154456Q72819O88504L57104k4566l95896o88272r51704j095122j058230
$$ 11154456 12027275 12715779 13072883 13048317 12652421 11964149 11012445 9917323 8859093
9146H859093r92592r09476q19796o97386o63739n84472m92786l72042l18468k95225
$$ 8859093 7866501 6957025 6137229 5439843 4776104 4191632 3698846 3326804 3008336 2713111
9136B713111k35336k46785k01513j44509j17589j28828j50697j02169k7610q5290
$$ 2713111 2477775 2230990 2029477 1884968 1767379 1638551 1487854 1385685 1358075 1272785
9126A272785j30462j15504n8668m5058p0554l6881o1824l7178n4718k8015k4377
$$ 1272785 1142323 1026819 968151 923093 852539 815658 753834 716656 661938 633923 609546
9115F09546q7361M901m08j1193L6813M4107M071j06793n8948k0936l4804L7924
$$ 609546 522185 527086 526678 515485 552298 596405 600476 493683 434735 413799 378995 416919
9103D16919Q2246L0353k1109p2035o7137l9770j3140M3784R1128m4911m9308n0085
$$ 416919 499165 529518 508409 436374 369237 329467 316327 360111 451239 406328 357020 306935
9091C06935l9230l941J7339j0204p125j5525j0571j4678K0107K0009L1298o9616
$$ 306935 267705 263764 281103 270899 263774 248249 237678 223000 243107 263116 294414 224798
9079B24798k8574M5935j3395n3543k0794l495J0671j9312N609M2970j5370P158
$$ 224798 196224 242159 228764 175221 154427 150932 161603 142291 147900 190870 175500 182658
9067A82658N9719J1045p167M1893L1609j6389o2898M0457N1238o5959k9300q490
$$ 182658 242377 253422 246255 288148 319757 303368 240470 280927 332165 266206 236906 228416
9055B28416J9232N482K5568L3140j8050k4752k398p793L269J6785p4581m2354
$$ 228416 247648 253130 278698 311838 293788 269036 266638 258845 262114 278899 204318 161964
9043A61964l6284J03603O6459n0542k6897l4599l1113J1824J1833K1703K3329
$$ 161964 125680 229283 295742 245200 218303 183704 152591 164415 176248 197951 221280
9032B21280J3832L9949m9935o8599K7346K4902J8086p9051l0691j3896K5164Q0863
$$ 221280 235112 275061 225126 156527 183873 208775 226861 147810 117119 103223 128387 209250
9020B09250N637o1105L3080r850j668L2294J2204o6475l5101P990L8987J3915
$$ 209250 214887 153782 186862 177012 175344 207638 219842 153367 118266 126256 165243 179158
9008A79158m2644k3634M0888M9941l1608k0826m0293O1765m1020J0290K165l5151
$$ 179158 136514 112880 153768 203709 172101 151275 110982 172747 131727 142017 144182 109031
8996A09031k2425K7315N559L3847M5077k9167M760j742L129q753L7377L108L036
$$ 109031 86606 113921 119480 153327 198404 169237 173997 172255 175384 166631 204008 207116 210152
8983B10152k8111j2162l1772j0070k1198k7849Q733k7219N8745M8544n2821n7545
$$ 210152 182041 169879 138107 128037 106839 78990 87723 60504 119249 167793 114972 57427
8971E7427j9340l639n971p573J3827K6640L9722J509j2887j6524n5493p4219N359
$$ 57427 38087 34448 28477 20904 34731 61371 101093 102602 89715 73191 17698 -56521 -51162
8958e1162R0944P056k0414m0380l4700N952N2307N8344K7294k3397M1626k0399
$$ -51162 39782 46838 26424 -13956 -48656 -42704 9603 67947 95241 71844 113470 93071
8946I3071L6153L3467n1187o6137n4893L5095O6461N7686j2603j2828j884k784
$$ 93071 129224 162691 111504 45367 -9526 25569 92030 149716 137113 124285 122401 119617
8934A19617L6074m659n6353m2387j5256j1339Q842K4880l326M1738k823J5440
$$ 119617 155691 151032 94679 52292 37036 25697 34539 59419 56093 97831 95008 110448
8922A10448J9653l247J3639p7810n0991n9433M6159L6970J2201k5636N203M0195
$$ 110448 130101 126854 140493 62683 11692 -47741 -1582 35388 47589 21953 27156 67351
8910F7351N0880L366l4527l0715r2919m903K5363M5844K0817L9659J68K31j4462
$$ 67351 118231 121597 87070 56355 -36564 -41467 -16104 29740 50557 90216 90384 90615 76153
8897G6153k1601K515K931N158j7394L7366L0459J0899j6507J015l1796m1664K2482
$$ 76153 54552 57067 59998 65156 47762 85128 115587 126486 109979 110994 79198 37534 60016
8884F0016L2280p0817l9004N2916J4848j158m9390r309J9115k4380j3767j8171
$$ 60016 92296 21479 -17525 35391 50239 49081 -309 -9618 9497 -14883 -28650 -46821
8872d6821P8733M0571m160l076l0574k6289n1614J849j728K3799M8866P656p504
$$ -46821 31912 72483 68323 65247 34673 8384 -43230 -41381 -43109 -19310 29556 37212 29708
8859B9708k3187n0565K9478N5213M3533k9748l7814R924M384K7168L5222n034
$$ 29708 6521 -44044 -14566 40647 84180 54432 16618 26542 30926 58094 93316 88282
8847H8282p711O075j6287l7945P2223P734o5479l6277O830R241m2369K7856l180
$$ 88282 80571 86646 70359 32414 104637 112371 46892 10615 17445 26686 -15683 12173 8993
8834H993n8020R0204J30299K3138l1281o1387p7840j8420K923N7923l1299k6672
$$ 8993 -49027 41177 171476 194614 163333 101946 24106 5686 8609 66532 35233 8561
8822H561L4032n1005q6034M6170J11153N9679j4333o5932R426N1324j686l1543
$$ 8561 42593 -8412 -94446 -48276 62877 122556 108223 42291 51717 103041 101355 69812
8810F9812j9576j5096m6215L3237j9772N2050J4321M896O020Q2540k381m4677
$$ 69812 50236 35140 -11075 22162 2390 54440 68761 73657 79677 162217 159836 115159
8798A15159M240l7028r4021M8169Q5349J3200m2989j6480J7004k7735O243k5364
$$ 115159 119399 82371 -11650 36519 121868 135068 92079 75599 92603 64868 71111 45747
8786D5747M984L7829K914l6465m4737K702l2036J0213K0265K9513q732R814j640
$$ 45747 50731 88560 91474 55009 10272 12974 -19062 -8849 11416 40929 32197 42011 40371
8773D0371M2005o0486p3900Q243j968n3070p432N7387R6273J7016J4893J1033
$$ 40371 82376 21890 -52010 -43767 -45735 -98805 -106237 -48850 47423 64439 79332 90365
8761I0365n4249K8168J4300l5921p4295K2472L8644o622m8083j4534J7901n255
$$ 90365 36116 64284 78584 42663 -31632 -9160 29484 22862 -25221 -39755 -21854 -27109
8749b7109L3467P944N717M5270j0019l9352K7380o4971n882N0402K7766K2655
$$ -27109 6358 14302 20019 65289 55270 15918 43298 -21673 -27555 22847 50613 73268
8737G3268k9799m3745K9101n815l4046M5083K5329k0147K1609j5215n480P3118
$$ 73268 43469 -276 28825 23010 -11036 34047 59376 39229 60838 45623 40143 113261
8725A13261L8164l9724n2618k3419R684L2832K1479j4580q047P4308l389J8780
$$ 113261 151425 111701 59083 35664 45348 78180 99659 85079 77032 151340 147951 166731
8713A66731m4371n3353M268N4223K6593j6653m7037n9946n821P1053j076k1791
$$ 166731 122360 69007 73275 127498 154091 137438 90401 30455 24634 95687 94611 72820
8701G2820o2537R113N3615J0880r490l5369q5258J3687J04192k047N3922N2157
$$ 72820 10283 19396 73011 83891 74401 39032 -46226 -32539 71653 69606 123528 175685
8689A75685n1643k4044p673j2440j3399l5780l990K6554J727L1307j3151k0679
$$ 175685 124042 99998 92325 79885 66486 30706 26716 53270 54997 86304 73153 52474
8677E2474M3551L6195R310N950k9439n5428j6971J5024P3764M4416p5888n2658
$$ 52474 96025 132220 141530 147480 118041 62613 45642 60666 134430 178846 102958 50300
8665E0300J9947J6602M0734L3777r2778q520L4787K0742P8582K5449K1625R878
$$ 50300 70247 86849 127583 161360 68582 60062 94849 115591 194173 219622 241247 251125
8653B51125M4555J10076K72914J24042j38804j66234j10805j8330n5074p1045
$$ 251125 295680 405756 678670 802712 663908 497674 386869 368539 313465 242420
8643B42420q0334j9276m5795J1777j7088K9020J9332j3105K3078q437J3276N1156
$$ 242420 162086 142810 97015 108792 91704 120724 140056 126951 150029 141592 154868 206024
8631B06024P3737k780r8605N699O7896N2547k733n4834k8012k1200j3558J9436
$$ 206024 279761 276981 178376 184075 251971 304518 301785 246951 218939 197739 184181 203617
8619B03617M5950L8941k0068m628O1115m253m3236L6406P4080N4864Q4679K00127
$$ 203617 249567 288508 268440 263812 324927 320674 277438 313844 387924 442788 527467 727594
8607G27594K82977M76396L41607j48265l29971k41218j27504o6141l2625O12R744
$$ 727594 1010571 1486967 1828574 1680309 1350338 1109120 981616 915475 882850 883462 893206
8596H93206k8863l3297j05261j49117l7100n2940r1031j16805q3446M5640j1775
$$ 893206 864343 831046 725785 576668 539568 486628 395597 278792 195346 240986 229211
8585B29211m166m3691k6295J3368p5227n9904j7499M4963K5257O7881K0056o5460
$$ 229211 225045 181354 155059 168427 93200 33296 15797 60760 86017 153898 173954 108494
8573A08494j6074J4921k6960J3619N8997m258j4829J7331J1846Q393O5110R5833
$$ 108494 92420 107341 80381 94000 152997 148739 133910 151241 163087 171480 236590 332423
8561C32423J36294J96088n0822j64011j29500j31145m5858L8006m7396R016Q301
$$ 332423 468717 664805 613983 449972 320472 189327 143469 181475 134079 143095 151396
8550A51396j5859n7911n2450M3573J6543K0408m4527n7271K6694P2058l288r1396
$$ 151396 135537 77626 25176 68749 85292 105700 61173 3902 30596 102654 99366 7970
8538G970j9492N1738Q0400K8033L621l3860j2619P4845J6537n5632o7223n4696
$$ 7970 -11522 40216 120616 148649 152270 118410 105791 180636 197173 141541 74318 19622
8526A9622K6284K5118j6550r813N185L0894J4217k3576j8195m5966p103J3597
$$ 19622 45906 71024 54474 44661 49846 80740 94957 71381 53186 7220 117 13714
8514A3714j0595j6334N4494O465k5805n3283J2158J7410Q0834L9301L732j5591
$$ 13714 3119 -13215 41279 47744 21939 -31344 -19186 -1776 79058 118359 122091 106500
8502A06500N9746l3602n6147n8673j7563L9868N2189K7971K7450N6271n6088p6682
$$ 106500 166246 132644 76497 17824 261 40129 92318 120289 147739 204010 147922 71240
8490G1240k104N0073M0567p150J1516k0075m4663j3141n612p4l5395k5905O3849
$$ 71240 69136 119209 159776 152626 164142 144067 99404 86263 80651 80577 45182 19277 83126
8477H3126L8927M7954j3010l6436l7452L338n9221r91L4019J3578m885q436L312
$$ 83126 122053 170007 156997 120561 83109 86447 27226 26235 60254 73832 68947 60511 63823
8464F3823l5253j4881Q0646j5074k943j26389m4816J2008N5647p8396j5941O3937
$$ 63823 28570 13689 94335 79261 76318 -50071 -94887 -82879 -27232 -105628 -121569 -57632
8452e7632O3845Q1684o9081k0750J8767L4944P005j1143L921j1775k2272j3996
$$ -57632 6213 87897 18816 -1934 16833 51777 58782 47639 51560 39785 17513 3517
8440C517L9676n065k6877O1538j7296j2857k2360l8503J6405j3236N2406M7921
$$ 3517 43193 38128 11251 72789 55493 42636 20276 -18227 -1822 -15058 37348 85269
8428H5269l3267q4874K107j2055L6017Q1583K9130l9091k7159o1598N9629K4306
$$ 85269 52002 -32872 -30765 -42820 -6803 74780 103910 64819 37660 -23938 35691 59997
8416E9997J3505K038q6526k5513K8248K4592l9102k5314o4045l9764L4984N4081
$$ 59997 73502 75540 -10986 -36499 -8251 16341 -22761 -48075 -112120 -151884 -116900 -62819
8404f2819l617K64P4470j0617m5215L2420L9652j2099l2727L456l0566L2030M6228
$$ -62819 -66436 -66172 8298 -2319 -47534 -15114 24538 12439 -20288 -16832 -47398 -15368 30860
8391C0860M715l6887k512j2820m404K9154J1688L1631q373j4935k6357l6535M989
$$ 30860 35575 -1312 -3824 -16644 -21048 8106 19794 51425 43052 28117 1760 -34775 -29786
8378b9786L2665K5732n94p369l5196J2324N1516m241k2177k9630J4741k6031j5735
$$ -29786 2879 28611 28017 20648 -14548 -2224 49292 45051 22874 -6756 7985 -18046 -33781
8365c3781R3873Q160O614L6036N0222r3801n8853J0066K2256k882l1233l5972
$$ -33781 60092 68252 74866 110902 161124 67323 8470 18536 40792 37910 6677 -29295
8353b9295M8751j5586K7165K9439l9845J4722K6771l5763p936L0931K2844o668
$$ -29295 19456 3870 31035 60474 20629 35351 62122 26359 18423 49354 72198 65530
8341F5530n4789l0144N677J1365j0867J8945j9093l0518l0483L4927P1722j5119
$$ 65530 10741 -19403 -13726 -2361 -13228 5717 -13376 -43894 -74377 -39450 32272 17153
8329A7153j7810l9320n993j4879K1680M7117l5673K5905L3177J062j0116q225
$$ 17153 -657 -39977 -45970 -60849 -39169 7948 -27725 -1820 31357 32419 22303 14078
8317A4078k6366J4970M9524K636m8397r493n84k4251L0089J6499l3085j2035J1114
$$ 14078 -12288 2682 52206 54842 6445 -3048 -3632 -27883 2206 18705 -14380 -26415 -15301
8304a5301J1285N9063J8545l1129J3658L2417n4041n1280N75O2295n623l0140
$$ -15301 -4016 55047 73592 42463 56121 88538 34497 -16783 -16208 46087 40464 10324
8292A0324m2414r26N64n1882M1148K9351o435J2796j3580k0636L7065M1430j751
$$ 10324 -32090 -33016 -32452 -84334 -43186 -13835 -20270 -7474 -21054 -41690 -4625 36805 35054
8279C5054j7478m1315l5717M138k661J6553m9791M3999Q0911J010j4882L3340
$$ 35054 17576 -23739 -59456 -55318 -57979 -41426 -91217 -47218 33693 34703 19821 53161
8267E3161J4519o501j00096Q466K8371k9292O014p887k8268Q6243J414k7456n184
$$ 53161 67680 61179 -38917 -30451 -2080 -31372 -25358 -33245 -61513 24730 26144 -1312 -6496
8254f496k3888o481J645k398p813Q170K7479J7580M6397K8082m161K2674o5470
$$ -6496 -30384 -36865 -35220 -37618 -45431 -37261 -9782 7798 54195 82277 78116 100790 35320
8241C5320n3742k0180J4982Q7099j6536q872M6995P897o1262o3433J4355L2372
$$ 35320 -18422 -38602 -23620 63479 46943 38071 85066 92963 31701 -31732 -17377 14995
8229A4995K0090k6511K620L0204L0941K2597k6044p8497K82N0245L6495J2544
$$ 14995 35085 8574 11194 41398 72339 94936 68892 -9605 -9323 40922 77417 89961
8217H9961K0472n2725l3331n0401j9522k641K4630L7415K0424j9318k9507K0007
$$ 89961 110433 57708 24377 -26024 -45546 -48187 -23557 13858 34282 14964 -14543 5464
8205E464K9791N0812Q837j33787o6605N6524R1778L9154K4322P446R641p8664
$$ 5464 35255 86067 94904 -38883 -105488 -48964 42814 81968 106290 113736 123377 44713
8193D4713n3389l9697M2010K8557M5942K4153J2442j030q8500j4032M9004J8032
$$ 44713 -8676 -48373 -6363 22194 68136 92289 104731 103701 15201 1169 50173 68205
8181F8205r823n5812N5983M9237j9100l2664q403J8143m2090r406p312M0615J2059
$$ 68205 58382 2570 58553 107790 88690 56026 47623 65766 23676 14270 6958 47573 59632
8168E9632j3537r971k9511J7598Q291M2346j709k3602n36M5106q004k3641l729
$$ 59632 46095 36124 6613 24211 32502 74848 73139 49537 49001 94107 86103 62462 58733
8155E8733k5464K812P6151J3007m217m9527l3332J1726l2943K0126j172j4292
$$ 58733 33269 36081 112232 125239 121022 71495 38163 49889 16946 37072 35900 21608
8143B1608K7055M2956o749l557N2351K7744p1987n3621l8053L0727J1627p7781
$$ 21608 48663 91619 84870 81313 133664 161408 89421 35800 -2253 28474 40101 -37680
8131c7680J6379P430m4301j0078K5233j2412m585m448M2631M6145K1279K499n392
$$ -37680 -21301 -13871 -58172 -68250 -43017 -55429 -60014 -64462 -21831 24314 45593 48092 42700
8118D2700K3086P529l8868K87j5012J0663PK3086L5359q525o519k0257K0736k7408
$$ 42700 65786 73315 34447 34734 19722 30385 30392 53478 88837 80312 73793 53536 74272 46864
8104D6864l1240l9888j1172L8481L8489K0988P973j7355j981p0409n5524l678
$$ 46864 15624 -24264 -35436 3045 41534 62522 70495 53140 51159 -19250 -74774 -78452
8092g8452M2576J0580k9602K499O974l305M8015M487o8378p0150p76Q5798J8216
$$ -78452 -35876 -25296 -54898 -52399 -45425 -48730 -715 3772 -64606 -134756 -135532 -49734 -31518
8079c1518r175n5943L8702K3185m5068j1710O833Q5299J1067Q671J7845p41l0676
$$ -31518 -40693 -96636 -57934 -34749 -79817 -91527 -84694 605 11672 20343 38188 37447 6771
8066F771j8489K8109P872k1257L1538P5707K7478o2775k026l502K0547q38L3002
$$ 6771 -11718 16391 24263 3006 34544 110251 137729 74954 72928 69426 89973 89135 122137
8053A22137j450p1777p1312p596K59P1538Q330p5697j8045K3932K6173J4419j627
$$ 122137 120687 48910 -22402 -29998 -29739 41799 50129 -25568 -43613 -19681 6492 20911 19284
8040A9284J569p4841N407O0557K9426K1371J1840J6984J849M6783l8655l6165
$$ 19284 20853 -53988 -48581 11976 41402 62773 74613 91597 93446 140229 101574 65409
8028F5409J4116M92J509L8888Q424m4557l7462j7861L1604k141J4365j1261o3893
$$ 65409 79525 80017 81526 120414 128838 84281 46819 28958 60562 58421 72786 61525 -2368
8015b368k7913j777K8388K2498m5823k0591J4443M9510K0360M4565M4679M4826
$$ -2368 -30281 -32058 -3670 18828 -26995 -47586 -33143 16367 36727 81292 125971 170797
8003A70797k6127m7367p050M8498J8432j7380p0349l8906m80M112M4636M1010
$$ 170797 144670 97303 90253 138751 157183 139803 69454 30548 30068 34180 78816 119826
7991A19826k0672p6036M8473L76M1908j2443n8549j9819K1439q116m1933l783
$$ 119826 99154 23118 71591 71967 113875 101432 42883 23064 44503 36387 -5546 -9329
7979i329l243L0398J9597L2032P3887K0768k8328M1138l6863j2433L0135K5692
$$ -9329 -12572 17826 37423 69455 143342 164110 135782 176920 140057 127624 157759 183451
7967A83451N3833l549p5735p7246K287m0460K3802P2365o633l7836J0239K0862
$$ 183451 237284 233735 158000 80754 83041 42581 66383 138748 132115 94279 104518 125380
7955A25380q5011l8257L7454P0817M9217k1165n9046o1495j2888n764k7455J4282
$$ 125380 40369 2112 39566 110383 159600 138435 79389 17894 5006 -758 -28213 -13931
7943a3931L8175L3168Q035N002m4260l2487R987K79L0493O675k0084J6111r870
$$ -13931 24244 57412 65447 70449 26189 -6298 3689 3968 34461 41136 21052 37163 27293
7930B7293j8206P258L9946N5530R235k4809j3212l3435q782L9449K1392l2436
$$ 27293 9087 16345 56291 111821 121056 96247 83035 49600 40818 80267 101659 69223
7918F9223R88J7744j0171l1329M0460J030n9997j8870l118K9643k0543j6597k5680
$$ 69223 70211 87955 77784 46455 86915 87945 27948 9078 5960 35603 15060 -1537 -27217
7905b7217J2740N046q788n375N571Q141L7121Q452p7363L859j8908n387P4328
$$ -27217 -14477 -9431 -18219 -23594 -18023 -9882 27239 35691 -41672 -37813 -56721 -62108 12220
7892A2220L5106K264O902k3435P597L7063k8224o356r415o7232N6518M9983j8670
$$ 12220 47326 49590 56492 33057 40654 77717 49493 43137 33722 -33510 23008 72991 54321
7879E4321j5009m4502Q020j3476r005o528J0897m9842o0369J1236M3207P8539
$$ 54321 39312 -5190 2830 -10646 -19651 -26179 -15282 -65124 -125493 -114257 -71050 7489
7867G489N5122k855m4501l7701p581o21l6765L2939j787l5403J4199O5407O2737
$$ 7489 62611 59756 15255 -22446 -30027 -30648 -67413 -34474 -36261 -71664 -57465 7942 70679
7854G0679O5930l9605r6563j725K3859l8171n4744L2347P4585l4743j5151j8541
$$ 70679 136609 97004 441 -1284 22575 -15596 -70340 -37993 36592 1849 -13302 -31843
7842c1843k7225r444M4848O3377O4421l7228j12375M57j5654P533k4278j1606
$$ -31843 -59068 -68512 -23664 39713 104134 66906 -45469 -45012 -60666 -53133 -77411 -89017
7830h9017N0756j441K0943P480l660m7944m5945K3423J07276j2597o6780l0556
$$ -89017 -38261 -39702 -18759 -11279 -14939 -62883 -108828 -85405 21871 9274 -57506 -88062
7818h8062M7542l740L4783j0491N753j8689l0318k5775K7426N967l1058j9072
$$ -88062 -40520 -44260 -9477 -19968 -14215 -32904 -63222 -88997 -61571 -55604 -86662 -105734
7806a05734L8194N2480j3537J8195K6614m1509j3685K0496J2995L0416n4469m0598
$$ -105734 -67540 -15060 -28597 -10402 16212 -25297 -38982 -18486 -5491 24925 -29544 -70142
7794g0142M1727J2631N379K8307p353n9693p2325J4378O9253K9615K3900J6551
$$ -70142 -28415 -15784 -10405 17902 10549 -49144 -121469 -107091 -37838 -8223 15677 32228
7782C2228l8084j3065l7793K7750N8859N0506n7959p2030j8545K610P0023R6533
$$ 32228 -5856 -18921 -56714 -28964 29895 80401 22442 -49588 -68133 -65523 4500 101033
7770A01033l5583q3587k2902K0625j2148k1739N4418k2J0529j5109m1645m2929
$$ 101033 65450 -18137 -41039 -20414 -32562 -54301 117 95 10624 -4485 -46130 -89059
7758h9059N6195O2764p1649J3537j630L4796O2687j2984p0119r168m7870J7083
$$ -89059 -32864 29900 -41749 -28212 -29842 4954 67641 54657 -15462 -24630 -72500 -55417
7746e5417K8854R683J4740O5917k7204o7769J0733N3829O5520p720l0067p708
$$ -55417 -26563 -16880 -2140 63777 36573 -31196 -20463 33366 98886 91166 61099 53391
7734E3391J7166o3095l8874M9417K7157n1403k4209K3301J5765L625M1057N1072
$$ 53391 70557 7462 -31412 18005 45162 -6241 -30450 -7149 8616 12241 53298 104370
7722A04370L167o0810j28J4098m3743j0535p0386j7977K7881p364m832N1835K3536
$$ 104370 107537 46727 46599 60697 16954 6419 -63967 -81944 -54063 -61427 -66259 -14424 9112
7709I112j5290k0963K4009j5089N927O351Q271k0996k9074J0816L1546m355n0595
$$ 9112 -6178 -27141 -3132 -18221 -12294 -5943 2328 -18668 -47742 -36926 -5380 -9735 -60330
7696f0330j0908M815L7288L5721r09n7602L217K7976n4041O17l100R168n616K2729
$$ -60330 -71238 -66423 -29135 6586 5677 -51925 -48708 -20732 -74773 -74156 -77256 -68088 -73704 -50975
7682e0975K0059n284j1374j8274L4910K5779j4500L997K5873j02108K9598N9678
$$ -50975 -30916 -36200 -47574 -65848 -30938 -5159 -19659 -15662 10211 -91897 -62299 -2621
7670b621n4809j1306p530K8246L5353j7589L564m0749K3649j4847r911M1596M5317
$$ -2621 -57430 -68736 -76266 -48020 -12667 -30256 -26692 -67441 -43792 -58639 -68550 -26954 18363
7657A8363N4377J0355n4294o2455k0614m243p4712O0539P1938N946J8983l0387
$$ 18363 72740 83095 28801 -33654 -54268 -58511 -133223 -72684 -746 5200 24183 -6204
7645f204r35j580L7565j0227o217J2939J2037k8280k0110l1890o021k0113r150
$$ -6204 -7139 -8719 28846 18619 12402 25341 37378 9098 -11012 -42902 -48923 -69036 -78186
7632g8186Q802m3399m4657N3338K7827j1280N3011K9838n3046M0091N5101m3583
$$ -78186 -69384 -112783 -157440 -104102 -76275 -87555 -34544 -4706 -57752 -17661 37440 -6143
7620f143q0422m5672k1112L0728K876k0002J9185j4161K4176L6255M655K1830
$$ -6143 -86565 -132237 -153349 -122621 -119745 -139747 -120562 -134723 -110547 -74292 -69637 -47807
7608d7807Q3007k8471k7943k8508L1980p014l8090M191K8858k6056P5381M8735
$$ -47807 35200 6729 -21214 -49722 -17742 -24756 -62846 -58655 -29797 -55853 19528 68263
7596F8263j1775j9305p615L255n878o3453j7322L767J3697J3199M8459j9158p6820
$$ 68263 56488 37183 29568 32823 26945 -36508 -53830 -50063 -36366 -23167 25292 6134 -70686
7583g0686m6063L3056N3439j6619n6012k0447Q3256r568j7757o204R908K5858
$$ -70686 -116749 -83693 -30254 -46873 -102885 -123332 -40076 -49644 -67401 -73605 -63697 -37839
7571c7839m5686n1951j0542L5569J0697k6696J2611O5215M5760j4143r052L6632
$$ -37839 -83525 -135476 -146018 -110449 -99752 -126448 -113837 -48622 -2862 -17005 -26057 10575
7559A0575J1443m7791q2692r081M7514L8945J7830M1923j9195j9808k4120J0309
$$ 10575 22018 -25773 -108465 -117546 -70032 -31087 -13257 28666 9471 -10337 -34457 -24148
7547b4148j779k7043j6033l373L682j7633K3847J9307N9628J8610o5389n4787
$$ -24148 -25927 -52970 -69003 -72376 -68694 -86327 -62480 -43173 16455 35065 -30324 -85111
7535h5111l9010K5120O9690N2041P519k1012M1421k169l0200k3957l7441k2590
$$ -85111 -124121 -99001 -29311 22730 30249 9237 50658 48489 18289 -5668 -43109 -65699
7523f5699L1161L1969k0585K3427L893m6716o674k5276j312o0163K8827N5124
$$ -65699 -34538 -2569 -23154 273 4166 -42550 -49224 -74500 -75812 -135975 -107148 -52024
7511e2024j2696M337m845j4214K3491n4324K2955L4727l08m136J1336j4572K8984
$$ -52024 -64720 -60383 -65228 -79442 -55951 -110275 -87320 -52593 -52901 -57037 -45701 -60273 -31289
7498c1289m7841j327K1077O4343K5266K8961K1510k2409k0516p130n5739K7995
$$ -31289 -79130 -80457 -59380 4963 30229 59190 80700 58291 37775 30645 -25094 2901
7486B901M5345K955k3408k6640k4097L3390K8619k1389m999J8173k9346l6138
$$ 2901 48246 51201 27793 1153 -22944 10446 39065 17676 12677 30850 1504 -34634
7474c4634n0145K442N4975K0247l4720j5548N3820m2727j5795J9573O3226L4876
$$ -34634 -84779 -82337 -27362 -7115 -41835 -57383 -3563 -46290 -62085 -42512 20714 55590
7462E5590n1053l5276k0229m6115O0151M5548L5752L5460l6242K7345n853q0512
$$ 55590 4537 -30739 -50968 -97083 -36932 8616 44368 79828 43586 70931 65078 -15434
7450a5434p4506J2474K3734j1599J6048J4533N6529L2662m3564m6510L4695j0607
$$ -15434 -89940 -77466 -53732 -65331 -49283 -34750 21779 54441 10877 -35633 -938 -11545
7438a1545k0739J9779l6098l1562R636k4874q841M4745k9148L7209O7479o9918
$$ -11545 -32284 -12505 -48603 -80165 -70529 -95403 -104244 -59499 -88647 -51438 16041 -53877
7426e3877j02066O461J2870Q3710N3012M261J6994n1834p4131N012K4304R8692
$$ -53877 -155943 -149482 -136612 -52902 110 4371 21365 -30469 -104600 -99588 -75284 23408
7414B3408J8337k0040J413j8446j2683l1361J0910K3510n0867o7148M810K8040
$$ 23408 41745 21705 23118 4672 -8011 -39372 -28462 -4952 -55819 -122967 -118157 -90117
7402i0117m0946O240J7381M4223J7094P4523l970l2091n4714k6163J0524p648
$$ -90117 -131063 -124823 -107442 -63219 -46125 28398 24428 -7663 -62377 -88540 -78016 -85664
7390h5664k8172m031L2041k962j2067k896J1584M4843R979R409k5372j1010k8630
$$ -85664 -113836 -117867 -85826 -88788 -100855 -103751 -92167 -47324 -37345 -27936 -53308 -64318 -92948
7377i2948K361j7370L6835M8342K2994k4572r0102j4766J968j6080M3855Q3517
$$ -92948 -90587 -107957 -71122 -22780 214 -24358 -114460 -129226 -127258 -143338 -99483 -15966
7365a5966L7683k0628p3515K1299Q891l4807k7319k2715k0190J4896L0567K7396
$$ -15966 21717 1089 -72426 -51127 -42236 -77043 -104362 -127077 -147267 -132371 -101804 -74408
7353g4408j489N2239J3004J055K1567l5673j0018l0857j0766M1042k0751j9999
$$ -74408 -75897 -23658 -10654 -9599 11968 -23705 -33723 -64580 -75346 -34304 -55055 -75054
7341g5054K1534K7294K7958M5033j6649P631n67j2251K692J3042k1772k9984J3597
$$ -75054 -53520 -26226 1732 46765 30116 37747 37180 24929 27621 40663 18891 -11093 2504
7328B504l8678l8777J9044M2247L5214L5904j3910m0753j8604O485k0778o304
$$ 2504 -36174 -74951 -55907 -13660 21554 57458 43548 2795 -15809 -9324 -30102 -36406
7316c6406J7101l8209j1085K399j0575L9674L9600n721n231j4156J569k600k5070
$$ -36406 -19305 -57514 -68599 -66200 -76775 -37101 2499 -3222 -8453 -22609 -21040 -23640 -48710
7303d8710p9366J616L0400L6997J6467K1192M8216L0097p077j1959j9484k3721
$$ -48710 -128076 -126460 -96060 -59063 -42596 -21404 26812 56909 49832 37873 18389 -5332
7291e332k1675m77j2436J7418K0872K3607J3874K7420j8066k336j6902k3314k0064
$$ -5332 -27007 -27484 -39920 -22502 -1630 21977 35851 63271 45205 42869 25967 2653 -17411
7278a7411l5904K0519j5722k9936M3939L362J1946K6674K3820L5373J317j17562
$$ -17411 -53315 -32796 -48518 -78454 -34515 -31153 -19207 7467 31287 66660 67977 -49585
7266d9585j6732r495J8770o0412j9510J4782j8852L6811O3525L3173l0535k930
$$ -49585 -66317 -75812 -57042 -117454 -136964 -122182 -141034 -104223 -40698 -7525 -38060 -40990
7254d0990J5074K0221M6298P287o9948l0790j1905k3426k3471N4333K3219J7199
$$ -40990 -25916 -5695 40603 47890 -22058 -52848 -64753 -88179 -111650 -57317 -34098 -16899
7242a6899j3913J9479m7297j9558L4621N2101N436j5573l2914R469P4710j536
$$ -16899 -30812 -11333 -58630 -78188 -43567 8534 13970 -1603 -34517 -25048 49662 48126
7230D8126n9744N0936J0810p1272k8861k6202J7474K176n923L719k243L8614M3423
$$ 48126 -11618 39318 50128 -21144 -50005 -76207 -58733 -56557 -62480 -58761 -61004 -22390 21033
7217B1033J0324j4292j1074J5448P420N6645Q407m2325o0955l5887J6955J7301
$$ 21033 31357 17065 5991 21439 28859 85504 93911 51586 -9369 -45256 -28301 -11000
7205a1000p209l7998J1193l0429m2077M7298Q7665J3556m3737k4213q315J6009
$$ -11000 -18209 -56207 -45014 -75443 -117520 -70222 17443 30999 -12738 -36951 -45266 -29257
7193b9257o986K2484L1488k2110J60Q350L0564M6798j2481o4145k7738O2306L0409
$$ -29257 -36243 -13759 17729 -4381 -4221 4129 34693 81491 69010 4865 -22873 39433 69842
7180F9842L5520l4038o9752L487O5727p833m617r032k7658M0619p669m5674o0276
$$ 69842 105362 71324 1572 5059 70786 62953 58336 49304 21646 62265 54596 8922 -51354
7167e1354M5126Q104J3194m990J8371o3831l2390j8824k9197r311P568O7287L6726
$$ -51354 -6228 1876 15070 10080 28451 -35380 -67770 -86594 -115791 -125102 -117534 -50247 -13521
7154a3521k671l5936K2732O446K2207k943m3612j2518J0457j9691l0543q542M353
$$ -13521 -16192 -52128 -29396 -22950 -743 -3686 -47298 -59816 -49359 -69050 -99593 -108135 -103782
7141a03782N3088k0332k8791l2119J1550K6892N6908m3879K4233L6016k8233o5633
$$ -103782 -50694 -71026 -99817 -131936 -120386 -93494 -36586 -80465 -56232 -20216 -48449 -114082
7129a14082K1954K3495k8488K7706R7341j8609j284L1304O698K3580k8602o8257
$$ -114082 -92128 -68633 -97121 -69415 27926 9317 8033 39337 46035 69615 41013 -27244
7117b7244k0796M0764K6309J3844m6213m6020j4855J7050P6343K4609m4709r173
$$ -27244 -48040 -7276 19033 32877 -13336 -59356 -74211 -57161 19182 43791 -918 -10091
7105a0091K436r612l7347j6307j7509k752L8521K40l965K8769P682L587K7837
$$ -10091 -7655 -17267 -54614 -70921 -88430 -91182 -52661 -52421 -56386 -27617 -19935 -16348 11489
7092A1489r362l5410L1380K1584j5718p3500K3910L4916K3779m1103j9770k12
$$ 11489 2127 -33283 -1903 19681 3963 -69537 -45627 -10711 13068 -28035 -47805 -48017
7080d8017n072J485n623N2754n162o6815m531J04001K8868Q818m3515j1899k6882
$$ -48017 -53089 -51604 -57227 -4473 -9635 -76450 -80981 23020 51888 60706 17191 5292 -21590
7067b1590N0000L0496p5215o500L8215n644k7562m0189J8041N515k2578J6467
$$ -21590 28410 58906 -16309 -22809 15406 9762 -17800 -57989 -39948 -34433 -57011 -40544
7055d0544M6371j8428j2499q340q0635M173K8956M4633p634l6471n239O1288l450
$$ -40544 5827 -12601 -25100 -33440 -114075 -109902 -80946 -36313 -43947 -80418 -85657 -24369 -27819
7042b7819k0434N341M2003k6921J1833J1317O878q6060j0995J9167P333p318k1096
$$ -27819 -48253 -42912 -909 -27830 -15997 -4680 2198 -83862 -94857 -75690 -68357 -75675 -96771
7029i6771N0567Q2965K3633j1051m448r100m2787k6416k3246M433r164K5133m241
$$ -96771 -46204 36761 60394 49343 44895 35795 -6992 -33408 -56654 -52221 -61385 -36252 -40493
7016d0493l3480L0502Q0820l473J291M1726l3740o0714n9781j7728o74K1399P424
$$ -40493 -73973 -43471 37349 33876 35167 76893 43153 -17561 -77342 -95070 -95744 -74345 -66921
7003f6921N8785L3144L6080j75l1262m4793p200L3726l7942j8023J390N8523j6608
$$ -66921 -8136 25008 61088 60913 29651 -15142 -22342 11384 -26558 -44581 -43191 15332 -1276
6990a276K2253m966k0937M6223K0733q800k5367n1625M8977J8701p5249k6985
$$ -1276 20977 16011 -4926 41297 62030 53230 27863 -23762 25215 43916 -31333 -58318
6978e8318J2710K2873K3820j7140j5473J2391m867K2234J478l9694j3684j4908
$$ -58318 -45608 -22735 1085 -16055 -31528 -19137 -24004 -1770 -292 -39986 -53670 -68578
6966f8578p034J842j1028q1829l9293Q72M2623J26524L6117o4675K4457P732K0342
$$ -68578 -75612 -73770 -84798 -166627 -205920 -205048 -162425 -35901 216 -64459 -40002 -32270 -11928
6953a1928j9288K5955j9810j476R134M4617j6191r974N2646o9679k8075L4694
$$ -11928 -31216 -5261 -25071 -26547 -17413 27204 11013 1039 53685 -15994 -44069 -9375
6941i375M49K5581J4408L9529j5601l0805O048M8524J0573k5113k8702j3290l5957
$$ -9375 -8926 16655 31063 70592 54991 24186 30234 78758 89331 64218 35516 22226 -13731
6928a3731k5129J932L425P292j1342k0579M9385M3898l6852p2980l5084o143K1085
$$ -13731 -38860 -36928 -33503 -26211 -37553 -58132 -8747 35151 -1701 -74681 -109765 -115908 -94823
6915i4823N3381L812N0521M0069k540k996q460k5888m4566n7763M6408P2641M5699
$$ -94823 -41442 -37630 12891 52960 50420 47424 38964 13076 -31490 -89253 -42845 29796 75495
6902G5495J5123m5846l7396j5677n718L9291N8351j5760J841j8469p8431l9667
$$ 75495 90618 44772 7376 -8301 -14019 25272 83623 67863 69704 51235 -27196 -66863
6890f6863o6586L480L1194M2787L1420l662j6254l846K2682J0386m5071j0998
$$ -66863 -133449 -129969 -98775 -55988 -24568 -28230 -44484 -48330 -25648 -15262 -60333 -71331
6878g1331K1675K5886O4025j3054r2619n3172J6545q76K8763n5521j1421O3471
$$ -71331 -49656 -23770 40255 27201 -65418 -118590 -102045 -102921 -74158 -129679 -141100 -77629
6866g7629L5833p2595K1738L1901L8009J5904l9519l6958J5515K8111K0348k0933
$$ -77629 -41796 -114391 -92653 -60752 -22743 -6839 -46358 -83316 -67801 -39690 -19342 -40275
6854d0275J6487k9892n2923m938O0788K7131N0747K0835m1630J214L6162m557
$$ -40275 -23788 -53680 -106603 -111541 -50753 -23622 27125 47960 6330 7544 43706 39149
6842C9149l595L1827O966k4431l5882p733N1579j1228k8564K901m104l819n783
$$ 39149 35554 67381 74347 49916 14034 6301 57880 46652 18088 20989 16885 13066 7283
6829G283r858p4039k6133L7527J6701M257R366K8733j0541j5950L4221M9828k8817
$$ 7283 -2575 -76614 -102747 -65220 -48519 -44262 -34896 -6163 -16704 -32654 1567 51395 22578
6816B2578l6276n5113J664M1011J6083j4985j6085L0780k996m6236l7248M9280
$$ 22578 -13698 -68811 -67147 -26136 -10053 -25038 -41123 -10343 -13339 -59575 -96823 -47543
6804d7543M9330N0333J1680R259k981R690n3708n0983j696k7092M334K2108m1046
$$ -47543 1787 52120 63800 73059 70078 79768 26060 -24923 -26619 -53711 -49377 -27269 -68315
6791f8315L3300K4631J3547P4649q795m1320j3327m5121l7065N2087M0425m2403
$$ -68315 -35015 -10384 3163 77812 69017 27697 14370 -30751 -67816 -15729 24696 -17707
6779a7707J7812k7248K1706M3425K5879k8214n1829J6568N4431J5459l8848n9393
$$ -17707 105 -27143 -5437 37988 63867 35653 -16176 392 54823 70282 31434 -27959
6767b7959k9544L6327K8020K1473K168j5202j481k2770O643l261m6224L1295q176
$$ -27959 -57503 -21176 6844 28317 30485 15283 13802 -8968 -2325 -5586 -51810 -20515 -28691
6754b8691R135M6859J5301j1204M2278N2514K2042n1310j2323n975K688o3067
$$ -28691 -19556 27303 42604 31400 73678 126192 148234 96924 84601 78626 81314 18247
6742A8247l6402k182O3399J072K4917k4247L5965J3800m4738L2141L3171J488
$$ 18247 -18155 -20337 43062 44134 69051 44804 80769 94569 49831 81972 115143 116631
6730A16631k5712R323K6602O5870Q3500J62231K97850M67892M88762O8979m93475
$$ 116631 90919 100242 126844 192714 276214 438445 736295 1204187 1692949 1761928 1268453
6719A268453n12587k43822j69182j61877m3605J0627k9063o8017l3052k8079K1670
$$ 1268453 755866 512044 342862 180985 137380 148007 118944 50927 17875 -10204 11466
6708A1466M3229J0174l2112q460m140l8416l4695J4064L1543M2726j9901R935
$$ 11466 54695 64869 32757 24297 20157 -18259 -52954 -38890 -7347 35379 15478 25413
6696B5413k7345p6860K8484P1977L396k8134l0538K050J3900n6885l9846J0859
$$ 25413 -1932 -78792 -50308 21669 25065 -3069 -33607 -31557 -17657 -74542 -114388 -103529
6684a03529q208J6792q072n9757o5601m448N6132J27131L903j4208L4622l9899
$$ -103529 -111737 -94945 -103017 -162774 -228375 -232823 -176691 -49560 -45657 -59865 -25243 -65142
6672f5142l6388M8126K1608P3617n3714K7259K8205j5395k8018q2670k9127P6292
$$ -65142 -101530 -53404 -31796 41821 -11893 15366 43571 28176 158 -82512 -111639 -35347
6660c5347M2550M6347L2979k3918j1084J969k3567n380o9045m1024K4459K0665
$$ -35347 7203 53550 86529 62611 51527 53496 29929 24549 -44496 -85520 -61061 -40396
6648d0396p008M3413J3521n7727l2820K3866M4169N5786m061n3712o4918n2337
$$ -40396 -47404 -3991 9530 -48197 -81017 -57151 -12982 42804 38743 -14969 -79887 -132224
6636a32224L37N0113N6697L171k7840j1501K5460L7883K6838L0881k1821o1020
$$ -132224 -131887 -81774 -25077 -21906 -49746 -61247 -35787 2096 28934 59815 37994 -23026
6624b3026J3671J7881j421j6350m9864l1789L1117O5882L7327O712j0578k757
$$ -23026 -9355 8526 7105 -9245 -59109 -90898 -59781 6101 43428 50140 39562 36805
6612C6805o6223l7228J3609l2258N1993J15488m2202m2786P111j4713p040n6288
$$ 36805 -29418 -66646 -53037 -85295 -33302 82186 39984 -2802 4309 -10404 -17444 -73732
6600g3732n8797n070O801J3960N5082J3103K252L0010k1282l3971J5923J8151
$$ -73732 -132529 -137599 -130798 -116838 -61756 -48653 -46401 -16391 -37673 -71644 -55721 -37570
6588c7570L5736K3710m6439o946j362r296L6259R493k4477P189m7457l291l1492
$$ -37570 -1834 21876 -24563 -31509 -32871 -42167 -5908 3585 -20892 -13703 -61160 -64451 -95943
6575i5943m007N0665K0354N4837n01n4354l45L0832K0590k1427l5617Q643j9126
$$ -95943 -99950 -49285 -28931 25906 25405 -28949 -29294 1538 22128 701 -34916 -26273 -45399
6562d5399o335K418K4963Q058J4514m7673N1638N3263l4916K201J4810l5309l1157
$$ -45399 -51734 -49316 -24353 -16295 -1781 -49454 2184 55447 20531 22732 37542 2233 -28924
6549b8924k2211Q386l479p2858k9434L9571K9791L2012N7945n266J5849N239j6298
$$ -28924 -51135 -42749 -46228 -119086 -148520 -108949 -79158 -47146 10799 5533 21382 26621 10323
6536A0323j8536n539l8504K8330K4042o462J3296K1182M178n4303m9036N6306
$$ 10323 -8213 -13752 -52256 -23926 116 -6346 6950 28132 32310 -21993 -71029 -14723
6524a4723Q655n8824m9006N7249q988m0129j6407L0482k8158o614n358r59L6273
$$ -14723 -6068 -64892 -113898 -56649 -65637 -105766 -122173 -91691 -119849 -126463 -131821 -132780 -96507
6511i6507M114K8704P2122K1320M583Q908m5017k4539j7651j378q972K1916K0623
$$ -96507 -92393 -63689 8433 29753 34336 43244 -1773 -26312 -43963 -45341 -54313 -32397 -11774
6498a1774o819p5368K7309O7439O0958k0016k2002K7487M2388K6938j21219p8021
$$ -11774 -18593 -93961 -66652 787 61745 41729 19727 47214 89602 116540 -4679 -82700
6486h2700m9311K3857o576m8533M2804J2208K2547L9228j7561L4382O054m3980
$$ -82700 -132011 -108154 -114730 -163263 -120459 -108251 -85704 -46476 -64037 -29655 -23601 -67581
6474f7581K130K9462M8748m3767n6516p255n828j7971J6617k753L1694M3399M3961
$$ -67581 -65451 -35989 12759 -31008 -87524 -94779 -100607 -118578 -101961 -104714 -73020 -29621 14340
6461A4340m989m8710l5739j8767L3927N516P17N7776k4942n8467q945K0437j6752
$$ 14340 9351 -39359 -75098 -93865 -59938 -54422 -53705 4071 -20871 -79338 -88283 -67846 -84598
6448h4598k5563J1190O099K4190K594r002N7281O9180m8802r400K7993L4695k8778
$$ -84598 -110161 -98971 -92872 -68682 -66088 -75090 -17809 51371 2569 -6831 21162 55857 27079
6435B7079k3796n4058J6716L7427K4700l5495k7202k7329l182n068J5257N5567
$$ 27079 3283 -50775 -34059 3368 28068 -7427 -34629 -61958 -65140 -70208 -54951 616
6423F16k8151l404J196n7612Q709l879K0604K3032O2249k4569l4743L4299L6154
$$ 616 -27535 -30939 -29743 -87355 -78646 -82525 -61921 -38889 23360 -1209 -35952 -1653 34501
6410C4501m944n639j0697k2599j0140J4965Q992j5750l9077m1853J3497L2060
$$ 34501 29557 23918 13221 -9378 -19518 -4553 4439 -11311 -50388 -92241 -78744 -46684
6398d6684L1241m887j1758J1365k6103L0989m0323m2534M214K6466M9018k5619
$$ -46684 -15443 -20330 -32088 -20723 -46826 -15837 -56160 -98694 -94480 -68014 -18996 -44615
6386d4615Q338q116K4846K7131J293j3460j5085M6802l2753q0183L309L5014J6587
$$ -44615 -36277 -44393 -19547 7584 8877 -4583 -19668 27134 -5619 -85802 -82493 -47479 -30892
6373c0892N5566K0614n9814j8499m4731l501N222M1560L8345n145k2470O0165
$$ -30892 24674 45288 -14526 -33025 -77756 -81257 -76035 -34475 3870 -1275 -23745 36420
6361C6420j9190l9897N2171K3935l280J765o1761o9331K4316N0328r570j7253
$$ 36420 17230 -22667 29504 53439 50159 51924 -9837 -79168 -54852 -4524 -14094 -31347
6349c1347j8720N7873O446n4620j3517R6946n460k0367l6944o7487J5199M0682
$$ -31347 -50067 7806 14252 -40368 -53885 43061 37601 17234 -19710 -87197 -71998 -31316
6337c1316L3070L816o659q557k8978N4701M5158o907p6179j6793j1379J1950m0412
$$ -31316 1754 5570 -1089 -9646 -38624 16077 61235 54328 -21851 -38644 -50023 -38073 -78485
6324g8485j973K7451L2498K60j4238L0601O655j5025r773j3337l0911J1792L4549
$$ -78485 -80458 -53007 -20509 -20249 -34487 -3886 2769 -12256 -22029 -35366 -66277 -54485 -19936
6311a9936k7151M454J1721q412j1894q239J9332K2178J3121q789j6757j7900o0397
$$ -19936 -47087 -42633 -30912 -39324 -51218 -59457 -40125 -17947 -4826 -13615 -30372 -48272 -108669
6298a08669M265l3087R0398M2516m291N314m897m3106J4599K9218N3285M4539
$$ -108669 -104404 -137491 -47093 -4577 -8868 -3554 -8451 -51557 -36958 -7740 45545 90084
6286I0084M9648j974n3820P74N7L165p0370k2796M7039J4857p2226l8104m5492
$$ 90084 139732 137758 83938 84712 84769 87934 17564 -5232 41807 56664 -15562 -53666 -99158
6273i9158O5173P7630j0169m4253r010l9255k6700M8914J2985k1373j5419p673
$$ -99158 -33985 43645 33476 -10777 -19787 -59042 -85742 -36828 -23843 -45216 -60635 -68308
6261f8308j6542P225n50L3044K2807k8384Q787k5545K6880k7229j4541M2031M5522
$$ -68308 -84850 -77625 -78175 -45131 -22324 -50708 -41921 -67466 -40586 -67815 -82356 -40325 5197
6248E197m6732r451J1841k9903K8213L4550L5068M4295j8487j6910m8949l8539
$$ 5197 -41535 -50986 -39145 -69048 -40835 -6285 28783 73078 54591 37681 -11268 -49807
6236d9807m527l6131N4192k8239l5490Q4068P7750K0170l6643l7143r540M2739
$$ -49807 -54334 -90465 -36273 -64512 -100002 -15934 61816 81986 45343 8200 -1340 41399
6224D1399L6395q367j7544k9615q1439k0653J00K3646L4081j1394J4250R41j9620
$$ 41399 77794 69427 51883 22268 -59171 -79824 -79724 -56078 -21997 -33391 -19141 -18200 -37820
6211c7820N160R48m8386k7150k786K5083M0124j5470j2867N9914k5371j7909P170
$$ -37820 -32660 -31712 -80098 -107248 -110034 -84951 -44827 -60297 -73164 -13250 -38621 -56530 -49360
6198d9360J1837M989l010r672q29J0889j1068p715K9288l2223R603J6235j8747
$$ -49360 -37523 -32534 -35544 -45216 -46045 -35156 -46224 -53939 -24651 -56874 -47271 -31036 -49783
6185d9783p272j0177J3043K6683k9673K7686K8044m2239J6827K5793n462J8815
$$ -49783 -57055 -67232 -54189 -27506 -57179 -29493 -1449 -43688 -26861 -1068 -6530 12285
6173A2285N3476M3996j2715o5660o1647k3J3524k5781q384L7885L3718l956K5494
$$ 12285 65761 109757 97042 31382 -30265 -30288 -16764 -42545 -50929 -13044 20674 16718 42212
6160D2212n1202j4570m1528k5481M2663J2136l6546N1879R7648j3022j5543p2742
$$ 42212 -8990 -23560 -65088 -90569 -47906 -35770 -72316 -20437 77211 64189 48646 -24096
6148b4096k7095k2068k528m1318n126M3018R1126l133J489k0756m6747l0821L6344
$$ -24096 -51191 -73259 -75787 -117105 -122231 -79213 11913 8780 10269 -10487 -57234 -88055 -51711
6135e1711L6616k9318J185l0396j8401J2439K4475m943K5954q194M7945N868k4254
$$ -51711 -15095 -44413 -43228 -73624 -92025 -79586 -55111 -60054 -34100 -42294 5651 11519 -12735
6122a2735p64Q540p8841o514O4558P478m5324q3551L7183P8735R6608N2683Q17
$$ -12735 -13499 -4959 -83800 -90314 -25756 -18278 -63602 -147153 -109970 -31235 65373 118056 118873
6109A18873k5395n0575o22p073k7784j9984J7165o640k5011q485M5981J465l0886
$$ 118873 93478 42903 42281 35208 7424 -12560 4605 -2035 -27046 -35531 10450 11915 -18971
6096a8971k4456k8804j3478K9134J8443O439O0163J8689n4328k9712L7578O5506
$$ -18971 -43427 -72231 -85709 -56575 -38132 -31693 28470 47159 -7169 -36881 697 66203
6084F6203o858r8j2651K0768J1466n6166J1163L2439l8354n353Q1540J632o1331
$$ 66203 59345 59247 46596 67364 78830 22664 33827 66266 27912 22559 104099 105731 44400
6071D4400l6564m9134L285L6323J5229l3563l6939K4862K4647J0129q228k6940
$$ 44400 7836 -41298 -38013 -1690 13539 -20024 -56963 -32101 -7454 2675 -5553 -32493
6059c2493J0633J0072K1300L3859r477k0528K7859k4991l7435J9057l3037J201
$$ -32493 -21860 -11788 9512 43371 33894 13366 41225 16234 -21201 -2144 -35181 -33980
6047c3980N5016M3180m8754n2406k3785m1546j5808Q5011Q473j9335J1069L7681
$$ -33980 21036 64216 15462 -36944 -60729 -102275 -118083 -33072 -24599 -43934 -32865 4816
6035D816p0774k8724L6002O6814k5472K1850n8307J3370K772o3230m073L0202
$$ 4816 -65958 -94682 -58680 8134 -17338 4512 -53795 -40425 -37653 -100883 -104956 -74754
6023g4754l4145j8157K1782M48P208L138J1896K1818k5117O1645R5744L8596Q854
$$ -74754 -108899 -127056 -105274 -104826 -97618 -94480 -82584 -60766 -85883 -24238 71506 110102 118956
6010A18956o0531o1209m4367o9924m67k5469M6572J12145O3454m517r4413r2801
$$ 118956 58425 -2784 -47151 -117075 -117542 -143011 -96439 15706 79160 74643 -19770 -112571
5998a12571L6484O8377M4702l5838l8963j2115M1651o651n0800O122K3341K3373
$$ -112571 -76087 -7710 36992 1154 -37809 -49924 -8273 -14924 -65724 -59602 -36261 -12888
5986a2888M245M3381J6939m4390l462L1352K7552o8123q9647l895N2499N360L3217
$$ -12888 -8643 34738 51677 7287 3825 35177 62729 -5394 -95041 -98936 -46437 -41077 -7860
5973g860L5161j1435k7992j2927K1681q582K0299J4552J2866L4159J6960o0460
$$ -7860 27301 15866 -12126 -25053 -3372 -11954 8345 22897 35763 69922 86882 26422
5961B6422n5427J146k1658k6067m485l3988J2256K8445K1985j5085K1010q1797
$$ 26422 -29005 -27859 -49517 -75584 -80069 -114057 -101801 -73356 -51371 -66456 -45446 -127243
5949a27243l257J0394L9508P1623M9200J9808n0480o330l6180k3032j0663K3984
$$ -127243 -130500 -120106 -80598 -8975 40225 60033 9553 3223 -32957 -55989 -66652 -42668
5937d2668j5564K3988K1664R319L3094k7900n9436J2118K1731K9022j193m9490
$$ -42668 -58232 -34244 -12580 -3261 29833 1933 -57503 -45385 -23654 5368 4175 -45315
5925d5315l1132J7041J5673L862J3689j095K3565Q672J558R944p712j424P501
$$ -45315 -76447 -59406 -43733 -39871 -26182 -27277 -3712 4960 6518 16462 8750 7326 14827
5912A4827Q535k6271k2072o642N4410p0994k3084M2745j5372L1195N5842j5949
$$ 14827 23362 -2909 -24981 -31623 22787 -48207 -71291 -28546 -43918 -12723 43119 27170
5900B7170J7246n1257n3386m87N4277K2915p0899r7964R870J5188k0403K8639
$$ 27170 44416 -6841 -60227 -60714 -6437 16478 -54421 -152385 -142515 -127327 -147730 -119091
5888a19091P9049M6182J1267R459m6071j6036m545r613J6280l8732j2447r427
$$ -119091 -40042 6140 17407 26866 -19205 -35241 -39786 -49399 -33119 -71851 -84298 -93725
5876i3725K1535k4240K2170J12228P1872j8023k0440r8044j7497j2908N2819J5298
$$ -93725 -72190 -96430 -74260 37968 109840 91817 71377 -26667 -44164 -57072 -4253 11045
5864A1045k6900r111k5820Q987O23K2083K1847K5015j0341j4685k4526j6044j7128
$$ 11045 -15855 -24966 -50786 -41799 -41176 -19093 2754 27769 17428 2743 -21783 -37827 -54955
5851e4955L9057m1230m9086p473K5266K7935M8393O922j8176p9733j4128n378
$$ -54955 -15898 -57128 -106214 -113687 -88421 -60486 -12093 -5171 -23347 -103080 -117208 -122586
5839a22586K8424P1110K3206M3869l873l7773l824O4226j9527j355m0983m5455
$$ -122586 -94162 -23052 154 44023 40150 2377 -1447 62779 43252 41897 914 -44541
5827d4541M175M0773M223j8201J514N5348L6087n3492o5255k2888R939q708l462
$$ -44541 -40366 407 4630 -13571 -12057 43291 79378 25886 -39369 -62257 -52318 -61026 -64488
5814f4488o400N1544j5346o6662l1762M4815K8893J0611J1359J9518J7644l778
$$ -64488 -70888 -19344 -34690 -101352 -133114 -88299 -59406 -48795 -37436 -17918 -274 -4052
5802d052Q940K8912J2944j2799l2671m5793m893k849m390k2483p8774K2170Q9365
$$ -4052 4888 33800 46744 33945 1274 -44519 -49412 -52261 -56651 -79134 -157908 -135738 -46373
5789d6373M3811o005j2766o5039j6288k7302O603K1171J5987J7547K3282R446
$$ -46373 -2562 -8567 -21333 -86372 -102660 -129962 -123359 -102188 -86201 -68654 -45372 -35926
5777c5926n2881k7665N924K4863M1848j8830m0164m7517n384M3339K0327J9901
$$ -35926 -88807 -116472 -110548 -85685 -43837 -62667 -102831 -150348 -155732 -112393 -92066 -72165
5765g2165o749J8550N7625K6948n6193L1765j705m510p830m2527P037P7106P1074
$$ -72165 -78914 -60364 -2739 24209 -31984 -219 -1924 -6434 -14264 -56791 -49754 27352 98426
5752I8426M0070m0313m8687l5507o6061L742M9189k4712l0085k3249J4150K973
$$ 98426 138496 98183 49496 13989 -52072 -48330 859 -23853 -53938 -77187 -63037 -60064
5740f0064k1808k6611k1552J485K4488O4669J7845M265J5805Q071K9164K1134
$$ -60064 -81872 -108483 -130035 -128550 -104062 -39393 -21548 -17283 -1478 6593 35757 56891
5728E6891j8469j4436N7029K3021k909p3888j351j1424n4625r2961k9775Q5472
$$ 56891 38422 23986 81015 104036 101127 27239 25888 14464 -40161 -133122 -162897 -77425
5716g7425O8978l5290m7266k538M6228K3371p18J1404O2268l0219q384M1206p160
$$ -77425 -8447 -43737 -91003 -93541 -47313 -23942 -24660 -13256 49012 18793 10409 51615 44455
5703D4455R122J2300j1437J7962k7604j4150p088l3091L0146L9792m4798n0619
$$ 44455 53577 65877 54440 72402 44798 30648 23560 -9531 20615 60407 15609 -35010
5691c5010M0443L4835m4514n2343Q1576K1123o7215K3131K3610J0764j6777p960
$$ -35010 5433 40268 -4246 -56589 24987 46110 -21105 2026 25636 36400 19623 11663
5679A1663l14P306k8620O0760q711m1822j7582n4247m4263l3184K5519K937L260
$$ 11663 11349 18655 -9965 50795 42084 262 -17320 -71567 -115830 -149014 -123495 -120558 -117298
5666a17298M479L2060M727K2596R0259J2930j875P873l8343l9756L4824M921r7499
$$ -117298 -112819 -80759 -76032 -53436 36823 49753 47878 55751 17408 -22348 12476 17397 -80102
5653h0102l1525P2738R5111L2569k3409m8489m8360l2724r4203j3451P4487K9870
$$ -80102 -111627 -38889 56222 88791 65382 16893 -31467 -64191 -158394 -171845 -97358 -67488
5641f7488P6936k6066R7q444M099l251l4314j2941j034K6353M59J0990M3713O8483
$$ -67488 9448 -16618 -16521 -24965 -20866 -24117 -58431 -71372 -72406 -46053 -45594 -34604 9109 77592
5627G7592N0418K4325r0282o0609l269O953N521o1598l037j8598M9812O0716M588
$$ 77592 128010 152335 62053 1444 -1825 5128 10649 -50949 -53986 -72584 -22772 37944 42532
5614D2532k4097p772j6694l6968M1815L7465K260k6494j9278k859R417m9576K8856
$$ 42532 18435 10663 -6031 -42999 -1184 36281 38541 12047 -7231 -10090 -673 -50249 -21393
5601b1393O596J355j8671j9692j2448M9680K9657n4469l3762R58J7971K4550J9316
$$ -21393 -14797 -13442 -32113 -51805 -64253 -14573 15084 -39385 -73147 -72189 -54218 -29668 -10352
5588a0352P926J8336k6250m2152K5544k8580j0461j6859M402r226K2358L8454
$$ -10352 -2426 15910 -10340 -52492 -26948 -55528 -65989 -82848 -78446 -87672 -65314 -26860
5576b6860J6084j0859J270m997l1218j7280L4927J264K2829K1755O2510Q586q529
$$ -26860 -10776 -21635 -20365 -25362 -56580 -73860 -38933 -37669 -14840 6915 69425 78011 69482
5563F9482N5119j6838j5419R750j00427n9791J0842l6197p5024J9489L1685J3944
$$ 69482 124601 107763 92344 102094 1667 -58124 -47282 -83479 -158503 -139014 -107329 -93385
5551i3385K1340L4672L3222j7715n1454j3411o626j7640q055q776R428K1572M4012
$$ -93385 -72045 -37373 -4151 -21866 -73320 -86731 -93357 -110997 -119052 -127828 -118400 -96828 -52816
5538e2816M6334j1763J6451J3855n926j410J3573m254N616M074N3504O079k0225
$$ -52816 -6482 -18245 -1794 12061 6135 4725 18298 14044 19660 23734 77238 83317 63092
5525F3092o9440k6439L9473O809k7475j4479L0286J383l2298Q297J0402q478J8965
$$ 63092 -6348 -32787 6686 13495 -13980 -28459 1827 3210 -29088 -20791 -10389 -18867 98
5512I8m030m0608j2861R0942j5068k0716J2106N6842o877k6298m0054m3717k5809
$$ 98 -3932 -44540 -57401 33541 18473 -2243 9863 66705 59828 33530 -6524 -50241 -76050
5499g6050R396K6047J8421l1086M1756N6416j8459j8563J8683J4995K3561p9130
$$ -76050 -66654 -40607 -22186 -53272 -11516 44900 26441 7878 26561 41556 65117 -14013
5487a4013m2328J8185k7281k3065M2053l9211j2390J9140K2257M3044K9231L0369
$$ -14013 -56341 -38156 -65437 -88502 -46449 -85660 -98050 -78910 -56653 -13609 15622 45991
5475D5991m7193J2494k1507n5330J7918K9713m9358j02898J0972O5450L4730M1749
$$ 45991 -1202 11292 -10215 -65545 -47627 -17914 -67272 -170170 -159198 -93748 -59018 -17269
5463a7269P9486m3219l9603q775K8852K0826j0353J3977m8179l3653K2214L162
$$ -17269 62217 18998 -20605 -29380 -528 20298 9945 23922 -24257 -57910 -35696 -32534
5451c2534m511L4331l234j522O859L8863K318l9084M2492m4682R883R27j46l6789
$$ -32534 -37045 -2714 -5948 -7470 -611 38252 40570 1486 43978 -704 9179 10106 9960 -26829
5437b6829k4890J05159N0756l3742o6361n5879L2021j0332k7933O1394O176r77
$$ -26829 -51719 53440 104196 70454 4093 -51786 -19765 -30097 -58030 3364 9540 8563
5425H563m2793k7414Q078M2559l1306k3511L2811l904Q0471j3955l8079l673k1774
$$ 8563 -34230 -61644 -53566 -11007 -42313 -65824 -33013 -36917 43554 29599 -8480 -12153 -33927
5412c3927j0591O669K8039P2756n1487j7487K8922J5905l2562k8735j6782j7616
$$ -33927 -44518 -37849 -9810 62946 11459 -6028 22894 38799 6237 -22498 -39280 -56896
5400e6896l7597L3963M7475J2317J1493l1292m7508O021J4694L4706M1851j0826
$$ -56896 -94493 -60530 -13055 -738 10755 -20537 -68045 -62024 -47330 -12624 29227 18401
5388A8401m0699j9699K6806K3244P30l674j7480j2953j5484j0069K0491m800L800
$$ 18401 -22298 -41997 -15191 8053 8783 5109 -12371 -25324 -40808 -50877 -30386 -35186 -31386
5375c1386L7928l3742k6683j3679N1339l7292j0855j2371J2076j6658L4388J8159
$$ -31386 6542 -27200 -53883 -67562 -16223 -53515 -64370 -76741 -64665 -81323 -46935 -28776
5363b8776K4909n799R847l8352n5449j6072R65K7268Q873K4138l3274k9585J8198
$$ -28776 -3867 -9666 181 -38171 -93620 -109692 -108727 -81459 -72586 -48448 -81722 -111307 -93109
5350i3109P0190L0298L2253q90r2690m4463K212K8523O560m752j7854j3162M0397
$$ -93109 -22919 7379 39632 38742 -53948 -98411 -96199 -67676 -61116 -65868 -83722 -96884 -56487
5337e6487J420k3203M7983M8990k5135k4886M9404L3596j2640p4947R840k5235
$$ -56487 -55067 -78270 -30287 18703 -6432 -31318 18086 51682 39042 -35905 -26065 -51300
5325e1300O8760J1610L7907j7581p8323q4844k3621P4135O9257k339k9042K6655
$$ -51300 17460 29070 66977 49396 -28927 -113771 -137392 -63257 6000 3661 -25381 1274
5313A274k096Q603N3573O054o2862n6284j4454N9310L1879K9653j9812j269M797
$$ 1274 -822 7781 61354 67408 4546 -51738 -66192 -6882 24997 54650 34838 33569 38366
5300C8366J459L445K5680k3214r518K7383n4677n150J4950K0566o7723l0667N6410
$$ 38366 39825 43270 68950 45736 36218 63601 8924 3774 18724 39290 -28433 -59100 -2690
5287b690L6209K5665J1533o4409m3233j1965k5751L9695J820J8241M8972l1764
$$ -2690 33519 59184 70717 6308 -36925 -48890 -74641 -34946 -33126 -14885 34087 2323
5275B323M9574k1102l4L7081K7029L2061k1376k7562p2176m6145N8453J3783N3563
$$ 2323 51897 30795 30761 67842 94871 126932 105556 77994 5818 -40327 18126 31909 85472
5262H5472r365r9266l9890K4449n029j568N9839n555N8455P1204k3348m2318j7130
$$ 85472 76107 -23159 -63049 -38600 -43629 -45197 14642 9087 67542 138746 115398 73080 55950
5249E5950l7116J922J9101l321j2602L0633l386j3168K9222l3786j6766o1729
$$ 55950 18834 20756 39857 36536 23934 54567 51181 38013 67235 33449 16683 -45046
5237d5046j8837n1206N5246R9047k503j3269m3389K0938J0744J18j5005j0581
$$ -45046 -63883 -115089 -59843 39204 36701 23432 -19957 981 11725 11843 -3162 -13743
5225a3743J2339K4517j3110K8094M0242O320k3290n4214M092K3040m792o7555
$$ -13743 -1404 23113 10003 38097 78339 84659 61369 7155 11247 34287 29495 -38060
5213c8060m0616L2185K2437M7779k0974m9637k2707l319M366J1269L4216O1428
$$ -38060 -78676 -46491 -24054 23725 2751 -46886 -69593 -72912 -68546 -57277 -23061 38367
5201C8367J6790j7421R957k2014O126q012k3383m5052j7708L9206J793m2603Q393
$$ 38367 55157 37736 47693 25679 31805 23793 410 -44642 -62350 -23144 -21351 -63954 -55561
5188e5561O2061m373p0550K0787K6638k9908J466K2886J640L2483r045R023M5235
$$ -55561 6500 2127 -68423 -47636 -20998 -50906 -49440 -26554 -24914 7569 -1476 7547 52782
5175E2782J4958r8819m4772M2451O4661J1228j4911o54o8443m6405Q427M3085
$$ 52782 67740 -31079 -75851 -33400 31261 42489 27578 26924 -41519 -87924 -79497 -36412
5163c6412K2164k8539J5386N1543K7551o420L3427j4382n9932K35L236J8706m2262
$$ -36412 -14248 -42787 -27401 24142 51693 45273 78700 64318 4386 4621 7857 26563 -15699
5150a5699J5985O9068j612r3859r42N8526L0554L4142l6259n604p2552j8154n4610
$$ -15699 286 69354 67742 -26117 -27059 31467 62021 96163 59904 54300 -18252 -36406 -91016
5137i1016N8785K8593q1576L8603O1809J6532m043K1099m3730J4947J6686j8669
$$ -91016 -32231 -3638 -85214 -46611 15198 31730 27687 48786 5056 20003 36689 18020
5125A8020k0896J0802k4381K0438m1217j8793p403R909M4662L6907K587K0479
$$ 18020 -2876 7926 -16455 3983 -37234 -56027 -63430 -53521 -8859 28048 30635 51114
5113E1114k3352j1529n2188j9697J2772K2152m5394K9143J3051j68O2472N3337
$$ 51114 27762 16233 -35955 -55652 -42880 -20728 -66122 -36979 -23928 -24096 38376 91713
5101I1713J56j889m8445j2457j9945K4742J9694L4724p1143L3278K6915l0501
$$ 91713 91869 89980 41535 29078 9133 33875 53569 88293 17150 50428 77343 46842
5089D6842n2713P16m0783l0421K3704J1274m3312o2199n6529M7108O7133J72004
$$ 46842 -5871 -5155 -45938 -76359 -52655 -41381 -84693 -146892 -203421 -156313 -89180 82824
5077H2824M9430q5066p2828J761O5307O6976k9958p0123j5707J0552L0329l7448
$$ 82824 132254 47188 -25640 -23879 41428 108404 78446 8323 -7384 3168 33497 -3951
5065c951j3600J1518l4701k568J8011r473n8460m073J7895K7546M1796Q6511n893
$$ -3951 -17551 -6033 -40734 -43302 -25291 -34764 -93224 -97297 -79402 -51856 -10060 76451 70558
5052G0558m9963j7075J2659k0541j3073l5466L4359M6210j8715P901O016J5112
$$ 70558 20595 3520 16179 -4362 -17435 -52901 -18542 27668 8953 16854 22870 37982
5040C7982L3061L730L091n514l4718q9747m4139N1362J5514n590K7992R94l3632
$$ 37982 71043 74773 77864 72350 37632 -52115 -96254 -44892 -29378 -34968 -6976 -5982 -39614
5027c9614J6772J7170n1318M133j131k664M4402K0906p6720p6320M3287N2564
$$ -39614 -22842 -5672 -56990 -52857 -53988 -56652 -12250 8656 -68064 -144384 -101097 -48533
5015d8533L2981k0082P5510K6243k6412J0946n6187m9436k2587M7747P0065j3085
$$ -48533 -15552 -35634 39876 66119 39707 50653 -5534 -54970 -77557 -29810 40255 27170
5003B7170l7776l0444k0840n6009K4827M3998K7862K8904o2468n915K4860J6231
$$ 27170 -10606 -41050 -61890 -117899 -93072 -49074 -21212 7692 -54776 -60691 -35831 -19600
4991a9600R775l171k6975m745m8863l4497N1218R6257M3558j8358k2225n4342
$$ -19600 -9825 -12996 -39971 -44716 -93579 -128076 -76858 19399 62957 44599 22374 -31968
4979c1968l317j4803J3964L6354M6458L624q0147n2497k3574P2973J38245O005
$$ -31968 -35285 -50088 -36124 230 46688 50312 -29835 -82332 -105906 -32933 105312 111317
4967A11317m1271o1192j6188k5897K1863R838l7416j5653L4630m173K5604k2460
$$ 111317 70046 8854 -7334 -33231 -11368 -1530 -38946 -54599 -19969 -24142 1462 -20998
4955b0998L098O4707J8782k8899l1463M6786J2737l6960k4255m6523L6185K5760
$$ -20998 -17900 46807 65589 36690 5227 52013 64750 27790 3535 -42988 -6803 18957
4943A8957J0261K6186k7980p7853j7485k3602l0589L2283J9357j6722J3693J7552
$$ 18957 29218 55404 27424 -50429 -67914 -91516 -122105 -89822 -70465 -87187 -73494 -55942
4931e5942j7993n0838j7159j1634n118O0529J6406L181P3691L9891N4238j683
$$ -55942 -73935 -124773 -141932 -153566 -158684 -98155 -81749 -78568 -4877 35014 89252 87569
4919H7569K916M496j9703o3650j0321j1045r954p622n458J2552L0208J1797M625
$$ 87569 90485 94981 75278 11628 1307 -9738 -19692 -27314 -32772 -20220 9988 21785 26410
4906B6410o018l1541l499m7419j446l3885L525O593O3175Q442k8857j0298m3476
$$ 26410 20392 -11149 -14648 -62067 -63513 -97398 -93873 -87280 -24105 -15663 -44520 -54818 -98294
4893i8294n2690L7013O7305K2986P24J022K3021P1044j1825k5143m2818P4786
$$ -98294 -150984 -113971 -46666 -23680 -22956 -21934 1087 72131 60306 35163 -7655 67131
4881F7131N4210n8136r3488n989O7355n065m7315l173O501M0951J4991l6552q1313
$$ 67131 121341 63205 -30283 -36272 31083 26018 -21297 -24470 -17969 22982 37973 1421 -79892
4868g9892k9168K8620L8825p620M0208L9739n524j0515N2609p1195p079K495o0745
$$ -79892 -109060 -80440 -41615 -49235 -9027 30712 25188 14673 67282 -3913 -10992 -8497 -69242
4855f9242N793M9901M5504o3366J384K3741M315l303l9848K94Q104L1415M9178
$$ -69242 -63449 -13548 31956 -31410 -30026 -6285 -1970 -5273 -45121 -44827 -36723 -5308 43870
4842D3870J1677k2387p069r934l3916j3555R468O4087j5570k9362N3798J5391
$$ 43870 55547 33160 26091 16157 -17759 -31314 -21846 42241 26671 -2691 51107 66498
4830F6498j12997k0628M4350k9701n0145K8935M7421J3201n211l6687n4491k2881
$$ 66498 -46499 -67127 -22777 -52478 -102623 -73688 -26267 -13066 -18277 -54964 -109455 -132336
4818a32336l6120J2797Q7878K8303Q648j1410j7688r952K729K0624k8191L9636
$$ -132336 -168456 -155659 -67781 -39478 -30830 -42240 -59928 -69880 -67151 -46527 -74718 -35082
4806c5082J3639j0921j8306R030M0565J2634j1984K2910m8566j5521N9359K7402
$$ -35082 -21443 -32364 -50670 -41640 -1075 11559 -425 22485 -26081 -41602 17757 45159
4794D5159N6533k7723n3031j9719K24o959Q566N1530o0307L1935L2861J1691j1711
$$ 45159 101692 73969 20938 1219 1443 -5516 3050 54580 -5727 26208 59069 70760 59049
4781E9049J488n5378M002K7911j9614K7130l9460j5853m9803k2438M7786l5412
$$ 59049 60537 5159 9161 37072 17458 44588 5128 -10725 -60528 -82966 -35180 -70592
4769g0592K0054R9155l9434L183K7241k626q293K697l4061n7557M8678J6439L7747
$$ -70592 -50538 48617 9183 12366 39607 36981 28688 31385 -2676 -60233 -11555 4884 42631
4756D2631R759l6939l5196K5552J7650n14K1030R0430J5804l9597J9260j053n4727
$$ 42631 52390 15451 -19745 5807 23457 22943 43973 134403 150207 110610 129870 128817 74090
4743G4090o6417J2795m198m090j6836N316N4091K6385l7182n0447j3201l6973
$$ 74090 7673 20468 16270 12180 -4656 660 54751 81136 43954 -6493 -19694 -56667
4731e6667L9583L1402q491J2884k7013k9691m6629Q381k5389M1875L3618k0659
$$ -56667 -17084 14318 5827 18711 -8302 -37993 -84622 -76241 -101630 -59755 -26137 -46796
4719d6796K8381J768p577j7731K1698M3029j3491J0136k8185J3980K7011j8473
$$ -46796 -18415 -16647 -24224 -41955 -20257 22772 9281 19417 -8768 5212 32223 13750
4707A3750j7893l6520J3414k3909l2586M8173J0823l1600j0434r526M809K7053
$$ 13750 -4143 -40663 -27249 -51158 -83744 -35571 -24748 -56348 -66782 -76308 -71499 -44446
4695d4446L1850K1707J7613K1211k6907j6564l139j97n8296K4006N6544n363r308
$$ -44446 -12596 9111 26724 47935 21028 4464 1325 1128 -57168 -33162 23382 18019 8711
4682H711L0523J7629n2276p841j543k4286O711N832k916L583l9345m095O4230
$$ 8711 39234 56863 4587 -3254 -4797 -29083 -22372 -16540 -19456 -15873 -55218 -59313 4917
4669D917J6833J0882M940J0828l8324k3200K1783N6527l8458K0315K3100K0931
$$ 4917 21750 32632 37572 48400 10076 -13124 8659 65186 26728 47043 70143 91074
4657I1074R50o5637j2495J4607J1915J4989K062m5237J0648m4693k883J6038J4798
$$ 91074 92024 26387 13892 28499 40414 55403 57465 12228 22876 -21817 -24700 -8662 6136
4644F136j2330o7360M6144J444N015K4831P5669O5680J6782j9928m9153m1973
$$ 6136 -6194 -73554 -27410 -25966 -20951 3880 79549 145229 162011 142083 92930 50957
4632E0957k0175k5238K7033J2046q129j3293K3842o372m6324q795K355N480M755
$$ 50957 30782 5544 32577 44623 36494 23201 47043 40671 -5653 -14448 -12093 -6613 -1858
4619a858p569p650L07l8797n9072j9227M7374J0408L7887O462j2711l5460K2531
$$ -1858 -9427 -17077 -16770 -55567 -114639 -133866 -86492 -76084 -38197 -31735 -44446 -79906 -57375
4606e7375L3957M5720L4442m33m9582j2885j9984N549J804M7346J7981L2217n8600
$$ -57375 -23418 22302 56744 56311 6729 -6156 -26140 -20591 -18787 28559 46540 78757 20157
4593B0157m8619q786j2938j9082N135k977m054j0507J6954L467n6964O7292N6600
$$ 20157 -28462 -37248 -50186 -69268 -64133 -67110 -71164 -81671 -64717 -61250 -118214 -50922 5678
4580E678j953L5688M762J5056K0391L3800j4052q9029o2810N0905M5286M229l1013
$$ 5678 3725 39413 44175 59231 79622 113422 99370 10341 -52469 -1564 43722 47951 16938
4567A6938J7413j2895l4606k5770m6458O643K4389L3071O164L316j8489J6480
$$ 16938 34351 21456 -13150 -38920 -85378 -78735 -54346 -21275 -15111 -11795 -30284 -13804
4555a3804P3036k0162k0897m086K7956l4569k309p884N673j3368l8034L9569l5835
$$ -13804 59232 39070 18173 14087 42043 7474 5165 -2719 2954 -10414 -48448 -8879 -44714
4542d4714o8898o153j886K086L9460L3385M3593L0694m084P550n4421m3429J1009
$$ -44714 -113612 -119765 -121651 -119565 -80105 -46720 -3127 27567 23483 31033 -23388 -66817 -55808
4529e5808j7810j0885O067J8749j2021o859J7302k8407n55k8886M5222N0079M0081
$$ -55808 -73618 -84503 -78436 -59687 -71708 -78567 -61265 -89672 -90227 -119113 -73891 -23812 16269
4516A6269j891j7226K2365M6770j2183j6621n1010j5508J2059j2833M6739M3943
$$ 16269 14378 -2848 19517 66287 54104 37483 -13527 -29035 -16976 -29809 16930 60873
4504F0873q141o7196M341J8730J1432k165j0592k4038j3676K2933r283J6203K5770
$$ 60873 52732 -14464 -10123 8607 20039 17874 7282 -16756 -30432 -7499 -16782 -579 25191
4491B5191O5891Q08m442k3048m5254J3836j8636o0060q115M2781O4968M9578j7481
$$ 25191 91082 91890 87448 64400 19146 32982 14346 -45714 -53829 -11048 53920 103498 86017
4478H6017n2860M0656L2039n5511K6188k142l6236m5673m770o943J7329Q74M1
$$ 86017 33157 73813 105852 50341 76529 74387 38151 -7522 -12292 -19235 -1906 -1032 -991
4465i91J0787k1636M025J1434J7403J6088l6500l9640J339m3999m904j7620j479
$$ -991 9796 -11840 -7815 3619 21022 37110 610 -39030 -37691 -81690 -86594 -104214 -105693
4452a05693J1131K0954N8180j3448L6077K6300k9040k1245Q1883m0087l6644Q41
$$ -105693 -94562 -73608 -15428 -28876 7201 33501 4461 -16784 65099 25012 -11632 -10791
4440a0791J1561J3079Q976k9723J115M0473k3407k5944L1818K3543j3418l6305
$$ -10791 770 13849 22825 -6898 -5783 34690 11283 -14661 17157 40700 27282 -9023
4428i023n1508Q484L5440K5629N185L643m0358P623M3233k5735p3946K2820M2752
$$ -9023 -60531 -52047 -16607 9022 14207 17850 -22508 -14885 28348 2613 -71333 -48513 -5761
4415e761M638N1720J7803j7386k7724q021K6045J0602K7998R096L1824l3209k0356
$$ -5761 -1123 50597 68400 51014 23290 15269 41314 51916 79914 89010 120834 87625 67269
4402F7269K9064Q888p200m337o8334P418k7233j8132M5335K6436M0394n3619m5722
$$ 67269 96333 105221 98021 93684 25350 32768 5535 -12597 32738 59174 99568 45949 227
4389B27j100M0453M1439r037l1066m4246K1159m0376k475k2879J7936p266n0771
$$ 227 -873 39580 81019 71982 40916 -3330 17829 -22547 -25022 -47901 -29965 -37231 -88002
4376h8002J461N725L5992P4029m7309R539K9836p0907m243N3264K2582N795J2763
$$ -88002 -86541 -80816 -44824 29205 -18104 -8565 21271 -49636 -53879 -615 21967 27762 40525
4363D0525J710P954j7254o2167l7018L4479m1620L1956K7337N5835J89l1178o0484
$$ 40525 42235 50189 32935 -29232 -66250 -31771 -73391 -41435 -14098 41737 41926 10748 -49736
4350d9736J1359j498j142k0640O237M584J1942M1122O1432K8789n5154K6553M4043
$$ -49736 -38377 -39875 -41017 -61657 -55420 -50836 -38894 2228 63660 92449 37295 63848 107891
$$ [...]
##END NTUPLES=NMR SPECTRUM
##END=
