##TITLE=Analysis number 329398
Compound Code cc 68209
Book Reference 546/20
Project Code adrs
Chemist Name craigr
##JCAMPDX= 6.0         $$ Bruker NMR JCAMP-DX V2.0
##DATA TYPE= NMR SPECTRUM
##DATA CLASS= NTUPLES
##ORIGIN= Bruker BioSpin GmbH
##OWNER= nmr
$$ XWIN-NMR		Version 3.5
$$ Tue Aug 28 14:17:40 2007 GMT Daylight Time (UT+1h)  MAYBRIDGE\nmr@NMR_250MHZ
##.OBSERVE FREQUENCY= 250.131544655141
##.OBSERVE NUCLEUS= ^1H
##.ACQUISITION MODE= SIMULTANEOUS (DQD)
##.ACQUISITION SCHEME= undefined
##.AVERAGES= 16
##.DIGITISER RES= 18
##SPECTROMETER/DATA SYSTEM= dpx250
##.PULSE SEQUENCE= zg30
##.SOLVENT NAME= CDCl3
##.SHIFT REFERENCE= (INTERNAL, CDCl3, 0, 16.522)
##AUDIT TRAIL= $$ (NUMBER, WHEN, WHO, WHERE, WHAT)
$$ ##TITLE= Audit trail, XWIN-NMR		Version 3.5
$$ ##JCAMPDX= 5.01
$$ ##ORIGIN= Bruker BioSpin GmbH
$$ ##OWNER= nmr
$$ C:\u/data/dgb/nmr/ADRS/1210/pdata/1/auditp.txt
$$ ##AUDIT TRAIL=  $$ (NUMBER, WHEN, WHO, WHERE, WHAT)
(   1,<2007-08-28 14:16:07.85 +100>,<MAYBRIDGE\nmr>,<NMR_250MHZ>,
      <created by zg, POWCHK disabled, PULCHK disabled
       configuration hash MD5:
       76 6E 9A 78 1E 09 19 81 EC 84 63 8F B0 6A 59 2D
       data hash MD5: 64K
       AD 84 DB 36 7B 26 21 12 7D 2F 12 A5 47 D8 E1 2F>)
(   2,<2007-08-28 14:16:39.31 +100>,<MAYBRIDGE\nmr>,<NMR_250MHZ>,
      <Start of raw data processing
       ef LB = 0.3 FT_mod = 6 PKNL = 1 SI = 32K 
       data hash MD5: 32K
       A8 C9 D2 B0 D6 C7 7A ED 46 27 85 3F C8 13 63 79>)
(   3,<2007-08-28 14:16:44.34 +100>,<MAYBRIDGE\nmr>,<NMR_250MHZ>,
      <apk 
       data hash MD5: 32K
       9E 6B 5D 4C D2 45 10 F6 A7 51 82 5C 3D 39 35 AA>)
(   4,<2007-08-28 14:16:49.43 +100>,<MAYBRIDGE\nmr>,<NMR_250MHZ>,
      <abs ABSG = 5 
       data hash MD5: 32K
       36 6E 49 E7 71 36 39 EE 87 D8 2E CE 8A 88 E9 33>)
$$ ##END=
$$ 
$$ hash MD5
$$ 73 CC E1 D1 6D C9 8F 34 DA B5 BD 40 AF 11 05 48
##$RELAX= 
##$RELAX= 
##$RELAX= 
##$RELAX= 
##$RELAX= 
##$RELAX= 
##$RELAX= 
$$ Bruker specific parameters
$$ --------------------------
##$DU= <C:\u>
##$EXPNO= 1210
##$NAME= <ADRS>
##$PROCNO= 1
##$TYPE= <nmr>
##$USER= <dgb>
##$AMP= (0..31)
100 100 100 100 100 100 100 100 100 100 100 100 100 100 100 100 100 100 
100 100 100 100 100 100 100 100 100 100 100 100 100 100 
##$AQSEQ= 0
##$AQ_mod= 3
##$AUNM= <au_zg>
##$AUTOPOS= <46 >
##$BF1= 250.13
##$BF2= 250.13
##$BF3= 250.13
##$BF4= 250.13
##$BF5= 500.13
##$BF6= 500.13
##$BF7= 500.13
##$BF8= 500.13
##$BYTORDA= 1
##$CFDGTYP= 0
##$CFRGTYP= 5
##$CHEMSTR= <none>
##$CNST= (0..31)
1 1 145 1 1 1 1 1 1 1 1 1 1 1 1 1 1 1 1 1 1 1 1 1 1 1 1 1 1 1 1 1 
##$CPDPRG= <>
##$CPDPRG1= <>
##$CPDPRG2= <>
##$CPDPRG3= <>
##$CPDPRG4= <mlev>
##$CPDPRG5= <mlev>
##$CPDPRG6= <mlev>
##$CPDPRG7= <mlev>
##$CPDPRG8= <mlev>
##$CPDPRGB= <>
##$CPDPRGT= <>
##$D= (0..31)
0 1 0 0 0 0 0 0 0 0.06 0 0 0 0 0 0 0.0002 0 0 0 0 0 0 0 0 0 0 0 0 0 0 
0 
##$DATE= 1188306965
##$DBL= (0..7)
120 120 120 120 120 120 120 120 
##$DBP= (0..7)
150 150 150 150 150 150 150 150 
##$DBP07= 0
##$DBPNAM0= <>
##$DBPNAM1= <>
$$ [...]
##$SUBNAM7= <"">
##$SUBNAM8= <"">
##$SUBNAM9= <"">
##$SW= 20.6930455092707
##$SWIBOX= (0..15)
0 0 3 0 0 0 0 0 0 0 0 0 0 0 0 0 
##$SW_h= 5175.983436853
##$TD= 65536
##$TD0= 1
##$TE= 297.16
##$TE2= 300
##$TE3= 300
##$TEG= 300
##$TL= (0..7)
0 120 120 120 120 120 120 120 
##$TP= (0..7)
150 150 150 150 150 150 150 150 
##$TP07= 0
##$TPNAME0= <>
##$TPNAME1= <>
##$TPNAME2= <>
##$TPNAME3= <>
##$TPNAME4= <>
##$TPNAME5= <>
##$TPNAME6= <>
##$TPNAME7= <>
##$TPOAL= (0..7)
0.5 0.5 0.5 0.5 0.5 0.5 0.5 0.5 
##$TPOFFS= (0..7)
0 0 0 0 0 0 0 0 
##$TUNHIN= 0
##$TUNHOUT= 0
##$TUNXOUT= 0
##$USERA1= <user>
##$USERA2= <user>
##$USERA3= <user>
##$USERA4= <user>
##$USERA5= <user>
##$V9= 5
##$VALIST= <valist>
##$VCLIST= <CCCCCCCCCCCCCCC>
##$VD= 0
##$VDLIST= <DDDDDDDDDDDDDDD>
##$VPLIST= <PPPPPPPPPPPPPPP>
##$VTLIST= <TTTTTTTTTTTTTTT>
##$WBST= 1024
##$WBSW= 4
##$XGAIN= (0..3)
0 0 0 0 
##$XL= 0
##$YL= 0
##$YMAX_a= 416711
##$YMIN_a= -391647
##$ZGOPTNS= <>
##$ZL1= 120
##$ZL2= 120
##$ZL3= 120
##$ZL4= 120
##$ABSF1= 16.522
##$ABSF2= -4.171173
##$ABSG= 5
##$ABSL= 3
##$ALPHA= 0
##$AQORDER= 0
##$ASSFAC= 0
##$ASSFACI= 0
##$ASSFACX= 0
##$ASSWID= 0
##$AUNMP= <proc_1d>
##$AZFE= 0.1
##$AZFW= 0.1
##$BCFW= 0
##$BC_mod= 0
##$BYTORDP= 0
##$COROFFS= 0
##$CY= 12.5
##$DATMOD= 1
##$DC= 0
##$DFILT= <>
##$DTYPP= 0
##$F1P= 14.0000005364418
##$F2P= -0.99999901652339
##$FCOR= 0.5
##$FTSIZE= 32768
##$FT_mod= 6
##$GAMMA= 0
##$GB= 0
##$INTBC= 1
##$INTSCL= 1
##$ISEN= 128
##$LB= 0.3
##$LEV0= 0
##$LPBIN= 0
##$MAXI= 10000
##$MC2= 0
##$MEAN= 0
##$ME_mod= 0
##$MI= 0
##$NCOEF= 0
##$NC_proc= -3
##$NLEV= 6
##$NOISF1= 0
##$NOISF2= 0
##$NSP= 0
##$NTH_PI= 0
##$NZP= 0
##$OFFSET= 16.522
##$PC= 1
##$PHC0= -42.93496
##$PHC1= 8.081714
##$PH_mod= 1
##$PKNL= yes
##$PPARMOD= 0
##$PSCAL= 4
##$PSIGN= 0
##$REVERSE= no
##$SF= 250.13
##$SI= 32768
##$SIGF1= 0
##$SIGF2= 0
##$SINO= 400
##$SIOLD= 32768
##$SREGLST= <1H.CDCl3>
##$SSB= 0
##$STSI= 32768
##$STSR= 0
##$SW_p= 5175.98343685301
##$SYMM= 0
##$S_DEV= 0
##$TDeff= 65536
##$TDoff= 0
##$TI= <Analysis number 999999
Compound Code 99
Book Reference 9
Project Code 9>
##$TILT= no
##$TM1= 0
##$TM2= 0
##$TOPLEV= 0
##$USERP1= <user>
##$USERP2= <user>
##$USERP3= <user>
##$USERP4= <user>
##$USERP5= <user>
##$WDW= 1
##$XDIM= 32768
##$YMAX_p= 315837049
##$YMIN_p= -108781
$$ End of Bruker specific parameters
$$ ---------------------------------
##NTUPLES= NMR SPECTRUM
##VAR_NAME=  FREQUENCY,     SPECTRUM/REAL,   SPECTRUM/IMAG
##SYMBOL=    X,             R,               I
##VAR_TYPE=  INDEPENDENT,   DEPENDENT,       DEPENDENT
##VAR_FORM=  AFFN,          ASDF,            ASDF
##VAR_DIM=   32768,         32768,           32768
##UNITS=     HZ,            ARBITRARY UNITS, ARBITRARY UNITS
##FACTOR=    0.157963299565203, 1,           1
##FIRST=     4132.6476996994, 0,             0
##LAST=      -1043.33573715361, 0,           0
##MIN=       -1043.33573715361, -108781,     0
##MAX=       4132.6476996994, 315837049,     0
$$ Real data points
##PAGE= N=1
##DATA TABLE= (X++(R..R)), XYDATA
$$ [...]
24258A2360M713j6352K3765K2329K1149K0980J1433j0208k3043k0529j2094l8098
24246c595j1861L6011J9367l4046j7985Q386j1724o166L9586J7898J2431r422
24234C8880k5412n116P992J3735J3398L643j7183j4498j537J3184O585j0144j085
24221B2442j5314k4365k060L6277K4997J1199j0992k0293k7338l1634K8049J0265
24209A233q343Q310K222r40l506L4342K2748l874j1118q70L26j680J5239m741
24195D9348k3164m2283Q91J5926K6262j4858j1146m32j2943j5749R960M543N68
24182a3077r691O731L0670p369j5206R626J8864j3377k7221l1495J0638J2818
24170b8089J9038j3491k2448K884J7834P487j1503J4921L2774j1332l3549p67
$$ y = [12360, 17073, 721, 24486, 46815, 67964, 88944, 100377, 90169, 67126, 46597, 34503, -3595, -15456, 20555, 39922, 5876, -12109, -3723, -15447, -21613, 17973, 35871, 48302, 38880, 13468, 8352, 16344, 30079, 43477, 47120, 29937, 15439, 13902, 27086, 33671, 23527, 22442, 7128, -17237, -19297, 16980, 41977, 53176, 42184, 21891, -5447, -37081, -9032, 1233, -7110, 1200, 3422, 2482, -1024, 33318, 56066, 52192, 41074, 40204, 40530, 38850, 54089, 49348, 26184, -16099, -15208, 718, 26980, 12122, 976, 544, -12399, -28148, -18188, -13645, -13077, -22768, -16037, 14633, 7264, -7942, 1684, 20548, 7171, -20050, -51545, -40907, -28089, -9051, -22542, -44990, -42106, -24272, -16785, -28288, -13367, 19407, 8075, -25474, -26241]
24158b6241k571J2447M103k033J190J2640Q059O932j6645J0441O02j1587j3303
24145a5966M566K265L2119m569J4565j2209k3830j8971j6963k1311J0411L2918
24133a6975K7619p591J0114K1914K9417N067l9021O86j5582k1408J8324K6528
24121C9092k7851o575K9492j5349k9622J5582P827k3427j5819j5455J98m27J5325
24108b7009j87L0747l92j6665R158k0349J0669K9627P864l1877j6308j4628J1631
24095b7719K4468n001k068k2058R451N963j2708j4564L2884P866l4128j8311M6087
24082i838J5108j9216o641J0012J8900n359J45j2460m790L8113J7438k1123p487
24069A2802j5193J2344K0518p940j1868m688L8445j1047j6221m004k1976k5776
$$ y = [-26241, -28812, -16365, -12262, -14295, -13105, -465, 7594, 14526, -2119, 8322, 8924, -2663, -15966, -11400, -9135, 22984, 18415, 32980, 20771, -3059, -22030, -38993, -60304, -49893, -16975, 10644, 3053, 13167, 35081, 64498, 69565, 30544, 31230, 15648, -5760, 12564, 39092, 11241, 4666, 34158, 18809, -10813, 4769, 12596, -10831, -26650, -42105, -41907, -42334, -27009, -27196, 3551, 3159, -13506, -4348, -24697, -14028, 15599, 23463, -8414, -24722, -39350, -27719, -3251, -8252, -10320, -32378, -22927, -16964, -29672, -44236, -11352, -3486, -37614, -55925, -9838, 5270, -13946, -20587, -10575, 8325, 2966, 3111, -9349, -14139, 23974, 41412, 20289, 12802, -2391, 9953, 30471, 22531, 10663, 5975, 44420, 33373, 17152, 13148, -8828, -34604]
24057c4604j5580J1959l31o054N275j3278r893K6141L5099K2972J2315P660j0245
24044C1436r506k5420N962K0982r419L7724J9921l2434k3828j2538j5737j5175
24032b8032K3264K2797m910j0209r841J2262L3214K015K1298R305m951l515L46
24019F3043Q151j3470j96j2357j1419k3406l1644k5426j2087J0943n60n944J5532
24006c8840K0215M133j089J6112K2311L0072j351m9971m080L280N421k536L25
23993D002k8408r634L6131J7955R138r966J1612M802j6566J0392j1115k7377r761
23980a8795j2818N462J0344K6537J4763j4948m032k6986O286J1554j2973j9682
23968c5288J3993m312l986J3040K433J398J2478k7058j0063K2744N194L034k850
$$ y = [-34604, -50184, -38225, -38556, -44610, -39335, -52613, -62506, -36365, -1266, 21706, 34021, 41681, 31436, 21930, -3490, 2472, 23454, 14035, 51759, 71680, 39246, 15418, 2880, -12857, -28032, -4768, 18029, 13119, 2910, -6931, 5331, 38545, 40560, 61858, 71163, 66212, 62697, 63043, 71194, 57724, 57528, 45171, 33752, 10346, -21298, -46724, -58811, -47868, -48428, -54372, -38840, -18625, -14492, -15581, 531, 22842, 52914, 51563, 1592, -2488, 792, 6213, 3677, 4002, -24406, -34040, 2091, 20046, 29184, 19218, 30830, 35632, 19066, 29458, 18343, -9034, -18795, -31613, -26151, -15807, 10730, 25493, 10545, 6513, -20473, -14187, -2633, -15606, -35288, -21295, -25607, -29593, -16553, -14120, -12722, -244, -27302, -37365, -14621, -9427, -6393, -9243]
23955i243R886l617j1839L916K4479r814m484L510k1411M277J6868J5499j1872
23942F155n43K7833M038k1526m623L7537k103j0926J4994j1784l3745l946l6755
23929c5394J2586L2453k1826m526n947J9557o63l4842J4219J4194k0810l3826
23917f4825j4464K6184O666Q998j835Q274K7828l062J3030J6905M860k8626m279
23904d346J2016j1626K3348L3955N673k9094k3040n042n560j0554J591K0619q641
23891g01j424K8478K3717q478l969k929l893k7158o159n939J8818L1419q465n975
23877B7342K5722J62j2823j4667k581j690J0905o129p761o63J959m975q235M452
23863A1018j8034l1982K7397J9764J2217K1095q415k3778l7136k174J8995q613
$$ y = [-9243, 643, -2974, -14813, -10897, 13582, 3768, -716, 2794, -18617, -14340, 2528, 18027, 6155, 5612, 33445, 37483, 15957, 11334, 48871, 46768, 35842, 50836, 39052, 5307, 1361, -35394, -22808, 9645, -12181, -16707, -22654, -3097, -3760, -38602, -24383, -10189, -30999, -64825, -79289, -53105, -46439, -37441, -39276, -31002, -3174, -6236, 6794, 23699, 28559, -67, -4346, 7670, -3956, 19392, 53347, 59020, 29926, 6886, 1844, -3716, -14270, -12679, 7940, -701, -2125, 26353, 50070, 41592, 37623, 34694, 30801, 3643, -2516, -8455, 10363, 41782, 33317, 27342, 53064, 53226, 40403, 25736, 23155, 21465, 32370, 26241, 18480, 17817, 19776, 14801, 6566, 11018, -7016, -38998, -11601, 8163, 20380, 41475, 33060, 9282, -27854, -30028, -11033, -19646]
23851a9646l2135k422Q303K4812j2727j9034K4283K1298j0980j3413K8898n015
23839g778m016J7770Q044j802P244J4072k1082J0637j4429q240J2615K4831q496
23826B9370j0264r64J0409n956P081k5432Q503O855o802k1900l1136o899K3454
23813b3681P544k1864J4125K1126J1452J1617L451m237k1469l739J0579J8794
23801B3698J1997j9373j8373L444j397r222L723k402L658P234j1454J6736m81
23788G788j7645N06j1971o214J9267Q358l6125m613L5524j2526J211J4404J8028
23775A5992l1594k7249J1355L5674K646k3950j0486n320J829l1107p985j2161
23763h2356J8507L4567r612k129l355K1014K7364Q996j2851k3863l2303j0331
$$ y = [-19646, -51781, -54203, -45900, -21088, -33815, -52849, -28566, -7268, -18248, -31661, -2763, -7778, -11794, 5976, 14020, 12218, 19462, 33534, 12452, 23089, 8660, 420, 13035, 37866, 29370, 19106, 18142, 28551, 22595, 29676, 4244, 12747, 19602, 12800, -9100, -40236, -47135, -23681, -16137, -38001, -23876, -2750, 8702, 20319, 23770, 19533, -1936, -5675, 4904, 23698, 35695, 16322, -2051, 1393, -4, -9226, -5503, -7905, -4247, 2987, -8467, 8269, 7788, -9857, -9351, -21322, -27536, -8269, 89, -36036, -40649, -5125, -17651, -16440, -2036, 15992, -15602, -42851, -31496, 4178, 6824, -17126, -27612, -32932, -31103, -62210, -70195, -82356, -63849, -29282, -38894, -41023, -44378, -23364, 4000, 12996, 145, -23718, -56021, -66352]
23751f6352r08J3703M3229P963J1198j6725M857J7842j9887j0830L0679j8054
23739c285J2399K6857j6327l8629R89N684j0071l1455j5230J4963L12l809L2483
23726b5119L7989r340j5616P436l242l8976k6395J4414J5062K5136J1022j1560
23714a9189k80J2550P028J5361k954k8025j457L602Q041N609J7733Q338K1968
23701D8325J8409j5196m3690m8562O674J5582k233j7389J9369K1166J635R923
23689A4013l1695m156j0870O614J2874k868l523L009k1682n1603J5004K7924J1694
23676c5265R254M202K3378N695J8412J2040j6929m010k650J2859j874K551j5809
23663A1854j748Q982j5900l6858n917L3688K5246o454p621k1505m0993o860J9545
$$ y = [-66352, -67260, -53557, -10328, -2365, 8833, -7892, -3035, 14807, -5080, -15910, 14769, -3285, 9114, 35971, 19644, -18985, -17996, -12312, -22383, -53838, -69068, -54105, -53793, -57602, -25119, 12870, 3530, -12086, -4650, -7892, -46868, -73263, -58849, -43787, -18651, -7629, -19189, -19469, -6919, 109, 15470, 12516, -15509, -16966, -13364, -5323, 286, 18019, 26357, 48325, 66734, 51538, 7848, -40714, -34040, -18458, -20691, -38080, -18711, 2455, 4090, 14013, -17682, -21838, -32708, -26094, -13220, -16088, -19611, -16602, -38284, -89887, -74883, -46959, -35265, -26011, -21809, 1569, 7264, 25676, 37716, 20787, 16777, 14127, 26986, 25112, 27663, 11854, 10106, 19088, 3188, -33670, -39587, -5899, 19347, 12893, 5272, -16233, -57226, -64086, -44541]
23650d4541J1934J8154j8226j0686K2071M634J1498q988N67M787L745r483n580
23637b0114R533O072j9754q032K3692J3842J5233l401j6143r14l958k1044N584
23624a9404M839J0201J097N113J1301p413j1224j6022J343k4323Q128J8082L4591
23611A6309o186k5057k3637J7677L0883k1l708q723l1540o679P4j425O317n062
23597d0778J0877J8018p46j6257L3426K6949J730K1108K5364k3462m7227N848
23585A4850L0887p185l180R820K151q425m75o146J811j3789j2227P147N981k6789
23571e569K189P91J6188N094L459k4886O044M992l1550k1379K8222K855l798J3338
23557d010M294J0018k0677k1668k338K947j0588j430K6874m680n685J6518R151
$$ y = [-44541, -32607, -14453, -32679, -43365, -21294, -16660, -5162, -14150, -13583, -8796, -5051, -14534, -20114, -10581, -4509, -24263, -32295, -8603, 5239, 20472, 17071, 928, 14, -3944, -24988, -19404, -14565, -4364, -3267, 1846, 13147, 5734, -5490, -21512, -20169, -44492, -36364, -18282, 16309, 10123, -14934, -38571, -20894, 9989, 9968, 6260, -2463, -34003, -40682, -40608, -42033, -35716, -40778, -29901, -11883, -12629, -28886, 4540, 31489, 33219, 54327, 79691, 56229, 9002, 14850, 45737, 38552, 35372, 45192, 47343, 38918, 38443, 32297, 34108, 20319, 8092, 15239, 21220, -5569, -3380, -2589, 13599, 18693, 22152, -2734, 3310, 8302, -23248, -44627, -16405, -13550, -17348, -4010, 284, 10302, -10375, -32043, -34381, -31434, -42022, -43452, -16578, -21258, -26943, -10425, -1274]
23544a274j2977k4231J0883J0985K0978J2254j6090k0104j0715J9017J6361J8647
23532B3734j4585j1564j9637k9451j0996m102K8246M8901j858o465q085r526j4044
23519b9432n644R429J9360k7015l4904m097K7787k880L271j598l43L9541L417
23506c108k4833p362l2315P55M8213K4706N570k5205j8513j6631j2489J0385K1188
23493b9639J5080j5538k66J3026J7482L0806o72K540k6575m4218l7966N259K9587
23480d1094J2718L9143L0400j155k9467l9259m059J0847l929K4592K8222K4641
23468E1600j3858o384l3396j1926J1353p535k4627J4359J1556L793j3671k213
23456b0949J8989J7968L678k0539J0244k5818l9293r710N153K2443K8397l7626
$$ y = [-1274, -14251, -38482, -27599, -16614, 4364, 16618, 528, -19576, -30291, -11274, 5087, 23734, 9149, -2415, -22052, -51503, -62499, -66601, -38355, 10546, 8688, 2223, -5862, -15388, -29432, -35076, -25647, -6287, -33302, -68206, -72303, -44516, -47396, -44125, -45723, -46066, -6525, -3108, -27941, -35303, -67618, -66863, -18650, 6056, 11626, -13579, -32092, -48723, -61212, -50827, -29639, -14559, -30097, -30363, -17337, 145, 30951, 30279, 32819, 6244, -37974, -75940, -70681, -41094, -28376, 10767, 41167, 40012, 10545, -28714, -32773, -21926, -25855, -1263, 26959, 51600, 37742, 31358, -2038, -13964, -2611, -10146, -34773, -20414, -8858, -5065, -18736, -20949, -1960, 16008, 19686, -853, 9391, -16427, -55720, -65430, -60277, -37834, -9437, -47063]
23444d7063j8955J0379M0637J0100k1222Q269J7221K6569l038j8627j0280J3643
23432G633K0111L5583J5455l8955q474J2721k5309j4345k5791j1903P084K2629
23420c561p031p519q874P221o577O071K6754K8609K6870k3001q247l034k6124
23407A557l9865K766K3455L303j236K2155K3953K0743q303k3633l2058j2344J7849
23394a658k3263k7857L843J425P912K224J3498k6790J0491L567J3626L609P685
23381a1688L139j352J1789O695L2825R075l9750j4940o129J6685J0044L2565L097
23368E2055l5232j9795J1414O591j2972j205L464J767M628k7183o895o110m931
23355c4404L0225J8892L178K545l1898l586M708J1898q948J2630J4884o149J2430
$$ y = [-47063, -66018, -55639, -15002, -4902, -26124, -17855, -634, 25935, 22897, 4270, -6010, 7633, 27744, 63327, 78782, 39827, 31353, 44074, 18765, 4420, -21371, -33274, -26190, -3561, -10592, -18111, -26985, -19764, -26341, -20270, 6484, 35093, 61963, 38962, 30715, 27681, 1557, -38308, -35542, -12087, -8784, -10020, 12135, 36088, 56831, 48528, 24895, -7163, -19507, -1658, -24921, -52778, -48935, -47510, -39598, -37374, -23876, -50666, -40175, -36608, -22982, -19373, -11688, -8549, -9901, 1888, 8583, 41408, 50483, 10733, -4207, -10336, 6349, 16393, 48958, 52055, 16823, -2972, 8442, 15033, 2061, 856, 4320, 6087, 10715, -16468, -23363, -29473, -34404, -4179, 14713, 17891, 20436, -11462, -15048, -10340, 1558, -7390, 5240, 20124, 13975, 26405]
23342B6405L0017j0979l7047O979J1682j8294P560R413k9659R686J6933j4846
23330G850J3577j1882j3760k1589j9161J4778J3929o174p947K3397K6577j3631
23318E964j8363j6543p91M3989K3024J6754J4543p718m3707j023M520k6860K0651
23305A4440J5188p043l1591k7060K9887K3775J0045O656k2565q3r697L534M82
23292E968j3617k5567q249J570K5688J8455k532J6682K9521r83j8153r183o381
23279A3219j1558K2522p852j4469j2870k4475J0854J9632p236j540l31k8146k1842
23266f4092J3312K3515k304l0493J0687M2557l087k6695K549J8726J9880m217
23254C38j1063J3035J0292J1525p667j4124k2804K504j2334K9000m698K790J7766
$$ y = [26405, 56422, 45443, 8396, 15375, 27057, 8763, 16323, 25736, -3923, 5763, 22696, 7850, 21427, 9545, -4215, -25804, -44965, -30187, -16258, -22432, -30379, -6982, 19595, 5964, -12399, -28942, -29733, 14256, 37280, 54034, 68577, 60859, 17152, 16129, 20649, -6211, 14440, 29628, 22585, -9006, -36066, -6179, 17596, 27641, 34297, 11732, 11649, 1952, 5486, 5968, -7649, -33216, -41465, -39895, -14207, 4248, 1716, 18398, 47919, 46936, 28783, 19600, 13219, 1661, 24183, 16331, 1862, -11008, -35483, -24629, -4997, -12233, -13773, -14104, -42250, -64092, -50780, -27265, -29569, -60062, -49375, -6818, -9905, -36600, -34051, -15325, 4555, 338, -10725, 2310, 12602, 24127, 16460, 2336, -20468, -17964, -30298, -1298, -5996, -3206, 14560]
23241A4560j1757l0576M53K6187J4138K494l891m5665J218J6915J9364j1251k8943
23228c6754J4009L9464K7698n164j7934K3327j3748k300N721q188k0821l3477
23216b8167K1704K5078J6835Q714Q337j9063P553l7667k4152O758K8324J9917
23204C4171j6762j6832k683R84l553r931j9047Q88J8516L231o147m93n035Q305
23190a4388O11M562R246K7943j3787k2066k3486K1387J0745k7857k1574R934J9973
23177a8757L334M756J4143J5083q688O638j4553o062k1103Q221o0J3103j7401
23164b1346K2618j6315l5474J4089K9939k2246r380J2600j3233j0336N501L2797
23152a0786L3721J0012l2099J2048j4753l6256n809L1132L1534M698J3912J4862
$$ y = [14560, 2803, -27773, -27320, -1133, 13005, 15499, 11608, -34057, -32839, -15924, 3440, -7811, -36754, -22745, 16719, 44417, 39253, 21319, 44646, 30898, 28598, 34319, 26131, 5310, -28167, -6463, 18615, 35450, 44164, 52501, 33438, 40991, 3324, -20828, -14070, 14254, 34171, 17409, 577, -2106, -1122, -4675, -14606, -33653, -32765, -14249, -11018, -17165, -17658, -22693, -14388, -13777, -9215, 31, 27974, 14187, -7879, -31365, -9978, 767, -27090, -48664, -38730, -18757, -15423, -10667, 3476, 18559, 9871, 16509, 1956, -4106, -25209, -16988, -17048, -3945, -21346, 1272, -15043, -50517, -36428, -6489, -28735, -38115, -25515, -38748, -49084, -43583, -10786, 22935, 32947, 848, 12896, -1857, -38113, -43922, -12790, 18744, 23442, 37354, 52216]
23140E2216J2404l708o786k501j3944m7513l5055j60o50J8761J1442n062k2165
23127d2721M346J7780j7236m0411K1629N0769o052J6843j357k0302l624J6856
23115c480K0137J5835K85j4160k2951p62J4160M007m542K314j5892K322O771j6442
23101a2398J1244J6298l8070j5773J699K325L1660M689p255j8664N435J246k692
23088b0256p501k1070K6174J1457j504q73k665R433J1198J7322R379q647r619
23075A2828r774j1673n081P422L0646p765J0532K1662m675k3607k262J5757r475
23062B4535j522r913J1904j6597Q444j3103k0898r083M4771L3554j0666j3600
23050B7826K0520j4398j5563K634k0587j8994j181P133R866R682M766j2764m195
$$ y = [52216, 64620, 60912, 54126, 51625, 37681, -9832, -44887, -45047, -45697, -26936, -15494, -20556, -42721, -38375, -20595, -37831, -78242, -56613, -5844, -11896, 4947, 3590, -16712, -20336, -3480, 16657, 32492, 32777, 18617, -4334, -5096, 9064, 13071, 8529, 10843, -5049, -2727, 4044, -12398, -1154, 15144, -22926, -38699, -37000, -34675, -3015, 1674, -5581, -24245, -18810, -17564, -20256, -27757, -48827, -22653, -11196, -12700, -13573, -16238, -6805, 4393, 21715, 31094, 22447, 12828, 3054, -8619, -13700, -6278, 24368, 16603, 27135, 48797, 44122, 20515, 18253, 34010, 24535, 23013, 13100, 25004, 8407, 16851, 3748, -17150, -26233, 18538, 52092, 41426, 27826, 48346, 33948, 18385, 21019, 432, -18562, -19743, -12610, -2744, 6938, 11704, -1060, -5255]
23037e255l800J1348J437l27o090J3838J5977j6479l2439j1341P035j3384n152
23024d4632M067N446K4119p901k1415P974K5078K5060j0700k8226J269R466K887
23011g508p3005J2874K8318M9312L7703p848n1956o630J3336J8078J3795j2984
22999A3485l1268l9792J605K788k0071q997J9135L5596R312r299m272J4076N899
22986a1803j4601j4416K3712K1478l377Nl261j663K3060K4162J8525J2139J9023
22973I2983m9775k5073J7933l3865n05N287L060L5020K0038j6971j1884M434Q358
22960D9040M28l5775k9734K7526K1714j9109O216Q094R633j5990l5773k5805K3925
22947a5610K2380r736k2779q805j6630N49N517k1679k1915K5822L3328K8921J8557
$$ y = [-5255, -9055, 2293, 3730, 3403, -2687, 11151, 27128, 10649, -21790, -33131, -26096, -39480, -44632, -40565, -35119, -11000, -18901, -40316, -32342, -7264, 17796, 7096, -21130, -19861, -10395, -7508, -80513, -67639, -39321, 9991, 47694, 39846, -12110, -18740, -5404, 12674, 26469, 13485, -17783, -57575, -55970, -53182, -73253, -82250, -63115, -27519, -18207, -27506, -31778, -17702, -11803, -26404, -40820, -17108, 4370, 993, 998, -2263, -3926, 19134, 43296, 61821, 73960, 92983, 43208, 18135, 36068, 2203, 1698, 6985, 10045, 45065, 65103, 48132, 36248, 40682, 49040, 49468, 13693, -16041, 11485, 33199, 14090, 20306, 28400, 38033, 22043, -13730, -39535, -15610, 6770, -2966, -25745, -34550, -51180, -50631, -45114, -66793, -88708, -62886, -29558, -637, 17920]
22934A7920J5561m391l751K4137J605k9533r415j7157j4855J8417K374M740j5634
22921i982k601K3664k6889k8110K9949L1195K3909j1447j5636l2664L444j7685
22909c2853j6481J5903J8411J6590J9440j0911k7374k1225J4731r027R471N889
22897a7436K9685J8925l2871k7355o501l276J1676J1877K144k491j6257K1008
22885a0872L639L770K8510n910k1378R445N866M996J9108j0360m0721J7991M324
22872H408Q543j8962q932Q484L113L1500J5651J2811l0066l2334j4550j0451k8001
22859e4786L1622J8129K0569o523l9558j4195K400J2619j6567q784k671J4779
22847d2966J1331J8758L6243r13m2344m647J30L181q604J8273l984k7210p679
$$ y = [17920, 33481, 29090, 25339, 49476, 51081, 21548, 12133, -5024, -19879, -1462, 912, 5652, -9982, -12583, 11081, -15808, -43918, -13969, 17226, 41135, 29688, 14052, -18612, -15168, -32853, -49334, -33431, -15020, 1570, 21010, 10099, -17275, -38500, -23769, -32796, -23325, -17436, 12249, 31174, -1697, -29052, -35553, -38829, -27153, -15276, -13132, -15623, -31880, -10872, -7233, -3463, 25047, 19137, -2241, 7204, 13070, 18066, 37174, 26814, -13907, 4084, 8408, 16951, -2011, -10943, -2459, 654, 32154, 47805, 60616, 30550, -1784, -16334, -26785, -54786, -23164, -5035, 15534, 9011, -30547, -44742, -42342, -29723, -46290, -55074, -57745, -42966, -31635, -12877, 23366, 22453, -19891, -24538, -24408, -21227, -29831, -11558, -15542, -42752, -50431]
22834e0431M4870P384k7208P783k0531Q95K932O415J4735R983j7084J3464J4090
22821G297K473l5869l2174j9222L3534K7699J5899K6934N12K2576j8609l0669
22809C81p784R956k704j8366K3117R207j4524q317M0799r566l9722k454n403p419
22795c2799J5649J9776Q23l7327j8627P242Q834J1350k786J2884o71R359J6822
22782A0529j3254m50p974j210Q466L207j98K3515L839J2285O655o059l0274j3496
22768d419O129J5461Q309k3936j9240M645J0455K9068j1900l757J6040j194k7279
22755a618j5154J7980J6482K073N711l1577j9246q276k349p652L692j0893j7994
22742f8821L1679M2302K439j9597Q031J4297K3386n0305j2860J7906L6591o129
$$ y = [-50431, -5561, 1823, -25385, -17602, -38133, -37238, -34306, -27891, -13156, -3173, -20257, -6793, 7297, 9770, -26099, -58273, -77495, -43961, -16262, -363, 26571, 27083, 49659, 31050, 381, -7403, 2553, -151, -18517, 4600, 13807, -717, -9034, 31765, 22199, -17523, -19977, -25380, -32799, -17150, 2626, 3449, -33878, -52505, -45263, -36429, -25079, -27865, -14981, -15652, -6293, 10529, -2725, -3175, -11149, -12359, -3893, -686, -884, 22631, 26470, 38755, 45410, 39351, 9077, -4419, 1710, 17171, 25480, 1544, -17696, -13051, -2596, 26472, 14572, 10815, 26855, 25661, -1618, -16772, 1208, 17690, 19763, 25474, -6103, -25349, -33625, -35974, -43626, -39934, -50827, -68821, -37142, 5160, 7599, -11998, -3967, 10330, 33716, -16589, -29449, -11543, 25048, 18919]
22730A8919l7839j4359J6227O416K0582K1806j4591l7610M110L2395K071q081
22718A0046J6129m541m174q845m564j6207o005K0888K5052o587j0997R402l2452
22705a2855j8414O041K1009J876p099o559J0358Q093J020J8372k205k2786j244
22692d393J5228j4378n759K0969N745k385o393j0115K157K1577L4947N392Q949
22679G1541K301k4187k5964j2382j249l70K9647K7942j9799m4250K2824J3770
22667C9824J1172l015l8385k4965j8074K305j0194Q233K3955J9185o980K4195
22655B7256K8553j9214j6668L495k5492l192k6261J4444R15J9247j1159l3383
22643d1459j2357o668m246j9488J2047L3831M236l1937p331L7153K771j6996N752
$$ y = [18919, -18920, -33279, -17052, -10636, 9946, 31752, 17161, -20449, -16339, 16056, 18127, 10046, 26175, 21634, 17460, 8615, 4051, -12156, -18161, 2727, 27779, 21192, 10195, 19597, -12855, -31269, -25228, -4219, -2343, -9442, -16001, -5643, 2450, 3470, 21842, 19637, -3149, -4393, 10835, -3543, -9302, 11667, 17412, 15027, 8634, -1481, 676, 22253, 57200, 62592, 71541, 73842, 49655, 23691, 11309, 10060, 9690, 39337, 67279, 47480, 3230, 26054, 39824, 50996, 47981, 9596, -15369, -33443, -31138, -41332, -33099, -9144, 10041, 3061, 27256, 55809, 36595, 19927, 23422, -2070, -5262, -31523, -17079, -16164, 3083, -8076, -41459, -53816, -60484, -64730, -84218, -72171, -38340, -34104, -66041, -73372, -36219, -33448, -50444, -44692]
22630d4692q337r804p302j44L903J5843K7781K8428j1677r195j524K0751l70j0902
22616g241J9675k084K2980m260O214K280l450K492j8112J7331K541k1777P112
22603B3701J4682q865m1873K6534n274k4293p856p36l0660l0768O887L8712L0294
22590i515K7811j867k1156r007j4468k823j1668N047M6701K3380J2161J2372o1085
22577d117k6083L5307J3437p179k4245j7801N58N201n526j3763R884J2359J8134
22564c834M440q075l5330O343M6216L3656n062k9445j5044O170j2636j4783J2697
22551a4687m375k4374J2617L1910l14j735J4616R236j2089j5023J4179J1535J0559
22538C2055j6261J722m8830J5054K6684J5870L871P899j9000r82r223j3543n287
$$ y = [-44692, -53029, -62833, -70135, -70279, -66376, -50533, -22752, 5676, -6001, -15196, -16720, 4031, 3661, -7241, 12434, 10350, 33330, 29070, 35284, 37564, 34114, 36606, 18494, 35825, 38366, 16589, 23701, 38383, 29518, -12355, 14179, 8905, -15388, -23244, -23980, -54640, -85408, -78521, -39809, -9515, 18296, 16429, -4727, -13734, -28202, -31025, -42693, -37646, 9055, 32435, 44596, 56968, -4117, -30200, 5107, 18544, 11365, -12880, -30681, -30123, -24922, -30448, -44211, -34327, -21968, -3834, 606, -7469, -42799, -36456, 9760, 43416, 38354, 8909, -6135, 35, -12601, -27384, -14687, -19062, -43436, -30819, 1091, 777, -958, 13658, 22894, 10805, -4218, 9961, 21496, 32055, 15794, 17516, -31314, -16260, 10424, 26294, 30165, 38064, 19064, 18082, 8859, -4684, -9971]
22525i971K414L2249j8583r441K972k2960R535K552n635O22J2006k7555k1970
22512e3765Q171M40K758Q360O778l098J0921j8528J3445L4023L942o524k0821
22499a3898J4380J1207k7635k8631M577J2069L992M1626K7583Q157r430k6532
22487A7465k7698j7566L451L1298J8477l7933k4754J6918o022q787N832q983O210
22474c2092J8965J699J6704M0484q79O192K2456k9815k0718J145J2143k153k0855
22461A3276n4683j4897L5928M2793o444k8537j932K7303K7700j2126l3548J6247
22449A1080j0913j8736m963j3754N229r833R046q008n629J8658J4847J1490j7714
22436a9200m335j118l387K5930J0924p513N109m672O871O37q712j8522l5542J4582
$$ y = [-9971, -7557, 24692, 6109, -3332, -360, -23320, -13785, -11233, -16868, -16246, -4240, -31795, -53765, -45594, -45154, -42396, -34036, -27258, -30356, -19435, -37963, -24518, 9505, 13447, 6923, -13898, 482, 11689, -15946, -44577, -40000, -27931, -23939, 17687, 45270, 53427, 43997, 17465, -10233, -27799, -24348, 6950, 25427, -12506, -37260, -20342, -26364, -35151, -29319, -38302, -32092, -13127, -11428, 5276, 45760, 44881, 51073, 73529, 43714, 22996, 24141, 36284, 34131, 13276, -41407, -56304, -20376, 22417, 15973, -12564, -14496, 12807, 40507, 28381, -5167, 11080, 167, -18569, -23532, -37286, -32057, -41890, -32844, -40852, -46481, -27823, -12976, -1486, -19200, -23535, -24653, -28040, -2110, 8814, 1301, 6410, 1738, 8609, 9246, 534, -17988, -53530, -38948]
22422c8948L8896K0371k4276J0163m901J0128K8324k9844m0644J0727K0117q822
22410h709r604k9099J5577J1087k0516K6870O093O694K5872K0446l7025j7286
22398i600q920q523l28q593o041m359L5807K4470P494K2206k1770k5849k3906
22385b7912K4655N244m151k2935L5507M491k4050j1727m923K2911k5137r344K7866
22372i505L241J3075M5423o840k6133j3546q78O558J5271l3852j196Q474q016
22359g924K9747j071q272K7504P851k7899k0708j340L082n569K9129L335k2256
22346E609l616l312k0381j271J7530J4231J293j8277p875J4782L948J2870K8289
22333D3820k1930k5351K2162p61m402R452j4683L816j7898k7581L4297q655J0735
$$ y = [-38948, -52, 20319, -3957, 6206, 1305, 11433, 39757, 9913, -30731, -20004, 113, -8709, -18313, -47412, -31835, -20748, -41264, -14394, -8301, -1607, 24265, 44711, 7686, -9600, -18520, -27043, -27371, -35964, -42005, -46364, -10557, 13913, 21407, 43613, 21843, -4006, -27912, -3257, 1987, -2164, -25099, 10408, 14899, -9151, -20878, -25801, -2890, -28027, -37371, -9505, -6264, 6811, 52234, 45394, 19261, 5715, 4837, 11395, 26666, -7186, -8382, 92, -7924, 21823, 20752, 12480, 39984, 47835, 19936, -772, -2112, 970, -4599, 24530, 27865, 5609, 1993, -1319, -21700, -22971, -5441, 8790, 10083, -8194, -16069, -1287, 2661, 15531, 43820, 21890, -3461, 18701, 17940, 13538, 22990, 8307, 12123, -5775, -33356, 941, -7714, 3021]
22320C021m848J6182j0088p570j5458j9914k232M934J3534Q995J626J7443Q942
22307A4567O143K4188j9003l2812j8575j0034j4612J6286J3822p813j9955J0353
22295c7445J1335J2473J1974j3045k849L1758j0654k9409o515J565K5313P81K6956
22282B2238K2814O21j3014k6730J743J6725R346J5865l3468k5483J4682l848q062
22269f571O709k945J2993J6290L462l5006j9859M365j2652L1545K2639q607l681
22256H682r411q101r064J6943J2188k7026L634O169j8074J0682l870o528N00m21
22242b3697j7160p279J8188L781J9266j7808j0995k0026K1128n592l3237J1143
22230f2288J9063J9478O038j1076Q78k4112Q305L0453k343k5220n013J098K4177
$$ y = [3021, -1827, 14355, 4267, -3303, -18761, -38675, -40907, -35973, -22439, -13444, -11818, 5625, 14567, 20710, 44898, 25895, -6917, -25492, -35526, -50138, -33852, -20030, -27843, -47798, -37445, -26110, -13637, -1663, -14708, -17557, 14201, 3547, -25862, -32377, -30812, -5499, -4718, 22238, 45052, 45673, 32659, 5929, 7672, 24397, 33743, 49608, 16140, -9343, 5339, 1491, -6571, 138, -2807, 10186, 26476, 29938, -5068, -24927, -20562, -33214, -1669, 20970, 12363, 8682, -729, -8830, -17894, -951, 11237, -15789, -12155, -5986, -24060, -13378, -17248, -23776, -23276, -23697, -40857, -48136, -29948, -26167, -6901, -24709, -35704, -55730, -34602, -40194, -73431, -62288, -43225, -23747, -17709, -28785, -27907, -52019, -43714, -13261, -15604, -40824, -45837, -44739, -20562]
22217b0562K0250k0058J8007J3754K0697J7783J0880j4748m6866j7748p263J4967
22205a0907l536J3253L1927l8594l0297O290P413J0545P491m888j1366l254J51
22192b5772N3233K7053j3946l6921K872J8895M777j9431K069l5706K605L565K3421
22179F714J8952l0994k5215J1539J9977K6975k2974m1277K1101M5508R880l0533
22167I653k5390m296J9870l428L512J2360N77l1542J5082Q726l3107l2567m61
22154f1011L2401p486K5306l806J6992R623k4528j531J7430j8961J8861L8547
22142D1837k8660k4830J3716o645J1561j4008L927J0077m304m892j1362R328m975
22129i230J3384j953O306K0992p47k3880m316K665j3223j3388R046J9328j0403
$$ y = [-20562, -312, -20370, -2363, 11391, 32088, 49871, 60751, 46003, -863, -18611, -25874, -10907, -14443, -1190, 30737, -7857, -38154, -31864, -24451, -13906, -6415, -11303, -22669, -25923, -25772, 27461, 54514, 40568, 3647, 6519, 25414, 30191, 10760, 12829, -22877, -20272, -16707, 6714, 25666, -5328, -30543, -19004, 973, 27948, 4974, -36303, -15202, 30306, 40186, 9653, -15737, -20033, -163, -3591, -79, 12281, 12858, -18684, -3602, 5124, -27983, -60550, -61011, -28610, -36096, -10790, -14596, 2396, 12019, -12509, -14040, 3390, -15571, 3290, 41837, 13177, -11653, 2063, -4582, 6979, -7029, -3102, 6975, 2671, -2221, -13583, -4255, -9230, 4154, 2201, 8507, 29499, 28752, 4872, 556, 3221, -10002, -23390, -14344, 4984, -5419]
22116e419k5157J3775K7850J6622k2073k1111j1551J4559n747J756k5080K0758
22104b0818M7410K7707l9289l5410m514J449o953q566m248J0895N2069J5185J0059
22091D4976J1080n2965j1119J9242K9751K5160k6805K958k0691J0207l513j388
22079B6893j7757k9893n043p709L3790K8084m462p013j7731K032J3126R24l6366
22066b1125j994J5996P335N926k6395j5753N873J6696J1576K1455J3509l5232
22054b133L568K3239j6727l7914k1616J9940K6792j0954J0916n536j6846p393
22042c4664M4953P178k0810j6356K1441J9589j7612j6519J2342K1900p754j2220
22030A468O890j0623m3739J2638j5740J5770L0157m243j7711q195J8103L1170
$$ y = [-5419, -30576, -16801, 11049, 27671, 5598, -15513, -27064, -12505, -18252, -16496, -41576, -20818, 26592, 54299, 15010, -20400, -24914, -23465, -30418, -38984, -43232, -32337, 19732, 34917, 44976, 56056, 3091, -8028, 11214, 40965, 66125, 39320, 42278, 21587, 31794, 28281, 26893, 9136, -20757, -25800, -33509, 281, 28365, 23903, 16890, -841, 1191, 14317, 15241, -21125, -23119, -7123, 212, 6138, -20257, -36010, -30137, -13441, -1865, 19590, 33099, -2133, 1435, 24674, 7947, -29967, -51583, -31643, -4851, -15805, -4889, -10425, -27271, -34664, 10289, 17467, -3343, -19699, 1742, 21331, 3719, -12800, -458, 21442, 13688, 1468, 8358, -2265, -46004, -33366, -49106, -33336, -3179, -7422, -25133, -33328, -15225, 15945]
22018A5945J9208j6183k1530j1573j6736k661j543J8283R783k0559p667J2444
22006b2789O604j0601m591M088J3331K2049j8816l891o67j9187K5472Q332k793
21993c459r739J8859j6812j3266l576J458N8882K9481P03J6334k0729k3754m0631
21980f249q101L820j7344o946J5541K5077o829j1625l0092k7168j3389J7827K6375
21967c9103j6750K2755K1222J2367M903Q875j4724k3219r860J4792L780l7359
21955e2321j6422q931M307K5862K1573J1434j6260j3663O52K0840Q778l731l650
21942b1532j040q196j7772k4069L833K2135N2350K7527J2455j3092j7498P075
21930B2176q376j2070M499k5365l4667J771Q981L5530R998k6226J1310J5633j8404
$$ y = [15945, 35153, 18970, -2560, -14133, -30869, -33530, -35073, -16790, -7007, -27566, -35233, -22789, -16185, -26786, -31377, -27289, -13958, 8091, -10725, -14616, -15283, -34470, -8998, -666, -3459, -13198, 5661, -11151, -24417, -27993, -26535, 32347, 61828, 62531, 78865, 58136, 34382, -6249, -14350, -10530, -27874, -34820, -19279, 5798, -1031, -12656, -42748, -69916, -83305, -65478, -39103, -55853, -33098, -11876, 491, 5394, 14269, -455, -23674, -33534, -18742, -14962, -52321, -68743, -77674, -73367, -47505, -25932, -14498, -30758, -44421, -43769, -22929, -14151, -17882, -21532, -22572, -30768, -48540, -72609, -68776, -46641, 5709, 33236, 45691, 32599, 15101, 22176, 13800, 1730, 6229, -19136, -53803, -52032, -43051, -7521, 2477, -23749, -12439, 3194, -15210]
21917a5210j8592J4559J2030k2661j8686K0312L8370r787j6276k405L3623O039
21905B1316o783K4220R631L615k747k8300l5023j3810J2484Q778J8023j7937l4578
21892d1111k1434K5440K7082j3774P217P458Q305J2153p114K0432k4878k4257
21880b4481P543L031j0820J5612M652R712q320l0268N903J7253O054K5868J6114
21867C7853o246j6467k2389J2266K3344j2935j2474n750q598L3262M35J05M404
21854B6810k2919K306j103l4448j7009K3204L7349J1576j6767m181J3838K2095
21842D0751j0784k027J690l1150n2622p159N1414L4438l46l0596j9021M231R710
21829a1471L0354J98p580L2731k7584O19l78r122J6217J142l5787N782o700k2764
$$ y = [-15210, -33802, -19243, -7213, -29874, -48560, -28248, 10122, 335, -15941, -18346, 15277, 21316, 14533, 38753, 48384, 51999, 49252, 20952, -14071, -27881, -15397, -6619, 11404, -6533, -41111, -62545, -37105, -10023, -23797, -16580, -9122, -817, 11336, 4222, 24654, -224, -24481, -16938, -13907, -24727, -9115, -4463, 5249, -3071, -33339, -27436, -10183, -4129, 21739, 37853, 31607, 15140, -7249, 5017, 28361, 15426, 2952, -2798, -11396, 21866, 22301, 22406, 26810, 3891, 6197, 5094, -29354, -46363, -23159, 14190, 25766, 8999, 4818, 18656, 40751, 29967, 27940, 29630, -1520, -54142, -61301, -9887, 24551, 24205, -6391, -25412, -21181, -11471, 18883, 19081, 11501, 44232, 16648, 17267, 16889, 7767, 23984, 25126, -10661, -4879, -11579, -34343]
21815c4343k7486j5653P549L3832J8024n56K6149J4638m0817k1323K0119P420
21803a2447r486J4418L6622P735l2836k0002j5937J5459J4618J0463Q680J844
21791A9131l407L0920k8867m9363J9506K2630r523j4522j599J6179j7260r179
21779b5354K4029Q602j4982j2975k395j2116o406P144J7811P606J6956l09o540
21766A071j2083K7428L2368J2356m0620k5798p62J1878O39J8109j111j7044j9765
21753a3334L368N2209L1838m2598k8963p942P51K0244O500J6327n112p139j0056
21740A6093k1496n895q557j0777j9917j3379L4901J1197j282J6207k5118M190
21728b3833M3685L5493j8308k6076j2155L481K1758O564n829k3574l6055J4300
$$ y = [-34343, -61829, -77482, -69933, -36101, -18077, -18633, 7516, 22154, -18663, -39986, -19867, -12447, -21933, -7515, 29107, 36842, 4006, -15996, -31933, -16474, -1856, 8607, 17287, 19131, 15724, 46644, 17777, -31586, -12080, 10550, 1027, -13495, -15094, 1085, -16175, -25354, -1325, 7277, -7705, -20680, -23075, -35191, -41597, -34453, -16642, -9036, 7920, 7611, 1071, -11012, 16416, 48784, 61140, 20520, -5278, -6040, 5838, 6477, 24586, 23475, 6431, -13334, -9966, 42243, 74081, 31483, 2520, -5422, -4671, 15573, 22073, 38400, 33288, 26149, 16093, -5403, -11298, -19855, -30632, -50549, -63928, -29027, -17830, -19112, -2905, -28023, -23833, 19852, 55345, 37037, 10961, -1194, 2287, 24045, 30609, 24780, 1206, -34849, -20549]
21716b0549K8951P051k3103j835Q52m246K0751L3144j4422r425j3881j4722J0983
21703d51o743R686R603r704P892j7684j311L0327K3721j4627l3985o747R377k5599
21689b6245m7125J3712K0060N523j936J8022J4377n899p723m038O952J2472L300
21676A452o095k8910p925K4131L862R71L0263M216P182O617j573R403R644j3427
21662C9811o812n015l5829k2157J4771Q600j622J3179k7668q202J4129R657p180
21649a4338l793O24L474J7764L1060J088J3240K190m1131k4096O506j184P436
21636a160K0160L4034r375j8066L3942j804l0886n234J326R330N3J860k2670l2914
21622b1404n94L909J3920k231P738p327l528J0730L3947J6693n771j7853J122
$$ y = [-20549, 8402, 15453, -7650, -9485, -8633, -12879, 7872, 41016, 26594, 17169, 3288, -11434, -451, -7194, 2492, 12095, 2391, 10283, -7401, -8712, 21615, 45336, 30709, -3276, -10023, -646, -26245, -73370, -59658, -39598, -34075, -36011, -17989, -3612, -9511, -17234, -21272, -14320, -1848, 1452, -4643, -33553, -41478, -17347, -13485, -12514, 17749, 21965, 29147, 35764, 34191, 43594, 53238, 39811, 32999, 27984, -7845, -30002, -15231, -6631, -8253, 4926, -22742, -30944, -16815, -7158, -14338, -18131, -17507, -14033, 3731, 34791, 35879, 49119, 51309, 10178, -13918, -7412, -8596, -1160, 19000, 53034, 43659, 25593, 59535, 57731, 26845, 21611, 22937, 32267, 32320, 34180, 11510, -21404, -21998, -18089, -4169, -6400, 1338, -5989, -9517, 1213, 35160, 51853, 46082, 28229, 29351]
21609B9351r378N006K8842O339m1760k6561r530l4660O174K8110K7569j1407j0340
21596a2245K82P193j272j926M0878J8621n4107P029K7686j5685L621J083q968
21583A2190k2273J588p825j1192k6028J2135M4892K425l1078K373K9201L3950
21571D0358l385j0295j5019P970k5265k1710M087Q138j5847R664o008j6702m120
21558d8134J1133K120m339j4124K3310k781J3214K7077K124J7214n305l5602k2890
21545c6983R329k0314Q279M2552O737L131j318L658L6532J5907k3363K912K7811
21532G4870j2819l9900l9172j6538K19K2716j8901P73K8322K399K3178R787l9518
21519d584j0522Q802j7747j9165K5371K7678j1947j2198J0103k4849l3874p655
$$ y = [29351, 19973, 24979, 53821, 60160, 18400, -8161, -17691, -52351, -46177, -18067, 9502, -1905, -12245, -11963, -4770, -6042, -7968, 32910, 51531, -2576, 4453, 32139, 16454, 20075, 21158, 12190, -10083, -8495, -16320, -27512, -53540, -41405, 3487, 5912, -25166, -22793, 6408, 40358, 36973, 26678, 11659, 19629, -5636, -27346, -23259, -15121, -30968, -21304, -27312, -44014, -48134, -37001, -34881, -39220, -53344, -30034, -32815, -19601, 7476, 9600, 26814, 21509, -14093, -36983, -27654, -47968, -39689, 2863, 9600, 12731, 11413, 15071, 51603, 67510, 44147, 47059, 74870, 62051, 22151, -17021, -33559, -33340, -10624, -29525, -28752, -430, 1969, 25147, 34934, -4584, -15106, -6304, -24051, -43216, -17845, 9833, -2114, -14312, -4209, -29058, -62932, -70587]
21507g0587L119J2955K2814j6317O055K5130J6178k374k6951K6516R90k5268K1678
21494f062J3781q442J4435J045j0405k6150j8059r819j7217j4588Q271J6692K702
21481e3816M5747J7813J7839K0017L633J6024K954l3841j9004N996m438R61J4204
21468C4089K1533n810p823j6295O969Q456J5080K7916n258l1416l3726k3586O698
21455c173L466P37m4442N933K7747k853m277J3420l2904k0177K7768L0848J6571
21442A8664k4183j0104N56J221K7388k975j0827k3532k9716l1014j0974M0740
21430e4756L4664J3246j5604k8411j3461j0900J0757R414J6235R337J7831K5710
21418A4062j7515j427K6584J7369l7381p943M384J8034K2642j6394k8786j6023
$$ y = [-70587, -67468, -54513, -31699, -48016, -41961, -16831, -653, -3027, -29978, -3462, -2472, -27740, -6062, 7719, -723, 13712, 14757, 4352, -21798, -39857, -49676, -66893, -81481, -73210, -56518, -53816, -8069, 9744, 27583, 47600, 51233, 67257, 70211, 36370, 17366, 23362, 18924, 19885, 34089, 55622, 49812, 41989, 25694, 32663, 41119, 56199, 84115, 78857, 47441, 13715, -9871, -3173, 293, 1030, -43412, -37479, -9732, -12585, -16862, -3442, -36346, -56523, -28755, 2093, 18664, -5519, -15623, -15067, -13846, 13542, 10567, -260, -23792, -53508, -84522, -95496, -54756, -20092, -6846, -22450, -50861, -64322, -75222, -64465, -55051, -38816, -29479, -11648, 14062, -3453, -4880, 21704, 39073, 1692, -6251, -1867, 16167, 38809, 22415, -6371, -22394]
21406b2394l58J0957L378J5953L2251K6121j9117k9026j541j6065j0374Q248j1189
21393a3156j7724k774j3226j0537J6988M4994K0348k0870k602p777P971J1995
21381A3630j0851K304J8968l9396k0317Q604K8327l74l0765J4022L0592l841J1351
21368B2254n4j1148L956m0442l1586n765L0132O859o563K3062K5463p133k0576
21355a1541q349j875j1075K0824K4412k70M062K2877r701k4268K0522J3137j1218
21342B7537M041l2436k2272l2918k586P836Q213J8500k1813k2356Q081L7742K1641
21329g90J9146J34N5261J014k4756k5244j2813M279k2147q876l748j933j350j941
21315b3764J3740K2116P161r268n545P537L2516n463l4801l7478k5472K6846R595
$$ y = [-22394, -22752, -11795, -8417, 7536, 39787, 65908, 46791, 17765, 16224, 159, -10215, -1967, -13156, -30880, -33654, -46880, -57417, -40429, 4565, 24913, 4043, 1441, -6336, 1635, 13630, 2779, 5083, 24051, -15345, -35662, -27058, 1269, 895, -29870, -15848, 14744, 10903, 22254, 22200, 11052, 15008, -25434, -57020, -62785, -32653, -25794, -32357, -9295, 16168, 9035, -11541, -19890, -21765, -32840, -12016, 12396, 12126, 16188, 39065, 29364, 5096, 25618, 38755, 27537, 31578, -858, -23130, -56048, -58634, -50798, -42585, -24085, -45898, -68254, -60173, -22431, -790, 18356, 18490, 73751, 74765, 50009, 24765, 11952, 16231, -5916, -14792, -18540, -20473, -21823, -23764, -10024, 12092, 19253, 9985, 4440, 11977, 44493, 39030, 4229, -33249, -58721, -31875, -22280]
21302b2280j4824J0797o641q167k3729K7018J0494j1121L9638O221j898P333k9441
21289a6600k3510P951M0966M2480j5707J3597J3864k9770j7885m8521k880K5439
21277a0576k2709N734k671k7526J3490L5009r299R181P285M394L263l6156k0855
21264e1436K3937L6866M599k96n643K4313j59k2018k3848j4797L4872J6240o638
21251A5992o834N354o253K5237r409j216J832j7191m7256j5702J8928K1372J8547
21238C401M792m126o427R081J4778k267L8520R108k2539j9330k4307l978j8522
21225b1816K1829J7904m6329o6516p179M8795M3026J7726J5929j362j2329N740
21213A5418J7417Q336m1513l3117j1144j8530n297J2820M4165j0964l1521o97
$$ y = [-22280, -37104, -26307, -32948, -41115, -64844, -37826, -27332, -38453, 1185, 7406, 5508, 12841, -16600, -40110, -32159, 8807, 51287, 35580, 49177, 63041, 33271, 15386, -33135, -36015, -10576, -33285, -27551, -30222, -57748, -44258, -9249, -18548, -9367, -2082, 2312, 5575, -30581, -51436, -27499, 9367, 13966, 13670, 8027, 32340, 32181, 10163, -13685, -28482, 6390, 22630, 15992, 9158, 14512, 8259, 33496, 24087, 22871, 24703, 7512, -39744, -55446, -36518, -15146, 3401, 8193, 4067, -2360, 6721, 21499, 19232, 57752, 66860, 44321, 24991, 684, -3294, -21816, 13, 17917, -28412, -94928, -102107, -53312, -10286, 7440, 23369, 22007, 9678, 15418, 32835, 41171, -342, -33459, -44603, -63133, -68430, -55610, -11445, -22409, -53930, -54627]
21201e4627k748r78q610J7246L5624J2595P146J5137K2874k5411o2246j0057J2320
21188d1735J5543J0981J3201k9477Q815L2130K750l789n217J6869j6664Q517K6152
21175C8076l605L1388J9967j5872j793k2257k3783k8627l0153L4720k6134j9841
21163d7914K7595k553l6668j5541J3643M3775J2805p800j7772R108J8492k6842
21151b9672k6704r810K0906J5687L4654K0129J5167L145m9909k2106J9022o197
21139a5688J7346j3714k6530j4423J6948J3419R519L517P348j4570J4399o733
21127i162J3679n913p405n482l25L658j9299L918P221M50J224l37K7200K3037
21113C2464k2828o725k3785o267j2692q503J7624K1283K0521L4198K2763j7897
$$ y = [-54627, -57375, -58353, -66963, -49717, -14093, -1498, 5648, 20785, 43659, 18248, -43998, -54055, -41735, -26192, -15211, -2010, -31487, -22672, 9458, 12208, 8419, 3202, 20071, 3407, 11924, 38076, 34471, 65859, 85826, 69954, 68161, 45904, 22121, -6506, -36659, -1939, -28073, -47914, -20319, -22872, -59540, -75081, -61438, -17663, -4858, -12658, -30430, -21322, -2830, -29672, -56376, -66186, -45280, -29593, 5061, 25190, 40357, 43502, -6407, -28513, -9491, -15688, 1658, -12056, -38586, -53009, -36061, -22642, -13123, -9606, -2258, -16828, -2429, -9162, 4517, -1396, -8801, -14283, -14608, -10950, -30249, -26331, -19110, -18660, -17436, -17773, 9427, 32464, 9636, 2911, -20874, -27141, -39833, -48336, -30712, -9429, 11092, 45290, 68053, 50156]
21101E0156k4648l1538P234O666o009J06L8654N776j4791q660R441j1225J809
21088B2971k8444l2406M686K4884N445J0057m0867j7154n791P229N65K1431J4174
21075a3220l2661p761N185K2166Q920K7407p421l3093J1844O863k736J5946o680
21062e241p221k800K1096Q141k1986j6115L6062Q399o780K0266Q862l939J825
21049D0569J5764l019m4177j8232K2521j8247p792k9590j1090o281N490M6010
21037h074L0811k0207j4173k3567J6284K6988R552l9347j5706K4924N83k9882
21025d1814n418K7032l718J48K1516K6067k2283l6135J5028R553k2154p40O406
21012b6512K3378j4730r099k5036j1536K5111o180q84J9367M2101J0320j6786
$$ y = [50156, 25508, -6030, 1204, 7870, 1861, 1967, 40621, 46397, 31606, 22946, 32387, 21162, 22971, -5473, -37879, -33193, -8309, -2864, 7193, -33674, -50828, -56619, -49390, -48825, -27394, -13220, -45881, -53642, -48457, -26291, -17371, 10036, 2615, -30478, -18634, -11771, -14507, 1439, -5241, -12462, -15262, 5834, 13975, -8011, -24126, 11936, 20335, 13555, 33821, 42683, 38744, 40569, 56333, 53314, 9137, -9095, 13426, -4821, -12613, -42203, -53293, -59574, -54084, -8074, 22737, 2530, -11643, -35210, -18926, 8062, 17614, -21733, -37439, -12515, -11932, -41814, -47232, -20200, -23918, -23770, -2254, 23813, 1530, -34605, -19577, -10024, -32178, -32918, -26512, -3134, -17864, -26963, -51999, -63535, -38424, -44604, -45488, -26121, 15980, 26300, 9514]
21000I514j8578j7816J9176L945J366O419p066j0260K0411J5473Q762k569n7703
20987b8926j6917K6013R247k349J2894J1609j9536j3388j6161n145J6798J3492
20975a2369k7508n222M92J1837p316Q861R592j0204j943J5832O292M367k996K8645
20961A8360r753j2793K9887K0923k894j2560R139R476k134l0640p374Q08l3343
20948b2898n977j2711j3809j808M7238j9982k5201K1744K717Q017K4418K5571
20936B7319j9118J7312q715m0547L313K7322J6141j6270q700j2507j4267J8246
20924a0471J5525J252q620O458r977K1625J2386j8978j7377J6023P144j6606n525
20911g141J2962K1769j0972j6590j1983j566j4520l6196K284n962L006K2484L2136
$$ y = [9514, -9064, -26880, -7704, -3759, -2393, 4026, -3040, -13300, 7111, 22584, 31346, 28777, -28926, -45843, -19830, -10583, -12932, -38, 11571, -7965, -21353, -37514, -42659, -25861, -12369, -39877, -45099, -44607, -32770, -40086, -31225, -21633, -31837, -33780, -17948, -11656, -7289, -10285, 18360, 8607, -4186, 25701, 46624, 43730, 31170, 40309, 49785, 47651, 17011, 9637, 10445, -22898, -28875, -41586, -55395, -57203, -9965, -29947, -55148, -33404, -30687, -22670, 1748, 27319, 8201, 25513, 16798, -23749, -20436, 6886, 23027, 6757, -1943, -14450, -28717, -10471, 5054, 6306, -2314, 4144, -5833, 15792, 28178, 9200, -8177, 7846, 14990, -1616, -7141, 5821, 27590, 16618, 28, -11955, -13521, -28041, -64237, -61953, -67915, -64909, -42425, -10289]
20898a0289J6853J50L0644K3824M487J408j2932p342k429J6280q64o074l4604
20885A9112J991J0171J5992k3282l468K1910o435p366k8259P860J4253K120k4241
20872C58j2461J851j7740J9637n30j0285N482K8040K2903R307l495j8961k5788
20859a682J339K5806K4880k4565P031L0182n609Q81O483O104k3384k8260K883
20846B2089J3361l0583k4124J2595Q875j921L3165j3144j485J1267M564k2689
20834A1970Q412M792l6922J5802j3536l875K2788j088K402k7059J3908k1020k2984
20821d6410k602p964J3398J9065M0096K6820j3871j9445j598k2251L039p129o353
20808b5205K6785j2359P518K4417J8144R40k5387p914K860j9227O705J2582j7949
$$ y = [-10289, 6564, 6714, 37358, 61182, 65669, 67077, 54145, 46803, 44374, 60654, 59790, 53716, 19112, 21103, 31274, 47266, 23984, 20516, 42426, 35991, 28625, 366, 8226, 22479, 24599, 358, -12103, -10252, -27992, -8355, -8885, -19170, -13688, 14352, 37255, 46562, 43067, 24106, -1682, -343, 25463, 50343, 25778, 32809, 62991, 57382, 58263, 64746, 70850, 47466, 19206, 22089, 35450, 4867, -19257, -6662, 2213, 292, 33457, 20313, 18828, 30095, 34659, 11970, 20382, 25174, -11748, 4054, -9482, -13357, 9431, 8343, 10745, -16314, -2406, -23426, -46410, -49012, -56976, -43578, -24513, 15583, 42403, 28532, 9087, 7489, -14762, -11723, -18852, -25205, 1580, -10779, -3261, 21156, 39300, 40240, 14853, 6939, 9799, -9428, -2723, 9859, -8090]
20795h090k9404p538Q728O315j445q361j9527N367K5500J4307R981J2928K2579
20782C1340M667J1224p581r641l6683l5656L1576K9957J840K1162j0264j4374
20770A7567l6687o224K2083R12K3224l610l1759L28J797m1437J2940K4587L7217
20757B0938J9255l1676j8520j5263j2224J0125j772K6992Q602j1330p417J5702
20745C412M260k4657j0197q360q305O109O291K8043k197J641l2361k25K0668K8060
20731A2182K5549n558k4387p750j3906j9055j592J9411k649l585K7302K2150M882
20718C2994M968n559r565j7965J6512R203k472K980n1398j8405k771J5696j6662
20705d2444m081K9011R830k7167j6848M049K297K4493L1522K0224k0331K0740
$$ y = [-8090, -37494, -45032, -36304, -29989, -31434, -39795, -59322, -53955, -28455, -14148, -4167, 8761, 31340, 36007, 47231, 39650, 30009, -6674, -42330, -10754, 19203, 21043, 42205, 31941, 17567, -19120, -25344, -3261, -2349, 20875, 17265, -14494, -14166, -12369, -53806, -40866, -16279, 20938, 40193, 8517, -10003, -25266, -37490, -27365, -29137, -2145, 6457, -4873, -12290, 3412, 7672, -16985, -27182, -35542, -43847, -37738, -31447, -3404, -5601, -3960, -36321, -36546, -15878, 12182, 37731, 32173, 7786, 36, -13870, -32925, -34517, -15106, -17755, -21340, 5962, 28112, 32994, 37962, 32403, 22838, 4873, 21385, 30588, 28116, 31096, -20302, -38707, -41478, -25782, -42444, -46525, -17514, -7684, -34851, -51699, -47650, -45353, -20860, 10662, 30886, 10555, 31295]
20693C1295L5k0318k0641R851J2773K5573k206l3999k7851K9418N828m54j3337
20680d033l7364k9698K3097L0152J8089M8664L053P027j1625k8629R6J9829r605
20667B9053J4997L512p206q132r968j6902l197J639o836j9783m646K2743J1346
20654F620l2474N384q316L489j1944N479L1628K7281j0116k7641m917K3640J0089
20641A8202j0590j2827j9271J7934J6608j4734l215J885O413k1100m764j289J9725
20628g023J0903K2381J0400k7674l4318J3912m206r754M758P270k43k019J6032
20615D19P952j2643J848J3088J1593J8141J0794k6266n8540l9945L8002K6247
20603i310j0468m9108r303L2272N0985j0332j5205K9477Q226j5461K0319K1439
$$ y = [31295, 31330, 11012, -9629, 222, 12995, 38568, 36362, 2363, -25488, 3930, 9758, 9304, -4033, -41397, -71095, -47998, -17846, 243, 48907, 51960, 58987, 47362, 18733, 18829, 38658, 29053, 44050, 47562, 40356, 32224, 22256, 5354, 2157, 3796, -3040, -22823, -27469, -4726, 6620, -25854, -20470, -28786, -25297, -37241, -31762, -134, 27147, 17031, -10610, -15527, 8113, 18202, 7612, -5215, -24486, -6552, 10056, -4678, -7893, -6008, 405, -20695, -25459, -26748, -7023, 3880, 26261, 36661, 8987, -25331, -11419, -15625, -25379, -20621, -13351, -13594, -15613, 419, 8371, -4272, -2424, 10664, 22257, 40398, 51192, 24926, -33614, -73559, -35557, -9310, -19778, -68886, -78189, -45917, 5068, -5264, -20469, 9008, 17234, 1773, 22092, 43531]
20591D3531k854l8263j5307j8322J9505J9856o704m3895j5778L5079L5107j9510
20579g555L516l523n129L3758M2668J1594m0m521l6959N419j2395k961j9132l3323
20565b8583J2667M6437R228k8558l7686j1464m222L2556J3024K0437J2460Q51
20553C7147m409L249j7256k1018p486j7270R583j5833J2374J3074L1319j175J2866
20540C5165k9011j1754J6609p303j8088M356K0626k8061k1613J359K1955K1488
20528E728J5478O539k4134J4913R36j4989j8580j508P240L316J7724j4392l739
20515e468k91J3066J6955j5042l556j896k7479k9084K5535L7111j4213j9301l27
20502b3990l0498N163n074J2348N531L455k2475N682p671J4977M522J8383J0676
$$ y = [43531, 40677, 2414, -12893, -31215, -11710, 8146, 1442, -42453, -58231, -23152, 11955, -7555, -4039, -7562, -12691, 21067, 63735, 75329, 75289, 70768, 33809, 39228, 26833, 23872, 4740, -28583, -15916, 30521, 39749, 11191, -26495, -37959, -42181, -9625, 3399, 23836, 36296, 37147, 32738, 35987, 18731, -2287, -9773, -27043, -17460, -33293, -20919, -7845, 23474, 22299, 35165, 6154, -5600, 11009, 3706, -14382, -10026, 10600, -17461, -39074, -37715, -15760, 5728, 21206, 27745, 3611, 18524, 19460, 4471, -14109, -15617, -8377, -5061, 12663, -1729, -5468, -5759, 7307, 24262, 9220, 5664, 3768, -23711, -52795, -27260, 9851, -4362, -23663, -23990, -54488, -49325, -54399, -42051, -36520, -33065, -55540, -49858, -57529, -42552, -38030, -19647, -8971]
20489h971l236j3376K9772J6471r771P721r305l0497j1089J3877K8200r193q802
20476h199J9939r238l6586r043J9593K5284L7353j9334k6204M600O891K6860J919
20463C3835k411k16K5178Q100o2395k0556K1829K7879J07j0400o894n997l5364
20450b7305l762j456K039J8811J1339j7487j7092j370J4088J3251j1085J8949
20438a080L0468l0140k9597k64K2530K1030m990k303p161J35J228k4428j7505
20425d2077J8576j504J9897O525P911P46j1737J0625j109l3628k6784j253L4686
20412a9126P644j8947q881N258l549l328R970M960K6996J0571j84N298l875K4804
20398C7611k3482k0884K9601J9296l1057m3274k473J0404m201j2932J4176k6086
$$ y = [-8971, -12207, -25583, 4189, 20660, 10889, 18610, 9305, -21192, -32281, -18404, 9796, 603, -8199, 11740, 2502, -34084, -43127, -23534, 1750, 39103, 19769, -6435, -1835, 5056, 31916, 33835, 31424, 31208, 56386, 64486, 2091, -18465, 3364, 31243, 31350, 20950, 14056, 8059, -27305, -31067, -32523, -30484, -11673, -334, -17821, -34913, -36283, -22195, -8944, -20029, -1080, 29388, -752, -30349, -30613, -8083, 12947, 7957, 5654, -1507, -1372, -144, -24572, -42077, -23501, -25005, -5108, 1417, 9328, 10074, -1663, 8962, 7853, -25775, -52559, -53812, -19126, -11482, -30429, -39310, -34052, -37601, -40929, -30959, -25999, 997, 11568, 11384, 16682, 12807, 37611, 14129, -6755, 22846, 42142, 11085, -32189, -34662, -24258, -28459, -41391, -27215, -53301]
20386e3301O613J7938O583r002L099k3731j178M817J4464J7792q315K3564m771
20373e428J2810Q337o72Q500j9217Q71R672M173L108j8764K561J4549p113J0015
20359B3402K0390K1247m3018k2658m407J0110L647j4233J4063K5856Q30o536k3894
20346D799j3588p492j022J5525r874q827K6384J1627l395J9213j5818N067J9731
20333D2330m60j4454l0393n2825J0832M360j0799Q550M1959J705K1687o305k2599
20320f412k4276k305L7547l099k5988p686R584J6124j4637j0099k0850k0658Q146
20307f4609K2405k898r435J0421K5971j295J081k777M1061k2157L069m215M320
20294I42K929K0862j7421j0685k0523m2255R658j500L5471J7625l207K7671M3929
$$ y = [-53301, -46688, -28750, -22167, -31169, -28070, -51801, -52979, -48162, -33698, -15906, -24221, -657, -5428, 7382, 15719, 15047, 23547, 4330, 5201, 14873, 19046, 22154, 3390, 5951, 20500, 13387, 23402, 43792, 65039, 22021, -637, -5044, 5066, 8713, -5520, 8543, 34399, 35229, 28693, 4799, -8789, -16281, -17303, -1778, -11652, -20479, 5905, 17532, 14137, 33350, 17532, 22599, 42330, 41870, 27416, -2977, -55802, -44970, -40610, -51409, -42859, -900, 805, 22492, 16187, -6412, -30688, -32993, 4554, 1455, -24533, -32219, -22635, -6511, -21148, -31247, -52097, -72755, -64609, -42204, -45102, -54537, -44116, -18145, -19440, -18359, -21136, 19925, -2232, 837, -3378, 942, 3871, 24733, 7312, -3373, -23896, -66151, -56493, -57993, -22522, -4897, -8104, 19567, 63496]
20281F3496N691k6724l5381k8600k554J1573j5758k1753J764P045J6351K1311
20269c539L148L2925N2348J6143k216l0330k3235p767k3587Q027J1757o827j3732
20256A3115R521j1685l2457K0591j376n166q324k3672J893Q289k2172J103K3017
20243b7323K4577K5549l866k5976k2787k959j7275j9348k365q683J6888J8642
20231d4926j442q953J4211J2610J310J3983L6579j717k7098o486J3850K239Q537
20218A2697n139j9357J1752M764q580K0155p699J6981n39q686J646J4477k915
20205B9557k2933l075K368p910M076j5479q24K4519j0389j7547j559k4001j133
20192d4330L1400J6894k643l629R657j1952q615J3191j4258m858j5580j5940j0501
$$ y = [63496, 69187, 42463, 7082, -21518, -24072, -12499, -28257, -50010, -48246, -41201, -24850, -3539, -391, 32534, 84882, 101025, 98809, 68479, 45244, 37477, 13890, 21917, 33674, 26847, 13115, 22636, 10951, -21506, -915, -2291, -7457, -15781, -39453, -37560, -29271, -51443, -50340, -27323, -2746, 22803, 18937, -7039, -29826, -32785, -50060, -69408, -71773, -80456, -63568, -44926, -46368, -55321, -41110, -28500, -27190, -13207, 23372, 21655, -5443, -11929, 1921, 4160, 12697, 7558, -11799, -47, 4717, -3863, 16292, 8593, 25574, 25035, 16349, 17995, 32472, 29557, 6624, 3549, 5917, -1993, 2083, -13396, -14220, 10299, -90, -17637, -19196, -43197, -44330, -12930, 3964, 1321, -2308, 7349, -4603, -13218, -27, -14285, -19143, -34723, -50663, -61164]
20179f1164J1072K7810L7167j0935j8441K109O823J2445M893K505O773J9528l3944
20166F641m8163l881j098R130P193J0360N460m868K3044J7146j0774J589j9638
20153g859l1490j0519j3039J7107M30J0649j0007J583M11J8496K0384j8983O11
20140b2226J1867Q397R654j0668o495J3327J0384N338l0031M033K3797K727n915
20127A4189N883j4377k0929J427K383L8669N457l6890p910K0258r195M882R699
20114A3546k4646p087P942J952o065k5540j7430K1768L9891j405j2168j2277M745
20101a6774R762j7626j0078J8282L7483j0373j6898j1931r795J7173L132o295
20089a3938R697J7560n682Q536J1521J0202l9734l9614K6231N8170L2129j4607
$$ y = [-61164, -50092, -22282, 14885, 3950, -14491, -12382, -5559, 6886, 11779, 14284, 21057, 40585, 6641, -41522, -45403, -46501, -37371, -30178, -19818, -14358, -19226, 3818, 20964, 10190, 11779, -7859, -39349, -49868, -62907, -45800, -45370, -34721, -44728, -43145, -42734, -24238, -3854, -22837, -22226, -10359, -1962, 7692, -2976, -9471, 3856, 14240, 19578, -10453, -6420, 17377, 20104, 14189, 20072, 5695, -15234, -13807, -11424, 27245, 32702, -4188, -12098, 8160, -1035, 3847, 13546, -11100, -18187, -10245, -8293, -14358, -39898, -57328, -35560, 4331, 2926, -9242, -21519, -16774, -7012, -24638, -34716, -16434, 21049, 10676, -6222, -18153, -27948, -10775, -7643, -13938, -4241, 13319, 7637, 16173, 27694, 37896, -1838, -41452, -15221, 42949, 75078, 60471]
20077F0471m9188j8512k7723l565L53K8909o578k0211r942k6968j235J4458J6293
20064d3438J0369k2657K9100J2775J357o927j257j8486l8330o012L2970L3809
20052a6727R928l1365l0887P517j0531J8764K6789j2396L7468J0227j9980l1789
20040d2982m80J6556o932j4720Q990J731J2659M422K3060J8457J8656k0825l2891
20027a4299K8876j4593p451k559J4154J2865r535k6992J6422j0053r984l1728
20015e4877l2886L6061J8584R257o763R115J6696J914K8380o306r762N581R085
20002B4079l2693l0982J3046J7826J8132K2107j1165l1462J8584J3672l595n834
19990A1715j0108j3830K07K4414R339n124k1933j5822J5266r67n776L0853M5552
$$ y = [60471, 11283, -7229, -34952, -38517, -38164, -9255, -15833, -36044, -45986, -72954, -74189, -59731, -43438, -33069, -55726, -26626, -13851, -12494, -19421, -20678, -39164, -77494, -83506, -50536, -16727, -6799, -38164, -69051, -61534, -72065, -53301, -26512, -38908, -1440, 8787, -11193, -42982, -43462, -26906, -33838, -48558, -39568, -37837, -25178, -20756, 2304, 20761, 39417, 18592, -14299, 14577, -16, -7467, -10026, 4128, 16993, 7458, -19534, -3112, -13165, -23149, -54877, -87763, -51702, -33118, -23861, -30624, -21509, -4813, -2899, 25481, 19175, 9413, 14994, 24079, -8614, -39596, -26550, -8724, 9408, 31515, 20350, -11112, 7472, 21144, 17549, 11715, 1607, -12223, -12016, 12398, 21737, 16613, -5320, -21142, -5876, -6843, -12619, 18234, 63786]
19977F3786J1990k3585k1935k9428N734L6193o973q215J129N041J1620J3382j4864
19964D3875q934J2148n796l5831J6660J915r471j3828j7877K537j9282J3506m565
19951b4943K0226J7936p677k5910M5704Q566l1547q83j1347j5730o902K0817J8432
19938F742J0832J5904p019j4500l344n513j6494k807r232N887j1744o674L394
19925c4568J5509K0069k273l1062l2849l957J3049J7810k5224O917O1629J0533
19913A5583m465m95J9039l3019j2895p493j1704k9294p74n411J9606L8967J1493
19900h62O629l2203p304m004k311O670J1752M5981R556M028m411P182k0272j6821
19886C610J7117M699l2940k0472J4755m333R715j824j8687k1357N90K1119p355
$$ y = [63786, 75776, 52191, 30256, 828, 6562, 42755, 35782, 27567, 28696, 33737, 45357, 58739, 43875, 34941, 47089, 41293, 5462, 22122, 24037, 14566, 738, -17139, -14602, -33884, -20378, -24943, -4717, 13219, 5542, -20368, 25336, 33902, 2355, 1472, -9875, -25605, -32507, -11690, 6742, 17574, 33478, 26459, 11959, 8615, 3102, -13392, -16199, -25431, -19544, -31288, -37962, -34568, -19059, 1010, -1263, -32325, -65174, -69131, -56082, -38272, -63496, -56579, 5050, 15583, 11118, 10623, 29662, -3357, -16252, -23745, -35449, -64743, -65517, -70928, -51322, -12355, -862, 5767, -26436, -33740, -37744, -40055, -33385, -21633, 24348, 33904, 37932, 33521, 40703, 20431, 3610, 20727, 25426, -7514, -27986, -13231, -17564, -7849, -9673, -28360, -49717, -49127, -28008, -35363]
19873c5363L208K0117o99J5007m308k5168M265P877P316Q076K2570P971L064j4506
19859A9427k1331j4219k0901J6509J93p264J3615K8044j1240k25R801J4057J0031
19846C6497J9702j0925o2649k670J6175j9501m191Q951K4366J9064k6531k3327
19834b5039L4055J6830o680j815n109j819l8912k9286o878J7190K6990K896j0581
19821b8158j3512l8225l526M1876M328J9971K0057N175J4238K4967l1114k5018
19809h941J2211J1065j5417o842j1359k4104j4891J5040J1738J8557k3624O98
19797c5869L7342M0724j6358l3403k1783R113J4308K5062K1149Q6l3999k6663
19785b0291j0730N833j4002k3259K2268j4745L587J1171k3345J7350J6744O809
$$ y = [-35363, -32155, -12038, -12737, 2270, -2038, -27206, -22941, -15064, -7748, 328, 22898, 30869, 33933, 19427, -1904, -16123, -37024, -20515, -20322, -27586, -13971, 14073, 2833, 2608, 12409, 26466, 36497, 56199, 45274, -17375, -20045, -3870, -23371, -27562, -18611, 5755, 24819, -1712, -25039, 9016, 25846, 19166, 17351, 12242, 10423, -28489, -57775, -64653, -47463, -20473, -17577, -28158, -41670, -79895, -83421, -41545, -37217, -17246, 2811, 7986, 22224, 47191, 16077, -8941, 3270, 14335, -1082, -7924, -19283, -43387, -58278, -43238, -31500, -12943, -36567, -35869, 1473, 42197, 25839, -7564, -29347, -20234, -5926, 19136, 40285, 40371, 6372, -20291, -31021, -25188, -39190, -62449, -40181, -54926, -51339, -40168, -63513, -46163, -29419, -22610]
19773b2610R39N912P222m677K209R235k666J6746R34K381P039J6811K1790j4910
19759D6355j8709j861j647l208j5684j624p760j0859m028J1843L631K5502j4384
19746G567k2772J346J596J1989J5810K0713k0788l1457m569K5474O025q342L2643
19733C5235l506l1666n3185K8542L8263k7574k4527P568J5601l1013k277j079
19721d9618K9678k0433J6860J2263l032L122j6973K640J2516K950Q287p539M606
19708d673J0786j1840j0709j0412k848j0594K9545M8853j4210m596J8329l1026
19696F605j5507L633r790k3414Q379R256o114J4477N244j075J3301K2238j7310
19683I923L05N408j268j1798L113J5354j0740j6514j3289R812J8196Q759l497
$$ y = [-22610, -21671, -15759, -8537, -13214, -11005, -1770, -4436, 12310, 13244, 15625, 22664, 39475, 61265, 46355, 27646, 25785, 24138, 20930, 5246, 3622, -4138, -14997, -19025, -7182, -3551, 21951, 7567, -15205, -13859, -12263, -274, 15536, 36249, 15461, -15996, -20565, 4909, 10934, 2592, 35235, 31729, 63, -53122, -24580, 13683, -13891, -38418, -30850, -15249, -46262, -48539, -49618, -19940, -40373, -23513, -11250, -14282, -11160, -28133, -25493, -12977, -10027, -1740, -9279, -4673, 6113, -5727, -16436, -26848, -29696, -40290, -10745, 38108, 23898, 19302, 37631, 6605, -8902, -5269, -15059, -38473, -30094, -20838, -26952, -12475, -7231, -8306, 4995, 27233, 9923, 10228, 15636, 14368, 2570, 5683, 21037, 10297, -6217, -19506, -9694, 8502, 17261, 13764]
19670A3764k1303k0854j3586r982K243J944J5141J9935j6684j2236k011j862O650
19657c8841m064L2938J8246p246Q675o382l1253n542J6409j3910O272j189Q112
19644a7775O498j0874J1905L1791J9463l4794m3100j6139j0476J4433p878P189
19632d9757n359n172N165m296Q032K9191J7487K200n518L3346J0454k6693p758
19619A322J0003l319j6048P134j43N89M6498K8016k6955j1814j9977k7523K8884
19606A6667j3610j8298o507M841J4093L303j9682K7227K067N700J547k8952N915
19593e689L1486M105m1431k2936M820N012K5576J729K1655j7440k6205m239J0585
19580a2972j4671Q76K8352J5103Q515M108N95k880j0301j3528p602K2196J97k7420
$$ y = [13764, -7539, -28393, -41979, -51961, -49718, -47774, -32633, -12698, -29382, -41618, -43629, -45491, -38841, -42905, -9967, 8279, 1033, 9708, 3326, -27927, -33469, -17060, -30970, -24698, -25887, -17775, -11277, -22151, -10246, 21545, 41008, 6214, -36886, -53025, -63501, -49068, -56946, -49757, -55116, -60288, -55123, -59419, -51387, -22196, -4709, -2509, -8027, 25319, 35773, 9080, 1322, 11325, 8006, -8042, -908, -1051, -462, 46036, 74052, 47097, 35283, 15306, -12217, 16667, 3057, -15241, -21748, -16907, -2814, 489, -19193, 8034, 10101, 15801, 17348, -11604, -5689, 25797, 29902, -11529, -34465, -29645, -24633, 943, 2672, 24327, 6887, -19318, -23557, -12972, -27643, -26767, 1585, 16688, 25203, 29311, 29906, 27026, 16725, 3197, -4405, 17791, 17988, -9432]
19566i432l7638J3915J9639R339J1158k559k6939K205Q517J8966m75j7204Q043
19553b465K1192m206M511K0501J4095M16l663l4587k4393O790r58r757O511p43
19539f756J6134l3402l0858J0208J6870K0414k515m890J6340J5876J3929J27l7552
19526f075k9878j2398J0152J5435K8441J8058%J8400R767k6670j2842j5365j5247
19513a8222j2496k7167Q946K8848P966L082P744q564j7504J0556J0857J5519J3691
19500B3256j3618L72j987n98k4641p429L001L936K5867J0100m0933J9293J0661
19487G280k0381j0408j381j137K1561K0125k1417L176p600M494j2481j0329N657
19474b2841Q942K4786J3722J6789J3563l4623k6799R57J0914qk0516l8419L1083
$$ y = [-9432, -47070, -33155, -13516, -4177, 6981, 4422, -22517, -20312, -11795, 7171, 6696, -10508, -2465, 18727, 14521, 19032, 39533, 53628, 54044, 50381, 15794, -8599, -1809, -2767, -12524, -6013, -6756, 9378, -24024, -54882, -44674, -27804, -7390, -9905, -14795, 1545, 17421, 31350, 31477, -6075, -35953, -48351, -38199, -22764, 5677, 23735, 23735, 42135, 51902, 25232, 12390, -2975, -18222, -30718, -57885, -48939, -20091, -12125, -9043, -1299, -9863, -27367, -16811, -5954, 9565, 23256, 9638, 10010, 8023, 7425, -17216, -24645, -21644, -17708, 8159, 18259, -22674, -3381, 7280, -13101, -23509, -24890, -26027, -4466, 15659, -5758, -2582, -10182, -5688, -18169, -28498, -22841, -13899, 10887, 24609, 41398, 54961, 20338, -6461, -5504, 5410, 5402, -15114, -53533, -22450]
19461b2450M256q978J4563j8388j6865M2308L9539K2919m5779j3664J1934j3093
19449c698j3893L77N2411q595l3241j8276j3483n537J0505K3235O964J525k5312
19436b7018q80O926J7894j2676k0873N721J4498R808o322l924k3746j7553K4827
19423c3318P760k2655J3786J1732j9070k5770R314K7353J2525j6796o430K2130
19411a9439L9766M585K249Q631J186j3721l5634j2984L78J4936K3245j5816j2461
19398a5079k7200J7983J1030m489P633K2470L3997j7429l0739n374J4616k3696
19386a6277k2415L4063K2750k1895k289J151N699k5806R051N571j3092K361L598
19373a7530j237K208l1054J2966J8154P643r664j4507K920j1979J6673Q348k0620
$$ y = [-22450, -18194, -27172, -12609, -30997, -47862, -5554, 33985, 56904, 11125, -2539, 9395, -3698, -17591, -17214, 35197, 26602, -6639, -24915, -38398, -43935, -33430, -10195, -3231, -1706, -27018, -27898, -20972, -3078, -15754, -36627, -30906, -16408, -6600, -12922, -16846, -40592, -58145, -33318, -25558, -48213, -34427, -22695, -41765, -67535, -58221, -30868, -18343, -35139, -41569, -19439, 20327, 24912, 27161, 35792, 36978, 23257, -12377, -25361, -24983, -10047, 13198, -2618, -15079, -42279, -24296, -13266, -17755, -10122, 12348, 46345, 28916, -1823, -7197, 7419, -16277, -38692, -4629, 18121, -3774, -6063, -4912, 787, -25019, -15968, -10397, -23489, -21128, -17530, -18767, -16559, -47613, -34647, -16493, -8850, -18514, -33021, -30101, -42080, -25407, -17059, -37679]
19360c7679j4646R700r557m232o340K5851J3490J4897J3514k9784r329L3950l0203
19347c0368N332K8281r218k5728J9102l609K0027m987l386o25J4051K1606l899
19334B6579m6335k954k15J8437J8744L942j6394j0653K6108P331J704q776j8897
19321a379J4299m231o047l453l8125j6265k1725J8027M4352N6180R174k2477P930
19308C6260k6031l9459R183K1730J0169L0781k8049l4207L328J0573K985m3847
19296d6584k6766k377J7478M6220p022j199K2418L3284K2152j3944k6180k1166
19284c686m0729J1264k645Q247J5119q90m364J0822j7121k7789j7179L7486J2221
19271a9244q968j5689l3205k1405L2889K0749M664Q105O221K1097J7837l9357
$$ y = [-37679, -52325, -42625, -52182, -56414, -62754, -36903, -23413, -8516, 4998, -24786, -34115, -165, -30368, -25036, 3245, -5973, -31701, -12599, -16208, 3819, -1168, -4554, -5179, 8872, 30478, 26579, -19756, -22710, -22925, -4488, 14256, 18198, 1804, -8849, 17259, 24590, 26294, 17518, -1379, 12920, 8689, 2642, -811, -38936, -55201, -76926, -58899, -14547, 41633, 50807, 28330, 36260, 10229, -29230, -20047, 1683, 11852, 42633, 14584, -19623, -16295, -5722, -2737, -46584, -73350, -75727, -58249, -12029, -19051, -20250, 2168, 35452, 57604, 43660, 17480, -3686, -44415, -33151, -35796, -27549, -12430, -13320, -17684, -6862, -23983, -51772, -68951, -31465, -19244, -28212, -43901, -77106, -98511, -65622, -44873, -40209, -32104, -25883, -4786, 13051, -26306]
19259b6306j21q768R998M492K338j1118K5966J8485O99j0505j5648J8751N466
19246A3729k5029n663p735R31M785K0827K1513J6503k7725p841j6493J2375K1109
19233B1286j9103k8273r901p478P462j9986Q720r749L4318K3705K5702p930j3155
19220E618l6945r225k7431O792O735J5990M695q591L1038P506j917R418J5542
19207A9225j9704k3848K8943N8930r931j8683j6901L50J1967k609l263k1232J0532
19194A3776J1609j6497P911q370k8960J2841L1311j1218l6329J3745K2719J1365
19182B3903Q504j2438M877K5826l4392k2950k1738o907q834q189L1472K645o086
19169b4307J0124O387j0871j6609o241o77N748L3400K1624J5941l5281q827J6923
$$ y = [-26306, -26427, -35195, -25197, -20705, -18367, -29485, -3519, 14966, 15665, 5160, -10488, 8263, 13729, -11300, -16963, -24698, -23767, -18982, 1845, 23358, 39861, 12136, 4295, -12198, 177, 21286, 2183, -26090, -35991, -43469, -36007, -55993, -47273, -57022, -22704, 1001, 26703, 18773, 5618, -31327, -40552, -67983, -61191, -54456, -38466, -33771, -42362, -11324, -3818, -5735, 3683, 19225, -479, -24327, 4616, 63546, 53615, 34932, 18031, 18381, 30348, 27739, 24476, 3244, 13776, 25385, 8888, 16799, 8429, -20531, -7690, 23621, 12403, -23926, -10181, 12538, 23903, 32407, 19969, 24846, 50672, 16280, -6670, -28408, -35315, -44149, -52338, -20866, -18221, -24307, -14183, -7796, -18667, -35276, -41517, -42194, -36446, -3046, 18578, 34519, -762, -9589, 7334]
19156G334K6452J3346m96j2554J7792l1615m6819m027n362K6487K4280J9212o447
19143B7583j7670q553k4406j0749o570m495n682O892L3409K9507k383j3174K7792
19130C1501J9118r301m7809N544L284J86j7435N689l075J1110o557P598J0164
19117A0017k6459L149j8207l965O068K9943o31J1271m812L7414m73j1097J1739
19104D3957R891K3552j788j9290r07J0322O113K6184M8349M079K5482O5287P7623
19091C18854O1801K83k9531l4564m9922m4235p9508m6082k4776l3878j8839J3169
19079C2772J9187N8154Q281l8068j5696j5033J1122j2839k7222k0143k5025j8340
19067d2850J8389J6326L9161J3394K6904K9116j063m5710j9324o186j1756K1614
$$ y = [7334, 33786, 47132, 46636, 34082, 51874, 20259, -26560, -30587, -35949, -9462, 14818, 34030, 27583, 9913, 1360, -23046, -33795, -40365, -44860, -50542, -43650, -10241, 19266, 16883, 3709, 31501, 50619, 41318, -6491, -947, 2337, 2523, -14912, -9223, -12298, -1188, -7745, -147, 10017, -16442, -13293, -31500, -35465, -29397, 546, -85, 11186, 6374, 43788, 43315, 32218, 43957, 53848, 77400, 75612, 56322, 55415, 65737, 71850, 98034, 146383, 150462, 175944, 241231, 318854, 380655, 380938, 351407, 316843, 266921, 222686, 143178, 97096, 72320, 38442, 19603, 32772, 51959, 110113, 118394, 80326, 64630, 49597, 60719, 47880, 20658, 515, -24510, -42850, -24461, -8135, 31026, 44420, 71324, 100440, 99377, 53667, 34343, 28157, 16401, 38015]
19055C8015K4634J4206k0450l507J0583K3679L8832L4504R581j0495N270l686
19043A61166M743K2166j039Q240M7183R6677Q3699M5748r041m4098j01721p0918
19031B42805n4925n5340l6847o479l1099j8427o55N616K3394K2209K1148N517
19019A16917O879n7706j1369Q696k2790K199Q771j6216k116k919j9507j4325o53
19006d139K2179j1185j9596o699M490k248J4994K2655J2657J1838Q769P898J6584
18993G8197n5135o3092l2732J1197L0563O8609J2019j0955j2164j6264j3750j506
18981e013J7611k5676j3044J701k0224j7178M2198N1493l3859k1706k2637n100
18969e1434K9470J1072R170p438j7003J4130K3604l380j4248K8377L3376O394
$$ y = [38015, 62649, 76855, 56405, 52898, 63481, 87160, 125992, 160496, 170077, 159582, 164852, 161166, 165909, 188075, 187036, 195276, 242459, 339136, 422835, 468583, 459542, 415444, 313723, 242805, 187880, 132540, 95693, 89214, 58115, 39688, 39033, 44649, 68043, 90252, 111400, 116917, 123796, 66090, 54721, 63417, 40627, 42826, 51597, 35381, 33265, 30346, 10839, -3486, -4139, 18040, 6855, -12741, -19440, -14950, -17198, -2204, 20451, 33108, 44946, 53715, 61613, 78197, 23062, -40030, -72762, -61565, -31002, 37607, 49626, 38671, 26507, 10243, -3507, -5013, 12598, -13078, -26122, -24421, -44645, -61823, -19625, 31868, -1991, -23697, -46334, -51434, -21964, -10892, -1722, -9160, -26163, -12033, 11571, 8191, -6057, 22320, 55696, 62090]
18957F2090j9299j0927O802K1325K6299j8484k3068m653n5256l2232j7936K1953
18945d3386N5882Q61L181j2674j3978L919n296p898N565r875l261j161L3739L9052
18931D4670P19l3113k7971k0529O440L0097Q695L88K7079m833J2968k7180k7548
18918a0118n453L4577O696l1061j2033K054p301j4851P407J6624R60K019k0518
18905c0998P163m963j0775q142L5254K6669j1912m8354k2241K3054K3897J2695
18893h653N641k1461M914M5534J0358p052k1129j1955N542J7336k3393j5746j1453
18880c1517P755K6733L2882o94j1548k3025o881J347K5545J8042j4444j6823k7724
18867b0352p731M7121O497q53l9014M209L4534Q879k8141N95J4953k6090j7325
$$ y = [62090, 42791, 31864, 38666, 59991, 86290, 67806, 44738, 40085, -15171, -47403, -65339, -43386, 12496, 13357, 16538, 3864, -10114, -6195, -11491, -19389, -13824, -23699, -26960, -28121, 5618, 44670, 45389, 12276, -15695, -36224, -29784, 313, 9008, 9396, 36475, 31642, 44610, 17430, -10118, -15571, 19006, 25702, -5359, -17392, -15338, -22639, -37490, -30083, -13459, -12499, -10480, -30998, -23835, -28798, -39573, -47715, -12461, 14208, 2296, -46058, -68299, -45245, -21348, -8653, -3012, -24473, -19559, 25975, 36333, 29281, 8152, -3803, 1739, 19075, -4318, -20064, -31517, -23762, 2971, 35853, 35159, 23611, 586, -6295, -4948, 20597, 38639, 24195, 7372, -20352, -28083, 19038, 25535, 24682, -14332, -10123, 24411, 33290, 5149, 5744, 20697, -5393, -22718]
18854b2718L7406k170m9876j0604R881K1534K2517j401j4617J461M9308m052q733
18841B7936l1721l263P066L612L1867J1330K9494K4807l45k8288k4753j2017q932
18828B6793j4469n896j5938R328k9634k635J4021J5819J550j6292j9320O165p768
18815c8276K9326j597J1085q521N045J3131J6423J1786r587j148J450k2272j4090
18802g245R615L5114Q724l2032k5016K584O879k320k5529j089K814k2033l2018
18789h1552j1865L9693L5922L0040J2890J0281Q357K4415J3427K8810N1005J5786
18777A77209J0188K1818j919n0121j7117J4788J5285M1998K0852L2607Q7650J01886
18765D55124K2144n1333m2736l8709Q091P932k150O872J0731r93k9662l4551k5951
$$ y = [-22718, 14688, 12518, -37358, -47962, -38081, -16547, 5970, 4569, -10048, -8587, 40721, 36669, 27936, -3785, -7048, 18, 3630, 35497, 46827, 76321, 101128, 100783, 72495, 47742, 35725, 26793, 12324, 6428, -9510, -182, -29816, -32451, -18430, -2611, -1061, -17353, -36673, -30508, -38276, -8950, -10547, 538, -7983, -2938, 10193, 26616, 38402, 28815, 27667, 29117, 6845, -7245, 2370, 37484, 46208, 14176, -10840, -8256, -1377, -3697, -29226, -30315, -27501, -49534, -81552, -93417, -53724, -17802, 12238, 25128, 35409, 43766, 68181, 81608, 110418, 161423, 177209, 187397, 209215, 207296, 157175, 140058, 154846, 170131, 212129, 232981, 265588, 353238, 455124, 477268, 425935, 383199, 344490, 352581, 360513, 358363, 365235, 375966, 374973, 345311, 310760, 284809]
18752B84809q211K5864L6658j3126j8643m1687l8343p635m3128Q526L0582j3203
18740B02463j2076j9308R394r411l3537k5329l1888r348Q737Q87J1784j9372J4336
18727H7332M0114K4487l684J1836N5249L5018N4214L8982J909j3586j8442J9812
18715C33241J3364l582O364k3748M02j2405k3794J750L2108k9486P262J5251j1739
18702C04988q633J0486j4784M952L8522J9565j5955l3648k8017j3918n038r114
18690B49406k7421j109m545j8509k8092n0154p601j9849m288R884k4791l02j3294
18677E9335j0570j5245m2850r790J4662L8311J9606R519j063k1977j6522k4343
18665i27j0616J3856O325L135L992j6986l4165J7431J2626J3153k0374j4872R488
$$ y = [284809, 276598, 302462, 339120, 325994, 307351, 265664, 227321, 219686, 176558, 185084, 215666, 202463, 190387, 171079, 180473, 171062, 137525, 112196, 80308, 70960, 79697, 80584, 92368, 72996, 87332, 127446, 151933, 148249, 160085, 215334, 250352, 304566, 343548, 345457, 331871, 313429, 333241, 346605, 343023, 349387, 325639, 326041, 313636, 289842, 291592, 323700, 294214, 301476, 316727, 304988, 296355, 306841, 292057, 297009, 335531, 355096, 339141, 305493, 277476, 263558, 258520, 249406, 221985, 220876, 216331, 197822, 169730, 119576, 111975, 92126, 87838, 97722, 72931, 72629, 59335, 48765, 33520, -9330, -19120, -4458, 33853, 53459, 62978, 61915, 39938, 23416, -927, -11543, 2313, 8638, 11773, 15765, -1221, -35386, -17955, -5329, 7824, -12550, -27422, -17934]
18652a7934O92M138J247M3287J0129k5152j7785J9428l706j5814L5657K1021n493
18639D9715o967k4582m144L1290M321N022l581L768J3510J1579l7788n1008J6349
18626G484K7391l0880j0210R27L434M62J0077j6151N190K282J0073j6474J061
18613e334j314K860j327Q070q004m520K518J0693J8359k8832l923K7483N74m466
18599A2837M716k3326M2996J0397k3555j431M463j7450J8286j563p691k5070o372
18586a2763P23j784K004J2000L0677J4123l8229l6924k649L3491K1168J7096J0243
18573D9176n980P0l1020q034j4188K4714J4282m194r662k0552J820k5320j5331
18560d4219J7228J2251j7366j476l850K714j855m916K0595K4112m645P572K520
$$ y = [-17934, -17242, -13104, -11857, 31430, 41559, 16407, -1378, 18050, 14344, -1470, 34187, 55208, 49715, 42748, 18166, 14022, 45312, 49633, 54655, 51074, 54842, 68352, 79931, 42143, -8865, 7484, 34875, 3995, -6215, -5288, -1854, -1392, 8685, -7466, -2276, 6, 10079, -6395, -5334, -6648, -3788, -5115, 2955, -5049, -9569, -7051, 3642, 22001, -6831, -10754, 16729, 17303, 12837, 17553, -5773, 37223, 47620, 24065, 22634, 27097, 9647, 27933, 26370, 18679, -6391, -12763, -12040, -13824, -11820, 180, 30857, 44980, 6751, -30173, -32822, 669, 21837, 38933, 49176, 43196, 43266, 12246, 4212, -9976, 14738, 29020, 24826, 15164, -5388, -3568, -28888, -44219, -26991, -14740, -32106, -33582, -37432, -34718, -36573, -41489, -20894, 3218, -1427, 6145, 8665]
18547H665m109J0041J5536J2893k4574n943Q566j500K1433M4253J4787l3374j0048
18534E6626J8263K334M744L189j0070k5425J9831J6647L141j2452k9172k5127
18522B2529p081J0149J798o420Q951J0002L0294J801L934l4381L565N303m839
18509D5605k010r343J4105l544m603Q830k4655j5223J2441n022j4996o173J0146
18496E558K606J6087L8719O2348J2667j1921P127K8847j682k9900j574l7767O986
18483I8101P5092P3144O4825Q3214P5903J31435J34047L4597l1433m2332r7803
18472E98790j11722j34663r2486n3705m1828k085j511J2190K9308q12J3602r787
18460B05291k3158m259k7986n4273l1595k068J0494j3470j5394j9914M922P585
$$ y = [8665, 4556, 14597, 30133, 43026, 18452, 12509, 21075, 19575, 41008, 85261, 100048, 66674, 56626, 74889, 77223, 81967, 85156, 75086, 49661, 69492, 86139, 89280, 76828, 47656, 22529, 15448, 25597, 27395, 20975, 29926, 39928, 70222, 72023, 75957, 41576, 45141, 50444, 45605, 43595, 34252, 48357, 44813, 40210, 49040, 24385, 9162, 21603, 16581, 1585, -4588, 5558, 8164, 24251, 62970, 125318, 137985, 126064, 133191, 162038, 160356, 130456, 128882, 91115, 98101, 173193, 246337, 311162, 394376, 470279, 601714, 735761, 770358, 738925, 696593, 598790, 487068, 352405, 259919, 206214, 164386, 162301, 160790, 172980, 202288, 201476, 215078, 205291, 182133, 177874, 149888, 95615, 64020, 61952, 72446, 58976, 43582, 23668, 28590, 36175]
18448C6175j2518K0840K2086l050l34J6328M5606K3696k198m459j1623j6458O056
18435A20147M5178J5845k338J6899J4908k458j2378j3848N786L7642J9638L5119
18423B80140O2970Q8638O6612O51q6269q4076o5840m9220l6429n6158j2895j1091
18411I7033l7723M624K347Q306p449J4117K2972j359q608q696J312J4441j6842
18398H4475k4566J7600K8505M0687K704k6144j5689L212j5001R263K3925L8483
18386A67454l6325k138M944m941o654J4429L9775L8644L4864J1983k091R920J6211
18373B86075L6215N5430Q8765J36384K19364L42593N27089O56398M19817r0836
18363B677294n32256n81905l88200k50619j88204j13478l5735K082J1268K5894
$$ y = [36175, 23657, 44497, 66583, 63533, 63199, 79527, 125133, 148829, 146631, 142172, 130549, 114091, 120147, 165325, 181170, 178832, 195731, 210639, 208181, 195803, 181955, 187741, 225383, 245021, 280140, 343110, 431748, 498360, 499011, 412742, 328666, 262826, 213606, 177177, 121019, 108124, 97033, 59310, 63934, 66281, 74587, 67138, 81255, 104227, 102868, 94260, 85564, 86876, 101317, 84475, 59909, 77509, 106014, 146701, 149405, 123261, 107572, 110784, 95783, 105046, 128971, 167454, 131129, 128991, 133935, 128994, 122340, 136769, 176544, 215188, 250052, 262035, 259944, 269864, 286075, 322290, 377720, 466485, 602869, 822233, 1164826, 1691915, 2348313, 2768130, 2677294, 2145038, 1563133, 1174933, 924314, 736110, 622632, 586897, 588979, 600247, 626141]
18353F26141K0780K5360j9590J5088r459o0905m2745n7300l838M1255K6896k0437
18341E41246J1777J3417k7483o4834q7054n9022n7644j4412R14J1148K5009n827
18329B87235l4334k9439J9889M0373K3342j734J0237l6980j5925K5505J1207J4864
18317C14240M5921M0478J3494j1000p13M944k4133R664M4886M4996M4203J7880
18305E44860J6637L2998L0679q824J7411M1007P4478R3493R5020R0331J21781
18294A149871J76884K18326K94922M79971O89306R67212J361379J612133J380161
18285H330165N13939l66691p52483p46371n82084l52487k07306j09523k05390
18276E521769m90561o10433n71572m14440l08364j16759P3790K16368L46275L90856
$$ y = [626141, 646921, 672281, 652691, 667779, 658320, 597415, 554670, 497370, 493532, 534787, 561683, 541246, 553023, 566440, 538957, 474123, 387069, 328047, 270403, 255991, 256905, 268053, 293062, 287235, 252901, 223462, 243351, 283724, 307066, 305332, 315569, 278589, 262664, 288169, 299376, 314240, 360161, 400639, 414133, 403133, 402420, 407364, 383231, 392895, 437781, 482777, 526980, 544860, 561497, 594495, 625174, 616350, 633761, 674768, 749246, 842739, 937759, 1028090, 1149871, 1326755, 1545081, 1840003, 2319974, 3009280, 3976492, 5337871, 6950004, 8330165, 8844104, 8477413, 7724930, 6978559, 6396475, 6043988, 5836682, 5727159, 5521769, 5031208, 4420775, 3849203, 3434763, 3126399, 3009640, 3083430, 3299798, 3646073, 4036929]
18266D036929L28009K34144K51109K28073J9975k15640k75778j91391j51477j03803
18256D160150K0147J37119K68503M39507O34264P48480P33427M69554R9900j40575
18246G570476j32500R3708M26852P66836J121838J492048J901296K430886L078280
18237A8749720L811622M575728O056270R092846J4135154K0605120K7120001L3538586
18229A37685047L8766222L8923843L4560919K9064855K2572946J4015114K48103
18222C15837049k3239739m9635679o0073218n1236828l6174706k4364924j6310601
18215E4801354j0985275p741113n987109m913851l917375k950158k208188j656240
18207A4442045j275611j009952p02621m83232m01037m71753p62970j085367j121176
$$ y = [4036929, 4364938, 4599082, 4850191, 5078264, 5098239, 4882599, 4606821, 4415430, 4263953, 4160150, 4180297, 4317416, 4585919, 5025426, 5659690, 6408170, 7141597, 7611151, 7711051, 7570476, 7437976, 7531684, 7958536, 8725372, 9847210, 11339258, 13240554, 15671440, 18749720, 22561342, 27137070, 33193340, 42286186, 56421340, 77026460, 104146461, 137685047, 176451269, 215375112, 249936031, 279000886, 301573832, 315588946, 315837049, 292597310, 242961631, 182888413, 131651585, 95476879, 71111955, 54801354, 43816079, 36074966, 30087857, 25174006, 21256631, 18306473, 16098285, 14442045, 13166434, 12156482, 11453861, 10970629, 10569592, 10097839, 9334869, 8249502, 7128326]
18198G128326r31548p03167n11527l14938j17637J6669P1819J74834L36122M91965
18188E640918M87806J54444l27630o66777p59921o43419n03905l07874j69882
18179B903760n2350O1739K10081M23583P12022J078871R76286J81120n08175m54605
18169E532332J22147Q08939J100813P73408J57359o74637j324796j428607j120316
18160C946642q41740n44426m11513k63864j83214j43195p3912q7266r6859o8576
18150A232077l2664n0477m3025m3663n0280o5420o1334n1736m3462l0462n8068
18139G01486j1777L408Q803K3083K2887q697K080J4988K089j9971Q584J3781Q1273
18126H42017M1747M1556M4414M3538Q2840J63505J78760J96871K78235L73347
$$ y = [7128326, 6196778, 5493611, 4982084, 4667146, 4549509, 4566178, 4637997, 4812831, 5148953, 5640918, 6128724, 6283168, 5955538, 5288761, 4528840, 3885421, 3381516, 3073642, 2903760, 2851410, 2913149, 3123230, 3546813, 4258835, 5337706, 6313992, 6495112, 5986937, 5532332, 5654479, 6463418, 7564231, 8337639, 8494998, 7820361, 6495565, 5066958, 3946642, 3104902, 2560476, 2148963, 1885099, 1701885, 1558690, 1484778, 1397512, 1300653, 1232077, 1199413, 1148936, 1105911, 1062248, 1011968, 946548, 885214, 833478, 790016, 759554, 701486, 689709, 693117, 701920, 725003, 747890, 739193, 741273, 756261, 758350, 738379, 746963, 760744, 842017, 883764, 925320, 969734, 1013272, 1096112, 1259617, 1438377, 1635248, 1913483, 2286830]
18116B286830N25858P34437J123181J780121L061790N573922J0221237J7048582
18108D2355958J7522759O75775j4746925j5653342r924126o602584m236778k513552
18100F877185j535804j033936p51699n95404m56824l23656k62896k12136j81719
18091A523111j72696j28888o9851q6920r5459q3686o7561r7002r8266n3512l5794
18080E33476j4846k3715k6343j515K503l1259m9442l5711k53j0186J0726k0292
18068C33143j475q564q632R578j2532j8682r074r875j207J8198M218L006O663
18055C04765r190L5860L2840L3392l0043m5786j5631r27m63K0760K3737j2422
18043C36892j2461k1302k8925l4698k0781l0038N813J421q07k3751l9096j4309
$$ y = [2286830, 2812688, 3547125, 4670306, 6450427, 9512217, 15086139, 25307376, 42355958, 59878717, 60554492, 45807567, 30154225, 20230099, 13627515, 9390737, 6877185, 5341381, 4307445, 3555746, 2960342, 2503518, 2179862, 1916966, 1704830, 1523111, 1350415, 1221527, 1151676, 1064756, 969297, 885611, 818050, 721048, 622782, 569270, 533476, 518630, 494915, 468572, 467057, 469560, 438301, 388859, 353148, 352895, 342709, 353435, 333143, 331668, 323104, 314472, 324050, 311518, 292836, 283762, 273887, 272680, 290878, 295096, 298102, 304765, 295575, 331435, 364275, 397667, 367624, 321838, 306207, 305280, 304817, 325577, 349314, 336892, 324431, 303129, 274204, 239506, 218725, 188687, 194500, 195921, 195114, 171363, 132267, 117958]
18031A17958L1962j0993k1664K1911M3703K3318j4536k9734Q977J5460j7248n3959
18019A15155J1878j4726l3717n647j834M544K3665j592K0105K6040j6606q962
18007A18303k4160n6065j6858M3609M7424J8361l408K8062L4692j9181p15J1072
17995A81136J0397R879j4435n245J9833K4414J992K6465K3058M5676K1836n114
17983C39892k1250k628m525p911j7793k1334l6319j2413j0136m6705l1251j7452
17971A10175L6160J9947m182P496j418j4943m1073k8596J7517J5242j0446J449
17959A07328j8237k0241J2584J5464K159m428K3158O845N511J2091J1632k3181
17947A30685q233l941K678J3890J2309J6497J0503j9518N915L77k926J1464K8693
$$ y = [117958, 149920, 138927, 117263, 139174, 182877, 206195, 191659, 161925, 170902, 186362, 169114, 115155, 127033, 112307, 78590, 72943, 71109, 75653, 99318, 97726, 117831, 143871, 127265, 118303, 94143, 38078, 21220, 64829, 112253, 130614, 127206, 155268, 189960, 170779, 170064, 181136, 191533, 201412, 186977, 181732, 201565, 225979, 227971, 254436, 277494, 323170, 345006, 339892, 318642, 316014, 311489, 303578, 285785, 264451, 228132, 215719, 205583, 158878, 127627, 110175, 146335, 166282, 162100, 169596, 168178, 153235, 112162, 83566, 101083, 116325, 105879, 107328, 89091, 68850, 81434, 96898, 99057, 94629, 117787, 124632, 130143, 142234, 153866, 130685, 122452, 118511, 121189, 135079, 147388, 163885, 174388, 154870, 160785, 161162, 158236, 169700, 198393]
17934A98393J1661k1723k7655j1973J7863K8279k1403l3695k3666J432n75o56
17922A16282m2937P15J5264P287k9419k4119k1441J3262K8221l598j3620J4063
17910E9960j6346J1355j3427k1085j4771J0963K1813O056J6854K16N831k0862
17898D6557J952N200Q531m592k6594L528r53N262O671J5057M777l5380N904L9896
17884G5816k645r885P572n57l4617o222j1635K4773K7065Q501k5537l1113p074
17871A4442j3251J3100K2154j319j3200k5941j2892L3415L4060j880j5473k9069
17859D146l7948q507O382L0351J657k6013J2892K8973K1812j4010k5189J3262
17847G808J3942j0475L682M413K3965L8540l514p112J6859k0143j2074l549k6700
$$ y = [198393, 210054, 188331, 160676, 148703, 166566, 194845, 173442, 139747, 116081, 117513, 116938, 116282, 73345, 74060, 89324, 96611, 67192, 43073, 21632, 34894, 63115, 59517, 45897, 59960, 43614, 54969, 41542, 20457, 5686, 16649, 38462, 44518, 61372, 61588, 67419, 46557, 48509, 53709, 62240, 57648, 31054, 34582, 33629, 38891, 45562, 60619, 65396, 30016, 35920, 75816, 73171, 63286, 70858, 70301, 35684, 29462, 17827, 42600, 69665, 78166, 52629, 21516, 14442, 1191, 14291, 36445, 35126, 21926, -4015, -16907, 16508, 50568, 48688, 33215, 4146, -33802, -42309, -35927, -5576, -3919, -29932, -17040, 11933, 33745, 19735, -5454, 7808, 21750, 11275, 14957, 19370, 43335, 81875, 78361, 71249, 88108, 67965, 55891, 52342, 25642]
17834B5642K6044L0790J7279J5143K567l8289o0888p918R929j8192k1445J3015
17822f323J1895P92R818K9308l2755k6176J2169K7255J5612k1671l4025J0671
17810c430n424j0087K5280N1099j2160k960j251J0266Q099o582q278l5710J7681
17797B6543K0728Q958l521j7337P587j685j0978L885N026Q089m158k1316k2971
17784a150o17N446l055k3478O874M1273J3961j5471j4188j9934R125J8130Q426
17771B5342N831L0353J9840k3139M4133M4251J8501L177J9965N442J0286K3467
17759B27449K6959j7015j972J8506j2864k1814M7790K0345k4399o308l9254m7454
17747A69969k1580j5115q602j1259k1574M65J9984M686P5J3350K4P586K8767M3798
$$ y = [25642, 51686, 82476, 99755, 114898, 117465, 79176, 18288, 10370, 20299, 2107, -19338, -6323, 5572, 6364, 16182, 45490, 12735, -13441, -1272, 25983, 41595, 19924, -14101, -3430, -8854, -18941, 6339, 57438, 45278, 42318, 41067, 51333, 59432, 52850, 44572, 8862, 26543, 47271, 56229, 52708, 35371, 42958, 41273, 30295, 34180, 39206, 47295, 43137, 21821, -1150, -1767, 3679, 624, -22854, -15980, 25293, 39254, 23783, 9595, -10339, -1214, 16916, 25342, 31173, 61526, 81366, 58227, 102360, 146611, 165112, 168289, 188254, 193696, 203982, 227449, 254408, 237393, 235421, 253927, 241063, 219249, 267039, 287384, 262985, 256677, 217423, 169969, 148389, 133274, 124672, 113413, 91839, 92304, 112288, 116974, 117049, 130399, 130423, 138009, 166776, 210574]
17733B10574J9720p614K6391N4281L2575j807l1309l0846j1210o564k3204J4332
17721B45319O166m433J4412R908K8405P0856L0855j1286n7849k6896m6145l9207
17709B20105j266K869P064J3127P661J226m671M411J0396p446J599j5474k8542
17696B11059K2574j8549l2663r346P007j4849m5784k2936j0530k751K0566l071
17684A00727K1579J0765K9253j8399K0640J7128k811j2290j0458p919K9227M4940
17672B22382K6343k3603m6069l8131p38j2110k8582K7164J4273L1136L0039K9603
17660B31707n787j3692n2551k8657l4351j0421j084k7061j1847l6461l7504M800
17648b2909K6736Q208L2285o295j6930j7582n523N313J7756L549k0733R40J3334
$$ y = [210574, 230294, 222680, 249071, 303352, 335927, 334120, 302811, 271965, 260755, 254191, 230987, 245319, 251485, 247052, 261464, 271372, 299777, 370633, 401488, 390202, 332353, 305457, 259312, 220105, 218839, 221708, 228772, 241899, 249560, 250786, 246115, 250526, 260922, 253476, 255075, 239601, 211059, 233633, 215084, 182421, 173075, 180082, 165233, 119449, 96513, 85983, 83232, 103798, 100727, 122306, 133071, 162324, 143925, 164565, 181693, 178882, 166592, 156134, 148215, 177442, 222382, 248725, 225122, 179053, 140922, 140184, 128074, 99492, 126656, 140929, 172065, 202104, 231707, 225920, 212228, 159677, 131020, 96669, 86248, 85164, 58103, 46256, 9795, -27709, -22909, 3827, 12035, 44320, 38025, 21095, 3513, -2010, 3303, 21059, 24608, 3875, 4815, 18149]
17635A8149m442j9259J034K5325K7373K0866o669j7314k4411M362M43J3363k0193
17622A8627j5050j0070K9670P556j4108q541j9104P624K0971K5410J2888P671
17610F3544k5113j5846O411p34j1304J0771J36k3425r706r699J0879K3942K4124
17597D3980k4786j531k0359J2380m562K7210M864m0132k6205k5988O663L825P797
17584c6844N054R071m295L1541J9618l1594l0349L675O844K1393Q387p55Q880
17571A0626j60q155j6163M147L164K942o422k6741P262L2249j1037J4539J9758
17558B6009j894r186j4991Q644M695J4491R95l8471l1504J1692K5021K119J0307
17545G927m202M461j1908l9968L9214J4319j4529J0323j3841l2950J2883L7171
$$ y = [18149, 13707, -5552, -4518, 20807, 48180, 69046, 62377, 45063, 20652, 25014, 25457, 38820, 18627, 3577, -6493, 23177, 30733, 16625, 8084, -11020, -3396, 17575, 42985, 55873, 63544, 38431, 22585, 28996, 28262, 16958, 27729, 27865, 4440, -5266, -14965, -4086, 19856, 43980, 19194, 17663, -2696, 9684, 5122, 32332, 37196, -2936, -29141, -55129, -48466, -44641, -36844, -31790, -22719, -27014, 4527, 24145, -7449, -37798, -34123, -27279, -5886, 2501, 1746, 10626, 10466, 2311, -13852, -9705, -6541, -3599, -10021, -36762, -29500, 2749, -8288, 6251, 26009, 24115, 14929, -62, 8582, 13277, 27768, 28763, -9708, -41212, -29520, -4499, -2380, 7927, 3725, 8186, -3722, -43690, -4476, 9843, -4686, 5637, -8204, -41154, -28271, 8900]
17533H900K1192k1842n823L119j2251K232Q097j6217j7270j0981R259o963n293
17520d3841J017O570J8204J2003r091J4222R011O782K719J2552J5898k0240j618
17507B4188K0427k5625k0173J2570K0523J1127m362j692L281k6005k2040r36k7853
17494c6570O89J1280L0594q212k3300J2271j7388K623J2402p542p338k9695O423
17481e3763J2654J5750j0079j02j6547J9789J2868q832k886R637L3760K253o213
17468H289O711k6912k4824l495K4245J892M813J3592J107j0019M905K1711J1081
17455C3096k5735j4946j1527j5061K4666K2744m301J0488K1192L0235L4110L9446
17443A44407Q5783Q9673K9112n6405n8211m2485l2879l7375m0156k1399j5831
$$ y = [8900, 30092, 8250, 2427, 5546, -6705, -4473, 3624, -12593, -29863, -40844, -31585, -38548, -43841, -42824, -36254, -18050, -6047, -15138, -916, 8095, 14877, 17596, 30148, 46046, 25806, 24188, 44615, 18990, -1183, 11387, 31910, 43037, 38675, 36983, 40264, 14259, -7781, -8717, -36570, -35881, -24601, 5993, -2219, -25519, -13248, -30636, -28013, -15611, -23153, -30491, -60186, -53763, -41109, -25359, -35438, -35540, -52087, -32298, -19430, -28262, -31148, -21511, 12249, 14502, 8289, 15000, -11912, -36736, -40231, -15986, -14094, -9281, 4311, 5418, -4601, 304, 22015, 33096, 7361, -7585, -19112, -34173, -9507, 13237, 8936, 19424, 40616, 70851, 104961, 144407, 230190, 319863, 348975, 292570, 234359, 191874, 158995, 121620, 81464, 60065, 44234]
17432D4234k1232O862M6710j9432m0715r134k5839j0740k337m269K4326J2981
17420A415m841K074K6590P916j7879M524p641q098j7184r268j4659k2964J5193
17407d4822K5442J7315J4105K5969m4346k1303j0982K6004L8680j6604l5566j1474
17395c7582J4766K5178R893j5630j4363r698R311K5813J960J9667m247o051O549
17382B5566K0470p227k5898k4977k2365P844L9462K5614l550j9567j5272m751
17370d651j5273J641O961Q726J0519L9291j9892l5212l1791O859J914J6854J0764
17357c290R505K324K2057M856l1346J676K2267J4198J0746J243j0536n134K6692
17344F5258l642o7174m8943J4394M4429K6240Q785P701P772j9351k6238k5534
$$ y = [44234, 23002, 29864, 76574, 57142, 16427, 7293, -18546, -29286, -31623, -35892, -11566, 1415, -3426, -1352, 25238, 33154, 15275, 19799, 12158, 4060, -13124, -22392, -37051, -60015, -44822, -19380, -2065, 12040, 38009, -6337, -27640, -38622, -12618, 26062, 9458, -26108, -37582, -22816, 2362, 12255, -3375, -17738, -27436, -18125, 7688, 9648, 29315, 25068, 19017, 25566, 46036, 38809, 12911, -12066, -34431, -26587, 12875, 38489, 34939, 15372, 100, -4651, -19924, -18283, -11322, -2596, 7923, 47214, 27322, -7890, -39681, -32822, -30908, -14054, -3290, 6215, 8539, 30596, 35452, 4106, 5782, 28049, 42247, 52993, 54236, 43700, 38566, 65258, 61616, -5558, -54501, -40107, 4322, 30562, 39347, 47048, 54820, 35469, 9231, -16303]
17332a6303o624L3345K7762l928k3221J5247K8345k1804n497K70q543q576k5572
17319a5099J0801m951j4000j6837K1589j1690J318N705l037K2931N205M215P370
17306A3520J6016j688M374l6062j4620J5439J5779J6410j0633j3305o925k2648
17294b4343J5720Q630J1254n237K0826j1858j5680j7355K0673k593n505J54K1434
17281A6120k3614m518j2892J5292J6122Q766j2036j6803J1386j7585K6269P789
17269A4296O488k060R754r799N338o034n738M097M471l6990k0299K442n162K2621
17255a6575K4756K546q117O543j2240l0368J2501K3763j6190R731L2593Q055j9707
17242A7291j9754Q565J2039p652j7939l6900r076K4269J0225o384j2555O354J6446
$$ y = [-16303, -22927, 10418, 38180, 34252, 11031, 26278, 54623, 32819, 27322, 27592, 19049, 10473, -15099, -4298, -9249, -23249, -40086, -18497, -30187, -28869, -23164, -26201, -3270, 1935, 6150, 13520, 29536, 27848, 32222, -3840, -18460, -3021, 12758, 29168, 18535, 5230, -1695, -24343, -8623, 7, 11261, 6024, 26850, 14992, -688, -18043, 2630, 37, -5468, -5314, 16120, -7494, -12012, -24904, -9612, 6510, 15276, 3240, -13563, -2177, -19762, 6507, 14296, 20784, 18724, 28478, 18679, 24017, 17983, 12245, 16342, 20813, -16177, -36476, -34034, -39196, -16575, 8181, 10727, 2610, 9153, -3087, -33455, -20954, 2809, -13381, -3650, 28943, 36998, 17291, -2463, 6102, 18141, 10489, -7450, -44350, -53426, -29157, -18932, -25316, -37871, -31517, -15071]
17229a5071J0264j6008k5188j3108k335J9286J3407L9441R431j776m3489j9003
17217d4149J1594R243n218k4515L8071K6909L7461j9785k5822J4735K7192m980
17205D0736k7198K1860K3542k4523k1317l3131l7570J5378m625K341J4601K529
17193b7377l572q712R283j9695K4589J6581m988O786N269p152k7146K4820J859
17180i455m663K678K744l9685j2864J3259q670K3306R896p11K051r032p120K2239
17166a6027J5508J5557k164k5108k4910K4520L0492K973j7813k6337j0799K1872
17154a2236p24l3527O820J0529L0100J7244K032J7643k9848j3667L3399J7633
17142D5398M886m6445k7616r640O014M078j717M781L074K1193M9l162K760M269
$$ y = [-15071, -4807, -20815, -46003, -59111, -61446, -42160, -28753, 10688, 20119, 18343, -25146, -44149, -32555, -23312, -28530, -53045, -14974, 11935, 49396, 29611, 3789, 18524, 45716, 40736, 13538, 35398, 58940, 34417, 13100, -20031, -57601, -42223, -46848, -44507, -29906, -27377, -30949, -39661, -30378, -50073, -25484, -8903, -13891, -7105, -1836, -8988, -36134, -11314, -9455, -14118, -11440, -8696, -48381, -61245, -47986, -56656, -33350, -23454, -24165, -22114, -31146, -38266, -16027, -519, 15038, 12874, -12234, -37144, -12624, 17868, 20841, 3028, -23309, -34108, -12236, -12960, -46487, -39667, -29138, 962, 18206, 20238, 37881, 8033, -5634, 27765, 45398, 50284, 3839, -23777, -33417, -27403, -23325, -25042, -20261, -17187, 4006, 4055, 893, 3653, 7922]
17128G922j4778J5261l3027j8348J3953K5049R316J939n65J264J1421o073J4413
17115B7747n3801j838J0338K3823J8493p587l1967k378O693m4028k0127J9043
17103e5589M427R841K6706J9183M019j4918j3426Q340O642R437Q305J0910j2268
17090A1609j5852j1745L980P978j4854j332J1646J903L0998J1935k5153l7327
17078b6214M933k368k9475J0554M7213M29j9589O47J2974m806K328m584j7343
17065b5301n992P074L288K8113J5965P079O893K2622P221m2121l2218Q899J3625
17052A5147j0387k4769n820k2035J0841J1085j4115k922O663L8984K7606k3597
17040F681J948o419J8504o491j2181K6512K0014J228n065q214k0819k6346J2204
$$ y = [7922, -6856, 8405, -24622, -42970, -29017, -3968, 5348, 7287, 6722, 7986, 19407, 13334, 27747, -26054, -27892, -17554, 6269, 24762, 17175, -14792, -17170, -10477, -54505, -74632, -55589, -51162, -41321, -14615, 4568, 8587, -6331, -19757, -11417, -4775, 4662, 12967, 23877, 11609, -4243, -15988, -12008, -4030, -18884, -20216, -8570, -6667, 24331, 36266, 11113, -26214, -21281, -23649, -53124, -42570, 4643, 5072, -14517, -13870, -896, -5702, -3374, -7958, -25301, -31293, -24219, -20931, 7182, 23147, 30226, 37119, 59741, 66962, 24841, -7377, 1522, 15147, 4760, -20009, -25829, -47864, -37023, -25938, -40053, -42975, -36312, 2672, 30278, 6681, 8629, 2210, 20714, 14223, 2042, 28554, 48568, 49796, 44731, 36517, 15698, -10648, 1556]
17027A556j7531l4675k2786J2770M7113R415l1150m838K7920J7472P070m189k2966
17014a4819K1846J0109k7735m8228j5194J5203K3060L2160P206N590J2879l578
17002A8499j1465k9682J7827K8758k8550k7964m015J6126j0536R222L2071k740
16990G551P197o197M569j0057j4192M018j109M32k838p597K9980O832r873jk3567
16975a4852j8792J9248J0533r305k2436J7358j363j3461m939K8816L2890K6849
16963E0546J340l702N031j3558k1127j7094J7782K2920J7531K2141k8226n972
16951D7612n93j544j2946K5203P52j0697M668j2736m2803l3295L1052J9583j2875
16938A381j3918K356L0955M23M589J2686m507j0914k2951k2042j0811l0810j3625
$$ y = [1556, -15975, -50650, -73436, -60666, -13553, -4138, -35288, -40126, -12206, 5266, 12336, 8147, -14819, 7027, 17136, -10599, -58827, -74021, -58818, -35758, -3598, 3608, 9198, 22077, 18499, 7034, -22648, -4821, 23937, -4613, -32577, -36592, -20466, -31002, -21780, 10291, 7551, 14748, 8551, 13120, 3063, -11129, -7111, -8220, -7788, -10626, -18223, 11757, 18589, 8716, 8715, -14852, -33644, -14396, -3863, -13168, -35604, -18246, -19609, -33070, -38009, -9193, 23697, 50546, 51886, 48184, 53215, 39657, 18530, 1436, 19218, 42138, 59669, 81810, 53584, 47612, 47019, 45475, 32529, 57732, 58484, 47787, 52455, 39719, -3084, -36379, -5327, 14256, 1381, -12537, -10181, 20774, 21197, 25786, 38472, 33965, 23051, 100, -21942, -32753, -63563, -77188]
16925g7188N1781P219L0986J2910q560O105L0069L276K599j3875Q29P969m294
16912D9826k3177p509Q120j988K187N022J6636k7303j2454k3315q366J4481J8890
16899A1050q077O01K9123k1084j2041j1327k2881O076j6512j4646j7644K7688
16887d9674K7510r531P677L9444R395k2492j7287R965j8761q988K8672L6518J138
16874C3586K042j45j189l5756j1299j3197Q293K7533K1365j8717p707J7261j1557
16861A0513j2516L024j7406N61k6225O335j2660k7356J4700J2827N305k476J7642
16848b7732L9946J4196k7786p809J3584J3870j7354k2847N710J3656j8204m964
16836b5734O079J847J2577J5580l522j144J3043K0653l0528P43j347O873j3757
$$ y = [-77188, -25407, -18188, 12798, 25708, 17148, 23253, 53322, 56598, 59197, 45322, 46151, 54120, 49826, 26649, 19140, 27260, 25272, 27459, 32481, 49117, 21814, 9360, -13955, -22321, -7840, 11050, 2973, 3574, 32697, 11613, -428, -11755, -34636, -28560, -45072, -59718, -77362, -49674, -22164, -31695, -24018, 15426, 24821, 2329, -14958, -4993, -23754, -32742, -4070, 32448, 33586, 35628, 35483, 34294, -1462, -12761, -25958, -17665, 9868, 31233, 12516, 4809, 22070, 10513, -2003, 1021, -16385, -15824, -42049, -35714, -48374, -75730, -61030, -48203, -42898, -45374, -27732, 12214, 26410, -1376, -9185, 4399, 18269, 915, -21932, -16222, -2566, -20770, -25734, -19655, -17808, -5231, 10349, 6827, 5683, 18726, 39379, 8851, 9594, 8247, 15120, 1363]
16823A363Q114M321J3833K6563k8580k2093j125N901J0885P177n256k6142j7492
16810b2531n039O006N311o232K017R170K332K2137J8286m1937M235J6374m682
16797E447k246l001J6745O610J8103k3875J0175K9717l421p806l9312P690K5550
16784D0376J7671k549K0926o426k5308k4040J7010R556J721j9144k2663m4739
16772c7609o800L6924N27j8407J3526M0583q37j1631o209o338j2996j1718K6062
16759E077J7543l571p08P824k2923O821K7656O282r580j5710L930l0624o781J4243
16745e21M5923P076N902j7833j6861j6019j2604J1561J4990N668k0223l3744N044
16732b1641J5464l553p349K2581J7590k3364J9534O404J1384j7548K0242K7239
$$ y = [1363, 9477, 13798, 27631, 54194, 25614, 3521, 2396, 8297, 19182, 26359, 21103, -5039, -22531, -27570, -21564, -16253, -22485, -20468, -11298, -8966, 13171, 31457, -10480, -6245, 10129, 5447, 3201, 200, 16945, 23555, 41658, 17783, 27958, 57675, 54254, 46448, 7136, 14826, 40376, 58047, 55498, 76424, 69998, 44690, 20650, 37660, 47216, 48937, 29793, 7130, -37609, -44409, -7485, -6958, -25365, -11839, 28744, 27907, 16276, 10067, 3729, -9267, -20985, 5077, 22620, 19049, 18341, 26165, 3242, 10063, 37719, 44001, 34421, 18711, 22641, -7983, -14764, -521, 45402, 52478, 58380, 40547, 23686, 7667, -4937, 6624, 21614, 27282, 7059, -26685, -21641, -6177, -9730, -17079, 5502, 23092, -272, 19262, 25666, 37050, 19502, 39744, 66983]
16720F6983j0717m7325j6169p938k1409J6890J5113l458j9563j9067k2252m392
16708g3304J2473L4135M2871M3852N543l9j6704l2241j9220N176n204J86K395
16695h1j6408J3899K2515j1538j6584P380L2233J5626j2178j1037K2635k7600
16683A8862k3124P001j8198j2838P268r935K2512K5685j9326j6576j3143k3199
16671e5011J790J5128J8049K495J2764l830k8117J0144K659J0964O116k6302k7110
16658f0261R960K3722J5356K685j132K1482N894k0756J7505J4820P419K5775L5605
16645I8074k23j8450k733K009K9998J8337J9557N9464M2000M4812J5767K658J1111
16632C22381L8016J716j1005j4418k7678l0915p598j8499k8968l6307n9749l3294
$$ y = [66983, 56266, 8941, -7228, -15166, -36575, -19685, -4572, -8030, -27593, -46660, -68912, -73304, -60831, -26696, 16175, 60027, 65570, 65531, 48827, 16586, -2634, 2542, -2662, -2476, -81, -16489, -2590, 19925, 8387, -8197, -817, 31416, 47042, 34864, 23827, 46462, 18862, -4262, 2739, -15459, -28297, -21029, -30964, -8452, 17233, -2093, -18669, -31812, -55011, -53221, -38093, -20044, -17549, -4785, -8615, -36732, -26588, -23929, -12965, -6849, -33151, -60261, -50301, -26579, -11223, -8538, -9670, 11812, 17706, -3050, 14455, 29275, 36694, 62469, 98074, 97851, 79401, 76668, 78677, 108675, 127012, 146569, 206033, 248033, 292845, 308612, 311270, 322381, 360397, 362113, 351108, 336690, 309012, 278097, 270499, 252000, 223032, 186725, 126976, 93682]
16620I3682k7834j8289j9962j0504j1020J8159K5960K7514j0970n0061r428p390
16608a43K4440K2201l4977k4006K242r392o369Q909K1224J0266p602L003j872
16595G924K163J8258r843r810j9460l7044Q200J1901J0430k1997n649r829Q221
16582d6535O806K1409J3080J5764j470J039M425J038j3469k0774j4593K6959l526
16569i847J16o95J8450j097o856k5338k1764J2762K7642L7196l3524j7211J1250
16556h916J3305j3500K052k425k6334J5875N187M96k725K786J0429j523m535K0434
16542A0606M485o190j7000L01k3306L2493R047r386m960J1086k281q407k7522
16529c1034P560J9229N970K386j4701Q34R670K8947K3462k9773k2608N849J2702
$$ y = [93682, 65848, 47559, 27597, 17093, 6073, 24232, 50192, 77706, 66736, 16675, 7247, -143, 24297, 46498, 11521, -12485, -10243, -19635, -26004, -17095, 4129, 14395, 6793, 9796, 7924, 10087, 28345, 18502, 8692, -10768, -47812, -39612, -27711, -17281, -39278, -44927, -54756, -46535, -39729, -18320, -5240, 10524, 9054, 10093, 14518, 15556, 2087, -18687, -33280, -6321, -9847, -9731, -10426, 8024, 6927, 71, -25267, -47031, -34269, -6627, 30569, -2955, -20166, -8916, 4389, -9111, -7059, -9484, -35818, -19943, -14756, -14260, -16985, -14199, -3770, -5293, -9828, 10606, 15091, 8901, -8099, -7798, -31104, 1389, 10436, 1050, -3910, 7176, 4895, -3512, -31034, -23474, -4245, 1725, 4111, -10590, -9756, -86, 28861, 52323, 22550, -58, 5791, 18493]
16516A8493j4341j4532K0118J9967k2699j5700p336o147j6902k1827Q870L7476
16504a4560l46m345J1625j6009j9154N1097O496p172j7115J0283J7766J8786q952
16491B8400j6209j6680k7699k1384M322K6530L2565k2174o34n896j7968K862M1284
16478G319J3444l620J648k919J1477l069k6128K5886m667l4274o821k7090o987
16465e5801M00n001K8550L4792K6298k3458j873J393k108m373p838k486j3914
16452b5419k9916K5067J9127O746K0q578J491J797J9313j8995k1265J205q930
16439c8337N292l0304M316J5166J7188K6609j1757k4265J5739K8300l423j7620
16427a3096l0217j891l5790q953J9058J9925N208J4976J300J2348P317j6407J0809
$$ y = [18493, 4152, -10380, 9738, 29705, 7006, -8694, -16030, -22177, -39079, -60906, -52036, -14560, -14906, -19251, -7626, -23635, -42789, 8308, 14804, 7632, -9483, 800, 18566, 37352, 28400, 12191, -4489, -32188, -53572, -49250, -22720, 9845, -12329, -12963, -18859, -36827, -33965, 7319, 20763, 17143, 18791, 15872, 27349, 24280, -1848, 24038, 19371, -14903, -21724, -48814, -55801, -55401, -60402, -31852, 2940, 29238, 5780, 3907, 5300, 3192, -1181, -9019, -11505, -25419, -55335, -30268, -11141, -4395, -4375, -12953, -11462, -9665, 9648, -9347, -30612, -29407, -38337, -33045, -63349, -59033, -43867, -26679, -70, -11827, -36092, -20353, 7947, 4524, -13096, -43313, -45204, -80994, -89947, -70889, -50964, -45756, -30780, -29480, -17132, -9815, -26222, -15413]
16414a5413J7377p842k0919j1124N481j190J5312Q645Q50K2654q871r351k7694
16401c2085k9648q867K6497L6248n517j4830k2234n628K3368O6275K3765j4013
16389D3331k6131l6619k415K8153k0944P043L8296n179m9239J5617O976k463J6924
16376A3350j3818j2888J8225j1088m2518M088J7860l893J6359Q572K5661K270
16364B2180m0069p513J1914M597r815K6081J0681Q410K46N100J3046j0226O835
16351D1467R920J710k8742p584J5172j812j6376K652K584J0145M5910O887o456
16338G5477J8573Q978o622K853l514J520l5204j2382J373K3334j9553l3058j0903
16325A0872j8786l3216j1544Q943K4090k621k599K6791n119j5985J1295j6019
$$ y = [-15413, 1964, -5878, -26797, -37921, -32440, -33630, -18318, -9673, -8823, 13831, 4960, -4391, -32085, -61733, -70600, -44103, -7855, -13372, -28202, -50436, -56064, -32696, 33579, 57344, 43331, 17200, -19419, -21834, 6319, -14625, -7582, 30714, 25535, -23704, -8087, -1111, -3574, 13350, -468, -13356, 4869, -6219, -48737, -44649, -26789, -30682, -14323, -5751, 19910, 22180, -17889, -25402, -13488, -8891, -18706, 7375, 18056, 26466, 26712, 31812, 44858, 34632, 41467, 51387, 53097, 24355, 16771, 31943, 30131, 13755, 16407, 18991, 29136, 75046, 81933, 75477, 94050, 103028, 96406, 99259, 95745, 97265, 62061, 49679, 51052, 74386, 54833, 21775, 10872, -7914, -41130, -52674, -43731, -19641, -22262, -24861, 1930, -3189, -19174, -7879, -23898]
16313b3898K6795L6560j9260p075P665j577q474R706p9p965k0972k0288j2784
16300d1646L3002J6696k255R098L030j0008J4687J1024K1329M388q473l2648o77
16287A7547j7453j259j917L977j5355p95l400L874J3161K7693r485k7915j4139
16274b5466k7666J2481J8890l2440j2605K9195R910K340J8502N083J8299l0455
16262a3932J1196K5196J2374k0778k6452J1107J4526Q01l613K2805O614o801K988
16249C6031j0542j0177j5703o480k0149j4285J817N358L3331j376J0450o482J1038
16236A2831j289r49k9018p152J9520j119o059q260l19J3548J3556L2210J7570
16223E5070J4132K0671J1325k39P260p238o727r326J8624j956k2783N351p317
$$ y = [-23898, 2897, 39457, 20197, 13122, 20787, 19210, 10736, 20442, 20363, 12398, -8574, -28862, -41646, -8644, 8052, 5797, 14895, 17925, 7917, 22604, 33628, 54957, 59345, 50872, 18224, 17547, 94, -1165, -3082, 895, -14460, -15255, -18655, -14781, -1620, 26073, 16588, -11327, -25466, -53132, -40651, -21761, -54201, -66806, -37611, -27701, -25361, -6859, -1776, 16523, -13932, -2736, 22460, 34834, 14056, -12396, -1289, 13237, 14038, 10425, 33230, 39844, 33043, 36031, 25489, 15312, -391, -6871, -27020, -41305, -39488, -34130, -799, -2175, 8275, 1793, 12831, 11542, 10593, -18425, -25577, -6057, -7176, -13235, -21495, -21814, -8266, 5290, 37500, 55070, 69202, 89873, 101198, 100959, 108219, 100981, 94254, 84928, 103552, 101596, 78813, 84164, 76847]
16210G6847O900J4931l5002n3293R577K317l0217j1660K6000K8091M599J9308
16198E8398o440j9841l470M242p265j0086k819j0497L7418L7205q353O67J708
16185G0867K1466J7995l346K990J1695j3941j5324n3271q511J4897m721N523J1929
16172E8248r744O040n141l749K831K1419r084j4626K3863L5400J042k907M7507
16159A51099L8390J0244K4383M3145L0451j7634L5941J8684K9168K7136R207j2426
16147C87788K917k1928n0914m3355k3393Q087K781J4760j4523k2319J7415K8729
16135B86045J0869J0470M872K6769K2523J5218M018p672l0672J4942N2810J8896
16123D29088K8215O3655O5365O2337J10555R3892J12058J09369P9871P4467P8174
$$ y = [76847, 83747, 98678, 63676, 10383, 19960, 22277, -7940, -19600, 6400, 34491, 39090, 58398, 51958, 32117, 28647, 32889, 25624, 15538, 12719, 2222, 39640, 76845, 68492, 69159, 70867, 92333, 110328, 106982, 109972, 121667, 107726, 92402, 39131, 30620, 45517, 40796, 46319, 58248, 48504, 54544, 49403, 45654, 48485, 69904, 60820, 46194, 70057, 105457, 106499, 103592, 151099, 189489, 199733, 224116, 267261, 297712, 280078, 316019, 334703, 363871, 391007, 400214, 387788, 390705, 368777, 317863, 274508, 251115, 259202, 261983, 276743, 262220, 239901, 257316, 286045, 296914, 307384, 312256, 339025, 361548, 376766, 380784, 373112, 342440, 357382, 410192, 429088, 457303, 520958, 586323, 648660, 759215, 853107, 965165, 1074534, 1154405, 1228872, 1307046]
16112A307046J02822J36612J73136J96311K03938K15590K90118L82312M99862
16103C507747O68728R42610J314682J794916K402783L139921L900154M631258
16095B2302799N322717N967427O512903O508772N300117M273127L841693K585900
16087F2615455M27527j780019k872393l591458m980661o192828o351037n932757
16079C1341829n509674m946471m258507l492573k760324k094787j574179j151216
16071E554098q28231o37795n04063m07115l59875k95271k31814j84118j73005
16062A932811j50606r2490r9824j33466r7113j02290o8506o8929q0224j02980
16052I36383r6727o8961p4044n8538m0292m6472p7019j3122l1820l3919N449j2302
$$ y = [1307046, 1409868, 1546480, 1719616, 1915927, 2119865, 2335455, 2625573, 3007885, 3507747, 4176475, 5119085, 6433767, 8228683, 10631466, 13771387, 17671541, 22302799, 27625516, 33592943, 40105846, 46614618, 51914735, 56187862, 60029555, 62615455, 63042982, 61262963, 58390570, 54799112, 49818451, 43625623, 37274586, 31341829, 25832155, 20885684, 16627177, 13134604, 10374280, 8279493, 6705314, 5554098, 4725867, 4088072, 3584009, 3176894, 2817019, 2521748, 2289934, 2105816, 1932811, 1782205, 1689715, 1589891, 1456425, 1359312, 1257022, 1188516, 1119587, 1039363, 936383, 839656, 770695, 696651, 638113, 597821, 551349, 474330, 461208, 429388, 395469, 400918, 388616]
16040C88616k5727j5411j0392k8105J8255K7524n4783o1698m6838J84m198N42
16028A87969O2603M6985l801k1910j9996k7729r282L916m571q518k6600k7002
16016A52064j3402m599K5025L6922n139j8703k0561Q83r729j3932j6412J4549
16004A26966j2836k0521K2435K1444j7592k3456O292K3500L974o639K845m149
15992A22263j6195k161m544K877o311J3716J4825k788m3739j1275n793M25J8254
15979G9554j065l1353r780K0952L5943K0433j6984n015R716j1690k2833J294j5762
15966E3410K263K0696J5406j0159j8917M629J8364O621J1978K5007n028m6552
15954G7718j1455J4411j9817j3843j4929J6791J9594l0078j1084J857j8003l340
$$ y = [388616, 362889, 347478, 337086, 308981, 327236, 354760, 299977, 238279, 191441, 191625, 187427, 187969, 250572, 297557, 293756, 271846, 251850, 224121, 214839, 218755, 214184, 205666, 179066, 152064, 138662, 134063, 159088, 196010, 190871, 172168, 151607, 152490, 142761, 128829, 112417, 126966, 114130, 93609, 116044, 137488, 119896, 96440, 102732, 126232, 130206, 123567, 126412, 122263, 106068, 103907, 99363, 102240, 95929, 109645, 124470, 121682, 77943, 66668, 60875, 61300, 79554, 78489, 47136, 37356, 58308, 94251, 114684, 97700, 92685, 102401, 90711, 67878, 69172, 53410, 55673, 76369, 91775, 81616, 62699, 67328, 85692, 92313, 104291, 129298, 124270, 77718, 66263, 80674, 60857, 47014, 32085, 48876, 68470, 38392, 27308, 29165, 11162, 7822]
15942G822J1064j0984K8894L2677m3400j5818j6621j5681J1692L6012K2015J3970
15930F1642j7036m073L2273J2704J0067N875j2235k9762j3322k530k0925q314
15918A4364L0339Q46j9063n063K7179O000k908j7860j9984L40p719m667M6564
15905D8368o181R615k554l1105L026R492k5439J8761k0199k1865j0708J0872M998
15892a2919K4672M603M106P560r093j4786p209j3850M7805K9872r643o032K004
15879D7090j6978l6128j4007L0949k1154n411K1930L5724Q507l940l7394k7095
15867a7907M208P28r481J6058L623o036q874m44O208Q270L7817N248r567Q99J5053
15852D5803l142P244Q53J413k0292J2308j388J2448O601n171k5168j0986J3941
$$ y = [7822, 18886, 7902, 36796, 69473, 26073, 10255, -6366, -22047, -10355, 25657, 47672, 61642, 44606, 40533, 72806, 85510, 95577, 101452, 89217, 59455, 46133, 43603, 22678, 14364, 44703, 45549, 26486, 21423, 48602, 54602, 51694, 33834, 13850, 14190, 6471, 1804, 48368, 42187, 51802, 49248, 18143, 21169, 30661, 5222, 23983, 3784, -18081, -28789, -17917, -12919, 11753, 16356, 20462, 28022, 18929, 4143, -3066, -16916, 30889, 60761, 51118, 45086, 47090, 30112, -6016, -20023, 10926, -10228, -15639, 6291, 42015, 50522, 46582, 9188, -17907, -13699, -12971, -22452, -6394, -2771, -8807, -17681, -18125, -11917, -3647, 34170, 39418, 29851, 30750, 45803, 42661, 49905, 50758, 52171, 31879, 44187, 42799, 55247, 61848, 56677, 31509, 20523, 34464]
15839C4464N052J6212m489l746p051J4891J0479n27r578m7667q911J221o736J240
15825e146j6808J0675J795r468o641P083M7481m339k8102J7437O63j2428l2289
15812c0087L585M202J1810J2677J8372k3255j8902J1526J4905j9881m5167J4563
15800d5652j4890M3107L4204k5934r432M373Q408m390L9366J0315j4563l9476
15788a4564p148N211j049L3J9334l16k3940j491K2185N345L016J718k5511o645
15774b3822K8877L0619k4708J4162J8855R841l1127j9547o846k310k309K2841
15762A4526N293J5064o307m475k941k2069n823j7049K574L0207J5831J015j0469
15749A5377J0351j0903n969P457k671L3697k346K009j256j3851P605J2906k8452
$$ y = [34464, 39516, 55728, 51239, 47493, 40442, 55333, 65812, 65285, 55707, 8040, -871, 350, -6386, -5146, -21954, -11279, -9484, -18952, -25593, -18510, 28971, 24632, -3470, 13967, 14630, 2202, -30087, -26502, -22300, -10490, 2187, 20559, -2696, -21598, -10072, 4833, -15048, -60215, -45652, -60542, -17435, 16769, -9165, -18597, -14224, -5816, -10206, 29160, 39475, 24912, -14564, -21712, -16501, -17550, -17517, 1817, 1501, -22439, -23930, -1745, 3600, 6616, 8334, -17177, -23822, 5055, 35674, 10966, 25128, 43983, 53824, 22697, 3150, -3696, -6006, -8315, 14526, 19819, 34883, 28576, 24101, 21160, -909, -6732, -23781, -21207, 9000, 24831, 25846, 15377, 25728, 14825, 8856, 16313, 13642, 47339, 44993, 47002, 45746, 31895, 39500, 52406, 23954]
15736B3954j6166K1294p123j1680R821j4220k1656r336p542N875j3730l629K0683
15723b3455j0069J1155K4906O704j5025M883L7445j2448l1230k8842m079n293
15711d5348j7766L0962k630M901J7697N1634J7664n93J1772j60l4635j2038L2554
15698E4014k782k5563k1071P020L2512J6745k175j7263k4567p878J7578n849p179
15685A3542Q005k2212o880M542j5983j8520J1530O565J7105Q958J8120k2115k6374
15672b3717L243K513J8973O260j4094M596m924j1820j3557O573J4673J6855J6537
15659B2111j2097L753K0159o845n87j24o351P73M4798K1877j4704k7652j3211
15646C1900K1324J8830k5724Q385j761M27O990j7871l0498j5899k0443j5707J3827
$$ y = [23954, 7788, 29082, 21959, 10279, 20100, 5880, -15776, -25112, -32654, -26779, -40509, -44138, -23455, -33524, -22369, 2537, 9241, -5784, -901, 36544, 24096, -7134, -35976, -40055, -45348, -63114, -32152, -34782, -29881, -12184, 39450, 57114, 56521, 68293, 68133, 33498, 21460, 54014, 51232, 25669, 4598, 11618, 44130, 60875, 58700, 41437, 16870, 8992, 26570, 20721, 13542, 21547, -665, -7545, -3003, -18986, -37506, -25976, -19411, -2306, 6652, 24772, 2657, -23717, -20474, -17961, 1012, 7272, -6822, -2226, -7150, -18970, -32527, -25954, -11281, 5574, 22111, 10014, 13767, 33926, 27081, 26494, 26370, 20019, 20792, 65590, 87467, 72763, 45111, 31900, 53224, 72054, 46330, 54715, 52954, 53381, 60371, 42500, 12002, -3897, -24340, -40047, -26220]
15633b6220N2548J1600k655j4431k253K823J356j3300l597j327j0179l693M801
15620d527J7700j7529q903Q202P311n495k5606p279K6744K1993O547J985q128
15607A3015J8185m193m0536K654K9671Q450j4827m939j218K0705Q525j8912M857
15594B1437j1797k805L0122M817j4904k014L6310j5143l7435l3324K6188m25N096
15581F123J2028J2387J1428m401l5068J3110n940o875k0860l99P031j0647P565
15568a4518L0281j5823j8640l901O362j5132M75l7380Q80L8882N2372L102Q107
15555C5067j1508n838O896J8857L3K7566J712K287L0309j1527L2160N0524M2910
15542B19448P579J9301L860J9566K1583q22j6405l076J7448k0571k5614m4129
$$ y = [-26220, 26328, 37928, 35273, 20842, 18589, 21412, 22768, 9468, 5871, 4544, -5635, -9328, -4527, 13173, -4356, -13259, -5057, 2254, -3241, -28847, -36126, -9382, 12611, 19158, 21143, 13015, 31200, 27007, -13529, -10875, 18796, 27246, 12419, 7480, 6262, 26967, 35492, 16580, 21437, 9640, 6835, 36957, 41774, 26870, 24856, 61166, 46023, 8588, -24736, 1452, 1027, 6123, 18151, 30538, 41966, 37565, 2497, 15607, 9667, 2792, -18068, -18467, -11436, -22083, -14518, 15763, -60, -18700, -22601, -16239, -31371, -30896, -68276, -67396, -28514, 23858, 26960, 35067, 23559, 17721, 24617, 43474, 43507, 71073, 72785, 75072, 105381, 93854, 126014, 176538, 219448, 227027, 246328, 250188, 269754, 291337, 290515, 274110, 271034, 288482, 267911, 242297, 198168]
15530A98168k7171o067j1176l1901k3083l5511r721L1356m6m4024l4478l2880
15518b6534k5964J5011J9816J6528p347J5543J4541n333J0379r051j5469J754
15506C874J5310J6917k583m0653m1958r729L0010K7184N707M5988K5506m181r241
15493F2151k4836j0533k107M819k9463o9937k5943J913K3236J5741J7078P789
15481c0092N290J1302j4746j1730K3261J9736o833K0607j5480j6475j5504J1564
15469a9100L397J6325J711j0034J0763m016j7215J4166j4336q853Q675l1809K2792
15456b7534L3350P796L134K431N676J3437l5704k2592J7396J9049O10R110N784
15443C1943j8878l8708J6478K4197M177o752J1882K4513j1567k4451K2724K3703
$$ y = [198168, 170997, 164930, 153754, 121853, 98770, 63259, 53538, 84894, 84848, 40824, 6346, -26534, -52498, -37487, -17671, -1143, -8490, 7053, 21594, 16261, 26640, 17589, 2120, 3874, 19184, 36101, 33518, -7135, -49093, -58822, -28812, -1628, 4079, 50067, 75573, 71392, 62151, 37315, 26782, 24675, 29494, 31, -69906, -95849, -93936, -70700, -54959, -37881, -30092, -24802, -13500, -28246, -39976, -16715, 3021, -3812, 16795, 1315, -15160, -30664, -19100, -15703, 622, 2333, -7701, 3062, -954, -18169, -4003, -18339, -27192, -18517, -50326, -27534, 5816, 13612, 16746, 19177, 24853, 38290, 2586, -20006, -2610, 16439, 17049, 26159, 31943, 13065, -25643, -9165, 15032, 19209, 12457, 24339, 48852, 37285, 12834, 35558, 59261]
15431E9261m86j032j766l3263o1804j1007l292Q336Q893P403J2390o860l305J9084
15417g448R66j6013R434Q108k7191n0L3315K3111L0148j0736l1306J921J2968
15404B7227K123L493R145R855k5101j8009o223l732K1772k5562p147j2303o011
15391c0473J3070l5570j4862K1391L275J3057K9277R352r936O623p559J2656M674
15378A4975O762n103k2283r656l5650k8655K6294M9426q764j1755J7056n577O188
15365f742J4193L2771J4663q72o342j3121k9741L1238J1040k3037j2639M901K295
15352A8607J1771L420m2099j4714r623l8740J29L8768k378q994J2733K9570J2712
15339A1162k0571j6427r781K3415L1717J9025N564k6401l6939j0281j8557j3151
$$ y = [59261, 58775, 57743, 55977, 22714, -39090, -50097, -53389, -45053, -36160, -28757, -16367, -23227, -26532, -7448, -6482, -22495, -13061, -4953, -32144, -32194, 1121, 24232, 54380, 43644, 12338, 14259, 27227, 29350, 32843, 41988, 51843, 26742, 8733, 2510, -1222, 20550, -5012, -12159, -24462, -30473, -17403, -52973, -67835, -46444, -43169, -30112, -835, 8517, -1419, 5204, -2355, 10301, 14975, 21737, 16634, -5649, -15305, -50955, -79610, -53316, -3890, -12654, -24409, -7353, -12930, -6742, 7451, 40222, 54885, 54013, 47671, 34550, 4809, 36047, 47087, 24050, 11411, 16312, 18607, 30378, 33798, -8301, -23015, -32638, -71378, -71249, -32481, -34859, -43853, -31120, -1550, 11162, -9409, -25836, -35617, -12202, 19515, 38540, 44104, 17703, -19236, -29517, -48074, -61225]
15327f1225J2570K6590K9316P261n0k8028K27k211J170J2282q292M509k53j856
15313g990r938J6212r38K5311J2668j7720k2464R303o233m580K3400j4923o897
15300d789J0361n36K944K2798J4504k0225k2729l2865K7748L3308r843K1745o611
15287C5810k0187p867l1280q484J3052M5396J262m5043k2067O815l961M8495L4933
15274D6874k714l0461l8091k65K0814m560J210k723L381N246K806o725Q337P987
15260A1116k3277O605j9705K4154J0865j1266j0507J6423K21P350k9728j0461
15248b8210J368J3193N172L5392p585R28k4826m5826N4Q8r29P559J1047K6270
15234f305L5449O451m1172O8K0540j2066r014J5278M0925o629k2913j5360p791
$$ y = [-61225, -48655, -22065, 7251, 14512, 14462, -13566, -13339, -15550, -14380, -2098, -10390, -5881, -6134, -7990, -17928, -1716, -2654, 22657, 35325, 17605, -4859, 4444, -1789, -6369, 17031, 2108, -4789, 5572, 5036, 7980, 30778, 45282, 25057, 2328, -30537, -2789, 30519, 20676, 42421, 35810, 15623, 7756, -23524, -32008, -18956, 26440, 27702, -17341, -39408, -32593, -36554, 11941, 46874, 44160, 13699, -24392, -24657, -3843, -8403, -7193, -9916, -6535, -1289, 1517, -5208, 3129, 11116, -12161, -5556, -25261, -1107, 9758, -1508, -12015, 4408, 4629, 11979, -17749, -28210, -26842, -13649, -8477, 26915, 19330, 20258, -4568, -50394, -50340, -50252, -51181, -43622, -32575, -6305, 29144, 35595, -5577, -5509, 15031, 2965, -6049, 9229, 50154, 43525, 20612, 5252, -2539]
15221b539K124j865l3519L887L9445L3308q420m6938j5201R345Q325j791q788
15208b2627l446K1908j8627J50J5455q295j4059J6299J4948j2026m56K315j0273
15195a8734J3605O250O127j877k0999L749p823k3369j7943M237R031j5821j3249
15182g6816q554j2173L9041N8118O756r470K4941m247j5424j4901k8014l434K0862
15169b3315J1752q696o419l037P722k8373J7684j4215j2784L4482M9108J2624
15157C6533N347m281k311j981R594J6991j5735k2056k0313n334M735N936K847
15144I972l765m0759j8968P646L4872M841J1650L513J936J3929j5446l2712J4941
15131h350K3545k4975l1132L0030L729J7793k686O955O878p360j6697P209J2117
$$ y = [-2539, -415, -2280, -35799, -31912, 7533, 40841, 32421, -14517, -29718, -20373, -12048, -13839, -22627, -26073, -4165, -22792, -22642, -7187, -15482, -29541, -13242, 1706, -10320, -10776, -8461, -18734, -5129, 1121, 7248, 5371, -15628, -11879, -19702, -43071, -61014, -56777, -47746, -63567, -76816, -85370, -97543, -58502, -384, 6372, -3098, 21843, 17596, 2172, -12729, -40743, -44177, -23315, -11563, -20259, -26678, -29715, -21993, -50366, -32682, -46897, -59681, -25199, 23909, 36533, 41880, 37599, 35288, 33307, 42901, 59892, 44157, 22101, 1788, -3546, 1189, 7125, 9972, 6207, -34552, -53520, -45874, -11002, -6161, 5489, 9002, 10938, 24867, 9421, -23291, -8350, 15195, -9780, -40912, -10882, -7153, 10640, 7954, 14909, 21787, 14427, -2270, 4939, 17056]
15118A7056l7946k6463K0497K0260N78n638J3571K8162J9202o86j805K0587J0828
15105G8203j5212l2599k8446o119O67n180k674J6107j6075J8832K4846j0424O531
15092B8457J0063j5632J9772j7387l4293j4020r360J2317k0732J5574j5258L210
15080c7289J8604J0482k5217J5874k0307j5089R958R258k3273J9496K3949K9720
15068A6166j0760m3155q915K6353j0817P376L960J6667P790k2675k9755j9154
15056f6919N559J8440J6204K4375K2060j4359J090j6498K2144J2628J1780l2212
15044D292l650k2865k2003j4394J5438K7854R046p927j1240o696r955j3024J7649
15031c7475J5996N556L0926p654l3805K1325l432k0819O995j0026Q390J2500o361
$$ y = [17056, -20890, -47353, -26856, -6596, -6018, -11656, 1915, 30077, 49279, 48593, 46788, 67375, 78203, 62991, 30392, 1946, -4173, -3506, -8686, -11360, 4747, -11328, 7504, 32350, 21926, 28457, 38520, 22888, 42660, 25273, -9020, -23040, -32400, -20083, -40815, -25241, -40499, -37289, -18685, -8203, -33420, -17546, -37853, -52942, -42984, -33726, -56999, -37503, -13554, 16166, 5406, -37749, -46664, -20311, -31128, -23752, -19792, -3125, 4665, -18010, -47765, -66919, -61360, -42920, -26716, -2341, 19719, 5360, 6450, -10048, 12096, 24724, 36504, 4292, 642, -22223, -44226, -58620, -43182, -15328, -6282, -14209, -25449, -32145, -42100, -55124, -37475, -21479, -15923, 15003, 7349, -26456, -5131, -8563, -29382, -22387, -32413, -24023, -11523, -17884]
15018a7884k0759L0409O966k763J736J0999L7k0269j475L975L92J5850J7981j4378
15004A0817m7100k0105K2649M5018J1802n054l1833l3857K0369J9920L7182J7015
14992D6823j1343L812k2980k7158j7471l201K9620o434k6237q97l040L686n76
14979c5396j4830K644m930J2797j2185m739J3764O519j7449M0079J8291j1909
14967g344q972K4743L37j3255j6774k6584J2783J3211p04K0515j3277n101r426
14954b9848p045L575K0767K33k1108M224K8193J2601J5396k9948J3462J1789k5713
14941c422O439p619l5434j3103L354J6727m901Q656j5790P149R073O494N367O903
14927a0107J3981j7828m0529L5140J4715k567P588P00J3507m820J512r306j9050
$$ y = [-17884, -38643, -8234, -1268, -4031, -2295, 8704, 8741, -11528, -13003, -9028, -8636, 7214, 25195, 10817, -36283, -56388, -33739, 11279, 23081, 18027, -13806, -47663, -27294, -7374, 29808, 46823, 35480, 39292, 16312, -10846, -28317, -31518, -1898, -8332, -34569, -35466, -38506, -34820, -35396, -50226, -47582, -52512, -39715, -51900, -56639, -42875, -36356, -53805, -13726, 4565, -7344, -16316, 8427, 8764, -4491, -21265, -47849, -35066, -21855, -22559, -2044, -15321, -20422, -29848, -36893, -33318, -12551, -12318, -33426, -29202, -1009, 11592, 26988, -2960, 10502, 22291, -3422, 3017, -4602, -40036, -53139, -49785, -33058, -37959, -29303, -45093, -37944, -28871, -22377, -17010, -10107, 3874, -13954, -54483, -19343, -4628, -7195, 393, 1093, 14600, 9780, 11292, 1986, -17064]
14914a7064P296n974j6591K1181J575j0470N450M421J646P626L3709J2122l0661
14901A4266k0652L7722K3766K285j4675P33l4765r972J486J2095J9039o882M023
14888B8469j5109P54k2131n472k0535J3680K6353O631k3033L371L45k3106J6062
14875a3721R537k8006j6807k6406m694L8818K7799K3294O081j616j4931q96m907
14862f455l1124j611l628J1880K5265n277m185L435O990N184K3014o261j1023
14849F204K613J0213k0002j0333J415M905k134N622K022o260o249R791K5244K1092
14835D4143O019j3636j836Q308J0497k2803l4690n059J3225p135j1654m3625j5587
14822g3833k2579L3818M243L0719l721j1775L6257M1206m243p937l1435R849L02
$$ y = [-17064, -9768, -15742, -32333, -11152, -9577, -20047, -14597, -10176, -8530, -904, 32805, 44927, 14266, -6386, 31336, 55102, 57387, 42712, 43445, 8680, -1292, 194, 12289, 31328, 24446, 28469, 13360, 14114, -8017, -13489, -34024, -20344, 6009, 12640, -10393, -7022, -6677, -29783, -13721, -4184, -32190, -48997, -75403, -80097, -41279, -13480, 9814, 15895, 14279, -652, -1548, -6455, -37579, -39190, -42818, -30938, -5673, -10950, -15135, -11700, -4710, 474, 23488, 17227, 6204, 8817, 19030, -972, -11305, -9890, -4985, -7119, -1497, 525, -5735, -11984, -2193, 23051, 44143, 50162, 36526, 34690, 42998, 53495, 30692, -3998, -9057, 4168, -2967, -14621, -58246, -73833, -96412, -62594, -58351, -27632, -31353, -43128, -6871, 34335, 30092, 22155, -9280, 569, 871]
14809H71J729J1265K9405r344n337N826k7168j6901N774j2459j1419J8884M2583
14796C3709J8133j736k9554j1055j6847k4681J0569l847j0892j0575j6507R148
14784e4135N427J1231K6296o086j2335k4175q450j925J8191p555L2428K6578J1992
14771A7482L213p992J232o709j2736j0353J0353j499n907P475K0309J2897J0300
14758C8065K6082M1991n280l0546k0259J1388M3518O6165J08061J36483J57533
14747E73201J98414K15688J21078j8320j53207k17196k03521j47647q9212n6458
14737B22820l8300l7066l5878k2488n3092m6758J1969J488P02J6213J7298J1662
14725D8570l436k3826J0653J9835J1533j9088k4820k1477q256j0731l0916J4164
$$ y = [871, 2600, 13865, 43270, 33926, 28589, 34415, 7247, -9654, -3880, -16339, -27758, -8874, 33709, 51842, 50106, 20552, 9497, -7350, -32031, -21462, -25309, -36201, -46776, -63283, -54135, -48708, -37477, -11181, -17267, -29602, -53777, -62227, -64152, -45961, -53516, -21088, 5490, 17482, 20695, 12703, 13935, 7226, -5510, -15863, -5510, -7009, -12916, -5441, 14868, 27765, 38065, 64147, 106138, 100858, 70312, 50053, 61441, 104959, 171124, 279185, 415668, 573201, 771615, 987303, 1108381, 1090061, 936854, 719658, 516137, 368490, 279278, 222820, 184520, 147454, 111576, 89088, 35996, -10762, 1207, 2695, 3397, 19610, 36908, 48570, 45134, 21308, 31961, 51796, 63329, 44241, 19421, -2056, -10312, -21043, -51959, -37795]
14713c7795J9181K608O9J2854l7825J2987K8075R109k139j303j5008k9761J0137
14700b8811j1053j4883L3595o338j556R758J9425K6648K8077j4593k0689l2392
14688a2812k0722K273k9308j8370J7863M6695M9230j203j7446l0495L165n415
14676a6545j6127o654J1170J8878J6658o536N414N703k4706n247O756R47K5390
14663A5101j3051K7306n410m9386P553j2368k1211K1538J7112J7944o931k1063
14651b2866j1240l602k4937j891J9294J555L6787p15j6194L889J2507j0957J6013
14638b357J0741j6415M268J1669J4956r984J0264k9481k0524q660J0525o303J0783
14625b0518L3305j2215j1117l892j9488k5206r691L2510q214O585M6458o305o613
$$ y = [-37795, -18614, -16006, -15937, -3083, -40908, -27921, 154, 9263, 7124, 5821, -9187, -38948, -28811, -39864, -54747, -21152, -27490, -29046, -19288, 137, 26785, 54862, 40269, 19580, -12812, -33534, -31261, -60569, -78939, -61076, -14381, 34849, 33646, 16200, -14295, -11130, -16545, -32672, -39326, -28156, -9278, 7380, 844, 6258, 11961, -12745, -17992, -11236, -10289, 15101, 2050, 29356, 23946, -25440, -17887, -30255, -51466, -29928, -12816, 5128, -1803, -22866, -34106, -37708, -62645, -64536, -45242, -43687, -6900, -7615, -23809, -19920, -7413, -18370, -2357, 8384, -8031, -3763, 7906, 22862, 12878, 23142, -6339, -26863, -35523, -24998, -31301, -20518, 12787, 572, -10545, -14437, -33925, -59131, -68822, -36312, -44526, -37941, 8517, 2212, -4401]
14612d401o199j4617L3788Q925j7702q974J0297j8522j6220Q527J3535p611J3213
14599e961M2322k0656j4623J8594M490r213j6106j2462j6051o85K7200J9671O782
14586B3302m11M718K5318o99l7118p251K859m848J1052p132k4302j2656k936j6965
14572d7069j2101K4036K8520l059R75o413j4205r847k9088K4257L8353J4003j9084
14559a0722k5375r912J5453K3556L667J4397J5195J5993L5203r354l6437k8252
14547C412P38P185J2760q907q226k4101k3072J0507J2511K303L073Q754n451k2950
14533c1464m187J4187J140K9629P38m4344J4783J0730N184J7817Q848N107q960
14520A9208P757M4052m772p129j3272k4870N175K1108r349J207K8822J8282J3159
$$ y = [-4401, -10600, -25217, 8571, 17496, -206, -9180, 1117, -17405, -33625, -25098, -11563, -19174, -5961, 36361, 15705, 1082, 19676, 24166, 14953, -1153, -13615, -29666, -30351, -3151, 16520, 23302, 22891, 27609, 52927, 52228, 15110, 7859, 10718, 5870, 16922, 9790, -14512, -27168, -30104, -47069, -59170, -35134, -6614, -9673, -8698, -15111, -29316, -39163, -68251, -43994, -5641, 8362, -10722, -36097, -46009, -30556, -7000, -3333, 11064, 26259, 42252, 77455, 68101, 31664, 3412, 4150, 11335, 24095, 15188, 6962, -17139, -40211, -29704, -17193, -14890, -11817, -3063, -8514, -31464, -35651, -21464, -20324, 9305, 10043, -34301, -19518, -8788, -3604, 14213, 23061, 28168, 19208, 26965, 71017, 66245, 59116, 45844, 20974, 26149, 47257, 37908, 39115, 67937, 86219, 99378]
14507I9378J89j5710R380O530J6845J3525j3720N506j202K903J7701J6571K3588
14494A81484J9103n232n068O682J2110M656J1093q047k4987k0478k597k026M916
14481A71609j8531p636L7022R492k041J8621J841l2744k447k190q950o68R567
14468A72945K7473J6050J4400J0892j0124k6365l8554j1338m853j8240j5998k529
14456A13759m333j18r824l565m4960J547L3732o864j9835M547l68j5207j6709
14443C1802k9620j894J1363p695N474L988L3098l720j7726j6559L85K1363L584
14430C3843l38j3870R551n876r451K3603k805m426J0350j3971k1341L822R916
14417A9007K0172j516k5539k736J359J7824K9063P165k224j8532j9208m274Q579
$$ y = [99378, 99567, 83857, 93237, 99767, 116612, 130137, 116417, 121923, 120721, 123624, 141325, 157896, 181484, 200587, 195355, 190287, 196969, 209079, 213735, 224828, 216781, 191794, 171316, 168719, 166693, 171609, 153078, 145442, 182464, 191956, 189915, 208536, 210377, 177633, 175186, 172996, 164046, 163378, 172945, 200418, 216468, 230868, 241760, 231636, 205271, 166717, 155379, 150526, 132286, 116288, 113759, 109426, 109308, 99484, 95919, 50959, 52506, 86238, 79374, 59539, 64086, 63718, 48511, 31802, 2182, 288, 11651, 3956, 9430, 13418, 46516, 42796, 25070, 8511, 8896, 30259, 33843, 33505, 19635, 29186, 23310, 13859, 37462, 34657, 30231, 40581, 26610, 5269, 9091, 19007, 39179, 37663, 12124, 9388, 10747, 28571, 57634, 64799, 62575, 44043, 24835, 20561, 29140]
14404B9140O873q152m920J1889L881j8979m2474m812k649k232J0458j0428L9174
14391F769L007J1492k8489l0536J9533M0293L0378j4254p144O613k0155m6654
14379b9147k3382l095K7815J0975k4948N216M2338K7740j6333k3818J5265P400
14367A6026j3730J3132J3655k4791k4640j767k4977n500J0472l0426l379j59L0732
14354d5352j183P437K3784R836Q182L0771J689N671j1941j9262L964l336K404
14341A2664J4270l0289p39J2771j0255P649j4754p221P597K6390J1965J1021K6590
14328F7659K6353N062k8009K5042M7l844j146R999K867j1800O456n274N261k052
14314I6621k2482J562j9257k7216j1845q914J195J7424j3917J3397J009J7817
$$ y = [29140, 36013, 27861, 22941, 34830, 38711, 19732, -22742, -27554, -30203, -32435, -21977, -32405, 6769, 9776, 21268, -7221, -37757, -18224, 22069, 52447, 38193, 31049, 37662, 17507, -29147, -52529, -55624, -27809, -16834, -41782, -36566, 5772, 33512, 17179, -6639, 8626, 16026, 2296, 15428, 29083, 4292, -20348, -22115, -47092, -52592, -42120, -72546, -75925, -76084, -45352, -46535, -39098, -15314, -5478, 2704, 33475, 35164, 40835, 28894, 9632, 13596, 10260, 12664, 26934, -3355, -4094, 8677, -1578, 6071, -8683, -15904, -8307, 18083, 30048, 41069, 67659, 94012, 99074, 71065, 96107, 96154, 92310, 91164, 101163, 104030, 92230, 98686, 93412, 98673, 96621, 74139, 75701, 56444, 29228, 17383, 8469, 9664, 27088, 13171, 26568, 27577, 45394]
14302D5394m763k4013l8473j5011L3745L4562j5420k0237K7780L3165o842p91
14290D9096M249J7889M771j3556J4702r800p712p504o488J4205j3132k307L876
14277D8289K7284n193k5222j6368r092J5373J0403J5919L8335r942o1504k294
14265B5988o830k2969J188n951J2788L581j4989Q341Q616L0207K6259k550q268
14252E5411k2399j1476J7712K8819O060J864M168J2817l3671N061l0440j8594
14240A5332j535m935l316K0639L2559n659j0650M30N123j2928r423J8070P084
14227E0791l5940k2925J6282p917O279o671k5943J966K4456J8828J576k0455J0794
14214A1121L7391l940m9607Q288L2378J1040j3394l1646k5818M0116L7175L3131
$$ y = [45394, 40631, 16618, -21855, -36866, -3121, 31441, 16021, -4216, 23564, 56729, 49887, 49096, 53345, 71234, 76005, 62449, 77151, 67351, 59639, 52135, 45647, 59852, 46720, 44413, 48289, 75573, 70380, 45158, 28790, 19698, 35071, 45474, 61393, 99728, 89786, 28282, 25988, 19158, -3811, -2623, -8574, 4214, 7795, -7194, 1147, 9763, 39970, 66229, 63679, 55411, 33012, 21536, 39248, 68067, 74127, 75991, 80159, 92976, 59305, 64366, 33926, 15332, 13797, 8862, 5546, 26185, 58744, 53085, 42435, 42865, 47988, 35060, 25637, 43707, 50791, 14851, -8074, 8208, 291, 6570, -101, -26044, -24078, 378, 19206, 20782, 327, 11121, 48512, 44572, -5035, 3253, 35631, 46671, 33277, 1631, -24187, 15929, 53104, 86235]
14202H6235j48l453j016k349n875k0519j8116J9239J9242J9395j2150j1734m911
14189F3840L691m332k9570j3230K7066J1727k1309k0136L1470K0896j1642P674
14177F6145J6030L25j6489l003K2620J6215k4564J6390J3318K2084R690r064j8129
14164A11568k6098L1957j0928k0864j042m330M925L2151N277o618J4756q844l3253
14151H8657J8986J8504l67j5982K1609j2698j630M684J5054K0315K244o343L970
14138A57003N356r274j2470K2778J9846j2917K0936J8522k687l5708K2226L4281
14126B27892L886o809j1526l5251P796L8331p3j0098K3361L5937J1227L1796L5479
14113C51948J7870J1516L285l851K861O716K0172K9711M3369J6038K1626L1942
$$ y = [86235, 86087, 82634, 81618, 79269, 73394, 52875, 34759, 53998, 73240, 92635, 80485, 68751, 63840, 67531, 63199, 33629, 20399, 47465, 59192, 37883, 17747, 49217, 70113, 58471, 66145, 82175, 82500, 66011, 63008, 85628, 101843, 77279, 93669, 106987, 129071, 138761, 129697, 111568, 85470, 117427, 106499, 85635, 84593, 80263, 85188, 117339, 122616, 115998, 130754, 121910, 88657, 107643, 126147, 125780, 109798, 131407, 118709, 117079, 121763, 136817, 157132, 159376, 153033, 157003, 162359, 153085, 140615, 163393, 183239, 170322, 191258, 209780, 207093, 171385, 193611, 227892, 231778, 224969, 213443, 178192, 185988, 224319, 224246, 214148, 237509, 273446, 284673, 316469, 351948, 369818, 381334, 384619, 380768, 383629, 390345, 410517, 440228, 483597, 499635, 521261, 553203]
14101E53203L9832M5354Q303M7553k263L5068O5407O0949N5827N2908N5851P3140
14089A091132M4436O3152Q8798R7392P9770R6024J03608J48231J32433J42377
14079B087353J73890K39315J97802K35523K52043L09246K99174M02609M27048
14070D624003M39474N10115N63653O42077P67830Q26794R52226J053311J158128
14061A1537611J263524J393629J544781J690755J829967J952638K020945K102354
14053B5336204K103020K059920J970218J826804J610675J389453J184818R47057
14045C8428169P05914M94687K54943J25379K2310n8441j16224j53696j66306j09922
14035C9426813o4253k6813K0124P3805J46081K09542K45154K49708K77853K54760
$$ y = [553203, 593035, 638389, 646692, 694245, 691982, 727050, 792457, 853406, 909233, 962141, 1017992, 1091132, 1135568, 1198720, 1287518, 1384910, 1464680, 1560704, 1664312, 1812543, 1944976, 2087353, 2261243, 2500558, 2698360, 2933883, 3185926, 3495172, 3794346, 4196955, 4624003, 5063477, 5573592, 6137245, 6779322, 7547152, 8373946, 9326172, 10379483, 11537611, 12801135, 14194764, 15739545, 17430300, 19260267, 21212905, 23233850, 25336204, 27439224, 29499144, 31469362, 33296166, 34906841, 36296294, 37481112, 38428169, 39134083, 39628770, 39883713, 40009092, 40031402, 39972961, 39856737, 39703041, 39536735, 39426813, 39362560, 39335747, 39355871, 39429676, 39575757, 39785299, 40030453, 40280161, 40558014, 40812774]
14025D0812774J70682P1321n4967k52620m73509o88339r32141j200982j459014
14016C5993205j634125j852346k003922k077815k085074k066714k034691j954431
14008B0284087j806285j669676j570116j421008j310881j151236j075076r50744
14000I329065q21469p38528o86623o17222n68993n06696m42660l89517l41899
13991D215458l24782l18440k66547k26557j83075j71914j79324j73175j71034
13982B200610j14551r5856j08097j28614j25588j02372p8066q0766n2789o6423
13972A247488o7448p5140m5182k4964j8989n2670n1252n237k2983p4839m1711
13961G67073j041L811l1794l2106l0272k3271l6674l6124j3076q172j6200q155
$$ y = [40812774, 40983456, 41054777, 40999810, 40747190, 40273681, 39585342, 38653201, 37452219, 35993205, 34359080, 32506734, 30502812, 28424997, 26339923, 24273209, 22238518, 20284087, 18477802, 16808126, 15238010, 13817002, 12506121, 11354885, 10279809, 9329065, 8507596, 7769068, 7082445, 6465223, 5896230, 5389534, 4946874, 4557357, 4215458, 3890676, 3572236, 3305689, 3079132, 2896057, 2724143, 2544819, 2371644, 2200610, 2086059, 1990203, 1882106, 1753492, 1627904, 1525532, 1447466, 1366700, 1313911, 1247488, 1180040, 1104900, 1059718, 1034754, 1015765, 963095, 911843, 906606, 883623, 808784, 767073, 766032, 769843, 738049, 705943, 675671, 652400, 615726, 579602, 566526, 558354, 542154, 533999]
13949E33999j6209k4198J787j9256k4302l666q707l4295l3908k0416J1955N518
13937C68302O685p057j8146j2683k772J0817M086l3919j7764K1506q815l0461
13925B79779j3322r035N65j2840l2520J2634Q761j3574L6824q983m7882j6541
13913A83866Q936J5128q600j3937l079k0167j9360l951k3305n986L3479J3030
13901A56054N012L516l4013R967P089j4857L9087j8680l8614n801K7646J078J4118
13888A51602p035P423j2478O358J0498J3745O318j7310j6801l961N724N598j8451
13875A31230j2450j1578l679J0198L9269m615j8203j1621K0455J7141k6245j3391
13863A16511j5998P049j1198k8027K8414J1793K583J4814K063r903N241k4100
$$ y = [533999, 517790, 493592, 495379, 476123, 451821, 448155, 439448, 405153, 371245, 350829, 362784, 368302, 374987, 367930, 349784, 337101, 334329, 345146, 349232, 315313, 297549, 319055, 310240, 279779, 266457, 257422, 257987, 245147, 212627, 225261, 234022, 220448, 257272, 248289, 200407, 183866, 192802, 207930, 199330, 185393, 182314, 162147, 142787, 138836, 115531, 109545, 143024, 156054, 161066, 164582, 130569, 140536, 147625, 132768, 171855, 153175, 114561, 108760, 136406, 137484, 151602, 144567, 151990, 139512, 145870, 156368, 170113, 176431, 159121, 142320, 138359, 144083, 149681, 131230, 118780, 107202, 103523, 113721, 152990, 148375, 130172, 118551, 139006, 156147, 129902, 116511, 100513, 107562, 96364, 68337, 96751, 108544, 111127, 125941, 128004, 118101, 123342, 99242]
13851I9242P63J9616l1073n6692k6800k701J1369L2547L2521L3139J033m8402
13839F4562j9760K6133o960K0717L188k6741j3439M120J0781j3554o582O600J8762
13826F7827Q335J7962j2145l0319K6006J8451j6494j9873l999J0157m507j3526
13814D7875k5803K8242K0526r846j761l4123n38k684J6384J4580r563J1320m861
13801D9748R163k507j8025K211K835O858N391L3210O495k179m0783m0644M832
13788A6605N0858j3001k9629J6795J4892k4843M350J0667J566j901p088J065n536
13775C4800n888J6391K8291k848j6668j2819J0111l3291j6612O113R113M125j0733
13762A0085r194k5287R970L4802L2668J2725j8630l0976j2351o315J976R570Q61
$$ y = [99242, 100005, 119621, 88548, 31856, 5056, 2355, 13724, 46271, 78792, 111931, 112964, 64562, 44802, 70935, 63975, 84692, 87880, 61139, 47700, 51820, 62601, 49047, 42465, 49065, 67827, 76162, 94124, 81979, 51660, 77666, 96117, 79623, 59750, 55751, 65908, 61401, 47875, 22072, 50314, 70840, 60994, 59233, 25110, 24572, 21888, 38272, 52852, 43289, 54609, 49748, 58911, 56404, 38379, 40590, 43425, 50283, 55674, 88884, 95379, 93200, 52417, 11773, 16605, 67463, 54462, 24833, 41628, 56520, 31677, 36027, 46694, 48260, 46359, 39271, 40336, 34800, 28912, 45303, 73594, 70746, 54078, 41259, 51370, 18079, 1467, 7580, 16693, 20818, 10085, 891, -24396, -14426, 20376, 53044, 65769, 47139, 16163, 3812, -2503, -527, 9043, 9904]
13749I904J0400J6717k867m4720M647K2135K1147n050m758J3862K6572J373j27
13736F9235k7547k3117j2715P559Q390M672p552L872K5180N992k7499j3715J9624
13723C2379J1437l38k0393j9866o386K0466O438J1318J0125j4939k1607J5534
13711B4168R396m325p153j4190P088J5117J5854n729j7503j1089P872o670j7029
13698d193j3825n530K2864P589k5725J4861j5943p068J4169k45k959J5270J4043
13685A3308k5545m717M223L7510k94J6774q425O65j7929K357p759k5606K322K2686
13671I570R07j5405j1971J9958k8816Q68L1281L7425Q603l6798k3830K1627J6710
13658C0129k8991k7051m087J0007r339J0815J2532J0035J033O359K8277J8904
$$ y = [9904, 20304, 37021, 34154, -10566, -5919, 16216, 37363, 32313, 27555, 41417, 67989, 69362, 69235, 41688, 18571, 5856, 13415, 21805, 26477, 18925, 22797, 47977, 53969, 26470, 12755, 32379, 43816, 43478, 23085, 3219, -3167, 17299, 23737, 35055, 45180, 30241, 8634, 24168, 33564, 29239, 22086, 7896, 14984, 30101, 45955, 40226, 22723, 11634, 19506, 12836, -4193, -18018, -23548, -684, 6905, -18820, -3959, -19902, -26970, -12801, -13046, -16005, -735, 13308, -12237, -16954, -12731, 24779, 24485, 41259, 32834, 33499, 15570, 17927, 10168, -15438, -13116, 9570, 10477, -4928, -16899, 3059, -25757, -24889, 6392, 43817, 52420, 15622, -8208, 13419, 30129, 1138, -25913, -30000, -19993, -29332, -18517, -5985, 4050, 5083, 11442, 39719, 58623]
13646E8623r330m4337k274M788M751k0558K486M002J2939J8483j8669n1402k1090
13633f1588L6468N3453J1866J156K077j1960k0758k470q187K570J7597j128K974
13620B2070r269K1792n12k5146M142M981K229K2257K1605j1224Q295J7484K225
13607H0929J516m42K6528L6745M570j989j9346k785L394N5900J7313Q424L1007
13594B41764M417k321k9529m3122j1055J2163L4734J8849k8359p831K7140Q234
13582B25084Q196Q783J3559K118j5358q405K3372K9439k393j3865Q998L011q923
13569B73616J4781m4128k3821j4433j9926j043m325J8898j670q631P799J6293
13557B13410L203j2067j7973m1881k7108j5348j7259K3661j2546m5293l7681K0978
$$ y = [58623, 49293, 4956, 2682, 7470, 12221, -8337, -5851, -1849, 11090, 29573, 10904, -40498, -61588, -25120, 28333, 40199, 41355, 43432, 31472, 10714, 8244, 57, 2627, 20224, 19096, 22070, 12801, 34593, 34081, 8935, 13077, 18058, 20287, 42544, 64149, 52925, 61220, 78704, 80929, 82445, 82003, 108531, 145276, 149846, 147857, 128511, 125726, 129120, 185020, 202333, 210757, 241764, 246181, 243860, 214331, 171209, 160154, 172317, 207051, 225900, 197541, 189710, 216850, 225084, 233280, 242063, 255622, 257740, 242382, 233977, 257349, 286788, 284395, 270530, 279528, 282539, 273616, 288397, 244269, 220448, 206015, 186089, 185046, 180721, 199619, 197949, 189318, 197117, 213410, 216613, 204546, 186573, 144692, 117584, 102236, 84977, 108638, 96092, 50799, 13118, 34096]
13545C4096R254j0489k1089K7083J6772K4949m6257l0903J6368Q344j7833J9130
13533B9425N107k4516P556k7049N120L6949J0187k7966j4014L300k3723j9288
13521c8912M4731o860K074K0691m509J014n529O649J5828l222k7150j969K9787
13508C2623r772k667j1386M0406l437l5090k676L1216N072j7292J6861k6189N277
13495B2946N914R089K05j3915j5210q927k7956L268O076N401J7237K0131J0407
13482C4666m914l4100j9778P81J9477o476J6224K1166N445J4678k4696k6772J9331
13469A5032r05k702J278j9940r795J0570L318n385l238J6726Q743K996l043k3675
13455a0020k343K4938J6064p281m1392q261J3739J3930L2685j7236m9567M306
$$ y = [34096, 43350, 32861, 11772, 38855, 55627, 80576, 34319, 3416, 19784, 28128, 10295, 29425, 34532, 10016, 17572, -9477, -4357, 32592, 42779, 14813, 799, 4099, -19624, -38912, 5819, -1041, 1033, 21724, 17215, 18229, 12700, 19349, 35177, 31955, 4805, 2836, 32623, 22851, 20184, 8798, 49204, 45767, 10677, 8001, 39217, 44289, 26997, 43858, 17669, 22946, 28860, 37949, 38154, 24239, 9029, 102, -27854, -24586, -18510, -13109, 4128, 24259, 34666, 29752, -4348, -24126, -23345, -3868, -10344, 5880, 27046, 32491, 47169, 22473, -4299, 15032, 14127, 11425, 12703, -7237, -17032, -6462, -3144, -8529, -11767, 4959, 13702, 16698, 13655, -10020, -12363, 12575, 28639, 21358, -20034, -28295, -14556, -626, 32059, 14823, -34744, -30438]
13443c0438n716K4710L0138j3706k1718O912K7019K4762k1646l7106J1862O922
13431A995N455j3669L132j3284m295j7379l8718J1151M2803m937J7570N530k6555
13418c1201j1429j3751k25J9826K3541M607r9k195M474N897K7251O994j8841k5600
13404a0751j1021L123N992l2969k4182L7246J9149p127J5505j506m3114Q44J6617
13391c2194K6769J5000k3715l599r143k7121j7452p609L9854K7653j1499r283
13379c2339m219k5562K5190R526J7403K613m892R982k176K9653l509q000l176
13366A0494J4093J4587k6900k0257J9346Q634l2245k4342K9220p657n987k4710
13354d5724L5775K2219K872K254J394j9427m730R655j5392P4Q553J4159o352j5250
$$ y = [-30438, -36154, -11444, 18694, 4988, -16730, -9818, 17201, 41963, 20317, -16789, -4927, 1995, 7450, -6219, -3087, -16371, -20666, -38045, -76763, -65612, -22809, -27746, -10176, -4646, -31201, -42630, -56381, -56606, -36780, -13239, -8632, -8731, -10926, -6452, -555, 26696, 33690, 14849, -10751, -21772, -18649, -12657, -45626, -69808, -32562, -13413, -20540, -5035, -6541, -49655, -48811, -32194, -5425, 9575, -14140, -17739, -26882, -54003, -71455, -79064, -39210, -11557, -23056, -32339, -36558, -62120, -36930, -27404, -10001, -7388, -12280, -2298, -4474, 25179, 21670, 13670, 10494, 24587, 39174, 12274, -7983, 11363, 19997, -12248, -36590, -7370, -15027, -21014, -45724, -9949, 12270, 15142, 17396, 18790, -637, -5367, 4288, -11104, -11030, -2477, 11682, 5330, -9920]
13340i920o627R037J6338N279k600l4043j5162J1695L3068j1140l4883L0318K3281
13327A4641K1810j1152p884K6102m285k5488K550l226k6941k8304M522K2618K4266
13314I229K8192Q308J263r252k5854r783K0039R141j5734k7128j3381J8203J0366
13301C609o288M624m307j4644m057m814K9897O386j952j0234J5821J2025l4711
13288h645J3734J4799J8627j0267m677J07J8113o96k4410l032j0837j5945p986
13275b1115m853M482J3231J99K251K2891k0416k1567J4513L7665J095l943M258
13262B8691n6410N715J6914K2971J9498q574J69l2539p601J3485K1664j6011j0762
13249b790J5797j9090k3569J313j862J1364n19l0165J3550P422o818j3083J457
$$ y = [-9920, -16547, -7510, 8828, 14107, 11507, -22536, -37698, -26003, 7065, -4075, -38958, -8640, 14641, 36451, 25299, 17415, 43517, 39232, 13744, 16294, 13068, -13873, -42177, -37655, -15037, 9229, 37421, 45729, 46992, 37740, 11886, 2103, 22142, 31283, 15549, -11579, -24960, -6757, 3609, -2679, 1945, -2362, -17006, -21063, -25877, 4020, 10406, 8454, -1780, 14041, 26066, -8645, 5089, 19888, 38515, 28248, 23571, 23678, 41791, 41095, 16685, 13653, 2816, -13129, -21115, -25968, -21486, -8255, -8056, -5805, 17086, -3330, -24897, -10384, 27281, 28376, 24433, 28691, -27719, -22004, -5090, 17881, 37379, 28805, 28974, -3565, -11166, 2319, 23983, 7972, -2790, 13007, -6083, -29652, -28339, -30201, -18837, -19356, -49521, -35971, -28549, -35367, -48450, -46993]
13236d6993j3845k430J8450J0610J1766K995Q785j3940o744K2357K2870N081P511
13223B6473l2983k6605K0110K3593J0367k6130P908j3931j5750r720K5905O406
13211d357j0955n458m512K9895k518m2841j6399J7055L1023K2869Q93j4078p875
13198g258k0135P756K2290M8918J626k1997l7494k2498L1305K1826O06l6045r719
13185b0819M1498Q983k5226q724k555J5298O524k6421j8961l151N113L0866N875
13172H300l7597m1609M700K9013K5326O679O976J4612j81k4526m36O45K3253r875
13158E280m4285l988K5300J7318M378k1608J4678K763l552J0995j2249k4927J3563
13145a6334K6251P986m479K401l5727m986K0192O398m608N121Q624j941q746O699
$$ y = [-46993, -60838, -63268, -44818, -34208, -22442, -19447, -10662, -24602, -31346, -8989, 13881, 18962, 26473, -6510, -33115, -13005, 10588, 20955, -5175, 2733, -11198, -26948, -36668, -10763, -4357, -15312, -20770, -25282, 4613, 2095, -40746, -57145, -40090, -9067, 13802, 14695, 617, -7258, -27393, -19637, 2653, 51571, 53197, 31200, -6294, -28792, 2513, 24339, 24945, -11100, -20819, 20679, 29662, 4436, -4288, -6843, 8455, 14979, -11442, -30403, -33554, -28441, 2425, 8300, -29297, -70906, -66206, -37193, -11867, -5188, 1788, 16400, 16219, -8307, -8743, -8098, 15155, 5280, -39005, -42993, -17693, -375, 4003, -17605, -2927, -164, -3716, 7279, -4970, -29897, -16334, 9917, 17903, 13424, 15825, -19902, -24888, -4696, 1702, -2906, 2215, 10839, 8898, 152, 6851]
13131F851O914p069j4521j9789k4271J8953K8840Q339j0791k8188N477L2179K6166
13118B9090k1385n390r526k236J9711N549j3428l0096k1281N711M2587J7812P995
13105B5113o124q579n33j987J3238j6726j2137K2142L773j1287m011j4920J6000
13092C962J5817j5515j1999j5579j0562j5895j7518J0935L5577J1262J1666r960
13080g809k2067N995J7585p036L15k435L234j632M359L744j5239p432J6319L3016
13066B0917K988j7430j4180J1047L32J209j3070j6596k6024p352K3096J2400L3252
13053A0589k1581l0992J1082L0818J6761L494n943M675k3934j7835L2283j0250
13041h33M508R155j3781o881q105r520l768L569j8459J2532k653j9154l973K611
$$ y = [6851, 13765, 6696, -7825, -27614, -51885, -32932, -4092, 4247, -6544, -34732, -29255, 2924, 29090, 7705, 2315, -7211, -9447, 10264, 15813, 2385, -27711, -48992, -43281, -694, 17118, 25113, 18989, 10410, 9877, 7890, 21128, 4402, -7735, 14407, 18180, 6893, 2882, -12038, 3962, 19779, 4264, -7735, -23314, -33876, -49771, -67289, -56354, -20777, -9515, 2151, -7809, -29876, -23881, -6296, -13332, -13017, -15452, -12218, -13850, -9491, -5747, -20986, -28418, -12099, 20917, 23905, 6475, -7705, 3342, 3674, 4883, -8187, -24783, -50807, -58159, -35063, -22663, 10589, -10992, -41984, -30902, -84, 16677, 20171, 14228, 18903, -5031, -22866, 9417, -833, 3675, 12830, -951, -7832, -15937, -25457, -29225, -25656, -44115, -31583, -34236, -53390, -57363, -54752]
13027e4752j511K8222R505K252p605L055J8037N571k4654r438K2859p596Q65J5699
13013E09J2417P730n636k3232l239J5456R437P696r775J2324l397j8520n388P73
12999b845J6286J1063O970m921N208l3569l8605k5725j2286L4269L2487K2956
12987A1288K1949J3422l983L198j1011l3026j0740k1908R211J7028p235j5911
12975b7718J2136K8065J3499J183n969k1646j7619k5699J3149L4574K5994l387
12963B6562j0424j4068o41q30k839n672r92j1281k4147L567p417L04M4761R886
12949F769K8846J550j7417k1720l2962o044J9847J0940k2783j2668k959K2322
12937b6279r676K0789P729J1181K2337L0454k1933j7831j7302k5272J2507l831
$$ y = [-54752, -56263, -28041, -18536, -16284, -23889, -20834, -2797, 2774, -21880, -31318, -8459, -16055, -15190, 509, 12926, 20656, 15020, -8212, -11451, 4005, 13442, 21138, 11363, 23687, 20290, 1770, -3618, -2845, 13441, 24504, 31474, 26553, 31761, -1808, -40413, -66138, -78424, -44155, -11668, 11288, 33237, 46659, 42676, 45874, 34863, 1837, -8903, -30811, -21600, -4572, -11807, -27718, -15582, 12483, 25982, 27165, 21196, -450, -18069, -43768, -30619, 3955, 29949, 26562, 16138, 2070, 1429, 599, -2240, -7912, -8904, -20185, -44332, -40765, -48182, -47878, -3117, 6769, 35615, 37165, 19748, -1972, -34934, -40978, -21131, -10191, -32974, -45642, -48601, -26279, -35955, -15166, -7437, 3744, 26081, 56535, 34602, 16771, -531, -25803, -13296, -17127]
12925a7127j6485P311K3222J7585M521P070j0353m039p461l8298k0351j5351M199
12912f5557j7495Q081M3058J6335k1215N677J2336L754j2910j9531O27L7093l507
12899a3254K748p905l380J670j4076K690j2188j9708J9771L2035r48k284p430
12886b2259r765k8490l574M7227K0800n579l7565k0686n894o66J8192P429J4618
12873b6212p684l1162j5668J8908M593J690J2194j4980r875P097J2640J9993L7801
12860I335o070r147j13j3449j5199j2241L582R436Q672l544j8772J7343J9469
12847a0698m0560K544J0817l7669L532L1391J5107K1711J4642P989K9K705l633
12834A7907P892j5010k9141N495P236L0268r440j0323K8439j4123l886k7N051
$$ y = [-17127, -33612, -26301, -3079, 14506, 19027, 26097, 15744, 11705, 4244, -34054, -54405, -69756, -65557, -83052, -74971, -31913, -15578, -36793, -31116, -18780, -15026, -27936, -47467, -46840, -9747, -13254, -10506, -18411, -21791, -20121, -34197, -31507, -43695, -63403, -43632, -11597, -12545, -14829, -22259, -32024, -60514, -64088, -16861, 3939, -1640, -39205, -59891, -65785, -66451, -48259, -40830, -26212, -33896, -65058, -80726, -61818, -57225, -55535, -43341, -58321, -68196, -61099, -48459, -28466, 9335, 3265, -5882, -5995, -19444, -34643, -46884, -43302, -33866, -25194, -28738, -47510, -30167, -10698, -51258, -48714, -37897, -75566, -72034, -40643, -25536, -3825, 10817, 18806, 18835, 21540, 17907, 25799, 10789, -18352, -12857, -5621, 24647, 15207, 4884, 33323, 19200, 15314, 15287, 20338]
12821B0338J9307n608m4780j8678J2486K3250L7167K1q847J6538j8348l0892J5842
12808A7796J5738q194l4012r317J7432J945p248K27j2833j7428K3867K1218L3135
12795D2326O827K6363K9225J9591M5839P8288J08495J38298J66503K00928Q3481
12784I46164n9944j70054j64828j57979r7443o4693n3599n2548m0594n2380p998
12773B4104q022o500q639K2531J5862l3531j5646K5841O308p633J2397J1220r065
12760B9227K022J0975j6243L147J0195O744j2654j5603R136k6739j2002l6407
12748d8202n160J4569j7320j487O842J2139J7427P832J1166q727k3206L584J6044
12735a4499J0476o069j662k872k3318J6860J6599m915j4641l801j0883p593K7901
$$ y = [20338, 39645, 34037, -10743, -29421, -16935, 6315, 43482, 43503, 34656, 51194, 32846, 1954, 17796, 33534, 25340, -8672, -17989, -557, 1388, -5860, -5633, -18466, -35894, -12027, 9191, 42326, 49153, 75516, 104741, 124332, 170171, 248459, 356954, 495252, 661755, 862683, 946164, 886220, 716166, 551338, 393359, 295916, 231223, 177624, 125076, 84482, 32102, 24104, 16082, 9582, 943, 23474, 39336, 5805, -9841, 16000, 22308, 14675, 27072, 38292, 29227, 31249, 42224, 25981, 29128, 39323, 46067, 33413, 17810, 26946, 207, -11795, -48202, -53362, -38793, -56113, -57600, -50758, -38619, -21192, -13360, -2194, -10921, -34127, -30543, -14499, -4023, -10092, -11754, -14626, -37944, -21084, -4485, -9400, -24041, -27842, -38725, -46318, -18417]
12722a8417M8708J3811p391j1349L96N423l7575o458m479K8989J9216P656k1238
12709A7292j5735j9520K8818j6380j5695J0836j4668p371J4840J539K848M0m19
12696a3575L2928K6562m2713j9758L275L4663K9831k579k8721k335J0697m7225
12684a8950p917L057L1539K6106j1167j275r484J6496J8308k2444L495n084k7510
12671d830m9092j5333K0369M6179n626j0009l7073J0039K3945L7309K8546o206
12659C8218l2365L837j6200J3628J9131L25J854j6313m2266j5904J4392J3375
12647a8288R093j6529p875J2642j9441k3746l538K9792L2088J0074O49o218N347
12634D050j4030l571J8031r369l0977l937K3898o416L524J9844L3614k6859k2351
$$ y = [-18417, 30291, 44102, 36711, 25362, 25758, 31181, -6394, -12852, -17331, 11658, 30874, 38530, 17292, 1557, -17963, 10855, -5525, -21220, -10384, -25052, -32423, -17583, -16044, -13196, -13156, -13575, 19353, 45915, 3202, -16556, -13281, 21382, 51213, 48634, 19913, 17578, 28275, -18950, -26867, -23810, 7729, 33835, 22668, 21393, 11909, 28405, 46713, 24269, 27764, 22680, -4830, -53922, -69255, -48886, -2707, -8333, -18342, -55415, -45376, -21431, 15878, 44424, 38218, 5853, 9690, -6510, 7118, 26249, 26574, 28428, 12115, -30151, -46055, -31663, -18288, -9195, -25724, -33599, -20957, -40398, -64144, -67682, -37890, -5802, 4272, 4921, -1297, 4050, -9980, -13551, 4480, -4889, -35866, -39803, -15905, -22321, -18797, 1047, 34661, 7802, -14549]
12621a4549q107L661L213K2271L784k4729K0174J50k7840j927K8885J933q986
12608b067J2329o68k9416k6117o518L6185L2521J4359K7753j1358o308j4575o436
12595A9684K567l6384l7145m460P993k005L4766N693l3376q369P300K3067L1472
12582A0803m428O025K960j3282l8540k0366N408r856Q345j7018J6674L4245J6268
12569b762j4109j675j0600j6605j5737J991J4866K5225J2647K5506P560j1379
12557A4928j0063j3357j6736j2602R566K4957J8097J3707J4195J5886q189k2034
12545B8355k5852r340l864o592j6727q486n758m489J3313j1872K1314m237p814
12532d2049k6073j4191K3899M5355K9036r690O74J0468j0391j7324l5024M866
$$ y = [-14549, -22656, -18995, -15782, 6489, 10273, -14456, 5718, 5868, -21972, -23899, 4986, 6919, -2067, 10262, 9594, -19822, -45939, -52457, -16272, 16249, 30608, 58361, 47003, 40695, 26120, 19684, 22251, -14133, -51278, -55738, -47745, -49750, -14984, -9291, -42667, -51036, -43736, -20669, 10803, 6375, 12400, 15360, 2078, -36462, -56828, -51420, -61276, -52931, -69949, -53275, -19030, -2762, -16871, -18546, -29146, -45751, -61488, -59497, -44631, -19406, -6759, 18747, 26307, 14928, 4865, -8492, -25228, -37830, -28264, -3307, 14790, 28497, 42692, 58578, 50389, 28355, 2503, -6837, -10701, -17293, -34020, -42506, -48264, -52753, -39440, -51312, -29998, -34235, -42049, -68122, -82313, -58414, -13059, 15977, 6287, 6961, 17429, 7038, -10286, -45310, -40444]
12520d0444p285j7829J6366P388K871j6700j084P4188L1520Q955o373l8360M945
12507A8158p951k9786k6977j0997L0575K144K7099J7753j9194k4928m726m942
12495c3772R152j116J7635R620K325R297J195k0421j5725J150Q935J3252k0981
12482a9454l6847J0942J3021j395J7766L8504j8484l6122k816j154K3258K9996
12470A7215L2487M479k0549j7554p58J8836k8825N79p010k0858q446L532L6837
12457I965K9665j6815P748J3541J302l3509l1498N926K3013n039p450k986j9336
12444b5473j0876R952J5192o558j0236K7190J4576j3812K4438m640k6943l6290
12432d3480m1852J129L9355Q692j3408L1503L5931L399k4971N77j9264k1781N070
$$ y = [-40444, -47729, -65558, -49192, -41804, -38933, -55633, -56717, 17471, 48991, 57946, 51573, 13213, 18158, 10207, -19579, -46556, -57553, -26978, -24834, 2265, 20018, 824, -24104, -28830, -33772, -24620, -25736, -8101, 1519, 3844, 13141, 14336, -6085, -21810, -20660, -11725, 1527, -19454, -56301, -45359, -32338, -33733, -15967, 22537, 4053, -32069, -34885, -36039, -12781, 17215, 49702, 54181, 33632, 16078, 15320, 34156, 5331, 5910, -1100, -21958, -30404, -26872, 9965, 39630, 22815, 30563, 44104, 45406, 11897, -19601, -13675, 9338, 4299, -3151, -6137, -25473, -36349, -26397, -11205, -17763, -27999, -809, 13767, -45, 24393, 19753, -7190, -43480, -85332, -84203, -44848, -36156, -49564, -18061, 17870, 21269, -3702, -3125, -22389, -44170, -39100]
12419c9100J5523K468R404L0922j401J15r132k6255j0746l977p705k91Q501J9938
12405a1736M1580o40j1913j5916J2466M62l653j1172k3891r913L6951K5127j7469
12392A0283J7440K0422k697j0745L6263J2908k5941J9426j3571j6210j6386q908
12380B2284K0090k7574k8641Q913p487L3297K2519K1098j4798K986J6634R885
12368G9206k1003k6561J751j90J3788Q386j0937J4147J3259R951Q533m690j0641
12355G4999k3250j5828k5420M958K4364N973j8126O397j0198k0051m568P568L2667
12342C9485J178J174k1601o381J0028r746j1239k935K8136K9004J8205j764j4621
12329E8923k3602l2960n077M299O241K628l6685q426j4132J1025M6676J9670k4441
$$ y = [-39100, -23577, -21109, -11705, 19217, 17816, 17931, 8799, -17456, -28202, -32179, -39884, -40175, -31674, -11736, 29844, 29204, 17291, 1375, 13841, 14303, 10650, -522, -24413, -34326, 2625, 27752, 10283, 27723, 48145, 45448, 34703, 70966, 83874, 57933, 77359, 63788, 47578, 31192, 22284, 42374, 14800, -13841, -4928, -12415, 20882, 43401, 64499, 49701, 52687, 69321, 79206, 58203, 31642, 33393, 33203, 46991, 55377, 44440, 58587, 71846, 81797, 90330, 85640, 74999, 51749, 35921, 10501, 15459, 39823, 45796, 27670, 34067, 23869, 3818, -750, 6818, 39485, 40663, 41837, 20236, 13855, 23883, 14137, 2898, -37, 28099, 57103, 75308, 73544, 58923, 35321, 2361, -2716, 1583, 7824, 10452, -26233, -34659, -48791, -37766, 8910, 28580, 4139]
12316D139j8990J0486J6079M893j837k3934j1036j7239k8691K6058K5108N080
12304i884l839j705o420q280j8406j1693O844N5175K4787k706O801k7948q217
12291e491K9232O376l7732n952l85j3429j9199k6472K034J0206k4822P166L4087
12278d4381M8301k774j9740k1961l647J7729K8989K489O657J5258L290k0299j1254
$$ y = [4139, -14851, -4365, 11714, 16607, 14770, -9164, -20200, -37439, -66130, -40072, -14964, -9884, -13723, -15428, -21848, -30128, -48534, -60227, -53383, 1792, 26579, 23873, 30674, 2726, -5491, 23741, 30117, -7615, -13567, -13952, -27381, -46580, -73052, -71018, -60812, -85634, -78468, -44381, 3920, 1146, -18594, -40555, -44202, -26473, 2516, 5005, 11662, 26920, 30210, 9911, -1343]
$$ [...]
##END NTUPLES=NMR SPECTRUM
##END=
