##TITLE=Analysis number 321357
Compound Code mo 00015
Project Code adrs
Chemist Name durham
##JCAMPDX= 6.0         $$ Bruker NMR JCAMP-DX V2.0
##DATA TYPE= NMR SPECTRUM
##DATA CLASS= NTUPLES
##ORIGIN= Bruker BioSpin GmbH
##OWNER= nmr
$$ XWIN-NMR		Version 3.5
$$ Mon Aug  7 12:19:20 2006 GMT Daylight Time (UT+1h)  MAYBRIDGE\nmr@NMR_250MHZ
##.OBSERVE FREQUENCY= 250.131544655141
##.OBSERVE NUCLEUS= ^1H
##.ACQUISITION MODE= SIMULTANEOUS (DQD)
##.ACQUISITION SCHEME= undefined
##.AVERAGES= 16
##.DIGITISER RES= 18
##SPECTROMETER/DATA SYSTEM= dpx250
##.PULSE SEQUENCE= zg30
##.SOLVENT NAME= DMSO
##.SHIFT REFERENCE= (INTERNAL, DMSO, 0, 16.522)
##AUDIT TRAIL= $$ (NUMBER, WHEN, WHO, WHERE, WHAT)
$$ ##TITLE= Audit trail, XWIN-NMR		Version 3.5
$$ ##JCAMPDX= 5.01
$$ ##ORIGIN= Bruker BioSpin GmbH
$$ ##OWNER= nmr
$$ C:\u/data/dgb/nmr/ADRS/340/pdata/1/auditp.txt
$$ ##AUDIT TRAIL=  $$ (NUMBER, WHEN, WHO, WHERE, WHAT)
(   1,<2006-08-07 12:18:51.29 +100>,<MAYBRIDGE\nmr>,<NMR_250MHZ>,
      <created by zg, POWCHK disabled, PULCHK disabled
       configuration hash MD5:
       E2 DF 36 D8 04 B2 41 60 5A D7 A3 38 5A 4B D0 FE
       data hash MD5: 64K
       1A 9B CF AA A7 59 6D AC 06 7B F0 2E 7B 78 13 D0>)
(   2,<2006-08-07 12:19:06.09 +100>,<MAYBRIDGE\nmr>,<NMR_250MHZ>,
      <Start of raw data processing
       ef LB = 0.3 FT_mod = 6 PKNL = 1 SI = 32K 
       data hash MD5: 32K
       DE F3 3D 87 59 B9 46 25 5A AB 56 96 CE 86 3E 8F>)
(   3,<2006-08-07 12:19:07.92 +100>,<MAYBRIDGE\nmr>,<NMR_250MHZ>,
      <apk 
       data hash MD5: 32K
       D8 E6 28 FB B4 06 B5 E7 A1 DC 10 F9 1C 51 E4 1C>)
(   4,<2006-08-07 12:19:08.79 +100>,<MAYBRIDGE\nmr>,<NMR_250MHZ>,
      <abs ABSG = 5 
       data hash MD5: 32K
       E5 FD 89 29 D4 5C AB 4D BD AA C3 D8 EC A9 42 FD>)
$$ ##END=
$$ 
$$ hash MD5
$$ 96 85 8D 3F B3 FE 0B 70 1E 0A C5 2A CB 1B 4A E3
##$RELAX= 
##$RELAX= 
##$RELAX= 
##$RELAX= 
##$RELAX= 
##$RELAX= 
##$RELAX= 
$$ Bruker specific parameters
$$ --------------------------
##$DU= <C:\u>
##$EXPNO= 340
##$NAME= <ADRS>
##$PROCNO= 1
##$TYPE= <nmr>
##$USER= <dgb>
##$AMP= (0..31)
100 100 100 100 100 100 100 100 100 100 100 100 100 100 100 100 100 100 
100 100 100 100 100 100 100 100 100 100 100 100 100 100 
##$AQSEQ= 0
##$AQ_mod= 3
##$AUNM= <au_zg>
##$AUTOPOS= <22 >
##$BF1= 250.13
##$BF2= 250.13
##$BF3= 250.13
##$BF4= 250.13
##$BF5= 500.13
##$BF6= 500.13
##$BF7= 500.13
##$BF8= 500.13
##$BYTORDA= 1
##$CFDGTYP= 0
##$CFRGTYP= 5
##$CHEMSTR= <none>
##$CNST= (0..31)
1 1 145 1 1 1 1 1 1 1 1 1 1 1 1 1 1 1 1 1 1 1 1 1 1 1 1 1 1 1 1 1 
##$CPDPRG= <>
##$CPDPRG1= <>
##$CPDPRG2= <>
##$CPDPRG3= <>
##$CPDPRG4= <mlev>
##$CPDPRG5= <mlev>
##$CPDPRG6= <mlev>
##$CPDPRG7= <mlev>
##$CPDPRG8= <mlev>
##$CPDPRGB= <>
##$CPDPRGT= <>
##$D= (0..31)
0 1 0 0 0 0 0 0 0 0.06 0 0 0 0 0 0 0.0002 0 0 0 0 0 0 0 0 0 0 0 0 0 0 
0 
##$DATE= 1154949530
##$DBL= (0..7)
120 120 120 120 120 120 120 120 
##$DBP= (0..7)
150 150 150 150 150 150 150 150 
##$DBP07= 0
##$DBPNAM0= <>
##$DBPNAM1= <>
##$DBPNAM2= <>
##$DBPNAM3= <>
$$ [...]
##$SUBNAM7= <"">
##$SUBNAM8= <"">
##$SUBNAM9= <"">
##$SW= 20.6930455092707
##$SWIBOX= (0..15)
0 0 3 0 0 0 0 0 0 0 0 0 0 0 0 0 
##$SW_h= 5175.983436853
##$TD= 65536
##$TD0= 1
##$TE= 295.16
##$TE2= 300
##$TE3= 300
##$TEG= 300
##$TL= (0..7)
0 120 120 120 120 120 120 120 
##$TP= (0..7)
150 150 150 150 150 150 150 150 
##$TP07= 0
##$TPNAME0= <>
##$TPNAME1= <>
##$TPNAME2= <>
##$TPNAME3= <>
##$TPNAME4= <>
##$TPNAME5= <>
##$TPNAME6= <>
##$TPNAME7= <>
##$TPOAL= (0..7)
0.5 0.5 0.5 0.5 0.5 0.5 0.5 0.5 
##$TPOFFS= (0..7)
0 0 0 0 0 0 0 0 
##$TUNHIN= 0
##$TUNHOUT= 0
##$TUNXOUT= 0
##$USERA1= <user>
##$USERA2= <user>
##$USERA3= <user>
##$USERA4= <user>
##$USERA5= <user>
##$V9= 5
##$VALIST= <valist>
##$VCLIST= <CCCCCCCCCCCCCCC>
##$VD= 0
##$VDLIST= <DDDDDDDDDDDDDDD>
##$VPLIST= <PPPPPPPPPPPPPPP>
##$VTLIST= <TTTTTTTTTTTTTTT>
##$WBST= 1024
##$WBSW= 4
##$XGAIN= (0..3)
0 0 0 0 
##$XL= 0
##$YL= 0
##$YMAX_a= 294230
##$YMIN_a= -317264
##$ZGOPTNS= <>
##$ZL1= 120
##$ZL2= 120
##$ZL3= 120
##$ZL4= 120
##$ABSF1= 16.522
##$ABSF2= -4.171173
##$ABSG= 5
##$ABSL= 3
##$ALPHA= 0
##$AQORDER= 0
##$ASSFAC= 0
##$ASSFACI= 0
##$ASSFACX= 0
##$ASSWID= 0
##$AUNMP= <proc_1d>
##$AZFE= 0.1
##$AZFW= 0.1
##$BCFW= 0
##$BC_mod= 0
##$BYTORDP= 0
##$COROFFS= 0
##$CY= 12.5
##$DATMOD= 1
##$DC= 0
##$DFILT= <>
##$DTYPP= 0
##$F1P= 14.0000005364418
##$F2P= -0.99999901652339
##$FCOR= 0.5
##$FTSIZE= 32768
##$FT_mod= 6
##$GAMMA= 0
##$GB= 0
##$INTBC= 1
##$INTSCL= 1
##$ISEN= 128
##$LB= 0.3
##$LEV0= 0
##$LPBIN= 0
##$MAXI= 10000
##$MC2= 0
##$MEAN= 0
##$ME_mod= 0
##$MI= 0
##$NCOEF= 0
##$NC_proc= -4
##$NLEV= 6
##$NOISF1= 0
##$NOISF2= 0
##$NSP= 0
##$NTH_PI= 0
##$NZP= 0
##$OFFSET= 16.522
##$PC= 1
##$PHC0= 145.9678
##$PHC1= 4.955358
##$PH_mod= 1
##$PKNL= yes
##$PPARMOD= 0
##$PSCAL= 4
##$PSIGN= 0
##$REVERSE= no
##$SF= 250.13
##$SI= 32768
##$SIGF1= 0
##$SIGF2= 0
##$SINO= 400
##$SIOLD= 32768
##$SREGLST= <1H.DMSO>
##$SSB= 0
##$STSI= 32768
##$STSR= 0
##$SW_p= 5175.98343685301
##$SYMM= 0
##$S_DEV= 0
##$TDeff= 65536
##$TDoff= 0
##$TI= <Analysis number 999999
Compound Code 99
Book Reference 9
Project Code 9>
##$TILT= no
##$TM1= 0
##$TM2= 0
##$TOPLEV= 0
##$USERP1= <user>
##$USERP2= <user>
##$USERP3= <user>
##$USERP4= <user>
##$USERP5= <user>
##$WDW= 1
##$XDIM= 32768
##$YMAX_p= 511957727
##$YMIN_p= -464285
$$ End of Bruker specific parameters
$$ ---------------------------------
##NTUPLES= NMR SPECTRUM
##VAR_NAME=  FREQUENCY,     SPECTRUM/REAL,   SPECTRUM/IMAG
##SYMBOL=    X,             R,               I
##VAR_TYPE=  INDEPENDENT,   DEPENDENT,       DEPENDENT
##VAR_FORM=  AFFN,          ASDF,            ASDF
##VAR_DIM=   32768,         32768,           32768
##UNITS=     HZ,            ARBITRARY UNITS, ARBITRARY UNITS
##FACTOR=    0.157963299565203, 1,           1
##FIRST=     4132.6476996994, 0,             0
##LAST=      -1043.33573715361, 0,           0
##MIN=       -1043.33573715361, -464285,     0
##MAX=       4132.6476996994, 511957727,     0
$$ Real data points
##PAGE= N=1
##DATA TABLE= (X++(R..R)), XYDATA
$$ [...]
15915A98933R1724o2599m6124O4642P281j04271n6489j00443l2118o6628k4982
15904a31074J8970r144o3983n9499L6108J36829Q7675k1298j8119K5577J03513
15893A05555N5682l0543k6760q3594R638R365n7828J3509P0053m4572J7441n2208
15881a4262k8687r48J33355N7150q5992l3925j31172m0642M9270l2387K419J18501
15869g320K2305j05141l4526J54253K6134j37699j00682j3559J10916R9124o2193
15858d8388j54890K6396n2302J02078O0532j2870K207m576K1654M7292o4391M7452
15846b9806M0530p5534p0052J2762M9130j617Q7671m8096J2474l2122o9198j03549
15834b27407q6048L7432J37481J34728M5876j4123q4993j6741O9631L7635K1492
$$ y = [198933, 290657, 228058, 181934, 246576, 253857, 149586, 93097, -7346, -39464, -106092, -131074, -112104, -121248, -185231, -244730, -208622, -71793, 15882, -5416, -23535, 2042, 105555, 161237, 130694, 103934, 20340, 29978, 39343, -18485, -4976, 65077, 20505, 37946, -14262, -42949, -43897, 89458, 146608, 60616, 26691, -104481, -145123, -95853, -128240, -125821, -7320, 14985, -90156, -124682, 29571, 55705, -81994, -182676, -196235, -85319, 13805, -48388, -203278, -176882, -229184, -127106, -66574, -79444, -77237, -81813, -60159, -12867, -77258, -29806, 10724, -64810, -134862, -122100, -72970, -74587, 13084, -35012, -22538, -54660, -123858, -227407, -313455, -276023, -138542, -3814, 42062, 27939, -57054, -73795, -4164, 33471, 54963]
15823E4963j14877j19762o33P6983n834K3243p1614J4146J26811O0348m9263N1178
15811D5689N52o6033q6259J1359M9751j997l8862j41726l7404J10237Q9079N8256
15799g358j27016N5983J30737m3024j07049j5596N1189Q4568M8773j00341R6803
15788F7669J66683n0445j30494j29747N6824o1894L805P1442M1679j7049N8523
15777G6996n3943j52174J6666j0181M1814O9484N3298p6110j24954J47160k1580
15766c3524o5068J1070j7874j01492J33813N1080j3060p271l270P2721j24282
15755i7157j31731J10062O8468j0311n227l18J75738J26990k9610k3937j25274
15744E7693j00878j8377j13658n4823R3339O1035J2946L7467P6720j03487p4168
$$ y = [54963, -59914, -179676, -180309, -103326, -109160, -85917, -157531, -143385, -16574, 43774, -5489, 45689, 46241, -19792, -106051, -94692, -44941, -46938, -85800, -227526, -264930, -154693, -65614, -7358, -134374, -78391, 52346, 9322, -97727, -113323, -62134, 22434, 71207, -29134, 67669, 234352, 183907, 53413, -76334, -19510, -81404, -77599, -6157, 35522, 18473, 76996, 23053, -129121, -112455, -122636, -80822, -11338, 41960, -34150, -159104, -11944, -33524, -98592, -87522, -105396, -206888, -73075, -21995, -35055, -42326, -45596, 27125, -97157, -228888, -118826, -50358, -60669, -65896, -66214, 109524, 236514, 206904, 182967, 57693, -43185, -61562, -175220, -230043, -136704, -75669, -62723, -25256, 51464, -52023, -126191]
15733a26191K803Q8006J39842n0371j8337N2978J8760P7969m8852r7149r3941
15722e4483l415O1604L9614J1742J2381m0862j4490M0053J9209o3180l9361K0467
15710a0721K3269Q184P5162R3178p7760n5997j50773J5758R9283j5487m4789P0321
15698B9628J6231l7607P0264K297o4296n1266l0518K6224P0019m6751K339o1875
15686g5311n7576L5777J41323P4973r7026j58188k9183J48301N3241L1674J8194
15675H6199j23535K78k3059N2897N5024j1757K7342r1573j5345Q0062K8291k8732
15663C6092K220N0654j898q4788k7886M3011Q198P9918k9470j5112j3560l1970
15651A5409r1045J8363K3572j9204j4424m0517k163K3652j7657P0255N4797P3053
$$ y = [-126191, -123388, -35382, 104460, 54089, 35752, 88730, 107490, 185459, 136607, 39458, -54483, -57898, 3706, 43320, 55062, 67443, 26581, 12091, 52144, 71353, 8173, -31188, -10721, 12548, 20732, 95894, 189072, 111312, 55315, -95458, -79700, 19583, 4096, -40693, 29628, 45859, 8252, 78516, 80813, 16517, -34749, -65267, -39043, 30976, -15775, -13436, -75311, -132887, -97110, 44213, 119186, 22160, -136028, -165211, -16910, 36331, 68005, 86199, -37336, -37058, -60117, -7220, 47804, 36047, 63389, -28184, -43529, 36533, 64824, 36092, 38312, 88966, 87068, 2280, -25606, 17405, 25603, 105521, 76051, 60939, 47379, 15409, -75636, -57273, -33701, -52905, -67329, -107846, -110009, -86357, -104014, -33759, 21038, 94091]
15639I4091K156o4745l1491L7895o290m4874j01621j12005K9593J03773R4123
15628F05Q6140O74J8643j2093q4441o0411K0417m116m0054j3490R8251l6406M3278
15615A6997M9672k1858N6581l3775q2691j7129P2804r720N4707k2492R5578r327
15603A49347m0029o9101L3466K8380o0903k9985j6490o240k9278m0704m1364R1077
15591c1824J21222N6900N094o5646o7590m6229j21537J3758M8126J21295R3357
15580A26926N6521m2789j03131j7020M0823M3591r0847j42979q7021J20098J21992
15569B6164o3289j07683L4195J5391J86825J5515R217J8044q2256J7932p3095
15558c040j61908M3412J21420m5647L8316L0131n0346n8910l8793l791r6324j1249
$$ y = [94091, 96247, 31502, 11, 37906, 31616, -13258, -114879, -226884, -197291, -93518, 605, 86745, 87419, 106062, 93969, 9528, -50883, -30466, -34582, -74636, -88126, 10125, -26281, 16997, 66669, 44811, 101392, 67617, -15074, -32203, 40601, 30881, 85588, 63096, 158674, 149347, 109318, 40217, 73683, 102063, 41160, 11175, -5315, -11555, -40833, -81537, -122901, -31824, 89398, 146298, 151392, 85746, 18156, -28073, -149610, -135852, -87726, 33569, 126926, 183447, 140658, 37527, 20507, 61330, 104921, 14074, -128905, -215926, -95828, 26164, -37125, -144808, -110613, -95222, 91603, 107118, 116335, 134379, 52123, 70055, -3040, -164948, -121536, -116, -45763, -7447, 22684, -27662, -86572, -125365, -129156, -225480, -236729]
15546b36729R2120j4435p614J6918n0945M0809J51613J25317j2120m0736j07137
15535d2939k0107j0501K0295m0400J69404J19152L4438q5801k38133j49382m494
15524b48468R2153M7590l5572J8083Q923L0907M5754K2782L9506J6511K7150M8729
15512A14048q0595j3767l8779O2822j10622o2817J4352L776J02451J15480n7826
15501D8523o6249N7060K57993j1866l2938j05232o1434N193r8363m7119K6922
15490b7510K6313j38270j09342N2172J14898J36145R064r1723j9875j05385M6203
15479a07310O9132N7708P4836J06626n1310o0908l6550m2719K10187K0669o3224
15468A77137n8417p7973n7088M175K6096r8911n8587Q5659N5628m6608N872K9536
$$ y = [-236729, -144609, -159044, -166658, -149740, -200685, -159876, -8263, 117054, 104934, 64198, -42939, -63046, -73547, -53252, -93652, 75752, 194904, 229342, 143541, -94592, -243974, -248468, -156315, -108725, -144297, -126214, -117291, -86384, -40630, -17848, 21658, 38169, 65319, 114048, 33453, 19686, -19093, 43729, -66893, -129710, -115358, -111582, -9131, 106349, 48523, -17726, 39334, 297327, 285461, 252523, 147291, 85857, 91050, -7313, -54432, -27510, -1197, -139467, -248809, -196637, -81739, 54406, 63470, -28253, -48128, -153513, -107310, -38178, 19530, 94366, 200992, 149682, 88774, 52224, 9505, 219692, 240361, 177137, 118720, 40747, -16341, -12166, 13930, -84981, -143568, -57909, -2281, -48889, -43017, -13481]
15456a3481K7918o6571m6814N5491r9748j1377Q8233J10533l3328q4792o298o921
15444h7155K7332k9085J09780j0569J1083p3872n4812M0852J21712o2626O0263
15433E2903K0155j80487N3134J26691L9081l5592J4105J34574o5333j20438m4983
15422f190R1348o534J142k5785o9342k0127l7187r995l3471M9185O955J24736
15410F4735m4153R123K7019K3240j17022l6289M7941L9004M4990L5891k8803P5448
15398A41124p4557j75954m7984n1358m9794P0321J52351M4273j6415p2170p972
15387h8135j00087j9605J00443K3151k4918q5244j799P2447L396J46659o866n297
15375A4145n9892o5630J6302L586Q6852J36718L3866l3357p0434m2506p8566J38733
$$ y = [-13481, 14437, -52134, -98948, -43457, -143205, -154582, -66349, 44184, 10856, -73936, -80234, -87155, -59823, -88908, 20872, 10303, 21386, -52486, -107298, -66446, 55266, -7360, 52903, 73058, -107429, -54295, 72396, 111477, 75885, 89990, 224564, 159231, 38793, -6190, 85158, 78624, 79766, 53981, -15361, -35488, -72675, -82670, -116141, -66956, -60001, 64735, 20582, 29705, 56724, 79964, -37058, -73347, -25406, 13598, 58588, 94479, 65676, 141124, 66567, -109387, -157371, -208729, -258523, -188202, -35851, 8422, -7993, -80163, -88135, -188222, -207827, -107384, -84233, -109151, -194395, -196194, -123747, -120351, 26308, 19442, 14145, -45747, -111377, -95075, -91489, -4637, 132081, 165947, 132590, 62156, 19650, -58916, 79817]
15363G9817O8127k4107l0183k3586q4833j38362J1097J20877j1293Q3340Q5235
15352A36129L5958k4706j68281n259j9502j3164p2369q2202J7905Q6199k5992
15341a35284k9116J26625R1574l5881p986J30383l1453m3188M7444n5263m2225
15330A5630L6921l7710O5139j0271j20495q7657r0315p3516K9658n7540J44486
15319a85670J89862J5436l1317p5523j8913O8029q2177j11912J2125J35647J43077
15308E8664J7810p0774M2430j9919N6032j0382k02189n9901J29836Q6896m5809
15297a7306Q0096j9305j06008r2562j2892J449J5157J03041J18405m417r5874
15286c0216N111J56642m7318j03911J4811K2559N3633M0986j11336j0237N611
$$ y = [79817, 147944, 123837, 93654, 70068, -14765, -153127, -142030, -21153, -32446, 50894, 136129, 172087, 147381, -20900, -26159, -45661, -58825, -131194, -213396, -195491, -109292, -135284, -164400, -37775, 53799, 17918, 9932, 140315, 108862, 65674, 113118, 57855, 15630, 52551, 14841, 79980, 69709, -50786, -138443, -228758, -302274, -272616, -330156, -185670, 4192, 19628, -11689, -87212, -106125, -38096, -120273, -232185, -220060, -84413, 58664, 76474, 5700, 48130, 28211, 84243, 73861, -128328, -188229, -58393, 28503, -17306, 62790, 43485, -62523, -155085, -167977, -166528, -151371, -48330, 70075, 65658, -30216, -25105, 131537, 84219, -19692, -4881, 17678, 71311, 112297, 961, -9276, -3665]
15275c665m7315J9634N0584m0776l243L0006l3076Q2585P347j4414m568l1199
15263A1900j8472l861L9352J9488L1268j1364J6637J8519m3101l658J12115O804
15251A75627n1853N7849K09045K9800j91322j70580o4476k5456J64974M7071m4326
15240A36353k3166R2765k7485m7482m5281O4977p9258M5616J63146j05517p8333
15229I6335O8297p9262j20145J2492J0675n7371P1051O1261J7632J32753K4668
15218B38386j35074r8113J39687L9368m4538j61818p5227J0794L7448J10278r500
15207E1691q592m702L4321J7882k4546m7909M1560j0097k6427J1170P8472N4900
15195A67723p2305r7353l8523r835J18428J00584J7325J27070M1184q831j04237
$$ y = [-3665, -50980, -31346, 19238, -21538, -24781, 5225, -27851, 54734, 62081, 47667, 43099, 11900, -6572, -10433, 28919, 48407, 79675, 68311, 84948, 103467, 60366, 56708, 168823, 175627, 123774, 181623, 390668, 420468, 229146, 58566, -5910, -31366, 133608, 180679, 136353, 113187, 205952, 178467, 130985, 85704, 150681, 71423, 117039, 280185, 174668, 96335, 164632, 85370, -34775, -22283, -11608, -68979, 2072, 63333, 80965, 213718, 238386, 103312, 5199, 144886, 184254, 139716, -22102, -97329, -86535, -49087, 61191, 51691, 43099, 38397, 72718, 90600, 66054, 18145, 59705, 49608, 23181, 34351, 112823, 167723, 95418, -1935, -40458, -50293, 68135, 168719, 186044, 313114, 354298, 345467, 241230]
15184B41230k13779L203M307j37592j15035K282M8027O5542N2602J7968k0340
15173e1585p875p2270R6610N3229l9221o6193K5629Q1862o7105n1795k4699Q921
15161a14492P5746J28208M0624m6239M3130q2556L1235L2944m8506k2321M5789
15150H3562L6208K7594n1006l6406o829k5979o8495J4961O3891l5738p339M4333
15138C8757n1818p3460K0332P927p1612K0495L2600R3549l778l6861q6532j11982
15126b22383M0075L6225M3477N4104P3710J3259J1893J1027O2804p3418o0976
15115a0203m5252k4114Q1402k1831m1952N3252L2042o4135K5270O7683j11495
15104e9333J0510M0567J5395l4081M2796J1408q2170l4847L6915J05057J3238
$$ y = [241230, 27451, 30654, 34961, -102631, -217666, -215384, -167357, -101815, -49213, -31245, -51585, -59460, -131730, -35120, 18109, -21112, -87305, -61676, 20186, -46919, -98714, -123413, -114492, -38746, 89462, 130086, 83847, 126977, 44421, 75656, 108600, 60094, 37773, 83562, 119770, 147364, 96358, 59952, 53123, 27144, -41351, -26390, 37501, 1763, -5576, 38757, -13061, -86521, -66189, -58262, -129874, -109379, -76779, 16770, 12992, -23869, -110401, -222383, -182308, -146083, -102606, -48502, 25208, 38467, 50360, 61387, 124191, 50773, -10203, -55455, -79569, 1833, -19998, -61950, -8698, 23344, -40791, -15521, 52162, -59333, -48823, -8256, 7139, -26942, 15854, 27262, -54908, -89755, -52840, 52217, 65455]
15093F5455p1741o3575q9785l4149K34629P3737k12294j00744q113p219Q7623
15082a26176J00119n419j34065j1629J20910J7681m2123L606J34972K01968L7146
15071B96990j43311j97331K7294K8783P0018j01985p6602J29008J02472o3429
15061G1907L3803j07625j5420o6255l5235L9344J11740O1236L9917n9005l5775
15050C8632n9145m3863Q8J7811n771O9182R1835N9363j748q027P4402M7058K5701
15037C05518q1475n1054J687L759r7141l1108j08814q1260O2677J46339M9710
15026A18838L7637N4385m4145j7474j0866k6426j03164l0031m7727L430N5770
15015i773P4877k6460l3346j5897O028P8239n8161r5208M8389j2868m4685J04587
$$ y = [65455, -6286, -69861, -159646, -193795, 40834, 114571, -97723, -198467, -206580, -213799, -126176, -26057, -31476, -165541, -177170, -56260, -38579, -80702, -77096, 57876, 259844, 296990, 153679, -43652, -16358, 12425, 82443, -19542, -96144, 32864, 135336, 71907, 105710, -1915, -17335, -83590, -118825, -79481, 32259, 93495, 133412, 74407, 38632, -20513, -64376, -64288, -46477, -52248, 16934, 108769, 168132, 166384, 158357, 232759, 279817, 305518, 224043, 172989, 174676, 178435, 81294, 50186, -58628, -139888, -77211, 69128, 118838, 156475, 210860, 166715, 149241, 138375, 111949, 8785, -21246, -68973, -65543, -9773, 65104, 38644, 5298, -10599, -4571, 73668, 15507, -79701, -31312, -44180, -88865, 15722]
15003A5722R6850j38929j50530L9148P4780l4153M100Q0006k8270r6609J0652
14992a27233J33621J00335K593k8865n3738L7996K3919N6896p1429n4634r95q272
14980A0194j5402p2379p9535J02757M389r2426o4118R0544J03370J68647J1120
14969A67161M1221j786j01300r1432O1537M2911m2907j3406M8505Q7509o214q2726
14957A09073l8376n1364l4245n3967Q0077L0207j821K8396P1710L1440j22167
14946D8963j25982l0016P5752M9954m9205M6218N349K9050Q1017J2803j18263
14935B5640p1355O740R8763J04770m3499j57802R30O0305n7044J03137K8493N1693
14923A50771j09076j46779K7546o5279L8989M3326l9914M4726M967J8147L7957
$$ y = [15722, 112572, -26357, -176887, -137739, -62959, -97112, -93012, -13006, -41276, -137885, -127233, 6388, 106723, 109316, 80451, 26713, 64709, 88628, 145524, 74095, 19461, 18466, 10194, -5208, -77587, -157122, -54365, -49976, -142402, -206520, -115976, -12606, 156041, 167161, 208382, 206596, 105296, 13864, 75401, 118312, 75405, 61999, 110504, 198013, 191799, 109073, 70697, 19333, -14912, -68879, 11198, 41405, 39584, 67980, 139690, 171130, 48963, -77019, -107035, -31283, 18671, -30534, 15684, 21033, 50083, 131100, 143903, 25640, -45715, -38975, 59788, 164558, 121059, -36743, -35813, 24492, -32552, 70585, 99078, 150771, 41695, -105084, -77538, -142817, -103828, -60502, -100416, -55690, -50723, -32576, 5381]
14912E381K5200m2654m9033Q8154P4536j08963j29613L3978J46588R2081j05343
14901C0312j74117Q5539P1535J3402R9792O558q7643r7166N4927j2863O1201O8137
14889A19614n2554K2276M9066k3083o4945P747o2781p6298k7616O0388L7278l3270
14877d4178p7413N3128k202j6313L2800p9312J1559P9751J01125J28245K4632
14866B11822q9383J5003K066n8940q4687p6877l1650O9801O5312l9360k2555k8627
14854f8075l1685N2706J00081R5785n1061k422j02145p798L9440n649K807N7657
14842G9641N0292q3814m7428Q4742m0292q7625K9920j14244M7830L7723K7856
14831a5399L024L6760m1037r3566m6393L2051M9447M7968n9907m9282q9087O8105
$$ y = [5381, 30581, -12073, -61106, 27048, 101584, -7379, -136992, -103014, 43574, 135655, 30312, -143805, -58266, 13269, 26671, 126463, 133021, 45378, -51788, 3139, -9724, 51477, 119614, 67060, 89336, 138402, 115319, 50374, 58121, -4660, -80958, -108574, -48186, -10908, -44178, -121591, -68463, -70665, -86978, -54178, -133490, -121931, -42180, 58945, 187190, 211822, 122439, 137442, 139508, 80568, -4119, -80996, -112646, -42845, 22467, -16893, -39448, -68075, -99760, -47054, 53027, 148812, 97751, 95329, -6816, -14614, 24826, 19177, 21984, 79641, 129933, 46119, -1309, 83433, 43141, -44484, -14564, -128808, -80978, -43255, -15399, -12375, 24385, -16652, -110218, -156611, -124560, -75113, -27145, -87052, -136334, -225421, -157316]
14819a57316R5921J08343o1280r9490q7931L1557Q6640O0017l5306q1202P0110
14808f9937J02859J7457J6268P45m2870M5060k6385J3302J70096Q7797j09006
14797B05386n7534K4455P4894M5585j24750j71271K793m8360l0711J6003J03706
14786D0196j243n0562P7451J28712L9911j32145l5691k4820l5776j7516r935J1146
14774a0272J299K0172O2280L3617j22758O4377m2650j43107J6722r0535j05018
14763c15873P7900J05914N114p9632q1476j1004N3392J17262n2367P1563L8306
14752g0901J23407J4887m9240P7535J03352L6523j80656L9450m6260n1929J08181
14741A04349Q0037m5578k4681k7344p9990q7637N9715l6082p798M4994j0327N3360
$$ y = [-157316, -61395, 46948, -14332, -113822, -201753, -170196, -83556, -23539, -58845, -140047, -69937, 32922, 50379, 66647, 67392, 24522, 69582, 43197, 56499, 226595, 314392, 205386, 147852, 172307, 247201, 292786, 168036, -3235, -442, -48802, -79513, -63510, 40196, 38953, -11609, 65842, 194554, 234465, 102320, 66629, 41809, 6033, -11483, -21418, -10272, -8973, 11199, 73479, 107096, -15662, 48715, 6065, -137042, -120320, -210855, -315873, -237973, -132059, -126945, -206577, -288053, -299057, -245665, -128403, -180770, -109207, -70901, 52506, 67393, 18153, 95688, 199040, 235563, 54907, 94357, 48097, -3832, 104349, 184386, 138808, 114127, 86783, 6793, -80844, -21129, -57211, -65009, -20015, -30342, 23018]
14729B3018o2358l9347R8210J59624L3970q6009j28707j3666q2094k0837R8888
14718a9308J03171J7783o0955n020n2750M6306K9140j01888K0334J8035O7291
14707F2139K3607J100o74L8614J7425o9078j28611J1142J0764n0635K4933O2319
14695C045L6150R3901J57154L6468j03141o6462p7347p3200M5752l127n9469r4289
14683a04565p3014l3741p1350R1108K11767J00013l4660p5225j29921J3685Q2893
14672b3010m4892k1354O5794L1835q562j8139M1727L4855j03026J7828j31806
14661a58750O4294J58549N8565o475q442j22932o5998q1219l424j3507N0283k1063
14649a50119Q673M2975q187p9155M3143q3191l0547Q0146R1532J619l9064J1453
$$ y = [23018, -39340, -78687, 19523, 179147, 213117, 127108, -1599, -15265, -97359, -118196, -19308, 83863, 101646, 40691, 35671, -17079, 29227, 58367, -43521, -23187, -5152, 62139, 85746, 86846, 86172, 124786, 142211, 73133, -55478, -44336, -33572, -84207, -59274, 3045, 39195, 133096, 290250, 326718, 223577, 157115, 79768, 6568, 52320, 49193, -10276, -104565, -177579, -211320, -282670, -191562, 20205, 120218, 85558, 10333, -119588, -105903, -23010, -67902, -89256, -23462, 8373, -189, -18328, 23399, 58254, -44772, -26944, -158750, -94456, 64093, 122658, 116183, 107741, -15191, -81189, -162408, -165832, -179339, -129056, -150119, -141446, -98471, -106658, -185813, -142670, -225861, -256408, -176262, -84730, -83111, -122175, -110722]
14637a10722J52174L8823j54935j39381P6877P6308K3281N9320p5027m5473J6319
14626h2436N8802J54793M8924j37774j95308l2764n8351O1075J13727Q8857q3502
14615f3957l7742R5512o4958k1767l499K6302Q5609l7998k2940r2075l9731O7081
14603a10163Q1411L0046N2662m3893J2744L9259Q316o3167q4223n0948J29441
14592A485K43169K7517k49057m6093J35061o2613k3821J11959n7277r0817k3093
14581c3580n985k7393K0170M1865J33473P775J09131J7975m1007j79916m9477
14570f969L3461J5708q273N1078o9860K6260O3644r2274l5237r7566N4406N425
14558f0197k2036p1390j910K4314N1513J7570j1785J03449J46978Q0166j00343
$$ y = [-110722, 41452, 80275, -74660, -214041, -137164, -60856, -37575, 21745, -53282, -98755, -82436, -23634, 131159, 180083, 42309, -152999, -185763, -244114, -183039, -69312, 19545, -63957, -101699, -6187, -71145, -92912, -96411, -70109, 15500, -22498, -45438, -137513, -177244, -110163, -28752, 1294, 53956, 10063, 22807, 62066, 70382, 7215, -77008, -127956, 1485, 244654, 272171, 23114, -22979, 112082, 49469, 25648, 137607, 80330, -10487, -33580, -39565, -66958, -46788, -4923, 128550, 136325, 245456, 263431, 222424, 42508, -6969, 26492, 42200, 33927, 85005, 15145, 41405, 105049, 12775, -22462, -120028, -65622, -60197, -82233, -153623, -155533, -131219, -79706, -62136, -73921, 29528, 176506, 256672, 156329]
14547A56329o1590O4784l2914j5577p6313m1201q6461N4777N6896l4016P2244
14536E6958J4218O38L4134j7049J06942p5335r4657r7244r5876j284j8886L4496
14524a52945J0404R1753O8837M8885j3647j02342j01484J23929q751k5701j3544
14513g4606m0558J06199N5624n8781m9758j15791j77375O992J22232P1813L1919
14502a22090p1925Q5308O3540P1829O2315N8732j1855m4185L0246L9197l4853
14491A26259m7750o4492k8241N1606L7384N4455o7293n7969O3332J27L727k9978
14479D1167j11017K7260l5694l1472n6330k9139J7941J22944M4229l0270o4447
14468a04828O942m5464n063k6157R0548K9436j0802n597j0041O6157M7716Q4449
$$ y = [156329, 94739, 159523, 126609, 111032, 34719, -6482, -92943, -38166, 18730, -15286, 56958, 71176, 71814, 105948, 88899, 195841, 120506, 25849, -71395, -167271, -168555, -187441, -152945, -142541, -50788, 18049, 66934, 53287, -49055, -150539, -26610, -35361, -61062, -74606, -115164, -8965, 46659, -12122, -61880, -177671, -355046, -348054, -225822, -154009, -122090, -194015, -108707, -45167, 26662, 88977, 147709, 135854, 91669, 121915, 161112, 126259, 78509, 14017, -14224, 37382, 74766, 129221, 61928, 3959, 67291, 67418, 71145, 41167, -69850, -42590, -78284, -109756, -166086, -195225, -177284, -54340, -10111, -40381, -104828, -97886, -143350, -148413, -174570, -84022, -54586, -65388, -70985, -81026, -14869, 32847, 117296]
14456A17296l7721o9456j10874L6661K3586M5790L1829q5139K6912O9927k4145
14445B4666j8775M193n5351q1623j63085L3583J03093Q5927J28395K8286j20657
14434c1348j32774O7006K0878N5330L7708k7624N1047q5325r7367J20509j3103
14423c5063q2787L1592j3806j38441j0205J23088n6101r254J74626Q6546o3985
14412F210j36488Q3395M7331j26291J0655K3462L1831j14342J8255j7053M1384
14401a31651N702l4876l4680R9684N4242J3605Q0326o6003L0618L2164q4554l7513
14389g2936Q6943R3308p9309r2063J06812o4326k5347O9218K7526L9167j07579
14378a8586k0596J12257M9354j48878j03628J32328J26711r1401l5093N2154j52103
$$ y = [117296, 79575, 10119, -100755, -64094, -40508, 5282, 37111, -48028, -21116, 48811, 24666, 5891, 10084, -45267, -126890, -289975, -256392, -153299, -67372, 61023, 89309, -31348, -164122, -97116, -76238, -20908, 16800, -10824, 40223, -45102, -142469, -21960, -35063, -117850, -86258, -100064, -238505, -248710, -125622, -181723, -190977, -16351, 70195, 6210, -130278, -46883, 448, -125843, -115188, -91726, -59895, -174237, -155982, -173035, -131651, -125949, -160825, -195505, -95821, -41579, -27974, 52352, -13651, 16967, 49131, -35423, -72936, 14007, 107315, 28006, -64057, 42755, -21571, -46918, 22300, 49826, 88993, -18586, -39182, 73075, 122429, -26449, -130077, 2251, 128962, 37561, 2468, 54622, -97481]
14367i7481l3900M8030j8544N6422Q3777O8755J03236r126l9882R0214p2779n3456
14355A25266l1410L3456j428J6927j18087N5924J77457Q0779p2092k51034p4722
14344e8964P831n0260O2346Q9766O5804r494p9261r3511R0359p2163m2031O5282
14332b4296j2060K0210K14187N5648Q2783j70850k51141j4395J22855l4223p3210
14321h4492J41828R1848r7238k919M7134O8578m04p2408J01871m1469j9597n8316
14309G4416Q1452R821q6710j31446k8250n0748J34870R2476J5591p4480j20456
14298h3464o1298O454K1111K8521O35O9137N3036l5773j54551J722J12408m8732
14286i0794L6169Q1588q6673j25344K5889j4754M8899L7757p2179o1138J04697
$$ y = [-97481, -131381, -83351, -101895, -45473, 38304, 107059, 210295, 201169, 161287, 251501, 178722, 125266, 93856, 127312, 125884, 142811, 24724, 80648, 258105, 338884, 266792, 15758, -58964, -51133, -101393, -39047, 50719, 116523, 107029, 27768, -65743, 24616, -47547, -89578, -24296, -36356, -16146, 198041, 253689, 336472, 165622, -85519, -99914, 22941, -11282, -84492, 57336, 149184, 51946, 49027, 96161, 164739, 164335, 91927, 193798, 152329, 132732, 74416, 155868, 165689, 78979, -52467, -80717, -131465, 3405, 95881, 111472, 36992, -83464, -144762, -138308, -117197, -88676, -88041, -18904, 34132, -1641, -156192, -154470, -42062, -90794, -54625, 26963, -59710, -185054, -159165, -173919, -125020, -87263, -159442, -220580, -115883]
14275a15883N7686o8752k1504j4890R8335J43740R2185J9228p3690j36186j39170
14264a58901M4574K04630L368j7974K3792K8532j17641m3567Q6912R5424O0738
14253B09887n653k1138j6226j2980m8648m9799p9368R8465O1660k0532j2792n4326
14241D8550J1995J2609k4156q7785q0422R5771L0182P7636J7008j4451r7486N222
14229e327K0782k5934Q7498o6560o2723J46628N2837j10633j11617j9181O5494
14218b8736R0230N531m2112J5762r2483l2347K4509r126j96227L0049N9537j3452
14206a88865J32808J43903L5386n9401k6115K3944Q5241o3872K9003l1135K5117
14195A06014k0042l3768j833o053K0803p3381o5254P6735M4658l0934L8020M8323
$$ y = [-115883, -58197, -126949, -148453, -163343, -65008, 78732, 170917, 190145, 116455, -19731, -158901, -114327, 90303, 93671, 75697, 99489, 128021, 10380, -33187, 53725, 149149, 209887, 204234, 183096, 166870, 153890, 105242, 55443, -23925, 74540, 136200, 115668, 102876, 48550, 60545, 73154, 48998, -38787, -119209, -23438, 6744, 84380, 101388, 86937, -10549, -5327, 15455, -10479, 77019, 10459, -52264, 94364, 147201, 36568, -75049, -94230, -28736, 61494, 67025, 24913, 40675, -51808, -84155, -59646, -68772, -264999, -234950, -175413, -188865, -56057, 87846, 123232, 63831, 37716, 61660, 146901, 83029, 112032, 80897, 106014, 85972, 52204, 50371, 44318, 65121, -8260, -73514, 3221, 47879, 16945, 54965, 103288]
14183A03288o0861j26882k9376N0833j5600N9073M1606O8765k407r0029l3365
14172c4955J2693K2133j3626j17428O0926J03306R902O1553P3543P8973q2662
14161A74358j11530L546o2435J4959K0505K6530m3661j63612k1383J36149J31364
14150A04790p107o5516L561p1991q3166J4054L265M4227K6328L3597K1366P6239
14138I9647j05338R6930M8128p7214p0029J2008O6894K8762J5299j9368l7491
14127E8228m256K2067K9588o8827l8805O8136J669j3623l7526l1922J18752J8267
14115A21748m584n5636k0702l9209L6218l0997j0007R4P369Q2399M6408r2180
14103D0921q3538J0261n2876L4800J0157R0579J35469r2647j19174n7889J21715
$$ y = [103288, 42427, -84455, -113831, -62998, -78598, -19525, 22081, 90846, 88439, -1590, -34955, -22262, -129, -13755, -131183, -70257, 33049, 42951, 104504, 178047, 257020, 174358, 62828, 66374, 3939, 18898, 39403, 65933, 22272, -141340, -162723, -26574, 104790, 97683, 32167, 35728, -36263, -119429, -105375, -102110, -57883, -31555, 2042, 23408, 99647, -5691, 91239, 139367, 62153, -7876, 4132, 71026, 99788, 115087, 95719, 58228, 53972, 76039, 105627, 36800, -2005, 66131, 67800, 54177, 16651, -15271, 103481, 121748, 117164, 61528, 40826, 1617, 37835, 6838, -3169, -3075, 4294, 86693, 133101, 40921, -42617, -32356, -85232, -50432, -40275, 50304, 185773, 93126, -26048, -83937, 37778]
14092C7778k68p5207m7143P7675P6081r0975p0482j07667L5468L9491L9046O4346
14080b1857L9474q3459k5909M5162j9997J372J41860m9866j8350N3956L4873o0024
14068C7235r5908j01661l6013K1466Q426J22942K0717j0468K0665J621n3947J7806
14056d7119j23295r2157P6099J73409J48222j17114j07400o6281O7383N1250o9224
14045a06227q4148Q4724J23792J03244o1487m0969q5743o6054j12942O5559J19850
14034f0401O9194Q0243J13646r5677k75436m4359J29351J28084J1534k0837N3873
14023H9215L642p1267k0493K0254O5990k8550j26886j42158J12892J66961j2534
14012E7066o5594K2808Q5399O2546j9048j07161L4086P3839p7583J0069J5771
$$ y = [37778, 37510, -37697, -84840, -7165, 68916, -22059, -92541, -200208, -164740, -125249, -86203, -21857, 17617, -65842, -91751, -46589, -66586, -65214, 76646, 26780, 8430, 62386, 97259, 37235, -58673, -160334, -196347, -174881, -166455, -43513, -22796, -33264, -12599, -10978, -64925, -47119, -170414, -262571, -186472, -13063, 135159, 18045, -89355, -155636, -88253, -37003, -106227, -190375, -105651, 18141, 121385, 59898, 18929, -66814, -132868, -245810, -180251, -60401, 8793, 89036, 202682, 107005, -168431, -212790, -83439, 44645, 56179, 35342, 89215, 92857, 21590, 1097, 21351, 87341, 58791, -68095, -210253, -97361, 69600, 57066, -8528, 14280, 99679, 162225, 143177, 36016, 70102, 143941, 66358, 76427, 92198]
14001I2198R0192l9546p1674j22299M6229j0291m7572K0491O3108o4598m1531
13990h5293l4631L5528L9130j5924n9147J9072R6623n4444N9547J78457q5574
13979I3344j39880j23651N438J25735O9102R7649J1322J6673j00308j3695O9549
13968A11278L1429q8798j41233m7714N4528K9832M4967j4674m6810M2485Q1935
13957E7225O2947m6774j2018L4564L9403j0236o0021L5655j8618J2718M900k0830
13945G8915r689n8137l8435k4267m0696p617J42288M4690p5980l1110p6724j24269
13933b21031l027N7044P512j6715N6161Q5488K0032j1494N0274O4105m5107j86229
13921a42987m8564l2044O0893M3510p3680o440M9184O9023k2965J3062K1555K1372
$$ y = [92198, 182390, 142844, 71170, -51129, -4900, -15191, -62763, -42272, 20836, -43762, -85293, -119924, -84396, -45266, -61190, -120337, -101265, -4642, -59086, 461, 178918, 93344, -46536, -170187, -164749, -39014, 30088, 127737, 139059, 155732, 55424, 41729, 111278, 142707, 53909, -87324, -135038, -80510, -50678, -5711, -20385, -67195, -24710, 57225, 120172, 73398, 61380, 95944, 135347, 125111, 65090, 100745, 82127, 94845, 99745, 78915, 69226, 11089, -27346, -51613, -92309, -99926, 42362, 87052, 11072, -20038, -96762, -221031, -224058, -167014, -159502, -176217, -120056, -34568, -14536, -26030, 24244, 88349, 43242, -142987, -191551, -223595, -162702, -119192, -192872, -199312, -150128, -81105, -104070, -91008, -69453, -48081]
13909d8081o5171J15945m731m8521N6563N6715R9874J04891k0768p1450m3881
13898A31385j58728j60559n1863J78664P5025j07340j22029K1166O8106K5287
13888a00886J03191J01605N0846P8155m4284k43818m8180Q5883j9686o5425k5438
13877a28037q3180o0364J5484L6187J45204K7664k3042m4214L9705o9168p483
13866a51244J56170N8225j8410j4150J8003j12578r5666p316j7700p8882J25278
13855a38270Q7836j1657M8813m8761q2158J21394O9512j61115Q4059K6300k9873
13844c3920J17248J1386p3253J34269K7891r71n6220m8727p2163n9035L7933N0306
13832C4744N9461j55329l9814J60611M5840J754n5062l8076p1063O9568Q7919
$$ y = [-48081, -113252, 2693, -2038, -50559, 6004, 62719, 162593, 267484, 246716, 175266, 131385, -27343, -187902, -239765, -61101, 13924, -93416, -215445, -194279, -126173, -100886, 2305, 103910, 154756, 232911, 188627, -55191, -103371, -17488, -37174, -102599, -128037, -211217, -271581, -256097, -219910, -74706, -47042, -70084, -114298, -74593, -143761, -151244, 4926, 63151, 44741, 30591, 48594, -63984, -159650, -166966, -184666, -263548, -138270, -50434, -62091, -13278, -62039, -144197, -22803, 46709, -114406, -30347, -4047, -33920, 83328, 94714, 21461, 155730, 183621, 182650, 126430, 77703, 5540, -53495, -15562, 34744, 94205, -61124, -100938, 59673, 105513, 107267, 52205, 14129, -56934, 12634, 100553]
13821A00553q4259m98L9042j06276Q1527M7219l1860N029o430N8024o0864p1410
13809c0203k2982Q0403J4847k27190r585J29032K7419Q3093O3499j26212M1886
13798B4007K5387M0547j3821O793k6777p2763o8579m7667N5099m6908o6084n3808
13786b44574N3280P2480L1063P3666J409l2100j8355M0087P3056J28287N4599
13775B32898n3748J12Q9344n3895q0460q8927k3243k3947l5333J67266m7607Q1115
13763A63575L3111J7605L4496n3748p0581o6614J6951q1297J13324m194j63147
13752f0519Q648O1577M123m9019p2956P0070J4689j4263r284J4087m5276o8800
13740a46923L8121R0921R612m4529l3301O2953M2226k7140n3853q5221O6879O0860
$$ y = [100553, 16294, 15796, 54838, -51438, 30089, 77308, 45448, 50477, 44047, 102071, 41207, -30203, -53185, 27218, 42065, -185125, -194710, -65678, -38259, 44834, 108333, -17879, 24007, 49394, 89941, 76120, 82913, 56136, -16627, -85206, -132873, -77774, -124682, -190766, -244574, -191294, -118814, -87751, -14085, -12676, -44776, -63131, -23044, 50012, 178299, 232898, 179150, 179262, 268606, 214711, 134251, 45324, 22081, -1866, -37199, 130067, 82460, 163575, 196686, 214291, 248787, 195039, 124458, 57844, 74795, -6502, 106822, 102628, -60519, -51871, 9706, 13829, -35190, -108146, -38076, -23387, -37650, -46934, -32847, -78123, -146923, -108802, -17881, -8269, -52798, -86099, -23146, 19080, -8060, -61913, -147134, -80255, -19395]
13728a9395J15268k1371l4697M719J24656J6318k5009J24494M7125L973q6158
13717B49923j38861r0529K8225J06243L5420o7801l3878M7684M5594o5330o0755
13706E5935n983k9026J9402n6544K9902j86520J8649J25586N6024k0462P21p2387
13694f4703n1254J7835Q5192j2275J0215n440m7274j4721r464J18187Q3273m9792
13682E9779l8395j20481m7436Q212j14410n7619J35392J31579k2201K2586j23872
13671a66866k5533J83175R5254o8439L3518l3935p0841j45272k1549J77339J55970
13660A12821o4059j74128m8462O5483J28696O1070q3133r1957q396J06898o0013
13649e5180j41768O3104L8026J12475l1976r8380k3087j18589j00812J70470P4083
$$ y = [-19395, 95873, 74502, 39805, 44524, 169180, 185498, 160489, 284983, 332108, 336081, 249923, 111062, 20533, 48758, 155001, 190421, 122620, 88742, 136426, 182020, 116690, 55935, 49952, 20926, 40328, -16216, 13686, -172834, -154185, -28599, 27425, 6963, 7684, -64703, -115957, -98122, -12930, -25205, -14990, -20430, -67704, -82425, -91889, 26298, 109571, 59779, 21384, -99097, -146533, -138321, -252731, -310350, -174958, -43379, -65580, -42994, -166866, -192399, -9224, 86030, 17591, 51109, 17174, -53667, -198939, -220488, -43149, 112821, 48762, -125366, -173828, -108345, 20351, 81421, -1712, -93669, -102065, 4833, -55180, -196948, -133844, -95818, 16657, -15319, -113699, -136786, -255375, -356187, -185717, -111634]
13638a11634Q9674P7256k0727K4027L4910J486j75088j7544P9637o389p9204K7165
13626g6431k8949J7596k7881j02402j19203M7338l7J33095L6125J9461M0601K7350
13614c3337J3278J39625K5625n5905j27487L5061J9330k7198K6771P0267N7909
13603A43939J4064p4351n4854O3282l9429o6400n3605o0925J19478J37190L0619
13592A59008l7463n0459j28457j09868M5392J66604P6310L7521m6822p2170j23125
13581h3529j0016M9492J34612p591p5434L497L8378m346M5471K5418k5284O4652
13569A55320J319p214n6967N5335M8025j3430q6740R394J57149J00246j32370
13558B30067p8044k9626o6070j8855L3004p4717J4210L3437P8308N6482q543o996
$$ y = [-111634, -21960, 55296, 34569, 58596, 93506, 94992, -80096, -97640, -18003, -24392, -103596, -76431, -105380, -87784, -115665, -218067, -337270, -289932, -289969, -156874, -120749, -101288, -60687, -33337, -20059, 119566, 145191, 89286, -38201, -3140, 16190, -11008, 15763, 86030, 143939, 158003, 83652, 28798, 92080, 52651, -13749, -67354, -128279, -8801, 128389, 159008, 121545, 71086, -57371, -167239, -121847, 44757, 121067, 158588, 111766, 39596, -83529, -93545, -44053, 90559, 82968, 7534, 11031, 49409, 45063, 90534, 115952, 90668, 155320, 156639, 149425, 92458, 147793, 195818, 182388, 95648, 105042, 262191, 362437, 230067, 152023, 122397, 56327, 37472, 70476, -4241, 9969, 43406, 121714, 178196, 169653, 162657]
13546A62657r0990k7493m2805K9979R2545p6257n7163N2288O6472j1415k8123
13535F9695J3074l2191k3245l828j09232n4223P8951M9953J8045N3977L7558r1764
13523F770l9713l2403n4806O8485J54137P3192P7718r7265r9771L7500P7866m7718
13511A23992o5103p1190P4349L925N914N4766J95135o2677j01945j52982J9560
13500B3744J58457k0725o7961M1438m628l3369o9693j31016j0590J29195P990
13489B2842k9119l3544l2610r6447J2753J16056j859J350N2231Q9524p4088j82867
13477a55778N1009M855m497J9476N6612j14224m1443J52485O6913J7665P7529
13466A30602m2622J3434J8324m5108o2489q2000p4049L4993J01437Q1796M9824
$$ y = [162657, 71667, 44174, 1369, 31348, 123893, 47636, -9527, 42761, 109233, 97818, 69695, 82769, 50578, 27333, 23505, -85727, -139950, -60999, -11046, 6999, 60976, 98534, 6770, -32943, -65346, -120152, -51667, 102470, 175662, 253380, 156115, 56344, 93844, 171710, 123992, 58889, -12301, 62048, 65973, 71887, 126653, 321788, 259111, 157166, 4184, 23744, 182201, 161476, 93515, 134953, 130325, 96956, 27263, -103753, -114343, 14852, 22842, -6277, -39821, -72431, -168878, -156125, -40069, -41928, -40578, 11653, 101177, 27089, -155778, -104769, -99914, -104411, -84935, -28323, -142547, -183990, -31505, 35408, 53073, 130602, 87980, 101414, 119738, 74630, 12141, -69859, -143908, -108915, -7478, 74318, 124142]
13455A24142k552o8267M8923L1356P0866r0071j43305L9556L7465r4996o1754
13444a08637P4775J37904N8212j05924r8947l0082R7130M2189j55310o3250R5535
13433e6405J48432J47740K9349m8088O00n8781n7726l5893r8959k555P0465L93
13421C8572m9162Q194p2129J9718l9527N8214P179r362j50357N4513M2632J8972
13409g2543R4272k658o3730J946J0066N6148L9399L9757l7523P0988N3137r749
13397A79510j30166p1905q1671j3465j31086o1703K11224J88913l2659n3275Q2368
13386H6085m5269j2073N5309J0947q389j07702K9833N8605R3908p888r9379K6412
13374H0399J14835k1692o4850m6723M1010K1817p655m2804M6784L9235m3796m0578
$$ y = [124142, 121590, 53323, 102246, 133602, 204468, 114397, -28908, 10648, 48113, -46883, -108637, -33862, 104042, 162254, 56330, -42617, -72699, 24431, 66620, -88690, -151940, -56405, 92027, 239767, 269116, 221028, 221628, 162847, 105121, 69228, -29731, -32286, 38179, 38572, -10590, -2396, -74525, -54807, -94334, -36120, -28941, -38303, -188660, -134147, -91515, -72543, 21729, 19071, -44659, -42713, -32647, 23501, 62900, 102657, 65134, 136122, 189259, 179510, 49344, -22561, -104232, -117697, -248783, -310486, -99262, 89651, 56992, 3717, 86085, 40816, 28743, 84052, 94999, 86610, -21092, 8741, 67346, 161254, 153366, 53987, 80399, 195234, 173542, 108692, 61969, 102979, 124796, 117141, 74337, 121121, 160356, 116560, 75982]
13362G5982P658r4113k0512q6972M1506O2243r638R2393N4728P4440o8815j62058
13350c3158K8207j3152o4102J7134J4985L2032Q3958j4501m0264q7989q0953q00
13338a58603l5779Q6256Q2177R1726m0623K567J6615q108n0052P3934J14398J08488
13326B82996o4743j27241q3389r6877P3306m0853j4570j4426R8043N3033Q5667
13315A50946R2254O6653j52753m2204P6511q7672l0915Qj14780j11507K7545R6768
13303b9146p9044O2894j016L7274L7295k4200m5250M9019O2075J3001j8122O4491
13291A29271J01457K3097k05257r1131M5595j0245o2571r759J7324Q7469K6005
13280E1255r1517n0976J78483J02993j929k5229M856l7621p9597k00075k5818
$$ y = [75982, 83640, -10473, -30985, -117957, -76451, -14208, -23846, 68547, 123275, 197715, 128900, -33158, -4951, -18103, -82205, -65071, -50086, -18054, 65904, 51403, 11139, -76850, -157803, -158603, -194382, -108126, -25949, 65777, 25154, 27721, 44336, 36228, -13824, 60110, 174508, 282996, 218253, 91012, 7623, -89254, -15948, -56801, -71371, -85797, 12246, 65279, 150946, 243200, 309853, 157100, 114896, 191407, 103735, 72820, 72828, -41952, -153459, -125914, -29146, -108190, -45296, -46312, -9038, 28257, 4057, -41193, 7826, 69901, 82902, 64780, 129271, 230728, 253825, 48568, -42563, 3032, -7213, -69784, -79543, -62219, 25250, 51255, -40262, -91238, 87245, 190238, 188309, 163080, 167936, 130315, 50718, -149357, -175175]
13269a75175L7394K02785J39526o289j02864p4772P9706O3598o8096L6665J9112
13258A51590n6186k5895K7800J27828q200K0101Q5898K0853j82712q9726K0471
13247I1822l7964K3987J6026m061Q7424M1095m8206n9708R814n6157o5430J11843
13235A10485Q8484n481p0733j01190q1623l2227M3169k1034K9394K9243r821L8147
13223A6813J299k5569j14306r3442l8217m7211J68739K00647N0472N3837n9760
13212A13302k7542q3141k5171k9414N2438Q9108j0044N4893o3513j47413N1928
13201b4569N9878P3086J19476M7701l2038p8570j56215j3126P9524m8128l5436
13190h417R1813k0151l9048J17221J05344K9378O7107k4318k46023l4899O8852
$$ y = [-175175, -137781, 65004, 204530, 198241, 95377, 20605, 100311, 163909, 95813, 132478, 151590, 95404, 69509, 97309, 225137, 216937, 237038, 322936, 343789, 161077, 71351, 91822, 53858, 77845, 93871, 89810, 177234, 218329, 170123, 110415, 120229, 64072, -1358, 110485, 198969, 193488, 122755, 21565, -60058, -92285, -49116, -70150, -40756, -11513, -21334, 16813, 18112, -7457, -121763, -215205, -253422, -300633, -131894, 68753, 119225, 173062, 113302, 85760, 2619, -22552, -51966, 472, 89580, 79536, 134429, 70916, -76497, -24569, 35309, 108395, 227871, 275572, 243534, 164964, 8749, -4377, 75147, 27019, -8417, 83396, 63245, 24197, 141418, 246762, 276140, 343247, 318929, 72906, 38007, 106859]
13179A06859m8626L5678Q2578k0824K1089p4291m6609L6608m3266N2922q786j58288
13167f4956K1938m7353Q3972R5756J00822l0494j6253k7490j5711N4544j1388
13156A43387j24074Q0005L3697N6014N4072l7367q3715l9013P513J32016n8070
13145A64465j60469j387J58931M9692q4666l2508Q7840m5970M4198q0522o2757
13134C6847J13760n2344J8271r316p7058k5730k1854O5081M8141O2842k9569M815
13122A33886J65397N0200k3826q4956j780p3216n2078O1976M7419R1809m5882
13111B68949o2370M8199q401P6406k6619k814J5900l9211j61010j8188M6354q091
13099A29104j29266j36847Q0211R6952j22174j30015L9064M6624L1317M2770M3963
$$ y = [106859, 58233, 93911, 176489, 155665, 176754, 102463, 55854, 92462, 49196, 102118, 93332, -64956, -43018, -90371, -6399, 89357, 190179, 159685, 143432, 115942, 100231, 154775, 143387, 19313, 99318, 133015, 189029, 243101, 205734, 122019, 83006, 90519, 222535, 164465, 3996, 2609, 161540, 211232, 126566, 94058, 181898, 135928, 180126, 99604, 36847, 150607, 98263, 116534, 107218, 30160, 4430, -17424, 47657, 95798, 158640, 129071, 133886, 299283, 349483, 325657, 240701, 238921, 165705, 113627, 175603, 223022, 314831, 268949, 206579, 254778, 246377, 322783, 296164, 293350, 309250, 270039, 109029, 90841, 137195, 129104, -162, -137009, -56798, 40154, -82020, -212035, -172971, -126347, -95030, -52260, -8297]
13088h297K379m8978L6515O8852R7448j6391r8789n1134q6463K1720P5949P5756
13076F8567K0096j01199q8405J9292k3113R1769J36485J03966j62002l2126l2504
13065H26m969N8491K9253M0766j01619n1688J35859Q9732k9907o6417j22711l0304
13053e2688J24148k529j3793n197n7093k2936J37969P2801p9868p2985M5741M8992
13041A22562R161j34960l3791K6573m2657Q5099l2710K0743J82088m2742j6552
13030A42814J18548J39970o6035j0957p2574r7089M1531N4512q9503m847j015
13019A55355p6215o5624J87933M8420p7595q0029Q8662M2155r5743r100J5254
13008A33473p0246r044K6465Q6668j36380m3146Q893J16858J24805N1142L838
$$ y = [-8297, -5918, -54896, -18381, 50471, 147919, 131528, 32739, -18395, -104858, -83138, -7189, 68567, 88663, -12536, -100941, -81649, -104762, -12993, 123492, 227458, 65456, 33330, 826, -4143, 54348, 83601, 124367, 22748, -28940, 106919, 196651, 166744, 100327, -22384, -52688, 71460, 68931, 55138, 49941, -7152, -30088, 107881, 180682, 100814, 27829, 73570, 122562, 131723, -3237, -37028, -10455, -53112, 31987, -723, 20020, 202108, 159366, 142814, 261362, 401332, 335297, 324340, 251766, 154677, 196208, 250720, 161217, 156370, 155355, 79140, 13516, 201449, 249869, 172274, 92245, 180907, 223062, 127319, 118219, 133473, 63227, 54183, 80648, 167316, 30936, -12210, -3317, 113541, 238346, 289488, 293326]
12997B93326p1156j20186J8384J24389n5179o5874O7311Q9352j17573n1878n8412
12986E2504q286J26370O0367O5843n312j5717j46518r2245k1397P1026R4309P3253
12974B54197n912Q597j42789l5316M1728m3671l6869O2730N1199Q4239j5999K9835
12962B51969p0250L7334J5411K5671K5624j7657j1438m0401m1012M3807J19615
12951C38673O283r3062n6539r7322p9774R6770M6145n9856J3863O3180O0435J47882
12939C86678m7867l7107o5465K6213M0363l3637j29403J12675R4913j2495M7040
12928C81908j52936p8618M411L7857J06262j06320j2020j5639l4813j19442o6695
12917e6045L4976L3057Q6286j8060k7593N8215N6958M7565m6457o5381q0912N5674
$$ y = [293326, 222170, 101984, 120368, 244757, 189578, 123704, 191015, 280367, 162794, 110916, 52504, 44218, 170588, 230955, 296798, 291486, 275769, 129251, 37006, 15609, 86635, 180944, 254197, 248285, 256882, 114093, 78777, 120505, 76834, 39965, 102695, 153894, 238133, 222134, 251969, 181719, 219053, 234464, 260135, 285759, 268102, 256664, 216263, 175251, 219058, 338673, 344956, 251894, 195355, 98033, 18259, 115029, 161174, 101318, 115181, 178361, 238796, 386678, 338811, 301704, 236239, 262452, 302815, 269178, 139775, 252450, 347363, 334868, 381908, 228972, 150354, 154765, 192622, 298884, 192564, 180544, 164905, 130092, 10650, -56045, -21069, 11988, 98274, 80214, 52621, 110836, 167794, 215359, 168902, 103521, 22609, 78283]
12905G8283L8725P568o7697l1431J3833J344P8851Q4645l1031n4221p8552J963
12893D2280R1911J08714q5908o3630n0045q3297L3228K1295L1361M2720R1116
12882A79745N230l8904K8394J947J20908l9102L0744N429j08814K1981o2313o2765
12870H2480R6680N4083l3321k7598L5319J14764P3714j31256j27270P9097R4875
12859C11567Q5860j8747l1366r8529l8093O0737P0222o3182L0365m6334r1198
12848A71302J07671O7677o1230j2060L4027P6405J1313o4424r5353q3667r1866
12837E9795M8321J17796O995k2954k8271j62431M5052J06251j21600O3357J06468
12826B18779N671L2766q2020j52864L4050J65357r5264M7543L4865R9176P3155
$$ y = [78283, 117008, 124576, 56879, 25448, 39281, 40625, 119476, 204121, 173090, 118869, 40317, 42280, 134191, 242905, 156997, 93367, 43322, -39975, -6747, 14548, 45909, 88629, 179745, 184975, 146071, 174465, 176412, 297320, 258218, 288962, 294391, 185577, 207558, 145245, 82480, 179160, 233243, 199922, 172324, 207643, 322407, 396121, 264865, 137595, 216692, 311567, 397427, 378680, 347314, 248785, 210692, 271429, 341651, 278469, 308834, 262500, 171302, 278973, 346650, 285420, 273360, 307387, 383792, 395105, 330681, 235328, 151661, 59795, 108116, 225912, 232907, 209953, 181682, 19251, 64303, 170554, 48954, 112311, 218779, 224450, 257216, 175196, 22332, 56382, 221739, 126475, 174018, 208883, 308059, 381214]
12815C81214k3323r6993K946j26932k3930j2270j0775J01545N3928M1152J08527
12804C95089L8686l8755n0680l1447M3586r1408j36667j8017l0441M2779j383
12793A21342J5939P7711J9519L7319k819K0799K9701o1820k8237R4834r549n1401
12781B63338J0557m0075p6991J25281M4049O2282J50408J9688o1456j79714K51
12770C17618M9379L4755N9115m4602m8160j087J5468n7197o053P8136j27891n7167
12758B12314J01193K7059j50764J4316J46589J26082o7158q0140l6284q342l8986
12747B45879L056j1430p7501m9778K9173j3156N5520R1184L4659j2535J15960
12736D11031k0493j39693j44665M74J27451J8845j0107o618L4762M3047P903j720
$$ y = [381214, 357891, 260898, 263844, 136912, 112982, 100712, 89937, 191482, 245410, 286562, 395089, 433775, 395020, 344340, 312893, 356479, 265071, 128404, 110387, 79946, 122725, 121342, 137281, 214992, 234511, 271830, 269011, 289810, 319511, 257691, 229454, 324288, 314739, 263338, 273895, 233820, 156829, 282110, 326159, 388441, 538849, 558537, 497081, 317367, 317618, 366997, 401752, 460867, 416265, 368105, 367018, 382486, 325289, 319236, 397372, 269481, 212314, 313507, 340566, 189802, 204118, 350707, 476789, 409631, 329491, 293207, 284865, 245879, 248935, 237505, 160004, 110226, 139399, 126243, 181763, 272947, 307606, 295071, 411031, 390538, 250845, 106180, 106654, 234105, 252950, 242843, 236225, 270987, 314034, 321937, 320217]
12724C20217Q0627k6096J7930P3952m056m0077j6338p0354k8174M1124K1528J5725
12712C86008K1769L0047k3700o0943j4988j2035M5067o3935l0806j343j21805
12701A53336l2514R9137m4459o9839m7343K04082J81319m3203J908l3767J0422
12690C79079O0947q0188p7394k9868K5660R036j0291N7950K4630L701K7268j3923
12678C76607p9730j4447p0916K6468N6013j2546n3659N7912j6517P0359k1922
12667C17622N7385l104m5306p90n7689k4197K12951o5444l8432j57696q3053K57687
12655C69934J41054j4685k2423m4216L4191j2950j03989j3628K1071J741n5601
12644C00499J1006J03950P2354m7486j05687j00799q3037J1075J6541K8032L0415
$$ y = [320217, 400844, 374748, 392678, 466630, 462574, 422497, 406159, 335805, 307631, 348755, 370283, 386008, 407777, 437824, 414124, 353181, 338193, 326158, 371225, 307290, 276484, 275141, 153336, 120822, 219959, 175500, 105661, 58318, 262400, 443719, 400516, 402424, 368657, 379079, 440026, 359838, 282444, 252576, 278236, 287272, 276981, 334931, 359561, 363262, 390530, 376607, 296877, 282430, 211514, 237982, 293995, 281449, 227790, 285702, 269185, 339544, 317622, 375007, 371903, 326597, 325807, 268118, 243921, 456872, 391428, 352996, 195300, 112247, 369934, 510988, 496303, 473880, 429664, 463855, 450905, 346916, 333288, 354359, 356100, 300499, 311505, 415455, 487809, 440323, 334636, 233837, 150800, 161875, 178416, 206448, 236863]
12633B36863J22526j9464j04500j1344J41136Q5830k0241R126N0731Q7400P35
12622E78798P1893p0032J1031q9583j8446m2273j08004K4N5136L8118M3366L0823
12610E00851k6694o2347r5860j09946J27295J49951j11847o2752j3444r493J4616
12599C00330n8919J22081k5772J32496k873N79J1862p3646R3385n0282J0365K9953
12587D89559j1516Q837J45504N601o0329o3776k6241n0826j26481M4852L8448
12576C93632k0252k8261l1987M9318L3040N0929Q7285J6300j1369j14286n2069
12565C72280Q2878k783j1434N2176P5860n8771N9821L4001k1831l5526k1400m0500
12553D84771L8737n1795j81326K5286j71O2846N0179m464N0036O9020o3P3845
$$ y = [236863, 359389, 339925, 235425, 224081, 365217, 451047, 430806, 439932, 490663, 578063, 578798, 650691, 580659, 591690, 502107, 483661, 441388, 333384, 333408, 388544, 426662, 470028, 500851, 474157, 411810, 315950, 206004, 333299, 483250, 371403, 308651, 295207, 285714, 300330, 241411, 363492, 337720, 470216, 467343, 467922, 479784, 406138, 499523, 449241, 459606, 489559, 478043, 486880, 632384, 637985, 577656, 513880, 487639, 436813, 310332, 355184, 393632, 373380, 345119, 313132, 362450, 395490, 446419, 533704, 550004, 538635, 424349, 372280, 455158, 452375, 440941, 493117, 568977, 510206, 570027, 604028, 582197, 546671, 525271, 484771, 523508, 471713, 290387, 315673, 315502, 378348, 428527, 424063, 474099, 543119, 543056, 616901]
12541F16901M3338j41543j1418p0993r3105J35309J61823p743j03292m64l1219
12530D97594q3646K3451m0074n6422o5055j5429J34795J79821k1750q0509j3459
12519D59317j5034Q8173K4285j46392N887L9964J35917J16126p3556p6810r61
12508E56916J2601P3366l0695o1109l4204L2196l3447k6345l5373N670J6361j4308
12496D61629N2307m0306L8184l8403N9562J17200O0899k6742l3196m6636o5805
12485E38693j4339O0469J37623R4295j20757J4774m7804n2067r3288N3486P3069
12474F44154J2275k2303o488J43791o6825p5792l2305p1036k8728l1230O4788
12463E30301P0775P8728K6677P9324M9406j47179m144L0505J38241L7601p0914
$$ y = [616901, 660239, 518696, 507278, 436285, 343180, 478489, 640312, 632569, 529277, 528813, 497594, 413948, 437399, 397325, 340903, 275848, 260419, 395214, 575035, 553285, 472776, 459317, 444283, 532456, 556741, 410349, 416236, 456200, 592117, 708243, 634687, 557877, 556916, 569517, 642883, 612188, 551079, 516875, 549071, 515624, 489279, 453906, 459576, 475937, 461629, 513936, 473630, 511814, 473411, 532973, 650173, 711072, 684330, 651134, 604498, 538693, 524354, 584823, 722446, 816741, 695984, 710758, 662954, 610887, 517599, 571085, 644154, 656429, 634126, 627638, 771429, 704604, 628812, 596507, 525471, 496743, 465513, 530301, 601076, 679804, 706481, 785805, 835211, 688032, 683888, 714393, 852634, 890235, 819321]
12452H19321m4675J1492K6622j03338r1749m4635R4521R9120O8354O8129j41339
12441G61823n0131J5357q61M9182M9180o8923m0865R9067L9905m2004K9862q5538
12429G56054j24961k6975O2997p5433l2436J4931P4027Q6956k425r1285J2296
12418F53746o391L9936M0752M6586j0338L7997l0426K7741L5945J6559P1531J28259
12406A051897l8338j61699n2541M6848l6886P8518k2193j3601j5316L9926R888
12395H86503P9606L1430J4653j15331j24815J06552J20125k2722j72982K5861
12385H28880m2423R8711R044n4267l2760J6513k297K1547O4625l6171l339p8870
12373G89193o7094J03876P7977N1074M21p905l9076K2253m4297J29483J87783
$$ y = [819321, 774646, 786138, 812760, 709422, 617673, 573038, 667559, 766679, 835033, 903162, 761823, 711692, 727049, 726188, 775370, 824550, 755627, 714762, 813829, 853734, 811730, 841592, 756054, 631093, 604118, 667115, 591682, 559246, 574177, 648204, 735160, 732735, 641450, 653746, 647355, 687291, 728043, 774629, 764291, 802288, 771862, 799603, 835548, 852107, 923638, 1051897, 1013559, 851860, 799319, 846167, 809281, 887799, 865606, 852005, 836689, 876615, 886503, 966109, 997539, 1012192, 896861, 772046, 878598, 998723, 976001, 803019, 828880, 786457, 885168, 894212, 839945, 807185, 823698, 821401, 842948, 907573, 871402, 868063, 789193, 722099, 825975, 903952, 955026, 955447, 947542, 908466, 930719, 886422, 1015905, 1203688]
12362A203688J1078l8126j23356j09566Q9813J38881L8911j9957q2684J352J8368
12351A128402K9740j272M9579N2123q1510j11985q2477P1090J7178q445J29827
12340A192250P3032J250j73020m2179k2440M5710O8396o1048j02858N0240j3719
12329A015614j3819O8961K2453L6209n6322N9027L3526J6449j2830j03420j0846
12318A055002Q2222J25834j00319p9254J1332R05j8115Q4332O5088J21980l9619
12307A309388r9517j0926l8738r8987J13802J93992M8669o3652j75604J6078K5493
12296A219998K3337o1367p5463j5141r393J53416j9604P579K015m8509R2089P5209
12284A344166M3913q5667r3309j29441M5405J48844K2344l7147J57546M4631l4547
$$ y = [1203688, 1214766, 1176640, 1053284, 943718, 1033531, 1172412, 1211323, 1191366, 1108682, 1110034, 1128402, 1158142, 1156870, 1206449, 1258572, 1177062, 1065077, 982600, 1053690, 1070868, 1062423, 1192250, 1265282, 1266532, 1093512, 1051333, 1028893, 1074603, 1142999, 1081951, 979093, 1029333, 1015614, 1001795, 1070756, 1093209, 1129418, 1073096, 1132123, 1165649, 1182098, 1169268, 1065848, 1055002, 1137224, 1263058, 1162739, 1083485, 1094817, 1095722, 1077607, 1161939, 1227027, 1349007, 1309388, 1209871, 1198945, 1160207, 1061220, 1175022, 1369014, 1417683, 1354031, 1178427, 1194505, 1219998, 1243335, 1181968, 1106505, 1091364, 1081971, 1235387, 1215783, 1223362, 1225377, 1176868, 1268957, 1344166, 1388079, 1302412, 1209103, 1079662, 1125067, 1273911, 1296255, 1259108, 1416654, 1461285, 1426738]
12273A426738l0535Q3797n3486p5555m8386P380j0647K05258L3127j02344J0545
12262A445892j07314M5080J68595J23330n385k39527m1802Q0755o4400q895P1612
12251A467941N3548M3654R1254j18711p8517J51190Q5487l5416K8288R648j9643
12240A678723M9218J03123j652o6228J08706J48853k0429j02382m3922p1802n3694
12229A728514J5535R1817p2796l3347J98065J3203K1247j8492j99513J8915K210
12218A765358M7636N3518K2732P3880J2962N4300N2950o2856K8748M4939o493
12207B087674R76j33072r202R7100Q0915j0712o3227l9479j12656r9053N0544
12196A849808K3916q615J23504R0112n4586L5156J06184J16056J48841P2126j22798
$$ y = [1426738, 1396203, 1480000, 1426514, 1350959, 1302573, 1309953, 1299306, 1504564, 1537691, 1435347, 1445892, 1338578, 1383658, 1552253, 1675583, 1670198, 1430671, 1388869, 1469624, 1405224, 1396329, 1467941, 1521489, 1565143, 1656397, 1537686, 1459169, 1610359, 1695846, 1660430, 1688718, 1698366, 1678723, 1727941, 1831064, 1829412, 1763184, 1871890, 2020743, 2000314, 1897932, 1854010, 1782208, 1728514, 1744049, 1835866, 1763070, 1729723, 1927788, 1940991, 1962238, 1943746, 1744233, 1763148, 1765358, 1812994, 1866512, 1889244, 1963124, 1976086, 2030386, 2083336, 2020480, 2049228, 2094167, 2087674, 2088650, 1955578, 1946376, 2043476, 2124391, 2113679, 2050452, 2010973, 1898317, 1799264, 1849808, 1873724, 1865109, 1988613, 2078725, 2024139, 2059295, 2165479, 2281535, 2430376, 2502502, 2379704]
12185B379704n963K8284K6614k09138k9678L3860P8668k1860r52J69145L1147
12174B479831r574J14282P0455M8551k825j05185Q1709o9598j68582P2987J49657
12163B661708O5549L7328l1759K0872q7828o592J86058K5687Q032J02330j2673
12152B968712j17265r5232p2307N8557N6411Q4254m169n1188J28150R1240l4424
12141C012739r226J9079J02319J57027L3650L3445n1018K4020N0525M8241J42690
12130C563491j4780l6720o7190k5970R3340P9189n9544n2552j72998j03603J60592
12119C363255Q9656k229j9545J2877O9767J46230J17469n0019o3625N2431M3818
12108C760085p5133l9046J66411J65557L1448L0682j2592n1976K9589P934m0360
$$ y = [2379704, 2373741, 2402025, 2428639, 2219501, 2189823, 2223683, 2302351, 2280491, 2279539, 2448684, 2479831, 2470257, 2584539, 2654994, 2703545, 2700720, 2595535, 2677244, 2607646, 2439064, 2512051, 2661708, 2727257, 2764585, 2732826, 2753698, 2665870, 2659278, 2845336, 2871023, 2879055, 2981385, 2968712, 2851447, 2756215, 2683908, 2742465, 2798876, 2883130, 2878961, 2827773, 2955923, 3047163, 3012739, 3003513, 3022592, 3124911, 3281938, 3315588, 3349033, 3298015, 3322035, 3372560, 3420801, 3563491, 3548711, 3511991, 3444801, 3418831, 3512171, 3591360, 3531816, 3479264, 3306266, 3202663, 3363255, 3452911, 3450682, 3431137, 3444014, 3513781, 3660011, 3777480, 3727461, 3663836, 3716267, 3760085, 3684952, 3645906, 3812317, 3977874, 4009322, 4040004, 4027412, 3975436, 4005025, 4012959, 3972599]
12097C972599l0744P6094M796J0495O3176l8945k9302Q1187J3893L3871Q3465
12086D240585J19260R4435J41263m764p5333J9327j5772L9614K4073j6902M4966
12075D610752J84543J29185j6596K08027J17574L4631N5745O080j02380m8026
12065E179535Q869n2867L501N9802P1830L4470o689k1586J88041L3872K8889K6667
12053E554334O9148L9835m8837m0986K2760J50043J25715j1519J16900M9614K1510
12042F048517l4944m3923R9225J56592N5721o156J46778J34090q2992j5799O5873
12031F522982J10208J05412M5161J22333P7624J19255K4409M3653o9254K4862
12021G126645O5328J55049K8701R7325J74887m3103J3691k5502q4635k2161J06861
$$ y = [3972599, 3941855, 4017949, 4022745, 4033240, 4096416, 4057471, 4028169, 4109356, 4123249, 4157120, 4240585, 4359845, 4454280, 4595543, 4590779, 4515446, 4534773, 4519001, 4558615, 4582688, 4565786, 4610752, 4795295, 4924480, 4907884, 5115911, 5233485, 5268116, 5323861, 5329941, 5227561, 5179535, 5188404, 5135537, 5139038, 5198840, 5270670, 5305140, 5298451, 5276865, 5464906, 5498778, 5527667, 5554334, 5623482, 5663317, 5614480, 5573494, 5596254, 5746297, 5872012, 5860493, 5977393, 6027007, 6048517, 6013573, 5969650, 6068875, 6225467, 6281188, 6275032, 6421810, 6555900, 6472908, 6457109, 6522982, 6633190, 6738602, 6783763, 6906096, 6983720, 7102975, 7127384, 7171037, 7101783, 7126645, 7191973, 7347022, 7375723, 7473048, 7647935, 7604832, 7618523, 7593021, 7508386, 7486225, 7593086]
12010G593086J91019K4727r371m358r1210K6921J50144J24828O9856J13743J41303
11999H330688L4046M6279N3964p9791J04002K966J0109R6663k52n2919M7442J19458
11987H712655l4084L771J53087R2124J9622j0806R6456K62937j6909k7097K5780
11976I277536J26805P0805o8916M4002J25523N1665R0879J34773J92280N5305
11966A0100657l1743R7055P5429N4689J05170M2715q0252j5659N6055J1548J34067
11955A0549731R2990j38479j5198M4027J3267N1360J18526N7625p433J72766O8582
11944A1007764j1878j8742J00460Q9876k4536P4478j7930K6576J3723J52219m9419
11933A1342591m9646N9686j5969j08576R221l687L4585O8944m249n361J666N6252
$$ y = [7593086, 7784105, 7808832, 7799461, 7795103, 7703893, 7730814, 7880958, 8005786, 8075642, 8189385, 8330688, 8364734, 8411013, 8464977, 8385186, 8489188, 8492154, 8502263, 8598926, 8598674, 8545755, 8593197, 8712655, 8678571, 8682342, 8835429, 8927553, 8947175, 8936369, 9032825, 9295762, 9278853, 9251756, 9277536, 9404341, 9475146, 9406230, 9450232, 9575755, 9627420, 9718299, 9853072, 10045352, 10100657, 10068914, 10165969, 10241398, 10296087, 10401257, 10443972, 10363720, 10348061, 10404116, 10415664, 10549731, 10642721, 10504242, 10489044, 10533071, 10546338, 10597698, 10716224, 10773849, 10766416, 10939182, 11007764, 10995886, 10977144, 11077604, 11167480, 11142944, 11217422, 11199492, 11226068, 11239791, 11392010, 11342591, 11292945, 11352631, 11336662, 11228086, 11237307, 11233620, 11268205, 11337149, 11332900, 11327539, 11329205, 11385457]
11921A1385457r2869O311J7883J7440R8574p1707o0010M0978M4985n2245m0663
11910A1294134O0293M8338P3938M975q2225p3674j31420P9199n8675l2825J7589
11899A1199647J01889p6181j41239r5323P8282J29764K1887m2778p3958l6655
11889A1065335k5300l8929o2621m9647m6394k0651m5680n2178j80148o3519P2200
11878A0552468p496m9375K4264p9547J738R4054L9144m0596k8755k9015o2412
11867A0414472o634j16912q6638q5491l1475L4711J1929j71727j34568m7767o6474
11856I713426j4109K5896j67322p9756n7334K0567O7105L5419q6518q7267l9588
11845I330519j49397p1846N7235L4122q1651O8090m0491j09940j64847p1561o8707
$$ y = [11385457, 11292588, 11298899, 11316782, 11334222, 11432796, 11361089, 11301079, 11342057, 11387042, 11334797, 11294134, 11354427, 11402765, 11476703, 11481678, 11399453, 11325779, 11194359, 11273558, 11214883, 11182058, 11199647, 11301536, 11225355, 11084116, 10988793, 11067075, 11196839, 11218726, 11175948, 11101990, 11065335, 11040035, 11001106, 10938485, 10888838, 10842444, 10821793, 10776113, 10723935, 10543787, 10480268, 10552468, 10544972, 10495597, 10519861, 10440314, 10442052, 10536106, 10575250, 10534654, 10505899, 10476884, 10414472, 10407838, 10290926, 10204288, 10118797, 10087322, 10122033, 10133962, 9962235, 9827667, 9779900, 9713426, 9699317, 9725213, 9557891, 9478135, 9420801, 9441368, 9508473, 9543892, 9457374, 9370107, 9330519, 9181122, 9109276, 9166511, 9200633, 9118982, 9187072, 9146581, 9036641, 8871794, 8800233, 8731526]
11834H731526o2534L0642j65014j63768j5376L7141l4982N3195n1053j04038k105
11823H253634l12237k06545n3784M1121O1877o299p3240M8561m470k63716P208
11812G492110J36100j12271j12724l9443j17264K0518M8345p3228r3059K0336
11802G169420j30298j12621j15095j2986n5357L863P4804q1092P309o7266j04670
11791F576011m4001l2694o0332L9637j9604l5429j11689K4165L3877l8977o3001
11780F267963j06673j03347p7132j79748j45248p4680n4231P0897K5099q5580
11770E537320r0331p1878p6395R5116P0910J7861j56899j32568M4969Q667l1178
11759E215594N4606n7936j13364k7790p2278r4196r164m4291m4221O1719N3563
$$ y = [8731526, 8668992, 8699634, 8534620, 8370852, 8355476, 8392617, 8357635, 8410830, 8359777, 8255739, 8253634, 7941397, 7734852, 7681068, 7722189, 7784066, 7777767, 7704527, 7753088, 7748618, 7484902, 7492110, 7628210, 7515939, 7403215, 7363772, 7246508, 7267026, 7315371, 7242143, 7149084, 7169420, 7039122, 6926501, 6811406, 6798420, 6743063, 6746926, 6821730, 6740638, 6747947, 6680681, 6576011, 6532010, 6499316, 6438984, 6478621, 6459017, 6423588, 6311899, 6336064, 6369941, 6330964, 6267963, 6161290, 6057943, 5980811, 5801063, 5655815, 5581135, 5526904, 5597801, 5622900, 5537320, 5446989, 5375111, 5298716, 5393832, 5464742, 5482603, 5325704, 5193136, 5238105, 5246772, 5215594, 5270200, 5212264, 5098900, 5071110, 4998832, 4904636, 4895472, 4851181, 4806960, 4868679, 4922242]
11748D922242j13296q9915J5043l1590m2027o5636L2375K1693K0232J9422k9753
11737D658790j36575q4713k1443p5570n9871q497m4718j71307n6303J08996J9073
11726D127862j8687j28026k1941K9110Q746O3418J41661p3048j12783k7023q560
11715C980729r9328p8776r7666p6975n5441o8727l9899J778n1935J13412l888
11704C523284j3187m7884k5057n080q0730Q2844K0110r8753l7151j7406k1300
11693C279690l0288p4757L8287K1973K7169j3660k0857P3926j9122Q685n4850
11682C236196r2000J68j02160r0980r0990K189N043N7327K2958m5776j32031l8687
11670B731257Q159J4165O9676L7850r4809j25218p2476K3963q0357n7253K8272
$$ y = [4922242, 4808946, 4719031, 4734074, 4702484, 4660457, 4594821, 4627196, 4648889, 4669121, 4688543, 4658790, 4522215, 4437502, 4416059, 4340489, 4280618, 4272121, 4227403, 4056096, 3999793, 4108789, 4127862, 4109175, 3981149, 3959208, 3988318, 3997064, 4060482, 4202143, 4129095, 4016312, 3989289, 3980729, 3881401, 3802625, 3704959, 3627984, 3572543, 3503816, 3463917, 3465695, 3413760, 3527172, 3523284, 3510097, 3462213, 3437156, 3432076, 3351346, 3434190, 3454300, 3355547, 3318396, 3300990, 3279690, 3249402, 3174645, 3212932, 3234905, 3262074, 3248414, 3227557, 3301483, 3282361, 3291046, 3236196, 3144196, 3144364, 3042204, 2951224, 2860234, 2862423, 2867466, 2924793, 2947751, 2901975, 2769944, 2731257, 2739416, 2753581, 2823257, 2861107, 2766298, 2641080, 2568604, 2592567, 2512210, 2454957, 2483229]
11659B483229k6540K0768p7382n8162m0730M2577r5389J47124J53033k3990j30073
11648B394465j3497J3990p200J059k6375j4755r4026M8612n7539N1729l0763J133
11636B266833p3961M8100O8721R5084J787L1826m8926j7612q3077l0133R902j17902
11624B150642j674p4749m5949O5239k3663o9995J2889M7671n1075j18263N2274
11613A943347O1952j2288j15818M797j34869M8326J16889L6688N7077l4688j04224
11602A867189K8687M8056N6070o2749o4664j60079r2463N3507M5372k6173O261
11591A699014l8218Q1201r913j21422J7028Q4906J20442o9771n2477j12083N0119
11580A648826k6318q857K4631l6370k5787o4828n6564k6253J05833R6124R7067
$$ y = [2483229, 2456689, 2477457, 2400075, 2341913, 2301183, 2343760, 2248371, 2395495, 2548528, 2524538, 2394465, 2380968, 2394958, 2387758, 2388817, 2362442, 2347687, 2253661, 2302273, 2244734, 2296463, 2265700, 2266833, 2192872, 2240972, 2309693, 2404777, 2406564, 2438390, 2389464, 2371852, 2288775, 2258642, 2268544, 2150642, 2148968, 2074219, 2028270, 2093509, 2069846, 1999851, 2012740, 2060411, 2009336, 1891073, 1943347, 2005299, 1993011, 1877193, 1881990, 1747121, 1795447, 1912336, 1949024, 2006101, 1971413, 1867189, 1895876, 1943932, 2000002, 1937253, 1872589, 1712510, 1620047, 1673554, 1718926, 1692753, 1699014, 1660796, 1741997, 1732084, 1610662, 1627690, 1712596, 1833038, 1763267, 1710790, 1598707, 1648826, 1622508, 1613651, 1638282, 1601912, 1576125, 1511297, 1454733, 1428480, 1534313, 1630437, 1727504]
11569A727504k3236j6936q0089j40381r6803j20454j19170O8444K03539k3748
11559A378670L2081J0834N5005J1151m6303j1356l1508q2914J0766M1462K7104
11548A394992O4172n6717O8514K3222q4721o3254J33609k0804j62127j42445J5109
11537A169550j6321J2734P1514L9696L7054L8388K093r3029J3810N9574L0450
11526A365513n6515l5202j54639j5212J15107K6808j2606j58482j75516j406J36724
11515A034574J59474o869o3569O1558l1479Q5826J1637p6507M4753O496n4384
11504A171510m5834n4418N909p4928l3302k3967J2469J35263j16847j92053p9632
11493G04170K32017J23096L6658j5807m600k3802j1049j5250o2676q6323O8673
$$ y = [1727504, 1704268, 1687332, 1607243, 1466862, 1370059, 1249605, 1130435, 1198879, 1402418, 1378670, 1410751, 1421585, 1476590, 1487741, 1441438, 1430082, 1398574, 1315660, 1326426, 1367888, 1394992, 1459164, 1402447, 1470961, 1494183, 1409462, 1346208, 1479817, 1459013, 1296886, 1154441, 1169550, 1153229, 1165963, 1237477, 1277173, 1314227, 1352615, 1354708, 1261679, 1275489, 1335063, 1365513, 1308998, 1273796, 1119157, 1103945, 1219052, 1245860, 1233254, 1074772, 899256, 897850, 1034574, 1194048, 1187179, 1123610, 1185168, 1153689, 1239515, 1251152, 1174645, 1219398, 1225894, 1171510, 1125676, 1071258, 1077167, 1002239, 968937, 944970, 957439, 1092702, 975855, 783802, 704170, 936187, 1059283, 1095941, 1080134, 1075534, 1051732, 1040683, 1025433, 962757, 876434, 945107]
11482I45107j7615J3513l4096R7313O8496l9057R46O0507n0500n2495J7525K3372
11470A033016M8549j6153j2449L8236P3336K5484j76539m3395M1144q5961j62360
11459G62908n9681Q9157r294M5324l3745n7964K1933M530L8476J29526M1736m4339
11447I28567p2110M6072M4129n7127k6968J09788j7882p839O0452j10210j02074
11436G94798l3127J8501J56305q4632j40356j4504Q617r8763R9545J49685J05446
11425I61515j0570l0248j09046j00130P9057K2358o3676j17621M2941K31670O3290
11414I69540l7885j28280n1678Q1452Q3994o9719L6213j8323j5812P9277j88967
11403G39812j19857l2943J5117j6545o384R6047J23810K5175q8312l2994j5761
$$ y = [945107, 927492, 941005, 906909, 1004222, 1072718, 1033661, 1034607, 1095114, 1044614, 992119, 1009644, 1033016, 1081565, 1065412, 1052963, 1091199, 1164535, 1190019, 1013480, 970085, 1011229, 925268, 762908, 703227, 792384, 783090, 828414, 794669, 736705, 758638, 763168, 801644, 931170, 972906, 928567, 856457, 902529, 946658, 889531, 862563, 972351, 954469, 946630, 1007082, 896872, 794798, 761671, 780172, 936477, 851845, 711489, 696985, 705602, 606839, 706384, 856069, 961515, 950945, 920697, 811651, 711521, 790578, 812936, 749260, 631639, 674580, 906250, 969540, 931655, 803375, 751697, 833149, 917143, 847424, 883637, 865314, 849502, 928779, 739812, 619955, 587012, 602129, 585584, 579200, 675247, 799057, 824232, 735920, 702926, 687165]
11392F87165l3271k9112J8971J21265N2742q245q695j5114O3308J5828n3722l5007
11380G76113j10653r1040O4896o7606j34280j0483L9380J69248J5419J750k8655
11369F24089M2542K5420P678m8832q0893l4841P7465Q2531J7682n7374n0141J1181
11357F16507q3534j04354J5247N8698K1389m9137n4571J32036O1429P7591K2438
11346G13739N6030q7723r1234M5521Q10J5727J6333N1685K4401m7827q1518j02543
11334E13401K9367J08123J6167n8294L4112p5980n8194P5401J8809j05707p8643
11323D18562r3852j7470M9780Q414n0038J1004P6933J03404p4746Q1187k1089
11312D92089j52805K3455P2446J06889r538m9917j5090n5727j5162M7179K7355
$$ y = [687165, 653894, 624782, 643753, 765018, 817760, 809515, 800820, 785706, 849014, 864842, 811120, 776113, 665460, 574420, 639316, 571710, 437430, 426947, 466327, 635575, 650994, 652744, 624089, 666631, 692051, 699729, 650897, 570004, 535163, 612628, 695159, 712841, 655467, 605326, 616507, 532973, 428619, 443866, 502564, 523953, 474816, 420245, 552281, 613710, 691301, 713739, 769769, 682046, 590812, 636333, 637143, 652870, 669203, 720888, 745289, 697462, 615944, 513401, 542768, 650891, 667058, 608764, 642876, 566896, 508702, 584103, 602912, 497205, 418562, 324710, 307240, 357020, 365434, 315396, 326400, 403333, 506737, 431991, 513178, 492089, 339284, 362739, 435185, 542074, 532536, 482619, 467529, 411802, 396640, 443819, 471174]
11301D71174p3148l9649l9341M2610j1492J4052J1592Q9377J40092m9217j80742
11290C75308l9794O6121o0725r606J9378P6173N3880J09733J1127N9994o0914
11279F00675j01254l2697m141p3751L4674L4291R4436Q8788L562p110j74700l6067
11267D26706l5066O2657L2427Q4170J01415M2275j3728o6463o1611L8542Q7760
11256F99084M9832p2274q0685j1005K609m2303r6500N0114n934r6621j8031M4707
11244D22993N8712p7423j42326j19816n8544J5030m0289J2865K6174J38645M9922
11233B85943j4316N8803o693Q1030j16864j2211R0491j101J1189k0565q7099J82
11221B68789O6486r1034m0630Q1091M5052L4725L4162p98l4085N5425k2430j76837
$$ y = [471174, 398026, 358377, 319036, 361646, 350154, 364206, 375798, 465175, 605267, 556050, 375308, 335514, 401635, 340910, 331304, 350682, 426855, 480735, 590468, 601595, 661589, 600675, 499421, 466724, 462583, 388832, 423506, 457797, 552233, 641021, 644583, 637473, 462773, 426706, 391640, 454297, 486724, 570894, 672309, 714584, 700856, 634393, 572782, 611324, 699084, 748916, 676642, 595957, 584952, 587561, 545258, 448758, 498872, 492938, 396317, 378286, 422993, 481705, 404282, 261956, 142140, 83596, 98626, 58337, 71202, 97376, 236021, 285943, 271627, 330430, 323737, 404767, 287903, 275692, 366183, 365082, 376271, 355706, 268607, 268789, 335275, 244241, 203611, 284702, 329754, 364479, 398641, 397843, 363758, 419183, 396753, 219916]
11209B19916j14401k1383P2743M8831R7858N0989P6238K9102j5796o6947q5768
11198B91382n3127j300P4620O8504o8622P8343R1976j34931q0677K4591L7848
11187C28607R3142q0553o876L3327k6295r2799J0888J13692J2228j12299n7877
11176B15185O1354j9135J34988O535l2808O6258J0163j09361r4830r8771L4333
11165A73911J82129O4009o9833L4463N5225o8629j2511J24294N1571j0894K2461
11154E46196j07044j13685m5242M8019R3811K794j2478K3664L2387L7087r5511
11143D09998j00557j7436m1834J1118l7696J6479p560K7143j24955k6931k9767
11132G8002P9438P1932K1988l0266O395O7012J8051N9426K2283r8910o8248M9673
$$ y = [219916, 105515, 84132, 156875, 205706, 303564, 354553, 430791, 459893, 444097, 377150, 291382, 238255, 236955, 311575, 380079, 311457, 389800, 481776, 346845, 266168, 290759, 328607, 421749, 341196, 334320, 367647, 341352, 248553, 259441, 373133, 385361, 273062, 215185, 276539, 257404, 392392, 398927, 366119, 432377, 442540, 333179, 238349, 139578, 173911, 356040, 420049, 350216, 384679, 439904, 371275, 358764, 483058, 534629, 523735, 546196, 439152, 325467, 280225, 328244, 422055, 424849, 412371, 436035, 468422, 505509, 409998, 309441, 292005, 250171, 261289, 223593, 240072, 232512, 259655, 134700, 107769, 78002, 157440, 229372, 251360, 221094, 227489, 294501, 312552, 371978, 394261, 295351, 227103, 276776]
11120B76776J13136K957N9343j36522q8327k3548k0228l9334l9772L2833N0444
11109A87758k3555n9279l0955P900P9930N7338k346N3393K0824L4216q3594j0629
11097B31001P4251J04808m972n6037o6001K129Q3078r5684o6808j4878J70634
11086C61521K5490n5448L213K6117r1543o047K6958N4777j12507n680j703J37479
11074C62627P3026n7960n8459q3626k2702o32K994J8019J25457M9750q2200k2949
11062C03345j04812k2514m5442q5169l7989J05137J45792k3601l4160o8715p6797
11051E5075J58397J01553K771o0008m9946l1671k6895j22837j6125N9213K4111
11040I3638l2613K1644J13294J22894J8956M1073N2179L2201o7575j48651J12322
$$ y = [276776, 389912, 392869, 452212, 315690, 227363, 203815, 183587, 144253, 104481, 137314, 187758, 164203, 104924, 73969, 81869, 161799, 219137, 216791, 270184, 291008, 325224, 241630, 231001, 305252, 410060, 405088, 349051, 283050, 285179, 368257, 272573, 205765, 190887, 361521, 387011, 331563, 334776, 360893, 269350, 263303, 290261, 345038, 232531, 226851, 225148, 362627, 435653, 377693, 319234, 235608, 212906, 212274, 215268, 233287, 358744, 408494, 326294, 303345, 198533, 176019, 130577, 45408, 7419, 112556, 258348, 234747, 200587, 131872, 55075, 213472, 315025, 317796, 257788, 207842, 176171, 149276, 26439, 10314, 69527, 93638, 61025, 82669, 195963, 318857, 337813, 378886, 431065, 463266, 395691, 247040, 359362]
11029C59362J34533r531M6052J23149J0860L8311j9644N689r9793l756Q9275J61491
11017H35998j7283l6293q0709K9254M9720L9311P6656K1421o0341j23876j0447
11006G23411k759r359P0542l2371r8393N5840L4694L9192p1892j37429j0235P6405
10994F37646P664r6463N8985L7710j57946n6423L9548M8184N3198l0298L1664
10983E73469R3840m4774N5589Q4775M5002j3203J94919K42802J59774K99473L81797
10972B073463K64318N5863J04860P5543J6669M0863r0460j55849l26257m58847
10962A600166l58132k69237l0485j05461r4293P693l8055o8549l3360n8582N0215
10951F01920J944j00408n1067p0940q574m585j02392l5375r1478m105P4780M2761
$$ y = [359362, 493895, 484364, 530416, 653565, 664425, 702736, 683092, 688781, 588988, 585232, 674507, 835998, 818715, 782422, 701713, 730967, 780687, 819998, 896654, 918075, 857734, 733858, 723411, 720652, 711293, 781835, 749464, 651071, 706911, 741605, 780797, 708905, 571476, 561241, 637646, 645310, 548847, 607832, 645542, 487596, 431173, 470721, 518905, 572103, 541805, 573469, 667309, 622535, 678124, 762899, 807901, 794698, 989617, 1232419, 1392193, 1691666, 2073463, 2337781, 2393644, 2498504, 2574047, 2590716, 2631579, 2541119, 2385270, 2059013, 1600166, 1242034, 972797, 942312, 836851, 742558, 750251, 712196, 643647, 610287, 551705, 601920, 603864, 503456, 452389, 381449, 372875, 368290, 265898, 230523, 139045, 134940, 209720, 252481]
10939B52481R555K9537M9543O270k8047O2671k0764q1788j10738L6618r7877J8259
10927A25720N4696l7392K6463J72120p750q4698l9697O7707N1690l552j63306
10916A62001o2952K0907J96293K6131p9861l4338l8488q3246l7281M5074J14923
10905B29163J03600n7622N8249q053J0739O774j53321r8328K6233N4462M8593
10894B20489n0453P0424P502o4692M5294J105j94112j0558n144m1502Q1011Q5230
10882A44594o1778l7561J04569J10942N1764R5121M4154j8126n5867J1812n6260
10871C33364n2276N805m5937J18460J04964q1863p9784M1971k4348m2242o2643
10860B15471j02439q833J21130R6063k097k9790p454j7744l4242R7589J34762
$$ y = [252481, 262036, 291573, 341116, 347386, 319339, 382010, 361246, 279458, 168720, 205338, 107461, 125720, 180416, 143024, 169487, 341607, 333857, 249159, 209462, 277169, 328859, 325307, 162001, 99049, 119956, 316249, 342380, 262519, 228181, 189693, 106447, 69166, 114240, 229163, 332763, 275141, 333390, 325337, 336076, 342850, 189529, 91201, 117434, 171896, 220489, 170036, 240460, 247962, 183270, 228564, 229669, 35557, 24999, 19855, -21647, 59364, 144594, 82816, 45255, 149824, 260766, 312530, 407651, 451805, 433679, 377812, 389624, 333364, 281088, 286893, 240956, 359416, 464380, 382517, 302733, 344704, 320356, 278114, 215471, 113032, 104199, 225329, 321392, 319295, 289505, 282051, 264307, 230065, 327654, 462416]
10849D62416O7845p7310j33621n0482n2352K4465p5105M4226R1638M7577k6394
10838C22903p5102L0092n8129m0190J15586q364K7005J23152p4633q4405N850
10827B83765M0214L4049m817O9887N3663p7686l3584P6210M6707M3374N132o3306
10815D73608m7345j01358L6762O3570N6570M351n3721o8327q5382j49463P7361
10804B06626R3701j0614r9102P693R560O1740p9240r004j2123J30201R320j40531
10792A68227O9280J12352N6924o5956j36429M8722P6710n722j46155p5014j34345
10781c1406J34251J25037Q5292j8625j12019J6896r2590l1708R1835j3950L7567
10770A90580P0007l5410N6046M4787p7909k7204n054j9684N799l5423q813O600
$$ y = [462416, 530261, 452951, 319330, 268848, 216496, 240961, 165856, 210082, 301720, 349297, 322903, 247801, 277893, 219764, 179574, 295160, 286796, 313801, 436953, 362320, 277915, 283765, 323979, 358028, 353211, 423098, 476761, 399075, 365491, 441701, 488408, 531782, 536914, 473608, 426263, 324905, 361667, 425237, 481807, 486158, 432437, 364110, 278728, 129265, 206626, 300327, 289713, 190611, 198304, 207864, 269604, 190364, 181360, 169237, 299438, 308758, 168227, 237507, 349859, 406783, 340827, 204398, 253120, 329830, 324108, 177953, 102939, -31406, 102845, 227882, 313174, 294549, 182530, 199426, 106836, 75128, 166963, 153013, 190580, 260587, 225177, 281223, 326010, 248101, 220897, 215843, 196159, 201958, 166535, 157722, 164322]
10758A64322M1477o2528l456K2218J4433l4664k352R931J45837J11497p6327O575
10746C36963J04157n7484K2158M3744j52591j01661m2217j6922M467N132R6707
10735B42453M7877M802k2115k6619p4404o4343J40104Q4926N8673j0869M7172
10724D27657J8230n2063m7548K2231J7895J4319o7635j6433p2713j06361Q2561
10713B20140J19712k1798m7701M4469J05914K069L9012O2584o301q3082r5463
10702C39555p3309N0373L7139o4598j23311M225N9823m9615p0444m6312J8836
10691H2362J11301j5019j8273P2299L1797M1454P1241J29517J71677L1573N5670
10680G65599N1024Q8253J11484J8231n4366l8991k0938m8905j07110r8600o4110
$$ y = [164322, 205799, 143271, 139815, 162033, 176466, 141802, 139450, 149381, 295218, 406715, 330388, 336963, 441120, 383636, 405794, 449538, 296947, 195286, 153069, 136147, 140614, 145746, 242453, 290330, 295132, 273017, 246398, 171994, 107651, 247755, 332681, 391354, 380485, 427657, 445887, 393824, 346276, 368507, 386402, 400721, 333086, 316653, 243940, 137579, 220140, 339852, 318054, 270353, 314822, 420736, 422805, 461817, 524401, 518100, 435018, 339555, 266246, 316619, 353758, 289160, 165849, 170074, 229897, 180282, 109838, 63526, 82362, 193663, 178644, 160371, 232670, 264467, 305921, 377162, 506679, 678356, 709929, 765599, 816623, 904876, 1016360, 1034591, 980225, 941234, 920296, 871391, 764281, 665681, 601571]
10669F01571P6232q173L0909J08969K8013k2570J42243J27629k6523m3220O0502
10658A075582k9914k6633J67148J78283L8120m5665J557j2118k7933k857j246
10647A314324J0633N2645J51276P5304m0760N0502J98626R8804j93313m8123J61931
10636A831849O3848K4760J48834J10121M7270J05829K07976K78002L00811K66150
10626C385450K63576L29188L33452K53556L78973N21167N23040N83424Q02302
10617G374128J117746J374702J759960K217396K915640L499647L677081L470215
10609B7406515L229055K977839K761464K961530L286717L442315L319777L236128
10601E2621340L797258M621451N300846N049805M288667L767930L779079M333821
$$ y = [601571, 677803, 669630, 700539, 809508, 837521, 814951, 957194, 1084823, 1058300, 1015080, 1075582, 1045668, 1019035, 1186183, 1364466, 1402586, 1356921, 1358478, 1346360, 1318427, 1315570, 1314324, 1324957, 1377602, 1528878, 1604182, 1563422, 1613924, 1812550, 1911354, 1718041, 1669918, 1831849, 1895697, 1920457, 2069291, 2179412, 2226682, 2332511, 2540487, 2818489, 3119300, 3385450, 3649026, 3978214, 4311666, 4565222, 4944195, 5465362, 5988402, 6571826, 7374128, 8491874, 9866576, 11626536, 13843932, 16759572, 20259219, 23936300, 27406515, 30635570, 33613409, 36374873, 39336403, 42623120, 46065435, 49385212, 52621340, 56418598, 61040049, 66340895, 71390700, 75679367, 79447297, 83226376, 87560197]
10593H7560197M820752M715790L693953K511671K582658L867207N139774N081559
10585A19973561M301520L842330M107180M950716N675237N472278M038340L180686
10577A55541848M910518R797564J6763061K5408253L7103056N1656040O3275830
10570C64456170O0158435L9395965J7198979O986766N647919Q456393R657100
10563E11957727m273678l9193622p3271894q0000173o3616777m4591469l0973984
10556A76036130k2812789j8006716j4978597j2791971j0664777q793653p356545
10549H0631082n987846m795007l821635l402924l277462l063982k441086k002279
10541E1838861j864986j871941j943252k261126k289883k188070j901769j673886
$$ y = [87560197, 92380949, 97096739, 100790692, 103302363, 105885021, 109752228, 114892002, 119973561, 124275081, 128117411, 132224591, 137175307, 142850544, 148322822, 152361162, 155541848, 160452366, 170249930, 187012991, 212421244, 249524300, 301180340, 364456170, 424614605, 464010570, 481209549, 488196315, 493844234, 502300627, 511957727, 507684049, 468490427, 395218533, 315218360, 251601583, 207010114, 176036130, 153223341, 135216625, 120238028, 107446057, 96781280, 87987627, 80631082, 74643236, 69848229, 66026594, 62623670, 59346208, 56282226, 53841140, 51838861, 49973875, 48101934, 46158682, 43897556, 41607673, 39419603, 37517834, 35843948]
10533C5843948j511160j429448j169236j157567j268532j208100r03651q02280
10525B6393974q85676q41225p16107o89728p22567o85956n08681o23664p20083
10516B0000287o66858m70334m73783n45148n03901m57862n41229n05383l39604
10507A5496185l71289m66534m44219m22372l57858l26280l86426l07344m08684
10498A2005179n51996k39375k66847k30076k63682l12821q5942q5669k36040k21236
10488I511495j84540l51398k72760r0003k21237k62615j84258k82905j14441j71182
10478G376156k14899j50347j36293j4597j27474k98912m2130o3311q3621j17436
10468F127136k18388j40967n5299J2176p5534j17890q3203j99989k04918l6316
$$ y = [35843948, 34332788, 32903340, 31734104, 30576537, 29308005, 28099905, 27196254, 26393974, 25508298, 24667073, 23950966, 23261238, 22538671, 21852715, 21344034, 20720370, 20000287, 19333429, 18863095, 18389312, 17844164, 17340263, 16882401, 16341172, 15835789, 15496185, 15124896, 14658362, 14214143, 13791771, 13433913, 13107633, 12721207, 12413863, 12005179, 11453183, 11213808, 10946961, 10716885, 10453203, 10140382, 10054440, 9968771, 9732731, 9511495, 9326955, 8975557, 8702797, 8612794, 8391557, 8128942, 7944684, 7661779, 7547338, 7376156, 7161257, 7010910, 6874617, 6860020, 6732546, 6433634, 6391504, 6328193, 6244572, 6127136, 5908748, 5767781, 5712482, 5724658, 5649124, 5531234, 5448031, 5248042, 5043124, 5006808]
10458E006808l2160k02905j47009j09526q4134l9989q6850j824m5677k7039K4723
10447D254418J4768L9504l8787J43877P0693k7306o8284q6336j27055n749N8135
10436D227878k37929k19768r6486k01004k16966j78805p5576Q6916L9896m7355
10426C080801m8999j05652M5412P0941m9185j17457j49958j03882K0178n8182
10416B584017n2314q0113j5013j54747m2093M8890j24036J1424J43990J70615
10406B490620m8844j56289j06718j78099k7475J61784q5828j64780o3209M5627
10396A866789M9495j11750j7189k5535N5833L9652r0256j38191O5869j0667o4485
10385A619565n0574o3595m0422q1536K1046o0429q3484p6750N8219J4780o1936
$$ y = [5006808, 4974648, 4771743, 4624734, 4515208, 4431074, 4391085, 4304235, 4302411, 4256734, 4229695, 4254418, 4269186, 4308690, 4269903, 4413780, 4484473, 4457167, 4388883, 4302547, 4175492, 4169743, 4227878, 3989949, 3770181, 3673695, 3472691, 3255725, 3076920, 3001344, 3088260, 3128156, 3080801, 3031802, 2926150, 2971562, 3042503, 2993318, 2875861, 2725903, 2622021, 2642199, 2584017, 2531703, 2451590, 2436577, 2281830, 2239737, 2288627, 2164591, 2176015, 2320005, 2490620, 2441776, 2285487, 2178769, 2000670, 1973195, 2134979, 2049151, 1884371, 1821162, 1866789, 1916284, 1804534, 1787345, 1761810, 1817643, 1857295, 1767039, 1628848, 1694717, 1684050, 1619565, 1568991, 1505396, 1464974, 1383438, 1404484, 1344055, 1260571, 1183821, 1242040, 1256820, 1194884]
10374A194884O4306O330j18937j12402j53778O766J3860M1214Q5608J26221P2933
10363A227005r1835L9886L7843J0592m3164j84914L6337N629r3438l3931j82940
10352G27070j45840P8004J54039q09R312P6381R8183J04675j05648r4682P3082
10341I73767o0274j20857j12117o3301J15755J06167N0013o3693l4988O9057K1935
10330H81464l3360q6730J9897R8001n404N461j34888L139r2139L8106K6699j19298
10318F00948J06450P716j3209k4296M400p3914m5971J12715M0815N4587J5714
10307G85955j46840j20060p8640q9993P5682O5111r3450r9701j3862Q8530N3459
10296D26191k0832J14591O2493K7778n6702j43352R6816K5525m8601k8104N4500
$$ y = [1194884, 1259190, 1265520, 1146583, 1034181, 880403, 887169, 901029, 942243, 1027851, 1154072, 1227005, 1135170, 1175056, 1212899, 1223491, 1180327, 995413, 1031750, 1037379, 943941, 910010, 727070, 581230, 659234, 813273, 812464, 821776, 898157, 996340, 1101015, 995367, 900685, 973767, 913493, 792636, 680519, 617218, 732973, 839140, 889153, 825460, 790472, 859529, 881464, 848104, 761374, 781271, 879272, 873868, 879329, 744441, 747580, 655441, 693547, 720246, 600948, 707398, 715114, 701905, 677609, 682009, 608095, 562124, 674839, 715654, 770241, 785955, 639115, 519055, 440415, 350422, 426104, 491215, 397765, 298064, 284202, 372732, 426191, 405359, 519950, 582443, 610221, 553519, 410167, 506983, 532508, 483907, 455803, 510303]
10285E10303L5141j1107q3314Q148J12074r7484K6831O7089N3127K045j62895
10274D59958k8919L8492l0172O7099j41704k08295J62464J49415j6956o1073J3704
10263D04013J13228j24400l023o8528J2052o6363n6204J34475O778j01240p4540
10252A76248n8867R1826R9882J23485L2741J5870M7012n1603N6251j7787J2419
10241E27477J5846p5964j31658J2317n197n8433N8374J13446R9121k455p3036
10230D79838M7717q9919m7849N666o002l9911j51298L9742M2959n0828j03211
10219A26904J8389Q5536o026o1012n4487j01848o9194J87859N9792p7160Q3956
10208A92709q303Q8629P2355n7595P4972O1970J8187l6133K8752K3976k674k1823
$$ y = [510303, 545444, 534337, 451023, 459171, 571245, 473761, 500592, 567681, 620808, 622853, 459958, 431039, 469531, 439359, 506458, 364754, 156459, 318923, 468338, 451382, 390309, 404013, 517241, 392841, 389818, 321290, 333342, 266979, 210775, 345250, 352028, 250788, 176248, 117381, 209207, 309089, 432574, 465315, 481185, 528197, 476594, 532845, 515058, 527477, 543323, 467359, 335701, 348018, 342821, 284388, 342762, 456208, 555329, 552874, 479838, 527555, 437636, 389787, 395453, 389451, 349540, 198242, 237984, 280943, 230115, 126904, 145293, 230829, 224803, 163791, 109304, 7456, -61738, 126121, 185913, 108753, 192709, 184406, 273035, 345390, 287795, 362767, 424737, 442924, 406791, 435543, 459519, 456845, 435022]
10196D35022j13928q26O0246j2935j46627l2422N6324N3303j84388p4539M4061
10185H3291Q1980N0639P1035P1719J86501Q6230n9951m3856J47464o5555Q887
10174F18384J03180r8607m9736k3225L6385J35107J43900q0949R2280K90116L02333
10163A469168L23049L54038K15795K41056J58069L9602m225N9376J27271J9425
10153C002624l30677m55980l70585r5912j35339j53016q3962K6288O4329q1583
10143A386187n853p4894m930j20218r6906p818L3442l3351n2761P8483Q5013n375
10131A181019l2725j261k0480j56581n5519R4132K8719n641R5026K8385j67932
10120I87142o9105j4129m6418p476n017p1722o2436k3215r360K5933j7804j52645
$$ y = [435022, 321094, 320268, 380514, 367579, 220952, 188530, 244854, 298157, 113769, 39230, 83291, 165271, 215910, 286945, 358664, 545165, 631395, 571444, 527588, 675052, 609497, 618384, 721564, 622957, 573221, 549996, 586381, 721488, 865388, 784439, 876719, 1166835, 1469168, 1792217, 2146255, 2362050, 2603106, 2761175, 2800777, 2796552, 2855928, 2983199, 3002624, 2671947, 2215967, 1845382, 1749470, 1614131, 1461115, 1377153, 1403441, 1467770, 1386187, 1380334, 1305440, 1300510, 1180292, 1083386, 1075568, 1109010, 1075659, 1022898, 1101381, 1186394, 1181019, 1148294, 1147033, 1126553, 969972, 914453, 1008585, 1037304, 1031663, 1126689, 1155074, 987142, 918037, 903908, 857490, 850014, 844997, 773275, 710839, 687624, 678264, 704197, 686393, 533748]
10108E33748o1038j0357m0466l0923M1050N4765K506J5261N1619k7172j8506q0482
10096D30005p1229N1105j7389m6690j6250Q4559j21616L7907J50998R445r8820
10085C92025j25050l6459M2236J52736M9394k5388p1632L8993j1826P0682L5158
10074E10869n3869j39254J2631M7431P2398r8331l851O3382L1801Q3451k6295
10063E00363l0180l7355k0190l5213o6369r8825k7150j6801j50454L9324P4365
10052A31515M5326L9263N246L2254N9451j9389l4947L9914n252k3847j79438l5539
10040E4557K2948K8369k674O435J6036j3118J08211J3399J59217q2143j06872
10029B04365l8180l5209k427m527Q6193J13524j6610n2771M607M8445o87P902
$$ y = [533748, 472710, 462353, 421887, 390964, 432014, 486779, 489285, 504546, 556165, 528993, 510487, 430005, 358776, 409881, 392492, 345802, 329552, 414111, 292495, 330402, 481400, 490845, 392025, 266975, 230516, 272752, 425488, 474882, 449494, 377862, 416855, 405029, 475711, 510869, 457000, 317746, 330377, 377808, 450206, 351875, 348024, 411406, 443207, 526658, 500363, 470183, 432828, 412638, 377425, 311056, 212231, 185081, 168280, 17826, 57150, 131515, 176841, 216104, 221350, 253604, 313055, 293666, 258719, 298633, 293381, 269534, 90096, 54557, 77505, 105874, 103200, 109635, 125671, 112553, 220764, 234163, 393380, 311237, 204365, 166185, 130976, 128549, 124022, 210215, 323739, 307129, 254358, 258965, 307410, 306723, 314625]
10017C14625r7178p101J00508N9627J5210q1091l714m1180j16155l0658j4063
10006I8830J020j5726j963r0732K7668J54152N408K5093K0341L1704N5520O4086
9994C75401p3827p3564j7974K731K1659n1547Q9720R1517m0381p2850q803J1853
9982B53935m7373J40029j8648N00M892J3665N285P4940k9972m9784L1597j2984
9970C66082n1796j32997p7934n2088J83280R529j9361l8993j54685P0094O2649
9959A63780L1481l1592M8005Q0593m7266p9106k1769M308L3788P0816j09911j09431
9947C3696j05839Q4813J0275p4776l5827O0272J32334Q9982K1086P2868j17765
9936A71119J7015l3336j0572o6358k5071R6412O3172j6064j05193k9053N57k8033
$$ y = [314625, 217447, 210346, 310854, 370481, 385691, 304600, 300886, 259706, 143551, 112893, 98830, 99850, 84124, 82161, -8571, 19097, 173249, 178657, 203750, 224091, 255795, 311315, 375401, 301574, 228010, 210036, 212767, 234426, 182879, 272599, 364116, 323735, 250885, 242082, 253935, 206562, 346591, 327943, 328443, 333335, 347000, 352285, 427225, 397253, 347469, 379066, 366082, 314286, 181289, 103355, 51267, 234547, 244076, 224715, 185722, 31037, 101131, 163780, 195261, 163669, 211674, 292267, 245001, 165895, 144126, 148434, 182222, 253038, 143127, 33696, -72143, 12670, 22945, -51831, -87658, -27386, 104948, 194930, 216016, 288884, 171119, 188134, 154798, 144226, 77868, 52797, 149209, 212381, 196317, 91124, 62071, 62628, 34595]
9924C4595L1576R6883Q0914q386j32383j92433K4963R5452O5829L198r522M6116
9912A36802L1688j2806j71265j1120L6441J61268Q2884n8706j60551N0957L768
9901H9360R5138O8890q5738m4593j27069J3068O9293j0905n7134p0923Q5074M4165
9889F8626N273L0840j7261J588R8670P9070m4370q7985J2340J12493k0282j26476
9877A12526m3418q8116r1756M2583O7466N9811P6508R3710k8713l1366j35698
9866C3537k7335J7109L8288M834J30979O5759l8064n6681p680q9022J39186m1003
9854A69907j21082j5746M1106R0419M8931m5369p4839l8852l5850j4196L1239
9843C5668j1927o6864l9350N1647O7626M3038k7925j8043m4738j4708o3374p364
$$ y = [34595, 66171, 163054, 243968, 235582, 103199, -89234, -64271, 31181, 97010, 100208, 90686, 136802, 168490, 155684, -15581, -26701, 9740, 171008, 253892, 195186, 34635, 85592, 89360, 184498, 253388, 167650, 123057, -4012, 9056, 78349, 67444, 10310, -60613, 24461, 68626, 73899, 104739, 87478, 89066, 187736, 266806, 222436, 134451, 146791, 259284, 239002, 112526, 69108, -19008, -110764, -68181, -715, 59096, 135604, 229314, 200601, 169235, 33537, 6202, 23311, 61599, 66433, 197412, 263171, 225107, 168426, 160746, 71724, 210910, 169907, 48825, 33079, 74185, 164604, 213535, 168166, 93327, 54475, 18625, 4429, 35668, 23741, -43123, -82473, -30826, 36800, 79838, 51913, 33870, -10868, -25576, -88950, -96314]
9831i6314J21552J24191R8478M6195n252n7711N626j09499j81199K6899j7957
9820d4991k6206K7063l2123N3604j1172K6270n5409j066M5489j9721J31496L3602
9808A26836N7701j5926P9320K5257j7903j59567r7020L8566L4494n3935o7417
9797d9594p5203q0569l5652R0992J42470R54r9429j4256P1731J18994N299r042
9785F6695l3649j3288M6680J4767o368K6482k6385j15793q7084M6747R4357R1351
9773A04512o158j06092o7203k0073J87449L9416K2385P2472m4083j45944n3295
9762a6614p625P6522N2752j80305m6474J49244n7738P270L8895q017P6058O1382
9750A45350L270l361n5762l0734O2479L1426p2997j9487K575J6554K2054R5210
$$ y = [-96314, 25238, 149429, 247907, 294102, 288850, 231139, 236765, 127266, -53933, -27034, -44991, -71197, -44134, -76257, -22653, -33825, -7555, -62964, -64030, -18541, -38262, 93234, 126836, 184537, 168611, 247931, 273188, 255285, 95718, -1302, 37264, 71758, 17823, -49594, -124797, -205366, -241018, -150026, -7556, -6602, -106031, -120287, -48556, 70438, 75737, 66695, 33046, 19758, 66438, 81205, 74837, 101319, 74934, -40859, -127943, -81196, 13161, 104512, 98354, -7738, -74941, -95014, 92435, 131851, 154236, 226708, 182625, 36681, -16614, -24239, 52283, 105035, -75270, -121744, 27500, -30238, -22968, 15927, 7910, 83968, 145350, 148620, 145259, 89497, 58763, 121242, 152668, 79671, 60184, 62759, 79313, 101367, 196577]
9738A96577k4656r1140m8296j00324K7529j9588O4034k8293J08119O2251q0755
9727F5458p2001o0341L4733m7596j6674L3416M8155J28949K0253Q4826k3901m9274
9715A46003r606N3472n6019j2579M415q7386j3265N23O4470j459R665k6487M5344
9702A17091P7226J6725l6034j58233j04974r109N3136M8907j7765J27053J12178
9691B26201j1743j59082p2595P499j7998J70334K269M352J0129k9474k6072K7772
9679A31592J23381m2099m2459O236O3743p8162J1529K7747J05063j03873j59232
9668D3466P5156J33249j4455Q4506o0143j81235n6256J07099M241J01707L4430
9657B71765J0266n7452L0182n0084o3382n9691Q0035J50021J09107J15406K0839
$$ y = [196577, 171921, 80781, 32485, -67839, -40310, -59898, 4136, -24157, 83962, 146213, 65458, -6543, -66884, -32151, -79747, -96421, -63005, -14850, 114099, 134352, 219178, 195277, 146003, 136397, 189869, 133850, 121271, 125686, 38300, 25035, 25558, 90028, 88569, 98234, 71747, 117091, 194317, 211042, 175008, 16775, -88199, -97308, -44172, 4735, -13030, 114023, 226201, 214458, 55376, -17219, -9720, -27718, 142616, 144885, 149237, 159366, 129892, 103820, 131592, 254973, 212874, 170415, 176651, 240394, 162232, 173761, 201508, 306571, 202698, 43466, 118622, 251871, 237416, 321922, 261779, 80544, 24288, 131387, 135628, 237335, 271765, 282031, 224579, 254761, 204677, 141295, 81604, 161639, 311660, 420767, 536173, 557012]
9646E57012q9163l3444J5698J22973O2400j02994o9871q266j21592m0305m6909
9635B45539r1386o5642j17461m226l7907J14046Q5624L6858m4491j6465J38092
9624B42581L0316j21369j20536M0511N6987P1462j5898l8612o3851r2573k3094
9613c4076J15858K7050n6530r3878n0554K15371J66421j61341p3185j5988J09056
9602A48204o0680M6250O0803L8483m187m612o5621o5585J32933M985j78748k9243
9590B2982J04392O3851n317r2308j45582K3568K1819P6171P9256J8441j3792J5596
9578A69077m1602n4004k5190L3282L4704l8474K7055p4520K5149L1116P8675M2265
9566B07533J6141o5068r5054J16402l5262r2600j37575o0173k5020N2986J19624
$$ y = [557012, 467849, 434405, 450103, 573076, 635476, 532482, 462611, 454345, 332753, 292448, 245539, 154153, 88511, -28950, -33176, -71083, 42963, 128587, 165445, 120954, 104489, 242581, 272897, 151528, 30992, 71503, 128490, 199952, 184054, 145442, 81591, -10982, -34076, 81782, 108832, 52302, -41576, -92130, 123241, 289662, 128321, 55136, 39148, 148204, 87524, 133774, 194577, 233060, 228873, 224261, 158640, 93055, 225988, 230973, 52225, 22982, 127374, 191225, 185908, 93600, -51982, -28414, -6595, 69576, 148832, 167273, 153481, 169077, 127475, 73471, 48281, 81563, 116267, 77793, 104848, 30328, 55477, 86593, 165268, 207533, 223674, 158606, 63552, 179954, 144692, 52092, -85483, -145656, -170676, -117690, 1934]
9555A934Q8814N9950J3944j9490m1869o9980j93014O6477N7972M8437K1555J5356
9543E0086M0357Q5596r3838k40212L1131n786M3106l0629N3321l0915M54l025
9531a00354k3480P3500m0680N3052P8129J8860m1550j27886M8533P9582J3007
9520C0713k402J21585N9677k03026p1774Q571k758J62373N864o0350L3800J36479
9508B18752j90202j36979N0155J41518L0546p8863n9044l7096M2790J81655N5397
9497B18629j14951M3278o1534j57160q4780l303L649Q330N9595R8474J30177n4524
9485H5880r5012l1698p418l9425j05470r9490N7866K8017N5110J0954J05109P9618
9473D4041j6414j2466k5452m5924j7936n382P960J59299J00171R0918j52973p4055
$$ y = [1934, 90748, 150698, 164642, 145152, 103283, 33303, -159711, -93234, -35262, 13175, 34730, 50086, 90443, 176039, 82201, -158011, -126880, -132666, -89560, -120189, -66868, -97783, -97329, -100354, -123834, -50334, -91014, -37962, 40167, 59027, 17477, -110409, -61876, 17706, 30713, 28311, 149896, 209573, 6547, -65227, -56656, -59414, 102959, 108823, 48473, 82273, 218752, 28550, -108429, -58274, 83244, 113790, 34927, -24117, -61213, -18423, 163232, 218629, 103678, 146956, 85422, -71738, -156518, -159821, -156172, -147842, -88247, 10227, 140404, 85880, -9132, -40830, -48248, -87673, -193143, -292633, -234767, -206750, -151640, -140686, -35577, 44041, 27627, 15161, -10291, -56215, -74151, -79533, -71573, 87726, 187897, 278815, 125842, 51787]
9461E1787J887r647O144J00796M9797j36034j14629L219n3681o5392J19010o8554
9449a15297o1544M2582K25995Q8069j1421j5203O6021O7735L7563j23504q101
9438A92895O4508j84912o6164P5036j3064J6485Q8876J4121k3104j01097k4309
9427C9271P4977o6232M6925N8529K0731p119r8643j21931m487J1428j8915r7618
9415a63084k6780P0096J7133n7204k6459Q8182R6825P731n5525O1411l0771o4829
9403h3274M0601M495J2863j9215O5442m7987k30586n3067J50557J02834m3399
9392a00736j4178J24295J30475N1460q5996n8303J10358R7658M320q9392r2376
9381G7585j10996K8572J9535L6414n1565j06303J04578L9328N9415k5203j41488
$$ y = [51787, 53674, 44027, 50171, 150967, 200764, 64730, -49899, -46680, -100361, -165753, -46743, -115297, -176841, -134259, 91736, 179805, 168384, 153181, 219202, 286937, 324500, 200996, 192895, 257403, 72491, 6327, 81363, 68299, 84784, 173660, 187781, 164677, 63580, 39271, 114248, 48016, 94941, 153470, 174201, 167082, 68439, -53492, -57979, -46551, -65466, -163084, -189864, -119768, -102635, -159839, -186298, -98116, -1291, 6440, -49085, 12326, -18445, -83274, -42673, -38178, -25315, -44530, 20912, -27075, -257661, -310728, -160171, -57337, -100736, -114914, 9381, 139856, 191316, 105320, 47017, 157375, 255033, 259353, 169961, 77585, -33411, -4839, 14696, 51110, -455, -106758, -2180, 37148, 96563, 71360, -70128]
9370g0128j15486Q276J0910J25580O6158L2234j22532M1893J49773N4918K6140
9359B07736n1025q2283J0143J15965l526n1782o3859P370K5377K2434J5532k0056
9347A32026l8138l4299J2586K9833l5765n6322k569K3569J9350R619l1095o3931
9335c5136n995q2801J7229l3059L9073N8931J81428j3563j80604N20N0986o9732
9323g2723m126o2188l1844O0076q771m8467O4015N0167l648l4832K983J0901K1732
9310e6725N2241l2670J23331J21409k6288o7264P662j6371M2690K1615j1698j20706
9298C7226q2732R2040Q0877K6946J2273j254o7774p1713K5127j7669M8918K9048
9286A11313M299P4540l6787l716O2936p7450r1595j4501j8066J0144N3037m0308
$$ y = [-70128, -185614, -177338, -166428, -40848, 25310, 57544, -64988, -23095, 126678, 181596, 207736, 156711, 74428, 84571, 200536, 197010, 145228, 81369, 88739, 114116, 136550, 152082, 132026, 93888, 59589, 72175, 102008, 66243, 9921, 7352, 30921, 50271, 59890, 28795, -35136, -41131, -123932, -106703, -139762, -100689, -41758, 139670, 126107, -54497, -53977, -2991, -72723, -76849, -139037, -170881, -110805, -119576, -168043, -104028, -53861, -57509, -92341, -89358, -78457, -56725, -4484, -37154, 86177, 207586, 181298, 114034, 121696, 105325, 148015, 169630, 157932, 37226, -45506, 46534, 127411, 154357, 166630, 165376, 97602, 25889, 51016, 33347, 82265, 111313, 115612, 190152, 153365, 149649, 212585, 135135, 43540, 29039, 10973, 21117, 74154, 33846]
9274C3846k0919j1470R1022N1023m9788j33113J53576N4479j10996j22754j1701
9263g6795K737N1045M0516l8204l4919p3374o9483O8371R6227Q3780K0262j03504
9251c3341l4373m5332L0486R2506M6994K6101M0011J5211k3395j02168J6790M6835
9239G6325J9830l6652l6278L5238J79990p201p9822j1817r076j54754j269L7330
9227A1844m1653L4075J31276K4383j12777j14428K1956J1099O7840l1066l5290
9216c2741J13881P611j63008J2659J262j05990J13151N368m5116R408P0481l9803
9204e2837o5279l750N7775l0423n3268J7439M3316k7752R3071P7132J32965r5893
9192I2496p5586K7770l6731O305P6105o7282l3112K0805J1627M6679j6205l1129
$$ y = [33846, 12927, 1457, 92479, 143502, 93714, -39399, 114177, 168656, 57660, -65094, -76795, -74058, -23013, 17503, -20701, -55620, -128994, -198477, -130106, -33879, 49901, 70163, -33341, -67714, -113046, -82560, 9946, 56940, 83041, 123052, 138263, 114868, 12700, 29490, 76325, 96155, 59503, 23225, 58463, 238453, 231252, 151430, 139613, 130537, -24217, -25486, 11844, -29809, 4266, 135542, 159925, 47148, -67280, -45324, -34225, 33615, 2549, -32741, 81140, 88751, -74257, -61598, -60336, -166326, -53175, -47807, -92923, -83515, -13034, -52837, -118116, -121866, -64091, -94514, -147782, -130343, -87027, -114779, -21708, 55424, 188389, 92496, 16910, 44680, 7949, 14254, 90359, 23077, -10035, 10770, 22397, 69076, 52871, 21742]
9180B1742o4628r4510p6315L3575M3754R190J6140N7009K4070M1248m1406N3165
9168B3034k1138o7428O446M7785J3406m3676q709O0047J24404m8809N1157j38466
9156a947j7506m2653q8146J3754P6031P946l2367L3735J77370Q285l3917o2268
9144C8317m2808l6802R7668J9697r0225n2434M8518l040j08649O9567N4851N1414
9132D6074Q808K5235L9027m601o2435q5978J5057M4573r6064m5791J55770J15175
9120A54850j3987j51456p8515l1929K9617P6047Q5214k4372m7595J0399n445j1756
9108h928m9259p0900j2453L7361k3892J0103J07866L4963L9641O3216m8548K2978
9096A02148J34895o6255j5013p720l2211m0324r7857j05307N1439K9560k7510
$$ y = [21742, -42886, -137396, -213711, -180136, -136382, -127192, -111052, -54043, -29973, 11275, -30131, 23034, 1896, -65532, -59086, -11301, 2105, -41571, -50280, 9767, 134171, 85362, 136519, -1947, -19453, -62106, -150252, -136498, -60467, -52521, -84888, -51153, 126217, 134502, 100585, 38317, -4491, -41293, 56375, 76072, -14153, -66587, -18069, -21109, -129758, -60191, -5340, 46074, 54882, 80117, 119144, 114543, 52108, -33870, -18813, 25760, -70304, -116095, 39675, 154850, 140863, -10593, -89108, -121037, -91420, -15373, 69841, 45469, -2126, 8273, 2828, -8928, -58187, -129087, -141540, -104179, -128071, -117968, -10102, 24861, 64502, 127718, 79170, 102148, 237043, 170788, 155775, 148055, 115844, 75520, -22337, -127644, -76205, -46645, -74155]
9085g4155K5221J1375n4163L2068j8629L811q7008M2193R1907O8861J17206r1982
9073F6705j7918K6388j8011J1531o979L8278q9460n7083k8780L1026J16309M0107
9061A12113L335j042j00037M0328o4760o9502j6052J9629P8407K0859j1129M0587
9049E2736l92j33620k8248L0304L3706J52939N1422o9639j53471r167J19127Q6664
9037A32361j1017n5847K2118L253m505J0255l5002j23416j22181n6096O1573J6038
9025a62466J0931R7659j31430L8368N1346l4083l7761J4228J26622P2819l066
9014D3167J4141L6652j24839n5845J02632k1162R4833j2023M8242K4185j08425
9003D1558p1270N238M3136J43237l0604j24445M9721j4319j14997k0133O9801
$$ y = [-74155, -48934, -37559, -91722, -59654, -78283, -74472, -161480, -119287, -27380, 41481, 158687, 66705, 48787, 75175, 57164, 68695, 61716, 99994, 10534, -46549, -75329, -44303, 72006, 112113, 115448, 114406, 14369, 54697, -10063, -79565, -95617, -75988, 2419, 23278, 12149, 52736, 52344, -81276, -109524, -79220, -45514, 107425, 158847, 89208, -64263, -73430, 45697, 132361, 121344, 65497, 87615, 90868, 86363, 96618, 61616, -61800, -183981, -240077, -178504, -162466, -151535, -53876, -185306, -146938, -95592, -129675, -167436, -153208, -26586, 46233, 43167, 57308, 93960, -30879, -86724, 15908, -5254, 89579, 77556, 125798, 149983, 41558, -29712, -24474, 18662, 161899, 131295, 6850, 56571, 42252, -72745, -92878, -23077]
8992b3077o9089o9728R9910O2794o7606P117J0442K2274J6314J31520P6562k0346
8980A77087j06481l9013J4939j2036l982O1469k9266L1866k6583j05402N4334
8969A6932l1623J9767O7858j2835J8162M3412K6760J2168M981n4438n8586L2648
8957H5206J569j12990j15973J08632J23808k6364k583n0061N7370l9789j3609
8946A5216O986K6560k5846j03293N1205J39895q925p8745Q0417m8120L9366L1038
8934A25754p2775j56503p1611J5889M1558J3927L7022M0568o1949M0214K3046
8923b4860K7125K6480L2742j32296o5887O3652J65566J05786K221j04602q2862
8912A3065P8735k9093M228j2392o1744j65041j11067j1966J19509Q8730L1102
$$ y = [-23077, -92166, -161894, -61984, 810, -66796, -59679, -49237, -26963, -10649, 120871, 197433, 177087, 70606, 31593, 46532, 34496, 30514, 91983, 62717, 94583, 68000, -37402, 16932, -14691, 5076, 72934, 60099, 78261, 121673, 148433, 160601, 165582, 111144, 52558, 85206, 86775, -26215, -142188, -33556, 90252, 63888, 61305, 11244, 68614, 28825, 15216, 22202, 48762, 22916, -80377, -29172, 110723, 101798, 23053, 103470, 55350, 94716, 125754, 52979, -103524, -175135, -159246, -117688, -103761, -66739, -26171, -88120, -47906, -24860, 2265, 28745, 61487, -70809, -136696, -73044, 92522, 198308, 200529, 95927, 13065, 91800, 62707, 66935, 54543, -7201, -172242, -283309, -295275, -175766, -87036, -55934]
8901e5934R2553j1508M4516l4494j52812J735J38728Q3253J6746q0308m0922j2064
8889a0511J06894n0014j07260l1410O904J55959m2575j0599r4101p5179J0049
8878a41843L4122O5313o170M7501J05447q4180j20031q561m2800Q2326J27876
8867E9000R693j5389j06153J3808J07506m924l7628J1470J15484O6650o761r1889
8855A20867k4456j0069M6544M0396p8844j27786P3877k2269l1164L8509P3597
8844I9202q5755o8177M2469J00584l0645J2594j9743J8179j6436r2999N3451Q9014
8832A01738J0501o9154j23125k6562j8126P4724m1430n8105k2048J9728o2030
8821b13889k8289J71806J7862N3996J11116K0084j11010j01112K8263m1765M3954
$$ y = [-55934, 36619, 25111, 69627, 35133, -117679, -115944, 22784, 106037, 122783, 42475, 1553, -10511, 96383, 46369, -60891, -92301, -85397, 70562, 27987, 17388, -76713, -151892, -141843, -107721, -42408, -48578, -1077, 104370, 20190, -99841, -108402, -151202, -68876, 59000, 68693, 53304, -52849, -39041, 68465, 63541, 25913, 37383, 152867, 219517, 212756, 120867, 96411, 86342, 132886, 173282, 94438, -33348, 40529, 18260, -12904, 25605, 99202, 13447, -54730, -12261, 88323, 57678, 70272, 50529, 68708, 52272, -40727, 12724, 101738, 112239, 43085, -80040, -106602, -124728, -50004, -91434, -149539, -171587, -151859, -213889, -242178, -70372, -52510, 1486, 112602, 132686, 21676, -79436, -51173, -92938, -48984]
8810d8984l146j56891j19907n37J30221J17264R5101M9171K4922J06297j82801
8799A0710k37916P9449J01479K2044o1265L5129L5019J31959R191o1658r8797
8788c4656L6594J02453m5557J2835j7841m4949l7008N4676o7506j70781n8358
8777b70098K38466Q0821m1427J2986N8896J39361N2738M3180j45174p1987q0579
8766A7183m2765j9081m2803m5117m7190J9619J79838K440n5411m1645m063L4596
8754d4399j32930K667P9258J59931k6800j46297K6277m5004r3353R3534P7903
8743d9213J37065j23897j34823l2475Q1576m7930m1709N2095J97228J93185J2446
8732B43548M4944l2030o9235m9495q7668o422o1550K1416J0798m5286R064R2162
$$ y = [-48984, -52130, -209021, -328928, -329465, -199244, -81980, 13121, 62292, 87214, 193511, 10710, -227206, -147757, -46278, -24234, -85499, -50370, -15351, 116608, 125799, 64141, -34656, 1938, 104391, 58834, 71669, 53828, 8879, -28129, 26547, -40959, -211740, -270098, -31632, 49189, 7762, 20748, 79644, 219005, 271743, 314923, 169749, 97762, 17183, -25582, -44663, -87466, -132583, -179773, -160154, 19684, 22124, -33287, -74932, -78995, -44399, -177329, -174662, -95404, 64527, 37727, -108570, -82293, -127297, -220650, -127116, -49213, 87852, -36045, -170868, -203343, -121767, -169697, -211406, -159311, 37917, 231102, 243548, 288492, 256462, 187227, 137732, 50064, 43642, -17908, 3508, 14306, -30980, -21916, 70246]
8720G0246j03093j44688L0519J24233Q1326n36l5441m3832K8434k1728q1419M54
8708i5525N5200J1763K842L1901L8270P319m5372R3530Q915r4412O1632R7014
8696A73077M7663j08472q8253n7927O0667J3399M7770n5267q3940L9654N3449
8685D1820K8403l4296N2781N3617L7717K1161k1527k4072j17009M6126q955o7076
8673H690J7969n3644n1768m6790O7727R5445o0249O8204J15676L0396L7915j02517
8661A27054j19827l3139o7589J75910Q6091q894O7038l7250j72889m3136J09743
8650H3112M4533J04927q4077j73210k1503k2467j2148L4958Q7213N3629O0304
8639A55271p2814n6922K4665Q4301J04907o7864j39664L3040N7741q494j37409
$$ y = [70246, -32847, -177535, -147016, -22783, 58543, 58007, 22566, -21266, 7168, -14560, -95979, -95525, -40325, -28562, -25720, 6181, 44451, 51770, 6398, 99928, 108843, 14431, 76063, 173077, 220740, 112268, 24015, -33912, 26755, 40154, 87924, 32657, -51283, -11629, 41820, 70223, 35927, 88708, 142325, 180042, 201203, 179676, 155604, 38595, 84721, 75766, 8690, 26659, -26985, -78753, -125543, -57816, 37629, -22620, 45584, 161260, 191656, 229571, 127054, 7227, -25912, -93501, 82409, 168500, 159606, 226644, 189394, 16505, -26631, 83112, 127645, 232572, 148495, -24715, -46218, -68685, -80833, -45875, 41338, 94967, 155271, 82457, 25535, 50200, 134501, 239408, 171544, 31880, 64920, 122661, 114167, -23242]
8628b3242m023J8993j24778p464P2460Q7528N4329R911j34587j19159l5038j1704
8616b16774j8070J70046O6436J40599R311k7770J5826L1638M6951j14828q7394
8605A5971k8389N832l7505j4270J73376J09286l0458k11854o666q2731N6664O9678
8593A8934m6033O767O1218Q6227Q0819q100j96077j3280K7289Q6124N8707j62832
8581b37j05505N5791p6567r147J07890M1098m069p8300M1202J43986N8360q8959
8569H5543l1694L7301P7456J33799j0115l09649n0136J19625P5054J8266Q792
8558A54242j1574j02543o4840p4887N9989J13420Q3832k1240n0862Q3799r736
8547A59600j57669j45132m0516O6412O3346O7816M7326l0480L0277p0876M520
$$ y = [-23242, -27265, -8272, -133050, -140514, -68054, 19474, 73803, 83714, -50873, -170032, -205070, -216774, -234844, -64798, 1638, 142237, 151548, 123778, 139604, 171242, 218193, 103365, 15971, -12418, -6586, -44091, -58361, 115015, 224301, 193843, -18011, -24677, -107408, -50744, 18934, -27099, -20332, 40886, 127113, 207932, 199832, 3755, -9525, 17764, 103888, 162595, -237, -105742, -49951, -126518, -135665, -27775, 13323, 9254, -69046, -27844, 116142, 174502, 85543, 53849, 91150, 168606, 302405, 292290, -17359, -67495, 52130, 127184, 145450, 154242, 142668, 40125, -24715, -99602, -39613, 73807, 157639, 136399, 85537, 169336, 159600, 1931, -143201, -183717, -117305, -53959, 13857, 61183, 30703, 60980, -9896, -5376]
8536e376N2488K238m7893R965M1130J7640j4796k6812Q994n6376l1691j13366
8524a63855n9923N6616P2579K1883P4002R2845L654j2361l0373m1585q913l1889
8512b7320k8362k4491P048n7032j1857j1124K7852L1565Q7370L2862o8562j4643
8500e6694j9674L5825j51189m5102O7667Q7668M839M1226J23279o0864j31039
8489a04058n9075l7762J49295J09825K1515l6683O4958k3033j45595l8498J19604
8478B0493J22795K9849R820L6192K0048l9910j21865r3837K4123o8627K2472n0372
8466h8819j13535J11400Q1915r897R1495J00200M5489k9500p5090j29057M8007
8455C2608J18338L7039j16126j11582k4902O9589O2262K3520n7419p3130m1965
$$ y = [-5376, 47112, 49350, 1457, 11422, 52552, 70192, 55396, 28584, 37578, -18798, -50489, -163855, -223778, -167162, -94583, -72700, 1302, 94147, 97801, 85440, 55067, 13482, 4569, -27320, -55682, -80173, -73125, -130157, -142014, -153138, -125286, -93721, -6351, 26511, -42051, -56694, -76368, -40543, -191732, -236834, -169167, -81499, -76660, -35434, 87845, 26981, -104058, -163133, -200895, -51600, 58225, 79740, 43057, 108015, 84982, -60613, -99111, 20493, 143288, 173137, 182957, 219149, 239197, 199287, 77422, -16415, 7708, -60919, -38447, -88819, -202354, -90954, -9039, -18936, 72559, 172759, 218248, 188748, 113658, -15399, 32608, 150946, 187985, 71859, -39723, -64625, 4964, 67226, 90746, 33327, -39803, -81768]
8444h1768P3362P66R3000M6228n4720n6728M1941k4435j8781k8467N4956J22093
8432A67447J0995n0848n5523n6765r827N7740n7434r7201K0473M2970j36865O7049
8420i7789J22128K5194Q54k6654l1351l4350L4086J58872Q6077j19664j17819
8409d16k2142J15937J2199r8301R7119k1272o8900j28719m4273j2766l2050J09225
8397i4359Q6263q4730m5033R5829j251m1606J0188j537J12325J00047l6159j6057
8385H3920o2815j8193n6062m5535m0783q6025K0550J42022m3489l0926j7535p0010
8373b24881L2207K7673O4253n0374L5855L0031j284o9956j6941k0965L4962j9114
8361a78534l0230M2934R4719r3670P1255L0033m2992m0588m4340N6485O1223J55880
$$ y = [-81768, -8406, -7640, 85360, 131588, 76868, 20140, 62081, 37646, 18865, -9602, 45354, 167447, 178442, 127594, 72071, 15306, 5479, 63219, 5785, -91416, -70943, -27973, -164838, -97789, 24339, 49533, 50387, 23733, -7618, -41968, -7882, 150990, 237067, 117403, -416, -22558, 93379, 105578, 7277, 104396, 83124, 14224, -114495, -158768, -171534, -203584, -94359, -8096, -92826, -137859, -42030, -43281, -84887, -74699, -76236, 36089, 136136, 99977, 83920, 21105, 2912, -53150, -98685, -139468, -225493, -204943, -62921, -106410, -137336, -154871, -224881, -192674, -165001, -100748, -151122, -115267, -85236, -86520, -156476, -173417, -194382, -159420, -178534, -208764, -165830, -71111, -164781, -93526, -63493, -106485, -147073, -191413, -134928, -73705, 82175]
8349H2175r936j0183k0178j07304J7429p458k0607N6579n8333m5723O3805R4125
8337C4391K1614k8857J1407n0647N0537R0434J8779K9705j9784N6369p0942n3879
8325H9127p4428j28613r7311L0649K719m9803j3127O8655L6905j9919j9974L3574
8313a41546J56899k9481j7177n3981L0612P2546K4682J3882L1507o1774m0869
8302a4700M0986l0101j9074j02755o192J49851K7250o4320N0438Q3521l2765q8294
8290f155o5872j800k8596j9800J21670O4452l8851o060L6778p8276M5703O6909
8278I0102m361l9427M5884P6394j1344j6618k6176L9594n2723k7586r9164j8582
8266d4007J5017l7709M5215L3896r2242K4364P6556R7012P2869j8653L1869l3983
$$ y = [82175, 72239, 62056, 41878, -65426, -47997, -55455, -76062, -19483, -77816, -123539, -59734, 34391, 56005, 27148, 38555, -12092, 38445, 128879, 147658, 177363, 157579, 213948, 143006, 89127, 14699, -113914, -211225, -180576, -177857, -227660, -240787, -172132, -135227, -155146, -175120, -141546, 15353, -14128, -31305, -85286, -54674, 17872, 42554, 56436, 87943, 26169, -14700, 26286, -3815, -22889, -125644, -131836, 18015, 45265, -19055, 31383, 114904, 82139, -6155, -72027, -73827, -102423, -122223, -553, 63899, 25048, 18988, 55766, -22510, 23193, 90102, 85741, 46314, 92198, 168592, 157248, 140630, 114454, 154048, 101325, 73739, -25425, -44007, -28990, -66699, -21484, 12412, -79830, -55466, 21090, 118102, 190971, 172318, 204187, 170204]
8254A70204j56636J4459P8759K0016l2627J9554K0934N6509q3182o5338p5215
8243c2563N4796J6455o0571R5105M1595m3904J2803k2052k0645J17618M5141r9057
8231A04721M2448N8852q9984o824L9823j16927j04999j09395K00747o6628n7178
8220a05344N9512J00918L965M2858j58232m8065M3768P71k6397l7360p7695J21548
8208g9753J01321m989l6217O0022J25150l2745m9286N3855M3610l3831j09746
8197C7391r6588k6373J4970j9869q735n2736j7967N8252L0056m8698J6751M1033
8185g2513J29040N4929l7559o7485j00071p1712M5798j7271J3626J48385L955
8174B9122k687n2198l6019m9961R6676L1749M9665J22027m1996P3491j2083k9407
$$ y = [170204, 13568, 28027, 106786, 126802, 94175, 113729, 134663, 191172, 107990, 42652, -32563, 22233, 38688, -21883, 73222, 114817, 70913, 83716, 61664, 41019, 158637, 203778, 104721, 147169, 206021, 116037, 109213, 149036, 32109, -72890, -182285, 18462, -48166, -105344, -45832, 55086, 59051, 101909, -56323, -104388, -60620, -59849, -86246, -123606, -201301, -79753, 21568, 16579, -19638, 40384, 165534, 132789, 83503, 137358, 180968, 147137, 37391, -59197, -85570, -70600, -90469, -99204, -151940, -169907, -111655, -81599, -130297, -113546, -72513, 56527, 111456, 73897, 6412, -93659, -165371, -119573, -136844, -123218, 25167, 29122, 26435, -25763, -61782, -111743, -15067, 16682, 66347, 188374, 146378, 219869, 207786, 178379]
8162A78379n5664q4468j39416j89456Q1304L5876q6793l1005j5668Q0113J51765
8151g5033L9698l5082m3012n3576L9745R5646j20784J57365j256l9973q4180k7301
8139a47743j20143P8624N3351J6753O7416L7752k17435J19555O6847L2207Q7659
8128G4843Q0143j37355o5484j44171j67123O0935J04287K3667J088j3107L5487
8117a46790N1427k9706n7586Q1117K8411Q9027N1226j48640j98338l1276O3464
8106b47664J863Q9591J12240M0137j01297J0721R0438p9592n5656L0559l3421
8095a42081m5759j56k8158p4074M4053K4997Q3899l930k0070N0331K4714M7668
8083c8566j66566J2207L0396j7191K534Q995N4230J52193j603N9254r8749L8235
$$ y = [178379, 122715, 38247, -101169, -290625, -209321, -173445, -260238, -291243, -306911, -226798, -75033, -35335, -70417, -113429, -167005, -127260, -31614, -152398, 4967, 3711, -36262, -120442, -147743, -267886, -189262, -135911, -119158, -51742, -13990, -231425, -111870, -45023, -12816, 74843, 154986, 17631, -47853, -192024, -359147, -298212, -193925, -170258, -169170, -182277, -146790, -95363, -125069, -182655, -101538, -73127, 15900, 67126, -81514, -279852, -311128, -247664, -245801, -156210, -43970, -3833, -105130, -94409, -3971, -83563, -139219, -108660, -142081, -187840, -187996, -216154, -290228, -246175, -221178, -137279, -141209, -161279, -110948, -86234, -38566, -205132, -192925, -162529, -179720, -177186, -168191, -113961, 38232, 36629, 95883, -2866, 35369]
8071C5369J09918N1636j073k2683j40128q2077P2719R1003m5558q004K7235j97959
8059a09602O382l6214N2808L3949m6610N249k3809J45852P4222k4530K9610M0550
8047A47857q2811j3397m9870j24786O134O0514j6850j66437l2257J48339R8830
8036b4734j04101K3872K5587K4163K8008L5969L3989q7713k4676l3785M2338l3799
8024i4882J3168k0730o094o4843r1505p2764L0360Q7734p884N115K0913M9849
8012a51563O8369M2651L9922p2987n2413N7638J04674J47674m5832l745p730j62744
8000c6086k8023j0092J83637L1700k49758j41781Q0797K7133M2025N7333J29729
7989H6614R6871j94785r1688K9860m3862R383m2163P1004Q2854J40098j6031o8455
$$ y = [35369, 145287, 196923, 195850, 173167, 33039, -49038, 23681, 114684, 69126, 61122, 88357, -109602, -103220, -139434, -86626, -52677, -99287, -94038, -117847, 28005, 102227, 77697, 107307, 147857, 65046, 51649, 1779, -123007, -116873, -56359, -73209, -239646, -271903, -123564, -24734, -128835, -104963, -79376, -55213, -27205, 8764, 42753, -44960, -69636, -103421, -61083, -94882, -81714, -102444, -108538, -173381, -264886, -337650, -307290, -219556, -227440, -222325, -201412, -151563, -83194, -40543, -621, -73608, -126021, -68383, 36291, 183965, 138133, 134388, 126658, -36086, -64109, -74201, 109436, 141136, -108622, -250403, -169606, -142473, -100448, -43115, 86614, 183485, -11300, -102988, -73128, -116990, -107607, -149770, -78766, 4088, 144186, 128155, 59700]
7977E9700j6254j3820j3276m2077M0854j31824l7169J27915J8594j15789L2557
7966i0589Q0763J9548m6821M9240L4098o3733l9819l4564P516L5046P922N9799
7954A8406P0867J7947k7929j48338O2016l260L482j03469j38127J26765Q8548
7943c3092J4242n8824K223j4778N088J43857J50759Q2885n9695l2469o2701l7926
7931I9569M6885J03695l8827j79746k0556K2782K193j5094N8823L6684j2960K3042
7919A26490j07021o1320j3074L4777j1633M889k4182J4409j3929j3403N1579M2124
7907B9706k7314n1200O1632O35r9616k4361m3843P5612J3757J60994J02687r6602
7895A02087o0724N4012q8120J390L3853l4039N3868j9664P2167J75598O8451j89516
$$ y = [59700, 43446, 29626, 16350, -25727, 15127, -116697, -153866, -25951, -7357, -123146, -90589, -9826, 9722, -37099, 12141, 46239, -17494, -57313, -91877, -84361, -49315, -41393, 18406, 89273, 107220, 79291, -69047, -7031, -10291, -6809, -110278, -248405, -121640, -33092, -18850, -77674, -75451, -90229, -85141, 58716, 209475, 292360, 232665, 200196, 137495, 99569, 146454, 250149, 211322, 31576, 11020, 33802, 35995, 20901, 79724, 116408, 103448, 126490, 19469, -41851, -54925, -20148, -31781, -26892, -51074, -36665, -50594, -63997, -12418, 29706, 2392, -48808, 12824, 13459, -86157, -110518, -154361, -78749, -64992, 96002, 198689, 102087, 41363, 95375, 7255, 8645, 42498, 8459, 62327, 42663, 114830, 290428, 358879, 169363]
7883A69363j30750o3375J5152J53409J17198j02471n6789o550J31694K0767j01420
7872A46228n9802O784j54561j7997o7674m9843L8065P9465N2784J15291M9095
7861A37835n712n7053n718R1670M104j28131j77741m6160r3043q015L3482m4903
7849b99385R2789J9804N8601R582K0104j03081r3971j55793R8753J62334J35762
7838e4501M3277p0294p1367J62616N9561n7471o8821N4319l8922r8783J10175
7827c0211O6180j08729j6542k412m9108J2398N618l3993Q3781m0450J33417k4651
7815d702q3045O1319o71J2239o3571o1492m374L7482Q9010L809j6072J5260K6828
7802A2020L3440j23498k6271O4625m9928n3809l4858P5624j4092K1872q4057j43911
$$ y = [169363, 38613, -24762, -9610, 143799, 260997, 158526, 101737, 95187, 226881, 247648, 146228, 86426, 93210, -61351, -79348, -147022, -196865, -158800, -79335, -26551, 88740, 137835, 132123, 75070, 69352, 161022, 165126, 36995, -140746, -186906, -279949, -287964, -254482, -299385, -206596, -186792, -128191, -118609, -98505, -201586, -295557, -451350, -352597, -190263, -54501, -11224, -81518, -152885, 9731, 69292, 11821, -57000, -2681, -41603, -140386, -30211, 35969, -72760, -89302, -91714, -140822, -128424, -122806, -156799, -73018, -113468, 19949, -4702, -87747, -26428, -27099, -14860, -78431, -139923, -144297, -106815, -17805, -13996, -30068, -14808, 12020, 45460, -78038, -104309, -39684, -89612, -143421, -178279, -102655, -116747, -94875, -178932, -322843]
7790c22843j37363K6003K44929Q6139R0783O54J25203j0914q6889L191p6657m4916
7778a02680K1428p1795j54845K8029R7333K316J4675k9219J1320M0698R3195m77
7766e0022J32585K3148J7057p1689o052j1047j0556Q341k3233q7749n1142L4819
7754i5540N7938k6601j74131M3847J14125N2033m0012L7863j15796m9395P2449
7743a23220J15683k2793J2131N7394K5035j22314j41880N7253K20829O2424j65386
7732b4844n476m4444M1973K3197r3432m8953L212n7323m9020J52832R4250O1696
7720E3668l5557L804R6599L7417M4480L7075m2187Q466j12438j24598P4340J07224
7708A48293j32159r9546O4423q654M0298n6662l5440k6627r5129o2001k157M1749
$$ y = [-322843, -460206, -434203, -189274, -103135, -12352, -11698, 113505, 102591, 15702, 18893, -57764, -102680, -81252, -153047, -307892, -279863, -182530, -180214, -165539, -194758, -183438, -142740, -49545, -50022, 82563, 105711, 122768, 51079, 45027, 33980, 23424, 31765, 8532, -79217, -130359, -95540, -37602, -64203, -238334, -194487, -80362, -28329, -68341, -30478, -146274, -195669, -123220, -7537, -30330, -18199, 39195, 64230, -58084, -199964, -142711, 78118, 140542, -24844, -30320, -74764, -32791, -9594, -103026, -151979, -148767, -206090, -255110, -102278, -8028, 53668, 18111, 21915, 118514, 155931, 200411, 237486, 195299, 203765, 91327, -33271, 41069, 148293, 16134, -83412, -18989, -27643, 12655, -44007, -79447, -106074, -201203, -263204, -265361, -223612]
7696b23612J64667J47733m3875p7591k9816j11485M6628M9926j2060j870K5198
7685f6157O6672L8275j52740L756J03645k6410m4311r72p2417l3499J04753J4398
7673f5007R2640n5639j40876J615J93017O0466r9325n0323K6337J04605M190L1474
7661A03174J31835n2769j49377J24143N4240o8967j05951n5106L0259N4967m3497
7650B2951j38050j36913R127j7216J75915m0987l3867p2501j09039P5134J6429
7639b49017j662Q804J08240r0181j41172n3171J3083P2235J97409Q0937J8340
7628c6155L6499j8600J21883r075j06661j51186k6914k0593m7326R1010K2497
7617a44621l4680M7357k2601n3977n0860K08254J38608q1870k19428k1753K08198
$$ y = [-223612, -58945, 88788, 44913, -32678, -62494, -173979, -127351, -77425, -89485, -91355, -66157, 515, 38790, -113950, -110194, -6549, -32959, -77270, -78242, -150659, -184158, -79405, -65007, 27633, -28006, -168882, -167267, 25750, 86216, -13109, -63432, -37095, 67510, 71700, 103174, 235009, 182240, 32863, 157006, 211246, 142279, 36328, -18778, 11481, 66448, 22951, -115099, -252012, -242885, -260101, -84186, -125173, -159040, -231541, -340580, -265446, -249017, -250679, -241875, -133635, -223816, -364988, -418159, -405076, -332841, -135432, -54495, -36155, 344, -18256, 103627, 94552, -12109, -163295, -190209, -210802, -258128, -167118, -144621, -179301, -131944, -154545, -208522, -259382, -51128, 87480, 5610, -213818, -235571, -27373]
7606b7373J12825j2772j43184M4359O152q4379K968L6444O6786L8013o1534o6401
7594h8096J5469J04998M5474P415j06115j2870K14162r032j24197m2900j05421
7583a01113m251l181J6713N1037P3838K3203m6153j50419K3886J27962j1662n7574
7571e7714K534K3424m1868O2327j327r4786L684n4532q2714M8889J05539j040
7559h7584j15031K8488Q0357J3431R8685J58985K000j28895J3583J9465p1981
7548A1503k28K4428K5724p4342n5167p0853r974L542q2781O3880j3118k2051J17143
7535h2294J14750J550N5425p2896m1351o2152m0535j3633O6371l6190M8725J21616
7523E9386o568j05966K2577N9257j13894o8652O4329m7207j26441Q7885N7035
$$ y = [-27373, 85452, 72680, -70504, -26145, -19993, -104372, -101404, -64960, 1826, 39839, -21695, -88096, -72627, 32371, 77845, 85260, -20855, -33725, 180437, 171405, 47208, 4308, -101113, -105364, -108545, -91832, -40795, 33043, 56246, 10093, -140326, -116440, 11522, -140, -57714, -55180, -31756, -73624, -11297, -12624, -107410, -103726, -158258, -240972, -192083, -86544, -87584, -202615, -174127, -93770, -80339, 18346, 177331, 179331, 50436, 64019, 83484, 11503, 11275, 35703, 61427, -12915, -68082, -138935, -148909, -145367, -228148, -164268, -177386, -199437, -82294, 32456, 34006, 89431, 16535, -24816, -86968, -127503, -141136, -74765, -110955, -62230, 59386, 52818, -53148, -30571, 28686, -85208, -153860, -89531, -136738, -263179, -175294, -118259]
7512a18259J68202Q6486p703l9003j5611o3426j18111k4819Q5012J10734j9375
7501D4127P0735j3279M3026n0827p3420m9081K9051J02786N6125l1145n2774j00603
7489b5279j2281Q9077o1885q5619j48572L5576j7539j4718n851Q3665l777M2960
7477a24243N0991P9858J9263Q4346n3154j15546k1707p013o5758pJ38874Q690
7465e406K9073q4534J5317k5667M0566J02867K5195O3626k9991j12166m7148l4721
7453f2989l4143Q3800N9035o4232n9008J40342R1502p2946q2461J09R875r756
7441h72l8251q099K2661P7740K5662m4384j02743n4987J9590k1057j7357J44612
7429B515J85949J08812o3594j05307P880j6844J6587L6052r1261j65123l0344
$$ y = [-118259, 49943, 136429, 128726, 89723, 74112, 10686, -107425, -132244, -47232, 63502, 44127, 114862, 101583, 144609, 93782, 20362, -28719, 332, 103118, 159243, 128098, 75324, -25279, -37560, 51517, -10368, -95987, -244559, -208983, -226522, -241240, -247091, -163426, -167203, -124243, -73252, 6606, 25869, 110215, 57061, -58485, -80192, -87205, -152963, -152970, -14096, -5406, 23667, -60867, -45550, -71217, -30651, 72216, 97411, 161037, 131046, 18880, -28268, -62989, -97132, -13332, 45703, -18529, -77537, 62805, 154307, 81361, -1100, -991, 8884, -872, -39123, -47222, -24561, 53179, 78841, 34457, -68286, -123273, -103683, -124740, -142097, 2515, 188464, 297276, 233682, 128375, 136255, 119411, 135998, 172050, 80789, -84334, -114678]
7418a14678k5416m794J48551J70737o3709m1301J9957N0671M124o7399l9222r9292
7406f1771p1074m214k3451m605J07838J18658L425N1824P0294l2603p2863j0729
7394G0729o4320j16070n2213l496P5146j9356M8437K4990q1744L9216j0768p3646
7382a63095O3367N3692m6424J1865L8841N1377J6247m4239L2291m2007q1215j4692
7370a23992o1147J2886M3462k3718m0424J80336k2753K0902q1521p8825K7543
7359a47251J2998l4290k8127M461M1358L1232J88626J10465N6857j8791m6352
7348A71186l4523j39153r2445j8934M2932N4700J11935q932k7774l9316o753o7960
7336e5037M5819k2796K08282N7201j13627j13011k17200K170J22622m3694j07340
$$ y = [-114678, -140094, -144888, 3663, 174400, 110691, 69390, 89347, 140018, 144142, 76743, 37521, -61771, -132845, -137059, -160510, -165115, -57277, 61381, 64806, 116630, 186924, 154321, 81458, 70729, 6409, -109661, -161874, -165370, -90224, -109580, -61143, -36153, -117897, -78681, -89449, -163095, -99728, -46036, -92460, -80595, -41754, 9623, 25870, -18369, 13922, -28085, -109300, -123992, -185139, -172253, -128791, -152509, -192933, -12597, -35350, -14448, -95969, -174794, -147251, -134253, -168543, -196670, -192209, -150851, -119619, 69007, 179472, 236329, 217538, 171186, 136663, -2490, -94935, -113869, -70937, -16237, 95698, 86766, 58992, 19676, 12923, -55037, -9218, -32014, 176268, 233469, 119842, 6831, -210369, -208199, -85577, -129271, -236611]
7325b36611j41839N6290L3464o672N8153J198J67804N0399l8332p200N5450M993
7313b903m02K511j12597p8999j444O2431J35582O1536j16783j57991K8581M0387
7301a40091r426J3325K31872N5659j39805M6277O0391l3581m2873j85753q4897
7290b28902O6687R6869j3240Q0600m153q6382j3745m5801R7831J67210K9663n2283
7278I4354J6221p2470l2924J8506M599O3483k5227p0081N3953L4082J7350n9754
7266D2092L8475J6875L5876Q0215q1817j79683r0552N3287j5915p865Q6408Q4208
7254F1604p0382o1479j08641n0698P124K4472J9169J7522n3514M952j6742L2839
7242a93774J21135J13144K02611J41071j33058q6606o929p1456O8288j65743j37888
$$ y = [-236611, -378450, -322160, -288696, -295368, -237215, -236017, -68213, -17814, -56146, -63346, -7896, -2903, -3305, -794, -113391, -192390, -193834, -131403, 4179, 65715, -51068, -209059, -180478, -140091, -149517, -136192, 95680, 151339, 11534, 57811, 118202, 84621, 41748, -144005, -228902, -162215, -65346, -78586, 2014, -2139, -88521, -102266, -148067, -50236, 116974, 146637, 94354, 110575, 38105, 5181, 23687, 28286, 91769, 66542, -3539, 50414, 84496, 101846, 42092, 80567, 97442, 133318, 213533, 131716, -47967, -138519, -85232, -101147, -109012, -22604, 61604, -8778, -70257, -178898, -229596, -222472, -198000, -178831, -161309, -214823, -209871, -226613, -193774, -72639, 40505, 243116, 384187, 251129, 164523, 157594, 86138, 154426, -11317, -149205]
7231a49205J11423j1972L970N9686j17638Q85J7284J05891m3912N3721J3612o2611
7219a8866p1143n864k676O0868R957o5132q9725L856M1148J66834N2413n9528
7207B2142J293j8485n1784o140o0622n7680J20535J45629n384m7995k3993k9904
7195a2388o0193M7547J9491L3301q1141p6080Q0442N2287P0362N5905N0880m5357
7183A35056j99988m5654Q4909j7416p6980j3451N4781K7964R5811j08m7545j30620
7171a33241p859O9893l0359n5426m1566K9688Q8819K0612l586k9224N1506N5023
7159A4280j8237j04409J17736L6903r4252j4826j7930Q1362P823J6045K1563j4955
7147C1103m7127L7921J2127o5419k267M5779N7417K2856o6303j5576O0654p9491
$$ y = [-149205, -37782, -49754, -45784, 13902, -103736, -102851, -85567, 20324, -23588, 30133, 43745, -18866, -90009, -95873, -98549, -37681, -27724, -92856, -182581, -178725, -137577, 29257, 81670, 22142, 23435, 4950, -46834, -52974, -113596, -171276, -50741, 94888, 89504, 41509, 17516, -12388, -72581, -25034, -5543, 27758, -53383, -129463, -49021, 3266, 73628, 129533, 180413, 135056, -64932, -110586, -25677, -43093, -120073, -133524, -78743, -50779, 45032, 44924, -2621, -133241, -141100, -71207, -101566, -156992, -198558, -168870, -80051, -59439, -63025, -92249, -40743, 14280, -3957, -108366, 9370, 46273, -47979, -62805, -80735, 627, 8450, 24495, 46058, 31103, -16024, 21897, 34024, -31395, -33662, 12117, 69534, 92390, 26087, 10511, 71165, -8326]
7135h326j28481K5135J53539l6305p5023N0936O2874K0136m5119M909J86720k7865
7123A83130k00729k1909O616J03144k8012k7644l9601Q5050Q0614J2215n258l5282
7111A12334r7066J1713N961k9410j3203J1451j36408Q5791L4700j3975J8672P8300
7099F8860j36447j06871k7861l5720O409J29320k75p5621J94198J9564O412r7185
7087e5217p1849n253l1850L2830N9060O0054J7456k4788J3466P7243J8075p0146
7075A9081L8498L812m191l0526j7706o5096q9839p9330Q2442J10361R4763N4625
7063A16894k2530k9416r1397O5122j34301p1854J14796K1633k1980j123k6441
7052h0597p348P4766L3538k3927k874J05601l826r5093O8780m1582L4745p2741
$$ y = [-8326, -136807, -111672, 41867, 5562, -69461, -18525, 44349, 64485, 19366, 24275, 210995, 183130, -17599, -39508, -32892, 70252, 42240, 14596, -25005, 60045, 140659, 152874, 147616, 112334, 15268, 26981, 32942, 3532, -9671, 1780, -134628, -48837, -14137, -28112, -9440, 68860, -67587, -174458, -202319, -238039, -231630, -102310, -102585, -178206, 15992, 35556, 41968, -55217, -127066, -132319, -164169, -131339, -72279, -12225, 5231, -19557, -6091, 71152, 89227, 19081, 57579, 61391, 57200, 26674, 8968, -56128, -145967, -225297, -142855, -32494, 62269, 116894, 94364, 64948, -26449, 38673, -95628, -167482, -52686, -31053, -53033, -54156, -80597, -87945, -13179, 20359, -3568, -6442, 99159, 95333, 240, 69020, 27438, 62183, -10558]
7040a0558k7474J01328m8106j30478j20277L8839J34417P5343J8035n0342q1396
7029a00669M073P9945M7368K7950M3485l0665q0779L8518Q9665Q2289j31087j03984
7017c3891j0899j9111P8733L9709p096m2902r2986q6588Q4281J28702N7382k7183
7005F8151o8426j38835o1943Q219o4363M3790Q2836P1983L2067n9428j06857M4824
6993a47982J18705j02296k979J1712M6514k8234j47994l6298L1730J31368R6387
6982b9367N8174k1768m8460o2141Q5587K0575J21348o6576m6274m5355o8381J2753
6970h9885J8174J07810O3696J03646n9139n5152L0797R337j91073j36167J53860
6959d4096N7010j4176o0662o4354P0040L8686p4948N2541R2434R0883L658K9204
$$ y = [-10558, -38032, 63296, 15190, -115288, -235565, -196726, -62309, 13034, 31069, -19273, -100669, -96596, -16651, 30717, 58667, 102152, 71487, -9292, 29226, 118891, 201180, 70093, -33891, -44790, -63901, 14832, 54541, 47445, 4543, -88443, -175031, -90750, 37952, 95334, 68151, -275, -139110, -201053, -192834, -257197, -213407, -130571, -58588, -26521, -85949, -192806, -147982, -29277, -131573, -134552, -122840, -76326, -104560, -252554, -288852, -257122, -125754, -29367, 28807, 7039, -41421, -103562, -17975, 2600, 123948, 57372, 11098, -34257, -102638, -89885, -71711, 36099, 99795, 203441, 144302, 89150, 119947, 129284, -61789, -197956, -44096, 12914, -1262, -61924, -126278, -56238, -17552, -92500, -39959, 52475, 143358, 147016, 176220]
6947A76220L6181q1921j41366j869K9595K4716L775L9671O5889j63292j00272
6936a12673l5736j2840J02682k9972n5930k6098O4152l3956L55K4647j01024j9559
6924b35952r1426K3890N4521k1188m2722M5979J22219l5767k3998J3347k4449
6913b15546R1089q702p2382R344J51189O9517j10198j13987J15541J08511J5070
6902C9446N4176k3914m7762P4725p6889n9167O7661J6462J1671K1900r4722k05569
6890b21982o5468J41971k034j60057P4076L5522J2832Q9430N1660O7128J15568
6879A38646O7814o3632N0674j3733r0057k1403N0421J2891p2791j01718N0236
6868G348P9510j21984j2874o4449L7735k3877l8928k325M5753M2381J15738J06858
$$ y = [176220, 212401, 130480, -10886, -12755, 16840, 41556, 45331, 85002, 150891, -12401, -112673, -148409, -161249, -58567, -88539, -144469, -170567, -106415, -140371, -140016, -115369, -216393, -235952, -327378, -303488, -248967, -270155, -312877, -266898, -144679, -180446, -204444, -191097, -215546, -124457, -133159, -205541, -196197, -45008, 24509, -85689, -199676, -84135, 24376, 39446, 93622, 69708, 21946, 96671, 19782, -39385, 28276, 44738, 56409, 78309, -16413, -221982, -287450, -145479, -147513, -307570, -233494, -197972, -185140, -95710, -44050, 23078, 138646, 206460, 142828, 193502, 179769, 89712, 68309, 118730, 131621, 58830, -42888, 7348, 86858, -35126, -48000, -112449, -74714, -98591, -137519, -139844, -94091, -51710, 64028, 170886]
6856A70886n5576M6928Q6313o1873j26880r7391K2387P1948P2089q8242o746o3503
6844b9660k1941J4503J12795L502j24681j06133l9559N0457n907J6331J02069
6833b8224J69664q402N7227P7443q8923n6447O976J4462r8794j7351R2275q7279
6821C2627P6482R394k8625K1975q2242m1126l3589p0119K552K6113J44546K7005
6809H4993j7212j3433k4109l2751r0358j00074p704N1793N5891N3655j2242n9957
6797a11508j14592J2313P0729k5424j0660J56311Q1414j1636J33486L4996O9007
6786B84436r799p2586r8830j79942k30R6556J05675M1497l2216o6047r9881j6180
6774d7547J6133L0340P7968J14870o0747r7697n8856o0624k3206M2665P6701q4203
$$ y = [170886, 115310, 162238, 248551, 186678, 59798, -37593, -15206, 56742, 128831, 40589, 33843, -29660, -51601, -37098, 75697, 79199, -45482, -151615, -191174, -140717, -146624, -130293, -28224, 141440, 133038, 190265, 267708, 178785, 122338, 129314, 143776, 44982, 27631, 119906, 32627, 109109, 118503, 89878, 111853, 29611, -11515, -45104, -115223, -112671, -86558, 57988, 84993, 67781, 54348, 30239, -2512, -92870, -192944, -200648, -148855, -92964, -39309, -51551, -111508, -226100, -213787, -143058, -168482, -179142, -22831, 58583, 46947, 180433, 215429, 284436, 274637, 202051, 103221, -76721, -76951, 19605, 125280, 166777, 134561, 68514, -31367, -47547, -31414, -1074, 76894, 191764, 131017, 33320, -25536, -86160, -109366, -66701, 10000, -74203]
6762g4203M8238N2967n1723o0356R4992M2826n7363o4801J144N4965R4882M2585
6750A24153j383m4657j10588k4267r323q9040L5440P9048J06772K4563p8627J04228
6738A16319J32249J5213M2633j40814j64272j15078R014O0562K537P4139R3484
6727A25986n9547l6604k2201N0144l6134j20393M426N9587J27379K7339L9893
6716A59875J6606n8331j074m5777o8140l1269R0936J06702m1113j10372p7898
6705e9855j02824j07137K1213K3225j23J15896P5729k2230L0725j17662L7764
6694a05279Q3815k715r07l1603m1139m8738J7634N0793N0295Q1195j46785j14789
6682b08223R779k2470J30816L2983j11928n926n0495Q923j3814J5205M5914q876
$$ y = [-74203, -25965, 27002, -24721, -85077, 9915, 52741, -4622, -69423, -68279, -13314, 81568, 124153, 122770, 78113, -32475, -56742, -66065, -155105, -119665, -40617, 66155, 90718, 12091, 116319, 248568, 263781, 306414, 165600, 1328, -113750, -104736, -44174, -41637, 32502, 125986, 66439, 29835, 7634, 57778, 21644, -98749, -94323, -34736, 92643, 119982, 159875, 176481, 118150, 117076, 71299, 3159, -28110, 62826, 169528, 128415, 18043, -59855, -162679, -269816, -248603, -225378, -225501, -109605, -33876, -56106, -25381, -143043, -105279, -21464, -24179, -25086, -56689, -97828, -146566, -128932, -78139, -27844, 53351, -93434, -208223, -198444, -220914, -90098, -57115, -169043, -174969, -225464, -216541, -230355, -215150, -169236, -178112]
6670a78112J5966J77477K8141K6028K5477O0176m8511m7194j5662N5738K1782
6659A21306J29177n3959p3938q5554j97430j4228P6265J38747M9244j28773j08141
6648a47284j22956J66011O4022N3142m1269k9170j02121R9441J12440l0952j14768
6637i3464n5365p5834j8725K2481k7249q2982Q5455J01262P8751n763j4413r9751
6625a85597o6435J25703J17213k8015m7318k4426J18325m5012J143p3615O1752
6614d6282j7732j00841p408L2810m0432N7583J28884p0604j30419r096J12875
6603i0662K6856k5087K9799k980P9499k608k7851O5953K2281O0759r2183r8047
6591e4271K6235O6622R1131M6766K383l0226j41769n8520n1257r595K5811l4126
$$ y = [-178112, -162146, 15331, 43472, 69500, 94977, 155153, 106642, 59448, 43786, 99524, 121306, 250483, 196524, 122586, 37032, -160398, -174626, -98361, 40386, 89630, -39143, -147284, -270240, -104229, -40207, 12935, -28334, -57504, -159625, -60184, 52256, 21304, -93464, -148829, -224663, -243388, -220907, -248156, -331138, -245683, -144421, -65670, -71433, -85846, -185597, -252032, -126329, -9116, -37131, -84449, -108875, 9450, -35562, -34419, -108034, -46282, -64014, -164855, -172263, -139453, -179885, -122302, 6582, -64022, -194441, -203537, -90662, -63806, -88893, -59094, -62074, 17425, 14817, -13034, 52919, 75200, 135959, 43776, -54271, -28036, 38586, 129717, 176483, 178866, 148640, 6871, -51649, -102906, -112501, -86690, -120816]
6579a20816n2383n4011J22585J24383Q5621j17417q3303K2278J84786N1287p1279
6568I1731k3704j4045l9616j04309m9757p308l1798R3096M8002K597N501l4735
6556f4345O1299M642M0764J09240J8719O51j05833m2479j6066O8368Q8774l0929
6544A32805o3884J388L1793K6147l5798J8813j19563j11436o6524P9852l616J39678
6532B9655M8456k8014n3158k1624j56125L6529K3939J5819N775L4027P8304N1425
6520F5008L9580r5553J9512O4367J0992r1254k1470P8950J1143K5632J3628r464
6508A11071l0249l0227n0359L3382r8136L3074J78325J68653J3078K4724j24320
6497B29016j35075j42025p251Q0193j59209j49886j5887j899P3008N1085O1829
$$ y = [-120816, -173199, -227210, -104625, 19758, 105379, -12038, -95341, -73063, 111723, 163010, 91731, 68027, 53982, 14366, -89943, -139700, -147008, -178806, -85710, -37708, -35111, -29610, -64345, -3046, 1596, 42360, 151600, 170319, 170970, 65137, 22658, 6592, 74960, 163734, 132805, 68921, 70309, 102102, 128249, 92451, 111264, -8299, -119735, -186259, -106407, -110023, 29655, 78111, 50097, -3061, -24685, -180810, -144281, -120342, -104523, -98748, -64721, 13583, 65008, 104588, 9035, 28547, 92914, 103906, 12652, -8818, 70132, 81275, 106907, 120535, 111071, 80822, 50595, 236, 33618, -64518, -31444, 146881, 315534, 328612, 353336, 229016, 93941, -48084, -55335, 24858, -134351, -284237, -300124, -302023, -229015, -177930, -116101]
6486a16101Q5822J13533O0945k5099J0562l9459K9766k9815l5775p2417m5221
6475f3259N0062K26649O0145o6320o9479p5344j95k4686r5045M4299J02838O6250
6463A55915j12077j40236o4291L0364J55340J16174o0864k3131L4220J9528J3039
6452A23981l0350K8096j0148j01981L5182l9813m5095k3575l572P113m9065O5186
6440d4041O1001M0457k7708j03498P9015N9556j7703q4685o9614N6210M8334m012
6428f688r170k009J55735n2383j27417K0942J761j24013j39034k4730P4915p153
6416b39244O2205J47854J03635Q3504l9186r093R762J1639K2886j18181J2275
6405D8056J2805o286j0046o0617l1721J4207K6931j26215j4695L8518l2423j17597
$$ y = [-116101, -30279, 83254, 144199, 119100, 129662, 90203, 119969, 90154, 54379, -18038, -63259, -13197, 213452, 273597, 207277, 137798, 62454, 62259, 37573, -57472, -13173, 89665, 155915, 43838, -96398, -160689, -130325, 25015, 141189, 80325, 57194, 91414, 110942, 123981, 93631, 121727, 111579, 9598, 44780, 4967, -40128, -63703, -67275, -60162, -109227, -44041, 16960, 57417, 29709, -73789, 5226, 64782, 47079, -37606, -107220, -51010, -2676, -6688, -15858, -17867, 137868, 85485, -41932, -20990, -19229, -143242, -282276, -307006, -232091, -239244, -177039, -29185, 74450, 157954, 118768, 109675, 119437, 131076, 153962, 35781, 48056, 60861, 54575, 44529, -16088, -47809, -33602, -6671, -132886, -147581, -109063, -141486, -259083]
6393b59083P3364J07853Q7966L3153r109k7103j7324n9365K9824o7535l6609K7669
6381a16299l0231q064N6666J87516k6008j39664n4422O3353J0602l1385j41728
6370b29664m2853L9637O5411r374M1450R9087N7035m9972p9000K9498P5761J21199
6358A18215J36899J64382r0570k26978r8512p243o0543j95068R877K05687J90350
6347A46496j74903j43366M2038J24461P5414q6051j26494N887M9336J8361J10746
6336D1925O5551p4049R622Q0196n6345o8577r0252J15549L9395j15417n8980j07015
6324b18397R427R0641L2162j1582O044K1220N3468J28643K9649r0837q0612J8715
6312a1459L8713M1141Q185m1342p1783J33561k2357m662K3492o8795j28238Q8926
$$ y = [-259083, -185719, -77866, 10100, 43253, 34144, 7041, -10283, -69648, -39824, -107359, -143968, -116299, -146530, -154594, -97928, 89588, 63580, -76084, -130506, -67153, -56551, -87936, -229664, -272517, -232880, -167469, -176843, -135393, -36306, 20729, -29243, -108243, -78745, -2984, 118215, 255114, 419496, 328926, 101948, 3436, -3807, -64350, -259418, -249541, -43854, 146496, -28407, -171773, -129735, -5274, 70140, -15911, -142405, -136518, -87182, -68821, 41925, 107476, 33427, 43049, 123245, 66900, -1677, -91929, 23620, 63015, -52402, -111382, -218397, -208970, -118329, -86167, -97749, -91705, -70485, -17017, 111626, 141275, 50438, -30174, -11459, 27254, 68395, 76580, 35238, -36545, 97016, 74659, 69997, 93489, 24694, -103544, -14618]
6300a4618J34696M243o0539M0674l7340j14348j02996l6228N7025O9934o6318
6289a25815k8355j09923J12853J85235N1719q7995k8389J08014o36o4452K9871
6278D2127N1920j39588r5492N5065l1055r893J34376j3273n6608j11653J7094
6267a56980J03517N039n7469M8167k9372n4278K0868L8191O7831J05967M9173
6256A40654j01l2445L0038m3914j81964l511J24465J29882J100p7394j09473l4386
6244e7049K0910r4049j2752J03319K6412r9699q2212J12610J07520j1433j01850
6233h8273l6410K8819O8028Q6970j6743p78J62525j2137j66080j39076o4680J0415
6221a67420M5972K422Q0309m9603n2414m7276O3710L4889K8163p460O6044q531
$$ y = [-14618, 120078, 124321, 63782, 104456, 67116, -47232, -150228, -186456, -129431, -59497, -125815, -154170, -264093, -151240, 33995, 85714, -2281, -30670, 77344, 76708, 12256, 42127, 94047, -45541, -141033, -85968, -117023, -126916, 7460, -5813, -62421, -174074, -156980, -53463, -48424, -105893, -57726, -87098, -141376, -120508, -82317, -14486, 91481, 140654, 140553, 108108, 138146, 94232, -87732, -91243, 33222, 163104, 164204, 86810, -22663, -57049, -36139, -130188, -142940, -39621, -13209, -112908, -195120, -82510, 25010, 13577, -88273, -124683, -95864, -27836, 59134, 42391, 41613, 204138, 192001, 25921, -113155, -177835, -167420, -121448, -119026, -38717, -88320, -140734, -188010, -124300, -89411, -61248, -68708, -2664, -11195]
6209a1195q3209R769m4239Q2686J79801n066r6183q036J40103O3222J5911j55660
6197H7904r7742N4244K4288L563O5812j16658k35961Q7190N4223J33562J12975
6186A73400q3231j3493J6181n8726r1586J07021l6869Q9175l2418l7636M4154
6175G5972J21139r0042j18360q701j815N1898J55485N1113p3921k1505l6336j23203
6163a8276m3348p6102k0608J4682J03484L5787o966L807J13070K7896l784o3888
6151F5754j35517m1426N9372N5465L138q7012N1340J88075J11553N2185L7908
6140C60835j17558j69500j06323K1060O1544J40760L9512K7145r8233o5502p697
6129H6043k2239j00076p2943n6310L7671O0507o22O7059M5060J9587j0419k4683
$$ y = [-11195, -94404, -84635, -128874, -46188, 133613, 128547, 32364, 24328, 164431, 227653, 243564, 87904, -9838, 44406, 68694, 72257, 138069, 21411, -214550, -127360, -73137, 60425, 173400, 90169, 76676, 92857, 34131, -57455, 49566, 12697, 101872, 69454, 31818, 75972, 197111, 107069, -11291, -19992, -21807, 30091, 185576, 236689, 162768, 141263, 104927, -18276, -61624, -137726, -158334, -143652, -40168, -4381, -11347, -7540, 105530, 133426, 129642, 65754, -69763, -111189, -51817, 3648, 6786, -80226, -28886, 159189, 270742, 322927, 360835, 243277, 73777, -32546, -11486, 50058, 190818, 230330, 257475, 159242, 93740, 86043, 63804, -36272, -109215, -165525, -127854, -67347, -67969, -910, 44150, 63737, 53318, 28635]
6117B8635j42079n3400J32745J48603k8554j18637J572k9949k7656J10655J2599
6106C4534j5185M1233k8308q028o3004L7493K3521J440l0205j9180p1715m140
6094a01544q770O4973N8312Q2116o6946n4116k1648k8614j10771L6879J05562
6083d4567o2349L210K6231K06740P9112k6089j47770M8040J314r2500Q250l1553
6071c1931k0425J22411k552m1849o8932j5056M9475p2616O643J23978N7281l7261
6059F9166k954q1719R876o9216R5482J41096l1942L9845o0946q1155O1463M6715
6047A35711J2292J33015R6076o8843q1853n9604P869j10387q3680M3952J01816
6036A26364J7317O0852j637j13837o8543K8573l3657m3019n4134P0037J6730j28869
$$ y = [28635, -113444, -166844, -34099, 114504, 85950, -32687, -31115, -61064, -88720, 21935, 34534, 19349, 60582, 32274, 24246, -38758, -1265, 22256, 23696, -6509, -25689, -97404, -101544, -110314, -45341, 12971, 95087, 28141, -25975, -47623, -76237, -187008, -150129, -44567, -106916, -103706, -77475, 129265, 208377, 182288, 34518, 82558, 83872, -8628, -378, -31931, -52356, 70055, 67503, 25654, -43278, -58334, -8859, -81475, -74832, 49146, 106427, 69166, 66212, -15507, -5631, -74847, 20635, 161731, 129789, 169634, 108688, 27533, 88996, 135711, 148003, 281018, 377094, 308251, 226398, 166794, 174663, 64276, -19404, 24548, 126364, 143681, 204533, 202896, 89059, 20516, 49089, 15432, -27587, -81721, -11684, 5046, -123823]
6024a23823N71P0975k0694R8511J07039r678j28796n4932l3775j9782J01507m592
6012a7469J210k9640o2435j4929o7777m982Q2271J04923L6037o2684L8802O727
6000A0054m2543k0342l9300j8607j8802p1517n7853O3082R9085J0928O5240O274
5988a4301k3082L957n5459j8013o163j9580j6248J6430Q8500N9373K2244l6227
5976A431j00568j32918M9562m2210L9847M9760l7319J56317L5334K3300N0837
5965I3373l0087l7221k7150p4833j09249q541J78985K7885j11082k5175J34213
5954A1118R6423j21459p9433n6326L8110N0007K5099M8190m5642j07791M7763
5943i3941k2499J4793J04754J53293J20675K0933j81371j33335J4411m7866p2851
$$ y = [-123823, -123252, -52277, -72971, 25540, 132579, 122901, -5895, -60827, -94602, -114384, -12877, -17469, -16259, -45899, -108334, -123263, -191040, -196022, -113751, -8828, 27209, -35475, 3327, 10054, -32489, -52831, -92131, -110738, -129540, -201057, -258910, -195828, -96743, -85815, -20575, -14301, -37383, -33426, -88885, -106898, -113061, -132641, -148889, -132459, -43959, 15414, 37658, 1431, -99137, -232055, -182493, -224703, -184856, -135096, -172415, -16098, 19236, 42536, 93373, 63286, 26065, -1085, -75918, -185167, -193708, -14723, 13162, -97920, -123095, 11118, 107541, -13918, -93351, -149677, -111567, -61560, -36461, 11729, -33913, -141704, -93941, -116440, -101647, 3107, 156400, 277075, 298008, 116637, -16698, -2287, -50153, -123004]
5932a23004r1063m0948J09682j499N8853O8357o8138n747N1737N3002J9956r4263
5920f3075j13039O1525J00693K0663j1746n4464m2087O6009k2417O8584K6524
5909C7170q613K6742o2510J01123J54577q937j38964j04862n5285J2720m4568
5898i1407n8346m5862K4267J53942J03051k3198J1676k0410q2286N4226m8252
5887b2599m3114k1889n0964l182J75547N2410r1255m587P172n0163j20443J01557
5875g1510K4566j23982k8820l2188J27927O2829J59366L3285r0353j0990j02155
5864e2025j19956K6611r565P2973K0679m0448K7444r0838L4966N7556P1752R1046
5852I0195j00996j10658K9991R0042q0141k3371K4820M8800L4173o2577j34499
$$ y = [-123004, -214067, -255015, -145333, -146832, -87979, -19622, -87760, -93507, -41770, 11232, 31188, -63075, -176114, -114589, -13896, 6767, -4979, -59443, -101530, -35521, -57938, 10646, 37170, 28557, 55299, -7211, 93912, 248489, 239552, 100588, -4274, -59559, -46839, -91407, -149753, -195615, -171348, -17406, 85645, 62447, 74123, 53713, -28573, 25653, -22599, -65713, -87602, -138566, -141748, 33799, 86209, -5046, -9633, -2461, -52624, -173067, -71510, -46944, -170926, -199746, -231934, -104007, -41178, 118188, 151473, 61120, 50130, -52025, -171981, -145370, -154935, -81962, -61283, -101731, -74287, -165125, -130159, -72603, -851, 90195, -10801, -121459, -91468, -1426, -81567, -104938, -80118, -31318, 2855, -59722, -194221]
5841a94221j03145K1059M9207N6212N3266O1555R6292n7674P4096l824n6808l6
5829d021J7844O4274N010r5507J9317J11607K7238m0074m9640K4736p338n2517
5817B0929r0322N8954M1657j41521n5696J6655N2725K4805K2709m4826R9583Q6185
5805I1837k7597l9742j33868j26422R4476J32923o6676m5193J8872O0085L4524
5794f781J6674p0112M5216n0209K0173P0476L3087Q1230j38159j5424m9389n8121
5782a21339m6525M484N6899o3612N6160K3719J31101J28598o0983q7715p3863
5771e3076N1977r2302n7980P6694J87769K1723n7804j12790j6161R988m1093J0852
5759g2203l8797K1904K3457P4259N0369j3776n12j65782m757J22666J13644J9958
$$ y = [-194221, -297366, -276307, -227100, -170888, -117622, -56067, 40225, -17449, 56647, 52823, -3985, -4021, 13823, 78097, 83107, -12400, 6917, 118524, 145762, 105688, 56048, 80784, 73446, 20929, -69393, -10439, 31218, -110303, -165999, -149344, -96619, -71814, -49105, -93931, 5652, 91837, 64240, 24498, -109370, -235792, -141316, -8393, -75069, -120262, -101390, -41305, -6781, 9893, -60219, -15003, -65212, -45039, 25437, 58524, 139754, 1595, -13829, -63218, -121339, -167864, -163380, -106481, -170093, -113933, -90214, 40887, 169485, 108502, 20787, -53076, -1099, -93401, -151381, -74687, 113082, 134805, 77001, -35789, -51950, -41962, -83055, -72203, -111000, -89096, -65639, 8620, 58989, 45213, 44701, -121081, -125838, -3172, 110472, 130430]
5747A30430M9209l8586r8534k4209l3240o9729L6870J9660n3314n9116j4442l5349
5735a90350J3954J01435J0249Q5591m7211n2177p8253K8483J0238K03349R2693
5724A78001j69917j9021k6657j9929N7232P807L0959K5429l515J37611r3504j49163
5712d4667l4989j9745J45044M1337j07497j05806p0060L2264J05458O0027j38238
5701a36872M566N6227l0589m1705J24399N5122J1655j5634M6994J37922j7547
5690A94538j27318M979j3717m8041J5713j38332j29914M4785L5271M4954L8521
5679g8561m2220J35691J39913m9941M2817r4292j14798k496r671l2015Q8604P2603
5667E5634o3802p379P2081j6525r5172m8956j6201m9969M2190N2082J6123P6113
$$ y = [130430, 179639, 141053, 42519, 18310, -14930, -84659, -47789, -28129, -81443, -140559, -155001, -190350, -176396, -74961, -64712, 20879, -26332, -78509, -156762, -128279, -118041, 85308, 178001, 8084, -10937, -37594, -57523, -291, 7516, 38475, 63904, 60389, 198000, 104496, -44667, -79656, -99401, 45643, 86980, -20517, -126323, -196383, -164119, -58661, 1366, -136872, -132306, -76079, -106668, -148373, -23974, 31148, 42803, 27169, 74163, 212085, 194538, 67220, 72199, 58482, 10441, 26154, -112178, -242092, -197307, -162036, -117082, -78561, -120781, 14910, 154823, 104882, 147699, 53407, -61391, -63887, -73558, -105573, -16969, 55634, -8168, -15547, 56534, 40009, -55163, -104119, -120320, -170289, -128099, -76017, -59894, 16219]
5655A6219K9840r4861o8860J5418N8179J02165M389p4747N9869k9657M448m4238
5643b1836k2732K6300k8103M0202q5814K9464p2382j11976Q6237J36274L189r725
5631c0902N6191J2619r425q6782n9221q249O1419K4407q6609N6969L1695l6939
5619g4827j06569P045J08477J9004K8145J36284r5277r9899J0574N9020K8414
5608B0391R9649j6824j4430m9049j10880k328n4411M3693l5940n2505Q3279J69325
5596G9970l9152j9317N7203q8506K9218k2352q8693J31078R0456m0472r4637n2909
5584e8113K7597Q0067p6437r9019K1795l0141p4620O4894P5974L1910M0409m2999
5572c8683j06570N5160R7121k9489l2944m2767R4802L6129J2260P8921N4537j05003
$$ y = [16219, 46059, -48802, -117662, -102244, -44065, 58100, 62489, -12258, 47611, 17954, 22402, -21836, -44568, -18268, -46371, -6169, -91983, -62519, -134901, -246877, -160640, -24366, -21177, -30902, 25289, 37908, 28483, -58299, -117520, -125769, -64350, -39943, -126552, -69583, -37888, -74827, -181396, -174351, -65874, -46870, -18725, 117559, 22282, -77617, -67043, -8023, 20391, 120040, 103216, 88786, 39737, -71143, -73471, -127882, -84189, -120129, -172634, -89355, 79970, 40818, 21501, 78704, -9802, 19416, -2936, -91629, 39449, 129905, 89433, -5204, -58113, -30516, 49551, -26886, -125905, -104110, -134251, -208871, -143977, -68003, -36093, 4316, -38683, -145253, -90093, 7028, -22461, -55405, -98172, -3370, 32759, 45019, 123940, 178477, 73474]
5560G3474r7507p1145n300n2902M720M8602J00772N4630k9030O6640k0719p3882
5548a647M7283N6245r2733j44814R9832J3789P8264J08897Q4074o4238p0909l3845
5536H0198m7851J1577l3148p6056o9383J27516P7338l3740K9366o9115m5868l7092
5524h6258Q7225N0771L7623q3584N126m8121p0491P7044N2525J9909k6165l7046
5512b1442n8315O0573k3713o5647M1689N0196N362P0673j3640n7841j37528p1605
5500b21238k8104K7606P0578j13120O475J18871J19115K2636j13874l4626R3334
5489e2347O5798o570j07246L1354k9722M873j23041r9910K23K01583J55711j15017
5477g4311o6361m8605L5777l4697Q2862J05865J9060n673j50063O4662J36665
$$ y = [73474, -24033, -95178, -100478, -153380, -148660, -100058, 714, 55344, 26314, 92954, 72235, -1647, 45636, 101881, 9148, -135666, -35834, -22045, 56219, 165116, 249190, 184952, 114043, 80198, 32347, 43924, 10776, -65280, -134663, -7147, 70191, 36451, 65817, -3298, -49166, -86258, 967, 51738, 89361, 5777, 10903, -37218, -107709, -30665, 21860, 41769, 15604, -21442, -79757, -19184, -42897, -108544, -66855, -16659, -11297, 59376, 45736, -12105, -149633, -221238, -249342, -221736, -151158, -264278, -257803, -138932, -19817, 2819, -111055, -145681, -52347, 13451, 6881, -100365, -69011, -98733, -93860, -216901, -316811, -316588, -115005, 40706, -74311, -140672, -189277, -153500, -188197, -105335, 530, 19590, 13917, -136146, -71484, 65181]
5466F5181M8006j39876r8189P1666N884m0890J00287N404p9174R7321m0821j45172
5454a50373n738K0120O4258M7848l9978l2201J1838Q3342q1895k1233n9523L3575
5442a29960N4048q6393p386N9561l9983n8397q2753m9606R577M5660R6907J60968
5430b7757O4110k344j0850N8019o60r603J2452M6470L4575r8447o1400m7123m0805
5417h3363M4924m3615J03841N8433k7821O3393l6322j12141L9829J49007j1843
5406A44322j53703k31809r7767Q8505J65810P0823N6107N496j77457k9587J44770
5395a4490R9341K3401l5521p715N2431k735j36031p1855l5111M4388P2282n7409
5383f9024q7961J8025J6201k5285n2808L6738J30783O0530p2268J6236K1199K0423
$$ y = [65181, 113187, -26689, -124878, -53212, -47328, -88218, 12069, 17473, -61701, 35620, -5201, -150373, -156111, -135991, -71733, -23885, -63863, -96064, -84226, -884, -82779, -104012, -163535, -129960, -75912, -162305, -169691, -110130, -150113, -208510, -291263, -340869, -331292, -285632, -188725, -27757, 36353, 34009, 23159, 81178, 80518, 70915, 83367, 129837, 164412, 65965, 4565, -42558, -83363, -38439, -82054, 21787, 80220, 52399, 115792, 79470, -32671, 7158, 156165, 144322, -9381, -241190, -338957, -250452, -84642, -13819, 42288, 47784, -129673, -159260, -14490, 84851, 108252, 72731, 65016, 117447, 114712, -21319, -93174, -128285, -83897, -11615, -69024, -156985, -138960, -122759, -148044, -200852, -164114, -33331, 27199, -45069, -28833, -7634, 12789]
5371A2789j9295K345r6260j80193m1977L2540O2250R7381o3457k4040O5697P8650
5359g3570n2302J6720P0339K17049R7739o0727n1295r9416j33049m5970p253M8182
5347g3553q1210j5628O1666J07045r572l5409J6064J4370l4238n305M2936n7996
5335g0830o3783q4177P2548K2293L8706K1318o5735L672K01626J45234p9506j16002
5323B5364m7458l5239P9443O4082k0860l8996p8108j21257O9638J42108P3514
5312A12231o1094n6865M145L4541P768n7930j8605K2307j8020J3379n3570Q5221
5300A3508j6698J5568o573n1425M8416j0013J2610l1508j33108l839o0226M2065
5288a81223L0872j6822N6217j0123m1437j2541J5168J16062K9931N9030j20562
$$ y = [12789, -6506, -4161, -100421, -280614, -322591, -290051, -227801, -130420, -193877, -217917, -152220, -73570, -125872, -109152, -38813, 178236, 275975, 215248, 163953, 64537, -68512, -114482, -121735, -73553, -154763, -170391, -108725, -1680, -11252, -46661, -30597, -16227, -50465, -55770, -12834, -70830, -134613, -218790, -146242, -123949, -85243, -63925, -129660, -125988, 75638, 220872, 141366, 25364, -22094, -57333, 22110, 86192, 65332, 26336, -51772, -173029, -103391, 38717, 112231, 51137, -5728, -1583, 32958, 40726, -17204, -35809, -13502, -31522, -18143, -71713, 13508, -3190, 12378, 5805, -45620, 2796, -7217, 5393, -26115, -159223, -163062, -223288, -181223, -150351, -167173, -110956, -121079, -162516, -175057, -159889, -43827, -13896, 45134, -75428]
5277g5428l9574K5327j9881J8784J1483o3367j0256K6411j4559R4715K6653p9887
5265i9579M2813P9211p7281N6060n3318p6896K5313L8543Q6267n5471q3703J1960
5253a06081O1328l0408O3817P0865j43516j29718q66J02684J75872J26059L8949
5242B28985o993l1526O3334m315j48172k3817j20854j76576L7787N8002K2504
5231a01641n9858n3843j62116m5554P8499J67870R9107K0026R7536J2700r900
5220D2826O4223k8100q8338q8382p0984J34252J02249j10101q3603N0054p9460
5209a55364R8190P2450o6790l955M4037J13183J8241Q3337R0551q7763q7627q3311
5197C5179j29354j5127L5994L1812L6572r7887r082P7882j0703j19671o2339J59606
$$ y = [-75428, -115002, -89675, -109556, -90772, -79289, -142656, -152912, -126501, -141060, -46345, -19692, -99579, -56766, 22445, -54836, 1224, -52094, -128990, -103677, -65134, 21133, -34338, -118041, -106081, -44753, -75161, -11344, 59521, -83995, -213713, -214579, -111895, 63977, 190036, 228985, 221992, 190466, 253800, 249485, 101313, 77496, -43358, -219934, -182147, -124145, -101641, -161499, -215342, -377458, -423012, -344513, -176643, -77536, -57510, 40026, 52726, 42826, 107049, 78949, -9389, -97771, -168755, -34503, 67746, -42355, -125958, -75904, -155364, -57174, 15276, -51514, -55469, -11432, 101751, 119992, 203329, 293880, 206117, 118490, 35179, -94175, -109302, -73308, -41496, -4924, -102811, -111893, -34011, -44714, -164385, -226724, -67118]
5185f7118O5239O1979N2809M5631N198q6394r1813m8392p7111J5089J9712J35289
5173C0118k0395j9092M9488j05779l1077M8931j2818P2472L4737l5379r7192R0888
5161D902p1560j3712l9854K6031j2448J31849N586Q990k1961l4192J32515M3191
5149A59337j35424k08988J20668L7915P133J48944N3405r3122j46518r8640M676
5138a50614J39601P931r5325j2J12112L0636J03387k5412q3382j35184l877L7179
5126f2960n6711n5081K3821J16225Q7504J38445J6958l6635j07357q2099o8712
5115h6602k7290n505l8121J0602J38991J6781K0669n2522K102k1595o3110r0047
5103a95647k7494J9018M3839k5126l4072P3299M7662K1084o137k2629n35P4005
$$ y = [-67118, -1879, 60100, 112909, 158540, 163738, 77344, -14469, -62861, -139972, -124883, -105171, 30118, 9723, -9369, 40119, -65660, -96737, -47806, -60624, 11848, 46585, 11206, -85986, 4902, -66658, -80370, -120224, -94193, -106641, 25208, 30794, 39784, 17823, -16369, 116146, 159337, 23913, -185075, -64407, -26492, -19359, 129585, 182990, 89868, -56650, -155290, -150614, -11013, -3082, -98407, -98419, 13693, 44329, 147716, 122304, 38922, -96262, -100139, -62960, -119671, -174752, -150931, -34706, 52798, 191243, 208201, 171566, 64209, -17890, -86602, -113892, -119397, -157518, -146916, -7925, 8856, 29525, -22997, -20895, -42490, -105600, -195647, -223141, -204123, -160284, -185410, -219482, -146183, -98521, -77437, -83574, -106203, -106738, -32733]
5091c2733p27r7059O6365J5021k7505O8904P6515j05877o8321o9772P9126J52980
5079E6917q291l2770q4282N861P4744J13417K0740m2224M2444k7955l6042j23328
$$ y = [-32733, -33460, -130519, -64154, -49133, -76638, -7734, 68781, -37096, -105417, -175189, -96063, 56917, 48626, 15856, -68426, -62565, 12179, 125596, 146336, 104112, 146556, 118601, 82559, -40769]
$$ [...]
##END NTUPLES=NMR SPECTRUM
##END=
