##TITLE=Analysis number 321830
Compound Code mo 01101
Project Code adrs
Chemist Name hixia
##JCAMPDX= 6.0         $$ Bruker NMR JCAMP-DX V2.0
##DATA TYPE= NMR SPECTRUM
##DATA CLASS= NTUPLES
##ORIGIN= Bruker BioSpin GmbH
##OWNER= nmr
$$ XWIN-NMR		Version 3.5
$$ Wed Aug 30 10:58:28 2006 GMT Daylight Time (UT+1h)  MAYBRIDGE\nmr@NMR_250MHZ
##.OBSERVE FREQUENCY= 250.131544655141
##.OBSERVE NUCLEUS= ^1H
##.ACQUISITION MODE= SIMULTANEOUS (DQD)
##.ACQUISITION SCHEME= undefined
##.AVERAGES= 16
##.DIGITISER RES= 18
##SPECTROMETER/DATA SYSTEM= dpx250
##.PULSE SEQUENCE= zg30
##.SOLVENT NAME= DMSO
##.SHIFT REFERENCE= (INTERNAL, DMSO, 0, 16.522)
##AUDIT TRAIL= $$ (NUMBER, WHEN, WHO, WHERE, WHAT)
$$ ##TITLE= Audit trail, XWIN-NMR		Version 3.5
$$ ##JCAMPDX= 5.01
$$ ##ORIGIN= Bruker BioSpin GmbH
$$ ##OWNER= nmr
$$ C:\u/data/dgb/nmr/ADRS/1880/pdata/1/auditp.txt
$$ ##AUDIT TRAIL=  $$ (NUMBER, WHEN, WHO, WHERE, WHAT)
(   1,<2006-08-30 10:58:01.89 +100>,<MAYBRIDGE\nmr>,<NMR_250MHZ>,
      <created by zg, POWCHK disabled, PULCHK disabled
       configuration hash MD5:
       E2 DF 36 D8 04 B2 41 60 5A D7 A3 38 5A 4B D0 FE
       data hash MD5: 64K
       3B 67 64 45 9D 5C FD 82 05 96 F4 FB A3 E3 43 C2>)
(   2,<2006-08-30 10:58:16.65 +100>,<MAYBRIDGE\nmr>,<NMR_250MHZ>,
      <Start of raw data processing
       ef LB = 0.3 FT_mod = 6 PKNL = 1 SI = 32K 
       data hash MD5: 32K
       2D 90 D1 B4 B9 76 FC 65 06 56 76 AD D8 31 FD 90>)
(   3,<2006-08-30 10:58:18.73 +100>,<MAYBRIDGE\nmr>,<NMR_250MHZ>,
      <apk 
       data hash MD5: 32K
       5F DB FA 71 32 F5 88 20 FE 99 23 F8 60 62 A2 37>)
(   4,<2006-08-30 10:58:19.50 +100>,<MAYBRIDGE\nmr>,<NMR_250MHZ>,
      <abs ABSG = 5 
       data hash MD5: 32K
       7B D8 7D 20 1F 6C B4 7E 0A 04 8B 8F 90 2C C2 4B>)
$$ ##END=
$$ 
$$ hash MD5
$$ 02 E6 D3 A0 C5 25 F4 69 0B 49 4A C0 B1 BA 5C 3F
##$RELAX= 
##$RELAX= 
##$RELAX= 
##$RELAX= 
##$RELAX= 
##$RELAX= 
##$RELAX= 
$$ Bruker specific parameters
$$ --------------------------
##$DU= <C:\u>
##$EXPNO= 1880
##$NAME= <ADRS>
##$PROCNO= 1
##$TYPE= <nmr>
##$USER= <dgb>
##$AMP= (0..31)
100 100 100 100 100 100 100 100 100 100 100 100 100 100 100 100 100 100 
100 100 100 100 100 100 100 100 100 100 100 100 100 100 
##$AQSEQ= 0
##$AQ_mod= 3
##$AUNM= <au_zg>
##$AUTOPOS= <13 >
##$BF1= 250.13
##$BF2= 250.13
##$BF3= 250.13
##$BF4= 250.13
##$BF5= 500.13
##$BF6= 500.13
##$BF7= 500.13
##$BF8= 500.13
##$BYTORDA= 1
##$CFDGTYP= 0
##$CFRGTYP= 5
##$CHEMSTR= <none>
##$CNST= (0..31)
1 1 145 1 1 1 1 1 1 1 1 1 1 1 1 1 1 1 1 1 1 1 1 1 1 1 1 1 1 1 1 1 
##$CPDPRG= <>
##$CPDPRG1= <>
##$CPDPRG2= <>
##$CPDPRG3= <>
##$CPDPRG4= <mlev>
##$CPDPRG5= <mlev>
##$CPDPRG6= <mlev>
##$CPDPRG7= <mlev>
##$CPDPRG8= <mlev>
##$CPDPRGB= <>
##$CPDPRGT= <>
##$D= (0..31)
0 1 0 0 0 0 0 0 0 0.06 0 0 0 0 0 0 0.0002 0 0 0 0 0 0 0 0 0 0 0 0 0 0 
0 
##$DATE= 1156931880
##$DBL= (0..7)
120 120 120 120 120 120 120 120 
##$DBP= (0..7)
150 150 150 150 150 150 150 150 
##$DBP07= 0
##$DBPNAM0= <>
##$DBPNAM1= <>
##$DBPNAM2= <>
##$DBPNAM3= <>
$$ [...]
##$SUBNAM7= <"">
##$SUBNAM8= <"">
##$SUBNAM9= <"">
##$SW= 20.6930455092707
##$SWIBOX= (0..15)
0 0 3 0 0 0 0 0 0 0 0 0 0 0 0 0 
##$SW_h= 5175.983436853
##$TD= 65536
##$TD0= 1
##$TE= 295.16
##$TE2= 300
##$TE3= 300
##$TEG= 300
##$TL= (0..7)
0 120 120 120 120 120 120 120 
##$TP= (0..7)
150 150 150 150 150 150 150 150 
##$TP07= 0
##$TPNAME0= <>
##$TPNAME1= <>
##$TPNAME2= <>
##$TPNAME3= <>
##$TPNAME4= <>
##$TPNAME5= <>
##$TPNAME6= <>
##$TPNAME7= <>
##$TPOAL= (0..7)
0.5 0.5 0.5 0.5 0.5 0.5 0.5 0.5 
##$TPOFFS= (0..7)
0 0 0 0 0 0 0 0 
##$TUNHIN= 0
##$TUNHOUT= 0
##$TUNXOUT= 0
##$USERA1= <user>
##$USERA2= <user>
##$USERA3= <user>
##$USERA4= <user>
##$USERA5= <user>
##$V9= 5
##$VALIST= <valist>
##$VCLIST= <CCCCCCCCCCCCCCC>
##$VD= 0
##$VDLIST= <DDDDDDDDDDDDDDD>
##$VPLIST= <PPPPPPPPPPPPPPP>
##$VTLIST= <TTTTTTTTTTTTTTT>
##$WBST= 1024
##$WBSW= 4
##$XGAIN= (0..3)
0 0 0 0 
##$XL= 0
##$YL= 0
##$YMAX_a= 208504
##$YMIN_a= -415573
##$ZGOPTNS= <>
##$ZL1= 120
##$ZL2= 120
##$ZL3= 120
##$ZL4= 120
##$ABSF1= 16.522
##$ABSF2= -4.171173
##$ABSG= 5
##$ABSL= 3
##$ALPHA= 0
##$AQORDER= 0
##$ASSFAC= 0
##$ASSFACI= 0
##$ASSFACX= 0
##$ASSWID= 0
##$AUNMP= <proc_1d>
##$AZFE= 0.1
##$AZFW= 0.1
##$BCFW= 0
##$BC_mod= 0
##$BYTORDP= 0
##$COROFFS= 0
##$CY= 12.5
##$DATMOD= 1
##$DC= 0
##$DFILT= <>
##$DTYPP= 0
##$F1P= 14.0000005364418
##$F2P= -0.99999901652339
##$FCOR= 0.5
##$FTSIZE= 32768
##$FT_mod= 6
##$GAMMA= 0
##$GB= 0
##$INTBC= 1
##$INTSCL= 1
##$ISEN= 128
##$LB= 0.3
##$LEV0= 0
##$LPBIN= 0
##$MAXI= 10000
##$MC2= 0
##$MEAN= 0
##$ME_mod= 0
##$MI= 0
##$NCOEF= 0
##$NC_proc= -6
##$NLEV= 6
##$NOISF1= 0
##$NOISF2= 0
##$NSP= 0
##$NTH_PI= 0
##$NZP= 0
##$OFFSET= 16.522
##$PC= 1
##$PHC0= 139.5189
##$PHC1= 11.77373
##$PH_mod= 1
##$PKNL= yes
##$PPARMOD= 0
##$PSCAL= 4
##$PSIGN= 0
##$REVERSE= no
##$SF= 250.13
##$SI= 32768
##$SIGF1= 0
##$SIGF2= 0
##$SINO= 400
##$SIOLD= 32768
##$SREGLST= <1H.DMSO>
##$SSB= 0
##$STSI= 32768
##$STSR= 0
##$SW_p= 5175.98343685301
##$SYMM= 0
##$S_DEV= 0
##$TDeff= 65536
##$TDoff= 0
##$TI= <Analysis number 999999
Compound Code 99
Book Reference 9
Project Code 9>
##$TILT= no
##$TM1= 0
##$TM2= 0
##$TOPLEV= 0
##$USERP1= <user>
##$USERP2= <user>
##$USERP3= <user>
##$USERP4= <user>
##$USERP5= <user>
##$WDW= 1
##$XDIM= 32768
##$YMAX_p= 403238692
##$YMIN_p= -1413339
$$ End of Bruker specific parameters
$$ ---------------------------------
##NTUPLES= NMR SPECTRUM
##VAR_NAME=  FREQUENCY,     SPECTRUM/REAL,   SPECTRUM/IMAG
##SYMBOL=    X,             R,               I
##VAR_TYPE=  INDEPENDENT,   DEPENDENT,       DEPENDENT
##VAR_FORM=  AFFN,          ASDF,            ASDF
##VAR_DIM=   32768,         32768,           32768
##UNITS=     HZ,            ARBITRARY UNITS, ARBITRARY UNITS
##FACTOR=    0.157963299565203, 1,           1
##FIRST=     4132.6476996994, 0,             0
##LAST=      -1043.33573715361, 0,           0
##MIN=       -1043.33573715361, -1413339,    0
##MAX=       4132.6476996994, 403238692,     0
$$ Real data points
##PAGE= N=1
##DATA TABLE= (X++(R..R)), XYDATA
$$ [...]
25643c94569j70374j25191K77790J28337L8600J1381q3106p4062L0418J51246
25633b09530L1779j83963M48320J94703J6214j96225k23991j12316o9485J0107
25623b94387P086m07991J56638K54946k10433j16563J51163J49920l19604q0499
25613g09724L48267M31729K49251k69463p9895p8024L7436J90742N9776o0233
25603A19862k4989l8770j51886l86108k9108M6568R1664q2253J64936O4706m17503
25592f42881n0206J07807J70k05360J19353K24648k0123k53853p4915N26119K29449
25581c9792K5664K24051Q1008l14829l19250K60396k1985o2906m0786j3601l6085
25570b58115L33731l9085m11761N8165p6181L58837J82221J78169J94909l94903
$$ plain form
25643 -394569 -564943 -690134 -412344 -284007 -245407 -234026 -317132 -391194 -360776 -209530
25633 -209530 -177751 -361714 86606 281309 297523 101298 -122693 -235009 -304494 -294387
25623 -294387 -287301 -695292 -538654 -283708 -494141 -610704 -459541 -309621 -629225 -709724
25613 -709724 -361457 70272 319523 50060 -29835 -107859 -70423 120319 180095 119862
25603 119862 94873 56103 -95783 -481891 -510999 -464431 -372767 -455020 -290084 -225378 -642881
25592 -642881 -693087 -585280 -585110 -790470 -671117 -446469 -466592 -720445 -795360 -269241 -39792
25581 -39792 -14128 209923 290931 -23898 -343148 -82752 -104737 -167643 -208429 -222030 -258115
25570 -258115 75616 36531 -375230 -317065 -393246 -34409 147812 325981 520890 125987
25560A25987j54851n116k76995L58227M02224K43772j63702o4784p1144n5723
25550C37895n1735M9466k98011l98383J35293L65105k34945k63515J30880K16523
25540a1427K00368j95341m82804k84323J35981n4691K44028L28759J60999k41669
25530b00120m2980l12628j03039M80145k31566N1786M86842K66335l18948q7108
25520a1281K29078j45928o8864L00929k27447m7043R3309j52095J24106M7990
25510A42754r8390m1606J81287Q8718j84935l52605K65347j79395o3062L298k90568
25499e29157O8705J18980K35911J99121R3217k58365j93170L79511l00675k25513
25489d11435K26920J59786K68805R1450o8434l0762j03934J2562J47049l42896
$$ plain form
25560 125987 -28864 -33980 -310975 47252 449476 693248 529546 464762 393618 337895
25550 337895 286160 335626 37615 -360768 -225475 139630 -95315 -358830 -227950 -11427
25540 -11427 188941 -6400 -489204 -773527 -637546 -692237 -448209 -119450 41549 -200120
25530 -200120 -243100 -555728 -658767 -178622 -410188 -358402 128440 394775 75827 -11281
25520 -11281 217797 71869 3005 303934 76487 29444 122753 -29342 94764 142754
25510 142754 44364 2758 184045 272763 87828 -264777 570 -178825 -241887 -238589 -529157
25499 -529157 -460452 -341472 -105561 93560 186777 -71588 -264758 114753 -185922 -411435
25489 -411435 -184515 -24729 244076 335526 267092 236330 132396 144958 292007 -50889
25479e0889k15927J90383n964J56874J29660M50457p7846k86697q6829L2196k09214
25468B6204m58039o5114K22308L14561L96839K0660k59202k97735O1145J79469
25458A41096J91073l24959r5603n9100j02897J82176L39532l4593j10453J13096
25448B39368P5734j50934o6853j3115J57103J02104k38613q499K12421o5975r125
25437B33616j56896J57848j50203k14282j18234J88454k67495k63291J23272L13725
25427a53486n597k70628r9074L05988M08254N8377p6956Q1646K67875j17585l42869
25416E5945j49504J70247P9409j76356K07835j09923m20759k56125j05793K86827
25406d18197N28306L7108M6199n3705j17399j88174m64263m6759K85509J88326
$$ plain form
25479 -50889 -266816 -76433 -82397 74477 204137 654594 576748 290051 203222 235418 26204
25468 26204 -431835 -496949 -274641 39920 436759 457419 198217 -99518 -38373 141096
25458 141096 332169 7210 -88393 -147493 -250390 -68214 271318 236725 126272 239368
25448 239368 315102 164168 97315 84200 241303 343407 104794 96295 308716 242741 233616
25437 233616 76720 234568 84365 -129917 -248151 -59697 -327192 -590483 -467211 -153486
25427 -153486 -159083 -429711 -528785 -222797 185457 243834 166878 248524 516399 398814 55945
25416 55945 -93559 76688 156097 -20259 187576 77653 -343106 -599231 -705024 -418197
25406 -418197 110109 147217 193416 139711 22312 -165862 -630125 -676884 -391375 -203049
25396b03049J85640j28263j48874n3087K60696k34387K065L9241K44071j55267
25386a91214l3488Q71q5377J78555K06150J42069N9756j46339j32315k99841p0767
25375c71940K6150j68588j25925J01855L64170M81068J00109j12457Q8430k27860
25365A55012o2006L27673R3759l31320k23603j08848k4052L40608Q6280m0691
25355B12812j84081j69015j720J23933j55658k91064R3189L16907N6766j27881
25345a25812J96547j10401k50455j85092L46045K61653j79030k97557l93598J97639
25335e40061J52209j25354O5755K70862K83946K03678k53874r1472J66568r9905
25325C2352O3882j57010j26986l2625q3090J14781M6780L42949n1786l15993p4219
$$ plain form
25396 -203049 -17409 -145672 -294546 -347633 -86937 -321324 -319259 -280018 -35947 -191214
25386 -191214 -224702 -223831 -309208 -130653 75497 217566 277322 130983 -1332 -301173 -371940
25375 -371940 -345790 -514378 -640303 -538448 -174278 306790 406899 294442 382872 155012
25365 155012 93006 420679 514438 183118 -40485 -149333 -173385 167223 253503 212812
25355 212812 28731 -140284 -142004 -18071 -173729 -464793 -371604 -54697 2069 -125812
25345 -125812 70735 -39666 -290121 -475213 -129168 132485 -46545 -344102 -737700 -540061
25335 -540061 -387852 -513206 -447451 -176589 107357 311035 57161 -34311 132257 32352
25325 32352 96234 -60776 -187762 -220387 -303477 -188696 -141916 201033 149247 -166746 -240965
25314b40965J16303k044j49469r8885K32792K90848q4044j86494m15999M7405
25304d90552M42911K23021j51977k0537M5726o8226l14694l80428P5023L63385
25294b76348K41646j17975k26135l14899P9036L11513K89809Q2912J22796k37036
25284d4681P1690J90423l9927l2828L7579j52785j58094l051k64595J48526J76731
25273g1012K29345r784l54353n0518N9028j67016q9408M63960q5296j5305j21715
25262b12074r586J27260L2875j53751k31864J23394K06922j0133k29391k15121
25252e71469J84547l8292j00007r2911M74372J20150j7447Q4157o8493j08028
25242a33421j50780j66216K38587k2267k45210J05995L16081N3581n6737j15724
$$ plain form
25314 -240965 -124662 -126706 -276175 -375060 -142268 148580 64536 -121958 -537957 -490552
25304 -490552 -47641 175380 23403 2866 48592 -19634 -334328 -714756 -639733 -276348
25294 -276348 -34702 -152677 -378812 -693711 -614675 -303162 -13353 69559 192355 -44681
25284 -44681 27009 217432 177505 144677 182256 29471 -128623 -131674 -396269 -247743 -71012
25273 -71012 158333 148549 -205804 -256322 -197294 -364310 -453718 10242 -75054 -90359 -212074
25262 -212074 -221660 -94400 -61525 -215276 -447140 -323746 -116824 -126957 -356348 -571469
25252 -571469 -386922 -425214 -525221 -618132 -143760 -23610 -41057 43100 -25393 -133421
25242 -133421 -284201 -450417 -211830 -234097 -479307 -373312 -57231 -3650 -60387 -176111
25232a76111K16068o587j36327m5407m2581o4060K1962R4448K41983k21539k10930
25221c29081j69378J11608k297k14536J56143k9514l8660P5473j11817K66956
25211b85103N48787j14528j65235J32318N03762N9324j04783J85617O461o16937
25201A49683k62941j39167j5040k41404L71975J55343J17027J02925l22361Q7312
25191C352M2655L4732J84907j51421N0290K12892j29915l39947j17885N852r9753
25180c04241J87755J27004J17918l07778J58689K20754k33140j0097L23426L84462
25170F64752K25284j03493j63465r6783l17640j78708Q1924J13187j434R8378
25160C22002k69494k80241j75775r8247J17522J93367K75696J98889j40729L26869
$$ plain form
25232 -176111 39957 33370 -102957 -148364 -190945 -255005 -233043 -138595 103388 -118151 -329081
25221 -329081 -498459 -386851 -389148 -603684 -447541 -477055 -515715 -440242 -552059 -285103
25211 -285103 263684 149156 -16079 116239 620001 679325 574542 760159 766620 149683
25201 149683 -113258 -252425 -267465 -508869 -136894 18449 135476 238401 -83960 3352
25191 3352 46007 80739 265646 114225 164515 377407 247492 -92455 -210340 -204488 -304241
25180 -304241 -116486 10518 128436 -179342 -20653 200101 -33039 -43136 280290 664752
25170 664752 890036 786543 623078 526295 208655 29947 111871 225058 223624 322002
25160 322002 52508 -227733 -403508 -501755 -384233 -190866 84830 283719 142990 469859
25150D69859K0802l78630M4548K95057K35562k34710j50851J4331m3589P4317
25140C46696N8605k24964l25301j96609L5218L9840K4955J94093J5238o7712N6559
25129d3382j60114M3678Q0552P645l7733n0774L65725J07131j02837q8078m24772
25118c02959k79871L69839L26465J00024J33991N2070n17909k89971n8562K2262
25108d44621P9891P4610M5149l1471k19875K61702L47477N3128J80497l05309
25098D1178k72366J3233J0623k1535L752J78040l5258J0104n7848P3860k30822
25087b87039n6356K27449K83693J99891j23050K0357n4467Q6128p5174R2774M25006
25076G39212j22205k09353q9622k77723o3153J36184K1903K38680K65547Q6m33530
$$ plain form
25150 469859 490661 112031 156579 451636 687198 452488 301637 315968 272379 346696
25140 346696 405301 180337 -144964 -341573 -306355 -266515 -241560 -47467 -32229 -99941 -43382
25129 -43382 -203496 -159818 -79266 -71621 -109354 -160128 205597 312728 209891 121813 -302959
25118 -302959 -582830 -212991 113474 213498 347489 399559 -118350 -408321 -466883 -444621
25108 -444621 -364730 -290120 -244971 -276442 -496317 -234615 112862 165990 346487 41178
25098 41178 -231188 -217955 -207332 -228867 -225115 -47075 -82333 -72229 -130077 -56217 -287039
25087 -287039 -343395 -115946 167747 367638 244588 264945 210478 296606 221432 314206 739212
25076 739212 617007 407654 318032 40309 -22844 113340 135243 373923 639470 639556 206026
25065B06026k98642K15989L79802m00037j80840J85101N04448k70698k71250j26022
25055e6123j7654J40251L2828K23540j1957j86296l6155P5486l336r4833J67089
25044B32840K20101O9347P685j82749j24237k16303k54725J630L80652J31903
25034B66144N12440O5759m55127j03626J8718j9574J77932j42699k95463k53281
25024b28777j6883J06794J89423o7710k8133k95407J1077J22986J43413Q4988
25014B1771J72183J83762j02907j03444j32324k65038j26676K22145K51414r3055
25004B7831l09274K38474J44245j85112J7748Q4863O203k47693k33616J1248R1197
24993c53886N78M5234K84330j86759p2287k01911l12992J74453r4253J75030K47848
$$ plain form
25065 206026 -92616 123373 503175 103138 -77702 107399 611847 341149 69899 -56123
25055 -56123 -73777 66474 99302 322842 310885 124589 88434 163920 160584 65751 232840
25044 232840 452941 522288 529973 347224 222987 6684 -248041 -246411 134241 266144
25034 266144 778584 844343 389216 285590 304308 284734 462666 319967 24504 -228777
25024 -228777 -245660 -138866 50557 -17153 -45286 -340693 -329616 -206630 -63217 21771
25014 21771 193954 377716 274809 171365 39041 -225997 -352673 -130528 120886 27831
25004 27831 -281443 -42969 101276 -83836 -66088 18775 24978 -222715 -456331 -445083 -353886
24993 -353886 -353308 -308074 -23744 -210503 -282790 -484701 -797693 -623240 -717493 -542463 -294615
24982b94615L04091K14033r9844k87956k63892j30540j34673r7307J91408K47943
24972c51352R5428K09318K99280j62633j33281K09917k74554J31694n7270p0371
24962a03824J38876l3003l80057J46055K9355p0427K64099N1282j48368K53487
24952A47475K0351k00411j76717K95704J05682K19752Q5549j43948l32819O4234
24942H4852m0062j14739L85855n90k00898k37318J82789N73777J21033j01543
24932F53156l21454j09388j38250L06159j75487l90000K896L36006L97440J92497
24922G53575l33152k43996n1834J25172L64341k33228k54737K69642K03586n6135
24912E43234j20156n31052J1327j05130l7078J01509l40868N4559J85058K02724
$$ plain form
24982 -294615 9476 223509 123665 -164291 -428183 -558723 -693396 -790703 -599295 -351352
24972 -351352 -255924 -46606 252674 90041 -43240 166677 -107877 23817 -33453 -103824
24962 -103824 35052 2049 -378008 -231953 -202598 -273025 -8926 42356 -106012 147475
24952 147475 167826 -32585 -209302 86402 192084 411836 497385 353437 20618 84852
24942 84852 44790 -69949 315906 315316 114418 -122900 59889 633666 754699 653156
24932 653156 331702 222314 84064 390223 214736 -175264 -172368 163638 561078 753575
24922 753575 420423 176427 124593 249765 614106 380878 126141 395783 599369 543234
24912 543234 423078 -107974 -96647 -201777 -238855 -137346 -478214 -423655 -238597 -35873
24902c5873j00980Q5433K4602j49882Q8801K6491l0557K39764P7840k05424R707
24891B9922N6536k0056K17710r5058P3230J33910k37778k28147L50531K0388K76222
24880E77410R8450o15927r4794N1501o4826k88647P9832N01483K39671l7378j13079
24869C33696j86213p0953K2539L24229K44855K6098j48959k13349k44919J83391
24859B70415j4395j37162O1515O8728P4767l10486k06536K00142l4200J53180
24849A25968J61730J5697L45041j91445Q5181J30395l48676j77259j43995k9598
24839b6961j076o8132K50287K79521k0204k77719m3393P9240J87545j4789K7452
24828C71771n3147j25772p5005k14087j11512J25324J23788K09615L50425j00340
$$ plain form
24902 -35873 -136853 -51420 -26818 -176700 -87899 -61408 -91965 147799 225639 20215 29922
24891 29922 86458 66402 284112 189054 262284 396194 158416 -69731 280800 301188 577410
24880 577410 675860 59933 -34861 16640 -48186 -336833 -257001 244482 484153 446775 333696
24869 333696 147483 76530 99069 423298 668153 694251 545292 331943 87024 270415
24859 270415 256020 118858 180373 249101 323868 13382 -193154 6988 -27212 125968
24849 125968 287698 303395 648436 456991 542172 672567 323891 146632 2637 -26961
24839 -26961 -28037 -96169 154118 433639 413435 135716 92323 171563 359108 344319 371771
24828 371771 318624 192852 117847 -96240 -207752 -82428 41360 250975 601400 501060
24818E01060m51435k98900o5962K52049K87698J06261l08716o1584K64283J6522
24808B41276r1354K3029L17945J1747N5980j92537N031j39267r2937J42320j36991
24797A44242j31805j32516K79269M39825l4605l98718P5104o1950J00754j26916
24787A52684K28530m1145j23829k59053J00270K05539K10153J34255N8940N3297
24777G19641k46935k86542j81576P2622M27201q8661r1200Q8265k25361o9459
24767A17995q0282j98025J29327J43933m7718J68011q8030q0820j29295J20465
24757E5561k38802P5054M13065J68369j61054k0291k4371k52094k09536J94152
24747E3L11959J43759m20709J16082M3394k35133M6443J96255j4773j11195J77150
$$ plain form
24818 501060 49625 -249275 -315237 -63188 224510 330771 22055 -39529 224754 241276
24808 241276 149922 172951 490896 502643 558623 366086 371117 231850 138913 281233 144242
24797 144242 12437 -120079 159190 599015 564410 165692 240796 178846 279600 152684
24787 152684 381214 340069 216240 -42813 57457 262996 473149 607404 666344 719641
24777 719641 472706 186164 4588 77210 504411 415750 324550 412815 187454 117995
24767 117995 37713 -160312 -30985 112948 65230 233241 145211 64391 -64904 55561
24757 55561 -183241 -108187 304878 473247 312193 291902 267531 15437 -194099 53
24747 53 312012 455771 35062 151144 194538 -40595 5848 202103 187330 76135 253285
24736B53285J70024L9152m39906l24127K11771J86733n9835J86004M45966Q9923
24726G58990j37630n92331j38987k8537l18388k1209L32265M61259J93453j07019
24716D01866k76519p305K00096J00968k15399m2003K2635j87614j2347q5369J91508
24705I0517O1027l4724r5846k70653P5002K7908M7900J89681j44754p3210k91205
24694d18357K06305N36567L82373p2578m46106k25519N1613J35311J89491J0781
24684C49881r1613R1030L70121J14305o3270K37983N0027l0197j28419l42641
24674E57207m00709l81933l9462J31949j49616K84393K96463K86989K14269n91099
24664B08451o2770N21801L6090m5644J91226m03253o17574J0281L06069q8646
$$ plain form
24736 253285 423309 462461 22555 -301572 -89801 96932 37097 223101 669067 758990
24726 758990 621360 29029 -109958 -138495 -456883 -478092 -145827 315432 508885 401866
24716 401866 125347 118042 318138 419106 203707 161704 184339 -3275 -15622 -100991 90517
24705 90517 151544 116820 20974 -249679 -174677 -146769 -98869 90812 -53942 -127152 -418357
24694 -418357 -212052 324515 706888 634310 188204 -37315 14298 149609 339100 349881
24684 349881 258268 349298 719419 833724 770454 1008437 1058464 1028267 899848 557207
24674 557207 156498 -225435 -264897 -132948 -282564 1829 298292 585281 799550 208451
24664 208451 145681 667482 703572 657928 849154 445901 -171673 -161392 144677 56031
24654E6031J88561Q8836j88384j10555K84464N9365m94539J97941M37835K6204
24644E45759m4463k15293l19552k5499M4452k9962J66931J62604Q9987j782m6943
24633C26239J67354k9966l17222q9528j85945n2432K02621K10792J6038o7757
24623A80194m8082l7769J5700o5470J12334K98907L65444Q4670j52583j15646
24613F37699N7636j63243n46032o5590J33870K50675k76791J06746K70438O6899
24603D72307k57524R5601L64591J01193p0292l8097j60891L2704J44668k02872
24593D81388j06894j79059O323k43899K582J06494J76033m4087L37018J31164
24583F67063k2200K8511k92112m5659j50176J36737j04521J03094P6213K1406
$$ plain form
24654 56031 244592 333428 145044 34489 318953 378318 -116221 81720 519555 545759
24644 545759 501296 286003 -33549 -59048 -14596 -44558 122373 284977 374964 373182 326239
24633 326239 493593 463627 146405 56877 -129068 -181500 21121 231913 247951 180194
24623 180194 132112 94343 110043 44573 156907 455814 821258 905928 753345 637699
24613 637699 695335 532092 -13940 -79530 54340 305015 28224 134970 405408 472307
24603 472307 214783 310384 674975 776168 705876 667779 506888 539592 684260 481388
24593 481388 374494 195435 201758 -42141 -39559 66935 242968 198881 535899 667063
24583 667063 644863 673374 381262 335603 185427 322164 217643 320737 396950 418356
24573D18356J9975M7898j26058Q9223K41905J79112j87720k46505r2374K07821
24563E51633r732M1067k79500k70651l2277L64224K04441l20637j41153p0821
24553C6594Q891J17464k39276j92049J57142o87m0310o6171j9K51838N53k690
24541C1280L12024M67623J15231k34600j0628o2682m04202K71645J8799j58802
24531C45688j26897m0279k01813J91809J88890K75128M5376k25177j60243J63263
24521D55745J75722j3255o8255l04577l7597l3225j51181l82856K62391L75033
24511B77945j15425l96021j25242M21650K90684r8340j30820J51316J32291P600
24501D15638n23937l09274L80188J1021j03327j56149N4087K04428J99911r4632
$$ plain form
24573 418356 438331 486229 360171 449394 691299 870411 682691 436186 343812 551633
24563 551633 541901 582968 303468 32817 540 364764 569205 248568 107415 36594
24553 36594 45485 162949 -76327 -268376 -111234 -111921 -152231 -218402 -218421 33417 33970 31280
24541 31280 343304 810927 926158 691558 680930 618248 214046 485691 504490 345688
24531 345688 218791 178512 -23301 168508 357398 632526 677902 452725 292482 455745
24521 455745 631467 618212 549957 245380 207783 174558 23377 -359479 -97088 277945
24511 277945 162520 -233501 -358743 62907 353591 255251 124431 275747 408038 415638
24501 415638 -108299 -417573 -37385 -26364 -129691 -285840 -231753 -27325 172586 77954
24491G7954j02854P1355r780L68358N9492K4335P1762q0202l71243M4071L77427
24480E30675J4281M0505N9166l0976N466k54291l16087q1211K1924K72125J59189
24469D20766r2496k46997j42954o7563p948N4256j34098R7242k9951K48760M7175
24458A46192j10373L24523L7889j17916j52380p3213j72222K67672M5954n1503
24448A44623M1615j52032K03759J86394L19083n4116k95873k91342m8418k9684
24438B4009j46381K69745J8536l89026j04840R3352K08320J53237n1720M09008
24428D84240L18473k61088k73888n0484J96613O7925N6005J33115j64880k53683
24418B52348k71180n0555K48924K70800k20731k00690L72731k9711r0350J03441
$$ plain form
24491 77954 -24900 46455 36675 405033 464525 488860 560622 480420 109177 153248 530675
24480 530675 544956 585461 644627 613651 619117 364826 48739 -32472 -10548 261577 420766
24469 420766 328270 81273 -61681 -129244 -137192 -82936 -217034 -119792 -149743 99017 146192
24458 146192 35819 360342 398231 280315 127935 54722 -117500 150172 196126 144623
24448 144623 186238 34206 237965 424359 743442 689326 393453 102111 53693 24009
24438 24009 -122372 147373 165909 -223117 -327957 -234605 -26285 126952 75232 484240
24428 484240 802713 541625 267737 217253 413866 481791 537796 670911 506031 252348
24418 252348 -18832 -69387 179537 450337 229606 28916 401647 371936 281586 385027
24408C85027r1453J8268K48729N9968J0095o8032J97747l54329j53010J37247
24398C90257j42571k98867J29450J61511j23464k5463o084K80077J66045j25638
24388D05253j5686m4979J38990L7331p0162j67117j51377L4580l4697l15332J40919
24377d2277K71239j01548J17644J72305j61306l58396P0514J52804L6809L72616
24367E30404k22353l67107J10963J88067O9467N59065j13344k16925q0493l8338
24357D19406m63671m7361J49259K7402R0095m079j64982J43703M76032m7919K93696
24346H71581L40406k97532j44764k19037j69421j88660R1076j08983K42850k20488
24336A97028k50456l67031O6475M43989L90905J00535j18727k40637m4354M66147
$$ plain form
24408 385027 293574 311842 560571 620539 630634 562602 760349 406020 253010 390257
24398 390257 247686 -51181 78269 239780 116316 90853 84769 364846 530891 405253
24388 405253 389567 344588 483578 520909 450747 283630 132253 166833 132136 -183196 -42277
24377 -42277 228962 127414 245058 417363 256057 -102339 -31825 120979 157788 530404
24367 530404 308051 -59056 51907 239974 309441 868506 755162 538237 457744 419406
24357 419406 -44265 -91626 57633 85035 175130 171051 6069 149772 625804 577885 871581
24346 871581 1211987 914455 769691 550654 381233 192573 283649 174666 417516 197028
24336 197028 -53428 -420459 -353984 90005 480910 581445 462718 222081 177727 643874
24326F43874K8740o2605J46361k63172j37682j210J17865O1516J62816k23796
24316D72707j50956j56226M3497r4885n6125N6834P2375q1996L4914J4412l47946
24305a93395J12561K13741n8541J44262m6163J00674L95287K84847m01662k40039
24295C11572k14952m05100M5627J24393O8583k4401N85418M02398J88448j69154
24285I12832k48968j37485j02026L2313q4506P2615j16210l27408j60454J98823
24275C9526P1865j49545J39708n0127j42621L15809J33360J55502N8981L71548
24265I44006n8875m14122k35221J41155K1706R2310J15746j59873j5954k48994
24255A81884j12035K4953k66726J33512L34003L2491o8042P1670k45296J67022
$$ plain form
24326 643874 672614 610009 756370 493198 355516 354306 472171 533687 696503 472707
24316 472707 321751 165525 209022 114137 58012 114846 187221 105225 140139 154551 -193395
24305 -193395 -80834 132907 74366 218628 172465 273139 668426 953273 551611 311572
24295 311572 96620 -308480 -262853 -138460 -69877 -94278 491140 893538 1081986 912832
24285 912832 663864 526379 424353 456666 372160 444775 328565 1157 -159297 39526
24275 39526 111391 -38154 101554 51427 -91194 224615 357975 513477 572458 944006
24265 944006 885131 471009 235788 376943 398649 490959 606705 446832 430878 181884
24255 181884 69849 94802 -171924 -38412 295591 328082 260040 331710 86414 253436
24245B53436O5441L744K01234P0237j78942K25531m202L174J72655j30623j34839
24234E46846l27534k65764j4781L5451P0583J61529L2758J1042N1659M5149k923
24223C44015J23132o8472K0155N15930K28137k09239l62197k70575k24515o2158
24213C4213k11478J37848J72304J23300k59454q0905L43240L93281P2489j03498
24203F21340r9989m86048J52809L83223J54304O7604j31503r3353L03897K25912
24193A098196k3138J14118j63133m6188j93547K91318O4379o23023k39180k57214
24183B2588Q2925J79243J0727q7411K05440K23924P8978O4332n3027j03889j73270
24172D50560k16498J93546J52145k08358j27222l7260j41347K79958J85328k08178
$$ plain form
24245 253436 318877 322621 523855 594092 415150 640681 636479 639653 812308 681685 546846
24234 546846 219312 -46452 -61233 -25782 44801 206330 239088 250130 301789 346938 344015
24223 344015 467147 398675 418830 934760 1162897 953658 591461 320886 96371 34213
24213 34213 -177265 -39417 132887 256187 -3267 -84172 259068 652349 724838 621340
24203 621340 521351 35303 188112 571335 725639 793243 661740 568387 872284 1098196
24193 1098196 1075058 1189176 1026043 979855 786308 1077626 1142005 518982 279802 22588
24183 22588 105513 284756 295483 208072 413512 637436 716414 780746 727719 623830 450560
24172 450560 234062 427608 579753 371395 244173 206913 65566 345524 530852 322674
24162C22674r0553Q9320j083J39412P8933j89031j43484P6747n0139R5766K84926
24151F13488m2854k25327n7820l01645J30737O2136j59462M1453p8101J70809
24141A53414L66603k02874M5720K28929R3094O1046J01976P6497k57558K531k24188
24130D45190m16621j05960L37200K44059K17686J04482o4719l85141p8797O4880
24120C62259J31379o2681k99703J42575K70213K02692K40928n7223q5811l53007
24110D91621k05675M37370j0778k31660L5226L02010J9033l09403n7525Q0641
24100E50860L7194k98083j33356M29308p2612n23717r8599K13408K52780L88768
24090G45951j78974j81866J27287O5511m11808J40682O7628L9988J1137k96592
$$ plain form
24162 322674 232121 321441 320358 459770 538703 349672 206188 282935 232796 328562 613488
24151 613488 570634 345307 287487 -14158 116579 178715 19253 60706 -17395 153414
24141 153414 520017 317143 362863 591792 684886 745932 847908 924405 666847 669378 445190
24130 445190 28569 -77391 259809 503868 721554 826036 761317 376176 297379 362259
24120 362259 493638 430957 131254 273829 544042 746734 987662 930439 844628 491621
24110 491621 285946 723316 712538 480878 516104 818114 837147 527744 470219 550860
24100 550860 588054 289971 156615 585923 513311 -10406 -109005 104403 357183 745951
24090 745951 566977 385111 512398 577909 166101 306783 374411 414399 425536 128944
24080A28944k77430M35706j24962k5542L82842M2946j14278k15438j86315J35225
24070A81698K54773r8618J82230p9034j0580j07056m5034K43245K27874p1192
24060F78306l88804J25356j3558m659j4189O5472J19778J231m31510k33864R6602
24049A61L49037N33517J61921k66491k70018k76097k20374K03206P5458m0379
24039B49941K22374K09163k66178k30612J2673P8391j53138L87287K02389r1543
24029F20747K8722J94995j40750l66453j28408m6717l96149N01607O55783k20045
24019G03332m23842J16990J51647j3365L58300k87167j32688l84048K72348J72639
24009E34146k48602p7160K51013J66259k10981j01752r0359q1555L29035K52585
$$ plain form
24080 128944 -148486 287220 162258 136716 519558 562504 448226 232788 46473 181698
24070 181698 436471 337853 520083 441049 430469 323413 278379 521624 749498 678306
24060 678306 289502 414858 401300 396641 382452 447924 567702 568933 137423 -96441 161
24049 161 349198 882715 1044636 778145 508127 232030 11656 214862 290320 249941
24039 249941 472315 681478 415300 184688 197361 275752 122614 509901 712290 620747
24029 620747 649469 844464 703714 337261 208853 162136 -234013 267594 923377 703332
24019 703332 279490 396480 548127 534762 893062 605895 473207 89159 361507 534146
24009 534146 285544 208384 459397 625656 414675 312923 222564 141009 470044 722629
23999G22629l43321J29189K88509R3577Q5831Q0024k09878l33547j95329l98352
23989h0668k01914L36661J93217J59534K94286J66016j26112j08569k35919m2646
23979C53886K83284l9173l84532l08141K22654L7794k866j44888k8086K65262
23969B55194L85930L5071k04569k31960p4703q9750J56429M57557P1329m47408
23959C13120j20456J26198J29968R2309j43866O5771N1148k72062k41688K04856
23949B05298L45440M6172l01714k13185k2803L5279J59768J25425k22058M6036
23939B03658k22322p4562K42645J75195k23576K31558l9891R6167L8576J29900
23929E57348K12901K15937Q2426p4874P8467l39486l03449K71823K77830M023
$$ plain form
23999 722629 379308 508497 797006 890583 976414 1056438 846560 513013 317684 -80668
23989 -80668 -282582 54079 247296 406830 701116 867132 741020 632451 396532 353886
23979 353886 637170 597997 213465 -94676 127978 165772 162906 18018 -10068 255194
23969 255194 641124 676195 471626 239666 164963 75213 231642 689199 760528 313120
23959 313120 192664 318862 448830 541139 397273 463044 514192 242130 442 205298
23949 205298 550738 596910 295196 82011 59208 94487 254255 379680 157622 203658
23939 203658 -18664 -93226 149419 324614 101038 332596 292705 388872 427448 557348
23929 557348 770249 986186 1068612 993738 1072205 732719 429270 701093 978923 982946
23919I82946j31631l82244K3790j9978R6139J92420K36758r7760k56211J51737
23909G95966j9994j04635Q7438j97248k00065j12364P847l3927j25077J7661l21600
23898b05998j36240K84727J86603n8595Q9842J66223j15196l25130l12314J3676
23888d12402L17075K17372M5679K32643R7957N8094j00135m08p5419K31119P0016
23877F81591k39663P8772M0832j68871k71471K08992L86948K1007J3013j98310
23867E52840k09154k05581j16416L45042L62665J52409J5736O0218k20345j01845
23857F35569J91215J40759l76218k75078J28833K95537K08442K0609j23639j16480
23847G29549j14175j93987O964J196p9866J33679k02065j3848J64119J11670j99704
$$ plain form
23919 982946 851315 469071 492861 472883 569022 761442 998200 900440 644229 795966
23909 795966 775972 671337 758775 561527 361462 249098 256945 223018 97941 115602 -205998
23898 -205998 -342238 -57511 129092 70497 160339 326562 211366 -113764 -426078 -412402
23888 -412402 -95327 122045 167724 400367 498324 556418 456283 455875 380456 611575 681591
23877 681591 441928 520700 561532 392661 121190 330182 717130 738137 751150 552840
23867 552840 343686 138105 21689 366731 729396 881805 897541 957759 737414 635569
23857 635569 826784 967543 591325 316247 445080 740617 949059 969668 846029 729549
23847 729549 615374 421387 428351 429547 349681 483360 281295 267447 431566 543236 343532
23836C43532J20606J12072J96213Q770l1335K09521R1266j71619j73908l41720
23826C63398m6217J66167M04622o9953r9377j68041k18748j11963P1224M87j27999
23815A63600P4679j05594M2608N0793r4234J45945j3562K39653k0623r8331j63675
23804B21259Q8L95280R5903k23071l49738J83353M70800k83614k6888Q6039J21143
23793F90554j44566M0758K19435K98033J90972j15339l32369o01199p5318M80592
23783F51553N00971O1511k07341k38556q9493o7487J63449K9629l1466J47197
23773I19967m78013m29193L28219M28098K02589L2857j28593K18988J21570M6618
23763A263107l98545n72560m5542L32579q5691k39436N4634J1822J29456J484
$$ plain form
23836 343532 464138 576210 772423 781193 749858 959379 1050645 879026 705118 363398
23826 363398 317181 483348 887970 818017 718640 550599 331851 219888 291112 291599 163600
23815 163600 238279 132685 175293 226086 131852 277797 264235 503888 483265 384934 221259
23804 221259 221347 616627 712530 489459 139721 323074 793874 510260 483372 569411 690554
23793 690554 545988 586746 806181 1104214 1295186 1179847 847478 246279 170961 651553
23783 651553 1152524 1214035 1006694 768138 678645 611158 774607 804236 772770 919967
23773 919967 441954 12761 340980 769078 971667 1004524 875931 1094919 1216489 1263107
23763 1263107 864562 292002 246460 579039 493348 253912 308546 320368 449824 451308
23753D51308n2188K70410P3636k4207m6427M0730j79770K83248K74935J7873k27847
23742H81701p1098K160R5033j60785K08303K80952k70241m7385j92778J1176k6880
23731G10158K23497j24338N3243q1594m4l43321m3636J70848p8584j29463K72604
23720F29370Q9070l16266Q4046K46087N09156k1246k82271k42222l8936l27046
23710C29742j74415j45629L88455L84193j35994j94003n7122K1359Q2576L06730
23700H05892o1775N5355K16305k18522j39384j72297N8817L01871k2992O1751
23690H85021m1009r0597q1422R1291p9826k59857k57583J25659J14710K76090
23680F82477M2614l84278j90910L10882J23493J19876O7852j53060j2544o2764
$$ plain form
23753 451308 399120 669530 743166 718959 672532 713262 533492 816740 1091675 1109548 881701
23742 881701 810603 812763 907796 747011 955314 1236266 966025 918640 725862 737038 710158
23731 710158 933655 809317 862560 780966 780922 437601 393965 564813 486229 356766 629370
23720 629370 718440 402174 486220 732307 1241463 1220217 937946 695724 656788 329742
23710 329742 155327 9698 398153 782346 646352 452349 395227 416586 499162 805892
23700 805892 744117 799472 1015777 797255 657871 485574 544391 846262 823270 885021
23690 885021 844012 753415 671993 763284 683458 423601 166018 291677 406387 682477
23680 682477 725091 340813 149903 460785 584278 704154 772006 618946 606402 543638
23670E43638j24480p722K44237J30187R712M3353J12186k00590J4887o2140k78640
23659D24628K56896K44016L70499J28705j91675k51614l10302l8769K98112j3797
23649I16699k96813l04102J45495J15925n3909l56836k961M12182Q5082J36642
23639G97404K75591j71289m65620k80565l6913J74686L61261L29583j46600l25943
23629E11595j7383K07817L60155q8825m3300O2392m8327j56295L2429k00343j06961
23618E12954j21912M78952N16582j94503r6915j05837k54544j70303K32178m6422
23608G50230j50724n6181J31951K70597J84892o5465m90538j59399L25794k05006
23598E36151K09780l1464k08354l0330K88885K46501K74598j18073j86328n9440
$$ plain form
23670 543638 419158 411436 655673 785860 795572 838925 951111 750521 765408 703268 424628
23659 424628 681524 925540 1296039 1424744 1233069 981455 671153 632384 930496 916699
23649 916699 619886 315784 461279 577204 523295 166459 163498 575680 660762 797404
23639 797404 1072995 901706 436086 155521 118608 293294 654555 984138 837538 511595
23629 511595 494212 702029 1062184 973359 930059 992451 944124 787829 820258 619915 512954
23618 512954 391042 869994 1386576 1192073 1095158 989321 734777 564474 796652 750230
23608 750230 599506 543325 675276 945873 1130765 1065300 574762 415363 741157 536151
23598 536151 745931 714467 506113 475783 764668 1011169 1285767 1167694 981366 921926
23588I21926o1714R8623k87444n7074o4440j96605k55148q4376N1243M82031O74614
23577A221636N9782o14325k31906J20715J33548l03352O1312K47856P2302n256
23567G62312K32573J47958R1079j20800j15129l00802j98107P3379J55855K23399
23557I51717j23572l54982J95990M45678l4529k23455J3573l24284Q4725P1195
23547G02056J47744P0923K48908K29913L8697j47323p1411P6718Q1304J9521j53715
23536A243335k44850k50227k02082l42852L6551K95610J55077K01172j24266m2270
23526G25198l516N7679L73160J56025j60785l57671o23324q9195J10024R3535
23516B81130K58842L75261p4854j97825K28371J03703J96203q2760n2811j36587
$$ plain form
23588 921926 860212 958835 671391 614317 549877 353272 98124 13748 64991 547022 1221636
23577 1221636 1281418 667093 435187 555902 689450 386098 447410 695266 767568 762312
23567 762312 994885 1142843 1233922 1113122 997993 697191 499084 572463 728318 951717
23557 951717 828145 473163 669153 1114831 1080302 856847 870420 546136 630861 702056
23547 702056 849800 920723 1169631 1399544 1438241 1290918 1219507 1296225 1377529 1397050 1243335
23536 1243335 998485 748258 546176 203324 239875 535485 690562 891734 767468 725198
23526 725198 721682 779361 1152521 1308546 1147761 790090 166766 77571 187595 281130
23516 281130 539972 915233 840379 642554 870925 974628 1170831 1088071 1035260 898673
23506H98673j12966l1484l45005L30698M26624L37671j49921j41441j11143Q0837
23496A182543l50188k05126p0497J65098m6852j52239m989k84285l2201M2421
23486B43685J02156K14240M14592j23205l68219K34090K00903P9686p1777q3447
23476H42704Q5598J49381J04941k43415j67846q8243J00187K62240J61994k09700
23466I97841r1754l5126j94223J30239J4496q7572r5481q274R9065j39785k12735
23455C76691J43193o0667j22628j34737K49086K37497M17172K8347N9628n7203
23445A136379l19178K82813L08765J82616l11690m6382N7892n02278o65237J49555
23435B73255L62941R863K63463l50901j69832L51802N44874L3563p7085m18363
$$ plain form
23506 898673 785707 754223 409218 739916 1166540 1504211 1354290 1212849 1101706 1182543
23496 1182543 832355 627229 556732 721830 674978 522739 517750 233465 201264 243685
23486 243685 345841 560081 974673 851468 483249 717339 918242 997928 926151 842704
23476 842704 928302 1077683 1182624 939209 771363 683120 783307 1045547 1207541 997841
23466 997841 906087 870961 676738 806977 821473 733901 638420 630146 729211 589426 376691
23455 376691 519884 459217 336589 201852 450938 688435 1105607 1133954 1193582 1136379
23445 1136379 817201 1100014 1408779 1591395 1279705 1233323 1291215 788937 123700 273255
23435 273255 636196 646059 909522 558621 388789 740591 1285465 1319028 1241943 823580
23425H23580j59869J63115M8348J22066k06828p5964p7423M180N9718K59568L6317
23414I96808j33681n1206j28860K00728L53510j22373r2398K22541L69236L7093
23404A651398r9285k09472j0888k44939l55219m413K88034n4995K6316J87907
23394A174444K4209k28862M0657O42985K74540m30297j88112j56491j42238j3752
23384I97083l80167n05462K6206P00655K56967l16085n48938Q1394K05797j11217
23374D06233N8382j16873R7072J10745N7130K40089j0717N1460Q3378q158l3626
23363I35115r9877k12861J78332K99451l19977K38414K01130K35350j54862P0791
23353A371006j92935j17293l12665K9173j72564L2701L74q0283J14441L1878k77598
$$ plain form
23425 823580 663711 826826 875174 997240 790412 714448 637025 641205 700923 960491 996808
23414 996808 863127 811921 683061 883789 1237299 1114926 1022528 1245069 1614305 1651398
23404 1651398 1552113 1342641 1331753 1086814 731595 727182 1015216 960221 986537 1174444
23394 1174444 1198653 969791 1010448 1653433 1927973 1497676 1309564 1153073 1010835 997083
23384 997083 616916 111454 137660 838315 1095282 779197 230259 311653 517450 406233
23374 406233 464615 347742 444814 555559 612689 852778 842061 893521 976899 968741 935115
23363 935115 835238 622377 800709 1100160 780183 1018597 1219727 1455077 1300215 1371006
23353 1371006 1178071 1060778 748113 777286 604722 637423 637797 557514 671955 703833 426235
23342D26235N3375L05554J25447K80017L0551k15261k6382K61814j31911j46609
23332I62830j8189j57655K818M544j2125K68094M3378l61680K59865L98091l7418
23321A352553j17528m4591j21485j66674K02029n2406j37705r6391J28657L24241
23311A270700K76510k2327o4592j38960J14732j14383k27826o9513j38913q6654
23301G98774Q744J30313J43664j93415k91233L601m6126p3582L3367J07806K30173
23290H52086J00955R3613p0285L20481j1456l82000j29447J57755K41601J53273
23280A326576K37J24277J07770k20576n58808K8552l8655k00296K35756K49922
23270A054755j49253J58244L16071j82786J08278j62586m31112r200K86021N2042
$$ plain form
23342 426235 479610 785164 910611 1190628 1221179 1005918 979536 1241350 1109439 962830
23332 962830 944641 786986 789804 794348 782223 1050317 1093695 732015 991880 1389971 1352553
23321 1352553 1235025 1190434 1068949 902275 1104304 1051898 914193 817802 946459 1270700
23311 1270700 1547210 1524883 1460291 1321331 1436063 1321680 1093854 1024341 885428 798774
23301 798774 807518 937831 1081495 888080 596847 600448 554322 480740 514107 621913 852086
23290 852086 953041 1046654 976369 1296850 1285394 903394 773947 931702 1173303 1326576
23280 1326576 1326813 1451090 1558860 1338284 779476 808028 769373 569077 804833 1054755
23270 1054755 905502 1063746 1379817 1197031 1305309 1142723 711611 702411 988432 1040474
23260A040474K78369O6136o7400J40925k16994k02177k59003n9537J59056Q4294
23250I64143n7035J01960j22040M3507K04485k15127m6058O0418J54094K66787
23240A355134k13240k95436k31157j1629K71992k39619l7781J1746k60892n3081
23230B96037J063Q7315K69596J51883k25742K9770L3522J06664j42039j72306
23220D35763K97289L06998J33364L05175L0220m08650m99587N3028r6649J97J32203
23209F89351l4114J72411K30416K45351m08851j01582N6546K29845J51609N3666
23199A284648j89713k8115L7230N704l172m3267J7831l70544n2314L17724L37879
23188A313891j56905n05316O2499K11201L19865j50229k75102j86489j84530J97277
$$ plain form
23260 1040474 1318843 1384979 1317579 1458504 1241510 1039333 780330 720793 879849 964143
23250 964143 907108 1009068 887028 930535 1135020 919893 873835 934253 1088347 1355134
23240 1355134 1141894 846458 615301 603672 875664 636045 598264 610010 349118 296037
23230 296037 297100 384415 654011 805894 580152 609922 643444 750108 608069 435763
23220 435763 733052 1040050 1173414 1478589 1508809 1100159 600572 653600 556951 557148 689351
23209 689351 655237 827648 1058064 1303415 894564 792982 849528 1079373 1230982 1284648
23199 1284648 1094935 1066820 1104050 1109754 1106582 1063315 1081146 710602 658288 976012 1313891
23188 1313891 1156986 651670 714169 925370 1245235 1095006 819904 633415 448885 646162
23178F46162o4984J24350K03397J5066J07022p3966R8021k00583K86386K58856
23168A399727l5181j41168j04459k38155M99386J47619k91401J08012J51637P5060
23158A571077p1460k40877J35033M02942l77309m22251l7280K18675J11759j31305
23148A159004R9296l8966J8487r6556j51037l2975N8721j9888J73761m4415J69758
23137A295190l0388m1778j25089j39721J61285J61344L0743J3365k96144l2422
23127I96385M9163K37715J28805j84697j45032N735k4723K03399K51401K22652
23117A740803q2149k95175j22700l7826j26015k56644Q5174L8911P6990K26162
23107A247531L65902M7846k16153j77592J66359K18631n2111m92209k64324M07043
$$ plain form
23178 646162 581178 705528 908925 923991 1031013 957047 1055068 854485 1140871 1399727
23168 1399727 1364546 1223378 1118919 880764 1380150 1527769 1236368 1344380 1496017 1571077
23158 1571077 1499617 1258740 1393773 1796715 1419406 997155 959875 1178550 1290309 1159004
23148 1159004 1258300 1219334 1237821 1141265 990228 957253 1015974 996086 1169847 1125432 1295190
23137 1295190 1264802 1223024 1097935 958214 1119499 1280843 1311586 1324951 1028807 996385
23127 996385 1045548 1283263 1412068 1227371 1082339 1088074 1063351 1266750 1518151 1740803
23117 1740803 1658654 1363479 1240779 1202953 1076938 820294 905468 944379 1021369 1247531
23107 1247531 1613433 1661279 1445126 1267534 1433893 1652524 1600413 1108204 843880 1250923
23097A250923J35153k09852k63305j5399J1313k05356J44320J35897j11475K4821
23087H97040J35067j35449k16509K5750K28792M74820k89612l00243K35146J03094
23077A157896k8385J56946K31403J1948j84722l4483n1386L8174p0016q1073n1630
23066A094672L58601J21373m0106j79737k30786j31534J7181K810J22258P1993
23056A206725j87773n3592J68946M8289j34460j85906J16831L57070k1653j05004
23046A209473L10641Q9933J05383q1937j21182K47178j9030m680L6937m74826
23036A297890L14310J26885j07527k0679J6550J50498n6823l67892l29917r4544
23026I28751l02154J52534J38878l4253R6772K04772M0849K39183K92680j6463
$$ plain form
23097 1250923 1386076 1176224 912919 897520 908833 703477 847797 983694 872219 897040
23087 897040 1032107 896658 680149 705899 934691 1409511 1119899 819656 1054802 1157896
23077 1157896 1129511 1286457 1517860 1529808 1345086 1310603 1259217 1297391 1227375 1146302 1094672
23066 1094672 1453273 1574646 1534540 1354803 1124017 992483 1009664 1012474 1134732 1206725
23056 1206725 1018952 965360 1134306 1182595 1048135 862229 979060 1336130 1314477 1209473
23046 1209473 1520114 1610047 1715430 1633493 1512311 1759489 1740459 1735779 1772716 1297890
23036 1297890 1612200 1739085 1631558 1610879 1627429 1777927 1721104 1353212 1023295 928751
23026 928751 626597 779131 918009 883756 980528 1185300 1226149 1465332 1758012 1741549
23016A741549j03975k11968k92894J30985K86625o756J3199k12040l56308m1394
23006I47023J45577q4274J8558L86928m7122K487j3485l63720o5333R7525J69877
22995A194041j02630J02738j40084l4936j46024J53265R0508K96367k09644l54031
22985H49570J79175Q4257J97942q9794j56248j54855J48346p845o788L00723k13272
22974A131211k73559J2234J09385K26174n0382J09235J07517p1315n5255k29933
22964A015312K7953K18174o8533J11212J27207l63699M7350K8848O0260Q1390
22954A285474P5586m0897P4257m1407J10830J31051J13130K5612m5856K0020j84165
22943A523635m75120m8072K1666N1044K89979L47857k51360r8543K20849M87039
$$ plain form
23016 1741549 1637574 1425606 1132712 1263697 1550322 1543566 1556765 1344725 988417 947023
23006 947023 1092600 1008326 1026884 1413812 1366690 1369177 1355692 991972 926639 1024164 1194041
22995 1194041 1091411 1194149 1054065 1019129 873105 1026370 1116878 1413245 1203601 849570
22985 849570 1028745 1113002 1310944 1221150 1064902 910047 1058393 1050548 1043760 1344483 1131211
22974 1131211 857652 869886 979271 1205445 1155063 1264298 1371815 1300500 1245245 1015312
22964 1015312 1043265 1261439 1192906 1304118 1431325 1067626 1114976 1143824 1204084 1285474
22954 1285474 1361060 1320163 1394420 1353013 1463843 1594894 1708024 1733636 1687780 1707800 1523635
22943 1523635 1048515 1000443 1022109 1073153 1363132 1710989 1459629 1361086 1581935 2068974
22933B068974K1239j79713m1481j69571k85482k32568P4556L0320Q126J58699
22923A453099M04k31866j54801N2972k19792K52428J37245m40772l9976K12011
22913A020952K55439J44111j42112m36975r1578J44523K62065M79277j27637k45307
22903A262758K7199j60464J83318j4167K9554K16643l31976J10455P9984J1408
22893A414712k1470J79190r5511J07064Q3703l13111k92504J23554M77760K61361
22883A924748J63207l09494o5048P796j86617j95481N6607J55034L74829r7163
22873A828418n24933m22554J67513J16222k83240J04450N87716L32728k60733
22864A645587m35658n30292o3376M04438L59572K60177P6128k25422N2554l61168
$$ plain form
22933 2068974 2090213 1910500 1869019 1699448 1413966 1181398 1255954 1286274 1294400 1453099
22923 1453099 1453503 1221637 1066836 1119808 900016 1152444 1289689 848917 808941 1020952
22913 1020952 1276391 1420502 1278390 841415 749837 894360 1156425 1635702 1508065 1262758
22903 1262758 1289957 1129493 1312811 1298644 1328198 1544841 1212865 1323320 1403304 1414712
22893 1414712 1393242 1572432 1476921 1583985 1667688 1354577 1062073 1185627 1663387 1924748
22883 1924748 2087955 1778461 1713413 1721209 1534592 1339111 1395718 1550752 1925581 1828418
22873 1828418 1303485 880931 1048444 1164666 881426 985876 1573592 1906320 1645587
22864 1645587 1209929 679637 616261 1020699 1380271 1640448 1716576 1491154 1543708 1182540
22854A182540m32807Q0943K43316N511L44920K55721j80094j7143k47591K11793
22844A447109N982J02966M36685l718k91701o518M3016R3141O639k87549l85377
22833A160675K36205j86971O1487K5876L08080l14194P5135L44077L93649K5451
22823B129470l09960k51235j15158J33119K34701q652j33585l12060K25154P604
22813A599398J3681k65401j11403L9311k28697j66450Q8563j18946j40318l5888
22803F73850L22608J12874l6088k39121r8025L06751R9188J15193r781P7582j05688
22792A219343J3789P7448P8290J23344K34539l3708l85680J97759K49104j32210
22782A642018m2530j6890m18491m9079L14417J75095k09005K16250l6367J06952
$$ plain form
22854 1182540 749733 830676 1073992 1079503 1424423 1680144 1500050 1482907 1235316 1447109
22844 1447109 1453091 1556057 1992742 1989024 1697323 1690805 1733821 1826962 1833601 1546052 1160675
22833 1160675 1396880 1209909 1271396 1297272 1605352 1291158 1366293 1710370 2104019 2129470
22823 2129470 1819510 1568275 1453117 1586236 1820937 1812285 1678700 1366640 1591794 1599398
22813 1599398 1613079 1347678 1236275 1275586 1046889 880439 969002 850056 709738 673850
22803 673850 996458 1109332 1073244 834123 736098 1042849 1142037 1257230 1247449 1325031 1219343
22792 1219343 1233132 1310580 1388870 1512214 1746753 1713045 1327365 1525124 1774228 1642018
22782 1642018 1599488 1582598 1164107 1115028 1429445 1604540 1395535 1611785 1575418 1682370
22772A682370J62457J50449j91756m09521j33941K86315j13842K76998K12829
22763A922358j17380l67604k9925l3262k62571l4794O6281J9309Q0537L42557
22753A585506J33856J18310j07487q2804j62359j24818k37855j17630k5682j56488
22743H22549L36876L07649L39784Q0773J42581j81716r2242j65326p2471j44682
22733A373775J59294J55254j750N3800J3246o4290J07721L39235K54024l19852
22723B070457r8890l9121j98390l32576l0667L8156P2452o8994k72145R3013P60743
22712A994038L24572j14410k47097j12222n1279r2075k7181J35725j58064K32425
22702A884432m1625q3100L668l08639j59650J488K70361j76212J43785j6829k09472
$$ plain form
22772 1682370 1844827 1995276 1803520 1393999 1260058 1546373 1432531 1709529 1922358
22763 1922358 1804978 1437374 1407449 1374187 1111616 1076822 1143103 1162412 1242949 1585506
22753 1585506 1719362 1837672 1730185 1647381 1485022 1360204 1122349 1004719 979037 822549
22743 822549 1159425 1467074 1806858 1887631 2030212 1848496 1756254 1590928 1518457 1373775
22733 1373775 1533069 1688323 1686573 1740373 1753619 1689329 1797050 2136285 2390309 2070457
22723 2070457 1971567 1932446 1734056 1401480 1370813 1408969 1481421 1412427 1140282 1233295 1994038
22712 1994038 2318610 2204200 1957103 1844881 1793602 1701527 1674346 1810071 1652007 1884432
22702 1884432 1842807 1759707 1763375 1454736 1295086 1296574 1566935 1390723 1534508 1517679 1308207
22691A308207j76126R9080J37334k93921k65L01842l6617L7189Q4988l51149J23436
22680A233998L17112j96593P3939K34997K55396M7618j49596l88682k15896J00189
22670A312482J84773m0053L1957r2954n3821K46341Q5108j33000q3190P6112j39100
22659A394655K02057J22673k78997p8481J95638J02264n3063R7146M9991q1465
22649A672418o5881j01924K00676J26777j93522J22342L27176J80504j0000j13268
22639B145298l21218m44874K20413K62866r3707J41589Q6678k05358n44333J84833
22629A432187L47794P6894P7047M9268m00267n6249l1213M3237J24820J45710
22619A809228K06180K06504N2259l00085p9731j94764j50955J33922Q0207j85804
$$ plain form
22691 1308207 1132081 1231161 1368495 1074574 1074309 1376151 1339534 1376723 1461711 1110562 1233998
22680 1233998 1551110 1354517 1428456 1663453 1918849 1966467 1816871 1428189 1212293 1312482
22670 1312482 1497255 1457202 1489159 1396205 1342384 1588725 1673833 1540833 1457643 1533755 1394655
22659 1394655 1596712 1719385 1440388 1361907 1557545 1659809 1606746 1703892 1753883 1672418
22649 1672418 1606537 1504613 1705289 1832066 1638544 1760886 2088062 2268566 2258566 2145298
22639 2145298 1824080 1379206 1599619 1862485 1768778 1910367 1997045 1791687 1247354 1432187
22629 1432187 1779981 1856875 1933922 1983190 1582923 1526674 1495461 1538698 1663518 1809228
22619 1809228 2015408 2221912 2274171 1974086 1894355 1699591 1548636 1682558 1762765 1576961
22609A576961r6008L6936L64883J40376K7428j71917j94983l7565j22289M27894
22599A951716L25371O4310k41989l10366k83857m07716k92880J5405L28705K59544
22589A408243K65811L29226j51424m25516N3007M01416K33571r8540L2903L41449
22579B390146K55691k26750J3724k02844k74033l71786l8443L50250J07950K13199
22569B217104n5280J33513q0352J9453J0371j80160k54127J58359L51738j77555
22559B143064n14541n8505l6398k10743J46576K86562q1690M0591R7322j71627
22549A640611J00137l0970j6197K1140p8058L1528l54802J24784M43476J16409
22539A998058l29207j1634J39458j46705k48073N5436Q28761J39387n69955k8577
$$ plain form
22609 1576961 1480953 1517889 1882772 2023148 2050576 1878659 1683676 1646111 1523822 1951716
22599 1951716 2277087 2341397 2099408 1789042 1505185 1097469 804589 819994 1148699 1408243
22589 1408243 1674054 2003280 1851856 1426340 1479347 1880763 2114334 2015794 2048697 2390146
22579 2390146 2645837 2419087 2432811 2229967 1955934 1584148 1545705 1895955 2003905 2217104
22569 2217104 2161824 2295337 2214985 2234438 2244809 2064649 1810522 1968881 2320619 2143064
22559 2143064 1628523 1570018 1533620 1322877 1469453 1756015 1674325 1714916 1812238 1640611
22549 1640611 1740748 1709778 1693581 1714721 1636663 1668191 1313389 1438173 1881649 1998058
22539 1998058 1668851 1657217 1796675 1649970 1401897 1457333 2286094 2425481 1855526 1826949
22529A826949J30662J11349k99553j30639n294K02547k3396j45692K71767M08069
22519B346769k73906k08320J15189j9796J66326J12790j64543j30694M4887J15675
22509B104377K37276l4299j82722j32297k82368k23650J71447J33084K1887m6751
22499A765984l4728k20114p2418r5619J42770M65570L28660l83279k85738k71314
22489A339774J32972L92508l1039j10597P4991j39610l6298n9605J40749L3650
22479A737495l48801J20118N72748J11966j0406R0524k8418j23720k56547j80866
22469A684093j77617M41211J42568j34380L1593L15521j64622m20611k83207j57659
22459A276890L73328K56495K81113P2674m1803k45953J26642l79448n1965K10686
$$ plain form
22529 1826949 1957611 2068960 1769407 1638768 1633474 1836021 1812625 1666933 1938700 2346769
22519 2346769 2072863 1864543 1979732 1959936 2126262 2239052 2074509 1943815 1988702 2104377
22509 2104377 2341653 2307354 2124632 1992335 1709967 1486317 1657764 1790848 1812735 1765984
22499 1765984 1731256 1511142 1438724 1343105 1485875 1951445 2280105 1896826 1611088 1339774
22489 1339774 1472746 1865254 1834215 1723618 1798609 1658999 1622701 1563096 1703845 1737495
22479 1737495 1388694 1508812 2081560 2193526 2183120 2273644 2245226 2121506 1864959 1684093
22469 1684093 1506476 1947687 2090255 1955875 1987468 2302989 2138367 1717756 1434549 1276890
22459 1276890 1650218 1906713 2187826 2260500 2218697 1972744 2099386 1719938 1667973 1878659
22449A878659J02045L4309l2922J84042p1063K50639q733j18833j14058m31071
22439A673014l2599L86587J53809M0678p3801m12299L0280L12480O6215l90981
22429A753383l84603m6065L28227M78193J99891j05884k42759L08962q359k52889
22419B028097k87799l972M22483L06675J25092k96102k58883k97644k52638M7986
22409A533295k36446j67115K45215M61121p7788j93877J68784Q3327K03351j20466
22399A899401j17249L33122j08408n3410J49983j11887m15736K96786L49294N5612
22389B277508n6873K15698k485j98213j08278n4865j12567J12175K411l67188
22379A707323J10485J52034j07377j86668M64217L97389j67252m21473l9541l0645
$$ plain form
22449 1878659 1980704 2015013 1982091 2166133 2095070 2345709 2336976 2218143 2104085 1673014
22439 1673014 1640415 2027002 2180811 2221489 2147688 1735389 1765669 2078149 2144364 1753383
22429 1753383 1368780 1322715 1650942 2129135 2329026 2223142 1980383 2289345 2280986 2028097
22419 2028097 1740298 1736326 2158809 2465484 2590576 2294474 2035591 1737947 1485309 1533295
22409 1533295 1296849 1129734 1374949 1836070 1758282 1564405 1733189 1816516 2019867 1899401
22399 1899401 1782152 2115274 2006866 1953456 2103439 1991552 1575816 1872602 2221896 2277508
22389 2277508 2220635 2436333 2433848 2235635 2127357 2072492 1959925 2072100 2074511 1707323
22379 1707323 1817808 1969842 1862465 1675797 2140014 2537403 2370151 1948678 1909137 1878492
22369A878492J53589M01920j87695k11491P7180R6675M5990k32819R9304P1107
22359B192252K55597J04364l38295J61753j18554m46007J0819L009K57779j50606
22349A932111m2536j11553Q653K38889K43709j39869j30936k2233K742K67034
22339B246011J52400o4099M8883o5210k30658k74438j03674j28755j18147j46230
22329A316083L36141N09059j00524j91588K03552j541P9557J85600n2523j92847
22319B090969M4999j48616m9230k33748J63558j50039n97498J50815K39995N40897
22309B052102j68600m1393K21400j82650k9899l10186n3894p1899K81521O4686
22299A761188Q3678J56288K05744l82663L02321J56841J3437j76505m34456L37469
$$ plain form
22369 1878492 2032081 2434001 2246306 2034815 2111995 2208670 2254660 2021841 2121145 2192252
22359 2192252 2447849 2552213 2213918 2375671 2257117 1811110 1821929 1824938 2082717 1932111
22349 1932111 1889575 1778022 1786675 2025564 2269273 2129404 1998468 1976235 1978977 2246011
22339 2246011 2398411 2334312 2383195 2317985 2087327 1812889 1709215 1580460 1462313 1316083
22329 1316083 1652224 2161283 2060759 1869171 2072723 2071182 2150739 2336339 2283816 2090969
22319 2090969 2135968 1987352 1938122 1704374 1867932 1717893 1120395 1271210 1511205 2052102
22309 2052102 1883502 1842109 2063509 1880859 1850960 1540774 1486880 1414981 1696502 1761188
22299 1761188 1844866 2001154 2206898 1824235 2126556 2283397 2296834 2120329 1685873 2023342
22289B023342K76381J82422o7973k64741Q3172K74180K010k87824r9584L22063
22279B443448j03472k19108L4685M09388J61159k94392l58223q5269j11691k63762
22269A612763K33200J66409m28320r9444M98954J18717K08510J70052n1931L22581
22259B751491o9j02652j05414j79595P9816j89766j11285l68044o7756K48064
22249A954790j9342k31844J98243R6064j09549J05296L05585R9951K94728J87388
22239B881310m93915J39431N9314k68895l04226O0552J4065q4678K07534J92479
22229B402971R34K6821j86626l45808J28739M42335p8607k35849o8113j10063
22219A976734j68309J88095k1524K28756J06156J56455J00180l67096l3698N42816
$$ plain form
22289 2023342 2299723 2482145 2414172 2149431 2232603 2506783 2508793 2220969 2121385 2443448
22279 2443448 2339976 2120868 2155553 2564941 2726100 2431708 2073485 1988216 1876525 1612763
22269 1612763 1845963 2012372 1584052 1484608 1983562 2102279 2310789 2480841 2428910 2751491
22259 2751491 2751422 2648770 2543356 2363761 2443577 2253811 2142526 1774482 1706726 1954790
22249 1954790 1935448 1703604 1901847 1997911 1888362 1993658 2299243 2399194 2693922 2881310
22239 2881310 2387395 2526826 2586140 2317245 2013019 2073571 2087636 2002958 2210492 2402971
22229 2402971 2403905 2430726 2244100 1898292 2027031 2469366 2390759 2154910 2086797 1976734
22219 1976734 1808425 1996520 1974996 2203752 2309908 2466363 2566543 2199447 2165749 2708565
22209B708565Q4698k30218m77921k33098K04097K37189n5775l85794j36856J26866
22199A841753Q7681l6368K50415r946J23902J12563Q0150J17861o8790j17516
22189B381705k05675J46758Q5530P8752L57476J04368n36867j93171j37491l41817
22179A739568J96767J41394K49990j24437J72268N72358Q3273m67279k23441n6767
22169B283694l1467K72658P3858J54410N556k14684o9490o1203P789l664r156
22158B408301j47500j65428P4120J32133p7242j36014K04822O7758q1681j18648
22148B160621q7459M1766J49301M3835j5745j36582J43393K25279k26215k11960
22138B086234J69414L80395k00667L1384k33349j95426J59080J32961K06288P8431
$$ plain form
22209 2708565 2793263 2563045 2085124 1852026 2056123 2293312 2237537 1851743 1714887 1841753
22199 1841753 1929434 1893066 2143481 2133535 2257437 2370000 2450150 2568011 2499221 2381705
22189 2381705 2176030 2322788 2408318 2487070 2844546 2948914 2412047 2218876 2081385 1739568
22179 1739568 1936335 2077729 2327719 2203282 2375550 2947908 3031181 2563902 2340461 2283694
22169 2283694 2252227 2524885 2598743 2753153 2758709 2544025 2474535 2413332 2421121 2417457 2408301
22158 2408301 2260801 2095373 2169493 2301626 2224384 2088370 2293192 2360950 2279269 2160621
22148 2160621 2073162 2114928 2264229 2308064 2292319 2155737 2299130 2524409 2298194 2086234
22138 2086234 2255648 2636043 2435376 2466760 2233411 2037985 2197065 2330026 2536314 2614745
22128B614745k27050q3644M7882J8959J10761k13745j64817J65525l4574J01247
22118B335289L12255K8125j38739k17248j02701J3125m0413k3025p1375J56776
22108B252069L85617J22588o365l82566k60632m8302l0984J04091L18653K85866
22098B740035o5683O9754K40909m6228k93507r3613k4538M5498J27218l04322
22088B395523l09911J83748J0133J22538j38796K08461J68291K48062J52577k11228
22078B829398k83862m53581k35855m3146M41546L76550j80912o8527J46490j80915
22068B347186l897L1704l16578r6549J51843N07009K81351m46435l09622K09874
22058B355886k5784l4782J4086K14579l2810j99666k0080J81502L59088J11782
$$ plain form
22128 2614745 2387695 2304051 2351933 2370892 2481653 2267908 2103091 2268616 2234042 2335289
22118 2335289 2647544 2675669 2536930 2319682 2216981 2230106 2189693 2166668 2095293 2252069
22108 2252069 2637686 2760274 2753909 2371343 2110711 2062409 2031425 2135516 2454169 2740035
22098 2740035 2674352 2744106 2985015 2938787 2645280 2551667 2527129 2572627 2699845 2395523
22088 2395523 2085612 2269360 2279493 2402031 2263235 2471696 2639987 2888049 3040626 2829398
22078 2829398 2545536 2091955 1856100 1812954 2254500 2631050 2450138 2381611 2528101 2347186
22068 2347186 2343289 2374993 2058415 1961866 2113709 2620718 2902069 2455634 2146012 2355886
22058 2355886 2330102 2295320 2309406 2523985 2491175 2291509 2271429 2452931 2812019 2923801
22048B923801j61069k4953k43333q3141J2804K71817R4723k49555n47610l45683
22038A647801L76753J24301K49368R4873J23813j20856J82747L77183j82574l12665
22028B560744j78941K30875m37l92786Q5029L28537K71960K40632j9521j39394
22018B986698k23770M05704J38189m08103m26061k4584J74089J19394j51043n8324
22008B532189K60133j14336m40355k3437O8853O972J73482o0475q3476K1779L02520
21997B643849K40087k4797J69380j77664j13582l26168J57713K29774j66313l42403
21987B289876J61456M1581J73413J95010K97599K01854l06422n1605q0969k26269
21977B695524j02037O1129L31881j78853j75985l98154J28735L39775J76630J92768
$$ plain form
22048 2923801 2762732 2737779 2494446 2411305 2424109 2695926 2790649 2541094 1993484 1647801
22038 1647801 2024554 2148855 2398223 2493096 2616909 2496053 2678800 3055983 2873409 2560744
22028 2560744 2381803 2612678 2612241 2219455 2304484 2633021 2904981 3145613 3126092 2986698
22018 2986698 2762928 3168632 3306821 2898718 2472657 2448073 2622162 2741556 2590513 2532189
22008 2532189 2792322 2677986 2237631 2214194 2283047 2290019 2463501 2403026 2319550 2341329 2643849
21997 2643849 2883936 2859139 3028519 2850855 2737273 2411105 2568818 2798592 2632279 2289876
21987 2289876 2451332 2492913 2666326 2861336 3158935 3360789 3054367 3002762 2921793 2695524
21977 2695524 2593487 2654616 2986497 2807644 2631659 2233505 2362240 2702015 2878645 3071413
21967C071413j36740k69611j40129r5807K46214k1629o5241l91870J48993J19574
21957B465167j5970N3301J74690R1424N4409J77045Q6877R1477k06149j89046
21947B783225p8409K98284K35609K29268r4650n30298p510j8867j23575l22430
21937B370647J0203L48258l6100m3473N4259l4224l13435K53230J51195L14066
21927C074626J96743m45172o0051l5790o9867k58692O267L51999L55342J34493
21917C249898m6407M186k76219k74331K00901N6085o9770n47789m16516R2422
21907A972460L83118J26536O32547K66978j22115l86005j76205l04296j54383
21898B238635L21350j25799P8681J59058k9484Q7042J34813Q2425p4618q6797
$$ plain form
21967 3071413 2934673 2665062 2524933 2429126 2675340 2653711 2588470 2196600 2345593 2465167
21957 2465167 2449197 2502498 2677188 2768612 2823021 3000066 3086943 3178420 2972271 2783225
21947 2783225 2704816 3003100 3238709 3467977 3373327 2843029 2835519 2816652 2693077 2370647
21937 2370647 2380850 2729108 2693008 2649535 2703794 2669570 2356135 2609365 2760560 3074626
21927 3074626 3271369 2826197 2766146 2730356 2660489 2401797 2408064 2760063 3115405 3249898
21917 3249898 3203491 3207677 2931458 2657127 2858028 2914113 2844343 2296554 1880038 1972460
21907 1972460 2355578 2482114 3114661 3381639 3259524 2873519 2697314 2393018 2238635
21898 2238635 2559985 2434186 2512867 2671925 2642441 2729483 2864296 2946721 2872103 2785306
21888B785306j49489L8339J03444K96404O1367j87975j31762m9974P3020r1136
21878B747544n667J51616j8033J22397m5332N2420J26403J64417K2400l70011
21868B948154j53433J03627J19313n3501j30022j20737J50978K16465O5345r9274
21858C046915K4238m6535P75L83935L3463j38483l33246M7485J5315K2922j34073
21847B922711j70946L55916K03422l5907L45372M98k67581j72405k35825K82607
21837C227862Q1643m65204j96018K49298J48245j39804j16774J50189J40334L7063
21827C116834L89125J28780k90042o062j63426l44737n8832k88281j64610L01120
21817B619869J1483R9171M25487J63674l5341m4491J87456p3706n2006j12185
$$ plain form
21888 2785306 2635817 2674156 2777600 3074004 3135371 2947396 2815634 2765660 2838680 2747544
21878 2747544 2741877 2893493 2875460 2997857 2952525 3004945 3131348 3295765 3318165 2948154
21868 2948154 2794721 2898348 3017661 2964160 2834138 2713401 2864379 3080844 3146189 3046915
21858 3046915 3071153 3024618 3025393 3409328 3442791 3304308 2971062 3018547 3033862 3056784 2922711
21847 2922711 2751765 3107681 3311103 3275196 3620568 3621066 3353485 3181080 2945255 3227862
21837 3227862 3309505 2844301 2648283 2897581 3045826 2906022 2789248 2939437 3079771 3116834
21827 3116834 3505959 3634739 3344697 3338635 3175209 2830472 2771640 2483359 2318749 2619869
21817 2619869 2631352 2730523 3156010 3319684 3284343 3239852 3427308 3353602 3301596 3189411
21807C189411j51939J25969K31784q5776k09215j19780J55218K66206K28245j25185
21797C504938n6494j26108j28690M38697K21846l79630k71058k08238j60453k69440
21787B565370k25339R3883R5184M26575K13532J41292p5752l24305J14673J30369
21777C155482k35467J59635k5947J98187Q1268j48106j84930J19588p7053m51709
21767B590948k35143L96992j8747J96282r3364j11991l6902Q2712J09320J20064
21757C000171N7133j28460Q1831L28275j48369m83095J54759j01785k9085K76520
21747C007895K71385M06260l1922j39086k29936k39479l48983l09631J20786J43598
21737B650887K32233J30255Q78250k32407k89744j86729m5848r0796j27485K56066
$$ plain form
21807 3189411 3037472 3163441 3395225 3309449 3100234 2980454 3135672 3401878 3630123 3504938
21797 3504938 3448444 3322336 3193646 3632343 3854189 3474559 3203501 2995263 2834810 2565370
21787 2565370 2340031 2433914 2529098 2955673 3169205 3310497 3234745 2910440 3025113 3155482
21777 3155482 2920015 3079650 3053703 3251890 3333158 3185052 3000122 3119710 3042657 2590948
21767 2590948 2355805 2752797 2734050 2930332 2836968 2724977 2688075 2770787 2880107 3000171
21757 3000171 3057304 2928844 3010675 3338950 3190581 2707486 2862245 2760460 2731375 3007895
21747 3007895 3279280 3685540 3653618 3514532 3284596 3045117 2696134 2386503 2507289 2650887
21737 2650887 2883120 3013375 3891625 3659218 3369474 3182745 3136897 3046101 2918616 3174682
21727C174682L76438K72415o2018m42297k8763j83176O2513q5823l19119j8207
21717B746645M37045J3270K20582L21497k20309l74407L5063q9627p7040l6768
21707B975951p9229j21217J0969P0284P7732P8653J47756k29696l42927K22929
21697B811205N88087N37105n79295n62884j17875k75189K24327J28670n5367L093
21687B701877j12755L90661L4425k8858j4228J98896J37689o9205Q1216J60553
21677C480271n05575o6075J66883L70033O9908N3785j15135J9057m01692k10540
21667B860920L99896N99278R4144l25207m52184l23857j69859j18630K24099K88461
21657C077061O9846J26408J15787N5044P7191m3811J68517l2093k53464j30172
$$ plain form
21727 3174682 3551120 3823535 3761517 3319220 3290457 3107281 3169794 3083971 2764852 2746645
21717 2746645 3183690 3196960 3417542 3739039 3518730 3144323 3179386 3089759 3012719 2975951
21707 2975951 2896722 2775505 2786474 2856758 2934490 3013143 3160899 2931203 2588276 2811205
21697 2811205 3399292 3936397 3357102 2794218 2676343 2401154 2625481 2754151 2698784 2701877
21687 2701877 2589122 2979783 3014208 2985350 2971122 3170018 3307707 3238502 3319718 3480271
21677 3480271 2974696 2908621 3075504 3445537 3515445 3569230 3454095 3473152 3071460 2860920
21667 2860920 3260816 3860094 3954238 3629031 3176847 2852990 2683131 2564501 2788600 3077061
21657 3077061 3146907 3273315 3389102 3444146 3521337 3477526 3646043 3613950 3360486 3230314
21647C230314l80681J58306L71295j53779k21164m7322M6982o4537j47832K73354
21637C064936K66832r1586j1081N8036r3343n1201k06930L18205J72807r6181
21627C330494j50835L6407J19870J15351J16563k58902J31029R833j761J21002
21617C569051J3971m270l2307j22670l7930J92090l9517n5684K87102P4167m2345
21606C801658k30940k22714l28626l67125L02361K15876j23748O703k17318K15495
21596C051622M97999O36117J69113k09086k76841o3597J3538K93102k3820j16175
21586C971972k09910k11373M0928K20682j40707k05042m23094j97270M67205J4040
21576C327431j82066J65429L79180J93556k17576k5331J01421k01204K4305L07958
$$ plain form
21647 3230314 2849633 3007939 3379234 3225455 3004291 2956969 3003951 2939414 2791582 3064936
21637 3064936 3331768 3240182 3229101 3287137 3193794 3142593 2935663 3253868 3426675 3330494
21627 3330494 3179659 3216066 3335936 3451287 3567850 3308948 3439977 3449810 3448049 3569051
21617 3569051 3583022 3578752 3546445 3423775 3385845 3577935 3538418 3482734 3769836 3844003 3801658
21606 3801658 3570718 3348004 3019378 2652253 2954614 3170490 3046742 3053445 2836127 3051622
21596 3051622 3549621 4185738 4354851 4145765 3868924 3805327 3818865 4111967 4088147 3971972
21586 3971972 3762062 3550689 3591617 3812299 3671592 3466550 3043456 2846186 3313391 3327431
21576 3327431 3145365 3310794 3689974 3883530 3665954 3640623 3742044 3540840 3565145 3873103
21566C873103K07672o0630o1865l05348k55878j13530l8931j48819j57607j5463
21556B922704J74877L39557J33501Q0547j22706k97656p939L3509K94459j04734
21546C446119j51845K9883J50256J58831J64916J74148J3146N3832r7552m17842
21536C523892K00241o2896l72090J09360R3068p4728M66830O5338k4731l41696
21526C582588l98226j44940L14961K88784j37735k52185k1452L08648J51267j63844
21516C527866K82987P8773Q1660k97251j25813J52738m4377j03452M9262k72135
21506C330258j87583K48009Q6641p206R1193K32007Q8903j44534l96553j48049
21496C193086K85538K6682K83371L49712m3353k55456k60101K1438K73630j8569
$$ plain form
21566 3873103 4080775 4020145 3958280 3652932 3397054 3283524 3244593 3095774 2938167 2922704
21556 2922704 3097581 3437138 3570639 3651186 3528480 3230824 3222885 3256394 3550853 3446119
21546 3446119 3294274 3324157 3474413 3633244 3798160 3972308 3985454 4039286 3941734 3523892
21536 3523892 3724133 3661237 3289147 3398507 3491575 3416847 3883677 3949015 3924284 3582588
21526 3582588 3184362 3039422 3354383 3643167 3505432 3253247 3231795 3540443 3691710 3527866
21516 3527866 3810853 3889626 3971286 3674035 3548222 3700960 3656583 3553131 3602393 3330258
21506 3330258 3142675 3390684 3477325 3470119 3561312 3793319 3882222 3737688 3341135 3193086
21496 3193086 3478624 3505306 3788677 4138389 4095036 3839580 3579479 3600917 3874547 3855978
21486C855978r6400k92379o2613J049J3412j08228L51085J68336j13972j98521
21476C517747K70220L2932J78363j35779j27233K44041j06223l55102j26908J69227
21466C561285J29684N0465p4562K1507J94963J47464l75609m0794J81629L92229
21456D188261j51016l21337j48388k06514J46093R8396L0099K9214L7605K05635
21446C908048M7580L66316o8350r3514l31791j01475p7458K912J82611K93327
21436D128206J98216l56928k96891P2960J54159k51532J60108j59713l27355L57276
21426C678506L19920l2201k13498o0825L5580O2639R4365j73551j7809r6115M92556
21415D089567K97601o27113k51287L17111K28105M6967l93209r0364K90498M58242
$$ plain form
21486 3855978 3759578 3467199 3404586 3405635 3419047 3310819 3661904 3830240 3716268 3517747
21476 3517747 3787967 3820899 3999262 3863483 3736250 3980291 3874068 3518966 3392058 3561285
21466 3561285 3690969 3741434 3666872 3688379 3883342 4030806 3655197 3614403 3796032 4188261
21456 4188261 4037245 3715908 3567520 3361006 3507099 3605495 3635594 3664808 3702413 3908048
21446 3908048 3955628 4321944 4253594 4160080 3828289 3726814 3649356 3652268 3834879 4128206
21436 4128206 4326422 3969494 3672603 3745563 3899722 3648190 3808298 3648585 3321230 3678506
21426 3678506 3998426 3966225 3752727 3691902 3727482 3790121 3884486 3710935 3693126 3597011 4089567
21415 4089567 4387168 3760055 3508768 3825879 4053984 4100951 3707742 3617378 3907876 4366118
21405D366118m1720K0529j68269l48448J83706K31088r0609k62369Q8359K80674
21395D259059j03890k82720K21691j83536k28921J74203K33466Q5540M6889N1294
21385D273075o1483k41247m4088R914J66437m4042j36806j42743m9670L63161
21375D092508m4160r2076N6016r7866J37857K97825j04495k74798J00833M73422
21365D545066K96901j16818j54061j23026J22104j35047n4544r6926L8683k39721
21355D082611K36137J88276Q0549o9610L4379k77154j49427k54932j44010K17314
21345C944133P3893q1334L98090Q2287k79311J06302k84539j77840o4786K52846
21335C969741J04120j97283J77976L81226n5211K69930J36863k24031p2547J67402
$$ plain form
21405 4366118 4324398 4344927 4176658 3828210 4011916 4243004 4152395 3890026 3978385 4259059
21395 4259059 4155169 3872449 4094140 3910604 3681683 3855886 4089352 4174892 4221781 4273075
21385 4273075 4211592 3970345 3926257 3936171 4102608 4058566 3921760 3779017 3729347 4092508
21375 4092508 4048348 3956272 4012288 3914422 4052279 4350104 4245609 3970811 4071644 4545066
21365 4545066 4841967 4725149 4571088 4448062 4570166 4435119 4380575 4283649 4322332 4082611
21355 4082611 4318748 4507024 4587573 4517963 4552342 4275188 4125761 3870829 3726819 3944133
21345 3944133 4018026 3936692 4334782 4417069 4137758 4244060 3959521 3781681 3716895 3969741
21335 3969741 4073861 3876578 4054554 4435780 4380569 4650499 4787362 4563331 4490784 4658186
21325D658186m3085j93849J45954K15874n9615L24862K25129J12443K16485J92417
21315E794801N02735K33825k19216k9963N708N9464K86523k65519o7344l2586
21305F268428j8649k49545j69404L3294l2211K353O0315n0059J55271J35668J84086
21294F319547N8244R2894k7653J01623M70449J16216j78376j36k81787k33842
21284F437179k03675k20809p7688l42660k78453P6791j84476O8347K43237j01255
21274E416538k61904p6640K7508L85629n9909k92858j3326O8182m89694j9069
21264D684457N6182j18883j09149j3723j8505L459J29045p9280k91271p731J86221
21253D420822K54087j15832j2854J29494N4846K48655r224m18174n2502J64099
$$ plain form
21325 4658186 4615101 4421252 4567206 4783080 4723465 5048327 5273456 5385899 5602384 5794801
21315 5794801 6297536 6531361 6312145 6282182 6287890 6347354 6633877 6368358 6301014 6268428
21305 6268428 6249779 6000234 5830830 5864124 5831913 5834266 5894581 5844522 5999793 6135461 6319547
21294 6319547 6377791 6470685 6443032 6544655 7015104 7131320 6952944 6952808 6671021 6437179
21284 6437179 6233504 6012695 5935007 5592347 5313894 5390685 5206209 5274556 5517793 5416538
21274 5416538 5154634 5077994 5105502 5491131 5431222 5138364 5125038 5193220 4703526 4684457
21264 4684457 4740639 4621756 4512607 4498884 4480379 4483838 4612883 4533603 4242332 4234601 4420822
21253 4420822 4674909 4559077 4546223 4675717 4730563 4979218 4969994 4551820 4499318 4663417
21243D663417N5484j75470o9035L52240K79839J61496J67039R3856k94252m5k84812
21232D949757j58595J33125K86121J12245j98832k64717K2562J75407j62585K76301
21222E170789j44699k36511j22272N2809J01382Q5752K3681j06507j83181k80953
21212D360290J02166J45485R6431l30976r3983K3665K94253j14209p751o6107
21202D409264K2700Q494J80548J21617q3154k21350k46716Q1926K12471L48523
21192D834323r9465j50683K37575J605j15467P6349J24548O9623n1710j47966
21182D778732o4049L60051K0150n6286l12935R574J08313l0558M8115J22347R7162
21171E080616J1529j89841O9373J8037j56975L1344N8972m761j87147m2549P2417
$$ plain form
21243 4663417 4718901 4543431 4474396 4826636 5106475 5267971 5435010 5528866 5234614 5234569 4949757
21232 4949757 4791162 4924287 5210408 5322653 5123821 4859104 4881666 5057073 4894488 5170789
21222 5170789 5026090 4789579 4667307 4720116 4821498 4907250 4930931 4824424 4641243 4360290
21212 4360290 4462456 4607941 4704372 4373396 4279413 4303078 4597331 4483122 4475371 4409264
21202 4409264 4431964 4440458 4621006 4742623 4659469 4438119 4191403 4273329 4485800 4834323
21192 4834323 4734858 4584175 4821750 4823355 4707888 4784237 4908785 4978408 4926698 4778732
21182 4778732 4714683 5074734 5094884 5038598 4725663 4735237 4843550 4812992 4861107 4983454 5080616
21171 5080616 5092145 4902304 4971677 4989714 4832739 4864083 4923055 4918294 4731147 4688598 4761015
21160D761015m18089k85043J04418M52121J92795N4496K1986N64016L47063p9670
21150E715108k91625L2989m62746l05999l26505J73065j465J51950L95058J7472
21140E097302j54305J31869J01828J78004J8237p627J12719j98381O2212J21608
21130E463466J05547j75462k67693k75616K3458J58178R1955j33873N725J1012
21120E006697N9136N3979n1621L07895K74321n212k40971J64893N8332P4150j05012
21109E596587Q0203k44255l75384n06577j27127J04912J46350J75657L8054R9877
21099D988297M9807K93733M32024j52693k28703R6625K06589m94758k70137k0907
21089D899877K04520P6509L13835j44585j3459J4197l10876Q5709L73951L09733
$$ plain form
21160 4761015 4342926 4057883 4162301 4614422 4807217 4861713 4883699 5447715 5794778 5715108
21150 5715108 5423483 5456472 4993726 4687727 4361222 4534287 4532822 4684772 5079830 5097302
21140 5097302 4942997 5074866 5176694 5354698 5372935 5365308 5478027 5279646 5341858 5463466
21130 5463466 5569013 5393551 5125858 4850242 4873700 5031878 5123833 4989960 4995685 5006697
21120 5006697 5065833 5119812 5068191 5376086 5650407 5645195 5404224 5569117 5627449 5701599 5596587
21109 5596587 5676790 5432535 5057151 4550574 4423447 4528359 4674709 4850366 4888420 4988297
21099 4988297 5038104 5331837 5763861 5611168 5382465 5479090 5685679 5190921 4920784 4899877
21089 4899877 5104397 5180906 5494741 5350156 5336697 5350894 5040018 5125727 5499678 5809411
21079E809411Q8648p1326j93627m1792j01152R911j39321j20878l8425R1405J28914
21068E421768n0667j53085M64542J14199j94671J5476j60040J85966j34774l52845
21058E155869n7636J99789L16281r4744N7588m2224m7582J27891L8321k03074
21048E450479J81949L21936j42267l54744K1606J76397M11443K66194p4776q3103
21038F175114m84774k23170J48556j02372k41003J41080L51661J96906L25355
21029F287353k22593k58611K25349N2423k82007k06355m8676K17381L74182J97478
21019F335924m66924l61364K56182J87182J49025L20133J3375l27256k88278J38911
21009E956910J82502K49432m437o19197J02156L4127p0964K14339k1311K65314
$$ plain form
21079 5809411 5898059 5826733 5633106 5591314 5490162 5500073 5360752 5239874 5201449 5292854 5421768
21068 5421768 5371101 5218016 5682558 5796757 5602086 5617562 5457522 5643488 5508714 5155869
21058 5155869 5098233 5298022 5614303 5519559 5577147 5534923 5487341 5615232 5653553 5450479
21048 5450479 5632428 5954364 5812097 5457353 5478959 5655356 6066799 6332993 6258217 6175114
21038 6175114 5690340 5467170 5615726 5513354 5272351 5413431 5765092 5961998 6287353
21029 6287353 6064760 5806149 6031498 6083921 5801914 5595559 5546883 5764264 6138446 6335924
21019 6335924 5869000 5507636 5763818 5951000 6100025 6420158 6433533 6106277 5817999 5956910
21009 5956910 6139412 6388844 6384407 5765210 5867366 5901493 5830529 6044868 6023557 6288871
20999F288871K40235m7622o7071K95275K68921m42288m20410l64289L8062K3092
20989E812776J60757J57281J56000k52827j21717J77282n8698j76254O8609o3344
20979E859865j58214M4505L14971J37421N9416J31400M49j92256q207R8232K60282
20968F547864K01516J39330M54566j35741J42871J10485j40058k38644K25967
20959G308156k3796J80463k5885j51846n4030k9209J24309J51687N7802p247J60128
20948G690532J39786m6866r7312k84188o6393L05350J69718P692K3308j17589
20938G724038j86910K96773L08909l3487R1248j38360J56978J21648K34918K18964
20928H794719j04372j37357R1470J9547J59520L16563L92915P5288l43485r8339
$$ plain form
20999 6288871 6529106 6481484 6414413 6709688 6978609 6536321 6115911 5751622 5789684 5812776
20989 5812776 5973533 6130814 6286814 6033987 5912270 6089552 6030854 5854600 5923209 5859865
20979 5859865 5701651 5746156 6061127 6198548 6257964 6389364 6389813 6197557 6189350 6287582 6547864
20968 6547864 6749380 6888710 7343276 7207535 7350406 7460891 7320833 7082189 7308156
20959 7308156 7284360 7464823 7438938 7287092 7233062 7203853 7328162 7479849 7537651 7530404 7690532
20948 7690532 7830318 7783452 7686140 7401952 7335559 7640909 7810627 7818319 7841627 7724038
20938 7724038 7537128 7833901 8142810 8109323 8200571 8062211 8219189 8340837 8575755 8794719
20928 8794719 8690347 8552990 8644460 8664007 8823527 9140090 9533005 9608293 9264808 9166469
20918I166469K64677J78995J29848q829m4238M00178j17707J07600J43017L2333
20908A0252343J99741R9538L48288N77753J01848k42974J81379J53389o4796Q6703
20898A1693212K61961L12492k42244j12803J29850K54930j27203k10491m67467
20889A1492237k54240M68364M32118j28330K37601p1815m80961j92064k88214
20880A1214696K13003L86849K75874j29544O7286J90464L36433L91919O4618N9251
20870A3070849k42207k67674K62445M79700N28556o2051l3165J89050N01952N43107
20860A4970562M1636j51740M53238J16258K04164L78942M46556M72336M91352
20851A7423304O64259O41149L30656K74995Q67562R19557R23205R16909J091756
$$ plain form
20918 9166469 9431146 9610141 9739989 9731160 9686922 10087100 9969393 10076993 10220010 10252343
20908 10252343 10452084 10551622 10899910 11477663 11579511 11336537 11517916 11671305 11606509 11693212
20898 11693212 11955173 12267665 12025421 11912618 12042468 12297398 12170195 11959704 11492237
20889 11492237 11237997 11706361 12138479 12010149 12247750 12175935 11694974 11502910 11214696
20880 11214696 11427699 11814548 12090422 11960878 12028164 12218628 12555061 12946980 13011598 13070849
20870 13070849 12828642 12560968 12823413 13303113 13831669 13769618 13736453 13925503 14427455 14970562
20860 14970562 15012198 14860458 15313696 15429954 15634118 16013060 16459616 16931952 17423304
20851 17423304 18087563 18728712 19059368 19334363 20201925 21121482 22044687 22961596 24053352
20842B4053352J123389R53950R40769J067847J276062J203564R51606O35242J47330
20833C2353111n4636p4766j84458k58682m98318l38086l89547m38692l28307j47617
20823B9640002k78495O6036K80456O47774J60171O7729O15077N98070R04705J023878
20813C3725403N79773J065547R98688J013507J389733J787439J805715K043053
20805D4408858K064209K408022K838915L389888L422911L558256L599294M491281
20797G0181634N465266O535319P792277Q644130R668238J2328052J5498242J8239705
20789A54352863K1415011K5195937K8886826L1443911L2668222L1566279K8277253
20782C53806302K3361850J6663691Q860794N46055p188387j3843339j8861558
$$ plain form
20842 24053352 25176741 26130691 27071460 28139307 29415369 30618933 31570539 32205781 32353111
20833 32353111 32298475 32223709 32039251 31780569 31282251 30944165 30554618 30115926 29787619 29640002
20823 29640002 29361507 29427543 29707999 30355773 30515944 30583673 31198750 31796820 32701525 33725403
20813 33725403 34305176 35370723 36369411 37382918 38772651 40560090 42365805 44408858
20805 44408858 46473067 48881089 51720004 55109892 58532803 62091059 65690353 70181634
20797 70181634 75646900 82182219 89974496 98618626 108286864 120614916 136113158 154352863
20789 154352863 175767874 200963811 229850637 261294548 293962770 325529049 353806302
20782 353806302 377168152 393831843 402692637 403238692 396050305 382206966 363345408
20775C63345408k2384458k4490108k5613939k5278098k4102837k2812992k0744031
20768A97918945j8316608j7069073j5207242j3366074j1787921j0002215r033886
20761A03135926p857616p109968n978207n290954m697253m053875m068955l734323
20753F0344775l292638l225902k524093j815774j797873k146699j860598j633694
20745D2047504j680121j784880j429693j725809j427471j568302j250504j047632
20737C0133092j046265r32141r42808q43052n20734q62553q23087o39979n54353
20728B2968120o85189l18437j30457m89747m24871l76706n03475m85283m41411
20719A9112544l32661k48665m04262l06009l71214j76513J13520m32439j69541
$$ plain form
20775 363345408 340960950 316470842 290856903 265578805 241475968 218662976 197918945
20768 197918945 179602337 162533264 147326022 133959948 122172027 112169812 103135926
20761 103135926 95278310 88168342 82190135 76899181 72201928 68148053 64079098 60344775
20753 60344775 57052137 53826235 51302142 49486368 47688495 45541796 43681198 42047504
20745 42047504 40367383 38582503 37152810 35427001 33999530 32431228 31180724 30133092
20737 30133092 29086827 28154686 27211878 26368826 25848092 24985539 24162452 23522473 22968120
20728 22968120 22282931 21964494 21834037 21344290 20919419 20542713 20039238 19553955 19112544
20719 19112544 18779883 18531218 18126956 17820947 17449733 17273220 17386740 16954301 16784760
20710A6784760l48325j29074J93483j92849J16204j35064k6920j09167n26193
20701A5626855m28923k71976J87053j91540n70914l50573m04770p16221k57657
20692A2621334p7157j37913j89168m73978m16098l86182j97632M142l86213m81150
20682I879985l319K77203J80144l9623m68535n51890l20403m3640j44590Q4222
20672H849554j56997k62941L4831r6444l96751r3900J90926K09457j67495j48177
20662G962063m90183k45017n91769q6320Q0651r729n7843K17717O0292l16273
20652F523589J94398l0993n26347L56015m8344N197q8982l70792k5769J8566k38607
20641E767931k4658K30226k05155n9702m5460K41089J64622k12184k7986j99306
$$ plain form
20710 16784760 16436435 16307361 16500844 16307995 16424199 16289135 16262215 16153048 15626855
20701 15626855 15197932 14925956 15113009 14921469 14350555 13999982 13595212 12878991 12621334
20692 12621334 12544177 12406264 12217096 11743118 11327020 10940838 10743206 10747348 10361135 9879985
20682 9879985 9876666 10153869 10334013 10294390 9825855 9273965 8953562 8909922 8765332 8849554
20672 8849554 8692557 8429616 8464447 8368003 7971252 7877352 8068278 8277735 8110240 7962063
20662 7962063 7471880 7226863 6635094 6548774 6629425 6619696 6561853 6779570 6839862 6523589
20652 6523589 6717987 6686994 6160647 6516662 6468318 6473515 6384533 6013741 5987972 6006538 5767931
20641 5767931 5743273 5973499 5768344 5708642 5663182 5904271 6068893 5856709 5828723 5629417
20631E629417O0463J68525o2750j4602l91947j15120p648Q3516j84558O634j36893
20620E035037l42772j64384n6618P7810L09191J77810L0766k1958O4838m3114
20610E066606L9066p709k43196l2022j56894K3120m29761j94808l6979k17137
20600C810286K52348M4826R5784L4266J50590k339O9714r8755j55057J97236R1067
20589D489966J17012K46853M1676J71155l54916o6056J0277j9395J45140J61978
20579D943690L6156K89951k01933l76470L33274M35019J45666k91967r0196k39726
20569D983464j02364k16283J20447J46209J0761q5278N236K90288J09084j34697
20559E126867l58668k17661K55798M25028M46287j61775k32707k71270M1905k03572
$$ plain form
20631 5629417 5689880 5858405 5795655 5781053 5389106 5273986 5266338 5349854 5165296 5171930 5035037
20620 5035037 4692265 4527881 4471263 4549073 4858264 5036074 5066840 5044882 5109720 5066606
20610 5066606 5105672 5097963 4854767 4822745 4665851 4688971 4259210 4064402 4027423 3810286
20600 3810286 4062634 4107460 4203244 4237510 4388100 4385761 4455475 4356720 4201663 4398899 4489966
20589 4489966 4606978 4853831 4895507 5066662 4711746 4645690 4655967 4636572 4781712 4943690
20579 4943690 4979846 5269797 5067864 4691394 5024668 5459687 5605353 5313386 5223190 4983464
20569 4983464 4881100 4664817 4785264 4931473 4942234 4856956 4862192 5152480 5261564 5126867
20559 5126867 4768199 4550538 4806336 5231364 5677651 5515876 5283169 5011899 5053804 4850232
20549D850232j68019P5946q6886J85257J19773j25801j32637l8237M7290n18k0167
20538D706233L25113k02490k21029p70J52074J36846j78930q9387K12969P3140
20528D913769R867K96899j5228K596K0076k732j31612J84588j90675o6370L58404
20517E379582K57159r1042l79696k13494r0198j49695J39875L83828O9216j6151
20507E289384N3590o0406k53179j2692O6279m31276j87261K7001O0217K3696j9317
20496D556036n7157j32048k4097k8888K09819q7471N6791K49869N8166k73677
20486D527343j85976k2620n1627J05455J72725M7757k39449j45853n2287r452
20476D146016L77063K47503r5821k5732K28730J65542p2393J08235j36923j4975
$$ plain form
20549 4850232 4682213 4758159 4671273 4856530 4976303 4850502 4717865 4679628 4726918 4726400 4706233
20538 4706233 5031346 4828856 4607827 4607057 4759131 4895977 4717047 4627660 4840629 4913769
20528 4913769 4923636 5220535 5205307 5207903 5227979 5225247 5093635 5278223 5087548 5021178 5379582
20517 5379582 5636741 5545699 5166003 4952509 4862311 4712616 4852491 5236319 5305535 5289384
20507 5289384 5342974 5282568 5029389 5016697 5082976 4651700 4464439 4491440 4551657 4575353 4556036
20496 4556036 4498879 4366831 4342734 4313846 4523665 4436194 4492985 4742854 4801020 4527343
20486 4527343 4341367 4318747 4267120 4372575 4545300 4593057 4353608 4207755 4155468 4146016
20476 4146016 4523079 4770582 4674761 4649029 4877759 5043301 4970908 5079143 4942220 4927245
20466D927245K20593k20707o2399j02942n2844j15448n5999r1972N3338J33503
20456D632368P8377J91401L38428m71708l03631L88875J39032J44793J93840l39976
20446D991799n16526j90857J24546M46686K56425O4974r0668m01025k76070L67996
20436D777280K9161J01277l69199j95595J84814J23935L6178k79174j59767j9866
20426D229044j8384r6645m0095M18548L65345k47077l49491J87566L66276o7602
20416D747485J6437j11081j42125r9909K99219J10361L37078N54943n0315k21249
20406E440844n05364P7165J88441Q2667r6081k03342R0029j64917l12135K727
20396D600034j3507K24256R7818k38488K26692L74686j41811M9706L0903l26160
$$ plain form
20466 4927245 5147838 4927131 4864732 4761790 4708946 4593498 4537499 4445527 4498865 4632368
20456 4632368 4710745 4902146 5240574 4768866 4465235 4854110 4993142 5137935 5331775 4991799
20446 4991799 4475273 4284416 4408962 4855648 5112073 5177047 5086379 4685354 4409284 4777280
20436 4777280 4806441 4907718 4538519 4342924 4527738 4651673 4687851 4408677 4248910 4229044
20426 4229044 4210660 4114015 4073920 4492468 4857813 4610736 4261245 4448811 4815087 4747485
20416 4747485 4763922 4652841 4510716 4410807 4710026 4820387 5157465 5712408 5662093 5440844
20406 5440844 4935480 5012645 5201086 5283753 5187672 4984330 5074359 4909442 4597307 4600034
20396 4600034 4586527 4810783 4908601 4670113 4896805 5271491 5129680 5179386 5210289 4884129
20386D884129n19411k0870L68283L46800J48940l43622j78580K12348J0898J7199
20376D926114j34289j06489L80228L17412K49617J31199M69896l83117m87353
20367E363218l14491Q4823l85999l80758L35702l737N2607p8795L32914R0447
20357E095931l64904o308K38783J68204j13195r7406L073M29703K67957p3910
20347E547928k82890K4907J63119j02504j74893l18861J88319N49473m68168l8317
20337E088113o063J17877j11354j50886K09128J51443k46681k38841k11549K22284
20327D823471M8626j14893R7013o3367n9874M00127K42417p5628j47477R7494
20317E247909l3309q0090K28962r3379O3435Q1224Q5246j79522k38329J05456
$$ plain form
20386 4884129 4364718 4343848 4712131 5058931 5207871 4864249 4685669 4898017 4908915 4926114
20376 4926114 4791825 4685336 5065564 5382976 5632593 5763792 6233688 5850571 5363218
20367 5363218 5048727 5133550 4747551 4366793 4702495 4698758 4751365 4672570 5005484 5095931
20357 5095931 4731027 4724719 4963502 5131706 5018511 4921105 4924178 5353881 5621838 5547928
20347 5547928 5265038 5289945 5453064 5350560 5175667 4856806 5045125 5594598 5126430 5088113
20337 5088113 5082050 5199927 5088573 4937687 5146815 5298258 5051577 4812736 4601187 4823471
20327 4823471 4872097 4757204 4854217 4790850 4730976 5131103 5373520 5297892 5150415 5247909
20317 5247909 5214600 5134510 5363472 5270093 5333528 5414752 5499998 5320476 5082147 5187603
20307E187603J54920J02026J572k50319k65572L59299M23386J99713P7998k19264
20297E771362l48915m67730L53905K74756j27782L1308p8897j67897l78918M312
20287D865504L99718N92777p438m33875j96227J19813k49908o1834K56304j09026
20277E175808k30480J4422l4033J11770K02765k30432L63728L30692j44298q6987
20267E472955r4156M3498L1016k65950r5667K95475r5812J30903j01578P0601
20257E391285K06198J37802M45628K98646J90708J26432J50197j84782J47504
20248F909618J42360j87865r5708J75566J41976J12525o3159m9511l08729O3701
20238F840774J33252j43784j60636l10732j49684j9880r3143l51462N9344J93190
$$ plain form
20307 5187603 5342523 5444549 5446121 5195802 4930230 5289529 5712915 5912628 5990626 5771362
20297 5771362 5422447 4954717 5308622 5583378 5455596 5486904 5408007 5240110 4861192 4865504
20287 4865504 5265222 5857999 5850561 5416686 5220459 5340272 5090364 5028530 5284834 5175808
20277 5175808 4945328 4959750 4925717 5037487 5240252 5009820 5373548 5704240 5559942 5472955
20267 5472955 5378799 5422297 5453313 5187363 5091696 5387171 5291359 5422262 5320684 5391285
20257 5391285 5597483 5735285 6180913 6479559 6670267 6796699 6946896 6762114 6909618
20248 6909618 7051978 6864113 6768405 6943971 7085947 7198472 7135313 7085802 6777073 6840774
20238 6840774 6974026 6830242 6669606 6358874 6209190 6189310 6096167 5744705 5804049 5997239
20228E997239J60125l87208n23577k53612l0690L75354M88451L4252K86039R9860
20218F246233n37294J79863J46402l17428K3786K36614n9920k76462p9904Q3473
20208E645363k012j72987J89879J16694k52743O3998K84365o7064q9044k66880
20198E449569r1641k27666n908R7938L19072N68590l40230M3849K02454j90877
20188E825150q7553o2744k72528k07445J47893J1322k33611P3773K49339J17089
20178E560685j46986J42494M0643K34853J12637j04799l94524k02273K2921J24927
20168E390578J07462J29957k97107j17172j29990N6620K72953P3083m9805k2821
20158E413758J57142L22276r1311Q0830k6435J3799L2561K06858K03639l54419
$$ plain form
20228 5997239 6157364 5770156 5246579 4992967 4962277 5337631 5826082 5860334 6146373 6246233
20218 6246233 5708939 5888802 6035204 5717776 5741562 5978176 5918256 5641794 5561890 5645363
20208 5645363 5643351 5470364 5660243 5776937 5524194 5588192 5872557 5805493 5716449 5449569
20198 5449569 5357928 5130262 5124354 5222292 5541364 6109954 5769724 5813573 6016027 5825150
20188 5825150 5737597 5674853 5402325 5194880 5342773 5354095 5120484 5194257 5443596 5560685
20178 5560685 5413699 5556193 5596836 5831689 5944326 5839527 5445003 5242730 5265651 5390578
20168 5390578 5498040 5627997 5330890 5213718 5083728 5140348 5413301 5486384 5436579 5413758
20158 5413758 5570900 5893176 5801865 5882695 5856260 5870059 5902620 6109478 6313117 5958698
20148E958698k37423P1961O6366o9401J07647M32494K23690J20708L0239L4347
20138F739326l96597k46476M7059j34206l268L19526R5648k46159m80458J7402
20128E711797K32065L30196K28178j81399k09569K68135N8149n0362J62763n2816
20118F497137K0579l9447m2493j32045N2129j69722q5055k0899M14309J1049m22
20107F505120K07780J9285k42444j75586K44193j43369l27394n7668R25K20501
20097F251343R4489J38152l26679j72123k47716M8012K79317k30303J04870J99028
20087F138390K94826K02712k93406l22125L19909J58185q4062m18473K99913L15599
20077F611468k39408j66299J7660Q0710j46204K8994J82138J31103N1011l53432
$$ plain form
20148 5958698 5721275 5793236 5859602 5790201 5897848 6330342 6554032 6674740 6704979 6739326
20138 6739326 6342729 6096253 6143312 6009106 6005838 6325364 6421012 6174853 5694395 5711797
20128 5711797 5943862 6274058 6502236 6320837 6111268 6379403 6437552 6387190 6549953 6497137
20118 6497137 6517716 6478269 6435776 6303731 6355860 6186138 6101083 6080184 6494493 6505542 6505120
20107 6505120 6712900 6732185 6489741 6314155 6558348 6414979 6087585 6029917 6030842 6251343
20097 6251343 6345832 6483984 6157305 5985182 5737466 5785478 6064795 5834492 5939362 6138390
20087 6138390 6433216 6635928 6342522 6020397 6340306 6498491 6414429 5995956 6295869 6611468
20077 6611468 6372060 6205761 6223421 6304131 6157927 6186921 6369059 6500162 6551173 6197741
20067F197741L8318k0247L30916L86703M3769k00573N4368R2807j67245o9474
20057F687083j68403M5831K92721K30505j34675k19605m84684r9792Q2927L55573
20047F587481L01606L8503k75641O7489j37771m22654m11669l1539J40267M39187
20037F295259N8333J45507M27330R3934K36954k50010l85790k97593j5694j71370
20027F136860N01268J70295j22368M2490R7933j71083O6374j11648j4654j69330
20017F426137N1587K65147l31674k21156J46473j32011j66855K73101K62558k7808
20007F545499k98970n84574M9307K25058J9455o7854j3395k9193L7793J63968
19997F047094J76105n0745j33446j64891J14689j00957k26572r8154K84481J45917
$$ plain form
20067 6197741 6236059 6215812 6546728 6933431 6977200 6776627 6830995 6923802 6756557 6687083
20057 6687083 6518680 6564511 6857232 7087737 6953062 6733457 6248773 6148981 6231908 6587481
20047 6587481 6889087 6927590 6651949 6719438 6581667 6159013 5747344 5715805 5856072 6295259
20037 6295259 6353592 6499099 6926429 7020363 7257317 7007307 6621517 6323924 6308230 6136860
20027 6136860 6638128 6808423 6686055 6728545 6826478 6655395 6721769 6610121 6595467 6426137
20017 6426137 6477724 6742871 6411197 6190041 6336514 6204503 6037648 6310749 6573307 6545499
20007 6545499 6246529 5661955 5711262 5936320 5955775 5887921 5874526 5845333 5883126 6047094
19997 6047094 6223199 6172454 6039008 5874117 5988806 5887849 5661277 5563123 5847604 5993521
19987E993521J00740L00030q4496M862m4341q371p7910n8414q4951O8037M9262
19976F157969M33722K50605J07149k56225m44371R9459M0654K26777K1135k47956
19966F388918j76080K8381K07287Q0121j26116l39752L8394J44096j10372O0953
19956F195830K7197J94984N29853L310k07672K5072j840K64154k47030p3374n0571
19945F659913O3176K56563J16584m77238k79398N0242R3833J27468n4363K20358
19935F777138K90777P8412J55922n753k34025l59912J12539K86558J12634J08239
19925G322529k41225Q0988K18731r2599j62935j33142K49577l8976J05838J37656
19915G446442l42591L5601K81774K47243o5288L2050r2479K13998L00714p8575
$$ plain form
19987 5993521 6094261 6394291 6309795 6314657 6270316 6261945 6184035 6125621 6040670 6108707 6157969
19976 6157969 6591691 6842296 6949445 6693220 6248849 6348308 6388962 6615739 6636874 6388918
19966 6388918 6212838 6241219 6448506 6528627 6402511 6062759 6101153 6245249 6134877 6195830
19956 6195830 6223027 6418011 6947864 6951174 6743502 6768574 6766734 7030888 6783858 6710484 6659913
19945 6659913 6723089 6979652 7096236 6618998 6339600 6389842 6483675 6611143 6556780 6777138
19935 6777138 7067915 7146327 7302249 7296496 7062471 6702559 6815098 7101656 7214290 7322529
19925 7322529 7081304 7162292 7381023 7288424 7125489 6992347 7241924 7202948 7308786 7446442
19915 7446442 7103851 7139452 7421226 7668469 7603181 7635231 7542752 7756750 8057464 7978889
19905G978889m4066j96990L9086j21558J24065M78451O42057J77332q6360j20844
19895H870062q1105J02797K22236L89491Q7518q368j1851N1876J56795j16295
19885I663156k92689L7406L50308K87j70370l00813j79876M52481l1968j84810
19875I343112j00130O9536N8386j37543k78917j4200J75020j89036k68919Q3626
19865H740935j79202J615K33210k35233J26462K38419R8372l00414l19340q8998
19855H315826p319M3157N5981J06401O1463k17161o6637J38611o5993k01465p3980
19844H088884J72121j15696L5850J51619o9106L76440l5473N9495P7488k90651
19834H450971k60446Q6574Q8476l76498j58158k41041J44698J10865K14254k48592
$$ plain form
19905 7978889 7934823 7737833 7776919 7655361 7779426 8257877 8899934 9077266 8990906 8870062
19895 8870062 8788957 8891754 9113990 9503481 9590999 9582631 9570780 9622656 9779451 9663156
19885 9663156 9370467 9407873 9758181 9758468 9588098 9287285 9107409 9559890 9527922 9343112
19875 9343112 9242982 9312518 9370904 9233361 8954444 8940244 9115264 8926228 8657309 8740935
19865 8740935 8561733 8563348 8796558 8561325 8687787 8926206 9024578 8724164 8404824 8315826
19855 8315826 8308507 8351664 8407645 8514046 8575509 8358348 8291711 8430322 8364329 8162864 8088884
19844 8088884 8261005 8145309 8181159 8332778 8263672 8640112 8604639 8664134 8741622 8450971
19834 8450971 8190525 8277099 8365575 7989077 7830919 7589878 7734576 7845441 8059695 7811103
19824G811103j19257j99550p7904K60418K97555J20487K10611K34818J12110j95584
19814H454807k90934j30038l75055o1229K02498K00034j0652k9027Q3560l0098
19804H013866p9526J94554J74482J05317j33430K347j50604j77467J5173P9198
19794H043910J05441K27819j86525J6723K34991Q469K31778r9012n0719J65302
19784H698177J72568J30837K06846K7456l32721k11340k63185J00976M14301J39667
19774I083582l9375j76530j6051J82519J73978k636j48992m0619J22498j15330
19764I023044O1249j00885q6911k5029n5139j15060n2869J01715Q9543O4286J9778
19753H923722N7855J71009k66326K93899L21601l1344k94580k30580K0472q8788
$$ plain form
19824 7811103 7691846 7492296 7414392 7674810 7972365 8092852 8303463 8538281 8650391 8454807
19814 8454807 8163873 8033835 7658780 7597551 7800049 8000083 7989431 7960404 8043964 8013866
19804 8013866 7934340 8128894 8303376 8408693 8275263 8277610 8127006 7949539 7964712 8043910
19794 8043910 8149351 8377170 8190645 8207368 8442359 8450828 8682606 8583594 8532875 8698177
19784 8698177 8870745 9001582 9208428 9235884 8903163 8691823 8428638 8529614 8943915 9083582
19774 9083582 9044207 8867677 8851626 9034145 9208123 9205487 9056495 9015876 9138374 9023044
19764 9023044 9084293 8983408 8896497 8871468 8816329 8701269 8648400 8750115 8839658 8903944 8923722
19753 8923722 8981577 9152586 8886260 9180159 9501760 9470416 9175836 8945256 8965728 8876940
19743H876940k94031L9965L53909K32002J20876n1431j89985k14168L71L69509
19733I243957M16261j04857j6069K39391J64138L3960j09647M2989L63794p518
19723A0266399j72470m231k3781O4534j36513j775K21571L11122J88297K75125
19713A0988278l7863J1754j73122K8552L2662k89480q2026m7972J53179K34701
19703A0818663M30237K53526L36732j74005k3509O7174J33629K92139M83887K8082
19693A2646555j7582k50404J44136L01501J48601j08574J58923k00601J51796
19684A2974351M8268O87331L58248k21898J29380K18855K0580N1341J92472j87024
19674A4271904j93262M2156p8503o7881Q1094J05522l0930j49274N1464N7025
$$ plain form
19743 8876940 8582909 8622874 8976783 9208785 9329661 9278230 9088245 8874077 8874448 9243957
19733 9243957 9660218 9555361 9539292 9778683 9942821 9976781 9867134 9910123 10273917 10266399
19723 10266399 10093929 10089698 10065917 10130451 9993938 9992163 10213734 10524856 10713153 10988278
19713 10988278 10950415 10962169 10789047 10817599 10850261 10560781 10478755 10430783 10583962 10818663
19703 10818663 11248900 11502426 11839158 11665153 11641644 11708818 11842447 12134586 12618473 12646555
19693 12646555 12628973 12378569 12522705 12824206 12972807 12864233 13023156 12822555 12974351
19684 12974351 13022619 13709950 14068198 13846300 13975680 14194535 14215115 14266456 14458928 14271904
19674 14271904 14078642 14120798 14042295 13974414 14055508 14161030 14130100 13980826 14032290 14089315
19664A4089315J21673R7868L34407M15336j54127k78908r150M5688L13871K53962
19654A5229935J18664m7200q728q759L56860K35791j76688L1826K15184M51574
19644A6398459N44235P1452K49312L90593K41748L81828K98485j33964M5326M42390
19634A8929864O89197R2103J08709M84842O73326L85658J87420O67641P03080
19625B2921840Q50470M48103L02749Q27530J031465P59737J064346J521580J336374
19616C1064194J472962J439995J569378J872299J736494K230167K940008L666335
19608D7991832L763619L822325M544073N207002O010317O650939P542357P975206
19600I3507670Q389110Q534500Q719587P662839P529212O717315N577129M629571
$$ plain form
19664 14089315 14210988 14308856 14643263 15058599 14904472 14625564 14616414 14662102 14975973 15229935
19654 15229935 15348599 15301399 15292671 15283912 15640772 15876563 15699875 15731701 15946885 16398459
19644 16398459 16942694 17014146 17263458 17654051 17895799 18277627 18576112 18442148 18487474 18929864
19634 18929864 19619061 19711164 19819873 20304715 20978041 21363699 21551119 22218760 22921840
19625 22921840 23772310 24220413 24523162 25350692 26382157 27141894 28206240 29727820 31064194
19616 31064194 32537156 33977151 35546529 37418828 39155322 41385489 44325497 47991832
19608 47991832 51755451 55577776 60121849 65328851 71339168 77990107 85532464 93507670
19600 93507670 101896780 110431280 119150867 126813706 134342918 141060233 146637362 151266933
19592A51266933L729753K453033J783645O85874j128071k663144l975927m845084
19584A47307012n665765o120380o641888o978473o723025o546281o481063n773669
19576I6376468n475381n000897m394254l782750l686539k862726k230069j862619
19568F7081233j188728j073451n33658j99509l24974J2266L90509J093328J331445
19559F6588461J694626K055901K833966L435968M177214M905688N653482O634786
19551I7980092P030955P981590Q730055R168056R054898Q585118Q099978P074178
19543A63704920O300289N338640L684519K507162J281376k7872j311779k521379
19535A78955876m043057n890330p249278q085961q616206q500411q967982r011100
$$ plain form
19592 151266933 154996686 157449719 159233364 159919238 158791167 156128023 152152096 147307012
19584 147307012 141641247 135520867 128878979 121900506 115177481 108631200 102150137 96376468
19576 96376468 90901087 85900190 81505936 77723186 74036647 71173921 68943852 67081233
19568 67081233 65892505 64819054 64285396 64085887 63760913 63773179 64163688 65257016 66588461
19559 66588461 68283087 70338988 73172954 76608922 80786136 85691824 91345306 97980092
19551 97980092 105011047 112992637 121722692 130890748 139945646 148530764 156630742 163704920
19543 163704920 170005209 175343849 179028368 181535530 182816906 182789034 181477255 178955876
19535 178955876 174912819 169022489 161773211 153687250 145071044 136570633 127602651 118591551
19527A18591551q192046p857383p742228p151479o292847n575106n007374m168160
19519F6604928m004617l295281l125855l289198k705499k484134k346350k124510
19511D3229484j890846j844960j598919j301692j246275r99241j059741r90862
19503C2296948j109844q11055j065770p76067p39667o38226m05707j46534m49128
19494B6154950p71157r52283j197260o11140R0107j18622o37708n16522k72983
19485B1167382q154l85416q23864m63257L8424k392r2052j50330k66075l55392
19475A8658874n62364j11232k90765J7736j438M6563l55022r29107k30654Q6908
19465A6329499l7144N103Q5276k11001n5006k86175j55611K40942M0193k15214
$$ plain form
19527 118591551 110399505 102542122 94799894 87648415 81355568 75780462 70773088 66604928
19519 66604928 62600311 59305030 56179175 52889977 50184478 47700344 45353994 43229484
19511 43229484 41338638 39493678 37894759 36593067 35346792 34347551 33287810 32296948
19503 32296948 31187104 30376049 29310279 28534212 27794545 27156319 26750612 26604078 26154950
19494 26154950 25383793 24431510 23234250 22623110 22713217 22594595 21956887 21440365 21167382
19485 21167382 21159228 20773812 19949948 19486691 19525115 19522723 19430671 19280341 19014266 18658874
19475 18658874 18096510 17985278 17694513 17712249 17710811 17757374 17402352 16473245 16242591 16329499
19465 16329499 16292355 16297458 16382734 16171733 16116727 15830552 15674941 15915883 15956076 15740862
19455A5740862l37398J3444M07722k24117l45614K59449J20331k47604j93451
19446A5193624l67923J57381J65974N6655j90248j94646R0938r3730k69585l06024
19436A4242416J364n6618l4699l7379K16158j13075J90137J17494K4807l55804
19426A4194801o9869L35366k24819p0031j03621j8062P3721J58156k06064n2440
19416A4017138N179J95783k03822r647L38922L37006K06095P7406Q5629M53742
19406A5503431P7502J3963j15081K38941L79968M54105l9767J27411O05196K71605
19396A7517274p1765K54820N48479O00598K81699M59671M46814K96222K53250
19387B0587062K26120M55293L99124O37121J16641J52083M63297K31612R0747
$$ plain form
19455 15740862 15403464 15416908 15824630 15600513 15254899 15514348 15634679 15387075 15193624
19446 15193624 14825701 14983082 15149056 15205711 15015463 14820817 14911755 14818025 14548440 14242416
19436 14242416 14243780 14187162 14152463 14115084 14331242 14218167 14408304 14525798 14550605 14194801
19426 14194801 14124932 14460298 14235479 14165448 14061827 14043765 14117486 14275642 14069578 14017138
19416 14017138 14022317 14218100 14014278 14004631 14343553 14680559 14886654 14964060 15049689 15503431
19406 15503431 15580933 15594896 15479815 15718756 16098724 16552829 16513062 16640473 17245669 17517274
19396 17517274 17445509 17700329 18248808 18849406 19131105 19590776 20037590 20333812 20587062
19387 20587062 20813182 21268475 21667599 22304720 22421361 22573444 23036741 23268353 23359100
19378B3359100N5058k74408j56839l2447j5875p8826J72835j45184l4336o6316
19368B2782762J35857n9863p849J89718m4347L78622M98996L23081K19810K15355
19358B4632142M3878L09888M50578O37059R10151P80798P24375N99311P01006
19349B9789186J192210J419507J338010J448438J650413J889507K441048K898061
19341D4066380L369071L623777M168732M345108M603534M822166N673176O037586
19333H0709530N667687N401969N302398M991277M602203M324527L609086K293545
19325A16902222J398917O12352q5141q54111j573025k999027l684973m134810
19317A05582404m545879m417491m559728m622341m345120l933203l835162l430197
$$ plain form
19378 23359100 23414158 23139750 22982911 22950464 22934589 22855763 23028598 22883414 22849078 22782762
19368 22782762 22918619 22858756 22850907 23040625 22996278 23374900 23873896 24196977 24416787 24632142
19358 24632142 24676020 24985908 25436486 26073545 26983696 27764494 28488869 29088180 29789186
19349 29789186 30981396 32400903 33738913 35187351 36837764 38727271 41168319 44066380
19341 44066380 47435451 51059228 55227960 59573068 64176602 68998768 74671944 80709530
19333 80709530 86377217 91779186 97081584 102072861 106675064 110999591 114608677 116902222
19325 116902222 118301139 118913491 118828350 117974239 116401214 113402187 109717214 105582404
19317 105582404 101036525 96619034 92059306 87436965 83091845 79158642 75323480 71893283
19309G1893283l084859k650406k293828j781751j062353j160826r37886p41594
19301E8179780j45000j43109M14544R06933R94538J378924J588669J654016K371363
19292F7200658K703975L258906M158484M838970N927044O543125P714539Q586085
19284A10931786R874653J0912316J1666539J2027326J2808813J2728405J2151268
19277A93101106J0933027R618625Q897929P130691N126920L786164K285257j05631
19269B40774088k309803m270416o239142p954138r039418r848470j0436198j1177299
19261A79499204j1051060j0548555j0219373r877995r495317q575729p784476
19254A11946699p042317o157757n477542m758668l963283l726931l223184k615154
$$ plain form
19309 71893283 68808424 66158018 63864190 62082439 61020086 59859260 58921374 58179780
19301 58179780 58034780 57891671 58306215 59213148 60207686 61586610 63175279 64829295 67200658
19292 67200658 69904633 73163539 77322023 82160993 88088037 94631162 102345701 110931786
19284 110931786 120806439 131718755 143385294 155412620 168221433 180949838 193101106
19277 193101106 204034133 213652758 222550687 229681378 234808298 238594462 240879719 240774088
19269 240774088 238464285 234193869 227954727 220000589 210961171 201112701 190676503 179499204
19261 179499204 168448144 157899589 147680216 137802221 128306904 119731175 111946699
19254 111946699 104904382 98746625 93269083 88510415 84547132 80820201 77597017 74981863
19246G4981863k141785k111944j766721j541486j021554j088808n71149k94682
19238F4443734J67221K26515L3349M83548J200776J699346K372004K952289L335817
19229G6914599L671055M109208M881727N649967O001041N461360N345421M877260
19221A16911638L949678L380168L246741K613157J885145J095320J227o14018
19213A32469056j782693l085361l666135l886109m726626m880028m975947m890964
19205A00575193m399780m052970l603367l129553k889282k629587j936064j663623
19197G6270967j363953j090313j28017L73742N99989Q18888J671087K184566K675709
19188H2012665L289878M243679N080558O054223O058681O126878O499174O764997
$$ plain form
19246 74981863 72840078 70728134 68961413 67419927 66398373 65309565 64738416 64443734
19238 64443734 64610955 64837470 64870819 65354367 66555143 68254489 70626493 73578782 76914599
19229 76914599 80585654 84694862 89576589 95226556 101227597 106688957 112034378 116911638
19221 116911638 120861316 124241484 127488225 130101382 131986527 133081847 133083074 132469056
19213 132469056 130686363 127601002 123934867 120048758 115322132 110442104 105466157 100575193
19205 100575193 96175413 92122443 88519076 85389523 82500241 79870654 77934590 76270967
19197 76270967 74907014 73816701 73688684 74062426 74662415 75481303 77152390 79336956 82012665
19188 82012665 85302543 89546222 94626780 100681003 106739684 112866562 119365736 126130733
19180A26130733N934363M914468M521959M223842L567149K930547K211692J670271
19172A56105024M61186l89768j337202k336545l176436m113505m745502n202629
19164A35264623n417555n504625n430916m911724n026767n492151n258397n050499
19156I3171989n310572m965017m015210l911780l703181l424905l030567l139632
19148F1671125k741700k081417k153617j905260j582226r80963r75503q68550
19140D8381889k96027o9742k53418O6011N89099J356516J755667J653465J911535
19131E5094995K288917K774988L214478L165476K854661K313704K155598J674728
19123G5537545O19985N94161K82409j1043p05545r76576j888968k241112k325741
$$ plain form
19180 126130733 132065096 136979564 141501523 145725365 149292514 152223061 154434753 156105024
19172 156105024 156566210 156176442 154839240 152502695 149326259 145212754 140467252 135264623
19164 135264623 129847068 124342443 118911527 113999803 108973036 103480885 98222488 93171989
19156 93171989 87861417 82896400 78881190 74969410 71266229 67841324 64810757 61671125
19148 61671125 58929425 56848008 54694391 52789131 51206905 50225942 49250439 48381889
19140 48381889 48085862 48016120 47762702 47828713 48417812 49774328 51529995 53183460 55094995
19131 55094995 57383912 60158900 63373378 66538854 69393515 71707219 73862817 75537545
19123 75537545 76157530 76751691 77034100 77023057 76317512 75340936 73451968 71210856 68885115
19114F8885115l234720l607152l364283m008740l350619k948503l184015k841637
19106D2345446k510450k190093k232872k211002j646040j871827j917590j479436
19098B6286136j037476r78639q48557q74619p62569n69684l64365l88486n01787
19089A9959954n75821j12536m33915r33343o49984l87257l42374o44162m08329
19080A5472233l09115j67278l93407l34534r2036N4517j81496j05451m72919m99370
19070A2971144k6105m5192j31548K1925n64045k82796j72156m31188j00294J78699
19060A1418444L7958m95444o5953o4821M473j38152j32771J38892j40563l84761
19050A0177302l4577M2860q2802L9429L5769O525j30547q6583O3148K16125o6753
$$ plain form
19114 68885115 65650395 62043243 58678960 54670220 51319601 48371098 45187083 42345446
19106 42345446 39834996 37644903 35412031 33201029 31554989 29683162 27765572 26286136
19098 26286136 25248660 24270021 23421464 22546845 21784276 21214592 20850227 20461741 19959954
19089 19959954 19384133 19271597 18837682 17904339 17254355 16867098 16524724 15880562 15472233
19080 15472233 15163118 14995840 14602433 14267899 14175863 14230380 14048884 13943433 13470514 12971144
19070 12971144 12945039 12899847 12768299 12790224 12226179 11943383 11771227 11340039 11239745 11418444
19060 11418444 11456402 10960958 10895005 10830184 10834657 10696505 10563734 10702626 10562063 10177302
19050 10177302 10142725 10185585 10102783 10142212 10177981 10184506 10053959 9967376 10030524 10246649 10179896
19039A0179896k11032k56612j13260q2073J47762j75020j58834j3734R6567K6575
19029I440235L29275M78112j26978k70586k24510j58480P6040O0450K13913L07492
19019A0124963j45185K9332J8239K35999k12065m4674M211j0109o58132k11004
19009I131575L40224J9735P679R4451l8098k85635j24708J46270J56147L80655
18999I828295Q2251j93273J87710L13867L03745j6866j67124L9031P0364N0843
18989A0498843k0841K02459L15493M17646K83487m9821j20391K14726J63173m6107
18979A1858667L5473j20997J17875J97723J94629l7654J58732r2804p8487M8573
18969A2281730M6341K22629P652k08303K93608J46176J5588O5597m9234l4874
$$ plain form
19039 10179896 9968864 9712252 9598992 9516919 9664681 9489661 9330827 9317093 9413660 9440235
19029 9440235 9769510 10247622 10120644 9850058 9625548 9467068 9543108 9603558 9817471 10124963
19019 10124963 9979778 10009110 10027349 10263348 10051283 10006609 10010820 10000711 9342579 9131575
19009 9131575 9471799 9491534 9499213 9593664 9555566 9269931 9145223 9291493 9447640 9828295
18999 9828295 9910546 9717273 9904983 10218850 10522595 10505729 10338605 10377636 10448000 10498843
18989 10498843 10478002 10680461 10995954 11413600 11697087 11647266 11526875 11741601 11904774 11858667
18979 11858667 11894140 11773143 11891018 12088741 12283370 12245716 12404448 12311644 12233157 12281730
18969 12281730 12328071 12550700 12558352 12350049 12643657 12789833 12805421 12871018 12821784 12786910
18959A2786910j24948M1487J70678L65884k10661P1234J42613R0363K70118P85643
18949A4389321O52930M59941M22178K94844L30231J89093Q49122J213750P89681
18940A9591091L95248L17533P55556J174274J006240Q17060J076732J108811O36459
18931B6879004P28547J102434R93214J380851J690130J528495J355280J725039
18923C7382994K526214K602779K681075L519426M187933M271810N006042N485362
18915F7663635N626827N277701N192884M926132M397402M347704L649272K923172
18907A04004729K395162J786141J301953L06475m88318j698523k778643l379163
18899A01449813m032190m075755l923404l688004l866422m103046l667954l135074
$$ plain form
18959 12786910 12661962 12703449 12874127 13240011 13029350 13100584 13243197 13333560 13603678 14389321
18949 14389321 15042251 15502192 15924370 16219214 16549445 16738538 17587660 18801410 19591091
18940 19591091 19986339 20303872 21059428 22233702 23239942 24057002 25133734 26242545 26879004
18931 26879004 27607551 28709985 29703199 31084050 32774180 34302675 35657955 37382994
18923 37382994 39909208 42511987 45193062 48712488 52900421 57172231 62178273 67663635
18915 67663635 73290462 78568163 83761047 88687179 93084581 97432285 101081557 104004729
18907 104004729 106399891 108186032 109487985 109794460 109306142 107607619 104828976 101449813
18899 101449813 97417623 93341868 89418464 85730460 81864038 77760992 74093038 70957964
18891G0957964l002376k297820j775465j298147j028192o50450J65766L91985
18883F1463265K40469N40130J037377J336924K020485K186876K885326L467954
18875G5178806L924675M143878M857982N059796N334037N319084N655178N616460
18867A15089896N765996N694936N701583N481341N028814L674260K919984K338316
18859A51695126N82939m70488j164589j838538k083487k672866l444046m348663
18851A36255388n208171n363292n975756o816560o478115o081675o061944n561757
18843H8708118n257734m972272m312284l998128l377943l093708k927064k325192
18835E8443793j958318j606588j077270q78410o83068k34640J10253L2891R47614
$$ plain form
18891 70957964 67955588 65657768 63882303 62584156 61555964 60905514 61071280 61463265
18883 61463265 61703734 62243864 63281241 64618165 66638650 68825526 71710852 75178806
18875 75178806 79103481 83247359 88105341 93165137 98499174 103818258 109473436 115089896
18867 115089896 120855892 126550828 132252411 137733752 142762566 146436826 149356810 151695126
18859 151695126 152278065 151807577 150642988 148804450 146720963 144048097 140604051 136255388
18851 136255388 131047217 125683925 119708169 112891609 106413494 100331819 94269875 88708118
18843 88708118 83450384 78478112 74165828 70167700 66789757 63696049 60768985 58443793
18835 58443793 56485475 54878887 53801617 52923207 52240139 52005499 52115752 52148643 53096257
18826E3096257J373087J592088J761851K412001K728758K623705K504142K548417
18818G0640306K915718K312999J694119J217780R86448J8923j33895k6152q09372
18809G8816874j793308k526695k800370l378177l729019l797154l818679m108640
18801E2864832l518141l125962k984715l248832k506707k255366k167338k019405
18793C1038366j279187j191416j407513j344083j272919j048607j100607q43600
18785B1550434o37492r17651p85304o92475o59146o73768o14794p06770o48325
18776A5214709l62120m13221o7849k19352o81223q13907m50460n60608j01403
18767A1544566M4092n37948o28581k48988n5341m9591p6883j37342P1377K5707
$$ plain form
18826 53096257 54469344 56061432 57823283 60235284 62964042 65587747 68091889 70640306
18818 70640306 73556024 75869023 77563142 78780922 79767370 79786293 79652398 79626246 78816874
18809 78816874 77023566 74496871 71696501 68318324 64589305 60792151 56973472 52864832
18801 52864832 49346691 46220729 43236014 39987182 37480475 35225109 33057771 31038366
18793 31038366 29759179 28567763 27160250 25816167 24543248 23494641 22394034 21550434
18785 21550434 20912942 19995291 19209987 18517512 17858366 17184598 16569804 15863034 15214709
18776 15214709 14852589 14439368 14371519 14152167 13470944 12657037 12206577 11645969 11544566
18767 11544566 11588658 11050710 10422129 10173141 10117800 10068209 9991326 9853984 9925361 9951068
18757I951068l42146k26693k47142m00915k2830k42846k56811k54971m64620r3931
18747G398163o1599J58673j59673J18793j55423l98880R5038J42931m03571l60678
18737F373774k58532J68206j81166n14357j655J20566J98862M4437K31427j84399
18727E997163J7547k62442j46998j88219m18378l3440L89505k18988k69278k47590
18717D618882J37382J72264m0155j52666l90771k47135K87008M7320J601r8852
18707D334878j09110n23190l95282K47799J25448m4263K24088k9651m19348k71355
18697C140014L96523M45671k83890m68608j56479m4287P7299J50811N3800j68732
18687C142122k65933N9449J19436O3133J7854J21098o0921K25038Q0805N0083
$$ plain form
18757 9951068 9608922 9382229 9135087 8734172 8711342 8468496 8211685 7956714 7492094 7398163
18747 7398163 7336564 7495237 7335564 7454357 7298934 6900054 6995092 7138023 6734452 6373774
18737 6373774 6115242 6283448 6102282 5587925 5586270 5706836 5905698 5950135 6181562 5997163
18727 5997163 6014710 5752268 5605270 5417051 4998673 4965233 5354738 5135750 4866472 4618882
18717 4618882 4756264 4928528 4888373 4735707 4344936 4097801 4384809 4432129 4433730 4334878
18707 4334878 4225768 3702578 3307296 3555095 3680543 3636280 3860368 3830717 3411369 3140014
18697 3140014 3536537 3982208 3698318 3229710 3073231 3028944 3106243 3257054 3310854 3142122
18687 3142122 2876189 2935638 3055074 3118207 3136061 3257159 3196238 3421276 3502081 3552164
18677C552164j80346l92518j26495k5177J36201P3254K24110J41837j07595k79197
18667C016238j89749k290J58140N18000J1841n1473J56549J94669k56339n25086
18657C030500l14598n5574L16471K04019N12375Q8895m85392m10929L9333o0149
18647B864951j42915J22153j1522k15433M6556j46427m620K13051l6571L57855
18637C047078K67045j28510k76766k63945j9636k21816j53310j10351Q9611K69733
18627B499133R3539L14742Q2675k31841k97J70872L2537N2915m7474k67194o2933
18616B636674m6965j03188n2897p2252K47343K91051j15740Q4385J14543j10352
18606B872602l49758R2261J73210q0878K61343j22674k12650j29371K82155J86960
$$ plain form
18677 3552164 3371818 2979300 2852805 2827628 2963829 3037083 3261193 3403030 3295435 3016238
18667 3016238 2826489 2824199 2982339 3500339 3512180 3460707 3617256 3811925 3555586 3030500
18657 3030500 2715902 2660328 2976799 3180818 3693193 3782088 3296696 2885767 2925100 2864951
18647 2864951 2722036 2844189 2832667 2617234 2663790 2517363 2512743 2725794 2689223 3047078
18637 3047078 3314123 3185613 2908847 2644902 2625266 2403450 2250140 2139789 2229400 2499133
18627 2499133 2592672 2907414 2990089 2758248 2757951 2928823 2961360 3014275 2966801 2699607 2636674
18616 2636674 2589709 2486521 2433624 2361372 2608715 2899766 2784026 2868411 2982954 2872602
18606 2872602 2522844 2615105 2788315 2707437 2968780 2846106 2633456 2504085 2786240 2973200
18596B973200q4458R5764K62342j365k52935K97774O0512l39537K47214J10618
18586C369129P1253M3537Q7595L62628K57591Q3149N268J90289K10972L06186
18576D987597L65043L38778L76744M05641K27034K53172L96718P29340M80858
18567H560925r0058K45330j42804j6963P5411j60594j67748M9321l74539m71925
18557G506356j06300l39379n61559n44140k76919k81022l92830l13291l23131
18548D367785L7385p2723r8962k60564J21697J3986j95783r6087m4816j89129
18538C582789l18479l64790J93086M40185K87714q9683L2167J73800J84122j47439
18528C973472l92329K34713L42709L40003L33739k1619o0305M1854Q4115K19866
$$ plain form
18596 2973200 2888742 2984506 3246848 3245483 2992548 3290322 3350834 3011297 3258511 3369129
18586 3369129 3440382 3483919 3571514 3934142 4191733 4274882 4280150 4470439 4681411 4987597
18576 4987597 5352640 5691418 6068162 6473803 6700837 6954009 7350727 8080067 8560925
18567 8560925 8470867 8716197 8573393 8556430 8631841 8471247 8303499 8352820 7978281 7506356
18557 7506356 7400056 7060677 6499118 5954978 5678059 5397037 5004207 4690916 4367785
18548 4367785 4405170 4332447 4233485 3972921 4094618 4108604 3912821 3816734 3771918 3582789
18538 3582789 3264310 2899520 3092606 3532791 3820505 3730822 3762989 3936789 4120911 3973472
18528 3973472 3581143 3815856 4158565 4498568 4832307 4810688 4750383 4792237 4876352 5096218
18518E096218P62052N24096N8384K97025K32565K58533k06650n92150l50599j84237
18508E895237N1577K46168O9688j79236m55185l67084m76933n38883k22940n9898
18498C962511j72627j51962j4705J02158K03818j79206j49577k03201o3401n1036
18488C282772o6559j69888o974M85549L8978J26994J82633P6874j19767r4615
18478C735997J36785k8450j56270k78600o7473Q078K24526l90134O2778j45556
18468C101681P4465k15096j06136q9214K66990Q2917j75480j29184r061r4225
18458B707657k01801K36945R9218R5520k73424l38899J2465K59968k27112j52551
18448B217986L08985j30814n44626k04039L50136K76254Q8786L89879K62671j48031
$$ plain form
18518 5096218 5858270 6382366 6440750 6737775 6970340 7228873 7022223 6430073 6079474 5895237
18508 5895237 5946814 6192982 6262670 6083434 5628249 5261165 4784232 4245349 4022409 3962511
18498 3962511 3789884 3637922 3623217 3725375 3929193 3749987 3600410 3397209 3333808 3282772
18488 3282772 3216213 3046325 3039351 3524900 3563878 3690872 3873505 3950379 3830612 3735997
18478 3735997 3872782 3844332 3688062 3409462 3341989 3350067 3574593 3184459 3247237 3101681
18468 3101681 3176146 2961050 2854914 2765700 3032690 3115607 2940127 2810943 2801882 2707657
18458 2707657 2505856 2742801 2842019 2937539 2664115 2325216 2337681 2597649 2370537 2217986
18448 2217986 2526971 2396157 1851531 1647492 1997628 2273882 2362668 2752547 3015218 2867187
18438B867187k31145j96428K49232J90553m4359j98885k24304k04875K6449J76488
18428B409913J17398J64974o3457k5593L5661K22482J10691k56694k40120L05362
18418B780617O5590p0427k96077M32439L55156j72790m260K63205K03580J00053
18408C657086q3026k2238m13088K63106K85673L7933q2200l36087L21107R6939
18398C725205K01519Q318K49879K09593J51916o9850J7200M81825L0753J88479
18388E194837K64551M2246k62025l27384j1008N9451m3795n7562j73774l77486
18378D308051l76548k58106J82963N66973L981m36399j66791R1565O411q0265
18368C841835k86053r3891J85338l039j13255R3092l4179J88290P2140q886m36475
$$ plain form
18438 2867187 2636042 2439614 2688846 2879399 2835040 2636155 2411851 2206976 2233425 2409913
18428 2409913 2527311 2692285 2628828 2603235 2638896 2861378 2972069 2715375 2475255 2780617
18418 2780617 2846207 2775780 2479703 2912142 3267298 3094508 3090248 3353453 3557033 3657086
18408 3657086 3574060 3551822 3138734 3401840 3687513 3725446 3643246 3307159 3628266 3725205
18398 3725205 3926724 3935042 4184921 4394514 4546430 4476580 4493780 4975605 5006358 5194837
18388 5194837 5459388 5501634 5239609 4912225 4901217 4960668 4916873 4859311 4685537 4308051
18378 4308051 3931503 3673397 3856360 4423333 4427314 3990915 3824124 3915689 3922100 3841835
18368 3841835 3555782 3461891 3647229 3644190 3530935 3624027 3589848 3778138 3850278 3841392 3404917
18357C404917K93271N16604K34050P3275K48543N23890L88242L51444K50735J3783
18347F298754Q2691N01162K99893n3422K01597K28148R7338k44798k58442J20919
18337G273840K78119j95645m95134l08663j59586L8481j98769l57150k63846j29641
18327E482006l4964j61130l07614l31175k79913Q8174q9205m42626j97220n5459
18317C670874M4897q9056j39239j67564k08374J67429M23901K6965o70422k95212
18307B764199L70406L26271J51078J94103j39846J10138K68748P782J45425j39284
18297D059020j71707K620L59116K67535n4574P1351l1117n0295o8504k550j32385
18286D248510r1296m3807J31214L9396j35227n37805j98191n1514J4245J1901
$$ plain form
18357 3404917 3698188 4214792 4448842 4522117 4770660 5294550 5682792 6034236 6284971 6298754
18347 6298754 6381445 6882607 7182500 7129078 7330675 7558823 7656161 7411363 7152921 7273840
18337 7273840 7551959 7356314 6861180 6552517 6392931 6431412 6232643 5875493 5611647 5482006
18327 5482006 5447042 5285912 4978298 4647123 4367210 4455384 4366179 3923553 3726333 3670874
18317 3670874 3715771 3626715 3487476 3319912 3111538 3278967 3702868 3729833 3059411 2764199
18307 2764199 3134605 3460876 3611954 3806057 3666211 3776349 4045097 4052879 4198304 4059020
18297 4059020 3887313 3889933 4249049 4516584 4462010 4533361 4502244 4451949 4383445 4380895 4248510
18286 4248510 4157214 4113407 4244621 4284017 4148790 3610985 3412794 3361280 3375525 3387426
18276C387426j48490J88073K5182m01340j31010n41745j91774J97013J00257M5423
18266B529015K46J33855J52238N4641r1284j98755l82196k02328Q4928P8410J18791
18255B277561k1611Q5310k2408P3813K7025l64126m62656o420J06358P7970j50335
18244A620481K9445O7492l5965N4512N4808q0967M0257j44573k97271l21097J33121
18233A120243K02719N92765Q8577O0079P5313L9835k77550o9084P727j28404k25454
18222A486766K88979J28045k4898k45271M8686n16156L0220p0632k9398J44454
18212A240795L28572L3677l3000j04144k33152j03260K08619M21365R7175j1172
18202A845475o8610J55300K66901J03894l20416k95177j08645j08079K3052M34587
$$ plain form
18276 3387426 3238936 3427009 3452191 3050851 2919841 2378096 2186322 2383335 2483592 2529015
18266 2529015 2529261 2663116 2815354 2869995 2778711 2579956 2197760 1995432 2080360 2158770 2277561
18255 2277561 2255950 2341260 2318852 2392665 2419690 2055564 1592908 1586488 1692846 1770816 1620481
18244 1620481 1649926 1717418 1681453 1735965 1790773 1709806 1750063 1605490 1308219 987122 1120243
18233 1120243 1322962 1915727 2004304 2064383 2139696 2179531 1901981 1832897 1840624 1712220 1486766
18222 1486766 1775745 1903790 1878892 1633621 1682307 1166151 1196371 1125739 1096341 1240795
18212 1240795 1569367 1603044 1570044 1465900 1232748 1129488 1338107 1759472 1856647 1845475
18202 1845475 1776865 1932165 2199066 2302960 1982544 1687367 1578722 1470643 1493695 1928282
18192A928282k7667m54049P5998M77480J66004j56673J01363J41914M5526m92724
18182A805454m30693j85059J99642L00344j06978l14984l02217K65362L06538
18173A537409L34004R3208j0433l4497j9868K35483l54564m63787n75331j3814
18163G27810M22516L67491L0055k39230j64020l0447J02917J19454L32581R6989
18153A766116n3678l26118j69748L08428L04067J43242j14185m02704J79675K80715
18143A915810k44514k35827L2846o0556k62126o2924N73432K94183j83222j24777
18133A642325J62193J72925m346j67168Q8418L67943R9232l66149p1508O3477
18123A987342L6369j04283N8800j21247J8650m21990q2456j37810K68159l26416
$$ plain form
18192 1928282 1900615 1446566 1522564 2000044 2166048 2009375 2110738 2252652 2298178 1805454
18182 1805454 1374761 1189702 1389344 1689688 1582710 1267726 965509 1230871 1537409
18173 1537409 1871413 1964621 1954188 1919691 1899823 2135306 1780742 1316955 741624 727810
18163 727810 1150326 1517817 1547872 1308642 1144622 1114175 1217092 1336546 1669127 1766116
18153 1766116 1712438 1386320 1216572 1525000 1829067 1972309 1858124 1455420 1635095 1915810
18143 1915810 1671296 1435469 1468315 1407759 1145633 1082709 1656141 1950324 1767102 1642325
18133 1642325 1804518 1977443 1973097 1805929 1894347 2262290 2361522 1995373 1923865 1987342
18123 1987342 2023711 1919428 1978228 1856981 1875631 1453641 1371185 1233375 1501534 1175118
18113A175118N9378K4047m14078N0908J27188j07354M41640J11377J62536J05805
18103A736565j47012k43481k50164K5007j50868m56288R4955L23557j16511j88879
18093F26881J22113J81819M71257M51166n0196o3923k73322M38889L1320l15458
18083A620546j7435k74849J34275j85898j82199k6009j01000K38274K5964l13024
18073I18645M42906O523j715j91064j22590K34057K17541j89116j96458N5108
18063A173837J04884O2508Q4765P2575j8269j02022L11085j42233m29400N5470
18053A173200k43659l03521J74102J97170k05782k99291M76434K17452J74870
18044A360975Q2496j10699o9338m50219p3623O46337R0527P378k59890l44147
$$ plain form
18113 1175118 1234496 1258543 844465 895373 1022561 915207 1356847 1468224 1630760 1736565
18103 1736565 1589553 1346072 1095908 1120915 970047 513759 608714 932271 815760 626881
18093 626881 748994 930813 1402070 1853236 1803040 1739117 1465795 1904684 1936004 1620546
18083 1620546 1603111 1328262 1462537 1276639 1094440 1068431 967431 1205705 1231669 918645
18073 918645 1361551 1368074 1366359 1175295 1052705 1286762 1504303 1315187 1118729 1173837
18063 1173837 1278721 1341229 1425994 1498569 1480300 1378278 1689363 1547130 1117730 1173200
18053 1173200 929541 626020 800122 997292 791510 492219 968653 1186105 1360975
18044 1360975 1443471 1332772 1263434 813215 739592 1385929 1476456 1483834 1223944 879797
18034H79797M9858R6580o7732J45829K37705K6699l10248K6543K91311l18011
18024A058331k21443k15070J23427L83226M57072j12555k5104j34540n3793J19552
18014A379103p2917j19907n5012J50910q0136l01706j30589N5884p6973J10693
18004H59350Q9443l1405K7663q9279k35721K10071K45945K95712n12991j98328
17994F60460K16751L4475j17892m1125J87178K8358j83467J06392J53453k80956
17984G63627L68987K07642j6422K42232j99095j86377l79218j31468R4793j39104
17974F25597J69998K97081J66679p2080O146j49711j8604O7070j74734q6507P7500
17963I08435K25327n2816J71196j80278m81767k08021L52953O5453j83601M7174
$$ plain form
18034 879797 929655 1026235 958503 1104332 1342037 1368736 1058488 1085031 1376342 1058331
18024 1058331 836888 621818 745245 1128471 1585543 1472988 1447884 1313344 1259551 1379103
18014 1379103 1306186 1186279 1131267 1282177 1202041 900335 769746 825630 748657 859350
18004 859350 948793 917388 945051 855772 620051 830122 1076067 1371779 858788 660460
17994 660460 877211 911686 793794 752669 939847 968205 784738 891130 1044583 763627
17984 763627 1132614 1340256 1323834 1566066 1366971 1180594 801376 669908 764701 625597
17974 625597 795595 1092676 1259355 1187275 1193421 1043710 1025106 1092176 917442 830935 908435
17963 908435 1133762 1080946 1252142 1071864 590097 382076 735029 800482 616881 664055
17953F64055J2189K73255J70717L485Q4962m9902K8213R0832k75918j96975K47330
17942A052243L17894k56248j53353K39004j11125K97819J40209K27860K89604
17933B043907j45706l10445l88038n18531o6474R8513J0832l95985k39028P9036
17923A68081L1578K94615L50639R2921J77336J62074P944R774k53962m905K32208
17912A268303J71730k40435k17096n8141R5874m0005k3220L14512P3400j74381
17902A170541k21959R3094q0198l26538L95449M16378Q2022r9585k06864k14036
17892A008304J2080o4210k52256j79703P0307j46735q2084K9256j86676j3109
17882A95174N01338J30300k42924k23994J08764K83744O0976p4579M127N9812
$$ plain form
17953 664055 676244 949499 1120216 1123701 1208663 1158761 1186974 1277806 1001888 804913 1052243
17942 1052243 1370137 1113889 960536 1199540 1088415 1386234 1526443 1754303 2043907
17933 2043907 1898201 1587756 1199718 681187 614713 713226 724058 328073 89045 168081
17923 168081 199659 494274 844913 937834 1115170 1277244 1285188 1294962 1041000 1036095 1268303
17912 1268303 1440033 1199598 982502 924361 1020235 980230 957010 1271522 1344922 1170541
17902 1170541 948582 1041676 961478 634940 1030389 1446767 1528789 1429204 1222340 1008304
17892 1008304 1020384 956174 703918 524215 594522 447787 365703 394959 208283 195174
17882 195174 696512 826812 583888 359894 468658 752402 813378 738799 742926 802738
17872H02738L53061L6720o5915k43j80897J74518j16678J56961J50605O4917K87568
17861A663355k46256k76380l0217j01427Q8227K94168j42173k48922l09752j01357
17851E89266o0597n0795J31810J16646o6633K3189K22832K93286j34714j68064
17841H96226j13258n8901j57421O1370J13322j09657Q0727J41912m0276K93371
17831A107415J16837j21913m87499R0886q2377p2559L96083K24792j0712j09599
17821A051354o3824K28934J90691J83241K21290k57836k47149j88963O7332q2818
17811A102252l61280j90724K25498J00140K08514k8630l80839m8013M073o3045
17801E67946k2378K58124K15312M0366j67781q8337j33966R9984J27779k18728
$$ plain form
17872 802738 1155799 1192519 1126604 1126361 945464 1119982 1003304 1160265 1310870 1375787 1663355
17861 1663355 1417099 1140719 1110502 1009075 1097302 1391470 1249297 1000375 690623 589266
17851 589266 528669 477874 609684 726330 659697 682886 905718 1199004 1064290 896226
17841 896226 782968 724067 566646 628016 741338 631681 712408 854320 814044 1107415
17831 1107415 1224252 1102339 614840 705726 623349 550790 946873 1171665 1160953 1051354
17821 1051354 987530 1216464 1407155 1590396 1811686 1553850 1306701 1117738 1185070 1102252
17811 1102252 740972 550248 775746 875886 1084400 1055770 674931 626918 630991 567946
17801 567946 545568 803692 1019004 1059370 891589 803252 669286 769270 897049 678321
17791F78321j01757K30750L9747L670k43867n8876R5499j04131m6281O5939K94688
17780H53702K01478j05244q5421m5379k78117k30052K47815M38052J33030J33362
17770A263226L4912k85057l82211l39840j92325J12581J57988J75119Q201K23080
17760G75674P2426j87522m9096l5657r8591Q5580K59248J65299P4729n69583k90219
17749B02288K7605K4741M51291k5184J04091j83795J29607J82910K25730K00368
17739A339652k63511j80389k05794j63153J52080K1280L69966n5589m34242j26404
17729D53896K88021k46618J33409L05683J56565K4986j16113n21614R582J38297
17719F26094N8054K04387k32982Q123j07623p5713L87338l662J9110l6599k63412
$$ plain form
17791 678321 576564 807314 847061 850731 606864 547988 643487 539356 493075 559014 853702
17780 853702 1055180 949936 864515 819136 541019 310967 558782 996834 1129864 1263226
17770 1263226 1298138 1013081 630870 291030 98705 211286 369274 544393 552594 775674
17760 775674 848100 660578 611482 575825 477234 562814 822062 987361 1062090 492507 202288
17749 202288 229893 254634 705925 680741 784832 601037 730644 913554 1139284 1339652
17739 1339652 1076141 895752 689958 526805 678885 700165 1070131 1014542 580300 453896
17729 453896 741917 495299 628708 934391 1090956 1115942 999829 478215 487797 626094
17719 626094 684148 888535 655553 663676 556053 480340 867678 864016 883126 846527 583115
17708E83115R0000O6515J09464J59756k89671n9297M5206O3412J66985l6224Q1762
17697I81023L90631M27103m17160p0559l5501n0303P4428j75060q8934K37822
17687A273490p112j17215k17437k55452j95386o011Q6893J53505R4609J17014
17677I26898L20640J28135N0468q5242l47803j22809m0094J59796J39894J70362
17667A300245j38920j40592m08211j52319K52961J24437J99075j89372R3942K82730
17657A223976m32607k60111n1882j11381j3919J52666M13454K56263l59091k50180
17647E67188K05656P6615L05178J20340j0256J07515k98324k60287J1617p2719
17637G52523m6854Q5601K01426j34239k18126q8808J22551j25597K19239o7139
$$ plain form
17708 583115 673115 739630 849094 1008850 719179 659882 705088 768500 935485 899261 981023
17697 981023 1371654 1798757 1381597 1311038 1275537 1225234 1299662 1124602 1035668 1273490
17687 1273490 1266378 1149163 931726 676274 480888 474877 561770 715275 809884 926898
17677 926898 1247538 1375673 1426141 1340899 993096 870287 830193 989989 1129883 1300245
17667 1300245 1161325 1020733 612522 460203 713164 837601 1036676 847304 941246 1223976
17657 1223976 791369 531258 479376 367995 354076 506742 920196 1176459 817368 567188
17647 567188 772844 849459 1154637 1274977 1264721 1372236 1073912 813625 825242 752523
17637 752523 705669 791270 992696 858457 640331 551523 674074 548477 767716 700577
17627G00577J48556k60510k44304K64687N07O5352J64520R5667L42157R6355j33184
17616A240380P6581O241l7018k00574k67496j20215M72443N6161L0900n3182M03604
17605A607825J09653j40110j69298k62589n08332k06829j91416Q5041L19231L5186
17595F78362j52325P362J37733j49181j2831J30589l5649k82153J99599K98058
17585H19564J66476k17789n39996J21885K26342L05365M6583r5951O0903J02985
17575I96367m9695q2667O8452j99953O6654k10939J69059M14598j14939m2347
17565A014590J12466o7778P4927J82291l1126m37859j36265J66553J28394J51016
17555A157209r8448r7645j39999k76390j35284K09025q3520k92899j18416K14934
$$ plain form
17627 700577 849133 588623 344319 609006 609513 674865 839385 935052 1277209 1373564 1240380
17616 1240380 1316961 1323202 1286184 1085610 818114 697899 1170342 1226503 1257403 1204221 1607825
17605 1607825 1717478 1577368 1408070 1145481 637149 430320 238904 323945 643176 678362
17595 678362 526037 533399 671132 521951 509120 639709 604060 321907 521506 819564
17585 819564 986040 768251 228255 350140 576482 881847 928430 832479 893382 996367
17575 996367 946672 864005 932457 732504 799158 588219 757278 1171876 1056937 1014590
17565 1014590 1127056 1059278 1134205 1316496 1285370 847511 711246 877799 1006193 1157209
17555 1157209 1058761 961116 821117 544727 409443 618468 534948 242049 123633 338567
17545C38567K75151Q1395j01936M001m1759M7375q1714n2103k01808J84811Q6575
17534E38555M11301J76285l33415J17199L32301J17653q8786J94926m28966m25774
17524F11279j58155Q9599K15770j02332l10359k53784L38735O2005l0366j1684
17514D50708m2762j43339J53215J82636J0461J15498r0675m2788K65766k2669
17504H36051m193j60563k29156O4685L13296K29491J41716l989Q8482p6096l32852
17493H66872l30216r9601J04217J35582k69571J23347K17882N0779R9305l1022
17483H67574r1860q04p8577k18336j44749j35483P790l3017P9810O8982J26079
17472D47409M55698j50668l26408j03900m4700j55977J3806J25598J87660Q2719
$$ plain form
17545 338567 613718 695113 593177 597178 555419 602794 521080 468977 267169 451980 538555
17534 538555 949856 1126141 792726 909925 1242226 1359879 1271093 1466019 1037053 611279
17524 611279 453124 542723 758493 656161 345802 92018 430753 492758 462392 450708
17514 450708 407946 264607 417822 600458 610919 726417 635742 592954 858720 836051
17504 836051 831858 671295 442139 506824 820120 1049611 1191327 1187338 1275820 1199724 866872
17493 866872 536656 437055 541272 676854 407283 530630 748512 799291 898596 867574
17483 867574 775714 774910 696333 477997 333248 197765 205555 172538 252348 321330 447409
17472 447409 903107 752439 426031 322131 277431 121454 135260 260858 448518 531237
17462E31237m6250N2017k55679J09001o4018J70131K14795k05780k7147j56593
17452C21714M3019L04738J33666M1082n7673l7453N7973k29878k79915j33178
17442A64095k25539M9239K12960o041J22449J56951J46884p5683j83430j84694
17432A77191r697O1693O3440k9800L9013K67262l3073k16518k17266Q7168M05821
17421E95234J21448m7856J91025O1559n515r8101p0800j68007O1709K28224j00268
17410G68652o8163l23762k05390K4717N1037J19750J47612k9884J8413j70628
17400C32354m07576J0248j09172K47499K35152q7589K39620j91633j53288K05055
17390C20670P8033J62520Q3931k56066J03046m15400k90933N22441q4142j2241
$$ plain form
17462 531237 484987 537004 281325 390326 326308 496439 711234 505454 478307 321714
17452 321714 364733 669471 803137 844219 786546 749093 807066 577188 297273 164095
17442 164095 -61444 -12205 200755 194714 317163 474114 620998 545315 361885 177191
17432 177191 167494 229187 292627 262827 301840 569102 536029 319511 102245 189413 595234
17421 595234 716682 668826 859851 921410 915895 817794 746994 578987 640696 868920 768652
17410 768652 700489 376727 171337 196054 247091 366841 514453 484569 502982 332354
17400 332354 -75222 -64974 -174146 73353 308505 220916 460536 268903 115615 320670
17390 320670 398703 561223 645154 389088 492134 76734 -214199 308242 224100 211859
17380B11859l0016k67411J02196K10867J25720K6839O5690K3156K669j09799k0832
17369C40938J27241J50547k1783J37181N2236l52127J1516J78127R228J61399
17359G94503r2817k23743Q355m7632k27994J91503L12105j48586J72305K05761
17349I43760j82802k31531j46794k61292o0796J37990m5783m4038K87299L85281
17339G81294m818j70979o4373j16592l27555j36873j94808L30002M57567n4368
17329D98497K70317J07585K3671m2336J38167r5096n44767k37273L01204J85056
17319F05025K37439Q6046k78135k73824K59132j40469m486K12298Q4383j86180
17309F01229m18642j25463K34501L02534Q6882J7652k04704j58p3139n6815K17704
$$ plain form
17380 211859 181843 -85568 16628 227495 353215 380054 445744 468900 471569 361770 340938
17369 340938 468179 618726 596943 734124 786360 434233 445749 623876 633104 794503
17359 794503 701686 477943 486298 438666 210672 402175 714280 565694 737999 943760
17349 943760 760958 529427 382633 121341 60545 198535 152752 108714 396013 781294
17339 781294 776476 605497 541124 424532 96977 -39896 -234704 95298 552865 498497
17329 498497 768814 876399 900070 857734 995901 900805 356038 118765 419969 605025
17319 605025 842464 928510 650375 376551 635683 495214 490728 703026 787409 601229
17309 601229 182587 57124 291625 594159 681041 698693 493989 493831 420692 363877 581581
17298E81581j70515j74531L65144M206p6524q1500m7242J75743K27016l18474
17288D84904j8781J77887p2717j18542o2085q2856K03353J7079j77969j7797L4354
17277C66830j22967o0147K42671J17836J81323J10528l79123j02424J53832K54302
17267G62661k03435n9732K71000j4245L96903J52920M9405l05524m0207k6786
17257I82960j75720k87984j28002j67635L25971l07085j62498K65370L35351j11365
17247E69363k17394q6302m0581K36859k44091j16835R8059L22577K78758O6195
17237H66608P0161p9826m0044L1336R3977j48816j5933K18752J00747l98575o30245
17226F8142r829K1873J1304K08476l9394n3402l14939j89221J25334K00994l7404
$$ plain form
17298 581581 411066 236535 601679 605885 529361 447861 400619 576362 803378 484904
17288 484904 466123 644010 571293 452751 390666 307810 511163 528242 350273 332476 366830
17277 366830 243863 183716 426387 544223 725546 836074 456951 354527 508359 762661
17267 762661 559226 499494 770494 756249 1153152 1306072 1355477 1049953 1009746 982960
17257 982960 807240 519256 391254 223619 549590 242505 80007 345377 680728 569363
17247 569363 351969 265667 225086 461945 217854 101019 199078 521655 800413 866608
17237 866608 936769 856943 816899 848235 942212 793396 777463 996215 1096962 698387 68142
17226 68142 58313 80186 91490 299966 260572 207170 -107769 -296990 -171656 29338 -8066
17215h066k05568K90692L17505l4610j10941R8219o4476Q3071O8494q4737j18381
17204B31202k2022J67484J39208J257j75238J98023J20962j14085N1975J14140
17194G12906N0445m31355J29617l2488p7064k91949R564M11470M37641p356j03617
17183H07814k09503K95029j01247l868q8498j44489J9483R3223J8541j40738p0190
17172D75557J17708R9245N7742j09055J73757J24733j90803j85554o4678N3492
17162E52144j39338m16366j27402K16270L45312M8069j74093j24952J65904j68858
17152A76690k39448K03523M37724l85127J38713k4092K61780K40790p6443m96696
17142B37414j05189L13813q1355J60438M9021r4215k8840m9101j78247m15916
$$ plain form
17215 -8066 -213634 77058 394563 359953 249012 347231 282755 365826 434320 349583 231202
17204 231202 209180 376664 515872 517129 341891 539914 660876 546791 598766 712906
17194 712906 763351 331996 461613 429125 352061 60112 69676 481146 918787 911431 807814
17183 807814 598311 893340 792093 788225 699727 555238 574721 667944 686485 545747 475557
17172 475557 593265 692510 750252 641197 814954 939687 748884 563330 498652 552144
17162 552144 412806 -3560 -130962 85308 430620 478689 304596 179644 345548 176690
17152 176690 -62758 140765 578489 193362 332075 307983 569763 810553 734110 237414
17142 237414 132225 446038 364683 525121 574142 479927 451087 401986 223739 -192177
17132a92177M986J65071J34507M40588L01105M1839L19964j33823j97600l81149
17122E03311j46701J81777Q6736J53517J97647K9800k68887l93037k3422P1087
17112C91828J7442j84300q1207K29601J30141N0841N3974l9531O3090J34769Q6769
17101H53417j69024k7127j27200k84002m16382P9458N273r6887p6842j49217N6558
17090c51975K35547J11832R8451R0865J10571J34555j44384l85571r6220L51650
17080A55321J85051M4667j23335j41437l8362k66405M8719J07373J57609J47257
17070B76458M62417j9275l98612l51589j05020j00705K29936N57542p2794n258
17060D73100L5857j35482k83366J11082M06019M10731j24488q57679j9396J80932
$$ plain form
17132 -192177 -187191 -22120 112387 552975 854080 895919 1215883 1082060 884460 503311
17122 503311 356610 538387 625123 778640 976287 1006087 737200 344163 320741 391828
17112 391828 409270 224970 143763 373364 503505 554346 608320 568789 631879 766648 853417
17101 853417 684393 657266 530066 246064 -170318 -90860 -85587 -182474 -259316 -408533 -351975
17090 -351975 -116428 -4596 93855 184720 295291 429846 285462 -100109 -196329 155321
17080 155321 340372 385039 261704 120267 81905 -184500 -135781 -28408 129201 276458
17070 276458 738875 719600 320988 -30601 -135621 -236326 -6390 551152 478358 473100
17060 473100 508957 373475 90109 201191 607210 1017941 893453 35774 16378 197310
17050A97310J50023P0548M7380K92313k04283k18961J03750O5359K28208k4664
17040G06983l68673k17603j11679l0523j24562J12325J81341o23826l551K16412
17030b63356K39476L9286J76133k823M104J8537L5757J73584m84112J36852J03014
17019A76452r2113k4054J74257R4465J30142l29478j94771L16914R8135o8201
17009B81748k46581L08304J33242j19907j8596Q2069J18524R2351l75695p8865
16999A76594k02373O1289M56656m0295p1278j23054Q1253j03144k43381r0495
16989i8228K99509O04621L35015k8999K18482n04990j94821j55142j96219O2061
16979C41289o2009k28108N6305Q5096K10897J3544J7655J34087k49987j1596j90518
$$ plain form
17050 197310 347333 417881 465261 757574 553291 334330 438080 503439 731647 706983
17040 706983 338310 120707 9028 -21495 -146057 -33732 147609 -476217 -479768 -263356
17030 -263356 -23880 15406 191539 188716 192820 211357 247114 420698 -63414 73438 176452
17019 176452 84339 60285 234542 329007 459149 129671 -65100 251814 349949 281748
17009 281748 35167 343471 476713 356806 338210 420279 538803 631154 255459 176594
16999 176594 -25779 35510 492166 451871 380593 257539 338792 235648 -7733 -98228
16989 -98228 201281 805902 1140917 1111918 1330400 825410 630589 475447 279228 341289
16979 341289 279280 51172 107477 192573 403470 417014 434669 568756 318769 307173 116655
16968A16655p0928M74160N5341r3331Q5482J10035o1275k33513J67925P9869p0672
16957E59748J93416q6571N114M1173J279j03596j15504J32588N7833j68535J52672
16946F69617j84331k79961J86310j63271k69270P7851J36585K93303K95576J5389
16936G77798k66538j17451R1797m9788j05787p4167k10787K35400j09918m32960
16926b62401J81832P03522L90307k39912Q517j80150n40112r4333L15048m2163
16916B40155j2524J37510k29225M1442k10789r4599K43664r5725N6997n3409j81411
16905a57914j21555K66940j15775J50956J55034j22563j41993r8565M06341j55071
16895F5835k79321L5620k48512l6177L83978J12867J09827j51248R7229M6429
$$ plain form
16968 116655 45727 519887 575228 481897 567379 677414 616139 382626 550551 630420 559748
16957 559748 753164 666593 671707 712880 714159 610563 495059 627647 685480 516945 669617
16946 669617 485286 205325 391635 228364 -40906 36945 173530 466833 762409 777798
16936 777798 511260 393809 485606 435818 330031 255864 45077 280477 170559 -262401
16926 -262401 -80569 622953 1013260 773348 781865 601715 61603 -32730 282318 240155
16916 240155 227631 365141 135916 177358 -33431 -128030 115634 19909 76906 23497 -157914
16905 -157914 -279469 -12529 -128304 22652 177686 55123 -86870 -185435 220906 65835
16895 65835 -213486 -177866 -426378 -462555 -78577 34290 144117 -7131 90098 136527
16885A36527k69021K43702K38834n1217J40482K90010L88996l05800o86908k73061
16875a47456J44096K49381R868J11330Q2956j69570Q2665j23090m09781j55836
16865c25437J41155K89472K36596M6776J91488j15224r1684J9314L3782k00523
16855B25715J85206Q9814j66025j25380m17247k42506L95045M01477j66144m17666
16845b37711l23747J04510M59023j28781l09921J48243K97285j08167k98436L0658
16835c67044L43146Q5410j4189K56069j31960R4404R6593J78437o4284l62525
16825A14057R0554K42503K7760M1796j44612j73420j18563j72879J18529q4201
16815e8476J78456K95814n9249j76937J11386q6392R0150p7727k84861k10219
$$ plain form
16885 136527 -132494 111208 350042 298825 439307 729317 1118313 812513 125605 -147456
16875 -147456 -3360 246021 255889 367219 450175 280605 363270 240180 -169601 -325437
16865 -325437 -184282 105190 341786 388562 580050 464826 373142 392456 426238 225715
16855 225715 410921 500735 334710 209330 -207917 -450423 -55378 346099 179955 -237711
16845 -237711 -561458 -456948 2075 -126706 -436627 -288384 8901 -99266 -397702 -367044
16835 -367044 -23898 61512 47323 303392 171432 265836 362429 540866 476582 114057
16825 114057 204611 447114 474874 516670 372058 198638 80075 -92804 25725 -58476
16815 -58476 119980 415794 356545 179608 290994 204602 294752 217025 -67836 -278055
16805b78055K59085O9139q9037J4741m3219J18383L00722K45345j78975J62934
16795E81063j70656j63225J18446j01871j9082j24936O1130R9462J82045l07577
16785A54799m75924J30722K84658j1511J76935K75721j1508l5655j60304j32385
16775A95548K1421J24563p2496J6150J85304j80039q1328P7355J59900j9174J50452
16764E77656j3852m84131k29890J21553L45749m6468j35558J03171K18651M4407
16754E01288l02225j63706l3146r5072k5797L49461J11575k22160k3768J5861
16744A12311j11205k70786K29449L05629O8613k65835R480j08886J18330J86163
16734B73263J25107p2266j4552R6571n4270J66499K04385k69289m3856q5698j52625
$$ plain form
16805 -278055 -18970 50169 -38868 -24127 -67346 51037 351759 597104 418129 581063
16795 581063 410407 247182 365628 263757 244675 119739 180869 280331 462376 154799
16785 154799 -321125 -190403 94255 82744 259679 535400 523892 488237 327933 195548
16775 195548 216969 341532 269036 285186 470490 290451 209123 286478 446378 427204 577656
16764 577656 563804 79673 -150217 -28664 317085 270617 135059 238230 456881 501288
16754 501288 199063 35357 2211 -92861 -118658 230803 342378 120218 96450 112311
16744 112311 1106 -269680 -40231 265398 334011 68176 77656 -31230 87100 273263
16734 273263 398370 326104 311552 408123 353853 520352 724737 455448 411592 325894 173269
16723A73269k09728n1005K75784K05198P6919J35997j11968l02441q2482j46076
16713c6533k4819J15737K82175Q0778J50298o0128P9514l80374j44153j47936
16703h5441O630n0805L03582J26524o752l14445l74981L3728L9880J78051j08240
16692b52269K75592n81j50332p8442K10972j4876l00379J48303p6710k28837O2250
16681d05309K69781K01938l73270J22801J12438J81570J3024L6949R7374j99152
16671E8144R3098m7824K7443n0512k47675j43595n651J44425K41460j4976J01253
16660A55590j00376j12530K20048J31541J18602j03468j66589O6709j58701N1514
16650A02340K47093K49220r9712o48505j48444L05907J91063J03532o1468j75460
$$ plain form
16723 173269 -36459 -87464 188320 393518 470437 606434 494466 192025 109543 -36533
16713 -36533 -61352 54385 336560 417338 567636 507508 587022 206648 62495 -85441
16703 -85441 -78811 -129616 173966 300490 293738 -20707 -395688 -361960 -322080 -144029 -252269
16692 -252269 23323 22742 -127590 -206032 4940 -9936 -310315 -162012 -238722 -467559 -405309
16681 -405309 -135528 66410 -306860 -184059 -71621 109949 122973 159922 257296 58144
16671 58144 151242 103418 130861 80349 -167326 -310921 -316572 -172147 69313 54337 155590
16660 155590 55214 -57316 162732 294273 412875 309407 142818 209527 50826 102340
16650 102340 349433 598653 498941 -149564 -298008 7899 198962 302494 241026 65566
16640F5566k39469j14335J76671N9033N7254l3357k6410K06806M3282K53139J37057
16629E85237j96613m3424M8198j14624k77929J30088K35479Q7837K25095l5889
16619F43455J6890R8431N0890k68321k77251l88030K09656K15557k09605J27937
16609B19609L01468M3385m2957J52633L1530k33676j26531l49172l12094j73830
16599d89635L41621K06216J95500j22538j3377K31379l50858l63534L16739J29735
16589H1248K1525o1940r7496l84869L40472K18472K39874K44977l23367k99590
16579b0694P6437J8725k05716l85114l3592P17211L21812K02375j21045m00864
16569A69535P5534P9146K06831K24531n3424j55955j07910l93892o7445J51673
$$ plain form
16640 65566 -173903 -288238 -111567 -52534 4720 -28637 -55047 151759 195041 448180 585237
16629 585237 388624 345200 393398 278774 845 130933 366412 454249 679344 643455
16619 643455 660345 758776 809666 541345 264094 -123936 85720 301277 91672 219609
16609 219609 521077 564462 521505 674138 705668 471992 345461 -3711 -315805 -489635
16599 -489635 -148014 58202 253702 131164 117787 349166 -1692 -365226 -48487 81248
16589 81248 102773 40833 -56663 -441532 -101060 117412 357286 602263 278896 -20694
16579 -20694 55743 74468 -131248 -516362 -549954 167257 489069 691444 570399 169535
16569 169535 245069 324215 531046 755577 702153 546198 438288 44396 -23049 128624
16559A28624L17860k07556k63583k50304J95191M65984l05418J73539K81029q3699
16549D51667k11283j92342l6476K78928j27303j68111K08652j60382q94j18382
16539g5926j34863j40503l263O7069J32976J19509L23922j0938m16254n86370
16529g24641J7505Q3184k6267J67206M71052n7985M0537P4327J82895K32789j66004
16518B94598k8897k43564r8239L57633K41681L0806k32824j76941k28690K42963
16508A58526j42255l87538l18800N3936k314J27850K87190K98073K29058J83535
16498D87261O8657j65636n17071l9249J97498M65434j94586n5319k04633j94589
16488a52233l9623L000M4391K56732K97664l3439k82689j35576K15946J28563
$$ plain form
16559 128624 446484 238928 -24655 -274959 -79768 386216 80798 254337 535366 451667
16549 451667 240384 48042 11566 290494 163191 -4920 203732 43350 42456 -75926
16539 -75926 -210789 -351292 -354555 -287486 -154510 -35001 288921 277983 -138271 -724641
16529 -724641 -707136 -623952 -650219 -483013 -11961 -69946 -29409 44918 227813 460602 294598
16518 294598 265701 22137 -76102 281531 523212 554018 321194 144253 -84437 158526
16508 158526 16271 -371267 -690067 -636131 -638445 -510595 -223405 74668 303726 487261
16498 487261 555918 390282 -126789 -166038 31460 496894 302308 246989 42356 -152233
16488 -152233 -191856 -188856 -144465 112267 409931 376492 93803 -41773 174173 302736
16478C02736k83153j70395l852j5610J61494L06581K819m0840J10660L9986k15993
16467A94433k0031r6221J3666L89090n4193n9253k20462l88109J46343j1547J24671
16456A8387K56151J37071p9624J56411m13732k35953K02736J58536k78668l5526
16446a14211J72795j4135j76837j08752P2003J1006n1654k09596K65564N7572
16436i6245R7693L49934K74563J87794j3666k64926k06012l8507J07393J39256
16426E37277q1324k48003K787M5837J6426o816K0877J21961o2802l7528p8572
16415B30120q5484k08671P3249J27385j45362K08560j7848n0902j3998Q130K29424
16404C54603p7669j75317P4092M01179L2247k61227j06121J40687L0194l55899
$$ plain form
16478 302736 19583 -150812 -154664 -170274 -8780 297801 300620 259780 370440 410426 194433
16467 194433 174402 78181 91847 480937 426744 367491 147029 -241080 -94737 -106284 18387
16456 18387 274538 411609 331985 488396 74664 -161289 41447 199983 -78685 -114211
16446 -114211 58584 44449 -132388 -241140 -169137 -158131 -209785 -419381 -153817 -96245
16436 -96245 1448 351382 625945 813739 800073 535147 329135 290628 398021 537277
16426 537277 455953 207950 210737 256574 273000 266184 287061 409022 346220 308692 230120
16415 230120 144636 -64035 9214 136599 -8763 199797 181949 131047 117049 125179 354603
16404 354603 276934 101617 175709 576888 609135 347908 241787 382474 412668 56769
16394E6769q3879O1439K23927J03009P5369p9925k48310j99703j93355n2177J38138
16383a98698K47959j48165J95100J90021k14766J36037N03169L2657j87982j71276
16373C84056l75602J12172K16802J07859j64348j41999J27602L82621p2877q6204
16363D90082k28612N93j17646j34197J05411j19642k33796m73721m5062L93678
16353c62912L08186k6630k86818j65833J38902K58088K19735K12589R0412j90013
16343A95706k40296j02210j09136K38741m3214J06901L45838o4732K85491K22605
16333H35694k10365Q7670K16492k87026l39677k45265j19973k9000j3091L5914
16323f8627k44397l1184k68497o8407K38056J83753q5245m51660L10439M95793
$$ plain form
16394 56769 -27110 34329 258256 361265 436634 356709 108399 -91304 -284659 -336836 -198698
16383 -198698 49261 -98904 96196 286217 71451 207488 710657 743314 555332 384056
16373 384056 8454 120626 337428 445287 280939 138940 266542 649163 576286 490082
16363 490082 261470 262063 144417 10220 115631 -4011 -237807 -711528 -756590 -362912
16353 -362912 -54726 -81356 -368174 -534007 -395105 -137017 82718 295307 385719 195706
16343 195706 -44590 -146800 -255936 -17195 -60409 46492 392330 327598 613089 835694
16333 835694 625329 712999 929491 642465 302788 57523 -62450 -91450 -104541 -68627
16323 -68627 -313024 -344208 -612705 -681112 -443056 -259303 -344548 -796208 -485769 10024
16313A0024K10378j01723R8732k52783l53025k8949K75154q574k630K09560J19777
16302A75941j00458K4380j5912j88932m7794K11685J86100k63684J21316K3184
16292A25826J16442N143k33566l1568Q517j46163M59933J96614l43150p1500J45399
16281B31927l29904m25433R4878K44156j18756j5622J30258M0200j6564J94779
16271B9919N3091J14357M02244O6648k22568k52160M6788j53379l12074m02971
16261f30105J57211R086P6677k5172N14860M80397m5549j25299k02601j35997
16251G3508l19356J3346K94907K25876m4962K32901m591P6052l36190k15089k19631
16240b23229j67991J65096K02068j8289K17682L05756J35791k83569k76999J13242
$$ plain form
16313 10024 220402 118679 217411 -35372 -388397 -417346 -142192 -150766 -153396 56164 175941
16302 175941 75483 99863 83951 -104981 -152775 58910 245010 -18674 102642 125826
16292 125826 242268 247411 13845 -17723 -9206 -155369 304564 501178 158028 86528 231927
16281 231927 -97977 -523410 -428532 -184376 -303132 -318754 -188496 -148296 -164860 29919
16271 29919 83010 197367 599611 666259 443691 191531 238319 84940 -227134 -630105
16261 -630105 -472894 -463808 -387131 -412303 102557 582954 537405 412106 209505 73508
16251 73508 -245848 -232502 62405 288281 243319 476220 471629 547681 211491 -3598 -223229
16240 -223229 -391220 -226124 -24056 -42345 175337 481093 616884 333315 56316 169558
16230A69558o738j30451l59986j08001J0645N8756k04636K3867J27004L39766
16220h0216N9843j39981p9267K18077N08875J90211J10814L4856n02429j72568
16210A48215J30047j6713k58241R6885K35090n3480J26346M5161L7312m69389
16200B1233l14095k63160k342M65601N33983N2761J06123r4980l8429j42747k94606
16189B9342j56353R2546K69430j05246J76762K75805J41782j11757J38795N2291
16179H03397l13059l37531O1295m1140Q7742k25393l4681J4994j32836p8283k68503
16168d63998j84332L676P0098M7813L78139J3794k41941O7958J16832q3314k6550
16157c01825J13083R5051N1159k56144J6961J70743L64119j02429r4932k08549
$$ plain form
16230 169558 162820 32369 -327617 -435618 -424973 -366217 -570853 -546986 -419982 -80216
16220 -80216 -20373 -160354 -239621 -21544 487331 677542 788356 823212 320783 148215
16210 148215 278262 261549 3308 100193 335283 281803 408149 453310 490622 21233
16200 21233 -292862 -556022 -558364 -92763 441220 493981 600104 505124 466695 323948 29342
16189 29342 -127011 -34465 234965 129719 306481 582286 724068 612311 751106 803397
16179 803397 490338 152807 214102 172962 260704 35311 630 15624 -117212 -195495 -463998
16168 -463998 -648330 -644654 -574556 -526743 -148604 -134810 -376751 -308793 -191961 -275275 -301825
16157 -301825 -188742 -93691 -42532 -298676 -281715 -110972 253147 150718 55786 -152763
16147a52763k66741J75350Q0526m3966j34841J70371q704m2989K79828K08875
16137B64946L45718J20436J51020p269o14245k46218K09161j06087j59491J15817
16127G3788J94092j13664k54275n8984J07075l71333J45463M47031L18023J75221
16117F62437l60800l16025M1684N3270j7005m06219r3111l4485j4868L08614J34754
16106d1754k85096j5891M019M19837J58507l64348k43312P1955J59173J66019
16096B9109J92021J32056l44627l51327L06348M9097J43887N7663j42981j14485
16086d3239j69829J01031k195O0487o9954L40724J10406l95847j25388K16266
16076B2462J13408J41124J729j02783N50353J34317j83808k59762j07914R0213
$$ plain form
16147 -152763 -419504 -244154 -163628 -207594 -342435 -172064 -180768 -223757 56071 264946
16137 264946 610664 731100 882120 874851 260606 14388 223549 117462 -42029 73788
16127 73788 267880 154216 -100059 -159043 -51968 -423301 -277838 169193 487216 662437
16117 662437 301637 -14388 27296 80566 63561 -342658 -435769 -470254 -485122 -176508 -41754
16106 -41754 -326850 -342741 -338722 81115 239622 -124726 -368038 -296083 -136910 29109
16096 29109 221130 353186 8559 -342768 -36420 12677 156564 214227 71246 -43239
16086 -43239 -213068 -112037 -114232 -53745 -123699 217025 327431 -68416 -193804 22462
16076 22462 135870 276994 278723 175940 726293 860610 676802 417040 309126 399339
16066C99339L75961K95011l20210r7156j87542j23388k81414j789k94286J75277
$$ plain form
16066 399339 775300 1070311 750101 652945 465403 342015 60601 58812 -235474 -60197
$$ [...]
##END NTUPLES=NMR SPECTRUM
##END=
