##TITLE=Analysis number 321682
Compound Code mo 01298
Book Reference 449/126
Project Code adrs
Chemist Name davee
##JCAMPDX= 6.0         $$ Bruker NMR JCAMP-DX V2.0
##DATA TYPE= NMR SPECTRUM
##DATA CLASS= NTUPLES
##ORIGIN= Bruker BioSpin GmbH
##OWNER= nmr
$$ XWIN-NMR		Version 3.5
$$ Thu Aug 24 12:26:54 2006 GMT Daylight Time (UT+1h)  MAYBRIDGE\nmr@NMR_250MHZ
##.OBSERVE FREQUENCY= 250.131544655141
##.OBSERVE NUCLEUS= ^1H
##.ACQUISITION MODE= SIMULTANEOUS (DQD)
##.ACQUISITION SCHEME= undefined
##.AVERAGES= 16
##.DIGITISER RES= 18
##SPECTROMETER/DATA SYSTEM= dpx250
##.PULSE SEQUENCE= zg30
##.SOLVENT NAME= DMSO
##.SHIFT REFERENCE= (INTERNAL, DMSO, 0, 16.522)
##AUDIT TRAIL= $$ (NUMBER, WHEN, WHO, WHERE, WHAT)
$$ ##TITLE= Audit trail, XWIN-NMR		Version 3.5
$$ ##JCAMPDX= 5.01
$$ ##ORIGIN= Bruker BioSpin GmbH
$$ ##OWNER= nmr
$$ C:\u/data/dgb/nmr/ADRS/1640/pdata/1/auditp.txt
$$ ##AUDIT TRAIL=  $$ (NUMBER, WHEN, WHO, WHERE, WHAT)
(   1,<2006-08-24 12:26:29.73 +100>,<MAYBRIDGE\nmr>,<NMR_250MHZ>,
      <created by zg, POWCHK disabled, PULCHK disabled
       configuration hash MD5:
       E2 DF 36 D8 04 B2 41 60 5A D7 A3 38 5A 4B D0 FE
       data hash MD5: 64K
       52 EF 6C 64 0A EB 22 0E 78 2D 30 29 45 8C C3 9C>)
(   2,<2006-08-24 12:26:43.04 +100>,<MAYBRIDGE\nmr>,<NMR_250MHZ>,
      <Start of raw data processing
       ef LB = 0.3 FT_mod = 6 PKNL = 1 SI = 32K 
       data hash MD5: 32K
       2F CE 66 29 10 42 6D 3F 00 DA FB E2 BE DB 65 E5>)
(   3,<2006-08-24 12:26:44.68 +100>,<MAYBRIDGE\nmr>,<NMR_250MHZ>,
      <apk 
       data hash MD5: 32K
       40 90 A4 E4 40 1D 2C C8 9C 3B 4D D4 BD E0 22 01>)
(   4,<2006-08-24 12:26:45.48 +100>,<MAYBRIDGE\nmr>,<NMR_250MHZ>,
      <abs ABSG = 5 
       data hash MD5: 32K
       64 A4 59 51 4A 4F 1F B0 55 84 94 F6 DB FE 6F A4>)
$$ ##END=
$$ 
$$ hash MD5
$$ 00 49 A3 AD 24 5E 28 96 59 0B 33 38 46 DF 0D EB
##$RELAX= 
##$RELAX= 
##$RELAX= 
##$RELAX= 
##$RELAX= 
##$RELAX= 
##$RELAX= 
$$ Bruker specific parameters
$$ --------------------------
##$DU= <C:\u>
##$EXPNO= 1640
##$NAME= <ADRS>
##$PROCNO= 1
##$TYPE= <nmr>
##$USER= <dgb>
##$AMP= (0..31)
100 100 100 100 100 100 100 100 100 100 100 100 100 100 100 100 100 100 
100 100 100 100 100 100 100 100 100 100 100 100 100 100 
##$AQSEQ= 0
##$AQ_mod= 3
##$AUNM= <au_zg>
##$AUTOPOS= <7 >
##$BF1= 250.13
##$BF2= 250.13
##$BF3= 250.13
##$BF4= 250.13
##$BF5= 500.13
##$BF6= 500.13
##$BF7= 500.13
##$BF8= 500.13
##$BYTORDA= 1
##$CFDGTYP= 0
##$CFRGTYP= 5
##$CHEMSTR= <none>
##$CNST= (0..31)
1 1 145 1 1 1 1 1 1 1 1 1 1 1 1 1 1 1 1 1 1 1 1 1 1 1 1 1 1 1 1 1 
##$CPDPRG= <>
##$CPDPRG1= <>
##$CPDPRG2= <>
##$CPDPRG3= <>
##$CPDPRG4= <mlev>
##$CPDPRG5= <mlev>
##$CPDPRG6= <mlev>
##$CPDPRG7= <mlev>
##$CPDPRG8= <mlev>
##$CPDPRGB= <>
##$CPDPRGT= <>
##$D= (0..31)
0 1 0 0 0 0 0 0 0 0.06 0 0 0 0 0 0 0.0002 0 0 0 0 0 0 0 0 0 0 0 0 0 0 
0 
##$DATE= 1156418789
##$DBL= (0..7)
120 120 120 120 120 120 120 120 
##$DBP= (0..7)
150 150 150 150 150 150 150 150 
##$DBP07= 0
##$DBPNAM0= <>
##$DBPNAM1= <>
$$ [...]
##$SUBNAM7= <"">
##$SUBNAM8= <"">
##$SUBNAM9= <"">
##$SW= 20.6930455092707
##$SWIBOX= (0..15)
0 0 3 0 0 0 0 0 0 0 0 0 0 0 0 0 
##$SW_h= 5175.983436853
##$TD= 65536
##$TD0= 1
##$TE= 295.16
##$TE2= 300
##$TE3= 300
##$TEG= 300
##$TL= (0..7)
0 120 120 120 120 120 120 120 
##$TP= (0..7)
150 150 150 150 150 150 150 150 
##$TP07= 0
##$TPNAME0= <>
##$TPNAME1= <>
##$TPNAME2= <>
##$TPNAME3= <>
##$TPNAME4= <>
##$TPNAME5= <>
##$TPNAME6= <>
##$TPNAME7= <>
##$TPOAL= (0..7)
0.5 0.5 0.5 0.5 0.5 0.5 0.5 0.5 
##$TPOFFS= (0..7)
0 0 0 0 0 0 0 0 
##$TUNHIN= 0
##$TUNHOUT= 0
##$TUNXOUT= 0
##$USERA1= <user>
##$USERA2= <user>
##$USERA3= <user>
##$USERA4= <user>
##$USERA5= <user>
##$V9= 5
##$VALIST= <valist>
##$VCLIST= <CCCCCCCCCCCCCCC>
##$VD= 0
##$VDLIST= <DDDDDDDDDDDDDDD>
##$VPLIST= <PPPPPPPPPPPPPPP>
##$VTLIST= <TTTTTTTTTTTTTTT>
##$WBST= 1024
##$WBSW= 4
##$XGAIN= (0..3)
0 0 0 0 
##$XL= 0
##$YL= 0
##$YMAX_a= 356344
##$YMIN_a= -528090
##$ZGOPTNS= <>
##$ZL1= 120
##$ZL2= 120
##$ZL3= 120
##$ZL4= 120
##$ABSF1= 16.522
##$ABSF2= -4.171173
##$ABSG= 5
##$ABSL= 3
##$ALPHA= 0
##$AQORDER= 0
##$ASSFAC= 0
##$ASSFACI= 0
##$ASSFACX= 0
##$ASSWID= 0
##$AUNMP= <proc_1d>
##$AZFE= 0.1
##$AZFW= 0.1
##$BCFW= 0
##$BC_mod= 0
##$BYTORDP= 0
##$COROFFS= 0
##$CY= 12.5
##$DATMOD= 1
##$DC= 0
##$DFILT= <>
##$DTYPP= 0
##$F1P= 14.0000005364418
##$F2P= -0.99999901652339
##$FCOR= 0.5
##$FTSIZE= 32768
##$FT_mod= 6
##$GAMMA= 0
##$GB= 0
##$INTBC= 1
##$INTSCL= 1
##$ISEN= 128
##$LB= 0.3
##$LEV0= 0
##$LPBIN= 0
##$MAXI= 10000
##$MC2= 0
##$MEAN= 0
##$ME_mod= 0
##$MI= 0
##$NCOEF= 0
##$NC_proc= -5
##$NLEV= 6
##$NOISF1= 0
##$NOISF2= 0
##$NSP= 0
##$NTH_PI= 0
##$NZP= 0
##$OFFSET= 16.522
##$PC= 1
##$PHC0= 143.0062
##$PHC1= 8.239192
##$PH_mod= 1
##$PKNL= yes
##$PPARMOD= 0
##$PSCAL= 4
##$PSIGN= 0
##$REVERSE= no
##$SF= 250.13
##$SI= 32768
##$SIGF1= 0
##$SIGF2= 0
##$SINO= 400
##$SIOLD= 32768
##$SREGLST= <1H.DMSO>
##$SSB= 0
##$STSI= 32768
##$STSR= 0
##$SW_p= 5175.98343685301
##$SYMM= 0
##$S_DEV= 0
##$TDeff= 65536
##$TDoff= 0
##$TI= <Analysis number 999999
Compound Code 99
Book Reference 9
Project Code 9>
##$TILT= no
##$TM1= 0
##$TM2= 0
##$TOPLEV= 0
##$USERP1= <user>
##$USERP2= <user>
##$USERP3= <user>
##$USERP4= <user>
##$USERP5= <user>
##$WDW= 1
##$XDIM= 32768
##$YMAX_p= 517297337
##$YMIN_p= -661345
$$ End of Bruker specific parameters
$$ ---------------------------------
##NTUPLES= NMR SPECTRUM
##VAR_NAME=  FREQUENCY,     SPECTRUM/REAL,   SPECTRUM/IMAG
##SYMBOL=    X,             R,               I
##VAR_TYPE=  INDEPENDENT,   DEPENDENT,       DEPENDENT
##VAR_FORM=  AFFN,          ASDF,            ASDF
##VAR_DIM=   32768,         32768,           32768
##UNITS=     HZ,            ARBITRARY UNITS, ARBITRARY UNITS
##FACTOR=    0.157963299565203, 1,           1
##FIRST=     4132.6476996994, 0,             0
##LAST=      -1043.33573715361, 0,           0
##MIN=       -1043.33573715361, -661345,     0
##MAX=       4132.6476996994, 517297337,     0
$$ Real data points
##PAGE= N=1
##DATA TABLE= (X++(R..R)), XYDATA
$$ [...]
20880 313838 393792 642463 671264 641182 671262 615765 509994 560154 628989 788526 787615
20869 787615 566830 299082 338672 406383 482202 390218 405344 462797 599226 653012 622594
20858 622594 654127 594678 663678 478435 511375 641221 522931 436789 338675 286052 263889
20847 263889 300104 388199 473271 553372 491352 311758 357402 481870 386606 405841 498160
20836 498160 535341 481008 534646 741843 661763 526092 686703 652125 659223 624900 566491
20825 566491 648386 711356 609405 650340 805036 798899 706472 705075 798667 792694 739967 539413
20813 539413 519537 517239 393409 343682 509271 648747 725767 849341 821254 740080 618626
20802 618626 457090 461194 639253 578984 657882 634709 610555 716207 730768 529789 484389
20791 484389 737010 900227 787359 798144 830002 872441 815015 688722 696584 776884 786499
20780 786499 756658 858690 816263 700222 720473 835840 856016 862917 748761 697576 643267
20769 643267 645564 636224 773470 960047 826085 782140 949609 1047343 981304 667708 744976
20758 744976 897110 834597 858179 918024 1011601 1036184 902064 912889 884926 818657 784754
20747 784754 751478 756608 742049 820196 886159 910871 707651 541327 561542 765265 1043549
20736 1043549 1051525 781140 726957 894264 933136 794463 676291 655978 735527 802753 743826
20725 743826 658662 778784 919999 919643 969098 927741 964277 1046201 1151395 1189758 1082429
20714 1082429 1091368 1007437 820074 804977 801857 722433 697615 766746 886143 1001226 1096907
20703 1096907 1046767 1057460 1190395 1102429 909249 676355 568237 778522 936815 1048418
20693 1048418 1079614 943267 860605 973965 1063098 874248 925307 1105422 1293307 1223759
20683 1223759 1073810 916899 940333 972671 924154 988516 998802 966229 1083135 1000868 1122690
20672 1122690 1089365 997551 1070661 1081693 1016100 1220665 1462600 1438432 1343722 1356988 1353073
20661 1353073 1158943 1213985 1167937 1221356 1329227 1361377 1240244 1055749 1009568 1109122
20651 1109122 1184337 1155649 1088033 1119266 1304436 1337973 1331019 1359405 1331319 1429577 1402364
20640 1402364 1208208 1246530 1363549 1470813 1483105 1411618 1317564 1301934 1234693 1078323
20630 1078323 1070705 1236160 1245315 1320292 1463385 1427370 1446466 1428670 1267357 1438978 1725643
20619 1725643 1722274 1713799 1874460 1866626 1485491 1289580 1259377 1427062 1432880 1523560 1479697
20608 1479697 1391677 1337153 1549608 1803022 1672381 1603561 1558010 1447870 1725886 1968773
20598 1968773 1931664 1896181 1761591 1574032 1592275 1603643 1654192 1758159 1897755 1948569
20588 1948569 1963714 1818116 1869307 1972502 2000442 1921426 1897807 2007880 2170213 2068645
20578 2068645 1881967 1842457 1954977 2091196 2170159 2171875 2017653 2065056 2213505 2079203
20568 2079203 2025920 2126364 2227020 2209030 2200550 2114883 2195136 2298274 2275071 2354884 2583727
20557 2583727 2557410 2531784 2734597 2740697 2693067 2646456 2564229 2373458 2411056 2367858 2416617
20546 2416617 2477986 2616169 2779203 2721595 2628865 2637338 2650774 2578117 2656688 2837379 2899078
20535 2899078 2862399 3029771 3143069 3085222 2845074 2830526 2942572 2898382 2817502 2861968
20525 2861968 3102393 3249888 3291605 3202262 3165849 3199694 3206611 3034641 2996595 3196882 3262450
20514 3262450 3426764 3562392 3665523 3610210 3576501 3550531 3584787 3656567 3717517 3768530 3888479
20503 3888479 4028944 4134409 4056578 3854263 3865939 4040714 4090799 4049717 4062346 4061974 4100945
20492 4100945 4206849 4322093 4405480 4321071 4206632 4234518 4433767 4467515 4523485 4659999
20482 4659999 4820553 4980607 5170791 5172723 5050855 4921876 4841449 4908133 4915117 5097722
20472 5097722 5153330 5176619 5232363 5287172 5401657 5558202 5760699 5953118 5943831 5971696 6138065
20461 6138065 6256027 6421592 6496555 6436340 6454382 6503502 6383990 6338016 6482130 6731740
20451 6731740 6908656 6980469 6995730 6957385 7100663 7298209 7265196 7499328 7862664 8013848
20441 8013848 7980722 8044116 8214736 8384755 8481399 8481889 8424796 8520294 8629539 8696314 8965290
20430 8965290 9104774 9239473 9202246 9267017 9521475 9721759 9964313 10235266 10377285 10420066
20420 10420066 10504408 10583796 10758905 11060774 11297404 11581438 11693019 11932917 12097138 12076507
20410 12076507 12302291 12640758 12968761 13357735 13610145 13738333 13806345 13967344 14165100
20401 14165100 14380469 14662764 15164432 15666902 15878726 16036528 16101593 16327324 16864690
20392 16864690 17240897 17632826 17973279 18263393 18669713 19071899 19553782 19956230 20331155
20383 20331155 20751516 21087397 21606970 22240229 22865904 23262854 23674233 24187629 24728351
20374 24728351 25367629 26171246 26827322 27527014 28073469 28703772 29326498 30097366 30882228
20365 30882228 31855021 32605001 33569515 34456484 35391893 36486244 37349489 38505668 39732853
20356 39732853 40841675 42023620 43237516 44622938 45904868 47070569 48391313 49743728
20348 49743728 51238643 52873066 54698543 56482314 58136516 59822877 61938545 64125072
20340 64125072 66048726 68159925 70393653 72797832 75265805 77582086 79972610 82444813
20332 82444813 85053310 87720679 90528590 93498507 96354622 99316632 102210327 105109622
20324 105109622 107999372 110830027 113807295 116810684 119862589 122773577 125639574 128359297
20316 128359297 130917719 133303600 135653671 137733685 139590909 141466373 143033234 144270622
20308 144270622 145452543 146401752 146977268 147135748 147143700 147004834 146670551 145950277 144988428
20299 144988428 143708064 142405366 140925243 139191260 137227431 135120520 132985150 130799726
20291 130799726 128439301 126005944 123685880 121188536 118502833 115975770 113408119 110714372
20283 110714372 108119377 105484569 102786513 100329056 97851623 95287609 92964478 90801433
20275 90801433 88537040 86164416 84009613 81844959 79717110 77661773 75632168 73702490
20267 73702490 71653781 69728098 67959492 66302832 64665984 63143647 61532240 59908682
20259 59908682 58316811 57065525 55820527 54471375 53036324 51708008 50377495 49148803
20251 49148803 47919030 46737818 45549031 44607760 43739193 42734201 41648703 40676207
20243 40676207 39866328 39100347 38308483 37541091 36696833 35993762 35100225 34208016 33417847
20234 33417847 32701474 31916409 31258125 30851598 30404085 29746846 29110835 28392202 27765133
20225 27765133 27288617 26766466 26018865 25388166 24855172 24418929 24031168 23834686 23467891
20216 23467891 23078823 22864987 22635484 22163496 21615984 21121296 20647274 20281794 19844724
20207 19844724 19419502 19094955 18693086 18284201 17946202 17648380 17573816 17392394 17132123
20198 17132123 16827749 16572643 16277506 15924625 15350422 15068186 14916815 14707859 14482853
20189 14482853 14235972 14072656 13913963 13811453 13448241 13205327 13075372 12922724 12723987
20180 12723987 12462130 12273737 12164515 11957313 11668312 11477604 11464378 11399392 11070079 10753441
20170 10753441 10761011 10567455 10393756 10342610 10202187 9867166 9583002 9424294 9300855 9207631
20160 9207631 9058966 8771092 8501978 8534086 8442200 8460963 8400721 8376540 8193358 7916865
20150 7916865 7686417 7490159 7433965 7354450 7306663 7235783 7190139 7192710 7119579 7083292 6951558
20139 6951558 6800784 6613672 6663598 6707960 6572564 6495455 6522044 6363264 6082548 5868898
20129 5868898 5817727 5793423 5878737 5815394 5835197 5848455 5855650 5746239 5616586 5529736 5487267
20118 5487267 5420902 5312376 5106280 5027125 4967189 4828433 4677126 4703349 4747387 4747198 4819488
20107 4819488 4753795 4692011 4555005 4457831 4273722 4234189 4152606 4127997 4197313 4304661 4223412
20096 4223412 4257058 4352266 4183445 3999828 3886191 3908067 3989479 4007702 4084155 4101290 3995505
20085 3995505 3960479 3782786 3554150 3396289 3396868 3452909 3340179 3464816 3464023 3208655 3154339
20074 3154339 3219951 3268507 3286055 3340185 3238140 3165925 3088766 3035331 3089082 3068093 3118909
20063 3118909 3319655 3324630 3225722 3263233 3389912 3210168 3059660 3175926 3267375 3110343
20053 3110343 3034045 3141814 3096974 2744184 2569553 2684257 2655662 2607970 2610839 2526267 2361721
20042 2361721 2417546 2646060 2691484 2599114 2608687 2558793 2396249 2360691 2429470 2323117 2312443
20031 2312443 2529373 2398195 2283184 2348825 2251113 2375428 2396271 2337378 2350029 2385626
20021 2385626 2419478 2365828 2377520 2440727 2256271 2177357 2076384 1878149 1853268 1942329 2030642
20010 2030642 2122904 2088672 2031794 1864000 1996065 1935182 1991206 2009088 1993430 1919326 1878514
19999 1878514 1857297 1867640 1952732 2034302 1935342 1885315 1848323 1917136 1960370 2062711 2150831
19988 2150831 2166507 1992658 1844727 1745889 1541301 1557418 1715217 1895333 1979747 1894468
19978 1894468 1784542 1762536 1582343 1332933 1446172 1457684 1496962 1628368 1668605 1443695
19968 1443695 1559243 1672078 1651757 1519450 1498889 1454659 1549477 1602076 1613300 1467629
19958 1467629 1244014 1252756 1269040 1226571 1249243 1310552 1380664 1425373 1394646 1274252 1243071
19947 1243071 1204169 1142082 1194511 1232330 1177294 1100691 1012136 1152377 1436424 1463265 1327135
19936 1327135 1261591 1297049 1364189 1375145 1491756 1371413 1364795 1179766 1186038 1299026 1074880
19925 1074880 1074177 1309593 1493313 1407250 1265276 1118312 1127018 1093166 1022433 1007239 926929
19914 926929 928394 935535 914745 982346 1004326 889973 963243 1062911 941504 962469 1268294
19903 1268294 1298883 1265758 1102922 999674 1089023 1097552 1150509 1329165 1320746 1267118 1372015
19892 1372015 1446262 1329842 1388154 1484098 1398527 1322173 1277534 1342899 1492133 1497889 1437429
19881 1437429 1498289 1550064 1513618 1405528 1334134 1487012 1590614 1536826 1609238 1669435 1544951
19870 1544951 1438945 1616202 1553821 1469379 1457180 1416794 1305538 1288483 1178964 1095994
19860 1095994 1164905 1058297 1022350 900557 942107 940022 781419 726712 854993 1032086
19850 1032086 1049149 916252 775319 819255 897190 695389 686466 918540 1134767 1086017
19840 1086017 999315 763066 631084 562735 570755 708824 731542 762216 982847 861610
19830 861610 865464 1050696 1004182 838124 849447 749248 656310 626107 696132 691691 785258
19819 785258 991691 967419 941843 963122 943447 972593 718935 669402 672634 770059 773157
19808 773157 576170 457484 434448 533295 587339 635871 825654 784599 690885 583362 591995
19797 591995 715436 537623 387683 456587 506354 476495 696125 811235 778604 676858
19787 676858 683489 640621 596465 597383 764104 788674 774011 673895 633311 609603 832985
19776 832985 913275 849774 758775 815950 929531 798042 639533 681444 730877 681399 493148
19765 493148 425856 361528 380468 505883 626826 749127 682790 635495 660431 816017 731422
19754 731422 553521 560349 637188 629294 904157 1015364 874128 827115 922708 932234 922025
19743 922025 1018982 1141363 1329068 1366014 1413054 1463369 1308827 1420946 1448236 1369702 1254370
19732 1254370 1113775 1090370 1037813 969384 1051534 1010320 989738 942919 947751 715926 572924
19721 572924 463416 573870 719079 727351 768659 753960 839597 877022 806258 634282 633071
19710 633071 859384 1048040 907786 828702 990825 976955 1182348 1172088 1078683 1189385
19700 1189385 1213627 959454 884246 968788 1020502 1152464 1250363 1279343 1086456 951706
19690 951706 995082 1095764 947751 845473 870350 962223 971734 953264 931131 782947 766479
19679 766479 829295 844828 790135 688696 682190 574856 563000 480720 550192 571433 577361
19668 577361 647506 572149 463664 543518 555996 502963 443677 533447 679339 771003 689478
19657 689478 733030 786428 796805 888581 851823 620693 593962 771771 933386 1009791 943821
19646 943821 901546 1124581 1051156 757833 741047 716326 742296 887279 961443 1080432 1043586
19635 1043586 892010 640391 459236 482825 643141 645686 493952 413173 224576 284882
19625 284882 525516 699560 601875 549119 489339 514754 615368 688260 731142 647339 645485
19614 645485 767688 913692 951949 862901 733007 571575 526820 379451 364524 456743
19604 456743 341632 239113 302838 455882 416206 422281 475039 436159 508770 455072 436572
19593 436572 495601 533517 439997 242236 308866 402371 366574 351843 348958 487524 560961
19582 560961 528706 338540 406290 463719 526575 454467 454818 548514 659532 649970 669796 716137
19570 716137 669250 639569 472609 211453 167088 366923 446411 655614 727293 705895 659588
19559 659588 648958 626758 500581 306823 279204 332856 386346 470903 459134 539816 619458
19548 619458 685752 832662 807561 693995 640583 723060 658403 569797 562388 435663 588993
19537 588993 569119 700278 704621 595990 530925 477411 557348 484840 491474 506424 454157
19526 454157 407404 588300 551763 417059 542646 550257 497000 505116 339689 169355 193452
19515 193452 425466 597444 610607 581627 580654 681026 622253 640249 702746 729301 602566
19504 602566 459373 432202 388449 404226 382697 484964 595641 425907 372765 519041
19494 519041 584089 706327 732808 653054 570873 497526 398828 429508 572488 756588 810995
19483 810995 979750 1088708 1076349 1055975 900772 975458 1050747 1000674 920737 953416 1040742
19472 1040742 1052900 960916 1006719 1007452 1042608 1098166 1064565 909130 936252 978598 1009298
19461 1009298 956413 989095 906145 890070 835832 808358 619018 470318 627222 720912 751749
19450 751749 726122 824374 772396 794055 939822 983716 918848 783551 681781 775043 996257
19439 996257 1065565 1082078 1301485 1402443 1355131 1244010 1165170 1200082 1253920 1280634 1228611
19428 1228611 1243319 1394711 1374485 1444921 1498388 1471589 1472506 1621247 1735579 1706244 1855866
19417 1855866 1926552 2020288 2098900 2240572 2170664 1987330 2010301 1994279 2106823 2180704 2224490
19406 2224490 2270607 2304765 2477994 2387146 2434721 2708087 2886578 3077903 3103169 3115925
19396 3115925 3428893 3809714 3863836 4010182 4203703 4412566 4796580 5223456 5508755 6027980
19386 6027980 6739186 7444937 8076466 8895814 9985521 11009267 12040333 13379416 15111318
19377 15111318 17410862 20458810 24390654 29216158 34585810 39959419 45358677 50734181
19369 50734181 56354248 62027748 68347227 75422286 83157305 91860103 101484138 111041143
19361 111041143 119002341 125343698 130802729 135254641 137785108 137754408 135778666 132756078
19353 132756078 129228591 125555624 121652546 118332659 115475660 112936414 110868125 109156662
19345 109156662 107086315 103244830 97889381 91973085 85663249 79012642 71867120 64631600
19337 64631600 58115733 52196906 47121491 42699764 38896062 35657322 32863995 30340889
19329 30340889 28249241 26428983 24903322 23714473 22371383 21101638 19965120 18872979
19321 18872979 17947884 17265208 16618623 15953085 15100522 14460075 13910541 13496034 13136979
19312 13136979 12699247 12274015 11994519 11553779 11074065 10911641 10620521 10351118 10062016
19303 10062016 9659983 9406191 9081974 8678253 8565373 8290732 7936305 7658441 7318034
19294 7318034 7181670 7164666 7177583 6936750 6827797 6583634 6399251 6325408 6209505 6119551
19284 6119551 5813338 5621693 5661691 5607153 5587724 5620933 5492319 5396613 5285344 5196574
19274 5196574 5317014 5189524 5182665 5214795 5057947 4774707 4575167 4470498 4368520 4421847
19264 4421847 4443093 4210699 4166793 4196028 4134256 4090085 4088329 4094078 4097139 4086879 3956156
19253 3956156 3957287 3870283 3826042 3870514 3927731 3739160 3875704 3907889 3824990 3888832 4093537
19242 4093537 4004659 3948313 4126248 4265065 4454894 4884454 5237256 5413913 5720562 5774242
19232 5774242 5873363 5853950 5633784 5428942 5351858 5221945 5202360 5210307 5214059 5302937 5537220
19221 5537220 5880786 6207036 6527545 6830590 7143038 7371704 7616534 7756801 7772329 7723109
19211 7723109 7815704 7988260 8179416 8337859 8698245 9033665 9527306 10330084 11183621 12107386
19201 12107386 13402912 15270296 17579407 20260293 23677369 28015247 32315432 35688708
19193 35688708 38218035 40010937 41301589 41997249 41966990 42229653 43196015 45062241 47613005
19184 47613005 50948016 54359057 58069568 61695802 64414749 65537962 65036643 63536673
19176 63536673 61289504 58037972 54241124 50583154 47743534 45873323 44893715 45363415
19168 45363415 46982983 49043849 50787200 51818165 52616851 52973629 52681320 51706929 50741219
19159 50741219 50274243 50896508 52671690 55480357 59051951 62889605 66218391 69455914
19151 69455914 72549409 75626631 78684313 82047319 86174225 91054812 97149326 104581982
19143 104581982 113869587 125361434 138953503 153884143 169815872 186799546 204998605
19136 204998605 223679718 240347777 252238337 259380033 263417762 265295002 263837928
19129 263837928 257440852 246440098 232417384 216875532 200549620 183310027 165637103
19122 165637103 148268923 132357954 117976731 105778194 95274686 86082249 78338951
19115 78338951 71932610 66367337 61681370 57582528 53951664 50799806 47898599 45361806
19107 45361806 43106648 40933973 38953013 37096287 35469889 34194713 33238805 32189615
19099 32189615 31281938 30392766 29626713 29034092 28575146 27979062 27114944 26180439 25446186
19090 25446186 24527923 23621846 22476959 21525149 20435711 19424405 18501519 17856135 17248110
19081 17248110 16650023 16000813 15369882 14837490 14470176 14023929 13447476 12809419 12510177
19072 12510177 12277290 12086307 11872411 11445306 11107783 10747797 10583985 10333512 10062015
19063 10062015 9838981 9680029 9411725 9167548 8984767 8703382 8541178 8532111 8385486 8096911
19053 8096911 8027169 7899524 7724809 7494709 7321722 6988000 6788427 6673656 6395020 6138766
19043 6138766 5839310 5563915 5600821 5618108 5349322 5008348 4714631 4677331 4660785 4614289
19033 4614289 4471740 4398273 4465303 4426568 4324290 4136267 3924968 3931966 3839134 3670797
19023 3670797 3601162 3643596 3647563 3573856 3586692 3476435 3344265 3134734 2905342 2905464 3050262
19012 3050262 3056114 3060022 2998121 2868239 2620417 2514617 2465325 2293371 2215739 2428883 2468304
19001 2468304 2310588 2283140 2293805 2084997 2086154 2082704 2120103 2060371 2003853 1973705 1951104
18990 1951104 1899672 1812601 1770722 1727171 1618670 1738430 1828889 1756030 1540399 1488464 1644264
18979 1644264 1615116 1614054 1662375 1676666 1565638 1383042 1226722 1224601 1296583 1291593 1311175
18968 1311175 1278230 1223581 1270806 1164861 1193496 1233916 1185303 1142948 1091689 1002124 937853
18957 937853 881474 829260 975212 1076598 1072098 1015073 765483 648933 718061 709863 753537
18946 753537 674928 726111 849131 719398 759507 500357 530023 621167 658892 705229 791539
18935 791539 800197 781886 839674 823192 762661 647618 684516 807686 903140 846962 797488
18924 797488 919666 1033501 1117442 1153366 1043945 739324 682601 723924 773816 858231 872811
18913 872811 825521 815637 716324 483854 392315 577486 623981 587038 563825 541113 463587
18902 463587 325655 452203 707241 789964 841686 875658 823569 759540 703619 583137 611916
18891 611916 665593 656942 707146 760293 683757 649181 673003 714454 810296 779997 713146 640928
18879 640928 474756 446643 550313 526853 578224 715361 778911 680889 472650 506080 633133
18868 633133 516529 567434 622238 650264 832207 893441 998801 952051 817604 680502
18858 680502 628477 751999 809444 785319 735054 680388 699853 622555 614556 588683 708150
18847 708150 815412 921488 849428 716289 622571 621906 763055 974475 893642 905152 845989
18836 845989 974680 1219319 1158634 1068579 1059237 1125210 1069821 1068493 1091183 1218474 1319529
18825 1319529 1351669 1454227 1425664 1382798 1341435 1256031 1371386 1383393 1354255 1455868 1400296
18814 1400296 1315677 1294402 1155101 1047191 1015555 852298 782240 673943 767343 915913
18804 915913 885321 894478 873693 895019 845601 743660 840441 828304 808700 671612 627758
18793 627758 569348 678721 742511 714449 521594 442030 506977 552069 700001 746044 669604
18782 669604 880348 1038018 1051864 915573 858675 851405 973419 1073973 916210 643879
18772 643879 681166 722110 758909 718348 618348 577062 766994 925894 984550 704289 670115
18761 670115 885028 1139646 1046905 972832 991723 996472 1007605 988732 1005105 974856 941168
18750 941168 1131099 1323140 1468941 1377859 1365635 1273556 1125834 1049378 1250905 1323377
18740 1323377 1196965 1103160 1133463 1146603 1112642 1198632 1329689 1224101 1111300 1188203
18730 1188203 1342339 1472248 1395110 1280131 1334571 1301832 1369522 1358877 1310360 1207596
18720 1207596 1258083 1449135 1622147 1782654 1784013 1644969 1651612 1745502 2034694 2208881
18710 2208881 2096739 1918920 2036005 2223480 2351190 2273615 2221285 2281604 2439866 2498480
18700 2498480 2623690 2722102 2643263 2719987 2928814 3027807 3353021 3542745 3729400 3945917
18690 3945917 4316486 4696083 5150999 5530644 5903298 6142288 6230234 6401873 6637345 6860187
18680 6860187 7363764 7958652 8697976 9623548 10848077 12523806 14439232 16116139 17380031
18671 17380031 18242196 18854575 19069436 18692125 18061804 17590007 17295818 17439259 18052843
18662 18052843 19050340 19920372 20686281 21367124 21838267 22028825 21954620 21518696 21015541
18653 21015541 21028466 21274945 21760791 22448110 23396646 24679168 26375987 28548154 31348170
18644 31348170 34815041 39038833 44419792 51708081 61231625 72889462 86227583 100409443
18636 100409443 114594985 128861616 142907395 155110739 164633417 172853614 181882574
18629 181882574 192050218 202133595 210427547 215921386 219280554 221049763 219800942 213859794
18621 213859794 203564900 191107523 178304897 165334085 152357976 140088923 129569431
18614 129569431 121577860 116276457 113263435 111877518 111255410 110159774 108242675 105817319
18606 105817319 102480440 97861648 92060678 85846487 80188224 75552321 71870804 69140134
18598 69140134 67739726 67593678 68948979 72234109 77644504 84045034 90703640 97166220
18590 97166220 103430109 108994027 112187144 112154801 109537569 105279256 99899924 92919018
18582 92919018 85065592 77260899 69988811 63425079 57707313 52683033 48039241 44149424
18574 44149424 40851045 37946392 35468472 33285717 31466703 29822005 28239329 26895999
18566 26895999 25881683 24800042 23737108 23009114 22203887 21290398 20680459 20048701 19425355
18557 19425355 18960669 18370491 17921836 17714775 17424971 17030055 16660737 16478648 16474915 16481853
18547 16481853 16643402 16973865 17612626 18507846 19585933 21035865 22615087 24029384 25402252
18538 25402252 26523644 26988601 26688797 25899494 24808505 23606730 22175687 20617063
18530 20617063 18845055 17334965 16052363 14819017 13790385 12880015 12198840 11650872
18522 11650872 11127426 10710979 10187261 9824297 9541913 9088805 8714670 8606270 8394263
18513 8394263 8267524 8035472 7785394 7617556 7455415 7303247 7043691 6670335 6357603
18504 6357603 6184124 5837212 5551417 5367673 5127800 4992812 4838135 4605802 4628557 4569328
18494 4569328 4521473 4475681 4216084 3933851 3819051 3755145 3780139 3723306 3729796 3744617 3532976
18483 3532976 3341426 3387718 3404734 3300927 3164904 3028682 3069390 2964836 2985751 2984962 2908611
18472 2908611 2811749 2708364 2647346 2523535 2360471 2318201 2339884 2341545 2262168 2195144 1992239
18461 1992239 1917539 2034430 2210425 2083857 1889599 1642768 1506245 1641216 1808959 1851872
18451 1851872 1798819 1724542 1614844 1521107 1410437 1158373 1045647 1121206 1150145 1387974
18441 1387974 1480650 1461456 1396263 1287634 1206833 1266337 1179889 985423 867757 967491 1050660
18430 1050660 949725 926314 911787 854028 958457 898541 787849 800728 855529 984782
18420 984782 1063275 1057155 973541 1151736 1209252 1051377 1075679 1096017 917164 740858 784798
18409 784798 903426 1053103 1092586 1026450 781359 700671 704134 649439 755804 760708 745965
18398 745965 665790 660456 758775 896003 1045414 945170 665761 550065 599312 731531
18388 731531 844464 705061 618370 540946 477152 468959 533376 731476 872090 871930 748428
18377 748428 682122 743033 714054 743069 707598 745686 807812 907574 776880 635801 680999
18366 680999 551528 519808 685953 837745 847546 767634 811338 910944 978976 1010820 810517
18355 810517 548047 476500 492916 573959 451451 287348 191179 255285 306219 226791 35542
18344 35542 199763 360186 425489 527240 560254 479432 411545 405872 356020 206650 185257
18333 185257 472323 460064 171363 191985 141102 165098 296787 275017 382235 274421
18323 274421 117351 298909 327517 259442 314916 386537 231588 175157 221809 324648 359367
18312 359367 264056 413256 488707 410833 327022 264445 439850 401273 310775 469944 463032
18301 463032 211436 79587 76941 55168 82616 148142 206653 240423 238479 248408 188977 2528
18289 2528 53761 66488 21939 -718 227968 230901 24840 28154 -26447 -63411 -91376 117437
18277 117437 341102 278039 384365 425064 348658 376349 392857 388865 308383 427532 438062
18266 438062 404427 353548 258528 122571 156282 113198 40416 -3803 -17392 118768 337045
18255 337045 374471 151649 -45890 34228 234214 199405 119432 109528 155554 217044 302874
18244 302874 287273 385030 392157 449275 230360 31742 -71935 -158791 67909 212831 189648
18233 189648 137801 131817 200929 168270 171723 -9563 -90342 -90156 -87927 -43357 153815 257318
18221 257318 189092 115591 188835 209661 218243 238441 308759 277455 109116 -47009 38156
18210 38156 53911 -70774 -155812 -158708 -133367 -194660 -129682 4960 -17109 -147366 -221471
18199 -221471 -271710 -199695 -110458 146271 275311 365518 358613 323473 127384 -2990 -38882
18188 -38882 -29888 -51107 -113526 -46952 70043 35784 10405 20966 83676 164300 183048 327803
18176 327803 343477 306309 152554 72919 100352 -16465 -120629 -54319 50667 -75308
18166 -75308 -7683 -40336 -336270 -345952 -75224 88618 61399 -51167 6526 32766 34472
18155 34472 -15022 -244869 -160237 -19685 22648 41009 1529 40753 -40041 48420 98756
18144 98756 184748 163056 17170 -5210 277107 390977 296167 299583 438137 405894 362672
18133 362672 374073 460915 430343 367611 243896 332365 497639 645822 658481 666438 646087
18122 646087 861033 1016684 801584 732957 702461 495325 665502 744888 730648 688387
18112 688387 758342 688051 615851 549844 521443 543089 466244 403429 259707 149056 191287
18101 191287 329439 418999 332047 235177 160200 43046 1015 227487 411729 431649 532728
18090 532728 436447 297970 246861 225514 310518 344422 414756 583746 682787 816870 736991
18079 736991 734376 756167 846927 904508 837725 895712 1020600 893292 826187 780363 836755
18068 836755 798297 769490 701191 633334 509116 615372 808413 818792 765216 657485 413870
18057 413870 259806 171170 144137 177634 113105 203324 358502 354123 226388 237566 446836
18046 446836 541605 372383 151032 194540 343295 346186 200557 133856 245242 243131 154590
18035 154590 234912 247032 110546 162821 223744 146894 201999 99238 -73241 81392 164241
18024 164241 52155 21669 25781 119581 155113 201161 246041 266782 390705 405623 465299
18013 465299 537693 430581 337458 149007 160574 154829 105724 104676 120770 122554 210460 367783
18001 367783 358484 406913 365115 217082 211456 74808 -107700 16626 139705 62678 -48985
17990 -48985 162743 342680 353124 273411 274439 249997 168016 107871 192303 154265 205839
17979 205839 328276 279316 81678 108813 -14738 -54660 -4078 -87101 -58736 -78582 -94391
17968 -94391 -88133 35849 150245 9789 -143565 -8046 65128 -177500 -122582 -935
17958 -935 105303 214793 164292 77349 23768 112833 272326 239462 242032 261405 279660 199423
17946 199423 33347 147930 341347 212200 131211 253890 249841 107514 168247 219075
17936 219075 370062 386568 218589 285347 301676 209577 273785 274098 62039 31094 -33292
17925 -33292 -84368 -20940 157856 95493 49298 98045 115362 264324 148525 -60164 -253314
17914 -253314 -132112 56596 65325 -99060 -252638 -243368 -235148 -373839 -107949 182864 33992
17903 33992 -171799 89789 125156 54247 38299 -6420 -106285 157286 212388 103170 -62595
17892 -62595 -233851 -441677 -372026 -163080 121660 180084 -23745 -20193 106131 60165 43468
17881 43468 -224 -131992 -128000 -168274 -211150 -175400 -104554 -49253 68001 57711 46872
17870 46872 90563 -6118 -219435 -172993 -82367 -209092 -99750 17916 -12315 -13549 -186784
17859 -186784 -260731 -73965 -6 52858 65710 63179 40796 106036 -25569 -228358 -60466
17848 -60466 158859 295502 225639 87977 76851 -41354 -75869 53849 123161 57861 11699
17837 11699 88677 224441 200585 4682 -233642 -176960 -73760 -81685 61652 148634 106755
17826 106755 23832 -93928 -79485 54663 -45346 -169184 -196298 -142478 -31605 52647
17816 52647 -57670 -145399 -158743 -123585 -219859 -339357 -243825 -67536 227442 244031 93997
17805 93997 12991 -12995 -29213 91617 278060 215886 251418 384877 145496 76095 130249
17794 130249 331537 440861 196975 -138802 -295967 -244173 -69283 -27810 -64014 2070
17784 2070 -3091 -72647 -42171 95057 164552 213219 199828 4176 57839 6603 -92170 -127417
17772 -127417 -206499 -53448 43048 82377 162688 122436 -35239 -74918 -50646 59972 145393
17761 145393 261040 274081 308024 235382 142611 69271 -14060 -30461 -107222 -90772 -44078
17750 -44078 -41143 -142120 -259123 -206459 -29406 27683 -4051 2664 101186 65267 -59696
17739 -59696 -4349 83264 -62178 -97780 -30549 83819 58000 -81016 -115162 -67332 -71674
17728 -71674 -36287 78890 195963 194266 166370 164047 94840 -5677 -163627 -115243 -87798
17717 -87798 59984 224839 316677 300249 222442 34312 -43791 -145851 -101475 137260 150637
17706 150637 66762 -102888 -213462 -170683 -182996 -209675 -193592 -121471 -195252 -204668 -265869
17695 -265869 -211328 -232696 -209871 -154561 -19651 105945 141525 84343 80184 122498 79030
17684 79030 65772 -76280 -176753 -143860 -29666 19402 -127552 -68706 37503 12485 -26254
17673 -26254 18066 40671 145319 87800 -8091 21916 273849 305260 181968 93588 66753
17662 66753 85355 82884 -103775 -112589 -280955 -165954 -120020 -48707 -25865 303087 341020
17651 341020 150662 94653 145480 55848 -58202 -153509 -224106 -164860 -107185 -119628 -33051
17640 -33051 4414 35625 -48132 -85276 -110725 -155618 -84868 69670 10995 -41848 -22270
17629 -22270 -108218 -81610 -43004 2050 -26235 -662 -109429 -177995 -231651 -19407 189038
17618 189038 269497 255136 83447 177129 116555 127004 -569 -92002 -100173 -81544 -107890
17607 -107890 3112 139991 165315 -775 -23057 -187714 -290652 -175998 -73804 -71409
17597 -71409 -100458 -88749 -28545 25944 165107 306329 292702 258413 144297 -51441 -116728
17586 -116728 68065 164611 211412 163356 -40916 -95469 113794 100543 -15131 -120044
17576 -120044 -234309 -295901 -162753 -261121 -233757 -212612 -60484 -24794 -8427 -80074 90324
17565 90324 138321 34395 -53761 -59038 57552 118393 -3716 -17864 100832 65278 5200
17554 5200 159627 169483 147634 220396 422967 446620 336719 164123 250790 302999 101410
17543 101410 -119210 -233876 -197150 -48652 28759 43066 -67249 37942 68525 79147
17533 79147 220818 276912 189189 176878 195760 231287 115178 44390 -5049 -69766 98455
17522 98455 109942 2273 -48991 -15712 58100 79126 122523 80412 -22289 -169540 -326221
17511 -326221 -156429 12268 57267 135815 111407 -7291 -42763 -76312 -104917 -72002 -33836
17500 -33836 -177639 -99730 -122144 -218305 -169357 -174865 -217450 -132328 -116306 -156017 25315
17489 25315 -70324 -121535 119732 302461 124610 123345 150761 197957 330306 187818 142733
17478 142733 216009 419358 317191 71040 -52128 -188747 -265176 -210670 -52665 -119632
17468 -119632 -145293 114422 278418 174690 170990 76997 -75527 -245580 -276421 -283097 -154404
17457 -154404 -16552 45747 64459 -40078 -175815 -9767 48115 74580 96456 126088 234722
17446 234722 134986 19006 29897 54127 93778 200182 -98860 -326648 -92517 114484
17436 114484 71549 27241 -35476 -111849 -76193 115352 153595 -40997 -48335 -173959 -223109
17425 -223109 -193148 -27062 158363 53579 -108384 -91469 -12382 156424 102979 -4383
17415 -4383 -53650 97030 273825 212869 182091 242693 119020 2488 -17198 -123104 -29946
17404 -29946 -20498 -35482 -59148 -213575 -220716 -146315 -170447 -150326 -80811 -185923 -228316 -110365
17392 -110365 15900 174573 120548 55523 -135210 -180398 -128278 -80422 -74657 -122228 -124767
17381 -124767 -65609 -91024 -185933 -93842 599 34053 -143024 -61395 20827 182561 212824
17370 212824 16183 -169789 -143369 -87547 -174365 -235842 -150525 -18469 -1986 31329 26492
17359 26492 -25856 -69860 -21947 12733 -47664 7413 171622 236849 241510 173243 -12128
17348 -12128 -60902 12598 12305 109450 298828 264211 -15394 -14123 -8095 64261 269661 217436
17336 217436 131515 165568 925 -113950 -65514 -118138 -312297 -336112 -181303 -10063
17326 -10063 101972 -106028 -276282 -326803 -228334 -150289 -30786 77492 57694 12805 -37574
17315 -37574 35650 -16559 -25659 -114947 -43755 -99540 -74605 5137 195659 144566 172763 189870
17303 189870 101051 193076 157900 134760 103805 -114538 3779 109667 30316 -125851 -88592
17292 -88592 -63013 -15854 19110 124932 188175 108825 103468 140002 62224 -72396 -143217
17281 -143217 27187 -17508 15974 97008 128160 -52650 -107434 -87237 25803 148152 38742
17270 38742 -111214 -106719 -10859 155651 182692 90884 -7545 -59941 -62818 -65962 -50112 90964
17258 90964 170390 126662 116810 -29906 -30855 28486 53694 136946 5298 -329092 -265640 -116686
17246 -116686 -115853 -16037 -22085 -66897 -4869 -72361 -21456 14317 -7421 -16572 -7782 -49347
17234 -49347 -35193 -109812 -75085 47871 148972 27899 -176411 -188556 -177770 16608 53071
17223 53071 -28137 -28414 155736 226359 175040 123540 153493 3635 -63441 -172687 72401
17212 72401 244006 276236 126926 28940 24133 41835 113516 46725 76393 192219 257008
17201 257008 72536 -147705 -106145 -42913 -68142 -35625 -56322 -81465 -165215 -248658 -195790
17190 -195790 -248855 -166771 -20470 -143593 -213644 -160678 -214727 -205330 -152311 -115417 -96726
17179 -96726 -88183 -97898 -113205 -67954 -9331 92635 226397 137746 -11829 -53657 -157949
17168 -157949 -104635 -26936 -36470 -63811 -89121 -29186 44792 70309 65703 73717 132022 56705
17156 56705 7068 -74864 -41651 -61735 -125347 -26471 14902 -20538 53551 38584 4139 12292
17144 12292 119139 176666 53063 -2613 -90370 -171069 -158693 -250537 -361322 -283305 -110552
17133 -110552 -160709 -38215 14721 -177443 -280960 -272991 -74063 44251 144056 17410
17123 17410 -110428 -216014 -167303 -173059 -108504 85194 158690 102086 39673 6411 -8365
17112 -8365 -29648 110713 -19926 -246432 -182643 -76376 -104377 -79812 -201127 -229304 -109663
17101 -109663 82537 135831 170521 273860 322426 448054 264593 -8094 37952 -33315
17091 -33315 -85199 24501 74174 -44299 -134065 -69803 -99154 27201 151399 59102 2049
17080 2049 95173 -16676 -144654 -191729 2465 156375 52706 -103625 -153931 -86412 -83439
17069 -83439 -120914 -168940 -114283 -157150 -155957 -265446 -194864 -194778 -142920 -77699 -39929 -243758
17057 -243758 -290370 -283513 -219044 -195519 -184863 -228933 -220604 -367818 -566072 -453793 -287827
17046 -287827 -76045 -57609 -65037 -111096 -78904 -39214 -91370 -163262 -137691 -141587 -90334 -98362
17034 -98362 -37256 42192 -43919 -116591 -121143 -114633 9630 85219 91793 -122951 -206217 -105227
17022 -105227 66169 225888 177982 73702 93864 2140 96584 313722 444129 355406
17012 355406 268223 310377 176083 152490 197219 178733 118769 -57523 -53722 -79597 44147
17001 44147 6385 -114461 -72068 66943 100073 93973 129574 190135 -15950 -136332 -17920
16990 -17920 52224 122289 138788 99782 274193 250873 133389 111890 160376 89451 38568
16979 38568 -58515 -102875 -138649 -89309 -201849 -353037 -390687 -275051 -259139 -266984 -202302
16968 -202302 -197404 -196522 -283883 -263914 -249283 -163408 -41803 -35288 -202653 -288917 -214972 -275621
16956 -275621 -192698 -53005 -58436 -62264 -140531 -211624 7164 219996 335510 83859 -92452
16945 -92452 -84541 16584 108755 320165 191155 8110 83692 195681 82393 4817 -71809
16934 -71809 -11542 92660 87742 56525 195430 387514 253342 69369 -64395 -155269 8806
16923 8806 31664 94818 152821 59960 20585 88410 179304 150572 2943 -35694 -169272
16912 -169272 -109003 6004 -16544 -132240 -55035 -214375 -250325 -14817 119029 -35575
16902 -35575 -1785 78459 108100 106538 183211 -39121 13096 26897 35462 -69821 -150042 -98431
16890 -98431 49944 100024 -15649 -129793 -261273 -262919 -147925 -58841 -10180 112155 78319
16879 78319 -111531 -226043 -198403 -244666 -177701 21394 47231 73424 233076 169647 123096
16868 123096 115625 51839 -44544 -169687 -61687 6112 -5330 -107013 -174820 -268997 -250743
16857 -250743 -264241 -214029 -376644 -327518 -45365 -45918 -94591 -73783 2487 -60990 -111154
16846 -111154 -187978 -34139 132669 178689 91117 -36242 -73167 -87334 14044 -223008
16836 -223008 -344341 -79690 75024 -46922 -60978 -24656 -227444 -348115 -321948 -62001
16826 -62001 55697 63800 18996 -65449 -151551 -170403 -74042 -14169 -55315 -48659 -35551 20648
16814 20648 20495 28335 -8114 8791 -142571 -87216 60924 -27993 -98341 -97392 -228618 -394072
16802 -394072 -342529 -123040 -82261 27554 109191 40095 135774 104553 -18416 104505 82495
16791 82495 14223 105626 210744 138001 -158386 -399487 -467247 -445313 -157547 -6562 99877
16780 99877 34490 -33809 -144665 -228113 -164693 -198637 -179982 -38306 -81330 12826 102439
16769 102439 24829 5546 49237 48506 60243 147559 267497 9843 -77745 99253 48746
16758 48746 -65926 24911 -45601 -105026 -226362 -297064 -175467 -150189 -206307 -134950 -109993
16747 -109993 -44096 -35752 -111449 -207636 -224176 -157538 -128852 -142030 -326702 -362020 -342784
16736 -342784 -337199 -358657 -292720 -191950 -145631 -114711 -147119 -81727 -119908 -86121 -47765
16725 -47765 -21345 -73177 -136747 -69162 18125 -28912 -111177 134768 283974 115837 145108
16714 145108 85153 117584 41778 -54106 64534 14035 -88231 -322 201072 92367 -28195
16703 -28195 -113157 -34017 91758 86169 40912 259470 232865 46604 -55250 -3730 -54436
16692 -54436 5327 -32486 -75639 -111260 -42236 113205 154032 168540 134518 16092 -22993
16681 -22993 118692 253933 15316 -173272 -200420 -195955 -156924 -181751 -19464 73013 -7210
16670 -7210 -62432 111776 246482 255356 144038 43384 -40008 5653 -1773 -3930 -86342 -41789
16658 -41789 44718 48162 174823 375299 234927 185478 130889 189026 89099 199107 340335
16647 340335 282820 112313 76997 89042 -98640 -220309 -234940 -138845 -261688 -384414
16637 -384414 -264501 -182567 -187517 -229235 -334586 -219658 -201991 -45858 141832 256039
16627 256039 188682 114283 53612 -17341 -46629 -25111 -59886 -97418 -105026 -177209 -151245 -54886
16615 -54886 -162449 -197924 -271865 -382916 -525132 -413469 -227718 -218132 -30384 -42590 -50520
16604 -50520 -38889 -149199 -99677 99923 100499 125100 164527 131248 130202 124993 136137 103300
16592 103300 144583 206214 308347 272166 161493 150471 -24786 -32331 -65831 -84209 61912
16581 61912 56330 157 -74873 -151986 41650 129551 217713 263299 206941 197350 195262 81723
16569 81723 20821 57207 110689 201352 142066 119494 54538 -202822 -147900 41916 -11247
16558 -11247 -31909 -164725 -162447 -170886 -188805 -210979 -91847 -191009 -225306 -50154 -26848
16547 -26848 -57201 9773 -63 61787 75834 208843 221069 170693 44041 79864 174805
16536 174805 118862 133198 159609 43271 -112252 -300774 -312925 -216819 -12127 135765
16526 135765 60961 113057 24462 -105418 -120134 73804 -2703 -114304 -77561 -133600 -210392
16515 -210392 -81341 -782 -82651 -89589 -171815 -6335 126514 -48725 -270392 -319361 -118811
16504 -118811 -50587 -155766 -58846 -72106 -104648 -90668 -17870 51457 -86528 -272649 -298277
16493 -298277 -262404 -308148 -318257 -117078 -228162 -251033 -178731 35174 93626 -36483 -83342
16482 -83342 -223102 -297133 -331028 -275083 -177316 -255348 -148981 -95728 -234113 -322873 -172166
16471 -172166 -60343 -41185 -79261 -150928 -158500 -77666 -2911 -101020 -137100 -245755 -199025
16460 -199025 -30159 43932 77326 43238 12422 -1363 -7581 -39293 64627 61285 -121514
16449 -121514 -179772 -106832 -76382 66298 148135 190159 41662 -126760 -70825 -25701 102970
16438 102970 53082 -47049 -120286 -10837 -59272 82117 147247 74265 -67918 -38608 -106573
16427 -106573 -261373 -264245 -182938 -58130 38256 112663 55571 -6161 -136942 -195069 -142028
16416 -142028 -105271 -153642 23193 39701 -20705 -10173 -81090 -156570 -166741 -49799 -832
16405 -832 -34299 -107186 -173008 -34430 89633 91420 -26221 -64977 -276707 -219023 -229650
16394 -229650 -244896 -172202 -222951 -212800 -143599 -16679 -63490 -176879 -158009 -103080 -13072
16383 -13072 29357 -285536 -414885 -222407 -168519 -283881 -262673 -230568 -107077 -54819 105347
16372 105347 153838 137679 -25850 -254964 -326477 -313672 -178073 -85632 46178 89455 184552
16361 184552 94725 175767 207961 196837 150575 159672 227084 116401 -37661 -89501 -22349
16350 -22349 -154412 -210350 -265146 -300947 -290937 -134505 -68631 -16580 39756 139294 185467
16339 185467 292450 222441 139824 62310 27934 58172 84751 33853 90053 23451 -99077
16328 -99077 -81704 -110777 -117915 -86293 81029 159061 123398 88740 -1973 -81874 -153424 -34849
16316 -34849 -27842 -104613 -155097 -74143 -58394 -41029 -154914 -127148 -39157 40117 47140 48144
16304 48144 169288 196637 153991 106931 52761 81071 -1042 -116311 -200003 -204524 -133563
16293 -133563 -54309 83127 120234 158051 -32378 -96992 -190987 -272322 -175350 -65998 -151366
16282 -151366 -228100 -321545 -350453 -194203 -185680 -174419 -271490 -163388 -128026 -154503 -88606
16271 -88606 -146559 -311866 -265952 -166955 -114380 -132031 7602 220815 160362 -10500 -174008
16260 -174008 -111180 -173132 -216710 -164894 -65144 -18889 43375 107603 272818 137507 16830
16249 16830 -240350 -153322 36249 96443 21965 4581 -92150 -29707 -38005 -143327 -69446
16238 -69446 -51642 -25178 -47506 -11905 -30288 -50560 -72606 -28876 113322 306834 314051
16227 314051 282803 216153 160972 109795 -6458 -76802 -74879 -212670 -186348 -164854 -53147
16216 -53147 98079 219933 223719 110460 -97311 -63036 170324 142147 -12969 8767 106272
16205 106272 113959 278366 212034 -1006 -144112 -105078 -5396 32670 117496 184402 127841
16194 127841 -89442 -233666 -156089 -10429 -19084 -88956 -173905 -200291 -171577 74426 195605
16183 195605 23906 -246728 -352660 -315989 -250993 -171354 -151578 -98597 52217 -127602
16173 -127602 -223656 -206573 -136149 -178122 -137902 -65391 -20159 152 17505 -2453 205573
16162 205573 81729 -89849 -54211 -40746 76884 57326 17511 -112642 -179182 -216403 -334969
16151 -334969 -162044 -73187 -143010 -167750 -277091 -361722 -336976 -258630 -99868 11961 -69671
16140 -69671 -102705 -143122 -49520 188946 175766 75521 84587 25429 100785 252902 255941
16129 255941 251003 134728 99675 86204 152905 119626 104222 183758 190023 7352 -125377
16118 -125377 -251099 -256664 -286898 -191022 80985 108254 -141868 -198931 -133701 27508 -2958
16107 -2958 -17217 3604 128269 119655 74853 31745 -18118 -72211 -13991 160910 144178 -41790
16095 -41790 -195551 -123748 -60023 15194 -28403 -191332 -229600 -217451 -302641 -310568 -135602
16084 -135602 -101195 -190086 -205171 -227622 -170143 -115885 46682 204423 369506 217465 153553
16073 153553 78190 -47995 -137433 -231203 -142885 78464 166309 212213 391974 300784 157993
16062 157993 81532 130975 75759 78131 212645 204427 134778 5429 -22814 -119268 -251744
16051 -251744 -158062 -68624 -105688 -6878 87281 -32170 5135 -49249 -78575 -48027 -67149
16040 -67149 44340 -146525 -141635 -178295 -113689 62559 158777 215368 1276 -109796 -7559
16029 -7559 -34757 -108610 -125351 -71727 -10308 -114967 -245047 -182222 -135912 81598 64854
16018 64854 52068 -46317 -41628 30129 117884 156491 138136 131878 79051 -48640 14273 -46702
16006 -46702 -224591 -227262 -296208 -364393 -147793 -71658 -47107 -78323 -24995 -20215 -102630 -299419
15994 -299419 -331659 -202971 5092 61928 -40412 78899 -11319 -94065 -114006 4278
15984 4278 114268 92206 -53086 2544 12003 -57484 54359 180929 186072 168199 -57796
15973 -57796 -162590 -47921 81791 64022 -31514 -22931 59242 84962 -11121 -217469 -239092
15962 -239092 -8029 59671 -1945 -73195 -12925 125516 141731 -27450 -58691 109858 41467
15951 41467 -50093 -231327 -141105 -58303 -30426 -30591 -85699 -25852 -74583 -275565 -336694 -302341
15939 -302341 -386410 -265838 -40481 36461 1012 -70671 -275630 -219894 -42254 -15564 -121502
15928 -121502 -55126 47715 137733 200152 84005 2513 -259171 -391990 -369267 -258010
15918 -258010 -304199 -53335 127915 94697 -186832 -106210 57496 130518 8131 -22258
15908 -22258 -94904 -37039 23601 125568 -22559 -143514 -36563 -97052 17452 47209 -65125
15897 -65125 -159932 -127887 -42374 -61360 -44833 -87492 105321 144161 -107198 -257752 -185753
15886 -185753 -172783 -210239 -206310 -163206 -200511 -104152 82139 134879 8137 -75009 56339
15875 56339 145295 148014 42237 101351 211193 77003 -59345 -93265 -158902 -166461 -191668
15864 -191668 -262006 -354357 -328572 -259461 -369453 -428728 -379406 -212760 35206 45910 29484
15853 29484 82098 130007 124319 247385 287439 304334 212979 119021 62214 144108 89897 -64149
15841 -64149 -118375 -135317 15904 55218 132617 191664 -18701 -148827 -57632 -101023 -150614
15830 -150614 -32393 -36666 -8819 -10385 -15933 -140968 -139376 22043 126674 101893 94279 -77116
15818 -77116 -5031 -92011 -88839 -23572 -65325 33564 -68013 -74177 48018 142935 290063
15807 290063 248939 172148 108365 -61256 -22729 53613 -34212 -20616 -50422 -261596 -181613
15796 -181613 -60490 -201088 -198730 -145681 -225327 -170821 65997 172727 114384 128178 -34575
15785 -34575 -66905 -27686 2068 23144 127779 161742 54544 -62943 -55023 -120011 -135062
15774 -135062 -112641 -2722 -84313 -41241 -21459 -54643 -86075 -88140 -237277 -227661 -231335 -223161
15762 -223161 -137535 -190924 -199008 -214604 -333874 -339336 -166915 -133710 -302985 -222976 -178991
15751 -178991 -318164 -347171 -213166 -61678 51249 115697 5923 -274481 -447144 -304288
15741 -304288 -196983 -231607 -321204 -270338 -324572 -363059 -328637 -329544 -264149 -376449 -419157
15730 -419157 -335034 -200547 -30559 -25488 -57018 -31548 40724 -204490 -233893 -211638 -108027
15719 -108027 -142496 -251709 -222075 -199872 -185071 -152046 -137472 -213433 -125207 -63127 -136823
15708 -136823 -131199 -169878 -169767 -327213 -345672 -310611 -378177 -289930 -186071 -214088 -335446
15697 -335446 -293437 -284975 -369212 -380196 -289549 -172011 -101048 -107997 -27661 259331 89056
15686 89056 -113506 -127686 -93486 -19287 139257 71640 -19839 -37632 21783 80932 243093
15675 243093 311797 200653 182512 250949 236584 317673 357019 161970 -105590 -200285 -160984
15664 -160984 -196866 -207438 -141084 -28610 50026 -13468 -136469 -221518 -193888 -180971 -89074
15653 -89074 -238747 -489859 -409779 -309546 -290224 -127586 -27355 -24293 -75975 -69006 -48313
15642 -48313 -10769 -69626 -99515 20241 15900 -12595 10553 -114944 -94979 40204 598
15631 598 -108532 -270964 -366327 -420992 -210616 -9705 146286 253357 261214 298962 174192
15620 174192 71894 16894 11080 -18901 -137744 -359119 -229098 -56582 3786 -156974
15610 -156974 -255422 -104713 126666 188866 304581 315059 280233 81412 -56395 -65967 98773
15599 98773 101021 -185853 -261552 -20196 86641 -146439 -164271 -69603 -3942 80517 29178
15588 29178 -73287 -77518 -90029 33754 101239 -11452 -120656 -121609 -236747 -191853 -138310
15577 -138310 -118105 184984 58302 -70502 -94010 -183472 -106639 48781 -56900 -157978
15567 -157978 -132138 -39035 19263 -13673 -52639 -26286 -1605 -43184 12363 190553 282240
15556 282240 342664 55801 21191 24440 -38263 104393 136190 86141 -31383 24391 219312
15545 219312 185821 -31032 -115515 -148717 -92485 -69748 -148466 -261229 -199718 -46606 -63099
15534 -63099 -103613 -200090 -163865 -28007 -128083 -115960 -120571 -86623 -41907 71733 78863
15523 78863 -1534 -116435 -100493 135967 236561 47045 -81790 -154163 -213907 -222895 -219996
15512 -219996 -212797 -196983 -94566 -32331 -76628 -122757 -256527 -252898 17584 155839 140937
15501 140937 102017 58040 130040 -14380 -69141 -21702 2137 -177911 -370376 -465020 -491484
15490 -491484 -450681 -348452 -396389 -393230 -285199 -159071 -98437 -60107 -172007 -196247 -239669
15479 -239669 -281346 -167048 -81693 -92995 -132241 -218865 -336237 -334596 -326199 -159017 -43045
15468 -43045 125325 139731 67603 -35862 -143516 -36633 133737 165421 121884 168157 302162
15457 302162 163437 28936 118749 122663 -30413 -96052 65897 114177 56385 -44838 -40960
15446 -40960 75027 -75287 -216152 -187235 -210610 -104752 -172829 -238368 -187402 29957 70906
15435 70906 -65583 -45726 -82734 -205991 -297551 -193470 38623 113518 324067 181011
15425 181011 52075 69906 30954 -11636 100493 43999 -54734 -90588 -48776 80077 257483
15414 257483 335518 232645 149408 -10983 -160980 -91116 28173 51931 58105 161247 126779
15403 126779 38292 -87917 -108485 748 -123552 -268962 -336180 -177283 -17106 -68550
15393 -68550 -7167 -33987 -151248 -182406 -202231 -145245 -176246 -235202 -122903 -36041 -26480
15382 -26480 -17000 -122074 -74115 -106438 -167089 -279401 -266120 -256054 -176235 -112419 -48201
15371 -48201 58983 64491 -21672 58500 -41521 -256205 -345767 -270064 -151484 -154258 -73983
15360 -73983 -41049 -85279 -187058 -125168 -39989 -115103 -226087 -154898 -116520 16746 198137
15349 198137 257771 151360 12278 -32289 -86837 -82768 -222761 -155657 -125178 19941 120994
15338 120994 108912 -125301 -252557 -200625 -45708 13805 16569 14373 93374 -8866 -116491
15327 -116491 -5666 -5451 63495 -73369 -258298 -406872 -282072 -195282 -249045 -305805 -182625
15316 -182625 -112130 21005 174775 284838 126964 4222 22801 -102634 -186280 -193053
15306 -193053 -94980 -55493 -212861 -118900 -17209 -112905 -120123 -205767 -124112 -96644 -109667
15295 -109667 -100362 19807 -26627 -47895 61118 94715 -16168 -35404 -56947 -155862 -138901
15284 -138901 -68120 -90208 -235226 -265615 6391 145864 123134 98864 115067 105887 64161
15273 64161 16342 97912 196591 183170 42440 78080 8083 -156507 -160517 -187180 -191869 -48098
15261 -48098 3081 -102205 -78900 -197980 -215884 -76547 -67974 1732 70786 -24974 -166541
15250 -166541 -110488 -14853 -158025 -191271 -137716 -17363 -18789 -102202 -134152 -93553 -205760
15239 -205760 -337799 -276544 -128607 -204468 -340709 -485077 -395215 -299052 -113080 9892
15229 9892 -99533 -207893 -91156 -9739 -164621 -240608 -292269 -266841 -270382 -400217 -309059
15218 -309059 -224343 -229504 -247314 -270696 -156168 45602 92718 220099 227821 96465 124278
15207 124278 214154 243127 210100 146252 116098 -39011 -115788 -151003 -68145 -33607 -51942
15196 -51942 -105050 36327 14403 -50393 -115796 -109465 -198503 -224511 -151556 -4982 23713
15185 23713 47812 214730 191863 146276 75030 127496 210371 355299 275348 126980 112858
15174 112858 186003 172183 -10966 -218871 -306449 -231299 -135138 78898 92004 93531 -26151
15163 -26151 -110312 -306016 -533391 -548931 -430832 -356021 -209243 -32444 7086 -35462 84765
15152 84765 27303 -70349 -142236 -227808 -213892 -232817 -240318 -188408 -252523 -122423 -86027 -206749
15140 -206749 -164760 -133138 -116303 -117013 -177671 -191235 -79803 -3561 -151882 -273102 -274716
15129 -274716 -82859 7883 -61416 -39246 -192815 -297096 -101084 -10 27427 -27970
15119 -27970 -37302 -65640 -104189 -110440 -25811 73963 116678 76984 -38635 5173 -22924 -4370
15107 -4370 9897 -23274 22415 64004 -181741 -311115 -284648 -97864 -85423 -222847 -402272
15096 -402272 -421984 -458422 -406094 -276437 -262588 -190162 -135346 -264052 -279817 -203121 -107754
15085 -107754 70090 186091 6904 -167364 -60936 186711 116562 -31287 -90997 -162336
15075 -162336 -195548 -159544 15572 22864 -74717 -104231 -197594 -213072 -115427 -50707 -157922
15064 -157922 -284899 -178112 -130111 -253492 -196937 694 -30448 -134766 -184640 -105150
15054 -105150 -118889 22251 48352 -131308 -182466 -239218 -108947 -80031 120374 248730
15044 248730 102773 35865 -36824 -135191 -211601 -246866 -95363 101687 116119 79559 77635
15033 77635 106388 133258 64544 -89221 -227828 -147535 -56909 -83414 -23165 -48445 -131232
15022 -131232 -319933 -358918 -220395 36911 59342 -85249 65626 226583 282117 161638
15012 161638 44285 -31890 110644 107635 190978 167845 100005 48700 120977 196630 95893
15001 95893 6217 3936 -88291 -186891 -273511 -265354 -200396 -293403 -192191 -128426 18004 88953
14989 88953 71986 177438 12596 -209494 -284763 -342301 -268969 -223668 -154592 -153048 -95304
14978 -95304 -188473 -37707 -89769 42600 -55575 -48761 -165989 -252723 -261478 -134415 -99336
14967 -99336 -135977 -8264 31274 -68742 -47729 28751 76498 161487 125296 56988 6039
14956 6039 -12243 70733 84760 102539 -23664 -47123 26116 67234 -121717 -211417 -123417
14945 -123417 -161931 -274495 -318128 -234894 -241102 -369907 -222356 -190444 -219505 -144919 -232178
14934 -232178 -386243 -349055 -227419 -290573 -208779 -27389 91246 -57704 -266403 -349954
14924 -349954 -438279 -486819 -349069 -121218 -71203 -76828 -21717 113516 115505 -2497 97190
14913 97190 237507 163856 17007 -136324 -230676 -190676 -46781 39501 -139812 -237030 -211637
14902 -211637 -165919 -108814 2481 -21325 -35619 -87570 -257643 -321068 -334542 -169426 -130183
14891 -130183 -65233 -90656 -143524 -201333 -244852 -295482 -350749 -299831 -183045 -229964 -187818
14880 -187818 -197026 -66502 -182686 -190068 -84246 -17195 137900 5970 -133482 -276670
14870 -276670 -265119 -208924 15048 155366 -8530 -211708 -242083 -105566 -128091 -121186 -198775
14859 -198775 -154200 -272934 -191000 -85779 -82065 -274729 -261377 704 32018 75009 32307
14848 32307 67868 105703 188698 229509 6524 -177885 -88814 -82611 -230269 -287558 -370888
14837 -370888 -361061 -376248 -287934 -197420 -84485 -61229 -170434 -128616 -115872 -171453 -226464
14826 -226464 -262327 -93483 123767 121294 -37452 -92588 101576 228447 203662 55557
14816 55557 84386 83607 -9485 -181866 -74623 -47981 -57988 -131740 -151309 -137925 -218000 -364950
14804 -364950 -265879 33131 204219 16846 -6936 -30624 -171222 -163999 -135381 -264643 -138101
14793 -138101 -55309 70913 40799 -86392 -149843 -116779 40049 151066 163819 33342
14783 33342 -21381 3015 -17546 61116 49925 -114091 -285801 -298481 -213576 -147212 -118431
14772 -118431 6070 -54323 -244273 -240019 -342051 -244041 -272852 -246117 -273246 -287683 -274190
14761 -274190 -141708 -144010 -277589 -246543 -282117 -235546 -197917 -112346 -48796 17620 15744
14750 15744 -85066 -60854 -71368 -51335 -39184 -39164 -140084 -318357 -459233 -265497 -143891
14739 -143891 -88506 -73080 29649 147494 161715 -85098 -216291 -220701 -261081 -183194 -126567
14728 -126567 16928 115145 152987 49980 -139720 -140665 -184100 -254411 -184130 -60913 519
14717 519 -138848 -331855 -320642 -303575 -121809 11420 -29486 -176433 -218480 16699 13145
14706 13145 152812 310869 362644 331079 183082 108815 73264 -31367 -116840 -44423 46907
14695 46907 -177478 -272977 -305897 -339860 -283258 -197896 -72414 21817 86878 4056 -7427
14684 -7427 -1027 -126538 -236044 -309522 -283476 -107435 31862 31166 -6831 9761 -37816 -64105
14672 -64105 22204 -117201 -279461 -229600 -23644 76493 47546 88248 209865 266393 169423
14661 169423 -46327 -69401 -167255 -151494 -257236 -192403 -148851 -78744 -74273 -107167 -179274
14650 -179274 -87203 -9850 -43819 77153 65227 1077 101731 7586 -97944 -84858 -55604
14639 -55604 -95613 -98717 -101292 -44555 -122957 -177320 -239013 -286480 -192092 -108494 -34935 15897
14627 15897 -105511 -183592 -193356 -229065 -280703 -310141 -431460 -420589 -303490 -139827 16223
14616 16223 97078 -2293 14904 54537 -120828 -130244 -25768 16800 31223 73263 183761
14605 183761 -7033 -225157 -124383 -32740 -176752 -275112 -254658 -274160 -270177 -57461 -54584
14594 -54584 -59933 -52375 -113614 -193756 -175684 -154136 -58231 -156479 -156478 -160564 -43796 -56403 -176456
14581 -176456 -240036 -249951 -253567 -243377 -164597 -96224 -94817 -258982 -92325 32513 -47688
14570 -47688 366 76975 -64455 -321679 -480493 -291900 -73155 -219028 -149922 -21058
14560 -21058 4490 13313 6644 91874 13245 -106209 -68902 -179186 -158624 -144987 -13654
14549 -13654 26664 -39214 -138966 -65479 -99345 -196424 -6713 202071 198544 180198 137366
14538 137366 111261 59092 -137596 -274546 -221072 -228544 -379711 -397279 -196619 -91582 26280
14527 26280 910 -65599 -65711 -13351 17252 -27723 -188115 -278873 -161206 -145425 -200450 -163080
14515 -163080 -277049 -69864 -100704 -271978 -381197 -266371 -63392 -142937 -181930 -248344
14505 -248344 -115527 159099 154425 -84710 -174505 -83955 -37905 -141040 -87909 235792 74039
14494 74039 -170764 -304196 -237822 -77339 -59688 75182 1002 27023 89855 174060 303964
14483 303964 240089 101452 136938 68888 -176534 -162185 -4785 165080 233732 186135 173520
14472 173520 210926 166970 67995 76891 266443 289312 411966 383152 129723 -94130 -61808
14461 -61808 -8673 -39730 -15083 5812 26660 96893 17513 -290640 -452980 -543724 -336673
14450 -336673 -263736 -91059 53510 -13680 20894 -41244 -54661 23506 -3541 -108531 -218510
14439 -218510 -316951 -278690 -90047 -88328 -130951 -179418 -174681 -206952 -133063 -30926 -87906
14428 -87906 17988 135201 198891 185728 -85797 -221823 -217589 -326821 -391618 -346878 -132340
14417 -132340 -87682 -258665 -306529 -419118 -545930 -344918 -187733 -213187 -13676 176166
14407 176166 33345 -125697 -119210 -173300 -75326 -71750 -74018 -99887 34917 41450 212404
14396 212404 35355 15651 58226 112110 -23348 -150935 -257169 -202587 -103229 81601
14386 81601 325819 124989 -76217 -181329 -313891 -277015 -207494 -206894 -201062 -40924 35940
14375 35940 -91087 -75419 -174843 -54777 190031 203114 81636 26690 6084 212038 307394
14364 307394 238478 52421 -124264 -186819 -166651 -159192 -44243 -203037 -246023 -111725 -179233
14353 -179233 -236142 -179777 44377 207649 -44275 -7740 -86034 -262377 -325906 -171065
14343 -171065 37542 98753 18944 126909 262214 145035 89108 64735 -20264 -95573 -84796
14332 -84796 -28239 -77469 -162623 -142627 25695 -8482 -97939 -127550 1100 35360 -121929
14321 -121929 35554 64163 -103946 -33443 138454 -9270 -123324 58 260346 257738
14311 257738 216156 173293 44076 11413 70853 225753 97401 8676 3675 26696 10882
14300 10882 -44273 -65968 70545 137904 91534 48727 -99583 -172087 -178785 -110298 -217670
14289 -217670 -372922 -173444 -100197 -23673 -75527 -109789 -161704 -188390 -69295 121976 -31395
14278 -31395 -137824 -155798 -188355 -308715 -371382 -250714 -175638 -207614 -233518 -256395 -226821
14267 -226821 -249614 -200719 -229212 -206588 -52320 -56205 -244080 -221761 -256639 -208593 -92739
14256 -92739 -83537 -275840 -403451 -332637 -185712 -95784 18206 104286 89759 -103694 -31355
14245 -31355 -33539 -30092 -267273 -299976 -225016 -92420 -248487 -351649 -272635 -360905 -238769
14234 -238769 -241864 -272766 -184054 -111392 -69438 -126952 -4304 65183 60026 138853 210005 200695
14222 200695 169199 138363 -40203 -25047 83808 189360 271183 167808 140758 131551 -36852
14211 -36852 -217682 -143718 -215038 -193940 -163713 -165490 -283182 -364597 -256438 -177453 -35458
14200 -35458 -25933 6510 9176 -224168 -274310 -55844 30546 -89174 -342728 -257660 15894
14189 15894 87659 -43179 -386250 -643120 -637746 -582980 -270419 -159870 -177584 -242413 -156140
14178 -156140 -107239 -132722 -192467 -224534 -175974 -117244 93280 75521 216158 190835 160257
14167 160257 83296 -52516 474 -121626 -90958 -62051 -30975 80014 178352 219239 354048
14156 354048 453282 369198 242383 32442 -37225 49659 120492 -54312 -219263 -43832
14146 -43832 212031 116554 177915 -43472 -263279 -135108 -14265 40865 69335 42966 42471
14135 42471 -88086 7190 79806 153124 -25762 -87964 -147974 -85448 130896 80629 -20737
14124 -20737 -34207 -73317 -143252 -270816 -331340 -172416 -105762 -197534 -189874 -104580 -74050
14113 -74050 -19119 107240 116505 -191062 -225739 -177385 -174530 -40094 -160876 -241269 -132448
14102 -132448 -87591 1764 36426 -71659 -95725 -16842 -33303 -243162 -122747 -4498 -92104
14091 -92104 -131377 -145952 -209718 -246596 -267812 -154888 -11226 -138338 -122840 82278 159663
14080 159663 61519 -30183 -46842 -137380 -30926 175717 248555 248098 248803 324902 133073 -45546
14068 -45546 -108516 -214453 -29042 -9103 96762 90741 -19082 78879 -37956 -120369 -163193
14057 -163193 -215396 -84829 -128548 -338709 -349281 -248249 -207065 -26225 -55114 -72938 5980
14046 5980 53666 -21445 -126281 -201513 -117198 -70352 -159828 -109616 24740 -9505 -13269 -100777
14034 -100777 -78019 -137948 -129219 -61809 22454 -124703 -334678 -274198 -191012 -59428 43609
14023 43609 -103990 -217235 -199654 -197664 -103486 -76239 -164053 -102406 48449 163686 260807
14012 260807 218691 258530 223847 175346 265230 179118 51368 97392 269136 380592 261235
14001 261235 199906 97999 -50879 100378 234347 342786 356340 333883 157545 47445
13991 47445 71609 -76545 -57256 -49180 -220178 -229285 -91877 -54720 -47167 32283 91312 58614
13979 58614 -106380 -67858 -120156 -211727 -200923 -61479 229463 290466 267940 273831 151935
13968 151935 18936 -110178 44 -44727 -42712 21491 -80590 -76703 -6651 57131 144561
13957 144561 123249 -16396 -130345 10967 144094 264257 209774 340983 305576 300458
13947 300458 202097 161563 82311 142217 84229 -56934 89030 135646 209122 195860 234012
13936 234012 189036 -46819 -34558 75707 17220 146638 261051 190369 130399 129486 161813
13925 161813 214037 87782 41734 48984 49203 123067 58359 149298 -23926 90400 221577
13914 221577 192986 40420 -179112 -308979 -170602 -32123 -122466 -51254 -6125 -8344 -93989
13903 -93989 -35386 79013 -27387 -214406 -139675 -49590 -215795 -326793 -240148 -29502
13893 -29502 122834 145825 170110 244476 144827 6271 6739 37554 149807 114449 42460
13882 42460 36920 187857 65776 -57718 -196961 -262628 -20534 87805 -187777 -176092
13872 -176092 22318 27008 -56843 -74129 -15569 -34195 -110990 21525 -35710 -84036 -36296
13861 -36296 55186 6344 -89924 99143 241996 161220 63401 -22 -84997 6441 8419
13850 8419 -91945 -70745 26603 75859 113577 54260 -3980 -89150 -69711 -210920 -318876
13839 -318876 -233378 -44756 85788 47050 27193 55098 -64068 65996 80704 96360 27808
13828 27808 51182 116478 118283 116336 289741 284196 173503 322535 343611 354221 153746
13817 153746 -13258 -104692 -124083 -158320 -117600 -100624 -246881 -285690 -365219 -319949 -260913
13806 -260913 -283773 -239936 -156285 -139743 -26832 -125377 -32705 -34532 -101323 -89256 -40569
13795 -40569 -40486 43511 130163 134300 66828 70108 45661 -13137 119501 51296 50770 59905 7373
13782 7373 -109470 -27615 77613 6029 -208065 -189128 -68052 -96132 -153755 -139247 -235916
13771 -235916 -302455 -174818 -152105 -152777 -130765 13654 18190 185521 278134 266639 233756
13760 233756 173529 267921 138827 34542 105253 330090 339566 78584 47861 261057 424086
13749 424086 390696 244323 384797 324230 146190 83661 201966 166730 130634 80260 -6358
13738 -6358 1131 123047 350254 309184 278956 290914 337457 208408 191437 260532 493148
13727 493148 646845 548441 675856 755971 867070 908984 1102029 1351185 1462713 1448990
13717 1448990 1584084 1487884 1511957 1412512 1568866 1523442 1435120 1355272 1219776 1110628
13707 1110628 920161 906256 884396 671277 636157 732262 794246 681046 510167 450911
13697 450911 422821 527821 463840 468092 473613 289912 233846 154353 156210 97171 239797
13686 239797 252242 143950 59590 97412 186987 281505 318496 214134 115358 201658 379287
13675 379287 518799 426757 241305 240991 415788 349586 217801 78269 66807 39542 -3944
13664 -3944 -80987 64685 170038 304263 468758 242346 108903 33566 -140642 -133615 -20356
13653 -20356 199935 334400 263624 98138 47888 -50729 -34123 36762 18961 40811 81740
13642 81740 120102 36362 90281 341478 433191 437045 533964 518928 467911 613461 571528
13631 571528 475846 435928 229274 223137 243065 127785 141979 221130 334950 222844 118769
13620 118769 180519 189993 284028 369570 228925 368866 442160 400528 178325 9060 101591
13609 101591 -91876 -187313 -139583 -89162 -52272 3909 196445 241312 291336 491249 355260
13598 355260 145560 -2974 -230379 -213574 -146414 -166002 -51582 -5350 -75651 -30701 12095
13587 12095 90437 167591 172426 267973 270791 128385 89183 13051 36313 155370 25769
13576 25769 148180 213610 173649 99345 90108 78387 158851 112650 -4715 -4799 -93642 -89456
13564 -89456 21794 31367 115660 43808 36247 62627 -24653 -61553 -166721 -194607 -132619 -35598
13552 -35598 62944 152498 330628 251555 137917 197090 132628 102019 144040 163792 230004
13541 230004 256432 365943 512636 400439 308180 450718 401880 324197 191775 65771
13531 65771 167728 135337 276775 392500 381370 134833 1705 159736 202026 173090
13521 173090 167038 358262 476289 490036 460503 434568 369301 422857 475478 417356 268233
13510 268233 221019 422993 296204 210638 269215 336282 277555 123901 45374 197585 403184
13499 403184 561011 409599 285193 294445 339221 226703 92846 97171 -29914 -126092 -86545
13488 -86545 145145 185620 103421 131281 45918 179300 333996 302087 180841 155966 355795
13477 355795 243136 169536 76289 141435 197761 194633 206163 219876 278255 359981 314003
13466 314003 378065 414132 450131 390750 543796 544218 473126 538105 477305 322877 160224
13455 160224 294624 461600 515270 535406 529689 546357 600279 585494 421332 307630 492302
13444 492302 542270 502136 457427 440496 435340 314881 238358 476435 605316 525005 643099
13433 643099 668237 608266 422990 263926 320305 575642 581597 658587 608979 585067 622124
13422 622124 650961 568155 386524 286207 365130 562220 456940 460506 560993 703542
13412 703542 600779 444103 321773 298252 407953 519670 632940 745941 700307 786025
13402 786025 782040 812117 986337 1111542 953521 988518 1008578 1020266 957609 922451 1050255
13391 1050255 1146068 1275661 1635923 1821299 1679902 1667023 1616375 1701769 1570409 1488364
13381 1488364 1443674 1472610 1614217 1754720 1721714 1633204 1549379 1444868 1481190 1476933 1435890
13370 1435890 1499200 1502040 1637707 1753899 1641074 1646726 1791931 1864093 1883031 1940099 1996363
13359 1996363 2050172 1938677 1996047 2129669 2220989 2126078 2038081 2000389 2093439 2201550 2244518
13348 2244518 2326083 2230510 2195409 2354195 2328778 2412892 2642318 2671611 2608694 2732188 2825993
13337 2825993 2841345 3072818 3125634 3095244 3105248 3375615 3555938 3526638 3659114 3854575
13327 3854575 3980668 4087683 4048861 4122902 4325528 4418659 4556207 4760915 4987340 5278214
13317 5278214 5426726 5747284 5885039 5865943 6161671 6418384 6699797 6961941 7317117 7730817
13307 7730817 8135012 8510989 8874707 9346362 9905820 10451543 11015840 11614222 12243178
13298 12243178 13071063 13975314 14685042 15688348 16883746 18025096 19384953 20836244
13290 20836244 22614551 24490461 26501193 28983775 31931014 35087552 38612597 42609843
13282 42609843 47354684 52863540 59051977 66314126 75054378 85496895 98102861 113018979
13274 113018979 130828183 151662068 175351284 201309314 228098079 254633899 279771873
13267 279771873 302575388 321658432 335721948 343671184 345128885 340619544 330738567
13260 330738567 316373560 298040544 277016274 254823693 232805298 211777074 191946635
13253 191946635 174083675 158073799 143989986 131642680 120719869 111232731 103024750
13246 103024750 95654694 88903852 83024008 77606226 72621566 68181574 64183186 60625608
13238 60625608 57332374 54268547 51348111 48583048 46260972 44147490 42124093 40100666
13230 40100666 38222051 36621106 35069321 33700783 32467549 31317378 30107446 28866720
13222 28866720 27828403 26770783 25849439 25112498 24407434 23625977 22861043 22162491 21485937
13213 21485937 20742815 19999069 19402125 18909982 18493423 17981540 17551654 17180469 16748948
13204 16748948 16276328 15903645 15488552 15276406 14981726 14517011 14071576 13710773 13321901
13195 13321901 13005286 12701443 12352988 12050457 11753877 11453790 11245213 11174791 10939114
13186 10939114 10422650 10179836 9987673 9843368 9643454 9412999 9285353 8996557 8668836
13177 8668836 8355316 8149489 7942493 7711309 7474301 7293723 7342763 7223405 6984796 6807784
13167 6807784 6597626 6404779 6177654 5983256 5829056 5692067 5562444 5383404 5151621
13158 5151621 4907975 4888441 4921204 4832821 4735608 4713189 4638115 4623108 4659371 4690982 4584661
13147 4584661 4410885 4046565 3798450 3840811 3938865 3802775 3723424 3710276 3822799 3795985
13137 3795985 3742960 3730853 3603963 3309759 3295353 3206506 3222277 3185255 3084146 3001254 3080794
13126 3080794 3202406 3265240 3193777 2996962 3083163 2961625 2840254 2679401 2615936 2566894
13116 2566894 2441767 2394082 2387471 2254851 2104442 2109566 1947773 1917558 2101017 2010706 1976403
13105 1976403 1855965 1927265 1938371 1941669 1825425 1732685 1660636 1650913 1714382 1543841 1472816
13094 1472816 1373895 1321574 1214152 976721 817373 785494 843201 1078427 1213994 1161983
13084 1161983 1005560 869433 856262 766746 613069 515363 555304 387676 370036 553154
13074 553154 603797 555527 404360 492178 700566 763693 610738 463988 550778 786070
13064 786070 841453 1002878 1110983 1059555 919485 939952 1017679 867924 767556 772801 728428
13053 728428 806506 714389 709012 757910 831149 988352 1158711 1094449 879432 877510 751716
13042 751716 809014 1024535 987861 923149 947555 800619 680022 769755 790301 711475 700080
13031 700080 645479 562552 621568 733713 705700 601778 678565 725897 795298 849964 789432
13020 789432 572105 515606 644775 797082 813543 660786 493518 415339 485325 564291
13010 564291 562912 610089 569088 386387 376429 386785 488217 676283 637800 564325 444639
12999 444639 372636 538169 516321 444309 625861 578151 545435 569433 587749 772341 780426
12988 780426 666532 706323 602771 682201 634857 535987 360872 425052 537726 543042 392404
12977 392404 434108 472312 413268 580833 754587 715512 493363 514083 593209 533431 433431
12966 433431 377317 383173 258325 249214 265547 165954 74851 142679 137014 -16849 55454 48032
12954 48032 -24272 -19118 -5738 -108389 -154611 -79766 -6231 222407 329803 163863 46176
12943 46176 -29539 73897 168567 188519 271250 304597 269640 250106 260454 183929 263859
12932 263859 270114 390047 389994 238219 116713 131523 130307 163770 232414 383162 431139 396241
12920 396241 390529 175271 72856 230527 509956 505565 634483 612284 315438 324608 317982
12909 317982 157689 138314 82617 29609 151299 225774 428738 465108 502258 553074 624682
12898 624682 503873 379271 405511 451162 441740 321172 178005 8390 7274 12508 -16117
12887 -16117 83676 157754 266611 186306 199457 104030 94886 -83733 -118248 -26991 147380
12876 147380 138552 200345 261512 359703 297435 164136 25773 -77051 -146194 -128847 -56364
12865 -56364 127830 237242 232508 178382 71887 85195 155090 328398 352103 377544 361497
12854 361497 274250 488700 420317 159264 304898 413450 364597 300419 305730 323483 186273
12843 186273 68404 64101 149012 164175 213572 271940 296345 250316 112266 106376 147375
12832 147375 223585 208903 192010 325258 353363 346177 294547 390331 344917 380263 413981
12821 413981 344843 391815 424915 413655 453099 580236 794493 1003352 1106499 1320351
12811 1320351 1543026 1463292 1414117 1531145 1560834 1722273 1843618 1852010 1814753 1815873 1860017
12800 1860017 1729317 1570829 1600100 1686948 1681623 1613766 1325325 1100360 923034 908656
12790 908656 840503 851911 725599 555537 510624 565681 514561 447674 486070 340154 104748
12779 104748 64986 340250 479339 381821 200044 226513 284681 283019 196196 211672 124201
12768 124201 255731 179731 58808 22050 209632 389382 345047 430306 423711 408415 466823
12757 466823 357395 315079 272382 108724 220190 359804 265405 127416 -9670 59836
12747 59836 121384 255604 223700 59234 -52244 -35565 119810 62072 -40079 113435
12737 113435 272916 230368 127806 9072 -62828 4997 -43776 -73340 11291 -16185 141382
12726 141382 166909 161629 114616 -80724 -56407 -6786 -41421 -86070 -27034 79742 36931
12715 36931 63502 93664 111981 265215 240260 149456 224339 266639 138864 108970 48396
12704 48396 -16415 7733 119791 181305 139103 94454 179820 220876 91535 116052 127620
12693 127620 -148324 -81201 99625 224568 235688 209226 103769 143433 108614 91904 165156
12682 165156 206590 141056 -48562 -84883 -50220 -99254 -187227 -191082 -138247 7332 89469
12671 89469 43346 80701 153008 131919 76202 -26156 114764 208718 217641 207095 177345
12660 177345 221264 394730 391780 482584 499604 407572 136398 -93517 -208278 -214062 -2923
12649 -2923 132783 260548 205742 80830 41591 -81121 -150342 -165743 -184285 -7895 301772
12638 301772 233178 -36393 -206974 -231036 -66173 20689 -158287 -235890 -244771 -82116 80608
12627 80608 197601 221219 104963 -13756 51816 49419 62795 118069 37465 32504 71253
12616 71253 151470 77277 39923 129508 -36525 -136423 -84699 -87037 -46615 120755 32521
12605 32521 -144512 -230630 -317970 -187339 -2456 1751 52034 128905 78568 93047 119931
12594 119931 80257 15273 -126673 -56056 158796 381746 157672 97447 -25132 -163841
12584 -163841 -322831 -335345 -129068 69155 155131 234649 287553 251811 150985 155100 184589
12573 184589 121225 48607 32727 -5584 -54834 116452 184980 200187 80252 -137000 35883
12562 35883 192438 209578 131215 140977 7622 -178461 -97264 -85334 139052 252060 180592
12551 180592 24849 37363 118991 149746 295964 170401 -45266 -180211 -109621 181114
12541 181114 376360 338828 231413 74634 348311 348850 199097 129233 -90700 -250732
12531 -250732 -118829 -64056 -69410 4155 -37218 -25236 180656 296363 84490 62011 18369
12520 18369 -66751 35848 -43107 -175280 -107361 -63016 -59887 -220139 -225076 -142327 -12552
12509 -12552 -50464 -122119 -119342 -81910 -123256 -118234 -103352 -62937 -86498 -42074 -86166 -83719
12497 -83719 -107570 -56520 183427 299645 257818 15310 -223689 -74383 86505 163121
12487 163121 -16386 -131463 -148519 9560 236809 149923 -14026 9421 -56178 -62419 95409
12476 95409 240427 129704 25526 -52792 -64676 46435 176678 166372 16074 74262
12466 74262 115939 51372 127828 248850 313527 396642 430839 272501 97599 -15811 59387
12455 59387 81578 -52381 -66951 -23347 55136 78727 112427 238092 256612 170661 -23275
12444 -23275 -57042 70993 186829 137409 1256 -94241 -153584 -161353 -283833 -131208 -17969
12433 -17969 -9787 63365 14979 58541 116185 1591 -170470 -260070 -305043 -297804 -295980 -153981
12421 -153981 -140500 -153181 -144146 -171093 -219121 -158163 -337922 -364914 -120638 30143 224615
12410 224615 208124 87233 -24952 -84626 -49029 182847 76604 -100812 -246444 -203118
12400 -203118 -105420 120900 92891 -52610 38444 38706 -1342 120083 -4649 -226721 -103247
12389 -103247 35923 -67539 -157924 -74854 -55728 -60042 -22358 -11136 -21846 87049 76626
12378 76626 -125084 -165483 -270653 -322314 -268799 -151750 -190670 -7912 113210 89011 64980
12367 64980 -126850 -156806 -30783 79043 -4581 25714 172464 166632 164314 -28266 -132366
12356 -132366 -86112 24409 13681 11839 166596 243840 37253 4230 -11267 -126789 -92457
12345 -92457 63153 162520 142108 -13054 -12591 58975 121282 282738 245227 958 -167110
12334 -167110 -128610 -22291 121883 240241 380533 196061 173614 100999 80490 -27777
12324 -27777 54156 20371 -94371 -139751 -77779 -128676 -233300 -164571 -235623 -164310 -8231
12313 -8231 72112 -23423 -16345 -75735 -86628 -16708 188316 203563 182858 193629 232137 270256
12301 270256 160191 62529 -3716 -77507 17181 188196 182766 78347 95012 84823 34605
12290 34605 17052 31289 40927 3164 27073 78567 78945 15297 -28688 -120980 -140817 50633
12278 50633 -26925 -86699 -19525 -65778 61151 314208 211185 39148 -196741 -244542 -77582
12267 -77582 155879 256674 146575 -173347 -231506 -166585 -250341 -72116 173401 41554
12257 41554 5354 96152 30877 90315 179735 161659 243439 209825 199036 253969 231446 319639
12245 319639 175809 46327 -46042 -135174 -179290 -57872 88160 244094 317522 432935
12235 432935 362030 300852 271295 365254 329738 346021 344122 246023 24282 12219 23011
12224 23011 56723 20246 -20463 55308 62719 26063 105097 24591 -90583 66497 219475
12213 219475 223026 -3777 -17665 -65097 -72155 90561 168752 130789 136486 135964 175607 98860
12201 98860 70499 138926 226576 208809 378532 285542 166643 181390 180617 146875 258502
12190 258502 482137 581406 483646 535687 525420 546435 563277 485215 327568 168171 168520
12179 168520 296206 341088 294388 147701 208537 332230 476808 461057 476465 419085 539385
12168 539385 652183 637511 669477 657622 672036 612577 419514 400359 457773 360230 168706
12157 168706 285184 144994 -65532 -73959 -25990 106711 2939 136380 351993 309073
12147 309073 208952 168972 207059 104292 81523 175688 231646 106477 58483 164337 282464
12136 282464 167285 106737 276344 281578 388757 509644 488179 539757 598063 747334 912407
12125 912407 986551 901551 836688 832986 902974 926652 847813 715742 686425 821422 772074
12114 772074 638243 563619 698932 838941 804837 618628 553254 753801 775943 598472
12104 598472 423338 385710 397685 399478 355263 278602 370375 257499 85711 164014 223509
12093 223509 338471 458156 385766 418480 484482 669664 758170 733952 717539 735674 804155
12082 804155 710611 477175 522727 488283 560135 535964 694606 878141 839914 914650 857654
12071 857654 756190 882015 1047511 1106454 1098698 1216951 1210758 1216955 1276148 1275257 1358739 1481672
12059 1481672 1662398 1591138 1504310 1534177 1488680 1415134 1415984 1350734 1328780 1465382 1670841
12048 1670841 1588190 1349059 1373898 1459948 1439642 1444116 1492124 1632002 1625428 1357251 1425450
12037 1425450 1596477 1432477 1503388 1676501 1787471 1800137 1768148 1818767 1969224 2017445
12027 2017445 2023659 2188151 2148953 2079839 1956425 1949898 2020730 2033388 2171449 2281370 2350078
12016 2350078 2195331 2130789 2225386 2140661 2254891 2486416 2686153 2804887 2852293 2647244
12006 2647244 2681385 2695610 2798482 2861752 3072731 3409478 3387788 3321729 3490804 3586303
11996 3586303 3736645 3763135 3761823 3813121 4075251 4304512 4390746 4500214 4791369 5154416
11986 5154416 5262387 5257676 5506746 6013620 6413152 6756899 6889061 7049283 7454846 7840204
11976 7840204 8035181 8421516 9075370 9577423 9991076 10532850 11261243 11930475 12611992
11967 12611992 13284392 14053941 14906917 15999126 17012812 18161705 19504218 21095854
11959 21095854 22820717 24672554 26752188 29293544 32043968 35083433 38486430 42716845
11951 42716845 47532859 53129884 59817279 67727829 76977040 88429683 102499605 119845684
11943 119845684 141428980 168268638 201742618 242736837 291497261 345721654 399946031
11936 399946031 447334885 483455582 507048643 517297337 513321820 494862057 464447194
11929 464447194 426903421 387055066 348105492 311532095 277860791 247483348 220742831
11922 220742831 197528177 177511473 160346373 145587692 133000728 122191092 112894965
11915 112894965 104798750 97753930 91283312 85373856 80013681 75244056 70876233 66904894
11907 66904894 63510365 60319750 57188865 54369531 51645606 49205156 46998235 44909697
11899 44909697 42988547 41172106 39366271 37729797 36350145 35015491 33842083 32723405
11891 32723405 31554921 30391826 29306794 28209579 27313398 26677039 25889971 25098757 24359392
11882 24359392 23679854 23057806 22620806 22000592 21257119 20594508 19964149 19316292 18758108
11873 18758108 18459284 18188089 17744563 17356834 16977370 16629560 16289886 15888866 15433923
11864 15433923 15029659 14548700 14326009 14001480 13703778 13473664 13139354 12880917 12790863
11855 12790863 12479078 12087475 11767478 11507461 11098632 10788998 10615012 10294111 9997355
11846 9997355 9856783 9557084 9242759 8803420 8448882 8180534 8064829 7869922 7701586
11837 7701586 7542766 7453432 7299960 7007380 6763999 6732021 6594060 6446648 6207360 6009214
11827 6009214 5988329 5824740 5641808 5671955 5759588 5722866 5528235 5343586 5227846 5103099
11817 5103099 4954344 4945426 4897866 4685676 4619060 4552205 4396559 4348528 4410325 4294007 4080317
11806 4080317 4097872 4161271 4256730 4103454 3958848 3775207 3648336 3549449 3606800 3399379
11796 3399379 3384155 3609318 3585000 3633634 3751923 3586221 3299897 3118079 3117396 3171255 3155415
11785 3155415 3045440 2836891 2522788 2380810 2424311 2439237 2446510 2395497 2399309 2205599 1994360
11774 1994360 2091349 2081604 2100092 2010501 1931985 1882415 1825786 1920996 1749466 1432971 1305202
11763 1305202 1365704 1390450 1314772 1357108 1359759 1360782 1328937 1395688 1325701 1409386 1561273
11752 1561273 1464821 1254292 1243348 1294121 1171647 1019396 977363 1072504 1097952 1002506 910484
11741 910484 1044145 1121216 1029159 996237 1030547 1103483 1005862 903757 1011840 1158251 948926
11730 948926 904717 702088 593820 830791 1015955 1160312 1318160 1237471 974879 924025
11720 924025 844637 745052 741840 888631 947309 979766 987714 1140247 1293892 1256850 1029445
11709 1029445 914291 949888 821365 701402 740367 830680 992287 1157087 1145030 1018598
11699 1018598 732495 708563 893108 870705 755074 713323 849703 969545 918939 621387
11689 621387 506023 591636 593136 511873 632180 467311 191175 293143 515035 664307
11679 664307 792530 919116 754298 615320 463296 545802 769948 916795 965000 1046689
11669 1046689 1091111 1071735 1130304 923325 745323 722982 792837 709368 688291 648184 577953
11658 577953 503116 608421 686458 791104 874375 787336 616406 664641 677391 612787 848019
11647 848019 940960 892694 958041 925318 934689 769478 542168 515767 633610 600759 613219
11636 613219 602627 631140 707722 644797 631938 567013 514894 614588 603781 627548 515986
11625 515986 478920 363835 453078 499903 572390 693769 607484 582097 617992 494983 551524
11614 551524 480909 373605 602612 605721 472201 371148 195852 177286 179825 208591 275767
11603 275767 184300 94958 60803 9546 92776 124776 142525 65306 53814 147608 51263
11592 51263 139920 150913 23071 137815 186423 429837 507092 484928 418969 467102 546857
11581 546857 528819 505553 607054 531289 537405 460602 325026 320989 115214 128814 18659
11570 18659 11909 132863 202175 282266 233929 144620 113528 221675 528010 530214 422482
11559 422482 382081 296204 277156 239248 273317 215165 150624 343948 465573 301208 398589
11548 398589 492881 393427 410138 421586 410223 424456 301537 306055 340027 347371 322727 358219
11536 358219 370728 344976 230390 175448 136291 64777 146650 184204 277247 168051 241053
11525 241053 51786 -91516 -59220 -70236 -70770 -67607 118008 257749 326900 348819 328439
11514 328439 166553 131387 194577 351768 215265 216877 373679 355988 430017 330073 161613
11503 161613 66492 130306 180129 186451 400361 466168 563624 477754 294638 143751 161067
11492 161067 108269 161967 234686 359590 302493 296936 395413 370163 287406 182253 145092
11481 145092 109818 244500 308447 300463 363871 382241 232621 227905 134868 150380 235099
11470 235099 157153 177923 236349 162358 187574 135708 211924 224757 129597 154464 38479
11459 38479 93908 84430 85440 203084 191397 94691 120346 22001 170725 310561 241873
11448 241873 250788 142968 27870 20747 173783 294953 132171 -22945 96627 305625
11438 305625 519328 459112 341124 376202 451031 484892 364244 326184 216910 184057 224906
11427 224906 158993 46604 -45532 -53925 -33051 35195 21234 70419 146601 181733 240183
11416 240183 203834 364294 367513 329785 114439 82250 130692 96051 66219 137735 198736
11405 198736 334994 230143 229751 360512 218771 246353 362943 314223 159963 178611 187840
11394 187840 111034 -170236 -309172 -209786 -120491 9738 -107842 -129833 46947 196776
11384 196776 300567 207277 80956 -13129 -69658 -188561 -134760 45885 276233 322789
11374 322789 141100 136060 -45158 -130637 92808 149886 331472 359422 258589 183902 197525
11363 197525 90586 -21318 14580 46420 191436 203819 71713 -101720 -94678 -22432 -38888
11352 -38888 -60506 68908 182889 2135 -22720 120561 93851 128487 185564 49969 40780
11341 40780 28113 35837 184963 229905 323966 285336 206012 118356 133133 212366 127650 36449
11329 36449 -55196 -160931 -92466 -68189 52162 -35081 -9948 43599 -137769 -122899 -48051
11318 -48051 -76392 -73541 20395 74369 203960 189212 199719 328984 360589 269759 287002
11307 287002 221946 83723 99202 66001 66778 263269 173981 -62560 -146602 43023 260481
11296 260481 266993 115960 14105 94111 63027 -111092 -174961 216402 334296 314103 237154
11285 237154 218152 190905 227562 286679 251621 18332 -87168 -23982 59796 74031 136610
11274 136610 110779 173060 175726 226487 252196 187867 74584 -121462 -78961 23266 88367
11263 88367 55276 35086 92094 165925 165441 258494 110733 48056 -72415 -146053 -77156 62270
11251 62270 95427 34777 5920 167599 241675 367735 466187 477358 457877 275983 225228
11240 225228 228506 433 -218626 -154740 -182440 -131217 609 1007 -121569 -182260 -217308
11229 -217308 -139236 -111678 -157321 -315224 -203874 -64577 -224363 -187484 -228194 -249335 -260954
11218 -260954 -199857 -45918 159889 453720 511198 554018 379131 75650 -117242 -11197
11208 -11197 77999 116228 108288 185842 145385 8452 210441 464260 605876 479893 392591
11197 392591 367478 285885 189445 144421 214768 266001 202972 194337 235434 185913 184168 96478
11185 96478 -40844 -146055 30269 50857 136933 186990 76519 94608 241434 360296
11175 360296 302043 197994 218418 303542 180984 109771 71686 16018 48331 197245 365773
11164 365773 317588 150860 225707 257235 132829 159414 445540 342448 327650 228820 95642
11153 95642 135583 171645 118254 73277 45944 128125 225675 192267 227670 264735 302778 349616
11141 349616 311893 197079 130486 -47325 -195140 -97334 95080 248427 311792 373998
11131 373998 247460 -50159 -44031 81355 35795 1281 -105983 -152955 9264 8746 54799
11120 54799 12951 26636 -146957 -132198 -155790 -188913 -160374 -118408 50700 -101194 7488
11109 7488 77212 270 -249655 -267539 -318497 -304125 -210575 -187131 -90377 88429 257704
11098 257704 222369 135796 22759 -86966 -43528 -80708 -68121 114441 230850 125737
11088 125737 130568 242111 262654 308406 230105 241266 259157 236066 105760 112394 57804
11077 57804 -44356 -112357 -89506 -122419 87299 216917 242316 323627 411849 321527 143749
11066 143749 94131 84631 -57857 -110140 -210109 -211282 -239430 -34874 75399 145929 144803
11055 144803 211401 153865 53124 -71916 37116 96595 298832 311785 89544 -25806
11045 -25806 -30583 91284 320024 289172 150905 224620 287946 327718 393382 547578 486379
11034 486379 404328 380605 475065 567663 597298 621250 588285 577867 532102 543218 619298
11023 619298 613789 568892 699880 809869 811438 693468 653021 886637 1003799 1006308 1008359
11012 1008359 1039925 1049835 963785 794819 759769 790985 985518 926584 674237 685948 957263
11001 957263 1093621 945651 896709 749955 677121 756676 755376 735958 767100 754417 671023
10990 671023 473616 514197 561930 526197 410894 118073 37662 -63789 -24645 91191
10980 91191 13929 -152268 -111276 79377 124738 145971 166592 289099 250667 189334 235591
10969 235591 278369 386863 318627 375746 389643 383502 345142 360031 392845 315020 105885
10958 105885 -56357 123409 189847 213402 191536 110552 -65942 -3422 37618 -62628 -41614
10947 -41614 5102 105692 109015 5873 -88346 16951 130277 30603 -45581 -15216 21809
10936 21809 -35120 -11668 25615 121066 79151 -63102 -102450 -92898 -251110 -199964 -102525
10925 -102525 -92251 -125621 -97946 -73805 -101167 -23349 122365 251820 439507 544979 455193
10914 455193 162848 216638 237027 117731 -23561 -349408 -249684 -148449 -250571 -5628
10904 -5628 135865 60266 -2426 52424 192648 111256 32506 -58029 52415 -105463 -82595
10893 -82595 79055 130470 166102 184430 248116 293429 118368 102931 62615 -19737 6942
10882 6942 -105647 -117277 -69845 105562 171349 172963 7740 -168446 -196060 -203308 -168603
10871 -168603 -89693 -147224 -150298 -149960 2852 -15255 -8915 -14531 211279 236230 293518 323070
10859 323070 422758 172312 6714 25431 22353 76896 33537 -108862 -92456 35677 67693
10848 67693 25817 54283 62013 106559 343640 388965 143614 63534 52346 121485 214246
10837 214246 99424 32649 167974 113591 230441 187615 272038 294783 269391 271659 152749
10826 152749 12533 102611 207526 198236 132828 -6465 -129682 10668 201275 118590
10816 118590 117009 149328 130329 60328 97625 188950 57733 -89004 -2791 151693 318953
10805 318953 405229 326001 220885 73611 77213 102596 31317 -9365 -37673 57085 38857
10794 38857 1182 144405 100047 149329 108619 156484 111511 148714 231347 328112 200860
10783 200860 -5397 -29644 11671 81977 183345 278000 330767 346358 439824 410650 296870
10772 296870 213106 223241 151858 123832 59741 88553 220613 322259 297249 254076 254515
10761 254515 339023 390912 349105 257355 126633 182737 144978 157953 242776 385902 378333
10750 378333 390975 347722 270332 145725 -18926 -69169 23652 -3101 57517 172626 264576
10739 264576 318499 278615 371785 411667 389356 386136 191402 87938 176837 222454 160580
10728 160580 302365 381977 297411 240100 373977 316866 285484 272165 318115 261461 257971
10717 257971 385172 596997 534737 420682 385983 257633 411088 452510 310155 479946
10707 479946 527467 417015 413088 588801 697584 710882 626071 560307 583031 576840 521574
10696 521574 593774 699070 801709 897957 872282 748960 687017 715604 799964 964256 1009967
10685 1009967 1006286 753162 672702 864511 940444 842027 703747 656606 837742 960791
10675 960791 927020 878891 904000 955002 1022760 1020068 933256 927484 1008185 1273074 1512865
10664 1512865 1574888 1545586 1446181 1475867 1405066 1386955 1471266 1487092 1498862 1486796 1639441
10653 1639441 1627479 1535185 1379014 1478279 1503262 1594607 1737066 1783361 1841338 2114450 2314223
10642 2314223 2403754 2557965 2730626 2970577 2929543 2876805 3107636 3296819 3451652 3617789
10632 3617789 3821005 4254895 4624188 5020861 5604311 6077674 6428602 6875721 7478919
10623 7478919 8149493 8946849 9856495 10999656 12056998 13478581 15404615 17767100 20825129
10614 20825129 24532336 28874091 33853831 39311332 45033858 50878115 56291295 61330916
10606 61330916 65913306 70206813 74297906 78517835 83412840 89655586 97187191 106066902
10598 106066902 115321200 123946672 131426611 137709068 142466200 145652873 148118584 150588530
10590 150588530 153956853 158892135 165628368 173712659 181965932 189171969 194456404 197469426
10582 197469426 197950671 195975520 191797805 186547630 181840641 178250837 176030441 175005257
10574 175005257 174488565 173435869 171217152 167845579 163079588 156979741 149488189 141533233
10566 141533233 134022755 127497162 122073441 117406323 113177958 108824225 104135693 99365116
10558 99365116 94032976 88329428 82187121 75908871 69728799 63946338 58671638 53917779
10550 53917779 49724969 46194705 43002340 40117472 37539493 35241387 33341088 31590833
10542 31590833 29925078 28550042 27241701 25826274 24596117 23526109 22732900 22016600
10534 22016600 21168919 20341547 19656546 19186842 18477146 17754570 17177072 16767213 16189005
10525 16189005 15658863 15227271 14791378 14406934 14071100 13646829 13158114 12694635 12496809
10516 12496809 12142795 11853941 11733025 11397792 11092992 10748944 10412121 10228033 10237065 10042438
10506 10042438 9867452 9769085 9625924 9344756 8907762 8533768 8170498 7993190 7748766
10497 7748766 7518784 7423026 7162680 7030454 7023843 6881340 6723455 6607370 6447150 6376808
10487 6376808 6317808 6241607 5948689 5697356 5593084 5368505 5137180 5000439 4957265 4931550
10477 4931550 4736367 4591447 4388056 4298147 4200245 3999108 3925909 3917956 4122067 4241737
10467 4241737 4043252 3822790 3721234 3580385 3497068 3470357 3245679 3177445 3239783 3110950
10457 3110950 3004064 3047614 3034264 3035605 2970642 2954187 3009125 2798843 2636807 2432605 2433759
10446 2433759 2493125 2435474 2448200 2389788 2366230 2365799 2194324 2121084 2161330 2091309 2179904
10435 2179904 2031546 1837927 1816032 1807873 1767931 1727097 1883999 1895274 1888497 1780092 1722866
10424 1722866 1673561 1587451 1561808 1389987 1410044 1531856 1429746 1372000 1398052 1390761 1315531
10413 1315531 1207163 950177 1284502 1435191 1478205 1377190 1339597 1229616 986570 836920
10403 836920 925239 945744 911625 959906 888182 804655 712408 814928 935881 969306 836356
10392 836356 846439 972326 921636 792926 705019 685816 634232 506562 538480 509539 388705
10381 388705 359754 575772 664058 612369 644713 500162 511870 681960 772411 804251 767082
10370 767082 966001 934995 878227 878453 950684 901583 903021 899264 757718 703395 688500 425793
10358 425793 521178 656182 588512 434820 481228 697885 756366 701672 750297 743955 618125
10347 618125 538795 593539 651859 540995 379547 403306 639250 608235 584652 551171 566990
10336 566990 568996 567703 524812 662656 787926 603901 639746 651330 574123 586400 610671
10325 610671 569777 690649 716965 683394 527168 555449 519669 597295 540311 546968 615388
10314 615388 552800 518084 517358 535152 442405 336968 228876 295249 332742 405694 371562
10303 371562 457102 433341 486421 568781 481743 434694 443693 318657 323346 296028 281711 295100
10291 295100 403464 491526 486273 459268 317540 275535 403606 378416 347193 388926 385805
10280 385805 360871 385210 385562 365422 245264 192505 199738 462645 582025 498321 402444
10269 402444 425745 453986 362625 396229 517846 388164 147436 119509 123540 171286 144244
10258 144244 26332 998 38824 156289 209852 194032 181247 200774 56172 -14010 195348
10247 195348 237691 275583 231836 338806 355385 475736 524617 417433 235632 192313 423579
10236 423579 485535 237232 128216 40132 -48343 25686 41454 41544 61459 25508 74314 151420
10224 151420 249621 190209 255530 183482 116173 45259 -70813 100802 270508 192438 268717
10213 268717 503093 454851 329104 267236 290528 300883 208366 117600 201205 347344 295670
10202 295670 174881 133579 257696 405990 452870 487085 399079 439116 372391 423934 531392
10191 531392 507356 377124 372642 232165 235282 230298 219398 330779 469657 272599 89412
10180 89412 131565 209811 89058 16553 129161 280718 383994 381030 309089 311847 466492
10169 466492 737055 593084 577449 640446 805710 768802 723080 761304 741475 781157 861972
10158 861972 860208 925224 1009002 1003577 951666 844493 909165 939872 963076 1096746 1053464
10147 1053464 920880 1160862 1190117 1228921 1247189 1246779 1246230 1301477 1158080 1257379 1339005
10136 1339005 1279421 1272854 1232817 1079373 1056555 953026 976584 1101297 995160 851413
10126 851413 639794 530275 662306 745097 762543 676608 506025 384837 348426 269621
10116 269621 354432 243638 203937 217910 282177 407078 539381 504354 482126 373114 401837
10105 401837 352634 238249 470678 576503 421041 147661 -4403 -124939 -71951 3330
10095 3330 -55652 58117 21455 86534 236565 159151 149996 274698 256063 374946 304429
10084 304429 200055 113138 -43131 98656 242408 92557 -9052 84684 42307 209608
10074 209608 160307 212505 302553 291408 301762 377633 275862 300640 476443 351214 78777
10063 78777 97482 164072 74380 133949 228673 180962 14975 -87268 -219830 -253664 -21200
10052 -21200 121207 220106 333175 363931 459750 466587 379152 312227 334133 281512 214242
10041 214242 336672 366333 349655 294023 251258 186631 258241 297275 235156 134189 189924
10030 189924 237150 331317 294942 215071 266465 242136 289147 353195 148290 237596 264272
10019 264272 285240 288545 259852 72268 -26407 -57458 -95307 -126342 -15033 108404 105619
10008 105619 150547 256900 251029 167059 127871 230327 207090 194615 165148 139609 41293
9997 41293 -38899 -67554 8936 88091 213177 151975 186360 192716 -19138 -256832 -187337
9986 -187337 -102883 157976 285504 357154 301035 154699 19537 -74062 -29924 -28055 116154
9975 116154 114500 132265 90305 130497 315107 347745 277188 66786 82086 1489 -145590
9964 -145590 -241466 -174004 66480 163607 151171 35901 79835 198595 209411 163551 73726
9953 73726 -194505 -116184 -81455 -16777 84538 65501 100713 29093 29051 168238 283424 125482
9941 125482 24513 -83496 -134669 -129359 -180139 -61008 -34442 -65345 31010 241027 164473
9930 164473 -26421 -5873 -41130 96273 173559 22058 -8866 126169 298421 207856 -83068
9919 -83068 -188964 -103103 -10337 154974 309248 187549 162361 310236 165803 187887 189570
9908 189570 304691 421813 320127 90658 84252 177977 293830 271780 105788 119181 207799
9897 207799 90839 -13971 17622 59497 -205198 -295552 -281741 -118730 -114920 -237554 -8410
9886 -8410 109791 130989 256572 171075 72321 -94168 -60174 -140081 19107 193083 242465
9875 242465 191326 233362 96704 -65070 64505 167212 94608 1406 -50042 32284 139720
9864 139720 210980 98381 56662 -26475 -127081 -166549 -31601 2147 -31262 -148166 176
9853 176 -126236 -97859 -77312 99149 220352 278098 288794 341058 401092 314607 261022 267690
9841 267690 166565 219619 75583 32307 42329 -43365 178726 319941 225225 151637 293177
9830 293177 266116 279631 244209 249199 142360 107504 63476 46735 271411 260035 172169
9819 172169 -136962 -162536 -22176 162787 251553 86557 64991 79526 -7091 -53802 -37392
9808 -37392 -99414 -72324 -133032 59831 136046 93149 75617 46394 15777 43665 10345 -26377
9796 -26377 54971 -42842 -81256 -172716 -165890 -189177 -127225 -53977 -124710 -33271 84820 160483
9784 160483 64829 13903 105973 -7715 -152261 -40513 8581 -52844 39758 33366 22223
9773 22223 54404 174627 143386 -143126 -322893 -240461 -33413 47649 180697 73589 -53166
9762 -53166 -76279 -55479 -43103 -38639 80358 108917 150008 70278 -65769 -149745 -89682 -26429
9750 -26429 -95663 421 27629 30543 163758 344721 423712 444500 242984 297364 337393
9739 337393 244944 310474 292681 163980 207495 182431 -113719 -147317 -220261 -163597 -45722
9728 -45722 -84885 -186507 -156670 -169044 -214965 -135546 -83160 -166504 -88717 89027 117897
9717 117897 145060 154453 235157 378758 285514 201198 226344 189764 111467 118194 38482 -29432
9705 -29432 74282 134339 85887 -27714 -33796 -162731 -262565 -256468 -224281 -283400 -381710 -176849
9693 -176849 -86138 -49695 85813 -1064 -121279 89878 140491 223882 261330 103140 -10078
9682 -10078 56246 178899 154670 197981 232352 100268 -61966 -90014 -122947 -62847 131265
9671 131265 236214 107734 108698 114597 44086 -183383 -175359 -198635 -265681 -414588 -100105
9660 -100105 130371 297386 263188 269019 94813 -70338 -83069 -19427 70479 232890 274251
9649 274251 77431 -46863 -27394 -21180 10160 12512 178844 298316 297487 257657 290712 184255
9637 184255 11279 183622 194847 295628 319667 202323 209442 317375 323787 33045 52171
9626 52171 88029 113651 -24711 -128683 -142719 -233762 -212011 -185932 -115273 16548 -104431
9615 -104431 7062 174940 202773 307664 323563 170473 249680 294941 148840 34661
9605 34661 -87204 91530 227600 219986 268937 320048 308224 264358 170228 -42370 8739
9594 8739 27419 251856 204879 49059 15628 -19324 -57085 30358 247761 198540 135590
9583 135590 140962 104579 154326 146997 182855 111862 186843 293758 333390 248728 34924 -67435
9571 -67435 -200108 -39942 157508 12844 -302499 -448110 -263377 -93886 -135520 -275222
9561 -275222 -136940 -82848 44012 26415 -114194 -142848 -35901 120861 4010 -126489
9551 -126489 -196217 -158429 16691 276111 295163 -1693 -209071 -94229 -29894 -200053
9541 -200053 -254371 -221423 38208 25978 -132202 32396 105646 29290 72676 124353 -42717
9530 -42717 -95753 -1558 1562 49663 33331 -120623 -199493 -152691 53227 155808 135854
9519 135854 -40151 109149 141564 169592 36357 46372 200564 286465 231118 186215 63940
9508 63940 -40845 77331 77752 32870 147830 291422 286086 140255 62057 91747 79705
9497 79705 -12468 -39450 -152259 -207875 -269922 -263135 -66884 -19169 71702 168439 36694
9486 36694 43714 -116621 -30840 -23279 16685 -131993 -234593 -228182 -229231 -84160 -123496 -110115
9474 -110115 -282531 -335451 -277228 -263279 -182920 -233450 -278095 -194914 -115112 14032 -49388
9463 -49388 -121528 -91786 9436 59946 -48964 -103697 -95365 -28328 -80349 -197672 -257460
9452 -257460 -287316 -230892 -118216 51305 91452 121812 91992 138282 106275 173871 43889
9441 43889 71150 -38159 -330861 -344395 -270551 -189248 -216731 -98966 -62080 16185 128147
9430 128147 134703 -30373 28562 -9585 9037 -70627 44462 198692 88625 -157918 -286543
9419 -286543 -222874 -47407 74947 125722 7822 -269084 -200793 -108401 -42429 -5242 -102473
9408 -102473 -177320 -117049 20609 195639 194804 134332 147311 105525 165351 85251 28199 -20388
9396 -20388 -11187 57315 88282 208759 208025 224424 224418 123992 107806 16076 121340 141619 17177
9383 17177 -124956 -212996 -169911 -125858 58684 125704 157645 230751 214637 115790 157595
9372 157595 122219 33697 108326 112525 182022 74723 76068 53604 96949 61828 -37661 -27921
9360 -27921 -14491 22508 66546 -16440 -44481 28010 99562 205871 305017 94074 15643
9349 15643 136942 266898 138740 115599 235691 307037 376122 428551 351661 304270 278079
9338 278079 161339 147944 132347 148507 8539 23419 84246 137546 12697 42432 244562
9327 244562 281161 115200 149953 134588 110419 2313 -6073 -115505 30447 199554 111540
9316 111540 146296 76835 28155 92620 211432 206487 188097 107043 39493 5437 -18637 -9578
9304 -9578 192579 159309 16090 188461 332971 276315 262527 222568 233586 158696 -42246
9293 -42246 -11733 -4589 92544 102031 96455 11497 53927 108553 167128 159971 262134 308773
9281 308773 129800 26745 2878 -3807 54520 133452 26226 -68105 83837 143832 34010
9270 34010 38405 -8332 83348 62935 -235855 -356119 -212574 -57183 34342 17970 -124282
9259 -124282 -125587 -39613 158551 103904 76504 190284 223609 34427 -23154 111523 173389
9248 173389 206560 33182 9047 33580 -63021 -4688 21644 -239672 -265258 -125608 -37825
9237 -37825 -149408 -240243 -172690 -57045 -36576 -29082 -22502 42326 222903 251976 158267 -79288
9225 -79288 -251582 -72289 26851 -18429 -37631 40273 25380 67229 170245 207129 23517
9214 23517 -166405 -261397 -117575 -8597 -79224 -201226 -145261 -229804 -238499 -267799 -25892
9203 -25892 -2414 -71229 -146763 379 -54035 -88585 109255 124729 218750 176605 121405
9192 121405 79017 -38669 76639 183085 170404 127827 46114 29396 -132205 -37061 -43719
9181 -43719 15779 5843 64815 82415 28154 -36678 134302 201418 172053 219076 141250 208351
9169 208351 209015 159529 106145 -71810 -88244 35256 26968 -64412 -147662 -192686 -106731 5720
9157 5720 22088 -18549 -95868 -105533 -50451 44715 -6488 -177672 -251773 -122563 -107156 -266659
9145 -266659 -126267 171523 255226 146077 -46531 -131034 48904 -9473 -108991 -123332 -172061
9134 -172061 21305 69248 -18051 -199085 -303193 -289520 -322432 -386562 -106685 -62357 -200100
9123 -200100 34262 114576 -24726 -184284 -206662 53134 169180 125301 45313 177148
9113 177148 251711 118118 94103 206637 265412 201948 148879 177881 109342 117148 131453
9102 131453 84923 48541 -81867 -139398 -113749 -77231 -201604 -187811 -118554 -132467 -118882
9091 -118882 33922 61734 -53346 34455 11817 62173 265013 175828 62988 -133654 -20268
9080 -20268 143705 164121 179303 147401 80506 -13993 -40507 -167194 -140768 98974 171688
9069 171688 110396 73948 134917 7712 -98346 -5042 61408 -5486 22523 262799 321480
9058 321480 138765 28420 10287 -1968 -171075 -176780 -231284 -38443 101758 -96763 -121066
9047 -121066 27510 -27065 29183 91832 -20264 -148544 -118824 -49458 103427 -62869 -160976
9036 -160976 47049 136434 89562 169271 224059 278863 177230 207192 127765 29652 -66987
9025 -66987 -41330 87478 248973 202759 15952 -50458 -156055 -111707 -28027 59517 103947
9014 103947 99758 -20474 33 53536 -27571 -27148 166931 255736 190390 81550 -17406 17849
9002 17849 21218 57135 -78148 -166394 -378328 -424580 -257154 -82660 -73450 -88129 -88853 -43910
8990 -43910 103781 40442 33466 -66001 -318728 -351085 -203696 -139641 -165168 -99126 -4110
8979 -4110 133692 76274 35677 31217 -58993 -81549 22531 169807 123878 -139 -158041
8968 -158041 -157822 -43872 6529 -27039 -96505 -307495 -298591 -218487 -243249 -46194 101209
8957 101209 88168 27907 -18254 35155 35503 -24051 37020 -7262 -60807 -178874 -144751 52872
8945 52872 140679 163291 200950 -69482 -196823 -9194 21717 7393 -60555 -97540 -42846
8934 -42846 -232576 -367307 -205179 -148586 -134664 -50379 100584 172787 336174 322543 288745
8923 288745 116405 183166 194491 243849 237843 134324 176672 117447 -38212 -123852 19823
8912 19823 105763 85167 89849 77741 68911 -61270 -131601 -194317 -163530 -50371 52433 110886
8900 110886 -89571 -144726 -189968 -134966 -60491 60105 108553 -35421 -148570 -225790 -304298
8889 -304298 -214099 -90444 -49373 -36055 -32861 -21321 23836 -73057 -167861 -71971 -44531 -48003
8877 -48003 -171811 -269052 -489919 -589454 -493224 -170156 3670 130814 87681 -69244 -143734
8866 -143734 -21114 23483 70969 138652 206360 116480 155322 26996 11208 -34641 -79721
8855 -79721 -95405 -118857 -67841 -15969 37942 -6461 -180214 -194948 -134945 62337 -40904
8844 -40904 -167975 -23798 141668 212126 67273 10383 -101837 -167806 -54909 30033 -56908
8833 -56908 -4340 227114 144002 160647 212630 152324 94241 70845 178676 265697 194436
8822 194436 -113489 -244196 -159318 -70991 76973 62852 13433 2692 -65651 -202177 -80591
8811 -80591 93320 77954 92869 102759 -4222 -20327 -20231 -119083 -189945 -301416 -305621 -180469
8799 -180469 -161959 -146711 -16594 49854 64286 249193 208529 208816 101897 127590 322672
8788 322672 479660 467182 341003 227710 151672 127185 49258 169427 176419 58843 -14097
8777 -14097 -30807 138406 100546 94841 156563 130822 59952 287201 281698 263709 221318 106246
8765 106246 45884 -88642 -77161 198852 298776 101239 -41332 41186 211747 177476 106153
8754 106153 144801 86030 45168 15947 -23159 47590 95630 41934 -50164 171110 238276
8743 238276 287185 474239 325261 23636 -124555 -35746 45802 182634 67628 173360
8733 173360 286078 375094 281241 72272 -51566 66101 66419 116198 195264 23682 -147218
8722 -147218 -250050 -244157 -151022 -81383 47034 75294 -40584 -82412 -97617 -83305 -13821
8711 -13821 45772 6357 -149205 -142761 51698 77694 44906 36763 46097 -57240 -43003 -54146
8699 -54146 -152366 -131401 -320279 -325113 -269676 -157632 -62221 -58139 -122937 -244579 -334940 -316627
8687 -316627 -177623 -103365 38326 124056 111746 74383 79071 235095 223256 150162 72021
8676 72021 83539 4580 -157147 -246677 -229079 -204460 -131089 -1070 68842 -18354 -84532
8665 -84532 -172284 -275702 -228159 -214031 -167434 -107139 -25048 30047 28395 36771 5371 -121333
8653 -121333 -97661 -65237 -97064 -213593 -272670 -255961 -187043 -27621 88199 10459 15148
8642 15148 -111814 -164317 79824 206476 297327 441318 336336 206460 38335 88849
8632 88849 275179 147254 43233 95468 -104419 -227088 -70392 248711 146179 -71181
8622 -71181 -223695 -229755 -176824 -91173 -135952 -132149 -211704 -275958 -135812 -105315 -152776 -75046
8610 -75046 77670 -98062 -135245 -82708 -31722 -127027 -229479 -92155 86054 -5023 -159795
8599 -159795 -157670 -106224 -200586 -148072 -84723 -236070 -281840 -285731 -340987 -244557 -264457 -260313
8587 -260313 -316661 -326843 -234224 -159424 -52914 58027 -34327 -82587 -47551 -77878 -70576
8576 -70576 -65387 63196 -66025 -102362 171317 401507 437479 312266 263603 200441 145634
8565 145634 252009 378002 197790 5319 52282 114913 121653 81016 -91883 -49404 -59375
8554 -59375 -175618 -49328 83439 91410 16339 -170908 -194604 -41834 -40088 -217556 -138540
8543 -138540 -150491 -144450 -39878 76663 264801 264559 160311 11552 -159103 -334982 -263064
8532 -263064 -333945 -354976 -263189 -177705 -2036 -19356 -116408 38897 126956 63855 -46290
8521 -46290 -52723 -64705 14787 30599 11703 -3246 76819 -26165 -22700 -11050 144039 210788
8509 210788 79469 -7779 -38319 -148215 -261849 -81242 58843 -219784 -330771 -152998
8499 -152998 -92309 -189322 -203699 -114470 -73566 6823 171639 300142 197260 59433 2753
8488 2753 -9320 -110484 -180095 -124478 -128569 -195468 -141577 -98061 106452 50086 -47045 -135450
8476 -135450 -3445 72197 -3020 -129810 -88291 -6800 39510 7440 51962 122072 214553
8465 214553 26012 -78583 -145478 -179028 -85594 -151180 -233868 -260901 -342313 -328608 -328185 -457958
8453 -457958 -484574 -398183 -355076 -236460 -71201 -114049 -32727 76496 165918 200855 348464
8442 348464 391548 240038 281194 220533 206784 197298 122629 264828 391529 293032 58994
8431 58994 -41463 95338 164498 53412 26455 203091 340976 296572 208457 235647 77325
8420 77325 -126403 -184622 -170072 -82529 43285 49164 75758 51622 -8953 -63559 7061 57222
8408 57222 73882 44774 -1013 169377 113771 186407 199966 15068 7882 77747 164403 167750
8396 167750 78278 9398 -45156 121619 110815 -73833 -189675 -188692 -186514 -72585 -77383 -27305
8384 -27305 -74857 20888 -51788 -251663 -369829 -105214 117839 100602 72868 -28745 -34925
8373 -34925 38659 -23101 -84390 24567 83479 94027 -47856 66859 5140 -304752 -251553
8362 -251553 -44660 129164 120225 55612 -63265 -9879 -61900 -167013 -185077 -105721 137169
8351 137169 172229 178851 228202 81832 35296 64482 58835 59059 241247 282875 230354 219741
8339 219741 183656 66645 -68370 -203806 -167958 -90003 25160 151619 33196 -65016
8329 -65016 -14138 4713 7340 100852 53379 -63315 94031 120889 76495 165109 252379 271011
8317 271011 233751 250578 203633 196884 205794 184490 216027 106300 58250 178165 347966
8306 347966 383494 333932 148154 43480 39615 37147 112977 46646 18797 -2725 -84840 -95470
8294 -95470 -34839 -14220 9432 63299 46583 -180937 -285290 -185002 49721 43586 23204
8283 23204 67850 141925 142490 39973 -129719 -221450 -231030 -212344 -28618 127287 108421 189517
8271 189517 261387 233625 183399 280303 290872 128401 -20741 -82259 133563 230624 2759
8260 2759 -178369 -318659 -344367 -297149 -266191 -263393 -59756 122312 28643 -39432 84055
8249 84055 68632 -44444 -37342 -155988 -142619 -108258 -21723 -49549 32413 107674 147252 159211
8237 159211 163858 29401 -36008 -82982 -2083 -133073 -65641 92044 315869 204380 -36136
8226 -36136 -4119 71294 84454 75048 11307 -88600 -172788 -189907 -171616 -253445 -291136 -196051
8214 -196051 -18216 54011 3306 -144866 -36109 70131 2740 -18548 -105427 -169469 -120759
8203 -120759 -57741 30958 167644 186543 171234 115470 107534 96361 -26361 -70903 -5558
8192 -5558 148835 13844 -143385 -357469 -351042 -278331 -244082 -109209 -108460 -33177 207710
8181 207710 170446 265203 196922 -13343 -19976 -19545 43684 97959 -66742 -45178 -30563 -28241
8169 -28241 51758 123728 133603 87013 155311 166937 91710 80934 93180 114960 -12437 -177431
8157 -177431 -39880 248345 158305 -81338 -143849 -222405 -75775 -18988 -110602 -141206 7214
8146 7214 -49240 -22494 -84030 -101607 -24984 -140939 -168907 -4647 197762 243506 124647
8135 124647 97891 155425 251136 321961 279235 121407 -15706 -181086 -353141 -375636 -169708
8124 -169708 -129110 -182480 -161452 -123408 -103716 -91323 -142076 -120012 -83402 -77026 -19337 3512
8112 3512 4440 118752 79134 165995 293808 403898 290535 203801 125116 103172 46854 66402
8100 66402 214909 201322 92342 -10420 -13856 165062 296675 208380 122034 44977 134818
8089 134818 170003 149892 92475 132992 20104 24301 26658 120103 139380 138481 -55738 -123633
8077 -123633 -70791 -90931 -47847 -76708 -116074 -90130 -10596 54466 90725 82402 -155944 -279959
8065 -279959 -224338 -244405 -130170 -81223 40744 62052 159163 229550 172607 229005 223847
8054 223847 179192 188409 47375 63447 104125 170357 286846 125660 101537 96734 183471
8043 183471 47621 -128873 -130047 -66532 -33720 -61382 -28187 52486 71254 265040 254715
8032 254715 228558 167637 271400 255174 188061 196868 135419 66397 -41164 -166239 -156458
8021 -156458 -125857 123296 328981 400140 247143 -53252 -116904 -81012 -100876 -67081 -75724
8010 -75724 -225006 -99787 161121 148242 77180 7699 -25616 -60003 -27113 -36346 17208
7999 17208 32891 26565 47354 208539 128850 91201 215761 227209 178236 177432 174562 74152
7987 74152 17055 34305 136121 167497 271507 205035 253286 212692 68627 48241 99417
7976 99417 107804 -171702 -280515 -202471 -6297 115600 172058 270496 261500 219375 157685
7965 157685 146050 172531 211665 154576 43836 194093 321389 307012 230287 141248 64998
7954 64998 -40323 -2847 56670 -42123 -129843 -17368 33705 -94619 -131138 -189344 -169811
7943 -169811 -112568 -15861 125076 143487 293258 177252 224585 142463 161004 252703 274530
7932 274530 312840 241409 136661 25815 51212 154395 306171 421091 515845 277531
7922 277531 129734 160244 58939 -38540 14913 64271 91915 36159 -655 -92066 -92557 -165593
7910 -165593 -78657 53119 202119 151198 19851 -48648 -11244 -135254 -119144 -140332 -97841
7899 -97841 -70259 69908 -100981 -128349 -46089 -98552 -84816 -46017 74921 25010 -50799
7888 -50799 -121127 -51558 87328 -4549 -156329 -106775 22105 189356 210803 -7156 -182818
7877 -182818 -127791 46975 125149 106640 -4450 -137063 -19878 27112 -98981 -15315 -13532
7866 -13532 -121551 -111697 24609 229779 5983 -165404 -183079 -195401 -259926 -136385 -140120
7855 -140120 -162077 -301840 -331049 -188132 -86233 -6439 99134 105526 199661 210339 237106
7844 237106 154309 142827 120872 27611 -37051 -111594 -121640 -230228 -139118 -28195 -23282
7833 -23282 -105552 -656 -64244 -174979 26376 156841 31921 78322 47756 -67297 -112863
7822 -112863 -146884 -114402 -216655 -122412 77309 37765 65564 -102489 -139692 -49226 35920
7811 35920 -43292 -13667 8437 16768 -26186 -82146 2569 -10195 25991 334420 397687 285008
7799 285008 186704 115417 -59351 -5688 92469 61143 -142117 -212007 -359831 -369195 -360012
7788 -360012 -356521 -212727 -115248 77958 273250 208867 13113 -83035 -50991 -97989 -113236
7777 -113236 -6633 -1834 -130741 -256549 -298996 -272868 -152758 -59504 -109120 -233148 -145163
7766 -145163 -107854 -105914 -52017 -6260 79374 62996 -139732 -260647 -151980 -122351 1068
7755 1068 -15851 -157033 -195704 -171139 -228372 -383940 -264960 -126360 -239000 -283644 -185478
7744 -185478 -99537 -47097 -42425 -91257 -274843 -333559 -257559 -274343 -378073 -407367 -172520
7733 -172520 -43016 -10129 142039 115648 -54276 -21446 5382 -105465 -205081 -313306 -204423
7722 -204423 -45121 114709 278278 219884 131360 93166 214180 348697 245866 48873
7712 48873 -34133 41633 116089 -12104 -115572 -116962 -5336 138100 109678 62241 -46534
7701 -46534 11478 149773 133464 108906 -40037 -151910 -256456 -153714 -79973 14808 28146
7690 28146 -43523 -26126 32780 58380 -93301 -170882 -123692 -10136 -48067 -122592 -143134
7679 -143134 -150926 -309587 -173069 76703 97362 108779 144183 203387 124913 46357 5073
7668 5073 -1743 56241 71236 110910 2880 -52291 -46049 -188217 -309553 -163752 -47379
7657 -47379 -94701 95726 170483 110923 14854 -19780 24671 -11365 -75041 -145672 -291074
7646 -291074 -285104 -221396 -204536 -133320 -127288 7127 60942 97063 151918 174234 -21286 -183107
7634 -183107 -261868 -281888 -253438 -273990 -216813 -193721 -138440 -11361 13456 -203076 -414556
7623 -414556 -329359 -206906 -127435 -34110 4426 -74086 -121583 -112853 -76074 -121581 -212045 -282313
7611 -282313 -225273 -152505 -206452 -209794 -186311 -15373 197512 254831 358280 384083 169856
7600 169856 -54298 -26449 55456 -32506 -74820 997 -126465 -202012 43856 69866 32535
7589 32535 -4925 176457 361765 509530 420334 314906 198513 174582 27987 -21000 66206
7578 66206 155516 48401 -121554 -54264 -115156 -178466 -74490 121135 16785 -27763 18584
7567 18584 24815 35537 202036 185538 57353 -187248 -227278 -81886 -127536 -91085 75101
7556 75101 154212 179444 261927 278090 176660 101878 112348 -100370 -191055 -57062 -12107
7545 -12107 -154564 -231135 -216943 -93710 -75504 -75910 -166963 -167874 -133017 -61896 34784 77481
7533 77481 4128 174697 353943 151740 59369 58548 158928 116808 -17856 -43971 186024
7522 186024 266064 274340 67190 60650 87708 -47479 30043 253004 122550 73796 146177
7511 146177 119146 -90206 -190173 -221831 -86322 72416 59924 49024 -80793 -170274 -93166
7500 -93166 -79567 -38015 -198587 -251270 -181350 -59898 30371 -50692 -73409 -225575 -413526
7489 -413526 -312502 -234169 -144018 30337 103784 20461 92373 133902 167587 119765 -14030
7478 -14030 1611 5597 113467 141733 72824 80182 -21459 -257316 -332238 -128355 80931
7467 80931 116833 61714 -106044 -405694 -191513 107967 1301 -39944 -153639 -197438 -174017
7456 -174017 -32452 92313 44595 -10030 -119235 -231015 -187522 73395 16189 -134628
7446 -134628 -217405 -346413 -307574 -192065 -52868 -11663 -86168 -83279 -93565 -35245 157992
7435 157992 185549 -40899 -102155 -43927 6918 -143307 -322157 -469987 -360883 -409229 -367046
7424 -367046 -218722 -58194 -50671 -73556 -115099 -279058 -256830 -301234 -226808 -139117 -106044
7413 -106044 -91663 -112723 -62630 50875 -42805 -224661 -158750 -121275 -100468 -39720 -9257
7402 -9257 -207670 -348288 -317250 -190188 40020 151575 164248 83309 134123 204401 126472
7391 126472 -3635 1093 -6819 52389 219364 -5707 -206892 -216728 -99079 72288 30945
7380 30945 -36832 -75870 -532 25458 -74188 -144462 -235441 -218128 -14593 86440 16025
7369 16025 67234 104754 104375 112977 162120 119851 63894 54455 21531 -19959 -2267 -85178 -105858
7356 -105858 -163141 -148753 -121326 -166193 -110131 -140031 -284955 -313216 -227133 -113136 -41970
7345 -41970 -71590 31322 -118956 -288057 -248030 -141173 -91614 -63587 -81125 -157833 -125070
7334 -125070 -92891 -70837 -52000 2499 -116261 -86294 -43568 24 100041 73660 -84172
7323 -84172 -65635 -80570 -54577 -7135 36305 90857 168172 178612 122130 279432 245512 160314
7311 160314 -30378 -127081 -136536 -63941 -130228 -171852 -117076 50161 165877 219043 140392
7300 140392 11112 175116 68832 -70821 -96789 14512 67228 157916 -4925 -65358
7290 -65358 -75023 -217014 -311632 -376780 -348308 -258710 -175248 -105270 -266044 -144815 -187405
7279 -187405 -292034 -359253 -302647 -196014 -32542 -992 -61023 7138 84164 -51203 -139844
7268 -139844 -141286 -188831 -217914 -50364 -181911 -273049 -350694 -206369 33833 72880 19039
7257 19039 -167899 -162484 -35880 -33909 -43276 -97719 -136418 -76628 -14484 -9408 -11899 -146524
7245 -146524 -177571 -167868 20146 145590 125163 -47917 47241 46891 -37031 -69644 -10820 50222
7233 50222 6516 124874 46971 -53343 -105201 -191487 -114364 -64731 13951 4061 -92138 -252526
7221 -252526 -291279 -231943 -112512 -70562 -162688 -130913 29969 68395 52368 -24923 -31206
7210 -31206 -41286 68190 47072 -78441 305 20033 -11738 163436 223215 319258 263485
7199 263485 127380 120630 34862 29390 -7143 -14765 41502 9203 113563 146003 69797 53657
7187 53657 -42175 -147721 -200596 -191006 -99637 -9095 73960 138253 137424 30258 -33274 -41584
7175 -41584 -31167 -176362 -218516 -218030 -137188 -36546 115596 110044 39846 130505 29352 -27911
7163 -27911 -63705 48997 94577 69485 32152 96004 -17105 41628 257309 73646 -132547
7152 -132547 -204378 -221609 -121939 17722 39889 95229 74014 95503 57611 82525 11951
7141 11951 -78612 -72803 119381 175633 29727 2510 -31829 -1866 -105071 -355634 -286282
7130 -286282 -137267 -4578 -61789 -119856 -108037 -30732 -47219 -158431 -160399 -60227 97472
7119 97472 -22398 31347 -28604 110410 -74081 -268266 -357821 -224694 -192595 -89147 -70298
7108 -70298 123105 110496 44111 -106005 -136244 -31250 -26880 9826 -98637 5204 48415
7097 48415 14294 115280 -33396 -205911 -115806 121021 262849 293955 77990 -104025
7087 -104025 -219676 -214754 -137697 -99007 -40468 -12698 10719 -58630 -66199 31799 64717 -101044
7075 -101044 -98064 -123469 -196739 -210988 -82767 -12035 109727 49522 13119 29490 47823
7064 47823 37057 54103 -20692 -40781 -116323 -73370 -81796 -110515 -13056 70553 88582 -65610
7052 -65610 -51945 -153552 -365014 -474843 -294143 -177769 -236610 -291155 -255105 -242501 -215030
7041 -215030 -41794 127541 101813 22746 -180260 -173615 -87674 -52946 15119 100947 66696
7030 66696 10983 53154 75152 -148127 -255712 -233511 -267390 -139769 27377 31122 22660
7019 22660 -53779 -233952 -278072 -160330 -132241 -204318 -265119 -213894 -146124 -14765 -25017
7008 -25017 -152132 -185604 -196070 -282222 -187176 -107966 -245628 -324099 -452172 -431850 -400692
6997 -400692 -175513 -181469 -348122 -303866 -197810 -97309 -114640 23286 211508 60221
6987 60221 -81750 -74170 18981 260156 289172 102886 15825 -39533 -132575 -191602 -287478
6976 -287478 -210580 -155661 -184143 -218962 -220811 -197250 -219564 -15778 -70228 -62923 83817 97585
6964 97585 96035 -24629 -43561 -54102 -172246 -184273 12552 23748 -165810 -93023 -28023
6953 -28023 -11413 -95054 -18623 -2582 -4748 58834 -88915 -71609 -5327 -25007 -124913 -269595
6941 -269595 -297337 -68491 14103 135713 188089 161445 36240 -84106 10157 109044 123204
6930 123204 24162 44787 26122 -2428 -24392 -62437 -50965 83973 146930 56367 16377
6919 16377 69510 80847 -39170 -102072 -152826 -353574 -286973 -74512 74720 113433 75822
6908 75822 51909 -56159 -131288 -3248 9880 60738 1080 -92161 -28725 92609 -7274
6897 -7274 -120657 -179249 -205122 -82533 -143811 2609 39717 4319 -27440 -24286 -142452
6886 -142452 -143336 24448 139684 95093 -36284 -110988 -45560 152283 143667 -173788 -337519
6875 -337519 -351538 -117446 116440 2927 -101762 6743 -153245 -282361 -318832 -198612
6865 -198612 -37816 -157156 -176007 -198636 -205699 -184412 -248624 -180456 -212156 -90309 -15378
6854 -15378 -60942 -67961 19963 -40525 34570 156845 198147 260534 126147 -18446 76461
6843 76461 186769 108707 181788 150488 96105 -95211 -91433 -63437 -25954 198221 127415
6832 127415 106367 140486 -49754 -238880 -29738 -18209 -17513 72006 154758 108017 59992
6821 59992 11734 145405 168415 79888 89616 197008 229633 51161 -70431 -157197 -259333
6810 -259333 -340752 -238250 5341 28037 -97517 -211687 -185008 -183007 -204929 -222488 -117235
6799 -117235 -30911 -29188 156345 216539 46673 -134716 -44067 129079 97243 -34344 -146338
6788 -146338 -235991 -368683 -280221 -223818 -225287 -212380 -112227 -22209 93127 104310 -43334
6777 -43334 -225240 -361147 -267974 -182952 -96108 67289 -43886 -91535 -89608 -23954 -18326
6766 -18326 -109989 -247535 -148125 49742 57764 84856 124514 127176 98299 139792 69597 -106383
6754 -106383 -108214 -49179 -62883 -73964 -50046 17985 27111 -120184 -264864 -293586 -316134 -148440
6742 -148440 -103306 -187738 -83588 29420 -109367 -58751 49273 33432 -57831 -4579 -81184
6731 -81184 -44087 -249722 -361954 -322531 -216739 -112697 -100683 5374 -18273 -115272 -110635
6720 -110635 27922 106582 22212 -152020 -136304 845 261919 193648 186881 243487 227864
6709 227864 196670 137484 84301 126131 253744 236794 273498 213462 13964 52885 101801
6698 101801 -13129 90436 32489 -62680 -60359 -18947 -51764 -120601 -102509 102904 126794
6687 126794 70086 34347 202925 391660 177361 66298 -72 -105850 4437 -4835 -117355
6676 -117355 -65999 12857 -23637 -143248 -271769 -211018 -166895 -22322 -68166 99504 1533
6665 1533 -164397 -232891 -209349 -186744 -85630 140482 112088 -141793 -169350 -142856 -171659
6654 -171659 -80549 -110580 -139928 -266114 -494542 -357570 -60710 56739 99672 -11491
6644 -11491 -45040 -222485 -191106 -6550 -101286 -150387 -250150 -310229 -331146 -345514 -226536
6633 -226536 -116409 -11057 6262 -61573 -121999 -6538 -38198 6508 74221 80220 33878
6622 33878 -59389 -46634 -16630 -84684 -193335 -261084 -289506 -207110 -181971 -162813 -65008 -39477
6610 -39477 -89558 -131697 10418 13321 21881 89293 -56061 -76535 -136685 -38063 121587 194127
6598 194127 -77986 -184178 -189763 -139275 -71706 44218 64099 38819 -79800 -103169 33114
6587 33114 3620 -41355 -37284 63316 -36358 -172989 -75393 -122438 -141740 -186624 -54944
6576 -54944 -59660 -149715 -132998 -122732 -80691 -58707 41675 8073 47271 -23395 5781 46680
6564 46680 161350 121998 -10198 263 -49101 -133111 -142244 -147325 -155937 -2195 17144 -6094
6552 -6094 -92761 -60079 -135884 -346965 -171411 -41925 -28147 32270 222383 165206 32670
6541 32670 118637 163934 151204 43895 259010 192004 82535 203020 300762 379690 420729
6530 420729 206591 -2211 -57996 -94680 -62967 65750 203817 269954 284984 235478 240708
6519 240708 87583 -117155 -115414 -47880 -37324 -44066 -161037 -109083 9162 -32975 -13119
6508 -13119 61094 158528 222930 223546 112071 30123 -122884 -308531 -204045 -74319 -74621 17821
6496 17821 -14391 -53818 33761 107516 144871 -55216 -24551 -38977 189106 309598 180575
6485 180575 -1987 -38312 -73418 -192877 -269940 -106876 10141 24591 -19933 109735 129020
6474 129020 30751 -90355 -41675 48497 1911 41722 4448 -66565 1789 116363 83756
6463 83756 143794 165642 158608 258863 252698 95051 11514 184485 196630 241647 170868 216649
6451 216649 73130 -31858 140307 105219 161248 38004 -101534 -35756 -70683 -76723 -90393
6440 -90393 -193181 -80469 -38188 -70412 -67188 -154330 -182632 -206153 -226250 -106413 -199104
6429 -199104 -236115 -159069 10663 87555 34826 -1800 24702 97102 -23813 -59284 28275
6418 28275 50729 -13394 -163919 -163653 -44727 235711 218046 133167 137158 90971 -55929 -161719
6406 -161719 -197101 -95151 -90043 -252333 -177528 -3638 184084 218533 -3899 -43567 86192
6395 86192 3781 6590 9070 -50272 -42055 12036 -17215 186261 93922 -130530 -133005 -150768
6383 -150768 -133667 -208382 -166311 -220334 -270560 -180805 63225 52365 89936 79399 -1366
6372 -1366 -40487 -83198 -84035 -165264 -228205 -243715 -91159 -178994 -135652 -112191 -2412 71796
6360 71796 78268 92508 137185 160131 301875 248861 73118 11780 -23864 62666 -78661
6349 -78661 -48558 -99596 -44693 54243 36970 23060 -154587 -401811 -289788 -194767 -158706
6338 -158706 -21696 47006 49248 -30508 18802 55038 -50357 -56029 -157505 -296876 -277720
6327 -277720 -41338 65254 130586 127913 78733 -22113 73652 15047 -77223 152405 396229
6316 396229 327347 405267 218972 316817 377893 141406 -55323 86047 7039 -93820 51471
6305 51471 254875 391523 282304 148373 44475 -235356 -329216 -343115 -353903 -192023
6295 -192023 -109932 -34572 -20431 -35773 -18285 -13496 -123169 -62504 -54334 -115340 -34164 90230
6283 90230 97977 -36228 -59199 22132 -45006 -18334 41816 46910 -125327 -343874 -454362
6272 -454362 -451001 -340014 -273783 -173976 -107763 5361 113932 108499 -36358 -43174 64251
6261 64251 -30124 -258692 -48455 217760 230743 255396 302181 299914 201789 66968 -50621
6250 -50621 -158767 -93261 -58859 -41714 54852 67062 78902 144117 242366 40439 -53881
6239 -53881 -149996 -230583 -98296 60149 186024 9844 -251948 -314209 -281658 -92636 60730
6228 60730 182156 220844 148829 74473 58565 -86822 -335761 -409149 -317414 -269169 -157303
6217 -157303 17747 -31785 -189166 -63225 -42412 -18986 23158 8817 110870 65910 -59769
6206 -59769 20077 123711 104449 7737 -121236 -72545 107510 236213 274129 254747 345642
6195 345642 205443 -82298 -339980 -357687 -300126 -217034 -243621 -220990 -212133 -153453 -91375
6184 -91375 -86904 -24977 84438 107922 182971 -10103 -125868 -142968 -215099 -275553 -221539
6173 -221539 -125264 -118745 -99904 56033 -14410 -8784 -168120 -179413 -153572 -72810 -21735 -152935
6161 -152935 -83088 112315 188487 149024 -102424 -103385 -123257 -85105 106403 188635 -49697
6150 -49697 -54285 -24691 -65588 -71355 -191663 -188552 -165917 -194483 -277177 -273774 -256167 -259950 -75114
6137 -75114 86155 79010 114239 126128 -135469 -253966 -415164 -210382 -22324 188447 284298
6126 284298 244382 135458 -21899 -219377 -157436 -35150 -63678 -263835 -268223 -197095 -59865
6115 -59865 31426 -43630 -71493 -79315 -203555 -90606 57885 4078 -112308 -38302 -2762
6104 -2762 23099 31744 -28210 -24362 48627 22168 -4511 131735 109341 87267 124128 21800
6092 21800 -100688 -110973 38703 -11684 -152134 -222362 -261002 -184225 -33363 -120377 -84848
6081 -84848 -16531 -50446 -76981 -248059 -375459 -251795 -119488 -173691 -207320 -167167 -28258
6070 -28258 121227 30622 -110731 -158957 26160 123696 23226 -77141 -91129 -48807 64354
6059 64354 -41997 -201632 -260430 -160985 -274694 -224221 -43311 61074 118929 193000 -34223
6048 -34223 -83069 -14216 -182183 -214701 -173937 -109727 -166622 -108991 -2274 222438 325520
6037 325520 277031 81549 -57677 -149173 -277328 -220607 -161558 -192522 -247186 -141763 -19011
6026 -19011 -89983 -289045 -532279 -661345 -491081 -260396 -39470 -24994 -106690 -154206 -92744
6015 -92744 -241006 -414382 -273398 -226470 -111121 -160966 -84908 -50600 80851 22777 -122874
6004 -122874 -155182 -124937 17283 -48855 -197712 -292866 -234989 -253095 -213713 -94199 -58214
5993 -58214 -50027 -154599 -206098 -155286 -17491 113810 166634 81224 -4119 142725 116479
5982 116479 119535 -26057 -52679 339 -13792 75195 61154 36336 -130190 -126415 -25680
5971 -25680 -62079 81206 95472 -65894 -78070 -166717 -52098 123046 54261 -52418 -42759
5960 -42759 28613 4334 134833 315279 295665 309425 165595 43628 128778 167787 -27352
5949 -27352 -52553 -46479 -154959 -116141 -114883 -72709 -123109 -207046 -129162 -100886 -103924 -51400
5937 -51400 38694 -32822 -27878 -148541 -104631 -47643 -173895 -198546 -127754 -125237 -229532 -271089
5925 -271089 -131955 35588 -27316 -80736 96144 -80899 -165554 -173718 -140367 -16545 -19869
5914 -19869 -148101 -365 107412 18582 -79001 1077 157708 65309 -21168 -73664 8634
5903 8634 48473 65999 262114 459242 437916 543690 515364 460857 244756 130057 6024
5892 6024 -9449 -60051 -293002 -323222 -323761 -235738 -206637 -167423 -61079 -33099 -6615 144461
5880 144461 347022 187619 172613 272429 217440 156388 281404 313820 200096 89977 83472
5869 83472 174897 133664 62239 -116035 -306738 -405871 -127525 69041 129244 18753 -109210
5858 -109210 -216590 53538 242735 354845 178052 146146 153792 165547 187316 56623 58510
5847 58510 -15459 -138649 -177694 -240065 -137162 -59618 -67285 -81454 -47554 193390 227263
5836 227263 111194 -42545 -106280 -135905 -180986 -186610 -197076 -28063 -6941 22705 -57475
5825 -57475 -149008 -270029 -149285 71534 75720 98588 -11794 -200628 -159831 -101611 -129
5814 -129 104911 109781 120555 28101 -6536 -290191 -278694 -106925 -61701 -10188 -23884 -21562
5802 -21562 -4549 -28951 -7463 -54763 -112331 -30098 -30073 -8983 11963 25799 -28381 -123151
5790 -123151 -202599 -301626 -169782 3191 -184174 -301831 -210932 -189799 -174298 -185260 -147125
5779 -147125 -99468 -105552 -32076 55323 -9734 49171 108515 2189 -82095 -148006 -257845
5768 -257845 -259133 -149354 -117254 -68231 -44588 -5413 -51416 -47114 -88302 -142156 -50 189296
5756 189296 134190 120243 54852 -55720 4713 90468 -147231 -260732 -130563 -61312 -64140
5745 -64140 28247 217174 183317 128551 76244 9183 -172856 -127433 -140077 -49616 -12827
5734 -12827 21202 36402 -27006 -85578 -44010 151676 144449 -31390 -29219 -84247 -44957 74383
5722 74383 59257 -150677 -189582 20239 184455 284237 136395 22650 -21085 -9681 -23772
5711 -23772 -176298 -131365 -154995 -160699 -167804 7642 183726 52988 -161712 -187637 -280002
5700 -280002 -75365 -52439 -36361 62517 80834 143694 195287 160834 177447 81788 192347
5689 192347 168001 11519 140782 145467 107902 47734 -33043 22197 137928 67303 -66906
5678 -66906 -292947 -318082 -300157 -229731 -312117 -385475 -307672 -100684 -51646 85238 245122
5667 245122 121354 -93829 72271 128005 115106 18289 -102926 -128590 -98761 4199 53324
5656 53324 -122298 -98963 55248 91068 50609 29593 -73633 17884 8959 -155897 -83593
5645 -83593 -1270 -67431 -94382 -119939 -270092 -363688 -425423 -328018 -200172 -156065 -93657
5634 -93657 103268 116775 55833 -19028 -226844 -212536 -278235 -175277 24431 78035 38296
5623 38296 264558 55612 -136342 -102284 -14786 57915 26104 -65777 -125948 -75282 7216
5612 7216 38301 26419 3589 -114237 -209934 -250445 -252959 -56446 39103 99023 53569 -153208
5600 -153208 -192044 -148897 -197741 -90534 -86284 -123999 -205648 -147288 -41744 -95702 -112688
5589 -112688 -101524 -57316 -64485 16128 214152 300835 253965 102319 66660 -28747 -4567
5578 -4567 74062 38679 -64239 -47223 -268448 -361402 -58507 -147171 -344222 -83341 10800
5567 10800 -189450 -361840 -395979 -381895 -252826 -134302 -86921 -52270 -108152 -97602 -265814
5556 -265814 -259513 -90492 -29519 31665 67942 102723 -90632 -308402 -194632 -29039 -14017
5545 -14017 -220915 -344353 -377318 -414611 -320973 -98460 37632 -40619 -75552 29928 -14340
5534 -14340 65953 169036 180144 173283 117656 134584 243650 282447 136972 52907 47588 27518
5522 27518 -62530 -24950 -3817 -120367 -260505 -268453 -120803 -107918 -90305 -33839 97283
5511 97283 377079 330628 132868 48900 101495 59980 49466 -51699 -121589 -127069 -177738
5500 -177738 -92049 -39852 -102617 -27306 -39489 -126267 37741 168670 207545 90590 53046
5489 53046 45198 -96872 13405 -6993 -159268 -47909 9582 6133 56593 60281 55037 37608
5477 37608 -26343 -114254 -266231 -325480 -145469 118010 137783 95627 55166 -66653 -168862
5466 -168862 -120795 -157160 -103423 31539 -43371 -101095 -110915 -114466 -117679 29752 34955 11482
5454 11482 46579 68665 -62339 -103658 -254871 -313425 -199814 -60840 77463 58833 7107
5443 7107 69102 272044 117004 -132671 -158350 -99863 -19301 -33239 -42449 3786 113149
5432 113149 32308 31850 161055 160574 170745 -2514 -97405 -150943 -154302 -62898 -161266 -95931
5420 -95931 -33933 -82935 -196635 -368101 -120014 71560 39476 -5262 45711 225096 192160
5409 192160 174257 203112 317145 370410 271560 226478 82963 180416 213536 -85505 -42831
5398 -42831 105366 97629 -14976 -23295 -238573 -20284 16632 15712 31315 -268 -5199 -164197
5386 -164197 -81827 -15116 -44843 -35812 46650 11081 -99058 -157198 -154136 -79751 77012 180431
5374 180431 216531 312486 262281 155555 204508 266937 276860 300713 310431 113129 71519 -20661
5362 -20661 -20690 12646 101289 214207 137196 150199 121986 139348 86417 145675 190421 191354 116066
5349 116066 114079 201798 217146 104695 -64299 -24398 184902 229339 118634 8668 104733
5338 104733 127126 184484 122461 -109234 -16676 -98133 -187812 -275454 -257715 -35399 101900
5327 101900 287639 244719 157358 161076 268389 373943 294742 219629 130246 17133 163353
5316 163353 115494 93728 130813 67780 -71159 -332984 -475318 -370569 -278582 -201171 -83964
5305 -83964 -110889 -104301 -115118 -106896 -60400 -198363 -106035 -67668 -10664 -70524 -46731 113063
5293 113063 115629 53423 132035 346167 270796 309314 285181 201721 79591 12554 147029
5282 147029 106440 131290 96585 57192 83205 52996 119185 103966 152218 129276 -76478
5271 -76478 -212615 -301398 -150378 -22305 -204340 -235088 -178923 -63707 -95080 -56204 -86816
5260 -86816 -138161 -49918 175692 138824 -30767 -80685 45427 136512 52460 22072 118424
5249 118424 104231 79647 13316 -75643 -34741 52950 24136 -113375 -216155 -124898 -681
5238 -681 49005 70383 -3558 32367 31113 110241 206167 148732 3952 -33541 -170634 -156906
5226 -156906 -194170 -170125 -179652 -86981 49672 -23917 -103093 -244129 -168680 -195600 -377157
5215 -377157 -232298 -147657 2140 12268 52869 232693 174340 167813 134916 40320 11137
5204 11137 -87367 46802 145419 65917 142993 390743 365534 203319 16358 -15306 35505
5193 35505 102742 239283 259936 283350 203419 -214 188966 321600 207454 -4351 -277665
5182 -277665 -271117 69449 246580 192786 3005 -159998 -207021 -157468 -78543 75283 205954
5171 205954 142016 55158 -19398 86362 143938 116973 215836 70133 -5016 -107991 -75531
5160 -75531 -60653 -207666 -296854 -249913 -182239 -105985 -83609 -173527 -208493 -155246 -182460 -196662
5148 -196662 -131922 -49937 -16968 -67994 -28687 14477 -37162 -14532 140323 126068 59805
5137 59805 -13935 -20700 -105399 -44078 96602 298191 307291 209854 -27787 -97315 -84793 -131199
5125 -131199 -103237 82722 202339 -33580 -133607 -29679 16495 -89467 -66782 139073
5115 139073 184814 -39900 -161966 -187683 -136188 -45497 -119271 -66790 21534 19411 -42236
5104 -42236 9684 28931 -106867 -70186 -31498 -107203 -98313 -130868 57748 84049 90294 38107
5092 38107 -71931 -133716 30697 11324 -56858 122111 193788 -7994 -165617 -67141 20785
5081 20785 -1084 -141988 -244564 -288682 -42127 -60341 -125121 -95595 -64308 -145160 -30371
5070 -30371 -33605 -5056 -303915 -247649 -265275 -231400 45480 58501 215700 246170 101603
5059 101603 -5934 -210334 -438669 -327727 -113044 -39478 38785 7279 -17199 -25860 56350
5048 56350 72840 -53211 54191 153219 165244 -37552 -157323 -399611 -489503 -371885 -321449
5037 -321449 -333837 -220430 -268721 -255228 -152736 -184042 -293941 -224593 -197375 -192373 -117343
5026 -117343 24542 -117569 -110806 -99294 50580 164692 14818 -17093 41052 162086 208032
5015 208032 230214 -66550 -169374 -162660 -159165 -113252 -977 -108131 -43242 -83607 -3557
5004 -3557 177611 101380 70581 -86517 -178408 -84271 -20738 164899 118176 22508 -177305
4993 -177305 -146651 95928 122342 -13782 -124377 -78278 -130648 -211785 -140770 -3551 30653
4982 30653 -94795 -85837 -15829 -69182 -139128 -123076 82154 60722 -42190 27541 60612
4971 60612 134355 42395 29767 -44973 -201712 -133187 -28480 30268 164885 190011 93115
4960 93115 27997 -55243 25071 83375 -19254 -71305 -41217 5343 -125130 -165984 -130827
4949 -130827 -266673 -88062 -69050 -189838 -19204 65981 12519 65627 230974 325213 190756
4938 190756 156105 159977 149987 18907 -21462 50193 189370 217285 251264 111257 -112428
4927 -112428 -24517 176020 212124 187555 23262 -72369 -191807 -94914 -182608 -238465 -134344
4916 -134344 -100669 113534 72494 133687 123901 38891 4165 -46173 -68226 -147023 49856
4905 49856 -17962 -189115 -108449 -60234 -112287 -56370 32176 47167 197408 198304 135525 77506
4893 77506 135711 235096 230910 104019 -102990 -205530 -230551 -189014 -115461 -22274 -36665
4882 -36665 -143771 -129828 -184006 -255649 -174089 -137704 -138002 -52620 -196915 -179372 28475 -21222
4870 -21222 85086 -22524 -267858 -170712 -14505 -92323 -236320 -196575 -187348 -110109 7242
4859 7242 107406 30245 21909 -228261 -321602 -207960 -98264 -55602 198 110869 240273
4848 240273 121907 -44555 -19287 -43430 -59304 -122988 -132871 -69309 -217606 -323502 -266396
4837 -266396 -259387 -88048 60480 230426 195154 160637 56569 -128225 -115661 -244466 -196811
4826 -196811 -104231 64573 108450 -20380 -75392 -56084 81973 213088 139635 183436 201927
4815 201927 159281 -50748 -163700 -156742 -94185 -3103 152279 245470 288482 206624 148998
4804 148998 123071 61864 -98619 -133894 -44269 -7233 -120849 -157067 -24192 83712 86686
4793 86686 -40052 31017 83278 62942 -25475 31203 133346 98749 289031 369023 268277
4782 268277 262330 66088 -62769 -192962 -107121 -92901 -112976 -90947 -24785 56699 150884
4771 150884 270058 217943 141365 234421 293462 287687 242555 151413 6428 33485 165860
4760 165860 282866 246253 154936 198585 151707 -89330 -322656 -385982 -372531 -375667 -327136
4749 -327136 -372139 -389832 -350425 -333135 -146619 55695 -5802 -114739 -71312 -26317 100025
4738 100025 195879 186628 75749 38475 4195 44373 86692 -79888 -184422 -108752 5751
4727 5751 -114769 3874 148445 70995 -38657 -144867 -83205 -67824 -30685 42035 184425
4716 184425 253180 78262 -82097 -99438 103096 172244 7754 -43786 29989 73351 83463
4705 83463 63886 17139 28992 17943 -96219 -156855 -385448 -487322 -416364 -374955 -233146
4694 -233146 -171483 -109723 -26834 -25948 -16451 32662 265346 364305 198394 230250 333852 336765
4682 336765 461081 375111 261205 215383 118728 -45953 -70052 16163 -85025 -86453 -33649
4671 -33649 -17286 20697 70224 155092 116875 -52303 -186102 -365769 -296444 -267173 -281711
4660 -281711 -121312 -134120 -107127 -115321 -210163 -175627 -189948 37843 160434 164203 75372
4649 75372 -57248 -78307 -52390 7763 27568 -18492 -48854 -72379 -134551 -228443 -145688 -207706
4637 -207706 -276106 -87770 -36150 -87414 180088 153821 -105827 -120893 -2426 74062 63490
4626 63490 2052 -90800 -93733 -108236 -111250 -191438 -168277 36096 38128 -32264 4599 -50213
4614 -50213 -80665 22525 -96817 28550 72691 198867 250499 232994 73911 111142 223339
4603 223339 130087 -12853 393 33675 21161 69972 -25805 -126129 -57323 46590 75365
4592 75365 76605 -78622 -333832 -313434 -155625 -64515 -51668 5506 -95627 -531 78346
4581 78346 47350 -130901 -255147 -39180 -52771 -217005 -304832 -233024 28312 190307 177024
4570 177024 159840 99199 133330 67975 1875 -39026 25167 65619 149768 107159 38874 -31486
4558 -31486 -47460 -39933 -131342 -304202 -283509 -68903 -49307 -31942 -227788 -173542 -42136
4547 -42136 158306 184914 87361 38875 205558 127092 7850 -81395 -119782 -75766 25735
4536 25735 -18938 5248 34267 -64265 -136773 -217464 -294548 -279699 -139867 -252715 -315985
4525 -315985 -349296 -383194 -155389 -28020 91527 162728 107107 117062 12293 -10854 -47849
4514 -47849 18085 281700 432168 226870 109845 212769 324054 203661 325596 302524
4504 302524 -29522 -126721 -177688 -8185 56190 39982 -99128 -103161 -101003 -149660 -11747
4493 -11747 -37959 66146 42492 121711 -349 -159508 -331661 -426360 -411769 -185811 -149669
4482 -149669 -77199 49762 174251 7255 23598 219217 287812 103945 116366 194046 223578
4471 223578 317087 205032 43329 62977 55687 60038 15003 111804 -77525 -68736 128303
4460 128303 133357 -29740 -77254 -79465 -235025 -366214 -391837 -360810 -430147 -408387 -217426
4449 -217426 -65561 -14580 187881 202188 120986 93183 -104 89989 53012 -127500 -36706
4438 -36706 461 3476 49412 157525 128224 -16184 -71368 -133439 24114 115943 79238
4427 79238 -25589 -119583 -90393 -123961 -162473 -176606 -134650 -94862 -96469 -28104 -16433 184041
4415 184041 245584 77607 -91576 -183574 -13736 81515 89717 57654 -90672 -78182 -62008
4404 -62008 -267965 -286488 -126430 -47597 -233364 -427164 -323627 -231386 -165506 -175874 -47308
4393 -47308 161760 261785 19146 -55988 44883 41978 33058 -34245 -55308 -128048 -48377
4382 -48377 -20258 114994 82590 24585 87708 -78934 -178379 -262063 -207112 61841 77609
4371 77609 47346 42891 -40561 -59039 -218891 -353453 -340432 -274919 -219055 -109135 -71941
4360 -71941 -155623 -138445 43166 24706 -152765 -47672 46324 -7543 -156907 -144042 -106835
4349 -106835 66977 60272 70204 -76412 -55758 -94295 -157129 -191760 -242053 -205405 -166079 -201820
4337 -201820 -153013 -10259 11826 -267760 -300725 -141264 -156102 -123360 -16502 75857 75263
4326 75263 17871 24049 93024 224787 317954 80184 46997 75647 104202 15113 -33476 -239782
4314 -239782 -285514 -161599 -49328 -12632 -26385 88114 228814 264596 89019 19583 -169033
4303 -169033 8049 143987 10080 -154345 -114634 -29795 -51658 1599 6743 87348 47828
4292 47828 106851 61101 133809 155103 166458 187575 116885 50735 129547 183215 218044 96959
4280 96959 -19274 14631 64189 60996 -65243 -145641 -104428 -127422 -197373 29219 152860
4269 152860 86820 -96201 70541 -35138 -219622 -223799 -109517 -253046 -361535 -107833
4259 -107833 76480 113059 -66411 -56114 100545 182780 34331 -53635 -51787 -217315 -90398
4248 -90398 -20002 -25950 -171208 -118374 6705 86321 -138654 32386 64736 -112748 -81737
4237 -81737 -113646 -220844 -236307 -96600 88479 52664 -149202 -186399 526 204307 159442
4226 159442 76350 21559 -37589 -71971 -207352 -210067 -169831 -20690 -125119 -244404 -76159
4215 -76159 67017 167285 123608 133575 18087 -56697 -44515 23824 -34472 -236727 -190784
4204 -190784 -177292 -40638 -55657 -28850 119450 -99992 -172464 -115976 -40100 58250 168490
4193 168490 91097 -186695 -246503 -92952 55032 114621 140634 121155 86301 69926 117595
4182 117595 250984 318331 178456 4261 -143316 -133621 -145908 -27286 -57884 -97465 -154361
4171 -154361 -71486 152955 166427 -38392 -4582 4602 17066 -11001 18218 -59420 -226629
4160 -226629 -105088 62242 11332 -38770 74099 25577 -61243 192585 238013 164961 114992
4149 114992 83802 26107 140912 157922 16495 126266 253207 292366 150104 42386
4139 42386 121316 95437 42636 -57339 -149075 -129893 -69684 219 -36585 96285 -41000
4128 -41000 -1706 -35358 2456 -77251 -202819 -245885 -138810 -120381 -132516 -234666 -249574
4117 -249574 -212994 -112085 -181772 -107272 -68873 -145192 -135744 -210803 -157880 -97665 -112554 -123787
4105 -123787 -244843 -332269 -149348 134568 146436 133762 113350 -71979 -124118 -58621 19948
4094 19948 17222 79978 43594 11522 56666 11837 -4416 -139862 -316043 -99788 162283
4083 162283 231061 171388 32022 -549 -127028 -159247 -62863 2188 57413 19873 -33653
4072 -33653 -98946 -157612 -138497 -160622 -226428 -80060 12419 22069 80697 -54885 -117546 -28391
4060 -28391 118856 264147 215459 268223 230892 79628 2893 -38199 -175767 -224914 -134545
4049 -134545 -99254 -97890 -225701 -235128 -247170 -235908 -129709 -64140 -87162 -124692 -34364 -78496
4037 -78496 -36943 71290 75285 -98405 -65226 -88613 -131946 -115631 18382 28961 51623
4026 51623 13648 175723 308711 178846 -79359 -183907 -297174 -125124 -7673 -36091
4016 -36091 -69724 38064 41963 -23629 -38307 -61724 -121997 -196606 -155390 -128868 -59095 -46792
4004 -46792 63089 24906 134004 135866 223384 208342 162373 192498 129903 128867 143964 -110638
3992 -110638 -253738 -131316 -103628 -209741 -50889 90360 89863 68824 23852 20091 -182839
3981 -182839 -378765 -353286 -236232 -166867 -112615 -15155 -57877 -126978 -214396 -136631 -98776
3970 -98776 -26907 86254 177754 230991 132786 145362 2482 -33689 98201 94874 147149
3959 147149 -86261 -208028 -272716 -215164 -287821 -257772 -169095 -110553 31235 -26047 -121313
3948 -121313 -28136 47898 -109531 -197219 -123616 -82510 -16389 92706 -64028 -256523 -181710
3937 -181710 -58896 -51661 -7584 -10195 -12909 -165518 -175682 -118960 -22408 42676 91927 -91545
3925 -91545 -81702 101782 280412 231066 142632 157052 -60281 -242841 -206961 -202255 -241226
3914 -241226 -302178 -178482 -29560 -2121 -121228 -111328 -48090 78179 17796 -53561 -120908
3903 -120908 -196922 -364967 -430780 -420539 -169647 -50253 41557 -20794 -468 22386 -22834
3892 -22834 -6661 76426 161789 161498 62416 -88869 -254223 -159719 -60708 123551 301630
3881 301630 178623 51000 7628 -109870 -233637 -89546 12342 -67065 -103465 -3030
3871 -3030 -72535 83308 207189 241254 121894 152042 179342 123282 -43755 33624 185372
3860 185372 -35719 -3680 133617 11239 -127348 -59177 -151973 -258230 -248439 -223041 -228665
3849 -228665 -221196 -212828 -148630 -230593 -27755 114996 106176 -88811 -112508 -336439 -308152
3838 -308152 -97055 -139747 -114141 -62844 -133761 -207729 -331914 -430530 -354341 -237003 -150996
3827 -150996 -373821 -540392 -408355 -187926 6773 -4511 218481 146983 15111 -145110
3817 -145110 -306986 -154306 -233969 -93122 -49387 106518 222848 215584 211482 111156 85622
3806 85622 139132 247391 342443 205332 56709 51199 35045 17819 -153701 -187407 -40667
3795 -40667 -23042 -56275 -88432 -47923 -250608 -310700 -267663 -228423 -129158 -88215 -208116
3784 -208116 -164539 -251 212274 274489 144449 -7740 -59043 -172788 -155146 59962
3774 59962 64461 25415 45382 40963 32206 172332 172882 67569 175112 112816 162318 148532
3762 148532 53906 -129262 -129613 11007 -40843 23345 14444 131884 139200 55343 38906 -106008
3750 -106008 -197402 -121689 -272313 -366761 -234838 -222915 -234565 -349372 -162997 -41007 -128211
3739 -128211 -235877 -258039 -191508 -142626 81456 175262 21898 14747 116922 67157 -79985
3728 -79985 -87060 -16264 -91481 -129291 -18346 4850 -76897 43369 138070 151836 141167 114237
3716 114237 222390 333197 329380 265473 269227 160672 156837 214008 215895 177636 155592 216429
3704 216429 193790 18566 -96158 -129209 -176331 -321588 -328055 -320318 -131426 -88057 -125267
3693 -125267 -119366 125279 116565 32065 -61764 -119175 -94371 -64217 34280 129964 259497 357452
3681 357452 419923 548672 653637 575535 259516 134140 -38279 -30128 50603 101737 -66133
3670 -66133 -208551 -43692 -53285 -39934 100107 204404 221215 241713 222726 318444 467624
3659 467624 294968 44425 -120619 -168443 -88769 -272 36240 130715 55201 -87937 148743
3648 148743 177502 -78461 -173222 -104533 -40044 8353 87859 207451 169515 158477 126717
3637 126717 212965 275845 212560 57239 162111 -31100 -244219 -225147 -64501 -3238 5963
3626 5963 25994 124169 248812 273803 407817 466972 192849 81409 89798 20758 -45405
3615 -45405 -120198 -177468 -78390 -98796 -198817 -95129 49665 -122607 -210388 -208751 -89773
3604 -89773 -72929 -52304 -41348 -70467 36844 47185 -39360 -138394 -105981 -85140 -30482 140087
3592 140087 260117 170827 271662 258564 103628 83062 288527 283998 287414 144383 65259
3581 65259 96350 187130 63010 -41436 -6205 -34232 23173 123176 68977 -17835 -84057
3570 -84057 -184644 -99647 215109 299777 215869 45301 2811 109607 96776 144939 -40561
3559 -40561 -147037 -158585 -113422 -7996 -1721 101250 209034 199054 147017 42562 -38798
3548 -38798 -114901 -110667 -76991 -100557 -132895 -199666 -33688 182807 243600 207859 94177
3537 94177 47206 -21382 -118619 -86392 -44665 -124602 46561 74879 65995 62109 34499 -25682
3525 -25682 47983 108456 -38926 32593 -139634 -121454 -44580 72263 156822 103708 127084
3514 127084 61334 14470 -25684 -52319 -180257 -184319 -224430 -181094 -153427 -79709 -50399 22874
3502 22874 122856 146667 73305 23371 -147737 -240185 -229873 -196614 -154983 -156535 -78658 -100243
3490 -100243 -134713 -188749 -149801 -141381 -60592 136852 236617 149706 170629 186064 14337
3479 14337 -109904 -44259 -6770 -75918 -152457 -104712 -4073 -37843 90438 28818 -54913
3468 -54913 33124 -13330 -73948 -132973 -48985 -75137 -142872 -125933 -32067 -48788 -72521 154843
3456 154843 33725 -84341 47412 91117 -164340 -205925 -134640 -56591 161319 142870 5146
3445 5146 -126713 -147255 9039 -39451 -143364 -201007 -254450 20395 246509 155985 156562
3434 156562 52363 -129216 -162488 100789 239663 64817 -6279 1243 -24246 -122403 -181886
3423 -181886 -37060 14278 113768 186533 221446 79429 -109018 -103450 31149 12608 -80945
3412 -80945 -73633 -125372 -233731 -250733 -151214 -178059 -213795 -225859 -169254 -119911 5346 268279
3400 268279 215289 162586 22022 24362 111469 29728 93767 86141 107222 -8922 -18301 -11023
3388 -11023 -106953 -131501 -66373 72882 17204 8611 47208 54630 127381 130782 246522 215405
3376 215405 113956 -59014 -74692 -117213 -170930 -126677 -69489 -220655 -258680 -108432 -71365
3365 -71365 61352 -90295 -256325 -193090 -47567 55733 -23614 -74984 -44118 -70990 69104
3354 69104 130417 35741 -49611 123119 323191 148339 128914 122921 88874 -91527 -185591
3343 -185591 -222739 -94837 -31963 43493 5327 -26657 -15196 53939 147861 127303 14654
3332 14654 -10171 -60899 23140 105063 -54566 -2288 -131688 -219429 -286692 -348022 -322765
3321 -322765 -100798 -61984 -211752 -173845 -31656 -24419 -137126 -210332 -148574 -75479 -193782
3310 -193782 11746 118111 -4401 103019 232094 174338 178296 46510 -91237 -14576
3300 -14576 53281 104814 -21651 -154654 -39389 197633 137922 39993 -131447 -248577 -195892
3289 -195892 -182115 -129769 -46730 -34132 -80653 -3304 60053 -35451 -90800 -184965 -270379 -256425
3277 -256425 -102054 29044 -25553 19296 -62006 106014 294705 119262 12634 11114 -31478
3266 -31478 106222 168936 132640 78487 147694 179551 193106 94520 89930 126447 55403 19383
3254 19383 84999 32364 -41451 -257429 -233223 -72152 -2300 -25900 -30990 -16345 -83172 -246196
3242 -246196 -249401 -256933 7495 131673 4176 -203713 -245438 -107845 -66213 -121517 -12991
3231 -12991 -47915 -97787 -64433 6093 -24315 -7279 -38378 -33208 43041 -22816 -36016 -168987
3219 -168987 -155668 -251114 -322356 -328889 -265770 -240742 -171409 -233174 -266921 -211987 -124318 -146516
3207 -146516 -209515 -300886 -232115 -119424 -18177 101338 60843 47738 94817 63107 -4011
3196 -4011 36025 62194 19306 -37046 -124374 -157200 -51527 -48077 -90301 -143576 -85096 -18225
3184 -18225 -42440 -189488 -175713 -115381 -183009 -176353 3986 -48708 -33957 7059 -2739 -26787
3172 -26787 -65344 -17445 -48315 -120067 -182459 -164634 -196340 -243978 -111697 -94157 -186553 -170901
3160 -170901 -182533 -185269 -105886 -249239 -225702 -219808 -286177 -293195 -191229 -76862 -178239
3149 -178239 -296938 -258661 -190932 -99434 174133 269951 163504 9819 -10571 49638 79896
3138 79896 206318 237330 338245 292649 166406 -54193 -222594 -296495 -319837 -235494 -198338
3127 -198338 -179765 -134956 5936 43819 92080 258614 116614 -51499 -166666 -179208 -142887
3116 -142887 -54653 15351 -15630 45718 41164 -15923 69454 84938 -81353 -39173 60158 85270
3104 85270 34842 28470 86575 92557 173112 175165 64065 -93258 25464 190518 168207 49383
3092 49383 41486 -75044 -205184 -104019 -122009 -211568 -218280 -145154 38653 151141 214012
3081 214012 111091 -11835 -101931 -72425 82799 81052 -17513 -17931 59895 88292 38564 -6767
3069 -6767 193024 317015 293324 185796 -57910 -293355 -179835 -129699 -102721 -24713 -26674
3058 -26674 -140574 -54044 1790 192592 188269 214479 48839 -90017 -141585 -217752 -139448
3047 -139448 -186640 -82493 115662 203477 86520 -61122 -169921 21092 -44333 -26493
3037 -26493 -75606 -219890 -258463 -194144 -36738 97767 -60168 -456 123617 154904 202528
3026 202528 98686 129211 134680 55905 182219 236067 138641 14237 107871 295031 284264
3015 284264 268113 165843 161795 98501 49854 -62852 -76119 73484 117781 140943 231037
3004 231037 176888 99641 78758 71190 -1018 -95546 -131266 32904 235909 281052 159095
2993 159095 -6195 38307 -12638 -78774 -112454 69242 20384 -22461 -132528 -22840 50048
2982 50048 94292 154636 186509 -1042 110707 232654 129637 -68900 -221700 -209146 -111507
2971 -111507 -143967 28637 96060 9560 67335 122422 85307 79333 122774 153863 126258 -62223
2959 -62223 -41326 -2152 1055 -44329 -10245 57948 73679 17473 -140373 -209389 -176031 -178039
2947 -178039 -154440 5522 95390 148076 117995 93295 13697 52356 12526 -140242 -135734
2936 -135734 13313 84326 178325 332037 301686 236332 219273 91385 91661 46068 100190
2925 100190 169041 145376 144193 231142 300532 176775 121455 71263 51242 31894 60354 -123264
2913 -123264 -218537 -298841 -257438 -186643 -89113 -50361 -35510 233293 203794 122069 72289
2902 72289 24593 169095 185993 265273 231569 199113 319276 288891 322336 89412 -34235
2891 -34235 53327 138746 86815 49496 98737 147617 -48281 -220232 -385995 -259555 -125144
2880 -125144 -193220 -171217 33986 156934 252438 155528 95313 161635 141951 90653 -47612
2869 -47612 -169185 -198837 -178724 -55612 -97117 -87684 -191315 -236776 -48199 164729 269212
2858 269212 343153 291897 141685 48416 30634 178571 185429 75510 50596 298180 314732
2847 314732 311327 223790 77733 50314 130134 290751 131239 -153503 2624 106211 -18680
2836 -18680 -54444 207228 308558 272199 259469 141672 20680 13430 -172115 -313088 -137410
2825 -137410 190083 237359 245093 213606 232262 81967 -33487 -160675 -82330 28926 60500
2814 60500 37037 26584 -38888 -84166 79816 208667 311035 364748 116412 195553 326217
2803 326217 330873 312177 333063 299525 294048 138620 135284 154746 68460 73187 30492 -151551
2791 -151551 -135776 -127211 -191189 -122096 -209526 -215973 -270308 -196336 -246798 -150606 -79701 36519
2779 36519 54329 40832 -16153 -37113 -113410 38811 84071 79308 82800 71324 -22849 -113084
2767 -113084 -41754 62128 -22599 -113246 -70206 -9057 60533 12925 -143194 -183335 -208909
2756 -208909 -171971 -102989 -562 80358 97240 139662 148261 1604 -169131 -235043 -137338
2745 -137338 -59769 -33998 92208 -97437 -68268 67716 -42172 -301209 -227606 -145467 -255229
2734 -255229 -164760 12017 -7120 -18064 -31071 -28746 215687 242781 143429 123066 213943
2723 213943 348667 382235 111297 -82731 -13564 20834 -62463 -118605 -44473 79982 100131
2712 100131 226117 314738 175083 -31368 -31165 72923 91528 29974 -10708 -51147 21703
2701 21703 33864 -80448 -148327 -174086 -211723 -76882 -83900 -89206 -56271 -223242 -178110 -15355
2689 -15355 -57318 69823 258646 181032 -69362 99418 154578 54124 -14025 -104053 -18885
2678 -18885 -10343 -27927 63180 50571 53009 177754 335868 105098 -115274 -117764 15828
2667 15828 84877 49477 52883 68598 69953 165546 118827 -39606 -33410 -21447 -49599 -43853
2655 -43853 98617 95883 93593 47249 -197484 -139214 -18226 29624 1098 41760 223907
2644 223907 229290 236088 264642 262780 269700 99280 -105951 -176764 -126777 55668 170239 204871
2632 204871 231046 102814 -10088 -65393 -37899 -83928 -98186 -89760 23031 190798 200403
2621 200403 252985 289970 214839 80248 -18160 -12838 129860 118656 114834 15217 61305 112265
2609 112265 148973 141413 -15319 -56816 122814 234871 38932 17085 54123 -72037 2319
2598 2319 47472 -15275 -133809 30172 206201 125359 11549 -151266 -92611 27588 120703
2587 120703 36271 -106490 37136 120899 82404 112394 90291 203152 94867 -19852 48339
2576 48339 173050 125164 28806 -25341 1077 -4783 102806 -15874 8402 72194 221368
$$ [...]
##END NTUPLES=NMR SPECTRUM
##END=
