##TITLE=Analysis number 321686
Compound Code rf 01278
Project Code adrs
Chemist Name fudan
##JCAMPDX= 6.0         $$ Bruker NMR JCAMP-DX V2.0
##DATA TYPE= NMR SPECTRUM
##DATA CLASS= NTUPLES
##ORIGIN= Bruker BioSpin GmbH
##OWNER= nmr
$$ XWIN-NMR		Version 3.5
$$ Tue Aug 22 12:54:06 2006 GMT Daylight Time (UT+1h)  MAYBRIDGE\nmr@NMR_250MHZ
##.OBSERVE FREQUENCY= 250.131544655141
##.OBSERVE NUCLEUS= ^1H
##.ACQUISITION MODE= SIMULTANEOUS (DQD)
##.ACQUISITION SCHEME= undefined
##.AVERAGES= 16
##.DIGITISER RES= 18
##SPECTROMETER/DATA SYSTEM= dpx250
##.PULSE SEQUENCE= zg30
##.SOLVENT NAME= CDCl3
##.SHIFT REFERENCE= (INTERNAL, CDCl3, 0, 16.522)
##AUDIT TRAIL= $$ (NUMBER, WHEN, WHO, WHERE, WHAT)
$$ ##TITLE= Audit trail, XWIN-NMR		Version 3.5
$$ ##JCAMPDX= 5.01
$$ ##ORIGIN= Bruker BioSpin GmbH
$$ ##OWNER= nmr
$$ C:\u/data/dgb/nmr/ADRS/1370/pdata/1/auditp.txt
$$ ##AUDIT TRAIL=  $$ (NUMBER, WHEN, WHO, WHERE, WHAT)
(   1,<2006-08-22 12:53:44.24 +100>,<MAYBRIDGE\nmr>,<NMR_250MHZ>,
      <created by zg, POWCHK disabled, PULCHK disabled
       configuration hash MD5:
       E2 DF 36 D8 04 B2 41 60 5A D7 A3 38 5A 4B D0 FE
       data hash MD5: 64K
       C2 41 00 9D D6 D8 06 69 43 BD FC D8 11 E0 71 FF>)
(   2,<2006-08-22 12:53:57.05 +100>,<MAYBRIDGE\nmr>,<NMR_250MHZ>,
      <Start of raw data processing
       ef LB = 0.3 FT_mod = 6 PKNL = 1 SI = 32K 
       data hash MD5: 32K
       1E 11 6F 15 1E 94 62 60 50 5B BA 35 DC 68 1D 9F>)
(   3,<2006-08-22 12:53:58.72 +100>,<MAYBRIDGE\nmr>,<NMR_250MHZ>,
      <apk 
       data hash MD5: 32K
       B7 F7 1E 02 38 D5 0C 0E 35 0F 09 A7 58 A5 D9 7D>)
(   4,<2006-08-22 12:53:59.49 +100>,<MAYBRIDGE\nmr>,<NMR_250MHZ>,
      <abs ABSG = 5 
       data hash MD5: 32K
       7E CE 9B 3D 03 6B 2E 4E 8A BE F3 D8 CC 3B AB 17>)
$$ ##END=
$$ 
$$ hash MD5
$$ A4 01 E9 31 84 9B 03 83 80 E0 B4 74 99 E8 56 77
##$RELAX= 
##$RELAX= 
##$RELAX= 
##$RELAX= 
##$RELAX= 
##$RELAX= 
##$RELAX= 
$$ Bruker specific parameters
$$ --------------------------
##$DU= <C:\u>
##$EXPNO= 1370
##$NAME= <ADRS>
##$PROCNO= 1
##$TYPE= <nmr>
##$USER= <dgb>
##$AMP= (0..31)
100 100 100 100 100 100 100 100 100 100 100 100 100 100 100 100 100 100 
100 100 100 100 100 100 100 100 100 100 100 100 100 100 
##$AQSEQ= 0
##$AQ_mod= 3
##$AUNM= <au_zg>
##$AUTOPOS= <31 >
##$BF1= 250.13
##$BF2= 250.13
##$BF3= 250.13
##$BF4= 250.13
##$BF5= 500.13
##$BF6= 500.13
##$BF7= 500.13
##$BF8= 500.13
##$BYTORDA= 1
##$CFDGTYP= 0
##$CFRGTYP= 5
##$CHEMSTR= <none>
##$CNST= (0..31)
1 1 145 1 1 1 1 1 1 1 1 1 1 1 1 1 1 1 1 1 1 1 1 1 1 1 1 1 1 1 1 1 
##$CPDPRG= <>
##$CPDPRG1= <>
##$CPDPRG2= <>
##$CPDPRG3= <>
##$CPDPRG4= <mlev>
##$CPDPRG5= <mlev>
##$CPDPRG6= <mlev>
##$CPDPRG7= <mlev>
##$CPDPRG8= <mlev>
##$CPDPRGB= <>
##$CPDPRGT= <>
##$D= (0..31)
0 1 0 0 0 0 0 0 0 0.06 0 0 0 0 0 0 0.0002 0 0 0 0 0 0 0 0 0 0 0 0 0 0 
0 
##$DATE= 1156247622
##$DBL= (0..7)
120 120 120 120 120 120 120 120 
##$DBP= (0..7)
150 150 150 150 150 150 150 150 
##$DBP07= 0
##$DBPNAM0= <>
##$DBPNAM1= <>
##$DBPNAM2= <>
$$ [...]
##$SUBNAM7= <"">
##$SUBNAM8= <"">
##$SUBNAM9= <"">
##$SW= 20.6930455092707
##$SWIBOX= (0..15)
0 0 3 0 0 0 0 0 0 0 0 0 0 0 0 0 
##$SW_h= 5175.983436853
##$TD= 65536
##$TD0= 1
##$TE= 295.16
##$TE2= 300
##$TE3= 300
##$TEG= 300
##$TL= (0..7)
0 120 120 120 120 120 120 120 
##$TP= (0..7)
150 150 150 150 150 150 150 150 
##$TP07= 0
##$TPNAME0= <>
##$TPNAME1= <>
##$TPNAME2= <>
##$TPNAME3= <>
##$TPNAME4= <>
##$TPNAME5= <>
##$TPNAME6= <>
##$TPNAME7= <>
##$TPOAL= (0..7)
0.5 0.5 0.5 0.5 0.5 0.5 0.5 0.5 
##$TPOFFS= (0..7)
0 0 0 0 0 0 0 0 
##$TUNHIN= 0
##$TUNHOUT= 0
##$TUNXOUT= 0
##$USERA1= <user>
##$USERA2= <user>
##$USERA3= <user>
##$USERA4= <user>
##$USERA5= <user>
##$V9= 5
##$VALIST= <valist>
##$VCLIST= <CCCCCCCCCCCCCCC>
##$VD= 0
##$VDLIST= <DDDDDDDDDDDDDDD>
##$VPLIST= <PPPPPPPPPPPPPPP>
##$VTLIST= <TTTTTTTTTTTTTTT>
##$WBST= 1024
##$WBSW= 4
##$XGAIN= (0..3)
0 0 0 0 
##$XL= 0
##$YL= 0
##$YMAX_a= 541128
##$YMIN_a= -539891
##$ZGOPTNS= <>
##$ZL1= 120
##$ZL2= 120
##$ZL3= 120
##$ZL4= 120
##$ABSF1= 16.522
##$ABSF2= -4.171173
##$ABSG= 5
##$ABSL= 3
##$ALPHA= 0
##$AQORDER= 0
##$ASSFAC= 0
##$ASSFACI= 0
##$ASSFACX= 0
##$ASSWID= 0
##$AUNMP= <proc_1d>
##$AZFE= 0.1
##$AZFW= 0.1
##$BCFW= 0
##$BC_mod= 0
##$BYTORDP= 0
##$COROFFS= 0
##$CY= 12.5
##$DATMOD= 1
##$DC= 0
##$DFILT= <>
##$DTYPP= 0
##$F1P= 14.0000005364418
##$F2P= -0.99999901652339
##$FCOR= 0.5
##$FTSIZE= 32768
##$FT_mod= 6
##$GAMMA= 0
##$GB= 0
##$INTBC= 1
##$INTSCL= 1
##$ISEN= 128
##$LB= 0.3
##$LEV0= 0
##$LPBIN= 0
##$MAXI= 10000
##$MC2= 0
##$MEAN= 0
##$ME_mod= 0
##$MI= 0
##$NCOEF= 0
##$NC_proc= -5
##$NLEV= 6
##$NOISF1= 0
##$NOISF2= 0
##$NSP= 0
##$NTH_PI= 0
##$NZP= 0
##$OFFSET= 16.522
##$PC= 1
##$PHC0= 153.7826
##$PHC1= 8.668427
##$PH_mod= 1
##$PKNL= yes
##$PPARMOD= 0
##$PSCAL= 4
##$PSIGN= 0
##$REVERSE= no
##$SF= 250.13
##$SI= 32768
##$SIGF1= 0
##$SIGF2= 0
##$SINO= 400
##$SIOLD= 32768
##$SREGLST= <1H.CDCl3>
##$SSB= 0
##$STSI= 32768
##$STSR= 0
##$SW_p= 5175.98343685301
##$SYMM= 0
##$S_DEV= 0
##$TDeff= 65536
##$TDoff= 0
##$TI= <Analysis number 999999
Compound Code 99
Book Reference 9
Project Code 9>
##$TILT= no
##$TM1= 0
##$TM2= 0
##$TOPLEV= 0
##$USERP1= <user>
##$USERP2= <user>
##$USERP3= <user>
##$USERP4= <user>
##$USERP5= <user>
##$WDW= 1
##$XDIM= 32768
##$YMAX_p= 380840136
##$YMIN_p= -963494
$$ End of Bruker specific parameters
$$ ---------------------------------
##NTUPLES= NMR SPECTRUM
##VAR_NAME=  FREQUENCY,     SPECTRUM/REAL,   SPECTRUM/IMAG
##SYMBOL=    X,             R,               I
##VAR_TYPE=  INDEPENDENT,   DEPENDENT,       DEPENDENT
##VAR_FORM=  AFFN,          ASDF,            ASDF
##VAR_DIM=   32768,         32768,           32768
##UNITS=     HZ,            ARBITRARY UNITS, ARBITRARY UNITS
##FACTOR=    0.157963299565203, 1,           1
##FIRST=     4132.6476996994, 0,             0
##LAST=      -1043.33573715361, 0,           0
##MIN=       -1043.33573715361, -963494,     0
##MAX=       4132.6476996994, 380840136,     0
$$ Real data points
##PAGE= N=1
##DATA TABLE= (X++(R..R)), XYDATA
$$ [...]
23392A7504046j00210o8010m54170l91752j06314j29075r4855N4597o7835l1251
23382A6115171l61893m05056l12513q2171j85059j56512p9905k39663j65349j91078
23372A3935972j38367j4074j74479j41376j46074k63836j89955j16716m1374k5973
23362A2683748j68465j95120j69128j97553j17997J04232m2335l14911q6803j49261
23352A1346407J12269J52152j18602o8775j75599k08966k4911n670k36595k35003
23342A0536707j95542j67499K240o5146l0984j00458l4942j02189J5812j75263
23332I682736k1660p4489j79747k23936L8275K43793k95034l13019K25289k40804
23322H841404l16839m2655N5777j14556k14747j88256l4678K6763j00047J8432
$$ y = [17504046, 17403836, 17335826, 16881656, 16489904, 16383590, 16254515, 16159660, 16214257, 16146422, 16115171, 15753278, 15348222, 15035709, 14953538, 14768479, 14611967, 14532062, 14292399, 14127050, 13935972, 13797605, 13783531, 13609052, 13467676, 13321602, 13057766, 12867811, 12751095, 12709721, 12683748, 12515283, 12320163, 12151035, 11953482, 11835485, 11939717, 11897382, 11582471, 11495668, 11346407, 11458676, 11610828, 11492226, 11423451, 11247852, 11038886, 11013975, 11008305, 10771710, 10536707, 10341165, 10173666, 10175906, 10110760, 10079776, 9979318, 9944376, 9842187, 9857999, 9682736, 9661076, 9586587, 9406840, 9182904, 9221179, 9464972, 9169938, 8856919, 9082208, 8841404, 8524565, 8481910, 8537687, 8423131, 8208384, 8020128, 7985450, 8012213, 7912166, 7930598]
23312G930598M5203L0733K6018l38533m4716r0241p4992m4971j93256J0525P2386
23301G328754K88764k14801j88298p286k68889q5853K3657L04838j55197k81943
23291F743746K15122o1742J21220m8691k99050l99901M2808o1340l2590l6999
23281F182583j92825l29346O0509k117J08407L6123M9854J4948l0344L4199j71765
23270E760226J12447j24610k28671k50355k369j33530r9185j68124j78367J42185
23260D829647l9571j3812J91444k2486j22834K67074o1222O6182j7456j08064
23250D968902j15495J50328k6733k6099J04290Q1921j79020j72897k738J1444
23240D793903j21677l24569j02744K30140O4503r7934j87838k4705k37412J30863
$$ y = [7930598, 7975801, 8006534, 8032552, 7694019, 7649303, 7559062, 7484070, 7439099, 7245843, 7256368, 7328754, 7617518, 7402717, 7214419, 7207133, 6938244, 6852391, 6876048, 7180886, 7025689, 6743746, 6958868, 6897126, 7018346, 6969655, 6670605, 6270704, 6313512, 6252172, 6219582, 6182583, 5989758, 5660412, 5720921, 5718804, 5827211, 5863334, 5913188, 5928136, 5897792, 5931991, 5760226, 5872673, 5748063, 5519392, 5269037, 5266668, 5133138, 5033953, 4865829, 4687462, 4829647, 4790076, 4776264, 4967708, 4945222, 4822388, 5089462, 5028240, 5094422, 5076966, 4968902, 4853407, 5003735, 4977002, 4950903, 5055193, 5137114, 4958094, 4785197, 4782459, 4793903, 4672226, 4347657, 4244913, 4475053, 4539556, 4441622, 4253784, 4229079, 3991667, 4122530]
23230D122530L8670k5723K46855J51544j60414k91345k5499J91821j84553l41850
23220C722036n2262N9440n474J4403l1083J46733j10965l6936p8635n7934J33567
23209C702890K83335j00249j56425J84061m6228L310r4796k92323j17660K26486
23199C592401J506n21143m1906J29027L08854L7476l6681j23225j51682R5512
23189C290139K19091j28809j99670J24176k2234L3784j84941j24091K92742J56366
23179C456553j31757j40460k10678k01184n1851N5565K79229j24858j10143K45478
23169C065894J8488j52931j91488P2854L07235J99864k21888l76061J05238k872
23159B824333j03236O7126M9091n4118o3892k72119J222K81007L8987P2766l8650
$$ y = [4122530, 4161200, 4135477, 4382332, 4533876, 4373462, 4082117, 4056618, 4248439, 4063886, 3722036, 3669774, 3729214, 3723740, 3738143, 3707060, 3853793, 3742828, 3705892, 3627257, 3569323, 3702890, 3986225, 3885976, 3729551, 3913612, 3867384, 3870694, 3775898, 3483575, 3365915, 3592401, 3593907, 3072764, 3030858, 3159885, 3468739, 3506215, 3469534, 3346309, 3194627, 3290139, 3509230, 3380421, 3180751, 3304927, 3282693, 3316477, 3131536, 3007445, 3300187, 3456553, 3324796, 3184336, 2973658, 2772474, 2720623, 2776188, 3055417, 2930559, 2820416, 3065894, 3084382, 2931451, 2739963, 2812817, 3120052, 3319916, 3098028, 2721967, 2827205, 2824333, 2721097, 2788223, 2837314, 2783196, 2719304, 2447185, 2448407, 2729414, 2768401, 2841167, 2802517]
23148B802517N8690k1594j44981j58144m0087J4204o3814k5869k798j85392o2320
23137B170412R6915j90R7036m774n254K03833o7915k45890q0262R2990J84923
23126B441824J87359L9086j97706j91903p0350l940K08254J4414j51454R5523
23116B371107J26599n9658j06861q6028k52173J26631o1691j566m4691p5380J18815
23105B055104J11683K0597r0464j18527N9039j49842l6622J75731l9252Q9998
23095B077445K18751k60841j88110J59673J27740j0742k42786r3618j74201J32287
23085A745598M15591L8233j86644k234j78722k22922r996l5603j0377n757j28940
23074A418227j8583J37487L13576K27187J6660j34044p7790r4642J3357n3039
$$ y = [2802517, 2861207, 2839613, 2694632, 2536488, 2496401, 2510605, 2446791, 2420922, 2418124, 2232732, 2170412, 2267327, 2267137, 2364173, 2359399, 2354145, 2557978, 2490063, 2244173, 2163911, 2256901, 2441824, 2629183, 2668269, 2470563, 2278660, 2208310, 2204370, 2412624, 2427038, 2275584, 2371107, 2497706, 2438048, 2331187, 2245159, 1992986, 2119617, 2057926, 2056360, 2011669, 1936289, 2055104, 2166787, 2187384, 2096920, 1978393, 2037432, 1887590, 1850968, 2026699, 1987447, 2077445, 2296196, 2035355, 1847245, 2006918, 2134658, 2123916, 1881130, 1787512, 1613311, 1745598, 2161189, 2199422, 2012778, 2010544, 1831822, 1608900, 1598904, 1563301, 1552924, 1547167, 1418227, 1399644, 1537131, 1850707, 2077894, 2094554, 1960510, 1882720, 1788078, 1801435, 1748396]
23064A748396M0229J78113j48438k06134k07655K30259K13438j36125q6801K2454
23054A647736R2258j75459K55911J2748L70N4293J30380r6262K4728M6944l95562
23043A598085k35690n6134k2296l166N4083j69028p1934J39496j786l3421J40308
23032A338517R9871j01210J01843M8394m6084q9396q9492m4260J05126J47302
23022A470611J61865L18598K2849l67236J9109J16292K55824k0509r0495O2338
23012A949246r8452N925j86450k65154k67899p9313l6146O2575Q7104j03030j82774
23001H85632J58559P2275J6998L3822J16012K73927J13898j78639n3898l17870
22991A120716n8130R5851K67563R6516j81735m8232J34115J16095j65841j21777
$$ y = [1748396, 1788625, 1966738, 1818300, 1612166, 1404511, 1634770, 1848208, 1712083, 1625282, 1647736, 1739994, 1564535, 1820446, 1833194, 1833564, 1887857, 2018237, 1921975, 1946703, 1993647, 1598085, 1362395, 1306261, 1283965, 1280799, 1334882, 1165854, 1093920, 1233416, 1231630, 1198209, 1338517, 1438388, 1337178, 1439021, 1487415, 1441331, 1351935, 1262443, 1218183, 1323309, 1470611, 1632476, 1951074, 1973923, 1606687, 1625796, 1742088, 1997912, 1977403, 1886908, 1949246, 1850794, 1856719, 1670269, 1405115, 1137216, 1057903, 1021757, 1084332, 1171436, 1068406, 885632, 1044191, 1116466, 1133464, 1167286, 1283298, 1557225, 1671123, 1492484, 1438586, 1120716, 1062586, 1158437, 1426000, 1522516, 1340781, 1292549, 1426664, 1542759, 1376918, 1255141]
22981A255141j15856j35549j86587j2186M5726J9303M2689J87130j7418k8198
22971A054195J12516L0905J73422l901L0799N5107o9659J30795k20149p7538J13030
22960A329522M2772n36o2677r4182n8615r1089J5649j14299j69833K1620l54071
22949D64261N1177K0098n9315J64927k6922O1216Q4604J28829J62191j05016j89293
22938G56757J40290k683Q3970R167j32905m3637r3132l8692L7371J32129K8576
22927H77211j80791q3389M1486L6039l5603J87197J88901N2898j19309r0182r3659
22916G80799k12998L2108J6250J4425K21620J10552J28819O9620k00555r134p6097
22905H75409J25281j55372l6222Q9455J1203j6465L2184N3253k10358o8799j04047
$$ y = [1255141, 1139285, 1003736, 817149, 804963, 850689, 869992, 912681, 1099811, 1082393, 1054195, 1166711, 1197616, 1371038, 1367137, 1397936, 1453043, 1383384, 1514179, 1294030, 1216492, 1329522, 1372294, 1371758, 1309081, 1214899, 1156284, 1065195, 1080844, 966545, 796712, 818332, 464261, 515438, 535536, 476221, 641148, 614226, 675442, 760046, 888875, 1051066, 946050, 756757, 897047, 894364, 978334, 987501, 854596, 810959, 717827, 679135, 716506, 848635, 877211, 696420, 613031, 654517, 690556, 654953, 842150, 1031051, 1083949, 964640, 874458, 780799, 567801, 599909, 616159, 630584, 852204, 962756, 1091575, 1161195, 960640, 951506, 875409, 1000690, 845318, 809096, 898551, 909754, 893289, 925473, 978726, 768368, 699569, 595522]
22894E95522j6662K90355J24442n6085j50747l609K3277L30016j29466j16766
22884H90277j47977k62612O5435R2290j38897m8863K6167J27727N2242J32995
22874G88784J07885o7521j50879j17789R670K29783j9677L7120j23753j08051
22864E85572O9345K98366K09926j91127j50871j4531p2887O5338L7100k52499
22854E83732p0288J79824J96002N3929j89864r2748j54160k37304p5262J53223
22844C47084K30968J77452K57223j42053K8195O7348n3455J82549K1917j11174
22834A006054k74897j69594Q1042j99339r7685K89256J08238j13563j18970k54326
22824B56216p3409K72018J37861m3920j8264J08359j21064k33959K62641K00755
$$ y = [595522, 578860, 869215, 993657, 937572, 786825, 783216, 806493, 1136509, 1007043, 890277, 742300, 479688, 545123, 637413, 498516, 449653, 475820, 603547, 655789, 788784, 896669, 829148, 678269, 560480, 570150, 799933, 780256, 817376, 693623, 585572, 654917, 953283, 1163209, 972082, 821211, 806680, 733793, 799131, 836231, 583732, 513444, 693268, 889270, 943199, 753335, 660587, 506427, 269123, 193861, 347084, 578052, 755504, 1012727, 870674, 898869, 966217, 912762, 1095311, 1117228, 1006054, 731157, 561563, 642605, 443266, 345581, 634837, 743075, 629512, 510542, 256216, 182807, 454825, 592686, 548766, 530502, 638861, 517797, 283838, 546479, 747234]
22814G47234L44845J31735j15160J00747l5220k56951k09146j07075j26914k14029
22804B60066M0847K70442J1474n8897J38831r1659j0811j07246j13897K8520j5910
22793C51760O3011J33422K24211K9557j6153q0500k64712J87734L5786j6470K153
22782F49799J17951J02358N2511K8318q2278j76117j06758M7770J09216J46852
22772H89622j72707n3198p240J52527L0903k33164k86753L54081L01954j14159
22762H61866q973q6968k14158j46419k8586p5044o1830M5180j83685J42654O6578
22751C10615q3848j16662O5869j78355K04043K94154M5663J46126M3414j67678
22741E63341k28693j33692j30753k1308K2826n250L45073R5727j17491m5342J58512
$$ y = [747234, 1092079, 1223814, 1108654, 1209401, 1174181, 917230, 708084, 601009, 474095, 260066, 300913, 571355, 582829, 523932, 662763, 571104, 560293, 453047, 339150, 367670, 351760, 414771, 548193, 772404, 801961, 785808, 705308, 440596, 628330, 664116, 647646, 649799, 767750, 870108, 922619, 950937, 868659, 692542, 585784, 633554, 742770, 889622, 716915, 663717, 656477, 809004, 839907, 606743, 319990, 674071, 976025, 861866, 852893, 765925, 551767, 405348, 376762, 301718, 239888, 285068, 101383, 244037, 310615, 226767, 110105, 175974, -2381, 201662, 495816, 541479, 687605, 731019, 563341, 334648, 200956, 70203, 48895, 71721, 66471, 411544, 507271, 389780, 344438, 502950]
22730E02950N873j45400K38648J18478j4125l6206p9612m5157K2243K0948o7168
22719E21472J82016L7662j50622O9966J78303m9963j49622L7321m0767j36337
22709D99429j76628P6642Q0988l19103k59827J01712K83713J42256O9322j92751
22699C05753p3959J26660j18264J98165K21079N9634m4667K00157j04943j66246
22689F03369Q629J72026k51184m31067K7287J85831J65721r2139j48804Q0607
22679C20276K65395k07429k82525j6227K5732j4631n6839K55330L11979m8193
22669E52868M3457r5687j34810J26184L61741k07105j36180K618K5001p497M6484
22658E77074Q4906m7951j25664j07868j30936J06614j23679k34978r106K9012
$$ y = [502950, 508823, 363423, 602071, 720549, 706424, 670218, 590606, 545449, 567692, 588640, 521472, 703488, 741150, 590528, 660494, 838797, 788834, 639212, 676533, 635766, 499429, 322801, 399443, 480431, 161328, -98499, 3213, 286926, 429182, 498504, 305753, 231794, 358454, 240190, 438355, 659434, 719068, 674401, 874558, 769615, 603369, 611998, 784024, 532840, 101773, 129060, 314891, 480612, 388473, 239669, 320276, 585671, 378242, 95717, 79490, 105222, 90591, 33752, 289082, 601061, 552868, 596325, 500638, 365828, 492012, 853753, 646648, 510468, 513086, 538087, 530590, 577074, 661980, 614029, 488365, 380497, 249561, 356175, 232496, -2482, -11588, 17424]
22648A7424L02892M3945L0889j95895Q5664J74907J85199l1684k17878l23088
22638G2375p3018K63128O9487r0559J14715L26058J23649j19374k72439l14472
22628I9550K32235O7307K6810K37926k59698j81123j72678o9600J50340K97824
22618D28893r9880k54904j6498J94480Q1371l3204j83076K6357K29726J42877
22608E16142J07680J25807p0013k51957o2314N9359J05302K0890R0526j99786
22598D41636l20498J49558q723r184j25758J2079K0509O1585o4568J44938J11116
22587D12690K3722q1800r5720j80594l4216Q2845p1656J33645K23590j54172q3680
22576A74654R4509j28859m8574r2065J28875J30798P3321J52152P9083k18355
$$ y = [17424, 320316, 364261, 395150, 199255, 284919, 459826, 645025, 613341, 395463, 72375, -643, 262485, 331972, 241413, 356128, 682186, 805835, 686461, 414022, 99550, 331785, 399092, 425902, 663828, 404130, 223007, 50329, -19271, 131069, 428893, 329013, 74109, 57611, 252091, 333462, 300258, 117182, 143539, 373265, 516142, 623822, 749629, 679616, 427659, 365345, 424704, 530006, 550896, 641422, 441636, 121138, 270696, 261973, 252789, 127031, 139110, 159619, 221204, 156636, 301574, 412690, 436412, 354612, 258892, 78298, 44082, 126927, 55271, 188916, 412506, 258334, 174654, 269163, 140304, 91730, -335, 128540, 259338, 332659, 484811, 563894, 345539]
22566C45539o7726m1894J16260K19441p9889j73644j30988n9277J1227q0284k5396
22555C3369P4709J70914K96253n9280k97349m9867Q7057o6914K3389O0825J5582
22544B88688o2945j7860K02661O7830L6697k53294j49349M0503J17745L2363r9402
22533B03637l9110J3745K36511j58980J28392O9865j7381m1987j09818n6073K2560
22522B51361N9705o4273q4400j09006r3128k35737j40509K33980J76011j2912
22512a8908J94709J16016m2484j40707O9145M8405j5662M372n1331q744J64039
22501C18850J19707l4363p2225J29943k6151n7223P5714j00301j17230K02954
22491D39675M002K6674k27726k65497R8651q2432p0348J39551M4071r384n7118
$$ y = [345539, 277813, 235919, 352179, 571620, 491731, 318087, 187099, 127822, 139049, 58765, 33369, 108078, 278992, 575245, 515965, 218616, 168749, 255806, 188892, 212281, 273106, 288688, 225743, 207883, 410544, 478374, 515071, 261777, 112428, 152931, 270676, 303039, 203637, 164527, 178272, 414783, 255803, 384195, 454060, 436679, 394692, 284874, 228801, 251361, 311066, 246793, 162393, 53387, -39741, -275478, -415987, -182007, -5996, -18908, 175801, 291817, 249333, 108626, 177771, 226176, 210514, 214886, 163555, 154811, 318850, 438557, 404194, 331969, 461912, 435761, 378538, 454252, 353951, 236721, 439675, 443677, 470351, 242625, -22872, 75779, -6653, -77001, 62550, 106621, 97237, 40119]
22480D0119r7545j35533L7013K76231J81333J0474R766J37934P7657o4139q8417
22469C84893L1312l53428j24079R2055N9229O4927J27175K25930p4168p5538j94137
22458A64171O5774J28564J11338r9519J1036J7960j56993j89055K50983K76684
22448E80943N4303o5899Q1634j9738k76512k29273j08018o972J501j58694j73704
22437c20429n4575K1587K9104N4437o265R0680K9992J78041J17525K59681J29457
22426E29235k07671j35079J38751k88701k60569N9750R2838J18578O3084k53365
22416a43149j9688J80291J01937j3367J28762N1557j09329j4513M0386o481l3480
22405A62926K0082j16511J19835j6717k4884j85806K0055o088M2252L00480P2403
$$ y = [40119, -57426, -192959, -155946, 120285, 301618, 312092, 321858, 459792, 537449, 473310, 384893, 416205, 62777, -61302, 30753, 89982, 154909, 282084, 508014, 433846, 358308, 164171, 229945, 358509, 469847, 370328, 381364, 399324, 242331, 53276, 304259, 580943, 635246, 569347, 650981, 631243, 354731, 125458, 17440, 10468, 11969, -146725, -320429, -375004, -353417, -324313, -269876, -276141, -185461, -155469, 22572, 140097, 399778, 529235, 321564, 186485, 325236, 36535, -224034, -164284, -71446, 47132, 110216, -143149, -162837, 17454, 119391, 106024, 234786, 286343, 177014, 162501, 202887, 196406, 162926, 183008, 66497, 186332, 169615, 144731, -41075, -21020, -27108, 15144, 315624, 388027]
22394C88027J08339o700L2422Q4772K14193j49408k46292n1432n2856J57159O2855
22383E41079j76066j53588q5880M2402q9751J4558J07236j31660j00736L03190
22373B70784J20697O0726o146k11945N5053r1037k20590k8244O0465P4943L7529
22362A22235J81717N7914N931J37695J6775j1880K4300j51413p1533p5987m055
22351B31699j10343N6904k15241p8532J20287M02505J31737l39426k47156p5483
22341a23049J00518k9419j68415n341M4505N1038J36965R0531J45294q4113k0909
22330A37605J11841r2679J11153J5563J27791j49595K0057l1418n4350k14414
22320a8446j29695J07124P0846J54707K09782J24633o918k35645J00685K2136
$$ y = [388027, 496366, 489666, 522088, 606860, 821053, 671645, 425353, 373921, 321065, 478224, 541079, 365013, 211425, 125545, 167947, 78196, 92754, 199990, 68330, -32406, 270784, 391481, 452207, 446061, 234116, 289169, 198132, -22458, -50702, 9763, 84706, 122235, 303952, 361866, 367797, 505492, 522267, 510387, 534687, 383274, 311741, 235754, 231699, 121356, 178260, -36981, -115513, 4774, 407279, 539016, 199590, -47566, -123049, -22531, -51950, -220365, -225706, -181201, -130163, 6802, 97333, 242627, 158514, 137605, 249446, 156767, 267920, 283483, 411274, 261679, 281736, 250318, 195968, -18446, -148141, -41017, 29829, 184536, 394318, 518951, 512033, 276388, 377073, 399209]
22310C99209k79474k18468J7226J10293m500M41575J37557j49687k23960p2265
22300A57506k4477j67471l986J07863j40638k56251r7160K2543M24408J16482
22290A38819K2761Q7615j52830K9373L03752j72138k63014J14576K14754J4607
22280C38275j630j340j62733J0960J77431j8164P6602j06975q2130m3898l0207
22269A56191j30914N7025j196J48715J29993R2971R9845j48530l49843k35685
22259a81428m816K04391L05829r8499k1064j8719j9013p6922j4776R3551N6312
22248B24846j33878p3852l7007Q3701o8885N8628J07278l17371n4696K00948j1950
22237b2238N7397Q7160R03J24925R2934j25417m1750P2998n1551P808M5529K1305
$$ y = [399209, 119735, -98733, -81507, 28786, 24286, 465861, 603418, 453731, 229771, 157506, 133029, -34442, -38428, 69435, -71203, -327454, -424614, -402071, 22337, 138819, 161580, 249195, 96365, 125738, 429490, 257352, -5662, 108914, 323668, 338275, 336645, 335305, 172572, 183532, 360963, 342799, 419401, 312426, 230296, 186398, 156191, 25277, 82302, 81106, 229821, 359814, 452785, 552630, 404100, 54257, -181428, -186244, 18147, 323976, 225477, 204413, 185694, 166681, 89759, 74983, 168534, 224846, 90968, 17116, -19891, 63810, -5075, 53553, 160831, -156540, -211236, -10288, -22238, 35159, 122319, 123222, 248147, 341081, 215664, 173914, 246912, 195361, 203169, 248698, 270003]
22225B70003J2706J53098J49746J1675Q8611j90556N7007l2744k14423k13911
22215I1212k27616M6596K36926J87643Q2533J22762J2990j5745k79430j51601
22205A06270M824q543K6864K0311K80519J76093L776m60522j29716O0357J32809
22194B13042j27805o208L1941R9876J42311J49716k29378j8625O5604K5190R8410
22183D44074P3279j1420k0840J16824k21487Q383M9847j53076j91152k51265k1868
22172a78701Q6809J86696N2974J4998k15878M073J6271p2569K03341J21562R4021
22161C13597L3184M8887j96851j66164l1006q8165K59044J60626j88689J78250
22151C22713j13956J46070Q7043j66675M588j02082P8839j52240l70612p8249
$$ y = [270003, 282709, 435807, 585553, 597228, 685839, 495283, 552290, 519546, 305123, 91212, -136404, -89808, 147118, 334761, 417294, 540056, 553046, 537301, 257871, 106270, 111094, 102551, 129415, 149726, 430245, 606338, 610114, 149592, 19876, 80233, 213042, 85237, 79029, 110970, 210846, 353157, 502873, 273495, 254870, 320474, 345664, 444074, 517353, 505933, 485093, 601917, 380430, 388813, 438660, 285584, 94432, -156833, -178701, -91892, 94804, 147778, 162776, -53102, -49029, -32758, -105327, 98014, 219576, 313597, 346781, 395668, 198817, 32653, 1647, -86518, 172526, 333152, 144463, 322713, 208757, 354827, 441870, 275195, 279783, 177701, 256540, 104300, -266312, -344561]
22141c44561J66128K51073j4976j49414k9160J35356L2246l281o2623j2727P5596
22130D3657m904p3745J5440n793K33357J40276l76473j42674K46681j81966j11104
22119b17248J36904J03360R2793j04478l0137r516J06529k1868j55715k21994
22109c21370M2158p8658M4831K29884R5737q9790p0895Q9990j56788J09240K22227
22098A16566k3594o1821p3482J30948r0726L6619R673O8944N6414M8389j19423
22087I8507J00137k4698j44641N198N3535j19222p7493K82643J41048O1252q130
22076C68136M4846j00182j18876j93080j82344J25113k43690l873K11365Q4622
22066g963O8423j56957o1506J53741j21138p8387K9611O6967J14177J8000k13013
$$ y = [-344561, -178433, 72640, 57664, -91750, -120910, 14446, 46692, 43411, -19212, -31939, 43657, 38753, -34992, -19552, -25345, 208012, 348288, -28185, -170859, 75822, -106144, -217248, -80344, 23016, 115809, 11331, -18806, -28322, 78207, 56339, -99376, -321370, -279212, -357870, -313039, -83155, 12582, -77208, -148103, -58113, -214901, -105661, 116566, 92972, 31151, -42331, 88617, -2109, 34510, 44183, 113127, 169541, 217930, 98507, 198644, 173946, 29305, 34503, 88038, -31184, -108677, 173966, 315014, 376266, 368136, 412982, 312800, 193924, 844, -181500, -56387, -300077, -303950, -92585, -7963, 60460, -96497, -158003, -4262, -125400, -203787, -174176, -107209, 6968, 24968, -188045]
22055a88045O0246J73260n4576n6636j00037j38091J79319K15221j77684j83422
22045b70445k24438J70992O0247Q8672J39987j17804J65378K10663p7863L1726
22035A77115j3677j62704j54708L50673J44985n7268l317k27268j88693K09737
22025G4875K30969j0582j70876j90116P1744K22355K10338j03823l67515k21232
22015b53863J34969O9790q1171j82883l2853q0662K74581M3257Q5774p532R884
22004b0709J27022J41864K9378j91668j46100p4870K36803J44483P5871J58163
21994D80237m9084k82287k2616R271K56101J16667l4389k56222k20357J57844
21984A55165p2518j56668P1102Q6833l3684j81414p5853Q172Q7434j19049k24296
$$ y = [-188045, -127799, 45461, -9115, -65751, -165788, -303879, -124560, 90661, -87023, -270445, -494883, -323891, -263644, -174972, -34985, -152789, 12589, 223252, 145389, 177115, 163438, 734, -153974, 196699, 341684, 284416, 281099, 53831, -134862, 74875, 305844, 295262, 124386, -65730, 6014, 228369, 438707, 334884, -32631, -253863, -118894, -49104, -130275, -313158, -346011, -426673, -152092, -108835, -23061, -30593, -20709, 106313, 248177, 277555, 85887, -60213, -135083, 101720, 246203, 322074, 480237, 431153, 148866, 126250, 135521, 391622, 508289, 473900, 217678, -2679, 155165, 82647, -74021, -2919, 83914, 50230, -131184, -207037, -198865, -111431, -230480, -454776]
21973d54776N7293L40485L53589j9422k39343j66982l7267n0114J05390r3615
21963b04762L8356j02701j1915K50947K42459J28454m35987k77865K65412K7434
21953h0168J11379N1367k11012k15153J11643K6845K16907P7071K1434L7677p5959
21942G2031R9387J97929P9346j79637j28726M2847p4631m5210q0185O3274K13400
21931B59825J32712k28697j51793k05613k12491N3584L3028K5011J87271R8046
21921i117M0256M6858M0115J4688m2668q136k03031K1202J7031Q4210l5600n7783
21909i1975J27117J23750m828j34207p7458J99814o5109Q6752j66195Q7255J75969
21898B60885J7483k35663n767k92993L5118J12067r6572k17001j9347J87985R3187
$$ y = [-454776, -397483, -56998, 296591, 277169, 37826, -129156, -166423, -216537, -111147, -204762, -166406, -269107, -281022, -30075, 212384, 340838, -95149, -373014, -107602, -80168, 31211, 82578, -128434, -343587, -231944, -205099, 11808, 88879, 110313, 147990, 72031, 171418, 369347, 448693, 269056, 140330, 183177, 108546, 63336, -16849, 46425, 259825, 392537, 163840, 12047, -193566, -406057, -352473, -319445, -294434, -107163, -9117, 31139, 77997, 118112, 132800, 90132, 81996, -121035, -99833, -82802, 1408, -34192, -91975, 35142, 158892, 154064, 19857, -57601, 142213, 77104, 163856, -2339, 84916, 260885, 278368, 42705, 36938, -256055, -220937, -108870, -205442, -422443, -441790, -253805, -160618]
21887a60618R8169R0056K42868J970k40168l5165L3495n7983l4414J11448J02590
21876A52248m5462l4329k44717j06250K35446K42120l4042l15442o0361o0943
21866b71732K97250M4170J9799j62670N1652K49212k8784k1371L9990j0156p4230
21855A33130q9040K2521j4246j42868Q6717J53804M2959k8149j1676j94151K7963
21844a3036J49040q3098K9699n6637j24821N2507K62656p2071p0891j61533j6846
21833a05031K83852J75893J2959Q6767j40829m0726J69320J42795k25835k62200
21823I6965l0763j42044J03017N301K4516p659L928J54201Q7899n0823j2281k43898
21811a1641L9336K74509N298n1502R4127j414M2401j4973J9679j50746L4928J2026
$$ y = [-160618, -62449, 27607, 270475, 272445, 32277, -2888, 30607, -27376, -61790, 49658, 152248, 106786, 72457, -172260, -278510, -43064, 199056, 165014, -150428, -210789, -271732, 25518, 69688, 89487, -73183, -21531, 227681, 198897, 177526, 217516, 207360, 133130, 44090, 66611, 52365, -90503, -3786, 150018, 192977, 164828, 153152, -40999, -13036, 136004, 52906, 82605, 25968, -98853, -46346, 216310, 144239, 73348, -88185, -105031, 178821, 354714, 367673, 454440, 313611, 272885, 442205, 585000, 359165, 96965, 66202, -75842, 27175, 32476, 56992, 49333, 53261, 207462, 295361, 244538, 232257, -11641, 27695, 302204, 307502, 256000, 350127, 348713, 391114, 376141, 395820, 245074, 280002, 292028]
21799B92028n9692r3208j94794r6575J33938J17450O489J14527K81449O5608l27832
21788B39388k90092J09977K85390j06202K5977Q6398j31058o6118J45254J98343
21778D97257K2175j50378k86540k15905K40923K04022j13370j30110j0380Q9346
21768A47040J28809J28365m4698J5404j25272k68773k9144J84653r166k54908
21758a27690j05594J58008J13156K99340Q7063j57151j06755J59306k6635k84629
21748H419j99401k8068J17604j4154j01986J67431P5773P3025o1604O2690p9382
21737B0347j91545j05656J01735Q4714K3253k4562j04019J21813J40537P0507
21727A37124j48056l8655J29267J29807J60851R9213J28827n5188r1575j43624
$$ y = [292028, 232336, 139128, -55666, -152241, -18303, 99147, 105636, 220163, 501612, 567220, 239388, -50704, 59273, 344663, 238461, 264438, 350836, 219778, 153660, 298914, 497257, 519432, 369054, 82514, -133391, 107532, 311554, 198184, 68074, 57694, 147040, 275849, 404214, 359516, 374920, 249648, -19125, -48269, 136384, 127218, -127690, -233284, -75276, 37880, 337220, 424283, 267132, 160377, 319683, 293048, 8419, -190982, -219050, -101446, -115600, -217586, -50155, 25618, 98643, 37039, 99729, 20347, -171198, -276854, -175119, -90405, -67152, -91714, -195733, -73920, 66617, 137124, -10932, -49587, 79680, 209487, 370338, 469551, 598378, 543190, 451615, 307991]
21717C07991j22977k4504k03318k8959P5270R2514J65482k11933k56506n393j46252
21706c58585j15026N5603K10289J00365K49901P9468k18198j29893j36563j4422
21696b77061K7847N9504J67703J51180Q3907m9298k23881m0979K40953J23045
21686B62920Q8462R0027j98540k35240j96631r4706J58985R0510J0613j4940j23950
21675a62490J1467K74j1473K23859K15187j1502k10969k717J21782p2884k39484
21664a38950j53057R6534N2032N8047p2531l3377L19329R8045j06316j3382m5961
21653F0413j34217j92196p4325j14639L59237Q9641R0623J91198j7475L4856j93835
21642I9281J4078n7361l1605J11207J35728p7849q973J05032j4482j66969l50372
$$ y = [307991, 185014, 160510, -42808, -71767, 3503, 96017, 261499, 49566, -206940, -212333, -358585, -473611, -418008, -207719, -107354, 142547, 222015, 3817, -126076, -262639, -277061, -249214, -189710, -22007, 129173, 213080, 163782, -60099, -101078, 139875, 262920, 351382, 441409, 242869, 7629, -189002, -283708, -124723, -34213, -23600, -38540, -162490, -151023, -150749, -162222, 61637, 276824, 265322, 54353, 51636, 173418, 100534, -138950, -292007, -195473, -143441, -85394, -157925, -191302, 128027, 226072, 119756, 106374, 60413, -73804, -266000, -340325, -454964, -95727, -6086, 84537, 275735, 258260, 293116, 99281, 113359, 55998, 24393, 135600, 271328, 193479, 184506, 289538, 275056, 108087, -242285]
21631b42285j09P8656J12003k4933J26670N1241j28085L2606j38473J16283J04190
21620H7764j60607p6846M5377r8307N1542J16955k65366J67098m2295k18437R4712
21609b98410K14217O1495P212R6275J54696K19369M7518r0738j25675l5859K86546
21598E36646J74427k32732l38311r6578N3487p2663J46632K4375m5116J36932
21588B87099N2270k01357o7359q3600j9211J63938K9780k87336k8087K36033J46227
21577B28397r1712j44724L3490R5594J75905J55275k81781l9508R9430p2497j42814
21566A5055L7431j1493j94049n4491J08884J4403K2295j01273Q1751J79928q4746
21555A3695q7976j5072o4998l782K42735K05239P0352k69407m04833j10056L01762
$$ y = [-242285, -242394, -163738, -51735, -76668, 50002, 101243, -26842, 5764, -132709, -16426, 87764, -72843, -149689, -104312, -202619, -151077, -34122, -299488, -132390, -174685, -393122, -298410, -84193, -22698, -15486, 80789, 235485, 454854, 502372, 411634, 285959, 250100, 536646, 711073, 478341, 140030, 43452, 96939, 24276, 170908, 195283, 150167, 287099, 339369, 138012, 70653, -12947, -32158, 131780, 161560, -125776, -153863, 82170, 228397, 136685, -8039, 25451, 121045, 296950, 452225, 170444, 130936, 230366, 157869, 15055, 52486, 40993, -153056, -207547, -98663, -84260, -61965, -163238, -81487, 98441, 13695, -74281, -89353, -154351, -158133, 84602, 289841, 360193, 90786, -314047, -424103, -122341]
21544a22341K28601r3400J35880q8953m64953q3531J73882K70398O6209o3784
21534d1992k38722k965j85644k73910K76610K94127J13641P3166o8670q2185J30572
21523e972o3892O9713J47384L34826N2228k09085O3750j37685k14737n1524l2907
21512d7901m4264K05839q008j33679m1140J45041j21912q7654j33753j4190J71377
21501a10244K17659J71776j89290P19l0906O3788r8823m0159p3986j21298Q3833
21490a26931N4765q8674Q8227J5768O8789O9391l6889j49077q350l8422K3483
21479a27920J19001Q7583q243n8547M6611j40639r2565P9465J83184J14827k47703
21468d4946j45561K12200r2266n0784o6189O7761J44727O0294j45609J0228K79523
$$ y = [-122341, 106260, 12860, 148740, 59787, -405166, -488697, -314815, -44417, 21792, -41992, -280714, -283679, -469323, -743233, -466623, -172496, -58855, 14311, -54359, -136544, -5972, -69864, -151, 147233, 482059, 534287, 325202, 388952, 251267, 36530, -14994, -47901, -92165, 113674, 105666, -28013, -69153, 75888, -46024, -133678, -267431, -281621, -110244, 107415, 279191, 89901, 90620, 59714, 123502, 24679, -15480, -89466, -210764, -126931, -72166, -160840, -72613, -56845, 11944, 81335, 44446, -104631, -112981, -151403, -127920, -8919, 78664, 70421, 11874, 58485, -82154, -174719, -95254, 87930, 202757, -44946, -190507, 21693, -70573, -121357, -187546, -119785, 24942, 85236, -60373, -50145, 229378]
21457B29378j18185k24071o3132L4679J0779K35307J22136m1090Q2834J00590
21447C69225J79477j46394k88971n0684k14557P1386k1150j4341j43052j4580
21437b73641P8690J12609l1312L5397r6264j75561j47197K70464K30720J52611
21427A56516M0632O554n9247k45345Q2819m655J113r4674K27020j57039j1061
21416e7367j2466J62695k5506j22704J08106R057k09472k32306o2503j68639J94784
21405d16321J36903K52126K79436K40721j76616J24322K4982j32793j9923Q8925
21395D01762j43181k30235j83634k8609n3851m0066J08188K75005J41912J3500
21385B60791o4744O0463k03335l70018m9894J45650N2662m5133l2802K15773K01174
$$ y = [229378, 111193, -112878, -176010, -141331, -130552, 104755, 226891, 185801, 268635, 369225, 548702, 402308, 113337, 62653, -151904, -80518, -101668, -116009, -259061, -273641, -194951, -82342, -113654, -78257, -174521, -350082, -497279, -226815, 3905, 156516, 197148, 203702, 144455, -100890, -18071, -22726, -21613, -116287, 110733, -46306, -57367, -69833, 92862, 67356, -55348, 52758, 61815, -147657, -379963, -442466, -611105, -416321, -279418, -27292, 252144, 492865, 316249, 440571, 465553, 332760, 312837, 401762, 258581, 28346, -155288, -183897, -237748, -277814, -169626, 105379, 247291, 260791, 196047, 256510, 53175, -316843, -366737, -221087, -168425, -213558, -246360, -30587, 170587]
21374A70587q8216J45420N4807l40834N0541q7881k51424M0835Q1957J85628K5220
21363a3360k29284K407J497K40614J19933k62654j93291L3444J40647J04229J11500
21352E5682R7504j52528Q6774N6100j73499k46695J43869J53532P3164K7649O1090
21341A82642m764l25898q9971J38581O6975j27812R0426K61089J00710j9463k52366
21330B0149K2966J11214O2434r6551R4934K9979K371k63568k32926J05447L87904
21319B44353J35514j89665j64620k54637q4969j15453R9503l0381m6377R6603
21309c10129o1711J57400N5220J68715J94524J1224k24621p7598J95772M5944
21299A54740j08502L97L1633l23328j30761J99937J83116k80935P9485J65036
$$ y = [170587, 82371, 227791, 282598, -58236, -7695, -95576, -347000, -306165, -224208, -38580, -13360, -242644, -240237, -238740, 1874, 121807, -140847, -334138, -300694, -160047, -55818, 55682, 153186, 658, 87432, 143532, -29967, -276662, -132793, 20739, 93903, 121552, 182642, 177878, -148020, -237991, -99410, -32435, -160247, -69821, 191268, 291978, 272515, 20149, 43115, 154329, 216763, 120212, 215146, 245125, 247496, -16072, -248998, -143551, 244353, 379867, 190202, 25582, -229055, -314024, -429477, -329974, -360355, -406732, -310129, -371840, -214440, -159220, 9495, 204019, 215243, -9378, -86976, 108796, 154740, 46238, 46635, 78268, -245060, -375821, -175884, 7232, -273703, -194218, -29182]
21289b9182p5136k10853Q8401R9991P5936Q9693q1085J31700m6906q6728j10430
21278a54599J8895j87101Q0826K02241n6352M7793J22325J07483l0716j22871
21268B7924k1313J47414q9240P833l2545r8643J99126k7529k04660p9820q5226
21257b56679j23949J37414J00733J99318j10805j34407j16669P8659j32018N7055
21247c01348R4942L9240j80668j47373p2311K63087J19799K30249J57161j25817
21237G6961n9104k3717l68995J69134J00560p1247j1170j61754J20872J8647j6653
21226b26466l6377r460R413M5565M6837Q9847R6174K41867j88432j86484l30229
21215d47745j48950k1789L19539K87160P0503Q3669m9353q8185J27650J01057
$$ y = [-29182, -104318, -315171, -226770, -126779, -50843, 38850, -42235, 89465, 42559, -44169, -154599, -135704, -322805, -241979, -39738, -96090, -48297, 74028, 181511, 150795, 27924, 6611, 154025, 64785, 72618, 40073, -58570, 140556, 113027, -91633, -171453, -256679, -380628, -243214, -142481, 56837, -53968, -188375, -305044, -226385, -358403, -301348, -206406, -167166, -347834, -495207, -567518, -304431, -184632, 45617, 202778, 76961, 17857, -5860, -374855, -205721, -105161, -176408, -187578, -349332, -228460, -209813, -226466, -262843, -272303, -262890, -217325, -170488, -80641, 15533, 257400, 68968, -117516, -447745, -596695, -618484, -298945, -11785, 58718, 142387, 93034, 4849, 132499, 233556]
21205B33556k2929k11664J9119L7301k8028O1598J72853R9629K5628R1479j04889
21194C73653j49897q717n4269j28131k25628l6052P4149p4523J30990r9197j65745
21183c63367j889R2958J96281k61520P1451L37871O6795j18363r1087Q3640K1911
21172C4681k0372P7848j21911j30003l5889J19515o0895j10075k4153J62396J30082
21161B1224K26936k5161j83729l50518k12387k7917K24233l4326k37175J66241
21151d32579L74407J34580l9075J33314K5513j37048k21671j20839J0217J26636
21141a46545K05280J57475k52112R2049J79968k10146J58342r1056m26264o7612
21131d00621J36993K19620j6662k48129N7141j46862L030K4257k48996P3895L40274
$$ y = [233556, 210627, -1037, 18082, 55383, 27355, 88953, 261806, 361435, 387063, 478542, 373653, 223756, 215039, 160770, 32639, -192989, -229041, -154892, -229415, -98425, -197622, -363367, -365256, -272298, -76017, -337537, -266086, 71785, 138580, 20217, -70870, 12770, 34681, 14309, 92157, -29754, -159757, -195646, -76131, -137026, -247101, -271254, -108858, 21224, 248160, 222999, 39270, -311248, -523635, -551552, -327319, -361645, -598820, -432579, -58172, 76408, 37333, 170647, 196160, 59112, -162559, -283398, -273181, -146545, 58735, 216210, -35902, 56147, 236115, 25969, 184311, 93255, -333009, -400621, -263628, -44008, -60670, -308799, -251658, -398520, -395490, -371233, -620229, -546334, -206060]
21120b06060J73530m3424J17661j6248k36078j34387J0880l1638k42802k1397
21110f29963M4815K93390K30540J21154R4051m31140m81587J29295K56460K7797
21100c45188k0967k3271J0065j3516l3589J24678J27190q117q3094J11725M9757
21089a04327N4555n84m1498J83667o6125j90374j45573k73349j3801L20456L10637
21078C3684j08072l1278J50381N9483l8054N2232k07067k4129K3256M6111J43879
21067A00426r821J8937j07168j93259O9129N4314M5354l7539k8576N8483R2960
21056F3240J7299j05500j78946j30087M0988K76319K96167J00156k04509k60846
21046h5719k94936l7340J72676J49067L4492k73334m7187M6748J40311M0661j09
$$ y = [-206060, -32530, -75954, 41707, 25459, -210619, -345006, -334126, -365764, -608566, -629963, -585148, -291758, -61218, 59936, 153987, -277153, -758740, -629445, -372985, -345188, -366155, -389426, -379361, -392877, -426466, -301788, -174598, -182715, -265809, -154084, -104327, -49772, -50356, -91854, 91813, 25688, -164686, -310259, -583608, -597409, -276953, 33684, -74388, -105666, 44715, 104198, 66144, 118376, -88691, -112820, -89564, -43453, 100426, 90605, 109542, 2374, -190885, -121756, -67442, -22088, -59627, -88203, -29720, 63240, 80539, -24961, -203907, -333994, -293006, -16687, 279480, 379636, 175127, -85719, -380655, -417995, -245319, -96252, -61760, -335094, -382281, -335533, -195222, -154561, -154670]
21035a54670j5120q2205J6188p1239P7079J05846L29988k9953O0954n0928L1829
21024B17769m8487O4251j19807j04650j03244n6234M0957Q3308k63485q0478K09723
21013a60377j1505q4486K5773n1519q2350K7656K53162K99771K8596k23474k98136
21002b76889j79496K11459R2637m2261K27201m3195r7441J1473J1476K21566Q9919
20991B26449Q632j42404l788K64688K26282m3635Q2964k97714o14310k85892L5769
20980e42959K05974K71181P3651j82567j06660R0251Q7607Q2663j8237r2224j15457
20969b46777L4881M8504j11606j90636R8558R5573K46765O2220Q5224j55703O786
20958b6211j29316j31079j4807J78241J13495n0335o6761M4809J71482R0727j90568
$$ y = [-154670, -169790, -251995, -235807, -307046, -229967, -124121, 205867, 175914, 236868, 185940, 217769, 169282, 233533, 113726, 9076, -94168, -150402, -109445, -26137, -289622, -370100, -160377, -171882, -256368, -230595, -282114, -364464, -336808, -83646, 216125, 244721, 21247, -276889, -456385, -244926, -152289, -194550, 32651, -10544, -107985, -96512, -85036, 136530, 226449, 235081, 92677, 88889, 353577, 579859, 536224, 619188, 321474, -292836, -578728, -542959, -336985, -65804, 7847, -174720, -281380, -191129, -103522, -20859, -39096, -131320, -246777, -211896, -163392, -274998, -465634, -367076, -271503, -24738, 37482, 122706, -32997, -26211, -155527, -286606, -301413, -123172, -9677, -60012, -126773, -81964, 89518, 180245, -10323]
20947a0323k56633j31985O4245J86774P7754o1925Q8564J48957j39438j98064
20937b32074J5129N7172K3144K3900J04994o7288j06568p3748l49752j14106L05678
20926d13519J37645J21443p8471J7760j09033j74655p3917J02186J08653J34573
20916b27335J80198R3572l0020k8118l1858j46470J62614K6185j94722j27528
20906c23482p5181R6951J57338K33891l4330k34375k62830l36360K40542L49191
20896a88645p9000j63896j08404M8465N81Q4903J65822J57435K72719N0298l06152
20885f5874k01184l7978Q9387N4318R316j54190Q9276j23384k4549K58865J2851
20874i3146n5093j26858m4201J39394O1593P6493K21163k5401m795l9515j6226
$$ y = [-10323, -266956, -398941, -334696, -147922, -70168, -132093, -43529, 105428, -34010, -232074, -216945, -159773, -136629, -112729, -7735, -75023, -181591, -255339, -605091, -719197, -413519, -275874, -154431, -232902, -215142, -324175, -498830, -572747, -470561, -361908, -227335, -47137, 46435, 16415, -11703, -43561, -190031, -27417, -1232, -195954, -323482, -398663, -301712, -144374, 89517, 55187, -179188, -442018, -778378, -537836, -188645, -267645, -431541, -539945, -491480, -490899, -405996, -240174, -82739, 189980, 240278, -65874, -267058, -305036, -215649, -161331, -152015, -306205, -216929, -340313, -364862, -105997, -93146, -148239, -275097, -319298, -179904, -118311, -41818, 179345, 153944, 149149, 109634, 93408]
20863I3408J24661o1056j68805o5783p0303l03010j60907K00220J65652M7113
20853a98810Q8203p1244J24494o4620j48816K33769L40790l75590j01169J09987
20843f3006J4982M5043j59515j13184j48459K46049O7666m0947n4427j09655j8654
20832c34107j1459n0495K06541Q1931K9883J16384L18301O7759k47944m7126N7182
20821A86850r6699p7896J16691L06887j8817j99555j43876k52980l0702J37137
20811g2960j46984J26344J89070k16608k76994l6127J65150J52285J9902j29608
20801b26530l1260L9843O0923L57826R0230l48670q2505J47461J6591k39445J5330
20790b00206O2352J41032N4189p106k70557j51458j0024J95043K95280n6317J4687
$$ y = [93408, 218069, 157013, -11792, -77575, -147878, -450888, -611795, -411575, -245923, -198810, -110607, -181851, -57357, -121977, -270793, -37024, 303766, -71824, -172993, -63006, -48024, -2981, -162496, -275680, -424139, -178090, -110424, -151371, -205798, -315453, -334107, -345566, -396061, -189520, -107589, -77706, 38678, 356979, 424738, 176794, 129668, 186850, 90151, 12255, 128946, 435833, 417016, 217461, 73585, -179395, -210097, -72960, -219944, -93600, 95470, -121138, -398132, -434259, -269109, -116824, -96922, -226530, -257790, -217947, -157024, 200802, 291032, -57638, -140143, 7318, 23909, -215536, -200206, -137854, 3178, 57367, 50261, -220296, -371754, -381778, -186735, 108545, 52228, 66915]
20779F6915n2845j75628K66568J68555l1646l98535j61558m3805K62527J77225
20769G7773M2664L2777r6921n566n9397k23509N7800N944L9163n9744j92200M4883
20757c36333J21442L5732K41541Q0434n2807j22584l34697j07089r55j3460J30876
20746c57900O8472J75774L7280m9690r885J0405j47629q4380J74849L9955q1180
20735b23929J04168J85298k43576n7212J36022J609O8321j35148N6354J76384
20725F8291J06586j1403j4038m54430J421J02799J32443J53438J29522Q1816k0743
20714B75702J20256l8667k65032k19734j77058Q0155O8071J06071J3390m0835
20704g7681J12172J07679J19933m182j72558j37418k14203J12177j1346q8899
$$ y = [66915, 14070, -161558, 105010, 273565, 241919, -156616, -318174, -361979, -99452, 77773, 120437, 153214, 56293, 50727, -8670, -232179, -174379, -168435, -129272, -189016, -381216, -336333, -214891, -179159, 62382, 142816, 90009, -32575, -367272, -474361, -475316, -488776, -357900, -289428, -113654, -76374, -126064, -135949, -125544, -273173, -357553, -182704, -142749, -223929, -119761, 65537, -178039, -235251, -99229, -97620, -29299, -164447, -108093, 68291, 174877, 163474, 149436, -304994, -303573, -200774, -68331, 85107, 214629, 296445, 275702, 395958, 357291, 92259, -127475, -304533, -224378, -156307, -50236, -36846, -77681, 34491, 142170, 262103, 257921, 85363, -52055, -266258, -154081, -165427, -254326]
20694b54326l11561r9589K12942o1974l7353J29015L75246J24262j98102q0374
20684b01814K00432K15486j69175p4680j08315j43740L2036J30111r7888J17209
20674a00338m167Q7109R665j37205j64334N829p0022J3576K25934J48098K02145
20663B16290P923j72073P0952j87906n9262j11036l6337k2548R3471J54291J20334
20652G4099J40877l01124j00266q5128J38995J73531K11940N9063j36309k56360
20642h0682j91512j84563M5067J21397Q1571J5759j96538j10320p6655K13161
20632c63315L22950J28609l5015j37049K758J87628o1524k40794j5809M659R9086
20621a07816O0006J25782N8181L1030j74580l21757m8299R4646Q0019J52686j81094
$$ y = [-254326, -565887, -665476, -452534, -514508, -551861, -422846, -47600, 76662, -121440, -201814, -1382, 214104, 44929, -29751, -138066, -281806, -249770, -119659, -217547, -100338, -104505, -17396, -7731, -144936, -309270, -303441, -373463, -359887, -133953, 14145, 216290, 224213, 52140, 123092, -64814, -124076, -235112, -271449, -293997, -200526, -46235, 74099, 214976, -86148, -186414, -271542, -132547, 40984, 252924, 311987, 175678, -80682, -272194, -456757, -411690, -290293, -208722, -192963, -389501, -499821, -576476, -363315, -40365, 88244, 53229, -83820, -81062, 106566, 45042, -195752, -211561, -206902, -107816, -47810, 77972, 136153, 167183, -7397, -329154, -377453, -282807, -202788, -50102, -231196]
20610b31196J6698Q7014k12011l1521J92603K39429J39076k4295k27256l7241
20600h8700R2140m7388k9151L0983j59898J86499J41530r5305Q7913j6617j71302
20589f9296q07J29516n2880Q9423n6878J05664m4259k81353J68977O4350K33267
20578B85724n6064l70396k08696k0252q3743l9431L88299L33662l1999j95128
20568A976k68449m6984L0111P0149J6496l9420l1990j06011k2629r4725l6633
20557e28109J60217J29367J11831q9044p7487m3185r3470K18792K54885Q8137
20547A31934Q4717k38418j98289J6536K65325j92654k28600o6346k06709l0038
20537f62542J46635R0959N2897K8711J41011P5988j07315M2353P6565j38541j9408
$$ y = [-231196, -214498, -127484, -339495, -371016, -178413, 61016, 200092, 175797, -51459, -88700, 3440, -43948, -73099, -42116, -202014, -15515, 126015, 30710, 118623, 102006, -69296, -70103, 59413, 6533, 95956, 39078, 144742, 100483, -180870, -11893, 52457, 285724, 229660, -140736, -349432, -369684, -453427, -492858, -104559, 229103, 197104, 1976, -266473, -313457, -283346, -213197, -196701, -236121, -268111, -374122, -396751, -491476, -528109, -367892, -238525, -126694, -215738, -293225, -336410, -429880, -211088, 43797, 131934, 216651, -21767, -220056, -203520, 61805, -130849, -359449, -425795, -632504, -662542, -515907, -424948, -372051, -343340, -202329, -126341, -233656, -191303, -114738, -253279, -272687]
20526b72687l1639j60411K4719J87338q7416m3979N8170Q6489R2058m9662J8498
20515a78522K92059L1013j29455P0595k761j24353l19155K6213j43430P3591J30792
20504b73413J52955J75937M8548l01293O0202J26995j75311l2267J59565r8212
20494a56294r6183k20775J50394L08182J23891m8808j00958n0450q9675L3016
20484a47660k34092n5566L2949J79036K09046L8664J2505J8249J36013q7964k03198
20473a02018J10674k2494j08284n4719m9874r0042r8617Q2000j3889K31074L68220
20462B52031n2817k12886N6214k0342j27252o3807N6312K4981j19989K53712K06488
20451B52645k4698P0319k02692l78940n5830L09792Q452R1900M6697k67274k70423
$$ y = [-272687, -304326, -464737, -440018, -252680, -340096, -384075, -325905, -239416, -147358, -197020, -178522, 113537, 144550, 15095, 85690, 82929, -41424, -360579, -334366, -477796, -404205, -273413, -120458, 55479, 104027, -197266, -137064, -10069, -185380, -217647, -58082, -156294, -252477, -473252, -322858, -14676, 109215, 60407, -40551, -91001, -180676, -147660, -381752, -437318, -404369, -225333, -16287, 22377, 34882, 53131, 189144, 101180, -102018, 8656, -13838, -122122, -176841, -226715, -316757, -415374, -333374, -347263, -116189, 252031, 199214, -13672, 42542, 22200, -105052, -168859, -112547, -87566, -207555, 46157, 252645, 227947, 298266, 95574, -283366, -339196, -29404, -20952, 70948, 117645, -149629, -420052]
20440d20052J12828j19867K01723J93297M1878j16995J379K0107p4691J10705
20430d9688O2702J01357r8367k7175J80844p3396K7881j03406J70067J20650k74588
20419C6881k87618N4986J76541j38556j69527j5538j65602m9830Q2640L7747J18839
20408c19037J06085j14731l1177K44101K19561N2149o324q9133R6320j51432k15671
20397b09289J38312K23178n4203p8339j83385m3080J0971r9453O0220J38002R480
20386h7586O4008M8049l7040Q0390j52611K8606j2339q9540M3867o7847K62857
20375H0814K17004j62450j02666j27289r2427J30572J21620M7334J0065k19538
20365i6961r3641J69434L23370O8373k46934k84695m1518L1014K70438M1691k23706
$$ y = [-420052, -307224, -427091, -225368, -32071, 9807, -107188, -105809, -85702, -160393, -49688, 13014, 114371, 16004, -11171, 169673, 96277, 124158, 20752, 190819, 311469, 36881, -250737, -195751, -19210, -157766, -327293, -342831, -508433, -558263, -475623, -437876, -319037, -212952, -327683, -358860, -114759, 104802, 156951, 150627, 61494, 157814, 6382, -209289, -70977, 152201, 97998, 19659, -163726, -206806, -195835, -295288, -235068, -97066, -87586, -23578, 24471, -12569, 67821, -84790, -56184, -68523, -158063, -114196, -182043, 80814, 297818, 135368, 32702, -94587, -187014, -56442, 65178, 112512, 122577, -96961, -190602, -21168, 302202, 370575, 123641, -161054, -202572, -171558, 98880, 140571, -83135]
20354h3135Q6622j58199j56994l5631R2650R2976O6939R529M4407M7207O1417
20343F7788K53553l7624k77240m9972n2142j850j00514l83J43943M6301n7888
20332f6028n2017l19860r7336R0552k01376J48663L9940l3060j68924J59177M24965
20321g5304q5440j14976q8895R8719p1374j87564R7055K96899R0894k1029p1306
20310a32321L280o5419q1355M3031N1895P617k74323k44055K3880R2978K01490
20299c73302j23565K07305M46183L17564q1926k45690o5379j32315R8905J50748
20289A98528Q2371k00688k89903L48921k35725m0670R1341j8244j76256J77394
20279f2931K66958k1228j04608K19469j9212l10908p5331j32594n6193M9449K3382
$$ y = [-83135, 3487, -154712, -311706, -347337, -254687, -161711, -94772, -85243, -40836, 6371, 67788, 321341, 283717, 6477, -43495, -95637, -97487, -198001, -198384, -54441, -8140, -66028, -118045, -437905, -535241, -444689, -646065, -497402, -457462, -490522, -659446, -500269, -75304, -160744, -275720, -364615, -265896, -337270, -524834, -427779, -130880, -39986, -61015, -132321, -129041, -194460, -275815, -232784, -180889, -173272, -447595, -691650, -667770, -574792, -373302, -496867, -289562, 156621, 474185, 392259, 146569, 81190, -51125, 47780, 198528, 280899, 80211, -209692, 139229, -96496, -137166, -45825, -64069, -240325, -62931, 204027, 182799, 78191, 297660, 278448, -32460, -107791, -240385, -296578, -247129, -223747]
20268b23747M9958l35797l17125P0810M20754J90978K97719J18419j41961r9915
20258C0093O5347P6438M4391r7852k40365O9950J50345q7026j30168n5309q2666
20247b56822j7728K7724K707j20419J15939J58624J3616k19303K22249N8390j21371
20236a36394J15181O5162r256L4617m8932j54341r094o5094P3375j01352O3446
20225a72682N0587n4241p2094l9677j27440M1611n7977Q7531J60811J11039O9763
20214b769l7362k57778k48305j47908l5775J78600K30834K23373J09784j5530
20204b836l5316j31898J02826Q1385K24950K0547j24059j61858j35892J85M3760
20193a18206L385j59378n7506o2519J48105J62121O3189K27057R2480k4037J59196
$$ y = [-223747, -173789, -509586, -826711, -755901, -335147, -144169, 153550, 271969, 130008, 30093, 95440, 171878, 216269, 118417, -121948, -51998, 98347, 11321, -118847, -174156, -256822, -274550, -246826, -244119, -364538, -248599, -89975, -76359, -295662, -73413, -15023, -136394, -21213, 43949, 34693, 69310, 20378, -133963, -143057, -208151, -134776, -236128, -172682, -122095, -176336, -248430, -288107, -415547, -373936, -431913, -344382, -183571, -72532, -2769, -40131, -297909, -546214, -694122, -729897, -551297, -320463, -97090, 12694, -2836, -38152, -170050, -67224, 14161, 239111, 259658, 135599, -26259, -162151, -161966, -118206, -114821, -274199, -331705, -394224, -246119, -83998, -20809, 206248, 298728, 274691, 433887]
20182D33887K12964k13369k21269k33792r0887r1938M55848J56313k07196j37523
20172F3038K00493J4314k5344j52100k56010o5878o8261M2697P9295K85936j8274
20161I9906j83795k989N412j0154L2163j81577k70241p3553J99525Q1856L10223
20150F776L6886j57505p492J06930K8485K10264j33963o2719J75427m48781J53547
20139i2145k2077l6464J40938Q8897K1636k27297k18168J29821J34034j48957
20129b29782k32093q8833P8053J3325K41849L74074l12737R3920Q814j6116J74645
20118A05119l093M1937j8764j88455n6311R9424J68447N3841j81930o2105j48128
20107a90018J24751J30751J5826k26654J31793K32580p1669j19563p1469j06648
$$ y = [433887, 646851, 433482, 212213, -21579, -112466, -204404, 251444, 407757, 200561, 63038, 263531, 277845, 252501, 100401, -155609, -221487, -289748, -247051, -167756, 118180, 99906, -83889, -86878, -81466, -91620, -59457, -241034, -511275, -584828, -385303, -303447, 6776, 43662, -113843, -121335, -14405, 14080, 224344, 90381, 27662, 203089, -245692, -92145, -114222, -150686, -9748, 79149, 100785, -126512, -344680, -214859, -80825, -229782, -461875, -550708, -472655, -459330, -217481, 156593, -156144, -62224, -53410, -69526, 105119, 102026, 143963, 125199, -63256, -119567, -20143, 148304, 202145, 20215, -41890, -190018, -65267, 65484, 81310, -145344, -13551, 219029, 147360, 27797, -43672, -150320]
20097a50320J06818J67527J99066K08670R558l13476j57944R9931j26467j47444
20087a04081P9360R5747m8271J28859l1377J75037J5367r0885k5123k42283j16982
20076a64632J14890Q619q4556k23273J75123K53441j08430n3240j9118o4960j38124
20065c04260o1893p6143q0336K1772k1302K25549j9685k07191J60846K15739q2550
20054b29454j29181J89193k8851L12266j1957j58554K95866N2064j60276k49060
20044a17944j73437o9521p6785J0283j07261k5413J44255J01177K78864O4719
20034B8937k09390J01005J84706k6656J16788l1183p9827j12531k4403N8681j61107
20023a54980P2645J68365Q1391Q602j70467j66957j38867Q5535L01077N8050J12783
$$ y = [-150320, -43502, 124025, 323091, 531761, 541319, 227843, 69899, 169830, 43363, -104081, -24721, 71026, 22755, 151614, 120237, 295274, 310641, 219756, 194633, -47650, -164632, -49742, -41123, -125679, -348952, -173829, 79612, -28818, -82058, -101176, -166136, -304260, -366153, -442296, -522632, -500860, -522162, -296613, -316298, -523489, -362643, -146904, -229454, -358635, -169442, -198293, 113973, 102016, -56538, 239328, 291392, 131116, -117944, -291381, -360902, -437687, -427404, -534665, -560078, -415823, -314646, -35782, 28937, -180453, -79448, 105258, 78602, 195390, 164207, 84380, -28151, -52554, 6127, -154980, -82335, 86030, 167421, 176023, 5556, -161401, -300268, -214733, 86344, 144394, 257177]
20012B57177O9137l2326L0639j52269j43330m2767P8744l8158J68609J1795m54110
20001b46859q5555K9293k532q2805J79121k5859j3725R8064J59851j18032q3500
19990a92538j99697O7518J44151J11529J946j78104L3093R0548p3877j68680p3870
19979d37981Q4738O5518R8308j7072J05492J47720J2922k8121M8122J09245q4003
19968A04888j28828M2748k9362K0956q2577l8197m4172n1256N4262Q510m5175
19957a88203R0730Q0094q1146J984q3200j70343m8230K75699J58491q215p1787
19946d4126K271m5174K05793L1744k44449j86785J8544K10856J18214o5174P926
19935I640o1425J44629J09094M4049j54100M1373k1137J84920j11999j25351K5062
$$ y = [257177, 326314, 293988, 324627, 172358, 29028, -13739, 65005, 26847, 195456, 207251, -246859, -332414, -303121, -305653, -388458, -209337, -235196, -248921, -150857, 8994, -109038, -192538, -392235, -324717, -180566, -69037, -67091, -245195, -212102, -121554, -195431, -364111, -437981, -353243, -287725, -189417, -206489, -100997, 46723, 59645, 31524, 79646, 188891, 104888, -23940, 18808, -10554, 10402, -72175, -110372, -154544, -205800, -151538, -143028, -188203, -97473, -17379, -98525, -96541, -179741, -350084, -398314, -122615, 35876, 27661, -44126, -41855, -87029, 118764, 150508, -93941, -280726, -262182, -51326, 66888, 1714, 9640, -51785, 92844, 201938, 245987, 91887, 133260, 112123, 297043, 185044, 59693, 84755]
19924H4755j74861k14448J00537K81965j38508j91065k0595J08842N7770L6531
19914f9077J09936R6731L0560l8850j95745J4086j19863n7072j22985J06051J18848
19903a27380k52921r3196J10942K72715P7860p9069J16189J70381J27690N9790
19893C83001j30285k1958k71532m3581q4847O593J2470J87476k7911J8277q5731
19882e8028m3409J74901K6835k0160m3840k77308P4640J76373j11213J24875J1080
19871C4746j77496o7364p4049N5832k48360k0385M9154j8336M6663R5068J27395
19860a97132k89960R5914K75999K45003J44377k8593r9780k9191k27272j94482
19850c05117j7263l5145k92568J27183K49725j6844O7272K97844L1269N800j38547
$$ y = [84755, -90106, -304554, -204017, 77948, -60560, -251625, -272220, -163378, -105608, -69077, 40859, 137590, 168150, 129300, -66445, -52359, -172222, -229294, -352279, -246228, -127380, -380301, -473497, -362555, -89840, -11980, -91049, 25140, 195521, 323211, 383001, 252716, 230758, -40774, -84355, -169202, -162609, -150139, 37337, 9426, 27703, -58028, -101437, 73464, 100299, 80139, 36299, -241009, -166369, 10004, -101209, 23666, 34746, -142750, -210114, -284163, -228331, -476691, -497076, -447922, -466258, -419595, -324527, -197132, -487092, -391178, -115179, 129824, 274201, 245608, 145828, 116637, -110635, -305117, -322380, -357525, -650093, -522910, -273185, -290029, -222757, 75087, 106356, 112156, -26391]
19839b6391l7434J9386L37496l3136j24520j45764k35142k6876J7834l9016j13973
19828d07536J38320M8450j4484K19690Q4114j00455j81857n527O3104K44761q9976
19817a396k30996j01751K69473J01512p8226L205m2681M13N1338L0375j33326
19806a32060o5017L11551m5284j01437L8842L6510O0863j44348K0313J93488M5035
19795B18456j3962O3412q2691l2803K25459J11324j85720o7036o3806j00183j43983
19784g1533k62535k9116J21485J24316K2240J33751j44942J4601L1800J09550
19774D9617R926j37783k009R9912L217l288j86090q104J26866J98442J21445j42364
19762A29787J26632p5522p8521j10651j27599J43705J333l6866j96225K04737
$$ y = [-26391, -63825, -44439, 293057, 259921, 135401, -10363, -245505, -272381, -254547, -293563, -407536, -269216, -220766, -235250, -15560, 68554, -31901, -213758, -219285, -156181, 88580, -1396, -232392, -334143, -64670, 36842, -41384, -38179, -80860, -80447, -29109, 1266, -132060, -197077, 114474, 69190, -32247, 6595, 43105, 103968, -40380, -20067, 173421, 218456, 204494, 267906, 185215, 152412, 377871, 489195, 303475, 236439, 172633, 72450, -71533, -334068, -363184, -241699, -117383, -95143, 38608, -106334, -91733, -59933, 49617, 59543, -78240, -80249, 19663, 22880, 19592, -166498, -174602, -47736, 150706, 272151, 129787, 256419, 180897, 102376, -8275, -135874, 7831, 9164, -27702, -223927, -19190]
19752a9190J75105M3237R1701k39666k71044O8902J61961L26245j39371j4215
19742A83665J11900k3292k19923j16608j53613Q4945J8330J15581O2729P1462
19732A35176J84314m3571L1786j37680l51121j35655j211L63974q9214o697J5608
19721c4291r1313j61092J67554Q4885J14416j46422N2826J41988L13071l2901
19711D08721k66012k18883m6964K79913P7332m9389j38504j48364l3640m2872
19701a78662j4076N1349j61220q4414J12399K10503m9886j27213j66179J33822
19691b73577K75632K26204j16379k12579j46479K6784r6209q9900P6180r0520
19681d20843m0722K354j6496o7086J26331J23637m5941m2787J06298P2896K71292
$$ y = [-19190, 155915, 199152, 290853, 51187, -219857, -150955, 11006, 337251, 197880, 183665, 295565, 272273, 52350, -64258, -217871, -132926, -114596, 985, 63714, 135176, 319490, 275919, 307705, 170025, -181096, -316751, -317962, 46012, -43202, -49899, -34291, -125604, -286696, -119142, -34257, 80159, -66263, -13437, 128551, 441622, 408721, 142709, -76174, -123138, 156775, 234107, 184718, 46214, -102150, -135790, -178662, -192738, -141389, -302609, -387023, -274624, -64121, -114007, -241220, -407399, -273577, 2055, 228259, 111880, -100699, -247178, -220394, -316603, -406503, -330323, -420843, -461565, -459211, -475707, -542793, -416462, -292825, -338766, -381553, -275255, -202359, 68933]
19670F8933k37031J20427K67147o4066o6906J05910j44233p4555N1061k53281
19660b26594k3350K50901J39986J55115l476k90118J88605J852q2571k93814j76792
19649c60256j18783J99200J18473J02631K12040M8676j94852j78601M1652P5127
19639e4693o7571k31999l267P8421J45077J13124j90315R4739K36242j01358k34707
19628b16307J1752j525N4584j2859j07072q3676O7795j1527j9612K95467J75336
19617A52356j17052m20417K4609J09568N2967j94835Q6582J96809n8846Q7074
19607h1185J90902J2628r4370k08312p174O3247j03969j49475K66256R1241j56572
19596a76783m8463J97509M3435m3132J28931j8004l32127Q6523j8216j85110o2162
$$ y = [68933, -168098, -47671, 219476, 155410, 88504, 194414, 50181, -24374, 26687, -226594, -249944, 957, 140943, 296058, 292582, 2464, 191069, 192921, 110350, -183464, -360256, -479039, -279839, -161366, -58735, 153305, 201981, 7129, -171472, -129820, -54693, -122264, -354263, -357530, -279109, -134032, -20908, -211223, -116484, 119758, 18400, -216307, -204555, -206080, -151496, -164355, -271427, -355103, -287308, -298835, -318447, -22980, 152356, 35304, -385113, -360504, -250936, -197969, -392804, -306222, -109413, -168259, -81185, 109717, 122345, 27975, -180337, -187511, -124264, -228233, -377708, -111452, -20211, -176783, -225246, -27737, 15698, -27434, 101497, 83493, -248634, -162111, -180327, -365437, -427599]
19585d27599J25714n3731L39049K33561q4928j43081p6730J62462R0745j53310
19575A2152l02632o8353K71593m2350r913J71398Q259n1200J03237k051k62275
19564a72135j05696J99603k4094m9620m2973K36066J02051k5031j31884j91578
19554b05291j04021k6243J02917O5356M2804J15391j13656j6706O6803M5418N0433
19543B3205l1928J01222j19505p2435J06222Q1993l58350J04175k1761k72972
19533d60134O5120J99986K74103J3462J56725m6031J11864K84598k7483R8574
19523F70784L35880J67158J79704o8274k92556M0531K07743k448N3717o5947j14548
19512A111744J08739J8812j65100k70325N910j30237l05590M221J05205P7647
$$ y = [-427599, -301885, -355616, -16567, 216994, 132066, -11015, -87745, 74717, 165462, 12152, -290480, -358833, -87240, -129590, -139503, 31895, 40154, -11046, 92191, 90140, -172135, -277831, -78228, -102322, -151942, -194915, 41151, 143202, 118171, -13713, -205291, -309312, -335555, -232638, -167282, -124478, -9087, -122743, -139449, -72646, -27228, 23205, -8723, 92499, -27006, -99441, 6781, 88774, -269576, -165401, -187162, -460134, -395014, -195028, 79075, 92537, 249262, 203231, 315095, 599693, 572210, 670784, 1006664, 1173822, 1353526, 1285252, 992696, 1033227, 1240970, 1238522, 1292239, 1226292, 1111744, 1220483, 1239295, 1074195, 803870, 809780, 679543, 373953, 378174, 483379, 561026]
19502E61026k1751r1184K9209p9044q1191Q6844L9558K28552q2370k11694k32403
19491A45552j12739Q8423K29323O0334j53726J10553K70097K02968J04332p5875
19481H69242j68136P9836K58442J20420p2101n6681K13512J62220j10214J6854
19471A313394Q5838K34594J82530j1478K45430k7990k37988j49729q0337k7086
19461A527178k01059j44298n4093L3454j36425j34294k07626l10040j21553J34510
19451C85754J4016m4266m7551J26894j5960m3522l3605o689Q6660O6446K05697
19440F93874k27621j73350p8316o3353p1686J49429q0283r9940M9085j51971j1199
19429f5331L730J43814R7428Q9050K27344Q9114k5820k52430P9656M8665P0582
$$ y = [561026, 539275, 448091, 477300, 398256, 317065, 403909, 443467, 672019, 589649, 377955, 145552, 32813, 121236, 350559, 410893, 257167, 367720, 637817, 840785, 945117, 869242, 701106, 780942, 1039384, 1159804, 1087703, 1031022, 1244534, 1406754, 1296540, 1313394, 1399232, 1633826, 1816356, 1804878, 2050308, 2022318, 1784330, 1634601, 1554264, 1527178, 1326119, 1181821, 1127728, 1161182, 1024757, 890463, 682837, 372797, 251244, 385754, 399770, 355504, 307953, 434847, 418887, 375365, 341760, 335071, 421731, 488177, 693874, 466253, 292903, 214587, 151234, 79548, 228977, 148694, 48754, 97839, -54132, -65331, -61601, 82213, 179641, 268691, 496035, 585149, 559329, 306899, 386555, 435220, 505802]
19418E05802L2765p5559q5248j89062j89228K7886L32696R0546J84517J00922
19408G36037L6592q1168o21802j69481R2885J36250K48329j52394j76570l8064
19398A0614N109O3070m894L9924Q7445n7494q6100j5802j63245k33799M4515L14829
19386D172L92087j68228N0194K69074j79315l21063K39052j65520O716M6184m5633
19375A27720J52704N5220k32783q6188j411l742L2936L3858j73425p3328q5074
19364b53513J16142J76031R1004p6885j52620j32810J7455M25567j36125m94762
19354d20516k10912J03990J52121J72932R4832R5263L65153J08445L4488k9493
19344D66303K04429j70890J22764n9404k50284k18658l13738r4358J46243J11050
$$ y = [505802, 538567, 463008, 377760, 188698, -530, 27356, 360052, 450598, 635115, 736037, 772629, 691461, 69659, -99822, -6937, 129313, 377642, 225248, 48678, 10614, 15723, 78793, 73899, 113823, 201268, 143774, 57674, 41872, -121373, -355172, -310657, 4172, 396259, 228031, 278225, 547299, 367984, 46921, 285973, 120453, 127169, 173353, 127720, 280424, 335644, 102861, 16673, 15262, 11520, 44456, 78314, -95111, -168439, -253513, -137371, 38660, 129664, 52779, -99841, -232651, -215196, 210371, 74246, -420516, -631428, -527438, -375317, -202385, -107553, -12290, 352863, 461308, 495796, 466303, 670732, 499842, 622606, 563202, 312918, 94260, -219478, -313836, -167593, -56543]
19334e6543O7887J60705l04712j71893J10080L4089J332j81883j99670j25299
19324f65907J87586M34908K19596j49508l6049K645J00606Q6826j00362k56889
19314a76548J72820K14621j30511j67888P5112J88916j66468j85723J55030K76738
19304B56099o7704k12714j20912r5351K2812L9351J01733L8814n751J83740j46960
19293f843j92431M5203j63666J10893J54403J02767k76789N304m1103O2062K42125
19282D1925Q7494k05438j41480l8082J76180L42517O7161k27309K1256K90267
19272D14491j62592k87442j11557K26274J38404J04233m440k28521N8297k6834
19262A20313j62536K47560N0869K14609j48233k11605L8218N2483J53717j42346
$$ y = [-56543, 11344, 172049, -132663, -304556, -194476, -160387, -159055, -340938, -540608, -665907, -478321, -43413, 176183, 26675, -9374, -6729, 93877, 180703, 80341, -176548, -3728, 210893, 80382, -87506, -12394, 176522, 10054, -175669, -20639, 256099, 188395, -24319, -145231, -240582, -217770, -178419, -76686, -37872, -43623, 140117, -6843, -199274, -154071, -317737, -206844, -52441, 50326, -226463, -221159, -262262, -200200, 41925, 129419, -76019, -217499, -255581, -79401, 263116, 330277, 102968, 124224, 414491, 251899, -35543, -147100, 79174, 217578, 321811, 317371, 88850, 147147, 120313, -42223, 205337, 256206, 470815, 322582, 110977, 149195, 201678, 355395, 213049]
19252B13049q6400J65023J22841k09608j20519L05889K70623M0765l5035j48844
19242E17784o7058J25217l4223Q5070N0030j64474j7476Q578m1661o8126J3215
19231D06876J00212l8742q1550J75892L71675l6215j33091k62421K4951O2465
19221E90052O8298j67627J56910K1859O7977K03705L1387j85439j18066J91326
19211H60382J4037o2108j61020J21980J19566j49572l13581k3389J32997l1991
19201E07301j01156K4709J01733q3396j51836N4689K93513K39304J14474r6819
19191I02516j08560R4942r4778N8796Q7398L2795K76339j50266r0406K23598O9932
19180A302306L5347L5389n4194Q5478K43923K42656K9585P340k13244j85752p5780
$$ y = [213049, 126649, 291672, 414513, 204905, 84386, 390275, 660898, 701663, 666628, 517784, 450726, 575943, 541720, 626790, 676820, 512346, 494870, 503448, 461787, 393661, 406876, 507088, 468346, 386796, 562688, 934363, 898148, 765057, 502636, 527587, 590052, 658350, 490723, 647633, 669492, 737469, 941174, 972561, 787122, 669056, 860382, 874419, 812311, 651291, 773271, 892837, 743265, 429684, 406295, 539292, 507301, 406145, 430854, 532587, 449191, 297355, 352044, 645557, 884861, 999335, 902516, 793956, 888898, 794120, 852916, 940314, 973109, 1249448, 1099182, 1008776, 1232374, 1302306, 1337653, 1373042, 1318848, 1404326, 1648249, 1890905, 1920490, 1927830, 1714586, 1528834, 1453054]
19169A453054k0061r726R0688J35306j44870r8617p2648P4528j50245N6211j82935
19158A130685k50855o2397j07801j28477Q6337j26365n8229K11747L31239N0091
19148A075975j90398n2144N8312R6965N2013K51302o5490j09905m2141J9520j2073
19137A081936j03307L00137L10146k14990M8263N5277L0386r0105L2275M0547
19127A490565J8947q9812J92504J65980O9038J51434o4793j68296J33846J06208
19117B005621l77148r4243o086n0852k73321k0691k6101L8477Q9099k5990j71531
19106A087234J21409o4389q8378m1906J50070Q8085L3258l47159j22682K5757
19096H41299J31721l57178j33282J99391k4620j04320J15077J20609J72987J06461
$$ y = [1453054, 1432993, 1423267, 1513955, 1649261, 1504391, 1405774, 1333126, 1407654, 1257409, 1313620, 1130685, 879830, 817433, 709632, 581155, 667492, 541127, 482898, 694645, 1025884, 1075975, 885577, 833433, 891745, 988710, 1040723, 1292025, 1226535, 1116630, 1074489, 1094009, 1081936, 978629, 1278766, 1588912, 1373922, 1422185, 1477462, 1507848, 1417743, 1450018, 1490565, 1509512, 1419700, 1612204, 1778184, 1847222, 1998656, 1933863, 1765567, 1899413, 2005621, 1628473, 1534230, 1528144, 1477292, 1203971, 1183280, 1157179, 1195656, 1284755, 1258765, 1087234, 1208643, 1144254, 1055876, 1013970, 1164040, 1252125, 1285383, 938224, 815542, 841299, 973020, 615842, 482560, 681951, 657331, 553011, 668088, 788697, 961684, 1068145]
19086A068145q7960j93647J6776J13661K56515K07331p8932k02137o7206J32711
19076A165257K70743K35666J17590K93313J05393L7139j8899L0652q5779j61313
19066A989762j21787n5912P7741j67884r7517Q8255j02230j29233j94264l2965
19056A253966K04107K95679K69833l1621N8934k3388r8923J16836p3303o393J49937
19045B115664L87461L83519j8680J19093j07096J5202J71560K42541Q4970K0199
19035C414433L32351K30939L35429O03494L64430L61267M02275K89021M80148
19026F813787Q26916Q30715R80824P93700O90753R21196Q72481J019183J409564
19017A5159119J491814J529967K164722K462245K872808L754949N055197O718177
$$ y = [1068145, 980185, 786538, 803314, 916975, 1173490, 1380821, 1301889, 1099752, 1032546, 1165257, 1436000, 1671666, 1789256, 2082569, 2187962, 2225101, 2206202, 2236854, 2151075, 1989762, 1867975, 1812063, 1889804, 1721920, 1624403, 1712658, 1610428, 1481195, 1286931, 1253966, 1458073, 1753752, 2023585, 1991964, 2050898, 2027510, 1928587, 2045423, 1972120, 1965727, 2115664, 2503125, 2886644, 2867964, 2987057, 2879961, 2895163, 3066723, 3309264, 3394234, 3414433, 3746784, 3977723, 4313152, 4916646, 5281076, 5642343, 6044618, 6333639, 6813787, 7640703, 8471418, 9452242, 10245942, 10936695, 11857891, 12730372, 13749555, 15159119, 16650933, 18180900, 20345622, 22807867, 25680675, 29435624, 34490821, 41208998]
19009D1208998R382753J3359674J8701340K3421893K3060608J8171141J5081132
19002A62387539J4888351J6165126J8217235J7714130J6449268J0592970l65674
18995B56048945n820468n449057m448424m382570r087978j4422918j8892847k2501655
18987A71043028k2253871j8492355j4816130j2549184j0925594q948399p247284
18980G5810211n855452m923174l964596l287449k379948j839097j642851j341685
18972E0575959j016176j018654q29112n19042K41941O93430N44163J070063J812155
18963E1554727K719020L466458M340926O414442R627108J4374754K0188433K5692906
18955A38378774K5642445K0545348J7343450J6875233J8222373J9995872J8945393
$$ y = [41208998, 50591751, 63951425, 82652765, 106074658, 129135266, 147306407, 162387539, 177275890, 193441016, 211658251, 229372381, 245821649, 256414619, 256048945, 250228477, 244779420, 240330996, 235948426, 226860448, 212437530, 193544683, 171043028, 148789157, 130296802, 115480672, 102931488, 92005894, 83057495, 75810211, 69954759, 65031585, 61066989, 57779540, 55399592, 53560495, 51917644, 50575959, 49559783, 48541129, 47712017, 47192975, 47434916, 48128346, 48672509, 49742572, 51554727, 54273747, 57740205, 62081131, 68495573, 78122681, 92497435, 112685868, 138378774, 164021219, 184566567, 201910017, 218785250, 237007623, 257003495, 275948888]
18948B75948888J7524963J1272198o85436p244998p155745n721067n959416j0900378
18940B67079009j6837350k1660489k5615379k5407046k1870891j8129141j5077934
18933A22480779j3203026j1436137r641735p951370o204756n119882m662069m287634
18925E9974170l426629k848918k473362k210972k196917k100342j864269j474743
18917D1378018j788680j498881j541186j685886j361250j463160j429360j025178
18909B9584437r91056j017041j091375j045718o62846o22171n80334p30929n18846
18900B2324121l41893m40194n94826l41717k30525m74874n42388p50827p40212
18891A7866665p83969o36436o05521m59312n34740m79693k44380n21071l51469
$$ y = [275948888, 293473851, 304746049, 304060613, 296815615, 289659870, 283938803, 277979387, 267079009, 250241659, 228581170, 202965791, 177558745, 155687854, 137558713, 122480779, 109277753, 97841616, 88199881, 80248511, 74043755, 68923873, 64261804, 59974170, 56547541, 53698623, 51225261, 49014289, 46817372, 44717030, 42852761, 41378018, 39589338, 38090457, 36549271, 34863385, 33502135, 32038975, 30609615, 29584437, 28593381, 27576340, 26484965, 25439247, 24776401, 24154230, 23573896, 22842967, 22324121, 21982228, 21542034, 20947208, 20605491, 20374966, 19900092, 19357704, 18606877, 17866665, 17082696, 16446260, 15840739, 15381427, 14846687, 14366994, 14122614, 13601543, 13250074]
18882A3250074m55489l00510l55572k89112k63282l19584k64967j44494k34245
18873A0622819l06207n08579l36814k08343p6164m87924m02410l8362k00143n10925
18863G546948m05197r2902l22918j64284k0044l8905K02167p6272m50580k97851
18853E880162r2491j7501j06149o8807L077l72621j47990J65813k2444j18184
18843E102865j21718j10639j03416k11755J63568k1546l2941j43426k21001k6969
18833D273022p5010J16937J57742n9633k71586l97523k63608j00404K73330j37236
18823C516031k9142k21679j34983R2811J19194k55494j99852j28869j20136j58128
18813B479753k11528j99585J2339k2710J09947n0210j50692K58090O5565j01251
$$ y = [13250074, 12794585, 12494075, 12138503, 11849391, 11586109, 11266525, 11001558, 10857064, 10622819, 10316612, 9808033, 9471219, 9262876, 9186712, 8698788, 8296378, 8258016, 8057873, 7546948, 7141751, 7048849, 6725931, 6561647, 6541603, 6502698, 6704865, 6628593, 6178013, 5880162, 5787671, 5770170, 5664021, 5595214, 5598291, 5225670, 5077680, 5243493, 5221049, 5102865, 4981147, 4870508, 4767092, 4555337, 4718905, 4697359, 4664418, 4520992, 4299991, 4273022, 4198012, 4314949, 4472691, 4413058, 4141472, 3743949, 3480341, 3379937, 3653267, 3516031, 3486889, 3265210, 3130227, 3223038, 3342232, 3086738, 2886886, 2758017, 2637881, 2479753, 2268225, 2068640, 2080979, 2058269, 2168216, 2118006, 1967314, 2225404, 2290969, 2189718]
18803B189718l76993K4659l4843o7307P8475J93210J7354K59880K42984j21740
18793B405397k48815m1084o9869n3331J443N14058K67468p5238k41177q3149J39102
18782B514805k003o0487J57206J75238k2893k18741J86993J44665j65927n6540
18772B652316j58398j94630j53631K32494K60751L61946L05893L15425K26873
18763C849039N3895M1979k7708P6893q3854k49654k21L0134p9351K1875K33163
18752C866190L75622J55130J40605L66019K57121K42508L41064L43693N54654
18743F642606N24417L15336M42202M42747R3986L29599N20386R40718J220789
18734A1472786J253036J637202K294330K648588L334324N086310P254551J0680546
$$ y = [2189718, 1812725, 1837384, 1802541, 1735234, 1813709, 2006919, 2024273, 2284153, 2527137, 2405397, 2156582, 2115498, 2045629, 1992298, 1993741, 2507799, 2775267, 2700029, 2458852, 2375703, 2514805, 2512802, 2452315, 2609521, 2784759, 2761866, 2543125, 2730118, 2874783, 2708856, 2652316, 2493918, 2299288, 2145657, 2378151, 2638902, 3000848, 3306741, 3622166, 3849039, 3902934, 3944913, 3917205, 3994098, 3910244, 3660590, 3660369, 3690503, 3611152, 3633027, 3866190, 4241812, 4396942, 4537547, 4903566, 5160687, 5403195, 5744259, 6087952, 6642606, 7167023, 7482359, 7924561, 8367308, 8461294, 8790893, 9311279, 10251997, 11472786, 12725822, 14363024, 16657354, 19305942, 22640266, 27726576, 34981127, 45661673]
18726D5661673J4614543J6682930J2641721O097908J291528k115710k738750J227874
18718I3363717O577707R055715N505552j245524n961474r758006j1970529j0872585
18710G4694573q620527p240444o345786n250855m669115l735750k835388k009207
18702C3987501j525647j149302j049675q87549p59050l34861k17759k25557k31558
18693B7606543k4804R9974J024106J434102J802900K086157K873639L960620M989486
18684D5852723P130172J0634220J5382568K0152491K0613207J4691618P934612
18677A42391611L485083O95299L501949J1948847K2285732K9201002K5932349
18670B39441872J3967704Q28028r862051j6332824j5789332q542792L54811N111912
$$ y = [45661673, 60276216, 76959146, 89600867, 95698775, 96990303, 94874593, 92135843, 93363717, 99941424, 108997139, 114502691, 113257167, 107295693, 97537687, 85567158, 74694573, 66074046, 58833602, 52487816, 47236961, 42567846, 38832096, 35996708, 33987501, 32461854, 31312552, 30262877, 29375328, 28616278, 28281417, 28063658, 27838101, 27606543, 27581739, 27681713, 28705819, 30139921, 31942821, 34028978, 36902617, 40863237, 45852723, 52982895, 63617115, 78999683, 99152174, 119765381, 134456999, 142391611, 145876694, 146571993, 150073942, 162022789, 184308521, 213509523, 239441872, 253409576, 254237604, 244375553, 228042729, 212253397, 203710605, 204065416, 209177328]
18662B09177328J390933o910417j2595479j7626653k0149832j8395491j4861402
18655A20028987j2414856j0860058r447826p724044o629328n716506m756047m037706
18647E8442616l049826k580938j968450j578357j440797j279632r35131n37890
18639D5071595k41260p1676K64125R03676J467608K197498K747590M068868O225038
18630F2633062R405421J3746115K0524755K7266791K8119386J8956690P636377
18623A88288597m40700o227897n345866J985803J0820996J3580742N431412n227236
18615B02865851j2635603j9079072k1712416j9024399j5344685j3162219j1494465
18608I0412992j0077728q626204p011193n748344m849729m154868l466460k984236
$$ y = [209177328, 210568261, 203657844, 191062365, 173435712, 153285880, 134890389, 120028987, 107614131, 96754073, 87306247, 79582203, 72952875, 67236369, 62480322, 58442616, 55392790, 52811852, 50843402, 49265045, 47824248, 46544616, 45609485, 45071595, 44830335, 44758659, 45022784, 45926460, 47394068, 49591566, 52339156, 56408024, 62633062, 72038483, 85784598, 106309353, 133576144, 161695530, 180652220, 188288597, 187847897, 181620000, 176274134, 178259937, 189080933, 202661675, 208093087, 202865851, 190230248, 171151176, 149438760, 130414361, 115069676, 101907457, 90412992, 80335264, 71709060, 64697867, 58949523, 54099794, 49944926, 46478466, 43494230]
18600D3494230k522045k076045j718353k023048j846667j680052j260689q82291
18592B9485040o79485p16700r18798j170286j132975j070494q72585p11383n07866
18583B1704468m99312m74872o17833p88843p95937q62652p51072m91885o49390
18574A5772672m16097k41808m28896n34774o36267m17508m20634n37170k57821
18565A1881697O522k60744k83732k28802k75500m65998k35439m92679l76462j60332
18555I108531Q5602l27067m75328k10774R2064N5751k74476r0831l04318k56316
18545G402838j35518q5691k71957k72263M3854J33275j26017l63926m53812l46191
18535E524592k38088k26544j26310j10827j22563N510N7122l3768j62336k17271
$$ y = [43494230, 40972185, 38896140, 37177787, 35154739, 33308072, 31628020, 30367331, 29485040, 28805555, 28088855, 27170057, 25999771, 24866796, 23796302, 22923717, 22212334, 21704468, 21205156, 20730284, 20112451, 19323608, 18527671, 17665019, 16913947, 16422062, 15772672, 15356575, 15114767, 14685871, 14151097, 13514830, 13097322, 12676688, 12139518, 11881697, 11888219, 11627475, 11343743, 11114941, 10839441, 10373443, 10138004, 9645325, 9268863, 9108531, 9194133, 8867066, 8391738, 8180964, 8273028, 8328779, 8054303, 7963472, 7659154, 7402838, 7267320, 7181629, 6909672, 6637409, 6681263, 6814538, 6688521, 6324595, 5870783, 5524592, 5286504, 5059960, 4933650, 4822823, 4700260, 4705770, 4762892, 4729124, 4566788, 4349517]
18525D349517k8383R3952p0270R0434J56495r226k12923j53494k02849j6559k1712
18514C974982j36884k39179k83638K49614k21482p4512J23059J55070L4720J9026
18504C600776j2025j01985l84888j5595j95091J45891L06851J74086M6816J8331
18494C583167k18913J14876J00196r9175q6293k55042q7676k69842r8912P719
18484B690105Q4553J0732J18524M4804k41049K73634L67342J83663J74695R1958
18474C798961M44007K84572p305Q5485J97906K60185J90015L9208J54835J44825
18464E592694n0341O58m06208l24489j67222J13419R3914R7849J71752K81240
18454E403266K04132l3798J13646K94264M40495P65504K95602M43872P84339P62026
$$ y = [4349517, 4321134, 4415086, 4344816, 4435250, 4591745, 4582519, 4369596, 4216102, 4013253, 3996694, 3974982, 3838098, 3598919, 3315281, 3564895, 3343413, 3268901, 3391960, 3547030, 3581750, 3600776, 3588751, 3486766, 3101878, 3086283, 2891192, 3037083, 3343934, 3518020, 3564836, 3583167, 3364254, 3479130, 3579326, 3480151, 3393858, 3138816, 3051140, 2781298, 2682386, 2690105, 2774658, 2785390, 2903914, 2948718, 2707669, 2981303, 3348645, 3532308, 3707003, 3798961, 4242968, 4527540, 4520235, 4605720, 4803626, 5063811, 5253826, 5293034, 5447869, 5592694, 5542353, 5543011, 5136803, 4812314, 4645092, 4758511, 4852425, 4950274, 5122026, 5403266, 5607398, 5573600, 5687246, 5981510, 6422005, 7187509, 7483111, 7926983, 8711322, 9473348]
18444I473348Q91505J064515J118050Q75463J042197J224454J500895J844319
18436A9034746K190198K524162K733522L279310L943048M516233O082069Q272367
18428E2575655J1418542J5738731K2011205K9318718L3794257L1527042K9017234
18421B25401384L1093617L6534737M0276678L1702842J4228163J602715q343445
18414C72496691j3717523j5913617k0429488k5324035l0597696l4348770l1619103
18407B00546459k5695985k0839623j7633043j5265028j3102903j0534271q446268
18400H9029338p081159n886712n038171m086977l290494l065727k519210k495943
18392E5564945k228149j910336j739342j359841j482384j233803j073381o45751
$$ y = [9473348, 10364853, 11429368, 12547418, 13422881, 14465078, 15689532, 17190427, 19034746, 21224944, 23749106, 26482628, 29761938, 33704986, 38221219, 44303288, 52575655, 63994197, 79732928, 101744133, 131062851, 164857108, 196384150, 225401384, 256495001, 293029738, 333306416, 365009258, 379237421, 380840136, 372496691, 358779168, 342865551, 322436063, 297112028, 266514332, 232165562, 200546459, 174850474, 154010851, 136377808, 121112780, 108009877, 97475606, 89029338, 81948179, 76061467, 71023296, 66936319, 63645825, 60580098, 58060888, 55564945, 53336796, 51426460, 49687118, 48327277, 46844893, 45611090, 44537709, 43891958]
18384D3891958l59034l1000K28108L97082R34553J387642J794634K406838L232408
18375E3883189N037425P161768J0175664J4497689K0029786K3895505K2069267
18368A56750293J8590787J9817753K3245383K6188707K0385345P493891r56702
18361B71515457p826083j1669797j2311380j4630652j7814125k1187673k3216062
18354A62859685k1133381j7656489j4260766j2016140j0383521q557896p084567
18347G1766925n734606m794807m063224l482339k967453k704458k271121k339494
18339D3409423k159926j770850j832632j669778j536371j466982j569194j322603
18331C0081087q69012r05920p42485j060561r49361r10160r95102n59668p95089
$$ y = [43891958, 43532924, 43501924, 43730032, 44127114, 45061667, 46449309, 48243943, 50650781, 53883189, 58920614, 66082382, 76258046, 90755735, 110785521, 134681026, 156750293, 175341080, 195158833, 218404216, 244592923, 264978268, 272472159, 271515457, 263689374, 252019577, 239708197, 225077545, 207263420, 186075747, 162859685, 141726304, 124069815, 109809049, 97792909, 87409388, 78851492, 71766925, 66032319, 61237512, 57174288, 53691949, 50724496, 48020038, 45748917, 43409423, 41249497, 39478647, 37646015, 35976237, 34439866, 32972884, 31403690, 30081087, 29212075, 28306155, 27563670, 26503109, 25553748, 24643588, 23648486, 23088818, 22293729]
18322B2293729p84780o59776o81785l85056k25298o10225o27549n49982n49795
18313A7219483m42843l88234l16485j09429l85475k71457k88090k39309k19246
18304A4558915m01901k09312k93414q4323J2451q8685J5373J13884K19042K27539
18294A4069569M5485J39424j5786r5710J57910K42241M894O2909J52539M57020
18284A5220495L57945M61799O92662Q48449J078558J075516J462071K403994K683567
18275B6285056L221863M206115N851219Q087718J1166144J6323808K2992468K8226719
18267A26361110K6168650J7870340J1843572Q076836O637952N811489k82374p960446
18259A94527129j4304734j9909136k1268707j8120943j4727775j2254830j0809121
$$ y = [22293729, 21508949, 20849173, 20167388, 19782332, 19557034, 18946809, 18319260, 17769278, 17219483, 16776640, 16388406, 16071921, 15962492, 15577017, 15305560, 15017470, 14778161, 14558915, 14157014, 13947702, 13654288, 13569965, 13582416, 13493731, 13509104, 13622988, 13842030, 14069569, 14115054, 14254478, 14238692, 14142982, 14300892, 14543133, 14548027, 14610936, 14763475, 15220495, 15578440, 16040239, 16732901, 17581350, 18659908, 19735424, 21197495, 23601489, 26285056, 29506919, 33713034, 39564253, 47651971, 58818115, 75141923, 98134391, 126361110, 152529760, 170400100, 182243672, 190320508, 196958460, 202769949, 202487575, 194527129, 180222395, 160313259, 139044552, 120923609, 106195834, 93941004, 83131883]
18252H3131883r170145p262347n945742m916532l869009l115685k403769j989273
18244D4459381j695363r50879p16491p36573n59690m27482k00667J67590K22360
18235C9562186L04358P36239R09616J622940K467977L257117M449935O109575
18227E9419943Q093034J1779231J6924633K3505279K8021955K6099116K1793634
18220A95636825K1877815K5159104K8979865K6345449J3724665K528412n644283
18213C08607852j0963595j1827796j4256118j8674110k2983905k6501370k6162454
18206A77238504k2528557j8120261j4936415j2991253j1197979r357338p618711
18199H0487990n925167m813220m194288l244704k752112k260003k021298j822779
$$ y = [83131883, 73961738, 66699391, 60753649, 55837117, 51968108, 48852423, 46448654, 44459381, 42764018, 41813139, 41096648, 40360075, 39800385, 39372903, 39172236, 39339826, 39562186, 39866544, 40602783, 41512399, 43135339, 45603316, 48860433, 53310368, 59419943, 67512977, 79292208, 96216841, 119722120, 147744075, 173843191, 195636825, 217514640, 242673744, 271653609, 297999058, 311723723, 314252135, 308607852, 297644257, 285816461, 271560343, 252886233, 229902328, 203400958, 177238504, 154709947, 136589686, 121653271, 108662018, 97464039, 88106701, 80487990, 74562823, 69749603, 65555315, 62310611, 59558499, 57298496, 55277198, 53454419]
18191E3454419j661472j624176j387092j225488r30153q08599k32524j76717J51497
18182D5559695N56969Q07004J687133K418265L388397M884820P407306J1264765
18174G7974354J6394761J9642065J6987892J0687911P178629N173211M744430
18167A58783253L491100j864159p542232j2250055j6186036j6226421j3575675
18160I4629775j0842902r207081q173603p141034n752130m713563m088021l276886
18152D1434555k594723k413235k126577j532147j264837j254419j109330q51988
18144B8287299o34488j004945q45147q64033q42975p93513p31070l53911p02788
18135B1514429p12805o62970o55464m11337n36611l27539l14751p38490k22599
$$ y = [53454419, 51792947, 50168771, 48781679, 47556191, 46626038, 45817439, 45584915, 45408198, 45559695, 46116664, 46923668, 48610801, 51029066, 54417463, 59302283, 66709589, 77974354, 94369115, 114011180, 130999072, 141686983, 148865612, 154038823, 158783253, 162274353, 160410194, 152867962, 140617907, 124431871, 108205450, 94629775, 83786873, 74579792, 66406189, 59265155, 53513025, 48799462, 44711441, 41434555, 38839832, 36426597, 34300020, 32767873, 31503036, 30248617, 29139287, 28287299, 27652811, 26647866, 25802719, 24938686, 24095711, 23302198, 22571128, 22217217, 21514429, 20801624, 20138654, 19483190, 19071853, 18535242, 18207703, 17892952, 17154462, 16931863]
18126A6931863j3101k64103K10756L13621K22793K16574N78406O31551Q38079
18117A9666439J211469J623907K084053K733806M137626N571340Q103044J2756877
18109E7888561K2784818M0628154N9049843M5685378P079238n349401k3325500
18102B04441091l8253784l0924500j9731007j4701106j4579992j3460475j0533156
18095F2257071p978057o571137n077822m164551l671764k848082k160896j907736
18087B7877026j495739j516261j383440j175504j177183j205112p65138p27382
18079A8431267r09129q78422q11201o13245k55115m99921o27775n60752m69145
18070A2806562m27963n49295m00646k01431l05928m13887k30554k90183k70079
$$ y = [16931863, 16918762, 16654659, 16865415, 17179036, 17401829, 17618403, 18196809, 18828360, 19666439, 20877908, 22501815, 24585868, 27319674, 31457300, 37028640, 45131684, 57888561, 80673379, 121301533, 180351376, 226036754, 233115992, 227766591, 204441091, 166187307, 135262807, 115531800, 100830694, 86250702, 72790227, 62257071, 54279014, 47707877, 42630055, 38465504, 34793740, 31945658, 29784762, 27877026, 26381287, 24865026, 23481586, 22306082, 21128899, 19923787, 19158649, 18431267, 17522138, 16643716, 15832515, 15219270, 14964155, 14464234, 13836459, 13275707, 12806562, 12378599, 11829304, 11428658, 11227227, 10921299, 10507412, 10276858, 9986675, 9716596]
18061I716596l91927j95708j65292m38096j72350l32662l73458j34309Q2893j03905
18051G491782k13284l25051k30603N7558l15156j71741J84983p9618l83682k40381
18041E774807k27067k27372k40342q6021j05857J04990K57944n7908k75269q1963
18031D835942o013J32647n9250n2524q9624j27880j25054m42446m1249r2221p4621
18020C857707J0040j52683k16650Q6514J8074j76981j01116r819j49910l85281
18010B779895J30697M9687k12142j25047K3141R6644r9202L5571J943j8104k4530
17999B638553o6570k0968p5525J22180q0293k65313j46836K9556J94040k8172
17989B300652j14395j66576l69o2565j30522j252j20730K07177R9040k57295j32581
$$ y = [9716596, 9324669, 9128961, 8963669, 8525573, 8353223, 8020561, 7647103, 7512794, 7595687, 7491782, 7278498, 6953447, 6722844, 6780402, 6465246, 6293505, 6478488, 6398870, 6015188, 5774807, 5547740, 5320368, 5080026, 4994005, 4888148, 4993138, 5251082, 5193174, 4917905, 4835942, 4829929, 4962576, 4903326, 4850802, 4761178, 4633298, 4508244, 4065798, 4024549, 3932328, 3857707, 3867747, 3715064, 3498414, 3584928, 3603002, 3426021, 3324905, 3315086, 3165176, 2779895, 2910592, 2960279, 2748137, 2623090, 2646231, 2742875, 2643673, 2679244, 2681187, 2663083, 2638553, 2571983, 2551015, 2475490, 2597670, 2517377, 2252064, 2105228, 2134784, 2328824, 2300652, 2186257, 2019681, 2019312, 1956747, 1826225, 1824973, 1704243, 1911420, 2010460, 1753165, 1620584]
17978A620584J5339M8460n0738o0997m58274m0875j4014m7627J11020K35803P5240
17967A433921k70494O3638O8928k36181q1533L8497O6380P1763l3365J52861J09287
17956A383702O9102J83858L01500J66268J87504j16357k55952k37347k13095j19158
17946A350025j4397P2428j9110N5419J90850J41608K5061q9773R516J20603k8920
17935A813310m4672J06279R2221J3177k10098j65702N2729o1118m539M5957R3737
17924A731281O215L2055Q0756j74594J81953R732j75042p1266J03532r9641M3957
17913A668938K9317j56849j54408j89910J73183J68511r215j71862j53897J81936
17903A385744L22354J63592Q6634J81008J06074q7586J86823j51612r3199j00757
$$ y = [1620584, 1635923, 1684383, 1633645, 1572648, 1114374, 1073499, 1059485, 1011858, 1122878, 1358681, 1433921, 1163427, 1227065, 1295993, 1059812, 978279, 1016776, 1083156, 1154919, 1121554, 1274415, 1383702, 1452804, 1636662, 1938162, 2104430, 2291934, 2175577, 1919625, 1682278, 1469183, 1350025, 1335628, 1408056, 1388946, 1444365, 1635215, 1776823, 1801884, 1712111, 1721627, 1842230, 1813310, 1768638, 1874917, 1967138, 1980315, 1770217, 1604515, 1657244, 1596126, 1591587, 1637544, 1731281, 1737496, 1769551, 1850307, 1675713, 1857666, 1867398, 1692356, 1621090, 1724622, 1624981, 1668938, 1698255, 1541406, 1386998, 1197088, 1370271, 1538782, 1529567, 1357705, 1203808, 1385744, 1708098, 1871690, 1958324, 2139332, 2245406, 2157820, 2344643, 2193031, 2099832, 1999075]
17893A999075j32745k7304r5662J52841K13568R5689Q6436k960R4585j53027j4714
17882B215782J86398L8877n1810L4548K2731k45453k2498j32417n4638l2995k09883
17871A748642k82147J9573L4665j43103R2764J09968j70893l28379j66161K03856
17861A118785J11679J31813k09289O361N7803N200k22579k93174K157J09707j6634
17850H01829k35391J29600r7426M7387J71839j42250N1590J49040p2299j47383
17840F56536L32757L25029R0113J4007j3889M22056M46793J95373q894k32181
17830B227700J2211J98659k0235k54590j1684k80411l12872L0098k37090k24939
17820A126847k7748n2541j17336Q241j7931k41434j64392K01850J53246L5520
$$ y = [1999075, 1866330, 1839026, 1743364, 1896205, 2109773, 2205462, 2291898, 2288938, 2383523, 2230496, 2215782, 2402180, 2441057, 2389247, 2423795, 2446526, 2201073, 2178575, 2046158, 1991520, 1958525, 1748642, 1466495, 1486068, 1520733, 1377630, 1470394, 1580362, 1409469, 1081090, 914929, 1118785, 1230464, 1362277, 1152988, 1159349, 1217152, 1222352, 999773, 706599, 708756, 818463, 801829, 566438, 696038, 598612, 645999, 817838, 675588, 727178, 876218, 803919, 656536, 989293, 1314322, 1404435, 1418442, 1404553, 1826609, 2273402, 2468775, 2459881, 2227700, 2239911, 2438570, 2418335, 2163745, 2152061, 1871650, 1558778, 1588876, 1351786, 1126847, 1099099, 1046558, 929222, 937463, 919532, 678098, 513706, 715556, 868802, 904322]
17810I04322K33855m8430j29324p435o6175p1663J20538k0301j91490l7665k6668
17799F59564K17133J31099o7177j10858Q3645j11589q0900k57735q4466j36489
17789B42227N3249K10141J12298P1885m3966p9876J01378J35757p826q2214P5996
17778G89049j35097r7374q0941k24205P3278L324j01385p0236k09378K1038L78631
17767C46704K10555j22298L44758j20490k39952L1831j0055J04775O7799O8679
17757F82306o3031P8724M0596o6469O4318R0953K42775K72922K11377K12777J0309
17746A777557j09063l87077k15608O5486j59860P3571J11350k0438m36851j51493
17736E47574r2701r5773l3133J80182J16261j25627l8545o4324j37332J46140
$$ y = [904322, 1138177, 1089747, 960423, 952988, 886813, 815150, 935688, 915387, 723897, 686232, 659564, 876697, 1007796, 940619, 829761, 913406, 801817, 720917, 463182, 378716, 242227, 295476, 505617, 617915, 689800, 645834, 565958, 667336, 803093, 795267, 713053, 789049, 653952, 556578, 475637, 251432, 324710, 328034, 226649, 156413, -52965, -31927, 346704, 557259, 434961, 779719, 659229, 419277, 451108, 441053, 545828, 613627, 682306, 619275, 697999, 738595, 672126, 736444, 827397, 1070172, 1343094, 1554471, 1767248, 1777557, 1668494, 1281417, 1065809, 1131295, 971435, 1045006, 1156356, 1135918, 699067, 547574, 454873, 359100, 325967, 506149, 622410, 496783, 458238, 393914, 256582, 402722]
17726D02722R8945r4431N4431J44101j20528j93939K3191J58043J72901r1713
17716E53723l5170l4795J17755r8325j69162J15166O6570J72674J61186m3634
17706H05988J45248J18474J52370J91969J00178N6720L72233K59106m6946k18923
17696A936417J74572J3286l12883j66657k69511k33148R3875j08616P4998l9488
17686A162845m9407k04239n8202l9472j08510l2684R761l759p9764r6820q1369
17675D18380J83836L03635j12989n4953j82732r5862K9760M5392R8874P5474N1605
17664G60420j19177l0780J70980J08454J15801J37259K86395k240p2827L5918
17654A390203M4896q1088P6416j784J01851l8150J3163j0963k32025n33376k54406
$$ y = [402722, 501667, 407236, 461667, 605768, 485240, 291301, 314492, 472535, 645436, 553723, 518553, 483758, 601513, 503188, 334026, 449192, 515762, 688436, 849622, 805988, 951236, 1069710, 1222080, 1414049, 1514227, 1570947, 1943180, 2202286, 2155340, 1936417, 2110989, 2124275, 1811392, 1644735, 1375224, 1142076, 1235951, 1127335, 1202333, 1162845, 1113438, 909199, 850997, 811525, 703015, 670331, 680092, 676333, 596569, 499749, 418380, 602216, 905851, 792862, 737909, 555177, 459315, 489075, 534467, 633341, 708815, 760420, 641243, 610463, 781443, 889897, 1005698, 1142957, 1429352, 1427112, 1354285, 1390203, 1435099, 1354011, 1430427, 1428643, 1530494, 1492344, 1505507, 1494544, 1262519, 729143, 474737]
17643D74737j24492J15643K18821J06555K9820J34189j48223k84887j23110P4982
17633D74035J81948r3689j61139L4080J83295J8188m08942l67210K18005J90353
17623B68924Q6645p25l5106o6315K79957J97443O0295p3212k19073j96995J87796
17612D89634R2192p6403j44304k227K46173J43941q211q3171M685m3134p6531
17601E42644k64129j54950N2269J43807j35399m6239J69453k5649K05185K70051
17591G57043r1084l33179p1439P8533j9569j64037j07299K22169J06476R1963
17581D69577R390q2174L2312j19567r8492k2693j32125q6107N378J32634K8961
17570A37094N0884q7437r8332p4816j01078K59209Q9976k10744J83925P5462K76319
$$ y = [474737, 350245, 465888, 684709, 791264, 821084, 955273, 807050, 522163, 399053, 474035, 655983, 562294, 401155, 435235, 618530, 636718, 227776, -139434, 78571, 268924, 355569, 354844, 319738, 253423, 533380, 730823, 791118, 717906, 498833, 301838, 489634, 581826, 505423, 361119, 358892, 605065, 749006, 740795, 657624, 662309, 619175, 542644, 278515, 123565, 175834, 319641, 184242, 138003, 307456, 281807, 486992, 757043, 665959, 332780, 261341, 339874, 320305, 156268, 48969, 271138, 377614, 469577, 478967, 396793, 429105, 309538, 211046, 188353, 56228, -29879, -24501, 108133, 137094, 187978, 100541, 2209, -72607, -173685, 85524, 175500, -35244, 148681, 224143, 500462]
17559E00462J39470m29736n5626j19459L4394m3464r6374j02733K06218P0880
17549A04032p8958N4354j23710k59860j45458O0194R7364J45978J38106K24016
17539B16058m0013L6250M2852M6030P7446J43813o3433q9012p0449J8387L7940
17528C55869m6273J50217P9744r6847p5438o9845o8072k07976J42488J70920j55829
17517A78958o5075K25947m0345j86157q6907n1677K12365K28845J65777J76343
17507G58074k43316m11291k26284J56383K94796M6671j01972k4804k3037O5827
17497B91047l1186N5461r8315k22223o3928J51226Q8989Q1190j28968l31702O0776
17486a47633J10835o5877Q6629K47194J678m5375j30116l0086J23313K4801j18104
$$ y = [500462, 639932, 210196, 154570, 35111, 69505, 26041, -70333, -173066, 33152, 104032, 25074, 79428, -44282, -304142, -449600, -389406, -292042, -146064, -7958, 216058, 176045, 212295, 255147, 301177, 378623, 522436, 459003, 369991, 299542, 317929, 355869, 309596, 459813, 539557, 442710, 367272, 297427, 229355, 21379, 163867, 334787, 178958, 113883, 339830, 299485, 113328, 26421, -25256, 187109, 415954, 581731, 758074, 514758, 103467, -122817, 33566, 328362, 375033, 273061, 248257, 225220, 291047, 259861, 315322, 217007, -5216, -69144, 82082, 171071, 252261, 123293, -208409, -147633, -36798, -102675, -16046, 231148, 232826, 187451, 57335, 27249, 150562, 175363, 57259]
17475E7259K06361L3857j53026Q1436P6519P6436l6285m3645N3486j67678l5638
17464A49082q7841L9292l1319K42013l3105j95141j83245P2076m1253q454Q0767
17453B872l449J05953p3058L24184p594k99766J2137M03543K03019q9629K35942
17442H14154J09675J53727M11492K28011l0564m78429k69946j99419l56162n2180
17432C30359j12849P7510J93432K7416k57659p7984j90487R7152J06944k07370
17422a3536R5333K37471r6539r4223P6566J84760k53732j57915r3452M4808m9192
17411a19651J62776J83856j62965m1643n1134L0195J59081J5616j3734J33848
17401B96245j43910o5112J83612N4394n2390J54145P8385r4636j18695m407K2386
$$ y = [57259, 263620, 297477, 144451, 225887, 302406, 378842, 342557, 298912, 352398, 184720, 149082, 61241, 100533, 69214, 311227, 278122, 82981, -100264, -28188, -69441, -77895, 2872, -577, 105376, 32318, 356502, 348908, 49142, 61279, 464822, 667841, 578212, 814154, 923829, 1077556, 1489048, 1717059, 1686495, 1208066, 938120, 738701, 382539, 330359, 217510, 295020, 488452, 515868, 258209, 180225, -10262, 86890, 193834, -13536, 81797, 319268, 222729, 128506, 205072, 389832, 136100, -21815, -115267, -70459, -119651, 43125, 226981, 64016, 22373, -28761, 1434, 160515, 176131, 162397, 296245, 152335, 87223, 270835, 325229, 272839, 426984, 505369, 410733, 292038, 287631, 310017]
17390C10017L19499j3577k51142q5878k88230j24517K27551K27168l64183j20338
17380a63630K72250J68187l4614L3451J12957n0647j68965j87777R4890K59459
17370C35561M3400j53189l7440l5967l8898o0205k34253j28503L24187L41520
17360C56213R588J0002j37369j48050M9350K0824j50512o7731J85393P8985l4343
17349A72350J76415L5824k45615j64020R8985K17912m2820j58268L5786P2022
17339A98571m4964j35622j3713J64736L6318q442R2900m6711j63290J83300l3728
17328B29355k01012j36653j09960O5486L32187M5963j68596r6201J10139k5258
17318D5450L7965K20050m4196r4724r7443k116Q3299M506o284o8586Q0445o6661
$$ y = [310017, 629516, 615939, 364797, 278919, -9311, -133828, 93723, 320891, -43292, -163630, 108620, 276807, 242193, 275644, 388601, 337954, 168989, -18788, 76102, 335561, 378961, 225772, 188332, 152365, 113467, 53262, -180991, -309494, 14693, 356213, 365801, 375803, 238434, 90384, 139734, 160558, 10046, -57685, 127708, 206693, 172350, 348765, 384589, 138974, -25046, 73939, 291851, 249031, 90763, 126549, 198571, 153607, 17985, 4272, 169008, 205326, 196884, 289784, 243073, 79783, 263083, 229355, 28343, -108310, -218270, -152784, 179403, 225366, 56770, -39431, 70708, 45450, 83415, 303465, 259269, 164545, 67102, 64986, 148285, 152791, 146507, 77921, 158366, 91705]
17306I1705k7601k50298L14032O4828k43269R4702J24664j60798j09745K37346
17296A35566J50877j48713j17995j37852K1017r1725o0426J37375K16602k10553
17286a05827J01902J48384l2987K04225j14477n8744L1998k4789n0384k30842
17276a31541k01635K27846k8515k06675j6082Q2897N5620J14816p197N271k5409
17265a30604Q3076j3745m1131n8241J4978N0160J36148k1723m3402K46729P690
17254B29935l8534j69739J74243K70844J25378j96842k09915j56115J43120j12454
17244E9921l60367J27031J83345N4768K32613j0386j55912j45552P6671J6913
17234G9045K544J7646l90K77265Q0269o5348k7314r0886L5153r9938j0654J4117
$$ y = [91705, 64104, -186194, 127838, 192666, -50603, 44099, 168763, 7965, -101780, 135566, 286443, 137730, 19735, -118117, -97100, -188825, -249251, -111876, 104726, -105827, -3925, 144459, 111472, 315697, 201220, 142476, 174474, 149685, 99301, -131541, -333176, -105330, -133845, -340520, -356602, -273705, -218085, -103269, -110466, -105195, -130604, -47528, -61273, -102404, -160645, -145667, -95507, 40641, 18918, -24484, 222245, 229935, 191401, 21662, 195905, 466749, 592127, 395285, 185370, 29255, 172375, 59921, -300446, -173415, 9930, 64698, 297311, 286925, 131013, -14539, 62132, 79045, 81589, 99235, 98845, 376110, 456379, 391031, 363717, 272831, 307984, 208046, 197392, 211509]
17222B11509O0672j731j77078l01016o7288J1807J51310J73544N5900q00j0739
17211A06090P6628r852o3690k17363j1224K67269M8095M6788j05656k02864j9382
17200h5161r7503J02362m0072j9867K5571p6018j48420m3455K23848P9868j29413
17189b08260K36527o5438p7445Q7042J11876j0884K63462j21660j38053j42083
17179f4916J58199Q3371J25232P8912j33282m4817q0429r649q1003P6323K01228
17168C09169k23780q380J00361J39814J27021J55240J04137M163J13341p6052
17158G45034l15319j33771k40383O2866j76256J79551J44923p1050k65951k2801
17148i3157M48952J88551k66499l02109K63354O7477n8425N1367j77410q2389
$$ y = [211509, 272181, 270450, 93372, -207644, -274932, -263125, -111815, 61729, 117629, 116829, 106090, 182718, 172866, 109176, -108187, -119411, 147858, 195953, 242741, 137085, -65779, -85161, -182664, -80302, -120374, -140241, -114670, -190688, -339108, -382563, -158715, -78847, -208260, 28267, -37171, -114616, -27574, 84302, 73418, 336880, 215220, 77167, -64916, 93283, 176654, 301886, 380798, 247516, 202699, 122270, 112621, 31618, 107941, 309169, 85389, 77009, 177370, 317184, 444205, 599445, 703582, 707745, 821086, 745034, 429715, 295944, 55561, 118427, -57829, 121722, 266645, 195595, -70356, -93157, 355795, 544346, 277847, -24262, 239092, 306569, 248144, 299511, 122101, 39712]
17138C9712K8360l56506j33207J72199K30919J96034j23585k57510m8176m3123
17128b94883q6001K0273J24874L4816K6378J78521K65073k2048k6471p7064k12100
17117f8632J22072P0556J356o3909l3989R8078j07800N4813J0258m8779j39028
17106a05004J39910R5577r564p0165j05731o7986l3207j38633k8749p0569J28428
17095b65693K14510K65843J35616P5651J7447k6693q952n6852k79309J08244J34811
17084C14623j72049P187l15567J27805K52375K62661j64629m33134Q5207J98821
17074A63300O2883J27564m9342Q357J62520j06092k37439k20204k71946j26932
17064d87331L0601l6112K14161M11437j14633k6953j51481r2422K48082J51529
$$ y = [39712, 68072, -288434, -421641, -249442, -18523, 177511, 53926, -203584, -251760, -294883, -380884, -360611, -235737, -200921, -174543, 3978, 269051, 247003, 220532, 143468, -68632, 53440, 123996, 125352, 61443, 27454, 125532, 17732, 72545, 82803, 34024, -105004, 34906, 130483, 120919, 50754, -54977, -122963, -156170, -294803, -323552, -394121, -265693, -51183, 214660, 350276, 425927, 443374, 416681, 407729, 350877, 71568, 179812, 314623, 142574, 149761, -165806, -38001, 214374, 477035, 312406, -120728, -35521, 163300, 226183, 353747, 304405, 312762, 475282, 369190, 131751, -88453, -360399, -487331, -456730, -492842, -278681, 132756, 18123, -8830, -160311, -252733, -4651, 146878]
17054A46878L8074r289j37866l30796j6223L61351l631j15620L04302J18411k00231
17043A55360j84628l366J48547K00744N7379j27079j41758p8202j9987P9075M6529
17032A32614Q90J18648L4376l7467j77276j06226j45765m9657j1842K86788J1793
17021E6876j46751K0965N2125J91067p5469k01585J66726j67322l1258K32264
17011I7638Q9621j55822q3898o7655j4324j67667Q9767L13693K1693J17719o1370
17000A79395m8055k9543Q3300J25338k4742j75869K5348j78771j47547k10156
16990d01302k41211K87192M93068J73848k24619r3745J61126K8046j4756r3049
16980G4598K6633k320K00952j32434j84621K0371j09511K31310L26017J17645
$$ y = [146878, 184952, 175663, 37797, -292999, -309222, 52129, 48498, -67122, 237180, 355591, 155360, -29268, -32634, 115913, 316657, 374036, 246957, 105199, 26997, 7010, 86085, 132614, 133504, 252152, 286528, 249061, 71785, -34441, -180206, -229863, -241705, 45083, 56876, -89875, -68910, -16785, 174282, 98813, -102772, 63954, -103368, -134626, 97638, 187259, 31437, -52461, -120116, -134440, -302107, -212340, 101353, 123046, 240765, 179395, 131340, 101797, 185097, 310435, 285693, 109824, 135172, -43599, -191146, -401302, -642513, -355321, 137747, 311595, 86976, -6769, 154357, 182403, 167647, 74598, 101231, 98911, 299863, 167429, -17192, 3179, -106332, 124978, 450995, 568640]
16970E68640k03155l18011K7201j14711J49388J00538P6296Q9304o7665j78386
16960A29439L013n8336j91938k01872J5206L03894j32432j34548M4825J1809K9806
16949a81134k5484k36193J53369J32041j323k3576j42636j2276k64123L61108
16939b40227L76648R2874m0816k56657j30665m444o6570O7857l06857j79065J47800
16928e40122K63703K8084k6666L82873L28872k02756l53342k75940J42944P1060
16918a81290k0933J22385J88451P3006J0931p3064l12584q4200j8128j08899O3751
16907c40574j7839J13939J37978Q2767J8915L3375K0765j4563p580p5967n6106
16896a04890L8950K4842O9479P329j61481j82258J19526N4866J53662j67414j74461
$$ y = [568640, 365485, 47474, 74675, -40036, 109352, 209890, 286186, 375490, 307825, 129439, 132452, 74116, -117822, -319694, -304488, -594, -133026, -267574, -222749, -210940, -181134, -206618, -442811, -289442, -157401, -158724, -182300, -324936, -337212, -601335, -240227, 136421, 229295, 188479, -68178, -198843, -203287, -269857, -202000, -508857, -687922, -540122, -276419, -248335, -275001, 107872, 436744, 233988, -119354, -395294, -252350, -181290, -202223, -79838, 108613, 181619, 192550, 119486, -193098, -277298, -295426, -404325, -340574, -358413, -244474, -106496, -23729, -4814, 28561, 49326, 34763, 27183, -48784, -104890, -65940, -41098, 28381, 35710, -125771, -308029, -188503, -133637, 20025, -147389, -321850]
16885c21850J19331J3479j40983J03115L69879K1882m9394j23876j17972J71706
16875D5317J23146j56041L7799j28150M3108J76694j07674j89262J41820Q4340
16865G1097j6137o2793k51376j05543j29007J36852L65436p071K0765r7396m4299
16854a19472R6716J22246j95334q961J39237j6118K37324l9961j67897K590j0831
16843C9539L6754K3328j7125P1267R3605j40014K6417o0251k51212k39893j25303
16832e42888K29699K72430J87339J56194j59612l68727J26595J17296q3028j23784
16822a88486j04509O6480L22813R7097j46034o9108j03282j82280R2670K30548
16812A5909J34922L5157r7816J03468K0967o3355l84384j58635K4136k36436N1104
$$ y = [-321850, -202519, -189040, -330023, -226908, 142971, 164853, 115459, -8417, -126389, 45317, 168463, 12422, 50221, -77929, -34821, 141873, 34199, -155063, -13243, 71097, 54960, -7833, -259209, -364752, -493759, -356907, 8529, 1458, 22223, -75173, -119472, -22756, 99490, -95844, -104805, 34432, 18314, 255638, 215677, 47780, 50370, 39539, 76293, 99621, 82496, 153763, 247368, 107354, 133771, 73520, -177692, -417585, -542888, -313189, -40759, 146580, 302774, 143162, -225565, -98970, 18326, -64702, -188486, -292995, -226515, 96298, 193395, 47361, -21747, -125029, -307309, -214639, 15909, 150831, 185988, 88172, 191640, 212607, 149252, -235132, -393767, -369631, -606067, -554963]
16801e54963K59271J51457j5004J2557N9363Q4382J67842J0719k1029n0928j83201
16790g9534j73880P7126k2094j82971K06011K50178J30159j20606J4385J4007
16780A12781k60723j36407j07080K59327L0696l6689k03204L6558n662J12758
16770a97645J15777Q5478J10262k51505l02473n9363J04574n1424J87835J25869
16760a32615K9926Q6290p7963n9744M8216N2439K32451P425J46563K4550k57851
16749I9687k13819q9955k19893K70428K81692J3425k22161n0856J06141K3572
16739a739q6930k90401k34322L85962K85060k67718k27722J8767J75398K7686
16729b15959N4750n6151k1817K51701J23104p2645j28794M6886O0697m7999q4665
$$ y = [-554963, -295692, -144235, -159239, -146682, -87319, -2937, 164905, 175624, 154595, 103667, -79534, -253414, -176288, -198382, -381353, -175342, 74836, 204995, 84389, 98774, 112781, -147942, -284349, -391429, -132102, -101406, -138095, -341299, -304741, -310403, -197645, -81868, 3610, 113872, -137633, -440106, -499469, -394895, -446319, -258484, -132615, -102689, -16399, -94362, -154106, -105890, -53451, 179000, 186425, 332988, 357538, 99687, -114132, -204087, -423980, -153552, 128140, 141565, -80596, -131452, -25311, -1739, -88669, -379070, -613392, -227430, 57630, -210088, -437810, -419043, -243645, -215959, -161209, -217360, -239177, 12524, 135628, 62983, -65811, -18925, 41772, -6227, -90892]
16718i0892M6143J73589K15640k8815O4642j23506j08475q9631j86876l055J25432
16707e804j42360O3835K20610o2652j52242j59447K4491L54623O6770j4482j92780
16696E62j68768l0754j8208J96246k1341J8655j77497j08713J23892K89172K15715
16685C18961j76446q071o5076r2009j74405n3030N1996K13990J9249J62356k3849
16674A73666l45516q797K30200n734J73314k56688o7726K52790q787L1093M0244
16663B08059R2590k79084k12652n6805j6672J208K34568O4315J05791j00704J1490
16652E2104l6425J22782J63328j75992P4421r649j4017q6002L16462p7703j90046
16641A39263j96828J85243J27125j46643k13933j391l0719O6819n9349p7160O1596
$$ y = [-90892, -44749, 128840, 344480, 315665, 380307, 256801, 148326, 58695, -128181, -131236, -5804, -148164, -84329, 136281, 73629, -78613, -238060, -213569, 141054, 207824, 193342, 562, -168206, -198960, -217168, -20922, -42263, -23608, -201105, -309818, -185926, 103246, 318961, 142515, 134444, 69368, -22641, -197046, -250076, -198080, 15910, 35159, 197515, 173666, -171850, -180647, 49553, 43819, 217133, -39555, -107281, 145509, 136722, 167815, 208059, 300649, 21565, -191087, -247892, -264564, -263356, -28788, 35527, 141318, 40614, 52104, 15679, 138461, 301789, 125797, 200218, 190569, 176552, 90550, 407012, 329309, 139263, -57565, 127678, 254803, 108160, -105773, -107164, -137883, -71064, -130413, -207573, -145977]
16630a45977K16708q8995r8978j22795n656N3734n3076J05725J59740M1732j02116
16619c9954j39855Q1594R3826J27849N7921r5019q8440L20275O4432M0786l08648
16608A14767k02566P4911p6158L608J71733J99262j3226j63063k00415r4828j94739
16597c80714M1424o62j47625L65261K96893k35409q1220J33846J41426O4359m2862
16586A54717p7046L8283J13208k8009M8760J45006l68n826o9635j08634k1198
16575A89258q8482l99699j44572q7226J12344L14955j35267j80167R9441R4998
16565b24417J94035J98450J14221n2626r1227j20033M5413N8180L1407R4054J10593
16554C58050Q8323k02119r6586Q2368k4347j01637K827N8401m8141j22914k6425
$$ y = [-145977, 70731, -18264, -117242, -240037, -245693, -191959, -245035, -139310, 20430, 62162, -39954, -179809, -98215, -4389, 123460, 181381, 86362, -2078, 318197, 382629, 423415, 114767, -87799, -12888, -89046, -85438, 86295, 285557, 272331, 109268, -91147, -185975, -380714, -339290, -339952, -487577, -122316, 174577, -60832, -142052, -8206, 133220, 197579, 154717, 77671, 115954, 229162, 201153, 249913, 394919, 394551, 388725, 319090, 210456, 189258, 100776, -298923, -443495, -530721, -418377, -103422, -238689, -418856, -319415, -224417, -30382, 168068, 282289, 229663, 138436, 18403, 63816, 121996, 153403, 247457, 358050, 446373, 244254, 147668, 230036, 205689, 104052, 106879, 165280, 117139, -5775, -32200]
16543c2200r3775l9036J05325J80681k05636N4278J09997J74130j10172r196k13823
16532g9427j73978J53999J75595J23894J63701J03505J5584k42911k58903p3284
16522i2225J0620k8130J21041J00759j26274q9490J46944Q3045K0605o7888R027
16511H8034L1213Q7952n4620L0023k33589l17389j85883K9543J94392J24047J00742
16500a05535J98498Q0403P2805j17872O9439l2262j6126q5068k2546K94608P8310
16489D14654j41007N8100K6662p7157k19145k51870j40580j30548N8344N7707
16479c44840o3635K61893K34457J6779L4488P4031j3633l26097j41497l0921N3491
16468b45484M8095O1740Q4513J09321J87018Q2042K5225k74595k77747J03717
$$ y = [-32200, -125975, -165011, -59686, 120995, -84641, -30363, 79634, 253764, 143592, 134396, -79427, -253405, -99406, 76189, 200083, 363784, 467289, 482873, 239962, -18941, -92225, -81605, -109735, 11306, 112065, -14209, -103699, 43245, 126290, 146895, 79007, 88034, 119247, 207199, 152579, 182602, -50987, -368376, -554259, -524716, -330324, -206277, -105535, 92963, 173366, 246171, 128299, 197738, 165476, 149350, 64282, 41736, 336344, 414654, 273647, 331747, 358409, 281252, 62107, -189763, -330343, -460891, -402547, -344840, -408475, -146582, 87875, 104654, 139142, 213173, 199540, -126557, -268054, -298975, -245484, -197389, -135649, -51136, 58185, 245203, 327245, 352470, 77875, -199872, -96155]
16458i6155J47892j33976j2266J04356K27744j23678l96151p1767K38959R3544
16448b1498l6179j09710j38195j86466K00606J56608J71875J7038q5167j86355
16438b17443j32343j9510J78991Q745l9762J96835J03043k12038k18979j58419
16428e10880O2198Q2688j88671M7371K48067J71229l8547q6477K8706K91849R464
16417A16997j76645j57678k17491L7293J69753o5753J0606r1726P2416n822q2473
16406c90523n1967l31428q9454K60129M3523L39087K21373j6339J63566j77757
16396b9790L9812K385l4561P3280P4176J37239k18371O7239K48263L2813k65657
16385A26828J38635J26833R2226J61829j25102k03018m3933j64470j29908J23504
$$ y = [-96155, 51737, -82239, -94505, 9851, 237595, 113917, -282234, -354001, -115042, -21498, -57677, -167387, -305582, -492048, -291442, -134834, 37041, 54079, -31088, -217443, -349786, -369296, -190305, -181560, -221322, -24487, 78556, -133482, -352461, -510880, -448682, -365994, -554665, -507294, -259227, -87998, -126545, -213022, -184316, 107533, 116997, -59648, -217326, -434817, -397524, -227771, -293524, -282918, -374644, -302228, -308050, -390523, -442490, -773918, -863372, -603243, -559720, -220633, 740, -15599, 147967, -29790, 10022, 12407, -22154, 51126, 125302, 262541, 44170, 111409, 359672, 392485, 126828, 265463, 392296, 484522, 646351, 521249, 318231, 274298, 109828, -20080, 103424]
16375A03424l26523m60022o8070L57749M70107m272O9963k9586R2494q2268n0412
16364G2584j28560k79247N4652J80688J50537j1614O1640K11479L0047j2036j0455
16353C19715q606q2072J4045Q4349k7620m05250j32668J22844J09825O7026P7553
16342A39141j0295j18108k18884l4086O0677K85350k170j0921r7049k4746n2645
16331h3736j65670K34943q7716j01596o0141l6865O2527J96934J76584J24056
16321B59320O4700J24440n4851k36266j26595m05665J31050K83868N6158k3422
16311G2737q7602q2289J35991K41979n2912q3254o9156q1776R341m0150J37617
16300A00526o1816k6731K0935J55687j13351k83478J13897L26043j50019j64976
$$ y = [103424, -223099, -683121, -751191, -393442, 76665, 72393, 142356, 112770, 205264, 122996, 72584, -55976, -335223, -280571, -99883, 50654, 39040, 100680, 312159, 342206, 330170, 319715, 311109, 229037, 243082, 327431, 299811, -105439, -238107, -115263, -5438, 61588, 139141, 128846, 10738, -208146, -242232, -181555, 103795, 101625, 90704, -6345, -31091, -83736, -249406, -14463, -102179, -203775, -263916, -300781, -238254, -41320, 135264, 259320, 324020, 448460, 393609, 157343, 30748, -374917, -243867, 40001, 96159, 72737, -14865, -97154, 38837, 280816, 227904, 144650, 75494, -6282, 3059, -37091, 100526, 38710, 11979, 32914, 188601, 75250, -208228, -94331, 231712, 81693, -83283]
16290h3283n5456P3203J61821p8476j28454N06k1625J21252p8051j39565J00518
16279a27610J56191O1660l5799k40518l1936J23013n4233j76727K18729k8582
16269a35812N910m3292n2362n5387J49387R5771J51779j22070j26222j4039L00815
16258A54478J74407N8957j89410j42103J32327J061J9309r1655j08942k18355
16248b09926j23718J67297q0656R9837Q1113K19892N3139q4237J0942J46684o8177
16237B12190P4654O0398K71151k48166k88684r6742m2957j9469k70126o117K53091
16226a00777Q6314j3472r1839K4152K17014P6649J2639j65805P0499K38856j22865
16215B31365j05720J4188r0629j66941Q1259K07074J67785l8655P3297n7733j52102
$$ y = [-83283, -138739, -65536, 96285, 17809, -110645, -110139, -131764, -10512, -88563, -228128, -127610, 28581, 90241, 54442, -186076, -218012, -94999, -149232, -325959, -107230, -135812, -129902, -173194, -225556, -280943, -131556, -35785, 115994, -6076, -132298, -146337, 154478, 328885, 387842, 198432, 56329, 188656, 189717, 209026, 117371, 8429, -209926, -333644, -166347, -247003, -147166, -66053, 153839, 206978, 122741, 133683, 280367, 212190, 286844, 347242, 618393, 370227, 81543, -15199, -58156, -77625, -347751, -353868, -100777, -14463, -27935, -119774, -95622, 121392, 198041, 210680, 44875, 115374, 354230, 231365, 125645, 139833, 49204, -117737, -36478, 170596, 338381, 299726, 373023, 315290, 163188]
16204A63188j7309n9951M0845M6233P0218J53225j90853l4341j63435k953J93301
16193A98168J28801j14068r3583P8297K3501j71638L102q2392j11220L701q9639
16182b26970J6575q56p6238n3017K41038J73102K85453p2862j43294j96377k30073
16171b83519J72275n0442k8216J20169k5192k8707j00257o6076J26887J97865
16161C4787P9141k05564N8039J447j79954o6163q8719J89281j3072l1327J15351
16150a06753l3807R9406r8103j71617j852l9786o2714J8966R2202j5921j80822
16139e00801O1246K80079J43186K704J88341p9154K4646l8872j13871j30164J79550
16128A6890o9393j01298n099J08519Q5307n9167l12460k76458P8553R5441n8465
$$ y = [163188, 145879, 85928, 126773, 173006, 243224, 396449, 205596, 171255, 7820, 4867, 198168, 326969, 212901, 119318, 197615, 221116, 49478, 52580, -29812, -141032, -137331, -226970, -210395, -211251, -287489, -340506, -99468, 73634, 359087, 286225, 142931, -53446, -283519, -111244, -161686, -189902, -69733, -94925, -123632, -223889, -289965, -163078, 34787, 113928, -91636, -33597, -32150, -212104, -278267, -366986, -177705, -190777, -222104, -106753, -140560, -41154, -139257, -310874, -312726, -352512, -415226, -396260, -304058, -319979, -500801, -439555, -159476, -16290, -13586, 174755, 95601, 120247, 81375, -32496, -162660, 16890, -52503, -153801, -158900, -50381, 34926, -24241, -336701, -613159, -534606, -439165, -497630]
16117d97630J86522Q0449J09955P7592O3271k02125q0749j3006J55923N9102P8562
16106A7866m0607L428J68121j33248j10391J71132K99043K4695o1881p209K0216
16095C51165k24343n5854j19429j89655Q2636P8982P8207L9619k70976J45849
16085h3799J13884L7221r542Q0934K1420k1850R2206j03979j27226R3966J07482
16074B00717j11366k28480J17458K51078O7604l6623k48995K0758j17886j89952
16064b75687J95540L34819n1184k6031J1508r1353j09398k8359n740P7478p0330
16053c8737l6425j8196K44293J33658q4534j65725L1512R3907r6134n6018N7331
16042F4932K47043K78511r4968j05233k99585j23021P1878Q4300J48282k49117
$$ y = [-497630, -311108, -230659, -120704, -43112, 20159, -181966, -262715, -275721, -119798, -60696, 17866, -22741, -19313, 148808, 15560, -94831, 76301, 375344, 400039, 338158, 330949, 351165, 126822, 70968, -48461, -238116, -155480, -76498, 1709, 41328, -229648, -83799, 30085, 67306, 57764, 138698, 160118, 138268, 230474, 126495, -731, 93235, 200717, 89351, -139129, -21671, 229407, 297011, 260388, 11393, 32151, -85735, -275687, -80147, 254672, 203488, 177457, 188965, 97612, -11786, -40145, -45885, 31593, -38737, -75162, -93358, 150935, 284593, 200059, 34334, 65846, 159753, 63619, 7601, 64932, 311975, 590486, 495518, 390285, 90700, -32321, 39557, 123857, 272139, 23022]
16032B3022K4633M25j51328K5454M7580K67333j22652j67893N2287K70897J29100
16021C98858k37956m42255k95093K35700K35364J34387N0292R9801p8163K39137
16011C40072J68015Q4871k24017l22839k23031j40922J29489J40334k4934j10161
16001a83123J4313J17290n574J59537P2015q2469j19613j68755p1189n4232J54881
15990a66919J80752l9714m1669M6364L1712l5290K73749K63605M4751j80080j11818
15979B65443p7564N0646j92987J5277O459K7084K03979K97812J90803N0335k9784
15968H07503j69876Q3576k04667r7906L5525j97626J13344P4599j21002l24800
15958a330j20150O2794P8941k9494J42318l667m2155k79083K4889j38595K23061
$$ y = [23022, 47655, 48080, -103248, -77794, -30214, 237119, 114467, -53426, -1139, 269758, 398858, 160902, -281353, -576446, -340746, -105382, 29005, 79297, 179098, 100935, 340072, 508087, 592958, 368941, 46102, -176929, -317851, -188362, -48028, -72962, -183123, -168810, -51520, -57094, 102443, 174458, 91989, -27624, -196379, -267568, -321800, -166919, 13833, -25881, -67550, -21186, 10526, -24764, 248985, 512590, 557341, 377261, 265443, 187879, 238525, 45538, 60815, 67274, 94358, 298337, 596149, 786952, 837287, 807503, 637627, 721203, 516536, 418630, 454155, 256529, 369873, 444472, 323470, -1330, -121480, -58686, 20255, -9239, 133079, 129412, 87257, -191826, -166937, -305532, -82471]
15947h2471K55716j12913O6494R4266R2669j0702j34300j78993j13714J07915
15937a6033L2788J53825J45630j9211M7069k02229l50218P6719J78186m1560K2980
15926B7946L7373J19387L10084j82268k62939j25085k21597M9924J42736J64675
15916F0236l4110k6126n3029J49130L4211j03038q4012J24264m0328k20227J2703
15905a80326P4725k9865j09287m3041R8047j3556K70804K11599n5404j57353Q0680
15894A47023J9257p799j50095M9588J93956J04509j8808j65557j75274n3442j93634
15883b50276J37996J62399O2938n503m62433O9098J69841l18186Q344Q6529Q1281
15872b57972k2705n8744j8204L50760J00585l255J8678J6547j72435m3296m8939
$$ y = [-82471, 173245, 60332, 126826, 221092, 313761, 303059, 168759, -10234, -123948, -16033, 16755, 170580, 316210, 296999, 344068, 141839, -208379, -131660, 46526, 4966, 27946, 65319, 184706, 494790, 312522, 49583, -75502, -297099, -247175, -104439, 60236, 26126, 0, -53029, 96101, 130312, 27274, -56738, 67526, 27198, -193029, -180326, -105601, -135466, -244753, -287794, -189747, -203303, 67501, 279100, 223696, 66343, 147023, 166280, 158481, 8386, 57974, 251930, 356439, 337631, 172074, -3200, -56642, -250276, -112280, 50119, 113057, 107554, -354879, -285781, -115940, -434126, -425782, -339253, -257972, -280677, -339421, -357625, -6865, 93720, 90465, 109143, 125690, -46745, -90041, -138980]
15861a38980k7646J65836L2550R440P4563M9034j32979N7815K06644k84536r1253
15850g9512J07208L2008j44591k23066m2825J37279J59892r4286n9333L97744
15840A90518J94441l09347r1793J64881j3327J27950j65429k68044k95420N2847
15830d12723L4389L20197L56954Q0191j82259R6097K1722j63540r8134m1997k30115
15819b19218l31312r3597K37415J5251J13120K9561L039N3615K15693K26539J13643
15808C63749k65666j65981J87988K26556j88138k05997J264J37672j20769J22914
15798I3592Q1943p9396L1574n7472L430O8572l0432k16633l5971K71656r8152
15787C2711j96152L41075J72086j44031p2437l9120m3506j4647K2651J76655N9453
$$ y = [-138980, -166626, -790, 31760, 41200, 115763, 164797, 31818, 89633, 296277, 11741, -79512, 27696, 59704, -84887, -307953, -350778, -213499, -53607, -147893, -207226, 190518, 384959, 75612, -16181, 148700, 135373, 263323, 97894, -170150, -465570, -412723, -378334, -58137, 298817, 379008, 196749, 292846, 314568, 151028, 52894, 10897, -219218, -550530, -644127, -406712, -391461, -278341, -248780, -245741, -192126, 23567, 250106, 363749, 98083, -67898, 120090, 346646, 158508, -47489, -46225, 91447, -29322, 93592, 175535, 96139, 127713, 70241, 73671, 142243, 111811, -104822, -140793, 130863, 32711, -163441, 177634, 349720, 205689, 133252, 94132, 50626, 35979, 58630, 235285, 294738]
15776B94738j53039m1710Q2152J49811Q4693l08558M0919q2537K3390J5554k09474
15765a04061j00616J47722N6233l7090K58574P1453k66859J8595p7158j77100
15755b10307L0405J98790J75367n170l7924j65766q0572L3966J11475Q761l7840
15744B1185O3317j39300j33619R3257r7210o1149j21144J98715J85927j21720
15734a11741Q7982P7957J24388l4721o0017Q2053R5676N9115k22741j1158J38814
15723B25607o9974j6854k55794L9958R3756n7686q1098K5052j00195p7200Q3404
15712a91024J2836K18845J16831J65137j41072k17357J82557p5464l44281J17458
15702a55534J91096J08923Q4371J34708k12122m38809j72363L9853K02154L00109
$$ y = [294738, 141699, 99989, 182141, 331952, 416645, 108087, 149006, 66469, 89859, 105413, -104061, -204677, -56955, -722, -37812, 220762, 292215, 25356, 43951, -33207, -210307, -179902, 18888, 194255, 189085, 151161, -14605, -95177, -61211, 50264, 59025, 21185, 84502, -54798, -188417, -95160, -192370, -253519, -374663, -175948, 9979, -111741, -23759, 54198, 178586, 143865, 83848, 165901, 261577, 320692, 97951, 86793, 225607, 155633, 138779, -117015, -77057, 16699, -40987, -122085, -97033, -197228, -274428, -191024, -178188, 40657, 157488, 322625, 181553, -35804, 146753, 71289, -272992, -155534, 35562, 144485, 228856, 363564, 151442, -287367, -459730, -419877, -217723, 82386]
15692H2386N9427M0760l0082j75226l4859j6675J26705N7250k97821k43073L8667
15681c92541J36520J45208q8135o0328J62750K57310j49671j43598m2656J02360
15671g2781R1926k2343j48162l6700L2263r2003k22001p926O5961J54223p7426
15660c34969j59245J15085o5440p7827J06009K16687p6467Q0490L75564R1292
15650B71179k5140j79667k44650p1027J10345N8370l5766j56557J28253j7082
15640a61742r36Q1198J5256M8450J30030J25632P8469l9429j89697j81730k31590
15629c26089K04368L00802N3312j96468l69262l19505L9242J95381J15251R0607
15619b12361O3101J06467J08477K04699J0573o7477m7999m3498j66762j68445
$$ y = [82386, 141813, 182573, 152491, -22735, -57594, -74269, 52436, 109686, -188135, -431208, -392541, -256021, -110813, -198948, -259276, -96526, 160784, 11113, -132485, -175141, -72781, 19145, -3198, -151360, -188060, -155797, -247800, -469801, -477727, -411766, -257543, -334969, -494214, -379129, -444569, -522396, -416387, -199700, -276167, -195677, 179887, 271179, 246039, 66372, -178278, -249305, -138960, -80590, -116356, -272913, -144660, -161742, -162678, -81480, -66224, -17774, 112256, 237888, 316357, 276928, 87231, -94499, -326089, -121721, 179081, 232393, 35925, -333337, -652842, -613600, -418219, -302968, -212361, -149260, -42793, 65684, 270383, 280956, 213479, 165480, 121982, -44780, -213225]
15609b13225k9584j63883q4562J84289M15521K55012P5463j58633j83788L0511
15599A27121j19999p2418o2128Q628J56950J88186j93016j92899j00011o5497
15589c25083K5702J24437K06023P8480J86634k45084l87764p4649o6285J58808
15579c18781P3727O6700N9074J39890m3486j62571j260L22483J69220j20664J1924
15568A96256O7700o2982m4209j12887J37139P377J02923J76847J8046n1454j37533
15557B97223k06341j08652j15940j7467r543J4342J30781Q1784l06924l66724
15547f07461M924L88985K68716J18733J89880L5294j10638n3403r5378n1867k4050
15536F3735o2034j421r2731P6088k6370j60085Q899p5584Q9378R9494J48929J00351
$$ y = [-213225, -242809, -406692, -491254, -306965, 108556, 363568, 439031, 280398, 96610, 127121, 7122, -65296, -127424, -118796, 38154, 226340, 33324, -159575, -259586, -325083, -299381, -174944, 31079, 109559, 296193, 51109, -336655, -411304, -477589, -318781, -245054, -178354, -119280, 20610, -22876, -185447, -186707, 135776, 304996, 184332, 196256, 263956, 200974, 156765, 43878, 181017, 188394, 291317, 468164, 486210, 434756, 297223, 90882, -17770, -133710, -151177, -160720, -146378, -15597, 66187, -240737, -607461, -602537, -213552, 55164, 173897, 363777, 399071, 288433, 235030, 139652, 87785, 63735, 1701, 280, -92451, -16363, -42733, -202818, -193919, -269503, -180125, -80631, 68298, 168649]
15524A68649R6086j88296j08575n5075k94162K75236L48565J14998k33196K9562
15514A53792m8947k42586Q8698K26434p6628N2498l03241k15686q5048R7739N3188
15503b99787O4488R3062k96956m241K35613O2643J21760Q2846l02676J73656J2429
15492e7163q3528L02991J34100J93244j94221j81967J07088J9655J30372j7867
15482C52704k47486J26436N5450k21039n3917J41970J12544j3758j46932r6975
15472H997j67454r5999J63825M6041j63234M3503n754j17971j09823J39826J06243
15461a51800J09821j15214R8966J66766j81214j1923P10k2896j67268l43163J24670
15450d92545J53993j66825L6872O9585J47509K44758K26162J16585k3172j89815
$$ y = [168649, 264735, 76439, -32136, -87211, -381373, -106137, 242428, 357426, 124230, 153792, 104845, -137741, -49043, 177391, 100763, 153261, -149980, -365666, -450714, -352975, -299787, -235299, -142237, -439193, -443434, -207821, -145178, -23418, 59428, -243248, -69592, -57163, -140691, 162300, 296400, 489644, 295423, 113456, 220544, 240199, 370571, 352704, 105218, 231654, 287104, 66065, 12148, 154118, 266662, 252904, 105972, 8997, -158457, -254456, -90631, -44590, -207824, -164321, -170075, -288046, -397869, -258043, -151800, -41979, -157193, -58227, 108539, -72675, -84598, -83888, -106784, -274052, -617215, -492545, -338552, -505377, -468505, -398920, -251411, -6653, 219509, 336094, 312922, 123107]
15440A23107j54443l56927J50056J01583J27874o335j9792j83133k4785J60292
15430h2503L93612l8528p9987j76950M8592l8034k76385n5702L56255Q3722J06439
15419B40531m3919k97010P4645j16003Q0676K56158q5325k86653j40662Q8285
15409b29277J14648n5577m6289n9220R6757J40647l0161j69533j56436K82467
15399a11974K76005j76683l41524j22504J25182P8962K66768L9327L3191l46158
15389b79408j37472J94001K87110R464k02387k34875J26405J49742K33125j34703
15379A1002j47179j6336M0256L8388m9031j02674M52835J11731k45886j13800
15369b0694j1094J6198K76488j32366j07841l8701r5146r375J13427J30693j9260
$$ y = [123107, -31336, -388263, -238207, -136624, -8750, -15085, -34877, -218010, -242795, -82503, 311109, 272581, 192594, 15644, 64236, 26202, -250183, -305885, 50370, 134092, 240531, 196612, -100398, -25753, -141756, -61080, 195078, 109753, -176900, -317562, -229277, -114629, -170206, -216495, -275715, -178958, -38311, -68472, -238005, -394441, -111974, 164031, -12652, -354176, -476680, -351498, -272536, -5768, 33559, 66750, -279408, -416880, -222879, 64231, 73695, -128692, -363567, -237162, -87420, 145705, 11002, -136177, -152513, -112257, -73869, -122900, -225574, 227261, 338992, 93106, -20694, -31788, -15590, 260898, 128532, 20691, -18010, -113156, -122531, -9104, 121589, 102329]
15358A02329P3055J30495J31486R1750j8785k67791j69559j04009K53353j21797
15348A00527j32359m1524R1639P1481o3986K368J63979j4787J24278J4080J13422
15337D29118k22313j75443J16754L06373O9830k85529j14761K3941j48872j23290
15327a24192O4311J5043o0216q5092J39660J94046N4936K3744J14246K88606K1715
15316F46807j90442k3664k02813j58410k51814j82799P7949L33845r6809o974
15306e5124K70732j90804j09000k2062J08856m1910l4920m4229J38598J33844
15296A53981M9691n3018K05530O2306k09244k59702k1185J76350K44088j20141
15286B28656L7748L8938R2604J34078j11168o089k65447k12855o182J42226J08355
$$ y = [102329, 175384, 305879, 437365, 529115, 510330, 242539, 72980, -31029, 222324, 100527, -31832, -73356, 18283, 89764, 25778, 28146, 192125, 177338, 301616, 315696, 429118, 206805, 31362, 148116, 454489, 524319, 238790, 124029, 147970, -902, -124192, -59881, -44838, -105054, -190146, -50486, 143560, 198496, 222240, 336486, 625092, 646807, 456365, 432701, 229888, 71478, -180336, -363135, -285186, 48659, -48150, -55124, 215608, 24804, -84196, -106258, 2598, -39312, -74232, -118461, 20137, 153981, 203672, 150654, 356184, 418490, 209246, -50456, -71641, 104709, 348797, 228656, 266404, 305342, 397946, 532024, 420856, 414767, 149320, -63535, -69717, 72509, 180864]
15275A80864J3706J19899n3391K6340l26456j87612K13893l5249j59996q7154
15265b95156j39921R1167J72991K7626J7455P764K24887N9028L6093M5656m9620
15254A97970k59604K5015J23304M8801J39087l3904j38877o4645r256K8843o8043
15243a1309R9908r2916o2905j61176j918N1665R8773q2132j27240j91861J99131
15232b81980J75659M5468P9718J12610p9035k09263J04051j38874M0777K4147
15222a26722l8137k60238k57797K44535M53773J25753o9119L9242O1068N1402
15212B23760p2735M6423J81764n6470j76287l04208L5799K38056k2998M9669J374
15201A44147K4283k60557L11433M7086r2169j57548L8516J21735p0326j7134J61270
$$ y = [180864, 194570, 314469, 261078, 287418, -39038, -226650, -12757, -48006, -208002, -295156, -435077, -343910, -170919, -143293, -125838, -118074, 106813, 165841, 201934, 247590, 197970, -61634, -36619, 86685, 135486, 274573, 240669, 101792, 37147, 27891, 56734, -11309, 88599, -4317, -67222, -228398, -230316, -178651, -79878, -162010, -289250, -481111, -281980, -106321, -60853, 18865, 131475, 52440, -156823, -52772, -191646, -150869, -126722, -164859, -425097, -682894, -438359, 15414, 141167, 72048, 111290, 172358, 223760, 151025, 197448, 379212, 322742, 146455, -157753, -121954, 116102, 93104, 142773, 144147, 168430, -92127, 219306, 266392, 174223, 16675, 55191, 176926, 106600, 89466, 250736]
15190B50736j5893j23511k11415j33853L7398J2452m8056k19970m1212J31886
15180c61438p9472q5015J14990K31097n0578j19653J73045J94822Q568j11930
15170h5564j23072j43911k74798L63308J55763j20702j5000J22559p5883O7898
15160a29402O4148n495r3399J4312L7325p2956J23272q1259N8721O8173p6750
15149i3310J60323M7612q2556J78741P4579k45589J23971j13252K3598J32060
15139B06177k5168l26028P6471j26885r3980j38812J05971J02345k1192R3953
15129a47148J39967n4258J68937J90475J20433k9332k42013k83677r1337K732
15119b25221q0789K829R4554K39813J73976j25992j02737p7o4838l14302k20431
$$ y = [250736, 234843, 111332, -100083, -233936, -196538, -184086, -232142, -452112, -493324, -361438, -440910, -525925, -410935, -179838, -230416, -350069, -177024, 17798, 26366, -85564, -208636, -352547, -627345, -264037, -108274, -228976, -243976, -121417, -197300, -129402, -65254, -70749, -164148, -149836, -112511, -185467, -62195, -143454, -84733, -16560, -93310, 67013, 114625, 32069, 210810, 285389, 39800, 163771, 50519, 74117, 206177, 181009, -145019, -68548, -195433, -289413, -428225, -322254, -219909, -241101, -147148, -7181, -61439, 107498, 297973, 418406, 389074, 147061, -136616, -227953, -225221, -306010, -303181, -208627, 31186, 205162, 79170, -23567, -23644, -88482, -402784, -623215]
15108f23215J74446J73422O6577m6978K23014K90792J46523L9494k36920j62486
15098D4669p6769q6782J26635J90431N8254l06630k19544K26005Q9425j39931
15088i4237j56852J94942J37599p6436j28137o472J06502j6682O3833J15218r6489
15077D2789k70977p5794K57650J35351l7577M6302j95059J10602J87462M3198
15067B43947J4261k14786j23586J21541P0266K5466j28535j33875J03039J61288
15057A39026o829j2100o9605J0208N6601k8569Q0581m0577j90100j24990J49554
15046c6800K50018K29084j4003N0159K5540l75506O1616K70313J50918p8181j59686
15035C73472l82810n3281P3313P0016j19882k260J4037J5879k2451M5861l914
$$ y = [-623215, -448769, -275347, -208770, -255748, -32734, 258058, 404581, 444075, 207155, 44669, -32100, -118882, 7753, 198184, 256438, -50192, -269736, -43731, 45694, -94237, -251089, -56147, 81452, 5016, -123121, -129593, -23091, -39773, 24060, 139278, 42789, -228188, -303982, -46332, 89019, 51442, 97744, -97315, 13287, 200749, 243947, 258208, 43422, -80164, 41377, 111643, 137109, 8574, -125301, -22262, 139026, 132197, 120097, 50492, 60700, 117301, 88732, 169313, 128736, -61364, -186354, -36800, 213218, 442302, 428299, 478458, 503998, 128492, 190108, 460421, 611339, 533158, 373472, -9338, -62619, 10694, 80710, -39172, -41432, -27395, -11516, -33967, 11894, 7980]
15024G980J58373L9328r0713n5695J25719Q5478n698j71938j41153K94201m095
15013B41787j16597Q5916j3942K5730J04451l8874k19263o9188M4104q456O9416
15002A05084J04003k3842m2016M0902k4498j42674K93233J21758j33408j79370
14992A19172j72638j56457j6151J15064J5246l6596O1954K44143k56318j08394
14982a90975j78079j87864K35386Q7748j3023Q4810K74929J33895j96449k85546
14972b35168j34949K56965J51437O5967K01192m9832o0387k87781q6059j12195
14962b90810K76052J51783k8047L2010j16166k3622p2984j74251J61059K86974
14952B01998K5768K14881m0233j28288k435N7466j18460k45564R5552L7042k6092
$$ y = [7980, 166353, 205681, 114968, 59273, 184992, 270470, 264772, 92834, -48319, 245882, 241787, 125190, 211106, 197164, 222894, 327345, 288471, 69208, 20, 44124, 35668, 105084, 209087, 185245, 143229, 184131, 159633, 16959, 310192, 431950, 298542, 119172, -53466, -209923, -226074, -111010, -95764, -132360, -70406, 173737, -82581, -190975, -369054, -556918, -321532, -233784, -246807, -161997, 112932, 246827, 50378, -235168, -370117, -113152, 38285, 104252, 305444, 255612, 195225, -92556, -178615, -290810, -14758, 137025, 108978, 140988, 24822, 1200, -71784, -246035, -84976, 201998, 227766, 442647, 402414, 274126, 271691, 329157, 210697, -34867, 60685, 97727, 71635]
14941G1635k4220N5740q7672j17541L0814O1839J58344j78260k62899j84836J79461
14930b97595J85239N0320o6232P5921J06693k61522M2900P2424Q0492m7116q2886
14919a41362n8173j32803P593M75581J02445J31455j1321k25331N9777j93401
14909A4460o2644j23415J26013M2515l7562K51357R5502j1959o541m6949r5398
14898A45379k99824p2417J03872J13672K3132M6638O7932J54021j29758j72324
14888a9677J4633j99161o8832O044L7149j8462J58595N9800j93022n5370L26084
14877D7781J82796J20473k58626j36346Q2022L9508l875J9594J60929J13900Q8214
14866D56370q7635J5519r958j60109j1762L38550l3183j68926j40414k65023k05055
$$ y = [71635, 47415, 103155, 15483, -102058, -71244, -9405, 148939, -29321, -292220, -477056, -297595, -112356, -62036, -128268, -52347, 54346, -207176, -164276, -91852, -11360, -58476, -141362, -199535, -332338, -324745, 150836, 253281, 384736, 373415, 148084, 207861, 14460, -48184, -171599, -45586, -3071, -40633, 210724, 306226, 294267, 287726, 240777, 145379, -154445, -226862, -122990, -9318, 13814, 60452, 128384, 282405, 152647, -19677, -5044, -204205, -273037, -266993, -229844, -248306, -89711, -29911, -222933, -278303, 47781, 230577, 351050, 92424, -43922, 38100, 77608, 73733, 93327, 254256, 368156, 456370, 368735, 384254, 374296, 214187, 202425, 540975, 507792, 338866, 198452, -66571, -271626]
14855b71626K1078J97708J78727K28550J52511m954l18202j31128j79196J06469
14845b0063j4539M00186n175j8442J99961j68971k70804j99884K51K60673r8762
14834F4431j76126p0440R3839j9526N2421P8250j49399j518J90034K2499j549
14823H2916p8001K373J60817k95928l11491J30721J44283J25332n5584j23934
14813b18496o2732J32665J0533q1983L06994K69422k71775k0987J52052K6990
14803B42683R6328j36874k95898l9929J04678J19691K8204J23117J918j90836
14793E3082j59686N1873O8378P9074l24873Q6575k73991J0254K5007k18783o2718
14782f65808Q4092K17931L5441l6251J66698L3125N7680P8316j65470j71004j49273
$$ y = [-271626, -250548, -52840, 125887, 354437, 506948, 501994, 183792, 52664, -126532, -20063, -34602, 365584, 360409, 341967, 541928, 372957, 102153, -97731, -97480, 163193, 64431, -111695, -182135, -88296, -107822, -55401, 22849, -126550, -128068, 61966, 84465, 82916, 4915, 7288, 168105, -127823, -439314, -308593, -164310, -38978, -94562, -218496, -281228, -148563, -138030, -220013, 86981, 356403, 84628, 63641, 215693, 242683, 339011, 202137, -93761, -133690, -29012, 90679, 118883, 242000, 243918, 53082, -106604, -54731, 13647, 92721, -232152, -145577, -419568, -409314, -384307, -603090, -665808, -581716, -363785, -328344, -364595, -197897, -164772, -107092, -28776, -194246, -365250, -514523]
14771e14523J07086r6061k25582J48546Q5575J72269m0608Q0339K84860p300o2724
14760f8123J28661J93969j19340k51443j37093J16525J6900p030L8252J47767
14750E9045j15624r2271P2933j31039q4869J32789O7047P4246k08969R0143J52647
14739A6078j59845J67595K27354J68619j74380j04687J33620j30463j21126J14210
14729A36975j67604Q0370m3714j46652J2129J37689Q9735m4287j5628j04090M9794
14718a5283j05608J193J35691K99536J93032k60774j40827k9480L7414m859J35001
14707B45036J80664q5447l14831k13988l4347N3444J25213N7779j17958l03153
14697d07588j6466K06664K65627J14255N2587p041o8171N1132m1826j80620M0287
$$ y = [-514523, -407437, -503498, -729080, -580534, -494959, -322690, -363298, -282959, 1901, -5399, -68123, 60538, 254507, 135167, -116276, -253369, -136844, -119944, -126974, -88722, 59045, -56579, -148850, -75917, -206956, -291825, -159036, -91989, -17743, -226712, -136569, 16078, -143767, 23828, 251182, 419801, 245421, 140734, 274354, 143891, 22765, 136975, -30629, 49741, 6027, -140625, -128496, 9193, 98928, 54641, 39013, -65077, -15283, -120891, -119698, 15993, 315529, 508561, 247787, 106960, 77480, 114894, 110035, 245036, 425700, 340253, 25422, -188566, -222913, -169469, -44256, 13523, -104435, -407588, -424054, -217390, 48237, 162492, 215079, 208038, 139867, 190999, 149173, -31447, 8840]
14686H840J13226J67985j31497j78078J62289J44534j2181j01113j48610R3246
14676A18641N1975J38841j54200J42021m0584P1141l2638j32548j22505j08082
14666f7938k4893O4909L01449K7648p6166L2755k7181k46391k9482j2404o5666
14655a23360J10936L8193j10253r1118r4950K71147K42199K87814K1374k09110
14645C42872o1576j52311J6244l20819J2010J91176J57588J80097M1313m4260
14635C62334j77288k12255J7288J67991Q8901k31371L00292k5166j67872r5647
14625B7207r4222J61234j69747q9846M4712p5035j43959K09070K09534q4759j24587
14614a30398o0336L26713L0631p4576K4187j97257J89472J00125j98606l126q8255
$$ y = [8840, 122066, 290051, 158554, -19524, 142765, 287299, 275118, 174005, 25395, 118641, 170616, 309457, 155257, 297278, 256694, 327835, 295197, 162649, 40144, -67938, -92831, -27922, 273527, 301175, 225009, 257764, 230583, -15808, -45290, -57694, -123360, -12424, 25769, -84484, -175602, -270552, 595, 242794, 530608, 551982, 342872, 281296, 128985, 145229, -175590, -163580, 27596, 185184, 365281, 406594, 362334, 185046, -27209, -9921, 158070, 246971, 15600, 315892, 290726, 122854, 27207, -67015, 94219, -75528, -165374, -120662, -195697, -339656, -130586, 78948, -5811, -130398, -190734, 135979, 166610, 92034, 116221, -81036, 108436, 208561, 9955, 6829, -81426]
14603h1426j11527J58817m0896M67r945J49155L2783j00618j61874M6998J147
14592a16919k5892J93210n3998M1330k9140J90896m1793N5371N3730l68149j80411
14581b81765P3011r2900K68888K39159k49515p2916K14378q6411o3824j50780
14571b02675j08414r6861J26113L34333K28078K9455l8129n4345R268Q7303k8123
14560B86003J1230j59230P0130J6686k94174k50621j33571N2716N0442q1199q621
14549d40209K70607J41290k2155J35325J06577k09796l72495p3241J54701J90149
14539a19247j26432n3343J86165P0981Q6513K02229j26789j63790O5318o969j33290
14528a18654k9795n322l9215Q6347K41988p1660l36541l09865l9538K95554K28263
$$ y = [-81426, -192953, -34136, -75032, -74565, -84510, 64645, 97428, -3190, -165064, -118066, -116919, -142811, 50399, -3599, 37731, 8591, 199487, 157694, 213065, 266795, -101354, -281765, -208754, -301654, -32766, 206393, -43122, -116038, 98340, 11929, -51895, -202675, -311089, -407950, -281837, 52496, 280574, 310029, 271900, 217555, 226823, 314126, 286003, 297233, 138003, 208133, 224819, -69355, -319976, -453547, -400831, -350389, -431588, -440209, -169602, -28312, -50467, 84858, 191435, -18361, -390856, -464097, -309396, -119247, -245679, -299022, -112857, -41876, 44637, 246866, 120077, -43713, 21605, 14636, -118654, -148449, -153771, -192986, -106639, 135349, 63689, -272852, -582717, -622255, -326701, -98438]
14517i8438O4990J4123n1564j09600k6909Q4302j2927J87981j4207m887j42194
14506a09330k48489n810K7963J21208p2467L4085K25289K37782k29621j01721
14496a21111K85714L17427J57502J3271r0387J29025n1027j38621k047j93305
14486C06441q0911J83581J16239k15110j96037K9800L45724j93187q0221J93876
14476D10195l92689k81782j37733R0905J4683J19297K05790j39978O5297m859
14466e0874l17219j08532J77438J67502K84260j35084l01690K72933K17726n8140
14456A48320m58081j15522M17153J51164n3113J08122J74552j60857k19098l04003
14446c11363J72438J80393J12649j3101K23658k07449k16513j4565R3647O4147
$$ y = [-98438, -33448, -19325, -70889, -180489, -207398, -123096, -136023, 51958, 37751, 32864, -109330, -357819, -363629, -335666, -214458, -286925, -252840, -27551, 210231, -19390, -121111, 164603, 482030, 639532, 652803, 562416, 691441, 640414, 501793, 499746, 306441, 225530, 409111, 525350, 310240, 114203, 144003, 489727, 296540, 216319, 410195, 17506, -264276, -402009, -311104, -296421, -177124, 28666, -111312, -46015, -50874, -368093, -476625, -299187, -131685, 152575, 17491, -284199, -11266, 206460, 148320, -309761, -425283, -8130, 143034, 89921, 198043, 372595, 211738, -7360, -311363, -138925, 41468, 154117, 141016, 364674, 157225, -59288, -73853, 19794, 83941]
14436H3941N1440J4472J07719K9716K8516j07530j12431J06780j94403j21976
14426a13756j45467J3003j2096K58182J89104M8513j53523j01434J26214O1744
14416A70484J34218R7063P8210m24100k04438n29l8161k87334K36294O1949k4980
14405b01324R9337J59919j79257o2542N6661j71139M1179J72845J40627L5845
14395I2151J70941P6676p3185k65974j83719L9773K68938J05206j06503n06091
14385c81787j26262L70064J86370k29810R1843J38432R7124l9761j77032K708
14375f8111R5269l8743p8569O5250J7234m5310k1775j56166p9844p7902N8776
14364c29891J0745N0411K49620Q1946o7326j89534J66133J12916j51252k25884
$$ y = [83941, 135381, 149853, 257572, 287288, 315804, 208274, 95843, 202623, 8220, -113756, -259223, -246220, -258316, -134, 188970, 237483, 83960, -17474, 108740, 170484, 304702, 401765, 479975, 55875, -148563, -149092, -187253, -474587, -238293, -176344, -201324, -101987, 57932, -121325, -183867, -127206, -298345, -257166, -84321, 56306, 92151, 263092, 339768, 266583, 609, -183110, -143337, 125601, 230807, 124304, -381787, -508049, -137985, 48385, -181425, -89582, 48850, 145974, 106213, -70819, -68111, 27158, -11585, -90154, -24904, -7670, -52980, -74755, -230921, -310765, -388667, -329891, -319146, -268735, -19115, 62831, -4495, -194029, -27896, 85020, -66232, -292116]
14354b92116j76198l346K00629K43915P1331j78321o1573J61313J26248n3285
14344C8597R350L8626j6320l39872j28639K18790K58745k70222m4776J3854j74282
14333c96149o036Q9668J70411J17021P8848N2029j51182M4536J44109j65811O9656
14322D7100J04192L56r8535j60593r434J18586K8534q4590R1116K88774K12723
14311E38229j74876k71522J47081j38258j10298q736k08452K6180l2715q0197
14301c13564q8833O9516K17998j7761K52516L13998p9534k39509n3068j7629k58999
14290b14869K80550K22478p4749r6524J27221L5249L3867k96728n8953j08646
14280a51104K47404J80297O6322j28280j55318J14324p754l38104M0523J06491
$$ y = [-292116, -468314, -471660, -271031, -27116, 44215, -134106, -195679, -34366, 91882, 38597, 47947, 86573, 70253, -269619, -398258, -179468, 79277, -190945, -235721, -221867, -396149, -402185, -312517, -142106, -25085, 53763, 105792, -45390, -854, 143255, -22556, 47100, 151292, 151648, 53113, -107480, -116914, 1672, 30206, -54384, 36732, 325506, 538229, 363353, 91831, 238912, 100654, -9644, -18380, -226832, -200652, -233367, -313564, -402397, -332881, -114883, -132644, 119872, 433870, 354336, 114827, 61759, 44130, -214869, 65681, 288159, 213410, 116886, 244107, 279356, 313223, 16495, -42458, -151104, 96300, 276597, 342919, 214639, 59321, 173645, 165891, -172213, -131690, -25199]
14270b5199J2112k26957L0838j68214l5168J91787L0128j9412K36332J93090k02431
14259A6906R9089M1066j91358m1007j00948j00066k2877p3488L28276L51701o1522
14248B45772k58344l37903r404N8558N5900K23672p4527K8276J70583k14200n2277
14237a63894j43171P1020M5636J60998J08185L8212Q0844J36991j56343J9471
14227A97949J91921j89445j76999J35061J24617j12385j80590J83468J21980o7894
14217B27683k90208o9912R9794J08832j10869j15717J95225O5527k51022j77648
14207c18315J28251J93908j59897q9079j42467P0943K63420Q4734J28972l7339
14197A23131k13868O4744J57356K37778k2898J86818j52991p5075J13990m5710
$$ y = [-25199, -13087, -240044, -209206, -377420, -412588, -220801, -190673, -210085, 26247, 219337, 16906, 115995, 157061, -34297, -75304, -176252, -276318, -299195, -372683, -44407, 307294, 245772, -12572, -350475, -359879, -301321, -245421, -21749, -96276, -68000, 102583, -111617, -163894, -307065, -236045, -190409, -29411, 78774, 116986, 197830, 334821, 178478, 197949, 389870, 200425, 23426, 158487, 283104, 170719, -9871, 173597, 295577, 227683, -62525, -132437, -32643, 76189, -34680, -150397, 44828, 110355, -140667, -318315, -190064, 3844, -156053, -245132, -387599, -316656, -53236, 31498, 160470, 123131, -90737, -25993, 131363, 369141, 346243, 533061, 380070, 304995, 418985, 373275]
14187C73275l75918j82229J44462n6457k22326J01043M3088o5999n0658R9507
14177a92212O5815k37113j65389l539J08426j668k39494J88398K98573L3382J40741
14166d080P0948R0674M6855q8946l31840k53872o4050L70547M5947k294J51017
14155C0906J46312j6198j47232p8899q7215j426J38207J09320n0265l3216N5350
14144F5644J34085l5757K5368K427j31836j33982m0476J09143J84190Q3941J04733
14133C67480l55L0170k9278q0745o5825j87033J17256j09453K7211m8471k19548
14122a98591M7180J13235N4899K17917j86195n3983j53474R7777Q7891P0085j0517
14111H6224k21195L3574j4243J67676J79579j55257j75693j4638J96731K64339
$$ y = [373275, -2643, -184872, -40410, -96867, -319193, -218150, -175062, -241061, -291719, -192212, -126397, -363510, -528899, -532438, -424012, -425680, -665174, -476776, -178203, -144821, -4080, 66868, 157542, 204397, 115451, -216389, -470261, -534311, -163764, -117817, -120111, 30906, 177218, 161020, 13788, -65111, -152326, -153752, -15545, 93775, 43510, 10294, 65644, 199729, 163972, 189340, 191767, 59931, -74051, -114527, -5384, 178806, 262747, 367480, 367125, 397295, 368017, 287272, 221447, 34414, 151670, 42217, 69428, 20957, -198591, -151411, -38176, 16723, 234640, 48445, -5538, -159012, -61235, 26656, 96741, 86224, -134971, -101397, -115640, 52036, 231615, 76358, -99335, -113973, 82758, 347097]
14101C47097j86363l47816N5373K63036J17167j59406m61939K2988K14488K48538
14091A13163M7628j06698r6929J5560r4049Q5181J16569j713r6696L4852M5591
14080F2459k2461o706P2755q9370j16152k17299j30437N8552J87050n6204J53524
14069a04289l4729L9876J25290j67376Q0524J73566R8321m2171J99029j06179
14059B61862r4011M4750J94519j72874n2455O6602J38661K4524k3792j88216r5939
14048A03631j32235k6034O8281q5101k25844k9390J36748r5415j17519j3632J03586
14037c12924p8457k52660J23945L88229L1228k34653k9490J80626K72625J39841
14027B28310r2999j78520O549k02933P4164K02757J73849P8297k36726m6975K19512
$$ y = [347097, 160734, -187082, -131709, 131327, 248494, 89088, -372851, -349863, -135375, 113163, 160791, 54093, -42836, -27276, -121325, -36144, 80425, 78712, -17984, 16868, 62459, 39998, 33292, 106047, 16677, -99475, -316774, -447211, -388659, -201609, -257813, -104289, -139018, -99142, 26148, -141228, -60704, 112862, 211183, 169012, 368041, 261862, 167851, 212601, 407120, 234246, 181791, 248393, 387054, 411578, 387786, 199570, 103631, -28604, -54638, 13643, -71458, -297302, -326692, -189944, -285359, -402878, -416510, -312924, -391381, -644041, -520096, -131867, -100639, -335292, -364782, -184156, 88469, 228310, 135311, -43209, -36660, -239593, -165429, 37328, 211177, 289474, 52748, 5773, 225285]
14016B25285j96624K0699l50726L7249K73428J5403J48502L4201j11590J80450
14006B76277j66Q968J92285R1868k34105j96214j13832K372J37084K63354k24935
13995B02956l67430K7278J74334J87202j65232N0128j92683j74938N0351l2832
13985b40866P8058K21210K7467J26261O3179k15149j70673q070K9552J16310J27543
13974A54822m1637L3185J20321j53953j22506M9540J66303J72772j46328J7995
13964B50514j34764J8028l2588L5285J5268p1673j5440n087j76773j34231J17116
13953a34345O9827K38986n563Q9052j74860k96220M58870J56800k37768j48969
13943A5810q617j3497Q9341j57075K50670L2781r2505j77599L554O098l7379j55010
$$ y = [225285, 28661, 49360, -301366, -264117, 9311, 24714, 173216, 207417, 95827, 276277, 276111, 285079, 477364, 569232, 335127, 138913, 25081, 27453, 164537, 427891, 202956, -164474, -137196, 37138, 224340, 59108, 109236, -83447, -258385, -208034, -240866, -162808, 58402, 85869, 212130, 275309, 60160, -110513, -118583, -89031, 27279, 154822, 113185, 146370, 266691, 112738, -9768, 39772, 206075, 378847, 232519, 250514, 115750, 133778, 101190, 136475, 151743, 80070, 64630, 59543, -117230, -251461, -134345, -64518, 174468, 168905, 257957, 83097, -213123, 245747, 402547, 164779, 15810, 7193, -6304, 83037, -74038, 176632, 209413, 116908, -60691, -57137, -51039, -88418, -243428]
13931b43428J34882L4389l35389P4188J90372J30485k69568Q4151L23586K45251
13921C68919k8751q1161j06076j66300K0356m4132k13474J48J66075J71605M202
13910I1411P5k02111k30295K52072M4343K2756J41119O0436q8596q7850J09834
13899A13194L0453R6529k22152j70520J34470m0514J06001q3859j75046J30810
13889h0634k2680J80812l6096j94652M4649Q9581J52551J61384R6584k46517k13038
13878f8056J20707J12492n8818j1564J16624Q1396k7195k28431l14052O0185J76377
13867d0335J91620J8345k82773m0974p195P2563J20988p9639N8656J40184m1403
13856A10037m5402k06914k22217L6054P9561K1041J95624n8410J89871J71046
$$ y = [-243428, -108546, -74157, -409546, -335358, -144986, -14501, -284069, -199918, 123668, 368919, 340168, 259007, 152931, -13369, 6987, -37145, -250619, -250471, -84396, 87209, 91411, 91486, -110625, -340920, -88848, -44505, -21749, 119370, 179806, 91210, 3360, 113194, 143647, 240176, 18024, -152496, -18026, -58540, 47461, -36398, -211444, -80634, -103314, 77498, 41402, -153250, -108601, -19020, 133531, 294915, 391499, 144982, -68056, 52651, 165143, 106325, 94761, 211385, 292781, 265586, 37155, -276897, -216712, -40335, 151285, 169630, -113143, -154117, -161312, -88749, 32239, -47400, 11256, 151440, 110037, 64635, -142279, -364496, -328442, -248881, -227840, -32216, -90626, 99245, 270291]
13846B70291n46L9988K67200r5304j87926j79354l19947j28964Q885J64280K94262
13835A32865J61635j87192p5666L2022j93414m3288j06126J28448O8325m2193
13825a24584L22052o0531j77614R6714Q8937j71352m3198L8303r0377l601K0297
13814a04954O3017R6465J9541M5938l9055J14998J06670k02380j90302m7691P2449
13803f5304p6977J44663j21852o5875l9699j12191j17664j9833j38121J31151
13793d81702K09081J1592k20899j33016L1037N1548L06309J1813L7709q6300K4593
13782b38235J14900n3672O1282M4413L49331J00194q6984J19538Q6240J11914
13772F08921k4117l18025j92597o6323l7865j8305q6597J8304k7145q178j190
$$ y = [270291, 269745, 309733, 576933, 481629, 293703, 114349, -205598, -334562, -325677, -161397, 132865, 294500, 107308, 31642, 63664, -129750, -173038, -279164, -150716, -82391, -124584, 197468, 136937, -40677, 56037, 144974, -26378, -69576, -31273, -121650, -125251, -104954, -41937, 54528, 74069, 120007, 80952, 195950, 302620, 100240, -90062, -137753, -65304, -142281, 2382, -119470, -185345, -225044, -337235, -454899, -474732, -612853, -481702, -272621, -261029, -481928, -614944, -583907, -532359, -226050, -214237, -176528, -262828, -238235, -123335, -177007, -115725, -71312, 278019, 378213, 291229, 410767, 497007, 608921, 584804, 266779, 74182, 7859, -30006, -48311, -134908, -116604, -143749, -151927, -153117]
13761a53117o0955J70333N0926j50061J292J47092R037P2662j24720j86552k1143
13750b45206K65060P7830K0283J40094M00537k6338l76491k72633j62304j07985
13740b87153n6949J134k6797R0669J73012K33911j36305k60402J74310K15978
13730A21408O0485O1506p6603j31015J20434m0719m14225k81291K13728J84193
13720a82099j26169p4926N7048J03305J84455J25806J06226M1386j6328j10964
13710A07740N0673J23953J45783O1281j94822K0939j49342l3414N9930p9771j596
13699A11354j19958q68N8402o3114K48970J00770K4078j63022j63095j8419O667
13688B1765M1828J2891q0026L31679M8590l5859l51959l78579J25560r7720P0938
$$ y = [-153117, -214072, -43739, 7187, -142874, -141582, 5510, 14547, 87209, -37511, -224063, -245206, 19854, 97684, 117967, 258061, 658598, 632260, 255769, -16864, -179168, -287153, -344102, -342968, -369765, -279096, -106084, 127827, -8478, -268880, -94570, 121408, 181893, 243399, 166796, 35781, 156215, 115496, -298729, -580020, -366292, -182099, -308268, -383194, -326146, -222841, -38386, 87420, 193646, 235032, 218704, 107740, 158413, 282366, 428149, 489430, 294608, 315547, 166205, 132791, 192721, 112950, 111354, -8604, -9472, 48930, -14184, 234786, 335556, 359634, 196612, 33517, 15098, 21765, 63593, 76484, -3542, 328137, 376727, 340868, -11091, -389670, -264110, -361830, -290892]
13677b90892P7537k4243j11925J01774J20286J3394n1760K7601J13546o8452j9675
13666a12809j13936j46048O7095J9970N8164j37371J27635L6928J18913K47284
13656A65825k3093j50451l47274q2364K86227M4778O8762k05824j58931K95821
13646a06524J60553j19978J2998L2879N07756J6402k80022j10257j27908l05223
13636c19324j68099P368J22158K48224K24670K66553K34791l40968l62437k0780
13626a07844L6909J81834P2210K0018k72276k7876J231K02042j81288j20133J23848
13615g1325J36393R4553j23728j74511n0044j00077K6419J23803K5848j4435k13425
13604c40529j34662K34694M82917P5599q4705k74588j38816q4774J14858j7044
$$ y = [-290892, -213355, -237598, -349523, -247749, -127463, -114069, -165829, -138228, -24682, -93134, -112809, -226745, -372793, -305698, -285728, -227564, -364935, -237300, -200372, -81459, 165825, 142732, -7719, -354993, -437357, -151130, -106352, -37590, -243414, -402345, -106524, 54029, -65949, -52951, -20072, 487684, 504086, 224064, 113807, -14101, -319324, -487423, -480055, -357897, -109673, 114997, 381550, 616341, 275373, -87064, -107844, -70935, 110899, 183109, 203127, -69149, -97025, -95794, 106248, -75040, -195173, -71325, 65068, 159621, 35893, -138618, -188662, -288739, -262320, -138517, -112669, -127104, -340529, -475191, -240497, 242420, 318019, 233314, -41274, -180090, -264864, -150006, -167050]
13594a67050L6737J71338K1191L5520j34365j03819L6145N3109J28111k49906
13584a72989k8422J55419M0583k2471p8103J05468r0531K9030M88005j31245l90295
13573i5551L1060K05193Q8303K96k63323k62320K0697J04130R1722J85955j17831
13562a1669j07133j0945Q0083J50931O5799j63506O832k03493Q3545j46718k1256
13551b77530R9030K41916j3518j7945K3689j83599R7390L94439N1720k19887j53851
13540D1854M8991R4390j8084j62546K675m1372n3171O7293j29729m9892J62545
13529c7046O650K13589O2072p2402K9472O0374n0841Q5408O9808o6180r585j64614
13517A26705l830R4363j03110J75239J2353j72025k5056L6872o6496Q4267K56528
$$ y = [-167050, -130313, 41025, 62216, 97736, -36629, -140448, -104303, -51194, 76917, -172989, -201411, -45992, -5409, -27880, -105983, -515, -91046, -62016, 425989, 294744, -95551, -64491, 140702, 229005, 229301, -34022, -296342, -275645, -171515, -79793, 106162, -11669, -118802, -129747, -49664, 101267, 167066, 3560, 10392, -193101, -109556, -256274, -277530, -178500, 63416, 49898, 31953, 55642, -127957, -30567, 363872, 415592, 195705, 41854, 90845, 185235, 167151, 4605, 7280, -34092, -87263, -19970, -149699, -199591, -37046, -30396, 183193, 245265, 172863, 202335, 262709, 211868, 297276, 367084, 300904, 291319, 126705, 122875, 217238, 114128, 289367, 301720, 129695, 104639, 141511, 75015, 159282, 415810]
13506D15810N8901l10875l40321j57555K40427J21667j1670K4697J48749P7748
13496B67578J44117j33315k00927m4652L8648N1713J76425P3135J25092J06479
13486F04293J66177O1966l54797k14816r5722k20988q8998J10545O6481J0471
13476D4612J79871j69647k02291K83017K12363j05868j14418k99477J21005o4956
13466a15789J53668l3009r3719J7149J19747q4476k19691K21644K39931Q0827
13456B86282k59788J7771q9113j01432O3419p8362o9147J78961K58691N4466K5800
13445B87548p5549j68769K346o6386j60202J71764J25029o0836j98396j7940j57329
13434c18720K73905R5769O5259j63346m32201j05088R0816J27046L99113K43119
$$ y = [415810, 474711, 163836, -176485, -334040, -93613, 28054, 16384, 41081, 189830, 267578, 411695, 278380, 77453, 32801, 71449, 123162, 299587, 372722, 497814, 604293, 770470, 832436, 477639, 262823, 167101, -53887, -142885, -32340, 34141, 44612, 224483, 54836, -147455, 135562, 347925, 242057, 127639, -171838, -50833, -115789, 37879, 4870, -88849, -71700, 48047, -36429, -256120, -34476, 205455, 286282, 26494, 44265, -44848, -146280, -82861, -161223, -230370, -51409, 207282, 261748, 287548, 211999, 43230, 45576, -20810, -181012, -9248, 115781, 54945, -143451, -161391, -318720, -44815, 50954, 116213, -47133, -479334, -584422, -493606, -366560, 32553, 275672]
13424B75672j75010m3974J0671R9716k1249j2812O7264j24241j74450k14600M7173
13413b65840j49518M6472L88691k9728j79007R4564K27249K546J59130m6144j10036
$$ y = [275672, 100662, 56688, 67359, 167075, 145826, 133014, 200278, 76037, -98413, -313013, -265840, -415358, -368886, 19805, -9923, -188930, -94366, 132883, 135429, 294559, 248415, 138379]
$$ [...]
##END NTUPLES=NMR SPECTRUM
##END=
