##TITLE=Analysis number 321823
Compound Code sb 01023
Project Code adrs
Chemist Name stores
##JCAMPDX= 6.0         $$ Bruker NMR JCAMP-DX V2.0
##DATA TYPE= NMR SPECTRUM
##DATA CLASS= NTUPLES
##ORIGIN= Bruker BioSpin GmbH
##OWNER= nmr
$$ XWIN-NMR		Version 3.5
$$ Wed Aug 30 09:54:39 2006 GMT Daylight Time (UT+1h)  MAYBRIDGE\nmr@NMR_250MHZ
##.OBSERVE FREQUENCY= 250.131544655141
##.OBSERVE NUCLEUS= ^1H
##.ACQUISITION MODE= SIMULTANEOUS (DQD)
##.ACQUISITION SCHEME= undefined
##.AVERAGES= 16
##.DIGITISER RES= 18
##SPECTROMETER/DATA SYSTEM= dpx250
##.PULSE SEQUENCE= zg30
##.SOLVENT NAME= CDCl3
##.SHIFT REFERENCE= (INTERNAL, CDCl3, 0, 16.522)
##AUDIT TRAIL= $$ (NUMBER, WHEN, WHO, WHERE, WHAT)
$$ ##TITLE= Audit trail, XWIN-NMR		Version 3.5
$$ ##JCAMPDX= 5.01
$$ ##ORIGIN= Bruker BioSpin GmbH
$$ ##OWNER= nmr
$$ C:\u/data/dgb/nmr/ADRS/1840/pdata/1/auditp.txt
$$ ##AUDIT TRAIL=  $$ (NUMBER, WHEN, WHO, WHERE, WHAT)
(   1,<2006-08-30 09:54:11.99 +100>,<MAYBRIDGE\nmr>,<NMR_250MHZ>,
      <created by zg, POWCHK disabled, PULCHK disabled
       configuration hash MD5:
       E2 DF 36 D8 04 B2 41 60 5A D7 A3 38 5A 4B D0 FE
       data hash MD5: 64K
       F4 73 C1 D1 69 95 47 66 71 76 E4 8C C4 CB 16 00>)
(   2,<2006-08-30 09:54:27.60 +100>,<MAYBRIDGE\nmr>,<NMR_250MHZ>,
      <Start of raw data processing
       ef LB = 0.3 FT_mod = 6 PKNL = 1 SI = 32K 
       data hash MD5: 32K
       44 0E BB 25 B7 C0 CD 07 01 0A C4 8C 71 42 F2 38>)
(   3,<2006-08-30 09:54:29.08 +100>,<MAYBRIDGE\nmr>,<NMR_250MHZ>,
      <apk 
       data hash MD5: 32K
       CB 10 A3 A7 A9 AD FA E8 90 0A 21 2A AB D0 D8 93>)
(   4,<2006-08-30 09:54:29.94 +100>,<MAYBRIDGE\nmr>,<NMR_250MHZ>,
      <abs ABSG = 5 
       data hash MD5: 32K
       67 38 99 F4 6B 23 73 C8 6C 4B A3 24 EF A1 18 DC>)
$$ ##END=
$$ 
$$ hash MD5
$$ 73 20 61 26 8B 89 DB 60 AD 2F C4 5B C9 FB B2 D7
##$RELAX= 
##$RELAX= 
##$RELAX= 
##$RELAX= 
##$RELAX= 
##$RELAX= 
##$RELAX= 
$$ Bruker specific parameters
$$ --------------------------
##$DU= <C:\u>
##$EXPNO= 1840
##$NAME= <ADRS>
##$PROCNO= 1
##$TYPE= <nmr>
##$USER= <dgb>
##$AMP= (0..31)
100 100 100 100 100 100 100 100 100 100 100 100 100 100 100 100 100 100 
100 100 100 100 100 100 100 100 100 100 100 100 100 100 
##$AQSEQ= 0
##$AQ_mod= 3
##$AUNM= <au_zg>
##$AUTOPOS= <7 >
##$BF1= 250.13
##$BF2= 250.13
##$BF3= 250.13
##$BF4= 250.13
##$BF5= 500.13
##$BF6= 500.13
##$BF7= 500.13
##$BF8= 500.13
##$BYTORDA= 1
##$CFDGTYP= 0
##$CFRGTYP= 5
##$CHEMSTR= <none>
##$CNST= (0..31)
1 1 145 1 1 1 1 1 1 1 1 1 1 1 1 1 1 1 1 1 1 1 1 1 1 1 1 1 1 1 1 1 
##$CPDPRG= <>
##$CPDPRG1= <>
##$CPDPRG2= <>
##$CPDPRG3= <>
##$CPDPRG4= <mlev>
##$CPDPRG5= <mlev>
##$CPDPRG6= <mlev>
##$CPDPRG7= <mlev>
##$CPDPRG8= <mlev>
##$CPDPRGB= <>
##$CPDPRGT= <>
##$D= (0..31)
0 1 0 0 0 0 0 0 0 0.06 0 0 0 0 0 0 0.0002 0 0 0 0 0 0 0 0 0 0 0 0 0 0 
0 
##$DATE= 1156928050
##$DBL= (0..7)
120 120 120 120 120 120 120 120 
##$DBP= (0..7)
150 150 150 150 150 150 150 150 
##$DBP07= 0
##$DBPNAM0= <>
##$DBPNAM1= <>
##$DBPNAM2= <>
$$ [...]
##$SUBNAM7= <"">
##$SUBNAM8= <"">
##$SUBNAM9= <"">
##$SW= 20.6930455092707
##$SWIBOX= (0..15)
0 0 3 0 0 0 0 0 0 0 0 0 0 0 0 0 
##$SW_h= 5175.983436853
##$TD= 65536
##$TD0= 1
##$TE= 295.16
##$TE2= 300
##$TE3= 300
##$TEG= 300
##$TL= (0..7)
0 120 120 120 120 120 120 120 
##$TP= (0..7)
150 150 150 150 150 150 150 150 
##$TP07= 0
##$TPNAME0= <>
##$TPNAME1= <>
##$TPNAME2= <>
##$TPNAME3= <>
##$TPNAME4= <>
##$TPNAME5= <>
##$TPNAME6= <>
##$TPNAME7= <>
##$TPOAL= (0..7)
0.5 0.5 0.5 0.5 0.5 0.5 0.5 0.5 
##$TPOFFS= (0..7)
0 0 0 0 0 0 0 0 
##$TUNHIN= 0
##$TUNHOUT= 0
##$TUNXOUT= 0
##$USERA1= <user>
##$USERA2= <user>
##$USERA3= <user>
##$USERA4= <user>
##$USERA5= <user>
##$V9= 5
##$VALIST= <valist>
##$VCLIST= <CCCCCCCCCCCCCCC>
##$VD= 0
##$VDLIST= <DDDDDDDDDDDDDDD>
##$VPLIST= <PPPPPPPPPPPPPPP>
##$VTLIST= <TTTTTTTTTTTTTTT>
##$WBST= 1024
##$WBSW= 4
##$XGAIN= (0..3)
0 0 0 0 
##$XL= 0
##$YL= 0
##$YMAX_a= 408277
##$YMIN_a= -426934
##$ZGOPTNS= <>
##$ZL1= 120
##$ZL2= 120
##$ZL3= 120
##$ZL4= 120
##$ABSF1= 16.522
##$ABSF2= -4.171173
##$ABSG= 5
##$ABSL= 3
##$ALPHA= 0
##$AQORDER= 0
##$ASSFAC= 0
##$ASSFACI= 0
##$ASSFACX= 0
##$ASSWID= 0
##$AUNMP= <proc_1d>
##$AZFE= 0.1
##$AZFW= 0.1
##$BCFW= 0
##$BC_mod= 0
##$BYTORDP= 0
##$COROFFS= 0
##$CY= 12.5
##$DATMOD= 1
##$DC= 0
##$DFILT= <>
##$DTYPP= 0
##$F1P= 14.0000005364418
##$F2P= -0.99999901652339
##$FCOR= 0.5
##$FTSIZE= 32768
##$FT_mod= 6
##$GAMMA= 0
##$GB= 0
##$INTBC= 1
##$INTSCL= 1
##$ISEN= 128
##$LB= 0.3
##$LEV0= 0
##$LPBIN= 0
##$MAXI= 10000
##$MC2= 0
##$MEAN= 0
##$ME_mod= 0
##$MI= 0
##$NCOEF= 0
##$NC_proc= -4
##$NLEV= 6
##$NOISF1= 0
##$NOISF2= 0
##$NSP= 0
##$NTH_PI= 0
##$NZP= 0
##$OFFSET= 16.522
##$PC= 1
##$PHC0= 155.2741
##$PHC1= 9.79813
##$PH_mod= 1
##$PKNL= yes
##$PPARMOD= 0
##$PSCAL= 4
##$PSIGN= 0
##$REVERSE= no
##$SF= 250.13
##$SI= 32768
##$SIGF1= 0
##$SIGF2= 0
##$SINO= 400
##$SIOLD= 32768
##$SREGLST= <1H.CDCl3>
##$SSB= 0
##$STSI= 32768
##$STSR= 0
##$SW_p= 5175.98343685301
##$SYMM= 0
##$S_DEV= 0
##$TDeff= 65536
##$TDoff= 0
##$TI= <Analysis number 999999
Compound Code 99
Book Reference 9
Project Code 9>
##$TILT= no
##$TM1= 0
##$TM2= 0
##$TOPLEV= 0
##$USERP1= <user>
##$USERP2= <user>
##$USERP3= <user>
##$USERP4= <user>
##$USERP5= <user>
##$WDW= 1
##$XDIM= 32768
##$YMAX_p= 365783197
##$YMIN_p= -537299
$$ End of Bruker specific parameters
$$ ---------------------------------
##NTUPLES= NMR SPECTRUM
##VAR_NAME=  FREQUENCY,     SPECTRUM/REAL,   SPECTRUM/IMAG
##SYMBOL=    X,             R,               I
##VAR_TYPE=  INDEPENDENT,   DEPENDENT,       DEPENDENT
##VAR_FORM=  AFFN,          ASDF,            ASDF
##VAR_DIM=   32768,         32768,           32768
##UNITS=     HZ,            ARBITRARY UNITS, ARBITRARY UNITS
##FACTOR=    0.157963299565203, 1,           1
##FIRST=     4132.6476996994, 0,             0
##LAST=      -1043.33573715361, 0,           0
##MIN=       -1043.33573715361, -537299,     0
##MAX=       4132.6476996994, 365783197,     0
$$ Real data points
##PAGE= N=1
##DATA TABLE= (X++(R..R)), XYDATA
$$ [...]
24682a19955J74327j7709P2010l2754r9303r1393J95941p8518j86502J80016J3622
$$ -119955 54372 36663 108673 75919 -23384 -114777 81164 2646 -183856 -3840 9782
24671I782j46658j30434j7732K29388J65099n600j34088j16207P6800N538o7832
$$ 9782 -136876 -267310 -285042 -55654 109445 103845 -30243 -146450 -69650 -64112 -131944
24660a31944o3126K0827p6528Q5536K10395j6791j39445r216j17570j3963J36984
$$ -131944 -195070 -174243 -250771 -165235 45160 28369 -111076 -120292 -237862 -251825 -114841
24649a14841O0832n3456q2327r2586o967K2393m117J75110Q1006k700o1121K4369
$$ -114841 -54009 -107465 -189792 -282378 -289345 -266952 -271069 -95959 -14953 -17653 -78774 -54405
24637e4405m0092j14621O8690J07149l7339L9789L8127P0590j05438m7011O6089
$$ -54405 -94497 -209118 -140428 -33279 -70618 -30829 7298 77888 -27550 -74561 -8472
24626h472q1041j3589p344j059J27788J27613j12957n615Q9178J643j03537K8273
$$ -8472 -89513 -103102 -110446 -111505 16283 143896 30939 25324 114502 116145 12608 40881
24614D0881n5084j1711J03422J8114j10050O6987j67338J2872M3525Q9322j38771
$$ 40881 -14203 -25914 77508 95622 -14428 52559 -114779 -101907 -58382 30940 -107831
24603a07831n408j20533k09123j8321Q6736Q8957k6887J16321R5363K3208p3389
$$ -107831 -113239 -233772 -442895 -461216 -374480 -285523 -312410 -196089 -100726 -77518 -150907
24592a50907J45081R5172M7658o7869r9711Q2380L7129j02347J26722m5261l4819
$$ -150907 -5826 89346 137004 69135 -30576 51804 88933 -13414 113308 68047 33228
24581C3228J19162m5382p6033L4193j0526l8544q3337P0496k4132o9287j09845
$$ 33228 152390 107008 30975 65168 54642 16098 -67239 3257 -20875 -90162 -200007
24570b00007p4921P9391j06595K16208J50197p2314j76142M7848J50823N750j60696
$$ -200007 -274928 -195537 -302132 -85924 64273 -8041 -184183 -136335 14488 20238 -140458
24559a40458Q519K05680n9741j05579O3608N9402P7110j8066L1646q664j14620
$$ -140458 -131939 73741 14000 -91579 -27971 31431 108541 90475 122121 113457 -1163
24548a163r7578J12727P8618p1169k638J40845J06067p2279j81642p3764r0286
$$ -1163 -98741 13986 92604 21435 18797 159642 265709 193430 11788 -61976 -152262
24537a52262L373L3622J83004j461j3962m7178n1664M9693N3636J7324m1300l9476
$$ -152262 -148889 -115267 67737 66276 52314 5136 -46528 3165 56801 74125 32825 -6651
24525f651J06422o7231o7334J36998L3453r0430r776q6552j19150J7835J87207
$$ -6651 99771 32540 -34794 102204 135657 45227 35451 -51101 -170251 -152416 34791
24514C4791l0157j4040j24928Q4459P991j1466R8134O3699O3504J2708q3442r464
$$ 34791 4634 -9406 -134334 -49875 -41884 -53350 44784 108483 171987 184695 101253 91789
24502I1789J57009n8905j25044l8677K973o3586O9883J74800n0228K5620m9542
$$ 91789 248798 189893 64849 26172 29145 -34441 35442 210242 160014 185634 136092
24491A36092o3309K8685J4676l9459M9158R899r97k6123j26011j02450o795j2782
$$ 136092 72783 101468 116144 76685 125843 135742 134745 108622 -17389 -119839 -126634 -139416
24479a39416n7406o7444j3901J46661o3759J36585J61376k37q8885P225L7620
$$ -139416 -196822 -264266 -278167 -131506 -195265 -58680 102696 102459 13574 20799 58419
24468E8419j87165N2708j15221l3444K3135J57822J15726N9023N4741O7107p7505
$$ 58419 -128746 -76038 -191259 -224703 -201568 -43746 71980 131003 185744 252851 175346
24457A75346P0026q9732k16485p5187J07669p914O2784O11M5831J1989j15794
$$ 175346 245372 155640 -60845 -136032 -28363 -36277 26507 27118 72949 84938 -30856
24446c0856j32613m950q4322J00746J35479J17419P886L6086m0475m9334m7401
$$ -30856 -163469 -168419 -252741 -151995 -16516 100903 108789 144875 104400 55066 7665
24435G665o8342J5050o8097j7445r9735K1571M297L6223l8454j1333l2334J35934
$$ 7665 -60677 -45627 -113724 -131169 -230904 -209333 -205036 -168813 -207267 -218600 -250934 -115000
24423a15000J66114O4044N639j50702j55986N5762Q07Q981l3133J33322k2536
$$ -115000 51114 115158 120797 -29905 -185891 -130129 -129322 -120341 -153474 -20152 -42688
24412d2688k02485N4331J90387K1799j44256m1200O7509J63650k9402j51936L6090
$$ -42688 -245173 -190842 -455 21344 -122912 -164112 -96603 67047 37645 -114291 -78201
24401g8201j24364M1142K4450J50854L5066k2263q2243r5285p9884l7927M7394
$$ -78201 -202565 -161423 -136973 13881 48947 26684 -55559 -150844 -230728 -268655 -221261
24390b21261Q7137O8503l3739M0544L666n4195k3386j09240K142J58926k0427
$$ -221261 -134124 -65621 -99360 -58816 -55150 -109345 -132731 -241971 -239829 -80903 -101330
24379a01330j80887J93631J95886j93309m8562O2325L7327J0061M7449N152J413
$$ -101330 -282217 -88586 107300 -86009 -134571 -72246 -34919 -24858 22591 27743 29156
24368B9156K7554m1108q5770Q5853m3603K909L4019m8721j09534N2893J03673
$$ 29156 56710 15602 -70168 15685 -27918 -25009 9010 -39711 -149245 -96352 7321
24357G321R8475N225k7729o7841J8600P0670j81857p7627J31394k5371o9295N3614
$$ 7321 105796 111021 83292 15451 34051 104721 -77136 -154763 -23369 -48740 -118035 -64421
24345f4421j27697O8373Q6573K5361p3706j5735P2881J17963k589j4112J99386
$$ -64421 -192118 -123745 -37172 -11811 -85517 -101252 -28371 89592 87003 72891 272277
24334B72277N1950n0305q2003j20309r1163J01698J109q3605r2173J5775J13886
$$ 272277 324227 273922 191919 71610 -19553 82145 83254 -351 -92524 -76749 37137
24323C7137J46898J18180o3950r9577r7769M6656J32493J45652j11344j57650
$$ 37137 184035 302215 238265 138688 40919 87575 220068 365720 254376 96726
24313I6726j16851R8225J0395O7576L7712r1198n1269K2052q8366r3918k2982
$$ 96726 -20125 78100 88495 156071 193783 102585 51316 73368 -14998 -108916 -131898
24302a31898R4312J1028j10589P3498M2417L8857O5550L7898J09930k6069J1704
$$ -131898 -37586 -26558 -137147 -63649 -21232 17625 83175 121073 231003 204934 216638
24291B16638j21002l5895k6342J0769N980J20353q2642k5941K5098P632p3432
$$ 216638 95636 59741 33399 44168 50148 170501 87859 61918 87016 94648 21216
24280B1216o5598n1147R962k5430Q5932J54756p8106l0201J77371P6128o7148
$$ 21216 -44382 -95529 -85567 -110997 -25065 129691 51585 21384 198755 274883 207735
24269B07735O3840J31644J22085n4888j76519k00412K6423N5554J05822m9030
$$ 207735 271575 403219 525304 470416 293897 93485 119908 175462 281284 232254
24259B32254j43453m4987Q819o9635J2327K9834R0660J27277o6723j43671L0953
$$ 232254 88801 43814 52633 -17002 -4675 25159 115819 243096 176373 32702 63655
24248F3655N5167O6781l6133j31466j9294m2033M3349N9346k071p1870j33598
$$ 63655 118822 185603 149470 18004 -1290 -43323 26 59372 57301 -14569 -148167
24237a48167Q9767O3861K2926K8292q8256m041j00884K0975L4072p2462N008J03060
$$ -148167 -58400 5461 28387 56679 -31577 -35618 -136502 -115527 -81455 -153917 -148909 -45849
24225d5849j77463j70204k0415m799J92431J71705l983M0307n0140P8965j46326
$$ -45849 -223312 -393516 -413931 -418730 -226299 -54594 -58577 -18270 -68410 10555 -135771
24214a35771l0066L4699J7403J13639R3477O7172r9927l6847J02644K635n4437
$$ -135771 -165837 -131138 -113735 -96 93381 160553 60626 23779 126423 129058 74621
24203G4621j23724N7918J16208R4735j15282o5366o2781n2372N8043Q5308m0346
$$ 74621 -49103 8815 125023 219758 104476 39110 -23671 -76043 -18000 67308 26962
24192B6962j00184n2896k0156R0642J25726J2663m5555O4055l521j25451J61224
$$ 26962 -73222 -126118 -146274 -55632 70094 82757 37202 101257 97736 -27715 133509
24181A33509J40477r4163j50790j7217Q1972J77650j18151j61380J05189Q4799
$$ 133509 273986 179823 29033 11816 93788 271438 153287 -8093 97096 181895
24171A81895j23850j50177q5630o746N3617L5337p6851o3696J15224R6651P3131
$$ 181895 58045 -92132 -177762 -184508 -130891 -95554 -172405 -236101 -120877 -24226 48905
24160D8905J229j04332O4554l0301J2965R2258J22188J11262q0913r6597k2756
$$ 48905 50134 -54198 10356 -19945 -6980 85278 207466 318728 237815 141218 118462
24149A18462M2844j0611O0448q3836K9635J63253j55103j13606q7964p6370j19462
$$ 118462 161306 150695 211143 127307 156942 320195 165092 51486 -36478 -112848 -232310
24138b32310M0851j2695m6702J55728r487J50947P3047q6661o5306K6732r0374
$$ -232310 -191459 -204154 -250856 -95128 -104615 46332 119379 32718 -32588 -5856 -96230
24127i6230n0250n479n4409M940Q9882J32098N3453O1601j04152L3193m7568n5159
$$ -96230 -146480 -151959 -206368 -201428 -111546 20552 74005 135606 31454 64647 17079 -38080
24115c8080j09194J2767J79249Q7392m793r6446O923L26l7304j0074k6030q2201
$$ -38080 -147274 -134507 44742 132134 127341 30895 37818 38144 840 -9234 -35264 -117465
24103a17465n601p6975k2409J17508l8354p8168Q0988r1633K8040J65017L3677
$$ -117465 -123066 -200041 -222450 -104942 -143296 -221464 -140476 -232109 -204069 -39052 -5375
24092e375Q3561L2752K6136r6585j66983N3832J40952l4579P8584m595j06907
$$ -5375 78186 110938 137074 40489 -126494 -72662 68290 33711 112295 107700 793
24081G93p8418p3956o6391j4513l1898K8126J68443J07075n6666m7362O7960k4513
$$ 793 -77625 -151581 -217972 -232485 -264383 -236257 -67814 39261 -17405 -64767 3193 -21320
24069b1320J6671O7495Q0273K3299j44289o8198j7707p3125k4891k6628J16325
$$ -21320 -4649 62846 143119 166418 22129 -46069 -63776 -136901 -161792 -188420 -72095
24058g2095J41416m808j6139M5030N0328j20814l36965k4654J28824j2966J34773
$$ -72095 69321 64513 48374 93404 143732 22918 -314047 -338701 -209877 -222843 -88070
24047h8070J53268l4132p3161L6391J09341l6641p1383j16704j27232O1286k8887
$$ -88070 65198 31066 -42095 -5704 103637 66996 -4387 -121091 -248323 -187037 -215924
24036b15924j4996K4274n782J16921k4153J4170M729P3570j01820L3235J80740
$$ -215924 -230920 -206646 -212428 -95507 -119660 -105490 -100761 -27191 -129011 -95776 84964
24025H4964P4166m3884k6212J00662O9781L6705j04311j68149r1303o397J42856
$$ 84964 159130 115246 89034 189696 259477 296182 191871 23722 -67581 -73978 68878
24014F8878J60764m8775p5683j50221n3436K30347L1788j28559n3303M6038M5636
$$ 68878 229642 180867 105184 -45037 -98473 131874 163662 35103 -18200 27838 73474
24003G3474L042j41838m8745j3668Q5919k6889l7880m3856k7080q9279M4702M1953
$$ 73474 76516 -65322 -114067 -127735 -41816 -68705 -106585 -150441 -177521 -266800 -222098 -180145
23991a80145J08978O7235q304R3672Q5938P77o7095L968l5864m9251n8477J7784
$$ -180145 -71167 -3932 -12236 81436 167374 168151 101056 105024 69160 19909 -38568 -20784
23979b0784J5530l9966K9892m6523q2343K0331q1416J392O5497J58873m683n6388
$$ -20784 -5254 -45220 -15328 -61851 -144194 -123863 -205279 -203887 -138390 20483 15800 -40588
23967d0588j0113j81648l684J11056j18693L5934K4646N9913N776J32356J64917
$$ -40588 -50701 -232349 -236033 -124977 -243670 -207736 -183090 -123177 -117401 14955 179872
23956A79872Q0726q2951j42627r3788p2549k1253L6186L3690k002j04945L0813
$$ 179872 260598 177647 35020 -58768 -131317 -152570 -116384 -82694 -84696 -189641 -158828
23945a58828J17964P2400O6564j16459N431J82819n0195j44930r5668N8957M3035
$$ -158828 -40864 31536 98100 -18359 -12928 169891 119696 -25234 -120902 -61945 -18910
23934a8910J243L1962o0262j1462P3605j7445r7638P2511j024p7263l7408K5728
$$ -18910 -17667 14295 -45967 -57429 16176 -1269 -98907 -26396 -27420 -104683 -142091 -116363
23922a16363O1640J11700P0037r8214j01120n8815K771l1082j11745j19958M5757
$$ -116363 -54723 56977 127014 28800 -72320 -131135 -128364 -159446 -271191 -391149 -345392
23911c45392J57470J32680J5360K7517j14381n9734J37999K2862J960L1766N6148
$$ -345392 -187922 -55242 -39882 -12365 -126746 -186480 -48481 -25619 -23659 8107 64255
23900F4255m1655q2794L8552k5905J58002J03512j627k37543k6306m9184M6977
$$ 64255 22600 -60194 -21642 -47547 110455 213967 212340 -25203 -51509 -100693 -53716
23889e3716R8951J5643j73797N3894J04057N302q3034p5122l7027l0442J99044
$$ -53716 45235 60878 -112919 -59025 45032 50334 -32700 -107822 -144849 -175291 23753
23878B3753J7417k3925R1738K9089q5436l7512Q5306k3863J458m3218l9676k5876
$$ 23753 41170 17245 108983 138072 52636 15124 100430 76567 78025 34807 -4869 -30745
23866c0745O4841K5660K51j11364Q5767k3343p2915o6558p3218n4340K6048R7947
$$ -30745 34096 59756 60007 -51357 34410 11067 -61848 -128406 -201624 -255964 -229916 -131969
23854a31969k7239m1741J16422J01Q119m1094K4216O9233l7719L5297o2384J6818
$$ -131969 -159208 -200949 -84527 -84426 -76307 -117401 -93185 -23952 -61671 -26374 -88758 -71940
23842g1940J01639j17501k1319R9129M0119j1557o8616n8801q051J8435P826Q6988
$$ -71940 29699 -87802 -109121 -9992 30127 18570 -50046 -108847 -116898 -98463 -90637 -3649
23830c649J3430M8157N9348p8085j56262j23584p6395Q5507O4030P2714R373o8238
$$ -3649 9781 57938 117286 39201 -117061 -240645 -317040 -231533 -167503 -94789 -85416 -153654
23818a53654J6550K8775K1204J9268m4049r18J72097R5557m8939K5666q1097j54232
$$ -153654 -137104 -108329 -87125 -67857 -111906 -112824 59273 154830 105891 131557 50460 -103772
23806a03772Q667K5107Q5921J00090J26128q3946j79095N4612J89313O8771j29540
$$ -103772 -95105 -69998 15923 116013 242141 158195 -20900 33712 223025 291796 162256
23795A62256j71359J8572P8166j4705j86993k3389R0283J5068Q9440p5203m6862
$$ 162256 -9103 9469 87635 72930 -114063 -137452 -47169 -32101 57339 -17864 -64726
23784f4726N6756o346J04888Q1090j39157j36827P7612M295r5436L9526K27445
$$ -64726 -7970 -14316 90572 171662 32505 -104322 -26710 -22415 -117851 -78325 149120
23773A49120Q5257j0659j0188l1688j98320k8588M1544o2156J8549J7698L5117
$$ 149120 234377 223718 213530 181842 -16478 -45066 -3522 -65678 -47129 -29431 5686
23762E686L412J41752N7359L5656J4543j44791q3298n808M1687k4057j51482J7275
$$ 5686 9098 150850 208209 243865 258408 113617 30319 24511 66198 42141 -109341 -92066
23750i2066P3982M6847J10950O6365k0876j5922l1298j73033r4724q6179Q9826
$$ -92066 -18084 28763 139713 206078 185202 169280 137982 -35051 -129775 -215954 -126128
23739a26128R1601N6196k2906p9469J952o6207K1773l2797l3302n7110O4901p1468
$$ -126128 -34527 21669 -1237 -80706 -78754 -144961 -123188 -155985 -189287 -246397 -181496 -252964
23727b52964J53453J93531k6248j07611j65259K1264J80018J27291p6692k35537
$$ -252964 -99511 94020 67772 -39839 -205098 -183834 -3816 123475 46783 -188754
23717a88754j61191q7705N7069J63252J18595J10837J44012q9335j76608J3063
$$ -188754 -349945 -437650 -380581 -217329 -98734 12103 156115 66780 -109828 -96765
23707i6765l6223r8427O8393O3081J19743j09610N433M6949J37708O787j04480
$$ -96765 -132988 -231415 -163022 -99941 19802 -89808 -84375 -37426 100282 107069 2589
23696B589n4073O049J22922Q5553L1741j75335j89113l3774J0841M4842l2386
$$ 2589 -51484 -45435 77487 163040 194781 19446 -169667 -203441 -192600 -147758 -180144
23685a80144O1269O834m14n475J76961N5804j44273o7987m2855p9898Q5690J47809
$$ -180144 -118875 -112041 -112455 -117930 59031 114835 -29438 -97425 -140280 -220178 -134488 13321
23673A3321O5228K5791j0483q3455J4519Q6468Q0837o5678l8335k04918j09249
$$ 13321 78549 104340 93857 10402 24921 111389 192226 126548 88213 -116705 -225954
23662b25954k343R7237M7828m050k12585j08901k0985M8555J3035M2684R7859
$$ -225954 -228297 -131060 -83232 -87282 -299867 -408768 -429753 -381198 -368163 -325479 -227620
23651b27620J29479J69397R3829k0003N8641O3240q8922j18578n5662j3273p1934
$$ -227620 -98141 71256 165085 145082 203723 266963 178041 59463 3801 -9472 -81406
23640h1406j19888m5583O7496J39842k718J51L82o9313j3161J87471L6678j19888
$$ -81406 -201294 -246877 -179381 -39539 -42257 -42106 -41724 -111037 -124198 63273 99951 -19937
23628a9937o6474k6115J2878M9932M7895l9878j8489n8278Q4941M9026o7488j25336
$$ -19937 -86411 -112526 -99648 -49716 -1821 -41699 -60188 -118466 -33525 15501 -51987 -177323
23616a77323K5633J79478M7495q6954L2778P3097n8897K5479R5731o0187o5358
$$ -177323 -151690 27788 75283 -11671 21107 94204 35307 60786 156517 96330 30972
23605C0972Q3883m1461m8824O8258n930Q3436j55335j5981k3747Q5322p1791P4521
$$ 30972 114855 73394 24570 92828 86898 170334 14999 -982 -24729 60593 -11198 63323
23593F3323Q6367l7308j74839o5203o336o180J18963K3940J04230J04908q5947
$$ 63323 149690 112382 -62457 -127660 -133996 -140176 -21213 2727 106957 211865 125918
23582A25918j54328m4052J48214l222j07057J6022j02788Q9934j5028O1649m6208
$$ 125918 -28410 -72462 75752 72530 -34527 -18505 -121293 -31359 -46387 15262 -30946
23571c0946m4238m181J5499M2037Q9095j22152p379K9025K1522J8141J1182n9827
$$ -30946 -75184 -79365 -63866 -21829 67266 -54886 -62265 -33240 -11718 6423 17605 -42222
23559d2222o5350K53074K23811j53975j26803n5400m1474J37658Q8671j37980
$$ -42222 -107572 145502 369313 215338 88535 33135 -8339 129319 217990 80010
23549H0010p3256P3484J5702q398k0155J6736n2819j21433L3379J28872J4770
$$ 80010 6754 80238 95940 87542 67387 84123 31304 -90129 -56750 72122 86892
23538H6892m6482p6642k7345K7557l3085m5382P0458k2662M122j8360J13495R1321
$$ 86892 40410 -36232 -63577 -36020 -69105 -114487 -44029 -66691 -62569 -80929 32566 123887
23526A23887l4812j57807j77820J3147R461O0878J88124J2121m875L5131m8483
$$ 123887 89075 -68732 -246552 -233405 -223944 -163066 25058 37179 32304 67435 18952
23515A8952o094q5760j88133N1651L7254r8334L2298J57800P1525r1876K5511
$$ 18952 12858 -72902 -261035 -209384 -172130 -270464 -238166 -80366 -8841 -100717 -75206
23504g5206l8916L0440J91965k8743r1538m219q3584r1808q7993Q4454M4733O3832
$$ -75206 -114122 -83682 108283 79540 -11998 -16217 -99801 -191609 -279602 -195148 -150415 -86583
23492h6583P5848k338J07032m3420k9208K4998l6562K0012j2176k777p4603j47440
$$ -86583 -10735 -13073 93959 50539 21331 46329 9767 29779 17603 14826 -59777 -207217
23480b07217N7573q4486j9058o9199P2147p943Q2977n612J25210J22758J4775
$$ -207217 -149644 -234130 -253188 -322387 -250240 -258183 -175206 -180818 -55608 67150 81925
23469H1925j28594o4801P3846n0672K2986r0570M5395J01496J8317L373l5799
$$ 81925 -46669 -111470 -37624 -88296 -65310 -155880 -110485 -8989 9328 12701 -23098
23458b3098j02759l0151n0068J8812l3878Q4231J34230r41Q7708n8563j67393
$$ -23098 -125857 -156008 -206076 -187264 -221142 -136911 -2681 -3622 84086 25523 -141870
23447a41870N312J13982Q890J457R5987R9190j64089n0367Q5968J2388j28318
$$ -141870 -136558 -22576 -13686 -12229 83758 182948 18859 -31508 54460 66848 -61470
23436f1470M0311J3195o4791R7505o7519L4112J76220l9255k65249j63852J18675
$$ -61470 -21159 -7964 -72755 24750 -42769 -8657 167563 128308 -136941 -300793 -182118
23425a82118N1902J27948l744r1284J54061J98317l0767j57552p6029J01930Q4622
$$ -182118 -130216 -2268 -6012 -97296 56765 255082 224315 66763 -9266 92664 177286
23414A77286J24171j15538m0807m8301k6722j29211j04703r6557Q2891J11591
$$ 177286 301457 185919 145112 96811 70089 -59122 -163825 -260382 -177491 -65900
23404f5900m2088J07248J07288J9991R0462o3691n0912k9139K0499R0271l6365
$$ -65900 -107988 -740 106548 126539 217001 153310 102398 73259 93758 184029 147664
23393A47664R234L9921r5002j09064j8747K3999P2709j42870O1272N5142P3495
$$ 147664 156898 196819 101817 -7247 -25994 -1995 70714 -72156 -10884 44258 117753
23382A17753J72715o5284j65442l2244k6427j10682R2168o007l6234K4612n8575
$$ 117753 290468 225184 59742 27498 1071 -109611 -17443 -23450 -59684 -35072 -93647
23371i3647Q765o6168R8153K05994M2602o5517O2800K66084R0747j36200r1904
$$ -93647 -84882 -151050 -52897 153097 195699 130182 192982 459066 549813 413613 321709
23360C21709k32220j74152p8274J28561Q1352m0826m233K721R4543J6738m4513
$$ 321709 89489 -84663 -162937 -34376 46976 6150 1917 4638 99181 115919 71406
23349G1406Q573r0745j17859P5599M057j079M5479K785M6980j2499j73158L226
$$ 71406 79979 -10766 -128625 -53026 -48969 -50048 -4569 -1784 45196 32697 -140461 -137235
23337a37235M7771J03206J02913o6819p7371J49192j2322K7400n6844k22650L2743
$$ -137235 -89464 13742 116655 49836 -27535 121657 109335 136735 79891 -142759 -110016
23326a10016R7363L3106j30746j27108M11P8924K00336L3430J59882J1785J2575
$$ -110016 -12653 20453 -110293 -237401 -236990 -158066 42270 75700 235582 247367 259942
23315B59942q0784k40634r899J38562J57611Q0913p1139m0196k21246j84185O0319
$$ 259942 179158 -61476 -71375 67187 224798 305711 234572 194376 -26870 -211055 -150736
23304a50736k1822q037k7957J23806J37962r230j03184j39812O3639P8098J01923
$$ -150736 -172558 -180595 -208552 -84746 53216 43986 -59198 -199010 -135371 -57273 44650
23293D4650M9781r5316l8089J29016R6052j3791j5119O8930j05552j02133J0358
$$ 44650 94431 -885 -38974 90042 186094 172303 157184 226114 120562 18429 28787
23282B8787J50097N0771J4903J49220j04889j19771j10290p4661N7020l0937J84604
$$ 28787 178884 229655 244558 393778 288889 169118 58828 -15833 41187 10250 194854
23271A94854N0620J51157K69326L05939K04959K10452K66694K09101J16923k63608
$$ 194854 245474 396631 665957 971896 1176855 1387307 1654001 1863102 1980025 1716417
23261A716417j96178k31558j43734j99751J3561j04996j18031j85080m1639J4329
$$ 1716417 1520239 1288681 1144947 945196 958757 853761 735730 550650 509011 523340
23251E23340r7652j21738o262M4563Q7854k4457m6292l1255P0161J5167m2913
$$ 523340 425688 303950 297688 342251 430105 405648 359356 328101 398262 413429 370516
23240C70516l3551j59355o7833P700j3460j25062r5087P542J33817M3925J9664
$$ 370516 336965 177610 109777 117477 104017 -21045 -116132 -108590 25227 69152 88816
23229H8816N009k6674K8977j36671k8796J27256j3647j38971L5974N594M0861
$$ 88816 93825 67151 96128 -40543 -69339 57917 44270 -94701 -58727 -53133 -12272
23218a2272M9315J9065J2648J04329O2725L2466N5845O4131j37179r1394n4643
$$ -12272 37043 56108 68756 173085 235810 268276 324121 388252 251073 159679 105036
23207A05036k1954l5989J73775O6567J8973o874K3274J08527K5218p3735l5151
$$ 105036 83082 47093 220868 287435 306408 299534 322808 431335 456553 382818 347667
23196C47667r7710n9110n5631J00264k3389j51043n1974P7246k6691q0980n4897
$$ 347667 249957 190847 135216 235480 212091 61048 9074 86320 59629 -21351 -76248
23185g6248j29673J39508P9144n4462l9174K4138J00397J50076k0220j14489o9285
$$ -76248 -205921 -66413 12731 -41731 -80905 -56767 43630 193706 173486 58997 -10288
23174a0288J0929M1210J326p4449J27583L4699j25193j43571O0665r1764p3136
$$ -10288 641 41851 43177 -31272 96311 131010 5817 -137754 -77089 -168853 -241989
23163b41989R2614J49552M6064J5597J09421P5536m5353P2297J22125q1741j03609
$$ -241989 -149375 177 46241 61838 171259 246795 201442 273739 395864 314123 210514
23152B10514r7260k986q2974J39133J72685M0542k47894k06089K9699p37m0568
$$ 210514 113254 110268 27294 166427 339112 379654 131760 -74329 -44630 -45367 -85935
23141h5935O8057p293N3853K0999l9546J6426o2438p6806k160J1642Q5642j21454
$$ -85935 -17878 -25171 28682 49681 10135 26561 -35877 -112683 -114843 -103201 -17559 -139013
23129a39013m0355R950J75525J93776m2147r3434j23643J14824L2917r2795j66916
$$ -139013 -179368 -169418 6107 199883 157736 64302 -59341 55483 88400 -4395 -171311
23118a71311J49188J60371m5908l9143M9317J08337O8099j39680l31181N2099
$$ -171311 -22123 138248 92340 53197 102514 210851 278950 139270 -191911 -139812
23108a39812J32205J6586n3088p957O2086P014q8196K7321R761J07233k8932j0121
$$ -139812 -7607 8979 -44109 -52066 10020 17034 -71162 -43841 -34080 73153 44221 34100
23096C4100N2822O9140r0207O268J02616k0574k2004p9497o1155P6692j8805j05997
$$ 34100 86922 156062 65855 72123 174739 154165 132161 52664 -8491 68201 49396 -56601
23084e6601j01969J3617R990J18886J43177M7009L1713j07179o5703N4357M7504
$$ -56601 -158570 -144953 -134963 -16077 127100 174109 205822 98643 32940 87297 134801
23073A34801m6782n2147q4844k2833M0711O5576n707j44987j19981J05923K02177
$$ 134801 88019 35872 -48972 -71805 -31094 34482 28775 -116212 -236193 -130270 71907
23062G1907q677m0181k8645L8532L2056j40223n8665R6284N0942J07926J03865
$$ 71907 63230 23049 -5596 32936 64992 -75231 -133896 -37612 13330 121256 225121
23051B25121J87116N6195j93570l2200q1399k21449j02055j12676n7551J77586
$$ 225121 412237 468432 274862 242662 161263 -60186 -162241 -274917 -332468 -154882
23041a54882M3837J348R3445P1559J37208M7121K7595k09370j16745n0932L4336
$$ -154882 -111045 -109697 -16252 55307 192515 239636 267231 57861 -58884 -109816 -75480
23030g5480N7201L2211p949J4330Q9358o4936J5336q6792P0875P7410k3539K6298
$$ -75480 -18279 13932 5983 20313 109671 44735 60071 -26721 44154 121564 98025 124323
23018A24323Q5435J07384j84028j73235M2303K7165R680k9909M0565J55788r7788
$$ 124323 209758 317142 133114 -40121 2182 29347 39027 9118 49683 205471 107683
23007A07683L411Q3191K2952n4610p2348j34864N8175M5094J5370R2800J38366
$$ 107683 111094 194285 217237 162627 90279 -44585 13590 58684 74054 166854 305220
22996C05220o3226q3680j5004L2814J20988N8539O0685j76599j19418M1951p4919
$$ 305220 241994 158314 143310 176124 297112 355651 416336 239737 120319 162270 87351
22985H7351m5874J49346p9135p0558l3441J30164p095k00421j73460J29336K0033
$$ 87351 41477 190823 111688 41130 7689 137853 130758 -69663 -243123 -113787 -93754
22974i3754j39266Q0349J13617O3074o3887L4435L13861P5279j02014j18082n294
$$ -93754 -233020 -152671 -39054 24020 -39867 -5432 308429 383708 281694 163612 158318
22963A58318J7455L7636J56224J6319J09356o5341j49226j05096o294K3184Q3994
$$ 158318 175773 213409 369633 385952 495308 429967 280741 175645 169351 192535 276529
22952B76529m9451j27583m265k8515m3757j373R42L4254k9397l7610Q328L3155
$$ 276529 227078 99495 95230 66715 22958 21585 22527 56781 27384 -10226 -1898 31257
22940C1257n5371n7727K51823P6524j03686n1185O6576K280p0895O3659j7905
$$ 31257 -24114 -81841 169982 246506 142820 91635 158211 160491 89596 153255 135350
22929A35350N024J76071m7454p5050n8940J4255l0560r6085j04312N9664K2977
$$ 135350 140374 316445 268991 193941 135001 149256 118696 22611 -81701 -22037 940
22918I40J24554n5645k8077J05954N151L8608j06450M2536O6263n9279o622m8770
$$ 940 125494 69849 41772 147726 152877 191485 85035 127571 193834 134555 127933 79163
22906G9163p9993M9274l9828j28231k504j860J56180m4991j40737J9250Q9620
$$ 79163 -830 48444 8616 -119615 -122119 -123979 32201 -12790 -153527 -134277 -44657
22895d4657J56142P039L83N3741J4956j68953k35316j25421j36927l8582N6042
$$ -44657 111485 118524 118907 172648 187604 18651 -216665 -342086 -479013 -517595 -461553
22884d61553J84569O2408N8790N6899P4909q6871p9464J61934J71159p2313j5750
$$ -461553 -276984 -214576 -155786 -98887 -23978 -110849 -190313 -28379 142780 70467 54717
22873E4717Q86k0916Q592N639R0981k7782k9432K4998R7403k1881k2090K8284
$$ 54717 55603 34687 43279 48918 139899 112117 82685 107683 205086 183205 161115 189399
22861A89399k3449j5891j64360m8732l6881R8253K8096j0301J6206P7768J0217
$$ 189399 165950 150059 -14301 -63033 -99914 -1661 26435 16134 32340 110108 120325
22850A20325r0091o9688Q4501n2207o2440M5667j43643k176N4411P5738J77517
$$ 120325 30234 -39454 45047 -7160 -69600 -23933 -167576 -169752 -115341 -39603 137914
22839A37914n317J01606M2587m5560q4944N9827R3964N5716J2296J37930Q5268
$$ 137914 132597 234203 276790 231230 146286 206113 300077 355793 368089 506019 591287
22828E91287O5542M2205O9116j0776j73982j08848j6268j6636J26415L2554n5164
$$ 591287 656829 699034 768150 757374 583392 474544 458276 441640 568055 600609 545445
22817E45445j8020J58523J19780J4298m9567o9708j10977N0039Q4688P7019j10368
$$ 545445 527425 685948 805728 820026 770459 700751 589774 639813 724501 801520 691152
22806F91152k07597k405J59063J50712j07815r8569J60126R726k30741m3539Q7874
$$ 691152 483555 481150 640213 790925 683110 584541 744667 754393 523652 480113 567987
22795E67987K10588L6370o661r776n9015K6085J0950N0983K9400J18544K09971
$$ 567987 778575 814945 808284 798508 739493 765578 776528 827511 856911 975455 1185426
22784A185426L90689M16258N48740K37246P3040q6187m18189l00166j30358j65508
$$ 1185426 1576115 1992373 2541113 2778359 2851399 2765212 2347023 2046857 1916499 1750991
22774A750991k26961r8794j57086p1405M2476o102j03189r731q446j2995J16453
$$ 1750991 1524030 1425236 1268150 1196745 1239221 1233119 1129930 1120199 1111753 1098758 1215211
22763A215211L8210J31823n7191l5029M9418Q0694n6858K538j27003l7917K0033
$$ 1215211 1253421 1385244 1328053 1293024 1342442 1423136 1366278 1368816 1241813 1203896 1223929
22752A223929M6827J55077R2116J05676K2523J50275N73p1189L4312J08176L6309
$$ 1223929 1270756 1425833 1517949 1623625 1646148 1796423 1796996 1725807 1760119 1868295 1904604
22741A904604J59288L1015Q3011J57132K7684J61857L27363J54743J28773K65036
$$ 1904604 2063892 2094907 2177918 2335050 2362734 2524591 2851954 3006697 3135470 3400506
22731C400506J58289J83912L02184J67196J61026L49376L49063M57332N88833
$$ 3400506 3558795 3742707 4044891 4212087 4373113 4722489 5071552 5528884 6117717
22722F117717N86291P06772Q33962R79061J093938J170867J528977K027491K613623
$$ 6117717 6704008 7410780 8244742 9223803 10317741 11488608 13017585 15045076 17658699
22713A7658699L369494M305080O126914Q698851J2754826J9763277L1920923M6860896
$$ 17658699 21028193 25333273 31460187 40159038 52913864 72677141 104598064 151458960
22705A51458960N5695672N8228176N4576917L6238054R585418j6105173l4699671
$$ 151458960 207154632 265382808 319959725 356197779 365783197 349678024 314978353
22698C14978353m3504517m5339918l9534024l0277917k2727131j7949392j5005136
$$ 314978353 271473836 226133918 186599894 156321977 133594846 115645454 100640318
22691A00640318j2460903j0271919q180344o727875n556898m614910m145100l819358
$$ 100640318 88179415 77907496 69727152 62999277 57442379 52827469 48682369 44863011
22683D4863011l370006k914679k550618k299399j975249j630427j454891j385423
$$ 44863011 41493005 38578326 36027708 33728309 31753060 30122633 28667742 27282319
22675B7282319j277449j029723j068945j122937j185703j023639r09991r03075
$$ 27282319 26004870 24975147 23906202 22783265 21597562 20573923 19663932 18760857
22667A8760857p72213n84215o77278n13915l87633n03814l79402l44803m74194
$$ 18760857 17988644 17404429 16727151 16213236 15825603 15321789 14942387 14597584 14123390
22658A4123390o37324n93044o49758m86892l36086k04765k17230m84300m68815
$$ 14123390 13486066 12893022 12243264 11756372 11420286 11215521 10998291 10513991 10045176
22649A0045176k27663k54731l51798j83499k88859l19567l22178m00659k95354
$$ 10045176 9817513 9562782 9210984 9027485 8738626 8419059 8096881 7696222 7400868
22640G400868j03515r2048m1413l3573j13170k07441k0231j34939l25640j88345
$$ 7400868 7297353 7205305 7163892 7130319 7017149 6809708 6789477 6654538 6328898 6140553
22630F140553q2436n4682j03278n4895J3675O7339P7969K57609P2047J00490L590
$$ 6140553 6058117 6003435 5900157 5845262 5858937 5926276 6004245 6261854 6333901 6434391 6437981
22619F437981l17611l66269l05567l73836k68675k34612k41733o4864j20807j89041
$$ 6437981 6120370 5754101 5448534 5074698 4806023 4571411 4329678 4264814 4144007 3954966
22609C954966l26733j77102j05324r9900Q3640n1003j90532p1629j82795j65155
$$ 3954966 3628233 3451131 3345807 3245907 3329547 3278544 3088012 3016383 2833588 2668433
22599B668433j41205p4096n3793r7607r7604j42113l0894N508p0670j47592Q7707
$$ 2668433 2527228 2453132 2399339 2301732 2204128 2062015 2031121 2036629 1965959 1818367 1906074
22588A906074J8153j10265r3028P3393L2452j15215q816Q0857Q4280r4338k59080
$$ 1906074 1924227 1813962 1720934 1794327 1826779 1711564 1702748 1783605 1867885 1773547 1514467
22577A514467p3331N4189n1448P3308Q4943m8587J18169L5013j64610L5009M1586
$$ 1514467 1441136 1495325 1443877 1517185 1602128 1553541 1671710 1706723 1542113 1577122 1618708
22566A618708j85665j43158j53821n9370L4929L0230P8820m5501m9682m1273l8105
$$ 1618708 1433043 1289885 1136064 1076694 1111623 1141853 1220673 1175172 1125490 1084217 1046112
22555A046112j74980j25910o802n8328P3109O6918M4802J5430k759r7818L3470
$$ 1046112 871132 745222 738420 680092 753201 820119 864921 880351 877592 779774 813244
22544H13244k0137j08241M310L2965k2900K4703J07393R8131K6763m2554n884
$$ 813244 793107 684866 689176 722141 699241 723944 831337 929468 956231 913677 907793
22533I07793k6834j01693J1508j29963M3153J13812J03395n2873p5342j05146
$$ 907793 880959 779266 790774 660811 703964 817776 921171 868298 792956 687810
22523F87810j18512Q372q9904K3158P0428J16884R148n2398J8102J6796p1067
$$ 687810 569298 577670 487766 510924 581352 698236 707384 654986 673088 689884 618817
22512F18817M6478J5734m4980J05847J8758j86199q2286P8246m19k1700N2967
$$ 618817 665295 681029 636049 741896 760654 574455 492169 570415 569996 548296 601263
22501F01263m8904j82178k15963n7502M7410k6292J21024J06850J5526P4298j24430
$$ 601263 552359 370181 154218 96716 144126 117834 238858 345708 361234 435532 311102
22490C11102r3583L1400L7127K9249j1643K705M2568j3116j70620k10887L8123
$$ 311102 217519 248919 286046 315295 303652 306357 348925 335809 165189 -45698 -7575
22479g575J55863K02017K9002r8031p0306l610m7461n1177j05696N3474J84184
$$ -7575 148288 350305 379307 281276 210970 207360 159899 108722 3026 56500 240684
22468B40684N6369j87676j68626J42072J26984L8535J893n5166P5590r2310K5539
$$ 240684 297053 109377 -59249 82823 209807 248342 250235 195069 270659 178349 203888
22457B03888n9785K8918q6095l3748J2883n8889l9984M3367P8815J07132J063
$$ 203888 144103 173021 86926 53178 66061 7172 -32812 10555 89370 196502 197565
22446A97565m4718N9621O881k3679p0370m8992J38240O7002K5562l6916O7276
$$ 197565 152847 212468 219349 195670 125300 76308 214548 281550 307112 270196 337472
22435C37472R5091l2371p1545l1384j45374n1234m1046r1623L665m7996P365M3543
$$ 337472 432563 400192 328647 297263 151889 100655 59609 -32014 -28349 -76345 -68980 -25437
22423b5437K0579L9893J36560M7213k00900j74429J06763K22822j18073p1508
$$ -25437 -4858 35035 171595 218808 17908 -156521 -49758 173064 54991 -16517
22413a6517j074L1664o9476M1368k5874j28180l0829K14971J53193J82330J1689
$$ -16517 -17591 14073 -55403 -14035 -39909 -168089 -198918 16053 169246 351576 363265
22402C63265j31090j74960j10145J0875j6706k9203M1167J67469J24587q8794
$$ 363265 232175 57215 -52930 -42055 -58761 -87964 -46797 120672 245259 156465
22392A56465k61105J4587p3480P195J44919n2350p0079r5652j3637N0231K7535
$$ 156465 -104640 -90053 -163533 -156338 -11419 -63769 -133848 -229500 -243137 -192906 -165371
22381a65371J84489J23537n3730j83200k43841j073J50774J06706n261r1020P4935
$$ -165371 19118 142655 88925 -94275 -338116 -339189 -188415 -81709 -86970 -177990 -103055
22370a03055M7011O8579K6966J19299j1950j17351j24421L0637Q0413K18q5414
$$ -103055 -56044 12535 39501 158800 146850 29499 -94922 -64285 16128 16346 -69068
22359f9068j96538o5837J69198J81191P7433P6734j05616n5748j7958Q7449J11785
$$ -69068 -265606 -331443 -162245 18946 96379 173113 67497 11749 -6209 81240 193025
22348A93025J7726j06927j23571k7516R5222K9464o4248N2455K2446j01605o6747
$$ 193025 210751 103824 -19747 -47263 47959 77423 13175 65630 88076 -13529 -80276
22337h0276j4151J10065K482J26705P2749J9470L2663l608K0202j29672k18624
$$ -80276 -94427 15638 18120 144825 217574 237044 269707 266099 286301 156629 -61995
22326f1995N5428Q4210K3036k3034m402N857O7464O6818j20076l5452J05453m2823
$$ -61995 -6567 77643 100679 77645 73243 79100 146564 213382 93306 57854 163307 120484
22314A20484L5727o7903O401O1419j66045j15281K5634K3634q8321Q1585J43250
$$ 120484 156211 88308 94709 156128 -9917 -125198 -99564 -75930 -164251 -82666 60584
22303F0584P0521j7246m1311O2217L9531J0307n7075o6688J100n6015P615m4249
$$ 60584 131105 113859 72548 134765 174296 184603 127528 60840 61940 5925 13540 -30709
22291c0709l1414O0513j5436j8204j1128m0140J3274K0843o1146j82121j5500
$$ -30709 -62123 -1610 -17046 -35250 -46378 -86518 -73244 -52401 -113547 -295668 -311168
22280c11168P7641J5483J08863N6347r6013n3648K28113O3029p0925j62810N3350
$$ -311168 -233527 -218044 -109181 -52834 -148847 -202495 25618 88647 17722 -145088 -91738
22269i1738O396j22091K8608J84276N1586j26513o34L7686Q1136J3523n89j28985
$$ -91738 -85342 -207433 -178825 5451 57037 -69476 -70110 -32424 48712 62235 61646 -67339
22257f7339Q6001J54024J594K3739o107l2586o4306k034r279k9485M8664O077
$$ -67339 18662 172686 174280 198019 191912 159326 95020 92986 83707 54222 102886 108963
22245A08963p7466l5172r6999r02j7358L5068o5611k11248o227K6858K04410J86054
$$ 108963 31497 -3675 -100674 -101576 -118934 -83866 -149477 -360725 -366952 -340094 -135684 50370
22233E0370p972j0816J13624Q546k6232o2178j25593j8238M3117Q4206J22194
$$ 50370 42398 31582 145206 153752 127520 65342 -60251 -78489 -35372 48834 171028
22222A71028j25578m2600J321l3342o9379q2336J40358J41749m8201o9232j20367
$$ 171028 45450 2850 4171 -29171 -98550 -180886 -40528 101221 53020 -16212 -136579
22211a36579l6945O170M3206O7592R5855J11965p3871m7601p7769P6972j2725
$$ -136579 -173524 -167354 -124148 -56556 39299 151264 77393 29792 -47977 28995 16270
22200A6270O4389L3860M4267m3263n3934M3051K8875J42965m5088k10109j52046
$$ 16270 80659 114519 158786 115523 61589 104640 133515 276480 231392 21283 -130763
22189a30763m6555J33167J30723j06205q7210j30603r0560J04505l3791J25742
$$ -130763 -177318 -44151 86572 -19633 -106843 -237446 -328006 -223501 -257292 -131550
22179a31550R7765l1638r6426Q8236K1110J29438K8296q8405q087o3092J2708
$$ -131550 -33785 -65423 -161849 -73613 -52503 76935 105231 16826 8739 -54353 -41645
22168d1645J8532j9070M8556N8852j05329m1597J20630K8687N3388J915p1608
$$ -41645 -23113 -42183 6373 65225 -40104 -81701 38929 67616 121004 122919 51311
22157E1311q2955K7603K8536m3921j6183j0897K6505J6863r8252R5433Q1476q2634
$$ 51311 -31644 -4041 24495 -19426 -35609 -46506 -20001 -3138 -101390 -5957 75519 -7115
22145g115m2426m0268O7250J5626Q464l4482R0382R9619P2795K28075K63605L50740
$$ -7115 -49541 -89809 -22559 -6933 1531 -32951 57431 157050 229845 457920 721525 1072265
22133A072265L42607L28082J53487J1142m0121l04512j95767k15953k74888j00531
$$ 1072265 1414872 1742954 1896441 1907583 1867462 1562950 1367183 1151230 876342 775811
22123G75811j2417q9338o1013j32953o1338L1010l2707r9471p2196o5815n8592
$$ 775811 763394 674056 613043 480090 418752 449762 417055 317584 245388 179573 120981
22112A20981j7905M3323Q0283j1819j4037J0261N0764Q7077m8410l6245j33626
$$ 120981 103076 146399 226682 214863 200826 211087 261851 348928 300518 264273 130647
22101A30647r3489l2344J2571j5029N6235k6408j3441K8135r3631N5827J03722
$$ 130647 37158 4814 17385 2356 58591 32183 18742 46877 -46754 9073 112795
22090A12795n1826m7116m3692r0612M9570n7725l4107l7586q819J50612O1434
$$ 112795 60969 13853 -29839 -120451 -70881 -128606 -162713 -200299 -209118 -58506 2928
22079B928m6527N6437n1589q7917N5344R0823j8223j0743R1249L1698o8156k9785
$$ 2928 -43599 12838 -38751 -126668 -71324 19499 1276 -9467 81782 113480 45324 15539
22067A5539J28073J3176k037J14988j02534q2853P1106Q4450m1274n4784q0925
$$ 15539 143612 156788 154751 269739 167205 84352 155458 239908 198634 143850 62925
22056F2925j2402K1103J6078j32667j6990J15749q3681k8803r0158M5867J34601
$$ 62925 50523 71626 87704 -44963 -61953 53796 -29885 -58688 -148846 -102979 31622
22045C1622J21986j11002j35052K9333K06283J38187j73739j21400O5374M7643
$$ 31622 153608 42606 -92446 -63113 143170 281357 107618 -13782 51592 99235
22035I9235M5668O109m0484q4285J3803Q8549r8114o1841p3145o1847R0159p1189
$$ 99235 144903 151012 110528 26243 40046 128595 30481 -31360 -104505 -166352 -76193 -147382
22023a47382m7835L7124J11904K1721M3607k944j2252J28537q2596j11658j26500
$$ -147382 -195217 -158093 -46189 -24468 19139 16195 3943 132480 49884 -61774 -188274
22012a88274l3190Q8904k4047q083J27181m0377J0522p4821M1765k7915j37801
$$ -188274 -221464 -132560 -156607 -164690 -37509 -77886 -67364 -142185 -100420 -128335 -266136
22001b66136q300J03508n0377q8345J26104n2570K8235R5390L3124P0834p685
$$ -266136 -274436 -170928 -221305 -309650 -183546 -236116 -207881 -112491 -79367 -8533 -16218
21990a6218j72207j3141M5784Q0651J54055J23066M2246L4088j07707j12694p1774
$$ -16218 -188425 -201566 -155782 -75131 78924 201990 244236 278324 170617 57923 -13851
21979a3851j7771l3631l2199k9062o5549L0010J73604J3443j42400j14966p751
$$ -13851 -31622 -65253 -97452 -126514 -192063 -162053 11551 24994 -117406 -232372 -240123
21968b40123K9849Q7727J26027q475N0240r3220j0245p0456J8660k8305L7690
$$ -240123 -210274 -122547 3480 -4995 45245 -47975 -58220 -128676 -110016 -138321 -100631
21957a00631J43247J28373j20768M0517l7164m5635N9431l6660n2526N9961p488
$$ -100631 42616 170989 50221 90738 53574 7939 67370 30710 -21816 38145 30657
21946C0657j9647j06736j6799R3888k7603P1341J76872k9576k57693j01002M6504
$$ 30657 11010 -95726 -112525 -18637 -46240 25101 201973 172397 -85296 -186298 -139794
21935a39794J19333J32853Q4086j03224j17422j51791m9478J86138j0902j51270
$$ -139794 -20461 112392 196478 93254 -24168 -175959 -225437 -39299 -50201 -201471
21925b01471m8632J71784P2736O3054J8177N4021o0523L9943l2065m0184O3569
$$ -201471 -250103 -78319 -5583 57471 75648 129669 69146 109089 77024 36840 100409
21914A00409l6647j23488l1797J80554N143r8086j17554n6882K6183M1210J1152
$$ 100409 63762 -59726 -91523 89031 94174 -3912 -121466 -178348 -152165 -110955 -99803
21903i9803R1355J66149P0665O8938j39487j14185j5582P2243K0656P4892j18614
$$ -99803 -8448 157701 228366 297304 157817 43632 28050 100293 120949 195841 77227
21892G7227k31168l4098J13412m9998j6111R1349J09534m2752o566K5533j86745
$$ 77227 -153941 -188039 -74627 -124625 -140736 -49387 60147 17395 10829 36362 -150383
21881a50383o1138J12231J75512j69326K3051j5558m0538k4313J0161J07704K1608
$$ -150383 -211521 -99290 76222 -93104 -70053 -85611 -126149 -150462 -140301 -32597 -10989
21870a0989n4915k7604J40462K6640j18255R2913R0746n8864r6716M2952J6291
$$ -10989 -65904 -93508 46954 73594 -44661 48252 138998 80134 -16582 26370 42661
21859D2661j13891N7970L7145n9661l2269m8449L9989J12305m4792j07227p9792
$$ 42661 -71230 -13260 23885 -35776 -68045 -116494 -76505 35800 -8992 -116219 -196011
21848a96011n1912J34688K04388m9970k6470O8917R5341k0395j6773k9675j53865
$$ -196011 -247923 -113235 91153 41183 14713 83630 178971 158576 141803 112128 -41737
21837d1737j00537o2284J53026Q1863m222K5593j4106Q3566J6985j02799k5604
$$ -41737 -142274 -204558 -51532 30331 26109 51702 37596 121162 138147 35348 9744
21826I744N7837k2850r1663j02773l0325Q9222r014J825k4000M3276K11567J0911
$$ 9744 67581 44731 -46932 -149705 -180030 -90808 -99822 -97997 -121997 -78721 132846 143757
21814A43757j36870j8905n9429L591K9739J38123J2780m7765j6055q5503j2552
$$ 143757 6887 -12018 -71447 -67856 -38117 100006 112786 65021 48966 -36537 -49089
21803d9089O650J67537Q4495n677J06428j31179j05492k5767j96207R3284R6329
$$ -49089 -42439 125098 209593 203916 310344 179165 73673 47906 -148301 -55017 41312
21792D1312j23998P2240o7682J44304Q0317p5008j9710r8424Q816j21022o1047
$$ 41312 -82686 -10446 -78128 66176 146493 71485 51775 -46649 -37833 -158855 -219902
21781b19902M8544Q6815M9978j31590r2985J14128P6154L2317J97801l419q1603
$$ -219902 -171358 -84543 -34565 -166155 -259140 -145012 -68858 -36541 161260 157841 76238
21770G6238j3133j18007j66308L0427J31785j4696O0800M2839K1613j5681r759
$$ 76238 63105 -54902 -221210 -190783 -58998 -73694 -12894 29945 51558 35877 26118
21759B6118O7656K443q029M6671p6896p7677j19056k8134Q8624M8478J60888l3322
$$ 26118 93774 96217 88188 134859 57963 -19714 -138770 -166904 -78280 -29802 131086 97764
21747I7764j04247N9281J49182l2452j01259j25525l3246O1421p0919p6189M1473
$$ 97764 -6483 52798 201980 169528 68269 -57256 -90502 -29081 -100000 -176189 -134716
21736a34716k491M8105J18960M1815Q7742r4043L267j04876n5328K0673N9388
$$ -134716 -137207 -89102 29858 71673 159415 65372 68639 -36237 -91565 -70892 -11504
21725a1504N5355n4037j81432p0742J04054J75740o7081P798m5324L9893J08000
$$ -11504 43851 -10186 -191618 -262360 -158306 17434 -49647 -41849 -87173 -47280 60720
21714F0720q2648R3609k6363k25216j92411Q2403R7256Q3895M9774n5944j00685
$$ 60720 -21928 71681 45318 -179898 -372309 -289906 -192650 -108755 -58981 -114925 -215610
21703b15610j7106J56759m4703Q9632j14903q9190J9687J9562N9748k6944j11791
$$ -215610 -232716 -75957 -120660 -31028 -145931 -235121 -215434 -195872 -136124 -163068 -274859
21692b74859R4550Q722M6799L7294J9835N4357J61325J9815r1318P376P9854m4912
$$ -274859 -180309 -171587 -124788 -87494 -67659 -13302 148023 167838 76520 83896 163750 118838
21680A18838j34916j41980r7370R7941K798n7513j36330k168J67760J60530q5575
$$ 118838 -16078 -158058 -255428 -157487 -154689 -212202 -348532 -350700 -182940 -22410 -107985
21669a07985o3046J6174J10684N6792p7324M5395j12073j60111m591N5012O9192
$$ -107985 -171031 -154857 -44173 12619 -64705 -19310 -131383 -291494 -296085 -241073 -171881
21658a71881l2951R8210P8369j16776l8276J776M9799q1690q0037J69089J07408
$$ -171881 -204832 -106622 -28253 -145029 -183305 -181529 -131730 -213420 -293457 -124368 -16960
21647a6960N4443M0588j0943L5925j1892q4199N6665j8615J0621k25355o4841
$$ -16960 37483 78071 67128 103053 91161 6962 63627 45012 55633 -169722 -234563
21636b34563R7925k0731J06237J0209L6343n360p1676j47324k7561N0710O0512
$$ -234563 -136638 -157369 -51132 -40923 -4580 -9940 -81616 -228940 -256501 -205791 -145279
21625a45279K6084J59806n650k566j3807q8003j3742J947o085j0218M7199J59893
$$ -145279 -119195 40611 34961 32395 18588 -69415 -83157 -81210 -87295 -97513 -50314 109579
21613A09579j8029j72294J85812J8730q7225L0067p1081m231J1946q445j04887
$$ 109579 91550 -80744 105068 123798 36573 66640 -4441 -8672 3274 -5171 -110058
21602a10058j42040J52125J78417R592j41548j66575L0560J04079j4528l2453
$$ -110058 -252098 -99973 78444 88036 -53512 -220087 -189527 -85448 -99976 -132429
21592a32429J05621j4823p8381R7481j39261k8668K4629O8481J9430L5032J08950
$$ -132429 -26808 -41631 -120012 -22531 -161792 -190460 -165831 -97350 -77920 -42888 66062
21581F6062n9317m6237K2091J5629O5485j3117m1554R912k13854N5376R5906j01145
$$ 66062 6745 -39492 -17401 -1772 63713 50596 9042 18954 -194900 -139524 -43618 -144763
21569a44763k0920O7709O0022M3754j47434n579J41183j21893j7710N8873Q2078
$$ -144763 -165683 -97974 -37952 5802 -141632 -147211 -6028 -127921 -145631 -86758 -4680
21558d680l6769m5419q7024R210l2531Q5676L6101J856l3746Q034m663P0671J03473
$$ -4680 -41449 -86868 -173892 -164682 -197213 -111537 -75436 -73580 -107326 -99292 -103955 -33284 70189
21545G0189o5420j13550r2558m3280O5686n4544o7065m4241M5103P9321j7209
$$ 70189 4769 -108781 -201339 -244619 -178933 -233477 -300542 -344783 -299680 -220359 -237568
21534b37568N8158Q4389J15048P9799Q339j28613r559O0916K7881K2994K6925
$$ -237568 -179410 -95021 20027 99826 108165 -20448 -30007 30909 58790 81784 108709
21523A08709l0333j43621J0462O0628p3081P054K244p9613L434Q0495P8750K5441
$$ 108709 78376 -65245 -54783 5845 -67236 -60182 -57938 -137551 -134117 -53622 25128 50569
21511E0569m5880p2646k1055K5543j49730j0744j4524r5571J40723Q1052p1546
$$ 50569 4689 -67957 -89012 -63469 -213199 -223943 -238467 -334038 -193315 -112263 -183809
21500a83809k99689m1654K07775N7253J3163M6920P0981R2492j3864n4886l5363
$$ -183809 -483498 -525152 -317377 -260124 -246961 -200041 -129060 -36568 -50432 -105318 -140681
21489a40681J61353p9748n5077J8494K9976j15294J81609R9524j8721n8625l8880
$$ -140681 20672 -59076 -114153 -95659 -65683 -180977 632 100156 81435 22810 -16070
21478a6070J58671k7643O8171q6470j48243o8045K7831J72444J42000q6394r8472
$$ -16070 142601 114958 183129 96659 -51584 -119629 -91798 80646 222646 136252 37780
21467C7780r9514M7153n3788q8445P0219Q4316Q6613M3589J4026l6960m9391l6679
$$ 37780 -61734 -14581 -68369 -156814 -86595 -2279 84334 127923 141949 104989 55598 18919
21455A8919Q4989M5334p7049j04649o3498k94j2332o5999N0516K42302L4945n2309
$$ 18919 103908 149242 72193 -32456 -95954 -96248 -108580 -174579 -124063 118239 153184 100875
21443A00875q1691j29521j18246J4398J57292J23236q305M3228P1229O6101j8239
$$ 100875 19184 -110337 -228583 -214185 -56893 66343 58038 101266 172495 238596 220357
21432B20357N5499k3775q7904j5371n7167j10672p2433J4650k9035L126P5754
$$ 220357 275856 252081 164177 148806 91639 -19033 -91466 -76816 -105851 -102725 -26971
21421b6971R3900P0937j5896j44730J01561j02804j21051k7524J50014j3075n8829
$$ -26971 66929 137866 121970 -22760 78801 -24003 -145054 -172578 -22564 -35639 -94468
21410i4468Q022p9622K276K5723k6745J31946O0583l0658j05933J54791N2898
$$ -94468 -86446 -166068 -163792 -138069 -164814 -32868 27715 -2943 -108876 45915 98813
21399I8813j06493n9176m5287j29792O6716J03396L8579Q724k655k9519l209J47996
$$ 98813 -7680 -66856 -112143 -241935 -175219 -71823 -33244 -24520 -27175 -56694 -59903 88093
21387H8093O1409Q8683j62888p2960n677m5575p1670K0379n3239Q3678L161p9195
$$ 88093 149502 238185 75297 2337 -3340 -48915 -120585 -100206 -153445 -69767 -66606 -145801
21375a45801L7300l0172j9878j8534k4323m0529j1537k813R4262J12961j02393
$$ -145801 -108501 -138673 -158551 -177085 -201408 -241937 -253474 -256287 -162025 -49064 -151457
21364a51457j10613M7097Q161n475R5573O9323k1355Q4517j5029j86782L9490
$$ -151457 -262070 -214973 -206812 -212287 -116714 -47391 -68746 15771 742 -186040 -146550
21353a46550J58512r4494j92239M3790L4792J45161J41558M970K4746p1781o026
$$ -146550 11962 -82532 -274771 -230981 -196189 -51028 90530 95500 120246 48465 42439
21342D2439J4447Q9544n3024j47690R427m2205J6524J11347j04542m8471M2446
$$ 42439 56886 146430 93406 -54284 -44857 -87062 -70538 40809 -63733 -112204 -69758
21331f9758k5867J77794l8844K0121l8212l8697j02641L0142K6209p1964q7536
$$ -69758 -95625 82169 43325 63446 25234 -13463 -116104 -85962 -59753 -131717 -219253
21320b19253R6509J32163M5906j5549l05r7863o7586P7294J45390j19314j19178
$$ -219253 -122744 9419 55325 39776 39471 -58392 -125978 -48684 96706 -22608 -141786
21309a41786J16208R6633M4287m7957P3413k6197j29775J19977R7200l2062r3645
$$ -141786 -25578 71055 115342 67385 140798 114601 -15174 104803 202003 169941 76296
21298G6296q7945J45245r6896Q8195J16012j24079j84304O2745J02938l970k0444
$$ 76296 -11649 133596 36700 124895 240907 116828 -67476 -4731 98207 94237 73793
21287G3793m2221k664n3223j45376j13457n3266J02272Q6561n5628j6798J70664
$$ 73793 31572 28908 -24315 -169691 -283148 -336414 -234142 -147581 -203209 -220007 -49343
21276d9343J03531o0315Q74p3991r4102P5121K16157J1506n3940j8898L6146m1617
$$ -49343 54188 -6127 -5253 -79244 -173346 -98225 117932 129438 75498 56600 92746 51129
21264E1129p8156j00594j18773n4833Q8752J81088J0312q7666n2821k9540P636
$$ 51129 -27027 -127621 -246394 -301227 -212475 -31387 -21075 -108741 -161562 -191102 -183466
21253a83466j33844k0012Q1734P9462K5313O3691N7251J58471P5244l0912j29357
$$ -183466 -317310 -337322 -255588 -176126 -150813 -87122 -29871 128600 203844 172932 43575
21242D3575k35756m6156M3295J28669l119o2589q6986J74479K18867j78665j89139
$$ 43575 -192181 -238337 -195042 -66373 -69492 -132081 -219067 -44588 174279 -4386 -193525
21231a93525m356J20211M2289L3342N1885l9140K4656M6497o8551r8885p5214
$$ -193525 -197881 -77670 -35381 -2039 49846 10706 35362 81859 13308 -85577 -160791
21220a60791n135R5942J17776n1375o6105L3263M30P2239M5637j46083j05026
$$ -160791 -165926 -69984 47792 -3583 -69688 -36425 -35995 36244 81881 -64202 -169228
21209a69228M4261J46223p3576k9152R6696J09140l8221L5470n912j39557j3708
$$ -169228 -124967 21256 -52320 -81472 15224 124364 86143 121613 115701 -23856 -37564
21198c7564L2025j6401j22292k10099j0917K77767K60745K8975k5234J7883j09260
$$ -37564 -5539 -21940 -144232 -354331 -365248 -87481 173264 202239 177005 194888 85628
21187H5628q2277l5005j29271N1262J39507R1531j3801q9633K683N9246j1906
$$ 85628 3351 -31654 -160925 -109663 29844 121375 107574 17941 20624 79870 67964
21176F7964J22260J21769M4551j87798k07355N3541P8495o9299M8345J14921n6853
$$ 67964 190224 311993 356544 168746 -38609 14932 93427 24128 72473 187394 130541
21165A30541p2518j3710J24802J6844o2399m0967m366l8694m9102M4003l9222
$$ 130541 58023 44313 169115 185959 123560 82593 78227 39533 -9569 34434 -4788
21154d788j34026J700J1734k2533j02540k3161P2394m616Q2365N9074J39711M6981
$$ -4788 -138814 -137114 -125380 -147913 -250453 -273614 -201220 -205836 -123471 -64397 75314 122295
21142A22295q6688j43735j43618j41022K8937J79234L5648j915o810q1791M6538
$$ 122295 35607 -108128 -251746 -392768 -363831 -184597 -148949 -150864 -157674 -239465 -192927
21131a92927M7124R3617k2256n5367l6777J4766J11148p7896l810Q9648j2811
$$ -192927 -145803 -52186 -74442 -129809 -166586 -151820 -40672 -118568 -122378 -32730 -45541
21120d5541j30550M688R8638K0300j13128l1962J21180k910n256m225N6379j0778
$$ -45541 -176091 -171403 -72765 -52465 -165593 -197555 -76375 -79285 -84541 -88766 -32387 -43165
21108d3165q5254o0373J60223J66093Q7749n6792L5818r8148L0709l0283k06344
$$ -43165 -128419 -188792 -28569 137524 225273 168481 204299 106151 136860 106577 -99767
21097i9767r8746k0279O9541L2705k3585n5407O1410K6663m9032J18340K2134
$$ -99767 -198513 -218792 -149251 -116546 -140131 -195538 -134128 -107465 -156497 -38157 -16023
21086a6023j16902r9303Q8079k8061N2210J6956k6324r551J13383L5522j40113
$$ -16023 -132925 -232228 -144149 -172210 -120000 -103044 -129368 -138919 -25536 9986 -130127
21075a30127q8353J23245J26506L8028L3253l9106n0249N1754l425o3018k6675
$$ -130127 -218480 -95235 31271 69299 102552 63446 13197 64951 61526 -1492 -28167
21064b8167j15501K6879P2921r424j6596P9364O5321j03512r4712M7606J9728
$$ -28167 -143668 -116789 -43868 -53292 -69888 9476 74797 -28715 -123427 -75821 -56093
21053e6093P1056j05858q4584R704o4187r1804J39047J41689j1101j3579l3866
$$ -56093 14963 -90895 -175479 -165775 -229962 -321766 -182719 -41030 -52131 -65710 -99576
21042i9576L1922q1412k4772N3142J36276J25039n4821j50674M4543J58249j4110
$$ -99576 -67654 -149066 -173838 -120696 15580 140619 85798 -64876 -20333 137916 123806
21031A23806K8184k7938M943k19692K4287J90481M7108j14630j25594l2038R2930
$$ 123806 151990 124052 128995 -90697 -66410 124071 171179 56549 -69045 -101083 -8153
21020h153Q0228k3745M454P0527m8382k8606l6209k07191J94181J03399j67835
$$ -8153 72075 48330 52784 123311 74929 46323 10114 -197077 -2896 100503 -67332
21009f7332q6237J44985o6023J0315J25385Q3133O1911Q9751j65484m5599n7325
$$ -67332 -153569 -8584 -74607 -64292 61093 144226 206137 295888 130404 84805 27480
20998B7480j29603m5418O0860l2455O9428P2929l7664j14920M812O660J92204
$$ 27480 -102123 -147541 -86681 -119136 -49708 23221 -14443 -129363 -124551 -117891 74313
20987G4313M9920l3201r4284J47098o755l9829j2951j92564L7415k9363J15790
$$ 74313 124233 91032 -3252 143846 137091 97262 84311 -108253 -70838 -100201 15589
20976A5589k8240j1415n7866m20J04165J59147n0636j37216J80874k60J1557J43718
$$ 15589 -12651 -24066 -81932 -82352 21813 180960 130324 -6892 173982 173722 185279 328997
20964C28997j91974j07815j56863p3497l2770J25152J38934n7523j105Q597o006
$$ 328997 137023 29208 -127655 -201152 -233922 -108770 30164 -27359 -28464 -19867 -25873
20953b5873M5024l5514Q397M4401o9941J25444r1466j53407o3291j05813K562
$$ -25873 19151 -16363 -7966 36435 -33506 91938 472 -152935 -216226 -322039 -319477
20942c19477R5572J6216R2765R5120Q4779n1801j04148o0210J84042L69n7505
$$ -319477 -223905 -207689 -114924 -19804 64975 13174 -90974 -151184 32858 33227 -24278
20931b4278O8812j39077k8530J25809K1868N1926Q8255M0945q1896l4557r2083
$$ -24278 44534 -94543 -123073 2736 24604 76530 164785 205730 123834 89277 -2806
20920b806k0029J28049k805m9126L4374N5616r4394k05549m5397j6015n6637Q7484
$$ -2806 -22835 105214 102409 53283 87657 143273 48879 -156670 -202067 -218082 -274719 -187235
20908a87235J35532O1919m7208J5119q2307P9029k6285l14j7581J2121P7182N2251
$$ -187235 -51703 10216 -36992 -21873 -104180 -25151 -51436 -51750 -69331 -57210 19972 72223
20896G2223K2050r3714R909l5964k6962J9589r3923M8719j917J35739P7575n86
$$ 72223 94273 559 10468 -25496 -52458 -32869 -126792 -78073 -79990 55749 133324 132738
20884A32738P6663L5165j7053p5733j47273M5701k5394j2312M7245K816P6437
$$ 132738 209401 244566 227513 151780 4507 50208 24814 12502 59747 62563 139000
20873A39000K4206K4244q8707K0158q1181j82845j13486J09051J47585J72618
$$ 139000 163206 187450 98743 118901 37720 -145125 -258611 -149560 -1975 170643
20863A70643j43978q7747j16910j05833k3260j8575J1211O9753J02492R426N7836
$$ 170643 26665 -61082 -177992 -283825 -307085 -325660 -314449 -244696 -142204 -132778 -74942
20852g4942J43221P368m0739L7931p215q8011N2339R1199j14788m3184n926O3143
$$ -74942 68279 75647 34908 72839 65624 -22387 29952 121151 6363 -36821 -42747 20396
20840B0396O2270J09524O7588q098K6433j0702n9645M1618p3668j15624O3332
$$ 20396 82666 192190 259778 251680 278113 267411 207766 249384 175716 60092 123424
20829A23424J87429j05362r7530P158K5569J1891k5558j82349k4397M659N8290
$$ 123424 310853 205491 107961 115119 140688 152579 127021 -55328 -79725 -75066 -16776
20818a6776k9944N5734J78175q5697j77331j28991M1029P4549L7272n7550N3438
$$ -16776 -46720 9014 187189 101492 -75839 -204830 -163801 -89252 -51980 -109530 -56092
20807e6092k0567m4986n4223r6503J24877K0647p4417J29071j9734L2749J10432
$$ -56092 -76659 -121645 -175868 -272371 -147494 -126847 -201264 -72193 -91927 -59178 51254
20796E1254O4324m2695k1105J13868m4881k8970m3403J45610J09068j37156j26306
$$ 51254 115578 72883 51778 165646 120765 91795 48392 194002 303070 165914 39608
20785C9608j78150j02986J10163J32531j25211r4030N1007q2190j6925J65390
$$ 39608 -138542 -241528 -131365 1166 -124045 -218075 -167068 -249258 -266183 -100793
20775a00793J68168K598K0074j12471p6253j7997n8084J07142J48336L5574o5097
$$ -100793 67375 69973 90047 -22424 -98677 -116674 -174758 -67616 80720 116294 51197
20764E1197R181m2182j87482o7434N242R6382O7603p8345n9599O2276j30469j03340
$$ 51197 60378 18196 -169286 -236720 -231478 -135096 -67493 -145838 -205437 -143161 -273630 -376970
20752c76970k5197R3496J53309P0323L3368l8410j02832q1151K7414Q5169Q4419
$$ -376970 -402167 -308671 -155362 -85039 -51671 -90081 -192913 -274064 -246650 -161481 -77062
20741g7062q02k0515j04665n8019k3430R2032K5485k1354Q1800R7321k3551J1857
$$ -77062 -77864 -98379 -203044 -261063 -284493 -192461 -166976 -188330 -106530 -9209 -32760 -20903
20729b0903k16135k484J68139M1717P4931k2689k0332M4860p3581m2012L4484
$$ -20903 -237038 -239522 -71383 -29666 45265 22576 2244 47104 -26477 -68489 -34005
20718c4005p912j22909l5879P8412L9941J33635L7754J1828l3629o1628l807n6739
$$ -34005 -41917 -164826 -200705 -122293 -82352 51283 89037 100865 67236 5608 1801 -54938
20706e4938K5694r8332k6767o7060p1201J02150J76743J4871n2608j70315O4363
$$ -54938 -29244 -127576 -154343 -221403 -292604 -190454 -13711 1160 -51448 -221763 -157400
20695a57400l9941j14655n4915L8310J59005J09537J15030R1694j5007k09865
$$ -157400 -197341 -311996 -366911 -328601 -169596 -60059 54971 146665 131658 -78207
20685g8207j08464M677J08401P9667J13373J2452n2758m4707m9940L567k6384
$$ -78207 -186671 -181994 -73593 6074 119447 131899 79141 34434 -15506 -11939 -38323
20674c8323M6991j03144m8356J41229O2443J40945q897j6965p264j04546P7707
$$ -38323 8668 -94476 -142832 -1603 60840 201785 192888 175923 168659 64113 141820
20663A41820m9942j12442l7322l8848R4739J28355r4269r2982m0220m6133l4088
$$ 141820 91878 -20564 -57886 -96734 -1995 126360 32091 -60891 -101111 -147244 -181332
20652a81332j2478J9830K9512P1660L0341n2777M9035L9803k500k9826J5975m4339
$$ -181332 -193810 -173980 -144468 -72808 -42467 -95244 -46209 -6406 -8906 -38732 -22757 -67096
20640f7096M5423O393n4286n0566m1320R4674l1618n0459j25105J67479M2527
$$ -67096 -21673 -15280 -69566 -120132 -161452 -66778 -98396 -148855 -273960 -106481 -63954
20629f3954J2105N466j08855q3427N4550M5556L4637J22303Q0353q3164m152J2804
$$ -63954 -51849 -46383 -155238 -238665 -184115 -138559 -103922 18381 98734 15570 11418 24222
20617B4222J8638j14540P7970Q5597Q7958P2560L7417j03913j405n6070q6841
$$ 24222 42860 -71680 6290 91887 179845 252405 289822 185909 184504 128434 41593
20606D1593k1703J22850K4473j3087o4961m1132q738l8567j0310M6261K4218q5810
$$ 41593 19890 142740 167213 154126 89165 48033 39295 728 -9582 36679 60897 -24913
20594b4913q179N5533p4056j19803M285k3594o4769J79394K9549M73J79218K01764
$$ -24913 -33092 22441 -51615 -171418 -167133 -190727 -255496 -76102 -46553 -46080 133138 334902
20582C34902R7863j50122O5158j96370k02711O5530M2314p5454r1598J7220q4733
$$ 334902 432765 282643 347801 151431 -51280 14250 56564 -18890 -110488 -93268 -178001
20571a78001P371j125j26152M3866K05592Q7603Q1943M2138R060k4765p5053m5407
$$ -178001 -170630 -171755 -297907 -254041 -48449 39154 121097 163235 172295 147530 72477 27070
20559B7070j13555R7389J00187m8330q2414L5394j8224l65393j00593O2162J21728
$$ 27070 -86485 10904 111091 62761 -19653 15741 -2483 -367876 -468469 -406307 -284579
20548b84579R1980J79254L9739J565J04520P4163r5223j03304K8996R4234p611
$$ -284579 -192599 -13345 26394 27959 132479 206642 111419 8115 37111 131345 123734
20537A23734L4211M2659j0956M457N942j26891r3855J78980o6349k33715j44836
$$ 123734 157945 200604 189648 194105 200047 73156 -20699 158281 91932 -141783 -286619
20526b86619J03588L6307L5242J05084P5739j1494j84566k9704M607p264m8364
$$ -286619 -183031 -146724 -111482 -6398 69341 57847 -126719 -156423 -151816 -159080 -207444
20515b07444Q877J01936N4788o0368O7931L7586J6348K0640R2261Q6965r44j14836
$$ -207444 -198567 -96631 -41843 -102211 -34280 3306 19654 40294 132555 219520 218576 103740
20503A03740r1638J03080J82910l3246j63467k2922K2180J27515J18246P0156
$$ 103740 12102 115182 298092 264846 101379 78457 100637 228152 346398 416554
20493D16554q6438k8753O9658N7887M4076L5417O5240M6782P4523J4517n4180
$$ 416554 330116 301363 371021 428908 472984 508401 573641 620423 694946 709463 655283
20482F55283J8701J08705N2970k5374j12725r7137L1027p8444k7454L6141P9529
$$ 655283 673984 782689 835659 810285 697560 600423 631450 553006 525552 561693 641222
20471F41222J06993K03718J85467K1743p1191j46404P3021p0751j17271j7325
$$ 641222 748215 951933 1137400 1159143 1087952 941548 1014569 943818 826547 809222
20461H09222n0183k4661k14980p1691l6592m4693p4646r0163R7937K603J00234
$$ 809222 759039 734378 519398 447707 411115 366422 291776 201613 299550 302153 402387
20450D02387J77166j19931o2064l2839o5205q3858J6677K3556j07231M1657R3730
$$ 402387 579553 459622 397558 364719 299514 215656 232333 255889 148658 190315 284045
20439B84045L7299m8063Q4067n0069m214L3500m417J05251K84766J03121k4109
$$ 284045 321344 273281 357348 307279 303065 336565 332148 437399 722165 825286 801177
20428H01177J35003Q5424Q8393j03609J3255p8388K4447R1310j53771o5676J02142
$$ 801177 936180 1021604 1109997 1006388 1019643 941255 965702 1057012 903241 837565 939707
20417I39707J21177M1345R2897m3615p2573j3922k83015n3714J3706Q8828q1373
$$ 939707 1060884 1102229 1195126 1151511 1078938 1065016 782001 728287 741993 830821 749448
20406G49448J5546K4533O1611j43424l35006j36928j5482o9985R2736O5090M4767
$$ 749448 764994 789527 851138 707714 372708 235780 220298 150313 243049 308139 352906
20395C52906j39273j17660J16738j33515M6918J52179l5399o7656r8274n7952
$$ 352906 213633 95973 212711 79196 126114 278293 242894 175238 76964 19012
20385A9012j60925p5780J03392L4677K4289J20210J08967L0550m3855l8822K02536
$$ 19012 -141913 -217693 -114301 -79624 -55335 64875 173842 204392 160537 121715 324251
20374C24251m9168o5673m9764j47305J7723J15327J40829l2967j08347j6572O8695
$$ 324251 275083 209410 159646 12341 30064 145391 286220 253253 144906 128334 197029
20363A97029M5359j01289j05717o2652L7474J22105l7214j18739Q8357O0396n2790
$$ 197029 242388 141099 35382 -27270 10204 132309 95095 -23644 64713 125109 72319
20352G2319n1383L8534j3486K1027K6493N4987l2569J8640l3377l2033L6249k314
$$ 72319 20936 59470 45984 67011 93504 148491 115922 134562 101185 69152 105401 103087
20340A03087n8552o869L9046N9114L7643j32248j38023o9337K4011J58405m296
$$ 103087 44535 37666 76712 135826 173469 41221 -96802 -166139 -142128 16277 11981
20329A1981n6616J06857n9122j34807Q6095k5259r291O6409P9140l4185L5973
$$ 11981 -44635 62222 3100 -131707 -45612 -70871 -80162 -13753 65387 31202 67175
20318F7175Q6421r7560j5929j18018J13522N4057n3345J19686J35586n1668m6059
$$ 67175 153596 56036 40107 -77911 35611 89668 36323 156009 291595 239927 193868
20307A93868j80220j50398J26784M4321k0213j36851k4145N0733J24369J34334
$$ 193868 13648 -136750 -9966 34355 14142 -122709 -146854 -96121 28248 162582
20297A62582k7576k2525j01430j60493J41374R4649N1695j8715O579o0200m3735
$$ 162582 135006 112481 11051 -149442 -8068 86581 138276 119561 126140 65940 22205
20286B2205j8855o3333P7972P4031L7059p1635P2468o5023R6998L6933r8167L2066
$$ 22205 3350 -59983 17989 92020 129079 57444 129912 64889 161887 198820 100653 132719
20274A32719R4223Q3743p5760j01591M0816O4127p651N518K4416j42513n9756
$$ 132719 226942 310685 234925 133334 174150 238277 230626 236144 260560 118047 58291
20263E8291P7173k3518O2217J01009p300k1799o0675q9247l1143P0712r2399j00097
$$ 58291 135464 111946 174163 275172 267872 246073 185398 96151 65008 135720 43321 -56776
20251e6776n2219L7274J69918N0977K4994o5361j71177J2849K9340O2341L9902
$$ -56776 -108995 -71721 98197 149174 174168 108807 -62370 -49521 -20181 42160 82062
20240H2062J6610O9211O0534j6779K0773p55o4249k7437R7531l1508k7178k9784
$$ 82062 98672 167883 228417 211638 232411 231656 167407 139970 237501 205993 178815 149031
20228A49031J65025L0447r0525j28314r106O8725J8921N8556j8264J0478q6811
$$ 149031 314056 344503 253978 125664 116558 185283 204204 262760 244496 254974 168163
20217A68163q8591R4568Q0732N604n8117M1210j6112k07652j13375o7312N8969
$$ 168163 79572 174140 254872 260476 202359 243569 227457 19805 -93570 -160882 -101913
20206a01913l4455J22938L1688N4893K66838N4761q916r4665j32650k8470J64441
$$ -101913 -136368 -13430 18258 73151 339989 394750 385834 291169 158519 130049 294490
20195B94490n8086O2141j18628P1239J02587j78661r1443P2203Q4152M7213n3560
$$ 294490 236404 298545 179917 251156 353743 175082 83639 155842 239994 287207 233647
20184B33647j61343j0745R1470N8636P5514j73141l1546J03786J53841Q2436m8169
$$ 233647 72304 61559 153029 211665 287179 114038 82492 186278 340119 422555 374386
20173C74386j52226o1650j7715l605j0117o3842n9418J33952O273j5425J7706
$$ 374386 222160 160510 142795 139190 129073 65231 5813 139765 146038 130613 148319
20162A48319J06971J17523O859M7664k1264q0314m9126r45l8832O4321k7785N4760
$$ 148319 255290 372813 379672 427336 406072 325758 276632 275687 236855 301176 273391 328151
20150C28151j1756n4078l2783P3844N9389l2727J6642l8306q0824m0953J7366
$$ 328151 316395 262317 229534 303378 362767 330040 346682 308376 227552 186599 203965
20139B03965j17335k3973J13219P1438k3218N4154M5941k4860M9256j12520j64363
$$ 203965 86630 62657 175876 247314 224096 278250 324191 299331 348587 236067 71704
20128G1704p1586j66294q5117N0559Q6934O0648J8138N0659j490o247o686l093
$$ 71704 118 -166176 -251293 -200734 -113800 -53152 -35014 15645 14155 7908 1222 -1871
20116a871p8609q0797j1227K26855J89689j63136l6607N7983q0437j9331l1260
$$ -1871 -80480 -161277 -172504 54351 244040 80904 44297 102280 21843 2512 -28748
20105b8748l4822q2781R8319j5685q8972K17030J27906j5913K9786j12451j32676
$$ -28748 -63570 -146351 -48032 -63717 -152689 64341 192247 176334 206120 93669 -39007
20094c9007J7900K41694J01852n511k6403l950J0955o7210m4908K737o0631j68123
$$ -39007 -21107 220587 322439 316928 290525 286575 297530 230320 185412 188149 127518 -40605
20082d0605m429J34642r223o3565k6738M2925p3949o0698r23K07218j5670R7998
$$ -40605 -45034 89608 80385 16820 -9918 33007 -40942 -101640 -102563 104655 88985 186983
20070A86983K2343l4226K0392m5699o746R2188m6864n9082K403N9617j0221k3591
$$ 186983 209326 175100 195492 149793 143047 235235 188371 129289 131692 191309 181088 157497
20058A57497p832n4171o5672J13981Q4873P244P2576j8065n4629K8813r76J7072
$$ 157497 149665 95494 29822 143803 228676 235920 308496 290431 235802 264615 263639 280711
20046B80711j8589J68180N2913J0405J21053L3459r8452j7557L5042m9772j10559
$$ 280711 262122 430302 483215 493620 614673 648132 549680 532123 567165 517393 406834
20035D06834P7727J25235P243j38074j14232M7990J27677J2977k0253n7715N3204
$$ 406834 484561 609796 617039 478965 364733 412723 540400 553377 533124 475409 528613
20024E28613J33149N1153N7440R9413j09258K8702L7390p4800p8202J33545J21412
$$ 528613 661762 712915 770355 869768 760510 789212 826602 751802 673600 807145 928557
20013I28557q2905o305J56370K28624o9326r2228l4578P8292Q1609J3828L5819
$$ 928557 845652 839347 995717 1224341 1155015 1062787 1028209 1106501 1188110 1201938 1237757
20002A237757J545J49932J26992L8710n6733j15033L8115K2372q5196J45575J8373
$$ 1237757 1239302 1389234 1516226 1554936 1498203 1383170 1421285 1443657 1358461 1504036 1522409
19991A522409O7117J76857N8261j7237o3420M164K57258J82756K4652P1351R7597
$$ 1522409 1589526 1766383 1824644 1807407 1743987 1748151 2005409 2188165 2212817 2284168 2381765
19980B381765K58239J27502K1568p5545O3744K13781K29143J85124J0020L34711
$$ 2381765 2640004 2767506 2789074 2713529 2777273 2991054 3220197 3405321 3415341 3750052
19970C750052L68526M87892L17981M53598M01470O40627Q16876Q26621O61321
$$ 3750052 4118578 4606470 4924451 5378049 5779519 6420146 7237022 8063643 8724964
19961H724964P75619R38113J553272K364499L429114M480079M731152M044985
$$ 8724964 9500583 10438696 11991968 14356467 17785581 22265660 26996812 31041797
19953C1041797K933202J664407P06801L47779J071153K916379N439336R299053
$$ 31041797 33974999 35639406 36346207 36693986 37765139 40681518 46120854 55419907
19945E5419907J5693946K5503095L4944172L6209265L1401061K1675585Q609569
$$ 55419907 71113853 96616948 131561120 167770385 199171446 220847031 229456600
19938B29456600m620967j6336154j9760082j8886832j6606398j4198476j0739100
$$ 229456600 224835633 208499479 188739397 169852565 153246167 139047691 128308591
19931A28308591n258216l83163J163921k28459l107647o946959j0127023j1541385
$$ 128308591 123050375 122667212 123831133 123602674 120495027 113548068 103421045 91879660
19923I1879660j0503742q407415o532987n254255m561091l800266l123320k696969
$$ 91879660 81375918 72968503 66435516 61181261 56620170 52819904 49696584 46999615
19915D6999615k119781j566853j315349j038104p24669o54659o02693k79494j76097
$$ 46999615 44879834 43312981 41997632 40959528 40234859 39580200 38977507 38698013 38521916
19906C8521916K38161P01107J474254L010524N070589Q156060J1611522J2843994
$$ 38521916 38760077 39461184 40935438 43945962 49016551 57172611 68784133 81628127
19898H1628127J1260880Q129106L778919k38397k118326m68865M728156J1746575
$$ 81628127 92889007 101018113 104797032 104558635 102440309 101971444 106699600 118446175
19890A18446175J7915453K4004700L1602702L8588452L8729304K6670533J0594558
$$ 118446175 136361628 160366328 191969030 230557482 269286786 295957319 306551877
19883C06551877o909086k3493052l4796911l7388538l1106132k2788802j6633694
$$ 306551877 299642791 276149739 241352828 203964290 172858158 150069356 133435662
19876A33435662j2441642q640065n299222l448972l489063m358864n636018o885774
$$ 133435662 120994020 112353955 107054733 103605761 100116698 95757834 90121816 83236042
19868H3236042p527079p233536o147201m864016l987339l480586l045251k867170
$$ 83236042 75708963 68475427 62328226 57464210 53476871 49996285 46951034 44083864
19860D4083864k488655k412616k122872j886304j845055j736439j490109j418028
$$ 44083864 41595209 39182593 37059721 35173417 33328362 31591923 30101814 28683786
19852B8683786j438537j177602r08765r56874r34529q32189o95697n94519o73193
$$ 28683786 27245249 26067647 25158882 24202008 23267479 22435290 21739593 21145074 20471881
19843B0471881o46103o21941o40392q05381p96975p23256m35222n02135m50642
$$ 20471881 19825778 19203837 18563445 17758064 16961089 16237833 15802611 15300476 14849834
19834A4849834m03786l80526m60675m63775m91303k91487m06562l78514k73102
$$ 14849834 14446048 14065522 13604847 13141072 12649769 12358282 11951720 11573206 11300104
19825A1300104k75473j85229k42365k76426k44370k57629j87744k83697k81275
$$ 11300104 11024631 10839402 10597037 10320611 10076241 9818612 9630868 9347171 9065896
19816I065896j81436j58750k47841k16957k16360j41017j39966k07811k42147
$$ 9065896 8884460 8725710 8477869 8260912 8044552 7903535 7763569 7555758 7313611
19807G313611j86596j23711k52139l08901j44603j42348p9644j78241j42217j45394
$$ 7313611 7127015 7003304 6751165 6442264 6297661 6155313 6075669 5897428 5755211 5609817
19797E609817j95862j74543k19459k32807j43142j84553j99873K354j67122k0868
$$ 5609817 5413955 5239412 5019953 4787146 4644004 4459451 4259578 4261932 4094810 4073942
19787D073942J76042K9747l37601j83205k7389j11348J2261l6922j67734j18625
$$ 4073942 4249984 4279731 3942130 3758925 3731536 3620188 3632449 3595527 3427793 3309168
19777C309168n0911K4512q0449j53663j70515k1073j5274N6995p8122j29860N241
$$ 3309168 3258257 3282769 3202320 3048657 2878142 2857069 2841795 2898790 2820668 2690808 2696049
19766B696049l70l4724k4902K4293L9042k8629p1745M5999M5991j11234n3202
$$ 2696049 2695679 2660955 2636053 2660346 2699388 2670759 2599014 2645013 2691004 2579770 2526568
19755B526568K3500O6817J6110k5823r0847j21765j36001j43173k7418K0308k9332
$$ 2526568 2550068 2616885 2632995 2607172 2516325 2394560 2258559 2115386 2087968 2108276 2078944
19744B078944j31234j19214o1864P8917J23597k19035j44407q946j69879j42157
$$ 2078944 1947710 1828496 1766632 1845549 1969146 1750111 1605704 1596758 1426879 1284722
19734A284722K4546J87081M1457j46171Q814Q6352O3499j44587j10671j57345
$$ 1284722 1309268 1496349 1537806 1391635 1400449 1486801 1550300 1405713 1295042 1137697
19724A137697n919m9076j11194M8889R2275q4279K7832l2594j18642Q2356R723
$$ 1137697 1131778 1082702 971508 1020397 1112672 1028393 1056225 1023631 904989 987345 997068
19713I97068r180J2183J0373L9089L1983r8924J09990K1747n1749O9472j1989
$$ 997068 987888 1000071 1010444 1049533 1081516 982592 1092582 1114329 1062580 1132052 1120063
19702A120063j4527N1222J19798J439K8700r3266n8800j92720O9783P0634j69653
$$ 1120063 1105536 1156758 1276556 1277995 1306695 1213429 1154629 961909 1031692 1102326 932673
19691I32673j55161m7884Q6535J01139O5311J46587L6310j00321p6047q0262q9938
$$ 932673 777512 729628 816163 917302 982613 1129200 1165510 1065189 989142 908880 818942
19680H18942K6294L8638p225n0224j36158K0018j80607p9506J35904R389q8389
$$ 818942 845236 883874 876649 826425 690267 710285 529678 450172 586076 595465 507076
19669E07076P4365J6183o1044J684r382n3924J01664P7520J33668O0607j5804
$$ 507076 581441 597624 536580 538264 528882 474958 576622 654142 787810 848417 832613
19658H32613j22334J2187J32430l8326j04998j26917l6514k0147O76n5220Q5602
$$ 832613 710279 722466 854896 816570 711572 584655 548141 527994 528670 473450 559052
19647E59052m064l2119L8096K18705K07120p6746p4032k15397j41150p691R9482
$$ 559052 554988 522869 560965 779670 986790 910044 836012 620615 479465 471774 571256
19636E71256J11375r6112M0932k539l8689n3873j3478o6607j7808l05J16052J48633
$$ 571256 682631 586519 627451 624912 586223 532350 518872 452265 434457 434152 550204 698837
19624F98837N1456k5393l8732j43383k98406j2270J40483m2225N4387M2065j1291
$$ 698837 750293 724900 686168 542785 244379 232109 372592 330367 384754 426819 415528
19613D15528k1073r1273j5446j21237j46644j9141o7503l3524Q5259L5766m1960
$$ 415528 394455 303182 287736 166499 19855 714 -66789 -100313 -15054 20712 -21248
19602b1248J9787M9984J68571J32214j09171m5405k9929n5411J51164J02267o86
$$ -21248 -1461 48523 217094 349308 240137 194732 164803 109392 260556 362823 362137
19591C62137q9817N0928J64213k2421j319j68828M7449J26824r1890j47215R766
$$ 362137 272320 323248 487461 465040 463721 294893 342342 469166 377276 230061 239827
19580B39827O4537k2449j65690k19687m7008R188Q8036K43846J20859k7256p0437
$$ 239827 304364 281915 116225 -103462 -150470 -141282 -53246 190600 311459 284203 213766
19569B13766l6465j7209j72893R1189n581J10649j20829j62003K2574N9621J8671
$$ 213766 177301 160092 -12801 78388 72807 183456 62627 -99376 -76802 -17181 1490
19558A490K41332K56261K7166q2131j01054m716j9550m2098K2618P7982M8060
$$ 1490 242822 499083 526249 444118 343064 338348 318798 276700 299318 377300 425360
19547D25360k5363j08056j36803P1533j1680m322J50843N3728O4541J297j9661
$$ 425360 399997 291941 155138 226671 214991 210669 361512 415240 479781 481078 461417
19536D61417L0006j644p6698J04050K7525j12591P7410K8097O4266n1838k8011
$$ 461417 491423 489779 413081 517131 544656 432065 509475 537572 601838 550000 521989
19525E21989K9827J7461n7666k7013K8330m210N0131K36292N5824j55268M1407
$$ 521989 551816 569277 511611 484598 512928 508718 558849 795141 850965 695697 737104
19514G37104p1460j05562P4621M6936j4081p6807J28524N4442j49902J21416K78327
$$ 737104 665644 560082 634703 681639 667558 590751 719275 773717 623815 745231 1023558
19503A023558R2174R7806K10714O6206q3090j10813n0854o9317j47292Q8732K85782
$$ 1023558 1115732 1213538 1424252 1490458 1407368 1296555 1245701 1176384 1029092 1117824 1403606
19492A403606J27137m3775L7744J27109K6007R325k4077O284l024n8455J7072
$$ 1403606 1530743 1486968 1524712 1651821 1677828 1687153 1663076 1669360 1666336 1607881 1624953
19481A624953J06410J6893N5177R2197O3465L9299J05056J62157J44455l4230
$$ 1624953 1731363 1748256 1803433 1895630 1959095 1998394 2103450 2265607 2410062 2375832
19471B375832n1126K35048J25217J75458K09260K96313L53180L22913N18277N92410
$$ 2375832 2324706 2559754 2684971 2860429 3069689 3366002 3719182 4042095 4560372 5152782
19461E152782P39510N44846M78596M04228L09050J27691J34528M11099O37946
$$ 5152782 5892292 6437138 6915734 7319962 7629012 7756703 7891231 8302330 8940276
19452H940276Q34591J204369J610056J906756L032665M483009O495854R064068
$$ 8940276 9774867 10979236 12589292 14496048 17528713 22011722 28507576 37571644
19444C7571644Q774526M401382p51000l298477k172899P56415L471286O306222
$$ 37571644 46346170 50747552 49996552 46698075 44525176 45281591 48752877 55059099
19436E5059099J0382535J7741401L1485482N3488121P2527125O2149262K5216665
$$ 55059099 65441634 83183035 114668517 168156638 240683763 302833025 328049690
19429C28049690j4795404l1210704k8755945k6085089k7509542k7733993k2018465
$$ 328049690 313254286 282043582 253287637 227202548 199693006 171959013 149940548
19422A49940548j3955409o035285J774675Q299900P554997j756592j2635271j7710701
$$ 149940548 135985139 129949854 131724529 140024429 147579426 145822834 133187563 115476862
19414A15476862j5853989j1839661q938408p597401o517838n440515m374565l422380
$$ 115476862 99622873 87783212 78844804 71247403 64729565 59289050 54914485 51492105
19406E1492105k612682k047133j523299j283286j191546j099796j232373j075457
$$ 51492105 48879423 46832290 45308991 44025705 42834159 41734363 40501990 39426533
19398C9426533p01999k08322K67588O49959J210953K135407L608405O269033J0283985
$$ 39426533 38724534 38516212 38783800 39433759 40644712 42780119 46388524 52657557 62941542
19389F2941542J5550832J7662874J1378400Q10272p054514p257124k297935M667930
$$ 62941542 78492374 96155248 107533648 108343920 101289406 94032282 91734347 96402277
19381I6402277J2278957J9366749K2393914K3928364K8697844L7773541L7259638
$$ 96402277 108681234 128047983 150441897 174370261 203068105 240841646 278101284
19374B78101284J1535613k2279728m4105020m2056280k9814655j9856888j5148912
$$ 278101284 289636897 267357169 223252149 181195869 151381214 131524326 116375414
19367A16375414j2772443j0224091p308130m097751r50652N22091j501126m792713
$$ 116375414 103602971 93378880 86070750 81972999 81022347 81544438 80043312 75250599
19359G5250599p120784o984556n810938m533736l979643l541323k975177k586852
$$ 75250599 68129815 61145259 55334321 50800585 46820942 43279619 40304442 37717590
19351C7717590k183347j725357j414395j292327r97405r46947r21834j186456
$$ 37717590 35534243 33808886 32394491 31102164 30104759 29157812 28235978 27049522
19343B7049522j147526j237987j243063j089515r14538q05156p27854p26712n96468
$$ 27049522 25901996 24664009 23420946 22331431 21416893 20611737 19883883 19157171 18560703
19334A8560703n25794n92759n54144n28907o56798o34789n30485n04566l88878
$$ 18560703 18034909 17442150 16888006 16359099 15702301 15067512 14537027 14032461 13643583
19325A3643583m47456m24340m87680l98037l31752l23530k31248j80387l23485
$$ 13643583 13196127 12771787 12284107 11886070 11554318 11230788 10999540 10819153 10495668
19316A0495668k82646l20863l62648j44520q4745j59005j30074k85217k79708
$$ 10495668 10213022 9892159 9529511 9384991 9300246 9141241 9011167 8725950 8446242
19307H446242j91927j45835l21254j32182j52936k12336k86748j73034j95826
$$ 8446242 8254315 8108480 7787226 7655044 7502108 7289772 7003024 6829990 6634164
19298F634164k83996o3927j68089k35826k89550M7283J00223j80149k26100j77493
$$ 6634164 6350168 6286241 6118152 5882326 5592776 5640059 5740282 5560133 5334033 5156540
19288E156540j45942p2794m5892l5445j40827k55409j76899j59462n918m4314
$$ 5156540 5010598 4937804 4891912 4856467 4715640 4460231 4283332 4123870 4117952 4073638
19278D073638K0506o8475l32335j58045q7288j49557n0489j75061j53420m2516
$$ 4073638 4094144 4025669 3693334 3535289 3448001 3298444 3247955 3072894 2919474 2876958
19268B876958l4476j05699o8543K3885Q1788k5084o3314k4973p5748n6207r2308
$$ 2876958 2842482 2736783 2668240 2692125 2773913 2748829 2685515 2660542 2584794 2528587 2436279
19257B436279N1779R8504j1004k7441n5867R4563J6830K181p2808p4494r8990
$$ 2436279 2488058 2586562 2575558 2548117 2492250 2586813 2603643 2605824 2533016 2458522 2359532
19246B359532m1976O3030j04990j0629k0421m3102j35311j44238r0115k11068
$$ 2359532 2317556 2380586 2275596 2264967 2244546 2201444 2066133 1921895 1831780 1620712
19236A620712j73952P0374J14778N970j08045m3758Q6291j40195k10688j60079
$$ 1620712 1446760 1517134 1631912 1637882 1529837 1486079 1572370 1432175 1221487 1061408
19226A061408K7588N1275J322J8415n0193j94918Q2097K6280k1577k631N0876
$$ 1061408 1088996 1140271 1141593 1160008 1109815 914897 996994 1023274 1001697 999066 1049942
19215A049942q0729q472p4307k0993L984L7641P7837m5889l6384j2013L4646M1908
$$ 1049942 969213 960741 886434 865441 869425 907066 984903 939014 902630 890617 925263 967171
19203I67171q0737J9623L8903N092l3011j74610k5772O0525j20435M28M8341J16224
$$ 967171 886434 906057 944960 950052 917041 742431 716659 777184 656749 657177 705518 821742
19191H21742J72168Q6666L8361k1017J2152o0601j41540o7103J4086j10597o9818
$$ 821742 993910 1080576 1118937 1097920 1110072 1049471 907931 840828 854914 744317 674499
19180F74499L4624l1019n0124J42953J13754n2713r6034j03222N0935n996j76693
$$ 674499 709123 678104 627980 770933 884687 831974 735940 632718 683653 677657 500964
19169E00964o2451J11728J27692R5588n490j70620r6057L4391L5039j14453k3625
$$ 500964 438513 550241 677933 773521 768031 597411 501354 535745 570784 456331 432706
19158D32706n4086j71585j9934o1961Q6375M1975m3097M7323o1599j61202J12380
$$ 432706 378620 207035 187101 125140 211515 253490 210393 257716 196117 34915 147295
19147A47295J98670J84617L7278R6887j71535l2334K2850J1356p6300j80262Q3724
$$ 147295 345965 530582 567860 664747 493212 460878 483728 495084 418784 238522 322246
19136C22246Q5871o3221J41765K6327j952j14302j55106p9472J97002R2079m6719
$$ 322246 408117 344896 486661 512988 511036 396734 241628 162156 359158 451237 404518
19125D04518o2226N330J0040j19629k6358o5641j5505Q0273J13193M707o4269
$$ 404518 342292 347622 357662 238033 211675 146034 130529 210802 323995 328702 264433
19114B64433j16210r43O9570j53320o7419J61708J58310L0761n3448K1946M1602
$$ 264433 148223 147280 216850 63530 -3889 157819 316129 346890 293442 315388 356990
19103C56990K8853o1897j11305J18176P8839P7325j55309j20653r0518O366j30410
$$ 356990 385843 323946 212641 330817 409656 486981 331672 211019 120501 126867 -3543
19092c543Q0086P6349o3136m0767R5149q8683r8129R7743N7298p4921j08951L8792
$$ -3543 76543 152892 89756 48989 144138 55455 -42674 55069 112367 37446 -71505 -32713
19080c2713M7113m9593j60738J6930n0260O5462J46568K39414k2519j22596l5332
$$ -32713 14400 -35193 -195931 -179001 -229261 -163799 -17231 222183 199664 77068 41736
19069D1736K9803J05543q549P3801K5737N2924k0346M4796o6860J11267p1182
$$ 41736 71539 177082 168533 242334 268071 320995 300649 345445 278585 389852 318670
19058C18670j74718j66451L2330J04292k18625o297N5272J29083K1053L9348n6942
$$ 318670 143952 -22499 9831 114123 -104502 -110799 -55527 73556 94609 133957 77015
19047G7015m2919J2396j2642k3956R9198J32626o5296l2987J05733R662j18410
$$ 77015 34096 46492 33850 9894 109092 241718 176422 143435 249168 258830 140420
19036A40420m9921j13373m6994J49643P8884R0369j49736j2739N4265M8987p4398
$$ 140420 90499 -22874 -69868 79775 158659 249028 99292 86553 140818 189805 115407
19025A15407K3164P7576M8267o1738J8225L0152r891Q6432J67861j864K5582J43699
$$ 115407 138571 216147 264414 202676 220901 251053 241162 327594 495455 493591 519173 662872
19013F62872N2104j85914j5392r477n3205j01009p8811q0922L7549P7876o8929
$$ 662872 714976 529062 513670 504193 450988 349979 271168 190246 227795 305671 236742
19002B36742p3810j6j1230M2524J16296l8799j28041q3255p5004q2214K59823
$$ 236742 162932 162916 151686 194210 310506 271707 143666 60411 -14593 -96807 163016
18991A63016J08703P7414j16627k82003M4373J42227m834O5488O182M1280Q1385
$$ 163016 271719 349133 232506 -49497 -5124 137103 132269 197757 203939 245219 326604
18980C26604J35229L8141j01515n3228m1231K0410m4775k5253Q7325n2528n749
$$ 326604 461833 499974 398459 345231 304000 324410 279635 254382 341707 289179 283430
18969B83430R360k26477L7184N5772q042J52487Q8687j42716p0782k0775l8361
$$ 283430 292790 66313 103497 159269 151227 303714 392401 249685 178903 158128 119767
18958A19767r924m6201J22123J81943J11783j43304k59375M8538L4240J43955
$$ 119767 109843 63642 185765 367708 479491 336187 76812 125350 159590 303545
18948C03545P7042j54245o7504k9750j3864p5305J7479j7204L8054p3068L6317
$$ 303545 380587 226342 158838 129088 115224 39919 57398 40194 78248 5180 41497
18937D1497K27824Q233r2028R5801L7881j36058r5831k1329l4417L0871O8932
$$ 41497 269321 277554 185526 281327 319208 183150 87319 65990 31573 62444 131376
18926A31376K6176k6217l8807l4985L2762J65070P7528j2665Q734M6617J00335
$$ 131376 157552 131335 92528 57543 90305 255375 332903 320238 328972 375589 475924
18915D75924J21178j9756n6919m1647K24974K14220K03027l1105k11375j36525
$$ 475924 597102 577346 520427 478780 703754 917974 1121001 1089896 878521 741996
18905G41996n5394n4349Q0879P7626Q0512K6034J28583K11398K0771j68883k67222
$$ 741996 686602 632253 713132 790758 871270 897304 1025887 1237285 1258056 1089173 821951
18894H21951j43378n0109j30936J4360m4598J9364n956M0157M9901N8320n9274
$$ 821951 678573 628464 497528 511888 467290 486654 480698 520855 570756 629076 569802
18883E69802P60p9467J4362o9325j04131p578p319N0289j6753p0818j5700m7621
$$ 569802 570562 491095 505457 436132 332001 324423 317104 367393 350640 279822 264122 216501
18871B16501J75287O0260R9418j96250j34492p4251L1397R5866J07576J72582
$$ 216501 391788 452048 551466 355216 220724 146473 177870 273736 381312 553894
18861E53894J14458O8881l3259j14632o8689J27033M506J36722J63319k1208K4457
$$ 553894 668352 737233 703974 589342 520653 647686 652192 788914 952233 931025 955482
18850I55482n6068j80315K830K2747m2774p3370j08579J30063J58895Q3619L3399
$$ 955482 899414 719099 721929 744676 701902 628532 519953 650016 808911 892530 925929
18839I25929k8622M3408j59042j55679l2763l3493l9330j21001k9458j01280l8493
$$ 925929 897307 940715 781673 625994 593231 559738 520408 399407 369949 268669 230176
18828B30176K7611j02254n5064N3710p094j25748j17007k2944J74633L9115N6911
$$ 230176 257787 155533 100469 154179 147085 21337 -95670 -118614 56019 95134 152045
18817A52045k9242K5174L5184n368J06000N546j94014k7736J32969J08935k1315
$$ 152045 122803 147977 183161 177793 283793 289339 95325 67589 200558 309493 288178
18806B88178l4867o5392M327M9619m0470q6698L1961j34953j44068J7246J453
$$ 288178 253311 187919 192246 241865 201395 114697 146658 11705 -132363 -115117 -113664
18795a13664R9854j9850P186J6378N6436M5684K3509Q2592q1156j75930o0031
$$ -113664 -13810 -33660 -26474 -10096 46340 92024 115533 198125 116969 -58961 -118992
18784a18992k4361L1704L6920J34202L4389q4377k4665M0714k5683k111k8234
$$ -118992 -143353 -111649 -74729 59473 93862 9485 -15180 25534 -149 -2260 -30494
18773c0494j08803j339J56686M2752j32546J2237J08714K48474K56838J68552
$$ -30494 -139297 -140636 16050 58802 -73744 -61507 47207 295681 552519 721071
18763G21071J74321k0855k72225k03917p2260K8919N6348k0991P6778l2907N1619
$$ 721071 895392 874537 602312 398395 326135 355054 411402 390411 467189 434282 485901
18752D85901n4309m8933P4734p2815n2295m7276Q1963r9805q7722P2212r5783
$$ 485901 431592 382659 457393 384578 332283 285007 366970 267165 179443 251655 155872
18741A55872N0833K8827j14260r866L6801J05105P832k1354O687p5613Q7141J1453
$$ 155872 206705 235532 121272 111406 148207 253312 261144 239790 246477 170864 258005 269458
18729B69458p1725m0823J2237n110j34038J2015R8312p15j6928J2657K29076O0108
$$ 269458 197733 156910 169147 164037 29999 42014 140326 139611 122683 135340 364416 424524
18717D24524j33314J7315m4679m9360n3589q1381j13017m3865N7225q7537n2990
$$ 424524 291210 308525 263846 214486 160897 79516 -33501 -77366 -20141 -107678 -160668
18706a60668J44661J5669J3622n3570l0970o7959P5836J92168Q5190m1192l9296
$$ -160668 -16007 -338 13284 -40286 -71256 -139215 -63379 128789 213979 172787 133491
18695A33491J51117N1406k9855j10201M929j20999q3229q4249l2135J10981M2305
$$ 133491 284608 336014 306159 195958 200887 79888 -3341 -87590 -119725 -8744 33561
18684C3561J6120j71348n8874K750p7890r0628K6545J87596K43286R0004j42033
$$ 33561 49681 -121667 -180541 -177791 -255681 -346309 -319764 -132168 111118 201122 59089
18673E9089j41202P6786J10048j2665o2343L2967j06164l0847N7352J26010P1051
$$ 59089 -82113 -5327 104721 92056 29713 62680 -43484 -74331 -16979 109031 180082
18662A80082j51236q4599J32534j20944K74J16526N3984p1403o3133J06088J24281
$$ 180082 28846 -55753 76781 -44163 -43889 72637 126621 55218 -7915 98173 222454
18651B22454K5526k8176m4324p3908Q6235p2121k37334P3970N3337k5726O4255
$$ 222454 247980 219804 175480 101572 187807 115686 -121648 -47678 5659 -20067 44188
18640D4188P5998N1828J6859L1529l5250j82542r6521J9718K2875r7936O1391
$$ 44188 120186 172014 188873 220402 185152 2610 -93911 -74193 -51318 -149254 -87863
18629h7863j526j52169K6694K46661J44286o6086L5061R535j00961m9708r0456
$$ -87863 -89389 -241558 -214864 31797 176083 109997 145058 154593 53632 3924 -86532
18618h6532l2400J45748M7050o3815k1667O2524J05049M0402k5643O3784j46634
$$ -86532 -118932 26816 73866 10051 -11616 50908 155957 196359 170716 234500 87866
18607H7866j23008P4634j15393q1265Q9032L4171m5772K700j01030L37Q7348j7600
$$ 87866 -35142 39492 -75901 -157166 -68134 -33963 -79735 -77035 -178065 -177728 -90380 -107980
18595a07980O9276N0916k9905J0971M5243J7335J34047R3581j12411j56657k7087
$$ -107980 -38704 12212 -17693 -6722 38521 55856 189903 283484 171073 14416 -12671
18584a2671j01920k091R3073J6974Q9176R9324q5633P8319L683j50094j03349
$$ -12671 -114591 -116682 -23609 -6635 82541 181865 96232 174551 178234 28140 -75209
18573g5209j29740N2501J15430O155J14376J28103J85777J54701p1566k07948
$$ -75209 -204949 -152448 -37018 -30863 83513 211616 397393 552094 480528 272580
18563B72580q9646L342j52799j52632m7456J5777Q4638j6056L337J6377k0392
$$ 272580 182934 186276 33477 -119155 -166611 -150834 -66196 -82252 -78915 -62538 -82930
18552h2930R7017m5070O2192P8491J9176K8741j55446L8957K11122M5765k03867
$$ -82930 14087 -30983 31209 109700 128876 157617 2171 41128 252250 298015 94148
18541I4148J1498M8511J2593K6364j39496r1477K0787Q076L0501Q9556M7672N1941
$$ 94148 105646 154157 166750 193114 53618 -37859 -17072 -8996 21505 111061 158733 210674
18529B10674Q3532P2953J9654l1264j1218r8754p4629O2931L883Q1422q8696j48945
$$ 210674 294206 367159 386813 355549 344331 245577 170948 233879 237762 319184 230488 81543
18517H1543K9023O639m6065O4531J00398j9266r6871j39335l1057R5873l8329
$$ 81543 110566 117205 71140 135671 236069 216803 119932 -19403 -50460 45413 7084
18506G084J0903N4808n8940J04989N0856P735p3999K8973J13570J08759J2650
$$ 7084 17987 72795 13855 118844 169700 177435 103436 132409 245979 354738 367388
18495C67388m1722q3264r8524j12722l6240L9859k4378M3707M2548k6777m6055
$$ 367388 325666 242402 143878 31156 -5084 34775 10397 54104 96652 69875 23820
18484B3820J96731R1095M7115j66604j26132O9797k1725j08190J26864J80288
$$ 23820 220551 311646 358761 192157 66025 135822 114097 5907 132771 313059
18474C13059p1029p9421L8244K2287p9376o9193j9110j30367M2092J29103J54462
$$ 313059 242030 162609 200853 223140 143764 74571 55461 -74906 -32814 96289 250751
18463B50751p0731r2502j17990j4145R0349q8685k8940n3881J2675M5282P4991
$$ 250751 180020 87518 -30472 -44617 45732 -42953 -71893 -125774 -113099 -67817 7174
18452G174o2925k4797L2288N1797M8976O0811K5526j00744j07155P2983R415K284
$$ 7174 -55751 -80548 -48260 3537 52513 113324 138850 38106 -69049 3934 13349 15633
18440A5633n6655j11121k8780p6142p1952j02108O1553J10241j09138j1482J32929
$$ 15633 -41022 -152143 -180923 -257065 -329017 -431125 -369572 -259331 -368469 -379951 -247022
18429b47022J48385J34654j56370r0184J7085j15182p181N0343O9264J55028N9659
$$ -247022 -98637 36017 -120353 -210537 -193452 -308634 -315815 -265472 -196208 -41180 18479
18418A8479J34933N1744n140L6498q5713n3943L4501l1762M587M005M42J29177
$$ 18479 153412 205156 200016 236514 150801 96858 131359 99597 104184 108189 108631 237808
18406B37808O802n3737l2813J11883O2092K9026j07553j12583o5247l0492k1338
$$ 237808 244610 190873 158060 269943 332035 361061 253508 140925 75678 45186 23848
18395B3848j02732j19139j911n1642J13491k8881J00671L8261j05988M8975j0779
$$ 23848 -78884 -198023 -199934 -251576 -138085 -166966 -66295 -28034 -134022 -85047 -95826
18384i5826J45113Q0117J5851k7424q9400j17978K14483K2121j05478m848l5933
$$ -95826 49287 129404 145255 117831 28431 -89547 124936 147057 41579 36731 798
18373G98o8386L0465j5037J63534O5003Q9434n6912L9608o0699j54503j69773
$$ 798 -67588 -37123 -52160 111374 176377 265811 208899 248507 187808 33305 -136468
18362a36468J12707J04643J6389n8790l2918l6471M8698n367o5093L1327q5468
$$ -136468 -23761 80882 97271 38481 5563 -30908 17790 12423 -52670 -21343 -106811
18351a06811J59516J37132l0863k6286p1374o3239K9901J6814p8415o0239M6812
$$ -106811 52705 189837 158974 132688 61314 -1925 27976 44790 -33625 -93864 -47052
18340d7052K845k19759K0618O5652l465j04317o256K05985K30720O3868p8714
$$ -47052 -44207 -263966 -243348 -177696 -181161 -285478 -291734 -85749 144971 208839 130125
18329A30125R8146m9593J0249J1113M3022J662J2805j64050k5803m875J8633l2105
$$ 130125 228271 178678 188927 200040 243062 244724 257529 93479 67676 62801 81434 49329
18317D9329n7641p8240j7589O1963J5824n9163M9054Q8619J23135l2349m4228
$$ 49329 -8312 -86552 -104141 -42178 -26354 -85517 -36463 52156 175291 142942 98714
18306I8714P7786K002R1000j35503o1101n3169o6047K2269J71751Q8620p0834
$$ 98714 176500 178502 269502 133999 72898 19729 -46318 -24049 147702 236322 165488
18295A65488l8046k02649R497q4651l8447J88795R8215P4100o3825o9509j07606
$$ 165488 127442 -75207 -65710 -150361 -188808 -13 98202 172302 108477 38968 -68638
18284f8638M2799M0401q9159n0725J00964n1587q8831K280P7398M3833K5088m7774
$$ -68638 -25839 14562 -74597 -125322 -24358 -75945 -164776 -162496 -85098 -41265 -16177 -63951
18272f3951n8943P0424J01996j242J2648o9106m0820j296Q766r1647q5290J40220
$$ -63951 -122894 -52470 49526 48284 60932 -8174 -48994 -50290 -41524 -133171 -218461 -78241
18260g8241K5449m8289L4997j03728M1253J19174k769n3581R667J05022j08177
$$ -78241 -52792 -101081 -66084 -169812 -128559 -9385 -12154 -65735 -56068 48954 -59223
18249e9223k5032l4729M0973P998O1417j8795r9677L3145J24223r3035j15431
$$ -59223 -84255 -118984 -78011 -70013 -8596 -27391 -127068 -93923 30300 -62735 -178166
18238a78166R4676J6081k6919J70364L7759Q2703j08915j7588J05217k9524p7861
$$ -178166 -83490 -67409 -94328 76036 113795 196498 87583 69995 175212 145688 67827
18227F7827P912J72558k1609l0777N5560J01433N148L6124k3585q8475p0647R8702
$$ 67827 75739 248297 226688 195911 251471 352904 358052 394176 370591 282116 211469 310171
18215C10171j06124J10543Q4602J0343J9545k53520j83572J3053R03M5007k3482
$$ 310171 204047 314590 399192 409535 429080 175560 -8012 5041 5944 50951 27469
18204B7469P6440M7451j4401Q0974M905K6112M6717j4628k5875j29129j70402
$$ 27469 103909 151360 136959 217933 222838 248950 295667 281039 255164 126035 -44367
18193d4367j6179j9579J24265R89m412P8174k6448o482j44837n451J64572R5121
$$ -44367 -60546 -80125 44140 45129 40717 118891 92443 85961 -58876 -64327 100245 195366
18181A95366l4780L0633O522J5671J23400L8489L8782o0354K7589j39071l2950
$$ 195366 160586 191219 197741 213412 336812 375301 414083 353729 381318 242247 209297
18170B09297Q3261M4981o1660l33q4896j43626j584J13918J03971Q1973p2008
$$ 209297 292558 337539 275879 275546 190650 47024 45440 159358 263329 345302 273294
18159B73294O0695m773o2768l9858r685J21592N1884L3536m1066K0034l2590N2269
$$ 273294 333989 329216 266448 226590 216905 338497 390381 423917 382851 402885 370295 422564
18147D22564J55348R5970O193k5724J2139K4812j4484j04023m6670J09171k0003
$$ 422564 577912 673882 680075 654351 666490 691302 676818 572795 526125 635296 615293
18136F15293Q2482K13505J02787R5373L2545J8300L8881J8530Q3112K1377J87185
$$ 615293 697775 911280 1014067 1109440 1141985 1160285 1199166 1217696 1300808 1322185 1509370
18125A509370K94471L73219L37138N2933K34885M16263N34636N76038O70658Q16357
$$ 1509370 1803841 2177060 2514198 2567131 2802016 3218279 3752915 4328953 4999611 5815968
18115E815968J117797J492178K350268L400478M689924P504195J3142616K3714148
$$ 5815968 6933765 8425943 10776211 14176689 18866613 26370808 39513424 63227572
18107F3227572L8353429L6362071J1241286j7005275l0367305k3868989j4165011
$$ 63227572 101581001 137943072 149184358 132179083 101811778 77942789 63777778
18100F3777778q864211p791870p088417n680786m361734l497370l017091k325431
$$ 63777778 54913567 47121697 40033280 34352494 29990760 26493390 23476299 21150868
18092B1150868j906307j601813j246486j153074j161809j059225j069524q28041
$$ 21150868 19244561 17642748 16396262 15243188 14081379 13022154 11952630 11124589
18084A1124589o36655o42287m96044n77246m88852k12731l03626m26370m26997
$$ 11124589 10487934 9845647 9349603 8772357 8283505 8070774 7767148 7340778 6913781
18075F913781l28340k25295j76612q4678j97922l14026k70939j84992j67503j11959
$$ 6913781 6585441 6360146 6183534 6098856 5900934 5586908 5315969 5130977 4963474 4851515
18065D851515l258n9560j37079j64928j43385j04479l40163k41089j49638m3708
$$ 4851515 4848257 4788697 4651618 4486690 4343305 4238826 3898663 3657574 3507936 3464228
18055C464228k248q4428k23097m08000p8160j13184j65417P8786K0178j9246m1438
$$ 3464228 3461980 3377552 3154455 2746455 2668295 2555111 2389694 2468480 2488658 2469412 2427974
18044B427974r0216q9627o9963n1875J0073K00868l6163j34359j64863o3149l5786
$$ 2427974 2337758 2248131 2178168 2126293 2136366 2337234 2301071 2166712 2001849 1938700 1902914
18033A902914j5592r1169O7512l8383r0579j62236q7803j21478n260j38847o4193
$$ 1902914 1887322 1796153 1863665 1825282 1734703 1572467 1484664 1363186 1357926 1219079 1154886
18022A154886L4515M9522j8857Q2772N6935Q616j20829k6592o5037j37249M6629
$$ 1154886 1189401 1238923 1220066 1302838 1359773 1368389 1247560 1220968 1155931 1018682 1065311
18011A065311O3221q1251Q2747l4825j14470J8731N2111m0334j13810m89j87436
$$ 1065311 1128532 1047281 1130028 1095203 980733 999464 1051575 1011241 897431 896942 709506
18000G09506J1147n0980l9937J8736R8454k5035l2040Q9377j66612j35022R29
$$ 709506 720653 669673 629736 648472 746926 721891 689851 779228 612616 477594 478523
17989D78523j9230n647J38561J83126j03300k08248q9065K3629O5499r578N4814
$$ 478523 459293 453646 592207 775333 672033 463785 374720 398349 463848 454270 509084
17978E09084J13612n1143j19207j3111J29343M6515o1158j56311j19018L3597
$$ 509084 622696 571553 452346 439235 568578 615093 553935 397624 278606 312203
17968C12203O5119P969N316N8563L7695m429p215q0565m2546l1118r982n8437
$$ 312203 377322 385291 390607 449170 486865 482436 475221 394656 352110 320992 311010 252573
17956B52573o4924l6877R6923J06304j3687J47849m6650k45294p2242L935M695
$$ 252573 187649 150772 247695 353999 340312 488161 441511 196217 123975 127910 132605
17945A32605K2882Q4241L2139j7972j09687n2883j6497l6272R7162K34044P6357
$$ 132605 155487 239728 271867 253895 144208 91325 74828 38556 135718 369762 446119
17934D46119o7283q7012J8548K0023j8535K322K3906o5880J6222J12591j81715
$$ 446119 378836 291824 310372 330395 311860 314182 338088 272208 288430 401021 219306
17923B19306k19947M3609k3876m4333M1734J5893n039K06819J33703K5446j22762
$$ 219306 -641 42968 19092 -25241 16493 32386 27347 234166 367869 393315 270553
17912B70553j57343j04404R6829J06456p258P120k1057O6601J2291m2770j06744
$$ 270553 113210 8806 105635 212091 204833 211953 190896 257497 269788 227018 120274
17901A20274m5455M1204J06634n5372m249M26K6646j1395o6945R691Q8568l793
$$ 120274 74819 116023 222657 167285 163036 163462 190108 178713 111768 121459 210027 206234
17889B06234j80540m6348J40411J69938k7163n5112k7039j61527n6167j9994n0265
$$ 206234 25694 -20654 119757 289695 262532 207420 180381 18854 -37313 -57307 -107572
17878a07572K462l7818L9263R9038K9611l5933l0727O8084Q9801J58338j2283
$$ -107572 -105110 -142928 -103665 -4627 24984 -10949 -41676 26408 116209 274547 262264
17867B62264j15900j52237q5826J88627M4864j0199L6628o4497J28533M4519O8704
$$ 262264 146364 -5873 -91699 96928 141792 131593 168221 103724 232257 276776 345480
17856C45480m6584q5904r3718M3814r3801m2371l6206k4246J51843P0186j21339
$$ 345480 298896 212992 119274 163088 69287 26916 -9290 -33536 118307 188493 67154
17845F7154j24619p3286K1105R4621J8651j11107J3564M9917l127R1827J70667
$$ 67154 -57465 -130751 -109646 -15025 3626 -107481 -93917 -44000 -47127 44700 215367
17834B15367k4864m833L2287o5161o5542k8510p8400l8723J42606J16356r2199
$$ 215367 190503 185670 217957 152796 87254 58744 -19656 -58379 84227 200583 108384
17823A08384o8844j32361k56M7631K6408m4853l519j38288p4683L7753J2983J40739
$$ 108384 39540 -92821 -93077 -45446 -19038 -63891 -67410 -205698 -280381 -242628 -229645 -88906
17811h8906O2163l5462K4153M9545L475o9496o0986l765L208J7140j2038p342
$$ -88906 -26743 -62205 -38052 11493 14968 -54528 -115514 -119279 -116071 -98931 -110969 -118311
17799a18311n3839k9838J00569R7075j12378N6991L9191j03666M4853P8072j00036
$$ -118311 -172150 -201988 -101419 -4344 -116722 -59731 -20540 -124206 -79353 -1281 -101317
17788a01317j18913q181J45872O1862n4765M1516q3112K3212o1952L6884J19212
$$ -101317 -220230 -228411 -82539 -20677 -75442 -33926 -117038 -93826 -155778 -118894 318
17777C18O960o2257j3044p7783o9428J62559J46332J18914r9846m3041p0310r9564
$$ 318 7278 -54979 -68023 -145806 -215234 -52675 93657 212571 112725 69684 -626 -100190
17765a00190M3081J90930J1815P8507L8072r6807j09847r8622r3872m6835K7487
$$ -100190 -57109 133821 145636 224143 262215 165408 55561 -43061 -136933 -183768 -156281
17754a56281R1337l8695n4073J9859N0919j5318j35225M635R4010J31893k2135
$$ -156281 -64944 -103639 -157712 -137853 -86934 -102252 -237477 -232842 -138832 -6939 -29074
17743b9074j13354j3743N2172J00490J58629j182K8954l8783j0893j54249q8554
$$ -29074 -142428 -156171 -103999 -3509 155120 153938 182892 144109 133216 -21033 -109587
17732a09587J62516J29786m4681l057k5415Q3647K1635l6467k3142j04175l4009
$$ -109587 52929 182715 138034 134977 109562 193209 214844 178377 155235 51060 17051
17721A7051J49646j0692r063m0769N0377r1384O9645O5920m9585q6333l6402R2144
$$ 17051 166697 156005 146942 106173 156550 65166 134811 200731 151146 64813 28411 120555
17709A20555j585Q7994J34385L3303j60013j15715P0785q4213j24595p6917J50789
$$ 120555 118970 206964 341349 374652 214639 98924 169709 85496 -39099 -116016 34773
17698C4773R4464l6811P0440N1589j70239n0298J4394O4478J01359K3177J87837
$$ 34773 129237 92426 162866 214455 44216 -6082 8312 72790 174149 197326 385163
17687C85163l1011k26598k129j7842m8541n3104k0141j1898q9959q4222J08696
$$ 385163 354152 127554 125425 107583 59042 5938 -14203 -26101 -116060 -200282 -91586
17676i1586j27424q8341K26835J34859j7374l2926o2661r7071Q9903J04911K8013
$$ -91586 -219010 -307351 -80516 54343 36969 4043 -58618 -155689 -65786 39125 67138
17665F7138J2354P4064P8488m5823r3383J3462O255j1793j04172j3615M0905n2191
$$ 67138 79492 153556 232044 186221 92838 106300 112555 100762 -3410 -17025 23880 -28311
17653b8311k5060J1715J41525J20071j36717Q8457J42326j0935j49193O2047o2937
$$ -28311 -53371 -41656 99869 219940 83223 171680 314006 303071 153878 215925 152988
17642A52988K982Q817M0534m6739n0455r8941j24706J23289M7819j3283r4395
$$ 152988 155970 164787 205321 158582 108127 9186 -115520 7769 55588 42305 -52090
17631e2090r2040J21635k6799j1898P8401J53393J08480j78307k13356k04605
$$ -52090 -144130 -22495 -49294 -61192 17209 170602 279082 100775 -112581 -317186
17621c17186j32486K7548N5679L3024N7446Q7811K9243l7466q6635N5151J05400
$$ -317186 -449672 -422124 -366445 -333421 -275975 -188164 -158921 -196387 -283022 -227871 -122471
17610a22471J77910L0844n1638l3477K1549q676k13439J5869J53141L6478k5736
$$ -122471 55439 86283 34645 1168 22717 14041 -199398 -183529 -30388 6090 -19646
17599a9646L2548l1259J40750m1995p5038n2208p171R9396n9260j19762l9520
$$ -19646 12902 -18357 122393 80398 5360 -46848 -54019 45377 -13883 -133645 -173165
17588a73165o170m6369K1246j0539q6536J98206J28074J8688M1629o9015o459
$$ -173165 -179335 -225704 -204458 -214997 -301533 -103327 24747 43435 85064 16049 9590
17577I590r9988r1809j3148J14014K9966m2564M3903K4720L6721L467r9820k4995
$$ 9590 -90398 -182207 -195355 -81341 -51375 -93939 -50036 -25316 11405 14872 -84948 -109943
17565a09943R7059J9084Q9829j09254q9844K6674O7327J64844K9250k4779j12393
$$ -109943 -12884 6200 96029 -13225 -103069 -76395 -9068 155776 185026 160247 47854
17554D7854j57894K0950K6512M1896o7105m8302M3230K47856O6935q1015j8798
$$ 47854 -110040 -89090 -62578 -20682 -87787 -136089 -92859 154997 221932 140917 122119
17543A22119m2651m6017N1003q5812M4720N0681j51381J6294J28716Q5526o1426
$$ 122119 79468 33451 84454 -1358 43362 94043 -57338 -41044 87672 173198 111772
17532A11772o9224J7769q8614l8649J84019J08291j11442k4135m9461M544m8179
$$ 111772 42548 60317 -28297 -66946 117073 225364 113922 89787 40326 44870 -3309
17521c309o730L0804N986k4777j8551R279O7227l975K2945K6504n0057j09579
$$ -3309 -10039 20765 26751 1974 -16577 -7298 59929 55954 78899 105403 55346 -54233
17509e4233O1810J24454N0908l0948k233R0946q7718j93602j81747N8108M0883
$$ -54233 7577 132031 182939 151991 149758 240704 152986 -40616 -222363 -164255 -123372
17498a23372K22453Q2553p969l3001p8412j35325J4548l151j11018M9225J05795
$$ -123372 99081 181634 173665 140664 62252 -73073 -58525 -61676 -172694 -123469 -17674
17487a7674P7728N3886p454p9254j46823R7298Q7719r511J830N2905j5436n2862
$$ -17674 60054 113940 106486 27232 -119591 -22293 65426 55915 57745 110650 95214 42352
17475D2352m5555L786J0591m0491L5537J885r2010L1101k6543J09105J58945M8482
$$ 42352 -3203 583 11174 -29317 6220 8105 -83905 -52804 -79347 29758 188703 237185
17463B37185q9593o6456k358J4620N0006p53j7315r8112l2139L2881m8035n113
$$ 237185 147592 81136 78778 93398 143404 142651 125336 27224 -4915 27966 -20069 -25182
17451b5182Q937Q5604Q8256l0465J1227J55179L0597k4870q2591p2934K26369
$$ -25182 -16245 69359 157615 127150 138377 293556 324153 299283 216692 143758 370127
17440C70127K30334M0715m7827k65799p922J01821j330m3022k1752r4861p0514
$$ 370127 600461 641176 593349 327550 319628 421449 420119 377097 355345 260484 189970
17429A89970j8768q7811q5040k3673n4817r746J11375K03803l1760K036K8755
$$ 189970 171202 83391 -1649 -25322 -80139 -89885 21490 225293 193533 195569 224324
17418B24324M6492l7304J36750k2753n0491r9034J5140k1404j33248p5416L64
$$ 224324 270816 233512 370262 347509 297018 197984 213124 191720 58472 -16944 -16580
17407a6580l8074r8393j3196K0400J43872R0904m4732m193j09083m9742J49787
$$ -16580 -54654 -153047 -166243 -145843 -1971 88933 44201 40008 -69075 -118817 30970
17396C0970J6879j05406N9576Q0996L5044l0818O663n2863J28710K6381n7862
$$ 30970 47849 -57557 2019 83015 118059 87241 93904 41041 169751 196132 138270
17385A38270r7916O1560P4098O9954j76323n9377N9131P8068J6940J527j50282
$$ 138270 40354 101914 176012 245966 69643 10266 69397 147465 164405 165932 15650
17374A5650k7532J16244M3946O4624j4938j955Q9134j61061k53440p0920J27830
$$ 15650 -11882 104362 148308 212932 197994 196039 285173 124112 -129328 -200248 -72418
17363g2418O7846R9074j01238L7340M3026n8142o3865J3507L5438l2599J24360
$$ -72418 -4572 94502 -6736 30604 73630 15488 -48377 -34870 568 -32031 92329
17352I2329J28669k3341r8481J2892j04590k9388o1407J38968l4235j48079J0381
$$ 92329 220998 197657 99176 112068 7478 -21910 -83317 55651 21416 -126663 -116282
17341a16282M6630L631N2232r2505N1793N6328J55153q1783q3613k5996O1693
$$ -116282 -69652 -66021 -13789 -106294 -54501 1827 156980 75197 -8416 -34412 27281
17330B7281Q3036q9937l5990O2321P599r234n362P8560n5859p1129m2254k365
$$ 27281 110317 20380 -15610 46711 54310 45076 39714 118274 62415 -8714 -50968 -53333
17318e3333J05815l5811m9484j3128J4083Q3783Q7127N4173J300P173J854m3909
$$ -53333 52482 16671 -32813 -45941 -31858 51925 139052 193225 194525 201698 203552 159643
17306A59643p8042m0095r7636o4174N1047Q2631j48785n7101o1410j30456J884
$$ 159643 81601 41506 -56130 -120304 -69257 13374 -135411 -192512 -253922 -384378 -382494
17295c82494J12540Q4484J8270m042L4354m8157k0235Q4665K2478R419j01728
$$ -382494 -269954 -185470 -167200 -171242 -136888 -185045 -205280 -120615 -98137 -88718 -190446
17284a90446j44456P6222P0378o4243J85263K2046p8731M0069R3536j7735j50583
$$ -190446 -334902 -258680 -188302 -252545 -67282 -45236 -123967 -83898 9638 -8097 -158680
17273a58680j37342P0556M5878P3687R9019p7438j5880J49202l7272r4716j06120
$$ -158680 -296022 -225466 -179588 -105901 -6882 -84320 -100200 49002 11730 -82986 -189106
17262a89106R2561J54516l9744K5942Q3809O145p95M176j48730q6082o0580K7969
$$ -189106 -96545 57971 18227 44169 127978 134123 133328 137504 -11226 -97308 -157888 -129919
17250a29919l5681J9504R0961M92j12944L0383Q2471P4503q3900j18957p1319
$$ -129919 -165600 -146096 -55135 -54643 -167587 -137204 -54733 19770 -64130 -183087 -254406
17239b54406L4903K04906M2041l5592R67O8908p932o0888k0976k4677M4080j8601
$$ -254406 -219503 -14597 27444 -8148 -7181 61727 53795 -7093 -28069 -52746 -8666 -27267
17227b7267J43015O5271j48213k02286L0091J84134J55262j43693j56148K940
$$ -27267 115748 181019 32806 -169480 -139389 44745 200007 56314 -99834 -96894
17217i6894l1894n017J89325L3379j6347j10970P4209O009o766j09701j8683l5671
$$ -96894 -128788 -133805 55520 88899 72552 -38418 35791 41800 35034 -74667 -93350 -129021
17205a29021O7560O836o1114M6670R9508L1280j1876j39040M3348l8328N1455
$$ -129021 -61461 -54625 -115739 -69069 30439 61719 49843 -89197 -45849 -84177 -32722
17194c2722L218p9323K2750P3177P3425j13698k7769O4132p7153K1344J9777k9924
$$ -32722 -29504 -108827 -86077 -12900 60525 -53173 -80942 -16810 -93963 -72619 -52842 -82766
17182h2766J09398J33821K6161j46655n7594n5683j09069N974J32387N2318q4811
$$ -82766 26632 160453 186614 39959 -17635 -73318 -182387 -176413 -44026 8292 -76519
17171g6519r2847O8981j18082l5488M6568N1651j3244P2393m7837k086J13808
$$ -76519 -169366 -100385 -218467 -253955 -207387 -155736 -168980 -96587 -144424 -146510 -32702
17160c2702L2056J08085R0140j62690j87610N4997Q2026m994j19434J1981L7643
$$ -32702 -646 107439 197579 34889 -152721 -97724 -15698 -20692 -140126 -128145 -90502
17149i0502J18075K042l0668o9048q5921R8762O0072R2055j8039j17002N0147
$$ -90502 27573 29615 -1053 -70101 -156022 -57260 2812 94867 76828 -40174 9973
17138I973Q2288j31366p6516Q1177P726P716P058J07527k5451M174l5231j01679
$$ 9973 92261 -39105 -115621 -34444 -26718 -19002 -11944 95583 70132 74306 39075 -62604
17126f2604J6728k67L0970J3798o1881Q8535n5281j84299J49992R518j5506R2728
$$ -62604 -45876 -46143 -15173 -1375 -63256 25279 -30002 -214301 -64309 -54791 -70297 22431
17114B2431O924j1264N5081M34j03250j06736N724M8383N0444J04762Q71k9380
$$ 22431 29355 18091 73172 73606 -29644 -136380 -130656 -82273 -31829 72933 73804 44424
17102D4424L3872J20526N7359k58478q4456J02021m4578j77223p8781J20540J82
$$ 44424 78296 198822 256181 -2297 -86753 15268 -29310 -206533 -285314 -164774 -164592
17091a64592Q8593j4035q7581n9365J98241J40441n8129l5867R1611k867j883
$$ -164592 -75999 -90034 -177615 -236980 -38739 101702 43573 7706 99317 96450 94567
17080I4567r0225m0732j02060j40550J37285M0035N0966l1538j25779K394j51255
$$ 94567 4342 -36390 -138450 -279000 -141715 -101680 -50714 -82252 -208031 -205637 -356892
17069c56892j292J63781J08648k4614P564J2585m2909l8917p4418P0576M7394
$$ -356892 -358184 -194403 -85755 -110369 -102805 -90220 -133129 -172046 -246464 -175888 -128494
17058a28494Q3810O5726P3250q721j06449O898J95541r3138j43373p3077J03741
$$ -128494 -44684 21042 94292 85571 -20878 -13980 181561 88423 -54950 -128027 -24286
17047b4286J11595J08704q9331p0208o5670j51702J03988L0909R1965O004o3380
$$ -24286 87309 196013 106682 36474 -29196 -180898 -76910 -46001 45964 51968 -11412
17036a1412l6821L0779K3489P9160N4129m3851k8478n4006q3922r5393R5977k7688
$$ -11412 -48233 -17454 6035 85195 139324 95473 66995 12989 -70933 -166326 -70349 -98037
17024i8037p4574O3299J20422p9730k9999Q0961O0190P0467R4127j21758n2942
$$ -98037 -172611 -109312 11110 -68620 -98619 -17658 42532 112999 207126 85368 32426
17013C2426j27480N8213L4372M1420m9566o8067r2489j00132j9876P5458L3726
$$ 32426 -95054 -36841 -2469 38951 -10615 -78682 -171171 -271303 -291179 -215721 -181995
17002a81995q100R1722n185R6128p5418P4812J792l6550j9278L1557K8817P3420
$$ -181995 -190095 -98373 -103558 -7430 -82848 -8036 -6244 -42794 -62072 -30515 -1698 71722
16990G1722o7265j06709j6263n3664n8283P2900Q4065Q170m0686J17381J20742
$$ 71722 4457 -102252 -118515 -172179 -230462 -157562 -73497 -65327 -106013 11368 132110
16979A32110M6942l2253j3443M3130Q8090j43015m36J19234l0410j74652l0320
$$ 132110 179052 146799 133356 176486 264576 121561 121125 240359 209949 35297 4977
16968D977L8473j37182J21424P9235n6323o6266o7693q2663O0523o1638M5444
$$ 4977 43450 -93732 27692 106927 50604 -15662 -83355 -166018 -105495 -167133 -121689
16957a21689J08810p3007k490M663j11492j60269n3636J35584J75985N9140k5108
$$ -121689 -12879 -85886 -88376 -83713 -195205 -355474 -409110 -273526 -97541 -38401 -63509
16946f3509j66341M7505K40877K0483q9045n1727M9191K30169j31760j34500o656
$$ -63509 -229850 -182345 58532 79015 -10030 -61757 -12566 217603 85843 -48657 -55313
16935e5313J04858k2830j17254K8113J21730O023j307m2424O1599k8763j47582
$$ -55313 49545 26715 -90539 -62426 59304 65327 64020 21596 83195 54432 -93150
16924i3150m8660N2984m8825K6574j837l6267K8172N8029j18678L6346K6605Q6530
$$ -93150 -141810 -88826 -137651 -111077 -112914 -149181 -121009 -62980 -181658 -145312 -118707 -32177
16912c2177p7947K0041L3317Q9825q1099k04810j1334J33011P2585p3977l2380
$$ -32177 -110124 -90083 -56766 33059 -48040 -252850 -264184 -131173 -58588 -132565 -164945
16901a64945J18157L286J01099n9152j03943j19966O7932J04530N4159j9015j5720
$$ -164945 -46788 -43502 57597 -1555 -105498 -225464 -157532 -53002 1157 -17858 -33578
16890c3578J09755N1827m4852R5463J5913l3547k18351k95785J28046K15294p5862
$$ -33578 76177 128004 83152 178615 194528 160981 -57370 -353155 -225109 -9815 -85677
16879h5677O6245P43r8497l6990J62578R8572p1387k59910j07846N9865J56948
$$ -85677 -19432 -18689 -117186 -154176 8402 106974 35587 -224323 -332169 -272304 -115356
16868a15356J55319L6260q4803Q544O3245M7729r9862n871k3689j01490l4623
$$ -115356 39963 76223 -8580 -36 63209 110938 11076 5205 -18484 -119974 -154597
16857a54597L0055O378O3911N8305k1091n7736Q1653P6152m1497L012L9909j13991
$$ -154597 -124542 -118164 -54253 4052 -17039 -74775 6878 83030 41533 44545 84454 -29537
16845b9537r9613J3518K1232J25138n4517q2162l5523Q41o8360o345J0461n9808
$$ -29537 -129150 -115632 -94400 30738 -23779 -105941 -141464 -140623 -208983 -215328 -204867 -264675
16833b64675Q0254N0445J01661J74146M8194p3688o693m0931m892J0657J166L1434
$$ -264675 -184421 -133976 -32315 141831 190025 116337 109644 68713 63821 74478 75644 107078
16821A07078q841j07784j12951N436M2464j6161p1390K3785J43023m5629q0983
$$ 107078 98237 -9547 -122498 -117062 -74598 -90759 -162149 -138364 4659 -40970 -121953
16810a21953O3365R484n4882m4741K6606O4120n4958R1714o776l5803R8880O1321
$$ -121953 -58588 -49104 -103986 -148727 -122121 -58001 -112959 -21245 -28021 -63824 35056 96377
16798I6377j08334L1610K4268j0999n9341r9991n2617L1800N9680O9550J3490
$$ 96377 -11957 19653 43921 32922 -26419 -126410 -179027 -147227 -87547 -17997 -4507
16787d507p2982J6118K01811J50590k1312j17712p6928j03982j05225q862M0748
$$ -4507 -77489 -61371 140440 291030 269718 152006 75078 -28904 -134129 -142991 -102243
16776a02243k3494r037R4345P0506l4731r8747K4901M5001Q2728k9632m9380j07165
$$ -102243 -125737 -134774 -40429 30077 -4654 -103401 -78500 -33499 49229 19597 -29783 -136948
16764a36948M9838k5151M7713k33M5502l1408r171j34998j8742o2751K40763J37718
$$ -136948 -87110 -112261 -64548 -64781 -19279 -50687 -59858 -194856 -213598 -276349 -35586 102132
16752A02132J7170j20241r3514L5765K9441m3163J4538P945k8579p6566K45935
$$ 102132 119302 -939 -94453 -58688 -29247 -72410 -57872 -49927 -78506 -155072 90863
16741I0863J52695P74M4751K762r5196n5039p4673j03325K3648q3658o4680n5552
$$ 90863 243558 244332 289083 291845 196649 141610 66937 -36388 -12740 -96398 -161078 -216630
16729b16630J147j7618n339Q8296k6728N0719j0718J10067O3460j40753m5414
$$ -216630 -215483 -233101 -238440 -150144 -176872 -126153 -136871 -26804 36656 -104097 -149511
16718a49511k4583N5856K561J2208Q2823L4556m1152K6j05337P4375J91874J58910
$$ -149511 -174094 -118238 -115677 -103469 -20646 13910 -27242 -27216 -132553 -58178 133696 292606
16706B92606L543j69721o36L9891p8734J0598q4623R4500p689j32912j28053m8764
$$ 292606 296149 126428 125792 165683 86949 97547 12924 107424 99735 -33177 -161230 -209994
16694b09994Q3310K0878j34391p417r564J12383m6391j35421P0919J46633R4950
$$ -209994 -126684 -105806 -240197 -247614 -257178 -144795 -191186 -326607 -255688 -109055 -14105
16683a4105J16835L4725q5339J14141o1198k7019L6663o9126j0183q1230j12656
$$ -14105 102730 137455 52116 166257 105059 78040 114703 45577 35394 -45836 -158492
16672a58492M731j86R6914L7811Q1652L7879p7716r3697j6463R705O7073O7598
$$ -158492 -153761 -153947 -57033 -19222 62430 100309 22593 -71104 -87567 -77862 -10789 56809
16660E6809n9701m0253K0855P631K8594L8033l1388Q0178l1369n7184n3452J15047
$$ 56809 -2892 -43145 -22290 -14659 13935 51968 20580 100758 69389 12205 -41247 73800
16648G3800P0915j49308M7271N8364J39485n794m519L6798j10279J2112j0416
$$ 73800 144715 -4593 42678 101042 240527 234733 230214 267012 156733 168845 158429
16637A58429l7151J05240L3281L9750k3267p2022J7877p7142j11629m9851j13439
$$ 158429 121278 226518 259799 299549 276282 204260 222137 144995 33366 -16485 -129924
16626a29924k0154N3576J61002P1368M7656N6447j31687K9060K336k6528M4560
$$ -129924 -150078 -96502 64500 135868 183524 239971 108284 137344 139680 113152 157712
16615A57712Q3105j08507j01811J16372j15715j7285n157L3685l2433j1923K01894
$$ 157712 240817 132310 30499 146871 31156 13871 8714 42399 9966 -1957 199937
16604A99937J1040j21610R419j19328N9403j2508o2531q6113j0581j38673Q8651
$$ 199937 210977 89367 98786 -20542 38861 26353 -36178 -122291 -132872 -271545 -182894
16593a82894P0395M319M0373p182O8332J00329M0336Q6246o5574j03169q8513
$$ -182894 -112499 -108180 -67807 -74989 -6657 93672 134008 220254 154680 51511 -37002
16582c7002j57117p5677J80227J68055R8629l2121p0435k1424j5448J00068r9797
$$ -37002 -194119 -269796 -89569 78486 177115 144994 74559 53135 37687 137755 37958
16571C7958j75667o2939J58280k824k0244J80637o971j36565r9590N5607j6646
$$ 37958 -137709 -200648 -42368 -45192 -65436 115201 108230 -28335 -127925 -72318 -88964
16560h8964n6056m3399Q1847K35798P482k01522j00785Q4442j32461m4110O9824
$$ -88964 -145020 -188419 -106572 129226 136708 -64814 -165599 -81157 -213618 -257728 -187904
16549a87904J37050J26508j84313j23518j1713j39074R2016R2555L1987Q7096
$$ -187904 -50854 75654 -108659 -232177 -243890 -382964 -290948 -198393 -166406 -79310
16539g9310O287J13005J01150j66516k09162J9591Q1171O3317r1003q5643q3022
$$ -79310 -73023 39982 141132 -25384 -234546 -214955 -133784 -70467 -161470 -247113 -330135
16528c30135p1043J41252J94088N2957j0815L4623l8635j1425L263P0829k2223
$$ -330135 -401178 -259926 -65838 -12881 -23696 10927 -27708 -39133 -35870 34959 12736
16517A2736Q1750L2564l0315j71920R399J5823o6870N129M1889K1345K3289j9507
$$ 12736 94486 127050 96735 -75185 -65786 -49963 -116833 -111704 -69815 -48470 -25181 -44688
16505d4688o6315L2300J21822J47596J55752j51933j44224N7923L2535m1930Q541
$$ -44688 -111003 -78703 43119 190715 346467 194534 50310 108233 140768 98838 107379
16494A07379K17390n1822r0169q4257j24983J5062j50282N7083J15673n6349j4004
$$ 107379 324769 272947 182778 98521 -26462 -11400 -161682 -104599 11074 -45275 -59279
16483e9279j7119R5187l1544q8846Q9459m8674m3685Q8704Q4666m4838K3858l5808
$$ -59279 -76398 18789 -12755 -101601 -12142 -60816 -104501 -15797 68869 24031 47889 12081
16471A2081o0432m5700n113M7350K0000P1509j02188j30848j8533J38567o005
$$ 12081 -48351 -94051 -99164 -51814 -31814 39695 -62493 -193341 -211874 -73307 -79312
16460g9312P2136o8530N4829J0697L0784l8740N0910j06324n5639O4312P5635
$$ -79312 -7176 -75706 -20877 -10180 20604 -18136 32774 -73550 -129189 -64877 10758
16449A0758O7192O0007n2156J5928J19023O6733j00899j18712n5230Q1596k3761
$$ 10758 77950 137957 85801 101729 220752 287485 186586 67874 12644 94240 70479
16438G0479m455p0664n9176J64372J46946l75o5783j2879j39525o1906l1716R1180
$$ 70479 66024 -4640 -63816 100556 247502 247127 181344 168465 28940 -32966 -64682 26498
16426B6498J4028m9485q078l5052R983M7958l9991l9690N343N5511M2429K5361
$$ 26498 40526 -8959 -17037 -52089 -42106 5852 -34139 -73829 -68486 -12975 29454 54815
16414E4815r0635P647J8765O3358k2663O4766J08301k0789p7102M8069j40310
$$ 54815 -35820 -28173 -9408 53950 31287 96053 204354 183565 106463 154532 14222
16403A4222q5557O5317J9655M1445j3590J16n4177M1793O074j41406r2525J01447
$$ 14222 -71335 -6018 13637 55082 41492 41608 -12569 29224 35298 -106108 -198633 -97186
16391i7186K12332l3033n7764p7146j10494j48890J58620R5774O4165N6154j02862
$$ -97186 115146 82113 24349 -52797 -163291 -312181 -153561 -57787 6378 62532 -40330
16380d0330j1637O2807J9576J28950J08704J1713Q2664p3964o4590o8820o9229
$$ -40330 -51967 10840 30416 159366 268070 279783 362447 288483 223893 155073 85844
16369H5844p5618R7696K4569l2775L0740m1771r4206j0269L8770k8424j47623
$$ 85844 10226 107922 132491 99716 130456 88685 -5521 -15790 22980 -5444 -153067
16358a53067r1955Q1859J84672J9586L6186P2645o1242j06967k5727N7534n2962
$$ -153067 -245022 -163163 21509 41095 77281 149926 88684 -18283 -44010 13524 -39438
16347c9438m9548J9260L3890m3725M2264J48732l9353k18842o2947K2075J54139
$$ -39438 -88986 -69726 -35836 -79561 -37297 111435 72082 -146760 -209707 -187632 -33493
16336c3493J29124K5152K91o0007l9754o8975j75994j26151j3281J31910l4663
$$ -33493 95631 120783 121074 61067 21313 -47662 -223656 -349807 -363088 -231178 -265841
16325b65841K9415K6877O3582J15270o312R6580J337r742l1797k04240j29716
$$ -265841 -236426 -209549 -145967 -30697 -37009 59571 60908 51166 19369 -184871 -314587
16314c14587J19856J66400j63320n7899J11258J33832J01188l0600n0027M2748
$$ -314587 -194731 -28331 -191651 -249550 -138292 -4460 96728 66128 16101 58849
16304E8849Q7503j32053o9931J0348m009L2404J8994O9851m5535j89809p5207
$$ 58849 146352 14299 -55632 -45284 -49293 -16889 2105 71956 26421 -163388 -238595
16293b38595j3569R0948J4368k055N0449Q2828N6882m1000O6031n6608K2017p5298
$$ -238595 -252164 -161216 -146848 -148903 -98454 -15626 41256 256 66287 9679 31696 -43602
16281d3602J754k2535J22251q975j7005O550R798n5746J258n5981K7331J2094
$$ -43602 -41848 -64383 57868 48893 31888 38438 48236 -7510 -6252 -62233 -34902 -22808
16269b2808M0427J22869j8064l2391L5018k5673K7175p7046j33480N8536J39917
$$ -22808 17619 140488 122424 90033 125051 99378 126553 49507 -83973 -25437 114480
16258A14480N1439l532q6397k00762j14704n4169j0758J10017K10042J27725j09005
$$ 114480 165919 162387 75990 -124772 -239476 -293645 -304403 -194386 15656 143381 34376
16247C4376r8801j02919o437J45662N6473L1217o7628J19982r1105j47339q1052
$$ 34376 -64425 -167344 -173781 -28119 28354 59571 -8057 111925 20820 -126519 -207571
16236b07571L0196L7554N0774J8913P4750J00516o930J9374j28548j1687N5866
$$ -207571 -177375 -139821 -89047 -70134 4616 105132 98202 117576 -10972 -22659 33207
16225C3207k8473R7958k2072j16327k3583k2466J6363J11084P3234O262k0592
$$ 33207 4734 102692 80620 -35707 -59290 -81756 -65393 45691 118925 125187 104595
16214A04595k8879r348j17357Q9111J21234J32790L0719m0379o0813q8809m3298
$$ 104595 75716 66368 -50989 38122 159356 292146 322865 282486 221673 132864 89566
16203H9566n3615O1781m0212J276L5930m9741M6550R955L1875J2872n2089r2255
$$ 89566 35951 97732 57520 58796 94726 44985 91535 101490 133365 146237 94148 1893
16191A893O2616J0944N7937l3557J0983J03441J35778j18848k31833k01353k8511
$$ 1893 64509 75453 133390 99833 110816 214257 350035 231187 -646 -201999 -230510
16180b30510M8064n7229l0392P8886N2171l3170O4494P1186k6160P1082J27202
$$ -230510 -182446 -239675 -270067 -191181 -139010 -172180 -107686 -36500 -62660 8422 135624
16169A35624J9944r1792P015R18k03826P4557J98871l4385l9065o0821M7577m2062
$$ 135624 155568 63776 70791 71709 -132117 -57560 141311 106926 67861 7040 54617 12555
16157A2555o8755J25056N1548m5442J07527j3478o9983o0040L6299k7376J1525
$$ 12555 -56200 68856 120404 74962 182489 169011 99028 38988 75287 47911 59436
16146E9436q7760j06183L2321M212q1189n864O1833N6138N0064k310N9819K6623
$$ 59436 -28324 -134507 -102186 -97974 -179163 -185027 -123194 -67056 -16992 -19302 40517 67140
16134F7140j05299j9555K4287l844J14533M0253P5120o092j57115j66651j07094
$$ 67140 -38159 -57714 -33427 -37271 77262 117515 192635 186543 29428 -137223 -244317
16123b44317J46482J18186o6382r8172L7440r35M060K0099j28406p7509Q2752
$$ -244317 -97835 20351 -46031 -144203 -106763 -107698 -103638 -83539 -211945 -289454 -206702
16112b06702Q8241j2603n1360N1965P6127R441J06682k3604j20640j72769l2689
$$ -206702 -118461 -131064 -182424 -130459 -54332 -44891 61791 38187 -82453 -255222 -287911
16101b87911Q181O4654M2727j2767J7918j7433J45955Q5095q9880n2910j849J03292
$$ -287911 -279730 -215076 -172349 -185116 -167198 -184631 -38676 46419 -43461 -96371 -98220 5072
16089E072Q2723M1989p9723j13787l7355M1424k6969o3852k1004M8939K14133
$$ 5072 87795 129784 50061 -63726 -101081 -59657 -86626 -150478 -171482 -122543 91590
16078I1590J7931j008l1370m5485l6734R9586j17763O5049K8827m9065L2404j75360
$$ 91590 109521 108513 77143 31658 -5076 94510 -23253 41796 70623 21558 53962 -121398
16066a21398n1076K18525n104j5203J0381N4737P3414m4343l0773N3419q3372
$$ -121398 -172474 46051 40947 25744 36125 90862 164276 119933 89160 142579 59207
16055E9207L5504K8204j00032J0662r76L8613m1713j49592O3776P2819J3194j2526
$$ 59207 94711 122915 22883 33545 32569 71182 29469 -120123 -56347 16472 29666 17140
16043A7140m0190J88193M0752j01761O2517K00688l2828j05651m7256n449J3609
$$ 17140 -23050 165143 205895 104134 166651 367339 334511 228860 181604 176155 189764
16032A89764o9303j50992k78475l060J55110J31145p713J05760O1003n0834n6534
$$ 189764 120461 -30531 -309006 -312066 -156956 -25811 -33524 72236 133239 82405 25871
16021B5871q5315l5106J27613R4638J8391j06969M0667k863N5265N2481j41553
$$ 25871 -59444 -94550 33063 127701 146092 39123 79790 76927 132192 184673 43120
16010D3120l5507N7042J08007K3526j10548Q3107o6444o5519m3404K8588M0022
$$ 43120 7613 64655 172662 196188 85640 168747 102303 36784 -6620 21968 61990
15999F1990r235M2946L6405J03125r4349K5400J2879K719L0353o0315J1347j45755
$$ 61990 52755 95701 132106 235231 140882 166282 179161 181880 212233 151918 163265 17510
15987A7510l4405K5233j26458o071n2300n8986k5530p9444J70186J40319L9370
$$ 17510 -16895 8338 -118120 -124191 -176491 -235477 -261007 -340451 -170265 -29946 9424
15976I424O8696K4321m3721o2363J7299M6064J22701J876o1404k7196p8319K1643
$$ 9424 78120 102441 58720 -3643 13656 59720 182421 184297 122893 95697 17378 39021
15964C9021l3930L4635R697M0958j5328M7791j62479r7895l3370L748J38415m0044
$$ 39021 5091 39726 49423 90381 75053 122844 -39635 -137530 -170900 -167152 -28737 -68781
15952f8781L5917R9282p9058k1028j15882O2443K3900O198p3988r479k9444M5836
$$ -68781 -32864 66418 -12640 -33668 -149550 -87107 -63207 -57009 -130997 -140476 -169920 -124084
15940a24084J56549P6399l3592K556Q3073n0066J5505q1319k3274L4004L3349
$$ -124084 32465 108864 75272 77828 160901 110835 126340 45021 21747 55751 89100
15929H9100o4981k5923L5797j4505J2170K6237J0861j5901J14981Q4628p6941
$$ 89100 24119 -1804 33993 19488 31658 57895 68756 52855 167836 252464 175523
15918A75523M295n2087L4352r8468j30811K0138J12633R0831j1656j48776k5637
$$ 175523 179818 127731 162083 63615 -67196 -47058 65575 156406 144750 -4026 -29663
15907b9663l3403L7583O6597j09694j6180q0720R3801N6516j38285K3211P3907
$$ -29663 -63066 -25483 41114 -68580 -84760 -165480 -71679 -15163 -153448 -130237 -56330
15896e6330R036n9485J22290M4093o7600o40j23434q6214J4815p2886J25355J15365
$$ -56330 -47294 -106779 15511 59604 -7996 -8636 -132070 -218284 -203469 -276355 -151000 -35635
15884c5635Q4552M5599N8600n7558j7320l293j8304j07354n138M5050R3956O9198
$$ -35635 48917 94516 153116 95558 78238 74945 56641 -50713 -55851 -10801 83155 152353
15872A52353P418j03832j3041q6814O2933O8613R6071J5032J4706l8769Q7328
$$ 152353 159771 55939 42898 -43916 19017 87630 183701 198733 213439 174670 261998
15861B61998k9791q7039r3111Q9133L6766q9172j14012K052M947J18523n5404
$$ 261998 232207 145168 52057 141190 177956 88784 -25228 -23176 -18229 100294 44890
15850D4890p9597j6832m2864K3133M2886l2804j30792o2012K11563J93105o3834
$$ 44890 -34707 -51539 -94403 -71270 -28384 -61188 -191980 -253992 -42429 150676 86842
15839H6842l5200J4440j05692L6300j2618k5436l4053J17820Q4348L0181J5367
$$ 86842 51642 66082 -39610 -3310 -15928 -41364 -75417 42403 126751 156932 172299
15828A72299n7023K0922L2103j67386K8016L774o6657R9160l6906K2914p6622
$$ 172299 115276 136198 168301 915 28931 32705 -33952 65208 28302 51216 -25406
15817b5406j40350O5818J62489q958j05898j62497o7008J5024P6731J16815J36630
$$ -25406 -165756 -99938 62551 53593 -52305 -214802 -281810 -266786 -190055 -73240 63390
15806F3390j12226j65320M3082N5287N2794m6919N1173O1851J6077J5374J21306
$$ 63390 -48836 -214156 -171074 -115787 -62993 -109912 -58739 3112 19189 34563 155869
15795A55869K9376j47447q753k5117q7781j05573j66179Q1652P1712M9315M3868
$$ 155869 185245 37798 29045 3928 -83853 -189426 -355605 -273953 -202241 -152926 -109058
15784a09058P3812j13476m1630J99341J27040l1632j38067NR1978j12638q1227
$$ -109058 -35246 -148722 -190352 8989 136029 104397 -33670 -33665 58313 -54325 -135552
15773a35552O6194J26340O5033l4001r7276J0690k0955l6760j15528O0385P2566
$$ -135552 -69358 56982 122015 88014 -9262 1428 -19527 -56287 -171815 -111430 -38864
15762c8864k7710M1530l6366j13478O1809R2169o6199k1299K3560J29486l4097
$$ -38864 -66574 -25044 -61410 -174888 -113079 -20910 -87109 -108408 -84848 44638 10541
15751A0541K8774K2566j56789k5982P7461j3845N8493P0429j21553j82005M3047
$$ 10541 39315 61881 -94908 -120890 -43429 -57274 1219 71648 -49905 -231910 -188863
15740a88863Q7379K991m6579J0141J05561O9968j18487j18442j21823O5582K89115
$$ -188863 -101484 -98493 -145072 -134931 -29370 40598 -77889 -196331 -318154 -252572 36543
15729C6543L4452j17244J59835P5300p4940l8886o7216n4613K5165l2133l5973
$$ 36543 70995 -46249 113586 188886 113946 75060 7844 -46769 -21604 -53737 -89710
15718h9710M9464q26J15846J35779j23832j31434K7906M2850P9148M3828l5079
$$ -89710 -40246 -41072 74774 210553 86721 -44713 -16807 26043 105191 149019 113940
15707A13940p4103l4228K5522L7408K4457m9771j12628q00J02857K7895J8079
$$ 113940 39837 5609 31131 68539 92996 43225 -69403 -70203 32654 60549 78628
15696G8628j07068n7736O2109k2511J24703O020q6648j63604q7981J37517J41608
$$ 78628 -28440 -86176 -24067 -46578 78125 84145 -2503 -166107 -254088 -116571 25037
15685B5037m9929j04051P3796J88768p6491j05181M0405K1060O3876j11632r2059
$$ 25037 -24892 -128943 -55147 133621 57130 -48051 -7646 13414 77290 -34342 -126401
15674a26401k8139K02890L5808r9654n7272J1579N996o1693r8245O9106O1324
$$ -126401 -154540 48350 84158 -15496 -72768 -61189 -55193 -116886 -215131 -146025 -84701
15663h4701m0186q2239R2859J3003n6009q991m9007O1640Q5719N6721m6137K5478
$$ -84701 -124887 -207126 -114267 -101264 -157273 -166264 -215271 -153631 -67912 -11191 -57328 -31850
15651c1850L0600j7687o0090Q9914l343R3344k869R6366J01982j96661j25137
$$ -31850 -1250 -18937 -79027 10887 7544 100888 98019 194385 296367 99706 -25431
15640b5431n9815P9595q771l7767j78535N3524J36452P8315L9914m4211o3704
$$ -25431 -85246 -5651 -14422 -52189 -230724 -177200 -40748 37567 77481 33270 -30434
15629c0434j5000j58813j47175J22472J13727K902N4973J90272Q4333p9828K8884
$$ -30434 -45434 -204247 -351422 -228950 -115223 -112321 -57348 132924 217257 137429 166313
15618A66313R8848j38092k60742j75713J90577P6899M3351L3412r868j2471k2446
$$ 166313 265161 127069 -133673 -309386 -118809 -41910 1441 34853 24985 12514 -9932
15607i932k772j20429n8231N0623M3032o228p019n6214L0692L0991N3300j3526
$$ -9932 -12704 -133133 -191364 -140741 -97709 -103937 -110956 -167170 -136478 -105487 -52187 -65713
15595f5713M3911J24037K480j59497k35607J00998O5533j16384k0757J5353J13113
$$ -65713 -21802 102235 104715 -54782 -290389 -189391 -123858 -240242 -260999 -245646 -132533
15584a32533P8074L9684K7486j7092k1405n8270P2679J60298o467k1431p6751
$$ -132533 -54459 -14775 12711 -4381 -25786 -84056 -11377 148921 142454 121023 44272
15573D4272j98374j30076P6226J61700O2798j5965q6978J6166K3119M9604J37363
$$ 44272 -154102 -284178 -207952 -46252 16546 581 -86397 -70231 -47112 2492 139855
15562A39855n0293j22618Q0726M4402o9203O6885l7444r6470m9262l232N1126
$$ 139855 89562 -33056 47670 92072 22869 89754 52310 -44160 -93422 -96654 -45528
15551d5528k9470p9607r6114n4483Q0470J18850M63O510P9161L8498N048K7154
$$ -45528 -74998 -154605 -250719 -305202 -224732 -105882 -105419 -98909 -19748 18750 23798 50952
15539E0952o595l8546k5367J94461N656j37286l4418P6091k2763j40266k9001
$$ 50952 44357 5811 -19556 174905 180561 43275 8857 84948 62185 -78081 -107082
15528a07082L6369R3778j21168P6110N0746N3498O1405j04578J4893n4791j73538
$$ -107082 -70713 23065 -98103 -21993 28753 82251 143656 39078 53971 -820 -174358
15517a74358N8513R7795J52795j5646j78856k9838J36818Q9677N2394l5070p9746
$$ -174358 -115845 -18050 134745 119099 -59757 -89595 47223 136900 189294 154224 74478
15506G4478j46719j61662n2861Q6429O9164j04438o19J13668o3032j7000P4227
$$ 74478 -72241 -233903 -286764 -200335 -131171 -235609 -236228 -122560 -185592 -202592 -128365
15495a28365J67010O9526Q4763l2571O3926j4604L72M1108j99771K0883L5901
$$ -128365 38645 108171 192934 160363 224289 209685 210057 251165 51394 72277 108178
15484A08178j14001j18931K6886N8134N4396J18333Q5290n579j17176l6830j49380
$$ 108178 -5823 -124754 -97868 -39734 14662 132995 218285 212706 95530 58700 -90680
15473i0680j369j4185J17235J01485m5227j14665Q4191M8985j43760O448k9201
$$ -90680 -92049 -106234 11001 112486 67259 -47406 36785 85770 -57990 -51542 -80743
15462h0743M765R7756K01256N0372j03815n0139l1082j21886q5798J10400J88426
$$ -80743 -75978 21778 223034 273406 169591 119452 88370 -33516 -119314 -8914 179512
15451A79512O3369r3665p1231J5975m3547J9126J61506P3264o7802p9725j18918
$$ 179512 242881 149216 77985 93960 50413 69539 231045 304309 236507 156782 37864
15440C7864k8634M5403p3850k9186j98148k01186r477J82547J10553J14588J5465
$$ 37864 9230 54633 -19217 -48403 -246551 -447737 -457214 -274667 -164114 -49526 -34061
15429c4061K270n689M3038Q372J32216K5467p5059j00414o8300p8121k6851O3186
$$ -34061 -31791 -37480 5558 13930 146146 171613 96554 -3860 -72160 -150281 -177132 -113946
15417a13946O6752O7347n0470j37865P1381R6132J10700J05116L9004j29850j53822
$$ -113946 -47194 20153 -30317 -168182 -96801 -669 110031 215147 254151 124301 -29521
15406b9521m2425J20691K9472J09710j4296r202l4171m955m3931Q377l6680j87590
$$ -29521 -71946 48745 78217 187927 173631 164429 130258 125303 81372 89749 53069 -134521
15394a34521q657p187l9848M1538J41455N5944p9077J10730J14290n1993j53189
$$ -134521 -143178 -150365 -190213 -148675 -7220 48724 -30353 80377 194667 142674 -10515
15383a0515j8348M1656j29836j24590J06182K8629r564K7016J10557j5555p9932
$$ -10515 -28863 12793 -117043 -241633 -135451 -106822 -116386 -89370 21187 5632 -74300
15372g4300P5751J8074j42272l2085p5935M1315J10369m0671K8431l9884J20634
$$ -74300 1451 19525 -122747 -154832 -230767 -189452 -79083 -119754 -91323 -131207 -10573
15361a0573R56l6491M4104J34238J2461j9868j57539J9030J0518N1364q7334m2250
$$ -10573 -9617 -46108 -2004 132234 144695 124827 -32712 -13682 -3164 48200 -39134 -81384
15349h1384n3807j42802N8698R7201n3448J38474N1083o038k2821o1043l6981
$$ -81384 -135191 -277993 -219295 -122094 -175542 -37068 14015 7977 -14844 -75887 -112868
15338a12868q8512Q678J73904L6611o4396r2230j34691J6612N726J30711L2739
$$ -112868 -201380 -192702 -18798 17813 -46583 -138813 -273504 -256892 -251166 -120455 -87716
15327h7716K1092M2625p3301r9744O5963P2863o2268O1757J7163R4023K7630l2598
$$ -87716 -66624 -23999 -97300 -197044 -131081 -58218 -120486 -58729 -41566 52457 80087 47489
15315D7489L2218j7893J7529J55644q7689n3034L8281J15738k111q5139Q952q599
$$ 47489 79707 61814 79343 234987 147298 94264 132545 248283 246172 161033 169985 161386
15303A61386J6859k2130n9387j12079j36666K1851R6670L9952N3024O8407m3910
$$ 161386 178245 156115 96728 -15351 -152017 -130166 -33496 6456 59480 127887 83977
15292H3977m1526j0029j1875P6109R8219j42730j02678R1940N3432J06050j2983
$$ 83977 42451 32422 20547 96656 194875 52145 -50533 41407 94839 200889 187906
15281A87906j210q306j36349n8984R759M020O2745J04075j4125p4751j0008q5292
$$ 187906 186696 178390 42041 -16943 -7184 -3164 59581 163656 149531 74780 64772 -20520
15269b0520j45286j24115J53980O4844k8421R424n0972j76836J02881P6570M3498
$$ -20520 -165806 -289921 -135941 -71097 -99518 -90094 -141066 -317902 -215021 -138451 -94953
15258i4953r277j10781O8924J08815J38066j1168o1716o9410O9269O1510k4891
$$ -94953 -104230 -215011 -146087 -37272 100794 89626 27910 -41500 27769 89279 64388
15247F4388o7349j20504m8656O8920K2832o60P8771N4197j6764p2689j12317l3767
$$ 64388 -2961 -123465 -172121 -103201 -80369 -81029 -2258 51939 35175 -37514 -149831 -183598
15235a83598R4982J01249R4294p651j09053j8228o8519P175k5598p4159J8398
$$ -183598 -88616 12633 106927 99276 -9777 -28005 -96524 -89349 -114947 -189106 -170708
15224a70708k1922l8211P1024m0151p699m020J67029L6602j38320M6712l6076
$$ -170708 -192630 -230841 -159817 -199968 -207667 -211687 -44658 -8056 -146376 -99664 -135740
15213a35740j42622M517J65567L8752O7695J49938P4621O292O204n6457l6596
$$ -135740 -278362 -273845 -108278 -69526 -1831 148107 222728 229020 235224 178767 142171
15202A42171k9447j22289L0229N4875O7644q9995K411J12742n3901j32886j1348
$$ 142171 112724 -9565 20664 75539 143183 53188 55599 168341 114440 -18446 -29794
15191b9794n1780o5755l5249j2366O5230L1182M9997J27589J17830P5397j43398
$$ -29794 -81574 -147329 -182578 -194944 -129714 -98532 -48535 79054 196884 272281 128883
15180A28883j17219j8252L3227J17631J2196j35183n2289J28646J09482m7511
$$ 128883 11664 -6588 26639 144270 156466 21283 -31006 97640 207122 159611
15170A59611p4294j35869j6339K4967J93248J62248l2431o4224P97O3658n3626
$$ 159611 85317 -50552 -66891 -41924 151324 313572 281141 216917 217714 281372 227746
15159B27746J6534k8387j11315m6407n3503Q7852q0728q609j5907M9413n700k14369
$$ 227746 244280 215893 104578 58171 4668 92520 11792 3183 -12724 36689 30989 -183380
15147a83380j12549J50052M8073K5512J31410R7072M6498p5466J6224j53559j20983
$$ -183380 -295929 -145877 -97804 -72292 59118 156190 202688 127222 143446 -10113 -131096
15136a31096J87600J98400p8961o8432l1398R565Q7179O7851k0205j83490k48453
$$ -131096 56504 254904 175943 107511 76113 85678 172857 240708 220503 37013 -211440
15125b11440J41275J08003n8507N3098Q2261M3407j30543J690J00353k3807p8027
$$ -211440 -70165 37838 -20669 32429 114690 158097 27554 29244 129597 105790 27763
15114B7763j27241p6606J0787L6376K3048J09374p1346K7510K4218R6922o2595
$$ 27763 -99478 -176084 -165297 -128921 -105873 3501 -67845 -40335 -16117 80805 18210
15103A8210p6376p7362P6747j8370p08l5847k6015M3401J52543L0176k1906j17550
$$ 18210 -58166 -135528 -58781 -77151 -77859 -113706 -139721 -96320 56223 86399 64493 -53057
15091e3057r9999O9098J55659L7746l3108r5651O0270L5494j9890n6705J6379
$$ -53057 -153056 -83958 71701 109447 76339 -19312 40958 76452 56562 -143 16236
15080A6236k2071m361q2066J54428L5112L2565J7236j27033p2691l3387M9382
$$ 16236 -5835 -10196 -92262 62166 97278 129843 147079 20046 -52645 -86032 -36650
15069c6650l6411n2385J08258J31197j31958M1213j8654j11487l9945l3799N0835
$$ -36650 -73061 -125446 -17188 114009 -17949 23264 4610 -106877 -146822 -180621 -129786
15058a29786K4899J1919P3204K9958J3268o2690m6562J05205J21003J4750P6079
$$ -129786 -104887 -92968 -19764 10194 23462 -39228 -85790 19415 140418 155168 231247
15047B31247j60773j09517O2053M6466k1900j24514M3539R9678J1214K27J38462
$$ 231247 70474 -39043 23010 69476 47576 -76938 -33399 66279 77493 77720 216182
15036B16182j15658k07302r2541j1155M7380M3794R2522j8001k4337J39204q3650
$$ 216182 100524 -106778 -199319 -210474 -163094 -119300 -26778 -44779 -69116 70088 -13562
15025a3562j63404J28594N8418l6471j6767j7710r8426p3959k4061N357K6965
$$ -13562 -176966 -48372 10046 -26425 -43192 -60902 -159328 -233287 -257348 -251991 -225026
15014b25026J54978J51767m0420K460K4311r2361j45893J14066N3505r424M8255
$$ -225026 -70048 81719 41299 43759 68070 -24291 -170184 -56118 -2613 -12037 36218
15003C6218L6096L7560J28782o3334j06644j8862P7677j5728k469J17144m3522
$$ 36218 72314 109874 238656 175322 68678 49816 127493 111765 109296 226440 182918
14992A82918n4198k4306k1232r9811m0936K08438J66644q0680K2065p255j93562
$$ 182918 128720 104414 83182 -16629 -57565 150873 317517 236837 258902 251647 58085
14981E8085j08942J02818o0421m7756j5179o8044M054J30878P5305J45702p1838
$$ 58085 -50857 51961 -8460 -56216 -71395 -139439 -135385 -4507 70798 216500 144662
14970A44662l2578J72032j71517j47371P2199p01P0752O3369M32k4527j01837
$$ 144662 112084 284116 112599 -34772 37427 36726 107478 170847 171279 146752 44915
14959D4915N0195J01281l618Q913n596l8065j2445q0987j30923j08456J20996
$$ 44915 95110 196391 192773 201686 196090 158025 145580 64593 -66330 -174786 -53790
14948e3790O8111p2256l5566J9786Q0847k2131J24728M5308j60766l0954p0581
$$ -53790 14321 -57935 -93501 -73715 7132 -14999 109729 155037 -5729 -36683 -107264
14937a07264p4803l4823o859m287r622n040m72R2885o4024k8403K3039j0022P2607
$$ -107264 -182067 -216890 -223749 -228036 -237658 -242698 -243170 -150285 -214309 -242712 -219673 -229695 -157088
14924a57088R9768J63337q0912o301Q991q7032j03808K2617J02124R0541Q322
$$ -157088 -57320 106017 25105 18804 27795 -59237 -163045 -140428 -38304 52237 60559
14913F0559l7694p573q6377n6369j08142j0646J52925K28478J56248p5967j71335
$$ 60559 22865 15292 -71085 -127454 -235596 -246242 -93317 135161 291409 215442 44107
14902D4107j02011o1339J86682p893j46036N9286L4788o7779M1267O7311L1967
$$ 44107 -57904 -119243 67439 59546 -86490 -27204 7584 -60195 -18928 48383 80350
14891H0350n3068j3523r427j37097j14966m2289J51439J52173M6014l3896J0144
$$ 80350 27282 13759 4332 -132765 -247731 -290020 -138581 13592 59606 25710 35854
14880C5854j27321o2347M9753N8816n0432l4186P9317j6282j2777p3306J59660
$$ 35854 -91467 -153814 -104061 -45245 -95677 -129863 -50546 -66828 -79605 -152911 6749
14869F749P8969o6480m6800N1123p3136p502q5904Q139P4779O6647k3948M0861
$$ 6749 85718 19238 -27562 23561 -49575 -57077 -142981 -134842 -60063 6584 -17364 23497
14857B3497J4689J4370l7811K4844m3726l7157L3977m635Q8890J6277j0251P5796
$$ 23497 38186 52556 14745 39589 -4137 -41294 -7317 -11952 76938 93215 82964 158760
14845A58760l3212k8019L617l6868M0253M0186q5282j23068j9521Q1656J9498
$$ 158760 125548 97529 101146 64278 104531 144717 59435 -63633 -83154 -1498 18000
14834A8000J504n237K9111p0452j7066L1312j25960n102Q4772k0401K2649J00285
$$ 18000 19504 14267 43378 -27074 -44140 -12828 -138788 -143890 -59118 -79519 -56870 43415
14822D3415R7891r4160o9525L6104q797j41459J0086M2753M0388O8395L6314q4572
$$ 43415 141306 47146 -22379 13725 4928 -136531 -126445 -83692 -43304 25091 61405 -23167
14810b3167L0582k4586k2989j04702j6426J6413p5108K0320L727Q7444J92591
$$ -23167 7415 -17171 -40160 -144862 -161288 -144875 -219983 -199663 -195936 -108492 84099
14799H4099J04697n6427j3201j37530j8437m6003J09496j4945k13722j2753L6885
$$ 84099 188796 132369 119168 -18362 -36799 -82802 26694 11749 -201973 -214726 -177841
14788a77841j02506J0542K93989J23402k2318o1118O9123K8133p2525p7018J4022
$$ -177841 -280347 -269805 24184 147586 125268 64150 133273 161406 88881 11863 25885
14777B5885m7502n5331J30838l7514L1675k1158J17368n3020k1392J1436K8605
$$ 25885 -21617 -76948 53890 16376 48051 26893 144261 91241 69849 81285 109890
14766A09890k2335m6036j23981j75745J3740P6024J05917j7399J39422o8599j24241
$$ 109890 87555 41519 -82462 -258207 -244467 -168443 -62526 -79925 59497 -9102 -133343
14755a33343M1280N3484M9483P7022J0178k4572q3649m042j6466j683J25279Q2765
$$ -133343 -92063 -38579 10904 87926 98104 73532 -10117 -14159 -30625 -32308 92971 175736
14743A75736j77176N8354j8050k1001r231J2559l941o5248m0075J51221L5430
$$ 175736 -1440 56914 38864 17863 8632 21191 17250 -47998 -88073 63148 98578
14732I8578o4860p6418J14297J40780j3153r8380n3875M0037q3781j05475K0014
$$ 98578 33718 -42700 71597 212377 199224 100844 46969 87006 3225 -102250 -82236
14721h2236N2094J83611n3150o8974r6415o6617O3213M9195k7395r006M7622N8639
$$ -82236 -30142 153469 100319 31345 -65070 -131687 -68474 -19279 -46674 -55680 -8058 50581
14709E0581n8167q2853j53255m9570J14439K12239J33110J00252J3081Q9731r6663
$$ 50581 -7586 -90439 -243694 -293264 -178825 33414 166524 266776 279857 369588 272925
14698B72925p1459p807q2652o0418L8264n8647q6497o2558M5203P9899N0393P1859
$$ 272925 201466 193659 111007 50589 88853 30206 -56291 -118849 -73646 6253 56646 128505
14686A28505j02106R403j5243n722O7689K4181j81270Q877J06759J36669N7171
$$ 128505 26399 35802 20559 14837 82526 106707 -74563 -65686 41073 177742 234913
14675B34913k18037j50389P954N0643J4414j1091N0837j1138l0209n3805k828
$$ 234913 16876 -133513 -125559 -74916 -60502 -71593 -20756 -31894 -62103 -115908 -118736
14664a18736J4443q8225K609N3126R9084J13465J5269j1850M7074p7627J0622
$$ -118736 -104293 -192518 -189909 -136783 -37699 75766 91035 79185 126259 48632 59254
14653E9254O7921J44253L9587j64804j19836K6957P0539P615l8079m2049P464
$$ 59254 127175 271428 311015 146211 26375 53332 123871 131486 93407 51358 58822
14642E8822k1177p74k575J14322j63789j6161J88691J0540L4624K3914M6305j41359
$$ 58822 37645 36871 34296 148618 -15171 -31332 157359 167899 202523 226437 272742 131383
14630A31383j49829m5544Q8117L3902j17652N7035N3261M0870J00769j49507j34012
$$ 131383 -18446 -63990 24127 58029 -59623 -2588 50673 91543 192312 42805 -91207
14619i1207J38605R8628k8544q5680l1487K31415J00958j15461j09429Q247J1289
$$ -91207 47398 146026 117482 31802 315 231730 332688 217227 107798 116045 127334
14608A27334n3507K4219o1234j01773N7984J4826l7381R5911k1861j85706l3728
$$ 127334 73827 98046 36812 -64961 -6977 7849 -29532 66379 44518 -141188 -174916
14597a74916L5687k8306o5835J22683J58208J22535j21885o5672N5045m9810k0214
$$ -174916 -139229 -167535 -233370 -110687 47521 170056 48171 -17501 37544 -12266 -32480
14586c2480J1810J0486m4926k3992o6976Q7500k403l6309N7550J87507J69750
$$ -32480 -20670 -10184 -55110 -79102 -146078 -58578 -60981 -97290 -39740 147767 317517
14575C17517K2524j00183n3147m9656j17915r5784J40491J35155k8710j07212
$$ 317517 340041 239858 186711 137055 19140 -76644 63847 199002 170292 63080
14565F3080M654k8692l4738p4617j6555p3025K45327J11641j28835m0103J16733
$$ 63080 67734 39042 4304 -70313 -86868 -159893 85434 197075 68240 28137 144870
14554A44870Q7470n4710p1883j5305M0127O253l2838k3999j6494m8668K7354Q753
$$ 144870 232340 177630 105747 90442 130569 136822 103984 79985 63491 14823 42177 50930
14542E0930j8296M1939j3816p287R7420r2935j40506p5153P7045L3664k6593l2013
$$ 50930 32634 74573 60757 53470 150890 57955 -82551 -157704 -80659 -46995 -73588 -105601
14530a05601P0374N6734k190r698K0427L2745j4974q5159q8555j10020l9125J31905
$$ -105601 -35227 21507 19317 9619 30046 62791 47817 -37342 -125897 -235917 -275042 -143137
14518a43137K03591R6592j22651J8622O5228j6621j8569n9345n6037K6192j1735
$$ -143137 60454 157046 34395 53017 118245 101624 83055 23710 -32327 -6135 -17870
14507a7870K3581M3908J43595Q5103l4618j05562k65329q4552J42018Q4441n1726
$$ -17870 5711 49619 193214 278317 243699 138137 -127192 -211744 -69726 14715 -37011
14496c7011j42850J47178J36205J25146j26543J242j8746j06014N4588l0755M3208
$$ -37011 -179861 -32683 103522 228668 102125 103367 84621 -21393 33195 2440 45648
14485D5648m0411m8703L2125k733R3626l9399j89705n5694J71866m1991l9000
$$ 45648 5237 -43466 -11341 -14074 79552 40153 -149552 -205246 -33380 -75371 -114371
14474a14371J21476n3534j015J55415J50102n1094j06461N9707r6577m8162k0338
$$ -114371 7105 -46429 -47444 107971 258073 206979 100518 160225 63648 15486 -4852
14463d852m7710J22802j8187L6818Q9423k2399j17226r2325J5465J0889j09809
$$ -4852 -52562 70240 52053 88871 178294 155895 38669 -53656 -38191 -27302 -137111
14452a37111N2608R3250P1003j6870J820j88090k8168P9368J66287j43215k20443
$$ -137111 -84503 8747 79750 62880 64700 -123390 -151558 -72190 94097 -49118 -269561
14441b69561J9709Q9157L655j0868O2171J38178N3741r6702M8237J82390J85970
$$ -269561 -249852 -160695 -157040 -167908 -105737 32441 86182 -10520 37717 220107 406077
14430D06077p5189j29986j08211j47228J82049J00446M509o5571n2736L1298k9626
$$ 406077 330888 200902 92691 -54537 127512 227958 232467 166896 114160 145458 115832
14419A15832m5494m042J16069l97r7667o3076k6615J957R7375J42411N5739j18867
$$ 115832 70338 66296 182365 181968 84301 21225 -5390 -3433 93942 236353 292092 173225
14407A73225j8572J21484O1819q3424j18534m4369j33910o0236j01048J92158
$$ 173225 154653 276137 337956 254532 135998 91629 -42281 -102517 -203565 -11407
14397a1407J02921l4692Q8749o3226m6258j23454l5397O5467J22715M9122L3342
$$ -11407 91514 56822 145571 82345 36087 -87367 -122764 -57297 65418 114540 147882
14386A47882J9787j344n4763q4343o9655K8816P2734J12863r0538N9870q7847
$$ 147882 167669 166325 111562 27219 -42436 -13620 59114 171977 81439 141309 53462
14375E3462m0831K5938k0926r801M5726n8987J06727J1795k337j02466K1244j8822
$$ 53462 12631 38569 17643 7842 53568 -5419 101308 113103 110766 8300 29544 10722
14363A0722q892M3769N4529K8081l0925j38543L4027M4329j0978J31751M3967
$$ 10722 1830 45599 100128 128209 97284 -41259 -7232 37097 26119 157870 201837
14352B01837j07148j12724p2187n7213k2951R1711Q1789l2676J06725M0909j69446
$$ 201837 94689 -18035 -90222 -147435 -170386 -78675 3114 -29562 77163 118072 -51374
14341e1374q0203l8171o534o2871J19911n8629J30452O1059K0131J50420q7139
$$ -51374 -131577 -169748 -176282 -239153 -119242 -177871 -47419 13640 33771 184191 97052
14330I7052M9554j9661K3291k74229m44N5576j12621J4204L4038M7301Q2289J34139
$$ 97052 146606 126945 150236 -123993 -124437 -68861 -181482 -167278 -133240 -85939 -3650 130489
14318A30489P4897R2581K04200M6797l22409k12209j00748Q7194Q3370K737j09113
$$ 130489 205386 297967 502167 548964 226555 14346 -86402 792 84162 86899 -22214
14307b2214K1388l7026j9525l067P918o0279O7169N466O9189L5659k2438o2372
$$ -22214 -826 -37852 -57377 -60444 -52526 -112805 -45636 -40170 29019 64678 42240 -20132
14295b0132o3296n9732P2901J32334J32856K31345J5510l1504L1011o5006P9789
$$ -20132 -83428 -143160 -70259 62075 194931 426276 441786 410282 441293 376287 456076
14284D56076j3772J7017n9270j20476l4474r9855M0240K82547j60060j24666Q2527
$$ 456076 442304 459321 400051 279575 245101 145246 185486 468033 307973 183307 265834
14273B65834l8779j25516l0529r7235o975J06290L2253p7121n6919r8969M629
$$ 265834 227055 101539 71010 -26225 -33200 73090 105343 28222 -28697 -127666 -123037
14262a23037J48857l6803j7610m5754J5788o3945j47485R7576J10298l2811j4762
$$ -123037 25820 -10983 -28593 -74347 -58559 -122504 -269989 -172413 -62115 -94926 -109688
14251a09688J08977l5083J23397M6470j07380p3130o13k9493J2828R9274J58640
$$ -109688 -711 -35794 87603 134073 26693 -46437 -47050 -76543 -63715 35559 194199
14240A94199k5617P37j41674K1741R5993k9163j39277Q5721J26068m6561j16055
$$ 194199 168582 169319 27645 49386 145379 116216 -23061 62660 188728 142167 26112
14229B6112n143m1178m0148N3672M78k3820J03309R6021j33238p9893Q9152N3486
$$ 26112 20969 -20209 -60357 -6685 -6207 -30027 73282 169303 36065 -43828 45324 98810
14217I8810j8735j8323j58798M3186R8510K11069o1996j50158n5673k5632K7204
$$ 98810 80075 61752 -97046 -53860 44650 255719 193723 43565 -12108 -37740 -10536
14206a0536r421o5230n7997J13607N6470K0959j8740P4960K0314O5893p5979o3570
$$ -10536 -19957 -85187 -143184 -29577 26893 47852 29112 104072 124386 190279 114300 50730
14194E0730p060L5584j13230j48166J51922J68606K3768m7332m5321N5687K9030
$$ 50730 43670 79254 -33976 -182142 -30220 138386 162154 114822 69501 125188 154218
14183A54218j04641k4569N3476j4582j22232n0370P6080l8066m3246j5060Q8556
$$ 154218 49577 25008 78484 63902 -58330 -108700 -32620 -70686 -113932 -128992 -40436
14172d0436K00112j1379l5214r5337j00086J80611Q3718m1805p6863k2506J12626
$$ -40436 159676 148297 113083 17746 -82340 98271 181989 140184 63321 40815 153441
14161A53441p4441k02784j00755J18498K24513J44426J83455L6869j29759o4507
$$ 153441 79000 -123784 -224539 -106041 118472 262898 446353 483222 353463 288956
14151B88956P6909O7423j86750K2923l3535m7137p9918j13664p1141J3205O0135
$$ 288956 365865 433288 246538 269461 235926 188789 108871 -4793 -75934 -62729 -2594
14140b594j7023p2917J18862k2465p2024N655P1894m9892J4940P1982J06261j73351
$$ -2594 -19617 -92534 26328 3863 -68161 -62506 9388 -40504 -25564 46418 152679 -20672
14128b0672j01024J37708j5121j01846p7253p2316q6081K3001J49586J09777J00699
$$ -20672 -121696 16012 891 -100955 -178208 -250524 -336605 -313604 -164018 -54241 46458
14117D6458L9344l4094O1750o0794O3661R9911q4552p6045o0611K4975o8334k8754
$$ 46458 85802 51708 113458 52664 116325 216236 131684 55639 -4972 20003 -48331 -77085
14105g7085o3820J03713M3371L2264K00797N3791r8655M118j56721j14672l5075
$$ -77085 -140905 -37192 6179 38443 239240 293031 194376 198494 41773 -72899 -107974
14094a07974J25574J79358o20j66658q9067M5090R555P9945m9932m9536m6988
$$ -107974 17600 196958 196338 29680 -59387 -14297 -4742 75203 25271 -24265 -71253
$$ [...]
##END NTUPLES=NMR SPECTRUM
##END=
