##TITLE=Analysis number 321828
Compound Code sb 01215
Project Code adrs
Chemist Name flurochem
##JCAMPDX= 6.0         $$ Bruker NMR JCAMP-DX V2.0
##DATA TYPE= NMR SPECTRUM
##DATA CLASS= NTUPLES
##ORIGIN= Bruker BioSpin GmbH
##OWNER= nmr
$$ XWIN-NMR		Version 3.5
$$ Wed Aug 30 10:41:35 2006 GMT Daylight Time (UT+1h)  MAYBRIDGE\nmr@NMR_250MHZ
##.OBSERVE FREQUENCY= 250.131544655141
##.OBSERVE NUCLEUS= ^1H
##.ACQUISITION MODE= SIMULTANEOUS (DQD)
##.ACQUISITION SCHEME= undefined
##.AVERAGES= 16
##.DIGITISER RES= 18
##SPECTROMETER/DATA SYSTEM= dpx250
##.PULSE SEQUENCE= zg30
##.SOLVENT NAME= CDCl3
##.SHIFT REFERENCE= (INTERNAL, CDCl3, 0, 16.522)
##AUDIT TRAIL= $$ (NUMBER, WHEN, WHO, WHERE, WHAT)
$$ ##TITLE= Audit trail, XWIN-NMR		Version 3.5
$$ ##JCAMPDX= 5.01
$$ ##ORIGIN= Bruker BioSpin GmbH
$$ ##OWNER= nmr
$$ C:\u/data/dgb/nmr/ADRS/1860/pdata/1/auditp.txt
$$ ##AUDIT TRAIL=  $$ (NUMBER, WHEN, WHO, WHERE, WHAT)
(   1,<2006-08-30 10:41:05.50 +100>,<MAYBRIDGE\nmr>,<NMR_250MHZ>,
      <created by zg, POWCHK disabled, PULCHK disabled
       configuration hash MD5:
       E2 DF 36 D8 04 B2 41 60 5A D7 A3 38 5A 4B D0 FE
       data hash MD5: 64K
       AF 1B 0F AA 59 B2 55 F4 46 29 FC 34 0B EA C8 7E>)
(   2,<2006-08-30 10:41:22.48 +100>,<MAYBRIDGE\nmr>,<NMR_250MHZ>,
      <Start of raw data processing
       ef LB = 0.3 FT_mod = 6 PKNL = 1 SI = 32K 
       data hash MD5: 32K
       1D 2E 1A 01 1E 37 8D D2 0F 30 C4 84 82 1A 4E 2A>)
(   3,<2006-08-30 10:41:24.09 +100>,<MAYBRIDGE\nmr>,<NMR_250MHZ>,
      <apk 
       data hash MD5: 32K
       35 F9 D8 CD 74 05 5F F7 E4 98 73 24 2F BD AE 1E>)
(   4,<2006-08-30 10:41:24.84 +100>,<MAYBRIDGE\nmr>,<NMR_250MHZ>,
      <abs ABSG = 5 
       data hash MD5: 32K
       9C 82 BE 69 FF CA 14 03 73 A2 29 88 90 07 9A B6>)
$$ ##END=
$$ 
$$ hash MD5
$$ 3B B1 66 CC B2 FC 03 4F 92 CF FB 19 B0 F1 11 E6
##$RELAX= 
##$RELAX= 
##$RELAX= 
##$RELAX= 
##$RELAX= 
##$RELAX= 
##$RELAX= 
$$ Bruker specific parameters
$$ --------------------------
##$DU= <C:\u>
##$EXPNO= 1860
##$NAME= <ADRS>
##$PROCNO= 1
##$TYPE= <nmr>
##$USER= <dgb>
##$AMP= (0..31)
100 100 100 100 100 100 100 100 100 100 100 100 100 100 100 100 100 100 
100 100 100 100 100 100 100 100 100 100 100 100 100 100 
##$AQSEQ= 0
##$AQ_mod= 3
##$AUNM= <au_zg>
##$AUTOPOS= <11 >
##$BF1= 250.13
##$BF2= 250.13
##$BF3= 250.13
##$BF4= 250.13
##$BF5= 500.13
##$BF6= 500.13
##$BF7= 500.13
##$BF8= 500.13
##$BYTORDA= 1
##$CFDGTYP= 0
##$CFRGTYP= 5
##$CHEMSTR= <none>
##$CNST= (0..31)
1 1 145 1 1 1 1 1 1 1 1 1 1 1 1 1 1 1 1 1 1 1 1 1 1 1 1 1 1 1 1 1 
##$CPDPRG= <>
##$CPDPRG1= <>
##$CPDPRG2= <>
##$CPDPRG3= <>
##$CPDPRG4= <mlev>
##$CPDPRG5= <mlev>
##$CPDPRG6= <mlev>
##$CPDPRG7= <mlev>
##$CPDPRG8= <mlev>
##$CPDPRGB= <>
##$CPDPRGT= <>
##$D= (0..31)
0 1 0 0 0 0 0 0 0 0.06 0 0 0 0 0 0 0.0002 0 0 0 0 0 0 0 0 0 0 0 0 0 0 
0 
##$DATE= 1156930863
##$DBL= (0..7)
120 120 120 120 120 120 120 120 
##$DBP= (0..7)
150 150 150 150 150 150 150 150 
##$DBP07= 0
##$DBPNAM0= <>
##$DBPNAM1= <>
##$DBPNAM2= <>
$$ [...]
##$SUBNAM7= <"">
##$SUBNAM8= <"">
##$SUBNAM9= <"">
##$SW= 20.6930455092707
##$SWIBOX= (0..15)
0 0 3 0 0 0 0 0 0 0 0 0 0 0 0 0 
##$SW_h= 5175.983436853
##$TD= 65536
##$TD0= 1
##$TE= 295.16
##$TE2= 300
##$TE3= 300
##$TEG= 300
##$TL= (0..7)
0 120 120 120 120 120 120 120 
##$TP= (0..7)
150 150 150 150 150 150 150 150 
##$TP07= 0
##$TPNAME0= <>
##$TPNAME1= <>
##$TPNAME2= <>
##$TPNAME3= <>
##$TPNAME4= <>
##$TPNAME5= <>
##$TPNAME6= <>
##$TPNAME7= <>
##$TPOAL= (0..7)
0.5 0.5 0.5 0.5 0.5 0.5 0.5 0.5 
##$TPOFFS= (0..7)
0 0 0 0 0 0 0 0 
##$TUNHIN= 0
##$TUNHOUT= 0
##$TUNXOUT= 0
##$USERA1= <user>
##$USERA2= <user>
##$USERA3= <user>
##$USERA4= <user>
##$USERA5= <user>
##$V9= 5
##$VALIST= <valist>
##$VCLIST= <CCCCCCCCCCCCCCC>
##$VD= 0
##$VDLIST= <DDDDDDDDDDDDDDD>
##$VPLIST= <PPPPPPPPPPPPPPP>
##$VTLIST= <TTTTTTTTTTTTTTT>
##$WBST= 1024
##$WBSW= 4
##$XGAIN= (0..3)
0 0 0 0 
##$XL= 0
##$YL= 0
##$YMAX_a= 503855
##$YMIN_a= -545074
##$ZGOPTNS= <>
##$ZL1= 120
##$ZL2= 120
##$ZL3= 120
##$ZL4= 120
##$ABSF1= 16.522
##$ABSF2= -4.171173
##$ABSG= 5
##$ABSL= 3
##$ALPHA= 0
##$AQORDER= 0
##$ASSFAC= 0
##$ASSFACI= 0
##$ASSFACX= 0
##$ASSWID= 0
##$AUNMP= <proc_1d>
##$AZFE= 0.1
##$AZFW= 0.1
##$BCFW= 0
##$BC_mod= 0
##$BYTORDP= 0
##$COROFFS= 0
##$CY= 12.5
##$DATMOD= 1
##$DC= 0
##$DFILT= <>
##$DTYPP= 0
##$F1P= 14.0000005364418
##$F2P= -0.99999901652339
##$FCOR= 0.5
##$FTSIZE= 32768
##$FT_mod= 6
##$GAMMA= 0
##$GB= 0
##$INTBC= 1
##$INTSCL= 1
##$ISEN= 128
##$LB= 0.3
##$LEV0= 0
##$LPBIN= 0
##$MAXI= 10000
##$MC2= 0
##$MEAN= 0
##$ME_mod= 0
##$MI= 0
##$NCOEF= 0
##$NC_proc= -4
##$NLEV= 6
##$NOISF1= 0
##$NOISF2= 0
##$NSP= 0
##$NTH_PI= 0
##$NZP= 0
##$OFFSET= 16.522
##$PC= 1
##$PHC0= 158.2829
##$PHC1= -1.848525
##$PH_mod= 1
##$PKNL= yes
##$PPARMOD= 0
##$PSCAL= 4
##$PSIGN= 0
##$REVERSE= no
##$SF= 250.13
##$SI= 32768
##$SIGF1= 0
##$SIGF2= 0
##$SINO= 400
##$SIOLD= 32768
##$SREGLST= <1H.CDCl3>
##$SSB= 0
##$STSI= 32768
##$STSR= 0
##$SW_p= 5175.98343685301
##$SYMM= 0
##$S_DEV= 0
##$TDeff= 65536
##$TDoff= 0
##$TI= <Analysis number 999999
Compound Code 99
Book Reference 9
Project Code 9>
##$TILT= no
##$TM1= 0
##$TM2= 0
##$TOPLEV= 0
##$USERP1= <user>
##$USERP2= <user>
##$USERP3= <user>
##$USERP4= <user>
##$USERP5= <user>
##$WDW= 1
##$XDIM= 32768
##$YMAX_p= 293192462
##$YMIN_p= -452146
$$ End of Bruker specific parameters
$$ ---------------------------------
##NTUPLES= NMR SPECTRUM
##VAR_NAME=  FREQUENCY,     SPECTRUM/REAL,   SPECTRUM/IMAG
##SYMBOL=    X,             R,               I
##VAR_TYPE=  INDEPENDENT,   DEPENDENT,       DEPENDENT
##VAR_FORM=  AFFN,          ASDF,            ASDF
##VAR_DIM=   32768,         32768,           32768
##UNITS=     HZ,            ARBITRARY UNITS, ARBITRARY UNITS
##FACTOR=    0.157963299565203, 1,           1
##FIRST=     4132.6476996994, 0,             0
##LAST=      -1043.33573715361, 0,           0
##MIN=       -1043.33573715361, -452146,     0
##MAX=       4132.6476996994, 293192462,     0
$$ Real data points
##PAGE= N=1
##DATA TABLE= (X++(R..R)), XYDATA
$$ [...]
$$ plain form
23714 -45586 -57210 -55662 -116234 -202800 -213233 -194818 -125441 -131232 -176476 -192237 -28391 121282
23702 121282 172650 70268 -73908 -24456 47686 36380 -27958 8650 13061 20739 41280
23691 41280 11327 -89262 -210131 -195235 -130258 -73699 25178 97745 136840 60753 -107623
23680 -107623 -255451 -237337 -260557 -153397 33726 45802 -22592 -83467 -7771 30919 -39681
23669 -39681 -65426 -34134 -52511 -2712 -35477 -26416 18616 24336 -43390 -58593 -132962 -127861
23657 -127861 -36988 18953 63705 20693 26371 25730 -28111 37807 220949 289203 174116 31750
23645 31750 -59109 -76842 -22245 103408 92037 75081 147034 109206 53855 1788 13049
23634 13049 19139 4823 64903 64110 74204 55937 -34830 -59151 -56778 -64209 -18983 -3459 -81136
$$ packed form
23714d5586j1624J548o0572q6566j0433J8415O9377n791m5244j5761J63846J49673
23702A21282N1368j02382j44176M9452P2142j1306o4338L6608M411P678K0541
23691D1280k9953j00589j20869J4896O4977N6559R8877P2567L9095p6087j68376
23680a07623j47828J8114k3220J07160J87123J2076o8394o0875P5696L8690p0600
23669c9681k5745L1292j8377M9799l2765R061M5032N720o7726j5203p4369N101
23657a27861R0873N5941M4752m3012N678o41n3841O5918J83142O8254j15087j42366
23645C1750r0859j7733N4597J25653j1371j6956P1953l7828n5351n2067J1261
23634A3049O090j4316O0080p93J0094j8267r0767k4321K373p431M5226J5524p7677
$$ plain form
23621 -81136 -120010 -39327 81818 118017 25917 -18196 -27596 -79159 -176157 -150750 -105988 -112311
23609 -112311 -156794 -107883 25179 41559 32236 -17115 -69336 -153526 -168548 -84542 -1934
23598 -1934 -16536 -35328 -13844 119074 117978 60468 17071 131488 10910 -15046 43959
23587 43959 134401 64933 -103365 -262846 -235778 -169698 -110990 -151379 -168974 -5821 105638
23576 105638 29798 -14219 -31966 61745 28747 -121515 -122212 -94592 -24117 -31986 -55589 -14527
23564 -14527 -1695 -54834 -25843 13391 17347 36900 34990 33938 39553 -6864 -120259 -206865
23552 -206865 -118202 -33599 24015 92764 198785 106339 -16305 -62977 -92295 65917 132324
23541 132324 45883 -74627 -149605 -105364 -3582 69944 89198 -39283 -118670 -147200 -158586
$$ packed form
23621h1136l8874Q0683J21145L6199r2100m4113r400n1563r6998K5407M4762o323
23609a12311m4483M8911J33062J6380r323m9351n2221q4190j5022Q4006Q2608
23598a934j4602j8792K1484J32918j096n7510m3397J14417j20578k5956N9005
23587D3959R0442o9468j68298j59481K7068O6080N8708m0389j7595J63153J11459
23576A05638p5840m4017j7747R3711l2998j50262o97K7620P0475p869k3603M1062
23564a4527J2832n3139K8991L9234L956J9553j910j052N615m6417j13395q6606
23552b06865Q8663Q4603N7614O8749J06021r2446j22644m6672k9318J58212O6407
23541A32324q6441j20510p4978M4241J01782P3526J9254j28481p9387k8530j1386
$$ plain form
23530 -158586 -150829 -90813 -117426 -11726 -73468 -68045 -6188 -27711 -13352 117391 178393
23519 178393 184256 96450 46214 -70426 35046 146175 184001 160950 59987 -5358 24428
23508 24428 -38258 -18891 55327 85898 31977 61438 39081 37365 107570 136392 79174 137778
23496 137778 237733 261254 163951 93107 21651 44998 13783 40495 85095 53648 1975
23485 1975 13177 142388 147926 50617 49573 -96152 -11707 21612 -56703 127006 132234 67349
23473 67349 57072 -69998 -84497 -60994 -83701 -81755 -18601 -64309 -14435 72188 175281
23462 175281 271411 195809 132852 187379 187302 31613 13029 100084 272446 231324 219183 201722
23450 201722 145948 67684 45160 103010 112529 40189 56856 45116 156990 225410 153392
$$ packed form
23530a58586P757O0016k6613J05700o1742N423O1857k1523J4359J30743O1002
23519A78393N863q7806n0236j16640J05472J11129L7826k3051j00963o5345K9786
23508B4428o2686J9367P4218L0571n3921K9461k2357j716P0205K8822n7218N8604
23496A37778R9955K3521r7303p0844p1456K3347l1215K6712M4600l1447n1673
23485A975J1202J29211N538r7309j044j45725Q4445L3319p8315J83709N228o4885
23473F7349j0277j27070j4499K3503k2707J946O3154m5708M9874Q6623J03093
23462A75281R6130p5602o2957N4527p7j55689j8584Q7055J72362m1122j2141j7461
23450B01722n5774p8264k2524N7850R519p2340J6667j1740J11874O8420p2018
$$ plain form
23439 153392 164900 197994 9276 -10006 -57986 -114862 -63417 69557 172176 265078 233021
23428 233021 38581 -114786 -121510 -80483 11585 -78741 -93592 -78100 -99617 71604 80076
23417 80076 89823 -15290 -50754 31258 79639 94910 128104 137710 85977 137721 142425 146664
23405 146664 145570 118488 120552 177365 191238 133891 174168 295781 262782 89714 -34861
23394 -34861 -75356 -57862 49346 77569 220907 192149 74894 174851 143606 -24227 -33267
23383 -33267 50966 -16643 -51500 -26776 105626 175684 73029 -44888 -141181 -174483 -225796
23372 -225796 -152832 -77017 -58342 -209747 -136562 -76459 -20370 -27306 -137182 -152865 -166962
23361 -166962 -101572 -37165 -55043 -126791 -3890 16894 -115324 -50942 106395 81265 51392
$$ packed form
23439A53392J1508L3094j88718j9282m7980n6876N1445J32974J02619R2902l2057
23428B33021j94440j53367o724M1027R2068r0326j4851J5492k1517J71221Q472
23417H0076R747j05113l5464Q2012M8381J5271L3194R606n1733N1744M704M239
23405A46664j094k7082K064N6813J3873n7347M0277J21613l2999j73068j24575
23394c4861m0495J7494J07208K8223J43338k8758j17255R9957l1245j67833r040
23383c3267Q4233o7609l4857K4724J32402P0058j02655j17917r6293l3302n1313
23372b25796P2964P5815J8675j51405P3185O0103N6089o936j09876j5683j4097
23361a66962O5390O4407j7878p1748J22901K0784j32218O4382J57337k5130k9873
$$ plain form
23350 51392 -1942 -28272 -94436 -56441 -51195 -41618 14191 20008 45808 -582 35034 55004
23338 55004 33613 -1635 -13155 16272 -49012 -53351 -143389 -180870 -103519 -67660 43002 37069
23326 37069 -36976 -101510 -151659 -25320 30151 -173029 -102424 17028 14040 -102685 -182870
23315 -182870 -106506 -49987 3935 47084 85619 90265 19726 -21463 32004 16341 20513 37099
23303 37099 95161 74583 77178 80310 -8269 1763 7523 -34029 43922 76557 86644 73398
23291 73398 -12843 -73859 -120231 -283473 -284699 -43197 143021 225172 131811 -18831 -45636
23280 -45636 -66940 12680 -15653 -20649 -36196 -81439 -86206 -49757 -77481 -150201 -76383 -72890
23268 -72890 -10386 -25054 -80303 -90661 -9367 31122 58199 120851 63516 9771 43410 43404
$$ packed form
23350E1392n3334k6330o6164L7995N246R577N5809N817K5800m6390L5616J9970
23338E5004k1391l5248j1520K9427o5284m339r0038l7481P7351L5859J10662n933
23326C7069p4045o4534n0149J26339N5471k03180P0605J19452k988j16725q0185
23315a82870P6364N6519N3922M3149L8535M646p0539m1189N3467j5663M172J6586
23303C7099N8062k0578K595L132q8579J0032N760m1552P7951L2635J0087j3246
23291G3398q6241o1016m6372j63242j226K41502J86218Q2151r3361j50642k6805
23280d5636k1304P9620k8333m996j5547m5243m767L6449k7724p2720P3818L493
23268g2890O2504j4668n5249j0358Q1294M0489K7077O2652n7335n3745L3639o
$$ plain form
23256 43404 12439 141128 138004 43548 98166 54436 5794 -50537 -20712 54321 107738 30245
23244 30245 -27346 -42848 -141560 -113429 -119094 -178469 -170005 3747 31859 -83991 -161365 -130184
23232 -130184 -59063 -37792 51611 99119 6600 -33581 -106680 -63921 -57369 35222 65655 -47807
23220 -47807 -149526 -37806 101524 48529 10809 74756 167762 131073 109231 135259 177693
23209 177693 87598 58020 66515 105063 -14206 -52663 -54518 -5017 125784 120589 80055 117885
23197 117885 17178 -24751 5269 -74143 -162364 -43144 18468 -12811 -55420 -22366 77274
23186 77274 99397 56044 -8288 -62972 3800 60076 206697 250900 208734 207338 91918
23175 91918 116117 58319 21537 76140 90838 80592 9473 -92507 -94894 -46973 5726 33022
$$ packed form
23256D3404l0965J28689l124r4456N4618m3730m8642n6331K9825P5033N3417p7493
23244C0245n7591j5502r8712K8131n665n9375Q464J73752K8112j15850p7374L1181
23232a30184P1121K1271Q9403M7508r2519m0181p3099M2759O552R2591L0433j13462
23220d7807j01719J11720J39330n2995l7720O3947R3006l6689k1842K6028M2434
23209A77693r0095k9578Q495L8548j19269l8457j855M9501J30801n195m0534L7830
23197A17885j00707m1929L0020p9412q8221J19220O1612l1279m2609L3054R9640
23186G7274K2123m3353o4332n4684O6772N6276J46621M4203m2166j396j15420
23175I1918K4199n7798l6782N4603J4698j0246p1119j01980k387M7921N2699K7296
$$ plain form
23163 33022 126746 191901 34365 29757 4000 41080 37681 -69341 -118727 -88641 -163543 -223185
23151 -223185 -184897 -19159 97586 65430 169119 93022 55824 -3090 -65660 -154531 -210884
23140 -210884 -6907 63044 38598 52994 173289 243158 164808 86201 -3844 -6948 64393
23129 64393 47138 -83851 -21253 -6739 -60107 -11059 -3430 67425 58052 -17817 -69570 -107142
23117 -107142 -91886 -23471 83076 84789 975 -142971 -107528 -33116 -84285 -69774 92227
23106 92227 122261 -65449 -174218 -166117 -33799 114552 142066 45371 71560 3660 -31473
23095 -31473 27906 118638 150578 143180 131581 70521 -12576 18343 -104608 -123895 -115140 -67112
23083 -67112 -1977 115184 180226 185421 184057 189922 156708 77501 68730 63777 49379 165859
$$ packed form
23163C3022R3724O5155j57536m608k5757L7080l399j07022m9386L0086p4902n9642
23151b23185L8288J65738J16745l2156J03689p6097l7198n8914o2570q8871n6353
23140b10884K03977O9951k4446J4396J20295O9869p8350p8607r0045l104P1341
23129F4393j7255j30989O2598J4514n3368M9048P629P0855r373p5869n1753l7572
23117a07142J5256O8415J06547J713q3814j43946L5443P4412n1169J4511J62001
23106I2227L0034j87710j08769Q101J32318J48351K7514r6695K6189o7900l5133
23095c1473N9379R0732L1940p398j1599o1060q3097L0919j22951j9287Q755M8028
23083f7112O5135J17161O5042N195j364N865l3214p9207q771m953j4398J16480
$$ plain form
23071 165859 60804 88571 78716 112066 14597 -46772 -57741 27493 155588 108725 31876
23060 31876 59137 -5974 19017 -908 -70676 1697 -20092 -65651 101623 109615 44567 3543
23048 3543 -5880 60276 169987 170138 72028 -170498 -270451 -173836 -185693 -43746 18719 -37011
23036 -37011 -219951 -304888 -254802 -150733 73995 102550 56057 29321 -38976 -60708 99309
23025 99309 168485 259764 210347 84003 4912 99607 174290 264980 255498 114432 34910
23014 34910 -35314 -149028 -319781 -319717 -244245 -178513 -68239 -14320 5933 32556 -10989 -6734
23002 -6734 73679 36515 10688 -96937 -107777 6357 36274 -135499 -177966 -176327 -106827
22991 -106827 -18216 -2426 -49275 -7233 1588 107794 182571 64503 18577 106797 133317
$$ packed form
23071A65859j05055K7767r855L3350r7469o1369j0969Q5234J28095m6863p6849
23060C1876K7261o5111K4991j9925o9768P2373k1789m5559J67274P992o5048m1024
23048C543r423O6156J09711J51r8110k42526r9953R6615j1857J41947O2465n5730
23036c7011j82940q4937N0086J04069K24728K8555m6493k6736o8297k1732J60017
23025I9309O9176R1279m9417j26344p9091R4695P4683R0690r482j41066p9522
23014C4910p0224j13714j70753O4P5472O5732J10274N3919K0253K6623m3545M255
23002f734Q0413l7164k5827j07625j0840J14134K9917j71773m2467J639O9500
22991a06827Q8611J5790m6849M2042Q821J06206P4777j18068m5926Q8220K6520
$$ plain form
22980 133317 -9290 -9042 -1506 122210 147351 70810 -50 -80847 -41154 106966 17704
22969 17704 -17009 135856 143019 113390 97619 184572 119715 61614 69956 57843 130464 160990
22957 160990 151620 107381 211649 231407 278753 133018 61238 -12055 -91203 -92644 -131111
22946 -131111 -119723 4149 163045 71454 -124106 -138930 -171756 -123522 39674 127841 185484
22935 185484 222505 147193 20917 3899 83533 168299 84473 -27718 -46446 -10324 422
22924 422 40775 81806 94718 106951 82756 35611 -17759 -62789 50728 175429 224454 253047
22912 253047 142288 92743 120337 116520 13532 13083 151900 146434 38792 -32564 -48323
22901 -48323 -21239 -48590 -201404 -276067 -203457 -102086 -12437 47273 11543 -57467 -92596
$$ packed form
22980A33317j42607K48P536J23716K5141p6541p0860q0797L9693J48120q9262
22969A7704l4713J52865P163k9629j5771Q6953o4857n8101Q342j2113P2621L0526
22957A60990r370m4239J04268J9758M7346j45735p1780p3293p9148j441l8467
22946a31111J1388J23872J58896r1591j95560j4824l2826M8234J63196Q8167N7643
22935A85484L7021p5312j26276j7018P9634Q4766q3826j12191j8728L6122J0746
22924D22M0353M1031J2912J2233k4195m7145n3370m5030J13517J24701M9025K8593
22912B53047j10759m9545K7594l817j02988m49J38817n466j07642p1356j5759
22901d8323K7084k7351j52814p4663P2610J01371Q9649N9710l5730o9010l5129
$$ plain form
22890 -92596 -40956 23010 62966 99516 168401 256383 189168 163086 195458 119737 99484 65688
22878 65688 -47137 -68364 -43696 -39405 -17931 -65861 13732 58203 48285 30167 -7997 43655
22866 43655 31508 7025 -40101 -20667 24528 125894 214920 222456 108237 19132 2022
22855 2022 -36133 3616 62511 74127 56991 119221 81021 43731 114416 165314 137971 42786
22843 42786 -97119 -221447 -260925 -184981 -261567 -271824 -138441 -60434 111689 133136 -9844
22832 -9844 -99329 -174421 -100444 -35994 77669 12425 -140689 -73341 -48575 -103332 -162844
22821 -162844 -240452 -380226 -414061 -349256 -225374 -168067 -144824 -108087 -56317 -107726 -213242
22810 -213242 -114346 -60577 -8196 9904 -78285 -167260 -144801 -104166 -24524 -41788 -184509
$$ packed form
22890i2596N1640O3966L9956L6550O8885Q7982o7215k6082L2372p5721k0253l3796
22878F5688j12825k1227K4668M291K1474m7930P9593M4471r918j8118l8164N1652
22866D3655j2147k4483m7126J9434M5195J01366Q9026P536j14219q9105j7110
22855B022l8155L9749N8895J1616j7136O2230l8200l7290P0685N0898k7343r5185
22843D2786j39905j24328l9478P5944p6586j0257J33383P8007J72123K1447j42980
22832i844q9485p5092P3977O4450J13663o5244j53114O7348K4766n4757n9512
22821a62844p7608j39774l3835O4805J23882N7307K3243L6737N1770n1409j05516
22810b13242R8896N3769N2381J8100q8189q8975K2459M0635P9642j7264j42721
$$ plain form
22799 -184509 -187924 -213964 -248029 -228054 -226524 -201686 -180506 -115882 -192102 -107065 -26255 48238
22787 48238 87970 61534 25681 -46444 -82929 -120130 -108070 -29301 -26577 -12695 88483 27085
22775 27085 4351 -5071 -12756 51067 164546 92743 35562 61284 42053 146401 286789
22764 286789 305446 184424 71385 -84601 -249612 -87939 -24982 22379 -10415 -94667
22754 -94667 -129285 -23479 38883 -7121 -51126 -93318 -98931 -41117 14148 9906 72385 72340
22742 72340 120005 55282 99628 33152 -17409 6888 67731 115027 85380 63201 42107 9979
22730 9979 -3069 -28430 -41124 -118411 -137586 -107270 -79052 -109502 -110200 -17868 41158 71010
22718 71010 -31005 -157540 -123886 -75705 -113796 -9378 -16879 -66882 -1102 38973 -111269
$$ packed form
22799a84509l415k6040l4065J9975J530K4838K1180O4624p6220Q5037Q0810P4493
22787D8238L9732k6436l5853p2125l6485l7201J2060P8769K724J3882J01178o1398
22775B7085k2734r422p685O3823J13479p1803n7181K5722j9231J04348J40388
22764B86789J8657j21022j13039j55986j65011J61673O2957M7361l2794q4252
22754i4667l4618J05806O2362m6004m4005m2192n613N7814N5265m242O2479m5
22742G2340M7665o4723M4346o6476n0561K4297O0843M7296k9647k2179k1094l2128
22730I979j3048k5361j2694p7287j9175L0316K8218l0450o98R2332N9026K9852
22718G1010j02015j26535L3654M8181l8091J04418p501n0003O5780M0075j50242
$$ plain form
22707 -111269 -129684 -137953 -115718 -39056 -78855 -137319 -98088 -132048 -204197 -54302 -14951
22696 -14951 -44130 -96421 -116709 -172440 -68032 167924 171183 101125 -38918 -19398 -33237
22685 -33237 -25880 -47870 10215 5531 -21612 -67073 -85615 -55975 79366 14192 -49443 3263
22673 3263 107219 103694 154004 172059 153624 9046 -103874 -137448 -154600 -15952 12544
22662 12544 2148 20968 -32346 -191453 -295435 -164972 -97162 -162575 -98596 41655 79632
22651 79632 84032 56735 -20127 -38421 -92223 -83740 -108729 -46112 27505 62029 25449 91005
22639 91005 140960 134102 130723 156198 34424 -100575 -150903 -118776 -21283 115136 119951 131839
22627 131839 124575 157923 210128 225661 236505 135297 65524 114673 102892 65976 62640 165500
$$ packed form
22707a11269j8415q269K2235P6662l9799n8464L9231l3960p2149J49895L9351
22696a4951k9179n2291k0288n5731J04408K35956L259p0058j40043J9520j3839
22685c3237P357k1990N8085m684k7143m5461j8542K9640J35341o5174o3635N2706
22673C263J03956l525N0310J8055j8435j44578j12920l3574j7152J38648K8496
22662A2544j0396J8820n3314j59107j03982J30463O7810o5413O3979J40251L7977
22651G9632M400k7297p6862j8294n3802Q483k4989O2617P3617L4524l6580O5556
22639I1005M9955o858l379K5475j21774j34999n0328L2127R7493J36419M815J1888
22627A31839p264L3348N2205J5533J0844j01208o9773M9149j1781l6916l336J02860
$$ plain form
22615 165500 109438 161231 165863 104153 -95731 -99311 23836 99523 49972 -155876 -117717
22604 -117717 -54114 -122608 -126849 -71730 -1396 -133944 -215681 -186597 55131 213315 54982
22593 54982 9304 -41907 -163303 -207791 -19986 71842 99613 -24128 -26913 72083 71348 -16216
22581 -16216 4181 36224 111565 105718 81228 213543 139467 93105 109048 125688 214739 195670
22569 195670 138981 51467 64552 70882 103405 69755 95977 40376 53874 7791 -76288 -1127
22557 -1127 79746 -18381 -98554 -181538 -23694 33150 -99346 -194458 -155124 -69816 -66810 -115017
22545 -115017 -88669 -25411 22677 97284 140723 263541 382270 267721 22676 -147888
22535 -147888 -52982 41754 24574 -18973 -102003 -34633 -12153 47509 -17108 36898 50960
$$ packed form
22615A65500n6062N1793M632o1710j99884l580J23147P5687m9551k05848L8159
22604a17717O3603o8494m241N5119P0334j32548q1737K9084K41728J58184j58333
22593E4982m5678n1211j21396m4488J87805R1828K7771j23741k785R8996p35q7564
22581a6216K0397L2043P5341n847k4490J32315p4076m6362J5943J6640Q9051j9069
22569A95670n6689q7514J3085O330L2523l3650K6222n5601J3498m6083q4079P5161
22557a127Q0873r8127q0173q2984J57844N6844j32496r5112L9334Q5308L006m8207
22545a15017K6348O3258M8088P4607M3439J22818J18729j14549k45045j70564
22535a47888R4906R4736j7180m3547q3030O7370K2480N9662o4617N4006J4062
$$ plain form
22524 50960 53882 50365 59346 7713 12765 50356 -84717 -182379 -141167 -93706 -53827 -54896
22512 -54896 -133740 -223870 -193567 -106709 188 32148 94710 130599 124006 69292 13482 -15556
22500 -15556 49876 20971 -17150 -62626 -57781 -63140 38274 44704 -4498 21734 92205 30491
22488 30491 26528 61621 55332 94229 159596 138028 131001 62025 -67747 -165126 -70308 17358
22476 17358 50913 49912 48671 -51099 -170191 -212284 -117231 -60884 -57024 -2 -44902 -87783
22464 -87783 -165533 -150858 -105052 103013 176871 84035 45576 -574 -44394 -106100 -94632
22453 -94632 -147906 -120525 -114946 -134593 -97204 -92543 -83427 -57243 -38641 -39860 3018 -43819
22441 -43819 -41381 32060 46982 -100401 -93252 -232244 -245442 -150402 -27813 -1863 23454
$$ packed form
22524E0960K922l517Q981n1633N052L7591j35073r7662M1212M7461L9879j069
22512e4896p8844r0130L0303Q6858J06897L1960O2562L5889o593n4714n5810k9038
22500a5556O5432k8905l8121m5476M845n359J01414O430m9202K6232P0471o1714
22488C0491l963L5093o289L8897O5367k1568p027o8976j29772r7379R4818Q7666
22476A7358L3555j001j241r9770j19092m2093R5053N6347L860N7022m4900m2881
22464h7783p7750J4675M5806K08065P3858r2836l8459m6150m3820o1706J1468
22453i4632n3274K7381N579j9647L7389M661R116K6184J8602j219M2878m6837
22441d3819K438P3441J4922j47383P149j38992j3198R5040J22589K5950K5317
$$ plain form
22430 23454 -8800 3143 56909 63339 37877 -157829 -106558 25956 87770 -11307 -48068
22419 -48068 -87142 -39827 -51851 117123 160610 135441 26611 -73854 -154860 -91446 16832
22408 16832 -391 -51375 54161 45051 -78666 -116317 -115476 -175560 -98933 -40595 -10054 -113998
22396 -113998 -161467 -176177 -120273 -89279 -65940 12707 14427 -48235 -55044 -20339 -45317 -117804
22384 -117804 -40795 18733 -42545 -58593 -102910 -143956 -121208 27501 27012 -53208 -161582
22373 -161582 -190683 -60913 37674 35881 -46659 16664 92826 47631 -99242 -29020 -8753
22362 -8753 -44031 18740 82033 170184 34722 -64799 -70437 -37871 52069 121408 66123 -7311
22350 -7311 9478 -45247 -88054 9601 -68886 -174655 -154763 -223913 -199247 -140757 -21203
$$ packed form
22430B3454l2254J1943N3766O430k5462j95706N1271J32514O1814r9077l6761
22419d8068l9074M7315j2024J68974M3487k5169j08830j00465q1006O3414J08278
22408A6832j7223n0984J05536r110j23717l7651Q41o0084P6627N8338L0541j03944
22396a13998m7469j4710N5904L0994K3339P8647J720o2662o809L4705k4978p2487
22384a17804P7009N9528o1278j6048m4317m1046K2748J48709m89q0220j08374
22373a61582k9101J29770R8587j793q2540O3323P6162m5195j46873P0222K0267
22362h753l5278O2771O3293Q8151j35462r9521n638L2566Q9940O9339n5285p3434
22350g311J6789n4725m2807R7655p8487j05769J9892o9150K4666N8490J19554
$$ plain form
22339 -21203 31044 47829 -4308 -26300 -49139 -65297 -61823 -30416 -19544 -17477 13456 -79094
22327 -79094 -118049 -114641 -113466 -104813 -2753 86345 61763 127325 60980 20065 66238 126116
22315 126116 183389 128848 116259 100575 -42714 -74127 -100740 -132038 -39083 63681 109727
22304 109727 157316 81072 33550 -43981 -95028 -170491 -258308 -294288 -234024 -181554 -126238
22293 -126238 -140889 -217908 -270292 -310499 -214340 -78634 16744 41609 70738 -26595 14494
22282 14494 105601 101833 -38500 -22651 50531 105841 73882 71768 34062 40262 133705 191287
22270 191287 128352 -7564 -121285 -95731 -82064 -158434 -134632 -139433 -114552 81820 183360
22259 183360 172760 156410 166914 79353 63701 79967 92242 91973 29646 -86900 -103738 87021
$$ packed form
22339b1203N2247J6785n2137k1992k2839j6158L474L1407J0872K067L0933r2550
22327g9094l8955L408J175Q653J02060Q9098k4582O5562o6345m0915M6173N9878
22315A26116N7273n4541j2589j5684j43289l1413k6613l1298R2955J02764M6046
22304A09727M7589p6244m7522p7531n1047p5463q7817l5980O0264N2470N5316
22293a26238j4651p7019n2384m0207R6159J35706R5378K4865K9129r7333M1089
22282A4494R1107l768j40333J5849P3182N5310l1959k114l7706O200R3443N7582
22270A91287o2935j35916j13721K5554J3667p6370K3802m801K4881J96372J01540
22259A83360j0600j6350J0504q7561j5652J6266J2275k69o2327j16546j6838J90759
$$ plain form
22247 87021 156947 121650 -43364 -161547 -98524 -3989 7938 -14060 38790 49201 -99009
22236 -99009 -137448 -166049 -127996 -135708 -68589 40202 66534 11249 111036 133954 183247 202892
22224 202892 12685 -163239 -293608 -251734 -136509 -93723 -137116 -84326 24937 -9810
22214 -9810 -34612 -66455 -55209 89901 98894 46011 -12358 -131382 -80227 -63153 -64500 90408
22202 90408 118920 -4815 -160827 -205810 -183898 -156110 -176680 -138952 -37325 16987 -1171
22191 -1171 -21049 -130922 -69711 50838 143737 175347 116535 83312 -33413 -34461 17316
22180 17316 166196 108114 -19284 -119446 -134497 -44307 -97374 -121681 -227633 -222615 -24498
22169 -24498 -63764 -43957 -42627 -134083 -96172 -145063 -176207 -153409 -31962 80995 119292
$$ packed form
22247H7021O9926l5297j65014j18183O3023R4535J1927k1998N2850J0411j48210
22236i9009l8439k8601L8053p712O7119J08791K6332n5285R9787K2918M9293J9645
22224B02892j90207j75924j30369M1874J15225M2786m3393N2790J09263l4747
22214i810k4802l1843J1246J45110Q993n2883n8369j19024N1155J7074j347J54908
22202I0408K8512j23735j56012m4983K1912K7788k0570L7728J01627N4312j8158
22191a171j9878j09873O1211J20549R2899L1610n8812l3223j16725j048N1777
22180A7316J48880n8082j27398j00162j5051R0190n3067k4307j05952N018J98117
22169b4498l9266J9807J330r1456L7911m8891l1144K2798J21447J12957L8297
$$ plain form
22158 119292 -10758 -119989 -125835 -81164 -117829 34056 156359 9273 -87049 -137436 -2891
22147 -2891 139305 41195 -53565 -34795 -23948 -4790 15478 -74506 -128880 -56935 51202
22136 51202 28164 88164 124184 103901 79109 87904 -43310 -232589 -226765 -75109 -35389
22125 -35389 -75467 -160935 -131475 -183016 -260298 -195286 -122094 -147811 -94333 -58553 -111489 -39110
22113 -39110 -50604 -140510 -150785 -274021 -330231 -207365 -258071 -201306 -178894 37884 85966
22102 85966 63359 -55233 -74376 -56918 -72777 -130908 -121880 -141943 -149020 -80879 -121124 -62393
22090 -62393 -14735 39885 81305 -28649 -94034 -103853 3014 22527 34702 74046 46275
22079 46275 -7541 54965 157884 228241 182455 136197 76824 78515 162501 272719 329531
$$ packed form
22158A19292j30050j09231n846M4671l6665J51885J22303j47086r6322n0387J34545
22147b891J42196r8110r4760J8770J0847J9158K0268q9984n4374P1945J08137
22136E1202k3038O0000L6020k0283k4792Q795j31214j89279N824J51656L9720
22125c5389m0078q5468K9460n1541p7282O5012P3192k5717N3478L5780n2936P2379
22113c9110j1494q9906j0275j23236n6210J22866n0706N6765K2412K16778M8082
22102H5966k2607j18592j9143J7458j5859n8131R028k0063p077O8141m0245N8731
22090f2393M7658N4620M1420j09954o5385r819J06867J9513J2175L9344k7771
22079D6275n3816O2506J02919P0357m5786m6258n9373J691Q3986J10218N6812
$$ plain form
22068 329531 258205 98618 87790 114189 87510 42561 -119400 -89207 -56609 -83984 -61459
22057 -61459 -90250 -47636 -23324 59479 109110 -17543 -5211 68563 118944 99562 29662
22046 29662 -120281 -94483 -49524 5396 56664 85779 -50121 -187901 -132590 -26229 28031
22035 28031 -15840 17978 -75433 51907 143110 122675 82873 69239 55704 22810 26587 80543
22023 80543 153623 116647 52597 13401 -71703 -47804 45329 57751 19048 47266 -62168
22012 -62168 -21409 63960 221650 194111 135770 74441 168253 263912 199094 141705 48109
22001 48109 39715 84559 77055 64862 43935 25167 44056 125224 78202 -31596 14169 153476
21989 153476 74544 -78191 -85958 10766 -2319 -41271 -53669 -112009 -50236 51320 132283
$$ packed form
22068C29531p1326j59587j0828K6399k6679m4949j61961L0193L2598k7375K2525
22057f1459k8791M2614K4312Q2803M9631j26653J2332P3774N0381j9382o9900
22046B9662j49943K5798M4959N4920N1268K9115j35900j37780N5311J06361N4260
22035B8031m3871L3818r3411J27340R1203k0435l9802j3634j3535l2894L777N3956
22023H0543P3080l6976o4050l9196q5104K3899R3133J2422l8703K8218j09434
22012f2168M0759Q5369J57690k7539n8341o1329R3812R5659o4818n7389r3596
22001D8109q394M4844p504j2193k0927j8768J8889Q1168m7022j09798M5765J39307
21989A53476p8932j52735p767R6724j3085l8952j2398n8340O1773J01556Q0963
$$ plain form
21978 132283 106003 122053 26612 70815 173451 145375 -44492 -50097 -115873 -31957 64795
21967 64795 5602 9381 70147 95909 95768 68455 9259 7817 -10245 66651 66377 -8413 -104894
21954 -104894 -106489 -74106 -85170 -73153 -35652 67735 145910 14671 -13581 8264 -59038
21943 -59038 -132020 -93073 2775 -44324 -72057 -47890 -112616 -136499 -124557 -117168 84055 135867
21931 135867 20324 -28675 -18124 -97906 -91473 -68924 -133384 -47467 51188 79698 137156
21920 137156 204181 81290 -27423 -54584 -163722 -204746 -72237 21517 -54697 25692 59082
21909 59082 36551 108943 33172 2553 25496 152439 273029 263848 157048 107589 27029
21898 27029 -54955 -152533 -81615 43501 75900 18534 20846 101694 -9846 -45032 -31548
$$ packed form
21978A32283k6280J6050r5441M4203J02636k8076j89867n605o5776Q3916R6752
21967F4795n9193L779O0766K5762j41k7313n9196j442j8062P6896k74p4790r6481
21954a04894j595L2383j1064J2017L7501J03387P8175j31239k8252K1845o7302
21943e9038p2982L8947R5848m7099k7733K4167o4726k3883J1942P389K01223N1812
21931A35867j15543m8999J0551p9782O433K2549o4460Q5917R8655K8510N7458
21920A37156O7025j22891j08713k7161j09138m1024J32509R3754p6214Q0389L3390
21909E9082k2531P2392p5771l0619K2943J26943J20590r181j06800m9459q0560
21898B7029q1984r7578P0918J25116L2399n7366K312Q0848j11540l5186J3484
$$ plain form
21887 -31548 69022 133278 173289 146022 140799 102135 13918 2836 104543 166100 177797
21876 177797 81338 70102 57723 110505 194032 161629 -39511 -89733 55892 168817 151385
21865 151385 40308 -61737 -105756 -102019 -48291 30752 57284 100906 54090 -819 -59737
21854 -59737 -12372 103312 125028 14508 22182 1648 -92232 -78927 -93066 -101222 -12093 34344
21842 34344 104797 133579 136996 20576 -107909 -46034 -141886 -98350 -114272 -84739 -28334
21831 -28334 23187 36601 63798 -27935 -86046 2109 42525 -49790 -49739 65302 68143 5080
21819 5080 -52816 -101743 -96661 -15504 -44692 -76208 -38312 -85314 -102711 -110308 -108066 -66733
21807 -66733 -17301 61749 67373 34674 -31579 -48226 -59405 -24746 136879 191908 9154
$$ packed form
21887c1548J00570O4256M0011k7267n223l8664q8217j1082J01707O1557J1697
21876A77797r6459j1236j2379N2782Q3527l2403k01140n0222J45625J12925j7432
21865A51385j11077j02045m4019L737N3728P9043K6532M3622m6816n4909n8918
21854e9737M7365J15684K1716j10520P674k0534r3880J3305j4139q156Q9129M6437
21842C4344P0453K8782L417j16420j28485O1875r5852M3536j5922K9533N6405
21831b8334N1521J3414K7197r1733n8111Q8155M0416r2315N1J15041K841o3063
21819E080n7896m8927N082Q1157k9188l1516L7896m7002j7397p597K242M1333
21807f6733M9432P9050N624l2699o6253j6647j1179L4659J61625N5029j82754
$$ plain form
21796 9154 -6053 -32772 -115876 -201762 -240030 -144567 -65210 67359 99306 65683 52814 129350
21784 129350 66203 -838 78769 88291 60761 36326 49326 -12012 55697 -40779 -48591 -46579
21772 -46579 -97121 -149193 -82081 -14953 -43610 -127201 -128987 -209533 -178615 24317 148312
21761 148312 69815 57991 90357 124226 117928 136536 102701 91284 61967 -4447 -87570 -57105
21749 -57105 27475 60662 103322 65921 50987 165355 192683 196877 119949 105446 47707 81946
21737 81946 19163 43087 12225 -69370 -84861 -31268 85397 90339 185032 212014 85647
21726 85647 44305 52201 60862 -82638 -145564 -107421 -120074 -73792 24836 -89674 -124329 -112194
21714 -112194 -19513 44680 -18316 4549 119387 178275 142311 31786 21428 102018 123687
$$ packed form
21796I154j5207k6719q3104q5886l8268R5463P9357J32569L1947l3623j2869P6536
21784A29350o3147o7041P9607R522k7530k4435J3000o1338O7709r6476p812K012
21772d6579n0542n2072O7112O7128k8657q3591j786q0546L0918K02932J23995
21761A48312p8497j1824L2366L3869o298J8608l3835j1417k9317o6414q3123L0465
21749e7105Q4580L3187M2660l7401j4934J14368K7328M194p6928j4503n7739L4239
21737H1946o2783K3924l0862q1595j5491N3593J16665M942R4693K6982j26367
21726H5647m1342P896Q661j43500o2926L8143j2653M6282R8628j14510l4655J2135
21714a12194R2681O4193o2996K2865J14838N8888l5964j10525j0358Q0590K1669
$$ plain form
21703 123687 156374 75129 -10759 41611 90574 68113 41539 65591 -13752 -153131 -143377
21692 -143377 -126481 -95762 -112110 -69235 34869 74920 57999 2266 -8227 146504 202489
21681 202489 75286 -30337 -109471 -20355 -17081 103484 116875 95636 220756 225481 180119
21670 180119 183502 249838 242758 130839 -82012 -40179 -40867 89309 133720 30235 -46804
21659 -46804 -99476 -85888 39399 106227 76646 4925 -5048 72350 93670 29994 -150128
21648 -150128 -94622 -68303 27590 68645 69300 43329 36536 10240 43863 117124 164613 251872
21636 251872 236242 211569 106318 137946 221728 160313 116396 96864 -4883 71894 69379
21625 69379 35459 163695 102229 -601 -5053 -25802 118506 207605 83617 -109730 -154178
$$ packed form
21703A23687L2687q1245q5888N2370M8963k2461k6574K4052p9343j39379R754
21692a43377J6896L0719j6348M2875J04104M0051j6921n5733j0493J54731N5985
21681B02489j27203j05623p9134Q9116L274J20565J3391k1239J25120M725m5362
21670A80119L383O6336p080j11919k12851M1833o88J30176M4411j03485p7039
21659d6804n2672J3588J25287O6828k9581p1721r973P7398K1320o3676j80122
21648a50128N5506K6319R5893M1055O55k5971o793k6296L3623P3261M7489Q7259
21636B51872j5630k4673j05251L1628Q3782o1415m3917j9532j01747P6777k515
21625F9379l3920J28236o1466j02830m452k0749J44308Q9099j23988j93347m4448
$$ plain form
21614 -154178 -31654 -96369 -90357 -21412 -39963 -29430 40714 34446 -18519 42447 7288 -54684
21602 -54684 -55353 -9082 41232 -86079 -109209 -132791 46076 149440 83820 59440 114610
21591 114610 144475 70174 -17059 -101450 -145802 -113763 -96256 -256376 -143040 -7153 -37964
21580 -37964 -14336 93898 188031 204589 209838 145756 78252 50200 -17244 -75211 10883 111482
21568 111482 70732 103453 77349 141649 79829 1095 -28559 -108187 -129612 -117431 -160389
21557 -160389 -138891 -108678 17543 93716 126612 255529 187290 31963 -45854 9110 -23209
21546 -23209 46194 48200 113862 68868 -93262 -31408 24386 -73097 -97726 -44069 54178 152316
21534 152316 180606 125798 124111 49517 -131885 -166575 -188191 -151301 -46523 57774 86271
$$ packed form
21614a54178J22524o4715O012O8945j8551J0533P0144o268n2965O0966l5159o1972
21602e4684o69M6271N0314j27311k3130k3582J78867J03364o5620k4380N5170
21591A14610K9865p4301q7233q4391m4352L2039J7507j60120J13336J35887l0811
21580c7964K3628J08234R4133J6558N249o4082o7504k8052o7444n7967Q6094J00599
21568A11482m0750L2721k6104O4300o1820p8734k9654p9628k1425J2181m2958
21557a60389K1498L0213J26221P6173L2896J28917o8239j55327p7817N4964l2319
21546b3209O9403K006O5662m4994j62130O1854N5794r7483k4629N3657R8247R8138
21534A52316K8290n4808j687p4594j81402l4690k1616L6890J04778J04297K8497
$$ plain form
21523 86271 -8920 -7729 -74082 -31435 9560 144141 7507 -91265 -95035 -16694 73171 -22857
21511 -22857 -37174 12265 -5752 -63077 -10575 10151 -31780 6428 53509 18887 -36877 -30709
21499 -30709 -18044 1912 -59290 -158202 -200564 -147276 -165187 -215170 -228751 -209783 -179036 -140343
21487 -140343 -29116 -78304 -172629 -123420 17168 73298 -20680 -71851 -11645 115833 187918
21476 187918 132614 72260 173131 193377 178746 155896 109526 29403 -135188 -222949 -219541
21465 -219541 -266797 -174933 -141273 -145575 4668 111360 42493 -2801 58216 51307 -24107
21454 -24107 -102796 -34539 39796 14531 -37294 -123807 -107866 -171941 -156918 -224913 -190336 -64986
21442 -64986 -34970 -20073 -51515 -73596 -12422 83063 49513 -21997 -104545 -60480 107584
$$ packed form
21523H6271r5191J191o6353M2647M0995J34581j36634r8772l770P8341Q9865r6028
21511b2857j4317M9439j8017n7325N2502K0726m1931L8208M7081l4622n5764O168
21499c0709J2665J9956o1202r8912m2362N3288j7911m9983j3581J8968L0747L8693
21487a40343J11227m9188r4325M9209J40588N6130r3978n1171O0206J27478P2085
21476A87918n5304o0354J00871K0246j4631k2850m6370q0123j64591q7761L408
21465b19541m7256R1864L3660m302J50243J06692o8867m5294O1017o909p5414
21454b4107p8689O8257P4335k5265n1825q6513J5941o4075J5023o7995L4577J25350
21442f4986L0016J4897l1442k2081O1174R5485l3550p1510q2548M4065J68064
$$ plain form
21431 107584 291052 218621 44054 -82333 -28739 69786 -118237 -227104 -139305 -85482
21421 -85482 -39407 -40457 46670 77746 17698 -1325 43138 26377 -42952 -98766 -81269 -1886
21409 -1886 130854 210604 105448 -44284 -143870 -130213 -210151 -136027 -81519 -41197 -77680
21398 -77680 -55686 -111783 -92277 -109693 -38117 31755 70552 35478 -39025 -15428 -21921 -11574
21386 -11574 -8018 -28682 -22244 -13087 11215 -81159 -79661 -40503 -91258 -132742 -116067 32527
21374 32527 -234 -134856 -13975 30330 -20082 -139639 -178626 -138303 -58343 -47834 -142505
21363 -142505 -137435 4521 -42990 -149482 -189863 -102345 -46045 5314 -16353 291 17725
21352 17725 -89873 -104979 -79702 53267 106956 158015 168834 124528 168722 153952 73236
$$ packed form
21431A07584J83468p2431j74567j26387N3594R8525j88023j08867Q7799N3823
21421h5482M6075j050Q7127L1076o0048j9023M4463j6761o9329n5814J7497P9383
21409a886J32740P9750j05156j49732r9586J3657p9938P4124N4508M0322l6483
21398g7680K1994n6097J9506j7416P1576O9872L8797l5074p4503K3597o493J0347
21386a1574L556k0664O438R157K4302r2374J498L9158n0755m1484J6675J48594
21374C2527l2761j34622J20881M4305n0412j19557l8987M0323P9960J0509r4671
21363a42505N070J41956m7511j06492m0381Q7518N6300N1359k1667J6644J7434
21352A7725j07598j5106K5277J32969N3689N1059J0819m4306M4194j4770q0716
$$ plain form
21341 73236 24655 -22160 -9516 -3231 68209 -16917 -27003 -135126 -95656 -42415 71182
21330 71182 169810 266472 136080 -10498 -80960 -40855 14042 139779 264982 147023 -52305
21319 -52305 -63789 -99625 -124665 -19295 61806 14357 -22291 -3342 -43889 8271 151084
21308 151084 99954 31174 -89865 -97922 -30751 -7445 -136477 -133761 -155150 -104955 8925
21297 8925 13065 77350 -68438 -236266 -234748 -94230 48542 58509 19062 -7271 -33966 -49683
21285 -49683 -31091 -40062 -39894 -42785 39445 149603 89927 85044 91300 68437 68326 119779 32770
21272 32770 -70851 -99753 -75637 40242 67667 41177 7348 29158 32299 -19990 -99512
21261 -99512 -79934 -115000 -104791 3102 -24343 -12367 7243 137424 175310 17621 -83982
$$ packed form
21341G3236m8581m6815J2644O285P1440q5126j0086j08123L9470N3241J13597
21330G1182R8628R6662j30392j46578p0462M0105N4897J25737J25203j17959j99328
21319e2305j1484l5836k5040J05370Q1101m7449l6648J8949m0547N2160J42813
21308A51084n1130o8780j21039q057O7171K3306j29032K716k1389N0195J13880
21297H925M140O4285j45788j67828J518J40518J42772R967l9447k6333k6695j5717
21285d9683J8592q971J68k891Q2230J10158n9676m883O256k2863j11N1453q7009
21272C2770j03621k8902K4116J15879K7425k6490l3829K1810L141n2289p9522
21261i9512J9578l5066J0209J07893k7445J1976J9610J30181L7886j57689j01603
$$ plain form
21250 -83982 -20253 38979 184899 250037 137239 132623 158946 156402 197737 201606 220453 102896
21238 102896 107110 42917 1897 -51876 -117052 -50479 -43520 364 77281 202984 170073 114137
21226 114137 95192 110916 202685 190199 88088 -35179 -58417 -11926 18331 6026 5362
21215 5362 -116200 -110550 -103946 -44925 34811 89015 126335 19480 -25887 6609 21990 129492
21203 129492 183708 111486 7090 -45841 -17668 -18297 34106 111834 128997 -4875 39854
21192 39854 8563 -40939 -76521 -172439 -259963 -231710 -187728 -124374 -110890 -129661 -147917 -98867
21180 -98867 -41116 -72612 -31833 82092 113551 84088 19396 5785 -2841 -27127 1654 21906
21168 21906 -27859 -55136 41676 35026 32194 3548 -208712 -256720 -131050 -146851 -182189 -212269
$$ packed form
21250h3982O3729N9232J45920O5138j12798m616K6323k544M1335L869J8847j17557
21238A02896M214o4193m1020n3773o5176O6573O959M3884P6917J25703l2911n5936
21226A14137j8945J5724R1769j2486j02111j23267k3238M6491L0257j2305o64
21215E362j21562N650O604N9021P9736N4204L7320j06855m5367L2496J5381J07502
21203A29492N4216p2222j04396n2931K8173o29N2403P7728J7163j33872M4729
21192C9854l1291m9502l5582r5918q7524K8253M3982O3354J3484j8771j8256M9050
21180i8867N7751l1496M0779J13925L1459k9463o4692j3611q626k4286K8781K0252
21168B1906m9765k7277R6812o650k832k8646k12260m8008J25670j5801l5338l0080
$$ plain form
21156 -212269 -155954 -135551 -133385 -127799 11151 156175 63271 -53221 -110549 -51200 -57204
21145 -57204 -146175 -237935 -127681 -11194 -44133 -137684 113 158315 102531 43005 -74030
21134 -74030 -117686 -46628 27392 121157 162988 17574 -115302 -83740 -110814 -89344 -70602
21123 -70602 -89157 -21955 9680 45820 41721 70879 99183 59265 -37299 97999 184778 31143
21111 31143 66433 90062 -22433 -92469 -95047 -48483 -158772 -161939 -232656 -158674 -82302 -32794
21099 -32794 -62557 -128737 -231380 -153350 7630 96555 85338 111730 90610 26695 -64764
21088 -64764 -36177 3404 -86959 -105217 -92104 37403 68277 37542 25182 19611 -44064 -54808
21076 -54808 47560 196551 134137 94773 139276 197762 198977 131733 97843 101904 -34604
$$ packed form
21156b12269N6315K0403K166N586J38950J45024r2904j16492n7328N9349o004
21145e7204q8971r1760J10254J16487l2939r3551J37797J58202n5784n9526j17035
21134g4030m3656P1058P4020R3765M1831j45414j32876L1562k7074K1470J8742
21123g0602j8555O7202L1635L6140m099K9158K8304l9918r6564J35298Q6779j53635
21111C1143L5290K3629j12495p0036k578M6564j10289l167p0717P3982P6372M9508
21099c2794k9763o6180j02643P8030J60980Q8925j1217K6392k1120o3915r1459
21088f4764K8587L9581r0363j8258J3113J29507L0874l0735j2360n571o3675j0744
21076e4808J02368J48991o2414l9364M4503N8486J215o7244l3890M061j36508
$$ plain form
21065 -34604 66076 142701 171905 216100 296533 187384 -20528 -14904 -13488 -50522 -39940
21054 -39940 41948 21687 -4953 62222 93884 -32268 -162680 -164054 -59293 -118998 -153990
21043 -153990 -88623 -67375 -15085 39701 49995 -17100 -17485 -67187 -148170 -150684 -65014 -12450
21031 -12450 3718 -29622 -17637 -63758 -3778 -48882 -115981 -10209 91797 48484 117874
21020 117874 106199 16147 32352 66882 54412 79286 103970 -55891 -125147 -126487 -35759
21009 -35759 -63308 -66520 -129062 -195897 -74830 35288 -23150 -104419 -161162 -152992 45047
20998 45047 112640 18592 -16551 -62541 -17601 96865 143579 -18519 -76692 -78974 -75529 -47847
20986 -47847 -36948 42359 11288 -103470 -138192 -151630 -111048 -67610 -159297 -288488 -221617
$$ packed form
21065c4604J00680P6625K9204M4195Q0433j09149k07912N624J416l7034J0582
21054c9940Q1888k0261k6640O7175L1662j26152j30412j374J04761n9705l4992
21043a53990O5367K1248N2290N4786J0294o7095l85m9702q0983k514Q5670N2564
21031a2450J6168l3340J1985m6121N9980m5104o7099J05772J02006m3313O9390
21020A17874j1675r0052J6205L4530j2470K4874K4684j59861o9256j340R0728
21009c5759k7549l212o2542o6835J21067J10118n8438q1269n6743Q170J98039
20998D5047O7593r4048l5143m5990M4940J14466M6714j62098n8173k282L445K7682
20986d7847J0899P9307l1071j14758l4722j3438M0582M3438r1687j29191O6871
$$ plain form
20975 -221617 -143031 -146119 -169547 -119523 36324 31131 70400 57747 -68760 -103741 -81277
20964 -81277 -82913 -33830 21601 -9972 -17198 61677 26000 23143 171546 228544 245338 158513
20952 158513 69304 -8498 -192721 -156460 -18501 67720 36793 479 -7517 -58983 64474
20941 64474 16472 -243777 -308293 -107472 7852 -14270 -29681 -164060 -275277 -183121 -36427
20930 -36427 -65789 -225624 -152915 41249 108123 163128 148437 143705 137435 110129 66470 731
20918 731 -24094 -89018 -203696 -244006 -224352 12862 247837 227203 136550 153973 27223
20907 27223 -102924 -99251 -135279 -54333 -12834 -79308 -116144 -23611 28979 -109081 -224468
20896 -224468 -143709 -10664 -2929 -100439 -167786 -116448 -203098 -205093 -159460 -116920 -198452 -189999
$$ packed form
20975b21617P8586l088k3428N0024J55847n193L9269j2653j26507l4981K2464
20964h1277j636M9083N5431l1573p226P8875l5677k857J48403N6998J6794q6825
20952A58513q9209p7802j84223L6261J37959Q6221l0927l6314p996n1466J23457
20941F4474m8002k60249o4516K00821J15324k2122j5411j34379j11217R2156J46694
20930c6427k9362j59835P2709J94164O6874N5005j4691m732o270k7306m3659o5739
20918G31k4825o4924j14678m0310J9654K37214K34975k0634r0653J7423j26750
20907B7223j30147L673l6028Q0946M1499o6474l6836R2533N2590j38060j15387
20896b24468Q0759J33045P735r7510o7347N1338q6650j995M5633M2540q1532Q453
$$ plain form
20884 -189999 -132632 -70123 -118359 50814 64600 -21745 -70491 -80631 -37643 -52099 -19265
20873 -19265 85945 254124 130985 37496 10787 39737 137316 169818 101273 -52103 -14650
20862 -14650 121906 260426 290394 253427 117607 156938 191657 42799 -11802 -9203 35263
20851 35263 76871 109204 95874 144499 217925 2565 -146150 -108959 -52537 -117092 -107574
20840 -107574 -9021 115165 187139 100020 117090 98135 20286 34641 69986 107617 36761
20829 36761 -7002 -140191 -160270 -159037 -68716 91570 200741 219874 209574 175821 127717
20818 127717 69404 85991 131717 143519 95059 -79011 -129845 22089 123128 92579 91758
20807 91758 -9984 -91907 -168932 -215373 -102162 -41922 98635 34691 -97501 -190724 -159326
$$ packed form
20884a89999N7367O2509m8236J69173J3786q6345m8746j0140M2988j4456L2834
20873a9265J05210J68179j23139r3489k6709K8950R7579L2502o8545j53376L7453
20862a4650J36556J38520K9968l6967j35820L9331L4719j48858n4601K599M4466
20851C5263M1608L2333j3330M8625P3426k15360j48715L7191N6422o4555R518
20840a07574R8553J24186P1974q7119J7070j8955p7849J4355L5345L7631p0856
20829C6761m3763j33189k0079J233R0321J60286J09171J9133j0300l3753m8104
20818A27717n8313J6587M5726J1802m8460j74070n0834J51934J01039l0549q21
20807I1758j01742q1923p7025m6441J13211O0240J40557o3944j32192r3223L1398
$$ plain form
20796 -159326 -53517 44425 139531 111579 30970 132424 252658 234676 196321 4986 -106911
20785 -106911 -74947 -168847 -127851 -24637 19845 -36733 52378 72158 68053 144617 91111
20774 91111 176890 179355 195817 231159 124713 102553 219944 188521 99048 101206 -10330
20763 -10330 -2789 89098 82281 24329 -20956 -39740 -81195 -112756 -104572 -68196 72385 142266
20751 142266 111194 184075 106714 -5647 -83543 -61106 1420 -8684 -40656 -47211 -63133
20740 -63133 46495 152508 156439 252507 167385 151813 -469 -67518 -130808 -98140 -111585
20729 -111585 -198957 -232689 -253334 -135148 -40900 -122152 -239087 -218491 -158307 38926 132986
20718 132986 255650 83805 18494 35970 65805 23649 41579 73710 27167 1674 85957
$$ packed form
20796a59326J05809R7942R5106k7952q0609J01454J20234j7982l8355j91335j11897
20785a06911L1964r3900M0996J03214M4482n6578Q9111J9780m105P6564n3506
20774I1111Q5779K465J6462L5342j06446k2160J17391l1423q9473K158j11536
20763a0330P541R1887o817n7952m5285j8784m1455l1561Q184L6376J40581O9881
20751A42266l1072P2881p7361j12361p7896K2437O2526j0104l1972o555j5922
20740f3133J09628J06013L931R6068q5122j5572j52282o7049o3290L2668j3445
20729a11585q7372l3732k0645J18186R4248q1252j16935K0596O0184J97233R4060
20718A32986J22664j71845o5311J7476K9835m2156J7930L2131m6543k5493Q4283
$$ plain form
20707 85957 56011 94097 249634 112960 15778 86377 85116 83072 30274 78224 161045 158607
20695 158607 41611 -25701 -82825 -54214 -5264 101461 187878 252052 190876 136508 75252
20684 75252 47531 98188 136948 73628 -113927 -85242 -17179 101823 157151 194337 197514
20673 197514 113896 20316 -141692 -180678 -137826 31615 15952 -106730 -121186 49383 25447
20662 25447 -29212 -11089 12085 -17269 140951 158790 180895 262180 231841 162254 203405
20651 203405 89103 11606 -6698 55666 47678 48272 32517 -4539 -67310 -159513 -180042 -91704
20639 -91704 20893 13130 -54392 -98395 -141779 -50042 -9286 -27608 -115380 -212467 -223090 -121374
20627 -121374 -52524 -89932 -70960 14164 121753 114581 49812 67391 143950 104387 177522
$$ packed form
20707H5957k9946L8086J55537j36674r7182P0599j261k044n2798M7950Q2821k438
20695A58607j16996o7312n7124K8611M8950J06725Q6417O4174o1176n4368o1256
20684G5252k7721N0657L8760o3320j87555K8685O8063J19002N5328L7186L177
20673A97514q3618r3580j62008l8986M2852J69441j5663j22682j4456J70569k3936
20662B5447n4659J8123K3174k9354J58220J7839K2105Q1285l0339o9587M1151
20651B03405j14302p7497j8304O2364p988N94j5755l7056o2771r2203k0529Q8338
20639i1704J12597p763o7522m4003m3384R1737M0756j8322q7772r7087j0623J01716
20627a21374O8850l7408J8972Q5124J07589p172o4769J7579P6559l9563P3135
$$ plain form
20616 177522 148675 136217 82731 43159 -40095 -65719 21055 64599 -44176 36130 43391
20605 43391 -59935 -15838 -57342 -83262 15260 13040 -90830 -61930 75114 162462 137296
20594 137296 116979 157033 16242 -171848 -234559 -219874 -194242 -200816 -156123 20185 106794
20583 106794 22339 75404 140710 100418 -23559 -186893 -194900 -154895 -155268 -101100 41618
20572 41618 45919 70952 25835 21852 99501 131630 29400 46348 78418 -9426 -125390 -143465
20560 -143465 -51876 43852 98467 92187 181933 155508 -98386 -173916 -154684 -98695 -114369
20549 -114369 -123192 -30695 -35807 -133567 -66702 -166935 -260796 -254218 -44393 38184 92142 23636
20537 23636 -26277 24765 94065 -49425 -2330 -44621 -149175 -161281 -133529 24124 100615
$$ packed form
20616A77522k8847j2458n3486l9572q3254k5624Q6774M3544j08775Q0306P261
20605D3391j03326M4097m1504k5920R8522k220j03870K8900J37044Q7348k5166
20594A37296k0317M0054j40791j88090o2711J4685K5632o574M4693J76308Q6609
20583A06794q4455N3065O5306m0292j23977j63334q007M0005l73N4168J42718
20572D1618M301K5033m5117l983P7649L2129j02230J6948L2070q7844j15964j8075
20560a43465R1589R5728N4615o280Q9746k6425k53894p5530J9232N5989j5674
20549a14369q823R2497n112r7760O6865j00233r3861O578K09825Q2577N3958o8506
20537B3636m9913N1042O9300j43490M7095m2291j04554j2106K7752J57653P6491
$$ plain form
20526 100615 190829 176562 60091 9411 -57237 -157479 -241053 -228660 -15748 40320 67689
20515 67689 23680 -30057 -35149 -35029 -103962 -33790 73678 -14887 -50302 -203904 -154845 -100771
20503 -100771 -65816 -41656 -47493 30111 127695 80978 87506 129639 101371 75276 222840 264562
20491 264562 183637 172355 263818 236008 116725 97507 203174 102179 44799 -38464 -83748
20480 -83748 -98012 -132513 -58107 11978 -71784 -64295 7245 44114 20668 50135 119699 95215
20468 95215 -5766 127570 272678 140757 36880 191142 310427 223789 109738 63698
20458 63698 -21017 -48306 86324 112324 8359 -16606 -47544 24645 98631 100929 168780
20447 168780 136440 81470 -16995 -32753 17524 18448 -53950 -103477 -138509 -219185 -227741 -134906
$$ packed form
20526A00615R0214j4267j16471n0680o6648j00242q3574J2393K12912N6068K7369
20515F7689m4009n3737n092J20o8933P0172J07468q8565l5415j53602M9059N4074
20503a00771L4955K4160n837P7604R7584m6717O528M2133k8268k6095J47564M1722
20491B64562q0925j1282R1463k7810j19283j9218J05667j00995n7380q3263m5284
20480h3748j4264l4501P4406P0085q3762P489P1540L6869k3446K9467O9564k4484
20468I5215j00981J33336J45108j31921j03877J54262J19285q6638j14051m6040
20458F3698q4715k7289J34630K6000j03965k4965l0938P2189P3986K298O7851
20447A68780l2340n4970r8465j5758N0277R24p2398m9527l5032q0676q556R2835
$$ plain form
20435 -134906 -5239 13217 45536 4119 -80325 -119595 -79090 -124176 -9370 -54779 -55280
20424 -55280 12000 125751 47106 82503 122299 177275 128478 68712 -46745 -72772 -25664
20413 -25664 40901 78980 69312 140782 104401 -21716 -102002 3909 24400 -75189 -101067
20402 -101067 -100172 324 2660 -6923 33209 -11147 -142057 -202051 -55101 38286 62532 120058
20390 120058 228200 106555 -34861 -145611 -46128 2160 -73052 -134777 -213447 -147451 -36648
20379 -36648 14003 37093 51831 2855 -48561 -67182 356 123522 148820 92954 91655 123106
20367 123106 92999 109781 118053 74226 52726 -59783 -114055 -84070 -51716 -92532 -87082 -69293
20355 -69293 -75599 -59857 -33701 31120 126137 143223 123136 105191 98557 113606 128468 173873
$$ packed form
20435a34906J29667J8456L2319m1417q4444l9270M0505m5086J14806m5409n01
20424e5280O7280J13751p8645L5397L9796N4976m8797n9766j15457k6027M7108
20413b5664O6565L8079r668P1470l6381j26117q0286J05911K0491r9589k5878
20402a01067Q95J00496K336r583M0132m4356j30910n9994J46950R3387K4246N7526
20390A20058J08142j21645j41416j10750R9483M8288p5212o1725p8670O5996J10803
20379c6648N0651K3090J4738m8976n1416j8621O7538J23166K5298n5866j299L1451
20367A23106l0107J6782Q272m3827k1500j12509n4272K9985L2354m0816N450J7789
20355f9293o306J5742K6156O4821R5017J7086k0087j7945o634J5049J4862M5405
$$ plain form
20343 173873 185613 187552 147685 79096 12126 -93598 -32244 63983 61093 103088 152811 86524
20331 86524 -38002 -139964 -135255 -87147 59390 130145 21789 -79998 -118853 -141788 -138133
20320 -138133 -55169 22072 79341 103235 45355 90686 148239 89322 -99265 -217094 -88568
20309 -88568 -4679 -61219 -70538 -37790 -96051 -140746 -163189 -156015 -156996 -201025 -307876 -226478
20297 -226478 -112521 -120714 -102100 -136133 -160462 -32557 -15380 18248 25448 -34887 -97801
20286 -97801 -136946 -193035 -68759 76291 169064 185125 106843 42243 8485 -114806 -68946
20275 -68946 -3652 55843 166988 114092 26547 -9714 96060 107453 60486 67754 123008
20264 123008 133141 80220 194267 189206 121147 37687 -65457 -57188 -59513 -74386 41259
$$ packed form
20343A73873J1740J939l9867o8589o6970j05724O1354R6227k890M1995M9723o6287
20331H6524j24526j01962M709M8108J46537P0755j08356j01787l8855k2935L655
20320a38133Q2964P7241N7269K3894n7880M5331N7553n8917j88587j17829J28526
20309h8568Q3889n6540r319L2748n8261m4695k2443P174r81m4029j06851Q1398
20297b26478J13957q193J8614l4033k4329J27905J7177L3628P200o0335o2914
20286i7801l9145n6089J24276J45050R2773J6061p8282o4600l3758j23291M5860
20275f8946O5294N9495J11145n2896q7545l6261J05774J1393m6967P268N5254
20264A23008J0133n2921J14047n061o8059q3460j03144Q269k325j4873J15645
$$ plain form
20253 41259 1704 21562 3496 -5621 -83526 -115049 -54011 50579 8853 -85011 -77550 21615
20241 21615 95898 100322 -18932 -78639 -24024 -51968 -129527 -133467 -15491 -65043 -164739 -113311
20229 -113311 -77371 -32242 14749 22015 -88429 -202395 -192461 -220264 -151174 -69043 61794
20218 61794 75220 58032 67335 58811 129347 199942 92025 64841 141596 164078 80512 14066
20206 14066 71364 192763 186625 102164 97785 170059 172688 177029 160794 134415 165510 201891
20194 201891 153629 304079 389675 302469 231583 150127 143266 231918 157946 97177 183649
20183 183649 198614 124468 42102 64973 46935 64426 108225 80750 113671 163773 71221
20172 71221 -30751 -49855 1841 99038 62381 27242 -24887 73789 33162 -49901 37788
$$ packed form
20253D1259l9555J9858j8066r117p7905l1523O1038J04590m1726r3864P461R9165
20241B1615P4283M424j19254n9707N4615k7944p7559l940J17976m9552r9696N1428
20229a13311L5940M5129M6991P266j10444j13966R934k7803O9090Q2131J30837
20218F1794J3426j7188R303q524P0536P0595j07917k7184P6755K2482q3566o6446
20206A4066N7298J21399o138q4461m379P2274K629M341j6235k6379L1095L6381
20194B01891m8262J50450Q5596q7206p0886q1456o861Q8652p3972o0769Q6472
20183A83649J4965p4146q2366K2871j8038J7491M3799k7475L2921N0102r2552
20172G1221j01972j9104N1696R7197l6657l5139n2129R8676m0627q3063Q7689
$$ plain form
20161 37788 162173 201727 168480 205256 274122 279614 295724 100443 -72679 -59412 123998
20150 123998 173784 87884 92570 14437 -50063 -69187 -173207 -44927 66349 140211 50296
20139 50296 4253 43450 167310 215004 203688 150839 88503 137518 57009 109602 212915
20128 212915 127111 106612 118384 147503 151459 100165 153025 162732 86312 57834 -12763 -59076
20116 -59076 35214 88676 12751 25036 18630 7405 59124 75104 149687 173099 145018 150991
20104 150991 170225 30138 -28705 46961 133059 315131 262513 166618 182959 145591 83840
20093 83840 108927 94661 715 6650 -84632 -81314 3257 -98530 -207240 -128047 -30842 -48895
20081 -48895 139311 124006 116582 157359 137541 148593 80334 45029 105883 56989 31470 -101795
$$ packed form
20161C7788J24385L9554l3247L6776O8866N492J6110j95281j73122J3267J83410
20150A23998M9786q5900M686p8133o4500j9124j04020J28280J11276P3862q9915
20139E0296m6043L9197J23860M7694j1316n2849o2336M9015q0509N2593J03313
20128B12915q5804k0499J1772K9119L956n1294N2860R707p6420k8478p0597m6313
20116e9076R4290N3462p5925J2285o406j1225N1719J5980P4583K3412k8081N973
20104A50991J9234j40087n8843P5666Q6098J82072n2618r5895J6341l7368o1751
20093H3840K5087j4266r3946N935r1282L318Q4571j01787j08710P9193R7205j8053
20081d8895J88206j5305p424M0777j9818J1052o8259l5305O0854m8894k5519j33265
$$ plain form
20069 -101795 -98573 -33244 -12114 83890 84343 27624 -39054 -66222 -21864 -38934 -30955 -83854
20057 -83854 -137764 -115449 -100675 -74496 20009 90952 199101 233875 130276 82521 86882
20046 86882 141450 152800 18796 -112591 -146920 -88508 -63893 74642 290851 419561 337807
20035 337807 214566 7943 6503 -39177 -55753 -66972 -88772 -160888 -56539 20231 19804
20024 19804 -30927 -78466 158541 158394 120189 -6919 -46707 -37911 -79402 -121087 -159785 -22418
20012 -22418 178137 207495 200021 144684 93086 7312 17935 74752 119323 -7701 -127583
20001 -127583 -181601 -182054 -6404 112235 47248 44820 47647 41369 -24879 -159137 -148812 -66839
19989 -66839 49224 104063 31927 38832 -10548 -65012 -120173 -209833 -205523 -188891 -133774 -69474
$$ packed form
20069a01795L222O5329K1130R6004M53n6719o6678k7168M4358j7070P979n2899
20057h3854n3910K2315J4774K6179R4505P0943J08149L4774j03599m7755M361
20046H6882N4568J1350j34004j31387l4329N8412K4615J38535K16209J28710q1754
20035C37807j23241k06623j440m5680j6576j1219k1800p2116J04349P6770m27
20024A9804n0731m7539K37007j47l8205j27108l9788Q796m1491m1685l8698J37367
20012b2418K00555K9358p474n5337n1598q5774J0623N6817M4571j27024j19882
20001a27583n4018m53J75650J18639o4987k428K827o278o6248j34258J0325Q1973
19989f6839J16063N4839p2136O905m9380n4464n5161q9660M310J6632N5117O4300
$$ plain form
19977 -69474 -692 -42925 -19836 18303 101325 114406 123801 118645 129660 144878 233071 84180
19965 84180 -4972 103819 122965 154397 173140 137902 57389 -17884 25787 35933 8132
19954 8132 33310 31694 -60033 -95109 -53405 128710 87411 -4179 -62447 69928 195616
19943 195616 197889 101576 9502 55297 101605 127226 119730 109850 130102 268743 335530 340622
19931 340622 313293 298819 207569 84207 35043 51866 -8273 -99325 43994 99799 156871
19920 156871 234539 260425 254122 193164 264563 203157 225708 155978 96469 69220 96159 119971
19908 119971 49293 -123247 -160094 -84722 -97314 -73328 -19566 43352 -92852 -103566 -53359
19897 -53359 -31327 -14585 -29890 -29831 -15749 -36217 -23367 -129908 -32621 78055 29279 -35692
$$ packed form
19977f9474O8782m2233K3089L8139Q3022J3081R395n156J1015J5218Q8193j48891
19965H4180q9152J08791J9146L1432J8743l5238q0513p5273M3671J0146k7801
19954H132K5178j616r1727l5076M1704J82115m1299r1590n8268J32375J25688
19943A95616K273r6313r2074M5795M6308K5621p496r880K0252J38641O6787N092
19931C40622k7329j4474r1250j23362m9164J6823o0139r1052J43319N5805N7072
19920A56871P7668K5886o303o0958P1399o1406K2551o9730n9509k7249K6939K3812
19908A19971p0678j72540l6847P5372j2592K3986N3762O2918j36204j0714N0207
19897e3359K2032J6742j5305N9J4082k0468J2850j06541R7287J10676m8776o4971
$$ plain form
19885 -35692 -20952 -29894 -43706 97688 155530 168824 278404 201744 42465 25812 267
19874 267 -25270 -21846 23717 129807 213825 167268 28520 -44647 23464 89355 17643 -41976
19862 -41976 -40369 -69718 54813 128396 180269 163540 160179 77278 28715 -15465 15113 12691
19850 12691 -58860 -96782 56116 77502 47704 140659 192255 110493 97817 108090 84597
19839 84597 88106 40713 130990 130365 59547 121764 200897 176837 51800 66228 8978 98889
19827 98889 227447 189973 233538 259746 116482 -1669 124515 31314 -160436 -132397 88286
19816 88286 218121 94153 -60966 -118561 -121482 -111099 -42796 -58033 -120336 -61196 21230
19805 21230 -34525 -34675 1774 -9499 -106023 -72043 -101269 4481 222117 143459 114619 100646
$$ packed form
19885c5692J4740q942j3812J41394N7842J3294J09580p6660j59279j6653k5545
19874B67k5537L424M5563J06090Q4018m6557j38748p3167O8111O5891p1712n9619
19862d1976J607k9349J24531P3583N1873j6729l361q2901m8563m4180L0578k422
19850A2691p1551l7922J52898K1386k9798R2955N1596q1762j2676J0273k3493
19839H4597L509m7393R0277o25p0818O2217P9133k4060j25037J4428n7250Q9911
19827I8889J28558l7474M3565K6208j43264j18151J26184r3201j91750K8039K20683
19816H8286J29835j23968j55119n7595k921J0383O8303j5237o2303N9140Q2426
19805B1230n5755j50L6449j1273r6524L3980k9226J05750K17636p8658k8840j3973
$$ plain form
19793 100646 73949 108642 155623 82985 107075 160469 124239 230079 220208 206039 245018
19782 245018 377482 375468 349894 267896 261152 200780 53583 -1932 108273 266168 206511
19771 206511 167328 296089 257911 246257 192438 167257 180330 100008 -16973 -39311 -46144
19760 -46144 -78315 33094 110473 170947 66639 -49068 -97707 -136348 -21026 -5696 41568
19749 41568 111001 117484 127709 86177 52222 134911 172328 148929 213376 174036 131486 116952
19737 116952 60788 43837 29743 9462 94888 139463 111507 74153 -29936 -24186 17214
19726 17214 -27907 -35377 -80441 82127 320798 261529 226855 155873 147875 62217 -88111
19715 -88111 1917 125370 202465 92889 61310 -11518 -27199 48357 139715 106239 147117
$$ packed form
19793A00646k6697L4693M6981p2638K4090N3394l6230J05840r871j4169L8979
19782B45018J32464k014k5574q1998o744o0372j47197n5515J10205J57895n9657
19771B06511l9183J28761l8178j1654n3819k5181J3073q0322j16981k2338o833
19760d6144l2171J11409P7379O0474j04308j15707m8639l8641J15322J5330M7264
19749D1568O9433O483J0225m1532l3955Q2689L7417k3399O4447l9340m2550j4534
19737A16952n6164j6951j4094k0281Q5426M4575k7956l7354j04089N750M1400
19726A7214m5121p470m5064J62568K38671n9269l4674p0982p998q5658j50328
19715h8111R0028J23453P7095j09576l1579p2828j5681P5556R1358l3476M0878
$$ plain form
19704 147117 209005 61033 -2650 59434 -76582 -88457 -90128 -62667 51252 222698 380790
19693 380790 330761 244179 122938 -40320 57060 174243 195676 220341 233718 137920 106183
19682 106183 121964 71293 132555 168646 167067 228871 228780 148218 197728 203565 167812 31637
19670 31637 52851 64424 96016 -44271 -89636 -46173 41242 109671 64382 63587 88232 78908
19658 78908 113698 149140 181115 261452 173000 200082 182937 88479 214155 335311 404719
19647 404719 291217 212241 209882 192404 192641 172609 204713 206283 242465 190382 182292 237983
19635 237983 126419 12249 -25012 -29756 7176 75687 165539 187363 145919 130382 202321
19624 202321 62474 30385 18569 -25627 30837 144397 198778 82864 64984 124590 213240
$$ packed form
19704A47117O1888j47972o3683O2084j36016j1875j671K7461J13919J71446J58092
19693C80790n0029q6582j21241j63258R7380J17183K1433K4665J3377r5798l1737
19682A06183J5781n0671O1262L6091j579O1804r1q0562M9510N837l5753j36175
19670C1637K1214J1573L1592j40287m5365M3463Q7415O8429m5289p95K4645r324
19658G8908L4790L5442L1975Q0337q8452K7082j7145r4458J25676J21156O9408
19647D04719j13502p8976k359j7478K37k0032L2104J570L6182n2083q090N5691
19635B37983j11564j14170l7261m744L6932O8511Q9852K1824m1444j5537P1939
19624B02321j39847l2089j1816m4196N6464J13560N4381j15914j7880N9606Q8650
$$ plain form
19613 213240 152829 164672 191438 52058 -44200 934 140472 77660 32498 92755 147917
19602 147917 30966 -37853 -74143 -35208 40271 28045 45502 154315 80825 132021 279088
19591 279088 238840 148521 151430 194083 355752 358312 257659 175100 117303 84516 142303
19580 142303 189070 130638 234182 258071 94377 91197 115415 55178 23261 102644 121247
19569 121247 53289 60937 111612 135152 137780 164888 216471 171427 52077 127177 288157
19558 288157 204707 166021 17714 14866 30107 45717 31200 3005 37035 51832 27994
19547 27994 -47181 37085 162020 240584 157249 -4301 -70025 -132802 -70133 31979 109028
19536 109028 187613 192641 231357 360491 328156 244996 262204 154692 87499 47993 22079
$$ packed form
19613B13240o0411J1843K6766j39380r6258M5134J39538o2812m5162O0257N5162
19602A47917j16951o8819l6290L8935P5479j2226J7457J08813p3490N1196J47067
19591B79088m0248r0319K909M2653J61669K560j00653q2559n7797l2787N7787
19580A42303M6767n8432J03544K3889j63694l180K4218o0237l1917P9383J8603
19569A21247o7958P648N0675K3540K628K7108N1583m5044j19350P5100J60980
19558B88157q3450l8686j48307k848J5241J5610j4517k8195L4030J4797k3838
19547B7994p5175Q4266J24935P8564q3335j61550o5724o2777O2669J02112P7049
19536A09028P8585N028L8716J29134l2335q3160J7208j07512o7193l9506k5914
$$ plain form
19525 22079 165625 261814 205352 207029 309040 358449 250980 248584 277754 218494 176059
19514 176059 242156 328802 309798 265475 194423 146845 158297 157054 86567 34344 109521 154337
19502 154337 174665 131474 172619 277809 269834 290883 261901 214075 87588 150053 312088
19491 312088 344392 338453 288121 245350 217553 213430 243020 322865 383700 281508 234178 186448
19479 186448 113567 137890 194743 162635 90934 72173 59548 66127 146738 149160 90089 69158
19467 69158 184474 241389 186338 153922 184390 198757 219059 276091 287226 328822 408312
19456 408312 302132 176913 92451 115208 128310 100555 56203 61956 208147 226742 131815
19445 131815 40136 107156 42719 33571 54721 198462 249461 185238 203272 289026 400077
$$ packed form
19525B2079J43546R6189n6462J677J02011M9409j07469k396K9170n9260m2435
19514A76059O6097Q6646j9004m4323p1052m7578J1452j243p0487n2223P5177M4816
19502A54337K0328m3191M1145J05190p975K1049k8982m7826j26487O2465J62035
19491C12088L2304n939n0332m2771k7797m123K9590P9845O0835j02192m7330m7730
19479A86448p2881K4323N6853l2108p1701j8761j2625O579Q0611K422n9071k0931
19467F9158J15316N6915n5051l2416L0468J4367K0302N7032J1135M1596P9490
19456D08312j06180j25219q4462K2757J3102k7755m4352N753J46191J8595r4927
19445A31815r1679O7020o4437r148K1150J43741N0999o4223J8034Q5754J11051
$$ plain form
19434 400077 388009 293511 267628 231288 223132 373240 402754 372112 424716 361446 273598
19423 273598 254444 269223 283349 310312 304272 325819 382478 437222 267503 249662 241493 192082
19411 192082 109202 133807 216706 212290 184399 220822 221042 267605 259301 241242 321575 241213
19399 241213 127689 130530 196496 181301 258521 349916 372668 307263 303113 317421 280224 220644
19387 220644 231698 226220 178822 156050 251865 230286 114691 157321 157497 220469 277694 322052
19375 322052 315989 212927 116642 223309 214567 80549 -4250 17681 5982 78290 172409
19364 172409 233997 308502 331763 393426 417007 493843 625249 683755 783603 915051 1123039
19353 1123039 1140450 1000438 878992 631110 546596 542404 418172 385292 498521 514295
$$ packed form
19434D00077j2068r4498k5883l6340q156J50108K9514l0642N2604o3270q7848
19423B73598j9154J4779J4126K6963o040K1547N6659N4744j69719j7841q169m9411
19411A92082q2880K4605Q2899m416k7891L6423K20M6563q304j8059Q0333q0362
19399B41213j13524K841O5966j5195P7220R1395K2752o5405m150J4308l7197n9580
19387B20644J1054n478m7398k2772R5815k1579j15595M2630J76O2972N7225M4358
19375C22052o063j03062r6285J06667q742j34018q4799K1931j1699P2308R4119
19364A72409O1588P4505K3261O1663K3581P6836J31406N8506R9848J31448K07988
19353A123039J7411j40012j21446k47882q4514m192j24232l2880J13229J5774
$$ plain form
19343 514295 560356 511634 580480 628286 678472 687387 616287 607662 619090 679180 668151 567917
19331 567917 522133 364780 316244 446170 563194 564563 511230 523953 477916 532835 627828
19320 627828 732287 811668 761190 645113 620036 656244 616352 605294 658000 765187 875583
19309 875583 942777 1088107 1246497 1339971 1309256 1218405 1215364 1246510 1223429 1099777 1157513
19298 1157513 1256361 1336820 1449367 1551320 1612253 1592699 1539698 1402907 1294114 1363321
19288 1363321 1341184 1332437 1351403 1147255 862154 629781 672447 644514 638815 559599 582147
19277 582147 556603 594304 550787 477316 486568 574024 620631 503467 378004 454269 501996
19266 501996 513889 552644 567074 568243 682650 830763 962010 1058412 1072536 1112238 1085599
$$ packed form
19343E14295M6061m8722O8846M7806N0186Q915p1100q625J1428O0090j1029j00234
19331E67917m5784j57353m8536J29926J17024J369n3333J2723m6037N4919R4993
19320F27828J04459P9381n0478j16077k5077L6208l9892j1058N2706J07187J10396
19309H75583O7194J45330J58390R3474l0715r0851l041L1146k3081j23652N7736
19298A157513R8848Q0459J12547J01953O0933j9554n3001j36791j08793O9207
19288A363321k2137q747J8966k04148k85101k32373M2666k7933n699p9216K2548
19277E82147k5544L7701m3517p3471R252Q7456M6607j17164j25463P6265M7727
19266E01996J1893L8755J4430J169J14407J48113J31247R6402J4124L9702k6639
$$ plain form
19255 1085599 995971 850901 744594 716097 756374 751608 864984 836304 927163 1113256 1166694
19244 1166694 1245582 1168953 1001835 847028 731928 725409 774268 736411 602915 555084 556428
19233 556428 470454 461166 508621 548579 623088 621134 713776 751441 717797 699632 673083 659939
19221 659939 648072 481559 427227 453502 355367 427334 403446 520345 651455 743454 614959
19210 614959 515815 547197 499713 354876 203467 264968 400140 554701 728951 557056
19200 557056 548881 531295 523932 428833 437328 413645 471717 523074 473858 415786 348487 313827
19188 313827 358423 434744 468833 423854 350532 211466 194712 327041 574168 662141 597495
19177 597495 597959 633964 592149 372589 258746 285077 337197 418244 429362 481804 477683 438682
$$ packed form
19255A085599q9628j45070j06307k8497M0277m766J13376k8680R0859J86093N3438
19244A166694P8888p6629j67118j54807j15100o519M8859l7857j33496m7831J344
19233E56428q5974r288M7455L9958P4509j954R2642L7665l3644j8165k6549j3144
19221F59939j1867j66513n4332K6275r8135P1967k3888J16899J31110R1999j28495
19210F14959r9144L1382m7484j44837j51409O1501J35172J54561J74250j71895
19200E57056q175j7586p363r5099Q495k3683N8072N1357m9216n8072o7299l4660
19188C13827M4596P6321L4089m4979p3322j39066j6754J32329K47127Q7973o4646
19177E97495M64L6005m1815k19560j13843K6331N2120Q1047J1118N2442m121l9001
$$ plain form
19165 438682 467097 445596 361362 357857 315248 399624 512209 571432 517712 432529 464594
19154 464594 459489 417284 414428 445823 515440 390705 317553 348688 426979 511909 512355 443863
19142 443863 276517 239164 423197 509749 549171 598128 647705 534710 342513 374419 395569
19131 395569 313308 250044 334388 423099 364068 287465 374828 444483 488832 495339 409817 395251
19119 395251 373287 402785 436051 349642 313140 415730 438048 514024 467332 397722 410480
19108 410480 493173 371793 387217 362344 226992 163198 128448 322496 554564 468949 278072
19097 278072 333683 355539 378996 317337 397153 483080 462728 448480 503575 599676 643542
19086 643542 565761 449169 488189 526651 648019 741079 712325 595055 651108 731645 764188
$$ packed form
19165D38682K8415k1501q4234l505m2609Q4376J12585N9223n3720q5183L2065
19154D64594n105m2205k856L1395O9617j24735p3152L1135P8291Q4930M46o8492
19142D43863j67346l7353J84033Q6552L9422M8957M9577j12995j92197L1906K1150
19131C95569q2261o3264Q4344Q8711n9031p6603Q7363O9655M4349O507q5522j4566
19119C95251k1964K9498L3266q6409l6502J02590K2318P5976m6692o9610J2758
19108D10480Q2693j21380J5424k4873j35352o3794l4750J94048K32068q5615j90877
19097B78072N5611K1856K3457o1659P9816Q5927k0352j4248N5095R6101M3866
19086F43542p7781j16592L9020L8462J21368R3060k8754j17270N6053Q0537L2543
$$ plain form
19075 764188 794672 764126 817622 878890 827844 677954 547973 532428 542969 522135 506237
19064 506237 618172 655219 677283 649334 595971 648543 772462 761085 651335 431305 473697
19053 473697 639361 620819 638866 689108 593057 543603 544692 678578 682319 587995 621229
19042 621229 620040 593146 601299 611563 615570 583860 613166 665860 653587 661399 678265 733022
19030 733022 775569 757043 844582 895051 918620 852951 825889 807804 656093 650828 658421 774737
19018 774737 813114 802608 808393 812923 914750 866322 784056 887246 928737 903368 822539
19007 822539 846760 891242 965221 956220 988492 996240 1076081 1140138 1049421 1019564 952888 887125
18995 887125 838787 688508 520697 632459 815448 802222 711234 591007 644564 577742
$$ packed form
19075G64188L0484l0546N3496O1268n1046j49890j29981j5545J0541k0834j5898
19064E06237J11935L7047K2064k7949n3363N2572J23919j1377j09750k20030M2392
19053D73697J65664j8542J8047N0242r6051m9454J089J33886L741r4324L3234
19042F21229j189k6894Q153J0264M007l1710K9306N2694j2273P812J6866N4757
19030G33022M2547j8526Q7539N0469K3569o5669k7062j8085j51711n265P593J16316
19018G74737L8377j0506N785M530J01827m8428q2266J03190M1491k5369q0829
19007H22539K4221M4482P3979r001L2272P748P9841O4057r0717k9857o6676o5763
18995H87125m8338j50279j67811J11762J82989j3226r0988j20227N3557o6822
$$ plain form
18985 577742 660481 597831 545616 634781 644558 714249 767371 781656 871662 943782 954636 897454
18973 897454 972394 1082664 1162023 1077917 957260 826939 834831 880924 912271 938498 949196
18962 949196 1060563 1229343 1243878 1348916 1446891 1510953 1573321 1570661 1446958 1490119 1534683
18951 1534683 1593875 1611334 1543911 1478261 1448734 1571764 1619548 1395069 1332747 1312249 1236611
18940 1236611 1249007 1260744 1261362 1177222 1167743 1180158 1162811 1127166 1078096 1033487 1099894 1148128
18928 1148128 1159870 1076367 956511 787134 768825 738219 706700 725487 795961 798851 839381
18917 839381 921650 1040572 1099464 1112655 1142057 1199659 1412879 1687033 1713529 1534348 1528191
18906 1528191 1513886 1494267 1639249 1723579 1908386 2100005 2265537 2484870 2612639 2473767
$$ packed form
18985E77742Q2739o2650n2215Q9165R777O9691N3122J4285R0006P2120J0854n7182
18973H97454P4940J10270P9359q4106j20657j30321P892M6093L1347K6227J0698
18962I49196J11367J68780J4535J05038R7975O4062O2368k660j23703M3161M4564
18951A534683N9192J7459o7423o5650k9527J23030M7784k24479o2322k0498p5638
18940A236611J2396J1737O18q4140r479J2415j7347l5645m9070m4609O6407M8234
18928A148128J1742q3503j19856j69377j8309l0606l1519J8787P0474K890M0530
18917H39381Q2269J18922N8892J3191K9402N7602K13220K74154K6496j79181o157
18906A528191j4305j9619J44982Q4330J84807J91619J65532K19333J27769j38872
$$ plain form
18896 2473767 2434318 2378714 2205138 2064118 1897019 1751289 1715835 1684966 1640959 1678459
18886 1678459 1823052 1938097 2157535 2313343 2246439 2139535 2029147 1869702 1663295 1640073
18876 1640073 1620032 1734311 1783641 1860081 1920805 1931007 1866249 1863740 2067422 2166907 2287242
18865 2287242 2534297 3039076 3674015 4683299 5879308 6599634 6719612 6257317 5641034
18856 5641034 5077769 4694020 4444944 4292445 4283996 4502307 4756772 4957119 5084711 5300903
18846 5300903 5439462 5524235 5574497 5636585 5708872 5808940 5970030 6067319 6222663 6651913
18836 6651913 7307957 7965081 8836106 9968217 11651195 14149434 17809443 23650908 33524756
18827 33524756 50158236 71922051 92112007 108744099 117991895 118716647 110474003 95086239
$$ packed form
18896B473767l9449n5604j73576j41020j67099j45730l5454l0869m4007L7500
18886A678459J44593J15045K19438J55808o6904j06904j10388j59445k06407k3222
18876A640073k0041J14279M9330P6440O0724J0202o4758k509K03682R9485J20335
18865B287242K47055N04779O34939J009284J196009P20326J19978m62295o16283
18856E641034n63265l83749k49076j52499q449K18311K54465K00347J27592K16192
18846E300903J38559Q4773N0262O2088P2287J00068J61090R7289J55344M29250
18836F651913O56044O57124Q71025J132111J682978K498239L660009N841465R873848
18827C3524756J6633480K1763815K0189956J6632092R247796P24752q242644j5387764
$$ plain form
18819 95086239 81527009 72366657 67862996 67603096 72042037 83851706 103850752 125691262
18811 125691262 142787454 147860800 140530089 124792337 105476972 89263269 77258730
18804 77258730 68396444 61608043 55908822 51074591 47086983 44059426 41607488 39467896
18796 39467896 37730474 36560500 35837157 35553725 35537535 35864103 36743118 38688266 41953715
18787 41953715 47386005 56586034 73284207 102910881 142367848 175263829 194098059
18780 194098059 195128548 187165882 176259067 165093669 164279314 176677064 190262817
18773 190262817 194251966 185239842 175420703 180081017 201912909 231298268 255731035
18766 255731035 264742812 266992780 264058133 255175450 240329454 222820661 207808239
$$ packed form
18819I5086239j3559230r160352m503661k59900M438941J1809669J9999046K1840510
18811A25691262J7096192N073346p330711j5737752j9315365j6213703j2004539
18804G7258730q862286o788401n699221m834231l987608l027557k451938k139592
18796C9467896j737422j169974p23343k83432j6190L26568Q79015J945148L265449
18787D1953715N432290R200029J6698173K9626674L9456967L2895981J8834230
18780A94098059J030489p962666j0906815j1165398q14355J2397750J3585753
18773A90262817L989149r012124r819139M660314K1831892K9385359K4432767
18766B55731035R011777K249968k934647q882683j4845996j7508793j5012422
$$ plain form
18759 207808239 191395199 170763439 148334136 129405681 114964259 104208389 95592822
18752 95592822 88178327 82057871 77109247 72905327 69314236 66685961 65120152 64661931
18744 64661931 65642510 68678213 75506767 88940567 110696763 136432412 160475536 175943337
18736 175943337 176627102 165576167 146040490 128285484 115827049 106776319 99263134
18729 99263134 92458024 87598136 85811008 88602678 98344864 118579122 147013918 172218159
18721 172218159 189251037 193779709 187154467 170988166 146851785 124563859 107117332
18714 107117332 94058223 84236244 75993179 68850462 62709207 57666631 53420626 49890742
18706 49890742 46936429 44354289 42307394 40565715 38922550 37164736 35454292 33890338
$$ packed form
18759B07808239j6413040k0631760k2429303j8928455j4441422j0755870q615567
18752I5592822p414495o120456m948624m203920l591091k628275j565809m58221
18744F4661931R80579L035703O828554J3433800K1756196K5735649K4043124J5467801
18736A75943337O83765j1050935j9535677j7755006j2458435r050730p513185
18729I9263134o805110m859888j787128K791670R742186K0234258K8434796K5204241
18721A72218159J7032878M528672o625242j6166301k4136381k2287926j7446527
18714A07117332j3059109r821979q243065p142717o141255n042576m246005l529884
18706D9890742k954313k582140k046895j741679j643165j757814j710444j563954
$$ plain form
18698 33890338 32644342 31458037 30515128 29968100 29505809 29050593 28677234 28519662 28998859
18689 28998859 30099747 31002185 30901794 29382567 27278266 25508381 24149351 22882559
18681 22882559 21883844 21120495 20322612 19531275 18878149 18093122 17417720 16945041 16459667
18672 16459667 16078542 15752737 15460689 15184194 14813875 14398102 13967871 13531319 13155009
18663 13155009 12899796 12654492 12577421 12621037 12762775 12840240 12649685 12399945 12079805 11610474
18653 11610474 10952330 10646548 10323013 9989009 9769400 9488531 9247829 9059071 8909049
18644 8909049 8775861 8509165 8355104 8235031 8095486 8037739 7904306 7851362 7666117 7397152
18634 7397152 7288292 7140320 6905743 6698821 6583859 6558575 6451608 6376213 6453615 6464169
$$ packed form
18698C3890338j245996j186305r42909n47028m62291m55216l73359j57572M79197
18689B8998859J100888R02438j00391j519227k104301j769885j359030j266792
18681B2882559r98715p63349p97883p91337o53126p85027o75402m72679m85374
18672A6459667l81125l25805k92048k76495l70319m15773m30231m36552l76310
18663A3155009k55213k45304p7071M3616J41738P7465j90555k49740l20140m69331
18653A1610474o58144l05782l23535l34004k19609k80869k40702j88758j50022
18644H909049j33188k66696j54061j20073j39545n7747j33433n2944j85245k68965
18634G397152j08860j47972k34577k06922j14962k5284j06967p5395P7402J0554
$$ plain form
18624 6464169 6276714 6185615 5992690 5692606 5460745 5308175 5252541 5281707 5147573 4992444
18614 4992444 4843480 4771840 4724791 4734279 4828965 4860687 4828872 4702828 4394797 4316810 4205452
18603 4205452 3998426 4091950 4251629 4203677 4147239 3991672 3861240 3867498 3931929 3919153 3773484
18592 3773484 3703013 3644028 3471077 3305242 3258707 3270358 3183868 2979772 2804502 2759481
18582 2759481 2693618 2806910 2930965 3086205 3294841 3537258 3641066 3484653 3217227 2954951
18572 2954951 2914969 2867072 2771472 2918961 3077513 3300948 3463424 3390989 3229462 3182843
18562 3182843 3086700 2813248 2637078 2761511 2695352 2505489 2388944 2403889 2335798 2224018
18552 2224018 2157636 2103379 2183574 2177934 2103499 2011165 1910675 2036587 2324877 2670368 3000642
$$ packed form
18624F464169j87455r1099j92925l00084k31861j52570n5634K9166j34134j55129
18614D992444j48964p1640m7049R488R4686L1722l1815j26044l08031p7987j11358
18603D205452k07026R3524J59679m7952n6438j55567j30432O258O4431j2776j45669
18592C773484p0471n8985j72951j65835m6535J1651q6490k04096j75270m5021
18582B759481o5863J13292J24055J55240K08636K42417J03808j56413k67426k62276
18572B954951l9982m7897r5600J47489J58552K23435J62476p2435j61527m6619
18562C182843r6143k73452j76170J24433o6159j89863j16545J4945o8091j11780
18552B224018o6382n4257Q0195n640p4435r2334j00490J25912K88290L45491L30274
$$ plain form
18541 3000642 3174429 3385716 3626845 3926710 4201435 4285965 4246058 4081773 3873612 3718259
18531 3718259 3644088 3741934 4064917 4629337 5252049 5407204 5193754 4941999 4856929 4950399
18521 4950399 4902734 4565929 4264377 3916889 3748714 3545018 3530067 3540498 3453659 3264905
18511 3264905 3195960 3242704 3303478 3390743 3591678 3839208 4025446 4096019 4325569 4759694
18501 4759694 5338619 6230744 7666088 10057518 14483690 22014467 31414188 37727621
18493 37727621 38442390 33550058 27836757 23598306 20943329 19758306 19291512 19397712
18485 19397712 20302593 22772815 28278677 38711283 52023834 60675553 61011918 52588184
18477 52588184 42803720 35266059 30427186 27148774 24532336 22354225 20364912 18657000
$$ packed form
18541C000642J73787K11287K41129K99865K74725Q4530l9907j64285k08161j55353
18531C718259p4171R7846L22983N64420O22712J55155k13450k51755q5070R3470
18521D950399m7665l36805l01552l47488j68175k03696j4951J0431q6839j88754
18511C264905o8945M6744O0774Q7265K00935K47530J86238P0573K29550M34125
18501D759694N78925Q92125J435344K391430M426172P530777R399721O313433
18493C7727621P14769m892332n713301m238451k654977j185023m66794J06200
18485A9397712R04881K470222N505862J0432606J3312551Q651719L36365q423734
18477E2588184r784464p537661m838873l278412k616438k178111j989313j707912
$$ plain form
18469 18657000 17127363 15814260 14902004 14245048 13744638 13426921 13215095 13113532 13172500
18460 13172500 13412263 13725879 14163421 14835386 15784634 17216426 19261378 22209157 26753374
18451 26753374 33740667 45189885 65023824 97414734 134594188 157199214 156294848
18444 156294848 134473530 110565328 92704996 81646910 75245015 70979976 68497696
18437 68497696 68986806 74256469 87851459 113626479 145534181 166076631 165420952 144374435
18429 144374435 119575793 100316304 87668474 79680173 73947075 69492117 66664030
18422 66664030 65925913 68000308 74780339 89571120 116627090 152190686 177783929 181987321
18414 181987321 163119695 138370410 118892892 106323140 99236441 95852211 96387244
$$ packed form
18469A8657000j529637j313103r12256o56956n00410l17717k11826j01563N8968
18460A3172500K39763L13616M37542O71965R49248J431792K044952K947779M544217
18451B6753374O987293J1449218J9833939L2390910L7179454K2605026r04366
18444A56294848k1821318k3908202j7860332j1058086o401895m265039k482280
18437F8497696M89110N269663J3594990K5775020L1907702K0542450o55679k1046517
18429A44374435k4798642j9259489j2647830p988301n733098m454958k828087
18422F6664030p38117K074395O780031J4790781K7055970L5563596K5593243M203392
18414A81987321j8867626k4749285j9477518j2569752p086699l384230N35033
$$ plain form
18407 96387244 103137197 120272886 153743650 200144577 243805195 277769173 293192462
18400 293192462 287992757 263238743 223376647 186670349 158613415 138368891 123643108
18393 123643108 111889107 102289882 95008095 89854751 87235453 88183607 94539400 109570859
18385 109570859 133162475 153362513 159237604 147131910 126838826 109507228 97545517
18378 97545517 90008826 85048612 81997530 81556948 85094998 95398125 115864589 143192770
18370 143192770 165169188 173649706 163855487 147046904 129848363 117548651 111805850
18363 111805850 113218413 124507261 145320239 163056219 166306738 151570814 128752229
18356 128752229 109270474 95543417 87043659 80955224 74969791 68782175 62596954 57218888
$$ packed form
18407I6387244O749953J7135689L3470764M6400927M3660618L3963978J5423289
18400B93192462n199705k4754014l9862096l6706298k8056934k0244524j4725783
18393A23643108j1754001r599225p281787n153344k619298R48154O355793J5031459
18385A09570859K3591616K0200038N875091j2105694k0293084j7331598j1961711
18378I7545517p536691m960214l051082m40582L538050J0303127K0466464K7328181
18370A43192770K1976418Q480518r794219j6808583j7198541j2299712n742801
18363A11805850J412563J1288848K0812978J7735980L250519j4735924k2818585
18356A28752229j9481755j3727057q499758o088435n985433o187616o185221n378066
$$ plain form
18348 57218888 52774497 49280762 46339907 43581590 41249264 39181597 37359646 35692592
18340 35692592 34101017 32850933 31741919 30824249 30108319 29405712 28817865 28475876 28077357
18331 28077357 27857213 27768570 27618082 27727735 28456225 30409515 34687188 42530468 51724581
18322 51724581 57293393 56718303 50564379 44115685 39522593 36891618 35608076 35650182
18314 35650182 37800513 42060150 45334140 45247540 41150888 35841141 31455036 28290096
18306 28290096 26116453 24457011 22946488 21484650 20094127 18957020 17967594 17276143
18298 17276143 16852018 16502443 16023967 15513740 14816806 14282129 13778023 13365123 13153736
18289 13153736 12759913 12266217 11898609 11564795 11187665 11049580 10960312 10888957 10895686 10880152
$$ packed form
18348E7218888m444391l493735k940855k758317k332326k067667j821951j667054
18340C5692592j591575j250084j109014r17670p15930p02607n87847l41989l98519
18331B8077357k20144q8643j50488J09653P28490J953290M277673P843280R194113
18322E1724581N568812n75090o153924o448694m593092k630975j283542M2106
18314C5650182K150331M259637L273990q6600m096652n309747m386105l164940
18306B8290096k173643j659442j510523j461838j390523j137107r89426o91451
18298A7276143m24125l49575m78476n10227o96934n34677n04106m12900k11387
18289A3153736l93823m93696l67608l33814l77130j38085q9268p1355O729j5534
$$ plain form
18279 10880152 10671701 10332474 10054242 9850229 9492361 9103094 8807036 8597923 8438513
18270 8438513 8333045 8353587 8377684 8258011 7964051 7611885 7307073 7230528 7152316 6898801
18260 6898801 6769831 6769241 6690509 6580869 6366410 6171286 5886989 5698408 5541867 5450023
18250 5450023 5411735 5262384 5251663 5301488 5414528 5551583 5638888 5746071 5743473 5611602
18240 5611602 5555649 5339293 5002134 4801475 4808239 4754005 4677724 4561469 4526809 4536970 4588943
18229 4588943 4685919 4675595 4394639 4148311 3849946 3634336 3588313 3605609 3637450 3740995
18219 3740995 3835514 3891888 3877714 3763836 3559213 3315121 3094665 2832904 2636661 2620848
18209 2620848 2621107 2616117 2616796 2713078 2597257 2463769 2369401 2400375 2546759 2478097 2416036 2395227
$$ packed form
18279A0880152k08451l39227k78232k04013l57868l89267k96058k09113j59410
18270H438513j05468K0542K4097j19673k93960l52166l04812p6545p8212k53515
18260F898801j28970n90p8732j09640k14459j95124k84297j88581j56541r1844
18250E450023l8288j49351j0721M9825J13040J37055Q7305J07183k598j31871
18240E611602n5953k16356l37159k00659O764n4234p6281j16255l4660J0161N1973
18229D588943R6976j0324k80956k46328k98365k15610m6023J7296L1841J03545
18219C740995R4519N6374j4174j13878k04623k44092k20456k61761j96243j5813
18209B620848K59m990O79R6282j15821j33488r4368L0974J46384o8662o2061k0809
$$ plain form
18197 2395227 2351210 2217756 2056213 1839109 1773971 1748982 1712285 1725815 1671359 1567699
18187 1567699 1562497 1610036 1818337 2019482 2085687 2023087 1811102 1789269 1863165 1758317 1641733
18176 1641733 1586074 1583725 1405950 1203131 1129117 1123874 1112312 1001407 913559 898710 847537
18165 847537 834425 1043981 1128824 1057101 1074722 1063167 967685 909986 984522 962007 980901
18154 980901 890188 793557 768232 761252 769978 849461 876633 904790 1113332 1140072 1180113 1093968
18142 1093968 1066640 1100847 1098025 1010824 955109 1005203 1001474 960851 830438 886273 936448
18131 936448 919117 1015392 1143538 1190294 1252108 1267104 1372754 1594316 1733362 1776530 2068851
18120 2068851 2399423 2814612 3146817 3582236 4345109 5309816 6530557 8258669 10945230
$$ packed form
18197B395227m4017j33454j61543k17104o5138k4989l6697J3530n4456j03660
18187A567699n202M7539K08301K01145O6205o2600k11985k1833P3896j04848j16584
18176A641733n5659k349j77775k02819p4014n243j1562j10905q7848j4849n1173
18165H47537j3112K09556Q4843p1723J7621j1555r5482n7699P4536k2515J8894
18154I80901r0713r6631k5325o980Q726P9483K7172K8157K08542K6740M0041q6145
18142A093968k7328L4207k822q7201n5715N0094l729m0623j30413N5835N0175
18131I36448j7331R6275J28146M6756O1814J4996J05650K21562J39046M3168K92321
18120B068851L30572M15189L32205M35419P62873R64707J220741J728112K686561
$$ plain form
18111 10945230 15220220 22527749 36431152 62612879 96709319 118673803 119884991
18104 119884991 98858284 75967644 59337017 48858514 42200533 36696234 31683483
18097 31683483 27441316 23824108 20904441 18446409 16355370 14661419 13207487 11919995
18089 11919995 10974376 10218025 9553532 8974387 8446533 7924516 7419518 7097900 6750305
18080 6750305 6378132 6034647 5808732 5719871 5606572 5401269 5263352 4979870 4719283 4473201
18070 4473201 4365823 4263829 4183566 4099873 4031345 3859686 3522843 3380619 3395131 3446210
18060 3446210 3254502 3175809 3160973 3100380 3161122 3112822 2975636 2838746 2700473 2563512
18050 2563512 2461292 2367113 2276795 2041031 2014395 2057256 2035244 1893105 1874380 1777342 1763293
$$ packed form
18111A0945230M274990P307529J3903403K6181727L4096440K1964484J211188
18104A19884991k1026707k2890640j6630627j0478503o657981n504299n012751
18097C1683483m242167l617208k919667k458032k091039j693951j453932j287492
18089A1919995r45619p56351o64493n79145n27854n22017n04998l21618l47595
18080F750305l72173l43485k25915q8861j13299k05303j37917k83482k60587k46082
18070D473201j07378j01994q0263q3693o8528j71659l36843j42224J4512N1079
18060C446210j91708p8693j4836o0593O0742m8300j37186j36890j38273j36961
18050B563512j02220r4179r0318k35764k6636M2861k2012j42139j8725r7038j4049
$$ plain form
18039 1763293 1751254 1653676 1635188 1553442 1557686 1622885 1564662 1621588 1649922 1402856 1256728
18028 1256728 1269824 1361321 1388654 1232895 1130778 1158460 1090745 1050637 1080429 1168343 1166793
18017 1166793 1089756 1025850 979258 836497 746962 723335 706031 692582 669083 751088 831917
18006 831917 965550 942009 885648 795594 750246 714189 745841 739989 628584 577910 583060
17995 583060 520919 388043 337636 324394 248084 127565 241379 396174 437187 453747 409494
17984 409494 485697 524065 552169 555986 563741 633334 507599 299770 248889 270179 317639
17973 317639 361949 177262 276411 376055 379280 453660 384932 388328 432160 410884 525363
17962 525363 604180 599829 498102 542674 614169 666914 733363 745000 726763 830862 869571
$$ packed form
18039A763293j2039r7578j8488q1746M244O5199n8223N6926K8334k47066j46128
18028A256728J3096R1497K7333j55759j02117K7682o7715m0108K9792Q7914j550
18017A166793p7037o3906m6592j42761q9535k3627j7304j3449k3499Q2005Q0829
18006H31917J33633k3541n6361r0054m5348l6057L1652n852j11405n0674N150
17995E83060o2141j32876n0407j3242p6310j20519J13814J54795M1013J6560m4253
17984D09494P6203L8368K8104L817P755O9593j25735k07829n0881K1290M7460
17973C17639M4310j84687R9149R9644L225P4380o8728L396M3832k1276J14479
17962E25363P8817m351j01727M4572P1495N2745O6449J1637j8237J04099L8709
$$ plain form
17951 869571 732006 610488 534331 437530 423737 447575 373724 286620 160795 132358 111086
17940 111086 78451 100999 238496 346282 265826 308549 289198 192418 224123 241001 185577
17929 185577 142982 182081 344483 385575 412668 316448 252635 220030 264457 269946 323933
17918 323933 419065 303387 339762 517467 530625 470942 400581 651549 823247 812456 697677
17907 697677 661431 646123 748534 788461 809232 833973 827001 947539 1134250 1064205 986358
17896 986358 855536 776551 674953 704076 731333 714772 742077 667499 644118 533414 367931
17885 367931 331649 257432 75157 50951 60789 32505 204130 258943 302743 269573 181754
17874 181754 185267 168837 271081 208617 -9619 9334 46334 145062 208526 309513 428996
$$ packed form
17951H69571j37565j21518p6157r6801j3793K3838p3851q7104j25825k8437k1272
17940A11086l2635K2548J37497J07786q0456M2723j9351r6780L1705J6878n5424
17929A85577m2595L9099J62402M1092K7093r6220o3813l2605M4427N489N3987
17918C23933R5132j15678L6375J77705J3158n9683p0361K50968J71698j0791j14779
17907F97677l6246j5308J02411L9927K0771K4741o972J20538J86711p0045p7847
17896I86358j30822p8985j01598K9123K7257j6561K7305p4578k3381j10704j65483
17885C67931l6282p4217j82275k4206R838k8284J71625N4813M3800l3170q7819
17874A81754L513j6430J02244o2464k18236J8953L7000R8728O3464J00987J19483
$$ plain form
17863 428996 512543 649502 508738 358984 372304 352098 309255 356688 407429 513031 757429
17852 757429 951242 1157512 1294157 1280291 1199844 1072046 987176 960327 1085186 1196942
17842 1196942 1273413 1317737 1272986 1138029 880202 733134 704780 538060 453701 497597
17832 497597 418799 325477 219426 138353 148206 113270 98779 154958 148903 97445 91239 141907
17820 141907 251875 373109 373423 240250 111636 55545 47578 -33065 -46677 -17857 22326
17809 22326 69870 64503 137611 203308 219969 187968 115051 140394 200204 329470 355169 358431
17797 358431 336517 241574 197505 353363 331108 166835 189490 255968 196879 96547 61981
17786 61981 84052 76375 -35334 -110429 -57352 -103816 -120216 11748 59468 55210 37515 -94954
$$ packed form
17863D28996Q3547J36959j40764j49754J3320k0206m2843M7433N0741J05602K44398
17852G57429J93813K06270J36645j3866q0447j27798q4870k6849J24859J11756
17842A196942P6471M4324m4751j34957k57827j47068k8354j66720q4359M3896
17832D97597p8798r3322j06051q1073R853l4936j4491N6179o055n1458o206N0668
17820A41907J09968J21234L14j33173j28614n6091p967q0643j3612K8820M0183
17809B2326M7544n367P3108O5697J6661l2001p2917K5343N9810J29266K5699L262
17797C58431k1914r4943m4069J55858k2255j64273K2655O6478n9089j00332l4566
17786F1981K2071p677j11709p5095N3077m6464j6400J31964M7720m258j7695j32469
$$ plain form
17774 -94954 -112173 -150406 -63715 -315 93248 113063 69744 -42686 -199212 -161721 -126865
17763 -126865 -104540 -16850 87456 88781 74702 45002 94334 105121 7348 -42775 4692
17752 4692 47364 66925 142544 25618 88033 157661 -50440 -67198 16608 21566 -616 -3936
17740 -3936 44344 107072 111948 -14646 -52171 -166265 -218922 -321165 -180239 -149956 -215611
17729 -215611 -152916 -58071 31194 115029 114286 123937 -4183 -77342 -151100 -95441 -102975 -82146
17717 -82146 -45401 -70654 2486 32914 1770 -52031 -7683 7853 -52594 -127612 -141206 -129408
17705 -129408 -90781 -86224 -93649 -4692 77964 52301 -8557 20258 -95077 -176245 -167153 -159795
17693 -159795 -111143 -136647 -195991 -239446 -177659 -160261 -199094 -177065 -185029 -161610 -247103 -291263
$$ packed form
17774i4954j7219l8233Q6691O3400R3563J9815m3319j12430j56526L7491L4856
17763a26865K2325Q7690J04306J325j4079k9700M9332J0787r7773n0123M7467
17752D692M2672J9561P5619j16926O2415O9628k08101j6758Q3806M958k2182l320
17740c936M8280O2728M876j26594l7525j14094n2657j02243J40926L0283o5655
17729b15611O2695R4845Q9265Q3835p43R651j28120p3159p3758N5659p534K0829
17717h2146L6745k5253P3140L0428l1144n3801M4348J5536o0447p5018j3594J1798
17705a29408L8627M557p425Q8957Q2656k5663o0858K8815j15335q1168R092P358
17693a59795M8652k5504n9344m3455O1787J7398l8833K2029p964K3419q5493m4160
$$ plain form
17681 -291263 -280086 -346110 -347978 -352526 -303901 -180796 -107744 -107493 -139042 -215012 -289530 -223344
17669 -223344 -136058 -119118 -103912 -157484 -187146 -161651 -176974 -127815 -119548 -167652 -205362 -317898
17657 -317898 -335993 -204171 -123523 32444 48706 -24931 12111 58416 -34683 -30489 -47070
17646 -47070 -81036 -99623 -111834 -31602 84101 -62082 -159273 -167914 -146123 -55344 8053
17635 8053 -50138 -90595 -185369 -224616 -256767 -73725 18738 -109470 -31712 -28924 -12178 52623
17623 52623 71961 73236 57470 -29245 -25921 -59777 -88811 -101338 52106 56745 -25047 -16210
17611 -16210 -58798 -63667 46520 184873 71498 -62739 -122652 -131824 -217607 -216768 -273371 -221627
17599 -221627 -141705 -161563 -230756 -217419 -204816 -164781 -99661 -7463 -47408 -64211 -18036
$$ packed form
17681b91263J1177o6024j868m548M8625J23105P3052K51l1549p5970p4518O6186
17669b23344Q7286J6940J5206n3572k9662K5495j5323M9159Q267m8104l7710j12536
17657c17898j8095J31822Q0648J55967J6262p3637L7042M6305r3099M194j6581
17646d7070l3966j8587j2211Q0232J15703j46183r7191q641K1791R0779O3397
17635H053n8191m0457r4774l9247l2151J83042R2463j28208P7758K788J6746O4801
17623E2623J9338J275j5766q6715L324l3856k9034j2527J53444M639q1792Q837
17611a6210m2588m869J10187J38353j13375j34237n9913r172q5783Q39n6603N1744
17599b21627P9922j9858o9193J3337J2603M0035O5120R2198l9945j6803M6175
$$ plain form
17588 -18036 -90395 -173163 -155059 -173754 -53738 98795 75939 -16488 45532 -5743 -84784
17577 -84784 -139404 -209419 -209663 -131995 -184140 -123563 -49611 -7446 10079 -1198 -45942 -105664
17565 -105664 -203003 -272045 -203931 -146695 -131044 -106682 -67725 -20401 9662 84486 164975
17554 164975 35815 -12031 8852 25863 -69705 -49542 -90406 -51092 -7869 -3162 49774
17543 49774 -102085 -105620 -57733 -4913 43776 70603 -68291 -198351 -223765 -176383 -132168
17532 -132168 2050 119541 -31979 -181969 -51327 -125706 -144645 -59601 -92808 -103930
17522 -103930 -31239 -28039 -19386 17987 -8681 -76443 -67927 22580 72686 59099 -39876 -98735
17510 -98735 -55902 -56832 -55472 -54599 -73633 -65717 -110673 -233333 -260215 -291798 -183515 -64708
$$ packed form
17588a8036p2359q2768J8104j8695J20016J52533k2856r2427O2020n1275p9041
17577h4784n4620p0015k44P7668n2145O0577P3952M2165J7525j1277m4744n9722
17565a05664r7339o9042O8114N7236J5651K4362L8957M7324L0063P4824Q0489
17554A64975j29160m7846K0883J7011r5568K0163m0864L9314M3223M707N2936
17543D9774j51859l535M7887N2820M8689K6827j38894j30060k5414M7382M4215
17532a32168J34218J17491j51520j49990J30642p4379j8939Q5044l3207j1122
17522a03930P2691L200Q653L7373k6668o7762Q516R0507N0106j3587r8975n8859
17510i8735M2833r30J360Q73j9034P916m4956j22660k6882l1583J08283J18807
$$ plain form
17498 -64708 -145839 -188554 -123623 -95180 -112793 -95608 -37015 -10406 -34597 -138205 -226257
17487 -226257 -177921 -139003 -69136 6432 -11449 4993 -40098 -145605 -136291 -52361 -34507
17476 -34507 -241979 -305110 -258293 -150324 -67156 -163742 -306003 -157240 -97710 -151370 -162962
17465 -162962 -95186 2478 87643 -2233 -91414 -181973 -86373 -46766 -133797 -152084 -137837
17454 -137837 -108804 -216561 -178818 -48620 46708 -30557 -86787 -41549 -46673 -86804 -35845
17443 -35845 101549 257048 280499 346154 445426 392874 254259 177471 148014 104304 73570
17432 73570 36807 -96650 -183173 -167274 -80417 -97396 -68682 -74037 -34395 -64732 -68815 -91533
17420 -91533 43767 62031 70797 84745 -3133 -111923 -227596 -308594 -263146 -296275 -273864
$$ packed form
17498f4708q1131m2715O4931K8443j7613J7185N8593K6609k4191j03608q8052
17487b26257M8336L8918O9867P5568j7881J6442m5091j05507R314Q3930J7854
17476c4507k07472o3131M6817J07969Q3168r6586j42261J48763N9530n3660j1592
17465a62962O7776R7664Q5165q9876q9181r0559R5600L9607q7031j8287J4247
17454a37837K9033j07757L7743J30198R5328p7265n6230M5238n124m0131N0959
17443c5845J37394J55499K3451O5655R9272n2552j38615p6788k9457m3710l0734
17432G3570l6763j33457q6523J5899Q6857j6979K8714n355L9642l0337m083k2718
17420i1533J35300J8264Q766J3948q7878j08790j15673q0998M5448l3129K2411
$$ plain form
17409 -273864 -143567 -92791 48731 83037 -20993 11448 75352 59470 38409 -37941 -69743
17398 -69743 65092 67798 1145 -35034 -112643 -68394 -136085 -157259 -137807 -182115 -126633 -69158
17386 -69158 -83535 -158032 -121614 -131056 -133032 -93070 -151709 -145989 -43691 -85034 -184988 -199228
17374 -199228 -108968 -40135 -5201 -76929 -202460 -179690 -151683 -199002 -195213 -273150 -367458
17363 -367458 -249681 -254732 -350549 -374161 -333251 -267909 -217455 -136741 -86736 -69679 -74703 -109374
17351 -109374 -129557 -95410 -4671 -13725 -51467 -192249 -88238 474 86930 139743 141334
17340 141334 121368 33986 -2483 -77733 -173920 -79494 -146834 -160174 -133612 -134710 -6273
17329 -6273 45156 17972 -17638 877 86924 -10400 -98342 -72446 -102772 -161756 -134627 -129991
$$ packed form
17409b73864J30297N0776J41522L4306j04030L2441O3904j5882k1061p6350l1802
17398f9743J34835K706o6653l6179p7609M4249o7691k1174J9452m4308N5482N7475
17386f9158j4377p4497L6418r442j976L9962n8639N720J02298m1343r9954j4240
17374a99228R0260O8833L4934p1728j25531K2770K8007m7319L789p7937r4308
17363c67458J17777n051r5817k3612M0910O5342N0454Q0714N0005J7057n024l4671
17351a09374k0183L4147R0739r054l7742j40782J04011Q8712Q6456N2813J591
17340A41334j9966q7382l6469p5250r6187R4426o7340j3340K6562j098J28437
17329f273N1429k7184l5610J8515Q6047r7324q7942K5896l0326n8984K7129M636
$$ plain form
17317 -129991 21313 22356 32799 27741 32337 108523 20808 -64547 -23483 -90702 -100933 -133413
17305 -133413 6781 -59265 -91488 -23670 -36907 -193264 -386511 -371186 -260111 -163766 -38977
17294 -38977 -122310 -266443 -276424 -299467 -276495 -249540 -244854 -172609 -103875 -76519 -76771 -44473
17282 -44473 34538 126931 133541 43196 10835 -47686 -106025 -168714 -119893 -43678 -53856 -99640
17270 -99640 -168131 -314433 -420317 -336010 -179303 -121540 -171907 -171655 -152297 -66463 56718
17259 56718 104126 85598 113270 90430 1288 -124585 -107954 -120567 -122885 -98210 -164106 -227577
17247 -227577 -94639 -97890 -101207 5750 -6562 -75745 -131324 -62542 107817 99724 -98809
17236 -98809 -136552 -157230 -264772 -163572 -125859 -162843 -176816 -240974 -253958 -177170 -178829
$$ packed form
17317a29991J51304J043J0443n058M596P6186q7715q5355M1064o7219j0231l2480
17305a33413J40194o6046l2223O7818j3237j56357j93247J5325J11075R6345J24789
17294c8977q3333j44133r981k3043K2972K6955M686P2245O8734K7356k52L2298
17282d4473P9011R2393O610r0345l2361n8521n8339o2689M8821P6215j0178m5784
17270i9640o8491j46302j05884Q4307J56707N7763n0367K52J9358Q5834J23181
17259E6718M7408j8528K7672k2840q9142j25873J6631j2613k318K4675o5896o3471
17247b27577J32938l251l317J06957j2312o9183n5579O8782J70359q093j98533
17236i8809l7743k0678j07542J01200L7713l6984j3973o4158j2984P6788j659
$$ plain form
17225 -178829 -111420 -34202 -2370 59100 57182 -39904 -30362 -24770 42178 26210 -77304 -114529
17213 -114529 -130988 -95328 -92356 -40127 -28372 -30128 -104974 -126798 -148418 -19425 68880 -66023
17201 -66023 -85604 4910 -65226 17441 33207 7456 13875 2975 -60396 -36680 10993 35855
17189 35855 46143 34005 34644 65098 -94355 -108872 -63177 -43360 -8969 -41236 19748 28434
17177 28434 155501 249944 275809 11332 -113490 -103622 -103095 -59084 -90646 -105711 -19391 -15512
17165 -15512 -111367 -110697 -59313 13033 -42667 -33644 292 -15172 27114 136712 138660 168304
17153 168304 81851 62629 79980 77737 119453 79145 13985 18238 59324 100525 127639 26238
17141 26238 -27051 42629 -9323 -34127 -70289 -151154 -276408 -178922 -111488 -66502 2169
$$ packed form
17225a78829O7409P7218L1832O1470j918r7086R542N592O6948j5968j03514l7225
17213a14529j6459L5660K972N2229J1755j756p4846k1824k1620J28993Q8305j34903
17201f6023j9581R0514p0136Q2667J5766k5751O419j0900o3371K3716M7673K4862
17189C5855J0288j2138O39L0454j59453j4517M5695J9817L4391l2267O0984Q686
17177B8434J27067R4443K5865k64477j24822R868N27M4011l1562j5065Q6320L879
17165a5512r5855O70N1384P2346n5700R023L3936j5464M2286J09598J948K9644
17153A68304q6453j9222J7351k243M1716m0308o5160M253M1086M1201K7114j01401
17141B6238n3289O9680n1952k4804l6162q0865j25254R7486O7434M4986O8671
$$ plain form
17130 2169 71975 9282 -75868 43866 79051 27369 27271 15295 38950 56323 -41141 -165292
17118 -165292 -236178 -236953 -163901 -157530 -200336 -172210 -206513 -130426 -93247 3752 4505 -54269
17106 -54269 -102772 -42531 50685 -3758 37617 7797 -113581 -79560 -88221 -110062 -71189 4901
17094 4901 44625 -73350 -155802 -109854 -85962 7637 93401 134345 85623 57783 55484 74033
17082 74033 37114 -92326 -202722 -198145 -137655 -79702 -49231 -6720 -163099 -187777 -117643
17071 -117643 -115939 -143978 -73109 74668 112192 40277 -25959 13978 10144 686 -40999 -119252
17059 -119252 -63917 -9555 42081 47424 -86979 -156603 -25033 -52945 -42586 3308 100491
17048 100491 128124 145783 74061 24376 36336 -49352 3144 74322 58360 31634 -21143
$$ packed form
17130B169O9806o2693q5150J19734L5185n1682r8j1976K3655J7373r7464j24151
17118a65292p0886p75P3052O371m2806K8126l4303P6087L7179R6999P53n8774
17106e4269m8503O0241R3216n4443M1375k9820j21378L4021q661k1841L8873P6090
17094D901L9724j17975q2452M5948K3892R3599Q5764M0944m8722k7840k299J8549
17082G4033l6919j29440j10396M577O0490N7953L0471M2511j56379k4678P0134
17071a17643J704k8039P0869J47777L7524p1915o6236L9937l834r458m1685p8253
17059a19252N5335N4362N1636N343j34403o9624J31570k7912J0359M5894R7183
17048A00491K7633J7659p1722m9685J1960q5688N2496P1178j5962k6726n2777
$$ plain form
17037 -21143 -24506 -39496 -144848 -783 65834 73125 95813 145243 85113 -41276 -55691
17026 -55691 -76595 -122944 -115115 -161708 -123873 -141610 -65070 -44402 -30603 -20736 -41964 105680
17014 105680 178121 19838 -45814 45466 50882 -51696 -133137 -75528 -192159 -59394 -22067
17003 -22067 60604 195273 102019 84188 103110 93867 3994 -139686 -276706 -247212 -93048
16992 -93048 91918 153796 185280 133863 28598 -35565 -75808 -117863 -133672 -199979 -158379
16981 -158379 -153000 -89914 -60810 -120044 -169846 -101486 -78894 -11810 -43786 -30678 -3665 -27149
16969 -27149 -73459 -62792 542 2157 -49786 51342 34549 -21999 -55041 -57716 -57839 -76547
16957 -76547 -48063 -89677 43978 -7692 -90062 -64558 -48049 -73973 -45747 47296 116308
$$ packed form
17037b1143l363j4990j05352J44065O6617P291K2688M9430o0130j26389j4415
17026e5691k0904m6349P829m6593L7835j7737P6540K0668J3799R867k1228J47644
17014A05680P2441j58283o5652R1280N416j02578q1441N7609j16631J32765L7327
17003b2067Q2671J34669r3254j7831J8922r243q9873j43680j37020K9494J54164
16992i3048J84966O1878L1484n1417j05265o4163m0243m2055j5809o6307M1600
16981a58379N379O3086K9104n9234m9802O8360K2592O7084l1976J3108K7013k3484
16969b7149m6310J0667O3334J615n1943J01128j6793n6548l3042k675j23j8708
16957g6547K8484m1614J33655n1670q2370K5504J6509k5924K8226R3043O9012
$$ plain form
16946 116308 -74067 -199547 -176846 -129544 -104473 15255 52062 -2461 -78532 -15883 -29405
16935 -29405 -208199 -277397 -171717 -100130 10871 67767 79890 -114041 -142604 -103178 -31356
16924 -31356 -11741 60524 68662 54147 71381 -24008 -125352 -122177 -25382 72900 66768 -105564
16912 -105564 -220205 -79668 -7566 21197 3564 -57947 77032 49256 5424 -87833 -19214
16901 -19214 443 -26046 32960 79908 12273 13165 -46670 109524 55891 17981 25256 18238
16889 18238 -32212 -56389 -161471 -140383 -207288 -259984 -245939 -151896 -225946 -273582 -199062
16878 -199062 -262776 -210410 -134521 -90323 -191983 -211367 -82622 -73938 -113108 -197066 -210700
16867 -210700 -217404 -126718 -58243 -7422 -33851 -114785 -50930 66832 136065 -10305 -188490
$$ packed form
16946A16308j90375j25480K2701M7302K5071J19728L6807n4523p6071O2649j3522
16935b9405j78794o9198J05680P1587J11001N6896J2123j93931k8563L9426P1822
16924c1356J9615P2265Q138j4515J7234r5389j01344L175R6795R8282o132j72332
16912a05564j14641J40537P2102K8763j7633o1511J34979k7776m3832r3257O8619
16901a9214J9657k6489N9006M6948o7635Q92n9835J56194n3633l7910P275p018
16889A8238n0450k4177j05082K1088o6905n2696J4045R4043p4050m7636P4520
16878a99062o3714N2366P5889M4198j01660j9384J28745Q684l9170q3958j3634
16867b10700o704R0686O8475N0821k6429q0934O3855J17762O9233j46370j78185
$$ plain form
16856 -188490 -255240 -156036 -144324 -188714 -106967 -141715 -76279 -78705 -127860 -185256 -148684 -124287
16844 -124287 -99944 -191404 -180319 -69578 -26512 26760 109571 168693 195644 73605 76900
16833 76900 60302 85988 22783 27115 -53903 -161039 -222758 -119029 6940 123538 113084
16822 113084 107986 103747 -101183 -128349 -48640 -45519 -74836 -36032 31984 72781 132734 167586
16810 167586 31321 -102576 -128163 -185052 -218445 -241793 -240201 -354761 -335109 -307497 -169890
16799 -169890 988 -86957 -82069 -89090 -152834 -214444 -105903 35614 59672 30149 -25908
16788 -25908 -128002 -171175 -116290 -86582 -84810 -129196 -150352 -227272 -192767 -64069 63618
16777 63618 153640 168298 139895 121789 126439 111002 -70639 -141101 -156609 -49293 11868
$$ packed form
16856a88490o6750R9204J1712m4390Q1747l4748O5436k426m9155n7396L6572K4397
16844a24287K4343r1460J1085J10741M3066N3272Q2811N9122K6951j22039L295
16833G6900j6598K5686o3205M332q1018j07136o1719J03729J25969J16598j0454
16822A13084n098m239k04930k7166P9709L121k9317L8804O8016M0797N9953L4852
16810A67586j36265j33897k5587n6889l3393k3348J592j14560J9652K7612J37607
16799a69890J70878q7945M888p021o3744o1610J08541J41517K4058k9523n6057
16788b5908j02094m3173N4885K9708J772m4386k1156p6920L4505J28698J27687
16777F3618R0022J4658k8403j8106M650j5437j81641p0462j5508J07316O1161
$$ plain form
16766 11868 -18672 -69307 43097 68786 25731 -10152 -10721 -39146 -62983 -58383 -70200 9936
16754 9936 -9163 -84800 -93503 -86165 -100416 -173656 -135424 -34123 -30728 -77846 -71560 18384
16742 18384 13404 18916 65401 148986 185288 247091 156044 96385 31563 -59428 -94102 -126958
16730 -126958 -75039 37461 -29371 36697 43278 -32437 -16153 -1347 -51148 -105377 -138536
16719 -138536 -164701 -186949 -121258 -189159 -178536 -79316 -140258 -108298 47849 70328 -11286
16708 -11286 -96616 -109427 -198665 -234971 -105935 -16447 -18093 -136600 -222138 -140724 -27717
16697 -27717 48767 113520 103182 159003 111792 25413 136370 215120 145397 149991 213792 101758
16685 101758 71424 61413 21966 -115280 -219641 -193188 -173431 -211374 -177832 -7423 117914
$$ packed form
16766A1868l0540n0635J12404K5689m3055l5883n69k8425k3837M600j1817Q0136
16754I936j9099p5637q703P338j4251p3240L8232J01301L395m7118O286Q9944
16742A8384m980N512M6485Q3585L6302O1803r1047n9659o4822r0991l4674l2856
16730a26958N1919J12500o6832O6068O581p5715J6284J4806m9801n4229l3159
16719a38536k6165k2248O5691o7901J0623R9220o0942L1960J56147K2479q1614
16708a1286q5330j2811q9238l6306J29036Q9488j646j18507q5538Q1414J13007
16697b7717P6484O4753j0338N5821m7211q6379J10957P8750o9723M594O3801j12034
16685A01758l0334j0011l9447j37246j04361K6453J9757l7943L3542J70409J25337
$$ plain form
16674 117914 151417 -4603 -120896 -50220 -2181 -3056 -73091 -227462 -196949 -159539 -162948
16663 -162948 -158095 -123844 -210116 -154074 -42082 -128287 -179031 -100184 36171 10294 -60024
16652 -60024 1826 9627 -8438 19391 -54502 -29771 26778 134266 173432 205963 233902 271785
16640 271785 143513 109722 220169 122842 28089 89270 156441 115641 79373 -64078 -111807
16629 -111807 -83600 -116187 -183530 -122629 46497 16937 -43869 41660 213135 231954 162698
16618 162698 83870 -41830 -13515 117080 160587 141561 22039 -74013 -173196 -194374 -142783
16607 -142783 -166969 -96446 -55457 -79300 -52578 111409 287491 241166 43443 -65235 -68865
16596 -68865 -44355 -90862 -89408 -61031 -57641 -21516 17234 14405 146528 211139 248920 297150
$$ packed form
16674A17914L3503j56020j16293P0676M8039q75p0035j54371L0513L7410l409
16663a62948M853L4251q6272N6042J11992q6205n0744P8847J36355k5877p0318
16652f0024O1850P801j8065K7829p3893K4731N6549J07488L9166L2531K7939L7883
16640B71785j28272l3791J10447r7327r4753O1181O7171m0800l6268j43451m7729
16629a11807K8207l2587o7343O0901J69126k9560o0806Q5529J71475J8819o9256
16618A62698p8828j25700K8315J30595M3507j9026j19522r6052r9183k1178N1591
16607a42783k4186P0523M0989k3843K6722J63987J76082m6325j97723j08678l630
16596f8865K4510m6507J454K8377L390L6125L8750k829J32123O4611L7781M8230
$$ plain form
16584 297150 348524 443527 417806 336123 144231 75694 96791 162874 147495 23843 -33015
16573 -33015 29795 -118137 -19847 54754 13131 -15993 -78185 -133876 -23112 117687 163691
16562 163691 154785 8706 -16866 -53360 -142392 -105600 -87505 -79284 -105423 -39230 41468 -29475
16550 -29475 -64442 21303 124278 114037 7163 37136 3558 -97940 -33992 -58904 -111360
16539 -111360 -83877 -60919 -146770 -155403 -87596 -37750 92756 33473 -40161 5849 35509
16528 35509 55773 244606 167452 84843 67457 21603 10743 -3803 -67158 -62847 -56369 -67355
16516 -67355 -92908 -90463 -103483 24788 115544 46895 117032 85828 33997 23812 -25021 -47140
16504 -47140 -89820 -110491 -172528 -274356 -215878 -90427 -54523 -54735 -59777 59120 114648 125957
$$ packed form
16584B97150N1374R5003k5721q1683j91892o8537K1097O6083j5379j23652n6858
16573c3015O2810j47932R8290P4601m1623k9124o2192n5691J10764J40799M6004
16562A63691q906j46079k5572l6494q9032L6792J8095Q221k6139O6193Q0698p0943
16550b9475l4967Q5745J02975j0241j06874K9973l3578j01498O3948k4912n2456
16539a11360K7483K2958q5851q633O7807M9846J30506n9283p3634M6010K9660
16528C5509K0264J88833p7154q2609j7386m5854j0860j4546o3355M311O478j0986
16516f7355k5553K445j3020J28271R0756o8649P0137l1204n1831j0185m8833k2119
16504d7140m2680k0671o2037j01828N8478J25451L5904k12n042J18897N5528J1309
$$ plain form
16492 125957 -635 -113228 -134784 -43902 43500 117302 157229 152914 212622 107987 -15020
16481 -15020 45236 -26759 -7437 158037 145554 35351 -127357 -175203 -110360 -348 84374
16470 84374 38545 83539 204914 223961 67507 63359 109931 86725 44718 10197 -10429
16459 -10429 -59575 -27897 -63698 -76278 -109880 -153827 -238029 -209307 -59742 -130228 -316335
16448 -316335 -296005 -233601 -280617 -297777 -189962 -146900 -99186 -174813 -88630 -26423 -25065
16437 -25065 17394 -51083 -140991 -128726 61494 124332 96552 -20097 17572 12245 -48996
16426 -48996 -217104 -276239 -201881 -148384 -105053 -50658 15840 -14469 -96109 -161980 -105075
16415 -105075 -21910 9551 -57588 -85970 -92320 -165874 -247252 -161647 -17479 -14786 -41106 -48546
$$ packed form
16492A25957j26592j12593k1556R0882Q7402P3802L9927m315N9708j04635j23007
16481a5020O0256p1995J9322J65474j2483j10203j62708m7846O4843J10012Q4722
16470H4374m5829M4994J21375J9047j56454m148M6572k3206m2007l4521k0626
16459a0429m9146L1678l5801j2580l3602m3947q4202K8722J49565p0486j86107
16448c16335K0330O2404m7016j7160J07815M3062M7714p5627Q6183O2207J358
16437b5065M2459o8477q9908J2265J90220O2838k7780j16649L7669n327o1241
16426d8996j68108n9135P4358N3497M3331N4395O6498l0309q1640o5871N6905
16415a05075Q3165L1461o7139k8382o350p3554q1378Q5605J44168K693k6320p440
$$ plain form
16403 -48546 -141007 -183321 -26758 -8969 -41107 -75727 -64783 40736 16416 65331 54925
16392 54925 96563 250191 211102 218245 248718 173550 118013 40325 -28485 -4302 -31220 -143797
16380 -143797 -125648 -68992 -74037 -35308 -92070 -136072 -251484 -223305 -121134 -33073 -39411
16369 -39411 17915 -30676 -3624 5127 -48484 -18533 73964 55313 -2287 46540 110009 118864
16357 118864 185817 179293 191864 99639 -48721 -133521 -112819 25980 104228 189575 108767
16346 108767 154218 200547 66386 -22986 -29937 56035 133432 134326 98713 23652 53182 47071
16334 47071 4316 -27930 -52939 -89825 -87489 -183254 -251507 -113028 -59266 -112303 -117752 -66390
16322 -66390 41308 -44065 -15441 47344 57030 29248 -87282 -50119 34590 78244 11839
$$ packed form
16403d8546r2461m2314J56563J7789l2138l4620J0944J05519k4320M8915j0406
16392E4925M1638J53628l9089P143L0473p5168n5537p7688o8810K4183k6918j12577
16380a43797J8149N6656n045L8729n6762m4002j15412K8179J02171Q8061o338
16369c9411N7326m8591K7052Q751n3611K9951R2497j8651n7600M8827O3469Q855
16357A18864O6953o524J2571r2225j48360q4800K0702J38799P8248Q5347q0808
16346A08767M5451M6329j34161q9372o951Q5972P7397Q94l5613p5061K9530o111
16334D7071m2755l2246k5009l6886K336r5765o8253J38479N3762n3037n449N1362
16322f6390J07698q5373K8624O2785R686k7782j16530L7163Q4709M3654o6405
$$ plain form
16311 11839 -55757 39678 120804 76026 24629 36665 95167 94832 86506 178614 193484 58254
16299 58254 -3451 77344 152476 123388 34907 -898 12624 11195 -72283 -212961 -178273 -97940
16287 -97940 -33798 173075 47839 -56077 -61619 142224 225733 219753 359 24520 196494
16276 196494 119711 -42327 -53468 -71751 12626 -129033 -119162 -55407 -88415 -79976 -22309
16265 -22309 -1723 77141 133785 203971 133232 33069 -94067 -40261 -154845 -179568 -165579
16254 -165579 -164829 -109754 -74704 7229 39259 7675 -107907 -113432 36714 1451 -28141 62959
16242 62959 44317 -38776 -25727 -40596 -20506 99552 152194 105433 -34888 -32487 103254
16231 103254 243575 148352 2549 -107759 -133778 -135966 31242 6228 -115179 -156202 -257601
$$ packed form
16311A1839o7596R5435Q1126m4778n1397J2036N8502l35q326R2108J4870j35230
16299E8254o1705Q0795P5132k9088q8481l5805J3522j429q3478j40678L4688Q0333
16287i7940O4142K06873j25236j03916n542K03843Q3509n980k19394K4161J71974
16276A96494p6783j62038j1141j8283Q4377j41659R871O3755l3008Q439N7667
16265b2309K0586P8864N6644P0186p0739j00163j27136N3806j14584k4723J3989
16254a65579P50N5075L5050Q1933L2030l1584j15582n525J50146l5263k9592R1100
16242F2959j8642q3093J3049j4869K0090J20058N2642m6761j40321K401J35741
16231A03254J40321r5223j45803j10308k6019k188J67208k5014j21407m1023j01399
$$ plain form
16220 -257601 -238870 -102391 -58029 -7405 72683 21461 -21359 -5884 51160 110677 150779
16209 150779 47031 84358 91054 117504 86116 63756 -55100 -24830 -30596 -86631 -36619
16198 -36619 -9362 35049 -78995 -148590 -240891 -198839 -90570 -101476 -131120 -76579 -127657
16187 -127657 -126906 -72450 -160624 -108317 -118239 -68287 -12760 27924 -14280 -77578 -36962 -3799
16175 -3799 109977 167488 128073 184921 215994 182519 99181 -56938 -35039 70911 114120
16164 114120 75092 49614 -17091 -35541 -10380 7636 6928 -34353 -2588 6949 -25919 -22545
16152 -22545 -121942 -188837 -173980 -130695 -216225 -183889 -267651 -78498 139939 124530 53836
16141 53836 17049 5949 -49111 -165799 -82242 -44057 94473 136882 131768 88868 -9758
$$ packed form
16220b57601J8731J36479M4362N0624Q0088n1222m2820J5475N7044N9517M0102
16209A50779j03748L7327O696K6450l1388k2360j18856L0270n766n6035N0012
16198c6619K7257M4411j14044o9595r2301M2052J08269j0906k9644N4541n1078
16187a27657P51N4456q8174N2307r922M9952N5527M0684m2204o3298M0616L3163
16175c799J13776N7511l9415N6848L1073l3475q3338j56119K1899J05950M3209
16164A14120l9028k5478o6705j8450K5161J8016p08m1281L1765R537l2868L374
16152b2545r9397o6895J4857M3285q5530L2336q3762J89153K18437j5409p0694
16141E3836l6787j1100n5060j16688Q3557L8185J38530M2409n114m2900r8626
$$ plain form
16130 -9758 -101867 -60189 -91145 -57313 43941 97152 79234 52317 -39758 -28677 56823 13402
16118 13402 -38395 -41264 -69448 -50911 56737 52336 -17578 63696 118658 130146 107182 86743
16106 86743 23546 -33182 -27267 60440 15702 37327 67016 147422 91133 86213 250439 295125
16094 295125 233124 64344 -7911 19073 11493 -35335 -24988 -9189 -36168 -55230 65443
16083 65443 34222 31958 -45890 19957 84925 48901 -19684 -118826 -38579 -46606 -46517 -17755 -85675
16070 -85675 -208221 -110151 -55901 -108904 -32753 46510 2718 -93643 -72092 -20044 -48875
16059 -48875 -46886 140103 131649 58834 -14633 -115710 -113919 58465 141668 14706 -76845
16048 -76845 -165553 -26005 23616 88383 99681 52223 85943 105107 61703 -38907 -191989
$$ packed form
16130i758r2109M1678l0956L3832J01254N3211j7918k6917r2075J1081Q5500m3421
16118A3402n1797k869k8184J8537J07648m401o9914Q1274N4962J1488k2964k0439
16106H6743o3197n6728N915Q7707m4738K1625K9689Q0406n6289m920J64226M4686
16094B95125o2001j68780p2255K6984p580m6828J0347J5799k6979j9062J20673
16083F5443l1221k264p7848O5847O4968l6024o8585r9142Q0247q027Q9K8762o7920
16070h5675j22546R8070N4250n3003P6151P9263m3792r6361K1551N2048k8831
16059d8875J989J86989q454p2815p3467j01077J791J72384Q3203j26962r1551
16048g6845q8708J39548M9621O4767J1298m7458L3720J9164m3404j00610j53082
$$ plain form
16037 -191989 -248200 -255435 -103656 44735 112102 88718 188977 220106 202633 -8249 -236002
16026 -236002 -255193 -120371 51916 93644 144647 127120 64106 31265 102715 152593 4394
16015 4394 54102 116871 71772 9900 -133800 -156659 -212315 -189835 -163907 -222368 -233104 -277859
16003 -277859 -200304 -118101 -19699 139519 116652 13689 -61223 -78741 -123453 -64936 -166590
15992 -166590 -149968 -231314 -243253 -198776 -155277 21757 79200 99926 187788 236066 208572
15981 208572 182344 -9350 -104834 -87407 -178508 -256621 -251074 -159915 -123987 -106719 -128240
15970 -128240 -99575 -117539 -76449 -127552 -22483 71475 70836 35462 40987 160481 79435 122976
15958 122976 152986 116378 -14050 -163824 -70394 13820 2630 -63477 -55298 68212 100259
$$ packed form
16037a91989n6211p235J51779J48391O7367k3384J00259L1129j7473k10882k27753
16026b36002j9191J34822J72287M1728N1003j7527o3014l2841P1450M9878j48199
16015D394M9708O2769m5099o1872j43700k2859n5656K2480K5928n8461j0736m4755
16003b77859P7555Q2203R8402J59218k2867j02963p4912j7518m4712N8517j01654
15992a66590J6622q1346j1939M4477M3499J77034N7443K0726Q7862M8278k7494
15981B08572k6228j91694r5484J7427r1101p8113N547R1159L5928J7268k1521
15970a28240K8665j7964M1090n1103J05069R3958o39l5374N525J19494q1046M3541
15958A22976L0010l6608j30428j49774R3430Q4214j1190o6107Q179J23510L2047
$$ plain form
15947 100259 14951 -59193 -177807 -120216 48122 115505 118326 124907 -78083 -50803 26309
15936 26309 91440 59403 -71767 -135211 -133263 -58297 28664 62568 47818 76744 49208 -9443
15924 -9443 -56836 -32970 -42518 -23265 -44128 -81873 -154095 -76557 83329 34063 -48705 -12507
15912 -12507 -54269 -103060 -83705 -56247 -147165 -131896 -100065 -186053 -178197 -132520 -90987 33954
15900 33954 118230 19081 -60824 -84652 -117043 -132674 -189067 -194743 -98473 -1498 9089 -25130
15888 -25130 -96004 -91848 -111358 -56764 -24368 37333 45425 28476 -53473 -106302 -48350 -115081
15876 -115081 -157614 -48772 -8531 148474 109928 14700 8367 18433 149706 81260 89971
15865 89971 -83461 -100045 -91417 86921 147429 182547 82310 -18434 93917 91068 6283
$$ packed form
15947A00259q5308p4144j18614N7591J68338O7383K821O581k02990K7280P7112
15936B6309O5131l2037j31170o3444J948P4966Q6961L3904j4750K8926k7536n8651
15924i443m7393K3866r548J9253k0863l7745p2222P7538J59886m9266q2768L6198
15912a2507m1762m8791J9355K7458r0918J5269L1831q5988P856M5677M1533J24941
15900C3954Q4276r9149p9905k3828l2391j5631n6393n676R6270R6975J0587l4219
15888b5130p0874M156j9510N4594L2396O1701Q092j6949q1949n2829N7952o6731
15876a15081m2533J08842M0241J57005l8546r5228o333J0066J31273o8446Q711
15865H9971j73432j6584Q628J78338O0508L5118j00237j00744J12351k849q4785
$$ plain form
15854 6283 -94469 -105573 -86350 -89993 -90200 -109061 -38594 44950 74422 8519 -82436 -45279
15842 -45279 29562 97271 144329 153337 168655 116288 -7459 -41680 -11832 -39405 -78099 -39138
15830 -39138 -57225 -84201 -127374 -118899 14133 58750 28123 35202 27607 153364 16997 -55349
15818 -55349 -8492 126884 162279 76167 10254 -16582 4874 88053 123555 -66121 -161095
15807 -161095 -155319 -134371 -152477 -231385 -307965 -121740 3704 -94135 -139671 -52319 71322
15796 71322 153723 121647 53940 60834 -3666 -18581 17961 -66115 18588 67957 106615 108088
15784 108088 92646 44660 -33912 -116395 -90942 -59003 -67256 -27444 6034 112564 109515 121166
15772 121166 153521 117604 45001 -21349 -184153 -123872 -34613 -19516 69167 111255 197437
$$ packed form
15854F283j00752j1104J9223l643k07j8861P0467Q3544K9472o5903r0955L7157
15842d5279P4841O7709M7058R008J5318n2367j23747l4221K9848k7573l8694L8961
15830c9138j8087k6976m3173Q475J33032M4617l0627P079p595J25757j36367p2346
15818e5349M6857J35376L5395q6112o5913k6836K1456Q3179L5502j89676r4974
15807a61095N776K0948j8106p8908p6580J86225J25444r7839m5536Q7352J23641
15796G1322Q2401l2076o7707O894o4500j4915L6542q4076Q4703M9369L8658J473
15784A08088j5442m7986p8572q2483K5453L1939q253L9812L3478J06530l049J1651
15772A21166L2355l5917p2603o6350j62804O0281Q9259J5097Q8683M2088Q6182
$$ plain form
15761 197437 306626 203570 65624 -119598 -155735 -49034 -83293 -47065 -28444 -111679
15751 -111679 -153042 -128941 -49519 -73935 35539 48005 -31862 -97679 6963 88570 47056
15740 47056 -8763 -111846 -42897 -82302 -108457 -93400 180 10354 -45051 69345 147445
15729 147445 82835 -22110 53067 -18945 -80894 17029 111599 84501 170694 212796 132552
15718 132552 97221 121750 210677 379914 191599 118763 146669 136841 16683 -63439 47796
15707 47796 60808 96898 112218 219123 208822 203145 243770 120460 -3923 86972 103287
15696 103287 132707 220732 135698 41405 95030 219004 320926 311385 300023 170017 146489
15685 146489 127589 53487 39770 31735 1958 -28929 -1011 16247 38033 87355 46631 19682
$$ packed form
15761A97437J09189j03056j37946j85222l6137J06701l4259L6228J8621q3235
15751a11679m1363K4101P9422k4416J09474J2466p9867o5817J04642Q1607m1514
15740D7056n5819j03083O8949l9405k6155J5057R3580J0174n5405J14396P8100
15729A47445o4610j04945P5177p2012o1949R7923R4570k7098Q6193M2102q0244
15718A32552l5331K4529Q8927J69237j88315p2836K7906r828j20158q0122J11235
15707D7796J3012L6090J5320J06905j0301n677M0625j23310j24383R0895J6315
15696A03287K9420Q8025q5034r4293N3625J23974J01922r541j1362j30006k3528
15685A46489j8900p4102j3717q035k9777l0887K7918J7258K1786M9322m0724k6949
$$ plain form
15673 19682 24797 -26757 107656 204087 156966 33787 -52259 -29649 -14923 22356 32962
15662 32962 -73801 -131512 -113110 63446 200606 209447 201454 250334 251443 182618 62148
15651 62148 60254 94010 48845 76079 104129 82941 -30171 -68586 -65486 51158 235982
15640 235982 288094 173542 70332 98078 87887 48722 10739 -65406 -14552 63924 86276
15629 86276 103996 85908 31142 -104820 -190027 -152177 -11511 62609 -26816 29323 61397
15618 61397 150346 127295 153507 67480 -47039 -44231 -61998 -49565 -20500 -37180 -91399 -56562
15606 -56562 -80267 -95405 -131940 -137584 -107500 -81013 -49663 -54022 -57414 -77205 -170841 -185144
15594 -185144 -3140 65272 136850 49431 20015 -17238 -46104 -71408 -89842 -30257 -16373
$$ packed form
15673A9682N115n1554J34413R6431m7121j23179q6046K2610J4726L7279J0606
15662C2962j06763n7711J8402J76556J37160Q841p993M8880J109o8825j20470
15651F2148j894L3756m5165K7234K8050k1188j13112l8415L100J16644J84824
15640B35982N2112j14552j03210K7746j0191l9165l7983p6145N0854P8476K2352
15629H6276J7720j8088n4766j35962q5207L7850J40666P4120q9425N6139L2074
15618F1397Q8949k3051K6212q6027j14519K808j7767J2433K9065j6680n4219L4837
15606e6562k3705j5138l6535n644L0084K6487L1350m359l392j9791r3636j4303
15594a85144J82004O8412P1578q7419k9416l7253k8866k5304j8434N9585J3884
$$ plain form
15583 -16373 -51937 -90350 -203098 -152007 -106627 -130817 -91468 36015 108559 48855 -4567
15572 -4567 -98383 -79731 -30605 2736 28697 59581 53200 32379 -6475 -35033 -116665 -132872
15560 -132872 -153537 -147800 -73038 7842 4309 76709 95143 26972 25661 54546 -61957 -13084
15548 -13084 -9529 -107530 -131507 -111658 -101407 -108016 21389 62786 80530 30795 -126011 -31649
15536 -31649 36464 76805 202902 232529 226845 75964 14639 65886 123934 213128 232228
15525 232228 123765 -172239 -315489 -217876 -199924 -67382 -31356 -60088 -29392 -24489 -56310
15514 -56310 52987 102897 142873 89676 -20472 -42146 -17586 -45653 41195 9077 -38127
15503 -38127 57738 151628 170990 194662 223660 114789 -12816 -66229 73740 95371 89865
$$ packed form
15583a6373l5564l8413j12748N1091M5380k4190L9349J27483P2544n9704n3422
15572d567r3816J8652M9126L3341K5961L0884o381k0821l8854k8558q1632j6207
15560a32872k0665N737P4762Q0880l533P2400J8434o8171j311K8885j16503M8873
15548a3084L555r8001k3977J9849J0251o609J29405M1397J7744m9735j56806R4362
15536c1649O8113M0341J26097K9627n684j50881o1325N1247N8048Q9194J9100
15525B32228j08463k96004j43250R7613J7952J32542L6026k8732L0696M903l1821
15514e6310J09297M9910L9976n3197j10148k1674K4560k8067Q6848l2118m7204
15503c8127R5865R3890J9362K3672K8998j08871j27605n3413J39969K1631n506
$$ plain form
15492 89865 -11148 20941 177111 204167 185376 89931 -59876 -26 2404 -62183 -24913
15481 -24913 -9436 -91195 -208688 -184152 -165627 -124931 -124445 -180364 -154218 -180893 -113786 33227
15469 33227 -15948 -118234 -5313 123448 27441 62151 77476 -25689 -59321 -113547 -156806
15458 -156806 -130112 -39262 -82014 -108278 -44578 -62615 -56659 21549 52937 100506 48639 -33801
15446 -33801 -59762 -108113 -48160 -30451 25937 80514 99322 164748 200128 216076 215729 148770
15434 148770 105966 83060 66571 11482 -65420 2133 115860 263298 226376 149353 109892
15423 109892 3326 61613 67934 30669 61550 93620 81497 41958 65509 -50838 -78803
15412 -78803 64087 61212 23959 13776 -2577 -49804 -108037 -95741 -122246 -162689 -104383 52969
$$ packed form
15492H9865j01013L2089J56170K7056j8791r5445j49807N9850K430o4587L7270
15481b4913J5477q1759j17493K4536J8525M0696M86n5919K6146k6675O7107J47013
15469C3227m9175j02286J12921J28761r6007L4710J5325j03165l3632n4226m3259
15458a56806K6694R0850m2752k6264O3700j8037N956P8208L1388M7569n1867q2440
15446c3801k5961m8351N9953J7709N6388N4577J8808O5426L5380J5948l47o6959
15434A48770m2804k2906j6489n5089p6902O7553J13727J47438l6922p7023l9461
15423A09892j06566N8287O321l7265L0881L2070j2123l9539K3551j16347k7965
15412g8803J42890k875l7253j0183j6353m7227n8233J2296k6505m0443N8306J57352
$$ plain form
15400 52969 59363 20072 185014 136314 -30690 -151494 -45076 6420 -35522 -43033 -107783
15389 -107783 -83696 -72659 -70350 -38563 29767 -2524 13933 12168 -55136 99249 29919 -16681
15377 -16681 -33550 -130770 -152763 -180688 -116377 -27019 -24544 -85920 -92630 -168899 -135288 -99868
15365 -99868 -105491 -36819 18108 4272 101847 125887 101705 1543 56756 21574 -151686
15354 -151686 -137830 -79431 -7104 16477 134741 122556 74854 150964 139825 146945 71231
15343 71231 57674 -41341 -4460 186774 139491 81070 -8010 -14106 83867 48910 -18816 -95123
15331 -95123 -104094 70746 60971 7362 52810 150784 201620 131945 219603 234747 277430 259011
15319 259011 273613 105594 -38386 -71764 -52117 100583 101747 -103563 -140918 -51291 -89693
$$ packed form
15400E2969O394l9291J64942m8700j67004j20804J06418N1496m1942p511o4750
15389a07783K4087J1037K309L1787O8330l2291J6457j765o7304J54385o9330m6600
15377a6681j6869r7220k1993k7925O4311Q9358K475o1376o710p6269L3611L5420
15365i9868n623O8672N4927j3836R7575K4040k4182j00162N5213l5182j73260
15354a51686J3856N8399P2327K3581J18264j2185m7702P6110j1139P120p5714
15343G1231j3557r9015L6881J91234m7283n8421q9080o096R7973l4957o7726p6307
15331i5123q971J74840r775n3609M5448R7974N0836o9675Q7658J5144M2683j8419
15319B59011J4602j68019j43980l3378J9647J52700J164k05310l7355Q9627l8402
$$ plain form
15308 -89693 -34478 -72464 -131130 -114653 -188389 -147070 8000 -22765 -571 -22957 56738
15297 56738 103373 192288 240304 191522 144054 111026 167883 106070 121601 149698 137295 106348
15285 106348 17663 -66883 -119930 -43906 48795 -68089 -178825 -106477 -60450 -42587 -32087
15274 -32087 134243 58722 52738 151120 247662 134569 42528 -44668 53291 114829 65859
15263 65859 -46494 -84152 -68536 -36745 24041 103097 43052 -72298 -127701 -102791 -8134
15252 -8134 11528 -19738 15661 -105310 -220471 -57993 30261 34023 -104874 -143301 -155014
15241 -155014 -221931 -186721 -35020 76484 60200 69272 49260 19547 39637 15916 8915
15230 8915 -3637 133289 37571 -59400 -2590 122174 183875 199408 96897 13483 -11932
$$ packed form
15308h9693N5215l7986n8666J6477p3736M1319J55070l0765K2194k2386P9695
15297E6738M6635Q8915M8016m8782m7468l3028N6857o1813J5531K8097j2403l0947
15285A06348q8685q4546n3047P6024R2701j16884j10736P2348M6027J7863J0500
15274c2087J66330p5521n984R8382R6542j13093r2041q7196R7959O1538m8970
15263F5859j12353l7658J5616L1791O0786P9056o0045j15350n5403K4910R4657
15252h134J9662l1266L5399j20971j15161J62478Q8254L762j38897l8427j1713
15241a55014o6917L5210J51701J11504j6284R072k0012k9713K0090k3721p001
15230H915j2552J36926r5718r6971N6810J24764O1701J5533j02511q3414k5415
$$ plain form
15219 -11932 -64164 -44826 -88966 -132939 -5663 148001 211181 353120 436305 260912 92548
15208 92548 74644 18449 124375 251449 270582 209402 -21853 -59825 26669 88828 112282
15197 112282 72616 109411 79323 17717 -24060 -43588 89490 284374 171096 46677 19533
15186 19533 22586 -29686 -55783 -51292 -76794 7279 1164 -35009 -62181 -31773 73641 197075
15174 197075 195200 53251 -75500 -109559 43691 62119 8486 18749 -43778 -157887 -194549
15163 -194549 -81759 -28612 -21522 39249 115766 -33163 -92330 -116458 -129339 -194560 -327292
15152 -327292 -243463 -90067 -27974 -43675 32262 35379 27670 134542 110731 5469 24215
15141 24215 82572 165541 119405 175443 206690 108642 48722 59361 36807 58231 62053 13274
$$ packed form
15219a1932n2232J9338m4140m3973J27276J53664O3180J41939Q3185j75393j68364
15208I2548j7904n6195J05926J27074J9133o1180k31255l7972Q6494O2159K3454
15197A12282l9666L6795l0088o1606m1777j9528J33078J94884j13278j24419k7144
15186A9533L053n2272k6097M491k5502Q4073o115l6173k7172L0408J05414J23434
15174A97075j875j41949j28751l4059J53250J8428n3633J0263o2527j14109l6662
15163a94549J12790N3147P090O0771P6517j48929n9167k4128j2881o5221j32732
15152c27292Q3829J53396O2093j5701P5937L117p709J06872k3811j05262J8746
15141B4215N8357Q2969m6136N6038L1247r8048n9920J0639k2554K1424L822m8779
$$ plain form
15129 13274 -67736 -91436 -67995 -33475 96465 96885 111692 33600 68861 135823 35015 -53655
15117 -53655 -66369 -94979 -66947 -158810 -129520 -124963 -185284 -183302 -233935 -233175 -223133 -111346
15105 -111346 -11297 41463 -151502 -289882 -233469 -128236 -12587 8707 -44672 90781
15095 90781 71795 56848 -23286 -48211 -42031 -91957 -39631 -105610 -207108 -154537 -124406 -138522
15083 -138522 -43139 136048 123304 42414 25864 -4280 74413 139272 191737 136225 -6912
15072 -6912 -17963 -11174 -17639 -16644 48508 -41176 -150392 -164225 -102159 -29147 52260 144407
15060 144407 181314 109808 98736 80535 91568 -982 -16303 -19818 -25881 50807 159215 54665
15048 54665 16437 36218 -4680 -76788 -137592 -139143 -82852 -23695 30363 638 143106 68086
$$ packed form
15129A3274q1010k3700K3441L4520J29940M20J4807p8092L5261O6962j00808q8670
15117e3655j2714k8610K8032r1863K9290M557o0321J982n0633P60J0042J11787
15105a11346J00049N2760j92965j38380N6413J05233J15649K1294n3379J35453
15095I0781j8986j4947q0134k4925O180m9926N2326o5979j01498N2571L0131j4116
15083a38522R5383J79187j2744q0890j6550l0144P8693O4859N2465n5512j43137
15072f912j1051O789o465R95O5152q9684j09216j3833O2066P3012Q1407R2147
15060A44407L6907p1506j1072j8201J1033r2550j5321l515o063P6688J08408j04550
15048E4665l8228J9781m0898p2108o0804j551N6291N9157N4058k9725J42468p5020
$$ plain form
15036 68086 -71637 -87174 -69778 -121731 -114287 -103021 -24031 22840 -12656 -33662 -39430 -73206
15024 -73206 -104191 -65000 -38851 -15917 40217 -13715 -4648 -72155 -110629 9456 -31067 -31714
15012 -31714 9835 58859 156981 33727 -16361 -58953 -125771 -94469 10373 24454 148091
15001 148091 91942 24301 58179 65063 105766 59324 72987 42924 -40215 -78688 -43561 35669
14989 35669 155308 174918 73667 61934 55414 25788 135449 213392 316614 363019 183960
14978 183960 41053 -85011 -164147 -181513 -226697 -63897 32272 91610 87513 -34461 -109353
14967 -109353 -159171 -210524 -167779 -152370 2612 155816 12914 -116354 -103124 3642
14957 3642 37194 -36295 -88077 32045 115494 75775 134860 119953 17154 -12856 42668
$$ packed form
15036F8086j39723j5537J7396n1953P444J1266P8990M6871l5496k1006n768l3776
15024g3206l0985L9191K6149K2934N6134n3932R067o7507l8474J20085m0523o47
15012c1714M1549M9024R8122j23254n0088m2592o6818L1302J04842J4081J23637
15001A48091n6149o7641L3878O884M0703m6442J3663l0063q3139l8473L5127P9230
14989C5669J19639J9610j01251j1733o520k9626J09661P7943J03222M6405j79059
14978A83960j42907j26064p9136j7366m5184J62800R6169N9338m097j21974p4892
14967a09353m9818n1353M2745J5409J54982J53204j42902j29268J3230J06766
14957C642L3552p3489n1782J20122Q3449l9719N9085j4907j02799l0010N5524
$$ plain form
14946 42668 36207 26407 -72864 -135960 -75557 -20987 27745 137331 84740 70924 35012 -2400
14934 -2400 -17837 68040 87543 70411 6671 -52970 57534 91052 112064 34643 47559 139666
14922 139666 99544 37427 107323 134386 31192 -143185 -79823 36263 -3908 -39677 4923
14911 4923 -10558 -47662 -62109 -23871 -46006 -93220 -77723 -88164 -89377 -106993 -95269 -31478
14899 -31478 -58903 -148221 -5540 144176 135783 145244 85171 24902 -31480 -103032 -11678 108478
14887 108478 150318 111014 -29005 -43549 -82445 -158012 -182156 -102843 -55979 -61932 -109153
14876 -109153 -5222 63631 -6751 -11459 -94431 -117433 -59478 1104 -113806 -60662 84770
14865 84770 79284 -9703 -15869 28364 26130 14915 28838 96801 70564 15698 13045 -11143
$$ packed form
14946D2668o461r800r9271o3096O0403N4570M8732J09586n2591j3816l5912l7412
14934b400j5437Q5877J9503j7132o3740n9641J10504L3518K1012p7421J2916R2107
14922A39666m0122o2117O9896K7063j03194j74377O3362J16086m0171l5769M4600
14911D923j5481l7104j4447L8238k2135m7214J5497j0441j213j7616J1724O3791
14899c1478k7425q9318J42681J49716q393R461o0073o0269n6382p1552R1354J20156
14887A08478M1840l9304j40019j4544l8896p5567k4144P9313M6864n953m7221
14876a09153J03931O8853p0382m708q2972k3002N7955O0582j14910N3144J45432
14865H4770n486q8987o166M4233k234j1215J3923O7963k6237n4866k653k4188
$$ plain form
14853 -11143 16280 83905 17708 -32113 -117463 -91850 -108764 -77198 -92704 -151701 -242780 -156717
14841 -156717 -101943 -73310 -43557 -125152 -215802 -258026 -165521 -61259 16006 -48431 -60454
14830 -60454 -83815 -88814 -53089 -114955 -80922 -118509 -168324 -205743 -137571 -136450 -156596 -129319
14818 -129319 -9733 3540 63224 202113 207047 38810 -118777 -204789 -212686 -192343 -196535
14807 -196535 -192604 -244550 -250715 -239491 -112071 -75483 -64397 -164707 -156140 -13572 110131
14796 110131 -82870 -149419 -20055 151129 203707 159718 45682 -150846 -223476 -364862
14786 -364862 -268942 -127518 36792 128709 229266 261866 202828 131478 253386 214349 127763
14775 127763 79904 48259 8648 -73454 67840 207956 140641 23217 -7412 69852 27418
$$ packed form
14853a1143K7423O7625o6197m9821q5350K5613j6914L1566j5506n8997r1079Q6063
14841a56717N4774K8633K9753q1595r0650m2224R2505J04262P7265o4437j2023
14830f0454k3361m999L5725o1866L4033l7587m9815l7419O8172J121k0146K7277
14818a29319J19586J3273N9684J38889M934j68237j57587q6012p897K0343m192
14807a96535L931n1946o165J1224J27420L6588J1086j00310Q567J42568J23703
14796A10131j93001o6549J29364J71184N2578m3989j14036j96528p2630j41386
14786c64862R5920J41424J64310R1917J00557L2600n9038p1350J21908l9037q6586
14775A27763m7859l1645l9611q2102J41294J40116o7315j17424l0629P7264m2434
$$ plain form
14764 27418 -139483 -181860 -49816 56430 -11886 -29512 73124 63788 61867 26717 9869
14753 9869 58442 -91533 -79716 3606 94194 122026 116508 8913 80091 39471 61986 86258
14741 86258 114063 173912 122890 86337 -13586 -121098 -50892 42996 57773 -52397 -123862
14730 -123862 -31334 54831 28471 -46746 -54332 12941 8959 -84496 -79809 -78764 -29463 -22285
14718 -22285 6407 114664 104479 19576 40044 38175 -48238 -46665 148 -65722 -113525 -131867
14706 -131867 109158 194291 102041 36630 -55837 -20363 77901 84061 139404 102056 134535
14695 134535 2543 -90936 -83468 -11408 47244 13434 36128 -59725 -97533 -125153 -79131
14684 -79131 -61065 -132042 -67894 67465 13706 61954 138963 157977 170663 153487 117850
$$ packed form
14764B7418j66901m2377J32044J06246o8316j7626J02636r336j921l5150j6848
14753I869M8573j49975J1817Q3322R0588K7832n518j07595P1178m0620K2515K4272
14741H6258K7805N9849n1022l6553r9923j07512P0206R3888J4777j10170p1465
14730a23862R2528Q6165k6360p5217p586O7273l982r3455M687J045M9301P178
14718b2285K8692J08257j0185q4903K0468j869q6413J573M6813o5870m7803j8342
14706a31867K41025Q5133r2250o5411r2467L5474R8264O160N5343l7348L2479
14695A34535j31992r3479P468P2060N8652l3810K2694r5853l7808k7620M6022
14684g9131J8066p0977O4148J35359n3759M8248P7009J9014J2686j7176l5637
$$ plain form
14673 117850 95160 55950 79608 146095 98253 96252 10725 -17978 32123 -62059 -104435 -2068
14661 -2068 53281 121909 77967 73225 111601 99288 53734 -7024 -6286 127289 207225 179522
14649 179522 152451 83584 166534 139494 173888 181368 121778 76117 9536 -120795 -68489
14638 -68489 58982 53962 99958 122979 126193 134845 161558 169872 186357 59836 -4795 -3068
14626 -3068 614 84643 9572 -21620 11942 91904 138275 69331 -33872 32689 99425 82574
14614 82574 16225 -61923 -111666 -106897 -78624 113624 140511 50152 -54052 14114 46780
14603 46780 88168 22628 -12872 32213 167424 162628 138655 144756 45494 142764 192800 131574
14591 131574 26393 -203717 -269221 -219750 -233689 -70798 34232 18285 39443 -14271 -187038
$$ packed form
14673A17850k2690l9210K3658O6487m7842k001q5527k8703N0101r4182m2376J02367
14661b068N5349O8628m3942m742L8376j2313m5554o0758P38J33575P9936k7703
14649A79522k7071o8867Q2950k7040L4394P480n9590m5661o6581j30331N2306
14638f8489J27471n020M5996K3021L214Q652K6713Q314J6485j26521o4631J727
14626c068L682Q4029p5071l1192L3562P9962M6371o8944j03203O6561O6736j6851
14614H2574o6349p8148m9743M769K8273J92248K6887r0359j04204O8166L2666
14603D6780M1388o5540l5500M5085J35211m796k3973O101r9262R7270N0036o1226
14591A31574j05181k30110o5504M9471j3939J62891J05030j5947K1158n3714j72767
$$ plain form
14580 -187038 -145657 -21424 -12790 -154702 -111498 11437 -21096 -62321 -71602 -146768 -127206
14569 -127206 -86832 -82587 -72700 -92288 -146608 -85239 -110470 -169526 -93547 65927 130101 8104
14557 8104 15793 85872 38659 -123314 -278581 -159628 -178945 -187882 -145481 -133871 -67655 -107192
14545 -107192 -145863 -128967 -66772 -143265 -36879 25382 -324 -32798 -63098 -102688 -66150
14534 -66150 -94340 -225891 -236175 -153296 -37966 -4099 106525 124963 136717 238177 241919
14523 241919 178932 67997 36008 117769 -4008 -55909 -232360 -157313 -124583 -17120 98500
14512 98500 141571 84005 -40899 -56586 3295 80487 57728 96224 49937 -42395 30091
14501 30091 33627 -94048 -233419 -251309 -280354 -328331 -257816 -111675 25718 30658 -15074
$$ packed form
14580a87038M1381J24233Q634j41912M3204J22935l2533m1225r281p5166J9562
14569a27206M0374M245R887j9588n4320O1369k5231n9056P5979J59474O4174j21997
14557H104P689P0079m7213j61973j55267J18953j9317q937M2401J1610O6216l9537
14545a07192l8671J6896O2195p6493J06386O2261k5706l2474l0300l9590L6538
14534f6150k8190j31551j0284Q2879J15330L3867J10624J8438J1754J01460L742
14523B41919o2987j10935l1989Q1761j21777n1901j76451P5047L2730J07463J15620
14512I8500M3071n7566j24904j5687N9881P7192k2759L8496m6287r2332P2486
14501C0091L536j27675j39371j7890k9045m7977P0515J46141J37393M940m5732
$$ plain form
14490 -15074 70685 51208 13209 115376 256609 306814 223812 82800 67272 89471 38255
14479 38255 32537 74252 101006 -22533 -6234 -7104 -22540 60912 57272 74683 -11944 -15938
14467 -15938 107054 164501 149873 164813 65678 68703 56072 85519 144724 124554 147573 213008
14455 213008 155682 163964 172414 164660 268993 267030 179528 82806 -159777 -98963 16916 -6059
14443 -6059 18696 -46867 -99915 -50458 -29519 36174 39161 -20854 -36133 -23242 -51649 55053
14431 55053 147439 220557 144769 7818 -40697 49816 168237 187463 169416 16467 -12158
14420 -12158 22409 76708 68686 56651 -44305 -67302 -52362 -84311 -48648 -83329 -54861 15789
14408 15789 66298 208484 259746 135684 91801 157013 160850 94608 53669 85611 153842
$$ packed form
14490a5074Q5759j9477l7999J02167J41233N0205q3002j41012j5528K2199n1216
14479C8255n718M1715K6754j23539J6299q70j5436Q3452l640J7411q6627l994
14467a5938J22992N7447j4628J4940r9135L025j2631K9447N9205k0170K3019O5435
14455B13008n7326Q282Q450p754J04333j963q7502r6722k42583O0814J15879k2975
14443f059K4755o5563n3048M9457K0939O5693K987o0015j5279J2891k8407J06702
14431E5053R2386P3118p5788j36951m8515R0513J18421J9226j8047j52949k8625
14420a2158L4567N4299q022j2035j00956k2997J4940l1949L5663l4681K8468P0650
14408A5789N0509J42186N1262j24062m3883O5212L837o6242m0939L1942O8231
$$ plain form
14397 153842 194190 173398 178239 132967 148146 119945 57626 187101 220520 132146 163252
14386 163252 131556 96009 98273 160966 237000 200783 148715 197662 103933 5255 24305 36932
14374 36932 75116 9814 -104199 -9480 97225 63140 144045 146688 29942 -128302 -76562
14363 -76562 12907 68919 156476 73895 -48559 -47706 -66029 -6348 35494 9219 39737 76464
14351 76464 53480 146593 188096 93392 -69946 -83365 -75750 -88696 -88575 -70862 -73455 1349
14339 1349 -170655 -135594 -85608 -73130 -1612 -71316 -61100 -481 97401 109646 24629 -70660
14327 -70660 -144134 -195224 -100219 -68067 -146728 -161459 -209505 -166968 -50047 -71549 -181745
14316 -181745 -183573 -112611 -35274 -8060 13171 44114 106197 130725 95847 74578 181324
$$ packed form
14397A53842M0348k0792M841m5272J5179k8201o2319J29475L3419q8374L1106
14386A63252l1696l5547K264O2693P6034l6217n2068M8947r3729r8678J9050J2627
14374C6932L8184o5302j14013R4719J06705l4085Q0905K643j16746j58244N1740
14363g6562Q9469N6012Q7557q2581j22454Q53j8323N9681M1842k6275L0518L6727
14351G6464k2984R3113M1503r4704j63338j3419P615j2946J21J7713k593P4804
14339A349j72004L5061M9986J2478P1518o9704J0216O0619R7882J2245q5017r5289
14327g0660p3474n1090R5005L2152p8661j4731m8046M2537J16921k1502j10196
14316a81745j828P0962P7337K7214K1231L0943O2083K4528l4878k1269J06746
$$ plain form
14305 181324 267409 129351 23383 101360 150954 128241 116653 225661 250520 64959 -15044
14294 -15044 40382 12244 66424 142504 85261 2529 87396 60597 34648 45989 25320 106053
14282 106053 218534 196921 128985 133583 83151 130634 125264 21291 -142225 -187746 -39576
14271 -39576 37725 80087 64413 98100 90348 1407 22254 -55508 -43031 -35092 -30776 -72228
14259 -72228 -158194 -144881 -89536 -60731 4822 40226 42359 -68154 -76195 -149579 -222417 -188702
14247 -188702 -30236 -51420 -95047 -196152 -144256 -109573 8159 172664 128088 52675 -120737
14236 -120737 -202396 -248558 -307329 -166688 -51323 -34797 25960 53898 124173 15102 95574
14225 95574 144516 93161 38233 -48597 -42435 -30803 -80957 39711 62277 -230 50111 109620
$$ packed form
14305A81324Q6085j38058j05968P7977M9594k2713j1588J09008K4859j85561q0003
14294a5044N5426k8138N4180P6080n7243q2732Q4867k6799k5949J1341k0669Q0733
14282A06053J12481k1613o7936M598n0432M7483n370j03973j63516m5521J48170
14271c9576P7301M2362j5674L3687p752q8941K0847p7762J2477P939M316m1452
14259g2228q5966J3313N5345K8805O5553L5404K133j10513q041p3384p2838L3715
14247a88702J58466k1184m3627j01105N1896L4683J17732J64505m4576p5413j73412
14236a20737q1659m6162n8771J40641J15365J6526O0757K7938P0275j09071Q0472
14225I5574M8942n1355n4928q6830O162J1632n0154J20668K2566o2507N0341N9509
$$ plain form
14213 109620 44354 -18771 -36898 13121 -99646 -162519 -33022 99282 76399 -156489 -191642
14202 -191642 -102171 -96587 -54969 -38402 53561 114359 85911 41953 -39632 47935 38068 58422
14190 58422 115868 124122 32173 -8454 53640 -30090 26972 157332 205093 201880 92526 -7140
14178 -7140 902 60706 43404 20979 -7684 7266 -26678 -127348 -42450 -38947 -55396 -67058
14166 -67058 -103123 23700 28468 52487 145657 127571 40003 -66981 2555 95465 7019
14155 7019 83026 26845 -94914 -81807 -82434 -30293 14461 -114027 -222142 -174309 1795
14144 1795 -40 -93477 -15998 80308 162634 131224 91690 -5465 -6870 -45792 -98110 11685
14132 11685 123820 144924 46550 37513 23632 -121786 -135211 -81524 -38670 137541 238811
$$ packed form
14213A09620o5266o3125j8127N0019j12767o2873J29497J32304k2883k32888l5153
14202a91642Q9471N584M1618J6567R1963O0798k8448m3958q1585Q7567r867K0354
14190E8422N7446Q254r1949m0627O2094q3730N7062J30360M7761l213j09354r9666
14178g140Q042N9804j7302k2425k8663J4950l3944j00670Q4898L503j6449j1662
14166f7058l6065J26823M768K4019R3170j8086q7568j06984O9536R2910q8446
14155G019P6007n6181j21759J3107o27N2141M4754j28488j08115M7833J76104
14144A795j835r3437P7479R6306Q2326l1410l9534r7155j405l8922n2318J09795
14132A1685J12135K1104r8374r037j3881j45418j3425N3687M2854J76211J01270
$$ plain form
14121 238811 194967 70739 -82767 -82378 38149 57728 52964 33457 -45784 -101921 -118707
14110 -118707 -61313 47065 137853 230268 190530 15366 -83177 -98150 -82073 -68980 -120797
14099 -120797 -112199 -150209 -216310 -98763 107031 218104 194201 112798 130985 89550 75556
14088 75556 135768 16553 -20155 20602 -6374 -62706 -69667 -29236 -39082 -84389 -101653 -32827
14076 -32827 47459 -16979 -52787 14277 -14924 -74328 -90212 27631 82265 85341 19553 44277
14064 44277 92352 14696 -145904 -136337 -24018 -26880 -48620 -105361 -237655 -265398 -221293
14053 -221293 -116872 -78117 24264 80450 23647 -58409 26623 98891 62915 -66650 15212
14042 15212 155021 44653 -6414 26982 26255 -54220 -9307 67170 14349 -84308 -94603 -80817
$$ packed form
14121B38811m3844j24228j53506L89J20527J9579m764j9507p9241n6137j6786
14110a18707N7394J08378R0788R2415l9738j75164r8543j4973J6077J3093n1817
14099a20797Q598l8010o6101J17547K05794J11073k3903q1403J8187m1435j3994
14088G5556O0212j19215l6708M0757k6976n6332o961M0431r846m5307j7264O8826
14076c2827Q0286o4438l5808O7064k9201n9404j5884J17843N4634L076o5788K4724
14064D4277M8075p7656j60600R567J12319k862k1740n6741j32294k7743M4105
14053b21293J04421L8755J02381N6186n6803q2056Q5032P2268l5976j29565Q1862
14042A5212J39809j10368n1067L3396p27q0475M4913P6477n2821r8657j0295J3786
$$ plain form
14030 -80817 -30626 150451 196439 164524 247519 172691 19611 -51431 -38073 9513 10407 53508
14018 53508 50417 124443 273175 232141 31868 -54929 -34872 21279 5432 5026 45897 69460
14006 69460 108839 138737 99156 15713 -57683 -29701 -43516 -28442 -12024 -15612 -132538 -146093
13994 -146093 32606 24858 45186 142977 117114 63390 68452 -9056 -85720 -151501 -114273 -9252
13982 -9252 -54691 -109232 -201169 -195890 -261470 -259237 -153112 -103195 49895 89206 -12080 -82510
13970 -82510 -135916 -27114 23211 73989 116302 88220 99701 99649 69974 57762 13422 -113069
13958 -113069 -154366 -170018 -136049 -95464 -15606 114545 93659 -15411 46492 143011 37487
13947 37487 40895 108824 115756 31163 19646 140217 160320 115813 -58546 -186409 -137478
$$ packed form
14030h0817N0191J81077M5988l1915Q2995p4828j53080p1042J3358M7586Q94M3101
14018E3508l091P4026J48732m1034k00273q6797K0057N6151j5847m06M0871K3563
14006F9460L9379K9898l9581q3443p3396K7982j3815J5074J6418l588j16926j3555
13994a46093J78699p748K0328R7791k5863n3724N062p7508p6664o5781L7228J05021
13982i252m5439n4541r1937N279o5580K233J06125M9917J53090L9311j01286p0430
13970h2510n3406J08802N0325N0778M2313k8082J1481n2k9675j2212m4340j26491
13958a13069m1297j5652L3969M0585P9858J30151k0886j09070O1903R6519j05524
13947C7487L408O7929O932q4593j1517J20571K0103m4507j74359j27863M8931
$$ plain form
13936 -137478 -111505 -121325 9352 67122 -53373 -73847 10821 10532 82955 165689 137662 60263
13924 60263 52329 63130 -55461 -68869 104219 250950 177466 70556 -105132 -115009 -16181
13913 -16181 -154077 -257346 -50025 7439 36945 29743 -10563 30978 218882 267943 109186
13902 109186 -1752 -68978 -82554 19821 79346 59566 3184 -112141 -182062 -125488 -116259
13891 -116259 -85644 -91521 -27578 2338 26661 116414 147848 86931 77689 98061 -1163 -96764
13879 -96764 101794 317256 282649 267958 213485 130730 166583 150105 94442 -30094 -111272
13868 -111272 -49139 -2392 95039 83863 61177 43857 -47753 -118318 45401 -10374 -56459
13857 -56459 56677 31531 267 -113863 -116517 -128883 -74353 -114639 -100960 -25051 38217
$$ packed form
13936a37478K5973r820J30677N7770j20495k0474Q4668k89P2423Q2734k8027p7399
13924F0263p934J0801j18591j3408J73088J46731p3484j06910j75688r877R8828
13913a6181j37896j03269K07321N7464K9506p202m0306M1541J87904M9061j58757
13902A09186j10938o7226j3576J02375N9525j9780n6382j15325o9921N6574R229
13891a16259L0615n877O3943K9916K4323Q9753L1434o0917r242K0372r9224r5601
13879i6764J98558K15462l4607j4691n4473q2755L5853j6478n5663j24536q1178
13868a11272O2133M6747R7431j1176k2686j7320r1610p0565J63719n5775m6085
13857e6459J13136k5146l1264j14130k654j2366N4530m0286J3679P5909O3268
$$ plain form
13846 38217 34854 30717 13169 -23441 33 22007 115705 54217 -5967 -41461 -132667 -120670
13834 -120670 -98801 -151231 -130905 -68015 68268 151004 162102 178106 172572 152400 128916
13823 128916 173898 219276 207317 245913 64051 -34330 21487 -46250 -61631 106806 102945
13812 102945 85301 -19192 -161254 -100403 -72482 -35826 99289 122278 107812 46762 66122
13801 66122 78309 57504 53446 11140 -52868 -113417 -93064 -44890 -14303 -16814 45658 -4822
13789 -4822 -9557 -128733 -34261 -7173 -53393 7095 -44846 -48578 -61289 -54483 -69062 -67841
13777 -67841 41474 94202 132274 138802 14198 -135063 -101840 -19473 113591 158391 117559
13766 117559 39172 1460 18570 55660 61662 31349 27604 -3085 4896 32742 -100673 -169747
$$ packed form
13846C8217l363m137j7548l6610K3474K1974R3698o1488o0184l5494r1206J1997
13834a20670K1869n2430K0326O2890J36283Q2736J1098J6004n534k0172k3484
13823A28916M4982M5378j1959L8596j81862r8381N5817o7737j5381J68437l861
13812A02945j7644j04493j42062O0851K7921L6656J35115K2989j4466o1050J9360
13801F6122J2187k0805m058m2306o4008o0549K0353M8174L0587k511O2472n0480
13789d822m735j19176R4472K7088m6220O0488n1941l732j2711O806j4579J221
13777f7841J09315N2728L8072O528j24604j49261L3223Q2367J33064M4800m0832
13766A17559p8387l7712J7110L7090O002l0313l745l0689P981K7846j33415o9074
$$ plain form
13754 -169747 -53851 49151 53087 21941 39735 32068 11880 33217 -18401 -23035 -58880 -98587
13742 -98587 -115672 -291371 -329300 -261385 -158978 -34765 -55024 -164612 -189809 -266943 -219684
13731 -219684 -192192 -113591 -23350 -61650 -18151 28879 -28487 -132181 -177281 -18795 93942
13720 93942 117559 50329 42813 79529 -1621 -11184 83360 57351 35663 -49939 -194322 -256337
13708 -256337 -96759 -44230 32066 -12451 33353 6037 16169 11280 -58045 -125008 -84700
13697 -84700 -151559 -248381 -250410 -197765 -142438 -110520 -71932 -121485 -200390 -194235 -182831 -235425
13685 -235425 -221714 -215296 -190298 -90854 -76520 -37588 -86054 -150204 -116321 32178 120763
13674 120763 95237 -56068 -88285 -4414 90098 167279 238671 195103 43667 -4735 -47511
$$ packed form
13754a69747J15896J03002L936l1146J7794p667k0188K1337n1618m634l5845l9707
13742i8587j7085j75699l7929O7915J02407J24213k0259j09588k5197p7134M7259
13731b19684K7492P8601R0241l8300M3499M7030n7366j03694m5100J58486J12737
13720I3942K3617o7230p516L6716q1150r563R4544k6009k1688q5602j44383o2015
13708b56337J59578N2529P6296m4517M5804k7316J0132m889o9325o6963M0308
13697h4700o6859r6822k029N2645N5327L1918L8588m9553p8905O155J1404n2594
13685b35425J3711O418K4998R9444J4334L8932m8466o4150L3883J48499Q8585
13674A20763k5526j51305l2217Q3871R4512P7181P1392m3568j51436m8402m2776
$$ plain form
13663 -47511 -42967 -130212 -144991 -66508 15233 135802 137709 104508 120981 169694 130986 -2631
13651 -2631 -102658 -40295 -108562 -132367 -98322 37980 94039 120800 105446 43069 63774
13640 63774 101284 33349 -43389 27379 45774 22990 70651 62457 98546 125619 177258 102113
13628 102113 122629 139291 92184 21197 61043 -8501 -44195 -124577 -111213 31946 -10536
13617 -10536 64131 28593 38767 -34865 -137959 -209542 -173673 -73507 -11166 -15656 2078
13606 2078 36549 -114818 -82249 -31394 -60321 -42800 -68265 -53726 -84119 -158323 -144893 -53462
13594 -53462 2988 -59668 -150744 -42117 19374 50957 -336 36880 -139937 -211859 -92067
13583 -92067 -97200 -15955 -25269 -14572 95451 99181 89034 46883 107575 170042 143874 174105
$$ packed form
13663d7511M544q7245j4779P8483Q1741J20569J907l3201J6473M8713l8708j33617
13651b631j00027O2363o8267k3805L4045J36302N6059K6761j5354o2377K0705
13640F3774L7510o7935p6738P0768J8395k2784M7661q194L6089K7073N1639p5145
13628A02113K0516J6662m7107p0987L9846o9544l5694q0382J3364J43159m2482
13617a0536P4667l5538J0174p3632j03094p1583L5869J00166O2341m490J7734
13606B078L4471j51367L2569N0855k8927J7521k5465J4539l0393p4204J3430R1431
13594e3462N6450o2656r1076J08627O1491L1583n1293L7216j76817p1922J19792
13583i2067n133Q1245r314J0697J10023L730j0147m2151O0692O2467k6168L0231
$$ plain form
13571 174105 188021 83055 -24215 -149124 -23849 143183 85771 -75921 -166095 -135712
13561 -135712 -54675 -4214 -38415 63966 177823 101507 78454 113798 118247 101738 174725
13550 174725 81658 129799 97081 33554 -35003 -3597 -14044 -70825 -39763 66309 46271
13539 46271 -43374 -48550 -58342 -12866 -22118 -4218 -75950 -62492 16573 -20330 -27594 23336
13527 23336 146819 196765 209213 48082 -94096 -93505 -81137 51477 127209 73656 63459
13516 63459 -7454 -93281 -120256 -203784 -170950 55892 147773 53539 71452 28598 -121586
13505 -121586 -187389 -153442 14258 138264 170603 96866 33418 -3443 -20695 35500 14771
13494 14771 -54557 13285 58739 -49872 -34339 -48242 -110946 -224779 -141594 24987 23698
$$ packed form
13571A74105J3916j04966j07270j24909J25275J67032n7412j61692r0174L0383
13561a35712Q1037N0461l4201J02381J13857p6316k3053L5344M449j6509P2987
13550A74725r3067M8141l2718o3527o8557L1406j0447n6781L1062J06072k0038
13539D6271q9645n176r792M5476r252J7900p1732J3458P9065l6903p264N0930
13527B3336J23483M9946J2448j61131j42178N91J2368J32614P5732n3553j0197
13516F3459p0913q5827k6975q3528L2834K26842R1881r4234J7913m2854j50184
13505a21586o5803L3947J67700J24006L2339p3737o3448l6861j7252N6195k0729
13494A4771o9328O7842M5454j08611J5533j3903o2704j13833Q3185J66581j289
$$ plain form
13483 23698 -25221 24494 93914 56427 98792 75730 -38306 -76817 -58769 -124291 -86667
13472 -86667 12519 -7992 -60259 -34300 15903 60316 90632 140421 34934 -91657 -86457
13461 -86457 14905 206170 209489 125650 91858 21904 -115926 -126360 -62956 75215 143606
13450 143606 52169 -11281 -138698 -102372 46505 98120 112507 84532 29081 -3603 -28981
13439 -28981 93133 101562 8422 15954 44366 3967 -10212 17562 -2739 -16384 46976 42819
13427 42819 16907 -1850 44185 48647 151941 149820 137006 81903 -85099 -47549 -69452 -141077
13415 -141077 -126932 -88531 -112538 -121744 -82665 -105552 -73143 61943 58710 49957 89567 61813
13403 61813 -33249 -133973 -145709 -24830 -22506 -61863 28731 6072 63300 54035 -14801 10797
$$ packed form
13483B3698m8919M9715O9420l7487M2365k3062j14036l8511J8048o5522L7624
13472h6667R9186k0511n2267K5959N0203M4413L0316M9789j05487j26591N200
13461h6457J01362J91265L319q3839l3792o9954j37830j0434O3404J38171O8391
13450A43606r1437o3450j27417L6326J48877N1615J4387k7975n5451l2684k5378
13439b8981J22114Q429r3140P532K8412m0399j4179K7774k0301j3645O3360m157
13427D2819k5912j8757M6035M462J03294k121j2814n5103j67002L7550k1903p1625
13415a41077J4145L8401k4007r206L9079k2887L2409J35086l233q753L9610k7754
13403F1813r5062j00724j1736J20879K324l9357R0594k2659N7228r265o8836K5598
$$ plain form
13391 10797 -59504 -41033 -37814 -3381 29667 113599 163015 291899 196963 86193 108244
13380 108244 165880 216247 270598 203420 177804 222372 145171 118067 81724 6972 47300
13369 47300 80748 194350 172818 22337 -128035 -125625 -14953 63377 82152 106435 102021
13358 102021 76628 103976 157826 197507 121055 81599 48782 25766 59952 33394 6889
13347 6889 -91255 -30213 113975 44912 24999 -193134 -145975 -68205 -30289 -41618 -121685
13336 -121685 -154170 -138334 -170003 -174347 -182294 -223813 -250202 -58764 80013 7583 -76941
13325 -76941 23420 76433 5121 -156053 -111772 -101838 -182534 -96453 -28529 15755 144221
13314 144221 229993 140328 -32827 -119872 -174492 -43112 -16786 -39014 -55812 -41642 32645
$$ packed form
13391A0797p0301J8471L219L4433L3048Q3932M9416J28884r4936j10770K2051
13380A08244N7636N0367N4351o7178k5616M4568p7201k7104l6343p4752M0328
13369D7300L3448J13602k1532j50481j50372K410J10672P8330J8775K4283m414
13358A02021k5393K7348N3850L9681p6452l9456l2817k3016L4186k6558k6505
13347F889r8144O1042J44188o9063j9913k18133M7159P7770L7916j1329q0067
13336a21685l2485J5836l1669m344p947m1519k6389J91438J38777p2430q4524
13325g6941J00361N3013p1312j61174M4281R934q0696Q6081O7924M4284J28466
13314A44221Q5772q9665j73155q7045n4620J31380K6326k2228j6798J4170P4287
$$ plain form
13303 32645 141641 178478 153387 83164 -113622 -57507 111758 129159 -22915 -85965 -54351
13292 -54351 -9228 22720 40040 37896 6801 1338 35795 22928 21416 -54563 -108240 -98344
13280 -98344 -15568 20950 -65599 -99142 103 53626 349 65991 65381 72568 -1037 58433
13268 58433 89513 66289 27783 -20319 -5516 -305 68375 38978 -13530 45923 134808 72592
13256 72592 73104 46558 81849 53407 123619 162396 149082 53180 29348 19708 -19039 19771
13244 19771 88461 12818 -153198 -139329 -100482 78911 125514 178956 161659 257915 255322
13233 255322 119410 26580 -45185 -164364 -123665 -36345 -196602 -144042 -41922 -22006 681
13222 681 45365 23537 -35821 -15068 25445 15122 -112300 -158492 -153552 -108268 -60764 -30531
$$ packed form
13303C2645J08996L6837k5091p0223j96786N6115J69265J7401j52074o3050L1614
13292e4351M5123L1948J7320k144l1095n463L4457j2867j512p5979n3677R896
13280i8344Q2776L6518q6549l3543R9245N3523n3277O5642o10P187p3605N9470
13268E8433L1080k3224l8506m8102J4803N211O8680k9397n2508N9453Q8885o2216
13256G2592N12k6546L5291k8442P0212L8777j3314r5902k3832r640l8747L8810
13244A9771O8690p5643j66016J3869L8847J79393M6603N3442j7297R6256k593
13233B55322j35912r2830p1765j19179M0699Q7320j60257N2560J02120J9916K2687
13222F81M4684k1828n9358K0753M0513j0323j27422m6192M940M5284M7504L0233
$$ plain form
13210 -30531 22917 -11320 -131152 -82650 -40113 -123775 -186060 -219268 -189697 -114204 -96163
13199 -96163 -23250 58280 125456 112894 1883 -67587 -106080 -144006 -174584 -141126 -153029
13188 -153029 -163222 -195569 -139662 -9541 23622 -38142 -1025 87607 27706 -133742 -198311
13177 -198311 -212927 -115381 56497 146404 239330 244152 283330 171589 124503 112666 5403
13166 5403 -19817 -14680 -28980 91162 134657 87360 71362 59696 -27819 -220141 -247757 -114327
13154 -114327 -24226 128074 175722 86385 45545 180685 250826 196148 100004 130093 134706
13143 134706 190441 221087 139904 68234 73163 53098 -9636 -92096 -2186 32905 31846 16885
13131 16885 125117 147001 117297 59129 -58296 -71089 -53141 -19572 33672 -43796 -25543
$$ packed form
13210c0531N3448l4237j19832M8502M2537q3662o2285l3208K9571P5493J8041
13199i6163P2913Q1530O7176j2562j11011o9470l8493l7926l0578L3458j1903
13188a53029j0193l2347N5907J30121L3163o1764L7117Q8632n9901j61448o4569
13177a98311j4616R7546J71878Q9907R2926M822L9178j11741m7086j1837j07263
13166E403k5220N137j4300J20142M3495m7297j5998j1666q7515j92322k7616J33430
13154a14327R0101J52300M7648q9337m0840J35140P0141n4678r6144L0089M613
13143A34706N5735L0646q1183p1670M929k0065o2734q2460Q9910L5091j059j4961
13131A6885J08232K1884k9704n8168j17425j2793J7948L3569N3244p7468J8253
$$ plain form
13120 -25543 5503 -10490 -18043 27483 -64536 -100914 -141972 -138809 -49839 24342 44251 26897
13108 26897 -10829 -147843 -287542 -292235 -199212 -103299 -18966 -63548 -69798 -103589 -66457 120739
13096 120739 36488 -10651 -48158 -115194 -76263 -87464 -119927 -131089 -120655 -78376 -668
13085 -668 75031 29914 35715 144863 140863 93231 81631 -23933 -156759 -135879 -27017 69210
13073 69210 70693 66579 63493 46550 112842 43240 -20119 -53982 -57750 -125332 -113929 3282
13061 3282 -11080 -24212 -15816 -74988 -22066 17486 39464 43067 60031 10444 -151205 -130258
13049 -130258 -142838 -21233 31888 96670 34405 -3604 -54249 -36521 -25577 83343 113008
13038 113008 163563 209110 168681 130256 7204 -5054 -66327 -123578 -180753 -61856 18733
$$ packed form
13120b5543L1046j5993p553M5526r2019l6378m1058L163Q8970P4181J9909j7354
13108B6897l7726j37014j39699m693R3023R5913Q4333m4582o250l3791L7132J87196
13096A20739q4251m7139l7507o7036L8931j1201l2463j1162J0434M2279P7708
13085f68P5699m5117N801J09148m000m7632j1600j05564j32826K0880J08862R6227
13073F9210J483m114l086j6943O6292o9602o3359l3863l768o7582J1403J17211
13061C282j4362j3132Q396n9172N2922L9552K1978L603J6964m9587j61649K0947
13049a30258j2580J21605N3121O4782o2265l8009n0645J7728J0944J08920K9665
13038A13008N0555M5547m0429l8425j23052j2258o1273n7251n7175J18897Q0589
$$ plain form
13027 18733 39863 -6516 28040 -15903 -113672 -87152 -22190 -40964 -38534 66087 134764 13668
13015 13668 56498 103663 158939 66086 38245 15116 -35085 24736 63167 13119 45804 99981
13003 99981 51091 -14909 -65284 -13340 -18724 177366 286191 213600 100404 57899 76715
12992 76715 119046 229903 143031 32549 29098 40509 -68710 15905 165444 232444 263074
$$ packed form
13027A8733K1130m6379L4556m3943r7769K6520O4962j8774K430J04621O8677j21096
13015A3668M2830M7165N5276r2853k7841k3129n0201N9821L8431n0048L2685N4177
13003I9981m8890o6000n0375N1944n384J96090J08825p2591j13196m2505J8816
12992G6715M2331J10857q6872j10482l451J1411j09219Q4615J49539O7000L0630
$$ [...]
##END NTUPLES=NMR SPECTRUM
##END=
